##TITLE=Analysis number 326693
Compound Code cc 52411
Book Reference 464/106/2
Project Code adrs
Chemist Name chrisr
##JCAMPDX= 6.0         $$ Bruker NMR JCAMP-DX V2.0
##DATA TYPE= NMR SPECTRUM
##DATA CLASS= NTUPLES
##ORIGIN= Bruker BioSpin GmbH
##OWNER= nmr
$$ XWIN-NMR		Version 3.5
$$ Mon Feb 19 12:03:10 2007 GMT Standard Time (UT+0h)  MAYBRIDGE\nmr@NMR_250MHZ
##.OBSERVE FREQUENCY= 250.131544655141
##.OBSERVE NUCLEUS= ^1H
##.ACQUISITION MODE= SIMULTANEOUS (DQD)
##.ACQUISITION SCHEME= undefined
##.AVERAGES= 16
##.DIGITISER RES= 18
##SPECTROMETER/DATA SYSTEM= dpx250
##.PULSE SEQUENCE= zg30
##.SOLVENT NAME= CDCl3
##.SHIFT REFERENCE= (INTERNAL, CDCl3, 0, 16.4495)
##AUDIT TRAIL= $$ (NUMBER, WHEN, WHO, WHERE, WHAT)
$$ ##TITLE= Audit trail, XWIN-NMR		Version 3.5
$$ ##JCAMPDX= 5.01
$$ ##ORIGIN= Bruker BioSpin GmbH
$$ ##OWNER= nmr
$$ C:\u/data/dgb/nmr/ADRS/1220/pdata/1/auditp.txt
$$ ##AUDIT TRAIL=  $$ (NUMBER, WHEN, WHO, WHERE, WHAT)
(   1,<2007-02-19 12:02:40.73 +000>,<MAYBRIDGE\nmr>,<NMR_250MHZ>,
      <created by zg, POWCHK disabled, PULCHK disabled
       configuration hash MD5:
       49 4B E0 1D 92 C2 6B 37 9F E6 65 BC 52 41 86 1D
       data hash MD5: 64K
       BB B7 C3 46 E1 FE 7C EB 4F B7 07 0D 93 86 E1 76>)
(   2,<2007-02-19 12:02:57.22 +000>,<MAYBRIDGE\nmr>,<NMR_250MHZ>,
      <Start of raw data processing
       ef LB = 0.3 FT_mod = 6 PKNL = 1 SI = 32K 
       data hash MD5: 32K
       0D A5 1B FB 1A 79 97 57 7C 13 0C C0 72 98 9A 97>)
(   3,<2007-02-19 12:02:58.78 +000>,<MAYBRIDGE\nmr>,<NMR_250MHZ>,
      <apk 
       data hash MD5: 32K
       22 98 48 94 4D E7 D0 89 17 7B 11 68 08 E4 94 97>)
(   4,<2007-02-19 12:02:59.45 +000>,<MAYBRIDGE\nmr>,<NMR_250MHZ>,
      <abs ABSG = 5 
       data hash MD5: 32K
       F2 4A C9 70 50 BB F5 35 B1 86 BD 5C 2C C1 5E 75>)
$$ ##END=
$$ 
$$ hash MD5
$$ FF D5 CD 46 2B 36 EE 07 E0 76 44 7E 64 8F 0F 85
##$RELAX= 
##$RELAX= 
##$RELAX= 
##$RELAX= 
##$RELAX= 
##$RELAX= 
##$RELAX= 
$$ Bruker specific parameters
$$ --------------------------
##$DU= <C:\u>
##$EXPNO= 1220
##$NAME= <ADRS>
##$PROCNO= 1
##$TYPE= <nmr>
##$USER= <dgb>
##$AMP= (0..31)
100 100 100 100 100 100 100 100 100 100 100 100 100 100 100 100 100 100 
100 100 100 100 100 100 100 100 100 100 100 100 100 100 
##$AQSEQ= 0
##$AQ_mod= 3
##$AUNM= <au_zg>
##$AUTOPOS= <51 >
##$BF1= 250.13
##$BF2= 250.13
##$BF3= 250.13
##$BF4= 250.13
##$BF5= 500.13
##$BF6= 500.13
##$BF7= 500.13
##$BF8= 500.13
##$BYTORDA= 1
##$CFDGTYP= 0
##$CFRGTYP= 5
##$CHEMSTR= <none>
##$CNST= (0..31)
1 1 145 1 1 1 1 1 1 1 1 1 1 1 1 1 1 1 1 1 1 1 1 1 1 1 1 1 1 1 1 1 
##$CPDPRG= <>
##$CPDPRG1= <>
##$CPDPRG2= <>
##$CPDPRG3= <>
##$CPDPRG4= <mlev>
##$CPDPRG5= <mlev>
##$CPDPRG6= <mlev>
##$CPDPRG7= <mlev>
##$CPDPRG8= <mlev>
##$CPDPRGB= <>
##$CPDPRGT= <>
##$D= (0..31)
0 1 0 0 0 0 0 0 0 0.06 0 0 0 0 0 0 0.0002 0 0 0 0 0 0 0 0 0 0 0 0 0 0 
0 
##$DATE= 1171886557
##$DBL= (0..7)
120 120 120 120 120 120 120 120 
##$DBP= (0..7)
150 150 150 150 150 150 150 150 
##$DBP07= 0
##$DBPNAM0= <>
##$DBPNAM1= <>
$$ [...]
##$SUBNAM7= <"">
##$SUBNAM8= <"">
##$SUBNAM9= <"">
##$SW= 20.6930455092707
##$SWIBOX= (0..15)
0 0 3 0 0 0 0 0 0 0 0 0 0 0 0 0 
##$SW_h= 5175.983436853
##$TD= 65536
##$TD0= 1
##$TE= 295.16
##$TE2= 300
##$TE3= 300
##$TEG= 300
##$TL= (0..7)
0 120 120 120 120 120 120 120 
##$TP= (0..7)
150 150 150 150 150 150 150 150 
##$TP07= 0
##$TPNAME0= <>
##$TPNAME1= <>
##$TPNAME2= <>
##$TPNAME3= <>
##$TPNAME4= <>
##$TPNAME5= <>
##$TPNAME6= <>
##$TPNAME7= <>
##$TPOAL= (0..7)
0.5 0.5 0.5 0.5 0.5 0.5 0.5 0.5 
##$TPOFFS= (0..7)
0 0 0 0 0 0 0 0 
##$TUNHIN= 0
##$TUNHOUT= 0
##$TUNXOUT= 0
##$USERA1= <user>
##$USERA2= <user>
##$USERA3= <user>
##$USERA4= <user>
##$USERA5= <user>
##$V9= 5
##$VALIST= <valist>
##$VCLIST= <CCCCCCCCCCCCCCC>
##$VD= 0
##$VDLIST= <DDDDDDDDDDDDDDD>
##$VPLIST= <PPPPPPPPPPPPPPP>
##$VTLIST= <TTTTTTTTTTTTTTT>
##$WBST= 1024
##$WBSW= 4
##$XGAIN= (0..3)
0 0 0 0 
##$XL= 0
##$YL= 0
##$YMAX_a= 226075
##$YMIN_a= -327978
##$ZGOPTNS= <>
##$ZL1= 120
##$ZL2= 120
##$ZL3= 120
##$ZL4= 120
##$ABSF1= 16.44954
##$ABSF2= -4.243633
##$ABSG= 5
##$ABSL= 3
##$ALPHA= 0
##$AQORDER= 0
##$ASSFAC= 0
##$ASSFACI= 0
##$ASSFACX= 0
##$ASSWID= 0
##$AUNMP= <proc_1d>
##$AZFE= 0.1
##$AZFW= 0.1
##$BCFW= 0
##$BC_mod= 0
##$BYTORDP= 0
##$COROFFS= 0
##$CY= 12.5
##$DATMOD= 1
##$DC= 0
##$DFILT= <>
##$DTYPP= 0
##$F1P= 14.0000005364418
##$F2P= -0.99999901652339
##$FCOR= 0.5
##$FTSIZE= 32768
##$FT_mod= 6
##$GAMMA= 0
##$GB= 0
##$INTBC= 1
##$INTSCL= 1
##$ISEN= 128
##$LB= 0.3
##$LEV0= 0
##$LPBIN= 0
##$MAXI= 10000
##$MC2= 0
##$MEAN= 0
##$ME_mod= 0
##$MI= 0
##$NCOEF= 0
##$NC_proc= -5
##$NLEV= 6
##$NOISF1= 0
##$NOISF2= 0
##$NSP= 0
##$NTH_PI= 0
##$NZP= 0
##$OFFSET= 16.44954
##$PC= 1
##$PHC0= 227.5595
##$PHC1= 7.084993
##$PH_mod= 1
##$PKNL= yes
##$PPARMOD= 0
##$PSCAL= 4
##$PSIGN= 0
##$REVERSE= no
##$SF= 250.130018124234
##$SI= 32768
##$SIGF1= 0
##$SIGF2= 0
##$SINO= 400
##$SIOLD= 32768
##$SREGLST= <1H.CDCl3>
##$SSB= 0
##$STSI= 32768
##$STSR= 0
##$SW_p= 5175.98343685301
##$SYMM= 0
##$S_DEV= 0
##$TDeff= 65536
##$TDoff= 0
##$TI= <Analysis number 999999
Compound Code 99
Book Reference 9
Project Code 9>
##$TILT= no
##$TM1= 0
##$TM2= 0
##$TOPLEV= 0
##$USERP1= <user>
##$USERP2= <user>
##$USERP3= <user>
##$USERP4= <user>
##$USERP5= <user>
##$WDW= 1
##$XDIM= 32768
##$YMAX_p= 302232106
##$YMIN_p= -517505
$$ End of Bruker specific parameters
$$ ---------------------------------
##NTUPLES= NMR SPECTRUM
##VAR_NAME=  FREQUENCY,     SPECTRUM/REAL,   SPECTRUM/IMAG
##SYMBOL=    X,             R,               I
##VAR_TYPE=  INDEPENDENT,   DEPENDENT,       DEPENDENT
##VAR_FORM=  AFFN,          ASDF,            ASDF
##VAR_DIM=   32768,         32768,           32768
##UNITS=     HZ,            ARBITRARY UNITS, ARBITRARY UNITS
##FACTOR=    0.157963299565203, 1,           1
##FIRST=     4114.52353437187, 0,            0
##LAST=      -1061.45990248114, 0,           0
##MIN=       -1061.45990248114, -517505,     0
##MAX=       4114.52353437187, 302232106,    0
$$ Real data points
##PAGE= N=1
##DATA TABLE= (X++(R..R)), XYDATA
$$ [...]
$$ plain form
23906 50601 -148670 -306210 -300981 -202141 -187397 -210568 -172961 -116715 -4917 93469 42545
23895 42545 -49624 -134433 -66692 41189 8902 -57113 34124 129384 171241 171829 97506 -182292
23883 -182292 -205871 -107492 -39709 -70086 -133709 13021 -51234 -63407 -120478 -229576 -219474
23872 -219474 -269253 -316056 -278004 -182357 -117385 -29189 -97407 -31989 84065 75796 131080
23861 131080 144292 240661 172596 146700 188420 215836 138456 115092 121128 172097 291909
23850 291909 243764 170893 148212 80562 -30727 -19851 2863 -80459 17159 72850 10184
23839 10184 -108639 -175632 -38054 185120 170668 147115 142630 95767 -64635 -125127 139161
23828 139161 139100 72600 -5700 -174939 -311177 -270898 -96653 -67555 -121498 51902 200124
$$ packed form
23906E0601j99271j57540N229R8840J4744k3171L7607N6246J11798R8386n0924
23895D2545r2169q4809O7741J07881l2287o6015R1237R5260M1857N88p4323k79798
23883a82292k3579R8379O7783l0377o3623J46730o4255j2173n7071j09098J0102
23872b19474m9779m6803L8052R5647O4972Q8196o8218O5418J16054q269N5284
23861A31080J3212R6369o8065k5896M1720K7416p7380k3364O036N0969J19812
23850B91909m8145p2871k2681o7650j11289J0876K2714q3322R7618N5691o2666
23839A0184j18823o6993J37578K23174j4452k3553m485m6863j60402o0492K64288
23828A39161o1o6500p8300j69239j36238M0279J74245K9098n3943J73400J48222
$$ plain form
23817 200124 117256 96304 13864 -22878 8899 -34496 -61711 -82929 -125818 -39441 13423
23806 13423 -76795 -93576 -219096 -320314 -142756 -91914 -93376 -74663 -102778 -104421 -196980
23795 -196980 -102907 -106511 -120075 -44534 25313 83369 83660 123496 139788 103230 62492 94263
23783 94263 48680 59384 46730 26927 -40609 -5925 -38659 13283 23104 -60714 -14702 50179
23771 50179 231950 320614 247355 209636 150609 115555 21984 -16985 81511 88370 -7465 -94231
23759 -94231 -79909 566 -15465 -42450 -96658 -138268 -87352 -28618 -103609 -100476 -39155 62258
23747 62258 -30560 -190856 -116660 -91213 -11094 -13309 -31285 -17651 -148096 -142273 -98170 -141864
23735 -141864 -188616 37664 123243 57363 -2455 -45658 -67922 28599 130583 181342 59033
$$ packed form
23817B00124q2868k0952q2440l6742L1777m3395k7215k1218m2889Q6377N2864
23806A3423r0218j6781j25520j01218J77558N0842j462J8713k8115j643r2559
23795a96980R4073l604j3564P5541O9847N8056K91L9836J6292l6558m0738L1771
23783I4263m5583J0704j2654j9803o7536L4684l2734N1942R821q3818M6012O4881
23771E0179J81771Q8664p3259l7719n9027l5054r3571l8969R8496O859r5835q6766
23759i4231J4322Q0475j6031k6985n4208m1610N0916N8734p4991L133O1321J01413
23747F2258r2818j60296P4196K5447Q0119k215j7976J3634j30445N823M4103m3694
23735a41864m6752K26280Q5579o5880n9818m3203k2264R6521J01984N0759j22309
$$ plain form
23724 59033 -82243 -53297 -15603 1580 -26894 103352 -61391 -113495 -57286 -18887 -62998
23713 -62998 -78345 -39324 39478 142469 83204 -71914 -162659 -97666 -12413 24325 -22588
23702 -22588 21539 -26061 -17558 -116876 -123276 -127788 -30001 -57926 -69778 -41495 -51924 -131107
23690 -131107 -209539 -258887 -168367 -81141 -39819 -40521 20349 43073 93782 184773 109209 -4242
23678 -4242 -42818 -19840 29954 17432 13249 54782 3402 14545 50878 470 7720 -20476
23666 -20476 -48937 -225582 -242065 -189966 -203451 -133310 -117291 -217762 -266566 -147716 -89416
23655 -89416 16445 70965 -627 166826 96690 93122 200093 261699 263029 180711 344118
23644 344118 329375 242482 17965 -12272 -15614 -92453 -126020 -98148 -56890 -19688 -102362
$$ packed form
23724E9033j41276K8946L7694J7183k8474J30246j64743n2104N6209L8399m4111
23713f2998j5347L9021P8802J02991n9265j55118r0745O4993Q5253L6738m6913
23702b2588M4127m7600Q503r9318o400m512R7787k7925j1852K8283j0429p9183
23690a31107p8432m9348R0520Q7226M1322p02O0870K2724N0709R0991p5564j13451
23678d242l8576K2978M9794j2522m183M1533n1380J1143L6333n0408P250k8196
23666b0476k8461j76645j6483N2099j3485P0141J6019j00471m8804J18850N8300
23655h9416J05861N4520p1592J67453p0136l568J06971O1606J330q2318J63407
23644C44118j4743q6893k24517l0237l342p6839l3567K7872M1258L7202q2674
$$ plain form
23633 -102362 -197686 -206283 -189600 -38812 -128209 -97407 -70640 -145576 -113361 -117763 -281864
23622 -281864 -239211 -216973 -373501 -380327 -157485 -125233 -188698 -287197 -223708 -3137 114773
23611 114773 53455 -37108 -8176 -1211 -81117 -31989 -104195 -134124 -128789 -124486 -65528 -12651
23599 -12651 -54670 -14529 -93323 -53628 64839 -38943 -23563 38423 -113567 -16472 90723
23588 90723 129938 88910 124343 160975 212749 114368 133916 73723 -27891 39402 78739
23577 78739 52688 51711 99745 31921 63532 170056 109154 92637 23902 -57013 11028 37843
23565 37843 -126209 -228206 -187167 -219807 -81440 118051 165462 172406 -33602 -127077 -21668
23554 -21668 36998 -12129 -79290 -188060 -219197 -148959 -165998 -204381 -106469 -28940 -30788 -33595
$$ packed form
23633a02362r5324q597J6683J50788q9397L0802K6767p4936L2215m402j64101
23622b81864M2653K2238j56528o826K22842L2252o3465r8499O3489K20571J17910
23611A14773o1318r0563K8932O965p9906M9128p2206k9929N335M303N8958N2877
23599a2651m2019M0141p8794L9695J18467j03782J5380O1986j51990R7095J07195
23588I0723L9215m1028L5433L6632N1774r8381J9548o0193j01614O7293L9337
23577G8739k6051r77M8034o7824L1611J06524o0902j6517o8735q0915O8041K6815
23565C7843j64052j01997M1039l2640J38367J99491M7411O944k06008r3475J05409
23554b1668N8666m9127o7161j08770l1137P0238j7039l8383R7912P7529j848k807
$$ plain form
23542 -33595 -111169 -16603 9934 80437 119109 129052 172956 74824 109680 76969 14407 29690
23530 29690 112177 46369 115369 236125 38676 11205 21522 -22153 50503 -130039 -311848
23519 -311848 -153229 47599 69804 161168 216948 182836 161656 24864 -101206 -72805 93784
23508 93784 179651 224787 169894 40808 97287 76348 53148 126853 223985 260443 176242
23497 176242 32162 120241 53341 -17442 110629 24434 -71905 -45044 -17923 114684 170335
23486 170335 1468 -14791 28750 -22497 -23149 20554 53922 200617 173997 -38077 -2988
23475 -2988 -20607 11764 42980 25600 37566 -39938 -104279 -109732 -39400 -24901 -66798 -87081
23463 -87081 119431 148246 -35054 41386 114820 154580 95710 118460 9252 -220137 -44403
$$ packed form
23542c3595p7574R4566K6537P0503L8672R943M3904r8132L4856l2711o2562J5283
23530B9690Q2487o5808O9000J20756j97449k7471J0317m3675P2656j80542j81809
23519c11848J58619K00828K2205R1364N5780l4112k1180j36792j26070K8401J66589
23508I3784Q5867M5136n4893j29086N6479k0939k3200P3705R7132L6458q4201
23497A76242j44080Q8079o6900p0783J28071q6195r6339K6861K7121J32607N5651
23486A70335j68867j6259M3541n1247o52M3703L3368J46695k6620k12074L5089
23475b988j7619L2371L1216j7380J1966p7504o4341n453P0332J4499m1897k0283
23463h7081K06512K8815j83300P6440P3434L9760n8870K2750j09208k29389J75734
$$ plain form
23452 -44403 18502 -138704 -131330 -7305 -63580 -31772 79631 151481 151326 238054 305490 332894
23440 332894 263125 89594 -125121 -215104 -116764 -26335 -75280 -107595 -21983 96991 39696
23429 39696 -26374 -19278 -90790 -221092 -255201 -145512 23662 87806 176501 165087 140682
23418 140682 137091 22758 -104173 -164263 -138847 -70499 -126843 -57573 -609 48540 -92340
23407 -92340 -115694 -40033 -15050 -13685 75455 -4388 3054 39042 139947 69577 -20673 -91974
23395 -91974 -217003 -181579 -138852 24396 40426 -108421 -143283 -29185 88120 12273 -139110
23384 -139110 -111852 -69084 -47650 62345 118021 -19971 19663 122743 153005 162754 152636
23373 152636 117136 181774 179964 23975 -15975 -78646 25958 69088 -10725 -59706 -68691
$$ packed form
23452d4403O2905j57206P374J24025n6275L1808J11403P1850j55Q6728O7436K7404
23440C32894o9769j73531k14715q9983R8340R0429m8945l2315Q5612J18974n7295
23429C9696o6070P096p1512j30302l4109J09689J69174O4144Q8695j1414k4405
23418A40682l591j14333j26931o0090K5416O8348n6344O9270N6964M9149j40880
23407i2340k3354P5661K4983J365Q9140p9843P442L5988J00905p0370r0250p1301
23395i1974j25029L5424M2727J63248J6030j48847l4862J14098J17305p5847j51383
23384a39110K7258M2768K1434J09995N5676j37992L9634J03080L0262R749j0118
23373A52636l5500O4638j810j55989l9950o2671J04604M3130p9813m8981q985
$$ plain form
23362 -68691 -75791 -155289 -149154 -97028 -107257 -45787 -21932 49539 -49557 -133237 -44253 77004
23350 77004 168214 196251 165990 82510 97433 86242 29396 99045 -4117 -25266 -12055
23339 -12055 1926 -131095 -53507 -50009 -685 -58810 -74974 -58314 -46878 -78636 -22781 91132
23327 91132 24405 56007 132773 132980 92104 153167 148227 -11224 13749 79960 -33035 -66679
23315 -66679 -87682 -95539 -77206 -255707 -401036 -361717 -246197 -78880 -98405 -59639 -54648
23304 -54648 44063 15129 -131881 -180907 -176395 -96420 -54112 -104229 -70676 6429 106853
23293 106853 91258 -7582 29909 12553 -28086 -31303 -36776 2062 -15219 18451 210212 235036
23281 235036 128739 85439 12101 -37446 -68468 -61474 -19555 -65496 -217788 -284706 -264562
$$ packed form
23362f8691p100p9498O135N2126j0229O1470K3855P1471r9096q3680Q8984J21257
23350G7004R1210K8037l0261q3480J4923j1191n6846O9649j03162k1149J3211
23339a2055J3981j33021P7588L498M9324n8125j6164J6660J1436l1758N5855J13913
23327I1132o6727L1602P6766K07m0876O1063m940j59451K4973O6211j12995l3644
23315f6679k1003p857J8333j78501j45329L9319J15520J67317j9525L8766M991
23304e4648R8711k8934j47010m9026M512P9975M2308n0117L3553P7105J00424
23293A06853j5595r8840L7491j7356m0639l217n473L8838j7281L3670J91761K4824
23281B35036j06297m3300p3338m9547l1022O994M1919m5941j52292o6918K0144
$$ plain form
23270 -264562 -343979 -386550 -415874 -247329 -162719 -147264 -199094 -100606 -66423 -25778 -40856
23259 -40856 29593 112062 32879 79851 186977 182157 214114 126909 65923 -49170 -70277
23248 -70277 -102732 -101209 -14498 -61248 -30158 -21433 -58182 -82517 -153693 -141864 -29195 -9912
23236 -9912 -25900 25867 72472 -72084 6479 111944 140189 153961 75140 20432 3111
23225 3111 85930 18694 -49331 38217 81828 222889 248912 161429 147070 155600 47330 -18228
23213 -18228 106714 97742 -109635 -229909 -191928 -66435 -33913 20273 57501 -3154 13611
23202 13611 129494 84811 51126 5015 -125074 -40606 14396 -76284 -223596 -109102 39459
23191 39459 41770 20305 13054 -89334 -82788 -100141 -102780 -159877 44800 103320 -19038 -41001
$$ packed form
23270b64562p9417m2571k9324J68545Q4610J5455n1830R8488L4183M0645j5078
23259d0856P0449Q2469p9183M6972J07126m820L1957q7205o0986j15093k1107
23248g0277l2455J523Q6711m6750L1090Q725l6749k4335p1176J1829J12669J9283
23236i912j5988N1767M6605j44556P8563J05465K8245J3772p8821n4708j7321
23225C111Q2819o7236o8025Q7548M3611J41061K6023q7483j4359Q530j08270o5558
23213a8228J24942q972k07377j20274L7981J25493L2522N4186L7228o0655J6765
23202A3611J15883m4683l3685m6111j30089Q4468N5002r0680j47312J14494J48561
23191C9459K311k1465p251j02388O546j7353k639n7097K04677N8520j22358k1963
$$ plain form
23179 -41001 -4442 78247 83799 142806 64824 -86020 35234 74887 59487 137615 134347 59213
23167 59213 -24647 -61716 -42604 -56816 -91534 -90807 -12407 83257 6976 -179093 -177422 -105324
23155 -105324 -97874 -10214 -35777 -90279 -66208 63715 31697 -86369 -157759 -146036 -121908
23144 -121908 -43588 -93605 -175038 439 167092 158233 150106 87094 24459 163816 246587
23133 246587 170053 184137 126291 105913 108863 17349 147215 168929 154699 147895 91789 13543
23121 13543 -112174 -201766 -206224 -208904 30086 163711 68820 -55706 -163814 -12373 184132
23110 184132 -8232 -50119 52400 152970 37189 -17807 61803 71069 113520 74024 86124
23099 86124 85753 32823 -83731 -74761 -35701 71349 175868 100673 127187 120013 32114 -7172
$$ packed form
23179d1001L6559Q2689N552N9007p7982j50844J21254L9653j5400P8128l268p5134
23167E9213q3860l7069J9112j4212l4718P27P8400R5664p6281j86069J671P2098
23155a05324P450Q7660k5563n4502K4071J29923l2018j18066p1390J1723K4128
23144a21908P8320n0017q1433J75477J66653q859q127o3012o2635J39357Q2771
23133B46587p6534J4084n7846k0378K950r1514J29866K1714j4230o804n6106p8246
23121A3543j25717q9592m458k680K38990J33625r4891j24526j08108J51441J96505
23110A84132j92364m1887J02519J00570j15781n4996P9610R266M2451l9496J2100
23099H6124l71n2930j16554Q970L9060J07050J04519p5195K6514p174q7899l9286
$$ plain form
23087 -7172 -52463 -67090 -63564 -66431 -2264 75698 244684 185093 93123 125725 171725 36597
23075 36597 50770 105868 43997 -60474 -215558 -174275 -165027 -218111 -269182 -57996 53191
23064 53191 -95792 -38724 53583 -27844 -105968 -160893 -46876 87017 58737 180578 105146
23053 105146 21107 -62467 -66776 -8407 66125 88975 70748 17631 -40123 -47698 30594 145893
23041 145893 60015 -34269 14508 -70057 -145251 -71333 -130774 -74959 -16581 -11840 4202 31088
23029 31088 70562 178975 114340 64105 64211 77149 77295 68039 -32232 -58271 19304 23430
23017 23430 58640 159089 172290 74160 -97150 -86485 -12009 6377 27559 111268 170827
23006 170827 128403 10317 -42909 -65857 164261 267882 172675 -11362 1267 100121 77278
$$ packed form
23087g172m5291j4627L526k867O4167P7962J68986n9591r1970L2602M6000j35128
23075C6597J4173N5098o1871j04471j55084M1283R248n3084n1071K11186J11187
23064E3191j48983N7068R2307q1427p8124n4925J14017J33893k8280J21841p5432
23053A05146q4039q3574m309N8369P4532K2850j8227n3117n7754p575P8292J15299
23041A45893q5878r4284M8777q4565p5194P3918n9441N5815N8378M741J6042K6886
23029C1088L9474J08413o4635n0235J06J2938J46r256j00271k6039P7575M126
23017B3430L5210J00449J3201r8130j71310J0665P4476J8386K1182Q3709N9559
23006A70827m2424j18086n3226k2948K30118J03621r5207j84037J2629R8854k2843
$$ plain form
22995 77278 -60668 -223060 -162382 -41489 6821 -62354 -194618 -212969 -58450 -11036 -78986
22984 -78986 -97657 -9143 56031 43209 137569 75821 45951 575 27146 108775 99466 -80716
22972 -80716 -55540 74401 102964 16574 32097 41023 -34659 26748 76474 -50268 -237364
22961 -237364 -21434 166754 86554 161708 134731 128961 13724 20450 39798 -9582 -218707
22950 -218707 -249205 -92407 -39745 -62453 -168992 -108937 5163 47506 2274 -25612 -80106
22939 -80106 -56010 -268107 -309271 -199496 -108428 -143345 -157851 22277 219913 281401 264847
22928 264847 93969 52489 145828 172574 235992 216823 105841 65026 189343 152365 36079
22917 36079 -26878 -115738 -165158 -131905 -115639 -71764 72501 -56594 -70013 18530 45948
$$ packed form
22995G7278j37946j62392O0678J20893M8310o9175j32264j8351J54519M7414o7950
22984g8986j8671Q8514O5174j2822R4360o1748k9870m5376K6571Q1629r309j80182
22972h0716K5176J29941K8563q6390J5523Q926p5682O1407M9726j26742j87096
22961b37364K15930J88188q0200P5154k6977n770j15237O726J9348m9380k09125
22950b18707l0498J56798N2662k2708j06539O0055J14100M2343m5232k7886n4494
22939h0106K4096k12097m1164J09775R1068l4917j4506J80128J97636O1488j6554
22928B64847j70878m1480R3339K6746O3418j9169j10982m0815J24317l6978j16286
22917C6079o2957q8860m9420L3253J6266M3875J44265j29095j3419Q8543K7418
$$ plain form
22906 45948 53794 118840 172350 30965 -112052 -161251 -193772 -120562 -50934 -9473 -20992
22895 -20992 -92725 1338 24667 -55309 -142893 -179145 -124358 -98722 -83697 42362 -10778
22884 -10778 92045 104922 28144 -77307 -77572 6251 2945 85003 132663 203473 176267 146567
22872 146567 57512 2843 -97392 -169347 -24644 77910 -66451 -65913 -50447 -123592 -244365
22861 -244365 -306610 -196612 -169959 -359899 -440562 -450056 -333463 -188253 -241439 -124096 -88802
22850 -88802 -108644 -126952 7848 24932 115703 23314 -89486 -33519 56783 61007 13275
22839 13275 -169346 -315558 -161178 -76455 117976 38023 -77811 104108 167166 85664
22829 85664 39650 17717 77737 152223 64615 -106899 -64736 41645 -40594 -5884 92482
$$ packed form
22906D5948P846O5046N3510j41385j43017m9199l2521P3210O9628M1461j1519
22895b0992p1733R4063K3329p9976q7584l6252N4787K5636J5025J26059n3140
22884a0778J02823J2877p6778j05451k65Q3823l306Q2058M7660P0810k7206k9700
22872A46567q9055n4669j00235p1955J44703J02554j44361N38J5466p3145j20773
22861b44365o2245J09998K6653j89940q0663r494J16593J45210n3186J17343L5294
22850h8802j9842j8308J34800J7084R0771r2389j12800N5967R0302M224m7732
22839A3275j82621j46212J54380Q4723J94431p9953j15834J81919O3058q1502
22829H5664m6014k1933O0020P4486q7608j71514M2163J06381q2239L4710R8366
$$ plain form
22818 92482 132735 -51533 -11489 60069 -1005 -99165 -172730 -119701 -53363 -72020 -135710
22807 -135710 -196603 -58181 31373 104148 141375 249953 310853 311941 186624 22087 -39544
22796 -39544 -43771 48575 112823 33196 -82442 -97358 -107366 -156012 -222469 -295577 -268136 -125602
22784 -125602 -38222 -76996 32143 108425 96811 143463 29302 -95424 -74359 17510 37320
22773 37320 -27209 -107147 30355 7786 -40110 -102589 -161264 -73990 -25097 27871 154329
22762 154329 159156 -47047 -124566 -91372 -50671 32155 107151 38946 67366 45805 77971
22751 77971 65035 -92262 -286495 -263780 -177642 -138023 -166696 -242112 -225846 -171161 -130944
22740 -130944 -207611 -159027 -25508 -99883 -142061 -196893 -165051 -172248 -218500 -52129 119706
$$ packed form
22818I2482M0253j84268M0044P1558o1074r8160p3565N3029O6338j8657o3690
22807a35710o0893J38422Q9554P2775L7227J08578O0900J088j25317j64537o1631
22796c9544m227R2346O4248p9627j15638j4916j0008m8646o6457p3108K7441J42534
22784a25602Q7380l8774J09139P6282j1614M6652j14161j24726K1065R1869J9810
22773C7320o4529p9938J37502k2569m7896o2479n8675Q7274M8893N2968J26458
22762A54329M827k06203p7519L3194M0701Q2826P4996o8205K8420k1561L2166
22751G7971j2936j57297j94233K2715Q6138L9619k8673p5416J6266N4685M0217
22740a30944p6667M8584J33519p4375m2178n4832L1842p197m6252J66371J71835
$$ plain form
22729 119706 131388 130677 255270 106499 -147545 -201230 -111764 -56086 -64383 -51154 -213858
22718 -213858 -147269 -107137 -36455 5827 77258 95927 91274 19102 9666 -81572 -144517 -130360
22706 -130360 -77955 -14796 -95760 -148811 -107369 -28774 -48339 -24028 -65774 -161756 -240212
22695 -240212 -239352 47327 83390 -16931 -41101 -79027 -87958 64349 105995 89530 102443
22684 102443 105494 55492 135730 274850 333231 303113 236967 -1568 -48755 5316 -112037
22673 -112037 -166478 -170658 -129568 -193830 -351318 -400205 -334743 -163560 67330 -28455 -113816
22662 -113816 -225551 -150612 -174683 -85477 26114 138719 90195 21771 -27287 -160965 -78287
22651 -78287 -80908 -179551 -132913 -182829 -99810 21478 89765 129636 123745 98357 19456 -7739
$$ packed form
22729A19706J1682p11J24593j48771k54044n3685Q9466N5678q297J3229j62704
22718b13858O6589M0132P0682M2282P1431J8669m653p2172r436r1238o2945J4157
22706a30360N2405O3159q0964n3051M1442P8595j9565K4311m1746r5982p8456
22695b40212Q60K86679L6063j00321k4170l7926q931J52307M1646j6465J2913
22684A02443L051n0002Q0238J39120N8381l0118o6146k38535m7187N4071j17353
22673a12037n4441m180M1090o4262j57488m8887O5462J71183K30890r5785q5361
22662a13816j11735P4939k4071Q9206J11591J12605m8524o8424m9058j33678Q2678
22651g8287k621r8643M6638m9916Q3019J21288O8287L9871n891k5388p8901k7195
$$ plain form
22639 -7739 47723 101390 66243 82108 106993 75799 75371 76444 -85587 -165372 -267528 -274536
22627 -274536 -141632 -8971 34262 -46029 -185695 -280659 -286437 -296101 -217055 -92287 -31396
22616 -31396 -153861 -79702 84933 -3031 -16454 -133183 -116161 -71942 -175125 -227678 -138771
22605 -138771 99 -33532 -23880 -97392 -83578 24690 -33329 19308 205059 285312 259431
22594 259431 142514 25974 -18586 88319 82016 -27435 -54460 -82171 -42776 56922 -16958
22583 -16958 -149817 -160509 -4466 42398 11972 110137 109671 98923 -27080 -93993 -105077
22572 -105077 -235820 -213862 -150001 8260 75577 110402 151395 140433 -117622 -254862 -150217
22561 -150217 -175989 -236038 -242054 -170670 -85688 -20936 -42127 -18177 -1497 -121656 -166149
$$ packed form
22639g739N5462N3667l5147J5865K4885l1194m28J073j62031p9785j02156p008
22627b74536J32904J32661M3233q0291j39666r4964n778r664P9046J24768O0891
22616c1396j22465P4159J64635q7964j3423j16729J7022M4219j03183n2553Q8907
22605a38771J38870l3631R652p3512J3814J08268n8019N2637J85751Q0253k5881
22594B59431j16917j16540m4560J06905o303j09451k7025k7711L9395R9698p3880
22583a6958j32859j0692J56043M6864l0426R8165m66j0748j26003o6913j1084
22572a05077j30743K1958O3861J58261O7317L4825M0993j0962k58055j37240J04645
22561a50217k5772o0049o016P1384Q4982O4752k1191K3950J6680j20159m4493
$$ plain form
22550 -166149 -87019 -12871 -50367 8603 -7962 -78965 -96667 -79279 -112063 -44613 -150686
22539 -150686 -208631 -115742 -301572 -292552 -248706 -257511 -119441 -74287 -141452 -136697 -32655
22528 -32655 -35342 18017 60193 49343 64502 28652 20076 104846 154944 100229 96137 62030
22516 62030 -79430 -125417 -53450 -27226 99990 210061 198699 88953 47786 87850 70868
22505 70868 -73212 -74564 76684 124500 16526 11245 61452 44833 104250 124570 54166
22494 54166 93797 208818 132504 70888 39970 -159262 -220666 -261926 -230931 -121198 -61130
22483 -61130 -47355 -32746 24110 24344 129205 178774 160982 198385 164710 16376 -95887
22472 -95887 -75861 -86439 -135142 -104011 -153744 -240782 -197887 -120794 -89559 88969 135840
$$ packed form
22550a66149P9130P4148l7496N8970j6565p1003j7702J7388l2784O7450j06073
22539a50686n7945R2889j85830R020M3846q805J38070M5154o7165M755J04042
22528c2655k687N3359M2176j0850J5159l5850q576Q4770N0098n4715m092l4107
22516F2030j41460m5987P1967K6224J27216J10071j1362j09746m1167M0064j6982
22505G0868j44080j352J51248M7816j07974n281N0207j6619N9417K0320p0404
22494E4166L9631J15021p6314o1616l0918j99232o1404m1260L0995J09733O0068
22483f1130J3775J4609N6856K34J04861M9569j7792L7403l3675j48334j12263
22472i5887K0026j0578m8703L1131m9733q7038M2895P7093L1235J78528M6871
$$ plain form
22461 135840 -4550 -132987 -124338 -50789 -3821 71066 119678 178847 154886 42331 55949
22450 55949 -22671 13402 84199 95917 2876 89572 150832 118077 63513 -43875 -140233
22439 -140233 -89268 -102887 -55695 78220 64463 11204 62254 179205 190535 84292 27917
22428 27917 98395 29582 47636 81652 78174 78694 53077 9378 32675 -21572 -130479 -101713
22416 -101713 21450 37640 10073 -82558 15602 117205 66046 -92657 -151347 -130640 -10479
22405 -10479 -75789 -168286 -170432 -279207 -276481 -173654 -103767 -206234 -220491 -192668 -84979
22394 -84979 -92438 -133422 -231409 -156807 -151966 -130396 -206328 -133732 12127 -66597 -143196 -37376
22382 -37376 -6475 -95807 -109727 -31871 21231 40412 91991 104219 242149 162343 -63893
$$ packed form
22461A35840j40390j28437Q649P3549M6968P4887M8612N9169k3961j12555J3618
22450E5949p8620L6073P0797J1718r3041Q6696O1260l2755n4564j07388r6358
22439a40233N0965j3619M7192J33915j3757n3259N1050J16951J1330j06243n6375
22428B7917P0478o8813J8054L4016l478N20k5617m3699K3297n4247j08907K8766
22416a01713J23163J6190k7567r2631R8160J01603n1159j58703n8690K0707J20161
22405a0479o5310r2497k146j08775K726J02827O9887j02467j4257K7823J07689
22394h4979p459m0984r7987P4602M841K1570p5932P2596J45859p8724p6599J05820
22382c7376L0901q9332j3920P7856N3102J9181N1579J2228J37930p9806k26236
$$ plain form
22371 -63893 -62152 43599 91916 6641 -92857 -100886 62049 22150 -42545 -81829 -128531 -8442
22359 -8442 33236 20358 74860 109872 143415 211585 97234 -16138 159932 214135 287457
22348 287457 254183 78996 67261 39431 -16077 40870 8522 -111157 -14136 42692 -78867
22337 -78867 -57384 45837 61308 149421 49203 31915 44722 -13917 13876 3879 137270
22326 137270 227675 186604 -5139 -98903 -30979 59221 45064 49480 130065 85527 36306
22315 36306 131672 150186 257027 291474 430628 371918 356476 326823 161687 35579 17817
22304 17817 -91459 -210365 -171907 -291075 -200860 -137208 -44595 -50011 -41108 113564 169498
22293 169498 116284 -34380 -37495 40412 -6537 90906 173952 182250 85666 -99773 -134867
$$ packed form
22371f3893J741J05751M8317q5275r9498q029J62935l9899o4695l9284m6702J20089
22359h442M1678j2878N4502L5012L3543O8170j14351j13372J76070N4203P3322
22348B87457l3274j75187j1735k7830n5508N6947l2348j19679R7021N6828j21559
22337g8867K1483J03221J5471Q8113j00218j7288J2807n8639K7793r997J33391
22326A37270R0405m1071j91743r3764O7924R0200j4157M416Q0585m4538m9221
22315C6306R5366J8514J06841L4447J39154n8710j5442k9653j65136j26108j7762
22304A7817j09276j18906L8458j19168R0215O3652R2613n416Q903J54672N5934
22293A69498n3214j50664l115P7907m6949R7443Q3046Q298r6584j85439l5094
$$ plain form
22282 -134867 -123604 -115328 -172874 -161140 -104843 -83987 -11870 122060 205952 146389 119418
22271 119418 152357 -803 -72108 -54040 -66485 -87386 -102417 -23270 -2617 50200 79823
22260 79823 9660 -63711 61459 105913 133688 101064 23508 -13440 -53222 -160502 -138608
22249 -138608 -111244 -128084 -116500 -117657 -108340 -102390 -17841 60346 92827 43795 51015 130951
22237 130951 131934 111320 -12863 12881 -23063 -79142 -67432 -87686 -89226 46620 65235 139647
22225 139647 152843 -39627 -86047 -2353 110766 130047 6436 6971 -84736 -90587 -6014
22214 -6014 79002 41473 -54857 26873 -22990 -5548 -52917 20880 107785 71896 13478 -29901
22202 -29901 -56722 -69651 -131573 -68779 133278 118072 222167 244613 78280 -10634 -38515
$$ packed form
22282a34867J1263Q276n7546J1734N6297K0856P2117J33930Q3892n9563k6971
22271A19418L2939j53160p1305J8068j2445k0901j5031P9147K0653N2817K9623
22260G9823p0163p3371J25170M4454K7775l2624p7556l6948l9782j07280K1894
22249a38608K7364j6840J1584j157R317N950Q4549P8187L2481m9032P220P9936
22237A30951R83k0614j24183K5744l5944n6079J1710k0254j540J35846J8615P4412
22225A39647J3196j92470m6420Q3694J13119J9281j23611N35r1707n851Q4573
22214f014Q5016l7529r6330Q1730m9863J7442m7369P3797Q6905l5889n8418m3379
22202b9901k6821j2929o1922O2794K02057j5206J04095K2446j66333q8914k7881
$$ plain form
22191 -38515 -124868 -107635 -142844 -188545 -276894 -175846 -156031 -60506 -46450 -107473 -33844
22180 -33844 39069 152363 79469 37038 75057 75171 47458 -144577 -191597 -174644 -181852 -188015
22168 -188015 -154347 -165600 -98704 19699 97469 -33392 -35993 -23305 121651 112893 39605
22157 39605 3544 144098 114839 -41999 -169870 -71564 -145867 -80186 -16041 47566 153530
22146 153530 162035 55989 101128 -51222 -87990 11814 -59507 -12883 18482 -69672 -125031
22135 -125031 -99891 -151816 -79019 735 -14300 -115416 -24571 19937 6143 38551 132764
22124 132764 43253 -2298 34500 105389 71298 63509 49685 -33796 -73242 -21840 1019 -16729
22112 -16729 -14586 -68897 -121947 -57235 -35195 -128281 -245924 -321170 -343083 -265594 -151430
$$ packed form
22191c8515q6353J7233l5209m5701q8349J01048J9815R5525J4056o1023P3629
22180c3844P2913J13294p2894m2431L8019J14k7713j92035m7020J6953p208o163
22168a88015L3668j1253O6896J18403P7770j30861k601J2688J44956q758p3288
22157C9605l6061J40554k9259j56838j27871R8306p4303O5681O4145O3607J05964
22146A53530Q505j06046M5139j52350l6768R9804p1321M6624L1365q8154n5359
22135a25031K5140n1925P2797P9754j5035j01116R0845M4508j3794L2408R4213
22124A32764q9511m5551L6798P0889l4091p789j3824q3481l9446N1402K2859j7748
22112a6729K143n4311n3050O4712K2040r3086j17643p5246k1913P7489J14164
$$ plain form
22101 -151430 -90353 -119842 -179006 -120651 -96898 -30144 41492 -55847 -83891 -36465 70689
22090 70689 -4089 -60013 -18493 24442 19448 30769 76826 174625 216385 149102 31842 29057
22078 29057 20441 -63310 -27338 -49873 -103021 -116677 -60187 -75397 -113455 -220072 -103307
22067 -103307 -1497 5739 -60030 -10466 95196 118428 -41807 50684 72339 40302 56143
22056 56143 -48506 -58949 97864 211605 228732 197874 195807 -7893 8114 34168 50534
22045 50534 168221 269924 185158 148734 105988 79474 75968 67351 -14375 10791 -17071 -146860
22033 -146860 -297919 -320079 -214176 -48582 -35118 -8786 20653 -50862 -154224 -30325
22023 -30325 183644 156900 123439 179318 -22285 -189382 3159 -1259 -164852 -122764 -5488
$$ packed form
22101a51430O1077k9489n9164N8355K3753O6754P1636r7339k8044M7426J07154
22090G0689p4778n5924M1520M2935m994J1321M6057R7799M1760o7283j17260k785
22078B9057q616q3751L5972k2535n3148j3656N6490j5210l8058j06617J16765
22067a03307J01810P236o5769M9564J05662K3232j60235R2491K1655l2037J5841
22056E6143j04649j0443J56813J13741J7127l0858k067k03700J6007K6054J6366
22045E0534J17687J01703q4766l6424m2746k6514l506q617q1726K5166k7862j29789
22033a46860j51059k2160J05903J65594J3464K6332K9439p1515j03362J23899
22023c0325K13969k6744l3461N5879k01603j67097J92541m418j63593M2088J17276
$$ plain form
22012 -5488 27556 97125 297161 170129 78043 169344 174635 141960 211618 124129 12290
22001 12290 52523 75399 102173 117018 141112 258108 225791 45110 -166395 -157536 -136367
21990 -136367 -84644 201556 250136 167555 12483 29582 48605 72305 38533 101545 94473
21979 94473 23931 -38478 -46879 -37779 117246 212975 279087 258904 71293 -41387 -1539
21968 -1539 -84926 -112451 36311 152281 180562 125943 58066 22607 17968 -15153 9108 252306
21956 252306 282184 110613 10786 -34295 -19171 -33016 -33394 -72419 -169118 -117411 -9802
21945 -9802 76846 25255 -16453 4262 61624 -27328 -81165 -76236 -99969 49661 59649 -94600
21933 -94600 -157721 -964 61566 -86488 -149965 -205108 -143067 -81812 -164247 -183251 -151052
$$ packed form
22012e488L3044O9569K00036j27032r2086R1301N291l2675O9658q7489j11839
22001A2290M0233K2876K6774J4845K4094J16996l2317j80681k11505Q859K1169
21990a36367N1723K86200M8580q2581j55072J7099J9023K3700l3772O3012p072
21979I4473p0542o2409q401R100J55025R5729O6112k0183j87611j12680L9848
21968a539q3387k7525J48762J15970K8281n4619o7877l5459m639l3121K4261K43198
21956B52306K9878j71571r9827m5081J5124j3845l78l9025r6699N1707J07609
21945i802Q6648n1591m1708K0715N7362q8952n3837M929k3733J49630R988j54249
21933i4600o3121J56757O2530j48054o3477n5143O2041O1255q2435j9004L2199
$$ plain form
21922 -151052 -212208 -196949 -94347 -53963 -28441 50810 132970 283671 179198 123977 135996
21911 135996 14686 -109317 -27447 -28086 -34070 -11406 82388 1805 -70145 -20052 76228 127387
21899 127387 -89664 -170586 -76279 133189 184337 170128 163172 122238 120771 511 -198633
21888 -198633 -219906 -128963 -47054 3272 63101 75385 167254 70154 -64855 -47267 -38603
21877 -38603 -88192 -48257 55692 1643 -35429 51568 74041 -76126 -209351 -145666 -140216
21866 -140216 -152411 10776 139910 137987 94820 77870 -41245 -116656 -115535 -64836 122545
21855 122545 189216 188872 240967 109736 43621 49647 83125 63081 5930 11740 101002 197423
21843 197423 189897 157168 102487 12082 -32461 -206738 -218034 -164515 -240237 -295223 -248876
$$ packed form
21922a51052o1156J5259J02602M0384K5522P9251Q2160J50701j04473n5221J2019
21911A35996j21310j24003Q1870o39n984K2664R3794q0583p1950N0093R6280N1159
21899A27387k17051q0922R4307K09468N1148j4209o956m0934j467j20260j99144
21888a98633k1273R0943Q1909N0326N9829J2284R1869r7100j35009J7588Q664
21877c8603m9589L9935J03949n4049l7072Q6997K2473j50167j33225O3685N450
21866a40216j2195J63187J29134j923m3167j6950j19115p5411J121N0699J87381
21855A22545O6671l44N2095j31231o6115O026L3478k0044n7151N810Q9262R6421
21843A97423p526l2729n4681r0405m4543j74277j1296N3519p5722n4986M6347
$$ plain form
21832 -248876 -134400 97801 200719 216576 79594 -16591 -41495 38343 131591 59515 4424
21821 4424 82437 -12377 -135476 13462 90835 54988 9708 19640 135809 10305 -140124
21810 -140124 -227521 -81312 28902 -74375 -48046 31281 49440 7098 -112027 -153939 -190814
21799 -190814 -237998 -250056 12511 131368 39881 -37712 -37455 68987 393 65239 113811
21788 113811 45933 -143218 -155513 -204657 -148756 -5111 21843 21922 38563 -49672 -28040 36146
21776 36146 15271 -55553 -97875 -155942 -100218 -77859 -125739 -120359 57540 104064 107586 65930
21764 65930 -88247 -190639 -99764 -14546 25173 49295 -7955 -18035 28421 -104807 -346193
21753 -346193 -388599 -254881 -179524 -139997 7976 33269 -56358 -80994 -28346 -253312 -265220
$$ packed form
21832b48876J14476K32201J02918J5857j36982r6185k4904P9838R3248p2076n5091
21821D424P8013r4814j23099J48938P7373l5847m5280R932J16169j25504j50429
21810a40124q7397J46209J10214j03277K6329P9327J8159m2342j19125m1912l6875
21799a90814m7184j2058K62567J18857r1487p7593K57J06442o8594O4846M8572
21788A13811o7878j89151j2295m9144N5901J43645K6954P9J6641q8235K1632O4186
21776C6146k0875p0824m2322n8067N5724K2359m7880N380J77899M6524L522m1656
21764F5930j54177j02392R0875Q5218L9719K4122n7250j0080M6456j33228k41386
21753c46193m2406J33718P5357L9527J47973K5293q9627k4636N2648k24966j1908
$$ plain form
21742 -265220 -218977 -158273 -65258 -23711 -96067 -30645 28366 9839 -96952 -200460 -141998
21731 -141998 -33294 -20272 5902 33021 -1920 -134734 -160837 -103459 -56223 -98050 -109928
21720 -109928 -74488 -218873 -355675 -359506 -238968 -168061 -80973 -112357 -109872 25324 171057
21709 171057 197549 149756 91670 -46662 -170272 -171697 -230584 -252609 -237383 -120570 -134837
21698 -134837 -168588 -214196 -103141 -5115 -30983 -5949 57049 72550 -72432 -155496 -42651
21687 -42651 57012 -14080 -160457 -197726 -176040 -11648 81762 140617 48750 -58556 -166962
21676 -166962 -30790 211015 324833 209432 137888 160880 233390 244502 207296 138704 119334
21665 119334 181548 233454 102599 4027 55271 -100946 -186633 -325334 -238730 -171798 -153613
$$ packed form
21742b65220M6243O0704R3015M1547p2356O5422N9011j8527j06791j03508N8462
21731a41998J08704J3022K6174K7119l4941j32814k6103N7378M7236m1827j1878
21720a09928L5440j44385j36802l831J20538P0907Q7088l1384K485J35196J45733
21709A71057K6492m7793n8086j38332j23610j425n8887k2025J5226J16813j4267
21698a34837l3751m5608J11055R8026k5868K5034O2998J5501j44982q3064J12845
21687d2651R9663p1092j46377l7269K1686J64392R3410N8855r1867j07306j08406
21676a66962J36172K41805J13818j15401p1544K2992P2510J1112l7206o8592j9370
21665A19334O2214N1906j30855r8572N1244j56217q5687j38701Q6604O6932J8185
$$ plain form
21654 -153613 1380 21795 46847 133654 157187 15523 -27462 -78146 -12901 38341 46739
21643 46739 77141 1835 -15367 26824 -31459 -99914 -167401 -101524 -1429 149756 46682
21632 46682 33882 -38722 -53488 -89704 -72502 -180769 -199836 -23944 -54900 -210229 -257063
21621 -257063 -177381 -18931 105594 77372 -75242 -191525 -241691 -297190 -277791 -152207
21611 -152207 -5212 19982 167357 249141 250779 181339 177648 99747 179910 218530 104664
21600 104664 -17913 -30329 75999 36569 33539 59388 52128 13057 51583 -120636 -172203
21589 -172203 -110666 -152637 -112634 -34425 55021 57079 19039 120401 134139 -12793 -120538
21578 -120538 -67018 -36547 -142946 -249145 -127701 -56008 -153513 -168024 -274045 -292105 -78337
$$ packed form
21654a53613J54993K0415K5052Q6807K3533j41664m2985n0684O5245N1242Q398
21643D6739L0402p5306j7202M2191n8283o8455o7487O5877J00095J51185j03074
21632D6682j2800p2604j4766l6216J7202j08267j9067J75892l0956j55329m6834
21621b57063P9682J58450J24525k8222j52614j16283n0166n5499J9399J25584
21611a52207J46995K5194J47375Q1784J638o9440l691p7901Q0163L8620j13866
21600A04664j22577j2416J06328l9430l030K5849p260l9071L8526j72219n1567
21589a72203O1537m1971M0003P8209Q9446K058l8040J01362J3738j46932j07745
21578a20538N3520L0471j06399j06199J21444P1693r7505j4511j06021j8060K13768
$$ plain form
21567 -78337 -155641 -190085 -224581 -53268 76 -40958 -161520 -165943 -177408 -119091 -36123
21556 -36123 104122 76952 -11625 24192 -82579 -132533 -208619 -203421 -24087 204302 243254
21545 243254 10599 -64855 -48525 49617 -5018 -81502 -73769 -57887 -30026 -104158 -254824
21534 -254824 -346371 -285076 -21726 83365 -6850 -33360 38685 31593 -138838 -169177 -213990
21523 -213990 -267398 -201708 -166476 -105455 -154948 -48068 -4739 -82873 -95749 -111929 -175784
21512 -175784 -265209 -196201 -90437 69074 -64290 -71432 -66950 -162924 -177354 -126973 -161033
21501 -161033 -123299 -92208 -195578 -270374 -151140 -81478 -103969 -17008 -71948 -137919 -117879
21490 -117879 -46428 23408 -79152 -114464 -67690 -42754 -25881 -50451 -80313 6707 60525
$$ packed form
21567g8337p7304l4444l4496J71313N3344m1034j20562m423j1465N8317Q2968
21556c6123J40245k7170q8577L5817j06771m9954p6086N198J79334K28389L8952
21545B43254k32655p5454J6330R8142n4635p6484P733J5882K7861p4132j50666
21534b54824r1547O1295K63350J05091r0215k6510P2045p092j70431l0339m4813
21523b13990n3408O5690L5232O1021m9493J06880M3329p8134j2876j6180o3855
21512a75784q9425O9008J05764J59511j33364p142M482r5974j4430N0381l4060
21501a61033L7734L1091j03370p4796J19234O9662k2491Q6961n4940o5971K0040
21490a17879P1451O9836j02560l5312M6774K4936J6873k4570k9862Q7020N3818
$$ plain form
21479 60525 69346 141912 175354 156213 125114 133283 -34236 -150098 -124032 53811 113910
21468 113910 57587 -112061 -119478 8448 165313 107209 116824 46617 63993 45791 24434
21457 24434 -73488 -74673 -27373 -120791 -116846 2891 113119 107871 62394 -54059 -68011 -98306
21445 -98306 -75595 -24234 -104991 -114200 -171084 -119252 -140112 -128401 -51814 63394 60570 -130173
21433 -130173 -212038 -180369 -115650 -53743 49532 22007 27575 64481 746 -55439 -113620
21422 -113620 -105612 -19443 10522 -44663 -55735 -71312 -75548 -53154 115155 248243 195491
21411 195491 93937 115198 146728 223767 330896 358692 269324 213101 130587 -9429 -38696
21400 -38696 -138155 -211780 -116869 -36526 73285 -32496 -207652 -153450 -83121 -80578 -8673
$$ packed form
21479F0525Q821P2566L3442j9141l1099Q169j67519j15862K6066J77843O0099
21468A13910n6323j69648p417J27926J56865n8104R615p0207J7376j8202k1357
21457B4434r7922j185M7300r3418L945J19737J10228n248m5477j16453j3952l0295
21445i8306K2711N1361q0757r209n6884N1832k0860J1711P6587J15208k824j90743
21433a30173q1865L1669O4719O1907J03275k7525N568L6906o3735n6185n8181
21422a13620Q008Q6169K9965n5185j1072j5577m236K2394J68309J33088n2752
21411A95491j01554K1261L1530P7039J07129K7796q9368n6223q2514j40016k9267
21400c8696r9459p3625R4911Q0343J09811j05781j75156N4202P0329K543P1905
$$ plain form
21389 -8673 -7697 -58210 -178940 -92472 -187713 -220196 -181731 -5943 -2765 -9363 28082 164907
21377 164907 203357 50604 -83575 -106347 -7600 -23689 -39358 -6253 -26795 -77677 35602
21366 35602 48272 116951 115867 95506 56286 -3967 14305 -165058 -169759 -79267 -18948 -13701
21354 -13701 54068 75251 27491 -21143 54278 94703 13447 -42450 -139676 -46592 -95252 -110141
21342 -110141 -62939 -3662 6264 25128 82312 128005 246896 216533 -23155 -242255 -195055
21331 -195055 -103046 -88231 -97320 -59887 -79841 -79861 -120829 -138223 -121377 -106293 -136143 -564
21319 -564 -361 58548 75181 -7073 -52890 -95202 -80707 72079 172355 51668 -46491 -36655
21307 -36655 -112881 -56523 -17653 71789 185309 147722 111735 -14550 -101380 -60179 24527
$$ packed form
21389h673R76n0513j20730Q6468r5241l2483L8465J75788L178o598L7445J36825
21377A64907L8450j52753j34179k2772R8747j6089j5669L3105k0542n0882J13279
21366C5602J2670O8679j084k0361l9220o0253J8272j79363m701R0492O0319N247
21354a3701O7769K1183m7760m8634P5421M0425q1256n5897r7226R3084m8660j4889
21342a10141M7202N9277R926J8864N7184M5693J18891l0363k39688k19100M7200
21331a95055R2009J4815r089L7433j9954k0m0968j7394J6846J5084k9850J35579
21319e64K03N8909J6633q2254m5817m2312J4495J52786J00276j20687r8159R836
21307c6655p6226N6358L8870Q9442J13520l7587l5987j26285q6830M1201Q4706
$$ plain form
21296 24527 136971 235721 122668 -118304 -145195 66926 102114 131108 134898 94799 -5174
21285 -5174 -137849 -182448 -223133 -155886 46793 128356 202259 137413 93118 118972 112079 53005
21273 53005 -40091 45808 41230 -94034 -199859 -206177 -276879 -375919 -438221 -461897 -349236
21262 -349236 -316498 -199564 -146210 66589 59180 95866 22644 24922 -26394 -105075 29506
21251 29506 50521 43920 -92387 -77988 -59887 -25450 -4217 52157 159512 220149 82441
21240 82441 -25422 -77570 -62649 -4653 16686 -45429 -17214 -36955 -146437 -313765 -380039
21229 -380039 -156757 -61730 -177662 -150491 -219752 -221646 -160523 10285 -58463 -216831 -77380
21218 -77380 84910 212240 91950 -204544 -160483 -12935 -77236 -48688 24019 161642
$$ packed form
21296B4527J12444R8750j13053k40972k6891K12121L5188K8994L790m0099r9973
21285e174j32675m4599m0685O7247K02679Q1563P3903o4846m4295K5854o893n9074
21273E3005r3096Q5899m578j35264j05825o318p0702r9040o2302k3676J12661
21262c49236L2738J16934N3354K12799p409L6686p3222K278n1316p8681J34581
21251B9506K1015o601j36307J4399J8101L4437K1233N6374J07355O0637j37708
21240H2441j07863n2148J4921N7996K1339o2115K8215j9741j09482j67328o6274
21229c80039K23282R5027j15932K7171o9261j894O1123J70808o8748j58368J39451
21218g7380J62290J27330j20290k96494M4061J47548o4301K8548P2707J37623
$$ plain form
21208 161642 72966 82583 33968 -33599 -25849 -10502 49021 104257 24051 -12087 -5337 5882
21196 5882 -24057 16670 99530 108094 -4290 105193 187870 31071 -205282 -229710 -87896
21185 -87896 14816 -28637 -117787 -180194 -121486 -49501 37829 95392 26722 -87247 -41964
21174 -41964 -169339 -148160 -33308 803 -70082 -376 -10852 -34491 84782 166801 41534
21163 41534 61938 70627 18935 -100026 -40118 134744 110368 7721 -57629 -96368 -20773
21152 -20773 222264 237160 290270 246786 202820 75350 26146 36824 -60772 -106948 1991
21141 1991 -10448 108108 169741 79738 37820 -39013 -7623 -53315 -114713 -176053 -93634 67951
21129 67951 16645 -7629 46856 -100370 -61761 -73647 -164294 -112396 -106995 305 38412
$$ packed form
21208A61642q8676R617m8615o7567P750J5347N9523N5236q0206l6138O750J1219
21196E882k9939M0727Q2860Q564j12384J09483Q2677j56799k36353k4428J41814
21185h7896J02712m3453q9150o2407N8708P1985Q7330N7563o8670j13969M5283
21174d1964j27375K1179J14852L4111p0885O9706j0476k3639J19273Q2019j25267
21163D1534K0404Q689n1692j18961N9908J74862k4376j02647o5350l8739P5595
21152b0773K43037J4896N3110m3484m3966j27470m9204J0678r7596m6176J08939
21141A991j2439J18556O1633r0003m1918p6833L1390m5692o1398o1340Q2419J61585
21129F7951n1306k4274N4485j47226L8609j1886r0647N1898N401J07300L8107
$$ plain form
21118 38412 -147664 -68440 -15371 105465 121791 -36153 -96964 -61169 -177609 -159897 -52598
21107 -52598 -30760 -165203 -165105 2397 189921 114192 34553 -47429 27438 169104 217935
21096 217935 247690 102307 -68340 -48584 -49002 -105976 -16810 68308 33856 -33099 -48686
21085 -48686 -14192 44846 63009 133197 67909 48260 65707 142054 124670 149199 93606 -24113
21073 -24113 -50517 61553 -61100 -132797 37716 23158 -14846 28642 53356 19169 29232
21062 29232 40442 -22317 -107215 -78016 -38210 -71039 -162568 -231403 -143052 -93236 -102800 -23151
21050 -23151 -6574 -35709 -47939 -210292 -340849 -262905 -159593 4895 156066 95335 94349
21039 94349 271376 354900 348882 219408 -26693 -86975 -12829 -23821 -4421 -32189 -55389
$$ packed form
21118C8412j86076P9224N3069J20836J6326j57944o0811L5795j16440J7712J07299
21107e2598K1838j34443R8J67502J87524p5729p9639q1982P4867J41666M8831
21096B17935K9755j45383j70647J9756m18n6974Q9166Q5118l4452o6955j5587
21085d8686L4494N9038J8163P0188o5288j9649J7447P6347j7384K4529n5593j17719
21073b4113k6404J12070j22653p1697J70513j4558l8004M3488K4714l4187J0063
21062B9232J1210o2759q4898K9199L9806l2829r1529o8835Q8351M9816r564P9649
21050b3151J6577k9135j2230j62353j30557P7944J03312J64488J51171o0731r86
21039I4349J77027Q3524o018j29474k46101o0282P4146j0992J9400k7768k3200
$$ plain form
21028 -55389 -55203 -119662 -113189 -64302 -88019 -188019 -284697 -182371 -118090 -199831 -238977 -201402
21016 -201402 -157740 27239 34529 -180118 -273690 -80149 -28749 48998 111381 16578 -4684
21005 -4684 105677 31183 60419 112388 129718 164132 191124 86658 -64393 -150191 -147535
20994 -147535 -63641 -119679 -54030 80423 100187 154321 170217 176236 86696 77325 -8292 -254955
20982 -254955 -345183 -352939 -314108 -325294 -381002 -284230 -131133 -13220 34822 -20242 30926
20971 30926 114478 60165 114477 117796 -111161 -94343 -32501 102289 147070 161328 69724
20960 69724 27784 -76030 -136738 -72745 -47349 -54028 -63888 90987 139219 86671 133230 99671
20948 99671 54877 -9707 -6853 28338 -7167 1968 -9061 -27091 -143923 -232865 -93887 -6526
$$ packed form
21028e5389J86o4459O473M8887k3717j00000r6678J02326O4281q1741l9146L7575
21016b01402M3662J84979P290k14647r3572J93541N1400P7747O2383r4803k1262
21005d684J10361p4494K9236N1969J7330L4414K6992j04466j51051q5798K656
20994a47535Q3894n6038O5649J34453J9764N4134J5896O019q9540r371q5617k46663
20982b54955r0228p756L8831j1186n5708R6772J53097J17913M8042n5064N1168
20971C0926Q3552n4313N4312L319k28957J6818O1842J34790M4781J4258r1604
20960F9724m1940j03814o0708O3993K5396o679r860J54875M8232n2548M6559l3559
20948I9671m4794o4584K854L5191l5505R135j1029j8030j16832q8942J38978Q7361
$$ plain form
20936 -6526 -162716 -237823 -126855 -186989 -53789 78461 -37670 -83894 -2436 85261 -96988
20925 -96988 -183075 -160700 -138774 -91515 -13120 54022 37440 -48764 1880 -21465 -194874
20914 -194874 -261043 -260576 -189622 70862 119348 82234 91765 83701 40496 -111490 -144022 -167327
20902 -167327 -161997 -74981 -16314 -199634 -227006 -246042 -277695 -205893 -180536 -181043 -248328 -320677
20890 -320677 -154504 60304 172037 -19283 -113211 -78404 -5780 -19485 -92247 -122487 -91731
20879 -91731 -91607 -127861 -149651 -106397 -61491 2059 -22632 6009 73815 47395 66152 59922
20867 59922 -10696 -30336 -27367 -23052 -75442 -125146 -123674 -227519 -258921 -228212 -161128 -68157
20855 -68157 -18054 -61369 -45640 94158 198893 180513 40850 -34788 -61454 -77386 -49547
$$ packed form
20936f526j56190p5107J10968o0134J33200J32250j16131m6224Q1458Q7697j82249
20925i6988q6087K2375K1926M7259P8395O7142j6582q6204N0644k3345j73409
20914a94874o6169M67P0954K60484M8486l7114R531q064m3205j51986l2532k3305
20902a67327N330Q7016N8667j83320k7372j9036l1653P1802K5357n07o7285p2349
20890c20677J66173K14808J11733j91320r3928L4807P2624j3705p2762l0240L0756
20879i1731J24l6254k1790M3254M4906O3550k4691K8641O7806k6420J8757o230
20867E9922p0618j9640K969M315n2390m9704J472j03845l1402L0709O7084R2971
20855f8157N0103m3315J5729J39798J04735j8380j39663p5638k6666j5932K7839
$$ plain form
20844 -49547 -189715 -165535 3774 119000 144383 91683 -39528 -80698 -82415 18087 -30397
20833 -30397 -38438 -87930 -75579 -82180 -7454 24362 -21569 -80524 -41712 -51556 -130229 -91654
20821 -91654 -187818 -189556 -56689 -14126 23284 -58728 -129707 -182662 -119605 -17795 45036
20810 45036 7768 -22316 135252 116399 55722 103767 278184 319033 244682 299478 331549
20799 331549 162117 -29678 -129747 -149485 -193796 -301229 -267756 -91413 -14999 -76333
20789 -76333 -49421 64681 30691 -32318 -9760 46380 -998 4476 81581 -48157 -17655
20778 -17655 48265 -28381 -86939 -71349 -101776 -183238 -168393 20360 127624 92754 -14961
20767 -14961 -85002 -97504 -32131 -203312 -219122 6622 70403 180586 -944 -124368 -14893
$$ packed form
20844d9547j40168K4180J69309J15226K5383n2700j31211m1170j717J00502m8484
20833c0397q041m9492J2351o601P4726L1816m5931n8955L8812r844p8673L8575
20821i1654r6164j738J32867M2563L7410q2012p0979n2955O3057J01810O2831
20810D5036l7268l0084J57568j8853o0677M8045J74417M0849p4351N4796L2071
20799C31549j69432j91795j00069j9738m4311j07433L3473J76343P6414o1334
20789g6333K6912J14102l3990o3009K2558N6140m7378N474P7105j29738L0502
20778a7655O5920p6646n8558J5590l0427q1462J4845J88753J07264l4870j07715
20767a4961p0041j2502O5373j71181j5810K25744O3781J10183j81530j23424J09475
$$ plain form
20756 -14893 -91950 -238555 -199267 -123442 -150290 -77629 45930 -83430 -172456 -176964 -153750
20745 -153750 -78456 -20176 95168 131695 53789 -19822 1731 -126175 -57853 -37569 -43309
20734 -43309 -107643 -74372 -118234 -118430 -36031 -58500 -68949 -12088 -89895 -209483 -160325 -213723
20722 -213723 -193260 -125591 -153575 -197581 -262981 -259203 -279713 -104410 -108605 -100577 6496 62855
20710 62855 4230 -122982 -19025 83329 35009 -239 -152152 -229259 -166549 -55065 95941
20699 95941 30718 -5186 -40213 -134144 -162684 -192139 -328644 -428258 -403041 -202764 -165519
20688 -165519 -75334 -77205 -197826 -236572 -191746 29371 113575 66786 -50482 -33828 -32569
20677 -32569 -126539 -128090 -154086 -297598 -135461 -117625 -146019 -140194 -159359 -88958 -27109 -75508
$$ packed form
20756a4893p7057j46605L9288P5825k6848P2661J23559j29360q9026m508K3214
20745a53750P5294N8280J15344L6527p7906p3611K1553j27906O8322K0284n740
20734d3309o4334L3271m3862j96Q2399k2469j0449N6861p7807j19588M9158n3398
20722b13723K0463O7669k7984m4006o5400L778k0510J75303m195Q028J07073N6359
20710F2855n8625j27212J03957J02354m8320l5248j51913p7107O2710J11484J51006
20699I5941o5223l5904l5027r3931k8540k9455j36505r9614K5217K00277L7245
20688a65519R0185j871j20621l8746M4826K21117Q4204m6789j17268J6654J259
20677c2569r3970j551k5996j43512J62137J7836k8394N825j9165P0401O1849m8399
$$ plain form
20665 -75508 -103160 -261963 -394665 -249734 -70756 2976 -6910 30492 -8913 -85323 -207187
20654 -207187 -194446 -147988 -108812 -18662 -64739 -70140 -103983 -258874 -249641 -192695 -168601 -123112
20642 -123112 -88877 -17647 72609 -7613 -69809 -42830 -6703 123459 128963 111241 -109362
20631 -109362 -307469 -227597 -49544 16974 24006 -219664 -205657 -65384 -5365 13661 -113725
20620 -113725 -76854 -103670 -279599 -299362 -165809 5432 161413 71239 55153 35566 62402
20609 62402 -46125 -265121 -227342 -193192 -168575 -147447 -90593 -56622 -105140 -53293 -85894
20598 -85894 -25917 51893 166590 100568 -72092 12101 40069 -19367 40126 126411 48200
20587 48200 59371 -41769 -148112 91812 132054 93549 46275 51821 216362 198740 7846
$$ packed form
20665g5508k7652j58803j32702J44931J78978P3732r886L7402l9405p6410j21864
20654b07187J2741M6458L9176R0150m6077n401l3843j54891R233N6946K4094M5489
20642a23112L4235P1230R0256q0222o2196K6979L6127J30162N504j7722k20603
20631a09362j98107P9872J78053O6518P032k43670J4007J40273O0019J9026j27386
20620a13725L6871k6816j75929j9763J33553J71241J55981r0174j6086j9587K6836
20609F2402j08527k18996L7779L4150K4617K1128N6854L3971m8518N1847l2601
20598h5894N9977P7810J14697o6022j72660Q4193K7968n9436N9493Q6285p8211
20587D8200J1171j01140j06343K39924M0242l8505m7274N546J64541j7622j90894
$$ plain form
20576 7846 -64924 -17595 39889 -31393 31359 19932 -87281 -245589 -301633 -212452 -178137
20565 -178137 -249138 -243071 -147779 -150655 -217569 -77152 -99834 -152000 -143825 -154395 -171593 -239993
20553 -239993 -203935 -79183 29463 98467 46242 -71810 -105195 -132331 -75214 -86929 -86177
20542 -86177 -143156 -168335 -140435 48413 -63468 -315081 -282348 -167276 -242013 -259076 -115505
20531 -115505 22370 184784 154256 26578 -103568 6454 51973 15685 27375 124377
20521 124377 120513 19189 -125952 -224031 -203278 -79443 22244 -113076 -211832 -237831 -176096
20510 -176096 -118023 -150927 -185694 -299465 -253296 -133617 -141669 -264444 -237104 -189576 -81948
20499 -81948 -68497 -301802 -276452 -185769 -307447 -356891 -174027 9814 135577 31841
$$ packed form
20576G846p2770M7329N7484p1282O2752j1427j07213j58308n6044Q9181L4315
20565a78137p1001O067R5292k876o6914J40417k2682n2166Q175j0570j7198o8400
20553b39993L6058J24752J08646O9004n2225j18052l3385k7136N7117j1715P52
20542h6177n6979k5179K7900J88848j11881k51613L2733J15072p4737j7063J43571
20531a15505J37875J62414l0528j27678j30146J10022M5519l6288J1690R7002
20521A24377l864j01324j45141r8079K0753J23835J01687j35320r8756k5999O1735
20510a76096N8073l2904l4767j13771M6169J19679q052j22775K7340M7528J07628
20499h1948J3451k33305K5350R0683j21678m9444J82864J83841J25763j03736
$$ plain form
20489 31841 -131003 -148052 -226235 -286668 -135331 -42530 -146647 -169641 -195079 -188145 5456
20478 5456 65330 11473 -102366 -43889 -45384 -75206 -135905 -192831 -184970 -86690 32022 12344
20466 12344 78593 10923 -44730 -137234 -171014 -200477 -259346 -299654 -207498 -162956 -109548 12498
20454 12498 -9164 -100786 -88282 23517 -72761 -141983 -189225 -113423 5848 36708 137791
20443 137791 139673 175699 135965 -21850 -230411 -139993 -40791 43859 -978 6413 29195
20432 29195 98331 68419 -84705 -204763 -215018 -133049 -63815 62709 119906 -100297 -134158
20421 -134158 -45572 -70648 -120252 -141754 550 3609 -121764 -203519 -217449 -144040 -59642
20410 -59642 -89150 -37304 59163 138019 36907 -24976 -78672 -190793 -215081 -234908 -177535
$$ packed form
20489C1841j62844j7049p8183o0433J51337R2801j04117k2994k5438O934J93601
20478E456N9874n3857j13839N8477j495k9822o0699n6926P861R8280J18712j9678
20466A2344O6249o7670n5653r2504l3780k9463n8869m0308R2156M4542N3408J22046
20454A2498k1662r1622J2504J11799r6278o9222m7242P5802J19271L0860J01083
20443A37791J882L6026l9734j57815k08561R0418R9202Q4650m4837P391K2782
20432B9195O9136k9912j53124j20058j0255Q1969O9234J26524N7197k20203l3861
20421a34158Q8586k5076m9604k1502J42304L059j25373q1755j3930P3409Q4398
20410e9642k9508N1846R6467P8856j01112o1883n3696j12121k4288j9827N7373
$$ plain form
20399 -177535 -29637 76388 -7864 56622 153590 210401 272755 171469 1376 -4387 -164861
20388 -164861 -182588 -69299 -133928 -109550 -233705 -167060 46685 115346 37247 60770 -33379
20377 -33379 -49915 -44210 -76054 -41633 103514 136497 109916 136901 -32594 -158498 -178038
20366 -178038 -124232 39386 113875 55353 38830 -13939 -93056 -106896 -95080 28884 182689
20355 182689 197287 -20100 -125309 -167129 -218774 -182588 -46332 -91202 -88627 -127542 -154457
20344 -154457 -157488 -203636 -65820 -15932 -29050 -24899 -74194 -59697 -89210 -10330 43395 11702
20332 11702 -43375 -185347 -255583 -217236 -191120 -143377 -109926 -98855 -46503 -70166 -54937
20321 -54937 -73097 -156537 -72567 55384 47611 47244 -82131 -237154 -240296 -261139 -188155 -11348
$$ packed form
20399a77535J47898J06025q4252O4486R6968N6811O2354j01286j70093n763j60474
20388a64861j7727J13289o4629K4378j24155O6645K13745O8661p8099K3523r4149
20377c3379j6536N705l1844L4421J45147L2983k6581K6985j69495j25904j9540
20366a78038N3806J63618P4489n8522j6523n2769p9117j3840J1816J23964J53805
20355A82689J4598k17387j05209m1820n1645L6186J36256m4870K575l8915k6915
20344a54457l031m6148J37816M9888j3118M151m9295J4497k9513P8880N3725l1693
20332A1702n5077j41972p0236L8347K6116M7743L3451J1071N2352k3663J5229
20321e4937j8160q3440Q3970J27951p773l67j29375j55023l142k0843P2984J76807
$$ plain form
20309 -11348 -47342 -98098 -110580 -36631 65144 -86653 -190256 -116058 181364 277707 206847
20298 206847 -1887 -146895 -217305 -250347 -184486 -99922 9900 66561 4601 -146645 -313778
20287 -313778 -277843 -163117 -42615 -69686 -118686 -145216 -256141 -208062 -136819 -112474 -62090
20276 -62090 -59880 -36486 42264 -63642 -124550 -55125 -53746 -1136 88745 219677 268206 29714
20264 29714 -85329 -36695 -40627 25318 -1383 -11999 -133625 -259171 -224669 -246185 -202958
20253 -202958 -228600 -250082 -232531 -67074 25437 25942 -142656 -194854 -147986 -95986 41520
20242 41520 -54458 -304918 -353961 -380605 -145144 43841 190390 139508 82006 53085 12293
20231 12293 77379 128027 106284 118541 155087 76794 -196131 -330995 -252718 -132046 -120641
$$ packed form
20309a1348l5994n0756j2482P3949J01775j51797j03603P4198K97422R6343p0860
20298B06847k08734j45008p0410l3042O5861Q4564J09822N6661o1960j51246j67133
20287c13778L5935J14726J20502k7071m9000k6530j10925M8079P1243K4345N0384
20276f2090K210K3394P8750j05906o0908O9425J379N2610Q9881J30932M8529k38492
20264B9714j15043M8634l932O5945k6701j0616j21626j25546L4502k1516M3227
20253b02958k5642k1482J7551J65457R2511N05j68598n2198M6868N2000J37506
20242D1520r5978k50460m9043k6644K35461J88985J46549n0882n7502k8921m0792
20231A2293O5086N0648k1743J2257L6546p8293k72925j34864P8277J20672J1405
$$ plain form
20220 -120641 -107593 12688 38626 52903 72287 33131 -85217 -186496 -113862 -57409 -84237
20209 -84237 -38222 43170 78547 64701 -27267 -104054 -52366 -16801 -1844 39740 -96016
20198 -96016 -63263 76440 21995 -52548 -70844 -70721 16957 55761 84952 15102 -73049 -218651
20186 -218651 -214714 -104742 -164372 -163447 -77487 38219 83619 112043 66907 54299 140871 71713
20174 71713 -4580 -199932 -348195 -242531 -146401 -126099 38773 82127 -42178 -997 -17404
20163 -17404 -87266 -109473 -59116 -145604 -134384 -24816 185117 42048 -47488 -79501 -60078
20152 -60078 -71946 -11457 118674 104776 58431 74995 44382 63082 58279 -28336 50187 22967
20140 22967 33155 128186 84470 1389 4872 64708 -95171 -188491 -86154 -81807 -166566 -236461
$$ packed form
20220a20641J3048J20281K5938J4277J9384l9156j18348j01279P2634N6453k6828
20209h4237M6015Q1392L5377j3846r1968p6787N1688L5565J4957M1584j35756
20198i6016L2753J39703n4445p4543j8296J23Q7678L8804K9191o9850q8151j45602
20186b18651L937J09972n9630R25Q5960J15706M5400K8424m5136j2608Q6572o9158
20174G1713p6293j95352j48263J05664R6130K0302J64872M3354j24305M1181j6407
20163a7404o9862k2207N0357q6488J1220J09568K09933j43069q9536l2013J9423
20152f0078j1868O0489J30131j3898m6345J6564l0613J8700m803q6615P8523k7220
20140B2967J0188R5031m3716q3081L483N9836j59879r3320J02337M347q4759o9895
$$ plain form
20128 -236461 -259409 -402972 -342098 -248824 -215331 -294348 -366650 -292527 -134355 -138970 -172191
20117 -172191 -200799 -150291 -143172 -256154 -200261 -77677 -30458 6044 -34638 -162410 -74850
20106 -74850 -23573 78971 60308 60506 95916 152141 33458 5882 11878 -4 -88488 -93440
20094 -93440 -89527 4710 42380 48116 52079 -76526 -54529 -25544 -30164 27356 -17415 -56068
20082 -56068 9020 66137 50127 34934 -42597 -124223 -68535 -92377 -94831 22954 228497
20071 228497 316530 340716 255600 96528 -12958 76779 28416 -60632 -60594 27445 86751 46853
20059 46853 -13997 12390 9782 28327 -69335 -225105 -209401 -83243 -22390 105526 89129
20048 89129 110085 208791 136760 114202 104285 184450 89675 163836 132248 39778 7343 9922
$$ packed form
20128b36461k2948j43563O0874R3274L3493p9017p2302P4123J58172m615l3221
20117a72191k8608N0508P119j12982N5893J22584M7219L6502m0682j27772Q7560
20106g4850N1277J02544j8663J98L5410N6225j18683k7576N996j1882q8484m952
20094i3440L913R4237L7670N736L963j28605K1997K8985m620N7520m4771l8653
20082e6068O5088N7117j6010j5193p7531q1626N5688k3842k454J17785K05543
20071B28497Q8033K4186q5116j59072j09486Q9737m8363q9048L8Q8039N9306l9898
20059D6853o0850K6387k608J8545r7662j55770J5704J26158O0853J27916j6397
20048H9129K0956R8706p2031k2558r917Q0165r4775P4161l1588r2470l2435K579
$$ plain form
20036 9922 77973 14378 -115389 -140467 -224208 -175035 -48042 -33290 -102120 -156466 -105393
20025 -105393 -38012 -79956 -200215 -230285 -230548 -300892 -329728 -236708 -193579 -109142 -118229 -186815
20013 -186815 -173990 -63641 -21097 -59506 58179 109920 101123 -24239 -63044 -60321 -71041
20002 -71041 -183112 -208513 -48175 -66957 -79711 -255189 -336053 -260443 -144959 -79861 -98400
19991 -98400 -21965 -114585 -141064 -247011 -289540 -266956 -162924 -104749 -228503 -311768 -185869
19980 -185869 -164043 -270863 -296549 -277293 -155427 -193997 -169408 3747 261788 338268 276784
19969 276784 184319 46203 -99778 3430 102718 95998 183472 134865 46321 -27378 -33352
19958 -33352 -107944 -219705 -200896 -175632 6957 -17578 -134209 -207520 -69752 35957 -64119
$$ packed form
20036I922O8051o3595j29767k5078q3741M9173J26993J4752o8830n4346N1073
20025a05393O7381m1944j20259l0070k63p0344k8836R3020M3129Q4437r087o8586
20013a86815J2825J10349M2544l8409J17685N1741q797j25362l8805K723j0720
20002g1041j12071k5401J60338j8782j2754j75478q0864P5610J15484O5098j8539
19991i8400P6435r2620k6479j05947m2529K2584J04032N8175j23754q3265J25899
19980a85869K1826j06820k5686J9256J21866l8570K4589J73155K58041P6480o1484
19969B76784r2465j38116j45981J03208R9288o720Q7474m8607q8544p3699n974
19958c3352p4592j11761J8809K5264J82589k4535j16631p3311J37768J05709j00076
$$ plain form
19947 -64119 -268975 -395806 -378061 -253654 -258304 -352257 -262949 -240684 -301001 -304752 -280005
19936 -280005 -299869 -254523 -86002 -16893 -41470 66331 88733 133580 188738 189382 -42823
19925 -42823 -141278 -109629 -59134 -65342 -138816 -239853 -90422 36315 -13697 -194225 -287545
19914 -287545 -314158 -219259 -140602 -79227 -72424 -43230 -21331 23337 -29259 -56262 14325 103018
19902 103018 -66619 -154925 -133293 -141942 -130120 -88324 -135396 -67222 -80880 -18965 -29141
19891 -29141 -138594 -206878 -138843 -141309 -118910 -62057 -64340 -70966 -66577 -21284 27411 3410
19879 3410 -22489 -9101 45389 118311 102473 8601 -59089 -170273 -119178 -40558 68790
19868 68790 54251 -82509 -80895 -71951 -135814 -83158 -73361 -120110 -151272 -126618 -33702 115377
$$ packed form
19947f4119k04856j26831J7745J24407m650r3953Q9308K2265o0317l751K4747
19936b80005j9864M5346J68521O9109k4577J07801K2402M4847N5158O44k32205
19925d2823r8455L1649N0495o208p3474j01037J49431J26737n0012j80528r3320
19914b87545k6613R4899P8657O1375O803K9194K1899M4668n2596k7003P0587Q8693
19902A03018j69637q8306K1632q649J1822M1796m7072O8174j3658O1915j0176
19891b9141j09453o8284O8035k466K2399N6853k283o626M389M5293M8695k4001
19879C410k5899J3388N4490P2922j5838r3872o7690j11184N1095P8620J09348
19868F8790j4539j36760J614Q944o3863N2656R797m6749l1162K4654R2916J49079
$$ plain form
19856 115377 65316 129473 125259 43328 -34769 8766 14017 81279 92486 -39442 -100640 -116897
19844 -116897 19298 101998 126359 -13729 -60592 12701 -36016 -143191 -214127 -150322 -33389
19833 -33389 -6138 115829 -24986 -211416 -253187 -294291 -214463 -252420 -111764 27353 55881
19822 55881 -78705 -250098 -124499 3182 18361 -113259 -259952 -258485 -162943 -126688 -94520
19811 -94520 -120365 -41419 -75641 -116368 -258000 -153315 -30031 10295 -455 -80907 -134084
19800 -134084 -108744 -129104 -60210 21317 10924 21291 70748 -65296 -159526 -17109 75177
19789 75177 6371 -51646 -170308 -293785 -98992 -79908 -93815 -35123 -123334 -24494 35972
19778 35972 189123 230376 7623 -5046 10027 -17203 83020 169021 118247 46504 85226
$$ packed form
19856A15377n0061O4157m214q1931p8097M3535N251O7262J1207j31928o1198j6257
19844a16897J36195Q2700K4361j40088m6863P3293m8717j07175p0936O3805J16933
19833c3389K7251J21967j40815j86430m1771m1104P9828l7957J40656J39117K8528
19822E5881j34586j71393J25599J27681J5179j31620j46693J467R5542L6255L2168
19811i4520k5845P8946l4222m0727j41632J04685J23284M0326j0750q0452n3177
19800a34084K5340k0360O8894Q1527j0393J0367M9457j36044r4230J42417R2286
19789G5177o8806n8017j18662j23477J94793J9084j3907N8692q8211R8840O0466
19778C5972J53151M1253k22753j2669J5073k7230J00223Q6001n0774p1743L8722
$$ plain form
19767 85226 51309 -30164 -135030 -188741 -136226 -33735 -9319 27311 -19952 24398 107049
19756 107049 2109 -111249 -51160 -67824 -104067 -89372 -40242 -106430 -52621 37933 67913
19745 67913 76350 -99655 -91249 149293 104315 -18202 -40378 -45433 -15511 -52950 -105934 -90140
19733 -90140 -27905 -5974 -42326 -50124 -58382 -178021 -176723 -103207 -125497 -172147 -140361 56466
19721 56466 194496 261682 182473 16008 -147070 -253501 -292757 -333302 -163599 -89804 -221427
19710 -221427 -68963 48547 35378 62332 45143 36814 -36912 -75266 -83007 -132248 -235884
19699 -235884 -223192 -220238 -115065 -37853 -53772 -160024 -211802 -148520 -9319 -165602 -241806
19688 -241806 -228708 -142796 -132074 -127097 -187991 -196259 -274433 -320624 -320340 -222281 -82549 100442
$$ packed form
19767H5226l3917q1473j04866n3711N2515J02491K4416L6630m7263M4350Q2651
19756A07049j04940j13358O0089j6664l6243J4695M9130o6188N3809R0554K9980
19745F7913Q437j76005Q406K40542m4978j22517k2176n055K9922l7439n2984J5794
19733i0140O2235K1931l6352p798q258j19639J298P3516k2290m6650L1786J96827
19721E6466J38030O7186p9209j66465j63078j06431l9256m0545J69703P3795j31623
19710b21427J52464J17510j3169K6954j7189q329p3726l8354p741m9241j03636
19699b35884J2692K954J05173P7212j5919j06252n1778O3282J39201j56283p6204
19688b41806J3098Q5912J0722M977o0894q268p8174m6191K84R8059J39732J82991
$$ plain form
19676 100442 165300 118940 64660 3454 27809 -28493 -73526 -90222 -63505 -119290 -94938
19665 -94938 -120984 -215838 -120457 -93299 -97827 23977 53843 19505 -44632 30378 43929 -21795
19653 -21795 -66145 -51993 -57690 -24851 45433 36848 126801 188301 170228 105751 -50583 -86882
19641 -86882 -103974 -84605 -83557 -28534 -9481 -135971 -100628 -11721 157618 51395 -74763
19630 -74763 59090 96348 19795 -137391 -107462 -163515 -296904 -226418 -131219 -170279 -249161
19619 -249161 -291591 -244859 -204125 -56093 -33746 -120108 -95694 -66517 -1478 142219 139098
19608 139098 75365 67064 39784 -36202 -172453 -90419 -71961 17129 12658 -37864 85349
19597 85349 92439 62654 68208 8683 52986 11258 -32568 12466 25339 -113540 -139382 -173907
$$ packed form
19676A00442O4858m6360n4280o1206K4355n6302m5033j6696K6717n5785K4352
19665i4938k6046r4854R5381K7158m528J21804K9866l4338o4137P5010J3551o5724
19653b1795m4350J4152n697L2839P0284q585Q9953O1500j8073o4477j56334l6299
19641h6882j7092J9369J048N5023J9053j26490L5343Q8907J69339j06223j26158
19630g4763J33853L7258p6553j57186K9929n6053j33389P0486R5199l9060p8882
19619b49161m2430M6732M0734J48032K2347q6362K4414K9177O5039J43697l121
19608A39098o3733q301k7280p5986j36251Q2034J8458Q9090m471n0522J23213
19597H5349P090k9785N554n9525M4303m1728m3826M5034J2873j38879k5842l4525
$$ plain form
19585 -173907 -147551 -104948 -141484 -168871 -205581 -188526 -138590 1778 -52492 -179479 -77144
19574 -77144 136758 82656 -86746 -233243 -316781 -283556 -227623 -226548 -34758 140403 -30035
19563 -30035 -81445 -29436 -81356 -108147 -137104 -250548 -147367 -143345 -74997 48421 101601
19552 101601 20044 -153037 -165611 -84453 -54579 60767 43383 42894 -89000 -150084 -155786
19541 -155786 -143992 -101451 -199574 -246043 -146925 -33163 -136380 -214726 -176664 -91669 -74837
19530 -74837 -38083 107037 160762 70064 22016 -57852 -129775 -255872 -210056 -55927 119376
19519 119376 182279 -1881 40217 132621 -43295 -119610 -136959 -62619 -54386 52142 91172
19508 91172 137024 157983 125168 61215 -109938 -88620 57711 -104534 -182270 -147306 -98189
$$ packed form
19585a73907K6356M2603l6536k7387l6710J7055M9936J40368n4270j26987J02335
19574g7144K13902n4102j69402j46497q3538L3225N5933J075J91790J75161j70438
19563c0035n1410N2009n1920k6791k8957j13444J03181M022O8348J23418N3180
19552A01601q1557j73081j2574Q1158K9874J15346j7384m89j31894o1084n702
19541a55786J1794M2541r8123m6469R9118J13762j03217p8346L8062Q4995J6832
19530g4837L6754J45120N3725r0698m8048p9868p1923j26097M5816J54129J75303
19519A19376O2903j84160M2098R2404j75916p6315j7349P4340Q233J06528L9030
19508I1172M5852K0959l2815o3953j71153K1318J46331j62245p7736L4964M9117
$$ plain form
19497 -98189 -90650 -74476 23050 -37268 -119093 -212494 -326093 -290990 -332818 -315146 -303119 -248470
19485 -248470 -165441 -156300 -142909 -22641 41278 -34047 -192932 -132766 -19364 20600 41456
19474 41456 -7745 -74553 25821 -32872 -42204 66152 40917 -55154 9306 206873 282852
19463 282852 25875 -116841 -117825 -176657 -175273 -134190 -4879 -35428 -63700 -102533 -199563
19452 -199563 -308384 -276282 -178488 -138638 -83794 8249 61737 -2106 37731 63768 63138 -68887
19440 -68887 24478 43881 -16344 -34087 -16551 -313 -74520 -116910 -236934 -245448 -115169
19429 -115169 8950 -58972 -131079 -86692 -52428 17095 143724 246320 112787 37771 -19617
19418 -19617 63842 58985 -60944 -133481 -86065 -12155 6144 -100859 -29452 82914 75173
$$ packed form
19497i8189P539J6174R7526o0318q1825r3401j13599L5103m1828J7672J2027N4649
19485b48470Q3029R141J3391J20268O3919p5325j58885O0166J13402L9964K0856
19474D1456m9201o6808J00374n8693r332J08356k5235r6071O4460J97567P5979
19463B82852k56977j42716r84n8832J384M1083J29311l0549k8272l8833r7030
19452a99563j08821L2102R7794L9850N4844R2043N3488o3843L9837K6037o30j32025
19440f8887R3365J9403o0225j7743J7536J6238p4207m2390j20024q514J30279
19429a15169J24119o7922p2107M4387L4264O9523J26629J02596j33533p5016n7388
19418a9617Q3459m857j19929p2537M7416P3910J8299j07003P1407J12366p741
$$ plain form
19407 75173 80401 3724 -83896 -126017 -195047 -166940 -106235 -94652 -106486 -62076 -199558 -184688
19395 -184688 -203869 -243806 -332678 -206998 11066 62170 -16220 -55001 -167684 -90089 -103446
19384 -103446 -75026 -165401 -128190 -93839 17188 117768 15057 -96782 -118839 -197813 -229448
19373 -229448 -12692 56295 -25747 23582 -27949 -152595 -195831 -162089 -233560 -236783 -224831
19362 -224831 -152827 -61648 -43080 16834 7948 64527 110332 -23575 -69487 -109073 -108823 -100516
19350 -100516 -42484 -83613 -29347 -133415 -284747 -220482 -7765 95337 -5258 -132861
19340 -132861 -75225 -27149 -83498 -239872 -343141 -337011 -227137 -154495 -275243 -288790 -124620
19329 -124620 -45721 -121528 -216050 -165192 -86969 -13970 -29477 -94886 -240340 -263187 -160620
$$ packed form
19407G5173N228p6677q7620m2121o9030K8107O0705J1583j1834M4410j37482J4870
19395a84688j9181l9937q8872J25680K18064N1104p8390l8781j12683P7595j3357
19384a03446K8420r0375L7211L4351J11027J00580j02711j11839k2057p8974l1635
19373b29448K16756O8987q2042M9329n1531j24646m3236L3742p1471l223J1952
19362b24831P2004R1179J8568N9914q886N6579M5805j33907m5912l9586K50Q307
19350a00516N8032m1129N4266j04068j51332O4265K12717J03102j00595j27603
19340a32861N7636M8076n6349j56374j03269O130J09874P2642j20748j3547J64170
19329a24620P8899p5807r4522N0858P8223P2999j5507o5409j45454k2847J02567
$$ plain form
19318 -160620 -100921 -47838 -36476 -8648 -20524 18967 -89435 -111477 -247127 -156798 19626
19307 19626 50952 -48497 -162510 -138255 33359 20666 38359 6867 -73688 -2809 59086
19296 59086 89306 81312 90138 81388 -33920 -71411 -139278 -170355 -164899 -107320 -119696 -217067
19284 -217067 -236534 -178735 -158424 -128686 -122652 -280706 -199742 -163530 -200107 -236757 -153780
19273 -153780 -280607 -343332 -259942 -130149 -168521 -90157 -113994 -240209 -152050 -153116 -57181
19262 -57181 -51273 -38747 -92485 -1250 12269 15921 -39194 -33902 63672 77876 29921 48066
19250 48066 -8809 -135990 -141807 -14754 -20667 -74593 -101115 -66649 20288 -36974 -157893
19239 -157893 -148619 -117855 -37821 17071 -27199 -14354 -3077 12592 56637 22974 68248 -87494
$$ packed form
19318a60620N9699N3083J1362K7828j1876L9491j08402k2042j35650R0329J76424
19307A9626L1326r9449j14013K4255J71614j2693J7693l1492q0555P0879O1895
19296E9086L0220p994Q826q750j15308l7491o7867l1077N456N7579j2376r7371
19284b17067j9467N7799K0311K9738O034j58054Q0964L6212l6577l6650Q2977
19273a53780j26827o2725Q3390J29793l8372P8364k3837j26215Q8159j066R5935
19262e7181N908J2526n3738R1235J3519L652n5115N292R7574J4204m7955J8145
19250D8066n6875j27181n817J27053n913n3926k6522L4466Q6937n7262j20919
19239a57893R274L0764Q0034N4892m4270J2845J1277J5669M4045l3663M5274j55742
$$ plain form
19227 -87494 -137509 -99321 -108007 -170283 -52107 -73232 -111595 -115195 -26989 -24626 -180595 -300145
19215 -300145 -252867 -175620 -166739 -194303 -234226 -231213 -157024 -102646 -93706 -87294 -121348 -225634
19203 -225634 -362254 -298310 -291931 -217113 -15536 -99563 -47656 10166 54969 126393 19432
19192 19432 78674 -119163 -228126 -191356 -183215 -129299 -138898 -153303 -226613 -104680 -9761
19181 -9761 12537 -17590 66014 97718 65191 62424 206736 229372 86184 -4393 -49895 -228726
19169 -228726 -173650 -172993 -67355 16571 97333 57501 -58867 -73698 -39651 35572 26348 -39485
19157 -39485 -91009 -167174 -115437 9331 -27113 -49446 -36356 33011 168588 165819 -117755
19146 -117755 -141561 -152588 -87479 78912 89502 49643 -75112 -71826 90565 121152 121764
$$ packed form
19227h7494n0015L8188q686o2276J18176k1125l8363l600Q8206K363j55969j19550
19215c00145M7278P7247Q881k7564l9923L013P4189N4378Q940O412l4054j04286
19203b25634j36620O3944O379P4818K01577q4027N1907N7822M4803P1424j06961
19192A9432N9242j97837j08963L6770Q141N3916r599j4405p3310J21933R4919
19181i761K2298l0127Q3604L1704l2527k767J44312K2636j43188r0577m5502j78831
19169b28726N5076O57J05638Q3926Q0762l9832j16368j4831L4047P5223r224o5833
19157c9485n1524p6165N1737J24768l6444k2333J3090O9367J35577k769k83574
19146a17755k3806j1027O5109J66391J0590l9859j24755L286J62391L0587O12
$$ plain form
19135 121764 48022 262347 429222 401998 282260 141431 146628 141863 205313 305504 375371
19124 375371 437877 483804 425358 396440 493498 504332 426540 617393 743519 637313 542240
19113 542240 617133 666099 689289 725458 663698 553476 424001 357252 337517 288128 319811
19102 319811 195594 182167 304734 377955 319761 295250 265032 178343 153859 388299 448000
19091 448000 549819 628356 616038 569950 497312 413037 434866 318011 236530 279815 316140
19080 316140 248565 168295 126474 285015 331489 460577 500808 311902 245705 238709 348429
19069 348429 589796 632154 633164 474994 475060 536522 619073 599939 613149 510245 522152 451189
19057 451189 453266 496700 559375 699214 796711 825846 715743 675729 572789 518069 564748
$$ packed form
19135A21764p3742K14325J66875k7224j19738j40829N197m765O3450J00191O9867
19124C75371O2506M5927n8446k8918R7058J0834p7792J90853J26126j06206r5073
19113E42240P4893M8966K3190L6169o1760j10222j29475o6749j9735m9389L1683
19102C19811j24217j3427J22567P3221n8194k4511l0218q6689k4484K34440N9701
19091D48000J01819P8537j2318m6088p2638q4275K1829j16855q1481M3285L6325
19080C16140o7575q0270m1821J58541M6474J29088M0231j88906o6197o996J09720
19069C48429K41367M2358J010j58170O6O1462Q2551j9134J3210j02904J1907p0963
19057D51189K077M3434O2675J39839R7497K9135j10103m0014j02940n4720M6679
$$ plain form
19046 564748 567626 503152 464003 503223 643556 637356 565389 452772 353996 508817 682152
19035 682152 785288 911867 1115848 1169486 1057892 828092 497466 289568 283520 204480
19025 204480 5799 -59927 -101120 -145558 -205950 -101849 -106895 -44569 98905 87541 128286
19014 128286 212806 210133 133355 177747 276402 260069 91622 63559 20710 -131206 -147405
19003 -147405 -29983 37177 52069 2100 -51430 -143807 -77088 39094 76317 66055 118917
18992 118917 174522 138205 149987 76446 -31652 -69018 -26249 -75895 -162145 -148276 -79910
18981 -79910 -81117 -130812 -56052 45780 -4365 3144 5514 -10468 -60088 -178452 -113601 -75712
18969 -75712 -5675 -58471 -60826 -187354 -145433 11444 123983 63362 26603 50457 -40856
$$ packed form
19046E64748K878o4474l9149L9220J40333o200p1967j12617r8776J54821J73335
19035F82152J03136J26579K03981N3638j11594k29800l30626k07898o048p9040
19025B04480j98681o5726m1193m4438o0392J04101n046O2326J43474j1364M0745
19014A28286Q4520k673p6778M4392R8655j6333j68447k8063m2849j51916j6199
19003a47405J17422O7160J4892m9969n3530r2377O6719J16182L7223j0262N2862
18992A18917N5605l6317J1782p3541j08098l7366M2769m9646q6250J3869O8366
18981g9910j207m9695P4760J01832n0145P509K370j5982m9620j18364O4851L7889
18969g5712P0037n2796k355j26528M1921J56877J12539o0621l6759K3854r1313
$$ plain form
18958 -40856 -177936 -134214 32757 77410 81146 135592 149069 78158 -6362 -53843 -257514
18947 -257514 -335420 -307366 -251806 -233866 -278083 -289870 -315588 -132036 -66799 -104197 -127267
18936 -127267 -124112 25399 71222 103681 98306 16661 -16921 -19052 81816 160629 192330 148206
18924 148206 159209 137306 218517 244950 176812 76844 67406 167254 56559 58170 72882 174504
18912 174504 207799 46005 -36813 -160420 -155767 -92764 -53241 -40493 -62923 -48714 -120183
18901 -120183 -123031 -37583 65086 161398 137179 86106 6262 -51139 63520 -14882 -80716
18890 -80716 52990 7024 86950 220322 257029 107341 -8211 -1442 104899 103967 36020
18879 36020 16928 -7944 89700 139563 20286 -1725 4338 -79771 -128327 -178382 -217859 -126744
$$ packed form
18958d0856j37080M3722J66971M4653L736N4446J3477p0911q4520m7481k03671
18947b57514p7906K8054N5560J7940m4217j1787k5718J83552O5237l7398k3070
18936a27267L155J49511M5823L2459n375q1645l3582k131J00868P8813L1701m4124
18924A48206J1003k1903Q1211K6433o8138r9968r438R9848j10695J611J4712J01622
18912A74504L3295j61794q2818j23607M653O3003L9523J2748k2430J4209p1469
18901a20183k848Q5448J02669R6312k4219n1073p9844n7401J14659p8402o5834
18890h0716J33706m5966P9926J33372L6707j49688j15552O769J06341r32o7947
18879C6020j9092k4872R7644M9863j19277k2011O063q4109m8556n0055l9477R1115
$$ plain form
18867 -126744 27724 154677 69243 30945 -135657 -197540 -113927 30336 -14113 -2597 -51417
18856 -51417 -97918 -95155 -118383 49501 88970 157416 247701 232633 212683 195687 260441 117783
18844 117783 -75250 -134894 -111403 14487 208954 161012 -85047 -123895 -80853 -51615 -82866
18833 -82866 8305 11001 -60375 -90682 -138822 13183 110746 188194 166875 135770 14886
18822 14886 -64842 -35546 50368 100953 135233 134804 197105 63345 -107835 -196991 -179257 -139103
18810 -139103 -65277 -107223 -107035 51943 71333 71504 109751 98795 -31902 6101 145676 31335
18798 31335 34755 11007 46725 73715 68449 160988 149351 111389 -14968 -32173 -35248 -53974
18786 -53974 -92079 -32858 39606 50186 28620 84394 60602 111480 125028 17907 -99249
$$ packed form
18867a26744J54468J26953q5434l8298j66602o1883Q3613J44263m4449J1516m8820
18856e1417m6501K763k3228J67884L9469O8446R0285j5068j9950j6996O4754j42658
18844A17783j93033n9644K3491J25890J94467m7942k46059l8848M3042K9238l1251
18833h2866R1171K696p1376l0307m8140J52005R7563P7448k1319l1105j20884
18822A4886p9728K9296Q5914N0585L4280m29O2301j33760j71180q9156J7734M0154
18810a39103P3826m1946J88J58978J9390J71L8247j0956j30697L8003J39575j14341
18798C1335L420k3748L5718K6990n266R2539j1637l7962j26357j7205l075j8726
18786e3974l8105N9221P2464J0580k1566N5774k3792N0878J3548j07121j17156
$$ plain form
18775 -99249 -13997 203877 349478 259004 349433 415230 611825 660034 1037981 1416814 1349489
18764 1349489 1114409 779113 557374 411851 280187 205727 207500 154466 46545 -22972
18754 -22972 92175 77428 197257 235793 307477 347658 376153 448998 356087 215521 131202
18743 131202 134244 -3184 -52148 -45313 24291 148203 27996 31616 206029 273864 232010
18732 232010 30365 -81875 -69002 10482 84104 119438 5545 24624 32038 129505 99429
18721 99429 61782 162969 180787 163582 178534 53655 77831 76349 -527 36960 20229
18710 20229 -36217 -70112 -81006 34459 173867 127701 109365 109966 74638 157028 222428 235010
18698 235010 268219 253343 203734 168317 173421 114106 -41071 -34204 15008 152492 181685
$$ packed form
18775i9249Q5252K17874J45601r0474R0429O5797J96595M8209L77947L78833o7325
18764A349489k35080l35296k21739j45523j31664p4460J773n3034j07921o9517
18754b2972J15147j4747J19829L8536P1684M0181K8495P2845r2911j40566q4319
18743A31202L042j37428m8964O835O9604J23912j20207L620J74413O7835m1854
18732B32010k01645j12240J2873P9484P3622L5334j13893J9079P414R7467l0076
18721I9429l7647J01187J7818j7205J4952j24879K4176j482p6876L7487j6731
18710B0229n6446l3895j0894J15465J39408m6166j8336O01l5328Q2390O5400J2582
18698B35010L3209j4876m9609l5417N104n9315j55177O867M9212J37484K9193
$$ plain form
18687 181685 98594 -22771 -83995 20792 107081 273404 347715 378847 429295 410849 326456
18676 326456 320033 352994 419717 420174 346376 235960 208721 98750 225698 307279 358148
18665 358148 417347 433985 464367 544094 703718 676301 490772 332050 283698 338382 377043
18654 377043 327821 270542 372479 501698 454586 521930 734112 854680 850946 840092 911751
18643 911751 907229 748113 815237 827607 910967 1079913 1160099 1190708 1305767 1456515 1567387
18632 1567387 1627898 1778444 1990631 2199437 2374990 2759942 3430336 4171080 4640166 5071783
18622 5071783 5528665 6355943 7862506 10243480 13786373 18791573 24066547 25421821
18614 25421821 23162398 19085234 15449527 13230203 12214263 11979025 12169999 13042615
$$ packed form
18687A81685q3091j21365o1224J04787Q6289J66323P4311L1132N0448j8446q4393
18676C26456o423L2961O6723M57p3798j10416k7239j09971J26948Q1581N0869
18665C58148N9199J6638L0382P9727J59624k7417j85529j58722m8352N4684L8661
18654C77043m9222n7279J01937J29219m7112O7344K12182J20568l734j0854P1659
18643I11751m522j59116O7124J2370Q3360J68946Q0186L0609J15059J50748J10872
18632A567387O0511J50546K12187K08806J75553L84952O70394P40744M69086M31617
18622E071783M56882Q27278J506563K380974L542893N005200N274974J355274
18614B5421821k259423m077164l635707k219324j015940k35238J90974Q72616
$$ plain form
18606 13042615 14585143 16983444 20213038 24570825 31352536 42360317 59972666 86487771
18598 86487771 124865376 184033591 254666050 276201256 250548127 207061607 170189266
18591 170189266 142412341 116070681 92511635 73981004 63154390 59038764 60101293
18584 60101293 66104122 77523010 89740378 90330163 79154676 62698053 47324332
18577 47324332 36318827 28871137 23990990 20601825 18314076 16870532 15816507 15162464
18569 15162464 14956148 14881085 14934194 14566737 14046387 13620300 13553091 13834007 14668085 16156155
18559 16156155 18535367 22372699 28198477 36668652 48534580 65466074 83058995 89007626
18551 89007626 82892812 71028370 60484508 55325791 56037177 62411570 75647073 98982356
$$ packed form
18606A3042615J542528K398301L229594M357787O781711J1007781J7612349K6515105
18598H6487771L8377605N9168215P0632459K1535206k5653129m3486520l6872341
18591A70189266k7776925k6341660k3559046j8530631j0826614m115626J062529
18584F0101293O002829J1418888J2217368N89785j1175487j6456623j5373721
18577D7324332j1005505p447690m880147l389165k287749j443544j054025o54043
18569A5162464k06316p5063N3109l67457n20350m26087o7209K80916Q34078J488070
18559A6156155K379212L837332N825778Q470175J1865928J6931494J7592921N948631
18551H9007626o114814j1864442j0543862n158717P11386O374393J3235503K3335283
$$ plain form
18543 98982356 130257326 158212771 187916303 234105958 293347989 302232106 259847241
18536 259847241 195119794 135144587 94803082 69850650 54074515 43719330 36619363
18529 36619363 31508271 27653673 24379573 21849097 20486074 19977690 20266054 21319251
18521 21319251 23596448 27727133 32865865 33885425 30138234 24362862 18898212 15018091
18513 15018091 12433032 10776820 9773912 9076595 8545655 7866650 6972664 6048777 5362350
18504 5362350 4789611 4443693 4188049 3929588 3817485 3735788 3584874 3474887 3191293 2978492
18494 2978492 2883161 2808279 2572608 2378715 2204078 2233554 2185813 2061352 1949090 1909444
18484 1909444 1814548 1808879 1761928 1697905 1688540 1589612 1313416 1156324 1079722 1109344 1095577
$$ packed form
18543I8982356L1274970K7955445K9703532M6189655N9242031Q884117m2384865
18536B59847241o4727447n9975207m0341505k4952432j5776135j0355185p099967
18529C6619363n111092l854598l274100k530476j363023n08384K88364J053197
18521B1319251K277197M130685N138732J019560l747191n775372n464650l880121
18513A5018091k585059j656212j002908o97317n30940o79005q93986r23887o86427
18504E362350n72739l45918k55644k58461j12103q1697j50914j09987k83594k12801
18494B978492r5331p4882k35671j93893j74637K9476m7741j24461j12262l9646
18484A909444r4896n669m6951o4023r365r8928k76196j57092p6602K9622j3767
$$ plain form
18473 1095577 1028383 895817 1062531 1230312 1178202 1070586 909674 865983 893996 890845
18463 890845 953325 893108 916645 888080 887791 813642 816698 691744 650262 741092 787147 668588
18451 668588 586169 540764 629089 676863 685990 682150 409710 253890 37564 77745 278299
18440 278299 255453 194536 207356 155002 79001 176523 273201 282563 304742 305614 226780 155843
18428 155843 163436 256811 319399 258381 273269 302553 222915 310150 340664 215336 272294
18417 272294 396453 460612 451918 351153 353950 320857 311720 570401 619886 535484 462889
18406 462889 442885 429207 327251 376271 571462 618155 650010 511810 265658 205082 252940
18395 252940 329680 470762 434560 335741 316133 262359 265165 244946 158488 180279 56015
$$ packed form
18473A095577o7194j32566J66714J67781n2110j07616j60912m3691K8013l151
18463H90845O2480o0217K3537k8565k89p4149L056j24954m1482R0830M6055j18559
18451F68588q2419m5405Q8325M7774R127l840k72440j55820k16326M0181K00554
18440B78299k2846o0917J2820n2354p6001R7522R6678R362K2179Q72p8834p0937
18428A55843P593R3375O2588o1018J4888K9284p9638Q7235L0514j25328N6958
18417B72294J24159O4159q694j00765K797l3093r137K58681M9485q4402p2595
18406D62889k0004j3678j01956M9020J95191M6693L1855j38200k46152o0576M7858
18395B52940P6740J41082l6202r8819j9608n3774K806k0219q6458K1791j24264
$$ plain form
18384 56015 -51666 143570 321600 321547 327929 332253 284111 254201 92219 181189 268405 190676
18372 190676 205284 272463 252540 127202 114886 107706 272372 368966 399173 500681 546095
18361 546095 490415 398987 273616 275498 278539 95150 99421 225230 210398 124871 209480
18350 209480 333919 455696 545470 523603 448748 369296 340368 429207 372957 333381 182367
18339 182367 129628 127225 274191 359800 424412 285448 352948 324293 253325 212039 221744
18328 221744 161727 121225 207738 308407 125817 -45454 -15552 74313 137968 66403 77432
18317 77432 94346 52112 94113 151069 142673 138392 84101 20235 79422 73405 52657 163712
18305 163712 214855 199026 206454 167028 169825 85249 181694 200104 168668 31635 -9231 149571
$$ packed form
18384E6015j07681J95236J78030n3O382M324m8142k9910j61982Q8970Q7216p7729
18372A90676J4608O7179j9923j25338j2316p180J64666R6594L0207J01508M5414
18361E46095n5680r1428j25371J882L041j83389M271J25809j4832q5527Q4609
18350B09480J24439J21777Q9774k1867p4855p9452k8928Q8839n6250l9576j51014
18339A82367n2739k403J46966Q5609O4612j38964O7500k8655p0968m1286R705
18328B21744o0017m0502Q6513J00669j82590j71271K9902Q9865O3655p1565J1029
18317G7432J6914m2234M2001N6956q396m281n4291o3866N9187o017k0748J11055
18305A63712N1143j5829P428l9426K797q4576R6445J8410l1436j37033m0866J58802
$$ plain form
18293 149571 18184 -32558 -8358 80894 99324 27270 -5640 25369 54577 67398 4786
18282 4786 5961 129231 116598 21216 226282 383627 289882 214527 118430 60075 46884
18271 46884 -30747 35388 190798 101460 50320 -17341 -58621 -106811 -84230 -20183 5538
18260 5538 119468 134614 34778 -29213 -90764 -3036 42674 70261 200505 212066 144752
18249 144752 176410 171629 160863 161982 231244 198507 122371 90264 202493 233682 99457
18238 99457 -17841 -16239 80709 135731 258881 409416 300062 110152 37155 3370 -1371
18227 -1371 56281 39540 -2121 -8588 54445 189590 145305 59177 222534 199114 86643
18216 86643 -15681 -80541 -41164 63361 140039 90997 109162 58710 81013 163310 192084
$$ packed form
18293A49571j31387n0742K4200Q9252J8430p2054l2910L1009K9208J2821o2612
18282D786J175J23270j2633r5382K05066J57345r3745p5355r6097n8355j3191
18271D6884p7631O6135J55410q9338n1140o7661m1280m8190K2581O4047K5721
18260E538J13930J5146r9836o3991o1551Q7728M5710K7587J30244J1561o7314
18249A44752L1658m781j0766J119O9262l2737p6136l2107J12229L1189j34225
18238I9457j17298J602R6948N5022J23150J50535j09354j89910p2997l3785m741
18227a371N7652j6741m1661o467O3033J35145m4285q6128J63357k3420j12471
18216H6643j02324o4860L9377J04525P6678m9042J8165n0452K2303Q2297K8774
$$ plain form
18205 192084 210627 152548 106123 67751 10109 31935 192233 233731 47559 91781 121075
18194 121075 213991 204618 189450 119400 90004 138536 92557 215309 211845 267835 304025 317664
18182 317664 314052 317080 194209 159349 102740 -46349 60669 129282 188976 126056 122269
18171 122269 125282 221231 211809 423888 579822 472077 498368 482879 498197 573156 477677
18160 477677 357670 210151 87480 85103 169985 244399 342933 527186 488153 500353 490788
18149 490788 565742 723876 759831 864649 1051394 1183369 1211206 1094881 918997 930216
18139 930216 976371 1171290 1212065 1322831 1403876 1520675 1504318 1472189 1514306 1649902 1769888
18128 1769888 1975606 2278954 2529831 2738565 3050572 3532509 4142774 4838391 5792381
$$ packed form
18205A92084J8543n8079m6425l8372n7642K1826J60298M1498j86172M4222K9294
18194A21075R2916r373j5168p0050k9396M8532m5979J22752l464N5990L6190J3639
18182C17664l612L028j22871l4860n6609j49089J07018O8613N9694o2920l787
18171A22269L013R5949r422K12079J55934j07745K6291j5489J5318P4959r5479
18160D77677j20007j47519j22671k377Q4882P4414R8534J84253l9033J2200r565
18149D90788P4954J58134L5955J04818J86745J31975K7837j16325j75884J1219
18139I30216M6155J94919M0775J10766Q1045J16799j6357l2129M2117J35596J19986
18128A769888K05718L03348K50877K08734L12007M81937O10265O95617R53990
$$ plain form
18119 5792381 7014613 8591095 10990692 14613311 20196182 29044336 43423347 66524016
18111 66524016 99766440 153074277 240317530 279374868 244029243 182042873 117764846
18104 117764846 77162765 53947909 39923795 30768377 24537354 20155153 16864446
18097 16864446 14219817 12295281 10731346 9530004 8266339 7227820 6389622 5751472
18089 5751472 5249898 5012127 4721549 4409471 4054509 3753909 3524623 3206229 3085175
18080 3085175 2897140 2714505 2784806 2773672 2734859 2618426 2382506 2138281 1941575 2043802
18070 2043802 2143637 2299764 2455526 2348479 2067448 1768058 1636667 1564335 1491721 1341388
18060 1341388 1192119 1142096 1057655 1188468 1284981 1262836 1183616 1210338 1216082 1176514 1157939
$$ packed form
18119E792381J222232J576482K399597L622619N582871Q848154J4379011K3100669
18111F6524016L3242424N3307837Q7243253L9057338l5345625o1986370o4278027
18104A17764846m0602081k3214856j4024114r155418o231023m382201l290707
18097A6864446k644629j924536j563935j201342j263665j038519q38198o38150
18089E751472n01574k37771k90578l12078l54962l00600k29286l18394j21054
18080C085175j88035j82635P0301j1134l8813j16433k35920k44225j96706J02227
18070B043802R9835J56127J55762j07047k81031k99390j31391p2332p2614j50333
18060A341388j49269n0023q4441J30813R6513k2145p9220K6722N744l9568j8575
$$ plain form
18049 1157939 1095022 1059534 795875 682485 651140 569165 570489 549407 587406 549340 441034
18038 441034 382372 456103 445179 528940 609573 688054 776564 788592 688811 700517 741426
18027 741426 898719 975414 839535 723744 815965 805949 743838 945089 1249909 1382117
18017 1382117 1345207 1111783 827815 623499 612605 524275 484964 377905 319075 527061
18007 527061 714789 903916 1090930 1011958 969752 770533 608544 456637 319406 364637
17997 364637 384306 378431 344384 331934 352430 411602 409924 384390 444970 519828 375983 269961
17985 269961 276623 332479 223921 233009 356642 292542 199856 175464 118420 57600 151753
17974 151753 149113 5092 63711 80967 259254 311776 236201 245182 368619 349910 358950
$$ packed form
18049A157939o2917l5488k63659j13390l1345q1975J324k1082L7999l8066j08306
18038D41034n8662P3731j0924Q3761Q0633P8481Q8510J2028r9781J1706M0909
18027G41426J57293P6695j35879j15791R2221j0016o2111K01251L04820J32208
18017A382117l6910k33424k83968k04316j0894q8330l9311j07059n8830K07986
18007E27061J87728J89127J87014p8972m2206j99219j61989j51907j37231M5231
17997C64637J9669n875l4047j2450K0496N9172j678k5534O0580P4858j43845j06022
17985B69961O662N5856j08558R088J23633o4100r2686k4392n7044o0820R4153
17974A51753k640j44021N8619J7256J78287N2522p5575Q981J23437j8709R040
$$ plain form
17963 358950 312889 265233 423664 373427 225476 120330 112590 28562 -60150 -12837 26221
17952 26221 153447 243081 395046 402674 271645 95874 -61488 -67497 19110 33123 106073
17941 106073 237963 222368 230970 144751 236366 301487 285756 168149 138233 30123 -86142
17930 -86142 -62445 -141151 -50530 61416 42392 72626 43981 58965 59508 51302 169414 153700
17918 153700 145035 264471 206441 143501 119397 53543 32958 11735 9665 93789 59317 -33972
17906 -33972 -43653 43070 -15604 -107102 121539 277622 247079 245760 282164 239616 290731 288574
17894 288574 313200 297755 216616 94417 81587 113516 118349 -7054 -65153 -39921 -68455
17883 -68455 6745 -62423 -60331 -55036 -22138 57188 129524 260514 437069 471875 496034 441515
$$ packed form
17963C58950m6061m7656J58431n0237j47951j05146p740q4028q8712M7313L9058
17952B6221J27226Q9634J51965P628j31029j75771j57362o009Q6607J4013P2950
17941A06073J31890j5595Q602q6219R1615O5121j5731j17607k9916j08110j16265
17930h6142K3697p8706R0621J11946j9024L0234k8645J4984N43q206J18112j5714
17918A53700q665J19436n8030o2940k4104o5854k0585k1223k070Q4124l4472r3289
17906c3972r681Q6723n8674r1498K28641J56083l0543j319L6404m2548N1115k157
17894B88574K4626j5445q1139j22199j2830L1929M833j25403n8099K5232k8534
17883f8455P5200o9168K092N295L2898P9326P2336J30990J76555L4806K4159n4519
$$ plain form
17871 441515 384548 307556 242076 238408 190283 214437 250924 133105 122243 372919 363844
17860 363844 262091 124358 -7951 -41341 -109276 -75552 139122 181334 57622 -47870
17850 -47870 -59911 58172 59116 93154 103226 142645 21220 -201649 -207322 -142994 -78898 4673
17838 4673 142062 158588 161315 64313 80737 126025 4611 -76288 -91837 -3444 122037
17827 122037 172059 104982 158878 178963 299340 231188 120793 87880 -7711 -31956 3185
17816 3185 41002 -5299 -29016 -204609 -205430 -225774 -126967 114773 219125 180247 122910 80911
17804 80911 52907 10300 21111 174439 360794 402911 342359 285091 304692 185789 117788
17793 117788 174482 158414 256852 286831 198416 -20952 -130207 -136064 -132428 -128143 -62138 -32822
$$ packed form
17871D41515n6967p6992o5480l668m8125K4154L6487j17819j0862K50676r075
17860C63844j01753j37733j32309l3390o7935L3724K14674M2212j23712j05492
17850d7870j2041J18083R44L4038J0072L9419j21425k22869n673O4328O4096Q3571
17838D673J37389J6526K727r7002J6424M5288j21414q0899j5549Q8393J25481
17827A22037N0022o7077N3896K0085J20377o8152j10395l2913r5591k4245L5141
17816C185L7817m6301k3717j75593q21k0344R8807K41740J04352l8878n7337m1999
17804H0911k8004m2607J0811J53328J86355M2117o0552n7268J9601j18903o8001
17793A17788N6694j6068R8438K9979q8415k19368j09255n857L636M285O6005K9316
$$ plain form
17781 -32822 17202 63522 229496 226193 299993 331300 262139 263050 305249 402510 269813 96361
17769 96361 178709 242965 242537 241023 186410 335260 474488 586477 594740 665350 712909 729467
17757 729467 694519 686141 885428 883159 820891 744377 609864 656262 575888 584658 619027 634485
17745 634485 713231 804751 965783 1092968 1201152 1279209 1399332 1432953 1432002 1364651 1327349
17734 1327349 1202552 1121415 1089709 1039989 1017926 998276 911496 809658 737650 774256 721504
17723 721504 670078 643396 488611 494781 558636 448858 307471 378999 397717 465799 443386
17712 443386 578512 675324 589208 426464 449140 613227 518043 507423 539488 402970 315324
17701 315324 362938 414387 551742 777395 917708 945993 1095387 1105981 958694 832613
$$ packed form
17781c2822N0024M6320J65974l303P3800L1307o9161R11M2199R7261j32697j73452
17769I6361Q2348O4256m28j514n4613J48850J39228J11989Q263P0610M7559J6558
17757G29467l4948q378J99287k269o2268p6514j34513M6398q0374Q770L4369J5458
17745F34485P8746R1520J61032J27185J08184P8057J20123L3621r51o7351l7302
17734A327349j24797q1137l1706m9720k2063j9650q6780j01838p2008L6606n2752
17723G21504n1426k6682j54785O170O3855j09778j41387P1528J8718O8082k2413
17712D43386J35126R6812q6116j62744K2676J64087r5184j0620L2065j36518q7646
17701C15324M7614N1449J37355K25653J40313K8285J49394J0594j47287j26081
$$ plain form
17691 832613 794684 776363 763306 878254 1023212 1145585 1110272 1126722 1310972 1507683
17681 1507683 1549496 1361576 1288980 1250351 1187603 923494 778675 786591 651601 507464
17671 507464 440265 521164 527597 577235 637161 521128 361511 273909 283833 383584 443343
17660 443343 316172 170797 211947 220124 397006 457368 490409 513541 409251 370032 339704
17649 339704 245376 194775 287424 357702 487539 392621 213937 110586 132849 161001 259615
17638 259615 272097 270488 189888 152446 91127 79840 40952 103269 203605 254603 279691
17627 279691 335471 225712 151239 155081 200159 300485 48090 -140479 -40579 -24167 52266
17616 52266 154816 257303 313676 374891 405528 412036 350230 146465 86408 112848 266956
$$ packed form
17691H32613l7929j8321j3057J14948J44958J22373l5313J6450J84250J96711
17681A507683M1813j87920p2596l8629o2748k64109j44819P916j34990j44137
17671E07464o7199Q0899O433M9638N9926j16033j59617q7602R924R9751N9759
17660D43343j27171j45375M1150Q177J76882O0362L3041K3132j04290l9219l0328
17649C39704r4328n0601R2649P0278J29837r4918j78684j03351K2263K8152R8614
17638B59615J2482j609q0600l7442o1319j1287l8888O2317J00336N0998K5088
17627B79691N5780j09759p4473L842M5078J00326k52395j88569R9900J6412P6433
17616E2266J02550J02487N6373O1215L0637O508o1806k03765o0057K6440J54108
$$ plain form
17605 266956 360630 400563 513378 516267 443128 591318 744959 668202 651787 580141 593563
17594 593563 555895 467936 532536 436417 309547 241087 123533 96066 261753 402890 374558
17583 374558 146560 14402 -25985 134017 245034 286664 333926 269106 317752 330046 389292
17572 389292 272227 109250 128098 18311 39322 91978 114569 85042 92685 83056 58362
17561 58362 -2900 39207 190594 275288 193072 45006 120701 115198 215137 426935 433592
17550 433592 356776 250406 189937 250974 225430 193926 248137 202239 258967 268080 180455
17539 180455 132028 57882 75418 228898 203518 156779 220994 129189 141668 180590 109798
17528 109798 41623 57934 137391 121654 95750 313445 419311 368279 140544 209642 362242
$$ packed form
17605B66956R3674L9933J12815K889p3139J48190J53641p6757j6415p1646J3422
17594E93563l7668q7959O4600r6119j26870o8460j17554k7467J65687J41137k8332
17583C74558k27998j32158m0387J60002J11017M1630M7262o4820M8646J2294N9246
17572C89292j17065j62977J8848j09787K1011N2656K2591k9527P643r629k4694
17561E8362o1262M2107J51387Q4694q2216j48066P5695n503R9939K11798O657
17550D33592p6816j06370o0469O1037k5544l1504N4211m5898N6728R113q7625
17539A80455m8427p4146J7536J53480k5380m6739O4215r1805J2479L8922p0792
17528A09798o8175J6311P9457j5737k5904K17695J05866n1032k27735O9098J52600
$$ plain form
17517 362242 380121 185509 63559 43927 16809 160928 271747 183967 112832 -19201
17507 -19201 129430 18741 -44059 19168 58154 136492 116027 138444 39102 89786 213741
17496 213741 197330 192262 233394 353786 315717 248498 186975 165668 166041 162404 225633 189263
17484 189263 18440 -181527 -249819 10027 268303 246537 272124 283182 294436 196328 293283
17473 293283 303362 152815 74731 4474 66855 7261 -106758 -96048 8667 72229 38936
17462 38936 34354 -10690 -159022 -112952 8463 148032 190061 135481 28054 55616 -18117
17451 -18117 77876 260164 402945 524001 368149 328957 405433 696186 1216139 1686579
17441 1686579 1692875 1493281 1009366 693520 616089 591854 623779 608976 581556 399063 264422
$$ packed form
17517C62242J7879j94612j21950j9632k7118J44119J10819q7780p1135j32033
17507a9201J48631j10689o2800O3227L8986P8338k0465K2417r9342N0684J23955
17496B13741j6411n068M1132J20392l8069o7219o1523k1307L73l637O3229l6370
17484A89263j70823j99967o8292K59846K58276k1766K5587J1058J1254r8108R6955
17473B93283J0079j50547p8084p0257O2381n9594j14019J0710J04715O3562l3293
17462C8936m582m5044j48332M6070J21415J39569M2029n4580j07427K7562p3733
17451a8117R5993J82288J42781J21056j55852l9192P6476K90753N19953M70440
17441A686579O296j99594m83915l15846p7431k4235L1925j4803k7420j82493j34641
$$ plain form
17430 264422 162532 238181 274144 95844 -76906 -152844 -117045 64604 -18665 -94132 -51564
17419 -51564 58854 46554 113102 195930 190584 116236 77412 94224 -251 -53535 48197
17408 48197 223469 146262 -49372 -114378 -91013 -12694 102047 190316 250835 119271 77012
17397 77012 140216 195486 53908 170245 205843 139729 267119 301793 275606 99325 -110109
17386 -110109 -234051 -174951 -123045 -37352 -12005 -50527 72351 147957 43818 66461 17264
17375 17264 -741 -1575 63764 129912 136674 -43155 -85533 -91934 -246669 -204594 -99329 -86868
17363 -86868 163198 185269 246219 291508 318240 261540 174748 94605 148245 118352 261299
17352 261299 308883 200640 180999 48711 -9569 -18021 -17428 27163 67325 164902 249772 246926
$$ packed form
17430B64422j01890P5649L5963j78300j72750p5938L5799J81649q3269p5467M2568
17419e1564J10418j2300O6548Q2828n346p4348l8824J6812r4475n3284J01732
17408D8197J75272p7207j95634o5006K3365P8319J14741Q8269O0519j31564m2259
17397G7012O3204N5270j41578J16337L5598o6114J27390L4674k6187j76281k09434
17386a10109j23942N9100N1906Q5693K5347l8522J22878P5606j04139K2643m9197
17375A7264j8005q34O5339O6148O762j79829m2378o401j54735M2075J05265J2461
17363h6868K50066K2071O0950M5289K6732n6700q6792q0143N3640k9893J42947
17352B61299M7584j08243j9641j32288n8280q452N93M4591M0162R7577Q4870k846
$$ plain form
17340 246926 280828 311089 317541 414882 585452 618610 614182 527750 425741 223646 70576
17329 70576 101431 175753 212553 142904 121533 235419 264965 202769 133410 153584 190233
17318 190233 86878 97360 169892 141849 123043 274492 399160 260237 187795 250940 351558
17307 351558 286217 338933 429296 432443 393628 303552 368293 385138 425824 389272 321930 411285
17295 411285 584215 719273 758102 748887 733710 697072 791365 808828 883055 971874 877560
17284 877560 916928 1100939 1018501 1044986 1163208 1224028 1438497 1653382 1979330 2400161
17274 2400161 2784168 3088006 3502723 3739169 3753905 3728260 3879264 4166717 4835327 5714811
17264 5714811 6908392 8636362 11130713 15064579 20339119 25084508 27543996 26565995
$$ packed form
17340B46926L3902L0261O452R7341J70570L3158m428q6432j02009k02095j53070
17329G0576L0855P4322L6800o9649k1371J13886K9546o2196o9359K0174L6649
17318A90233j03355J0482P2532k8043j8806J51449J24668j38923p2442O3145J00618
17307C51558o5341N2716R0363L147l8815r0076O4741J6845M0686l6552o7342Q9355
17295D11285J72930J35058L8829r215j5177l6638R4293J7463P4227Q8819r4314
17284H77560L9368J84011q2438K6485J18222O0820K14469K14885L25948M20831
17274B400161L84007L03838M14717K36446J4736k5645J51004K87453O68610Q79484
17264E714811J193581J727970K494351L933866N274540M745389K459488r78001
$$ plain form
17256 26565995 22999604 18833642 15695738 13974325 13314478 13670196 14633272 16287104
17248 16287104 18884295 22502610 27736166 35311390 46979076 65256286 92913631 135002729
17240 135002729 194415274 250512826 280499676 271930364 236440176 196336397 160862658
17233 160862658 131857104 106787164 87068929 73728270 67186200 66635155 71360084
17226 71360084 80411069 88814453 91127867 84593842 70993079 55942316 43094566 34043704
17218 34043704 28061021 24025968 21332593 19273018 17658686 16339528 15269281 14209107
17210 14209107 13459489 13106207 13206418 13464639 13859209 14446464 15226605 16251515 18163505
17201 18163505 21544807 26682331 34150837 44897027 59147658 72803320 80975878 80513884
$$ packed form
17256B6565995l566391m165962l137904j721413o59847L55718R63076J653832
17248A6287104K597191L618315N233556P575224J1667686J8277210K7657345M2089098
17240A35002729N9412545N6097552K9986850q569312l5490188m0103779l5473739
17233A60862658k9005554k5069940j9718235j3340659o542070n51045M724929
17226G1360084R050985Q403384K313414o534025j3600763j5050763j2847750r050862
17218C4043704n982683m035053k693375k059575j614332j319158j070247j060174
17210A4209107p49618l53282J00211K58221L94570N87255P80141J024910J911990
17201A8163505L381302N137524P468506J0746190J4250631J3655662Q172558m61994
$$ plain form
17193 80513884 73054883 64224227 58225321 57660597 62561514 73772641 91798731 114342547
17185 114342547 140030893 170072838 210186202 247515280 263922459 244282364 196504889
17178 196504889 144675274 102226861 74024443 56398655 44935992 37163548 31678788
17171 31678788 27662029 24692458 22186923 20187967 19016925 18701321 19465111 21425835
17163 21425835 24600390 27794875 29048339 27582238 23605134 18985699 15095909 12319589
17155 12319589 10448889 9180046 8252824 7450057 6969893 6581230 6344031 6125875 5650972
17146 5650972 5056300 4584731 4171616 3904887 3602794 3314760 3043236 2863522 2720861
17137 2720861 2507984 2412968 2315656 2306968 2344784 2221772 2287359 2199701 2001200 1933744 1864521
$$ packed form
17193H0513884p459001q830656n998906n64724M900917J1211127J8026090K2543816
17185A14342547K5688346L0041945M0113364L7329078J6407179j9640095m7777475
17178A96504889n1829615m2448413k8202418j7625788j1462663p772444n484760
17171C1678788m016759k969571k505535j998956j171042l15604P63790J960724
17163B1425835L174555L194485J253464j466101l977104m619435l889790k776320
17155A2319589j870700j268843r27222q02767m80164l88663k37199k18156m74903
17146E650972n94672m71569m13115k66729l02093k88034k71524j79714j42661
17137B720861k12877r5016r7312q688L7816j23012O5587q7658j98501o7456o9223
$$ plain form
17126 1864521 1707205 1656026 1580121 1575927 1462235 1347327 1277991 1045817 1040522 1078535 1101877
17115 1101877 1010317 1055454 1157615 1167929 1154467 1161467 1093357 895438 827540 901521 986643
17104 986643 1043802 1063674 924231 900434 780342 673501 682634 669544 726499 860405 954171
17093 954171 958806 909600 763151 635228 561927 462618 560087 733442 735709 572932 448776
17082 448776 425194 411732 433604 453509 405074 299553 398931 465568 465135 448766 379083 456503
17070 456503 589438 634417 647228 641344 480246 401760 436808 480985 500485 401002 350813
17059 350813 384131 372293 255875 170669 256595 310820 361809 411264 341641 304916 180039
17048 180039 132100 249340 314707 203321 244554 315039 230157 235929 221796 279248 426392
$$ packed form
17126A864521j57316n1179p5905m194j13692j14908o9336k32174n295L8013K3342
17115A101877r1560M5137J02161J0314j3462P000o8110j97919o7898P3981Q5122
17104I86643N7159J9872j39443k3797j20092j06841R133j3090N6955J33906R3766
17093I54171M635m9206j46449j27923p3301r9309R7469J73355K267j62777j24156
17082D48776k3582j3462K1872J9905m8435j05521R9378O6637m33j6369o9683P7420
17070D56503J32935M4979J2811n884j61098p8486L5048M4177J9500r9483n0189
17059C50813L3318j1838j16418q5206Q5926N4225N0989M9455o9623l6725j24877
17048A80039m7939J17240O5367j11386M1233P0485q4882N772j4133N7452J47144
$$ plain form
17037 426392 476606 491829 566520 516735 551778 511325 488875 511203 425322 324900 199753
17026 199753 97104 253417 255014 197741 255654 241883 142420 83054 -71514 -33892 -2652
17015 -2652 72629 151103 249616 276377 181957 101601 119652 299193 427388 282225 156093
17004 156093 234039 357779 181969 -28534 86201 215526 276007 171970 56248 34483
16994 34483 94589 225891 305405 427506 330367 208791 121838 31733 86302 99809 -35334
16983 -35334 83940 165194 221619 174457 109367 160466 353366 306219 177627 207436 199737
16972 199737 225289 305918 282927 155348 121531 95368 181847 92507 22051 151266 173423
16961 173423 134994 215001 57014 12165 67122 168249 316727 317393 203305 134555 189504
$$ packed form
17037D26392N0214J5223P4691m9785L5043m0453k2450K2328q5881j00422j25147
17026A99753j02649J56313J597n7273N7913j3771r9463n9366j54568L7622L1240
17015b652P5281P8474R8513K6761r4420q0356J8051J79541J28195j45163j26132
17004A56093P7946J23740j75810k10503J14735J29325O0481j04037j15722k1765
16994C4483O0106J31302P9514J22101r7139j21576q6953r0105N4569J3507j35143
16983c5334J19274Q1254N6425m7162o5090N1099J92900m7147j28592K9809p699
16972A99737K5552Q0629k2991j27579l3817k6163Q6479q9340p0456J29215K2157
16961A73423l8429Q0007j57987m4849N4957J01127J48478O66j14088o8750N4949
$$ plain form
16950 189504 204562 159098 109390 41066 -3191 13495 117281 153983 147969 30866 122278
16939 122278 293398 256139 99945 184643 122240 191546 266059 299948 315076 206035 107835
16928 107835 136716 193473 140589 111230 167626 288558 300048 374585 367185 347904 327233
16917 327233 174686 91303 25370 21380 36713 177141 269444 272176 206398 216383 159567 63775
16905 63775 48589 47290 138154 323594 552246 448485 312555 194954 176609 223036 157640
16894 157640 5296 72621 110061 252935 263930 280274 358006 353775 328140 375388 342446
16883 342446 194515 72087 4533 12546 40462 93212 115826 82283 151520 24296 -85589
16872 -85589 -967 55653 -48596 100787 157279 149489 217514 174787 187395 285582 268079
$$ packed form
16950A89504J5058m5464m9708o8324m4257J6686J03786L6702o014j17103R1412
16939A22278J71120l7259j56194Q4698o2403O9306P4513L3889J5128j09041r8200
16928A07835K8881N6757n2884k9359N6396J20932J1490P4537p400j9281k0671
16917C27233j52547q3383o5933l990J5333J40428R2303K732o5778R985n6816r5792
16905F3775j5186j299R0864J85440K28652j03761j35930j17601j8345M6427o5396
16894A57640j52344O7325L7440J42874J0995J6344P7732m231k5635M7248l2942
16883C42446j47931j22428o7554Q013K7916N2750K2614l3543O9237j27224j09885
16872h5589Q4622N6620j04249J49383N6492p790O8025m2727J2608R8187j7503
$$ plain form
16861 268079 156930 29270 13059 130899 233680 171503 96808 111290 101714 22517 124665
16850 124665 168096 79611 8978 -74502 -179175 -146176 -42767 55821 27007 -17617 66380
16839 66380 -2203 -58270 -62847 -14742 25641 70292 246921 299123 28841 -196514 -249168
16828 -249168 -108128 -31575 38334 -63972 -84048 -71567 -34414 -51231 -9757 92224 209685
16817 209685 259231 341544 299537 263396 244935 306719 431853 402666 196473 54286 115357
16806 115357 99716 117672 177879 145487 90269 49578 109029 207839 246907 273069 258941
16795 258941 239980 149964 6263 -91629 -91280 -82320 -115145 -167465 -167572 41026 35255 106312
16783 106312 -14112 -71887 -71454 -109850 -57346 -74807 -90670 -60199 -83906 -50802 146394
$$ packed form
16861B68079j11149j27660j6211J17840J02781o2177p4695J4482r576p9197J02148
16850A24665M3431q8485p0633q3480j04673L2999J03409R8588k8814m4624Q3997
16839F6380o8583n6067m577M8105M0383M4651J76629N2202k70282k25355n2654
16828b49168J41040P6553O9909j02306k0076J2481L7153j6817M1474J01981J17461
16817B09685M9546Q2313m2007l6141j8461O1784J25134k9187k06193j42187O1071
16806A15357j5641J7956O0207l2392n5218m0691N9451R8810L9068K6162j4128
16795B58941j8961r0016j43701r7892L49Q960l2825n2320j07K08598n771P1057
16783A06312j20424n7775M33l8396N2504j7461j5863L0471k3707L3104J97196
$$ plain form
16772 146394 160688 -1175 -71014 8796 93172 140063 206412 211402 134175 20316 -51389
16761 -51389 -99897 -107092 -109277 -199528 -87790 -24631 58562 228580 277547 372372 395722 306331
16749 306331 265399 297403 372599 501758 402154 164155 89926 89474 165250 348879 468692
16738 468692 518532 637311 745577 667629 472986 437030 517511 496268 519573 392276 345212
16727 345212 386688 364710 203552 146901 231493 402501 560525 749032 875525 761017
16717 761017 724369 505612 342613 172819 83531 59485 84685 128876 178029 306245 368903
16706 368903 423338 426518 377096 220619 49311 159481 339989 237285 174445 179270 195537
16695 195537 239688 313381 225547 15888 26471 140733 279803 263503 297557 344870 417094
$$ packed form
16772A46394J4294j61863o9839P9810Q4376M6891O6349M990p7227j13859p1705
16761e1389m8508p195k185r0251J11738O3159Q3193J70018M8967R4825K3350q9391
16749C06331m0932L2004P5196J29159r9604k37999p4229m52P5776J83629J19813
16738D68692M9840J18779J08266p7948j94643l5956Q0481k1243K3305j27297m7064
16727C45212M1476k1978j61158n6651Q4592J71008J58024J88507J26493j14508
16717G61017l6648k18757j62999j69794q9288k4046K5200M4191M9153J28216O2658
16706C68903N4435L180m9422j56477j71308J10170J80508j02704o2840M825J6267
16695A95537M4151P3693q7834k09659J0583J14262J39070j6300L4054M7313P2224
$$ plain form
16684 417094 484869 549848 495504 581178 706090 737059 633141 561269 480236 472660 517725
16673 517725 412872 270060 144667 188192 278330 312010 355699 282661 279543 309197 503486
16662 503486 734526 775710 710789 656301 730758 622142 440915 431199 428115 282871 179448
16651 179448 206598 188724 146511 117587 159510 158800 165850 141653 166397 145295 71126 -24433
16639 -24433 23874 58128 21913 -26368 71950 135525 144909 241152 221191 112147 233134
16628 233134 171019 37544 35745 195 -52745 -82034 -68092 67620 203642 211984 139605
16617 139605 192794 299983 236555 228532 212416 287088 172150 38638 61992 71059 41703
16606 41703 78136 39251 -76296 -13879 29453 154341 344617 281411 43114 -68064 -28064
$$ packed form
16684D17094O7775O4979n4344Q5674J24912L0969j03918p1872q1033p576M5065
16673E17725j04853j42812j25393M3525R0138L3680M3689p3038l118K9654J94289
16662E03486K31040M1184o4921n4488P4457j08616j81227r716l084j45244j03423
16651A79448K7150j7874m2213k8924M1923p10P050k4197K4744k1102p4169r5559
16639b4433M8307L4254l6215m8281R8318O3575R384R6243j9961j09044J20987
16628B33134o2115j33475j799l5550n2940k9289J3942J35712J36022Q342p2379
16617A39605N3189J07189o3428q023j6116P4672j14938j33512K3354R067k9356
16606D1703L6433l8885j15547O2417M3332J24888J90276o3206k38297j11178M0000
$$ plain form
16595 -28064 123526 80059 13402 -9673 -15287 9137 78065 -31748 -4115 35910 34611 22128
16583 22128 -16759 -127429 -43126 75861 85807 103095 53528 63637 29151 104223 157764
16572 157764 135411 224153 45743 -121923 -135926 -37009 -70123 -89168 -7951 139181 181775
16561 181775 177123 178304 85437 -131605 -241912 -129006 -91708 -109368 -70074 -53639 6734
16550 6734 64823 99058 -29721 -144220 -124210 -150351 -108514 3932 34631 -85997 -169944
16539 -169944 -200333 -204798 -155629 -135797 -76164 -11249 13971 -120372 -84821 -94296 -152555 -83321
16527 -83321 -40989 -89104 37695 12034 42920 -3594 -29775 -7885 -257 -19639 -72840 -18905
16515 -18905 -63844 -71892 70975 98242 3969 -471 37054 103041 210222 164589 67557 -9143
$$ packed form
16595b8064J51590m3467o6657k3075n614K4424O8928j09813K7633M0025j299j2483
16583B2128l8887j10670Q4303J18987R946J7288m9567J0109l4486P5072N3541
16572A57764k2353Q8742j78410j67666j4003R8917l3114j9045Q1217J47132M2594
16561A81775m652J181r2867k17042j10307J12906L7298j7660L9294J6435O0373
16550F734N8089L4235j28779j14499K0010k6141M1837J12446L0699j20628q3947
16539a69944l0389m465M9169J9832N9633O4915K5220j34343L5551r475n8259O9234
16527h3321M2332m8115J26799k5661L0886m6514k6181K1890P628j9382n3201N3935
16515a8905m4939q048J42867K7267r4273m440L7525O5987J07181m5633r7032p6700
$$ plain form
16503 -9143 153836 101836 55363 80077 115238 95119 155412 223704 65942 36066 37282 18939
16491 18939 -12325 47827 -27728 -46683 -16237 30276 -45716 58298 59248 -55401 -101993 -33569
16479 -33569 -43254 -287501 -306672 -298495 -190682 -170403 -63853 -42321 -10722 -12525 -71700 -219135
16467 -219135 -131561 -64832 -36460 50912 32636 26738 -27177 -56911 -173835 -249160 -241464 -128145
16455 -128145 -16594 207634 272382 185762 52055 -65660 -57892 -24168 -113543 24626 7625
16444 7625 -21035 -3833 80340 -83194 -198002 -63651 -40300 91070 -41669 -167397 -227458
16433 -227458 -125695 -47914 -1993 -27210 -103550 -95139 47164 109948 -65070 -106055 -1883
16422 -1883 -3457 87613 139517 63184 -75404 45215 39858 -77077 -179372 -278278 -155858
$$ packed form
16503i143J62979n2000m6473K4714L5161k0119O0293O8292j57762k9876J216j8343
16491A8939l1264O0152p5555j8955L0446M6513p5992J04014R50j14649m6592O8424
16479c3569r685k44247j9171Q177J07813K0279J06550K1532L1599j803n9175j47435
16467b19135Q7574O6729K8372Q7372j8276n898n3915k9734j16924p5325P696J13319
16455a28145J11551K24228O4748q6620j33707j17715P768L3724q9375J38169j7001
16444G625k8660J7202Q4173j63534j14808J34351K3351J31370j32739j25728o0061
16433b27458J01763P7781M5921k5217p6340Q411J42303O2784j75018m0985J04172
16422a883j574R1070N1904p6333j38588J20619n357j16935j02295r8906J22420
$$ plain form
16411 -155858 105511 226295 172844 125414 151772 155157 117678 234950 204009 216511 66690
16400 66690 -14400 11256 8108 -23750 -23764 -90026 -34753 208420 261480 265196 212823 151610
16388 151610 108956 18817 -111107 -196149 -193047 -145607 -27955 41087 89585 75686 -24576
16377 -24576 -126614 -164669 -78340 -30439 109248 94548 -24263 -28801 64382 -60323 -91155
16366 -91155 -35324 -72563 -211995 -245396 -62136 -50651 -18297 21396 129063 236436 167398
16355 167398 98464 168902 128787 43220 167518 248338 161035 156457 143299 106425 137185
16344 137185 139900 139848 38783 -13932 -106053 -67295 -74384 5180 -22942 -32790 -96042 -118596
16332 -118596 -47035 -149812 -52740 64852 85881 103092 39980 -148671 -329244 -288632 -254380
$$ packed form
16411a55858K61369J20784n3451m7430K6358L385l7479J17272l0941J2502j49821
16400F6690q1090K5656l148l1858j4o6262N5273K43173N3060L716n2373o1213
16388A51610m2654r0139j29924q5042L102M7440J17652O9042M8498j3899j00262
16377b4576j02038l8055Q6329M7901J39687j4700j18811m538R3183j24705l0832
16366i1155N5831l7239j39432l3401J83260J1485L2354L9693J07667J07373o9038
16355A67398o8934P0438m0115q5567J24298Q0820q7303m578j3158l6874L0760
16344A37185K715n2j01065n2715r2121L8758p089P9564k8122r848o3252k2554
16332a18596P1561j02777R7072J17592K1029J7211o3112j88651j80573M0612L4252
$$ plain form
16321 -254380 -278799 -185256 -140768 -93887 -133481 -212086 -240150 -146976 -26885 107700 175386
16310 175386 247839 238979 251980 177023 79247 -66802 -28923 47008 -4062 52605 64610
16299 64610 -35471 -109299 -66864 -86428 -218628 -238898 -266833 -160013 -80302 -10750 69594
16288 69594 41605 116624 44763 -55606 -88207 -98931 -5357 91930 104856 52533 125097
16277 125097 19405 -61953 -194186 -221885 -209346 -106987 54837 4891 -110256 -252726
16267 -252726 -398238 -345334 -89345 25745 46384 24531 -101 -59845 -19868 63755 5370
16256 5370 -75513 -134970 -81890 -54935 -129102 -62310 26464 -4811 -50091 -78762 -194111 -180944
16244 -180944 -83832 -59299 -10055 -99925 -177865 -177289 -32051 -90801 -204969 -178124 -29784
$$ packed form
16321b54380k4419R3543M4488M6881l9594p8605k8064R3174J20091J34585O7686
16310A75386P2453q860J3001p4957r7776j46049L7879P5931n1070N6667J2005
16299F4610j00081p3828M2435j9564j32200k0270k7935J06820P9711O9552Q0344
16288F9594k7989P5019p1861j00369l2601j0724R3574R7287J2926n2323P2564
16277A25097j05692q1358j32233k7699J2539J02359J61824m9946j15147j42470
16267b52726j45512N2904K55989J15090K0639k1853k4632n9744L9977Q3623n8385
16256E370q0883n9457N3080K6955p4167O6792Q8774l1275m5280k8671j15349J3167
16244a80944R7112K4533M9244q9870p7940N76J45238n8750j14168K6845J48340
$$ plain form
16233 -29784 8316 -128171 -110535 -89133 -35718 89881 27166 -5030 -84544 -91483 -67347
16222 -67347 72795 127569 93694 -21929 40531 24122 -94642 -42350 -27752 -220503 -225051
16211 -225051 -183394 -163660 -111731 -64564 -143262 -185176 -302034 -311850 -204058 -34136 5505
16200 5505 -41080 -11139 31971 1549 37607 -58651 -102581 -61190 -130046 -155679 -148432 -176535
16188 -176535 -101106 -56626 -25181 106828 167081 218427 66095 -89865 -83145 -55041 -39537
16177 -39537 -111861 -145364 -232211 -291661 -254960 -232323 -152827 -39274 -11294 -38191 -98429
16166 -98429 -129325 -77645 -33209 -155279 -73606 33498 151700 145127 9487 67862 39034
16155 39034 -33922 -3773 82225 112404 135662 117977 145813 153279 26357 -127146 -231786
$$ packed form
16233b9784L8100j36487J7636K1402N3415J25599o2715l2196p9514o939K4136
16222f7347J40142N4774l3875j15623O2460j6409j18764N2292J4598j92751m548
16211b25051M1657J9734N1929M7167p8698m1914j16858r816J07792J69922L9641
16200E505m6585K9941M3110l0422L6058r6258m3930M1391o8856k5633P247k8103
16188a76535P5429M4480L1445J32009O0253N1346j52332j55960O720K8104J5504
16177c9537p2324l3503q6847n9450L6701K2637P9496J13553K7980k6897o0238
16166i8429l0896N1680M4436j22070Q1673J07104J18202o573j35640N8375k8828
16155C9034p2956L0149Q5998L0179K3258j7685K7836P466j26922j53503j04640
$$ plain form
16144 -231786 -171754 -187936 -110437 -106810 -83408 -57828 -37246 -12412 111767 77978 -78072
16133 -78072 -159047 -115336 -110444 -93873 -127423 -307820 -448601 -343988 -222422 -169933 -9063
16122 -9063 43532 36590 -31922 -45993 -30720 11757 92637 74515 -21429 -120002 -288258 -321037
16110 -321037 -185075 -171385 -112609 -13628 -112478 -255884 -230656 -193550 -247816 -288350 -169480
16099 -169480 -163033 72796 175122 172921 158439 114281 -20579 -156753 -166604 39185 130352
16088 130352 107481 -135692 -325055 -246312 -45830 -36330 -39898 -114267 -60645 24095 -58304
16077 -58304 -138511 -87670 -36718 9721 -146020 -230578 -201883 -196548 -69275 25484 113948
16066 113948 84033 -53695 -104697 -127226 -53635 3344 44685 -49122 -135240 -149864 -681
$$ packed form
16144b31786O0032j6182P7499L627K3402K5580K0582K4834J24179l3789j56050
16133g8072q0975M3711M892J6571l3550j80397j40781J04613J21566N2489J60870
16122i063N2595o942o8512j4071J5273M2477Q0880j8122r5944r8573j68256l2779
16110c21037J35962J3690N8776R8981r8850j43406K5228L7106n4266m0534J18870
16099a69480O447K35829J02326k201j4482m4158j34860j36174r851K05789R1167
16088A30352k2871k43173j89363P8743K00482R500l568p4369N3622Q4740q2399
16077e8304q0207N0841N0952M6439j55741q4558K8695N335J27273R4759Q8464
16066A13948k9915j37728n1002k2529P3591N6979M1341r3807q6118j4624J49183
$$ plain form
16055 -681 101202 118972 38180 -49619 -45339 -200468 -260390 -211473 -14978 19659 -6196 8926
16043 8926 3299 -48376 -98418 -114329 -124266 -99862 -158017 -243831 -203881 -198402 -217078 -164057
16031 -164057 -67982 -64905 -53872 46509 -41743 -147699 -160567 -155156 -127656 -78119 -144446
16020 -144446 -165244 -99774 -161989 -132119 41014 146442 54288 -15380 16375 118225 37094
16009 37094 -54840 -38007 -152066 -211484 -222762 -109084 -75898 80919 172043 122222 -29407
15998 -29407 -1149 145907 302717 271380 165377 118475 35498 28887 59084 -63749 -99840
15987 -99840 -11224 168824 141957 137111 73724 170676 235101 142535 43130 31990 116819 197086
15975 197086 42609 -167403 -126290 -43235 76925 142962 59701 23096 31577 48386 17492
$$ packed form
16055f81J01883J7770q0792q7799M280j55129n9922M8917J96495L4637k5855J5122
16043H926n627n1675n0042j5911r937K4404n8155q5814L9950N479j8676N3021
16031a64057R6075L077J1033J00381q8252j05956j2868N411K7500M9537o6327
16020a44446k0798O5470o2215K9870J73133J05428r2154o9668L1755J01850q1131
16009C7094r1934J6833j14059n9418j1278J13678L3186J56817R1124m9821j51629
15998b9407K8258J47056J56810l1337j06003m6902q2977o611L0197j22833l6091
15987i9840Q8616J80048k6867m846o3387R6952O4425r2566r9405j1140Q4829Q0267
15975A97086j54477k10012M1113Q3055J20160O6037q3261l6605Q481J6809l0894
$$ plain form
15964 17492 87719 131796 144059 152641 175077 116751 77367 51991 -99045 -75342 -96374 -88062
15952 -88062 14616 77429 44202 7636 -4053 -94704 -32699 6314 -95910 -244104 -254043
15941 -254043 -245915 -28035 -33508 -91017 -64004 -157138 -166121 -159998 -131292 -70346 138320 199134
15929 199134 244600 118937 74671 2555 -21697 -28773 -200787 -285212 -150926 -147463 -108757
15918 -108757 -30435 -34941 -104321 -64490 -176459 -303521 -226490 21276 109693 154062 139596
15907 139596 55037 18065 79409 73566 941 7996 -19535 -48961 -29191 -24416 -70521 -67212
15895 -67212 -63708 -72630 -90281 -217547 -203182 -129084 -144894 -68379 2134 -100720 -190164 -133259
15883 -133259 -82917 14679 190758 25017 -29416 17515 -17803 7386 156695 236228 278305
$$ packed form
15964A7492P0227M4077J2263Q582K2436n8326l9384k5376j51036K3703k1032Q312
15952h8062J02678O2813l3227l6566j1689r0651O2005L9013j02224j48194r939
15941b54043Q128K17880n473n7509K7013r3134q983O123K8706O0946K08666O0814
15929A99134M5466j25663m4266p2116k4252p076j72014q4425J34286L463L8706
15918a08757P8322m506o9380L9831j11969j27062P7031K47766Q8417M4369j4466
15907A39596q4559l6972O1344n843p2625P055k7531k9426J9770M775m6105L309
15895f7212L504q922j7651j27266J4365P4098j5810P6515P0513j02854q9444N6905
15883a33259N0342R7596J76079j65741n4433M6931l5318K5189J49309P9533M2077
$$ plain form
15872 278305 183617 103773 42633 30063 -5756 -1770 118563 179110 149436 120212 79947
15861 79947 45002 16548 58389 124805 5171 -106069 -129989 -136043 7278 67377 75312
15850 75312 42823 60083 50210 97312 28609 16518 -73033 -50018 37364 -107014 -200157 -36779
15838 -36779 78283 19625 -29616 2225 -3918 90866 91254 -2265 -107576 -145848 -183880 -172645
15826 -172645 -92613 31151 43615 -65579 -6136 76420 65413 -79458 -116385 -161440 -162489
15815 -162489 -151670 -205358 -241213 -167105 -35198 14252 34118 -30980 -33843 -147083 -242048
15804 -242048 -105543 -42096 83810 -51184 -147655 -77706 -138281 -227717 -140848 -82264 -49453
15793 -49453 -42561 4119 92871 266338 345325 346975 236210 99451 -72929 -68557 7937
$$ packed form
15872B78305r4688p9844o1140j2570l5819L986J20333O0547k9674k9224m0265
15861G9947l4945k8454M1841O6416j19634j11240k3920o054J43321O0099P935
15850G5312l2489J7260r873M7102o8703j2091q9551K3015Q7382j44378r3143J63378
15838c6779J15062n8658m9241L1841o143R4784L88r3519j05311l8272l8032J1235
15826a72645Q0032J23764J2464j09194N9443Q2556j1007j44871l6927m5055j049
15815a62489J0819n3688l5855P4108J31907M9450J9866o5098k863j13240r4965
15804b42048J36505O3447J25906j34994r6471O9949o0575q9436Q6869N8584L2811
15793d9453O892M6680Q8752J73467P8987J650j10765j36759j72380M372P6494
$$ plain form
15782 7937 -4762 -5632 65029 -95804 -110429 -28189 -97559 -66473 38332 74329 82429 45916
15770 45916 14764 89049 20289 -68691 -36160 -1473 -9412 47292 148302 72737 70952 -4046
15758 -4046 62801 69564 48840 153678 73883 97513 146473 177690 102294 -14652 -53872 -764
15746 -764 -91794 -194452 -88518 -51924 -73164 -111136 -96489 -37157 -9986 -24448 -13776 -65934
15734 -65934 -76446 20121 -47422 -156282 -209910 -326084 -252572 -267252 -337741 -242059 -121071
15723 -121071 -100437 -159324 -223925 -197160 -197318 -176900 -30876 64279 112494 62653 -81729
15712 -81729 -68191 -119424 -111852 -50543 -42355 -46198 -80767 -33586 -27048 -96914 -194027 -223523
15700 -223523 -52907 27223 67794 56382 -152816 -121608 -14642 169216 147128 -21536
$$ packed form
15782G937j2699q70P0661j60833j4625Q2240o9370L1086J04805L5997Q100l6513
15770D5916l1152P4285o8760q8980L2531L4687p939N6704J01010p5565j785p4998
15758d046O6847O763k0724J04838p9795K3630M8960L1217p5396j16946l9220N3108
15746g64r1030j02658J05934L6594k1240l7972J4647N9332K7171j4462J0672n2158
15734f5934j0512R6567o7543j08860n3628j16174P3512j4680p0489R5682J20988
15723a21071K0634n8887o4601K6765j58K0418J46024R5155M8215m9841j44382
15712h1729J3538n1233P572O1309Q188l843l4569M7181O538o9866r7113k9496
15700b23523J70616Q0130M0571j1412k09198L1208J06966J83858k2088j68664
$$ plain form
15690 -21536 -74587 -72391 -64851 -25883 -21217 207960 223982 41261 -53427 -261304 -384408
15679 -384408 -330936 -237321 -191137 -69036 -51857 2513 37216 -113167 -176370 -152804 -173194
15668 -173194 -177026 -313033 -301696 -244931 -197435 -46571 -66050 -89906 -137204 -190764 -213955
15657 -213955 -253500 -310363 -35153 122089 85984 142012 236810 131477 79380 3020 -50741
15646 -50741 -12564 27859 16927 98934 287043 340562 166488 2327 -65340 -15632 8360
15635 8360 110707 108251 49479 38462 111156 89861 85341 93383 42957 101545 194619 248931
15623 248931 246492 121695 34748 135096 101543 -85060 -221256 -75051 -30752 -83463 -168994
15612 -168994 -275217 -268695 -94118 -145125 -78587 -84873 -215581 -197839 -126376 -229126 -233456
$$ packed form
15690b1536n3051K196P540L8968M666K29177J6022j82721r4688k07877j23104
15679c84408N3472R3615M6184J22101J7179N4370L4703j50383o3203K3566k0390
15668a73194l832j36007J1337N6765M7496J50864j9479k3856m7298n3560k3191
15657b13955l9545n6863K75210J57242l6105N6028R4798j05333n2097p6360n3761
15646e0741L8177M0423j0932Q2007J88109N3519j74074j64161o7667M9708K3992
15635H360J02347k456n8772j1017P2694k1295m520Q042n0426N8588R3074N4312
15623B48931k439j24797q6947J00348l3553j86603j36196J46205M4299n2711q5531
15612a68994j06223O522J74577n1007O6538o286j30708J7742P1463j02750m330
$$ plain form
15601 -233456 -282341 -116613 -95231 -109650 -29519 -168062 -294922 -263295 -206178 -108260 27389
15590 27389 95382 97057 -35337 -154711 -256541 -129919 6277 67662 21438 40908 80145
15579 80145 106424 134045 -19246 -36671 38275 43434 -15318 -117214 -152147 5580 119822
15568 119822 87438 -45405 -44006 -49541 43382 132970 104254 93853 36279 -79035 -218938
15557 -218938 -218071 -259191 -272600 -224266 -114757 20090 6181 -13619 -37624 107095 208478
15546 208478 275167 137478 136145 102835 126131 130443 94272 36711 -113211 -196720 -235980
15535 -235980 -289978 -199562 -43879 -58165 25735 33324 27827 -24444 -33948 -49176 -2906 7320
15523 7320 60161 -10576 -105253 16505 79014 213140 132612 -47438 -4008 -101630 -140214
$$ packed form
15601b33456m8885J65728K1382j4419Q0131j38543j26860L1627N7117R7918J35649
15590B7389O7993J675j32394j19374j01830J26622J36196O1385m6224J9470L9237
15579H0145K6279K7621j53291j7425P4946N159n8752j01896l4933J57727J14242
15568A19822l2384j32843J399n535R2923Q9588k8716j0401n7574j15314j39903
15557b18938Q67m1120j3409M8334J09509J34847j3909j9800k4005J44719J01383
15546B08478O6689j37689j333l3310K3296M312l6171n7561j49922q3509l9260
15535b35980n3998R0416J55683j4286Q3900P589n497n2271r504j5228M6270J0226
15523G320N2841p0737r4677J21758O2509J34126q0528j80050M3430r7622l8584
$$ plain form
15512 -140214 143665 96371 -18458 -132222 -50428 13786 76600 15129 -121114 -115895 -47013
15501 -47013 -46110 -78700 -114603 37396 174022 72488 -102217 -84232 -70487 14204 245224
15490 245224 328835 256726 350525 411304 342058 288287 234712 135221 -48589 -105428 -67552
15479 -67552 -36808 1465 1305 -18599 13039 -47747 -156992 -179537 -68949 -9036 -13517 -135277
15467 -135277 -131555 -85120 53562 122965 102715 85137 109776 120791 191683 170205 107091
15456 107091 86035 -64589 -172404 -172819 -2198 -12463 -32821 -65059 115947 95090 -27662
15445 -27662 -96830 55732 125690 39088 37367 23780 -137127 -95514 66245 65296 72381 75115
15433 75115 113884 -96598 -143095 -164996 -56597 56523 213501 117774 -40462 -23093 108025
$$ packed form
15512a40214K83879m7294j14829j13764Q1794O4214O2814o1471j36243N219O8882
15501d7013R03l2590l5903J51999J36626j01534j74705J7985J3745Q4691K31020
15490B45224Q3611p2109R3799O0779o9246n3771n3575r9491j83810n6839L7876
15479f7552L0744L8273j60j9904L1638o0786j09245k2545J10588N9913m481j21760
15467a35277L722M6435J38682O9403k0250j7578K4639J1015P0892k1478o3114
15456A07091k1056j50624j07815m15J70621j0265k0358l2238J81006k0857j22752
15445b7662o9168J52562O9958q6602j721j3587j60907M1613J61759r49P085K734
15433G5115L8769k10482m6497k1901J08399J13120J56978r5727j58236J7369J31118
$$ plain form
15422 108025 171596 246052 274535 283579 169630 -9336 -129346 -144869 -59878 8168 -22402
15411 -22402 -105972 -69615 -66970 -73668 -115841 -212403 -130108 -49599 -94506 -163706 -198563 -96892
15399 -96892 -61501 -4816 199769 215421 143065 56019 -9819 16900 4350 -19351 36490
15388 36490 89503 226494 164440 -17485 -58640 -38611 -63609 -22319 57397 99308 149213
15377 149213 236967 49136 -41609 -94518 -149015 -199315 -207863 -126318 -66373 44470 18368
15366 18368 -62572 -29690 -34017 -22455 68505 59061 -80202 -141086 -144008 -131912 -96681 -80449
15354 -80449 -56335 -119947 -59869 -122611 -220949 -122551 -193622 -254033 -158803 -53597 14810
15343 14810 -15377 -68678 -21504 161176 145458 98117 19991 -33626 -76067 -112209 34277
$$ packed form
15422A08025O3571P4456K8483R044j13949j78966j20010j5523Q4991O8046l0570
15411b2402q3570L6357K645o698m2173r6562Q2295Q0509m4907o9200l4857J01671
15399i6892L5391N6685K04585J5652p2356q7046o5838K6719j2550k3701N5841
15388C6490N3013J36991o2054j81925m1155K0029k4998M1290P9716M1911M9905
15377A49213Q7754j87831r0745n2909n4497n0300q548Q1545N9945J10843k6102
15366A8368q0940L2882m327J1562R0960r444j39263o0884k922J2096L5231J6232
15354h0449K4114o3612O0078o2742r8338R8398p1071o0411R5230J05206O8407
15343A4810l0187n3301M7174J82680j5718m7341p8126n3617m2441l6142J46486
$$ plain form
15332 34277 46307 11205 26201 -52155 -40351 -21897 56615 -51120 -19516 64030 -22415
15321 -22415 -12221 -128160 -185984 -164808 -12836 119342 57911 52448 153 -52408 -68807
15310 -68807 -165931 -292603 -279182 -158417 -124185 -85285 -19911 -26688 102131 110116 22092
15299 22092 95701 94492 19874 -29208 -143999 -40554 18282 35211 -18669 -74907 -200137
15288 -200137 -177395 -175179 -33283 166457 83557 45049 -101857 -174566 -143531 -37885 -72281
15277 -72281 -161671 -188772 -188508 -162864 -105268 -67420 -47594 79447 -14422 6375 37737 74048
15265 74048 64731 -83754 -106397 -68637 17996 43604 16451 31869 51657 -28232 -73679 -104853
15253 -104853 -134779 -213649 -150709 -7421 2472 61298 17020 19556 -81431 -152435 -157978 -133313
$$ packed form
15332C4277J2030l5102J4996p8356J1804J8454P8512j07735L1604Q3546q6445
15321b2415J0194j15939n7824K1176J51972J32178o1431n463n2295n2561j6399
15310f8807r7124j26672J3421J20765L4232L8900O5374o777J28819P985q8024
15299B2092P3609j209p4618m9082j14791J03445N8836J6929n3880n6238j25230
15288b00137K2742K216J41896J99740q2900l8508j46906p2709L1035J05646l4396
15277g2281q9390k7101K64K5644N7596L7848J9826J27041r3869K0797L1362L6311
15265G4048r317j48485k2643L7760Q6633K5608k7153J5418J9788p9889m5447l1174
15253a04853k9926p8870O2940J43288R893N8826m4278K536j00987p1004n543K4665
$$ plain form
15241 -133313 -110775 -114512 48181 130097 99913 165113 68091 -101446 -66189 -14997 23952
15230 23952 -72991 -45491 -77516 -63569 -94172 -92079 -39923 -51742 -49855 -11784 -45404 -77934
15218 -77934 -165486 -254406 -320846 -241625 -175972 -140713 -229956 -245683 -314164 -271261 -209301 -103343
15206 -103343 -57649 -111928 -99130 -83595 -105674 -177087 -245533 -217106 -206008 -132883 -26015
15195 -26015 -69859 -15332 60857 65016 -99735 -158369 -164351 -303141 -350907 -242101 -234238 -213152
15183 -213152 -205993 -173559 -149221 -121954 -15132 -181266 -236112 -271721 -225878 -46359 35542
15172 35542 13630 106727 195916 127591 -795 -72581 -224806 -230107 -113948 -74703 118515
15161 118515 276773 145018 39766 -103964 -263384 -126547 63132 14926 -222762 -220581
$$ packed form
15241a33313K2538l737J62693Q1916l0184O5200r7022j69537L5257N1192L8949
15230B3952r6943K7500l2025J3947l0603K093N2156j1819J887L8071l3620l2530
15218g7934q7552q8920o6440P9221O5653L5259q9243j5727o8481M2903O1960J05958
15206a03343M5694n4279J2798J5535k2079p1413o8446K8427J1098P3125J06868
15195b6015m3844N4527P6189M159j64751n8634n982j38790m7766J08806P863K1086
15183b13152P159L2434K4338K7267J06822j66134n4846l5609M5843J79519Q1901
15172C5542k1912R3097Q9189o8325j28386p1786j52225n301J16159L9245J93218
15161A18515J58258j31755j05252j43730j59420J36837J89679m8206k37688K181
$$ plain form
15151 -220581 -99201 -77643 -98981 -81401 -85646 -26767 51433 -82951 -177148 -178968 -132932
15140 -132932 24541 -16925 -12278 87546 12575 -149590 -132961 -135143 -229354 -229828 -150567 -110343
15128 -110343 -98402 104530 8458 -171909 -80958 2723 -35150 -211127 -231400 -145902 -154151
15117 -154151 -100238 43430 -14265 -103700 -200991 -165061 -193897 -244929 -157212 -159475 -368183
15106 -368183 -308435 -115763 -42844 -670 3905 38308 10441 -64590 -51827 -2108 -5934 7289
15094 7289 12002 19156 -49955 -71781 52963 -37045 -201533 -284698 -211014 -69469 -43588 132850
15082 132850 170375 184308 202559 268173 162783 156115 150397 49327 -64202 -179541 -159297
15071 -159297 -70145 -78237 -76190 -24500 -56915 -54463 -40985 -86503 -208413 -226652 -146358 21008
$$ packed form
15151b20581J21380K1558k1338J7580m245N8879P8200j34384r4197j820M6036
15140a32932J57473m1466M647R9824p4971j62165J6629k182r4211m74P9261M0224
15128a10343J1941K02932r6072j80367R0951Q3681l7873j75977k0273Q5498q249
15117a54151N3913J43668n7695q9435r7291L5930k8836n1032Q7717k263k08708
15106c68183N9748J92672P2919M2174M575L4403k7867p5031J2763M9719l826J3223
15094G289M713P154o9111k1826J24744r0008j64488q3165P3684J41545K5881J76438
15082A32850L7525J3933J8251O5614j05390o668n718j01070j13529j15339K0244
15071a59297Q9152q092K047N1690l2415K452J3478m5518j21910j8239Q0294J67366
$$ plain form
15059 21008 13293 -9830 4461 132787 173640 69410 -4260 -80610 -166702 -170316 -208401 -25383
15047 -25383 127962 187809 136017 10298 40641 -243 -21065 34938 198134 206105 124535
15036 124535 185218 187806 190764 161423 166039 137678 15714 26880 151051 161249 74062 129556
15024 129556 91780 106653 210601 164613 128817 96884 29167 27574 -16502 -170200 -137758
15013 -137758 -151996 -224930 -135182 -81923 6189 75282 72208 64379 5885 73351 106724 48106
15001 48106 -19826 -77381 -116782 -66546 44376 123279 134681 80898 41303 84144 74630 68416
14989 68416 -6803 -30428 -74166 -83813 -168780 -57717 -51341 -8283 51042 6945 -17430 -66700
14977 -66700 -75705 12087 -15250 25832 43996 193332 258970 291197 201458 38401 -140686
$$ packed form
15059B1008p715k3123J4291J28326M0853j04230p3670p6350q6092l614l8085J83018
15047b5383J53345N9847n1792j25719L0343m0884k0822N6003J63196P971q1570
15036A24535O0683K588K958k9341M616k8361j21964J1166J24171J0198q7187N5494
15024A29556l7776J4873J03948m5988l5796l1933o7717j593m4076j53698L2442
15013a37758j4238p2934Q9748N3259Q8112O9093l074p829n8494O7466L3373n8618
15001D8106o7932n7555l9401N0236J10922P8903J1402n3783l9595M2841r514o214
14989F8416p5219k3625m3738r647q4967J11063O376M3058N9325m4097k4375m9270
14977f6700r005Q7792k7337M1082J8164J49336O5638L2227q9739j63057j79087
$$ plain form
14966 -140686 -132892 -20022 78697 171852 134544 127978 77565 20308 -6087 -104667 -114586 -40212
14954 -40212 -64900 -76127 -155091 -95105 -82019 -105334 30556 29873 15045 120484 168044 142308
14942 142308 106080 195776 229696 121853 108986 52475 47860 -41169 4317 -65886 -60565 -7094
14930 -7094 128333 180991 183443 145851 183814 148200 152277 135674 62250 18785 1982 25379
14918 25379 105770 31279 -32404 -83449 -153410 -172476 -47392 94114 -21368 73467 150882
14907 150882 176574 48205 28380 -64859 -118943 -121491 -120971 -59562 -101913 -273826 -245213 -168883
14895 -168883 -128944 39096 -10605 36052 47566 -20800 -121186 -97570 104180 210066 239237
14884 239237 236252 200636 251430 254407 90119 -253954 -323866 -318483 -315995 -147671 -70213 -30286
$$ packed form
14966a40686P794J12870R8719R3155l7308o566n0413n7257k6395r8580r919P4374
14954d0212k4688j1227p8964N9986J3086k3315J35890o83j4828J05439M7560k5736
14942A42308l6228Q9696L3920j07843j2867n6511m615q9029M5486p0203N321N3471
14930g094J35427N2658K452l7592L7963l5614M077j6603p3424m3465j6803K3397
14918B5379Q0391p4491o3683n1045o9961j9066J25084J41506j15482R4835P7415
14907A50882K5692j28369j9825r3239n4084k548N20O1409m2351j71913K8613P6330
14895a68883L9939J68040m9701M6657J1514o8366j00386K3616K01750J05886K9171
14884B39237k985l5616N0794K977j64288l44073o9912N383K488J68324P7458L9927
$$ plain form
14872 -30286 -24365 -101210 -194490 -177392 -348801 -361924 -259226 -131914 -8546 -78869 -118197
14861 -118197 -68485 -53913 -35693 -45819 -2845 -94425 -103258 -58633 -8739 -43052 -144774
14850 -144774 -134163 -86142 -51612 24298 19289 -45533 -69371 5102 -8991 -21575 -12680 -10225
14838 -10225 -73068 -87601 -164419 -62773 -50268 -156081 -201867 -239870 -139229 -21625 -6554
14827 -6554 -161579 -190279 -121954 -35242 41991 17340 -129914 -239182 -104333 -91948 -61860
14816 -61860 64251 46050 -77435 4814 25149 -16064 -7617 -24455 -94840 -65695 -17333
14805 -17333 81145 14223 -153846 -151584 -109179 -113044 -125664 -152987 -59555 -46364 -63899 5892
14793 5892 50708 106552 14666 -20553 19070 69094 14119 -81806 -112080 -168267 -107796 9399
$$ packed form
14872c0286N921p6845r3280J7098j71409j3123J02698J27312J23368p0323l9328
14861a18197M9712J4572J8220j0126M2974r1580q833M4625M9894l4313j01722
14850a44774J0611M8021L4530P5910n009o4822k3838P4473j4093j2584Q895K455
14838a0225o2843j4533p6818J01646J2505j05813m5786l8003J00641J17604J5071
14827f554j55025k8700O8325Q6712P7233k4651j47254j09268J34849J2385L0088
14816f1860J26111j8201j23485Q2249K0335m1213Q447j6838p0385K9145M8362
14805a7333R8478o6922j68069K262M2405l865j2620k7323R3432J3191j7535O9791
14793E892M4816N5844r1886l5219L9623N0024n4975r5925l0274n6187O0471J17195
$$ plain form
14781 9399 28162 -44658 -78638 -183409 -113107 35201 101905 32586 -110339 7781 -4198
14770 -4198 -77250 -149206 -297855 -224283 -140462 -154147 3615 186048 341247 305431 131891
14759 131891 -857 -33008 -65660 -63085 -153137 -255699 -66939 -15419 -35483 34087 73684
14748 73684 155748 129739 85946 74277 39781 128519 63146 -1627 -89578 -88715 -29630 -116696
14736 -116696 -126910 -48318 80579 115484 71443 47219 -13488 -158664 -254139 -291569 -178069
14725 -178069 22077 112665 83841 200853 162785 86127 32353 19243 45845 -46916 -225194
14714 -225194 -220674 -107741 -24058 -89491 -144310 -177740 -257763 -189236 -198138 -202942 -173939 -99387
14702 -99387 -14087 41655 211193 223388 264396 222246 188201 94999 -48873 -47481 52369
$$ packed form
14781I399J8763p2820l3980j04771P0302J48308O6704o9319j42925J18120j1979
14770d198p3052p1956j48649P3572Q3821j3685J57762J82433J55199l5816j73540
14759A31891j32748l2151l2652K575r0052j02562J88760N1520k0064O9570L9597
14748G3684Q2064k6009m3793j1669l4496Q8738o5373o4773q7951Q63N9085q7066
14736a16696j0214P8592J28897L4905m4041k4224o0707j45176r5475l7430J13500
14725a78069K00146R0588k8824J17012l8068p6658n3774j3110K6602r2761j78278
14714b25194M520J12933Q3683o5433n4819l3430q0023O8527q902m804K9003P4552
14702i9387Q5300N5742J69538J2195M1008m2150l4045r3202j43872J392R9850
$$ plain form
14691 52369 89977 8536 -94513 -33665 -17042 -64509 34871 66164 112878 103300 -38825
14680 -38825 35645 88911 55680 122493 99753 100097 61574 -29873 -38925 -58142 -29659 117293
14668 117293 56320 -95819 -113736 -9984 -45603 -148869 -180629 -124522 -55090 -20021 21320
14657 21320 132184 175486 202036 155294 195310 146167 73165 48981 -79598 -205797 -244275
14646 -244275 -94355 27760 -30944 -42789 -71172 -32808 9223 -71448 -39476 76319 94036
14635 94036 -20262 -166321 -98349 -20466 102615 104557 176504 256443 73829 -92490 -194000
14624 -194000 -237663 -171384 -165206 -215200 -163142 -74495 37476 50665 -45453 -56957 -74245
14613 -74245 -157032 -89042 44119 7630 20222 -6520 -67165 21535 23169 60856 99066 61624
$$ packed form
14691E2369L7608q1441j03049O0848J6623m7467R9380L1293M6714r578j42125
14680c8825P4470N3266l3231O6813k2740L44l8523r1447r052j9217K8483J46952
14668A17293o0973j52139j7917J03752l5619j03266l1760N6107O9432L5069M1341
14657B1320J10864M3302K6550m6742M0016m9143p3002k4184j28579j26199l8478
14646b44275J49920J22115n8704j1845k8383L8364M2031q0671L1972J15795J7717
14635I4036j14298j46059O7972P7883J23081J942P1947P9939j82614j66319j01510
14624a94000m3663O6279O178m9994N2058Q8647J11971J3189r6118j1504j7288
14613g4245q2787O7990J33161l6489J2592k6742o0645Q8700J634L7687L8210l7442
$$ plain form
14601 61624 94059 163929 185455 158828 26505 6648 -152514 -309577 -230113 -61327 25007
14590 25007 75013 64061 22258 -8182 -52026 78552 206652 105322 63164 40461 49504
14579 49504 -35877 -253252 -243796 -106612 -172111 -279129 -247455 -201810 -39821 71953 83777
14568 83777 41091 -51531 -231196 -396956 -356660 -361243 -417271 -290955 -248971 -185721 -240394
14557 -240394 -284176 -171408 -147896 -25697 -25716 33361 50948 53237 1880 14242 -70805 7478
14545 7478 38998 -49596 36020 97346 40541 -90567 -133209 -3471 7296 -22673 45515
14534 45515 122828 151085 195047 53762 -19487 -5590 15555 83696 113162 44284 43716 -60905
14522 -60905 -97450 -207085 -236590 -359161 -283806 -42 161693 201778 122321 127690 118305
$$ packed form
14601F1624L2435O9870K1526k6627j32323j9857j59162j57063P9464J68786Q6334
14590B5007N0006j0952m1803l0440m3844J30578J28100j01330m2158k2703R043
14579D9504q5381k17375R456J37184o5499j07018L1674M5645J61989J11774J1824
14568H3777m2686r2622j79665j65760M0296m583n6028J26316M1984O3250n4673
14557b40394m3782J12768K3512J22199j9N9077J7587K289n1357J2362q5047P8283
14545G478L1520q8594Q5616O1326n6805j31108m2642J29738J0767k9969O8188
14534D5515P7313K8257M3962j41285p3249J3897K1145O8141K9466o8878n68j04621
14522f0905l6545j09635k9505j22571P5355K83764J61735M0085p9457N369r385
$$ plain form
14511 118305 42130 -91005 -129746 -55579 -74283 -59487 -62465 -119546 -77350 -38327 58184
14500 58184 172130 346023 233806 48111 91134 33876 116873 239517 260058 137589
14490 137589 87192 16640 -25766 46594 62699 -56 -80447 -4774 95752 118935 -26897
14479 -26897 -88765 -55138 131414 176548 56951 -3095 -6114 11666 -80437 18190 211943
14468 211943 164482 124761 125044 -75615 -221254 -181916 -9685 51921 14463 -113962 -88447
14457 -88447 8782 105369 69326 -75187 2824 2007 -17765 -74878 -236582 -273155 -279085 -200160
14445 -200160 -73503 894 178381 220796 158776 74551 104420 183784 139163 97913 113524
14434 113524 10718 -76019 49808 86731 117054 81526 -86504 -119894 -112550 -94316 -80169
$$ packed form
14511A18305p6175j33135l8741P4167j8704J4796k978n7081M2196L9023R6511
14500E8184J13946J73893j12217j85695M3023n7258Q2997J22644K0541j22469
14490A37589n0397p0552m2406P2360J6105o2755q0391P5673J00526K3183j45832
14479b6897o1868L3627J86552M5134j19597o0046l019J7780r2103R8627J93753
14468B11943m7461l9721K83k00659j45639L9338J72231O1606l7458j28425K5515
14457h8447R7229R6587l6043j44513P8011q17j9772n7113j61704l6573n930P8925
14445b00160J26657P4397J77487M2415o2020q4225K9869P9364m4621m1250J5611
14434A13524j02806q6737J25827L6923L0323l5528j68030l3390P344J8234J4147
$$ plain form
14423 -80169 -85717 -96557 -88004 -125346 -44411 -20894 -63015 37015 115318 71869 55607 23554
14411 23554 55107 -4790 2100 165938 330131 270114 141307 75005 -13416 -49570 34111
14400 34111 45403 81688 150500 94512 108421 30134 -192796 -214198 -118510 -288550 -227994
14389 -227994 -11278 92090 240333 255686 278751 235557 108232 -92234 -34765 -29022 19799
14378 19799 98743 106887 69515 -77997 -17208 184214 308030 309008 184862 137024 29288
14367 29288 11234 21637 -19956 -36638 -184750 -277011 -62157 66043 131334 116057 194966
14356 194966 87377 -32245 8031 72594 94863 99544 41743 105571 91069 58185 6296
14345 6296 -47691 115964 159153 10153 -63190 -33237 34024 43067 10752 64113 15908 -58141
$$ packed form
14423h0169n548j0840Q553l7342Q0935K3517m2121J00030P8303m3449j6262l2053
14411B3554L1553n9897O890J63838J64193o0017j28807o6302q8421l6154Q3681
14400C4111J1292L6285O8812n5988J3909p8287k22930k1402R5688j70040O0556
14389b27994K16716J03368J48243J5353K3065m3194j27325k00466N7469N743M8821
14378A9799P8944Q144l7372j47512O0789K01422J23816R78j24146m7838j07736
14367B9288j8054J0403m1593j6682j48112r2261K14854J28200O5291j5277P8909
14356A94966j07589j19622M0276O4563K2269M681n7801O3828j4502l2884n1889
14345F296n3987J63655M3189j49000p3343K9953O7261R043l2315N3361m8205p4049
$$ plain form
14333 -58141 -177577 -346051 -324081 -218401 -188596 -225561 -106040 -79746 -158807 -53849 38158
14322 38158 13327 -67468 -65 -52368 -72024 -16406 54807 81776 80065 96741 -8585 147668
14310 147668 164377 27279 -45940 -237992 -312328 -263515 26855 30195 -76605 -120539 -144237
14299 -144237 -72317 -90515 -50537 -99576 -82169 -31886 -86751 -47345 -13553 -290877 -353323
14288 -353323 -142400 -3131 27327 47617 88244 68799 58360 79139 1441 48383 -23469
14277 -23469 -77000 -78294 -171670 -129748 -120971 -98790 -27035 -17210 -2740 106958 133779 178117
14265 178117 211312 198926 230058 142068 111485 70235 -37553 -55055 -21177 82950 132921
14254 132921 71586 89858 45242 -57810 -70501 -43136 -144512 -173291 -168082 27819 83747
$$ packed form
14333e8141j19436j68474K1970J05680K9805l6965J19521K6294p9061J04958R2007
14322C8158k4831q0795O7403n2303j9656N5618P1213K6969j711J6676j05326J56253
14310A47668J6709j37098p3219j92052p4336M8813K90370L340j06800m3934k3698
14299a44237P1920j8198L9978m9039J7407N0283n4865L9406L3792k77324o2446
14288c53323K10923J39269L0458K0290M0627j9445j0439K0779p7698M6942p1852
14277b3469n3531j294r3376M1922Q777K2181P1755R825J4470J09698K6821M4338
14265A78117L3195j2386L1132q7990l0583m1250j07788j7502L3878J04127M9971
14254A32921o1335J8272m4616j03052j2691K7365j01376k8779N209J95901N5928
$$ plain form
14243 83747 87726 71599 52440 -6217 2311 -60416 -73854 -103183 -73339 -11099 203515 99382
14231 99382 -97 -188682 -177685 -157930 -63194 -59707 -8282 -20867 27656 101352 209333
14220 209333 158920 217609 -5891 -220743 -206705 -156343 -159445 -30725 -24182 -37314 -23072
14209 -23072 -28025 -116006 -95300 -52210 -60399 -223713 -289111 -203153 -138490 -71823 -15906 -92426
14197 -92426 -191966 -161753 -120800 -35744 -98382 -93205 -57911 104904 159741 43918 52905 125003
14185 125003 -38014 -176629 -84377 29262 65587 8454 113274 179053 102614 27683 -63632
14174 -63632 -97108 -155003 -68239 -9245 -41997 75868 111222 -23606 -93859 -149201 -319973
14163 -319973 -269660 -168525 34935 31240 -31786 -113826 -44668 46019 68499 121582 221261
$$ packed form
14243H3747L979j6127j9159n8657Q528o2727j3438k9329K9844O2240K14614j04133
14231I9382r9479j88585J0997J9755R4736L487N1425j2585M8523P3696J07981
14220B09333n0413N8689k23500k14852J4038N0362l102J28720O543j3132J4242
14209b3072m953q7981K0706M3090q189j63314o5398Q5958O4663O6667N5917p6520
14197i2426r9540L0213M0953Q5056o2638N177L5294J62815N4837j15823Q987P2098
14185A25003j63017j38615R2252J13639L6325n7133J04820O5779p6439p4931r1315
14174f3632l3476n7895Q6764N8994l2752J17865L5354j34828p0253n5342j70772
14163c19973N0313J01135K03460l695o3026q2040O9158R0687K2480N3083R9679
$$ plain form
14152 221261 59040 -101423 -63625 -67443 2029 109889 131159 195246 244407 264505 290631
14141 290631 352401 199190 228621 168954 73723 -2872 42172 116965 189541 308311 335206
14130 335206 468415 377409 181134 170741 150419 136648 111036 85391 71725 118941 193821
14119 193821 313240 338008 306249 172640 176792 236981 296978 296404 192188 155337 171111
14108 171111 209452 124571 -84046 -10372 199072 228166 176898 268506 361666 293667 279378
14097 279378 333214 323489 110116 106961 124019 118271 53060 -36489 -32460 67580 136078 44172
14085 44172 -57272 -57475 32161 118863 81609 125357 102654 40490 18827 24517 51354 146532
14073 146532 216852 260512 203922 145728 209491 87424 5705 -35808 -67170 -59546 30592
$$ packed form
14152B21261j62221j60463L7798l818O9472J07860K1270O4087M9161K0098K6126
14141B90631O1770j53211K9431n9667r5231p6595M5044P4793P2576J18770K6895
14130C35206J33209r1006j96275j0393k0322j3771k5612k5645j3666M7216P4880
14119A93821J19419K4768l1759j33609M152O0189N9997n74j04216l6851J5774
14108A71111L8341q4881k08617P3674K09444K9094n1268R1608R3160o7999j4289
14097B79378N3836r725k13373l155J7058n748o5211q9549M029J00040O8498r1906
14085D4172j01444k03Q9636Q6702l7254M3748k2703o2164k1663N690K6837R5178
14073A46532P0320M3660n6590n8194O3763j22067q1719m1513l1362P624R0138
$$ plain form
14062 30592 90018 -41877 -90688 -492 -43764 -141198 -120836 -64181 -47257 -131655 -143243
14051 -143243 -81066 -164686 -187728 -156401 -55285 24928 35554 176331 220810 196160 67024
14040 67024 227807 260380 11967 32231 91388 9025 -59986 -110556 -100114 -69352 151373
14029 151373 196900 280917 291132 262403 269748 200896 172431 213625 216585 213131 132650 100363
14017 100363 130221 -8959 -60419 9088 32813 87935 142489 105063 28345 -91335 -43127
14006 -43127 41779 156066 94118 87210 97266 99291 90526 79015 69257 121998 99174 95117
13994 95117 98879 155429 40441 -108422 -136928 -140873 -68071 -47189 -87437 -232482 -208041
13983 -208041 -173292 -191803 -183038 -171552 -136132 -201132 -201347 -132594 -43982 24051 74311 52136
$$ packed form
14062C0592N9426j31895m8811R0196m3272r7434K0362N6655J6924q4398j1588
14051a43243O2177q3620k3042L1327J01116Q0213J0626J40777M4479k4650j29136
14040F7024J60783L2573k48413K0264N9157q2363o9011n0570J0442L0762K20725
14029A51373M5527Q4017J0215k8729P345o8852k8465M1194K960l454q0481l2287
14017A00363K9858j39180n1460O9507K3725N5122N4554l7426p6718j19680M8208
14006d3127Q4906J14287o1948o908J0056K025q765j1511r758N2741k2824m057
13994I5117L762N6550j14988j48863k8506l945P2802K0882m0248j45045K4441
13983b08041L4749j8511Q765J1486L5420o5000k15O8753Q8612O8033N0260k2175
$$ plain form
13971 52136 -54115 -111202 -38152 -120020 -145172 -119695 -172848 -339009 -286507 -149560 -25599
13960 -25599 117278 119409 175737 201436 87264 -7895 58315 102368 169260 166911 191220 198418
13948 198418 120489 163828 98632 45414 116572 258157 309878 188825 96997 133023 114990
13937 114990 121986 159704 127805 115720 309139 264929 239670 218800 195625 251523 335968
13926 335968 357074 306366 224453 158254 227426 99048 -91121 -84937 -73934 57662 -40907
13915 -40907 -53335 31305 101727 68982 5103 185363 289081 274494 199199 181571 160068
13904 160068 84373 140037 131833 186118 185360 168930 60575 53683 49209 24722 -84416 -62961
13892 -62961 18958 181115 294075 437466 314355 279139 270246 347782 217203 75007 37765
$$ packed form
13971E2136j06251n7087P3050q1868k5152K5477n3153j66161N2502J36947J23961
13960b5599J42877K131N6328K5699j14172r5159O6210M4053O6892k349K4309P198
13948A98418p7929M3339o5196n3218P1158J41585N1721j21053r1828L6026j8033
13937A14990O996L7718l1899j2085J93419m4210k5259k0870k3175N5898Q4445
13926C35968K1106n0708q1913o6199O9172j28378j90169O184J1003J31596r8569
13915d0907j2428Q4640P0422l2745o3879J80260J03718j4587p5295j7628k1503
13904A60068p5695N5664q204N4285p58j6430j08355o892m474k4487j09138K1455
13892f2961Q1919J62157J12960J43391j23111l5216q893P7536j30579j42196l7242
$$ plain form
13881 37765 233288 356864 286127 285252 238386 220569 189377 89840 16084 -52561 -98697 -19568
13869 -19568 117628 217413 151447 113523 269981 391713 324252 358656 288841 137091 142509
13858 142509 45842 -74560 -14541 81086 -6646 -134776 -203475 -69903 162741 261468 208527
13847 208527 232869 242251 272657 164881 83474 47446 83311 189696 214928 111785 17888
13836 17888 -13155 -26753 24892 -43590 -138726 -114470 -4815 31083 149884 88344 105363
13825 105363 187199 126253 77385 166321 89761 -18907 52256 260306 299718 267427 188735
13814 188735 96350 232677 297635 281554 217674 160789 170438 148353 186517 179836 244039 376517
13802 376517 237064 129056 269146 406469 365766 228963 208013 258339 285311 237232
$$ packed form
13881C7765J95523J23576p0737q75m6866j7817l1192r9537p3756o8645m6136P9129
13869a9568J37196R9785o5966l7924J56458J21732o7461L4404o9815j51750N418
13858A42509r6667j20402O0019R5627q7732j28130o8699J33572K32644R8727n2941
13847B08527K4342R382L0406j07776q1407l6028L5865J06385K5232j03143r3897
13836A7888l1043j3598N1645o8482r5136K4256J09655L5898J18801o1540J7019
13825A05363Q1836o0946m8868Q8936p6560j08668P1163K08050L9412l2291p8692
13814A88735r2385J36327O4958j6081o3880n6885R649k2085L8164o681O4203J32478
13802C76517j39453j08008J40090J37323m0703j36803k0950N0326K6972m8079
$$ plain form
13792 237232 174624 214232 279017 264837 202351 173342 115795 90121 -29419 -66495 57474
13781 57474 7358 28164 65894 136964 158578 185233 178402 222357 108575 -28264 -39915
13770 -39915 -27205 148617 305704 292605 209879 231138 355612 342931 311877 274671 168160
13759 168160 172991 305383 217456 181180 339494 396554 290388 241355 170506 312000 454672
13748 454672 484967 447685 414969 429684 539823 515774 625439 659164 588364 447852 547184
13737 547184 723373 801037 1024287 1263733 1322678 1355304 1641367 2074836 2462085 2884756
13727 2884756 3752153 5160986 6755022 8512512 10378805 12344365 14147070 15357570
13719 15357570 15946726 15588663 14624031 13298229 11822437 10253826 8878409 7795296
$$ packed form
13792B37232o2608L9608O4785j4180o2486k9009n7547k5674j19540l7076J23969
13781E7474n0116K0806L7730P1070K1614K6655o831M3955j13782j36839j1651
13770c9915J2710J75822J57087j3099q2726K1259J24474j2681l1054l7206j06511
13759A68160M831J32392q7927l6276J58314N7060j06166m9033p0849J41494J42672
13748D54672L0295l7282l2716J4715J10139k4049J09665L3725p0800j40512R9332
13737E47184J76189P7664K23250K39446N8945L2626K86063M33469L87249M22671
13727B884756Q67397J408833J594036J757490J866293J965560J802705J210500
13719A5357570N89156l58063r64632j325802j475792j568611j375417j083113
$$ plain form
13711 7795296 6889216 6120768 5615969 5420317 5521435 5857999 6365856 7212454 8524436
13702 8524436 10463431 13038084 16342946 20040257 23811976 27304379 30204082 32018187
13694 32018187 32244604 31038150 28745111 25565557 22093001 18790358 15796729 13507754
13686 13507754 11716931 10439253 9687691 9344485 9342166 9691243 10488335 11803452 13906606
13677 13906606 16837515 20788946 25726874 31516842 37447276 42729030 46831322 49152640
13669 49152640 49171625 47018932 43108635 38060445 32530899 27442037 23037652 19561253
13661 19561253 16868117 14998528 13962493 13460201 13461322 14053007 15205946 17245741 20444734
13652 20444734 24865203 30619605 37356733 44926416 52599401 59380301 64105301 65985054
$$ packed form
13711G795296r06080p68448n04799j95652J01118L36564N07857Q46598J311982
13702H524436J938995K574653L304862L697311L771719L492403K899703J814105
13694C2018187K26417j206454k293039l179554l472556l302643k993629k288975
13686A3507754j790823j277678p51562l43206k319L49077P97092J315117K103154
13677A3906606K930909L951431M937928N789968N930434N281754M102292K321318
13669D9152640J8985k152693l910297n048190n529546n088862m404385l476399
13661A9561253k693136j869589j036035n02292J121N91685J152939K039795L198993
13652B0444734M420469N754402O737128P569683P672985O780900M725000J879753
$$ plain form
13644 65985054 64798344 61062316 55170573 47859062 40265691 33455308 27662148 23013957
13636 23013957 19704520 17366853 15737337 14617848 14146477 14257260 14929119 16452622
13628 16452622 18716643 21968517 26339080 31602518 37280659 42855800 47429762 50404752
13620 50404752 51326458 49869813 46301485 41274649 35580463 29878957 24766256 20503429
13612 20503429 17100377 14622540 12790465 11502738 10826624 10468366 10538610 11073834 11941279
13603 11941279 13460333 15762839 18904015 22468624 26339661 29954602 32892137 34586805
13595 34586805 34876056 33541938 30913985 27567738 23685615 19805547 16330030 13397217
13587 13397217 11231502 9808046 8745869 7902734 7233796 6887618 6913156 7120169 7594133
$$ packed form
13644F5985054j186710l736028n891743p311511p593371o810383n793160m648191
13636B3013957l309437k337667j629516j119489m71371J10783O71859J523503
13628A6452622K264021L251874M370563N263438N678141N575141M573962K974990
13620E0404752R21706j456645l568328n026836n694186n701506n112701m262827
13612B0503429l403052k477837j832075j287727o76114l58258P0244N35224Q67445
13603A1941279J519054K302506L141176L564609L871037L614941K937535J694668
13595C4586805K89251j334118k627953l346247l882123l880068l475517k932813
13587A3397217k165715j423456j062177q43135o68938l46178K5538K07013M73964
$$ plain form
13578 7594133 8479923 9595607 11105171 12832182 14699508 16391363 17437666 17823775
13570 17823775 17559051 16656527 15117440 13228771 11139056 9173821 7667904 6290676
13562 6290676 5147991 4399107 3942295 3530191 3243585 2947100 2620625 2317092 2119765
13553 2119765 1851716 1566741 1383081 1393042 1316332 1256712 1236303 1183416 1010874 1011447 1084760
13542 1084760 960796 808184 762327 861589 805728 875943 822865 762715 725931 597957 637094
13531 637094 730719 821338 775310 655707 647926 713037 573374 449349 499431 483884 358331
13520 358331 345406 342904 356921 460950 514994 494360 594293 635537 559982 503491 439981
13509 439981 501059 559232 510835 436281 385412 334781 367409 457934 528029 483268 531202
$$ packed form
13578G594133Q85790J115684J509564J727011J867326J691855J046303L86109
13570A7823775k64724r02524j539087j888669k089715j965235j505917j377228
13562F290676j142685p48884m56812m12104k86606k96485l26475l03533j97327
13553B119765k68049k84975j83660R961p6710n9620k0409n2887j72542N73P3313
13542A084760j23964j52612m5857R9262n5861P0215n3078o0150l6784j27974L9137
13531F37094R3625R0619m6028j19603p781O5111j39663j24025N0082j5547j25553
13520C58331j2925k502J4017J04029N4044k0634R9933M1244p5555n6491o3510
13509D39981O1078N8173m8397p4554n0869n0631L2628R0525P0095m4761M7934
$$ plain form
13498 531202 341855 160323 161142 98564 158742 102676 102124 155700 246058 369377 433873 433826
13486 433826 263974 144058 15314 -55949 -9633 36577 189332 227278 241345 273500 179058
13475 179058 116722 206174 193374 149402 53503 -3868 95814 42386 -47580 -48735 -50915 99191
13463 99191 207680 145880 133729 123597 248906 259709 387280 406582 354488 336937 291585
13452 291585 191178 54108 58750 118476 56083 -23053 -104594 -108413 -24530 -50702 -52198 60417
13440 60417 114162 70215 126476 136447 294022 247843 149200 70441 47965 105509 105726 100562
13428 100562 77073 48390 50223 129730 270044 218369 265580 300674 338407 463700 446653
13417 446653 600734 483554 410794 442270 400249 295301 126978 110120 216355 92448
$$ packed form
13498E31202j89347j81532Q19o2578O0178n6066n52N3576R0358J23319O4496m7
13486D33826j69852j19916j28744p1263M6316M6210J52755L7946J4067L2155r4442
13475A79058o2336Q9452j2800m3972r5899n7371R9682n3428q9966j155k180J50106
13463I9191J08489o1800j2151j0132J25309J0803J27571J9302n2094j7551m5352
13452B91585j00407j37070M642N9726o2393p9136q1541l819Q3883k6172j496J12615
13440F0417N3745m3947N6261R971J57575m6179r8643p8759k2476N7544K17n164
13428A00562k3489k8683J833P9507J40314n1675M7211L5094L7733J25293j7047
13417D46653J54081j17180p2760L1476m2021j04948j68323j6858J06235j23907
$$ plain form
13407 92448 68686 12822 66309 127628 98336 15299 -30170 101570 215338 194512 170409
13396 170409 216600 208628 132770 81412 260365 354907 340922 286070 316228 435410 546850
13385 546850 515471 402446 441610 490161 349298 168129 157161 156934 189119 118993 153670
13374 153670 96789 95616 90977 86277 -1837 -16177 7373 174152 213037 213052 236203 209421
13362 209421 199735 294925 287615 355625 383055 378223 330921 347322 410341 340745 313749 332268
13350 332268 390921 382918 450669 625158 659873 635407 564059 489031 262008 169562 237486
13339 237486 215959 176719 255310 337198 415882 348895 216996 160034 177553 153143 114297
13328 114297 88973 103817 195431 251980 341963 313889 305087 332453 421149 501187 443011 419290
$$ packed form
13407I2448k3762n5864N3487O1319k9292q3037m5469J31740J13768k0826k4103
13396A70409M6191p972p5858n1358J78953R4542j3985n4852L0158J19182J11440
13385E46850l1379j13025L9164M8551j40863j81169j0968k27L2185p0126L4677
13374A53670n6881j173m639m700q8114j4340K3550J66779L8885J5K3151k6782
13362B09421r686R5190p310O8010K7430m832m7302J6401O3019o9596k6996J8519
13350C32268N8653q003O7751J74489L4715k4466p1348p5028k27023r2446O7924
13339B37486k1527l9240P8591Q1888P8684o6987j31899n6962J7519k4410l8846
13328A14297k5324J4844R1614N6549Q9983k8074q802K7366Q8696Q0038n8176k3721
$$ plain form
13316 419290 375486 223477 184178 286309 354091 272227 195650 233807 300166 291741 411686
13305 411686 387554 339895 341155 389724 359051 355084 326492 229758 155634 119573 53144 26555
13293 26555 42790 105275 187091 208505 136722 317802 474351 494829 489413 467133 437814
$$ packed form
13316D19290m3804j52009l9299J02131O7782q1864p6577L8157O6359q425J19945
13305D11686k4132m7659J260M8569l0673l967k8592r6734p4124l6061o6429k6589
13293B6555J6235O2485Q1816K1414p1783J81080J56549K0478n416k2280k9319
$$ [...]
##END NTUPLES=NMR SPECTRUM
##END=
