##TITLE=Analysis number 326475
Compound Code cc 52413
Book Reference 464/98/4
Project Code adrs
Chemist Name chrisr
##JCAMPDX= 6.0         $$ Bruker NMR JCAMP-DX V2.0
##DATA TYPE= NMR SPECTRUM
##DATA CLASS= NTUPLES
##ORIGIN= Bruker BioSpin GmbH
##OWNER= nmr
$$ XWIN-NMR		Version 3.5
$$ Wed Feb  7 13:44:18 2007 GMT Standard Time (UT+0h)  MAYBRIDGE\nmr@NMR_250MHZ
##.OBSERVE FREQUENCY= 250.131544655141
##.OBSERVE NUCLEUS= ^1H
##.ACQUISITION MODE= SIMULTANEOUS (DQD)
##.ACQUISITION SCHEME= undefined
##.AVERAGES= 16
##.DIGITISER RES= 18
##SPECTROMETER/DATA SYSTEM= dpx250
##.PULSE SEQUENCE= zg30
##.SOLVENT NAME= CDCl3
##.SHIFT REFERENCE= (INTERNAL, CDCl3, 0, 16.522)
##AUDIT TRAIL= $$ (NUMBER, WHEN, WHO, WHERE, WHAT)
$$ ##TITLE= Audit trail, XWIN-NMR		Version 3.5
$$ ##JCAMPDX= 5.01
$$ ##ORIGIN= Bruker BioSpin GmbH
$$ ##OWNER= nmr
$$ C:\u/data/dgb/nmr/ADRS/410/pdata/1/auditp.txt
$$ ##AUDIT TRAIL=  $$ (NUMBER, WHEN, WHO, WHERE, WHAT)
(   1,<2007-02-07 13:43:33.29 +000>,<MAYBRIDGE\nmr>,<NMR_250MHZ>,
      <created by zg, POWCHK disabled, PULCHK disabled
       configuration hash MD5:
       49 4B E0 1D 92 C2 6B 37 9F E6 65 BC 52 41 86 1D
       data hash MD5: 64K
       38 F0 85 7E 9E D9 0C 68 8A E8 12 91 13 E9 CF 95>)
(   2,<2007-02-07 13:43:56.61 +000>,<MAYBRIDGE\nmr>,<NMR_250MHZ>,
      <Start of raw data processing
       ef LB = 0.3 FT_mod = 6 PKNL = 1 SI = 32K 
       data hash MD5: 32K
       5E 4D 3B 91 4A 4A 84 8B B5 84 E1 6E 90 F6 36 30>)
(   3,<2007-02-07 13:44:01.37 +000>,<MAYBRIDGE\nmr>,<NMR_250MHZ>,
      <apk 
       data hash MD5: 32K
       53 53 8A B7 B5 FA 9C 25 26 8B FB 72 E6 F2 A9 DB>)
(   4,<2007-02-07 13:44:02.95 +000>,<MAYBRIDGE\nmr>,<NMR_250MHZ>,
      <abs ABSG = 5 
       data hash MD5: 32K
       6C 6E D4 F1 35 0A AD CF E8 7B DC 1E 8A B2 00 8D>)
$$ ##END=
$$ 
$$ hash MD5
$$ B3 6C 73 F5 5F 4A 4D 49 A4 C4 4A 27 C4 5B BC 55
##$RELAX= 
##$RELAX= 
##$RELAX= 
##$RELAX= 
##$RELAX= 
##$RELAX= 
##$RELAX= 
$$ Bruker specific parameters
$$ --------------------------
##$DU= <C:\u>
##$EXPNO= 410
##$NAME= <ADRS>
##$PROCNO= 1
##$TYPE= <nmr>
##$USER= <dgb>
##$AMP= (0..31)
100 100 100 100 100 100 100 100 100 100 100 100 100 100 100 100 100 100 
100 100 100 100 100 100 100 100 100 100 100 100 100 100 
##$AQSEQ= 0
##$AQ_mod= 3
##$AUNM= <au_zg>
##$AUTOPOS= <57 >
##$BF1= 250.13
##$BF2= 250.13
##$BF3= 250.13
##$BF4= 250.13
##$BF5= 500.13
##$BF6= 500.13
##$BF7= 500.13
##$BF8= 500.13
##$BYTORDA= 1
##$CFDGTYP= 0
##$CFRGTYP= 5
##$CHEMSTR= <none>
##$CNST= (0..31)
1 1 145 1 1 1 1 1 1 1 1 1 1 1 1 1 1 1 1 1 1 1 1 1 1 1 1 1 1 1 1 1 
##$CPDPRG= <>
##$CPDPRG1= <>
##$CPDPRG2= <>
##$CPDPRG3= <>
##$CPDPRG4= <mlev>
##$CPDPRG5= <mlev>
##$CPDPRG6= <mlev>
##$CPDPRG7= <mlev>
##$CPDPRG8= <mlev>
##$CPDPRGB= <>
##$CPDPRGT= <>
##$D= (0..31)
0 1 0 0 0 0 0 0 0 0.06 0 0 0 0 0 0 0.0002 0 0 0 0 0 0 0 0 0 0 0 0 0 0 
0 
##$DATE= 1170855806
##$DBL= (0..7)
120 120 120 120 120 120 120 120 
##$DBP= (0..7)
150 150 150 150 150 150 150 150 
##$DBP07= 0
##$DBPNAM0= <>
##$DBPNAM1= <>
$$ [...]
##$SUBNAM7= <"">
##$SUBNAM8= <"">
##$SUBNAM9= <"">
##$SW= 20.6930455092707
##$SWIBOX= (0..15)
0 0 3 0 0 0 0 0 0 0 0 0 0 0 0 0 
##$SW_h= 5175.983436853
##$TD= 65536
##$TD0= 1
##$TE= 294.16
##$TE2= 300
##$TE3= 300
##$TEG= 300
##$TL= (0..7)
0 120 120 120 120 120 120 120 
##$TP= (0..7)
150 150 150 150 150 150 150 150 
##$TP07= 0
##$TPNAME0= <>
##$TPNAME1= <>
##$TPNAME2= <>
##$TPNAME3= <>
##$TPNAME4= <>
##$TPNAME5= <>
##$TPNAME6= <>
##$TPNAME7= <>
##$TPOAL= (0..7)
0.5 0.5 0.5 0.5 0.5 0.5 0.5 0.5 
##$TPOFFS= (0..7)
0 0 0 0 0 0 0 0 
##$TUNHIN= 0
##$TUNHOUT= 0
##$TUNXOUT= 0
##$USERA1= <user>
##$USERA2= <user>
##$USERA3= <user>
##$USERA4= <user>
##$USERA5= <user>
##$V9= 5
##$VALIST= <valist>
##$VCLIST= <CCCCCCCCCCCCCCC>
##$VD= 0
##$VDLIST= <DDDDDDDDDDDDDDD>
##$VPLIST= <PPPPPPPPPPPPPPP>
##$VTLIST= <TTTTTTTTTTTTTTT>
##$WBST= 1024
##$WBSW= 4
##$XGAIN= (0..3)
0 0 0 0 
##$XL= 0
##$YL= 0
##$YMAX_a= 377685
##$YMIN_a= -427587
##$ZGOPTNS= <>
##$ZL1= 120
##$ZL2= 120
##$ZL3= 120
##$ZL4= 120
##$ABSF1= 16.522
##$ABSF2= -4.171173
##$ABSG= 5
##$ABSL= 3
##$ALPHA= 0
##$AQORDER= 0
##$ASSFAC= 0
##$ASSFACI= 0
##$ASSFACX= 0
##$ASSWID= 0
##$AUNMP= <proc_1d>
##$AZFE= 0.1
##$AZFW= 0.1
##$BCFW= 0
##$BC_mod= 0
##$BYTORDP= 0
##$COROFFS= 0
##$CY= 12.5
##$DATMOD= 1
##$DC= 0
##$DFILT= <>
##$DTYPP= 0
##$F1P= 14.0000005364418
##$F2P= -0.99999901652339
##$FCOR= 0.5
##$FTSIZE= 32768
##$FT_mod= 6
##$GAMMA= 0
##$GB= 0
##$INTBC= 1
##$INTSCL= 1
##$ISEN= 128
##$LB= 0.3
##$LEV0= 0
##$LPBIN= 0
##$MAXI= 10000
##$MC2= 0
##$MEAN= 0
##$ME_mod= 0
##$MI= 0
##$NCOEF= 0
##$NC_proc= -5
##$NLEV= 6
##$NOISF1= 0
##$NOISF2= 0
##$NSP= 0
##$NTH_PI= 0
##$NZP= 0
##$OFFSET= 16.522
##$PC= 1
##$PHC0= 230.5264
##$PHC1= 6.225764
##$PH_mod= 1
##$PKNL= yes
##$PPARMOD= 0
##$PSCAL= 4
##$PSIGN= 0
##$REVERSE= no
##$SF= 250.13
##$SI= 32768
##$SIGF1= 0
##$SIGF2= 0
##$SINO= 400
##$SIOLD= 32768
##$SREGLST= <1H.CDCl3>
##$SSB= 0
##$STSI= 32768
##$STSR= 0
##$SW_p= 5175.98343685301
##$SYMM= 0
##$S_DEV= 0
##$TDeff= 65536
##$TDoff= 0
##$TI= <Analysis number 999999
Compound Code 99
Book Reference 9
Project Code 9>
##$TILT= no
##$TM1= 0
##$TM2= 0
##$TOPLEV= 0
##$USERP1= <user>
##$USERP2= <user>
##$USERP3= <user>
##$USERP4= <user>
##$USERP5= <user>
##$WDW= 1
##$XDIM= 32768
##$YMAX_p= 561688080
##$YMIN_p= -337495
$$ End of Bruker specific parameters
$$ ---------------------------------
##NTUPLES= NMR SPECTRUM
##VAR_NAME=  FREQUENCY,     SPECTRUM/REAL,   SPECTRUM/IMAG
##SYMBOL=    X,             R,               I
##VAR_TYPE=  INDEPENDENT,   DEPENDENT,       DEPENDENT
##VAR_FORM=  AFFN,          ASDF,            ASDF
##VAR_DIM=   32768,         32768,           32768
##UNITS=     HZ,            ARBITRARY UNITS, ARBITRARY UNITS
##FACTOR=    0.157963299565203, 1,           1
##FIRST=     4132.6476996994, 0,             0
##LAST=      -1043.33573715361, 0,           0
##MIN=       -1043.33573715361, -337495,     0
##MAX=       4132.6476996994, 561688080,     0
$$ Real data points
##PAGE= N=1
##DATA TABLE= (X++(R..R)), XYDATA
$$ [...]
22202 -93903 -56125 -73039 -87414 -119724 -69523 -19044 -19612 -51528 -40145 41791 24670 -2123
22190 -2123 66586 141052 201413 161903 16491 -108834 -142663 -123599 -72199 -17109 10122
22179 10122 16679 -17095 3470 -10684 -64406 8252 33219 29630 35422 36594 -24953 -42659
22167 -42659 -5818 -64117 -16641 -26733 -32078 40652 101473 143906 101338 67976 41675 2128
22155 2128 -118933 -168869 -154141 -95458 -82404 -50543 -94880 -85605 -60647 -39540 -42562 -45214
22143 -45214 -54962 -93320 -16955 -35768 -52047 -60015 -99732 -88975 -61242 -75862 -47769 -67469
22131 -67469 -107778 -76660 -39942 40880 79470 67762 100365 54911 -1090 50048 96248 65538
22119 65538 93685 64522 66449 4969 14688 139620 106868 27449 7197 -43870 -59231 -29371
22107 -29371 -95760 -124830 -120965 -116297 -65164 -14474 -4783 -45885 -88070 -75069 -77486 -66661
22095 -66661 -132543 -151744 -65700 1159 11609 15895 -3248 -6028 -14862 21457 38995 10458
22083 10458 -24795 13536 39028 38039 17794 -21851 -29588 14626 22335 -27022 26267 84361
22071 84361 90381 53408 89105 115710 123623 83894 -33960 -49828 26003 70300 49772 -38011
22059 -38011 -45768 -41101 3404 36787 47014 16471 -58998 -125744 -105956 -62398 -11113 16799
22047 16799 -9537 -32759 -8788 47738 70587 66580 32248 29392 -3197 -39292 -8478 70929
22035 70929 59167 -465 -27189 43744 27111 14222 -37730 -96879 -134099 -164580 -157865 -85143
22023 -85143 -52540 9350 -17528 -52751 -42535 32260 57862 108783 143003 133586 143552 54555
22011 54555 -20183 -64224 -27071 26958 -1568 -14568 -7021 -17480 45536 80561 6379 -54129
21999 -54129 -55586 -14700 7777 -57581 -83375 -54430 32535 26540 44490 -4894 -50051 -33688
21987 -33688 -35315 -43028 3823 10159 -126168 -80866 -61462 -24599 -30166 -51612 -45167 -14762
21975 -14762 -19022 -1632 -4573 -30327 -37049 -76245 -200446 -244104 -175311 -74145 -73530 -39773
21963 -39773 -36739 -61077 -99321 -101380 -11417 51464 -11431 -31074 9211 -3986 -39964 -40431
21951 -40431 -42782 -53308 -61139 -78230 -57209 41412 47974 -4067 -10550 -52094 -24897 60011
21939 60011 69101 49479 49172 51374 2100 -52989 -102458 -143604 -145775 -195143 -190721 -212497 -151699
21926 -151699 -97232 -113588 -76338 -31286 -21017 -132100 -199613 -99694 -16922 -31324 -43857
21915 -43857 -75409 -64561 -60818 -33929 -11528 -35602 -13130 4347 -11648 -20758 -17494 43295
21903 43295 75094 103968 10330 -41245 25670 82395 113498 123377 29313 28786 68932 93570
21891 93570 118674 9499 -27139 -75823 -59164 39961 51194 14660 -12639 -16538 -10500 23683
21879 23683 -14588 -49914 35340 72544 65097 51844 -8202 3130 19055 -22325 -32790 -21597
21867 -21597 32414 18500 -9856 -35730 -35135 40183 91450 69473 14298 -39788 24009 52087
21855 52087 53449 44176 16414 24632 38289 61302 22685 -53158 -133928 -133972 -95067 -11279 41396
21842 41396 60091 41594 -14378 -78828 -106064 -137727 -89206 -31971 -48925 -7197 -49478 -85539
21830 -85539 -64560 11634 -18817 4617 -433 -54229 -130635 -66425 -22302 2638 107609 136912
21818 136912 76130 -60756 -88500 -136754 -102956 -66506 -31494 13577 40654 102653 98991
21807 98991 47527 -65319 -151332 -108584 42506 80953 -18727 -133213 -61401 -37763 -15871
21796 -15871 -103459 -33455 -16318 -16143 -3106 -1702 -17707 -90093 -76411 -42231 29160 4606
21784 4606 16499 78870 73530 56985 98971 99410 78279 40838 -24515 -55681 -68651 -83525
21772 -83525 -87549 -5616 23451 47605 74105 24428 -30839 -31655 -15049 59869 99856 101079
21760 101079 9262 -27268 9956 -8940 19524 89530 43181 7281 12484 -37040 -50980 -41262
21748 -41262 -28304 15537 38734 -2054 4977 -7965 -51775 -39660 -746 -25937 58174 44337
21736 44337 -248 -21860 38331 111488 120732 117311 101843 100706 132923 203926 133612 9830
21724 9830 -57752 -98992 -50664 69209 -11084 -58320 -110194 -150357 -172554 -53392 -57673 -9440
21712 -9440 35260 108530 75548 54246 -17004 -19884 83863 119503 145206 170568 135696 135944
21700 135944 127593 45082 -41365 -6684 2877 -257 39254 6571 -103912 -145940 -101978 -33101
21688 -33101 29881 59022 46501 40102 14921 5514 -31569 -407 -13027 -4933 -48242 -47777 -67612
21675 -67612 -96899 -46248 -47872 -95422 -188960 -206748 -125072 -73496 1298 44305 105291 93819
21663 93819 14541 -100184 -94608 -99746 -89809 -45694 -55656 -158543 -130188 -118731 -90764 -120993
21651 -120993 -99953 -10019 10195 -713 -14251 -10954 -36179 -2748 17426 40941 41212 -22537
21639 -22537 -44363 -53470 49054 -641 2048 74497 113634 146172 104863 18791 -41952 -39560
21627 -39560 -56475 -45645 -81427 -75757 12556 78442 153743 225342 203385 154156 69754 -25511
21615 -25511 89175 58100 10625 60330 20695 -76364 -86181 -73443 -76795 -61455 -57162 -99729
21603 -99729 -93423 -32578 -36604 46331 97136 57351 -34514 -58244 -69899 -51706 -69192 -91655
21591 -91655 -124552 -104099 -109974 -115200 -105125 -76271 -104011 -127827 -92867 -89983 -74827 -48386
21579 -48386 -8476 18860 40210 14889 17343 -11646 -26487 -95470 -67852 -19110 1179 20289
21567 20289 57888 87267 49001 19576 -45291 -19786 40689 101681 102845 26589 13990 32116
21555 32116 85922 71877 67425 20489 12274 -8116 -20616 -5780 -2398 -9626 -10256 -54 11753
21542 11753 21569 32081 15444 55609 84337 113292 132613 92411 17369 17981 2556 20564
21530 20564 -158 -21506 -1629 -18807 -5125 -76687 -26482 -28705 -80736 -48139 -54465 -60479
21518 -60479 -54849 -42214 -42011 -47148 -28633 -65297 -88200 -126948 -103385 -10008 68211 101035
21506 101035 41878 -61915 -98821 -54871 93876 119407 27342 18905 57124 58891 29824
21495 29824 53993 33385 -57876 -116497 -121471 -77487 -70647 -41482 -103455 -16399 14848 -9684
21483 -9684 13906 -23770 -4930 48964 11517 29997 27826 9311 -22447 -39364 -31506 40079
21471 40079 -24083 -60249 -75284 -54998 -130597 -180908 -195160 -156916 -49726 -16512 4644
21460 4644 42029 78527 59060 154583 124400 20448 29714 35459 39004 37326 9341 38969
21448 38969 60542 72952 17652 9843 -27424 -34578 -81173 -40698 -43611 -58733 -65107 -25647
21436 -25647 -9014 -36179 -106609 -122140 -40505 -17671 -74515 -114227 13410 76423 11499
21425 11499 -72309 -44563 -30814 8388 -61534 -128549 -42457 23280 32772 47476 52485 -30761
21413 -30761 -119503 -115024 15420 -33541 -144027 -125719 -26267 -36234 -40430 -54843 -38983 -35001
21401 -35001 -17727 -52362 -22831 36122 21387 -761 2449 -68731 -91096 -46641 -35188 -20086
21389 -20086 3176 -36288 -84130 -37238 7493 54278 -12370 -18826 48205 12563 -92995 -112475
21377 -112475 -85420 -78149 -38059 -65048 -49738 -45858 -73737 -48492 -10810 11750 19715 -35095
21365 -35095 -43877 -54109 -2417 -27507 -84622 -52448 -20254 20075 15697 4681 25625 44519
21353 44519 29536 89298 111138 18463 -37061 -20913 16735 19414 40984 -29598 -89708 -38962
21341 -38962 -37966 -57051 -11803 32798 12653 -19678 -27611 -42868 2930 -4860 -58824 -123692
21329 -123692 -179254 -144809 -79752 -64822 -49276 -7231 6011 -16171 -62238 -32178 38744
21318 38744 50491 31560 12871 17379 -26916 -111222 -117768 -82166 -72058 21747 42530 39775
21306 39775 20139 38484 23812 -33680 -4294 30213 -24004 15041 54955 31370 4215 36
21294 36 42743 79113 -15936 -110580 -98850 -86117 2415 3844 -8673 -4417 -50116 -65338 42869
21281 42869 72534 -21761 -136812 -127636 -67397 -70458 -97748 -32527 67971 51694 -1098 -4379
21269 -4379 -43594 -94701 -79610 -22042 20810 70075 103001 22752 -37757 -31475 -10158 5268
21257 5268 -49178 18615 76144 -2457 -123545 -85779 -24433 3242 5921 -67355 -9706 39429
21245 39429 -28718 -20513 -36909 -36787 -21223 -42851 -57573 4517 -14331 -23493 -86986 -127550
21233 -127550 -180192 -121571 -51351 -38268 -31771 45706 22026 -29745 -11944 -57648 25467 82774
21221 82774 44757 33201 30789 -31969 -93448 -156901 -149866 -109378 27738 55000 -4739 -34151
21209 -34151 23183 -6022 -3636 -24813 -61059 -76232 -17279 35984 52907 65903 -43042 2076
21197 2076 11480 43343 -11310 -30697 -45084 -36532 -34453 -46682 -73082 -55324 -75757 -88019
21185 -88019 -87051 -127107 -122423 -101558 -116549 -81301 -21905 30150 37567 -18094 -73252 -51639
21173 -51639 31661 87836 69330 -4423 -47869 6993 -39678 -47665 -41524 -48636 -61085 -58141
21161 -58141 -60967 -111751 -104201 -154274 -134779 -131647 -208463 -161240 -121457 -108411 -16898 5248
21149 5248 -19042 -85831 -99164 -75751 25709 71140 63671 29245 -34746 -64248 -51589 -80486
21137 -80486 -42711 65235 60633 45828 -35879 5308 44146 -5682 31807 64271 45985 53032
21125 53032 40183 -82762 -207288 -167308 -122160 -33139 10655 18739 32141 32891 -44189 -62632
21113 -62632 -45006 -30612 -19407 -13838 -8393 -45056 7963 21528 13782 -9306 21284 -21027
21101 -21027 -48313 -14093 -11113 -27053 23272 -43826 -70901 -81220 -126538 -92225 -124502 -93815
21089 -93815 -133642 -172965 -120468 -107765 -72848 -35209 31523 73628 1030 -104870 -138173
21078 -138173 -103913 -28968 -58335 -32678 -83106 -67671 -59831 -65283 -104778 -86297 -29117 41910
21066 41910 18195 28112 45182 112343 175437 146420 139847 133446 83184 6938 18607 -17325
21054 -17325 -41235 -39119 -122134 -165060 -192426 -158598 -188303 -146028 -74111 -14740 10576 58894
21042 58894 31073 -17280 -26642 -39506 3461 35151 51017 -22940 -88537 2423 39121 68843
21030 68843 30681 10922 19932 18290 -46251 -86761 -62285 -33155 -10729 5792 -46189 -42306
21018 -42306 -35183 6093 -14788 -794 36041 -9308 20339 48744 26313 -21856 -79025 -88879
21006 -88879 -7619 -39224 -97312 -87674 -68781 -73414 -17812 -57815 -179076 -178691 -136205 -93693
20994 -93693 -36177 -38226 -67603 -8003 -74556 -144163 -53038 47127 22451 -18636 -2178 -24035
20982 -24035 -5830 141623 201903 154455 61178 4468 -10890 -36026 18559 31286 4514
20971 4514 33614 45080 28317 25079 18641 -53898 -90472 -89574 -142264 -187501 -93917 8055
20959 8055 55090 109848 66107 83599 83951 -6319 -45147 -81969 -76979 -16970 34375 20077
20947 20077 39363 11035 -48570 -10362 41663 9898 17337 10125 -51348 -123895 -271388 -302588
20935 -302588 -234340 -167929 -134766 -108440 -86746 -40145 49162 149768 208256 193047 169217
20924 169217 104192 -19404 2756 43535 59443 61795 34346 35547 92062 49666 -2038 -24878
20912 -24878 5814 18414 38787 22456 -21283 -61072 -99924 -89507 18930 8890 -46396
20901 -46396 -7966 55772 15008 28872 80117 113016 118226 47210 1288 -51137 -35867 35406
20889 35406 31369 27437 158912 154340 36017 -5794 -57073 -34187 18259 50643 43230 142
20877 142 -6793 49041 25211 -6696 29211 9824 -63213 -83326 -49352 -10248 12938 1479
20865 1479 46068 30509 -111128 -105243 -56653 -45410 10513 53339 36001 12700 20377 -43029
20853 -43029 -144817 -113198 -54890 75120 64257 4691 47933 65400 10631 -6406 25393
20842 25393 49819 -12534 14385 5177 -16952 -23509 -4413 -74492 -108500 -176094 -229853 -127331
20830 -127331 -57007 -92414 -142684 -102487 -31245 -6378 -68000 -70695 -22869 -22098 -12506 30169
20818 30169 105959 112810 99452 59189 20662 26271 42732 32539 70900 61136 117409 139173
20806 139173 79498 118618 101209 21461 -4845 -43315 -30736 -27745 -2875 61460 18854 114880
20794 114880 88977 -43509 -59729 -10391 -960 -44465 -2788 -20471 -5811 25144 -10040
20783 -10040 25884 48203 52212 89878 17022 -93975 2266 72228 40869 17086 -22386 -99798
20771 -99798 -88128 -36545 -82318 -59265 -38323 31463 89321 38321 -19931 -7445 19762 14931
20759 14931 14149 35679 71067 90754 113099 47965 -25924 -25919 8332 75719 107784 33645 12942
20746 12942 44863 55684 30704 4469 -74632 -111065 -60488 -43811 -84667 -54923 -88664 -60226
20734 -60226 -54071 -91342 -53886 -35309 -156311 -231621 -262154 -227909 -261157 -200410 -159311 -155812
20722 -155812 -148194 -75871 -35741 -138293 -149142 -85303 -95662 -103544 -58729 15754 -17111 -25378
20710 -25378 -44456 -73436 -45317 13153 -38540 -39439 -65271 -45791 -3906 49835 58071 74602
20698 74602 106264 96605 121604 129120 10057 -40369 -47977 -56263 -111214 -78269 -51262 -47654
20686 -47654 -20548 -22954 -47777 -57270 -66703 -82143 -104400 -102137 -77474 -130884 -116794 -69220
20674 -69220 -47654 12416 10128 23971 -38781 -62347 -5086 30595 38925 110139 -2779 -69710
20662 -69710 -25047 -34665 -9651 -35540 -37843 -56837 -26379 -45045 -156034 -193719 -205607 -243016
20650 -243016 -163093 -64862 -60404 -91890 -65996 16556 45207 2181 -101561 -83643 38284
20639 38284 24239 -14383 -13310 40071 27670 32199 5097 32343 31749 45448 21232 -27118
20627 -27118 55197 114872 82743 51971 34081 -22057 -878 -25971 -16393 6302 29513 1355
20615 1355 -464 -4841 -5672 9542 -60221 -79483 -9734 27876 -7744 -96354 -40089 52048 28847
20602 28847 51812 -12169 -63919 -27704 3862 -13946 -51570 -55620 -81892 -99969 -95031 -72915
20590 -72915 -36555 24650 17622 -32330 -88692 -67072 -64560 -100342 -102691 -2813 -20502 -11331
20578 -11331 -65734 -7280 40338 5166 -22113 -73414 -152758 -137403 -42547 -23125 -40352 -54498
20566 -54498 -49411 -13361 42336 6549 -27583 -28595 10278 -14300 -113235 -66514 -47833 16979
20554 16979 100826 63181 -31226 -53860 26596 120394 82247 624 -106656 -120289 -79348
20543 -79348 23616 74815 41189 46259 33980 3645 8894 17496 22417 65983 16566 28268
20531 28268 41229 -1102 11008 -27615 5511 50669 40005 -31755 -24895 -52993 -47472 -19035
20519 -19035 -9495 46676 1235 -42924 -83094 12062 -9727 33266 52386 -36050 -38883 29252
20507 29252 55711 -3584 -12843 14610 26108 25413 -67393 -185295 -199051 -115193 -84696 16642
20495 16642 59889 -38476 -68160 -53074 -123763 -241325 -231708 -173788 -96190 -13470 26350 8943
20483 8943 42973 32289 40548 27011 65230 101118 90450 112226 85703 -44659 -144671 -149765
20471 -149765 -84906 -28074 -32066 -68958 -98221 -58710 -52969 27733 31499 -47503 -77075 -80311
20459 -80311 -109210 -124816 -80097 -115736 -102615 -33146 -61225 -87664 -81504 -41823 34254 88579
20447 88579 93938 123040 93574 96430 69559 38324 70598 117599 41707 -31241 22726 55240
20435 55240 -4428 -78235 -27715 28831 -11857 -15285 -7889 11946 18806 -23628 46530 35348
20423 35348 25478 6746 32680 6759 -40375 -113323 -178334 -142987 -25228 23733 29078 -3190
20411 -3190 -59041 -93814 -137523 -166411 -193558 -150343 -21572 18790 -52127 -14924 20522 355
20399 355 31117 19264 12652 38019 -17558 -9664 53638 55161 40854 -33689 -65844 -85589 -93310
20386 -93310 -97839 -93962 -109425 -106146 -79624 -49094 -43934 11248 81417 -36776 -23166 -17635
20374 -17635 -31201 6359 40003 29733 90817 144261 34704 25418 -7009 -43969 -36211 -102106
20362 -102106 -95722 -70838 -37284 -41002 -85593 -106839 -110975 -100698 -67072 -92330 -139664 -19191
20350 -19191 64348 17036 25803 74687 82692 72533 80059 59453 28427 1421 -59316 -54708
20338 -54708 -87678 -6705 41301 52754 66041 107438 147622 148469 127237 -8388 -103683 -64305
20326 -64305 -107923 -141144 -177345 -206865 -219815 -208935 -180315 -228003 -201089 -171682 -141158 -131322
20314 -131322 -42055 -45953 -30751 -22033 -40060 -104658 -87621 -29512 8567 14874 -5398 -32000
20302 -32000 -22229 -11642 40138 27350 -18956 -60468 32193 93788 -23795 -82352 -48114 -19180
20290 -19180 -50515 2484 68472 47418 150 -58462 -61111 -26728 -31353 -19980 -37869 -54393
20278 -54393 31043 32578 -63216 -100444 -90663 11562 3376 -104576 -129099 -157975 -177801 -171154
20266 -171154 -110662 -18925 39480 26448 32760 -32328 -3707 47680 37608 67759 38944 -7267
20254 -7267 17775 97930 57698 52517 -49210 -114264 -18299 20686 47404 71897 99674 148191
20242 148191 103048 66280 11929 -67604 -76172 -81478 -15741 -51893 -121367 -77627 9089 8960
20230 8960 8855 -37322 -67410 -127468 -101120 -36268 -20064 32083 70649 -2055 -14216 -25369
20218 -25369 -107977 -144051 -99985 -115539 -99091 -144521 -157117 -106994 -79776 -27423 41654 74820
20206 74820 52469 -3114 23697 72170 61242 4869 -9797 -3253 -3904 -60387 -70469 -64712
20194 -64712 -21074 86380 75693 8417 -17516 30423 -11781 -5995 51945 34048 -68221
20183 -68221 -106895 -16802 -41832 -77287 -73033 -83785 -97721 -62222 -60303 -102006 -46598 -19830
20171 -19830 -50173 -90632 -133124 -149160 -102834 -25142 -33467 24747 55495 669 -59995 -47755
20159 -47755 2865 -1951 -45981 -13068 35806 17909 -5255 -11711 43607 38628 22896 37226
20147 37226 75037 21932 25375 37388 44755 16596 -17383 27060 28016 -24954 -103249 -107489 -63589
20134 -63589 -30447 -154845 -158974 -136428 -84192 -97905 -158297 -201357 -191523 -161173 -132137 -25217
20122 -25217 67601 1809 -83770 -82417 -16238 3311 -55681 -59928 -29265 -35725 -34840 -28313 -40631
20109 -40631 -76882 15890 9637 -19359 -113 26349 -53145 -48503 -56624 -119623 -173390 -132552
20097 -132552 -95390 -102143 -96303 -104432 -58545 -19266 24925 53430 33256 74239 119361 77221
20085 77221 19774 -32118 5329 7618 52848 42829 73162 71684 60458 31832 38029 9289
20073 9289 -34303 -163729 -221709 -144059 -111019 -98052 -73735 -54446 -103073 -55489 14253 -45787
20061 -45787 -88950 -87647 -49007 -47808 -83260 -120563 -78505 -23351 -78674 -162483 -151434 -184435
20049 -184435 -162344 -117770 -112676 -77938 -67009 -45048 -16674 -38957 -50810 -34333 -25116 -27120
20037 -27120 -54301 -33654 -43819 23458 8402 -24060 -42581 -100119 -133635 -211372 -171470 -123626
20025 -123626 23487 82893 -48413 -118339 -142442 -79756 4486 117905 55560 3534 -37082
20014 -37082 -20447 15717 21069 26214 98040 136826 117639 25498 31865 -38303 -80650 -93473
20002 -93473 -75535 -66354 -65710 -52087 -9929 -4739 -23652 -15359 -69035 -84879 -64832 -15032 39098
19989 39098 -85635 -140759 -114102 -141626 -134794 -138279 -88859 -35194 -75685 -122104 -101397 -119118
19977 -119118 -141841 -123341 -128003 -116604 -101123 -88425 -23111 -20154 -61500 -133402 -63729 4529
19965 4529 -37569 -72435 -82880 -19790 -44475 -70617 -104160 -88028 -104640 -20039 -21944 12504
19953 12504 52351 59159 24035 17116 -94944 -72305 -89409 -93098 -61699 -18462 -19196 -16902 -26061
19940 -26061 -70230 -143041 -136291 -101020 -21241 -4781 -31727 17521 49255 -18680 -1952 24830
19928 24830 44226 65322 88280 20534 44124 89429 114784 171712 160596 112112 52859 -121
19916 -121 -41001 -50051 -14542 -114819 -132833 -90269 19500 36853 -122216 -159987 -98635 14127
19904 14127 -51139 -94956 -117042 -150103 -179234 -141444 -81596 25248 102562 75522 38366
19893 38366 8126 -64289 -94896 -102189 -138748 -148606 -125427 -72861 20621 68302 62664 -14749
19881 -14749 -26392 10893 -40754 -51577 -25466 33770 93926 10539 10620 8632 13066 34802 34161
19868 34161 70233 -37205 -14712 8474 -73119 -89856 -128550 -62357 -42478 -21979 -205
19857 -205 11843 16788 87994 94337 134587 143729 50095 29509 76328 82226 -34107 -97686 -67076
19844 -67076 -86214 -76594 -77652 -43157 34502 74530 80364 31486 -83969 -147886 -52063 -72118
19832 -72118 -105451 -98042 -82308 -95071 -101665 -53295 -105986 -119921 -80499 -104468 -103657 -14395
19820 -14395 -10351 -3830 46449 -14952 -99327 -96250 -62075 -67749 -91579 -110422 -87846 1474
19808 1474 34873 44581 55393 38964 3195 -8090 -49156 -109919 -134366 -131135 -149115 -134042
19796 -134042 -146676 -89931 -76922 -69544 -56835 30797 15959 -71459 20727 -3555 17915 88097
19784 88097 55453 3532 -1053 -24797 -48470 -64374 -58389 -53325 -132928 -138629 -107178 -118105
19772 -118105 -82735 -88509 -59144 -37183 -18785 -56153 -83561 -346 52589 4551 15682 -37935
19760 -37935 -70901 -69649 -94328 -60581 -58609 -97402 -86939 -70054 -106073 -85483 -74531 18773
19748 18773 -24183 -85592 -106142 -130354 -177245 -209067 -149898 -97501 -74328 -78897 -80198 -60626
19736 -60626 -34235 -54035 -7741 -61606 -62182 -25435 -9152 34052 -20918 -93529 -141794 -154449
19724 -154449 -102708 -54320 25493 57930 57285 41565 -19071 -64850 -94692 -121544 -32027 27526
19712 27526 -68192 -47673 -17431 31155 7537 43458 61648 39676 15344 -8132 30922 56244
19700 56244 -18258 -75773 -22740 -19896 -4460 48813 86689 58255 -7823 -52493 -62967 -26212
19688 -26212 -34763 -102701 -4898 35813 8577 -62374 -15892 3096 -45499 -164472 -219883 -138290
19676 -138290 -142284 -137406 -167149 -168268 -136845 -133060 -110769 -114937 -102705 -58779 -74279 -69661 -41666
19663 -41666 -52075 -7582 -47403 -652 9265 -20789 -13746 43243 13598 15194 -30877 -75355
19651 -75355 -53212 5716 -11759 -22640 20521 13993 -42368 -90744 -14499 19502 1215 -57222
19639 -57222 -79337 -13686 -9674 -50822 -72842 -48912 -3944 52177 4177 36985 45522 15877
19627 15877 -73558 -96704 -83023 -59188 -9547 62988 23640 12592 23130 64972 46087 -38944
19615 -38944 -22628 -7496 -38322 -116747 -153656 -174009 -137031 -132670 -65778 -40248 -90260 -90067
19603 -90067 -169702 -213180 -207974 -214090 -183796 -86556 -56974 -44493 -16371 -7899 -16007 -16782 -80700
19590 -80700 -97349 -103152 -58378 6221 -9383 -37124 -54093 -37345 -28827 -27229 -122699 -169766
19578 -169766 -200698 -145122 -82080 -79269 -13746 5403 46096 30135 70144 120039 71268 64187
19566 64187 46343 17860 -25021 4961 -51924 -107754 -91129 -67247 -97096 -104662 -82729 -104466
19554 -104466 -93302 -78786 -5932 74607 46109 25090 68803 37229 2813 -20323 -30137 -15773
19542 -15773 26770 119106 171010 186458 155799 141360 104887 122147 63763 101524 70814 21625
19530 21625 66756 105170 16511 -12272 18798 -4518 -44105 -129695 -116020 -64873 -54980 -38250
19518 -38250 -50785 52337 84938 33421 27323 22923 25589 68157 87716 70459 68304 111498
19506 111498 108706 27034 -26086 -70811 -27730 8960 -16204 -18811 90025 16234 30834 41413
19494 41413 -20202 -23632 -57392 -133596 -55451 -49899 -46597 -8766 -28992 -80566 -103518 -65082
19482 -65082 -59588 13602 30942 9433 41975 84459 119508 97178 69703 50736 -7502 -59536
19470 -59536 -136997 -146268 -29125 121174 119769 60028 -8631 41042 94530 98486 86272 78341
19458 78341 44734 -20155 -9117 -41706 -30667 -20792 -8774 5705 8084 87618 62647 32190
19446 32190 54903 81814 166442 197357 139185 132537 63125 23093 11553 19040 30053 53167
19434 53167 45019 -3548 5297 96260 188948 107510 77685 87350 -13725 -53201 -48690 -57683
19422 -57683 -26270 -77624 -45441 35809 146569 129252 84938 58842 -3679 -47810 -66758
19411 -66758 -34517 21579 30086 6403 -27297 -55576 -55355 -64872 -66945 -23261 -40143 -60676 -42265
19398 -42265 4227 -65090 -93431 -56501 -75936 -58939 -96988 -21618 -18477 -37352 -88874 -81713
19386 -81713 -61577 -8028 23962 -4591 -71930 -89804 -105584 -164666 -182935 -172402 -175145 -137687
19374 -137687 -126718 -59910 -89698 -124892 -145848 -35904 39397 61559 11389 -99952 -174322
19363 -174322 -105971 -15907 -12146 -17217 -34162 -48566 -42453 -105333 -61014 -65918 -63266 -87643
19351 -87643 -80458 4319 -75456 -123303 -82366 -83799 -32274 -55278 -70449 -92602 -100337 -89744
19339 -89744 -23734 21707 -29322 -15810 -74389 -79744 -118129 -89663 -26615 -5754 -11616 -5872
19327 -5872 16561 -22111 -17416 -62241 -72946 -77776 -140271 -56999 -46626 -13053 -2611 56412
19315 56412 34548 20827 17872 56643 98798 33360 -45428 -38180 13788 -4082 -32910 -21242
19303 -21242 -13332 -12460 -46843 -43788 31581 8265 -21027 52157 138682 140107 112864 69864 -36866
19290 -36866 -69940 -40181 -29914 -42951 16012 34207 112113 81358 -39239 -51837 -8245
19279 -8245 -29578 16583 32292 -51816 -131988 -124633 -55844 -13519 56194 65393 30044 57390
19267 57390 42855 17230 -73320 -115687 -109468 -137484 -185081 -100525 -38632 -32504 -47964 -6302
19255 -6302 32744 12766 -71855 -83870 -118575 -206842 -151258 -77990 -137690 -184305 -135983 -70325
19243 -70325 -104825 -52603 -5433 16888 -8188 -48055 -77884 -94975 -48129 -49587 -120845 -136289
19231 -136289 -109578 -107176 -149949 -112853 -9817 15610 -23341 -90013 -106634 -94567 -72430
19220 -72430 -11561 -25267 -63454 21509 -28873 -129067 -98254 -86823 -44912 -12962 -33629
19209 -33629 -24090 -29853 -23705 65485 114529 132375 56601 -42013 -84210 -54364 -92738 -67364
19197 -67364 6220 3595 -61190 -40837 -9935 -60324 -50358 -11808 36901 -9986 20440 10680
19185 10680 -58676 -28685 -26052 1493 -57534 -124147 -147968 -144536 -164870 -145852 -161393 -148278
19173 -148278 -166300 -185710 -123243 -100671 -109500 -159033 -106046 -33983 -12624 -16165 8290 -5564
19161 -5564 75417 103771 -1270 -26868 20018 48125 12779 -5977 17113 -60296 -139236 -169651
19149 -169651 -131239 -81641 -16798 12651 14292 -18664 61493 55272 62182 -11608 -38805 28359
19137 28359 96334 169477 53944 -93562 -148866 -102583 -16842 -7396 -77449 -139901 -153142
19126 -153142 -83512 -27535 -38470 -36134 -14744 -16217 8063 38208 -58204 -87699 -49972 -67945
19114 -67945 -25082 -33310 -49335 -26034 -42559 -95980 -71642 -69602 -12517 28912 14573 28741
19102 28741 5864 -88448 -81517 -53547 -23232 37631 117130 128497 79790 -31183 -76865 -50934
19090 -50934 -69999 -47153 -15657 -11030 -78468 -15914 -122361 -202918 -151447 -52742 -30704 -17361
19078 -17361 8947 -1946 -17458 -74160 -99926 -101428 -76653 -87877 -92988 -57505 12339 39504
19066 39504 86420 66019 -11846 -24808 -10002 -1390 -74840 -55421 95244 164178 168261 140793
19054 140793 83139 61362 30960 23953 10029 7201 -12815 5164 67343 145241 179484 166009
19042 166009 98457 39863 47993 75567 42266 -11983 -88525 -109892 -131616 -58899 30407 9975
19030 9975 -12519 908 4143 12217 -11816 -16915 -68174 -46712 -108068 -120380 -137083 -116894
19018 -116894 -56971 -37001 -50348 25650 65877 43673 28115 33144 -33389 -78438 -101379 -29985
19006 -29985 -43450 -77118 -23575 -22530 -6028 -85649 -78295 -31352 -61339 -129161 -104338 -48004
18994 -48004 106 -91852 -58853 -22312 -49170 -27850 16919 48398 123953 130632 29082 -26422
18982 -26422 -55104 -116830 -125566 -125371 -146681 -135875 -86672 -781 91508 204838 229309 194848
18970 194848 135742 52636 23315 620 -68036 -98924 -29788 -84551 -97790 -40547 -15651
18959 -15651 -705 -3665 5590 -40635 1349 56735 80567 -79387 -143608 -28188 -53170 -38953
18947 -38953 -27810 -41962 -45793 -43982 -30125 -4062 66451 97875 130013 128841 133254 136972 119321
18934 119321 113775 131758 47767 1653 -14662 -14815 3102 67075 23613 10958 8607 49613
18922 49613 118469 80551 55340 -65805 -129620 -7428 19328 -52493 -63154 -58796 -9191
18911 -9191 45492 21151 6927 -6113 -69635 -42829 3823 -80026 -183633 -176908 -175028 -148591
18899 -148591 -93187 -52510 -34281 -113273 -97164 -104451 -107703 -69626 -40376 -47297 -68769 -1195
18887 -1195 27000 52838 29208 705 -11556 10965 5649 -32685 -25339 -52878 -62919 -58875
18875 -58875 -46394 -80485 -84945 -90588 -142259 -204188 -173705 -118254 -95833 3103 70189 127934
18863 127934 93398 69565 85051 120017 124582 108846 63013 53023 48493 15967 -27498 -27341
18851 -27341 -10078 -39324 -39769 26736 38201 26224 30642 32225 -31552 -60199 30841 69073
18839 69073 40344 88972 57493 40487 51102 83423 -18403 -62661 -2306 30805 56913
18828 56913 35281 30124 -37009 -53459 46193 108993 147405 75818 31101 52515 32385 -89792
18816 -89792 -32239 25332 10135 18305 5768 48702 28746 -84877 -40304 1285 -15747 59351
18804 59351 123194 110817 103144 47526 13173 22136 -8926 -75654 -115845 -129215 -124922 -161440
18792 -161440 -111082 -4664 -47223 -97733 -112150 -73242 -12414 84516 172825 127643 51614
18781 51614 -22237 -93623 -134378 -50892 45651 50939 4738 61130 118825 210883 232266 284283
18769 284283 476800 640352 806690 887050 851644 595350 361044 192863 156024 102980
18759 102980 -14180 -49260 -49585 -10152 6560 -34163 -119580 -144491 -49849 590 37387 -1937
18747 -1937 23116 -52150 -136730 -92345 -13587 24160 12653 -20811 -85482 -147639 -125124 -79940
18735 -79940 -54124 -26352 -87376 -120563 -29899 25675 43285 94152 110058 38427 20501 71450
18723 71450 78768 13071 -72102 -155485 -107161 -41245 -54569 38567 133894 44000 -36846 -31925
18711 -31925 -4521 10044 58624 52375 26983 -25936 -54368 -53818 -43131 18635 17223 -18730
18699 -18730 -28959 -38500 -137402 -141934 -46767 -446 43349 29334 18483 6089 26209 24358
18687 24358 -14032 4699 63498 68692 19544 18059 39828 16826 -56461 -35416 -13549 6358
18675 6358 127507 122477 87691 108837 77612 57685 -16352 26953 34699 -26969 -122695 -157573
18663 -157573 -98799 -74110 -57049 -52833 -62593 -33882 27819 38334 -20404 -19197 -30133 -83952
18651 -83952 -87525 -39391 -3728 32758 45902 40169 44604 53035 131960 199775 192726 163754 68385
18638 68385 -4911 -2361 -90935 -59561 -11444 -96288 -153712 -147099 -98395 -26640 31736 -58464
18626 -58464 -133700 -108962 18187 25894 -19896 -30517 -38308 25505 -11598 -49066 101 20214
18614 20214 -8651 -44137 -27983 -56172 -87725 -24269 1598 -101650 -92654 -40930 -30630 -14590
18602 -14590 -81260 -61964 -51023 -12888 -1182 -43047 -75529 -53004 -24440 54196 43940 71300
18590 71300 129774 136413 182083 225865 180199 160273 119433 131360 220560 298973 380723 419339
18578 419339 428064 442842 492332 535031 595213 644302 583744 515916 573857 608989 573876 523940
18566 523940 545258 568639 585488 638610 667366 641978 583020 629149 640137 543454 457997
18555 457997 463285 426597 418873 352650 300695 300091 312191 272857 221941 164240 122913 184839
18543 184839 218971 254910 250180 139394 136752 112544 62977 92621 62724 89072 130590 158074
18531 158074 214005 296146 345132 384349 459992 519214 501108 447852 434453 491039 495739 497607
18519 497607 540007 659100 826763 839379 817012 795399 774593 782915 704569 679484 669631
18508 669631 651174 640177 654619 663274 713897 701105 641788 580760 577293 550135 432535 324964
18496 324964 204999 254043 241479 160847 77740 91746 92229 62942 32185 69654 170908
18485 170908 171917 171429 39927 -52398 -56123 11314 30713 80544 141775 67709 11678 57393
18473 57393 35016 -1591 -15646 55525 -54287 -79793 30905 94378 125496 128775 13503
18462 13503 -952 57313 31459 14210 118478 136538 109634 68020 158 -64096 -98292
18451 -98292 -73168 -37038 -31307 -55674 -55702 -31974 1004 40386 48159 -2894 -9535 -28946 -84818
18438 -84818 -98454 -73993 -35745 -9137 -51469 -41733 32014 30527 24942 92935 95273 65337
18426 65337 52079 -4456 -13947 -2746 57323 95918 9766 -34487 -12870 -11468 30896 -3238
18414 -3238 -52468 -11781 34231 -17157 30505 87372 132168 130472 78164 120574 80097 51060
18402 51060 39783 33225 23018 -12885 2575 6696 -11155 52275 48796 102763 40275 46356
18390 46356 -62980 -119606 -16868 45061 147689 193620 121101 60967 85265 85443 68977
18379 68977 77231 95057 23923 -49382 -74913 -26857 33587 -11205 -65830 -76956 -59116 -20365
18367 -20365 -23336 13130 27857 79531 77983 152072 205704 221703 193322 78002 62170 -17549
18355 -17549 -76155 -51039 26196 116130 148438 34135 -11824 6738 17545 52598 2944
18344 2944 25296 19784 -6177 33887 96019 125068 97627 77844 32375 -70786 -42328 90161
18332 90161 157230 163935 177878 198689 163525 201901 216571 127251 74501 103200 132104 163488
18320 163488 181090 144855 106310 95944 96653 145865 187924 121301 102539 143705 158761 140743
18308 140743 149037 155381 98807 109585 83585 44910 71497 56699 -10697 -16766 39796 53158
18296 53158 86315 144733 190173 250153 280199 252848 259733 255294 207797 157322 106770 116752
18284 116752 161170 196350 242266 243052 187077 187748 214460 231446 256702 290473 337674 364636
18272 364636 359374 300514 235521 228829 153507 97404 117038 119958 267448 334768 295408 232056
18260 232056 151391 104845 67965 83425 122216 53838 44043 96785 145871 119491 154451 184469
18248 184469 162298 85112 43380 60538 102178 112415 77167 103445 223949 180160 104427
18237 104427 85746 23512 20714 98677 259629 354821 280301 288795 273246 139059 44497
18226 44497 104701 108642 81024 36525 -2535 -18574 -12952 -11596 -44560 -38455 21486 46908
18214 46908 -33111 -95917 -111199 -98910 -36320 35486 54789 109951 92953 61327 59547 93996
18202 93996 82762 75616 78765 134536 281829 351310 304714 339332 460307 410172 396774 406828
18190 406828 310626 288913 348423 364769 329893 353220 433128 434538 438739 434089 467564 516120
18178 516120 522475 530708 533517 515699 407141 395046 420811 448658 377333 340121 268393 253141
18166 253141 213431 179640 145283 210368 303928 272312 276544 242765 262701 344535 324227 415126
18154 415126 470739 487590 572582 571394 555187 621789 736478 812215 905473 894770 949148
18143 949148 1084480 1129161 1166267 1273764 1345373 1377564 1434602 1470688 1659764 1812214 1932986
18132 1932986 2040794 2080138 2203475 2444627 2718059 2958385 3306745 3772176 4331869 4985771
18122 4985771 5800273 6755183 8006802 9473091 11146842 13089498 15588496 18876831
18114 18876831 23323844 29817382 39950920 57672516 89122483 134072047 172626332
18107 172626332 178010736 133943566 76426405 45413089 31065525 23899713 19895349
18100 19895349 17746630 17012016 17473608 18600702 20151308 21784791 23530515 25298167
18092 25298167 26457710 26459068 25879715 25693646 26030880 26536461 27475234 29617184 33445757
18083 33445757 39309888 48137098 61424299 80321690 103725186 128808513 153059414
18076 153059414 176463104 198418216 211713816 208585129 193169276 176728962 158569707
18069 158569707 135512521 111611458 94044334 83470794 77334299 74001833 72749345
18062 72749345 73050032 73648666 71901955 65979482 57905053 50480242 43372190 36041761
18054 36041761 29309136 24389569 21247620 19436313 18432635 17959422 17829592 18026318
18046 18026318 18537287 19383380 20517808 21837593 23766471 26486659 30502205 36311505
18038 36311505 43911554 52825597 61955039 70849848 79561796 87097781 90999750 90711369
18030 90711369 89630042 90969559 95107291 102522760 115113906 134612537 160857475 190402363
18022 190402363 217192855 236973679 250646598 258002648 250286256 222685133 187009271
18015 187009271 155906014 126316052 95959347 69744537 51681784 40731961 34185943
18008 34185943 30405301 28561327 28173472 28695795 29495804 30307462 31141419 31388519 30130677
17999 30130677 27078002 23540585 20502182 17639302 14711081 12051943 10193826 8956491
17991 8956491 8216501 7594967 7050203 6541536 6009705 5476582 4971839 4587994 4203100
17982 4203100 3925390 3696103 3540595 3331528 3085654 2941045 2804102 2643503 2508589
17973 2508589 2439541 2377066 2290105 2176984 2170810 2164360 2058576 1908988 1768294 1721516 1684933
17962 1684933 1577346 1527969 1436717 1381708 1310082 1281814 1157402 1097302 1038200 981298 997806
17951 997806 1001331 979745 962448 1018361 1124559 1181886 1127843 1062332 1048117 1040049 992819 947691
17939 947691 916425 893573 872084 872738 897622 891094 939456 940315 951357 979029 1042986 1140876
17927 1140876 1249076 1190036 1060241 954189 844999 729069 642342 549338 486270 490006
17917 490006 475649 575852 585018 564140 599739 610764 641978 580918 482248 452289 466414
17906 466414 417583 349421 337948 349922 309546 309137 348726 322273 332256 386801 441728 411329
17894 411329 414945 470275 594811 724097 780773 776666 791889 809417 761613 780056 813847
17883 813847 775825 612808 564811 645558 711181 774261 806542 873679 915690 941885 915971
17872 915971 896895 925805 933783 812804 745551 670852 520809 443078 394323 370709 337846
17861 337846 252038 265424 383385 389027 342622 408325 388925 399957 270406 205354 195654
17850 195654 148428 100420 149826 154066 149564 99101 76344 116711 159370 160811 161244 178067
17838 178067 257431 271155 233091 177666 240104 214318 250156 325347 398358 408393 352756
17827 352756 340222 378730 370786 355472 341477 319676 351291 427103 330600 342369 385215 264430
17815 264430 204129 220316 248117 235891 233842 260854 263919 205888 257427 302463 286872 205952
17803 205952 140315 212738 267127 251032 310849 374411 300582 234261 268006 335609 395176
17792 395176 416218 422185 407449 336245 299435 325192 280850 332841 380196 293590 205822 196963
17780 196963 204250 205787 265348 194607 96139 96396 152367 273625 263147 217831 185689 170199
17768 170199 262694 307089 290365 236068 194589 189117 150778 203155 233629 176589 162071 144160
17756 144160 197382 197402 209750 189179 186311 147813 145607 146959 182891 240569 177997 116962 134385
17743 134385 142844 217465 277856 344438 363470 276134 286496 325060 218741 134494 78198
17732 78198 41886 71511 192804 168728 88927 82721 94692 120684 166136 187087 180642 188111
17720 188111 266988 227431 197237 202303 194676 147417 123947 192495 267495 243164 246589 313364
17708 313364 232506 201637 235577 332454 323370 318357 386232 335063 185156 158129 172917 205895
17696 205895 230532 273558 283388 196561 174033 117709 48905 -21860 -51417 -72409 -43045 -87578
17684 -87578 -42232 21934 80465 5524 13309 46950 100343 79902 24940 -4213 18394 12469
17672 12469 58918 91788 161235 244401 267685 343048 434729 679870 875791 1108745 1456525
17661 1456525 1691799 1795994 1890104 1910050 1862048 1826490 1697711 1490235 1290994 1097075
17651 1097075 970267 896143 810311 820551 829575 813805 779491 784546 792445 839062 861523 778147
17639 778147 722999 657033 518688 304231 229558 215067 227291 239344 213629 253464 258007
17628 258007 321271 329986 287160 296063 293764 393316 390223 298753 270123 257368 330067 368968
17616 368968 412796 466658 460931 436525 373480 402757 506889 636249 729170 820736 886064
17605 886064 863269 900712 922171 904374 924905 1040164 1082434 1085908 1116739 1183321 1317206
17594 1317206 1308363 1343164 1388914 1493569 1637802 1751735 1844829 1899497 1846286 1851783 1934485
17583 1934485 2018195 2105194 2211069 2296012 2414144 2534883 2550946 2622054 2831638 3072514
17573 3072514 3252182 3606210 4034004 4469864 5115475 5934287 6853205 7928570 9215889
17564 9215889 10851437 12986207 15662478 19182259 23688240 28895157 33621400 36283567
17556 36283567 36114144 33593482 30308871 27958702 27429636 28824449 31896903 36524282
17548 36524282 42798637 50860016 61716138 77237856 100514568 135097513 181854970
17541 181854970 235697951 284144999 311605465 308420913 277758410 231793893 184270185
17534 184270185 143210628 111995582 90951185 79340034 75696029 78106625 84588104
17527 84588104 92506531 98150510 97910756 90078577 76376513 60596830 46623385 36386440
17519 36386440 29789527 25870018 23546713 22025390 20797083 19475137 18340938 17496181
17511 17496181 17017498 16910893 17218767 18050882 19244171 20860708 23026627 26023638 30490686
17502 30490686 37206762 46675756 58707300 71640160 82334515 87568885 86114451 80182182
17494 80182182 73701565 70443879 72548662 80994174 96161653 118071258 146182382 178800428
17486 178800428 212203251 239353628 250800425 239490033 205844189 160110472 115141036
17479 115141036 80429867 57507797 43797767 35817188 31149477 28238084 26130191
17472 26130191 24376922 22992630 22332685 22664973 24030781 25959285 27341474 27039866
17464 27039866 24625980 20756247 16660883 13218110 10655383 8770699 7395754 6491365
17456 6491365 5786810 5262075 4841447 4534481 4226653 3979995 3672319 3386601 3137007
17447 3137007 2926959 2708859 2659702 2652019 2654828 2742033 2788712 2594280 2223853 1925392 1774784
17436 1774784 1765024 1680474 1555191 1473683 1406719 1371380 1271975 1228245 1257279 1208387 1147576
17425 1147576 1094539 1008053 924010 862742 820680 848331 857833 901295 882418 844759 821286
17414 821286 908090 984468 1092561 1177690 1168495 1229439 1187898 1114357 1109778 1043374 1050323 936705
17402 936705 893158 971309 1008502 1092535 1095829 1084540 1117317 1110813 1105702 1061018 987360 993375
17390 993375 975367 932548 953615 790902 654436 603145 554038 512448 515187 506904 432236
17379 432236 435911 508922 504370 507940 499162 512789 560404 505864 481150 378305 346208 375958
17367 375958 403489 487826 527615 501805 416954 398625 489742 591673 683878 819475 893274
17356 893274 999231 1060696 1035095 1042434 994861 890677 859217 814890 838031 921552 843826
17345 843826 650187 555111 535295 491178 522965 555497 496524 547004 647755 669136 586264
17334 586264 480773 432056 476827 412900 289297 189100 170039 174213 173524 234278 202967
17323 202967 174172 188539 216322 318933 332554 258367 290683 318493 363424 366689 398145
17312 398145 301319 250788 227827 286246 317882 323654 293736 327481 336214 324713 444535 502601
17300 502601 544275 590244 595669 593420 530746 428669 400112 412309 400958 284433 222450
17289 222450 196230 171485 153548 149563 139248 123155 115834 153770 171636 206664 217876 201230
17277 201230 226872 218769 168515 177986 142531 80604 34848 77634 121606 129454 126239 109010
17265 109010 119744 63103 -3774 17775 32266 87277 167136 184629 232053 148880 96254
17254 96254 83713 130168 132724 128383 132649 78776 63979 33999 82074 156762 161744 187076
17242 187076 181073 204964 163221 98423 174780 170202 203686 152625 125526 92470 97615 73593
17230 73593 48978 18867 109535 89178 106420 95327 45256 31018 48162 42084 40732 35905
17218 35905 36879 31399 81614 70127 95176 128918 150916 96848 97962 73588 -18213 3750
17206 3750 12757 22620 -115 45966 79521 44016 63128 44651 90266 89473 119278 126615 110259
17193 110259 116871 105823 77735 24504 37033 65558 52085 116701 68387 -21496 21456 18859
17181 18859 1288 -33148 -21654 83837 105610 97605 -6571 -6349 39350 120284 132536 76577
17169 76577 85559 125599 101806 92604 103677 52763 73412 102763 103492 83081 102527 146883
17157 146883 85496 48319 59566 51484 13780 33210 72056 16309 24866 40169 54684 19502
17145 19502 -32455 -47191 -18731 27204 114810 59239 -75327 -90182 -41436 28077 125995
17134 125995 149570 175462 206410 236597 216746 147279 125451 158097 85819 53856 11808
17123 11808 -55653 -134190 -65884 19324 65848 39798 17143 -29 -7593 61357 147336 128496
17111 128496 164967 214206 203275 89236 25430 40496 67864 34144 -21851 -69079 -83155
17100 -83155 -50001 13851 61076 62171 58945 72430 130361 125978 46768 8278 49560 106536
17088 106536 122115 31816 -27340 43610 66747 112261 160026 129611 58727 51605 74668 57159
17076 57159 81857 108950 129924 61968 68399 80523 70721 31391 -29898 -40567 -20662 -16918
17064 -16918 -16786 -9633 69067 131501 173563 210090 147544 125248 109333 120209 52153 97257
17052 97257 203625 238177 218351 355981 479151 638982 683343 753988 890733 941134 891353
17041 891353 877352 811760 857217 872380 817790 737262 657380 597371 657212 740520 814905
17030 814905 898861 956835 1025281 952241 812449 657978 449136 335190 272919 283594 234549
17019 234549 256789 318240 357866 364837 362325 383517 358547 340475 348919 342369 243797 203591
17007 203591 211747 182452 137199 104568 34526 -10935 85634 179802 255906 295700 340563 433179
16995 433179 540089 661981 654476 693562 756055 781582 787141 892410 870306 777636 662203
16984 662203 510330 393837 346382 333602 376208 397200 373999 418019 435308 514102 596384
16973 596384 722836 837297 873624 904210 855755 722399 623912 515299 378915 223198
16963 223198 78142 28077 16521 48619 27555 38301 59026 43171 19245 -8946 -48877
16952 -48877 -79150 -27829 27442 42777 63828 89344 31081 -21649 -103563 -91675 -61606 -72814
16940 -72814 -83483 -65364 -33805 61212 77979 12716 -11334 -16299 -21728 -17177 35289 100857
16928 100857 61958 77625 9512 -21862 29398 39988 77314 98001 86373 95568 81176 99800
16916 99800 28739 -2951 -24658 -75950 -120238 -66808 34283 109790 66308 107178 54994
16905 54994 -17509 11554 -47852 -6066 30698 6330 -68368 -110575 -109895 -7284 45971 6653
16893 6653 13270 -3303 -47333 -54113 -31200 17843 -37460 -116857 -114308 -93904 -66781 -57530 -35218
16880 -35218 -1567 32104 -55083 -23138 -19036 -5707 -11132 -5242 -42628 2954 113841 90464
16868 90464 23308 -14134 -34290 11871 50642 82213 127334 147232 114254 20709 -37846 -62396
16856 -62396 -58895 -71124 -106705 -31013 119231 100654 60820 81723 80038 37017 87967 56440
16844 56440 53787 107813 77051 41634 86583 69532 62735 49678 2989 -91420 -69717 -50799
16832 -50799 -85347 -62176 20271 30308 22192 -7246 -67042 -90291 -18710 3948 57006 108537
16820 108537 69281 -978 -19941 -21444 -68998 -70225 -13007 8715 37158 51920 46992 70853
16808 70853 69532 43412 507 7952 5288 -218 36065 20234 -21960 11987 8188 26482 69881
16795 69881 98604 152175 141014 81602 114189 70855 39424 121259 175519 207942 136408 78401
16783 78401 96712 67649 -2115 72670 97070 78294 24235 46783 84348 30694 26937 11619
16771 11619 34962 54125 107337 163309 114884 36260 68923 74538 54008 82679 137690 93939
16759 93939 30075 29420 10356 -65080 -26689 29910 31438 61642 74580 -27843 -47097 -59082
16747 -59082 23991 52345 44018 67013 98735 117053 27734 39263 35514 100536 86533 34061
16735 34061 22945 22021 56794 111838 133994 169848 162579 84860 -2599 -74318 -51636 42059
16723 42059 30553 12573 44195 101053 132438 131943 94766 92997 59463 122738 118009 76733
16711 76733 53891 111404 151201 131743 55979 -58755 -48431 -39131 -59918 -102902 -61035 -50998
16699 -50998 -19942 -31369 72525 138580 146929 149696 208073 129715 118415 109342 47164 52961
16687 52961 59845 63543 102184 107882 25671 -44109 -39160 38906 123871 144560 35223 -10439
16675 -10439 25143 44943 62366 24349 29562 -34620 -125892 -127062 -118835 -71420 10385 -38057
16663 -38057 -29614 11907 -14129 -25758 -432 116697 133114 91027 128291 123293 66054 -34273
16651 -34273 -96360 -71426 -34372 -70118 -114948 -118194 -151745 -138356 -132004 -100300 -60660 -35724
16639 -35724 22607 89673 12500 -8123 -63030 -98169 -49169 30706 54709 78459 72908 -50391
16627 -50391 -105713 -88020 -93381 -68246 -52442 -81504 -115243 -128516 -78176 -56589 18376 143808
16615 143808 117001 7409 -187614 -260982 -201507 -130499 -80128 -40619 -66016 -101688 -82083
16604 -82083 -48279 -112096 -75228 -52703 -95416 -123758 -22858 -15578 34069 92111 49365 -30941
16592 -30941 -67546 -35188 -27318 -11488 37419 83750 61759 34517 -3658 -36058 -85317 -97360
16580 -97360 -123336 -106537 -62181 -67330 -87373 -33579 10291 29075 -3049 -5929 -21623 -18868
16568 -18868 -12802 -43409 -54997 -4373 12579 28627 -27009 -74645 -54047 -56450 -73146 -33854
16556 -33854 -25312 -74101 -6985 -39269 -49100 23837 113248 127764 95197 146535 53076 -31166
16544 -31166 -12904 -2682 -31743 -57739 -1444 54411 50794 18821 4012 -25936 19917 -5302
16532 -5302 -39019 -89534 -63834 -83465 -89948 -83849 -82293 -105843 -75125 -28827 91038 67286
16520 67286 11520 54820 48927 74520 170125 153118 131673 110828 62150 -20167 -41753 -49132
16508 -49132 -23161 -41439 -60106 -4399 -4986 -10262 -41939 -67043 -79326 -40554 17095 30311
16496 30311 13990 -37033 -71830 -82406 -48510 58613 118598 190283 189878 127767 -16203 -99050
16484 -99050 -60915 -58997 -11223 26666 -6610 70456 24613 30344 58163 129755 88884 6133
16472 6133 6403 -14977 6796 97344 82046 -19199 -29970 -35983 -7666 -5469 -27838 -65154
16460 -65154 -19922 -27098 -27985 -33908 -44707 13596 -29201 -27720 -16045 -63010 -1952 33601 47077
16447 47077 71600 130106 109754 127456 101343 107707 67865 -21903 -94369 -24198 2121 -60922
16435 -60922 -42986 -38763 -56456 -92605 -48951 27129 -20769 -53483 -82476 -45193 4646 90061
16423 90061 59134 -5517 -66739 -46483 19044 74128 48125 -14704 -65344 2771 -28253 3619
16411 3619 78905 109606 104424 -18510 3622 58540 31020 96738 129363 68990 72116 22720
16399 22720 -24790 -22425 6497 41542 27815 -2466 -67697 -28292 -3852 -28706 -73673 -39304
16387 -39304 -20839 37867 20662 -79610 -91641 -123524 -142111 -90068 -44313 -7349 -80930
16376 -80930 -100480 -18609 9441 -43127 -92499 -1846 18868 882 5396 -22946 -68147 -66814
16364 -66814 -23314 -29829 -45435 -15965 61239 54311 39281 32259 3823 -1395 25619 54887
16352 54887 32402 82393 52498 3047 16457 41971 100324 76904 53341 83335 56996 61010
16340 61010 1085 -49590 -31049 23501 19898 79627 64726 106582 53409 -45519 -75104 -17382
16328 -17382 11965 23398 21673 52555 70440 117091 106015 17358 -21593 -30079 -98011 -61304
16316 -61304 -66821 -33411 64093 4205 -66764 -20526 -35709 -57297 -89028 -47475 6517 -33632
16304 -33632 -236 36087 -42221 -103677 -98967 -72035 -82865 -83874 -137337 -153878 -22569 25431
16292 25431 65106 10130 -24878 -66792 -144123 -137506 -95715 -164840 -128790 -128325 -85243 -75916
16280 -75916 -81639 -85028 -112816 -97676 -38075 16718 95835 47121 -1184 -38079 -23084 9540
16268 9540 -62724 -99908 -88681 -108175 -34102 31853 17143 59252 75516 71855 56616 111353
16256 111353 146701 155126 122995 103479 24495 4861 23052 -68861 -92992 -93973 -44758 -9436
16244 -9436 -31058 -96678 -110750 -45361 -42959 -96079 -68824 -38754 -59664 -101828 -28270 -37269
16232 -37269 16571 136109 169416 180804 115330 57268 -79820 -199612 -171307 -178381 -122743
16221 -122743 -87938 -49669 -19154 421 45852 30585 1436 -39164 -22660 -72481 -81415 -25767
16209 -25767 -51402 -15989 -43707 -50727 -21083 21188 20454 13546 25123 36660 26622 28905 36765
16196 36765 -67672 -132078 -77378 -13607 -24572 6535 47271 43172 11595 22681 -30340 -52331
16184 -52331 23994 37446 40041 27762 5657 86838 61302 32089 -28386 -110852 -98447 -89583
16172 -89583 -75240 -35835 -76906 -85696 -70650 -104844 -75713 -56431 -102084 -67277 16058 70907
16160 70907 68860 76301 33263 26541 -3350 -23803 -38739 -1173 -41325 -58825 21258 8649
16148 8649 -1798 21086 89914 65183 89713 56963 -61542 -87356 -57170 -34118 -52727 -4047
16136 -4047 28491 44307 34809 -6945 7257 55956 69657 83380 164839 139407 94060 69466
16124 69466 69485 83746 47217 43938 32006 -49082 -84221 -95820 -155154 -74893 -20462 21171
16112 21171 89141 114561 144711 117379 41885 2631 10736 49981 77964 129939 120317 122052
16100 122052 58466 -63717 -38509 41211 42383 -18006 -52528 -33010 -15498 -70195 -106047
16089 -106047 -23997 47766 10579 -71367 -88453 -28319 -48211 -52220 -52411 -64482 -81711 -69414
16077 -69414 -74330 -103538 -61156 -33998 -122199 -143375 -92772 -87138 -109954 -38392 -22261 14998
16065 14998 -32136 -71061 -48073 -22324 -43134 -6022 61625 15166 -43046 9205 4321 13733
16053 13733 -63012 -72947 -68646 -105043 -95216 -41120 -35043 -49624 -113117 -189192 -231328 -184462
16041 -184462 -143741 -156894 -67880 50621 -14016 -69529 -26357 -24787 -3481 1858 -21673 12192
16029 12192 53266 67298 27837 1755 -22051 61342 125245 103178 85580 65119 36135 -12747
16017 -12747 -61913 -54729 17503 21012 36618 17648 35408 73163 62646 68728 146026 199826
16005 199826 170151 127572 119554 173051 110897 55137 -8002 -12107 -40836 9141 23237 -40487
15993 -40487 -90916 -82385 -33436 3778 18252 43792 -530 7739 30349 22738 -14897 5945
15981 5945 -48948 -32415 -2693 -58312 -40460 5932 -51486 -80395 -81004 -116069 -104502 -45651
15969 -45651 -28739 -29675 -64312 -112301 -103101 -49797 -44843 -122620 -119819 -47229 -15926 -73864 -63255
15956 -63255 -67460 -119648 -176117 -153501 -24831 -63838 -104723 -83554 -52291 2540 36491 23724
15944 23724 63956 34575 -21863 1851 923 -54138 -55270 -20180 -5146 -24098 -44177 -36380
15932 -36380 48710 57034 6655 -33662 -68946 -7396 22050 27076 -15058 11221 22952 41349
15920 41349 28756 2789 8629 -34645 -41359 -3891 19690 46931 63188 56052 79225 56104
15908 56104 15960 20791 80961 83609 67304 33378 -10588 6449 -78676 -38272 -78507 -87499
15896 -87499 -81158 -92717 -95777 -91928 -72272 -4464 37089 -29980 -19641 55464 101095 137765
15884 137765 104329 132333 119138 -40327 -111997 -77915 -63887 -17875 50755 102680 167212
15873 167212 229931 116591 11486 -14796 11648 -48970 -80004 12533 46915 -34252 22170
15862 22170 92546 130460 113777 111278 36124 -12525 -75008 -95671 -22126 -55008 -93331 -94974
15850 -94974 -81108 -44885 -17438 -3777 -42791 -33337 36231 -13665 -76842 -94688 -47122 -12645
15838 -12645 24057 4630 30057 105478 102343 98251 -26233 -103567 -10106 22575 21547 48712
15826 48712 31652 1555 -14854 -21869 28153 46556 52231 37969 -75451 -167896 -93329 -72150
15814 -72150 -91271 -86346 -15056 640 -13253 -18635 -82685 -40524 30555 90839 98178 93147
15802 93147 110080 137813 157656 128519 90880 33265 5171 19460 24742 -54736 -39089 -39523
15790 -39523 4891 26761 -13122 -42136 -18038 -58584 -110075 -99583 -93254 -57454 -33353 35394
15778 35394 89799 43207 -19345 -68240 -63463 -243 -53052 -131610 -108076 -111103 -120427 -74464
15766 -74464 -63151 -47369 -43366 -58299 7657 -26750 -62808 -36467 -53970 46654 39106 13551
15754 13551 120949 115501 77810 27790 -13650 47880 94881 92704 -10384 -71687 -111174 -12295
15742 -12295 10074 -2102 56526 53794 57656 58756 37703 55274 1714 -10146 60554 92393
15730 92393 22150 -22033 -10090 32643 111209 78255 -70598 -74400 16245 67518 112869 56584
15718 56584 9789 -2788 -40227 -48880 -34755 -2705 -7028 39778 121930 121937 118897 73491 29422
15705 29422 56268 52582 -5765 -115723 -99856 -33923 40721 23351 -13217 29416 54680 75029
15693 75029 110093 105392 125168 73887 -88969 -122476 -70863 -43717 -460 41154 17032 8090
15681 8090 56425 15758 11246 28255 52728 13888 8134 -9495 -49188 -31943 -25752 -40814
15669 -40814 20997 76728 25876 -18601 -67650 -81686 24306 65283 104945 96210 41820 41255
15657 41255 149464 172771 165630 165114 184389 173392 159820 59585 37009 38864 -38876 -45424
15645 -45424 -18524 11877 -40124 7549 42634 56573 -27045 -41270 56296 83474 40778 -36892
15633 -36892 -9499 65865 99604 51649 65607 68528 77637 108867 173193 108376 50590 55196
15621 55196 33160 14155 -36957 -135163 -101325 -13457 -7222 -25720 -39194 -119725 -78136 -71585
15609 -71585 -60309 -46673 -83272 -104353 -62580 37423 77029 50323 -6170 -80659 -116568
15598 -116568 -154406 -175822 -137646 -111653 -87780 -99455 -2020 25571 -15339 -60778 -89684
15587 -89684 -28268 -13274 -29282 19703 2422 -10647 36703 48195 -7438 -2720 -68204 -136274
15575 -136274 -101994 -78202 -49425 -21628 -52778 12827 -33502 -4419 337 -70605 -107777 -77479
15563 -77479 -94594 -112424 -66231 8746 36214 56019 58090 74596 69273 -3793 -76152 -32726
15551 -32726 36648 22928 42695 73050 69149 55076 -3569 24767 10459 3678 36356 60369
15539 60369 46885 -89777 -65167 -60984 -32574 -40675 66397 69026 12003 -3563 -4695 45425
15527 45425 59034 19216 26352 35906 57743 14533 7026 541 -35190 1645 30320 31006 73992
15514 73992 35095 65706 31359 1660 31496 68612 89020 96432 74569 82444 92089 153948
15502 153948 123998 33117 -20090 -96666 -105080 8860 27741 69682 5984 -38247 -1945
15491 -1945 -69897 -56959 20835 28114 -51450 -18135 -1518 2759 110889 140936 96207 73270
15479 73270 75751 23454 -67472 -78443 -59460 -36120 35650 93406 79015 56564 104798 93033
15467 93033 43190 -30852 -9417 -105347 -104801 -148984 -127196 -118987 -138037 -168699 -152014 -158311
15455 -158311 -115519 -74968 -23667 -31650 -57680 -41424 -23698 -66223 -35973 -63575 -63993 -81103
15443 -81103 -29564 -82829 -63237 -60195 -92733 -14640 40439 28525 26133 -70485 -5514 38886
15431 38886 7993 39452 11839 52441 120245 99451 53132 41852 186 -41621 6809 -3041
15419 -3041 -26630 17901 -76565 -125875 -87026 -60801 -63274 -110126 -101880 -132902 -83719 -34260
15407 -34260 -30479 -15795 -33615 -19293 6015 75103 64313 -57667 -68522 -87624 -106442 -72912
15395 -72912 31903 96881 45970 13241 76719 78393 98275 43565 -24851 -58166 -9976 85704
15383 85704 41655 222 1446 36285 70705 61792 100601 85888 40284 -16743 -29741 -27634
15371 -27634 -62596 -15843 4654 -82943 -157652 -153984 -109605 -95173 -124030 -90137 -14938 -32486
15359 -32486 27930 103397 113816 -9246 2682 76936 2334 -64963 -115266 -139051 -137137 -117489
15347 -117489 -12550 69660 135881 126504 110940 31778 -32136 -66343 -65835 29393 193 -38299
15335 -38299 -5795 3558 34841 98885 133222 62160 64555 -16549 -80196 -41240 -4199 -12725
15323 -12725 -18342 -26269 -1729 40192 -13989 -31096 -20510 -7790 38204 39376 122679 192944
15311 192944 140190 68042 79211 74991 51568 22538 50041 26551 6192 -21036 13193 69314
15299 69314 69438 -24898 -63786 -65299 -111205 -183926 -143577 -53400 17164 49160 -696 6620
15287 6620 65690 -3156 -26611 58552 126596 113932 85119 46033 -20877 -61790 -92440 -35620
15275 -35620 70025 116625 71785 67550 50311 4968 7442 21445 87106 31476 -58030 -47688
15263 -47688 35712 30466 -21511 -62791 -70984 -102112 -25286 63942 146925 114578 70404 -29718
15251 -29718 -35232 -34965 -92202 -31703 10854 35426 2566 -42272 -6372 43845 31164 17379
15239 17379 24848 42573 33005 57681 18944 -5682 1234 -53551 -64033 -40023 2604 3517 37679
15226 37679 103220 69643 57686 7540 75272 126436 81246 37704 3254 -11434 -8339 -22014
15214 -22014 -42519 -16434 78518 62806 888 -28688 -47437 -131532 -159660 -125364 -66032 -143466
15202 -143466 -160683 -68958 -4803 -4785 -3080 -38158 -107092 -195322 -185158 -142853 -60559 -38196
15190 -38196 -101736 -129771 -104878 -27900 -39452 -47240 61571 74521 25335 1963 37328 -23751
15178 -23751 -94403 -159113 -159592 -133195 -138227 -96478 -35377 31742 20516 44401 35980 -14948
15166 -14948 -86053 19990 73019 79425 15299 -64862 -72650 -105998 -74093 36626 92625 21296
15154 21296 -57739 16726 14224 54798 2497 -3532 101350 145113 65157 44379 27161 60239
15142 60239 135996 213428 133283 96167 -1047 -38106 11930 38596 6417 11063 82445 56802
15130 56802 -52987 -99304 -104465 -102021 -138420 -104334 -34558 393 20571 14857 3963 10400
15118 10400 -26747 -53008 -73856 -37499 -6698 -9324 6064 5592 18015 37074 39002 30205 35994
15105 35994 16224 -18074 -124489 -196095 -132870 -28925 16479 1386 -172 -11435 22829
15094 22829 26849 -9085 -7660 -24922 -13385 53564 -26037 -53446 -6473 -66946 -28494 93344
15082 93344 158942 113939 47159 -69555 -117806 -99240 -131727 -72248 4760 22233 79169
15071 79169 -8262 -38908 -29817 -27595 -66799 -42524 -50500 -17249 301 -42650 -39446 -45901 4155
15058 4155 10938 11880 66770 74798 19929 32369 111346 105197 82584 29103 -41498 -90486 -57591
15045 -57591 -18384 13564 64790 120764 52644 -106115 -164715 -75981 14563 1285 -10449
15034 -10449 45665 73087 23691 -9919 37970 49117 15590 4214 -2403 22490 46913 59289
15022 59289 40432 49917 67043 48784 -35154 -45504 -8899 -58547 -72321 -42411 -16098 -46090
15010 -46090 -57735 -79373 -137498 -146235 -150517 -157419 -142841 -200019 -208495 -202944 -213144 -208014 -134398
14997 -134398 -52563 -20503 -4564 43053 38944 19268 54624 55032 15253 -32319 -71457 -71895
14985 -71895 -27991 32945 6410 -39283 -49644 -46672 -46134 -348 46719 13103 -52664 -53005 -15654
14972 -15654 4061 -14089 -6836 15624 -70190 -60883 -26574 -29132 -21058 1163 18930 -57674
14960 -57674 -107699 -136183 -88175 3054 43339 20687 33957 -13427 -34663 -57061 1629 64517
14948 64517 69573 40415 39813 36246 -47276 -83149 -6286 52923 25281 30974 21093 37301 67723
14935 67723 48451 39503 -967 -57120 -132405 -198269 -155843 -82949 -64037 -94562 -56899 -21331
14923 -21331 14628 -1824 -24871 25005 14911 -7542 21334 60448 48354 17967 -11432 -153623
14911 -153623 -143941 -113145 -92186 -69519 -16801 990 -40145 -139013 -150709 -38930 -56915
14900 -56915 -49418 -15446 -1080 -60621 -113352 -134721 -56077 13347 11067 64165 56072 -1599
14888 -1599 9490 15779 20902 -46996 -20424 15141 31275 70099 39286 -50465 -138690 -115475
14876 -115475 -157525 -131477 -17288 19885 -41322 -116306 -180485 -129727 -51809 -147088 -165889
14865 -165889 -116742 -149386 -139476 -77078 -80274 -58659 -2279 -35893 -33416 -59382 -92610 -8602
14853 -8602 73818 92445 122692 147339 28799 -33072 -43229 -47641 11808 -31541 -61682 -23425
14841 -23425 -5523 -34341 -33396 -75265 -45407 -73410 -100246 -74371 -15020 -74478 -100670 -34973
14829 -34973 -71890 -88351 -120502 -133576 -163674 -214772 -93404 7552 49448 7931 -37454
14818 -37454 -40908 -39626 -54521 -64108 -26668 -17802 -34851 -25168 -9180 26564 63441 180 -10566
14805 -10566 -37390 -42296 1784 63775 110376 125865 135415 69536 -27851 -74828 -53974 -100784
14793 -100784 -54441 -33433 -7200 -49049 -74364 -101107 -34145 -24647 -20997 -78522 -146290 -173697
14781 -173697 -161716 -169489 -91703 -100838 -78132 -52103 -105091 -92498 -7453 -18781 -38132 -81140
14769 -81140 -39557 -20448 18944 2136 20664 4130 -31163 -95255 -72624 -76869 -110588 -57698
14757 -57698 -25191 48921 65616 94581 19828 -84050 -89171 -14357 -31556 -70948 -66192 -7354
14745 -7354 12546 -8844 -47754 -110727 -125696 -99037 -29558 36991 20538 -3102 -25362 -7328
14733 -7328 45131 56989 70702 31843 -48963 -58141 -46748 -27281 -37613 -81676 -40783 -33801
14721 -33801 -81801 -85711 -83079 -124933 -111326 -88938 -89414 -22997 60137 64258 14731 39830 65865
14708 65865 58407 39034 -24493 -31042 -2087 -36786 -27145 -18522 -38103 9796 58056 105954
14696 105954 99651 88332 29218 -28954 739 -15342 -7828 -31660 -11396 53437 30025 1283
14684 1283 -56036 -15433 54792 72599 108866 66180 14448 79944 112707 92831 77404 112276
14672 112276 98568 40453 9373 36428 -39343 -10901 -48329 -94361 -52418 -4131 -49047
14661 -49047 23745 79340 46055 30333 -24920 -54698 10376 -9381 -59454 -15570 -40674 -122472
14649 -122472 -96691 2587 49988 93199 134252 132155 90172 57934 -61020 -84209 -34020
14638 -34020 -101195 -137980 -60401 -14443 8797 41270 45377 70349 88639 108197 71797 15720
14626 15720 -41216 16115 86329 44058 -33410 -57177 -55184 -63900 -69824 -71816 -91075 -61134
14614 -61134 -72505 -80358 -31839 -20029 20087 123488 147369 170048 122230 66753 111331 49180
14602 49180 38931 10914 22902 74273 13969 86819 57099 -4489 10094 8554 -24401 -50690
14590 -50690 -21280 99574 149662 105346 17022 42830 42112 14996 82353 56053 -16511 -72859
14578 -72859 -93090 -75629 -22965 98005 96915 13314 -29335 -55794 -69883 -77521 -94254 -87201
14566 -87201 -90855 -93992 -61390 12631 103460 111476 20173 61901 11798 -81531 -50754 10229
14554 10229 -42533 -36206 60927 88402 168831 159772 91963 12661 3741 50014 6698 58020
14542 58020 75356 105124 126272 111429 65226 24681 40798 -41287 -77812 -60038 -28047 14873
14530 14873 64683 54857 -5609 4913 -11766 -26148 41849 98452 134657 149855 113502 116007
14518 116007 72860 60416 62575 52291 -1433 -19123 -15892 -11840 66840 -28844 -157423 -124066
14506 -124066 -45516 -75200 -106630 -115289 -131585 -100419 -50867 -14231 -35383 -14925 52749 48429
14494 48429 27067 46505 92992 85433 80419 78380 97331 26131 43897 77434 105627 87710
14482 87710 89041 116549 31343 -4724 27833 86780 124765 83851 77044 100596 71145 -6717
14470 -6717 -15939 -6732 -1990 34170 78398 54051 69196 76596 47671 20042 58548 102609 52798
14457 52798 24552 38242 77729 28145 2676 -81084 -167042 -68014 5898 -51007 59332
14446 59332 110007 61704 44937 68647 114044 91549 79680 36009 -31247 -55686 -36347 -16574
14434 -16574 75108 64100 27679 -31695 -53078 -33863 -37151 -5943 -4799 -34591 -54880 -61771
14422 -61771 -46349 -20064 18028 78855 21074 -18204 -47426 -46529 -18837 -16549 -46805 -36174
14410 -36174 -50096 -77077 -107422 -95650 -92258 -84868 -125930 -142860 -101111 38602 110439 114393
14398 114393 90892 67365 35359 21434 -6007 -18004 -2378 18380 -27140 -153139 -135355
14387 -135355 -131361 -145546 -82704 -89348 -147844 -85431 -69521 -71254 3647 59407 49879 10285
14375 10285 31503 -1998 44093 115918 122325 82706 9946 -71557 -88954 -5989 16829 -14630
14363 -14630 -26890 -79904 -149569 -154313 -47110 87169 81362 121017 37833 -29695 -8208 67217
14351 67217 -14507 -25956 -25328 -89004 -41164 -12891 -70610 -68596 -90556 -90234 -61308 -43292 -99834
14338 -99834 -58350 -41173 -47635 -130935 -137247 -78168 -16944 31214 -14688 -45078 -51143 -67753
14326 -67753 -77867 -55427 -19176 -10227 29031 -8740 -121605 -78899 -67472 -10947 50520 86810
14314 86810 138953 164965 120715 27226 43913 62853 89023 73009 31728 -4774 4531 9797
14302 9797 -15869 -54165 -118643 -76919 -19915 -384 49029 -5650 -84741 -134395 -99160 -128151
14290 -128151 -78267 -6278 55993 81855 102852 107513 97560 -16634 -103435 -91018 -114973 -103963
14278 -103963 -73422 -68218 4286 -18484 -25127 -15445 -56559 -41681 -35987 -135348 -141684 -97961
14266 -97961 -65810 -27201 -11869 -15011 -107212 -187547 -47275 46042 12500 -1759 -42124 20053
14254 20053 54586 3441 49280 93725 88865 57946 42824 -25412 -24279 -21887 -43521 -67120
14242 -67120 -43694 -29396 -56456 -73553 -16415 37976 37037 94350 156329 105592 -10295 -63142
14230 -63142 -21823 -43907 -39470 4947 -7565 30409 -11435 11956 -12019 6823 37846 56246
14218 56246 130295 92482 104230 76769 104985 59743 11878 16406 99852 145236 100620 147331
14206 147331 104885 124402 179259 158506 83399 65319 99521 142698 117282 106091 81394
14195 81394 116517 154609 76606 16198 121907 207808 185700 237727 205689 147738 88586
14184 88586 114622 79656 141020 223120 252074 276370 219521 206306 283276 292591 196012 117286
14172 117286 84881 41444 -64627 -142763 -136832 -107784 -84478 -98013 -50640 -34461 1950
14161 1950 35227 64493 77224 71286 113129 181064 220924 199943 200375 287005 370336 327760
14149 327760 233089 212914 232759 215910 196786 182093 143283 141539 189995 159916 111916 130271
14137 130271 161233 136820 135718 184744 217152 310628 346559 365339 379554 413229 425712 385982
14125 385982 409052 328280 207275 203647 160401 112596 173261 153856 131171 123370 172630 126961
14113 126961 68386 26063 21417 67618 79578 106296 139117 209568 296983 281285 275021 331775
14101 331775 415756 423664 364464 280041 312655 227898 85425 8870 61633 83901 48159
14090 48159 -3904 -65727 1168 49090 50494 17253 -4676 845 87078 115546 138364 200527
14078 200527 232388 260192 219922 213413 213977 218536 245125 201310 146555 191731 206845 104434
14066 104434 32610 -44282 -20458 64782 45080 19128 -69772 -90925 -17417 23086 82337
14055 82337 141282 130498 107206 84328 69545 63820 61043 95482 77532 53538 36083 1660
14043 1660 -17352 -19348 -45895 13682 32771 -2621 -68863 -9183 96978 140409 99749 64885
14031 64885 12695 15324 56436 39216 -3778 -6891 5165 -53617 -90589 -89873 -80845 -157084 -94382
14018 -94382 -39849 -19890 -21986 -22211 14954 69362 5833 -36401 82567 133692 118007 82429
14006 82429 64426 45235 32492 -14749 -14575 70758 126005 116121 60326 70153 -23074 -32952 8987
13993 8987 25286 64786 69316 -124 -14061 -23497 -94137 -23563 42956 14603 -26298 -41844
13981 -41844 -4488 -20220 -28609 -43499 -59209 37704 109352 82830 118815 121309 154833 117160
13969 117160 22638 24230 -40492 -41010 56580 101128 167462 174134 157809 85484 62477 110988
13957 110988 92691 72840 76600 54184 164266 168906 60943 108078 90135 140213 110456
13946 110456 82817 15501 8344 16929 37481 63879 87588 67014 -10581 -14352 72353 116701
13934 116701 130210 103682 110796 48626 45327 56398 3891 19582 24424 -16927 -11141 -27764
13922 -27764 -58724 -8430 18551 7336 41023 115556 110369 126962 121318 113780 152811 195584
13910 195584 112438 195600 269622 263628 183191 152393 136199 148782 94000 63056 131798 127746
13898 127746 76796 59043 91167 59597 10675 -48257 -36809 -46104 -21135 20524 92413 54512
13886 54512 -37272 2186 30498 69138 99171 94568 93228 78628 99863 96473 69038 -3452
13874 -3452 -46298 11469 23347 33796 -15971 29785 58858 51234 35169 99657 120807 90594
13862 90594 76613 69694 65485 52195 12172 -32279 29582 23978 -14941 -21641 -24519 -40804 -10362
13849 -10362 48190 51216 74140 26491 2104 39020 53551 46107 63105 28482 42912 61351
13837 61351 137249 233741 161617 68035 -9330 41442 24078 63 20833 -14600 44554 44908
13825 44908 9187 37159 133348 235013 240941 177459 155583 74476 46314 95029 164907 191412
13813 191412 174778 118818 100739 71018 65872 116296 180994 135142 44480 35365 95562 76455
13801 76455 80787 178264 187488 181249 211055 287794 364147 313991 266150 237144 275233 278677
13789 278677 282323 356807 349885 278711 241163 296882 416112 459405 445420 396454 415403 468433
13777 468433 475243 497730 591287 697764 829653 847089 852306 865353 998002 1159509 1300554
13766 1300554 1488781 1659591 1878262 2196898 2649429 3198307 3722184 4372639 5380331
13757 5380331 6701929 8298933 10209142 12338670 14416537 16261410 17512050 17889223
13749 17889223 17458193 16267248 14619259 12719555 10958508 9382712 8077389 7226513
13741 7226513 6755887 6572015 6604418 6952803 7517723 8330568 9515162 11096791 13243858
13732 13243858 15999342 19537679 23555849 27801357 31695149 34715243 36387164 36393945
13724 36393945 34554033 31342993 27339370 23200684 19308752 16046004 13639385 11982324
13716 11982324 10979199 10519075 10582346 10972815 11655240 12794466 14508623 16922680 20051014
13707 20051014 24141308 29415032 35460968 41854999 47805575 52581901 55305663 55477512
13699 55477512 52976038 48232457 42173313 35694918 29494149 24273635 20296239 17607628
13691 17607628 15947780 15050279 14916619 15394844 16413480 18030968 20404487 23695680
13683 23695680 28103407 33941263 41179374 49440889 57872640 65581813 71387949 74205506
13675 74205506 73492484 69217238 62155506 53431652 44467320 36251399 29268576 23911342
13667 23911342 20174702 17743171 16292039 15462599 15284079 15710237 16745907 18328263
13659 18328263 20713946 24071760 28523999 34017204 40227249 46455910 52004839 55920970
13651 55920970 57430578 56286503 52577937 46847920 40079852 33215527 26880509 21683374
13643 21683374 17724532 14870593 12953753 11750480 11192441 10987419 11163030 11778655 12805026
13634 12805026 14388275 16625563 19453200 23023502 27166806 31448349 35234025 37988872
13626 37988872 39123530 38423342 35988139 32111312 27463790 22756588 18409068 14845708
13618 14845708 12031747 9985086 8647434 7761727 7233205 7051342 7140857 7399913 7869182
13609 7869182 8696359 9894201 11423003 13185537 15131572 17062977 18693732 19575014
13601 19575014 19633573 18781543 17155250 15023223 12740597 10489442 8468259 6844826
13593 6844826 5582025 4562893 3807729 3232324 2858202 2610491 2385568 2204388 2085821
13584 2085821 1969291 1939627 1902119 1936026 1917809 1783053 1683519 1649214 1624855 1592661 1496820
13573 1496820 1363570 1334819 1411835 1372003 1299339 1210171 1174659 1105740 1058868 1088646 1093120
13562 1093120 1150065 1120541 1064173 1075745 1230362 1330007 1270580 1309151 1434855 1596757 1741225
13551 1741225 1928638 2078724 2334806 2601093 2844051 3108871 3368917 3738307 4020899
13542 4020899 4231654 4589894 4917012 5159811 5360863 5582593 5813606 5984890 6056283 6152328
13532 6152328 6206234 6243687 6181685 6159935 6032963 5842517 5597345 5306533 5061818 4709909
13522 4709909 4311712 3915874 3513232 3130663 2714290 2344749 2023160 1750575 1512449
13513 1512449 1442453 1410921 1324250 1095102 869477 765740 761130 705595 630536 648137 605924
13502 605924 547637 582081 601832 609098 628829 630844 619474 732636 705697 640895 663521 607165
13490 607165 578989 580959 520999 523072 563104 546196 447387 379206 409189 460699 415997 324786
13478 324786 301032 218779 210021 155162 108570 118651 123678 194603 190862 255725 359773 313991
13466 313991 284937 240715 235902 240539 194383 208039 289749 252643 144950 68333 22282 64231
13454 64231 164367 190359 181598 124294 101369 164824 285722 264944 348720 368371 358025
13443 358025 351986 421146 516834 507581 541540 536610 518044 463776 457880 409194 339480 319626
13431 319626 348452 369027 302589 197938 193922 216696 355932 369116 357515 426352 355923
13420 355923 273350 231335 295654 345476 464300 540135 534851 605856 584324 517657 487628
13409 487628 467216 406369 318522 309440 267423 316244 377093 436266 448542 467061 464099 482555
13397 482555 466369 439603 391570 360508 359192 329148 343956 388680 309874 264872 265579 235705
13385 235705 196810 142824 123035 214637 319266 402579 430363 425870 411048 396523 428007
13374 428007 450159 479666 491211 502695 566920 586111 608841 595202 552502 517916 518318 488156
13362 488156 433087 444145 459645 439477 359820 299918 311915 326265 339229 368176 337879
13351 337879 352857 455533 457300 412652 385993 330739 318234 387744 521697 509399 494996
13340 494996 548257 533091 411233 455591 529293 548410 487275 402597 349304 409139 418730
13329 418730 386663 449125 438671 463746 425585 320789 345109 320914 351466 291535 291030 308970
13317 308970 279392 257724 261125 172653 139560 217824 228339 208566 190151 320629 459074
13306 459074 475622 466406 499378 493464 458113 438730 402200 339278 358628 333913 302235 203204
13294 203204 195433 245026 275056 265639 244602 228185 123833 99341 150189 244574 245479 174713
13282 174713 111002 35337 108899 130627 173788 268003 270395 196761 214070 249144 280440 330576
13270 330576 360881 343612 312486 216917 153096 123581 183314 194918 203693 154201 143204 95467
13258 95467 68045 85677 88175 118688 126124 156453 173226 183600 208912 268368 290143 302007
13246 302007 275160 312943 328293 346247 415670 474013 404346 311571 227199 248709 249846 301253
13234 301253 250970 269871 320402 266888 183490 224911 307758 266375 261884 338588 338803 340680
13222 340680 389230 434611 459682 481413 603048 601787 574152 592989 599177 487710 379050
13211 379050 321264 261266 231099 322745 308218 283853 299590 232403 250603 267840 306739
13200 306739 335016 329221 342633 291233 241554 268926 368634 411338 410132 415082 387062 311368
13188 311368 287232 265175 228292 181460 134459 141878 231889 234992 220919 143701 33897 16366
13176 16366 108165 187284 203285 166750 144083 169274 275272 407442 460576 503861 458859
13165 458859 372837 387537 413411 468175 382085 265305 231599 262493 245984 130104 166678
13154 166678 166238 91942 97373 121749 179688 171502 118105 158585 236867 241152 220241 196567
13142 196567 212241 207238 186395 175742 204665 116269 152481 275862 296422 280555 272266 270780
13130 270780 162754 162006 209894 155066 132427 56276 85161 181111 128200 81119 56623 76674
13118 76674 138940 223840 194569 168480 231226 257471 257263 211911 158431 200593 264971 296755
13106 296755 380362 409617 403335 449144 411303 282927 175833 212346 249627 240550 287018
13095 287018 259215 210441 229761 226608 205072 202682 150815 133852 178154 226157 174434 211340
13083 211340 264513 254242 225420 168321 142364 229013 247789 229882 143539 159800 207590
13072 207590 323152 396698 373209 356428 402763 462219 382458 406347 521153 603356 657773
13061 657773 736972 897233 1197047 1510623 1818663 2112287 2399280 2765545 3081005 3270248
13051 3270248 3264146 3130484 2864568 2504153 2138482 1813856 1575966 1267253 990136 855628
13041 855628 704952 671166 671007 650542 622482 584293 501959 407037 470067 569514 583277 624706
13029 624706 623535 642715 786866 864209 836611 895388 917280 931494 928195 919002 938647 985858
13017 985858 990777 1120283 1272552 1339126 1372704 1519595 1635236 1824794 2033110 2223197
13007 2223197 2332624 2536019 2731252 2865868 3114595 3466725 3837623 4251459 4744490
12998 4744490 5379017 6157249 7162907 8462682 10044489 11905957 14146712 16942103
12990 16942103 20494514 25144729 31014148 37773868 44468087 50169859 54387295 57013164
12982 57013164 57682699 55887563 52065928 47259034 42092753 36637053 31141560 26303216
12974 26303216 22604771 20194765 18831668 18294019 18626537 19697654 21392535 23914258
12966 23914258 27326331 31778390 37376372 43987316 51017688 57588452 63020055 67002246
12958 67002246 69348882 69696810 67783953 64405140 60693055 57246707 54475814 53009110
12950 53009110 53197499 54848677 57268131 59856629 61833329 62598401 62224790 60743731
12942 60743731 58223125 54481848 50054996 45374317 40540985 35706821 31280671 27743072
12934 27743072 25426050 24269970 24117458 24843808 26446455 28887634 32278483 36632873
12926 36632873 41726835 47071975 52341723 57499400 62189550 66050139 68961384 71021667
12918 71021667 72545673 73694945 74361251 74862395 75461132 76433992 77604796 78624196 78998190
12909 78998190 78350651 76631503 73697788 69346241 63832401 57528097 51143708 45163106
12901 45163106 39697375 35064008 31547586 29408065 28401785 28531457 29748012 32060440
12893 32060440 35747426 40645446 46530018 52709441 58718277 64232993 69295770 73540747
12885 73540747 76589594 78159595 78343510 77517034 75437018 72212579 69222630 67554603
12877 67554603 67773059 69953013 73655543 77879187 81856181 84999590 86511635 85670663
12869 85670663 82010299 76089618 68744126 60184769 51236232 43110311 36616800 31808713
12861 31808713 28415341 26116656 24862864 24708116 25369413 26949711 29693233 33559176
12853 33559176 38735489 44990867 51724541 58328486 64330431 69450353 73168634 74652194
12845 74652194 73280865 69124751 62764026 54951228 46072488 37085450 29267879 23342006
12837 23342006 19195401 16296606 14024903 12199010 10788757 9571460 8542812 7770359
12829 7770359 7085317 6293830 5626012 5118009 4646181 4214049 3923696 3617146 3311999
12820 3311999 2959306 2833705 2716958 2567311 2433479 2307050 2237125 2145196 2065255 1966472
12810 1966472 1894841 1874185 1740012 1596946 1509126 1504444 1442572 1436497 1424098 1469796 1366056
12799 1366056 1271350 1223813 1192559 1158818 1138983 1130303 1066700 1049671 1103048 1146224 1045498
12788 1045498 1042012 1102152 1124084 1072239 1099712 1084910 956162 832171 749761 656872 761283
12777 761283 830710 807090 779493 797489 806324 806922 803585 736271 613683 576151 495321 436012
12765 436012 439722 432567 470338 516836 477966 417406 373563 440666 556258 727057 881193
12754 881193 1060484 1212881 1275009 1364746 1303302 1270268 1316638 1316519 1166905 1141400 1124483
12743 1124483 1015649 1002230 999172 1073724 1026760 1005971 1029405 995527 981526 970015 946840
12732 946840 952713 980981 1050038 1035426 1087243 1079540 1119176 1138652 1214740 1286077 1341407 1387731
12720 1387731 1453362 1505932 1521506 1435708 1341534 1244679 1147418 1219433 1178969 1130852 1167242
12709 1167242 1217796 1205570 1331984 1432062 1477855 1537903 1612664 1785501 1941615 2040752
12699 2040752 2052744 1998402 1914937 1831803 1823925 1822487 1727990 1772879 1820919 1870710 1926330 1964271
12687 1964271 2033318 2206559 2317695 2390849 2486629 2668884 2768188 2855973 2922133 3052776
12677 3052776 3151751 3165162 3146655 3152936 3325037 3589848 3777711 3984470 4252827 4508675
12667 4508675 4750588 4957630 5183646 5478865 5819345 6085830 6319332 6658509 7075725
12658 7075725 7476830 7957355 8631853 9441197 10299710 11429023 12710647 14317338 16301042
12649 16301042 18730848 21827604 25457312 29582200 34253153 39669862 45937758 53114891
12641 53114891 61570723 71748376 84710268 102066339 126230896 160286706 206709992
12634 206709992 265287310 331455506 398537947 460866425 513251598 549604908 561688080
12627 561688080 545209092 502761147 443721185 376257829 306232296 238023751 177778168
12620 177778168 130623395 97888404 76815043 63062222 53737226 46917891 41669901
12613 41669901 37320349 33389727 29567366 25893847 22523812 19607670 17190895 15139032
12605 15139032 13427710 12062654 10956065 9983981 9042691 8310948 7739062 7167183 6695604
12596 6695604 6292734 5848894 5511057 5181756 4923023 4655086 4397059 4162941 3941745
12587 3941745 3726978 3649318 3482098 3339713 3208734 3044800 2920520 2771812 2672933 2630443
12577 2630443 2585737 2568088 2478320 2407462 2334284 2260897 2121754 1954528 1922258 1838532 1795938
12566 1795938 1762413 1709883 1654449 1598740 1605421 1567415 1519380 1510294 1443967 1434121 1460089 1403723
12554 1403723 1329972 1388485 1447875 1426338 1404463 1251359 1183091 1214907 1217833 1230293 1194101
12543 1194101 1192479 1164739 1139562 1144017 1174676 1119783 1152423 1156279 1129967 1139998 1062723 988567
12531 988567 951215 925788 954705 945600 978082 943177 918786 1012320 1058309 1077388 1155712 1212635
12519 1212635 1154468 1098656 1072184 989384 971249 1014278 1103827 1211153 1189906 1103982 1013994
12508 1013994 1095732 1151871 1120766 1179868 1294056 1342413 1451128 1593723 1740324 1818595
12498 1818595 1794193 1797252 1807130 1804636 1727757 1724548 1735989 1734741 1743529 1728442 1705145 1685991
12486 1685991 1721206 1777266 1784052 1860733 1838953 1941080 1961893 1812265 1716659 1640413 1539722
12475 1539722 1292236 1032487 857296 730008 577374 492375 442291 400783 435997 504605
12465 504605 580181 623635 606750 566498 550288 547275 553616 669005 785786 885809 951980
12454 951980 1004370 944131 923740 856404 843038 793631 815481 794566 798171 857178 819856 810830
12442 810830 801837 741381 778949 818820 822207 872528 1025823 1142289 1172534 1143327 1131074
12431 1131074 1218010 1343459 1385310 1429878 1489926 1534518 1534427 1510024 1452965 1537914 1537958 1474247
12419 1474247 1434723 1404704 1380524 1304819 1190734 1078459 1044884 1016949 1028786 998506 942395
12408 942395 939477 970337 887588 864213 847999 799295 782343 755291 692415 706034 734590 667519
12396 667519 706324 734298 760718 762936 767280 797170 825216 826022 937496 967356 1030683 1117527
12384 1117527 1223904 1257576 1203326 1259450 1312415 1324762 1292295 1296587 1258544 1192754 1185479
12373 1185479 1232021 1288898 1328164 1339011 1369933 1300259 1293198 1301126 1332388 1410109 1552857
12362 1552857 1602460 1650383 1796999 1929302 2029414 2122060 2231780 2425144 2590534 2793982
12352 2793982 3029400 3423808 3902853 4401268 4961433 5656846 6564725 7648487 8860370
12343 8860370 10265133 11899802 13896088 16299272 19297035 23034131 27793162 34023833
12335 34023833 42039300 52072475 63671813 75355310 84917913 89708244 87736788 78905995
12327 78905995 65760070 52419341 41687029 34156027 29473434 26794323 25613239 25728514
12319 25728514 26962564 29478330 33362244 38651368 45500472 53789388 63344840 73571503
12311 73571503 82991055 89269851 90237727 85452272 75954957 63722680 51143318 40010216
12303 40010216 31318000 25035813 20582378 17598414 15741812 14672325 14194334 14065219
12295 14065219 14224002 14617989 15188370 15799842 16532739 17457094 18652552 20248641 22527499
12286 22527499 25634558 29891290 35522520 42831513 51987234 62780201 74391652 85126267
12278 85126267 91976405 92772501 87337523 78061307 67572088 57415111 48596070 41910867
12270 41910867 37542960 35524329 35373210 36947791 40294778 45738082 53542453 64140169
12262 64140169 77942234 94643714 113426320 132644128 149172009 158756854 157594093
12255 157594093 145089162 125332687 103987549 84591579 68400296 55634812 46104050
12248 46104050 39405674 34970777 32472573 31698799 32556677 34862430 38859761 44651058
12240 44651058 51910412 59850800 67504565 73606354 76564520 75052747 68763798 59288116
12232 59288116 49027113 39632610 31795030 25703352 21197319 17827939 15416828 13817698
12224 13817698 12941577 12396670 12104277 12119116 12391847 12776649 13164397 13630603 14095830
12215 14095830 14886579 16045942 17807490 20404782 23939239 29035923 35970121 44787156
12207 44787156 54790246 64408454 71707819 75186190 74146333 68975672 61015370 52275534
12199 52275534 44445738 37955895 32601606 28369913 25342190 23509256 22897614 23412732
12191 23412732 25042528 27931850 32496501 39210489 48173459 58881782 69458997 76665385
12183 76665385 77926759 72859009 63409139 52238410 41450803 32392202 25422722 20290127
12175 20290127 16639077 13927497 11868266 10278020 9072315 8175006 7483999 7006482
12167 7006482 6604705 6126401 5650324 5198367 4606164 4005606 3495344 3111085 2811946
12158 2811946 2570528 2325773 2042771 1848663 1822743 1697270 1649072 1630627 1577839 1516804
12148 1516804 1495024 1424236 1313039 1182070 1105082 1107223 1117125 1059154 999169 992774 931502
12137 931502 844794 819407 871391 910299 983792 942909 872913 896856 1004283 1000458 917173
12126 917173 888403 848837 812107 779522 808806 828632 796734 868327 849511 764285 756125 685752
12114 685752 678280 669171 716268 763548 845904 845930 860822 811358 724586 744414 765069 717381
12102 717381 585619 565210 533432 534997 547156 559510 484691 505077 499989 446075 472629 490192
12090 490192 409690 368494 375729 449823 423316 298339 270884 259201 270844 279500 300066 387575
12078 387575 403104 409109 393138 380453 361241 387094 363713 341074 295658 235794 274586 292869
12066 292869 317578 391724 429749 491089 506139 501194 468993 435414 387389 331003 406932 524331
12054 524331 619991 630031 512630 353282 315730 315232 354403 467776 507480 486350 425485
12043 425485 398094 425936 449828 346934 267968 222230 265423 299596 431280 473055 432459
12032 432459 354249 268229 194014 197601 194936 112323 89977 89370 44005 105656 171885 254398
12020 254398 263556 254632 298417 349761 236009 139863 87611 22478 57520 35248 87230 198892
12008 198892 294579 263612 282891 318397 337693 313337 243516 184840 192839 120007 126923 141251
11996 141251 146563 184681 173710 201779 227071 255149 285854 302007 307823 272064 262855 191910
11984 191910 166461 130299 79842 115062 166923 212349 207357 150721 166338 190028 169804 158935
11972 158935 146886 129736 169360 224046 190375 129247 107875 88324 114623 98502 161017
11961 161017 183255 171344 178493 201757 194852 199499 201785 58924 -7110 43081 64884 60298
11949 60298 61528 95130 102836 67112 111894 157573 159677 161253 116565 105423 63086 27095
11937 27095 35190 50065 4514 -33301 18124 55860 86882 9973 93959 148832 59480 17598
11925 17598 -52519 -16375 36004 75384 80678 65778 28124 75971 114884 131360 116979 124419
11913 124419 133038 202033 138384 81656 62034 136957 196664 115425 84598 150203 104353 61337
11901 61337 31249 41741 -33647 19877 13688 37170 84827 120985 150519 92544 17128 135128
11889 135128 219254 185543 142567 174998 274126 353793 410168 468445 483157 531113 557702
11878 557702 555973 531906 461795 459281 388350 316397 227590 182038 238888 231587 225994 170061
11866 170061 212347 316580 432630 452568 408443 389260 482189 595726 625533 545790 441158
11855 441158 382691 309908 231072 199128 184411 246698 251027 216613 205531 232324 222262 202641
11843 202641 240656 236988 182901 204397 212052 165068 258630 248834 263758 325286 344512 360465
11831 360465 395928 457114 506839 551092 630611 661871 587562 557033 480277 305170 110495
11820 110495 87709 164729 309268 398117 385773 355252 473589 486491 494141 501211 664366
11809 664366 752435 873643 910699 872875 797070 745404 688438 635646 533886 424077 295238
11798 295238 320138 370040 347129 288441 297384 287708 316628 372315 431667 472928 439925 476189
11786 476189 540636 542934 487988 477803 427327 410114 341297 240301 205354 180837 179734 127616
11774 127616 80259 54451 126185 118053 185644 205399 180926 233856 194082 110059 141678 109547
11762 109547 61584 116751 208999 312859 391297 457162 359870 351331 378588 407147 386674
11751 386674 448237 420424 375146 290259 257105 287586 274465 252448 240330 189675 169990
11740 169990 243801 349506 396383 345292 271781 298259 297760 312028 347245 304917 283953 226574
11728 226574 169495 225700 193677 155107 103619 119107 88136 94483 120537 98563 70593 73945
11716 73945 41686 129918 144165 78910 25139 4187 58586 39329 -66731 -77586 -24898
11705 -24898 -17069 -19554 -45428 704 15705 -13007 19283 38386 61653 32887 40749 86437
11693 86437 14502 -35258 -69121 31659 90719 88461 83655 118384 42780 4177 -11823 25331
11681 25331 111474 115096 38532 35427 71416 99492 38108 4845 57816 65510 98201 151352
11669 151352 199060 171463 121316 127147 156701 141207 154062 147465 159899 185975 124314 86970
11657 86970 69621 -8409 -24154 56037 78692 35404 28420 50507 72962 90053 84816 97649
11645 97649 80381 57828 27781 4334 22035 49250 49320 67531 68602 59002 41306 92667 50921
11632 50921 69728 117981 191398 129098 130613 120505 115212 93075 6647 -58159 -49555 -37789
11620 -37789 14753 2793 -100479 -135231 -81539 -11345 67068 96181 118693 62171 9013
11609 9013 50874 112672 130623 107511 109588 125647 63010 14470 77597 85271 54357 15329
11597 15329 61494 120819 90076 76987 99585 49571 1756 38808 62945 120022 116234 48837
11585 48837 -26360 -35729 7921 51878 70964 68016 109170 130588 84898 39686 9712 -35172
11573 -35172 66958 118288 118711 104273 157956 192696 119703 32863 23427 49658 32057 56991
11561 56991 107056 88070 22233 -19994 -55325 -55970 2840 54538 6617 26566 46805 28644
11549 28644 2981 -106570 -70481 37763 113836 102912 78104 81862 157233 212756 223921
11538 223921 181764 150481 29577 -13747 -2303 43414 -53113 -54335 -25576 -74612 -4345
11527 -4345 108569 97287 130681 125255 128391 72323 35033 -20034 -54569 -49430 -79033 -23126
11515 -23126 71102 91393 -17 -3068 47636 86718 73333 11839 53670 14651 -13807 71842
11503 71842 158215 106972 26726 -17966 41568 43234 68407 73337 6624 -55622 -93488 -41677
11491 -41677 22945 21984 49016 17995 11598 -57018 -68781 37957 53028 56161 10411 -7472
11479 -7472 -1815 30287 1113 -42903 -18878 -47158 -107367 -35275 -21426 1412 -22781 -68421
11467 -68421 -111327 -62089 -17143 -52140 -55689 -38075 -9853 -45732 16418 102960 136096 112290
11455 112290 32054 38734 75618 87324 77169 114433 53767 16407 750 -6149 27962 30245
11443 30245 28238 69737 22243 -53292 -121898 -114649 -122981 -59369 8543 9572 -22299 52542
11431 52542 134298 193273 96235 60302 49465 115466 90742 27330 -19144 -23440 31994 106726
11419 106726 117664 38467 -21956 -56406 -29584 -40310 -31079 -23772 19766 37220 25489 -28929
11407 -28929 -109918 -104859 -128157 -110480 -106906 -43361 -18550 -14979 -3574 -74383 -68438 22073
11395 22073 45899 84978 23457 -22315 3072 -55166 -123616 -150893 -148775 -78522 -77179 -21846
11383 -21846 5727 41139 12666 -12336 18304 34368 6229 -50512 -119377 -170432 -198731 -159496
11371 -159496 -190759 -120045 -102617 -116693 -13672 -8762 -68668 -76672 -59955 -39168 -2021 -5960
11359 -5960 -59323 -100914 -75518 16449 40352 -75209 -112723 -23186 50557 62658 27368 -54553
11347 -54553 -81364 -60892 -67633 -93938 -121738 -27400 3478 -91184 -34503 32875 76321 56863
11335 56863 30580 -57659 -96102 -47356 36878 55286 35396 33902 65224 97147 62210 -3685
11323 -3685 -70817 -104725 -44639 25920 65853 21867 -16307 -24916 -5568 -7713 15020 42079
11311 42079 41965 48788 16635 -48225 -62435 -78300 -130586 -53753 -21968 -46910 -110937 -151190
11299 -151190 -104500 -58007 -27942 47937 -16292 2613 -56874 -110520 -134382 -83268 -22408
11288 -22408 27984 -52442 -89495 -76358 -65208 -33734 -60128 -109517 -64944 19901 -28949 -41910
11276 -41910 -32493 -18298 -18012 -16049 54033 72904 67208 29667 20394 32164 87121 117096 145193
11263 145193 85044 10594 -26561 -24231 -13427 1861 11021 62484 23223 9520 -31370 -39419
11251 -39419 -21908 -20069 -21530 -6969 62051 95278 141497 111381 83797 73640 47768 17131
11239 17131 -32843 -25068 -8242 -46213 -55807 22983 51256 108621 117299 88764 89376 93537 47834
11226 47834 -72182 -90428 -34059 26886 64775 80467 18806 10184 8496 -42994 -37898 -68581
11214 -68581 -107698 -79326 -48018 -48684 -15143 13457 5710 -30086 -32192 -20541 -29531 29491 -35212
11201 -35212 -32037 3357 -28935 -55229 989 19775 32175 2826 45086 22077 58509 101566
11189 101566 86730 60962 63660 42672 -28397 -40768 -67853 16769 -38429 -133811 -3556
11178 -3556 34260 -16113 -31739 -27084 -1195 3914 -53229 -20112 -9725 -51423 52867 -29438
11166 -29438 -95927 -103769 -117653 -132645 -30605 -19918 -133548 -98390 -41404 -53900 -50426 -26456
11154 -26456 -30356 1543 68087 116083 70727 -53318 -79971 -109052 -27357 -58161 -50045 -87832
11142 -87832 -96521 -111230 -130899 -98738 -8406 -52374 -141068 -111879 -104591 -101407 -20448 10436
11130 10436 -26669 -11840 14159 40268 22606 54620 63039 76825 132285 95566 65554 68898
11118 68898 122318 174403 182991 166956 121461 55969 -19190 58896 124901 186639 235244 108790
11106 108790 -13224 -40394 -58763 -26675 22210 5721 8443 13227 36226 39974 66614 103254
11094 103254 32626 -28697 -63124 -107157 -20989 64921 133727 87968 52694 66295 64085 74785
11082 74785 108339 58485 32007 43841 92409 97782 88804 34680 9759 116505 205724 176507
11070 176507 79298 49927 23299 5845 -18276 -22083 -6419 -57558 -15416 80122 119120 85289
11058 85289 136117 172052 162251 127639 98160 84043 126822 125025 115803 102214 184123 296466
11046 296466 234789 82968 144306 178175 188878 111998 84373 70787 33566 81967 109345
11035 109345 147277 131409 90188 -10185 -38846 -20352 -20762 -1057 -10191 -46138 14923 96769
11023 96769 65051 82784 118623 106009 48849 47236 34061 44004 33429 97187 27032 -64065
11011 -64065 -45589 62355 40264 -37012 -126876 -174878 -141372 13588 43100 -40869 13257
11000 13257 51262 10182 -36160 -92739 -77350 -41227 -6599 58904 66133 42663 -36383 -74293
10988 -74293 -88882 -84156 -58528 -35057 32145 42087 14879 2653 -25725 -41493 -44381 -38115
10976 -38115 -22486 -32814 -56503 -68324 -43959 4145 23469 -51694 -105633 -98357 -34644 51434
10964 51434 17141 -36725 -25504 -12463 -61310 -123599 -69129 -4293 17748 -21306 14296 19632
10952 19632 61179 56074 37153 -19966 -7736 63371 9047 -58703 6639 35879 10048 73465
10940 73465 21373 39 41759 27480 67725 76222 39535 -27473 -1518 -87714 -81315 -24250
10928 -24250 -25969 22626 -18395 21802 18508 -6131 -25675 -43893 -2608 136718 176459 137007
10916 137007 61096 80537 121040 26370 -16843 -10339 -77875 -66428 -57827 -32382 35756 43830
10904 43830 15168 84275 137241 28863 -59088 -68008 -68552 -88755 -165160 -148390 -126628 -77508
10892 -77508 -71576 -42453 -22533 -49507 -49911 -45882 -22057 -5907 -7350 -8935 -68444 -130485 -86234
10879 -86234 -17400 72224 26074 -85267 -99216 -71568 -75293 -84342 -117965 -157847 -176480 -127529
10867 -127529 -10601 77258 87297 36727 35180 -40471 -104263 -117167 -79998 -28100 -32673 -76184
10855 -76184 -65193 -45832 -66031 -84991 -40369 -25035 -68504 -87228 -57212 -3071 38079 -27184
10843 -27184 -120248 -161248 -124230 -84010 -78951 -7703 -57565 -50720 -8673 5539 35983 59523
10831 59523 57798 3593 19432 50871 130473 160829 64548 67386 27546 -22775 71067 67298
10819 67298 -7451 -75881 -90795 33420 55807 35367 38656 32708 31817 89034 48001 58711
10807 58711 -2768 -82640 -50509 -53660 -47746 -8537 -548 78979 146724 151028 12218 -30421
10795 -30421 -81849 -119880 -82395 -30208 -41138 -71412 -33777 -34846 -29196 15168 -29982 -40604
10783 -40604 5924 12085 7499 -18341 -6963 11181 9387 -52329 -100180 -53125 -9977 1780
10771 1780 -64672 -118198 -91303 -159985 -236022 -127148 -83299 -45862 19544 140980 154301
10760 154301 53667 47849 85902 95862 102317 44944 33655 139555 94137 52030 66747 29837
10748 29837 7018 937 -91127 -49080 21419 53374 77687 -43013 -135893 -96980 -70627 -135467
10736 -135467 -183522 -138732 -65333 -46034 -73072 -21284 24819 95826 197572 233762 199715
10725 199715 140608 117974 92095 -3357 -30379 44179 43578 -23072 -82873 -57637 21021 64445
10713 64445 103100 84138 77171 85703 53472 -15343 -3587 22699 60971 72291 90183 59443
10701 59443 66002 -4729 -76379 -96799 -43471 9660 -65077 -104517 -38765 22672 7647 4926
10689 4926 -19885 19646 28616 12115 664 -6520 -29311 -17824 -45252 -17682 -11877 -49209
10677 -49209 -103083 -52373 20802 6823 44470 99043 78702 61528 76369 69352 68771 60484
10665 60484 12327 -12697 -19423 48051 133677 148095 159934 198062 83091 -29969 -44026
10654 -44026 -49075 24977 133051 164152 158641 103624 53240 63418 108938 76930 84691 86913
10642 86913 -2641 -74024 -136962 -71061 -9585 -27331 -67298 -61423 37611 47830 -21714 -5711
10630 -5711 18861 50707 67317 53318 7913 28631 40904 -41751 -54509 -3586 12506 -61704
10618 -61704 -24589 32069 15594 49786 68000 68006 78429 126997 114014 82523 133358 161779
10606 161779 118269 142281 106438 86313 105507 94980 45346 -49737 -116456 -114728 -71351 -28324
10594 -28324 68665 157787 126472 88012 63801 67498 90675 73092 62031 147229 221869 208246
10582 208246 226883 276712 300991 303055 309174 286534 213125 112463 105480 109731 95592 45254
10570 45254 -26621 -108350 -165846 -104053 -78123 -63170 -25603 67622 134346 172972 158933 124891
10558 124891 90739 72898 100392 112283 65607 82250 100651 137009 124319 140815 86302
10547 86302 65422 45101 57636 12700 39876 26479 16643 77495 86336 133827 202320 226185
10535 226185 280878 305471 316810 271814 255495 193697 286397 348755 309352 266761 289403
10524 289403 355780 362212 346173 366604 375166 431961 411818 397839 409661 460780 478047 427262
10512 427262 437620 396998 346445 304823 261054 255316 333862 374597 403279 292008 189836
10501 189836 113677 8841 -53742 -99787 -70809 -78061 28843 119365 194855 185937 98475
10490 98475 -4877 27979 93801 120573 197699 246479 316011 388163 423703 510202 549346
10479 549346 722727 1034290 1287966 1287708 1031434 716092 468695 263768 181931 134406
10469 134406 71168 103478 103686 34561 -56821 -34224 41385 96216 84056 156352 148140 77621
10457 77621 48336 -25599 -114184 -137083 -80729 -1753 99546 150961 175298 213917 168927
10446 168927 142409 182055 167177 124084 85580 134774 104064 140738 137470 81032 87027 137078
10434 137078 159490 200568 182313 99869 66168 132836 191994 98495 3810 5987 68633 119575
10422 119575 158126 116355 62737 90441 97282 156224 108553 21329 52590 133288 115948 67923
10410 67923 115436 143562 103485 55986 69443 87419 58128 57312 49458 64423 51926 -12270
10398 -12270 -60001 -2388 52333 5585 57050 67112 92586 178344 161860 62301 39072 110086
10386 110086 95866 130270 63956 5721 -58813 -56424 -65779 -67370 39617 106565 92034 40303
10374 40303 -15148 15721 49214 41136 451 84642 112200 10889 -46317 -24600 29534 57360
10362 57360 36000 29324 32589 49136 60071 94188 190527 144155 61289 85467 52124 71396
10350 71396 76817 96896 105366 102788 6557 46628 99850 157073 211779 250814 276948 354874
10338 354874 356068 396909 459549 580997 519767 482886 454669 468396 438893 381424 324763
10327 324763 191149 105682 186572 72370 -30971 -97396 -15947 24331 35592 53060 117047
10316 117047 80723 24226 41971 54570 47235 107122 127546 127028 140379 55063 -9752 23688
10304 23688 53896 46539 89347 96039 58196 -1427 17874 76082 154709 135838 77649 54248
10292 54248 38051 24769 179050 255313 256976 256154 261696 264046 226809 153071 149371 143506 115930
10279 115930 66109 86843 109913 76345 108294 142610 111841 198160 181983 150545 109854
10268 109854 119251 134033 32115 13314 40096 84704 99308 119755 222647 267122 304994
10257 304994 354095 355518 344052 363379 354518 366167 304754 229731 243558 250963 305545 264439
10245 264439 243207 209211 178200 106502 159672 260903 330696 362766 417123 408143 388697
10234 388697 357609 254454 288089 405196 437638 424001 428608 436278 488807 574226 597197
10223 597197 715651 791278 774821 739692 716183 652690 685910 733611 712317 755239 753763
10212 753763 755897 820498 956929 1205834 1473003 1757627 1958399 2181945 2485008 2872966
10202 2872966 3017971 2804073 2463398 2236169 1981183 1651146 1305269 1002720 742824
10193 742824 630762 567206 506490 428977 434113 399845 297064 315736 367523 394644 378759
10182 378759 380414 388293 384454 413351 477014 486965 435316 407698 409345 319267 225516 298844
10170 298844 424015 467587 557346 595942 561292 526836 587327 635817 537912 491310 414690
10159 414690 382215 371796 263522 322909 403385 482654 557519 471212 437167 446225 487219
10148 487219 563575 547019 483944 539892 571800 584188 501547 369257 384071 452824 464322
10137 464322 395257 362102 334827 340219 353398 315066 362279 434567 491377 462161 443707 359247
10125 359247 246598 271004 319569 279857 294022 318447 298247 254834 288316 373133 391533
10114 391533 341105 320822 326864 276887 189009 211364 235712 317866 319908 274070 255797 263429
10102 263429 191305 159802 136680 119789 138827 67095 121185 219557 186876 206925 165996
10091 165996 82303 134931 234850 324283 344934 343510 422292 426262 366089 357420 382628 362844
10079 362844 304007 253005 294972 358359 382764 392687 380851 313229 267984 358203 470646
10068 470646 506300 436172 425057 452044 507852 589830 570965 592563 633074 678862 748056
10057 748056 868581 1028221 1206789 1394244 1590537 1882462 2309568 2936482 3703378 4862904
10047 4862904 6996616 10962163 16879649 22274018 23545685 18031526 9983127 5630149
10039 5630149 3595436 2613056 2042530 1606103 1265507 1075664 915149 869625 734512
10030 734512 566796 433341 482534 597214 687655 726400 676654 614379 544050 525192 482978
10019 482978 429235 329987 278201 354370 416470 428613 425363 404925 332317 248787 216262 245302
10007 245302 279929 277623 252364 245814 279721 208181 250850 299889 407103 369749 305623 303611
9995 303611 268494 273311 240424 200688 257751 277452 339608 305362 203583 134433 180981 185695
9983 185695 154767 213109 265494 214582 198361 253696 279284 279130 263564 270892 267928 245883
9971 245883 251186 205636 310982 357034 321688 266479 222988 252215 290122 288115 229495 204144
9959 204144 195841 90873 170310 245919 225686 221069 237369 323204 303815 289093 293357 238888
9947 238888 209158 177683 263772 425317 531775 561541 530076 485179 453413 459854 542353
9936 542353 559466 520908 573310 664919 659636 587027 502596 546218 629487 596895 649626 669257
9924 669257 656731 676779 781865 844925 963246 1062924 1203266 1277707 1401813 1516162 1654563
9913 1654563 1786665 1861535 2002679 2055830 2173218 2510357 3001945 3564237 4313672 5421154
9903 5421154 6973080 8747468 10074630 10535930 9857407 9187573 9289165 10464135 12838795
9894 12838795 16197517 19420321 20866321 19704754 17150962 15685337 15867410 17362046
9886 17362046 19885968 22728535 24969517 25652698 24680477 23175716 22008887 21357649 21469589
9877 21469589 22292268 23587342 24632881 24579451 23312037 21142886 18929180 17320744 16811203
9868 16811203 17282258 18643408 20829158 23721935 27084635 30567138 33704434 36290981
9860 36290981 38266174 39407125 39856549 40013779 40563712 41878968 43689629 45262371 46282403
9851 46282403 46390953 45514937 43976373 42049606 40022557 37982517 36184608 34700121
9843 34700121 33930330 34332893 35929185 38297160 40838224 43119398 44831972 45285461 44052629
9834 44052629 41576355 38808984 37012082 36879912 38213191 40246915 42062574 43025607
9826 43025607 43052090 42638826 42366625 42431317 42628380 42458934 41822107 40820390 40049087 40021777
9816 40021777 40837722 41736615 41976430 41459381 40258914 38320740 35531902 32296723 29439251
9807 29439251 27841113 27841926 29528572 32924650 37608020 43008064 48037895 51704035 53391821
9798 53391821 53034657 51528228 50034500 49358790 49513766 50214771 51672481 53692600 55007629
9789 55007629 54471344 51823207 47697503 43110644 39192267 36814009 36487428 38281860
9781 38281860 41840257 46884801 52570445 57737991 61529070 63707531 64671890 64709361 64019642
9772 64019642 63003935 62975009 64313381 66313996 67970330 68734174 68764112 68634552 68571701
9763 68571701 68249395 67261686 65123878 62125261 59241027 57710034 58421583 61300489 65346724
9754 65346724 68857439 70325336 69328674 66550079 63082057 59507891 56472171 54741877
9746 54741877 54717840 56389669 59138258 62004910 64599818 67030283 69213165 70943128
9738 70943128 71894938 71649657 69848024 66965462 63847976 61557833 60279990 59627954 58867059
9729 58867059 57148366 54233653 50392358 45767264 40600755 35416580 31041862 27997837
9721 27997837 26507023 26437275 27757119 30363604 33635591 36465987 37918385 37658413 36043684
9712 36043684 33894369 32165548 31262909 31060464 30944461 30346883 29020296 26745889 23599961
9703 23599961 20029707 16665468 13809274 11349292 9513260 8108577 7063704 6266742
9695 6266742 5695350 5168330 4742057 4301562 3937495 3767077 3588833 3394667 3273567 3281965
9685 3281965 3188214 3089249 3075309 3056164 3071893 3214863 3319340 3563887 3863707 4364953
9675 4364953 5143461 6252495 7986993 10197287 12456482 14170032 15378813 17046790
9667 17046790 19413429 20836979 19802794 16596871 14041462 12529641 10957547 8681075
9659 8681075 6248494 4535940 3505617 2904579 2528664 2204985 1942245 1846284 1733827
9650 1733827 1623211 1554994 1431122 1420922 1397148 1376897 1405222 1416223 1441282 1351916 1275233
9639 1275233 1211264 1158908 1126285 1079622 1081655 1079724 1042583 966802 933477 901599 892045 828008
9627 828008 779923 830277 872659 886563 862187 863695 832141 806109 807115 786917 732181 721702
9615 721702 742444 723506 743180 716207 693993 701975 709638 749532 767197 689481 724833 777953
9603 777953 811441 774190 759938 736441 640642 624725 657665 641022 656841 695875 733849 771693
9591 771693 849889 772390 745762 712489 703951 716421 637061 665982 819886 785936 758198 848037
9579 848037 872957 817095 855273 931496 971523 1071532 1173799 1169833 1132086 1084405 1120782
9568 1120782 1151128 1194903 1247596 1240730 1239788 1192561 1184142 1379733 1639199 1796645 1913581
9557 1913581 2001118 2120132 2311857 2444082 2736552 3001162 3290834 3693615 4154465 4711605
9547 4711605 5314266 6139262 7245034 8590545 10154547 11863977 13876172 16310974 19571666
9538 19571666 24049548 29850935 36483021 42900653 47254118 48516196 46700338 42771014
9530 42771014 37349318 31173070 25350138 20828401 17579058 15363428 14000060 13152426
9522 13152426 12838225 13026498 13649344 14709316 16345275 18408231 21027185 24380437 28391266
9513 28391266 32928802 37637457 41822772 44581022 45688887 45158943 43403713 40657240
9505 40657240 36731209 31987230 27264566 23205113 20024485 17820262 16395975 15619647
9497 15619647 15563334 16122164 17238646 18734251 20710047 23122545 26044220 29803051 34865537
9488 34865537 41473047 49898344 59801356 69655622 77850514 83173769 85420481 84663952
9480 84663952 80539952 73113187 63741505 54273734 45815387 38865983 33701718 30240816
9472 30240816 28187231 27092247 26804915 27599018 29363060 32071249 35844707 40889913
9464 40889913 47404262 55278065 64033548 72522505 79308410 83554021 85563722 86261651
9456 86261651 86141141 84354142 80620649 75596112 69953270 64346363 59001598 53891508
9448 53891508 49133321 44857577 41332801 38397348 35549191 32613492 30025338 28354758
9440 28354758 27641544 27946725 29364600 31818815 35141482 39203602 43833451 48803182
9432 48803182 53621525 57807796 60643791 61523307 60717372 58969552 56518935 53386607
9424 53386607 49712806 45483549 40848541 36595608 32838737 29654158 27281836 25901530
9416 25901530 25450892 26129767 27878229 30800243 34814165 39284715 43702011 47446672
9408 47446672 50517482 53511487 56753364 59953680 62408694 63982316 64814440 65201721
9400 65201721 65206464 64554008 63062194 60767602 57996695 54626878 50225952 44593190 38496464
9391 38496464 32779498 28056152 24444482 21934688 20273180 19413949 19219197 19523273 20371085
9382 20371085 21843750 24028320 26763902 30491384 35226555 40599329 46070854 50859745
9374 50859745 54000113 54714705 53120299 49853924 45142245 39069591 32252631 26003336
9366 26003336 21132404 17751156 15453053 13902577 12830247 12085183 11617971 11408564 11370699
9357 11370699 11530478 11996874 12788794 14027775 15660961 17725028 20238947 22964381 25550059
9348 25550059 27455477 28394196 28501059 27940633 26579205 24245797 21185848 18068773 15300703
9339 15300703 13051906 11412492 10251822 9457948 9056941 8917533 9007020 9381751 10018810
9330 10018810 10865551 12113368 13793557 16041681 18981454 22412518 25751237 28335586
9322 28335586 29568197 29200163 27345189 23978151 19730631 15484194 12097405 9783544
9314 9783544 8238346 7157256 6273659 5470184 4804200 4377804 4055049 3704280 3431274
9305 3431274 3237403 3025640 2898864 2812405 2700756 2516984 2326922 2159701 1923846 1754036
9295 1754036 1616223 1497403 1408088 1357234 1293498 1315145 1372815 1345027 1328084 1354943 1293883
9284 1293883 1271126 1288449 1325278 1333612 1293028 1293143 1292869 1212552 1156856 1103234 1037547 1020377
9272 1020377 1104831 1212452 1213037 1267323 1333594 1317058 1356687 1358286 1402559 1465688 1511103 1503308
9260 1503308 1398881 1161615 1000559 944631 958219 963476 973487 942064 911293 869168 833183
9249 833183 846190 907135 965760 984990 1007049 996443 999220 867449 761983 770125 764409 772395
9237 772395 735661 710537 748214 726393 740169 726617 697515 761208 837337 876369 959394 953051
9225 953051 929609 980472 913364 843774 841759 785675 747974 701270 590978 656420 782171
9214 782171 765116 794900 795856 807068 820560 850747 853799 840465 776619 727990 671229 605393
9202 605393 654818 657143 663554 585058 564189 587311 671874 694920 708872 705437 699789 606776
9190 606776 604594 711732 751136 686543 692816 692513 685335 752324 696219 685309 713949 793218
9178 793218 825190 787599 787201 778793 843488 811738 776620 693744 596374 568289 607487 623363
9166 623363 682873 666521 646845 692819 689249 680883 723240 801690 765738 738129 677126 670290
9154 670290 776154 838225 868282 847317 854503 863510 775620 707876 613979 605073 786158 820257
9142 820257 760601 705511 669077 610137 595232 713113 768989 777646 814254 857798 823056 760795
9130 760795 785262 785900 840589 902744 1009047 1020157 1036623 1070091 1045049 1033366 1032759 1059708
9118 1059708 1070445 1102911 1026314 974318 951086 957420 1012941 1016915 1026507 1061558 1071015 1063231
9106 1063231 1060600 1171856 1178027 1203072 1134339 1103383 1101852 1147048 1132125 1132553 1190815 1139106
9094 1139106 1132737 1140613 1094939 1084728 1134953 1094290 1042483 1096475 1130248 1066970 981693 1034481
9082 1034481 1039012 1012384 1079390 1129645 1232964 1259897 1196694 1198766 1204444 1278828 1329977 1325773
9070 1325773 1410368 1482623 1545731 1589355 1611971 1546756 1490931 1376584 1345953 1338045 1359221
9059 1359221 1436183 1397391 1324895 1329668 1274968 1292805 1299128 1321084 1396260 1484767 1514170 1572246
9047 1572246 1709112 1752316 1739785 1785722 1857544 1778472 1771683 1767048 1808127 1800991 1662963 1608687
9035 1608687 1644491 1598977 1489789 1427621 1387974 1347262 1392550 1454476 1498167 1650921 1733393
9024 1733393 1739794 1703302 1704281 1749492 1768527 1809709 1888394 1889989 1942889 2011386 2001153 1870270
9012 1870270 1851787 1818371 1850895 1825748 1779548 1763968 1799789 1754075 1747289 1764555 1780416 1835122
9000 1835122 1819284 1838221 1915877 1976911 2000687 1982797 2016204 2058042 2090633 2107232 2113336 2175763
8988 2175763 2212027 2361255 2341524 2263670 2300670 2357806 2328102 2323696 2319958 2332186 2337576 2339989
8976 2339989 2374574 2318233 2353083 2374703 2301974 2286498 2267918 2328252 2375358 2434464 2516971
8965 2516971 2596453 2674040 2729573 2824670 2930691 2876988 2773467 2750199 2776163 2856765 2828644
8954 2828644 2856316 2918834 2875767 2821089 2761951 2770559 2870548 2923510 2885580 2913531 2982772 3015926
8942 3015926 3069961 3104012 3157681 3272921 3400105 3536089 3524647 3619294 3706537 3660533 3682029
8931 3682029 3758121 3810765 3863067 3918504 3943808 3936903 3957318 3957648 4077702 4169165 4288176 4345269
8919 4345269 4356004 4493537 4676307 4720681 4774061 4882335 4978317 5070639 5136973 5244916 5362937
8908 5362937 5481209 5659780 5719323 5843836 5933971 5929717 6018758 6133023 6213237 6344288 6541913
8897 6541913 6685690 6784546 6910305 7056341 7155231 7332195 7527036 7736090 7986029 8211799
8887 8211799 8484948 8796656 9213436 9631175 9974345 10329628 10788881 11273556 11825851 12518599
8877 12518599 13375973 14610266 16423922 19046387 22928095 27906675 32181329 33353460
8869 33353460 30168012 24781354 20592949 18122789 16839267 16220101 15921377 15815390 15916851
8860 15916851 16212517 16567618 16937347 17275195 17575015 17948400 18351973 18820331 19314602
8851 19314602 19804037 20348711 20951414 21576811 22305718 23029295 23747289 24586231 25420204
8842 25420204 26342076 27326235 28292548 29281765 30345524 31485148 32555953 33765482 35068678
8833 35068678 36528228 37953926 39425206 41016007 42596183 44205069 46042629 48029114
8825 48029114 49997517 52068239 54270198 56477739 58798944 61185341 63730283 66431802
8817 66431802 69168336 71898766 74754718 77724426 80802399 83712120 86548443 89430464
8809 89430464 92389815 95275702 97977045 100602774 103085175 105334701 107249696 108890138
8801 108890138 110301598 111425166 112210802 112607668 112580147 112223606 111458931 110282746 108843180
8792 108843180 107124352 105145915 102911887 100508501 97864202 95032120 92113816 89148375
8784 89148375 86145576 83209163 80214497 77260583 74359826 71452655 68624879 65996984
8776 65996984 63434528 60952937 58537778 56210727 53944532 51761024 49655588 47692645
8768 47692645 45796181 43941195 42228735 40612796 39042801 37511398 36110651 34756464
8760 34756464 33494922 32264402 31140767 30024159 28945780 27985781 27009916 26050174 25168339
8751 25168339 24397197 23640158 22944512 22163896 21404793 20760734 20180223 19494146 18923366
8742 18923366 18407976 17838695 17268012 16810109 16429491 16038860 15590997 15168340 14734363
8733 14734363 14397372 14020558 13732664 13493455 13233504 12886876 12543796 12371004 12227715
8724 12227715 11996047 11767396 11776703 11915552 12374800 13168166 14132839 14686972 14300819 12748235
8714 12748235 11106062 10111355 9483469 9108327 8855439 8614845 8344434 8111757 7948819
8705 7948819 7761015 7536897 7383621 7265564 7107287 6931890 6753416 6594146 6525682 6399919
8695 6399919 6350561 6226183 6081851 5938567 5830841 5703258 5592174 5509821 5463163 5409946
8685 5409946 5302163 5251189 5231927 5168572 5094070 5070958 4976396 4782477 4739478 4773344 4705063
8674 4705063 4590951 4441405 4382791 4328422 4247053 4176919 4106846 4020470 4080433 4064778 3979888
8663 3979888 3944721 3909577 3868749 3780715 3747413 3752241 3666587 3521235 3504409 3544918 3550051 3518854
8651 3518854 3421848 3320050 3284509 3207165 3127782 3080628 3071833 2998942 2974231 2973243 2935445 2923501
8639 2923501 2827289 2770335 2766020 2644944 2619697 2644200 2562437 2587390 2618569 2538046 2484045
8628 2484045 2495841 2527212 2587600 2545069 2514385 2454399 2442040 2402653 2299081 2292155 2295639 2252193
8616 2252193 2207512 2222654 2267365 2289453 2345228 2340911 2256518 2236126 2243288 2264156 2345389 2313303
8604 2313303 2274551 2297564 2260067 2350254 2365409 2395438 2462494 2481751 2366147 2322697 2327595
8593 2327595 2308052 2315654 2438614 2521050 2440658 2367720 2287828 2284054 2356920 2237649 2081122
8582 2081122 2024602 1954771 1890212 1822836 1832216 1809071 1671555 1599653 1623676 1593198 1569100
8571 1569100 1541802 1449412 1433262 1450508 1459415 1459806 1455504 1512498 1507306 1404278 1418504 1413390
8559 1413390 1420605 1390312 1392551 1428689 1388652 1313170 1239417 1232327 1218761 1236224 1238927 1282187
8547 1282187 1377234 1357520 1333434 1308065 1315585 1298419 1330578 1285927 1301653 1234145 1177639 1172979
8535 1172979 1259936 1279568 1256959 1331713 1312335 1264574 1372446 1437710 1449375 1449883 1557707
8524 1557707 1644193 1716262 1813989 1909611 2053407 2059145 2050460 2186806 2442651 2597988 2862797
8513 2862797 3051270 3151249 3103304 2900056 2648228 2412579 2200240 1954575 1697229 1514214
8503 1514214 1427038 1311671 1179304 1117996 1090538 1041889 990470 1015273 991353 975686 980190
8492 980190 912338 909024 929267 995556 985030 880159 896733 964263 932924 886836 852364 756284
8480 756284 716000 823466 816728 766329 765017 712035 716476 777503 818728 883523 838504 745034
8468 745034 755226 754369 757880 719139 731369 735633 734880 749377 753263 738460 743049 682944 648601
8455 648601 594906 620146 622932 639423 612298 643142 693449 751788 802821 753102 678667 573964
8443 573964 543746 603710 645793 657710 629969 590191 542666 579237 659879 772502 814235
8432 814235 732968 672205 622493 586154 574198 585677 557062 612043 609008 647847 651894 569419
8420 569419 504935 479559 511899 504087 582183 591034 541278 520606 522941 592966 595302 606060
8408 606060 583651 570108 544772 524482 434364 410668 439051 456017 457528 516354 567043 610449
8396 610449 601214 562776 563687 565572 559449 556191 565855 555714 599783 608541 612851 603404 542244 479363
8382 479363 444841 429570 439188 434588 446176 491565 482880 408383 361992 396199 497148 550353
8370 550353 543895 511967 513830 550188 537734 525188 518357 513072 497943 497408 517902 576996 589875
8357 589875 603343 583042 612831 690649 757361 836852 957501 1190658 1399998 1524804 1578656
8346 1578656 1476918 1176677 861588 647522 566259 482034 430392 437217 400075 416952 426289
8335 426289 362307 416595 476036 487191 439740 485312 473184 373639 326814 315752 407502 430980
8323 430980 481372 517372 519342 594859 588133 620258 636605 687510 739152 780906 775101 976811
8311 976811 1168448 1276188 1398614 1516983 1490911 1256526 972021 735247 620844 564346
8301 564346 450163 422206 386415 310896 311521 341449 373994 416593 464625 462567 497735 504095
8289 504095 408402 364912 352359 401453 440724 423794 397627 348504 363313 336744 291032 284662
8277 284662 287916 258334 256531 234104 271082 340919 366638 428933 478172 497856 504237 419285
8265 419285 392690 354562 312532 331191 261195 203782 219805 241753 220533 175813 180025 233810
8253 233810 192757 151299 150633 195444 271365 212229 193311 232135 297778 328308 331025 295547
8241 295547 186569 157448 152517 132455 188604 213938 205293 219360 185560 171604 219425 195532
8229 195532 137480 119896 168213 270886 293816 290457 335181 357723 323968 199477 179833
8218 179833 235982 188715 288454 300911 264031 272019 259532 265806 176243 149985 225242 270303
8206 270303 369126 416815 353424 376335 438369 420301 323233 280350 323609 299174 225878 194693
8194 194693 220379 235950 197422 211512 290971 261823 231475 230866 218226 194354 234403 290275
8182 290275 328015 360055 225788 138244 170681 273973 311623 234797 228111 227458 259767 297220
8170 297220 313287 286080 276207 209798 132596 160132 264415 235680 232121 241032 254004 282370
8158 282370 270561 185484 201405 215275 256904 275710 301166 349979 409929 417778 316482 292270
8146 292270 188215 169805 206086 287748 353533 307402 255051 214987 134939 122675 201848
8135 201848 247413 183177 145883 88542 93720 127080 56757 106746 123828 181950 202359 205565
8123 205565 173271 169022 170039 171455 135732 109379 181264 269341 335919 324091 282149 262201
8111 262201 257263 260588 258659 211196 189594 282221 364851 332634 355852 411989 402117 305156
8099 305156 274182 294604 336836 364117 324510 291748 247015 266501 311768 336431 286731 242056
8087 242056 286109 255715 250430 213591 278668 360803 323360 292087 232980 233116 228744 204830
8075 204830 181656 182143 176347 159878 112249 153802 96159 102329 202105 241819 209062 115452
8063 115452 134710 147111 171534 240909 339403 387411 400445 354383 293243 330246 347258 357234
8051 357234 289905 318658 347270 299507 284401 236865 156696 204036 246175 326305 347558 263202
8039 263202 265716 272785 248328 281570 307652 341626 310447 241712 216830 249124 266487 192218
8027 192218 179651 139338 133033 268187 335939 331425 229418 119424 108239 119527 217316
8016 217316 218569 173822 165403 179062 198641 235170 250127 276300 298785 292371 317656 372649
8004 372649 421940 412669 358760 220232 182368 186457 300147 387021 367561 304212 265109 258936
7992 258936 212081 279698 365100 290725 220137 250292 197594 149665 107335 163643 144991 108748
7980 108748 137406 214582 277747 252726 149276 89688 157047 233041 297405 238943 253168
7969 253168 210242 142657 91552 159115 214326 172720 156880 198256 230102 258111 251146 221354
7957 221354 205355 264525 310700 277909 218962 180935 189100 208190 143215 116555 90440 77190
7945 77190 151457 167418 183592 251824 273508 217280 153473 244611 267323 223790 212780 211374
7933 211374 128698 85563 56313 109564 136280 136342 205244 161138 131547 174959 216483 206712
7921 206712 218197 213153 122019 163419 269280 289464 315898 178751 55559 76658 22027
7910 22027 68408 132493 111492 74320 77715 111488 173842 147383 89591 10765 17008 21947
7898 21947 79452 68953 65199 55650 121762 213937 228732 212870 207350 204179 180176 130843 74597
7885 74597 54016 137811 186831 173994 226526 182926 105220 77290 38831 34578 133399 167984
7873 167984 138405 167822 171479 153362 161591 122282 138691 173815 78495 20792 142322 228197
7861 228197 168795 137197 82440 154738 190309 187644 128115 147281 201601 175814 242620 233340
7849 233340 204990 136363 103504 106699 116426 81059 54203 20005 -37533 26094 122157 175443
7837 175443 128520 69859 55202 102126 121687 86289 44934 94634 98550 82685 70637 79222
7825 79222 55116 73503 23035 28706 26750 9984 -16754 -2912 25292 43898 517 -4490
7813 -4490 -5339 31280 9370 12132 38002 52795 79902 82561 59584 50486 33841 65177 47142
7800 47142 10619 56898 130025 76336 115233 85787 118120 82026 995 -16259 8493 35001
7788 35001 31212 25127 54076 47146 47216 130754 155535 140507 45676 34118 110154 161601 127144
7775 127144 112733 161676 201662 199991 93643 65962 164832 203482 210619 158658 85572 31756
7763 31756 -12189 44768 63207 81090 56887 89221 57816 23097 744 20591 96229 68098
7751 68098 106803 74798 66013 46550 3075 59048 83198 47971 -2057 51000 66103 80916
7739 80916 104845 140510 96479 96497 133296 239598 259901 265294 270644 249839 105326 10792
7727 10792 23274 59484 82244 68257 110299 192494 216559 206907 203269 142303 108767 98742
7715 98742 101121 27789 28796 62757 19793 26001 91382 69817 23821 -30354 -30646 -31822 -89854
7702 -89854 -123242 -100926 -126868 -133827 -87626 -78487 -20876 -51066 -64266 -74082 13401 7899 -113440
7689 -113440 -143871 -175422 -170079 -101026 -38295 58525 116094 135586 70482 -46584 -40378 -24364
7677 -24364 -44840 -33275 -12454 34084 52358 65915 23717 -5007 -40727 -85010 -58980 -30340
7665 -30340 -70309 -72515 -19547 -3145 21319 34601 36418 93697 57165 -45312 -30822 -18208
7653 -18208 58771 99379 107595 70345 51413 129771 171747 155838 158234 146163 118600 113272
7641 113272 78545 50179 70402 46561 -9881 33526 50566 50329 106280 91344 68552 76415
7629 76415 74727 2028 -8935 56554 118344 91153 35211 22398 44472 11564 20060 33272
7617 33272 86389 99371 84742 62113 80892 139234 17289 20358 41454 -17488 -39491 -39843
7605 -39843 6731 83648 149843 214592 193380 68537 71807 -9200 -57554 -60285 -68705 -90243
7593 -90243 -80095 -102035 -28829 97149 163078 107077 26281 34616 78912 32964 -42476 -108988
7581 -108988 -95725 -44897 19088 66457 15808 -61978 -113567 -55010 18222 10976 19855 -39621
7569 -39621 -102435 -101062 -53220 36633 -13833 -21318 -7162 -37179 -68213 -48000 -40003 20867
7557 20867 44637 26319 46720 34335 -10141 -75384 -68034 -29940 19695 91027 128197 66770
7545 66770 23041 -21729 -24514 -40407 -15751 -49120 -119520 -78505 51851 71542 48627 42906
7533 42906 35518 14411 7728 1369 17448 71863 109174 127488 60249 28884 52108 14162
7521 14162 172 -2851 103614 61389 -150856 -66739 59774 13093 -63109 44125 91155
7510 91155 -12053 -43719 -37231 -29525 -24011 27688 38049 75957 140572 116966 108722 148084
7498 148084 157934 82358 -13062 15970 66127 88061 71513 45682 8103 -73302 -84178 30321
7486 30321 112318 139976 186660 115608 110873 74684 140140 82430 47242 44499 59871 65740
7474 65740 53740 74641 92433 94514 -3684 16303 32499 2712 30288 121579 114024 80830
7462 80830 81070 79215 67005 107152 114886 115658 78241 98673 32792 -82701 -88503 -106902 -147736
7449 -147736 -107358 -93804 -33571 -55746 -116892 -146397 -133005 -119575 -70350 -54544 30538 80014
7437 80014 81602 35999 79395 125629 36455 -75127 -129971 -112502 -49537 -52371 -121936 -192837
7425 -192837 -213132 -157882 -54468 22136 30373 -11112 41056 29698 -16018 -54245 4854 70931
7413 70931 90353 18651 -6468 24813 -34483 -28231 2654 5491 36746 57342 -5840 -11452
7401 -11452 51497 55324 -21013 -19026 63247 120211 159430 56113 -65831 -39109 -14218 -49357
7389 -49357 -70226 -78043 -61640 -54250 -51008 20341 19946 35282 -60416 -137342 -109265 -37634 -21281
7376 -21281 15714 108238 108859 17681 -41585 -60548 -41573 33352 59507 73055 72932 70786 107187
7363 107187 152608 121375 47617 16040 31454 36785 59325 65163 670 -93512 -84341 -36226
7351 -36226 45630 92761 46528 29812 -7127 -1066 -8385 -344 69267 118602 122690 197083 182831
7338 182831 85140 8180 -54080 -41811 6060 91770 127917 82342 9741 61277 77314 34768
7326 34768 71854 84792 154952 177043 71623 5483 10285 47093 113790 120522 90998 43749
7314 43749 51786 -28652 -74937 -53252 -47936 -1799 39640 12703 -47092 -59890 -17956 -23091
7302 -23091 -64923 -41777 -30548 44628 15815 -39694 -93001 -117192 -146581 -165489 -123573 -76983
7290 -76983 -69870 -24424 10235 3495 12666 36152 94505 94677 28590 -72046 -117816 -65990 -2928
7277 -2928 92566 105371 74015 39585 -44878 -63179 771 46310 74040 6692 -6397 -80200
7265 -80200 -61560 -6739 5738 -21274 -56302 -88979 -54201 -12492 -26469 -92530 -115508 -94266
7253 -94266 -28769 6347 79015 107677 73913 85461 64585 79730 71934 -25228 -68094 -6166
7241 -6166 86136 153296 129024 58839 10360 62085 116306 145526 131472 87391 65170 102109
7229 102109 112368 85483 29667 -28790 -14187 -7374 -61443 -60188 -49563 -72544 -51188 -15298
7217 -15298 -20911 -16340 -13575 21635 52229 76570 83724 41115 47413 107432 110698 65134 11006
7204 11006 -17891 -20470 -7779 29990 57937 54542 12736 -24763 7316 -5354 24659 4985
7192 4985 -47289 -111325 -118949 -154903 -123790 3109 31255 32723 63044 36605 107136 84909
7180 84909 63828 66582 63786 8079 -32320 30356 60248 23984 66730 164942 125808 78482
7168 78482 139690 132213 143308 86639 56912 23648 52589 47462 88182 6240 -43941 -24124
7156 -24124 18705 78296 119143 102572 174750 185230 91663 34117 84954 84625 34679 58801
7144 58801 88483 85515 73813 46497 5526 -40043 -97613 -114174 -76508 -19292 62880 84838
7132 84838 31471 10059 -39023 -21264 -70301 -17780 30300 -14238 -38147 1086 2121 56101
7120 56101 113686 60300 65478 79120 66600 102356 107986 93625 74639 61899 8246 -112143
7108 -112143 -134645 -26767 89769 156609 90649 44553 149658 115917 113403 115652 111231 3718
7096 3718 -20947 18203 29786 43581 52063 26246 50612 46798 56957 35183 51728 18511
7084 18511 22370 23961 24253 69575 68539 29462 120207 81990 72022 81873 102399 78850 13964
7071 13964 22476 75994 54366 127316 129108 77431 58869 -16623 -18355 -5419 51789 -14812
7059 -14812 -144304 -141092 -51523 -60209 -11862 -1188 -76498 -43097 -44174 -22343 89766 85608
7047 85608 -20996 -110666 -159196 -161708 -155291 -137452 -96379 -90972 -104452 -83409 -69987 -9031
7035 -9031 16620 -33731 21152 62487 32610 52559 -14463 -110538 -102553 -84445 -95949 -137569
7023 -137569 -128290 -120770 -46175 10237 -2121 -17212 21584 83851 114864 30932 -25718 9649
7011 9649 -16226 -40946 -48688 11655 31572 23337 -11799 6031 31846 -2560 -28506 -9683
6999 -9683 103120 148330 155400 74052 18690 -58024 -88672 8670 34656 36200 52350 -12449
6987 -12449 -7291 31919 31819 -980 -17540 -53845 -101210 -138822 -16829 34120 35618 41173 37235
6974 37235 28303 52139 69689 17683 73891 35325 35028 -41112 -71175 -26874 -15331 -20199 -32387
6961 -32387 -134986 -87778 -55 60287 32437 27689 39239 86252 62368 89589 75381 25299
6949 25299 -32226 -106082 -30378 -66137 -48216 4329 8720 48232 41593 -6632 -10566 -57597
6937 -57597 -52304 -11735 -58290 -45970 -33905 -63609 -84592 -126661 -28392 16317 54355 30905
6925 30905 -23117 -55589 -66501 -35508 -62157 -132286 -192838 -132541 -69567 -2536 48216 27584
6913 27584 9468 -37703 259 21233 16591 -30844 -26353 -9803 -4524 -84737 -102483 -72824
6901 -72824 -18344 58116 20893 -156 -35646 -81413 -98260 -90997 -140071 -103096 -84923 -46788
6889 -46788 -2224 68309 -6480 -101288 -162821 -56511 49218 128150 172402 112335 57398
6878 57398 39501 4594 -86927 -70837 -6022 1334 6146 53043 50231 17820 718 -16568
6866 -16568 359 -14250 -4560 49641 52901 81335 65309 5667 17054 101664 187923 179157
6854 179157 208689 180118 77741 85592 -25367 -138190 -61346 -47339 1472 -4975 -51695
6843 -51695 -109031 -75871 -3259 44907 70425 117596 103460 30544 8156 -7678 -65350 -55154
6831 -55154 12967 38529 71481 109200 -25748 9011 46556 44273 57322 44752 33347 51678
6819 51678 8166 73161 119850 180911 209386 137456 62985 44651 -13235 -43028 -4545 -3710
6807 -3710 71992 94527 73105 5513 -138879 -148124 -95884 -89818 -40868 8099 -85910 -84551
6795 -84551 -100428 -142662 -141205 -117858 -61542 -65391 -31848 42575 40381 -22688 22231 120056
6783 120056 129813 69472 94174 137008 171630 122884 60263 16238 -8228 -28632 -36875 -49703
6771 -49703 -91824 -96683 -143295 -103278 -30709 18887 -13919 -33109 5088 58881 88092 57028
6759 57028 44909 95853 182544 181791 63114 44626 65004 -4299 -33122 -778 -11272 -7265
6747 -7265 -12225 -57897 21944 39262 -24068 -44131 -61342 -34916 -32035 78436 152569 171139
6735 171139 131655 85482 103456 99316 -25688 -133979 -220687 -114532 3721 88671 88929
6724 88929 81706 21260 11763 101818 82493 48249 86102 164444 150232 45514 -5819 -33355
6712 -33355 -20644 -24056 -9471 -37465 -29260 9490 389 7905 -32796 -139087 -125669 -82194
6700 -82194 -65710 -98323 -78769 12129 9623 46894 83879 29724 -17804 -29656 37839 70664
6688 70664 34071 30021 104185 103217 35761 10696 4496 -79686 -88215 -9884 37095 55438 14221
6675 14221 39441 20361 553 2679 -31521 -45499 -19445 13975 14134 1106 -43392 -124815
6663 -124815 -104764 -90647 -90379 -25404 59721 27775 -57379 -96828 -90540 -75474 -1353 -39290
6651 -39290 -153612 -173301 -98779 -76645 -84266 -57973 -49189 -28520 -5248 -43693 -118733 -93874
6639 -93874 -83802 -95564 -88249 -67690 -62046 -30964 -17688 36035 48043 89894 253 -48773
6627 -48773 -48999 -54717 -39245 19449 -22858 31623 43619 35830 29843 -2029 -60068 -4509 59081
6614 59081 -10335 -32629 -22753 -24509 14746 102277 103419 102951 110994 55258 56267 20652 25047
6601 25047 69340 26305 -3616 13872 -39548 -53197 -56379 -74785 -16975 -18202 2142 11921
6589 11921 -6325 -78745 -13164 35624 44867 48524 92909 31134 -19241 -532 -46387 -71674
6577 -71674 -14942 25110 51300 47097 42770 59727 69293 102755 137235 109251 84871 72189
6565 72189 68616 3742 12892 39105 49200 -10621 -35142 -10010 -3871 43096 81812 84937 125238
6552 125238 141396 63068 -16019 -79868 -33497 -19661 -54975 -10394 -70113 -102927 -76425 -29
6540 -29 38733 31461 -25066 -51839 -40918 -27924 -41630 6907 -19748 -49104 27886 74683 46858
6527 46858 -48321 -80313 -46836 -66818 -135409 -127361 -133765 -39576 21916 -31413 -72675 -72475 -47059
6514 -47059 -34046 58961 96935 99602 52372 -17357 -88207 -102179 -43346 -45197 -78908 -41449
6502 -41449 -13375 -24688 -30648 -59425 -69310 -149699 -105206 -38105 -23578 6688 -993 29031
6490 29031 77739 66824 33627 -14413 -53501 -49497 17244 15655 103134 75997 -14353 -81206
6478 -81206 2612 35010 15497 -70080 -127524 -119629 -78681 -41173 32782 -15772 -74644 -47244
6466 -47244 -64213 -127995 -107230 -58394 35833 63128 6835 -51687 -21250 -50685 -63826 -96830
6454 -96830 -48604 35676 77908 59284 -44800 -80751 44192 144622 141326 73941 3838
6443 3838 28205 80330 43645 -30415 -22587 -63067 -82082 -32097 -24245 -895 -19002 -74316
6431 -74316 -87272 -86392 -14974 -57987 -64974 -57832 -26598 2983 18059 57206 158967 130259
6419 130259 42630 36595 35631 29587 -56173 -133226 -148104 -128755 -45681 -43235 -44395 27913 48294
6406 48294 68273 63582 34593 50260 4970 -51634 -3857 -17794 26042 17524 31081 44203
6394 44203 -20923 -46241 -146015 -161379 -106745 -94600 -57207 -42544 -58587 -13410 -1232 21858
6382 21858 -24045 15258 16573 738 -32763 -51882 -73514 12155 16740 -95711 -100023 -60198
6370 -60198 25599 81655 34069 52224 66259 -34520 -8410 40391 41316 72148 69581 20839
6358 20839 -4172 7767 58648 115974 143570 129124 46650 876 -35764 -95194 -157865 -238609
6346 -238609 -196151 -132676 -76152 95738 127066 187368 176304 118191 140879 127199 41273
6335 41273 -8043 -57471 -64314 -57937 -68039 -74765 -35240 23703 -78108 -89038 -114679 -37470
6323 -37470 67961 43903 -83178 -267064 -337495 -238621 -95284 21719 103872 51738 -78575
6312 -78575 -55410 -2077 31959 82011 149047 116610 100490 97946 62762 113359 167904 64463
6300 64463 -29574 -43332 3243 -2518 -26622 19239 90044 186377 181081 108861 47674 50233
6288 50233 35735 33872 4015 -80136 -46421 -85684 -57925 -31401 -74602 -90194 -149496 -120725
6276 -120725 -79985 -5296 20518 -16987 41832 89881 121717 76930 79402 52797 1503 -10493
6264 -10493 -66561 -103043 -31342 20676 5299 18356 13351 -9993 1956 -35715 -120594 -105108
6252 -105108 -127820 -158024 -96312 -37119 -111873 -234845 -269363 -242420 -176522 -83979 -84659 -118851
6240 -118851 -170083 -144232 -74305 -30141 -50109 -63070 -53838 -79897 -95492 -85750 -35413 13589
6228 13589 6318 5352 65245 133694 129569 108010 16908 -103019 -128496 -127488 -71731 -44415 -33202
6215 -33202 -45818 -81752 -59007 -81167 -120864 -119184 -70295 -6327 -19204 -67431 -101366 -103580
6203 -103580 -80359 -66096 -18879 -44940 -68924 -64545 -64006 -106111 -60568 -1983 -39611 -41910
6191 -41910 5366 56123 71695 59489 28123 -12066 -54245 -11435 6402 -63912 -65365 -122991
6179 -122991 -109811 -47334 -47456 -85287 -45444 1709 -22833 -34698 -9639 -66860 -80204 2698
6167 2698 79313 56460 1651 -2262 -36490 -7883 19816 -6390 35983 87834 69669 12126
6155 12126 -2023 24963 4358 35951 56042 38772 -25131 19876 22189 -64823 -55106 48419
6143 48419 91771 106170 97118 149477 166377 168399 165492 134848 85979 48253 -20323 -79703
6131 -79703 -28776 16836 -43388 -81085 -56447 8838 42528 71136 70794 19954 34289 -41231
6119 -41231 -107089 -69065 82592 64440 36483 67405 86458 24215 44339 -13342 -4843 -72356
6107 -72356 -34918 19420 72652 75045 87838 127647 92492 108809 2458 -55644 8044 50913
6095 50913 66029 18623 -9671 -46552 23911 29256 60123 82793 45745 15555 -5357 22897
6083 22897 -8720 -38837 -28080 -46348 -59174 -104797 -58049 -31301 4336 36818 40212 29166
6071 29166 26782 33594 57790 104193 129668 151989 64835 8612 37188 -19423 -83156 -30551
6059 -30551 -5681 -928 15628 43144 24906 43260 80727 145977 76386 46809 31885 790
6047 790 12437 1228 -17633 18993 18907 51951 41383 49788 25270 -81590 -44952 47177 58238
6034 58238 102763 59311 39291 55648 62989 58593 38483 13344 98287 109722 29010 -54450
6022 -54450 -68702 -109395 -103708 -3596 80367 71244 26518 -25570 -107520 -147248 -109074 -50170
6010 -50170 -71767 -51191 -25726 -62135 -103185 -93594 -89422 -127136 -222811 -263387 -199558 -117592
5998 -117592 -118197 -149566 -205682 -240350 -161011 -24669 3224 -75165 -162629 -128361 2090 -25055
5986 -25055 -141870 -81939 -55112 -24718 -15283 3107 -7540 -59517 -89446 -84821 -47310 -55742
5974 -55742 -38676 -18455 17579 -18133 -42563 -72852 -45735 -10948 -58703 -98173 -64039 -100983
5962 -100983 -83199 -63206 -98269 -44512 1770 13127 36060 1492 -47760 25970 107313 91046
5950 91046 85535 118395 85334 80483 31140 -7468 -15344 -3685 49671 105134 106449 124104 66733
5937 66733 -7991 -11850 49385 111066 167031 188071 169925 120073 81993 103816 77121 -2340
5925 -2340 15999 37108 24633 -20025 -46844 -14549 -52161 -81341 -92323 -100451 -25150 -3111
5913 -3111 -23174 -69489 -64732 -29431 36826 45463 60253 36218 30385 -18367 -33903 32607 135101
5900 135101 175184 179507 119066 59998 16527 -30188 -33590 -15787 -19452 44703 75655 48763
5888 48763 60544 51029 -21443 -25360 8854 -60579 -55576 -37588 -33894 -126501 -149852 -95922 -61257
5875 -61257 -61269 -56637 -99723 -99963 -112061 -101449 -34135 -10489 -24562 -47584 -5114 -131837 -204849
5862 -204849 -116164 -89491 -92498 -52125 -111231 -148537 -100713 -35960 93004 99754 75303 44885
5850 44885 43058 -2802 -41171 9992 -42653 -64740 -100692 -81504 -72730 -79696 -25379 41454
5838 41454 -1154 -66081 -79401 -14924 18636 51152 23665 34148 61567 19508 39212 26683
5826 26683 -17836 -44467 -48481 -52223 -24198 -15312 13490 12242 -55 27830 -50236 -87754 -100434
5813 -100434 -111103 -122549 -103865 -73885 15167 48925 17313 -42589 -140131 -160095 -204450 -217428
5801 -217428 -234814 -213064 -164271 -63810 -36983 35156 17743 -2365 20655 40250 77561
5790 77561 25154 -27480 67916 118778 132747 87161 54926 -29008 -55528 -157707 -214286 -104222
5778 -104222 -22434 -33851 -32279 -21838 -24251 -53463 -70401 -64872 -72592 -52719 -104335 -98474 -64793
5765 -64793 -84550 -55159 30901 30605 67129 -32181 -55902 -119530 -143380 -59777 -29234 -49456
5753 -49456 -122090 -89736 -60472 -93789 -20940 -21169 -32344 -11724 -124602 -120481 -33289 -67275
5741 -67275 -50888 -22975 66041 59649 -7402 -58008 -47062 -25216 -9403 -38834 -55120 -87141
5729 -87141 -92678 -12037 34625 -71042 -40749 -72085 -12786 4379 3345 -38029 -52696 -37258
5717 -37258 -21065 -77049 -74418 -11926 2982 3619 -54657 -104599 -71246 32785 33998 -63176
5705 -63176 -57585 -68332 -71973 -98682 -146956 -136650 -54065 -947 2265 60449 116623 82813
5693 82813 42723 -56980 -99340 -78449 -44170 -36750 -9175 70815 95496 135726 67242 -65934
5681 -65934 -81948 -31286 -54138 -94604 -46281 73647 109098 56449 -16919 -89269 -78839 -87409
5669 -87409 -50676 -25622 -31021 25173 45352 2373 -77067 -49068 66909 44719 59095 77275
5657 77275 55239 30016 -32771 13162 151920 140329 34787 7988 11140 87370 -15617
5646 -15617 -8444 8264 -22291 -81634 -127719 -136670 -156536 -100764 -15556 36140 62392 31657
5634 31657 2550 -25519 -4418 -10670 -2223 45899 65702 78960 34201 24482 -28735 -15850
5622 -15850 10642 -3054 -12508 33483 -3335 12026 -33512 -102673 -111408 -50476 27639 145275
5610 145275 143542 65582 59757 27967 -58441 -1737 86725 159032 144787 63767 50929 29915
5598 29915 24721 3251 28089 39542 69753 57474 54033 17627 54763 10785 35592 73992
5586 73992 886 -66788 -60980 -52835 -11989 37543 23171 56001 59298 9960 -35058 -42752 -31057
5573 -31057 -13325 -14919 -52460 -46431 -28941 -29879 11616 3023 -7830 -13626 -19876 -29004 -65573
5560 -65573 -2205 -14158 33200 47887 18675 -49511 -54752 -20667 -19767 -63464 -77976 -88651
5548 -88651 -59215 -74345 -60374 -49506 -11737 -13268 827 5804 -9206 -19759 -23029 -42675
5536 -42675 -80883 -32985 13901 -23206 -52671 -53444 -42179 -63404 -167991 -159260 -44833 29753
5524 29753 -5167 -18844 -61406 -104343 -105627 -111385 -89452 -61958 -87657 -92377 14397 50510
5512 50510 -35423 -30848 -6345 83932 91106 65029 83756 42917 -27871 -30410 -3887 35472
5500 35472 56437 52755 111626 123748 119880 89710 44853 45409 -13039 -61595 -29692 44590 -52177
5487 -52177 -74279 -30524 -28648 -8518 -7332 67409 5533 -70262 -9885 111 -38592 22946
5475 22946 -72139 -141964 -49806 -23427 -41141 -69719 478 51396 64596 76189 23165 46873
5463 46873 12839 -51844 -100923 -46527 -86856 -20744 102803 70564 14444 -25833 -65367 -43548
5451 -43548 45339 59420 18916 -28257 -76924 -57492 -29296 36650 88515 40348 48030 11041
5439 11041 -85904 -93426 -70433 -99745 -122259 -109111 -89780 -123426 -93774 -62584 -98750 -38944
5427 -38944 24362 68827 102570 70617 95442 33677 39274 28956 13251 -44070 -94958 -88829
5415 -88829 -64566 -26181 -31216 35359 2917 -31640 18859 33109 76690 48494 11188 -23722
5403 -23722 55531 -629 -71388 -94753 -63777 -56244 -13678 13687 29164 -22969 3742 61078
5391 61078 65007 -16239 -47401 -40344 30667 53377 13916 -41225 -109136 -125917 -71816 -66008
5379 -66008 -98353 -118110 -50533 -8225 -39647 -47639 -5932 -8390 50581 35579 74241 57213
5367 57213 3137 -45864 -20375 26035 -8939 -138919 -209976 -182066 -61835 47908 16523
5356 16523 -38683 -114722 -111977 -141165 -32812 27658 -20781 -33065 94331 127407 143948 175233
5344 175233 149372 137714 87351 119659 79078 15169 -29159 -52576 -99381 -127304 -114141 -71676
5332 -71676 -87286 -61981 31788 -7797 318 23032 -20555 -23381 -15588 -70053 -97029 -61634
5320 -61634 -18999 15458 -16854 -3293 137618 36184 -23711 -85053 -61481 -34383 -18374
5309 -18374 10337 2268 -102580 -106476 -25746 -104089 -179947 -160758 -168395 -169700 -129993 -150571
5297 -150571 -156173 -172198 -141040 -111208 -41635 47917 11526 -34041 -39017 3634 37410 -38240
5285 -38240 -63681 -49401 -59329 -10448 30524 12104 -53109 5698 63162 57529 22622 -40251
5273 -40251 81142 121916 100115 30432 -5554 -45093 -31023 -34775 -37413 -12188 24125 57159
5261 57159 60403 33588 -67495 -153083 -116759 -78504 -1233 -74515 -10490 32930 -56398 -32779
5249 -32779 4711 -47361 -101883 -106741 -61241 -26388 -36026 -14546 -10113 -39563 12955 93313
5237 93313 86121 32259 -17072 18243 -45532 -34632 6134 13600 -12572 -19347 -39796 -67680
5225 -67680 -98503 -54678 -69815 -47417 -94914 -101737 -58516 -9332 54745 102741 37023 -9239
5213 -9239 -51883 -14055 -62268 -131947 -118083 -56601 -58664 -41589 -8394 -56948 -100621 -100652 -40074
5200 -40074 -95156 -198634 -224443 -226786 -259078 -99511 49585 -38829 -120811 -103569 -39128
5189 -39128 -25446 -48957 -45338 -76402 -79613 -96430 -56430 -50774 -53577 -88225 -64381 -53212 -21147
5176 -21147 12747 -105838 -123086 -96558 -86287 -103930 -122206 -147938 -188822 -154818 -149002 -85701
5164 -85701 -37263 -33211 68450 81608 35414 -17053 -105330 -137941 -153587 -73992 14159 33164
5152 33164 5601 9257 63723 116065 58230 73462 107209 77352 12391 38 -23318 -9259
5140 -9259 -41958 -24800 -63673 -104881 -58219 14147 21421 59139 26607 48161 43454 77347
5128 77347 73596 123312 144459 71049 -5985 -52702 -35768 -9740 -26024 -112104 -81164 -42285
5116 -42285 12411 53391 10153 -58755 -24866 -35837 -51306 -72004 38822 96617 89338 14975
5104 14975 -23132 -8859 -35220 -40168 -43428 -47828 -33205 87930 103718 102264 62030 16121
5092 16121 29489 148977 186043 103223 104754 82657 53996 10576 8267 -12181 -25980 44007
5080 44007 61820 100141 20778 -11898 -11414 -370 -32891 -113181 -145000 -110901 -124134 -102552
5068 -102552 -27974 48889 16475 5527 -21816 -112995 -93638 -38319 -67722 -83186 -120784 -133123
5056 -133123 -121275 -139338 -96396 -116821 -8743 59119 34698 9181 -8827 19055 98448
5045 98448 65147 -13219 29248 57225 21831 -5314 -41550 -22523 80650 94134 18211 21629
5033 21629 20119 19314 -15359 -102769 -107778 -22708 -1887 -68985 -61874 14857 38014 30773 21032
5020 21032 -760 47402 11317 -55046 -55263 5456 29908 22928 -31463 -65190 -69384 -88057 -45064
5007 -45064 9108 -14057 -52907 -19164 24518 23597 -6004 -13590 16694 -41917 -92529 -152119
4995 -152119 -84694 -8425 21846 34125 -20694 -21312 -111272 -115460 -39871 -52589 -42232 -68024
4983 -68024 -71121 -84962 -29908 -75557 -97043 -88451 -49408 -16443 41043 141468 174393 106153
4971 106153 48218 70526 29684 20624 54956 69391 66200 37232 14055 -14310 -16034 19227
4959 19227 6509 -56404 -102070 -124110 -129639 -164035 -103863 -65278 -79655 -94726 -104334 -71191
4947 -71191 -37696 -77985 -72623 -38516 -273 -26060 -38930 9716 -31334 73513 141725 111014
4935 111014 37687 -7946 -34135 -1891 6245 -30058 -67782 -10232 -8907 -53634 -53614 -87209 -118064
4922 -118064 -86461 -66820 -105403 -96279 -43649 44932 29856 21158 55439 13449 -53257 -45253
4910 -45253 -103822 -130380 -199887 -144271 -60997 7320 22672 -33407 -38948 -82793 -86288 -60887
4898 -60887 -62568 -35502 23834 50187 18098 -53928 -30381 33982 -52663 7002 -1464 1346
4886 1346 -33363 -103032 -150402 -102800 -41513 -16211 6958 12582 53114 66086 30683 -19529
4874 -19529 37786 128302 24707 -116303 -91603 -155316 -121918 -69099 -19859 51051 29659
4863 29659 -11306 -62628 -15262 -58066 -104493 -66479 -100623 -110036 -146157 -72379 -83985 -104345
4851 -104345 -25725 112010 95428 28743 24899 -47719 -83412 -57132 -88690 4299 42863 103878
4839 103878 64090 2073 -15705 -25871 3506 18446 -26528 -38025 5847 -9606 -85581 26179
4827 26179 74975 53084 56888 8122 -21425 -10770 20537 -1839 34992 9501 -4709 13440
4815 13440 12314 37741 58807 32802 13584 -1619 34659 41917 -13779 -31701 -31245 39911 128591
4802 128591 74691 57344 -35370 -118924 -76077 -69051 -45660 -24790 -82156 -65714 -35830 -4846
4790 -4846 -58881 -20862 31556 49819 34454 71857 107608 84293 21464 17060 17913 50043 99918
4777 99918 105497 117756 111926 33546 -23800 -54705 -109623 -131940 -138088 -153984 -177181 -98996
4765 -98996 -52623 -81725 -45048 -76165 -1745 596 -60662 -72285 -136727 -172685 -111287 -83547
4753 -83547 -59198 14028 47450 -4643 -4125 35685 -5299 -49147 -106729 -89819 -73246 -37486
4741 -37486 6920 27293 -12688 -32307 3779 -7632 -69308 -67048 -65778 -137997 -155910 -103144
4729 -103144 -116138 -111705 -130775 -88356 -59729 -131685 -116233 -48549 11094 44001 79219 46541
4717 46541 -22203 2704 -5414 5528 -10502 -12873 68960 110787 102752 86629 67568 64425 91594
4704 91594 14299 -49135 34657 121322 68663 17345 64686 60047 -52408 -50964 -25487 -55441
4692 -55441 -28426 20730 14771 -64338 -70163 -102550 -138513 -138580 -59872 -18198 -49728 -42420 -17191
4679 -17191 7265 -3873 -46512 -87081 -128461 -97981 14323 15495 44270 -57690 -27712 -63451
4667 -63451 -122600 -120504 -49281 -25516 -63487 -102821 -84491 -52133 -38521 -45546 13475 -51293
4655 -51293 -107225 -90507 -118391 -126848 -14057 -922 -123911 -82419 -87366 -98380 -58455 -23483
4643 -23483 41346 26740 59878 66579 -4287 -24351 -9868 18838 -16941 -38322 2754 16226
4631 16226 1213 -31736 -13900 4415 16430 2228 -46085 -35728 -53831 -32064 -63277 -41609
4619 -41609 -3001 -44392 -7043 -6249 -51767 -55053 -37467 -50290 -41213 37620 58195 94912 136245
4606 136245 96641 95121 82607 42623 52930 44565 16261 8561 40238 10332 -48655 -55948
4594 -55948 -57405 -91145 -93513 -83662 -61868 -49064 -63597 -16803 -8798 -63453 -21312 -23420 3746
4581 3746 -62550 -91341 -28775 -6197 8574 23091 6283 -48557 -61358 -11018 42151 91091
4569 91091 117594 90585 53927 60231 91236 138290 90196 16696 1792 -40154 -45368 -36681
4557 -36681 55229 84347 102957 72055 46258 89298 57464 -11739 -26210 -60353 -51512 -38070
4545 -38070 -43104 -25987 -7821 9626 49589 17644 5711 -48244 -84263 -81999 -51783 -32166
4533 -32166 1746 70497 86151 48567 39668 10434 -65171 -158069 -153608 -111961 -74430 -74168 21684
4520 21684 10451 7181 18541 5993 3706 -14745 -12423 -130330 -133221 -145373 -137908 -150200 -181336
4507 -181336 -195740 -161199 -142908 -90505 -44904 -145767 -142990 -38123 -90351 -143910 -112078
4496 -112078 -21108 -99232 -98449 -12778 -9556 -45564 -23467 -55589 -134065 -72065 30506 -5843
4484 -5843 -19658 11593 -77472 -150629 -129514 -62288 -70750 -84717 -74105 -51583 -101906 -159303
4472 -159303 -96699 -80379 -15436 48712 60244 95162 71117 -35268 -98930 -77516 -60126
4461 -60126 -42796 -1266 39360 -17907 -65550 -110444 -84716 -25633 60759 130107 56266 -3074
4449 -3074 -4373 -18399 -57975 -11775 95398 29440 21087 80954 50499 -37476 -15228 74815
4437 74815 16968 -18209 -20581 -41290 -88556 -65468 -124994 -70882 -39315 37836 58713 29842
4425 29842 -35938 -110346 -153375 -92985 -13497 11963 40589 65787 75228 25637 -19504 -27910
4413 -27910 -70745 12220 24450 39808 100035 88968 -3906 39624 52845 22746 43235 36030
4401 36030 8219 21583 -298 8136 47158 85992 50896 82028 14325 -62228 -91787 5747
4389 5747 51446 -31275 -93571 -83050 -50864 -30184 46617 53546 71810 84139 143521 102729
4377 102729 34904 10423 30501 88121 92917 34079 30409 55400 98424 44783 -55169 -73628
4365 -73628 -103244 -90907 -56442 -49769 -4589 98829 87863 -31290 -50297 -48270 -80984 -75912
4353 -75912 -33226 44000 126047 103332 1076 4292 -51300 -58497 -10264 -23693 -6749 67515
4341 67515 86286 139953 57428 11944 -29334 -73894 -59127 -30025 -45024 -64096 -50268 -488
4329 -488 -99149 -80453 19241 100009 -1098 -46010 -28365 38168 20184 26154 48996 42376
4317 42376 20857 5042 -34613 -54444 -62895 -88241 -42850 24440 134769 190058 117062 23443
4305 23443 -25656 18494 12896 -24930 -49896 -71173 -76711 -68200 -45579 -71639 -2788 -37167
4293 -37167 -36102 -57447 -78324 -41959 64892 99457 56594 10561 -15154 -55410 11046 19205
4281 19205 75175 151052 61573 25155 -8379 -62377 -30261 -71879 -63911 -98022 -84407 -79779
4269 -79779 -87049 -39236 -22654 -11177 5827 29268 43092 55425 11778 11185 -13912 -89726
4257 -89726 24338 90787 46685 28216 10335 -39667 -88893 -80508 33320 108158 86479 57934
4245 57934 96845 140717 95918 16985 -7380 43764 20980 -7385 -28975 -38747 -10720 52253
4233 52253 81314 93306 82181 56232 52376 7179 20487 8741 -51994 -35554 -38696 -58922
4221 -58922 -75810 -62220 -15611 -34388 -52087 -67874 -68282 -107571 -83935 -50230 -66911 -3772
4209 -3772 31872 44944 30959 10855 7997 46290 79158 8838 -26359 -11576 46374 37400
4197 37400 66985 40947 41503 41620 70440 42190 37143 -24885 -13087 9597 63841 74777 69343
4184 69343 92218 144444 198791 162957 121181 170110 131176 72932 -61270 -105161 -103630 -171
4172 -171 126307 150900 144580 90519 29072 76500 81198 47869 -19075 -22781 -67988 -16655 66116
4159 66116 7032 -67683 9910 61638 -16483 9025 -29039 -77095 -51294 -51232 -64362 -72877 -102334
4146 -102334 -35713 -13237 -49786 -42746 -22350 -81509 -164769 -85933 -35784 -40476 -49818 -64482
4134 -64482 -42056 -26936 -62579 -1907 26312 -701 26732 34211 -68946 -130839 -52559 -52139
4122 -52139 -33323 25356 -27684 -99099 -69040 -81595 -94062 -82167 -14165 43126 787 -71257
4110 -71257 -68660 -24644 -45209 -105601 -94485 -14103 -11725 -23930 46618 77407 23250 -24122
4098 -24122 16415 34925 50858 -56150 -80092 -84491 -110639 -66497 -57589 -96079 -116505 -44590
4086 -44590 -20798 -73675 -131011 -128057 -46144 -21444 15074 26898 42805 89775 72841 113522
4074 113522 205566 170032 54677 45493 63215 23589 108396 117018 97627 103756 80746 32407
4062 32407 58789 93687 98001 67934 23689 -59619 -97300 -133023 -98523 -41205 -17469 9716
4050 9716 -50598 -53771 682 -12737 -48704 -3763 11127 -27372 -10870 42627 55708 18049
4038 18049 30976 209 -48317 -39406 40375 46444 9827 -10238 -72382 -77168 -17288 57711
4026 57711 -24598 -118127 -137880 -136410 -60290 -64192 -111538 -122220 -72117 -2142 -36073 -40948
4014 -40948 -48569 -68854 -53304 -104188 -124632 -60122 -130103 -164769 -134074 -105252 -46853 -55851
4002 -55851 -64183 2251 -18847 53275 51474 -62492 -81523 -65231 -35460 29836 68450 22608
3990 22608 7601 -7873 -40480 -66842 -81640 -73756 -2602 94487 79771 13909 43321 49748
3978 49748 78190 58636 267 42894 71633 30835 43163 35076 41571 1255 18218 113035
3966 113035 139536 159415 156715 63085 20535 -38755 -67021 -35237 -37913 47957 63862 29538
3954 29538 -1324 2635 70909 100339 54888 -25559 -58201 -55847 8412 99130 53087 -43741
3942 -43741 -84972 -23656 7247 65049 110025 101159 111991 54603 -10143 -65984 -82863 -17505
3930 -17505 -29853 -20555 -83686 -130582 -116147 -53946 -73332 -72519 4170 83013 91987 56000 19102
3917 19102 19484 50194 -3373 -16906 7523 -31199 -22489 24622 90926 79952 84329 -17954
3905 -17954 -57205 -27108 49826 55317 58935 54569 41518 33516 84770 101593 39980 -10712 -55440
3892 -55440 -116796 -107943 -66935 -50633 -12445 63806 33253 31241 19003 25318 66754 52724
3880 52724 -48634 -100888 -57680 -56237 -29023 5760 10114 73551 114480 78812 73872 62267
3868 62267 25767 7849 33084 -9523 -62371 16049 43549 52706 107596 86228 51537 -45142
3856 -45142 -60418 1876 -49397 -51649 10556 -5873 -79339 -144773 -103099 13199 31483 -13658
3844 -13658 -53400 -40245 -682 -1590 -53343 -81534 -153232 -152416 -125589 -115257 -95744 -54613 -50241
3831 -50241 -470 19375 8533 -2222 -6239 25946 133114 106080 38712 -4762 -56788 -18371
3819 -18371 25772 52269 54697 48634 36722 86900 98263 80969 12730 -99747 -169038 -170588
3807 -170588 -134270 -179440 -216994 -167357 -45465 -83627 -27090 65963 141959 -7155 -61126
3796 -61126 2389 77139 55680 60029 74336 139965 171747 114436 37708 -20816 735 33561
3784 33561 28897 58296 146125 125268 104717 83531 125783 184588 130276 112699 71515 14275
3772 14275 15691 3923 18646 -15619 -21279 -106464 -180794 -200229 -153880 -149168 -187521 -216164
3760 -216164 -225172 -239585 -250768 -210104 -136432 -100991 -93272 -51009 -49966 15958 34115 88586
3748 88586 169584 164929 100684 49165 31592 -23392 35267 50099 65993 91210 64168 74890
3736 74890 25640 70720 47365 -44472 -70622 -80489 -57900 -43891 -81525 -112655 -93347 -90342
3724 -90342 -60485 -47062 -23523 -41908 -48845 -70655 -76015 -24996 11767 34698 33372 71989
3712 71989 35629 40292 14682 1447 13639 95751 187798 139719 46288 -10870 -52811 -127070
3700 -127070 -234618 -321450 -294287 -206121 -81652 48305 140590 107454 -73033 -54655 17497
3689 17497 43 41191 -10460 -58173 -11371 89056 65291 39025 34051 -46699 -65950 -112648
3677 -112648 -105670 -44921 -71414 -99541 -91184 14013 52708 9205 -5590 -17319 -5670 -31860
3665 -31860 61336 99878 49736 79858 40007 38784 68878 78560 39450 4740 -31458 -3476
3653 -3476 -56833 -63583 -80060 -73910 -35655 -30536 -75351 -48980 -7281 -40537 -108745 -99381 -179810
3640 -179810 -156975 -99032 -38853 -40238 -123087 -146260 -210992 -155688 -122770 -96954 -78848 -35461
3628 -35461 -6944 -109771 -102223 -61412 -27058 21320 22918 -45622 -26038 25391 -5628 -66731
3616 -66731 -136279 -136901 -146495 -98468 -62612 9580 33184 20045 -84550 -146920 -112180 -94354
3604 -94354 -49666 26975 97494 117329 91446 39337 32763 -2190 -81968 -51052 1022 72062
3592 72062 81494 84923 73220 30702 -44363 -16564 24298 31630 -16673 -13625 173 3197 20423
3579 20423 68129 108249 138884 93999 105559 102453 70485 74594 89511 96759 151855 168650
3567 168650 166604 152009 92406 23398 4948 -1334 -93590 -115536 -63618 -15070 -10795 -46682
3555 -46682 -105303 -95750 -105289 -108865 -144689 -149305 -147936 -29727 14643 -11608 -30420 13230 162
3542 162 -64257 -82980 11024 44437 17689 41729 15615 29879 -599 -17348 -8595 9213
3530 9213 36988 67210 132252 60687 34569 7744 -32011 -35230 18653 33576 8808 -12076
3518 -12076 -29676 -49822 -146322 -129386 -74091 -62327 -36245 -61844 -102185 -181479 -205474 -10827
3506 -10827 3144 -70197 -74640 33187 5417 -15626 -34894 -66646 -34954 -52122 -70358 -66322
3494 -66322 -113018 -73912 -28115 -33334 -11506 120863 73570 24487 28258 33534 34508 12879 31165
3481 31165 57694 35748 -76405 -146849 -158473 -116011 -63409 -19368 -25507 -92891 -128447 -88433
3469 -88433 -67055 -68864 -32962 -35527 -10835 21669 31640 -18952 -49085 22448 79032 163098
3457 163098 206970 181455 104142 62204 87822 75734 24109 2739 2784 25706 -37378 -42247
3445 -42247 -46994 18360 -9931 -19743 26840 -49009 -85541 -92102 -13744 17271 -4541 -27604
3433 -27604 -15172 -33713 -127327 -119020 -119140 -99450 161 -2282 -1558 -34498 -83361 -32332 -37460
3420 -37460 -45473 -52334 -62752 31620 62770 10572 -101563 -87456 -23289 -29958 -44364 -21381
3408 -21381 18310 133760 161892 90294 40497 77097 -89497 -170909 -132218 -93305 -96696 -84225
3396 -84225 -7020 6143 -9547 -67825 -23635 22271 33667 25130 -11783 1983 4244 -15165
3384 -15165 54827 58630 21548 -4477 -23251 -120698 -137100 -54123 -48229 -54428 -39980 -24364
3372 -24364 -12761 3108 20677 37831 34475 65714 41876 34419 3677 -2675 6519 24503 19834
3359 19834 -26842 -151535 -200610 -132533 -107823 -40273 -26707 -17962 60260 41942 -1707 -23121
3347 -23121 25086 43468 70881 91506 106547 62440 19479 -71333 -66496 -48669 -40877 -41363 -35647
3334 -35647 -21965 8266 12235 -54593 -27593 -10599 -4918 59924 33797 -2121 24385 -145
3322 -145 6303 -50385 -22193 77054 80131 17321 39640 60441 28084 -11203 -21492 -45568 -70889
3309 -70889 53502 128178 84923 10719 -31971 -32470 8976 31807 21705 45958 63356 103321
3297 103321 102760 50016 90949 95647 95348 180322 216444 153636 110455 143872 92110 49419 59530
3284 59530 86292 153978 -26878 -18257 78806 91649 93537 148034 170997 101679 46209 39344
3272 39344 -20251 -101196 -90597 4236 47903 11113 -54341 -80132 -144342 -65907 -67105 -105985
3260 -105985 -111397 -38811 18231 18598 35714 27411 9619 -10531 -36428 -87038 -48725 -39307 -75649
3247 -75649 -83770 -75115 -15355 8364 -50322 -94438 -38588 29463 63823 64389 79735 59937 14988
3234 14988 -30140 37574 49400 -29323 -40924 -29433 31257 136015 134886 -3286 -23015 -26643
3222 -26643 97999 115563 78815 50087 -57743 -66677 -1957 107455 190255 199465 128616 37508
3210 37508 -35361 -85303 -104216 978 42070 -4324 -34060 -85097 -78038 -72486 -8895 -35388
3198 -35388 16502 82881 141977 35590 -16908 2963 65540 60261 35844 63108 82477 20658
3186 20658 1814 12819 37206 1655 -9209 -15454 34125 52019 -9133 -58527 -145147 -153975
3174 -153975 -135090 -38850 42625 29491 52659 30839 -28320 -147872 -139502 -63181 -78277 -46379
3162 -46379 -51120 -21624 -244 -55437 -77400 -81651 -26196 -8031 43301 -6726 -12500 9750
3150 9750 31205 -58635 -75492 -73113 -105528 -71051 -7852 -46690 -56454 -9261 -455 -94108 -100352
3137 -100352 -29984 -38367 -21815 -144237 -199148 -67059 -47337 -35713 -94610 -95018 -22534 22262
3125 22262 90662 34583 -18869 -86931 -127273 -133492 -42155 -25356 -20964 -29830 -18668 1774
3113 1774 -22749 -68865 -31572 -73144 -143432 -197108 -187751 -155900 -120758 -71416 -59972 -11256
3101 -11256 85819 54638 19354 -36452 -51747 -50770 -15503 -35631 -137221 -178426 -122782 -22593
3089 -22593 -75573 -16329 105772 199786 177802 142676 65084 11497 -71692 -43479 -60831 -93653
3077 -93653 -30782 7832 -53681 -78275 -61237 -39851 11033 3688 -47314 -154075 -136612 -73456
3065 -73456 -8289 36334 59715 42558 -53408 -43284 -37582 -19013 -38902 -26367 57410 48841
3053 48841 -48547 -61604 3051 66144 68546 94715 50547 -83281 -113536 -111569 -101158 -70063
$$ [...]
##END NTUPLES=NMR SPECTRUM
##END=
