##TITLE=Analysis number 313693
Compound Code cc 34404
Book Reference 451/35
Project Code adrs
Chemist Name evam
##JCAMPDX= 6.0         $$ Bruker NMR JCAMP-DX V2.0
##DATA TYPE= NMR SPECTRUM
##DATA CLASS= NTUPLES
##ORIGIN= Bruker BioSpin GmbH
##OWNER= NMR
$$ XWIN-NMR		Version 3.5
$$ Mon Sep 19 08:43:08 2005 GMT Daylight Time (UT+1h)  MAYBRIDGE\NMR@NMR_250MHZ
##.OBSERVE FREQUENCY= 250.131544655141
##.OBSERVE NUCLEUS= ^1H
##.ACQUISITION MODE= SIMULTANEOUS (DQD)
##.ACQUISITION SCHEME= undefined
##.AVERAGES= 16
##.DIGITISER RES= 18
##SPECTROMETER/DATA SYSTEM= dpx250
##.PULSE SEQUENCE= zg30
##.SOLVENT NAME= CDCl3
##.SHIFT REFERENCE= (INTERNAL, CDCl3, 0, 16.522)
##AUDIT TRAIL= $$ (NUMBER, WHEN, WHO, WHERE, WHAT)
$$ ##TITLE= Audit trail, XWIN-NMR		Version 3.5
$$ ##JCAMPDX= 5.01
$$ ##ORIGIN= Bruker BioSpin GmbH
$$ ##OWNER= NMR
$$ C:\u/data/dgb/nmr/ADRS/9600/pdata/1/auditp.txt
$$ ##AUDIT TRAIL=  $$ (NUMBER, WHEN, WHO, WHERE, WHAT)
(   1,<2005-09-19 08:42:31.38 +100>,<MAYBRIDGE\NMR>,<NMR_250MHZ>,
      <created by zg, POWCHK disabled, PULCHK disabled
       configuration hash MD5:
       62 19 C7 07 E1 42 D1 B7 37 6C 3D D0 77 39 F9 E6
       data hash MD5: 64K
       13 68 6D 81 E5 B1 7E 02 5E 39 40 CD 0D A5 9C 0A>)
(   2,<2005-09-19 08:42:49.35 +100>,<MAYBRIDGE\NMR>,<NMR_250MHZ>,
      <Start of raw data processing
       ef LB = 0.3 FT_mod = 6 PKNL = 1 SI = 32K 
       data hash MD5: 32K
       E1 7F 82 99 03 D2 31 4D B5 18 DD 3B 61 94 25 5F>)
(   3,<2005-09-19 08:42:52.13 +100>,<MAYBRIDGE\NMR>,<NMR_250MHZ>,
      <apk 
       data hash MD5: 32K
       56 CB 0F 7C 16 C9 17 28 AD 22 6A 26 44 56 A5 65>)
(   4,<2005-09-19 08:42:53.22 +100>,<MAYBRIDGE\NMR>,<NMR_250MHZ>,
      <abs ABSG = 5 
       data hash MD5: 32K
       64 AE CE 35 17 07 3C 92 C6 7B 43 B2 6E C0 F1 2C>)
$$ ##END=
$$ 
$$ hash MD5
$$ DF C8 F7 3D CF F5 17 D3 2D F2 6C BB 02 E7 B3 34
##$RELAX= 
##$RELAX= 
##$RELAX= 
##$RELAX= 
##$RELAX= 
##$RELAX= 
##$RELAX= 
$$ Bruker specific parameters
$$ --------------------------
##$DU= <C:\u>
##$EXPNO= 9600
##$NAME= <ADRS>
##$PROCNO= 1
##$TYPE= <nmr>
##$USER= <dgb>
##$AMP= (0..31)
100 100 100 100 100 100 100 100 100 100 100 100 100 100 100 100 100 100 
100 100 100 100 100 100 100 100 100 100 100 100 100 100 
##$AQSEQ= 0
##$AQ_mod= 3
##$AUNM= <au_zg>
##$AUTOPOS= <2 >
##$BF1= 250.13
##$BF2= 250.13
##$BF3= 250.13
##$BF4= 250.13
##$BF5= 500.13
##$BF6= 500.13
##$BF7= 500.13
##$BF8= 500.13
##$BYTORDA= 1
##$CFDGTYP= 0
##$CFRGTYP= 5
##$CHEMSTR= <none>
##$CNST= (0..31)
1 1 145 1 1 1 1 1 1 1 1 1 1 1 1 1 1 1 1 1 1 1 1 1 1 1 1 1 1 1 1 1 
##$CPDPRG= <>
##$CPDPRG1= <>
##$CPDPRG2= <>
##$CPDPRG3= <>
##$CPDPRG4= <mlev>
##$CPDPRG5= <mlev>
##$CPDPRG6= <mlev>
##$CPDPRG7= <mlev>
##$CPDPRG8= <mlev>
##$CPDPRGB= <>
##$CPDPRGT= <>
##$D= (0..31)
0 1 0 0 0 0 0 0 0 0.06 0 0 0 0 0 0 0.0002 0 0 0 0 0 0 0 0 0 0 0 0 0 0 
0 
##$DATE= 1127115750
##$DBL= (0..7)
120 120 120 120 120 120 120 120 
##$DBP= (0..7)
150 150 150 150 150 150 150 150 
##$DBP07= 0
##$DBPNAM0= <>
##$DBPNAM1= <>
$$ [...]
##$SUBNAM7= <"">
##$SUBNAM8= <"">
##$SUBNAM9= <"">
##$SW= 20.6930455092707
##$SWIBOX= (0..15)
0 0 3 0 0 0 0 0 0 0 0 0 0 0 0 0 
##$SW_h= 5175.983436853
##$TD= 65536
##$TD0= 1
##$TE= 294.16
##$TE2= 300
##$TE3= 300
##$TEG= 300
##$TL= (0..7)
0 120 120 120 120 120 120 120 
##$TP= (0..7)
150 150 150 150 150 150 150 150 
##$TP07= 0
##$TPNAME0= <>
##$TPNAME1= <>
##$TPNAME2= <>
##$TPNAME3= <>
##$TPNAME4= <>
##$TPNAME5= <>
##$TPNAME6= <>
##$TPNAME7= <>
##$TPOAL= (0..7)
0.5 0.5 0.5 0.5 0.5 0.5 0.5 0.5 
##$TPOFFS= (0..7)
0 0 0 0 0 0 0 0 
##$TUNHIN= 0
##$TUNHOUT= 0
##$TUNXOUT= 0
##$USERA1= <user>
##$USERA2= <user>
##$USERA3= <user>
##$USERA4= <user>
##$USERA5= <user>
##$V9= 5
##$VALIST= <valist>
##$VCLIST= <CCCCCCCCCCCCCCC>
##$VD= 0
##$VDLIST= <DDDDDDDDDDDDDDD>
##$VPLIST= <PPPPPPPPPPPPPPP>
##$VTLIST= <TTTTTTTTTTTTTTT>
##$WBST= 1024
##$WBSW= 4
##$XGAIN= (0..3)
0 0 0 0 
##$XL= 0
##$YL= 0
##$YMAX_a= 536076
##$YMIN_a= -386450
##$ZGOPTNS= <>
##$ZL1= 120
##$ZL2= 120
##$ZL3= 120
##$ZL4= 120
##$ABSF1= 16.522
##$ABSF2= -4.171173
##$ABSG= 5
##$ABSL= 3
##$ALPHA= 0
##$AQORDER= 0
##$ASSFAC= 0
##$ASSFACI= 0
##$ASSFACX= 0
##$ASSWID= 0
##$AUNMP= <proc_1d>
##$AZFE= 0.1
##$AZFW= 0.1
##$BCFW= 0
##$BC_mod= 0
##$BYTORDP= 0
##$COROFFS= 0
##$CY= 12.5
##$DATMOD= 1
##$DC= 0
##$DFILT= <>
##$DTYPP= 0
##$F1P= 14.0000005364418
##$F2P= -0.99999901652339
##$FCOR= 0.5
##$FTSIZE= 32768
##$FT_mod= 6
##$GAMMA= 0
##$GB= 0
##$INTBC= 1
##$INTSCL= 1
##$ISEN= 128
##$LB= 0.3
##$LEV0= 0
##$LPBIN= 0
##$MAXI= 10000
##$MC2= 0
##$MEAN= 0
##$ME_mod= 0
##$MI= 0
##$NCOEF= 0
##$NC_proc= -4
##$NLEV= 6
##$NOISF1= 0
##$NOISF2= 0
##$NSP= 0
##$NTH_PI= 0
##$NZP= 0
##$OFFSET= 16.522
##$PC= 1
##$PHC0= -71.42509
##$PHC1= 8.779926
##$PH_mod= 1
##$PKNL= yes
##$PPARMOD= 0
##$PSCAL= 4
##$PSIGN= 0
##$REVERSE= no
##$SF= 250.13
##$SI= 32768
##$SIGF1= 0
##$SIGF2= 0
##$SINO= 400
##$SIOLD= 32768
##$SREGLST= <1H.CDCl3>
##$SSB= 0
##$STSI= 32768
##$STSR= 0
##$SW_p= 5175.98343685301
##$SYMM= 0
##$S_DEV= 0
##$TDeff= 65536
##$TDoff= 0
##$TI= <Analysis number 999999
Compound Code 99
Book Reference 9
Project Code 9>
##$TILT= no
##$TM1= 0
##$TM2= 0
##$TOPLEV= 0
##$USERP1= <user>
##$USERP2= <user>
##$USERP3= <user>
##$USERP4= <user>
##$USERP5= <user>
##$WDW= 1
##$XDIM= 32768
##$YMAX_p= 399841201
##$YMIN_p= -552722
$$ End of Bruker specific parameters
$$ ---------------------------------
##NTUPLES= NMR SPECTRUM
##VAR_NAME=  FREQUENCY,     SPECTRUM/REAL,   SPECTRUM/IMAG
##SYMBOL=    X,             R,               I
##VAR_TYPE=  INDEPENDENT,   DEPENDENT,       DEPENDENT
##VAR_FORM=  AFFN,          ASDF,            ASDF
##VAR_DIM=   32768,         32768,           32768
##UNITS=     HZ,            ARBITRARY UNITS, ARBITRARY UNITS
##FACTOR=    0.157963299565203, 1,           1
##FIRST=     4132.6476996994, 0,             0
##LAST=      -1043.33573715361, 0,           0
##MIN=       -1043.33573715361, -552722,     0
##MAX=       4132.6476996994, 399841201,     0
$$ Real data points
##PAGE= N=1
##DATA TABLE= (X++(R..R)), XYDATA
$$ [...]
29226 78684 58355 -24096 -1207 73054 72069 11685 61790 90489 103136 38269 -72241 -73848
29214 -73848 -34676 -34184 7873 25267 36757 46807 74556 94807 52506 6044 -47387 -60004
29202 -60004 -66506 -65488 -68249 -75792 -55206 -54894 -107706 -149232 -125326 -106669 -142862 -34262 16956
29189 16956 21991 53253 72280 -39557 -32826 53611 69118 49027 -1201 8313 711 88912
29177 88912 144875 80655 43126 41038 64894 26964 8853 32038 77061 79102 36634 42899
29165 42899 48090 -2323 -21045 3387 13594 2258 -37430 -72789 -86747 -98729 -92930 -76656
29153 -76656 4512 40308 8747 -88210 -91737 -96501 -71017 -46602 -62781 -37524 9240 27687
29141 27687 9525 13871 21879 -14777 -65032 -30776 7762 15922 35988 35747 10174 -44435 -68200
29128 -68200 -23654 4974 -41814 -4039 8547 5759 -45876 -47656 -22159 -38782 -41388 -82780
29116 -82780 -49845 -10739 -11764 -36785 551 -11072 -40330 -15744 55100 102262 92493 110655
29104 110655 70151 99713 105069 50573 7493 -14803 22933 40636 21476 28355 95531 135339
29092 135339 113840 1971 -32154 -50448 -95674 -135222 -107980 -103512 -22949 18421 -5019
29081 -5019 -20849 53907 68487 42164 26208 29374 8527 15669 27884 39141 19708 33023
29069 33023 -4095 14509 64942 74341 66144 54856 20540 -32957 -17269 -13850 38990 36645
29057 36645 19629 39601 -19467 -36571 36861 49358 66100 47159 30444 8929 49076 99473
29045 99473 58002 14885 -33398 16781 58414 60757 7312 -35176 -95375 -136003 -119254 -148062
29033 -148062 -132767 -50271 -61584 -91713 -3203 3016 -9507 -700 10879 -14767 -116003 -102345
29021 -102345 -29478 -47953 -33953 -21966 -76727 -80903 -64876 -106416 -82497 -27441 -27544 2011
29009 2011 1755 -39709 -51611 -67635 -18987 8201 60195 85801 91506 41813 -14104 -38973
28997 -38973 -35764 -3776 -27078 -28711 14064 32763 35472 35049 66063 73669 9273 -44435 4495
28984 4495 5868 -15051 -72206 -70763 -83550 -12993 35985 23090 -24176 -91379 -76051 -41383
28972 -41383 -38788 -59036 -89388 -53122 11781 4960 -14140 -6564 28714 7304 7 -3911 3938
28959 3938 -5075 1481 -22131 -1823 -22512 -37271 -11892 -2210 -2619 5048 39735 15974 25255
28946 25255 74636 77259 23189 -16522 4678 28474 11864 -1154 -8232 34762 18959 -459
28934 -459 5371 3163 -6458 -3425 -18733 -9204 -44983 -41581 20408 10843 710 -37219 -41457 -30742
28920 -30742 -32666 -52102 -28157 -44568 -56456 -15294 16226 -6367 -4585 -21464 -21711 -42466
28908 -42466 -9719 33346 60067 11523 -109055 -101095 -11173 8803 -5905 7500 -1718 17809
28896 17809 75505 29955 -80885 -103949 -75601 -19148 15699 15496 -58238 -107888 -109133 -77081
28884 -77081 -96459 -110113 -82844 -132794 -112058 4363 39702 -14634 -58845 3912 -14528
28873 -14528 -12279 -249 -54257 -50577 12005 38444 49802 102315 92578 16433 -52783 -116516
28861 -116516 -94118 -30183 14770 35661 53359 -22757 -38619 -86246 -78688 -70941 -58098 1993
28849 1993 -2636 249 39308 26221 -7478 -35602 -21830 7627 38829 35406 -15123 -74478
28837 -74478 -42990 40819 23091 30760 22551 24134 20905 -6961 8025 -11578 -10198 -26557 -23324
28824 -23324 -64652 -20910 -42999 -38994 -17645 -6851 -5434 -21304 -34773 -51488 -22814 72728
28812 72728 96185 20728 4414 16981 -43884 -29840 25931 29482 63980 74228 2193 -24256
28800 -24256 -31761 -37160 -69244 -62071 -87745 -49478 -41985 -21682 49724 60221 43563 21576
28788 21576 -22487 3072 -9340 -68896 -84847 -43806 -26133 12725 24547 47880 43379 33770
28776 33770 -2288 -23702 -45770 -69107 -94030 -79128 -66905 10542 116772 83498 9244
28765 9244 -13983 -24656 2623 -16536 21197 41165 22288 6871 -24610 -23831 -35050 -11542
28753 -11542 31198 66515 57444 -2962 -55261 -54230 15883 71916 55925 63185 55809 40632
28741 40632 36782 73079 88103 106851 69049 24627 50286 72507 67357 47914 33612 22412
28729 22412 62023 137458 134020 101489 26622 -2409 -42178 -44127 -33346 641 -68070 -75727
28717 -75727 -6056 -19607 24641 51789 21624 30260 111895 161861 131065 57032 -4303 -74804
28705 -74804 -61605 -42555 -10347 -29254 -55662 -86660 -68456 -3642 49340 80907 57531 -42471
28693 -42471 -60589 -2250 -964 -49310 -32648 -46536 -2171 10204 10920 -12768 -14422 14017
28681 14017 66643 34909 50194 79044 87951 24956 -63357 -31657 -10274 11312 19634 29643
28669 29643 77928 104456 55583 18840 1740 14737 28321 -27877 -36273 -44820 15833 84747
28657 84747 64481 23215 -14608 -25179 31066 9465 -53101 18390 76447 30451 -18598 -42662
28645 -42662 -46242 -61446 -23451 54074 53489 72319 50616 60117 35947 -45235 36352 105724
28633 105724 70037 31433 -29575 -22947 -3167 35818 110906 133316 61406 56805 41575 9534
28621 9534 -234 60046 99210 71160 73471 106689 98931 59521 30757 -33178 -44499 -44838 -67741
28608 -67741 -92876 -38749 39057 75889 78935 21746 -2833 7799 39386 72380 85501 48710
28596 48710 83656 28653 -15847 26262 26007 -15793 -42899 -77479 -102690 -113346 -71538 -9796
28584 -9796 31590 75477 47613 -7533 4108 16202 45739 51539 41036 -7379 -26816 -30714
28572 -30714 23807 77602 43442 -26870 -20608 -2597 -4300 -19932 -22879 -51190 -41361 -35397 -52871
28559 -52871 -45050 5549 63147 97162 52740 59188 48476 37269 -12724 20837 30603 6046
28547 6046 -80705 -95420 -50852 -71894 -30185 -3740 -2157 -25459 -15363 -20477 -32921 11131
28535 11131 86793 80146 70460 88396 22858 -78572 -88281 -38524 13896 40871 64172 71613
28523 71613 27595 -9685 -30508 -26616 -12962 -4873 29771 83381 39047 50498 29063 -26319
28511 -26319 -37665 20747 31779 -21230 -59917 -31544 -18054 -12679 -3015 -7874 -13913 -59892
28499 -59892 -18364 39039 12511 -20832 2060 -26603 -34089 -4157 7799 15304 -23284 -82595
28487 -82595 -60639 510 43843 52956 62825 45075 -5706 32200 77430 46321 -34201 -75282
28475 -75282 -70370 -37096 -12393 -23034 -12749 -38592 4244 26058 -8809 2513 36168 27040
28463 27040 11775 5415 -60889 -49908 -24914 -24066 30517 68422 35947 62590 93505 114013
28451 114013 88286 3404 -75745 -37022 -18180 30316 24200 77051 187336 194211 114752 -1256
28439 -1256 -66892 -90557 -56960 -32755 -38836 23181 32028 -16880 52147 52143 519 7107 19284
28426 19284 -20614 -64699 34660 86371 45457 -14473 -55508 29244 69696 46950 97190 112091
28414 112091 50071 46924 3119 -51864 -2332 48254 88449 115452 65432 85646 76327 51061
28402 51061 35455 -19499 -46830 -3981 -38329 -46453 -28675 -27571 -37534 -63808 -67970 -32720
28390 -32720 -5962 16588 -22371 -26924 -58986 -92487 -69993 -75107 -128041 -93062 28124 73774
28378 73774 91093 102455 49592 8801 6264 -11479 -22329 -6984 51097 50458 4007 12874
28366 12874 3952 18444 59194 98432 113592 81617 49107 -21287 -1423 -18229 3320 -6977
28354 -6977 -20485 785 -15515 -45533 -44040 -4705 44900 87485 52679 35376 -23634 873
28342 873 41942 57975 77746 77674 94615 103864 130756 85960 34291 52189 50610 50192 37597
28329 37597 30194 59907 98020 79798 50912 56587 11798 -2578 21135 28855 1122 -29980
28317 -29980 -37796 -16698 17958 -1586 -21019 -13991 -57821 -57750 -29161 -13525 -68574 -30486 24073
28304 24073 19461 46793 -780 -42369 27319 11388 -19957 -21144 11857 -13787 -69870 -113255
28292 -113255 -48662 -9024 -10931 20369 35820 60886 53519 15604 12421 -10962 35798 86806
28280 86806 78644 58639 -30493 -65626 -102259 -78334 -52163 4671 61153 71413 63513 11473
28268 11473 -26198 -29402 -44154 -70266 -62731 -20791 -45356 -54412 -39743 27167 82388 78676
28256 78676 101235 86611 32778 -3740 -57606 -96758 -11708 23950 17312 -2856 3587 47251
28244 47251 23245 -1345 -36385 -3001 65534 28422 -25011 -32486 -40303 12529 42133 73573
28232 73573 98239 9637 -44975 -41986 11751 -60413 -75926 -32783 -81331 -104485 -16438 32820
28220 32820 2186 21446 23969 27395 -758 17891 13624 -74634 -142350 -31177 9149 -6984
28208 -6984 -24855 -37774 -46757 -43158 -58970 -43813 3917 15934 30235 15635 -1087 19184
28196 19184 52990 81686 60097 73337 82100 15174 14793 -17109 -59611 -38526 9526 64968
28184 64968 93909 58371 -1908 5009 37271 -14745 -36969 -94614 -75914 -104280 -137350 -131428
28172 -131428 -71035 16911 78026 56501 -19687 -49146 -27309 -22755 8903 19575 -33306 -37918
28160 -37918 -6935 69600 113553 97877 80217 27198 54673 14793 10915 47964 15410 12927
28148 12927 31735 43466 22078 -4468 -36883 -27112 7113 35966 28204 16224 27353 51669
28136 51669 74463 38906 25694 25989 -29834 -64605 -112742 -113654 -80810 -41613 46284 50964 2412
28123 2412 10154 19793 -3804 26520 27898 14613 26034 49995 40087 13035 38837 55301 1487
28110 1487 -3002 -42361 -98502 -178658 -175610 -106118 18622 125347 140865 94124 112178 83785
28098 83785 51762 52583 49181 44849 71456 63619 32787 9749 -2393 -54332 -74387 -98696 -73487
28085 -73487 -738 36123 30060 45123 41370 -21803 -5029 27920 14099 7537 47041 72855
28073 72855 94181 61216 54198 -31416 -71881 -54424 -15736 25899 -6469 -55673 5654 60354
28061 60354 24328 -21011 -70157 -61754 -9625 4860 -954 -10385 42915 66005 47569 -2791
28049 -2791 -28941 -93384 -124998 -50033 -31717 16742 52748 80954 70695 86214 19512 -49013
28037 -49013 -23410 34922 43695 37073 24480 -11507 -25819 -1213 22508 3775 -23738 -20131
28025 -20131 -14822 1008 3988 -10926 -28033 7324 -3387 -22675 -48624 -91054 -99496 -108207
28013 -108207 -134574 -133667 -111777 -74718 -48877 -57986 -97313 -57612 -22814 -34484 -65872 -35255
28001 -35255 -28860 3837 -12167 20826 12416 1556 13245 7573 -19747 -45151 -24679 27096
27989 27096 3436 -25288 10827 22101 16336 6969 31054 84854 106249 78771 5966 28808
27977 28808 36070 54163 91045 106776 80098 88074 64832 -10978 16264 44388 40339 18217
27965 18217 -64822 -87420 -94947 -47300 9269 37234 44916 25633 -11610 -285 6971 201
27953 201 -19978 -5098 -16383 -10050 21470 -22172 -43382 -54719 -93921 -104393 -64234 -50782
27941 -50782 -61757 -93445 -63684 32754 98029 67908 15850 65001 60030 16319 -15749 -40220
27929 -40220 24912 71644 35450 10259 19714 -14656 5394 13479 11336 11197 -36883 -60375 -88155
27916 -88155 -57346 -17605 58181 66964 55577 -15837 -95676 -48392 15574 14162 9088 53593
27904 53593 77637 79636 85067 131581 104987 26336 -7391 14125 79935 79025 8996 -10991
27892 -10991 -2298 -28383 17482 4646 -28977 -78745 -105119 -85278 -78402 -58443 -8134 -21492
27880 -21492 -66624 -67103 22570 49252 74387 70327 92920 91972 73750 5563 -29202 -70025 4734
27867 4734 90235 44157 -25064 -33636 -82594 -22145 12996 46839 57072 43514 29877 70517
27855 70517 61697 69549 74010 9418 -32379 -65430 15426 -19770 -39594 -54124 -61123 -61045 -53459
27842 -53459 -37663 -20554 26066 29439 27660 18032 -37452 -36136 -12503 -25455 -20734 45374 83474
27829 83474 105298 98937 83115 57872 26467 41749 45997 41949 77934 115561 89223 36709
27817 36709 83818 148755 96375 107827 71107 5237 46458 29984 9038 21906 28125 56106
27805 56106 46143 11867 13871 14350 -51802 -58778 -26512 -24641 -53710 -74674 -22766 79728 85515
27792 85515 85080 80738 40418 64687 35430 -30010 -51079 -68183 -43371 33870 37817 11091
27780 11091 6330 -13590 -49031 -64221 -27977 10581 51366 44084 4250 18078 85733 90147
27768 90147 12347 4225 -49424 -42587 -17833 -26518 2405 35708 37367 49383 36890 -13752
27756 -13752 -45715 -40937 -9705 20705 26057 28198 35172 -15802 13078 6277 15102 10189 -33144
27743 -33144 -45703 -10928 -5236 -27244 -60525 -62023 -78569 -126889 -118918 -94235 -61048 23068
27731 23068 -1739 -29929 -58105 -97331 -122219 -84515 -30331 -17405 -30185 -58447 -20174 55195
27719 55195 114348 87698 42543 5682 41074 14037 -42403 1810 51314 70521 113370 85595
27707 85595 74348 44942 3522 -14412 14505 68600 101159 62848 29052 45518 88564 75355
27695 75355 4574 26592 47901 -3719 -82222 -55030 -12558 -3997 -22292 -14578 51235 97571
27683 97571 117823 55826 68351 64396 89271 87427 60108 34265 29308 27631 19502 78979 108903
27670 108903 73516 30613 -10080 -19057 9686 32559 49332 73338 65112 87226 96620 64871
27658 64871 91555 74726 28778 53054 -1307 24357 53354 -20631 -127090 -77909 -14660
27647 -14660 3694 18139 61916 58454 69170 84893 76432 24064 -14388 38036 31228 36493
27635 36493 41715 77665 109751 49232 18653 -684 3413 24091 71295 117645 128016 102122
27623 102122 23776 16199 3737 -3748 -23982 -886 40908 -374 -14946 49282 -10783 -42814
27611 -42814 -4820 40480 6147 -25723 -45290 -58776 -85203 -126799 -113781 -111918 -90088 -83510
27599 -83510 -17695 48685 -16573 -68152 -56930 -56265 -48853 8870 39425 8182 13832 2026
27587 2026 14212 33255 60897 98165 103887 155786 118777 38204 -5833 -70913 -108519 -118635
27575 -118635 -58924 -10029 45963 55456 25619 2257 -10533 -48070 -60139 -68869 -70759 -4093
27563 -4093 23353 16483 -56605 -4945 54192 35460 -7688 35807 20946 31880 32823 -31364
27551 -31364 -50431 -31589 -60695 -52664 19336 66210 33844 811 -25393 4222 -4532 -56455
27539 -56455 -40294 15623 58522 19600 25460 21343 -47027 -117833 -133377 -84402 -17320 16182
27527 16182 21563 9375 -26162 -66013 -52384 -44074 -12648 -48593 -41538 -108984 -112152 -15721
27515 -15721 -8145 -44271 -9831 81533 114912 123041 82428 39413 -12017 -82497 -84529 -57502
27503 -57502 -33349 -1994 -5993 -45544 -29423 -14889 -4307 -29933 -84371 -94440 -59082 -39814
27491 -39814 -31547 -1008 47254 54370 -15585 -78003 -108987 -75420 10369 11123 -25069 26178
27479 26178 78501 125930 68676 47664 7724 -77242 -65887 -22233 -41106 -55813 -72280 -29324
27467 -29324 -20790 -19598 -46456 -22657 -43219 -6854 99731 77927 32667 29099 21318 -11938
27455 -11938 -3384 -19892 -66773 -42065 -31346 -35577 -26778 -23668 -46538 -16409 -6415 -12722 -13435
27442 -13435 23917 26069 -17792 -24240 -39087 8301 -2459 12563 37853 16236 -72281 -63723
27430 -63723 -35697 -312 18733 -2881 5289 10695 2979 -20679 -104277 -84995 -48641 -33920
27418 -33920 586 -48477 -84668 -52365 -47386 37361 59098 17134 16261 -5768 -13116 -69101
27406 -69101 -7355 103459 73070 22146 -2742 54810 83002 37700 43346 65684 99246 70509
27394 70509 32702 57992 53607 20503 -43917 -123213 -109308 -61027 -29128 -24658 -24625 -43435 14269
27381 14269 53529 60853 24118 24405 84395 73971 43093 -274 10620 68959 19823 -34492
27369 -34492 11981 17115 -10325 -38967 -30722 -46963 -16255 18073 -17934 -89738 -96563 -67716
27357 -67716 -72237 -63795 -36161 446 60554 82575 113253 22412 -25230 17348 55195 99467
27345 99467 101863 46192 -4174 12009 -45473 -51973 -679 52795 61418 38153 -2262 -30356
27333 -30356 51577 108350 68419 75718 81589 105249 132431 89411 35764 20123 27275 83252
27321 83252 134993 167239 129760 103744 139072 141469 130606 72592 71528 10971 -43923 -28201
27309 -28201 30627 3119 -62041 -77388 -24948 -17955 -24399 -46502 -33149 -2376 34763 32708
27297 32708 21284 19613 -61342 -32440 16302 -27111 -70669 -44324 -9459 31910 9108 -35806
27285 -35806 -69886 -99086 -57408 10707 76994 106384 108379 85526 42257 29878 49044 19432
27273 19432 20062 74500 98675 71046 93362 44071 -20326 -16175 -34801 -77599 -111657 -52716
27261 -52716 29385 48403 -35981 -88803 -24373 36065 3993 -51561 -55526 4217 16309 -4225
27249 -4225 -35238 26808 55445 51552 -14496 8056 7077 -3722 -31206 2465 22451 44379
27237 44379 17310 35795 102728 133865 89939 33927 35275 5829 5969 35321 48723 55852
27225 55852 90869 242643 170288 119281 145138 142300 141705 156384 92373 61859 64303 92581
27213 92581 43784 -61069 -126987 -155690 -174490 -144290 -95351 -85651 -68765 -91879 -160775 -182641
27201 -182641 -137335 -76893 14163 28362 -2129 3276 76636 65300 42903 -36282 -11891 4357
27189 4357 20922 -4678 -55997 -106119 -140807 -137785 -120716 -83055 -32483 -22114 8703 50864
27177 50864 74324 73863 105921 22635 -6036 23739 43556 47837 28415 -8157 35127 80324
27165 80324 47035 51405 68949 50208 94865 71597 57800 55095 65628 67568 68139 63573 54009
27152 54009 63777 26981 -10622 25450 6083 -29334 -40050 -32380 -41812 -75992 -94560 -83018
27140 -83018 -24259 -2419 -12765 19156 23899 -33690 -19081 1017 -2440 28269 32780 23416
27128 23416 27568 39158 69228 95766 74205 97159 94110 81782 49979 25598 5598 -26748
27116 -26748 -81808 -40265 26331 -1852 4475 21534 13042 14545 39164 -8935 3833 30238
27104 30238 38002 22456 -1185 -23767 -61975 -48006 -13439 -9723 20536 -30382 -92756 -87684
27092 -87684 -55958 -33145 41388 44607 50053 45828 40127 17475 -68813 -105662 -74912 -48257
27080 -48257 -3880 22886 8873 -37835 -23359 15567 -4015 -23633 -70286 -55719 -16580 -11913
27068 -11913 -27487 -1012 19611 -1574 -2476 -44639 -17089 -10289 30610 21576 -80869 -89871
27056 -89871 -80022 -90438 -90790 -66915 -58667 -62078 -39279 22601 50765 16404 -8606 -45947 -3555
27043 -3555 30183 17278 19580 84406 151380 157426 107023 24490 23532 55169 81353 67980 22040
27030 22040 31665 24846 31969 34335 6207 16162 22155 14340 61662 91035 91815 139027 146090 121402
27016 121402 76951 74157 59746 24009 6345 37393 32738 47840 15522 -2190 -72203 -106382
27004 -106382 -70213 -99375 -87409 -33948 -20850 -64976 -66332 -49944 -31673 -86824 -106920 -66946
26992 -66946 -82878 -73994 -52086 -24585 -46803 -39509 -36974 -62455 -76431 -47604 -61503 -78730
26980 -78730 -108175 -101880 -96953 -119591 -137642 -146832 -102977 -57858 -36592 1575 53172 12797
26968 12797 -48898 -47711 20097 37448 79551 111361 48837 31961 65737 59694 -2831 -26294
26956 -26294 -32069 -48985 -61452 -31216 19775 61573 57472 -7918 -28159 -2125 56719 40472
26944 40472 21859 15319 48908 31638 30846 52287 28885 5660 -8383 -35245 -306 30644
26932 30644 -3061 -69026 -94240 -51219 13037 51038 22685 -7528 7756 45556 -6828 -23959
26920 -23959 33140 -17183 -28091 -40098 -32071 -9074 -21743 -6220 -28172 -9699 28029 63261
26908 63261 88882 31405 -5996 -5324 -12418 -18277 -102940 -109490 -37179 14201 26153 28111 7570
26895 7570 27326 29157 11495 48806 61101 16984 31512 -30939 -66597 -23579 1224 25611
26883 25611 30458 59022 23767 -10007 -40127 -63348 -67428 -64128 -13983 13986 28552 55703
26871 55703 39739 -43765 -78793 -26415 -37099 -33294 34607 13710 -28715 -22978 -33225 -63762
26859 -63762 -131665 -99908 -62258 -28700 -44675 -61259 -47119 -830 -19500 -72823 -100374 -70279
26847 -70279 8779 94321 37644 6668 -2551 -5249 -42904 -19187 19408 17346 17048 30326 72077
26834 72077 42658 -31964 -33024 -49856 -16229 11171 65610 92285 40022 -24570 -28798 -88
26822 -88 24345 19120 56727 73265 40129 36445 67453 24486 -11990 -14047 80360 131389 74502
26809 74502 9432 -4089 -43245 -32236 -12125 -7983 25663 -11166 -11754 3596 -39809 -70200
26797 -70200 -81301 -60654 -8075 14270 6142 21185 -37892 -55273 -46688 -50014 -18125 -101624
26785 -101624 -123466 -107091 -62624 -22524 -83093 -80602 -70374 -99258 -45024 7689 24767 20934
26773 20934 2977 55159 47664 -56890 -111792 -125140 -113166 -78475 -67173 -63709 12977 46531
26761 46531 36190 7179 15612 72741 57862 54831 32606 20250 56310 97225 102221 100556
26749 100556 63065 56697 65730 45558 6287 18966 31088 49174 124809 121935 130479 96618
26737 96618 48664 46255 47179 -18534 -54663 -36908 -33111 -10392 -9140 -9154 35228 44263 36126 21231
26723 21231 19963 7574 34081 62288 64225 30544 85304 70304 -45234 -81764 17262 8866
26711 8866 60362 59145 36691 82517 79792 -1158 -12367 9420 6430 30290 76340 7630
26699 7630 -5446 66290 52652 -8630 -13856 23355 86852 98411 118701 116369 64446 7872
26687 7872 -8232 3012 17750 39402 92788 56648 61106 58045 1948 24646 54324 54706 39411
26674 39411 9824 -29843 -63160 -581 17787 5579 35602 22746 -34154 -75171 -116061 -176095
26662 -176095 -225136 -189195 -152598 -92909 -25406 13454 42408 64743 82900 65747 12444
26651 12444 -34873 -35056 -23783 -2727 14056 -7675 -60531 -80092 -11716 25396 1822 -38939
26639 -38939 26984 124797 79530 19942 -9085 15970 24851 -50830 -80222 -73830 -25164 -12452
26627 -12452 13130 4534 44573 34146 19696 -43294 -50598 -13505 27234 34270 -26876 -20474
26615 -20474 23111 19121 1096 4116 20685 55985 27358 13256 29527 7997 -35110 -31387
26603 -31387 -6203 -5347 12998 30686 12308 39911 68317 77274 26596 47967 55539 -10848
26591 -10848 -25886 -17754 -16262 -22544 -37047 -58229 -84188 -49518 45406 73668 24700 23220
26579 23220 44203 21246 -49773 -132785 -122867 -49803 -17344 -72281 -78328 -60379 -24362 29547
26567 29547 -19573 -59889 -55654 -7802 -20422 7126 -17638 -8246 142 -24576 -39547 -30035
26555 -30035 -13625 -1557 -21457 -16978 -39701 -20697 -49297 -47423 -57662 -34336 15881 79347
26543 79347 37895 6248 -39494 -33633 26513 57991 14063 9050 43856 60239 96370 99364
26531 99364 102373 63693 32045 10776 -30982 -24096 -4589 23521 55844 53126 43111 -13922
26519 -13922 -28579 42889 26829 18980 21076 18072 -72205 -110858 -92195 -49088 -67722 -76476
26507 -76476 -20586 66306 83609 55657 29796 -1034 -20175 2319 12517 21296 908 13659
26495 13659 -15168 -28409 -35506 47758 71380 63753 -5545 -23615 25470 11569 30953 14566
26483 14566 -53144 -12634 -49290 -31165 -3227 -7795 16233 10242 -16304 26348 56843 51706
26471 51706 46663 40523 67216 123365 95794 63948 36720 23088 21884 10675 26050 33307
26459 33307 15864 2041 -10159 -51281 -34277 -27070 -55101 -53251 -38691 -34708 37487 43654
26447 43654 68387 87117 112620 120279 69070 80108 73671 88892 71374 75717 49513 60330
26435 60330 78188 49559 -28472 -35257 -15911 21090 -5968 20104 30873 2287 633 -35326
26423 -35326 -45174 -16212 -47288 -43361 -42835 -11836 21055 25332 29991 77603 26948 69226 102231
26410 102231 47626 -834 -15127 -9207 100169 146535 147637 154850 103096 56605 43773 74881
26398 74881 67548 18402 -38864 8525 65559 81387 45034 24760 42051 28417 35487 60563
26386 60563 5441 -25900 -16889 -22551 -41857 -43375 -82364 -108782 -136609 -38528 -12203 19388
26374 19388 4790 -957 19147 24674 15028 43528 102761 49538 8034 22486 11888 -23975
26362 -23975 -21650 -48295 -33940 6667 2221 18714 12460 5488 -20722 -11319 15132 -20691 -1590
26349 -1590 14786 -14164 -970 81184 12068 -23765 -29951 -22997 -17940 25373 33177 -36493 -49327
26336 -49327 -39843 -57853 -83816 -21948 50636 84403 6321 -9195 14373 8295 32046 122221
26324 122221 128528 100215 89331 92741 93726 71368 56741 54414 121971 107709 89716 101421
26312 101421 113254 103390 100045 87646 94279 95109 73380 8899 32900 81266 -7913 -34157
26300 -34157 27348 33763 15623 12717 -20494 -18090 -20500 -47118 -58715 -29886 12822 44319
26288 44319 78949 77839 95090 51695 48270 49185 45463 358 -31290 -28744 -26238 -7563 35394
26275 35394 34872 66506 79265 55147 66812 62086 55958 55770 44542 37347 -1929 -8645 2282
26262 2282 -23501 -80279 -11417 32239 -15394 -71237 -94711 -105048 -57869 -25875 -52709 -46937
26250 -46937 -37708 -102048 -116863 -148545 -176449 -81510 -26538 -25820 -45399 -112953 -109778 -32317
26238 -32317 -4318 9128 33365 8470 -30834 -22960 -27750 -7008 15020 -1930 -756 -29102
26226 -29102 -14378 32962 53209 10400 18252 -12640 -34252 -74604 -18951 21485 -8641 -102078
26214 -102078 -155459 -126930 -25383 69141 64545 40135 12419 3972 -8328 22956 31308 39541
26202 39541 30510 27503 44676 -20330 2984 53201 115558 85464 41422 -59175 -93718 -114500
26190 -114500 -53191 -15199 24948 -10066 -13528 -5112 14839 -1168 19263 40538 59791 63928
26178 63928 7910 -13917 -1487 43551 23654 12614 12497 14120 -11963 -3839 7925 -44127
26166 -44127 -71074 -52114 -45174 3023 22177 14438 38209 -21149 -34723 25392 50875 57295
26154 57295 62049 20007 -41435 -56293 -31505 -33503 42947 106769 77521 49425 90638 73072
26142 73072 12283 -64371 -84011 -40205 -32621 -13538 2023 -12391 42590 37600 65227 51862
26130 51862 -4409 -15255 -1379 -59285 -90403 -62793 -49701 -76882 -85107 -74343 -58670 -53665
26118 -53665 -42880 -13293 8232 10111 24986 43888 714 -13129 20927 -20197 -29719 -10132
26106 -10132 33750 45580 52728 10939 -23441 -44630 -44050 -25771 10695 -18678 -36870 -58045
26094 -58045 -49201 -29826 -6887 26739 -23660 -44218 -1183 10820 -87993 -44168 -32273 -46169
26082 -46169 -78323 -56879 -27760 4035 -44290 -83790 -95587 -52020 -15001 -29229 -8765 26486
26070 26486 18614 47429 68510 42333 22412 14624 15164 44252 51724 22869 663 41697 66303
26057 66303 56667 -13887 -33466 -41644 -97648 -89981 -75732 -80468 -78036 -49444 -41997 -5191 10350
26044 10350 -17676 -38771 -41085 -17414 -36531 -42378 -52447 -81265 -54315 -69579 -68713 -50886
26032 -50886 -68143 -67478 -65755 -52401 -57307 -94804 -73997 -19745 4935 -28690 1050 21329
26020 21329 -29341 -94929 -58359 -19692 8179 58415 61127 21226 -12334 -33240 -55735 -50178
26008 -50178 -96577 -27616 -29497 -84774 -86927 -64072 -64196 -84311 -72497 -4410 -27322 -9719
25996 -9719 9422 9672 17910 79475 81129 79338 143728 76535 20179 20444 11511 -28167 19859
25983 19859 7710 -24445 -28593 -21530 -52472 -64395 -66921 -4151 72265 93198 59516 41704
25971 41704 16403 50147 56971 15968 38468 99090 76842 25712 24265 37985 3918 655
25959 655 -8497 -28882 21950 18443 -30058 -30108 -50822 -74457 -71211 -79042 -110197 -98960 -93964 -96491
25945 -96491 -130395 -136340 -143932 -59482 -35199 -16435 28927 17917 51133 63328 10536 15610
25933 15610 24833 -14952 -83646 -108076 -84692 -61930 -26938 -1222 -18765 -689 -5 -47988
25921 -47988 -36475 16249 63755 34894 41166 36616 -45033 -78181 -85117 -73191 -94964 -59031
25909 -59031 -40823 -16112 9469 18655 9193 -26759 -83472 -146869 -143262 -125747 -143688 -129725
25897 -129725 -69435 -66492 -101387 -61123 -37368 -78122 -77141 -50932 -4299 8661 10911 -19001
25885 -19001 -1200 40838 40276 40664 34250 -37974 -23153 -30022 -58296 -105032 -86182 -103193 -156870
25872 -156870 -154154 -124674 -95248 -52248 13364 53208 38993 -2598 28318 60776 47499 -16166
25860 -16166 -99497 -56048 -67235 -56159 -5240 8978 -63128 -140710 -123037 -87857 -70816 -47313
25848 -47313 18770 43653 -14299 9061 26597 22118 -42129 -23983 17954 20663 10861 38220
25836 38220 71627 115147 80021 81459 102148 121655 108663 123956 113527 140299 130573 81306
25824 81306 71553 36702 50901 92470 49175 30842 30258 37432 48131 -2768 -40251 11996
25812 11996 68094 75351 37955 35484 56063 54506 -15374 26445 42650 43540 15024 -16452 -39384
25799 -39384 -30633 -25264 -67199 -64183 -102115 -75706 -55436 -8320 3088 -998 5665 29945 66444
25786 66444 100660 27614 17545 -85186 -68036 -41892 -23514 15516 -85106 -115425 -106721
25775 -106721 -65178 -31221 3069 27464 48562 64823 29667 58698 4813 -36256 -43783 -23409
25763 -23409 -34405 -60493 -62889 -20913 25044 -14489 -24739 -14058 76135 88044 54845 21883
25751 21883 -11650 -40545 -42039 -46557 15260 -7895 -40159 -45068 20926 9824 -32182 -59832
25739 -59832 5259 18482 -25433 82999 108964 110661 129658 59077 26550 -9807 15237 18244
25727 18244 -4585 8413 -23116 -36547 -36595 -79018 -67521 -16758 21313 20093 29737 -41270 -38158
25714 -38158 -41654 -47570 -108675 -150916 -99007 -50638 -66613 -38058 -2199 40854 51511 32869
25702 32869 28599 -20930 -47908 -32882 12115 57477 35028 -1443 -21899 -31892 -51365 -25328
25690 -25328 -12615 -27550 -18811 22379 30007 13727 26080 -20960 -35555 -39533 1367 -26716
25678 -26716 -1137 36915 34340 -13612 -16439 -34027 -9345 54691 33480 -6508 -22206 -68026
25666 -68026 -56623 -63453 -83301 -100672 -117424 -82975 -44629 -29846 -39597 -75621 3396 61923
25654 61923 19552 -27952 -52848 -63103 -9543 -32178 -78026 -35535 7262 57456 80217 75111
25642 75111 24979 92252 135894 139273 104821 60931 39962 26889 -9654 -16852 53952 78883
25630 78883 45412 65154 124768 108646 58012 39454 56313 81756 95080 71487 62017 93821
25618 93821 55790 12488 -20546 58001 67146 50128 87723 80803 94099 61941 21488 28202
25606 28202 36329 -15820 -11231 -3002 2754 -26067 -96569 -109699 -115337 -75109 -92450 -147953 -66535
25593 -66535 34231 6323 -14307 -4198 -3626 24127 8623 -20090 -51356 -73920 -125377 -196648
25581 -196648 -144168 -93878 -14866 24006 -13617 -34238 23729 53 -55600 -97154 -149228
25570 -149228 -119950 -96427 -116132 -106069 -54103 -38164 -59335 -79826 -93462 -102927 -118282 -128551
25558 -128551 -36806 2540 37132 37833 -14763 -16403 -69934 -79261 -38204 -1044 28007 10826
25546 10826 -40663 -40127 -28066 15131 8249 -61406 -9679 33245 28501 -11669 -43648 -14100
25534 -14100 -2058 -53825 -38100 -1250 -50802 -103782 -111312 -60987 -49971 -60800 -51337 -10789
25522 -10789 -6047 -36380 -11240 -37113 19236 61707 28771 18864 13927 33947 63825 28358
25510 28358 -38503 -7815 -30785 -150 42097 -10364 -53657 15495 72898 74755 46976 25751
25498 25751 29106 49837 54282 8026 -15667 32475 18870 -192 9555 13636 -7534 18036
25486 18036 54190 3109 -41077 28970 73803 84981 90131 107497 50297 98 -10178 7113
25474 7113 13092 26367 6605 -70125 -135636 -96616 -32618 -8506 2787 49002 42354 -37157
25462 -37157 -15997 -11888 13599 20340 63599 72848 57405 66666 29855 19499 17374 -49959 -9750
25449 -9750 49121 54298 30198 -7790 -26775 -35424 -30647 -21221 39007 110230 52689 33554 35793
25436 35793 61889 97175 113218 113023 66672 48334 -26510 -22818 -13157 -23038 31284 75907 41005
25423 41005 -5634 -27634 -41460 -52927 -70319 -61150 -61903 -13150 -6554 -5007 59045 45933 -35569
25410 -35569 -99439 -56822 -25537 -27756 -28120 25687 42657 40447 7672 13225 11205 71766 85687
25397 85687 39336 31525 47329 60314 42087 21654 43433 16882 9859 -6213 -3506 -21599
25385 -21599 -45239 -74769 -62381 -34486 -47950 -13315 13629 7472 13697 11464 25323 24343 -8849
25372 -8849 -3138 2908 1543 21028 6576 25921 -45260 -66463 -27491 -9781 22595 36182
25360 36182 60925 58161 26746 -7074 7134 -19245 -61634 -42545 -33016 -11055 -33127 -51112
25348 -51112 19733 33379 5333 -26201 -30456 -60851 -45112 -22910 -58714 -90885 -21788 11444
25336 11444 18856 19822 5049 30683 19922 -24899 -1993 6358 -24103 24991 65260 25150
25324 25150 30159 20877 -3245 16467 11959 43688 21475 10498 22172 -26708 -36896 -14414
25312 -14414 29024 53548 -1754 -50195 -100068 -87754 -58687 -2758 68969 35228 -18190 -15725
25300 -15725 -8563 -47352 -44129 -47038 -30152 -20826 -18992 -39329 -25713 -38127 -66622 -111718 -115265
25287 -115265 -76020 -66165 -84164 -46163 49769 31724 -18501 -75510 -89025 -73828 -3038 41505
25275 41505 15188 -70365 -103842 -78110 -83116 -68214 -33314 32763 35554 28180 2201 34945
25263 34945 41087 -25670 -62531 -86242 -106597 -118821 -125197 -55247 -13172 -14494 -23053 -69421
25251 -69421 -42102 -32673 -4307 2274 -50439 -60028 -38030 -42284 -18234 -13297 39681 113114 86940
25238 86940 37277 5037 24368 3527 -10464 -11379 -37191 16088 17868 -5724 17296 22324
25226 22324 50763 33341 -19829 -50393 -2845 27279 -18460 -110953 -90909 -45435 -11459 -5620
25214 -5620 1596 -25103 -36721 2085 39049 18737 -25996 -10249 -29935 -8859 21280 9274
25202 9274 -8490 -449 -17599 15921 35695 22886 12273 -23159 -45132 -21496 -32263 -38591
25190 -38591 -7700 10870 1774 2706 -15765 -4800 -30542 -82955 -117836 -63940 -1988 -41051
25178 -41051 -74495 -53693 -18819 -29030 24706 26393 48133 63799 22382 3510 -45027 -44592
25166 -44592 -48703 -75731 -110706 -141549 -119374 -75862 -95552 -141759 -95589 -20708 77214 135822
25154 135822 139304 65560 44211 43317 31165 -26706 -60165 -49475 -9351 28685 1097 -21482
25142 -21482 -77047 -48587 -24499 -71216 -94363 -86375 -93606 -80768 5937 75053 81223 26804
25130 26804 26190 17787 45294 57530 35403 41257 113510 110954 30677 -5991 -77026 -58940 -62103
25117 -62103 -47106 4178 7598 -20902 67454 69780 51929 35574 11280 -18657 29203 50710
25105 50710 -29295 -8444 29341 24871 44115 76445 56904 9734 -16085 -19368 -22119 -36531
25093 -36531 11454 61735 97559 62621 -22114 -60830 -33005 -2514 -12192 -63734 -85000 -92120
25081 -92120 -102230 -54438 -56510 -65866 -31341 -17042 -16307 -3574 -9339 -363 21297 -6908 -7796
25068 -7796 -27874 -95372 -119875 -122161 -119241 -111150 -90946 -44814 -49848 -16391 2289 -48372 -74006
25055 -74006 -31837 -8166 17294 21651 45824 -69268 -87667 -55318 -26100 23542 255 -49738
25043 -49738 -65016 -53496 -47203 -69522 -89339 -88341 -102376 -78752 -44748 -15307 -60760 -30362
25031 -30362 -2905 -15686 -54673 -36503 -46593 -96483 -52321 -43493 -39040 -23129 -1006 -7111
25019 -7111 -70836 -71091 -72440 -40096 11849 2874 37406 34412 10628 -19130 -12086 26384 1309
25006 1309 -83847 -74670 -14487 -25475 -6731 47765 27034 19598 36756 44431 100895 104219 80715
24993 80715 18979 -19645 -24978 -29854 -1104 -630 -1456 36567 38767 52559 30828 -14381 -46684
24980 -46684 -82076 -44914 -11890 -15829 -35070 -64211 -79952 -61796 -71990 -81478 -71346 -77545
24968 -77545 -71147 -75910 -67715 -65767 -24310 -14360 -5270 793 18009 12280 3483 11196 34558 4909
24954 4909 25010 8703 -44075 -24903 -56380 -38540 25845 61062 61953 62901 46487 62290 62496
24941 62496 27336 55398 88901 71322 14879 73112 116019 57718 1661 -60468 -76923 -42000
24929 -42000 -123781 -131734 -97696 -75738 9342 100642 154626 168924 134604 74934 -1388 -16799
24917 -16799 34239 84380 13145 -47201 -65081 -63849 -48872 -10289 12635 36752 12847 9746
24905 9746 27958 -32493 -70335 -67574 371 38555 -49985 -101061 -74406 -7538 29638 44467
24893 44467 31922 31143 15885 -35664 -79391 -103508 -59001 -29625 -47709 -11344 -76691 -85446
24881 -85446 -49281 -30171 -70004 -74749 -19128 -12217 -20345 17036 5061 -49467 -51148 -19890
24869 -19890 -34935 -17321 -48884 -36489 -29521 -15576 -37906 -5319 -9497 -73263 -85283 -63944
24857 -63944 4944 25608 52747 53967 46291 35142 -5452 -30946 -18421 -39395 -12949 5276
24845 5276 294 -21921 14056 15067 -41645 -88999 -33037 -4851 9108 -12473 1337 16088
24833 16088 -5318 -17105 -72634 -107947 -65927 -42095 -13678 -5266 -4852 -3249 -4757 31222 29775
24820 29775 77839 68952 36846 42428 7599 29136 29673 44019 17567 16764 -48807 -70514 -74317
24807 -74317 -47197 -15530 27629 34135 10465 41162 17347 -21730 6292 4688 -22507 8108
24795 8108 51531 45444 45692 36568 25809 598 36459 62965 75751 86104 71428 65582 89150
24782 89150 41352 39944 66028 58106 39042 -6865 30618 87843 145435 137892 113638 120118
24770 120118 84036 34517 24251 25508 32541 26621 -22610 -88150 -156555 -118863 13469 37987
24758 37987 31866 56878 41604 13231 30305 34916 24826 13399 -33976 7637 42190 -7636
24746 -7636 -6242 -19330 -78322 -101857 -92794 -37976 -63155 -20537 12602 -10074 -2459 -5972 -46923
24733 -46923 -30276 24175 18761 63167 8924 -70240 -57938 28575 49906 12934 -46951 -16929
24721 -16929 24250 30344 36770 63512 68138 24600 11717 -25793 8881 24421 -28820 -104137
24709 -104137 -140598 -142824 -105999 -28590 5704 -76814 -136852 -73871 -22568 -9835 -7737 6177
24697 6177 28240 61902 21024 -18584 7483 -12383 -11213 4854 -2136 -18453 -2700 31566
24685 31566 69625 63548 35259 25426 24243 26762 -43449 -62107 -29319 -11864 -33006 -2399
24673 -2399 63948 59041 8892 -2016 48411 16504 10889 38925 45708 9401 4547 98700 109896
24660 109896 94257 83194 64542 53661 11673 -31517 40368 33320 -25986 -17179 -69241 -82481
24648 -82481 -11984 39311 36046 47342 42576 33278 47151 44584 -21207 -17995 4539 -9182 42970
24635 42970 78875 84233 34642 65790 88359 89644 49336 543 -13027 5758 49815 32560
24623 32560 -76891 -101130 -112521 -117029 -139919 -52205 -24420 -8751 56952 71097 64980 60617
24611 60617 54395 19102 -30671 -35936 -47866 -62269 -19863 38816 53263 47606 62416 57895
24599 57895 73212 36809 6411 60341 -3196 -33317 -6121 31722 10420 -49476 -80047 -104098
24587 -104098 -114150 -58958 -22875 -13704 -31369 -11163 11469 -19592 15499 64369 16575 -1958
24575 -1958 -49505 -90577 -46490 17343 20748 49402 22270 -32367 2809 73858 66537 88196
24563 88196 55329 29315 37446 -13601 27325 61539 -9681 -67369 -66332 -59611 -55059 -75423
24551 -75423 -59621 -37255 18249 1090 3496 -23102 -74973 -40529 -57898 -14713 40978 45115
24539 45115 71911 50889 14880 -24149 -16500 1604 43951 92756 60385 -14923 -108552 -133858
24527 -133858 -94249 -48500 -12561 1118 -50242 -83069 -4921 -24747 -81134 -92769 -95223 -82293
24515 -82293 -15894 30936 47198 55319 7357 -31958 -31566 -44121 -67426 -57853 -77667 -53293
24503 -53293 -784 -83161 -138947 -81320 -68312 -58291 -46788 -51511 -73669 -28422 48460 47899
24491 47899 25418 -16650 -4423 -25914 -25581 -49581 -18623 -51764 -58094 -30685 -45758 -99611
24479 -99611 -122872 -91993 -78624 -81600 -76705 -77486 -91764 -113804 -109467 -85850 -55086 -18892 19302
24466 19302 42299 5778 -34457 -12364 19495 55259 73680 10129 54325 28613 -33890 -9130
24454 -9130 16306 4294 10747 44892 52337 16771 27376 73031 17093 -11623 9783 44600
24442 44600 49835 45677 67185 84344 83947 82833 29100 39181 80360 117889 162975 197701 141029
24429 141029 27960 -61548 -73048 -109396 -67938 50829 71924 31048 17174 34775 67236
24418 67236 58547 41469 10801 15773 -6153 -3844 -17696 17128 34851 38922 77371 62296
24406 62296 105253 80508 30037 3603 32773 43224 -35409 -36182 -58209 -69915 -58976 -14647
24394 -14647 -40420 -23554 3180 1520 17134 4118 35268 67663 26357 17932 8161 -17442
24382 -17442 19915 4844 -42071 -39715 -58061 -44863 -47420 -71769 -42496 -25214 18004 51387
24370 51387 -12222 -70252 -30602 55604 67198 15449 -28067 4051 40036 25032 10625 -22390
24358 -22390 -47834 -80757 -90913 -111853 -94142 -45339 -31434 17376 -9580 15035 -22980 -37277
24346 -37277 -55950 -48851 -16033 -6625 -5028 -10264 -7847 -57602 -96210 -64943 -36183 -29986 -53232
24333 -53232 -38418 -48394 -73185 -97937 -114719 -102652 -91749 -42827 -27712 -38338 -14755 -10270
24321 -10270 -49035 -55477 -23328 -17092 17695 36728 -346 4079 -7745 7670 52329 70815
24309 70815 79156 45701 -3307 11490 21686 35022 92562 113049 91197 52810 27826 16279
24297 16279 15213 -1122 13966 33105 38878 -23891 -67224 -58679 22245 37872 37269 31730 -53778
24284 -53778 -84591 -55907 -36946 -31763 -4281 -15832 -24097 -22728 814 17799 16109 -24965
24272 -24965 -86187 -85466 -72354 -36693 -44835 -47864 -23155 28701 25425 -23140 -41879 -26646 -9536
24259 -9536 -2406 47726 13869 -21670 -25039 -53376 -60634 -36660 -95757 -102989 -106794 -132262 -106255
24246 -106255 -94444 -61478 35087 17686 -12242 -24525 -38453 17021 7771 -68982 -97603 -39321
24234 -39321 -52742 -31483 -14632 7832 45845 23206 -1027 5872 -1110 21635 27534 34356
24222 34356 55867 106862 94315 13006 -54373 -57458 -13690 -3085 -12562 -23755 -62229 5078
24210 5078 49832 59605 35885 44156 41223 9383 7559 20414 8503 21179 19688 -8138 -37835
24197 -37835 -32392 26859 36244 20212 8312 -31060 -13330 20848 3920 33727 65987 42657
24185 42657 64565 103112 118140 65471 72607 68153 35477 962 -16056 -8295 -71408 -60127
24173 -60127 -23339 68523 53760 -22462 -42137 -58128 -49268 -54464 -69351 -32350 15367 29951
24161 29951 21079 -4333 -43407 -39548 -75752 -35004 -29252 -15829 6661 46131 54044 9458
24149 9458 -52745 -44693 11426 24469 -10955 -23219 18704 47718 111788 5780 -3437 -36243
24137 -36243 -50390 -45994 -12780 -18912 -31838 -25998 -7716 16092 29042 18680 -1497 -392
24125 -392 -18330 -72563 -33509 18863 21009 -9252 -47332 -61328 -42857 -31627 -54806 -10172
24113 -10172 44578 14760 26362 36756 39257 13107 14128 -9165 31544 65297 12970 24686
24101 24686 -1964 -65377 -101940 -71929 -37022 -5417 -14296 26031 8577 -43616 -23873 -65250
24089 -65250 -97837 -125548 -131675 -51667 3896 40385 68913 84177 48950 45749 114545 86909
24077 86909 31415 -31400 -36003 -57224 -78380 -62458 -26403 -16132 -55046 -7150 18559 18941
24065 18941 16312 -13465 27059 46475 22098 -8238 43091 27012 -4485 40002 87172 13065
24053 13065 -70798 -64884 -24221 -20221 -45968 -5160 18920 -6362 -33563 -10888 3316 -6543
24041 -6543 48837 23179 9691 -43614 -104261 -91345 -60969 -92523 -146196 -105182 -29337 -25266
24029 -25266 18068 10540 43597 80044 78079 36306 8051 23103 37298 30772 46850 9468
24017 9468 34491 88034 56133 14544 -8898 2642 -45123 -45285 -9811 -12583 -27238 -57469
24005 -57469 -22232 -9636 79261 101187 65164 -6578 -52307 -76279 -63106 -7390 55078 49804
23993 49804 37277 13586 -8763 -34460 -71799 -119078 -96423 -33325 22804 9028 -60351 -92
23981 -92 61647 23178 21884 13943 -47332 -85816 -73465 -32892 -53695 -98684 -48787 -11759 10602
23968 10602 38877 59791 83924 47092 -14597 -26479 -5714 -29536 -50756 -29969 -33162 17547
23956 17547 16920 22679 3832 -82574 -68890 -20539 65038 31964 -26037 -51753 -83861 -64722
23944 -64722 -67630 -42074 -56702 -60809 -28547 -51039 -100086 -125644 -83698 -16697 -68987 -97221
23932 -97221 -76450 -96633 -121413 -122003 -99229 -87576 -104251 -62277 -53821 -45045 -21644 -35619
23920 -35619 -106615 -136625 -98638 -55780 -9852 21703 -25958 -102398 -85523 -39814 -40787 -29714
23908 -29714 -22813 4087 37655 26640 28040 42030 3821 2364 -66219 -63679 -6005 38105
23896 38105 19169 -17427 6832 746 -16063 -73295 -99535 -95663 -36012 -31152 -27183 -8034
23884 -8034 18301 26340 1173 -38029 -1077 36626 104500 46029 -30289 -5483 -3497 49158
23872 49158 45594 34516 13856 66535 106760 61314 62516 43831 39115 115259 98577 44640
23860 44640 19239 2400 30434 -25126 -54169 -56305 -36677 -19907 8764 -1114 -34113 -61258
23848 -61258 -46865 -18485 -40468 -22594 -923 -58704 -91876 -76682 -88574 -4479 58510 50778
23836 50778 -5201 -59071 -93994 -23361 26502 -10019 -97720 -170043 -129892 -190 71964
23825 71964 63967 33903 38289 45666 -17746 -70540 -65501 -82796 -75493 -47468 3664 47962 38577
23812 38577 -17295 -25095 7675 66062 55953 32070 67744 100999 52863 12136 9566 5
23800 5 44856 22750 55419 57698 54086 68997 91030 74131 22047 50120 76356 -31377 -85321
23787 -85321 -108432 1307 3491 -40646 -78758 -156281 -148257 -94569 -76221 -40726 -53760 -57660
23775 -57660 -31302 -2044 -24193 14501 41754 46261 -26671 -86083 -99922 -91900 6562 30313
23763 30313 -527 2593 19717 13689 -11322 6620 45486 19494 217 -23469 -27825 -32012
23751 -32012 -21908 20337 64815 9976 -19786 -54826 -36509 31458 18150 3316 32614 9008
23739 9008 -1136 67888 105588 102532 94954 110812 133796 44411 -37602 30313 10454 40029
23727 40029 102014 47503 -23281 -7230 23031 20829 -21619 -32269 -3949 -36439 -14099 -4047
23715 -4047 -43805 -21612 -4737 -36100 -56284 -15680 -11506 -36494 -36076 -81336 -31339 2166
23703 2166 -1885 2087 -16488 14180 1372 -16823 5886 25715 33043 2591 24334 25521 -37157
23690 -37157 -56807 10224 -1971 -6419 5030 11573 -3242 45704 81133 63492 20527 -13516
23678 -13516 31071 53335 52150 75115 62368 52869 43883 586 -38375 -43051 -59947 -49209
23666 -49209 -90109 -34168 -417 23925 95289 66119 28523 826 -6945 -16804 -9613 -90698
23654 -90698 -142556 -58522 -28541 461 37967 54427 39137 49561 91697 82973 59207 28486
23642 28486 16913 -43247 -67161 -39364 -42506 -32430 -75400 -83620 -97679 -39350 -20565 17383
23630 17383 36651 1650 2563 29577 -10796 -61857 -37353 -1487 28695 -2913 -40976 -71243
23618 -71243 -34501 22469 7537 -69419 -98053 -83337 -63366 -5947 31519 79554 142871 117924
23606 117924 65007 56460 52995 90681 60308 37518 22265 -16484 6166 34714 19347 -51758
23594 -51758 -65136 -39083 -40585 -18092 -51579 -41111 541 30845 48920 4610 -14074 -11808
23582 -11808 -9671 47335 85364 57768 -3741 -24543 -23026 -8263 1593 -19123 -27311 -58979
23570 -58979 -68154 -57443 -7533 -25517 -17512 -7999 -34258 -41072 -39550 -30831 -53781 -45136 36801
23557 36801 45389 -1474 12486 -12950 17013 102239 124829 144525 104464 48380 12584 10054
23545 10054 16277 -81474 -148970 -76334 -28010 -10544 40251 59012 46477 30825 22386 33900
23533 33900 -31888 -175705 -188595 -104509 -68873 -66973 -51920 4637 10941 -1046 4205 2203
23521 2203 -34957 -65545 -36628 -41597 -16750 -22545 -87978 -97036 -27281 -41504 7991 35679
23509 35679 59673 28910 -4327 -10545 4454 -34292 -79392 -87244 -52355 -29310 -12178 7102
23497 7102 -45592 -118561 -151165 -158037 -136104 -112050 -53803 -51479 -51075 26265 79305 92314 51036
23484 51036 22611 -32100 -37138 -39963 53664 112965 75004 99033 99646 110029 88912 8746
23472 8746 -43450 -13424 10284 -39212 -23198 36113 27485 -23207 -75009 -56260 -16676 31200
23460 31200 1995 -37888 -19397 8529 13124 8154 2102 46308 61737 44414 34528 -28955
23448 -28955 -123556 -61487 -26694 1156 19816 38697 50726 36914 16820 53056 89819 70010
23436 70010 35040 81639 72677 62654 36874 55288 58696 90792 98443 58102 206 -15224
23424 -15224 42504 32016 59104 35578 15947 -10412 -16139 56945 47015 20059 -3317 12888
23412 12888 31855 37704 13205 -38021 -26963 1937 -3603 50881 29640 -6950 -34377 -6203
23400 -6203 -7295 -9099 -18638 -1054 24906 17453 44872 80196 60345 44663 68861 59818 45405
23387 45405 134898 161750 134459 124440 118130 91117 35957 -1868 -63754 -69348 -15206 -16545
23375 -16545 -34897 -7612 62606 137427 84871 33892 -2503 37417 78261 50898 13938 39718
23363 39718 -23013 -25128 31554 53381 43713 31511 -9158 -29684 -7430 -5669 -18362 -16197
23351 -16197 -19750 19506 32414 36851 45118 32547 -23477 -9318 -20757 -19131 -4508 -18598
23339 -18598 38844 28695 -55112 -18352 16291 11486 -28113 -50407 -33887 -54871 -50696 40783
23327 40783 9994 -11711 -188 -14325 -48130 -121630 -81990 -11695 -66872 -100327 -60988 -88683
23315 -88683 -93453 -74054 -57050 -66437 -63373 27775 9401 -55981 -84945 -54381 -53602 -36852 18418
23302 18418 31493 47557 24068 -16405 -28591 -17376 -12814 -38690 -24477 -30337 -84216 -25834
23290 -25834 32408 34543 6206 -6973 -615 -5305 -32890 14083 24678 19693 -60881 -117593
23278 -117593 -111144 -93291 -77455 -42787 -73765 -58220 -12261 41528 75902 113540 80101 76043
23266 76043 53293 63309 43804 16886 -53045 -67967 -76832 -105901 -74753 -25405 41421 74295
23254 74295 49645 30420 63847 106745 77101 26360 1328 30586 97097 85947 53011 3978
23242 3978 -839 37530 104566 126025 68085 45893 44578 -4438 -19251 5124 34011 -23265
23230 -23265 -93810 -105450 -96994 -30660 -1264 52015 25123 -17678 -15609 -57445 -92083 -21170
23218 -21170 64137 77417 57634 -19681 -5026 23237 63670 64421 17251 25005 -26488 -29696
23206 -29696 -62765 -101191 -107421 -85052 -37042 -55582 -49274 -16585 13052 22017 17764 -29021
23194 -29021 -35514 -37153 -55159 -48614 -37562 -36965 -71840 -56944 -44926 -21312 -67855 -62356 -47754
23181 -47754 -39169 -89924 -84434 -41342 34495 68335 33480 4739 -7203 -57426 -63964 -2599
23169 -2599 30032 10278 -33506 -34932 31307 32806 14092 6735 3039 -46939 -71038 -95922 -86759
23156 -86759 -48189 -21651 -54361 11762 79744 96289 144717 152010 100455 56434 31919 70146
23144 70146 92083 94882 101326 85107 62527 67214 127151 122987 59095 34455 32520 25760 -10994
23131 -10994 -22117 -45447 -75695 -91803 -11460 83093 69957 28654 45834 61963 22611 -4788
23119 -4788 13721 10123 -15026 -18773 6617 18064 -9473 -50374 -57240 12251 75034 53690
23107 53690 21736 -3971 -13305 22838 12222 -6303 -6814 28187 8589 9632 998 72414 72642
23094 72642 16553 -84006 -107291 -58160 -17383 33428 83996 62311 8833 52224 103153
23083 103153 96445 72197 12257 -53290 -27448 6051 25720 3656 18003 21451 -4408 -9430
23071 -9430 -69599 -115567 -97481 -70137 -19263 -27928 -53157 -78419 -41042 -2009 42883 82969
23059 82969 115327 142692 184807 195898 142282 95429 104224 65869 -5894 16998 7550 7407
23047 7407 89940 109196 66245 40125 23732 393 -28095 -66435 -95520 -29134 -29023 -41711
23035 -41711 -67337 -79321 -46943 69166 35510 -5509 29181 11318 -86193 -112509 -56287
23024 -56287 -22900 4712 -29849 -30842 31061 99119 105748 8387 -74205 -63676 -19402 30673
23012 30673 71097 81699 84914 102613 94168 115478 97654 137046 134708 126367 127975 103075 92120
22999 92120 92460 104058 77762 57742 60691 33855 -19671 -71413 -77660 -12021 43365 29584
22987 29584 71446 157678 231692 254782 277393 271236 279619 373054 557653 785361 1116524
22976 1116524 1501230 1812611 1979430 1959562 1839705 1617528 1273649 978577 753746 536556
22966 536556 396170 295534 203870 156550 103345 78805 78077 74707 104929 116598 51667 11565
22954 11565 -7930 -10754 -40625 26489 4153 -24777 25911 14642 -2008 40718 91522 51656
22942 51656 60131 85199 98225 64174 59338 110547 126264 58857 71254 25676 23010 73457
22930 73457 46714 -5874 -6955 -45605 -90143 2024 47112 65377 80959 81730 63702 -4071
22918 -4071 129128 177863 179539 157472 119852 96745 71411 83551 95748 44181 -1265 -30820
22906 -30820 -164 66697 93836 30609 9231 11672 -20907 22929 65904 81179 18965 29933
22894 29933 6247 -57263 -47128 -18729 -50933 -62971 -63681 -109985 -74625 -21546 26974 50528
22882 50528 24008 30800 37567 76789 63077 62510 58574 76891 -20690 -59995 -44765 -50117 -94515
22869 -94515 -109977 -91697 -119026 -82606 -43154 -78024 -14679 42181 -10841 7749 55687 32082
22857 32082 -10848 27557 16851 6312 -66604 -55314 -3923 10915 -10117 -42926 -54020 -55758
22845 -55758 -16677 24862 36138 62693 20600 7727 15216 -1611 -20142 -35426 58946 -545
22833 -545 -65002 14028 64720 81931 66331 60988 94159 41270 -32986 -66282 -60196 2804
22821 2804 45808 27159 65324 61726 51229 1117 -42426 -35097 -16571 -31234 -34002 -49569
22809 -49569 -49174 -46353 -48615 24411 61365 90713 57358 45667 24564 -35653 -68064 -35406
22797 -35406 44074 68683 55040 35031 28229 55564 62612 9080 11042 -44297 -89272 -99176
22785 -99176 -168960 -185827 -101185 -44756 -28165 -15865 7830 71417 87412 61963 30403 28334
22773 28334 61583 47839 23296 -18912 -39502 -41666 29974 67136 57769 57583 120612 123688 66976
22760 66976 2167 16956 19750 55124 68799 41669 10008 -24044 34389 44413 2967 29499
22748 29499 68699 96620 99154 78704 14312 20024 16586 26822 112225 106325 19826 38906
22736 38906 15952 -8655 10124 95323 156315 122312 152382 173520 123475 60553 39285 50955
22724 50955 172669 184641 141964 85658 64791 44041 37659 63557 29111 -27318 -39240 -14924
22712 -14924 57299 123225 105752 96109 57622 -9638 16007 58101 60966 100161 166021 236393
22700 236393 181796 145148 119022 160245 142625 41304 50675 75224 58791 66794 139655 154925
22688 154925 161098 207746 271906 274012 294739 279551 248623 227771 140264 159433 132050 134208
22676 134208 122237 48820 41789 58204 80848 104236 123864 137292 94062 94551 101223 107188
22664 107188 48493 106475 91263 28011 -6474 -1110 27169 51142 79460 122758 110961 117080
22652 117080 113184 100389 83146 77906 68205 65990 54710 44912 52159 44920 90974 90627 85210
22639 85210 103505 86841 70111 70574 79714 77938 96761 143736 193914 157501 110640 53681
22627 53681 109853 147585 101203 166055 342089 487788 529859 602185 727083 798871 770082
22616 770082 708252 640212 582299 463724 374754 363791 330890 321250 296162 220096 206404
22605 206404 245921 214906 162469 120130 110027 149146 179468 200593 112556 136473 173250
22594 173250 156133 81643 113877 177011 202613 234006 281657 278474 304069 259562 229783 229066
22582 229066 157511 73872 47267 25278 55681 136881 141743 113170 163934 171368 185382 171051
22570 171051 199782 254712 222166 179766 183513 189203 215173 181101 134461 104572 143384 189244
22558 189244 152598 122310 163305 238776 243625 299189 304700 268399 254719 281785 248865 273800
22546 273800 333533 376250 391431 362765 350370 362432 359152 402052 422194 432822 377077 329819
22534 329819 379626 377929 422848 379336 316112 312086 301752 385291 421756 411603 438743 456754
22522 456754 474570 508381 561195 607028 581913 588139 660375 701066 725376 813414 831113 893051
22510 893051 950027 1034626 1210485 1519610 1890016 2253399 2510321 2600671 2557656 2350771
22500 2350771 2078584 1752029 1433904 1207928 1083126 979312 952105 935539 941633 943563
22490 943563 920594 997472 1056402 1032624 1032816 1034329 1074923 1136486 1211210 1242380 1335420 1386947
22478 1386947 1343306 1372795 1372904 1426908 1534274 1608262 1704467 1767485 1806742 1897277 2001090
22467 2001090 2082826 2156105 2324508 2495012 2642443 2780235 3010637 3318058 3671764 3903806
22457 3903806 4200285 4602635 5066909 5588941 6149901 6754343 7412233 8199426 9135270
22448 9135270 10286059 11583453 13109091 14826807 16828918 19219284 21970071 25204029
22440 25204029 29198649 34254259 40755586 49404111 61599812 79865449 107823573 147715621
22432 147715621 198427229 257676200 315718632 357315868 374234946 362629097 321087430
22425 321087430 261415581 199452304 143048461 98775195 69089708 50145507 37592093
22418 37592093 28898507 22626989 18004444 14525259 11872245 9916599 8431771 7309330
22410 7309330 6441195 5698097 5091461 4543314 4059838 3720832 3395519 3024735 2723623
22401 2723623 2528510 2400177 2242420 2049966 1980006 1896643 1890442 1914896 1854384 1717152
22391 1717152 1610045 1510706 1434575 1299112 1167325 1104364 1103798 1048581 952536 940613 972403
22380 972403 929351 907162 868360 796357 740969 784054 784440 704555 659862 639563 626083 597342
22368 597342 568448 602292 645048 655810 675446 725789 789183 849323 863725 845566 883384
22357 883384 1058446 1291887 1593778 1877304 2110608 2235959 2246660 2103693 1887952 1590179
22347 1590179 1201122 918019 699482 472841 372211 349767 315398 259768 179669 184203
22337 184203 226898 248772 198560 179051 178150 226625 256259 218845 264309 231481 174943 162695
22325 162695 180216 159536 158542 158018 142458 115033 97338 100431 57763 43254 23688 55303
22313 55303 85146 55494 41949 7429 -11350 27992 43080 79381 98155 123124 73750 98515
22301 98515 173139 285876 320210 303087 238721 198337 249718 236931 225233 220466 203125 181052
22289 181052 180447 226965 170963 106356 83134 77146 48989 40755 74909 86421 96983 153251
22277 153251 185962 160136 158033 132031 137896 122661 67651 27017 -29148 -75456 -95672 -99831
22265 -99831 -118549 -85605 20074 103789 80536 29726 10381 -19987 12904 -24260 -48780
22254 -48780 -54277 -95991 -111791 -129921 -135435 -206131 -265657 -178479 -173821 -220263 -227942 -293637
22242 -293637 -324031 -443731 -499809 -520206 -552722 -548862 -528521 -448954 -363438 -221577 -161688
22231 -161688 -63654 15597 40168 64481 109405 99819 122260 167945 148976 122089 90945 92904
22219 92904 123303 97171 42235 -14458 -4720 -40483 -61768 -31728 9358 112156 81665 71543
22207 71543 115012 94961 -12042 -60560 -47069 -32948 -13714 6792 15758 2582 8710 -9012
22195 -9012 30135 42804 -4954 -46739 -43547 -196 -32564 -49888 -64825 -32893 -55258 -81584
22183 -81584 -62207 -72527 -80450 -46685 -2044 -45465 -65068 -31366 6929 35338 58376 42088
22171 42088 -21314 -32702 -11329 -100 22525 12393 -15895 6152 72917 49215 -29201 -47343
22159 -47343 -54290 -38113 -39454 -61569 -37229 -36496 -21454 16016 30455 63202 47673 8029
22147 8029 -4076 -1397 11333 32118 42273 15196 13642 35861 62347 26376 -23087 -50510
22135 -50510 -25019 -4367 -49656 -95950 -38467 15917 51821 81751 57087 83577 67593 58989
22123 58989 37425 30739 -49574 -103620 -109199 -100204 -13117 -400 -17915 -15944 -26677 21338
22111 21338 40568 21824 10463 -53427 -48361 -20695 -2342 37797 42587 43248 28171 35323 4766
22098 4766 -2391 57002 55952 7214 -32062 -16154 -32102 -82670 -114985 -41953 -17084 7600
22086 7600 -29281 11581 15407 -19227 -39655 -45019 -529 34734 5679 2392 1554 -33847 -14680
22073 -14680 59434 97173 87541 123414 145346 90168 34440 -5996 -16366 20912 102606 119736
22061 119736 24985 -42293 -34126 37789 89076 73091 49747 26781 43328 122370 66720 -57125
22049 -57125 -101511 -98958 -105687 -24653 44550 52322 93995 16281 -29289 -6203 75756 97864
22037 97864 -19157 -21617 -29736 -29973 16408 -34089 -90252 -49783 29878 43082 -6771 -42362
22025 -42362 -49125 -27549 3235 2243 -44581 -76336 -93620 -97203 -103694 -66145 33925 85625
22013 85625 50316 89495 101986 5798 38551 75088 54078 -12862 -43942 18577 40574 -14314
22001 -14314 -35762 -73360 -31092 -4693 -22997 12092 44932 -7095 -16560 11200 33516 57533
21989 57533 85050 127751 144131 129966 150619 105279 21428 -17902 -17355 35063 91163 100683
21977 100683 71529 35108 -2383 -23374 -34049 -46221 -48424 -59250 -115630 -113435 -105062 -89443
21965 -89443 -46236 -51717 5791 50900 7624 -57233 -60126 5259 -8643 -64629 -70305 -55423
21953 -55423 -77581 -56981 -75876 -55230 -77899 -62551 -3754 11039 -10349 5224 -14148 -11946
21941 -11946 -22748 -43558 17557 39751 48702 25421 7998 66179 95934 76115 14384 17598
21929 17598 37445 30614 -17378 -47439 -46935 -32354 -28232 11009 60202 103758 60938 2583
21917 2583 -21529 17149 51760 -724 -16373 1080 -8070 -31360 20804 648 -47715 -28778
21905 -28778 -88246 -128793 -106945 -49291 -9057 -42932 -46775 32619 34973 44909 53954 53505 84328
21892 84328 98782 87126 95099 74377 53721 102218 134741 183584 201732 212394 261679 350020
21880 350020 450032 583932 831903 1097404 1424228 1777622 1960224 1973858 1873435 1642479
21870 1642479 1316701 953711 688631 516394 363277 245537 144566 98161 81251 39765
21860 39765 71548 90510 42299 15060 55690 29848 -20397 -79384 -88596 -99782 -17647 15386
21848 15386 -61338 -57625 -47899 -25392 7749 19614 51128 107069 83713 22538 -27190 -14935
21836 -14935 -21042 -23810 -18774 43 -20471 -34407 -47277 -108191 -78114 -58380 -78632 -32117
21824 -32117 -76891 -102812 -156104 -93130 -9277 54093 9637 -44120 -104949 -130523 -100992 -108910
21812 -108910 -82356 -14720 14807 14511 -1898 -69051 -37905 -32498 -17904 -10229 9311 -47
21800 -47 -48114 -47444 -42617 -56166 -69968 -26852 -2249 -8412 -36975 -13447 -19198 -20053 -51743 -77497
21786 -77497 -87643 -15127 -15137 -25301 -27003 -43978 -64299 -89914 -74270 -48207 -44775 -28499 -55857
21773 -55857 -31273 -5548 50265 36760 -15699 -5457 -321 49472 3829 -44916 -5462 22424
21761 22424 -18894 -44458 -43508 -21314 6370 3183 7891 -26128 697 20518 -54116 -54169 -37734
21748 -37734 -1432 -54405 -83788 -39833 -16744 12038 3227 23265 -12069 -79798 -101033 -79415
21736 -79415 -41871 -64428 -88867 -138696 -172602 -174174 -139385 -99676 -35836 -33693 49417 40442
21724 40442 -6564 -6473 59773 54092 38315 42679 54002 -32382 -75061 -59125 -17712 -63214 -46432
21711 -46432 -57466 -34731 13661 18208 -35326 -24575 39050 24007 -18494 -56492 -28163 38480
21699 38480 64602 52050 59184 121090 109512 76127 70629 93155 88847 52452 68622 82315
21687 82315 20093 -34012 -70913 -84603 -68232 -45870 -13590 22679 57371 19138 -48332 -65590
21675 -65590 -86949 -69008 -62903 -1175 43476 48071 37674 -10053 -94163 -116550 -49457 -77660
21663 -77660 -102936 -50284 -27821 6764 -42675 -27908 -50465 -16396 -49208 -115496 -135785 -110395
21651 -110395 -42680 -6274 14582 79881 57384 -7583 -59636 -35640 -25917 37666 64854 44183
21639 44183 -9409 -41401 -39536 -27806 -45820 -81584 -60302 -50180 -45090 -73591 -116981 -126459
21627 -126459 -75535 -26253 -19812 -13840 -48170 -98102 -104915 -94934 -86919 -3261 745 -71427 -122645
21614 -122645 -166051 -122552 -108699 -107339 -84780 -49353 -15423 56186 45186 32009 -5720 -5565
21602 -5565 -33550 -23638 2945 49170 25798 -22213 -8826 33437 78768 73480 71912 18061
21590 18061 -26887 -10556 47108 62564 25719 9609 8516 57206 60211 57755 65586 13168
21578 13168 -12654 16957 -8408 -69392 -25552 21868 21765 14822 -16969 -24209 -17456 -31438 -38919
21565 -38919 -34001 -12931 -1324 -16134 -38752 6912 49582 97698 104993 46376 36929 47479
21553 47479 15682 5019 27368 22937 27951 62211 -5374 -93198 -101744 -80045 -84808 -62259
21541 -62259 -51681 -48535 -62060 -90226 -55649 -2614 27686 -4173 -29583 -45978 -59089 -19174
21529 -19174 -28550 -2081 -13797 -56946 -62387 -75441 -25890 23173 32933 10789 -7441 3005
21517 3005 -44632 -62129 7842 50395 18396 9204 63040 87681 60937 45635 29685 29171
21505 29171 33424 22873 1643 -67427 -47470 1705 50028 51768 48987 50138 40523 -25564 15358
21492 15358 52129 37884 474 -34862 -37433 -24606 -28374 23221 51726 40428 18412 21664
21480 21664 21813 16123 21922 19911 -64852 -48929 -29168 -42265 -29995 -40004 -21767 -63788 -103725
21467 -103725 -56381 -36291 -78147 -79729 -64798 -57443 -52989 -48768 2976 23901 23980 11403 54823
21454 54823 79231 -34558 -49018 35621 74736 43865 18622 -1329 17438 27138 40825 15137
21442 15137 -39855 -33758 -36927 -12029 -9369 1136 39816 23442 -9815 42029 39779 31427 -30897
21429 -30897 -15129 -4085 -41206 -45634 8797 23139 -22671 -92995 -87703 -46759 -14823 -5402
21417 -5402 -151884 -194669 -118299 -64055 -122126 -121675 -74434 -49337 -57137 -37384 -19819 -45572
21405 -45572 -97555 -47032 17581 11803 1856 -34110 -29677 -37739 -46513 -94252 -88785 -145216 -149923
21392 -149923 -84964 -12849 37631 -12089 -67707 -62833 -39915 -92178 -111274 -70987 -70936 -21220
21380 -21220 26292 -21521 -46414 -102691 -52720 -11377 -25590 -10305 9469 -29101 -58470 -46220
21368 -46220 -15483 -30415 -160639 -160592 -92387 -80026 -22045 16249 -21582 -19996 -10333 974
21356 974 9977 36349 -8521 -4619 24665 44540 55073 91362 43739 -1211 -41961 -92325
21344 -92325 -81195 -90358 -143461 -127816 -77572 -83979 -74686 -22744 39877 40588 10621 23397 6834
21331 6834 4852 8045 8896 -15437 -51269 -97401 -47817 -1513 45487 63281 40630 -9590 -1777
21318 -1777 14447 -19132 -38822 -32314 -66584 -110079 -133869 -122889 -92160 -45829 -48528 -46136
21306 -46136 -20311 -19498 29176 36468 5506 -9979 18933 66441 56200 15479 84544 153220
21294 153220 228447 239463 177205 96284 56461 28930 -30205 -47948 -11928 -283 -22698
21283 -22698 25022 54482 63229 46720 -19860 -48443 -45088 -85477 -110811 -44780 -34335 -53822
21271 -53822 -48740 23645 29447 -18224 -30800 -28526 -47314 -75029 -34888 -15976 -22093 -31890 -88362
21258 -88362 -86418 -60008 -44709 -805 -42218 -33077 -25741 -62988 -47388 -2226 1307 -1404 579
21245 579 33522 59650 38079 -51864 -58403 -66617 -122591 -155235 -100932 -68052 -26031 -39922
21233 -39922 -3118 45132 73016 45534 20933 -59631 -86716 -35623 -13184 -29731 -55442 -20384
21221 -20384 47698 14251 -10615 -1769 -28601 -117489 -108786 -35970 127 31410 -5639 -42682
21209 -42682 -8716 14974 2042 3425 29795 50698 -29650 -71120 -68491 -65340 -66961 -70485 -65643
21196 -65643 -30201 -56602 -39641 -37689 -102537 -38204 -76128 -49672 -31391 -79338 -102005 -139055
21184 -139055 -100744 -70345 -13912 12495 59407 64884 41871 -19138 -37261 -24542 44779 64752
21172 64752 -4042 -19021 -49258 -46438 23425 48740 23784 -44685 -52195 -54464 -65907 -46938
21160 -46938 -10269 -74352 -106772 -74909 -122103 -98043 -43667 -51841 -32859 27379 33745 4688
21148 4688 45438 24363 -40642 -62587 8727 54006 797 -52437 -127977 -104900 -87992 -143279
21136 -143279 -136570 -106739 -62734 -38813 -89847 -97483 -23215 33127 69875 65701 33904 -47337
21124 -47337 -35789 13594 42339 55359 4714 32178 58703 34987 55729 -7113 -58862 -96319
21112 -96319 -91635 -96730 -106482 -23847 36937 92284 52864 22447 39095 42204 51594 108791 83230
21099 83230 67638 67050 108131 113399 114274 70632 -26656 -32917 4677 24481 68364 77799 53083
21086 53083 7570 32496 70984 71513 9372 -116293 -121489 -85939 -108691 -132602 -69120 19812
21074 19812 13426 -19390 -69352 -80976 -91146 -119976 -76247 -16725 29958 38924 36496 -55439
21062 -55439 -111775 -113107 -71409 -35107 -50694 -70576 -69852 -113918 -145511 -71477 -15544 53661
21050 53661 48464 25505 -15111 -6809 -86683 -85517 -20160 -8753 -40186 -24825 24680 14621
21038 14621 -6235 -28151 -33108 -60593 -106369 -140945 -135638 -90174 -63648 -27921 -9383 -7759
21026 -7759 1229 12849 15860 -3463 -2042 13740 19859 -27607 -66889 -21029 -3190 -73867 -109241
21013 -109241 -130712 -143428 -98235 -23814 -7500 -35019 -90756 -92064 -225 13619 -17694 -54036
21001 -54036 -101863 -111257 -101540 -71463 -63813 -66459 -52863 -101743 -112213 -48364 -305 35087
20989 35087 12478 -4838 -27496 -43182 -30620 -27165 6571 13507 28691 44611 29628 -34683
20977 -34683 -65396 -99220 -51439 847 15092 76593 71791 18496 43383 77592 40068 36045
20965 36045 3103 70067 95195 32708 -47837 -77930 -43710 53458 55852 41135 24351 -20814
20953 -20814 -27294 29909 61997 43798 4389 -12279 -17896 39205 45368 75566 112722 67563
20941 67563 4142 38293 6104 -3088 9815 41316 66654 49444 48716 49279 81255 108518 69818
20928 69818 27631 -1514 -42047 -99776 -74995 -9326 63322 58645 94573 63991 18997 19419
20916 19419 -23085 -61050 -66256 -31117 14852 45374 74624 91523 33161 -6902 30006 42836
20904 42836 31697 35831 30615 86612 82630 -31989 -94310 -138453 -123694 -84542 6338 36849
20892 36849 281 -17023 -23772 18304 22483 8807 11704 -17574 -56774 -64666 -11718 40963
20880 40963 45307 34708 43892 62331 38949 57799 51939 3955 15090 12502 -56902 -79288
20868 -79288 -103296 -109425 -34797 11173 23859 64969 65439 40647 7031 233 -19256 -58300
20856 -58300 -71067 -31801 11499 57686 64081 32129 37923 62741 19122 -15386 22054 -28818
20844 -28818 -44169 18854 7574 -10833 -8548 -9161 -2618 23703 18753 56765 15055 -14831 -25363
20831 -25363 -38872 -82087 -61538 -82084 -59554 -64838 -51597 -77823 -82290 -45696 -60785 -69489
20819 -69489 -20267 -30433 -16064 22171 25561 -28989 -112338 -130767 -79117 -120722 -105490 -46947
20807 -46947 -31370 19208 -5149 -55441 11626 -12451 -74624 -50509 -42876 -22227 30996 91455
20795 91455 101580 110857 43380 -60923 -91259 -74258 -129553 -152920 -133309 -52107 -14734 -2148
20783 -2148 23626 18652 8535 -20673 -49400 4666 -28225 -878 -4290 -20590 -43828 318
20771 318 25574 7318 33635 69809 46599 -41746 -65909 -44754 20117 39299 41329 47564
20759 47564 -22671 -36726 -20410 -17525 -54426 -46186 -29140 -7070 -53642 -96255 -79174 -39302
20747 -39302 20126 33138 13093 -6152 -58631 -75762 -42168 -10859 -3410 -24773 17710 -12156
20735 -12156 -14599 31296 33438 20046 -1453 -14658 7013 52045 73204 46864 27797 16949
20723 16949 -37277 -25673 43063 26266 -9476 -26634 -77 31922 22589 15349 45118 71447
20711 71447 58447 30739 62111 70416 42618 63841 40549 -25954 -51726 -51449 -43909 -72326
20699 -72326 -31984 11116 -25221 -14486 10453 33292 59791 38299 -363 -6662 8766 22896
20687 22896 27055 -2770 -72830 -51372 23305 45446 10482 -52978 -95629 -99783 -37208 28056
20675 28056 56222 50081 21804 -21456 -71102 -81951 -63604 -103779 -153280 -95186 -36439 -6011
20663 -6011 36925 28954 -13224 -74403 -41791 23442 1645 -2041 -23803 -21228 2640 12506 -17599
20650 -17599 -86229 -43241 -22236 -59864 -55199 -17953 18241 -4627 -1949 44280 64836 53129
20638 53129 77590 2485 -35496 -35604 -6581 -24106 -47186 -22006 -13652 -30718 -58825 -17761
20626 -17761 -15576 14512 61762 48242 1230 -63577 -64255 -57446 -65313 -97871 -46145 -3270 30252
20613 30252 81975 101313 81763 -1261 -33800 -35137 -47061 -9018 -16007 -33132 -86008 -68964
20601 -68964 -79689 -83264 -92535 -81247 -74536 -11163 91181 71012 73128 104303 93176 53387
20589 53387 25425 51497 99407 105877 88379 79334 -15019 -91651 -58683 -59245 -23363 19661
20577 19661 15725 22065 8527 -64249 -84187 -21597 -21401 -39021 -62815 -67895 -82440 -64882 8080
20564 8080 51933 96283 74266 22729 -30040 -27128 -9316 -24617 -28924 -5142 21763 79883
20552 79883 61209 21320 14898 27662 -23252 -53824 -8586 11080 -37860 -22308 14656 1481
20540 1481 -19606 27779 34220 45129 93821 20544 -40874 -3240 23154 64154 14859 14724
20528 14724 22150 19558 -4085 -6263 -10463 4383 -4903 56987 57441 81506 75646 49980 57006
20515 57006 24761 -38602 -51267 -43111 -36364 -11196 -32614 -47351 -70321 -26790 -4210 3394
20503 3394 19635 21344 -2976 26732 -15114 -24649 19562 62755 124727 105346 52971 -3814
20491 -3814 -20773 23908 50308 -4573 -67699 -79872 -19829 27916 21444 14371 -8130 -48801
20479 -48801 -41788 -65965 -56338 6983 46901 24686 41783 3570 -24993 -57515 -52355 -26404
20467 -26404 -43603 -75041 -108829 -81220 -51680 -14471 25058 4027 50902 105137 72794 22523
20455 22523 20571 52688 46616 31319 2692 51608 56810 64509 67402 42944 54651 39544 -30696
20442 -30696 -3955 29851 27754 47661 81454 54875 58797 46796 -9927 -61871 -50369 -14298
20430 -14298 -9628 -3876 -93 -17674 -9583 -7527 16107 -13362 26021 28541 9402 33637 83771
20417 83771 67613 27971 26904 26044 23114 55738 70614 58337 29856 36107 34045 19780 -8751
20404 -8751 25587 31431 -45938 -13141 44694 27440 66922 72807 63296 55717 64026 35602 3245
20391 3245 17487 2510 11612 -17246 32470 86683 126323 146860 58251 5782 -12268 10875
20379 10875 49478 13190 35487 72690 50969 9803 -23624 49390 106073 11564 -17003 17705
20367 17705 5973 -15176 -72785 -70285 -14955 5949 12390 -37060 -126306 -43523 -20840 -13580
20355 -13580 51356 89657 40440 -16856 -34955 35525 17014 18782 73050 42482 29069 52169
20343 52169 91051 80221 22356 34577 44666 -31647 -60623 -87701 -53732 -18274 -13365 -55537
20331 -55537 -67818 4117 56943 123054 115853 57694 26696 2476 -6027 -17855 -90423 -53176
20319 -53176 8821 50830 66588 64163 26339 18028 35653 -31542 -87213 -51321 -14985 -22616
20307 -22616 -22601 -24642 16682 69613 31457 16507 -4957 -4346 40294 97585 -12960 -106417 -66414
20294 -66414 -17905 51499 70948 56460 30497 -9815 -15343 14528 7274 -29191 -31624 -10275
20282 -10275 26268 -6238 -17862 8035 49860 38215 80639 64977 60118 52166 69240 48307
20270 48307 -3968 53729 49327 2454 -19337 -40545 -40731 39130 69073 -14298 -80044 -83449
20258 -83449 -89782 -126088 -94582 -29037 -23706 -33545 -65158 -34821 -18950 -4409 57785 4985
20246 4985 -84450 -61758 -7747 41938 16941 -9204 -42089 -52829 -15239 -1773 -19202 -43362
20234 -43362 -65462 -65860 -104214 -115014 -25840 30547 49966 19004 -21798 -107436 -149729 -164804
20222 -164804 -119912 -29485 -7181 2289 37194 31184 30995 6317 -14022 -61602 -57855 -33162
20210 -33162 -36620 7777 1012 -9406 59433 15442 -35377 -3657 -9845 7812 -16208 -18871
20198 -18871 73 -20367 7312 32022 60532 38444 23051 12167 99224 90542 75124 93572
20186 93572 62863 -44495 -62563 -28262 11351 -13736 -76093 -59492 -39271 -37761 -47891 -19579
20174 -19579 -7218 -18271 -34681 -4543 -3255 -67786 -49695 -27292 -15471 -13957 -73151 -90564
20162 -90564 -146402 -166521 -185788 -154266 -92053 -40837 -67924 -42887 -43264 -33201 -81091 -82147
20150 -82147 -7908 94174 78449 44966 -13008 -32199 -29669 35642 46710 -35307 -59584 -50598
20138 -50598 -66268 -57927 29367 66519 -11888 -32280 18202 54110 20931 -14296 -64879 -59406
20126 -59406 -38319 -39761 -50523 8596 86851 43547 -17007 -44559 -17060 -15014 -47710 -50214
20114 -50214 -40688 -74014 -86250 -88012 -63069 -78004 -36718 -2561 -93116 -126181 -129062 -71714
20102 -71714 7004 1479 -35092 10436 50273 35488 86599 61285 4658 -4558 49554 -5747
20090 -5747 -61756 -19347 35945 30762 -22767 -20252 8251 55246 95158 62807 -7507 -26262
20078 -26262 -40804 -61620 -49520 -43229 -22826 -19989 4663 -43735 -19650 -53053 -133870 -141751
20066 -141751 -95006 -96 31344 32239 5987 -2627 -1214 -11390 -33066 -15047 -37573 -25713
20054 -25713 -23117 37425 93095 73774 83650 80805 148299 177529 199981 149712 73102 79536
20042 79536 156969 163885 71749 19422 4501 -32623 6380 39561 40286 60431 63815 99833
20030 99833 106331 57271 27238 63000 -13676 -70144 -79828 -90503 -35649 -10547 4550 11363
20018 11363 8771 54779 61507 60168 5369 -35719 -58954 -77850 -45673 -7341 -1812 12980
20006 12980 -8847 -44006 -10160 -26933 -91712 -78297 -48351 -42428 -41467 -19485 943 56361
19994 56361 24206 -60588 -95191 -100871 -56682 -41386 -37775 -66091 -26415 18023 52719 50938
19982 50938 37734 2874 -17333 36834 84828 118354 52788 24059 56796 59988 22594 44435
19970 44435 86824 125110 100112 74834 59587 -13926 -11100 -7656 6865 -12258 -28238 9886
19958 9886 68452 128221 84059 79387 80066 17621 18882 -5863 -36921 -12984 4216 34332 15628
19945 15628 -9575 -36076 -13705 2832 49425 19514 9831 -27738 -15994 -5892 31267 37646
19933 37646 4290 -7113 22317 4865 30026 30896 16891 -33481 -24149 -31795 -23772 -27184 -1010
19920 -1010 23128 54386 33172 53950 67969 101085 96946 81875 62431 -6635 -39093 27615
19908 27615 91939 109477 81706 16113 5672 -4399 23189 80520 94689 68088 -17064 -65977
19896 -65977 -39079 10137 1980 -11971 20391 10931 87549 109387 50956 20808 -18706 -41334
19884 -41334 31598 65037 101940 129228 80845 64844 88625 58764 8356 5279 16369 32787
19872 32787 38908 31546 4055 39844 21095 -22940 -70380 -50177 17140 97014 128128 74386
19860 74386 2904 -22253 24870 82940 87774 64324 66698 107192 33757 -34650 -41124 -12210
19848 -12210 -63104 -68558 -63387 -15763 -6121 -59836 -73866 -88687 -85818 -83573 -60438 4626 12945
19835 12945 -9260 5411 78558 24180 51957 12063 -13240 10054 32499 27846 37073 33961
19823 33961 -31199 15043 40636 23719 -12051 -15593 39860 64019 10410 11029 83483 141363
19811 141363 104026 80843 64437 59588 31728 9048 26469 43223 27015 18259 16194 68520
19799 68520 48663 6278 -22182 -24809 1488 2748 8355 46184 74768 122231 113735 55012
19787 55012 20270 10937 27523 98918 89889 39365 59058 108638 108053 103231 59223 38436 8775
19774 8775 -38046 16644 49075 6890 -12646 33271 52508 62260 106220 118684 157623 158538
19762 158538 129459 114091 123827 110211 83844 64353 11044 9263 46361 32305 -22125 -15968
19750 -15968 6283 10063 37547 54697 66420 98237 97666 90397 -23414 -126096 -88786 -34340
19738 -34340 -28428 6224 37216 71554 92420 67292 -2098 18808 8020 10363 32565 59195
19726 59195 126554 184070 151032 117742 60377 69886 151633 123864 24308 197 11755 21617
19714 21617 23472 15945 -21707 -17943 51829 81238 87719 98376 13568 -45943 -25902 18247
19702 18247 90677 100260 69847 53155 62170 72536 54433 17757 -9162 24577 42543 73306
19690 73306 86760 93917 100180 127184 160580 164520 199155 178053 157903 130709 84949 50353
19678 50353 70257 86371 77808 115063 143158 150271 167188 156641 152692 141361 135319 122848
19666 122848 117524 150159 123130 133935 158636 163085 142685 170334 170434 135484 121596 242845
19654 242845 370041 472311 589038 711313 801735 902484 947304 890358 772179 663536
19644 663536 614298 546536 529896 575694 688250 727138 730114 833033 915266 960949 938902
19633 938902 868224 808535 704678 580791 414802 321384 273871 238438 223769 218110 176761
19622 176761 158650 196269 163915 88572 77464 129738 167150 219887 248152 235749 275216
19611 275216 340385 360462 310351 301211 313034 337388 304462 266712 254479 254407 273673 279577
19599 279577 363576 488662 633891 832248 1013695 1142583 1277020 1290514 1185374 1108796
19589 1108796 1021012 1000221 957820 955757 971962 1005413 980842 956760 856367 744105 581758
19578 581758 451893 345976 282596 225062 198530 170855 206404 219559 184270 206979 208913
19567 208913 199832 142134 125776 167071 184228 175936 130066 153585 167104 152759 130721 144016
19555 144016 108119 33455 33026 71902 105555 87220 101769 158591 107327 122144 168224 177116
19543 177116 197434 168336 150030 172225 215883 247064 249067 245154 265304 359270 399067 491689
19531 491689 633389 693570 759984 766190 710039 629841 600215 658582 703922 755149 826826
19520 826826 904996 984910 1014920 953241 889534 824066 735555 601465 562451 532766 530333
19509 530333 502125 499805 509619 525952 481483 368282 289836 269271 303634 309036 273726 234579
19497 234579 197920 194794 213470 200075 200474 195546 192364 146428 130398 194005 295472 353076
19485 353076 378369 436569 502154 556656 588729 673555 697912 740927 800062 865182 980245
19474 980245 1048809 1116894 1224967 1233851 1134787 1019752 886330 799423 726434 739135 817997
19463 817997 949480 1013345 1043047 989073 857836 690700 526015 383582 300935 199207
19453 199207 139064 212492 215959 228467 186915 197856 180309 211683 192165 128655 144958 131398
19441 131398 86626 61516 74405 92993 100192 67289 44586 42663 43552 81282 133823 191084
19429 191084 213419 211279 185949 183454 148866 161496 163384 156816 179582 114488 41037 32761
19417 32761 108960 161858 152991 181107 156119 100629 72977 82305 58190 95035 138696 142009
19405 142009 128507 95698 141738 203355 192603 96855 75022 141333 207394 240937 247742 236984
19393 236984 265173 281324 269110 183772 168412 223260 258483 236351 222208 192929 157706
19382 157706 134083 154287 126718 105868 202270 219861 229226 170260 172666 207881 226894 185931
19370 185931 151780 179917 140214 141773 199016 334774 344150 336439 393120 400967 319408 238987
19358 238987 220771 213597 187959 221677 180543 206738 280444 305989 331239 334972 325415 302749
19346 302749 310929 342007 380225 330193 309460 396230 418065 412411 372388 407519 427270 390031
19334 390031 342984 341791 453022 532533 494944 515505 489538 497574 470130 497874 424987 369204
19322 369204 404644 396051 341742 337298 380081 405992 370877 374035 302486 304747 408335 397255
19310 397255 371332 372717 387360 388854 402465 366347 352973 309220 295743 317473 293606 269081
19298 269081 259060 224329 189442 266608 366424 356977 331412 313448 374622 356346 345471 344558
19286 344558 314063 287651 262310 273546 255934 274398 383312 533409 685819 785672 897964
19275 897964 932485 932306 930092 820987 678790 628570 638008 671808 661793 672696 726094 798999
19263 798999 736897 674661 661812 699563 781682 837772 815649 850368 912893 870673 815685
19252 815685 778512 754899 754279 733150 695624 680173 681538 677950 630214 591746 552166 452889
19240 452889 373729 361754 354589 319893 319334 345762 424024 462695 489995 560306 592062 579438
19228 579438 527064 533949 544967 635092 686595 727243 799912 809444 734195 796145 843937 848977
19216 848977 911530 1036509 1204463 1365351 1509177 1700527 1863329 1916587 1914002 1927504
19206 1927504 1992076 2001855 1895175 1878015 1919429 1987835 2069674 2232687 2355231 2412639 2472361
19195 2472361 2475211 2428544 2370743 2233042 2081465 1938449 1840010 1803760 1823523 1836390 1813936
19184 1813936 1835689 1833459 1919105 1997607 2086005 2204649 2336056 2441197 2403001 2478339 2645514
19173 2645514 2830025 3029430 3242281 3485430 3772377 4088595 4484598 4979707 5504338
19164 5504338 6014675 6469066 6828698 7151540 7640755 8271384 9096713 10101404 11410766
19155 11410766 13052454 15210553 17996767 21657647 26005326 30441157 34459543 37739635
19147 37739635 40201104 42831840 48145542 58898294 77362164 102798281 128699435
19140 128699435 149433443 162514921 163889767 152613013 136595756 123340364 111175500
19133 111175500 95554368 78627368 67346663 63933267 65467782 67693250 67931966 64188979
19125 64188979 55278587 43645122 33607111 26676178 22112192 19203878 17345371 16266163
19117 16266163 15778045 15697650 15976728 16450183 17057322 17833679 18753817 19802095 20951790
19108 20951790 22231371 23876334 26073011 29223680 33887985 40840447 50951037 64805150
19100 64805150 80939299 95671317 106256094 110740539 107458011 99423845 93970168 95919144
19092 95919144 107258950 130511511 168040642 217526521 274200931 333177017 380520883
19085 380520883 399841201 388814968 352606938 294558112 228277796 172696492 137270675
19078 137270675 117531306 105226900 95298393 84052018 69152927 53417313 41149560
19071 41149560 32872198 27204070 23119219 20013317 17465993 15456624 13982515 13022140
19063 13022140 12377457 11883353 11435018 10907076 10195357 9424881 8587039 7816751 7227769
19054 7227769 6738931 6444468 6226353 6015618 5846120 5691585 5562262 5504624 5550738 5539585
19044 5539585 5509133 5546346 5667237 5764989 5990031 6235834 6503249 6842758 7285343 7836611
19034 7836611 8421389 9159917 10037910 10955398 11961214 13074840 14278704 15493637 16731195
19025 16731195 18115562 19667784 21530190 23834240 26768841 30419687 35043816 41160303
19017 41160303 49271298 59537766 71578579 84842908 98560663 111956051 126560340
19010 126560340 146302272 174573175 212562653 258887256 307782891 348800505 371264089
19003 371264089 370683721 347712676 305491864 252951518 201435846 157169613 123217610
18996 123217610 101687996 91450845 89031503 90787904 93455402 93551411 88708994 79226744
18988 79226744 66846887 53683842 41994786 33273067 27427877 23549974 20925962 19071801
18980 19071801 17677326 16649760 15874496 15422555 15216739 15235708 15407873 15878891 16563958
18971 16563958 17506325 18806079 20705083 23553735 27823706 33902268 41655966 50240667
18963 50240667 58765609 65701807 69708320 71085977 71769766 73907095 79179724 88330675
18955 88330675 101065705 115663490 129622571 141302958 149683069 152796694 147790868
18948 147790868 134409264 115270028 93254662 71795675 54923514 44055682 37765449
18941 37765449 33990708 30994367 27732276 24073880 20321625 16677240 13595002 11243881
18933 11243881 9573743 8352158 7475266 6701596 6074997 5623447 5143563 4693975 4286957
18924 4286957 3880227 3537233 3259376 2977347 2744235 2593702 2470199 2298187 2188513
18915 2188513 2093325 1967058 1831645 1676714 1539838 1424158 1305124 1216141 1191680 1170015
18905 1170015 1165275 1146127 1040272 983911 1003429 936611 857736 710143 547790 397741 299071
18894 299071 277754 341214 419798 456808 536155 661526 723495 751100 720375 694748 689983
18883 689983 729139 750020 710307 725303 778926 857467 881020 869517 788377 711760 710453 718656
18871 718656 751867 692833 623837 614966 610757 573251 596670 628998 666338 667777 628971 647981
18859 647981 617763 648147 675045 646341 573440 572460 601117 596704 594917 630579 664427 621314
18847 621314 492525 443019 450423 451803 479877 486820 467584 380942 378775 389022 422435 421328
18835 421328 419543 406099 393935 413554 454776 474089 531446 540196 529352 547128 526626 554470
18823 554470 507562 443826 412291 360488 220570 100646 75089 36386 79825 110923 76468
18812 76468 122355 178999 234431 286025 422835 489119 449072 414909 347966 397744 451021
18801 451021 361019 311324 312003 323870 348898 330709 367109 357606 371762 386879 379872 326416
18789 326416 297948 319300 347733 392873 426332 413854 384551 435689 492162 566798 578666
18778 578666 562940 607672 609069 606600 585814 522024 506502 488212 502496 511713 575539 704091
18766 704091 730179 826914 882650 820472 714022 618935 485140 377263 338925 382679 376522
18755 376522 396136 455319 514737 581472 627114 677419 705749 657392 610648 546212 499145
18744 499145 494104 527930 524397 533830 504034 537033 592177 570753 517218 498995 529981 517105
18732 517105 517996 562035 585863 611267 636385 613933 625202 704680 778679 775154 701990 643423
18720 643423 581793 509852 484836 430353 352868 347749 332811 318040 292162 273451 248750 273164
18708 273164 350426 365564 346904 321227 302170 312961 377761 401250 375117 335068 276451
18697 276451 301175 343058 391096 441147 494882 485354 422977 425325 424224 477328 467726 459445
18685 459445 458293 497296 463976 383730 368487 435870 345470 351191 420536 438312 443500 399256
18673 399256 356117 407302 434670 357889 354773 414130 440559 415591 349004 343286 313020 331366
18661 331366 372609 368069 458779 511274 542825 577906 603984 552429 521775 519318 541629 618986
18649 618986 663633 653686 612479 603804 639804 602523 595887 672694 673191 676128 770359 861528 892145
18636 892145 888036 918012 964138 971730 916271 956914 1061462 1253787 1438826 1564679 1778588
18625 1778588 1932012 1989034 1965565 1897924 1835250 1794500 1842934 2059609 2401136 2748538
18615 2748538 3065644 3289608 3384422 3292860 3159097 3051526 2949851 2904197 2999668 3120415
18605 3120415 3236505 3345681 3500725 3612123 3760615 3978885 4219912 4498200 4803132
18596 4803132 5176444 5572277 5968660 6397586 6956232 7593411 8272560 9060887 9909330
18587 9909330 10767040 11809008 13000566 14406084 16147076 18449469 21274515 24884780
18579 24884780 29789046 36821383 47416676 63579327 85933767 111000537 134080229
18572 134080229 153019484 165854201 170515193 169165351 166515452 162508132 152873082 139232471
18564 139232471 131803211 136144580 147183312 158990756 167924938 170118210 164898653 156337000
18556 156337000 146479345 131050902 106217227 77394153 53707013 38033268 28202753
18549 28202753 21959822 17636026 14461610 12114379 10468539 9260380 8289787 7491658
18541 7491658 6860704 6423376 6057798 5682919 5278677 4843047 4438907 4132050 3818090
18532 3818090 3596449 3417309 3275450 3138202 3082266 2981361 2831273 2740996 2669887 2536721
18522 2536721 2345799 2224034 2120492 2077673 2145368 2079962 2053091 2079186 2041029 2017280 1930663
18511 1930663 1727747 1546905 1435040 1313699 1192629 1210699 1225093 1170874 1210814 1326065
18501 1326065 1316403 1321793 1363823 1429781 1479053 1539522 1595771 1552490 1499008 1531869 1570291 1555214
18489 1555214 1608083 1585291 1636137 1663308 1550508 1443612 1310447 1146857 934432 725979
18479 725979 628367 614174 626666 626844 658244 636802 563512 561348 498397 521656 568241 561916
18467 561916 520046 472009 473784 467076 403562 335559 326114 379562 448941 492517 453347 379750
18455 379750 416391 482507 504365 585953 697494 748965 869632 934895 1035886 1145723 1211260
18444 1211260 1313595 1358800 1291157 1255221 1244976 1223355 1126771 1170820 1206056 1207022 1273648
18433 1273648 1411303 1505071 1538552 1522254 1385213 1229058 1060127 926778 900739 832484
18423 832484 698858 623968 543778 509699 472375 460793 475648 418063 373304 391058 374962
18412 374962 327024 308025 248004 252478 271353 266086 244253 223409 298387 305756 238484 234309
18400 234309 224687 236100 236890 236274 243627 260379 254617 216421 164421 160271 147126 144554 112068
18387 112068 113071 44318 10692 15447 -10404 -65663 -105551 -130203 -123772 -73666 -69645 -47939
18375 -47939 -18132 12409 -3372 -37462 -91490 -91889 -78812 21825 13162 6721 23289 74214
18363 74214 186669 273421 363227 365899 284406 246387 245177 219216 217105 232922 199651 175454
18351 175454 181274 200713 272041 345657 393372 418788 391543 385024 406405 434420 426476 398721
18339 398721 419920 465668 505824 526898 593589 660611 670156 657283 716069 701705 732334 697918
18327 697918 583295 490902 496261 458985 387338 352874 303339 297013 272046 260400 346024 340879
18315 340879 324583 296071 258722 253251 284829 294369 269641 268158 188505 129806 145568 166480
18303 166480 187610 226537 265703 284814 272995 345948 423628 465571 386508 267125 287909
18292 287909 356283 377837 394246 368901 371064 367567 340848 370702 442046 447547 447880 481062
18280 481062 523853 534294 530691 519706 522651 500025 523640 568633 505196 434393 369723 327704
18268 327704 304725 350533 335241 293821 339963 311178 251028 209551 226769 271136 294517
18257 294517 355369 388299 422172 397077 371174 381920 317568 313002 342806 382563 398458 370152
18245 370152 394395 420410 378678 318464 290162 311514 255719 250076 331808 357342 305198 257690
18233 257690 256049 284644 315181 316248 302634 313039 360773 402173 427584 416672 323559 330331
18221 330331 393135 437618 437303 384557 317203 284418 264895 280748 323127 369745 365445 328779
18209 328779 353558 360040 331586 333346 316415 351311 333684 256707 260611 296281 243948 229431
18197 229431 229425 227368 248898 188937 231676 301685 389041 410606 371093 364463 362474 339477 261989
18184 261989 303411 338177 340104 275566 276802 280911 318470 345083 333497 295517 357710 374822
18172 374822 310967 207832 219598 221055 266139 343704 351033 290778 295775 303852 294344 289036
18160 289036 300180 346597 401463 422145 446567 454315 442399 497053 521933 480568 522847 624476
18148 624476 562611 545179 599441 625681 590278 578970 583346 629051 746590 855535 964834
18137 964834 988953 935552 965569 1030527 1147798 1299083 1396817 1509994 1674489 1860384
18127 1860384 2049876 2291535 2489762 2693225 3024913 3499088 4006730 4544549 5128585
18118 5128585 5762772 6561985 7685415 9173095 11283688 14450898 19397888 27488946
18110 27488946 41311056 61407591 78586518 89449075 93080005 83176796 58655653
18103 58655653 36828812 23774032 16300954 11754893 8832055 6775735 5330529 4266157
18095 4266157 3543458 3023201 2584070 2199517 1941067 1753150 1650264 1482824 1292699
18086 1292699 1172185 1031321 936803 893706 830366 742319 687371 664749 719911 723452 731852
18075 731852 722228 735574 751174 739965 725872 687886 647872 595548 593389 571146 540367 565302
18063 565302 561022 590449 532930 490644 495195 477025 537900 575076 531527 468281 503696 532300
18051 532300 460631 399865 460793 470785 477656 491977 487041 447032 460031 448512 486713 419478
18039 419478 408154 365195 336544 339290 331413 330124 312075 282696 281490 333153 386020 425776
18027 425776 445887 473939 459935 418157 414542 409402 411789 406041 417222 417777 451064 557346
18015 557346 632287 703211 850614 1007620 1081317 1162245 1225485 1193719 1172331 1155945 1083198
18004 1083198 982997 933688 864203 776828 710360 647803 631799 613430 662500 705843 723828
17993 723828 775328 858242 1028175 1174717 1317355 1401070 1464878 1462999 1394530 1214126 1063588
17982 1063588 858236 786111 715055 553254 467458 510625 554862 478650 420754 452058 457062
17971 457062 465761 461662 387938 331087 291931 250093 293257 342042 364446 372768 360267 351228
17959 351228 364500 386617 386935 383513 387103 409765 430489 416280 372404 335457 377484 419102
17947 419102 424684 437406 397708 373037 330216 320158 344655 340405 395140 407533 363867 361511
17935 361511 408651 403295 426718 477560 515014 535826 540518 545892 612498 810909 991298 1034057
17923 1034057 1086538 1131905 1055126 998277 965162 919399 821155 788620 830834 898983 1022363
17912 1022363 1203276 1272037 1202216 1090813 1057397 1008554 907911 753652 612780 500717
17902 500717 457233 464364 486955 407634 326892 294354 277502 291910 282990 311174 316844 275639
17890 275639 201265 149127 83334 87188 113155 205563 170349 134612 116665 143889 202555 217528
17878 217528 157702 177522 225849 249535 274819 233574 134366 119068 168870 183144 170602
17867 170602 120327 93020 133945 185610 148403 176278 236241 189302 144521 112460 97189
17856 97189 106447 138883 114563 71722 84643 102811 71258 97049 120462 171493 218592 211532
17844 211532 182543 153628 113976 85340 71899 61672 94603 122385 91391 94506 140929 138101
17832 138101 177010 189855 122293 84977 87411 118104 126710 118659 110094 139821 185189 115728
17820 115728 127057 163593 190858 124245 85552 83532 80673 93575 145420 144159 106801 85933
17808 85933 68075 19543 1363 52424 113348 147378 58338 8320 33677 56479 91497 164343
17796 164343 161165 150983 164931 146619 109681 86150 115652 129745 91654 95070 53396 49770
17784 49770 71299 119829 172721 203249 225138 218395 205898 158990 87278 -12344 -60867 -21685
17772 -21685 49798 75768 63025 66402 95670 88353 7658 9092 26449 27278 16151 52315 32509
17759 32509 3657 49223 87270 58507 57361 28151 -15001 7945 -1032 43494 110654 159689
17747 159689 164055 180131 175971 145454 130734 118682 90318 66229 -7173 -42487 24834 76198
17735 76198 97948 83551 11861 -22911 -47260 -30945 56193 -3029 -4636 25967 36516 123787
17723 123787 146313 91328 97470 112777 148189 140141 151217 198125 161136 159377 216123 259351
17711 259351 227376 200938 127378 96109 50535 44155 98084 64875 102827 210366 215610 146526
17699 146526 107647 73549 101177 166838 173724 161193 221181 211065 132755 100623 133322 158237
17687 158237 171881 181084 208046 139161 77417 16015 -4319 -25383 44043 85171 88562 105456
17675 105456 32740 -4415 1479 -1171 8018 98263 134006 110972 94929 99994 155420 164286
17663 164286 198386 153621 68009 43880 -18598 38973 74629 82961 111721 182595 197821 173504
17651 173504 184635 182299 193355 229814 226172 217407 226809 192510 213741 235648 173662 138566
17639 138566 152576 157670 185216 265230 266063 300211 327639 310113 347390 376388 439046 451483
17627 451483 456309 424767 368116 290338 225985 202920 215947 192642 121358 138499 201620 200837
17615 200837 163657 71679 20846 55970 76423 74187 117001 162191 113223 92103 112459 154097
17603 154097 184510 182697 150172 129580 151977 151729 156464 206179 189644 116814 82940 85834
17591 85834 78447 46948 52334 74509 147886 195503 193166 241205 247587 230430 217142 186538
17579 186538 216737 228010 164217 133126 149622 166542 133576 177210 285729 349693 335006
17568 335006 283880 299892 297651 335616 314485 305779 234415 212235 264995 307826 259568 255749
17556 255749 266918 349173 363570 355838 396774 422054 395357 358966 334551 353947 342130 372415
17544 372415 349193 371103 382993 410526 422311 429530 483136 455774 430351 448822 466631 481445
17532 481445 506281 565270 671040 756541 789724 887152 917226 881906 818494 764442 731900
17521 731900 652199 720953 856258 909688 1032774 1139197 1141744 1097700 1101806 1185747 1171275
17510 1171275 1218299 1326412 1539820 1707150 1782251 1857614 1897379 1869309 1818115 1779826 1803320
17499 1803320 1904286 2104562 2333743 2636902 2977784 3250856 3487129 3670024 3826094
17490 3826094 4027941 4193851 4396555 4680039 4853515 5013592 5204720 5466449 5808524
17481 5808524 6193865 6695823 7286465 7994186 8855780 9892727 11124602 12679915 14666398
17472 14666398 17080177 20123632 24152434 29782387 37888935 50223303 68790612 92344349
17464 92344349 115575796 134922450 149095600 155458030 153518707 147804088 141024461 129371097
17456 129371097 108121459 81596779 59595583 45652815 37800475 33649738 31936512
17449 31936512 32201460 34432250 39023489 46988562 60287737 80667563 105870795 129943685
17441 129943685 149813280 163586524 167998333 163761764 156194990 147267322 131964878
17434 131964878 106291425 76592655 52831085 37344380 27663092 21400905 17155473
17427 17155473 14188446 11983083 10205334 8801130 7657133 6697666 5933871 5369277
17419 5369277 4958476 4614500 4333149 4135078 4024943 3821376 3612169 3472370 3392395 3240409
17409 3240409 3102342 2984130 2800198 2645626 2554166 2385315 2269605 2181594 1986666 1775976
17399 1775976 1630638 1537916 1416360 1299540 1273497 1211337 1156901 1154377 1099531 995428 893317
17388 893317 850477 805020 782025 758504 734558 702707 653912 639732 613750 638318 606678
17377 606678 558973 540588 537725 527051 535236 529216 467412 455019 467465 437493 380622 382801
17365 382801 402523 439452 420187 439651 427997 451313 496099 464763 427136 425794 363953 330670
17353 330670 340192 319517 227394 239466 268269 275032 271053 277244 282673 323019 352172 391419
17341 391419 341166 292185 287396 304764 306202 267649 267802 307873 281544 283944 318082 311269 324461
17328 324461 302901 296426 249669 213826 236848 220030 241209 274073 277548 236562 242912 207177
17316 207177 249197 245225 193883 222975 294400 364044 384025 384308 379345 345514 361353 307553
17304 307553 326588 348681 293754 186127 158615 136705 116039 126036 178483 206795 208235 252866
17292 252866 263510 219630 186654 207701 226446 207132 193330 172984 115044 115668 113622 91133
17280 91133 92600 -8209 -45042 -50910 -67651 -42077 -66226 -83660 -89271 -130688 -159205 -94741
17268 -94741 -25796 -61392 -47372 15828 39213 76885 116780 117264 58791 19485 28129 36952
17256 36952 58434 -6248 -65908 -109609 -126104 -124151 -113421 -78943 -59643 -37812 2812 -13791
17244 -13791 52564 129158 183490 200787 183450 180571 141936 143424 146376 94023 47469 104674
17232 104674 149852 151377 145566 125315 142083 151367 165948 210325 211062 185008 157664 161716 164985
17219 164985 177521 167601 170327 214132 216007 218558 194303 181968 178475 190916 128293 90289
17207 90289 82393 51480 80443 128849 171775 213479 150872 120368 96922 138932 155267 93643
17195 93643 47170 74964 144093 168381 140565 102688 107705 140896 139037 157226 121244 101213
17183 101213 88326 65890 81161 120990 112612 63457 104183 162540 164547 128210 101108 128366
17171 128366 146898 158248 143622 154269 119452 159416 196157 280335 310083 354548 426460
17160 426460 430822 374017 330341 341487 386113 439886 442429 455748 472853 489119 579251 643514
17148 643514 573092 434892 360357 363640 319220 293127 355688 391125 384619 389153 405221 388379
17136 388379 398236 359673 436922 503902 512572 505654 605217 683964 688218 621574 517475 374162
17124 374162 308415 246000 246502 286666 202825 205961 220877 164050 133490 148098 114469 157975
17112 157975 211853 182260 193849 229135 209419 181667 130352 97601 101429 73575 70092 39833
17100 39833 80419 163486 213391 244972 260614 264859 234617 234378 247467 227703 212869 163494
17088 163494 190964 216008 182977 166019 170208 192001 199867 168406 215319 213222 194960 175722
17076 175722 145823 166100 159947 196201 263318 289598 246726 209995 225453 207699 185661 205903
17064 205903 223570 255207 264627 289576 286709 266170 265851 346677 408994 379787 342905 333397
17052 333397 327989 369723 371538 359310 326948 396629 399142 352153 380633 401505 440684 465311
17040 465311 504054 507326 487549 432581 433707 493163 522136 547021 557553 504603 546428 564242
17028 564242 539663 581605 641094 685997 708772 681988 701766 764458 779644 783902 763052 747606
17016 747606 845499 901098 944485 976333 1080526 1078281 1135954 1262338 1323220 1407136 1539330
17005 1539330 1728834 1951856 2133308 2336018 2540517 2659806 2748136 2816546 2936239 3214647
16995 3214647 3579749 3936022 4365341 4827581 5229884 5533011 5858150 6197914 6727715
16986 6727715 7507350 8436156 9528099 10815055 12167767 13679580 15462142 17759180
16978 17759180 21030819 26013286 33852902 46602261 66759831 91930037 112340125
16971 112340125 125281422 127642917 112914447 86330412 65515576 55005425 52638463
16964 52638463 57180638 69648551 90205896 110905068 124888923 130801817 123083278
16957 123083278 99398447 75051601 61365518 57902374 63424409 78115971 97521005
16950 97521005 112498557 120984731 119265577 101866353 76267246 57691966 48550660
16943 48550660 46555472 50929517 62798664 81641789 99031418 109835818 112386003
16936 112386003 100935779 75008041 50090960 33899737 24292481 18335023 14548965
16929 14548965 12105906 10430308 9147302 8110780 7172106 6317504 5490957 4824599 4281341
16920 4281341 3920722 3702016 3526781 3488171 3482136 3449352 3326636 3078252 2828431 2622609
16910 2622609 2513551 2445470 2454306 2563007 2686590 2844179 2995031 2998314 3034250 2972900 2750388
16899 2750388 2462137 2134332 1782316 1552004 1360398 1222788 1129400 1102445 1083658 1081676
16889 1081676 1068976 1015030 966542 976369 1095193 1149393 1175180 1188300 1233997 1254911 1180766
16878 1180766 1138609 1091416 1024950 987580 952666 912129 838984 738348 675984 622044 564281
16867 564281 584979 696765 752416 774781 723633 609496 506590 465177 513226 518718 552870
16856 552870 590180 577343 549068 552193 508536 509697 499904 506010 470536 464953 441818 491466
16844 491466 537013 578693 651037 637556 616638 562190 521421 442717 371300 288538 272474
16833 272474 356061 409756 430458 462734 438026 454938 410311 391232 396002 358498 346432 394926
16821 394926 423452 447798 421088 343036 314507 305567 312179 266450 236650 230482 274633 351917
16809 351917 406801 445153 481459 453377 350475 283940 242242 206631 194216 197703 225995
16798 225995 257919 295353 267816 216786 195667 181772 187759 119739 41917 41660 74593 108450
16786 108450 41459 -5971 -39048 -40090 -53870 -103746 -149670 -192432 -163300 -103707 -83442 -76302
16774 -76302 -49014 -28583 -66059 -52997 -27495 -8745 -56374 -121638 -120107 -38738 62961 147689
16762 147689 119587 -10636 -98948 -102551 -91159 -65792 -30320 -17243 -39488 -41307 -56838 -15877
16750 -15877 25729 66143 30794 -43356 -88208 -68733 -49215 -30719 31631 89008 75676 79316
16738 79316 30683 26698 40195 11081 -14098 5871 37207 69793 141046 134204 73921 109104
16726 109104 136717 145004 144062 158511 177511 194483 163236 145622 118465 127028 116480 98167
16714 98167 126637 145004 67318 9182 27062 65490 106959 99957 98088 98444 105511 90117 75081
16701 75081 82740 93056 87259 72936 51003 81965 77725 42938 68282 24333 -55095 -22858
16689 -22858 -10899 -25464 11790 35979 44989 67318 23179 -18936 54183 88447 93111 109815
16677 109815 106483 85480 52450 48639 8101 -9814 -26535 -18754 -3805 64635 64037 -15516
16665 -15516 -31199 3203 43559 27008 44690 26217 10421 5599 30525 72091 68838 113021
16653 113021 78301 59266 26374 3428 83257 94595 63933 51410 71441 48823 -53915
16642 -53915 -115927 -95836 -56992 -24625 459 -1077 -20539 3197 39379 6505 -488 38130
16630 38130 61144 112510 139011 84834 95699 74870 91402 38008 21404 43852 101218 128236
16618 128236 79374 17918 -20670 81916 121527 122968 76505 34277 27776 30870 53271 45369
16606 45369 18388 -25763 -12815 24716 52737 44752 -11202 -16941 10330 33128 23191 -21747
16594 -21747 -26530 5535 -19062 -81173 -9771 1602 -10803 4569 7656 61392 135696 152629
16582 152629 143460 89834 54623 102119 175038 199116 193143 181036 169215 138880 85818 33010
16570 33010 -4712 14981 -5787 -3296 31336 89428 89854 148815 182069 103823 11176 -24505
16558 -24505 54667 85484 81925 33696 48172 100693 89946 33215 9016 -10272 -20858 61884
16546 61884 100785 74456 30863 9287 5898 -14850 15280 47525 44772 23886 -6768 -31160
16534 -31160 6356 25103 11596 42536 101017 83087 83252 60381 80592 69416 13578 -20461
16522 -20461 -21995 -5430 67153 113136 124434 62431 48777 31816 14428 -1942 -32426 -94281
16510 -94281 -90900 -64024 -33886 -13507 -54915 -50856 -4886 -66045 -54984 -69573 -118681 -79882
16498 -79882 2530 46700 102635 129201 152871 133538 97865 19512 -33824 -29310 31040 47452
16486 47452 19473 54840 59364 70399 49498 -4887 -104104 -71214 10617 33972 32623 -6932
16474 -6932 -69161 -100649 -27015 -17751 -55564 -17255 32683 17323 -26152 15691 29178 -14132
16462 -14132 -9611 71638 12543 4452 21258 -3360 -4586 55005 84752 90546 86124 32665 -12329
16449 -12329 -60376 -31819 -19329 -48519 -7286 52735 43000 -7939 -3291 -210 39135 68554
16437 68554 46184 -16418 -18650 -55097 -3232 106574 160302 136692 130600 127797 124267 134629
16425 134629 130981 97599 101500 101271 72455 35654 55422 131424 92884 153744 270001 383707
16413 383707 492741 594807 625319 659685 645033 515082 403221 322571 300893 353851 404167
16402 404167 540420 603963 707977 759137 691408 538477 357100 326964 348700 408650 448820
16391 448820 481080 601267 680148 705973 713018 601884 408913 333690 340157 332816 329580 374828
16379 374828 426831 522689 554937 516486 430827 324655 242716 212698 188927 182408 143525
16368 143525 59005 33383 87789 145261 197031 193507 128971 75078 78158 41526 34626 33795
16356 33795 25274 30087 1057 -43513 -74502 -31731 26774 64770 76019 30621 -118 -4269
16344 -4269 1958 -8931 31935 111866 133919 51430 20317 21429 31264 32675 68791 87379 32345
16331 32345 -12407 -23382 -6333 -70378 -94442 -7281 67407 7308 -72362 -51727 -17003 -41648
16319 -41648 20341 67141 37973 42192 22967 71232 27869 4971 29478 60033 20478 -20954
16307 -20954 6622 -20168 -14745 16031 25491 25018 13220 27520 51735 37264 43233 -11487 -49489
16294 -49489 -64799 -54302 7142 61486 69122 49532 -28744 -55205 -47016 -2936 11265 -17102
16282 -17102 35239 76909 45295 52063 64276 60302 34108 -11897 -25815 -15079 52509 138898
16270 138898 95222 27281 -6531 -85675 -85434 -35881 28665 6121 16420 -14707 -54753 -45332
16258 -45332 -51402 6034 37549 66048 17593 -10424 -16151 2451 -61923 -85041 -47721 -10105
16246 -10105 -51231 -59586 -63511 -33039 -16120 8138 -23480 -46845 -23990 -7058 -2211 -12970
16234 -12970 -64002 -74575 270 11514 -7514 9159 28188 33923 19267 30721 23774 29037
16222 29037 16371 -428 -22752 -75974 -140940 -97432 -104605 -125379 -104869 -65739 -23351 -2142
16210 -2142 7480 50140 66815 17861 -7986 27384 5347 -19174 17270 53568 79610 103304
16198 103304 116014 88289 10753 -50850 -66087 -21243 37769 5399 -38318 -30979 -4796 18601
16186 18601 11693 18319 -30894 -4873 18887 41923 23041 -16833 -51107 -52825 -29371 3267
16174 3267 24549 -35911 -34967 -6080 -17680 -50525 -85828 -44917 30863 63847 14081 -6576
16162 -6576 4548 43854 30311 24164 -19600 -426 39345 92500 66102 60090 43848 47799
16150 47799 25169 47826 69149 59639 29486 -5508 51556 106020 86874 81807 115485 133856
16138 133856 98032 105658 68682 17618 -18720 21232 14113 40403 49244 16366 -23014 -27361
16126 -27361 13352 18768 -41677 -71563 -95223 3092 74827 39897 10431 24096 54737 42930
16114 42930 62102 58168 81674 143514 139853 50820 9553 24517 34108 -12370 -18175 57352
16102 57352 41300 59467 103638 85259 58212 75223 68195 67874 49708 48024 71504 13566
16090 13566 -28156 7132 -13187 898 18889 675 -60143 -80504 -81424 -53759 -48835 -34049
16078 -34049 -35625 -26028 -20799 9981 49461 21323 -36384 -10354 11228 23269 9834 15103
16066 15103 41955 42291 -43671 -142036 -115055 -45942 -38659 -60178 -65574 -84834 -83766 -108316 -111925
16053 -111925 -41391 38219 42007 -36846 -75637 8905 64921 82909 46877 58938 112947 89363
16041 89363 92342 32992 -38349 -27310 -36736 -44836 21872 34993 -6262 -34954 -51411 24383
16029 24383 -9713 -16768 -13857 -38268 -899 -39801 -36400 -14923 52569 69589 41252 -2686
16017 -2686 -32804 -18179 -29384 -54442 -116576 -40732 -15776 -14111 23537 -31608 -80157 -34628
16005 -34628 5799 17083 19007 47527 60474 -12110 -2771 15027 35252 16227 26189 72368
15993 72368 129639 100627 12687 -83899 -60245 -21466 -46491 -91049 -13179 13285 26859 28769
15981 28769 -14362 -28907 -12869 -17082 -20222 -35119 -4100 -37774 -71796 -60064 -36802 877
15969 877 -25414 -96658 -62403 -88669 -83817 -71129 -92762 -74159 -25243 20760 -17648 -57721
15957 -57721 -32702 -971 -6229 17372 60476 34987 76124 102978 115076 106349 67169 40558
15945 40558 51608 58569 52095 28432 -15977 -62280 -69093 -40947 17389 -14029 -49084 -69845
15933 -69845 -65887 39337 81056 3364 -55121 -79132 -126780 -106930 -46815 -30083 24808 70568
15921 70568 49857 -5372 -49750 -10887 50254 68200 80911 119087 73312 88889 59910 -22686
15909 -22686 -13136 27738 27299 34065 31889 21359 34941 -23040 -53561 -13815 -36045 10504 51359
15896 51359 98540 61155 39299 80344 59090 41896 78965 81246 32190 -19725 36311 43756
15884 43756 35203 31868 61494 53531 -3301 -29252 11227 57447 74020 48481 7711 -13374
15872 -13374 -22866 -8446 -3023 -55118 -63689 -132522 -194292 -187192 -117886 -54720 11665 65030
15860 65030 61035 4729 -67048 -21501 7159 -36731 -89127 -42909 -28430 -44478 16315 -10177
15848 -10177 -33545 -57429 -42060 -5826 -717 -4925 -14882 2102 27494 19499 -16828 -22321 34457
15835 34457 53278 68997 71218 48624 46599 115405 83380 65366 109360 125974 74407 60475
15823 60475 15456 -17252 -21172 -27333 16821 16971 12906 -14332 -15279 15019 69205 130552 140580
15810 140580 92127 52804 -3565 34166 -19287 -57693 -66045 -121789 -111722 -97022 -92632 -50264
15798 -50264 5334 11834 -25041 18304 44464 80159 122800 93529 73074 100292 108529 61179
15786 61179 -19005 -9103 52725 25495 -29828 -21350 -32403 -40445 -55558 -122162 -114948 -86095
15774 -86095 -81861 -35515 -11906 -21029 -81939 -49415 -11069 -66491 -134411 -81399 35626 53458
15762 53458 58493 46045 3138 5397 -55204 -61060 -6214 -30292 -47838 -91320 -115347 -81829
15750 -81829 -13121 4535 18370 45138 128226 133691 101421 118806 118563 24395 27467 42204
15738 42204 28834 4446 13780 13218 -47764 -60404 -27490 28391 46449 42666 57761 79613
15726 79613 87276 65251 18540 -61882 -78886 -26686 -54781 -38123 -20800 -22009 -13032 -9721
15714 -9721 -46773 -42304 14610 -33079 -25351 -10671 27661 5053 24626 14010 57485 65721
15702 65721 78668 128790 96824 33989 46434 -26908 -119411 -167828 -161576 -131175 -110304 -89978
15690 -89978 -7493 37978 29529 5105 -91312 -123666 -56554 -22432 -50829 -35231 -54580 -66953
15678 -66953 -34675 68365 109799 99664 83677 90535 118182 154380 122377 59820 14150 -4767
15666 -4767 -19009 -35835 6305 10055 4663 53927 87382 123153 147794 136867 121139 125898
15654 125898 119938 116209 136527 102107 115484 98418 19562 3659 -4142 -28207 -36915 6473
15642 6473 61789 58542 -6809 -84433 -37166 -42873 9921 51162 6180 -24842 -5733 1719
15630 1719 -15888 2004 49854 76473 119517 58610 3770 -57388 -873 77078 104807 122474
15618 122474 55816 58006 37558 7511 31624 12361 -73083 -77862 22799 45807 26511 -5517
15606 -5517 -27224 -26858 3730 7383 5221 -13689 -42218 -64463 -49383 -9331 14054 2754 16668
15593 16668 15219 3033 -53321 -52103 -35698 -43637 -3113 25310 2862 -19721 -22063 -1564
15581 -1564 19207 -17676 -8020 -41373 -66377 -67061 -63984 -29327 10788 -3913 -33642 -122663 -85952
15568 -85952 41649 45760 -22453 4237 23502 1039 27705 34035 -30330 -27480 -16675 -15974
15556 -15974 -93430 -19428 -41657 -70131 -51889 -36820 -21080 31443 7131 -15349 -1083 -73696
15544 -73696 -108853 -67569 -75506 -4240 81877 62710 4722 -42259 -69948 -48541 -65899 -56220
15532 -56220 -94084 -142790 -80851 -51772 -68431 -101036 -104728 -89643 -87171 -27704 34211 7255
15520 7255 -22104 -25496 -3139 4766 59698 68741 41839 15824 -40837 -53875 -42902 -31946
15508 -31946 -29479 -20445 -37221 13530 12234 55695 51659 38601 32817 68653 53081 7822 5430
15495 5430 11722 -21256 -9045 74175 84897 63674 21858 26974 55813 14749 46670 93263
15483 93263 115135 47399 12277 -63214 -84711 -153190 -126695 -152888 -167026 -105774 -42033 -67833
15471 -67833 -56850 4518 59432 3722 -12385 24074 42195 51808 -1078 -66476 -141586 -141800
15459 -141800 -95885 -46236 -15082 9840 48155 101046 89954 65846 48443 9075 19131
15448 19131 13685 -52289 -28795 -491 14546 38262 68808 108977 89572 27928 6488 -24744
15436 -24744 -14292 26670 44240 53003 64240 59098 2547 -27063 -66216 -80351 -46080 -8855
15424 -8855 2100 62560 78823 85954 70975 8135 13653 4643 3392 -25517 -61374 -17095 -289
15411 -289 -1897 8476 -27229 -81764 -101317 -88460 -81579 -74860 -58981 -48027 -48934 -110511 -109431
15398 -109431 -116867 -99355 -94265 -99109 -141170 -122462 -42205 -51801 -38908 15917 10595 19313 22834
15385 22834 4394 13159 52974 11036 -40715 6481 -11996 -9296 -10457 -7444 -30717 -92255
15373 -92255 -87245 -62612 -7813 27767 30963 22961 19318 8767 -60959 -80852 -84225 -89847 -48638
15360 -48638 -15800 -4491 10134 43637 41810 84004 32896 35255 19116 38190 52631 -56421
15348 -56421 -48631 -58758 -43400 -15664 1526 23226 42396 23931 26506 55665 70244 39947
15336 39947 -6114 -25916 8281 41766 33699 -15542 -50652 -105870 -117890 -102347 -57641 -18232
15324 -18232 -6170 -38166 -24804 -2499 92795 107240 67634 -15680 -28341 -19400 -6859 1111
15312 1111 10132 19193 -950 5491 39422 72005 71645 -9211 2290 54652 44453 32898 72430
15299 72430 44684 62963 60754 -44703 -79630 -61210 -33928 -47438 -46025 -62016 -59973 17307
15287 17307 60374 51170 27653 -13567 -54488 -76686 -17123 -48201 -615 -33035 -137989 -173817
15275 -173817 -141704 -47133 -46637 -37414 16931 4793 -20023 -54096 -79747 -102504 -119963 -84229
15263 -84229 -41924 52498 47651 -2519 -2139 25183 54535 31830 60856 -13468 -43565 -67179
15251 -67179 -99946 -119993 -59690 -16436 -32867 -34071 -11374 -723 -16617 -12909 -38695 -54610
15239 -54610 -37261 -11737 29884 30210 34153 61280 96185 143900 110303 83117 26802 -50439
15227 -50439 -48545 -53604 7383 7077 -2191 30607 12558 -3331 16396 -16447 -34512 -17109 -806
15214 -806 -49266 -31493 27392 12717 1907 -879 -53337 -74343 -23076 -59807 -58182 -43830
15202 -43830 -37963 -36176 -34383 51209 64407 34943 18186 -33773 4551 12654 -61020 -16453
15190 -16453 -4842 -22132 -2882 6482 27425 46831 33684 -17243 19094 71021 83399 23846
15178 23846 5085 47530 28068 24123 -14367 -40379 -23337 -3520 34685 50720 12800 20742
15166 20742 65855 138500 87716 18030 -5253 8728 73756 6815 -14644 -27909 -25423 -1229
15154 -1229 -10433 -16947 -12286 -2575 9022 44713 74573 56062 24444 52330 100592 83994 17702
15141 17702 45372 5081 35999 40086 17965 -41125 5678 28224 -48861 -102707 -2295 89124
15129 89124 110869 87030 50483 30443 54412 110839 103238 67049 49835 44404 60935 114206
15117 114206 69434 41930 36765 -28009 -53871 -14169 -4839 -37929 74989 82630 18366 40429
15105 40429 86705 58104 33015 14559 -46220 -42528 -94742 -110272 -91264 -120310 -97934 12205
15093 12205 48145 -16841 -63302 -46816 -49142 -4666 19429 -26472 -55567 6437 70473 41768
15081 41768 -57168 -60991 8330 52614 37819 6730 -19237 5081 20310 5684 71698 94530
15069 94530 91007 32785 37018 27634 49377 50431 -3343 -72089 -139479 -173101 -94889 -85721 -88023
15056 -88023 -77031 -40794 -6104 -32680 -62716 -51160 -48741 -37150 -32363 -19571 -14582 7872
15044 7872 28394 -5021 -48206 -42745 2577 47335 -46291 -64135 6531 22091 3971 44757
15032 44757 58635 8386 -60121 -108909 -110872 -40376 9617 27715 -3136 32737 22928 70303
15020 70303 84673 34392 -56146 -97928 -57957 -22503 8509 -48703 -56696 -15025 -9275 57197
15008 57197 53347 60918 76150 89238 60482 8262 -39250 -34328 50640 84951 43156 11814
14996 11814 -4486 -530 11776 -8387 -2536 -10973 -35405 -32467 -39037 -23394 -35448 -57216 -71438
14983 -71438 -38616 -29184 25483 44948 25239 874 10973 10730 -17268 -58841 -63496 15429
14971 15429 54860 -44588 -82905 -18375 -141 -12102 -20812 -26372 36995 60017 5872 2486
14959 2486 27981 52376 12862 -18268 -26830 -55143 -49293 -3851 -27352 -66839 -52614 -34174
14947 -34174 -28247 31685 964 -47014 -27972 -1185 9801 -31915 -36556 23515 44177 -10955
14935 -10955 -12024 6497 18609 -11529 -37216 17794 24812 16612 44469 59551 40792 78470
14923 78470 61462 1792 -39218 -94056 -68638 -57048 -91507 -70549 -48391 -9648 -37388 -64468
14911 -64468 -17620 -8740 36126 76655 51627 61841 24515 -30360 -48489 4563 6151 -83442
14899 -83442 -124437 -63544 -9204 -51431 -52972 -67356 -54027 -22245 -21506 15818 67880 61155
14887 61155 -41902 -86183 -31291 716 4440 33544 -23174 -14865 -22226 -86988 -121845 -74780
14875 -74780 -85608 -32059 -26835 -63112 -40774 19480 2766 32910 18639 7234 24245 1939
14863 1939 -23939 -29585 -11371 -32249 -52893 -83917 -49717 -34737 -46532 -45577 -21503 -4817
14851 -4817 -9344 5887 14722 -2811 -42709 -86045 -63293 -12724 7774 -23344 -18061 1075
14839 1075 -75633 -118138 -28435 -33186 -46265 -34566 -103420 -143565 -161270 -95203 -43262 -64432
14827 -64432 -30412 3670 8165 9322 -2093 -14538 -5213 4754 25568 42106 -21781 -14885 17949
14814 17949 54717 47340 -766 -67460 -27039 6008 -14108 24381 6747 -56783 -62969 -110397
14802 -110397 -52481 -30225 -4314 260 -12534 -64797 -98191 -163230 -135012 -73584 -3418 14707
14790 14707 -16423 -67477 -82466 -47514 -18287 -8879 25764 22318 14489 7548 47310 49129 -15595
14777 -15595 43641 54847 20741 45753 58398 52513 60502 35331 42549 4912 38295 63703
14765 63703 67759 26588 -16115 -59576 -38520 -27049 -56856 -88738 -77566 -55838 -13381 -29133
14753 -29133 -32652 -53643 -50879 -67283 -36162 40083 41825 24283 2943 35494 28238 36084 -3208
14740 -3208 -54037 -70039 -65024 43413 65637 14031 8762 -14567 -16926 -945 -59998 -37005
14728 -37005 -4704 -54644 -55286 -60227 -37926 -61383 -98438 -40989 1378 38784 45868 39739 -34327
14715 -34327 -107754 -125786 -91452 -37435 -54765 -62537 -24773 -17990 17377 -30114 -5963 2872
14703 2872 4954 8181 -20004 -13884 -28610 -21978 21820 5497 -528 -17137 29110 30255 18195
14690 18195 21770 -10264 -52147 -83023 -71611 -41622 -27627 -13798 -53493 -110679 -147725 -164289
14678 -164289 -159297 -106562 -52064 -10312 -20232 -42268 -10221 -22540 4247 78340 88298 83056
14666 83056 34952 19894 7198 6854 21325 5464 527 55946 98384 152074 148549 114504
14654 114504 130603 115669 71235 70415 41847 -2667 -66114 -51262 -30852 37995 71518 30865
14642 30865 4000 -39460 -48478 -70960 -87705 -85306 -31854 15454 4407 -7178 50353 69762
14630 69762 80614 93927 60988 26082 -17718 -18048 -4363 -6042 7948 30941 72428 -6525
14618 -6525 -89664 -52490 -23019 -19546 -57840 -31211 5760 -22304 -1352 34699 45261 39972
14606 39972 47098 21893 25758 69265 62508 26131 19299 7626 -26221 -23280 -31647 -52914 -61024
14593 -61024 -27098 -35449 -26658 22313 -1716 26774 27535 8751 18954 9846 6249 -10529 51304
14580 51304 74575 34526 11211 -6454 -45164 -57474 -70859 -72135 -81033 -73938 -66538 326
14568 326 75789 131383 100735 10113 15311 36337 259 -6086 12235 28362 -50938 -77030
14556 -77030 -60879 13604 24563 53724 80126 62807 3724 -15703 -64747 -108126 -77777 -6057
14544 -6057 39201 26123 53193 25684 38110 11364 53040 -17903 -126037 -191984 -128198 -792
14532 -792 60043 54436 48037 -16300 -24070 -76248 -89107 -73477 -52373 -23765 3615 11334 -20008
14519 -20008 -5885 30690 26804 29550 30088 40184 34396 33517 36399 -51468 -82563 -61438 -43026
14506 -43026 -64929 -61246 -4225 -48751 -85540 -101362 -128232 -102304 -34685 4675 49422 36214
14494 36214 28670 -5646 -36359 -32322 -57049 -91983 -81794 -80001 -46731 -15213 7007 95213
14482 95213 48656 -18498 -12712 -21401 -1558 14873 42617 42817 42199 -35382 -62823 -14257 41403
14469 41403 21283 35937 39584 54809 26465 3868 -29199 13985 42029 89696 146871 117232
14457 117232 77897 -14318 -85784 -110296 -45775 12457 -883 -29006 -70179 -35194 -29347 -42310
14445 -42310 -24582 -62350 -116649 -110091 -44467 -77512 -126907 -121997 -96417 -59406 -55819 -77288
14433 -77288 -49366 7945 15271 -20652 -62804 -89092 -77787 -9287 3916 -3280 -31006 -51113
14421 -51113 -52731 -26360 -17706 -2131 5698 3507 -48308 -53035 -1613 48239 64279 67439 80524
14408 80524 59253 -199 -63278 -43971 25819 17060 14781 27092 41519 66537 30419 25720
14396 25720 30986 -35864 -54876 -66387 -35636 -7764 -54892 -82149 -40189 -50470 -53237 -40369
14384 -40369 -5897 14324 -32605 -48558 -46022 16929 70316 98652 65953 34015 49243 32517
14372 32517 34432 40752 346 -32172 -7484 -5540 -10468 5619 23622 -4148 -15817 -30293
14360 -30293 -9557 71079 57866 56752 17440 -57285 -63476 -27306 21972 26295 -3549 -2080
14348 -2080 13053 -14253 -47174 -51701 -31092 -35850 -68192 -98316 -49325 -27073 45518 56516
14336 56516 1512 28771 44623 61296 41527 54648 80131 69818 -22266 -93652 -38104 -51191
14324 -51191 -26932 5378 -22888 -41363 -21568 18423 -33352 -31046 -43920 -69503 -19834 59691
14312 59691 62245 49546 -108 -16666 -37266 -45994 -74420 -72502 -62536 -61841 -84727 -125152 -165022
14299 -165022 -53183 -70447 -78699 -118316 -93069 -25286 -79290 -62302 -32743 -15029 -4783
14288 -4783 5410 26351 17263 -16019 -36453 27603 63827 13646 -40773 -50206 -22319 11133
14276 11133 -6284 -92658 -61976 -21516 23205 62764 95534 142273 132717 99702 87520 11254
14264 11254 61976 149212 74437 36678 45016 46592 64808 25331 32956 16235 -19364 -71103
14252 -71103 -56921 -60802 -19488 -21448 -48585 18687 93772 126952 91982 69126 39071 12295
14240 12295 35982 15 15282 32901 16513 -2893 18299 6989 -25157 5303 12756 -2259
14228 -2259 5967 25174 35108 8193 -45996 -78062 -97897 -100604 -75971 -39990 96316 148396
14216 148396 76413 35644 14179 63154 60975 -11479 -39469 -44092 3911 33706 30253 21056
14204 21056 -22093 13466 42049 72678 72221 45390 -21158 -66255 -9945 73720 116047 34327
14192 34327 -6202 -9869 6362 -9215 -32075 4504 16187 25964 -12206 -13496 -19137 -71383
14180 -71383 -79773 -106135 -67453 -37404 -12900 -18119 -77762 -99416 -55431 -7842 -63623 -58669
14168 -58669 -33886 -9889 -33622 -2055 7588 -55245 -46898 -166 12464 5627 -15534 -8512
14156 -8512 -36245 -48555 -24072 -32709 -28366 -27384 -42629 -51268 -37510 -72047 -34816 -34770 -17816
14143 -17816 -6743 -614 -71556 -131837 -113526 -97960 -42616 -24353 -74196 601 40928 -26578
14131 -26578 -52430 -97515 -126430 -78419 -25504 -1726 18507 14060 74464 69200 138308 174646
14119 174646 221386 126585 6271 23894 59715 109258 48691 31321 31530 53720 43030 31979
14107 31979 -15160 -36406 -57124 -72434 -91179 -63368 47369 76652 75359 54100 23942 41084
14095 41084 142367 170842 188227 205653 239493 256638 273733 375812 404794 476416 551313
14084 551313 520498 484487 449857 400382 314841 219013 159537 116599 72387 121971 166591
14073 166591 121284 71574 52573 65130 58479 57223 77959 57587 -10790 -51784 -68201 -2069
14061 -2069 -20895 -18464 -10968 -3063 54922 109100 142383 211843 259398 300117 347615 439244
14049 439244 515088 487302 441888 385310 359808 330652 301719 253804 210507 209584 194667 151588
14037 151588 83799 75312 70772 47875 11293 -29086 -37194 20692 47066 54122 50748 4137
14025 4137 -27209 -10927 41149 40864 49939 49008 10777 28838 44573 28454 46071 46630 88721
14012 88721 76919 47843 10944 -242 -7129 -12811 59922 28294 -20879 -22092 -8569 -4806
14000 -4806 -35055 -47145 -32071 -41296 9753 78500 27223 -3956 32733 42103 27227 42663
13988 42663 72495 100007 70672 31373 56616 112217 83250 31868 6977 2682 -39033 34559
13976 34559 96161 121788 104423 46309 -24265 -16607 -8567 -48283 -34437 2026 5339 11490
13964 11490 21855 2435 943 -52245 -67940 -104205 -98946 -97210 -74412 -27557 -40490 -22021
13952 -22021 -20112 -86360 -116836 -96205 -42631 -9991 -48116 -3107 46961 33645 -12841 12513
13940 12513 -30495 -81335 -99389 -105762 -115697 -171404 -140672 -101685 -42385 -19938 -34501 -42520
13928 -42520 -64256 -81112 -94027 -78503 -69685 -104274 -107084 -121587 -10427 21498 -11807 5767
13916 5767 81016 79386 24709 -27112 -9934 55644 50953 41532 2972 -41420 -91743 -91429 -58100
13903 -58100 8791 -26221 -84744 -74816 -48941 -31422 -29759 -32982 -62586 -78647 -75407 -31018
13891 -31018 -50230 -10437 47036 89420 117549 90151 65802 -40881 -47918 4160 11765 3757
13879 3757 29672 24039 -29095 -59320 -68588 -57624 -37618 88344 88663 39385 9853 12555 -723
13866 -723 -35683 -20437 -26257 -44966 -5629 24473 53046 17702 -49640 -66915 -59763 -70968
13854 -70968 -60203 -73306 -43796 -16393 -40859 -97100 -138790 -138670 -157927 -84221 23565 71092
13842 71092 48739 13746 41744 30386 43174 38269 14533 -8572 24888 61417 124467 102074
13830 102074 32041 96047 114340 82252 53015 -10159 -15349 -10104 33252 69980 98869 90561
13818 90561 89344 102326 117156 73934 82558 60041 3651 -9868 23408 51772 35383 27008
13806 27008 -16827 -19782 -5957 -4213 12996 9032 6909 -8874 -10338 4820 -5407 -24312 -38017
13793 -38017 -40204 -53651 -78151 -55598 -48228 -48650 5313 51701 58699 58604 36247 -17721 6059
13780 6059 1842 1368 25495 4344 31894 61954 80171 -4865 -38876 -17506 12336 28531
13768 28531 16519 -3664 -45397 -43551 -10351 57345 80203 52011 11758 11022 36916 47762
13756 47762 32784 40174 39425 27474 24332 38941 -48001 -55917 -14256 -1950 -14074 -26064 -40717
13743 -40717 -43482 -44093 -40340 -35208 -5271 -2197 -25676 -9252 42257 16652 -8886 -12955 12545
13730 12545 59198 42037 -30486 -88002 -99971 -62968 15240 14467 4079 2056 9810 -24992
13718 -24992 -24142 -11892 -5047 -76940 -12877 70103 39733 26354 30101 -21175 -32026 -22924 29491
13705 29491 40014 52711 45343 -25302 -64930 -63831 -25495 -34646 -39383 -34240 723 -14074 -15621
13692 -15621 24186 381 -25018 25508 8176 -49958 -58518 -53402 -32968 -8318 4864 2604
13680 2604 63415 82141 34272 2720 -10868 68403 101645 98535 40738 -9366 9587 5632
13668 5632 -34501 34528 53520 5155 -32970 -64524 -70843 -33720 -13473 -13821 -65356 -41504
13656 -41504 -4879 -5503 -11352 -12471 -20792 -53925 -52046 10009 -2086 -59658 -77561 -72917 -100477
13643 -100477 -66904 -23366 2199 -15703 -19669 -33583 -82011 -145967 -171035 -161547 -52250 -44907
13631 -44907 -71484 -35800 -19873 -34523 -18141 2153 -8729 11693 -16666 17184 17138 -81880
13619 -81880 -84562 -110407 -138139 -96889 -114501 -77461 -16861 12681 37206 -7141 35422 32737
13607 32737 46546 54733 49315 42566 5468 24660 46921 58418 36805 -6860 -11820 11615
13595 11615 -21995 -25529 -1777 5690 -9555 -2021 46659 -133 -15046 -18014 -22887 -28498 -74698
13582 -74698 -118926 -126260 -106118 -72521 -79024 -86532 -94254 -84844 -24571 1710 -49996 -58245 -40201
13569 -40201 -19900 -46117 -61360 -26681 -44154 -69424 -65917 -10289 50923 50508 10540 22123
13557 22123 68449 73698 76084 72377 51287 25800 58453 37482 -37088 -27036 38447 82964
13545 82964 71318 57368 -15890 -71972 -54707 -20240 -47150 -63331 -42842 -50128 -36704 12527
13533 12527 1331 2960 -29716 -37318 -12985 19008 25754 23378 72360 117930 82652 40372
13521 40372 38292 -7273 -28108 -10399 6877 60124 39872 64885 82963 53065 49255 21451
13509 21451 -30167 -67346 -33033 70733 92163 104747 92832 129626 164909 156419 132341 118062
13497 118062 68655 55224 104521 67727 2939 22190 597 6204 24475 47963 8762 7441
13485 7441 73093 72387 -12647 -41114 -81645 -180336 -228314 -174073 -133994 -102223 -65445 -34130
13473 -34130 14297 27181 -6966 -5871 -7977 -10522 28121 20075 34240 59752 79089 -35964
13461 -35964 -54934 -49258 -58957 -57708 -50959 11245 21178 10349 1354 -28057 -63274 -93620 -2373
13448 -2373 46260 11712 -47909 -40619 -38601 -57644 -99855 -82983 -69352 -61071 -36280 -37340 -52007
13435 -52007 -11454 -23737 -41876 -36516 -28465 -19854 -62555 -33627 -17947 -22810 -83574 -70528
13423 -70528 -66577 -67844 -34185 40240 87515 75230 58108 29434 -8053 -17267 -16293 11284 -14151
13410 -14151 -668 -11333 -8512 13740 27498 60445 29259 -6158 -43307 -55016 -119657 -136152
13398 -136152 -124332 -109145 -40068 -4149 -60 -16223 -24348 -42310 -25764 44866 62929 79255
13386 79255 45620 2863 -67517 -83790 -20803 5282 -34179 -62814 -102510 -74001 68083
13375 68083 82226 40608 37091 35407 -1519 -2705 -22626 -60133 -27498 13045 52884 11318
13363 11318 31308 50616 34601 61815 34139 -70056 -86926 -78735 -51991 -21979 -13512 12310
13351 12310 55712 67757 5474 16688 60222 50638 21654 36000 22053 -44133 -64941 -20627
13339 -20627 33094 16405 38576 37328 -7947 -1781 26638 55529 58496 18800 51395 72376
13327 72376 36080 3264 -15853 52788 100992 79711 46696 75419 145259 112011 61201 51469
13315 51469 18964 -23706 -13054 26133 27096 -35775 -20155 62714 41478 17577 -11849 2049
13303 2049 -70860 -96228 -51437 -10448 33063 45250 41258 27126 -5779 36232 36752 31167 -5269
13290 -5269 -53684 -8373 -19768 -38236 -80121 -59180 -14645 17533 -44054 -53056 -1078 8183
13278 8183 -49000 -55983 -88212 -92599 -49969 20179 17018 13138 36150 96358 67417 48079 50802
13265 50802 117927 124067 133266 90330 57847 -474 -53386 -84409 -54111 -66779 -57550 -103733
13253 -103733 -110489 -61509 -31389 -25528 -58119 -59147 -27827 -59056 -103746 -58152 32849 -3726
13241 -3726 -62360 -98244 -73773 -42696 -56430 -123045 -145634 -63319 10899 11497 29679 62115
13229 62115 73650 82277 5909 -18875 -49761 -80629 -69665 -26723 -72257 -93785 -66850 9220
13217 9220 -56991 -75150 -77240 -97733 -48640 19910 2473 -15282 -11994 -35557 -48579 -55387
13205 -55387 -64139 -10121 5220 -7672 15609 1639 -41868 -40476 6923 -3700 -57240 -18480
13193 -18480 71575 104796 87925 13239 -15411 -26692 -8796 115378 123466 28307 49767 67895
13181 67895 81438 25337 -32437 42381 104772 84422 43070 -5400 -42529 -19583 31581 -5278
13169 -5278 -34710 -56533 -110743 -137420 -125608 -19044 7338 -6648 -6709 -19575 8136 19877
13157 19877 5199 -25040 29512 99584 67675 33023 32279 33436 6551 -17183 -5657 -27257
13145 -27257 -39674 -16548 44791 5327 -40992 -68745 -117218 -109223 -56956 -44814 -29016 -47271
13133 -47271 -93432 -126497 -137965 -79279 -83224 -129408 -122439 -130602 -126702 -67180 -49590 -106451
13121 -106451 -107140 -98675 -79310 -64381 -2588 60187 50767 51856 -10422 555 35823 66115
13109 66115 12663 -33034 -62421 -18203 -22209 -88058 -126335 -81104 -46878 -96450 -22588 64421
13097 64421 41824 21137 35321 19734 -33237 -7459 51731 84354 89853 114779 31309 -51262
13085 -51262 -46424 -19090 -1094 -54579 -93641 -82659 -32045 -4943 32687 -13423 -84456 -145307
13073 -145307 -140926 -90896 -119958 -88076 -66119 -28565 37627 97485 135582 140318 67696 19976
13061 19976 13922 -16881 -33625 29916 4610 -52981 -18193 -16862 -37324 -19051 -29025 9348
13049 9348 21422 41724 51325 51789 72019 22739 -53044 -92679 -68684 -61796 -114641 -117951 -89763
13036 -89763 -136552 -103520 -83387 -77890 -26829 47338 66683 77853 35453 -4599 -28889 -75957
13024 -75957 -44680 -58563 -72214 -56489 -3590 -24215 24280 34995 43200 56645 50111 24415
13012 24415 -13357 30523 56809 14882 -13727 -11841 -6981 -51592 -80678 -44666 -56348 -52946
13000 -52946 -49429 -62848 -100737 -72182 -48401 -47952 -68849 -63088 -90182 -76017 -41962 -49431 -84085
12987 -84085 -56567 -50657 -8210 8126 -28099 12821 -50825 -19579 -12405 -2965 -7107 -22866
12975 -22866 -87735 -85622 -138202 -178889 -183725 -208400 -152198 -39316 -15777 38501 59529 -1468
12963 -1468 -41474 -56050 -60948 -50217 -34202 -72320 -106149 -64772 15420 36214 63346 16181
12951 16181 -4104 15174 4964 -10566 -31310 -43048 -20559 5358 651 49915 111486 112817
12939 112817 52821 22 -43740 -27731 -30697 -57101 -50518 9035 10569 12419 13526 25103
12927 25103 -46203 -67061 -24821 -55374 -74183 -57067 -47545 -49120 -72941 -84342 -91292 -106242
12915 -106242 -113113 -77210 -18488 24829 73528 84444 62222 -2671 7365 57846 35685 -18728
12903 -18728 -8970 7850 924 9912 7507 -11796 -15536 -18949 18833 39109 44363 93280 103674
12890 103674 83989 50667 9894 48532 38776 -11279 -7620 27145 49988 23050 56278 96030
12878 96030 46438 30153 -24745 -14631 15388 5264 17273 -18363 -11008 11026 27061 32200
12866 32200 18844 -21766 -115708 -131322 -111449 -98681 -115355 -121815 -119501 -77052 519 -53191
12854 -53191 -102568 -33162 -65701 -120382 -47242 28562 16906 17520 48455 -5749 -33034 -32873
12842 -32873 -90812 -114340 -86602 -67415 -38715 3520 -11864 -50450 -74134 -54834 30109 106949
12830 106949 91195 53510 -21910 -77962 -90804 -39695 -43478 6039 40831 4791 -8235 32792
12818 32792 45459 24662 18418 14032 50344 33094 -43423 8808 1975 -35814 -18489 21075
12806 21075 49408 82394 80666 73601 64736 64426 10701 -40441 7248 63565 23876 16915 9388
12793 9388 -17699 -16365 22142 2491 -69966 -73608 -34875 -53788 -91496 -34799 38814 49972
12781 49972 -7278 -26889 -67630 -88281 -54335 36160 48199 65398 78151 47826 -37924 -53073
12769 -53073 -29934 3027 -30003 -39261 -1835 35972 77540 39582 20709 48468 57003 84776
12757 84776 49803 -24409 -48923 -23246 28908 11454 2487 33950 18053 -7091 -19543 -33775
12745 -33775 5056 24555 15435 -46808 -33746 8311 -3242 -28320 27055 8576 -39648 -75920
12733 -75920 -53859 23052 83795 -19662 -67244 -42085 -45842 -71228 -38781 23897 2659 16362
12721 16362 24167 14184 13051 -8851 12054 48092 26958 -37919 -55141 -26156 -30519 -44580
12709 -44580 -50871 -55298 -13637 -21065 -20177 -46839 -11208 24531 47877 36749 33991 -724 4796
12696 4796 -12224 4459 -3100 20280 14196 33748 22179 -3057 45929 55203 24427 5236
12684 5236 -4488 -28215 -49224 -74210 -72101 -27913 21391 11153 -11718 -15360 -10824 21357 41458
12671 41458 34119 -31341 -111583 -100939 -12442 10016 -26893 -32470 -40105 -38253 -35431 7480 16605
12658 16605 79374 82429 48551 20258 -15989 -31290 16042 44314 82109 37560 38041 70507
12646 70507 91213 132914 74683 -17400 -28498 -92649 -76667 -32598 -60253 -24918 -13976 -19193
12634 -19193 -27471 -17884 476 59519 74928 31982 -81836 -61198 19127 34317 28899 84128
12622 84128 93019 60934 68823 91107 113535 87821 94028 104391 28019 -3016 -24484 -16846
12610 -16846 -28258 -29339 -6399 -10877 -34174 -27600 -40685 -5650 15776 23680 -22936 -34532
12598 -34532 -72367 -43079 -40254 -13796 25509 8399 -15334 -73461 -72550 -16756 -8890 28520
12586 28520 19499 20785 12780 6561 20270 3318 6148 17213 -2723 16072 36964 61615 47469
12573 47469 7997 26066 -18141 -60921 -34998 16276 55513 78117 84461 62642 116675 119676
12561 119676 19632 32940 34427 -44909 -116419 -144173 -38298 55030 38675 -9213 18404
12550 18404 39381 14498 -9240 -35492 -5225 -3226 -47651 -54339 -39335 14630 -1579 27801
12538 27801 59134 36178 16044 5397 -45283 -105355 -31104 71218 108599 108458 34696 -56769
12526 -56769 -99963 -79571 -92343 -44947 -66336 -105074 -126873 -101541 -61919 -65769 -45964 -38413
12514 -38413 -13461 7759 22190 -50362 -92412 -94729 -42765 12731 -14757 -69126 -85905 -27832
12502 -27832 43491 -18052 -75194 -104426 -72964 12462 36143 -12793 -44776 -46772 -38958 -57171
12490 -57171 -40074 -691 41401 55329 26743 -21927 -28230 33102 94720 94167 57098 19809
12478 19809 -31445 -55266 -54459 47970 99332 96406 69916 55662 44698 44866 36208 5900 4410
12465 4410 483 36328 51872 69478 65458 57466 58707 -20454 -55900 -102521 -91350 -67120 -49632
12452 -49632 3431 36745 8050 44573 99945 97618 50740 -11452 -30673 -77149 -106394 -125347
12440 -125347 -76244 -45707 -24506 38406 16591 -42241 -98076 -145676 -101011 -107949 -129369 -91025
12428 -91025 -77898 -65170 -10317 96231 172024 145018 84128 44499 27464 -3372 -31991
12417 -31991 -71632 -122974 -63570 -38670 -24182 -71761 -95618 -40257 -31482 47224 85489 96734
12405 96734 75434 42264 7394 30879 22227 -49792 -101557 -99645 -48921 -44887 -24840 -38789
12393 -38789 -111168 -92163 -33053 -925 -9697 16818 -6235 -8872 24113 55659 79519 82733
12381 82733 70090 9457 -5380 48649 61674 14160 50161 21334 -22691 -14718 -7765 87999
12369 87999 124755 128843 85673 53028 80666 92551 53762 13143 38734 71156 96793 99011
12357 99011 115868 178902 169503 81203 45469 32835 30529 18567 32424 13367 -50283 -49934
12345 -49934 14428 25505 31704 -8725 -7650 -9561 -62170 -73447 -25145 -34407 -46194 -40186 -56678
12332 -56678 -41245 -3078 5471 -27101 -20463 -6009 12784 42358 -41353 -91673 -9691 49694
12320 49694 3909 -85755 -65164 15574 -18855 -19805 23227 48704 52365 -8237 -48921 -64720
12308 -64720 -48359 -3917 -9240 24265 53594 62006 54696 41577 34579 75371 58813 26846
12296 26846 43192 1592 8534 -38908 -57987 -119177 -63586 11654 17118 41211 23962 -44267
12284 -44267 -79403 -129091 -152348 -128992 -41845 -33158 -89737 -96528 -81840 -52357 -25866 -18374
12272 -18374 7218 29127 -11538 -104 -65103 -73846 -45218 -31473 -43035 -37509 -25971 -57048
12260 -57048 -112438 -123550 -77868 -23372 10511 47477 44557 18164 18364 26628 61921 32672
12248 32672 27688 34239 19183 37233 21593 -1948 -1609 -20781 -37943 -38338 -21899 -29926 -58920
12235 -58920 -17489 3243 14353 -9626 -39089 -65818 -52151 -21847 27919 -139 -17263 -7933
12223 -7933 -47758 -43362 -72632 -14457 75346 58167 25835 15569 55409 125588 130255 66142
12211 66142 11995 55098 58458 14085 -45693 -59806 -61067 5165 25094 13673 18907 -6009
12199 -6009 22790 46834 -22362 -47320 -17138 20371 4184 -19527 -9560 56935 25276 -48394
12187 -48394 -46949 -28180 -76457 -60473 -27522 -37539 -38566 -45296 19296 12356 -56529 -35947
12175 -35947 -43400 -49240 -3643 25317 15038 -30025 -64692 -33584 -11307 -1884 4603 10591 64246
12162 64246 71743 -23113 -53554 11936 52237 -1313 -39026 -4182 57896 32604 -1983 -45798
12150 -45798 -93788 -114252 -87826 -65239 -23626 7793 32755 21538 1162 -20536 -23536 -44456
12138 -44456 -38102 -23226 -9308 -29190 -27790 -11103 -8263 28900 -20719 -35750 -433 9431
12126 9431 -10098 -79122 -112593 -47236 -23101 49517 30301 -33885 -20150 -34771 -72299 -94097
12114 -94097 -45279 -13548 23313 74637 78594 25515 46999 2952 -15868 -3874 -56977 -45261
12102 -45261 -30342 5594 44760 36960 -48996 -82818 -55779 -55283 -10597 22752 24743 -5105
12090 -5105 -87247 -123333 -76549 -50337 -35086 -72538 -59355 -58307 -6419 51364 67032 43561
12078 43561 -26539 -36369 42421 125237 87815 98716 116139 137440 124833 84042 58194 65629
12066 65629 87879 32294 -14170 -96952 -137896 -120702 -87076 -42294 13895 28224 -1502 -13589
12054 -13589 -48923 -53519 -21752 -21311 -46784 -81623 -99161 -70580 -92482 -132879 -133471 -116448 -127828
12041 -127828 -127477 -85111 -54408 7327 21732 29571 96444 70762 39896 15843 -22077 -16301
12029 -16301 -24040 -33356 -22469 -47195 -62269 -17385 -8410 5181 21496 1610 -14414 -9155
12017 -9155 -23301 -63753 -110435 -54761 -33693 -54909 -70146 -88536 -121108 -165894 -70167 -42229
12005 -42229 -66628 -76131 -52218 1092 4351 -7791 -35609 -72869 -45121 7941 23930 19365
11993 19365 -7694 -10958 -26749 -40889 -11218 26214 83983 69443 21297 -14382 8558 46245
11981 46245 67504 34522 39236 -28129 -48451 -35025 -41495 -20642 -23434 -62954 -86574 -70427
11969 -70427 -78565 -59175 -44472 -6887 11214 -26441 -22562 4451 60187 58493 35784 -6519
11957 -6519 -9421 -23292 -4572 -13116 947 19944 -60680 -58008 -32251 32294 -5971 -18518
11945 -18518 -8930 -17558 6258 5106 63891 60908 64352 15684 -25833 21981 30996 -28172 -48585
11932 -48585 -12460 -42484 -59932 -6352 20733 -31724 -48736 -23645 20705 -13963 -82743 -154308
11920 -154308 -72300 -72011 -62667 -34315 -66693 -53178 -63119 -79404 -63863 -65580 -62165 -94187 -99131
11907 -99131 -82959 -36179 -8571 22584 24806 2962 -20546 -1940 48138 27314 -22759 -26784
11895 -26784 -19146 -12947 -21409 43789 80409 47223 -21954 -61299 -8948 40353 11341 -33600
11883 -33600 -82195 -9123 -40550 -57211 -5482 21246 53882 38257 29644 11239 -24089 -7528
11871 -7528 -3140 -38362 -30669 -55716 -76527 -79892 -98238 -109068 -86017 -72037 -6277 -7947 -19365
11858 -19365 -42776 -91173 -55887 2064 27129 73339 10124 -46206 -65211 -48870 -71628 -81665
11846 -81665 -45139 -48768 -44351 -102004 -153300 -111096 -145818 -137229 -59632 -6091 12056 44224
11834 44224 29578 21853 41766 18521 3742 448 -40743 -100531 -119387 -94698 23795 69467
11822 69467 -17736 -13222 -4270 -21262 6004 1518 -10070 -86645 -154883 -174621 -160100 -99643
11810 -99643 -76521 -59906 -68331 -124511 -85711 -110429 -145867 -154574 -109033 -49449 -17430 -33727
11798 -33727 -57671 -55005 -76388 -144274 -163977 -111689 -72318 -61892 -119405 -143018 -79940 -94483
11786 -94483 -71793 -35247 -57444 -35213 -58050 -138125 -90831 -64677 -90952 -85698 -76870 -125088
11774 -125088 -119267 -23853 44728 40570 -23848 -30015 -613 2941 -11911 4876 9452 -11425
11762 -11425 -8557 2669 -4738 -37268 -13307 -45462 -57768 -29599 8660 -33025 23719 58036
11750 58036 34113 30221 63907 50685 36154 44958 28127 -11447 -68025 -54460 -26371 -46387
11738 -46387 -29289 -17768 15200 -1031 -61251 -63953 -54259 -54271 -60224 -82414 -77597 -68916 -103900
11725 -103900 -90143 -126339 -142268 -132461 -89046 -82819 -86270 -57856 -30903 -54678 -89019 -114504
11713 -114504 -77215 -49408 9664 111249 163642 97478 93977 55753 -2033 -16178 -33766
11702 -33766 -64241 -63582 -43880 12573 51080 55236 24923 44613 26877 15010 -14465 1511
11690 1511 -46184 -41302 -42324 -45164 -66021 -66452 -68106 -79587 -37398 -32876 -27926 3664 -10748
11677 -10748 -26129 -26458 6743 80040 78266 86634 68357 1641 44823 95759 88539 34070 -5246
11664 -5246 31246 65382 41331 74082 57924 -10702 -38179 -51625 -41620 -8823 413 -23766
11652 -23766 -49614 -65010 -89636 -84706 1145 -9957 -46302 -71642 -58611 -48138 -44589 -13080
11640 -13080 -55910 -94760 -114546 -127324 -75904 -106209 -56986 640 7975 40880 -652 -8754
11628 -8754 22316 -486 -17367 -18399 3270 63396 119589 115638 109448 52520 10080 25085
11616 25085 -14131 -28694 -16552 -55280 -40352 -46718 -108209 -97321 -102571 -30349 24522 -14999
11604 -14999 -87009 -109767 -98895 -86434 -55224 -43835 -20400 -75792 -65863 -49926 31148 83764
11592 83764 71508 78267 34972 39814 10469 13873 62331 79280 50482 3866 33161 47023
11580 47023 55849 40086 10744 -21625 -40984 -35014 -1402 58552 87170 67557 3529 -62050
11568 -62050 -74687 -56386 -39741 -12099 -60859 -113763 -105116 -123241 -136053 -145456 -107192 -83316
11556 -83316 -56880 -50608 -16305 -16297 -63324 -63069 -93394 -102162 -81284 -31245 -6197 24718 -30691
11543 -30691 -50559 -112222 -143460 -111802 -54747 -1084 -2765 -35873 -72080 -14943 22004 32055
11531 32055 15924 23287 -19253 -24806 -14462 3819 -26782 -43322 -42316 6167 79559 88116
11519 88116 86017 47103 17097 -68967 -71019 -63379 2745 26208 112303 103267 57355 18175
11507 18175 490 -45816 -41672 -11047 26813 -590 -54325 -49103 -24008 -18732 22669 97389
11495 97389 96455 59881 44282 38049 19628 -34149 -54753 -57569 -35234 -57789 -80784 -43398
11483 -43398 12215 17678 -73803 -110294 -46191 34475 42863 33453 -2839 -2878 15930 4001 -10838
11470 -10838 17329 47935 13618 9094 51523 88361 51317 9737 -4089 11240 -22495 -49397
11458 -49397 -42800 -81629 -94468 -111107 -89259 -50279 -80505 -87743 -44025 -3684 -20319 31697
11446 31697 19277 -12090 -10691 12924 -4514 -44740 -66022 -86037 -100468 -67475 -80915 -52431
11434 -52431 -78684 -82444 -71663 -51061 -18909 -48646 -66744 -49842 -676 -945 -21207 -582
11422 -582 -1831 15137 -776 -29638 6823 -34073 -19341 -20205 -72305 -130247 -82650 -19077 2375
11409 2375 3862 -22553 -4841 -11115 -9733 -11743 -21561 -39340 10303 12388 32267 88665 49972
11396 49972 6493 -11285 -40304 10867 -24172 -27167 -16636 11820 -9391 -26776 -33832 -57673
11384 -57673 -61942 -49545 -21406 -38564 -61312 -85703 -102400 -103433 -99525 -54757 3615 7111
11372 7111 -54460 -47177 25730 53861 56542 58648 -16359 6064 87235 110111 102199 100688 61353
11359 61353 48358 26813 98218 151607 56681 -57372 -83410 -47838 30067 39078 -10462 57778
11347 57778 39900 54170 62818 63171 -24088 -46362 -32238 24595 25437 -45974 -85816 -22501 16831
11334 16831 41765 77781 71164 71213 46921 2394 -32417 20546 20270 -26159 11948 32564 -25942
11321 -25942 -65780 -18139 34859 53807 35732 29816 -51958 -116446 -126832 -82561 -77271 -56184
11309 -56184 -49566 29330 33717 219 17775 -31888 -45301 -46177 -45471 -4594 17224 35248 57826
11296 57826 75057 62453 97298 145653 101669 96257 47874 -2458 -33253 -60856 -5159 -8145
11284 -8145 -2300 -11943 -62362 -46045 -60109 -67719 -69816 -53885 -11227 -4003 -68664 -38788 -35411
11271 -35411 -44670 -11984 29452 5041 -10406 39635 32145 -27697 -68416 -94089 -114891 -44120
11259 -44120 2561 7386 18771 -43698 -76337 -95697 -86934 -61775 -69655 -26419 -831 24721
11247 24721 18896 44688 33656 93097 16770 -64290 -56241 -58416 5096 37049 69429 102357
11235 102357 92114 67547 67140 84000 48571 18940 -8516 8764 -32931 -63166 2729 20971
11223 20971 -53992 -28213 37330 48975 2492 8880 53551 85432 83679 34622 26155 21600
11211 21600 16275 7383 17542 6268 26621 -18312 -27020 18431 38545 25464 104856 84655
11199 84655 11538 -4088 -13429 -41987 -61030 -61125 -74860 -90019 -104419 -114791 -53369 -43805 -82788
11186 -82788 -77291 -29664 27936 49535 21748 -15386 -39477 -23983 -3380 8553 -47528 -66901
11174 -66901 -27499 33511 49562 7040 -2738 -5040 15317 23467 27644 22166 46953 80203 53918
11161 53918 45420 27391 -29946 -85557 -78773 -69847 -24515 -17966 35737 78224 72235 6907 34928
11148 34928 27354 -68215 -155799 -111064 -21908 2909 16724 11128 2168 4127 -32504 -97032
11136 -97032 -68650 -30771 5144 30841 62341 45492 16659 6812 12687 50600 69890 71843
11124 71843 51598 22074 13521 19089 65423 57526 75275 76989 98116 64474 97091 54596
11112 54596 13970 45627 -8020 -45675 -50258 -85723 -90390 -95069 -108533 -129257 -7190 62941
11100 62941 23346 -16750 27974 32868 -7226 -9435 13016 -21290 -7857 19821 80605 45854
11088 45854 72225 81261 56841 55955 59873 30419 48179 65500 65074 59205 9377 2105 -31211
11075 -31211 -73479 -33451 -39285 -8325 -54777 -92739 -40359 17390 77682 112176 59356 8814
11063 8814 346 -2280 -2940 -30895 -33992 -58615 -20450 44491 27513 40645 54128 -18273 -46087
11050 -46087 -40201 -38315 -81931 -90050 -6399 -901 23863 23179 16373 14237 27551 -20043 -88973
11037 -88973 -97011 -35240 -29937 -4049 37416 43350 28833 -16620 24034 26265 -9176 19213
11025 19213 -54732 -121835 -126819 -29270 19965 9654 36587 11453 -11826 -27534 -17036 44853
11013 44853 62249 -1580 -54282 -58229 -98084 -83381 -18812 -26554 -4104 -23542 -53342 -53935
11001 -53935 -17187 8106 23203 84291 11409 -98901 -99352 -61758 -71312 -80898 -41627 -66380
10989 -66380 -105937 -55489 -32147 -23743 -17300 33523 75683 83877 94255 44406 -29699 -58755
10977 -58755 -65468 -43313 -46388 1811 -2826 -1878 -49782 -49493 -4157 -41648 -17890 29592 37117
10964 37117 35731 9203 56891 137668 93400 94171 106921 5286 -36379 -29040 -30186 -34445 16769
10951 16769 -17647 -32462 -45234 -49947 5831 61876 96561 35140 -44475 -56000 56533 56764
10939 56764 45599 67577 132257 130883 53556 2729 19136 -25651 -18399 31949 36038 14951
10927 14951 -14022 3591 31477 122941 82019 -2483 -10548 -32319 -93527 -137121 -134303 -67117
10915 -67117 -25097 174 -9639 -25069 -36128 -18605 -4868 -1102 -19150 -71805 -25296 -25886
10903 -25886 -33839 -54021 -35805 5332 -5445 24495 7257 -39879 -38221 -18105 72456 118455
10891 118455 74428 72419 52707 -356 -13260 -49155 -14817 -5758 27476 68906 43088 62094
10879 62094 123383 68340 29505 6183 -12603 -31336 -34893 41465 67564 54791 10543 -27624
10867 -27624 7510 79136 54461 16269 -53534 -73591 -45995 -48612 -45796 -17925 -1023 6188
10855 6188 -22179 -30486 8052 -11911 17866 5716 -38212 -85592 -62055 15517 56758 49237
10843 49237 58851 74683 46563 -50774 -56264 15812 60766 54524 46921 40295 25385 -34912 -90419
10830 -90419 -81071 -70673 -91607 -83141 -24429 42077 77692 90933 94725 24375 -83061 -74069
10818 -74069 2963 37787 -7960 -20943 -7504 -38672 -40373 -369 39833 62209 49302 51911
10806 51911 61881 18378 12019 5721 -1568 -3599 14116 9136 -26035 -52163 -36910 26355 52866
10793 52866 -3734 -67648 -57782 -48197 -49402 -71323 -1758 -14420 18277 78065 56358 13535
10781 13535 -106629 -104976 -58672 5810 54851 12971 -26248 -17070 -4693 -4713 -168 -11041 -45693
10768 -45693 -80496 -44995 -29910 -2657 -25584 10803 63240 15989 7379 30657 65938 69432
10756 69432 27061 -9803 -13220 31664 35836 19958 48343 43838 89189 85904 53760 56353 26880
10743 26880 -31660 32084 35517 -4414 -56047 -56886 -9324 6849 36986 33664 11629 44683
10731 44683 12669 -41416 -46664 -35573 -83268 -94539 -104265 -126555 -121093 -79401 3094 73979
10719 73979 73216 60029 28309 -6292 7177 59959 83987 99083 93795 44807 95986 121903
10707 121903 97700 83772 52585 14739 25941 47449 70897 92272 88974 104281 127815 94107
10695 94107 47893 38024 81472 37325 29153 42982 48985 -4858 -55459 -43468 -17779 1752
10683 1752 9086 38150 28544 44906 85044 68132 40150 61883 17934 -19921 -51084 -43067
10671 -43067 -7565 34879 52153 -13402 -64743 -52554 -55917 -33822 -4721 -7943 30682 45247
10659 45247 15336 31806 73814 66024 19032 51878 87983 78570 38055 -41864 -7541 2261
10647 2261 30031 -5821 -53835 -39936 -7437 88045 95407 90685 66561 54266 25849 -27965
10635 -27965 -71747 -40077 -1019 40676 33991 10714 7083 -6154 24346 10818 -18580 -45538
10623 -45538 -61824 -57782 -64611 16101 102808 122643 83809 50126 11419 -24921 -10075 1184
10611 1184 39211 53812 28737 26102 46361 41437 5161 6197 -6700 -30223 -22638 -89069 -50693
10598 -50693 256 -21485 -56968 7242 -12909 -13310 -19430 -74077 -20042 37287 83411 113456
10586 113456 73720 28455 25702 25011 -15534 11594 18972 51701 71947 32749 33781 142030
10574 142030 142175 108526 166441 205938 235749 308467 354582 325321 270918 244545 254376 239521
10562 239521 210044 156856 153167 148390 154223 165309 151535 168216 120342 128689 150821 178699
10550 178699 217721 141550 66999 32528 47655 34600 58957 114153 103907 108656 60582 73788
10538 73788 96276 104287 107161 101772 55754 83551 58009 42232 98748 162076 227049 205708
10526 205708 149419 113537 104066 112770 25982 -40268 -64840 1898 49654 47930 28806 27322
10514 27322 19398 32599 11232 57791 126579 111392 89924 75028 70956 75510 47713 19299
10502 19299 99729 134363 90804 40233 57622 84104 47429 21312 48539 29952 21167 29488
10490 29488 2519 16991 -3312 6250 -53509 -70162 -57964 -66161 -46672 -56806 -49833 -84510
10478 -84510 -36952 35689 32602 22448 9016 -47459 -86420 -84027 -24512 -28513 -30244 -65799
10466 -65799 -93089 -87594 -69185 -62538 -21644 -76314 -40328 -23942 -33770 -77280 -87337 -69936
10454 -69936 -1535 58142 48486 87864 123536 97807 90791 66866 18779 43263 30752 -83523
10442 -83523 -41204 -30610 -57993 -56356 -960 32102 18247 5346 -22675 -298 24583 1629
10430 1629 -10067 67416 118287 153376 93059 15306 -27589 -87832 -68630 -26532 -31560 -59615
10418 -59615 -99356 -43270 27102 44462 29079 29879 50141 78586 74253 58720 81470 74820
10406 74820 79814 117028 156970 152512 182720 212267 246932 278151 324908 330470 295729 284169
10394 284169 279534 249310 271468 244521 303469 345200 304157 292731 293092 282061 260431 233724
10382 233724 183615 166611 95522 68178 73834 56477 17705 12603 52900 61282 14643 423
10370 423 -111142 -76269 -27784 -72061 31081 95064 77666 84268 20108 5472 1759 -3336
10358 -3336 12595 37572 -63853 -102132 -60460 -44879 -3627 70831 59464 93953 125966 144026
10346 144026 161532 159750 193400 236555 226797 298023 401507 455478 460351 504422 556978 550383
10334 550383 514765 502846 449168 428377 366547 338813 314011 256891 226354 133082 105094
10323 105094 118930 58867 22522 9426 32330 47975 42481 28143 -29079 -34298 -14353 -14247
10311 -14247 -34351 -61653 -83820 -59950 -9772 40799 81973 49576 -14561 -28284 -118923 -105464
10299 -105464 -32356 12784 37041 -37236 -71197 -9096 13194 -37539 -18479 26225 79741
10288 79741 109109 76302 41433 46077 65585 96777 81835 47162 75687 90419 102389 78528
10276 78528 123496 99386 52997 -10691 2346 85902 72276 50519 26051 35978 7796 -15611
10264 -15611 36550 129109 96415 69219 108755 94667 88021 38118 18461 -26493 -68940 -17596
10252 -17596 55468 15258 -9544 10526 1289 -29281 -33697 29136 71188 56169 63071 12826
10240 12826 -22416 -49710 -15265 425 13662 -15053 -17944 -38441 -20386 749 69326 110493
10228 110493 53335 23231 29508 28277 55407 16078 15627 33668 20160 26053 42745 27455
10216 27455 10526 -14618 -24781 37456 78555 50707 50913 22077 54455 42932 -9742 23661
10204 23661 -1504 -55971 -103344 -130945 -105127 -64592 9998 59701 70776 41300 28868 -5301
10192 -5301 -485 -11187 -45690 7084 53709 32744 4246 89609 114495 72205 48128 48481
10180 48481 60737 28085 52456 33898 29123 30776 85597 84913 96238 72852 78226 53924 97987
10167 97987 169886 192642 185800 208336 227916 184316 127627 77942 41848 69488 110286 106708
10155 106708 50673 35352 14702 -627 24225 13062 -19857 -32707 -2830 6305 16230 30640
10143 30640 65582 31537 -28698 -34247 37489 30162 79727 148778 86065 56552 46785 3982
10131 3982 3461 41689 111589 71728 -8110 -23193 -8892 7403 -45666 -76947 -145761 -118793
10119 -118793 -57161 27297 86534 78661 -27631 -53007 9380 30060 21671 -16752 -14659 -35385
10107 -35385 -78044 -85204 -60818 -70133 -71516 -30828 -12579 -20561 -16635 17018 21075 53888 51360
10094 51360 33451 75339 53670 4407 -9551 -37496 -29109 -670 -16413 -7285 68025 87751
10082 87751 124247 74300 8383 -62055 -16523 85235 84567 34623 8959 -64542 -34726 297
10070 297 88956 107839 91082 51740 5562 6295 46430 45557 43784 48102 1262 10635 50409
10057 50409 44321 40143 70198 32563 11441 -45356 -84338 -78766 -33390 -33226 -7121 29702 -3476
10044 -3476 -29436 -39318 29463 40267 8409 -783 -766 57066 80188 136033 92632 123781 117034
10031 117034 31499 -43297 -25565 6002 56373 63847 30702 10256 22546 39176 33693 26166
10019 26166 -21281 28173 37244 21718 -371 -10414 -1943 29469 52785 67871 22302 -16754
10007 -16754 -15326 12282 1298 -4618 -12147 -15547 -10095 -20016 -28215 -14274 28736 11254 -37325
9994 -37325 -39473 -22264 871 -22725 -39139 43766 54716 18147 -1827 -29463 -41723 -64950
9982 -64950 -56793 32067 66879 26999 -5131 -53670 -75105 -85236 -82496 -77527 -45322 -15774
9970 -15774 -9969 6019 -45680 -51757 -47222 -66603 -79497 -34886 -6736 44872 46405 23703 1862
9957 1862 -19571 -22145 24399 47333 10841 -4181 -22892 -55869 -56858 -59056 2097 27792 33700
9944 33700 15644 -56584 -72496 -62195 -41535 30517 76730 49721 72347 77605 52209 45282
9932 45282 41438 -13735 -11451 24067 -3228 -15294 -5315 3455 902 -25850 3897 53712 23190
9919 23190 12301 6744 43547 76570 51071 26992 -41027 -59626 -60522 -88980 -68302 -25943
9907 -25943 2089 -21805 -71360 -11155 23418 14139 51538 70886 36755 88353 73625 66096
9895 66096 91497 83561 82593 80704 112853 96773 93001 144989 154789 64745 -2134 27986 10418
9882 10418 -15233 47599 29710 -10965 -32436 -38233 9769 50541 34409 -65687 -67400 -11471
9870 -11471 -27570 -64213 -53070 -84666 -95300 -107858 -99531 -57500 -102260 -60277 -15816 -25423
9858 -25423 -2794 11510 -15923 -13219 64053 60845 49226 89410 138202 178122 187809 169803
9846 169803 153340 174043 160444 82085 35449 21734 17644 33521 86575 87460 91211 45803
9834 45803 22256 47749 55742 25437 -44689 -55897 -73839 -77489 -109716 -107123 -72172 -59046
9822 -59046 -89714 -83466 -112171 -100457 -93158 -60698 26718 -8187 -84872 -111072 -105937 -96025 -65448
9809 -65448 -5546 9863 -10967 -9458 -42715 -46914 -22242 -33001 -46070 -50588 -26606 -33080 -70627
9796 -70627 -36815 25253 54331 77897 54352 -3485 38322 37620 23364 -3620 24576 -4054
9784 -4054 -60243 -52075 26456 36550 18184 68608 75549 62231 83670 73473 -3253 -51146
9772 -51146 -28377 -28566 -20786 10537 10476 12962 -1995 -10294 -30671 -25443 -8044 -12318 -17920 3443
9758 3443 44421 28627 28057 32363 44439 29776 -15796 -84484 -119087 -83107 11527 77889 101548
9745 101548 40941 -22170 -107700 -122339 -79238 -36130 8559 -10914 -66576 -45155 -11091 18455
9733 18455 48243 41993 74432 65400 45712 36302 38043 -19526 -63371 -21254 -1350 8681 27460
9720 27460 -19538 -34685 3547 18477 75875 86266 36025 71129 117567 121528 80781 34819
9708 34819 55335 97073 72878 30894 62664 65545 44171 -1695 25305 44265 45254 23161
9696 23161 -34897 -3069 543 7018 35233 54252 70683 54619 59930 28481 44492 33113
9684 33113 80830 97290 24923 -9607 10610 33101 19686 77936 85146 177454 191979 76619
9672 76619 -60402 -37017 32359 43737 33855 54498 78847 38860 -16371 18955 -9536 -35680
9660 -35680 -54668 -26993 12607 83165 34615 1316 2275 -920 -11411 7867 28528 27218 75448
9647 75448 48356 19576 -4014 -28715 -48974 -53447 -44948 -22321 5503 23687 -2091 14897
9635 14897 63503 65534 105785 115281 66117 13529 34550 33861 12301 25245 14615 -10188 8081
9622 8081 28249 35424 10447 40451 49175 7040 -11166 -30794 1194 -12170 -8636 -4608 -12989
9609 -12989 60850 87828 88105 47312 78284 71033 17747 26581 86775 89716 48862 7142 -19679
9596 -19679 -61977 13724 72305 30516 280 -24337 -31073 -25381 -26069 -32693 -24254 -10337 1
9583 1 -16788 -54767 -50261 -25355 -37359 -32564 -33130 -9509 -15899 -51781 -130192 -65259 30296 51024
9569 51024 20337 -11587 1417 19926 77125 136910 97363 42701 33911 39539 87049 101175
9557 101175 65804 19917 19889 21381 28794 -30310 -31230 -22951 -22506 -41322 -40815 -52925 -58447 -15040
9543 -15040 48094 56338 17018 23699 99751 129639 143152 162738 134752 94681 102848 117559
9531 117559 60426 -5467 22951 44288 77705 94777 176609 237520 186572 126068 78648 29107
9519 29107 1023 -15719 -22740 29244 32720 37723 20188 -12475 40204 39337 886 -9164 6825
9506 6825 2183 27055 20415 -14628 9025 -12478 -34100 2455 40401 13494 46527 64860
9494 64860 63829 10775 -11913 -50132 -35735 28247 45098 35286 39127 15159 436 -49889
9482 -49889 -45690 26672 85209 56057 31559 21064 2582 41594 44687 57234 39217 -16333
9470 -16333 -57881 -27581 -22030 -909 -13103 -54862 -41105 15939 25252 -1895 -27077 -27447 -66120
9457 -66120 -30242 -27204 -2047 53701 29407 2063 39398 59083 81167 35380 -19479 -43661
9445 -43661 -12291 10532 52534 47987 52102 92614 13729 -22281 -24671 -47845 -50527 -72682 -61234
9432 -61234 -91822 -92507 -98000 -77413 -98219 -104293 -34748 19081 12610 19233 -1308 -36865 -27540
9419 -27540 -40534 2510 9947 17958 40552 74632 102748 149199 104768 87341 19658 36143
9407 36143 40692 72508 119125 155811 149564 199070 240491 243056 191620 125159 127724 64665 65233
9394 65233 97012 104713 85165 16170 -35008 -52703 -8774 13632 16034 8158 33254 56002
9382 56002 150471 125932 89386 79639 91618 102904 43111 11963 46747 83022 41297 -11505
9370 -11505 15583 53044 62606 122537 194977 279650 269696 230461 220605 227914 227474 147805 113244
9357 113244 151442 121129 93039 114769 115647 84492 128183 129881 132322 36295 3540 91313
9345 91313 80242 42899 10987 63200 46583 59803 75235 100249 119998 83923 109967 136959
9333 136959 101043 138909 127942 166197 175243 197377 207006 209806 182298 94649 76113 64434
9321 64434 17990 -3561 48804 22875 44027 133748 133487 144912 181318 215317 192515 144780
9309 144780 92849 52917 30378 56956 98603 86232 102133 79560 19026 69484 116066 109600
9297 109600 74844 48435 74564 25819 65534 77531 13259 17759 24187 50566 27047 -16248
9285 -16248 -29087 -42932 -1101 13493 64902 99049 96531 124827 126595 176090 143786 81283
9273 81283 49314 77564 101971 58118 77007 61446 98727 186799 186689 214835 243030 274852
9261 274852 239236 200985 181756 180212 155147 86623 95676 149050 190007 181402 113238 118339
9249 118339 183102 203291 192724 107691 105867 168493 137561 67221 73006 129060 103652 54003
9237 54003 27786 12645 68356 102209 144089 148313 152156 168724 176217 159584 154795 154121 126339
9224 126339 127569 134330 104759 128779 165366 234367 288671 251170 214083 209436 233605 246687
9212 246687 250569 270706 233113 170086 182265 221279 298912 306728 318079 255150 237932 255403
9200 255403 293081 333963 301723 332694 377282 434781 478379 510719 499939 495590 465451 500670
9188 500670 542539 588879 604691 634547 728371 816809 980528 1049715 1119123 1222837 1336721
9177 1336721 1493338 1640868 1847224 2127299 2413621 2748636 3164678 3783444 4512999 5494277
9167 5494277 6891895 8888013 11506634 14940715 18636997 21842031 23740388 23702182 21390315
9158 21390315 17449790 13321806 10041578 7667348 5973451 4798608 3902426 3208644
9150 3208644 2739567 2416054 2043758 1788095 1541956 1325781 1194824 1043695 947120 824741
9140 824741 716560 642307 606148 581779 565990 526884 561680 557355 512862 508528 541136 554997
9128 554997 527306 487916 479830 423314 380476 371719 386155 370066 361406 333423 323565 285152
$$ [...]
##END NTUPLES=NMR SPECTRUM
##END=
