##TITLE=Analysis number 318411
Compound Code cc 34405
Book Reference 451/133
Project Code adrs
Chemist Name evam
##JCAMPDX= 6.0         $$ Bruker NMR JCAMP-DX V2.0
##DATA TYPE= NMR SPECTRUM
##DATA CLASS= NTUPLES
##ORIGIN= Bruker BioSpin GmbH
##OWNER= nmr
$$ XWIN-NMR		Version 3.5
$$ Tue Mar 28 12:35:26 2006 GMT Daylight Time (UT+1h)  MAYBRIDGE\nmr@NMR_250MHZ
##.OBSERVE FREQUENCY= 250.131544655141
##.OBSERVE NUCLEUS= ^1H
##.ACQUISITION MODE= SIMULTANEOUS (DQD)
##.ACQUISITION SCHEME= undefined
##.AVERAGES= 16
##.DIGITISER RES= 18
##SPECTROMETER/DATA SYSTEM= dpx250
##.PULSE SEQUENCE= zg30
##.SOLVENT NAME= CDCl3
##.SHIFT REFERENCE= (INTERNAL, CDCl3, 0, 16.522)
##AUDIT TRAIL= $$ (NUMBER, WHEN, WHO, WHERE, WHAT)
$$ ##TITLE= Audit trail, XWIN-NMR		Version 3.5
$$ ##JCAMPDX= 5.01
$$ ##ORIGIN= Bruker BioSpin GmbH
$$ ##OWNER= nmr
$$ C:\u/data/dgb/nmr/ADRS/1570/pdata/1/auditp.txt
$$ ##AUDIT TRAIL=  $$ (NUMBER, WHEN, WHO, WHERE, WHAT)
(   1,<2006-03-28 12:35:02.17 +100>,<MAYBRIDGE\nmr>,<NMR_250MHZ>,
      <created by zg, POWCHK disabled, PULCHK disabled
       configuration hash MD5:
       84 BC 41 DB A1 6E 1D 46 DA 25 12 A5 C1 ED C5 3A
       data hash MD5: 64K
       7F 50 FA 68 BE B2 87 46 74 D4 D6 CE E7 47 1A BC>)
(   2,<2006-03-28 12:35:16.39 +100>,<MAYBRIDGE\nmr>,<NMR_250MHZ>,
      <Start of raw data processing
       ef LB = 0.3 FT_mod = 6 PKNL = 1 SI = 32K 
       data hash MD5: 32K
       47 E4 59 85 DD B5 47 31 2B E1 9A B6 D8 11 66 89>)
(   3,<2006-03-28 12:35:17.94 +100>,<MAYBRIDGE\nmr>,<NMR_250MHZ>,
      <apk 
       data hash MD5: 32K
       E9 82 9E AA 23 B9 74 AD 76 28 4A 3F 8C E7 60 53>)
(   4,<2006-03-28 12:35:18.72 +100>,<MAYBRIDGE\nmr>,<NMR_250MHZ>,
      <abs ABSG = 5 
       data hash MD5: 32K
       2C 7B 59 5E C8 6F B1 45 4E 2D DD 8E 4C EC A3 A3>)
$$ ##END=
$$ 
$$ hash MD5
$$ 02 A1 13 59 5B 19 8A 82 9C 23 62 F4 6C DB A0 81
##$RELAX= 
##$RELAX= 
##$RELAX= 
##$RELAX= 
##$RELAX= 
##$RELAX= 
##$RELAX= 
$$ Bruker specific parameters
$$ --------------------------
##$DU= <C:\u>
##$EXPNO= 1570
##$NAME= <ADRS>
##$PROCNO= 1
##$TYPE= <nmr>
##$USER= <dgb>
##$AMP= (0..31)
100 100 100 100 100 100 100 100 100 100 100 100 100 100 100 100 100 100 
100 100 100 100 100 100 100 100 100 100 100 100 100 100 
##$AQSEQ= 0
##$AQ_mod= 3
##$AUNM= <au_zg>
##$AUTOPOS= <22 >
##$BF1= 250.13
##$BF2= 250.13
##$BF3= 250.13
##$BF4= 250.13
##$BF5= 500.13
##$BF6= 500.13
##$BF7= 500.13
##$BF8= 500.13
##$BYTORDA= 1
##$CFDGTYP= 0
##$CFRGTYP= 5
##$CHEMSTR= <none>
##$CNST= (0..31)
1 1 145 1 1 1 1 1 1 1 1 1 1 1 1 1 1 1 1 1 1 1 1 1 1 1 1 1 1 1 1 1 
##$CPDPRG= <>
##$CPDPRG1= <>
##$CPDPRG2= <>
##$CPDPRG3= <>
##$CPDPRG4= <mlev>
##$CPDPRG5= <mlev>
##$CPDPRG6= <mlev>
##$CPDPRG7= <mlev>
##$CPDPRG8= <mlev>
##$CPDPRGB= <>
##$CPDPRGT= <>
##$D= (0..31)
0 1 0 0 0 0 0 0 0 0.06 0 0 0 0 0 0 0.0002 0 0 0 0 0 0 0 0 0 0 0 0 0 0 
0 
##$DATE= 1143545700
##$DBL= (0..7)
120 120 120 120 120 120 120 120 
##$DBP= (0..7)
150 150 150 150 150 150 150 150 
##$DBP07= 0
##$DBPNAM0= <>
##$DBPNAM1= <>
$$ [...]
##$SUBNAM7= <"">
##$SUBNAM8= <"">
##$SUBNAM9= <"">
##$SW= 20.6930455092707
##$SWIBOX= (0..15)
0 0 3 0 0 0 0 0 0 0 0 0 0 0 0 0 
##$SW_h= 5175.983436853
##$TD= 65536
##$TD0= 1
##$TE= 294.16
##$TE2= 300
##$TE3= 300
##$TEG= 300
##$TL= (0..7)
0 120 120 120 120 120 120 120 
##$TP= (0..7)
150 150 150 150 150 150 150 150 
##$TP07= 0
##$TPNAME0= <>
##$TPNAME1= <>
##$TPNAME2= <>
##$TPNAME3= <>
##$TPNAME4= <>
##$TPNAME5= <>
##$TPNAME6= <>
##$TPNAME7= <>
##$TPOAL= (0..7)
0.5 0.5 0.5 0.5 0.5 0.5 0.5 0.5 
##$TPOFFS= (0..7)
0 0 0 0 0 0 0 0 
##$TUNHIN= 0
##$TUNHOUT= 0
##$TUNXOUT= 0
##$USERA1= <user>
##$USERA2= <user>
##$USERA3= <user>
##$USERA4= <user>
##$USERA5= <user>
##$V9= 5
##$VALIST= <valist>
##$VCLIST= <CCCCCCCCCCCCCCC>
##$VD= 0
##$VDLIST= <DDDDDDDDDDDDDDD>
##$VPLIST= <PPPPPPPPPPPPPPP>
##$VTLIST= <TTTTTTTTTTTTTTT>
##$WBST= 1024
##$WBSW= 4
##$XGAIN= (0..3)
0 0 0 0 
##$XL= 0
##$YL= 0
##$YMAX_a= 285452
##$YMIN_a= -379504
##$ZGOPTNS= <>
##$ZL1= 120
##$ZL2= 120
##$ZL3= 120
##$ZL4= 120
##$ABSF1= 16.522
##$ABSF2= -4.171173
##$ABSG= 5
##$ABSL= 3
##$ALPHA= 0
##$AQORDER= 0
##$ASSFAC= 0
##$ASSFACI= 0
##$ASSFACX= 0
##$ASSWID= 0
##$AUNMP= <proc_1d>
##$AZFE= 0.1
##$AZFW= 0.1
##$BCFW= 0
##$BC_mod= 0
##$BYTORDP= 0
##$COROFFS= 0
##$CY= 12.5
##$DATMOD= 1
##$DC= 0
##$DFILT= <>
##$DTYPP= 0
##$F1P= 14.0000005364418
##$F2P= -0.99999901652339
##$FCOR= 0.5
##$FTSIZE= 32768
##$FT_mod= 6
##$GAMMA= 0
##$GB= 0
##$INTBC= 1
##$INTSCL= 1
##$ISEN= 128
##$LB= 0.3
##$LEV0= 0
##$LPBIN= 0
##$MAXI= 10000
##$MC2= 0
##$MEAN= 0
##$ME_mod= 0
##$MI= 0
##$NCOEF= 0
##$NC_proc= -3
##$NLEV= 6
##$NOISF1= 0
##$NOISF2= 0
##$NSP= 0
##$NTH_PI= 0
##$NZP= 0
##$OFFSET= 16.522
##$PC= 1
##$PHC0= 172.978
##$PHC1= 10.85905
##$PH_mod= 1
##$PKNL= yes
##$PPARMOD= 0
##$PSCAL= 4
##$PSIGN= 0
##$REVERSE= no
##$SF= 250.13
##$SI= 32768
##$SIGF1= 0
##$SIGF2= 0
##$SINO= 400
##$SIOLD= 32768
##$SREGLST= <1H.CDCl3>
##$SSB= 0
##$STSI= 32768
##$STSR= 0
##$SW_p= 5175.98343685301
##$SYMM= 0
##$S_DEV= 0
##$TDeff= 65536
##$TDoff= 0
##$TI= <Analysis number 999999
Compound Code 99
Book Reference 9
Project Code 9>
##$TILT= no
##$TM1= 0
##$TM2= 0
##$TOPLEV= 0
##$USERP1= <user>
##$USERP2= <user>
##$USERP3= <user>
##$USERP4= <user>
##$USERP5= <user>
##$WDW= 1
##$XDIM= 32768
##$YMAX_p= 279127551
##$YMIN_p= -231721
$$ End of Bruker specific parameters
$$ ---------------------------------
##NTUPLES= NMR SPECTRUM
##VAR_NAME=  FREQUENCY,     SPECTRUM/REAL,   SPECTRUM/IMAG
##SYMBOL=    X,             R,               I
##VAR_TYPE=  INDEPENDENT,   DEPENDENT,       DEPENDENT
##VAR_FORM=  AFFN,          ASDF,            ASDF
##VAR_DIM=   32768,         32768,           32768
##UNITS=     HZ,            ARBITRARY UNITS, ARBITRARY UNITS
##FACTOR=    0.157963299565203, 1,           1
##FIRST=     4132.6476996994, 0,             0
##LAST=      -1043.33573715361, 0,           0
##MIN=       -1043.33573715361, -231721,     0
##MAX=       4132.6476996994, 279127551,     0
$$ Real data points
##PAGE= N=1
##DATA TABLE= (X++(R..R)), XYDATA
$$ [...]
19190A151448l3963q9492j05072j6179J46o055N1867k941j7600o0158N934J5833
19178H93768j5868m1611m0083p0792J299l9076o1345n8097r857J0802L445j263
19166E71322k402o542r46n8107m7135k0835M7885M2175p2798l6128K6543N352
19154D48384K0022O3613K0793O651p7629o8300j1709j2730n496m947o4419q3138
19142B31095n530m2904K8222N7042Q871q181L1487M6844K2089n8843j7955J6097
19130C08334K857k835j4253k04j9860l9084k0416j0056M7918j2939L0022j8921
19118B50563m312M799O1854m4619l3833q205J8956p084p6760l9626K6235Q072
19106A56040M619K0357Q2666p8331n4983O7285j2528j9869K1755J277J7538o253
$$ plain form
19190 1151448 1117485 1027993 922921 906742 906888 900833 952700 949759 932159 872001 877935 893768
19178 893768 877900 836289 796206 725414 726713 687637 626292 568195 558338 569140 572585 571322
19166 571322 568920 562378 561432 503325 456190 435355 483240 525415 452617 416489 443032 448384
19154 448384 468406 532019 552812 559463 481834 413534 401825 389095 383599 378652 314233 231095
19142 231095 225565 182661 210883 267925 276796 268615 300102 346946 369035 310192 292237 308334
19130 308334 311191 308356 294103 293899 274039 234955 214539 204483 252401 239462 269484 250563
19118 250563 246251 251050 312904 268285 234452 226247 245203 238119 161359 121733 147968 156040
19106 156040 160659 181016 263682 185351 130368 197653 185125 165256 187011 188288 205826 199573
19094A99573k5215k8076l5212k5059J7144k4898m2871P3555L6994j0277j8855
19083A16803l2830l4651K8614N2350m4646m2458K7553l1044k2876r66K7586J4547
19071E7982Q787k6811n448j2996j3974Q2580N4068K0357N2249M729n2918n3316
19059A15289J4119K1154p4208m6337J3411k0512p68J5651O811N4139P3877N2982
19047B25608k3663n4226K8060J3685j677n6651l1450j2609K9349M0487J5545j764
19035A70694j5907k0618M632k4128k9640K0592R71k3852k7452J4216k24J6715
19023H5999R7215O0402k0966k9690k0961q552k578K7477L852L8572K2334N4441
19011C07545j4546m9892K5461P4146J8487n4581p2340j0492l4892k3479K1143
$$ plain form
19094 199573 174358 146282 111070 86011 103155 78257 35386 108941 145935 135658 116803
19083 116803 83973 49322 77936 130286 85640 43182 70735 39691 16815 15849 43435 57982
19071 57982 66769 39958 34510 21514 7540 90120 144188 164545 216794 221523 168605 115289
19059 115289 129408 150562 76354 30017 43428 22916 22148 37799 44610 98749 172626 225608
19047 225608 201945 147719 175779 189464 187787 131136 99686 87077 116426 156913 172458 170694
19035 170694 154787 134169 138801 114673 85033 105625 106596 82744 55292 69508 69284 85999
19023 85999 183214 243616 222650 192960 171999 163447 160869 188346 192198 230770 253104 307545
19011 307545 292999 243107 268568 342714 361201 306620 234280 223788 188896 165417 186560
19000A86560N9568n472K7860L1496J1620N4174R836j9506r623L3478L0057j1194
18988C98854K8867O6097L3942j6522K7980J71402O8746n1707L512R4651O3089
18977H88911N3957N7296P5892k1528J8448J07226J96517K70601K32805K37588
18967B117713K92899K76551J79391J41326J49064K19387L09311N00931Q10655
18958D997228J286384J895187K503685K913378K944288K103907P29594o76292
18950A8697359j422964q35418P93521K987727N860223J0008215J5311505J8763958
18942G0164126J6731648R411075o38142q994678j2067483j2757748j2985099j1111062
18934C7752637p384595l857885j061012J302194K599867K097327q1374l001419
$$ plain form
19000 186560 246128 240656 268516 300012 311632 365806 375642 356136 346513 379991 410048 398854
18988 398854 427721 493818 527760 511238 539218 710620 779366 727659 731171 825822 888911
18977 888911 942868 1000164 1076056 1054528 1072976 1180202 1376719 1647320 1880125 2117713
18967 2117713 2410612 2687163 2866554 3007880 3156944 3376331 3685642 4186573 4997228
18958 4997228 6283612 8178799 10682484 13595862 16540150 18644057 19373651 18697359
18950 18697359 17274395 16438977 17232498 20220225 26080448 36088663 51400168 70164126
18942 70164126 86895774 96306849 95668707 86674029 74606546 61848798 48863699 37752637
18934 37752637 30368042 26510157 25449145 26751339 29351206 31448533 31367159 28365740
18926B8365740n061115n138453l929294k686966j770278j167991p94836n13260
18918G303547l83756k37144j51852o0521K6055R0721L9944L2285J35005J67380
18908F961664L91976P34181J159865J484908J678318J926775K343811L224383
18900A9905881M075964L750041J930268o54455k733711k885034r75302J838546
18892B4252198M857692P596468Q784012Q514431P885411O505158L391378k015988
18884F9770760r306237j4153264j2940189q875432n441602l220794j698876o26052
18876A3508314J36041K96822j27482r87311j675146j857244j511125j036228o42589
18867F104052k75728K4246N9266k6483r1896j70198k63806l66872n15647n30265
$$ plain form
18926 28365740 23304625 18166172 14236878 11549912 9779634 8611643 7816807 7303547
18918 7303547 6919791 6682647 6530795 6470274 6496329 6587050 6626994 6659279 6794284 6961664
18908 6961664 7353640 8087821 9247686 10732594 12410912 14337687 16681498 19905881
18900 19905881 23981845 27731886 29662154 29007699 26273988 23388954 22413652 24252198
18892 24252198 29109890 36706358 45490370 54004801 61890212 68395370 71786748 69770760
18884 69770760 60464523 46311259 33371070 24495638 19054036 15833242 14134366 13508314
18876 13508314 13644355 13941177 13813695 12826384 11151238 9293994 7782869 6746641 6104052
18867 6104052 5828324 5852570 5911836 5885353 5793457 5623259 5359453 4992581 4476934 3946669
18857C946669l32217q3138J05386L05817M07470L41303K76208J61756L2441k15503
18847D946192m59283o79858o27442l93981k51315k04929j34012j34026k7785n8073
18837A975488n1452o7504q0063j50390j65141o0068l4730j7033n8425N615O9546
18826A365843L4890M4574O6315J00180P4538J2455n4721j29062m5764J9543Q7404
18815A576195K20842J45496J73852J94252J16574J21151R5321n0438k11945k71084
18805B110216j92587j11032j48122r3092R751M0213R8507J34476M1081m0973q0327
18794A768111j14655q0577j27978j11033j22359r6301p5417n337M4342n1562K721
18783A029955L730l0630o6552o7439j0814l1573r3368o0610m1859J6022R0055
$$ plain form
18857 3946669 3614452 3531314 3636700 3942517 4349987 4691290 4967498 5129254 5161695 4946192
18847 4946192 4486909 3807051 3179609 2785628 2534313 2329384 2195372 2061346 2033561 1975488
18837 1975488 1924036 1856532 1776469 1626079 1460938 1400870 1366140 1349107 1290682 1296297 1365843
18826 1365843 1400733 1445307 1511622 1611802 1686340 1698795 1644074 1515012 1469248 1488791 1576195
18815 1576195 1797037 1942533 2116385 2310637 2427211 2548362 2643683 2593245 2381300 2110216
18805 2110216 1917629 1806597 1658475 1565383 1575134 1615347 1713854 1848330 1889411 1848438 1768111
18794 1768111 1653456 1572879 1444901 1333868 1211509 1115208 1039791 1034454 1078796 1027234 1029955
18783 1029955 1033685 1003055 936503 869064 858250 826677 733309 672699 630840 646862 736917
18772G36917P9009M6160P730L41p4726k1891O8145J54637J58557P0086O7419j05799
18760A186585j90199j05617o9962n4053n812r469J387k9546O701K6337M2238L154
18748H01744n4485p9682m6238l5353M3635j9706j1630l0546m2878j9845N8956
18737E63972J8215m3687o9938n9280m4165J02621J1399o4758p1747n0190p075
18726B85367m4252j6737J9467L0979J2057m8954K59M819l2694J0092o088m3232
18714A71083J2115K4172R4307O911p3178n8789l4050J6666P78j5915l0722J3630
18702A27008K1382L6563O9625M7368m0592p4661j7024K6891o1693p5735P321M0933
18690A07386J30984N7900L214J362J9205J4716l1017o943l5215M4682L1789m4860
$$ plain form
18772 736917 815926 862086 869816 870157 795431 773540 841685 996322 1154879 1224965 1292384 1186585
18760 1186585 996386 890769 820807 766754 760942 751473 752860 723314 730015 756352 798590 801744
18748 801744 747259 667577 621339 585986 629621 609915 598285 567739 524861 505016 563972
18737 563972 582187 538500 468562 409282 365117 467738 479137 414379 342632 292442 285367
18726 285367 241115 224378 243845 274824 286881 237927 238186 243005 210311 220403 214315 171083
18714 171083 183198 207370 301677 308588 235410 176621 142571 159237 160015 144100 113378 127008
18702 127008 148390 184953 254578 301946 261354 186693 169669 196560 134867 59132 66453 107386
18690 107386 238370 296270 299484 300846 320051 334767 303750 296807 261592 306274 338063 293203
18678B93203p6136L6139L0665N645O964K1812N537p6956j19191p7806L4128J90292
18666B74296P7822n872J4560m1291r9611j4888L8440L8491p2639j1289j041R311
18654B06289M0458L2510m2469m6619J477J8480O1275L4076K6176j8879K9343O5294
18642D07411k7241m4774l6945j9018K1561J7743k6637n3465Q7176P4877L1823
18631D32511M2129K3915j3608J735o975O081O3651M2775J7149o598l3604k5425
18619E43736J5454L7114J4209J8768r299R8393Q4659O7790L5311N299P2684P9910
18607A064028k9509k5635k3512n4317L971J09257P0092p6720l0330K3297L3168
18596A063790J21993J04613J34151J22303J90359K05273L52119M53196M59880
$$ plain form
18678 293203 217067 253206 283871 289516 296480 318292 323829 246873 127682 49876 84004 274296
18666 274296 352118 346246 360806 319515 219904 205016 243456 281947 209308 198019 196978 206289
18654 206289 246747 279257 236788 190169 191646 210126 271401 305477 331653 312774 342117 407411
18642 407411 380170 335396 298451 279433 300994 318737 292100 238635 325811 400688 432511
18631 432511 474640 498555 484947 486682 479707 485788 549439 592214 609363 602765 569161 543736
18619 543736 559190 596304 610513 629281 619982 718375 803034 870824 906135 911434 984118 1064028
18607 1064028 1034519 1008884 985372 931055 935026 1044283 1114375 1037655 1007325 1030622 1063790
18596 1063790 1185783 1290396 1424547 1546850 1737209 1942482 2294601 2747797 3207677
18587C207677M57710L16513J20317J72758K53069K11669J11616O4578K32188O44317
18577E792412J176987J791596K619375M030260O438021Q640174Q511689N762489
18569D4763003K005116J4035P56541J014067j302248m828116n793081k374480
18561C4254837K769343N664629N077031K148612o74555q17814l2348j436003n224683
18552D1729049q744239q858707o321243l810877k253392j438743j084024r41005
18544H276819q02469n60123m87607n78662n63016m51605k56370k365J17123P837
18534D699562k14436j77872j72963j55228j87706l90684n52413m32110l48629
18525B067521k55139r2919p3783j12592j38560j02043p2401J839o0465l985J3771
$$ plain form
18587 3207677 3665387 3981900 4102217 4274975 4528044 4739713 4851329 4915907 5148095 5792412
18577 5792412 6969399 8760995 11380370 15410630 21848651 30488825 39000514 44763003
18569 44763003 46768119 46782154 47538695 48552762 47250514 42422398 36629317 34254837
18561 34254837 37024180 42688809 47765840 49914452 49239897 48422083 48389735 46953732 41729049
18552 41729049 32984810 24126103 17804860 13993983 11740591 10301848 9217824 8276819
18544 8276819 7474350 6914227 6426620 5847958 5284942 4833337 4576967 4574602 4691725 4699562
18534 4699562 4485126 4307254 4134291 3979063 3791357 3400673 2848260 2416150 2067521
18525 2067521 1812382 1719463 1645680 1533088 1394528 1292485 1220084 1221923 1161458 1157473 1171244
18514A171244l3619q9084o3885m9585l4547n7594j12546n4131j8841j8455j5907
18503F23050Q8l4834p034m3785O026k5981l2341m8344k7814N5871N2368m5582
18491D71688M682k2201p3253q3565j5523K0459k2588r236L4280L1349J662J6462
18479C54216j7261l0889k5435m731l7170j804N3691k7964l072L2063k4519n455
18467B61670K343l7390o6066o0298J5002N1101l6871L2808O1737j0827l4303Q431
18455A87337L275O0185J7558R789p865o5233j6114P0526M6264l7984L4316k636
18443B99418k6544m9322k1678J3020M0764L4842k0903J2993O504M976O9509L9283
18431D02862P5702k4385m4748l3354P8832P0699l0686o863J4118M9742J9075L7549
$$ plain form
18514 1171244 1137625 1048541 984656 935071 900524 842930 730384 676253 657412 638957 623050
18503 623050 623138 588304 581270 537485 543511 517530 485189 436845 409031 464902 517270 471688
18491 471688 476370 454169 380916 297351 281828 302287 279699 270463 304743 336092 337754 354216
18479 354216 336955 306066 280631 275900 238730 236926 290617 262653 259581 291644 267125 261670
18467 261670 264013 226623 160557 100259 115261 166362 129491 162299 224036 213209 178906 187337
18455 187337 190612 250797 268355 278144 270279 205046 188932 259458 305722 267738 302054 299418
18443 299418 272874 223552 201874 214894 255658 290500 269597 282590 289094 294070 363579 402862
18431 402862 478564 454179 409431 376077 454909 525608 494922 488059 502177 551919 570994 608543
18419F08543o4091p9407o2851n0099j4079m3719m275o463m8906N197N20K3744
18407B64114k9640l4786R953J0033K442m0543o4364l354L2786N3759M594m0902
18395A64092j05m5357K3037N5268N9878n2714k6097M1369J11848r375l6600k5411
18383B59833j3843J1626L3705N1020q083Q595l0897L1031J6659j1540l8170m3753
18371B66183m1080m625O5565K5520m2982n047j1028N350L5929j8161l6479k8369
18359B10776l6303l1075J6514m1091r3244O849Q3572L0727M7213P8045p9829q9441
18347A02713k5282J1415j0273L6128M2952K7433r076l1842k5756L5742k6831l4980
18335I2343J9681q894J0980J0877L2696m9550m9062N7510M065o6953k9875k7798
$$ plain form
18419 608543 544452 465045 402194 352095 338016 294297 290022 283559 234653 239850 240370 264114
18407 264114 234474 199688 209641 219674 222116 181573 117209 113855 146641 200400 204994 164092
18395 164092 163987 118630 141667 196935 256813 204099 178002 219371 331219 321844 285244 259833
18383 259833 245990 257616 291321 342341 334258 342853 311956 342987 359646 348106 309936 266183
18371 266183 225103 220478 286043 311563 268581 263534 252506 257856 293785 275624 239145 210776
18359 210776 174473 143398 159912 118821 25577 32426 115998 146725 193938 271983 192154 102713
18347 102713 77431 88846 78573 114701 157653 185086 176010 144168 118412 154154 127323 92343
18335 92343 112024 103130 114110 124987 157683 108133 59071 116581 120646 53693 23818 -3980
18323c980k4059j2238l51M5387K1540P3396r250M685L4682n3j8443J353k9864
18310H2805l5782k9961j6281L1587M1808N9704M296n3381J6514O9340j0977o671
18298A53001K2424N6202J2972o3928n0068n328m6264m3563K7308L0766J3885O8594
18286A76001K2397o6871L677Q6545J2582m9879j04078L212P497J5415L2272l84
18274A38386j6812m2352L2601Q908L4209M1885L4240L135j4430l4715m5852n8922
18262H0281R052Q4601K3726r556L1233L3459L4842K6245j12549q8831J1354L7143
18250A61000M020K8508n3281l2885j02912l585J812n2623J1038R2103P9713j1117
18238A21791r75k55L001K219p5365k8668M3287K2854q566J376j9399m1660j5590
$$ plain form
18323 -3980 -28039 -40277 -40628 4759 26299 99695 90445 95130 129812 129759 111316 112669 82805
18310 82805 47023 17062 781 32368 74176 133880 138176 84795 101309 170649 159672 153001
18298 153001 175425 231627 244599 180671 130603 125275 79011 35448 62756 93522 107407 176001
18286 176001 198398 131527 135204 221749 234331 184452 80374 83586 91083 106498 138770 138386
18274 138386 121574 79222 111823 120731 154940 196825 231065 234200 219770 185055 139203 80281
18262 80281 89333 173934 197660 188104 219337 252796 287638 313883 201334 112503 123857 161000
18250 161000 165020 193528 140247 107362 4450 865 2677 -49946 -38908 53195 132908 121791
18238 121791 120816 120561 123562 125781 50416 21748 65035 87889 79323 80699 61300 19640 4050
18225D050p3304l1859O5297Q8217L3981j1686J3871J2888k9735k0588j1251M364
18213D4245K7860M2533R122j878O9727j9373k2776q223J5734M5654m0968q0667
18201H0990M9410L0608q1293m8599N4078K6541J9277R772K6441j1557L1994J3928
18189B01590l1403j1620l6084p6623K916k3282J0139K4334L2381M0350J5611n5593
18177I2716l8165k449K0126L395J2629K7193n1092M8037K6671j6771p849l871
18165A10570J9280l8069o568L8903J1608L5252Q878L8500j9470j1286j1083L3764
18153B10279l9796j5187R486n1016l5044L1405J3243L4120N7332J425K5201M0885
18141B82333L422J4038J3435k0959j2170M3840O6689O0837K8217q518j1738P5125
$$ plain form
18225 4050 -69254 -101113 -35816 52401 86382 74696 88567 101455 71720 51132 39881 44245
18213 44245 72105 114638 123760 121882 191609 172236 149460 141237 156971 202625 161657 80990
18201 80990 130400 161008 79715 31116 85194 111735 131012 140784 167225 155668 187662 201590
18189 201590 170187 158567 122483 45860 48776 25494 35633 59967 92348 132698 148309 92716
18177 92716 54551 52102 72228 75623 88252 115445 64353 112390 139061 122290 114441 110570
18165 110570 129850 91781 85213 124116 135724 170976 179854 218354 198884 187598 176515 210279
18153 210279 170483 155296 164782 113766 78722 110127 123370 157490 214822 216247 241448 282333
18141 282333 285755 299793 313228 292269 280099 323939 390628 451465 479682 471164 459426 534551
18129E34551J05220J18094J26074J04378k5449L7871J15680J18687P6478J41604
18119A453188J98715K05812K96322M19042N82484O99505R81103J460575K230223
18110H526969L683079O728237J2128743K2212621K8880728J7894890L058633k0255225
18102H2858675l0043837j8824211j0637514o229687l721717k598184j918823j345610
18094G539092j038578q72472p50485n68989m04906l71472l73387l01426k60512
18085B596865k20465j90561j77811j86838j40066r4945r6773o5650p3785p2315
18075A277656j07566o9215o8549n868j7349n1275r0283p5333j6707m8722M843
18064G31632k5969J5166j0349n9230J1007k5153o3310O765k2918J3717p195r3066
$$ plain form
18129 534551 639771 757865 883939 988317 962868 1000739 1116419 1235106 1311584 1453188
18119 1453188 1651903 1857715 2154037 2573079 3155563 3855068 4836171 6296746 8526969
18110 8526969 12210048 18938285 31067028 53279649 82160377 100055267 103113900 82858675
18102 82858675 52814838 33990627 23353113 17123426 13401709 10803525 8884702 7539092
18094 7539092 6500514 5628042 4877557 4308568 3903662 3532190 3158803 2857377 2596865
18085 2596865 2376400 2185839 2008028 1821190 1681124 1586179 1489406 1423756 1349971 1277656
18075 1277656 1170090 1100875 1032326 1026458 1009109 957834 867551 792218 775511 726789 731632
18064 731632 705663 720829 710480 651250 662257 637104 573794 580559 557641 571358 564163 471097
18052D71097q557M5159K2767m089k7290j172K1371q4166O178Q0540M0754k5647
18040E36945k3880o3180q2795p8445k8712Q5249O5469r54J6955j5997n1887J8120
18028C76888j2109k1198o737o672L8231n146m3356l7235k2164J8322O3523J6857
18016C59204k1786o6873m3272L1639J1762J9799K6303M57J6478P3087M6541J2926
18004D66265P3943J0881N840K52k0384j8291k5668l8086l0413l2065m0215J0452
17992C62511j0608l7233j1907M4059J229n8670L6085l9068k6256L0650P2308l115
17980C59985K2046L2822P6166O1282J2925n4081o9539j19893j35631M9912O6682
17969C02676p6605j2402Q35M7743N8395l398j4791l5950J4675q0453r5642r17
$$ plain form
18052 471097 462540 507699 530466 526377 499087 497915 519286 435120 441298 521838 562592 536945
18040 536945 513065 449885 367090 288645 259933 345182 410651 409697 426652 410655 358768 376888
18028 376888 364779 343581 336844 330172 368403 363257 319901 282666 260502 278824 342347 359204
18016 359204 337418 270545 227273 258912 270674 290473 316776 317233 333711 406798 453339 466265
18004 466265 540208 551089 556929 557181 536797 518506 492838 454752 424339 392274 352059 362511
17992 362511 351903 314670 302763 346822 348051 289381 325466 286398 260142 290792 363100 359985
17980 359985 382031 414853 491019 552301 565226 511145 441606 321713 186082 235994 302676
17969 302676 226071 213669 214504 262247 320642 317244 302453 266503 281178 200725 105083 104166
17957A04166M0927L5833j2724J507J5749p1787n1801J2263J3706k1098j933P0984
17945A35792k9969k2106j8535M3207M5341j6356K9207K924p8911n2131j0327K0228
17933D8364r890J1517J2751L2330m74M8079N6514L7066M9261K6053O1104O5371
17921D38046m338r868j5340k3735j08386m2823m439N087L2333O1283K3623o864
17909C44579L1732M5636K8637o3256l3532l2141p2853J1691R81m0581m1528n1021
17897A28344K9149M9008k212k1190k4383j5347k7542M93l6020j4771N7034k506
17885A20057j2033n7393r312K2310J5163M6454N718n8163n1344l6944J5491N0242
17873E0246P890J4581K2248n342P465o219k0720o5757K8207L7537M152J8013O170
$$ plain form
17957 104166 145093 180926 168202 169709 185458 113671 61870 74133 87839 66741 64808 135792
17945 135792 105823 83717 65182 108389 153730 137374 166581 169505 90594 38463 28136 48364
17933 48364 38474 49991 62742 95072 94598 142677 199191 236257 285518 311571 372675 438046
17921 438046 433708 423840 408500 384765 276379 233556 229117 234204 266537 327820 351443 344579
17909 344579 376311 421947 450584 387328 353796 321655 248802 260493 261474 220893 179365 128344
17897 128344 157493 206501 204289 183099 158716 143369 115827 116320 80300 65529 122563 120057
17885 120057 108024 50631 41319 63629 78792 125246 130964 72801 21457 -15487 4 50246
17873 50246 58136 72717 94965 89623 97088 90869 70149 4392 32599 70136 74288 92301 98471
17860I8471l37k8709p1689k6481P8325O4762L8669K728m1128p0342L1044P3428
17848A48741M297o6438n2524k0318o4648O293O6151P166J6017l0809l1609p7989
17836i5670K3853P4315M3618M7896K6605m6125j1509j1142l8044j9532j3062l9719
17824e8516M7981J5438L2287j63j9800j1110J0944K8707K4036n6845m5245r90
17812c3276Q1920q273o752M7550j5729J5534n557o2832n0190N8270M9406k2255
17800D7816R396k357j0437M651O7693P0132k9915p4274q2008k3067J1098M0031
17788B8759O2957K4355o2265k5191N1562l693l7656l8642j914J5526n02N4517
17776F7813j1549n2103K1090P0531L2004l8786o3511l4511L6174n091l6538L027
$$ plain form
17860 98471 98134 69425 -2264 -28745 49580 114342 153011 155739 114611 44269 75313 148741
17848 148741 153038 86600 34076 13758 -50890 -44597 21554 28720 44737 13928 -17681 -95670
17836 -95670 -71817 2498 46116 94012 120617 74492 62983 51841 13797 -5735 -18797 -58516
17824 -58516 -10535 4903 37190 37027 17227 6117 17061 45768 69804 12959 -32286 -33276
17812 -33276 48644 40371 33619 81169 65440 80974 75417 12585 -37605 20665 70071 47816
17800 47816 57212 54855 44418 49069 116762 186894 156979 82705 697 -22370 -11272 28759
17788 28759 91716 116071 53806 28615 80177 76484 38828 186 -1728 13798 13296 67813
17776 67813 56264 4161 25251 95782 127786 89000 25489 -9022 27152 22061 -14477 -11450
17764a1450K3734k5633K7715q554L6507j0727J2464j6796L298r1014K2343L8868
17752G55N2046l7711O46Q4885j3197l8371L2202n448R812j1296k3701l1431J6173
17739C5364P326l6215L1383K06O1443K1993p2642l7865n979l5320L1795M2303
17727D3792k1619o209P915L598K8398l8280J6380K4969l5345K338M5725P296J8697
17714I7655o148N4181N3912m1884q2558r9226j5549P5396N4601M0840k9778n6099
17702D5343j8122L272J5352J4428o037m622J544p6998M3086O9219k2435j3890
17690E0140N0563k563m2912n5232l145K2230j8989j4271k3465q4254k635O6910
17678e7623O9107N644K8055p335J3230Q78J746l8441l4098j4673K3734J7338m5395
$$ plain form
17764 -11450 12284 -13349 14366 5812 42319 31592 44056 27260 30558 -60456 -38113 755
17752 755 52801 15090 15736 100621 87424 49053 81255 75807 85619 74323 50622 19191 35364
17739 35364 42690 6475 37858 38064 99507 121500 48858 10993 5014 -30306 1489 43792
17727 43792 22173 15964 23879 27477 55875 17595 33975 58944 23599 25937 71662 78958 97655
17714 97655 91507 145688 199600 157716 75158 -24068 -39617 35779 90380 131220 101442 45343
17702 45343 27221 30493 45845 60273 54236 49614 51158 -25840 17246 86465 64030 50140
17690 50140 100703 98140 55228 -4 -3149 19081 92 -14179 -37644 -121898 -124533 -57623
17678 -57623 11484 17128 45183 37848 51078 51956 53702 15261 -18837 -33510 -9776 7562 -37833
17665c7833k5060L2315m3008m2550N8576N0522n6398K4705M6023R963n3816o1301
17653i7862N3562P7227K8037k5205n7094k5820J450N3327L4731L4384j830m0622
17641C4285r184m1791l0524r69O7779O215o6043j9899K5190J647m0218L3451N499
17628c4562o4629K9522O3433J2441K4212o3620n4872k372M6007O2164J422p0730
17616e1584n7976q273O709n223O7741J9096k9735L0781K7942M4919P357n350O7505
17603A13909L0343l4760l0713J5541q260L3014l9538q859L801l2050K0026J8100
17591H0554k1074m6633j8220o8983m5381l2120J06849J60483K899o704J74p1287
17579D0557j4068k624n4831n3651k4975J9046J2636N9055J0646n8551R205M5765
$$ plain form
17665 -37833 -62893 -30578 -73586 -116136 -57560 -7038 -63436 -38731 7292 17255 -36561 -97862
17653 -97862 -44300 32927 60964 35759 -21335 -47155 -45705 7622 42353 76737 74907 34285
17641 34285 25101 -16690 -47214 -48183 19596 25811 -40232 -60131 -34941 -33294 -73512 -40061 -34562
17628 -34562 -99191 -69669 -6236 6205 30417 -33203 -88075 -90447 -44440 17724 19146 -51584
17616 -51584 -109560 -117833 -111124 -116347 -48606 -29510 -59245 -28464 -522 44397 51754 46404 113909
17603 113909 144252 109492 78779 94320 86060 119074 79536 70677 74478 42428 62454 80554
17591 80554 59480 12847 -5373 -74356 -119737 -151857 -45008 115475 118374 111670 111844 40557
17579 40557 26489 23865 -30966 -84617 -109592 -90546 -77910 -18855 -8209 -66760 -57555 -11790
17567a1790j0543K0557k6117K474P1640L9367o9659o6938j652j7855Q880J3726
17555d7910K877K1644L0677j95q130q318K4983P795L756J3262J2363M0196l2032
17542F0968k1088n141O826J2772R784J32004J2896m5875j0864k2310m0282m3439
17530D6251m953L1519J8139N1334M3876K8582k2645n9710o0632L1071J13897Q1845
17518B98574K5470J3241k1255m764R856l3343l2515m1002k4850N6069J72307O0659
17506D78447k9229K4707J1111J2479j6007M0694n6449L1801Q5574J45881J83268
17495I12277L34614M44279M23388L19126K17061L0676j4016j1763p0309k09877
17485B375456l56149l42961j48139r1900N964N1138J01471O0397O9558M0179N2791
$$ plain form
17567 -11790 -22333 -1776 -27893 -25419 46221 85588 15929 -51009 -52661 -70516 -61636 -47910
17555 -47910 -45033 -23389 7288 7093 -1037 -9355 15628 23423 27179 40441 52804 93000 60968
17542 60968 39880 34739 41565 54337 64121 196125 209021 163146 152282 129972 89690 46251
17530 46251 41298 72817 90956 142290 186166 214748 192103 132393 71761 102832 216729 298574
17518 298574 324044 337285 316030 311266 321122 287779 255264 214262 189412 245481 417788 478447
17506 478447 449218 473925 485036 497515 481508 522202 465753 497554 583128 729009 912277
17495 912277 1246891 1691170 2114558 2433684 2650745 2681421 2667405 2655642 2585333 2375456
17485 2375456 2019307 1676346 1528207 1436307 1442271 1493409 1594880 1655277 1724835 1765014 1817805
17474A817805J19554K69764M73941M53754L09203J76961J72611J94424K75269
17465D263286K21366J59631O5309K35667N93035J167459J993850L448748N706554
17456A7854905Q082616Q457062O100572K440646k41641J41344Q30694j181188
17448D2485010n165222q454634p924788n298844l216668j842280j033877n01464
17440I047233K5695L96497J026172J967486L658907O321970Q852808Q793108N953786
17431D6043662J813319o78830J12767M91920k185724o673879r561441q442931
17423B0918863n678531l451406k229110j556958j158149r23367p40942o05564
17415D574836m74636l77408k44220k89544l28280j87333j18551j00851m8037O8
$$ plain form
17474 1817805 1937359 2207123 2681064 3134818 3444021 3620982 3793593 3988017 4263286
17465 4263286 4484652 4644283 4709592 4945259 5538294 6705753 8699603 12148351 17854905
17456 17854905 25937521 34394583 40495155 42935801 42694160 42835504 43666198 42485010
17448 42485010 37319788 28865154 20940366 15641522 12424854 10582574 9548697 9047233
17440 9047233 9072928 9469425 10495597 12463083 16121990 22443960 31296768 40089876 46043662
17431 46043662 47856981 47178151 47290918 47782838 45597114 38923235 29361794 20918863
17423 20918863 15240332 11788926 9559816 8002858 6844709 5921342 5180400 4574836
17415 4574836 4100200 3722792 3478572 3189028 2860748 2673415 2554864 2454013 2405976 2406044
17405B406044j4471J03755J88640K54675L08891J28722j00104l1730m88m7307
17395C196627j80525m07743m49194l96128l55186k35007m8433k4861n7765n5152
17385I86633j9420M3301J38668K75321K95498L62864L26842J54345l5081m0373
17375B488598P8958K6242j91889l18393k84903j53708N8187R5954l794j62044
17365A633208k72204k72561j92613j92593q9148l3317k0539r7419l3614o4986
17355C64214J2138k5336L139L8004Q7282J1093P7341J71674K48162L08498J73151
17344A469360j54695k73339k57977k39813r9420k6441r9472j0247N0047J6827
17334C74830j8443k6036p8513m7941J2606m4258N9990r933n3679M5945M314k0700
$$ plain form
17405 2406044 2391573 2495328 2683968 2938643 3247534 3376256 3276152 3244422 3243934 3196627
17395 3196627 3016102 2608359 2159165 1763037 1407851 1172844 1124411 1099550 1041785 986633
17385 986633 967213 1010514 1149182 1424503 1720001 2082865 2409707 2564052 2528971 2488598
17375 2488598 2567556 2593798 2401909 2083516 1798613 1644905 1703092 1799046 1795252 1633208
17365 1633208 1361004 1088443 895830 703237 614089 580772 560233 462814 429200 364214
17355 364214 376352 351016 354155 392159 479441 490534 567875 739549 987711 1296209 1469360
17344 1469360 1314665 1041326 783349 543536 444116 417675 318203 307956 358003 374830
17334 374830 356387 330351 251838 203897 216503 172245 232235 222302 168623 214568 218882 198182
17322A98182p9721O353J00300l746o2516K2824O2587L1524N3988k681j1900j430
17310C13764m6005p1775l4411K9084L1284j4694k4308j1302l0393M3104N3162
17299B37510Q4474N9737J04702J48219k1930O712m7576j40930r5978l3053o8653
17288B33234m7878k2071L219J4986j8433m8256m130J2218L4021J6836m2679o4542
17276F6525M6363O4041L9998k7970j8239n1961k8909J844k5957p6748j5924L1680
17264D743M5250M1756J1188N5833j7435n0406J4369L1160N1286J3090n7936j3531
17252A29367K6603m2804l5827m3299O7397J1043j5813m6042l6134m2134R2811
17241F5168M5830k2119Q926J9003l3642m982K6211N0157K6369K477l1546l002
$$ plain form
17322 198182 118461 124814 225114 221368 158852 181676 244263 275787 329775 327094 315194 313764
17310 313764 267759 195984 161573 190657 221941 207247 182939 171637 141244 184348 237510
17299 237510 321984 381721 486423 634642 612712 619424 571848 430918 334940 301887 233234
17288 233234 185356 163285 166504 181490 163057 114801 110671 122889 156910 173746 131067 66525
17276 66525 112888 176929 216927 188957 170718 118757 89848 91692 65735 -11013 -26937 4743
17264 4743 49993 91749 102937 158770 141335 90929 105298 136458 187744 200834 142898 129367
17252 129367 155970 113166 77339 34040 101437 112480 96667 50625 14491 -27643 65168
17241 65168 110998 88879 97805 116808 83166 78184 104395 154552 180921 183398 151852 148850
17229A48850k0715L1712O1749R3293J21163J50730J98925L68224O62500J157740
17219B974171J689129J561688P00204m90097j545891j562991j145701p03716l67874
17210A108922j90275j46036j18356j04627o8611O568J181r993n9707r7998n5662
17199B65406j00492N01j7359L6276M1509r6037m5039Q8382P2401k893l4164j9773
17187A88718Q751j2194k6695K2448M4646K5063o6504o2414q724k586K046l7406
17175G5149R2786J5346m9668l121J6914r024O1704l3913m7491n6188M2462P0969
17163A75925M0660n718J0217J890l9950J8362o3615l6109o476K1961j0221N7987
17151A64913O4266j1831k8539p601m5440n195L5978M4675M1156o9183o3249N5428
$$ plain form
17229 148850 128135 159847 221596 314889 436052 586782 785707 1153931 1816431 2974171
17219 2974171 4663300 6224988 6925192 6435095 4889204 3326213 2180512 1476796 1108922
17210 1108922 918647 772611 654255 549628 481017 487585 488766 478773 419066 321068 265406
17199 265406 164914 165415 148056 184332 225841 129804 84765 173147 245548 242655 208491 188718
17187 188718 197469 185275 158580 181028 225674 250737 184233 121819 113095 110509 112555 75149
17175 75149 167935 183281 133613 130492 147406 138382 200086 166173 118682 62494 104956 175925
17163 175925 216585 210867 221084 222974 183024 201386 137771 101662 95186 117147 106926 164913
17151 164913 229179 217348 188809 181208 135768 130573 166551 211226 252382 183199 119950 175378
17139A75378J1424n4445J8388l8037m4543k6741L2062j5189j751M7925n5396r9443
17127e0368o9333K6816N9493j1047M3143N8417J1606K4010K8812j2954n690J4763
17115A17668J8215k5677k2122P618k0978j182q865m7884L9259O163P607m2386
17103B7436l2804k5602K8145m0525j5274o3303L1918J03066Q3325K305j2001J9604
17091A06290M426n62m7452j5614k912K4925m189q875n7800k2411L7331O5076N548
17078H3781o5094q1825o5073k829K2752R6094J0339J0643O7070K406l4520k4828
17066A8916k743O082N1828L9971j9457k6104L9806K1765M3058J4191k6585k3832
17054A36896n6029k0236J8048l0050m6844M4481O0675j6731l2756J397J8170m4492
$$ plain form
17139 175378 186802 132357 150745 112708 68165 41424 73486 58297 56546 104471 49075 -50368
17127 -50368 -119701 -92885 -33392 -44439 -1296 57121 68727 92737 121549 108595 102905 117668
17115 117668 135883 110206 88084 95702 74724 73542 64677 16793 56052 62215 69822 27436
17103 27436 -5368 -30970 -2825 -43350 -58624 -121927 -90009 13057 96382 98687 86686 106290
17091 106290 110716 110154 62702 47088 44176 69101 64912 56037 -1763 -24174 13157 78233 83781
17078 83781 18687 -63138 -128211 -131040 -108288 -12194 -1855 8788 75858 78264 43744 18916
17066 18916 16173 22255 74083 114054 94597 68493 108299 130064 173122 187313 160728 136896
17054 136896 80867 60631 78679 48629 1785 46266 106941 90210 57454 58851 77021 32529
17042C2529K6039P0245O7121P2692p3071p2643o0197L2731J9251j5537L004P279
17030A09443j3835R848K367r35O064j6508K3050L8362O4016O9852k9586o0228
17018B01910J3089L571L016J1372p863j1770M2278K6176J1029m3511J7312K9351
17006B95960L5091M700m5233J10464J20633N0202j6984J6503j3680m110P0785
16995F24331L6429Q2866J26825Q7071K2173P0331J34672K19998L42108N75243
16985B322047N60013M10218J68221k15046j76279r239J93390M60982Q54507J405146
16975E973960K443064M116627O678260R682488Q208898L378493l033719r203973
16967B8244098p994287m426738j807342K43010K022734M296524P391012Q409741
$$ plain form
17042 32529 58568 128813 195934 268626 195555 122912 62715 95446 114697 99160 102164 109443
17030 109443 95608 105456 107823 106888 112952 96444 119494 157856 221872 291724 262138 201910
17018 201910 214999 218570 221586 232958 225095 213325 255603 281779 292808 249297 266609 295960
17006 295960 331051 335751 290518 400982 521615 571817 554833 571336 557656 553546 624331
16995 624331 660760 743626 870451 957522 979695 1050026 1184698 1404696 1746804 2322047
16985 2322047 2882060 3292278 3460499 3245453 3069174 3059935 3253325 3714307 4568814 5973960
16975 5973960 8417024 12533651 19211911 28894399 37103297 40481790 37448071 28244098
16967 28244098 20249811 15823073 14015731 14258741 16281475 20577999 27969011 36378752
16959C6378752M875654l42747p137930r080934n575347k190644N21178K794765
16951B0242747N677845P785463N509372J169717m604515r113867p064944l937718
16943A5664100j699396J55480J958405M182430P044524P287374L521930j595231
16935C6519616p937923q776502n607547l254332j873818j197937r26843r30990
16927F013724q17773o24974m50665l55291k91654k08904K4661J05794O2574n6854
16917C400638k22255l87459l03584j82954j89091k57243k05839j57285r2251l0342
16907A372335p3240j27282k1397m427J7239P0137k9785k4886l3924k4582j6290
16896A103898N7602q007M9432l8918q7573j9538o9964p9523l0787p8837L767j5545
$$ plain form
16959 36378752 41254406 40911659 33773729 24692795 19117448 16926804 17447982 20242747
16951 20242747 25920592 33706055 39215427 40385144 35780629 26666762 19601818 15664100
16943 15664100 13964704 14120184 16078589 20261019 27305543 34592917 38114847 36519616
16935 36519616 28581693 19805191 14197644 10943312 9069494 7871557 6944714 6013724
16927 6013724 5195951 4570977 4120312 3765021 3473367 3264463 3289124 3394918 3457492 3400638
16917 3400638 3178383 2790924 2487340 2304386 2115295 1858052 1652213 1494928 1402677 1372335
16907 1372335 1299095 1171813 1150416 1145989 1163228 1233365 1203580 1178694 1144770 1120188 1103898
16896 1103898 1161500 1153493 1202925 1164007 1076434 1056896 986932 907409 876622 797785 801552 786007
16884G86007m0564j6818j2874m6381o9805j1706J4531l0842P7396L3607k8965
16873F53586j9654m2725m0473K0228j566J3530n2370p4183n7494n2075m6505r758
16861B90541L0161N3740N8762P034p6220m4136j072J6906O695J1120p988r670
16849C35873J8382P6495R9661K09467K66417L35591K06779m4168l33062l50715
16839H20720k18832o2226j01094n9857k4042n7543M2938O850j8352P146K1961
16828C57669J591L4878Q3552J14892J63936K43497K94963K03876L7135l01792
16818A234197l62179k33472r4528r9103p0007p8194j36404m7196N7084m1086k5894
16807A03218J15259J5082J7651L1918o8892p5794K2298M1320M1590R8q452n8300
$$ plain form
16884 786007 745443 728625 715751 669370 599565 587859 602390 571548 648944 682551 653586
16873 653586 633932 591207 550734 570962 569396 582926 530556 456373 398879 346804 300299 290541
16861 290541 320702 374442 433204 440238 364018 319882 318810 335716 342411 353531 345543 335873
16849 335873 354255 430750 530411 739878 1006295 1341886 1548665 1504497 1171435 820720
16839 820720 601888 539662 438568 378711 354669 297126 340064 346914 328562 335708 357669
16828 357669 359260 394138 477690 592582 756518 1000015 1294978 1498854 1535989 1234197
16818 1234197 872018 638546 544018 444915 374908 296714 160310 113114 170198 129112 103218
16807 103218 218477 233559 251210 283128 214236 138442 160740 202060 243650 243748 235296 176996
16795A76996J4706k4962l7408l0046K5144j5040l3756L0699r371m911o0696L0812
16783F2167J4707R420k5743p1033n8326O1757K4230K0315n4699N7216R8018p812
16771A30217l7157l2897K7865L5443K0436n0331l7201n7749j0834m7781J9737
16760d0252Q149m4957O4758J15925M3322m2625j2959k7822K1586L9575k5121k8619
16748G0960M2713o912J815P114k7755m940L7998j3550K4111o8266k2442L4319
16736G5165L0674j1349l9042n5288J5638L6849Q6263M220m2157n1836k4324j7185
16724G628N376K144K7130N4700l0727j3808J6515K0980m3225n6137l2519P7369
16712C5426K9226m1919K1232q815R882P8262m521J9357L9590J1663l6005l9892
$$ plain form
16795 176996 191702 166740 129332 99286 124430 109390 75634 106333 96962 92051 31355 62167
16783 62167 76874 86294 60551 -10482 -68808 -7051 17179 37494 -17205 40011 138029 130217
16771 130217 93060 60163 88028 123471 143907 93576 56375 -1374 -12208 -59989 -40252
16760 -40252 -32103 -77060 -12302 103623 146945 104320 91361 63539 85125 124700 99579 70960
16748 70960 113673 106761 108576 115690 87935 82995 120993 107443 131554 63288 40846 75165
16736 75165 105839 94490 55448 160 15798 52647 138910 143130 100973 49137 24813 7628
16724 7628 13004 15148 42278 96978 66251 52443 68958 89938 46713 -9424 -41943 35426
16712 35426 64652 22733 43965 35150 45032 123294 118773 138130 177720 189383 153378 113486
16700A13486k6779n4774m5737n3605j4767M3286M0209j1116k8314j4594j2381
16689f5086J546N4043Q5559J3813r7501J6132M6596j9970n1826M6545N2322o6
16677H2107j6031j5483p815M4964K8490j2823k3890q8266j7682N4113M461Q356
16665D0501P8492l6444o3782m131j4889P3929K8672n7450m7322n378M1987n06
16653C3679k1298R56n3661k0331J0082N4493j4651N0633M6877n4162J7813n5029
16641d599k0348L7179k129n6971L0559N5943m6998m6403M1666K7264l6234m8985
16629g0056Q150J3574m1955Q687N8583N223l6434n780r256n162j3836O7630J6724
16616c908K66J1890k4137L1018K0855k7192k1311k6126K1084J176M169J1383m7644
$$ plain form
16700 113486 86707 31933 -13804 -67409 -82176 -38890 1319 -9797 -38111 -52705 -65086
16689 -65086 -63540 -9497 76062 89875 -7626 8506 55102 35132 -16694 29851 82173 82107
16677 82107 66076 50593 42778 87742 116232 103409 79519 -8747 -26429 27684 32145 40501
16665 40501 118993 82549 18767 14636 -253 73676 102348 44898 -2424 -7802 34185 33679
16653 33679 12381 13337 -40324 -60655 -50573 3920 -10731 39902 86779 32617 50430 -4599
16641 -4599 -24947 12232 10103 -46868 -16309 39634 -7364 -53767 -12101 15163 -21071 -70056
16629 -70056 -61906 -48332 -90287 -81600 -23017 -17794 -54228 -60008 -69264 -74426 -88262 -20632 -3908
16616 -3908 -3642 8248 -15889 15129 35984 8792 -12519 -38645 -17561 -16385 -12216 -833 -48477
16603d8477L23P4123K8903K8077J635j9133k4527j765o4202n1936l1903l6241
16591a45123J1924Q7930P6124L3467m7306p0223m8359m5144k1188L6689q971K096
16579a38084l537J157J9500L9144j5212N4006r012J2846M3116J6082j0184l4641
16567b4819l724p3677l3108K4817O749K1856j2502L1904P1505J9930k735n9954
16555c3758J3202J8017L6816K2142k1827O0502M6525O439m7192m5099l8823K2056
16543C9000J9348N6471j4146k6616k0210p9140r782L8631k0677m7436K8083M0520
16531D046L6781K5766K1771K0787o2417m5615N1892N3215J6283J3117l0162l7921
16519F7543q5903J4115j389m8796k1356R7146j996l0993O21K3944L048m363q285
$$ plain form
16603 -48477 -48154 25969 54872 82949 84584 65451 40924 39159 -25043 -76979 -108882 -145123
16591 -145123 -133199 -45269 30855 64322 17016 -53207 -101566 -146710 -167898 -131209 -140180 -138084
16579 -138084 -141621 -140464 -120964 -81820 -97032 -43026 -52038 -39192 3924 20006 9822 -24819
16567 -24819 -28543 -102220 -135328 -110511 -103762 -81906 -94408 -62504 9001 28931 26196 -33758
16555 -33758 -20556 -2539 34277 56419 34592 95094 141619 148058 100866 55767 16944 39000
16543 39000 58348 114819 100673 74057 53847 -25293 -35075 3556 -17121 -64557 -36474 4046
16531 4046 40827 66593 88364 109151 46734 1119 53011 106226 122509 135626 105464 67543
16519 67543 -18360 -4245 -5634 -54430 -75786 21360 19364 -11629 -11008 12936 15984 11621 3336
16506C336M449j5294k4305N334L2650J1112L3346o798J9720j4050k9446K9615
16494D9669Q6155N1149J6915J638J8263k2504j24003l0872O7617K1176l4404M6697
16482A47496n1913Q163O198l5148K8930k8394J7190L35j3002L8413j2931n8986
16470D6351N2849M9581J4792j8240J1793K0653J5539K581j4926n392J913l4202
16458A43292l8471l6856j4388m1646k7333O7478R3530R036m6927r7056K8872O0040
16446I9571m6971p28j7638k9637K963K6937J1137l8205l8207L6509J8090J9510
16434D3331Q8368o989o3792m7155l6010R126O0397J7272l0693n0765J0316o854
16422a3448P6027P5553j5725p9545r5100l6419J9912P9657N3946R192L9924M1761
$$ plain form
16506 3336 7785 -7509 -31814 -26480 6170 17282 50628 43830 63550 49500 20054 49669
16494 49669 135824 186973 203888 205526 223789 201285 77282 46410 114027 135203 100799 147496
16482 147496 95583 103746 109944 74796 103726 75332 92522 92857 79855 118268 105337 46351
16470 46351 99200 148781 163573 145333 157126 177779 193318 195899 180973 175581 177494 143292
16458 143292 104821 67965 53577 11931 -15402 52076 145606 154642 107715 10659 39531 99571
16446 99571 52600 51872 34234 4597 7560 34497 45634 7429 -30778 5731 23821 43331
16434 43331 131699 124710 60918 13763 -22247 -13121 47276 64548 33855 -16910 -6594 -13448
16422 -13448 62579 138132 122407 42862 -52238 -88657 -68745 10912 64858 74050 113974 155735
16410A55735L7460l0815p7206l2492K5339O6265r441J1310L8354O9358r796l9109
16398B04962k2535m221L2130J1436m9338k3409k038Q352L5897j6452L6608N0856
16386B62248K6883m5780n1847m3487o3446k8544O3096K8174R3063K9285l3072
16375B36573p5481o9431k3367J6874l8836j6314L0405N5328m4638j6057J9857
16364G4913J9544n3271J0915j3089O539l7233J7675J4943J8378j0284p054p4330
16352c2354j7272M3542Q9045L7781o1182r2198m8045K2784k410J9220L7813J5635
16340A2359N373k984L0860q973p9331p1037N383M1871P3624O4436J0129k508j3337
16327F5865k387l6630j7112m5324K232L004K0316J30N5786N2305o4051k570L692
$$ plain form
16410 155735 193195 162380 85174 52682 78021 144286 134845 146155 184509 253867 244071 204962
16398 204962 182427 178206 210336 221772 172434 149025 146987 155339 191236 174784 211392 262248
16386 262248 289131 243351 191504 148017 84571 56027 119123 147297 240360 269645 236573
16375 236573 161092 91661 68294 85168 46332 30018 60423 115751 71113 55056 74913
16364 74913 94457 41186 52101 39012 45551 8318 25993 40936 59314 49030 41976 -32354
16352 -32354 -49626 -6084 82961 120742 59560 -32638 -80683 -57899 -60309 -41089 -3276 12359
16340 12359 17732 14748 45608 36635 -42696 -113733 -108350 -66479 7145 71581 81710 79202 65865
16327 65865 63478 26848 9736 -35588 -33356 -30352 -10036 -9906 45880 98185 34134 31564 35256
16314C5256l0156M0502Q747J6006L3882l6657P011L2951j9213K0759k1643q2207
16302E238m8375Q0094Q0298m955m2240m1257k526M3783K3511O2333k1326o6665
16290F7913M2501m6602n9895M6948Q997j1308n6134o5101j447K5352N2112j0589
16278g253L3175k5903R964J9362K2034m0712l1945m2903l3965L1602J307l0254
16266i5491l6434O0611Q888K6119K5198M236R255m2485j5768J2841K4305J2209
16254f516j4118J9499k9605k3050m0204p1964J0833M6253M343J5795j7805J2120
16242i4419N0712R388l1822L0902j8131L041P0573N027j8109m2448n6282m5782
16230a37350M8341L9150o0029P1813M1532j7063o152j6742l4332K4735M2985M3299
$$ plain form
16314 35256 5100 45602 54349 70355 104237 67580 74591 107542 88329 109088 87445 5238
16302 5238 -43137 36957 117255 112300 70060 28803 26277 70060 93571 155904 134578 67913
16290 67913 110414 63812 3917 50865 59862 48554 -7580 -72681 -74128 -48776 3336 -7253
16278 -7253 25922 19 9983 29345 51379 10667 -21278 -64181 -98146 -66544 -65237 -95491
16266 -95491 -131925 -71314 -62426 -36307 -11109 -6873 2382 -40103 -55871 -43030 -18725 -6516
16254 -6516 -20634 -1135 -30740 -53790 -93994 -165958 -155125 -108872 -104529 -88734 -106539 -94419
16242 -94419 -43707 -34319 -66141 -35239 -53370 -50329 20244 25271 7162 -35286 -91568 -137350
16230 -137350 -89009 -49859 -109888 -38075 3457 -13606 -19758 -36500 -70832 -46097 -3112 40187
16218D0187m7010Q898l2364L1724m387J3128L9580k2771m7151p8909j6288N9150
16206e6213k8181r4074Q7782R6359m5981k5477O4276j050L2k8912L813K2214k4170
16193b9582q1350j6237J3442J0911K1746O6545L3434q6522j4108N4361M4289J7439
16181C4368r720k595p6990j057K6286m5331j7702P1004P6539m2360m0581k6267
16169e4406j2611K819m799j7074J0199m4371K6564l6415P7143O6090l8799J2360
16157a3300l807J5671q224n4420n4708J8780K1750N5842N0322P4587l5662n9367
16145G464m9408k9030M2786N3581K6165q6437m9559M9333Q259l1551o5873M1892
16133h2378M9499K2846N9205M8805k2026l8232o6847m8194Q3892k5733R73Q258
$$ plain form
16218 40187 -6823 2075 -30289 1435 -2952 10176 49756 26985 -20166 -99075 -115363 -56213
16206 -56213 -84394 -178468 -90686 5673 -40308 -65785 -1509 -2559 -2527 -31439 -27626 -5412 -29582
16193 -29582 -110932 -127169 -113727 -102816 -81070 -14525 18909 -67613 -81721 -27360 16929 34368
16181 34368 24648 22053 -54937 -55994 -29708 -75039 -92741 -21737 54802 12442 -28139 -54406
16169 -54406 -67017 -64198 -68997 -86071 -75872 -120243 -93679 -130094 -52951 13139 -25660 -13300
16157 -13300 -17107 -1436 -9660 -64080 -118788 -100008 -78258 -22416 27906 102493 66831 7464
16145 7464 -41944 -70974 -28188 25393 51558 -34879 -84438 -35105 -26846 -58397 -124270 -82378
16133 -82378 -32879 -10033 49172 97977 75951 37719 -29128 -77322 6570 -19163 -18190 -9932
16121i932k8047m1130O2M2898o320m8668m2958L8065O1033k6495J9289M1774K3027
16108B2598j159L6385o481m0252o920J2115n1603k5531K8719L9351O1404j0394
16096E8232L146k7428l0168r419L1770L8170k4614j5522j8265k6684k3075p616
16084e1473J5295N1060J5787m743K3968m9251p9011o2385m247O5218m5968l2134
16072a57884P1534L9266n693J6212l4647m9126j9516N0514K306J9437O265j6231
16060g7563k852n1111l302j9581l827O616M3468O085m5697p467N782M3492j4751
16047a20708k6286r657O2504M6053l1433p453K0139o0054L4218L4899Q22M5512
16035a1444l9579k9621k0399R5792L6300j3653J511l457Q380k5614O589J3620
$$ plain form
16121 -9932 -37979 -79109 -79047 -36149 -42469 -91137 -134095 -96030 -34997 -61492 -42203 -429 22598
16108 22598 21439 57824 51343 11091 4171 16286 -35317 -60848 -32129 7222 68626 58232
16096 58232 61378 33950 3782 -5637 26133 64303 39689 24167 5902 -20782 -43857 -51473
16084 -51473 -36178 14882 30669 25926 49894 643 -78368 -140753 -145000 -79782 -125750 -157884
16072 -157884 -86350 -47084 -52777 -36565 -71212 -120338 -139854 -89340 -87034 -67597 -61332 -77563
16060 -77563 -80415 -131526 -134828 -154409 -158236 -151620 -108152 -102067 -147764 -155231 -149449 -105957 -120708
16047 -120708 -146994 -156651 -94147 -48094 -79527 -86980 -66841 -126895 -92677 -57778 -56956 -11444
16035 -11444 -51023 -80644 -101043 -5251 31049 17396 18907 15450 23830 -1784 4805 18425
16023A8425k1893j6026J0252O0127k7391k8684J5657j325L3519n522l0930l2614
16011b6405O078O4705k6713n0432m129M5131j1688N23l8129l3822k7646j8058
15999a20585J279N2373O0318J0087n0082L04o726P6818K5078j0213j8676k1688
15987a713j9168J045K2751j3934k4094n7999J4330R1632O2885k7260J4485O100
15975F9060k7131o5788l6941k3704L8447J5683N1867n2794r519r487o349M080
15963e2576p986O1952R9977k1404q1508k6499k3668j6945l7530K2391K7398N0364
15951f034M6937J5144j5366j2251p5064j05269K9011L7987O5806K7003k3464P6954
15939F1394L555K947o497n9163k4756K9786L4952L4297M5235q972m2291k0232
$$ plain form
16023 18425 -3468 -19494 -9242 50885 23494 -5190 10467 9142 42661 37139 6209 -26405
16011 -26405 -20327 44378 17665 -32767 -36896 8235 -3453 -2930 -41059 -74881 -102527 -120585
15999 -120585 -119306 -66933 -6615 3472 -46610 -46306 -53032 23786 48864 38651 19975 -1713
15987 -1713 -20881 -19836 2915 -11019 -35113 -93112 -78782 12850 75735 48475 62960 69060
15975 69060 41929 -23859 -60800 -84504 -46057 -30374 21493 -31301 -40820 -50307 -56656 -52576
15963 -52576 -60562 1390 101367 79963 -1545 -28044 -51712 -68657 -106187 -83796 -56398 -6034
15951 -6034 40903 56047 40681 28430 -46634 -151903 -122892 -84905 -19099 7904 -15560 61394
15939 61394 64949 67896 61399 2236 -22520 7266 42218 76515 121750 112778 70487 50255
15927E0255o420k3882J904o7394j0826M3214n859n7315p7379L2368O4585Q064
15915d8685m9566M9660N0020p610m5054K6136M965k7480K9959J8596n5066l3912
15903h8037L3884M8325K9040j188j0413L7494q687j1689m993j17K7557k3046m8907
15890b0777n9082n8984J9467L8141J2470l4854K03J8645J064L6731L8457K6247
15878A7728p4693l6640j3642Q4663Q0011Q080o5956O10O639L0810R569j0199k9927
15865G053j9274J020J7884P864j9987k0928J1283m4535O914L4139o643q828J7884
15852a6154j3713o9447n8066j0074O8828M8540n241J2590P8966L3451j5075j8863
15840C5742m2019m5586q528L7059l3931K7461m56m9859R106L8084M1655l523l2870
$$ plain form
15927 50255 43835 19953 21857 -45537 -56363 -13149 -19008 -76323 -153702 -121334 -56749 -48685
15915 -48685 -98251 -48591 1429 -6181 -51235 -25099 -20134 -47614 -17655 941 -54125 -88037
15903 -88037 -54153 -5828 23212 22024 11611 49105 40418 28729 23736 23619 51176 28130 -20777
15890 -20777 -79859 -138843 -119376 -81235 -68765 -103619 -103416 -84771 -83707 -46976 -8519 17728
15878 17728 -56965 -93605 -107247 -22584 57427 65507 -449 161 6800 37610 47179 36980 7053
15865 7053 -12221 -11201 6683 14547 -5440 -26368 -15085 -59620 -52706 -18567 -25210 -34038 -16154
15852 -16154 -29867 -99314 -157380 -167454 -98626 -50086 -55327 -42737 36229 69680 54605 35742
15840 35742 -6277 -51863 -60391 -23332 -57263 -29802 -30258 -80117 -71011 -32927 8728 5205 -27665
15827b7665m2425N4282M0268j19084j5819P3150M1554M0363K4889n019o3221j04880
15815a03607k1815l7261j079M4202L5379K9259m3557P242P854J6267O5806J5489
15803A4179m9557j7601j7505L0632P2011j242l7015o894J697m5267m319K9900
15791c0981J13554k7554K7808M1619n0731r0455n3113l9628L6425L7377J0042
15780b5637k403j8149L3889j9884o8802L5755L0646J4195M669M0477j8819k5681
15768a9744m06K3278Q4005J7385j04212j0794j1237J6562l9403m3753N6609P383
15756b4327n426O3992n993p9986n433P8497J7713o5809l9754K325k0239J5899
15744f8541M8668N5005J0032J0371o5588k1447k1139N163L6730K1051n803o6476
$$ plain form
15827 -27665 -70090 -15808 24460 -94624 -110443 -37293 4261 44624 69513 64494 1273 -103607
15815 -103607 -125422 -162683 -163762 -119560 -84181 -54922 -98479 -91237 -83383 -67116 -1310 14179
15803 14179 -35378 -52979 -70484 -39852 32159 30917 -6098 -12992 -11295 -56562 -60881 -30981
15791 -30981 82573 55019 82827 124446 73715 -16740 -69853 -109481 -73056 -35679 -25637
15780 -25637 -28040 -46189 -12300 -32184 -100986 -65231 -34585 -20390 -15721 24756 5937 -19744
15768 -19744 -20150 3128 87133 104518 306 -10488 -21725 -5163 -44566 -88319 -31710 -24327
15756 -24327 -29753 34239 28246 -51740 -57173 21324 39037 -26772 -66526 -64201 -84440 -68541
15744 -68541 -19873 35132 45164 55535 -10053 -31500 -52639 -47476 -10746 10305 4502 -61974
15732f1974p3908M0776J06251O1980M1458p7260n3576K0515n4157N0020K7683
15721B7808l0706J4137m3079j0997j7814n946n5558M4172O4249p5782m7132j8192
15709a54840K1314Q5818N3223J3735j1668J7641o3282m0454p222Q0856Q0041o9243
15697E919l9700J9213K759n7065p9859M4450Q1104L2921j9917L6897Q891k1669
15685A3944k1803k1112o333M2606J4061l4764j3031p15K7016K3198l6590n3873
15673f7396k6355J2545o642M648j467J8360L7081M3805l8220M580J4421l244m8214
15660e6098m9624L8133j2032M4926L4397o7411K0656N3515m3148j5201l1139K0039
15648f2987K1075l5474n1159L0529Q6802l6234N142K2494m698j5496R682J4667
$$ plain form
15732 -61974 -135882 -95106 11145 73125 114583 37323 -16253 4262 -49895 125 27808
15721 27808 -2898 11239 -31840 -42837 -60651 -66597 -122155 -77983 -13734 -89516 -136648 -154840
15709 -154840 -133526 -47708 5515 19250 7582 25223 -38059 -78513 -85735 -4879 75162 5919
15697 5919 -33781 -14568 -11809 -68874 -148733 -104283 -23179 9742 -10175 26722 35613 13944
15685 13944 -7859 -28971 -35304 7302 21363 -13401 -26432 -27147 -131 23067 -13523 -67396
15673 -67396 -93751 -81206 -87848 -83200 -84667 -66307 -29226 14579 -23641 -19061 -4640 -7884 -56098
15660 -56098 -105722 -67589 -79621 -34695 -298 -67709 -47053 6462 -36686 -51887 -83026 -62987
15648 -62987 -41912 -77386 -128545 -98016 -11214 -47448 -42306 -19812 -24510 -40006 -30324 -15657
15636a5657j5765p206K2370k5356J8119n1192M796P764j4329K5806j0352M6937
15624a4065K9556o0685p1339M2956L9286k500j2929j155l0698K6741K7876n2325
15612g9281M4509J2930n0180q520m472K3337M3047K5566n7201o182j7704o467
15600h0618M2995N1521k6180l2698M3813L290o491N3165r240n0164K3475M1808
15588E4676O3759M8178J0881o6618l9152l5613m1063q956j6341j5480J508m029
15576d8250J8303J8325J2036J1187j7979m0767K9664Q0762O330l0156l4601r37
15564C917K501l4983L485k2874p772N1588M4612n5589n7449m4624J7163Q8959
15552a1066j4345j3747O320J3970L9079n9671n1775J1794M2682N3733j0839K0512
$$ plain form
15636 -15657 -31422 -38628 -16258 -41614 -23495 -74687 -69891 -62127 -76456 -50650 -61002 -14065
15624 -14065 15491 -45194 -116533 -73577 -34291 -36791 -49720 -50875 -81573 -54832 -26956 -79281
15612 -79281 -34772 -21842 -72022 -80542 -85014 -61677 -18630 6936 -50265 -56447 -74151 -80618
15600 -80618 -37623 13898 -12282 -44980 -1167 2123 -4368 48797 39557 -10607 12868 54676
15588 54676 118435 166613 177494 110876 71724 36111 -4952 -13908 -30249 -45729 -44221 -48250
15576 -48250 -29947 -11622 414 11601 -6378 -47145 -17481 63281 69611 39455 4854 3917
15564 3917 6418 -28565 -25080 -47954 -55726 -4138 40474 -15115 -72564 -117188 -100025 -11066
15552 -11066 -25411 -39158 -32838 -18868 20211 -39460 -91235 -79441 -36759 16974 6135 26647
15540B6647l8366k1150p507J3764j9789l0405j2305J9109m9240p336P063J4214
15528a05301L2198M2410l3575m5156k8446K2383m6219Q124N6363M3440o294m3349
15516a03422N5229J6881l2670n9682K0152O9098l0144j3516J180k6962J0225L7054
15504e6577Q371p8318N946J0924l3740j1583O9007L8625l3230M5354O8179l3597
15492f39M2006O9249j7848p3315n0090r270o6857m3986l3040O0577J4229J6424
15480i2560J5382J6969L224m312o7112L929K6449j1807K4608J4552K4653K6839
15468a9186m311J109o4497m1751k7424M3862L4413K1033L5215L9779n2217o4549
15456i8524N2363K4046o1541K6274K7647J5228m6111k5049M1752j5752L2124k343
$$ plain form
15540 26647 -11719 -32869 -40376 -26612 -46401 -76806 -89111 -70002 -119242 -126578 -119515 -105301
15528 -105301 -73103 -30693 -64268 -109424 -137870 -115487 -161706 -153582 -97219 -53779 -60073 -103422
15516 -103422 -48193 -31312 -63982 -123664 -103512 -34414 -64558 -78074 -76894 -103856 -93631 -56577
15504 -56577 -48206 -126524 -120578 -109654 -143394 -154977 -85970 -47345 -80575 -35221 32958 -639
15492 -639 41367 110616 92768 19453 -30637 -39907 -106764 -150750 -183790 -123213 -108984 -92560
15480 -92560 -77178 -60209 -56985 -61297 -128409 -124480 -98031 -109838 -85230 -70678 -46025 -19186
15468 -19186 -23497 -22388 -86885 -128636 -156060 -112198 -77785 -56752 -21537 18242 -33975 -98524
15456 -98524 -46161 -22115 -83656 -57382 -29735 -14507 -60618 -85667 -43915 -59667 -27543 -29886
15444b9886j1071j3231j8788N6079n9474m7263J18198P3930k6606o6622j4152
15433c8886q776l9497n6950o527M4547M1089K2861L8450R439j6064R525k0050
15421b0839k4287k0595K2493M4435K1862o660j5774N633l214L2835L235n8915
15409a9791l6691K9013P5700l3287k4475L9463K1311r000n2054m8195O084l267
15397e5189j4023o490q4j0529l3595l9203K0431R7767M7320l6874k747n6750l682
15384i3648N511q9139J5798N8945R6696r554K33q8613k2512J5061J5762M5272
15372e0188j5116n5789K7834O9687M9612K7395J6179p8815r918L8305n945k3797
15360a0556L5040K003r460q2984R200Q958l7246k2640K2883R9793k9220p0204
$$ plain form
15444 -29886 -40957 -54188 -72976 -16897 -76371 -123634 -5436 68494 41888 -24734 -38886
15433 -38886 -47662 -87159 -144109 -150636 -106089 -65000 -42139 -3689 5750 -10314 -789 -20839
15421 -20839 -45126 -65721 -43228 1207 23069 16409 635 6268 3054 35889 39124 -19791
15409 -19791 -56482 -27469 48231 14944 -9531 29932 51243 42243 -9811 -58006 -51922 -55189
15397 -55189 -69212 -75702 -75786 -86315 -119910 -159113 -138682 -40915 6405 -30469 -33216 -89966 -93648
15384 -93648 -88137 -177276 -161478 -102533 -5837 -15391 -15158 -103771 -126283 -111222 -95460 -50188
15372 -50188 -65304 -121093 -93259 -23572 26040 53435 69614 -9201 -19119 19186 13241 -10556
15360 -10556 24484 26487 17027 -65957 -56757 -47799 -85045 -107685 -84802 14991 -14229 -84433
15348h4433N0624J089N465n5993l2488J8126J3039J8658K9131P830l3465n9540
15336a21957L5457M2114N9763L563n8846K6512j5555J7890J0357J1275K0617r363
15324B1827o8392K3087J7444K2358n722n7458l7101L3159P1085m2485k3253m0908
15312h6359L7585M8939O0701L4708m7757q5860n0359k0557R519M2717j3784R732
15300f0775J17m1624O7069O9012J6698J700O498k724L89J548l0044o393j1659
15287I812n3878Q18j737m0565J8291L4727J3279N6435j0114O928J2225l8157p4076
15274f6012l8917J1035Q7201J803L1388p0146o9476k029L6942J9562n215O7553
15262C689Q3210j5709p5084n6603p999J2464K8813N5918j4331j8516j0407L930
$$ plain form
15348 -84433 -33809 -32720 -27255 -83248 -115736 -97610 -84571 -65913 -36782 -28952 -62417 -121957
15336 -121957 -86500 -44386 15377 18940 -39906 -13394 -28949 -11059 -702 10573 31190 21827
15324 21827 -46565 -23478 -6034 16324 10602 -46856 -83957 -50798 20287 -22198 -45451 -86359
15312 -86359 -48774 165 60866 95574 47817 -38043 -88402 -108959 -99440 -56723 -70507 -60775
15300 -60775 -60658 -102282 -35213 33799 50497 52197 58695 55971 56360 57908 27864 21471 9812
15287 9812 -44066 -43248 -44985 -85550 -67259 -32532 -19253 37182 27068 33996 46221 8064 -66012
15274 -66012 -104929 -93894 -6693 -4890 26498 -43648 -113124 -115153 -78211 -58649 -63864 3689
15262 3689 86899 71190 -3894 -60497 -68496 -56032 -27219 28699 14368 -4148 -14555 -10625
15250a0625j5372q143J074L3592j965k5777K581j0530k0538K1535K5385j4633
15238b3416o1308k710J19534j1058p1890K3062L0240n2308O1542j3074K1672j5302
15226D984m6744m5869L9291M3594j135k8948J5856M2755J083K5168J0088r2856
15214c2733q46L8343O1349L2263K1476j3103r0818j8375J2395l7208m218k1862
15202e3337P061J9576O1933O3749m2825q0751j1718n4816j401O9157j5970k7598
15190f6940j0071K186m7517j7568J0620M4248O540L8147J6551M8054o3049o6565
15178a05364N1793P0231L0281l1977M524j5072M243L1537K577o0909Q399l2835
15166d2572m6406k7994k4970M9587N0037J4608J135K122j3729p986O985J7290
$$ plain form
15250 -10625 -25997 -34140 -33066 526 -1439 -27216 -24635 -35165 -55703 -34168 -8783 -23416
15238 -23416 -84724 -87434 32100 21042 -50848 -27786 2454 -49854 11688 -1386 20286 4984
15226 4984 -41760 -87629 -48338 -4744 -5879 -34827 -18971 23784 24867 50035 60123 -32733
15214 -32733 -33579 4764 66113 98376 119852 106749 15931 -2444 9951 -27257 -31475 -53337
15202 -53337 -46276 -26700 35233 98982 56157 -24594 -36312 -91128 -92529 -23372 -39342 -66940
15190 -66940 -77011 -74825 -122342 -139910 -129290 -85042 -78502 -40355 -23804 24250 -38799 -105364
15178 -105364 -53571 16660 46941 14964 19488 4416 8659 40196 42773 -18136 -9737 -42572
15166 -42572 -88978 -116972 -141942 -92355 -42318 -27710 -26575 -24453 -38182 -46168 -39183 -21893
15154b1893k1957L9875K0926o0630j6867m6702n816J0798Q9986L7681k8687m6272
15142d9558k9128J6973q781K1359j1785K0907K6450j8691O449L3457o2355J3707
15130d0996L9094o1648J4346K5059l107o6438J5488O353m7526j2068m4466M7271
15118a28638M3216j730K9815J00834L7953j7503l5612l4738m6687j698p6499k678
15106a33965M9849K8725k8020n5835P831R966j3531K1648R469L5812L4523J4647
15094a8881l9074J0877P779l4843K8912L3684l271l3053k7349j0858J9542N3294
15082a3241J0399j9255k4943l0757L1365M0582l9075k9572L8282Q0142K8295q023
15070F4199K8748p472m5151k6844n4399k4772J601J8625j0933j3380K0635M3200
$$ plain form
15154 -21893 -43850 -3975 16951 -43679 -60546 -107248 -113064 -102266 -12280 25401 -3286 -49558
15142 -49558 -78686 -61713 -70494 -49135 -60920 -40013 -13563 -32254 -25805 7652 -54703 -40996
15130 -40996 -1902 -63550 -49204 -24145 -27252 -93690 -78202 -71849 -119375 -131443 -175909 -128638
15118 -128638 -85422 -87152 -57337 43497 81450 63947 28335 -6403 -53090 -54788 -131287 -133965
15106 -133965 -84116 -55391 -83411 -139246 -131415 -121449 -134980 -113332 -103863 -68051 -33528 -18881
15094 -18881 -57955 -47078 -39299 -74142 -45230 -11546 -14817 -47870 -75219 -86077 -66535 -13241
15082 -13241 -2842 -22097 -47040 -77797 -46432 -5850 -44925 -74497 -36215 43927 72222 64199
15070 64199 92947 85475 40324 13480 -40919 -65691 -64090 -45465 -56398 -69778 -49143 -5943
15058e943M806p2022K7366L0829M805L6597o9111m6842r572N2344L370K2185M6012
15045B4824q613M833j5895n980K6512K3463K8794j7546q8000m1280N3394k8605
15033d4099l6332M462J7443j7900N6060N6461M777j5781m597j6404J9946k4546
15021e10K6496j8338k2670M4272K8153p406K7372k3220p5201p2094l6429L1742
15009i7833M5147k421q913O3811O5847M0798L3769L0229M334j4046r1775r0483
14997b1536o786j0056J0905N124K5269J4163j9844k3605k986j2425O201K7016
14985h560l398k1536j8783n7736m6358Q7495J0728q523k3648n6982j907K9635
14973a19573O4953l2582q051L3291J1261l334l4523K9487R3477J6613J2876k549
$$ plain form
15058 -5943 -1137 -73159 -45793 -14964 -10159 26438 -42673 -89515 -99087 -46743 -43373 -21188 24824
15045 24824 16211 21044 5149 -831 25681 49144 77938 60392 -27608 -68888 -15494 -44099
15033 -44099 -80431 -75969 -58526 -76426 -20366 36095 40872 25091 20494 4090 24036 -510
15021 -510 25986 7648 -15022 29250 57403 49997 77369 54149 -21052 -93146 -129575 -97833
15009 -97833 -52686 -55107 -64020 -209 65638 106436 140205 170434 174768 160722 68947 -21536
14997 -21536 -28322 -38378 -27473 -22349 2920 17083 -2761 -26366 -29352 -41777 -35576 -8560
14985 -8560 -11958 -33494 -52277 -110013 -156371 -68876 -58148 -66671 -90319 -147301 -149208 -119573
14973 -119573 -54620 -87202 -95253 -61962 -50701 -54035 -88558 -59071 34406 51019 63895 61346
14961F1346N231j3617p7561J6006q732l8530j4463J078m8244j02j5195j6976L1266
14948a18493N6528p971Q136K7180k0668n6173L6252J7249K0553J1764L131M9113
14936B6601Q0167k3238K92o5820q2835j7437J1254n80p6538m1756Q7395J4257
14924h8238j2693o1752o711N0098P4657r913j4858J6911L9152J38l3646o7328
14912a14183K069J6598K4849M3282M5424M8234j1359l1087J8789n4312J1554j7806
14900a7948O709J5759K622n3668k1594N6973K6981J1538M6130o9859n3468O7454
14888A7629K6640Q121N2289q0618o0233L5154j2771j6559k0414J2031L0049m1000
14876d9682K578l130N1116Q423k4836k3133J3162k0433J2386n589k0602j7608
$$ plain form
14961 61346 66577 52960 -24601 -8595 -17327 -55857 -70320 -69242 -117486 -117588 -132783 -149759 -118493
14948 -118493 -61965 -69936 -61800 -34620 -55288 -111461 -75209 -57960 -37407 -25643 -22512 26601
14936 26601 106768 83530 83822 18002 -64833 -82270 -71016 -71596 -148134 -189890 -102495 -88238
14924 -88238 -100931 -162683 -169394 -119296 -44639 -54552 -69410 -52499 -13347 -13209 -46855 -114183
14912 -114183 -112114 -95516 -70667 -27385 18039 66273 54914 23827 42616 -11696 -142 -17948
14900 -17948 -11239 4520 7142 -46526 -68120 -11147 15834 27372 73502 3643 -49825 17629
14888 17629 44269 52390 104679 24061 -36172 -1018 -13789 -30348 -50762 -38731 -8682 -49682
14876 -49682 -47104 -50234 882 9305 -15531 -38664 -25502 -45935 -33549 -39138 -59740 -77348
14864g7348m806J3333Q059j4598J9190P7709N1563o040n3065p1298l9191M5206
14852e1286K6034k9140j551m8024l2745J7636K5956J8695N1988L0003p067m5287
14840d4788j5208L0404N0864N2322m0378k1252m2996l372M1493m5815J2866L7593
14828A1733P546q956R349j2896K2602n2793q646O487M1909q18k5054m3466o4711
14815a17714P899O5964j6737l2627L1015K8038J216j6004M1793L7950K4798N1070
14803A06661p144K2907j2453m4012k4634p692J9006q5870M8754J8952j4027j8197
14791B251r2301K1839P857L2870L7577K4262N938r3033q8692K1158O5325l4820
14779h9769m526k4542M8494M7448K1313k4766l5500M6639j8788q325N126r7651
$$ plain form
14864 -77348 -82154 -68821 -60762 -75360 -56170 21539 73102 67062 13997 -57301 -96492 -51286
14852 -51286 -25252 -54392 -55943 -103967 -136712 -119076 -93120 -74425 -22437 7566 499 -44788
14840 -44788 -59996 -29592 21272 73594 33216 11964 -31032 -34404 7089 -38726 -25860 11733
14828 11733 19279 10323 19672 6776 29378 -23415 -32061 -25574 16335 15517 -9537 -53003 -117714
14815 -117714 -109815 -43851 -60588 -93215 -62200 -34162 -32946 -48950 -7157 30793 55591 106661
14803 106661 99517 122424 109971 65959 41325 33633 52639 -33231 15523 34475 20448 2251
14791 2251 -90050 -68211 -60354 -27484 10093 34355 40293 -52740 -141432 -120274 -54949 -89769
14779 -89769 -94295 -118837 -70343 -22895 -1582 -26348 -61848 -15209 -33997 -42322 -37196 -134847
14767a34847j8585J3518p400P6845M7584K8940J5767P135n0310O467n498j5141
14755c5525m2312j6163l144q356J9028L2561J0240P485K4895k8946J3698k2804
14743d9343l350k9843k8324O3408M1395M2094j5726j4776k4878K695j2773J6970
14731a2451J002j4051K5290M4541J8375l2088L0110K0861k7900o083J315j979
14719D6942l4061J1352k1865M3873L8524q603R314r7126o7620m1507K4731P5092
14707b0954L54m2940j4018p9744N2606L0136J8133L2250l2226k3214J0033M3484
14695b6100M8754n8305q654q2708l1442K7369O3688R872m904k6106l616M1755
14683e0397J5639J6240j4129K7628J7901o901l1386k7747n6034j2541M5905M7655
$$ plain form
14767 -134847 -153432 -139914 -147314 -70469 -22885 6055 21822 28957 -21353 -14886 -20384 -35525
14755 -35525 -77837 -94000 -97144 -105500 -86472 -53911 -43671 -36186 -11291 -40237 -26539 -49343
14743 -49343 -52693 -82536 -110860 -47452 -6057 36037 20311 5535 -19343 -16648 -29421 -12451
14731 -12451 -11449 -25500 -210 44331 62706 30618 60728 81589 53689 47606 48921 46942
14719 46942 12881 24233 2368 46241 84765 76162 85476 -11650 -79270 -120777 -96046 -20954
14707 -20954 -20600 -63540 -77558 -157302 -104696 -74560 -56427 -24177 -56403 -79617 -69584 -26100
14695 -26100 22654 -35651 -44305 -127013 -158455 -131086 -67398 -57526 -62430 -88536 -92152 -50397
14683 -50397 -34758 -18518 -32647 -5019 12882 5981 -25405 -53152 -109186 -121727 -75822 -28167
14671b8167L9431j5279n2614n0716L510J0668M8308N0733m341k4539k5313r4520
14659a42839R192N4799Q2367Q58o3947o1278n224K2239R4297r009p1925j3528
14647a03998M5744k6649L2048n982k5186l3984l5363L4227L1522O1019M938l0826
14635e2490K5650P4889j8115j9123j2722k3093m4249J3689j3269M5745q862K0764
14623a1186K9408M7131N050j1684J4050K2512k5336j03492k5063N3343R809p8730
14611g4188j286l3776K3553K6452o1093m0771K411M7122L8090q856o0750o8257
14599b11349L2761Q7615K7812r69o763J1532m3036o3828j2053M8452J2878P131
14587a09817K5174J7278l0473m346J4528L3896k312M5125N4100L5772N4053o8612
$$ plain form
14671 -28167 11264 -4015 -56629 -107345 -103835 -93167 -44859 5874 1533 -23006 -48319 -142839
14659 -142839 -133647 -78848 3519 4377 -59570 -120848 -126072 -103833 -9536 -18545 -90470 -103998
14647 -103998 -58254 -84903 -52855 -58837 -84023 -118007 -153370 -119143 -87621 -26602 -21664 -52490
14635 -52490 -26840 48049 29934 10811 -1911 -25004 -69253 -55564 -68833 -23088 -31950 -11186
14623 -11186 18222 65353 70403 58719 72769 95281 69945 -33547 -58610 -5267 4542 -74188
14611 -74188 -75474 -109250 -85697 -59245 -120338 -161109 -158698 -111576 -73486 -82342 -143092 -211349
14599 -211349 -178588 -90973 -63161 -64130 -70893 -59361 -102397 -166225 -178278 -129826 -116948 -109817
14587 -109817 -84643 -67365 -97838 -102184 -87656 -53760 -56072 -10947 43153 78925 132978 64366
14575F4366n9989r1182N298L5014L1352k0168J6430P5149J544J8132n967q1871
14563a1892n7222M6506N0698k2155L1676R872j09075n5140M6485N5256n709N6965
14551C6265K8871j0201n2178m6992Q870K2366k6936j8102N5921O4531Q366L905
14539G4686r2487m3279j22K0297M783j9797n7514p185R7225N4051m9559j6102
14527c5003L0627j6452l4371k4255O026m3280o816J5896p51J07595O8832Q6204
14515A54252L0866k6251o0018l8310L6922k5427o5251K0494k1580J6022P740j7894
14503A1565j2005L7097K9678j828m6180L3976r811m9105K1538J0318L2503m3729
14491A4017o1379l1369P0392J15767l650j3041k2656j1937k1182L9146L2960n2217
$$ plain form
14575 64366 4377 -86805 -81507 -46493 -15141 -35309 -18879 56270 57814 75946 69979 -11892
14563 -11892 -69114 -22608 28090 5935 37611 47483 -61592 -116732 -70247 -14991 -20700 36265
14551 36265 65136 54935 2757 -44235 -35365 -12999 -39935 -58037 -2116 62415 70781 74686
14539 74686 -17801 -61080 -61202 -40905 -36122 -55919 -113433 -120618 -23393 30658 -18901 -35003
14527 -35003 -4376 -20828 -55199 -79454 -73428 -116708 -123524 -107628 -108379 -784 68048 154252
14515 154252 185118 158867 98849 60539 97461 72034 6783 27277 5697 21719 29459 11565
14503 11565 -440 36657 66335 64507 18327 52303 42492 -6613 14925 25243 57746 14017
14491 14017 -47362 -78731 -8339 107428 103778 90737 68081 56144 34962 74108 107068 54851
14479E4851l5246j9005k1463L7162r107k6667k1195m1091j4439P695j1944k7215
14467a27664N3191P9955L3834j2350j1558l5027M4856K7023k4745m812M1631n2657
14455A1677k8936N2450M3554j1157l7161J9973L7142o838j4231o0700o6853p18
14443f1798N4314J3228k9236L6503j2643k4044l9346m411J8624K3536q3611o431
14431a15315N1899Q2020l3921l0570J7046L9459N832P3877K8921j9886l7613l4497
14419B7252o2956J7625J2570J5839Q379m8515p5616N531N6814N6165K6868O723
14407D6679O1100m2259o8020O2134L6716R945l2391m8971l939r568M6513p10k1611
14394C5618k9956J0682n4046o9155l7504L929J06513J0001n0993r988J999O8861
$$ plain form
14479 54851 19605 600 -20863 16299 7192 -19475 -40670 -81761 -96200 -88505 -100449 -127664
14467 -127664 -74473 5482 39316 26966 15408 -19619 25237 52260 27515 22703 64334 11677
14455 11677 -17259 35191 78745 67588 30427 50400 87542 80704 66473 5773 -61080 -61798
14443 -61798 -7484 5744 -23492 13011 368 -23676 -63022 -67433 -48809 -25273 -108884 -115315
14431 -115315 -63416 18604 -15317 -45887 -28841 10618 16450 90327 119248 99362 61749 27252
14419 27252 -35704 -18079 -5509 10330 18709 -29806 -105422 -99891 -43077 13088 39956 46679
14407 46679 107779 65520 -2500 59634 96350 106295 73904 24933 20994 11426 57939 57229 35618
14394 35618 5662 16344 -37702 -106857 -144361 -140432 -33919 -23918 -74911 -84899 -82900 -14039
14382a4039L1127L457J8360o3380l9806K0787K0635K7389n031J0056L8057N0630
14370I8242J0581m6425q632m2963n5697l393J8064Q262m547K2294K7142M7761
14358G0689J8008n6655N122l6508L3066k1671M222M9250j23249m7173j667M2141
14346f4425N3229l158K4475J973j541K5224r953r8702o8853J3170N8217J0841
14334e9503J5819K7525n545K9427l3301r667L265R274K720L938P3033l440l2521
14321B1024o0081l6776L7089L1536l271J3596L2995k3591k6671M280K3746j2489
14309A387m6244j3546l7525K4679M6422o376R167k811k0628q6673k7214P9938
14297g9424P506q4676m2721N1526l0194o792J007M1220J03776p199k7287m7571
$$ plain form
14382 -14039 17088 20545 38905 -24475 -64281 -43494 -22859 4530 -501 9555 47612 98242
14370 98242 108823 62398 53766 10803 -44894 -48287 -30223 -21961 -26508 -4214 22928 70689
14358 70689 88697 32042 37164 656 33722 12051 16273 65523 -57726 -104899 -106566 -64425
14346 -64425 -11196 -14354 10121 12094 10553 35777 25824 -72878 -141731 -128561 -70344 -59503
14334 -59503 -43684 -16159 -21704 7723 -25578 -35245 -31980 -22706 -19986 -16048 56985 53545 21024
14321 21024 -39057 -75833 -38744 -7208 -10479 3117 36112 12521 -14150 -9870 13876 1387
14309 1387 -44857 -58403 -95928 -71249 -24827 -31203 -22036 -24847 -45475 -132148 -159362 -79424
14297 -79424 -71918 -156594 -199315 -147789 -177983 -184775 -183768 -142548 -38772 -45971 -73258 -120829
14285a20829J6046K8758J2948k6160k0304K0718P0573P758l4827J8738L1276k4971
14273b0276l4555k6780L0625Q366l159j3982K4536o638m2596j7941M7462M768
14261e0170l2916J4574K1851p266N562m9291O4847L2057k1964K6056j4441k2356
14249c3457l8788L6536r392l2958n704M2279K2615J7014l4551j0825m350K2882
14237b8699R423P0714l9806k3211k1529p4820m5207M0773M1804j0144M224M1724
14225c4754j1532o1006Q677P3432N7968m0780n8125L4338Q178k5188k4891k6170
14213i9853K8792o5727K4373K0935k1897M2310k9467k1941N5174Q3754O0045K5162
14201A01660K0735R824P59m5756m8925o9257m683j3474l2026P2555j0437J8242
$$ plain form
14285 -120829 -104783 -76025 -63077 -89237 -109541 -88823 -18250 -10492 -45319 -26581 4695 -20276
14273 -20276 -54831 -81611 -50986 -42620 -45779 -59761 -35225 -41863 -84459 -102400 -54938 -50170
14261 -50170 -83086 -68512 -46661 -53927 -48365 -97656 -32809 -752 -22716 3340 -11101 -33457
14249 -33457 -72245 -35709 -45101 -78059 -83763 -41484 -18869 -1855 -36406 -47231 -51581 -28699
14237 -28699 -19276 51438 11632 -11579 -33108 -107928 -153135 -112362 -70558 -80702 -76478 -34754
14225 -34754 -46286 -107292 -98615 -25183 32785 -7995 -66120 -31782 -23604 -48792 -73683 -99853
14213 -99853 -71061 -136788 -112415 -91480 -113377 -71067 -100534 -122475 -67301 16453 76498 101660
14201 101660 122395 132219 132978 87222 38297 -30960 -35643 -49117 -81143 -8588 -19025 -783
14189g83n204q620j8497p57R6624k0122k5068l5383n276M109L2744m0842j6587
14176d3662K8918L4705n005K2743j2585K2182p2388R702J9204j7716o6777K0175
14164f0504m872l0150M637M3978J2761r307q079L8089J8672m2395q390j3036K8562
14151c0034N6740J15046j709j97m4041J8377K2091O1704K3899J11057J11098K04814
14139F48845L11717K94519J29740o2253l07393k79483j83038j24245j37270n2433
14129B38706l1596M3103k0900r5348j6728n548r304l8943l0339O7425L6037J6834
14117A53399l0888k7636n5116k6629L8187L789n6818m8270L01j5149J3305N5862
14105D337O3249J3309l4319J2843k999J5836P6686l6290R314J5730l6878k8901
$$ plain form
14189 -783 -5987 -14607 -33104 -33861 62763 42641 17573 -17810 -23086 -18977 13767 -27075 -43662
14176 -43662 -14744 19961 14956 37699 25114 47296 -25092 -15390 3814 -13902 -80679 -60504
14164 -60504 -65376 -95526 -90889 -46911 -34150 -43457 -51536 -13447 5225 -37170 -45560 -58596 -30034
14151 -30034 26706 141752 140043 139846 95805 114182 136273 197977 221876 332933 444031 648845
14139 648845 960562 1255081 1384821 1322568 1015175 735692 552654 428409 291139 238706
14129 238706 207110 250213 229313 133965 117237 111689 102385 63442 33103 100528 136565 153399
14117 153399 122511 94875 39759 13130 51317 55106 -1712 -49982 -49681 -64830 -51525 4337
14105 4337 67586 80895 46576 59419 56420 72256 148942 112652 121966 137696 100818 71917
14093G1917m6418m4722m910L4396J4747N2314M6227l0945j0023R2826P7763L8026
14081B91198N0125K20567J97074L04772N67337R92435J653637J899215J146377
14072G322737j4593j481322j906744j319508p97915m56976k56810j81032j10068
14063G97769j20058m1565m0136o8456o3696o2184n6981n7314l3453n9054K0363
14052B15235j0206l3703m9933o8637K452O7540P234N240m633J2967k3374P505
14040A27687Q701K7736j4540q616j7678k0135j1205j665M5108k0297o8916k8597
14028A7583M467m1377L2259P9672l1871n1983L1962p461N1304l4443m626l9540
14016E946K4491M9127k8879o820J762l2643n156J8168m5159O7587L2481J8322
$$ plain form
14093 71917 25499 -19223 -24133 10263 25010 77324 123551 92606 82583 175409 253172 291198
14081 291198 341323 561890 758964 1063736 1631073 2623508 4277145 6176360 7322737
14072 7322737 7308144 5826822 3920078 2600570 1802655 1345679 1088869 907837 797769
14063 797769 677711 636146 596010 527554 463858 401674 344693 287379 253926 194872 215235
14052 215235 205029 171326 121393 52756 55208 122748 129982 135222 130589 143556 120182 127687
14040 127687 136388 164124 149584 140968 123290 103155 91950 90285 135393 115096 46180 17583
14028 17583 22050 -19327 12932 92604 60733 8750 40712 33251 84555 50112 45486 5946
14016 5946 30437 79564 50685 43865 45627 12984 7828 25996 -19163 48424 80905 99227
14004I9227J2055o1391m5997J5492q426K838l7802m2344O965K2028l5169k213
13992g4737K5170N1477o541J0618M2639l2205n8042p1595j0092K7771M1333K7884
13980b6320N2j0116k0130m2742m4328O080Q538K5711J7339m018K1147L9142M0616
13967A0971l0538n6231k176O3899M0470k15l3263j9300k916J5749O2479r947m2427
13954c445m3833m874J3033j4038m7572M3250K4753M0831k7405J02040P5371l2309
13942A25802q4375j8390j115m5762M087K7609M6007L1042N5568m0202k5967j5325
13930E8979k785m7291R161m086k5313L3238N6716k0645k4561k5607O0810j9683
13918D8933o263K7428j4659L1309k5504l3139o4563l2863j0778J05948L910k6660
$$ plain form
14004 99227 111282 49891 3894 19386 10960 13798 -24004 -66348 -59383 -37355 -72524 -74737
13992 -74737 -49567 1910 -4631 5987 48626 16421 -41621 -113216 -123308 -95537 -54204 -26320
13980 -26320 -26268 -36384 -56514 -99256 -143584 -137504 -128966 -103255 -85916 -89934 -68787 -29645 10971
13967 10971 -19567 -75798 -77974 -14075 26395 26180 -7083 -26383 -29299 -13550 48929 38982 -3445
13954 -3445 -47278 -52152 -39119 -53157 -100729 -57479 -32726 8105 -19300 82740 158111 125802
13942 125802 41427 23037 21922 -23840 -19753 7856 53863 84905 140473 100271 74304 58979
13930 58979 56194 8903 18064 13978 -11335 21903 78619 57974 33413 7806 68616 48933
13918 48933 42670 70098 55439 86748 61244 28105 -36458 -69321 -80099 25849 29759 3099
13906C099l9443j3280o141J8053J09561O9567l3618o1373j6458J0201n1648J9879
13894H399K025r3682K995O9511R3744M5313J2299n3358k1514j2935L30l1824l0254
13881h951m651J0412J8766n996K6790J5156m4477p5820j0789J3236P4936J7472
13869B6084L0904M5169K167p3743n3752j1368j5826M3301P8289K4328o3639j9866
13857A2048L9025J9442r6434k1726N6070j5236m7255M647J0980k1157n4449L1707
13845h2338M1551J8884N1196M2966M9853P929n1704o1318k3684k8225l9545M9351
13833b5084Q7509n559k4563M2380K2853p9609o8091j6099M8165P647L1905K3066
13821D4520o313K552j412l8490k7236j2625q238N679O2838j9867l6895J3774k0765
$$ plain form
13906 3099 -36344 -49624 -55765 -37712 71849 141416 107798 46425 29967 40168 -11480 8399
13894 8399 10424 -83258 -80263 -10752 82992 128305 140604 87246 65732 52797 53127 21303 -8951
13881 -8951 -13602 -3190 15576 9580 36370 51526 7049 -68771 -79560 -66324 8612 26084
13869 26084 56988 102157 104324 30581 -23171 -34539 -50365 -7064 71225 95553 31914 12048
13857 12048 51073 70515 -25919 -47645 8425 -6811 -54066 -49419 -38439 -59596 -114045 -82338
13845 -82338 -40787 -21903 29293 72259 122112 130041 78337 17019 -6665 -34890 -74435 -25084
13833 -25084 62425 56866 32303 74683 97536 17927 -50164 -66263 -18098 -10451 21454 44520
13821 44520 38207 40759 39347 857 -26379 -39004 -47242 -41563 21275 1408 -35487 -21713 -42478
13808d2478k7702k587l6970K5353K3789P556o702M2711P2101m0817l6516j2957
13796c5219j3234k858P57K8115n0158K7231J00979L6875Q6939k9604m1826J5503
13784A23500M3920n5904r7372r0258l0502m2970n5385j9293K6012K8022J9203
13773a51027o156K3628M5853L5532k0013O641R053K120j4939Q08J1767N0317J5433
13760I017M3078J5778J5161l318k9293p076P649j3310l162j0238o506L7876P9334
13747A34990O5532k2843m2798l3812K4840N0478m141k8905k5057k2290l5255k6772
13735C3967j8744Q7557M7524K883n0858l3446O8379J7958j4466N0054k406L8476
13723B26878J2809K8797l3613k829k1452l5218N4498L6775L6177J0224L5241K6135
$$ plain form
13808 -42478 -70180 -72767 -109737 -84384 -60595 -53039 -59741 -17030 55071 14254 -22262 -35219
13796 -35219 -48453 -51311 -50554 -22439 -72597 -45366 55613 92488 179427 149823 107997 123500
13784 123500 167420 111516 14144 -76114 -106616 -149586 -204971 -224264 -198252 -170230 -151027
13773 -151027 -157183 -133555 -87702 -52170 -72183 -65542 -56489 -54369 -69308 -68500 -56733 -6416 9017
13760 9017 52095 67873 83034 79716 50423 43347 50996 37686 34524 24286 17780 55656 134990
13747 134990 200522 177679 134881 101069 125909 176387 172246 143341 118284 95994 60739 33967
13735 33967 15223 102780 150304 153187 102329 68883 137262 155220 140754 190808 188402 226878
13723 226878 239687 268484 234871 232042 210590 175372 229870 266645 302822 313046 348287 374422
13711C74422k7812O450O9109K9534N0077L1658J1150J5945N6158N5695n002l9327
13699F28057k2239j9630p340M0716J02007J00776J00448O9303J16604J12885J27194
13688A348781J23401R5740J23042K00784J62091K28659K58623L48450L60303M27639
13678C677513M47724N63471Q99742J258474J622519J839439K048301K569619L680675
13669A8607477N691780R064724J5575024K7093603M6325975O7669467O1079704
13662B51107754K8019797j8825950o4627402o3875149m1221623k5165762j5319618
13655E0092047r504899o060944l856879k785260k626247l008287l287460k904224
13647A6057847k266737j761420j421842j106372r07292q02931o33696n53348m39381
$$ plain form
13711 374422 346610 353060 422169 451703 501780 533438 544588 560533 616691 672386 667384 628057
13699 628057 605818 586188 578848 619564 721571 822347 922795 992098 1108702 1221587 1348781
13688 1348781 1472182 1567922 1690964 1891748 2053839 2282498 2541121 2889571 3249874 3677513
13678 3677513 4125237 4688708 5588450 6846924 8469443 10308882 12357183 14926802 18607477
13669 18607477 24299257 33363981 48939005 76032608 122358583 190028050 251107754
13662 251107754 279127551 260301601 195674199 131799050 90577427 65411665 50092047
13655 50092047 40587148 34526204 30669325 27884065 25257818 22249531 18962071 16057847
13647 16057847 13791110 12029690 10607848 9501476 8594184 7791253 7157557 6604209 6164828
13638F164828l47439l20956k66634k28495l07991k49053k14829j84189n2982o4058
13628C928202k8224k3052J4805J45232J07039R618p8315q5767q1179k14809k44691
13617C448859k24892j53686q8589j04578j64596j82909k02379j99647j34301o1805
13607A931477o0752n9162k2640j0229k0758j7159l3867k4887r9360p4586p3126
13596A434951o5371j10663l6175R952r5766r2528l7359K3042j2020l0234j0128
13585I77701m2911k0296j09364l0503R080k6794J4141Q7558j5175o8484n1698
13574G23255p4751L4805L4903k7347j2723K1667k4928k7668k8562J7710K4502
13563F60863J7835n382N077L0806L4919M7917o942o4302l6771j0238m6979r080
$$ plain form
13638 6164828 5817389 5496433 5229799 5001304 4693313 4444260 4229431 4045242 3992260 3928202
13628 3928202 3899978 3876926 3891731 4036963 4144002 4153620 4075305 3989538 3908359 3693550 3448859
13617 3448859 3223967 3070281 2981692 2877114 2712518 2529609 2327230 2127583 1993282 1931477
13607 1931477 1870725 1811563 1788923 1778694 1757936 1740777 1706910 1682023 1582663 1508077 1434951
13596 1434951 1369580 1258917 1222742 1232694 1136928 1044400 1007041 1030083 1018063 987829 977701
13585 977701 934790 914494 805130 774627 783707 756913 771054 858612 843437 774953 723255
13574 723255 648504 683309 718212 690865 678142 699809 674881 647213 618651 636361 660863
13563 660863 678698 673316 678393 709199 744118 792035 785093 720791 684020 673782 626803 617723
13551F17723j4519M9935K4827J470K001J9792M8373o364r4848k9805m2403j9879
13539E56303k4914J1663O5942J5890l2243m737L5529l202k1388j1919j7084l4965
13527E34875n7105J5389K4611l5584k464L6183L4200K3337j2702q5782M6907j9003
13515E02862j39917j21705k1064M7417P8058n51j9800k4969O451M2052J8206o7499
13503B99541m9512p275K2970q773m122k1096j8455k5936N2115Q2481L5207m6612
13491C10533k1594M2672J6733J5753M123n7824q1779m2636K3075o0448J9182k7891
13479A39899Q075K0472L4463N6349N2843K8480k077m6059j11771p9684k4505J6954
13467I3439L67J2652L6122N0657L1641l2991j1822J8823J3098k089m0870L3269
$$ plain form
13551 617723 603204 653139 677966 679436 681437 701229 749602 743238 648390 618585 576182 556303
13539 556303 531389 543052 608994 624884 592641 587904 623433 620231 598843 586924 569840 534875
13527 534875 477770 493159 517770 482186 479722 515905 550105 573442 560740 474958 521865 502862
13515 502862 362945 241240 220176 267593 345651 345100 325300 300331 306782 348834 367040 299541
13503 299541 250029 242754 265724 256951 252829 231733 213278 187342 239457 321938 357145 310533
13491 310533 288939 331611 348344 364097 368220 310396 228617 185981 209056 148608 167790 139899
13479 139899 147974 168446 202909 259258 312101 340581 338504 292445 180674 100990 76485 93439
13467 93439 93806 106458 142580 193237 224878 191887 180065 198888 211986 209897 169027 202296
13455B02296L1006j3518o2627l2286q515j8111J4751K6905j8813j8695P8906L1210
13443B12509j36675n0253Q8908M5656l9033k5819K6350m3679M5884L2545j9793
13432A36600j00213l9733l0985P222j265J00275L0815q4923J9489J0951M6407
13421I4640n578j4581L6270j3234k3901r19n1978q4767K1003P2810L3789R295
13409G2849Q562l7680m5364L93Q7408N2958m6727j026N5938r071o3230J477n473
13396G1014L4344K92K515n1580o330J6299j8151K4445k8249R748K1414j4066k5461
13383C6234j5416J642j4468p162j7175l596K6558j0633J8941K962J6504k1810
13371A2581J65O75L4723K494J0134j85l673l950k1309l161j0473k4224L6311j2688
$$ plain form
13455 202296 233302 219784 157157 124871 116356 98245 112996 139901 121088 102393 181299 212509
13443 212509 75834 25581 114489 160145 121112 95293 121643 77964 123848 156393 136600
13432 136600 36387 -3346 -34331 -27109 -28374 71901 102716 17793 37282 48233 94640
13421 94640 89062 74481 110751 97517 73616 72697 20719 -64048 -43045 29765 63554 72849
13409 72849 81411 43731 -1633 -1240 86168 139126 92399 91373 147311 138240 75010 76487 71014
13396 71014 105358 105650 108165 56585 50255 66554 48403 72848 44599 54347 75761 61695 36234
13383 36234 20818 22460 7992 830 -16345 -19941 6617 -4016 14925 17887 34391 12581
13371 12581 12746 13421 48144 50638 60772 60587 56914 52964 31655 28494 18021 -6203 30108 17420
13357A7420M83J1274j6248n7054J5744K4232L6234K2132K347j2341o2546q618
13345b6941p263j3905j400L7809J3403k9462n4506M7256L359R065M3279N1555
13333G2249n869m9221k3552m0173J6491k5129j00282J8591R4471M1835K6900M5234
13321G1545j02207n7218P4683M8270l4620L3432p909j4370K5937j9485j9316l0388
13309c1646k3386j9543K3110J8243J0584K6276L8064L0431l0996J6027M4926m6177
13297E5913j7889m4173K0862Q9714l1303m428k5221j8782m9463k8177K9727L1595
13285H375P802N1140j3949l0660n321k5928M833l1728l8705J194N0821k539J2053
13272a2612j6331M1601j6164n3068L7234N022j1629J5754m1739J0750N3402l2401
$$ plain form
13357 17420 17903 29177 12929 -44125 -28381 -4149 32085 54217 56564 44223 -18323 -26941
13345 -26941 -34204 -48109 -49509 -11700 1703 -27759 -82265 -35009 -31650 -22585 20694 72249
13333 72249 66380 17159 -6393 -46566 -30075 -55204 -155486 -136895 -42424 -589 26311 71545
13321 71545 -30662 -87880 -13197 35073 453 33885 25976 11606 37543 18058 -1258 -31646
13309 -31646 -55032 -74575 -51465 -33222 -22638 3638 41702 72133 41137 57164 102090 55913
13297 55913 38024 -6149 14713 104427 73124 68696 43475 24693 -24770 -52947 -23220 8375
13285 8375 16177 67317 53368 22708 17387 -8541 -3708 -35436 -74141 -72947 -22126 -24665 -12612
13272 -12612 -28943 12658 -3506 -56574 -19340 -14318 -25947 -10193 -51932 -41182 12220 -20181
13260b0181j2305m1724k5382L6749K1017Q175J8638Q382j6676J3429N5844L4650
13248H0616J5001r3336o7193P9098M3909k4453j2377J8530J3040R067m0253m1327
13236a9678m4504N5963J0638l7344q6013L8641J4007J2866P0010O5742k3658l3691
13224B2979M6378R502j7199J7544l1950m0344M9672P462m1821K6587K2845L4979
13212A06634o821j4464K3546O304j6270n3725p9247N86O0629P051j2192L0978
13200E3009M8481m2453o7956k888L7552M0487m586k4072O5700O3993J6989j6067
13188A68189r521N6573P9858J05390J95743K41752K65245K53250J10484j96521
13178A270442k92434l00998k59828j08246l1592j7753q2632J3875Q087k9946l0800
$$ plain form
13260 -20181 -32486 -74210 -99592 -62843 -41826 -33651 -15013 -6631 -23307 -9878 45966 80616
13248 80616 95617 2281 -64912 14186 58095 33642 21265 39795 52835 61902 21649 -19678
13236 -19678 -64182 -8219 2419 -34925 -120938 -82297 -68290 -55424 14586 80328 56670 22979
13224 22979 69357 78859 61660 79204 47254 6910 56582 64044 22223 48810 71655 106634
13212 106634 99813 85349 108895 115199 98929 45204 -34043 -33457 27172 34223 22031 53009
13200 53009 101490 59037 -8919 -11807 25745 66232 61646 37574 103274 167267 184256 168189
13188 168189 158668 215241 295099 400489 596232 837984 1103229 1356479 1466963 1270442
13178 1270442 978008 677010 417182 308936 277344 259591 176959 190834 198921 168975 138175
13167A38175k1037m1045m7533J4501N5291R8015J4354p459L7927j2888q9031l2148
13155A07122j260J7058j1530l9725N187O0815j8838n3038j4836R725J6856J0710
13143H8246o2635N5530J9094k9294l1452j6209M4715L6722m1935q7460Q9109Q2247
13131A46678o3873m4723Q860M7004M5916J42q7355m5432L688n090k0657n081k7586
13118d7509L8584L2263L8181k3189L6605p196l7943l5094J8751L4653j1766r238
13106B7102L9752N9032K4433P301o7438q3943k9067K5665N1086k9188l3398J4517
13094E854j2869r925J0930K4362Q087m4733j6763Q3163J3016n573O3289N3276
13082A72114l2940n4960m2429l7687j2583k4491q386K0809M5663M2419n975q1337
$$ plain form
13167 138175 117138 76093 28560 43061 98352 196367 210721 203262 241189 228301 139270 107122
13155 107122 105862 122920 111390 71665 76852 137667 118829 65791 50955 60680 77536 88246
13143 88246 25611 81141 100235 70941 39489 23280 67995 104717 62782 -24678 64431 146678
13131 146678 82805 38082 46942 93946 139862 140004 52649 7217 10905 5815 -14842 -19923 -47509
13118 -47509 -8925 23338 61519 38330 74935 67739 29796 -5298 13453 48106 36340 27102
13106 27102 66854 125886 150319 157620 90182 6239 -22828 2837 53923 24735 -8663 5854
13094 5854 -7015 -16940 -6010 18352 26439 -18294 -35057 48106 61122 55549 118838 172114
13082 172114 139174 84214 41785 4098 -8485 -32976 -41362 -20553 25110 67529 61554 -19783
13070a9783k4865k7011J2500p583K7486J15195R769n4465k4277l2687k8408k1772
13058g5901J2945L7628J5804k2715j5322m590n217L5293m335o95j1060O772l3023
13045f4416j2846q29L6644p711L2211L696n0418K993P8966K3525J0992J0050L31
13032F3188O397p5119m4194P176P0979L252j8198q954P2255M0385k8533o5481
13020B3153o0542p521Q4748N9491k8969l7891M617R618j7244j0953M809k4782
13008a466m0251J2881O2645L2925n6253o1537L0509N3842K6910n2171j1020l4582
12996c7568j5165o539k9304M1878M7849j2595n9195M3437J5970j3940J2884K4943
12984A2655L8040L4468k8850j0777j4747o542J91J2771l9385K1970j4077k8989
$$ plain form
13070 -19783 -44648 -71659 -59159 -66742 -39256 75939 85708 31243 6966 -25721 -54129 -75901
13058 -75901 -62956 -25328 -9524 -32239 -47561 -52151 -57368 -22075 -26410 -27105 -38165 -31393 -64416
13045 -64416 -77262 -78091 -41447 -49158 -16947 -13251 -63669 -60676 18290 41815 52807 62857 63188
13032 63188 69585 -5534 -49728 -42552 28427 31679 13481 4527 76782 117167 88634 23153
13020 23153 -37389 -44910 39838 99329 70360 32469 37086 46704 29460 18507 23316 -1466
13008 -1466 -41717 -28836 33809 66734 10481 -51056 -20547 33295 60205 8034 -2986 -37568
12996 -37568 -52733 -59272 -88576 -46698 1151 -11444 -70639 -27202 -11232 -25172 -12288 12655
12984 12655 50695 85163 56313 45536 30789 24247 24438 37209 -2176 19794 5717 -23272
12972b3272P292J5909M1714l8558l1612O8048N3644J3710J2041j9753p1858m8228
12960b0923K9810L9344j0600m5346k5917l0055K4587J3721K6240l649k8173n162
12948c6123p013L6405O4k6967k8989l9235l7744O2516N2194J913L0896K9023j8743
12935A8197n5660K742J9939j3321l9184k760L8785k026j7400M3672J28384k9691
12923I1677q7969j7550J461L7033R338o625J4690l2594K2016L9185m8375r737
12911A2550N31o243l1961l5673J7129L2679j0j9177K150K8321K4542j0494l7742
12898b3398K8232K4830k0403R837k011m0393n6790q100Q5100j1624k1127J6891
12886a8956L9604P8830O5524j3416p7587k0906Q657k3650M462p741L9480o7870
$$ plain form
12972 -23272 -15980 -71 41643 3085 -28527 39521 93165 106875 118916 99163 27305 -20923
12960 -20923 8887 48231 37631 -7715 -33632 -63687 -39100 -25379 861 -2788 -30961 -36123
12948 -36123 -43136 -6731 -6667 -33634 -62623 -101858 -139602 -77086 -24892 -22979 7917 36940 18197
12935 18197 -37463 -34721 -14782 -28103 -67287 -70047 -31262 -33288 -50688 -7016 121368 91677
12923 91677 3708 -13842 -12381 24652 33990 27365 42055 9461 31477 70662 22287 12550
12911 12550 13081 6838 -25123 -60796 -43667 -10988 -10998 -30175 -28025 296 24838 14344 -23398
12898 -23398 4834 29664 9261 19098 17087 -23306 -80096 -88196 -3096 -14720 -35847 -18956
12886 -18956 20648 99478 165002 151586 73999 53093 61750 38100 42562 34821 74301 6431
12874F431k6339M5832o776o1839O673N1814k2055n148K7553L5439o094m9919j2544
12861a6972J932K2277j1761l5459n733j1805k8181j4520k9696O1576J06942m42
12849C8158j4285L2105k8357k9023k2824l8450J9791R809j0552K4749J1956Q111
12837A188R371j8112O392M5412M5231m367k4760j0579k4761K0541J2569l657L0396
12824H4864l1113l9491p439r728R004K7833L5384K7581o3872j1480l2628m4372
12812e5457k0522J3650M5233j2832J4306k422J4005M3664J3937k9463O76J1613
12800C6388p0962M6276j3512k5875j7667J3984l6641o2634j0518J6934k1134O480
12788a38881R1396L2075J9740l015n517k2351j845O8839M5186l7929m0064l0409
$$ plain form
12874 6431 -19908 25924 19148 -42691 -36018 15796 -6259 -11407 16146 51585 45491 -4428 -16972
12861 -16972 -15040 7237 -4524 -39983 -45716 -57521 -85702 -100222 -129918 -68342 38600 38158
12849 38158 23873 55978 27621 -1402 -24226 -62676 -42885 -33076 -43628 -18879 -6923 1188
12837 1188 10559 -7553 -1161 44251 89482 85115 60355 49776 25015 45556 58125 54468 84864
12824 84864 53751 14260 6821 -2907 6097 33930 69314 96895 33023 21543 -11085 -55457
12812 -55457 -75979 -62329 -17096 -29928 -15622 -18044 -4039 39625 53562 24099 24775 36388
12800 36388 -34574 11702 -1810 -27685 -45352 -31368 -68009 -130643 -141161 -124227 -145361 -138881
12788 -138881 -47485 -15410 4330 1315 -4202 -26553 -28398 40441 85627 47698 7634 -22775
12776b2775K0394O3909K3729p965N0001k8999o0326n6491j8605J0903K0829j2556
12764a7952L2172L1528l4685m9760J2286J2839J7325J4672m6843M4698L596K762
12752B2638Q200l655J24j9272K0047K4845o888R35J2964K6314L7840j8358r437
12739I6297l0694p180m3640r9793m1095j0850j2141J6507J6057L7691N407O472
12727f6962K1836n256j7652M3969J507j5360L4186P5094M9493m9935r363K11p186
12714E4582j7204L391l3174l5614P6953K8903J9420j5451J9487n7808k7836J1800
12702B7449J5223J6672l6301l0093j359Q892L5779J5820k0414k6097J7678K5686
12690D8935N58J8283o8865o6115O185j5822l721K8752m1337m0984k8201M0746
$$ plain form
12776 -22775 -2381 61528 85257 77292 127293 98294 37968 -18523 -37128 -26225 -5396 -17952
12764 -17952 14220 45748 11063 -38697 -26411 -13572 3753 18425 -28418 16280 19876 22638
12752 22638 30838 27183 27307 8035 28082 52927 46039 46974 59938 86252 124092 105734 96297
12739 96297 65603 58423 14783 -85010 -126105 -136955 -149096 -132589 -116532 -78841 -73434 -66962
12727 -66962 -45126 -50382 -68034 -24065 -22558 -37918 -3732 71362 120855 70920 61557 61768 54582
12714 54582 37378 40769 7595 -28019 48934 77837 97257 81806 101293 43485 15649 27449
12702 27449 42672 59344 23043 -7050 -8409 483 36262 52082 31668 5571 23249 48935
12690 48935 49493 67776 -1089 -67204 -61019 -76841 -80562 -51810 -93147 -134131 -162332 -121586
12678a21586k9837N0550L5683J4396J4460j783Q400J6787Q891k2163k6531O5264
12666A2531K7095J1428j2378o7524J7394J1378j2161N369k0300M679N4396k2769
12654I138k3425J0570j2583P001L7774M6599o0437j3008p3370j1674j9016K3528
12642g8903O4700N0266l7231k4428N2070J3115o2296n7975L7622j8267J7321P832
12630c6174N9338l5111o990Q7038j2158o5663l6491N987k221k3956j4777M7244
12618c3934J8k7502p1662K5866L8331l9638L1398N5439k9931o080J798K5737k9344
12605e9504L58K9322l8035J0628J1473k4766N9049M765n1178l5417M1965k264
12593e3604k8845L0641J7860M8004K9793n360p5883j8677P2780O7649j7824m6601
$$ plain form
12678 -121586 -151423 -100873 -65190 -50794 -36334 -38117 -29717 -12930 -4039 -26202 -52733 12531
12666 12531 39626 51054 38676 -28848 -11454 -76 -12237 -6868 -27168 -22489 31907 9138
12654 9138 -14287 -3717 -16300 -9299 28475 75074 14637 1629 -71741 -83415 -102431 -78903
12642 -78903 -14203 36063 -1168 -25596 26474 39589 -22707 -80682 -43060 -61327 -44006 -36174
12630 -36174 23164 -11947 -18937 68101 55943 -9720 -46211 -40224 -42445 -66401 -81178 -33934
12618 -33934 -33916 -61418 -133080 -107214 -68883 -108521 -77123 -21684 -51615 -57695 -55897 -30160 -59504
12605 -59504 -59146 -29824 -67859 -57231 -45758 -70524 -11475 -6710 -57888 -93305 -51340 -53604
12593 -53604 -82449 -51808 -33948 14056 43849 38489 -37394 -56071 16709 84358 66534 19933
12581A9933N078P6508J0287L2192l3135P935r186k0731k7251k5882L7946l3823
12569C9871P0730j0593m8909n3357P355K1029P500j9771K9549l1579k5589K6354
12557A2590K6035K3756M824m2567l7681L0031K3732M3069K9668j0548O554m4976
12545F4487L964k4428L9993R9154L5890j870q2571p7445m164K9755l9457n1948
12533h640J0484o112k8478L7851m611j7013N1246N710J1593J550J3534L2313K909
12520A02336J3886L9464k9872o1409m2487L0753J283k9108j0899P220J9111J4811
12508E5089L8204K2980K0984M505m6113K555L6645J72l7969k7969K9566m4055
12496E4594l8622N7725k9050k2864R8262N524j4699l2553r241M7141K8093k2389
$$ plain form
12581 19933 25011 101519 111806 143998 110863 118798 109612 88881 61630 35748 73694 39871
12569 39871 110601 100008 51099 -2258 5097 26126 33626 13855 43404 11825 -13764 12590
12557 12590 38625 62381 67205 24638 -13043 16988 40720 83789 113457 102909 109463 64487
12545 64487 68451 44023 84016 183170 219060 217190 134619 57174 53010 82765 43308 -8640
12533 -8640 1844 -4268 -32746 5105 494 -16519 34727 40437 52030 53580 67114 99427 102336
12520 102336 116222 155686 125814 64405 21918 52671 53954 24846 13947 21167 40278 55089
12508 55089 93293 116273 137257 141762 95649 98204 134849 135021 97052 69083 98649 54594
12496 54594 15972 73697 44647 21783 120045 125569 110870 78317 69076 116217 144310 121921
12484A21921L284l0444j5051K4113l8578l1004J9341J1197J25m6593k4281O2021
12472E6051J4273K6233Q3735J21563P5456K1683l6241r4122r3392k0234K8687
12461A83692o8525n1301K9963l9674M726J6784k2610K3874j917k5796n7168L8557
12449C0605K3373k9587j3366j7330P5244L231m5489p6190J0040M6669R360N977
12437B2537N42N027n7719K0342O1485L7946J4102K6435N8504P3115M3189m0954
12425B64551j26500l6387k0562O66J141m6134l2549n1120K3671k4688K6005j2874
12413c4780N308K9877L0482K7235n9910m0315l8760N6953M2652k8681J5890J6328
12401B2279J1857K4116o682K1314r3222n1395K23Q0203j9582j02152J03068Q3989
$$ plain form
12484 121921 125205 94761 79710 103823 65245 34241 53582 64779 64904 18311 -5970 56051
12472 56051 70324 96557 180292 301855 377311 398994 362753 268631 175239 155005 183692
12461 183692 115167 63866 93829 54155 58881 75665 53055 76929 75012 49216 -7952 30605
12449 30605 53978 24391 11025 -6305 68939 72170 26681 -49509 -39469 7200 16560 22537
12437 22537 23079 28106 -29613 -9271 52214 90160 104262 130697 189201 262316 305505 264551
12425 264551 138051 101664 81102 81768 82909 36775 4226 -46894 -23223 -47911 -21906 -34780
12413 -34780 -29472 405 30887 58122 -1788 -42103 -80863 -23910 18742 -9939 5951 22279
12401 22279 34136 58252 51570 72884 -20338 -71733 -71510 8693 -10889 -113041 -9973 74016
12389G4016m6736j3084k4303J9610k5774k4298j913M4856j2149k0070J05856l3249
12377D2762p2982M4978L6419L5758k77k9973m6917r652L318N1250k844l0788j8640
12364B412L3205J1223q341j6301n338J6596R091j9409n8276J0843J7897L5180
12352B8782J0793n5938p6194o0475K4869O2684R1776n458l9180k4062l0444O452
12340f6395K7747J0047J6020j1237k1767o1820L9663M6750l9699J1230N106K4909
12328a9446K0685n3956M3997P835k2222n2938L320J8277j1272j3536j3845K3037
12316g0064M8792K2785J9781M9959o4675n2912j0005l7845q4114P0221M2537o9555
12304a35095n3261M8438O4362J5966P804K7189m0714l3491r709N768R1032K7890
$$ plain form
12389 74016 27280 14196 -10107 9503 -16271 -40569 -42482 2374 -9775 -29845 76011 42762
12377 42762 -30220 14758 51177 86935 86658 56685 9768 116 3434 54684 51840 21052 2412
12364 2412 35617 46840 38499 22198 16860 33456 42547 23138 -35138 -24295 -6398 28782
12352 28782 39575 -16363 -92557 -153032 -128163 -65479 26297 20839 -18341 -42403 -72847 -66395
12340 -66395 -38648 -28601 -12581 -23818 -45585 -107405 -67742 -20992 -60691 -49461 -44355 -19446
12328 -19446 1239 -52717 -8720 -885 -23107 -76045 -72725 -54448 -65720 -79256 -93101 -70064
12316 -70064 -21272 1513 21294 71253 6578 -46334 -56339 -94184 -178298 -108077 -65540 -135095
12304 -135095 -188356 -139918 -75556 -59590 -51786 -24597 -65311 -98802 -108511 -102743 -11711 16179
12292A6179K8924j4053o2512R45j184m9708J1260M5836L6576P9635o8063J0656
12280C4491k7829j7426J6165j5566J4239m870k5851J02259l3517m4944J2837L0572
12268D0560l46n0007m8275p652J6877k2089J9319O3027J269K4376P644k7931K1252
12255C8024k8158j8909N131K8442n889j6378r430K2975j2588j6495k513l2544
12243d8332j7924r588M8029K7032L1908q692k1232n2765k6705k4377N166L4425
12231f3055O2138N0522L1802l8677m8627k0358M7890J8750q133o9877J9742O9151
12219E1268J3149m420q053l3773n8551L9173L0993l227n446M7174l6962n3931
12207b2606r9M2910k716L408M6513p880j8015N25O6726j1274J7111o7988o1576
$$ plain form
12292 16179 45103 31050 -31462 -30517 -31701 -81409 -70149 -24313 12263 91898 23835 34491
12280 34491 6662 -10764 5401 -10165 4074 -796 -26647 75612 42095 -2849 9988 40560
12268 40560 40214 -9793 -58068 -65720 -48843 -70932 -51613 11414 12683 37059 44703 16772 38024
12255 38024 9866 -9043 -3912 24530 18641 2263 -7167 15808 3220 -13275 -15788 -48332
12243 -48332 -66256 -75844 -27815 -783 31125 22433 1201 -51564 -78269 -102646 -97480 -63055
12231 -63055 -917 49605 81407 42730 -5897 -26255 21635 40385 32252 -37625 -17883 51268
12219 51268 64417 59997 51944 18171 -40380 -1207 29786 26559 21113 68287 31325 -22606
12207 -22606 -22705 20205 17489 20897 67410 59530 41515 42040 108766 97492 114603 46615 -14961
12194a4961q687j1263J7184K6118J7820k8045O4020N2458J0312L2599L0397N1312
12182B39264j2105o8447p4975l1653l1338l5355L3866R2093N7006m1120r9092
12171B8144k0056K9521n725k8831J3323M1381R109j7675l2528l0932p431M2621
12159B0921J7872J271m3072M1003N6128m2440j2158p897J821K2147k9412K1123
12147D7307J1805K7133M8536K3522P8690K9566O3446J63475J41947J1565q4433
12136E62559j03498k7591k383K434j5442j33184j00410n6068j7884M4032p9202
12125G3363m2008M7501j7208j0604j3235J0444L6899m769k3160J7229m4371N63
12113C0644N8356l3379k925o623K2229J3848M839L8285K1696m8270J287l340m866
$$ plain form
12194 -14961 -23648 -34911 -17727 8391 26211 -1834 62186 114644 124956 157555 187952 239264
12182 239264 227159 158712 83737 52084 20746 -14609 19257 111350 168356 127236 28144
12171 28144 8088 37609 31884 3053 16376 57757 66866 49191 16663 -14269 -21700 20921
12159 20921 38793 40064 -3008 37995 94123 51683 39525 31628 33449 55596 26184 47307
12147 47307 59112 86245 134781 158303 236993 266559 330005 493480 635427 646992 562559
12136 562559 459061 431470 429087 431521 416079 282895 182485 126417 108533 152565 73363
12125 73363 31355 78856 61648 51044 37809 48253 85152 80383 57223 74452 30081 30644
12113 30644 89000 55621 52696 46073 68302 82150 86989 125274 146970 98700 99987 96647 91781
12100I1781L5670R6844J27878J42368J33427K19388J58629K7952j2735q4213j27929
12089H09060j38168j62136j39372r7085o6011m9803m6472k7425j2302K9207M2512
12078A42005M1310J6570p6212o4778m139J4391j603j6774J6747J1712J8921k297
12066I5853K937J1553M0747K0936l009j1436k494K7509P595o2489R591O1578P788
12053B06659K0488R2839M4947N7725N7163K1476n9873n6277q7650m3185m4464
12042B09848J1523o8934n4866l9297j6667K5551L7888J6625k7022l5730K795L661
12030F5375k5009m5192J1827K0821N6900N3228R3791j1362J0835J4327l5884l4918
12018A74739R119n6541n8128P1800K4083O226n1936q0936J3572l728L045P645
$$ plain form
12100 91781 127451 224295 352173 494541 627968 847356 1005985 1033937 1021202 936989 809060
12089 809060 670892 508756 369384 272299 206288 156485 110013 82588 70286 99493 142005
12078 142005 183315 199885 123673 58895 54756 69147 67544 50770 67517 79229 98150 95853
12066 95853 98790 110343 151090 172026 169017 157581 155087 182596 190191 127702 137293 198871 206659
12053 206659 227147 319986 364933 422658 479821 501297 441424 385147 297497 254312 209848
12042 209848 221371 152437 97571 58274 41607 67158 105046 121671 94649 58919 61714 65375
12030 65375 40366 -4826 7001 27822 84722 137950 231741 220379 231214 245541 209657 174739
12018 174739 183858 127317 69189 140989 165072 171298 119362 38426 51998 48270 51315 58960
12006E8960K6455P2055J5794p5733K5176j3583j131j2860k6725K1960K9524o8584
11994E1308m2348Q5421L2819k6275Q582q332m5183k9188n800N4034m589k5952
11982D4497n191L6998L2297K983J0822R469p0138n3875N54j7257K4815K8851M2329
11969H7154K1224j3224p479l9312k5223k6153K7283K2336l3933L1784J7282k7675
11957C4064R1533K0902m7393J091k1865M5093J640j5723r628L4895r669p851m2728
11944G4361k3797K0167K3235L3173n3505o4022p189N8557k251J8872p048P151
11932G7704k3161m9171L5339M1360L8950n9390l9763q991K1747j207p8084M3137
11920a530L8212m5473j2096j699L8590O2996j5377l8251j8609k7178o7324L6504
$$ plain form
12006 58960 85415 157470 173264 97531 122707 109124 107993 95133 68408 90368 119892 51308
11994 51308 8960 94381 127200 100925 109507 101175 55992 26804 21004 75038 70449 44497
11982 44497 39306 76304 108601 111584 122406 131875 61737 7862 8416 -8841 15974 44825 87154
11969 87154 108378 95154 87675 48363 23140 -3013 24270 46606 12673 44457 61739 34064
11957 34064 125597 146499 99106 100197 78332 123425 125065 109342 99714 134609 124940 117089 74361
11944 74361 50564 70731 93966 127139 73634 9612 2423 60980 58729 77601 70553 77704
11932 77704 54543 5372 40711 82071 121021 61631 21868 12877 34624 33417 -44667 -1530
11920 -1530 36682 -8791 -20887 -22586 16004 79000 63623 25372 6763 -20415 -87739 -51235
11908e1235M5968k2760O4300O5042K9826m325j9576M661l8219N619K5840N3707
11896A58848l8684j0005M1369M0290L3512J0899l6673l4127m7074o7023l9132
11885A2200n0997k2993M4705M5998k381k7770k5868J0575N5379P5362j5640o6967
11873C1603k273k5181L4803O0082k9504k6089O504q956l8716L0686l0194p2855
11861g0090N0411N2099l421N2950K5514p096J5431L5434j456m0872l4670j0002
11849F4232J8091K1983O7130l0735n7483l9737q168J5213M3677p6782m9531L115
11837b8995j612J9382P355K5442P3561j5003J5136K505l853m688L8088k3856o4901
11824C8561L0461N6722L684J8826J0385j6597k6059m839L316j8838K5821J9134
$$ plain form
11908 -51235 -5267 -28027 36273 101315 131141 126816 107240 111901 73682 79301 105141 158848
11896 158848 120164 110159 151528 191818 225330 236229 199556 165429 118355 51332 12200
11885 12200 -38797 -61790 -17085 28913 26532 -1238 -27106 -16531 38848 114210 98570 31603
11873 31603 29330 4149 38952 99034 69530 43441 49945 40989 2273 32959 2765 -70090
11861 -70090 -19679 32420 28999 81949 107463 100367 115798 151232 149776 108904 74234 64232
11849 64232 82323 104306 171436 140701 83218 43481 35313 50526 94203 17421 -32110 -28995
11837 -28995 -30607 -11225 -3870 21572 95133 80130 95266 97771 93918 89230 127318 103462 38561
11824 38561 69022 125744 129428 148254 158639 142042 115983 111144 114460 95622 121443 140577
11812A40577p905P172M630n8108K2720M0622J5034q776o7425l0190j4635j6856
11800B6860J3998k905K990L9060P882J4775r088O143L4563M6025O4635R487n1217
11787B03208q4504j10915n7464k1029M8083P2492m01J1890M5115m7290j387m4958
11775A2840n659J3412Q293M35j1665K0869j7174k0210J6928P0333k7160k3726
11763C7516l4524K9184J0604j7182o2496m1722O933N5470J686L9371N8426J3619
11751I6885l309m6796j3973l1322j6459k0013L6777M5021j9497N281K3116M82
11739E6193j5766k1857M719p2718M7400M9497K578k611m4971N5169k1518n6705
11727b0590j5804P0016J6329o6033L4984J8457m9699K286Q655K0645P8484n7210
$$ plain form
11812 140577 132672 139844 144474 86366 109086 149708 164742 155966 88541 58351 43716 26860
11800 26860 40858 37953 40943 80003 87885 102660 93572 99715 134278 180303 244938 254425 203208
11787 203208 118704 7789 -49675 -70704 -22621 49871 49470 61360 106475 59185 57798 12840
11775 12840 7181 20593 28886 29321 17656 38525 21351 1141 18069 88402 61242 37516
11763 37516 2992 32176 42780 25598 -36898 -78620 -71687 -16217 -14531 24840 83266 96885
11751 96885 93576 46780 32807 1485 -14974 -34987 1790 46811 27314 32595 55711 56193
11739 56193 40427 18570 23289 -49429 -2029 47468 50046 47435 2464 57633 36115 -20590
11727 -20590 -36394 33622 49951 -16082 18902 37359 -12340 -10054 -1399 19246 97730 40520
11715D0520j02282K7136L523j1314K8835j4622l2011O917n2686k0337N4304J05407
11703C3390j2024J9363l3636n2611k8360O519M746l1316L1664Q184P8413K4870
11691D9202o3883j3239l6039o6225n010O4582K6136J4081J4407n087j47j121K8973
11678F630L2273K8130O756m7314n6910q719k1541O865M7179k1254l0855j8625
11666g7385l0051R85j8262J7133K8564m0611J2897Q3854j1734L7762L5909N4582
11654I3643l3449k9551j1174k8290n2421k3264K6650J8740j6213j9080j5316l4016
11642a23741K8442N0799j4945K2639K9621j0749J492O753L9661J231k1147l1262
11630b1206j6011Q7535J1194n9153j5184N4425K631k3058j5986l5122Q227M838
$$ plain form
11715 40520 -61762 -34626 -31103 -42417 -13582 -28204 -60215 -53298 -105984 -126321 -72017 33390
11703 33390 21366 40729 7093 -45518 -73878 -67359 -62613 -93929 -62265 -54081 24332 49202
11691 49202 -14681 -27920 -63959 -130184 -135194 -70612 -44476 -30395 -15988 -21075 -21222 -22343 6630
11678 6630 38903 67033 73789 26475 -30435 -39154 -60695 -53830 -6651 -27905 -58760 -77385
11666 -77385 -107436 -106451 -124713 -107580 -79016 -119627 -106730 -22876 -34610 3152 39061 93643
11654 93643 60194 30643 19469 -8821 -61242 -84506 -57856 -39116 -55329 -74409 -89725 -123741
11642 -123741 -95299 -44500 -59445 -36806 -7185 -17934 -16442 -9689 29972 31203 10056 -21206
11630 -21206 -37217 50318 61512 2359 -12825 41600 44231 21173 5187 -29935 -21708 -16870
11618a6870m2385J1281K4608M5911j1626N5835J53m2244j072m575N5968m5707
11606B9277q9062l6901P132K0421K5686M9961j7401j3376l1722q500j2472k4053
11594a01010l249K8917N3459l4938k0273L2503L8488M391j7757q5425k2712N5042
11582g2564M0375L0618N3700k258j066j3191L8268k3670k6660j2796M2729n0910
11570B575p8374j0138L0071N5328K5482M5744j6451k1044q332J3299m57K6056
11558F3759l0127m3575j9436J5508Q0718M7049o0486m3794K0765J5852j4964P189
11546C8458k5562l474K1111k2280n496k143j0025o6310M4848L4561L0983k4675
11534I996k5222L0234j0067M4887o2688K3911j505m1558k128k4154l95l532O0907
$$ plain form
11618 -16870 -59255 -47974 -23366 22545 10919 66754 66907 24663 23591 19016 74984 29277
11606 29277 -59785 -96686 -89554 -69133 -43447 6514 -10887 -24263 -55985 -64485 -76957 -101010
11594 -101010 -104259 -75342 -21883 -56821 -77094 -44591 -6103 -1712 -19469 -104894 -127606 -72564
11582 -72564 -32189 -1571 52129 49871 48805 35614 73882 50212 23552 10756 53485 2575
11570 2575 -75799 -85937 -55866 -538 24944 70688 54237 33193 24861 38160 37703 63759
11558 63759 33632 -9943 -29379 -13871 66847 113896 53410 9616 30381 46233 31269 38458
11546 38458 12896 9422 30533 8253 2757 614 -9411 -75721 -30873 3688 34671 9996
11534 9996 -15226 15008 4941 49828 -12860 11051 9546 -32012 -34140 -58294 -58689 -62221 -1314
11521a314Q658q111o2323n2441L8562k3656l8929Q6169L3420o5340o0690K3102
11509a22893L3054k452P638L4333M6537j6575n1387J0866q525L7299Q868L085
11497b0152n253O0115N339J073k8868J7250p0k3906m0942k5550k0968l3055n4990
11484a69977M8649J2646o32O0453N174j9461j2538m3614P738o594l683O1302L9023
11471b1514j7003k3814K5975O1751L0289j2489r0025m1917J5089n6142l7670M8879
11459a18591L2083O0625L1765o9506k6090M0067L4143M140j9149m5073o3069l237
11447a41892L7348J06928Q2100L6447j3536m1950p6108o89l7942k7894J0153L6736
11435c0299O0594j0066n520K4465j4573l5504M29j0260j4153K4271M798r070l0256
$$ plain form
11521 -1314 7344 -767 -63090 -115531 -76969 -100625 -139554 -53385 -19965 -85305 -145995 -122893
11509 -122893 -89839 -92291 -84653 -50320 -3783 -20358 -71745 -60879 -69404 -32105 -23237 -20152
11497 -20152 -25405 34710 40049 41122 12254 29504 29434 5528 -35414 -60964 -81932 -114987 -169977
11484 -169977 -121328 -108682 -109314 -48861 -43687 -63148 -75686 -119300 -111562 -118156 -121839 -60537 -21514
11471 -21514 -38517 -62331 -36356 25395 55684 43195 -46830 -88747 -73658 -129800 -167470 -118591
11459 -118591 -86508 -25883 5882 -63624 -89714 -49647 -15504 -11364 -30513 -75586 -138655 -141892
11447 -141892 -104544 2384 84484 120931 107395 65445 -10663 -11352 -49294 -77188 -67035 -30299
11435 -30299 30295 20229 14709 39174 24601 -10903 -10474 -20734 -34887 -10616 -5818 -14888 -45144
11422d5144L7311N7743l840m9381n117J6111j8235q32J5650o9042k1333m4597
11410a30706J5344O7681K7899M420O1675M4163R885q4612o5168q184k0355L5289
11398d2669O9804P848o0083M711O604r188j5393Q8N651j0918N2173K9484l9233
11385a121J6364K538l4305o1471J0590J0171K2639J4377J8427L4042n7302q7966
11373a13017J4367j3154R270O7425R0965q375m4267l2027K1092R0515j7367q7090
11361b1663m7549k9545m5708L2190N2115K6713L9043l188P0137j7736n4381L2670
11349C3098M2675Q5k9499n512r1302q1995j5113M6891J2319o172M9015O7226m411
11336A7305l0592J6161Q4124n896j6924o0556N29n2865n4009O9148M9062o070
$$ plain form
11422 -45144 -7833 49910 46070 -3311 -8428 7683 -10552 -11384 4266 -64776 -86109 -130706
11410 -130706 -115362 -47681 -19782 -15362 46313 90476 100361 15749 -49419 -57603 -77958 -42669
11398 -42669 27135 34983 -25100 -20389 -13785 -22973 -38366 -38278 -32627 -43545 8628 38112 -1121
11385 -1121 15243 17781 -16524 -77995 -67405 -57234 -34595 -20218 -1791 32251 -25051 -113017
11373 -113017 -98650 -111804 -102534 -35109 55856 47481 3214 -28813 -7721 82794 65427 -21663
11361 -21663 -69212 -98757 -144465 -112275 -60160 -33447 5596 2408 72545 54809 428 33098
11349 33098 75773 75858 46359 40847 -50455 -132450 -147563 -100672 -88353 -94525 -45510 21716 17305
11336 17305 -13287 2874 86998 81102 64178 3622 4151 -48714 -102723 -33575 15487 9417
11324I417l160n2625j0333O600M835j6944j9068k2625j65O1061K0531J2265K2297
11311A2086L5526K8382o1058n3174n454m8858k9170N6P034P488J1847L1753j1429
11298g4971m4244k7838M400K1974P5451M4760j4191k0883K292J8595n575k3981
11286d4211M223L9779o095m6422J2137k6782l5507r624K5938J1313K7375M4242
11274c634K6306J6849N8824l0458j2328k8652K6629L7298m568J4238J2645p8456
11262C4693l6681r486K7735j2030m7491n0476p952J03634N9559k5795l5470o302
11250f062m772l4175J1088O1358L9558n0560n1813q8843M394Q8618L667l3531
11238f1073o5784J5603J8303N7346O7226l1037k870m3100j9250k111k2568o7534
$$ plain form
11324 9417 6257 -46368 -56701 -50101 -45266 -62210 -81278 -103903 -104068 -43007 -22476 -10211 12086
11311 12086 47612 75994 14936 -38238 -43692 -92550 -121720 -121664 -114630 -107142 -95295 -63542 -74971
11298 -74971 -119215 -147053 -142653 -120679 -45228 -468 -14659 -35542 -33250 -14655 -20230 -44211
11286 -44211 -39988 -209 -6304 -52726 -40589 -67371 -102878 -112502 -86564 -75251 -47876 -3634
11274 -3634 22672 39521 98345 67887 55559 26907 53536 90834 86266 100504 113149 34693
11262 34693 -1988 -11474 16261 4231 -43260 -93736 -101688 1946 61505 35710 240 -6062
11250 -6062 -10834 -45009 -33921 27437 66995 16435 -35378 -124221 -119827 -31209 -27542 -61073
11238 -61073 -126857 -111254 -92951 -35605 31621 584 -2286 -45386 -64636 -66747 -89315 -156849
11226a56849N742K9181J0082M1858K7382K0547L7259P1423k9884m5076p6552o317
11214g1204R3466q436m4551j6394o004k4448N9793J3864l7074l9582j9291l6345
11202a36206m8147o19k4820O6210J31081k7774l7186q463M504m3909L4174K8226
11190f2929L6272L6063n1732l9534M2788J2710K7991K9825r471R271k0028K7444
11178C8670K7545j2626o7956R981K4977J0710J2619m0767k2453j8232P5888L6626
11166G4982j0221j9125j4050j2776j9170K0379N5307l1667q2554K8832L8501J0038
11154C8476k4196n7759M111Q8900M6705K0366k3333l9123l1744q0929n2048R0017
11142b0557N0426o4634p5288N1706k0974L45K1050J217J105L6928M936M9445J388
$$ plain form
11226 -156849 -151107 -121926 -111844 -69986 -42604 -22057 15202 86625 56741 11665 -64887 -71204
11214 -71204 22262 13826 -30725 -47119 -53123 -77571 -17778 -3914 -40988 -80570 -99861 -136206
11202 -136206 -184353 -184972 -209792 -143582 -12501 -40275 -77461 -85924 -81420 -125329 -91155 -62929
11190 -62929 -26657 9406 -42326 -81860 -39072 -26362 1629 31454 21983 31254 11226 38670
11178 38670 66215 53589 -14367 -4386 20591 31301 43920 3153 -19300 -37532 38356 74982
11166 74982 64761 45636 31586 18810 -360 20019 75326 43659 -38895 -10063 28438 38476
11154 38476 14280 -43479 -39368 49532 96237 116603 93270 54147 22403 -58526 -110574 -20557
11142 -20557 29869 -34765 -110053 -58347 -79321 -78976 -57926 -56709 -55604 -18676 -13740 35705 37093
11129C7093L0961j5205l5634J4506k7518m3276L4401K187m1882o49K8303j8881
11117c5594O3279r911l6648l9176J7216p04j1498L6447N6941K6133j6058m4974
11105E453m1397k0833p417P462O7815K2439J6843L1262j3818n1225m9910M8153
11093A4827O1461L7572m3718j05946m4977M7076P0753J06683K5068m5913n7377
11082F5509l9245K4871R126m585n1408j8209P7836K5503k5764k7245L3580j3712
11070E6257m2302k6101J0413k3965J4974k6665K7198M3428K9028L6506j4681n0332
11058C3758j1259j7641l0761k1578P8414N018k1604l5881m3649O3799n756n2992
11046f0132J4685L886j5411M754K6854R6582n031k9551p428J4654M397j6569k6440
$$ plain form
11129 37093 68054 52849 17215 31721 4203 -39073 -4672 -2485 -44367 -45016 -16713 -35594
11117 -35594 27685 17774 -18874 -58050 -40834 -41538 -53036 -16589 40352 66485 50427 5453
11105 5453 -35944 -56777 -64194 -56732 11083 33522 50365 81627 67809 16584 -33326 14827
11093 14827 76288 113860 70142 -35804 -80781 -33705 37048 143731 168799 122886 65509
11082 65509 26264 51135 60261 55676 4268 -13941 63895 89398 63634 36389 69969 56257
11070 56257 13955 -12146 -1733 -25698 -10724 -37389 -10191 33237 62265 98771 84090 33758
11058 33758 22499 4858 -25903 -47481 30933 35951 14347 -21534 -65183 -1384 -7140 -60132
11046 -60132 -45447 -41561 -56972 -52218 -25364 71218 66187 36636 29208 43862 48259 31690 5250
11033E250J578L2788M7676K0502K376L0551j1006j5792J452n3064m2279l1051
11021a1019L4369O2991j9716o2290j2870R0378r346L5813M5608M69o868m4813
11009A02706K6M7717l4331j0526J3511l1473m1286m9994K6317M7866J2435n3702
10997B9266K2091M5045r170o3183K414K2853O3312r466m5984J9892J0105M2K5539
10984A12756j5087k0697q319l9160P7638O79q7175n7698m8885l2443O9992L7417
10972a0982O572o151j0926Q495K3665k0751r532m9293p092N823M1588P8505j3667
10959C6254p9251j6724L4620j1777K5471K0057K8708k5422M1041N7879o3620l3014
10947A4222J1093N179N1703j7711k0967K4714N138k4679N0162L6958q152m4770
$$ plain form
11033 5250 6828 39616 87292 107794 110170 140721 129715 113923 115375 62311 20032 -11019
11021 -11019 23350 86341 66625 4335 -8535 81843 72497 108310 153918 154387 147519 102706
11009 102706 102732 150449 116118 105592 119103 87630 46344 -3650 22667 70533 82968 29266
10997 29266 51357 96402 87232 24049 26463 49316 112628 103162 57178 77070 87175 87217 112756
10984 112756 97669 76972 68653 29493 107131 107810 20635 -37063 -85948 -118391 -48399 -10982
10972 -10982 -4410 -10561 -21487 -12992 10673 -10078 -19610 -68903 -75995 -70172 -28584 49921 36254
10959 36254 -42997 -59721 -25101 -36878 -11407 8650 37358 11936 52977 110856 47236 14222
10947 14222 25315 30494 82197 64486 43519 68233 73371 48692 98854 135812 127660 82890
10935H2890K8799m4127r354n5867l1257o0462K678J5382k4494k2337L9399J01112
10923B2362K0322k7510k1611k2697k0887j3917K6269k7382L1804L2663L1377N5908
10911H6701K3396l5117r202q1781R552j9973o147M9381k3965L9318J1750l0998
10899A2915n159L1718J8040m981m6495j7622K8298j875n5804k5152q991m142j6195
10886i5445L3372R667M3974K1388L5908k8077l4266l1666K8671O3337J0612q42
10874E6633m3721l4538l7756K3822L8791M0006o0710q134K7945K0949p7028o3848
10862a17589N5527L1588J9506Q109l2112j1334J4963L2474O5238K9001l795n6934
10850C4642k6368N862J1609o1128l9889P2466P3944m8108k1723o44n8110O34K2592
$$ plain form
10935 82890 111689 67562 58208 2341 -28916 -89378 -86700 -71318 -95812 -118149 -78750 22362
10923 22362 42684 15174 -6437 -29134 -50021 -63938 -37669 -65051 -33247 -584 30793 86701
10911 86701 110097 74980 65778 -16003 -6451 -26424 -32571 16810 -7155 32163 43913 12915
10899 12915 7756 39474 57514 52533 6038 -11584 16714 14839 -40965 -66117 -75108 -79250 -95445
10886 -95445 -62073 -52406 -8432 12956 48864 20787 -13479 -45145 -16474 46863 57475 56633
10874 56633 12912 -21626 -59382 -35560 3231 43237 -17473 -25607 2338 23287 -53741 -117589
10862 -117589 -62062 -30474 -10968 -2859 -34971 -46305 -31342 1132 66370 95371 91576 34642
10850 34642 8274 14136 25745 -35383 -75272 -2806 71138 23030 1307 663 -57447 -56813 -34221
10837c4221L5409l637N67k7408m1607l2293p0094n8437L0222M7614n69K7062Q7233
10824d0159P9875j3617j3823j2344n3199J5027K2681J4745P6813K5446l2657j7848
10812E0940l1350o2116l5052k6585J9220L8613M7145M2779K5611K5416k5049j3661
10800E5911j4869n9006k1554L845L3138J0495o2257L9026O1325J4450n4235j9206
10788a2937m291L3335J7158k0309r354M1867k7614l9173l889L9871r626k3597
10776a8559L1753L71l791K3991K580J8325K6105P712O5754J01058N6564J625K7966
10763C41454J436K661j571O0688M7969J04409J55880K48723L40567N41435Q04974
10752B648625J401747K455415M132203M735733K948551J73673l545197m816999
$$ plain form
10837 -34221 1188 -2449 -1882 -29290 -70897 -103190 -173284 -231721 -201499 -153885 -154454 -127392 -40159
10824 -40159 39716 26099 12276 -68 -53267 -38240 -15559 -814 75999 101445 68788 50940
10812 50940 19590 -42526 -77578 -104163 -84943 -46330 815 43594 69205 94621 69572 55911
10800 55911 41042 -17964 -39518 -35673 -2535 7960 -54297 -15271 46054 60504 6269 -12937
10788 -12937 -17228 16107 33265 12956 3602 45469 17855 -21318 -25207 14664 5038 -18559
10776 -18559 13194 13565 9774 33765 36345 54670 80775 88487 154241 255299 311863 313488 341454
10763 341454 342890 345551 343980 404668 452637 557046 712926 961649 1302216 1843651 2648625
10752 2648625 4050372 6505787 10637990 15373723 18322274 18495947 14950750 10133751
10744A0133751l284305j984765j300011p96100m84267l97206k53588k33337j81249
10735A218923o8958m3309m0915J8624k981l6255Q6285J02551J0045m3290p9483
10724A121237o1992q3861j01718j15663p9260r110R436k8311l031n9321k9359
10713E59047j0210m415j8218q4971j159L2384Q811o8829q1230M6776q50j7315
10701C59821j0586J4589n824r523L7034j2961o4186r0388r147K6555j0577k7585
10689A97222l7586L993m1841J844J2593j5008r178p2987M9894L5801p444l0064
10677H7239k7149P356K6982P281M107q1774j1720L1407m0114O7M1260O0572L5319
10664A40833j7785j0411l9576p0832J1604L6709P043L8859M8835J7284p4553j6384
$$ plain form
10744 10133751 6849446 4864681 3564670 2768570 2284303 1887097 1633509 1400172 1218923
10735 1218923 1149965 1106656 1065741 1084365 1081384 1045129 1131414 1233965 1244010 1200720 1121237
10724 1121237 1059245 975384 873666 758003 678743 669633 679069 650758 647727 588406 559047
10713 559047 548837 544422 526204 441233 440074 472458 481269 412440 331210 377986 377136 359821
10701 359821 349235 363824 358000 348477 385511 372550 308364 217976 208829 235384 224807 197222
10689 197222 159636 163629 121788 123632 136225 121217 112039 39052 88946 124747 117303 87239
10677 87239 60090 67446 94428 101709 105816 24042 12322 43729 3615 3682 44942 105514 140833
10664 140833 123048 112637 73061 2229 13833 50542 57585 96444 145279 162563 88010 71626
10652G1626j1720m2024n1961M641k049o2577j2476O6143J1447K6170O4J5439j407
10639A1316K23j2653j4251M3541M2016R281j7613l0121j5519p3760J6102Q9251
10627D7813K513m4295k9842n5829M688M7162M2284J2721J1929P047m6126j2541
10615a2476P3832P8167j3095m4552l4822r0904o490O1512l3850N08J6946J411
10603c813J5677m0329j8610L546K1848j174l7030K6275J2313l6089M2227K0865
10591E706l2895n6048q8307M2238P6179P2389K4862J2964J7854o0728m5784k146
10579c3716R214k0195n4976K7334L3413k4523N2081K8461j313Q040m8450l0422
10567e5052K9547P9281L0989J2178n1652k3753l4387l7942m574J2631k2578L3227
$$ plain form
10652 71626 59906 17882 -34079 -29438 -31487 -94064 -106540 -40397 -28950 -2780 -2716 12723 11316
10639 11316 11539 -1114 -15365 28176 70192 79473 61860 31739 16220 -57540 -41438 47813
10627 47813 50326 6031 -23811 -79640 -74952 -27790 14494 27215 39144 46191 65 -12476
10615 -12476 61356 139523 126428 81876 47054 -43850 -50340 11172 -22678 -22170 -5224 -3813
10603 -3813 11864 -28465 -47075 -43529 -21681 -22855 -59885 -33610 -21297 -57386 -15159 5706
10591 5706 -27189 -83237 -171544 -129306 -53127 19262 44124 57088 74942 14214 -31570 -33716
10579 -33716 -24502 -44697 -99673 -72339 -38926 -63449 -11368 17093 15780 23820 -24630 -55052
10567 -55052 -25505 53776 84765 96943 45291 21538 -12849 -50791 -55365 -42734 -65312 -32085
10555c2085L1314P198j1742k3415j9660n2825K4923K5451K7342n180N2389p687
10543A6023p0235J6910R8926L4610j9087M1621K6787K2747m7327M030k3195k4616
10531G7194J4690K5460P171L349J2010r001J0436j2594k1200Q8183K2490o5202
10519A52986o3185k0845l3383r91L978l5967K0149O227L5559L7656l1337m9317
10507B1530k0886k6465K5697P9619K9884p1508q3056J3000j972N2688L1724j6837
10495C3418k6457k3554o595K3734K9265J8263M4064j6795j17040r3947j3160M2460
10483a06344j8350Q3449P7756j3929k9895R582p862j9930m923l0797J4193P0458
10471B3408N030m3770j1130K0624m69o4080k6847L7968l2401n2649k4491l864
$$ plain form
10555 -32085 -771 6427 -5315 -28730 -48390 -101215 -76292 -50841 -23499 -28679 23710 16023
10543 16023 -54212 -37302 61624 96234 77147 118768 145555 168302 120975 125005 101810 77194
10531 77194 91884 117344 124515 127864 139874 130873 141309 128715 107515 195698 218188 152986
10519 152986 89801 68956 35573 34582 38560 2593 22742 28969 64528 102184 70847 21530
10507 21530 644 -25821 -124 79495 109379 37871 -45185 -32185 -34157 18531 50255 33418
10495 33418 6961 -16593 -23188 546 29811 48074 92138 75343 -41697 -135644 -148804 -106344
10483 -106344 -124694 -41245 36511 22582 -7313 2269 -5593 -25523 -30446 -61243 -47050 23408
10471 23408 28438 -15332 -26462 -5838 -6307 -70387 -97234 -59266 -91667 -144316 -168807 -172671
10459a72671M648r937Q3165J5430O102O4348L92q148J144r91l5400m5203K4574
10446g2547M0704j6294j179L800k4210M4753k0694J9573M9724j4907n7589r2716
10434a41582R710L2914O6633j7940o5013M2191J4917j2093j3731L5274K8593k1945
10422d2072m6393L6543l0540j1303J2802P2807m4758p4394k1388P4150M0827O1438
10410B7719P9766l1632r6698q4556j3020O2596r552j8125j9570k6131L7265K1575
10398g0363n3593M342o252j9897L3496J5393l1744j2162j1498N7064Q7481k7041
10386c4774k2927p926r11L991j0627L4857N8905l4040L361Q48l0665L7840M0659
10373C8591k2979j7736l8703r755J2297J8025l8234l1803L9705L6064L5217j4530
$$ plain form
10459 -172671 -168023 -177960 -94795 -79365 -73263 -8915 -8523 -16671 -15527 -16518 -51918 -97121 -72547
10446 -72547 -31843 -48137 -49316 -45516 -69726 -24973 -45667 -26094 23630 8723 -48866 -141582
10434 -141582 -131872 -98958 -32325 -50265 -115278 -73087 -58170 -70263 -83994 -48720 -20127 -42072
10422 -42072 -88465 -51922 -82462 -93765 -80963 -8156 -52914 -127308 -148696 -74546 -33719 27719
10410 27719 107485 75853 -20845 -105401 -118421 -55825 -65377 -83502 -103072 -129203 -91938 -70363
10398 -70363 -123956 -119614 -125866 -145763 -112267 -96874 -128618 -140780 -152278 -95214 -7733 -34774
10386 -34774 -57701 -65627 -66538 -62547 -73174 -38317 20588 -13452 -10091 -9243 -39908 -2068 38591
10373 38591 15612 -2124 -40827 -50582 -38285 -20260 -58494 -90297 -50592 -14528 20689 6159
10361F159k1412j0513O779J8771M5130M638k2301m137l1534j5638m5518j4358
10349h3934n697Q05P5093J5292K7002L6038l3859k6865L0004L0807n169n0558
10337H959M2078K8371j4549n3140J9522J1294k7297k5653M0655M5708k5781k392
10325D7775k1331j5413K5073K6966k1900J169k972p4977k3533j8119J3931L2393
10313c0938k1894J7857L4165L3239M2952K6212L3031k4967p0005l7208m7675m9127
10301i4358k492O7947m128k2020P703L1354K0875O523J2302l7898l5238j0651
10289f0081j8281J8123M409o79J8568L9233k5115l782J2012J8476j6607p4903
10277h8627j9490j616L269q662L424M1400M8418j9821k281o959L5432M6223O341
$$ plain form
10361 6159 -15253 -25766 -18987 -216 44914 49552 27251 23114 -8420 -24058 -69576 -83934
10349 -83934 -89631 -88826 -13733 1559 28561 64599 30740 3875 33879 64686 59517 8959
10337 8959 51037 79408 64859 11719 31241 42535 15238 -10415 30240 75948 50167 47775
10325 47775 26444 11031 36104 63070 41170 42339 39367 -35610 -59143 -77262 -63331 -30938
10313 -30938 -52832 -34975 -810 32429 75381 101593 134624 109657 39652 2444 -45231 -94358
10301 -94358 -96850 -28903 -33031 -55051 -47348 -15994 4881 11404 23706 -14192 -49430 -60081
10289 -60081 -78362 -60239 -55830 -56509 -37941 1292 -23823 -27605 -15593 2883 -13724 -88627
10277 -88627 -108117 -109733 -106464 -115126 -111702 -70302 -21884 -41705 -43986 -50945 -15513 30710 37051
10264C7051P676m5030l4040k6399m4524J0678l9809l9045N8145P6434K2060m7261
10252f4064K5123J1660j1057J5705j2362n0147k6759k958L2851K1847L9190K0562
10240d09k9897j3734J3076M7785Q929m5126p72N5026o5012m5982l1954L0878K4969
10227e2223K4431l965N644O130k7262m4066q732K4180l1138p244j2754L4662K8706
10214f3631R619p968k2592J8943k1490m3274K8308K4599M4007L104O684Q346L4160
10201A8815n9294l649l6573k7411M0515r169J5692M334j1142m1123J5432K6242
10189f7331J7985P1802K8654j6485M49L5298k0498j12366p2316K8732N3745M9008
10177c323M4661K9444j0818o1292l6255m364j2845n6206m0721L9805P5301n73
$$ plain form
10264 37051 44727 -303 -34343 -60742 -105266 -94588 -134397 -173442 -115297 -38863 -16803 -64064
10252 -64064 -38941 -27281 -38338 -22633 -34995 -85142 -111901 -114859 -82008 -60161 -20971 -409
10240 -409 -30306 -44040 -30964 16821 25750 -19376 -20148 34878 -30134 -76116 -108070 -77192 -52223
10227 -52223 -27792 -31757 -26113 -19983 -47245 -91311 -100043 -75863 -107001 -114245 -126999 -92337 -63631
10214 -63631 -54012 -61980 -84572 -65629 -87119 -130393 -102085 -77486 -33479 -30375 -23691 -15345 18815
10201 18815 -40479 -44128 -80701 -108112 -67597 -76766 -61074 -56740 -67882 -109005 -93573 -67331
10189 -67331 -49346 22456 51110 34625 35074 70372 49874 -62492 -134808 -106076 -52331 -3323
10177 -3323 41338 70782 59964 -1328 -37583 -41947 -54792 -110998 -151719 -111914 -36613 -37186
10165c7186j1172N9005J7858k2756M0383m8441n8108j963K6270k1427M0409J2345
10153d783j1644k7848m5411L8680M7057j16L887M4658L1539j2851p0059j6734
10141b3625L4977k3025j7641K9348m2538m6630R5712J7696j9332l9910o510J6906
10129b4572K3765M8136J1260J7166k7019M554j1022P202N0139m8207o5823j2031
10117b6452J5008n480o1049J2526N2029O7832L5373n8587l5337j837L9253j1607
10105B1672n378K18R973o504j9169L0279j5105n3403J4681o2788O2476P3842J4756
10092F5550J6601J851j1982m7882M4391K8479k9200K2477J6367k8375k6195l3953
10080A8129k5462j8297N641L1085P3809J5917l0658K1173j8683m2261K2206N8740
$$ plain form
10165 -37186 -48358 10647 28505 5749 46132 -2309 -60417 -62380 -36110 -57537 -17128 -4783
10153 -4783 -16427 -44275 -89686 -51006 -3949 -4065 -178 44480 76019 63168 -6891 -23625
10141 -23625 11352 -11673 -29314 34 -42504 -89134 6578 24274 4942 -34968 -41478 -24572
10129 -24572 -807 47329 58589 75755 48736 53290 42268 49470 99609 51402 -14421 -26452
10117 -26452 -11444 -16924 -77973 -65447 -13418 54414 89787 31200 -4137 -5974 33279 21672
10105 21672 16294 16512 26485 19981 812 31091 15986 -37417 -22736 -85524 -23048 50794 65550
10092 65550 82151 84002 72020 24138 68529 97008 67808 90285 106652 78277 52082 18129
10080 18129 -7333 -25630 -19989 11096 84905 100822 70164 91337 72654 30393 52599 111339
10068A11339j747k931m4406k6692n3793J5838J1773K3469J6250l6261M9823L4523
10056I7185K3396Q7268j6343N8679J22515K36077L56763K52508P4673j55129k75879
10045H61713k45055j86395r0079p5025m2604q7105j8784K0845m5304P2127L8340
10034B02674l0770l1018r3820K4776N2682L0116o1181k412l5029j7395L0352M3187
10022A12162K0318j5569K6810J5280p0666m2926o87r929K7168j256m3028j148
10010A6529N0782l2371m6108j7259J8947Q815L2723j4800l3485N062n695j3691
9998c0551o407M5985Q8765N113o3706n0182M8855M0755j8097j0818l4313o5910
9986e0511k0639Q3848O4335O5587J1743j03749J5537K0494l8977j708L7397l1783
$$ plain form
10068 111339 109592 106661 62255 35563 -18230 -2392 9381 32850 49100 12839 62662 97185
10056 97185 120581 207849 191506 250185 372700 608777 965540 1218048 1292721 1137592 861713
10045 861713 616658 430263 340184 265159 222555 135450 116666 137511 92207 164334 202674
10034 202674 171904 140886 47066 71842 124524 154640 93459 91047 56018 38623 68975 112162
10022 112162 132480 116911 143721 159001 88335 45409 44722 34793 61961 60705 17677 16529
10010 16529 67311 34940 -11168 -28427 -9480 -665 32058 17258 -16227 -11165 -16860 -30551
9998 -30551 -36958 9027 97792 102905 39199 -10983 37872 78627 60530 49712 15399 -50511
9986 -50511 -71150 12698 77033 142620 154363 50614 66151 86645 47668 45960 83357 51574
9974E1574l6890m0346k1589O5256O4664N2449k1109k9673M2501j5183o4381k7220
9962B0053O093K9986M8077M8308n8867q8343k8014P2330o655j2578Q537l8837
9950I0m5548k5337M5316o770M9742p269l8674M9531Q7411j540j6560m6353l0929
9937A3110L8107K1246j5665J6990l973n1608k3523q701R730n558l1251Q049m60
9924c3507p458J072l7383N5628J25160o608o7809j7377L099N8756k9436k7684
9912A6453j1294M2034P557n1258m6204l9205K6092M3509K6585J9310o0783n161
9900c2365l8893J0058Q3702O7833J5583o9486l5965j0601L4213N0038J2713l6803
9888E0027m3847L2808J8464o5603M5731m5341l5895J5850K3343K2886o1085J6154
$$ plain form
9974 51574 14684 -25662 -47251 18005 82669 135118 114009 84336 126837 111654 47273 20053
9962 20053 26146 56132 104209 152517 93650 5307 -22707 49623 42968 30390 38927 90
9950 90 -45458 -70795 -25479 -32249 17493 10224 -28450 21081 108492 106952 90392 44039 13110
9937 13110 51217 72463 56798 73788 69815 18207 -5316 -14017 -4287 -9845 -41096 -33047 -33507
9924 -33507 -40965 -39893 -77276 -21648 103512 96904 29095 11718 14817 73573 44137 16453
9912 16453 5159 47193 54750 3492 -42712 -81917 -55825 -12316 14269 33579 -27204 -32365
9900 -32365 -71258 -61200 22502 90335 105918 36432 467 -10134 24079 74117 86830 50027
9888 50027 6180 38988 57452 -8151 37580 -7761 -43656 -27806 -4463 18423 -42662 -26508
9876b6508N5541P8652j5838p2313o4951J0924K9755L2561J8644M782j5575q913
9864B6761O4174L2361n7105n0563K3159N6924M1808n4784n0384m1829o6154l2807
9852a08439kP5315N9423L81L2967n4350K799L2944k245j1615p103k1145o0218
9839f1288n045j730K7790j1270L8436O9678j7679j7239K0543k3035J5508O299
9827D0968m1157m5517K5317N5812L5244L193j1459l5680j5263L1028m0018q54
9815A614K2948m488q14q106j2515p1281M5970N1984Q88M909J5058N977J6321K5873
9801I4338n6068j34q527n100j1481N0162J3304K4773K3088l5167M2924j6510L028
9788A18630k2760m3369R677k7730L0781J0843J2076N7891Q473J6176L6920j4925
$$ plain form
9876 -26508 29033 107685 91847 19534 -45417 -34493 -4738 27823 46467 51249 35674 26761
9864 26761 90935 123296 66191 15628 38787 95711 137519 82735 32351 -9478 -75632 -108439
9852 -108439 -108441 -33126 26297 26678 59645 5295 8094 41038 38793 27178 20075 -1070 -61288
9839 -61288 -66333 -68063 -40273 -51543 -13107 56571 38892 21653 42196 19161 34669 40968
9827 40968 -189 -45706 -20389 35423 70667 73860 62401 26721 11458 42486 2468 1614
9815 1614 24562 20074 19260 11154 -1361 -72642 -26672 25312 26200 31109 46167 52144 68465 94338
9801 94338 38270 38136 29609 24509 13028 63190 76494 101267 124355 89188 132112 115602 118630
9788 118630 95870 52501 62178 34448 65229 76072 88148 146039 154512 170688 207608 192683
9776A92683l4797p4685m9593L3449l072n6291o0699k0390J5268K8808M8756K1113
9764D0550k112J5677L1723J399L1136M7417n8614j07825l5777l6809M5522N5523
9752B7810n097k478M9588K6223n129N8618N1602Q630Q63m1645m6463L1393L126
9739A57041q869K848l6804L1522L5067K3799Q856m681j8577M8664p108l7289k0062
9726A74407j1427o7631p003K5019L4620M198J3870j0666k0811J4272j1740l1210
9714A05898m5023m5643k8927l9533P7745M1596l4355K7538K6558J0927k5388K2127
9702I3520L1681N7440m9690n8408l4350L8535O4794J9124l059j0253L735N0472
9690B03541L9823L141m9680l9013j8074m1559J2141K871n5908j6784R022K4040
$$ plain form
9776 192683 157886 83201 33608 67057 63985 7694 -53005 -73395 -58127 -29319 19437 40550
9764 40550 38438 54115 85838 87237 118373 165790 107176 -649 -36426 -73235 -27713 27810
9752 27810 22713 20235 69823 96046 90917 149535 201137 209767 210630 168985 122522 153915 157041
9739 157041 148172 151020 114216 145738 180805 204604 213460 208779 190202 238866 231758 194469 174407
9726 174407 162980 95349 88346 113365 147985 152183 166053 155387 134576 148848 137108 105898
9714 105898 60875 15232 -13695 -53228 24517 66113 31758 59296 85854 96781 71393 93520
9702 93520 125201 182641 132951 74543 40193 78728 143522 162646 159587 149334 153069 203541
9690 203541 243364 246505 196825 157812 139738 98179 110320 113191 57283 40499 49521 73561
9678G3561L5575J4638J0362J6325l5355K530Q146J7891o702k7137j3250O945p27
9665A02802j9385M7315O3691K7707M6302q998l1572p0106j0425N2369M2156k6750
9653B15106o9330p3058N8575j6224J1952k3013o4747r711L6862K5487l1640J2144
9641G2403L527j8075J8309O2590l349m2839m4539j9012K0610j8828j1455m0531
9629b1189j3899m398L1o19M3552K7238N0473K6900L7176j8868n1977L0593r917
9616I5096N275k0222N6805K8219M229l5803J9990j9218l693O606q694J8155j9031
9603A27714n3628j0185m4045l2042N6199M749k999p6072L4606N9578J1333n5872
9591A9336n7193J4555K4755Q6589M4903J6798J8474K3549k6802q3826p0163M7477
$$ plain form
9678 73561 109136 123774 134136 150461 115106 117636 125782 143673 136971 109834 96584 103529 102802
9665 102802 83417 130732 194423 222130 268432 259434 227862 157756 147331 199700 241856 215106
9653 215106 145776 72718 131293 115069 127021 104008 39261 29550 66412 91899 60259 72403
9641 72403 75930 57855 76164 138754 135405 92566 48027 29015 49625 30797 19342 -21189
9629 -21189 -35088 -39486 -39455 -40074 3478 30716 81189 108089 145265 126397 74420 105013 95096
9616 95096 100371 80149 136954 165173 169402 133599 153589 134371 130678 137284 128590 146745 127714
9603 127714 74086 63901 19856 -12186 44013 48762 45763 -30309 4297 63875 75208 19336
9591 19336 -37857 -23302 1453 88042 132945 149743 168217 191766 164964 81138 10975 58452
9579E8452N6620k3984n2139k8291J823L7608M021K1875L2037M9884L2740j9256
9567A71390l4939K7926n9620r242j0422L6404m7952J1568r19L0739l7585k8130
9555D9218m4309n2979J7162P1965L2064m900l8428L2217j933K0830J6221J04702
9543B01830O6938l0761J7380N668q5904p4518n3553n1243K2639M6343L6396M6294
9531A47509Q284k7684N989p5835l1543j1723N6767P8111M4043l5829J301L2092
9519A91482O88n701m6574l6422l7702p5307m7448M1669M1182M6614K7689k2367
9507G7803p0245m715R3971O613R757n6445k3477M504K5203l9248j811l727J2895
9494C1078L9368j543K8163K9904k7463J242O553J7431N13O190o8052M5323M168
$$ plain form
9579 58452 115072 91088 38949 10658 12481 50089 54110 75985 108022 157906 190646 171390
9567 171390 136451 164377 104757 95515 85093 121497 73545 85113 84194 114933 77348 49218
9555 49218 4909 -48070 -30908 41057 73121 68221 29793 62010 60077 80907 97128 201830
9543 201830 268768 238007 255387 261055 175151 100633 47080 -4163 18476 64819 101215 147509
9531 147509 155793 128109 134098 58263 26720 14997 71764 149875 193918 158089 159390 191482
9519 191482 192170 186469 139895 103473 65771 -9536 -56984 -15315 25867 72481 100170 77803
9507 77803 7558 2843 96814 103427 113184 56739 33262 37766 62969 23721 21910 18183 31078
9494 31078 70446 68903 97066 126970 99507 100749 107302 124733 125246 131436 63384 108707 112875
9481A12875K559L996j7947K1593M9135L0700j7445o232J306N054l5649O0087O779
9468B16811m3188j4860M4891k6550j7042K7053j1645j4213m4081l5629J7152J6133
9456A14832N6579N0042L36N6414L8299m8243q496J0892n473P4246J35851J92135
9444F67414Q9578j3422l8264l3858r7911j32199r5153q677M7098K5826m8610l7244
9432C24578o9741K495k0766R043j6433O1056j4095l8158l21k4561l0536P280p1543
9419A18298l6203j1079P0472K3420o4695J804O796k690N1955k4449m8644j3009
9407G1976N2393N1658l8426m665k488l313M3944j8395j7732l6954O1462M8863
9395B08323L5740j1026K4068k4721K4469J8599n381M774J888L7248N355L3978
$$ plain form
9481 112875 115434 119430 101483 123076 172211 202911 185466 179234 180540 185594 149945 210032 216811
9468 216811 173623 158763 203654 177104 160062 187115 175470 161257 117176 81547 98699 114832
9456 114832 171411 221453 221789 278203 316502 268259 259763 270655 265182 339428 475279 667414
9444 667414 756992 743570 705306 671448 573537 441338 346185 337508 384606 410432 361822 324578
9432 324578 254837 257332 236566 245609 229176 290232 276137 237979 237658 213097 182561 189841 118298
9419 118298 82095 71016 141488 164908 100213 102017 108813 106123 158078 133629 84985 71976
9407 71976 124369 176027 137601 132936 130448 127135 171079 152684 134952 97998 159460 208323
9395 208323 244063 233037 257105 232384 256853 275452 270071 274845 276733 313981 319336 353314
9383C53314l0091O332L3305N4141L3510N9519O2660r377N8384M999l9755q6121
9371E00820J971l9273j5744o2488l7074K3787K2891L5027n931k1772n0890j3682
9359C37642K3314M3158Q642k7430k4235o0483k8912M3408k858L6453P564q229
9347C48034l1475p4847k1868J4652M157m0816m1766J3875O0814K818j7625M8607
9335B64560K5337L3053k1487k2344k7181K36Q82n539J6678J8544o7290q4999l5098
9322I5352l7567r093Q611k1586R692l2247J0615M9742P4775j3605k8838r346l1639
9309F4866l3754L414N858R869n166l0258N6021j6630J6900M1142M6356r435J6752
9296A65935n528K4764K6739m2083O066o472N474l8653K1870M2322L305l0253p9945
$$ plain form
9383 353314 323223 329555 362860 417001 450511 510030 572690 563313 621697 626696 586941 500820
9371 500820 502791 463518 447774 385286 348212 371999 394890 429917 423986 402214 351324 337642
9359 337642 360956 404114 412756 385326 361091 300608 271696 315104 312246 348699 356263 348034
9347 348034 316559 241712 219844 234496 238653 197837 156071 169946 230760 233578 215953 264560
9335 264560 289897 322950 301463 279119 251938 252174 253056 247517 264195 282739 215449 130450 95352
9322 95352 57785 48692 57303 35717 45409 13162 23777 73519 148294 134689 105851 96505 64866
9309 64866 31112 34526 40384 50253 45087 14829 70850 54220 71120 112262 158618 149183 165935
9296 165935 160407 185171 211910 169827 175893 169421 174895 136242 158112 200434 203739 173486 93541
9283I3541j2449K1639P844R728J2020M1110R270m6036l244M9676l5625q3746n1335
9270A2393J7333J02408k063J3457j9827l8021K1605J7076M794m6540m3510N9763
9258I8868J535k8041J6724N5686K8448O668m2589O375o6593j658K0455M1056L2878
9245A69812J9209k2256p370m3975m2840K7450J2212k3449j3033j4984K0592J1131
9233I2499O497m4673p5507L2498Q1037N7671l9450q4456j5921M9856k410N4215
9221A11856L8245L1154L0794m2315j8303N0583R066K5796J6440J2284o2562q8821
9209A14217J0152j3464k8759j6876J6859L3201N4621j7833L1847k3261Q435m14
9197A68725r080J300r385L3069J5331L8432j7300j3795P661K2233l306Q358j7360
$$ plain form
9283 93541 81092 102731 110575 120303 132323 173433 182703 136667 133423 183099 147474 63728 12393
9270 12393 29726 132134 130071 143528 123701 85680 107285 124361 129155 82615 39105 98868
9258 98868 100403 72362 89086 144772 173220 179888 137299 143674 77081 75423 95878 136934 169812
9245 169812 189021 166765 159395 115420 72580 100030 112242 88793 75760 60776 81368 92499
9233 92499 98996 54323 -21184 11314 92351 150022 110572 26116 10195 60051 57641 111856
9221 111856 150101 181255 212049 169734 151431 202014 211080 236876 253316 265600 203038 114217
9209 114217 124369 110905 82146 65270 82129 115330 169951 152118 183965 160704 169139 168725
9197 168725 159645 160945 151560 184629 199960 238392 221092 207297 214958 237191 233885 242243 224883
9184B24883K3566q416l0791J9410m55j8976N2346l6737o6836j0980k0105J3453
9172A40362Q6928M9879J4148n0495K6949N9800J4741o021j5671o2127k5274j7567
9160B15652J5612P5777L8981l3872J5657l6619J0734Q6938N3646K3636k1417p4449
9148C70276l2165k5189L0140K543O8357l4946m7659k1837L7617N1310P4827O3396
9136E36670N1264J9626K5693Q1908n797l2930l0320K0074P0942N4200O469K6371
9124H24170Q021L9214R0073L7588M1078P9210r632k215J18418Q6136M6938J10628
9112A469627K01198J23530M5708R5012J25473Q9452J35355K33521J70043J63203
9102B852122J71493J93021J72101K76381K38540K36680K94412L47788K85283K99936
$$ plain form
9184 224883 248449 240033 209242 228652 228197 209221 261567 224830 157994 147014 126909 140362
9172 140362 227290 277169 291317 240822 267771 327571 342312 336291 320620 258493 233219 215652
9160 215652 231264 307041 346022 312150 327807 291188 301922 388860 442506 466142 444725 370276
9148 370276 338111 312922 343062 345605 413962 379016 331357 309520 347137 398447 473274 536670
9136 536670 587934 607560 633253 715161 709364 676434 646114 666188 737130 791330 797799 824170
9124 824170 832191 871405 961478 999066 1040144 1119354 1109722 1107507 1225925 1312061 1358999 1469627
9112 1469627 1670825 1794355 1840063 1935075 2060548 2150000 2285355 2518876 2688919 2852122
9102 2852122 3023615 3216636 3388737 3665118 3903658 4140338 4434750 4782538 5067821 5367757
9092E367757L36922K68223K23091J62088J58335J11777Q6767r461o0519j03368
9082F541612k9679j33831k70074k64150k55599l06118k69154k82045k37580k27620
9072D265762k38512k47292k24488j08592j82375k03681j40722j99191k03759j62525
9062B354625o5211p2969r4830j14576j26911j32125m7372o919k1091j03269p8716
9051A490636o5007j08125j01854m5971L787o7018n5835l3667j0073q173m7120
9040I51580m7182l1539m0795n278n6898n5001p0872Q962J061l4935m3316M7318
9028F23105l7211r2642k6664M0863j3481p738P89M4381j5125p7510p2665J7529
9016C83631n1971j6756P868J3671P8641j3276n989j5491k9013n3336l5864Q673
$$ plain form
9092 5367757 5704679 5972902 6195993 6358081 6516416 6628193 6714960 6705499 6644980 6541612
9082 6541612 6511933 6378102 6108028 5843878 5588279 5282161 5013007 4730962 4493382 4265762
9072 4265762 4027250 3779958 3555470 3446878 3264503 3060822 2920100 2720909 2517150 2354625
9062 2354625 2289414 2216445 2121615 2007039 1880128 1748003 1700631 1693712 1672621 1569352 1490636
9051 1490636 1425629 1317504 1215650 1169679 1173466 1106448 1050613 1016946 1006873 998700 951580
9040 951580 904398 872859 832064 826786 769888 714887 644015 652977 654038 619103 575787 623105
9028 623105 585894 493252 466588 507451 493970 486232 487021 531402 516277 438767 366102 383631
9016 383631 331660 314904 322772 336443 415084 401808 395819 380328 351315 297979 262115 270788
9004B70788Q758o0821m7371L0615K8032M103k3746k074K7783L433r160K152M4547
8991B77039j7861R982N961M3j2704k4880n1557n7380m0617m3445N6381O4717m2036
8978A23643o5187J2666Q720K5695P9487N744o89q325j0366j6136L8529l8523m823
8965A50435K0741O0565K283l3263K7799p705l6388o3795k2418P7339P583j5652
8953A67524q597J0753l3541k9967k3909O3972K310M5473O6545n6145k9402J8779
8941A93795M9522R84j0240j7361p7372M7238j8929o1234p6999J1603K7911M4505
8929A13423o8253n1461Q238O6635N7805m7469L4250L8285l1469K0487N5676K2677
8917B18824j475P512K790L432m6778p1928n9630p6707k8098K0338M388M902n1796
$$ plain form
9004 270788 279546 218725 171354 201969 230001 234104 210358 208284 236067 239500 230340 232492 277039
8991 277039 259178 269160 275121 275164 262460 237580 186023 128643 88026 44581 100962 165679 123643
8978 123643 58456 71122 79842 105537 185024 190768 190079 181754 171388 155252 193781 155258 150435
8965 150435 171176 231741 234024 200761 228560 220855 184467 120672 98254 175593 183176 167524
8953 167524 158927 169680 136139 106172 82263 146235 148545 194018 260563 204418 175016 193795
8941 193795 243317 244301 234061 216700 139328 186566 167637 106403 29404 41007 68918 113423
8929 113423 45170 -6291 1947 68582 126387 78918 113168 151453 119984 140471 196147 218824
8917 218824 217349 224861 227651 231083 184305 112377 52747 -23960 -52058 -31720 -27332 -22430 -74226
8904g4226M2045K2259N8265j2578j2000k6624J0205Q378n8975Q390M8295M6041
8892E9475o8866j5463M2079J7558K2937O9615r121l0536p2108j3061P0657k0939
8880E2227m2690J0269j9070l3631j1384R6009M8164j6922k6533r749l9593R457
8868A6554N5975o0337j2353J3133o758L2259M4813J4264j6737n7221m8094j9538
8856d4040N7466K32K4003K0260J2306K3844Q196l9848q7894J4484K7697K2157
8844C8863p259J2600r150j9778J3906m3215J0867O577J8928J3607k0394k4820
8832i268K90m2959J1149N5946k762j9159o966K4197L6934j8218m2471o4793m641
8819h2721R607l7406J1753L5888J3114L2070P2402k069K4883r0141m8842P2384
$$ plain form
8904 -74226 -32181 -9922 48343 35765 23765 -2859 7346 15724 -43251 -34861 13434 59475
8892 59475 -9391 -24854 17225 34783 57720 127335 118214 87678 15570 2509 73166 52227
8880 52227 9537 19806 736 -32895 -44279 51730 99894 82972 56439 46690 7097 16554
8868 16554 72529 12192 -161 12972 6214 38473 83286 97550 80813 23592 -24502 -44040
8856 -44040 13426 13658 37661 57921 70227 94071 102267 62419 -25475 -10991 16706 38863
8844 38863 31604 44204 35054 15276 29182 -14033 -3166 3411 22339 35946 15552 -9268
8832 -9268 -8978 -51937 -40788 15158 12396 -6763 -13729 10468 47402 29184 -13287 -78080 -82721
8819 -82721 -73114 -110520 -98767 -62879 -49765 -17695 54707 52638 77521 -12620 -61462 10922
8807A0922j4357p1908m2000N306P3639K5443m2527k8980j919O7089K6079l3253
8795b6466M8609L7647n8804n725O3663L55j0558j2001L8024j1594j1008j5206
8783C6936j7425K3227J1077p173p97O8694n9100r5792k690p155M0792M3802n5330
8770b0934J1181M4754N4920m8313j9145L4131J9148K8559p0279k1521N87N0538
8758F3626J2897m2591k3271M3028j4566n8892l5019K3250Q511r040J6870K4502
8746I305J8843k0468l9888L1285n833l626M2360J1602n4238J8182p387L195j9523
8733a6191l0715M4302K8048M5552O2312M3418l7096r2447p3924M2590j2110p4722
8721g0983K5322N9822J9355M769k6453Q38j7459N1967M840j02655p800O691K8591
$$ plain form
8807 10922 -3435 -75343 -117343 -112037 -38398 -12955 -55482 -84462 -86381 -19292 6787 -26466
8795 -26466 22143 59790 986 -4739 58924 59279 48721 36720 74744 63150 52142 36936
8783 36936 19511 42738 53815 46642 45845 114539 55439 -40353 -43043 -50198 -9406 34396 -20934
8770 -20934 -9753 35001 89921 41608 22463 56594 75742 104301 34022 12501 13088 63626
8758 63626 76523 33932 10661 53689 39123 -19769 -54788 -31538 -23027 -32067 -15197 9305
8746 9305 28148 7680 -32208 -923 -6756 -10382 31978 43580 -10658 7524 137 3332 -16191
8733 -16191 -46906 -2604 25444 70996 133308 176726 139630 47183 -26741 15849 3739 -70983
8721 -70983 -45661 14161 33516 38285 11832 12670 -4789 47178 52018 -50637 -58437 -51746 -23155
8708b3155k4535l959j6330L2818L4455j1349K0763l3423q479J1545j2496o609
8696d0754N0667M4206l4202l7537L0476L8101k3387J7961L3980l1530p1604J9386
8684d237j2273k7790J0158l297L0774j2055p5827o781K4057K0928q1838o3792
8672b01973r522Q7904J32066L2933l3120k0960M5605K5905l5291K1235J1238q314
8660D7706p6092l2178k8680r663L1646J05536j909l1295J3001L1922R116j4868
8648D4242K7612Jk5272j7103p669j9356o46J4109j76N1849j1569p4027N931O3539
8634E1465L177N6356Q895q6663m9689m6257L5391J8019m2987r005N2331L050j276
8621g193j7617J2691l610n4588M7286O5015L6132O0755J6330K806k3977k0022
$$ plain form
8708 -23155 -47690 -51649 -67979 -35161 -706 -12055 8708 -24715 -33194 -21649 -34145 -40754
8696 -40754 9913 54119 19917 -17620 12856 50957 27570 45531 79511 47981 -23623 -4237
8684 -4237 -16510 -44300 -34142 -37439 -6665 -18720 -94547 -101328 -77271 -56343 -138181 -201973
8672 -201973 -211495 -123591 8475 41408 8288 -12672 32933 58838 23547 44782 56020 47706
8660 47706 -28386 -60564 -89244 -98907 -67261 38275 36366 5071 18072 49994 59110 44242
8648 44242 71854 71855 46583 29480 21811 2455 1809 15918 15742 67591 56022 -18005 -12074 51465
8634 51465 54642 110998 119893 33230 -16459 -62716 -27325 -9306 -52293 -61298 -8967 -5917 -7193
8621 -7193 -24810 -12119 -15729 -70317 -23031 41984 78116 138871 155201 158007 134030 114008
8609A14008J422k1943j7511L7162J5266j9934r592l6286K8026K7464l7151m2244
8597C8687K2593j6334k1992L4860J0809Q987j5525j7096K0513N7083k7965j7966
8585G6654N4223N4623q2819n6425O0001P2602j4157Q193j2091n7401l4904O817
8573G5316N5620O3044J8789N6827J22306J58984J30501j1894j19032j57348j08891
8562B84222J7964p2618p1198n4922j7726k8445J9246m8098o9660j1494J5315L7925
8550E11j7562K1948M9224M729l5632l1958K5246k094k2979L0663J0545k0302P3103
8537H5442J0457m7715K9189N9156M8937p0321l3176J5982L3167J0243P2223J37422
8525C51006K40051L89556L87051J35979n0018l27074l39794k23704k02659j55878
$$ plain form
8609 114008 115430 93487 75976 113138 128404 108470 98878 62592 90618 118082 80931 38687
8597 38687 61280 44946 22954 57814 68623 77610 62085 44989 65502 122585 94620 76654
8585 76654 130877 185500 102681 46256 106257 178859 164702 172895 160804 103403 68499 75316
8573 75316 130936 193980 212769 269596 391902 550886 681387 669493 550461 393113 284222
8562 284222 302186 229568 158370 103448 85722 57277 76523 28425 -41235 -52729 -37414 511
8550 511 -17051 4897 54121 58850 23218 -8740 16506 14412 -8567 22096 32641 12339 85442
8537 85442 95899 48184 77373 136529 185466 115145 81969 97951 131118 141361 213584 351006
8525 351006 591057 980613 1367664 1503643 1453625 1126551 786757 563053 360394 204516
8515B04516p2337L0178N9350N785p2878o8447M4750K59p3066M774r011J3571k1532
8502D5912K9291n6405l1585J927n497l0061j186L0508J4721j5980K4843k962o687
8489c161j9097m8089k4315K6037P5111J11986K3379Q913P7925J49541J35682J34750
8477F48662N3577j47439j65255n8477o2403j09784n9515l1073j8975l0912j1684
8466F722K5361Q2688P4036p483n6546m0360m6801k0475J4654M3974M0627m5958
8454G0439K0757L5964p2133k1980k3142K4566K122n4813M049N0240m1465o0132
8442f5528L7307J2793K1270j0591L3754J4740o335L290o502k6665j4270j6002
8430b2739k0477J3430J880j9518m4812J0228M5237J7103k2423j6936O3967O0102
$$ plain form
8515 204516 132179 162357 221707 227492 154614 86167 130917 131176 58110 62884 53873 67444 45912
8502 45912 75203 18798 -12787 -10860 -16357 -46418 -47604 -17096 -2375 -18355 6488 3526 -3161
8489 -3161 -22258 -70347 -94662 -68625 6486 118472 141851 150764 228689 378230 513912 648662
8477 648662 702239 554800 389545 331068 268665 158881 99366 68293 49318 18406 6722
8466 6722 32083 114771 188807 181324 124778 84418 37617 17142 31796 75770 116397 70439
8454 70439 91196 127160 55027 33047 9905 34471 36593 -18220 -14171 36069 -5396 -65528
8442 -65528 -28221 -15428 5842 -4749 29005 43745 37410 40700 34198 7533 -6737 -22739
8430 -22739 -43216 -29786 -27906 -47424 -92236 -82008 -36771 -19668 -42091 -59027 4940 65042
8418F5042k0950n6337N073N0390J6138k699l5694l8769j367j9985n4459J0762
8406h2855P3778N664m5745K686J3536J9886j1314p1831q1761j2660K9660K3403
8394a37553K6353L8835N3547L2292M1107j5436k7222k4406J3665O5015K6173m2426
8382D9944j0290L9604o0008o2262K8445L4909m8419l4329L9491M6041K4319O2784
8370A10229N369j29688q6193P415L6179L7462K4538K4932J8330j7147l0389K9526
8358C0563R694j2460M20M5148j7942m8789q4627J9911O1762N9852j0871k1339
8346C1322n430o23P0305j5061k3832K514o8998n965P7923Q866o0481n4099J2245
8333c1314M7329R08j8170k3715m406O631R54L9622L218p095j3221J2656K7397
$$ plain form
8418 65042 44092 -12245 -7172 43218 59356 56657 20963 -17806 -19173 -39158 -93617 -82855
8406 -82855 -9077 -3413 -49158 -46472 -32936 -13050 -24364 -96195 -177956 -190616 -160956 -137553
8394 -137553 -111200 -72365 -18818 13474 54581 39145 11923 -12483 1182 66197 92370 49944
8382 49944 39654 79258 19250 -43012 -14567 20342 -28077 -62406 -22915 23126 47445 110229
8370 110229 115598 -14090 -100283 -92868 -56689 -19227 5311 30243 48573 31426 1037 30563
8358 30563 40257 27797 28217 73365 55423 6634 -77993 -58082 3680 63532 52661 31322
8346 31322 25892 25269 95574 80513 56681 59195 -9803 -15768 62155 71021 10540 -43559 -31314
8333 -31314 16015 16923 -1247 -24962 -29368 -22737 -21783 17839 21057 13962 741 13397 40794
8320D0794J1368l1081l9535p047o084n9081K4076L3060K4979J8376N4620N3321
8308A17766M3675l6137l9413m9286p5604n93N714L0602N751J0335M5547j1298
8296D7059p3599k2154l1357L4614j429L933k1152J0523l7586p109J1323J6166
8284g0768O127j1571L942J4778j3367M4655L3987J1749K3346n894o568j6070K453
8271A6799K3777j5225l4561m551K3814r437K8777M8597q3114j6042K9935Q7515
8259I6284m3825p2541J6616J1314Q436k3306o2741j5857K0819L4857j5336n8148
8247a03428J8424M0821j5771k106L5930P448K0314m502Q359M1363q208L7247J8809
8234I4700m1422k8516J2554K1442l541k2749o276O290m1735K4765J1438r483q300
$$ plain form
8320 40794 52162 21081 -18454 -25501 -31585 -90666 -66590 -33530 -8551 9825 64445 117766
8308 117766 161441 125304 85891 36605 -38999 -39592 -33878 -3276 2475 12810 58357 47059
8296 47059 -26540 -48694 -80051 -45437 -46866 -42933 -64085 -53562 -91148 -98257 -86934 -70768
8284 -70768 -64641 -76212 -72270 -57492 -70859 -26204 7783 19532 42878 36984 30416 14346 16799
8271 16799 40576 25351 -9210 -13761 10053 616 29393 77990 -5124 -21166 8769 96284
8259 96284 52459 -20082 -3466 7848 16284 -7022 -69763 -85620 -64801 -29944 -45280 -103428
8247 -103428 -85004 -44183 -59954 -62060 -26130 -18682 1632 -2870 5489 46852 38644 75891 94700
8234 94700 53278 24762 37316 58758 55217 32468 26192 32482 -9253 15512 26950 17467 9167
8221I167k8617K2370k2376j11278M615O6541O9514r781N899K2893L0192l7132
8209B2007M2247k0808n0911J5987k834n3922K8577K4630k4240j656o279k2169
8197d9371l4026J2459K0535K2595J02846L8428L9765m3291m2086K4822J4242n4023
8185E2895m1921o425k9002o331J4216J3949j9935J0826k64j0914L136k755j9027
8172d1552m6854j8152M4393L7113l6388K4542k6393k1830M1413M9645M30m2065
8160c5698J8124m7796j0300K8424K580R0184K1602m1935k4515j3853K5242P1692
8148H3751o4156K5919R433m4732j7537J0563K1273M7041j535k845o1J9476L4943
8135A21533o8814l7337l3820j6375J2945n248m627l0697k5415M6045R0742M2752
$$ plain form
8221 9167 -19450 2920 -19456 -130734 -126119 -59578 9936 155 6054 28947 59139 22007
8209 22007 64254 43446 -7465 8522 5688 -48234 -19657 4973 -19267 -20923 -27202 -49371
8197 -49371 -83397 -70938 -50403 -27808 75038 113466 153231 109940 67854 92676 106918 52895
8185 52895 10974 4549 -24453 -30784 -16568 -2619 -22554 -11728 -11992 -22906 -19770 -22525 -41552
8172 -41552 -88406 -106558 -62165 -25052 -61440 -36898 -63291 -85121 -43708 5937 6367 -35698
8160 -35698 -17574 -65370 -75670 -47246 -44666 45518 67120 25185 670 -13183 12059 83751
8148 83751 19595 45514 54947 10215 -7322 3241 24514 71555 70020 67175 67114 86590 121533
8135 121533 52719 15382 -18438 -34813 -21868 -27116 -31743 -62440 -87855 -41810 48932 91684
8123I1684k981j06562o7374k4439o9358M5424P0150J4902M0964j7361N5423K5153
8111E5625k8831l1257K526q800k035L8939j3632J583k485k0144q4905k422n985
8098a01823P3141J8951n5911R02l4191R734O5342q904k4291M1068K4310M937M4232
8085E7497k5352l4226k7932P115k2371l9462M5060M2197N2005p252l9115O9558
8073G7722O0690n9184n3930K325R0075j0767p8510n4395K9117N7919n3259p1636
8061f3833L4N8965J726l5284k1438j9925m720Q4986l1625j7414J0498L4338O736
8048C044J0275j3053M2038K4693m0017q1378P938m202r60l3220J5683j9744M0561
8035d8342M7334M8176J3899M1261m6893o693l0729n8769j3163L5563L4380J3240
$$ plain form
8123 91684 88703 -17859 -85233 -109672 -179030 -133606 -63456 -48554 -7590 -24951 30472 55625
8111 55625 26794 -4463 -1937 -10737 -12772 26167 12535 14118 11633 -8511 -93416 -95838 -101823
8098 -101823 -28682 -9731 -65642 -64740 -98931 -89197 -23855 -32759 -57050 -15982 8328 13265 57497
8085 57497 32145 -2081 -30013 -22898 -45269 -84731 -39671 2526 54531 47279 8164 77722
8073 77722 138412 79228 25298 27623 117698 106931 28421 -25974 3143 61062 7803 -63833
8061 -63833 -63799 -4834 -3108 -38392 -59830 -79755 -84475 511 -31114 -48528 -38030 -3692 3044
8048 3044 13319 266 42304 66997 26980 -54398 -46460 -50662 -51622 -84842 -69159 -88903 -48342
8035 -48342 -1008 47168 61067 102328 55435 48742 18013 -40756 -53919 -18356 16024 29264
8023B9264n0465l2254j7473L6791j0226j091J942L0485L5798P790k9195m8075
8011d6709J06631L3246K842m194m4072o2169K5313L7462O838k2320n2144M8313
7999B9037J222k950P145L9167M6109J4597k6982r760L5646K1362n2312n4011J2796
7986F1066k6779r8155j8893p0563K5404M053J0144J8928k2457K3320O9286j1971
7974c6617q720R930P7257N998j5615L7820O9285j5642m2682L6562l8781l4879
7962D3916j1196l011J571k8289J3270L3391J8010P854L9181j1328J4556N55M9850
7949A68330l866j20351R485M1001P383q3005r792q933K0636k3867K4879L5491
7937E7391k9826j2057j2482r092j0036j140K0129P0725o696l2144m419r1015J0631
$$ plain form
8023 29264 -21201 -53455 -70928 -34137 -44363 -45454 -43512 -13027 22771 30561 1366 -46709
8011 -46709 59922 93168 96010 91816 47744 -14425 10888 48350 55188 32868 -19276 29037
7999 29037 30259 27309 34454 73621 119730 134327 107345 97585 133231 154593 102281 48270 61066
7986 61066 34287 -63868 -82761 -153324 -127920 -123867 -113723 -94795 -117252 -93932 -24646 -36617
7974 -36617 -45337 -35407 41850 47848 32233 70053 139338 123696 81014 117576 78795 43916
7962 43916 32720 29709 31280 2991 16261 49652 67662 75516 114697 103369 117925 118480 168330
7949 168330 164464 44113 53598 94599 101982 18977 9185 252 20888 -2979 21900 57391
7937 57391 27565 15508 3026 -6066 -16102 -17242 2887 73612 66916 34772 30353 -60662 -50031
7924e0031M0261n4851l3086l0879p554O2881P6999N4330K5785j9917L1514m018
7912I1434j4889o2088J5852K558J3588l4494J3949q052m2258M4096R49l723k3619
7899f697j7798j3143m9811R178Q0746m304n2516M3596n5467M4263J1545j6701
7887b7109J088K478K2650J4922K2076n300j8012j3287n3300N0837O6348p2875
$$ plain form
7924 -50031 -9770 -64621 -97707 -128586 -136140 -73259 3740 58070 83855 63938 95452 91434
7912 91434 76545 14457 30309 32867 46455 11961 25910 17858 -24400 19696 20645 16922 -6697
7899 -6697 -24495 -37638 -87449 -78271 2475 -1829 -54345 -10749 -66216 -21953 -10408 -27109
7887 -27109 -26021 -23543 -893 14029 36105 30805 12793 -494 -53794 -2957 63391 -9484
$$ [...]
##END NTUPLES=NMR SPECTRUM
##END=
