##TITLE=Analysis number 317558
Compound Code cc 34406
Book Reference 451/109
Project Code qc-cat
Chemist Name evam
##JCAMPDX= 6.0         $$ Bruker NMR JCAMP-DX V2.0
##DATA TYPE= NMR SPECTRUM
##DATA CLASS= NTUPLES
##ORIGIN= Bruker BioSpin GmbH
##OWNER= nmr
$$ XWIN-NMR		Version 3.5
$$ Thu Feb 23 12:17:07 2006 GMT Standard Time (UT+0h)  MAYBRIDGE\nmr@NMR_250MHZ
##.OBSERVE FREQUENCY= 250.131544655141
##.OBSERVE NUCLEUS= ^1H
##.ACQUISITION MODE= SIMULTANEOUS (DQD)
##.ACQUISITION SCHEME= undefined
##.AVERAGES= 16
##.DIGITISER RES= 18
##SPECTROMETER/DATA SYSTEM= dpx250
##.PULSE SEQUENCE= zg30
##.SOLVENT NAME= CDCl3
##.SHIFT REFERENCE= (INTERNAL, CDCl3, 0, 16.4353)
##AUDIT TRAIL= $$ (NUMBER, WHEN, WHO, WHERE, WHAT)
$$ ##TITLE= Audit trail, XWIN-NMR		Version 3.5
$$ ##JCAMPDX= 5.01
$$ ##ORIGIN= Bruker BioSpin GmbH
$$ ##OWNER= nmr
$$ C:\u/data/dgb/nmr/ADRS/16780/pdata/1/auditp.txt
$$ ##AUDIT TRAIL=  $$ (NUMBER, WHEN, WHO, WHERE, WHAT)
(   1,<2006-02-23 12:16:44.62 +000>,<MAYBRIDGE\nmr>,<NMR_250MHZ>,
      <created by zg, POWCHK disabled, PULCHK disabled
       configuration hash MD5:
       84 BC 41 DB A1 6E 1D 46 DA 25 12 A5 C1 ED C5 3A
       data hash MD5: 64K
       B2 A3 45 70 59 3F 6D 7E 2F 21 FA C1 F5 B7 C2 94>)
(   2,<2006-02-23 12:16:57.79 +000>,<MAYBRIDGE\nmr>,<NMR_250MHZ>,
      <Start of raw data processing
       ef LB = 0.3 FT_mod = 6 PKNL = 1 SI = 32K 
       data hash MD5: 32K
       4B 02 40 BF 6D DC A5 53 5D E3 62 12 61 D3 00 49>)
(   3,<2006-02-23 12:16:59.51 +000>,<MAYBRIDGE\nmr>,<NMR_250MHZ>,
      <apk 
       data hash MD5: 32K
       51 88 1B 9C 9C 9D 37 D0 C0 B2 6E 45 6D 54 73 C4>)
(   4,<2006-02-23 12:17:00.21 +000>,<MAYBRIDGE\nmr>,<NMR_250MHZ>,
      <abs ABSG = 5 
       data hash MD5: 32K
       F5 BE 32 7D 44 F7 12 5E 7F 13 75 CA 92 E1 E3 6A>)
$$ ##END=
$$ 
$$ hash MD5
$$ 6A DA 5E 04 43 D8 A3 91 A2 A1 DE 18 EA 9F 89 90
##$RELAX= 
##$RELAX= 
##$RELAX= 
##$RELAX= 
##$RELAX= 
##$RELAX= 
##$RELAX= 
$$ Bruker specific parameters
$$ --------------------------
##$DU= <C:\u>
##$EXPNO= 16780
##$NAME= <ADRS>
##$PROCNO= 1
##$TYPE= <nmr>
##$USER= <dgb>
##$AMP= (0..31)
100 100 100 100 100 100 100 100 100 100 100 100 100 100 100 100 100 100 
100 100 100 100 100 100 100 100 100 100 100 100 100 100 
##$AQSEQ= 0
##$AQ_mod= 3
##$AUNM= <au_zg>
##$AUTOPOS= <26 >
##$BF1= 250.13
##$BF2= 250.13
##$BF3= 250.13
##$BF4= 250.13
##$BF5= 500.13
##$BF6= 500.13
##$BF7= 500.13
##$BF8= 500.13
##$BYTORDA= 1
##$CFDGTYP= 0
##$CFRGTYP= 5
##$CHEMSTR= <none>
##$CNST= (0..31)
1 1 145 1 1 1 1 1 1 1 1 1 1 1 1 1 1 1 1 1 1 1 1 1 1 1 1 1 1 1 1 1 
##$CPDPRG= <>
##$CPDPRG1= <>
##$CPDPRG2= <>
##$CPDPRG3= <>
##$CPDPRG4= <mlev>
##$CPDPRG5= <mlev>
##$CPDPRG6= <mlev>
##$CPDPRG7= <mlev>
##$CPDPRG8= <mlev>
##$CPDPRGB= <>
##$CPDPRGT= <>
##$D= (0..31)
0 1 0 0 0 0 0 0 0 0.06 0 0 0 0 0 0 0.0002 0 0 0 0 0 0 0 0 0 0 0 0 0 0 
0 
##$DATE= 1140697003
##$DBL= (0..7)
120 120 120 120 120 120 120 120 
##$DBP= (0..7)
150 150 150 150 150 150 150 150 
##$DBP07= 0
##$DBPNAM0= <>
##$DBPNAM1= <>
$$ [...]
##$SUBNAM7= <"">
##$SUBNAM8= <"">
##$SUBNAM9= <"">
##$SW= 20.6930455092707
##$SWIBOX= (0..15)
0 0 3 0 0 0 0 0 0 0 0 0 0 0 0 0 
##$SW_h= 5175.983436853
##$TD= 65536
##$TD0= 1
##$TE= 292.16
##$TE2= 300
##$TE3= 300
##$TEG= 300
##$TL= (0..7)
0 120 120 120 120 120 120 120 
##$TP= (0..7)
150 150 150 150 150 150 150 150 
##$TP07= 0
##$TPNAME0= <>
##$TPNAME1= <>
##$TPNAME2= <>
##$TPNAME3= <>
##$TPNAME4= <>
##$TPNAME5= <>
##$TPNAME6= <>
##$TPNAME7= <>
##$TPOAL= (0..7)
0.5 0.5 0.5 0.5 0.5 0.5 0.5 0.5 
##$TPOFFS= (0..7)
0 0 0 0 0 0 0 0 
##$TUNHIN= 0
##$TUNHOUT= 0
##$TUNXOUT= 0
##$USERA1= <user>
##$USERA2= <user>
##$USERA3= <user>
##$USERA4= <user>
##$USERA5= <user>
##$V9= 5
##$VALIST= <valist>
##$VCLIST= <CCCCCCCCCCCCCCC>
##$VD= 0
##$VDLIST= <DDDDDDDDDDDDDDD>
##$VPLIST= <PPPPPPPPPPPPPPP>
##$VTLIST= <TTTTTTTTTTTTTTT>
##$WBST= 1024
##$WBSW= 4
##$XGAIN= (0..3)
0 0 0 0 
##$XL= 0
##$YL= 0
##$YMAX_a= 536860
##$YMIN_a= -641696
##$ZGOPTNS= <>
##$ZL1= 120
##$ZL2= 120
##$ZL3= 120
##$ZL4= 120
##$ABSF1= 16.43526
##$ABSF2= -4.257912
##$ABSG= 5
##$ABSL= 3
##$ALPHA= 0
##$AQORDER= 0
##$ASSFAC= 0
##$ASSFACI= 0
##$ASSFACX= 0
##$ASSWID= 0
##$AUNMP= <proc_1d>
##$AZFE= 0.1
##$AZFW= 0.1
##$BCFW= 0
##$BC_mod= 0
##$BYTORDP= 0
##$COROFFS= 0
##$CY= 12.5
##$DATMOD= 1
##$DC= 0
##$DFILT= <>
##$DTYPP= 0
##$F1P= 14.0000005364418
##$F2P= -0.99999901652339
##$FCOR= 0.5
##$FTSIZE= 32768
##$FT_mod= 6
##$GAMMA= 0
##$GB= 0
##$INTBC= 1
##$INTSCL= 1
##$ISEN= 128
##$LB= 0.3
##$LEV0= 0
##$LPBIN= 0
##$MAXI= 10000
##$MC2= 0
##$MEAN= 0
##$ME_mod= 0
##$MI= 0
##$NCOEF= 0
##$NC_proc= -4
##$NLEV= 6
##$NOISF1= 0
##$NOISF2= 0
##$NSP= 0
##$NTH_PI= 0
##$NZP= 0
##$OFFSET= 16.43526
##$PC= 1
##$PHC0= 244.3555
##$PHC1= 8.458795
##$PH_mod= 1
##$PKNL= yes
##$PPARMOD= 0
##$PSCAL= 4
##$PSIGN= 0
##$REVERSE= no
##$SF= 250.130021695576
##$SI= 32768
##$SIGF1= 0
##$SIGF2= 0
##$SINO= 400
##$SIOLD= 32768
##$SREGLST= <1H.CDCl3>
##$SSB= 0
##$STSI= 32768
##$STSR= 0
##$SW_p= 5175.98343685301
##$SYMM= 0
##$S_DEV= 0
##$TDeff= 65536
##$TDoff= 0
##$TI= <Analysis number 999999
Compound Code 99
Book Reference 9
Project Code 9>
##$TILT= no
##$TM1= 0
##$TM2= 0
##$TOPLEV= 0
##$USERP1= <user>
##$USERP2= <user>
##$USERP3= <user>
##$USERP4= <user>
##$USERP5= <user>
##$WDW= 1
##$XDIM= 32768
##$YMAX_p= 470239820
##$YMIN_p= -232368
$$ End of Bruker specific parameters
$$ ---------------------------------
##NTUPLES= NMR SPECTRUM
##VAR_NAME=  FREQUENCY,     SPECTRUM/REAL,   SPECTRUM/IMAG
##SYMBOL=    X,             R,               I
##VAR_TYPE=  INDEPENDENT,   DEPENDENT,       DEPENDENT
##VAR_FORM=  AFFN,          ASDF,            ASDF
##VAR_DIM=   32768,         32768,           32768
##UNITS=     HZ,            ARBITRARY UNITS, ARBITRARY UNITS
##FACTOR=    0.157963299565203, 1,           1
##FIRST=     4110.95213364917, 0,            0
##LAST=      -1065.03130320384, 0,           0
##MIN=       -1065.03130320384, -232368,     0
##MAX=       4110.95213364917, 470239820,    0
$$ Real data points
##PAGE= N=1
##DATA TABLE= (X++(R..R)), XYDATA
$$ [...]
$$ plain form
24388 -42096 -65107 -43809 -12458 44748 22897 25324 37070 7294 -16179 7422 -109 -10239
24376 -10239 -1209 -22571 -5232 38711 52377 4099 -3079 4822 -18334 39181 94881 86878
24364 86878 34503 -31762 -20291 -10886 -32751 -33445 -28479 -49959 -52375 -48054 -45302 -57368 -49188
24351 -49188 -25681 -9810 63339 76916 58561 29654 -2196 -41221 -94342 -21157 -15580 -48671
24339 -48671 -104045 -76380 -76625 -74307 -11011 48372 51437 38532 118030 122392 40588 -297 3388
24326 3388 14242 41558 66354 52049 28241 10609 7363 -11376 -27453 -84602 -120600 -100106
24314 -100106 -41916 -59548 -16740 -11255 -35491 -51980 -44113 -1271 67359 37854 -1493 -67986
24302 -67986 -64048 11859 72479 60481 21835 18585 33091 41896 64098 42557 17007 -27780
$$ packed form
24388d2096k3011K1298L1351N7206k1851K427J1746k9776k3473K3601p531j0130
24376a0239R030k1362J7339M3943J3666m8278p178P901k3156N7515N5700q003
24364H6878n2375o6265J1471R405k1865o94M966k1480k416M321K752j2066Q180
24351d9188K3507J5871P3149J3577j8355k8907l1850l9025n3121P3185N577l3091
24339d8671n5374K7665k45K318O3296N9383L065j2905P9498M362q1804m0885L685
24326C388J0854K7316K4796j4305k3808j7632l246j8739j6077n7149l5998K0494
24314a00106N8190j7632M2808N485k4236j6489P867M2842O8630k9505l9347o6493
24302f7986L938P5907O0620j1998l8646l250J4506Q805K2202k1541k5550m4787
$$ plain form
24290 -27780 -41765 6385 -1680 4080 46648 45800 -2149 12857 73917 68815 29934 -20268 -74339
24277 -74339 -80440 -64855 -24241 14410 8753 26634 1902 -8072 -28392 -72511 -142263 -64595
24265 -64595 -21823 -203 -65897 -105221 -19318 6443 58966 62917 -4202 -63777 -28441 -12674
24253 -12674 -83965 -148250 -109822 -28182 45615 49950 9159 -14667 1580 -46928 -43250 -35819
24241 -35819 -54786 -43325 3609 -14524 -40250 -27479 -11060 87906 70876 37189 -15378 -40583
24229 -40583 -52909 -19969 -22540 38541 97500 88614 56881 76527 65822 74908 38759 -10162
24217 -10162 -23434 -16401 27034 -12767 -80497 -95176 -33972 -27083 -57929 -54802 -18952 -4210
24205 -4210 -63809 12450 100363 94248 116111 145443 80029 30541 -33429 -101340 -62831 -17902
$$ packed form
24290b7780j3985M8150q065N760M2568q48m7949J5006O1060n102l8881n0202n4071
24277g4339o101J5585M0614L8651n657J7881k4732r974k0320m4119o9752P7668
24265f4595M2772K1620o5694l9324Q5903K5761N2523L951o7119n9575L5336J5767
24253a2674p1291o4285L8428Q1640P3797M335m0791k3826J6247m8508L678P431
24241c5819j8967J1461M6934j8133k5726J2771J6419R8966j7030l3687n2567k5205
24229d0583j2326L2940k571O1081N8959q886l1733J9646j0705R086l6149m8921
24217a0162j3272P033M3435l9801o7730j4679O1204O889l0846L127L5850J4742
24205d210n9599P6259Q7913o115K1863K9332o5414m9488o3970o7911L8509M4929
$$ plain form
24193 -17902 -18470 -44626 -58588 -44832 -29644 -40243 -40521 -57807 -124094 -56793 -25524 -27831 -19403
24180 -19403 -31023 8436 39880 19307 34960 62174 62998 50826 58414 45244 9234 -14735
24168 -14735 -37518 -16768 9951 5898 -6973 -26425 -41449 -70468 -105232 -56548 -56373 -42531
24156 -42531 -57225 -57510 -8105 49704 84328 64175 70395 95412 90106 5818 -86156 -193472
24144 -193472 -161520 -140838 -125222 -37319 12440 21675 -28086 -43103 -26872 27278 25607 58597
24132 58597 87107 27446 -34450 -50467 13688 20020 4729 -13363 -94472 -197906 -170598 -161041
24120 -161041 -127654 -61079 -8157 -25010 -80200 -106672 -119614 -99626 -56103 -32872 -71821
24109 -71821 -122742 -119936 -63759 10817 66095 51805 57462 99518 1168 -59759 -73431 -34543
$$ packed form
24193a7902n68k6156j3962J3756J5188j0599k78j7286o6287O7301L1269k307Q428
24180a9403j1620L9459L1444k0573J5653K7214Q24j2172P588j3170l6010k3969
24168a4735k2783K0750K6719m053j2871j9452j5024k9019l4764M8684J75J3842
24156d2531j4694k85M9405N7809L4624k0153O220K5017n306q4288r1974j07316
24144a93472L1952K0682J5616Q7903M9759R235m9761j5017J6231N4150j671L2990
24132E8597K8510n9661o1896j6017O4155O332j5291j8092q1109j03434K7308R557
24120a61041L3387O6575N2922j6853n5190k6472j2942J9988M3523K3231l8949
24109g1821n0921K806N6177P4576N5278j4290N657M2056r8350o0927j3672L8888
$$ plain form
24097 -34543 32301 60715 14128 20094 37063 10497 16559 2653 -2366 -7028 -29200 -32382 -4734
24084 -4734 -14194 -32860 -12943 -3139 41515 56867 12530 38608 67239 63958 38538 38365 62622
24071 62622 37904 7591 28156 4403 -49617 -6394 38739 26791 55232 41025 45556 -5872
24059 -5872 -34915 -73929 -91973 -54160 -1317 14484 25635 81179 126489 116039 104452 82503
24047 82503 80715 63160 60076 74027 92172 116757 135322 89126 13668 -21943 -11128 41788
24035 41788 51958 52645 30896 19003 40058 64645 57078 61235 73211 154762 160292 63415 17666
24022 17666 -3702 -79588 -82198 -62924 -36318 -365 37144 15287 64552 94843 49569 59103
24010 59103 110941 130146 112780 98005 90861 66007 21669 -290 15803 79455 90936 15185
$$ packed form
24097c4543O6844K8414m6587N966J6969k6566O062j3906n019m662k2172l182K7648
24084d734r460j8666J9917R804M4654J5352m4337K6078K8631l281k5420j73K4257
24071F2622k4718l0313K0565k3753n4020M3223M5133j1948K8441j4207M531n1428
24059e872k9043l9014j8044L7813N2843J5801J1151N5544M5310j0450j1587k1949
24047H2503j788j7555l084J3951J8145K4585J8565m6196p5458l5611J0815N2916
24035D1788J0170O87k1749j1893K1055K4587p567M157J1976Q1551N530r6877m5749
24022A7666k1368p5886k610J9274K6606L5953L7509k1857M9265L0291m5274R534
24010E9103N1838J9205j7366j4775p144k4854m4338k1959J6093O3652J1481p5751
$$ plain form
23998 15185 -38875 1615 -14309 -35728 13138 -14163 -13097 6941 36063 38695 69874 8076
23986 8076 -24701 -37973 -10819 13978 53533 52749 30922 -38224 -134628 -175036 -181338 -146160
23974 -146160 -155800 -130692 -71634 -60428 -67311 -4086 41671 7132 -37388 -44918 -34035 4818
23962 4818 -16117 33431 7384 6370 -16825 -50492 -32861 -85276 -78505 -37836 7505 34191
23950 34191 20448 53369 64964 -4924 -19094 14459 -14017 -25706 -49147 -63585 -71655 -85978
23938 -85978 -54928 2634 17623 233 20976 -41956 -66780 -4095 23047 -59023 -138445 -98693
23926 -98693 -71102 -67113 -10562 21251 -15540 -23411 23481 49674 15571 -61663 -119828 -130134
23914 -130134 -63811 7758 -19009 -8615 27590 61760 52855 50055 64199 96411 66238 27088
$$ packed form
23998A5185n4060M0490j5924k1419M8866k7301J066K0038K9122K632L1179o1798
23986H076l2777j3272K7154K4797L9555p84k1827o9146r6404m0408o302L5178
23974a46160r640K5108N9058J1206o883O3225M5757l4539m4520p530J0883L8853
23962D818k0935M9548k6047j014k3195l3667J7631n2415O771M0669M5341K6686
23950C4191j3743L2921J1595o9888j4170L3553k8476j1689k3441j4438q070j4323
23938h5978L1050N7562J4989j7390K0743o2932k4824O2685K7142q2070p9422L9752
23926i8693K7591L989N6551L1813l6791p871M6892K6193l4103p7234n8165j0306
23914a30134O6323P1569k6767J0394L6205L4170q905k800J4144L2212l0173l9150
$$ plain form
23902 27088 -12920 -20045 -9207 -36336 -32267 -68107 -42163 -16042 10258 57726 22045 24109
23890 24109 -60831 -87544 -72758 -64819 -130412 -82910 1750 73551 56443 -12189 -49603 -60304
23878 -60304 -52420 -46557 -107489 -76694 -44301 -10290 -43110 -87007 -72527 -16602 19516 32678
23866 32678 24978 32711 32413 -37961 -71523 -34364 -29864 -76275 -106880 -27945 38225 25553 15802
23853 15802 58194 74419 65412 41118 17065 35174 68838 44554 14667 -52753 -36516 21332
23841 21332 78071 32822 -83611 -66787 12287 77727 140865 142147 109246 114385 40148 -41157
23829 -41157 -51232 -85370 -10343 -10086 -4731 -5371 1893 -28352 -54713 -4354 -26040 -49455 15096
23816 15096 30056 24552 26548 2638 7981 17436 -38441 1266 69707 74974 47486 52626 88499
$$ packed form
23902B7088m0008p125J0838k7129M069l5840K5944K6121K6300M7468l5681K064
23890B4109q4940k6713J4786P939o5593M7502Q4660P1801j7108o8632l7414j0701
23878f0304P884N863o0932L0795L2393L4011l2820m3897J4480N5925L6118J3162
23866C2678p700P733k98p0374l3562L7159M500m6411l0605P8935O6170j2672r751
23853A5802M2392J6225r007k4294k4053J8109L3664k4284k9887o7420J6237N7848
23841B1332N6739m5249j16433J6824P9074O5440O3138J282l2901N139p4237q1305
23829d1157j0075l4138P5027K57N355o40P264l0245k6361N0359k1686k3415O4551
23816A5096J4960n504J996k3910N343R455n5877L9707O8441N267k7488N140L5873
$$ plain form
23803 88499 107901 71561 28530 79631 76295 93757 45591 -7097 -39311 3806 62191 21488
23791 21488 -29940 16160 -35168 -31958 -58135 -52185 -54225 -45947 -29143 9611 42946 105224
23779 105224 111942 90719 93518 82434 86534 54836 67842 55048 62188 66203 5668 -57794
23767 -57794 -74584 -76350 -39665 -35926 -44768 -47475 -23203 25286 26102 50362 31342 37966 73238
23754 73238 67375 57774 32136 31949 -5386 11502 24298 9002 23374 66155 93052 43002
23742 43002 -5899 -3924 -11718 36858 25270 -9873 -12913 -67121 -55814 55423 68430 66430
23730 66430 23619 21869 10977 24445 -24704 -39199 15441 36575 20710 41312 22202 -37625
23718 -37625 -58886 101 40279 71015 37273 35308 19489 -41938 -43545 -31179 -44223 -18683
$$ packed form
23803H8499J9402l6340m3031N1101l336J7462m8166n2688l2214M3117N8385m0703
23791B1488n1428M6100n1328L210k6177N950k040Q278J6804L8754L3335O2278
23779A05224O718k1223K799j1084M100l1698J3006j2794P140M015o0535o3462
23767e7794j6790j766L6685L739q842k707K4272M8489Q16K4260j9020O624L5272
23754G3238n863r601k5638j87l7335J6888J2796j5296J4372M2781K6897n0050
23742D3002m8901J975p794M8576j1588l5143l040n4208J1307J11237J3007k000
23730F6430m2811j750j0892J3468m9149j4495N4640K1134j5865K0602j9110n9827
23718c7625k1261N8987M0178L0736l3742j965j5819o1427j607J2366j3044K5540
$$ plain form
23706 -18683 22734 6031 -52057 -128866 -97306 -39513 -3143 -18447 -4499 -2833 8426 40225
23694 40225 1716 -10761 11768 20319 -14263 -9885 40462 25164 -19495 -58532 42024 11016
23682 11016 -55872 -65715 -885 34163 1833 -27744 -67593 -90904 -53752 1316 -7772 -43919
23670 -43919 -62897 -18561 41227 43449 -501 17260 29056 -15436 -72909 -18721 -4734 -55019
23658 -55019 -46227 -66180 -101736 -55539 -60557 -21893 -51566 -103565 -65206 -38424 -7049 39916
23646 39916 20222 -13384 29017 19161 24040 71247 36456 4323 43590 53799 60748 21102
23634 21102 -41362 -91781 -74937 -41923 -15015 22237 8411 -65531 -82473 -59426 -72815 -32621
23622 -32621 -43637 -78284 -40141 -29995 -4761 35498 80786 77412 62151 45677 48447 36959
$$ packed form
23706a8683M1417j6703n8088p6809L1560N7793L6370j5304J3948J666J1259L1799
23694D0225l8509j2477K2529Q551l4582M378N0347j5298m4659l9037J00556l1008
23682A1016o6888r843O4830L5048l2330k9577l9849k3311L7152N5068r088l6147
23670d3919j8978M4336N9788K222m3950J7761J1796m4492n7473N4188J3987n0285
23658e5019Q792j9953l5556M6197n018L8664k9673n1999L8359K6782L1375M6965
23646C9916j9694l3606M2401r856M879M7207l4791l2133L9267J0209O949l9646
23634B1102o2464n0419J6844L3014K6908L7252j3826p3942j6942K3047j3389M0194
23622c2621j1016l4647L8143J0146K5234M0259M5288l374j5261j6474K770j1488
$$ plain form
23610 36959 11640 39915 70598 34075 -10934 21871 8981 -33022 -82114 15220 80433 57544
23598 57544 -48526 -80353 -90594 -117035 -124273 -133829 -121737 -63162 12096 25152 34798 38013
23586 38013 66043 17923 25811 64499 90593 60120 -17814 -32695 -36501 -48432 -19292 -11571
23574 -11571 5176 10323 -23677 -37421 -44537 -12382 -31181 -49207 -55101 2962 24346 -4976
23562 -4976 -63847 -115178 -166680 -128489 -42496 -28084 -43143 -58518 -45389 -75675 -48074 -39516
23550 -39516 -58205 -45779 -20921 25592 19925 10469 -37235 23706 81019 63724 54468 28495
23538 28495 -9447 -34272 -25732 3649 37199 105496 68002 11731 12416 25755 65480 82605
23526 82605 98929 61660 11603 -25934 -79239 -75128 -45738 20998 44321 61494 3403 -6482
$$ packed form
23610C6959k5319K8275L0683l6523m5009L2805j2890m2003m9092R7334O5213k2889
23598E7544j06070l1827j0241k6441p238r556J2092N8575P5258J3056R646L215
23586C8013K8030m8120P888L8688K6094l0473p7934j4881l806j1931K9140P721
23574a1571J6747N147l4000j3744p116L2155j8799j8026n894N8063K1384k9322
23562d976n8871n1331n1502L8191Q5993J4412j5059j5375J3129l0286K7601Q558
23550c9516j8689J2426K4858M6513n667r456m7704O0941N7313j7295r256k5973
23538B8495l7942k4825Q540K9381L3550O8297l7494n6271O85J3339L9725J7125
23526H2605J6324l7269n0057l7537n3305M111K9390O6736K3323J7173n8091r885
$$ plain form
23514 -6482 -57328 -68659 -70469 -46745 -54939 -65403 -76660 -76937 -54636 -54711 -50116 -14703 15727
23501 15727 10912 -26490 -126285 -129911 -41656 24966 68631 69604 102221 64505 40372 61046
23489 61046 84880 85064 91234 48815 5400 -40613 -101084 -125284 -55384 -24806 -79989 -50602
23477 -50602 831 35444 38485 34575 46123 63831 58246 60967 66866 45394 -12925 -55162 -22182
23464 -22182 -22479 -3125 -3381 -20949 7360 35931 53302 29315 10760 35781 31313 -10603 -10165
23451 -10165 -5780 -13754 -11794 42673 72609 12243 -15440 -32362 -35046 -56178 -83222 -66720
23439 -66720 -54522 -39686 -34327 -54876 -101744 -128257 -82612 -28181 13228 30312 30461 29438
23427 29438 -2456 16500 751 710 11790 63767 68583 37856 17469 28429 26559 60942 68736
$$ packed form
23514f482n0846j1331j810K3724q194j0464j1257k77K2301p5M595L5413L0430
23501A5727m815l7402r9795l626Q8255O6622M3665R73L2617l7716k4133K0674
23489F1046K3834J84O170m2419m3415m6013o0471k4200O9900L0578n5183K9387
23477e0602N1433L4613L041l910J1548J7708n585K721N899k1472n8319m2237L2980
23464b2182k97J9354k56j7568K8309K8571J7371k3987j8555K5021m468m1916M38
23451a0165M385p974J960N4467K9936o0366k7683j6922k684k1132k7044J6502
23439f6720J2198J4836N359k0549m6868k6513M5645N4431M1409J7084J49j023
23427B9438l1894J8956j5749m1J1080N1977M816l0727k0387J0960j870L4383P794
$$ plain form
23414 68736 61564 81460 102474 121476 53044 3129 -63130 -75945 -4059 -2645 10712 26993
23402 26993 12987 29287 40298 29903 20038 51509 36619 33312 51277 109 5829 51134
23390 51134 -13882 -38513 -11842 19806 -14541 -41860 -20685 -13518 -6094 -17012 -8157 -23140
23378 -23140 -42761 -63002 -53571 -8963 11935 1099 -22151 4820 -30100 -64268 -114452 -129391
23366 -129391 -120152 -103178 -104031 -71124 -70566 -65946 -29005 12220 1757 -6825 -47241 -70156 -1731
23353 -1731 33212 28420 12115 52778 28313 23564 52258 15886 -299 38458 10980 27495
23341 27495 33751 564 47191 39588 8640 1421 -3262 -62589 -83338 -98060 -88542 -28612 -11122
23328 -11122 -13633 -8859 6471 27781 -43604 -52314 -72319 -41660 7224 40701 14389 10011
$$ packed form
23414F8736p172J9896K1014J9002o8432m9915o6259j2815P1886J414J3357J6281
23402B6993j4006J6300J1011j0395r865L1471j4890l307J7965n1168N720M5305
23390E1134o5016k4631K6671L1648l4347k7319K1175P167P424j0918Q855j4983
23378b3140j9621k0241R431M4608K0898j0836k3250K6971l4920l4168n0184j4939
23366a29391R239J6974q53L2907N58M620L6941M1225j0463q582m0416k2915O8425
23353a731L4943m792j6305M0663k4465m749K8694l6372j6185L8757k7478J6515
23341B7495O256l3187M6627p603l0948p219m683n9327k0749j4722R518N9930J7490
23328a1122k511M774J5330K1310p1385q710k0005L0659M8884L3477k6312m378
$$ plain form
23316 10011 9018 11157 50503 -24437 -33404 6348 95295 134094 58265 5081 -20233 -57259
23304 -57259 -41024 48502 52296 20980 -37660 -53069 -30991 33212 12209 -13175 -34756 -13395
23292 -13395 -4585 -13241 11393 8046 22099 39765 -30394 -67338 -81445 -55800 -14819 -9245
23280 -9245 -23787 -37645 42034 57183 14958 10755 31315 44425 42733 55929 67892 77810
23268 77810 31469 11588 30796 -34484 -59306 -80740 -27367 -15764 -12280 2003 -1574 -20268
23256 -20268 -28198 -34881 -83433 -99607 -76880 -68744 -59124 -11600 1142 -44415 -43495 -65379 -96378
23243 -96378 -98684 -94889 -119973 -141676 -144028 -92038 -63115 -79199 -100793 -70697 -4472 51609
23231 51609 46504 49217 -10954 -13801 -30461 -21134 -57705 -91822 -124129 -97233 -54036 -8129
$$ packed form
23316A0011r93K139L9346p4940q967L9752Q8947L8799p5829n3184k5314l7026
23304e7259J6235Q9526L794l1316n8640j5409K2078O4203k1003k5384k1581K1361
23292a3395Q810q656K4634l347J4053J7666p0159l6944j4107K5645M0981N574
23280i245j4542j3858P9679J5149m2225m203K0560J3110j692J3196J1963R918
23268G7810m6341j9881J9208o5280k4822k1434N3373J1603L484J4283l577j8694
23256b0268p930o683m8552j6174K2727Q136R620M7524J2742m5557R20k1884l0999
23243i6378k306L795k5084k1703k352N1990K8923j6084k1594L0096O6225N6081
23231E1609n105K713o0171k847j6660R327l6571l4117l2307K6896M3197M5907
$$ plain form
23219 -8129 -7656 11442 3284 -35622 -2302 52321 -3347 -15053 17107 66053 65658 22103 -24871
23206 -24871 5281 22760 -21239 -17630 -52739 -73075 -63935 -88663 -72542 -4991 55330 77119
23194 77119 83254 42676 22697 -29368 35093 18408 -53479 -72547 -56192 -39307 20126 33116
23182 33116 26489 -59390 -105336 -89683 -77516 -51849 -39441 -66745 -66444 -70480 -24338 -8587
23170 -8587 -51983 -67566 -32105 16148 49154 49720 3704 4029 -44792 -82753 -66113 42389
23158 42389 33046 39618 49554 49309 30626 26651 28106 60330 55691 32665 27675 -19480 -43073
23145 -43073 3557 5237 -47939 -56477 -69059 -56426 -31406 -28633 -59740 -71152 -20079 -36351
23133 -36351 -50165 -35726 -5672 44760 18953 22356 4153 -8191 -21387 10358 -21026 -70960
$$ packed form
23219h129M73J9098q158l8906L3320N4623n5668j1706L2160M8946l95m3555m6974
23206b4871L0152J7479m3999L609l5109k0336R140k4728J6121O7551O0321K1789
23194G7119O135m0578j9979n2065O4461j6685p1887j9068J6355J6885N9433J2990
23182C3116o627q5879m5946J5653J2167K5667J2408k7304L01m036M6142J5751
23170h587m3396j5583L5461M8253L3006N66m6016L25m8821l7961J6640J08502
23158D2389r343O572R936k45j8683l975J455L2224m639k3026m990m7155k3593
23145d3073M6630J680n3176q538j2582J2633K5020K773l1107j1412N1073j6272
23133c6351j3814J4439L0054N0432k5807L403j8203j2344j3196L1745l1384m9934
$$ plain form
23121 -70960 -105537 -112993 -71790 -75998 -93520 -95156 -91489 -77219 -53570 -61628 -60315 -81638 -118792
23108 -118792 -53232 9041 28300 28904 19683 12577 21702 23796 32434 56382 53422 49880 -14633
23095 -14633 4044 32405 14723 28924 -24167 2252 66290 86155 54838 27763 6496 12428
23083 12428 34206 38910 35596 15000 1139 -17482 -73520 -77468 -1811 14756 25154 60344
23071 60344 33305 -12598 -51819 -61677 -74942 -64694 6463 -19784 -50052 -40084 -26054 -53310
23059 -53310 -103952 -113352 -84205 23685 55203 27372 62617 99709 116225 108051 89734 21791
23047 21791 -79534 -57266 -27759 27298 39037 1564 -31071 -55845 -74886 -54301 -54393 -45048
23035 -45048 7102 -4357 -32734 -80415 -95388 -96858 -35144 44513 121119 90295 20803 -15962
$$ packed form
23121g0960l4577p456M1203m208j7522j636L667J4270K3649q058J313k1323l7154
23108a18792O5560O2273J9259O04r221p106R125K094Q638K3948k960l542o4513
23095a4633J8677K8361j7682J4201n3091K6419O4038J9865l1317k7075k1267N932
23083A2428K1778M704l314k0596j3861j8621n6038l948P5657J6567J0398L5190
23071F0344k7039m5903l9221r858j3265J0248P1157k6247l0268R968J4030k7256
23059e3310n0642r400K9147J07890L1518k7831L5245L7092J6516q174j8317o7943
23047B1791j01325K2268K9507N5057J1739l7473l2635k4774j9041K0585r2R345
23035d5048N2150j1459k8377m7681j4973j470O1714P9657P6606l0824o9492l6765
$$ plain form
23023 -15962 34239 73292 26339 -874 -14734 -42289 -53884 16529 36676 15071 2550 -37596
23011 -37596 -96380 -67073 -19074 -45395 -55714 -26780 -42466 -70323 -74398 -90200 -61110 -31066
22999 -31066 -30429 7108 17976 53250 33532 -18824 -7651 8155 -28891 -44014 -31202 507
22987 507 49408 91910 11958 -47261 -80558 -71998 -7872 -10288 -6412 15520 -13784 -11057 50604
22974 50604 -11945 -102116 -108048 -59756 -16665 -31402 -95888 -74853 -47712 -17817 -7216 -30179
22962 -30179 -25354 23552 37993 9916 -13080 16881 70316 51579 64629 127253 90731 12477
22950 12477 -2948 -13267 -29641 -92881 -104399 -93704 -105868 -103797 -102664 -91800 -41256 -54437
22938 -54437 -13782 3531 -19938 -52246 -75797 -69048 -57263 -43754 -43610 -4024 -12505 -56839
$$ packed form
23023a5962N0201L9053m6953k7213j3860k7555j1595P0413K0147k1605j2521m0146
23011c7596n8784K9307M7999k6321j0319K8934j5686k7857m075j5802K9090L0044
22999c1066O37L7537J0868L5274j9718n2356J1173J5806l7046j5123J2812L1709
22987E07M8901M2502p9952n9219l3297Q560O4126k416L876K1932k9304K727O1661
22974E0604o2549r0171n932M8292M3091j4737o4486K1035K7141K9895J0601k2963
22962c0179M825M8906J4441k8077k2996K9961N3435j8737J3050O2624l6522p8254
22950A2477j5425j0319j6374o3240j1518J0695j2164K071J133J0864N0544j3181
22938e4437M0655J7313k3469l2308k3551O749J1785J3509J44L9586q481m4334
$$ plain form
22926 -56839 -39395 -63914 -59162 -38328 -45311 -22237 25394 21007 -31830 -83494 -55725 -68706
22914 -68706 -80036 -79964 -45289 -34595 -21749 -26921 -50090 -102191 -94506 -59833 -60817 -76550 -62104
22901 -62104 -52708 -108358 -82047 -19140 -32041 18522 -5327 -20096 -32427 -20732 -51750 -35982
22889 -35982 -18081 30645 87625 85836 62627 63070 28499 -17494 -17000 38188 65495 19037 -91042
22876 -91042 -178980 -111045 -77114 -92560 -71276 -58034 -47236 -25014 -9753 23515 70157 84194
22864 84194 29237 -23284 -61081 -34395 -30941 -25119 -43910 -75983 -65135 -38811 -60567 -57133
22852 -57133 -63640 -38640 4911 -11205 20006 2740 -4228 -43994 -21824 9700 -25174 -38710
22840 -38710 -1898 -36979 -32384 26936 57248 67978 58928 49244 37972 40051 15796 8553 61715
$$ packed form
22926e6839J7444k4519M752K0834o983K3074M7631m387n2837n1664K7769j2981
22914f8706j1330P2L4675J0694J2846n172k3169n2101P685L4673r84j5733J4446
22901f2104R396n5650K6311O2907j2901N0563k3849j4769j2331J1695l1018J5768
22889c5982J7901M8726N6980j789k3209M43l4571m5993M94N5188K7307m6458j10079
22876i1042q7938O7935L3931j5446K1284J3242J0798K2222J5261L3268M6642J4037
22864H4194n4957n2521l7797K6686L454N822j8791l2073J0848K6324k1756L434
22852e7133o507K5000M3551j6116L1211j7266o968l9766K2170L1524l4874j3536
22840c8710L6812l5081M595N9320L0312J0730r050r684j1272K079k4255p243N3162
$$ plain form
22827 61715 25195 4841 -5235 8735 20842 -22519 -21236 -11788 -67888 -110914 -8835 -12805
22815 -12805 23397 51168 20578 -51129 -84402 -54631 -44160 -71005 -68603 -59569 -35973 -42122
22803 -42122 -58728 -42465 -44253 -25504 28256 68594 48731 21176 14019 13660 65400 43935
22791 43935 -20062 -54353 -86132 -158525 -98587 -32158 29390 51413 71019 78213 8070 -22453
22779 -22453 15964 44283 64995 -852 -46324 -68267 -37370 -29981 -28867 -4905 -2433 -24431
22767 -24431 -61114 -15121 15865 36949 15817 -9470 8919 -2770 -24358 31302 25457 3525
22755 3525 25080 83765 5596 -33183 -42352 -44150 32810 68877 40541 45938 27094 33010 24479
22742 24479 -45333 -13780 63588 75532 57160 21791 -60715 -37698 -15502 23833 27774 44811
$$ packed form
22827F1715l6520k0354j0076J3970J2107m3361J283R448n6100m3026J02079l970
22815a2805L6202K7771l0590p1707l3273K9771J0471k6845K402R034K3596o149
22803d2122j6606J6263j788J8749N3760M0338j9863k7555p157l59N1740k1465
22791D3935o3997l4291l1779p2393N9938O6429O1548K2023J9606P194p0143l0523
22779b2453L8417K8319K0712o5847m5472k1943L0897P389J114K3962K472k1998
22767b4431l6683M5993L0986K1084k1132k5287J8389j1689k1588N5660n845k1932
22755C525K1555N8685p8169l8779r169j798P6960L6067k8336N397j8844N916q531
22742B4479o9812L1553P7368J1944j8372l5369q2506K3017K2196L9335L941J7037
$$ plain form
22730 44811 50029 73492 94626 80481 28824 13521 -52729 -42877 -79782 -112786 -120189 -118842
22718 -118842 -117479 -76799 -5308 34254 44642 29880 -21981 -43751 -21472 7317 -6325 -49337
22706 -49337 -28742 -35689 -50033 -20133 27110 -32340 -76318 -91478 -97745 -99262 -111201 -66067
22694 -66067 15417 -9694 5103 34942 62488 -7295 21576 30651 5128 90563 57410 -19505
22682 -19505 -61130 -22194 -27102 -66362 -75064 -87520 -72318 -9301 16836 7349 13453 5207 -36351
22669 -36351 -101361 -72780 -18142 23529 34904 54064 41282 4162 -12926 -53833 -58127 -1099
22657 -1099 28835 -1108 43197 5081 -16175 -8343 14412 47527 37183 -19595 -46661 -17927
22645 -17927 -20516 -105550 -120890 -48307 -7064 -34836 -49226 -39142 11713 46780 109999 109457
$$ packed form
22730D4811N218K3463K1134j4145n1657j5303o6250R852l6905l3004p403J347
22718a18842J363M0680P1491L9562J0388j4762n1861k1770K2279K8789j3642m3012
22706d9337K0595o947j4344K9900M7243n9450m3978j5160o267j517j1939M5134
22694f6067Q1484k5111J4797K9839K7546o9783K8871R075k5523Q5435l3153p6915
22682a9505m1625L8936m908l9260q702j2456J5202O3017K6137r487O104q246m1558
22669c6351o5010K8581N4638M1671J1375J9160j2782l7120j7088m0907m294N7028
22657a099K9934k9943M4305l8116k1256P832K2755L3115j0344n6778k7066K8734
22645a7927k589q5034j5340P2583M1243k7772j4390J0084N0855L5067O3219n42
$$ plain form
22633 109457 12205 -45536 -28287 -36002 -65099 -57895 3357 18679 8258 49952 12089 -23192
22621 -23192 -5425 27288 42920 34765 6621 -10466 -93285 -70692 22317 57642 68489 90287
22609 90287 23185 -7058 -30721 -17519 54682 27226 -2531 -2252 25675 -10424 -32961 -56399
22597 -56399 -52005 -81755 -85633 -79744 -54202 -23336 -31470 -12546 -22142 -21067 19267 -22995 -46887
22584 -46887 -15681 24288 49376 36813 1203 -43019 -48620 18683 71173 36926 -26008 -31578
22572 -31578 -41940 -32972 -42459 -16902 13150 10437 34898 17176 -21847 -40286 -84067 -93931
22560 -93931 -2171 58758 78630 110933 72008 -16676 -26036 -64302 -87925 -68252 -40162 -27083
22548 -27083 -20673 -44365 -77577 -104886 -92414 -82543 -38974 13368 -4144 -992 294 -13690
$$ packed form
22633A09457r7252n7741J7249p715k9097P204O1252J5322j0421M1694l7863l5281
22621b3192J7767L2713J5632q155k8144j7087q2819K2593R3009L5325J0847K1798
22609I0287o7102l0243k3663J3202P2201k7456k9757K79K7927l6099k2537k3438
22597e6399M394k9750l878N889K5542L0866q134J8924r596J075M0334m2262k3892
22584d6887L1206L9969K5088j2563l5610m4222n601O7303N2490l4247o2934n570
22572c1578j0362Q968r487K5557L0052k713K4461j7722l9023j8439m3781r864
22560i3931R1760O0929J9872L2303l8925q8684r360l8266k3623J9673K8090J3079
22548b7083O410k3692l3212k7309J2472R871M3569N2342j7512L152J286j3984
$$ plain form
22536 -13690 5351 57927 67564 96072 118900 85159 62738 64769 31208 -16012 34012 32490
22524 32490 11239 -14548 -42636 -36046 -41356 -8534 26392 4321 -2344 -70214 -64010 -41408
22512 -41408 -31631 -77518 -66932 -88977 -74421 -36585 -23683 -83691 -123350 -133950 -91607 -55715
22500 -55715 -19671 25784 23904 -7313 -30649 -81214 -110744 -100015 -58084 -42721 -29753 32409
22488 32409 47004 54727 -14096 -19656 -283 2591 -9218 16069 46374 62442 73323 15630
22476 15630 -1105 -64881 -69647 -20977 22348 33639 5990 -6132 -22253 9922 67475 59753
22464 59753 72012 71365 24025 48610 21904 25289 25174 18805 2295 17869 44224 4124 -86018
22451 -86018 -81885 -32633 -56228 -40152 -91827 -124236 -46629 41677 40767 -3728 49250 103711
$$ packed form
22536a3690J9041N2576R637K8508K2828l3741k2421K031l3561m7220N0024j522
22524C2490k1251k5787k8088O590n310L2822L4926k2071o665o7870O204K2602
22512d1408R777m5887J0586k2045J4556L7836J2902o0008l9659j0600M2343L5892
22500e5715L6044M5455j880l1217k3336n0565k9530J0729M1931J5363J2968O2162
22488C2409J4595P723o8823n560J9373K874j1809K5287L0305J6068J0881n7693
22476A5630j6735o3776m766M8670M3325J1291k7649j2122j6121L2175N7553p722
22464E9753J2259o47m7340K4585k6706L385j15o369j6510J5574K6355m0100r0142
22451h6018M133M9252k3595J6076n1675l2409P7607Q8306r10m4495N2978N4461
$$ plain form
22439 103711 134150 115291 74955 -3215 -13390 5457 17424 -19735 -35483 -48715 -13411
22428 -13411 926 31476 20015 4485 51343 84412 22513 20959 -13282 -58145 -2312 3659
22416 3659 36528 50784 672 -16130 -43965 -35496 -25332 -43890 -96268 -120797 -92050 -107020
22404 -107020 -53202 -24560 -4215 -13980 -58008 -83457 -56355 -11483 29984 -8436 -34655 29683
22392 29683 64448 37208 -33177 32473 29462 24110 17854 -10262 -54186 -58349 -48936 -12109 12290
22379 12290 -20374 14159 19823 -9598 -19370 -12266 29686 -9327 -9043 22238 2818 -4100 -5597
22366 -5597 16963 6582 -16588 13917 63520 100378 116729 113963 64053 54958 72492 19358
22354 19358 20266 6249 -55563 -120717 -109117 -98046 -89547 -43033 -61843 -72757 11113 22496
$$ packed form
22439A03711L0439j8859m0336p8170j0175J8847J1967l7159j5748j3232L5304
22428a3411J4337L0550j1461j5530M6858L3069o1899j554l4241m4863N5833N971
22416C659L2869J4256n0112j6802k7835Q469J0164j8558n2378k4529K8747j4970
22404a07020N3818K8642K0345r765m4028k5449K7102M4872M1467l8420k6219O4338
22392B9683L4765k7240p0385O5650l011n352o256k8116m3924m163R413L6827K4399
22379A2290l2664L4533N664k9421r772P104M1952l9013K84L1281j9420o918j497
22366e597K2560j0381k3170L0505M9603L6858J6351k766m9910r095J7534n3134
22354A9358R08j4017o1812o5154J1600J1071Q499M6514j8810j0914Q3870J1383
$$ plain form
22342 22496 2371 -11152 -93953 -58431 -30699 -2334 -1459 6447 52283 13646 -4258 -18591
22330 -18591 -59191 -69327 -51117 -91895 -106802 -37207 3027 -20143 -94405 -116849 -58138 -43906
22318 -43906 -31975 -788 71572 20817 36401 71663 98447 53168 4889 -45274 -82163 -80165
22306 -80165 -2719 53956 22810 -33189 -88378 -81983 -64245 20109 100706 77886 -52478 -105228
22294 -105228 -53921 644 23278 -6794 -14190 -15053 -10796 -13120 -8829 11705 5211 32873 17500
22281 17500 6367 -34941 -112421 -135594 -120164 -66388 -28559 -13228 21091 -21488 -36829 -35981
22269 -35981 -52931 -86392 -75652 -102838 -43967 3684 48409 41230 -47111 -140994 -140110 -84672
22257 -84672 -65323 -69991 -73393 -70080 -109838 -162534 -167243 -119433 -131719 -108317 -77286 -88962
$$ packed form
22342B2496k0125j3523q2801L5522K7732K8365Q75P906M5836l8637j7904j4333
22330a8591m0600j0136J8210m0778j4907O9595M0234k3170p4262k2444N8711J4232
22318d3906J1931L1187P2360n0755J5584L5262K6784m5279m8279n0163l6889J998
22306h0165P7446N6675l1146n5999n5189O395J7738Q4354Q0597k2820j30364n2750
22294a05228N1307N4565K2634l0072p396q63M257k324M291K0534o494K7662j5373
22281A7500j1133m1308p7480k3173J5430N3776L7829J5331L4319m2579j5341Q48
22269c5981j6950l3461J0740k7186N8871M7651M4725p179q8341r3883Q84N5438
22257h4672J9349m668l402L313l9758n2696m709M7810j2286K3402L1031j1676
$$ plain form
22245 -88962 -84506 -50563 -40217 -20075 22982 23714 34446 11652 12559 2697 14284 48535 87422
22232 87422 65440 59042 29535 33904 -1293 -34944 -27724 21759 67541 11655 -12291 -2053
22220 -2053 38133 39181 44159 11923 129 5459 49312 -17567 -140794 -136805 -51096 -62270
22208 -62270 9207 108512 87798 57718 60663 31525 62290 77625 70662 -16044 -74949 -77665
22196 -77665 -75872 -37987 -3798 22937 7440 -16699 8766 13574 4146 45145 45129 52888 36232
22183 36232 -15209 -102962 -95239 -25226 -23118 -86178 -142743 -141317 -92511 -61128 -82209 -82316 -94502
22170 -94502 -48465 -52618 -72969 -53085 4797 -16866 972 22238 -15048 -9881 -34431 -23075
22158 -23075 13692 44850 4589 -49306 -89517 -46998 -10669 -21923 -40688 -49525 -33660 -42175
$$ packed form
22245h8962M456L3943J0346K0142M3057P32J0732k2794R07r862J1587L4251L8887
22232H7422k1982o398k9507M369l5197l3651P220M9483M5782n5886k3946J0238
22220b053M0186J048M978l2236j1794N330M3853o6879j23227L989Q5709j1174
22208f2270P1477R9305k0714l0080K945k9138L0765J5335o963q6706n8905k716
22196g7665J793L7885L4189K6735j5497k4139K5465M808r428M0999j6P759j6656
22183C6232n1441q7753P723P0013K108o3060n6565J426M8806L1383k1081j07j2186
22170i4502M6037m153k0351J9884N7882k1663J7838K1266l7286N167k4550J1356
22158b3075L6767L1158m0261n3895m0211M2519L6329j1254j8765q837J5865q515
$$ plain form
22146 -42175 -59889 -84733 -89205 -77825 -47555 -25061 11753 76018 104410 85170 72361 68808
22134 68808 -28404 -91705 -100775 -45174 3203 21563 14394 376 -48547 -96693 -65826 -42023
22122 -42023 -16781 16578 -40850 -76081 -91181 -96014 -32844 -25191 -81152 -26468 19765 -48049
22110 -48049 -97240 -113190 -60517 -94521 -108716 26004 43436 -52025 -80405 -15849 6822
22099 6822 22790 24409 -7537 -52227 -67407 -28201 -10125 -17978 -100540 -92902 -17386 4981
22087 4981 11141 39670 40030 55845 8913 -4175 22396 1914 -14343 7151 43323 15660
22075 15660 -43668 -55302 -42427 11849 26519 21579 37249 67988 72137 22640 -17333 -67903
22063 -67903 -26163 4768 -21841 -319 22590 34759 71654 84397 12326 -6652 2272 -41135
$$ packed form
22146d2175j7714k4844m472J1380L0270K2494L6814O4265K8392j9240j2809l553
22134F8808r7212o3301r070N5601M8377J8360p169j4018m8923m8146L0867K3803
22122d2023K5242L3359n7428l5231j5100m833O3170P653n5961N4684M6233o7814
22110d8049m9191j5950N2673l4004j4195J34720J7432r5461k8380O4556K2671
22099F822J5968J619l1946m4690j5180L9206J8076p853q2562P638P5516K2367
22087D981O160K8529L60J5815m6932j3088K6571k0482j6257K1494L6172k7663
22075A5660n9328j1634J2875N4276J4670m940J5670L0739M149m9497l9973n0570
22063f7903M1740L0931k6609K1522K2909J2169L6895J2743p2071j8978Q924m3407
$$ plain form
22051 -41135 -43966 -14000 20851 6778 25514 -17538 -25889 -27741 -24090 -14451 56305 26771 -62041
22038 -62041 -36849 -27966 -17595 3586 26405 6828 31570 25440 32427 76715 47269 21367
22026 21367 1243 -14520 27957 16702 -21450 -31426 -59096 -69995 -72168 14037 40856 -23119
22014 -23119 -70694 -70790 -34862 21561 58203 3313 -43471 -66689 -62040 22587 19953 -2845 21479
22001 21479 28043 39982 43724 38438 15587 749 -16868 25638 40661 7308 -339 -13312
21989 -13312 -58659 -70208 -94120 -44353 -10982 -4525 -12343 -49182 -56227 -17959 -37380 -59690
21977 -59690 -97332 -89977 -40871 -19986 8793 30483 -26315 -72675 -81414 -63183 -34966 -19477
21965 -19477 -4588 -5115 -42362 -14308 15751 21888 31174 54867 61950 -17546 18609 45360 -34450
$$ packed form
22051d1135k831K9966L4851j4073J8736m3052q351j852L651R639P0756k9534q8812
22038f2041K5192Q883J0371K1181K2819j9577K4742o130O987M4288k9446k5902
22026B1367k0124j5763M2477j1255l8152r976k7670j0899k173Q6205K6819o3975
22014b3119m7575r6L5928N6423L6642n4890m6784k3218M649Q4627k634k2798K4324
22001B1479O564J1939L742n286k2851j4838j7617M2506J5023l3353p647j2973
21989a3312m5347j1549k3912M9767L3371O457p818l6839p045L8268j9421k2310
21977e9690l7642P355M9106K0885K8779K1690n6798m6360q739J8231K8217J5489
21965a9477J4889n27l7247K8054L0059O137R286K3693P083p9496L6155K6751p9810
$$ plain form
21952 -34450 -23140 -53622 -63127 -9258 36598 2294 -57408 -10592 2415 -23003 40998 47724
21940 47724 81700 90469 69905 42387 56566 65858 10462 15011 43303 -3036 -39356 -33624
21928 -33624 -83278 -181536 -148169 -117162 -75478 -28345 -48534 -55813 -31980 -18634 -77961 -87024
21916 -87024 -60881 -15676 1907 -6417 -1896 15992 30803 41553 15150 10485 -29353 -71769
21904 -71769 -125459 -114728 -105429 -58688 -30768 -5038 -2002 -20503 35589 31542 56329 30238
21892 30238 -36084 -124586 -187184 -160221 -91709 -76069 -118440 -64667 -8815 -25326 -32699 -1739
21880 -1739 36144 -15568 10024 23852 24887 13567 -30745 -15376 6761 25010 -40459 -78958
21868 -78958 -102985 -83859 -80541 -93145 -69994 -84698 -144873 -178150 -151017 -73730 -72371 -86222
$$ packed form
21952c4450J1310l0482r505N3869M5856l4304n9702M6816J3007k5418O4001O726
21940D7724L3976Q769k0564k7518J4179R292n5396M549K8292m6339l6320N732
21928c3624m9654r8258L3367L1007M1684M7133k0189p279K3833J3346n9327r063
21916h7024K6143M5205J7583q324M521J7888J4811J0750k6403m665l9838m2416
21904g1769n3690J0731R299M6741K7920K5730L036j8501N6092m047K4787k6091
21892C0238o6322q8502o2598K6963O8512J5640m2371N3773N5852j6511p373L0960
21880a739L7883n1712K5592J3828J035j1320m4312J5369K2137J8249o5469l8499
21868g8958k4027J9126L318j2604K3151j4704o0175l3277K7133P7287J359j3851
$$ plain form
21856 -86222 -89191 -121054 -103203 -25271 -177 10732 10735 65036 84176 84169 14250 -76792 -116606
21843 -116606 -101104 -58342 5180 75142 46974 43340 26926 -1964 -10490 11200 -9651 -64529
21831 -64529 -47493 -60758 -61712 -66181 -88240 -104249 -78564 -64303 -48579 -28083 -6616 -25049
21819 -25049 -42133 -89099 -97112 -43271 -66480 -12891 37056 33407 11117 5598 -30185 -54658
21807 -54658 -22062 9034 -21645 -19669 -33834 -66439 -125664 -97281 -37826 -4639 -289 -5805
21795 -5805 -20095 14136 29404 38139 37093 39518 86406 67332 34157 15666 13890 -4546 11842
21782 11842 -5246 -28322 -97172 -89495 -52231 -3131 40087 -25729 -27180 -20699 16628 14954
21770 14954 44563 115654 79139 15675 -23222 -43824 -70389 -60662 -61577 -63311 -70132 -15350 40128
$$ packed form
21856h6222k969l1863J7851P7932K5094J0909LN4301J9140po9919r1042l9814
21843a16606J5502M2762O3522O9962k8168l634j6414k8890q526K1690k0851n4878
21831f4529J7036j3265r54m469k2059j6009K5685J4261J5724K0496K1467j8433
21819b5049j7084m6966q013N3841k3209N3589M9947l649k2290n519l5783k4473
21807e4658L2596L1096l0679J976j4165l2605n9225K8383N9455L3187M350n516
21795e805j4290L4231J5268Q735j046K425M6888j9074l3175j8491j776j8436J6388
21782A1842j7088k3076o8850P677L7264M9100M3218o5816j451O481L7327j674
21770A4954K9609P1091l6515o3464l8897k0602k6565R727r15j734o821N4782N5478
$$ plain form
21757 40128 12939 -30792 2765 2121 -58951 -88854 -67779 21415 40797 18582 -38721 -30518
21745 -30518 -13224 3894 -41264 -56181 -30803 -46684 -64191 -140848 -115521 -40509 -69443 -32190
21733 -32190 -523 -17620 -35452 -18781 -5190 1252 -7223 23923 23296 -3225 -45376 -48360 4654
21720 4654 22113 -20935 19946 95378 52952 25296 56569 57654 60126 44269 21475 10173
21708 10173 24103 72071 89038 72365 45462 21301 -26682 -95189 -71105 -24909 11272 34240
21696 34240 -44943 -76561 -56278 -24907 -14031 -50537 -37952 -41534 -29134 -13279 -10844 -1721
21684 -1721 47735 60949 20457 17655 14267 27157 20611 -25074 -42569 -17521 18238 70361
21672 70361 116646 99726 110100 64609 26164 19401 30893 69701 94499 76031 31616 -40286
$$ packed form
21757D0128k7189m3731L3557o44o1072k9903K1075Q9194J9382k2215n7303Q203
21745c0518J7294J7118m5158j4917K5378j5881j7507p6657K5327P5012k8934L7253
21733c2190L1667j7097j7832J6671J3591O442q475L1146o27k6521m2151k984N3014
21720D654J7459m3048M0881P5432m2426k7656L1273J085K472j5857k2794j1302
21708A0173J3930M7968J6967j6673k6903k4161m7983o8507K4084M6196L6181K2968
21696C4240p9183l1618K0283L1371J0876l6506J2585l582J2400J5855K435R123
21684a721M9456J3214m0492k802l388J2890o546m5685j7495K5048L5759N2123
21672G0361M6285j6920J0374m5491l8445o763J1492L8808K4798j8468m4415p1902
$$ plain form
21660 -40286 -11026 52820 44425 15333 8407 -31792 -39467 -56120 -81367 -61921 -43322 -10578
21648 -10578 -4658 -31852 -21831 -37970 -40481 -37550 40803 72709 50691 42021 4951 -28490
21636 -28490 -54113 -79514 -66914 -45630 -10513 -47636 -121892 -127455 -118102 -112224 -121571 -107118
21624 -107118 -77310 -15926 21141 7864 -60473 -102157 -10679 104481 100000 16532 21354 3452
21612 3452 41046 52459 19367 -30232 -36577 -75988 -28858 26506 74949 100697 58872 31008
21600 31008 16878 -17842 -30640 -14985 -37913 -28031 -11831 -3079 22658 55952 41526 30756
21588 30756 25598 34724 20037 3028 -1102 -22976 2098 9036 -21851 -12993 -23693 -4375 -9728
21575 -9728 -20385 -17808 -26058 27043 43097 1453 -24022 -25082 19618 -14312 -22879 -45237 -107939
$$ packed form
21660d0286K9260O3846q395k9092o926m0199p675j6653k5247J9446J8599L2744
21648a0578N920k7194J0021j6139k511K931P8353L1906k2018q670l7070l3441
21636b8490k5623k5401J2600K1284L5117l7123p4256n563R353N878r347J4453
21624a07118K9808O1384L7067j3277o8337m1684R1478J15160m481q3468M822j7902
21612C452L7594J1413l3092m9599o345l9411M7130N5364M8443K5748m1825k7864
21600C1008j4130l4720j2798J5655k2928R882J6200Q752K5737L3294j4426j0770
21588C0756n158R126j4687j7009m130k1874K5074O938l0887Q858j0700J9318n353
21575i728j0657K577q250N3101J6054m1644k5475j060M4700l3930q567k2358o2702
$$ plain form
21562 -107939 -149181 -126693 -135050 -125459 -151714 -134232 -89254 -64511 -23593 -48036 -83969 -93332
21550 -93332 -51578 -50467 -25991 1534 -18324 -57520 -77479 -69535 -16056 31657 -2964 -41027
21538 -41027 -64665 -84358 -37841 74042 76842 8847 -44588 -24416 -19557 -69892 -35601 -29738
21526 -29738 -767 22380 67808 52691 35461 25304 51889 34003 -1785 -4221 29190 78243
21514 78243 35312 52837 42322 -9388 20098 23181 31953 -4150 -36043 -51249 -44768 -44529 -29912
21501 -29912 -37686 -67904 -91250 -40172 -4815 -33302 -32181 58 31729 8727 -32611 -50161
21489 -50161 -45260 -13340 5009 -50177 -120064 -123820 -117738 -44429 27217 28930 59948 73757
21477 73757 89673 44219 7857 -24709 -61969 -110087 -95489 -15023 67967 68794 28386 -5859
$$ packed form
21562a07939m1242K2488q357R591k6255J7482M4978K4743M0918k4443l5933r363
21550i3332M1754J111K4476K7525j9858l9196j9959P944N3479M7713l4621l8063
21538d1027k3638j9693M6517J11883K800o7995n3435K0172M859n0335L4291N863
21526b9738K8971K3147M5428j5117j7230j0157K6585j7886l5788k436L3411M9053
21514G8243m2931J7525j0515n1710K9486L083Q772l6103l1893j5206O481K39J4617
21501b9912p774l0218k3346N1078L5357k8487J121L2239L1671k3002m1338j7550
21489e0161M901L1920J8349n5186o9887l756O082P3309P1646J713L1018J3809
21477G3757J5916m5454l6362l2566l7260m8118J4598Q0466Q2990Q27m0408l4245
$$ plain form
21465 -5859 18406 50289 92041 61208 -3218 56807 75657 6655 -65735 -35962 -32901 2187
21453 2187 47004 56146 26137 22109 -18312 -45016 -77000 -91325 -23586 -42190 -98467 -47943
21441 -47943 -3557 -26606 -35959 -14308 -51244 -68941 -16349 47310 58893 25168 55487 54242
21429 54242 9363 31603 51794 53985 60984 85145 93287 80782 25742 -23539 -22727 36529 18137
21416 18137 -17768 -55479 7034 -3085 -25457 -40454 -8732 46672 72509 70987 61430 24032
21404 24032 -40070 -60597 17282 32306 -63570 -35398 -35367 -47355 -91662 -112574 -103461 -37616
21392 -37616 -22873 -31791 4388 19146 -13528 7234 31613 55001 62306 8905 45646 47593
21380 47593 -16742 -39012 -63444 -72393 -56073 -152084 -152159 -69579 -46652 -28492 -21858 -70061 -40879
$$ packed form
21465e859K4265L1883M1752l0833o4426O0025J8850o9002p2390K9773L061L5088
21453B187M4817R142l0009m028m0421k6704l1984j4325O7739j8604n6277N0524
21441d7943M4386k3049r353K1651l6936j7697N2592O3659J1583l3725L0319j245
21429E4242m4879K2240K0191K191O999K4161Q142j2505n5040m9281Q12N9256j8392
21416A8137l5905l7711O2513j0119k2372j4997L1722N5404K5837j522r557l7398
21404B4032o4102k0527P7879J5024r5876K8172L1j1988m4307k0912R113O5845
21392c7616J4743q918L6179J4758l2674K0762K4379K3388P305n3401L6741J947
21380D7593o4335k2270k4432q949J6320r6011p5Q2580K2927J8160O634m8203K9182
$$ plain form
21367 -40879 -66548 -109816 -43056 6756 2870 -29720 -17108 -2432 -39475 -69863 -79737 -83428
21355 -83428 -33868 1028 48503 56159 2060 -68344 -20786 -20503 -7011 -51840 -57171 -110427
21343 -110427 -96717 -59052 -16659 26603 17670 -48225 -35827 -90912 -123492 -106717 -85004 -48398
21331 -48398 -37867 1919 29783 15929 -30305 -10243 13817 13984 -4189 34508 5161 -70405
21319 -70405 -88530 -32636 -62015 -71639 -18747 9726 22566 42374 6529 24804 66496 57409
21307 57409 -25916 -42691 -45800 23134 -9914 -52866 -14695 -24159 -35527 -16849 -44118 17466
21295 17466 22614 -94413 -119776 -99790 -107459 -100127 13019 30785 -14116 -12220 -33405 -17144
21283 -17144 -30976 -35577 -39445 -8024 28946 23837 31585 22446 875 30752 -25261 -115726 -77307
$$ packed form
21367d0879k5669m3268O6760M9812l886l2590J2612J4676l7043l0388r874l691
21355h3428M9560L4896M7475P656n4099p0404M7558K83J3492m4829n331n3256
21343a10427J3710L7665M2393M3262q933o5895J2398n5085l2580J6775K1713L6606
21331d8398J0531L9786K7864j3854m6234K0062K4060J67j8173L8697k9347p5566
21319g0405j8125N5894k9379r624N2892K8473J2840J9808l5845J8275M1692r087
21307E7409q3325j6775l109O8934l3048m2952L8171r464j1368J8678k7269O1584
21295A7466N148j17027k5363J9986p669P332J13146J7766m4901J896k1185J6261
21283a7144j3832m601l868L1421L6970n109P748r139k1571K9877n6013r0465L8419
$$ plain form
21270 -77307 -61921 -81305 -85587 -66381 -56314 -49885 -21771 -30777 -31517 -36114 -13402 13854 5364
21257 5364 21686 23383 43454 -12824 -25836 -58418 -56494 -29096 -26453 -43965 -68924 -55584
21245 -55584 -76320 -72905 -72910 -36984 -46137 -52445 -44766 -36341 -19877 -49959 -69569 -94588 -77686
21232 -77686 19817 30030 7689 936 -24378 -36148 -63325 -41871 -39493 -36432 -41083 37437
21220 37437 28592 31648 20092 11152 16653 -32016 -22190 15005 6010 -26605 -19857 -43597 -54344
21207 -54344 -75065 -56166 -2397 -14306 -52897 -46985 -14575 12651 26119 30647 5366 31803
21195 31803 71336 30183 -18365 -64 -34411 -56332 -81010 -78574 -25882 -573 52742 34726
21183 34726 58853 33117 15917 -15000 -97646 -131815 -102916 -51495 21158 6151 -71860 -31092
$$ packed form
21270g7307J5386j9384m282J9206J0067O429K8114r006p40m597K2712K7256q490
21257E364J6322J697K0071n6278j3012l2582J924K7398K643j7512k4959J3340
21245e5584k0736L415nL5926r153o308P679Q425J6464l0082j9610k5019J6902
21232g7686R7503J0213k2341o753k5314j1770k7177K1454K378L061m651P8520
21220C7437q845L056j1556q940N501m8669R826L7195q995l2615O748k3740j0747
21207e4344k0721J8899N3769j1909l8591N912L2410K7226J3468M528k5281K6437
21195C1803L9533m1153m8548J8301l4347k1921k4678K436N2692K5309N3315j8016
21183C4726K4127k5736j7200l0917q2646l4169K8899N1421P2653j5007p8011M0768
$$ plain form
21171 -31092 64121 70276 39531 25870 10264 -40230 -65349 -78393 -54594 -45291 -33765 -119676
21159 -119676 -157675 -186877 -159597 -103950 -99231 -99301 -59561 -84877 -75498 -12466 -2218 32923
21147 32923 18275 -3282 8198 34551 23340 -9496 -23092 -54986 -36211 16399 81986 104834
21135 104834 102817 91890 58654 86312 110508 104804 82929 26584 33482 13419 5301 -1106
21123 -1106 -40351 -74782 -79428 1384 23728 68471 74973 51111 14558 -54250 -82077 -98453
21111 -98453 -69166 2107 41092 51142 23443 -3804 -23180 -48133 -94903 -78096 -14775 2194
21099 2194 -37242 -47977 -67062 -52801 -6458 -1292 3941 30484 -4351 -16109 -36710 -7312
21087 -7312 9725 93580 93690 64621 54473 39708 -3231 18658 48079 92516 112029 84169
$$ packed form
21171c1092R5213O155l0745j3661j5606n0494k5119j3044K3799R303J1526q5911
21159a19676l7999k9202K7280N5647M719p0L9740k5316R379O3032J0248L5141
21147C2923j4648k1557J1480K6353j1211l2836j3596l1894J8775N2610O5587K2848
21135A04834k017j0927l3236K7658K4196n704k1875n6345O898k0063q118o407
21123a106l9245l4431m646Q0812K2344M4743O502k3862l6553o8808k7827j6376
21111i8453K9287P1273L8985J0050k7699k7247j9376k4953m6770J6807O3321J6969
21099B194l9436j0735j9085J4261M6343N166N233K6543l4835j1758k0601K9398
21087g312J7037Q3855J10k9069j0148j4765m2939K1889K9421M4437J9513k7860
$$ plain form
21075 84169 63256 36903 10790 45551 82110 95700 74074 39723 -27219 -50608 -25376 -20246
21063 -20246 -36735 -37060 -46470 -2395 21039 -23852 -9762 39813 20477 24943 49150 77591
21051 77591 36031 -10493 -34986 -47233 16005 84146 58127 48503 40454 70092 93854 83788
21039 83788 58331 65025 66486 114742 101760 39640 10550 29851 42519 19199 28374 20055
21027 20055 57535 69006 31138 2982 -16255 -4596 -21910 -9867 12783 9538 22987 42888
21015 42888 -5941 -6314 -2646 20820 20134 43652 39457 68348 159980 156947 130000 90005 44065
21002 44065 36042 30028 17515 17087 -52984 -100103 -78024 -52830 -38394 -13977 57872 98315
20990 98315 90779 57741 57178 34860 27852 24766 34118 49212 43399 9174 -21610 -5040 62512
$$ packed form
21075H4169k0913k6353k6113L4761L6559J3590k1626l4351o6942k3389K5232N130
21063b0246j6489l25r410M4075K3434m4891J4090M9575j9336M466K4207K8441
21051G7591m1560m6524k4493j2247O3238O8141k6019r624q049K9638K3762j0066
21039H3788k5457O694J461M8256j2982o2120k9090J9301J2668k3320R175q319
21027B0055L7480J1471l7868k8156j9237J1659j7314J2043K2650l245J3449J9901
21015D2888m8829l73L668K3466o86K3518m195K8891R1632l033k6947l9995m5940
21002D4065q023o014j2513m28p0071m7119K2079K5194J4436K4417P1849M0443
20990I8315p536l3038n63k2318p008l086R352J5094n813l4225l0784J6570O7552
$$ plain form
20977 62512 104626 39676 37252 71704 18606 -23828 -1152 -13820 -40252 -39103 -36016 -9481
20965 -9481 13494 15227 32511 76242 89129 73667 96684 69975 10032 56946 118608 91389
20953 91389 13358 23242 29550 41200 85720 96417 80311 85854 89715 161147 174385 129126
20941 129126 144565 157430 144355 84015 120749 152906 124565 110728 104836 68545 27833 17715
20929 17715 24002 84374 97361 112277 125789 139955 143766 175898 201490 239809 224609 224057
20917 224057 250146 222636 205057 216595 231358 204614 151007 185714 185235 217034 198073 192378
20905 192378 180136 189765 192902 201368 169716 174946 194024 180421 107844 152285 129444 91369
20893 91369 96857 141683 113076 68871 70962 110283 139844 163890 156152 146765 221719 242889
$$ packed form
20977F2512M2114o4950k424L4452n3098m2434K2676j2668k6432J149L087K6535
20965i481K2975J733J7284M3731J2887j5462K3017k6709n9943M6914O1662k7219
20953I1389p8031R884O308J1650M4520J0697j6106N543L861P1432J3238m5259
20941A29126J5439J2865j3075o0340L6734L2157k8341j3837n892l6291m0712j0118
20929A7715O287O0372J2987J4916J3512J4166L811L2132K5592L8319j5200n52
20917B24057K6089k7510j7579J1538J4763k6744n3607L4707m79L1799j8961n695
20905A92378j2242R629L137Q466l1652N230J9078j3603p2577M4441k2841l8075
20893I1369N488M4826k8607m4205K091L9321K9561K4046p738r387P4954K1170
$$ plain form
20881 242889 220164 209182 188653 170793 151227 136813 98952 79780 -14865 -629 79184
20870 79184 120622 125626 112133 92915 87508 75272 48615 101109 161165 179384 189382 120773
20858 120773 83957 119732 197580 161231 138866 195331 199879 160000 122171 111385 140646 106685
20846 106685 33471 9483 45032 60047 70522 44355 52410 -3663 -26607 -6483 61568 112119
20834 112119 100765 54216 86919 80467 43999 56050 82051 132529 85076 68988 22040 32923
20822 32923 37988 71095 44580 -21981 -28995 8168 84425 89049 74413 46052 20263 38665
20810 38665 26123 -8777 -9169 2666 -26956 25124 92767 102343 148710 169383 141613 94783
20798 94783 63784 73020 46726 31546 43408 22703 -31928 5204 -27153 4070 -15680 12508
$$ packed form
20881B42889k2725j0982k0529j7860j9566j4414l7861j9172r4645J4236P9813
20870G9184M1438N004j3493j9218n407j2236k6657N2494O0056J8219R998o8609
20858A20773l6816L5775P7848l6349k2365N6465M548l9879l7829j0786K9261l3961
20846A06685p3214k3988L5549J5015J0475k6167Q055n6073k2944K0124O8051N0551
20834A12119j1354m6549L2703o452l6468J2051K6001N0478m7453j6088m6948J0883
20822C2923N065L3107k6515o6561p014L7163P6257M624j4636k8361k5789J8402
20810C8665j2542l4900l92J1835k9622N2080O7643R576M6367K0673k7770m6830
20798I4783l0999R236k6294j5180J1862k0705n4631L7132l2357L1223j9750K8188
$$ plain form
20786 12508 56308 11741 -31552 -72302 -97463 -82684 -8093 26943 47834 67908 75001 -1589
20774 -1589 -10919 8119 3046 -42600 -81124 -66451 -23443 -17787 -29744 -61846 -80459 -71577 -57446
20761 -57446 -24033 22472 63813 94302 112438 139275 106450 79448 21354 18494 61646 101412
20749 101412 86130 35094 40290 30740 59659 108264 74075 63738 51809 -36250 -29565 -30278
20737 -30278 -74946 -70416 -40161 13909 92696 88329 86236 71511 -1810 -1216 1925 -38688 -67590
20724 -67590 -81411 -88377 -42651 2546 -3910 -16422 3979 -13083 -34035 15518 51417 51968
20712 51968 -252 -10076 32509 15162 57743 29740 3608 10079 8187 9861 -31132 -35042 -25402
20699 -25402 28153 48817 39644 35456 239 -22656 38455 11857 38649 68295 -9593 -66344
$$ packed form
20786A2508M3800m4567m3293m0750k5161J4779P4591L5036K0891K0074P093p6590
20774a589r330J9038n073m5646l8524J4673M3008N656j1957l2102j8613Q882J4131
20761e7446L3413M6505M1341L0489J8136K6837l2825k7002n8094k860M3152L9766
20749A01412j5282n1036N196r550K8919M8605l4189j0337j1929q8059O685p13
20737c0278m4668M530L0255N4070P8787m367k093j4725p3321N94L141m0613k8902
20724f7590j3821o966M5726M5197o456j2512K0401j7062k0952M9553L5899N51
20712E1968n2220r824M2585j7347M2581k8003k6132O471j892J674m0993l910R640
20699b5402N3555K0664r173m188l5217k2895O1111k6598K6792K9646p7888n6751
$$ plain form
20687 -66344 -20081 29925 -4829 -91750 -50736 12925 -5589 -45344 -29454 -41044 -21303 -30824
20675 -30824 -14955 -3983 -39858 22281 58655 71975 123523 36890 -67746 -53193 -23747
20664 -23747 330 -1879 -9075 -32999 6947 35762 -1646 -59551 -93823 -91219 -93150 -33813
20652 -33813 -14190 -61794 -48475 -34521 -36536 -27700 7506 12616 24938 12083 -77351 -68882
20640 -68882 -56566 -17195 -19371 -13988 -26485 2478 66340 110844 39836 11596 203 -43287
20628 -43287 -43981 -38518 -20840 -15363 -39865 -37393 -17576 1038 -11037 -18949 -28789 -50890 -63203
20615 -63203 -67149 -24323 12197 45419 42860 24115 -7229 -15513 -26197 -4528 10356 25427
20603 25427 -8211 -47524 -21314 -22454 -2958 -9005 -29524 -29230 -7208 27824 17637 -3610
$$ packed form
20687f6344M6263N0006l4754q6921M1014O3661j8514l9755J5890j1590J9741r521
20675c0824J5869J0972l5875O2139L6374J3320N1548q6633j04636J4553K9446
20664b3747K4077k209p196k3924L9946K8815l7408n7905l4272K604j931N9337
20652c3813J9623m7604J3319J3954k015Q836L5206N110J2322j2855q9434Q469
20640f8882J2316L9371k176N383j2497K8963O3862M4504p1008k8240j1393m3490
20628d3287o94N463J7678N477k4502K472J9817J8614j2075p912r840k2101j2313
20615f3203l946M2826L6520L3222k559j8745l1344q284j0684K1669J4884J5071
20603B5427l3638l9313K6210j140J9496o047k0519K94K2022L5032j0187k1247
$$ plain form
20591 -3610 -28092 -33544 22612 64608 -13707 -26017 -50671 -30877 -25251 -17415 17664 69355
20579 69355 41050 12446 40544 51464 56840 56152 126095 124700 129823 76396 5166 -16859 -34013
20566 -34013 3306 60491 71403 19177 -19488 -46684 -92495 -76729 -21018 21086 -38778 -39659
20554 -39659 -57275 -36945 -17204 -37341 -18628 -9165 -21084 -16176 -4867 26907 24832 5621
20542 5621 -19458 -78962 -82968 -26694 -87333 -108225 -61945 -59997 -66012 -84770 -85205 -56930 -26423
20529 -26423 -3383 11386 3079 -27168 -25659 -800 -9968 -21250 4980 -6250 4762 -20594
20517 -20594 -39810 -87818 -77548 -33812 -82803 -89400 -54211 -31853 -53565 -64765 -56335 -35061
20505 -35061 -19652 -51681 -107982 -104861 -96666 -108271 -8461 103920 90099 45357 -11860 -58637
$$ packed form
20591c610k4482n452N6156M1996p8315j2310k4654J9794N626P836L5079N1691
20579F9355k8305k8604K8098J0920N376o88O9943j395N123n3427p1230k2025j7154
20566c4013L7319N7185J0912n2226l8665k7196m5811J5766N5711M2104n9864q81
20554c9659j7616K0330J9741k0137J8713R463j1919M908J1309L1774k075j9211
20542E621k5079n9504m006N6274o0639k0892M6280J948o015j8758m35K8275L0507
20529b6423K3040J4769q307l0247J509K4859r168j1282K6230j1230J1012k5356
20517b0594j9216m8008J0270M3736m8991o597L5189K2358k1712j1200Q430K1274
20505c5061J5409l2029n6301L121Q195j1605R9810J12381j3821m4742n7217m6777
$$ plain form
20493 -58637 -47889 -56289 -58108 -83223 -120417 -123361 -28394 17878 26047 78814 57085 63141 85158
20480 85158 79541 30828 -19858 -24273 -26794 -44839 34409 50264 92021 105345 96662 103114 93229
20467 93229 41143 -24632 -18454 -32428 -26594 -30690 -2953 39417 117521 113529 19923 20067 39798
20454 39798 50349 90677 37995 -3079 21980 41159 21509 -2915 -41428 -64780 -51213 12536
20442 12536 -5438 -19235 7397 -11488 -3829 -29019 -62634 -68342 -61169 -45904 -39752 -16920
20430 -16920 18063 67052 62646 -1707 -26416 -2167 -20079 -45100 -104684 -125325 -116948 -109949
20418 -109949 -87856 -19183 6007 30590 -28000 -61358 -43620 -28973 4091 34668 -276
20407 -276 -67953 -115549 -52521 -32926 -45396 -60731 -50469 -51879 -40223 11420 -8977 -26444
$$ packed form
20493e8637J0748q400j819k5115l7194k944R4967M6272Q169N2767k1729O056K2017
20480H5158n617m8713n0686m415k521j8045P9248J5855M1757J3324q683O452r885
20467I3229n2086o5775O178j3974N834m096K7737M2370P8104l992r3606J44J9731
20454C9798J0551M0328n2682m1074K5059J9179j9650k4424l8513k3352J3567O3749
20442A2536j7974j3797K6632j8885P659k5190l3615n708P173J5265O152K2832
20430a6920L4983M8989m406o4353k4709K4249j7912k5021n9584k0641Q377O999
20418a09949K2093O8673K5190K4583n8590l3358J7738J4647L3064L0577l4944
20407b76o7677m7596O3028J9595j2470j5335J0262j410J1656N1643k0397j7467
$$ plain form
20395 -26444 -9717 -48471 -24885 -7521 5449 -5544 20253 17578 -38577 -25295 -18676 -437
20383 -437 -16024 -54774 -60284 -26905 -97631 -133751 -69091 -32619 -39906 -31737 -22358 -18746 -47346
20370 -47346 -84392 -43875 -12007 33701 57070 59928 91888 61093 5447 -23677 -49226 -5991
20358 -5991 -11767 -72916 -59290 12736 16654 -9292 9642 50240 50586 -21696 -10168 -25467 -85008
20345 -85008 -52105 -60304 -98920 -87799 -47443 -22729 1159 34240 -27456 -111483 -99583 -45658
20333 -45658 18231 -9106 -23927 -13099 35977 51151 46399 77952 79727 26187 -61918 -57021
20321 -57021 -79108 -78722 -49772 -32359 -72024 -101731 -45403 -35737 -37132 -23231 -27133 -19670 -43915
20308 -43915 -54358 -88309 -86642 -15455 108862 105673 8706 -51015 949 31305 14649 -12767
$$ packed form
20395b6444J6727l8754K3586J7364J2970j0993K5797k675n6155J3282O619J8239
20383d37j5587l8750n510L3379p0726l6120O4660L6472p287Q169R379L612k8600
20370d7346l7046M0517L1868M5708K3369K858L1960l0795n5646k9124k5549M3235
20358e991n776o1149J3626P2026L918k5946J8934M0598L46p2282J1528j5299n9541
20345h5008L2903q199l8616J1121M0356K4714K3888L3081o1696q4027J1900N3925
20333d5658O3889k7337j4821J0828M9076J5174m752L1553J775n3540q8105M897
20321e7021k2087L86K8950J7413l9665k9707N6328R666j395J3901l902P463k4245
20308d3915j0443l3951J667P1187J24317l189r6967n9721N1964L0356j6656k7416
$$ plain form
20296 -12767 33899 1496 2183 34168 29573 33843 19274 -12997 -63792 -61977 -10940 41724 46275
20283 46275 -22049 -54616 -46849 -10623 -16287 -15038 -28505 -23069 26313 42074 66710 78422
20271 78422 108359 94506 86858 106286 60571 9315 13322 13148 10340 -1734 -60499 -87325 -73062
20258 -73062 -51672 -24919 -12149 5570 43822 57715 57223 15564 -26664 -69485 -108804 -115169
20246 -115169 -74377 -47894 -37479 -8079 46568 73226 97161 49692 25459 38143 28921 94456
20234 94456 102349 31814 13589 20994 -9890 8731 57175 73853 76366 62573 59360 53725 52274
20221 52274 18757 72757 134333 95986 -40785 -123506 -137991 -88419 -118991 -112160 -99276 -56787
20209 -56787 -12604 -9686 43711 60161 -26670 -67425 -56012 -57991 -30936 -15094 -46866 -43803
$$ packed form
20296a2767M6666l2403O87L1985m595M270j4569l2271n0795J815N1037N2664M551
20283D6275o8324l2567P767L6226n664J249j3467N436M9382J5761K4636J1712
20271G8422K9937j3853p648J9428m5715n1256M007j74k808j2074n8765k6826J4263
20258g3062K1390K6753J2770J7719L8252J3893m92m1659m2228m2821l9319o365
20246a15169M0792K6483J0415K9400N4647K6658K3935m7469k4233J2684r222O5535
20234I4456P893p0535j8225P405l0884J8621M8444J6678K513j3793l213n635j451
20221E2274l3517N4000O1576l8347j36771q2721j4485M9572l0572O831J2884M2489
20209e6787M4183K918N3397J6450q6831m0755J1413j979K7055J5842l1772L063
$$ plain form
20197 -43803 -28718 -56422 -92939 -20209 12549 -43808 -72282 -742 76371 39423 7674 -4123
20185 -4123 -53505 -67683 -41801 -2786 34393 24097 253 -13683 18750 58709 64748 47541
20173 47541 38951 26361 13946 -52606 -64664 -62752 -25867 31803 57587 48831 90169 72052
20161 72052 7245 -39992 -53567 -31776 -14387 -130 -8736 -11312 -44017 -1770 -7010 -43992
20149 -43992 -38626 -19792 30393 82552 79850 83604 139809 71575 -33479 -29910 -50880 -32407
20137 -32407 24037 49073 108938 109599 100868 95537 36037 10494 12883 -54211 -27387 35875 98110
20124 98110 101321 66782 47099 -17727 -19266 -32276 -47311 -47197 -50292 4085 27123 7275 -38297
20111 -38297 -70536 -80466 -45174 -56343 -101531 -90095 -97213 -96868 -52956 -56550 6093 21175 -2238
$$ packed form
20197d3803J5085k7704l6517P2730L2758n6357k8474P1540P7113l6948l1749j1797
20185d123m9382j4178K5882L9015L7179j0296k3844j3936L2433L9959O039j7207
20173D7541q590j2590j2415o6552j2058J912L6885N7670K5784q756M1338j8117
20161G2052o4807m7237j3575K1791J7389J4257q606k576l2705M2247n240l6982
20149d3992N366J8834N0185N2159k702L754N6205o8234j05054L569k0970J8473
20137c2407N6444K5036N9865O61q731n331n9500k5543K389o7094K6824O3262O2235
20124I8110L211l4539j9683o4826j539j3010j5035J14l095N4377K3038j9848m5572
20111c8297l2239r930L5292j1169m5188J1436p118L45M3912l594O2643J5082k3413
$$ plain form
20098 -2238 30828 19508 -23073 -13791 -30846 7029 -28092 -35933 22159 33990 60542 31699
20086 31699 -17644 -26445 -1169 67684 79434 -34260 -111565 -112353 -93451 -33335 -42534 2825
20074 2825 -18310 -52169 -76410 -73908 -85020 -69448 -97528 -81752 -75349 -46355 -13399 -51052
20062 -51052 -44332 -12086 -36794 -56233 -47433 -60816 -64463 -29523 14065 10185 -6485 -28246
20050 -28246 -17941 30394 32828 29798 23490 55500 19879 43980 77112 43264 -8348 -50367
20038 -50367 -40763 -25871 -31635 738 30507 49047 48358 18432 62381 104508 60503 82188
20026 82188 47880 24700 57393 30571 15452 66773 84918 96461 58783 26785 45785 39301
20014 39301 61996 54309 42134 44341 81753 84134 108136 130766 76905 32891 7961 -7970
$$ packed form
20098b238L3066j1320m2581R282j7055L7875l5121p841N8092J1831K6552k8843
20086C1699m9343q801K5276O8853J1750j13694p7305p88J8902O0116r199M5359
20074B825k1135l3859k4241K502j1112J5572k8080J5776O403K8994L2956l7653
20062e1052O720L2246k4708j9439Q800j3383l647L4940M3588l880j6670k1761
20050b8246J0305M8335K434l030o308L2010l5621K4101L3132l3848n1612m2019
20038e0367R604J4892n764L2373K9769J8540o89k9926M3949M2127m4005K1685
20026H2188l4308k3180L2693k6822j5119N1321J8145J1543l7678l1998J9000o484
20014C9301K2695p687j2175K207L7412K381K4002K2630n3861m4014k4930j5931
$$ plain form
20002 -7970 -32839 -41954 -29574 -29935 -35788 -3200 13047 2581 -28601 -25255 15741 43307 -7464
19989 -7464 405 17525 42499 33672 -15862 -27056 98163 99888 77560 10752 11751 35914 34435
19976 34435 81894 101937 68870 32385 60340 68896 25102 41034 75286 51099 24420 60103
19964 60103 76373 69507 50391 56762 39207 -1096 -33331 -62969 -42146 35770 85301 108894
19952 108894 116980 134490 89631 55273 12935 -19462 -31529 -82221 -87090 -74625 -56502 -25268
19940 -25268 -14193 -29563 44659 64086 -6220 -37178 -49152 -30971 24330 24905 -25187 -47648
19928 -47648 -11485 -4816 -10459 -11310 -3649 25917 21504 66580 81828 94135 57647 27037 1657
19915 1657 10524 43188 64633 87638 -19724 -103395 -78195 -19055 27076 -6969 142 28984
$$ packed form
20002g970k4869r115J2380l61n853L2588J6247j0466l1182L346M0996K7566n0771
19989g464P869J7120K4974q827m9534j1194J25219J725k2328o6808R99K4163j479
19976C4435M7459K0043l3067l6485K7955Q556m3794J5932L4252k4187k6679L5683
19964F0103J6270o866j9116O371j7555m0303l2235k9638K0823P7916M9531K3593
19952A08894Q086J7510m4859l4358m2338l2397j2067n0692m869J2465J8123L1234
19940b5268J1075j5370P4222J9427p0306l0958j1974J8181N5301N75n0092k2461
19928d7648L6163O669n643q51P661K9566m413M5076J5248J2307l6488l0610k5380
19915A657Q867L2664K1445K3005j07362q3671K5200N9140M6131l4045P111K8842
$$ plain form
19903 28984 17284 -11360 -23785 -32449 -41477 -14701 -36429 -59352 -57160 -22358 -53349 -108761
19891 -108761 -70315 -36143 -65231 -53487 -59110 -87703 -109939 -63701 -33616 -55309 -74870 -23864
19879 -23864 -28390 -5841 -5418 2146 28443 7811 52732 51770 23198 32724 47172 57383 12964
19866 12964 40747 48760 45230 44943 68185 136798 49582 -48864 -43870 883 4831 55907 33356
19853 33356 59212 116299 134413 91171 10758 -42209 -78636 -48932 -21484 -11614 -1062 4190
19841 4190 17712 -12506 -52813 -58042 -17049 20443 -3760 -40910 -61217 -29629 36934 53446
19829 53446 -18048 -39272 -35931 -54796 -6385 31209 67240 81845 4024 -31991 -19357 -27956
19817 -27956 8981 27262 59180 37089 -46984 -38725 -888 6460 8527 36441 59683 72573
$$ packed form
19903B8984j1700k8644j2425q664r028K6776k1728k2923K192L4802l0991n5412
19891a08761L8446L4172k9088J1744n623k8593k2236M6238L0085k1693j9561N1006
19879b3864m526K2549M23P564K6297k0632M4921r62k8572R526J4448J0211m4419
19866A2964K7783Q013l530k87K3242O8613q7216r8446M994M4753L948N1076k2551
19853C3356K5856N7087J8114m3242q0413n2967l6427K9704K7448R870J0552N252
19841D190J3522l0218m0307n229M0993L7492k4203l7150k0307L1588O6563J6512
19829E3446p1494k1224L341j8865M8411L7594L6031J4605p7821l6015J2634q599
19817b7956L6937J8281L1918k2091q4073Q259L7837P348K067K7914K3242J2890
$$ plain form
19805 72573 89444 105683 48137 2279 8574 1854 19703 48967 77022 76211 88529 120893
19793 120893 86630 34959 5864 -9579 -242 4897 18865 43065 4429 -6743 2065 47622
19781 47622 91835 117275 108665 86140 64063 69765 14620 -27114 10852 60254 76256 70591
19769 70591 66992 -25759 -60381 -52886 -50238 -38413 -44396 -56498 -51974 16599 30443 30792 38488
19756 38488 66127 40158 28825 -26090 16482 39470 -915 -47390 -57325 -52435 -9492 -41318
19744 -41318 -13666 50276 38321 -31892 -47161 -55292 -8308 53423 12229 -31929 -8468 -3183
19732 -3183 73785 78079 66657 23254 -35605 -106014 -103973 -73903 -24569 14980 48061 67629
19720 67629 73641 55201 25573 23684 42660 71074 108334 115598 110561 80723 73766 84322 53178
$$ packed form
19805G2573J6871J6239n7546m5858O295o720J7849K9264K8055q11J2318L2364
19793A20893l4263n1671k9095j5443R337N139J3968K4200l8636j1172Q808M5557
19781D7622M4213K5440q610k2525k2077N702n5145m1734L7966M9402J6002n665
19769G0591l599r2751l4622P495K648J1825n983j2102M524O8573J3844L49P696
19756C8488K7639k5969j1333n4915M2572K2988m0385m6475r935M890M2943l1826
19744d1318K7652O3942j1955p0213j5269q131M6984O1731m1194m4158K3461N285
19732c183P6968M294j1422m3403n8859p0409K041L0070M9334L9549L3081J9568
19720F7629O012j8440k9628j889J8976K8414L7260P264n037k9838o957J0556l1144
$$ plain form
19707 53178 20356 13896 3017 25610 32391 49055 87051 132835 99595 56324 -29954 -48106
19695 -48106 -27033 -6668 -14598 17178 -29782 -99032 -24521 -946 -38373 -61503 -30567 -24919
19683 -24919 -56372 -97742 -94263 -78280 -46899 5883 97970 70187 23809 2433 -63804 -80703
19671 -80703 -90692 -8167 34935 19521 3177 22104 42083 24737 -12316 8148 85900 62325
19659 62325 52157 60774 78032 56671 13021 24505 -14902 -74827 -102023 -71523 -8283 50053
19647 50053 60274 125850 203779 187243 99589 13625 -1777 34615 52458 107948 132189 78627
19635 78627 -2276 4895 -10622 6133 -4851 25955 8678 18704 -24652 -8813 52997 94094
19623 94094 147314 107450 5831 1914 19101 34085 45147 18989 -15339 -8300 11108 -3440
$$ packed form
19707E3178l2822o460j0879K2593O781J6664L7996M5784l3240m3271q6278j8152
19695d8106K1073K0365p930L1776m6960o9250P4511K3575l7427k3130L0936N648
19683b4919l1453m1370L479J5983L1381N2782R2087k7783m6378k1376o6237j6899
19671h0703r989Q2525M3102j5414j6344J8927J9979j7346l7053K0464P7752k3575
19659F2325j0168Q617J7258k1361m3650J1484l9407n9925k7196L0500O3240N8336
19647E0053J0221O5576P7929j6536q7654q5964j5402L6392J7843N5490K4241n3562
19635G8627q0903P171j5517J6755j0984L0806j7277J0026m3356J5839O1810M1097
19623I4094N3220l9864j01619l917J7187J4984J1062k6158l4328P039J9408j4548
$$ plain form
19611 -3440 -13932 -472 -41865 -56885 -43732 -51299 -41945 -14789 11250 20142 44959 38748 97530
19598 97530 106918 79336 78242 76278 47102 29312 17065 -5828 -4638 9693 31857 56324
19586 56324 64046 53909 34693 49467 57162 116216 90962 87644 17050 -7270 87196 49839
19574 49839 -17148 -22878 -19729 -42464 -66629 -58235 -72311 -25723 2744 19909 8608 -56577
19562 -56577 -76149 -10072 -3115 -39421 -13311 37046 10064 39767 81807 97747 43862 -1768
19550 -1768 -5973 37185 42976 29144 23169 33576 45229 90264 55799 22159 -29221 -51059
19538 -51059 -991 -1791 -20097 14341 18650 47449 92677 44293 -667 -23309 -27693 12431
19526 12431 13781 42591 35136 -21471 -39083 -43778 -38952 -79414 9459 85797 46097 -9602
$$ packed form
19611c440j0492J3460m1393j5020J3153p567R354K7156K6039Q892K4817o211N8782
19598I7530R388k7582j094j964k9176j7790j2247k2893J190J4331K2164K4467
19586E6324P722j0137j9216J4774P695N9054k5254l318p0594k4320R4466l7357
19574D9839o6987n730L149k2735k4165Q394j4076M6588K8467J7165j1301o5185
19562e6577j9572O6077O957l6306K6110N0357k6982K9703M2040J5940n3885m5630
19550a768m205M3158N791j3832n975J0407J1653M5035l4465l3640n1380k1838
19538e1059N0068q00j8306L4438M309K8799M5228m8384m4960k2642m384M0124
19526A2431J350K8810p455n6607j7612m695M826m0462Q8873P6338l9700n5699
$$ plain form
19514 -9602 -38930 -28539 55569 73339 66171 88049 96309 60274 55360 85611 56973 914
19502 914 2043 12945 38007 34253 52561 96184 47776 41579 59086 33077 16768 59801 97700
19489 97700 78308 81202 67806 23838 -13584 -2289 66642 50700 -3034 28480 27479 79478
19477 79478 139005 171242 148533 88289 88410 82896 62021 64717 64723 43477 57075 80932 112494
19464 112494 115134 184212 199832 149460 147063 168609 184455 122172 49423 30474 68998 108068
19452 108068 123308 73253 32187 -24702 -15313 16263 81200 99167 126576 112927 116134 104039
19440 104039 63406 26163 -14585 5337 -1439 32648 61602 81610 88187 106038 97254 125349
19428 125349 208738 220418 181969 200005 207489 247706 272829 356325 448734 527822 521770 515438
$$ packed form
19514i602k9328J0391Q4108J7770p168K1878Q260l6035m914L0251k8638n6059
19502I14J129J0902K5062l754J8308M3623m8408o197J7507k6009j6309M3033L7899
19489I7700j9392K894j3396m3968l7422J1295O8931j5942n3734L1514j001N1999
19477G9478N9527L2237k2709o0244J21n514k0875K696Ok1246J3598K3857L1562
19464A12494K640O9078J5620n0372k397K1546J5846o2283p2749j8949L8524L9070
19452A08068J5240n0055m1066n6889R389L1576O4937J7967K7409j3649L207j2095
19440A04039m0633l7243m0748J9922o776L4087K8954K0008O577J7851q784K8095
19428A25349Q3389J1680l8449J8036P484M0217K5123Q3496R2409P9088o052o332
$$ plain form
19416 515438 495878 461033 468165 458657 376181 241644 240801 259680 238213 282718 357976 341453
19404 341453 308924 264182 201839 137483 179835 226506 197512 155472 176783 177023 168953 169475
19392 169475 167331 120738 98462 169824 175648 194537 198617 225477 244006 233218 192511 158263
19380 158263 145782 165079 180734 195914 201175 228902 262597 267158 248794 239773 301506 371712
19368 371712 448894 460484 509235 555510 624157 667458 658499 583800 464519 361898 260135
19357 260135 250622 285487 277081 325627 329874 279178 247781 205208 163079 175081 184197 112633
19345 112633 123826 142650 171373 151068 112307 122383 146732 171316 141682 145665 159127 187066
19333 187066 152450 149435 153936 122364 97015 103066 69655 57196 78728 97393 113812 111923
$$ packed form
19416E15438j9560l4845P132r508q2476j34537q43J8879k1467M4505P5258j6523
19404C41453l2529m4742o2343o4356M2352M6671k8994m2040K1311K40q070N22
19392A69475k144m6593k2276P1362N824J8889M080K6860J8529j0788m0707l4248
19380A58263j2481J9297J5655J5180N261K7727L3695M561j8364r021O1733P0206
19368C71712P7182J1590M8751M6275O8647M3301q959p4699j19281j02621j01763
19357B60135r513L4865q406M8546M247n0696l1397m2573m2129J2002R116p1564
19345A12633J1193J8824K8723k0305l8761J0076K4349K4584k9634L983J3462K7939
19333A87066l4616l015M501l1572k5349O051l3411j2459K1532J8665J6419j889
$$ plain form
19321 111923 135235 125341 106693 112008 151024 156500 106679 90357 89225 75415 45834 16539
19309 16539 2326 -14383 1016 55954 87570 136223 137700 169693 102806 10933 -11408 25382
19297 25382 83552 72844 51562 -5690 -28274 1116 6667 43646 72851 55926 110071 86751
19285 86751 45460 42170 64789 26018 9214 35309 24108 30362 21032 22927 57245 128392
19273 128392 71773 65373 101762 83797 61094 37724 40333 105147 137514 151197 161865 100507
19261 100507 19325 32529 84805 125721 99253 56429 3843 52269 35282 78740 130416
19250 130416 180769 182816 211494 236016 246924 252055 300560 280687 220803 186373 117511 21473
19238 21473 -11297 -20352 29663 106674 81523 60569 68416 93285 164739 188049 171733 163916
$$ packed form
19321A11923K3312r894j8648N315L9016N476m9821j6322j132j3810k9581k9295
19309A6539j4213j6709J5399N4938L1616M8653J477L1993o6887r1873k2341L6790
19297B5382N8170j0708k1282n7252k2584K9390N551L6979K9205j6925N4145k3320
19285H6751m1291l290K2619l8771j6804K6095j1201O254r330J895L4318P1147
19273A28392n6619o400L6389j7965k2703k3370K609O4814L2367J3683J0668o1358
19261A00507q1182J3204N2276M0916k6468m2824n2586M8426j6987M3458N1676
19250A30416N0353K047K8678K4522J0908N131M8505j9873n9884l4430o8862r6038
19238B1473l2770r055N0015P7011k5151k0954P847K4869P1454K3310j6316p817
$$ plain form
19226 163916 86421 69637 109661 179064 249746 288208 319056 371507 439165 564120 692868
19215 692868 852668 1007924 1123754 1142855 1061081 885995 767175 715060 715253 689206 730249
19204 730249 795547 912813 1062153 1232083 1326738 1387162 1327870 1189622 1058646 885806
19194 885806 801430 820615 865181 832251 811858 662961 494203 353085 300071 289773 295571
19183 295571 309109 330158 234108 123490 83847 139262 221518 270306 257862 260535 276937
19172 276937 281437 381524 471544 578958 614783 600310 552995 505017 388705 382669 415638
19161 415638 431734 538240 730920 1001979 1221545 1288289 1316453 1336015 1420438 1497075 1493609
19150 1493609 1345897 1157219 1039458 920803 925022 1055355 1273577 1411550 1494432 1533402
$$ packed form
19226A63916p7495j6784M0024O9403P0682L8462L0848N2451O7658J24955J28748
19215F92868J59800J55256J15830J9101q1774j75086j18820n2115J93k6047M1043
19204G30249O5298J17266J49340J69930R4655O0424n9292j38248j30976j72840
19194H85806q4376J9185M4566l2930k0393j48897j68758j41118n3014j0298N798
19183B95571J3538K1049r6050j10618l9643N5415Q2256M8788j2444K673J6402
19172B76937M500J00087R0020J07414L5825j4473m7315m7978j16312o036L2969
19161D15638J6096J06506J92680K71059K19566O6744K8164J9562Q4423P6637l466
19150A493609j47712j88678j17761j18655M219J30333K18222J37973Q2882L8970
$$ plain form
19140 1533402 1668779 1776053 1767214 1722052 1675567 1551905 1319885 1130853 944025 783467
19130 783467 678532 555416 553246 573798 546219 528666 538384 500291 431260 344621 224025
19119 224025 184693 152185 134634 153574 127176 180808 247070 255866 245615 228455 224534 217384
19107 217384 243639 233840 232402 312407 360863 347797 336083 357471 459861 520711 603679 545239
19095 545239 531890 512720 489936 513204 547183 638198 800688 1019471 1283067 1684812 2126416
19084 2126416 2506756 2653132 2518461 2307751 2180942 2041739 1851037 1545079 1310661
19075 1310661 1225612 1271285 1405920 1483477 1490424 1510674 1537696 1584251 1535143 1321398 1038398
19064 1038398 840851 647306 495089 401582 346943 295055 247751 213097 210422 211045 241808
$$ packed form
19140A533402J35377J07274q839m5162m6485j23662k32020j89032j86828j60558
19130G83467j04935j23116k170K0552k7579j7553R718l8093o9031q6639j20596
19119B24025l9332l2508j7551J8940k6398N3632O6262Q796j0251j7160l921p150
19107B17384K6255r799j438Q0005M8456j3066j1714K1388J02390O0850Q2968n8440
19095E45239j3349j9170k2784K3268L3979R1015J62490K18783K63596M01745M41604
19084B126416L80340J46376j34671k10710j26809j39203j90702l05958k34418
19075A310661q5049M5673J34635P7557O947K0250K7022M6555m9108k13745k83000
19064A038398j97547j93545j52217r3507n4639n1888m7304l4654k675O23L0763
$$ plain form
19053 241808 261598 222653 170127 164480 178572 197724 206372 233861 244683 210115 265805 336766
19041 336766 320906 254554 214234 155795 133445 110639 121068 135120 152816 158871 172503 169688
19029 169688 192675 244587 296868 248844 156163 84959 118304 189969 202646 183761 165189
19018 165189 128774 90710 61780 92637 169259 211713 184158 208315 220915 222467 204729 160714
19006 160714 190605 261029 292236 289831 288789 313576 367004 354066 327250 265450 244663 246160
18994 246160 212844 172246 254229 307484 305944 314123 296548 241273 182822 137129 146891 181587
18982 181587 245200 283011 260180 297498 336933 408546 475495 573719 618389 574669 484929
18971 484929 485663 478202 397290 339643 370484 383484 349223 345324 323784 283586 302349 410170
$$ packed form
19053B41808J9790l8945n2526n647J4092J9152Q648K7489J0822l4568N5690P0961
19041C36766j5860o6352m0320n8439k2350k2806J0429J4052J7696O055J3632k815
19029A69688K2987N1912N2281m8024r2681p1204L3345P1665J2677j8885j8572
19018A65189l6415l8064k8930L0857P6622M2454k7555K4157J2600J552j7738m4015
19006A60714K9891P0424L1207k405j042K4787N3428j2938k6816o1800k0787J497
18994B46160l3316m0598Q1983N3255j540Q179j7575n5275n8451m5693R762L4696
18982A81587O3613L7811k2831L7318L9435P1613O6949R8224M4670m3720q9740
18971D84929P34p461q0912n7647L0841J3000l4261l899k1540m0198J8763J07821
$$ plain form
18959 410170 423750 371628 333181 392821 436603 486495 551549 638652 613509 607695 561069 516042
18947 516042 512233 502418 515735 430881 384873 303325 322466 328404 357024 323430 314480 357018
18935 357018 384503 391200 472442 453537 357529 302274 322841 385846 439933 445703 538984 552233
18923 552233 591655 645079 633889 667108 683031 625824 580326 479063 529090 556509 497755
18912 497755 503567 517456 501701 472445 481674 493738 546549 611368 601036 577050 566233 543313
18900 543313 571360 691210 719576 693680 704083 722643 689683 675090 652929 644793 636257 631792
18888 631792 529067 437865 408649 427911 463665 451436 386791 362244 366521 382383 386868 394797
18876 394797 400335 321119 278059 297760 316286 304629 287271 303108 328868 368037 361407 339605
$$ packed form
18959D10170J3580n2122l8447N9640M3782M9892O5054Q7103k5143n814m6626m5027
18947E16042l809r815J3317q4854m6008q1548J9141N938K8620l3594q950M2538
18935C57018K7485O697Q1242j8905r6008n5255K0567O3005N4087N770R3281J3249
18923E52233L9422N3424j1190L3219J5923n7207m5498j01263N0027K7419n8754
18912D97755N812J3889j5755k9256R229J2064N2811O4819j0332k3986j0817k2920
18900E43313K8047J19850K8366k5896J0403J8560l2960j4593k2161q136q536m465
18888F31792j02725r1202k9216J9262L5754j2229o4645k4547M277J5862M485P929
18876C94797N538p9216m3060J9701J8526j1657j7358J5837K5760L9169o630k1802
$$ plain form
18864 339605 361033 363890 313813 355895 489718 543643 525628 462393 489072 491098 516407 537250
18852 537250 514864 543263 596040 560143 560528 657460 782656 927470 1015370 1089784 1141649
18841 1141649 1135611 1112249 1069958 1027057 1014752 910335 784615 741899 782576 801077 758823
18830 758823 744914 700779 616669 565642 630496 809656 968749 1060249 1148136 1190756 1175720
18819 1175720 1122954 1026603 913045 807571 743347 693032 652738 689741 765114 836769 840421
18808 840421 770053 717465 676616 688723 695224 725679 800639 796894 772001 757821 724760 671775
18796 671775 665955 627470 702427 869274 950006 974766 1009733 1083380 1237082 1241056 1195712
18785 1195712 1085201 1007516 975496 1032329 1067544 1064874 1064707 1055457 1092332 1041736 978743 963523
$$ packed form
18864C39605K1428K857n0077M2082J33823N3925j8015o3235K6679K026K5309K0843
18852E37250k2386K8399N2777l5897L85R6932J25196J44814Q7900P4414N1865
18841A141649o038k3362m2291m2901j2305j04417j25720m2716M0677J8501m2254
18830G58823j3909m4135q4110n1027O4854J79160J59093R1500Q7887M2620j5036
18819A175720n2766r6351j13558j05474o4224n0315m0294L7003P5373P1655L652
18808H40421p0368n2588m0849J2107O501L0455P4960l745k4893j4180l3061n2985
18796F71775n820l8485P4957J66847Q0732K4760L4967P3647J53702L974m5344
18785A195712j10511p7685l2020N6833L5215k670j67r250L6875n0596o2993j5220
$$ plain form
18773 963523 973333 1015932 1173488 1361161 1574447 1831947 1981764 2025325 2063552 2133824 2106640
18762 2106640 1922021 1744828 1609394 1490477 1397446 1349070 1317516 1346066 1475455 1603965
18752 1603965 1733390 1796002 1840953 1951933 2051501 2100626 2101420 2133303 2097307 2043358 2061683
18741 2061683 2057406 2096411 2142474 2213097 2309573 2470649 2679335 2941182 3335975 3998275
18731 3998275 4855042 5579397 6128999 6480158 6534131 6328362 6070872 5972385 6060416 6393883
18721 6393883 7105231 8222463 9704183 11793922 14766769 19506640 27236457 37756553
18713 37756553 46512288 48368065 44584174 38900947 33658197 30373642 29692423 31432935
18705 31432935 35486381 42498498 54385431 75367060 114029543 183226398 279910764
$$ packed form
18773I63523R810M2599J57556J87673K13286K57500J49817M3561L8227P0272k7184
18762B106640j84619j77193j35434j18917r3031m8376l1554K8550J29389J28510
18752A603965J29425O2612M4951J10980R9568M9125P94L1883l5996n3949J8325
18741B061683m277L9005M6063P0623R6476J61076K08686K61847L94793O62300
18731C998275Q56767P24355N49602L51159N3973k05769k57490r8487Q8031L33467
18721F393883P11348J117232J481720K089739K972847M739871P729817J0520096
18713C7756553Q755735J855777l783891n683227n242750l284555o81219J740512
18705C1432935M053446P012117J1886933K0981629L8662483O9196855R6684366
$$ plain form
18698 279910764 358977049 384453285 375179233 346391933 295753784 235180348 180019413
18691 180019413 136400251 106290863 89827158 85814862 94163886 113915341 134410144
18684 134410144 139367226 126089221 103901406 80714665 61263307 47372959 38387438
18677 38387438 32577379 28685439 26109306 24366393 23001683 22050624 21318387 20691734
18669 20691734 20263656 20007539 20104244 20476449 21107043 22349462 24361788 27316842 31887443
18660 31887443 39241607 51366261 71428599 100597889 128889109 140446378 132881014
18653 132881014 115736108 97614548 84778945 80921128 88062318 109944369 153039949
18646 153039949 216918682 286577699 355967721 429252370 470239820 439772010 361239370
$$ packed form
18698B79910764P9066285K5476236r274052k8787300n0638149o0573436n5160935
18691A80019413m3619162l0109388j6463705m012296Q349024J9751455K0494803
18684A34410144M957082j3278005k2187815k3186741j9451358j3890348q985521
18677C8387438n810059l891940k576133j742913j364710r51059p32237o26653
18669B0691734m28078k56117R6705L72205O30594J242419K012326K955054M570601
18660C1887443P354164J2124654K0062338K9169290K8291220J1557269p565364
18653A32881014j7144906j8121560j2835603l857817P141190K1882051M3095580
18646A53039949O3878733O9659017O9390022P3284649M0987450l0467810p8532640
$$ plain form
18639 361239370 272369722 193118145 134765893 97367725 74601666 60618971 51801170
18632 51801170 46551878 44565329 46547485 53475743 62768985 66764443 62122468 52516385
18624 52516385 41828724 32473017 25519790 20747641 17551044 15265166 13477116 12094735
18616 12094735 11119671 10535685 10332290 10210116 9991356 9727240 9270499 8487377 7568180
18607 7568180 6685918 5992375 5463014 5096388 4819343 4555309 4235858 3919665 3611928
18598 3611928 3345466 3148949 3049851 2966370 2851018 2701873 2526463 2364169 2200067 2084036
18588 2084036 1982618 1880177 1832833 1761272 1723847 1655228 1586581 1566512 1505574 1413189 1277221
18577 1277221 1193908 1094975 875332 695435 617013 665897 816058 1012026 1225382 1385654
$$ packed form
18639C61239370q8869648p9251577n8352252l7398168k2766059j3982695q817801
18632E1801170n249292j986549J982156O928258R293242L995458m641975r606083
18624E2516385j0687661r355707o953227m772149l196597k285878j788050j382381
18616A2094735r75064n83986k03395j22174k18760k64116m56741p83122r19197
18607G568180q82262o93543n29361l66626k77045k64034l19451l16193l07737
18598C611928k66462j96517r9098q3481j15352j49145j75410j62294j64102j16031
18588B084036j01418j02441m7344p1561l7425o8619o8647k0069o0938r2385j35968
18577A277221q3313r8933k19643j79897p8422M8884J50161J95968K13356J60272
$$ plain form
18567 1385654 1563605 1745186 1826746 1881768 1937356 1961860 1972288 1993510 2068921 2067541 2029449
18556 2029449 1990393 2022459 2020032 2019000 2020458 2066415 2098736 2080119 2104758 2094910 2018826 1850240
18544 1850240 1630796 1461424 1335686 1244655 1190343 1127360 1028965 1028650 1035116 961862 901483
18533 901483 852934 815929 755755 759993 865210 1016614 1213238 1339596 1338237 1241261 1106818
18522 1106818 951313 779962 661302 641914 733560 807208 904239 1068501 1271477 1538503
18512 1538503 1698479 1767372 1777711 1770973 1719444 1710754 1694777 1644558 1526167 1427427 1347097
18501 1347097 1321009 1367748 1497838 1623475 1746580 1879323 1998845 2101241 2109474 2088994
18491 2088994 2158187 2276258 2352075 2533996 2822513 2979087 3030970 3090812 3324751 3678061
$$ packed form
18567A385654J77951J81581Q1560N5022N5588K4504J0428K1222P5411j380l8092
18556B029449l9056L2066k427j032J458M5957L2321j8617K4639r848p6084j68586
18544A850240k19444j69372j25738r1031n4312o2983r8395l15O466p3254o0379
18533I01483m8549l7005o0174M238J05217J51404J96624J26358j359r6976j34443
18522A106818j55505j71351j18660j9388R1646P3648R7031J64262K02976K67026
18512A538503J59976O8893J0339o738n1529q690j5977n0219j18391r8740q0330
18501A347097k6088M6739J30090J25637J23105J32743J19522J02396Q233k0480
18491B088994O9193J18071P5817J81921K88517J56574N1883N9842K33939L53310
$$ plain form
18481 3678061 4027930 4348444 4609201 4825498 5009475 5150864 5132065 4996632 4840460 4842092
18471 4842092 4962501 5114592 5345776 5668225 6033504 6447201 6838123 7177506 7523489
18462 7523489 7794141 8013405 8401218 8866926 9479978 10502475 11872054 13487433 15665256
18453 15665256 18803170 23300360 30249515 41902130 63067981 100518513 151515659
18446 151515659 191159988 201716158 198739086 205101777 224042910 232908598 216352779
18439 216352779 187573278 163628158 158342463 180481774 214731921 230321267 223508762
18432 223508762 216249890 223384294 234032873 222956466 188791807 147041881 107865106
18425 107865106 77478686 57364884 44593770 36182251 30287211 25938881 22575391
$$ packed form
18481C678061L49869L20514K60757K16297J83977J41389j8799j35433j56172J632
18471D842092J20409J52091K31184L22449L65279M13697L90922L39383L45983
18462G523489K70652K19264L87813M65708O13052J022497J369579J615379K177823
18453A5665256L137914M497190O949155J1652615K1165851L7450532N0997146
18446A51515659L9644329J0556170k977072O362691J8941133Q865688j6555819
18439B16352779k8779501k3945120n285695K2139311L4250147J5589346o812505
18432B23508762p258872P134404J0648579j1076407l4164659m1749926l9176775
18425A07865106l0386420k0113802j2771114q411519n895040m348330l363490
$$ plain form
18418 22575391 19873553 17851679 16304801 15068718 14101881 13423629 12912096 12351660 11653046
18409 11653046 10964791 10468220 9997449 9376257 8758407 8288875 8073449 8016541 8187683
18400 8187683 8479605 8755476 8701008 8332095 7868381 7402537 6909162 6549745 6279661 5922983
18390 5922983 5572158 5282977 5099993 5075871 5136694 5178402 5266758 5201638 5060364 4914845
18380 4914845 4765503 4684763 4708672 4648268 4309913 3824170 3304960 2888035 2542063 2258392
18370 2258392 2075830 2004313 1945102 1749612 1594103 1524468 1486006 1474842 1433482 1371733 1377056
18359 1377056 1344925 1291034 1327537 1377446 1424221 1438931 1391654 1340841 1281140 1215884 1170894
18348 1170894 1189233 1226059 1313921 1406682 1546186 1785424 2102038 2357455 2394268 2380812
$$ packed form
18418B2575391k701838k021874j546878j236083r66837o78252n11533n60436o98614
18409A1653046o88255m96571m70771o21192o17850m69532k15426n6908J71142
18400H187683K91922K75871n4468l68913m63714m65844m93375l59417k70084l56678
18390E922983l50825k89181j82984k4122O0823M1708Q8356o5120j41274j45519
18380D914845j49342q0740K3909o0404l38355m85743n19210m16925l45972k83671
18370B258392j82562p1517n9211j95490j55509o9635l8462j1164m1360o1749N323
18359A377056l2131n3891L6503M9909M6775J4710m7277n0813n9701o5256m4990
18348A170894J8339L6826Q7862R2761J39504K39238L16614K55417L6813j3456
$$ plain form
18338 2380812 2301471 2226078 2311197 2475887 2533326 2383834 2164080 1938930 1827810 1840363
18328 1840363 1994619 2072415 1995185 1829560 1628997 1400089 1150024 937984 806505 782502
18318 782502 833649 848809 725430 591658 609220 620354 536191 503998 459459 320839 287456
18307 287456 326411 327079 234775 206194 226481 353924 525307 600574 569627 570900 545274 475768
18295 475768 536861 565693 582952 578586 553412 581832 600039 633792 614575 657916 682497 731858
18283 731858 838178 916205 1018740 1056827 1019978 955331 920766 850737 749253 693977 694561
18272 694561 643473 628738 611530 578073 574855 567259 583202 597700 555635 457310 443641 447625
18260 447625 447535 419461 330054 239641 262908 298870 346049 432851 443808 430753 374953 312711
$$ packed form
18338B380812p9341p5393Q5119J64690N7439j49492k19754k25150j11120J2553
18328A840363J54256P7796p7230j65625k00563k28908k50065k12040j31479k4003
18318G82502N1147J5160j23379j33772J7562J1134q4163l2193m4539j38620l3383
18307B87456L8955O68r2304k8581K0287J27443J71383P5267l0947J273k5626o9506
18295D75768O1093K8832J7259m366k5174K8420J8207L3753j9217M3341K4581M9361
18283G31858J06320P8027J02535L8087l6849o4647l4565p0029j01484n5276N84
18272F94561n1088j4735j7208l3457l218p596J5943J4498m2065r8325j3669L984
18260D47625r0k8074q9407r0413K3267L5962M7179Q6802J0957j3055n5800o2242
$$ plain form
18248 312711 252328 250476 290607 376018 352563 285529 238894 226381 196340 211538 225146 196774
18236 196774 240920 230948 252132 295744 361434 506190 564389 591590 535863 487512 410303
18225 410303 334887 416940 453496 441108 464888 454194 398779 371696 373776 389894 343398 314197
18213 314197 336351 275464 255736 293470 296297 326600 360464 347200 386249 464010 521285 524392
18201 524392 519923 497439 471195 389172 350742 432444 612462 823215 1036823 1251439 1270947
18190 1270947 1198474 1116195 1066981 1123019 1253660 1312028 1289532 1330638 1394105 1448041 1550622
18179 1550622 1710563 1697230 1529424 1341816 1186613 1080506 944120 888671 825046 724424
18169 724424 706898 710182 727037 749511 779074 770411 752917 741420 736040 734375 734171 698266 638507
$$ packed form
18248C12711o0383j852M0131Q5411k3455o7034m6635j2513l0041J5198J3608k8372
18236A96774M4146r972K1184M3612O5690J44756N8199K7201n5727m8351p7209
18225D10303p5416Q2053L6556j2388K3780j0694n5415k7083K080J6118m6496k9201
18213C14197K2154o0887j9728L7734K827L0303L3864j3264L9049P7761N7275L107
18201E24392m469k2484k6244q2023l8430Q1702J80018K10753K13608K14616J9508
18190A270947p2473q2279m9214N6038J30641N8368k2496M1106O3467N3936J02581
18179A550622J59941j3333j67806j87608j55203j06107j36386n5449o3625j00622
18169G24424j7526L284J6855K2474K9563q663j7494j1497n380j665k04l5905n9759
$$ plain form
18156 638507 578036 581140 636432 697002 716453 732277 718410 757613 893766 985279 1128293
18145 1128293 1350597 1611433 1797415 1813512 1771716 1719913 1846554 2134245 2533479 2948649
18135 2948649 3052810 2843877 2525965 2195515 1913498 1709069 1616832 1656736 1801754 2028411
18125 2028411 2291605 2665340 3087702 3511664 3749491 3783350 3660673 3633036 3670899 3739085
18115 3739085 3980567 4467299 5297232 6587849 8501221 11567499 16988797 27713947
18107 27713947 50437257 90401564 111569526 97195911 76635577 53286896 34241970
18100 34241970 22453383 15794473 11849315 9300021 7521944 6224236 5302883 4627120
18092 4627120 4141248 3755499 3460997 3179560 2898242 2672181 2466604 2377284 2278736 2209878
$$ packed form
18156F38507o0471L104N5292O0570J9451J5824j3867L9203J36153R1513J43014
18145A128293K22304K60836J85982J6097m1796n1803J26641K87691L99234M15170
18135B948649J04161k08933l17912l30450k82017k04429r2237L9904J45018K26657
18125B028411K63194L73735M22362M23962K37827L3859j22677k7637L7863O8186
18115C739085K41482M86732Q29933J290617J913372L066278N421298J0725150
18107B7713947K2723310L9964307K1167962j4373615k0560334k3348681j9044926
18100C4241970j1788587o658910l945158k549294j778077j297708r21353o75763
18092D627120m85872l85749k94502k81437k81318k26061k05577q9320r8548o8858
$$ plain form
18082 2209878 2100817 2018264 1993310 1958669 1889358 1863536 1921261 1943865 1839631 1800071 1791728
18071 1791728 1684882 1589541 1500041 1353307 1211725 1142636 996464 847779 795346 768310
18061 768310 749664 814632 812199 780955 741573 623344 555442 512903 473503 496047 495483 439850
18049 439850 421497 456554 415746 367400 356781 368779 318668 386967 433481 425245 410942 375788
18037 375788 331561 327612 389098 431102 490053 512067 509529 507247 493466 453281 460487 562048
18025 562048 523055 487232 489677 543637 581263 615076 623784 584697 584556 564781 509183 425102
18013 425102 365213 357434 349350 308709 376523 554303 788129 1006161 1180085 1270102 1273561
18002 1273561 1164741 1083783 953109 769567 670024 576928 555880 571857 614225 686015 663960
$$ packed form
18082B209878j09061q2553k4954l4641o9311k5822N7725K2604j04234l9560q343
18071A791728j06846r5341q9500j46734j41582o9089j46172j48685n2433k7036
18061G68310j8646O4968k433l1244l9382j18229o7902m2539l9400K2544n64n5633
18049D39850j8353L5057m0808m8346j0619J1998n0111O8299M6514q236j4303l5154
18037C75788m4227l949O1486M2004N8951K2014k538k282j3781m0185P206J01561
18025E62048l8993l5823K445N3960L7626L3813Q708l9087j41j9775n5598q4081
18013D25102n9889p779q084m0641O7814J77780K33826K18032J73924R0017L459
18002A273561j08820q0958j30674j83542r9543r3096k1048J5977M2368P1790k2055
$$ plain form
17991 663960 607437 607243 625875 594709 580210 601228 555521 493322 390610 296949 250423 243067
17979 243067 257727 361800 469471 583267 637700 694942 776793 856882 903343 924931 904168
17968 904168 859109 850369 877605 970433 1021383 1002130 962989 924399 841841 821556 748096 732549
17956 732549 810049 858179 899294 1009598 1187930 1414809 1613538 1684456 1624628 1486682
17946 1486682 1387610 1347441 1254357 1187473 1115150 1110473 1033403 990627 1044513 1150799 1216743
17935 1216743 1290946 1356906 1382300 1344474 1322661 1327362 1396483 1425991 1489886 1551484 1615080
17924 1615080 1684369 1757763 1803783 1883809 2025724 2127625 2266126 2454976 2571241 2728379
17914 2728379 2930461 3121439 3308522 3501502 3754749 4141693 4655365 5553846 6877150
$$ packed form
17991F63960n6523j94J8632l1166j4499K1018m5707o2199j02712r3661m6526p356
17979B43067J4660J04073J07671J13796N4433N7242Q1851Q0089M6461K1588k0763
17968I04168m5059q740K7236R2828N0950j9253l9141l8590q2558k0285p3460j5547
17956G32549P7500M8130M1115J10304J78332K26879J98729P0918n9828j37946
17946A486682r9072m0169r3084o6884p2323m677p7070m2776N3886J06286O5944
17935A216743P4203O5960K5394l7826k1813M701O9121K9508O3895O1598O3596
17924A615080O9289P3394M6020Q0026J41915J01901J38501J88850J16265J57138
17914B728379K02082J90978J87083J92980K53247L86944N13672Q98481J323304
$$ plain form
17905 6877150 8085786 8842894 9613184 10386361 11260528 12936094 16135989 21976921 32283097
17896 32283097 46660461 55261445 53480369 47815963 41278086 36339702 34636061 35977467
17888 35977467 39947014 46226395 56082685 72817079 102851258 159251979 261303192
17881 261303192 387892763 443208815 442174891 421299241 362437864 286237727 218372523
17874 218372523 164474946 126960123 104702053 94104892 94173125 106434260 130521899
17867 130521899 149988540 144465770 123428754 97927480 74067373 56168482 44347982
17860 44347982 36851135 32168297 29098598 26996416 25326098 23609369 22155930 21075796
17852 21075796 20208209 19614526 19503417 19577842 19605822 19830987 20476510 21680522 23963844
$$ packed form
17905F877150J208636P57108P70290P73177Q74167J675566L199895N840932J0306176
17896C2283097J4377364Q600984j781076n664406o537877m938384j703641J341406
17888C5977467L969547O279381R856290J6734394L0034179N6400721J02051213
17881B61303192J26589571N5316052j033924k0875650n8861377p6200137o7865204
17874B18372523n3897577l7514823k2258070j0597161O8233J2261135K4087639
17867A30521899J9466641n522770k1037016k5501274k3860107j7898891j1820500
17860D4347982p496847m682838l069699k102182j670318j716729j453439j080134
17852B1075796q67587n93683j11109P4425K7980K25165O45523J204012K283322
$$ plain form
17843 23963844 27922557 34673561 46591915 67405966 98621638 125046356 128074901
17836 128074901 116567763 100507483 86022907 78444175 80133623 92502748 120478359
17829 120478359 170280377 230788391 279937349 335263765 404000678 407018377 343394615
17822 343394615 267090591 191803476 133315346 95620073 72974197 59364639 50720661
17815 50720661 44552442 40256791 38264293 39614911 45580040 53255775 53694748 47483347
17807 47483347 39376986 31145553 24653448 20309382 17608232 15965768 15071858 14239934
17799 14239934 12974537 11510661 10188197 9069578 8201330 7510811 6852580 6298018 5905051
17790 5905051 5634766 5562415 5531243 5381858 5164224 4945655 4753263 4492509 4134272 3698674
$$ packed form
17843B3963844L958713O751004J1918354K0814051L1215672K6424718L028545
17836A28074901j1507138j6060280j4484576p578732J689448J2369125K7975611
17829A20478359M9802018O0508014M9148958N5326416O8736913L017699o3623762
17822C43394615p6304024p5287115n8488130l7695273k2645876j3609558q643978
17815E0720661o168219m295651j992498J350618N965129P675735M38973o211401
17807D7483347q106361q231433o492105m344066k701150j642464q93910q31924
17799A4239934j265397j463876j322464j118619q68248o90519o58231n54562l92967
17790E905051k70285p2351l1172j49385k17634k18569j92392k60754l58237m35598
$$ plain form
17780 3698674 3238168 2883186 2625172 2445110 2296295 2094549 1922228 1808531 1714110 1601306
17770 1601306 1502052 1445655 1414936 1415165 1405561 1292277 1227508 1148933 1034138 965078 916319
17759 916319 810323 658083 441183 198694 33896 92469 295995 506915 667897 798079
17749 798079 859619 836475 757679 674688 647008 661226 574103 501344 493847 531068 634751
17738 634751 700001 739394 692332 614751 612360 656869 697860 675739 699708 751634 745552 732535
17726 732535 761241 832168 874934 832446 814594 797527 723394 745735 724762 661671 554550
17715 554550 501535 495824 473572 502822 538186 609729 688460 689983 598544 473738 388130 341213
17703 341213 205538 5638 -94517 -137240 -145447 -79962 56500 322109 448856 536289
$$ packed form
17780C698674m60506l54982k58014j80062j48815k01746j72321j13697r4421j12804
17770A601306r9254n6397l0719K29r604j13284o4769p8575j14795o9060m8759
17759I16319j05996j52240k16900k42489j64798N8573K03526K10920J60982J30182
17749G98079O1540k3144p8796q2991k7680J4218q7123p2759p497L7221J03683
17738F34751O5250L9393m7062p7581k391M4509M0991k2121K3969N1926o082j3017
17726G32535K8706P0927M2766m2488j7852j7067p4133K2341k0973o3091j07121
17715E54550n3015n711k2252K9250L5364P1543P8731J523r1439j24806q5608m6917
17703C41213j35675j99900j00155m2723q207O5485J36462K65609J26747Q7433
$$ plain form
17693 536289 594212 580296 490268 395146 357890 286186 210962 183974 189482 202055 198629 248820
17681 248820 298042 368345 392523 431745 400869 324238 310126 355144 461337 581779 826492
17670 826492 1042558 1229919 1318704 1329668 1335915 1378838 1384434 1252715 1142220 996023 782218
17659 782218 628773 568000 525228 481056 442551 439411 507450 564067 641757 765305 988588
17648 988588 1248233 1470194 1532447 1470081 1485202 1570430 1513561 1395208 1220937 1017681
17638 1017681 806997 598128 494146 384117 327823 288905 261621 255016 271560 314353 293627
17627 293627 256956 241237 240653 287223 302336 279463 221656 172919 135432 131994 184735 217534
17615 217534 222331 260775 258925 188236 158844 118680 130526 132850 87789 95868 118663 89968
$$ packed form
17693E36289N7923j3916r0028r5122l7256p1704p5224k6988N508J2573l426N0191
17681B48820M9222P0303K4178L9222l0876p6631j4112M5018J06193J20442K44713
17670H26492K16066J87361Q8785J0964O247M2923N596j31719j10495j46197k13805
17659G82218j53445o0773m2772m4172l8505l140O8039N6617P7690J23548K23283
17648I88588K59645K21961O2253o2366J5121Q5228n6869j18353j74271k03256
17638A017681k10684k08869j03982j10029n6294l8918k7284o605J6544M2793k0726
17627B93627l6671j5719n84M6570J5113k2873n7807m8737l7487l438N2741L2799
17615B17534M797L8444j850p0689k9392m0164J1846K324m5061Q079K2795k8695
$$ plain form
17603 89968 83730 100708 123835 138688 162019 176930 200819 229204 197729 204399 215818 233678
17591 233678 232420 207705 123025 78936 70827 113716 136629 100762 169695 240121 261117 246814
17579 246814 193545 178499 126926 112319 68099 81727 136355 62283 -20060 -11395 51754 -11542
17567 -11542 -36390 26815 131613 155043 161236 114923 92113 130998 196149 196092 150313 158458
17555 158458 178082 191827 207053 182113 163119 208020 194309 137008 130445 122716 163761 148914
17543 148914 138750 96211 118925 156373 164972 141867 170716 165859 156322 140670 131653 73768
17531 73768 -9950 -44543 -16594 -4685 23410 41757 7812 -14358 13165 74055 61137 47123
17519 47123 -27167 -85969 -55001 -50294 -28623 49664 83864 162308 153742 147775 180092 157936
$$ packed form
17603H9968o238J6978K3127J4853K3331J4911K3889K8385l1475O670J1419J7860
17591B33678j258k4715q4680m4089q109M2889K2913l5867O8933P0426K0996j4303
17579B46814n3269j5046n1573j4607m4220J3628N4628p4072q2343Q665O3149o3296
17567a1542k4848O3205J04798K3430O193m6313k2810L8885O5151n7m5779Q145
17555A58458J9624J3745J5226k4940j8994M4901j3711n7301o563p729M1045j4847
17543A48914j0164m2539K2714L7448Q599k3105K8849m857r537j5652r017n7885
17531G3768q3718l4593K7949J1909K8095J8347l3945k2170K7523O0890j2918j4014
17519D7123p4290n8802L0968M707K1671P8287L4200P8444q566n967L2317k2156
$$ plain form
17507 157936 122263 111727 116854 138802 175824 197949 175514 227683 193677 186830 187261 189067
17495 189067 143618 103329 40810 42315 63269 79359 60905 56951 83330 112815 148057 126220
17483 126220 150653 91968 76935 132427 98931 94387 149113 152955 111029 87578 83663 -27983
17471 -27983 -25003 -20885 -19378 21424 35715 45156 49499 56795 134426 176412 121575 -6934 14012
17458 14012 44722 54343 52933 136492 168990 197690 170996 141408 107223 134524 181262 194076
17446 194076 182545 269527 344258 392579 508178 682358 1016816 1429251 1508433 1363159
17436 1363159 1038943 651542 501412 504322 480548 503058 636789 821249 1067052 1195704
17426 1195704 1116825 966086 794633 612151 525175 586782 697876 893520 1124920 1198054
$$ packed form
17507A57936l5673j0536N127K1948L7022K2125k2435N2169l4006o847M31J806
17495A89067m5449m0289o2519J505K0954J6090j8454l954K6379K9485L5242k1837
17483A26220K4433n8685j5033N5492l3496m544N4726L842m1926k3451l915j11646
17471b7983K980M118J507M0802J4291R441M343P296P7631M1986n4837j28509K0946
17458A4012L0710R621j410Q3559L2498K8700k6694k9588l4185K7301M6738J2814
17446A94076j1531Q6982P4731M8321J15599J74180L34458M12435P9182j45274
17436A363159l24216l87401j50130K910k3774K2510J33731J84460K45803J28652
17426A195704p8879j50739j71453j82482q6976O1607J11094J95644K31400P3134
$$ plain form
17416 1198054 1109434 970229 764260 639877 593898 567009 572702 554018 747338 1090588
17406 1090588 1400014 1375192 1158475 908566 729545 647360 603384 508348 385843 353378
17396 353378 385493 419580 398816 410953 452615 411390 392999 407366 365644 266677 350488
17385 350488 431164 407080 443128 544922 701061 879909 1010447 1088108 1081440 1115478 1209217
17374 1209217 1332747 1445038 1567795 1694215 1659978 1511307 1347980 1208648 1265095 1386913
17364 1386913 1405953 1302834 1170350 1104917 1242466 1531947 1907727 2262440 2426385 2345017
17354 2345017 2187499 1949152 1674187 1398807 1191582 1035837 867813 689218 538564
17345 538564 451061 505519 575240 620170 656037 588355 492439 413431 377555 350344 341484 343205
$$ packed form
17416A198054q8620j39205k05969j24383m5979k6889N693j8684J93320L43250
17406A090588L09426k4822k16717k49909j79021q2185m3976r5036j22505l2465
17396C53378L2115L4087k0764J2137M1662m1225j8391J4367m1722r8967Q3811
17385C50488Q0676k4084L6048J01794J56139J78848J30538P7661o668L4038R3739
17374A209217J23530J12291J22757J26420l4237j48671j63327j39332N6447J21818
17364A386913J9040j03119j32484o5433J37549K89481L75780L54713J63945q1368
17354B345017j57518k38347k74965k75380k07225j55745j68024j78595j50654
17345E38564q7503N4458O9721M4930L5867o7682r5916p9008l5876k7211q860J721
$$ plain form
17333 343205 386802 491560 493094 456091 461907 540588 635326 696744 728680 824328 986488
17322 986488 1156591 1322805 1309433 1200529 1174387 1251034 1434633 1677794 1786329 1671153
17312 1671153 1391434 1120969 928266 821554 787377 860805 902418 916567 922895 956464 1116750
17301 1116750 1358308 1626164 1726145 1645146 1477307 1195076 942786 746921 655966 632221
17291 632221 553253 430683 335715 285264 283809 266090 281156 205590 134191 129373 185590 232620
17279 232620 215394 247275 328875 543143 795614 832887 714433 565496 389257 311325
17269 311325 319406 262655 218130 243764 269288 308031 343091 342796 353609 353368 377236 426728
17257 426728 491258 597326 840859 1163148 1366606 1265879 1126450 1097267 1124718 1034533
$$ packed form
17333C43205M3597J04758J534l7003N816P8681R4738O1418L1936R5648J62160
17322I86488J70103J66214j3372j08904k6142P6647J83599K43161J08535j15176
17312A671153k79719k70465j92703j06712l4177P3428M1613J4149O328L3569J60286
17301A116750K41558K67856R9981q0999j67839k82231k52290j95865r0955k3745
17291F32221p8968j22570r4968n0451j455j7719J5066p5566p1399m818N6217M7030
17279B32620j7226L1881Q1600K14268K52471L7273j18454j48937j76239p7932
17269C11325Q081n6751m4525K5634K5524L8743L5060k95J0813k41K3868M9492
17257D26728O4530J06068K43533L22289K03458j00727j39429k9183K7451r0185
$$ plain form
17247 1034533 941399 879595 892734 866106 864928 834322 717781 637598 660214 662599 663018 713951
17235 713951 730982 696646 592805 559178 583708 585925 597772 657804 740495 720073 693142
17224 693142 673959 755303 817708 814663 713907 685676 623231 565576 540107 520079 487294
17213 487294 506356 490344 456926 415798 441417 443973 438809 519105 490226 457073 460960 467329
17201 467329 463602 492162 492400 485828 529044 574046 650862 703051 635962 555978 528473 467428
17189 467428 437569 466097 526095 563842 547390 530993 520988 560532 572551 606564 553646
17178 553646 567112 632738 710617 733305 704711 717013 667719 643416 670011 780071 829376
17167 829376 784912 825951 878655 901837 925818 919831 892253 908775 1015182 1127063 1296508
$$ packed form
17247A034533r3134o1804J3139k6628j178l0606j16541q0183K2616K385M19N0933
17235G13951J7031l4336j03841l3627K4530K217J1847O0032Q2691k0422k6931
17224F93142j9183Q1344O2405l045j00756k8231o2445n7655k5469k0028l2785
17213D87294J9062j6012l3418m1128K5619K556n164Q0296k8879l3153L887O369
17201D67329l727K8560K38o572M3216M5002P6816N2189o7089p9984k7505o1045
17189D67428k9859K8528N9998L7747j6452j6397j0005L9544J2019L4013n2918
17178E53646J3466O5626P7879K2688k8594J2302m9294k4303K6595J10060M9305
17167H29376m4464M1039N2704K3182K3981n987k7578J6522J06407J11881J69445
$$ plain form
17156 1296508 1441145 1530983 1668824 1927768 2229689 2462787 2587445 2731352 3099299 3564320
17146 3564320 3850055 3843924 3796789 3792265 3901772 4025298 4182194 4301183 4393919 4638008
17136 4638008 5116428 5917416 7037887 8486811 10214251 12177035 14655132 18018456
17128 18018456 22864968 30609937 44082819 68329022 108648310 155370701 181877974
17121 181877974 182878404 179240816 187143807 201659398 198391434 171321982 135261084
17114 135261084 100210721 72512910 54461640 44048679 38459293 35792088 35299290
17107 35299290 37323043 42660265 53315910 73970143 112092069 167104830 212215483
17100 212215483 224138663 218020363 218836455 233957344 241146426 219303553 178814134
$$ packed form
17156A296508J44637Q9838J37841K58944L01921K33098J24658J43907L67947M65021
17146C564320K85735o131m7135m524J09507J23526J56896J18989R2736K44089
17136D638008M78420Q00988J120471J448924J727440J962784K478097L363324
17128A8018456M846512P744969J3472882K4246203M0319288M6722391K6507273
17121A81877974J000430l637588P902991J4515591l267964k7069452l6060898
17114A35261084l5050363k7697811j8051270j0412961n589386k667205m92798
17107C5299290K023753N337222J0655645K0654233L8121926N5012761M5110653
17100B12215483J1923180o118300Q16092J5120889P189082k1842873m0489419
$$ plain form
17093 178814134 134803483 96006476 67920638 50072492 38972120 31717269 26585100
17086 26585100 22781031 19966755 17868967 16238169 14807923 13338134 11978255 10918895
17078 10918895 10148502 9599967 9115634 8633369 8329551 8158340 7887036 7581953 7360130
17069 7360130 7254366 7061552 6643326 6118855 5810080 5630044 5394194 5155625 4955887
17060 4955887 4688237 4272336 3854344 3434835 3107291 2926674 2929124 3042098 3191476 3201652
17050 3201652 3104297 3061717 3039272 3014992 2931367 2721962 2401789 2023432 1687634 1503173
17040 1503173 1457846 1448748 1436064 1324776 1219779 1141823 1143949 1135194 1095367 1064792 978296
17029 978296 942126 903899 945716 940772 876731 835604 805099 771910 772684 787968 741904 699132
$$ packed form
17093A78814134m4010651l8797007k8085838j7848146j1100372p254851n132169
17086B6585100l804069k814276k097788j630798j430246j469789j359879j059360
17078A0918895p70393n48535m84333m82265l03818j71211k71304l05083k21823
17069G360130j05764j92814m18226n24471l08775j80036k35850k38569j99738
17060D955887k67650m15901m17992m19509l27544j80617K450J12974J49378J0176
17050C201652r7355m2580k2445k4280q3625k09405l20173l78357l35798j84461
17040A503173m5327r098j2684j11288j04997p7956K126q755l9827l0575q6496
17029I78296l6170l8227M1817m944o4041m1127l0505l3189P74J5284m6064m2772
$$ plain form
17017 699132 620425 611337 644511 785373 942311 957608 958578 955536 916026 890777 836144 776483
17005 776483 630036 580822 670278 789185 864690 895767 758309 606677 440443 406914
16995 406914 361611 357292 466559 547837 616949 747497 793441 816777 778020 733057 710512
16984 710512 776291 857932 980267 1220246 1403631 1313909 1091610 914839 663340 547605
16974 547605 522958 581287 694271 779879 876055 1058589 1127397 1190970 1221160 1171141 1113753
16963 1113753 1087609 1114504 1186489 1354504 1501603 1501675 1406988 1271486 1169892 1095216 992285
16952 992285 982820 973070 1016310 1207810 1356197 1363809 1285531 1284174 1284922 1204398 1105939 1017341
16940 1017341 951029 915878 899207 936880 1004293 950381 852529 895068 928096 1000792 1013553
$$ packed form
17017F99132p8707r088L3174J40862J56938J5297R70l042l9510k5249n4633n9661
17005G76483j46447m9214Q9456J18907P5505L1077j37458j51632j66234l3529
16995D06914m5303m319J09267Q1278O9112J30548M5944K3336l8757m4963k2545
16984G10512O5779Q1641J22335K39979J83385q9722k22299j76771k51499j15735
16974E47605k4647N8329J12984Q5608R6176J82534O8808O3573L0190n0019n7388
16963A113753k6144K6895P1985J68015J47099P2r4687j35502j01594p4676j02931
16952I92285r465r750M3240J91500J48387P612p8278j357P48q0524r8459q8598
16940A017341o6312l5151j6671L7673O7413n3912r7852M2539L3028P2696J2761
$$ plain form
16929 1013553 1072817 1057926 1041383 1120023 1205809 1348555 1483219 1598862 1694841 1889962
16919 1889962 2182796 2536914 2646937 2502632 2408514 2424857 2486656 2628414 2852965 3224520
16909 3224520 3748374 4126681 4445263 4557987 4390178 4342793 4451870 4722552 5308083 6284811
16899 6284811 7455023 8727055 10076043 11212048 12489280 14404687 17576078 22766663
16891 22766663 31648682 48087199 80310618 139007445 199339095 200492862 171063170
16884 171063170 133461046 96637891 71712713 59085871 55957565 61706136 79893591
16877 79893591 119418387 181713430 213410814 192470798 157797512 119073226 88284109
16870 88284109 71736312 68623913 80008284 112320441 164490346 187228832 167111974
$$ packed form
16929A013553N9264j4891j6543P8640Q5786J42746J34664J15643R5979J95121
16919A889962K92834L54118J10023j44305r4118J6343O1799J41758K24551L71555
16909C224520N23854L78307L18582J12724j67809m7385J09077K70682N85531R76728
16899F284811J170212J272032J348988J136005J277232J915407L171391N190585
16891B2766663Q882019J6438517L2223419N8696827O0331650J153767k9429692
16884A71063170l7602124l6823155k4925178j2626842l128306N748571J8187455
16877G9893591L9524796O2295043L1697384k0940016l4673286l8724286l0789117
16870H8284109j6547797l112399J1384371L2312157N2169905K2738486k0116858
$$ plain form
16863 167111974 136742854 103128737 76225760 60137035 52815694 52795612 61197680 83581246
16855 83581246 128350341 174907360 172276231 144564878 110641944 77387444 53521419
16848 53521419 38790935 29883052 24167670 20225099 17498897 15559302 14140873 13288376
16840 13288376 12575416 11627395 10376819 9149517 8081589 7284988 6841483 6641979 6647109
16831 6647109 6569933 6419878 6184802 5922983 5468335 4870596 4343383 3878099 3475662 3163241
16821 3163241 2968609 2942040 3054827 3100792 2972010 2723662 2421662 2181301 2000936 1867512
16811 1867512 1732540 1569588 1422846 1303779 1257522 1229437 1237447 1227661 1162660 1076369 1042197
16800 1042197 992624 929984 891199 887258 839135 791554 735459 688301 714017 693220 602299
$$ packed form
16863A67111974l0369120l3614117k6902977j6088725p321341k0082Q402068K2383566
16855H3581246M4769095M6557019k631129k7711353l3922934l3254500k3866025
16848E3521419j4730484q907883n715382l942571k726202j939595j418429q52497
16840A3288376p12960r48021j250576j227302j067928p96601m43505j99504N130
16831F647109p7176j50055k35076k61819m54648n97739n27213m65284m02437l12421
16821C163241j94632k6569J12787M5965j28782k48348l02000k40361j80365j33424
16811A867512j34972j62952j46742j19067m6257k8085Q010r786o5001q6291l4172
16800A042197m9573o2640l8785l941m8123m7581n6095m7158K5716k0797r0921
$$ plain form
16789 602299 588044 604558 565406 539175 567901 595412 607389 583285 554035 553490 551488 540582
16777 540582 538725 527940 529004 545880 603420 566923 436327 383375 339274 309631 299885 270327
16765 270327 208881 148945 79297 -17337 -48697 -13827 85710 207624 233659 255528 244003
16754 244003 171709 141268 134837 5456 -109270 -90252 24880 114544 163963 195889 88686
16743 88686 26753 -34668 -76854 -105775 -75238 4095 73353 101902 149053 179269 153245 134032
16731 134032 132324 109829 -29674 -115980 -18321 135390 248953 250477 249689 202460 229209 253223
16719 253223 219587 248902 252581 263668 246905 229156 241622 287508 278543 279299 293598 295224
16707 295224 307005 374596 349055 291665 239385 231680 210099 235221 224296 217597 263480 240551
$$ packed form
16789F02299j4255J6514l9152k6231K8726K7511J1977k4104k9250n45k002j0906
16777E40582j857j0785J064J6876N7540l6497j30596n2952m4101k9643r746k9558
16765B70327o1446n9936o9648r6634l1360L4870R9537J21914K6035K1869j1525
16754B44003p2294l0441o431j29381j14726J9018J15132Q9664M9419L1926j07203
16743H8686o1933o1421m2186k8921L0537P9333O9258K8549M7151L0216k6024j9213
16731A34032j708k2495j39503q6306R7659J53711J13563J524p88m7229K6749K4014
16719B53223l3636K9315L679J1087j6763j7749J2466M5886q965P56J4299J626
16707B95224J1781O7591k5541n7390n2280p705k1581K5122j0925o699M5883k2929
$$ plain form
16695 240551 217972 216294 190457 170936 143784 125813 108933 112832 128201 162453 148852 99572
16683 99572 121083 107016 39769 20498 28038 44711 76919 131857 128601 125001 83120 40490
16671 40490 84838 104636 88132 37676 2397 34030 66142 72445 78458 112575 34099 -44726
16659 -44726 -45557 9221 55546 117428 129004 61470 32593 30880 61379 84305 114149 95156
16647 95156 45125 62529 79791 58505 50183 43773 48424 101279 157438 92499 60137 54820
16635 54820 107987 132314 203432 200148 169482 226908 266226 248627 235077 200892 197588 164975
16623 164975 131725 97370 -2508 -45038 -4031 34860 45017 105446 116880 68587 106915
16612 106915 106202 143459 127176 78529 52064 73906 55145 39722 62323 101180 106147 108721
$$ packed form
16695B40551k2579j678k5837j9521k7152j7971j6880L899J5369L4252j3601m9280
16683I9572K1511j4067o7247j9271P540J6673L2208N4938l256l600m1881m2630
16671D0490M4348J9798j6504n0456l5279L1633L2112O303O013L4117p8476p8825
16659d4726q31N4778M6325O1882J1576o7534k8877j713L0499K2926K9844j8993
16647I5156n0031J7404J7262k1286q322o410M651N2855N6159o4939l2362n317
16635E4820N3167K4327P1118l284l0666N7426L9318j7599j3550l4185l304l2613
16623A64975l3250l4355r9878m2530M1007L8891J0157O0429J1434m8293L8328
16612A06915p13L7257j6283m8647k6465K1842j8761j5423K2601L8857M967K574
$$ plain form
16600 108721 98988 50810 58938 146771 131898 99954 82628 63547 44607 24333 44725 118054
16588 118054 123020 120072 78795 66273 19789 39492 14262 37003 108917 134294 92809 6939
16576 6939 48447 75986 176128 265974 347549 493331 783488 1055477 1188537 1259053 1257697
16565 1257697 1311308 1311997 1224524 1063603 872520 716340 573527 438855 328434 235012
16555 235012 241003 240653 163048 203269 278406 390423 556506 786905 963898 1031690 997540
16544 997540 983930 1067542 1137666 1014964 856441 656808 495383 349982 234303 178017
16534 178017 150771 151966 171816 177016 186934 162399 111998 62241 58104 39633 86315 52460
16522 52460 49906 73219 2807 5868 32745 47558 35908 127577 141447 160508 155510 179855
$$ packed form
16600A08721r733m8178Q128Q7833j4873l1944j7326j9081j8940k0274K0392P3329
16588A18054M966k948m1277j2522m6484J9703k5230K2741P1914K5377m1485q5870
16576F939M1508K7539J00142Q9846Q1575J45782K90157K71989J33060P0516j356
16565A257697N3611O89q7473j60921j91083j56180j42813j34672j10421r3422
16555B35012N991l50p7605M0221P5137J12017J66083K30399J76993O7792l4150
16544I97540j3610Q3612P0124j22702j58523j99633j61425j45401j15679n6286
16534A78017k7246J195J9850N200R918k4535n0401m9757m137j8471M6682l3855
16522E2460k554K3313p0412L061K6877J4813j1650R1669J3870J9061m998K4345
$$ plain form
16510 179855 185805 167968 110767 48649 66031 90375 136903 112951 93980 127903 129281 127804
16498 127804 97879 118129 112522 123046 146985 218371 264532 222409 98007 34714 7609
16487 7609 43108 112902 112233 108620 150834 120647 161213 106966 51696 44167 -11052 -12712 -548
16474 -548 -6798 -33232 -55958 -23806 -5802 13877 18311 54586 100915 112719 111964 126558 64565
16461 64565 43949 72496 68196 70173 45157 62434 108284 130185 115687 124608 75186 32885
16449 32885 -26790 25373 -12934 -63488 186 44935 -1067 5214 32127 99089 118739 149010
16437 149010 116155 46513 -28502 -56807 -34230 60621 100574 75468 54146 143151 163832
16426 163832 137485 117165 121267 53687 37533 45874 23585 11504 10445 21216 16389 -7720
$$ packed form
16510A79855N950j7837n7201o2118J7382K4344M6528k3952j8971L3923J378j477
16498A27804k9925K0250n607J0524K3939P1386M6161m2123j24402o3293k7105
16487G609L5499O9794o69l613M2214l0187M0566n4247n5270p529n5219j660J2164
16474e48o250k6434k2726L2152J8004J9679M434L6275M6329J1804p55J4594o1993
16461F4565k0616K8547m300J977k5016J7277M5850K1901j4498Q921m9422m2301
16449C2885n9675N2163l8307n0554O3674M4749m6002O281K6913O6962J9650L0271
16437A49010l2855o9642p5015k8305K2577R4851L9953k5106k1322Q9005K0681
16426A63832k6347k0320M102o7580j6154Q341k2289j2081j059J0771m827k4109
$$ plain form
16414 -7720 -23973 24416 65254 77896 28721 -31815 -70182 -66302 -43863 -69142 -72306 -68122
16402 -68122 -50704 -27323 22137 57735 68168 48130 26774 35065 67436 26894 -9455 -29820
16390 -29820 -26098 21894 38139 25198 48742 60798 -11963 -50054 -18833 17926 60827 64546
16378 64546 87875 108180 108854 65610 3917 -20645 -17840 -5087 41021 55766 74935 57867
16366 57867 -3199 -51188 -21611 -5932 -12287 -29649 -50633 -42794 -53415 5305 47885 22894
16354 22894 -3135 -36366 -36510 -12971 -54932 -45743 -24143 -21966 -21016 -8440 -24866 -57527 -83202
16341 -83202 -33932 64580 89748 83031 37968 33788 63987 125845 232701 352557 499555
16330 499555 771630 953962 910037 823986 672322 551675 428385 366406 388259 458747
$$ packed form
16414g720j6253M8389M0838J2642m9175o0536l8367L880K2439k5279l164M184
16402f8122J7418K3381M9460L5598J0433k0038k1356Q291L2371m0542l6349k0365
16390b9820L722M7992J6245j2941K3544J2056p2761l8091L1221L6759M2901L719
16378F4546K3329K0305O74m3244o1693k4562K805J2753M6108J4745J9169j7068
16366E7867o1066m7989K9577J5679o355j7362k0984P839j0621N8720M2580k4991
16354B2894k6029l3231j44K3539m1961R189K1600K177R50J2576j6426l2661k5675
16341h3202M9270R8512K5168o717m5063m180L0199O1858J06856J19856J46998
16330D99555K72075J82332m3925q6051j51664j20647j23290o1979K1853P0488
$$ plain form
16320 458747 490833 669983 910535 1052918 1017642 842087 666129 557283 510022 501766
16310 501766 524251 709658 959633 1020652 899417 738027 615938 477530 417666 416853 338799
16299 338799 351122 455477 609410 779777 775301 665396 513765 365677 256439 200145
16289 200145 182336 181427 171702 177233 170300 147227 160990 177427 124207 85164 126781 137154
16277 137154 74912 17451 -4941 11808 4494 3894 12089 1159 -31426 2952 33651 21240
16265 21240 -33086 -15565 -6591 26426 58101 62077 24612 48930 76288 43592 4653 -25159
16253 -25159 -18930 -40241 -61268 -55266 -65591 -38611 -22400 -11535 11949 -14792 -52396 28341
16241 28341 72108 33911 37607 31775 19758 -10893 -5042 -15763 -20344 -25941 -34016 -43070 -18744
$$ packed form
16320D58747L2086J79150K40552J42383l5276j75555j75958j08846m7261q256
16310E01766K2485J85407K49975O1019j21235j61390j22089j38408n9864q13p8054
16299C38799J2323J04355J53933J70367m476j09905j51631j48088j09238n6294
16289B00145j7809r09r725N531o933k3073J3763J6437n3220l9043M1617J0373
16277A37154o2242n7461k2392J6749p314o00Q195j0930l2585L4378L0699j2411
16265B1240n4326J7521Q974L3017L1675L976l7465K4318K7358l2696l8939k9812
16253b5159O229k1311k1027O002j0325K6980J6211J0865K3484k6741l7604Q0737
16241B8341M3767l8197L696n832j2017l0651N851j0721m581n597q075r054K4326
$$ plain form
16228 -18744 18676 69291 67729 32475 19205 -9558 -18274 -8233 -40864 -51674 -2970 -3275
16216 -3275 -28818 13800 10159 -27039 -28215 18244 8987 -9376 -18550 -26329 -28487 -14167 -33205
16203 -33205 -71746 -14673 57585 62469 54538 36712 15881 -31604 -78053 -61295 -41671 -24112
16191 -24112 -16845 -13875 -21828 -61719 -82936 -10989 31479 -6440 -38909 -57164 -66677 -7630
16179 -7630 34569 40528 19562 -15431 -15635 -28196 -15704 -41903 -58739 -34901 -38874 -57952 -94014
16166 -94014 -108503 -61148 -17798 71588 118427 41619 -11536 -8381 35100 46866 43707 99460
16154 99460 64505 61143 1821 -37785 -35959 -29118 -30239 -28929 -56774 -40294 -16761 -20464 -33573
16141 -33573 -49032 -68806 -10761 3910 -15228 26316 42263 28474 15666 20031 75477 100683
$$ packed form
16228a8744L7420N0615j562l5254j3270k8763q716J0041l2631j0810M8704l05
16216c275k5543M2618l641l7198j176M6459r257j8363r174p779k158J4320j9038
16203c3205l8541N7073P2258M884p931j7826k0831m7485m6449J6758J9624J7559
16191b4112P267K970p953l9891k1217P1947M2468l7919l2469j8255r513N9047
16179g630M2199N959k0966l4993k04j2561J2492k6199j6836K3838l973j9078l6062
16166i4014j4489M7355M3350Q9386M6839p6808n3155L155M3481J1766l159N5753
16154I9460l4955l362n9322l9606J826O841j121J310k7845J6480K3533l703j3109
16141c3573j5459j9774N8045J4671j9138M1544J5947j3789j2808M365N5446K5206
$$ plain form
16129 100683 62038 42153 13311 15886 15 19764 -11832 -8353 -13485 -11244 -2047 -4817 -73209
16116 -73209 -21559 27173 78309 55680 1261 -17356 -1417 42903 52091 -6875 -27936 -18835
16104 -18835 -23078 -38603 6243 17909 13641 6928 -7924 -26225 -24326 -53423 -19623 12216
16092 12216 17110 33405 33335 66071 59722 27754 -14518 -10933 22933 62843 52079 39989 -11382
16079 -11382 -60743 -42867 -10654 45246 66497 14762 -45417 -12659 18573 -21455 -26385 5028
16067 5028 24364 -65480 -65612 7343 -9331 -64194 -90005 -68069 -69918 -81224 -30180 -51461
16055 -51461 -80075 -46135 -25088 -54987 -21426 -10256 -40704 5293 14812 767 -19821 -25576
16043 -25576 -4678 -32868 -36605 -43415 -24665 12003 56135 67937 46357 45017 27280 41083
$$ packed form
16129A00683l8645j9885k8842K575j5871J9749l1596L479n132K241R197k770o8392
16116g3209N1650M8732N1136k2629n4419j8617J5939M4320R188n8966k1061R101
16104a8835m243j5525M4846J1666m268o713j4852j8301J899k9097L3800L1839
16092A2216M894J6295p0L2736o349l1968m2272L585L3866L9910j0764j2090n1371
16079a1382m9361J7876L2213N5900K1251n1735o0179L2758L1232m0028m930L1413
16067E028J9336q9844j32P2955j6674n4863k5811K1936j849j1306N1044k1281
16055e1461k8614L3940K1047k9899L3561J1170l0448M5997R519j4045k0588n755
16043b5576K0898k8190l737o810J8750L6668M4132J1802k1580j340j7737J3803
$$ plain form
16031 41083 17007 -20022 -39739 -73767 -99265 -73983 -67308 -22641 -3356 -39170 -35954 -50785
16019 -50785 -107352 -68841 -60964 -57573 -80227 -79472 -60000 -39046 -1631 30096 -30271 2756
16007 2756 15508 -8303 50876 73977 54465 15402 2237 14331 42539 72783 73711 24366
15995 24366 4127 42081 110849 59749 35302 11419 1638 13502 38025 24644 22118 17865
15983 17865 32675 96552 132169 134981 99808 44653 39551 64936 67025 56510 26427 47796
15971 47796 99011 62551 26593 5205 -7722 -30630 9523 41620 80781 76282 67008 71383
15959 71383 28744 -50741 -37914 -14554 18473 29723 37510 31599 4252 3983 35438 60033
15947 60033 64675 63176 50607 4554 5743 18132 -21923 -8622 20548 60047 98520 95411
$$ packed form
16031D1083k4076l7029j9717l4028k5498K5282O675M4667J9285l5814L216j4831
16019e0785n6567L8511P877L391k2654P55J9472K0954L7415L1727o0367L3027
16007B756J2752k3811N9179K3101j9512l9063j3165J2094K8208L0244R28m9345
15995B4366k0239L7954O8768n1100k4447k3883r781J1864K4523j3381k526m253
15983A7865J4810O3877L5617K812l5173n5155n102K5385K089j0515l0083K1369
15971D7796N1215l6460l5958k1388j2927k2908M0153L2097L9161m499r274M375
15959G1383m2639p9485J2827K3360L3027J1250P787n911k7347k69L1455K4595
15947F0033M642j499j2569m6053J189J2389m0055J3301K9170L9499L8473l109
$$ plain form
15935 95411 100421 138371 116648 95362 82636 68316 55392 -19438 -25507 -38781 -16436 -9104
15923 -9104 -25022 -7206 24135 23189 13968 8671 41359 26359 -6867 12645 5824 15400 52532
15910 52532 48711 25031 14496 -38495 -28205 8052 -22970 -38126 -35281 -13161 -22791 -55987
15898 -55987 -48562 -50427 5800 75656 101903 117763 80810 12700 16113 53577 92910 151405
15886 151405 120239 48871 25211 -4404 -2596 -49490 -59715 -48584 -57432 -62167 16474 -16309
15874 -16309 -59927 -16519 12123 -24447 -63535 -82834 -76420 6710 47708 2208 3096 -7696
15862 -7696 -17743 -11704 -62996 -90906 -84227 -103296 -96399 -10123 84395 79706 90041 76388 15702
15849 15702 -20588 -19199 -51893 -99127 -115111 -80718 -66306 -55736 -30469 -45595 -79905 -105169
$$ packed form
15935I5411N010L7950k1723k1286j2726j4320j2924p4830o069j3274K2345P332
15923i104j5918J7816L1341r46r221n297L2688j5000l3226J9512o821R576L7132
15910E2532l821k3680j0535n2991J0290L6257l1022j5156K845K2120r630l3196
15898e5987P425j865N6227O9856K6247J5860l6953o8110L413L7464L9333N8495
15886A51405l1166p1368k3660k9615J808m6894j0225J1131q848m735P8641l2783
15874a6309m3618M3408K8642l6570l9088j9299O414Q3130M0998m5500Q88j0792
15862g696j0047O039n1292k7910O679j9069O897Q6276R4518m689J0335j3653o0686
15849A5702l6290J389l2694m7234j5984L4393J4412J0570K5267j5126l4310k5264
$$ plain form
15837 -105169 -28341 -6890 -14629 3519 50694 86157 64224 946 -5180 38567 12714 -9444
15825 -9444 -5951 29970 36069 -11202 -32155 -61124 -36068 -4482 -554 6297 2816 10123 15095
15812 15095 -21037 -50688 -30920 -55213 -81683 -45323 -77182 -22216 13987 23794 34069 -27282
15800 -27282 -42393 -36309 -79870 4054 41444 64568 50449 37667 22130 34782 7937 -59310
15788 -59310 -109510 -132615 -101380 -71889 8596 9756 -466 -14531 -19304 -56409 -57756 -12419
15776 -12419 -19421 31871 -14875 -99846 -109173 -99105 -98970 -90030 15312 1071 -21004 -33582
15764 -33582 -28173 -27322 -23562 -11328 1264 -25902 -33284 -45789 -73748 -84794 -40523 14588 28912
15751 28912 45987 47494 -2535 -5107 31211 129441 103272 15639 -25405 -93042 -110197 -92465
$$ packed form
15837a05169P6828K1451p739J8148M7175L5463k1933o3278o126M3747k5853k2158
15825i444L493L5921O099m7271k0953k8969K5056L1586L928O851l481P307M972
15812A5095l6132k9651J9768k4293k6470L6360l1859N4966L6203R807J0275o1351
15800b7282j5111O084m3561Q3924L7390K3124j4119j2782j5537J2652k6845o7247
15788e9310n0200k3105L1235K9491Q0485J160j0222j4065m773l7105j347M5337
15776a2419p002N1292m6746q4971r327J0068J35Q940J05342j4241k2075j2578
15764c3582N409Q51L760J2234J2592k7166p382j2505k7959j1046M4271N5111J4324
15751B8912J7075J507n0029k572L6318R8230k6169q7633m1044o7637j7155J7732
$$ plain form
15739 -92465 -82333 -79579 -71973 -90523 -40002 1803 7069 -64617 -146981 -106371 -13512 55101
15727 55101 58200 46210 38268 2804 15301 -12310 -11598 -21354 -88161 -30858 -3364 -43307 -52432
15714 -52432 -42910 -72095 -66282 -16989 -17009 -22698 -37179 16420 23247 -18078 -25414 -10512 30815
15701 30815 45405 49295 31105 24630 10709 -64526 -44097 -26798 -31002 17237 17143 -6341 16323
15688 16323 21859 -15952 -67783 -71460 -41734 17345 93718 110028 62766 35877 21889 -13815
15676 -13815 -36618 14229 22626 -7273 -39417 -39347 -23420 33450 63667 77022 13028 10103 46202
15663 46202 67785 -2671 -62248 -60377 -21974 -56151 -63887 -85474 -27856 30921 48578 13079
15651 13079 -50753 -58207 1043 57248 47988 11050 15504 37374 52216 43446 28849 20985 -9882
$$ packed form
15739i2465J0132K754P606j8550N0521M1805N266p1686q2364M0610R2859O8613
15727E5101L099j1990p942l5464J2497k7611P12r756o6807N7303K7494l9943r125
15714e2432R522k9185N813M9293k0n689j4481N3599O827m1325p336J4902M1327
15701C0815J4590L890j8190o475j3921p5235K0429J7299m204M8239r4k3484K2664
15688A6323N536l7811n1831l677K9726N9079P6373J6310m7262k6889j3988l5704
15676a3815k2803N0847Q397k9899l2144P0J5927N6870L0217J3355o3994k925L6099
15663D6202K1583p0456n9577J871L8403l4177p736k1587N7618N8777J7657l5499
15651A3079o3832p454N9250N6205r260l6938M454K1870J4842q770j4597p864l0867
$$ plain form
15638 -9882 34963 36068 49104 26983 12228 75284 59305 -16925 -47700 -34957 -7941 -7430
15626 -7430 -7583 13134 42251 68696 88891 78614 44833 45493 19234 1570 53044 85497 97619
15613 97619 127168 132782 86571 21836 18363 27146 7395 20739 37890 41609 18354 67178
15601 67178 67132 74672 40924 -23294 -59065 -75549 -109164 -69924 -17612 -31122 -12613 21011
15589 21011 103166 127378 91986 10230 -57936 -46462 -29674 23101 23916 40004 53216 53221 98153
15576 98153 156060 153844 87945 12485 45002 54468 36202 17175 20257 -4770 -29430 -6515
15564 -6515 41311 57928 84159 94107 97765 76985 24405 47675 89487 67468 77675 115556
15552 115556 103470 -1412 -33009 3848 67181 4035 -30836 -46079 -75862 -83404 -57747
$$ packed form
15638i882M4845J105J3036k2121j4755O3056j5979p6230l0775J2743K7016N11
15626g430j53K0717K9117K6445K0195j0277l3781O60k6259j7664N1474L2453J2122
15613I7619K9549N614m6211o4735l473Q783j9751J3344J7151L719k3255M8824
15601F7178m6P540l3748o4218l5771j6484l3615L9240N2312j3510J8509L3624
15589B1011Q2155K4212l5392q1756o8166J1474J6788N2775Q15J6088J3212NM4932
15576I8153N7907k216o5899p5460L2517R466j8266j9027L082k5027k4660K2915
15564f515M7826J6617K6231R948L658k0780n2580K3270M1812k2019J0207L7881
15552A15556j2086j04882l1597L6857O3333o3146l4871j5243k9783p542K5657
$$ plain form
15541 -57747 -55348 -3847 52166 79690 57946 31053 -27859 -116774 -139069 -103010 -73273 -95562
15529 -95562 -32261 52045 81238 71661 5759 -23742 -14154 3774 48894 75914 11093 -31113
15517 -31113 -78413 -70046 -51394 -36854 -7120 34793 35070 -16772 -5643 55709 57185 -13928
15505 -13928 -76904 -76548 6405 1094 -67881 -84066 -57120 -19953 -24298 -68301 -52225 -72800
15493 -72800 -85195 -56385 -2538 -15474 -97990 -116506 -117172 -63076 -5180 62142 46582 35201
15481 35201 70604 73303 61965 66956 30525 12286 9322 -23075 -23083 -22098 -26589 39893 10792 31405
15467 31405 42035 25113 60243 59941 36143 55056 37238 -30708 -19172 11491 14823 -37117
15455 -37117 -48856 -21382 -43901 -21146 12833 22754 -3619 -7433 -41895 -48240 -18884 20168
$$ packed form
15541e7747K399N1501N6013K7524k1744k6893n8912q8915k2295L6059K9737k2289
15529i5562O3301Q4306K9193r577o5902k9501R588J7928M5120K7020o4821m2206
15517c1113m7300Q367J8652J4540K9734M1913K77n1842J1129O1352J476p1113
15505a3928o2976L56Q2953n311o8975j6185K6946L7167m345m4003J6076k0575
15493g2800j2395K8810N3847j2936q2516j8516o66N4096N7896O7322j5560j1381
15481C5201L5403K699j1338M991l6431j8239k964l2397qR85m491O6482k9101K0613
15467C1405J0630j6922L5130l02k3798J8913j7818o7946J1536L0663L332n1940
15455c7117j1739K7474k2519K2755L3979R921k6373l814l4462o345K9356L9052
$$ plain form
15443 20168 36039 63854 50699 43089 28960 43668 39239 2097 8358 10946 -24799 -57956
15431 -57956 -45990 31078 12217 -26893 43199 108222 88939 54524 2842 -23224 3797 25240
15419 25240 21985 37322 55422 2439 6892 -18035 -30661 -30800 -5148 -47431 -47801 -18182 -26706
15406 -26706 -69080 -68465 -82531 -89131 -62905 -44346 -64801 -65383 -62010 -37977 9010 8841 -33046
15393 -33046 -37703 -20087 -21560 25948 78368 12392 13568 -22005 -60504 -20944 60609 104494
15381 104494 57189 88298 70320 -14167 -25110 9179 31478 65753 74398 3106 -50636 -73463
15369 -73463 -87757 -36123 -29132 -13954 -23394 -24666 -29809 -73747 -101008 -62880 12769 86834
15357 86834 93986 66338 1951 -30017 -42366 -31989 -68154 -42946 -23234 -16478 24250 30945
$$ packed form
15443B0168J5871K7815j3155p610j4129J4708m429l7142O261K588l5745l3157
15431e7956J1966P7068j8861l9110P0092O5023j9283l4415n1682k6066K7021K1443
15419B5240l255J5337J8100n2983M453k4927j2626j39K5652m2283l70K9619q524
15406b6706m2374O15j4066o600K6226J8559k0455n82L373K4033M6987j69m1887
15393c3046m657J7616j473M7508N2420o5976J176l5573l8499L9560Q1553M3885
15381A04494m7305L1109j7978q4487j0943L4289K2299L4275Q645p1292n3742k2827
15369g3463j4294N1634O991J5178r440j272n143m3938k7261L8128P5649P4065
15357H6834P152k7648o4387l1968j2349J0377l6165K5208J9712O756M0728O695
$$ plain form
15345 30945 18879 -18470 -57970 -64809 -845 -33567 -75245 -33389 -35708 -15602 11908 5255
15333 5255 -17993 9873 4002 -42119 -56438 -10245 37843 70138 48603 12775 -671 37746
15321 37746 68007 82930 65322 33682 -16425 -10159 15243 46988 44747 13501 77026 90827
15309 90827 -35975 -47583 -69117 -113587 -112083 -70383 -62161 -42542 -17942 37738 58432 23105
15297 23105 16037 65015 69838 -17227 -62172 -140284 -184506 -116949 -23594 -9587 17891 19472
15285 19472 -7632 -38802 -52429 -58771 -45315 9143 50476 71423 63531 72901 91014 100352
15273 100352 97608 66154 87174 81046 60214 4825 -34419 -37763 24667 81548 67262 25815
15261 25815 47644 102478 122934 48226 25784 88746 99606 48281 321 24475 63069 35874
$$ packed form
15345C0945j2066l7349l9500o839O3964l2722m1678M1856k319K0106K7510o653
15333E255k3248K7866n871m6121j4319M6193M8088L2295k1535l5828j3446L8417
15321C7746L0261J4923j7608l1640n0107O266K5402L1745k241l1246O3525J3801
15309I0827j26802j1608k1534m4470J504M1700Q222J9619K4600N5680K0694l5327
15297B3105p068M8978M823q7065m4945p8112m4222O7557R3355J4007K7478J581
15285A9472k7104l1170j3627o342J3456N4458M1333K0947p892R370J8113R338
15273A00352k744l1454K1020o128k0832n5389l9244l344O2430N6881j4286m1447
15261B5815K1829N4834K0456p4708k2442O2962J0860n1325m7960K4154L8594k7195
$$ plain form
15249 35874 37646 43947 40430 20867 -21234 13842 -9008 -52921 -19927 31614 23326 -77545
15237 -77545 -67522 -45492 -26128 20258 -13456 30608 16307 -38238 -16269 25210 38324 -2902
15225 -2902 11302 75229 111333 94990 30957 -22479 -13638 49420 69105 -3233 -49563 -72131
15213 -72131 -70412 -26896 -25114 15822 526 -26590 27167 32492 207 -52584 -47704 -17356
15201 -17356 20330 23071 -3357 -3185 31881 94608 105789 114056 111262 57392 25315 -9564 -3250
15188 -3250 63780 100163 52966 26894 -17964 -27428 -34773 -11317 10275 27806 -9224 -2419
15176 -2419 -28027 -71758 -91594 -97726 -20234 20625 3861 -52264 -117223 -95861 -65920 -88100
15164 -88100 -101689 -54843 -32638 -40937 -20726 -50477 -46847 -77294 -24703 75599 103528 50030
$$ packed form
15249C5874J772O301l517j9563m2101L5076k2850m3913L2994N1541q288j00871
15237g7545J0023K2030J9364M6386l3714M4064j4301n4545K1969M1479J3114m1226
15225b902J4204O3927L6104j6343o4033n3436Q841O3058J9685p2338m6330k2568
15213g2131J719M3516J782M0936j5296k7116N3757N325l2285n2791M880L0348
15201a7356L7686K741k6428J72L5066O2727J1181Q267k794n3870l2077l4879O314
15188c250O7030L6383m7197k6072m4858r464p345K3456K1592J7531l7030O805
15176b419k5608m3731j9836o132P7492M0859j6764n6125o4959K1362K9941k2180
15164h8100j3589M6846K2205q299K0211k9751L630l0447N2591J00302K7929n3498
$$ plain form
15152 50030 -5139 -1680 -2703 45772 4964 12933 54053 6924 -18781 65439 96095 23314
15140 23314 -49177 -34444 4027 -37619 -65838 -33900 -22984 -41471 -45346 -592 4531 -45474
15128 -45474 -24273 -3918 27044 45271 -4370 -7571 2231 27291 12333 -18520 -14271 -39863
15116 -39863 -76256 -63840 -23289 35083 41414 43334 37918 21111 21836 66375 52287 77571 104809
15103 104809 109961 92127 69940 46623 67992 53385 79257 110039 83795 49840 3192 -36671
15091 -36671 -50321 -7839 14781 31753 -30399 -46014 -41512 -5500 12633 -45430 -61131 -101417
15079 -101417 -124503 -57869 -17268 -22880 -3668 1598 46413 39209 60371 56862 79093 85283
15067 85283 82112 97025 31282 16422 37264 31438 9625 -48469 -17587 25124 35651 -31907
$$ packed form
15152E0030n5169L459j023M8475m0808P969M1120m7129k5705Q4220L0656p2781
15140B3314p2491J4733L8471m1646k8219L1938J0916j8487l875M4754N123n0005
15128d5474K1201K0355L0962J8227m9641l201R802K5060j4958l0853M249k5592
15116c9863l6393J2416M0551N8372O331J920n416j6807P25M4539j4088K5284K7238
15103A04809N152j7834k2187k3317K1369j4607K5872L0782k6244l3955m6648l9863
15091c6671j3650M2482K2620J6972o2152j5615M502L6012J8133n8063j5701m0286
15079a01417k3086O6634M0601n612J9212N266M4815p204K1162l509K2231O190
15067H5283l171J4913o5743j4860K0842n826k1813n8094L0882M2711J0527o7558
$$ plain form
15055 -31907 -63883 -68835 -18769 45706 33559 -48922 -68858 -28325 -68106 -10513 37381 854
15043 854 19509 19002 6059 6336 13707 5062 19043 10942 48479 36502 10574 14908 20278 48856
15029 48856 26590 -39470 -25706 25675 37898 16917 -23024 12124 6213 -6283 -35690 -43444
15017 -43444 -43268 9607 83081 67172 40294 -75214 -151632 -122160 -56244 19969 34267 25494
15005 25494 80219 113752 181391 257069 214700 129519 93871 77532 83838 83087 157610 82543
14993 82543 30417 85699 68499 44873 34151 52638 54253 72813 132020 146365 116012 98668
14981 98668 23828 5252 -10198 -4646 12924 38230 16154 53410 112590 69521 30895 -4551
14969 -4551 3056 -21631 -50995 -21500 60240 68941 92907 106955 89897 45069 -2136 -48513
$$ packed form
15055c1907l1976m952N0066O4475j2147q2481j9936M0533l9781N7593M7894l6527
15043H54J8655n07j2943K77P371q645J3981q101L7537j1977k5928M334N370K8578
15029D8856k2266o6060J3764N1381J2223k0981l9941L5148n911j2496k9407p754
15017d3444J76N2875P3474j5909k6878j15508p6418K9472O5916P6213J4298q773
15005B5494N4725L3533O7639P5678m2369q5181l5648j6339O306p51P4523p5067
14993H2543n2126N5282j7200k3626j0722J8487J615J8560N9207J4345l0353j7344
14981I8668p4840j8576j5450N552J7570K5306k2076L7256N9180m3069l8626l5446
14969d551P607k4687k9364K9495Q1740Q701K3966J4048j7058m4828m7205m6377
$$ plain form
14957 -48513 -100816 -65807 -22871 14234 1801 7893 12449 -17453 15429 46586 7803 -33318
14945 -33318 -24488 -52074 13832 29935 29992 12110 -5799 -22237 -30743 -48433 2933 -6799 -53718
14932 -53718 -91134 -95930 -104703 -32074 -11268 -74201 -95887 -76490 -69870 -53308 -28530 11367
14920 11367 -17047 -31441 30103 -17786 -60124 -36170 -39867 -20187 -35081 -35580 -41498 9098
14908 9098 23917 -39580 -40539 752 30918 43646 54111 80239 76842 22219 37988 62921
14896 62921 77453 98658 70011 27562 583 -37096 -36316 -9657 29130 5794 23299 60711
14884 60711 64893 52582 60970 64544 68539 58303 24295 4430 29287 55622 93314 103187 67250
14871 67250 58699 36900 17365 22682 8286 -1442 58605 67912 15059 5084 22409 22160 1384
$$ packed form
14957d8513n2303L5009M2936L7105j2433O092M556k9902L2882L1157l8783m1121
14945c3318Q830k7586O5906J6103N7j7882j7909j6438q506j7690N1366r732m6919
14932e3718l7416m796q773P2629K0806o2933k1686J9397O620J6562K4778L9897
14920A1367k8414j4394O1544m7889m2338K3954l697J9680j4894m99n918N0596
14908I098J4819o3497r59M1291L0166J2728J0465K6128l397n4623J5769K4933
14896F2921J4532K1205k8647m2449k6979l7679P80K6659L8787k3336J7505L7412
14884F0711M182j2311Q388L574L995j0236l4008j9865K4857K6335L7692R873l5937
14871F7250q551k1799j9535N317j4396r728O0047R307n2853r975J7325k49k0776
$$ plain form
14858 1384 34095 5595 -6698 -11901 4443 11778 83280 94830 87903 73010 97655 94487 97013
14845 97013 137927 201876 144086 120625 123133 59773 52381 27692 10645 47388 73664 72246
14833 72246 69181 48881 37768 6780 -13821 -39860 -61883 -102293 -69811 -39819 30905 84620
14821 84620 83071 52315 63613 37841 -748 -3261 34868 84679 81515 116572 100481 88715
14809 88715 77556 44244 -18589 -30981 -500 26973 63678 88700 72913 29849 -1803 37130
14797 37130 12377 -27096 -1452 28485 6476 -25830 -43769 -41261 11279 76687 41563 24184
14785 24184 40928 64333 108495 100880 52814 57677 41177 35657 52110 60404 62131 49483 73906
14772 73906 62495 59398 67671 96780 83047 78656 67526 31167 -694 9465 46318 35944
$$ packed form
14858A384L2711k8500j2293n203J6344P335P1502J1550o927j4893K4645l168K526
14845I7013M0914O3949n7790k3461K508o3360p392k4689j7047L6743K6276j418
14833G2246l065k0300j1113l0988k0601k6039k2023m0410L2482K9992P0724N3715
14821H4620j549l0756J1298k5772l8589k513L8129M9811l164L5057j6091j1766
14809H8715j1159l3312o2833j2392L0481K7473L6705K5022j5787m3064l1652L8933
14797C7130k4753l9473K5644K9937k2009l2306j7939K508N2540O5408l5124j7379
14785B4184J6744K3405M4162p615m8066M863j6500n520J6453Q294J727j2648K4423
14772G3906j1411l097Q273K9109j3733m391j1130l6359l1861J0159L6853j0374
$$ plain form
14760 35944 15959 -73956 -106609 -67752 -59612 -75167 -67364 12293 106683 117650 80237 104413
14748 104413 114033 60591 38482 8035 -29294 -46921 -74559 -40096 -24432 -39924 -49623 -23367
14736 -23367 33415 47948 34014 32066 36614 -20395 -64813 -77110 -60705 -53239 -105617 -106371 -48360
14723 -48360 -19567 -12519 -14383 8928 -1921 29980 34509 56386 91162 71401 43909 40495
14711 40495 45853 -4741 871 -1158 9057 43753 26409 -3644 -25367 -75 25236 25070 52264
14698 52264 -15112 -28860 -71761 -67085 -42172 -40903 35872 51420 52286 72306 48768 28801
14686 28801 43742 23727 46168 85599 87490 83340 68800 42874 18568 35298 27096 17371
14674 17371 915 13740 40264 42401 54611 93731 78335 51042 -11258 6822 35913 57781
$$ packed form
14760C5944j9985q9915l2653L8857Q140j5555P803P9657R4390J0967l7413K4176
14748A04413R620n3442k2109l0447l7329j7627k7638L4463J5664j5492r699K6256
14736b3367N6782J4533j3934j948M548n7009m4418j2297J6405P466n2378p54N8011
14723d8360K8793P048j864K3311j0849L1901M529K1877L4776j9761k7492l414
14711D0495N358n0594N612k029J0215L4696j7344l0053k1723K5292K5311j66K7194
14698E2264o7376j3748m2901M676K4913J269P6775J5548Q66K0020k3538j9967
14686B8801J4941k0015K2441L9431J891m150j4540k5926k4306J6730q202r725
14674A7371j6456J2825K6524K137J2210L9120j5396k7293o2300J8080K9091K1868
$$ plain form
14662 57781 16579 27615 66655 19849 4016 23196 12024 -2227 -50041 -34085 3647 -45849
14650 -45849 -61726 -49240 -57052 -16442 -18193 -64352 -87924 -57207 -11924 27658 85984 42865
14638 42865 34720 17326 12029 52338 56499 87411 82894 26870 5900 26230 18577 34959 19935
14625 19935 -8151 -10275 -36735 26253 81868 39546 46545 25706 -12049 -25061 -33 -40545
14613 -40545 -36607 -216 -7636 -18124 15631 -47658 -31851 -20567 -31252 -63135 -90401 -104015
14601 -104015 -63612 10325 12971 -47207 -48795 -14084 12786 39480 112432 116319 74714 25203
14589 25203 1824 6755 3924 36866 24701 66103 114354 108899 51679 41405 10814 -40370
14577 -40370 -29003 -13350 -2320 37293 60864 44176 99301 74097 32514 42493 -11557 -31093
$$ packed form
14662E7781m1202J1036L9040m6806j5833J9180j1172j4251m7814J5956L7732m9496
14650d5849j5877J2486p812M0610j751m6159k3572L0717M5283L9582N8326m3119
14638D2865q145j7394n297M0309M161L0912m517n6024k0970K0330p653J6382j5024
14625A9935k8086k124k6460O2988N5615m2322O999k0839l7755j3012K5028m0512
14613d0545L938L6391p420j0488L3755o3289J5807J1284j0685l1883k7266j3614
14601a04015M0403P3937K646o0178j588L4711K6870K6694P2952L887m1605m9511
14589B5203k3379M931k831L2942j2165M1402M8251n455n7220j0274l0591n1184
14577d0370J1367J5653J1030L9613K3571j6688N5125k5204m1583R979n4050j9536
$$ plain form
14565 -31093 565 -64120 -84640 -62103 -65583 -56074 -3604 86842 15289 -12554 -15007 -37214
14553 -37214 -18179 -6035 55599 112286 92413 61665 24379 11815 21615 21621 -25143 -45304 -67342
14540 -67342 -81313 -94913 -93570 -86288 -40721 -51824 -18493 -8370 -33566 -17983 55868 63239
14528 63239 49167 11163 -51176 -62305 -46744 -40795 -3308 33092 37397 59570 27508 -42338
14516 -42338 -45554 38007 88302 77493 11275 -39674 -46977 22496 60897 52757 3505 34296
14504 34296 43396 40899 32728 15144 16734 6739 -38702 22512 36623 -17378 20690 47058 36540
14491 36540 -24508 -37770 -82255 -41918 2870 25707 -7219 -95964 -113789 -55133 -60353 -82254
14479 -82254 -48644 -2774 -51348 -106918 -105450 -39891 6811 56531 25763 -25624 882 3129
$$ packed form
14565c1093L1658o4685k0520K2537l480R509N2470R0446p1553k7843k453k2207
14553c7214J9035J2144O1634N6687j9873l0748l7286j2564R800Om6764k0161k2038
14540f7342j3971j3600J343P282M5567j1103L3331J0123k5196J5583P3851P371
14528F3239j4072l8004o2339j1129J5561N949L7487L6400M305K2173l2062o9846
14516d2338l216Q3561N0295j0809o6218n0949p303O9473L8401q140m9252L0791
14504C4296R100k497q171j7584J590r995m5441O1214J4111n4001L8068K6368j0518
14491C6540o1048j3262m4485M0337M4788K2837l2926q8745j7825N8656n220k1901
14479h2254L3610M5870m8574n5570J468O5559M6702M9720l0768n1387K6506K247
$$ plain form
14467 3129 -51617 -15120 6810 41398 115119 143783 108668 45709 56760 65362 89190 46268
14455 46268 1167 -10472 21838 35597 114618 151552 99558 -692 -6223 22789 54829 74558
14443 74558 50560 18541 389 -18293 -16604 -54414 -89107 -98478 -77509 -103678 -98971 -78977
14431 -78977 -36679 42125 46926 41497 35529 48238 106660 112930 78511 30765 19562 -22432
14419 -22432 -28967 15075 -14695 2249 8645 47487 80661 59259 55125 36263 -746 3081
14407 3081 4329 15318 -5185 501 -41596 -48905 482 15429 34761 -5634 6516 43704
14395 43704 53546 67588 92089 93395 69512 11990 -31946 -59161 -56844 -27550 20967 -1414
14383 -1414 13174 52792 67996 80128 99290 -3067 11890 46988 36920 56376 28047 26789
$$ packed form
14467C129n4746L6497K1930L4588P3721K8664l5115o2959J1051Q602K3828m2922
14455D6268m5101j1639L2310J3759P9021L6934n1994j00250n531K9012L2040J9729
14443G4558k3998l2019j8152j8682J689l7810l4693r371K0969k6169M707J9994
14431g8977M2298P8804M801n429n968J2709N8422O270l4419m7746j1203m1994
14419b2432o535M4042k9770J6944O396L8842L3174k1402m134j8862l7009L827
14407C081J248J0989k0503N686m2097p309M9387J4947J9332m0395J2150L7188
14395D3704R842J4042K4501J306k3883n7522m3936k7215K317K9294M8517k2381
14383a414J4588L9618J5204J2132J9162j02357J4957L5098j0068J9456k8329j258
$$ plain form
14371 26789 30126 1036 21489 -28909 -39300 -23568 -42500 -67399 8102 45222 93681 108779
14359 108779 100781 68307 31664 18360 38254 -15998 -45066 -33794 25916 27122 8686 39389
14347 39389 22736 21298 45555 -8446 -66829 -68612 -42048 -27115 -9978 -6637 27195 31099
14335 31099 73001 36096 2503 33885 6370 -44886 -51919 -66944 -116118 -85525 -12831 18296
14323 18296 48864 15709 -1644 -27201 -45654 -36493 14878 45738 4312 -13129 -10465 20775
14311 20775 43776 43232 54147 56166 -23372 -55457 -35464 -31879 41312 64857 57441 70752 35430
14298 35430 22962 1119 -8041 -8402 -8918 29349 23050 50221 19116 -22742 -29553 -13547 16383
14285 16383 42710 18404 32490 22027 -3141 -17710 -46797 -89447 -63384 -32704 -32186 -87
$$ packed form
14371B6789L337k9090K0453n0398j0391J5732j8932k4899P5501L7120M8459J5098
14359A08779p998l2474l6643j3304J9894n4252k9068J1272N9710J206j8436L0703
14347C9389j6653j438K4257n4001n8383j783K6564J4933J7137L341L3832L904
14335C1099M1902l6905l3593L1382k7515n1256p033j5025m9174L0593P2694L1127
14323A8296L0568l3155j7353k5557j8453R161N1371L0860m1426j7441K664L1240
14311B0775K3001n44J0915K019p9538l2085J9993L585P3191K3545p416J3311l5322
14298C5430j2468k1843r160l61n16L8267o299K7171l1105m1858o811J6006K9930
14285A6383K6327k4306J4086j0463k5168j4569k9087m2650K6063L0680N18L2099
$$ plain form
14273 -87 60925 3334 -18898 -48558 -37464 -37638 -41956 -46835 -57072 39905 94457 84089 82944
14260 82944 79548 88576 110758 55562 23058 -28697 -92474 -46183 37258 53047 33145 53359
14248 53359 46017 -12327 -21473 -12374 -6581 19201 14958 23019 20801 46772 5252 -15641 -1413
14235 -1413 25235 55288 36788 23380 52712 78316 69246 66534 60610 33755 -6750 -55680
14223 -55680 -62292 -36873 11967 53182 84455 53013 23770 17064 18510 21176 18076 13877 -12235
14210 -12235 -38785 -66287 -54023 -22804 3700 42847 7900 -23881 5025 130236 222011
14199 222011 138955 74157 47422 67779 48279 41052 45487 83530 59272 59244 -2599 -22223
14187 -22223 -23920 -45176 -24530 -50291 -90304 -36122 37179 15097 -37341 -50283 -65599 -63738
$$ packed form
14273h7O1012n7591k2232k9660J1094j74m318m879j0237R6977N4552j0368j145
14260H2944l396R028K2182n5196l2504n1755o3777M6291Q3441J5789j9902K0214
14248E3359p342n8344r146R099N793K5782m243Q061k218K5971m1520k0893J4228
14235a413K6648L0053j8500j3408K9332K5604r070k712n924k6855m0505m8930
14223e5680o612K5419M8840M1215L1273l1442k9243o706J446K666l100m199k6112
14210a2235k6550k7502J2264L1219K6504L9147l4947l1781K8906J25211R1775
14199B22011q3056o4798k6735K0357j9500p227M435L8043k4258k8o1843j9624
14187b2223j697k1256K0646k5761m0013N4182P3301k2082n2438j2942j5316J861
$$ plain form
14175 -63738 -48257 -21198 -29260 19735 15560 -25082 -66776 -45488 -15891 -28229 -87750 -121951
14163 -121951 -88743 -32066 -7150 51855 37005 44362 13001 -4793 23028 25106 22591 68664
14151 68664 64323 -40019 -64467 -12943 32053 -7287 -52986 -43744 -37911 -73198 -49366 -19461
14139 -19461 -27438 -11446 -5020 -39063 -63127 -61433 -44063 -4558 12509 -42440 -80686 -49346
14127 -49346 -40845 -43745 -11297 43764 -4772 -70746 -50475 -29682 -61545 -49122 -55112 -46842
14115 -46842 -15325 17136 16180 14018 15997 4900 -7531 -16316 8625 19763 2471 18429 18403
14102 18403 -53081 -69647 -60277 -13907 33066 84817 45245 -63670 -92813 -73180 -50943 -44416
14090 -44416 -25492 -14797 -59911 -84363 -10441 2666 5664 -25359 -83387 -108650 -55030 4101
$$ packed form
14175f3738J5481K7059q062M8995m175m0642m1694K1288K9597j2338n9521l4201
14163a21951L3208N6677K4916N9005j4850P357l1361j7794K7821K078k515M6073
14151F8664m341j04342k4448N1524M4996l9340m5699R242N833l5287K3832K9905
14139a9461p977J5992O426l4043k4064J694J7370L9505J7067n4949l8246L1340
14127d9346Q501k900L2448N5061m8536o5974K0271K0793l1863J2423n990Q270
14115d6842L1517L2461r56k162J979j1097j2431q785K4941J1138j7292J5958k6
14102A8403p1484j6566R370M6370M6973N1751l9572j08915k9143J9633K2237O527
14090d4416J8924J0695m5114k4452P3922J3107K998l1023n8028k5263N3620N9131
$$ plain form
14078 4101 17154 21629 -9030 -26680 -2958 -14179 -25996 24984 21698 30916 8005 55203
14066 55203 28803 30458 18882 -24785 -48763 -21203 -2927 -8860 -56391 -53415 -46680 -41129 -57206
14053 -57206 -87323 -63482 4958 9068 123 13492 -18724 -32419 -18672 -1148 -41519 -85617
14041 -85617 -85259 -40446 15100 16176 -47170 -55719 -4629 -5522 -15123 -10318 -3473 -35793 -27114 -60199
14027 -60199 -38088 -57183 -75593 -79263 -38762 -1861 -17590 -40132 -46062 -40310 -57152 -19534
14015 -19534 13709 15585 -4709 -75458 -95043 -84066 -81057 -87563 -114413 -133639 -117676 -172639
14003 -172639 -112920 -27727 9104 -9662 -79569 -75741 -16467 42926 107411 91491 49953 32139
13991 32139 25710 -25748 -60721 -109761 -80010 -14117 24014 21606 -16912 6544 -4607 -40455
$$ packed form
14078D101J3053M475l0659j7650K3722j1221j1817N0980l286R218k2911M7198
14066E5203k6400J655j1576m3667k3978K7560J8276n933m7531K976O735N551j6077
14053e7206l0117K3841O8440M110q945J3369l2216j3695J3747J7524m0371m4098
14041h5617L58M4813N5546J076o3346q549N1090q93r601M805O845l2320Q679l3085
14027f0199K2111j9095j8410l670M0501L6901j5729k2542n930N752j6842L7618
14015a9534L3243J876k0294p0749j9585J0977L009o506k6850j9226J5963n4963
14003a72639N9719Q5193L6831j8766o9907L828N9274N9393O4485j5920m1538j7814
13991C2139o429n1458l4973m9040K9751O5893L8131k408l8518K3456j1151l5848
$$ plain form
13979 -40455 -53695 -69488 -77452 -55508 -31251 -41841 -57404 -108059 -127436 -75769 12071 11736
13967 11736 29195 69101 119715 99655 67622 23441 11187 21206 88278 141752 79453 -33964
13955 -33964 -91729 -84091 -90863 -95019 -64463 -32538 -43419 -74406 -134516 -157028 -157283 -63160 -19692
13942 -19692 -30287 20684 20602 19674 -10513 -29706 -24097 -22568 -52638 -76209 -3400 79135 54453
13929 54453 25910 -10394 -75323 -114477 -86559 -65494 -75729 -72269 -37894 -86756 -115494 -156053
13917 -156053 -163301 -64310 2624 -25515 -33253 -37977 -7117 20326 -2552 -37107 -27630 -24633
13905 -24633 -4298 -31155 -62829 -64447 -94024 -101499 -78804 -3884 27009 -48487 -56067 -82794
13893 -82794 -124604 -115147 -63222 -48319 -42911 16671 34848 19596 25954 73113 26512 -6531
$$ packed form
13979d0455j3240j5793p964K1944K4257j0590j5563n0655j9377N1667Q7840l35
13967A1736J7459L9906N0614k0060l2033m4181j2254J0019O7072N3474o2299j13417
13955c3964n7765P638o772m156L0556L1925j0881l0987o0110k2512k55R4123M3468
13942a9692j0595N0971q2r28l0187j9193N609J529l0070k3571P2809Q2535k4682
13929E4453k8543l6304o4929l9154K7918K1065j0235L460L4375m8862k8738m0559
13917a56053p248R8991O6934k8139p738m724L0860K7443k2878l4555R477K997
13905b4633K0335k6857l1674j618k9577p475K2695P4920L0893p5496p580k6727
13893h2794m1810R457N1925J4903N408N9582J8177j5252O358M7159m6601l3043
$$ plain form
13881 -6531 -9646 -16730 -60595 -50587 -58540 -43843 5170 53320 24695 -40426 -80169 -72758 -16706
13868 -16706 39229 9753 -17463 -32471 -54661 -63872 -51497 -52373 -82858 -58951 -6188 -24453
13856 -24453 -62722 -74845 -35807 28128 120114 145602 117232 17650 -54102 -50065 -55068 -103875
13844 -103875 -100773 -103147 -116929 -112432 -39255 -34939 -18274 -22716 -34619 -53153 -58763 -18463 -11615
13831 -11615 6306 -4756 2382 15169 9342 23793 39143 -7426 18154 23861 -5403 2747
13819 2747 20677 35075 29764 35897 -17755 -23845 -593 11878 -30265 20690 -1626 -40137
13807 -40137 -35141 -6596 4405 -11308 -6631 -8402 -20259 -28746 -75578 -93604 -42634 3619
13795 3619 17501 12125 -42368 -106647 -148614 -127123 -99210 -102380 -78038 -25396 -11727 13263
$$ packed form
13881f531l115p084m3865J0008p953J4697M9013M8150k8625o5121l9743P411N6052
13868a6706N5935k9476k7216j5008k2190r211J2375q76l0485K3907N2763j8265
13856b4453l8269j2123L9038O3935R1986K5488k8370r9582p1752M037n003m8807
13844a03875L102k374j3782M497P3177M316J6665m442j1903j8534n610M0300O848
13831a1615J7921j1062P138J2787n827J4451J5350m6569K5580N707k9264Q150
13819B747J7930J4398n311O133n3652o090K3252J2471m2143N0955k2316l8511
13807d0137M996K8545J1001j5713M677j771j1857q487m6832j8026N0970M6253
13795C619J3882n376n4493o4279m1967K1491K7913l170K4342N2642J3669K4990
$$ plain form
13783 13263 8072 8107 -37896 -77816 -44012 26760 29911 9425 15800 -831 43317 65595 38417
13770 38417 -18092 -79866 -62221 -33083 -22048 8043 24683 4431 -86394 -59070 45216
13759 45216 30784 -13103 -5843 -44375 -45351 -10962 -2712 -29204 -60228 -48757 3980 9334 -10854
13746 -10854 7024 72833 24301 -22865 -18251 39507 14339 -46418 -32757 21685 64801 84441
13734 84441 7383 -20331 13376 10032 -23153 3694 35776 92789 41138 15858 4867 36908
13722 36908 62561 5440 -77361 -118840 -59174 11295 12136 -12470 7820 -10593 -32983 -48911
13710 -48911 -53085 -40299 -32014 -96668 -102979 -19463 15932 13246 622 -20780 -49365 -33503
13698 -33503 11541 50518 32859 35106 46459 7763 -16380 -15852 -420 12454 27095 8252
$$ packed form
13783A3263n191L5m6003l9920L3804P0772L151k0486O375j6631M4148K2278k7178
13770C8417n6509o1774J7645K9138J1035L0091J6640k0252r0825K7324J04286
13759D5216j4432m3887P260l8532r76L4389Q250k6492l1024J1471N2737N354k0188
13746a0854J7878O5809m8532m7166M614N7758k5168o0757J3661N4442M3116J9640
13734H4441p7058k7714L3707l344l3185K6847L2082N7013n1651k5280j0991L2041
13722C6908K5653n7121q2801m1479N9666P0469Q41k4606K0290j8413k2390j5928
13710d8911m174J2786Q285o4654o311Q3516L5395k686j2624k1402k8585J5862
13698c3503M5044L8977j7659K247J1353l8696k4143N28J5432J2874J4641j8843
$$ plain form
13686 8252 -35175 -66135 -40664 -58121 -95024 -53587 -30392 39846 21365 55281 7730 -78183
13674 -78183 -87969 -87842 -94121 -111231 -121416 -93993 -62419 -42850 -3136 17863 21016 -14875 -30428
13661 -30428 -14364 -8177 -18790 -49467 -46656 -9741 -23083 -4211 48026 49811 64333 -7762
13649 -7762 -57823 -59956 -41918 -23503 -29466 -21940 -79 8353 -14322 10618 38347 50361 4002
13636 4002 -16962 47116 19348 -6149 -67328 -95175 -72092 20694 2625 10199 -50054 -105573
13624 -105573 -59358 6745 -3601 15258 -45831 -20893 89942 65644 31651 -31026 -40335
13613 -40335 14408 84500 86945 36907 56944 119513 157721 138776 106921 110371 97523 9887
13601 9887 -83907 -99439 -61298 -26364 32379 26287 -27975 -50644 -14810 -41288 -72402 -85353
$$ packed form
13686H252m3427l0960K5471j7457l6903M1437K3195P0238j8481L3916m7551q5913
13674g8183r786J27o279j7110j0185K7423L1574J9569L9714K0999L153l5891j5553
13661c0428J6064O187j0613l0677K811L6915j3342J8872N2237J785J4522p2095
13649g762n0061k133J8038J8415n963P526K1861Q432k2675K4940K7729J2014m6359
13636D002k0964O4078k7768k5497o1179k7847K3083R2786j8069P574o0253n5519
13624a05573M6215O6103j0346J8859o1089K4938J10835k4298l3993o2677r309
13613d0335N4743P0092K445n0038K0037O2569L8208j8945l1855L450j2848q7636
13601I887r3794j5532L8141L4934N8743o092n4262k2669L5834k6478l1114j2951
$$ plain form
13589 -85353 -101469 -65840 3890 -10090 -23090 -5390 71466 80110 26867 61383 46662 54709
13577 54709 66628 24318 75687 74393 -5703 30898 59938 47984 8005 1542 -8963 2780
13565 2780 6361 12312 2322 -27873 -45415 -61448 -60187 -92338 -96615 -27133 11690 2806 2117
13552 2117 -17137 1016 7156 -14387 -26453 9972 75434 131110 83858 47281 59237 87673
13540 87673 109274 70478 -40517 -90989 -66341 -20160 -8324 -10399 7077 -3217 -20790 -41207
13528 -41207 -36134 -41188 -47263 -72381 -73801 -62819 -76596 -93012 -52307 -14964 -100759 -148383
13516 -148383 -105703 -31076 30972 82727 54619 75896 89424 94807 61632 5481 -44555 -36203
13504 -36203 28425 39587 6092 -65287 -112867 -71053 -31202 -35438 -25311 -39323 40013 67397
$$ packed form
13589h5353j6116L5629O9730j3980j3000J7700P6856Q644n3243L4516j4721Q047
13577E4709J1919m2310N1369j294q0096L6601K9040j1954l9979o463j0505J1743
13565B780L581N951r990l0195j7542j6033J261l2151m277O9482L8823q884o89
13552B117j9254J8153O140k1543j2066L6425O5462N5676m7252l6577J1956K8436
13540H7673K1601l8796j10995n0472K4648M6181J1836k075J7476j0294j7573k0417
13528d1207N073n054o075k5118j420J0982j3777j6416M0705L7343q5795m7624
13516a48383M2680P4627O2048N1755k8108K1277J3528N383l3175n6151n0036Q352
13504c6203O4628J1162l3495p1379m7580M1814L9851m236J0127j4012P9336K7384
$$ plain form
13492 67397 46600 35019 47957 86411 89504 59851 25208 30352 89593 74119 48991 30188
13480 30188 9470 10527 14456 41273 -24327 -12654 29305 -5289 -38659 -55666 -44408 -8426
13468 -8426 -34061 -41208 4724 65413 51742 -14302 -1586 1477 -41717 -91482 -108478 -65037
13456 -65037 -45347 -76025 -33880 -44861 -77526 -80730 -20851 19415 41310 54247 90697 99923
13444 99923 62652 5751 -775 19646 -3082 -38906 -36843 750 55554 65969 12640 -44864
13432 -44864 -45930 -11097 4961 2389 -34882 -26921 -12285 -103162 -95516 -103577 -60425 11065 -16586
13419 -16586 -14016 -4377 -54294 -93863 -91419 -40224 24021 54990 56448 66584 53413 28638
13407 28638 -1759 -32363 -7916 7713 45483 19429 -15461 11693 -19879 -47194 -14925 31758
$$ packed form
13492F7397k0797j1581J2938L8454L093k9653l4643N144N9241j5474k5128j8803
13480C0188k0718J057L929K6817o5600J1673M1959l4594l3370j7007J1258L5982
13468h426k5635p147M5932O0689j3671o6044J2716L063m3194m9765j6996M3441
13456f5037J9690l0678M2145j0981l2665l204N9879M0266K1895J2937L6450R226
13444I9923l7271n6901o526K0421k2728l5824K063L7593N4804J0415n3329n7504
13432d4864j066L4833J6058k572l7271P961J4636r0877P646q061M3152P1490k7651
13419a6586K570R639m9917l9569K444N1195O4245L0969J458J0136j3171k4775
13407B8638l0397l0604K4447J5629L7770k6054l4890K7154l1572k7315L2269M6683
$$ plain form
13395 31758 -32999 -80686 -68909 33964 35047 -16269 -6199 -23032 34072 59599 55784 55846
13383 55846 69329 126402 141357 71346 18962 2830 9491 -11091 -12909 -5123 9451 -14273
13371 -14273 -58859 -46640 -42179 -44453 -15993 -19168 -54661 -80593 -124063 -79912 -60733 -54411
13359 -54411 -45703 -93120 -125303 -44376 -1530 -36192 -61790 -21383 -1899 11426 57161 63473
13347 63473 41546 -43570 -16 77275 79054 85514 65769 36334 59383 116267 113788 69890
13335 69890 68746 66702 71824 86106 85666 46821 -29435 -14179 -24536 -56487 -11695 55772 33632
13322 33632 -32482 -73425 -80329 -37855 -59033 -49425 -8467 -21725 -37860 -67961 -82512 -81275
13310 -81275 -17579 -18517 34189 114621 164936 162576 134758 131480 100038 98594 103381 104023 85982
$$ packed form
13395C1758o4757m7687J1777J02873J083n1316J0070j6833N7104K5527l815O2
13383E5846J3483N7073J4955p0011n2384j6132O661k0582j818P786J4574k3724
13371a4273m4586J2219M461k274K8460l175l5493k5932m3470M4151J9179O322
13359e4411Q708m7417l2183Q0927M2846l4662k5598M0407J9484J3325M5735O312
13347F3473k1927q5116M3554P7291J779O460j9745k9435K3049N6884k479m3898
13335F9890j144k044N122J4282m40l8845p6256J5256j0357l1951M4792O7467k2140
13322C3632o6114m0943o904M2474k1178R608M0958j3258j6135l0101j4551J237
13310h1275O3696r38N2706Q0432N0315k360k7818l278l1442j444M787O42j8041
$$ plain form
13297 85982 122967 173243 155936 126526 129112 156510 174487 102379 57481 105630 133220 146743
13285 146743 155925 151790 166979 153935 150186 135611 153016 134719 123091 75647 57593 -5443
13273 -5443 1422 34584 95784 92946 82889 76369 67599 21287 38381 57656 22201 -55685 -42093
13260 -42093 -8593 -8094 12383 39935 4717 -19984 -64439 -78294 -27757 12762 15836 -23360
13248 -23360 -28701 -117 39409 56132 50574 67659 72451 69943 106927 70006 79276 34854 -15203
13235 -15203 -18672 -30463 -69861 -112129 -101505 -51435 25836 43964 22862 35445 35760 21626
13223 21626 -2863 13762 82534 53031 34133 39330 35598 -14362 -12186 37168 45117 38282 22556
13210 22556 9754 -39076 -54139 -26800 28295 12712 -63669 -72018 -48470 -44976 -5958 53031
$$ packed form
13297H5982L6985N0276j7307k9410K586K7398J7977p2108m4898M8149K7590J3523
13285A46743R182m135J5189j3044l749j4575J7405j8297j1628m7444j8054o3036
13273e443O865L3162O1200k838j0057o520q770m6312J7094J9275l5455p7886J3592
13260d2093L3500M99K0477K7552l5218k4701m4455j3855N0537M0519L074l9196
13248b3360n341K8584L9526J6723n558J7085M792k508L6984l6921R270m4422n0057
13235a5203l469j1791l9398m2268J0624N0070P7271J8128k1102J2583L15j4134
13223B1626k4489J6625O8772k9503j8898N197l732m9960K176M9354P949o835j5726
13210B2556j2802m8830j5063K7339N5095j5583p6381q349K3548L494L9018N8989
$$ plain form
13198 53031 67504 38187 48056 13727 12836 7000 -12169 -26791 -16840 -46918 3711 52240 67408
13185 67408 47242 17188 14771 -26764 -50720 -69082 -51598 -55775 -90912 -55591 -35625 -12298
$$ packed form
13198E3031J4473k9317R869l4329q91n836j9169j4622R951l0078N0629M8529J5168
13185F7408k0166l0054k417m1535k3956j8362J7484m177l5137L5321J9966K3327
$$ [...]
##END NTUPLES=NMR SPECTRUM
##END=
