##TITLE=Analysis number 313640
Compound Code cc 34409
Book Reference 451/39
Project Code adrs
Chemist Name eva
##JCAMPDX= 6.0         $$ Bruker NMR JCAMP-DX V2.0
##DATA TYPE= NMR SPECTRUM
##DATA CLASS= NTUPLES
##ORIGIN= Bruker BioSpin GmbH
##OWNER= NMR
$$ XWIN-NMR		Version 3.5
$$ Thu Sep 15 12:25:12 2005 GMT Daylight Time (UT+1h)  MAYBRIDGE\NMR@NMR_250MHZ
##.OBSERVE FREQUENCY= 250.131544655141
##.OBSERVE NUCLEUS= ^1H
##.ACQUISITION MODE= SIMULTANEOUS (DQD)
##.ACQUISITION SCHEME= undefined
##.AVERAGES= 16
##.DIGITISER RES= 18
##SPECTROMETER/DATA SYSTEM= dpx250
##.PULSE SEQUENCE= zg30
##.SOLVENT NAME= CDCl3
##.SHIFT REFERENCE= (INTERNAL, CDCl3, 0, 16.522)
##AUDIT TRAIL= $$ (NUMBER, WHEN, WHO, WHERE, WHAT)
$$ ##TITLE= Audit trail, XWIN-NMR		Version 3.5
$$ ##JCAMPDX= 5.01
$$ ##ORIGIN= Bruker BioSpin GmbH
$$ ##OWNER= NMR
$$ C:\u/data/dgb/nmr/ADRS/9520/pdata/1/auditp.txt
$$ ##AUDIT TRAIL=  $$ (NUMBER, WHEN, WHO, WHERE, WHAT)
(   1,<2005-09-15 12:24:53.28 +100>,<MAYBRIDGE\NMR>,<NMR_250MHZ>,
      <created by zg, POWCHK disabled, PULCHK disabled
       configuration hash MD5:
       62 19 C7 07 E1 42 D1 B7 37 6C 3D D0 77 39 F9 E6
       data hash MD5: 64K
       70 E2 2B F6 DE EF C9 B0 DB 94 6F 06 CE 27 C0 56>)
(   2,<2005-09-15 12:25:04.96 +100>,<MAYBRIDGE\NMR>,<NMR_250MHZ>,
      <Start of raw data processing
       ef LB = 0.3 FT_mod = 6 PKNL = 1 SI = 32K 
       data hash MD5: 32K
       CD 54 5F DD 51 AA D2 BB 82 BD D4 62 D8 A4 A6 83>)
(   3,<2005-09-15 12:25:06.67 +100>,<MAYBRIDGE\NMR>,<NMR_250MHZ>,
      <apk 
       data hash MD5: 32K
       9F 9D 3C 9E 3B 26 49 F4 18 7D F0 78 03 04 E8 0C>)
(   4,<2005-09-15 12:25:07.42 +100>,<MAYBRIDGE\NMR>,<NMR_250MHZ>,
      <abs ABSG = 5 
       data hash MD5: 32K
       BA 2E 21 DA 9F 33 9C 4E 9A E3 A6 3D F1 D6 C4 41>)
$$ ##END=
$$ 
$$ hash MD5
$$ 58 5C A0 8E F3 7C 79 85 F5 5E 69 15 7E 97 6F 8E
##$RELAX= 
##$RELAX= 
##$RELAX= 
##$RELAX= 
##$RELAX= 
##$RELAX= 
##$RELAX= 
$$ Bruker specific parameters
$$ --------------------------
##$DU= <C:\u>
##$EXPNO= 9520
##$NAME= <ADRS>
##$PROCNO= 1
##$TYPE= <nmr>
##$USER= <dgb>
##$AMP= (0..31)
100 100 100 100 100 100 100 100 100 100 100 100 100 100 100 100 100 100 
100 100 100 100 100 100 100 100 100 100 100 100 100 100 
##$AQSEQ= 0
##$AQ_mod= 3
##$AUNM= <au_zg>
##$AUTOPOS= <17 >
##$BF1= 250.13
##$BF2= 250.13
##$BF3= 250.13
##$BF4= 250.13
##$BF5= 500.13
##$BF6= 500.13
##$BF7= 500.13
##$BF8= 500.13
##$BYTORDA= 1
##$CFDGTYP= 0
##$CFRGTYP= 5
##$CHEMSTR= <none>
##$CNST= (0..31)
1 1 145 1 1 1 1 1 1 1 1 1 1 1 1 1 1 1 1 1 1 1 1 1 1 1 1 1 1 1 1 1 
##$CPDPRG= <>
##$CPDPRG1= <>
##$CPDPRG2= <>
##$CPDPRG3= <>
##$CPDPRG4= <mlev>
##$CPDPRG5= <mlev>
##$CPDPRG6= <mlev>
##$CPDPRG7= <mlev>
##$CPDPRG8= <mlev>
##$CPDPRGB= <>
##$CPDPRGT= <>
##$D= (0..31)
0 1 0 0 0 0 0 0 0 0.06 0 0 0 0 0 0 0.0002 0 0 0 0 0 0 0 0 0 0 0 0 0 0 
0 
##$DATE= 1126783492
##$DBL= (0..7)
120 120 120 120 120 120 120 120 
##$DBP= (0..7)
150 150 150 150 150 150 150 150 
##$DBP07= 0
##$DBPNAM0= <>
##$DBPNAM1= <>
$$ [...]
##$SUBNAM6= <"">
##$SUBNAM7= <"">
##$SUBNAM8= <"">
##$SUBNAM9= <"">
##$SW= 20.6930455092707
##$SWIBOX= (0..15)
0 0 3 0 0 0 0 0 0 0 0 0 0 0 0 0 
##$SW_h= 5175.983436853
##$TD= 65536
##$TD0= 1
##$TE= 295.16
##$TE2= 300
##$TE3= 300
##$TEG= 300
##$TL= (0..7)
0 120 120 120 120 120 120 120 
##$TP= (0..7)
150 150 150 150 150 150 150 150 
##$TP07= 0
##$TPNAME0= <>
##$TPNAME1= <>
##$TPNAME2= <>
##$TPNAME3= <>
##$TPNAME4= <>
##$TPNAME5= <>
##$TPNAME6= <>
##$TPNAME7= <>
##$TPOAL= (0..7)
0.5 0.5 0.5 0.5 0.5 0.5 0.5 0.5 
##$TPOFFS= (0..7)
0 0 0 0 0 0 0 0 
##$TUNHIN= 0
##$TUNHOUT= 0
##$TUNXOUT= 0
##$USERA1= <user>
##$USERA2= <user>
##$USERA3= <user>
##$USERA4= <user>
##$USERA5= <user>
##$V9= 5
##$VALIST= <valist>
##$VCLIST= <CCCCCCCCCCCCCCC>
##$VD= 0
##$VDLIST= <DDDDDDDDDDDDDDD>
##$VPLIST= <PPPPPPPPPPPPPPP>
##$VTLIST= <TTTTTTTTTTTTTTT>
##$WBST= 1024
##$WBSW= 4
##$XGAIN= (0..3)
0 0 0 0 
##$XL= 0
##$YL= 0
##$YMAX_a= 360753
##$YMIN_a= -370371
##$ZGOPTNS= <>
##$ZL1= 120
##$ZL2= 120
##$ZL3= 120
##$ZL4= 120
##$ABSF1= 16.522
##$ABSF2= -4.171173
##$ABSG= 5
##$ABSL= 3
##$ALPHA= 0
##$AQORDER= 0
##$ASSFAC= 0
##$ASSFACI= 0
##$ASSFACX= 0
##$ASSWID= 0
##$AUNMP= <proc_1d>
##$AZFE= 0.1
##$AZFW= 0.1
##$BCFW= 0
##$BC_mod= 0
##$BYTORDP= 0
##$COROFFS= 0
##$CY= 12.5
##$DATMOD= 1
##$DC= 0
##$DFILT= <>
##$DTYPP= 0
##$F1P= 14.0000005364418
##$F2P= -0.99999901652339
##$FCOR= 0.5
##$FTSIZE= 32768
##$FT_mod= 6
##$GAMMA= 0
##$GB= 0
##$INTBC= 1
##$INTSCL= 1
##$ISEN= 128
##$LB= 0.3
##$LEV0= 0
##$LPBIN= 0
##$MAXI= 10000
##$MC2= 0
##$MEAN= 0
##$ME_mod= 0
##$MI= 0
##$NCOEF= 0
##$NC_proc= -5
##$NLEV= 6
##$NOISF1= 0
##$NOISF2= 0
##$NSP= 0
##$NTH_PI= 0
##$NZP= 0
##$OFFSET= 16.522
##$PC= 1
##$PHC0= -82.72395
##$PHC1= 8.527
##$PH_mod= 1
##$PKNL= yes
##$PPARMOD= 0
##$PSCAL= 4
##$PSIGN= 0
##$REVERSE= no
##$SF= 250.13
##$SI= 32768
##$SIGF1= 0
##$SIGF2= 0
##$SINO= 400
##$SIOLD= 32768
##$SREGLST= <1H.CDCl3>
##$SSB= 0
##$STSI= 32768
##$STSR= 0
##$SW_p= 5175.98343685301
##$SYMM= 0
##$S_DEV= 0
##$TDeff= 65536
##$TDoff= 0
##$TI= <Analysis number 999999
Compound Code 99
Book Reference 9
Project Code 9>
##$TILT= no
##$TM1= 0
##$TM2= 0
##$TOPLEV= 0
##$USERP1= <user>
##$USERP2= <user>
##$USERP3= <user>
##$USERP4= <user>
##$USERP5= <user>
##$WDW= 1
##$XDIM= 32768
##$YMAX_p= 447242563
##$YMIN_p= -449920
$$ End of Bruker specific parameters
$$ ---------------------------------
##NTUPLES= NMR SPECTRUM
##VAR_NAME=  FREQUENCY,     SPECTRUM/REAL,   SPECTRUM/IMAG
##SYMBOL=    X,             R,               I
##VAR_TYPE=  INDEPENDENT,   DEPENDENT,       DEPENDENT
##VAR_FORM=  AFFN,          ASDF,            ASDF
##VAR_DIM=   32768,         32768,           32768
##UNITS=     HZ,            ARBITRARY UNITS, ARBITRARY UNITS
##FACTOR=    0.157963299565203, 1,           1
##FIRST=     4132.6476996994, 0,             0
##LAST=      -1043.33573715361, 0,           0
##MIN=       -1043.33573715361, -449920,     0
##MAX=       4132.6476996994, 447242563,     0
$$ Real data points
##PAGE= N=1
##DATA TABLE= (X++(R..R)), XYDATA
$$ [...]
19136D56259M7166N240k2059K8309R8950o3370r259j29658q3835j38131M4532
19125B34144N8187J23766R1725q743l9263N4644P4914K3192j81941j10695k60
19114C19670L6786N5381p0915K8797J51917Q5954l8518J4764q366k9775L0180
19103E75875j6175k4170k567q2685r3093j4381J2493J27805J10755K7476P2999
19092F94332O1078J24757J79230K16301L13199K03208J05107l9900P7265J7370
19082A951947m0599j85989j25183l8046P2982R7068Q9536R8861n4524q8741N437
19071A782749n7926j84201k23636j06686k19550k32469l7773j8040M3334K1170
19061G66972r9720j5708j3707j18053R3223R9314r9624n0931k4357L4917K2265
$$ y = [456259, 503425, 508665, 486606, 514915, 613865, 550495, 541236, 411578, 327743, 189612, 234144, 292331, 416097, 507822, 499079, 459816, 514460, 589374, 612566, 430625, 319930, 319670, 356456, 411837, 340922, 369719, 521636, 607590, 569072, 583836, 575470, 545695, 575875, 559700, 535530, 532963, 450278, 357185, 342804, 355297, 483102, 593857, 621333, 694332, 755410, 880167, 1059397, 1275698, 1588897, 1792105, 1897212, 1857312, 1934577, 1951947, 1911348, 1725359, 1600176, 1562130, 1635112, 1732180, 1821716, 1920577, 1866053, 1777312, 1782749, 1724823, 1540622, 1316986, 1210300, 990750, 758281, 720508, 702468, 745802, 766972, 667252, 651544, 637837, 519784, 613007, 712321, 612697, 561766, 537409, 572326, 594591]
19050E94591p6265m6854N433j33713J1401J25104l3476K5522R146Q8874o7550
19039E02213M1687J06141k0263M1498o1121L6920L8127k879L0501j4520L2601
19028G30905N1605k5527j0417L9043j521j44070L9425R2628N1759J17999m9482
19017H92347j06234M6750P3827N3237l380k5200j4851n7673j42155j80003n1651
19006D85014L1826J95422P5826k8815p3497k5532J68664N7691j12552K306R2995
18995H69348m880o8170o9218L6115J68936q6758L7301p9364l7943J12872K6135
18984I04374p6554L1289K4338l8971l9000K4738K8305J226l1123Q352q7016j03887
18972F46071K0732J15590k95m4429j07409q8885P560R87N311O5840n674L6446
$$ y = [594591, 518326, 471472, 476905, 343192, 354593, 479697, 446221, 471743, 480889, 569763, 502213, 543900, 650041, 629778, 671276, 610155, 647075, 685202, 682323, 712824, 698304, 730905, 782510, 756983, 746566, 785609, 784088, 640018, 679443, 772071, 823830, 941829, 892347, 786113, 832863, 906690, 959927, 956547, 931347, 916496, 858823, 716668, 536665, 485014, 516840, 712262, 788088, 759273, 685776, 660244, 828908, 886599, 774047, 776353, 869348, 864468, 796298, 727080, 763195, 932131, 845373, 882674, 803310, 765367, 878239, 904374, 827820, 859109, 883447, 844476, 805476, 830214, 858519, 859745, 828622, 836974, 749958, 646071, 666803, 782393, 782098, 737669, 630260, 541375, 548935, 549922, 555233, 621073, 615399, 651845]
18960F51845J1580o413j05590k4088J24529Q6871q18o2458J112K1167L364J6607
18948G17708L9297n0963j179O3517l7567m7425M3367l4970j5174o1998p1272j6503
18936E26838M1662O6712l7136O9749j5363n2835L4526J07427K1292J03501R2011
18925I58384k2673o3093K9016j8138l3834P137K1603j10548j38499J1877O3335
18914G04567N3995p5483L6697L3044l7841m0541L3702N2217M9026J35809L4393
18903I79585L2664Q5989L4060J04967N0306m3700k00907M8631j08442k3074K1133
18892I81212J2935r739n3434p7706m8132J07681J59195j1548m7288L3776l7829
18881A009123m2013K2806l6683n5168P4613J47397J10596P0284l4285L8137P6522
$$ y = [651845, 663425, 657012, 551422, 527334, 651863, 738734, 737916, 675458, 676570, 697737, 701101, 717708, 757005, 706042, 704863, 768380, 730813, 683388, 726755, 691785, 676611, 614613, 543341, 526838, 568500, 635212, 598076, 667825, 652462, 599627, 634153, 741580, 762872, 866373, 958384, 935711, 872618, 901634, 883496, 849662, 856799, 878402, 767854, 629355, 641232, 704567, 758562, 683079, 719776, 752820, 714979, 674438, 708140, 760357, 809383, 945192, 979585, 1012249, 1098238, 1132298, 1237265, 1287571, 1243871, 1042964, 1091595, 983153, 960079, 981212, 994147, 984408, 930974, 853268, 805136, 912817, 1072012, 1060464, 1013176, 1046952, 1009123, 967110, 989916, 953233, 898065, 972678, 1120075, 1230671, 1300955, 1266670, 1304807, 1381329]
18870A381329P3530m7506L9179J24790n0492R098O5794q8227O1228J57280R518
18859A735521r2619m6191M7438J42413J21600R1225O1082l8234J2567k0050L8696
18848B053448O7047P4737P3018J1738k4096k9572J9020P6689k3967Q8064J31187
18837B517313K4264L4214J87094J69799R9777K81404J26830o7607R853O4964K37294
18826C685199J98380J57060J06470J37680K37972L10951K38396L05114K85079
18817E662301L28645L28334K05310M36516O48270Q92982J051121J023146J028780
18808A1605405R39399J020707J032940J220021J390275J736482K342518L545708
18800B4833455N195509P044827Q421452Q838412P635929M673440J390203l23530
$$ y = [1381329, 1454859, 1407353, 1446532, 1571322, 1520830, 1529928, 1595722, 1507495, 1568723, 1726003, 1735521, 1642902, 1596711, 1644149, 1786562, 1908162, 1999387, 2060469, 2022235, 2034802, 2014752, 2053448, 2120495, 2195232, 2268250, 2279988, 2255892, 2226320, 2245340, 2322029, 2298062, 2386126, 2517313, 2541577, 2575791, 2762885, 2932684, 3032461, 3313865, 3440695, 3373088, 3382941, 3447905, 3685199, 3883579, 4040639, 4147109, 4284789, 4522761, 4833712, 5072108, 5377222, 5662301, 5990946, 6319280, 6524590, 6961106, 7609376, 8502358, 9553479, 10576625, 11605405, 12544804, 13565511, 14598451, 15818472, 17208747, 18945229, 21287747, 24833455, 30028964, 37073791, 45495243, 54333655, 61969584, 66643024, 68033227, 67709697]
18792F7709697M50236L650690R496428J8699419L1968454M6632864N6309386N6242967
18784B91160141M1808772J6982536o809958k3444350l4302308m0047605m0201479
18777B05145749l5086564k5309011j2937079k155519L698651K967745l463521
18770A32860451j1566757j7494340j9024752j6726544j2820721r025533o147579
18763D0054225m098092k857374k013218j294952p65601k11573o5031K02637K17972
18754B9168993M46609P65639J360103K188148L505188N585412Q615319J2856074
18746F4491485J7787370K1849945K2399480J7749612Q000785k201767q069776
18739A42007134p535846R1484J3458692K9082802M3776664N5233384O0216233
$$ y = [67709697, 68159933, 71810623, 81307051, 100006470, 131974924, 178607788, 234917174, 291160141, 332968913, 349951449, 343141491, 319697141, 285394833, 245347228, 205145749, 170059185, 144750174, 131813095, 129657576, 133356227, 136323972, 132860451, 121293694, 103799354, 84774602, 68048058, 55227337, 46201804, 40054225, 35956133, 33098759, 31085541, 29790589, 29024988, 28813415, 28748384, 28951021, 29168993, 29615602, 30381241, 31741344, 33929492, 37434680, 43020092, 51635411, 64491485, 82278855, 104128800, 126528280, 144277892, 152278677, 150076910, 142007134, 134471288, 134562772, 148021464, 177104266, 220880930, 276114314, 336330547]
18732C36330547N5085633M0555503J5270880j9834597n1751596o9192067p0535514
18725B35928789n8908481m1956153k6366126j4360519o377002k207727j801454
18718H3951327m697332q373825j0690802j1048303r877270p632847n674480m196886
18710B1759582k915039k274927j703642j267833j103407j016305q84337j165037
18702I429055r08470q41370p62601n43665n04019m88405m59807l53771k03919
18693D363028k54548l45348k17527j37044j36277r0247j75718j91531j06885o3452
18683B644451j99869m3661l4140j28268n3481j15039j34767j11602k6901J1800
18673A808523l8551q2448M6803q417O6142n2924J4076P305j01148k62654k8707
$$ y = [336330547, 391416180, 431971683, 447242563, 427407966, 375656370, 306464303, 235928789, 177020308, 135064155, 108698029, 94337510, 87960508, 85752781, 83951327, 79253995, 70880170, 60189368, 49141065, 39263795, 31630948, 25956468, 21759582, 18844543, 16569616, 14865974, 13598141, 12494734, 11478429, 10594092, 9429055, 8520585, 7679215, 6916614, 6372949, 5868930, 5380525, 4920718, 4566947, 4363028, 4108480, 3763132, 3545605, 3408561, 3272284, 3182037, 3006319, 2814788, 2707903, 2644451, 2444582, 2400921, 2366781, 2238513, 2185032, 2069993, 1935226, 1823624, 1796723, 1808523, 1769972, 1687524, 1734327, 1725910, 1792052, 1739128, 1753204, 1760509, 1659361, 1396707, 1368000]
18662A368000L2145n33P4562J20236l5235m0605L5778j54994j81082k47450K0127
18651I90949M834j02487K9583J26888K0882j49744J5736K60l7595o1841J15064
18640I52529K2256q662j47220j64057P1638P7314R88p805m4998j7530k3896N9935
18628G70492m6077k4375q2407K2853p8245J07544L4957q1454P0999K21992J22899
18617A039178j06283p8021k06907j37701K22092J55366L427M5661J21047M3025
18607A100884N971j1107L7546L7019r8140k7396J22595j02028j19503Q1765K9178
18596A056784n5864l8464J4731m2572r8580m7678O9040J94455m1995r4382n4520
18585H60955k7801N4167k328M9276O0068O0083R3477k5266p2292q8680K8405K6323
$$ y = [1368000, 1400145, 1399612, 1474174, 1594410, 1559175, 1518570, 1554348, 1399354, 1218272, 970822, 990949, 995783, 893296, 922879, 1049767, 1070649, 920905, 936641, 936901, 899306, 837465, 952529, 974785, 966123, 818903, 654846, 726484, 803798, 804786, 796981, 751983, 734453, 710557, 770492, 724415, 700040, 617633, 640486, 562241, 669785, 704742, 623288, 694287, 916279, 1039178, 932895, 854874, 647967, 510266, 732358, 887724, 891151, 936812, 1057859, 1100884, 1106855, 1095748, 1133294, 1170313, 1072173, 1044777, 1167372, 1065344, 945841, 1027606, 1056784, 1000920, 962456, 977187, 934615, 836035, 788357, 857397, 1051852, 1009857, 915475, 860955, 833154, 887321, 884993, 934269, 994337, 1054420, 1147897, 1122631, 1050339, 961659, 990064, 1016387]
18573A016387j1321k25789o4355M0333K12818l7658J9705L4262j649J1607j4884
18562I79456K4301J43967M797j40480k0056J08385j461j00689N5950J02740k4100
18551A132810j3186k776p7716r2234o8854K8425N911j44587R0123J51832o2694
18540I47054j65285p7201Q9604O3719J56007Q0033Q1404o8097k6856J11794K04274
18529A396450r031q0265n2758R2448R2251m7207l7659q8704J01555J26602q061
18518A485621m976N050q7014k4531j13071P8994R2121l3291l3529O5335P7152
18507A507861P7861o5128K5542Q2941o600P3996P8451J86788K6444P7620J35006
18496B200782Q1899J24010J42368K89505L53935M25163K05757J08817J20915L26336
$$ y = [1016387, 1005066, 779277, 714922, 755255, 968073, 930415, 950120, 984382, 982733, 994340, 979456, 1003757, 1147724, 1152521, 1012041, 991985, 1100370, 1098909, 998220, 1054170, 1156910, 1132810, 1119624, 1116848, 1039132, 946898, 878044, 906469, 912380, 767793, 857916, 1009748, 947054, 781769, 704568, 794172, 857891, 1013898, 1093931, 1175335, 1107238, 1080382, 1192176, 1396450, 1387419, 1307154, 1254396, 1346844, 1439095, 1391888, 1354229, 1265525, 1367080, 1493682, 1485621, 1480645, 1485695, 1398681, 1374150, 1261079, 1340073, 1432194, 1398903, 1365374, 1430709, 1507861, 1585722, 1520594, 1546136, 1629077, 1622477, 1696473, 1774924, 1961712, 1988156, 2065776, 2200782, 2282681, 2406691, 2549059, 2838564, 3192499, 3617662, 3823419, 3932236, 4053151, 4379487]
18486D379487K39814P5085j44753q6938J62488N30993M57166L21758K32100K57450
18476F424650L33636M45002N55744O20259N98347O22036P33499Q77129J081695
18467A2291997J225917J401257J505854J621770J795955J901174K262792K782400
18459B6789116L517776M453150N923056Q372460J3029385K1673986L5546680M8933319
18451A68238928M4894773J8859161m232546k305641J4384038J6089430o687639
18444B49240504k9604644l0023923j0179195J6649051L2486023K1461123m788517
18437B45240422j5442285k342586J0781391j566405l0178098m7268430m4226562
18430A14997447l2183884k1406569j4201236r850903p153022n181470l857290
$$ y = [4379487, 4619301, 4694386, 4549633, 4462695, 4625183, 5156176, 5613342, 5935100, 6167200, 6424650, 6758286, 7203288, 7759032, 8379291, 8977638, 9599674, 10333173, 11210302, 12291997, 13517914, 14919171, 16425025, 18046795, 19842750, 21743924, 24006716, 26789116, 30306892, 34760042, 40683098, 49055558, 62084943, 83758929, 119305609, 168238928, 213133701, 231992862, 227760316, 225454675, 239838713, 255928143, 249240504, 219635860, 189611937, 179432742, 196081793, 228567816, 250028939, 245240422, 229798137, 227455551, 238236942, 236670537, 206492439, 159224009, 114997447, 82813563, 61406994, 47205758, 37354855, 30201833, 25020363, 21163073]
18423B1163073k978646k308334j662168j401290j164688q54738o32790o74984
18415I485435q37806n48552l48236n14957o61594n52873k63710l4018j05709j83003
18405E434977k23098r4389k3965r8100k09355k16623k41127o9721J5720l5680
18395D238639R5196N779m2372Q2272n4337k21063k95806j91577k13558k35249
18385C167924q240P006r1693k4766L4956Q500M3385K8328L1441O4429P3007j0978
18373C323299J10692J48549J53535R8424K43274Q8335K16625L12211J77135J84887
18363E056966J47764K54564L76271L55841M39275N02119N68985N90489Q73430
18354I165704J031997J018124J098178J150017J157424J138483J096861J398333
$$ y = [21163073, 18184427, 15876093, 14213925, 12812635, 11647947, 10793209, 10160419, 9485435, 8647629, 8099077, 7750841, 7235884, 6574290, 6021417, 5757707, 5723689, 5617980, 5434977, 5211879, 5117490, 5093525, 4995425, 4786070, 4569447, 4328320, 4258599, 4274319, 4238639, 4333835, 4339614, 4297242, 4379514, 4325177, 4104114, 3808308, 3616731, 3403173, 3167924, 3159684, 3166690, 3074997, 3050231, 3085187, 3093687, 3137072, 3165400, 3196841, 3261270, 3334277, 3323299, 3433991, 3582540, 3736075, 3834499, 4077773, 4166108, 4382733, 4694944, 4872079, 5056966, 5204730, 5459294, 5835565, 6191406, 6630681, 7132800, 7701785, 8292274, 9165704, 10197701, 11215825, 12314003, 13464020, 14621444, 15759927, 16856788, 18255121]
18346A8255121J734180K168101L038255M386092O030677P341372P030322O323961
18338E6308081P501066R483363P861465M493959M925063R944579J7497884K7397770
18330A45413230L6114949L3386403K9232339M1336291N3881327L1193254n637909
18323C64919884j2256580m381836j8965025m0667698m2002294l0700628k4052019
18316A91893804k2495430j9284926j1154393l246427m064048j1188799j3976971
18309A06482810j1360433j0255511j2247529j2752804j0700356p798008n495086
18302C5873083l534639k131337j299811p59158k07724K77557L39567N44631R22485
18293C0024654J610401K613485M385403O765548R666909J1688213J0454700R008940
$$ y = [18255121, 19989301, 22157402, 25195657, 29581749, 35612426, 42953798, 49984120, 56308081, 63809147, 73292510, 81153975, 85647934, 90572997, 100517576, 118015460, 145413230, 181528179, 214914582, 244146921, 285483212, 339364539, 370557793, 364919884, 352663304, 348281468, 329316443, 288648745, 246646451, 215945823, 191893804, 169398374, 150113448, 138959055, 135712628, 131648580, 120459781, 106482810, 95122377, 84866866, 72619337, 59866533, 49166177, 41368169, 35873083, 32338444, 30207107, 28907296, 28148138, 27940414, 28217971, 28557538, 29102169, 30024654, 31635055, 34248540, 38633943, 45399491, 55066400, 66754613, 77209313, 86218253]
18285H6218253J1143777J3633445R438463L264174M280745J1377781J5057115
18278A54413753J2762913J6382813L0282213L6078784J7675591L074070J2502754
18271B83172891J7978402q933378l5692465l5321006k5750859k7309493l1402038
18264A36742054k8010210k1087515j4462429q519235m097804l567761n537187
18257E1459913o112903m879578m761017n486772n336096m267618l117929k297390
18249A5200610j878191j427530j075122r67076r80841q67670p85878q95515o54324
18240E668463m46438m29734n22783m50967k76222j73559j69816j12848j23481
18231B962615q5060n7016k91728k27300j56485j00959q4723R9884k6782j85256
$$ y = [86218253, 97362030, 110995475, 120433938, 123698112, 127978857, 139356638, 154413753, 167176666, 183559479, 213841692, 249920476, 267596067, 270670137, 283172891, 301151293, 292217915, 256525450, 221204444, 195453585, 168144092, 136742054, 108731844, 87644329, 73181900, 64662665, 60564861, 56997100, 51459913, 45347010, 40467432, 35706415, 30219643, 24883547, 20615929, 17498000, 15200610, 13322419, 11894889, 10819767, 9852691, 8871850, 8004180, 7218302, 6322787, 5668463, 5222025, 4792291, 4269508, 3818541, 3542319, 3368760, 3198944, 3086096, 2962615, 2877555, 2820539, 2528811, 2301511, 2145026, 2044067, 1959344, 2059228, 2032446, 1847190]
18221A847190j11317l3610j01537K147l3156l767k685P6481J50637p0365j43796
18210A576222k1447k7467j62650j36662J3377J2982j32844M2957J75205m9345
18200A290328j23414l4306j3922l4991L866j50258j00821j05971j3480n0943n2477
18189F13611l3713L0037J56342M2614q1746r8572K5501Q9660N2693r2564n4309
18178F49554q5636M6967k0333j48481m7893J38126p6414q9641p0048r572J65739
18167D52368J17763j01138L5130o9999J2036J13854J43762J0662l346J5140L2746
18156G58978l5405o8806p2273L9420J16671N857N7601J13621J36172k7570P420
18145A031686J03863L9597j3633J38440K76302M2909j2983l5396Q9065K51313
$$ y = [1847190, 1735873, 1702263, 1600726, 1602873, 1569717, 1565950, 1563265, 1639746, 1790383, 1720018, 1576222, 1554775, 1527308, 1364658, 1227996, 1241373, 1254355, 1121511, 1164468, 1339673, 1290328, 1166914, 1132608, 1118686, 1083695, 1087561, 937303, 836482, 730511, 717031, 666088, 613611, 579898, 609935, 766277, 808891, 727145, 628573, 654074, 743734, 796427, 703863, 649554, 563918, 610885, 590552, 442071, 394178, 532304, 455890, 366249, 296201, 286629, 452368, 570131, 468993, 504123, 434124, 446160, 560014, 703776, 714438, 711092, 726232, 758978, 723573, 654767, 582494, 621914, 738585, 744442, 802043, 915664, 1051836, 1024266, 1031686, 1135549, 1175146, 1161513, 1299953, 1576255, 1619164, 1606181, 1570785, 1659850, 1911163]
18135A911163J91050O6961R0451J31566J55983J45988K19938K89212L80907L96737
18125C979956M69289O09543R37783J120237J363487J394120J152030R29881J128794
18116A3085120J503970K261137L505386N348756Q566329J4596638K7033555N0417752
18108A26318643O9037063K6523056l7415234n6566877m3562464k7462881j6670414
18101D0200892j0570330p218183n231365l748328k661404j950286j424577j146586
18093F249833r59217p86960o79993n83498m21672k89768j89677k15517j96923
18084A926608m21741l18581j81096q4816m901j50737q1927O1786J34412j1209
18074H67798j19967j23777l7715K8992j13003l7568P2479k4796J15926K7360j32821
$$ y = [1911163, 2102213, 2169174, 2259625, 2391191, 2547174, 2693162, 2913100, 3202312, 3583219, 3979956, 4449245, 5058788, 5996571, 7116808, 8480295, 9874415, 11026445, 11956326, 13085120, 14589090, 16850227, 20355613, 25704369, 34270698, 48867336, 75900891, 126318643, 195355706, 221878762, 184463528, 127896651, 84334187, 56871306, 40200892, 29630562, 22412379, 17181014, 13432686, 10771282, 8820996, 7396419, 6249833, 5290616, 4503656, 3823663, 3240165, 2818493, 2528725, 2339048, 2123531, 1926608, 1504867, 1186286, 1005190, 920374, 915473, 764736, 682809, 744595, 879007, 867798, 747831, 624054, 586339, 615331, 502328, 464760, 537239, 512443, 628369, 655729, 522908]
18063E22908j13766j63128r9397J26838J46198n066k1932K2496p3847o5709Q7368
18052C62963p2426j8060k5296l5164l4440r0535O407O0035L686j35867j41891
18041a20588j354k0308p592p0077L9063K6474L1542N2597P2071r5675p8468q261
18029a80576Q1711P1359K1385j24669o7350K8706M9011L5746j06171k4556J19028
18018i6376n9499o5572Q6755J82727K6892p8097Q7619R1152Q693O470j02939o4292
18006B3533N2300l8267l8464n9194R224P0267M7840O7184P6154r933j39822q3497
17994b2675J9852p3446o2623m8104k5213j5197M7644L9119N4911J17102j7300
17983A4070L0556P3894l3597o6743j00036P022m2283R5290Q6901L3816m4126o1985
$$ y = [522908, 409142, 246014, 146617, 273455, 419653, 414587, 392655, 415151, 341304, 275595, 362963, 290537, 272477, 247181, 212017, 177577, 87042, 93449, 153484, 157170, 21303, -120588, -121942, -142250, -149842, -219919, -180856, -154382, -122840, -70243, 1828, -93847, -172315, -180576, -98865, -27506, -6121, -130790, -198140, -169434, -120423, -84677, -190848, -215404, -96376, -155875, -221447, -134692, 48035, 74927, -3170, 84449, 175601, 184294, 190764, 87825, 23533, 75833, 37566, -898, -60092, -50868, 19399, 67239, 134423, 210577, 200644, 60822, -22675, -2823, -76269, -138892, -186996, -212209, -227406, -179762, -140643, -85732, 31370, 14070, 44626, 118520, 84923, 18180, -81856, -74834, -117117, -21827, 65074, 98890, 54764, -7221]
17971g221j03754j12579J3040J28198J88677Q5238n2550m0554n4950n7358n3351
17960f7164l174m9728N4437q4072P2870Q1793r4888j2677Q7544m4301o6752k8781
17948a54893j02905J06884J11464j2065j09614k6116P6995n8070N891P2863N7243
17937c2323J03971o4876j12748j41369o6442J35830J42060j9360M530R6844l3031
17926A3086r974j12658r2466R1413M2224J44989J17164N9814L76q2212j79229
17915g473j15373j6201L85j19823q83Q6499o4414j16104o0979P3935J82661p3963
17903b31733r1604J24573P5034O320l5778j5723O7941Q2895O2166m4372j0686
17892a0967M5549K5201n645n1256j48901N48J40982O1479J4465k5746j27161k6687
$$ y = [-7221, -110975, -223554, -210514, -82316, 106361, 191599, 139049, 98495, 43545, -13813, -67164, -70338, -120066, -65629, -149701, -76831, 4962, -89926, -102603, -15059, -59360, -126112, -154893, -257798, -150914, -39450, -51515, -161129, -187245, -110250, -168320, -162429, -89566, -32323, 71648, 6772, -105976, -247345, -313787, -177957, -35897, -55257, -50727, 46117, 13086, 3112, -109546, -202012, -110599, -68375, 76614, 193778, 253592, 253968, 171756, -7473, -122846, -139047, -138662, -258485, -259368, -172869, -237283, -353387, -414366, -340431, -157770, -231733, -323337, -198764, -123730, -117410, -153188, -168911, -100970, -18075, 44091, -281, -10967, 34582, 59783, 54138, 2882, -146019, -145471, -4489, 56990, 71455, 45709, -81452, -108139]
17880a08139N7915J10230K1193j5686Q5652j5805j24312j10095p4334Q0654Q2621
17869a0106R6814n2235K3008N8636Q0315r8496r2593N4746R648n8328K2017j5827
17857A7599K4710N720k5039j2151O6764l5772M0208K9527k574q4218j12188m2167
17845a29581J92241J36332k9327j66492o018K709O6273R3304O769L6912R0675
17834B93797J57637J07015K9069J09823J60044J42354J15317J16963J18915l5530
17824A315404j5598P7319N2023l5702n2091q8026L0825J64042q9178j12114j03070
17813A143834j37377j22185r8976J18434m5641N5711O8392J35756K34794O7794
17803A420536L0863l3260Q5646k4294q7750j02256p292k956N8023O7216O8882
$$ y = [-108139, -50224, 60006, 81199, 65513, 151165, 135360, 11048, -99047, -173381, -92727, -10106, 86708, 34473, 57481, 116117, 196432, 97936, 5343, 60089, 69737, 11409, 33426, 17599, 42309, 48029, 22990, 10839, 77603, 41831, 82039, 111566, 108992, 24774, -87414, -129581, 62660, 198992, 169665, 3173, -2845, -136, 66137, 159441, 166210, 203122, 293797, 451434, 558449, 587518, 697341, 857385, 999739, 1115056, 1232019, 1350934, 1315404, 1299806, 1377125, 1429148, 1393446, 1341355, 1253329, 1284154, 1448196, 1359018, 1246904, 1143834, 1006457, 884272, 785296, 903730, 858089, 913800, 982192, 1117948, 1352742, 1420536, 1451399, 1418139, 1503785, 1479491, 1391741, 1289485, 1282193, 1279237, 1337260, 1404476, 1473358]
17792A473358j91963r3608M0216J09583n773j85429j68631r5341o5279J4417j8315
17781H13235J02239R8016N80K1331O3933K0943M91L7177k4257j80169j73771P0800
17769H50548l401m5708R073J39386R8323m9058p024L7377J00529L1117r0696k00736
17757H69730k46142j27952j55456j22709k5478n525m6818O4748J906r4410k8468
17746H3426J00497O1802j33842j04273l5267o2659O1679k5139n4886k466P4691
17735c6437J16965J16989j00173j03055N1597j7833k2014L205P8900k6304M0815
17724A02655J7555L0560K7712l0125j17481m2343Q7171k4164o1441N4166N0558
17713I4823j5670O0034J17077K85659L27551K60857j1686k8389J6175J10022Q6257
$$ y = [1473358, 1281395, 1187787, 1228003, 1337586, 1331813, 1146384, 977753, 882412, 817133, 831550, 813235, 915474, 1013490, 1014070, 1035401, 1099334, 1120277, 1120768, 1157945, 1133688, 953519, 779748, 850548, 847147, 801439, 810512, 949898, 1048221, 999163, 992139, 1029516, 1130045, 1161162, 1070466, 869730, 623588, 495636, 340180, 217471, 191993, 186468, 139650, 204398, 206304, 111894, 83426, 183923, 245725, 111883, 7610, -27657, -90316, -28637, -53776, -108662, -111128, -36437, 80528, 197517, 97344, -5711, 45886, 28053, 6039, 9244, 88144, 61840, 102655, 120210, 150770, 178482, 148357, 30876, -11467, 75704, 51540, -9901, 44265, 94823, 79153, 139187, 256264, 541923, 869474, 1130331, 1118645, 1090256, 1106431, 1216453, 1302710]
17702A302710j59360k29131k30435j71906o2199o4581o5810p495k0546K4198l9931
17691B75514l3698J50297K25159K04515K30595K24516K0929j52914L608Q6406
17681A234927j01340k82949k16084j07667j19179j26885k5342Q203r1586M860
17671A76958o6644r0432M1546K5934q3769p4079J6557Q4961k7871O3981N2109
17660A19251l4707m2808j6051r2908n4854j0084Q5769J0895O1077k5362K8630
17649B8848K4967q097n6149n7816Q0361L287m6275P022M1317M7668J0349n0834
17637B4648k7161k8933n0725K8913j3494j09640J35420O6114J12624J1338j01135
17626D7969j21350N1255N6184o761p3301q2611j8334O3305M0821M9127R8815m504
$$ y = [1302710, 1143350, 914219, 683784, 511878, 449679, 385098, 319288, 311793, 291247, 315445, 275514, 241816, 392113, 617272, 821787, 1052382, 1276898, 1297827, 1144913, 1148521, 1234927, 1133587, 850638, 634554, 526887, 407708, 280823, 255481, 263684, 172098, 176958, 110314, 19882, 61428, 87362, 3593, -70486, -53929, 31032, 3161, 67142, 119251, 84544, 41736, 25685, -67223, -122077, -132161, -46392, -35497, 25580, 218, 28848, 53815, 45718, -10431, -68247, 12114, 15401, -30874, -23852, 17465, 65133, 75482, 24648, -2513, -31446, -82171, -53258, -66752, -176392, -40972, 25142, 137766, 149104, 47969, -73381, -22126, 34058, 27297, -46004, -128615, -146949, -83644, -42823, 6304, 105119, 100615]
17614A00615m9275L9409P1206J4965j14956j33439J1565J22150k198j14827l3054
17603h7839Q3224J44772J026K5256M4008j57307k383j2582k1505n5425k3600M9552
17591a2803R644l0467n78k0027k2110Q3330o3143j11077o2597O4545Q4504q0316
17579a61095j26080M0171L7195L6095q1060O6893J0387J7360M7946J10743m8297
17568d9742l4610L911N4001j69741l0928N6118J11355j537R526K9684O4636l9210
17556C463m1557l0025N7559L0294J11173L0646m1037N855J0759p7587r1505r7087
17544a29049J9976o6336J9954l5698P1974J17305m0132r1828j3421R6715n430
17533e5970m786k7586O1234O8146k6895j7112k9854j00995j04397M3282L1996
$$ y = [100615, 51340, 90749, 161955, 176920, 61964, -71475, -59910, 62240, 60042, -54785, -87839, -4615, 140157, 141183, 166439, 210447, 53140, 50757, 38175, 16670, -38755, -62355, -12803, -3159, -33626, -34204, -54231, -76341, 6989, -56154, -167231, -229828, -165283, -80779, -161095, -287175, -247004, -209809, -173714, -254774, -187881, -177494, -160134, -112188, -1445, -49742, -84352, -80441, -26440, -196181, -227109, -170991, -59636, -61173, -51647, -21963, 42673, 3463, -38094, -68119, -10560, 19734, 130907, 161553, 120516, 126371, 137130, 59543, -31962, -129049, -109073, -175409, -155455, -191153, -119179, -1874, -42006, -133834, -147255, -50540, -55970, -60756, -88342, -27108, 41038, 14143, -2969, -32823, -133818, -238215, -194933, -162937]
17522a62937m455J2831q8896J7710O750N2702O2154R3950J26733J50710l5457
17511B31795j62392j40990j21318J78556J50284K4199K9447l4944j10112j04804
17501f0279k167K33490P3393j15590k0360p6453k8486R2054J6340k32177k33530
17490c53765J27723Q7212R0662J15848L4491j5660J47040J00192J2552j38438
17480B07857j50568J9609O850J05493M6901r5744l3171j5709j228M7192O2915
17469B00397l2857L7843R9821k8762n4740j08555n5443K7777J4824j6173J08531
17458A92663o49m1178M2794j1474L2212o4773J7175o5104Q2251J44777n1355L0914
17446C08253J22280L7921J12960K25998L25656K81204P2664k39585n8198J50748
$$ y = [-162937, -167392, -154561, -243457, -225747, -218997, -166295, -104141, -10191, 116542, 267252, 231795, 69403, -71587, -192905, -14349, 135935, 160134, 189581, 154637, 44525, -60279, -62446, 171044, 244437, 128847, 108487, 32034, 3548, 95602, 111942, -120235, -353765, -226042, -138830, -48168, 67680, 102171, 86511, 233551, 333743, 346295, 207857, 57289, 76898, 83748, 189241, 236142, 140398, 107227, 91518, 90290, 137482, 200397, 167540, 205383, 305204, 276442, 221702, 113147, 57704, 85481, 100305, 84132, 192663, 192014, 150836, 193630, 182156, 214368, 149595, 166770, 101666, 183917, 328694, 277339, 308253, 430533, 468454, 581414, 807412, 1133068, 1414272, 1486936, 1247351, 1189153, 1339901]
17436A339901J78714j49336l00813k35583n8802p8363K1192rK8622J42620J70293
17425A058436K88108P2916j80493l06267j67584N362j01605J09662R3266K94330
17415A166131K59353M7923j87116k79800k78129j56357K4238K5190J80226J91593
17405I93252N2961Q9845J40095n7385k69757k29614J1609P493j11875m8602l7726
17394E40296n616k6360l7171J3674K0812j07858j59539p6695l0769l5406j8770
17383G6598J11003l237k4992r1066J3161J77069J03018K2614j14150q881M422
17372B65559O3219p4913l5620j5416j95212j6197M0517J00789N6612O8172n553
17361B51957p3711j01422N442J20808J7772j8648J49293L623o7243q7237M6461
$$ y = [1339901, 1518615, 1369279, 1068466, 832883, 774081, 695718, 716910, 716901, 745523, 888143, 1058436, 1346544, 1419460, 1238967, 932700, 765116, 770478, 668873, 778535, 871801, 1166131, 1425484, 1473407, 1286291, 1006491, 728362, 572005, 596243, 621433, 801659, 993252, 1046213, 1136058, 1276153, 1218768, 949011, 719397, 731006, 738499, 626624, 578022, 540296, 534680, 508320, 471149, 484823, 505635, 397777, 238238, 161543, 130774, 95368, 76598, 187601, 184364, 159372, 68306, 81467, 258536, 361554, 384168, 270018, 261137, 265559, 328778, 253865, 218245, 202829, 7617, -8580, 31937, 132726, 189338, 257510, 251957, 178246, 76824, 82266, 203074, 220846, 202198, 351491, 355114, 287871, 200634, 247095]
17350B47095P9155q1847K4901m0727j749o0917l1838O1149N9517J1687k9370P5037
17338C12093k8303K2046J689m2718k8250j0587L8155M2491j13581p2654m7681
17327G2700O1156P4334L3031o9282L1519M2134L5431j6451m3688M2147N0733q0956
17315B32808n8051j8500l2715P8760j1734k8662O5852n7648k1694M3733l3232
17304A58917j11522K4617J87024J09448j3963j0939l1744O1986N3195j12846r1769
17293B22404k1287J7965P7394j353n2312P198O6786O0705q3364o251j0910O2585
17281C39560K6471M399n5896k0947K184L582j0655n9361J16563R3296L461K7920
17269D70577j3727L4823m932k7769r887R5794J14689q7124j38635j13843L7518
$$ y = [247095, 326250, 244403, 269304, 228577, 226828, 165911, 134073, 195222, 254739, 266426, 237056, 312093, 283790, 305836, 307525, 264807, 236557, 225970, 264125, 306616, 193035, 120381, 72700, 133856, 208190, 241221, 171939, 203458, 245592, 281023, 264572, 220884, 263031, 313764, 232808, 174757, 156257, 123542, 202302, 190568, 161906, 227758, 170110, 148416, 192149, 158917, 47395, 72012, 259036, 368484, 354521, 343582, 311838, 373824, 427019, 314173, 222404, 201117, 219082, 296476, 295123, 242811, 250009, 316795, 377500, 294136, 287885, 276975, 339560, 366031, 370430, 314534, 293587, 295771, 299353, 288698, 229337, 345900, 439196, 442657, 470577, 456850, 491673, 486741, 458972, 449085, 544879, 659568, 572444, 433809, 319966, 357484]
17258C57484J01658J42545M5176n4857k2864J1097p316q3750p3492J0870M6529
17247D73080N6419q8588j8229P5557k5116j0418l0811l8292Q7378J97217K5640
17236G03837k6626K6872O460J0179M5960q5416P8284J22437K3386n3186K1933
17225H74120J19564K8023l4941k8980J24011k3616o2827K9851J7411J08184J01158
17214A251958L026J0701N087M1405O921O4766M8077j1485l2010J89431K19567
17203A797444J22136O3087L4240R1386J06902J97884J12911N3569M0170L42134
17193B961863N17416N14338L96737J64041K96221N55559N20209M93446M75065
17184F894895K87881J58724L39976N42406N30118N49716Q49356J123394J394764
$$ y = [357484, 459142, 601687, 646863, 592006, 569142, 580239, 572923, 489173, 415681, 426551, 473080, 529499, 440911, 422682, 498239, 473123, 462705, 431894, 393602, 480980, 678197, 703837, 677211, 704083, 710543, 720722, 766682, 681266, 759550, 881987, 905373, 852187, 874120, 993684, 1021707, 986766, 957786, 1081797, 1058181, 995354, 1025205, 1042616, 1150800, 1251958, 1254984, 1265685, 1270772, 1312177, 1319098, 1383864, 1431941, 1420456, 1388446, 1577877, 1797444, 1919580, 1982667, 2016907, 2108293, 2215195, 2413079, 2525990, 2579559, 2619729, 2961863, 3479279, 3993617, 4390354, 4554395, 4850616, 5406175, 5926384, 6419830, 6894895, 7182776, 7341500, 7681476, 8223882, 8754000, 9303716, 10153072, 11276466, 12671230]
17175A2671230J707434J977950K190956K508084L015690L593094M437791O001506
17167C8103735Q940247J4374685K4092245L7016977M4552182L3212960Q027057
17160B08320088o583603N6911J1637172M716784j9548067l8088041l8875168k9336373
17152I2299703j8948222j1446625o395472l096353m28051K332124N965824J1822592
17144G2105520K1369741L6097999M9343489M4760006J8276576o237376o673195
17137B29042760Q190068R244621j4253575m0580591m8753561m0834492k8398828
17130G3656402j8715570j2488503q555577o233983m724084l449802k568130k223709
17122A4697044j900873j624944j310446j022158o73850n30570n91209n87410l49455
$$ y = [12671230, 14378664, 16356614, 18547570, 21055654, 24071344, 27664438, 32102229, 38103735, 47043982, 61418667, 85510912, 122527889, 167080071, 200293031, 208320088, 201736485, 201793396, 213430568, 218147352, 198599285, 160511244, 121636076, 92299703, 73351481, 61904856, 55509384, 52413031, 51984980, 54317104, 60282928, 72105520, 93475261, 129573260, 178916749, 223676755, 241953331, 235715955, 229042760, 237232828, 246477449, 232223874, 191643283, 142889722, 102055230, 73656402, 54940832, 42452329, 33896752, 27662769, 22938685, 19488883, 16920753, 14697044, 12796171, 11171227, 9860781, 8838623, 8164773, 7634203, 7042994, 6455584, 6106129]
17113F106129l54090l70318j45324l14310j96766r6309k41522l25170j43388o8664
17103C850268j25648l23381m13288m70995l08468j18604j48571r4367j19740j40922
17093A586284m7058n9048q097q8914l6058k01516j66971J5264N0132n3675L0820
17082A021163J3731O4808K2055q1057n8074j35313j5674K4835p1074p6310m4321
17071F64769k1202j35816j9103J13899M1611O7362o8270j23941J7714r664o818
17060E20541j02146j2687n9016O4269P0503L0736r679O7220l0732o1269j30499
17049C47241j22260Q967J37486J2611j34339n901m3631k1621J47693K0740r6363
17038B50623J51686J30829q6247l1483J8532M2923j5391L1387J03213r233j39905
$$ y = [6106129, 5752039, 5381721, 5236397, 4922087, 4725321, 4629012, 4387490, 4062320, 3918932, 3850268, 3724620, 3401239, 2987951, 2516956, 2208488, 2089884, 1941313, 1846946, 1727206, 1586284, 1539226, 1480178, 1472081, 1383167, 1347109, 1145593, 978622, 993886, 1044018, 990343, 1021163, 1034894, 1099702, 1121757, 1040700, 982626, 847313, 831639, 856474, 785400, 709090, 664769, 643567, 507751, 488648, 602547, 644158, 711520, 643250, 519309, 537023, 527359, 520541, 418395, 405708, 346692, 410961, 481464, 512200, 502521, 569741, 539009, 477740, 347241, 224981, 233948, 371434, 384045, 249706, 243805, 200174, 178553, 326246, 346986, 250623, 402309, 533138, 446891, 415408, 433940, 476863, 461472, 492859, 596072, 586839, 446934]
17027D46934m4538Q130l5725q2636k2674l5545L269R4838J13439M3246o0687N3422
17015D81473R6940m7513n6335o4284J32215R7092k0656L1561l7711j09251m4862
17004D58669n7800N886P614l8669p728j3696P3360P2817L4281n8912q923p7344
16992C89555l2290k7318P5574J27991M2881K7315P4984L196j20947p0588K7638
16981E17991Q8274L4951N5099j2018r6831n1478K1434N4568o0727k8062l199q9287
16969D30715r327Q2754J31452o8406q1901m8143J35954N9596N9280J12367m5524
16958G58817q0470q8628j3330J96717O3566k8137m0653l1786l9966L8294M0848
16947G75272O7602K0986l0153n4479P1685L5497O1890J29027p6486p5844l029
$$ y = [446934, 402396, 410526, 374801, 292165, 269491, 233946, 237215, 332053, 445492, 488738, 428051, 481473, 578413, 530900, 474565, 410281, 542496, 639588, 618932, 650493, 612782, 503531, 458669, 400869, 406755, 414369, 375700, 367972, 354276, 427636, 500453, 534734, 475822, 466899, 389555, 357265, 329947, 405521, 533512, 576393, 603708, 678692, 681888, 560941, 490353, 517991, 606265, 641216, 696315, 684297, 587466, 535988, 557422, 611990, 551263, 523201, 520002, 430715, 421388, 504142, 635594, 567188, 485287, 437144, 573098, 632694, 691974, 804341, 758817, 678347, 589719, 576389, 773106, 836672, 808535, 767882, 736096, 696130, 734424, 775272, 842874, 863860, 833707, 779228, 850913, 886410, 948300, 1077327, 1000841, 924997, 921968]
16936I21968Q2869N7984K7955J36743j36312j10371P6677K91599J31609R2385
16926A573106J84333J39252M480M6740J54965J59115k0179J14126K06351M15136
16916B977425O09796K68820J001j29915J34351L02706L13650M15220N68196P31253
16906F192503N71046O21206N43880L33113M48308P85610J039019J522667J936565
16897A3993917J950060J745857J629499J567127J940924K817845M458204P136979
16889C7240412J1780669K0193849L5800407N7824568N6347126M521746m1252482
16882A82456295m7261660l3558559j9307555q565438q3022Q556395K1053610M0787166
16874A44077232N7797321L1490217k3374882m8518705m0777154k4560157j0455702
$$ y = [921968, 1004837, 1062821, 1090776, 1227519, 1091207, 980836, 1057513, 1349112, 1480721, 1573106, 1757439, 1896691, 1901171, 1947911, 2102876, 2261991, 2241812, 2355938, 2562289, 2977425, 3587221, 3856041, 3857042, 3727127, 3861478, 4164184, 4477834, 4893054, 5461250, 6192503, 6763549, 7384755, 7928635, 8261748, 8710056, 9495666, 10534685, 12057352, 13993917, 15943977, 17689834, 19319333, 20886460, 22827384, 25645229, 30103433, 37240412, 49021081, 69214930, 105015337, 162839905, 219187031, 223708777, 182456295, 135194635, 101636076, 82328521, 73763083, 73680061, 82236456, 103290066, 144077232, 201874553, 233364770, 209989888, 161471183, 120694029, 96133872, 85678170]
16867H5678170J843769J6320631L6280777M8940917J8695126k7989832m4088907
16860A35680651l5393836k2293945j2009847m391026K624036J1813758K6847319
16853A02877110M5867736M0401138n938966m1147943m2683163l0769716j9601793
16846D9004403j2357409q223066n832334m082404k899383j942465j460860j282817
16838A0923665j133635j165081j183689r41859o66677m45597j93331p6291r3013
16829E024492j36260k47149n90183n51439l91421l96137k16402j84255m7249j2818
16819B251179l7336M125K11062O0889j59686k93063m62155k16798n5483J304q5198
16808A218840p7658j48712j07314j6460m7649L0526J9680J6502k4955j29432p9487
$$ y = [85678170, 87521939, 103842570, 140123347, 189064264, 207759390, 179769558, 135680651, 100286815, 77992870, 65983023, 61591997, 64216033, 76029791, 102877110, 148744846, 189145984, 183207018, 142059075, 99375912, 68606196, 49004403, 36646994, 28423928, 22591594, 18509190, 15609807, 13667342, 12206482, 10923665, 9790030, 8624949, 7441260, 6499401, 5832724, 5387127, 5193796, 5117505, 5024492, 4888232, 4641083, 4050900, 3499461, 3108040, 2711903, 2495501, 2311246, 2263997, 2251179, 2213843, 2217968, 2429030, 2489919, 2330233, 2037170, 1575015, 1358217, 1302734, 1304038, 1218840, 1141182, 992470, 885156, 868696, 821047, 851573, 871253, 887755, 862800, 733368, 653881]
16797F53881L9925q2292J99n2065k4098N0112j9774k038q1367n2907P7615j5310
16785D91881L7006j01848J4758O6645j60889j07120q073J9395l0795j05931P4476
16774A89505R8716l4987M1416j33297k9391J04334M7060j9480q9753q6901m3430
16763D3792m7822k1554J3434J04291J60185k7783j6579n0430J1463n644j02070
16752F1283p463O8975j8903p4369J59974J06536m0818q2131j47347j12199P7762
16741h700M6978N2821M3792l1903L4647j8545M9898P2624p5891n1738J3170k3612
16729A03541q6090P2511N1148L2900L4398q5496Q407L6801L9657N9793o8262o1487
16717A37821M7870j52336j16822N8373J05447k3055m2799K6429J29809n7304n5116
$$ y = [653881, 693806, 611514, 611713, 559648, 535550, 585662, 565888, 563850, 482483, 429576, 507191, 491881, 528887, 427039, 441797, 508442, 347553, 240433, 232360, 251755, 220960, 115029, 189505, 288221, 253234, 294650, 161353, 131962, 236296, 283356, 263876, 174123, 87222, 43792, -4030, -25584, -12150, 92141, 252326, 224543, 207964, 157534, 168997, 163353, 61283, 53820, 122795, 103892, 29523, 189497, 296033, 255215, 173084, 25737, -86462, -8700, 38278, 91099, 134891, 102988, 137635, 119090, 168988, 241612, 165721, 113983, 127153, 103541, 17451, 89962, 141110, 174010, 208408, 122912, 131319, 168120, 207777, 267570, 199308, 137821, 185691, 33355, -83467, -25094, 80353, 57298, 14499, 40928, 170737, 113433, 58317]
16706E8317o0940j4347P3390k6380n2024o663J01053J8878r6722j9177J18450
16695I3835R7520K7840j32202n18M071r571p5292j9286J90645Q228k1714j8186
16683A45370n4515l0811j9844R8543l3994j39557L4805L1768m920o3550o4419
16672a01124M412P855R111O5527J6457o0742Q468M0107q4927O2778J46758J2486
16660A27166p6105q3741o0449Q2616l8389P9366o0293n0795j1166j89359J5119
16649b66030J68256Q0660K9882K4996j2688j00757M678N9721K3580r6306J2137
16638g1871L0742m3048n1849J7159M0061K0957J895J8938j3732Q9861J3643j01913
16626d9157L901P664m0799N4103L0805q5293Q7097L9658j9804P030J032J39484
$$ y = [58317, -2623, -16970, 56420, 30040, -21984, -28647, 72406, 91284, -5438, -24615, 93835, 191355, 219195, 86993, 86475, 90546, 80975, 5683, -13603, 177042, 185270, 163556, 145370, 90855, 60044, 40200, 138743, 104749, -34808, -3, 31765, 26845, -36705, -101124, -96712, -88857, -79746, -14219, 2238, -58504, -50036, -9929, -94856, -32078, 114680, 127166, 51061, -32680, -93129, -10513, -48902, 30464, -29829, -80624, -91790, -281149, -266030, -97774, -17114, 12768, 37764, 25076, -75681, -71003, -11282, 12298, -84008, -71871, -41129, -84177, -136026, -118867, -78806, -57849, -55954, -37016, -50748, 39113, 52756, -49157, -45256, -37592, -78391, -24288, 6517, -78776, 8321, 47979, 28175, 35205, 36237, 175721]
16614A75721R7207Q4379J1413J18517K23178J41396L09108J02139o8407p5096
16604A119555N0373K0343j79976k97618j87994q3686j79053m8820K7347q832K9137
16593B60776O2307p0879J80648J51810J07962K35908J68261Q1638k6779K021N558
16582A159231q4229j00941j19889k58334j69852r0175q0946R78N911r4028j24387
16571D3339n7363p7609M904L3687R0367O4014M7793r0901p1965Q0002j1579o3241
16559h552O9932p0361n6063M4177J01613n1536n7410j2025m0387o9313j76041
16548c25966L1171l7824m4094J20332J60657J11495j37930r6052k8628K5290J6961
16537b04588o304L1426J68847k9697j60947m6743P3927N7506P1417N7018R0174
$$ y = [175721, 272928, 357307, 368720, 487237, 710415, 851811, 1160919, 1263058, 1194651, 1119555, 1169928, 1190271, 1010295, 712677, 524683, 440997, 261944, 213124, 240471, 231639, 260776, 323083, 252204, 432852, 584662, 692624, 928532, 1096793, 1178431, 1151652, 1153673, 1159231, 1075002, 974061, 854172, 595838, 425986, 335811, 254865, 255843, 261754, 167726, 43339, -14024, -91633, -86729, -53042, 37325, 101339, 149132, 58231, -13734, 66268, 54689, -8552, 61380, -8981, -65044, -20867, 80746, 29210, -28200, -40225, -80612, -149925, -325966, -294795, -332619, -376713, -256381, -95724, 15771, -122159, -218211, -246839, -221549, -204588, -210892, -179466, -10619, -40316, -201263, -248006, -174079, -116573, -45156, 11862, 102036]
16526A02036m2649L821j07641j28150Q0320O4316q7571p7571J3118L0432j5124
16515a64663j00481j6366J272L338o5459r3798J25957J86666l7057J4141J66425
16504A9975j6679R1466m8039r7580r4497o8609L5985j7174L098J8778n1843J4031
16492b11088P9509O5410P4123P4603q3256p7482l2695l5123J14538j4712j3152
16481e9325R5083O2059j0900r5760k8288J6593m1936R3598J9364j05527q9566
16470a44605j37330K5983L5788J2922M9129J5403r75j22393L1253J84850j8854
16459f8829r6768k6229p5338o5440R2920J50166J22556J1813j24204m6096p829
16448a33278j49510Q356L49R4332L4418N0105J04429N2995N8490o4109j21379
$$ y = [102036, 59387, 63208, -44433, -172583, -92263, -27947, -115518, -193089, -179971, -149539, -164663, -265144, -281510, -280238, -276900, -342359, -436157, -310200, -123534, -160591, -146450, 19975, 3296, 94762, 46723, -50857, -145354, -213963, -177978, -195152, -192054, -173276, -225119, -211088, -131579, -66169, 7954, 82557, -699, -78181, -110876, -145999, -31461, -46173, -59325, 35758, 97817, 86917, -8843, -37131, -20538, -62474, 31124, 50488, -55039, -144605, -281935, -255952, -220164, -207242, -158113, -142710, -143685, -266078, -234825, -49975, -68829, -165597, -191826, -267164, -332604, -239684, -89518, 33038, 44851, -79353, -125449, -133278, -282788, -274432, -274083, -179751, -145333, -95228, 9201, 62196, 120686, 56577, -64802]
16437f4802l8634L516N1746J7095m016o6825o0034k1214o6759q529L4187Q8629
16425a35640J21211L616l6731J2357L741k1332M0821K5230p9486R2384j3365j20038
16413a07232P3352N6325n7429n2375M2335K6826O1182J6924m400p1660K0379P8376
16401H2603L2174n9916o7127j18621k7175Q2386K6045K9570m4791k3647Q122M9490
16389c0887p8975q6375N5693Q8491K1249j09466l4955J13580M2733q7070J1838
16378i4144k7562o235O3478K5941J7814K9065R7117j39890j12930j48891j03987
16367d00224m9696J05704R6612N8209Q5570O0304m4004o615M2895K6091P726m5889
16355f3317o1652m7600m4305P7639l2786j2691N8691M5354l5857L1172N8551N5814
$$ y = [-64802, -103436, -99920, -48174, -31079, -35095, -101920, -161954, -183168, -249927, -258456, -224269, -135640, -14429, -10813, -47544, -35187, -31446, -52778, -11957, 13273, -66213, 26171, 12806, -107232, -33880, 22445, -34984, -87359, -45024, -18198, 42984, 59908, 55508, -16152, 4227, 82603, 114777, 54861, -12266, -130887, -158062, -75676, -49631, -20061, -64852, -88499, -80377, -30887, -109862, -196237, -140544, -52053, -30804, -140270, -175225, -61645, -18912, -105982, -94144, -121706, -127941, -64463, -38522, -20708, 8357, 105474, -34416, -147346, -296237, -400224, -449920, -344216, -247604, -189395, -103825, -43521, -87525, -94140, -51245, -25154, -17428, -63317, -124969, -172569, -216874, -139235, -172021, -184712, -126021, -80667, -116524, -85352, -26801, 29013]
16343B9013j18439R605N6567n4034r075N9446M4730R4993J08937o5816K3806N2956
16331B32689J32151J98576K27849P4763J5176r4148k20950p4659j72021j18717
16321B00709N9951J20376J31047J38617L66574J23406k02705r9551j68774j91768
16311D77882P5719M5422R8143J02609K66123J05976j65869k19487j35589j38670
16301E12259j93843q4434N7211J01174K1831K67905J44837K6036k96572k85155
16291B71249j01919p7135l8089j11506j18646M1812J89072j9037j2024j03645
16281g9868p4209J06958M1946J6955J9120J3570K4321N584j14846m5207M0854
16270d4822J53342J5520q5216J4974k7762j02171m9949m2313l560m783j57952
$$ y = [29013, -89426, -79821, -23254, -77288, -86363, -26917, 17813, 112806, 221743, 155927, 179733, 232689, 364840, 563416, 791265, 866028, 881204, 787056, 566106, 491447, 319426, 200709, 260660, 381036, 512083, 650700, 1017274, 1140680, 937975, 838424, 669650, 477882, 553601, 599023, 697166, 799775, 1065898, 1171874, 1006005, 786518, 650929, 512259, 318416, 233982, 291193, 392367, 414198, 682103, 826940, 852976, 556404, 271249, 169330, 92195, 54106, -57400, -176046, -134234, 54838, 35801, 23777, -79868, -154077, -47119, -5173, 11782, 30902, 44472, 68793, 74377, -40469, -85676, -44822, 108520, 124040, 38824, 53798, 26036, -76135, -126084, -168397, -171957, -176740, -334692]
16259c34692J10913J37507O2579l7665L7754J00100r6943n9380k6912O4042O7948
16248B5251O5833j3894q3726j71431o0058K8034P5744N1859l5372Q134M2157p6026
16236a43495p251l0003p964l6281j4746P8847k0308N1119N9338m61L3079j7094
16224e5220q0637K9842N1477K0434j17454j29452Q3115J48723K5915j96061J5845
16213b03473L3824j10280R915Q5847J4953M1670P3401n570j7822k0860l8948k3813
16201a61156J3878P9211O2092l3569r30J0082j19446j03942m307O8360P6195Q7845
16189b5687l0200M0372K6513m5985m2620k4049r4242L8353P0303K4075L6134N6781
16177B9748Q0523M9345L2766J5139r0986m7964J8940n4789j41956k5562q1764
$$ y = [-334692, -223779, -86272, -23693, -61358, -23604, 76496, -20447, -79827, -106739, -42697, 25251, 91084, 77190, -6536, -177967, -238025, -209991, -134247, -82388, -117760, -109626, -67469, -143495, -150746, -180749, -188713, -224994, -239740, -160893, -181201, -130082, -70744, -71205, -38126, -55220, -135857, -106015, -54538, -34104, -151558, -281010, -197895, -49172, -23257, -219318, -203473, -169649, -279929, -270014, -184167, -169214, -127544, -54143, -59713, -77535, -98395, -137343, -161156, -147278, -68067, -5975, -39544, -40474, -30392, -149838, -253780, -258087, -189727, -113532, -25687, -55887, -15515, 10998, -34987, -77607, -101656, -195898, -157545, -87242, -63167, -27033, 29748, 110271, 159616, 192382, 207521, 116535, 68571, 87511, 32722, -109234, -134796, -216560]
16166b16560K3868M7822M0819Q0404q2181Q2861J06742L5332o8173r7758k2119
16155f8943J09761n8927n6347p63n2690j37605j374O2557J43373R6271o2427j21675
16143a48789L9426P879P1943M34m7994r883R7529J20200p0759j38916O9035N2474
16131D2579j83094n9320Q2237Q3642J7366n2568M3374L0829Q1934k9567r2704
16120c5292q2768o6722q647N9036k0060P4626Q9158Q2503N1628j4605r9898k471
16108B6488L3075k1339K9622l9971l8247k4409k7007P414o613n4853p600J1072
16096a12368J42414p7842l4231n3041O829O5481l7506J5157O0046k9640n5260
16085a09961O2453N4488J8315q5575j45027K9795K4369K2322N9228P8757r423
$$ y = [-216560, -192692, -144870, -104051, -23647, -105828, -22967, 83775, 119107, 50934, -46824, -68943, 40818, -18109, -74456, -75219, -127909, -265514, -266888, -204331, -60958, 35313, -27114, -148789, -109363, -101484, -29541, -29107, -77101, -86984, 10545, 130745, 59986, -78930, -9895, 42579, -140515, -199835, -117598, -33956, -16590, -69158, -25784, 5045, 86979, 57412, -35292, -118060, -184782, -193429, -134393, -154453, -79827, 9331, 91834, 143462, 128857, 28959, 26488, 59563, 38224, 67846, 27875, -10372, -34781, -61788, -54374, -60987, -115840, -123440, -112368, 30046, -47796, -82027, -135068, -128239, -62758, -100264, -85107, -25061, -54701, -109961, -47508, 6980, 25295, -60280, -205307, -175512, -151143, -128821, -69593, 9164, -259]
16074b59j0326K1087K6088l5098l2583j9224J5826J15210Q2563q1198j93352j74062
16062b85328P3836K6378j27977n1052J58312J92647J07880m7389o871j02815J47748
16051H5369P837l0339k8635p4064L5969k1197k5748l9504j441o5468Q312l0911
16039a79820k3566K7282Q0198J0259O8274O533p8685j23885J9805N8771O2733
16028g2101k6416o5966o5937M5387N7935L4028o2356k2261k259P2885j5867L3435
16016h9493J56101J05551J971j55621j85255L731L4879q3147k900L0508L6988
16005a46687O2968P5080J29378k8784j47642M1123M328o7955n2539o7643J43949
15994e4424J0471r8389j1133O2488J24501J13154P427J2844j07981p7456j00849
$$ y = [-259, -10585, 10502, 36590, 1492, -31091, -50315, -34489, 80721, 163284, 82086, -111266, -285328, -211492, -185114, -313091, -364143, -205831, -13184, 94696, 47307, 40436, -62379, 85369, 93206, 62867, 34232, -39832, -3863, -25060, -50808, -90312, -91753, -157221, -148909, -179820, -203386, -176104, -95906, -85647, -17373, -10840, -89525, -213410, -193605, -134834, -72101, -98517, -164483, -230420, -185033, -127098, -93070, -155426, -177687, -179946, -107061, -122928, -89493, 66608, 172159, 174130, 18509, -166746, -163015, -128136, -211283, -214183, -183675, -146687, -83719, -8639, 120739, 91955, -55687, -14564, -10236, -78191, -130730, -198373, -54424, -43953, -142342, -153475, -90987, 33514, 146668, 154095, 166939, 58958, -18498, -119347]
15983a19347j2048K3673K6021K0508r5815p2807J57868J3518M7680j5031j0425
15972c6205Q1787J1670K6765m4485j9166j1931j0515q629p4230J05556L5782M442
15960F0841j24325o1824L9649K3961l8364n8909J04573O3775l8238n4363p8779
15949a62003Q7349K1018J0156O658n4487M5971j9581j13413J44740Q8826J0078
15938F5312n884l0620p6742P6830Q2735K7054j43135j10642k2404Q1838J22828
15927F7170q4307J0804L9631r6789j35446p6072J15034J57156J0065k7763j27829
15916a48346l8365O3295M4265Q0212M1644l7189L7353M607j10958k5803m6724
15905a36009j09803K6381m4209o6255R1397J30344j3917J97446M7836n8851k21082
$$ y = [-119347, -131395, -107722, -81701, -61193, -157008, -229815, -71947, -58429, -10749, -25780, -36205, 45582, 57252, 84017, 39532, 20366, 8435, -2080, -10709, -84939, 20617, 56399, 60841, -63484, -125308, -85659, -61698, -100062, -158971, -54398, 9377, -28861, -83224, -162003, -74654, -53636, -43480, -36822, -91309, -45338, -64919, -178332, -33592, 55234, 65312, 59428, 28808, -47934, 28896, 111631, 138685, -4450, -115092, -137496, -55658, 67170, -17137, -6333, 33298, -63491, -198937, -275009, -159975, -2819, 7246, -20517, -148346, -186711, -123416, -79151, 1061, 42705, 5516, 42869, 47476, -63482, -89285, -136009, -245812, -219431, -263640, -329895, -238498, -108154, -122071, 75375, 123211, 64360, -156722]
15894a56722r5443J15031J49497J10804J1055p1869j63663m8045J07364K0378
15884b1613k2971O162m3383r4859J9358M5133M7029J89698K7712j23441p2456
15873d3631r520J35264K000o4665n9910m6881l8630M3981L5216l9631N5318L4235
15861C146P70M7267o691o7389R566k4178l7703n4053o8668k5871j9667R8955R8022
15848d6494n2391p1079J7473J21888O7547Q1463J074p5835j2973j3140j6184K294
15836C643J1752n019q9437N2557Q3782R90p429r9346l9251m6139o6597Q0638K7076
15823i2780L8905p0904q2927m8177J18036k5309k8972N9266O4377k640R2197P2091
15811I3163K0957k9991p2318K7089n4624M802R4858M4499O0372j55818r5198j00024
$$ y = [-156722, -252165, -137134, 12363, 123167, 134222, 62353, -101310, -149355, -41991, -21613, -44584, -38422, -81805, -176664, -157306, -112173, -65144, 124554, 152266, 28825, -43631, -53151, 82113, 84113, 19448, -40462, -87343, -125973, -81992, -46776, -86407, -31089, 3146, 3916, 51183, 44492, -22897, -13331, -37509, -75212, -129265, -197933, -223804, -243471, -144516, -46494, -98885, -169964, -152491, -30603, 36944, 118407, 119481, 43646, 30673, 17533, 1349, 3643, 15395, 10376, -79061, -26504, 57278, 58268, 50839, -48507, -87758, -133897, -200494, -119856, -92780, -53875, -124779, -207706, -255883, -137847, -163156, -192128, -132862, -68485, -71125, 21072, 93163, 114120, 84129, 11811, 38900, -15724, -10922, 83936, 128435, 188807, 32989, -62209, -162233]
15799a62233L636o357J5443q5891K9137k5544K2610L6162Q9293J73529k1653l7434
15787C0698k8211q8433m376M1705j3310J80000J11316n6690J6623m1930k4557
15776A22835k2689J1911j0527J19934l0915k8098l6752r9308n2685p712m1370
15765g5376j43194k5809Q5857J4291P7148O3453R4845k5382J0696j226P0215n6435
15753H9083k9886j87238j5823J28350J40533m40n7471p745J73j44068Q573l5296
15741a11255L842Q5752M0904M9348J42301l7577j13420j61589o7725p5270J34254
15730a10435N0839P0327L9383j76r9043N1683K7597J42148n667l256J05307L0448
15718B99155k20877n5278J38775J6189n4594j9839K1692j11428p6121k7750J4228
$$ y = [-162233, -158597, -164954, -149511, -235402, -206265, -231809, -209199, -173037, -83744, 89785, 68132, 30698, 2487, -85946, -90322, -48617, -61927, 118073, 229389, 172699, 189322, 147392, 122835, 100146, 112057, 101530, 221464, 190549, 162451, 125699, 26391, -26294, -34006, -75376, -218570, -244379, -158522, -144231, -67083, -3630, 91215, 65833, 76529, 75303, 145518, 89083, 59197, -128041, -143864, -15514, 125019, 124579, 67108, 59363, 59536, -84532, -75959, -111255, -107413, -21661, 19243, 68591, 210892, 173315, 59895, -101694, -169419, -244689, -110435, -59596, 10731, 50114, 49938, -49105, 2578, 30175, 172323, 166656, 163400, 268707, 299155, 78278, 23000, 161775, 177964, 123370, 103531, 125223, 13795, -62326, -90076, -75848]
15707g5848J9728P1750l3724j27914r510R3206m1752j10440j2902n7709J16445
15696a68670P7175K8612J10816r9656j64055m394J60467L6845K1633n5274k6556
15685h3057Q4558o5300j7395l3279j096p38j09603k9236N114M4925J02040L4657
15673f8410n0454M1637k3730k8922j64408p2565L6906J33777Q4884K879N6278
15662e2128L3043R8783j3597j34615M564M4889K3038J9099n8914J7816k5127j7257
15650f0406P7364Q9771l6622K6630q6737q8792m3864k0025J29387R0321K3481
15639A00508j84163j25200k437Q2348J36971o039j6545l2508J7201k6193j27698
15628a83755M8553L3649m0852j0602J23484j5683n4202m517n9444R4371K1428
$$ y = [-75848, -56120, 15630, -18094, -146008, -155518, -62312, -104064, -214504, -227406, -285115, -168670, -91495, -62883, 47933, -51723, -215778, -220172, -59705, -22860, -1227, -56501, -83057, 1501, -63799, -81194, -114473, -115569, -116307, -225910, -255146, -250032, -205107, -103067, -68410, -118864, -77227, -100957, -129879, -294287, -366852, -329946, -196169, -111285, -108406, -52128, -19085, 79698, 66101, -68514, -63950, -19061, 3977, 23076, -35838, -18022, -43149, -60406, 16958, 106729, 70107, 96737, 10000, -78792, -122656, -142681, -13294, 77027, 100508, -83655, -208855, -211292, -128944, 8027, 1988, -14557, -47065, -29864, -56057, -183755, -135202, -101553, -142405, -153007, -29523, -45206, -99408, -103925, -163369, -68998, -47570]
15617d7570n7667O121k789Q148r0986J57548R8715n4700m3718j6435m91J06010
15605F2186j5175L627P3993K2196q7205p5084J04351k8196N403p4493m6562J76518
15593A21559k2019p2734j05373K0525j2885O4911q3621P058J9632L8630k5172
15582d9489m5465k4740N105N8897P7905l9081L5016j7112Q858L2664l4512K8329
15570C6375p9349o353O3546M4898K6016N4252k5622n9930j51055j19746J27069
15559h9899K22232q3901o7498k5169n704l7514Q5556M4712r3612l6087l8710n9964
15547a85558J10215J62123m6746o6704J08076R4110K6286l7407O0383K9039R119
15536B62936k28645r8443L9901k390l433j05529o7548R0451J02191J0676p5406
$$ y = [-47570, -105237, -99116, -101905, -93757, -184743, -27195, 71520, 16820, -26898, -43333, -43824, 62186, 47011, 50638, 124631, 146827, 59622, -15462, 88889, 60693, 66096, -8397, -54959, 121559, 99540, 26806, -78567, -58042, -70927, -6016, -89637, -82579, -62947, -24317, -49489, -94954, -119694, -114589, -55692, 22213, -16868, 18148, 1036, 9894, 42558, 8046, 36375, -42974, -49327, 14219, 59117, 85133, 139385, 113763, 53833, -97222, -216968, -89899, 132333, 48432, -19066, -44235, -49939, -87453, -1897, 42815, -50797, -86884, -125594, -185558, -75343, 86780, 40034, -26670, 81406, 175516, 201802, 164395, 224778, 253817, 262936, 34291, -64152, -24251, -26641, -30074, -135603, -203151, -112700, -10509, 167, -75239]
15525g5239k7769P1494p7546m2743M0285p89P3759q2146l2144P1417k0722P8962
15513b3181O2250q2754m6903J12594l9167m6310o0487o3050J9896l3139q187J8651
15501a89787Q6286L9235o0237k6593N4851o4009l3686m6691M9127L8540L2777
15490a20187J12748J1086N601J58444K4585j18276M802Q2639Q030m0106m1978
15479H7388K7206P752j29206j34374M1624r9563L2931P6826J05012K0163o8623
15468c2864l9306n8718q9797o5016J54655J46241L9869P9935p1506l1977m4590
15457a3074o2948P7010n3818K5249L9386J5983K5510m1007K1637q149p2294K0714
15445b5801P5865J06901j7365p4325j7863l2490k4882J65832q7869r8443r2999
$$ y = [-75239, -103008, -31514, -109060, -151803, -111518, -112307, -38548, -120694, -152838, -81421, -102143, -23181, 39069, -43685, -90588, 22006, -17161, -63471, -123958, -187008, -167112, -200251, -208438, -189787, -103501, -64266, -124503, -151096, -96245, -160254, -193940, -240631, -191504, -152964, -120187, -7439, 3647, 9248, 167692, 192277, 74001, 78803, 161442, 169472, 129366, 87388, 114594, 122346, -6860, -141234, -99610, -199173, -166242, -89416, 15596, 35759, -32864, -72170, -130888, -220685, -285701, -131046, 15195, 55064, 134999, 63493, 31516, -13074, -76022, 988, -52830, -27581, 11805, 27788, 53298, 12291, 33928, 25779, -46515, -25801, 50064, 156965, 139600, 65275, 47412, 14922, -9960, 155872, 68003, -30440, -123439]
15434a23439r2628R6330J93086M606L9757l3980o2473j2893k483N482o363N513
15422A0515j24658n3121L2901l2500j610J25555J14150Q868j02051l7494j924
15411f1369q0507J10413R0200r2290J01134Q519j11612R0210r098J5347l7421
15400B3526p1471p5429j14321K0816J26549J00456R406l0557M6607N8436m6245
15389D7773n7068p7526M4094K22369q032j18708m0949r0781L5737l2125r486O3167
15377b1535J21404j1350k8891K4403L027p0414m0810M1922J0808q2777l3120J35930
15365D8597M3111O2821j23081o6640J00996L7081j02050j3561Q8944k3925k5415
15354B6878j35082k2415P3221j37672R8844N0579K03N4328l467J4574K3429R6904
$$ y = [-123439, -216067, -119737, 73349, 77955, 117712, 83732, 21259, 8366, 5883, 11365, 5002, 10515, -114143, -167264, -134363, -166863, -168473, -42918, 71232, 80100, -21951, -59445, -61369, -141876, -31463, 58737, -33553, 67581, 76100, -35512, 54698, 45600, 60947, 23526, -47945, -123374, -237695, -216879, -90330, 10126, 19532, -11025, 35582, 94018, 47773, -9295, -86821, -42727, 179642, 171610, 52902, 11953, -78828, -43091, -75216, -84702, -21535, 99869, 88519, 59628, 84031, 87058, 16644, -24166, 17756, 28564, -54213, -87333, 48597, 91708, 154529, 31448, -35192, 65804, 102885, 835, -12726, 76218, 52293, 26878, -108204, -130619, -57398, -195070, -96226, -45647, -45444, 8884, 5417, 19991, 43420, 140324]
15342A40324j1549p893r0012l6041Q0994j6872j95916K912O7065J24084Q288M1963
15330A07347l4437j02813r8944J16533M4486n2829J00590K6013j41742j28079
15320a63875J6034K2307O2103P3155L7148Q0213k5179j13206j1856j0226L1401
15309a981O7459N0948j99312q6470J61948P1157J12837J0634j79191j32304j5401
15298a39676q0228M1237N9509m7959J4917N4350K8435J41456J31572q4j24401
15287G9128q4240j422N673P1105J6237j53199k6758K2901k7515K06966J03288
15276B12164j30046q5127l3903J5244P7009K7887J8942L3313p0469n3042r2915
15265h0943p5486L9579J78182K3001o2999O5493L7028O2751M7602n7400P2377
$$ y = [140324, 128775, 120882, 30870, -5171, 75823, 58951, -136965, -134053, -66988, 57096, 65384, 107347, 72910, -29903, -128847, -12314, 32172, -20657, 79933, 105946, -35796, -163875, -147841, -125534, -63431, 9724, 46872, 127085, 101906, -11300, -23156, -33382, -1981, 65478, 116426, -82886, -169356, -7408, 63749, 176586, 187220, 8029, -124275, -139676, -219904, -178667, -119158, -167117, -152200, -97850, -69415, 72041, 203613, 203529, 79128, -5112, -6534, -861, 70244, 86481, -66718, -93476, -70575, -98090, 108876, 212164, 82118, -3009, -36912, -21668, 55341, 83228, 102170, 135483, 65014, 11972, -80943, -156429, -116850, 61332, 84333, 21334, 86827, 123855, 186606, 234208, 176808, 249185]
15254B49185j24076j87970j09661l9396M649j06055M2649P5050J07426J03985
15244A5786l7089j20637r7845o0581j0972J63387K3337O9484P998q542N3422Q0076
15232G7824J9186q5184j38577m3632J16199N6657J3966p1014q9946q700N3496
15221i9725Q1845k0406j9476J42075k9629j06049m2969r8358p5379L9223K1597
15210b07251Q3981Q7220J03544M4856M3794j0429m7123L2935M6011P1306j10087
15199A38757q2183L4644j0913q1681r0877m9656n365l6672M171P5235N0418j2034
15187f6156o391j45981O7361R0249O557N2265q1306o1126Q0400J0091K4469J00758
15175G1190q5532r8366N6985M4374P0041n2235q8145o0723L9120J08778N7035
$$ y = [249185, 125109, -62861, -172522, -211918, -207269, -313324, -270675, -195625, -88199, 15786, -21303, -141940, -239785, -300366, -311338, -147951, -124614, -55130, -47132, -55674, -2252, 77824, 97010, 11826, -126751, -170383, -54184, 2473, 16439, -54575, -144521, -153221, -99725, -17880, -38286, -57762, 84313, 54684, -51365, -94334, -192692, -268071, -228848, -207251, -123270, -36050, 67494, 112350, 156144, 145715, 98592, 131527, 177538, 248844, 138757, 56574, 91218, 80305, -1376, -92253, -141909, -147274, -183946, -179775, -104540, -54122, -66156, -72547, -218528, -151167, -60918, -54361, -2096, -83402, -144528, -64128, -54037, -29568, 71190, -14342, -112708, -55723, -11349, 58692, 6457, -81688, -142411, -103291, 5487, 62522]
15164F2522p0552K9588K4210M6836j13159m4603p1724k5652O7605R628q7670L1787
15152a41184Q0804R8833k9627j53401N725n514K8259q711Q191O4833P9697P8705
15140A06610L8302R158j01985r3346j47245j1523J22118J0422k5567L7761J02612
15129D7317n444r0198j3368o7658N1272J5277K4224R9446m2556o8356Q3261P9702
15117A12919R431j20938m3084q7505K9483P8333N9241P6742j8994l0937m3283
15106B1408j09398O4445J08011J37428p6473j55544q805J7823l0661p836n3487
15095i3089J39235j4811J7704k058n6771O5983l7857Q1712L1704K5208M3622J7581
15083B18163m128r8945n7912J7690N4P1518l0172N5682P6450j20970k73477m0213
$$ y = [62522, -8030, 21558, 45768, 92604, -20555, -65158, -136882, -162534, -94929, -85301, -172971, -141184, -60380, 38453, 8826, -144575, -138850, -144364, -116105, -124816, -116625, -51792, 27905, 106610, 144912, 154070, 52085, -41261, -188506, -200029, -77911, -67489, -93056, -55295, 47317, 41873, -48325, -61693, -129351, -78079, -62802, -38578, 60868, 18312, -50044, 33217, 112919, 122350, 1412, -41672, -129177, -99694, -21361, 37880, 114622, 95628, 64691, 21408, -87990, -23545, 84466, 221894, 145421, -10123, -18928, -1105, -31766, -39602, -93089, 46146, 31335, 49039, 46981, -9790, 56193, 18336, 100048, 131752, 156960, 200582, 218163, 214035, 115090, 57178, 74868, 74922, 146440, 116268, 171950, 248400, 127430, -146047, -186260]
15071a86260K19863J857r1340Q8167N4644o0649N0324r7315k6911J29938R7655
15060A79973o6034j67847m6855O682l1283Q8731N6500J06462j07226j12408O5137
15049b8168N1448o774m2432m3010n021j206P7656p3423r1591O5973Q732Q3372
15037d444L2229M3172j1961J5224P9099M3241P2616P670o1631j08921K3889l3267
15025I6916j6910n2585K117P901j39401k2426K9095J28822K7679j46312n0591
15014a35695M1020M4824L9858L5084K3460R0620O9512j7900q1518k9734O1262
15003A40793J75320M08878M68220J82801j84075m34040l38382q1621q8567p1075
14993A78252n5077j39589j31422l62J12433o563K0534R1183L5684j01657L1276
$$ y = [-186260, 33603, 35460, -55880, 32287, 86931, 26282, 76606, -20709, -47620, 82318, 179973, 113939, -53908, -100763, -94081, -125364, -36633, 19867, 126329, 19103, -93305, -28168, 23280, 16506, -25926, -68936, -73957, -75163, 2493, -70930, -162521, -96548, -87816, -4444, 27785, 70957, 58996, 74220, 153319, 196560, 269176, 276846, 215215, 106294, 130183, 96916, 80006, 27421, 29538, 37439, -101962, -124388, -95293, 33529, 61208, -85104, -135695, -94675, -49851, -9993, 25091, 48551, 139171, 208683, 190783, 109265, 79531, 140793, 316113, 724991, 1193211, 1376012, 1191937, 757897, 419515, 337894, 249327, 178252, 123175, -16414, -147836, -148198, -35765, -42328, -21794, 69389, 105073, 3416, 34692]
14982C4692m980p1784k3316O2617K2117P3143R1686n646L0036J4327J6744o8929
14970A70707r4381K5875J3789o1075m0386J6979L3783m9647M2406J07597m2853
14959A22794n4603m8430L0513l4251l6892P8824O083j46882J12511q9314j07883
14948a67530J82532Q7860p9391k591R5588k9669o3458M1365p449l7428o6364O1791
14936A5256J45283n6469n7685R150Q4252j8451j30257p231J92431J897o0555j13262
14924D359r1270L857j291J22730O9605K3497n5098l2817R3930Q2645m015r0927
14912A25205k6298L533n001j94603l142J46372K3133j58048O8350N1275N6370
14901H7146K9208K7280r9353j51461K0656j02846L1047J10446L8221M5430K9012
$$ y = [34692, 29712, -42072, -65388, -2771, 19346, 92489, 184175, 178529, 208565, 222892, 239636, 170707, 76326, 102201, 115990, 54915, 14529, 31508, 65291, 15644, 58050, 165647, 122794, 68191, 19761, 50274, 16023, -20869, 57955, 64038, -82844, 29667, -59647, -167530, 15002, 102862, 23471, 20880, 116468, 86799, 23341, 64706, 57257, 19829, -46535, 15256, 160539, 104070, 46385, 55535, 139787, 121336, -8921, -16152, 176279, 178176, 117621, 4359, -86911, -83054, -84345, 38385, 107990, 131487, 76389, 43572, 137502, 220147, 216132, 125205, 98907, 102440, 97439, -97164, -100306, 46066, 69199, -88849, -20499, 30776, 87146, 116354, 143634, 44281, -107180, -86524, -189370, -158323, -47877, -9656, 35774, 64786]
14890F4786q8264J4774M0987Q46M3617k6037M6371m5490j16665O0003J06828J1025
14878A12781j4315l3361M4741m612M7355M6801n7470n0333o8413k4673l0220o915
14866c8634K6488k8415k0053L158m4151R9998J79759j01465K272R6309p6552r452
14854H9262m5647l6015m0468r6333P6182K39688J88071o583j29555P483L2481
14843B78566j78820j45278j1233J09944J13439m0772j28084n8439Q8276K0295
14833D7894o493k552M773n4789K5220m106R9220q4118j53199r981o5096n2222
14821b55449k5053J90744J13807L5797p8737R5227k350j8386o3012m3589P659
14810d3342Q8906R4906L6740q6988P274j3362J12309j2957p7357r3493M5716K2173
$$ y = [64786, -23478, -8704, 32283, 33129, 76746, 50709, 97080, 51590, -65075, -5072, 101756, 112781, 98466, 65105, 109846, 105234, 152589, 199390, 141920, 91587, 23174, -1499, -31719, -38634, -12146, -40561, -60614, -57456, -101607, -1609, 178150, 76685, 78957, 175266, 98714, 89262, 43615, 7600, -32868, -129201, -53019, 186669, 374740, 368157, 238602, 246085, 278566, 99746, -45532, -56765, 53179, 166618, 125846, -2238, -60677, 27599, 47894, 41401, 38849, 43622, -11167, 14053, 9947, 109167, 25049, -128150, -138131, -203227, -255449, -280502, -89758, 24049, 59846, -18891, 76336, 73986, 55600, -7412, -51001, -43342, 45564, 140470, 177210, 90222, 97496, 84134, 196443, 183486, 106129, 12636, 58352, 80525]
14798H0525n748l8147r4275j1845n6852L9029N2083J05239Q6004m964j79155k2626
14786e0732M4495m0992L8970q9806j48001M4654R5374M5596R2651m5421j02549
14775a15761j5784O5709p2874P2264R9464o013n0953K13186K8340m9794N059o8973
14763A03870n4700n5066O7024O3656l2022q9650J13058o8984j38828R81Q0343
14752a0318Q0976N3621R264q7206r6824L8452L2513j3210M8617K4994q923L604
14740G5560m7543k9672J16043L4582r8972Q0623J00709n8644N2384m0512j04776
14729G9782J02150k939n1778o0152j66999p2653L9296J23588M5555M5106j6871
14718F4085K4637J279m2664j1929r4933k1292O6839M3692M767j9499L4942M7444
$$ y = [80525, 74777, 36630, -57645, -69490, -126342, -87313, -35230, 70009, 156013, 151049, -28106, -50732, -6237, -47229, -8259, -98065, -246066, -201412, -106038, -60442, 32209, -13212, -115761, -131545, -65836, -138710, -66446, 33018, 27005, -23948, 189238, 217578, 167784, 172843, 103870, 49170, -5896, 61128, 124784, 92762, 3112, 116170, 47186, -91642, -90661, -10318, 70658, 124279, 133543, 46337, -50487, -12035, 20478, 7268, 55885, 80879, 71956, 75560, 28017, -1655, 114388, 148970, 49998, 130621, 231330, 172686, 225070, 184558, 79782, 181932, 178993, 127215, 67063, -99936, -172589, -133293, -9705, 35850, 80956, 64085, 88722, 90001, 47337, 35408, -59525, -80817, -13978, 29714, 34481, 14982, 49924, 97368]
14706I7368Q7097j0090j58412M4012J4083k15067L6124R9692K8417n7087O627
14695b7236j6340P6432K8715P0788M7892P6788j8043n1372r2387k23381k45068
14684c73212L1602J95714J16971m8516O9918k6580p927M2358j20796k11385j5421
14673c47274L0078J26961R1982O2837Q8112o6888n8156q5295Q3679J32963J55381
14662B14380l8699j76266j7280J33161n5565q4932J6945L2668K3921j08290n7482
14651a17439L2056O2290N3989k9809n9618N8378Q8512m0520m7110M6271r0427
14640d3427J2177l2043R4586L7204q5080j07661k4481Q6545Q3761M6699P6037
14629A44317n1350l6227L5775n0376L7997L8411j32778K6429L5916j8377R1344
$$ y = [97368, 184465, 174375, 15963, 59975, 74058, -141009, -104885, -5193, 23224, -33863, -27236, -43576, 32856, 61571, 132359, 180251, 257039, 238996, 187624, 95237, -128144, -373212, -341610, -145896, -28925, -77441, -7523, -34103, -42030, 328, -120468, -331853, -347274, -317196, -190235, -98253, -35416, 52696, -14192, -72348, -157643, -73964, 58999, 214380, 175681, -585, -17865, 115296, 59731, -25201, -8256, 24412, 48333, -59957, -117439, -85383, -23093, 30896, 1087, -58531, -153, 88359, 47839, 729, 47000, -43427, -31250, -63293, 31293, 68497, -16583, -124244, -148725, -62180, 21581, 68280, 144317, 92967, 56740, 92515, 42139, 80136, 118547, -14231, 12198, 48114, 29737, 121081]
14618A21081o922P7996m9160j21181N6596O8677N0785l3604p1694j97249O6896
14607c7779j3403K7373J3519j1554J9470L8369J49672K5180j5773k0952m0790
14596A33332J9595L2043j3040r644j0151L9507J01238p9289j06779J8125l3564
14585I1373J30453L9032m5289k6842J12579j19879o7178K4223P0458J6333m5242
14574A80021j3343N0835Q0030K9218q7732m1860j21370l3523p6277N3165l8310
14563a9146N8654J23856K7552j16478j604M7085M0381J7960l0050P7311k213p4017
14551A49291k2428O2081k5733N0301L120j35638j01563k988R035P1086p249L4280
14539H3595K4277N4672L9521n7710J7716m7323j7918L9959J67318J71832N7296
$$ y = [121081, 114159, 192155, 142995, 21814, 78410, 147087, 197872, 164268, 92574, -104675, -37779, -51182, -23809, -10290, -21844, -2374, 35995, 185667, 210847, 195074, 174122, 133332, 152927, 184970, 171930, 162286, 152135, 191642, 292880, 213591, 106812, 124937, 91373, 221826, 260858, 215569, 188727, 301306, 181427, 114249, 138472, 208930, 225263, 180021, 166678, 217513, 297543, 326761, 239029, 197169, 75799, 42276, -34001, 19164, -19146, 39508, 163364, 190916, 74438, 72834, 119919, 160300, 178260, 148210, 225521, 223308, 149291, 126863, 188944, 163211, 213512, 216632, 80994, -20569, -23557, -14522, 56564, 49315, 83595, 107872, 162544, 202065, 144355, 162071, 114748, 96830, 136789, 304107, 475939, 533235]
14528E33235K7760Q7740J40879K19290K53297K03480J81655L16096K19142N9103
14518B241677j9496m2189k61370l16739k33590j62272k85829j49707k596m4510
14508G23379j84593j74671o3103K9986K4029P2941l822N3651o0751p8514Q5724
14497D24256J6162k3857M4808N7937Q8563P368N1940Q4591K14864K59828J82368
14486A408828J83319J51582K40554K81071J85931j06693j70630j77302k15172
14477A781488j94151k34124j80700j21784j69611k66576l5432n4236j10119n9988
14467C54767O734L4789r3687j69302n9908L2028p2846L1770J09959R9333R047
14456B82684J4704L20O419M984K560K0871n3975R4270L3823k52600L4843J26107
$$ y = [533235, 560995, 648735, 789614, 1008904, 1262201, 1465681, 1647336, 1963432, 2182574, 2241677, 2222181, 2179992, 1918622, 1601883, 1368293, 1206021, 920192, 770485, 767889, 723379, 538786, 364115, 301012, 330998, 355027, 427968, 424146, 477797, 417046, 338532, 424256, 440418, 416561, 461369, 519306, 607869, 615237, 667177, 751768, 966632, 1226460, 1408828, 1592147, 1743729, 1984283, 2265354, 2451285, 2344592, 2173962, 1996660, 1781488, 1587337, 1353213, 1172513, 1050729, 881118, 614542, 579110, 524874, 414755, 354767, 361501, 396290, 302603, 133301, 73393, 105421, 32575, 64345, 174304, 273637, 282684, 297388, 297708, 304127, 309111, 311671, 332542, 278567, 372837, 406660, 154060, 188903, 315010]
14444C15010j66684p4003k1867Q2633l1496O6593L3323L1060n600n4210o2552
14433A12207k7498p3691l9454M2460J5213K0768k9986j0158J61369R4844n3421
14422B12653O7761M5581K6977j10162L8030Q648k7817m7503l1335O0370L4927
14411B78130n6577l9338l6604j0883J11785O3072Q739L1151P912q1267j3906n0135
14399B12079r911r0809p2418N8980J8919L4212O8064M3735J2044o7576p0970k5307
14387A11042M8350K6815M318L2942j21420j4967J10093N4340o1129j22427j110
14376F6847L0581P5479R479M455m115J4290J02441k0585j4433j3679J1079Q5013
14364C46852k4123M738q9007m4407O3746L3190K6067J4516j30150l1650q9171
$$ y = [315010, 148326, 74323, 52456, 135089, 103593, 170186, 203509, 234569, 228969, 174759, 112207, 84709, 11018, -28436, 14024, 29237, 50005, 20019, 9861, 171230, 266074, 212653, 280414, 325995, 352972, 242810, 280840, 289488, 261671, 214168, 182833, 243203, 278130, 221553, 182215, 145611, 134728, 246513, 309585, 318324, 349475, 357387, 276120, 262214, 212079, 202168, 111359, 38941, 97921, 116840, 151052, 219116, 262851, 274895, 207319, 136349, 111042, 159392, 186207, 190525, 223467, 102047, 87080, 197173, 251513, 190384, 67957, 66847, 97428, 172907, 182386, 186841, 182726, 197016, 299457, 278872, 264439, 250760, 261839, 346852, 322729, 327467, 238460, 194053, 257799, 290989, 317056, 331572, 201422, 169772, 80601]
14353H0601J1962J16827R527K2320O7221k5641j8603n3777r0732K8134q9680j76470
14341a18311Q5013K23220J30645K8357j68775k08559Q9873R3093K05662N6971
14331D17189o1022j0946N8984J35759O850J5027J3476r419l1824K807N0118j1894
14319E75105L844L5448P5110pk24872j70228p585J22565R0001k40193j01813J06323
14307B63698k3972o1615J5394r657k330o5000N0739J79527M073l496p4345m4316
14295B28700L4417J1844l8703N4501R1810J9415J16069J23599q4354N13P6720
14284F34531j7353m7803p1477q8099j5395J21739o0842m649K049k3918j02141
14273C26642l9402O6178K0769p8829J03629J77727l4874q0158r8559j6745p3667
$$ y = [80601, 92563, 209390, 218917, 241237, 308458, 282817, 264214, 210437, 119705, 147839, 58159, -118311, -33298, 189922, 320567, 348924, 180149, -28410, 61463, 154556, 360218, 417189, 356167, 345221, 404205, 539964, 546814, 561841, 575317, 565898, 534074, 536881, 586999, 575105, 578949, 614397, 689507, 689500, 464628, 294400, 286815, 409380, 499381, 259188, 157375, 263698, 239726, 178111, 193505, 183848, 181518, 116518, 167257, 346784, 350857, 347361, 273016, 228700, 263117, 274961, 236258, 290759, 382569, 401984, 518053, 641652, 557298, 557811, 634531, 617178, 569375, 497898, 409799, 394404, 516143, 455301, 450652, 452701, 428783, 326642, 287240, 353418, 374187, 295358, 398987, 576714, 541840, 461682, 363123, 346378, 272711]
14262B72711M1528r1449k2536N7637P3697j40971j07853N5770l8135N5133O1087
14251B16619N1000r932Q214J2371L4783k7867J9887j4506J6982L011N6840N7408
14239D24810J22532J2138n1464q2587M8481J06362K6660n3504j83625n6036o122
14228C07645j1179m47q8757j19591R1069k5211P5007K3015J7861O2398P0824k4878
14216C77756M8390o4972Q8045J5057M5523J7966m8543m5014M5393J59399J06257
14205G45257p7922J8811J8821n7505k5335L5919k3817k4222n7790L9042M2100
14194F33359R0010K5114j361O6957l3635j16884J2006J5012k44075m2610J41700
14183E45593P8422o9647j26779K6677Q9491o9132q4999J9538J68636J16906L9469
$$ y = [272711, 314239, 222790, 200254, 257891, 331588, 190617, 82764, 138534, 100399, 155532, 216619, 267619, 257687, 265901, 278272, 313055, 285188, 305075, 290569, 307551, 310562, 367402, 424810, 547342, 559480, 508016, 425429, 473910, 580272, 606932, 553428, 369803, 313767, 307645, 296466, 296019, 207262, 87671, 178740, 153529, 228536, 251551, 269412, 331810, 402634, 377756, 426146, 361174, 449219, 464276, 509799, 527765, 479222, 434208, 479601, 639000, 745257, 667335, 686146, 704967, 647462, 622127, 658046, 634229, 610007, 552217, 591259, 633359, 723369, 748483, 747122, 814079, 780444, 663560, 675566, 690578, 446503, 403893, 545593, 624015, 554368, 427589, 454266, 543757, 474625, 389626, 409164, 577800, 694706, 734175]
14172G34175O4277Q3991l9156L5699P7627P2732M9116j13880O1312L8802j6534
14161A048161l1600l3532n2531J32610O0143P4607p4987j13172j4669M9425J3534
14150A057989J4433J2430l080J2610k5357n1209J8845K58476K771N055O5588l3225
14138A335326N8022N0073J15381k2325l4053P8841K08766J20640l1778J26563
14128B005456O3996L8986O5834J08522O6731J0970M8403J07002R7617K27821K47344
14117C088682J48073M6878J60299J32474O5021K17835K96389J00275J64369K35633
14107D655928J88409K93770M05281M51407L86701M52706N35731O89963P78215
14098H838111P65998Q02018J017113J194287J320935J568300K021209K510990
$$ y = [734175, 798452, 882443, 843287, 878986, 956613, 1029345, 1078461, 964581, 1025893, 1064695, 1048161, 1016561, 983029, 930498, 1063108, 1123251, 1197858, 1122871, 1009699, 995030, 1044455, 1057989, 1072422, 1084852, 1081772, 1094382, 1069025, 1017816, 1036661, 1295137, 1297908, 1302963, 1368551, 1335326, 1393348, 1443421, 1558802, 1536477, 1502424, 1581265, 1790031, 1910671, 1878893, 2005456, 2069452, 2108438, 2174272, 2282794, 2349525, 2360495, 2408898, 2515900, 2613517, 2841338, 3088682, 3236755, 3283633, 3443932, 3576406, 3641427, 3859262, 4155651, 4255926, 4420295, 4655928, 4844337, 5138107, 5543388, 5994795, 6381496, 6834202, 7369933, 8059896, 8838111, 9604109, 10406127, 11423240, 12617527, 13938462, 15506762, 17527971, 20038961]
14090B0038961K825935L423286M022002M600571M924088N445880O396787P841621
14082E9519131J0085624J3746868J9274926K6504545L4063593L9738578M3135332
14075B46068597M3604301M0574473L3582706K2578492P557180q423961k2345731
14068C63196057l2352563l8724741m1606747m1347738l7952175l1931940k4813470
14061A14466683j8350426j3269068r636805p271514n350436m042362k799485j702926
14053E2043661p04702L42360J378496K347530L064366L885047M738282O130079
14045G3225119P962162J0717595J5137646K1407193K9088230L5939036M0745360
14038B34222341M2661065M1385897L6671587K7978190J4909939j185091j6816461
$$ y = [20038961, 22864896, 26288182, 30310184, 34910755, 39834843, 45280723, 51677510, 59519131, 69604755, 83351623, 102626549, 129131094, 163194687, 202933265, 246068597, 289672898, 330247371, 363830077, 386408569, 393965749, 385541788, 363196057, 330843494, 292118753, 250512006, 209164268, 171212093, 139280153, 114466683, 96116257, 82847189, 73210384, 65938870, 60588434, 56546072, 53746587, 52043661, 51338959, 51681319, 53059815, 55407345, 58471711, 62356758, 67095040, 73225119, 81187281, 91904876, 107042522, 128449715, 157537945, 193476981, 234222341, 276883406, 318269303, 354940890, 382919080, 397829019, 396643928, 379827467]
14031C79827467k9500055l8155280m2978576m4353455m2615324l7804329l0867623
14024A13552825k3570698j7426055j2862356r676941p519523o041855m971412
14017C1483985m091919l655973l104344k566521k217114j991506j643714j325230
14009A0887664j162971r40791p81306p59335n98299m24061l48393k77735k05000
14000E389773l21996l28944l44627o743m0602k52448l09114k54957j85142k42091
13990C103109j60492j20998p0530k0137j07157j46158j62566j91765N0787K908
13980B177001j1269j25642j30301l6041p3732m2088j5599q9198n5692K2288j04072
13969A515655o2146r8094j13853p1656j74876m1220J01769J15867n638o383q3115
$$ y = [379827467, 350327412, 312172132, 269193556, 224840101, 182224777, 144420448, 113552825, 89982127, 72556072, 59693716, 50016775, 42497252, 36455397, 31483985, 27392066, 23736093, 20631749, 18065228, 15848114, 13856608, 12212894, 10887664, 9724693, 8783902, 8002596, 7243261, 6644962, 6220901, 5872508, 5594773, 5389773, 5067777, 4738833, 4394206, 4387463, 4346861, 4094413, 3785299, 3530342, 3345200, 3103109, 2942617, 2821619, 2751089, 2730952, 2623795, 2477637, 2315071, 2123306, 2174093, 2177001, 2165732, 2040090, 1909789, 1873748, 1800016, 1757928, 1742329, 1653131, 1597439, 1619727, 1515655, 1453509, 1355415, 1241562, 1169906, 995030, 953810, 1055579, 1171446, 1165808, 1159425, 1076310]
13958A076310l2115N2151k760j51845r4709l69J19239J32343R509p1810j40006
13947H95938k7881l6316j1300Q3073r2343j40297j33491o5856J63364l0043j2249
13936E92599J54769N8282j0113p4120K9845M4603l2813j5550q5083m0340L1420
13925F53499J170n201n1093j1822p2010R447J1993l3025j68026j27009j01495
13914A06428Q0010L8982J53746k814J62170N8338N4574N9601O485l792o3594j02348
13902E47786k8514m0534j1008J031j8933Q3346J6742J6343n5607q504L8388J9075
13890E59611k9510L4808k0294J5177k8996n9848M4592Q5495r3202j60716j38428
13879B08689R3718P6637j00569j52438J6271J51070m586j32330q545m8265o3927
$$ y = [1076310, 1044195, 1096346, 1093586, 941741, 847032, 846663, 965902, 1098245, 1107754, 1035944, 895938, 868057, 831741, 820441, 903514, 811171, 670874, 537383, 471527, 634891, 604848, 592599, 747368, 805650, 795537, 721417, 751262, 795865, 763052, 747502, 662419, 622079, 653499, 654669, 649468, 598375, 586553, 514543, 523990, 535983, 502958, 334932, 207923, 106428, 186438, 225420, 379166, 376352, 538522, 596860, 651434, 711035, 717520, 713728, 650134, 547786, 519272, 478738, 467730, 468761, 449828, 533174, 549916, 566259, 510652, 502148, 540536, 559611, 530101, 564909, 544615, 559792, 530796, 470948, 515540, 601035, 507833, 347117, 208689, 302407, 379044, 278475, 126037, 142308, 293378, 288792, 156462, 147917, 99652, 35725]
13868C5725o7994l0405J2284R6983M2164J6631k3180l8577l6718J34633J24275
13857B65821m9461j70324m3423N8160R1699Q3180P3450L9967j11249j33685m3978
13846F0157Q7432P0614o1855N6377l6035j18374p7146j63153p5898Q7652N210
13835a65019q3113P4859N6614m0909J6616M1708N4072L0923l5118K0504p9587
13824a08450m2358j3650k97J32271r3472o971O1900L4774J24517R5380q1778j03302
13812a436r2907o3468L4907J4403l8599O9603J27015r8241n9113K9574J33238
13801E4976J17520k5646k1759m0275j01239q1502J3308O8128K8574Q0003N9254
13790A51342j23134r1399J4826o5057l7070q1411n9272o0640l963O1982J28974
$$ y = [35725, -32269, -62674, -50390, 46593, 88757, 105388, 82208, 43631, 6913, 141546, 265821, 216360, 46036, 2613, 60773, 152472, 235652, 309102, 349069, 237820, 104135, 60157, 147589, 218203, 156348, 212725, 176690, 58316, -18830, -181983, -257881, -170229, -165019, -248132, -173273, -116659, -157568, -140952, -99244, -45172, -14249, -49367, -28863, -108450, -150808, -164458, -164755, -32484, -125956, -132927, -71027, -36253, 88264, 183644, 101866, -1436, -94343, -157811, -122904, -108501, -147100, -77497, 49518, -48723, -107836, -78262, 54976, 172496, 146850, 125091, 84816, -16423, -97925, -84617, -16489, 12085, 92088, 151342, 28208, -63191, -48365, -113422, -150492, -231903, -291175, -351815, -355778, -293796, -164822]
13779a64822K31287J16513m0336k9507k3816j17571r9624J8326J652Q931J0450
13768h8517J33436m931O8555l9540K1965M3733J7266o3221R3995R036K1387k1544
13756A91620l5597l8138n6105r2946j3963Q727k4757q869q820j07662J02220p6879
13744a61169p7640J02439J02246L5856R946m6133J26134M7676p1742l7141o1860
13733c1388M4527J71584O1598k0621j32289j718l3546q519q798O9827o0135q9475
13721c8953M4839m0965p7846L0723N0727K0749R0607L9614Q373j42847J2233p5918
13709g8664M1865M4633o028J10J2916M860p8216K6590J07926j00009r6877O007
13697a14887N1100J13832R956l9626m4019J7722J08500l0160o4084q4084J138
$$ y = [-164822, 66465, 182978, 142642, 113135, 89319, -28252, -127876, -109550, -107898, -98967, -88517, 44919, 39988, 108543, 69003, 90968, 134701, 151967, 88746, 182741, 191777, 213164, 191620, 156023, 117885, 61780, -31166, -45129, -36402, -61159, -70028, -78848, -186510, -84290, -161169, -238809, -136370, -34124, 1732, 11678, -34455, 91679, 139355, 67613, 30472, -31388, 13139, 184723, 246321, 225700, 93411, 91693, 58147, 49628, 40830, 110657, 50522, -38953, 5886, -35079, -112925, -82202, -31475, -10726, 79881, 119495, 127868, -14979, -2746, -78664, -36799, 7834, 1806, 1916, 14832, 19692, -58524, -31934, 75992, -24017, -120894, -114887, -63787, 50045, 60001, 20375, -23644, -5922, 102578, 72418, 8334, -75750, -74612]
13686g4612j1359k6656p8967P5738J50899N8509j199j7124m8482P8176J3263j3462
13674A04724j45913j6722K9806M4742M2135q0707q6807N2308k3799J20687P2230
13663A12684l9738j34568M6889L5994L9156N9485j23048j67395k7558J16133J76446
13652I4480r995n7897k646o7617L1835n4610j0510J46990J93297l225r3053j51330
13640A5719J45236J27815j34834n6288N7686k9403l1647Q587n1122J976J74539
13629B28264M6240K5593L5884J50476J37710J36920J71985K20043J58776O2206
13619A374097L43995L06457Q0268k8078R1190q4895k19831k32007k86025j46217
13609A198954q7993q3153k68386k61502k6649P8509l3993m3828q4493r5226M879
$$ y = [-74612, -85971, -112627, -191594, -115856, 35043, 93552, 92353, 75229, 26747, 104923, 118186, 104724, -41189, -57911, -28105, 16637, 58772, -21935, -108742, -56434, -80233, 40454, 112684, 72946, -61622, -14733, 21261, 60417, 119902, -3146, -170541, -198099, -81966, 94480, 84485, 26588, 23942, -43675, -11840, -66450, -76960, 70030, 263327, 260102, 167049, 15719, 160955, 288770, 153936, 97648, 155334, 125931, 94284, 102871, 51749, 53725, 228264, 274504, 300097, 335981, 486457, 624167, 761087, 933072, 1153115, 1311891, 1374097, 1718092, 2024549, 2104817, 2076739, 2167929, 2083034, 1863203, 1631196, 1345171, 1198954, 1110961, 1027808, 759422, 497920, 471271, 549780, 515787, 471959, 387466, 292240, 297119]
13598B97119r3815K2597M8155L3000o7102J5607j1128n6461K2522J11054J47490
13587D69038J77792J52655J68005Q4258J86531K62014L18077K73186K99l0352
13577B061503p2092j21558j72266j69740k36844j81884j55675j09574k21586j43080
13567D77204n3050j52109j57110M4940M2673m4061J3223N9028p5541n3345J4836
13556A16688k2169n2893K7519q2348j14211K8827L5319K3395Q8732K0146j24029
13545e5024o3897m1292l0008M3751J2039N3265n450k216Q22l805P0699P3020Q8418
13532A40322J4883j07903j36899O0784N7892l9322m5063J44379J4568l0225q0370
13521f954j8991m3323P2354j12520N8753R1878j02482J4012l6564N1778n2107
$$ y = [297119, 203304, 225901, 274056, 307056, 239954, 255561, 244433, 187972, 210494, 321548, 469038, 646830, 799485, 967490, 1051748, 1238279, 1500293, 1818370, 2091556, 2091855, 2061503, 1989411, 1867853, 1695587, 1525847, 1289003, 1107119, 951444, 841870, 620284, 477204, 424154, 272045, 114935, 159875, 202548, 158487, 171710, 230738, 155197, 101852, 116688, 94519, 41626, 69145, -13203, -127414, -98587, -63268, -39873, 48859, 69005, -55024, -118921, -160213, -190221, -146470, -134431, -81166, -86616, -88832, -88010, -91815, -21116, 51904, 140322, 155205, 47302, -89597, -28813, 29079, -10243, -55306, 89073, 103641, 73416, -6954, -25945, -69268, 3086, -109434, -50681, 41197, -61285, -47273, -83837, -32059, -84166]
13510h4166N045J00095M3250j30249j79288J1648J26865J36650K0113o5073n3041
13499f8151o1127J18221N4324o6483m1153j6226J53755J12446l1205o7636L8652
13488A25417k083q5658N1936O6164k2929O4823j51257o206p0414n9151N2200n6418
13476i3576Q4321N2875j30609r51Q2835J2213p1251J1915Q1545j32979j07209
13465b10871J24063R2854M2892j16855j35823L7181l2802q003K5416J4597n2633
13454b19984J72235J69824o1241r3777R669k5236j0637q7034K1927N5997R5049
13443B6792m4249R9040m2708p9016o6195J1575O5520J19889J13895J8584j5514
13432B07613O4228N4800p5742j08832m4645M6935L2040r4693M9151J65744n0864
$$ y = [-84166, -79121, 20974, 64224, -66025, -245313, -233665, -106800, 29850, 49963, -15110, -68151, -129278, -11057, 43267, -23216, -64369, -80595, 73160, 185606, 154401, 86765, 125417, 123334, 37676, 89612, 155776, 132847, 197670, 46413, 40207, -30207, -89358, -37158, -93576, -9255, 43620, -86989, -87940, -5105, 7108, -64143, -52228, 29317, -103662, -210871, -86808, 6046, 48938, -67917, -203740, -166559, -199361, -207364, -181948, -167351, -219984, -47749, 122075, 60834, -32943, -23274, -48510, -59147, -146181, -124254, -68257, 26792, -17457, 81583, 38875, -40141, -106336, -94761, -29241, 90648, 204543, 223127, 207613, 271841, 326641, 250899, 142067, 97422, 144357, 176397, 81704, 130855, 296599, 245735]
13421B45735j19763j95438p6124j00574J14612k2664q8993J29926J97074N8699
13411A42490q3342j13147Q901K2169K4982n954L861j1283L0731q3598l7810L7723
13399f4277n4629M9184K961M9736k9106J25087J28595j3898j01871q6334J36063
13388A41511o7483L0394P3595L8657l8129R574J6124j28899r3873L639N8417m596
13376C8931L1785q023k2410j57465r7304n792o7809M2704J40641k0071n8862J02691
13364h0984M8309J24070J8975j81393m1150Q0643M2387J981k0924j9344j3600
13353d1030n3255m1401M5811P1762q0456J7749J7885n1263L2285M6542j1367r6774
13341a43512L095J43055P6833q1534j30938n439J012K2457K7489O4047J7313J2463
$$ y = [245735, 125972, -69466, -145590, -246164, -131552, -154216, -243209, -113283, 83791, 142490, 59148, -53999, -45098, -22929, 2053, -3901, -40, -11323, 19408, -64190, -102000, -64277, -118906, -69722, -66761, -17025, -46131, 78956, 207551, 193653, 91782, 5448, 141511, 74028, 104422, 178017, 216674, 178545, 188119, 204243, 75344, -18529, -14890, 43527, 38931, 70716, 62693, 40283, -117182, -214486, -220278, -288087, -245383, -104742, -124813, -183675, -80984, -32675, 91395, 110370, -71023, -112173, -31530, 10857, 12838, -8086, -27430, -41030, -94285, -135686, -89875, -18113, -98569, -80820, -62935, -114198, -81913, -35371, -46738, -143512, -140417, 2638, 79471, -2063, -133001, -138440, -137428, -114971, -87482, -23435, -6122, 6341]
13329F341n9809p0168q6732n45N3780j13151O2416P8600J0732J29711Q5546l6185
13317F0536M210r558R076R7873q6761j73781P6374O264J6594O2092j6983l7192
13305H744p1696K3987p3355J01J5089J24499N3729J3360J8574N120j6344l2322
13293F9486J16513M1497j1544o7112o5927m1776R5666k0474n3008k7207k6120
13282I994j16540r087N5873N5702k4050k1695j0572J3530j26573k7247J0724M3229
13270a46712R2953j3950M6532L963l7751Q184M7021j9795Q5727j3679n1112m978
13258c597m6511P9719L6421J520p5253J05601n2597j4302L2283L2808L0396M4929
13246A71417q8849j40619j20465k8691p4342J18041O2159P7541P402J0941J07068
$$ y = [6341, -53468, -123636, -210368, -210913, -157133, -270284, -207868, -129268, -118536, 11175, 96721, 60536, 64746, 55188, 64264, 162137, 75376, -98405, -22031, -15767, 827, 62919, 45936, 8744, -62952, -38965, -112320, -112219, -97130, 27369, 81098, 94458, 113032, 118152, 101808, 69486, 185999, 227496, 215952, 148840, 82913, 41137, 136803, 116329, 63321, 36114, 9994, -106546, -115633, -59760, -4058, -28108, -49803, -60375, -46845, -173418, -200665, -189941, -146712, -53759, -67709, -21177, -17214, -54965, -46781, 240, -19555, 66172, 52493, 1381, -3597, -50108, 29611, 66032, 67552, -7701, 97900, 45303, 31001, 63284, 96092, 126488, 171417, 82568, -58051, -178516, -207207, -281549, -163508, -101349, -23808, -16406, -5465, 101603]
13235A01603L5903J41496P122J5943j87317j14653J5320l9988K9714Q506k3280
13224i631j21012n552K7925l6305j0776J0233O7111J36157j478j5073l4852m0183
13212c3436K0201J6226N5051R2932q1020k8487m7761j518k8489l3926l4491m58
13200a05176n1658k2068Q1808J1728N7462p1764j02917L1813k609r808Q4472J59963
13188F1246J4320q4892p2154J22745K6188j2270Q6726j3103j92479q6145P2412
13177g7406O1042r5711p6450m1032l2126Q2228N4087j4895M0302O3442o5320L4076
13165f7763J17383L1848M278K602j1464j10984k4553q3129R5001M1526o4992q2530
13153a52777L1063J10965R3325P1053p32k9937j04662k674L7652K2110p3126n1227
$$ y = [101603, 137506, 279002, 286124, 302067, 114750, 97, 15417, -24571, 5143, 13649, -9631, -130643, -136195, -108270, -144575, -155351, -145118, -78007, 58150, 56672, 41599, 6747, -33436, -13235, 2991, 58042, 150974, 69954, 41467, -6294, -7812, -36301, -70227, -104718, -105176, -156834, -178902, -97094, -85366, -27904, -99668, -202585, -170772, -173381, -183189, -98717, 61246, 75566, -9326, -81480, 41265, 67453, 55183, 141909, 128806, -63673, -149818, -77406, -16364, -112075, -188525, -229557, -261683, -179455, -125368, -140263, -99961, -36519, -101839, -67763, 49620, 81468, 85746, 88348, 76884, -34100, -58653, -141782, -46781, -5255, -70247, -152777, -121714, -10749, 82576, 153629, 152897, 122960, 18298, 15624, 53276, 75386, 2260, -48967]
13141d8967k2560J06284n9350j27433K6335m5981m169N7888O2176p8648j34218
13130b68643J0623R0342j6324l3727J5494R326O3148N1811R6813J24048j4112
13119A28799j18288N4607J50275k1148j10838k6197J0106j14193j38054O4055
13109a20876K2670K6381N8984J9903K5485j5445l5143Q1377J1974L0596N6537
13098A62443j95432j82103L8742P2327J3611J258o0627J13990J24184P1046q265
13087A51174p9734j49480j26885m0215P6604m8971J3602J20241R915Q8270M5476
13076E9997k1299K3142N2162J2486m077r431j41374j6703n563N1565r493K6604
13064A8016J05024n089L6611M2641P2633Q8281j5474o4021j27861l5199k3090
$$ y = [-48967, -71527, 34757, -24593, -152026, -125691, -171672, -175841, -117953, -55777, -134425, -268643, -258020, -167678, -184002, -217729, -202235, -192909, -129761, -77950, 18863, 142911, 128799, 10511, 65118, 215393, 194245, 83407, 57210, 67316, -46877, -184931, -120876, -98206, -71825, -12841, 7062, 32547, 17102, -18041, 63336, 75310, 105906, 162443, -32989, -215092, -176350, -104023, -90412, -89154, -149781, -35791, 88393, 159439, 151174, 71440, -78040, -204925, -245140, -168536, -217507, -203905, -83664, -73749, 14521, 59997, 38698, 61840, 114002, 126488, 122411, 112980, -28394, -45097, -50660, 905, -8588, 18016, 123040, 117951, 154562, 197203, 269836, 358117, 342643, 278622, 150761, 115562, 92472]
13053I2472O6879r2062p3916R2711k8058k8013K0810n1452P7022j3188j9081n1208
13041g084Q6043R8441q81r0819j22322l3728J13445K4671k4977j13458j1310K3880
13029e8099R9095N1178k4597n9979j7865j3543R3726k8309j42170n4882J0484
13018a44961R7484R7415k4431r9886K8200Q3624p8352O6113n5347J0714J13633
13007I4206J26316r3408k32192J1365P1471r7208J9084P6232m4907j40419M4255
12996a65205L3238o7858L9090K2449J04334K824O1682Q1060N3432P6416o8747
12985A72715k12923j75395r4051k9999J18707L1734n9830o623k4370P7259R4128
12974a08648R2092k45q0124j6748P7881P0313n1444m0242j0539k6888O7743J35819
$$ y = [92472, 159351, 67289, -6627, 86084, 58026, 30013, 50823, -629, 76393, 63205, 44124, -7084, 78959, 177400, 176519, 85700, -36622, -70350, 43095, 67766, 42789, -70669, -81979, -58099, 40996, 92174, 67577, 7598, -10267, -23810, 69916, 41607, -100563, -155445, -144961, -47477, 49938, 25507, -74379, -46179, 37445, -40907, 25206, -30141, -19427, 94206, 220522, 127114, -105078, -93713, -22242, -119450, -100366, -24134, -69041, -209460, -165205, -131967, -199825, -160735, -138286, -33952, -31128, 30554, 111614, 165046, 241462, 172715, -40208, -215603, -309654, -339653, -220946, -189212, -249042, -255665, -280035, -202776, -108648, -16556, -16801, -96925, -113673, -35792, 34521, -16923, -57165, -67704, -94592, -26849, 108970]
12962A08970J2351n3503o2345k8649n3431j29202m0028J23676R5258j20812o6569
12951b14284O3554k1793R479l6563n4429O8320l229j11332n5931m9288N0824J07238
12939b47434n0644j8837J46984K50554l0556n8289M954P9683O7968M5317p2398
12928A17302l7592K9391m2268r139L7287L3741p3423r7164P617L8480n9037m304
12916e9109O4011J3961m1519l288M3603L8593o5287p1190N4081K7790j9076p4297
12904i1727Q8956Q9303R0900L307j34635M4076Q713p7139l1134o8764m6005m1541
12892a65690j3841M6400K8597m355M3093N8173J05897J18046J9584k1961J8343
12881B32286m0596j61841m1813o009j8746q364j19812O544J07372J24589J7115
$$ y = [108970, 121321, 67818, 5473, -23176, -76607, -205809, -245837, -122161, -26903, -147715, -214284, -150730, -172523, -163044, -199607, -254036, -185716, -188945, -300277, -356208, -405496, -354672, -247434, -298078, -316915, -169931, 80623, 50067, -8222, -3268, 76415, 144383, 189700, 117302, 79710, 109101, 66833, 57694, 94981, 128722, 55299, -41865, -34248, 4232, -54805, -59109, 4902, 18863, -22656, -25944, 17659, 56252, -9035, -80225, -26144, 1646, -17430, -91727, -2771, 86532, 177432, 180739, 46104, 90180, 98893, 21754, -9380, -78144, -124149, -165690, -179531, -133131, -104534, -108889, -65796, -7623, 98274, 216320, 235904, 213943, 232286, 191690, 29849, -11964, -17973, -36719, -45083, -164895, -158351, -50979, 73610, 90725]
12870I0725r8180j17551M1975J1103J03888K7710o1847o8771q9159l6597M7070
12859a49634n5798R8865J0136j2553K2070J02612o2254l8891K5508L7386O1136
12848C8583K3433l3886J0246j04708o6964k7221r3003r7982P2190J11767K9159
12837a38386K2869O8629J7916r1630N6504q76P7443O1506j03256J09144l2364
12826D7499k12155J29916J27998J64384J8717k29998j31843p4227n6746L1722
12816a84733O3282o235j00867o3484N8628P6745J04922k2796K4869J640p8527
12805a26556p632R7592J35858k7019m9080p4401n0826n1411N5859j1061J63529
12794E4852Q42k3983r3022J3198o2806J10138L0490j25864p0755k2912Q448O1890
$$ y = [90725, -7455, -125006, -83031, -71928, 31960, 59670, -2177, -70948, -160107, -196704, -149634, -205432, -106567, -96431, -108984, -86914, 15698, -46556, -85447, -59939, -22553, 38583, 62016, 28130, 38376, -66332, -133296, -160517, -253520, -351502, -279312, -167545, -138386, -115517, -46888, -28972, -120602, -64098, -64974, 12469, 73975, -29281, 79863, 47499, -164656, -34740, 93258, 257642, 276359, 46361, -85482, -159709, -216455, -184733, -121451, -127686, -228553, -292037, -233409, -156664, -51742, -74538, -49669, -48029, -126556, -134188, -36596, 99262, 72243, 23163, -51238, -102064, -153475, -97616, -108677, 54852, 55694, 31711, -61311, -48113, -110919, -781, 29709, -96155, -166910, -189822, -181374, -119484]
12782a19484q709j28732j4791J06837L8083q2764j0753J47998J6295K7676P172
12771b1172m2064l6285P3713N9215q457O900m5654j3433N8458L7770r0253q1779
12759a03041N6437M3438M6917p6270k4686n172R778J4781N4824l0614k3501q5584
12747a22693m8682n9079L5781L8975M1507L8318p427k2073o6513r351J52547J13416
12735H4726p8984j3160K6218j9633L7443j31591j1739P1281K4402j4836K4177
12724a696Q5421m7091j21489n6891J986K6443L5804J09869l2060j16453P0545
12713d5612N7390M1985O0975n9678p0745j21670l1941M6899L7479K2832P1985
12702I899j57041k8723J10285R7620N4475L2118r6418j00038l3264N4479N7489
$$ y = [-119484, -128193, -256925, -271716, -164879, -126796, -209560, -220313, -72315, -56020, -28344, -21172, -63236, -99521, -25808, 33407, 24950, 31850, -13804, -27237, 31221, 68991, -21262, -103041, -46604, -3166, 43751, -32519, -57205, -62377, -52599, -37818, 17006, -13608, -37109, -122693, -171375, -230454, -194673, -155698, -114191, -75873, -83300, -105373, -171886, -181237, -28690, 84726, 5742, -7418, 18800, -833, 36610, -94981, -106720, -35439, -11037, -25873, -1696, 83725, 36634, -84855, -141746, -139760, -113317, -77513, 32356, 296, -116157, -45612, 11778, 53763, 114738, 55060, -15685, -137355, -169296, -122397, -84918, -62086, 9899, -147142, -175865, -65580, 32040, 86515, 118633, 22215, -77823, -111087, -56608, 881]
12691H81J3361p5209J9587N5911M3564Q519m3119r3611l9344L9093m1606J4090
12679i7883K2202M4087P9489R4671N2918j08855q0662J2952K8770R1915N23l8080
12667A02047n2379n8168K0337l941m7125k8890n5057l1578L2470N8240K3373j26524
12655a67195n8175K8007p9641Q9799R5559P8100m4944N7764P336q146N4554o7217
12643a4199o9050J0659J22074J71004j03952j55612J6300K6444l3292r6040j36865
12632b62529K0226J66155L4846q6039J5499J15512q0658n9488Q8349Q4532K9039
12621F5444k6576j10699J02671m1313k314k8489N9870J0806J9386l8906R014N4653
12609G3547O561p8899Q8625P9797p8760j15796l7026Q667K3169k6794P8746M9301
$$ y = [881, 14242, -60967, -41380, 14531, 58095, 66614, 23495, -70116, -109460, -70367, -111973, -97883, -75681, -31594, 47895, 142566, 195484, 86629, 5967, 18919, 47689, 139604, 140127, 102047, 49668, -8500, 11837, 7896, -39229, -68119, -123176, -154754, -122284, -64044, -40671, -167195, -225370, -197363, -277004, -187205, -91646, -13546, -58490, -726, 6610, -1536, 53018, -14199, -83249, -72590, 49484, 220488, 116536, -39076, -22776, 3668, -29624, -125664, -262529, -242303, -76148, -41302, -127341, -111842, 3670, -76988, -136476, -48127, 36405, 65444, 38868, -71831, 30840, -10473, -12787, -41276, 18594, 29400, 48786, 9880, 18894, 73547, 80108, 1209, 89834, 169631, 90871, -24925, -61951, -53284, -30115, -56909, 21837, 71138]
12597G1138p9806j10225n709k2501L6731K6396M5153r4950L4136Q6731Q950N4124
12585E0168j20806m9816M1563J1291j3291O7988j5081J7691K8345j38820p7957
12574a98725J60131J76597K12439p8378j06059o1462r7180m6364j9666j11208
12564a69875L8382J09469j11131K4948J5970L6729P8032J64850j1025r4073l2726
12553D9550P2969J54231r8961k7665p5856j51315J2587J29119j4987p8256M2071
12542A3487m3426p1611N6284P5248j2186q1644j33897M7998J24362M9386J6615
12531D0616l106l1959j29465M8825Q2862J2153o0731l76P116n433m4113L970l5272
12518a14913O0830J28115O281m7002j14640p9895N7919N2190n9861Q1584Q791
$$ y = [71138, -8668, -118893, -124602, -147103, -110372, -83976, -38823, -133773, -99637, -12906, -3956, 50168, -70638, -120454, -78891, -67600, -80891, -12903, -27984, -10293, 18052, -120768, -198725, -38594, 138003, 350442, 272064, 166005, 104543, 7363, -39001, -58667, -169875, -131493, -22024, -133155, -108207, -92237, -55508, 22524, 187374, 176349, 82276, 49550, 122519, 276750, 177789, 150124, 74268, -77047, -64460, 64659, 49672, -28584, 13487, -29939, -101550, -45266, 29982, 17796, -63848, -197745, -149747, -25385, 24001, 40616, 37510, 5551, -123914, -75089, 7773, 19926, -40805, -41181, -34065, -39498, -83611, -79641, -114913, -54083, 74032, 80313, 33311, -81329, -161224, -103305, -51115, -110976, -29392, -20601]
12507b0601K5947K8769l6381J3271o1186k6551N9341J6927P3107j0251M8601j7178
12495I3815n2960j28703Q977J14647N5700Q268m4965l9719M1055j4167j9604K2113
12483D4457p8928j06403J32909J0318N1203r698j22573n8322M6430q3588j01542
12472b75737p1068R2787Q2343R697J4926O9692N0584J17365N0105l4434j24882
12461a8622j9800J34630k1340m39O0202n1728o6348J1126l7515j08844j25425
12450b44103P430Q6526j4115k333k1513O9744J82762R6746q0125j02992R9884
12439G7911O3181N5855n727p0865p5742L2102k1524q1577N2194o0749n3748O888
12427h1801M5589j6721M3666R9138k6019p1372j21780Q6049J14101p0404o6940
$$ y = [-20601, 5346, 34115, -2266, 11005, -50181, -76732, -17391, -464, 72643, 62392, 110993, 93815, 40855, -87848, -78871, 35776, 91476, 99744, 54779, 15060, 56115, 41948, 22344, 44457, -34471, -140874, -7965, 2353, 53556, 43858, -78715, -137037, -90607, -174195, -275737, -346805, -254018, -171675, -161978, -147052, -77360, -26776, 90589, 140694, 106260, -18622, -38422, 96208, 74868, 74429, 134631, 82903, 16555, 27681, -9834, -118678, -244103, -236673, -150147, -164262, -166595, -188108, -118364, 64398, 161144, 81019, -21973, 77911, 141092, 196947, 191220, 120355, 44613, 76715, 55191, -26386, 25808, -34941, -88689, -81801, -36212, -52933, -9267, 89871, 63852, -7520, -129300, -43251, 70850, 446, -66494]
12416f6494M3196R0085J1309q5189r8962O3305O0503k7748l704r9412N25J13862
12404A276P2798J3263k1961m1751o3298K5046K16154j3862j60367j09373q4823
12393a66898O8872J24260j8954Q035r465j1m7397K0561n4027n4128j9325k4511
12381a72988L1123J37607R0790n9603r2352P1349K5988k8556K3466m5834j7532
12370c6542p4534O7221L8564J0456p1982n9490J19884O3216N7746o1013k13073
12359a59547j4860J11615J21935Q4158q6096j60300p4403J02214J01955L9416
12349F6087J15810k380J09965q363j17599m2294j6184P4644m2228j24410L0722
12338D3770M7121l3232J2639P9867j9361n1627j48696r3507J80679Q4842o077
$$ y = [-66494, -23298, 66787, 78096, -7093, -106055, -42750, 17753, -9995, -13699, -113111, -112586, 1276, 74074, 87337, 65376, 23625, -39673, -14627, 201527, 187665, 27298, -82075, -166898, -98026, 26234, 7280, 15315, 5850, 5839, -41558, -20997, -75024, -129152, -148477, -172988, -141865, -4258, 86532, 26929, -65423, 5926, 31914, 3358, 26824, -19010, -36542, -111076, -43855, -5291, 5165, -66817, -126307, -6423, 56793, 114539, 53526, -159547, -174407, -62792, 59143, 143301, 57205, -103095, -177498, -75284, 26671, 66087, 181897, 179517, 289482, 281119, 163520, 121226, 105042, 179686, 137458, 13048, 43770, 90891, 57659, 70298, 150165, 130804, 79177, -69519, -163026, 17653, 102495, 96418]
12327I6418j6891l5201j06311l4643K6215L1529n0645k4963p640l4431J6779Q8542
12315e1242n0035o5886Q2564O4277k1123l9196m2286q66j08945J22615J42607
12304C2484o2406L7005n3786m5585j27921j2466J12575R132n9131N5606j29268
12293b43761m8710R6211N357P6106j06464j1005J17820J98903K5363l7536R4024
12282A66308Q2625l077j59773j65310r1164J07149M5122J4143J3794J394p1550
12271f0339j9889N5609J6893J30535N1248l0542J7373N0904j53418q5112J41543
12260A14805p8551j83439J6264r799J27158J32463M3069K9292j65477m2840L0387
12249A3332N1145k1550n6122j4725M9946m1727O8836k739R7322K2773m1995j04528
$$ y = [96418, 79527, 44326, -61985, -96628, -70413, -38884, -89529, -114492, -122132, -156563, -139784, -51242, -101277, -167163, -84599, -20322, -41445, -80641, -122927, -123793, -232738, -110123, 32484, -29922, 7083, -46703, -92288, -220209, -232675, -120100, -110968, -170099, -114493, -243761, -292471, -196260, -190903, -114797, -221261, -232266, -114446, 84457, 109820, 72284, 166308, 248933, 245856, 86083, -79227, -170391, -63242, -18120, -3977, 9817, 11211, -60339, -80228, -24619, -7726, 122809, 174057, 143515, 160888, 211792, 58374, -26738, 114805, 36254, -147185, -130921, -140720, -13562, 118901, 161970, 191262, 25785, -17055, 13332, 64477, 42927, -13195, -27920, 22026, -19701, 49135, 46396, 143718, 166491, 124496, 19968]
12237A9968j28836m0313j118j0635J1502R4630J09175L1116K2858L3281O4420
12226B06048l7519m1125q8709j17802p2263P4692L7661l928j9574p0952J332O5244
12214f6895K5479L1644q7784j22697N5228P1530r2325j1796J501Q3085J3619o034
12202a05445N1931N9098k4714p7601O3468P7018R109M6066Q5795P4005l3288q0256
12190A45186j48047p3334J01589Q9672m9414p7529j3094m7706n4110j13925J55493
12179h5219J11827L9317P0002P5376P897l2477k9281j26054k7764M7909L8892
12168I0425L090Q3330l528o0277q0426l7844l3093R2596N5204j31996O2512J12718
12156A52711l2897L950k508K5007J56031p826k6186o4355o6407m4214j22177M6893
$$ y = [19968, -108868, -149181, -150299, -160934, -149432, -54802, 54373, 85489, 108347, 141628, 206048, 168529, 127404, 38695, -79107, -151370, -76678, -39017, -42945, -62519, -133471, -132139, -66895, -41416, -9772, -97556, -220253, -165025, -93495, -185820, -197616, -196115, -113030, -99411, -105445, -53514, 5584, -19130, -96731, -33263, 43755, 52864, 98930, 184725, 258730, 225442, 145186, -2861, -76195, 25394, 115066, 65652, -11877, -24971, -72677, -126787, -240712, -85219, 26608, 65925, 135927, 211303, 219200, 186723, 157442, 31388, 3624, 51533, 90425, 93515, 176845, 173317, 113040, 32614, -5230, -38323, 54273, 109477, -22519, 39993, 152711, 119814, 123764, 121256, 146263, 302294, 294468, 268282, 203927, 137520, 93306, -28871, 18022]
12144A8022J54384N1110j4129j39722r0260m9829k9844o875J62010K4008J06023
12133A84898L5718o3882j8437l872o5393n214k03830j24730J0186J57012J7614
12122g9930j11472m4256N5207J30083j9747m7154O0840N8697l7059n726J630q312
12110d7199P1237l1310M3563P8205K3740L3658K0566j15762l6746K8194k7177
12099D0969m1277m5006l3030J12064K8730L8648J58221Q2010q9163j48492j78602
12088g4928o0417P774J54865J844l0325j0550n3686p4276J2819k0610o4119L2735
12076a78874O1100K7963J14100L9168m8671p8182o7760O7929K9357o4677k2111
12065a20658k6056j7384j1048o1216m9489L3046L3320Q9209J62790r9651L6221
$$ y = [18022, 172406, 223516, 209387, 69665, -20595, -70424, -100268, -107143, 54867, 78875, 184898, 220616, 156734, 138297, 134425, 69032, 63818, -140012, -264742, -254556, -97544, -79930, -191402, -235658, -180451, -50368, -70115, -117269, -56429, 2268, -34791, -40517, -38887, -47199, 24038, -7272, 36291, 114496, 138236, 171894, 192460, 76698, 39952, 68146, 40969, -308, -45314, -78344, 33720, 62450, 101098, 259319, 341329, 252166, 103674, -74928, -135345, -127571, 27294, 29138, -1187, -11737, -65423, -139699, -126880, -147490, -211609, -178874, -117774, -89811, 24289, 63457, 14786, -63396, -131156, -63227, -33870, -98547, -120658, -146714, -164098, -175146, -236362, -285851, -252805, -219485, -130276, 32514, -67137, -30916]
12054c0916L2395o6652J3056L0149M5256K8393l2324M1704p5245n5404M0375p9567
12042a08780O1797J19175p1026L1499N8318J1592L7182j5589M4355M764j04187
12031F9100P0585n6556j1879N8570j69871K9483l3755j713P9899J00936m7819
12020H6980j10739m657L8029m8146N5628J7448p5258j552K5349L5290l6243k7483
12008d5354R1245n1372n5273L1503P155O7144j83105m7805j721K0163J3496J543
11996a52381j9975J09748J038l5111k4874P9034J24572p3062k30j8172O0168q0156
11984b9401n4239L7507Q499J622J54494m734j4455j46527l6632N0318r5744R395
11972a19897L208j8054o67R3095Q3056Q6290L0627o7098l6574K831q214j00173
$$ y = [-30916, 1479, -65173, -52117, -21968, 23288, 51681, 19357, 61061, -14184, -69588, -29213, -108780, -46983, 72192, 1166, 32665, 90983, 102575, 139757, 124168, 168523, 173287, 69100, 139685, 83129, 71250, 129820, -40051, -10568, -44323, -46036, 33863, 134799, 86980, -23759, -28416, 9613, -38533, 17095, 34543, -40715, -42267, -16918, 18372, -17871, -45354, 45891, -5481, -60754, -29251, -22096, 45048, -138057, -185862, -187583, -167420, -153924, -152381, -172356, -62608, -61570, -96681, -121555, -42521, 82051, 8989, 8759, -9413, 50755, -29401, -83640, -46133, -37634, -36012, 118482, 113748, 99293, -47234, -83866, -33548, -129292, -119897, -116689, -134743, -135410, -42315, 40741, 127031, 157658, 90560, 53986, 56817, 48603, -51570]
11960e1570Q5806O2728M4561N9559m328j44315p5691J6137j14283l1265n6905
11949b09566M1638P5328l648J7085J7724j923n3548K1495J61666P0446r8172j46629
11937a08104n3929N4875r128j50774o9462K45720J6123k9204j7795l6354l7827
11926a95859K8221M01J3019p5177L7748M8915J2329k3698J8017M9598n052l3497
11914a25035K7551J03411l592q3361k4886L6835M9792j13587q6547K69P7873L7366
11902a03911J03988O3927K293j8618r5385N3971J03896J0370N9251O186j35483
11891E0485j09071q2300m2923J06282J42770o6148p3796J985R7346j10060L3456
11880e1974N4418o1373m7386j4855K3710l4793n9048N7090Q3657L8708l3605p4306
$$ y = [-51570, 34236, 96964, 141525, 201084, 196756, 52441, -23250, -7113, -121396, -152661, -209566, -167928, -92600, -96248, -79163, -61439, -63362, -116910, -95415, 66251, 136697, 38525, -108104, -162033, -107158, -116286, -267060, -336522, -90802, -74679, -103883, -121678, -158032, -195859, -167638, -167237, -154218, -229395, -191647, -142732, -130403, -154101, -136084, -86486, -91538, -125035, -97484, 5927, 2335, -81026, -105912, -69077, -19285, -132872, -219419, -219150, -141277, -103911, 77, 64004, 66297, 47679, -47706, 6265, 110161, 120531, 179782, 185968, 50485, -58586, -140886, -183809, -77527, 65243, -905, -74701, -72716, 24630, -85430, -51974, 2444, -58929, -106315, -121170, -97460, -132253, -191301, -134211, -50554, -11846, -45451, -119757]
11868a19757J37111J10833J7664l0666p6980K2218R1498j9334o7057o4335r790
11857h595l2943L0561N5574P8763o3113r5283Q4832J330m5250M2032J05247R9993
11845B53148k7016j67498p6941J2850J12238R5111j38744j43782L5898r875K7352
11834b7259l6120o3809Q2513J8838n3400m6237J71043j5899q5057k0602J56559
11823H0570m9753n8090M0243L7802l1601o5662p7806k7833m4566R181m6449k0665
11811b54629R6981J34612j1305P0511R4655r005K4618M7993o1056j1987j3127
11800A08261m8319r9798j30084Q0904L4464O1579J13312n2854r0801q0551o052
11789a09939k7886J5790j6455K7448m554N887O4587L2347J9611p5899j24043r4116
$$ y = [-119757, 17354, 128187, 145851, 115185, 38205, 60423, 151921, 132587, 65530, 1195, -8595, -41538, -10977, 44597, 123360, 60247, -35036, 49796, 51126, 5876, 47908, 153155, 253148, 226132, 58634, -18307, -5457, 106781, 201892, 63148, -80634, -44736, -54611, -27259, -63379, -127188, -44675, -25837, -79237, -125474, 45569, 29670, -55387, -75989, 80570, 30817, -27273, 12970, 50772, 19171, -46491, -124297, -152130, -196696, -187515, -233964, -254629, -157648, -23036, -34341, 36170, 130825, 121820, 146438, 194431, 133375, 121388, 108261, 59942, -39856, -169940, -89036, -54572, 7007, 120319, 67465, -23336, -103887, -109939, -137825, -122035, -138490, -111042, -115596, -109709, -45122, -12775, 6836, -69063, -193106, -287222]
11777b87222J1839J43781K04762j13186j41040J6877M8346M888J21369J30910
11767A41324J6152J2564k14718o5130R2049J43464j7926O3869j22717N613J8999
11756G3543o7463m2673k018J3016N2931N3255j341o9327j23330q6551m957R9400
11744a05515M4214L5583J6375N9072R140o719r0189m2726m6708l9813n5203K0784
11732b01705J22589J48028Q3868n8012p4076J05838N6181q7568k9421j65273o8087
11721a67638J01432J0289R6803j8027q8768p1009n3965P3667J18881O4066J3612
11710G9343J0897j17487j29385N4428J23202q9243m16M512m7627R3348J1966l25
11698f787m4491q5835K2822N5874j9979r928m881J63449J68215p3583j26535j27796
$$ y = [-287222, -275383, -131602, 73160, -40026, -181066, -164189, -115843, -110955, 10414, 141324, 157476, 170040, -44678, -109808, -17759, 125705, 107779, 171648, 48931, 54544, 73543, 6080, -36593, -38611, -25595, 27336, 80591, 79250, 9923, -113407, -199958, -204915, -105515, -61301, -25718, -9343, 49729, 58869, 52150, -38039, -80765, -127473, -167286, -222489, -201705, -79116, 68912, 152780, 94768, 20692, 126530, 182711, 95143, 65722, -99551, -167638, -66206, -55917, 40886, 22859, -65909, -136918, -190883, -117216, 1665, 65731, 79343, 90240, -27247, -156632, -102204, 20998, -68245, -68661, -64149, -111776, -18428, -6462, -6787, -51278, -137113, -114291, -58417, -78396, -88324, -93205, 70244, 238459, 164876, 38341, -89455]
11686h9455p7487P9620J74175J04780l0766R2536K827q7715p9089l9973j84072
11675a34619J3764R8450o6882R6581K2488j35099K2418R6246M8278J3365j45642
11664g0652j51006K5237k0560O5895J72623l5629o9344j3811Q0733R8511O8758
11653A50755j04403J2365L275p1503p0266p1052l2344J80649p4229j7193J43965
11642E0019j3685p8781m794O7422k8037p1037l3152l697k1249P4255N7296j7241
11630b2681N2703p880p6005k0856R8794n2714j9699n030O0748q240j32265j7304
11618a50429j4409Q084j5033R718o3789L6732R4020Q0395L5120M9084o9152k0325
11606a9984j50848K0797J3703N3277N8934j37012j7493J3812K2832J8776n6828
$$ y = [-89455, -166942, -87322, 86853, 191633, 160867, 253403, 256230, 168515, 89426, 49453, -134619, -120855, -22405, -89287, 7294, 29782, -105317, -82899, 13347, 61625, 74990, -70652, -221658, -196421, -216981, -151086, 21537, -14092, -83436, -97247, -16514, 81997, 150755, 46352, 58717, 61992, -9511, -79777, -150829, -183173, -2524, -76753, -93946, 50019, 36334, -42447, -47241, 20181, -7856, -78893, -112045, -115742, -136991, -62736, -5440, -22681, 30022, 22142, -53863, -74719, 24075, -28639, -48338, -53368, 7380, -860, -133125, -150429, -164838, -156754, -171787, -162069, -225858, -189126, -95106, -14711, 20409, 69493, 341, -19984, -170832, -150035, -136332, -83055, -24121, -161133, -178626, -164814, -141982, -123206, -180034]
11595a80034k658M6615q644n4743P8787J35439n1364q0635J20136J26079k9979
11584I8999n8878n6029m4190l7345J21965J8031j16702o2140J7433J6643j9532
11573a21745J30249j4246j35515N3752O9386N0154K2304M2002l5105o6381o0297
11562f5442L6478o9857K1696K8819N0302L1785O5430n1034J1489m6560o5000k4931
11550g6825o0124L3492m2947j10780J40680L1147O5636N3490q0622J8851K5383
11539b619M5916j99186j74745O795R7112J01389J537P476L7232N6777O0183n9041
11527b1174N59K0332k3467m6071k335M8283l9601p9343j7070l694L1683R6346
11515c5552K6557p6246l3215Q9826J0345l1388m1107n0192K6983J8887O2430K3466
$$ y = [-180034, -182692, -136077, -144721, -199464, -120677, 14762, -36602, -117237, 2899, 128978, 98999, 40121, -15908, -60098, -97443, 24522, 42553, -74149, -136289, -118856, -102213, -121745, 8504, -5742, -141257, -87505, -18119, 32035, 54339, 96341, 61236, -5145, -65442, -28964, -98821, -77125, -48306, 1996, 33781, 99211, 48177, 59666, 13106, -51894, -76825, -136949, -103457, -146404, -257184, -116504, -85357, -19721, 33769, -46853, -28002, -2619, 43297, -155889, -330634, -323839, -226727, -125338, -123801, -116325, -79093, -22316, 37867, -21174, -20615, -283, -23750, -69821, -72156, -23873, -63474, -142817, -159887, -163581, -131898, -35552, -8995, -85241, -118456, -28630, -18285, -49673, -90780, -140972, -113989, -95102, -32672, -9206]
11503i206N5971j7373p706J9108O4697Q1876m682p6320p9793m5142k2119n1100
11491i1789M7184O2570l1538L0824M122j7313l6093o2842k2132N3692Q818K8004
11479b6493n7234n964M6110J40587P5438K0129m3857q412j43023K1508o290l2355
11467a9856o6550m023j3376J6372j1728L6666J03291L5468k4183k2780k3124N7526
11455F3703j5608J1641N8235m2443L0970n8994l3150M2643J9437r6381n504j16558
11443a42009k5767M4656J04725P2298o6791m057p2234k8621N0453K554O8884N4144
11431E8235n9306m012L6074K2633K2691j4964q6921l2519M3266p2366N5384J7188
11419a4617n6064L4052J9238K7900Q816P200q4718O028J60177J0198n1604n6253
$$ y = [-9206, 46765, 29392, 21686, 40794, 105491, 187367, 182685, 106365, 26572, -18570, -40689, -91789, -44605, 17965, -13573, 17251, 21373, 4060, -32033, -94875, -117007, -63315, -54497, -26493, -83727, -89691, -43581, 97006, 172444, 192573, 148716, 140304, -2719, 18789, 12499, -19856, -86406, -90429, -103805, -87433, -99161, -62495, 40796, 76264, 52081, 29301, 6177, 63703, 48095, 59736, 117971, 75528, 106498, 47504, 14354, 56997, 76434, -19947, -25451, -142009, -167776, -123120, -18395, 53903, -12888, -16945, -89179, -117800, -67347, -64793, 4091, 58235, -1071, -5083, 30991, 53624, 76315, 61351, -25570, -58089, -14823, -87189, -31805, -14617, -70681, -36629, -17391, 10509, 19325, 26525, -58193, -52165, 108012, 118210, 66606, 10353]
11407A0353j09480r1111l5058L1730n584M4515J33844K9081q8131k1314M0605
11396f0550M147l4754q0142O4649M3948k0755k5619K954K1650Q9307m4796p9962
11384a19923M822N2402l7063O593L4736M5873J1595K9901K8922n8160j13884k1200
11372a35386l7077j2742J13309R1438j03654j62317O3865K3839L0899r004R3689
11361d3141R0390j35869m2812K6303P6197M7052p7364r8985q4037J06604J30437
11350e225j7073l4507L4975Q5329j00343j27567Q229L6515R3985J44396q4764
11339C3950j22057m8055N3772J368R0733L5333J2428l7130p855k3304K946j9155
11327b7026L6067O519n2569k8341p2634l7220J75438j374m189O2700r9454j61861
$$ y = [10353, -99127, -190238, -225296, -193566, -199150, -154635, -20791, 8290, -79841, -101155, -60550, -56403, -91157, -171299, -106650, -62702, -83457, -109076, -106122, -84472, 4835, -39961, -119923, -115101, -62699, -99762, -93169, -58433, -12560, -965, 28936, 57858, -302, -114186, -135386, -172463, -185205, -71896, 19542, -84112, -246429, -182564, -158725, -127826, -136830, -43141, 47249, -88620, -131432, -105129, -28932, 18120, -59244, -158229, -242266, -135662, -5225, -22298, -56805, -21830, 63499, -36844, -164411, -156182, -119667, -25682, 118714, 33950, -88107, -136162, -82390, -81022, 9711, 45044, 57472, 20342, 12487, -10817, -7871, -27026, 9041, 15560, -37009, -65350, -137984, -175204, 234, -1140, -5329, 57371, -42083, -203944]
11315b03944k7196p1965J42355J94262K4076n5649N200k6183m9965j01442K3169
11304a47282R296O8350L536j7379K8755O4755O2207j789k6237J9987p2416j30813
11292a39030n050L0905q047O2976k4964k7014O9510K3592o1109k7317p988N4771
11280e8765k0999J6232N1005j829K2747l5879m1475N3232n4098K2318R9846J25350
11268A77685k1167o7192n4289j68566o8429J26516M100j04742M8536P4303n817
11257e9062M9186m7632R7170J14815j2293J3380N1781j6529l9049n0273n5200
11246D6294R9211Q8119j17221j22251L0606K8056N960k709j54417m204J34517
11235C1961J02138J5299p3612l1429Q2587Q1881P0637n8192l8132j4176n6706
$$ y = [-203944, -231140, -303105, -160750, 33512, 57588, 1939, 7139, -19044, -69009, -170451, -147282, -137986, -69636, -66100, -83479, -54724, 10031, 72238, 70449, 44212, 64199, -8217, -139030, -144080, -113175, -121222, -58246, -83210, -110224, -40714, -17122, -78231, -105548, -113536, -58765, -79764, -63532, -12527, -14356, 8391, -27488, -68963, -15731, -69829, -47511, 52335, 177685, 156518, 89326, 35037, -133529, -201958, -75442, -71342, -176084, -127548, -53245, -59062, -9876, -57508, 39662, 154477, 142184, 155564, 207345, 190816, 151767, 101494, 46294, 145505, 233624, 116403, -5848, 24758, 52814, 58774, 56065, -98352, -102556, 31961, 134099, 149398, 75786, 44357, 126944, 208825, 279462, 221270, 183138, 168962, 112256]
11224A12256m4384l7527M6455J9053L6978J0884r6788j04306P0215K55720l072
11213B65484q9737j34577l5064l9629j35925o2993J02189K9222L0131o887M8828
11202b8958P6241k9842r8896Q678N6368J99825J09305l138k46544j30644J35150
11191D7545o2844m0177P6336J8005P143r146J52916n8638n2830p9004m697P286
11179A895m1955p0512J09282P2480P1149q322N958r0312j51333j37539M7255J0232
11167a81722J4959j7204R5022P966R8135p689o9548j8555P592N2401j25953j14415
11155b59011J5474J08192N6849j707m9372k2291L6591m8438j6441Q6435K7225
11144f6494l5596Q2861n5701r3468J58438P8160l6757k7659K5124m849j6491r419
$$ y = [112256, 67872, 30345, 76800, 95853, 132831, 143715, 46927, -57379, 12836, 268556, 265484, 175747, 41170, 6106, -33523, -169448, -232441, -130252, -101030, -70899, -77786, -28958, 47283, 17441, -81455, -72777, -16409, 183416, 292721, 289583, 43039, -87605, 47545, -15299, -55476, 20860, 38865, 46008, 36862, 189778, 131140, 78310, -694, -5391, 1895, -40060, -110572, -1290, 71190, 142339, 134017, 139975, 49663, -101670, -239209, -191954, -181722, -166763, -183967, -88945, -80979, 17156, 9467, -60081, -78636, -71044, -18643, -144596, -259011, -243537, -135345, -78496, -80203, -129575, -151866, -115275, -163713, -180154, -93719, -66494, -102090, -19229, -74930, -168398, -9960, 68200, 31443, 3784, 28908, 24059, 7568, -1851]
11132a851m2149n5119n0582L6344k4869j321O7337K2522M0822L8576R5811l3887
11120I1634n8904p4043j1235k9776j5275J13103P5849q9545j59929J31606J49492
11109A22977j8632l9235k9862n5775K5919l9263n4720Q193J2933o2826q3267Q087
11097b05471K9066L3592j0441l2528K9328N4968M8525M693K1130N3742O8954o6469
11085B9089j53866O6354J17417J48160J2567j44036k32334O5605J38657K6426
11075G4039j06078q2267K8803J43518R8465K084k5079n0359J46249l5037l9243
11064A55095j0313J26870K2512p3818j31897j20940m393J10498j9449r1296r5872
11053a33003l0935L6776O4545Q2074R9507q3563j4345K1520R3291N6052k4174
$$ y = [-1851, -44000, -99119, -149701, -113357, -138226, -139547, -72210, -49688, -8866, 29710, 125521, 91634, 32730, -41313, -52548, -82324, -97599, 15504, 91353, 1808, -158121, -26515, 122977, 104345, 65110, 35248, -20527, 5392, -33871, -88591, -80398, -67465, -130291, -213558, -205471, -176405, -142813, -153254, -185782, -156454, -101486, -52961, -48268, -27138, 26604, 95558, 29089, -124777, -58423, 58994, 207154, 219721, 75685, -156649, -91044, 47613, 74039, -32039, -114306, -85503, 58015, 156480, 158564, 133485, 83126, 229375, 194338, 155095, 144782, 271652, 294164, 220346, 88449, -32491, -36884, 73614, 54165, -37131, -133003, -163938, -127162, -62617, 19457, 118964, 35401, 21056, 42576, 135867, 191919, 167745]
11042A67745o2470j53041K9553r9269j8433K3339J4463O8729K2988l4981Q8747
11031D7370k9887p5315L518J7115m2195n5252l9048j7496o1727q1291P1586J19498
11019a43124J42482k3068q2399p6176P3840l6404k9884J04526N7325p495l4186
11008e4563P467l3807l319J5732n0909l1741k2461P1859p0020o9575M9800N6425
10996a35112k8197j9703L7264N2393j7708O722o6351m187J73139L3011j2383j4549
10984D339p915r5837n2086N558k6807M3309J12213O94j51480M3038J25559M04
10972I89K8823n1377m7378l1377N0313Q187J7906M0266j23154m5979l8890J48480
10960d3191o708l7729q9400m0179J02262N3177M5009m894J3432m1917N2570J03532
$$ y = [167745, 105275, -47766, -18213, -117482, -135915, -112576, -98113, -29384, -6396, -41377, 47370, 17483, -57832, -54314, -37199, -79394, -134646, -173694, -191190, -252917, -334208, -262622, -143124, -642, -23710, -106109, -182285, -108445, -144849, -174733, -70207, -12882, -20377, -54563, -47096, -80903, -84222, -68490, -119399, -151140, -173601, -101742, -171762, -241337, -191537, -135112, -163309, -183012, -145748, -93355, -111063, -104341, -170692, -174879, -1740, 31271, 18888, 4339, -3576, -99413, -151499, -145941, -172748, -129439, -17226, -16532, -168012, -124974, 585, 989, 29812, -21565, -68943, -100320, -50007, -41820, -23914, 16352, -106802, -152781, -191671, -43191, -49899, -87628, -177028, -217207, -114945, -61768, -16759, -21653, -8221, -50138, 2432, 105964]
10948A05964k2448r5282m8565J27901J2305J842O5244o016m0794K4689J2429m4559
10936I2710r4715m7914R0635M80n4546q7764l3734Q9965O0430q3494O5766J7566
10924A5385r3058L4750R0949K09786l740j90832j18493J6465J2405m0507j7455
10913h4345j538O3545k5215j15933j49191p0787J01090J58528N3941L6549J20532
10902H7176O0525o1848p4593k7805p1234j525J5351K3152m405O2579k7320n1654
10890g1601J713m8140k6068Q641j26407O135R9107L3145O9595Q6644o2530q4955
10878a14721N2128n7732P4030Q0947M2417L2344j30000m4184n1240N9480J14783
10867E8252J42097N814j68591o8079j4579O6256n4814N940O5873j65385p1511
$$ y = [105964, 83516, -11766, -60331, 67570, 79875, 81717, 146961, 140945, 100151, 124840, 137269, 92710, -2005, -49919, 40716, 41196, -13350, -101114, -134848, -44883, 15547, -67947, -2181, 15385, -77673, -42923, 48026, 257812, 254072, 63240, -55253, -38788, -26383, -66890, -84345, -85883, -22338, -47553, -163486, -312677, -383464, -282374, -123846, -69905, -33356, 87176, 147701, 85853, 11260, -16545, -87779, -89304, -73953, -50801, -55206, 7373, -19947, -71601, -69888, -118028, -144096, -135455, -261862, -255727, -156620, -123475, -53880, 32764, -29766, -114721, -62593, -120325, -46295, 34652, 77069, 109413, -20587, -64771, -116011, -56531, 58252, 200349, 206163, 37572, -30507, -45086, 21170, -33644, -27704, 38169, -127216, -198727]
10856a98727P3967J39N291J27400L9713M223j3387j10565j26329l4891Q9337J90985
10844D7156r700j93905Q4423Q5401K9647j02946j35129o023m8901K609M5532M3664
10832a58172R6221J29017N3541p5192j30413q8923P2221O8569J16675J25436j9694
10821A89286r9622p730j9079j44223j41120M6146J13373O5257q6804l5757L2000
10810h8273J52933j1443k1695J8989O6125R5660N0440j61851j06625L7953o5005
10799c2792j06238R3380N709l4243l509Q3256J4171o4424J31844k5161j24664
10788f2671n3154J21693M0763q9145j1631r7991n2941K4910p292J04809L2854
10777d9796K6332J5367l4442m2776k238o7239P1949J40903M9105n2155n7006j7376
$$ y = [-198727, -124760, -124621, -119330, 8070, 47783, 52006, 38619, -71946, -198275, -233166, -143829, 47156, 37456, -156449, -72026, 13375, 43022, -59924, -195053, -201076, -249977, -247368, -201836, -158172, -61951, 67066, 120607, 45415, -84998, -173921, -101700, -33131, 83544, 208980, 189286, 89664, 81934, 62855, -81368, -222488, -176342, -62969, 2288, -84516, -120273, -88273, 64660, 53217, 31522, 50511, 116636, 212296, 262736, 100885, -5740, 32213, -32792, -139030, -45650, -39941, -74184, -77693, 5563, 19734, -44690, 87154, 61993, -62671, -115825, 5868, 46631, -42514, -54145, -152136, -205077, -180167, -187459, -82650, -49796, -23464, -8097, -42539, -85315, -87553, -154792, -82843, 58060, 107165, 55010, -1996, -19372]
10765a9372o3757Q5935R2202M5053j1769m1013o4035l0024J5853m3981P6765R1168
10753A33025M2725o0429n5333j16411j22188K6916N9218J9987k3603j29212n972
10742b31277J71594K4668j04059Q2685J54867L0188j30153n2714J2285L1843j9827
10731b9900Q628Q1992M2881o284l190K8278o8714j11186k6431J28122Q7653n8723
10719G3126m6596M4030M9210r1342K8060l2568n5129J7594M5357l3485n1176k1903
10707g4822L5864j21041n8088q322M3657O4016R7101O2326R4041M9164m3606k6494
10695A13796k5160M7k1669p2960m1765l7977J8869q801j6844m3624l8127R0663
10683h3552P1015l2954O216O7692m0208P508N284m0726J959K8091K7006k9616
$$ y = [-19372, -83129, 2806, 95008, 140061, 128292, 87279, 23244, -6780, 9073, -34908, 41857, 133025, 175750, 115321, 59988, -56423, -178611, -151695, -92477, -72490, -96093, -225305, -231277, -59683, -35015, -139074, -56389, 98478, 128666, -1487, -54201, -41916, -10073, -29900, -21272, 60720, 103601, 97317, 94127, 122405, 53691, -57495, -83926, 44196, 131849, 73126, 26530, 70560, 119770, 28428, 56488, 23920, -31209, -13615, 31742, -1743, -52919, -74822, -38958, -159999, -218087, -226409, -182752, -118736, -21635, 40691, 134732, 183896, 140290, 113796, 88636, 88683, 67014, -5946, -47711, -85688, -66819, -75620, -92464, -136088, -174215, -83552, -12537, -45491, -39275, 28417, -11791, -4283, 1001, -39725, -37766, -9675, 17331, -12285]
10671a2285N1302J5685l457j72845o6928l7697m4883Q1171J28747Q2020K7219
10660D8049o22r6190l2585j2161k2165L5682o9000O4938J455j10227p6102J0658
10648b58270M9946m1122J0048J33471J37786M2433j48694j06010J9412R3370P9427
10637A1797J10627M4777l3645o5667n592l956l9553K8688n308N1027l6241o7172
10625a0218j9427N0496K6561J09461m4910p5907r5309k4615k7527o4557O1669
10614a14283j0672J9134N7013J29606K7069j4794n038R164O2382O9876p4444j85692
10602c0679q5953K6735k4995J7109O785o6793Q3300N5142J16999l9913m3525k5150
10590a0938J4835J05074M6287O3306k9768k3759q6123j05252j6279K3075l0708
$$ y = [-12285, 39017, 54702, 51245, -121600, -188528, -226225, -271108, -189937, -61190, 20830, 48049, 47427, -48763, -81348, -93509, -115674, -79992, -148992, -84054, -82599, -192826, -268928, -258270, -208324, -249446, -239398, -105927, 31859, 74292, -74402, -180412, -161000, -67630, 11797, 122424, 167201, 133556, 67889, 62297, 58341, 18788, 47476, 42168, 93195, 56954, -10218, -29645, 20851, 47412, 156873, 111963, 36056, -59253, -83868, -111395, -175952, -114283, -124955, -105821, -48808, 80798, 107867, 93073, 88035, 97199, 159581, 229457, 155013, -30679, -116632, -89897, -114892, -97783, -90998, -157791, -74491, -19349, 97650, 57737, 14212, -10938, 3897, 108971, 155258, 218564, 188796, 165037, 78914, -26338, -42617, -19542, -50250]
10579e0250J53505j5304l5701O2385m5431n0803L2882J26387K2078j69932l716
10568B6100J56782k9878r3682p2029o1035j06806l0087M4422r7680J0962J51070
10557a01861J58955N940p4016L2288l0845k7323O1683K6019O3198R0028j3459
10546A90607j49236n0871K8146o5867M6769J13062j35433Q7765L1613j2995l445
10535H0115r4139J29779k6014r7590Q0170M029O088j3103j4024L734j26311p6771
10523a44037J30605P4868Q6048l0508q8339N406P2013J19905J5111k3724p8911
10512A38437n7456m2165N1058n3126J5242Q5997q8064J7848j4909j30536l672
10501h1346R3196n3131o8654P6900l4606j2744M8882l8346K0938p7976o7534R403
$$ y = [-50250, 103255, 87951, 52250, 114635, 69204, 18401, 51283, 177670, 199748, 29816, 26100, 182882, 153004, 59322, -12707, -73742, -180548, -210635, -166213, -263893, -252931, -101861, 57094, 63034, -10982, 21306, -9539, -36862, 24821, 50840, 114038, 204066, 190607, 41371, -9500, 18646, -47221, -452, 112610, -22823, 64942, 96555, 83560, 80115, -14024, 115755, 89741, -7849, 72321, 76350, 82438, 69335, 55311, 59045, -67266, -144037, -13432, 61436, 147484, 116976, 28637, 34043, 106056, 225961, 241072, 217348, 138437, 80981, 38816, 89874, 36748, 51990, 137987, 49923, 67771, 52862, -77674, -81346, 11850, -41281, -109935, -33035, -67641, -80385, -31503, -69849, -48911, -126887, -194421, -185018]
10489a85018J48733Q8071Q257j413Q3611p5978l9798o6677P0900p2650j7060k5064
10477h4086o8282j00262K5000K8901l1874L5260N6637k7702l747O0312J02297
10466g546J5194l841k61p013P862O7387K8851q7208l9009M0337J657J0745l876
10453B3279L6001l4541l2296j55751K04P1159Q4108J03599r1790m2928J05046
10442F6090K267m4641j0685k584O3030M1064N2668J574o0995M9890J01780j15760
10430A43698P542O6187j49751l4033k1600k0908P1751R1558N1819J17282O4998
10419C88543q3804j43243q3513j45864P4559o500k7855q163P2312K1635L5396
10408I3503J15820J07555j14507o9415k8965j11829Q1678K1012p0589k6920j394
$$ y = [-185018, -36285, 51786, 60043, 58630, 142241, 66263, 26465, -40212, 30688, -41962, -59022, -84086, -152368, -252630, -227630, -198729, -230603, -195343, -138706, -166408, -170155, -109843, -7546, 7648, 3807, 3546, -3467, 4395, 71782, 100633, 13425, -25584, 14753, 16410, 27155, 23279, 59280, 24739, -7557, -163308, -163104, -91945, -7837, 95762, 3972, -38956, 66090, 68357, 23716, 13031, 10447, 73477, 114541, 167209, 168783, 107788, 157678, 259458, 143698, 151240, 217427, 67676, 33643, 12043, -8865, 62886, 154444, 206263, 323545, 388543, 304739, 161496, 77983, -67881, 6678, 178, -27677, -35840, 36472, 58107, 93503, 209323, 316878, 202371, 132956, 103991, -7838, 73840, 94852, 24263, -2657, -4051]
10397d051k7465R9533j7062p8317N4648P0647K9832p2428j60270J2467K4697M2834
10385b4935m325l21O4659k5130l4091k783J62674k9514p0537n99L2164o864n1690
10372H708P5507j1023K9275K7725O6392Q9678n2931l4925r5801m4572p2144m5754
10360e9865Q6059R9220o938N1865j28686j2369q1052o8091q8414q967J24013Q8671
10348d554P7641n7573j43527n4092k2410k5091N7439P4027k4737l6551J32442
10337b6986K0076M0829j56j00865l3933K0837L2233l233O642J5710R3242o944
10325E7452K0292p8877J3194P8530J42292m1395o0990k1146J7983j0367O125N8266
10313A81359K609j15383m9183N9301l4969k2942Q9555o2180Q1209J4538j61179
$$ y = [-4051, -31516, 68017, 50955, -27362, 27286, 97933, 127765, 55337, -104933, -92466, -67769, -24935, -29260, -29581, 35078, 9948, -24143, -26926, 135748, 106234, 35697, 35098, 67262, 60398, 8708, 84215, 73192, 102467, 130192, 196584, 286262, 233331, 198406, 102605, 58033, -14111, -59865, 26194, 125414, 118476, 170341, 41655, 29286, -51766, -119857, -208271, -217238, -93225, -4554, 73087, 15514, -128013, -182105, -204515, -229606, -172167, -98140, -122877, -159428, -26986, -6910, 33919, 33763, -67102, -101035, -80198, -47965, -51198, -44556, -28846, 64396, 57452, 77744, -1133, 12061, 90591, 232883, 191488, 130498, 109352, 127335, 116968, 123093, 181359, 183968, 68585, 19402, 78703, 43734, 20792, 110347, 48167, 129376, 143914, -17265]
10302a7265P4030N7524m7256j1599p3820o8354M845m770Q2978J91290k8248j14303
10290D5052k1325M0430k3253L834m8618P4541J18290r2815j87778k6983O8169
10279e0456l7057k0438k1478J5225k5135M51j081m3234P476J03642L5959P3171
10267C7045m3831k0002l944O7551O8796M4728j09483r7126L7103j05181J1099
10256a13245J12110J22298o961o5869q7131q25N2459p478j31388l8564J200n950
10244a69344M7618R9489J06893j0766m7604N9459J6664k2741m837J2008r2324
10233e485k00999k101J40903J54211r620m9968k438j2129M9951r0763J03558K6172
10221A01292n9105p3427p5970M9942L999k3037M3257K955l4097n999N7914J36841
$$ y = [-17265, 56765, 114289, 67033, 55434, -18386, -86740, -81895, -86665, -3687, 187603, 159355, 45052, 23727, 64157, 40904, 44738, -3880, 70661, 188951, 96136, -91642, -118625, -50456, -87513, -107951, -129429, -114204, -139339, -138888, -139969, -183203, -175727, -72085, -36126, 37045, -6786, -26788, -30732, 36819, 105615, 150343, 40860, -56266, -19163, -124344, -113245, -1135, 121163, 114202, 48333, -38798, -39623, 12836, 5358, -126030, -164594, -163394, -169344, -121726, -22237, 84656, 73890, 26286, 85745, 102409, 79668, 74831, 86839, -5485, -206484, -208585, -67682, 86529, 76909, 26941, 24503, 12374, 62325, -28438, 75120, 101292, 42187, -31240, -107210, -57268, -53269, -76306, -33049, -30094, -64191, -70190, -12276, 124565]
10209A24565l6828k8505j2107m3092Q474k2288K4312J6112l4333J3406J40137
10198A49853j0982q7161k3574p7296N3249K7910N1615r2315j12045O2911J01787
10187D3952Q3378O3373j38074j12039q8301q936j1607j0707J31429P7636l1800
10176a696k00598N875R2030j9627J53367R1761Q2575j19910j97770L0424J08203
10165B4634j4735j4025O2867O0156j34628j04570J09595R2319j12279m0514r9987
10154a71167K2072J32317J59219N6450j8275J27l7874r2183n806J45995R7338
10143B88213n5379j11391k4452l2364L2452K3620l2638m0711n0698J14987m6801
10132F4838j98334J00595M303p8388m675R2993O8686l1509l1221L9936n9085n1263
$$ y = [124565, 87737, 59232, 47125, 4033, 12507, -9781, 14531, 30643, -3690, 9716, 149853, 138871, 51710, 28136, -49160, 4089, 31999, 83614, -8701, -120746, -57835, 43952, 127330, 190703, 52629, -59410, -147711, -156647, -168254, -178961, -47532, 30104, -1696, -202294, -196419, -104389, -124016, 29351, 121112, 203687, 83777, -113993, -83569, 24634, 9899, -4126, 58741, 118897, -15731, -120301, -10706, 81613, -30666, -71180, -171167, -149095, -16778, 142441, 198891, 180616, 180743, 142869, 50686, 44880, 190875, 288213, 232834, 121443, 96991, 64627, 97079, 120699, 88061, 47350, -3348, 111639, 64838, -133496, -32901, -28598, -106986, -111661, -18668, 50018, 18509, -12712, 27224, -31861, -83124]
10120h3124j2170O7471K3518m0974j05586n9571Q8518N1500j43090n4111O2443
10109b05176q5420l3647Q2387Q1132M9930n2772k803M758k5655Q9481J19792L2844
10097E4851O3987Q3513r9691j31106J10704j651k518k0999o719q822N3335j42714
10085d7830j19705J14492J07899j07389m038J11649Q7631q3283o2859O10l4471
10074c7294P1005n648J4576o5000m9832M0300p1953q0053N5048L5410M2777J7942
10062c2722j9700M7769L3261P1792N8802N1590J16275j38643j46253k3661r4704
10051g6194p741r4630j5242R5967j9039j1376M0152J02965K0221j7509j06829
10040h9255r4990o5061J22295J82993k2449p3567R22k1109R711M4967m6077q3405
$$ y = [-83124, -95294, -27823, -4305, -45279, -150865, -210436, -121918, -70418, -213508, -267619, -205176, -290596, -324243, -241856, -160724, -110794, -163566, -166369, -161611, -187266, -97785, 22007, 54851, 118838, 202351, 102660, -28446, 82258, 80607, 78089, 57090, 50371, 41549, 94884, -47830, -167535, -53043, 54856, -52533, -56571, 55078, 142709, 59426, -3433, -2823, -37294, 33711, 28063, 42639, -22361, -72193, -31893, -103846, -183899, -128851, -93441, -50664, -32722, -52422, -4653, 28608, 100400, 159202, 210792, 327067, 188424, 42171, 18510, -76194, -83935, -178565, -193807, -97840, -116879, -128255, -88103, 14862, 35083, 17574, -89255, -184245, -249306, -127011, 55982, 33533, -40034, -39112, -60221, -50510, -5543, -51620, -135025]
10028a35025O2427r0014n0477J63625K7697o8164N1632l0033o085m8950J9980
10017a03387K3057J8166m42P3016q6449J0718L5437l9130N8716L4279k4166L8379
10005C8194j39410p9127J7891O8145K21091O4952j21281k9845m7476j07775J09128
9994e513O9832l5695m4058n6629N0824K3811Q14R1873J21694r3060j99369n7350
9982a32826j9267P231Q4030J1572o1673K0592m3377M6063J14456m2880r7490j7890
9970a31459J98398L8028j57834p7460R8456J39127n0548L7962J3831p3538M6307
9959H1270R0286J19404j42340r1458j7673j2132j0033l0529j24747L3634J65243
9948F0925Q948o8981O6367j52204O22J12971M144m6801N924L4477p0095j1636
$$ y = [-135025, -72598, -162612, -213089, -49464, -21767, -89931, -38299, -68332, -74417, -123367, -103387, -80330, -62164, -62606, 10410, -76039, -65321, -29884, -69014, -10298, 23981, -185, 38194, -101216, -180343, -162452, -94307, 126784, 191736, 70455, 40610, -6866, -114641, -5513, 64319, 28624, -15434, -72063, -21239, 2572, 3386, 95259, 216953, 123893, -75476, -132826, -152093, -144862, -60832, -49260, -110933, -90341, -133718, -87655, 26801, -16079, -113569, -131459, 66939, 104967, -52867, -130327, -31871, 107256, 56708, 94670, 108501, 34963, 81270, 171556, 290960, 148620, 57162, 39489, 27357, 17324, -13205, -137952, -104318, 60925, 69873, 892, 67259, -84945, -84323, 28648, 32792, -14009, -8085, 26392, -43703, -55339]
9936e5339R8850o0763q3143O0071J19926J24983K4198j19467o4990r1413O1461
9925A4374M1256J12884j16530J1744l6423M8055J21753m9276j17296o2165r2602
9914a24226k1538J48463L1834O8852p175j20349q8856K6646N5443O5987r8559
9903f3478M4805O6651l9513Q2946J06776n1521q505r521k5116o0689j3438O027
9891C5424R7848J34942K0902n6475n3039N1560m1625O1069l7093j03188k2399
9880H7926J8908M5943J15630R2554j57522j07856l7638Q7896r1397r5727K2320
9869a8963n4059N0316M3127J1102J10439N5290k7472j6101K6498j4513m625r5198
9857F5841P026K5646j30496j2925J30055P591j1403l00378j22015J40887Q9551
$$ y = [-55339, 43511, -17252, -100395, -40324, 79602, 204585, 228783, 109316, 44326, -47087, 14374, 55630, 168514, 51984, 63728, 27305, 75360, 197113, 147837, 30541, -31624, -124226, -145764, 2699, 34533, 103385, 96210, -24139, -112995, -86349, -30906, 35081, -63478, -18673, 47978, 8465, 91411, 198187, 146666, 138161, 128640, 103524, 42835, 29397, 35424, 133272, 268214, 289116, 232641, 179602, 231162, 189537, 250606, 213513, 110325, 87926, 106834, 152777, 268407, 360961, 203439, 95583, 57945, 145841, 54444, -41283, -18963, -73022, -22706, 20421, 31523, 141962, 197252, 169780, 153679, 180177, 165664, 161039, 65841, 72867, 98513, -31983, -44908, 85147, 92738, 81335, -219043, -341058, -200171, -110620]
9846a10620N5809K7245M8621N8867K2460q6504P2194J7290M1051n8542j04236
9835a6365o5387m331L4653q289J19698n2411j1186m7192n3596m4985L6245R0641
9823b2505l1501o2204P846J83140Q3246o5589r5870R7614N87j09394J8043J21006
9811A24419R2156j50863j26665j6074J01259O4774o1116O7203m8281K4258L4550
9800A05620O890j18295l1001n916K2522M2618Q4778o732r7606l5431Q2837m9743
9788E41k8192r9984L7278Q8712l3266Q1647R4160p5297j85510J5029R1791m0777
9776e3868O6429K8909n4347J17859M2939m0221l1092m3112k5149J11588O4995
9765A84930l4990q0203N0047K7181k3099o8406o121L6555M7819J4635l1689k2004
$$ y = [-110620, -54811, -27566, 21055, 79922, 102382, 15878, 88072, 105362, 146413, 87871, -16365, -81752, -86083, -51430, -59719, 59979, 7568, -3618, -50810, -104406, -149391, -113146, -22505, -54006, -116210, -108364, 74776, 158022, 92433, -3437, 94177, 94764, -14630, 3413, 124419, 216575, 65712, -60953, -77027, 24232, 89006, 27890, 95093, 46812, 71070, 105620, 112510, -5785, -36786, -42702, -20180, 22438, 107216, 100484, 2878, -32553, 50284, 541, -27651, -127635, -90357, -1645, -34911, 46736, 140896, 65599, -119911, -104882, -13091, -53868, 12561, 41470, -12877, 104982, 147921, 107700, 76608, 33496, 8347, 119935, 184930, 149940, 69737, 119784, 146965, 123866, 55460, 49339, 85894, 133713, 148348, 116659, 94655]
9753I4655N3292M4638j18457o6488J9542O6417P1416L1409r6126m2881j11955
9742e4538j41048Q7881J12833j8912O2579o5110j11958p1419M0347M4999J5526
9731i8820J1852q7010o6400r444J19853j7407J22937n925N0125J16718j02891
9720C3588j07446J6008N9784k6959O0254k4225P7174j15482k5967R2036k4048
9709A4717K3324o461N382q4952n9895Q5199j2602N4871k0424q6958J6610j7861
9697h9050L4195N3357O5483O4151m3441p3873r1098k1633J6879N4823j5953j7764
9685f3924n2733j1596O8590J50993J19668l1240j07975M9768o360J03210M9084
9674B67485J00995k8776m4407j09294l4790j1772R8961j1480K2736J9659j22387
$$ y = [94655, 147947, 192585, 74128, 7640, 27182, 93599, 165015, 196424, 100298, 57417, -54538, -195586, -107705, 5128, -13784, 48795, -16315, -128273, -199692, -159345, -114346, -98820, -86968, -173978, -240378, -249822, -129969, -147376, -24439, -30364, 19761, 136479, 33588, -73858, -57850, 1934, -25025, 35229, 11004, 88178, -27304, -53271, 38765, 14717, 38041, 31580, 36962, -47990, -107885, -22686, -35288, 19583, -841, -87799, -71189, -89050, -54855, -1498, 63985, 128136, 84695, 10822, -80276, -101909, -85030, -30207, -46160, -63924, -116657, -128253, -59663, 91330, 210998, 179758, 71783, 121551, 115191, 218401, 267485, 368480, 339704, 295297, 186003, 151213, 139441, 238402, 226922, 249658, 269317, 146930]
9663A46930k2691n1694j16377M3595Q5996P2356K899k2205J5740o8898L5254O9974
9651A90879M8054o6496p8146k3762P4364p6354M7788J50676P572p0117n3586l4279
9639A16593J16262J09000O5918q7413n3435J1869n2109j25184o3113L9456r0480
9628a2636Q6330J44914n9147k10672o9092P1270N6887N6073J8537l1707N5547
9617A06304L4214j5673R7151k2814p4926K3886N6454L4810K6472r1120p7998J04145
9605B00905J66859J2783r9410m4168R383j20906M2361J2903m2703p994j11823
9594A8190k2685J19177P0353O7326r6954p6990M5792m034k6660m6132O9260L2364
9582A49007L8441k512j39715l1365j00313m5165J4960P6586J19178L0591J3792
$$ y = [146930, 124239, 72545, -43832, -237, 85759, 158115, 161014, 138809, 154549, 85651, 120905, 190879, 238933, 172437, 94291, 70529, 144893, 68539, 116327, 267003, 274575, 204458, 150872, 116593, 232855, 341855, 407773, 320360, 266925, 278794, 226685, 101501, 38388, 77844, -12636, 73694, 218608, 159461, -51211, -120303, -49033, 7854, 63927, 82464, 50757, 106304, 140518, 124845, 221996, 199182, 124256, 148142, 204596, 239406, 265878, 174758, 96760, 200905, 367764, 380547, 281137, 236969, 246352, 125446, 167807, 180710, 138007, 130013, 18190, -4495, 114682, 185035, 252361, 155407, 78417, 124209, 120175, 93515, 47383, 116643, 149007, 187448, 184936, 45221, 13856, -86457, -131622, -116662, -40076, 79102, 109693, 123485]
9571A23485k1078N5454k1319P835k985r405p2267j5301k0425l5118R239P9754
9559G7869M730O915Q4750p997q036o1392p2935Q7025J02774p0464m8645l3576
9547F1018k8140O1038Q2617m8557j65757k0040N4934j00504j4502O547n3612L6092
9535a28866Q9192N2698K5268L2062m4589j10169l4782R5489O4335p0810J03878
9524G3706J26145o7976K1425J15326l9503n4745j6870J345J2554K1872k4940K10367
9512C78706P8264j55388q9267k7510q8211j46418m064L0605J29223l7831n5684
9501A2425K7284O0623l6447k8083M9705n8515n8423J03799K0188p0813J11365
9490A33108J17749R5304q5546j7466J16871O1455r6044j59597m612K4091J17567
$$ y = [123485, 102407, 157861, 136542, 144377, 141392, 131987, 59720, 44419, 23994, -11124, -1885, 77869, 82599, 89514, 174264, 166267, 158231, 96839, 23904, 110929, 213703, 143239, 94594, 61018, 32878, 93916, 176533, 127976, -37781, -57821, -2887, -103391, -117893, -111346, -164958, -128866, -39674, 13024, 38292, 70354, 25765, -84404, -119186, -23697, 40638, -30172, 73706, 199851, 131875, 153300, 268626, 229123, 174378, 157508, 158853, 171407, 193279, 168339, 378706, 456970, 301582, 212315, 184805, 96594, -49824, -53888, -23283, 105940, 68109, 12425, 39709, 100332, 63885, 35802, 85507, 26992, -31431, 72368, 92556, 21743, 133108, 250857, 346161, 260615, 243149, 360020, 421475, 325431, 165834, 161222, 185313, 302880]
9479C02880L5402L0613N2503k8477r2655m2204n859J3002o7027J1720M9589N0248
9467C09735r3331j3186J08675J62608m6067n9424k0768k7840k4624J7891J9475
9456C33144O3J79854m9398Q4200r065N217K1946l6156M3935R6824L5027p7318
9444F28273L0160J26519J2208J3772m2027m6904M533J2058J41672P4579J01325
9433A056168R6359J6587M7099L3157M2728Q0224J7097p992l0947J43359K02452
9422A696291J18568O9972K33342J38151K11987J51942K41430K84883J93116L01275
9412C640957M94155M11000L99250N55201O91001R71402J165737J275912J363872
9403A0968487J516738J692359K034786K524717L338026M524642O433067R256720
$$ y = [302880, 338282, 368895, 421398, 392921, 300266, 258062, 252203, 265205, 198178, 209898, 259487, 309735, 216404, 203218, 311893, 474501, 428434, 369010, 348242, 320402, 295778, 313669, 333144, 333207, 513061, 463663, 547863, 538798, 544015, 565961, 529805, 573740, 670564, 705591, 628273, 658433, 784952, 797160, 810932, 768905, 722001, 726534, 738592, 880264, 954843, 1056168, 1152527, 1169114, 1216213, 1249370, 1292098, 1372322, 1389419, 1381427, 1350480, 1493839, 1696291, 1814859, 1884831, 2118173, 2256324, 2468311, 2620253, 2861683, 3146566, 3339682, 3640957, 4135112, 4546112, 4945362, 5500563, 6191564, 7162966, 8328703, 9604615, 10968487, 12485225, 14177584, 16212370, 18737087, 22075113, 26599755, 33032822, 42289542]
9395D2289542J3898658K0493061K7357728K7488704J3168573q357249k2233885
9388A14105132k4034310j9924298j4791055j0668042p715157n688461m342448
9381B6941361l372081k445213j793465j379658j081395p50986m34045j75291R9607
9372A5608834L88084P08906J037532J487625J963782K286656K361462K525130
9364B8368011L026415L814628N003945O816959R352240J3231055J9971424L1340321
9356A20924998M8683821O6432043O1066346J4474865l8452458n9649007n4139441
9349A59341167m0330805k8155616j9442081j3925309j0205515p518573n730194
9342C4033074m500546l592907k939269k414936j800292j321553j034218o09718
$$ y = [42289542, 56188200, 76681261, 104038989, 131527693, 144696266, 136339017, 114105132, 90070822, 70146524, 55355469, 44687427, 36972270, 31283809, 26941361, 23569280, 21124067, 19330602, 17950944, 16869549, 16118563, 15684518, 15509227, 15608834, 15996918, 16705824, 17743356, 19230981, 21194763, 23481419, 25842881, 28368011, 31394426, 35209054, 40212999, 47029958, 56382198, 69613253, 89584677, 120924998, 169608819, 236040862, 297107208, 311582073, 273129615, 213480608, 159341167, 119010362, 90854746, 71412665, 57487356, 47281841, 39763268, 34033074, 29532528, 25939621, 23000352, 20585416, 18785124, 17463571, 16429353, 15819635]
9334A5819635m71277j34409J14428L88922P45434Q32619J020877J132322J445339
9325B0893890K190791K887392L679832N183387P302217J0775938J5984944K2273049
9317I1171440K6465665J9659202K26609j8258930k5054018k2680575j7370751
9310E4158642j2462808q879506o408412m756704l619282k922122k359604j795514
9302A0954690j302770j131831j029360r48338q31147o09283m58716n29053l71607
9293C742585k63480k01350k55071j70602j35516j96596p2961q6890j71046j03711
9283B085362j36028j22236M7867j73428j97703j00416p9625N2874l6845R224j01901
9272A247145q0414j11555K2589O8208p5909o4395N682l0159l6261R412M9852M910
$$ y = [15819635, 15348358, 15213949, 15328377, 15717299, 16462733, 17295352, 18316229, 19448551, 20893890, 23084681, 25972073, 29651905, 34835292, 42137509, 52913447, 68898391, 91171440, 117637105, 137296307, 137522916, 119263986, 94209968, 71529393, 54158642, 41695834, 32816328, 26407916, 21651212, 18031930, 15109808, 12750204, 10954690, 9651920, 8520089, 7490729, 6542391, 5711244, 5101961, 4643245, 4114192, 3742585, 3479105, 3277755, 3022684, 2852082, 2716566, 2519970, 2447009, 2360119, 2189073, 2085362, 1949334, 1827098, 1874965, 1701537, 1503834, 1403418, 1323793, 1376667, 1339822, 1349046, 1247145, 1166731, 1055176, 1077765, 1145973, 1070064, 1005669, 1011351, 981192, 944931, 954343, 1004195, 1009105]
9260A009105o6351p9234j24345M9906O8792j4392n4907o5427L4622M83l1005k8438
9248F98809J6726J3360O2044k4647j64768m8027N9740o935j8624l175N1664L9616
9236F75783j0891n386K5642N5297O7874j8118J8868M0537P124j9511j27511j78118
9224E31590k337Q5002j3110j7424q847O4238K4399K2903n2258p9986N1007j9408
9212E85769J0071N6254N1160j26853j40908K1501J58874J00629P8828J18527p2093
9201H41759J438l8757j95871j64465j09025j8170K50203Q5767M7205q7930l26
9190F11828k9305k5024P6202L3337K5262J49666L2039K1725P557N6706R6317m9652
9178A006658j06407j8509J97299N8647R0075K18416J14028J30532J00354J45275
$$ y = [1009105, 942754, 863520, 739175, 789081, 857873, 843481, 788574, 723147, 757769, 758252, 727247, 698809, 715535, 728895, 790939, 766292, 601524, 553497, 613237, 606302, 587678, 584503, 636167, 675783, 664892, 659506, 685148, 740445, 808319, 790201, 809069, 849606, 856730, 837219, 709708, 531590, 529253, 614255, 601145, 583721, 574874, 639112, 663511, 686414, 634156, 554170, 605177, 585769, 595840, 652094, 703254, 576401, 435493, 456994, 615868, 716497, 795325, 913852, 841759, 843197, 804440, 608569, 444104, 335079, 316909, 567112, 652879, 700084, 612154, 611828, 582523, 557499, 633701, 667038, 692300, 841966, 874005, 895730, 903287, 959993, 1056310, 1006658, 900251, 881742, 1079041, 1137688, 1227763, 1446179, 1560207, 1690739, 1791093, 1936368]
9168A936368R5655R4066K4223J49555L42595L31173L61393M87933M84558N67121
9158D874640O75047P17358P16740Q33752J044249J362266J853031K545405L725803
9149A8348291N444075Q348902J2661002J7564394J8227356Q091019p205671j5745933
9141F5733435j6057372j2683363r073188o514390m736216l366802k383968j816510
9133I101626j453437j227537r44757q05040o30052m92505l48840m00426l17548
9124B481484k67637j53268j21531n6617k21961k39131k82331j44391n0227m2887
9114I01503l8671o7487r4187O1762K6919m4187j5367q2391k735P217j128Q0897
9102G32145p9877l3959O719q065J9301O8375p1499O7088r1328j61874n7821m8948
$$ y = [1936368, 2032023, 2126089, 2150312, 2299867, 2642462, 2973635, 3335028, 3822961, 4307519, 4874640, 5549687, 6267045, 6983785, 7817537, 8861786, 10224052, 12077083, 14622488, 18348291, 23792366, 32141268, 44802270, 62366664, 80594020, 88685039, 81479368, 65733435, 49676063, 36992700, 27919512, 21405122, 16668906, 13302104, 10918136, 9101626, 7648189, 6420652, 5475895, 4670855, 4040803, 3548298, 3199458, 2799032, 2481484, 2213847, 2060579, 1939048, 1882431, 1660470, 1421339, 1139008, 994617, 944390, 901503, 862832, 795345, 701158, 762920, 789839, 745652, 730285, 647894, 645159, 652376, 651248, 732145, 652268, 618309, 625028, 616963, 636264, 704639, 633140, 700228, 608900, 447026, 389205, 340257]
9090C40257J7541J1425r1234j00010j2756J71107P6709q317J1632L2048j01222
9079C47180j09483r871O0629j06312o2376L4512O7925P2639O071p5532N200J5001
9067B45583j43545p7384M7050m9685Q8567N8986l7849j5152K1691R4002L4162
9056B66426m2461o1187j7430n1403k3599N2869l309r0418P8533J18040L6654l3507
9044B29208j47383k1816m171M2705L0178Q3312m2001p1276k6766r8000L270J00622
9032G7882k3736O2937k9962q4053j349j20977R0803L6892j58658r0333Q4963R6109
9020e9482J57693J06888j4040o934p8961r1451M4045n2926o2431N9018O8683j8675
9008E1427j43354l4671P8562N6920N9854Q3821j3682o4655o1753J02604M227n8656
$$ y = [340257, 357798, 369223, 277989, 177979, 165223, 336330, 413039, 404722, 416354, 448402, 347180, 237697, 227826, 288455, 182143, 119767, 154279, 222204, 294843, 300914, 225382, 230582, 245583, 102038, 24654, 71704, 22019, 110586, 169572, 131723, 116571, 138262, 232264, 266426, 223965, 162778, 145348, 93945, 70346, 123215, 119906, 29488, 108021, 226061, 262715, 229208, 81825, 60009, 55838, 98543, 128721, 212033, 170032, 98756, 71990, -26010, -22740, 77882, 54146, 117083, 87121, 3068, 1719, -119258, -28455, 8437, -150221, -240554, -155591, -59482, 98211, 205099, 191059, 184125, 105164, 13713, 57758, 4832, -57599, 1419, 70102, 51427, -91927, -126598, -48036, 8884, 68738, 152559, 138877, 74222, 12469, 115073, 119300, 60644]
8996F0644J5182L4352k0622n5541m336k0275m680K8394J241R3422L8436J4457
8984A80674N9504k6012m5588L4928R6509K7998p9145k7633J1085n7217j714l3731
8972A39658m2410R3794M4989J8664k8082L5818q1165j02627Q1776K3664p2400
8961A11679P9343M0459r3982m2032O2117O9609l3291j23071m6944O2635j6787
8950F9735j34782m3155j04370N9222J74771M162m6057J6987L7443J7172O5042
8939A16170N1893M8339m7725j6421k3219l9102J5506R7722r8652j04462p340P0292
8927F3001L2219k7832j45313R7749M2509L9879K9933p6128j38630k4711j4685
8916a22009Q5736P0986P7375p3444M7808M9953M2213O2901O5135J4729j48895
$$ y = [60644, 75826, 110178, 89556, 34015, 29679, 9404, 4724, 33118, 34359, 127781, 166217, 180674, 240178, 214166, 168578, 203506, 300015, 328013, 248868, 221235, 232320, 175103, 173389, 139658, 97248, 191042, 236031, 254695, 226613, 262431, 181266, 78639, 160415, 184079, 111679, 191022, 231481, 137499, 95467, 157584, 227193, 193902, 70831, 23887, 86522, 69735, -65047, -108202, -212572, -153350, 21421, 25583, -20474, -3487, 33956, 51128, 116170, 168063, 216402, 168677, 152256, 129037, 89935, 105441, 203163, 104511, 49, -7291, 63001, 95220, 67388, -77925, 19824, 62333, 102212, 132145, 56017, -82613, -107324, -122009, -36273, 34713, 112088, 38644, 86452, 136405, 178618, 241519, 306654, 321383, 172488]
8905A72488l2674J21733P0501j37789j66980r7181R5115M7459m2400J5702K9092
8894G5066M1831j1657k8411L8534m51j02627Q533M1499j0861J6567J00792o8981
8882I9834j3596M7215O2483j1437k6244j26126k0444k6338P3364R4190n9359j19870
8870b6328q3119K2954q42L0133J38965J97031j64309j73898k9192j8536m5054
8859a52195k0880k0766R9728J61831O6765l1722M9687Q3143N628l9430j54674
8848D7115m9172K702R918J119m6926K2423n646J6477L0699k5196m3075O252N8936
8835B5626M3644K007o3178l3646O5541n5443j09963n8033J0572O8647K8263j9642
8823i5605O7946M9529m5685o3666r022J20058J16212L6782P556k0621M7001J26220
$$ y = [172488, 139814, 261547, 332048, 194259, 27279, -69902, 25213, 72672, 30272, 45974, 75066, 116897, 105240, 76829, 115363, 114912, 12285, 20818, 62317, 51456, 68023, 168815, 99834, 86238, 133453, 195936, 184499, 158255, 32129, 11685, -14653, 58711, 152901, 93542, -26328, -109447, -86493, -87335, -57202, 81763, 278794, 114485, -59413, -88605, -107141, -152195, -173075, -193841, -94113, 67718, 134483, 102761, 152448, 235591, 241219, 201789, 47115, -2057, 645, 10563, 11682, -35244, -12821, -18467, -1990, 28709, 3513, -39562, -33310, 25626, 69270, 71277, 8099, -25547, 39994, -15449, -125412, -183445, -172873, -104226, -75963, -95605, -27659, 21870, -23815, -87481, -96503, 23555, 139767, 176549, 184105, 163484, 210485, 336705]
8811C36705o5627l4762M8579p1219n2750q5314q063O8256m3814j0249r949n1897
8799A9896m7828J3918J12952J8848j8283l342k3760L559j9925R4546p6669r4002
8787b0090Q4951J6059O5197L6382K5389M5767o5940q3779j9839o6179p8482K0063
8775d0501J5462J2850j02274Q0730O7387n1856K4903j0729O117J6325J69487J4106
8763B02007j20512j68302p5966M232K1499J07310O7705J16734o7751j2667O9442
8752A43731O0042k990l2176K7688K1856n6932k7237q798j2087L1784L0572j21099
8740E4354N173J31094j8842j00443Q6872Q8859N5911j5422J6686p6932j72623
8729E4687l221j2352L0725L5499J07413m3486n9373q2515k3673j25978N8167O2326
$$ y = [336705, 271078, 236316, 284895, 213676, 160926, 75612, 67549, 135805, 91991, 81742, 71793, 19896, -27932, -14014, 98938, 117786, 99503, 96161, 72401, 75960, 56035, 150581, 73912, -20090, 64861, 80920, 146117, 182499, 207888, 253655, 187715, 103936, 84097, 17918, -60564, -40501, -25039, -12189, -114463, -33733, 33654, -18202, 6701, -4028, 2089, 18414, 187901, 202007, 81495, -86807, -162773, -158541, -137042, -29732, 37973, 154707, 86956, 74289, 143731, 203773, 200783, 168607, 196295, 218151, 161219, 133982, 125184, 113097, 144881, 175453, 54354, 59527, 190621, 171779, 71336, 158208, 247067, 302978, 287556, 304242, 227310, 54687, 51466, 39114, 69839, 105338, 212751, 169265, 109892, 27377, 3704, -122274, -64107, -1781]
8717a781K25989L0051j07554L3876L8359Q304m1739M7000L4612n3949Q73r235
8705B04806o4592l8584J7610J29266J82157J263r0939j00914j11806n4408N7680
8694A31539M4852p0018J7954N5211M0183j22605q9334p5963r9595L4191Q7557
8683d6028L8556P5914J84460o0r1838q0080k1849J3256p2509L6790m668J3216
8671D5160l4059j969J9716k1522K4307P7889K9176n3292k0899Q562j5117m7359
8659A0593P4166Q9638l2076l9558J1144J1836M2711P309m0076o7798J29603J5859
8647B13351r2802J0934j6324j31213k1411J919L4795l9320L9725P733J6450M3263
8635F7100O5517o2274j30957P3646J6481P9824N0184j71350j36406R0054K5540
$$ y = [-1781, 224208, 254259, 146705, 180581, 218940, 227244, 185505, 232505, 267117, 213168, 214041, 204806, 140214, 101630, 119240, 248506, 430663, 431926, 340987, 240073, 128267, 73859, 131539, 176391, 106373, 124327, 179538, 219721, 97116, 7782, -68181, -167776, -133585, -46028, -7472, 68442, 252902, 252842, 161004, 80924, 59075, 72331, -178, 36612, 31944, 45160, 11101, 9132, 28848, 7326, 31633, 109522, 138698, 85406, 64507, 73069, 57952, 10593, 84759, 174397, 142321, 102763, 113907, 125743, 168454, 175763, 135687, 67889, 197492, 213351, 120549, 131483, 115159, -16054, -37465, -35546, -751, -40071, -346, 7387, 23837, 67100, 132617, 70343, -60614, 13032, 29513, 109337, 159521, -11829, -148235, -58181, -32641]
8624c2641R1261O5147N0134M3268L6287j10083j32299j3833M7197M0799j6692
8613F8545q4076j5558J4757Q2866K65o4990k9555O7616R4753J27056r641k2461
$$ y = [-32641, 58620, 123767, 173901, 217169, 253456, 143373, 11074, -2759, 44438, 85237, 68545, -15531, -31089, -16332, 66534, 66799, 1809, -27746, 39870, 134623, 261679, 252038, 229577]
$$ [...]
##END NTUPLES=NMR SPECTRUM
##END=
