##TITLE=Analysis number 317193
Compound Code cc 34410
Book Reference 451/117
Project Code adrs
Chemist Name evam
##JCAMPDX= 6.0         $$ Bruker NMR JCAMP-DX V2.0
##DATA TYPE= NMR SPECTRUM
##DATA CLASS= NTUPLES
##ORIGIN= Bruker BioSpin GmbH
##OWNER= nmr
$$ XWIN-NMR		Version 3.5
$$ Fri Feb 10 09:01:50 2006 GMT Standard Time (UT+0h)  MAYBRIDGE\nmr@NMR_250MHZ
##.OBSERVE FREQUENCY= 250.131544655141
##.OBSERVE NUCLEUS= ^1H
##.ACQUISITION MODE= SIMULTANEOUS (DQD)
##.ACQUISITION SCHEME= undefined
##.AVERAGES= 16
##.DIGITISER RES= 18
##SPECTROMETER/DATA SYSTEM= dpx250
##.PULSE SEQUENCE= zg30
##.SOLVENT NAME= CDCl3
##.SHIFT REFERENCE= (INTERNAL, CDCl3, 0, 16.522)
##AUDIT TRAIL= $$ (NUMBER, WHEN, WHO, WHERE, WHAT)
$$ ##TITLE= Audit trail, XWIN-NMR		Version 3.5
$$ ##JCAMPDX= 5.01
$$ ##ORIGIN= Bruker BioSpin GmbH
$$ ##OWNER= nmr
$$ C:\u/data/dgb/nmr/ADRS/15830/pdata/1/auditp.txt
$$ ##AUDIT TRAIL=  $$ (NUMBER, WHEN, WHO, WHERE, WHAT)
(   1,<2006-02-10 09:00:56.34 +000>,<MAYBRIDGE\nmr>,<NMR_250MHZ>,
      <created by zg, POWCHK disabled, PULCHK disabled
       configuration hash MD5:
       84 BC 41 DB A1 6E 1D 46 DA 25 12 A5 C1 ED C5 3A
       data hash MD5: 64K
       8D 33 E6 85 49 DD A0 25 FE 20 98 A6 3E 1A 11 BF>)
(   2,<2006-02-10 09:01:17.21 +000>,<MAYBRIDGE\nmr>,<NMR_250MHZ>,
      <Start of raw data processing
       ef LB = 0.3 FT_mod = 6 PKNL = 1 SI = 32K 
       data hash MD5: 32K
       2C FA A9 28 80 7B 6A 84 A7 91 15 C6 E7 A5 73 33>)
(   3,<2006-02-10 09:01:20.81 +000>,<MAYBRIDGE\nmr>,<NMR_250MHZ>,
      <apk 
       data hash MD5: 32K
       8F AE 2F C4 AC 82 52 EB 50 D5 E4 06 13 46 5E 37>)
(   4,<2006-02-10 09:01:21.71 +000>,<MAYBRIDGE\nmr>,<NMR_250MHZ>,
      <abs ABSG = 5 
       data hash MD5: 32K
       96 4A 74 A3 0A D3 F9 88 C9 B6 DA 7B 4C 41 71 1B>)
$$ ##END=
$$ 
$$ hash MD5
$$ 57 5B 78 4F 7A 4C 86 A7 F7 72 E9 B5 D4 8B FB 0B
##$RELAX= 
##$RELAX= 
##$RELAX= 
##$RELAX= 
##$RELAX= 
##$RELAX= 
##$RELAX= 
$$ Bruker specific parameters
$$ --------------------------
##$DU= <C:\u>
##$EXPNO= 15830
##$NAME= <ADRS>
##$PROCNO= 1
##$TYPE= <nmr>
##$USER= <dgb>
##$AMP= (0..31)
100 100 100 100 100 100 100 100 100 100 100 100 100 100 100 100 100 100 
100 100 100 100 100 100 100 100 100 100 100 100 100 100 
##$AQSEQ= 0
##$AQ_mod= 3
##$AUNM= <au_zg>
##$AUTOPOS= <1 >
##$BF1= 250.13
##$BF2= 250.13
##$BF3= 250.13
##$BF4= 250.13
##$BF5= 500.13
##$BF6= 500.13
##$BF7= 500.13
##$BF8= 500.13
##$BYTORDA= 1
##$CFDGTYP= 0
##$CFRGTYP= 5
##$CHEMSTR= <none>
##$CNST= (0..31)
1 1 145 1 1 1 1 1 1 1 1 1 1 1 1 1 1 1 1 1 1 1 1 1 1 1 1 1 1 1 1 1 
##$CPDPRG= <>
##$CPDPRG1= <>
##$CPDPRG2= <>
##$CPDPRG3= <>
##$CPDPRG4= <mlev>
##$CPDPRG5= <mlev>
##$CPDPRG6= <mlev>
##$CPDPRG7= <mlev>
##$CPDPRG8= <mlev>
##$CPDPRGB= <>
##$CPDPRGT= <>
##$D= (0..31)
0 1 0 0 0 0 0 0 0 0.06 0 0 0 0 0 0 0.0002 0 0 0 0 0 0 0 0 0 0 0 0 0 0 
0 
##$DATE= 1139562054
##$DBL= (0..7)
120 120 120 120 120 120 120 120 
##$DBP= (0..7)
150 150 150 150 150 150 150 150 
##$DBP07= 0
##$DBPNAM0= <>
##$DBPNAM1= <>
$$ [...]
##$SUBNAM7= <"">
##$SUBNAM8= <"">
##$SUBNAM9= <"">
##$SW= 20.6930455092707
##$SWIBOX= (0..15)
0 0 3 0 0 0 0 0 0 0 0 0 0 0 0 0 
##$SW_h= 5175.983436853
##$TD= 65536
##$TD0= 1
##$TE= 294.16
##$TE2= 300
##$TE3= 300
##$TEG= 300
##$TL= (0..7)
0 120 120 120 120 120 120 120 
##$TP= (0..7)
150 150 150 150 150 150 150 150 
##$TP07= 0
##$TPNAME0= <>
##$TPNAME1= <>
##$TPNAME2= <>
##$TPNAME3= <>
##$TPNAME4= <>
##$TPNAME5= <>
##$TPNAME6= <>
##$TPNAME7= <>
##$TPOAL= (0..7)
0.5 0.5 0.5 0.5 0.5 0.5 0.5 0.5 
##$TPOFFS= (0..7)
0 0 0 0 0 0 0 0 
##$TUNHIN= 0
##$TUNHOUT= 0
##$TUNXOUT= 0
##$USERA1= <user>
##$USERA2= <user>
##$USERA3= <user>
##$USERA4= <user>
##$USERA5= <user>
##$V9= 5
##$VALIST= <valist>
##$VCLIST= <CCCCCCCCCCCCCCC>
##$VD= 0
##$VDLIST= <DDDDDDDDDDDDDDD>
##$VPLIST= <PPPPPPPPPPPPPPP>
##$VTLIST= <TTTTTTTTTTTTTTT>
##$WBST= 1024
##$WBSW= 4
##$XGAIN= (0..3)
0 0 0 0 
##$XL= 0
##$YL= 0
##$YMAX_a= 329330
##$YMIN_a= -409859
##$ZGOPTNS= <>
##$ZL1= 120
##$ZL2= 120
##$ZL3= 120
##$ZL4= 120
##$ABSF1= 16.522
##$ABSF2= -4.171173
##$ABSG= 5
##$ABSL= 3
##$ALPHA= 0
##$AQORDER= 0
##$ASSFAC= 0
##$ASSFACI= 0
##$ASSFACX= 0
##$ASSWID= 0
##$AUNMP= <proc_1d>
##$AZFE= 0.1
##$AZFW= 0.1
##$BCFW= 0
##$BC_mod= 0
##$BYTORDP= 0
##$COROFFS= 0
##$CY= 12.5
##$DATMOD= 1
##$DC= 0
##$DFILT= <>
##$DTYPP= 0
##$F1P= 14.0000005364418
##$F2P= -0.99999901652339
##$FCOR= 0.5
##$FTSIZE= 32768
##$FT_mod= 6
##$GAMMA= 0
##$GB= 0
##$INTBC= 1
##$INTSCL= 1
##$ISEN= 128
##$LB= 0.3
##$LEV0= 0
##$LPBIN= 0
##$MAXI= 10000
##$MC2= 0
##$MEAN= 0
##$ME_mod= 0
##$MI= 0
##$NCOEF= 0
##$NC_proc= -3
##$NLEV= 6
##$NOISF1= 0
##$NOISF2= 0
##$NSP= 0
##$NTH_PI= 0
##$NZP= 0
##$OFFSET= 16.522
##$PC= 1
##$PHC0= 107.8002
##$PHC1= -12.86681
##$PH_mod= 1
##$PKNL= yes
##$PPARMOD= 0
##$PSCAL= 4
##$PSIGN= 0
##$REVERSE= no
##$SF= 250.13
##$SI= 32768
##$SIGF1= 0
##$SIGF2= 0
##$SINO= 400
##$SIOLD= 32768
##$SREGLST= <1H.CDCl3>
##$SSB= 0
##$STSI= 32768
##$STSR= 0
##$SW_p= 5175.98343685301
##$SYMM= 0
##$S_DEV= 0
##$TDeff= 65536
##$TDoff= 0
##$TI= <Analysis number 999999
Compound Code 99
Book Reference 9
Project Code 9>
##$TILT= no
##$TM1= 0
##$TM2= 0
##$TOPLEV= 0
##$USERP1= <user>
##$USERP2= <user>
##$USERP3= <user>
##$USERP4= <user>
##$USERP5= <user>
##$WDW= 1
##$XDIM= 32768
##$YMAX_p= 293399852
##$YMIN_p= -112171
$$ End of Bruker specific parameters
$$ ---------------------------------
##NTUPLES= NMR SPECTRUM
##VAR_NAME=  FREQUENCY,     SPECTRUM/REAL,   SPECTRUM/IMAG
##SYMBOL=    X,             R,               I
##VAR_TYPE=  INDEPENDENT,   DEPENDENT,       DEPENDENT
##VAR_FORM=  AFFN,          ASDF,            ASDF
##VAR_DIM=   32768,         32768,           32768
##UNITS=     HZ,            ARBITRARY UNITS, ARBITRARY UNITS
##FACTOR=    0.157963299565203, 1,           1
##FIRST=     4132.6476996994, 0,             0
##LAST=      -1043.33573715361, 0,           0
##MIN=       -1043.33573715361, -112171,     0
##MAX=       4132.6476996994, 293399852,     0
$$ Real data points
##PAGE= N=1
##DATA TABLE= (X++(R..R)), XYDATA
$$ [...]
$$ plain form
24500 18520 1409 25624 41079 40591 37286 19193 -11473 -5764 -15869 -28567 -38240 -52804 -36724
24487 -36724 -22840 -25024 -19394 -24448 -30108 -41932 -30636 -2084 9980 -19157 -21374 -22598 -13949
24474 -13949 -29637 -31222 -30008 -555 12569 -9904 -32129 -34981 -37231 -14529 -12027 -30219 -23876
24461 -23876 4035 -7010 -9779 -23532 -29627 -18143 -6108 -20729 -78211 -41790 6884 38497
24449 38497 35327 26406 559 1636 7614 -10217 -48670 -46542 9227 17928 -25302 -54582 -19770
24436 -19770 9207 32721 59178 65413 35912 -11573 2900 1180 -8568 -13724 6066 -2181 -41827
24423 -41827 -6414 9645 22410 14763 -16847 -24883 -23257 -24680 -49715 -24805 413 24409
24411 24409 25752 19233 11553 -17146 -9238 -9657 -13486 -18183 -15099 11048 14021 31081 13391 7409
$$ packed form
24500A8520j7111K4215J5455m88l305j8093l0666N709j0105j2698r673j4564J6080
24487c6724J3884k184N630n054n660j1824J1296K8552J2064k9137k217j224Q649
24474a3949j5688j585J214K9453J3124k2473k2225k852k250K2702K502j8192O343
24461b3876K7911j1045k769j3753o095J1484J2035j4621n7482L6421M8674L1613
24449C8497l170q921k5847J077N978j7831l8453K128N5769Q701m3230k9280L4812
24436a9770K8977K3514K6457O235k9501m7485J4473j720r748n156J9790q247l9646
24423d1827L5413J6059J2765p647l1610q036J626j423k5035K4910K5218K3996
24411B4409J343o519p680k8699P908m19l829m697L084K6147K973J7060j7690n982
$$ plain form
24397 7409 4618 11494 16739 39325 24710 -5709 -14102 -3214 8000 27213 25456 7001 -2734
24384 -2734 -18319 -2564 -4871 -11903 -6756 13251 11529 3400 13959 34607 8618 42 14377
24371 14377 -16524 9831 23727 1261 -20036 -5361 -9738 2477 -25719 -34608 8713 26911
24359 26911 16785 33319 2346 -30548 -13561 -36745 -45434 -4777 26188 17680 2768 2931
24347 2931 -3972 -7480 -25427 -43295 -19521 10632 -1307 12358 39960 34241 800 -11951
24335 -11951 -6629 -27927 -50668 -66003 -59392 -18954 10913 5488 -15847 -15878 -18410 -2371 -17391
24322 -17391 -12478 4244 -11505 -42129 -35108 -4317 -3638 -4389 -3853 -32895 -32926 -20114 -9002 -16389
24308 -16389 -40136 -30627 -33214 -57761 -38314 -28219 -52209 -58757 -45343 -30897 -28772 -18948 4912
$$ packed form
24397G409k791O876N245K2586j4615l0419q393J0888J1214J9213j757j8455r735
24384b734j5585J5755k307p032N147K0007j722q129J0559K0648k5989q576J4335
24371A4377l0901K6355J3896k2466k1297J4675m377J2215k8196q889M3321J8198
24359B6911j0126J6534l0973l2894J6987k3184q689M0657L0965q508j4912J63
24347B931o903l508j7947j7868K3774L0153j1939J3665K7602n719l3441j2751
24335a1951N322k1298k2741j5335O611M0438K9867n425k1335l1k532J6039j5020
24322a7391M913J6722j5749l0624P021L0791O79p51N36k9042l1J2812J1112p387
24308a6389k3747R509k587k4547J9447J0095k3990o548J3414J4446K125R824K3860
$$ plain form
24295 4912 4334 3260 4253 15143 35315 30298 42140 60752 48493 18655 -1292 18579 -504
24282 -504 -14297 -23311 -25860 -18272 -14507 -301 14250 -4355 -24958 4599 -2663 -33563 -61648
24269 -61648 -47876 -38644 -42690 -4943 17318 11297 2565 44490 60746 31488 -10250 -32052
24257 -32052 -46381 -21696 -11611 -51653 -75392 -70308 -27719 -17170 -43105 -49629 21334 49187
24245 49187 38633 33647 34159 11764 -33265 -16731 16598 33792 158 -12046 -4760 13173
24233 13173 3652 -32966 -21377 244 43999 35353 7752 -15784 7168 31594 7191 -2351
24221 -2351 -31229 -42116 -30899 -18841 -18343 6573 -19540 -48061 -37919 -36715 -38550 -38263 -47530
24208 -47530 -42746 1236 30704 33536 31252 63960 59441 -3270 -45872 -71899 -60525 -23065
$$ packed form
24295D912n78j074R93J0890K0172n017J1842J8612j2259k9838j9947J9871j9083
24282e04j3793r014k549P588L765J4206J4551j8605k0603K9557p262l0900k8085
24269f1648J3772R232m046L7747K2261o021q732M1925J6256k9258m1738k1802
24257c2052j4329K4685J0085m0042k3739N084M2589J0549k5935o524P0963K7853
24245D9187j0554m986N12k2395m5029J6534L3329J7194l3634j2204P286J7933
24233A3173r521l6618J1589K1621M3755q646k7601k3536K2952K4426k4403r542
24221b351k8878j0887J1217J2058M98K4916k6113k8521J0142J204j835K87r267
24208d7530M784M3982K9468K832k284L2708m519o2711m2602k6027J1374L7460
$$ plain form
24196 -23065 11906 10937 39670 31163 16030 21089 13165 8836 -145 19582 28601 15264 9814
24183 9814 -9361 -5411 1092 7005 3693 -4564 -1019 1214 -17522 -18261 -18106 -33657 -38563 -20566
24169 -20566 -6561 -2576 3091 7448 15519 10422 11972 19258 -3687 -10717 -25067 -34327 -21182
24156 -21182 -29406 -28699 -30201 -40290 -17715 13694 -6511 14037 4559 3196 -1960 -38491 -12042
24143 -12042 14154 31018 16996 16217 27760 34404 28330 45306 35596 22232 -18323 -34496 -44833
24130 -44833 -55453 -57985 -47990 -38013 -14660 -23827 -13436 227 6276 25688 16699 32273 49917
24117 49917 43113 -12626 -3851 17854 59896 9080 -517 9997 -8078 -38574 -56413 -28642
24105 -28642 -9243 17477 28222 31716 -11893 -57151 -65934 -81412 -66404 -34954 -21632 1842
$$ packed form
24196b3065L4971r69K8733q507j5133N059p924m329q981J9727R019j3337n450
24183I814j9175L950O503N913l312q257L545K233j8736p39J55j5551m906J7997
24169b0566J4005L985N667M357Q071n097J550P286k2945p030j4350r260J3145
24156b1182q224P07j502j0089K2575L1409k0205K0548r478j363n156l6531K6449
24143a2042K6196J6864j4022p79J1543O644o074J6976r710j3364m0555j6173j0337
24130d4833j0620k532R995R977K3353r167J0391J3663O049J9412q989J5574J7644
24117D9917o804n5739Q775K1705M2042n0816r597J0514j8075l0496j7839K7771
24105b8642J9399K6720J0745L494m3609m5258q783j5478J5008L1450J3322K3474
$$ plain form
24093 1842 -11664 -12329 -5464 5062 21353 -5949 -31681 -53909 -52621 -48154 -16518 13292 -9452
24080 -9452 -26711 -14571 -13300 -4582 -18421 -34767 -45991 -38814 -23578 -22424 -36880 -53950 -27717
24067 -27717 -2994 7550 10212 1852 13972 40059 60999 35357 -2872 -14946 -18873 3963
24055 3963 8534 24301 27712 13905 -5583 -28336 -47203 -54010 -47842 -19476 -2154 12907 -11119
24042 -11119 -36347 -13218 -14682 -3100 11910 -3679 -20827 -14761 -1834 14570 18944 1940
24030 1940 -17564 24781 25060 -1510 14346 48168 34767 19977 -10206 -30350 -14262 -4318
24018 -4318 6936 155 -28874 -29732 -36629 -46087 -51515 -10640 9682 13025 21511 -3189 -37583
24005 -37583 -45607 -10618 -13063 -19831 -10788 20445 35665 39975 29813 29246 38416 40388 5562
$$ packed form
24093A842j3506o65O865J0526J6291k7302k5732k2228J288M467L1636K9810k2744
24080i452j7259J2140J271Q718j3839j6346j1224P177J5236J154j4456j7070K6233
24067b7717K4723J0544K662q360J2120K6087K0940k5642l8229j2074l927K2836
24055C963M571J5767L411j3807j9488k2753j8867o807O168K8366J7322J5061k4026
24042a1119k5228K3129j464J1582J5010j5589j7148O066J2927J6404M374j7004
24030A940j9504M2345K79k6570J5856L3822j3401j4790l0183k0144J6088R944
24018d318J1254o781k9029q58o897r458n428M0875K0322L343Q486k4700l4394
24005c7583q024L4989k445o768R043L1233J5220M310j0162n67R170J972l4826
$$ plain form
23992 5562 14558 19609 12483 28249 44048 26670 7757 5666 -28323 -46643 -30058 -9033 11427
23979 11427 1566 417 36364 33776 35780 1654 -24476 -17475 -9406 -18718 -22004 -23761 -10609
23966 -10609 -12158 -32811 -43741 -27511 8116 37137 43217 -2424 -26695 -36292 -3410 17852
23954 17852 19127 31870 27312 -1596 -18213 -18263 2155 1776 -5937 -18730 -26398 -2989 -122 11636
23940 11636 39313 29733 -8290 -18116 -13904 1243 -11288 -31912 -10286 18513 25361 5210
23928 5210 14145 -13610 -23207 -10226 -13756 -42550 -28759 -21069 -2671 16494 -5909 -45780 -52978
23915 -52978 -37902 -28782 -35607 -41197 -25914 -31247 -34235 -47070 -42096 -36533 -8397 -9737 5645
23902 5645 -3744 -35729 -57304 -77951 -53113 -32100 -40448 -28308 7303 25250 997 -22667
$$ packed form
23992E562Q996N051p126J5766J5799j7378j8913k091l3989j8320J6585K1025K0460
23979A1427r861j149L5947k588K004l4126k6130P001Q069r312l286j757J3152
23966a0609j549k0653j0930J6230L5627K9021O080m5641k4271r597L2882K1262
23954A7852J275J2743m558k8908j6617n0K0418l79p713j2793p668K3409K867J1758
23940A1636K7677r580l8023r826M212J5147j2531k0624K1626K8799O848k0151
23928E210Q935k7755r597J2981l530k8794J3791P690J8398J9165k2403l9871p198
23915e2978J5076R120o825n590J5283n333k988j2835M974N563K8136j340J5382
23902E645r389l1985k1575k0647K4838K1013q348J2140L5611J7947k4253k3664
$$ plain form
23890 -22667 -26404 -18362 -10294 -20514 -13503 -9517 8985 21303 -14555 -45650 -55776 -45832 -1928
23877 -1928 5302 -16507 -10601 7439 9005 -20503 -68916 -56229 -12392 -761 29393 33787 7412
23864 7412 -6740 6170 13351 22339 34676 29895 37970 31417 2350 -367 23923 45936 39595
23851 39595 24413 30695 21449 -20352 -60165 -46033 -51045 -72899 -86070 -43027 -7843 4248
23839 4248 -6049 11359 47761 56937 24908 -17054 9246 10349 -3777 37657 37869 26983 16686
23826 16686 -4327 -531 -8211 -29251 -39085 -48412 -31950 -32296 -29979 -8671 11937 5634 2253
23813 2253 -18554 -28846 -33292 635 6657 20438 20752 -10525 5650 12435 508 -18486 -12772
23800 -12772 -23433 -19330 -3892 5545 -11929 5851 -7939 -49282 -22380 5551 23332 18291
$$ packed form
23890b2667l737Q042Q068j0220P011L986J8502J2318l5858l1095j0126R944M3904
23877a928P230k1809N906J8040J566k9508m8413J2687M3837J1631L0154M394k6375
23864G412j4152J2910P181Q988J2337m781Q075o553k9067k717K4290K2013o341
23851C9595j5182O282r246m1801l9813J4132n012k1854j3171M3043L5184J2091
23839D248j0297J7408L6402R176l2029m1962K6300J103j4126M1434K12j0886j0297
23826A6686k1013L796p680k1040r834r327J6462l46K317K1308K0608o303l381
23813B253k0807j0292m446L3927O022J3781L14l1277J6175O785j1927j8994N714
23800a2772j0661M103J5438R437j7474J7780j3790m1343K6902K7931J7781n041
$$ plain form
23788 18291 12363 24134 21549 -10629 -33699 -36461 -33055 -6708 -23018 -32284 -29524 -22457 -16402
23775 -16402 40458 27020 -4942 -7414 27256 14750 -22427 -30261 -15384 29534 21325 30033
23763 30033 23541 5631 -4370 -14182 -216 -9923 27161 24123 21088 12272 -444 -13041 -21607
23750 -21607 -42924 -73677 -52247 -52172 -25093 -26428 -22453 -12884 16064 22501 -13493 -30689 -33100
23737 -33100 -4654 3136 -7856 -19352 -41410 -31371 18025 32172 10518 -3484 -17625 -49675
23725 -49675 -41559 -14008 396 -16768 -32086 -33370 -39880 -36343 -5874 4376 9644 1889 -12354
23712 -12354 -32369 -55064 -54441 -29100 -25301 -16047 -5472 -42017 -77386 -60782 -27512 -2434
23700 -2434 -28351 -27635 -26475 -32713 -47884 -47846 -31763 665 364 -10692 -35004 -43012 -18587 4654
$$ packed form
23788A8291n928J1771k585l2178k3070k762L406K6347j6310r266K760P067O055
23775a6402N6860j3438l1962k472L4670j2506l7177p834J4877M4918q209Q708
23763C0033o492j7910j0001r812J3966r707L7084l038l035q816j2716j2597q566
23750b1607k1317l0753K1430P5K7079j335L975R569K8948O437l5994j7196k411
23737c3100K8446P790j0992j1496k2058J0039M9396J4147k1654j4002j4141l2050
23725d9675Q116K7551J4404j7164j5318j284o510L537L0469J0250N268p755j4243
23712a2354k0015k2695O23K5341L799R254J0575l6545l5369J6604L3270K5078
23700b434k5917P16J160o238j5171L8J6083L2428l01j1056k4312q008K4425K3241
$$ plain form
23686 4654 12053 16575 -16802 -19685 -13128 9752 -2311 -27476 -33658 -42542 -41243 -39815 -10584
23673 -10584 8940 -19011 -31675 -26565 -38739 -29472 -40030 -8071 -1097 -3975 -24487 -21146 -18047
23660 -18047 -12527 -40639 -28483 12075 58438 50655 38609 32516 37660 48561 65122 54720
23648 54720 20590 9853 10367 641 26216 28948 -12755 -31795 -32575 -17004 6909 -14534 -10231
23635 -10231 2555 7591 -3999 281 -5580 1031 -1743 -20739 -22810 -15660 -7683 5256 -16185
23622 -16185 -7878 9820 12861 -4372 -494 -22040 -5464 32727 25523 472 -33852 -35056 -34436
23609 -34436 -49912 -57878 -29625 -20862 1455 6803 -25482 -42824 -44441 -35143 -36847 -28475 -25124
23596 -25124 -31664 -26779 -24668 -12385 9709 -473 -23572 -764 25377 22149 4067 -10939
$$ packed form
23686D654P399M522l3377k883O557K2880j2063k5165o182q884J299J428K9231
23673a0584J9524k7951j2664N110j2174R267j0558L1959O974k878k0512L341L099
23660a8047N520k8112J2156M0558M6363p783j2046o093N144J0901J6561j0402
23648E4720l4130j0737N14r726K5575K732m1703j9040p80J5571K3913k1443M303
23635a0231J2786N036j1590M280n861O611k774j8996k071P150P977J2939k1441
23622a6185Q307J7698L041j7233L878k1546J6576L8191p204k5051l4324j204O20
23609c4436j5476p966K8253Q763K2317N348l2285j7342j617R298j704Q372L351
23596b5124o540M885K111J2283K2094j0182k3099K2808K6141l228j8082j5006
$$ plain form
23584 -10939 -1557 -45961 -16458 -15984 -8210 29166 18494 -11834 -10463 -23081 -40610 -12965 772
23571 772 -8639 10444 37715 50061 63970 41780 21235 14338 32641 45263 40519 23348 27854
23558 27854 7586 -19579 -25253 -17086 -6828 3122 22040 24282 17372 6862 -633 15361 18367
23545 18367 22743 26700 36107 10209 19899 50117 48155 46209 45978 31425 -7391 -14965 23879
23532 23879 18348 1397 -23527 -19466 -12129 -29416 -17440 -6615 21603 14072 -3786 -8256 -12050
23519 -12050 -18745 -45042 -70360 -50971 -18229 -3515 3329 22498 27665 36365 19445 45328
23507 45328 33390 6109 -20448 -35719 -29603 -22558 -9806 -39459 -52821 -32797 -16418 -14934
23495 -14934 -26320 -23638 -27918 -15130 -5012 12054 31933 11112 9139 38516 7613 -83
$$ packed form
23584a0939R382m4404K9503M74P774L7376j0672l0328J371j2618j7529K7645J3737
23571G72r411J9083K7271J2346J3909k2190k0545o897J8303J2622m744j7171M506
23558B7854k0268k7165n674Q167J0258R950J8918K242o910j0510p495J5994L006
23545A8367M376L957R407k5898R690L0218j962j946k31j4553l8816p574L8844
23532B3879n531j6951k4924M061P337j7287J1976J0825K8218p531j7858m470l794
23519a2050o695k6297k5318J9389L2742J4714O844J9169N167Q700j6920K5883
23507D5328j1938k7281k6557j5271O116P045J2752k9653j3362K0024J6379J484
23495a4934j1386K682m280J2788J0118J7066J9879k0821j973K9377l0903p696
$$ plain form
23483 -83 10548 17296 40421 11231 -19186 -11392 20979 12235 -591 14829 18191 13758 32853
23470 32853 38448 31222 2978 -17474 -11281 -22075 -37655 -59794 -74759 -40677 -13764 -8890
23458 -8890 8401 12005 1710 -2118 -2829 -19297 -14688 -8230 -6207 -820 770 9360 6723 -2428
23444 -2428 -32 2 -791 -7215 -22973 -23228 -35152 -53572 -65645 -50356 -24360 -20277 -35269 -47828
23430 -47828 -22100 -950 27120 48702 17018 -14402 -45556 -44561 -31917 -16011 8416 21210
23418 21210 11535 14200 36608 79172 64284 40954 20958 -11605 -16865 -8279 -28098 -16505
23406 -16505 -12969 -354 18061 39689 52055 63570 62694 41938 14240 19053 14722 14258 32186
23393 32186 16707 3798 17348 10165 23056 42521 41297 22970 16909 2475 -2757 -9779 -35537
$$ packed form
23483h3J0631O748K3125k9190l0417P794L2371q744j2826J5420L362m433J9095
23470C2853N595p226k8244k0452O193j0794j5580k2139j4965L4082K6913M874
23458h890J7291L604j0295l828p11j6468M609O458K023N387J590Q590k637r151
23444b428K396L4p93o424j5758k55j1924j8420j2073J5289K5996M083j4992j2559
23430d7828K5728K1150K8070K1582l1684l1420l1154R95J2644J5906K4427J2794
23418B1210r675K665K2408M2564j4888k3330j9996l2563n260Q586j9819J1593
23406a6505L536J2615J8415K1628J2366J1515q76k0756k7698M813m331m64J7928
23393C2186j5479j2909J3550p183J2891J9465j224j8327o061j4434n232p022k5758
$$ plain form
23380 -35537 -44018 -35300 -43545 -68106 -54439 -54335 -37614 -3784 -7089 -10416 -34 5745 -598
23367 -598 -4772 -9372 -24402 -7506 -21861 -34748 -34888 -24988 -30351 -59708 -69312 -60506 -33266 -33395
23353 -33395 -35151 -51285 -54794 -22198 5950 47008 61562 24198 16957 35025 24930 1151
23341 1151 -18405 -19650 10984 20487 33244 -4991 -27374 -18382 -11823 10058 4917 -45600 -47417
23328 -47417 -50282 -38902 -24914 -19382 -28848 -31923 -774 24932 27516 38564 15596 -593 -6801
23315 -6801 -27072 -41779 -3610 13575 -11092 9311 -9711 -19563 -3002 -9243 6571 19718
23303 19718 29198 28958 35848 23143 18659 -2738 -10088 -27316 -19338 14025 -9494 -42857 -27311
23290 -27311 -37666 -44471 -20293 3368 1389 23306 22793 -9548 7301 29097 57274 50727 42127
$$ packed form
23380c5537q481Q718q245k4561J3667J04J6721L3830l305l327J0382N779o343
23367e98m174m600j5030J6896j4355j2887j40R900n363k9357r604Q806K7240j29
23353c3395j756j6134l509L2596K8148M1058J4554l7364p241J8068j0095k3779
23341A151j9556j245L0634R503J2757l8235k2383Q992O559K1881n141n0517j817
23328d7417k865J1380J3988N532r466l075L1149K5706K584J1048k2968j6189o208
23315f801k0271j4707L8169J7185k4667K0403j9022r852J6561o241J5814J3147
23303A9718R480k40O890j2705m484k1397p350j7228P978L3363k3519l3363J5546
23290b7311j0355o805K4178K3661j979K1917n13l2341J6849K1796K8177o547q600
$$ plain form
23277 42127 31173 43369 5941 -1972 -5162 -27091 -4996 6104 11317 1022 -13909 -20646
23265 -20646 -14723 -6737 1721 11503 8012 -5348 2116 -10036 -32729 -11289 43513 38906 5986
23252 5986 -20764 -11387 -13562 -14858 -48815 -60938 -29637 -14180 5344 -24375 -22447 -7026 319
23239 319 14385 30016 24043 -2011 -26096 -43145 459 10831 -3195 -32463 -35023 -16877
23227 -16877 -1631 3545 -4721 -14078 9207 5062 25854 42572 -3930 -28651 -16624 -23662 -35860
23214 -35860 -14471 11958 -4091 -19580 -11809 -17701 -39948 -44013 -22629 -40665 -52392 -57170
23202 -57170 -66771 -54289 -41485 -35189 -17540 -11930 -3594 598 14951 14908 9088 -40621 -39254 -4996
23188 -4996 21266 9804 5037 13154 27629 21552 16628 13455 1604 -1920 -33882 -13631 -1093
$$ packed form
23277D2127j0954J2196l7428p913l190k1929K2095J1100N213j0295j4931o737
23265b0646N923P986Q458R782l491j3360P464j2152k2693K1440N4802m607l2920
23252E986k6750R377k175j296l3957j2123L1301J5457J9524k9719J928J5421P345
23239C19J4066J5631n973k6054k4085j7049M3604J0372j4026k9268k560J8146
23227a6877J5246N176q266r357K3285m145K0792J6718m6502k4721J2027p038j2198
23214c5860K1389K6429j6049j5489P771n892k2247m065K1384j8036j1727m778
23202e7170r601J2482J2804O296J7649N610Q336M192J4353m3n820m9709J367L4258
23188d996K6262j1462m767Q117J4475o077m924l173j1851l524l1962K0251J2538
$$ plain form
23175 -1093 4498 2250 -13417 -22228 -31767 -72519 -49689 -12509 3139 -7266 29300 27765 -7150
23162 -7150 1874 12511 18169 20463 19512 28593 16111 -2203 4048 24332 2049 -23756 2807
23149 2807 -9757 -18679 -15414 -24151 -23430 -23246 -52744 -47304 -6343 12310 27639 30788 28542 36801
23135 36801 30621 34848 19827 -234 1578 4077 3507 -3130 -7208 -22256 -39334 -28407 -7257
23122 -7257 -15374 13921 2641 -23741 -42577 -41766 -32964 -14511 7198 14209 25498 -1898 -38801
23109 -38801 -28683 -60653 -77585 -45113 -30194 14310 62942 53196 42211 40309 33566 34724
23097 34724 17885 9316 -13324 -22654 -6076 10972 36527 27427 16239 31087 53129 44135
23085 44135 71513 47000 -7163 -28647 -18458 7444 -6254 -23608 -1765 18917 272 -10568
$$ packed form
23175a093N591k248j5667q811r539m0752K2830L7180J5648j0405L6566j535l4915
23162g150R024J0637N658K294r51R081j2482j8314O251K0284k2283k5805K6563
23149B807j2564q922L265q737P21J84k9498N440M0961J8653J5329L149k246Q259
23135C6801o180M227j5021k0061J812K499n70o637m078j5048j7078J0927K1150
23122g257q117K9295j1280k6382j8836Q11Q802J8453K1709P011J1289k7396l6903
23109c8801J0118l1970j6932L2472J4919M4504M8632r746j0985j902o743J158
23097C4724j6839q569k2640r330J6578J7048K5555r100j1188J4848K2042q994
23085D4135K7378k4513n4163k1484J0189K5902j3698j7354K1843K0682j8645j0840
$$ plain form
23073 -10568 -5512 2907 8015 35196 21099 -19056 -59102 -41151 1541 56445 46516 10258
23061 10258 37369 61256 29371 15066 28994 28383 15989 12968 11936 16875 11041 7854 35985
23048 35985 32085 7390 3455 -15144 -29684 -49340 -45081 -11229 -2293 -16390 -13256 -26106 1998
23035 1998 10339 39269 74776 30914 12090 1485 -11668 -17149 -4762 19854 12156 -5928
23023 -5928 -6625 -26689 -6006 3202 17561 36998 38590 14986 -5645 15657 -17882 -17105 -25527
23010 -25527 -29368 -13967 28013 1729 -15635 -13289 -881 8181 18271 10181 3504 441 -19591
22997 -19591 -7524 9121 4503 15618 11480 -10000 6491 35388 38704 -4730 -7708 -15180 -26109
22984 -26109 -18147 -9405 1874 7949 -32543 -67517 -48384 -19057 -47145 -62249 -31095 8248
$$ packed form
23073a0568N056Q419N108K7181j4097m0155m0046J7951M2692N4904r929l6258
23061A0258K7111K3887l1885j4305J3928o11j2394l021j032M939n834l187K8131
23048C5985l900k4695l935j8599j4540j9656M259L3852Q936j4097L134j2850K8104
23035A998Q341K8930L5507m3862j8824j0605j3153n481J2387K4616p698j8084
23023e928o97k0064K0683R208J4359J9437J592k3604k0631K1302l3539P77q422
23010b5527l841J5401M1980k6284j7364K346J2408R062J0090q090o677l063k0032
22997a9591J2067J6645m618J1115m138k1480J6491K8897L316m3434k978p472j0929
22984b6109P962Q742J1279O075m0492l4974J9133K9327k8088j5104L1154L9343
$$ plain form
22972 8248 15609 -5420 -20938 -26740 69 12486 20937 5887 -204 -19620 5705 22072 15973
22959 15973 21796 42383 44413 29175 -14132 -17199 -14756 -327 -5897 -37939 -58499 -59402 -51762
22946 -51762 -48886 -34620 -12240 -5684 -17991 -30739 -28246 4109 -8122 -9260 5121 -3441 8197
22933 8197 -14438 -46494 -40200 -39922 -38432 -11635 -15140 -2466 4295 -11357 -31296 5525 46546
22920 46546 39076 -760 10616 16458 22138 28798 32432 4366 -36142 -5702 30285 54470 39737
22907 39737 -9323 -33334 -68107 -54771 -19299 12619 26956 -3903 -29163 -37061 -45620 -70670
22895 -70670 -38557 -40882 -19620 -34715 -11444 19676 -11827 -30246 -2565 21139 27278 36563
22883 36563 35020 33622 26740 11838 12418 -3546 -6695 6252 908 7243 5419 -7252 -19247
$$ packed form
22972H248P361k1029j5518n802K6809J2417Q451j5050o091j9416K5325J6367o099
22959A5973N823K0587K030j5238m3307l067K443J4429n570l2042k0560r03P640
22946e1762K876J4266K2380O556j2307j2748K493L2355j2231j138J4381q562J1638
22933H197k2635l2056O294K78J490K6797l505J2674O761j5652j9939L6821M1021
22920D6546p470l9836J1376N842N680O660L634k8066m0508L0440L5987K4185j4733
22907C9737m9060k4011l4773J3336L5472L1918J4337l0859k5260p898q559k5050
22895g0670L2113k325K1262j5095K3271L1120l1503j8419K7681K3704O139R285
22883C6563j543j398o882j4902N80j5964l149J2947n344O335j824j2671j1995
$$ plain form
22870 -19247 -28880 -15226 967 17286 23879 6178 3820 2438 -6563 -3499 15897 49423 25446
22857 25446 -40514 -36328 -8320 18831 15041 -2261 -33667 -52764 -56514 -43846 -25173 -42025
22845 -42025 -65325 -55588 -31766 -2263 4870 6412 41931 14377 -608 -13041 -29431 -41150
22833 -41150 -35207 -6066 2389 -33012 -39464 -31064 -28027 -6391 3397 1055 21444 45649 29049
22820 29049 48642 88178 75987 69907 58414 45173 41633 48880 12865 32520 39349 31610 55762
22807 55762 38562 32651 16825 18430 13219 15182 -22651 -20011 -12169 -4114 13227 18784 10571
22794 10571 -3547 -25377 -29627 5178 25508 14931 -12702 -23085 4444 5199 -14068 -36874
22782 -36874 3874 4820 -29805 -43890 -31882 -26694 -56521 -43933 -25237 3457 2903 -8729 -6154
$$ packed form
22870a9247r633J3654J6193J6319O593j7701k358j382r001L064J9396L3526k3977
22857B5446o5960M186K8008K7151l790j7302l1406j9097l750J2668J8673j6852
22845d2025k3300R737K3822K9503P133J542L5519k7554j4985j2433j6390j1719
22833d1150N943K9141Q455l5401o452Q400L037K1636R788k342K0389K4205j6600
22820B9049J9593L9536j2191o080j1493j3241l540P247l6015J9655O829p739K4152
22807E5762j7200n911j5826J605n211J963l7833K640P842Q055J7341N557q213
22794A0571j4118k1830m250L4805K0330j0577k7633j0383K7529P55j9267k2806
22782c6874M0748R46l4625j4085J2008N188k9827J2588J8696K8694n54j1632K575
$$ plain form
22769 -6154 3344 -21464 -40919 -10888 24069 26646 34287 28499 14129 -1703 1303 -5461 -34612
22756 -34612 -44280 -26899 -14230 -969 -3881 -20881 -11819 -2370 4095 17119 11112 16020 -10670
22743 -10670 -39952 -49016 -34788 -48473 -53758 -43992 -34610 -1139 16556 21601 17087 29302 13488
22730 13488 1580 13230 -8621 -17263 -36164 -63936 -47058 -51107 -47564 -40347 -48256 -33565 -23432
22717 -23432 -23315 -20454 -6122 -3336 6909 8788 35027 54778 37986 -2937 -27955 -3543 -14924
22704 -14924 -9046 2854 13966 28637 26149 25745 36168 21400 18322 10041 -4418 15561 17884
22691 17884 13431 -3043 1609 5946 -7072 -15879 6116 34831 15939 21284 19329 7002 9054
22678 9054 -20980 -18291 17648 35737 14596 -5050 -23100 -9966 -15910 -12908 -2841 13217
$$ packed form
22769f154R498k4808j9455L0031L4957K577P641n788j4370j5832L006o764k9151
22756c4612r668J7381J2669J3261k912j7000R062R449O465J3024o007M908k6690
22743a0670k9282r064J4228j3685n285R766R382L3471J7695N045m514J2215j5814
22730A3488j1908J1650k1851q642j8901k7772J6878m049L543P217p909J4691J0133
22717b3432J17K861J4332K786J0245J879K6239J9751j6792m0923k5018K4412j1381
22704a4924N878J1900J1112J4671k488m04J0423j4768l078q281j4459J9979K323
22691A7884m453j6474M652M337j3018q807K1995K8715j8892N345j955j2327K052
22678I054l0034K689L5939J8089k1141j9646j8050J3134n944L002J0067J6058
$$ plain form
22666 13217 7027 -7024 -15298 -27061 -4665 3624 -1649 -2781 -25999 -29502 -23453 -20442 498
22653 498 38305 13728 -29629 -46308 -10519 5946 20084 15354 -16998 -40767 -42975 -39577 -20261
22640 -20261 -18531 3575 9106 -8714 -6432 -13357 -10047 -6562 -18629 -8060 -8260 -23476 -34340
22627 -34340 -46897 -39938 -51966 -61596 -40585 -34835 -22426 7772 32691 30103 -5952 -18188
22615 -18188 -5252 36549 66976 46967 40055 41949 25937 4831 6547 32928 40862 27352
22603 27352 27482 33982 10978 17492 -30273 -50167 -45077 -39535 -27780 -53059 -63035 -38276 -5373
22590 -5373 6432 18508 13823 -15286 -29178 -7073 -2667 -27033 -20482 -27990 -26256 -29235 -54875
22577 -54875 -74700 -54269 -41167 -43654 -34314 -8314 13554 36657 53295 46082 26326 23003
$$ packed form
22666A3217o190j4051q274j1763K2396Q289n273j132k3218l503O049L011K0940
22653D98L7807k4577m3357j6679L5789J6465J4138m730l2352k3769k208L398J9316
22640b0261J730K2106N531j7820K282o925L310L485j2067J0569k00j5216j0864
22627c4340j2557O959j2028r630K1011N750J2409L0198K4919k588l6055j2236
22615a8188J2936M1801L0427k0009o912J894j6012k1106J716K6381P934j3510
22603B7352J30O500k3004O514m7765j9894N090N542J1755k5279r976K4759L2903
22590e373J1805J2076m685k9109j3892K2105M406k4366O551p508J734k979k5640
22577e4875j9825K0431J3102k487R340K6000K1868K3103J6638p213j9756l323
$$ plain form
22565 23003 811 -17932 -24740 -26274 -27581 -39679 -48355 -14352 -10336 3809 224 7026 8994
22552 8994 20551 -3278 -21390 -11262 -20129 -18849 -35164 -52579 -52774 -12929 3205 24749 47239
22539 47239 8275 743 2048 -4150 1580 17974 22914 34506 47716 47965 54535 25813 12868
22526 12868 54956 61750 79193 51147 33436 -6998 -12558 -3445 50903 65384 26711 -5906
22514 -5906 3429 3075 9627 19026 20573 14648 6911 96 28037 66634 66078 26055 13769 30878
22500 30878 3843 -22155 -7506 -14676 914 31050 38796 13880 -15757 -1426 24380 18643
22488 18643 -9850 9494 19418 8742 -4020 -12847 1233 18220 30287 53120 41376 -364
22476 -364 -2899 -21858 -25017 -2768 -5980 269 13248 -167 -32074 -36465 -17833 -2727 10312
$$ packed form
22565B3003k2192j8743o808j534j307j2098q676L4003M016J4145l585O802J968
22552H994J1557k3829j8112J0128q867J280j6315j7415j95L9845J6134K1544K2490
22539D7239l8964p532J305o198N730J6394M940J1592J3210K49O570k8722j2945
22526A2868M2088O794J7443k8046j7711m0434n560R113N4348J4481l8673l2617
22514e906R335l54O552R399J547n925p737o815K7941L8597n56m0023j2286J7109
22500C0878k7035k5998J4649p170J5590L0136P746k4916k9637J4331K5806n737
22488A8643k8493J9344R924j0676j2762q827J4080J6987J2067K2833j1744m1740
22476c64k535j8959l159K2249l212O249J2979j3415l1907m391J8632J5106J3039
$$ plain form
22463 10312 19586 33367 29007 24296 -14264 -43205 -20219 10935 -4169 2030 12555 -5047
22451 -5047 -25631 -42469 -72999 -67920 -51922 -24691 -40084 -29687 -14778 -4313 -5388 1432
22439 1432 -8614 -10491 -13609 -7478 -21415 -54572 -33620 16398 1024 -25854 6891 35988
22427 35988 44201 32915 21752 13909 21928 32915 19282 -3046 -879 -2386 16395 1256 -20622
22414 -20622 -7032 5634 39215 19039 -41703 -48664 -31380 -32614 -21889 -2275 -8538 6816
22402 6816 9100 4958 15012 8393 -8952 8765 22497 2151 -19698 -17127 -7197 -2750 -15987
22389 -15987 1759 22728 2122 5909 26441 29115 33653 16194 -35698 -62424 -74597 -87024
22377 -87024 -66723 -41428 -16362 -20418 4080 24877 3435 -42350 -49834 -34903 -57774 -40270
$$ packed form
22463A0312R274J3781m360m711l8560k8941K2986L1154j5104O199J0525j7602
22451e047k0584j6838l0530N079J5998K7231j5393J0397J4909J0465j075O820
22439A432j0046j877l118O131j3937l3157K0952N0018j5374k6878L2745K9097
22427C5988Q213j1286j1163p843Q019J0987j3633k2328K167j507J8781j5139k1878
22414b0622J3590J2666L3581k0176o0742o961J7284j234J0725J9614o263J5354
22402F816K284m142J0054o619j7345J7717J3732k0346k1849K571R930M447j3237
22389a5987J7746K0969k0606L787K0532K674M538j7459n1892k6726j2173j2427
22377h7024K0301K5295K5066m056K4498K0797k1442m5785p484J4931k2871J7504
$$ plain form
22365 -40270 -37921 -21452 4400 12453 -15346 -30853 -21939 -32591 -33690 -19455 -8367 3565
22353 3565 14663 15687 15332 43628 22505 8223 24239 7872 29021 39935 33762 25608 15426
22340 15426 12003 14573 -13734 -56628 -53470 -42133 -47297 -33242 -14804 -12128 12915 41565 34042
22327 34042 18369 42545 38148 19646 5990 16369 -6004 -1285 668 -20998 -28256 -15212
22315 -15212 -9117 3935 26640 26507 6856 -5831 30031 48798 41929 42695 46010 50584 32978
22302 32978 9593 -10647 -10803 6626 3236 30097 31498 31832 19885 1940 22217 36537 31755
22289 31755 17014 37303 51846 6742 -47034 -56553 -64388 -94438 -88180 -53429 -29009 3637
22277 3637 19345 36627 38318 -9384 -2291 7007 14333 29294 35831 1770 -44286 -30981 -15767
$$ packed form
22365d0270K349J6469K5852Q053k7799j5507Q914j0652j099J4235J1088J1932
22353C565J1098J024l55K8296k1123j4282J6016j6367K1149J0914o173q154j0182
22340A5426l423K570k8307m2894L158J1337n164J4055J8438K676K5043K8650p523
22327C4042j5673K4176m397j8502j3656J0379k2373M719J953k1666p258J3044
22315a5212O095J3052K2705j33j9651j2687L5862J8767o869P66L315M574j7606
22302C2978k3385k0240j56J7429l390K6861J401L34j1947j7945K0277J4320m782
22289C1755j4741K0289J4543m5104n3776r519p835l0050O258L4751K4420L2646
22277C637J5708J7282J691m7702P093R298P326J4961O537l4061m6056J3305J5214
$$ plain form
22264 -15767 -4629 5848 25066 36095 27917 14669 9854 42892 44315 14592 -17218 -42265
22252 -42265 -50863 -44275 -32046 -24494 -27999 -28143 -28215 -22353 -25801 -25645 -17844 -5064 -61104 -90941
22238 -90941 -36537 -34801 -12603 2623 -6218 7484 36617 33569 18107 -10301 4526 28949
22226 28949 29070 15470 17032 25922 26159 37862 53018 43589 56339 46323 287 -53464 -39895
22213 -39895 -33246 -36515 -10741 4227 -26204 -54675 -32843 9951 9819 15984 20531 -3673 -26296
22200 -26296 -10167 5166 16890 14320 5459 -4325 -15074 -3599 35305 29954 22472 46326 23630
22187 23630 -184 5414 25274 57382 68555 61829 17683 -7635 -26934 -21633 2140 -28406
22175 -28406 -38032 -60748 -60576 -57689 -50395 -6067 947 13716 37928 4101 -14808 -47287 -40011
$$ packed form
22264a5767J1138J0477J9218J1029q178j3248m815L3038J423k9723l1810k5047
22252d2265q598O588J2229P552l505j44p2N862l448J56P801J2780n6040k9837
22238i0941N4404J736K2198J5226q841J3702K9133l048j5462k8408J4827K4423
22226B8949J21j3600J562Q890K37J1703J5156r429J2750j0016m6036n3751J3569
22213c9895O649l269K5774J4968l0431k8471K1832M2794j32O165M547k4204k2623
22200b6296J6129J5333J1724k570q861r784j0749J1475L8904n351p482K3854k2696
22187B3630k3814N598J9860L2108J1173o726m4146k5318j9299N301K3773l0546
22175b8406r626k2716J72K887P294M4328P014J2769K4212l3827j8909l2479P276
$$ plain form
22162 -40011 -7376 -5329 -19255 -19060 -28602 -27624 -17584 -44860 -63750 -65538 -50775 -45783 -39924
22149 -39924 -42147 -18954 12498 211 -44539 -38184 -20693 -11800 -21120 -35007 -43645 -38701 -25298
22136 -25298 -8246 -17956 -17194 31185 21210 16449 -36017 -27580 -24176 -35276 -60882 -64752 -77709
22123 -77709 -81910 -50046 -34466 -10215 -5409 -1095 19251 -1110 -14801 -10741 4203 -3649 -21201
22110 -21201 -15487 -16434 -40148 -49307 -25891 -44181 -63105 -54360 -50409 -57617 -42884 -31502 -21594
22097 -21594 -17825 -16019 -32110 -40650 -19043 21392 -7237 -8479 10996 2148 -34600 -44370 -61119
22084 -61119 -66841 -60239 -24006 -10531 13121 20182 -12899 2298 3495 -2230 7885 55913 61786
22071 61786 43871 53295 39049 29604 -509 730 25253 23159 20985 20402 -17492 -8876 -2770
$$ packed form
22162d0011L2635K047j3926J95r542R78J0040k7276j8890j788J4763M992N859
22149c9924k223K3193L1452j2287m4750O355J7491Q893r320j3887q638M944J3403
22136b5298J7052r710P62M8379r975m761n2466Q437L404j1100k5606l870j2957
22123g7709m201L1864J5580K4251M806M314K0346k0361j3691M060J4944p852j7552
22110b1201N714r47k3714r159K3416j8290j8924Q745L951p208J4733J1382R908
22097b1594L769J806j6091q540K1607M0435k8629j242J9475q848l6748r770j6749
22084f1119n722O602L6233J3475K3652P061l3081J5197J197n725J0115M8028N873
22071F1786j7915R424j4246r445l0113J239K4523k094k174n83l7894Q616O106
$$ plain form
22058 -2770 7033 13986 -2484 -7169 -27272 -38270 -18635 -8728 -25201 -17606 -16061 -6171 -3418
22045 -3418 -33509 -58313 -46312 -16241 -2145 10597 5831 27588 28541 -7387 -36455 -43183 -50807
22032 -50807 -72085 -47939 -31119 -10129 -7038 -14411 -25356 -37811 -41716 -55634 -52466 -44344 -22643
22019 -22643 -10691 24223 61172 40355 30307 13511 3726 738 1981 17643 5169 -32899
22007 -32899 -32970 -39830 -20216 14482 -15815 -35684 -41942 -32905 18428 30299 34476 8018 -33329
21994 -33329 -29665 10698 -11037 -41720 -62493 -73165 -57312 -52801 -2812 5279 -269 -18354
21982 -18354 -42419 -36076 -28634 -6604 -29430 -28079 -18532 -38677 -55507 -43441 -6051 7682
21970 7682 8084 -18878 -9376 -13831 -38002 -66151 -54801 -12384 -18779 -26932 -19557 -5070 38588
$$ packed form
22058b770R803O953j6470m685k0103j0998J9635R907j6473P595J545R890K753
22045c418l0091k4804J2001L0071J4096J2742m766K1757R53l5928k9068o728p624
22032e0807k1278K4146J6820K0990L091p373j0945j2455l905j3918L168Q122K1701
22019b2643J1952L4914L6949k0817j0048j6796r785k988J243J5662j2474l8068
22007c2899p1o860J9614L4698l0297j9869o258R037N1333J1871M177k6458m1347
21994c3329L664M0363k1735l0683k0773j0672J5853M511M9989Q091n548j8085
21982a8354k4065O343P442K2030k2826J351R547k0145j6830J2066L7390J3733
21970G682M02k6962R502m455k4171k8149J1350M2417o395q153P375J4487M3658
$$ plain form
21957 38588 26616 2373 6134 16729 18270 3413 -10667 -29600 -35793 -45383 -25231 -17985 -53513
21944 -53513 -51335 -40059 -31674 -42780 -45362 -9033 -20650 -8293 19895 -8929 -17156 7040
21932 7040 -10418 -54158 -43535 -17171 -20791 3091 29109 7173 -26654 -34736 -7648 13322
21920 13322 945 18677 8098 -38504 -51374 -19879 -1402 5189 33544 -16296 -45182 -22764
21908 -22764 14673 24316 42798 28303 21172 25658 14206 -19967 -52494 -36221 -24079 -13320
21896 -13320 9431 24995 12221 -21409 -42340 -53783 -45485 -16564 -1001 -2728 -5532 9821
21884 9821 11981 -10809 -23255 -22255 -33882 -54872 -30703 -45816 -58105 -60498 -68251 -74111 -42791
21871 -42791 -24030 -58191 -21452 14743 17089 31255 21369 18221 38178 12938 -8274 1560
$$ packed form
21957C8588j1972k4243L761J0595J541j4857j4080j8933o193r590K0152P246l5528
21944e3513K178J1276Q385j1106k582L6329j1617J2357K8188k8824q227K4196
21932G040j7458m3740J0623K6364l620K3882K6018k1936l3827q082K7088K0970
21920A3322j2377J7732j0579m6602j2870L1495J8477O591K8355m9840k8886K2418
21908b2764L7437R643J8482j4495p131M486j1452l4173l2527J6273J2142J0759
21896a3320K2751J5564j2774l3630k0931j1443Q298K8921J5563j727k804J5353
21884I821K160k2790j2446J000j1627k0990K4169j5113j2289k393p753n860L1320
21871d2791J8761l4161L6739L6195K346J4166r886l148J9957k5240k1212R834
$$ plain form
21859 1560 15093 -7729 -20904 -21881 -31321 16764 39609 23751 8494 4845 12969 -5607 -19724
21846 -19724 -7067 2933 949 -42747 -44233 -27939 -19201 -35354 -19369 21047 19339 7930
21834 7930 -16402 -38603 -13541 9485 -2730 -1161 -4287 -1944 4360 -18270 -45427 -43051 -39761
21821 -39761 -46912 -15031 19072 60607 38762 45241 22308 -2973 3239 20634 26551 3216
21809 3216 -504 54245 84037 51499 10356 -7723 -23085 -31023 -55317 -76878 -46630 -5846
21797 -5846 32653 13874 26869 47320 33397 18891 20262 11898 -10725 -20159 -6021 -25593
21785 -25593 -40461 -19405 2842 30313 53540 51144 38201 18916 6007 -12104 -16254 110
21773 110 14141 21559 35142 32111 30564 5876 -13678 -7466 -14037 -3973 11626 10841 -10699
$$ packed form
21859A560J3533k2822j3175r77r440M8085K2845j5858j5257l649Q124j8576j4117
21846a9724J2657J0000j984m3696j486J6294Q738j6153J5985M0416j708j1409
21834G930k4332k2201K5062K3026j2215J569l126K343O304k2630k7157K376L290
21821c9761p151L1881L4103M1535k1845O479k2933k5281O212J7395N917k3335
21809C216l720N4749K9792l2538m1143j8079j5362p938k4294k1561L0248M0784
21797e846L8499j8779J2995K0451j3923j4506J371q364k2623r434J4138j9572
21785b5593j4868K1056K2247K7471K3227k396j2943j9285j2909j8111m150J6364
21773A10J4031P418J3583l031j547k4688j9554O212o571J0064J5599p85k1540
$$ plain form
21760 -10699 -20371 10571 14660 1466 -4107 -1338 -4654 27323 35895 33754 18788 13310 -7622
21747 -7622 -16880 22985 52801 61235 50428 23500 -2099 -2904 264 -18292 705 -8877 -34642
21734 -34642 -39773 -21638 -1900 -25175 -58840 -60178 -52421 -7193 10786 -12495 -14646 -33039
21722 -33039 -62252 -63069 -40363 -23811 3258 23919 20411 9711 17562 -11268 -10949 -22118 -30245
21709 -30245 -19021 -20634 -49740 -63666 -58853 -48653 -41157 -50437 -28171 -3363 -16755 -4884
21697 -4884 8 947 8208 30637 50440 13864 -7569 -14909 -4413 -20825 -30241 -15104 3111
21684 3111 21370 29796 13526 -6168 4835 -14053 -1323 -18012 -29013 -24611 4484 -5105
21672 -5105 -7074 2092 5327 10895 2027 -17949 -22165 -31156 -29898 -12033 9565 10114 -18526 -43688
$$ packed form
21760a0699r672L0942M089j3194n573K769l316L1977Q572k141j4966n478k0932
21747g622r258L9865K9816Q434j0807k6928k5599q05L168j8556J8997r582k5765
21734c4642n131J8135J9738k3275l3665j338P757M5228J7979k3281k151j8393
21722c3039k9213q17K2706J6552K7069K0661l508j0700P851k8830L19j1169q127
21709c0245J1224j613k9106j3926M813J0200P496r280K2266K4808j3392J1871
21697d884M892R39P261K2429J9803l6576k1433p340J0496j6412r416J5137J8215
21684C111J8259Q426j6270j9694J1003j8888J2730j6689j1001M402K9095r589
21672e105j969R166L235N568q868j9976m216q991J258J7865K1598N49k8640k5162
$$ plain form
21658 -43688 -33926 -30600 -18683 6772 11796 12521 3836 23611 45940 29587 14043 8329 28559
21645 28559 43353 35152 35438 -13783 -49798 -44510 -32897 -19090 -40821 -71004 -71809 -38346 -137
21632 -137 4074 -8896 -18531 -18149 -17594 2392 16261 35871 37479 34043 13501 -14740 -27662 -27100
21618 -27100 -25806 -44693 -48175 -29325 -40770 -32157 -27436 -34313 15006 14835 -20247 -38052 -47778
21605 -47778 -34664 -56104 -46866 -20770 784 12368 11792 -13346 937 37019 38796 -230
21593 -230 -30918 -21526 -1834 -7689 -13855 1198 9135 -9198 -15287 -8012 -8481 -47351 -63871 -58706
21579 -58706 -84257 -90576 -70030 -39417 -50429 -61537 -32635 -20675 -9117 -13402 -29574 -40031
21567 -40031 -12170 -1820 -29478 -25674 -28177 -20042 -22066 -34407 -8287 -286 -12829 -18431 -49062
$$ packed form
21658d3688R762L326J1917K5455N024P25q685J9775K2329j6353j5544n714K0230
21645B8559J4794q201K86m9221l6015N288J1613J3807k1731l0183q05L3463L8209
21632a37M211j2970r635L82N55J9986J3869J9610J608l436k0542k8241j2922N62
21618b7100J294j8887l482J8850j1445Q613M721o877M9319j71l5082j7805r726
21605d7778J3114k1440R238K6096K1554J1584n76k5138J4283L6082J777l9026
21593b30l0688R392J9692n855o166J5053P937j8333o089P275m69l8870j6520N165
21579e8706k5551o319K0546L0613j1012j1108K8902J1960J1558m285j6172j0457
21567d0031K7861J0350k7658L804k503Q135k024j2341K6120Q001j2543n602l0631
$$ plain form
21554 -49062 -49432 2621 -14798 -23411 -12886 8586 6266 7462 822 -36388 -52349 -31916 -23611
21541 -23611 -48678 -62974 -25639 -30152 -13306 -20991 -51064 -49432 -39495 -17982 9872 14395 -2031
21528 -2031 12896 6904 3721 13566 249 -20092 -29197 -39740 -9803 -13403 -32090 -24937 -8317
21515 -8317 -1540 -2305 2945 23978 36726 17216 10759 26466 21109 -15763 -37341 -21272 4914
21502 4914 8844 -14475 -1729 28213 19284 -4985 -4964 -3645 -17098 -8827 -5079 -24093 -32233 -38237
21488 -38237 -33009 -25776 -5716 -12375 -32862 -38030 -9837 -14652 -45319 -49579 -25719 -30637 -8593
21475 -8593 23109 19367 5139 -8073 -4812 16519 24040 5662 -6670 23123 44108 53964 24606
21462 24606 -14515 -36603 -31939 -27359 -38576 -27042 478 26182 46669 18638 22648 27644
$$ packed form
21554d9062l70N2053j7419q613J0525K1472k320J196o640l7210j5961K0433Q305
21541b3611k5067j4296L7335m513J6846p685l0073J632R937K1513K7854M523j6426
21528b031J4927n992l183R845j3317k0341r105j0543K9937l600j8687P153J6620
21515h317O777p65N250K1033J2748j9510o457J5707n357l6872k1578J6069K6186
21502D914L930k3319J2746K9942q929k4269K1J319j3453Q271L748j9014q140o004
21488c8237N228P233K0060o659k0487n168K8193m815l0667m260K3860m918K2044
21475h593L1702l742j4228j3212L261K1331P521j8378j2332K9793K0985R856k9358
21462B4606l9121k2088M664M580j1217J1534K7520K5704K0487k8031M010M996
$$ plain form
21450 27644 15341 -22972 -54622 -30445 21075 15425 -8896 15329 -7728 11463 34088 43728
21438 43728 39224 5320 -5841 23379 9982 9710 6040 7105 5171 29633 31280 26051 47339
21425 47339 16980 -3534 -15560 -24893 -1936 19356 27894 27560 3152 2785 11766 -22782 -31886
21412 -31886 -13625 19353 45409 74513 43659 10305 -10462 -24738 -27177 -36095 -59238 -66195
21400 -66195 -31487 12532 -27 -1819 10848 13824 -14786 -23862 -11148 -16536 -45226 -38513 -31167
21387 -31167 -44411 -44445 -2976 3754 -16903 -25136 -27801 -8451 -11172 -10934 -8007 3853 -3314 16981
21373 16981 24428 15462 -23082 -54141 -68250 -38999 -21094 -21947 -34463 -33807 -42333 -33145 24613
21360 24613 73313 31774 2029 -6029 -29550 -31392 -6633 -8139 -21281 -16082 -18111 -39734 -22060
$$ packed form
21450B7644j2303l8313l1650K4177N1520n650k4321K4225k3057J9191K2625R640
21438D3728m504l3904j1161K9220j3397k72l670J065j934K4462J647n229K1288
21425D7339l0359k0514j2026r333K2957K1292Q538l34k4408l67Q981l4548r104
21412c1886J8261L2978K6056K9104l0854l3354k0767j4276k439q918k3143o957
21400f6195L4708M4019j2559j792J2667K976k8610r076J2714n388k8690O713P346
21387c1167j3244l4M1469O730k0657q233k665J9350k721K38K927J1860p167K0295
21373A6981P447q966l8544l1059j4109K9251J7905q53j2516O56q526R188N7758
21360B4613M8700m1539k9745q058k3521j842K4759j506j3142N199k029k1623J7674
$$ plain form
21347 -22060 -446 10879 11483 51603 50114 34408 21967 34375 42427 14953 -12359 -11558 27010
21334 27010 40719 25671 -1429 -35217 -20364 -18856 -11520 -12746 -51556 -60195 -22541 28435
21322 28435 27442 9335 9080 20835 14365 -4216 -29372 -21608 11105 33114 5526 -32052 -37160
21309 -37160 -29357 10859 25765 11569 12319 33685 13281 24021 34118 62461 66280 50210
21297 50210 53601 33881 -7306 6769 17188 8118 -5561 -4064 10810 31967 16898 -1461
21285 -1461 -5728 -19222 -17652 -18690 -14731 -9484 13658 10277 1402 -7582 -20863 -16003 -8901 11867
21271 11867 5454 -44849 -38361 -33392 -2817 21752 2950 -2542 3682 -6059 20906 23245 -15958
21258 -15958 -49543 -52273 -58455 -85175 -39172 -28889 -18618 -4130 13946 5036 -12745 -25155
$$ packed form
21347b2060K1614J1325O04M0120j489j5706j2441J2408Q052k7474k7312Q01L8568
21334B7010J3709j5048k7100l3788J4853J508P336j226l8810q639L7654N0976
21322B8435r93j8107k55J1755o470j8581k5156P764L2713K2009k7588l7578n108
21309c7160P803M0216J4906j4196P50K1366k0404J0740J0097K8343L819j6070
21297E0210L391j9720m1187J4075J0419r070j3679J497J4874K1157j5069j8359
21285a461m267j3494J570j038L959N247K3142l381q875q984j3281M860P102K0768
21271A1867o413n0303O488M969L0575K4569j8802n492O224r741K6965K339l9203
21258a5958l3585k730o182k6720M6003J0283J0271J4488J8076q910j7781j2410
$$ plain form
21246 -25155 -569 -15361 -35938 -35187 -5434 6302 -13893 5486 17578 7040 -17570 15658
21234 15658 6990 -18581 35858 24919 -11013 -4776 -8317 165 6102 -5730 -4894 -5503 2062 -10564
21220 -10564 -14930 21554 27518 5586 -4701 6756 7879 -28475 -28923 -34014 -20221 -21063 -22824
21207 -22824 -32408 -5159 5923 14312 22888 25263 36026 6702 -9020 -33070 -26560 -15183 -23298
21194 -23298 -629 18832 -2805 -20140 -38603 -62958 -90802 -93935 -85822 -87777 -85505 -76483 -52337
21181 -52337 -42504 -33186 -13986 2823 -11370 -38336 -40047 -26501 -5252 5167 -4956 23527
21169 23527 15372 -5110 -5569 21904 24886 35301 6359 -22225 -27431 3266 13761 20494 -4090
21156 -4090 -32326 5097 21041 50633 73744 75232 35477 -12773 -37385 -46486 -52972 -53840 -64921
$$ packed form
21246b5155K4586j4792k0577P51K9753J1736k0195J9379J2092j0538k4610L3228
21234A5658q668k5571N4439j0939l5932O237l541Q482N937j1832Q36o09P565j2626
21220a0564m366L6484N964k1932j0287J1457J123l6354m48n091J3793q42j761
21207b2824r584K7249J1082Q389Q576K375J0763k9324j5722k4050O510J1377q115
21194b3298K2669J9461k1637j7335j8463k4355k7844l133Q113j955K272R022K4146
21181e2337R833R318J9200J6809j4193k6966j711J3546K1249J0419j0123K8483
21169B3527q155k0482m59K7473K982J0415k8942k8584n206L0697J0495O733k4584
21156d090k8236L7423J5944K9592K3111J488l9755m8250k4612r101o486q68j1081
$$ plain form
21143 -64921 -30997 9779 23298 25967 24523 19473 7256 3548 -20964 -29272 -16728 -23775 -40015
21130 -40015 -27085 15575 35743 25990 22288 26806 -11016 -49537 -31490 -48579 -28233 9484
21118 9484 15912 -18528 -25948 -21552 -20432 -45542 -34271 11019 38374 26539 -4159 -2052 19565
21105 19565 630 -14663 -22119 -2821 7140 3666 -2978 23689 -5367 -15702 -26017 -28217 -11613
21092 -11613 27370 54261 69569 37261 35871 32983 25085 38617 48736 38280 12473 22841
21080 22841 5978 -23978 -37672 -31385 -1842 5997 -16302 -1672 14066 -14561 -8467 -15527
21068 -15527 -31998 -42965 -48251 -32449 -6909 14490 -17709 -17612 -6211 -7627 -24731 -27653 -22677
21055 -22677 30857 49845 4658 -14206 -20828 -47446 -31208 -30995 -30601 -33512 -29977 -10610 2181
$$ packed form
21143f4921L3924M0776J3519K669j444n050j2217l708k4512q308J2544p047j6240
21130d0015J2930M2660K0168r753l702M518l7822l8521J8047j7089K0346L7717
21118I484O428l4440p420M396J120k5110J1271M5290K7355j1835l0698K107K1617
21105A9565j8935j5293p456J9298R961l474o644K6667k9056j0335j0315k200J6604
21092a1613L8983K6891J5308l2308j390k888p898J3532J0119j0456k5807J0368
21080B2841j6863k9956j3694O287K9543P839k2299J4630J5738k8627O094p060
21068a5527j6471j0967n286J5802K5540K1399l2199R7J1401j416j7104k922M976
21055b2677N3534J8988m5187j8864o622k6618J6238K13L94k911L535J9367J2791
$$ plain form
21042 2181 15650 2918 -8518 -1665 13101 -15623 -23251 -10472 -19338 34249 58806 61185 40442
21029 40442 21167 10589 5491 2391 -25039 -32377 -38098 -57360 -84658 -77354 -66513 -49208 -20135
21016 -20135 -17253 -20101 -22043 -7362 25577 40866 47938 36593 6836 -11812 3542 -14747
21004 -14747 -34608 -13204 2527 -19084 -23334 -8693 18545 12043 -20251 -29210 -22211 -35301
20992 -35301 -25086 -11867 -7749 4380 16895 23208 22940 13970 33730 33939 17904 7509 37213
20979 37213 59598 37959 22838 161 19335 17452 31868 46525 43715 54673 47026 44697
20967 44697 35661 1490 8008 34826 34140 11107 10794 20609 33969 39265 17330 -15675 -31366
20954 -31366 -15034 -10050 -52294 -18724 -9719 -51914 -57564 -12310 10407 8312 -17407 -16797 15428
$$ packed form
21042B181J3469j2732j1436O853J4766k8724p628J2779q866N3587K4557K379k0743
21029D0442j9275j0578n098l100k7430p338n721j9262k7298P304J0841J7305K9073
21016b0135K882k848j942J4681L2939J5289P072j1345k9757j8648J5354j8289
21004a4747j9861K1404J5731k1611m250J4641K7238o502l2294q959O999j3090
20992c5301J0215J3219M118J2129J2515O313k68q970J9760K09j6035j0395K9704
20979C7213K2385k1639j5121k2677J9174j883J4416J4657k810J0958p647k329
20967D4697r036l4171O518K6818o86k3033l13R815J3360N296k1935l3005j5691
20954c1366J6332M984m2244L3570R005m2195n650M5254K2717k095k5719O10L2225
$$ plain form
20941 15428 -6121 -18180 -22444 -29141 -30649 -32205 -37429 -37887 -63120 -43780 -29782 -26082 -1484
20928 -1484 -4241 -9473 19319 43228 65898 39219 15319 27888 25892 -4675 -11835 -26241 -30082
20915 -30082 -16744 -13117 -8534 -460 -17462 -34828 -29627 -12 -12085 -13073 4792 16058 5786
20902 5786 -5674 6109 6548 -22221 -66163 -52578 -26270 -18442 -17696 -25545 -35399 -24542 10021
20889 10021 20048 17234 17793 -12220 -15081 27702 23222 -15364 -36650 -26348 -12575 -15678 -42086
20876 -42086 -47099 -35706 -25929 -21807 -8170 -26882 -31387 -24099 14942 52037 21952 -17977 -32199
20863 -32199 -33640 -32526 -32772 -11296 2532 -5766 -1326 5790 5203 18015 25339 41185 26538 16940
20849 16940 17754 -13375 -37470 -33660 -19752 7407 -6223 2672 38062 39582 4613 -19193 -8006
$$ packed form
20941A5428k1549j2059m264o697j508j556n224m58k5233J9340J3998L700K4598
20928a484k757n232K8792K3909K2670k6679k3900J2569j996l0567p160j4406l841
20915c0082J3338L627M583Q074j7002j7366N201K9615j2073r88J7865J1266j0272
20902E786j1460J1783M39k8769m3942J3585K6308P828P46p849r854J0857L4563
20889A0021J0027k814N59l0013k861M2783m480l8586k1286J0302J3773l103k6408
20876d2086n013J1393R777M122J3637j8712m505P288L9041L7095l0085l9929j4222
20863c2199j441J114k46K1476J3828q298M440P116n87J2812P324J5846j4647r598
20849A6940Q14l1129k4095L810J3908K7159j3630Q895L5390J520l4969k3806J1187
$$ plain form
20836 -8006 7607 24333 47415 24919 -4813 -18227 -31488 -20869 -11904 1415 -21033 -42883
20824 -42883 -31261 -13961 30358 54668 22517 4246 -1771 -10322 -2672 -6416 15876 11196 14254
20811 14254 18139 3230 -16113 -8963 -12163 -17940 13375 14533 64 -22537 -24445 -15778 -5663
20798 -5663 7193 22370 15491 -11665 -20364 16488 33762 -12930 -18232 -2144 -15755 -12911 -10255
20785 -10255 -16316 -14661 2564 25615 40868 37865 43952 25237 18578 11346 13310 13746 15086 26386
20771 26386 20681 30910 61862 55720 1515 -6706 22309 14122 4462 17473 -1156 -14622 -26740
20758 -26740 -46016 -4886 14577 9387 11334 3967 6622 10810 17829 22580 15004 -11333 -5887
20745 -5887 8821 -20091 -42334 -38769 -56659 -52654 -19042 -21551 -34672 -28969 -32492 -34235 -39588
$$ packed form
20836h006J5613J6726K3082k2496k9732j3414j3261J0619Q965J3319k2448k1850
20824d2883J1622J7300M4319K4310l2151j8271o017q551P650l744K2292m680L058
20811A4254L885j4909j9343P150l200n777L1315J158j4469k2601j908Q667J0115
20798e663J2856J5177o879k7156q699L6852J7274m6692n302J6088j3611K844K656
20785a0255o061J655J7225K3051J5253l003O087j8715o659p232J964M36J340J1300
20771B6386n705J0229L0952o142n4205q221K9015q187r660J3011j8629j3466j2118
20758b6740j9276M1130J9463n190J947p367K655M188P019M751p576k6337N446
20745e887J4708k8912k2243L565j7890M005L3612k509j3121N703l523j743n353
$$ plain form
20732 -39588 -55900 -22065 -7093 -16549 -25924 -42552 -51299 -24630 26053 30833 7897 1730 -13544
20719 -13544 -9973 12273 55270 23302 6400 10464 -2175 -20108 -27126 -11725 -10793 -1823 -7864
20706 -7864 -43368 -18569 21262 35648 47539 29473 17298 -2835 -19812 -26396 -4029 18908
20694 18908 36216 47948 49225 53959 55950 71490 53549 10348 1184 9345 25243 19404 182
20681 182 9338 13643 -4199 -22578 -9650 -10500 12179 41166 49112 30425 44526 7387 -24771
20668 -24771 284 -10685 -44995 -31482 15752 40827 35461 32665 21361 2281 -19380 -10624
20656 -10624 -7969 -40311 -10525 6743 -17262 -20357 21591 40487 43553 24486 6116 -20567
20644 -20567 -19598 -5815 -14076 -14923 -24574 -51730 -33939 -19657 1819 26823 29636 6013 16498
$$ packed form
20732c9588j6312L3835J4972r456r375j6628q747K6669N0683M780k2936o167j5274
20719a3544L571K2246M2997l1968j6902M064j2639j7933p018J5401R32Q970o041
20706g864l5504K4799L9831J4386J1891j8066j2175k0133j6977o584K2367K2937
20694A8908J7308J1732J277M734J991J5540j7941m3201r164Q161J5898n839j9222
20681A82R156M305j7842j8379J2928q50K2679K8987P946j8687J4101l7139l2158
20668b4771K5055j0969l4310J3513M7234K5075n366k796j1304j9080k1661Q756
20656a0624K655l2342K9786J7268k4005l095M1948J8896L066j9067j8370k6683
20644b0567R69J3783q261q47r651k7156J7791J4282K1476K5004K813k3623J0485
$$ plain form
20631 16498 4784 12640 27895 24520 13336 16744 31967 30783 -15235 -40563 -55005 -31964
20619 -31964 -11610 21221 15156 -16650 -48977 -36091 -30420 -33984 -36703 -18159 -29352 -27048 -7078
20606 -7078 -14788 -6882 -7102 12061 43487 82063 88988 77853 46106 4974 1608 8173 -10306
20593 -10306 1975 24152 33459 24974 37390 9732 15329 34320 19232 32764 9013 -22898
20581 -22898 -5558 11701 33075 41581 22639 27379 33101 1112 -16049 -11144 13054 23831
20569 23831 14307 966 11305 10867 8157 20142 49190 20764 5077 -12436 -37947 -35068 -18247
20556 -18247 6553 26340 17060 18975 -11002 -12569 10829 -5322 -6316 -2471 -11891 -6356 -1125
20543 -1125 21815 29528 -11928 -52045 -26981 5353 3383 18861 22156 -6393 -27982 -39341
$$ packed form
20631A6498j1714P856J5255l375j1184L408J5223j184m6018k5328j4442K3041
20619c1964K0354L2831o065l1806l2327J2886N671l564k719J8544j1193K304J9970
20606g078p710P906k20J9163L1426L8576O925j1135l1747m1132l366O565j8479
20593a0306J2281K2177R307q485J2416k7658N597J8991j5088J3532k3751l1911
20581b2898J7340J7259K1374Q506j8942M740N722l1989j7161M905K4198J0777
20569B3831r524j3341J0339m38k710J1985K9048k8426j5687j7513k5511K879J6821
20556a8247K4800J9787r280J915k9977j567K3398j6151r94L845r420N535N231
20543a125K2940P713m1456m0117K5064L2334j970J5478L295k8549k1589j1359
$$ plain form
20531 -39341 -36988 -45264 -26571 6463 24197 11057 -4033 -26128 -32581 -9085 25802 25163 39948
20518 39948 65065 55460 33467 15576 17659 20835 20410 -20823 -58671 -62065 -34715 -21960 -13237
20505 -13237 9156 22825 43524 42168 18531 14124 62376 54680 26154 19669 16931 17324 12149
20492 12149 4460 -264 28283 41743 -11397 -30872 -46938 -39896 -22815 -28584 -35552 -48342 -64775
20479 -64775 -54144 -34737 -7341 -4101 -8088 -18246 1862 -284 6965 17860 11349 9305 -6906
20466 -6906 -8903 -8293 -6635 -28409 -20662 -18310 -20588 -15625 -25629 -52108 -67682 -61948 -49155 -39166
20452 -39166 1484 19625 5319 4976 9013 16058 26275 14517 -5347 -19707 -22305 -16824 7837
20439 7837 12771 30346 21788 45567 79489 81596 59295 50927 18833 -13552 -13548 -26008 -47722
$$ packed form
20531c9341K353q276J8693L3034J7734j3140j5090k2095o453K3496L4887o39J4785
20518C9948K5117r605k1993j7891K083L176m25m1233l7848l394K7350J2755Q723
20505a3237K2393J3669K0699j356k3637m407M8252p696k8526o485k738L93n175
20492A2149p689m724K8547J3460n3140j9475j6066P042J7081n769o968j2790j6433
20479f4775J0631J9407K7396L240l987j0158K0108k146P249J0895o511k044j6211
20466f906j997O10J658k1774P747K352k278M963j0004k6479j5574N734J2793R989
20452c9166M0650J8141j4306l43M037P045J0217j1758j9864j4360k598N481K4661
20439G837M934J7575q558K3779L3922K107k2301q368l2094l2385Mj2460k1714
$$ plain form
20426 -47722 -30539 -38556 -43768 -51879 -31268 -20293 -6357 -18425 -2460 16757 20281 14137 12728
20413 12728 756 14010 -1300 -27099 -44151 -26745 11182 643 -4862 -14771 -32932 -41634
20401 -41634 -26513 -7643 6844 -29936 -15538 9280 32494 53322 38909 39431 47367 48320 39749
20388 39749 32705 38974 28295 32155 33755 35690 15002 6183 17627 34025 7094 -33471 -38521
20375 -38521 1959 -24197 -35498 -42161 -44156 -15401 33444 76803 54164 27671 15119 34573
20363 34573 25115 2783 -26832 -40952 -23788 -40565 -39175 -21908 -19854 -11281 16696 23091 27146
20350 27146 16905 8583 25159 25340 10024 -438 -777 750 3690 5654 10071 9667 1724 22977
20336 22977 12320 -27002 -64956 -42107 -12219 28944 39270 37308 27990 50593 46357 24696
$$ packed form
20426d7722J7183q017n212q111K0611J0975J3936j2068J5965J9217L524o144j409
20413A2728j1972J3254j5310k5799j7052J7406L7927j0539n505r909j8161q702
20401d1634J5121J8870J4487l6780J4398K4818K3214K0828j4413N22P936R53q571
20388C9749p044O269j0679L860J600J935k0688q819J1444J6398k6931m0565n050
20375c8521M0480k6156j1301o663j995K8755M8845M3359k2639k6493j2552J9454
20363C4573r458k2332k9615j4120J7164j6777J390J7267K054Q573K7977O395M055
20350B7146j0241q322J6576J81j5316j0462l39J527K940J964M417m04p943K1253
20336B2977j0657l9322l7954K2849K9888M1163J0326j962r318K2603m236k1661
$$ plain form
20324 24696 20997 12579 -11827 -31965 -7682 -2770 -12253 1063 -17211 -26528 -16971 5677 -3327
20311 -3327 55929 72019 70028 42875 22449 29766 34763 17787 -5005 -8967 -6511 -40427 -18888
20298 -18888 12422 31323 11756 -7835 1125 5083 26193 -12236 -37965 -35375 -32027 -6954
20286 -6954 13399 -1158 -7675 -8738 -39562 -43312 -43247 -26115 -29132 -24102 -16091 -7453 2786 35884
20272 35884 49956 18388 -161 -49135 -59450 -76928 -76511 -57480 -69667 -52294 -50418 -48521
20260 -48521 7301 -6441 -1053 -5844 -33158 -36880 -26559 -32623 -52793 -66108 -35967 10280
20248 10280 9282 -19170 -17110 -9665 -20890 -26428 -18976 -32657 -38647 -25980 2290 18448 -7485
20235 -7485 -18847 -2017 -5388 -40490 -43211 -23130 -25325 -15529 -7587 3106 -4646 18836 58375
$$ packed form
20324B4696l699q418k4406k0138K4283M912r483J3316j8274r317R557K2648r004
20311c327N9256J6090j991k7153k0426P317M997j6976k2792l962K456l3916K1539
20298a8888L1310J8901j9567j9591Q960L958K1110l8429k5729K590L348K5073
20286f954K0353j4557o517j063l0824l750O5J7132l017N030Q011Q638J0239L3098
20272C5884J4072l1568j8549m8974j0315j7478M17J9031j2187J7373J876J897
20260d8521N5822j3742N388m791k7314l722J0321o064k0170j3315L0141M6247
20248A0280r98k8452K060P445j1225n538P452j3681n990J2667K8270J6158k5933
20235g485j1362J6830l371l5102k721K0081k195R796P942J0693p752K3482L9539
$$ plain form
20222 58375 50521 30383 8961 5353 18569 53737 41242 44056 19382 -24471 -25651 -19602 -24147
20209 -24147 -9174 17079 15748 22719 39521 2572 8791 39927 38756 28729 26049 31222 31171
20196 31171 9071 5475 46699 50614 22708 13831 133 -17019 -35314 -14036 9928 4359
20184 4359 -797 -6309 -4339 -20432 -19425 11187 30727 59590 71459 61262 56264 39176 29044
20171 29044 20341 -3592 -23993 -33258 -28120 -27991 -5013 -2404 38384 59853 56561 43808 37661
20158 37661 20847 -9606 -810 46729 48872 41193 49205 67006 58180 43805 16710 14619 22166
20145 22166 7029 6114 17086 -7602 -27629 6596 45512 56629 29886 6813 -1596 -6269
20133 -6269 -13387 -43020 -69750 -34784 -3489 17634 11100 23958 11496 1846 -14443 -9446 6961
$$ packed form
20222E8375p854k0138k1422l608J3216L5168j2495K814k4674m3853j180O049m545
20209b4147J4973K6253j331O971J6802l6949O219L1136j171j0027k680N173n1
20196C1171k2100l596M1224L915k7906q877j3698j7152j8295K1278K3964n569
20184D359n156n512J970j6093J007L0612J9540K8863J1869j0197m998j7088j0132
20171B9044q703k3933k0401r265N138J29K2978K609M0788K1469l292j2753o147
20158C7661j6814l0453Q796M7539K143p679Q012J7801q826j4375k7095k091P547
20145B2166j5137r15J0972k4688k0027L4225L8916J1117k6743k3073q409m673
20133f269p118k9633k6730L4966L1295K1123o534J2858j2462r650j6289M997J6407
$$ plain form
20120 6961 23687 21946 27959 31181 51375 28004 4777 24535 25849 37996 46836 29432 8322
20107 8322 -7607 5662 16637 13404 2425 -8640 -12554 -15549 -895 -11888 -15279 -1240 -12598
20094 -12598 -18693 -24571 -23939 -34375 -18084 -5369 -8929 -36970 -37943 -24007 -7778 2996 677
20081 677 11399 2564 6505 -1659 -17580 -30297 -35912 -2881 1023 -17056 -27768 -30453 -37587
20068 -37587 -47449 -22825 -27219 -39441 -30849 1699 15501 4333 -28233 -42388 -35410 -35384 -14032
20055 -14032 127 -939 -5578 9169 38233 47093 23115 -4472 3981 28979 35775 21192 29553
20042 29553 22882 -1796 -12824 -8352 -10602 -22286 -25726 -32729 -23807 -47373 -58405 -49757 -28803
20029 -28803 2380 33101 22689 1001 -1246 -28862 -47084 -32870 -30660 -31612 -46444 -40091 -45642
$$ packed form
20120F961J6726j741O013L222K0194k3371k3227J9758J314J2147Q840j7404k1110
20107H322j5929J3269J0975l233j0979j1065l914k995J4654j0993l391J4039j1358
20094a2598o095n878O32j0436J6291J2715l560k8041r73J3936J6229J0774k319
20081F77J0722q835L941q164j5921j2717n615L3031L904j8079j0712k685p134
20068c7587r862K4624m394j2222Q592L2548J3802j1168l2566j4155O978K6K1352
20055a4032J4159j066m639J4747K9064Q860k3978k7587Q453K4998O796j4583Q361
20042B9553o671k4678j1028M472k250j1684l440p003Q922k3566j1032Q648K0954
20029b8803L1183L0721j0412k1688k247k7616j8222J4214K210r52j4832O353n551
$$ plain form
20016 -45642 -14067 18796 3007 19986 18275 29629 45725 45700 32573 45040 23326 -13505
20004 -13505 -14768 8635 64117 90081 36004 16277 50342 39291 28788 13964 17170 26887
19992 26887 31662 36279 27142 -3631 -35083 -22224 -32552 -24251 -277 -28348 -4183 9011
19980 9011 -7342 7480 1645 7929 -20109 -46488 -15232 -10403 31 21101 37562 -6557
19968 -6557 -21708 10942 6700 -6811 -12561 4606 9031 -33120 -55663 -37931 -51279 -21343
19956 -21343 -2213 -28299 -71218 -63432 -28740 -8329 5082 13470 -3750 -10763 175 2421
19944 2421 -19888 -37568 -27897 -26386 -31324 -51094 -27343 -27453 -40624 -30570 -30068 -40562 -59304
19931 -59304 -56552 -32881 1205 -23782 -11202 -13630 -10587 26807 13416 -16749 -22518 -7412
$$ packed form
20016d5642L1575L2863j5789J6979j711J1354J6096k5j3127J2467k1714l6831
20004a3505j263K3403N5482K5964n4077j9727L4065j1051j0503j4824L206R717
19992B6887M775M617r137l0773l1452J2859j0328Q301K3974k8071K4165J3194
19980I011j6353J4822n835O284k8038k6379L1256M829J0434K1070J6461m4119
19968f557j5151L2650m242j3511n750J7167M425m2151k2543J7732j3348K9936
19956b1343J9130k6086m2919P786L4692K0411J3411Q388j7220p013J0938K246
19944B421k2309j7680R671J511m938j9770K3751j10j3171J0054N02j0494j8742
19931e9304K752K3671L4086k4987J2580k428L043L7394j3391l0165n769J5106
$$ plain form
19919 -7412 41330 2261 2731 14002 18807 18580 -7267 -30218 -47103 -25488 -13894 677 -3202
19906 -3202 -4680 -24302 -30309 -610 28054 24389 23648 13989 9543 40766 39240 -6520 -18314
19893 -18314 -12640 18804 25882 25942 5259 -36880 -20959 -17629 -27703 -17489 11831 50532 31065
19880 31065 6769 10020 13812 21083 4962 -36382 -1707 12365 -3892 -17862 -2744 -4564
19868 -4564 -36229 -27196 -26222 -34923 -26739 -38711 -66717 -50784 -52416 -57180 -35845 11931 27249
19855 27249 -1192 -13589 -3099 17542 -1647 -22304 -9931 -22957 -35937 -61822 -44955 -17728
19843 -17728 -13315 -17349 -3745 13860 18597 21955 5745 -5742 -23223 -21400 -27609 -60004 -20323
19830 -20323 -22429 -9806 10526 12294 3715 34543 32866 8363 23456 -10237 -46432 -45271 -32723
$$ packed form
19919g412M8742l9069M70J1271M805k27k5847k2951j6885K1615J1594J4571l879
19906c202j478j9622o007K9699K8664l665p41r659m446L1223j526m5760j1794
19893a8314N674L1444P078O0k0683m2139J5921L330j0074J0214K9320L8701j9467
19880C1065k4296L251L792P271j6121m1344L4675J4072j6257j3970J5118j820
19868d564l1665R033R74q701Q184j1972k8006J5933j632m764K1335M7776J5318
19855B7249k8441j2397J0490K0641j9189k0657J2373j3026j2980k5885J6867K7227
19843a7728M413m034J3604J7605M737L358j6210j1487j7481J823o209l2395L9681
19830b0323k106J2623K0332J768q579L0828j677k4503J5093l3693l6195J161J2548
$$ plain form
19817 -32723 -35523 -19868 14617 46504 25200 -24400 -15793 18950 37343 40698 15533 19034
19805 19034 45217 28654 28516 70820 88041 58545 36502 24975 37634 50485 56460 44666
19793 44666 15324 -3443 545 -15951 -11809 -14053 -3587 -21229 -47202 -40420 -36945 -21363 -36064
19780 -36064 -40545 -29028 -45631 -41265 -14099 5843 13329 9711 13566 16592 -22104 -39347 -44012
19767 -44012 -67500 -38273 -20802 -22494 -14022 -1015 -23470 -32536 -15010 -17741 -17168 6643 9795
19754 9795 -27336 -65576 -41342 -30270 -45063 -38586 -32838 -50695 -27027 -28420 -29358 -16250 -25563
19741 -25563 -74690 -54595 -34459 -44924 -58272 -45547 -11795 1469 -10965 -58595 -44234 -29839
19729 -29839 -28927 -33829 -23568 -29159 -62232 -80782 -45884 1160 26537 8167 -26080 -24052 -36211
$$ packed form
19817c2723k800J5655L4485L1887k1304m9600Q607L4743J8393L355k5165L501
19805A9034K6183j6563j38M2304J7221k9496k2043j1527J2659J2851N975j1794
19793D4666k9342j8767L988j6496M142k244J0466j7642k5973O782L475J5582j4701
19780c6064m481J1517j6603M366K7166J9942P486l618L855L026l8696j7243m665
19767d4012k3488K9227J7471j692Q472J3007k2455r066J7526k731N73K3811L152
19754I795l7131l8240K4234J1072j4793O477N748j7857K3668j393r38J3108r313
19741b5563m9127K0095K0136j0465j3348J2725L3752J3264j2434m7630J4361J4395
19729b9839R12m902J0261n591l3073j8550L4898M7044K5377j8370l4247K028j2159
$$ plain form
19716 -36211 -69168 -49857 -37608 -14549 -8560 19492 21009 -19864 -43877 -39035 -20967 26124
19704 26124 25058 -1407 -10926 -26747 -17747 -41437 -37211 -16762 766 4026 11641 11590 10784 22577
19690 22577 31226 56948 44140 24714 9021 30701 45157 41467 6692 -33327 -1360 -1624
19678 -1624 2979 5392 5038 -7068 -13112 -14114 -12365 -36458 -33384 -44530 -36980 -18380 -18097 -8167
19664 -8167 -7465 42112 61998 54283 56768 33806 23432 24329 -621 -17275 -33060 -16289 1545
19651 1545 13233 4656 21679 14336 14641 27614 9715 2848 -12777 -19705 -31120 -34189 -17182
19638 -17182 -1257 -7378 -24713 -34784 -23957 -21338 -5066 9971 -22527 -58420 -39948 -32568
19626 -32568 -47948 -34264 -8459 -10510 10053 17187 21187 42561 51106 77076 43226 50048 32516
$$ packed form
19716c6211l2957J9311J2249K3059N989K8052J517m0873k4013M842J8068M7091
19704B6124j066k6465r519j5821R000k3690M226K0449J7528L260P615n1q06J1793
19690B2577Q649K5722j2808j9426j5693K1680J4456l690l4775m0019L1967k64
19678a624M603K413l54j2106o044j002J749k4093L074j1146P550J8600K83R930
19664h167P02M9577J9886p715K485k2962j0374Q97k4950j6654j5785J6771J7834
19651A545J1688q577J7023p343L05J2973j7899o867j5625o928j1415l069J7007
19638a7182J5925o121j7335j0071J0827K619J6272J5037l2498l5893J8472P380
19626c2568j5380J3684K5805k051K0563P134M000K1374Q545K5970l3850O822j7532
$$ plain form
19613 32516 22646 29037 57997 59289 48503 43514 35028 21484 15425 28130 19553 14602 27826
19600 27826 9994 10613 -20792 -26403 -21983 -8035 -12800 -12516 -2737 -15839 -6791 -2525 -21532 -36510
19586 -36510 -39065 -18157 12746 29587 -4542 -3619 42005 44308 17445 -4058 25915 19494 -13636
19573 -13636 11462 50925 50395 81107 92315 53357 5042 -49822 -81468 -70132 -59507 -17848
19561 -17848 39758 6265 -4019 3756 -12609 11201 25121 2236 4167 4064 27824 30986 19058
19548 19058 -16828 -32445 -13233 32233 23292 5533 -12287 -1834 13675 -3076 -18344 -22235
19536 -22235 -27456 -59585 -70509 -35362 -27223 -17313 -16358 7019 12412 -5347 -60056 -74867 -43634
19523 -43634 -7538 -8564 -7331 -2815 22474 30377 41637 13447 -20865 -25946 -5529 12617 3986
$$ packed form
19613C2516r870O391K8960J292j0786m989q486j3544o059J2705q577m951J3224
19600B7826j7832O19l1405n611M420J3948m765K84R779j3102R048M266j9007j4978
19586c6510k555K0908L0903J6841l4129R23M5624K303k6863k1503K9973o421l3130
19573a3636K5098L9463n30L0712J1208l8958m8315n4864l1646J1336J0625M1659
19561a7848N7606l3493j0284P775j6365K3810J3920k2885J931j03K3760L162j1928
19548A9058l5886j5617J9212M5466q941j7759j7820J0453J5509j6751j5268l891
19536b2235n221l2129j0924L5147Q139R910R55K3377N393j7759n4709j4811L1233
19523d3634L6096j026J233M516K5289P903J1260k8190l4312n081K0417J8146q631
$$ plain form
19510 3986 -20903 -26066 -35815 -17574 -11524 -2856 22027 6828 15688 9869 -7737 -7406 -28746
19497 -28746 -34628 -10707 -436 18892 22248 19640 16019 3165 24701 20193 24434 17425 26752
19484 26752 -300 -12461 -24455 -42443 -25598 11439 24350 21699 33434 43056 47589 32714
19472 32714 3040 5315 7726 11165 40434 48419 33342 1767 -14501 1914 15339 30197
19460 30197 44827 13426 -30272 -38111 6928 22821 2624 -5311 -20394 9688 18500 -17664
19448 -17664 -14271 -11609 -10312 -18066 -1282 705 6874 55379 70473 47186 32309 40421 25887
19435 25887 21679 10862 -3589 11393 9780 29648 11435 26535 37039 16713 -5864 -8540
19423 -8540 -2997 24277 34277 1623 -32072 -20523 -13862 20945 52930 52751 19174 6904 -6481
$$ packed form
19510C986k4889n163r749J8241O050Q668K4883j5199Q860n819j7606L31k1340
19497b8746n882K3921J0271J9328L356k608l621j2854K1536m508M241p009R327
19484B6752k7052j2161j1994j7988J6845L7037J2911k651J1735R622M533j4875
19472C2714k9674K275K411L439K9269P985j5077l1575j6268J6415J3425J4858
19460C0197J4630l1401m3698p839M5039J5893k0197p935j5083L0082Q812l6164
19448a7664L393K662J297p754J6784J987O169M8505J5094k3287j4877Q112j4534
19435B5887m208j0817j4451J4982j613J9868j8213J5100J0504k0326k2577k676
19423h540N543K7274J0000l2654l3695J1549O661L4807L1985j79l3577j2270j3385
$$ plain form
19410 -6481 1170 11500 18281 1860 742 130 16766 32414 28666 -8849 -15852 -16171 -2972 5267
19396 5267 5190 -3714 -22455 -20636 -29706 -11945 19138 11742 -10552 -21460 -2818 22651 19007
19383 19007 12814 29081 5471 17158 13657 528 -12246 -25197 -14091 11624 37177 18052
19371 18052 4812 7982 -28786 -40901 -25960 -12801 1149 9646 24002 11182 -17239 -35598
19359 -35598 -34380 -51515 -67320 -62099 -22383 -4074 -19061 -27510 -16150 -13413 -44283 -33770
19347 -33770 -5352 -11836 -3860 -3750 19558 20274 40134 69706 69890 40404 33682 27425 18786 12857
19333 12857 6311 -8241 -3850 -15160 25281 32566 15460 10054 9643 4050 3891 -10842 -53
19320 -53 5488 -8301 32173 42843 36925 29464 19021 -15308 -22521 -26303 -15617 -18149 -15873 -22372
$$ packed form
19410f481P651J0330O781j6421j118o12J6636J5648l748l7515p003l19J3199Q239
19396E267p7q904j8741J819r070J7761L1083p396k2294j0908J8642K5469l644
19383A9007o193J6267k3610J1687l501j3129j2774j2951J1106K5715K5553j9125
19371A8052j3240L170l6768j2115J4941J3159J3950Q497J4356j2820k8421j8359
19359c5598J218j7135j5805N221L9716J8309j4987q449J1360K737l0870J0513
19347c3770K8418o484P976J10K3308P16J9860K9572J84k9486o722o257q639n929
19333A2857o546j4552M391j1310M0441P285j7106n406m11n593j59j4733J0789
19320e3N541j3789M0474J0670n918p461j0443l4329p213l782J0686k532K276o499
$$ plain form
19306 -22372 -18917 -4288 -12514 8932 42468 23420 18422 27464 32847 53181 13095 -5499 5396
19293 5396 -18785 -29195 -2948 -14426 -30687 -14600 -260 -13324 -34580 -24761 -26789 -61916
19281 -61916 -49051 -42885 -50346 -20113 18457 -3707 -33244 -41697 -69564 -59697 -14718 -468
19269 -468 -35348 -20153 -7511 -2695 18973 39993 43407 52604 61785 28328 46887 26783 -962
19256 -962 -15588 -11493 10747 47240 32691 25592 30850 19228 -1040 -32287 -37715 -18127 -36821
19243 -36821 -19563 25803 47157 20566 -5415 16151 29849 18338 31957 21693 13379 42167
19231 42167 21538 10597 7866 14704 -3330 -26410 -16430 -7073 5708 20982 3009 34966
19219 34966 78402 72863 67255 70427 83739 88537 86596 91792 78080 21178 3334 -6000 -7776
$$ packed form
19306b2372L455J4629q226K1446L3536j9048m998R042N383K0334m0086j8594J0895
19293E396k4181j0410K6247j1478j6261J6087J4340j3064k1256R819k028l5127
19281f1916J2865O166p461L0233L8570k2164k9537q453k7867R867M4979J4250
19269d68l4880J5195J2642M816K1668K1020L414R197R181l3457J8559k0104k7745
19256i62j4626M095K2240L6493j4549p099N258j1622k0268l1247n428J9588j8694
19243c6821J7258M5366K1354k6591k5981K1566J3698j1511J3619j0264q314K8788
19231D2167k0629j0941k731O838j8034k3080R980R357J2781J5274j7973L1957
19219C4966M3436n539n608L172J3312M798j941N196j3712n6902j7844r334j776
$$ plain form
19206 -7776 1497 -15754 -34166 -43262 -59326 -34112 10484 -8729 -28476 -5693 1322 20792
19194 20792 23809 -7075 184 9783 14182 16248 9632 18481 25397 13459 25792 57196 49005
19181 49005 31035 24278 6819 -7598 10541 20797 18180 27632 23659 11212 8343 -16088 -18187
19168 -18187 1094 43161 55001 40429 34016 29250 25850 49460 39749 19544 -10907 -18802 10167
19155 10167 10362 9060 4469 -22600 -8651 9154 8063 7793 4446 -25719 3359 18375 -5519
19142 -5519 -35144 -32935 -14126 9798 10591 -2496 -15846 -9533 -11744 23915 28314 3246 15705
19129 15705 12581 -1626 -32016 1906 21635 31411 20753 36269 47348 37714 40819 46359 45417
19116 45417 50713 66373 71948 87086 109594 95887 81186 79613 83020 76904 74940 56983 27561
$$ packed form
19206g776R273j7251j8412r096j6064K5214M4596j9213j9747K2783P015J9470
19194B0792L017l0884P259R599M399K066o616Q849O916j1938J2333L1404q191
19181D9005j7970o757j7459j4417J8139J0256k617R452l973j2447k869k4431k099
19168a8187J9281M2067J1840j4572o413m766l400K3610r711k0205l0451p895K8969
19155A0167J95j302m591k7069J3949J7805j091k70l347l0165K9078J5016k3894
19142e519k9625K209J8809K3924P93j3087j3350O313k211L5659M399k5068J2459
19129A5705l124j4207l0390L3922J9729R776j0658J5516J1079r634L105N540r42
19116D5417N296J5660N575J5138K2508j3707j4701j573L407o116j964j7957k9422
$$ plain form
19103 27561 55845 93018 123525 169738 173333 126611 110095 140811 160621 234586 336688 497177
19091 497177 663936 807572 874362 874431 825676 742312 689246 588159 494268 466883 491374
19080 491374 569277 619131 682314 752544 810128 849748 832607 755764 711975 659831 612382
19069 612382 559823 475170 376710 314018 241956 181331 163044 183803 198328 195029 177587 150107
19057 150107 152326 184649 226908 279463 355721 441913 476707 469006 440278 404974 391159 416630
19045 416630 446371 468236 461398 457067 488119 588010 620602 589282 542466 492369 464866 510054
19033 510054 587777 644053 641792 594266 529835 464704 445144 478468 535984 556038 524929 496622
19021 496622 506387 528364 506874 478984 417880 320559 251266 218079 221045 197884 205807 195958
$$ packed form
19103B7561K8284L7173L0507M6213L595m6722j6516L0716J9810P3965J02102J60489
19091D97177J66759J43636O6790O9m8755q3364n3066j01087r3891k7385K4491
19080D91374P7903M9854O3183P0230N7584L9620j7141p6843m3789n2144m7449
19069F12382n2559q4653r8460o2692p2062o0625j8287K0759J4525l299j7442k7480
19057A50107K219L2323M2259N2555P6258Q6192L4794p701k8728l5304j3815K5471
19045D16630K9741K1865o838m331L1052R9891L2592l1320m6816n0097k7503M5188
19033E10054P7723N6276k261m7526o4431o5131j9560L3324N7516K0054l1109k8307
19021D96622R765K1977k1490k7890o1104r7321o9293l3187K966k3161P923r849
$$ plain form
19009 195958 151182 149881 170120 164253 178258 240292 325800 423775 464405 422880 351170 342062
18997 342062 324368 279159 269788 337527 423408 469310 490921 440891 358967 315972 294577 316287
18985 316287 392980 478573 600346 642573 605930 522639 370095 245576 189094 176118 176967
18974 176967 151390 160569 160907 135313 108940 107330 90474 90342 64814 60545 75500 69089 35729
18961 35729 41716 63759 68131 38731 10003 -11403 5663 9226 6302 9882 3630 43377 66468
18948 66468 86640 99548 105206 89190 63173 30261 24832 27582 19981 16132 30807 67465 82305
18935 82305 57665 37387 44964 67685 56518 47997 39231 62127 52680 34113 33196 61605 70373
18922 70373 72191 60628 83089 74190 72426 89591 93329 83104 67929 75932 77500 71597 77047
$$ packed form
19009A95958m4776j301K0239n867J4005O2034Q5508R7975M0630m1525p1710r108
18997C42062j7694m5209r371O7739Q5881M5902K1611n0030q1924m2995k1395K1710
18985C16287P6693Q5593J21773M2227l6643q3291j52544j24519n6482j2976Q49
18974A76967k5577R179L38k5594k6373j610j6856j32k5528m269J4955o411l3360
18961C5729N987K2043M372k9400k8728k1406J7066L563k924L580o252L9747K3091
18948F6468K0172J2908N658j6016k6017l2912n429K750p601l849J4675L6658J4840
18935H2305k4640k0278P577K2721j1167q521q766K2896r447j8567r17K8409Q768
18922G0373J818j1563K2461q899j764J7165L738j0225j5175Q003J568n903N450
$$ plain form
18909 77047 84603 81034 61014 44389 42534 66528 81168 95434 122401 121488 130514 123585 103900
18896 103900 90822 72499 81008 94956 116185 88140 50742 49905 47281 48328 66551 78931
18884 78931 68593 47598 35356 73883 67850 48814 46464 43959 37965 14870 -482 -5305 24187
18871 24187 38249 72334 83227 81458 77861 73549 60892 58163 74492 67453 73728 83531 45994
18858 45994 23308 4512 31155 54364 73163 104266 115658 80729 51864 58212 83942 85091
18846 85091 103434 87305 75862 96389 109713 119779 75377 46964 75272 50874 32934 33953
18834 33953 46549 76948 69054 69441 47784 36390 56447 63821 54309 53413 31771 -3961 22762
18821 22762 43106 57670 81168 67042 30961 35536 36366 73781 87056 57167 31371 61153
$$ packed form
18909G7047P556l569k0020j6625j855K3994J4640J4266K6967r13R026o929j9685
18896A03900j3078j8323Q509J3948K1229k8045l7398q37k624J047J8223J2380
18884G8931j0338k0995j2242L8527o033j9036k350k505n994k3095j5352m823K9492
18871B4187J4062L4085J0893j769l597m312j2657k729J6329p039O275R803l7537
18858D5994k2686j8796K6643K3209J8799L1103J1392l4929k8865O348K5730J149
18846H5091J8343j6129j1443K0527J3324J0066m4402k8413K8308k4398j7940J019
18834C3953J2596L0399p894L87k1657j1394K0057P374r512q96k1642l5732K6723
18821B2762K0344J4564K3498j4126l6081M575Q30L7415J3275k9889k5796K9782
$$ plain form
18809 61153 84189 65830 81769 95900 77092 53652 63619 60174 51362 37288 18358 23253
18797 23253 53151 20567 20552 38454 82303 88168 84402 87368 116715 102168 115565 146740 141215
18784 141215 157695 180865 185561 215516 243039 279392 311480 308960 292615 278232 242286 228721
18772 228721 210027 190557 202588 218944 225488 230359 273414 347614 439105 477757 525595 520856
18760 520856 421853 318913 265101 254142 238401 223168 224132 209490 207506 208942 186044 126162
18748 126162 111549 115494 101079 58527 48812 50992 78509 76202 92789 86769 112475 132940
18736 132940 122866 116267 93878 88172 80574 78989 88850 88851 105184 116866 132250 143166 141121
18723 141121 149394 157948 137520 108020 115703 120054 124801 120286 130904 141088 140102 133858 143534
$$ packed form
18809F1153K3036j8359J5939J4131j8808k3440R967l445q812j4074j8930M895
18797B3253K9898l2584j5J7902M3849N865l766K966K9347j4547J3397L1175n525
18784A41215J6480K3170M696K9955K7523L6353L2088k520j6345j4383l5946j3565
18772B28721j8694j9470J2031J6356O544M871M3055P4200R1491L8652M7838m739
18760E20856r9003j02940n3812j0959j5741j5233R64j4642j984J436k2898n9882
18748A26162j4613L945j4415m2552r715K180K7517k307J6587o020K5706K0465
18736A32940j0074o599k2389n706p598j585R861JJ6333J1682J5384J0916k045
18723A41121Q273Q554k0428k9500P683M351M747m515J0618J0184r86o244R676
$$ plain form
18710 143534 175572 189379 206732 214609 247384 272178 293458 310525 321520 306638 276362 249929
18698 249929 221898 206740 204860 239711 269666 292697 318486 334636 383505 409183 407968 418615
18686 418615 433077 408314 417291 430508 402780 388636 363502 361463 391451 449249 511051 622204
18674 622204 820250 1181735 1694416 2096818 2225833 2231329 2125767 1935313 1715226 1461329
18664 1461329 1171890 880539 711150 644486 682677 798060 951437 1074429 1095530 1030909
18654 1030909 915558 832607 756972 694503 623493 636627 599151 560858 530905 488034 486440
18643 486440 476857 477653 483553 471651 484057 536606 608101 683733 748390 819241 889654 1024014
18631 1024014 1248978 1512655 1710324 1777021 1718433 1549796 1397024 1308050 1244716 1253544
$$ packed form
18710A43534L2038J3807J7353P877L2775K4794K1280J7067J0995j4882l0276k6433
18698B49929k8031j5158j880L4851K9955K3031K5789J6150M8869K5678j215J0647
18686D18615J4462k4763Q977J3217k7728j4144k5134k039K9988N7798O1802J11153
18674F22204J98046L61485N12681M02402J29015N496j05562j90454k20087k53897
18664A461329k89439k91351j69389o6664L8191J15383J53377J22992K1101o4621
18654A030909j15351q2951p5635o2469p1010J3134l7476l8293k9953m2871j594
18643D86440r583P96N900j1902J2406N2549P1495P5632O4657P0851P0413J34360
18631A024014K24964K63677J97669O6697n8588j68637j52772q8974o3334Q828
$$ plain form
18621 1253544 1393348 1708864 2274893 3190220 4463650 5840143 6982405 7526399 7299808
18612 7299808 6402509 5270539 4194841 3342271 2782968 2417437 2208240 2221108 2406815
18603 2406815 2581441 2619896 2594494 2517178 2441850 2433975 2530897 2708353 3000151 3543491 4396443
18592 4396443 5620903 6881409 7825587 8688527 10078548 13048605 18526497 25026678
18584 25026678 29814812 31271567 29717790 27500758 26590298 26507864 25260916 22602162
18576 22602162 18913857 14941175 11946111 10201162 9317045 9177556 9989308 12141107
18568 12141107 15575229 18548876 19390748 18230985 15612985 12585721 10268921 8973450
18560 8973450 8518148 8607827 9166491 10138722 11172275 12040445 12497569 12279647 11472935
$$ packed form
18621A253544J39804L15516N66029R15327J273430J376493J142262N43994k26591
18612G299808q97299j131970j075698q52570n59303l65531k09197J2868J85707
18603B406815J74626L8455k5402p7316p5328p875R6922J77456K91798N43340Q52952
18592D396443J224460J260506R44178Q62940J390021K970057N477892O500181
18584B5026678M788134J456755j553777k217032r10460q2434j246948k658754
18576B2602162l688305l972682k995064j744949q84117j39489Q11752K151799
18568A2141107L434122K973647Q41872j159763k618000l027264k316800j295471
18560H973450m55302Q9679N58664R72231J033553Q68170M57124k17922q06712
$$ plain form
18551 11472935 10556857 9883436 9795636 10718180 12939154 17028105 22795249 27597392 29250229
18542 29250229 28482642 26056995 23208486 21335587 20688048 21037995 22220817 24482826
18534 24482826 28507274 35405844 47287087 68233427 104861256 159023272 215600115
18527 215600115 255933980 276278067 269958699 238401871 199301507 163969160 138996660
18520 138996660 123470950 111552011 103092798 98782753 101083167 106671301 110253453 116991478
18512 116991478 131920335 162524341 203597888 243454598 281620549 293399852 268954391
18505 268954391 226737995 175267286 126858626 92156183 70208581 56456896 47329014
18498 47329014 40723634 35641459 31838600 29252087 28189351 29331610 32819993 35862545
$$ packed form
18551A1472935r16078o73421q7800R22544K220974M088951N767144M802143J652837
18542B9250229p67587k425647k848509j872899o47539L49947J182822K262009
18534B4482826M024448O898570J1881243K0946340L6627829N4162016N6576843
18527B15600115M0333865K0344087o319368l1556828l9100364l5332347k4972500
18520A38996660j5525710j1918939q459213m310045K300414N588134L582152O738025
18512A16991478J4928857L0604006M1073547L9856710L8165951J1779303k4445461
18505B68954391m2216396n1470709m8408660l4702443k1947602j3751685r127882
18498D7329014o605380n082175l802859k586513j062736J142259L488383L042552
$$ plain form
18490 35862545 35470055 32812171 28317817 23200916 19165698 16298224 14197367 12616863
18482 12616863 11371894 10441622 9748364 9192743 8796677 8535980 8381224 8379569 8636289
18473 8636289 9217022 10207895 11815021 14604055 18704234 21904523 22307685 20976861 18269946
18464 18269946 15401076 13621997 13110555 13700718 15364992 18346928 23744362 32330090
18456 32330090 42171791 54187591 71021662 86536443 95964604 101471308 104148627 105709522
18448 105709522 104078416 95658249 84243712 72967248 66099434 68787670 78146260 83689417
18440 83689417 83070371 80784790 80569435 82876591 80830798 72673730 60240169 45238161
18432 45238161 32565187 24247346 19025777 15521796 13014999 11138110 9728338 8633803
$$ packed form
18490C5862545l92490k657884m494354n116901m035218k867474k100857j580504
18482A2616863j244969r30272o93258n55621l96066k60697j54756j655K56720
18473H636289N80733R90873J607126K789034M100179L200289M03162j330824k706915
18464A8269946k868870j779079n11442N90163J664274K981936N397434Q585728
18456C2330090R841701J2015800J6834071J5514781R428161N506704K677319J560895
18448A05709522j631106q420167j1414537j1276464o867814K688236R358590N543157
18440H3689417o19046k285581k15355K307156k045793q157068j2433561j5002008
18432D5238161j2672974q317841n221569l503981k506797j876889j409772j094535
$$ plain form
18424 8633803 7767212 7068143 6470570 5978053 5603269 5247453 4875754 4497393 4190101
18415 4190101 3964004 3754364 3553029 3338376 3187160 3097465 3003556 2856105 2725754 2602368
18405 2602368 2550313 2420696 2292154 2177321 2057317 1961168 1942845 1945741 1883883 1818643 1776543
18394 1776543 1721242 1651588 1597194 1526143 1400218 1301571 1210390 1110764 1021197 972994 904514
18383 904514 862953 852663 804544 758797 743291 734030 699452 681684 682721 679496 702446 733495
18371 733495 746000 741790 748005 710793 657623 610359 559773 531574 511537 511265 525148 502286
18359 502286 486437 497354 527735 561087 545461 530300 522684 513507 517546 513442 475485 450417
18347 450417 411101 374204 336779 328558 324831 294055 279160 303556 336583 328633 337026 359960
$$ packed form
18424H633803q66591o99069n97573m92517l74784l55816l71699l78361l07292
18415D190101k26097k09640k01335k14653j51216q9695r3909j47451j30351j23386
18405B602368n2055j29617j28542j14833j20004r6149j8323K896o1858o5240m2100
18394A776543n5301o9654n4394p1051j25925r8647r1181r9626q9567m8203o8480
18383I04514m1561j0290m8119m5747j5506r261l4578j7768J037l225K2950L1049
18371G33495J2505m210O215l7212n3170m7264n0586k8199k0037k72J3883k2862
18359E02286j5849J0917L0381L3352j5626j5161p616r177M039m104l7957k5068
18347D50417l9316l6897l7425q221l727l0776j4895K4396L3027p950Q393K2934
$$ plain form
18335 359960 349343 332682 330765 317895 298808 277389 274327 280177 289999 285944 272615 249903
18323 249903 209846 243328 267330 273944 284381 257699 236478 244751 241062 261541 242122 183583
18311 183583 183489 198518 215606 223238 249956 235539 212425 209019 229896 245977 232717 228652 244944
18298 244944 273885 308504 320389 306817 288126 308393 301102 302427 308647 283224 250405 238156
18286 238156 250405 269647 256814 252443 269674 283715 301627 296225 295997 304036 311824 304497 280383
18273 280383 246895 232870 220604 178708 174827 179326 175222 208285 209096 200076 208562 222119 217894
18260 217894 179030 158627 140943 155958 169956 151547 143217 171542 183331 175788 147401 147112
18248 147112 147726 150656 137972 124122 143670 146980 134683 119323 124310 147209 160212 144260
$$ packed form
18335C59960j0617j6661j917j2870j9087k1419l062N850R822m055j3329k2712
18323B49903m0057L3482K4002O614J0437k6682k1221Q273l689K0479j9419n8539
18311A83583r4J5029J7088P632K6718j4417k3114l406K0877J6081j3260m065J6292
18298B44944K8941L4619J1885j3572j8691K0267p291J325O220k5423l2819j2249
18286B38156J2249J9242j2833m371J7231J4041J7912n402k28Q039P788p327k4114
18273B80383l3488j4025j2266m1896l881M499m104L3063Q11r020Q486J3557m225
18260B17894l8864k0403j7684J5015J3998j8409q330K8325J1789p543k8387k89
18248A47112O14K930j2684j3850J9548L310j2297j5360M987K2899J3003j5952
$$ plain form
18236 144260 132296 153812 188063 212635 204762 213023 240490 255147 267412 242901 239731 248907
18224 248907 234013 244639 284957 263029 246117 260310 231771 206866 232483 249371 236026
18213 236026 205878 189245 161550 144025 125088 123148 154143 141124 112481 99285 118008 155055
18201 155055 174839 201288 195179 218056 249600 249689 221391 210080 186372 158698 145269 153642
18189 153642 184605 204138 191265 148698 127535 133161 124122 82509 82624 130901 147002 159940
18177 159940 152880 158137 190336 213421 215471 198882 198388 193391 169993 141289 119799 105486 122692
18164 122692 171555 195921 182748 188893 189906 172823 129610 147357 114540 126886 147765 134252
18152 134252 156832 181236 151506 146711 156831 181404 189846 195674 199857 204300 210427 226370 254785
$$ packed form
18236A44260j1964K1516L4251K4572p873Q261K7467J4657J2265k4511l170R176
18224B48907j4894J0626M0318k1928j6912J4193k8539k4905K5617J6888j3345
18213B36026l0148j6633k7695j7525j8937j940L0995j3019k8643j3196J8723L7047
18201A55055J9784K6449o109K2877L1544Q9k8298j1311k3708k7674j3429Q373
18189A53642L0963J9533j2873m2567k1163N626r039m1613J15M8277J6101J2938
18177A59940p060N257L2199K3085K050j6589m94m997k3398k8704k1490j4313J7206
18164A22692M8863K4366j3173O145J013j7083m3213J7747l2817J2346K0879j3513
18152A34252K2580K4404k9730m795J0120K4573Q442N828M183M443O127J5943K8415
$$ plain form
18139 254785 265810 256202 217162 225764 239022 247703 283705 291727 328959 378332 444500 466741
18127 466741 474601 535874 604241 611569 600856 653867 692855 756479 862486 987559 1133028
18116 1133028 1319927 1548388 1893250 2425275 3128778 4259049 6137618 9433729 16007795
18107 16007795 29598589 48160971 54615175 51510137 43189844 29474628 18607792
18100 18607792 12370014 8814198 6648842 5238966 4261833 3558200 3040492 2632419 2277619
18091 2277619 1984249 1729608 1506110 1373953 1231338 1100535 970621 855903 797207 752705
18081 752705 701773 673982 660395 634111 604569 551104 522919 540014 512623 483572 449705
18070 449705 429333 428954 402407 392568 410509 451956 458398 517933 598392 691504 769967 802775
$$ packed form
18139B54785J1025r608l9040Q602J3258Q681L6002Q022L7232M9373O6168K2241
18127D66741P860O1273O8367P328j0713N3011L8988O3624J06007J25073J45469
18116A133028J86899K28461L44862N32025P03503J130271J878569L296111O574066
18107A6007795J3590794J8562382O454204l105038q320293j3715216j0866836
18100A8607792o237778l555816k165356j409876r77133p03633n17708m08073l54800
18091B277619k93370k54641k23498j32157j42615j30803j29914j14718n8696m4502
18081G52705n0932k7791j3587k6284k9542n3465k8185J7095k7391k9051l3867
18070D49705k0372l79k6547r839J7941M1447O442N9535Q0459R3112P8463L2808
$$ plain form
18058 802775 770389 694443 650380 592457 505834 454383 495466 546214 583006 567614 548909
18047 548909 485990 399941 352103 366813 410030 437699 450421 459438 410249 346228 276668 234539
18035 234539 214274 199292 221522 217604 181805 184805 187954 202995 210240 193592 188974 186001 180312
18022 180312 209534 240564 236983 186347 176843 185130 176053 183096 187870 187630 230774 267627 275478
18009 275478 248146 258288 281885 306501 409610 519886 570981 571119 522982 518670 567580 612215
17997 612215 697561 781414 804485 780227 761350 787918 821935 832738 822963 745707 635177
17986 635177 593991 640106 686786 672194 618829 574045 492376 367602 265778 215267 184041
17975 184041 171285 149278 145956 148533 136275 134852 114254 120534 158759 177756 149639 128810
$$ packed form
18058H02775l2386p5946m4063n7923q6623n1451M1083N0748L6792j5392j8705
18047E48909o2919q6049m7838J4710M3217K7669J2722R017m9189o4021o9560m2129
18035B34539k0265j4982K2230l918l5799L000L149J5041P245j6648m618k973n689
18022A80312K9222L1030l581n0636r504Q287r077P043M774k40M3144L6853P851
18009B75478k7332J0142K3597K4616J03109J10276N1095J38m8137m312M8910M4635
17997F12215Q5346Q3853K3071k4258j8877K6568L4017J0803r775p7256j10530
17986F35177m1186M6115M6680j4592n3365m4784q1669j24774j01824n0511l1226
17975A84041j2756k2007l322K577j2258j423k0598O280L8225J8997k8117k0829
$$ plain form
17963 128810 150058 154766 164591 172088 131439 103963 109617 98415 108862 120190 115467 133177
17951 133177 151422 169762 195559 240752 292100 342706 379245 374836 349307 348416 344838 359735
17939 359735 395358 416762 392116 325016 252498 221878 195967 189880 211954 220639 241797 313894
17927 313894 397322 470264 505832 487586 377461 248640 188718 163264 160481 149569 139388
17916 139388 131058 121349 141707 135744 87278 60002 65691 55525 53874 53000 69340 76249 57859
17903 57859 36338 68193 58313 46842 43802 27396 8593 19334 43653 35569 52428 88619
17891 88619 65347 29888 57654 90189 107293 113236 112001 96325 82893 50261 11866 19021
17879 19021 7039 -17468 17942 37473 46069 37636 24257 23988 30845 19694 48720 37660 7709
$$ packed form
17963A28810K1248M708R825P497m0649k7476N654j1202J0447J1328m723J7710
17951A33177J8245J8340K5797M5193N1348N0606L6539m409k5529q91l578J4897
17939C59735L5623K1404k4646o7100p2518l0620k5911o087K2074Q685K1158P2097
17927C13894Q3428P2942L5568j8246j10125j28821n9922k5454k783j0912j0181
17916A39388q330r709K0358n963m8466k7276N689j0166j651q74J6340O909j8390
17903E7859k1521L1855r880j1471l040j6406j8803J0741K4319q084J6859L6191
17891H8619k3272l5459K7766L2535J7104N943j235j5676j3432l2632l8395P155
17879A9021j1982k4507L5410J9531Q596q433j3379k69O857j1151K9026j1060k9951
$$ plain form
17866 7709 3253 7029 29819 32885 26727 37819 37240 25937 20586 29683 12333 -24803 20673
17853 20673 60082 51678 39332 55872 43789 49367 66255 64499 56287 76761 98885 85156
17841 85156 68078 89612 79290 67255 54293 40942 44782 61861 68355 53062 30273 20740
17829 20740 14056 23164 21815 35658 50107 60790 66744 60928 66129 84701 93517 67584 67651 85061
17815 85061 126240 140046 129531 116228 106437 109773 159207 233370 294532 375015 423652 447463
17803 447463 439430 463311 468701 447722 385190 342051 324497 378621 439886 461020 451603 446044
17791 446044 482054 509074 462391 382087 325918 217811 134544 110468 142863 116823 119627
17780 119627 110702 128944 116841 94791 80045 49293 65285 67786 66236 70543 39849 48934
$$ packed form
17866G709m456L776K2790L066o158J1092n79j1303n351R097j7350l7136M5476
17853B0673L9409q404j2346J6540j2083N578J6888j756q212K0474K2124j3729
17841H5156j7078K1534j0322j2035j2962j3351L840J7079O494j5293k2789r533
17829B0740o684R108j349J3843J4449J0683N954n816N201J8572Q816k5933O7J7410
17815H5061M1179J3806j0515j3303r791L336M9434P4163O1162Q0483M8637K3811
17803D47463q033K3881N390k0979o2532m3139j7554N4124O1265K1134r417n559
17791D46044L6010K7020m6683q0304n6169j08107q3267k4076L2395k6040K804
17780A19627q925J8242j2103k2050j4746l0752J5992K501j550M307l0694R085
$$ plain form
17768 48934 38316 29108 32711 50107 83492 97612 94331 72046 73506 83626 80292 73981 56291
17755 56291 56632 44029 40801 49650 60482 94608 96051 91433 82486 73283 30305 22445 35817
17742 35817 15379 2659 1319 2147 36419 81168 86898 93603 62576 66275 67421 77866 87054
17729 87054 65528 58581 50517 43719 51583 82623 76483 61582 51661 66464 77103 75326 79941
17716 79941 108708 110692 101044 112477 128745 190037 248110 311328 343555 353672 376833 414443
17704 414443 450380 459078 427140 351066 276712 217315 202558 184652 160117 162718 165351 137686
17692 137686 122755 132869 147361 219816 317859 386690 430036 444197 447200 444230 462061 431046
17680 431046 366640 300359 215054 150165 141937 120271 106576 133561 103990 59069 34621 24231
$$ packed form
17768D8934j0618r208L603J7396L3385J4120l281k2285J460J0120l334o311j7690
17755E6291L41j2603l228Q849J0832L4126J443m618q947r203m2978p860J3372
17742C5817k0438j2720j340Q28L4272M4749N730O705l1027L699J146J0445R188
17729H7054k1526o947q064o798P864L1040o140j4901r921J4803J0639j777M615
17716G9941K8767J984r648J1433J6268O1292N8073O3218L2227J0117K3161L7610
17704D14443L5937Q698l1938p6074p4354n9397j4757j7906k4535K601K633k7665
17692A37686j4931J0114J4492P2455R8043O8831M3346J4161L003k970J7831l1015
17680D31046o4406o6281q5305o4889q228k1666j3695K6985k9571m4921k4448j0390
$$ plain form
17668 24231 25592 67946 85469 64444 34699 25038 37848 54249 59468 83158 64278 55654
17656 55654 60725 110229 106870 112984 102434 65112 30216 10770 50191 60767 25857 30371
17644 30371 28610 65084 88656 85685 61674 58397 40103 24897 2929 -6495 10712 50374
17632 50374 67757 54084 53764 62677 76835 81056 83464 90678 82857 40388 1367 2206 12879
17619 12879 14946 43758 60964 54587 61737 42725 32286 15164 5284 17273 18066 39368 48752
17606 48752 61122 57285 63607 64857 69662 63543 49004 48706 60324 48003 48472 28895 7256
17593 7256 8557 2371 7808 5991 21283 22634 -2416 35185 83191 90611 51516 21922 15970
17580 15970 49551 64449 48585 35069 13567 8997 25221 15486 47519 70790 59759 31893
$$ packed form
17668B4231J361M2354J7523k1025k9745r661J2810J6401N219K3690j8880q624
17656E5654N071M9504l359O114j0550l7322l4896j9446L9421J0576l4910M514
17644C0371j761L6474K3572k971k4011l277j8294j5206k1968r424J7207L9662
17632E0374J7383j3673l20Q913J4158M221K408P214p821m2469l9021Q39J0673
17619A2879K067K8812J7206o377P150j9012j0439j7122r880J1989P93K1302R384
17606D8752J2370l837O322J250M805o119j4539k98J1618j2321M69j9577k1639
17593G256J301o186N437j817J5292J351k5050L7601M8006P420l9095k9594n952
17580A5970L3581J4898j5864j3516k1502m570J6224r735L2033K3271j1031k7866
$$ plain form
17568 31893 41303 57547 73046 50833 73641 73796 48830 32955 44648 74986 85915 78682
17556 78682 49353 37815 66768 82007 65285 46028 33261 13189 7759 29589 41008 37404
17544 37404 18432 20778 21804 42181 56671 70143 81413 67798 53945 42042 50385 49847 53157
17531 53157 61629 86704 86332 83637 90286 84288 75260 33655 24142 51208 42392 11499 -1344
17518 -1344 15082 35592 69430 43824 9786 24029 51538 51568 39622 32087 17455 25130 52544
17505 52544 81484 101532 95139 123282 99737 72181 69967 88244 115876 95242 76238 105860
17493 105860 81942 51412 56836 74772 83901 87861 60850 40174 46173 61188 63229 73478
17481 73478 80904 95599 95402 124914 127100 112065 118431 134037 97636 71775 76064 37650 18124
$$ packed form
17568C1893R410J6244J5499k2213K2808J55k4966j5875J1693L0338J0929p233
17556G8682k9329j1538K8953J5239j6722j9257j2767k0072n430K1830J1419l604
17544C7404j8972K346J026K0377J4490J3472J1270j3615j3853j1903Q343n38L310
17531E3157Q472K5075l72k695O649n998r028m1605r513K7066q816l0893j2843
17518a344J6426K0510L3838k5606l4038J4243K7509L0j1946p535j4632P675K7414
17505E2544K8940K0048o393K8143k3545k7556k214J8277K7632k0634j9004K9622
17493A05860k3918l0530N424J7936R129L960k7011k0676N999J5015K041J0249
17481G3478P426J4695j97K9512K186j5035O366J5606l6401k5861M289l8414j9526
$$ plain form
17468 18124 -732 13588 52861 65080 71787 119422 132573 92356 69490 69729 77515 86126 97457
17455 97457 122851 106672 86718 61441 60389 57379 34269 29105 40439 48443 64988 112780
17443 112780 148302 168972 213633 353336 440552 442634 414754 364122 349672 385426 390951 357202
17431 357202 295767 240001 195503 174975 142079 149341 224616 273679 354300 420411 406351 347768
17419 347768 268523 217876 212551 217463 282727 339420 416700 504519 514021 465400 382122 283449
17407 283449 235935 242666 248985 271559 296094 334013 422816 457142 445564 388099 310692 249196
17395 249196 219101 176412 143743 137741 147021 172913 158579 149320 146631 139793 116412 146152
17383 146152 176966 161980 154610 132493 109026 83917 87439 98563 111350 104405 84520 83220
$$ packed form
17468A8124j8856J4320L9273J2219O707M7635J3151m0217k2866K39P786Q611J1331
17455I7457K5394j6179j9954k5277j052l010k3110n164J1334Q004J6545M7792
17443A12780L5522K0670M4661J39703Q7216K082k7880n0632j4450L5754N525l3749
17431C57202o1435n5766m4498k0528l2896P262P5275M9063Q0621O6111j4060n8583
17419C47768p9245n0647n325M912O5264N6693P7280Q7819R502m8621q3278r8673
17407B83449m7514O731O319K2574K4535L7919Q8803L4326j1578n7465p7407o1496
17395B49196l0095m2689l2669o002R280K5892j4334r259k689o838k3381K9740
17383A46152L0814j4986p370k2117k3467k5109L522J1124J2787o945j9885j300
$$ plain form
17371 83220 97467 88621 86738 59688 62016 78757 50095 33765 55657 96465 105788 111681 137901
17358 137901 164873 140951 109457 102381 110677 143052 160019 142347 140411 164602 130248 89938
17346 89938 76219 87770 92072 76245 59805 57299 61177 78843 89768 109860 122366 92072
17334 92072 60139 111969 159403 158488 139324 111658 97729 83004 81476 64495 40864 83534
17322 83534 100206 117202 119442 91846 107213 117808 109580 103091 118322 109547 97430 116733
17310 116733 168990 208677 240969 262756 261365 263690 280204 278153 279530 264033 258627 272442
17298 272442 265231 241274 234868 222662 228960 288390 346542 411527 506813 620541 790068 1053040
17286 1053040 1497708 2296088 3784703 5868118 7171460 7127385 6251740 4724409 3215935
$$ packed form
17371H3220J4247q846j883k7050K328J6741k8662j6330K1892M0808R323N893K6220
17358A37901K6972k3922l1494p076Q296L2375J6967j7672j936K4191l4354m0310
17346H9938j3719J1551M302j5827j6440k506L878J7666J0925K0092J2506l0294
17334I2072l1933N1830M7434r15j9164k7666j3929j4725j528j6981k3631M2670
17322H3534J6672J6996K240k7596J5367J0595q228o489J5231q775j2117J9303
17310A16733N2257L9687L2292K1787j391K325J6514k051J377j5497n406J3815
17298B72442p211k3957o406j2206O298N9430N8152O4985R5286J13728J69527K62972
17286A053040M44668P98380J488615K083415J303342m4075q75645j527331j508474
$$ plain form
17277 3215935 2188606 1576075 1219593 948915 788260 676097 563374 488300 421145 395925
17267 395925 377537 362031 378780 390522 362677 374285 387293 370450 368554 376861 382047 395469
17255 395469 353483 300283 284196 286511 267675 255402 281134 308035 283938 286771 288390 261703
17243 261703 233567 251387 272012 253273 218994 203332 206382 202866 226026 251258 224829 218073
17231 218073 207898 191689 219537 257408 263895 265183 263089 263409 267689 308550 339044 331914 326156
17218 326156 337133 341634 322134 322750 315548 309416 332710 343220 347989 363768 341801 343692 355870
17205 355870 384729 414701 413040 422864 418455 424495 476150 505536 531594 548599 583074 608984
17193 608984 644344 748235 864922 994334 1074904 1125393 1269166 1437950 1509767 1505717 1513614
$$ packed form
17277C215935j027329o12531l56482k70678j60655j12163j12723p5074o7155k5220
17267C95925j8388j5506J6749J1742k7845J1608J3008j6843j896Q307N186J3422
17255C95469m1986n3200j6087K315j8836j2273K5732K6901k4097K833J619k6687
17243B61703k8136J7820K0625j8739l4279j5662L050l516K3160K5232k6429o756
17231B18073j0175j6209K7848L7871O487J288k094L20M280M0861L0494p130n758
17218C26156J0977M501j9500O16p202o132K3294J0510M769J5779k1967J891J2178
17205C55870K8859K9972j661R824m409O040N1655K9386K6058J7005L4475K5910
17193F08984L5360J03891J16687J29412Q0570N0489J43773J68784P1817m050P897
$$ plain form
17182 1513614 1556231 1660898 1734164 1781682 1852877 1953873 2058372 2227305 2439960 2769384
17172 2769384 3236668 3808108 4526549 5425052 6631592 8444910 11402153 16558430 25876491
17163 25876491 40815349 55820909 62930470 64739157 65141788 67725190 70655972 67466112
17155 67466112 59246025 47151998 34074457 24411729 18644390 15408492 13616337 12713617
17147 12713617 12587730 13340823 15241298 19105411 26643801 40468264 59007808 71856254
17139 71856254 75687253 75896160 76555902 80367013 80250146 72909584 60863976 45299283
17131 45299283 31427590 22225736 16640294 13140886 10790075 9087200 7807362 6824177
17123 6824177 6050102 5361657 4712756 4145467 3658545 3324706 3085171 2865353 2655200
$$ packed form
17182A513614M2617J04667P3266M7518P1195J00996J04499J68933K12655L29424
17172B769384M67284N71440P18441Q98503J206540J813318K957243N156277R318061
17163B5876491J4938858J5005560P109561J808687M02631K583402K930782l189860
17155F7466112q220087j2094027j3077541r662728n767339l235898j792155r02720
17147A2713617j25887P53093J900475L864113P538390J3824463J8539544J2848446
17139G1856254L830999K08907O59742L811111j16867p340562j2045608j5564693
17131D5299283j3871693r201854n585442l499408k350811j702875j279838r83185
17123F824177p74075o88445o48901n67289m86922l33839k39535k19818k10153
$$ plain form
17114 2655200 2513262 2430151 2341164 2207762 2113708 2053678 1974947 1878843 1777956 1684474 1605198
17103 1605198 1517133 1404831 1268931 1152791 1041123 934931 846347 772150 723840 698605
17093 698605 639700 603749 572502 590742 564813 514209 446743 389848 385204 382864 360945 358144
17081 358144 345275 310397 280269 276695 296847 291899 256368 212487 187795 191334 199090 209810
17069 209810 221409 207517 186160 206176 235025 243089 258573 236673 214737 201656 192573 195713
17057 195713 169940 167728 174040 187949 159161 145145 139675 152590 181065 195082 213032 212210
17045 212210 231329 232049 200049 165203 108121 105426 135365 145877 110576 123101 109303 111907
17033 111907 125973 118637 112949 107902 117531 89359 80497 95424 113578 98487 79657 137089
$$ packed form
17114B655200j41938q3111q8987j33402r4054o0030p8731r6104j00887r3482p9276
17103A605198q8065j12302j35900j16140j11668j06192q8584p4197m8310k5235
17093F98605n8905l5951l1247J8240k5929n0604o7466n6895m644k340k1919k801
17081C58144j2869l4878l0128l574K0152m948l5531m3881k4692L539P756J0720
17069B09810J1599j3892k1357K0016K8849Q064J5484k1900k1936j3081r083L140
17057A95713k5773k212O312J3909k8788j4016n470J2915K8475J4017J7950q22
17045B12210J9119P20l2000l4846n7082k695K9939J0512l5301J2525j3798K604
17033A11907J4066p336n688n047R629k8172q862J4927J8154j5091j8830N7432
$$ plain form
17021 137089 126177 117422 119379 127677 129245 119165 97896 83719 90154 92493 88843 122867 166303
17008 166303 180827 184179 177445 148329 112703 104425 100395 150269 169074 176457 183403 170161 155447
16995 155447 153551 155493 155373 156098 138523 123734 105465 110597 159868 182215 187036 216709 199422
16982 199422 199498 207921 182780 143260 145982 163954 168519 175566 126752 111942 155966 173719 172679
16969 172679 126252 116799 127078 137065 146913 161499 173849 170252 167474 150935 134217 111198
16957 111198 109726 162938 170853 169054 188781 195510 208909 207063 212673 208948 202392 218384 207094
16944 207094 195080 211523 261275 262808 266050 256331 252109 253202 297606 315602 300793 285644
16932 285644 289522 304983 310708 328823 340185 365809 374200 393477 427157 432665 422765 465868
$$ packed form
17021A37089j0912q755J957Q298J568j0080k1269j4177O435K339l650L4024M3436
17008A66303J4524L352o734k9116l5626q278m030M9874J8805P383O946j3242j4714
16995A55447j896J942j20P25j7575j4789j8269N132M9271K2347M821K9673j7287
16982A99422P6Q423k5141l9520K722J7972M565P047m8814j4810M4024J7753j040
16969A72679m6427r453J0279R987R848J4586J2350l597k778j6539j6718k3019
16957A11198j472N3212P915j799J9727O729J3399j846N610l725o556J5992j1290
16944B07094j2014J6443M9752J533L242r719m222J093M4404J7996j4809j5149
16932B85644L878J5461N725J8115J1362K5624Q391J9277L3680N508r900M3103
$$ plain form
16920 465868 465937 478990 467577 456409 493810 559769 668069 807938 883114 907725 901933 865500
16908 865500 851437 883343 950323 1065100 1234745 1408434 1586765 1716322 1735517 1734464 1718210
16897 1718210 1765288 1935162 2185529 2532858 2941909 3391619 3817598 4275345 4862119 5733281
16887 5733281 7156411 9630139 14058591 22486591 38229101 57793269 65465318 63000811
16879 63000811 54088186 39942232 28630543 22373296 19923122 20553949 24777491 34786039
16871 34786039 52168985 66466462 67244464 61248039 48938838 35488990 27240257 24179053
16863 24179053 25806276 33543804 48332480 60037039 60041610 54417735 43106691 30968761
16855 30968761 23124883 19159772 18040323 19679810 25155529 37048759 52654751 58294438
$$ packed form
16920D65868O9J3053j1413j1168L7401O5959J08300J39869P5176K4611n792l6433
16908H65500j4063L1906O6980J14777J69645J73689J78331J29557J9195j053j6254
16897A718210M7078J69874K50367L47329M09051M49710M25979M57747N86774Q71162
16887E733281J423130K473728M428452Q428000J5742510J9564168P672049k464507
16879F3000811q912625j4145954j1311689o257247k450174O30827M223542J0008548
16871C4786039J7382946J4297477P78002n996425j2309201j3449848q248733l061204
16863B4179053J627223P737528J4788676J1704559M571n623875j1311044j2137930
16855C0968761p843878l965111j119449J639487N475719J1893230J5605992N639687
$$ plain form
16847 58294438 54917215 46243691 32951780 22009053 15310134 11313269 8837356 7217201
16839 7217201 6138537 5397912 4865814 4492678 4128907 3715705 3301788 2925877 2565476
16830 2565476 2260735 2063115 1940122 1915548 1882770 1856647 1783099 1620013 1433383 1239393
16820 1239393 1088209 996374 921806 843034 788521 827737 898108 920495 877948 804254 705162
16809 705162 598852 517270 455221 420626 371896 347824 346703 325408 313561 278294 241301
16798 241301 236121 262068 277194 254282 219136 164658 150267 155907 172397 184863 180743 181163
16786 181163 167393 99345 56930 51685 81802 112039 131960 118654 110138 114623 116303 83141
16774 83141 68969 54378 33840 29155 41560 43520 61550 70936 88599 111703 66690 12541
$$ packed form
16847E8294438l377223q673524j3291911j0942727o698919l996865k475913j620155
16839G217201j078664p40625n32098l73136l63771m13202m13917l75911l60401
16830B565476l04741j97620j22993k4574l2778k6123p3548j63086j86630j93990
16820A239393j51184r1835p4568p8772n4513L9216P0371K2387m2547p3694r9092
16809G05162j06310q1582o2049l4595m8730k4072j121k1295j1847l5267l6993
16798B41301n180K5947J5126k2912l5146n4478j4391N640J6490J2466m120M20
16786A81163j3770o8048m2415n245L0117L0237J9921j3306q516M485J680l3162
16774H3141j4172j4591k0538m685J2405J960J8030R386J7663K3104m5013n4149
$$ plain form
16762 12541 6787 6060 21913 31899 28671 37828 53741 64695 43283 13735 4470 26568 852
16749 852 -15225 -21840 31161 57176 26393 24823 32707 45722 36806 68693 94341 93617 58737
16736 58737 29640 18215 32998 40918 46713 44977 23074 22176 44664 51328 57327 47926 33034
16723 33034 39693 49871 33264 1711 -9317 18009 35399 14425 -4440 -5909 -23960 -38621
16711 -38621 -52124 -74691 -57743 -32489 8165 42699 62908 47687 16166 7492 -7712 -31273
16699 -31273 -20246 -17052 -8914 25954 45196 83675 67921 14512 1490 6623 -6824 -14635
16687 -14635 -41059 -41999 -26328 -14718 -17737 -12003 6090 8418 -3478 -15787 -12897 -2914 -23793
16674 -23793 -26631 -32013 -48942 -57058 -54312 -55812 -41910 -15137 9242 14359 8741 27618 21304
$$ packed form
16762A2541n754p27J5853R986l228R157J5913J0954k1412k9548r265K2098k5716
16749H52j6077o615N3001K6015l0783j570P884J3015q916L1887K5648p24l4880
16736E8737k9097j1425J4783P920N795j736k1903q98K2488O664N999r401j4892
16723C3034O659J0178j6607l1553j1028K7326J7390k0974j8865j469j8051j4661
16711c8621j3503k2567J6948K5254M0654L4534K0209j5221l1521q674j5204k3561
16699c1273J1027L194Q138L4868J9242L8479j5754n3409j3022N133j3447p811
16687a4635k6424r40J5671J1610l019N734J8093K328j1896j2309K890R983k0879
16674b3793k838n382j6929q116K746j500J3902K6773K4379N117n618J8877o314
$$ plain form
16661 21304 -1409 3521 -3679 -15764 -29535 -16545 -11151 -7916 -12425 -19947 -18886 -10868 889
16648 889 21001 33879 36137 10421 3105 19035 7691 -1115 -12830 -23080 -8443 7943 -6573
16635 -6573 9366 -5697 6372 29284 33471 57209 37476 20525 22516 14221 -16705 -8431 -22203
16622 -22203 -42430 9148 230 12254 40815 22270 34012 45479 30223 29523 30139 33701 68814
16609 68814 172241 311672 405251 429295 399343 404007 426178 446452 433853 352070 232658
16598 232658 162161 126515 85459 58709 79066 72264 71470 74866 125536 160380 220329 290099
16586 290099 368895 393341 371986 357354 363217 370635 323487 271575 203758 113028 67500 68288
16574 68288 74153 50086 61296 85326 84545 57373 26938 -7182 -19454 19376 38550 14969
$$ packed form
16661B1304k2713M930p200j2085j3771J2990N394L235m509p522J061Q018J1757
16648H89K0112J2878K258k5716p316J5930j1344q806j1715j0250J4637J6386j4516
16635f573J5939j5063J2069K2912M187K3738j9733j6951J991q295l0926Q274j3772
16622b2203k0227N1578q918J2024K8561j8545J1742J1467j5256p00O16L562L5113
16609F8814J03427J39431R3579K4044k9952M664K2171K0274j2599q1783j19412
16598B32658p0497l5646m1056k6750K0357o802p94L396N0670L4844N9949O9770
16586B90099P8796K4446k1355j4632N863P418m7148n1912o7817r0730m5528P88
16574F8288N865k4067J1210K4030p81k7172l0435l4120j2272L8830J9174k3581
$$ plain form
16562 14969 8898 2748 -9727 1153 47819 46624 58482 42211 10138 25400 27690 26228 20437
16549 20437 2297 4520 9583 30910 6516 2773 10393 -15168 -57829 -40068 4414 -5070 6139
16536 6139 9373 21237 -457 -48015 -51471 -31615 -44489 -50230 -70200 -71817 -74564 -61962 -40487
16523 -40487 -4941 -17096 -26985 -25500 -43891 -21875 -28654 -24381 18761 4950 -27866 -40065
16511 -40065 -76959 -74798 -51927 -45055 -23948 -41564 -48910 -4522 40779 45208 35392 470 -3033
16498 -3033 -25479 -11147 34663 27305 50448 60279 43405 15101 9590 4913 -3779 22531 33898
16485 33898 3381 -15184 -18391 -4190 26776 13021 -9998 -17758 -27006 -42148 -17126 -27180
16473 -27180 -30087 -8057 -17839 -57275 -69461 -45931 -39796 -43651 -44835 -13016 11072 23526 12436
$$ packed form
16562A4969o071o150j2475J0880M6666j195J1858j6271l2073J5262K290j462n791
16549B0437j8140K223N063K1327k4394l743P620k5561m2661J7761M4482r484J1209
16536F139L234J1864k1694m7558l456J9856j2874n741j9970j617k747J2602K1475
16523d0487L5546j2155r889J485j8391K2016o779M273M3142j3811l2816j2199
16511d0065l6894K161K2871O872K1107j7616p346M4388M5301M429r816l4922l503
16498c033k2446J4332M5810p358K3143R831j6874k8304n511m677q692K6310J1367
16485C3898l0517j8565l207J4201L0966j3755k3019p760r248j5142K5022j0054
16473b7180k907K2030r782l9436j2186K3530O135l855j184L1819K4088J2454j1090
$$ plain form
16460 12436 700 9238 5338 -32016 -2048 2098 5642 11977 22 -21396 -30992 -19117 -10116
16447 -10116 -8438 15473 41972 20249 17427 24824 21874 13729 21784 -796 -9746 20588 53790
16434 53790 43571 28234 8624 -23156 -30427 -35976 -44590 -42134 -56147 -31709 -27546 -50600 -63919
16421 -63919 -67722 -47633 -30721 -35806 -14898 13781 26643 45511 28233 19640 -9513 -29718
16409 -29718 -19532 3449 974 -2103 5737 9915 14577 27608 5206 -23678 -27928 -36319 -26283
16396 -26283 -5320 25255 43112 17449 -24522 -47998 -42831 -15717 -35130 -54808 -39735 -25327
16384 -25327 -53426 -68136 -49236 817 -29953 -33154 -10842 -31027 -54968 -83311 -71031 -48536
16372 -48536 -38807 -45210 -67113 -52978 -43581 -43434 -16225 -9883 -22678 -27893 6408 37881 40924
$$ packed form
16460A2436j1736Q538l900l7354K9968M146L544O335j1955k1418r596J1875R001
16447a0116J678K3911K6499k1723k822P397k950q145Q055k2580q950L0334L3202
16434E3790j0219j5337j9610l1780p271n549q614K456j4013K4438M163k3054j3319
16421f3919l803K0089J6912n085K0908K8679J2862J8868j7278q593k9153k0205
16409b9718J0186K2981k475l077P840M178M662J3031k2402k8884m250q391J0036
16396b6283K0963L0575J7857k5663m1971k3476N167K7114j9413j9678J5073J4408
16384b5327k8099j4710J8900N0053l0770l201K2312k0185k3941k8343J2280K2495
16372d8536R729o403k1903J4135R397J47K7209O342j2795n215L4301L1473L043
$$ plain form
16359 40924 12407 21141 14684 11168 18112 15939 14657 4972 12488 34219 42448 34803 -13319 -21842
16345 -21842 -39378 -19448 450 30599 34781 17824 12802 26619 29634 14123 21862 38214
16333 38214 43891 31658 38095 42566 33230 35386 54213 64094 118154 217987 285875 285511 210720
16320 210720 135525 118903 118224 98676 73095 81271 123260 209335 271337 292419 287626 248353
16308 248353 173817 129492 124889 126131 144608 202295 239185 249304 289092 286193 233055 163507
16296 163507 119524 109402 128058 164956 207316 272052 337727 317056 245858 175351 85376
16285 85376 62948 48303 40413 19060 5369 -1967 -10296 -20156 -31239 -32750 -24233 -1983 10685
16272 10685 7432 27632 65593 49892 41429 34129 27331 9282 3239 -33806 -45994 -29403 -22263
$$ packed form
16359D0924k8517Q734o457l516O944k173j282r685P516K1731Q229p645m8122q523
16345b1842j7536J9930J9898L0149M182j6957n022J3817L015j5511P739J6352
16333C8214N677j2233O437M471r336K156J8827R881N4060R9833O7888l64p4791
16320B10720p5195j6622o79j9548k5581Q176M1989Q6075O2002K1082m793l9273
16308B48353p4536m4325m603J242J8477N7687L6890J0119L9788k899n3138o9548
16296A63507m3983j0122J8656L6898M2360O4736O5675k0671p1198p0507q9975
16285H5376k2428j4645p890k1353j3691p336q329r860j1083j511Q517K2250J2668
16272A0685l253K0200L7961j5701q463p300o798j8049o043l7045j2188J6591P140
$$ plain form
16259 -22263 -5266 -25806 -40620 -36428 -24237 -32505 -17997 16194 34320 19440 -13595 -977
16247 -977 -9028 -3044 -18461 -34360 -33779 -60385 -56536 -32934 -13725 13905 -4864 2710 11012
16234 11012 25295 42190 12027 -13181 -37872 -33950 -36299 -12275 10993 10983 23507 6781 -24215
16221 -24215 -47271 -50347 -36115 -38399 -45541 -56584 -37941 9529 14322 -16592 -31376 -31530 -60477
16208 -60477 -57863 -11541 12192 -16132 -17955 -6690 -7326 -20066 -21957 -25645 -35376 -25717 -30243
16195 -30243 -45236 -76809 -83316 -70003 -58619 -50280 -44403 -15399 -10557 -28526 -42042 -39987 -28494
16182 -28494 -2587 767 -19603 -27511 -40483 -26887 -51464 -71922 -40295 -26454 -30184 -45994
16170 -45994 -29549 -26060 -46673 -44044 -14705 -15706 -19606 -24081 -25318 -2213 -1981 -44748 -63706
$$ packed form
16259b2263J6997k0540j4814M192J2191q268J4508L4191J8126j4880l3035J2618
16247i77q051N984j5417j5899N81k6606L849K3602J9209K7630j8769P574Q302
16234A1012J4283J6895l0163k5208k4691L922k349K4024K3268j0J2524j6726l0996
16221b4215k3056l076J4232k284p142j1043J8643M7470M793l0914j4784j54k8947
16208f0477K614M6322K3733k8324j823J1265o36j2740j891l688r731R659m526
16195c0243j4993l1573o507J3313J1384Q339N877K9004M842j7969j3516K055J1493
16182b8494K5907L354k0370p908j2972J3596k4577k0458L1627J3841l730j5810
16170d5994J6445L489k0613K629K9339j001l900m475j237K3105K32m2767j8958
$$ plain form
16157 -63706 -52889 -30147 4508 28675 7959 12627 179 3603 -8937 -27154 -34546 -22858
16145 -22858 -5793 24586 31095 14675 15675 10529 17929 21327 45400 46326 48166 42545 29385
16132 29385 -549 3313 21474 16394 7860 9516 -6650 -16360 -10457 13242 -206 -56440 -53015
16119 -53015 -34766 -31701 -58769 -38648 -37905 -41425 -42710 -50176 -65537 -54105 -58943 -40540 -25189
16106 -25189 -30490 -5678 17024 13255 1358 -5675 -20338 4445 21049 12492 12858 9267 -24203
16093 -24203 -43929 -22971 1107 17431 -7367 -17224 3767 12355 22677 27573 28888 23578 -10587
16080 -10587 -22500 -44530 -39657 -9242 -16012 -9537 14452 29871 19531 -28056 -32981 -25504 -43821
16067 -43821 -42247 4241 -4284 -10775 -3988 -21464 -19231 1273 -9482 -27634 -40478 -33314 -7446
$$ packed form
16157f3706J0817K2742L4655K4167k0716M668j2448L424j2540j8217p392J1688
16145b2858J7065L0379O509j6420J000n146P400L398K4073R26J840n621j3160
16132B9385k9934L862J8161n080q534J656j6166r710N903K3699j3448n6234L425
16119e3015J8249L065k7068K0121P43l520j285p466j5361J1432m838J8403J5351
16106b5189n301K4812K2702l769j1897p033j4663K4783J6604q557L66l591l3470
16093b4203j9726K0958K4078J6324k4798r857K0991Q588J0322M896J315n310l4165
16080a0587j1913k2030M873L0415o770O475K3989J5419j0340m7587m925P477j8317
16067d3821J574M6488q525o491O787j7476K233K0504j0755j8152j2844P164K5868
$$ plain form
16054 -7446 -5128 4954 23305 14110 -30301 -37022 -8462 10368 20654 34387 44826 14217
16042 14217 -22596 -45661 -41848 -72131 -78541 -45250 -36039 -41019 -58050 -31078 -24699 4543 5913
16029 5913 -16429 -9529 26135 35083 18245 18784 5737 -19212 -24570 5843 16553 8656 -6260
16016 -6260 -5891 -5798 4856 -25761 -8382 -7371 -891 2230 10022 35689 34135 35804 42335 57953
16002 57953 56932 10033 22311 18980 12847 -16880 -54710 -25500 -11326 -8522 -696 8923 -1818
15989 -1818 8907 12105 14040 4565 -18620 -35743 -51173 -40710 -26712 -21067 1731 -12535 -32347
15976 -32347 2010 -5463 -19924 -16848 -23153 -1233 -25009 -38754 -29962 -21461 -4870 1357 -7542
15963 -7542 10295 41470 10269 -13503 -9223 -19525 5261 5938 32646 52981 48029 61982 40528
$$ packed form
16054g446K318J0082J8351r195m4411o721K8560J8830J0286J3733J0439l0609
16042A4217l6813k3065L813l0283o410L3291R211m980j7031K6972O379K9242J370
16029E913k2342O900L5664Q948j6838N39j3047k4949n358L0413J0710p897j4916
16016f260L69R3J0654l0617J7379J011O480L121P792K5667j554J669O531J5618
16002E7953j021m6899J2278l331o133k9727l7830K9210J4174K804P826R619j0741
15989a818J0725L198J935r475k3185j7123j5430J0463J3998N645K2798j4266j9812
15976c2347L4357p473j4461L076o305K1920k3776j3745Q792Q501J6591O227q899
15963g542J7837L1175l1201k3772M280j0302K4786O77K6708K0335m952J3953k1454
$$ plain form
15950 40528 37707 28807 -8936 -37628 -39197 -42958 -44880 -34431 664 3469 3046 -19425 -15909
15937 -15909 -42940 -38234 -29627 -25573 -5596 1417 1438 -30668 -32202 -9763 -11525 52 19509
15924 19509 4631 3441 24466 43722 29366 20383 10829 -13478 -2573 -2937 -8033 -8920 12463
15911 12463 21446 19383 50558 37690 -1611 -43246 -57951 -34360 -15399 -3235 7241 -1032
15899 -1032 -49421 -31107 -31750 -42413 -40632 -15194 -12197 -28723 -33430 -36259 -37271 -44235 -72981
15886 -72981 -63786 -30842 3514 901 20758 31189 24415 46656 38186 11930 -18346 -19611 -12207
15873 -12207 -37596 -14347 -5981 -5481 -21591 -15573 -27985 -46172 -54961 -16911 24772 36496 30782
15860 30782 25511 33381 9097 7092 -5079 4580 -5138 -7283 12797 36070 35684 943 -40157
$$ packed form
15950D0528k821q900l7743k8692j569l761j922J0449L5095K805m23k2471L516
15937a5909k7031M706Q607M054J9977P013K1l2106j534K2439j762J1577J9457
15924A9509j4878j190K1025J9256j4356q983r554k4307J0905l64n096q87K1383
15911A2463Q983k063L1175j2868l9301m1635j4705K3591J8961J2164J0476q273
15899a032m8389J8314o43j0663J781K5438K997j6526m707k829j012o964k8746
15886g2981R195L2944L4356k613J9857J0431o774K2241q470k6256l0276j265P404
15873a2207k5389K3249Q366N00j6110O018j2412j8187q789L8050M1683J1724n714
15860C0782n271P870k4284k005j2171R659r718k145K0080K3273l86l4741m1100
$$ plain form
15847 -40157 -40821 -8866 -9788 -30432 -40946 -40429 -41499 -14389 -9283 -24618 -48492 -48045 -38667 -39740
15833 -39740 -32535 -5001 20158 -1050 -40731 -54684 -48705 -39863 -15035 21708 11263 4285
15821 4285 9961 -9402 -12082 -10889 -12955 -13693 14637 13112 13683 -3571 -29348 -45009 -49752 -653
15807 -653 27717 21390 1071 -16778 6502 16553 17940 15200 -1671 -4229 14611 33803 26670
15794 26670 11825 7283 -6389 -13796 -17584 14320 33733 10342 -8807 7423 3689 18133
15782 18133 25875 11541 -11598 -19612 -12496 -10050 10177 2207 -7495 786 -10644 -33746 -55883
15769 -55883 -58717 -43199 -28048 -25729 -23470 3231 51539 62961 53841 29287 23887 20084 17481
15756 17481 -10965 -34694 -26982 -8335 -4610 -5772 -20971 -28173 -42873 -36085 -27414 17875 26640
$$ packed form
15847d0157o64L1955r22k0644j0514N17j070K7110N106j5335k3874M47R378j073
15833c9740P205K7534K5159k1208l9681j3953N979Q842K4828L6743j0445o978
15821D285N676j9363k680J193k066p38K8330j525N71j7254k5777j5661m743M9099
15807f53K8370o327k0319j7849K3280J0051J387k740j6871k558J8840J9192p133
15794B6670j4845m542j3672p407l788L1904J9413k3391j9149J6230l734J4444
15782A8133P742j4334k3139q014P116K446K0227p970r702Q281j1430k3102k2137
15769e5883k834J5518J5151K319K259K6701M8308J1422r120k4554n400l803k603
15756A7481k8446k3729P712J8647L725j162j5199p202j4700O788Q671M5289Q765
$$ plain form
15743 26640 -14778 -9991 10129 -15542 -25830 -32811 -18070 -51964 -48525 -51198 -53612 -13610 18372
15730 18372 12215 2077 -12359 -19728 -6384 23370 56537 67268 7662 -16902 -25712 -14768
15718 -14768 -52 -23185 -20479 -8324 -31132 -16457 -3361 -19261 -42843 -55956 -45694 -11187
15706 -11187 -14014 -38416 -26815 -21412 -31756 -37160 -62567 -75958 -84546 -41108 -9871 -6183 -12586
15693 -12586 -25984 -110 -30429 -65658 -74074 -31681 -4581 -10972 -61 19880 8003 -25610
15681 -25610 -5148 -4215 -18555 -7088 6287 -11592 2071 -2065 -2316 35310 54087 78939 79952
15668 79952 62907 22318 3789 19785 27809 25320 -1451 -9266 -5813 10700 -6662 -6895 4267
15655 4267 -11875 -39488 -36689 -21234 -33426 -48549 -34519 -30349 -18602 -12063 -8081 635 35285
$$ packed form
15743B6640m1418M787K0120k5671j0288o981J4741l3894L439k673k414M0002L1982
15730A8372o157j0138j4436p369J3344K9754L3167J0731n9606k4564q810J0944
15718a4768J4716k3133K706J2155k2808J4675J3096j5900k3582j3113J0262L4507
15706a1187k827k4402J1601N403j0344n404k5407j3391q588M3438L1237L688o403
15693a2586j3398K5874l0319l5229q416M2393K7100o391J0911J9941j1877l3613
15681b5610K0462R33j4340J1467J3375j7879J3663m136k51L7626J8777K4852J013
15668G9952j7045m0589j8529J5996Q024k489k6771p815L453J6513j7362k33J1162
15655D267j6142k7613K799J5455j2192j5123J4030M170J1747O539L982Q716L4650
$$ plain form
15642 35285 75070 56389 35327 20812 20861 1797 -16250 -10776 1274 14109 8265 720 2912
15629 2912 -7012 23163 16165 -13637 10279 -4493 -13866 -25716 -58009 -70588 -58940 -64423 -27505
15616 -27505 3902 -14951 -69725 -56848 -29666 -22158 -33391 -21323 -5719 12366 17824 19358
15604 19358 13548 -3331 -18516 4378 -2270 -2741 -14665 -33292 -20448 731 25261 20226 575
15591 575 -18107 -10839 6434 -5225 -20043 -37093 -35543 -44186 -39229 -41595 -35988 -41872 -38500 -80531
15577 -80531 -69013 -46350 -32665 -16860 -7138 -13704 -7760 -14402 -24598 -11483 24411 33818 4590
15564 4590 -19992 -35455 -50305 -69607 -46508 -46134 -8833 2155 194 8217 21067 39432 21391
15551 21391 -14422 -10501 -268 -13292 -3101 1149 -16541 908 26085 31901 12058 10145
$$ packed form
15642C5285L9785j8681k1062j4515M9j9064j8047N474J2050J2835n844p545K192
15629B912r924L0175o998k9802K3916j4772r373j1850l2293j2579J1648n483L6918
15616b7505L1407j8853n4774J2877K7182P508j1233J2068J5604J8085N458J534
15604A9358n810j6879j5185K2894o648m71j1924j8627J2844K1179K4530n035j9651
15591E75j8682P268J7273j1659j4818j7050J550q643M957k366N607n884L372m2031
15577h0531J1518K2663J3685J5805R722o566N944o642j0196J3115L5894R407k9228
15564D590k4582j5463j4850j9302K3099L74L7301J0988j961Q023J2850J8365j8041
15551B1391l5813L921J0233j3024J0191M250j7690J7449K5177N816j9843j913
$$ plain form
15539 10145 9925 -7281 3411 17172 19626 16236 3029 -25572 -9515 -15287 -14461 -31790 -34068
15526 -34068 -61205 -75202 -44391 -20909 -853 19678 48769 37831 14711 12442 56766 55265
15514 55265 30117 11779 17772 7061 11617 34897 47771 44901 28644 24023 46333 51667 77524
15501 77524 57306 36899 27866 14471 18507 11235 -31476 -39253 -14779 -18479 -30785 -17392 -2998
15488 -2998 13121 -2845 -26169 -22325 -1710 -2547 -22419 7545 10462 4771 -14511 -10816 529
15475 529 -4382 -11047 -2373 -19283 -25336 -21812 -31631 3321 -3293 -10392 -4306 -31452 -29732 -6595
15461 -6595 -10739 -34125 -24985 -16054 -21866 -9342 12014 30661 27935 -9063 -38183 -29440 -24204
15448 -24204 -13260 -22939 -6598 -301 19943 36758 17059 -2707 -9670 -33661 -35018 -21577
$$ packed form
15539A0145k20j7206J0692J3761K454l390j3207k8601J6057n772Q26j7329k278
15526c4068k7137j3997L0811K3482K0056K0531K9091j0938k3120k269M4324j501
15514E5265k5148j8338N993j0711M556K3280J2874k870j6257m621K2310N334K5857
15501G7524k0218k0407r033j3395M036p272m2711p777K4474l700j2306J3393J4394
15488b998J6119j5966k3324L844K0615q37j9872K9964K917n691j9282L695J1345
15475E29m911o665Q674j6910o053L524r819L4952o614p099O086k7146J720K3137
15461f595m144k3386R140Q931n812J2524K1356J8647k726l6998k9120Q743N236
15448b4204J0944r679J6341O297K0244J6815j9699j9766o963k3991j357J3441
$$ plain form
15436 -21577 -21521 -51594 -75421 -31016 -27824 -64498 -39152 5011 32804 20728 -82 3440 18713
15423 18713 23049 28007 35391 32425 25914 15898 -20766 -12795 -1472 24411 5362 -3127 4788
15410 4788 11577 14434 17657 12839 -2112 -24270 -47613 -49573 -27002 -22739 -30523 -34294 7893
15397 7893 19165 47575 42542 24781 17911 31610 40223 41548 46008 31510 15849 12102 -3406
15384 -3406 -14920 -24558 -39109 -36903 -14825 8676 -3628 6887 21910 17495 24001 2911 5861
15371 5861 1907 -6269 -19012 -12890 -32846 -25517 -16600 -38501 -32449 -25890 -4214 -498 -30776
15358 -30776 -25950 -23394 -47728 -43806 -55689 -67504 -39398 131 8710 -6141 2120 2460 6018
15345 6018 -23612 -24784 9318 31463 43848 44612 23045 -790 -511 15946 16750 17832 9710 -924
$$ packed form
15436b1577N6l0073k3827M4405L192l6674K5346M4163K7793j2076k0810L522J5273
15423A8713M336M958P384k966o511j0016l6664P971J1323K5883j9049q489P915
15410D788O789K857L223m818j4951k2158k3343j960K2571M263p784l771M2187
15397G893J1272K8410n033j7761o870J3699Q613J325M460j4498j5661l747j5508
15384c406j1514r638j4551K206K2078K3501j2304J0515J5023m415O506k1090K950
15371E861l954q176j2743O122j9956P329Q917k1901O052O559K1676L716l0278
15358c0776M826K556k4334L922j1883j1815K8106L9529Q579j4851Q261L40L558
15345F018k9630j172L4102K2145J2385P64k1567k3835K79J6457Q04J082q122j0634
$$ plain form
15331 -924 12708 876 -7203 1685 12377 8146 8664 5854 22931 22163 12704 15945 21069 23273
15317 23273 44235 47708 53254 56912 51693 46658 36638 31317 10366 20029 38728 16415 -7085
15304 -7085 5923 -10667 -1488 10396 23359 15189 -25894 -37266 -44309 -27943 6545 5799 6460
15291 6460 10967 -868 -27562 -31899 -23677 -18399 -37581 -33268 -14711 -9353 -8119 11784 25105
15278 25105 33989 11052 4313 -15081 -35477 -32816 -48874 -69032 -88181 -64507 -45176 -54488
15266 -54488 -66242 -64428 -53874 -39560 -31361 4088 28150 24517 31645 28575 37331 36308 23957
15253 23957 -2342 3244 6958 5350 6482 33367 27204 49994 79031 43223 5498 -12202 -15929
15240 -15929 -41763 -38390 -25148 2317 14273 20151 28202 41160 32485 -7834 -18981 -26014 -24501
$$ packed form
15331i24J3632j1832q079Q888J0692m231N18k810J7077p68r459L241N124K204
15317B3273K0962L473N546L658n219n035j0020n321k0951R663J8699k2313k3500
15304g085J3008j6590R179J1884J2963q170m1083j1372p043J6366L4488p46O61
15291F460M507j1835k6694m337Q222N278j9182M313J8557N358J234J9903J3321
15278B5105Q884k2937o739j9394k0396K661j6058k0158j9149K3674J9331r312
15266e4488j1754J814J0554J4314Q199L5449K4062l633P128l070Q756j023j2351
15253B3957k6299N586L714j608J132K6885o163K2790K9037l5808l7725j7700l727
15240a5929k5834L373J3242K7465J1956N878Q051J2958q675m0319j1147p033J513
$$ plain form
15227 -24501 -29807 6939 46087 56033 54924 54028 27762 9645 83 -2494 9736 13991 -6729
15214 -6729 -40496 -47534 -42512 -70665 -68894 -35400 -13807 -3443 -9843 -22500 -19403 -25419 -49989
15201 -49989 -59148 -78624 -84963 -41250 13548 28970 1181 -24520 -8644 5793 26247 -8076
15189 -8076 -44144 -39455 -29701 -3353 8729 -22599 -34268 -15592 -24970 -15145 7788 -4445 -25799
15176 -25799 -12910 -5187 -10680 -33244 -40332 -28043 -27701 -29841 -37179 -29737 -21067 -20299 -5979 19621
15162 19621 18311 -7437 -25876 -13876 -2608 -1003 -16554 -29815 -25238 5945 27660 4814
15150 4814 -10255 24719 50555 29328 27252 -4914 -23758 -39518 -55599 -49946 -40787 -18945
15138 -18945 8713 15776 -5867 -28203 -20353 594 -2693 9984 -23468 -28436 -62986 -81391
$$ packed form
15227b4501n306L6746L9148R946j109q96k6266j8117r562k577J2230M255k0720
15214f729l3767p038N022k8153J771L3494K1593J0364o400j2657L097o016k4570
15201d9989r159j9476o339M3713N4798J5422k7789k5701J5876J4437K0454l4323
15189h076l6068M689R754K6348J2082l1328j1669J8676r378R825K2933j2233k1354
15176b5799J2889P723n493k2564p088J2289L42k140p338P442Q670P68J4320K5600
15162A9621j310k5748j8439J2000J1268J605j5551j3261M577L1183K1715k2846
15150D814j5069L4974K5836k1227k076l2166j8844j5760j6081N653R159K1842
15138a8945K7658P063k1643k2336P850K0947l287J2677l3452m968l4550j8405
$$ plain form
15126 -81391 -81040 -80196 -58214 -46129 -71414 -73183 -37412 1202 13483 16439 48287 79170 85021
15113 85021 71601 61365 24148 35741 56622 2026 -15729 11944 54072 85865 114024 97071
15101 97071 75226 72636 63486 51602 61897 53783 12343 -7507 5084 19731 23784 15673 1562
15088 1562 6298 24089 16996 -6462 11184 27799 37184 29607 16460 21385 28656 59198 58695
15075 58695 22658 -12949 -1754 3179 -15400 -31909 -31409 -28409 -12719 11900 -7488 -12321 -11765
15062 -11765 13000 29239 10030 -15743 -11247 5296 -2963 -1434 13839 -8167 -19389 -12740
15050 -12740 -13490 -22634 -33404 -6507 19240 -3198 -4449 8214 -512 -26479 -2088 -14644 -34202
15037 -34202 3710 3209 -27665 -34236 -60330 -73389 -71904 -26653 21202 42980 39338 36434 27013
$$ packed form
15126h1391L51Q44K1982J2085k5285j769L5771L8614J2281K956L1848L0883N851
15113H5021j3420j0236l7217J1593K0881n4596j7755K7673M2128L1793K8159j6953
15101I7071k1845k590r150j1884J0295q114m1440j9850J2591J4647M053q111j4111
15088A562M736J7791p093k3458J7646J6615R385p577j3147M925P271L0542n03
15075E8695l6037l5607J1195M933j8579j6509N00L000J5690K4619j9388m833N56
15062a1765K4765J6239j9209k5773M496J6543q259J529J5273k2006j1222O649
15050a2740p50r144j0770K6897K5747k2438j251J2663q726k5967K4391j2556j9558
15037c4202L7912n01l0874o571k6094j3059J485M5251M7855K1778l642k904r421
$$ plain form
15024 27013 -1920 -13223 23230 48053 24986 -13980 -28973 -31027 23993 49400 22238 13096
15012 13096 5537 25774 15538 -19657 5147 4570 -4946 -16326 -13759 12070 5935 19475 -1897
14999 -1897 -66902 -85148 -46560 -21248 -8301 -16578 -2640 4711 15097 -15051 -7453 9781
14987 9781 31498 37058 9582 11175 22902 22294 27968 8741 5710 19325 38302 34806 12828
14974 12828 32063 13124 -12488 -32912 -23725 -17030 -20404 14298 52940 48732 45207 62774 89815
14961 89815 93322 82677 73097 38329 19272 37836 67067 58208 36661 -1137 -9057 15816
14949 15816 3474 -33722 -24344 27694 44639 40662 43460 33062 25611 -2092 -15819 -12708 4243
14936 4243 16147 19294 -1407 -10109 -30592 -5569 -14174 -49034 -33940 -10630 26629 25356 -18243
$$ packed form
15024B7013k8933j1303L6453K4823k3067l8966j4993k054N5020K5407k7162r142
15012A3096p559K0237j0236l5195K4804n77r516j1380K567K5829o135J3540k1372
14999a897o5005j8246L8588K5312J2947q277J3938P351J0386l0148P598J7234
14987I781K1717N560k7476J593J1727o08N674j9227l031J3615J8977l496k1978
14974A2828J9235j8939k5612k0424R187O695l374L4702L8642m208l525J7567K7041
14961H9815L507j0645r580l4768j9057J8564K9231q859k1547l7798p920K4873
14949A5816j2342l7196R378N2038J6945l977K798j0398p451k7703j3727L111J6951
14936D243J1904L147k0701q702k0483K5023q605l4860J5094K3310L7259j273m3599
$$ plain form
14923 -18243 -53763 -64214 -44909 -34716 -32003 -23761 -388 -8510 -28654 -8022 21917 52109
14911 52109 60895 36088 18598 10813 2415 -18512 -28328 -27617 -5340 -5076 -18509 -35452 -18157
14898 -18157 18175 513 -34383 -21663 -12662 -27722 -18919 2072 29848 49633 51296 24952
14886 24952 36510 78012 78213 46166 17931 13941 -874 -37615 -33978 -17155 -12875 -4601 -14488
14873 -14488 -26821 -23699 -30287 -10528 9333 -3322 -13773 -15972 1807 10988 -27459 -31665 -1066
14860 -1066 -6850 15909 27090 34066 57731 45769 43252 43976 48216 41960 47434 31900 16066
14847 16066 282 23339 20324 2669 28978 46469 36068 36657 34519 18498 6078 -9241
14835 -9241 -57007 -44923 -25327 14716 36045 38400 15317 -10187 -21168 -6936 12966 -17239
$$ packed form
14923a8243l5520j0451J9305J0193K713Q242K3373q122k0144K0632K9939L0192
14911E2109Q786k4807j7490p785q398k0927r816P11K2277K64j3433j6943J7295
14898a8157L6332j7662l4896J2720R001j5060Q803K0991K7776J9785J663k6344
14886B4952J1558M1502K01l2047k8235l990j4815l6741L637J6823M280Q274r887
14873a4488j2333L122o588J9759J9861j2655j0451k199J7779R181l8447m206L0599
14860a066n784K2759J1181O976K3665j1962k517P24M240o256N474j5534j5834
14847A6066j5784K3057l015j7655K6309J7491j0401N89k138j6021j2420j5319
14835i241m7766J2084J9596M0043K1329K355k3083k5504j0981J4232J9902l0205
$$ plain form
14823 -17239 -28342 -16325 -29879 -49307 -31816 20539 35139 38410 22614 10079 10901 13226
14811 13226 34426 31114 14841 -375 806 -2439 -27591 -18021 -13660 3757 5770 -9576 -44951
14798 -44951 -32647 2819 12422 48741 70017 46330 38582 17805 3383 -23666 -39128 1054
14786 1054 13508 22837 18196 -10306 -25907 -26619 -25871 -26366 -2969 -1981 559 5126 -35831 -28750
14772 -28750 14320 27172 13966 1202 -24701 -28023 -34022 -51613 -50560 -3517 17538 32885
14760 32885 30713 27822 3751 8881 6447 -12857 -12421 1768 10908 -2725 2918 1757 7149 2843
14746 2843 10167 20607 16530 -14679 -36842 4371 45878 42367 38775 43565 2234 -25455 -52676
14733 -52676 -48684 -51918 -34236 -35515 -28124 -20782 -32629 -52709 6354 41937 40841 35630 9366
$$ packed form
14823a7239j1103J2017j3554j9428J7491N2355J4600L271j5796j2535Q22K325
14811A3226K1200l312j6273j5216J181l245k5152R570M361J7417K013j5346l5375
14798d4951J2304L5466R603L6319K1276k3687p748k0777j4422k7049j5462M0182
14786A054J2454R329m641k8502j5601p12P48m95K3397R88K540M567m0957P081
14772b8750M3070J2852j3206j2764k5903l322n999j7591J053M7043K1055J5347
14760C2885k172k891k4071N130k434j9304M36J4189R140j3633N643j161N392m306
14746B843P324J0440m077l1209k2163M1213M1507l511l592M790m1331k7689k7221
14733e2676L992l234J7682j279P391P342j1847k0080N9063L5583j096n211k6264
$$ plain form
14720 9366 -5674 708 -773 15709 30944 2728 6289 15852 -2049 5525 10456 -745 -12289
14707 -12289 -20653 -34836 -47983 -35723 -18300 21010 35138 57942 59063 40912 41859 10997
14695 10997 -1256 -19524 19345 43487 33154 569 -11698 -8834 -21333 -15512 -342 11887
14683 11887 10370 15270 -16211 -40552 -20660 -16513 4993 10856 22234 31517 1057 7113 39846
14670 39846 39344 -9477 -7805 15748 18958 42526 21814 14635 442 -20964 -18809 -12532 -16503
14657 -16503 -9232 5853 27454 43788 8863 -23790 12204 15702 -3749 -26212 -38119 -10425
14645 -10425 646 -14244 -38326 -38228 -32078 -25158 -8868 -10893 -5987 -23859 -16524 -23770 -11152
14632 -11152 -17946 -27140 -17722 -7907 16570 -1792 -17298 -32551 -55642 -68849 -46386 11452
$$ packed form
14720I366j5040O382j481J6482J5235k8216L561R563j7901P574M931j1201j1544
14707a2289q364j4183j3147J2260J7423L9310J4128K2804J121j8151R47l0862
14695A0997j2253j8268L8869K4142j0333l2585j2267K864j2499N821J5170J2229
14683A1887j517M900l1481k4341J9892M147K1506N863J1378R283l0460O056L2733
14670C9846n02m8821J672K3553L210K3568k0712p179j4193k1406K155O277l971
14657a6503P271J5085K1601J6334l4925l2653L5994L498j9451k2463j1907K7694
14645a0425J1071j4890k4082R8O150O920J6290k025M906j7872P335p246J2618
14632a1152o794r194R418R815K4477j8362j5506j5253k3091j3207K2463N7838
$$ plain form
14620 11452 43207 50078 9073 -7731 -16193 -1462 -21214 -33225 -38317 -40922 -19671 -93
14608 -93 14284 -6687 -5436 15218 6724 -25641 -17123 9069 28045 23619 -16630 -46095 -27664
14595 -27664 -21418 -38238 -52455 -46999 -26259 -35581 -36034 -14947 5934 -5390 -15810 -10034 -15498
14582 -15498 4627 20917 20498 10488 15349 33515 51755 40601 5725 4432 -6170 -25440
14570 -25440 -22237 -24006 -8035 6295 -6085 -1064 23455 46881 47629 27377 48902 41699 38015
14557 38015 3464 -14654 -15122 -18159 -28458 -44540 -32000 -20873 -4012 -24198 -49706 -39710
14545 -39710 -24940 -15592 -42907 -41473 -20601 -20710 -24950 1016 34759 75922 91133 61590 9691
14532 9691 12143 30574 52177 54515 67539 43679 10001 629 22598 43895 6461 -22380
$$ packed form
14620A1452L1755O871m1005j6804q462J4731j9752j2011n092k605K1251J9578
14608i3J4377k0971J251K0654q494l2365Q518K6192J8976m426m0249k9465J8431
14595b7664O246j6820j4217N456K0740r322m53K1087K0881j1324j0420N776n464
14582a5498K0125J6290m19j0010M861J8166J8240j1154l4876j293j0602j9270
14570b5440L203j769J5971J4330j2380N021K4519K3426P48k0252K1525p203l684
14557C8015l4551j8118m68l037j0299j6082J2540J1127J6861k0186k5508R996
14545c9710J4770R348k7315J434K0872j09m240K5966L3743M1163J5211k9543n1899
14532I691K452J8431K1603K338J3024k3860l3678r372K1969K1297l7434k8841
$$ plain form
14520 -22380 -24495 -6499 15070 19257 26419 57092 56832 14103 7492 5809 13129 22314 2110
14507 2110 -3535 4160 -2612 2 -29170 -59536 -43550 -24759 -13246 -5897 -10841 -39376 -20558
14494 -20558 23020 23037 30438 36960 48973 42201 14127 2352 2636 9839 -657 -3695 2399 12094
14480 12094 19475 6790 15012 12485 42904 73616 22319 -19123 27463 50480 49410 37008
14468 37008 27458 15067 -24182 -27052 -37 13449 1757 -15450 -42606 -35879 -34222 -11299
14456 -11299 -4836 -4061 7406 26765 3619 -444 -17205 -12970 21740 22473 -1088 -27290 -59741
14443 -59741 -48588 -43242 -59804 -31801 1168 -13833 -49627 -37086 -5186 7399 -2371 2922
14431 2922 -28779 -33251 -36530 -35273 -33250 -29399 -41777 -57345 -66122 -58079 -39576 12626 42510
$$ packed form
14520b2380k115J7996K1569M187P162L0673k60m2729o611j683P320R185k0204
14507B110n645P695o772K614k9172l0366J5986J8791J1513P349m944k8535J8818
14494b0558M3578J7P401O522J2013o772k8074j1775K84P203j0496l038O094R695
14480A2094P381j2685Q222k527L0419L0712n1297m1442M6586K3017j070j2402
14468C7008r550j2391l9249k870K7015J3486j1692j7207k7156O727J657K2923
14456a1299O463P75J1467J9359k3146m063j6761M235L4710P33k3561k6202l2451
14443e9741J1153N346j6562K8003L2969j5001l5794J2541L1900J2585r770N293
14431B922l1701m472l279J257K023L851j2378j5568q777Q043J8503N2202K9884
$$ plain form
14418 42510 8654 10844 18038 29766 22595 5710 23983 52913 41871 13781 -6820 8020
14406 8020 -1389 -576 8159 15481 -1549 16391 -9731 -4003 3126 2910 11680 12271 -33030 -34830
14392 -34830 -73259 -86743 -56859 -32809 -633 15605 37206 32410 21329 35391 2545 -49057
14380 -49057 -50705 -45015 -19916 -8661 9897 25697 16870 10304 27663 41966 43703 24624 37062
14367 37062 62833 13670 -42611 -75640 -67456 -18928 19323 24605 -8546 -40552 -31332 -31379 -28160
14354 -28160 -29506 -36968 -16574 10459 7196 -11873 5439 4449 -6874 -8167 26426 44760 25336
14341 25336 2016 -30545 -33666 -21980 -13184 -2256 -100 -11213 1152 16540 16257 19547 2805
14328 2805 5554 37042 69412 52797 33713 19622 -23976 -29474 -46650 -47144 -48699 -23792 11698
$$ packed form
14418D2510l3856K190P194J1728p171j6885J8273K8930j1042k8090k0601J4840
14406H020r409Q13Q735P322j7030J7940k6122N728P129k16Q770N91m5301j800
14392c4830l8429j3484K9884K4050L2176J6238K1601m796j1081J4062l2846n1602
14380d9057j648N690K5099J1255J8558J5800q827o566J7359J4303J737j9079J2438
14367C7062K5771m9163n6281l3029Q184M8528L8251N282l3151l2006R220m7L219
14354b8160j346p462K0394K7033l263j9069J7312r90j1323j293L4593J8334j9424
14341B5336k3320l2561l121J1686Q796J0928K156j1113J2365J5388k83L290j6742
14328B805K749L1488L2370j6615j9084j4091m3598n498j7176m94j555K4907L5490
$$ plain form
14315 11698 -6285 -4702 -11680 -41892 -44393 -35908 -22820 -1759 -9577 -24516 -36002 -41746 -23120
14302 -23120 -7335 -2154 -7236 -7116 2374 -15784 1595 667 15916 -7348 -34820 -14956 19072
14289 19072 37116 34656 22444 38800 30347 5787 -18934 -23073 1691 4610 -7712 -15968 8761
14276 8761 23620 -6721 -28516 -22896 -28222 -25607 -27385 -3397 -6906 -16852 -24165 -19530 -830
14263 -830 -6558 -24448 -48623 -39852 -44807 4086 -1053 -41183 -34711 10022 18058 16363 16255 22430
14249 22430 7223 -17478 -25475 -24526 -48422 -34511 11333 69091 60877 66581 64801 32838 35949
14236 35949 30784 23273 14221 10981 39460 47132 11984 15270 52605 55229 19715 -5426 -1434
14223 -1434 15580 20075 30657 17669 15990 15469 15171 29882 55876 79619 58809 53798 -1464
$$ packed form
14315A1698j7983J583o978l0212k501Q485J3088K1061p818j4939j1486n744J8626
14302b3120J5785N181n082J20R490j8158J7379r28J5249k3264k7472J9864L4028
14289A9072J8044k460j2212J6356q453k4560k4721m139K4764K919j2322q256K4729
14276H761J4859l0341k1795N620n326K615j778K3988l509r946p313M635J8700
14263h30n728j7890k4175Q771m955M8893n139m0130O472M4733Q036j695j08O175
14249B2430j5207k4701p997R49k3896J3911M5844N7758q214N704j780l1963L111
14236C5949n165p511r052l240K8479P672l5148L286L7335K624l5514k5141L992
14223a434J7014M495J0582j2988j679n21k98J4711K5994K3743k0810n011n5262
$$ plain form
14210 -1464 -26298 -5871 19884 15669 -17490 -66997 -67985 -27406 -18775 -7454 8990 1268 20725
14197 20725 19284 -1090 -27307 -8432 -38225 -44658 -14426 -23087 -47647 -66438 -70043 -30929
14185 -30929 -14246 -22343 -38001 -22853 3159 45128 64788 35042 -4671 1160 20102 50077
14173 50077 53023 45011 41988 10765 269 -2295 -16458 -22467 -59958 -66912 -26221 22974 46252
14160 46252 53616 32832 6978 12977 41979 33291 18577 2359 -6798 5872 6777 10754 12415
14147 12415 -495 -15274 -25563 -22335 -25338 -20393 8024 10740 18105 20396 37856 29086 4703
14134 4703 2691 -9461 -9025 -9189 -6295 8475 14312 28853 31985 3527 -17741 -30040 -34685 -13861
14120 -13861 10475 3999 -9254 -11218 -16718 -1645 -10937 -28929 -21133 4264 16621 22561 -14048
$$ packed form
14210a464k4834K0427K5755m215l3159m9507r88M0579Q631J1321J6444p722J9457
14197B0725j441k0374k6217J8875k9793o433L0232q661k4560j8791l605L9114
14185c0929J6683q097j5658J5148K6012M1969J9660k9746l9713N831J8942K9975
14173E0077K946q012l023l1223j0496k564j4163o009l7491o954M0691M9195K3278
14160D6252P364k0784k5854N999K9002q688j4714j6218r157J2670R05L977J661
14147A2415j2910j4779j0289L228l003M945K8417K716P365K291J7460q770k4383
14134D703k012j2152M36j64K894J4770N837J4541L132k8458k1268j2299m645K0824
14120a3861K4336o476j3253j964n500J5073r292j7992P796K5397J2357N940l6609
$$ plain form
14107 -14048 -8448 11156 14856 11098 -11081 -33885 -25490 -13962 -18114 -3595 9278 30125 49042
14094 49042 45727 27510 -7708 225 -176 -13117 -1402 -24684 -10243 13247 -7917 -19349
14082 -19349 -16084 -1547 -11222 -16535 -89 18298 32134 16900 28652 42135 61134 83093
14070 83093 81335 87871 85459 91119 69036 18791 -16823 -51812 -46885 -23687 -15349 -8899 -49174
14057 -49174 -29665 -11413 -17749 6979 24055 18523 -1708 -2809 -20770 -8268 14108 65747
14045 65747 92715 69922 47171 57617 48353 24802 5606 3981 12845 14610 27398 20362 10478
14032 10478 4395 14971 5490 30346 31201 55393 52719 20057 9811 -4841 -9634 -4492 -15171
14019 -15171 -23563 7945 29660 31715 48150 56003 47275 66977 63397 51808 49572 38007 37928
$$ packed form
14107a4048N600J9604L700l758k2179k2804Q395J1528m152J4519J2873K0847J8917
14094D9042l315j8217l5218P933m01j2941J1715k3282J4441K3490k1164j1432
14082a9349L265J4537r675n313J6446J8387J3836j5234J1752J3483J8999K1959
14070H3093j758O536k412N660k2083n0245l5614l4989M927K3198Q338O450m0275
14057d9174J9509J8252o336K4728J7076n532k0231j101j7961J2502K2376N1639
14045F5747K6968k2793k2751J0446r264k3551j9196j625Q864J765J2788p036r884
14032A0478o083J0576r481K4856Q55K4192k674l2662j0246j4652m793N142j0679
14019a5171q392L1508K1715K055J6435P853q728J9702l580j1589k236j1565p9
$$ plain form
14006 37928 9430 -4738 16278 29071 41689 41916 40156 72570 45206 28194 23611 8318
13994 8318 5942 23785 18493 -9296 2579 12527 47627 29488 2648 9200 -40595 -70442 -47863
13981 -47863 -26715 -25379 -26780 -51657 -53388 -28461 3946 7079 -1829 -3268 -10977 9627 38846
13968 38846 23240 24986 14467 -7439 -21537 -39210 -54159 -11630 34925 55942 31235 7694
13956 7694 -4457 -26271 -45300 63 3886 -6636 3516 22948 39331 35473 17293 -3263
13944 -3263 -19254 -33668 -29899 -5422 20179 8199 -21899 -34741 -14618 8513 10546 30961
13932 30961 21605 38356 51875 13779 1030 15820 11861 30173 40345 27706 42858 51344
13920 51344 14856 -9137 7694 18223 37933 55064 58655 32932 15203 15208 10982 15168 16951
$$ packed form
14006C7928k8498j4168K1016J2793J2618K27j760L2414k7364j7012m583j5293
13994H318k376J7843n292k7789J1875R948L5100j8139k6840O552m9795k9847K2579
13981d7863K1148J336j401k4877j731K4927L2407L133q908j439p709K0604K9219
13968C8846j5606J746j0519k1906j4098j7673j4949M2529M6555K1017k4707k3541
13956G694j2151k1814j9029M5363L823j0522J0152J9432J6383l858j8180k0556
13944c263j5991j4414L769K4477K5601j1980l0098j2842K0123K3131K033K0415
13932C0961r356J6751J3519l8096j2749J4790l959J8312J0172j2639J5152Q486
13920E1344l6488k3993J6831J0529J9710J7131L591k5723j7729Nm226M186J783
$$ plain form
13907 16951 1081 -4919 2122 5304 2222 9879 26842 40113 40600 37667 33281 16920 -11418
13894 -11418 -8368 -7494 -36179 -29333 -33704 -17731 -8666 8475 -1512 -35134 -53160 -47845 -32763
13881 -32763 -22820 2303 30402 19240 8748 12190 40446 31461 14614 -15272 -12840 -178
13869 -178 -444 -3956 -19474 -11641 -19768 -22520 -24202 20052 14614 -14986 -27035 -9932 33021 52158
13855 52158 72004 80203 73355 61698 31266 28520 26370 33462 35530 36102 -2402 -15366 -5804
13842 -5804 -13627 -14507 -2340 37731 24098 832 -145 -3715 -13373 -7482 -2429 8644 -28377 -60115
13828 -60115 -44699 -29755 -24039 14209 27115 8203 17360 26138 -3055 -13083 -14902 2528
13816 2528 3905 -5138 -11030 -16245 10574 -4225 -44373 -50036 -23654 -17602 -2680 3723 -6234
$$ packed form
13907A6951j5870o000P041L182l082P657J6963J3271M87k933m386j6361k8338
13894a1418L050Q74k8685O846m371J5973R065J7141r987l3622j8026N315J5082
13881c2763R943K5123K8099j1162j0492L442K8256q985j6847k9886K432J2662
13869a78k66l512j5518P833q127k752j682M4254n438k9600j2049J7103M2953J9137
13855E2158J9846Q199o848j1657l0432k746k150P092K068N72l8504j2964R562
13842e804p823q80J2167M0071j3633k3266r77l570r658N891N053J1073l7021l1738
13828f0115J5416J4944N716L8248J2906j8912R157Q778k9193j0028j819J7430
13816B528J377r043n892n215K6819j4799m0148n663K6382O052J4922O403r957
$$ plain form
13803 -6234 -23915 -24394 -5839 9018 -8815 -12686 -22666 -7760 -5951 -7679 -18624 -4 5951
13790 5951 -20219 -18970 -16894 -27144 -29176 -33058 -19818 -36136 -16488 -17755 -14612 -15579 -17064 -17196
13776 -17196 -54620 -73161 -51871 -15719 12532 25073 45940 55120 40099 26515 4976 -11698
13764 -11698 -8105 -3612 -23901 -12483 -5533 1943 -3004 11296 18082 25781 19080 742 4134
13751 4134 14883 -8403 -22092 -13040 4840 7927 -9090 10648 31962 42199 45688 34904
13739 34904 23779 23871 17549 58076 33957 15929 8250 -19950 10027 27400 14352 -6972 -35223
13726 -35223 -33669 -33924 -34437 -29521 -28912 4959 -19665 -26831 -12802 1862 13733 13666 32801 31622
13712 31622 8581 6406 14426 37448 -11612 -29111 -8698 8059 31877 -2662 -22543 -44843
$$ packed form
13803f234j7681m79J8555J4857j7833l871r980J4906J809j728j0945J8620N955
13790E951k6170J249K076j0250k032l882J3240j6318J9648j267L143r67j485j32
13776a7196l7424j8541K1290L6152K8251J2541K0867R180j5021j3584k1539j6674
13764a1698L593M493k0289J1418O950P476m947J4300O786P699o701j8338L392
13751D134J0749k3286j3689R052J7880L087j7017J9738K1314J0237L489j0784
13739C4904j1125R2o322M0527k4119j8028p679k8200K9977J7373j3048k1324k8251
13726c5223J554k55n13M916O09L3871k4624p166J4029J4664J1871o7J9135j179
13712C1622k3041k175Q020K3022m9060j7499K0413J6757K3818l4539j9881k2300
$$ plain form
13700 -44843 -22941 -11039 -27378 -15958 -26945 -20519 -19957 -28245 16617 36130 8253 10912 -1882
13687 -1882 -17758 -18263 -7836 -5024 -1815 -5553 6921 18749 210 -3639 19401 23655 -4435
13674 -4435 -68088 -104332 -108261 -39439 -7153 -28888 -51453 -33609 -9811 5862 21368 1436
13662 1436 -27106 -23838 -5843 844 865 8784 12771 30248 39611 26994 -21696 -37236 -27598 -23893
13648 -23893 -34161 -46891 -37432 -1473 25542 981 7724 2361 17347 35379 29483 6609
13636 6609 2381 -10210 9450 30322 19942 10612 12667 9740 8543 -19529 -9815 14519 22979
13623 22979 30179 -476 15094 64770 78721 49761 18437 36316 62407 51406 24992 17859
13611 17859 -32018 -55356 -36027 -1047 -4170 -44938 -60902 -37917 -24170 349 -15543 -15487
$$ packed form
13700d4843K1902J1902j6339J1420j0987O426N62q288M4862J9513k7877K659j2794
13687a882j5876n05J0427K812L209l738J2474J1828j8539l849K3040M254k8090
13674d435o3653l6244l929O8822L2286k1735k2565J7844K3798J5673J5506j9932
13662A436k8542L268J7995O687K1P919L987J7477R363j2617m8690j5540R638L705
13648b3893j0268j2730R459L5959K7015k4561O743n363J4986J8032n896k2874
13636F609m228j2591J9660K0872j0380r330K055k927j197k8072R714K4334Q460
13623B2979P200l0655J5570M9676J3951k8960l1324J7879K6091j1001k6414p133
13611A7859m9877k3338J9329L4980l123m0768j5964K2985J3747K4519j5892N6
$$ plain form
13599 -15487 -13665 -19147 -24588 -27221 -41578 -23706 -7708 -20840 -32799 -46735 -41198 -10678 -7753
13586 -7753 -12405 7977 22631 26540 819 -7810 -29533 2942 10718 5112 -16583 -14727 7239
13573 7239 1745 -15051 -30478 -41767 -29094 -13230 -26584 -39481 -59676 -30692 -34787 8006
13561 8006 37387 47838 32829 46456 40480 21384 -6226 -29702 -19696 -39347 -57709 -44080
13549 -44080 -36150 555 7924 31773 30100 15689 59701 75293 44936 47656 36423 22642
13537 22642 18848 3932 -24105 -30110 -47276 -46502 -6742 26248 23003 -11292 8613 -1544 -2795
13524 -2795 -2487 34610 23178 28384 28079 11467 32369 55013 44513 18157 -10669 -3377 12049
13511 12049 19850 28291 6046 -2180 -12229 -5421 -13201 -15260 7768 34695 42145 41703 10384
$$ packed form
13599a5487J822n482n441k633j4357J7872J5998j3132j1959j3936N537L0520K925
13586g753m652K0382J4654L909k5721q629k1723L2475P776n606k1695J856K1966
13573G239n494j6796j5427j1289J2673J5864j3354j2897k0195K8984m095M2793
13561H006K9381J0451j5009J3627n976j9096k7610k3476J0006j9651j8362J3629
13549d4080P930L6705P369K3849j673j4411M4012J5592l0357K720j1233j3781
13537B2642l794j4916k8037o005j7166P74L9760L2990l245l4295J9905j0157j251
13524b795L08L7097j1432N206l05j6612K0902K2644j0500k6356k8826P292J5426
13511A2049P801Q441k2245q226j0049O808p780k059K3028K6927P450m42l1319
$$ plain form
13498 10384 -28078 -20321 -10048 -23566 -33144 -24876 -34667 -19311 -154 19502 -7902 2405
13486 2405 3201 6820 18414 42359 16217 15277 -17300 -46629 -31353 -20227 -44173 -54516 -45062
13473 -45062 -26668 -21567 -14730 -794 7076 25701 17338 28078 -17716 -9975 1519 12845 -1034
13460 -1034 11888 22259 25546 41430 65100 52673 2890 -23755 1078 -25193 -16187 5058
13448 5058 38769 24427 13226 -6433 -33152 -22493 -29475 -10424 13371 -21308 -47740 -25105
13436 -25105 9006 3579 4885 11294 -5770 -22698 -22972 -19036 -25719 -25768 -18786 -8722 52676 81593
13422 81593 75266 76753 67256 54318 56958 57329 12935 -4343 16664 35243 31435 47200 31750
13409 31750 25955 24712 17551 41808 50782 26292 2089 11155 -2134 3615 20517 15848 1071
$$ packed form
13498A0384l8462P757J0273j3518r578Q268r791J5356J9157J9656k7404J0307
13486B405P96L619J1594K3945k6142r40l2577k9329J5276J1126k3946j0343R454
13473d5062J8394N101O837J3936P870J8625q363J0740m5794P741J1494J1326j3879
13460a034J2922J0371L287J5884K3670j2427m9783k6645K4833k6271R006K1245
13448E058L3711j4342j1201j9659k6719J0659o982J9051K3795l4679k6432K2635
13436b5105L4111n427J306O409j7064j6928k74L936o683m9O982J0064O1398K8917
13422H1593o327J487r497j2938K640L71m4394j7278K1007J8579l808J5765j5450
13409C1750n795j243p161K4257Q974k4490k4203R066j3289N749J6902m669j4777
$$ plain form
13396 1071 -737 2136 -31551 238 12507 15914 21058 20047 27524 17820 -12970 6881 19947
13383 19947 3318 -329 18390 25787 12278 -12223 -17184 2956 -6373 -10043 -6012 3576 20224
13370 20224 43294 39269 31860 14433 26920 43275 45682 28428 -3007 15440 48872 66170
13358 66170 52280 179 -5050 -6759 22856 67900 82337 62985 8674 -29470 -8830 11277
13346 11277 891 3564 28405 39433 12898 7077 9598 13750 16461 7261 12210 3669 -18155
13333 -18155 -32793 -38588 -6902 25392 52777 16604 7013 -9816 -10313 9794 5278 4175 20990
13320 20990 39991 35658 34721 22241 -10011 -4757 -2796 14304 10821 8250 28443 31780 -1215
13307 -1215 -14967 -51391 -19169 1959 2667 18333 33560 22106 19246 -1872 17946 23589 3535
$$ packed form
13396A071j808K873l3687L1789J2269L407N144j011P477r704l0790J9851J3066
13383A9947j6629l647J8719P397j3509k4501m961K0140r329l670M031R588J6648
13370B0224K3070m025p409j7427J2487J6355K407j7254l1435J8447L3432J7298
13358F6170j3890n2101n229j709K9615M5044J4437j9352n4311l8144K0640K0107
13346A1277j0386K673K4841J1028k6535n821K521M152K711r200M949q541k1824
13333a8155j4638n795L1686L2294K7385l6173r591j6829m97K0107m516j103J6815
13320B0990J9001m333r37j2480l2252N254J961J7100l483k571K0193L337l2995
13307a215j3752l6424L2222K1128P08J5666J5227j1454k860k1118J9818N643k0054
$$ plain form
13294 3535 -2435 -26635 -25607 830 12348 -15614 -17644 19510 36372 23795 9430 -13986
13282 -13986 3392 -11965 889 -2963 -26328 -27738 -32166 -17617 -24026 -41164 -31179 -25222 -10239
13269 -10239 -12023 6020 24263 11376 23926 113 -18054 -23077 26712 31664 3840 -890
13257 -890 15501 32136 14470 14730 12505 7660 -15357 -11925 -40325 -69387 -50426 -28589 -23606
13244 -23606 -34716 -34667 -23221 -26750 -45382 -52286 -44628 -54625 -3650 15606 -17440 -38459 -12369
13231 -12369 148 -3218 9782 21442 24160 -15630 -39584 440 14700 9785 6924 -1300 5475
13218 5475 13513 15196 -17901 -45144 -59544 -52806 -25185 -31302 -28465 -6281 -836 -10548 -17993
13205 -17993 11377 20417 6936 -7627 -8939 -18491 -16868 6324 -20434 -26650 -12611 16322 2677
$$ packed form
13294C535n970k4200J028K6437J1518k7962k030L7154J6862j2577j4365k3416
13282a3986J7378j5357J2854l852k3365j410m428J4549o409j7138R985N957J4983
13269a0239j784J8043J8243j2887J2550k3813j8167n023M9789M952k7824m730
13257h90J6391J6635j7666K60k225m845k3017L432k8400k9062J8961K1837M983
13244b3606j1110M9J1446l529j8632o904P658r997N0975J9256l3046k1019K6090
13231a2369J2517l366J3000J1660K718l9790k3954M0024J4260m915k861q224O775
13218E475Q038J683l3097k7243j4400O738K7621o117K837K2184N445r712p445
13205a7993K9370R040j3481j4563j312r552J623K3192k6758o216J4039K8933j3645
$$ plain form
13192 2677 -14586 -22790 -52175 -43292 -5236 11717 7856 13135 6568 -8179 -7852 10428 -8198
13179 -8198 -23862 -30397 -4965 1527 -34518 -10776 27808 32144 26570 35847 36399 30276 -71
13166 -71 -17000 -6359 -31756 -27403 -16842 -7419 16772 -7994 -30529 -33519 -23001 -15467 -4187
13153 -4187 -603 -12851 -27179 -43147 -70221 -67021 -50431 -28644 -22476 -47426 -38071 -17801 -1738
13140 -1738 23006 45402 33656 10848 4469 -6789 -6429 -27416 -45330 -31888 -1295 -3585 -20763
13127 -20763 -14702 -9778 -13251 -32975 -8982 9741 39104 56657 31989 15323 28266 13374
13115 13374 -23805 -35244 -16423 1805 29885 35020 -11975 -64477 -45535 -44755 -46607 -18927
13103 -18927 6516 8553 9645 -22780 -58744 -38582 -24476 -33171 -45837 -63710 -62219 -46788
$$ packed form
13192B677j7263q204k9385Q883L8056J6953l861N279o567j4747L27J8280j8626
13179h198j5664o535K5432O492l6045K3742L8584M336n574R277N52o123l0347
13166g1j6929J0641k5397M353J0561R423K4191k4766k2535k990J0518P534J1280
13153d187L584j2248j4328j5968k7074L200J6590K1787O168k4950R355K0270J6063
13140a738K4744K2396j1746k2808o379j1258L60k0987j7914J3442L0593k290j7178
13127b0763O061M924l473j9724K3993J8723K9363J7553k4668j6666J2943j4892
13115A3374l7179j1439J8821J8228K8080N135m6995n2502J8942P80j852K7680
13103a8927K5443K037J092l2425l5964K0162J4106q695j2666j7873J491J5431
$$ plain form
13091 -46788 -42401 -10027 6771 18176 16379 49204 62122 76257 66780 17954 5672 16146
13079 16146 -15600 -48266 -44679 -36720 -5162 -665 -17420 -1703 26684 42960 55504 52478
13067 52478 32082 20056 34713 31059 6539 -21309 13742 16279 1490 -22709 -33624 -23383
13055 -23383 -2596 5424 -1701 -28685 -21946 -6930 16249 -23834 -53893 -55841 -41965 -28918
13043 -28918 -35854 -44164 -47457 -32904 -10815 -36006 -33868 -29528 -14639 -15393 -37467 -66709 -57953
13030 -57953 -38476 -30643 -24443 10648 22102 -5810 3428 10608 34821 40883 17019 9997 -22801
13017 -22801 -18395 -2824 8927 33342 26002 -5219 8145 21391 27817 37650 24955 14892
13005 14892 27909 46483 40363 2721 -7978 12824 6458 -12166 9748 24873 15699 -3145
$$ packed form
13091d6788M387L2374J6798J1405j797L2825J2918J4135r477m8826j2282J0474
13079A6146l1746l2666L587P959L1558M497j6755J5717K8387J6276J2544l026
13067E2478k0396j2026J4657l654k4520k7848L5051K537j4789k4199j0915J0241
13055b3383K0787Q020p125k6984O739J5016K3179m0083l0059j948J3876J3047
13043b8918o936q310l293J4553K2089k5191K138M340J4889p54k2074k9242Q756
13030e7953J9477P833O200L5091J1454k7912R238P180K4213O062k3864p022l2798
13017b2801M406J5571J1751K4415p340l1221J3364J3246O426R833j2695j0063
13005A4892J3017J8574o120l7642j0699K0802o366j8624K1914J5125r174j8844
$$ plain form
12993 -3145 -12965 -5948 18709 -8979 -7360 -18985 -47043 -87167 -80673 -64768 -44693 -25411 -20014
12980 -20014 -36505 -40737 -18004 452 -605 -20656 -36396 -26707 -12570 -11246 -17385 -26136 -16934
12967 -16934 -26074 -34060 -14863 -15792 -28812 -41272 -43448 -22953 2546 12827 60931 61030 43114
12954 43114 18651 14365 8630 -9389 -19672 -7801 -1662 -10076 -20329 -37488 -12511 22367
12942 22367 -3231 -29815 -30151 -15558 18690 21741 2900 -5054 1906 10481 11317 17213 30125
12929 30125 22562 21735 57238 53142 25848 -7292 4035 5234 7812 -19077 -21034 5097 16522
12916 16522 10773 9114 16616 -2032 -2153 28295 57632 24806 -16415 -1634 -2901 -20447 -26156
12903 -26156 -29878 -8314 22351 49599 29639 10804 -7700 -15506 96 -17230 -36690 -33582
$$ packed form
12993c145r820P017K4657k7688J619j1625k8058m0124O494J5905K0075J9282N397
12980b0014j6491m232K2733J8456j057k0051j5740R689J4137J324o139q751R202
12967a6934r140p986J9197r29j3020j2460k176K0495K5499J0281M8104R9j7916
12954D3114k4463m286n735j8019j0283J1871O139q414j0253j7159K4977L4878
12942B2367k5598k6584l36J4593L4248L051j8841p954O960Q575Q36N896J2912
12929C0125p563q27L5503m096k7294l3140J1327J199K578k6889j957K6131J1425
12916A6522n749j659P502j8648j21L0448K9337l2826m1221J4781j267j7546n709
12903b6156l722K1564L0665K7248j9960j8835j8504p806J5602j7326j9460L108
$$ plain form
12891 -33582 -41181 -58505 -44020 -17984 8163 29747 21303 20275 16123 -8606 -33947 13515
12879 13515 30745 35813 21930 34171 17939 -36119 -47367 -26176 -29808 -65642 -59171 -45166
12867 -45166 -43692 -68811 -88609 -74912 -34336 -21965 -40603 -13509 -5798 -4764 -5677 -4460 -28780
12854 -28780 -28730 -16142 -5350 -21162 -22208 -28827 -24872 22 2537 -11624 -9990 -15148 -7716 -1089
12840 -1089 -29949 -45904 -34198 -9879 -3636 -23289 -37501 -22608 -22745 -22607 -46330 -52458 -16607
12827 -16607 -3469 -25111 -26669 -678 10062 21655 36396 45793 44484 4619 21143 17282
12815 17282 36040 34629 -797 -9992 -16713 -7628 7102 -27473 -32098 238 30462 28829 15629
12802 15629 2221 676 48534 46142 17552 11162 14434 40184 20342 29510 18453 21520 -7549
$$ packed form
12891c3582p599j7324J4485K6036K6147K1584q444j028m152k4729k5341M7462
12879A3515J7230N068j3883J2241j6232n4058j1248K1191l632l5834O471J4005
12867d5166J474k5119j9798J3697M0576J2371j8638K7094P711J034r13J217k4320
12854b8780N0J2588J0792j5812j046o619L955K4894K515j4161J634n158P432O627
12840a089k8860j5955J1706K4319O243j9653j4212J4893j37J38k3723o128L5851
12827a6607J3138k1642j558K5991J0740J1593J4741R397j309l9865J6524l861
12815A7282J8758j411l5426r195o721R085J4730l4575m625L2336L0224j633j3200
12802A5629j3408j545M7858k392k8590o390L272K5750j9842R168j1057L067k9069
$$ plain form
12789 -7549 -20337 -5276 14591 3169 -15965 -21887 -3395 4132 -2866 -35737 -41707 -45994 -11697
12776 -11697 12315 -5279 2618 15330 10845 -1822 -2180 3340 3664 27523 14337 -21936 -11540
12763 -11540 36309 58523 63858 44361 50813 34190 8118 23992 53777 18299 19916 23729
12751 23729 18768 16598 -11242 -22019 -2100 31158 41909 48789 31608 16222 2251 26622
12739 26622 -11529 19845 57364 72066 32068 28905 15184 4686 -2073 12541 -44796 -40355
12727 -40355 -2878 -1112 -15159 -35494 -36566 1850 25024 6472 -5813 -24551 -25654 -44572
12715 -44572 -44598 -33791 -9746 162 6440 -2655 -19672 -1451 -14593 -34231 -42018 -27419 -15606
12702 -15606 1198 3636 19822 21736 4712 -14551 -31920 -20735 -48828 -37053 -5151 30002
$$ packed form
12789g549j2788J5061J9867j1422j9134n922J8492P527o998l2871n970m287L4297
12776a1697K4012j7594P897J2712m485j2667l58N520L24K3859j3186l6273J0396
12763a1540M7849K2214N335j9497O452j6623k6072J5874K9785l5478J617L813
12751B3729m961k170k7840j0777J9919L3258J0751O880j7181j5386j3971K4371
12739B6622l8151L1374L7519J4702l9998l163j3721j0498o759J4614n7337M441
12727d0355L7477J766j4047k0335j072L8416K3174j8552j2285j8738j103j8918
12715d4572k6J0807K4045R908O278r095j7017J8221j3142j9638p787J4599J1813
12702a5606J6804K438J6186J914j7024j9263j7369J1185k8093J1775L1902L5153
$$ plain form
12690 30002 34553 31247 26636 -2590 -9397 3305 -1597 11260 31236 14147 23231 12197 21648
12677 21648 30647 32576 48777 40850 29961 23741 16261 6394 -3543 -5718 -12024 769 -2104 23984
12663 23984 21539 -4377 13961 19169 1762 -17644 381 52355 51093 32604 17453 -11515
12651 -11515 -11774 -2165 14075 17503 16243 21115 -12092 -19271 -37490 -25418 7362 22925 20624
12638 20624 11204 -648 1681 6255 -18756 -10998 20629 43977 28025 9747 12860 15778 19129
12625 19129 3258 37429 49039 47846 30660 10293 7025 -15618 1147 3991 3228 10975 10972 27432
$$ packed form
12690C0002M551l306m611k9226o807J2702m902J2857J9976j7089R084j1034R451
12677B1648Q999J929J6201p927j0889o220p480r867r937k175o306J2793k873K6088
12663B3984k445k5916J8338N208j7407j9406J8025N1974j262j8489j5151k8968
12651a1515k59R609J6240L428j260M872l3207p179j8219J2072L2780J5563k301
12638B0624r420j1852K329M574k5011P758L1627K3348j5952j8278L113K918L351
12625A9129j5871L4171J1610j193j7186k0367l268k2643J6765K844p63P747lJ6460
$$ [...]
##END NTUPLES=NMR SPECTRUM
##END=
