##TITLE=Analysis number 315825
Compound Code cc 34416
Book Reference 440/114
Project Code adrs
Chemist Name craigr
##JCAMPDX= 6.0         $$ Bruker NMR JCAMP-DX V2.0
##DATA TYPE= NMR SPECTRUM
##DATA CLASS= NTUPLES
##ORIGIN= Bruker BioSpin GmbH
##OWNER= NMR
$$ XWIN-NMR		Version 3.5
$$ Mon Dec  5 09:52:49 2005 GMT Standard Time (UT+0h)  MAYBRIDGE\NMR@NMR_250MHZ
##.OBSERVE FREQUENCY= 250.131544655141
##.OBSERVE NUCLEUS= ^1H
##.ACQUISITION MODE= SIMULTANEOUS (DQD)
##.ACQUISITION SCHEME= undefined
##.AVERAGES= 16
##.DIGITISER RES= 18
##SPECTROMETER/DATA SYSTEM= dpx250
##.PULSE SEQUENCE= zg30
##.SOLVENT NAME= CDCl3
##.SHIFT REFERENCE= (INTERNAL, CDCl3, 0, 16.522)
##AUDIT TRAIL= $$ (NUMBER, WHEN, WHO, WHERE, WHAT)
$$ ##TITLE= Audit trail, XWIN-NMR		Version 3.5
$$ ##JCAMPDX= 5.01
$$ ##ORIGIN= Bruker BioSpin GmbH
$$ ##OWNER= NMR
$$ C:\u/data/dgb/nmr/ADRS/13400/pdata/1/auditp.txt
$$ ##AUDIT TRAIL=  $$ (NUMBER, WHEN, WHO, WHERE, WHAT)
(   1,<2005-12-05 09:52:22.10 +000>,<MAYBRIDGE\NMR>,<NMR_250MHZ>,
      <created by zg, POWCHK disabled, PULCHK disabled
       configuration hash MD5:
       62 19 C7 07 E1 42 D1 B7 37 6C 3D D0 77 39 F9 E6
       data hash MD5: 64K
       8E 6D 4D 7C E2 FB 09 36 A4 8D 2E 3B 16 0A 6F FE>)
(   2,<2005-12-05 09:52:37.53 +000>,<MAYBRIDGE\NMR>,<NMR_250MHZ>,
      <Start of raw data processing
       ef LB = 0.3 FT_mod = 6 PKNL = 1 SI = 32K 
       data hash MD5: 32K
       0A 80 E2 DE 45 08 98 12 42 D3 92 8A 56 F1 CF 10>)
(   3,<2005-12-05 09:52:39.30 +000>,<MAYBRIDGE\NMR>,<NMR_250MHZ>,
      <apk 
       data hash MD5: 32K
       D5 84 2E FB E1 DF 44 E2 33 B2 BD 75 8A 52 99 3D>)
(   4,<2005-12-05 09:52:40.03 +000>,<MAYBRIDGE\NMR>,<NMR_250MHZ>,
      <abs ABSG = 5 
       data hash MD5: 32K
       51 47 E8 5E 61 94 D1 8F 4E E9 81 65 E0 D6 7D E9>)
$$ ##END=
$$ 
$$ hash MD5
$$ 86 B2 FF B1 83 90 D5 4E CF 86 28 A9 E3 B5 51 49
##$RELAX= 
##$RELAX= 
##$RELAX= 
##$RELAX= 
##$RELAX= 
##$RELAX= 
##$RELAX= 
$$ Bruker specific parameters
$$ --------------------------
##$DU= <C:\u>
##$EXPNO= 13400
##$NAME= <ADRS>
##$PROCNO= 1
##$TYPE= <nmr>
##$USER= <dgb>
##$AMP= (0..31)
100 100 100 100 100 100 100 100 100 100 100 100 100 100 100 100 100 100 
100 100 100 100 100 100 100 100 100 100 100 100 100 100 
##$AQSEQ= 0
##$AQ_mod= 3
##$AUNM= <au_zg>
##$AUTOPOS= <5 >
##$BF1= 250.13
##$BF2= 250.13
##$BF3= 250.13
##$BF4= 250.13
##$BF5= 500.13
##$BF6= 500.13
##$BF7= 500.13
##$BF8= 500.13
##$BYTORDA= 1
##$CFDGTYP= 0
##$CFRGTYP= 5
##$CHEMSTR= <none>
##$CNST= (0..31)
1 1 145 1 1 1 1 1 1 1 1 1 1 1 1 1 1 1 1 1 1 1 1 1 1 1 1 1 1 1 1 1 
##$CPDPRG= <>
##$CPDPRG1= <>
##$CPDPRG2= <>
##$CPDPRG3= <>
##$CPDPRG4= <mlev>
##$CPDPRG5= <mlev>
##$CPDPRG6= <mlev>
##$CPDPRG7= <mlev>
##$CPDPRG8= <mlev>
##$CPDPRGB= <>
##$CPDPRGT= <>
##$D= (0..31)
0 1 0 0 0 0 0 0 0 0.06 0 0 0 0 0 0 0.0002 0 0 0 0 0 0 0 0 0 0 0 0 0 0 
0 
##$DATE= 1133776340
##$DBL= (0..7)
120 120 120 120 120 120 120 120 
##$DBP= (0..7)
150 150 150 150 150 150 150 150 
##$DBP07= 0
##$DBPNAM0= <>
##$DBPNAM1= <>
$$ [...]
##$SUBNAM6= <"">
##$SUBNAM7= <"">
##$SUBNAM8= <"">
##$SUBNAM9= <"">
##$SW= 20.6930455092707
##$SWIBOX= (0..15)
0 0 3 0 0 0 0 0 0 0 0 0 0 0 0 0 
##$SW_h= 5175.983436853
##$TD= 65536
##$TD0= 1
##$TE= 294.16
##$TE2= 300
##$TE3= 300
##$TEG= 300
##$TL= (0..7)
0 120 120 120 120 120 120 120 
##$TP= (0..7)
150 150 150 150 150 150 150 150 
##$TP07= 0
##$TPNAME0= <>
##$TPNAME1= <>
##$TPNAME2= <>
##$TPNAME3= <>
##$TPNAME4= <>
##$TPNAME5= <>
##$TPNAME6= <>
##$TPNAME7= <>
##$TPOAL= (0..7)
0.5 0.5 0.5 0.5 0.5 0.5 0.5 0.5 
##$TPOFFS= (0..7)
0 0 0 0 0 0 0 0 
##$TUNHIN= 0
##$TUNHOUT= 0
##$TUNXOUT= 0
##$USERA1= <user>
##$USERA2= <user>
##$USERA3= <user>
##$USERA4= <user>
##$USERA5= <user>
##$V9= 5
##$VALIST= <valist>
##$VCLIST= <CCCCCCCCCCCCCCC>
##$VD= 0
##$VDLIST= <DDDDDDDDDDDDDDD>
##$VPLIST= <PPPPPPPPPPPPPPP>
##$VTLIST= <TTTTTTTTTTTTTTT>
##$WBST= 1024
##$WBSW= 4
##$XGAIN= (0..3)
0 0 0 0 
##$XL= 0
##$YL= 0
##$YMAX_a= 340918
##$YMIN_a= -406851
##$ZGOPTNS= <>
##$ZL1= 120
##$ZL2= 120
##$ZL3= 120
##$ZL4= 120
##$ABSF1= 16.522
##$ABSF2= -4.171173
##$ABSG= 5
##$ABSL= 3
##$ALPHA= 0
##$AQORDER= 0
##$ASSFAC= 0
##$ASSFACI= 0
##$ASSFACX= 0
##$ASSWID= 0
##$AUNMP= <proc_1d>
##$AZFE= 0.1
##$AZFW= 0.1
##$BCFW= 0
##$BC_mod= 0
##$BYTORDP= 0
##$COROFFS= 0
##$CY= 12.5
##$DATMOD= 1
##$DC= 0
##$DFILT= <>
##$DTYPP= 0
##$F1P= 14.0000005364418
##$F2P= -0.99999901652339
##$FCOR= 0.5
##$FTSIZE= 32768
##$FT_mod= 6
##$GAMMA= 0
##$GB= 0
##$INTBC= 1
##$INTSCL= 1
##$ISEN= 128
##$LB= 0.3
##$LEV0= 0
##$LPBIN= 0
##$MAXI= 10000
##$MC2= 0
##$MEAN= 0
##$ME_mod= 0
##$MI= 0
##$NCOEF= 0
##$NC_proc= -4
##$NLEV= 6
##$NOISF1= 0
##$NOISF2= 0
##$NSP= 0
##$NTH_PI= 0
##$NZP= 0
##$OFFSET= 16.522
##$PC= 1
##$PHC0= 91.983
##$PHC1= 1.997761
##$PH_mod= 1
##$PKNL= yes
##$PPARMOD= 0
##$PSCAL= 4
##$PSIGN= 0
##$REVERSE= no
##$SF= 250.13
##$SI= 32768
##$SIGF1= 0
##$SIGF2= 0
##$SINO= 400
##$SIOLD= 32768
##$SREGLST= <1H.CDCl3>
##$SSB= 0
##$STSI= 32768
##$STSR= 0
##$SW_p= 5175.98343685301
##$SYMM= 0
##$S_DEV= 0
##$TDeff= 65536
##$TDoff= 0
##$TI= <Analysis number 999999
Compound Code 99
Book Reference 9
Project Code 9>
##$TILT= no
##$TM1= 0
##$TM2= 0
##$TOPLEV= 0
##$USERP1= <user>
##$USERP2= <user>
##$USERP3= <user>
##$USERP4= <user>
##$USERP5= <user>
##$WDW= 1
##$XDIM= 32768
##$YMAX_p= 335394471
##$YMIN_p= -440194
$$ End of Bruker specific parameters
$$ ---------------------------------
##NTUPLES= NMR SPECTRUM
##VAR_NAME=  FREQUENCY,     SPECTRUM/REAL,   SPECTRUM/IMAG
##SYMBOL=    X,             R,               I
##VAR_TYPE=  INDEPENDENT,   DEPENDENT,       DEPENDENT
##VAR_FORM=  AFFN,          ASDF,            ASDF
##VAR_DIM=   32768,         32768,           32768
##UNITS=     HZ,            ARBITRARY UNITS, ARBITRARY UNITS
##FACTOR=    0.157963299565203, 1,           1
##FIRST=     4132.6476996994, 0,             0
##LAST=      -1043.33573715361, 0,           0
##MIN=       -1043.33573715361, -440194,     0
##MAX=       4132.6476996994, 335394471,     0
$$ Real data points
##PAGE= N=1
##DATA TABLE= (X++(R..R)), XYDATA
$$ [...]
28518 -71172 -32467 114433 105666 -62808 -152495 -83876 -51269 94321 142239 66834 2456
28507 2456 13218 -49266 -69828 -55041 -98153 -123963 -109270 95561 153283 111864 86231 10792
28495 10792 -33308 19213 52400 47660 33148 100621 19564 20861 112721 126488 118129 40982
28483 40982 84647 136553 149276 75182 -38796 15987 98506 44165 -50673 12460 92984
28472 92984 165522 235682 222025 229366 233115 133587 107818 174776 201616 154972 168528 127936
28460 127936 54135 53671 52272 -35050 -52126 549 3198 162819 152813 143527 47069 -13569
28448 -13569 -33924 -77298 -52356 -4976 61344 99279 167467 83829 55166 22776 -5218 32818
28436 32818 -4268 -208027 -285828 -136077 50355 86957 91634 96807 111649 148208 111647
28425 111647 -12562 55711 3369 -70536 -167430 -159749 -125802 -59262 -17514 -89190 49592
28414 49592 145228 213262 228250 252733 239978 175287 97361 24513 77861 64798 -21065 52935
28402 52935 -18095 85427 119557 134659 39111 -12571 -222 9309 19721 28643 164346 210872
28390 210872 122349 60810 4932 42126 3783 -31533 45694 14793 73999 99079 56369
28379 56369 -24744 -1963 218195 264340 54075 -83459 -96603 -24033 143481 104806 15142
28368 15142 -5577 63729 136199 51108 81119 107483 6825 61463 134160 66389 -17776
28357 -17776 -58323 22372 -170 36733 -4648 -17170 21308 98956 95116 31927 166415 188467
28345 188467 171735 65077 100724 158201 157097 134755 126172 111012 122040 161132 76190 68030
28333 68030 161425 114838 -66393 -45482 -26040 -28587 152967 163058 181443 62156 -71682
28322 -71682 -55055 -113295 -32392 101582 76664 101896 82588 25732 -10077 -21771 62659
28311 62659 -8944 -123263 -114510 -131718 -97084 -210725 -220583 -126145 -19666 6490 -30693
28300 -30693 -15697 -178688 -215792 -45928 124927 47121 139468 136586 123999 155593 192174
28289 192174 164919 43377 -101477 -120044 -157388 -174859 -33414 -49471 -115138 -88350 -2879
28278 -2879 68168 92100 56096 -2188 -30595 -33924 -34826 14779 51496 95861 94888 122509 206716
28265 206716 234628 223926 186398 128160 128205 103435 127161 103256 56107 33975 -104186 -114057
28253 -114057 -75305 -99591 -83930 16531 74071 337 -60604 -107481 -106138 -182706 -213175
28242 -213175 -280851 -235803 -144729 10036 90590 135781 216918 244855 93622 8111 -41864
28231 -41864 -44481 -26388 20752 -54755 -195204 -207570 -127476 -150945 -216334 -75768 49497
28220 49497 24624 -48863 -66958 -67713 -47706 -143163 -141580 -33862 -39758 -90711 -91678 -149864 -99492
28207 -99492 -54844 3512 12082 -19144 -38424 -26604 9414 -116734 -244937 -153454 -26664
28196 -26664 -43315 -66908 -44875 -13659 -22969 -38639 -58656 -58043 -46697 -86869 -54232 -49140
28184 -49140 -59886 -63900 -95541 -84929 -5357 14351 52735 -29244 -198460 -246883 -196563 -169855
28172 -169855 -65568 -280 -99892 -127033 -99408 -15978 -44028 -60612 -40847 -74153 -52561
28161 -52561 26650 88070 57552 30817 96131 132511 24629 57475 46029 72370 67238 860
28149 860 -72006 -65439 -82078 -196100 -172135 -184768 -281000 -207249 -207642 -250703 -167284 -13153
28137 -13153 -29927 3945 31621 -5470 -39770 -144108 -231539 -153167 48064 182084 83097
28126 83097 78022 89778 186706 167419 111428 127682 218516 168054 213095 35858 -74358
28115 -74358 -121717 -221879 -79851 -14417 113246 107211 -16559 -9420 70686 69476 -5211
28104 -5211 -3428 34474 63989 -95542 -235750 -112597 -211391 -281556 -223146 -168182 -44086
28093 -44086 -25224 -161163 -138862 -133681 -81918 -14316 80392 130194 134831 455 -48012 -125296
28081 -125296 -79756 44404 41646 -93189 -92312 -36714 -3657 -22608 35239 3003 -12563 -63403
28069 -63403 -11627 48858 148411 21470 -28969 -13280 -16573 -39614 -12218 -28259 30863 216866
28057 216866 245420 21937 -80334 -34268 -115751 -146879 -89793 92547 82501 -17099 -2822
28046 -2822 5458 -6972 -117801 -18982 47098 82946 140908 189892 215501 183416 223033 180495
28034 180495 64101 95631 140553 192635 273243 213926 135737 62062 61961 102388 55569 31217
28022 31217 32057 -81360 -213766 -227905 -189957 -133987 -206266 -161156 -87479 -24772 92070
28011 92070 67799 16898 4766 -36690 17737 111673 123488 500 -37278 83198 75235
28000 75235 42711 -41035 52502 183726 268814 90689 43511 15662 -53305 36277 -59508
27989 -59508 -73204 -58866 -96949 22988 -47176 -95831 -108550 -32411 -32264 78535 201274
27978 201274 242621 196575 100168 14324 29933 -29989 -29692 -30503 49886 63216 30515 -39091
27966 -39091 -99460 -22489 33718 117999 120441 29130 29667 89172 98120 -80026 -260103 -211078
27954 -211078 -77295 4563 51345 -69752 -204908 -123228 -3580 49622 122732 168929 257281
27943 257281 188919 102604 20100 -17233 139041 137403 93832 68355 85836 111331 58497
27932 58497 129730 173151 161547 149567 163495 108683 65445 74738 92832 224456 142975 -3252
27920 -3252 67790 144266 178403 245129 159900 90468 -48811 -189827 -98542 -14067 3134
27909 3134 -184069 -141885 42820 115801 82770 64812 102429 63480 79089 157921 182163
27898 182163 160031 173425 66675 38503 39245 87056 131113 118989 7292 -106122 -212943
27887 -212943 -20152 3259 -159648 -166692 -192250 -141358 -46235 46124 15907 152540 294743
27876 294743 185050 147610 189994 151882 100502 3000 -67544 -174344 -135599 27658 77928
27865 77928 57635 146376 171565 43840 -41163 -25432 77997 -3755 -87502 -26513 7743
27854 7743 38205 177469 224336 201332 161340 91132 147710 219256 265736 203197 193904 107405
27842 107405 32703 -3774 30640 209146 202526 141027 94509 80791 -5142 4514 22432 -3838
27830 -3838 -23366 -16842 8067 -38535 -141005 -40625 60316 8496 -5193 -56333 -67506
27819 -67506 -6330 16246 64752 43917 -11126 -5037 -100467 -28761 172844 255107 200195 110494
27807 110494 133510 140493 111716 -14223 -21236 64111 75235 79762 114873 -26283 -16164 -62471
27795 -62471 -19370 83049 59279 8042 -129911 -113976 57344 83814 36653 73272 140092
27784 140092 202370 127668 119139 119221 107003 161890 209849 93844 3267 -44436 -66683 -93029
27772 -93029 -65915 -53814 -52037 -77779 19356 111625 115586 88597 155294 161265 195140 199507
27760 199507 154211 102838 87145 121886 141171 144187 143622 61830 96202 163697 107256 126770
27748 126770 42454 -65151 -16756 49869 49491 90900 74076 41586 108870 94355 138097 108828
27736 108828 30600 -99295 -86195 -45185 -89028 -60571 26104 99548 72462 -49018 28487
27725 28487 98786 71302 4598 -51658 -78601 21129 147617 168068 103633 -66860 -105812
27714 -105812 -136716 -24011 69663 105032 15433 29850 44443 75913 45063 26970 122390
27703 122390 145277 93005 -4473 -46667 -63312 -39576 -37026 -140602 -172263 -104291 -67935
27692 -67935 -62287 -102261 -81532 -16264 -10661 -121638 -136101 -31553 -27423 -76279 -54526 8705
27680 8705 -69171 -251689 -177997 -48212 43229 132826 203288 233600 94963 85346 81905 162005
27668 162005 97506 75206 77592 152850 136303 -27822 -93369 -90306 -136876 -65893 64159
27657 64159 124797 137575 139451 84717 56222 -25613 -144025 -181526 -157144 -120287 -185572 -122913
27645 -122913 -62403 -154186 -158427 -72610 -97127 34825 73380 -7497 8684 -112870 -117953
27634 -117953 -57741 -38192 -65220 -47287 -5465 9352 10618 149351 236677 206079 -13519
27623 -13519 -91421 -190169 -135173 -154493 -202671 -110540 -68003 -11685 73737 64299 55128 44834
27611 44834 99264 69059 105863 53282 -84581 -223929 -223628 -199030 -166040 -74205 -41333 -44078
27599 -44078 -9834 -82406 -31031 28586 -43847 59857 51835 -67062 -68900 -79847 -66988 -58922
27587 -58922 7872 -42862 -42202 49525 12201 29537 37966 -14295 -24659 249 23793 158800
27575 158800 242038 244139 201793 113273 77346 124108 173651 175943 58476 14589 87360 127467
27563 127467 64700 25036 -134658 -73397 41238 72458 111631 146101 183061 161559 169968
27552 169968 123321 82834 52881 -1603 -66080 -117546 -90772 -39480 -90755 -138590 -83450
27541 -83450 -13604 -149693 -258046 -181363 -71793 -93777 -23573 178587 216907 163083 151110
27530 151110 1780 -107064 -43134 -62835 -167620 -127401 -90500 4489 61637 83559 31075
27519 31075 -50137 117390 146748 74115 -2725 45900 78263 23465 44155 27735 49938
27508 49938 63450 53068 212744 301133 186367 143777 146132 37118 72853 27063 -112404
27497 -112404 -142273 -83387 -76925 -152224 -91331 -91148 -89644 -104128 -54732 111257 -12524 -9633
27485 -9633 106430 118583 123776 41233 82417 154353 180845 220235 128622 -50697 -8131 79000
27473 79000 80908 14906 2237 118905 74944 -24674 -32614 13261 -7751 1884 -68840 -28830
27461 -28830 71616 155717 120286 23345 58549 9888 -33610 40117 92815 129227 95557
27450 95557 3724 -65759 -120188 -89466 -50380 -52121 -59926 -94021 -109856 -159646 3200 70234
27438 70234 127971 158897 221385 221456 101161 108553 177496 92022 6873 5811 152745 203952
27426 203952 178902 41103 -45813 -113360 -156564 -142026 -72278 -48893 -83295 -39829 33533
27415 33533 23081 8209 129814 31029 -125181 -44060 47005 88062 57739 58457 -23714 -119214
27403 -119214 -91755 18607 77916 142523 106963 74157 -109586 -159328 -97303 63631 105171
27392 105171 28387 25755 -25500 -4183 105564 86736 80982 107797 150225 112907 132937 54186
27380 54186 -20034 -13453 -29364 25649 88395 110612 -6511 -114556 -185227 -76944 -90125
27369 -90125 33386 46359 81376 138006 54248 -52563 -85445 -57476 -116555 -266184 -246022
27358 -246022 -135662 -128380 -104351 -151007 -129577 -108389 -68212 -57193 -65155 -134350 -125390 -64652
27346 -64652 42822 -15762 -79719 3309 -17355 -42930 -42369 -109744 -86641 -39703 -19025 123869
27334 123869 125392 80351 145193 214088 133298 27571 84280 153014 146682 98496 158403 121348
27322 121348 38092 -3051 81960 260877 238701 179929 89804 19574 -34803 -61650 -8908
27311 -8908 -80234 1615 -392 7947 -8165 70593 104124 104186 73057 -37073 -3214 17972 33838
27298 33838 64718 -59717 -96601 -17901 -15647 -17530 -30266 -14329 62786 135635 169004 51097
27286 51097 -14763 40453 39801 106335 123851 80800 -71922 -43110 33488 48407 36732 7719
27274 7719 -54340 -59022 -92208 -54855 -66101 -32516 18869 69499 27934 -26453 -108318 -215141
27262 -215141 -221120 -59914 -50786 -151697 -305055 -285499 -204767 -34523 11493 50361 115539
27251 115539 13684 -6445 63949 1588 28586 121877 52854 -86276 -207875 -160840 -72244
27240 -72244 12 109812 76346 48707 157507 212079 250105 283746 259150 194770 76860
27229 76860 -76006 -10616 143329 164877 119103 22283 29615 -71221 -61232 -25264 54489
27218 54489 46187 82100 59070 -47098 -75223 -4118 -60573 -97011 -162068 -300401 -296086 -283537
27206 -283537 -251042 -231187 -78426 -8290 -61996 -148002 -23839 20575 -72569 -93726 -90192
27195 -90192 -118306 -204671 -268666 -260205 -137739 -53324 -92459 -109769 -29566 52232 58984 170273
27183 170273 222509 95013 16279 -78629 -3778 116074 198974 38095 -23621 136020 131522
27172 131522 72612 29046 -4879 55381 95679 54531 4148 -66425 45224 114059 117498
27161 117498 51848 -62991 39010 161786 106434 15672 9526 -32540 -16403 -6160 -29485
27150 -29485 4946 62470 39448 -29954 78301 104885 -17631 24195 80280 84220 99341
27139 99341 145223 98599 93061 128372 161830 126262 118759 63817 -11558 -7033 66899 37171
27127 37171 11790 55681 139546 222927 178185 78648 33825 -62638 -9516 -2983 87652 51661
27115 51661 83240 157104 23140 29043 110766 180824 164632 55367 -3516 147773 196158
27104 196158 210711 200508 30727 16797 31471 9165 -17182 -78769 -86204 -56755 -71708
27093 -71708 -62033 -36285 -2656 13935 11096 31288 8695 14054 8784 95364 143015 45149
27081 45149 3654 -40486 -25519 -113042 -83409 -129860 -138353 -6255 -32114 13134 -93086
27070 -93086 -58903 -35796 -20855 21309 -22072 -22897 19246 64480 -14970 -110617 -144039 -145717
27058 -145717 -44249 -79255 -124258 -248660 -281108 -189170 -38000 -5528 -55008 59628 -10186
27047 -10186 -81060 -27134 53514 8849 -18071 42750 66484 53005 45240 -13610 -14063 4373
27035 4373 8804 -8032 -15585 77836 89780 -45166 -201185 -134111 -117091 -98011 -73983 -124354
27023 -124354 -78439 -28079 -112186 -57061 -2952 44433 105511 194414 140306 69785 4495
27012 4495 49858 170664 211117 60675 -10891 -47159 -39761 32660 81747 37820 72204 115950
27000 115950 109294 18332 181779 193571 242348 185812 182036 205828 216133 235049 89846
26989 89846 68416 -9907 48360 132923 188478 83926 107338 2481 -99425 20107 178217
26978 178217 123974 99706 55224 117255 55363 -10676 96137 121728 150391 158629 164961 185078
26966 185078 115504 141195 36944 -50547 -192580 -155441 -146803 -14512 -79795 29792 134788
26955 134788 103622 -35772 -38949 35319 15461 125014 146594 155959 259805 260033 176030 184261
26943 184261 270299 181065 80386 -9119 -74468 -27591 -112048 -106989 -14510 50574 -55528
26932 -55528 -72630 -15190 -30046 3857 19690 14464 -18304 -5492 69392 108492 100107 184715
26920 184715 222584 93718 -63652 -43995 -72124 -125913 -75540 -135222 -181764 -89247 7667
26909 7667 153148 150229 152575 39175 -93289 1404 130837 211585 190111 68613 23908
26898 23908 -40079 -46571 -45507 34851 76887 36300 7768 63624 -7560 -3176 99088 117874
26886 117874 14134 -138877 -117802 -18817 -48972 -173236 -163672 -82837 -74259 -127697 -78564
26875 -78564 -51655 -48133 -68783 -141074 -87533 35378 -69622 -63868 -32834 1739 22558 110020
26863 110020 50834 99751 79036 -48054 -93087 39675 -35266 -85539 -128404 -173177 -108339
26852 -108339 -208322 -210516 -122376 -9890 23307 49663 225992 180154 36067 -34776 -48800
26841 -48800 91996 41935 -29312 16214 -115332 -248657 -185729 -35380 50259 24624 -37694
26830 -37694 -35732 76580 73870 124409 107825 -39066 -11688 8328 -72023 -139609 -422
26819 -422 83957 40463 43320 11476 -10279 48076 153280 113066 -4048 -18598 -41844 -50253
26807 -50253 -87977 -11032 54220 1060 -16347 25008 42095 14061 -49861 -118902 -52221 -22593
26795 -22593 34404 134682 123604 115114 142173 237122 109495 -58335 -94756 57562 120837
26784 120837 125413 40751 152190 123026 141527 96338 -120665 -81617 -117788 -140889 -25933
26773 -25933 4314 -45389 -43616 -168360 -197840 -194149 -329918 -357197 -314612 -185913 35385
26762 35385 -4609 -25799 67084 45797 -39038 -37714 -102102 -150934 -33997 16913 -27312 -143958
26750 -143958 -56950 -72084 -93074 -96191 -39469 73541 142980 120751 109407 105777 129090 121137
26738 121137 158403 195490 165863 69056 89888 6747 -15653 41010 71204 47516 71796
26727 71796 60264 6186 10475 89985 91794 -7059 -108918 -100660 -95059 -114392 -79891 -58243
26715 -58243 -45586 -105516 -33532 -101992 -39523 52604 44049 127517 144212 -30485 -76334 -87292
26703 -87292 -73870 985 111187 128477 28683 77393 75000 32817 42975 29775 -281 -16309
26691 -16309 7237 34673 108907 86064 52850 -66995 -171046 -158722 -54301 -41960 -1590
26680 -1590 49772 20777 -15048 59334 52623 -7313 -55579 42269 80246 39034 13413 21588
26668 21588 16228 11845 -130184 -103354 -143534 -41881 80419 -37189 -146845 -118987 -205304
26657 -205304 -206433 -172498 -109939 -88410 54100 52805 -25207 -68873 -117786 -169647 -88509 23166
26645 23166 -68424 -5437 107387 91830 -17329 -46845 71731 121970 10627 35468 -50801
26634 -50801 -120642 -219293 -209657 -199800 -107542 -1035 131754 126340 105870 42295 -35476 -118398
26622 -118398 47567 56706 42271 48656 75774 -35132 -21693 7957 -36025 -67600 -23233
26611 -23233 1940 20090 -6121 -62495 -161130 -181560 -98698 -154191 -263436 -236829 -251104
26600 -251104 -126488 4374 19491 84135 -80771 -230809 -89219 78548 -19621 -138823
26590 -138823 -125643 -45205 -81019 -122491 -149304 -129066 -27143 -14904 -116221 25831 68368
26579 68368 -3046 -25928 -17475 -50556 9688 47067 69771 37132 9330 -12593 5621 72773
26567 72773 115291 5309 -15259 -67685 -70704 -82130 -40317 -37163 -30297 144163 243208 221406
26555 221406 90756 -46230 -59585 -153830 -156129 -84341 -37998 -3775 73305 16818 105124
26544 105124 87368 62355 82761 15819 35556 117193 178369 199117 232400 65397 31115
26533 31115 96384 53092 159287 220193 258218 287354 349364 211263 -5454 -158199 -199882
26522 -199882 -107132 1101 -36893 -105303 -241926 -181195 -145899 -170139 -21864 95608 23188
26511 23188 -124176 -91670 -19821 66835 -40120 -83191 -142302 -201500 -199456 -172498 -16564
26500 -16564 -13338 27374 115625 17561 -131887 -58312 17361 -26918 -93514 -69702 -82244 -215820
26488 -215820 -175267 2831 -8842 -90504 -31774 18797 31029 -71131 -142652 -122623 -38416
26477 -38416 -52194 -53655 24958 14160 -29256 -43198 -78558 -66164 -72860 -26262 111965 -28816
26465 -28816 -115864 -14488 44964 -7750 44083 187289 211288 118473 -31594 -56061 30732
26454 30732 132516 123123 84022 104011 91578 4699 -62299 -5539 -32437 21632 27277 66574
26442 66574 44270 4415 4754 -72284 -36445 -14199 -22283 -12602 63878 10881 -3591 -109536
26430 -109536 -175940 -30120 48467 132015 190210 118313 -101736 -165505 -29481 10689 -37860
26419 -37860 -131939 -116107 -53382 -15050 77791 -21 -69049 29526 -11155 -127868 -59884
26408 -59884 32324 88538 105783 96027 101640 15754 -19362 -126763 -137390 -178514 -88180 -7954
26396 -7954 -67848 -200854 -218112 -111377 -84633 -101450 -154565 -90161 -84943 -42867 -8380 -20253
26384 -20253 -67497 17072 29035 46884 65263 43605 -22975 -35213 -31335 43189 17960 4392
26372 4392 -15099 -62415 30744 55469 18707 -13107 130987 136737 116958 95056 42725 102422
26360 102422 246429 232942 241818 273340 236197 180558 60376 55563 29855 8122 97076
26349 97076 105409 53237 -51142 -29562 -119715 -160232 -44633 62694 68537 -41638 -122306
26338 -122306 -152700 -66008 -86493 -66980 -152198 -152343 -173829 -122679 -151675 -2818 113816
26327 113816 170278 186437 84796 32822 -7680 72093 34856 65336 58656 125174 168298
26316 168298 34346 -76774 12444 150072 54745 -45337 -94714 -214898 -124511 36614
26306 36614 -12314 -28026 -27545 -32155 -68420 -64564 52943 10571 156380 276968 192094 100679
26294 100679 169584 156430 126981 133917 122558 86196 10284 -59137 -91211 -16986 66650 59734
26282 59734 104359 83575 75710 56343 18683 7293 -118718 -203338 -102560 13846 22653
26271 22653 94920 144330 44517 88474 5293 -134385 -160851 -73080 -114666 -210782 -95926
26260 -95926 -40483 -66035 -56402 -58022 -72946 13558 68590 97340 92916 108044 164846 255362
26248 255362 232630 100671 129017 91888 85614 100356 219373 141131 80170 -14475 -142846
26237 -142846 -172504 -70830 -97590 35740 70006 -36371 -184731 -196290 -115616 -120017 -69082
26226 -69082 -37367 83264 130046 160251 117076 -68850 -102629 -141649 -159733 -190175 -128975
26215 -128975 -28494 -14989 -131621 -287103 -397997 -336945 -258023 -257186 -262266 -193459 -98850
26204 -98850 -43887 -467 -24613 -64384 -31986 40557 37255 15823 -42679 -69589 -92344 -82667
26192 -82667 -70068 -10386 -58563 -7022 18349 -7227 -119221 -252668 -272312 -255398 -189803
26181 -189803 -78809 -76723 -21024 67524 107287 134057 39102 -2195 33755 -9259 -37834
26170 -37834 -150757 -134274 3175 29175 -3470 -37056 -92454 -7336 -67423 -3571 -1946
26159 -1946 75145 83366 -215 52348 91287 158759 23596 13573 23932 -33154 -19435 -36497
26147 -36497 -205488 -226642 -159697 -31120 152039 64834 37704 -5826 -57936 -7785 44834
26136 44834 37129 65246 68818 -5629 9523 76333 161585 183707 116110 180098 75902 20129
26124 20129 -20448 20428 172527 198756 112153 -17598 -100637 -198389 -194461 -57137 -34267
26113 -34267 -9825 -26470 -60773 -77622 31674 -21726 -30301 -36835 40855 101809 165619 74455
26101 74455 -13178 -25532 80456 133783 100228 118806 107950 118985 76668 7187 -39319
26090 -39319 -132659 -65053 175900 261449 191959 19929 -36172 -79038 -94430 -131119 -140407
26079 -140407 -39724 95473 201499 251545 124757 61959 76787 114712 126185 192837 123526
26068 123526 58910 99787 80805 145172 109142 162321 245215 179866 169730 151457 47955
26057 47955 72765 83172 -69133 -140255 -219579 -315286 -308314 -246672 -224348 -127667 -98222 -67589
26045 -67589 2800 -30196 33325 33357 3445 22716 45754 143638 197175 212590 112654 68488
26033 68488 -11588 14945 49238 -58404 -129087 -93826 65563 156480 171364 109489 134610
26022 134610 35685 106066 104681 98505 88403 40605 -47146 -206473 -225027 -169408 -46351
26011 -46351 85653 170927 286096 225795 198219 229709 104739 -28905 -140260 -81734 59730
26000 59730 132507 66755 -42172 -58225 -60398 67512 135572 235207 150315 60618 29682
25989 29682 61973 15557 -23989 9308 74738 -30091 -193354 -179106 -11294 172759 196462
25978 196462 93713 9541 -7253 35325 -14443 5310 65733 154322 95020 -18093 -33644
25967 -33644 -20077 -60934 -11750 21847 161344 246370 322941 255063 136947 122214 101978
25956 101978 23506 4875 -23109 -62145 -94937 -164359 -78368 50826 31420 146771 196910
25945 196910 15738 -118666 -57640 13561 35142 60561 89094 39400 -27304 -54631 -48331
25934 -48331 -49433 -9614 -150079 -173249 -80423 -41310 -116912 -177053 -80394 33444 39037 -16016
25922 -16016 69338 179799 169205 104237 -4824 -92354 -116249 -62037 -56166 -68115 -76075 5004
25910 5004 165610 106334 -81025 -97962 3845 88308 120262 73785 102073 33220 -21019
25899 -21019 -60238 -124633 -116007 -99985 -106453 -133317 -134373 6465 27414 34747 60713 71757
25887 71757 16793 -92429 -450 104875 110904 89509 38283 33751 44027 35704 49944 68797
25875 68797 -31864 -151870 -127222 -99777 -112828 -73329 -48909 -21951 89944 258950 169313
25864 169313 63871 -54455 -109594 -61737 104490 182487 184535 182045 187828 173411 158384
25853 158384 156711 105185 35445 776 18447 115117 288877 342943 269022 148836 72024
25842 72024 135752 139998 126589 113535 77245 77986 172499 230718 286357 219256 154920 95731
25830 95731 -2985 -82363 -27317 -12926 25463 76298 139098 161355 182691 121355 12768
25819 12768 -33793 -104082 -98428 -41557 -86870 -168388 -121405 -91778 -107321 -77718 -158075 -136270
25807 -136270 5303 196986 151182 210079 235856 131085 45989 138052 80633 -58871 -70789
25796 -70789 -24933 58788 70970 104829 -81590 -89344 -61696 -39176 18393 112283 109684 10617
25784 10617 26693 -28122 -63810 20486 89277 48479 -29408 -163602 -129069 -106281 -122807
25773 -122807 -126408 -28006 181 -81204 -124467 -57978 80034 84128 143257 135385 222901 195557
25761 195557 123813 90335 112895 10976 76288 31114 12765 119379 168091 184322 147376
25750 147376 38350 68713 48480 89478 51986 -59266 -68562 -94519 -131977 -223386 -233610
25739 -233610 -181146 -121766 5079 -58620 -225290 -166992 -71857 123400 296921 344385 376365
25728 376365 320651 301251 309776 231163 53368 15081 27245 81628 33690 137879 208437
25717 208437 161343 2812 -32740 122494 165828 109359 -96860 -147467 3121 74570 83351
25706 83351 160416 166126 218022 147394 67658 13916 52683 590 -28843 -52535 12064 78485
25694 78485 162771 241425 245089 218768 86337 96638 137254 73843 -40690 7121 -23502
25683 -23502 4229 -34102 49116 200140 248614 140931 19105 -126765 -40638 186081 269715
25672 269715 114985 -13194 -23385 -24420 13257 97299 12420 118695 127775 143599 159801
25661 159801 230881 208120 67133 -18834 -166399 -205709 -194314 -127740 -31503 -45833 -17015
25650 -17015 82379 174237 134677 16447 12227 107673 113177 45227 3312 -48311 -48326 77265
25638 77265 -39227 -159609 -90399 46275 110559 88261 60583 74180 89450 145691 164272
25627 164272 181054 209006 191601 205855 141869 75106 143709 163823 227504 168061 90605
25616 90605 170031 132249 125720 74206 25135 35898 133869 283154 253888 210313 67107
25605 67107 -42070 -180399 -136618 -45981 126314 154986 102409 17103 24632 111069 104253
25594 104253 91555 210099 192708 22752 10201 140384 117011 130149 116649 165703 133231
25583 133231 58865 60222 149069 79001 11298 71389 29551 -99276 -42916 -13899 23738
25572 23738 -18903 -164083 -194638 -152286 -21247 25178 -104451 -125610 -158996 -130570 -183074
25561 -183074 -127876 -80503 -18190 -35902 -56336 134659 156492 109078 69421 309 19315
25550 19315 59951 64271 27889 -46087 -16217 -59240 -95840 -140421 -160902 3791 -34239 -31878
25538 -31878 -10265 -21342 6334 72436 -8011 -32873 33221 12233 -4628 60819 83731 -36814
25526 -36814 -153506 -185287 -94337 -107668 -13350 27133 58767 37324 36317 19879 -69524 47384
25514 47384 8189 -27810 1821 26253 -41320 -44289 -27142 86572 159721 130228 17176
25503 17176 -145568 -181549 -112101 -22310 154443 108166 25476 -109025 -67324 -26787 12843
25492 12843 -5858 57139 -38682 -134706 -49162 63259 7405 -107023 -167382 -205160 -86820
25481 -86820 37223 24348 20515 32890 -16563 18896 -19466 33991 77461 92512 135982 239404
25469 239404 149004 62691 154386 266256 191442 201697 54859 56217 92244 95745 54630
25458 54630 22223 98191 118965 111445 37412 -9804 -26282 9872 174971 153328 153150 140600
25446 140600 82351 115867 66406 24650 -13602 -16407 -15045 16164 255315 205992 48164
25435 48164 -44911 -34928 33162 28709 -82319 -245731 -348901 -272349 -132799 -117789 -79445
25424 -79445 -51025 -84748 -1998 10946 -27591 -25921 -16866 -103422 -69236 -47668 -45941 69853
25412 69853 66383 62294 -19275 -79714 -49675 -19879 -96830 -72009 -9597 -66303 -163838 -116876
25400 -116876 2942 36144 51376 40759 62799 176007 168411 155166 132953 163513 56756
25389 56756 1263 4707 -1407 -30621 -143454 -95575 -143203 -168644 -9607 30620 -80133
25378 -80133 -221917 -177617 -115049 -53810 -27435 -74827 -156304 -158932 -114254 -8849 -91143
25367 -91143 -158518 -153554 -86791 -110854 -135141 -132839 -35380 6614 -44571 4243 104112 71272
25355 71272 53163 -30139 21421 52977 47027 41800 93409 97902 74514 164173 207233 86558
25343 86558 -32539 -33416 -10710 60072 48758 4347 37099 29324 -1761 41505 13129 39442
25331 39442 108911 83777 -121994 -187274 -100207 -41723 118316 138829 -10343 -2115 132765
25320 132765 90944 -18057 -25674 85690 81813 46110 20621 56386 -12273 -61277 -52615 -141346
25308 -141346 -198783 -135734 -205419 -151966 -100260 -36040 -11575 -126933 -122059 -71287 -87417
25297 -87417 37456 83577 24197 41284 85496 53018 67345 97767 166953 160583 78767 -18021
25285 -18021 -144467 -154547 106136 209311 109471 92547 136410 131089 31343 4211 16814
25274 16814 24645 27402 -20679 -8249 34638 147477 113598 18240 133187 177251 110484 81422
25262 81422 188916 -31927 -156002 4324 857 -57510 -36633 2211 -56464 -45087 102810
25251 102810 79110 -16318 -101908 -138641 18900 92931 81879 36129 28720 -94559 -227204
25240 -227204 -355221 -347327 -318223 -195220 -70070 -27433 4189 -10066 -105545 -111481 -133631
25229 -133631 -233018 -249320 -225081 -112571 -50308 -55682 -87453 -114741 -74301 -64844 -42112 -30244
25217 -30244 -38224 -23072 -92949 -177622 -152879 85459 130754 31862 24392 -41662 34520 64940
25205 64940 189154 218609 171322 130050 87029 140032 90589 77647 71625 118189 76189 33913
25193 33913 -67416 -123887 -170952 -80454 -6779 96302 102761 87328 114301 140439 17201
25182 17201 -78975 35804 116603 57002 3357 31097 10288 -70142 -62039 -56893 -90316 -72188
25170 -72188 131425 305797 157528 71632 112811 163238 76694 92925 147078 71308 -28536
25159 -28536 -55540 15102 -13571 9149 -18389 -23820 -92768 -47572 39023 194322 254874 202323
25147 202323 282193 324273 203131 72754 115635 94087 -10478 -29475 -165213 -166051 -95057
25136 -95057 -96043 -161790 -187342 -133045 -67101 6251 12841 86232 -29073 -99949 7021 182454
25124 182454 212462 119139 -70897 -83248 -65678 -103538 -68193 -38751 -58290 -17213 -58282
25113 -58282 -82821 37295 76454 54007 76806 39141 66754 93556 208755 285598 215212
25102 215212 251264 312937 207777 130651 134738 126331 201443 136821 21824 -24782 24027
25091 24027 -39138 -119990 -40246 -102478 -200202 -125257 32440 76975 145397 278870 332514
25080 332514 207011 191868 107985 -18559 -76895 17618 111199 70620 145894 160945 82079
25069 82079 85513 104141 131775 175430 183868 80405 16625 5719 -42488 -40451 -2469 41204
25057 41204 -1750 -22499 -78305 -32815 -82 42563 39840 -152884 -167890 -83271 -43443 -73125
25045 -73125 -6321 40773 -44809 -26501 -6969 14126 32686 112715 21542 -111503 -103517 -38464
25033 -38464 -18715 -91506 -192656 -217586 -322208 -397817 -309911 -120489 -90229 -82458 -78556
25022 -78556 -114556 -137255 -163466 -165884 -81963 -19808 -2507 -61113 -114014 -87513 -178948 -165417
25010 -165417 -60385 67522 153399 155740 160528 142348 45267 33196 111625 171450 175017 218939
24998 218939 311841 196750 101715 100813 67225 -53457 24520 118640 32265 -57666 -52451 4942
24986 4942 -11924 -10357 3535 6433 5198 -84911 -156464 -117659 -59210 -67538 -196639 -138547
24974 -138547 -112099 -72039 -16844 27266 -123235 -89756 31667 1220 -53109 5844 17072
24963 17072 -74119 -152644 -116028 54561 109707 113780 99751 67954 2151 -4263 -43254 -47333
24951 -47333 72380 87563 19174 -49928 -40090 -8517 -7444 22887 42542 -69992 -102394 -44767
24939 -44767 21468 56913 -10376 -64051 -107942 -137729 -237112 -193062 -55150 -22995 -102485
24928 -102485 -93576 6239 -56091 -75573 968 68696 889 14124 20947 26552 12830 -9014
24916 -9014 138416 112845 27084 20695 -17725 48100 74946 50841 -24012 -8156 32817 33008
24904 33008 13771 -4670 74924 -30970 -101628 30774 69967 80272 -33655 -42018 124929
24893 124929 128284 59823 5810 138616 154895 34082 -73267 -86056 50113 122893 93011
24882 93011 76995 -26473 -27050 109527 220169 283105 296554 305552 107335 -18508 -17757 -7347
24870 -7347 35961 57631 -50520 -49013 7390 -62210 -62299 -192223 -178046 -87679 -121852 -112237
24858 -112237 -72681 -4384 21165 -105230 -150470 -38111 16048 -45444 15592 -17561 -27861
24847 -27861 -70161 -19844 98097 55168 -7874 -7559 91242 131285 -59829 -72790 44977
24836 44977 172472 174914 -43511 -167070 -238745 -197296 -64970 -35906 19441 -53131 -186493
24825 -186493 -197420 -186519 -164328 81870 169595 41528 -52487 -62681 -24789 -60344 -106812
24814 -106812 -116679 -53972 25108 67206 69990 -52380 -118146 -47698 14963 36999 103032 145260
24802 145260 40028 -26609 36606 -57877 -129678 -145046 -32584 49145 111195 46326 -136816
24791 -136816 -133117 -76743 22528 67287 13064 15012 -96576 -132191 -169049 -150847 -49996
24780 -49996 -107730 -71995 -109653 -252534 -247622 -70385 34518 10885 88990 67773 65705
24769 65705 39307 -73822 -103511 31334 116650 106734 94216 71140 54465 -59308 -200443
24758 -200443 -151033 -36147 -39452 -87784 -41422 -20550 -41867 20198 71535 176854 155386
24747 155386 53839 -56972 -36107 -58066 -62143 -16854 83489 145498 -78300 -73407 -33082
24736 -33082 52691 93254 171366 155754 29882 -55933 34315 27193 -103294 -224617 -290592
24725 -290592 -174461 -78934 -57457 -90326 -179750 -285239 -211350 -76541 -47094 -15911 -47280
24714 -47280 8430 126902 15707 -7353 41617 59406 25822 56757 100331 95635 67504
24703 67504 123930 292240 266261 116971 -60045 -74104 -65011 -168112 -218249 -156885 -179771
24692 -179771 -180837 -208094 -146641 -100922 -2732 -11118 116550 98613 -22662 24856 -31329
24681 -31329 -44721 -26892 -50604 -109998 -21675 -9503 -80230 -64578 -132608 -73348 -66393 -107305
24669 -107305 -139854 -159261 -27633 -48996 -169230 -89416 61475 140008 71477 72158 92023
24658 92023 72379 -27089 -176251 -155921 -180168 -93567 -145141 -156475 -148343 -76982 79186
24647 79186 -24401 -114518 -132885 -65286 66923 145300 63962 41007 108719 163223 287114
24636 287114 89770 21177 130586 153443 64115 83555 134100 176012 174196 204651 144222
24625 144222 -7048 -33629 -46012 160 70929 104915 94167 39280 -18339 17306 39533
24614 39533 36877 156145 136470 60367 62268 171981 106974 46561 -91827 -29281 -32681 -170741
24602 -170741 -95807 -29532 -40030 -6245 -37024 -155687 -46969 -36287 -66706 -1199 40994
24591 40994 123013 103064 20072 -30260 -100139 -242511 -303767 -225570 -82619 -4205 3320
24580 3320 -35360 40690 141214 108696 167099 185769 43073 37345 -23877 -67154 26863 15605
24568 15605 -939 -108784 -77657 -88757 -79894 -52816 30264 118982 196696 107637 46500 -77335
24556 -77335 57407 202444 179899 95981 78863 13119 23087 15121 13143 19222 7740 -45450
24544 -45450 -103148 -121690 -122477 -140722 -48200 -28142 -4123 -53097 79546 109677 87861 59602
24532 59602 179514 99842 67093 135524 309303 226653 67972 94317 106959 80602 -44497
24521 -44497 -111873 -27221 169089 157642 161439 60611 2606 93660 165904 171426 101306 128121
24509 128121 63502 901 65193 166479 137582 117037 -23608 -72711 54100 110803 116291
24498 116291 113501 47907 -50705 -164527 -136358 -27756 -14176 5131 190415 209426 -19075
24487 -19075 -183465 -177609 -104746 -13964 138512 69112 -27971 -51696 84031 87565 -37203
24476 -37203 -85734 -48085 220903 331860 324741 269573 231799 174400 103699 173305 163809 60318
24464 60318 22287 100023 36458 -3442 17563 -28752 -32280 -63246 -54488 -21025 -6946 -82928
24452 -82928 -94704 -27115 29736 -41390 -135615 -26261 -3862 -81773 -59830 -20703 -29940 50334
24440 50334 8315 70260 128656 121336 153049 179661 148587 51337 52608 -66625 -42150 -27781
24428 -27781 -34602 77150 141073 20648 -90861 -114237 -100237 -88681 -174663 -184256 -83456
24417 -83456 29998 84358 63738 105940 56503 6623 -121794 -147812 -100395 15509 140271
24406 140271 21834 -95943 -8307 89634 136554 276404 219580 36441 -12847 -34026 55629
24395 55629 45227 -61086 -108645 -14109 71236 67668 67451 47811 80223 82258 136039 155522
24383 155522 121065 -52096 -77131 2284 53344 57515 34012 -94735 -66803 47676 148543
24372 148543 155462 204293 119384 30133 -12095 108305 128482 22664 -126736 -81051 10330
24361 10330 6816 -11962 11083 106316 127607 102397 23444 25949 96919 27032 -11446 -21233
24349 -21233 -57518 48916 -66179 -124306 -133444 11680 -4615 -21283 19598 79624 98606
24338 98606 114640 40274 -17882 48687 113131 -113556 -189387 13129 84456 217934 233882
24327 233882 76867 -5843 19216 12091 -41944 11181 97681 119469 174275 174211 172005 69911
24315 69911 83579 -10155 16215 73997 109272 37449 86471 86195 -29291 30767 2890 113185
24303 113185 262469 319181 271382 256387 200291 65368 -158125 -194312 -70423 -28937 -55873
24292 -55873 -145685 -173611 -75112 119431 92466 110251 140799 110349 119246 186758 184322 217410
24280 217410 179820 173752 121195 45312 -69465 -41306 -13343 -10245 -48893 -18873 -42534 -92010
24268 -92010 -49372 -58686 -54790 -165955 -135988 -117937 -48466 -63826 -49968 -5960 52182 -19181
24256 -19181 -98108 -66307 -9993 58553 34413 82032 75159 8931 55913 88575 50749 -74686
24244 -74686 -103323 -60250 -52934 -50538 -58087 14524 56421 -35389 -69599 47628 73855 80961
24232 80961 36854 164485 86134 65756 -23825 -41092 31211 -10205 58885 78242 132940
24221 132940 91878 14645 -74024 -264011 -358518 -164328 104857 53243 2805 -5084 -26638
24210 -26638 -39831 129148 192387 253234 190935 12463 -35667 -32217 -13102 -86445 -124197
24199 -124197 -166954 -157125 -102592 -52299 -68768 -167951 -185065 -130012 -74814 -54178 -82879 -110594
24187 -110594 -50512 -21681 9461 3451 -9563 46527 162479 208219 131795 31450 -28645
24176 -28645 -124969 -140675 -109471 -47308 -60570 -110033 -161271 -87394 11321 -71687 -125938 -83026
24164 -83026 -3169 8637 14317 -2857 -3443 -88178 -55863 -92918 -73505 28151 101736 106238
24152 106238 30493 35820 57917 34501 -67023 -82264 -48335 -35985 -15613 105398 -1271
24141 -1271 23022 147412 171488 160488 159819 162002 55053 -12692 43739 29550 -25180 7281
24129 7281 -2435 -5782 77900 4377 11901 55541 24913 -12939 -105633 -74393 -184581 -193635
24117 -193635 -205332 -126529 -40008 58191 65687 41836 29227 -10987 35898 13153 -35187 -120478
24105 -120478 -27787 -54500 -54697 52988 6605 18684 46026 -11678 -7187 11506 4356 -3272
24093 -3272 -11810 31361 18027 13256 -55032 -93633 -35670 46188 -62441 -36479 9582 -73778
24081 -73778 -148373 -275571 -160809 -74712 24062 132013 249369 181777 124069 100533 110687
24070 110687 94138 40328 79858 194540 216254 189873 92585 -6076 -86476 -96400 -30943
24059 -30943 44862 143569 227939 147101 -22852 -93166 -51458 7867 34439 -46945 -41287 -86152
24047 -86152 -155230 -178974 -213474 -144906 -202779 -196167 -184090 -148998 -25286 148088 -11147
24036 -11147 -192814 -182200 -72954 -77106 -124548 5487 18652 -101078 -123237 -132508 -151632
24025 -151632 -152650 -116307 -37488 85909 140233 240880 147962 87255 2103 -143477 -186219
24014 -186219 -146793 -81313 -8071 20245 -46617 -68788 -68809 65796 151481 204896 155768 140223
24002 140223 66450 144136 163330 146141 152063 49248 -99777 -179032 -189857 -169313 -249981
23991 -249981 -220671 -121984 -32667 -77326 -93263 -11520 -11401 -75090 -135934 -143940 -61024 -107276
23979 -107276 -183255 -221988 -151217 17656 14619 -47122 -140898 -164493 -30143 -70330 25277
23968 25277 92085 47728 40397 -56774 -14462 -120865 -170295 -109384 49698 -7881 -17665 60376
23956 60376 118771 -10960 -141489 -180553 -92966 -105919 18522 86508 56192 -53796 -71291
23945 -71291 87890 189532 215443 226504 129393 119071 41955 -15796 -43612 -115003 -23467
23934 -23467 -48757 -2279 13818 1275 -6353 17672 23947 -57310 32299 61560 -11985 -15043
23922 -15043 10833 12760 2794 -131819 -123919 -147682 -94863 -29097 -16182 -14854 35178 48222
23910 48222 1779 17079 -7638 4719 75962 28795 8906 -159468 -232289 -87120 28029
23899 28029 64971 60729 66713 -21851 46714 105135 117221 54102 24840 -117646 -162947 -101689
23887 -101689 -46028 45438 19924 77056 81139 15367 -59773 -78310 14094 88506 16441 69958
23875 69958 -22647 -100815 -97871 -88166 -213431 -278458 -323918 -213606 -50978 -22486 24076
23864 24076 -10629 -66399 -28229 -22438 -65434 3506 23923 38377 12652 -42080 -41517 -45437
23852 -45437 -127451 -46956 102189 66182 -57653 -197596 -156859 -136294 -93192 -69214 -6420
23841 -6420 -32814 -88791 -138368 -115853 28477 86923 40145 -18804 63191 69862 150181 159850
23829 159850 54521 34 67275 14540 -153288 -149553 -62421 -107521 -201893 -140123 -115874
23818 -115874 -49778 -24733 4978 -40212 -58218 -13859 27448 -2207 -7694 -76092 -171958 -105968
23806 -105968 -72624 -48795 -47538 -19674 156752 178559 10536 -81817 -36517 -21089 -140217
23795 -140217 -154834 -63949 85078 154078 139360 78863 -65653 -63644 -158616 -155008 -97621
23784 -97621 -81675 -89541 -39371 -27145 34262 62455 94907 -40276 -180966 -191233 -122860
23773 -122860 -51947 -31142 -82568 -34411 94232 106464 -67237 -94391 76461 60638 15919
23762 15919 5036 14709 58481 84978 76057 -14723 -38923 -58819 -7019 26199 75681 46944
23750 46944 8482 11111 -80412 -30877 -24049 -20114 -42018 -30962 -49290 -112667 -89689 -86387
23738 -86387 -102501 -95581 -155258 -123894 -84811 -151976 -130686 -94376 -10684 -51799 -96858 -70002
23726 -70002 -37418 89561 112554 47617 -83857 -211193 -201602 -146124 -43842 -35753 -66952
23715 -66952 -169078 -22060 41217 37993 -32460 -34404 53986 -19644 -5631 168 -153305 -76060
23703 -76060 71223 98653 81341 -50985 -122641 -91345 -15413 43884 34172 92277 57398
23692 57398 -22283 -33436 9367 -119499 -256297 -272715 -178849 -32264 -30143 -6321 47976
23681 47976 -46198 -18296 27541 76259 69264 39680 205805 208703 165204 -43860 -73970 -63564
23669 -63564 -61976 47925 100158 -61626 -147265 -225347 -273580 -198506 -78635 -5551 112880
23658 112880 124732 164253 207717 154515 -2143 -72834 -46547 -23196 -103611 -221046 -209758
23647 -209758 -261284 -232979 -123519 52469 166974 258096 133231 120810 45395 -147865
23637 -147865 -195046 -111755 -101557 -115368 -53440 -17535 1672 71189 56703 203 150329
23626 150329 159877 70248 -20030 23206 39131 12145 11698 -15156 -103191 -144272 -176975 -109403
23614 -109403 24858 61291 -6566 36553 56668 -4452 -89534 -63599 -93929 -107088 -76607
23603 -76607 -120989 -154454 -63949 68912 199888 106671 -9071 -83055 -188031 -197203 -225781
23592 -225781 -168002 -155543 -54406 -84416 -135380 -101729 -149411 -164946 -122789 -23412 8016
23581 8016 -10115 -30309 -95707 -68099 -139981 -43040 -4776 72510 157299 86732 55710 111282
23569 111282 214311 181084 81306 -34673 -31450 -37751 -53255 -150302 -240953 -219619 -174575
23558 -174575 -339188 -335575 -208077 -155088 -110283 -8517 -67713 -107358 -46534 -70570 -101498
23547 -101498 3598 40466 -57261 16388 25380 10829 -27753 22705 71886 94179 54008
23536 54008 116085 14119 -44090 -147 11969 -79655 14585 143744 96226 40409 54558
23525 54558 114890 129596 150589 75617 -67093 -46066 -106319 -243433 -171612 -64440 638
23514 638 -66996 -117875 -138327 -21813 171992 258203 224163 159615 94015 42454 54825 156498
23502 156498 184274 156724 77745 45821 18726 94246 97569 93975 -12221 -52064 59068
23491 59068 85890 38923 70432 218340 207110 172876 57484 72227 168436 137858 21347
23480 21347 -124922 -103611 115428 171830 82482 -171465 -304989 -238200 -173952 -126684 -162476
23469 -162476 -131027 -165534 -215379 -229990 -122423 -30030 -55840 -123632 -209297 -245237 -178105
23458 -178105 -70150 111721 134792 113088 136043 123054 7944 31445 20099 14497 58254
23447 58254 98850 107856 65920 -35535 -5014 51601 48269 35709 -87034 -98844 -61646 -16222
23435 -16222 -27693 -27677 26196 14318 96705 60140 -121291 -238643 -275609 -231828 -254861 -231939
23423 -231939 -236605 -112916 -14936 1539 7388 31536 -56205 -102983 7353 55931 74274
23412 74274 42569 -34256 -210602 -267507 -98156 95772 59844 -90083 -127398 -81370 805
23401 805 -8982 -55642 16241 202595 221882 252997 264450 300981 318186 279466 291525 249850
23389 249850 178886 158572 82121 3883 -54259 -156382 -89270 -43435 62454 35758 -42075
23378 -42075 -174120 -165709 -85945 654 46665 55394 104648 134727 76430 70663 183049 224243
23366 224243 208663 43021 -147665 -49014 57187 24496 -63104 -175975 -183072 -109213 -21026
23355 -21026 -123134 -56802 -71673 -25577 -69807 11729 29954 -52701 -118217 -109189 -2382
23344 -2382 -90833 -145116 -90608 -13834 29536 65063 64616 170675 124984 39966 -66139 -102156
23332 -102156 -55479 -122584 -181018 -179935 -102370 -226488 -344964 -326006 -323994 -253609 -59274
23321 -59274 43456 32995 123676 65874 4404 -7785 712 -13765 -75734 -82532 -103126 -139717
23309 -139717 -196669 -31105 46762 19388 74418 -29546 -25759 22165 66622 24466 -2247
23298 -2247 -24296 -10788 60918 70220 73642 55854 -123516 -96903 17383 126715 65367 6350
23286 6350 -69499 -112230 -98790 -94344 -71867 17935 108947 204427 140685 39251 6149 -57310
23274 -57310 -143002 -296953 -304790 -63929 44742 63601 12163 -31185 -148673 -179921 -171111
23263 -171111 -104243 28474 30452 45515 55094 33991 -19513 -55430 153396 23515 -31809
23252 -31809 8688 8813 -4335 -77864 -125069 -169577 -152662 -75152 47011 -66949 -130492 -124703
23240 -124703 -33071 14883 -24086 -11031 36188 136504 172032 111800 51085 6234 125916
23229 125916 65221 104370 95692 -45660 -76518 -47711 -49661 5355 43497 64583 11852 -101266
23217 -101266 -20752 76595 84917 106722 60919 -11005 -17562 -101930 -109791 -105515 -99995 -20789
23205 -20789 87090 99057 47691 -71055 -91825 -134104 -126835 71081 91618 63935 -53133
23194 -53133 -161294 -133296 -116159 -220960 -209674 -3864 78010 120652 136164 108973 118067
23183 118067 142787 91934 -55414 -181596 -24855 -37296 -50996 59652 190733 158425
23173 158425 172152 123135 68116 38918 84766 -11641 -134985 -58911 -42644 -145655 -114858
23162 -114858 -137054 -141497 7756 -43641 -41934 -192748 -169634 -11124 195419 171393 113130
23151 113130 139580 172938 295812 209548 95771 149530 165137 142669 21006 -975 -111810
23140 -111810 -229564 -129168 -97604 -71523 46175 104928 126099 103083 68661 28036 61
23129 61 98105 163806 101040 115022 110274 74933 26029 19621 107786 244140 150970 96800
23117 96800 7794 -104379 -111130 -76224 20865 67586 31158 -108675 -15648 -892 -40458
23106 -40458 -54896 -128239 -26425 67345 100377 137021 151850 36667 36930 -25379 -82620 -125838
23094 -125838 -81646 -58764 -74441 -43780 -28563 -55434 -77389 -70026 -25550 23813 -51753 -49798
23082 -49798 -22051 37821 36060 23189 -56706 -126894 -38560 -96732 -134028 -131560 -54086 62095
23070 62095 71254 58208 71265 64048 -51407 -152115 -107310 33821 -41023 -175244 -79814
23059 -79814 -29713 -90064 -82345 -128753 -212752 -154350 -96219 -249800 -329686 -252817 -179346 -167471
23047 -167471 -79597 -44237 -2134 21077 51173 -7695 -129364 -295564 -372095 -236453 -58926
23036 -58926 62221 -67280 -171189 -62578 -16086 -33871 -11965 -37655 -154375 -72850 -103902
23025 -103902 -208211 -116005 -18117 55462 26100 115895 132582 132436 120711 158292 185674 161786
23013 161786 -19914 -59896 -171679 -120157 -35313 -21930 -171416 -208437 -64346 -99022 -25554
23002 -25554 4352 -60309 -73675 -96363 16113 60920 19573 -44213 -32442 20515 -40895
22991 -40895 -59236 -19796 74359 111116 98774 238689 194766 70087 71763 201559 262971
22980 262971 174268 152586 -48083 -143542 -137225 -44942 96516 125486 136371 69422 75167
22969 75167 25630 -7438 8548 29257 113289 95599 -17526 12384 39573 90193 119454
22958 119454 187533 145170 63944 -18224 -105502 -44558 30033 -9251 -24906 -3624 27087
22947 27087 -3744 -107417 -145334 -77406 -68739 -63797 -107996 -161027 -199328 -160069 -19276 68179
22935 68179 -11126 -101802 -145450 -174345 -85612 -1826 42083 32196 53844 3747 -126684 -135584
22923 -135584 -197685 -277689 -204956 -176984 -183874 -137830 -169488 -182232 -197205 -199184 -157503 -111617
22911 -111617 -31547 -61901 -48465 -73613 625 -27722 18008 51928 168605 126395 81244
22900 81244 -26474 -39952 -92760 -11616 -43240 -26886 55483 23268 -23682 94067 204551
22889 204551 142014 40126 -146879 -146894 31456 -2244 -28793 -20824 -41172 -74044 11969 58055
22877 58055 -15233 -83750 -97797 -106090 -29982 -25519 31394 -5462 -84656 -18176 198727 278693
22865 278693 124495 58787 12645 -73295 11612 112723 49993 -2380 -5249 -59656 -97587
22854 -97587 852 65393 157664 137473 255 -17049 -38170 -132266 -102042 -96420 -79869 -28947
22842 -28947 13980 33106 50495 72650 114733 18049 -125690 -163679 -227501 -163676 -82780
22831 -82780 -69825 -59853 28466 30650 -12291 -36419 -142297 -152646 -129336 -133167 -17033 -14609
22819 -14609 -67035 -68613 -27263 -50830 -52669 53133 83721 37378 6044 62289 24368 9019
22807 9019 39559 27268 20618 38335 135431 51155 -2080 39063 131122 50447 116978 197855
22795 197855 162150 118105 -16726 -235795 -256181 -243345 -162984 -95846 -20608 29451 -68939
22784 -68939 -77639 -112346 -103284 62946 82304 41925 88445 74680 52469 67355 -23278 -30930
22772 -30930 -140962 -204084 -268745 -204047 -59524 33591 66111 101242 78589 81873 141935
22761 141935 134178 93876 61374 98829 -94517 -176514 -100582 -109873 -110067 -111537 -149672 -140883
22749 -140883 -108381 -71027 96956 129596 -33458 -27045 -33208 -42851 -42131 -132362 -83206 -52148
22737 -52148 -31012 -2684 2705 75043 83020 31634 -4397 -49294 -11856 37336 65859 -10228
22725 -10228 -13105 -73113 -113314 -83131 -40341 -7982 77217 172138 212150 119216 -70698 -210994
22713 -210994 -114051 9772 4607 -81762 -32643 105169 102233 123844 63814 75057 97624
22702 97624 32250 -79387 -106626 -44663 72561 147744 -31244 -203844 -202459 -172018 -87876
22691 -87876 -36871 127068 126011 169733 265619 207535 85340 -46859 -101708 -183470 -70551
22680 -70551 -37788 41814 92186 47853 101001 152109 46981 -14328 -74243 -98625 43234
22669 43234 66932 -28733 -26175 -108726 -90828 -57380 -105940 -58092 -107790 -201908 -81782 25671
22657 25671 119057 43400 7332 -71491 -185789 -192797 -57472 -107136 -112762 -215361 -240036
22646 -240036 -254632 -206864 -107577 60007 67782 -9358 13201 47434 6222 -58251 -75452
22635 -75452 -82036 -93329 -29006 47233 115971 116327 -43967 -121525 -48786 -28752 -149022 -50007
22623 -50007 -23978 -2728 125967 110039 84737 -1399 -28771 -32341 -119088 -145958 -19266
22612 -19266 190934 177184 161493 52304 28517 72484 112170 52150 65193 72474 24247
22601 24247 -79282 -131812 -141463 -106141 -92195 -26605 12550 -84001 -103533 -17512 6757 -79779
22589 -79779 -123032 -151992 -47392 -9719 -104480 -50832 78374 101843 67560 30902 76945
22578 76945 -37070 -41678 65230 74614 60675 147097 210746 214587 123348 46708 -588 22167
22566 22167 -80879 -174277 -85097 -25151 3353 86053 145115 205815 264705 209576 138663
22555 138663 117379 20390 59347 80032 114789 120131 232154 257254 75520 103842 173425
22544 173425 222203 106776 16818 22977 62732 34599 52554 86116 21679 -33167 -125020
22533 -125020 -173809 -23095 125391 98957 23700 8059 -45362 135178 241154 89445
22523 89445 -28203 21566 11598 21783 22358 -99763 -273003 -317188 -248251 -270166 -338712 -162541
22511 -162541 36414 95350 -18266 -109507 -136784 -103666 76692 87299 -14896 12513 40558
22500 40558 56903 -31995 10074 76384 127291 -3710 -84928 -133372 -80186 -68509 -174003
22489 -174003 -127453 -25758 -72730 -88512 -216405 -306497 -379075 -279233 -236174 -263658 -212684
22478 -212684 -65634 -71131 -72038 8847 4088 -81226 -101958 66908 115784 50033 -114612 -144894
22466 -144894 -61385 -39283 720 5267 -37396 19812 -30201 -102601 -135957 -102329 -223130
22455 -223130 -213937 -116032 -95594 -101821 -101969 37077 110086 136294 69806 -44795 34261 31851
22443 31851 -60965 -138164 -148587 -264773 -232271 -113963 -38291 20986 -21540 -7614 -12287
22432 -12287 -53631 45127 68413 -5804 -25410 -73015 34662 109245 131244 67166 3530
22421 3530 77186 80994 75518 91733 96217 72250 7265 51305 155474 218824 121586 -12090
22409 -12090 14378 -30273 -197417 -127917 -6015 -114684 35101 90524 101707 47442 -642
22398 -642 -48230 -150780 -231846 -175610 -143831 -150698 -5999 28170 -146528 -218132 -204422 -299028
22386 -299028 -361193 -251981 -184766 -159492 -106305 -20437 111639 90490 20088 -36532 -81532
22375 -81532 -74334 -33389 6623 55088 91785 95539 186596 225877 22633 -42025 39745 -30221
22363 -30221 -66617 23221 -37670 -81520 99181 150567 56077 59403 11261 -24648 -167255
22352 -167255 -230332 -154884 -151267 -174709 -61911 6869 -15444 -39285 -54423 96102 180430
22341 180430 81604 19696 -51916 -154044 -210291 -141755 -114876 -126474 -133189 -146256 -196767
22330 -196767 -178906 -91138 -93469 -116546 -39610 32870 146496 102944 123913 124738 34933 66546
22318 66546 2465 -31982 -21191 -114741 -24782 -151164 -239494 -81550 -33932 -60409 7277
22307 7277 12726 -40412 -106668 -118296 20206 38874 -42517 -49067 101602 287043 286600 136882
22295 136882 116536 103751 85887 -34302 -224628 -308070 -96171 140592 225466 126012 -62174
22284 -62174 16469 176008 188194 71057 -3912 -28872 7347 27299 -129747 -94366 35658
22273 35658 -37778 -72726 -158573 -115020 -72764 45882 36526 82935 97750 34943 109334 211772
22261 211772 142867 81441 62817 -18815 -144660 -165121 -135457 -73944 -34382 -77940 -137686
22250 -137686 -207280 -203813 -128848 -28804 -10625 -54854 -62161 -34570 -17895 68050 78056 -30958
22238 -30958 -70228 31091 83477 98076 -72826 -31226 -19126 -131296 -233863 -263998 -72920
22227 -72920 66281 80119 70136 123812 89168 103856 123843 113671 88165 -40718 -194842
22216 -194842 -248171 -137842 -148868 -298059 -408646 -313235 -255575 -146904 -15815 -518
22206 -518 -3974 9811 29341 -130513 -132131 -45504 -40356 31002 98731 68863 -15085 -114589
22194 -114589 -173025 -67370 15463 11586 61427 102034 103545 173776 45047 -51021 -11757
22183 -11757 5419 -15268 -36738 -149476 -122893 -60573 -39506 -30170 -21668 35047 33328 11491
22171 11491 -30375 -62501 -148324 -99637 -87163 -185757 -218247 -91291 36996 31877 88166
22160 88166 18657 39990 45550 15033 46422 50766 72503 43173 25133 -121213 -205338 -91920
22148 -91920 15589 68069 98602 -34845 -139784 -40535 -73891 -94078 -52765 -163126 -178896
22137 -178896 -106869 -24838 39799 -16674 -38514 -85838 24971 21077 -69448 -75190 20763 85815
22125 85815 160262 53727 -46931 6484 -8929 -17478 -21158 100064 250165 310364 193356
22114 193356 62107 37166 53101 152972 59327 -161140 -100624 33450 73292 -509 -57023
22103 -57023 -101589 -7862 -20804 -21251 23919 -4650 -66496 -134447 -97931 -51987 -22431 32594
22091 32594 39111 11244 -53676 -67192 -35442 -63404 -166127 -73438 52483 -13186 -15268 -67935
22079 -67935 -227516 -272796 -157916 -79424 370 30081 -15485 -39405 25526 35694 172634
22068 172634 231704 111671 4110 -116284 -191653 -154758 -15929 63940 -86659 -117958
22058 -117958 60438 136910 75839 -31714 -94487 -155199 -204655 -88327 7160 26616 -13989
22047 -13989 -109373 -203426 -196378 -197736 -77607 -90218 616 76268 65971 -28526 -10628 40534
22035 40534 74494 1336 -13679 -58491 -68699 -81169 84477 155445 95122 145637 116114
22024 116114 65013 69610 208261 307676 249902 97845 -11402 -61399 -99582 -149757 -113396
22013 -113396 -167476 -165125 -82813 -74593 -10993 93572 109060 61570 16431 27710 72103 132770
22001 132770 6537 -150837 -181267 -213795 -309904 -283883 -290586 -225121 -103418 -15497 36061
21990 36061 72745 23655 -5423 68774 117061 117852 -43012 39734 229082 30884 40902
21979 40902 182856 148789 140793 150624 74789 126592 85458 119104 92611 1111 33869 58713
21967 58713 -47650 -125492 -63445 -70870 -108938 -18484 36698 29300 1218 -46117 -4398 -79129
21955 -79129 -131649 -149256 -110757 -84390 -616 19098 103987 9415 -31932 82951 92180 58449
21943 58449 11680 -29048 -66251 -72331 62638 -10483 -7740 -16475 11649 17427 -71572 -44930
21931 -44930 -69460 -38021 58666 -4034 92950 55970 28613 92056 94140 -22051 -18512 64295
21919 64295 86161 11619 25801 89754 31800 -53808 -62523 -54402 -56023 -36900 -14195 21603
21907 21603 94707 108316 124484 135715 31594 31170 -37986 -14816 69824 5627 -72313 -59175
21895 -59175 -68240 -55803 -5367 35679 194800 329113 157829 -16464 -99342 -71527 -97503
21884 -97503 -13666 47754 3929 16863 -24441 30437 7321 50889 -28289 8824 -39345 -23594
21872 -23594 -7369 1156 6338 57593 47544 98613 165601 84187 40598 24983 -30792 -146486
21860 -146486 -137484 -153809 -140062 -31712 70888 84841 102069 10330 -71033 -116799 -142542
21849 -142542 -130092 -141698 -136826 -167919 -163220 -142585 -63319 -158374 -132469 -66594 -23846 -65865
21837 -65865 -139376 -200199 -166190 -144515 -158368 -103927 17637 19291 -106437 -181095 4867
21826 4867 -7941 -53170 -31828 105848 122228 43487 -93527 -103258 -155728 -48961 94785
21815 94785 94753 178110 296586 179774 17001 -157346 -157982 -142789 -59999 -150436 -64321 35434
21803 35434 -80302 -73302 5054 -72254 -85395 18321 61664 -27781 -21805 19676 -94802
21792 -94802 -161693 -31511 6202 49073 88097 -18003 -54610 -67868 -72209 -59377 -45947
21781 -45947 28101 -7157 -211360 -251805 -116018 -185282 -248389 -161859 -81364 -102559 -116982
21770 -116982 -180771 -262577 -129144 -78552 27943 -15189 6716 9740 21762 99822 57927
21759 57927 30218 -98554 -113763 57929 81257 66839 124196 97040 -15082 -154401 -123263
21748 -123263 -45634 -106813 -209649 -144415 -72595 -16951 41635 16244 -114321 -108027 651
21737 651 64463 1595 -127013 -158081 -68179 -38041 -60611 -65137 20216 172043 244436 97103
21725 97103 -72595 -157457 -95197 -27626 -42992 -126405 -146713 -69579 167286 315888 146105
21714 146105 33864 -43400 -134181 -88170 -72000 18965 -11543 23 54453 -25735 24803
21703 24803 -13678 -130054 -109367 -22410 23781 11594 63595 152780 45272 13537 -42287
21692 -42287 61396 66255 79728 94536 -40507 -15579 -24840 -24144 -50796 -40352 53806 -26657
21680 -26657 -9692 -63110 -139447 -74658 -109508 -140273 -144935 -49865 -9671 -56747 -45107 3766
21668 3766 -11250 -23574 24777 133 28267 -4599 -154904 -169056 -102026 -69443 -87624 -68830
21656 -68830 24468 55027 -19866 -41243 -128351 -215631 -217462 -143875 -174588 -171686 -114757 -117876
21644 -117876 -192670 -144472 14738 124631 155731 132870 70110 51019 66439 140895 209746
21633 209746 226677 163384 164970 46402 -19453 -32192 -58188 21780 128579 125580 8333
21622 8333 -91235 -68548 -32037 -120112 -128900 -67069 -93172 -100133 -13914 75534 81724 -46363
21610 -46363 -170615 -175888 -119696 -127810 -111750 -47623 -4328 52214 153553 198092 48232
21599 48232 222 36607 42228 108219 43087 -33150 -55448 -88198 -150376 -91152 125009 -15429
21587 -15429 -35416 -63633 -46985 -39114 -65756 44281 163482 163430 123339 55345 -84527 -190801
21575 -190801 -161399 -125331 13191 130870 136135 91458 65978 -92928 -115651 -19607 96678
21564 96678 -97826 -195707 -21836 -15362 10013 75192 -77923 -7550 47133 -2009 -15449
21553 -15449 53602 99521 128266 150257 31969 71726 149149 113048 35331 36431 120555 105726
21541 105726 163853 252287 200856 214630 123948 135292 242567 192577 92774 42397 -31856
21530 -31856 -105713 -59062 64939 85833 -28627 -64970 -87677 -72643 58624 114896 -90688
21519 -90688 -251640 -200273 -244824 -96618 13197 7900 16573 -107056 -123074 -83073 -30514
21508 -30514 -82335 -43490 42895 601 -18716 -46213 63497 189883 75487 -105379 -142138
21497 -142138 -66156 14769 126069 129251 62234 -72870 -42514 60882 65600 41540 76331
21486 76331 39283 46650 -83682 -136669 -265447 -182434 -127714 -68775 -216390 -245408 -82457
21475 -82457 -75905 -68406 -59639 76148 148064 118223 -67425 -110089 -83724 -130548 -85637 -122871
21463 -122871 -117078 -59520 -41721 19262 93921 66351 66693 25859 50121 24976 30547 -123475
21451 -123475 -244222 -182018 -118733 -171403 -172931 -83459 49037 75204 74166 42727 36462 -3574
21439 -3574 37103 62530 121739 7541 -29386 74691 54958 -13022 30046 -61523 -58616 -55154
21427 -55154 -43109 103382 203198 98907 -37865 -79553 -104042 -61682 -33457 44976 -18308
21416 -18308 94 66516 87142 91964 17570 -108968 -184714 38253 206827 259869 234891
21405 234891 128795 85337 71626 -45702 -60250 -84111 -83206 -129495 -48940 -21663 -48601
21394 -48601 -83326 -135228 -152491 -161209 -299836 -291529 -172305 -135911 -160372 -111386 -27627 20847
21382 20847 -10647 34501 59337 30011 88844 18634 20716 22486 -58201 -53242 1228 105776
21370 105776 96991 -16259 -83823 -87984 32069 -41937 -180643 -157061 -90084 -106473 -105765 -5942
21358 -5942 -67268 -43259 3362 -92673 -81753 -31032 -21958 4640 4386 -39590 -65181 -173144
21346 -173144 -127175 -10793 -32086 60858 104684 167458 146958 159256 -325 -46561 43563
21335 43563 134471 126712 53042 -80835 -203146 -200566 -163125 -92414 -95116 -23271 -80983 -89975
21323 -89975 -1433 104284 136877 208484 155655 77644 111454 174315 147419 -87536 -160498
21312 -160498 -65054 -83168 -150271 -180974 -227358 -271768 -278394 -189519 -105118 -31840 -90858 -184463
21300 -184463 -230130 -210183 -147674 -173675 -255547 -213297 -104275 -120726 -146828 -124012 -116559
21289 -116559 -152750 -281060 -200899 -170410 -76102 -36884 -82384 -120186 -161079 -110605 -40188
21278 -40188 23295 12989 -41753 -102978 -119182 -189791 -88896 -95307 -83259 -50552 -92621 -131235
21266 -131235 -76880 -163224 -137094 47073 26079 16374 -27368 -14536 -8401 66920 33434 29461
21254 29461 -58874 -175636 -54680 100078 51010 25413 -7474 17251 -49722 -100715 -179676
21243 -179676 -149460 -112033 -138405 -199294 -214582 -291746 -356345 -260241 -119712 -128024 -120047 3199
21231 3199 98661 137769 108623 99153 -4093 48777 181686 85460 37288 -23620 504 147474
21219 147474 161034 142266 82784 -26737 -135348 -102964 -198735 -73811 20621 -75262 -186081
21208 -186081 -161185 -39804 -120561 -96917 21676 8182 7964 -17079 58885 146481 77004
21197 77004 41347 -2808 56164 116702 67837 53155 118004 151285 213703 236924 198264 146011
21185 146011 64812 38175 66865 56455 -48019 -182522 -276250 -248047 -168523 -92879 -8869
21174 -8869 -14703 26690 53819 46813 94753 117841 134658 114411 47333 -31746 39745 -5578
21162 -5578 -102550 -28205 26361 99888 29662 3604 -22792 -1283 -20036 -49092 -155582 -191832
21150 -191832 -225605 -190389 -261896 -290739 -170928 20820 107354 97814 96314 45412 50107 12008
21138 12008 -33193 -46954 -160080 -89736 -16334 56597 67024 41936 -23867 -80920 -112842
21127 -112842 -160584 -168111 -141707 -56340 22093 -52491 -61014 -94078 -54479 -76127 -96909 -55908
21115 -55908 -34592 -51295 -58481 5837 16269 34308 6058 -11835 -64296 -77489 -63520 28277
21103 28277 137677 153994 179143 100195 118936 -58475 -112220 8553 55414 155285 151357
21092 151357 -6475 22025 117119 172015 136248 94557 92488 65498 83739 74255 66373 21997
21080 21997 -41193 -43991 -63265 -56032 -42875 -90979 -94234 -25392 23284 17243 -54591 65762
21068 65762 89824 126314 126541 43366 -21339 -110846 8623 97947 97112 15660 -130201 -127998
21056 -127998 -59840 -38138 -66769 -46234 30744 16713 36240 51248 -8621 -211857 -212266 -15702
21044 -15702 26064 -27696 -223910 -210593 -135858 -135114 -40521 -13346 120099 286987 278951 204704
21032 204704 154410 86259 89882 12302 -88201 -33667 -135437 -168680 -31931 87961 47453
21021 47453 100884 75982 25151 27812 -128704 -266211 -258499 -193640 -180832 -120365 22559
21010 22559 97347 178108 200329 179018 156369 98754 103442 95767 194781 131003 75176 54679
20998 54679 73565 145319 10678 -90406 -72910 -18621 9010 50847 -1880 -58066 -20951
20987 -20951 77522 -25328 -134995 -20251 58966 -44573 -268079 -188738 -204527 -258614 -164320
20976 -164320 -118384 -31930 79999 111053 -13696 -165134 -82429 9521 143081 -14837
20966 -14837 -184778 -54581 9571 -38298 -13159 74060 120629 34530 -13291 19085 80506
20955 80506 63702 -33033 -17263 -37741 -139273 -67985 13129 83521 -67572 -95232 36974
20944 36974 155446 83119 -47258 -86341 -88668 -8443 15796 3990 -42912 -90606 -1892
20933 -1892 -41544 -206957 -188664 -170366 -125084 -138984 -151321 -39721 19110 -37421 -87463
20922 -87463 -163106 -155460 -84923 9906 54076 -38662 -92725 -104748 -52907 -4577 -3485 3043
20910 3043 153936 185178 71846 30732 -45149 -194489 -146251 -156014 -220836 -276722 -322017
20899 -322017 -257804 -239184 -158745 -36098 93660 117526 66575 -70818 -77118 -130558 -138487
20888 -138487 -56005 -21208 -21071 18766 -67706 -50217 5658 132659 171073 85067 -8744 79923
20876 79923 66795 -98620 -52539 9391 -16709 -1729 13587 58038 56668 43845 37898 -18710
20864 -18710 70104 33042 -51815 -6178 -19459 -26511 -133114 -38020 88611 192295 111268
20853 111268 18673 -22412 43302 199206 131568 100809 61312 72294 51567 7481 -61066
20842 -61066 8207 103484 191551 171209 76529 76696 15431 -65668 27306 107338 97396 11638
20830 11638 -66712 -58604 -64827 -85169 -114497 -75101 -72016 2582 61446 22336 30874 93846
20818 93846 101350 186266 130086 127478 2426 -88615 -148406 -178134 -120508 -20848 -21221 -64114
20806 -64114 -37750 -39243 56127 68282 -20935 15151 122497 37404 3206 1573 12122 154268
20794 154268 170639 165143 179819 130354 88897 111949 90720 79883 121675 93081 137770 294376
20782 294376 222151 13770 -3318 19487 47002 -15932 13118 88458 79794 35542 54024
20771 54024 -77992 -165648 -160759 -124851 -199142 -145017 -106680 -15261 12846 -154419 -262435
20760 -262435 -238359 -141635 40308 -82063 -142557 -214727 -307377 -292617 -199638 -97282 -72510
20749 -72510 -88581 -30680 -77702 -67774 -29269 -22347 -64196 -92295 -84044 22320 -53848 -28084
20737 -28084 2342 24651 35048 17113 5657 -80693 -54989 41166 55580 -45931 -124879
20726 -124879 -56110 -97382 -165880 -192501 -286426 -209363 -183725 -263581 -212206 -135519 -69793
20715 -69793 -577 3559 82243 75683 6145 -24868 4792 -11873 -1889 78869 139140 85269
20703 85269 71190 34139 5914 49494 24013 -7205 -75699 -69178 -149556 -222676 -86246 92760
20691 92760 143710 162325 174848 137438 83104 83373 54801 6994 152876 75110 -68192 -129321
20679 -129321 -188370 -132643 -68728 -69466 -12219 6809 -2430 -46319 -134986 -156513 -179754 -128629
20667 -128629 -1412 74654 58319 118531 45935 -93167 -101540 -218693 -315540 -265092 -103507
20656 -103507 43049 -32345 -167630 -206283 -181063 -61923 -537 -27246 -64438 -188760 -290433
20645 -290433 -205117 -175 -584 -112123 -96131 30051 18278 -55722 -117140 -223033 -223733
20634 -223733 -85219 -473 16711 -30492 25672 65081 -59196 -159780 -138662 -122809 -122998
20623 -122998 -22444 -30808 -37455 -83185 -153160 -40227 99469 113761 89232 23116 -57550
20612 -57550 -116070 -26648 33589 -59408 -27038 -34095 -76188 -124980 -51397 -95586 -280053 -322551
20600 -322551 -188620 -157310 -149756 -112163 9509 -62474 -47780 -55984 -115226 -57650 -41721
20589 -41721 -89800 -19385 100173 64540 21821 31236 -37717 -129590 -239975 -202021 -189065
20578 -189065 -266822 -188881 -89435 -26882 -19987 12648 -60712 -67384 25847 44990 -8604 -79251
20566 -79251 -254222 -287020 -158496 -76278 -152298 -239050 -232360 -239224 -214905 -159439 -96899 -163427
20554 -163427 -233126 -135770 -48105 -11831 128898 79211 -27596 -35299 -98791 -212852 -171241
20543 -171241 53734 133526 105696 131153 101148 -9124 17791 -4565 -12628 -102496 -172485
20532 -172485 -141468 -29469 44460 109013 55039 -35362 -107612 9433 37491 -2292 -88397
20521 -88397 -147620 -185167 -186863 -39169 67100 89560 -2002 -88417 4010 124343 95345
20510 95345 16342 47959 2871 -35622 -120266 -51505 -25471 -22425 -71246 -121874 -96373 -37493
20498 -37493 -7446 60600 -88135 -49445 -41691 -71133 -124485 -129542 -65477 -92083 -99756 -32684
20486 -32684 108810 149550 71276 15892 -40574 -51278 -23494 24925 -6745 28715 93312
20475 93312 90192 145683 236707 65025 -146520 -66575 95029 133951 50423 -23603 21893
20464 21893 -77294 -19340 -20266 -110463 -111034 49940 54609 16438 -46046 -69110 -50304 -15951
20452 -15951 -48969 19482 38098 -16006 -51571 -2188 68516 47254 -56203 -129765 13137
20441 13137 92018 124892 133214 64489 127064 160474 89981 -65823 -128100 -116317 -119901 -79582
20429 -79582 -140767 -138802 -75921 -126555 -72416 -120547 -162150 -66282 -89987 -109741 -112795 -114351
20417 -114351 -156672 -114781 60166 143142 70201 -39559 -69498 21767 77637 -8855 -51767
20406 -51767 -8407 22056 -56628 -127715 -190689 -270672 -168894 5516 -8679 -152211 -105498
20395 -105498 -1883 -158863 -182578 -1199 101780 2345 -86432 -41154 -87645 -22670 -54861
20384 -54861 -85984 -107519 -120557 -12937 71356 161926 178210 193099 149907 134784 112181
20373 112181 59369 63779 137130 232957 176754 30748 34595 -29722 -75188 -155754 -194933 -142310
20361 -142310 -28476 -47528 -184197 -198345 -46482 -20473 -138582 -92639 -32514 -41973 -137481
20350 -137481 -89391 -98272 -8811 109946 -67382 -169873 -81122 -40067 15038 -98777 -103245
20339 -103245 -156766 -194275 -71839 -30482 -42646 -81048 -41139 93054 167670 112663 -68916
20328 -68916 -95626 -34240 -28733 -52963 37461 65597 101079 157790 144915 208148 212801 155878
20316 155878 -2628 -116377 -84740 26015 32341 -12373 804 15110 -28500 14454 14761
20305 14761 5153 -18013 -84873 -93342 -77023 -70150 -111795 -26733 -95635 -76984 -14692 -66401
20293 -66401 -195106 -171372 -192396 -190377 -42855 -13131 41599 21964 -42606 -102436 -148556
20282 -148556 -135220 -92240 -200107 -239758 -151089 -116598 -136125 -168360 -53389 -46372 -87760
20271 -87760 -49255 -49704 -137023 -145198 -148632 -57375 44359 102393 95395 49299 -40432 -22691
20259 -22691 -31936 -65030 -67291 -72414 -130318 -62512 -53410 -24398 -126901 -161234 -197145 -114463
20247 -114463 -25115 106269 233065 280037 197470 102198 72862 -61274 -171351 -135729 -100558
20236 -100558 -70328 -65666 -104872 -208637 -128230 -98574 -30105 103551 109747 14364 -36692
20225 -36692 -87827 -142495 -106771 -197160 -140538 -23030 112255 53815 -72759 -34472 76648
20214 76648 177527 313293 216890 63618 -39843 -187407 -206872 -171274 -49623 -34958
20204 -34958 46210 65466 53615 57383 70060 -34191 -40154 47758 163551 91835 87462 32603
20192 32603 44147 34109 89358 59239 58768 58200 -7042 -2922 -9443 -117186 -25886 105932
20180 105932 111596 106618 55881 1144 5797 -89244 -190066 -196826 -173374 9623 86861 60011
20168 60011 71658 16966 -40526 7897 106103 121286 132695 67206 54162 -11434 -78743 -102223
20156 -102223 -175259 -255151 -73530 15278 51140 -22113 -55592 -42067 -91469 -84398 -45779
20145 -45779 -119437 -123422 -187517 -143923 -63590 -28338 -76146 -94123 -86343 -100444 -49575 65763
20133 65763 92331 2824 -72300 -75121 -25771 -147701 -98833 107390 138114 92466 95136 33086
20121 33086 -158512 -147344 -67348 -9905 8887 5279 -46882 -27580 -60866 -100221 -130740 -171093
20109 -171093 -91257 -54896 -30459 -14380 34539 33924 -4478 4789 79818 86078 103211 144692
20097 144692 114960 77414 56707 9148 60493 24051 -10298 -62697 -127022 -141551 -82031
20086 -82031 -19596 -14471 6782 -32659 -93692 -40291 -68445 -87029 14977 78832 84351 114795
20074 114795 122892 90072 76073 110021 168745 94228 18544 -121031 -81473 22159 65250
20063 65250 50148 41535 -9896 7305 35130 -20746 14653 9204 -9938 -68569 -69792 -77383
20051 -77383 -27653 5899 13600 76750 43655 -38144 -46341 -82324 -115023 -169787 -68902 -102282
20039 -102282 -183655 -221811 -188683 -200641 -91654 -37467 -7682 23830 45246 23140 30206
20028 30206 10251 141297 161656 112233 -53304 -178832 -149974 -142619 -209262 -126567 -38541
20017 -38541 -115811 -224387 -270760 -205065 -186249 -159772 -137009 -166222 -154414 -67250 -38258
20006 -38258 32618 26195 20324 -69728 -83647 -144772 -51620 83125 52188 39815 5922 -43625
19994 -43625 42754 71653 279 -49623 110469 69111 90999 135749 57742 -44729 -66323
19983 -66323 -8000 99910 55876 -1169 -63515 -33197 46548 95988 76894 18659 -32254
19972 -32254 -6420 -18952 -7864 46731 153829 127598 35986 -82382 -130674 1730 17085
19961 17085 -78650 -222773 -267152 -148002 -18665 59516 97969 -20997 -8177 -28404 -38756
19950 -38756 -88824 -249626 -270442 -156943 -106426 -258246 -267782 -245844 -180935 2080 93136
19939 93136 102159 80292 26385 -73566 -128719 -36810 146232 155294 42625 -83104 -180990
19928 -180990 -76445 -47465 -68859 -172446 -131795 -95996 -127006 -154984 -3228 103129 89854
19917 89854 97266 45327 -64440 47478 109122 62129 15525 -51043 -461 65464 59481 72836
19905 72836 85243 24210 -98478 -178759 -281151 -315085 -191135 -88414 -76319 -32742 -60123
19894 -60123 33963 70012 21928 178838 122673 177331 167642 -4450 -145763 -143767 -65564
19883 -65564 16590 -23890 -6276 92728 147565 83484 41993 56895 27093 -7783 -109490
19872 -109490 -136146 24617 139570 -31258 -121506 -2572 8178 -76441 -45210 -92176 -58726
19861 -58726 -24077 -21181 -24405 9416 -24423 76763 213446 172441 51906 27488 -10545
19850 -10545 35401 19283 -39120 -85608 -13467 28809 -8318 -20229 26689 6718 -9477 -39841
19838 -39841 -81631 -82613 36852 -48241 -202845 -307897 -164186 -116991 -92572 -5212 -33522
19827 -33522 42669 -19723 69071 171346 138306 62433 -3256 32476 74586 115276 79057
19816 79057 223220 327148 233918 100578 58337 25978 -14932 12730 85065 117597 180375
19805 180375 135457 11538 27735 54502 27334 -29269 -60244 9629 77577 92974 -13012
19794 -13012 -145849 -40812 146602 192500 311287 186509 48849 -54931 -189367 -244379
19784 -244379 -148846 -99494 -83711 -90670 -18040 -34867 93603 94378 -34865 -24596 -8312 47233
19772 47233 -13911 -50843 -80460 -6654 -143132 -47054 -46493 -128128 -160356 -151577 -151700 -96173
19760 -96173 32359 54773 -56941 -101036 -169912 -172018 -101629 39400 101260 146723 189289
19749 189289 267058 246319 219398 218226 259456 271352 147473 40291 -8655 8744 90924
19738 90924 98404 -18757 18451 55204 27321 -2362 29160 98193 213258 167559 166780 118431
19726 118431 -27164 -87932 -96479 -99028 -136822 -191051 -55336 40742 -36510 -250969 -168614
19715 -168614 64031 180104 190114 163474 78079 28030 -2186 -23193 -53017 -214846 -201391
19704 -201391 -200032 -232937 -206158 -83305 -76909 -114443 -40560 -11330 -74671 -86100 11104 135678
19692 135678 160048 118309 104585 70288 76627 66846 -27331 -73603 -121721 -83843 -74445 10205
19680 10205 -920 -33628 -99758 -52157 -40758 -58850 -22200 2850 -4547 45406 135287 217084
19668 217084 126183 108636 65985 -71607 -100168 -121965 -107272 -105442 -69886 -83412 -100422
19657 -100422 -172661 -234668 -162605 -135470 -139271 7568 66185 3706 -65210 -214423 -354662
19646 -354662 -289524 -150598 -171780 -286157 -188317 -61618 5940 67851 150905 75648 99872
19635 99872 78192 195231 286450 227309 150010 129332 37288 -72789 -22237 80608 194822
19624 194822 90147 130211 93863 60755 -13412 -216019 -351334 -368553 -291502 -234324 -313620
19613 -313620 -205458 78087 104556 -45931 -109489 -110946 -33769 -40850 -55205 -54733 -24717 -64926
19601 -64926 -130946 -164845 -161544 -245878 -191178 -143478 -942 -11439 -48183 -82352 -216037
19590 -216037 -307366 -305246 -300814 -247894 -238781 -155196 -107922 -43481 -27789 -1049 -152061 -217788
19578 -217788 -207974 -157330 -41028 -89764 -68287 -92256 -164434 -155151 8186 -42725 -172144
19567 -172144 -110259 -3756 27680 134701 80352 104392 168028 178242 169360 179075 203061
19556 203061 130581 144264 98562 16945 89227 49764 -103072 -123833 -208562 -274302 -303673
19545 -303673 -195620 -193721 -125450 -30765 -5332 -3775 -15869 81097 92595 54429 -98961
19534 -98961 -142786 -106920 -124360 -148377 -110519 -122718 -102521 -39874 31885 117371 66871 2205
19522 2205 -23424 -39254 28109 21368 -42854 40474 56834 51691 92028 88336 -75413 -137038
19510 -137038 -169251 -132405 -842 187543 197636 170555 164201 186236 272603 119277 24932
19499 24932 42441 -2991 -40180 -138512 -128837 -88738 -41321 -19403 -25906 37054 1971 -15794
19487 -15794 -5023 62803 35449 -25894 -53326 -3730 42388 -6553 997 -147939 -216178 -85575
19475 -85575 46072 84172 -85742 -109088 -140455 -138377 -21567 -29906 -108578 4092 -7017
19464 -7017 -60292 -48385 -61043 -117170 -131886 -160043 -93080 3326 57527 131432 55201 73565
19452 73565 71649 96352 8797 -73276 -49580 64121 77530 52020 -10390 -49770 41595 150402
19440 150402 63062 47099 46898 61004 19989 -30960 -135329 -144928 -116521 -208009 -136854 -32427
19428 -32427 71026 132745 209220 233982 168424 243626 475224 666202 612544 640436 558319
19417 558319 314965 126659 180238 289583 479599 543629 568106 674582 776225 706191
19407 706191 559366 686166 716254 659918 531533 459693 395021 427116 510287 391714 312988
19396 312988 227136 344318 238381 76892 37001 64046 55393 34656 -24765 9823 12054
19385 12054 53324 119731 93432 232448 255526 266557 287323 293763 147021 40051 52457
19374 52457 98625 101195 147862 218478 225213 368548 524372 743138 918741 1000691 994912
19363 994912 891952 911800 1028926 976886 888048 861660 733154 585346 584172 571057 443051
19352 443051 325744 333128 334118 315730 283283 212916 333155 291044 257304 287713 235745 109774
19340 109774 29172 54304 44242 34817 44046 43703 86483 94616 144936 132708 205310 160296
19328 160296 12220 -49555 -136078 -154021 -132407 73355 55122 22456 75208 67844 55573
19317 55573 25565 74068 14749 -93186 -76350 -68025 -73948 -60937 9294 40087 115885 87542
19305 87542 -204 -118958 -131333 -152822 -112766 13116 179563 198208 228358 214864 262291
19294 262291 369307 411985 502864 548677 493277 430466 394104 388850 414502 599717 754737
19283 754737 724021 843848 897101 662423 445055 341265 209366 168411 186712 158660
19273 158660 248009 394463 435615 409222 376137 303641 230664 173233 92756 69726 33760
19262 33760 -40650 -103386 -64169 -48493 -83680 39451 27799 -34465 11803 84173 8841
19251 8841 -25081 80644 160991 219434 211599 296609 402117 499790 584464 430281 379767
19240 379767 321619 405857 579706 786561 1086659 1112480 875639 744293 630196 588425
19230 588425 661961 583675 679122 819512 892145 925371 932135 825610 713510 532415 420531
19219 420531 378021 391890 430209 356464 339317 296675 346002 197488 145836 146716 111399 113562
19207 113562 282984 388823 377053 382621 317135 397617 408039 369409 407227 482849 570227
19196 570227 647040 646985 680448 761425 844312 816733 783932 739595 716225 619971 773519 864133
19184 864133 952159 898278 822062 813312 852999 766785 625779 414903 258572 231653 317888
19173 317888 321032 156292 89458 96344 254864 330358 228382 59569 45569 130404 9923
19162 9923 -72255 79939 179634 61731 -39049 -7191 57783 115770 112267 71179 168650
19151 168650 190128 222045 333081 282276 209780 179205 120231 94239 29102 31632 134991
19140 134991 105838 23478 77448 -39973 -33272 31201 -7016 -26954 -5673 -56913 -54232 37775
19128 37775 56061 106069 128321 126824 66466 -80587 -208432 -230180 -77372 -49357 -35021
19117 -35021 18896 81036 68531 156511 221477 234399 363855 404535 285961 289642 283962 240966
19105 240966 326714 350651 318813 375226 363111 322944 352973 328618 244512 197887 136749
19094 136749 271482 362470 176108 112548 165065 102156 -10452 -125625 -54416 58196
19084 58196 34257 99524 151534 114812 4011 16046 -35521 -133460 39728 56422 -14128
19073 -14128 -105861 -179516 -166296 -30513 17165 114290 236550 181530 133543 164001 99731
19062 99731 20276 -100419 -248368 -230944 -185426 -202147 -144838 -189727 -104230 23687 246258
19051 246258 422776 508471 487712 554037 597145 656252 552332 554284 382608 326690 306920
19040 306920 307418 357747 363623 264674 295486 424952 429740 406764 293457 125040 169822 304584
19028 304584 356534 195498 186143 130458 91094 111013 110868 72902 64427 117022 110853 155661
19016 155661 200429 224796 257206 368422 409490 312048 201616 236294 211430 115828 19158
19005 19158 -122702 -177901 -247930 -181078 267 214621 398081 704016 945310 1114724
18995 1114724 1326274 1388272 1277937 1125766 1039768 824515 634121 592304 555942 596051
18985 596051 546466 577280 638899 643979 567491 710926 835100 929187 963820 901822 800943
18974 800943 805947 836535 868451 773067 725930 644594 577278 571773 622144 781649 980840
18963 980840 1023244 997542 991118 857985 763275 848778 848065 742511 789528 883727 941023 901764
18951 901764 970759 1003392 1071052 1099383 1034015 1009534 1096500 1204396 1402400 1535639 1497779
18940 1497779 1558612 1511323 1560238 1687822 1886254 2155256 2317585 2658350 3054974 3246506
18930 3246506 3327628 3528859 3735310 3872161 4090134 4283006 4526737 4908359 5539872 6470332
18920 6470332 7664598 9073823 10752717 13068735 16571338 20914729 24526556 26316993
18912 26316993 27470018 29462147 32790071 38488944 48977879 67836046 95891489 123306994
18904 123306994 135340090 133928928 132465550 133225451 127686630 112279201 95103295 82284945
18896 82284945 72389720 64896918 62557856 65626134 68404702 65597286 58798527 51521595
18888 51521595 43825517 35838314 28930211 23901439 20567585 18449979 17125005 16384454
18880 16384454 15865002 15676118 15769009 15883527 15853231 15620191 15490706 15463088 16018167 16785251
18870 16785251 18029878 20193148 23395426 28226316 35549171 46647911 62086150 77377118
18862 77377118 84939513 84232869 80876050 77287751 74021746 73755027 79898284 95425750
18854 95425750 124066446 167780558 217015384 261391474 303271286 334845837 335394471
18847 335394471 303730542 259553058 215780091 174320137 139627902 117772066 106637149
18840 106637149 97164861 85258071 73908141 63955324 54206242 44952890 37337779 31688817
18832 31688817 27371339 24104885 21395153 19339338 17666447 16287061 15049693 14198112
18824 14198112 13675995 13153987 12587591 11947197 11065055 10282258 9506304 8755857 8037134
18815 8037134 7513168 6982293 6494381 6124014 5996036 5741025 5409499 5235181 5144265 4938411
18805 4938411 4723953 4524631 4315863 4331664 4383176 4395505 4463410 4486916 4436096 4402031 4525237
18794 4525237 4532231 4576846 4805088 5178366 5303264 5520665 5777368 6173609 6878152 7689872
18784 7689872 8554821 9282658 9798109 10243115 10739152 11270269 12083546 13250758 14743811
18775 14743811 16510205 18791104 21606301 25394203 30698169 38951242 51793888 67354097
18767 67354097 76179917 79919360 86865933 98728401 117187597 150809660 206719679
18760 206719679 270300957 312065332 324824160 328585212 317289021 272135133 218723754
18753 218723754 175862305 139971515 109266777 89533230 80490674 79711601 86383991
18746 86383991 96838215 99222737 90888323 80445135 70142634 58138826 46215460
18739 46215460 37280258 31271273 27340737 24754852 22831384 21293421 20075843 19084678
18731 19084678 18080277 17316248 16794581 16423898 16041009 15732194 15663633 16202333 16934543
18722 16934543 18045529 20058743 23496602 29056972 37723347 50031104 60212653 61379976
18714 61379976 58990870 57586139 56765069 57853572 65530223 82327360 99243941 104728794
18706 104728794 111111025 128447208 150592640 153965540 135479619 115413072 98387849
18699 98387849 78652824 59046436 45800677 39114849 37055510 36448848 33718015 29938932
18691 29938932 26595584 23158727 19439628 16337642 14110056 12416855 11214435 10233551
18683 10233551 9414087 8732318 8329402 7936442 7561988 7190555 6544094 5928446 5405972
18674 5405972 4996395 4749776 4476609 4153453 3998402 3708015 3460172 3127455 2882569
18665 2882569 2794211 2608413 2533486 2518041 2291151 2220719 2179246 2018216 1733650 1617911
18655 1617911 1770532 1821837 1891841 1701944 1512817 1561705 1603627 1505086 1504779 1552826 1414054
18644 1414054 1472792 1416064 1339125 1325957 1337074 1294566 1251551 1219345 1159220 1110055 1025754
18633 1025754 1101439 1086772 1002328 1155032 1118855 997887 1116000 1165984 1142660 1071725 1141083
18622 1141083 1249215 1270029 1343862 1203398 1021432 1191321 1367085 1369359 1425033 1451697
18612 1451697 1459594 1429430 1363415 1475015 1534758 1523889 1484584 1709204 1990176 2150345 2190819
18601 2190819 2148697 2072624 2126669 2243472 2213996 2193796 2210396 2350129 2468401 2485661 2569766
18590 2569766 2655370 2635833 2728371 2929723 2986586 3047030 3066140 3123871 3395989 3590915 3775287
18579 3775287 4043612 4286353 4461888 4590258 4951144 5342771 5728627 6238444 6749983
18570 6749983 7238009 7773864 8565877 9760386 11163974 12863928 15458911 18974218 23747082
18561 23747082 30834058 42184436 60564009 86367159 110249411 121386877 125780317
18554 125780317 135333205 147937438 150164483 138403538 124628365 116546883 114180178
18547 114180178 119987486 132854906 140814710 139879074 140866476 148604947 152110276 140419353
18539 140419353 119371065 99683972 81711999 63484021 47679895 36430005 29020408
18532 29020408 24244162 20883508 18375207 16432145 14868279 13539971 12483420 11587161
18524 11587161 10819130 10081327 9375207 8665550 8117037 7526287 7063388 6503979 6042306
18515 6042306 5927944 5751136 5420076 5176997 4992459 4873118 4703757 4343985 3969303
18506 3969303 3596736 3386005 3311162 3323518 3259200 3089466 2957755 2847372 2760402 2642205
18496 2642205 2373863 2225488 2119995 1993374 1819427 1782437 1637955 1592159 1483106 1314133
18486 1314133 1272239 1267878 1279226 1198472 1164142 1105134 956785 915368 825883 913006 954558
18475 954558 889899 922265 937159 915640 893510 914053 926444 936452 864382 849058 923327
18464 923327 894097 831714 841548 889692 845971 804792 791438 724665 638541 559158 578550 631562
18452 631562 664572 642228 644464 560204 547431 547463 414462 462189 532958 635951 646519 572544
18440 572544 711324 696415 707946 638472 685827 652759 591696 656351 721901 759193 712038
18429 712038 664889 648989 690274 702669 619060 610360 566931 537647 593202 537718 460388 396903
18417 396903 362447 553542 601025 614486 639419 583507 533051 425244 369820 446152 502946
18406 502946 477944 428454 524429 566696 508572 584472 544702 649805 722488 807565 829919
18395 829919 780246 763489 776992 919448 831131 759071 927034 1020099 1141406 1146785 1286395
18384 1286395 1390908 1443562 1421706 1315214 1174223 1174962 1115801 1024461 1021262 1104292 1306674
18373 1306674 1506346 1548617 1586065 1469265 1409887 1290906 1036053 762325 664141 790017
18363 790017 843099 811585 722869 668569 684771 620773 557771 514424 470556 432435 413079
18352 413079 384808 387833 428955 432346 373025 336476 373907 424610 381975 357317 352017 282060
18340 282060 410758 535889 554336 629560 596086 588973 656770 637256 751303 773145 673159
18329 673159 727918 796150 912305 1063243 1180662 1236680 1136861 1083513 947164 880393 820047
18318 820047 840762 867126 892946 976837 890376 809829 868614 838623 675601 441401 390421
18307 390421 377660 342345 330972 376837 438051 360626 333168 407865 397757 383206 423851
18296 423851 459444 489967 532386 543786 523270 536887 505766 373525 179616 111157 180214
18285 180214 186360 239939 320589 362818 296902 150001 28153 -47016 12649 163503 73981
18274 73981 56769 202947 265923 364237 385994 339063 119632 99882 134941 153108 89969
18263 89969 -10873 -99363 -249727 -308636 -296816 -155974 -37558 88277 158653 279447
18253 279447 294667 198914 272943 291119 358006 426016 386714 302858 303045 360551 389913 689513
18241 689513 875297 907613 970768 1071143 1196310 1208181 1173815 1231225 1324327 1316488 1402699
18230 1402699 1507341 1461957 1230363 1090675 899604 664530 585334 501263 572996 557113
18220 557113 564470 432708 445166 438809 402378 454281 352921 304067 317175 423550 504965
18209 504965 543863 496447 486012 668278 679900 528430 598660 626763 509077 441742 432948
18198 432948 349712 447702 508359 574353 553927 661719 884551 926059 914747 805144 650621
18187 650621 651944 634680 621125 658712 806332 869838 824571 671980 565224 666824 832223
18176 832223 955613 1166582 1290951 1150862 996616 867376 748451 694769 676912 720300
18166 720300 561593 494914 390655 334082 438453 498134 493231 524015 541997 538825 556013
18155 556013 570320 579758 603796 602011 586955 683047 726852 699935 676331 663304 621025 530776
18143 530776 610367 728662 773759 785660 900132 1006631 1054605 1064756 958206 867744 976670
18132 976670 1048508 899698 1169425 1426957 1631411 1956937 2156933 2323161 2486857 2843250
18122 2843250 3149390 3528807 4167346 4822120 5509631 6334499 7474064 9102423 11216467
18113 11216467 13975941 17941498 23644933 32019598 45266281 68598417 111934837 175388977
18105 175388977 195318450 166452984 142860264 124013920 92487992 60370853 40824614
18098 40824614 29764844 23132839 18933283 16001072 13808162 12029957 10535240 9292821
18090 9292821 8253946 7449320 6720973 5933979 5411001 4839503 4442290 4113735 3784872
18081 3784872 3558954 3125406 2872166 2798164 2717490 2622492 2411174 2138121 2080534 2000653
18071 2000653 1929416 1770164 1651123 1624597 1442006 1356244 1283373 1190865 1176281 1228755 1249305
18060 1249305 1188343 1028099 916501 839538 794404 713242 657103 706092 688470 676752 726415
18049 726415 785214 816002 733573 616560 596321 569000 634804 711113 682469 481466 339679
18038 339679 307206 315431 396343 468950 347195 223528 255654 358075 361625 420036 371015
18027 371015 386879 395021 344644 376679 444703 461682 427771 426129 456889 386575 344132 309329
18015 309329 359187 389493 208759 171207 267001 342970 399317 461062 344114 298174 265550
18004 265550 330809 398417 505035 522922 405133 362826 363875 445513 468425 521956 551679
17993 551679 516415 383803 207781 228017 426636 550315 590190 557412 505649 432448 360954
17982 360954 324934 322391 307632 172600 66989 105522 92951 89106 111413 169821 183481
17971 183481 181937 64029 -86389 -83828 19644 269669 629142 964455 1097350 1061376
17961 1061376 1085170 984017 841595 824871 787156 796056 729617 594972 605130 687386 717695
17950 717695 846456 785887 720575 669705 602723 543139 453846 433864 574780 740321 874390
17939 874390 1009638 1034230 925456 871401 833405 770348 768776 591078 593852 526410 353590
17928 353590 310923 317328 430132 239023 21939 56347 149044 200111 151178 58193 72725
17917 72725 163566 143173 89645 110001 68806 107234 296227 628985 793998 820821 735833
17906 735833 800261 886280 944218 863285 844164 762315 717718 711895 870272 880695 851051
17895 851051 781904 757477 917083 985308 900423 764476 633338 542746 449545 413989 306310
17884 306310 208182 181291 195442 129147 101995 135326 146535 142246 181797 196006 162179 90321
17872 90321 158240 205296 169340 167186 151499 130380 140984 197652 185939 190389 116622 142411
17860 142411 153557 185514 184183 134098 230899 162910 120603 232220 275512 280033 377115 294410
17848 294410 249940 262907 180233 29912 -29867 68377 120332 162911 183564 200384 110656
17837 110656 25175 111340 174832 112695 76658 140033 236287 276448 388611 377923 215058
17826 215058 224358 273223 195396 183305 257951 117342 43763 147120 258351 256242 151557
17815 151557 116546 180416 120800 158307 143909 141436 99689 113680 189123 138711 65526 73385
17803 73385 136574 133798 75871 14736 65623 90190 81776 -74832 -123362 -6484 47389 157769
17791 157769 182187 56561 17547 -18318 -39494 101331 66388 37832 12312 17351 20155
17780 20155 -22911 -23750 -78277 -89938 129672 230415 203606 126429 89052 149547 124838 130328
17768 130328 64804 -16190 -18292 112032 199494 186032 69953 -64201 -126492 -186682 -152875
17757 -152875 -116680 -81278 -38000 -3404 -38147 -19042 -65664 -206054 -257088 -63387 39498
17746 39498 -50374 -89651 -126963 -207009 -264720 -223937 -49038 -8763 -38376 -18164 74096
17735 74096 65090 13567 44975 28780 -25514 -53568 5933 8680 -33717 88365 140100 139208
17723 139208 42032 -59833 3780 178868 122146 99630 184595 80405 -60214 6535 -19068
17712 -19068 936 -4867 59988 135421 193727 27274 -117027 18999 175630 221251 69622
17701 69622 10075 40667 -67752 -131 86696 238650 325191 243279 186848 217419 116957
17690 116957 214071 277407 208962 157659 184660 274964 234548 135725 65548 64652 61524 87407
17678 87407 71773 91880 197872 187988 202963 182754 81985 33664 117368 331668 416270
17667 416270 384992 410807 371630 245639 201402 201654 171587 135628 78878 25786 10717 60925
17655 60925 53023 -16853 -22666 -10043 106616 205444 281309 177170 122912 129381 87359 132685
17643 132685 140949 4050 -35259 -14647 10068 129909 161442 201006 197079 113889 149193
17632 149193 199930 272753 359464 245201 89501 120717 40743 19445 108367 80894 4880
17621 4880 -55772 -3801 104724 242300 229802 174186 243456 319060 275723 230502 232742 271970
17609 271970 375624 363415 311001 286594 153336 35315 127083 257398 182222 211980 296739
17598 296739 145696 14610 71843 201872 243745 121596 49119 204102 238264 61311
17588 61311 -29334 53750 101642 76758 99223 62616 36864 10357 7678 -53650 10247 -16052
17576 -16052 33025 128644 141988 -9930 -171176 -255693 -266206 -218650 -87156 -18477 -87821
17565 -87821 -188260 -171674 -178870 -100320 -36189 80412 218388 326412 344543 273015 195295
17554 195295 74157 23397 -11288 -83038 -162702 -238028 -192900 -86565 -58020 -151827 -191413
17543 -191413 43145 175403 234032 315167 320143 225211 157816 110714 132033 150805 168763
17532 168763 184841 229011 184431 295514 316637 346242 363568 459714 489459 595750 636605
17521 636605 669644 649464 678356 689519 603132 471447 461544 507710 558289 537738 628974
17510 628974 666322 630692 482510 340162 325918 317115 427278 503124 520658 668328 713549
17499 713549 728042 673084 651244 492864 342481 471266 493981 444941 464403 660755 840662
17488 840662 938003 952989 886124 950181 1032603 842424 633600 508608 446234 369691 382644
17477 382644 374702 389882 307129 298861 305647 397324 398141 341663 409354 441723 625020 693468
17465 693468 655092 586069 568409 701145 687207 765844 839890 868814 847428 858427 1001880
17454 1001880 1044099 983608 1044960 1204248 1347568 1399399 1522158 1660226 1827519 2098927
17444 2098927 2245819 2433599 2762186 3231050 3847041 4258723 4265094 4167499 4211496 4075489
17434 4075489 4008664 4114176 4293294 4517169 4927076 5361613 5985545 6693382 7855066
17425 7855066 9384750 11118717 13309765 16354788 20398235 26371848 35863104 50963145
17417 50963145 74015708 99551491 113954271 116884289 121901860 132683468 137562944
17410 137562944 126269380 106941358 90016661 74446746 58290478 44874365 36279216
17403 36279216 31446680 29217092 28799788 30052369 33081698 38475577 47762458 64093518
17395 64093518 89482399 116299623 129387627 131384674 136862192 147890930 150830152
17388 150830152 136138697 114265078 95188089 77149920 58566707 43140922 32796524
17381 32796524 26155009 21716710 18619340 16417951 14554844 12874081 11553625 10355106
17373 10355106 9344440 8545075 7867142 7363760 6867418 6310230 5876566 5631113 5337319
17364 5337319 5133489 4946528 4677099 4527628 4353122 4008305 3808329 3877246 3759196 3432367
17354 3432367 3177112 2897442 2625456 2478601 2354028 2169987 1997612 1701734 1607764 1545949
17344 1545949 1616147 1568654 1493640 1380725 1238015 1300125 1273999 1366470 1447465 1435532 1449839
17333 1449839 1418111 1446489 1441861 1396843 1404588 1375236 1338992 1197607 1149206 1119655 989109
17322 989109 887207 818484 752505 706089 629041 611756 581041 574929 617279 599464 546841
17311 546841 631815 682629 722722 720267 702948 629151 585416 544229 382487 325633 366789
17300 366789 372785 332910 345606 422444 449905 519524 407673 292709 357968 534876 562464
17289 562464 521365 487014 457527 330899 327490 322018 183348 104923 126570 150740 322759
17278 322759 398674 404822 330721 353287 407453 324552 376441 345780 232724 139798 149615 264660
17266 264660 370595 374811 332863 417866 478890 579789 619864 485689 415891 348734 320076
17255 320076 282337 329459 454722 498128 512027 419779 292798 228595 200732 264904 413491
17244 413491 401632 400518 403694 431621 405775 388856 435159 501790 634660 559178 444599
17233 444599 382704 296487 313073 332203 289239 374341 406321 378890 283478 193490 236984
17222 236984 325105 405864 444954 431818 398978 353201 233362 156754 152515 179558 224572
17211 224572 176969 198020 169746 170531 237801 175256 160941 172653 190801 223172 273562 335588
17199 335588 403334 258949 213443 202809 214267 327013 208294 217001 327532 338551 265139
17188 265139 88040 30014 29152 43346 137756 290273 283728 211869 85844 1693 -4941 96634
17176 96634 63011 51657 29408 136411 177928 159871 130885 220210 278790 97252 53816
17165 53816 130498 97621 64003 45579 72466 63418 -8405 -145038 46208 231403 236692
17154 236692 166873 226550 318002 386865 306291 227213 243662 176708 223023 241511 142573
17143 142573 131535 283331 306924 273303 323662 318350 328689 315612 305069 305928 270618 276690
17131 276690 212790 90843 29048 113751 125442 219329 181801 162938 25653 48945 117932
17120 117932 -26555 38093 -48798 -48691 29472 97851 109769 49443 89801 34800 -82726
17109 -82726 -183886 -143499 -83965 -91733 -19311 -16369 51911 -48956 -129853 -220046 -153418 -36826
17097 -36826 38102 132258 192651 141327 130748 107402 131263 147786 -272 -88315 2784
17086 2784 9423 80022 56655 110613 154941 187717 257529 293982 304073 296342 115754 74652
17074 74652 183189 291786 376256 243192 300748 487224 464854 336860 310042 350221 340982
17063 340982 304854 260783 267662 305830 326198 381028 441778 473989 401432 411634 374012 318473
17051 318473 226672 221320 242602 261749 241534 298125 392557 343587 249394 185229 203497 164600
17039 164600 218847 276661 284227 359102 455015 362496 353033 403326 432178 340791 247479 258300
17027 258300 280506 343215 538373 457521 444526 503884 517268 526354 586518 512746 509192 524492
17015 524492 471179 488999 607610 537939 588578 672458 749321 753712 739561 728092 796736
17004 796736 812391 943933 971255 973569 1114902 1324769 1524086 1687479 1723313 1884810
16994 1884810 1915742 1775107 1757348 2029686 2405900 2869244 3132189 3231036 3375983 3654480
16984 3654480 3739988 3832958 3957685 4256828 4750155 5489180 6467874 7467851 8496666 9687716
16974 9687716 11273915 13571023 16615195 21247644 28536494 40867030 62454580 93943126
16966 93943126 111381946 102318467 90773004 81767321 68444436 54004442 46105161
16959 46105161 44944983 50059999 63707188 88487848 114511833 114245871 100662087 90135519
16951 90135519 79184084 64265940 53707149 51459588 57522331 74242059 100021610
16944 100021610 111038381 100225920 88666557 79161798 65826376 52306076 44675953
16937 44675953 43166273 47637433 60097445 83038055 104692886 100879930 86974682
16930 86974682 75855829 63165726 46467663 32876961 24455448 19417134 16195923
16923 16195923 14025800 12541417 11447498 10481791 9712156 8928912 8125948 7380067 6595424
16914 6595424 6003078 5469116 5200771 4959161 4744722 4524737 4247689 4077758 3753268
16905 3753268 3430946 3149983 2832845 2519761 2383821 2294985 2355796 2384570 2391715 2212518
16895 2212518 1984347 1871388 1599838 1369320 1252923 1277992 1228979 1233240 1209533 1034608
16885 1034608 981052 1028347 1069442 984253 777960 652115 712193 791151 725755 708242 737685
16874 737685 745842 689134 616881 588341 516254 556608 611082 661099 693712 727506 691026 673525
16862 673525 624503 737316 1065575 1296077 1320293 1384899 1413948 1445557 1427484 1431719 1398148
16851 1398148 1292579 1176658 1010452 743867 581770 610949 625420 610218 585585 690502
16841 690502 703768 711629 778441 862835 908372 868766 819223 858266 981299 1017393 901775
16830 901775 782868 638599 596336 566978 520155 495304 453153 428290 379265 434282 443141
16819 443141 324216 220548 253930 360128 416567 515222 509924 465015 489308 626913 671411
16808 671411 533012 461483 336945 373811 514635 472157 414465 522880 437180 279395
16798 279395 354062 451775 332793 257637 321738 288795 368322 299879 336116 453208 466898
16787 466898 266008 118299 76166 17260 178671 302821 273360 407701 419293 401775
16777 401775 306859 318105 302744 331752 283825 363776 371997 315979 186025 149517 179039
16766 179039 234168 279212 186504 17949 -105348 -8421 93071 92293 41910 -45189 -84233
16755 -84233 -87681 -2437 52104 9602 -25433 12680 107721 135032 80007 45885 10816 -17950
16743 -17950 -69489 4341 149264 68575 -10974 143555 99729 -3538 69940 79106 -39266
16732 -39266 -111552 -104663 -160102 -156026 -67128 42634 179264 138866 89209 94615 37234 -12759
16720 -12759 65455 86034 144166 108475 -41167 -96919 -73777 61523 -2424 1665 -33782
16709 -33782 -34003 55464 36752 -19895 15044 30702 3834 47907 111880 114674 78936 21308
16697 21308 -29781 -102355 -221883 -257811 -108693 23799 -19406 -124909 -51670 13279 123110
16686 123110 208644 146079 40046 -88765 -132855 -59847 -11924 21131 -15381 -129142 -74247
16675 -74247 4880 86842 77483 143829 206832 235367 225562 259944 326467 151644 -34076 -82995
16663 -82995 -90049 -126371 -121117 -68069 -108356 -164527 -173113 -103500 -22529 -35838 -48442 -43935
16651 -43935 -38803 -90648 -93400 19878 161025 220112 158680 154785 125285 56123 -66373 -73770
16639 -73770 72325 108683 111091 30888 3933 22566 72877 172929 168057 186908 118890 72574
16627 72574 100700 2321 -8132 -47451 -113941 -73025 153319 119107 -14888 -50705 -142923
16616 -142923 -103766 55388 67772 262 -17679 128256 96253 178527 227330 149027 94552
16605 94552 154417 123787 177810 95011 29632 162866 121829 -1042 45932 59785 89253
16594 89253 167317 203915 137947 122423 116824 95180 297869 309206 218449 184790 156736 80229
16582 80229 122525 65215 65683 106674 26764 -20974 33025 12941 -9614 36599 127484 210762
16570 210762 114203 -4126 -33585 -64601 -67911 -72243 30145 -34647 -208008 -237590 -143833
16559 -143833 -48043 118585 152930 28118 54429 104497 -6175 -93995 -139914 -109525 -74420
16548 -74420 -14096 -38474 -103470 -91595 -100610 -91902 46428 4628 30109 66699 -4528 60222
16536 60222 21833 -120842 -167614 -55617 -54592 -108542 10888 27424 107302 160032 94021
16525 94021 164410 195958 -1623 -23959 74330 26165 550 72286 158758 73692 47803
16514 47803 71108 38729 -11527 -19218 63989 92381 43417 175578 103427 112216 189800 231683
16502 231683 243759 188778 153059 222018 161329 83464 101921 91203 73775 57556 49927 52630
16490 52630 5312 85404 108486 135093 117695 162735 151236 -35660 -9980 53327 7627
16479 7627 -114727 -29071 60966 128976 166394 225123 152461 109266 28713 85719 74196 140536
16467 140536 27469 -3504 7708 20786 168479 183736 159163 294640 274187 180819 161767
16456 161767 72847 -10024 -13075 -26626 -40498 -22615 -61501 -75739 -5639 19581 50531 10565
16444 10565 -46091 -49959 23394 98983 127797 103466 12825 -116047 -116701 -134325 -97835 -84807
16432 -84807 -8077 3667 27061 14300 63307 182131 205819 134301 110677 150088 123178
16421 123178 70144 66378 166982 162916 115076 47113 102148 226265 191022 164761 113739
16410 113739 71912 132842 372240 494479 645506 722948 723294 617040 521269 464502 408576
16399 408576 154066 87390 188682 197833 179251 215579 266401 196302 244013 311576 249026
16388 249026 238903 183013 338264 455063 598056 559006 420009 354488 302997 338971 415950
16377 415950 441973 456569 430744 490962 405797 371541 413327 543699 611146 567306 364189
16366 364189 207130 200936 236651 170020 112966 167926 236561 182414 159168 223231 193422
16355 193422 77359 82565 95084 138351 52671 -41703 -44351 62354 178201 237082 253152
16344 253152 195491 97661 43486 11981 -6821 31137 86298 -42934 -43733 -132099 -39748 120078
16332 120078 172871 68829 726 64938 31059 40460 95716 129470 228936 306000 254085
16321 254085 193065 111410 -22062 -56369 -440 138993 208133 126975 14447 121642 130401
16310 130401 -28356 -116283 -15925 105611 75085 25144 5029 148738 212123 246546 99425
16299 99425 -47818 -30267 74225 139631 185030 111022 112301 -77489 -146712 -64344 85873
16288 85873 20371 -85584 -197369 -225375 -139829 -127188 -118869 -31219 2317 143407 222598
16277 222598 139062 -29612 -33254 106786 100837 -70837 -61871 -9970 -117616 -100515 -24178
16266 -24178 70206 27630 48508 87617 -35319 21817 155202 117840 142505 125565 77823
16255 77823 25015 -37608 -100235 -62950 53166 147126 -4124 -131645 -129702 -75356 -161251
16244 -161251 -141170 -50307 -25353 -125021 -139626 -66203 -83938 31411 194102 143499 122594
16233 122594 -11925 -136082 -191574 -227338 -90417 100714 71272 1514 -69576 -82198 46855
16222 46855 138425 58294 72090 40061 -13323 -103430 -80190 18990 63491 -15413 -129747
16211 -129747 -244641 -290363 -160622 -93947 -29770 68902 161729 202364 211634 230492 184338
16200 184338 4574 6255 44133 115470 167161 159788 184970 261617 171541 54625 -93394
16189 -93394 -145008 -113429 -67299 -39977 -10072 14501 141232 210845 57819 -36346 -128807
16178 -128807 -14798 22503 -2663 10506 -36763 -48173 -414 -25929 -17504 -70230 11445
16167 11445 92457 109537 197150 153809 102195 50906 -84348 -78290 -10415 117160 192257
16156 192257 241028 205009 110248 -5533 -13643 -51423 -159239 -185394 -109159 -174355 -165962
16145 -165962 -53967 -27831 -60952 106791 163667 99156 -71045 30565 -9095 -209654
16135 -209654 -162211 -90557 4819 -13704 -74127 -41504 -9075 -76781 -190807 -230072 -159727
16124 -159727 -134900 -37854 63448 201169 150571 73550 65364 155922 331217 330207 276677
16113 276677 234263 167776 102016 -17041 -113970 -48790 36535 116440 217120 126634 49302
16102 49302 19002 48495 111827 69148 48164 79556 132650 68961 40311 65070 69691 189705
16090 189705 224769 88970 -30472 -39214 65307 91013 71905 71280 35991 18088 12779 -18663
16078 -18663 -36899 57405 135580 147320 216918 230553 167762 60075 8870 -39088 122807
16067 122807 136532 58219 100625 139083 138631 131263 27285 -61500 -46514 109078 231530
16056 231530 283952 234799 172708 139154 84429 156269 112394 74908 102123 107349 7685 -23352
16044 -23352 36680 35707 -130760 -167270 -105401 -55386 12138 23389 -43669 22709 107882 86303
16032 86303 -10537 5759 73874 128272 78060 -27283 155462 147059 118017 110368 18290 -55090
16020 -55090 -44077 -73948 -85412 -127731 -13828 38748 40674 118248 209673 89442 25921
16009 25921 -11020 -27868 -4854 1840 28889 51787 107077 -39497 -100720 -169511 -169334 -68697
15997 -68697 -96135 -67873 -125075 -111551 35002 35501 -73812 -93461 30940 35390 77930 41266
15985 41266 -12789 -45930 19370 107904 98806 76667 -4755 -41218 -7222 87089 8356 -55809
15973 -55809 40417 49815 12838 50429 60614 17466 31576 -60684 -110866 -62376 -135738 -69945
15961 -69945 58040 47887 120178 204691 232530 184413 124749 -42348 -108185 -106579 -153832
15950 -153832 -142614 -54949 -45129 34105 38480 47851 12144 -112007 -100303 -116766 -167564 20374
15938 20374 -16470 32109 51942 128634 237717 306868 296222 203194 221085 190054 61930
15927 61930 1427 -24813 -696 -57599 -17779 50536 6809 58193 112123 221341 132741
15916 132741 122846 171913 220084 260436 306543 192590 65620 227250 311970 234835 207788
15905 207788 86181 150313 263783 243721 248244 279999 174844 -37938 -66719 23703 46350
15894 46350 71986 66795 23779 -82715 -203569 -128058 -24262 125038 150327 167976 47854
15883 47854 -93348 -111548 -73239 69420 -5671 -74659 68796 79447 -871 38927 -4044
15872 -4044 -77338 -103331 -7629 6596 -76660 -73908 -97993 -63804 -97291 -46635 -120963 -144934
15860 -144934 2867 43216 26139 4427 46171 111331 220877 159786 158411 149315 112658
15849 112658 101371 52256 -15430 101403 189646 209323 114899 137834 140180 70802 26210
15838 26210 -9321 29283 115394 96341 123792 105694 3903 -88942 -153268 -156909 -126295 -93532
15826 -93532 -38006 386 33697 108229 46397 -28684 73396 145673 170793 99374 110274
15815 110274 100181 25948 47265 108522 86386 49646 57581 14292 82258 187756 107415
15804 107415 -13189 -54549 -86212 -13607 -966 18820 68083 86190 84870 53729 27008
15793 27008 20273 87181 -14662 -159216 -144005 -96177 -67320 -64711 -25873 -32715 -174109 -165802
15781 -165802 -96497 -74572 -82185 -91732 -153005 -84950 31631 153946 126103 44146 98434
15770 98434 23669 5989 85898 35270 -86500 -93782 -76103 36555 13824 -41251 -119864
15759 -119864 -29206 107092 -8262 28614 82761 -94819 -134154 -87800 50586 19613 -85039
15748 -85039 -139749 -81818 -152853 -193468 -153325 -134525 -198467 -191653 -234769 -216295 -198224 -136599
15736 -136599 -78078 -42872 26459 157679 128766 83173 110710 86935 26237 93667 106517
15725 106517 33467 150750 239180 152023 7573 34042 23417 -11669 -40383 -48801 -79547
15714 -79547 -54975 9829 28272 -116091 -137750 -74546 -5030 68324 267177 174178 96741
15703 96741 222146 303477 175280 131280 114262 41492 -9807 45800 -17319 -148449 -141447
15692 -141447 -126956 -144676 -76902 83280 42828 -98243 -134948 -64072 -42012 432 -15572
15681 -15572 -69409 -82706 -88096 -35416 -5063 -12201 -140787 -163442 -186826 -123417 -147086 -135815
15669 -135815 -49652 -54122 -62327 -66952 -4884 -53468 -33047 58464 53877 -90963 -171087 -104469
15657 -104469 -37175 200380 217289 171595 236729 180913 158075 150474 142911 5034 -19881
15646 -19881 -26983 -7123 89054 42398 42614 76185 160985 161490 100503 41467 39781 132609 110940
15633 110940 2029 35319 66199 37793 16100 50449 47548 111420 229325 229940 192955 164559
15621 164559 84354 34395 -58824 -66774 -36328 -74447 26847 69554 215824 315333 343575
15610 343575 309808 232722 81440 76678 143554 187744 207072 203683 118616 35074 83420 178409
15598 178409 189303 309908 263905 179075 138852 135598 44616 47979 46155 20520 63994 31753
15586 31753 -78709 -219215 -147060 -101683 -125985 -45824 103318 120187 138953 61936 -18797
15575 -18797 -98145 -128802 -89421 -76412 77116 129656 56464 57029 79764 13019 -64716 -154202
15563 -154202 -79661 11827 9254 -52499 59612 129145 112958 97933 99116 84499 120845 214701
15551 214701 191133 113135 12774 -26517 59012 62454 119072 91531 110714 42649 -105552
15540 -105552 -152979 -88526 -18518 145116 201085 271784 169245 -74471 -144699 -44079 -118931
15529 -118931 -108019 -102097 -180614 -88138 77285 74355 157168 95196 -39282 -14745 25946
15518 25946 -108534 -102699 -42458 41797 25920 80544 93208 12057 8064 51225 -73766 -88992
15506 -88992 -56789 89551 158889 125896 61255 -62579 -19396 6416 80798 55574 -37988
15495 -37988 -20448 -102719 -210174 -188274 -124059 -33338 -6010 -21852 34044 78104 34439
15484 34439 -37726 11495 99362 149524 111059 28836 80399 35783 17734 27657 -60248 -9611
15472 -9611 -15353 63235 139417 106145 15481 -91950 -121198 -88041 424 60106 -63197 -108964
15460 -108964 396 86154 177922 191474 27282 -85405 -29155 46122 15536 45558 61668
15449 61668 -46712 -103738 -33178 -18345 2574 71883 191881 212002 169123 141077 189083
15438 189083 261350 298481 303227 235240 75394 19732 -19123 26933 54819 126408 105426
15427 105426 128592 97930 -44259 -152976 -282495 -266685 -195124 -86157 -123360 -173620 -184558
15416 -184558 -245099 -207928 -115423 -115707 -241453 -177738 -247389 -330940 -373859 -228471 -30391
15405 -30391 31918 -38197 103802 241114 126235 49868 28117 25181 -64448 19983 25172
15394 25172 -100570 -103407 -74048 -131491 -115378 -143702 -103322 -116180 -52103 -81328 -81758 -63989
15382 -63989 -101766 -120502 -128819 -38845 28179 22689 48397 -81768 -146908 -203199 -224867 -74199
15370 -74199 -18714 79052 100896 29324 58831 115927 -3171 -7571 -127817 -118161 88526
15359 88526 195737 160727 83080 101908 63813 20479 124742 188797 234053 193849 192789
15348 192789 204180 169955 66050 92721 5792 46636 67645 48780 64323 105892 111602
15337 111602 94965 161386 84783 37511 28882 60380 29921 90161 18033 -91689 -26816
15326 -26816 110811 175349 83661 66695 47793 -61137 -100869 -55461 -102698 -142796 -116627
15315 -116627 -59343 23497 74929 113456 89125 32399 69496 189928 71905 -13136 59220
15304 59220 178055 256455 192413 134091 40860 36011 -23673 -170425 -205346 -105881 120920
15293 120920 154099 91712 84629 152787 14129 -53419 -90044 -95675 10153 38149 44993 51953
15281 51953 181352 189926 159594 132183 -6515 -40724 55990 132280 227676 184410 68044
15270 68044 81881 112737 130271 79344 76779 -113080 -159654 -138981 -99863 -1609 39113 20897
15258 20897 -85422 -159551 -137578 -62107 -42182 -19921 -138848 -194175 -149676 24779 93999
15247 93999 41452 27740 73805 92510 61355 91519 40192 117500 165814 160529 -15442 -161294
15235 -161294 -225996 -167183 -165789 -186201 -106298 -6918 101078 147930 29176 97770 115850
15224 115850 106171 82947 66781 61145 42908 -8514 80908 168994 112425 26951 -31199 -1727
15212 -1727 -14663 -22721 19909 32667 -59735 -159373 -44893 31349 -7000 -24023 26035 -81691
15200 -81691 14840 170154 214391 90374 2268 74162 251431 243411 262130 74117 -99788
15189 -99788 -138799 -71419 -87639 -113732 -148120 -73171 14363 14736 56030 54822 100273 50120
15177 50120 -63680 -139132 -156665 -129807 -78785 -129562 -102448 -117416 -174564 -258100 -161091
15166 -161091 -21698 -13657 -34564 -123004 -115475 -27931 37102 63317 -6789 -13441 -48751 -116490
15154 -116490 -46462 40485 13098 -78580 -86892 -151874 -166727 -153985 6572 100387 210542
15143 210542 244995 214064 146854 111035 120939 49818 58565 13756 26033 12 21477 119547
15131 119547 102232 69942 70845 25295 115028 78391 147355 116992 89679 147740 149791 164181
15119 164181 78878 74587 69680 56879 -28557 -8361 2004 -13068 -75958 5095 32223 -14651
15107 -14651 15943 47476 -68401 -46850 74733 80854 113327 -10724 70044 -33952 -195039
15096 -195039 -270494 -240170 -172164 -165366 -174424 -31653 55956 67040 138696 169947 -751
15085 -751 -11623 90182 139922 209523 157491 74340 140214 217625 315985 272703 124402 -4998
15073 -4998 -48789 -66034 46360 191456 215562 88156 73368 151582 41331 79560 185489
15062 185489 123194 29776 -47808 -222004 -155234 -182490 -195500 -182813 -216582 -172302 -103589
15051 -103589 -153385 -140285 -54906 -51660 -114907 -111352 -40919 66304 97527 136783 156880 14939
15039 14939 30162 137814 193160 211279 164835 131683 173226 288602 214564 71541 10045
15028 10045 34329 177165 234498 130448 46500 -27711 44802 68876 155751 121654 59256
15017 59256 -17880 -18395 69330 -28485 -59020 26168 44355 76456 106575 105406 -10335 -87821
15005 -87821 10103 102051 165357 113170 55156 -11743 129255 155431 80723 83995 57075 62272
14993 62272 39433 83258 38204 -20703 -27931 -13927 -33153 -129571 -61048 90216 177009 -597
14981 -597 -39254 51793 159512 223991 384234 316907 351078 295641 84114 209 37027
14970 37027 14100 4351 42310 91805 174003 70541 -50504 -93126 -47166 -34370 -28427 -116392
14958 -116392 -90527 -1457 21276 -59985 -62970 -4829 61972 100741 13581 17598 51767 61364
14946 61364 -82517 -108226 -14073 12205 -83525 -73730 -36275 5296 7501 -6132 32118 -106527
14934 -106527 -143097 -106584 62932 105587 6169 -17747 -46665 26354 8366 -83075 -22725
14923 -22725 60712 138706 72892 10782 14776 21189 83164 193107 185079 144039 191672 212201
14911 212201 152393 97887 86640 67864 89980 193027 240579 124661 26257 -23765 28412
14900 28412 99893 185740 62340 -28556 -14191 -66856 -24503 33630 7794 -88686 -101180
14889 -101180 -11927 49776 -44327 -69282 -15404 88918 61520 -13297 -55625 33528 3615
14878 3615 67806 56907 111385 156655 92390 -26986 7360 60709 -15679 -58967 -110975 -113127
14866 -113127 -87885 -48803 -60086 -192229 -124960 -41331 14259 40635 -32613 -145225 -152033
14855 -152033 -96999 -98950 -101246 -71845 -17926 -24578 7857 17904 109165 141451 90391 52890
14843 52890 89375 41637 81849 235563 193024 123397 94990 41215 69265 77990 6924 36598
14831 36598 32118 -128342 -234973 -136927 -119127 -143443 -213177 -183165 -53929 -39929 -155292
14820 -155292 -145487 -11410 77749 7062 17816 -10881 1253 -6184 -20931 -29686 -51010 -30628
14808 -30628 -139186 -134233 -132017 -152428 -124224 2585 136211 135227 183403 275845 302626 241910
14796 241910 171827 46802 -30549 -125530 11820 86954 116261 91177 87665 3022 -88019
14785 -88019 -62902 11188 116157 97828 92896 38388 -8048 -50112 -67930 -31419 -74832 -50908
14773 -50908 -43891 -112262 -49089 -35886 -49078 -102998 16606 18071 -69556 -70284 -38146 -2230
14761 -2230 -15797 -60045 -131167 -189346 -235624 -207452 -119902 50877 138369 69664 -1698 -20465
14749 -20465 14377 129467 43129 48134 65075 32228 71573 42220 40536 78163 97465 9361
14737 9361 126742 56647 -49124 -124027 -95319 -22629 56399 61126 -22769 84170 111427
14726 111427 70022 72714 139049 167419 177893 119496 77644 70380 33190 -108127 -76931 -14365
14714 -14365 79865 96329 40242 -141861 -128484 33456 84629 106352 202364 219088 208006
14703 208006 235457 138994 -20052 -92223 -21688 70583 -17862 -45581 -115964 -52130 94204
14692 94204 257349 371218 205353 167335 142762 135467 118885 150145 141877 150193 200061 166047
14680 166047 152333 43785 -36516 -93462 30251 49447 -10193 -5865 13166 70287 13787
14669 13787 83325 -11610 -71887 -36826 59057 149131 187113 178664 189268 233172 127983 56993
14657 56993 -15671 -72433 -25458 52454 28675 -148454 -306604 -246945 -119325 -38574 -11450
14646 -11450 -34012 -93661 -61502 -20023 -24027 11978 137785 61394 52067 140205 139212 -15699
14634 -15699 -80808 -83088 -15705 -141428 -163778 -14743 141294 140224 54308 -48737 -97416
14623 -97416 -111315 -92263 -2491 35451 9001 2715 56695 22399 -8577 -6062 81174 150375
14611 150375 147295 159815 49326 35166 52615 1977 49043 194367 188964 72316 96156
14600 96156 129059 135675 150250 94474 84185 21198 4138 -13573 -58537 -86257 -85276 -169699
14588 -169699 -238154 -205776 -171254 -131638 -21041 71554 204609 232358 137571 19434 -23121
14577 -23121 47188 87920 56614 5163 99873 227527 244715 107543 41987 48486 5662
14566 5662 95298 137543 99475 150421 166004 49784 -34813 -21952 -80385 1809 96510 108107
14554 108107 64062 -674 -43858 -41918 7275 -25179 79454 85080 -55503 -80224 117896
14543 117896 310366 359034 303825 195503 57350 -112663 -191067 -225314 -229145 -192001 -34685
14532 -34685 81122 112854 52054 58846 159174 174694 53709 49692 117258 95705 127819
14521 127819 75684 68886 -5983 15424 66312 1547 -112419 -145860 -106019 16996 16777 -35686
14509 -35686 -37388 18419 -104 34700 64879 139627 155142 58648 -18493 -112506 -132057 -182406
14497 -182406 -124064 4264 -6066 -38029 -32955 -67495 -17801 -11645 106884 95139 -87688
14486 -87688 -118938 -79393 -72695 -61264 -121043 -180922 -187799 -9684 -34355 -65491 -33101 78531
14474 78531 78039 98513 139184 175160 175501 227577 172106 96483 92980 -28762 -114450 146158
14462 146158 199839 -29173 -65711 -92390 -90441 -49307 -51158 -108415 -66479 -61386 -90421 -87278
14450 -87278 -66035 -62554 -17720 79696 67162 20759 12497 67738 144346 75721 178523 212670
14438 212670 -28644 -159744 -143307 -63665 10547 -73112 -162063 -138683 -131676 4082 110258
14427 110258 70818 14717 -7343 37389 -30834 -89189 -80436 -22909 -87954 -103548 -31562 13128
14415 13128 48508 96598 204116 306863 320214 385891 346002 219068 203944 183501 247514
14404 247514 169170 70644 41697 50883 -38092 -46862 -44638 -80135 -111279 -206740 -206799 -164047 -105625
14391 -105625 75061 25517 30054 97452 33464 -5822 36426 -40724 36402 218051 247058
14380 247058 137953 8560 -40514 -86568 -24780 69286 75035 40460 -211 -34879 -38982
14369 -38982 70136 204486 105013 -37074 -106811 -44358 62258 77489 77205 30957 -15677
14358 -15677 -52184 -52316 -11092 32150 43015 -20923 -9149 -19939 -70827 -1553 -8249 -55129
14346 -55129 -17255 -47803 -70499 59980 224516 297775 291633 281765 161584 83457 8416
14335 8416 -100987 -152981 -117106 -88662 -2421 -8150 -2448 49979 72580 58617 44775 27242
14323 27242 55022 11784 -39389 14973 33562 79926 74431 40424 7749 90955 166786 125677
14311 125677 -13747 -2728 -59656 -121570 7245 74389 26631 38597 -24226 15975 24403
14300 24403 -24379 -105795 -97057 -1123 68810 150096 133201 220181 130870 40671 -23557 -54874
14288 -54874 -27624 69778 119763 89015 158553 182188 -72475 -93413 93329 183950 242986
14277 242986 269590 198918 80915 -37854 -26885 20600 -7438 35727 57560 22222 -35073
14266 -35073 -99167 -66288 16558 45969 72163 55362 14043 -46596 92376 200642 104573
14255 104573 55267 -7149 -109188 -38569 -6784 -14501 -1974 -117858 -114649 -162989 -38786
14244 -38786 -30002 -30343 -11392 -17380 33077 42775 -6539 -83034 -129989 -109607 -139051 -182231 -166087
14231 -166087 -137020 -90803 3406 93358 4163 -90491 -41570 18704 -18 7285 -6888 75219
14219 75219 26815 -108660 -164316 -84825 -55269 -29488 -118791 -204674 -172782 -169227 -90695 122837
14207 122837 188513 39615 21656 67603 77930 50430 97836 146096 90097 164456 289726
14196 289726 281861 188464 116257 26711 -1004 20337 16709 -86966 -106965 35239 98032
14185 98032 149030 146826 70099 152776 230608 176534 177696 104186 51270 74798 -9287 15419
14173 15419 143795 135108 33906 91330 192791 120488 49872 689 9909 -90181 -98869
14162 -98869 -50651 12786 84418 36249 11731 -62737 -80419 -137716 -78573 -50399 -78815 -87878
14150 -87878 -89592 -15280 105317 256262 349863 145772 31573 68579 83135 23157 26740
14139 26740 10558 104132 261132 166217 72309 106154 57046 -11829 34308 -21948 -14293 143001
14127 143001 45088 -12470 77099 181813 187904 205666 93440 48660 74618 -48592 -64273
14116 -64273 -42015 -26540 92677 26761 -13279 -117109 -209824 -137632 5402 3026 16685
14105 16685 39558 77811 143472 119268 99407 114766 47226 15064 16950 -28430 -110904 -3613
14093 -3613 148901 122578 80903 78379 19592 65213 59945 181789 149018 125446 108668 31257
14081 31257 -952 38879 51816 -6634 31164 42261 31422 14693 -83100 -207416 -245138
14070 -245138 -228364 -94537 17732 1147 -22395 -77072 -138518 -174654 -83039 54524 125930
14059 125930 -15948 -185938 -162578 -71438 -6969 4412 25557 91045 137430 12921 -92261
14048 -92261 -117090 62563 137720 54745 -179518 -302943 -238821 -55142 -73148 -149597 -99218
14037 -99218 -38835 -86749 -107885 -240488 -267089 -152717 -3485 35045 -35537 -46124 22546
14026 22546 -33107 -29775 -36897 -28772 -40812 -35460 -45856 -44991 -75717 -96066 80965 176055 144359
14013 144359 159958 115362 31204 -75612 -66133 79533 35374 -72307 -62485 31222 38566
14002 38566 53322 20872 -104529 -219774 -201368 -153137 -65279 -320 -15295 51298 -21943
13991 -21943 -70745 -37465 -104956 -53622 -38373 -36607 -61290 -113790 -9449 124938 209201
13980 209201 131348 89193 153280 146110 75301 86191 86589 153711 212084 220791 149127 72788
13968 72788 58582 82347 148184 92432 -21862 -106010 -210030 -247512 -199728 -211651 -195397
13957 -195397 -130619 -129114 1511 51365 -35704 -75073 -23215 31002 -20490 -92203 -69675
13946 -69675 -6594 -22898 -8853 94836 30397 -175754 -108302 -80990 -14788 51353 -19063
13935 -19063 -39297 -74464 -93445 -142381 -73912 44159 -56465 -10058 -36756 -42926 -2151
13924 -2151 31351 131443 67060 -59883 545 -34373 -106183 -33065 -82132 -163184 -242792
13913 -242792 -265169 -221873 -150256 -120803 -97674 -78249 -110756 -117435 -69246 -86123 -56297 37708
13901 37708 13559 38337 -51319 -95264 -43292 19552 59447 169145 211380 281269 216088
13890 216088 144992 148616 52442 -17626 -70310 -78102 821 10199 -90552 -191737 -32563
13879 -32563 -24344 -32667 5982 8502 -89825 -132594 -79738 18509 14896 -60732 -187131 -192757
13867 -192757 -194204 -140551 -69666 -33216 -96745 -28731 -27906 -30782 72129 26260 9472 -18379
13855 -18379 -42017 -19212 -13192 -31144 -64498 80142 120054 36399 52725 82113 104703 52233
13843 52233 16530 -81127 28154 54947 -49928 -81110 -73022 -192407 -199270 -33098 46742
13832 46742 -28037 -63377 -1435 28241 143081 108905 71677 129585 139043 63837 89249 40325
13820 40325 41037 -120319 -149840 53898 174685 181866 181103 115619 26680 -27603 -67235 -2210
13808 -2210 93084 164811 194137 163845 132941 105965 74537 15482 -4880 1765 -57560 -82834
13796 -82834 -14279 -90704 -124669 -92619 -151344 -140859 -66697 -155206 -87314 -52192 -12545 -3143
13784 -3143 28191 65206 124489 171704 144924 64002 96766 121993 109028 103485 100242 34483
13772 34483 -22046 -77767 -54582 -75652 -275216 -372570 -235683 -171288 -236379 -160678 -126222
13761 -126222 -90422 26043 108491 26635 -7359 177022 88068 54643 -43221 -149036 -163461
13750 -163461 -162510 -141998 -167627 -120111 89295 245207 175203 37672 -64712 20101 4716
13739 4716 -39234 -12314 208 106155 139524 204868 218147 84862 17326 -24030 -97205
13728 -97205 -41921 50449 -63775 -151153 -118197 -121305 -179631 -219518 -122198 -134879 -259459
13717 -259459 -129309 41825 69709 -85115 -158191 -115765 16616 -21615 -148063 -109939
13707 -109939 -129386 -97780 -51827 37348 11364 -5307 -78515 -141236 -105338 -179792 -159499
13696 -159499 -173027 -84925 31682 8307 -10115 25807 46534 -40407 -82414 -78020 -105622
13685 -105622 -118018 -38698 -88452 -173178 -247434 -206147 -185621 -115116 16450 -32460 -56855
13674 -56855 -91759 -128265 -180495 -150895 -183001 -234198 -137684 -81347 -83184 -58868 -9554 120395
13662 120395 97497 37265 57662 82966 -32759 -126327 -12392 81356 41175 11088 7246
13651 7246 2853 1900 54773 86607 202629 240502 196346 155266 48144 25905 111107 169249
13639 169249 212992 189137 110650 6415 -10055 33614 -43319 -25454 20199 21158 -33625 -152145
13627 -152145 -145720 -96136 -25928 -67409 -137539 -127598 -90462 -58757 -43732 -20187 -90522 -89165
13615 -89165 20058 75544 143394 78844 -125799 -125073 -40900 -79430 -99465 -75336 -90156 -26633
13603 -26633 -143779 -197347 -223520 -166106 -36061 -69694 -43576 -21799 24257 -10129 -4029
13592 -4029 -7896 -99610 -166996 -73292 6588 37511 96263 32264 -146646 -201688 -287497 -237717
13580 -237717 -273392 -223659 34453 5009 -31115 57004 17940 82534 105739 122683 116289
13569 116289 58173 -51456 -118638 -80060 -60049 65349 155472 28669 -17266 121616 117044
13558 117044 -13273 -13538 80571 122075 119065 16794 -107313 -80094 68340 23326 -12259
13547 -12259 -65890 -49056 62202 16102 -24401 -64210 -103561 -178537 -239804 -174688 -150051
13536 -150051 -197488 -200937 -160321 -192391 -155859 27692 173024 141902 213650 269734 222488
13525 222488 176727 156957 116471 14450 -71063 -30315 -56835 -184832 -196573 -96106 -50901
13514 -50901 -44430 11411 65655 -43697 -17907 99703 105104 13126 -5959 88470 42274 25988
13502 25988 -49017 -179809 -141639 -24512 67583 73940 -13469 -17699 -68534 -89665 -92800 -61953
13490 -61953 -73745 -3052 -27314 -26559 -87696 -41259 934 32050 152285 157182 42377 -30486
13478 -30486 -31141 62526 99828 12516 -70173 -86471 -88562 -144886 -167521 -85171 -58866 -36277
13466 -36277 61358 195720 159389 -8843 47044 -62080 -119316 -71710 34683 126400 173909
13455 173909 198517 192768 41913 -618 -47159 -46185 -27348 -103998 -135885 -133771 -111788 17990
13443 17990 -62855 -91768 -2480 90515 33463 -43962 -25838 118700 111057 -62410 -37595
13432 -37595 -30876 -39611 9311 35951 63172 76703 36060 6716 -16373 -64951 -106776 -89117
13420 -89117 -41045 -40301 -58333 64445 88327 100137 120264 52241 -64940 -33076 41735 122035
13408 122035 15199 23015 119025 176883 143787 82615 16418 -83661 -92769 -110427 34145
13397 34145 12722 23951 -27514 -67085 11074 85757 73776 -353 -50695 -124404 -62535 38127
13385 38127 83966 65609 17493 78684 142305 87666 128021 188386 143273 104916 -34375
13374 -34375 -107263 -121378 -160603 -169880 -139377 -39888 -86012 -104139 -55608 -134679 -140358 -69561
13362 -69561 -100655 -125463 -157593 -4730 115179 40529 -16427 -76140 -178554 -182660 -267815
13351 -267815 -189636 23816 148292 175769 178691 106928 -11049 -18596 32652 42507 74529
13340 74529 120566 144501 85252 3046 7994 121215 69852 -59931 -78950 58348 136831
13329 136831 27355 11791 26417 69861 16532 -78036 -111973 -132150 -100847 -167113 -90183
13318 -90183 -139551 -236030 -219133 -144495 93126 203575 35278 136041 224768 277782 169427
13307 169427 84043 130777 77523 188979 215357 137306 106302 38118 -40979 -70027 -36905
13296 -36905 28085 121524 40369 120916 238169 75767 -19610 20267 -57155 1520 102488
13285 102488 77209 51936 26076 132987 139095 124283 153063 101659 92450 143563 103070 36304
13273 36304 -5489 -50732 -153244 -469 123930 116387 49291 -136629 -191688 8388 41259
13262 41259 68917 87619 142380 160317 159824 123066 -12255 -27698 47382 205584 293211 126318
13250 126318 -117797 -275818 -261009 -156024 -71863 -34228 -26268 -42355 -48735 -79507 -36562
13239 -36562 -51032 -3336 110927 73509 37328 124166 116115 28142 23729 187329 156190 43389
13227 43389 -31903 -56595 -116187 -159913 -66773 84831 118337 19073 1447 -32015 -170646
13216 -170646 -94656 4671 55876 76740 82715 125891 60382 -19373 -33812 -74581 -66673 51341
13204 51341 -32590 -84593 -40708 -151014 -223168 -83786 55651 10579 -730 97519 99818
13193 99818 153422 135880 29203 -52792 -9382 99566 158677 10348 -184744 -209445 -228222
13182 -228222 -202445 -257989 -198770 -144270 -221594 -129152 -40336 42021 54842 -100418 -74340
13171 -74340 -37773 -27415 48900 66481 -3357 270 90050 91705 95839 182890 136370 104829
13159 104829 208528 178037 86171 175862 301685 107065 -124785 -195372 -274422 -178112 -2247
13148 -2247 112851 182221 -12300 -96883 -186444 -159973 -114604 -179782 -107206 13461 99267
13137 99267 111794 -54051 -138774 -34263 -10275 -17880 -51108 -120675 -132242 -214978 -113690
13126 -113690 -24862 -92488 -6215 80226 77307 62303 -14856 -147716 -199193 -136846 -25161
13115 -25161 -35183 -51866 -153417 -194076 -131929 -61426 -108051 -153886 -167990 -170639 -144673 -124488
13103 -124488 -127905 -196102 -184751 -171654 3352 24689 38232 221033 179363 8341 -80101
13092 -80101 -114652 -72695 -48098 3365 67830 -40856 -168787 -276068 -241932 -107206 -7037
13081 -7037 1741 56947 55066 87008 123976 80964 18309 -37393 16816 39082 63338 163712
13069 163712 222855 268389 325933 294432 229776 231301 147121 49933 -57381 -182605 -273522
13058 -273522 -171026 -111861 -112202 -117115 -54277 -37695 -23248 28636 51713 104565 45941 -94252
13046 -94252 -179481 -225729 -156007 -95203 -143728 -170559 -63300 -66491 -58750 -64724 50526 127151
13034 127151 187083 197991 149627 12704 -57243 -9247 37670 3436 -52403 -105332 48625
13023 48625 109066 166248 146556 87287 -4944 -39800 -162106 -176909 -90677 -38376 64439
13012 64439 97623 -18769 37401 166684 276597 246891 26147 75870 142810 98826 154645
13001 154645 229492 242708 138453 67536 48246 111171 112608 -164110 -300404 -181718 -103068
12990 -103068 -140098 -137322 -85754 -6280 10567 -36908 20736 152618 96698 19247 -15041
12979 -15041 -112712 -211470 -100104 -20277 40076 55020 -29739 49117 181130 101602 12759
12968 12759 73707 152651 6968 -123554 -136779 10207 49224 92417 186302 96191 -55329
12957 -55329 -172841 -159478 -64226 16127 12748 78323 41065 -11588 21071 100688 51688 27620
12945 27620 100500 36427 -66066 -100248 -149654 -219028 -231412 -275672 -204005 -72973 -59560
12934 -59560 -54109 42633 215098 284302 178540 13345 128822 75634 155091 129381 117375
12923 117375 169068 96255 9684 -79074 -69059 -44842 -4154 1975 22773 21683 9938 2010
12911 2010 24959 -3245 47579 19339 -86304 -118973 -43028 85338 158820 155863 14779
12900 14779 -104254 -175334 -156461 -198616 -215430 -41435 -10143 -93332 -104544 6823 -32400
12889 -32400 37087 69663 138340 30410 91261 71302 29789 -71849 -25364 88874 173657
12878 173657 215459 182609 149476 58921 -44076 35220 18759 1418 22524 30535 181277
12867 181277 292629 216283 89308 -40743 -156817 -167725 -183819 12387 121892 163474
12857 163474 227933 223060 187243 134462 248836 201394 158276 174130 185700 124596 -112775
12846 -112775 -106198 -2031 -75978 -121097 -118700 -149103 -80843 75565 145237 92657 76161
12835 76161 75045 -16715 -69397 -115782 -240256 -208885 -107385 -139115 -106180 -171608 -184354
12824 -184354 25740 -68118 -200782 -133006 -113349 -82748 -63220 -41818 41477 95106 134601
12813 134601 137363 120516 3435 -96774 -61952 45077 113222 85026 173056 115619 -842
12802 -842 4541 95160 62840 -120961 -176032 -128449 -56655 18388 53133 34944 -176042 -292097
12790 -292097 -292710 -271240 -291543 -204702 -91476 135401 96040 -4559 -6307 -15414 10114 -34582
12778 -34582 -67163 -16988 -48584 2017 51573 54526 74621 28534 -140373 -171418 -111815 -169354
12766 -169354 -82280 -24021 -83145 -147975 -117650 -1283 -25882 69218 116023 58924 -134544
12755 -134544 -210879 -42760 128180 234946 227713 116223 168 -83670 -91915 -109083 -214693
12744 -214693 -244971 -122217 -93270 -52091 18863 -21450 -43458 -95588 -25962 72663 18167
12733 18167 -43772 23029 -26932 31331 145271 132728 87208 65610 9155 -97636 -32489
12722 -32489 -58568 -47187 -36396 -50986 33270 147650 127260 29850 48380 -42951 -83099
12711 -83099 81664 135307 61879 30506 -42962 -157609 -58718 -54719 -72158 23378 50865
12700 50865 -36001 -103904 -41051 -27896 -110358 -122028 -17327 2195 -60331 -94529 -49765
12689 -49765 -17605 167126 177180 198865 93472 27412 -43107 -9185 -16346 -115473 -178026
12678 -178026 -181091 -236199 -74444 18926 -32371 -190891 -281753 -33717 6955 70140 11127
12667 11127 36662 89334 38075 -110240 -104130 -31946 -17637 -104208 -146406 -81557 -35178 38501
12655 38501 122754 145460 41736 82773 -5965 -19402 60549 90912 150180 59880 -40804
12644 -40804 35581 30628 32628 -51476 22548 140229 107563 -40546 -200239 -195574 -140189 -79620
12632 -79620 -57402 -179132 -196082 -152211 -47544 47843 -28288 -40824 17197 20703 73342
12621 73342 23588 -5610 12324 193953 267606 184019 13538 -52237 -24126 49238 51532
12610 51532 106841 151854 121118 -30405 -132266 -232727 -115657 -6241 -21377 -38615 -117419
12599 -117419 -159600 -209281 -180366 -37144 -56184 93297 162907 1728 -20039 -118199 -93960
12588 -93960 -23555 67527 86238 2289 45500 5566 59282 83896 37787 -21021 10776 40720
12576 40720 73298 221735 227851 98576 -123357 -201729 -65625 -6981 -107319 -182688 -99278
12565 -99278 -5712 -32228 -161155 -233228 -189954 -121685 -99958 -169834 -259 153949 182838
12554 182838 134740 8344 49115 35837 91495 44540 71181 105654 170079 72766 -41462
12543 -41462 -19436 34527 112749 178519 100293 -12116 -76638 -75762 -45916 -168248 -183316 -149902
12531 -149902 -212751 -220067 65936 225174 177174 190877 178494 156587 99886 -15430 -55131
12520 -55131 119140 -27248 -133721 8404 111026 49228 107407 37565 -45613 39740 150747
12509 150747 138851 -65850 -155708 -6030 32892 38049 -146975 -165332 -116643 -110221 -162156
12498 -162156 -202559 -55725 58961 -16121 1634 104971 81324 -201325 -266452 -224971 -150039
12487 -150039 -149453 -96360 -105615 -78985 -124698 -216011 -119608 15257 83573 202210 189594 134795
12475 134795 125998 9644 -25058 -116018 -78880 -39904 -20564 -139966 -162242 -115947 -26370
12464 -26370 41283 125375 39811 -24479 -88185 -93323 -143038 -108908 -40583 -50053 -43392 41520
12452 41520 127912 -9178 -86296 -94117 -83106 27935 15517 39864 15274 -55581 -22466
12441 -22466 -134349 -213632 -193764 -208797 -188184 -179829 -83809 -129967 -184701 -83996 -85764 -34671
12429 -34671 1235 118973 205337 219206 176634 78707 -20057 92387 139907 209611 115352
12418 115352 -83536 -158894 -51859 -56591 -143752 -202689 -52961 48336 62319 93500 111774
12407 111774 60599 3890 1074 -71153 -111013 -59720 -27071 58234 -10933 45374 -4743 -18632
12395 -18632 -64722 -140484 -254313 -209302 -72563 33751 -39528 -137235 -57578 -36025 -87666
12384 -87666 32210 129919 168175 85967 -44297 -41463 72693 179959 155456 111670 160516
12373 160516 203613 82589 -90110 -137153 -98833 -68807 -194487 -121099 -106607 -51636 121557
12362 121557 114402 -31402 -21916 86148 221087 175523 168427 286484 266761 132823 165941
12351 165941 244040 106001 -171636 -176132 -125988 -85828 -15951 64923 80508 101310 85039
12340 85039 -37891 -115630 -191440 -189030 -108893 13024 164047 187148 188300 243929 160463
12329 160463 142415 130984 127235 105911 -104343 -74973 -21860 -23265 -29007 -101383 -187074 -229005
12317 -229005 -98366 -1349 -28468 -3422 67557 161145 330365 262854 139938 79363 26727
12306 26727 129095 93583 2775 83310 24038 -54135 -136021 -47688 12375 930 107598
12295 107598 113239 -51206 -59774 37222 63912 79074 135287 19744 -10417 54441 39661
12284 39661 116292 123344 159306 183875 82905 78988 77619 96179 90702 146953 8965 -60764
12272 -60764 -10929 -141087 -127402 -113922 -191257 -82054 30997 -10242 25026 66182 28542
12261 28542 69522 6795 -56089 -129429 -115126 -38059 -91485 -161928 -22610 35581 39617 -42382
12249 -42382 61700 137771 15757 -61359 -7289 91889 133453 161702 148195 165861 162285
12238 162285 56696 48174 59885 24715 20451 -67930 -31599 49887 48840 87039 130150 41905
12226 41905 41991 -61436 -112637 -36047 166410 179272 136277 131757 51366 119134 62896 -72526
12214 -72526 11887 41206 -9173 75610 146815 139800 111104 34545 31109 59138 -15519 -86891
12202 -86891 -93105 -128170 -147412 -251311 -317060 -161134 -51905 -69492 25942 -39039 -62968
12191 -62968 -59884 13378 23264 -73069 -195594 -44025 74083 -22003 -85282 -92880 -133123 -152339
12179 -152339 -90809 -48443 -104892 -74156 -33765 -14407 -21668 -3171 -11035 -2329 20821 50836
12167 50836 22235 13559 80230 3695 -45541 -13327 6447 117788 145523 62474 37313 70579
12155 70579 35108 -84782 -188175 -150106 -77808 7411 -28731 -42931 -69237 -65045 40958
12144 40958 91937 37771 930 -41523 -4398 -18723 41939 34716 69910 -117525 -95791 -145371
12132 -145371 -241915 -245982 -219399 -188600 -38017 39048 40102 60440 111455 87149 36068 -3449
12120 -3449 2546 -51981 -134667 -195576 -175981 -15090 81876 28042 42631 -9645 -49953 -28674
12108 -28674 -52620 -45124 2751 14158 87475 206447 170950 55109 32086 -11383 -71938
12097 -71938 -202634 -160632 -81956 1648 -25984 -37843 20547 -42533 -56480 -3612 -6626 -6021
12085 -6021 13647 -29320 -76241 -31658 10532 37039 -37916 -79306 -129193 -129591 -107575 -40783
12073 -40783 -41295 -77694 -13922 44667 -43839 -101522 -116470 -134501 -106867 -138373 -241905 -166489
12061 -166489 -88583 -111439 -55205 -46530 -165913 -206782 -229568 -190605 -23410 73081 96273
12050 96273 139230 125366 131307 117315 98853 178600 339853 268314 139237 49489 29734
12039 29734 73506 62254 -105483 -140909 -129457 -185546 -58696 84295 55204 -89063 -51339
12028 -51339 -84850 -1363 93314 130876 21678 15482 18238 3456 95346 15544 33461 32970
12016 32970 107597 128792 -65780 -84159 -75033 -168339 -163637 -144903 -108555 -174317 -128208 14292
12004 14292 15914 -90584 7573 37424 115506 169878 178536 77608 -89057 -67835 108357
11993 108357 94018 78763 47616 26817 -86072 -116153 -125158 -54523 -147218 -211770 -155829
11982 -155829 -166787 -98594 -90403 -44841 27485 95787 -690 -89796 55611 67278 -45877
11971 -45877 31858 60535 23950 2575 35205 -12240 -59242 93571 170184 54477 1794
11960 1794 -19714 10641 47844 39680 29788 88406 88965 -68644 -31592 21649 58825 -21319
11948 -21319 -108896 -108234 108 -13832 -63917 -108550 -149979 -115591 61012 122136 182582 166031
11936 166031 78594 2665 -102916 -137038 -167651 -86372 82146 61807 51414 2592 80834
11925 80834 28316 -74518 -111862 -28549 68390 154469 159895 71149 34492 57274 27625 26296
11913 26296 -11042 -41823 -21593 -58039 -38023 -49041 -266329 -306798 -118693 17772 100297
11902 100297 119557 83490 -3696 7551 92008 159955 96791 53404 116132 99438 20559
11891 20559 97009 35542 -6068 29280 -119910 -145246 -35046 -62683 -112383 -193522 -222654
11880 -222654 -338502 -295771 -251660 -163368 -123927 -95835 12713 43353 82729 -25959 -932
11869 -932 -62408 1269 87714 74999 76625 20144 -22130 12959 2518 64429 11721 27404
11857 27404 112104 106481 42084 -69681 -161200 -128804 -126383 3529 116998 96455 144923
11846 144923 48249 101652 139328 68016 33016 -49209 26839 50551 11629 -43306 -128446
11835 -128446 -61738 39819 -3718 -136806 8013 33262 -1098 30913 35077 -5252 -83153
11824 -83153 -104908 -9142 50585 80918 9996 -6241 -38895 -130200 -53243 81 -40363 58221
11812 58221 72308 -90384 -159999 -41270 23287 -14122 -23516 18298 27843 91522 162839 188593
11800 188593 149789 40313 -84358 -106207 -6079 54727 123532 225523 143705 15893
11790 15893 -21714 -9927 29259 -60928 -7834 4207 -28868 -70857 -2420 6563 -26513 17149
11778 17149 69188 238830 146419 24222 65429 95681 -2091 -116357 -130901 -83880 -101143
11767 -101143 -130479 -206830 -223052 -239625 -234422 -175277 -176614 -10920 128511 218090 165224
11756 165224 92306 39869 -105504 -105493 61438 43604 -47873 -34601 -44270 13982 37876 93046
11744 93046 167311 352096 302057 294325 230985 173067 63987 -56628 -64737 -11922 62574
11733 62574 90875 54826 42705 46124 153411 41579 -38307 7682 29701 65880 51999
11722 51999 -45267 69113 93290 4768 -27065 19819 -14402 -920 -136310 -111462 -79236
11711 -79236 38892 17894 -26962 48703 145563 117246 122462 81100 83086 -32948 -114413 -46800
11699 -46800 7238 5143 46222 126909 -26963 -117455 -172808 -138549 -215122 -155192 51349
11688 51349 172050 190654 87351 -77399 -146851 -198145 -272838 -177104 -114611 -56703 27724
11677 27724 14122 -36656 35855 63199 88886 114622 76657 -28669 100458 176414 88620
11666 88620 3311 5850 88538 84280 85313 1253 -80564 -98217 -102012 -77304 79400 146542
11654 146542 90958 18005 53404 55851 3029 -36688 64164 60371 29518 86982 73281 4433
11642 4433 -55449 -82963 25032 125258 94926 -8270 -11550 -126197 -201839 -169463 -198369
11631 -198369 -122740 -88269 -64594 -140027 -232741 -287079 -276486 -114623 60354 158402 140573
11620 140573 185033 122154 48075 55276 70850 90234 82564 36662 90622 53670 74050 208680
11608 208680 211301 94875 8840 -34248 -1357 11449 72573 67675 44348 4399 24488 -29401
11596 -29401 -70126 24216 22747 4072 -19744 -68587 -27250 -3408 -57199 -132102 -43641 9851
11584 9851 22880 42610 -78711 -41618 12419 -39354 -122108 -36748 91623 39773 2183
11573 2183 89833 234845 235377 148991 193649 225667 255201 177071 9218 -63231 10872 25449
11561 25449 -88423 -116609 -33971 -102970 -108074 -22557 -31566 -92691 -41853 22590 59751 -82659
11549 -82659 -50109 75168 100968 43688 -18927 -39348 -136210 -95777 64293 -40622 -79288
11538 -79288 66440 69644 77326 83096 17636 -102005 -211463 -253918 -135371 -77205 -71306 24040
11526 24040 -814 -39314 -25487 -55702 -118547 -56019 -89901 -170422 -148298 -118334 -107857 -233662
11514 -233662 -225049 -100600 -119023 -128199 -114567 -113800 -128442 -33815 19423 4626 12009 40491
11502 40491 72835 15985 -106483 -251799 -292870 -211451 -1935 -18034 -149428 -257730 -263373
11491 -263373 -44798 -9142 -16546 -17354 23430 -31233 81474 96304 55289 -25789 49002 182812
11479 182812 231551 144345 -110712 -236854 -157356 -8422 -86876 -87413 -11574 57334 176078
11468 176078 124282 48733 79533 169807 66846 -82990 -33035 40673 28263 -117023 -128603
11457 -128603 -74038 39041 -18090 -50237 -103586 -127743 -170899 -277989 -229157 -95569 -13968
11446 -13968 31357 15977 97620 19220 -10430 18942 -36881 -110972 28961 41096 -172507
11435 -172507 -103327 25184 147128 145364 -25321 -155517 -221762 -160743 -129928 -244675 -322889
11424 -322889 -224001 -125220 -127915 -146693 -87985 23937 23814 8165 83070 51933 156507 38799
11412 38799 339 -88982 -222085 -309750 -167187 37695 211211 18727 -93425 -100921 -83464
11401 -83464 -11894 -7028 11683 168556 93086 -98318 -162988 -168874 -166352 1813 64904 -18183
11389 -18183 -36542 -58710 -103888 -128635 -142272 -136248 -47132 -133033 -97857 -19330 24765 -126709
11377 -126709 -66801 -40311 -4181 -38325 -165435 -243281 -199858 -59625 -60054 -73654 -2553
11366 -2553 50371 7224 -141597 -141357 -52041 72331 -77956 -200974 -214013 -137044 -29296
11355 -29296 4223 95855 120994 65260 5562 -47609 -167482 -101565 -166188 -92676 57083
11344 57083 -47670 -128767 -138759 -214925 -214105 -158620 -64534 -62860 -89354 -138582 -206589 -259672
11332 -259672 -187362 -129320 -145402 -91708 -38599 90053 88245 -15778 -151205 -187747 -242362
11321 -242362 -193131 -188394 14050 146187 144375 61602 28839 -30534 -52924 -12841 151421
11310 151421 210039 174232 292332 288768 282268 239715 254948 235805 142080 80799 -52442
11299 -52442 -35186 104234 133590 78221 35907 107242 210641 165212 85162 16136 64594
11288 64594 94169 -18595 -32038 -52613 -52464 -61857 -33755 68642 71138 26941 67376 49544
11276 49544 -63166 -106898 -69975 -77267 -51089 8800 -104540 -156201 -97750 -66451 -34324
11265 -34324 -28980 -60465 -89719 -2096 95583 -53779 -51705 -25868 4161 6426 67496 94241
11253 94241 -12995 -47027 -36238 -32745 7485 80155 87890 -17222 -103084 -28942 -58988 -213060
11241 -213060 -174413 -212095 -288722 -92278 -60092 -160562 -179624 -32591 78825 182132
11231 182132 93872 50234 113999 104179 81730 112646 153338 176949 42699 -59528 -55697
11220 -55697 28015 166469 220505 296848 241661 -1934 -41048 47495 63260 68260 82006
11209 82006 92680 94681 59694 28683 55414 81585 16667 -102633 -63467 -1197 -67603 22372
11197 22372 43899 -63873 -68558 -39176 -18115 -95916 -121296 -124683 -188766 -275753 -282226 -116128
11185 -116128 -53915 -11565 92131 112763 102493 -28568 -199750 -154069 101073 123675 47608
11174 47608 31895 106428 19050 -130579 -216056 -155398 -110520 -114003 -17931 161793 174297
11163 174297 84848 -34032 -47042 8282 40450 29912 -71839 -50389 -41677 43315 125913
11152 125913 67275 -40439 -133492 -165537 -154508 -134669 -63375 104262 150186 123928 -35719
11141 -35719 -58758 -12149 -26521 -145535 -108120 -85466 -134125 46077 130796 83375 -7670
11130 -7670 -27082 -58321 -32150 5338 -24517 -127461 -63713 -22812 126825 101165 57714
11119 57714 -13509 -100081 -96384 -19073 -88104 -143704 -130006 -78257 29913 -16567 -90414 -78097
11107 -78097 -118902 21831 108706 151687 231656 203762 168746 222089 103626 -106951 -60367
11096 -60367 -48374 41868 105927 -4888 -40358 16245 -45532 -126129 -73063 -23434 -15324 -56909
11084 -56909 -89001 -133928 -123036 -93134 -16600 -22335 -45178 42623 -22693 -198877 -236649 -220341
11072 -220341 -126274 -86638 17585 48357 70143 -36811 30253 103739 166360 88052 -89339
11061 -89339 -110384 -65112 -30639 107882 151701 167151 186270 318570 316271 233778 162523
11050 162523 197317 189588 168712 189529 243019 170125 48197 -87054 -132338 -49921 33813
11039 33813 2782 30942 140121 147035 -4645 -8070 44323 29059 98434 139047 131943 -10643
11027 -10643 -138874 -70708 -107199 -149204 -143847 -51292 -48319 -16671 57713 226562 205829 39745
11015 39745 86654 98087 38311 25025 -18413 -41566 -157 22182 4790 67668 128018 4907
11003 4907 84 76167 74719 -48098 -113697 -109502 54411 119034 63508 95455 68707 84111
10991 84111 81896 11631 17035 65061 14543 -64395 -65209 26917 16133 12744 -16217 -64180 -80559
10978 -80559 21325 109760 204824 167157 96968 10109 77774 -9736 1123 -59990 -136942
10967 -136942 -171599 -143088 -149385 -47944 88510 71977 -5547 33165 133418 161134 153725
10956 153725 19241 -58263 31061 110727 1764 -58311 -60932 -114957 -142606 -101299 -27779
10945 -27779 -12167 -60586 -32221 6646 19559 -18596 11522 165366 148361 -11007 11923
10934 11923 66046 113691 69333 69113 -70920 -87121 -128308 -168025 -12993 22791 18490 37206
10922 37206 102459 80897 5765 -36415 46143 102040 147687 64634 109047 88714 60289 85429
10910 85429 181134 184090 38708 45248 129525 67250 -14811 -43292 -144776 -98682 -24968 13137
10898 13137 -5306 55798 92818 1159 -95939 -216863 -206760 -147075 -149922 -16437 99277
10887 99277 188819 178876 164899 156136 50857 62597 84223 54539 51843 48425 46406 34950
10875 34950 117719 214295 181621 88722 45463 50785 79663 3049 -9835 -4109 9752 12400
10863 12400 -38308 -55657 -146585 -185742 -133187 -152460 -125024 -71254 -153349 2380 143464
10852 143464 111269 -20494 18952 11984 -65377 -52797 -13540 -11530 22497 28745 -14302 -46128
10840 -46128 -67552 21681 77650 -4711 -38649 -86759 -222543 -141750 -154203 -72040 32520
10829 32520 54572 34852 115119 11933 -80732 -4344 -101881 -210780 -192526 -49401 105009
10818 105009 119767 12507 61525 239423 242058 107371 75255 12983 -38785 -146132 -180119
10807 -180119 -112341 -31445 -22793 34517 64496 -44724 -117134 -112051 -81759 -14460 -12987 -24268
10795 -24268 -23256 -2198 106967 154367 170904 157446 174081 238045 183718 71757 69295 190478
10783 190478 216192 135874 145085 66460 40146 -12650 26352 43610 99466 148073 94637 63046
10771 63046 -9321 -44875 -27925 25411 -64563 -168395 -128967 -147981 -95310 -52531 -62352 13287
10759 13287 -68032 -83090 51427 127225 181805 40463 -55165 -73923 -13186 67704 132326
10748 132326 116526 78731 127217 106345 79912 -31308 -172823 -205979 -202461 -141318 -25744
10737 -25744 88515 20706 -46989 5649 6422 -18214 -68036 -131238 -130546 -55635 -4269 -85290
10725 -85290 -105448 -165505 -120066 10993 -13649 -29702 9932 -32986 -74040 -97855 -39369
10714 -39369 -43282 -20476 -13063 -95980 -172219 -80405 -99131 -97279 -81475 -17394 -79761 -175058
10702 -175058 -217652 -145664 -96644 33666 16275 -11147 -7913 61404 88227 77145 -48308
10691 -48308 -113981 -24044 -57161 -15516 -1341 -93341 -7147 68713 -105418 -161798 -76388
10680 -76388 97364 100578 -38333 75492 206879 143682 -5375 -28159 -80475 -220867 -171371
10669 -171371 2332 30146 -99260 57292 112506 113365 39688 34506 47726 -13820 -118031
10658 -118031 -90935 -121975 -140749 -72492 -58228 -16487 41208 55274 -97117 -200065 -183764
10647 -183764 -103632 -105000 -153111 -251869 -227440 -151055 -126108 -38756 58436 34350 -57933 -67284
10635 -67284 31005 45715 -40392 -209676 -234674 -231078 -186840 -118334 -139482 -139053 -81406 -71051
10623 -71051 -60279 -201624 -226781 -328509 -277699 -161669 -28391 -48828 -118024 -148631 -92319
10612 -92319 -55018 28327 5590 -50136 -125119 -308921 -357852 -235701 -127286 -55322 -31177
10601 -31177 11807 11017 -303 6476 106427 178003 88968 23617 -2094 66865 132706 101624
10589 101624 68704 144949 74675 72480 -91347 -209587 -301149 -340811 -66696 -32060 -45327
10578 -45327 42311 -11879 -6355 40941 152891 191974 132714 121956 -29636 -130760 -142379
10567 -142379 -102672 -152422 -129007 -93975 16527 201545 213445 265927 269321 182031 192734
10556 192734 62325 83001 134890 236333 196029 99732 55840 -36650 -37048 51114 22488
10545 22488 -22714 -28485 -52871 -29635 -45845 -68055 -44042 91784 104066 72908 114605 43751
10533 43751 27615 98179 81454 66031 147070 87870 -10476 64437 113645 171526 117418 128653
10521 128653 -30478 -79309 -66165 -92558 -61602 -102482 -72085 19803 126209 50930 -165957
10510 -165957 -276028 -168906 -47042 40835 79930 46452 20140 37202 -8679 -156102 -133285
10499 -133285 -112606 -123516 -36647 38906 -8721 -88928 -154756 -74646 27325 44956 9980
10488 9980 -33962 852 -10979 4842 64753 53617 -33338 -70633 -61758 -123618 -46731 116167
10476 116167 2515 -90441 -32134 58930 63525 55153 65439 -70289 -76174 -99061 2326
10465 2326 122593 165828 -7463 -67636 -30654 -32614 -21341 -63141 -157961 -84907 29208
10454 29208 20625 180619 277289 222365 116910 65506 41773 -51610 28696 103576 12277
10443 12277 -73929 -50342 65997 75718 60393 94724 -53167 -83954 -97409 -44361 42817
10432 42817 87217 51523 51548 50671 -159829 -259958 -251104 -214278 -212517 -204274 -139920 -18148 65529
10419 65529 32655 -4180 -40073 -32483 56217 102710 209585 263247 220885 215481 177409 118546
10407 118546 113557 52435 59037 -16435 17211 98605 22292 -25272 -36817 29557 77536 78180
10395 78180 169179 206307 198849 228723 115365 39344 100006 113568 239074 163392 78987
10384 78987 147598 116519 202393 78374 8101 121301 83181 91105 -31646 -80851 40889
10373 40889 -97 -14763 -1053 21367 13204 -65938 -50875 10829 77190 77829 64092 30020
10361 30020 -56363 -193443 -228252 -141332 -123978 -98803 -28852 -87369 -157613 -116349 -73201
10350 -73201 -13806 -30580 -50042 13901 60961 169618 159693 28873 -82693 -75457 83347
10339 83347 265708 354927 411127 383860 421505 352118 165493 55363 -13471 -28786 -41122
10328 -41122 -78152 -141469 -132998 -97025 -71404 -1144 -56141 -99613 -29959 36927 47856 -2400
10316 -2400 -86669 -125727 -43458 -2057 58299 54020 -7737 -22399 -82794 -96678 -64517 51607
10304 51607 57042 24082 112496 117632 -26527 60670 120665 187246 156523 5624 -73929 -161412
10292 -161412 -173113 -58030 -23670 -80791 -32033 -24881 -1206 32921 18511 43780 -63096
10281 -63096 -67775 -44935 -56943 -40629 -57155 -130735 -256002 -241489 -78441 -179668 -201415
10270 -201415 -47309 114422 48334 11892 63847 -32149 39632 99748 101909 47429 21602
10259 21602 130383 185372 269158 254165 152072 127408 70759 -55307 -143006 -29254 38717
10248 38717 63556 270864 259425 113709 -75211 -47775 54167 163402 216492 141599 106416
10237 106416 31945 -10110 -14011 76607 116195 143441 77512 28317 59206 113318 184405 90726
10225 90726 76388 147393 159813 63988 47644 65525 40272 34480 3989 -30641 -69670 -47381
10213 -47381 -60983 23837 15531 -100897 -140997 -33181 -62507 -88561 35355 51131 85318
10202 85318 58613 84156 2406 -21775 -101409 -66487 44021 -28061 2245 -29483 -139977
10191 -139977 -222434 -163191 -147715 -93403 -85841 -110853 -103712 -192055 -167483 -81154 17499 111543
10179 111543 96509 46237 -135555 -196301 -110808 -50384 -78141 -75822 -109544 -87615 -15720
10168 -15720 65961 37541 83639 227788 165279 153195 133284 127222 116963 100368 64640 39220
10156 39220 45500 39082 99966 142225 247223 98689 30459 75877 86021 -20680 -44432
10145 -44432 17305 -106264 -145432 -13184 105774 30915 30296 -56028 -99973 -77023 -179591
10134 -179591 -309320 -185772 -56846 -687 23765 -81829 -67979 3099 -31979 -122523 -136263
10123 -136263 -173475 -165903 -71391 -30532 -127076 -198332 -113447 -38076 51916 13370 -20127 -69424
10111 -69424 14513 41491 68748 165373 233275 234050 104676 36687 -39674 -4616 -39497 -129522
10099 -129522 -139874 -120239 -181223 -271101 -270495 -311680 -190654 -111755 -57977 -39796 -32217 -126258
10087 -126258 -183885 -265719 -260420 -243957 -117322 10845 80497 58018 113419 22176 -152694
10076 -152694 -198375 -211479 -108442 -65074 -98880 -90260 -69418 -126588 -105272 15892 58144
10065 58144 64991 103533 41722 43831 -77998 -163185 -153316 -10434 92350 116670 116716 152596
10053 152596 68740 23254 61289 44524 69678 141869 190676 53173 -37736 -85000 -175860
10042 -175860 -230063 -129655 -54493 -121120 -176360 -149835 -181188 -176293 -139956 -97633 -7977
10031 -7977 126033 112889 169296 196285 189547 99039 -44905 25976 86238 49190 -104 -80422
10019 -80422 -34832 -55673 -140475 -71837 -136760 -96499 -29906 -23803 -91232 -69109 2356 -20149
10007 -20149 -124820 -80910 -69521 -84155 -104874 -160889 -150927 10770 43455 -49008 -55230 -97286
9995 -97286 -162240 -107414 -94356 -91846 -91983 33700 118056 78573 -35625 32733 153161 62806
9983 62806 27152 124926 128585 132664 76927 -24730 -48145 30907 59105 64572 97448 88297
9971 88297 -47222 45296 101492 147893 92218 68561 133384 204554 191700 97864 37045 34981
9959 34981 13877 -21779 -8860 13647 120572 104275 10966 -126915 -119344 -111459 -148808 -124522
9947 -124522 -126012 -111687 25712 19672 33348 121269 94314 7063 6983 -10761 -4341 -48175 -83236
9934 -83236 -36722 10230 -55272 -122047 -134744 -105374 -67768 -20833 -79940 -65925 28380 92178
9922 92178 69772 2233 -35512 -35301 -108500 -119068 -60297 -84709 -122026 -132334 -116848 -105192
9910 -105192 -90023 -12329 31880 -32496 -21668 -74555 -57960 -62031 -98513 -125461 -195318 -257668
9898 -257668 -173575 -32051 95779 122870 58185 135553 100677 -9128 -165639 -220608 -109630
9887 -109630 -55384 -37264 -27596 -79054 -128518 -215605 -277067 -257503 -264512 -138110 -46309 10139
9875 10139 95077 -53380 -140771 -219164 -257111 -356475 -330036 -295282 -178512 -46044 21564
9864 21564 31354 47963 51181 43747 105560 219570 239325 180010 117569 -16907 -91517 -67177
9852 -67177 -7517 -16445 -4981 11099 27440 78397 73240 12872 -10672 83140 72460 28440
9840 28440 -33826 -34843 -41767 -165121 -112821 16994 28548 53293 60291 52821 33326 23668
9828 23668 56365 87521 127435 -26655 -107663 -78661 38433 28795 -230881 -216478 -76610
9817 -76610 -17166 38990 37971 128242 107224 61853 -36766 -104212 -165076 -122209 -66068 -48224
9805 -48224 -14342 28311 79510 187614 140583 -28772 -167350 -105973 -111389 -115543 -132847 -103437
9793 -103437 -173425 -91428 -3267 -36305 -61311 -66376 -102882 -92970 61657 106834 37518 -76741
9781 -76741 -97193 -121648 -100692 -822 667 -119204 -102260 -79720 -193283 -253720 -246430 -165711
9769 -165711 -16977 -17037 -60897 -39711 -42551 83726 80251 -58317 -137386 -150324 -139852 -109131
9757 -109131 -172674 -116643 8188 78206 34410 -29072 -11043 -55375 -94031 -6689 3234 -25788
9745 -25788 -20440 -5305 -66961 -167361 -154377 -4322 55821 71342 -66515 -111049 -60107
9734 -60107 -88494 -110491 -87415 -33261 102972 194812 15910 -121957 -143362 -87863 43708
9723 43708 89356 28271 -29749 77787 32455 -16494 27876 114101 181644 152970 187622 82254
9711 82254 -48011 11167 142895 193744 190836 105010 69140 88058 76047 103653 157733 111244
9699 111244 30182 -17783 -29157 -55499 -97885 -70312 -64475 -65438 27974 18679 -83494 -204467
9687 -204467 -228650 -201590 -96364 -45187 -50803 -38543 27554 87740 11744 -131409 -160388
9676 -160388 -224538 -167024 -129413 -97813 13152 89183 100530 79748 78196 137394 86246 -226132
9664 -226132 -298818 -212070 -164824 -164959 -91735 -85307 14983 79692 158435 151047 38710 75346
9652 75346 128763 230512 137075 -28421 -174641 -265592 -180384 5128 -100786 -214141 -69589
9641 -69589 74860 170869 221472 200224 163901 229680 273602 172472 143887 122786 113020 176962
9629 176962 170287 89024 -25746 -3787 -79113 19463 65041 3001 -82423 -17030 62875 167489
9617 167489 218954 181103 159300 139399 108426 28408 -49274 -126673 36982 219557 209850
9606 209850 179306 111915 135112 70474 -32400 -95968 -55174 5656 -10350 44824 56928
9595 56928 71664 -14545 -73295 -10316 73239 186976 233119 261897 95136 16644 112186
9584 112186 148393 113846 43121 -33612 39162 -41143 12415 67194 -16290 -90153 -3780 28486
9572 28486 34895 -44049 -160729 -189073 -168445 184 27567 -49476 -37338 106969 149125
9561 149125 121907 105070 76711 99165 173881 119687 -14247 -20500 -65300 -121430 -102910 -138774
9549 -138774 -82929 -109661 -195116 -183930 -294314 -257521 -210787 -114417 44901 -19113 6431
9538 6431 -47596 -16765 -34964 33274 177484 256879 373076 282180 245494 135762 30185
9527 30185 5478 24698 67262 34053 46876 59606 16489 13875 10547 71536 76029 -130715
9515 -130715 -258956 -264281 -180375 -170531 -83445 71281 84933 -24420 -12820 -21590 -6357 -114323
9503 -114323 -101194 -136060 -56526 -26336 -482 -74289 -35846 -91941 -125817 -44532 78773
9492 78773 166525 159213 167491 131546 101929 -59686 -131706 -101418 -110972 -50379 -63732 -34634
9480 -34634 17166 6708 -51637 -46158 -92601 -133362 -121587 -184902 -130860 -122841 -142168 40866
9468 40866 21261 -6485 7643 -19805 11649 7454 17006 17257 89319 -3890 -214549 -169869
9456 -169869 -11960 -11669 -18379 64767 131031 208933 196767 65425 109188 141017 191733 140371
9444 140371 75803 -50916 31293 114315 228537 280619 223706 291436 205090 116254 20940
9433 20940 -133050 -180855 -102413 17161 102052 193888 131696 -17180 -32701 -118971 -140509
9422 -140509 -156268 -214418 -57577 107472 72098 23686 41255 46355 -40822 -101833 -192845
9411 -192845 -204065 -163185 -51330 -85413 -108487 7754 17935 127511 207074 111943 -8843
9400 -8843 -166534 -265938 -173707 -120210 -106684 -35364 -19049 92727 5162 -127964 -171496
9389 -171496 -190048 -253456 -217301 -166666 -161702 -61489 -54972 -7691 12347 67001 34517 -88810
9377 -88810 -82811 15212 -59691 -133857 -16032 32378 -25296 50770 -28808 -40431 29142 49635
9365 49635 -6190 -68631 -66728 -53398 65765 103620 28144 -110147 -231547 -172804 -36667
9354 -36667 -49515 -50200 -67796 -112182 -36719 -44316 -50599 -24978 -41518 -100138 -180939 -168581 -25421
$$ [...]
##END NTUPLES=NMR SPECTRUM
##END=
