##TITLE=Analysis number 317747
Compound Code cc 34439
Book Reference 451/121/4
Project Code adrs
Chemist Name evam
##JCAMPDX= 6.0         $$ Bruker NMR JCAMP-DX V2.0
##DATA TYPE= NMR SPECTRUM
##DATA CLASS= NTUPLES
##ORIGIN= Bruker BioSpin GmbH
##OWNER= nmr
$$ XWIN-NMR		Version 3.5
$$ Thu Mar  2 14:11:49 2006 GMT Standard Time (UT+0h)  MAYBRIDGE\nmr@NMR_250MHZ
##.OBSERVE FREQUENCY= 250.131544655141
##.OBSERVE NUCLEUS= ^1H
##.ACQUISITION MODE= SIMULTANEOUS (DQD)
##.ACQUISITION SCHEME= undefined
##.AVERAGES= 16
##.DIGITISER RES= 18
##SPECTROMETER/DATA SYSTEM= dpx250
##.PULSE SEQUENCE= zg30
##.SOLVENT NAME= CDCl3
##.SHIFT REFERENCE= (INTERNAL, CDCl3, 0, 16.4477)
##AUDIT TRAIL= $$ (NUMBER, WHEN, WHO, WHERE, WHAT)
$$ ##TITLE= Audit trail, XWIN-NMR		Version 3.5
$$ ##JCAMPDX= 5.01
$$ ##ORIGIN= Bruker BioSpin GmbH
$$ ##OWNER= nmr
$$ C:\u/data/dgb/nmr/ADRS/17270/pdata/1/auditp.txt
$$ ##AUDIT TRAIL=  $$ (NUMBER, WHEN, WHO, WHERE, WHAT)
(   1,<2006-03-02 14:11:17.50 +000>,<MAYBRIDGE\nmr>,<NMR_250MHZ>,
      <created by zg, POWCHK disabled, PULCHK disabled
       configuration hash MD5:
       84 BC 41 DB A1 6E 1D 46 DA 25 12 A5 C1 ED C5 3A
       data hash MD5: 64K
       A9 3C 9D 43 07 56 C9 CF FC 21 1A D6 F5 1E EB D0>)
(   2,<2006-03-02 14:11:34.92 +000>,<MAYBRIDGE\nmr>,<NMR_250MHZ>,
      <Start of raw data processing
       ef LB = 0.3 FT_mod = 6 PKNL = 1 SI = 32K 
       data hash MD5: 32K
       82 3A 4C 02 90 59 DF B9 CA ED B6 B6 F5 E1 20 FF>)
(   3,<2006-03-02 14:11:36.79 +000>,<MAYBRIDGE\nmr>,<NMR_250MHZ>,
      <apk 
       data hash MD5: 32K
       0D A2 59 F1 D9 75 33 72 FD 4D 05 74 CC F6 6D AD>)
(   4,<2006-03-02 14:11:37.50 +000>,<MAYBRIDGE\nmr>,<NMR_250MHZ>,
      <abs ABSG = 5 
       data hash MD5: 32K
       C2 D3 C1 57 B3 BB 63 5E 54 43 C5 16 91 B3 42 0F>)
$$ ##END=
$$ 
$$ hash MD5
$$ 27 01 50 1A 63 0B D4 0B CE 49 97 3C 92 D8 1E 37
##$RELAX= 
##$RELAX= 
##$RELAX= 
##$RELAX= 
##$RELAX= 
##$RELAX= 
##$RELAX= 
$$ Bruker specific parameters
$$ --------------------------
##$DU= <C:\u>
##$EXPNO= 17270
##$NAME= <ADRS>
##$PROCNO= 1
##$TYPE= <nmr>
##$USER= <dgb>
##$AMP= (0..31)
100 100 100 100 100 100 100 100 100 100 100 100 100 100 100 100 100 100 
100 100 100 100 100 100 100 100 100 100 100 100 100 100 
##$AQSEQ= 0
##$AQ_mod= 3
##$AUNM= <au_zg>
##$AUTOPOS= <25 >
##$BF1= 250.13
##$BF2= 250.13
##$BF3= 250.13
##$BF4= 250.13
##$BF5= 500.13
##$BF6= 500.13
##$BF7= 500.13
##$BF8= 500.13
##$BYTORDA= 1
##$CFDGTYP= 0
##$CFRGTYP= 5
##$CHEMSTR= <none>
##$CNST= (0..31)
1 1 145 1 1 1 1 1 1 1 1 1 1 1 1 1 1 1 1 1 1 1 1 1 1 1 1 1 1 1 1 1 
##$CPDPRG= <>
##$CPDPRG1= <>
##$CPDPRG2= <>
##$CPDPRG3= <>
##$CPDPRG4= <mlev>
##$CPDPRG5= <mlev>
##$CPDPRG6= <mlev>
##$CPDPRG7= <mlev>
##$CPDPRG8= <mlev>
##$CPDPRGB= <>
##$CPDPRGT= <>
##$D= (0..31)
0 1 0 0 0 0 0 0 0 0.06 0 0 0 0 0 0 0.0002 0 0 0 0 0 0 0 0 0 0 0 0 0 0 
0 
##$DATE= 1141308675
##$DBL= (0..7)
120 120 120 120 120 120 120 120 
##$DBP= (0..7)
150 150 150 150 150 150 150 150 
##$DBP07= 0
##$DBPNAM0= <>
##$DBPNAM1= <>
$$ [...]
##$SUBNAM7= <"">
##$SUBNAM8= <"">
##$SUBNAM9= <"">
##$SW= 20.6930455092707
##$SWIBOX= (0..15)
0 0 3 0 0 0 0 0 0 0 0 0 0 0 0 0 
##$SW_h= 5175.983436853
##$TD= 65536
##$TD0= 1
##$TE= 293.16
##$TE2= 300
##$TE3= 300
##$TEG= 300
##$TL= (0..7)
0 120 120 120 120 120 120 120 
##$TP= (0..7)
150 150 150 150 150 150 150 150 
##$TP07= 0
##$TPNAME0= <>
##$TPNAME1= <>
##$TPNAME2= <>
##$TPNAME3= <>
##$TPNAME4= <>
##$TPNAME5= <>
##$TPNAME6= <>
##$TPNAME7= <>
##$TPOAL= (0..7)
0.5 0.5 0.5 0.5 0.5 0.5 0.5 0.5 
##$TPOFFS= (0..7)
0 0 0 0 0 0 0 0 
##$TUNHIN= 0
##$TUNHOUT= 0
##$TUNXOUT= 0
##$USERA1= <user>
##$USERA2= <user>
##$USERA3= <user>
##$USERA4= <user>
##$USERA5= <user>
##$V9= 5
##$VALIST= <valist>
##$VCLIST= <CCCCCCCCCCCCCCC>
##$VD= 0
##$VDLIST= <DDDDDDDDDDDDDDD>
##$VPLIST= <PPPPPPPPPPPPPPP>
##$VTLIST= <TTTTTTTTTTTTTTT>
##$WBST= 1024
##$WBSW= 4
##$XGAIN= (0..3)
0 0 0 0 
##$XL= 0
##$YL= 0
##$YMAX_a= 414955
##$YMIN_a= -416169
##$ZGOPTNS= <>
##$ZL1= 120
##$ZL2= 120
##$ZL3= 120
##$ZL4= 120
##$ABSF1= 16.44769
##$ABSF2= -4.245483
##$ABSG= 5
##$ABSL= 3
##$ALPHA= 0
##$AQORDER= 0
##$ASSFAC= 0
##$ASSFACI= 0
##$ASSFACX= 0
##$ASSWID= 0
##$AUNMP= <proc_1d>
##$AZFE= 0.1
##$AZFW= 0.1
##$BCFW= 0
##$BC_mod= 0
##$BYTORDP= 0
##$COROFFS= 0
##$CY= 12.5
##$DATMOD= 1
##$DC= 0
##$DFILT= <>
##$DTYPP= 0
##$F1P= 14.0000005364418
##$F2P= -0.99999901652339
##$FCOR= 0.5
##$FTSIZE= 32768
##$FT_mod= 6
##$GAMMA= 0
##$GB= 0
##$INTBC= 1
##$INTSCL= 1
##$ISEN= 128
##$LB= 0.3
##$LEV0= 0
##$LPBIN= 0
##$MAXI= 10000
##$MC2= 0
##$MEAN= 0
##$ME_mod= 0
##$MI= 0
##$NCOEF= 0
##$NC_proc= -2
##$NLEV= 6
##$NOISF1= 0
##$NOISF2= 0
##$NSP= 0
##$NTH_PI= 0
##$NZP= 0
##$OFFSET= 16.44769
##$PC= 1
##$PHC0= 244.8774
##$PHC1= 8.326373
##$PH_mod= 1
##$PKNL= yes
##$PPARMOD= 0
##$PSCAL= 4
##$PSIGN= 0
##$REVERSE= no
##$SF= 250.13001858546
##$SI= 32768
##$SIGF1= 0
##$SIGF2= 0
##$SINO= 400
##$SIOLD= 32768
##$SREGLST= <1H.CDCl3>
##$SSB= 0
##$STSI= 32768
##$STSR= 0
##$SW_p= 5175.98343685301
##$SYMM= 0
##$S_DEV= 0
##$TDeff= 65536
##$TDoff= 0
##$TI= <Analysis number 999999
Compound Code 99
Book Reference 9
Project Code 9>
##$TILT= no
##$TM1= 0
##$TM2= 0
##$TOPLEV= 0
##$USERP1= <user>
##$USERP2= <user>
##$USERP3= <user>
##$USERP4= <user>
##$USERP5= <user>
##$WDW= 1
##$XDIM= 32768
##$YMAX_p= 372171461
##$YMIN_p= -59428
$$ End of Bruker specific parameters
$$ ---------------------------------
##NTUPLES= NMR SPECTRUM
##VAR_NAME=  FREQUENCY,     SPECTRUM/REAL,   SPECTRUM/IMAG
##SYMBOL=    X,             R,               I
##VAR_TYPE=  INDEPENDENT,   DEPENDENT,       DEPENDENT
##VAR_FORM=  AFFN,          ASDF,            ASDF
##VAR_DIM=   32768,         32768,           32768
##UNITS=     HZ,            ARBITRARY UNITS, ARBITRARY UNITS
##FACTOR=    0.157963299565203, 1,           1
##FIRST=     4114.06076936432, 0,            0
##LAST=      -1061.92266748869, 0,           0
##MIN=       -1061.92266748869, -59428,      0
##MAX=       4114.06076936432, 372171461,    0
$$ Real data points
##PAGE= N=1
##DATA TABLE= (X++(R..R)), XYDATA
$$ [...]
15065a0568O474L322K626q694j1859o061J0949Q241L741q42Q10j4468N54r373
15051b5148O573J0855J3594q119j3738j1246k667K144Q85l853o341J4807N201
15038a7053O594J1875l74j2501p826R623n372j2236N620J0550J623j4071q940
15025c2488K0002l394n195n707R407n52j2114L403J8618J6219K771j1209p32m098
15011e069M676P957L037m313m057j758J7170Q132p464j2414P069J1448k598j6695
14997E121r395k2716k300J3232J1689r332J1036o54j4254j0003P99N748R864k048
14983a3213m815m748n616P928J5050P923m613j0049j0276o238n9L762O501J2647
14969e816L380k0r181q996J5066N364O993j1977j3362l263N062M829P968L128
$$ y = [-10568, -4094, -772, 1854, -6840, -18699, -24760, -13811, -5570, -1829, -2671, -1861, -16329, -15775, -25148, -18575, -7720, 5874, -2245, -15983, -27229, -29896, -27752, -26867, -30720, -37061, -22254, -17053, -10459, 1416, 1042, -11459, -19285, -9662, -15034, -27270, -21650, -11100, -9477, -23548, -32488, -12486, -15880, -21075, -26782, -17375, -17927, -30041, -26638, -8020, 8199, 10970, -239, -971, -5069, -393, 7564, 10601, 6288, 2231, 473, 17643, 25775, 18311, 5897, 12966, 24414, 21816, 5121, -4274, -26990, -29290, -16058, -4369, -13701, -2665, -3319, -17573, -27576, -26777, -21029, -11165, -13213, -18028, -22776, -28392, -20464, -5414, 2509, -2104, -12153, -22429, -28667, -28726, -24964, -18463, -5816, -2436, -2456, -11637, -20633, -5567, -203, 6790, -5187, -18549, -21812, -16750, -11921, -3953, -825]
14955h25m830l822o031J5699m0n953k838M08o099J4572n416L104J467j3333j32
14940a4069M759J0993J3711J307k262K0163n072l9227j8648n309Q717J5211J1855
14927B129o67p683m751O388J683R39j170j5317M073R221M89l128Q968q63O391
14912F702o272J4156O617o637j1212k1224k064n545M270L095m585M555p316K0339
14898e121J0502J1364K69o843j0939k230J6866P387j0540k658N544l934l941j1632
14884e906k044N210j378j2794k059L532N826J1742j5543j604J6502N792n88o367
14870C21q940m285K2941J5025o199j7436j2728J0829J5717j0469k254m385J3144
14857A1281P507r636j8817q756k834J688k30J1229k190k773L341N55j4201j15
$$ y = [-825, -5655, -9477, -15508, 191, 151, -5802, -8640, -8232, -14331, 241, -5175, -2071, -604, -13937, -14069, -9310, 1683, 15394, 16701, 14439, 34602, 29530, -9697, -28345, -33654, -24937, -9726, 2129, 1462, -6221, -10972, -4584, -2901, -1962, -3132, -18449, -14376, -5155, -4666, -7794, 1174, 311, 6702, 430, 14586, 21203, 14566, 3354, -17870, -19934, -25479, -21209, -18114, -22699, -18144, -25460, -5121, 5381, 16745, 17014, 10171, -768, -2998, 13868, 21255, 10715, 8057, 13601, 9667, 5726, -5906, -7950, -2740, -4118, -16912, -18971, -15439, -9613, 2129, -13414, -15018, 1484, 7276, 6688, 321, -8619, -12904, 10037, 25062, 18863, 1427, -11301, -472, 15245, 4776, 2522, -1863, 11281, 18788, 9152, -9665, -18421, -21255, -19567, -19797, -8568, -10758, -13531, -10190, -9635, -23836, -23951]
14843b3951J3661N435J796K122o577P342N605J072m687n774j0763p604K8479J6248
14829B2404j8274m340j0739j0311L236J0975l407Q152K1087q881p129L462L64
14816F599l979M160j2487j3113J758J1451k420j2518r752L893J0026J4453k832
14803d761L595J0469O44k2165q586O304o836J194O116J1068N428j165j5611O460
14789g846J7314J2166N56r055j075R62K481P790k191O087j2273n581M604n205
14775H734m946P118n91k0749J8888J8989O200m587k1020l3637j2745O121J3746
14762a8479Q008l715j0487k075q316J1925J8216J941q141j320N272K536J1307
14749F672P909j5779j1270J3956l228j3166j4701Q63P804J2209J2948L640K846
$$ y = [-23951, -10290, -4855, -3059, -937, -7514, -172, 5433, 6505, 1818, -3956, -14719, -22323, 6156, 22404, 4130, -210, -10949, -21260, -18024, -7049, -10456, -2304, 18783, 9902, 2773, 6235, 6599, 2620, 6780, -5707, -18820, -17062, -5611, -8031, -20549, -30301, -26408, -16382, -1929, -4761, -1166, 9303, 9947, -12218, -20804, -14500, -21336, -20142, -14026, -2958, 2470, 1305, -14306, -7846, 9468, 21634, 22190, 13135, 12060, 13022, 15503, 23293, 21102, 27189, 14916, 9335, 13939, 8734, 3788, 10906, 10315, -10434, 8454, 27443, 33643, 29056, 8036, -25601, -38346, -32225, -18479, -10471, -14186, -24673, -26748, -35064, -23139, -4923, -2982, -11123, -12443, -7171, -4635, 6672, 14581, -1198, -12468, 1488, -1740, -14906, -29607, -28744, -20940, -8731, 4217, 7857, 10703]
14736A0703L298n270K356J004j3625J597M043M606r362k729p257q825M094l112
14722a8479J630Q494J900J463J267L562o36K628K68j358l545Q04o450k0032J187
14707b7297J4174J262j557J347j1195L247J113K076N833j617p739l726o161J6811
14693a3429K4818j478k587L047l940j9256k0188J7828J9185n317o576J855j0563
14680a6601o258r489J1534J4383r04O232L436P963K350j2360m574J108k715O186
14666B91o12o445l07K99J9741o983n461n644m946P921J273m226k469o555k931
14651a7054O853J6176Q217m819q587j212J0434P748m325m443j2283j2082K569
14638a2808K644q726P841L502K002N990q915j1505j79l73K0501J4022j4866r433
$$ y = [10703, 14001, 8731, 11087, 12091, -1534, 63, 4106, 8712, -650, -3379, -10636, -19461, -15367, -18479, -16849, -8355, -6455, -4992, -3725, -163, -799, 1829, 2097, 739, -2806, -2002, -8452, -28484, -27297, -13123, -11861, -13418, -12071, -23266, -20019, -18906, -16830, -10997, -12614, -20353, -24079, -30240, -13429, 11389, 9911, 7324, 10371, 6431, -12825, -33013, -15185, 4000, -1317, -7893, -6038, -16601, -22859, -32348, -20814, -6431, -7335, -1103, 2333, 10296, 12646, 286, -4288, -3180, -5895, 291, -321, -6766, -7073, -6774, 12967, 5984, 523, -5121, -10067, -2146, -873, -5099, -7568, -14123, -17054, -10201, 5975, 14192, 9373, 786, -426, 10008, 17756, 13431, 8988, -3295, -15377, -12808, -10164, -18890, -11049, -7547, -5545, 445, -8470, -19975, -20154, -20527, -26, 13996, -870, -10303]
14624a0303R369J121r456k0868j0131J1928K714J1330j511j3810P361J0904j0411
14611b1763j817L452j839J713P555J919J2588k610l63j992l52Q981R648n832j272
14596H016Q425l797j1707k1012q46Q520j3161J7309K2585l897J7590J4383m969
14583C7439k5619j3750J2143M226j2638m381o047K177K447L638P657j1526p771
14570a2005J5789J7817q004j6896n169M330J1825l853n971j2960J73P468K300
14557e156o938J6793N912L410N048j5839m407N204o026j1955m127j547K769k578
14543a9437o532K2837O502N358r30l282P513J347k1121m628p128Q243J0589P883
14529G214N919P967K155k705p315q247o471k420o286L123q330M607O011k770j631
$$ y = [-10303, -934, 187, -9269, -30137, -40268, -28340, -25626, -14296, -15807, -29617, -22256, -11352, -21763, -23580, -20128, -21967, -20254, -12699, -10780, 1808, -802, -1165, -3157, -3509, 5472, 15120, 9288, 8016, 16441, 12644, 937, -20075, -20921, -12401, -25562, -8253, 14332, 10435, 28025, 42408, 37439, 11820, -1930, 10213, 14439, 1801, -2580, -8627, -6450, -4003, -365, 7292, -4234, -12005, 3784, 21601, 13597, -3299, -8468, -4138, 7687, 3834, -2137, -15097, -14924, -7456, -5156, -12094, 4699, 10611, 14021, 19069, 3230, -1177, 4027, -1999, -13954, -18081, -19628, -16859, -19437, -25969, -3132, 3370, 8728, 7798, 4516, 12029, 13376, -7745, -12373, -19501, -11258, -669, 7214, 13133, 21100, 23255, 20550, 13235, 4988, -1483, -3903, -10189, -7066, -15396, -10789, -4778, -7548, -9179]
14514i179m619k431J2699J0105l311j1281r2R141M630m250j4259l358J6759P850
14500H404J580J4001P135k528J0910n640p547K788j991K1935J1015Q105J2860
14487H1027L8825M0968L0124L4396L8374K6153J7999j2787k8387n3670l8421m8914
14475A25687l7654j3788J2547o644K002j6286j5129n050j1861o925o830R600k017
14462B7652j7963j7259P230P690K931J0248m90q68m388j1655j0434N757K8j5407
14448a6928j8578K0000K2265R859J698j1878m650O212J85k072o314j452r31j0363
14434a2947j1541M582J0487O140k806J0523o415j9803j320J7285K8633P619J554
14421C1991j5861p837j689l438r059p739O530k9J0101j366j1822k973L259L973
$$ y = [-9179, -13798, -16229, -3530, 6575, 3264, -8017, -8109, 1032, 5662, 1412, -12847, -16205, 554, 8404, 9984, 23985, 31120, 28592, 39502, 33862, 26315, 29103, 27112, 49047, 60062, 68167, 81027, 119852, 160820, 190944, 225340, 263714, 289867, 307866, 295079, 266692, 213022, 174601, 125687, 88033, 74245, 86792, 80148, 82150, 65864, 50735, 45685, 33824, 26899, 20069, 29669, 27652, 9689, -7570, -340, 7350, 10281, 20529, 20039, 19171, 14783, 3128, -7306, -1549, -1521, -16928, -35506, -15506, 6759, 16618, 18316, 6438, 1788, 8000, 8185, 6113, -201, -1653, -2584, -12947, -24488, -19906, -9419, -3279, -6085, 4438, -1977, -21780, -23100, -5815, 22818, 30437, 31991, 16130, 8293, 6604, 3166, -5893, -13632, -7102, -7131, 2970, 1604, -10218, -13191, -9932, -5959]
14407e959m00l214J0006p626j3844J3041J7713j2852O24k662N111r879L976J0534
14393D569m879l994j2230j0123o516m615o217R965J5319M271L017j148R258J3991
14379A0668L559j3287J579k091l797N158r197J174J4060Q371j854j4674q181k205
14365a0717p012R310J7185K390j4748p705q62R009J1974J4897J135n052o384k422
14351A0998m577J1688l244p597m057m22j6465P769J4934M64q787J037j2240j1962
14337b2461q340J2507J4680j4411q637r0m705P68J0923K644J655J882q01k116
14323a6502j022P24R632K81m041P953J2862l271m292O792l628j8277j4658k983
14309c0430R672Q357r891N249L213j0531M3p095L720R408M022j0517J0886J1755
$$ y = [-5959, -6359, -9573, 433, -7193, -21037, -7996, 9717, -3135, -2511, -5173, -62, -9941, -5965, 4569, -310, -4304, -16534, -26657, -33173, -37788, -44005, -34040, -18721, -14450, -11433, -12581, -3323, 10668, 14227, 940, 2519, 428, -3369, 1789, -7408, -6234, 7826, 16197, 14343, -331, -8512, -10717, -17729, -8419, 8766, 11156, -3592, -11297, -12159, -3150, 8824, 23721, 24856, 19804, 13420, 10998, 6421, 18109, 14865, 7268, 3211, 2789, -13676, -5907, 9027, 9491, 704, 1741, -10499, -22461, -30801, -18294, -3614, -18025, -26662, -26752, -31457, -30689, -19766, -17122, -15467, -13585, -14386, -16502, -17524, -16800, -7168, -6887, -10928, -2975, 9887, 6616, 2324, 9116, 5488, -12789, -27447, -30430, -20758, -12401, -22292, -17043, -13830, -24361, -24318, -31413, -27693, -18285, -14263, -24780, -13894, -2139]
14295b139q302J1494J684r336k352k382M187j168M639n001K53n622o822m915R438
14280a6344J5321j274P188P555q22J333p985m096n360p481M162M771P697L949
14266H614O699N090j4541l282R002J2768J0355R84r798j727n370j2245j6604k1786
14252c1841O394J6790k364P744N063n449M339N722M575q638k477j6117J0914M905
14238d40o461p743O974J1810J7124Q28j5384m453n38K553r58m374l930j5167r6
14223b0255O454p239o821k803p379O388J9005N143P724J1510j0057j4067J2718
14210C21J69K4498J727r230j2269j1877j2054N943J1224N565O010o673j9542J802
14196a4386J9209N628q442j3093J1081J1294j3856k210p747p451K794M563O042
$$ y = [-2139, -10441, 1053, 2737, -6599, -8951, -11333, -7146, -8314, -3675, -8676, -8423, -14045, -20867, -25782, -16344, -1023, -2297, 4891, 12446, 11624, 12957, 4972, 876, -4484, -11965, -7803, -3032, 4665, 8614, 15313, 20403, 5862, 2580, 11582, 24350, 34705, 35689, 25891, 24164, 18794, 6549, -10055, -31841, -25447, -8657, -11021, -3277, 1786, -3663, 676, 6398, 10973, 2335, -142, -16259, -5345, -440, -6901, -14644, -7670, 4140, 21264, 22092, 6708, 2255, 1717, 4270, 3312, -1062, -4992, -20159, -20255, -13801, -21040, -27861, -30664, -38043, -31655, -12650, -7507, 217, 11727, 1670, -12397, 321, 490, 24988, 26715, 17485, 5216, -6661, -18715, -12772, -1548, 4017, 10027, 3354, -16188, -14386, 4823, 10451, 2009, -11084, -3, 11291, -2565, -4775, -12522, -19973, -17179, -12616, -6574]
14183f574k458R373P059q127J270P856q589n538O235P989l846J3303l078k994
14169A1881k532o202L09J1688j588N965M918q109P719J1993n223j5450L020j0274
14155H115q48m361L514l05m483j1022l136M287p018m403p703o801L786K206Q296
14140a9876k771Q897J0824k417O568n385r63l306k663J4748K697j0447q12r011
14126a3917l931l930J6217L92L475N962j3437k923J6547R698K26j4008L374j0304
14112f559j1549q657j1277Q404J7022Q954J247k489Q738J965j6725K2480J2774
14099B4328j4774k1277j6729K1516J8616j2146j8990j010K917j049J3824m037
14087h811j5160J1620K235m596J1246o781Q593J0660l709l789M679j288q469J2062
$$ y = [-6574, -9032, 341, 7400, -727, 543, 8399, -190, -5728, 507, 8496, 4650, 17953, 14875, 11881, 9349, 3147, 3456, 15144, 13556, 19521, 24439, 16330, 24049, 36042, 30819, 15369, 18389, 8115, 7267, 2906, 6420, 6115, 1632, -9390, -12526, -8239, -15257, -19660, -27363, -34164, -30378, -28172, -19876, -22647, -13750, -2926, -5343, 1225, -4160, -5123, -8429, -11092, 3656, 6353, -4094, -4906, -13917, -17848, -21778, -5561, -5169, -1694, 4268, -9169, -12092, 4455, 14153, 14379, 371, 3745, -6559, -18108, -26765, -38042, -29638, -12616, -3662, -2415, -4904, 3834, 5799, -10926, 11554, 24328, 9554, -11723, -28452, -6936, 11680, -466, -19456, -20466, -17549, -18598, -4774, -8811, -23971, -12351, -10116, -14712, -3466, -10247, -1654, 9006, 5297, 1508, 6187, 4899, -3570, 8492]
14073H492P495o257K790m413j4464q037K359r872j0496j0590O453J7946J3254
14060e340j059O634R056j188K14N311J663j1817j32J343l040l127n176n988l001
14045a5647q339J3378J1132J1600k647m403J3385q441k7057n305M557J2039J4764
14032I016J146p049O272J0890q83j0852O031l306j0562l310M68n234j6429J46
14018b3656O087O969N037p282o78J0082Q677j9700j5365J0393J5252Q666j3667
14005i185O40j630k997Q626j5949j2889J2338K3329r619l505M545q075J0812R660
13991F101j0125k5992m973j46J203N438l843K217J4699P065R189M91j775k693
13977c144j1647q826N622N688O623q310n783K500P800P169j735r642k147J5860
$$ y = [8492, 15987, 9730, 12520, 8107, -6357, -14394, -12035, -21907, -32403, -42993, -36540, -18594, -5340, -6399, 235, 9291, 8103, 8317, 13628, 15291, 3474, 3342, 4685, 1645, -1482, -6658, -12646, -15647, -23986, -10608, 524, 12124, 9477, 5074, 18459, 10018, -17039, -22344, -17787, -5748, 9016, 10162, 3113, 9385, 20275, 19392, 8540, 14571, 11265, 703, -2607, -2139, -7373, -23802, -23656, -17569, -10600, -5563, -12845, -13523, -3441, 5236, -14464, -29829, -19436, -4184, 4482, -9185, -8545, -10175, -13172, -4546, -20495, -33384, -21046, 2283, -7336, -10841, -6296, -14371, -3559, 6101, -4024, -30016, -34989, -35135, -33932, -28494, -32337, -30120, -15421, -8356, 833, 1324, -451, -3144, -14791, -23617, -17995, -12307, -5684, -13994, -19777, -17277, -9477, -2308, -4043, -13685, -15832, 28]
13963B8q1O552O483k889p917O484j0276l717M418j0732l433N35P377O364L562
13948B758K874r508j765R353j0796l542J0684m216j56o502J2835N018p243q027
13934h233M77k919J975J4442Q564L68k2544q026R774k312J4244J0788k896j0796
13920B906m819P234K005J2882k0831K005p79Q008k418K056l033j1728O133N571
13906E192j6372K410N406L813O766k657j3555l2140n032K2626J8086O559K936
13893D038p607j3230P455J5622o713J1229j035j2285o461P606K746N166o33j8217
13879a2319j0939N161j39N183j06N033Q167O682O88r973q365L174L765n225L547
13864e666P971M112p617j6367m150l575L100J3585R122m209m4q343J0865J058
$$ y = [28, -53, 6499, 12982, 10093, 2176, 8660, -1616, -5333, -915, -11647, -15080, -14545, -7168, -804, 2758, 5632, -3876, -5641, 3712, -7084, -10626, 58, -4158, -4314, -10816, 2019, 7037, -206, -8233, -7756, -10675, -8700, 5742, 14306, 14674, -7870, -15896, -6122, -8434, 5810, 16598, 13702, 2906, -1913, 5321, 7326, 20208, -623, 1382, 603, 8611, 6193, 8249, 5216, -6512, -379, 5192, -11180, -8770, -3364, 449, 7215, 4558, -8997, -41137, -46169, -23543, -5457, 1102, 4038, -3569, -16799, -9344, 6278, -435, 10794, 9759, -2526, -8987, -1381, 1365, 6531, 5898, -12319, -23258, -18097, -18236, -13053, -13159, -8126, 41, 6723, 7411, -2562, -10927, -7753, -3988, -9213, -5666, 2305, 6417, -1200, -17567, -21717, -25292, -22192, -8607, 515, -3694, -3738, -12081, -1216, -158]
13850a58K889j6127j8613M340J4067R198M67J763j0405l142m41N474P528K707
13836d53j5518M78J3802j375j1940l520p111L844n78j260K816J1722J770o9r700
13821a7092R854M205j365J6240j024j3698J667M780J1824q037j909l655m946o965
13807a0121m116k288K240P323K517m445K1319K0257P663r423k1336j8628m466
13794a3504J1879P710k400J76o382j1757n024j0731M007l676m221J8565l810O27
13780a8541R373l971l645K422J154j2140M804Q576J3767p803j0795l666O349r867
13766b3983N341J349P531k05O304m041K923N685N818J2739J2657j6906j0307q537
13752c632j7225o917k400O416Q654N07j1363M544k955J2904L2241M93j6286p850
$$ y = [-158, 2731, -13396, -32009, -27669, -13602, -4404, -3937, -2174, -12579, -15721, -16162, -10688, -3160, -453, -15971, -15493, -1691, -3066, -15006, -18526, -25637, -21793, -22371, -23631, -20815, -9093, -7323, -7392, -17092, -7238, -3033, -4398, 11842, 10818, -2880, -1213, 3567, 15391, 7354, 5445, 1790, -3156, -10121, -14237, -16525, -14285, -6962, -4445, -8890, 12429, 32686, 40349, 30926, 9590, -9038, -13504, -1625, 6085, 3685, 3861, -2521, -14278, -19302, -30033, -26026, -29702, -33923, -15358, -19168, -18541, -9168, -13139, -16784, -14362, -13208, -25348, -20544, -11968, 1799, -6004, -16799, -20465, -14116, -23983, -18642, -17293, -9762, -9967, -3663, -7704, -4781, 904, 6722, 19461, 32118, 15212, 4905, -3632, -20857, -27774, -30174, -23758, -15104, -14597, -25960, -21416, -24371, -11467, 20774, 21267, 4981, -2869]
13738b869o932j6763j0874K892O081J1828L446o187J2240O639n752J7792K4662
13725C6203o419k7940j1591j2346M210M102K3247Rk3567j5557j802P566K690L125
13711a8070J5547O659j5398l795M223k350n226J6450m72q741R946l124L668P871
13697G188k491o940j0685q011q753K914J1440J0311j37j2377j1463N733P398J744
13683a4129K62J672K232o765j8267J1476Q859j7052K613M352L874K120O470R442
13669b841q095L308J4091N998j5246j0922N866K2699O411Q062M057l848j3185
13656A6355o049j3445k1644j0399J562K029R326N669M740q97J96J6307J1314R637
13642B4701l918j6634j5266p530R181O754r96J2908L623m552R27l837r309m700
$$ y = [-2869, -9801, -26564, -37438, -34546, -28465, -16637, -13191, -19378, -7138, -499, -6251, 11541, 36203, 29784, 1844, -9747, -22093, -17883, -13781, 9466, 9475, -14092, -29649, -31451, -23885, -21195, -18070, -2523, 4136, -11262, -15057, -10834, -13184, -18410, -1960, -2432, -11173, -1227, -4351, -683, 7188, 4697, -2243, -12928, -20939, -29692, -26778, -15338, -5027, -5164, -17541, -29004, -23271, -15873, -14129, -13867, -12195, -9963, -16728, -34995, -23519, -14660, -31712, -29099, -24747, -20873, -18753, -12283, -2841, -10936, -7628, 6463, 12461, -2785, -13707, -7841, 14858, 21269, 29331, 33388, 29540, 16355, 10306, -3139, -24783, -35182, -33620, -31591, -22265, -16596, -11856, -12753, -12557, 3750, 15064, 24701, 20783, 4149, -11117, -18647, -9466, -2712, -3708, 9200, 12823, 8271, 9198, 5361, -3948, -8648]
13628h648m177O683L436K704j2291k738K327l659L346J6574J0390r065l945m083
13614c146j4613j0950J1133j415q79K187J0667p578M252M688n398r16K093m565
13600a4440N149K741j165n689j1292m945J5198P513p978P143k389j7312j2856
13587d0322K2931K2710L570J900k971j661p416j2184J2037K1940n180j4212k107
13574i65l630Q733J2330m388o281l61n846O110J935J3038J1361L098J857q305
13560B8686k5048k733p50k443j110J6897R003j0747q569q76Q358J4200J1017j6509
13546A9376j7829o374k3386Q314O221J429J5407K513m38l553L36k981L457q002
13532e510j4260j6451O306J1376J1715K1602Q427n158j3516m518J0776Q041J1699
$$ y = [-8648, -12825, -6142, -2706, -2, -12293, -15031, -12704, -16363, -13017, 3557, 13947, 4882, 937, -3146, -17759, -28709, -17576, -18991, -19870, -17683, -7016, -14594, -10342, -5654, -11052, -11968, -9875, -14440, -9291, -6550, -7715, -13404, -24696, -29641, -14443, -6930, -14908, -7765, -10154, -27466, -40322, -17391, 5319, 8889, 10789, 7818, 6157, -1259, -13443, -1406, 20534, 15354, 1142, -965, -4595, 4138, 16468, 12080, 5799, 5438, -408, 5702, 7637, 20675, 32036, 35134, 36991, 28686, 3638, 905, 155, -2288, -3398, 13499, 22502, 11755, 3186, 2310, 10668, 24868, 35885, 19376, 1547, -4827, -28213, -19899, -13678, -12249, 3158, 5671, 5233, 1680, 2016, -965, 2492, -5510, -19770, -36221, -29915, -18539, -6824, 14778, 23205, 18047, 4531, 13, 10789, 18830, 30529]
13519C0529l928k546P514j5502m580O675j7293K490Q157O421p090j7618j3962
13506b0733Q12J9427P227J0461m691j6289q776M703p320j5216P13J1239J3671
13493d772K0594R372o475p756k15N412L647q048k5864R329J2715k867j1605j4591
13479b1124J6802J1013o797L528j1806K948M210l464K411j6421L15K590p892j7594
13465d1281r57R057J8593k261o615R643m2j5640L50kM086P328J2813k728J7007
13450I351k58j9188j2471Q324N981J206N589l458M085J0451q087l012r411J2043
13436A145O843j4477j7166J9976Q738O96P03n676o708M614k377j3091L326K721
13422a0733l036J1429N093o557k4162l768J6522M129j9801l218K910l841K432
$$ y = [30529, 26601, 24055, 31569, 16067, 11487, 18162, 869, 3359, 11516, 17937, 10847, -6771, -20733, -19921, -494, 6733, 17194, 12503, -3786, -12562, -7859, -15179, -30395, -29682, -18443, -4772, 15822, 25194, 18719, 10963, 10748, 16160, 19807, 11759, -14105, -4776, 7939, 5072, -6533, -21124, -4322, 6691, -106, 3422, -8384, -5436, -1226, -4690, -2279, -18700, -18385, -15795, -23687, -41281, -42238, -33181, -14588, -16849, -23464, -13821, -13863, -29503, -29153, -29155, -25069, -17741, -4928, -7656, 9351, 9093, -10095, -22566, -14242, -8261, -7055, -1466, -4924, -839, 9612, 1525, -1487, -10898, 1145, 7988, -6489, -23655, -3679, 5059, 5755, 6458, 782, -5926, -1312, -3689, -16780, -13454, -10733, -13769, -2340, 2753, -3804, -27966, -31734, -15212, -11083, -30884, -34102, -31192, -35033, -32601]
13409c2601J4889P151P217K8363M941n166j2702j2058O680j288j453q006m494
13396h527K388K318j3045j0491N040J3821K133j1224j518r661n798J1504J12p983
13382c0931J6325J0035r101J475J9435J7192Q239m273j8856p968R575m88j8060
13369g401m562L780k670O342r529Q283K364J1534M614r281q714m247N706j2695
13355a6476O745J1038J0874P450J3671L27l4277j1644K734Q422O93N382O580j2698
13341a179j6774N559k476N778l94k642J332J5107l701j8146L014N186P634j5446
13327a7148r961Q69J9302L350O615j531l023k340J8496R93j6950j2237n314M093
13313a4786K0834J6683p602p434J3395M335M572n446j6019k1399O870K5667N904
$$ y = [-32601, -17712, -10561, -3344, 25019, 29960, 24794, 12092, 34, 6714, 5426, 3973, -4033, -8527, -6139, -3821, -16866, -27357, -22317, -8496, -6363, -17587, -19105, -28766, -34564, -23060, -22948, -30931, -14606, -4571, -13672, -12197, 7238, 24430, 32669, 28396, 9540, 1572, 11147, 10659, -7401, -11963, -8183, -10853, -4511, -14040, -5757, -3393, 8141, 12755, 3474, -5240, -9487, -3781, -16476, -9731, 1307, 12181, 19631, 33302, 33629, -648, -12292, -9558, -1136, -443, 4939, 11519, -1179, -17953, -12394, -14870, -9092, -9486, -12128, -10796, 4311, 610, -17536, -14522, -9336, -1702, -17148, -27109, -26240, -6938, -3588, 3027, 1496, -1527, -3867, 14629, 15622, -1328, -13565, -18879, -14786, 6048, 22731, 15129, 7695, 21090, 25425, 29997, 24551, 8532, -12867, -5997, 19670, 25574]
13300B5574M186j521q058j7808k5976j478O49M715O994q946J6617J6200l725k200
13286E223j3201J79J4398N011j0743r578m115K730Q352m753m843o105L970J3698
13272B23K035o522l471J1645k272J1122j553N389K404q054J2054l810q808m169
13258F213Q746r084j9795p032j95M108m894r201N338N001J8279L676o838j196
13244f874O933K079Q79m094J9386O070j2608n185M226j3634k2J7192J1700n144
13230B0904o538j3729p857j4133l98L0346J5487r190L388K431o899l744p961M625
13216F732J066q43K395j1560P260P375n953p222n078j6131r541J8856J3179N916
13202F451m904j2277l389Q007K498J491m859P383J9637K572J5243K1701K3336
$$ y = [25574, 29760, 28239, 20181, 2373, -23603, -25081, -24432, -19717, -12723, -21669, -5052, 11148, 7423, 5223, -7978, -7799, 6599, 11610, 867, -8711, -12826, -10096, -1744, -6497, -11340, -17445, -13475, 223, 2258, -4264, -7735, 3910, 1638, 12760, 11207, 16596, 19000, 10946, 23000, 19190, 10382, 6213, 14959, 5875, -13920, -20952, -21147, -17039, -21933, -31134, -25796, -20795, -2516, 1160, -5678, -6874, 59, 2138, 3017, -1077, 18309, 24379, 11771, 6586, 10812, -2822, -2844, 14348, 26048, 20904, 14366, 637, -7220, -21353, -21751, 8595, 24082, 14892, 18280, 20711, 13812, 10068, 2107, 6732, 7798, 6955, 9350, -2210, 5050, 12425, 6472, -750, -5828, -21959, -31500, -12644, 535, 6451, 1547, -10730, -14119, -6112, -3614, -2123, -6982, 401, 20038, 22610, 37853, 59554, 82890]
13189H2890L922r944k470j7162j7593n56m689l851L77l107q455n700M64k011J414
13174A3529o492J0190J2212j272O186l051j4326j1442k24l551K1258J6457o563
13161C2911j2568j0471l354J6299J5669J1457R744k52N523j2047j387M53q074
13148D3903J483p629k0007k414J4473J9924j1600k9326p607Q877Q674J0544o588
13135B2707J2674O651j4288p366k908P171p101N46J6999M709j7378j9050M2L323
13121F731K113j2300n192Q276J4523m411M14J7444K4836Q669Q4j95j0740j3485
13107C6767j0628m532j94L083j3328r369P664K409j1781l159K559k335l511m746
13093a1101P161N485R410J2045J3085q311j7441M87J09k385r883q421n406P898
$$ y = [82890, 86812, 76868, 74398, 57236, 39643, 39087, 34398, 30547, 30924, 27817, 19362, 13662, 14126, 12115, 13529, 7037, 17227, 29439, 28167, 34353, 31302, 16976, 5534, 5310, 1759, 23017, 39474, 32911, 20343, 9872, 6518, 22817, 38486, 49943, 59687, 59435, 64958, 52911, 51524, 51977, 43903, 45386, 37757, 17750, 15336, 29809, 49733, 38133, 8807, 1200, 10077, 18751, 29295, 22707, 35381, 42032, 27744, 20378, 17470, 24641, 17540, 18086, 35085, 39794, 22416, 3366, 3408, 6731, 8844, -3456, -8648, -372, 14151, 9740, 10154, 27598, 52434, 61103, 61187, 60992, 50252, 36767, 26139, 21607, 21413, 24496, 11168, 1799, 9463, 11872, 91, -3068, -509, -2844, -6355, -11101, -3940, 1545, 10955, 23000, 36085, 27774, 10333, 10820, 10929, 8544, -1339, -9760, -15166, -7268]
13079g268k733J998L511Q372o803L857m376J541N135n048j0296L409l336O593
13065e444J6462R760l717n068M107P203p440m488P22J239k749j790j6522j2735
13051b0460J5015L957j4417m701k503J1371M473K035K4030J0174r298k37l82j1827
13037G230j3248j084J1823Q769o311J2339J1030o004k1396l261n366j2369j3644
13024c1492Q838J5737M533j5386L632P503n185L052k022N690L151J0138r536l329
13010d676j373j095m269n990J354J0059P012J4972O734k4181j8556L2003J3172
12997B5166p63q10l965N611J907r179n524j499p00m900n357J2840K7024K1146
12983F0997J1370p806L1629K3806J0367L2095J9887j547L859k1094l3119l4859
$$ y = [-7268, -10001, -8003, -4492, 3880, -2923, 934, -3442, -1901, 3234, -1814, -12110, -8701, -12037, -5444, 11018, 20778, 17061, 11993, 16100, 23303, 15863, 11375, 12097, 13336, 10587, 8797, -7725, -20460, -5445, -1488, -15905, -20606, -23109, -11738, -7265, -5230, 18800, 28974, 19676, 19439, 19057, 7230, -6018, -7102, 4721, 13490, 7179, 19518, 30548, 24544, 3148, -113, -5479, -17848, -31492, -22654, -6917, -2384, -17770, -14138, -6635, -11820, -8768, -10790, -5100, -1949, 8189, -1347, -4676, -6049, -7144, -11413, -17403, -16049, -5990, 1022, 15994, 22728, -1453, -20009, 11994, 25166, 24403, 23593, 19628, 25239, 27146, 17967, 12443, 10944, 10244, 5344, -13, 12827, 39851, 60997, 72367, 64561, 96190, 119996, 130363, 162458, 182345, 180798, 184657, 163563, 130444, 95585]
12971I5585j8243j3794j3970k984K270L658o85j1266j4649n138K268P34J8187
12958D1973K8046L2742K1370O72M110K1578L3489J9668l419J4085K7744J1533
12946B53591K848j4098q491k6502k0078R338j9141j5162q622q680j5840o908n965
12933A16290k6455j6954j8690m924k165l99m074q216P819P326J2409J9256K2963
12920A04186J0934J9885L0681K6749J0288Q930l987j2639l3075j3816k2538j6145
12908A09453j6002j3582M8m864j5002j3441k4766l946Q303o986N689l237j693
12895A9974L821J0K314j545Q345K959K672n137j3104j6251M724N497J677o286
12881I670P837j507r97J3804q913q288J2552P103M266J0986m593p397M78m409
$$ y = [95585, 77342, 63548, 49578, 46594, 48864, 52522, 51837, 40571, 25922, 20784, 23052, 23786, 41973, 70019, 102761, 124131, 124803, 128913, 150491, 183980, 203648, 200229, 214314, 242058, 253591, 256439, 242341, 233850, 207348, 187270, 196608, 177467, 162305, 153683, 145003, 129163, 122255, 116290, 89835, 72881, 54191, 49267, 47102, 46703, 42629, 34413, 42232, 49558, 61967, 81223, 104186, 115120, 135005, 165686, 192435, 202723, 211653, 207666, 195027, 161952, 148136, 125598, 109453, 93451, 79869, 79917, 75053, 60051, 46610, 21844, 17898, 26201, 19215, 24904, 21667, 19974, 23795, 23805, 26119, 24574, 32919, 35878, 38550, 33413, 20309, 4058, 8782, 14279, 15956, 9670, 17507, 16000, 15003, 28807, 19894, 11606, 24158, 31261, 35527, 46513, 41920, 34523, 35001, 30592]
12867C0592j5995j7835q927k74J5650J8971J2364J578R247J0011L616J010j558
12854E8450o607j8361j1375N525n735J497J2914p93p540J4o84p773p985k847L923
12839A2623o370r685o929L877J2163M928q769j1230J1514K285J5870J6109j055
12826C5331j574j3936k741O102J1855L024j4212j0648l842o343L490O583l420
12813I669j0155j12L589J852M165J3443o689m781J5937P69L391L37j0015k524
12799A8876N048o421q081N365q080N784L102L762R46J35n389J2901R320k0895
12785A6373m575P19r006j0170N355Q854K598O903M865J63J509p446J531r10k540
12770A4223o753j2778o049L219J724O311L573J5341O005o206n519l354j596o944
$$ y = [30592, 14597, -3238, -12165, -12439, 3211, 22182, 34546, 36124, 45371, 55382, 58998, 60008, 58450, 51843, 33482, 22107, 27632, 21897, 23394, 36308, 35515, 27975, 27989, 27305, 19532, 11547, 8700, 12623, 6253, -3432, -10361, -6484, 5679, 10607, 1838, -9392, 2122, 4407, 20277, 36386, 35331, 33757, 19821, 17080, 23182, 35037, 38061, 23849, 13201, 9359, 3016, 6506, 13089, 9669, -486, -598, 2991, 4843, 9008, 22451, 15762, 10981, 26918, 27687, 31078, 31415, 21400, 18876, 23924, 17503, 9422, 14787, 6707, 12491, 15593, 19355, 20301, 20436, 15047, 27948, 37268, 16373, 11798, 12517, 3511, -6659, -1304, 7550, 10148, 17051, 21916, 22079, 23588, 16142, 17673, 16763, 14223, 7470, -5308, -11357, -8138, -6414, -103, 3470, 18811, 24816, 18610, 13091, 9737, 8141, 1197]
12756A197N646l354J68L877R93j6227n558P580n750j397M504J3491K1490k519
12742B4141q039N095o94N489P39r246j00j352j970k831L34j2693Q174M272j8644
12727g325j254K8625R493O94R157J2595N230P66J131q286j4559n660o599N751
12713B9759O835J2578K2400J4780k306P900k984P1m513k324q337r832J5199J7548
12699I6774M928J0541l621J483J0500K5830K9386J7221M1844M1353L8493M1479
12687C56211L9017M1932M1854Q0337J25711J48959J90349K37426K67643K65789
12677A795228K04024P3089p1618j99608k57120k53961k43063j90617j38968r4560
12667F22826r0966p9475n4985m8225j6166j1253k8731l7209l5949k6643j2340
$$ y = [1197, 6843, 3489, 3657, 7534, 8527, -7700, -13258, -5678, -11428, -12825, -8321, 5170, 26660, 24141, 16102, 21197, 20503, 25992, 26731, 17485, 17385, 16033, 14063, 11232, 11566, -1127, 7047, 11319, -7325, -8579, 20046, 29539, 30233, 39390, 51985, 57215, 57981, 59112, 50826, 36267, 30607, 24008, 29759, 36594, 49172, 71572, 86352, 84046, 91946, 88962, 89033, 84520, 82196, 73859, 64027, 79226, 96774, 101702, 112243, 108622, 110105, 120605, 146435, 175821, 193042, 234886, 276239, 314732, 356211, 395228, 437160, 479014, 559351, 685062, 834021, 1024370, 1261796, 1529439, 1795228, 1999252, 2072341, 2000723, 1801115, 1543995, 1290034, 1046971, 856354, 717386, 622826, 531860, 452385, 397400, 349175, 333009, 321756, 293025, 255816, 219867, 193224, 180884]
12656A80884k152K677P585J0374M460K1674K0604M785J6002J6415k5951n3534
12644B03823l5136j9173j8250q706j8206j0766N500K6369O367K71r480k1436j1336
12631H9841R22j9329j998L2330J4965o113J4107J3961j4020m820J4334K5226m351
12618A55055j3367l0850j5379j3901M115P229K0094J0666J4938j345J7377J7968
12606A72600Q517p087M069j2410k6849R404L0448L3253L0973j589j3563n695j3345
12593B08726P21J685J1080M780K6097J4808J0648j0980j8636o864r868l525m948
12580B23724l588j4937k0516k3208o590l033k537J9218M2049L3121J5485K4449
12568B83637J6722L0293L3573P339Q725j422J1435J6074q157l5736k7949q906
$$ y = [180884, 178732, 181409, 188994, 199368, 203828, 225502, 246106, 250891, 266893, 283308, 257357, 203823, 168687, 149514, 131264, 122558, 104352, 93586, 99086, 125455, 131822, 132093, 122613, 101177, 89841, 90763, 71434, 69436, 101766, 116731, 110618, 124725, 138686, 124666, 119846, 134180, 159406, 155055, 141688, 110838, 95459, 81558, 85673, 92902, 112996, 123662, 138600, 137255, 154632, 172600, 181117, 174030, 178099, 165689, 138840, 148244, 178692, 211945, 242918, 241329, 227766, 222071, 208726, 209447, 211132, 222212, 226992, 253089, 267897, 278545, 267565, 248929, 242065, 232197, 228672, 223724, 220136, 205199, 184683, 161475, 154885, 151852, 149315, 168533, 210582, 243703, 259188, 283637, 300359, 330652, 364225, 371564, 380289, 378867, 390302, 406376, 398219, 362483, 334534, 325628]
12556C25628J121j1814r680k655k0597k5640k7883l4076j5377o122j9164j5512
12544A38229k7587j3857k2248k587J1373J2921Q905O658P813J0769J901K5052
12532A57342L6544L6296N3097K1088m260o116L929r041k7486l7608n4593l6858
12520A32334m7530j0498o204j6997N15M407L157J92j6210j1406q964K525M946
12507C0267p781J108l575r781n172m623P731J7294l521J510R488q208k6116k626
12493d005l479J1123J1817J1335L961j31j0757J1950L294j0295M850J3040l844
12480C8859n848j1157l529p617J781L695j4859J8562Q8j0544J9067J0708P752
12467D6958J1968n821j0159k8943k858N496m453p201O190J1147k309n821O484
$$ y = [325628, 326749, 314935, 305255, 302600, 282003, 256363, 228480, 194404, 179027, 172905, 153741, 138229, 110642, 96785, 74537, 71950, 83323, 96244, 105149, 111807, 119620, 130389, 132290, 157342, 193886, 230182, 283279, 304367, 300107, 293991, 297920, 288879, 261393, 223785, 169192, 132334, 84804, 74306, 68102, 51105, 51620, 56027, 59184, 59376, 43166, 31760, 22796, 25321, 30267, 22486, 23594, 20019, 10238, 5066, 443, 8174, 25468, 21947, 23457, 32945, 24737, -1379, -4005, -7484, 3639, 15456, 26791, 30752, 30621, 19864, 31814, 35108, 24813, 29663, 42703, 38859, 33011, 21854, 18325, 10708, 12489, 16184, 1325, 19887, 19975, 9431, 28498, 39206, 46958, 58926, 53105, 42946, 14003, 11145, 16641, 12188, 4987, 11177, 22324, 20015, 14194, 20678]
12454B0678Q50m80k10j981j7379l193J4385J5570j096k2200r313J2963O853M196
12440A9643K0734O708R859J5568J8552L7616J6083J447J270n129Q247j1263m6393
12427I2942j2139m099n298k5320l371J6752o442j1744o230J181Q839K0724L875
12414F9670J5857K9634K9903L2082M9498M5283L4144Q164r343l848j8075j7650
12402B65319l1506k1966l109J0614J6550R579J1407M2036K2977K3080M6200K1692
12390D12873J1567l251j7165j2888P072J0302J7485K5922J2695P172K727K9425
12378E03936R645P627j6763m2338l2853l1940k3784j7181k4268J569N021K047
12366C40718J9294r084r007m103k2499n452J7986M849j7628k0407k2611k0171
$$ y = [20678, 21528, 21048, 20838, 18857, 1478, -1715, 12670, 28240, 27144, 4944, -4369, 8594, 15447, 19643, 40377, 47085, 56944, 72512, 91064, 128680, 144763, 146210, 147480, 142351, 150598, 139335, 92942, 80803, 76704, 71406, 46086, 42715, 59467, 53025, 41281, 35051, 36232, 45071, 65795, 69670, 85527, 115161, 145064, 177146, 226644, 271927, 306071, 314235, 304892, 301044, 282969, 265319, 233813, 211847, 208738, 219352, 235902, 245481, 256888, 298924, 321901, 344981, 391181, 412873, 424440, 421189, 404024, 391136, 398208, 408510, 425995, 451917, 464612, 471784, 474511, 503936, 513581, 521208, 504445, 462107, 429254, 397314, 373530, 356349, 332081, 333650, 338671, 340718, 360012, 350928, 341921, 337818, 315319, 309867, 327853, 332702, 315074, 294667, 272056, 251885]
12354B51885k8512k2728P445K9657M7086O8399P6303O9024L1373j3422n8944m1768
12342D15798m3251k9593l0471k3168J5232J4200l1080m9856l0563N185l593j9868
12330A88972l7560k9286j7181l607j1127j4193n642n99n395k942J5468N2l701
12317G3259j0613m985j7169l021R831J0088K313J3534J0424K865j2797j7319p364
12304D9046J6116J7187M012q821r916j2811j4003j7017k142K129k150l160M280
12291B2750j0680K885J5964L854n120L709J4836k3392k2671p03J1123K664j1094
12278D125q997j3200j104P381j896M196J8057J7962R207j7412j3249p350m33J0652
12264G939J5222K25j2488M57R341q320P268M850J404m174k430j2448j305K257
$$ y = [251885, 223373, 200645, 208090, 237747, 284833, 353232, 429535, 498559, 529932, 516510, 457566, 415798, 372547, 342954, 312483, 289315, 304547, 318747, 287667, 237811, 207248, 212433, 208840, 188972, 151412, 122126, 104945, 101338, 90211, 76018, 70376, 69777, 64382, 61440, 76908, 76960, 73259, 62646, 57661, 40492, 37471, 47302, 57390, 59703, 73237, 83661, 86526, 73729, 56410, 49046, 65162, 82349, 86361, 77540, 67624, 54813, 40810, 23793, 21651, 23780, 21630, 18470, 22750, 12070, 14955, 30919, 34773, 29653, 33362, 48198, 24806, 2135, 1432, 12555, 15219, 4125, -4872, -18072, -19176, -11795, -13691, -9495, 8562, 26524, 35731, 18319, 5070, -2280, -2713, 7939, 23161, 23386, 10898, 11355, 20696, 12376, 19644, 24494, 25898, 21724, 19294, 6846, 5541, 7798]
12250G798o425q004j0156M838J5380k175j0447m30J4138J4764p750P72l084n269
12236C950l406l076J6763K4876j2100j5100J3282J9052m965j1208p011j920k0817
12223a680k1526k463Q551K2425j351L094P665O954j1504j1633J3165M366J0899
12210B6962j2209p311j1599K870O314o244J4477o664j0370P777L401N909R422
12197B2735J2991j380q897j1265J060O84q632R307J9473J4001Q993j27o806k97
12183E1840q323k025p293l00J67n975k409O85k516j9763n437j716m018m51q31
12168h365M922Q518k3448p202k087j0468J0185J9031J31J0145K355j383j080M512
12154E766J0275J1419J1343J6468J8491L979K4087J7524L042k3007k9899j5618
$$ y = [7798, 1373, -6631, -16787, -11949, 3431, 1256, -9191, -9621, 4517, 19281, 11531, 12303, 9219, 3950, 544, -2532, 14231, 39107, 27007, 11907, 25189, 44241, 39276, 28068, 21057, 19137, -1680, -23206, -25669, -17118, 5307, 3956, 7050, 14715, 21669, 10165, -1468, 11697, 16063, 26962, 14753, 7442, -4157, -1287, 5027, -1217, 13260, 6596, -3774, 4003, 7404, 13313, 22735, 35726, 34346, 25449, 14184, 15244, 15928, 7296, 16603, 36076, 50077, 59070, 58943, 52137, 51840, 43517, 41492, 34199, 33899, 34066, 28091, 25682, 26367, 23851, 4088, -1349, -3065, -7083, -7534, -8365, -3443, 5075, -18373, -25575, -27662, -38130, -27945, -8914, -8783, 1362, 3717, 2334, 1254, 5766, 16041, 27460, 38803, 55271, 73762, 77741, 101828, 119352, 122394, 99387, 69488, 53870]
12142E3870j9997j6958n124J4503q735j0027N684J9395J6183j836m06P073L5901
12129H9526J7075M676J0097p23j5816k9582r951j5021q673k0248j1423j5702K6358
12116B0593K6767M259r627O91J4890j148j1206K398j5493K978J1501J1231J304
12103E9138k2021j0840O559k683j3760j5719j109K5364L3400M399K936K9262L7822
12090A32748J9931L7759K9703J133j5322m4237m7128m2726l9971q391J7451n668
12078C5282k2299l62N087R330L893j59k5442q515j2415P882j719l967K0366k973
12064C989q014O587P864j0409p247K827K1121J9247j452m683j5737P796J3523
12051C5412K0400J4146K5351J4206j9785p767j0405k0055o757J0300j5450k2398
$$ y = [53870, 33873, 16915, 11791, 26294, 17559, 7532, 13216, 32611, 48794, 46958, 46552, 53625, 89526, 106601, 111277, 121374, 120651, 104835, 75253, 65302, 50281, 41608, 21360, 9937, -5765, 20593, 47360, 51619, 41992, 42683, 57573, 56425, 45219, 47617, 32124, 35102, 46603, 57834, 59138, 37117, 26277, 32836, 30153, 16393, 674, -435, 24929, 58329, 62728, 65664, 94926, 132748, 152679, 190438, 220141, 221274, 205952, 161715, 114587, 71861, 31890, 23499, 40950, 35282, 12983, 12621, 17708, 27038, 30931, 30772, 5330, -3185, -15600, -7718, -9437, -13404, 6962, 3989, -4025, 2562, 10426, 17, -7230, -4403, 16718, 35965, 34513, 29830, 14093, 21889, 35412, 55812, 69958, 95309, 109515, 89730, 81963, 71558, 51503, 44746, 55046, 39596, 17198]
12039A7198n768J86p216J2170J0075j0402j1637k1619o280J6597o16j249P91k861
12025a0631l297O288K3356n422q441J1599j597j6368j38Q590j110j6235J6309
12012B903l043j6818j247J0867L816J783j4813j0048o480J6800R903L103j4982
11999a8256J0581K3643J3683j1636q682l589P633q64l480J2476j3898j8764J832
11986i321O560l670p314J227M248Q822k385l147J7777J8378j9871j9708p576m762
11972b0742N559R669Q746k089m085n336L245K396m528J9584Q23o413N105J0224
11958B2158P244j5085j0958P127J4691j0960j8239P26j00o574m120J2788M402
11945C100r124j4682K4832J8216L224j6142j4337j622m871m730J452O991Q760
$$ y = [17198, 11430, 11616, 4400, 16570, 26645, 16243, 4606, -17013, -23293, -6696, -7312, -8561, -7770, -10631, -13928, -7640, 15716, 10294, 1853, 13452, 11855, -4513, -4651, 3939, 2829, -13406, 2903, -140, -16958, -18205, -7338, -3522, -1739, -16552, -26600, -33080, -16280, -6377, -3274, -18256, -7675, 15968, 29651, 18015, 9333, 5744, 13377, 12513, 9033, 21509, 7611, -11153, -9321, -2761, -6431, -13745, -12518, -8270, 552, -1833, -4980, 12797, 31175, 11304, -8404, -15980, -20742, -15183, -5514, 3232, 1143, -2942, -8278, -5033, -2637, -7165, 12419, 13242, 6829, 11934, 22158, 29402, 14317, 3359, 10486, 25177, 14217, -4022, -3296, -3396, -9970, -14090, -1302, 3100, -6024, -20706, 4126, 22342, 25566, 9424, -4913, -6535, -11406, -16136, -14684, -7693, 1067]
11932A067j2257P295J3463j5564J012P168j0708r688q797J3820N100L137j507
11919f459q1m186J841q04k460J4274J1524O776q04k262j6524p380O009R132J4357
11904B2953m761j4158R138j8764j3652J705J3526O01j3665j6794M265j236q977
11891c9819J2541K554J1291J1686n34N157q891k505l03j852l523m217p636J3603
11877a2448J7115m128j3635l214Q157k848j660O909N65p255k456J2142J1371l516
11863E099J925p230m021l222J0625K65k1102k5085J957J3332J3702R367Q337L757
11849G706J1115j1605q722J117o3M740J5192m367j0911q25k158o86k4p766L096
11834d161n587j7493L700O438J6572K1405M432j5829l474m384P10L831L063j0867
$$ y = [1067, -11190, -3895, 9568, -5996, -4984, 2184, -8524, -18212, -27009, -13189, -8089, -4952, -6459, -6540, -10726, -8885, -9689, -12149, 2125, 13649, 20425, 19621, 17359, 835, -6545, -536, 8596, 22953, 18192, 4034, 13172, -5592, -19244, -17539, -4013, -3412, -17077, -33871, -29606, -30842, -39819, -27278, -24724, -13433, -1747, -2281, 2876, -6015, -8520, -8823, -10675, -14198, -18415, -26051, -12448, 4667, 539, -13096, -16310, -8153, -11001, -12661, -5752, -5187, -12442, -14898, -2756, 8615, 5099, 7024, -206, -4227, -7449, 3176, 3441, -17661, -42746, -40789, -27457, -13755, -4388, 3949, 7706, 18821, 7216, -1506, -389, -452, 4288, 19480, 15113, 4202, 3377, 1219, 533, 509, -7257, -4161, -9748, -27241, -23541, -17103, -531, 20874, 25306, 9477, 6003, 1619, 2329, 6160, 9223, -1644]
11820a644n927n388O543J1384j3613m351J6261Q107q940j7591l602N205P362q311
11806a4505q710l48N792r370m545M953J1721M680J5564K417J098r134k202K860
11792B71q620N79q666J1023J6794m789j0240q94R579k737j3647O959j532j5230
11778b1150L129J1019Q920K846q357l872J5838P051j5719N239O329j0042j4915
11765a3684j5539J3445J6609j164l745O463q894R92l391K935K71j2737n341J9040
11751d740q37m154m222j2544l403R122Q139K875l383m96L305M666N29J57O847
11736A861J0144J887k999k2393q130K3062r75K151J3438J205j1636m711l862J547
11722E89n221J633r21r39J851J7122P441k262j8703R615j582m860J1010K157j7810
$$ y = [-1644, -7571, -12959, -6416, 4968, -8645, -12996, 3265, 11372, 2432, -15159, -18761, -13556, -6194, -14505, -23215, -23563, -17771, -27141, -31686, -26733, -15012, -10332, 5232, 7649, 8747, -387, -2589, 271, -8349, -7770, -16436, -5413, 11381, 6592, -3648, -4542, 5037, 2300, -11347, -4388, -5920, -21150, -18021, -7002, 1918, 4764, -3593, -7465, 8373, 15424, -295, 4944, 11273, 1231, -13684, -29223, -15778, 831, -333, -4078, 2385, -6509, -5517, -8908, -5973, -5702, -18439, -23780, -4740, -5577, -9731, -13953, -26497, -29900, -20778, -12639, -9764, -13147, -13643, -10338, -5672, -5143, -4986, 1861, 12005, 13892, 10893, -11500, -19630, 3432, 2457, 4608, 18046, 19251, 7615, 2904, -958, 589, -4632, -2999, -3920, -4859, -3008, 14114, 21555, 19293, 590, 10205, 8623, 3763, 14773, 16930, -880]
11707h80J15j1852K293M005r601J5874M920k728l018j1743K2607Q293j0034j1112
11693b861qQ057k1926r270J6830J3531K378J78r52P224P590j042q115l378o696
11678A540K611K3616L588j9760p40k594q002m316j3112N156p715J5053J7638J2880
11664B5843j1089o377j2853o469L866m177O222k579P767J5581M422r969l985L324
11650I527J150M997R040K799k137j8664j2543j1702P969o50J1577N49q800j0907
11636a7795j4131O845M4r810Q671l750j390K056J6523J9188Q018N706k773Q030
11622B5432l776k0414o298j526L213O019L68N876o794L587L293J2069L951m509
11608B0491k379N738P311J0479J2312J792p173K790n380j1567j9628p159j2924
$$ y = [-880, -765, -12617, -10324, -6319, -15920, -46, 4874, 2146, -872, -12615, 9992, 18285, 8251, -2861, -2869, 5188, -16738, -26008, -9178, 4353, 6731, 6909, 5957, 13181, 20771, 19729, 11614, 8236, 1540, 4151, 27767, 31355, 11595, 10855, 8261, 259, -4057, -17169, -12013, -19728, -4675, 12963, 25843, 14754, 8377, -4476, -10945, -7079, -11256, -5034, -7613, 154, 15735, 20157, 10188, 6203, 9527, 10677, 15674, 24714, 27513, 25376, 6712, -5831, -17533, -9564, -10214, 1363, 1912, -6888, -17795, -31926, -25081, -25037, -34847, -26176, -29926, -31316, -29260, -12737, 6451, 14469, 20175, 17402, 25432, 21656, 1242, -5056, -6582, -3369, 2650, 3018, 8894, 2100, 5687, 8980, 21049, 25000, 20491, 18112, 23850, 31161, 41640, 53952, 55744, 48571, 51361, 45981, 34414, 14786, 7627, -5297]
11595e297O0J538J762q908N724J1460J6470n040j3083M297L597J287q8L181J1297
11580B8257O896R21M353l162J8826K0621J6698L641k277K54p685j0785K960p377
11566G2141J782m543M973J1592J3666K9026L1423K7531J8543R148m211k9548k7501
11553A54022k6310o849j9889j4476p420j7891j1360r25M953o061k1265j6632n202
11540D695J2735M091K1008n687K532R341j053J5815P662J5382L0681L0965L7575
11527A85742K7870J7411p909l5058l9309l0857r462O020L647O303l467P356J3505
11514A41792K4252L1284L8274J8483r91j6607k9521l3478k8098k1165l6355k9501
11502E8369j8865n957n038J6456m453l696N332n154p080M868J9356J2820q278
$$ y = [-5297, -5237, -3699, -1937, -10845, -5121, 6339, 22809, 17769, 4686, 8983, 12580, 13867, 13779, 16960, 28257, 35153, 36074, 40427, 37265, 56091, 76712, 93410, 97051, 94774, 95028, 87343, 76558, 79518, 72141, 73923, 69380, 74353, 85945, 99611, 128637, 160060, 187591, 206134, 215282, 211071, 181523, 154022, 127712, 120863, 100974, 86498, 79078, 61187, 49827, 48902, 53855, 47794, 26529, 9897, 4695, 17430, 21521, 42529, 36842, 39374, 48715, 47662, 63477, 71139, 86521, 117202, 148167, 185742, 213612, 231023, 223114, 188056, 148747, 117890, 108428, 114448, 118095, 124398, 120931, 128287, 141792, 166044, 197328, 235602, 254085, 253094, 236487, 206966, 173488, 145390, 124225, 87870, 58369, 39504, 33547, 28509, 44965, 40512, 36816, 42148, 36994, 29914, 34782, 54138, 66958, 58680]
11489E8680J621R923O250R667J2834K8723K8478N1711M4705J0529l016l4170m3051
11476A82884k6330j4002l4745l5923k4754j1214n958J727K799J3894J3622J7332
11464G9332K8038p518j5689j8117k1061j3786k2030P91K287n842J5290O43n187
11451A7151Q417O610M668j2718k8569N396J9884j192n090q133q034m422p688J7645
11437C925J6857K3264n626o05O178J409M92j0562j978J7460m158r329r476j4174
11423A3677k760Q943Q936P793p238j7185q700k135p647l230j519n231K424J4562
11409F90K7700q859n422r465N716J0205r395j5661j0592j2406K86J4334m427K604
11395a4692M522j219j1315p202K0303K1763L896J0066j2514r533L21l217j325
$$ y = [58680, 60301, 70224, 76474, 86141, 98975, 127698, 156176, 207887, 252592, 263121, 260105, 225935, 182884, 156554, 142552, 107807, 71884, 47130, 35916, 29958, 31685, 34484, 48378, 62000, 79332, 107370, 99852, 84163, 66046, 44985, 31199, 9169, 9960, 12247, 6405, 21695, 22338, 17151, 25568, 32178, 36846, 24128, -4441, 955, 20839, 19647, 14557, 6424, -1610, -6032, -13720, 3925, 20782, 44046, 38420, 37815, 43993, 45402, 45894, 35332, 33354, 50814, 46656, 37327, 27851, 13677, 10917, 19860, 28796, 36589, 29351, 12166, 3466, 1331, -6316, -9546, -11065, -16296, -13872, 690, 28390, 19531, 14109, 4644, 10360, 20565, 11170, -4491, -15083, -27489, -27203, -12869, -17296, -14692, -10170, -11389, -22704, -29906, -9603, 12160, 16056, 26122, 13608, 4075, 4396, 1179, -146]
11382a46m918n560p549n209R15L525J0315J3883o308j4172N27p329J0671j135
11368a2490J5969J5594r866m32J2464j2325j3349Q959O348n216k1039j4801L501
11355b6683J3719N248P029p651p329j58m162q244L956J0700J6985l596r760O478
11341c468l861J0450k788o097J6130J0270P88L068l690K262p162m394j612j475
11327H421m004m29M412j2917j9456N543K7398Q037j8491j2299N385q4j38J8520
11313I898J7167p983q468p4j5436j4629O085J2736P834j0604l44o782L520j752
11299h832N363j552J8254M827r582L456J0274l179J009O349O807o967j8304j0726
11285b803J0176J4192J789m907N484m442J6335K1275J3684K8838L0281J4456J3265
$$ y = [-146, -5064, -10624, -18173, -23382, -22467, -18942, -8627, 5256, -1052, -15224, -14697, -22026, -11355, -12490, 3479, 19073, 9207, 8775, 21239, 8914, -4435, 4524, 10872, 5656, -15383, -30184, -26683, -12964, -7716, -687, -8338, -15667, -15825, -19987, -28231, -24275, -13575, 3410, -186, -9946, -3468, -7329, 3121, 333, -5764, 10366, 20636, 21424, 24492, 20802, 23064, 15902, 11508, 9896, 8421, 4417, 3988, 8400, -4517, -23973, -18430, 8968, 17005, -1486, -13785, -8400, -8484, -8622, 9898, 27065, 19082, 10614, 10540, -4896, -19525, -13440, -704, 7130, -3474, -3818, -10600, -7080, -8832, -3469, -5021, 13233, 18060, 8478, 11934, 22208, 19029, 20038, 26387, 33194, 26227, 7923, -2803, 7373, 21565, 23354, 18447, 23931, 19489, 35824, 57099, 70783, 99621, 129902, 144358, 157623]
11272A57623k2009j2284r106l0208k7208k9488r677P253j0456l1719o957K8524
11260D288J6168m811j7735j0006P677J1882k868j630O665J309k554Q112Q820o402
11246A8915n136Q236N764r26K248n0m295J502Q293J7763K6734J5167J1342J8172
11232A23729L0227N0930O6093Q3787O6430M2909o005m6774o1942p3250o5606l7799
11220A72729k9600j2779l522o975j2870j2730k9906o614m42j2219j3993j3222
11208A7857l362k020K808L455J386P129l722k291J3496k887l168J5886n00p332
11194C6735Q612L634m151J0889K8073J0569p846L5461N1868M4230O0221Q6675
11182C64970P1272N6230Q516l7378o4126q3102o8338m2182k4094k1458l2014k5867
$$ y = [157623, 135614, 123330, 114224, 84016, 56808, 27320, 17643, 24896, 14440, -17279, -24236, 4288, 20456, 15645, -2090, -12096, -4419, 7463, 4595, 2965, 9630, 10939, 8385, 16497, 25317, 18915, 13779, 22015, 27779, 26853, 29101, 29051, 24756, 26258, 34551, 52314, 79048, 94215, 105557, 123729, 153956, 204886, 270979, 354766, 421196, 464105, 458100, 411326, 349384, 276134, 210528, 172729, 143129, 130350, 126828, 119853, 106983, 94253, 64347, 57733, 57291, 45072, 31079, 17857, 14495, 12475, 15283, 18738, 20124, 27253, 23531, 21240, 34736, 31849, 28681, 44567, 44067, 36735, 45347, 48981, 44830, 55719, 83792, 94361, 86515, 121976, 173844, 218074, 278295, 364970, 436242, 492472, 500988, 463610, 399484, 316382, 248044, 205862, 181768, 160310, 128296, 102429]
11170A02429k1701l266R166n784j6043j0123j4528k1648l445J1059o405o445N466
11157A8732l561P440P583N949n271L792q113O270m60q939M566L14j1089n399J3535
11142B5349J5474L0190J5678J7259J4366Q587M562J9573K088l487j0630j0508
11130A28501j9153k8732j6159k8568j5088j131j1905L834K101j943R249n635L14
11117A5685M473L895j047J257l504L404K475q341R3n275k1448q347O442n743j970
11102a7951J0878L05j55L42p362P047N386L462k2834R35J4611Q701M330M594k0209
11087g920J3679M825j3597k1503L778J3566O020j2853J1446N56r957r857J3370
11074h447J2435l120j1551n524J1863K4840k678j8889Q372M302J943J500M622
$$ y = [102429, 80728, 77462, 86628, 80844, 64801, 54678, 40150, 18502, 15057, 26116, 19711, 13266, 18732, 15171, 22611, 30194, 36143, 30872, 34664, 26551, 32821, 32361, 23422, 27988, 28302, 17213, 11814, 25349, 40823, 71013, 86691, 103950, 118316, 126903, 131465, 151038, 153126, 149639, 139009, 128501, 109348, 80616, 64457, 35889, 20801, 19670, 7765, 11599, 13700, 11757, 21006, 15371, 15685, 20158, 24053, 23006, 24263, 20759, 24163, 26638, 18297, 18390, 13115, -8333, -16680, -10238, -15981, -17951, -7073, -6768, -6923, -6581, -13943, -6896, -1510, 1952, -20882, -19947, -5336, 3365, 7695, 12289, -7920, 5759, 10584, -3013, -24516, -20738, -7172, -1152, -14005, -2559, -2003, -11960, -21817, -8447, 3988, 868, -10683, -16207, -4344, 20496, 17818, -1071, 7301, 11603, 13546, 15046, 19668]
11061A9668j4889j8125K583O634P16N99q035M514J2501J00Q777N486p816k016
11047A0697j2013j0094K451K652Q898N974m615m901r170R403r899l642R366n819
11033a0712j8567K752J1132o542L089J4151J0873P859k1251j8966k049J9881Q597
11020B47n794p350l753J740J748L536j81m143J3048O256l549j96o159p364r516
11005b1430J0403R440J031O81j1554K56j5859l519M862N94n180R162J4064J1577
10991D528O856J7038O52Q182o944j8669r611r769n292M584R736j489l218O518
10977C102L254K634k1825r007M10J2726N478J1631J3382j4802m426p411K666K848
10963F60M99j1060L364r365j1108L358J0635P01P32Q74j252N297P069j1415m068
$$ y = [19668, 4779, -13346, -10763, -4129, -3413, -2814, -10849, -6335, 6166, 6266, 15043, 20529, 12713, 10697, -1316, -11410, -8959, -6307, 2591, 8565, 3950, -951, -10121, -718, -10617, -14259, -4893, -10712, -29279, -26527, -15395, -21937, -18848, -4697, 6176, 14035, -7216, -26182, -28231, -8350, 247, -5547, -12897, -16650, -14910, -13162, -9626, -9807, -13950, -902, 5354, 1805, 1609, -4550, -11914, -21430, -11027, -1587, -556, 125, -11429, -11173, -27032, -30551, -25689, -25095, -30275, -21113, -7049, 4528, 11384, 28422, 29074, 37256, 30312, 11643, 2032, -7737, -13029, -8445, 1291, -198, -3416, 3102, 6356, 8990, -12835, -21842, -21432, -8706, -3228, 8403, 21785, 6983, 2557, -4854, -2188, 660, 1159, -9901, -6537, -15902, -27010, -23652, -13017, -12316, -11584, -10710, -11962, -6665, 404, -11011, -15079]
10948a5079K2225r617q048o500n630j0437j3620J2687P689q76J922O637j939j165
10934b1751M229P971o488p244n809J3515J6354P84K35k71L382j0187j7795K7247
10920D172J2070r822j9770o667N905K876O279O130J0111j43n321j9189n669J4183
10906d855J0831r501m664j651k502J3332j0125j1052J0152J4639K322j998Q871
10893A3799L614l860k858r640j9556q599j1136M496J8388N384O183m582K97o50
10879h720j1847r742P121P321j0079j328L013J6009J2849M461m238j2491R30J336
10865e405q531j2934L749P636L08Q60J1961N58J650J0025K989k4052j5321m462
10851c0969r661M906J8451J9687l135j8804L258o651R578P999o093j5305L578
$$ y = [-15079, 7146, -2471, -10519, -17019, -22649, -33086, -46706, -34019, -26330, -27206, -25284, -18647, -20586, -21751, -17522, -9551, -16039, -23283, -29092, -15577, 777, 1561, 1796, 1525, 4907, -5280, -23075, 4172, 16242, 6420, -13350, -20017, -14112, -11236, -4957, 1173, 11284, 11141, 5820, -13369, -19038, -4855, 5976, -3525, -8189, -9840, -12342, 990, -9135, -20187, -10035, 4604, 6926, 4928, 13799, 17413, 13553, 10695, 1055, -18501, -27100, -38236, -33740, -15352, -9968, -3785, -8367, -8070, -8720, -20567, -30309, -23188, -15867, -25946, -27274, -24261, -8252, 4597, 9058, 4820, -7671, -6741, -5405, -13936, -26870, -23121, -15485, -15177, -14317, -2356, -1798, -148, 9877, 12866, -11186, -26507, -30969, -40630, -35724, -17273, 2414, -721, -19525, -16267, -22918, -13340, -5341, -11434, -26739, -23161]
10838b3161K5046M654l356Q215j1247j2383j3230k5391O119J0269R093P107K3158
10825D893O400j7505J893K2656o639J566K097m318j0657J6083L589r241p881k2444
10811a9508N569M910k715j6433l777J99J5060Q204j954l171m664j892K886P461
10797i825O613R145M725p524k3290j8186J646L1882n968j7313J1078J0105M787
10784b125m297m050m886K1636k0958k2578m286K57K3142J3297p742l685r1j6401
10770c2767L651L135M804P682Q823J648r822N133J2696n545k1425p142J1878J1546
10756e705K055p707K069M228K165L566Q32j2474k264L032j4698j053Q755J1136
10742f063J9373J955q250N655j7483j6565N228p39j0228L845j238p356J7297M433
$$ y = [-23161, 1885, 6539, 3183, 11398, 151, -12232, -25462, -50853, -44734, -34465, -25372, -18265, 4893, 11293, -6212, -4319, 18337, 11698, 13264, 15361, 11043, 386, 16469, 20058, 10817, 2936, -19508, -13939, -9029, -11744, -28177, -31954, -31755, -16695, -8491, -10445, -13616, -18280, -20172, -17286, -9825, -3212, 5933, 10658, 3134, -20156, -38342, -36696, -4814, -10782, -28095, -17017, -6912, -2125, -6422, -10472, -15358, 6278, -14680, -37258, -41544, -41287, -18145, -4848, -12590, -16275, -16366, -32767, -29116, -25981, -21177, -13495, -4672, -3024, -12846, -7713, 4983, -562, -21987, -29129, -17251, -5705, -3650, -11357, -9288, -5060, -2895, 671, 1503, -10971, -13235, -10203, -24901, -25954, -17199, -6063, 13310, 15265, 7015, 12670, -4813, -21378, -16150, -16889, -27117, -23272, -24510, -31866, -14569, -10136]
10728a0136M318N167r586j7063j2185J0970N806J3588n055j2492R364O585J1446
10715G27L235k943j0022K2496j2637k0941r7Q860q573r671M479K830j26k261n044
10700b9688J1652L660P912o056R183O994p211O4M560k491j4499J556m054j364
10686a9782J8192Q833J509j3633j5332K5324L0103J9N608m658Q405m046l735n690
10672C1117P10k2045j5165m594n390j3889J63Q27k690J7910J6118p330j3479P231
10658a0506J1238j1428j012L53l859O920J4020m163r600L47M082j9722L969k429
10644b1790K002J1379O745p983M420N39j130q986j515L630R882J8466K3393J6400
10630E5452p929l669O64J9156J1043M161j9493k2753k031N543m326o047k2442
$$ y = [-10136, -5818, -651, -10237, -27300, -39485, -28515, -22709, -9121, -14176, -26668, -17304, -10719, 727, 3962, 1019, -9003, 13493, 856, -20085, -20182, -11322, -19895, -29566, -25087, -22257, -22383, -24644, -29688, -18036, -14376, -6464, -12520, -3337, 3657, -3554, -3490, 1070, -1421, -15920, -14364, -18418, -19782, -1590, 7243, 8752, -4881, -20213, 5111, 35214, 35233, 40841, 36183, 44588, 40542, 36807, 31117, 31827, 9782, -5383, -9977, -15367, -29256, -29093, -28266, -30956, -13046, 3072, -4258, -17737, -10506, 732, -10696, -11708, -11355, -15214, -8294, 5726, 1563, -8037, -7690, -3608, -23330, -19361, -21790, -19788, -8409, -1664, -9647, -5227, -4688, -5818, -14804, -16319, -12689, -2807, 15659, 39052, 55452, 47523, 43854, 44518, 63674, 74717, 78878, 59385, 36632, 34601, 40144, 35818, 29771, 7329]
10617G329k4492j5765L048J4973K628j2345j3073m474J3535J2524o122O61N614
10604a5959L439l071l204O276J58L195P288O418P772J870o010l407m124j1652
10590a1011K452J1320J5412m030j893n596m064n302j0675P012Q478K1999J9616
10577D3718L80j2079j050J2328R163j5199r184j0052o009M235K55p34M088k940
10563A6920k14j3323j5354P679o7j3656j717J5341P246q284N140J0029n533o389
10549b182n31l071j0400l616l02j3270n836P316O791J7936k982J2269O962N151
10535A4235r57r345p338r852j888J5085O924O930n397j2688J1960l523r216j0291
10521a5361J337J0331n193n14j1267n713O912L375O812O445k242J2457R58q387
$$ y = [7329, -17163, -32928, -29880, -14907, -12279, -24624, -37697, -42171, -28636, -16112, -22234, -21573, -15959, -12520, -15591, -18795, -12519, -12361, -9166, -1878, 4540, 12312, 14182, 8172, 4765, 641, -11011, -8559, 2761, 18173, 14143, 12250, 6654, 2590, -2712, -13387, -6375, 2103, 24102, 43718, 44098, 32019, 30969, 43297, 52460, 37261, 28077, 18025, 12016, 16251, 16506, 15772, 19860, 16920, 16706, 3383, -11971, -4292, -4359, -18015, -19732, -4391, 2855, -5429, -289, 9740, 4207, -2182, -2713, -5784, -16184, -19800, -20102, -33372, -39208, -31892, -25101, -7165, -10147, 2122, 9084, 14235, 13278, 3933, -3405, -13257, -15145, -60, 6864, 13794, 8397, -4291, 7669, 4146, -5070, -15361, -14024, -3693, -8886, -9400, -20667, -26380, -19468, -16093, -9281, -2836, -5078, 7379, 8337, -50]
10507e0p441J0467K748p688K726n61j667N372N667p833p141J657J3251K244k057
10492I694j90k842j502j4198j5105p548j107R127J806r190J9230O266l254P318
10478a495J7024p653j3831R964l021l75k282l067n485L964P991p903n639m487
10464a6295K36P89K728r277N53K0146Q840O150q398r683J388q493J7145O095J598
10449A3522j605r052L744k766k4135J4791J5190l978J834m578m001O984j1680
10436e730k776P287P809j1942k0481J2474J9099j506m971m753M00q244m051J8163
10422G78J4556o87j413j8339j6509j423N316J18K337J4896M018L753K543l580
10408F364q346p336L310J0588q13j3450q454L559J4193O811k705J0531L453o335
$$ y = [-50, -7491, 2976, 5724, -1964, 762, 201, -1466, 3906, 9573, 1740, -5401, -3744, 9507, 11751, 9694, 9504, 6662, 5160, -9038, -24143, -31691, -32798, -23671, -21865, -31055, -11825, -5559, -8813, -1495, 15529, 7876, -5955, 4009, 988, 613, -1669, -4736, -10221, -6257, 1734, -6169, -11808, -16295, -16059, -15270, -12542, -21819, -21266, -1120, 7720, 13870, 5472, -4211, -2823, -11316, 5829, 11924, 13522, 11917, 2865, 6609, 3843, -20292, -5501, 9689, 5711, 7545, 2967, -1034, 5950, -5730, -8506, -1219, 6590, -5352, -25833, -13359, 5740, 4234, -737, -5490, -5090, -13334, -17385, 778, 15334, 14647, 13234, -5105, -21614, -23037, -17721, -17603, -15266, -370, 3648, 7401, 9944, 6364, -1982, -9318, -6008, 4580, 3767, -9683, -18137, -14578, -385, 6426, 3721, 14252, 17705, 11370]
10394A1370o058r792J0227J1755j0149n376k11P074K067p411J775j2998m118j154
10380a2999P875L285l216O927o49L195J7127Q811r287n846N990k553q65p489l312
10365F994O187L020N959J024o613O415j467R020N987j3665r372p694Q81P286j1121
10350B841n311Q130P597m941r143r89k577p596j01P748m37j5122j753Q063q63
10335a4454j013k051J97O579O898J297O417k408r005R146J709j0873q936O795
10321i702K1210J664j7553k3061j3624L485J6399J3988J2236K607L841k919M573
10308A3144j8095k7912R469R570n8O298r830m357K811K872M68k1438M326K7J1391
10293b1314J3357J584r047p805P923K143J622L71l968M412J0050k489N194J6523
$$ y = [11370, 5312, -4480, 5747, 17502, 7353, 1977, 1766, 8840, 10907, 3496, 5271, -7727, -11845, -12999, -5124, -1839, -5055, 1872, 1223, 4418, 21545, 30356, 21069, 15223, 21213, 18660, 17795, 10306, 6994, 13181, 16201, 22160, 23184, 16571, 22986, 21519, 30539, 36526, 22861, 13489, 5795, 6676, 13962, 2841, -2470, 5660, 13257, 8316, -827, -1816, -4393, -11989, -12090, -4342, -4779, -19901, -21654, -13591, -14454, -15467, -17518, -17321, -10742, -3844, -2547, 3870, 1462, -7543, 1603, 3312, -7561, -16497, -9702, 11508, 13172, -4381, -27442, -41066, -37581, -21182, -7194, 5042, 7649, 11490, 8571, 13144, -4951, -32863, -23394, -13824, -13882, -7584, -17414, -21771, -18960, -16088, -15620, -37058, -32732, -32705, -21314, -7957, -6373, -15420, -23225, -15302, -13159, -11537, -11166, -15134, -10722, -672, -3161, 2033, 18556]
10279A8556J9540j3698j3194J7871m352k979l532j3487P06P677m910j6533J235
10266g100K755J0765J2996k350K27L149j7103n599M235r531J2405p892p813J0953
10252I7n39j3280p593M048J9331J2941o044K702l098k571k535lQ025r889j9411
10237a7819K942J0680R579j2700o48k2642m885M558N110Q036j8755j6552O581
10224d6515m151J972J9914K8594J1455n220j1488p700J5779N080O778q666O454
10211A2286J7361K221l043K659J5482j0107j7046J318j8284L221p630J742M62
10198F42L70K4664K558j5367k513j07J480j4597j9133J406R432L43p535P746N458
10183e153K016j5608j0817M717N269j1332R614k195j5046k855J0218O174R579
$$ y = [18556, 38096, 24398, 11204, 29075, 24723, 21744, 18212, 4725, 5431, 13108, 8198, -8335, -7100, -4345, 6420, 19416, 17066, 17293, 20442, 3339, -2260, 1975, -7556, 4849, -3043, -10856, 97, -442, -13722, -21315, -17267, 2064, 15005, 8961, 11663, 8565, 5994, 3459, 3456, 11481, 1592, -17819, -14877, -4197, 5382, -7318, -7966, -30608, -35493, -30935, -25825, -17789, -36544, -53096, -46515, -50666, -48694, -28780, -186, 11269, 6049, -5439, -13139, 2640, 7720, 14498, 5832, 12286, 29647, 31868, 28825, 31484, 46966, 36859, 19813, 21131, 2847, 6068, -1562, 180, 642, 1012, 25676, 28234, 12867, 10354, 10247, 11727, -2870, -22003, -20597, -11165, -10822, -18357, -10611, -5153, -3137, -18745, -29562, -24845, -19576, -30908, -21294, -23489, -38535, -41390, -31172, -24998, -15419]
10170a5419k781l669j4205N3J122P02O092J2006J6560J1676j5778r269l302J3126
10156c086O10l836j8296j7030q301K0035J1632P745J5614K60o759o027J0136J1838
10142A4535L377M577j3728q150k997j2657P151j497p060J1333j118L250Q345p226
10128a865q495p131K836M170L278o497P937K4864K723j2360j0956j0242q989N16
10114b0211J1955L91l899m548j1884j1236r156M795J6463J4584k888J6944J0894
10101A2204K542j6604R603K20L030j1279l615L367O644O280p189n536J1964J0531
10087B2162j681k1428k539J4391R580q084r816r042j2726p10O394o861j713K0740
10073a333K494K855k371J2471K961M198p840j7019p224N379M861K2486J1901k8018
$$ y = [-15419, -18200, -21869, -36074, -36021, -34899, -34197, -28105, -16099, 461, 12137, -3641, -12910, -16212, -3086, -2476, -6312, -24608, -41638, -49939, -29904, -18272, -10527, 5087, 5347, -1412, -7439, 2697, 14535, 17912, 22489, 8761, 611, -2386, -15043, -7892, -9389, -16449, -5116, -6234, -2984, 5361, -1865, -10360, -17491, -14655, -10485, -7207, -13704, -5767, 19097, 21820, 9460, -1496, -11738, -20727, -20211, -8256, -7865, -11764, -16312, -28196, -39432, -48588, -43793, -27330, -12746, -15634, 1310, 12204, 14746, -1858, 7745, 7965, 10995, -284, -3899, -532, 6112, 12392, 5203, -333, 11631, 22162, 20481, -947, -3486, 10905, 20485, 12401, 2585, -6457, -19183, -19893, -13499, -20360, -22073, -1333, 1161, 4016, 1645, 14116, 17077, 21275, 13435, -3584, -10808, -5429, -568, 21918, 33819, 5801]
10059E801k5615O975J4224L839L97J3560L843n596j3522j8245Q396j190o23R162
10045A406L242Q884j543j4225j1652M865l125o836n715n975P656M380q244m901
10031c1783L1055K7426o859j7982p915L008j678j994J4224R968j6851j8486o536
10018b4403L256n686m953j410J0905J6471J2324O917l741p937j3064P72l446j519
10004a5514o496P299j3610k308m10L299L976J3010J0653r126n346k653J0694o29
9990g161L618l00K725J325J212O096K322k783j4633J256J3460j646j5268k744
9976a2521M004J1409P139R733k560j5367j2508j2523L73j0665J787j0651K086
9963d0264J5063m912m118j720J2077J2949J2501J729q919q844p748k537Q183J5729
$$ y = [5801, -19814, -12839, 1385, 5224, 5621, 19181, 23024, 17428, 3906, -14339, -5943, -7133, -7756, 1406, 4648, 13532, 11989, -2236, -13888, -9023, -12148, -18984, -24699, -30674, -23018, -18638, -26882, -31783, -728, 26698, 19839, 1857, -6058, -3050, -4728, -6722, 7502, 17470, 619, -17867, -24403, -21147, -26833, -31786, -33196, -22291, -5820, 6504, 13421, 9680, 1743, -11321, -10549, -13995, -15514, -22010, -14711, -28321, -30629, -31039, -27740, -23764, -10754, -101, -9227, -14573, -17226, -6532, -7161, -3543, -3843, -1118, 207, 1419, 7515, 9837, 7054, -7579, -6323, 7137, 5491, -9777, -12521, -8517, 2892, 10031, 19764, 17204, 1837, -10671, -23194, -22821, -33486, -31699, -42350, -40264, -25201, -30113, -34231, -35951, -23874, -10925, 1576, 3305, -5614, -14458, -22206, -24743, -16560, -831]
9949h31k630n073l077M323J1665m175j884R467l024k735k866N301L285J1169K469
9934B1384j0126j781m092j2186j3158o461P049k797J8392L133j2688N250j3761
9921b1842j7435J3795J6607j1834j992M907J9207j3554J89P344P033J6057N2j862
9907A6672j0790j002Q353P92m078N664K169N041n395m66Q326J601L272O684K463
9892C9306o916r812j1848j8453j1908n325L91J4335N029o597j1823n085J4978
9879a3728Q082m764m803m136J5259j167O08o956j6907j839Q513n56J6664J1671
9865E941O742J6347j4919j4635o178P493O347J085m544J3262K200k481M410L037
9851B4107n614k652L276P723J0788K603N38M56p305j6431M252M283p428j2024
$$ y = [-831, -3461, -8534, -11611, -7288, 4377, 202, -1682, 7785, 4761, 2026, -840, 4461, 7746, 18915, 21384, 11258, 9477, 5385, -6801, -19959, -26420, -19371, -22168, -3776, -643, -13331, -8081, -21842, -39277, -25482, -8875, -20709, -22701, -17794, 1413, -12141, -11952, -4608, 2425, 18482, 18534, 16672, 5882, 4880, 13233, 14025, 9947, 15611, 17780, 22821, 17426, 16960, 25286, 26887, 30159, 36843, 39306, 32390, 22578, 10730, -7723, -19631, -24956, -24565, -10230, -5201, -11798, -23621, -28706, -13728, -5646, -10410, -15213, -19349, -4090, -5257, -4649, -11605, -28512, -30351, -21838, -22394, -5730, 5941, 12683, 29030, 14111, -524, -6702, 791, 7138, 8223, 3679, 16941, 19141, 16660, 21070, 24107, 18493, 15841, 19117, 26840, 37628, 40231, 40769, 41225, 33920, 17489, 21741, 26024, 18596, 6572]
9837F572o212J5337J220m835j0403M94L3775K3717J6805N096j0760l817q8l946
9823F2955J0094Q940k2274r771q977j6232n064J0883J619j2702q053o31J8956
9810B9743L0547K6869j3244j7465J195o716o797L990k472J2482o9P566r115R78
9796E7492j3470j5799J6146K0056Q308J2705l377M618J1247k1175j8784j1327
9784D6640j2336M399J1242j401m612k013j0395k3271m549O449r348P460P997N078
9770B1340L833O597o596m223m622n64O436O324Q591m968r14J431J8829o434n373
9755C9687N131J3722k109L16M508k7556r605l277j022l128q085j9505p456l619
9741b1998J531R813r874J533J3513L428q659k735m185M337l632o26J3197J0699
$$ y = [6572, 360, 15697, 16917, 12082, 1679, 2173, 35948, 59665, 76470, 81566, 70806, 66989, 66901, 62955, 73049, 81989, 59715, 49944, 40967, 24735, 19671, 30554, 32173, 19471, 11418, 10787, 29743, 60290, 87159, 73915, 56450, 57645, 50929, 44132, 48122, 45650, 58132, 58063, 65629, 56514, 57492, 44022, 28223, 44369, 64425, 72733, 85438, 82061, 86679, 97926, 76751, 57967, 46640, 34304, 38703, 49945, 48544, 43932, 41919, 31524, 8253, 3704, 10153, 805, 8265, 16262, 21340, 25173, 31770, 25174, 20951, 16329, 15765, 22201, 28525, 37116, 32148, 31234, 32665, 51494, 45060, 39687, 44818, 58540, 56431, 56747, 61255, 33699, 24094, 20817, 19795, 16667, 8582, -10923, -18379, -21998, -20467, -10654, -20528, -18995, -5482, -2054, -10713, -13448, -17633, -13296, -16928, -17554, -4357, 6342]
9727F342j5871m579J1772r596M216J5882l080O884P949j325q029q880k6408j6729
9713d1452j3359K3455J7001J4765l348j1809o037m860O136N396j752j0642J078
9700b5428Q872J3104J4682r32n125N158O38n211o173l370K252L693K640L979q311
9685D68j4202j1434p250l655J8146k521l092o305J0276J6251J5898q459j9978
9672a5857n446K2467J0363R28J0425j612M48m746j6646M250J2115J14J970L804
9658B2577l815M339J0098J458r682M208R682N55J5593M0677K7091J4202Q935o980
9644A38938j2815k7324j5034k3751k9426n904J1120Q491J085r403j3279q194r919
9631D585k659R45J1732o177q548J7827J1780Q407Q346n946K627j2136k1956k8168
$$ y = [6342, -9529, -14108, -2336, -11932, -7716, 8166, 5086, 11970, 19919, 18594, 10565, 1685, -24723, -41452, -54811, -31356, -14355, 410, -2938, -14747, -20784, -25644, -19508, -14112, -15864, -26506, -25428, -16556, -3452, 11230, 10298, 5173, 10331, 10969, 5758, -415, -3785, -1533, 2160, 4800, 8779, 468, -13734, -25168, -32418, -36073, -17927, -20448, -23540, -29845, -19569, -3318, 12580, 4121, -15857, -21303, 1164, 11527, 12455, 22880, 21268, 21716, 16970, 324, 4574, 16689, 16803, 18773, 22577, 18762, 23101, 33199, 34657, 24975, 29183, 38865, 39420, 55013, 95690, 122781, 136983, 145918, 138938, 126123, 98799, 83765, 60014, 30588, 24684, 35804, 44295, 45380, 35977, 22698, 14504, 4585, 1926, 2871, 14603, 8426, -122, 17705, 29485, 37892, 46238, 40292, 42919, 30783, 8827, -19341]
9617a9341O477J5631j465R260p606O743K0150K1297J257j6781O9r824p8q829m056
9602A2904R127J4188k1362j3095K127J1489N631O703k568R68l343j3368M154j0175
9588C380m080j657L80j254m888L564q281O372J529L859N032O842L084j1462R873
9573A2293J0648k239q299j4705J209o784q903J1013L0247q409l570q186K841R655
9559A6811o034j5871o435J9734J8471J0151m746l436n559r750j4599N86N557J5943
9545B0823J4830Q393j6210m156k43P957O07Q091j3075M4J0517j146k265o096j3992
9530A4079j7854L730K40j0100J2011K4315J6423k5791j1815L926L60R383J4422
9517C3329J4863J0781J4202J0343j8220j7173N78n8j5829j4015N222m538j8933
$$ y = [-19341, -12864, 2767, 1302, 10562, 2956, 9699, 29849, 51146, 52403, 35622, 35691, 25867, 25789, 16960, 12904, 22031, 36219, 14857, 1762, 3889, 15378, 21009, 27712, 25144, 26112, 22769, 9401, 13555, 3380, -700, -2357, -1977, -3231, -8119, -4555, -12836, -6464, -4935, -1076, 3956, 10798, 13882, 2420, 12293, 22941, 20702, 12403, -2302, -1093, -7877, -16780, -5767, 24480, 16071, 12501, 4315, 7156, 16811, 10777, -5094, -11529, 8205, 26676, 36827, 32081, 28645, 23086, 13336, -1263, -677, 4880, 20823, 35653, 44046, 27836, 23680, 23437, 31394, 32001, 40092, 27017, 27061, 37578, 36432, 34167, 28071, 14079, -3775, -45, 195, -9905, 2106, 26421, 42844, 17053, 5238, 9164, 9524, 18907, 33329, 48192, 58973, 73175, 83518, 65298, 48125, 48703, 48645, 32816, 18801, 24023, 19485, 552]
9504E52r333J3648j721m099J024J6104J892k876R122l826j0208k437K50q753J7725
9489A7064N518l657m005O338J3058L565Q555r586j0538R42R398K799K890L238
9475D5579J457p164j1391O174J988m240L521J84m727P501J6498J1084q048j1130
9461D7286k254R592m938j5215j046J1875n080J637O885L707p818k3732m156Q833
9447B5576r13n917K110P272J282M774J2881p217q786j4120l982K7118m23l522
9433C6133j1596j0445L181O258j2951k698J816j381J2629J1423J5281m271r568
9420C3811o036j2472R120M0359M846j3135q291j353N861M370j5960n780Q807j3875
9406C0272j1083p295j1361k759J4246J8616O22o814j3604m722N89J8305J836M685
$$ y = [552, -8781, 4867, 3146, -953, 71, 16175, 18067, 15191, 24313, 20487, 10279, 7842, 8092, -661, 17064, 22582, 18925, 14920, 21258, 34316, 37881, 46436, 36850, 26312, 27254, 36652, 39451, 42341, 45579, 47036, 39872, 28481, 34655, 36643, 32403, 35924, 36108, 31381, 38882, 55380, 66464, 58416, 47286, 45032, 54624, 49686, 34471, 33425, 45300, 40220, 41857, 48742, 52449, 44631, 20899, 16743, 25576, 24663, 18746, 20856, 28128, 29410, 34184, 47065, 39848, 31062, 16942, 12960, 40078, 39655, 36133, 24537, 14092, 17273, 23531, 10580, 7882, 9698, 8317, 20946, 32369, 47650, 43379, 33811, 27775, 15303, 24423, 64782, 69628, 56493, 48202, 46849, 52710, 57080, 41120, 35340, 44147, 30272, 19189, 11894, 533, -2226, 12020, 30636, 31258, 24444, 10840, 6118, 6707, 25012, 26848, 31533]
9392C1533m69r894R45j0743m78M712L939j1273o05J3687P253l937k839n231J7004
9377C3604l261K503l222O007J1165K2959k90q542L759P189k710j3742j384J240
9363E5275p089J400K641K572O819j928R717r410j3869n707p22n14J5724P375N276
9348F7560j6866j8176M00O755L440m411j5628M701L533p595m211J690j2220o395
9334B577J6574J6316R336J2207J286p252J701J0894J3163q34q496R835j309j1780
9320F4218m213J0604P014j6327R741J5998J0162j1230n949P60J0557j123J1223
9307A01435J2J1837L028m378j5350k3517p866R269M447k1940j2093j578K9620
9294G2926O769J1731p86j3368k1175j4917M930J2414J4252j4260j2843m852J3314
$$ y = [31533, 31064, 21170, 22115, 11372, 10894, 15606, 19545, 8272, 7667, 21354, 28607, 24670, 21831, 16600, 33604, 30343, 32846, 29624, 35631, 46796, 69755, 69465, 60923, 64682, 71871, 69161, 55419, 54035, 55275, 48186, 49586, 52227, 54799, 61618, 59690, 69407, 59997, 46128, 40421, 39699, 39185, 54909, 62284, 67560, 50694, 32518, 32918, 39673, 43113, 38702, 23074, 27775, 31308, 23713, 19502, 21192, 8972, 2577, 19151, 35467, 44803, 57010, 58296, 51044, 52745, 63639, 76802, 75968, 67472, 77307, 75998, 64218, 60005, 70609, 77623, 61296, 71037, 87035, 97197, 85967, 80018, 80778, 91335, 90212, 101435, 101447, 113284, 116312, 111934, 96584, 73067, 65201, 74470, 78917, 56977, 44884, 43306, 72926, 79695, 91426, 90640, 77272, 56097, 41180, 46110, 58524, 72776, 58516, 45673, 40821, 54135]
9281E4135j4730K028J2656J471Q690K4656P551K1146K1930L5289M5072L0093n244
9268B44743k0317l479n831q065j6806l375k4048o853J7018m592l450P630M615
9255A77190R281j4171m147l757J353M740j880l916m147Q499j2528l5313j6171
9242A05033j0744j459j0444m089j297k93M341J4568O935J775O432J8679K2595
9229A52032J0844J6162K8745R115m740r4R081J0822L5845L6013L6568L8729J5577
9216C94699K5044K1439J7631O102j8241j9009l9396j4552k5387k9992j8813j6934
9204B82591l0965k8636j4780m024k805j6159J834J8197K068m171K726K046j3388
9191A94534O581m497n025j8846M609L081r945k1320o904O757P201p496n76K9899
$$ y = [54135, 39405, 41433, 54089, 55560, 64250, 88906, 96457, 117603, 139533, 174822, 219894, 249987, 244743, 224426, 220947, 215116, 207051, 190245, 186870, 162822, 155969, 172987, 168395, 164945, 172575, 177190, 186471, 172300, 168153, 164396, 165749, 170489, 168609, 164693, 160546, 169045, 156517, 121204, 105033, 94289, 92830, 82386, 78297, 77000, 76707, 81048, 95616, 102551, 104326, 110758, 129437, 152032, 162876, 179038, 207783, 216898, 212158, 212064, 221145, 231967, 267812, 303825, 340393, 379122, 394699, 419743, 441182, 458813, 464915, 446674, 427665, 388269, 373717, 348330, 318338, 299525, 282591, 251626, 222990, 208210, 204186, 201381, 185222, 187056, 205253, 207321, 203150, 205876, 207922, 194534, 201115, 196618, 191593, 172747, 177356, 180437, 170492, 149172, 142268, 149025, 156226, 148730, 148154, 178053]
9177A78053L5758L0048K1255R314K4313L1463L4712M1043N6201L3862L5735J8974
9165E50731J3875J3491J2133K2939K6689N0437N6645R7434J23380J41168J57787
9154A266709J48222J08648M4824m236n6056j11807j28442j43500j30528j27891
9144H65943j10775r5269p1251o7514m3524m2192k6572l2145k4338o579j3558k3563
9132C08663l745k3181k3601k7167p800j6448j5974L676J5734J1790R431L7215
9120B68593L4351K3788O926r900n8K2539O362K3907M2003L4046M0388N0240P1102
9107F14287J26597K22565L34462L82535K77241M3548k17372l43401l33858k44362
9097H62242j60659j13598r6738q6584m2659k6334l3168m0483l3837j6610j4399
$$ y = [178053, 213811, 243859, 265114, 274428, 298741, 330204, 364916, 405959, 462160, 496022, 531757, 550731, 564606, 578097, 590230, 613169, 639858, 690295, 746940, 844374, 967754, 1108922, 1266709, 1414931, 1523579, 1568403, 1564167, 1508111, 1396304, 1267862, 1124362, 993834, 865943, 755168, 659899, 588648, 521134, 477610, 435418, 408846, 376701, 352363, 345784, 332226, 308663, 304918, 281737, 258136, 230969, 223169, 206721, 190747, 194423, 210157, 221947, 231378, 268593, 302944, 326732, 333658, 323758, 323700, 346239, 352601, 376508, 418511, 452557, 492945, 543185, 614287, 740884, 963449, 1297911, 1680446, 1957687, 2001235, 1783863, 1440462, 1106604, 862242, 701583, 587985, 491247, 404663, 362004, 335670, 302502, 262019, 228182, 211572, 197173]
9086A97173k481j5108j7578K781j6349j2657K072j7011q328J631L137r156j6455
9073I1671q639R314J8054k12K0243J2135J3447K424r04K212L581j1215P745J5016
9059A74872j838j9331j0916j3825k9051o373o796P398N751J6702k111J4049R08
9046A29439j058N122K1216K1072O885j9169n155q313m938m442j009j8564j4922
9033A06164k867j090J9827O964R314o684J4307J2428j6951N43L3474J5982K539
9020A93950K4918J6995j5764p278J1080L8580M8660L2161K6581Q063k6526l4540
9008C16880j8162l0974m5388j4909K9653Q3409N6607k5585o8450n4206l6844j5323
8996A76708j3341j1458J045J6086M092P721Q990j0339j7922p859j4968p9J755
$$ y = [197173, 194692, 179584, 162006, 164787, 148438, 135781, 137853, 120842, 112514, 114145, 117282, 108126, 91671, 83032, 92346, 110400, 110188, 130431, 142566, 156013, 158437, 157533, 159745, 163326, 152111, 159856, 174872, 173034, 153703, 142787, 128962, 99911, 93538, 86742, 94140, 99891, 116593, 114482, 128531, 129439, 128381, 133503, 154719, 175791, 182676, 163507, 158352, 150039, 145101, 140659, 139650, 121086, 106164, 103297, 102207, 122034, 128998, 138312, 131628, 145935, 158363, 141412, 141955, 175429, 191411, 193950, 218868, 235863, 220099, 212821, 223901, 262481, 311141, 343302, 369883, 377946, 351420, 316880, 298718, 267744, 222356, 207447, 237100, 320509, 377116, 351531, 283081, 228875, 192031, 176708, 163367, 151909, 152954, 169040, 173132, 180853, 189843, 179504, 161582, 153723, 138755, 138676, 140431]
8983A40431j824M439j304n15K4632O557j4827j5829j9341r443j70R915P444l735
8969A26430K72q53p374L83J9451J2727j114J5978j307j667Q115K393j253j4347
8955A57834m0133j1676J950n15j9504j1455m851J8380J8320J6289K2773R845o455
8942A50802L861L251M090K294j5976p378q318O192J4150J5849J3615q42k1968
8929A59622n803k895M251j9018p530j8593l643K1442J4972j4788k460J3831J2129
8916A51517K602J246k3424j2694K4060L0442L8803P2213P0118O2065P5533R0061
8904E82542P2651N6983K9417j9811m1700p6970p1157n2799l5715k6769k3970j1694
8892C81008p866p757j0036q144J0359j4613j5631j1027J9339L1095M2401M4491
$$ y = [140431, 138607, 143046, 141742, 141227, 165859, 172416, 157589, 141760, 122419, 112976, 112806, 122721, 130165, 126430, 126702, 125849, 118475, 118858, 138309, 151036, 149922, 165900, 164593, 162926, 171041, 173434, 172181, 157834, 117701, 106025, 107975, 107460, 87956, 76501, 71650, 90030, 108350, 124639, 147412, 157257, 150802, 154663, 157914, 162004, 164298, 148322, 140944, 132626, 138818, 152968, 168817, 182432, 181590, 159622, 153819, 150924, 155175, 136157, 128627, 110034, 106391, 127833, 142805, 128017, 125557, 139388, 151517, 154119, 155365, 131941, 119247, 143307, 173749, 212552, 284765, 354883, 416948, 492481, 582542, 655193, 712176, 741593, 721782, 680082, 603112, 531955, 479156, 443441, 416672, 392702, 381008, 373142, 365385, 355349, 347205, 357564, 342951, 327320, 316293, 335632, 366727, 409128, 453619]
8880D53619M6852M3526L1648J7109P888J1686p154j1316q033j5183J6254K1515
8868F08411o099q189Q54K3826M1736M9701M5330N1878Q7230J47525J80310J69872
8856A392385Q6360j0797j05011j58326j57978j23265q7591m3831l9436j5918j243
8845G35349J6944M15j130K2Q058K0278K6685J7163J8828K8440O6044Q9866R3576
8832A120538J05231Q4185M7225K8926J116j128l630p592k8853k7627o739R297
8820A320949j713p29J1509M9579O6780Q2277Q9669R2298Q2906Q0151O9870N3621
8808A997167M506r053N204K6980O4617P3347Q9109R1335R6118Q3055R4583J08998
8796B725966J04778J39347J39065J42630J66587J89689K28421K55704K85625L16360
$$ y = [453619, 500471, 543997, 575645, 592754, 600642, 612328, 605174, 593858, 585825, 570642, 586896, 608411, 602312, 594123, 594977, 618803, 660539, 710240, 755570, 807448, 894678, 1042203, 1222513, 1392385, 1478745, 1467948, 1362937, 1204611, 1046633, 923368, 835777, 791946, 752510, 736592, 735349, 752293, 752708, 751578, 751600, 759658, 779936, 806621, 823784, 842612, 871052, 937096, 1026962, 1120538, 1225769, 1309954, 1357179, 1386105, 1387221, 1386093, 1382463, 1374871, 1346018, 1318391, 1311652, 1320949, 1319236, 1318507, 1330016, 1379595, 1446375, 1528652, 1618321, 1710619, 1793525, 1873676, 1943546, 1997167, 2001673, 1992620, 1997824, 2024804, 2089421, 2162768, 2251877, 2343212, 2439330, 2522385, 2616968, 2725966, 2830744, 2970091, 3109156, 3251786, 3418373, 3608062, 3836483, 4092187, 4377812, 4694172]
8786D694172L40198L57704L80775M28057M76184N10935N45477O00835O72709P70364
8776I777410Q91573J067521J285250J532353J792436K103726K503577K978146
8768B3931992L464463L946384M451348N040469N978136P692366J0504931J4831608
8760G9841697K1305753L1055124M5077614O1917434P0534382N1961066J0478391
8753C72171461l2272737o0903431o4035200n0700952l5626536k4098966j5909021
8746H8624618r807745n247531l211217m065688n858345p390101p511707o475920
8738C9056364n251910m222219l332086k568222j991863j563960j211181r15522
8730A7999401q38442j012474j240875j380883j299326j079220q78884p23217n83875
$$ y = [4694172, 5034370, 5392074, 5772849, 6200906, 6677090, 7188025, 7733502, 8334337, 9007046, 9777410, 10668983, 11736504, 13021754, 14554107, 16346543, 18450269, 20953846, 23931992, 27396455, 31342839, 35794187, 40834656, 46812792, 54505158, 65010089, 79841697, 101147450, 132202574, 177280188, 239197622, 309732004, 361693070, 372171461, 339898724, 278995293, 214960093, 164259141, 128632605, 104533639, 88624618, 78816873, 73569342, 70358125, 66292437, 60434092, 53043991, 45532284, 39056364, 33804454, 29582235, 26250149, 23681927, 21690064, 20126104, 18914923, 17999401, 17160959, 16148485, 14907610, 13526727, 12227401, 11148181, 10269297, 9546080, 8962205]
8721H962205m64813m03521l47919l19962l06100k84949k91626l19003l49179l56368
8711E518765l56096l36873k91254k46987j96385j52445j46017j32910j01017p0993
8701C487788p0247r4091j03737r6495r7379j25726j12971r0036p6928o6505q6033
8690B467640q4037q2141q3847r8786p8963o5467o8815q0792p7947m0618l5981
8679A670246m4715n8719m1828l444J6357L833j9031j872L5206L6217L1086K4665
8667A648001L3594K4050J2729R799j7514j9926n942q68k0795k8313m7973n8347
8655A528495o5641l1852o108j6652j1890r980N40j5413J5228M2284N8047M7343
8643A534401L3937L4951O4691J00822J17069J33547J60160K11659K78870L40891
$$ y = [8962205, 8497392, 8093871, 7745952, 7425990, 7119890, 6834941, 6543315, 6224312, 5875133, 5518765, 5162669, 4825796, 4534542, 4287555, 4091170, 3938725, 3792708, 3659798, 3558781, 3487788, 3417541, 3323450, 3219713, 3123218, 3025839, 2900113, 2787142, 2697106, 2620178, 2553673, 2467640, 2383603, 2301462, 2217615, 2118829, 2039866, 1974399, 1905584, 1824792, 1746845, 1706227, 1670246, 1625531, 1566812, 1524984, 1521540, 1537897, 1541730, 1522699, 1520827, 1556033, 1592250, 1623336, 1648001, 1681595, 1705645, 1718374, 1728173, 1710659, 1690733, 1684791, 1683923, 1663128, 1634815, 1586842, 1528495, 1462854, 1431002, 1424894, 1408242, 1396352, 1386372, 1386912, 1371499, 1386727, 1429011, 1487058, 1534401, 1568338, 1603289, 1667980, 1768802, 1885871, 2019418, 2179578, 2391237, 2670107, 3010998]
8633C010998L74523M05249M42374N28812P15291J031976J503804K289784L617957
8624A3920768N839971Q560030Q442733L378031k115530o495382p203789n261660
8616A9065172l574606k611818j982420j392834r15929o81532o09603o19669n70009
8607F106752m81850l62151k14183m2535J82079M82681Q53134J106598Q86890J72170
8597H689585n60167j055902j141488q75914n66652l65050k40995j72164j46400
8588C564853j40527j35624j22141j09308p2574m6554o0772l0217k0793R708J21885
8577B957936K41195K33936N3746q9231k22203k50097j79636j41233j55495j68633
8567B280285j55911j41977j29879r1213o3304o6911n8174p1835p4940o8984m8785
$$ y = [3010998, 3385521, 3790770, 4233144, 4761956, 5477247, 6509223, 8013027, 10302811, 13920768, 19760739, 28320769, 36763502, 40141533, 38026003, 31530621, 24326832, 19065172, 15490566, 12878748, 10896328, 9503494, 8587565, 7906033, 7296430, 6676761, 6106752, 5624902, 5262751, 5048568, 5006033, 5188112, 5670793, 6523927, 7630525, 8517415, 8689585, 8129418, 7073516, 5932028, 5056114, 4489462, 4124412, 3883417, 3711253, 3564853, 3424326, 3288702, 3166561, 3057253, 2984679, 2938125, 2877353, 2847136, 2826343, 2836051, 2957936, 3199131, 3433067, 3486813, 3397582, 3175379, 2925282, 2745646, 2604413, 2448918, 2280285, 2124374, 1982397, 1852518, 1761305, 1698001, 1631090, 1572916, 1501081, 1426141, 1357157, 1308372]
8556A308372l3237l7998m6814o7550q8065p9196p2926m1778p029J085K182K4970
8544H62016L2639M4299M5253N2120O0932O4187J8100n7611r1397j04167j02769
8533H23602p1177o1444n2283l1836j7332j2363k2516l482j0575k617j673J3299
8521E49603L2709K2280j3645l1598l6603j8086j3896j6886Q834n971j035j5542
8509D60164J651o253n143K3351M2196J0673R433l042r745o000J2736K4405O5964
8496F20390J20686J84695K20646K11529J33817m774j39822k14330k21720j67733
8486G43384j18334p7217n8700n4068l3353k4454k3490o801q60k306j0389o575
8474C26837J4465m77k6279j9220l397n245k571N424k1514q984n610J9972K3153
$$ y = [1308372, 1275135, 1237137, 1190323, 1122773, 1034708, 955512, 882586, 840808, 833779, 834864, 837046, 862016, 894655, 938954, 984207, 1036327, 1097259, 1161446, 1179546, 1121935, 1030538, 926371, 823602, 752425, 690981, 638698, 606862, 589530, 577167, 554651, 551169, 540594, 537977, 536304, 549603, 582312, 604592, 590947, 559349, 522746, 504660, 490764, 473878, 482712, 476741, 475706, 460164, 461815, 455562, 450419, 473770, 515966, 526639, 536072, 533030, 523285, 517285, 530021, 554426, 620390, 741076, 925771, 1146417, 1357946, 1491763, 1486989, 1347167, 1132837, 911117, 743384, 625050, 547833, 489133, 435065, 401712, 377258, 353768, 346967, 346107, 343801, 333412, 326837, 341302, 340825, 314546, 295326, 291929, 286684, 284113, 289537, 268023, 259039, 253429, 273401, 296554]
8461B96554j1050K113R640J0092R118J4525J4435J8804M0485K8025K0402K4886
8449D78029L5594P8486R3113Q4253K4340p1381j05805r3798r5264o8453k8437
8438C30677m3170o719N237j2970m156j0635k1864J690O90L81J63k3060j4331j6109
8424A85824m063K1060J1933j8780K461r597k3011o368p771j0344M97J8778J9563
8411A80182J4259M947K349R49j2227r783n084k082o898L976M007R112j3375j4158
8397A56174q045L2886K0779J0418p531j2316l794k606J355n712j794j3303j2324
8384A54187O657J5940P125n09O023k500K3934Q249J993J0414L4819J8272L428
8371B88032P637O222J504o171r947J3998O700P997L1322L2060K9651N8152Q6769
$$ y = [296554, 285504, 287617, 297257, 307349, 316467, 330992, 345427, 364231, 404716, 432741, 453143, 478029, 513623, 592109, 685222, 769475, 793815, 722434, 616629, 522831, 427567, 359114, 330677, 287507, 280788, 286025, 273055, 268899, 258264, 236400, 238090, 238780, 239161, 239324, 216264, 201933, 185824, 181761, 202821, 214754, 195974, 198435, 188838, 165827, 159459, 151688, 141344, 141841, 160619, 180182, 194441, 199388, 201737, 202686, 190459, 180676, 175592, 173510, 166612, 170588, 174595, 183707, 170332, 156174, 148129, 181015, 201794, 212212, 204681, 192365, 188571, 185965, 187320, 181608, 179814, 166511, 154187, 160844, 176784, 183909, 183400, 189423, 186923, 210857, 219106, 221099, 231513, 266332, 284604, 288032, 295669, 301891, 303395, 297224, 287277, 301275, 307975, 315972, 347294, 379354, 409005, 467157, 553926]
8358E53926J14430J14772J41863J57766J36757J20916J09765O0286r983o6063
8348A434435r8456j32851j41707j27322j10531r5531o7075p2600o3438m6873l1050
8337D47001k6183l1341m3761m2640k2234r539L825k6092j4840j453j3624j1845
8325B07274J642j3180j1093q266j5127r512m710K4900K274m933J93j0029j370
8312A58063P876R243l782r887o375P2r815J6j017j8299j6587j8540l781O626K641
8297I6454j4286k4883j896R453L798k914M934K5481J247J3264J7462q334j2710
8284A07070J278J2330K464k166k443K666M319m306J2862m246q310r718L153K675
8270A17628K605l832j552o218j1984j9636k005M840j2175K761o841J948M834J1423
$$ y = [553926, 668356, 783128, 924991, 1082757, 1219514, 1340430, 1450195, 1510481, 1500498, 1434435, 1335979, 1203128, 1061421, 934099, 823568, 728037, 660962, 588362, 524924, 478051, 447001, 420818, 389477, 345716, 303076, 280842, 271303, 275128, 249036, 234196, 232743, 219119, 207274, 208916, 195736, 184643, 176377, 161250, 151738, 147028, 171928, 174202, 169269, 169462, 159433, 158063, 165939, 175182, 171400, 161513, 155138, 155210, 145395, 145411, 144394, 126095, 109508, 90968, 87187, 93813, 96454, 82168, 57285, 55389, 64842, 68640, 65726, 70660, 96141, 97388, 110652, 128114, 119780, 107070, 108348, 120678, 123142, 120976, 118533, 121199, 125518, 121212, 134074, 129828, 121518, 111800, 114953, 117628, 120233, 116401, 114849, 108631, 96647, 77011, 75006, 79846, 67671, 70432, 63591, 65539, 70373, 81796]
8256H1796k288m22j588M346K826K583l41Q387O598P797O871K908k050N318Q402
8241A31143L47n89j0240p077Q030k214Q02K066l519r027q334J0032Q112J1029
8227A30561P785p341K0130J3218K6859K3873R620Q537O615K297M74q031k3512
8214B11085j6948m28m019k5116j5269l71p211j4017k6715K303J0121K470K264
8201A18149J611J190n755J3312N987o651j8705j448J0990L778j935j2934j7597
8188H9992l022o007n616j1376N856Q537j823j613J379J743N60K6010J3600j4274
8174A03946j9468Q000Q760J0619J3624n905q84o842j3822k1734j6419n154J4337
8161F9058R223p33j2972N193K1086J2800O779N909m2j6872o471o988K737o167
$$ y = [81796, 79508, 79086, 77498, 81844, 84670, 87253, 86912, 95299, 101897, 109694, 116565, 119473, 117423, 122741, 131143, 131490, 130901, 120661, 113584, 121614, 119400, 120202, 122268, 118749, 109722, 101388, 111420, 119532, 130561, 138346, 131005, 151135, 164353, 191212, 215085, 224705, 233242, 239857, 242154, 242628, 234597, 211085, 194137, 193709, 189690, 164574, 149305, 148934, 141723, 127706, 100991, 103294, 113415, 115885, 118149, 119760, 120950, 115195, 128507, 134494, 127843, 109138, 107690, 118680, 122458, 120523, 107589, 89992, 86970, 80963, 75347, 63971, 69827, 78364, 76541, 74928, 76307, 78050, 78610, 104620, 118220, 103946, 84478, 92478, 101238, 111857, 125481, 119576, 118692, 111850, 98028, 76294, 59875, 54721, 69058, 78281, 77548, 64576, 69769, 90855, 103655, 110434, 116343, 116301, 99429, 92958, 85970, 88707, 82540]
8147H2540K111R170J654J174j0622k900M223M208J9967J0303k863j4348j8289
8134H6328P350R934R617K5022L8754N539K165K1391L6384K5252L9026N5485N9910
8121D22157O6743R1036J40586J56605J31206J03939M5352j5933p4383j30609j45100
8110G91599j42975j25498q9303m3011k4623k8321r446o3k268J3945P496r054k9558
8097C08920l4679k5389j2876j1697j2953p051P616j1999j8516K349K8737K0974
8085B33436L0331M2205P494K159J5849L1570K0609L7044O0357P2207J33128J87337
8073H73726K70715L30699L40629K71367R2830j03012k70123l15606l18190k53722
8063I19313j73127j02063p2671m9893l9111j5764j1733k3287j5855j7126l4070
$$ y = [82540, 84651, 93821, 95475, 96649, 86027, 83127, 87350, 91558, 111525, 121828, 118965, 104617, 86328, 93678, 103612, 113229, 138251, 177005, 182544, 184709, 206100, 242484, 267736, 306762, 362247, 422157, 488900, 579936, 720522, 877127, 1008333, 1112272, 1157624, 1141691, 1067308, 936699, 791599, 648624, 523126, 433823, 390812, 366189, 337868, 328422, 328359, 326091, 340036, 347532, 338478, 308920, 274241, 248852, 235976, 224279, 211326, 204275, 211891, 199892, 181376, 183725, 212462, 233436, 263767, 305972, 313466, 315625, 331474, 363044, 383653, 420697, 481054, 553261, 686389, 873726, 1144441, 1475140, 1815769, 2087136, 2179966, 2076954, 1806831, 1491225, 1173035, 919313, 746186, 644123, 571452, 521559, 482448, 466684, 454951, 431664, 415809, 398683, 364613]
8052C64613l0347j1121j3349l2752j8634j1586o668M341r43j2929j2291p88r695
8039B07851N431J0787J998O062O002J1905K4826K9551L5507M8021N6800Q3708
8027E28449R3752J02508R1016P1944K5496l5013o9355q0506q4285q1353q3642
8016D79011o3830m7871k3773j4081l1246k4511l760j4569l808J1884k47j222n944
8003B56033o784j6433o632j5759j8130n242L12J8299m033N787P100N073k8258
7990A91333j8374L280j0415O734n09R901P325p897J3877M260k45P439J2711m319
7976B15101r244j648m090j1271p097P090n16%N39k928R493K8296R485n996n930
7961B21284k620N447L487J7766J3548q946j3314j6205Q359L858q778J0291J0577
$$ y = [364613, 334266, 323145, 309796, 277044, 258410, 246824, 240156, 244497, 243554, 230625, 218334, 217546, 207851, 213282, 224069, 226067, 232129, 238131, 250036, 274862, 304413, 339920, 387941, 444741, 528449, 622201, 724709, 815725, 887669, 913165, 878152, 808797, 728291, 644006, 562653, 479011, 415181, 367310, 343537, 329456, 298210, 273699, 269939, 255370, 251562, 263446, 263199, 261977, 256033, 249249, 232816, 226184, 210425, 192295, 187053, 187365, 205664, 201631, 207418, 214518, 219591, 191333, 172959, 176239, 165824, 172558, 172049, 181950, 189275, 181378, 195255, 199515, 199270, 206709, 219420, 215101, 205857, 204209, 200119, 188848, 181751, 188841, 188325, 188325, 188864, 185936, 195429, 223725, 233210, 227214, 221284, 218664, 224111, 227598, 245364, 258912, 249966, 236652, 220447, 228806, 232664, 223886, 234177, 244754]
7948B44754r820j0126j6838j4952q07j5234o445K2650K9348J3092j7250j4394
7936B03978N804Q006p034j7201O420J1811J939j3815j0475Q869J1410j138j5969
7923A92605J51J2277J0317k00O649N723j133j09j2416j425n544k8152j0845j977
7909A65921j3334m666N166J0913j2342j0979j850p615j3136n88L551n170O507
7896A22378M399r853O321l355O665O151M704M31J1169L146k2036q566J5976p248
7882A30282l3489k3057k707K0217J8546K963R567J3238P728j2126k8032j1429
7870I1701m347Q660Q151n186P08O972j1287n454j2323Q010J3298N184p075j6556
7856H0456m035Q574J3221J523k5215l357O561j9632n77J5049m870j5229M030k213
$$ y = [244754, 234934, 224808, 207970, 193018, 192211, 176977, 170532, 193182, 222530, 235622, 218372, 203978, 209782, 217788, 210754, 193553, 199973, 211784, 213723, 199908, 189433, 198302, 209712, 208574, 192605, 192756, 205033, 215350, 215150, 221799, 227522, 226389, 226280, 213864, 212439, 206895, 178743, 167898, 165921, 152587, 147921, 153087, 164000, 151658, 140679, 138829, 131214, 118078, 117490, 121041, 115871, 122378, 126777, 116924, 123245, 119890, 126555, 132706, 137410, 137841, 149010, 152156, 130120, 121554, 137530, 130282, 96793, 73736, 71029, 91246, 109792, 112755, 122322, 135560, 143288, 131162, 103130, 91701, 87354, 96014, 104165, 98979, 99687, 106659, 95372, 89918, 77595, 85605, 98903, 104087, 97012, 80456, 76421, 84995, 98216, 99739, 74524, 71167, 77728, 58096, 57519, 72568, 67698, 52469, 56499, 54286]
7842E4286q035Q030M736o459n36k746J162p218m049N259O966J2957j0582K97j695
7827E2373J7146J8491R1J0251k979j7029j0533J178p403M771m068q905n139R078
7813E7323K699k1477n598N379o491O236J8539n043q382j7918K076N621k090l389
7799B7485N976J1723J699l924J6434J349j5853j2511J1238J77J772k1895o213
7786A7457p83J7475j527J037Q49n508O263P513o992p750j2798k420J2764n048
7772B0532j4900J0855O753J3727L55L15J398l685L729J2125P132n035p465J000
7758D6836j1483N045l237o673j0441NO225L928K311L45L039p854O034k742j2885
7743A8453n861j1373o863j767R587n216m123K062J1255M956l300k344J8709M232
$$ y = [54286, 46251, 54281, 59017, 52558, 52022, 49276, 50438, 43220, 39171, 44430, 51396, 64353, 53771, 54068, 52373, 69519, 88010, 88101, 98352, 95373, 78344, 67811, 68989, 61586, 66357, 62289, 53384, 48245, 57323, 60022, 38545, 32947, 38326, 31835, 38071, 56610, 51567, 43185, 25267, 27343, 32964, 30874, 27485, 33461, 45184, 46883, 42959, 59393, 60742, 44889, 32378, 43616, 43793, 45565, 23670, 17457, 16674, 34149, 32622, 33659, 34508, 29000, 35263, 42776, 35784, 28034, 15236, 12816, 25580, 20532, 5632, 16487, 23240, 36967, 37322, 37637, 39035, 35350, 39079, 51204, 58336, 53301, 45836, 46836, 35353, 40398, 37161, 30488, 20047, 20052, 26277, 30205, 32516, 32861, 35900, 28046, 34080, 31338, 18453, 12592, 1219, -5644, -7411, 2176, -3040, -7163, -5101, 6154, 11110, 7810, 5466, 24175, 28407]
7729B8407K37J2460m598j5269o201o037l243R142J8996r663q402J348K558l998
7715A5737o787P19Q534P889J5040L986Q282r163o739k60j326O88L669O026j1888
7700C4407j9103L21J0437J2500l407q004m748j8938K351J4128J5001J2418j6517
7687C0846j6730M006N038k79O404j294j170K889O661J3083j1602n915L862J1233
7673D7032Q12m084p458l251R070q884j7828m237J3316k733j248j1524r703m25
7659a145J1897M90j989p436k275J2316Q062j3286m299l145P290J1898K440j821
7645A8997n323o413N612J6406l734k67k4463j9282R644J0933Q972o002J0764J1711
7631B7555R38M357J3820O452j1421j9704k354J0367P160P664j4496j6230o897
$$ y = [28407, 28644, 41104, 36506, 21237, 15036, 8999, 5756, 14898, 33894, 24231, 15829, 17177, 19735, 15737, 8950, 9669, 18203, 26092, 41132, 45118, 53400, 44237, 37498, 37238, 35912, 36600, 40269, 46295, 34407, 15304, 15625, 26062, 38562, 35155, 27151, 22403, 3465, 5816, 19944, 34945, 47363, 30846, 14116, 18122, 23160, 22881, 29285, 27991, 26821, 29710, 36371, 49454, 37852, 31937, 35799, 47032, 47844, 43760, 36302, 33051, 42121, 33237, 15409, 11172, 24488, 21755, 20507, 8983, -720, -1145, 10752, 11242, 9253, 1817, -458, 11858, 19920, 6634, 2335, -810, 6480, 18378, 20818, 18997, 13674, 7261, 12873, 29279, 25545, 25278, 815, -18467, -8823, 2110, 11082, 5080, 15844, 27555, 28493, 32850, 46670, 53122, 41701, 21997, 19643, 30010, 37170, 44834, 30338, 14108, 7211]
7618G211J0234R144l762L677m575j272k839j0722L046P546l032M85j8327j0281
7604a3467O553R137J1895M65j5301J2312K4332Q495p192m025j51j3067j5567O68
7590E087P5j1291J1149P432N608m497K612J3556j38N469o979N200P05j2832J3784
7575C4940N776O102P2j9908n450Q562J3123J949L788k930j3739q98J3494N754
7561E0635n32q727p107n684K430J0816r494o372j2786n600J0759J0633J1290p058
7547C3203L556n341p928k70J987o467N051m762J2412J3124M038j1174q921J4682
7533D3190Q576k7611k4036j6702J9806R555p140J2478j2233p742J4307P420k8461
7520h593j3906K3268J1116l154p304q155l071N013J384k964q523o406M925L555
$$ y = [7211, 17445, 26589, 22827, 26504, 21929, 20657, 17818, 7096, 10142, 17688, 14656, 15141, -3186, -13467, -6914, 2223, 14118, 14583, -718, 11594, 35926, 44421, 37229, 33204, 33053, 19986, 4419, 5087, 5162, -6129, 5020, 12452, 18060, 13563, 16175, 29731, 29593, 35062, 28083, 33283, 33988, 21156, 34940, 40716, 46818, 46890, 26982, 21532, 30094, 43217, 45166, 48954, 46024, 32285, 31387, 44881, 50635, 50103, 41376, 34269, 28585, 31015, 41831, 32337, 25965, 13179, 7579, 18338, 28971, 40261, 33203, 36759, 31418, 23490, 23220, 25207, 18740, 23791, 19029, 31441, 44565, 48603, 37429, 28508, 43190, 51766, 24155, 119, -16583, 3223, 12778, 5638, 18116, 5883, -1859, 12448, 19868, -8593, -22499, 769, 11885, 8731, 1427, -6728, -9799, -4786, -3402, -6366, -14889, -21295, -16370, -12815]
7506a2815N180K3897J8920Q241j4974j0872J0080M57k233M42P212J457o714j0462
7492A7816q985j4045n164O636Q411J2808R217k852r725j3661k104K859O607J3037
7478B0855p083K758P504o511p552L211j963j410m233M043Q332j5579J1468J4990
7464B8830m318J5194J09K836k396j0831K240p188j1241M512N155r630j2997n23
7450b48l434N932l232r99Q160j170j2507o957J0904K0397Q248r19j7932n958k477
7435b192j6552l269Q881R376R231J1445j0563o501o891o140J0471L1119k406p08
7421B5301J698k32K922P280N876R338j7332q345j0714O308J2321O985K127j3772
7407B9761j1765o577q702R08L735q797j0611R203J0136P235O597j0627n943M051
$$ y = [-12815, -7635, 16262, 35182, 43423, 28449, 17577, 27657, 28114, 25881, 26323, 33535, 34992, 28278, 17816, 8831, -5214, -10378, -3742, 4669, 17477, 26694, 23842, 14117, 456, -1648, 1211, 7818, 20855, 13772, 16530, 24034, 17523, 9971, 13182, 11219, 9809, 5576, 9619, 17951, 2372, 13840, 28830, 24512, 39706, 39815, 42651, 40255, 29424, 31664, 24476, 13235, 17747, 22902, 13272, 275, -248, -3682, 2250, -982, -1981, 6179, 5009, -7498, -14455, -3551, 16846, 25094, 24175, 6243, 285, -2192, -18744, -22013, -13132, -3756, 5475, 16920, 6357, -144, -7035, -13175, -2704, 28415, 26009, 25301, 26999, 26767, 29689, 36969, 42845, 52183, 34851, 26506, 15792, 22100, 34421, 41406, 43533, 29761, 17996, 11419, 2717, 3625, 7360, -1437, -12048, -2845, 7291, 14526, 21123, 10496, 4553, 8604]
7393H604L689j716p178J614l27m856q99N769R714n445j7780K1632l391K98P253
7378A6981l272p785o874j3584n403K5123J5443j1910N693k213j208k937K585L600
7364A4239n27l96j1665o138J1298Q949K930m925m195J0566J4582j0052j1023j7156
7350c513j2169J1936J6725P894j762j4776K0126M821k3661j1395r20J2365J0262
7337A5933J86o779l71o449R600J2426j0149j7247L594J1586J122m571o801J1214
7323A3294r373m844J8191P720j515j716o163K898R08Q168o591o235n44R873P276
7308C1347q875k4312r892K31j5299r681R618J6762l87o877k077L565k112O824
7294a1165J3292K760k721O116K1983o216m720j0050n631j4077K531Q089J5471
$$ y = [8604, 12293, 10577, 3399, 5013, 4686, -170, -1069, 4700, 14414, 8969, -8811, 12821, 9430, 9728, 16981, 13709, 5924, -950, -14534, -19937, 5186, 20629, 8719, 14412, 12199, 10991, 8054, 10639, 14239, 13712, 13316, 1651, -4487, 6811, 15760, 18690, 13765, 9570, 20136, 34718, 24666, 13643, -3513, -15682, -3746, 12979, 20873, 19111, 4335, 24461, 29282, 5621, -5774, -6694, 5671, 15933, 16119, 9340, 8969, 2520, 12120, 24546, 14397, -2850, 744, 12330, 13452, 8881, 2080, 13294, 3921, -923, 17268, 24988, 23473, 21757, 15594, 18492, 19400, 27568, 20977, 14742, 14198, 24071, 31347, 22472, -1840, -11732, -11501, -26800, -36481, -26863, -10101, -10488, -17365, -19442, -15877, -17989, -11165, 2127, 4887, 2166, 8282, 30265, 24049, 19329, 9279, 3648, -10429, -7898, 191, 15662]
7281A5662m260M44j264L455k403j0657m280M860Q049r532q498k923k390N441P387
7266i09j132r772n409Q227R469l295j563m160k440j009M39J6124N134j725o795
7251A184r371o585K1952O695j4582j5923R973O171K88J9939Q754k490j4661r244
7237B100Q481K58j7166j2876J2992Q881Q033O18L0N470J573j068r683l200J157
7222E600J0356L743p441j3235m138j808J3574N117j672j2428j4459M660l618R364
7208f385k638j9720J110J6590M937K612J940j2260p44O261M367O044P993J1210
7194B1317J903j0826o718j772j1774O901M799p433O998l501k3367j0281J9142
7181a4612J1134J1754J6214L069j5380j4192J043K0938Q101N640j7923r493K475
$$ y = [15662, 11402, 11846, 10582, 14037, 11634, 977, -3303, 1557, 9606, 74, -8424, -11347, -13737, -8296, -909, -2041, -11813, -17222, -8995, 474, -2821, -4384, -8544, -10984, -11993, -11554, 4570, 9704, 7979, 1184, -8187, -14772, 7180, 13875, -707, -16630, -6657, -486, -198, 19741, 28495, 26005, 11344, 2100, 10581, 10839, -6327, -19203, -6211, 2670, 10703, 11321, 11351, 16821, 18394, 17326, 7643, 4443, 5600, 15956, 19699, 12258, -977, -5115, -6923, 6651, 11768, 10096, -2332, -16791, -12131, -15749, -6385, -9023, -28743, -27633, -11043, -6106, -3494, -1554, -13814, -14558, -8297, -3930, 2114, 10107, 21317, 23220, 12394, 5676, 3904, -7870, -969, 3830, -3603, 3395, -106, -23473, -33754, -14612, -3478, 8276, 24490, 27559, 12179, -2013, -970, 19968, 28069, 33709, 15786, 6293, 8768]
7168H768J0634O377j0956P53J1443j0917M944R704P191k770j914J2009o417k4
7154C8825l715q982r818j1205j7347o50O683j323K3688Q135j1166j1878r776k787
7140a1316L324J1656q284p278K669n968J1238Q480L167L02N967L078L777o924
7126A3888k397Q971n701J824M655m096p292r556o454J2382j056K678N973K201
7112A6020N901j0662j364J2456M366r068j3045j0285K74j0024J2637P302k039
7099B469j6321n241J2541O847P634J10M17J0758k673n407M192n143N217m804n390
7084E206o922k048J0958k1323q892K3584J0240p886J5583M259l510J8778o930
7071C1097j6981K483m210j6522J7398P941J999o066j6037K203r235k2563O305
$$ y = [8768, 19402, 25779, 14823, 15576, 27019, 16102, 21046, 30750, 37941, 35171, 33257, 45266, 38849, 38825, 35110, 26128, 16310, 5105, -12242, -12892, -6209, -7532, 16156, 24291, 13125, 1247, -8529, -11316, -7992, 3664, -4620, -11898, -9229, -15197, -3959, 4521, 7688, 7990, 13957, 17035, 20812, 13888, 11491, 20462, 14761, 16585, 21240, 17144, 9852, 296, -6158, 6224, 5168, 7846, 13819, 16020, 21921, 11259, 9895, 22351, 26717, 17649, 4604, -5681, -5407, -15431, -2794, 4508, 2469, -13852, -19093, -6552, 295, 7929, 8039, 8456, 19214, 16541, 11134, 15326, 10183, 15400, 10596, 5206, -1716, -3764, 7194, -14129, -23021, 563, 10803, 2917, 18500, 22759, 19249, 38027, 31097, 14116, 16599, 12389, -4133, 13265, 21206, 23205, 17139, 1102, 3305, -5930, -28493, -22188]
7058b2188K1422K0j554J2260l957L320K293n421q152j4745J086N006l814n350
7044a9774N589k863O563J7545n854m602J3325p385m609k448J6924Q403k599j426
7030A6789j5426L574M653j6177j3978J9259Q965k458N199J4516P708j0330R280
7017C1574m574l0689j6400L086R037J0131j09l662K009j6873J060J7331O692l914
7003D699O246N512j3273r659K4466J2777j0490N363J0567K116K326J3553J5777
6990F9980J2215J5991Q503l415j5332j7691j7968M961l967j0144Q588l161o155
6977D2405K7R929J938j8455r487o653j3192j4553O561J9466N971j3180j590J698
6963A0885O207M96j2819K514P938p469M3J8200q487R735J2154j5895j2363j4902
$$ y = [-22188, -766, -746, -2300, 9960, 6003, 9323, 11616, 6195, -1957, -16702, -15616, -10610, -14424, -19774, -14185, -17048, -10485, 7060, 1206, -3396, 9929, 2544, -2065, -4513, 12411, 20814, 18215, 16789, 1363, 4937, 9590, -6587, -20565, -1306, 7659, 5201, 10400, 24916, 32624, 22294, 31574, 27000, -3689, -20089, -17003, -7966, 2165, 2056, -1606, 403, -16470, -15410, 1921, 8613, 4699, 10945, 16457, 3184, -6475, 17991, 30768, 20278, 25641, 36208, 38324, 40650, 54203, 69980, 82195, 98186, 106689, 103274, 87942, 70251, 52283, 57244, 53277, 43133, 51721, 48560, 42405, 42432, 52361, 54299, 35844, 26357, 19704, 6512, -8041, -1480, 17986, 23957, 10777, 9187, 10885, 17092, 17588, 4769, 7283, 15221, 7752, 7795, 25995, 17508, 27243, 39397, 23502, 11139, -3763]
6949c763K676J3140J6817M13o300j4720k759L786j0696n419J0242O952J0692L77
6935B1438k648r213j1084J416O940J6226l086m274o39l086j1749M306J4602j1193
6921G956o696M451J956L310P035n604q394n372j0463r213M667K0418Q571k675
6907I947l776o063J193J2625R17k2144o803M969J5487N236q977r434Q405J3528
6893A5110r992k09J275J9948P64Q576m923j0694j5813Q29k249j425O872j095k0100
6878a3126o273k288P712J3428J0432M125J939l032M717M716R538q245k3432m77
6864b66Q367p451R110j80k951j893k3070L167J6387L954J247j9538J3853R175
6850I911J2186K924n425L738j6034q426J3893Q93j351J49J628O581q618j5114
$$ y = [-3763, -1087, 12053, 28870, 29283, 22983, 8263, 5504, 9290, -1406, -6825, 3417, 10369, 21061, 21438, 18790, 9577, -1507, -91, 6849, 23075, 19989, 15715, 15076, 11990, 241, 4547, 19149, 7956, 1260, 5711, 7667, 10977, 18012, 12408, 4014, -1358, -11821, -21034, -16367, 4051, 12622, 9947, 6171, 108, 1301, 13926, 14843, -7301, -14104, -9135, 6352, 11588, 2611, -6823, 1582, 15110, 5118, 4909, 6184, 26132, 26896, 35472, 30549, 19855, 4042, 4871, 2622, 1197, 8069, 6974, -13126, -19399, -21687, -13975, -547, 9885, 14010, 15949, 12917, 17634, 22350, 31888, 23643, 211, -266, 8101, 650, 9760, 9580, 6629, 4736, -18334, -15167, 1220, 5174, 6421, -13117, 736, 9911, 22097, 25021, 19596, 23334, 7300, -1126, 12767, 13660, 12309, 12458, 14086, 20667, 12049, -3065]
6836c065j0158Q214r14K1193Q568R885M690j1215p888r287j0498j0089Q735j568
6822c397k548Q449N997j8875j7144q014N428J9254M161J640n540J427j570O014
6808d718K1575J0225n791O07Q289K474k2538j6722p889j6539J8013m356q873J9913
6794f330J4248N891j4557k660J1030p010j312O875j993L411L716p792J37J2823
6780A6477J7178m675l073K747q672J2835J5044j0054j2928j3609K494j0763n169
6767b168p733n12J3877P452N854k321j102M88N05J3348k569r379l729J1344J096
6752B4451j3867Q54J4513N147N355O161j4020m945m124O288R733P445P305J2390
6738F2686k088N143J0955J730Q276M633L554K2242K9631N349J3815P986J5316
$$ y = [-3065, -13223, -5009, -5923, 15270, 23838, 33723, 38413, 27198, 19310, 10023, -475, -10564, -1829, -3397, -5945, 2504, 8501, -10374, -27518, -35532, -30104, -10850, -6689, -5049, -10589, -9162, -10732, -4718, 16857, 27082, 21291, 21898, 30187, 32661, 10123, -6599, -14488, -31027, -13014, -17370, -26243, -6330, 7918, 13809, -748, -3408, 7622, 612, -700, 6175, 4182, 7593, 11309, 3517, 3654, 16477, 33655, 28980, 25907, 28654, 19982, 32817, 47861, 37807, 24879, 11270, 13764, 3001, -2168, -9901, -10413, 3464, 10916, 16770, 14449, 13347, 13835, 14340, 27688, 25119, 15740, 12011, 23355, 24451, 10584, 11438, 25951, 31098, 36453, 42614, 28594, 23649, 19525, 25813, 35546, 42991, 50296, 62686, 60598, 65741, 76696, 78426, 86702, 91335, 94889, 117131, 146762, 152111, 165926, 173912, 189228]
6725A89228J5115J6143J1162m628r874l9312l4867l1604k6795l5470j1299j129
6713C6670m921O937L601r247m508o344r86J3736j4884j222J1052r625L17o700
6699A3876j173J6653L318J378R375K183j4042k0440r714Q751J1762j8513j2753
6686i339R522K185O544j955k1620k858J8776L035r6n200L323p807l500K1831J2546
6671B5387J8278j8258j9203q60O111J0342j1281k449k208n02N613J275n996P605
6657A3854j4195m059R378K15j7497M675J1025O946L51j217J1719r714m463j2735
6643e717j0361o403Q847O863q256K727P656p976L777J134r307k523r53j6202J5816
6628b0878J4931j3486j3182n64J2231J0627J360j4505n092k340P083O96M035R577
$$ y = [189228, 204343, 220486, 231648, 227020, 217146, 177834, 142967, 111363, 84568, 49098, 37799, 36670, 31749, 38686, 42287, 33040, 28532, 22188, 21202, 34938, 20054, 18832, 29884, 20259, 20576, 13876, 12703, 29356, 32674, 34052, 43427, 45610, 31568, 11128, 1414, 10165, 21927, 3414, -9339, 183, 2368, 8912, 6957, -14663, -17521, 1255, 4290, 4194, -1006, 2317, -5490, -8990, 12841, 25387, 43665, 25407, 6204, 5344, 11455, 21797, 10516, 8067, 5859, 5357, 10970, 12245, 6249, 13854, -341, -4400, 4978, 5193, -12304, -7629, 3396, 10342, 10693, 9476, 21195, 11481, 7018, -5717, -16078, -22481, -13634, -6771, -15027, -12300, -4644, -12620, -8843, -7709, -17016, -19539, -20492, -36694, -20878, -5947, -19433, -32615, -33179, -20948, -10321, -8961, -23466, -28558, -30898, -23815, -23119, -19084, -9507]
6614i507N183j9178j7J4917N032p475r759J40R470r102L500J3263J4804K634J0438
6599B4343m479o697m679N88j3740p423K296J2043J3620J413j1028J3621J8559
6586C8437J814k2865m681M530P61J1822q837j2311M474j3315q489o62K868k087
6572h541k184L706J4053r063N014J7786j224kJ467M687j0979o192o76o187o821
6557e156J724m634n739N665J4220J0650n050k2753p12K4155J827l90j4772k0809
6543b1774O817M471M004L685j099j4890m064R088K370J2034r196K941j645J4942
6529G684J8719q636o047r000N835O886Q5m925R175K944l152n92k990l877j1452
6514F57m776K774o69m728J3722J3130n53j643J025r093o389K797Q175L221p272
$$ y = [-9507, -4324, -23502, -23519, -8602, -3570, -11045, -20804, -20664, -11194, -20296, -16796, -3533, 11271, 13905, 24343, 19864, 13167, 8488, 9076, -4664, -12087, -9791, 2252, 15872, 17285, 6257, 19878, 38437, 40251, 17386, 12705, 17235, 17996, 29818, 20981, 8670, 13144, -171, -8660, -9322, -6454, -8541, -10725, -7019, 7034, -2029, 2985, 20771, 19547, 19545, 21012, 25699, 14720, 8528, 7852, 1665, -5156, -3432, -8066, -13805, -8140, 6080, 16730, 11680, -11073, -11785, 12370, 14197, 13807, -965, -21774, -14957, -10486, -6482, -2797, -3896, -18786, -22850, -13762, -11392, 642, -8554, -5613, -7258, 7684, 26403, 17767, 11720, 2720, 8555, 15441, 15526, 10601, 19776, 22720, 19568, 18976, 15986, 12109, 657, -4119, -1345, -2014, -6742, 6980, 20110, 19557, 17914, 18939, 9846, 3457, 6254, 14429, 17650, 10378]
6499A0378l2196l476K0619J4315Q571R71r631L592n512K950o977M601L572r438
6485B339R156r395n918O64J3123N45j857M960j1988J54j0143n584J444l021j2662
6470b8183K2039J8753l821q713L230P675N624m953j0262j4076L127L075k392L495
6456e382J1183K0309k535j8529j1250M319j0420M288J2500J1942J4388K912j4291
6443A9434j1401q478J499K366R837m813P836o477J076L72R382j882p440j3655
6429b344M693J4832r501q064n346J6559J4927N654J930j6614j2138p580R869K2061
6415B8938l794j9281M881M521n681k0652J0793N332j2621j7383j0010r92K0385
6402a5564K273J403J940J0475Q989K678O615k127k74J7351n822j7131r993j9657
$$ y = [10378, -21818, -25294, -4675, 9640, 18211, 19182, 9551, 13143, 7631, 10581, 3604, 8205, 11777, 2339, 11495, 2100, -3818, -3154, 9969, 10514, 8657, 13617, 1629, 1783, -8360, -13944, -12500, -15521, -28183, -6144, 12609, 8788, 75, 3305, 10980, 16604, 11651, 1389, -12687, -9560, -6485, -8877, -5382, 5801, 26110, 23575, 5046, -6204, -1885, -12305, -8017, 4483, 16425, 30813, 33725, 19434, 8033, -445, 1054, 3420, 13257, 8444, 16280, 9803, 10879, 11251, 20633, 18751, 11311, -2344, 2349, 17181, 7680, -384, -5730, 10829, 25756, 31410, 33340, 16726, 4588, -2992, 6877, 28938, 25144, 5863, 10744, 15265, 9584, -11068, -275, 5057, -7564, -24947, -34957, -35949, -15564, -13291, -11888, -9948, 527, 9516, 12194, 18809, 16682, 16408, 33759, 27937, 10806, 813, -18844]
6388a8844J7343J4283j150j165o596N584l682k946p137J259K127K74j4663K06
6374a5107P628R319j5179r115P265P538j114j3276n195J8542Q316J1840r918q084
6360f540R362P089j7553M503L31J1388J0302O905j9965j8354o335N589Q892J5231
6346A0845Q6l442J1225k794k240p680Q375M952N891P165n792J416r161M986l93
6331B3439N225j4126p648M018q075m458p154M928J3321J6079J831j8697j6938
6318h255r64Q324p290J939L376k561M738J723j1289J7360n621k3114L169J9213
6304G48K4291Q15q923q391M555l904k4606K815J3002n13P675R528J4078j4712
6290A6458n055j0121N928L437O186J6418O67j4311k463K065q637k246j1255J944
$$ y = [-18844, -1501, 12782, 11632, 10467, 3871, 9455, 5773, 2827, -4310, -3051, -924, -650, -15313, -15107, -7479, 1840, -13339, -22454, -15189, -7651, -8765, -22041, -27236, -8694, -378, 11462, 1544, -6540, 2822, 9911, -7642, -3139, -2808, 8580, 18882, 25787, 5822, -12532, -18867, -13278, -4386, 10845, 10931, 7489, 18714, 15920, 13680, 6000, 14375, 19327, 25218, 32383, 26591, 28007, 18846, 23832, 23439, 28664, 14538, 6890, 10908, 2833, -1625, -8779, -3851, 9470, 25549, 27380, 8683, -8255, -9219, -895, -8185, -6246, -2870, -5431, -693, 1030, -10259, 7101, 1480, -21634, -18465, 748, 25039, 25854, 16931, 8540, 13095, 9191, -15415, -12600, 402, -111, 7564, 17092, 31170, 16458, 11403, 1282, 7210, 10647, 16833, 33251, 33918, 19607, 17144, 19209, 10572, 8326, -2929, -985]
6276i85J1218K915j059k20j3940K781N853j105j1967p313O70j1411P906J0257
6262f400m015O496J8712J1207j2298r702J620j96n422k011l471j0896M826J2678
6248A128M105N53p623m735j302j378r55L385o268J3524p729j0325r991K4091K0059
6233A6539j6035r319P032j3028p072J4102J7789J3897n180m741r326r07R843J2688
6219B6282j8258k4231l153J7125J4347o410o9m428j705M948l653n782k096k639
6205i722P063O183R731N07j0511j463j2866J892r477j054N129J3592K1746m926
6191A5824k6256r36J3358j072R300R412J333J712N800N687j5285j4683j0515K173
6177d148J3485r838m396n513j0677L979J0666M953m501k520j1745J2604N690l403
$$ y = [-985, 10233, 13148, 12089, 11869, -2071, 710, 6563, 5458, -6509, -13822, -13152, -24563, -16657, -6400, -10415, -3919, 14793, 26000, 13702, 4000, 5620, 5424, 2, -2009, -5480, -16376, -11550, 1128, 5233, 5786, -1837, -6572, -7874, -9252, -10207, -6822, -13090, 434, -7295, -17620, -27611, -3520, 16539, 504, -8815, -1783, -14811, -21883, -7781, 10008, 23905, 18725, 13984, 4658, 3751, 13594, 26282, 8024, -16207, -19360, -2235, 12112, 5702, 5633, 1205, -500, 4448, 795, -4987, -7083, -9722, -2659, 3524, 13255, 13762, 3251, 1788, -11078, -9186, -18663, -19717, -14588, -996, 20750, 15824, -10432, -11368, 1990, 918, 10218, 19630, 20963, 22675, 28475, 34162, 18877, 4194, -6321, -4148, 9337, -501, -4897, -10410, -21087, -17108, -6442, -1489, -5990, -8510, -20255, -7651, -1961, -5364]
6163e364r241m844m618K0449J4927o11o60j4321L309J275M52O525k62K516m251
6148E281m233k4368j2896J134J340J2446J8592j696m079K062q454Q271O969m347
6134c978Q216P143O366j4546j6515r946Q638N111l10j7510k994J4982J6964l948
6120b327K93j4501M134M700J1079L010k483o910j1337j0003P527J7804L963j3907
6106h958l243J1323j0483J782Q525R007k44N636K328p574o722j227k703r301J579
6091a0275o31Q049M477N699k995p445P698P934J289j1741j147j2170k0297J2999
6077a8556P802r383L553J6350p10l386R242J8540k351j3103j4232j3805M587j20
6063a5572J7441m753Q365L31o809m883J0688o853P24N374J0996m177Q965j0009
$$ y = [-5364, -14605, -19449, -24067, -3618, 11309, 10698, 10038, -4283, -974, 301, 753, 7278, 7016, 9532, 5281, 1048, -23320, -36216, -35082, -33742, -21296, -2704, -4400, -8479, -6417, -14871, -6600, 369, -3978, 4238, 11381, 17747, 3201, -13314, -23260, -14622, -9511, -9821, -27331, -30325, -15343, 1621, -2327, -2034, -16535, -12401, -7701, 3378, 6388, 3905, -3005, -14342, -24345, -16818, 986, 4949, -8958, -12201, -878, -11361, -9579, -1054, 7953, 7709, 13345, 15673, 8099, 1377, 150, -2553, -11854, -10275, -10906, -2857, 1620, 7319, 4324, -3121, 4577, 12511, 13800, 2059, 912, -11258, -31555, -18556, -10754, -20137, -16584, -234, -944, -4330, 4912, 23452, 21101, 7998, -6234, -20039, -15452, -15572, 1869, -2884, 5481, 5812, -997, -5880, 4808, -2045, -1321, 4053, 15049, 10872, 19837, 9828]
6049I828r101j545r855o720M28R834M202M897J0988l22N082p152p936L529O116
6034A2273k1480j7496K777Q895J2841r282j7782M132P490M261K1727j3013M02
6021d255K2402j1221O90J068q249j2351K297R704L879O600K093J6985K686j9086
6007A3242p915J050J2525k394k6465k5144J5778J8035O098p346n585K0121J7636
5994B9636J4875j0129j6084j6685l707K6167l602k1275j0346J3533l757O528R842
5981A4996j2853j0416M366M717k915J25L473K1555Q788k1280p915o035j628N616
5967E94J2219l291j1673R287J769p125m581O40l735R937K80P463O431l0J527j6634
5951C078j9093N474J4930j522l369J3079P141P604o457j3894j1540j1652k995
$$ y = [9828, 727, -818, -10673, -17393, -16965, -7131, -2929, 1968, 12956, 12634, 17716, 10564, 2628, 6157, 12273, -9207, -26703, -23926, -15031, -2190, -11472, -29254, -25122, -17632, -13371, 8356, -4657, -4255, 18147, 6926, 7616, 8684, 435, -11916, -9619, 85, 3964, 10564, 12657, 29642, 32328, 13242, 5327, 6377, 18902, 16508, -9957, -35101, -19323, -1288, 4810, -2536, -8121, 12000, 29636, 44511, 34382, 18298, 1613, -2094, 24073, 20471, -804, -11150, 2383, -1374, 5154, 14996, 2143, -8273, -3907, 810, -2105, -1980, 1493, 23048, 31836, 10556, 2641, -3394, -5022, 594, 12813, 9522, -2151, 7136, 8905, 1780, -2801, -2161, -5896, 4041, 4321, 11784, 18215, 18185, 19712, 3078, -16015, -10541, 4389, 2867, -502, 12577, 19718, 27322, 20865, 6971, -4569, -16221, -19216]
5938a9216l307k743k270L547J7514L359n431L310K255J488J5190L542m08r147
5924G683j578o578m723K838L008K385m450J6603p47k0376j1225O068N391J0318
5910D617R498q647j3977n277J957K325M222K331m523J131J952O072r727j0274
5896a8320n467R308J6937J4799k428j5394K764J103L022M276j0076O690K355N842
5882A5411M721o974L074j961O138o309q050n224J4247M797N866m026j1795O95
5868A0610N9O200K626M172q123j0570r807P309J8496R812k337j2818q430k068
5854E131q661J5995K61j0276k1836q479j1942j910J942k957j0721L530K3085P875
5840a8963M264K1074n945p166k963n02N906m113N66N026P857J2793j5087J580
$$ y = [-19216, -22523, -25266, -27536, -23989, -6475, -3116, -8547, -5237, -2982, -1494, 13696, 17238, 16830, 7683, 6105, -473, -5196, -2358, 650, 3035, -1415, 15188, 14441, -5935, -17160, -11092, -5701, 4617, 14115, 5468, -8509, -13786, -11829, -9504, -5282, -2951, -7474, -6343, -4391, 1681, -8046, -18320, -23787, -14479, 2458, 17257, 14829, -565, 2199, 3302, 6324, 10600, 524, 7214, 9569, 15411, 20132, 13158, 16232, 14271, 20409, 14100, 6050, 826, 15073, 19870, 25736, 21710, 9915, 10610, 10669, 16869, 19495, 23667, 15544, 4974, -4833, 2476, 20972, 30784, 28447, 15629, 7199, 5131, -3530, 12465, 12726, 2450, -19386, -27865, -39807, -41717, -39775, -42732, -53453, -49923, -26838, -18963, -14699, 6375, 430, -6736, -9699, -10201, -4295, -8408, -7842, -2816, 5041, 17834, 2747, 4327]
5826D327M068j8144p864Q392r192j5338j6848P172R531J0313J4661n771m807j688
5812b1188q6j7943R299P620Q869j667j745J8133m310j873K698M141n207J1545
5798H286J5610J2209r333q816j4002P060q505j58r20m4n777J3582Q25l297P955
5783A4675q67k404j2482p568j601p86r16J4259Q579m321M454m642l228q982l920
5768i750q111k825k994K363l208j547R552r928j132L1759j86q956J2551N460K293
5753A5341n104K0525Q951l463j5458j8852j1368k1712Q695J7898J8301j7045j0916
5740a4207M667j0807m037M685R411P404J1376R021k411j1956M760J1655R621M042
5726C3224j9612j9299P516O03n306k923M449J1212K504K79j4064O371J5039rJ14
$$ y = [4327, 8395, -9749, -17613, -9221, -18413, -33751, -50599, -43427, -33896, -23583, -8922, -14693, -19500, -21188, -21274, -39217, -29918, -22298, -13429, -15096, -16841, 1292, -3018, -4891, -2193, 1948, -3259, 8286, 23896, 36105, 26772, 17956, 3954, 11014, 2509, 2351, 1431, 1387, -4390, 9192, 10017, 6720, 14675, 13808, 11404, -1078, -8646, -10247, -11033, -11949, 2310, 10889, 6568, 11022, 6380, 3152, -5830, -9750, -17861, -20686, -23680, -21317, -24525, -26072, -16520, -26448, -27580, 4179, 3993, -4963, 7588, 13048, 15341, 10237, 30762, 39713, 36250, 20792, 1940, -9428, -31140, -22445, -4547, 13754, -3291, -14207, -9540, -20347, -24384, -19699, -10288, -2884, 8492, 17513, 15102, 3146, 7906, 19561, 29182, 33224, 13612, -5687, 1829, 2432, -2874, -5797, -1348, 9864, 12368, 12647, -1417, 4954, 19993, 19984, 20098]
5711B0098j0993m137K576p557j6174j919k668J1660J6363o64j1340j1637o798
5698b3190J6658J9528o898j2536j3093J1710Q313K720J046j6527j408J9074O783
5685A2180j1772j6885R750R545J472Q078l299r288J4353q06m318k0662M018n639
5671a3273n765P943J4553P387J584j0363j423K58m521Q522M207P72k7845o43L205
5656a5402R448K9352o038r854k424L320k25k028O191J8420N454j0152j4395L553
5642A5220j050j3203N457O252n538o973R380J9470j2311n186n5o492J4888j616
5628A8243J372N152m442q128k0483L312L62J5606o181L461O020j4930j3147n14
5614a4297J5268P444N951O039m013j2174L758p32j1158o517j2504Q546J1084K149
$$ y = [20098, 9105, 4968, 7544, -13, -16187, -18106, -20774, -9114, 7249, 6585, -4755, -16392, -23190, -6532, 12996, 6098, -6438, -19531, -7821, 492, 3212, 4258, -12269, -13677, 5397, 12180, 408, -16477, -6727, 2818, 4290, 12368, 9069, -219, 14134, 13328, 9010, -11652, -7634, -13273, -19038, -11095, 3458, 10845, 12429, 2066, 643, 901, -3620, 4902, 9109, 9881, -17964, -18607, -15402, -5954, 23398, 17360, 7506, 5082, 8402, 8177, 6149, 12340, 30760, 36214, 26062, 11667, 15220, 14170, 967, 6424, 12676, 7138, 165, 9545, 29015, 16704, 11518, 11463, 4971, 19859, 18243, 19615, 24767, 20325, 12197, -8286, -4974, -4612, 10994, 4813, 8274, 14294, -636, -13783, -14297, 971, 8415, 14366, 20405, 16392, 4218, 7976, 7244, -3914, -10431, -22935, -14389, -3305, -1156]
5600a156o252j1876q089R266J8391p795J0966J2973j62J812r84j8223o995r327
5586a7451o179K608P653J0546J3363p551q965K768J827Q755J4873N928j1989j6928
5572g42j13r07M87k138O286j1229j4100J3953M143j8266j1159J0422J2304J5964
5558D905o093l12M758j4110p689j2621J3931J3468O035P526o094O457J2539q405
5544A4295q918j1893p702K652O684P052p45k774M175l991J6772M66r108P619p921
5529F663j0811R673r32m333O001q185J0967Q776l028n522j8920k631K004R610
5515f68n501j5664M341J850j558K298Q604K020j00k355j1187R2J8344J7150p858
5500I808n318r109j1089M45J739r641J7982K5502r652r281J6198N836j9302o558
$$ y = [-1156, -7408, -19284, -27373, -18107, 284, -7511, 3455, 16428, 16266, 18078, 17094, -1129, -8124, -17451, -23630, -21022, -13369, -2823, 10540, 2989, -5976, -3208, -1381, 7374, 22247, 28175, 16186, -742, -855, -1762, -1275, -3413, 2873, -8356, -22456, -8503, -4360, -22626, -33785, -23363, -11059, 4905, -1188, -1500, 3258, -10852, -18541, -31162, -17231, -3763, 2272, 9798, 3704, 10161, 22700, 14295, 5377, -6516, -14218, -11566, -4882, 2170, 1425, -1349, 2826, -1165, 15607, 16073, 6965, 14584, 6663, -4148, 5525, 4593, 260, 6261, -1924, 9043, 17819, 14791, 9269, -9651, -12282, -10278, -668, -6169, -21833, -17492, -15642, -17200, -14902, -6298, -4278, -4378, -6733, -17920, -17828, 516, 17666, 9808, 4490, -4619, -15708, -15263, -13524, -23165, -5183, 20319, 10667, 1386, 17584, 23420, 4118, -2440]
5486b440J357J204J154p303n185o924l985J0002p009K487j615J0399K753l558
5472h663Q495K610n713q828P008o73j8441j2877l722K0977j677k38J1894P750
5458b098P212J687r833q830J7255k113k0259r249K3189P677o820M154N08o47j626
5443B07l175k7954rK2823J4495K216L349O999l234R327j0667j5638o238N232J3291
5428A1024l175l1r322R254J0880q188J079Q020o472R38p511p5R78k884K622m037
5412C100j3582k0718n678K1031M280L296k267O733J8666K442j23j0664k8523L948
5398a8059J1580k555j412N347J878o369j1787O224J5939J0285O170n946k0961
5385i666L610p481J2856R687j3803j0600M697J4117M028j2454l951R151m816J4011
$$ y = [-2440, -1083, 121, 1275, -6028, -11213, -18137, -22122, -12120, -19129, -16642, -18257, -7858, -5105, -8663, -168, 2442, -3271, -12099, -5091, -5764, -24205, -37082, -40804, -19827, -21504, -21742, -9848, -2098, 5114, 6801, -3032, -11862, 5393, 3280, -16979, -26228, -3039, 4638, -2182, 1972, 2480, 1833, 207, -2968, -30922, -30931, -8108, 6387, 8603, 11952, 18951, 15717, 25044, 14377, -1261, -7499, -2267, 11024, 7849, 7818, -1504, 7750, 18630, 10442, 11521, 19541, 13069, 14007, 6496, 6421, 7399, 4515, 7137, 3100, -10482, -31200, -36878, -15847, -11567, -8271, -10538, -3805, 14861, 17303, 17180, 6516, -22007, -18059, -6479, -9034, -10446, -5099, -3221, -9590, -21377, -15153, 786, 11071, 17241, 11295, -9666, -6056, -13537, -681, 9006, -4797, -15397, -10700, 3417, 7445, -5009, -8960, 191, -4625, 9386]
5371I386l32M825Q364L880j4651k1152q682J0578J8358P555P498N22j038j8914
5357F197k2669L199N132n922J230O678J971O645j284q851P074m246r289J4277
5343A42J293J1593N771j1097j0971R719K098m734j1499l95N840J0281R195N848
5329B3084l162o512o738j0785l620K699m923M400J0362N696K63J1883n789k6473
5315i615K0879J3946n554L78j3873j4384J640j2023j2289J305J5974J3004l317
5302c929o604R199L777J0739r093j514J085j5541o361q666r189J363J3380K88
5288b1066o302J245J6424K880o008q293J29J1065J4243q18N797Q902j5179p804
5274d785r371p981j2079n06J8454J1995m669K447P705r447n292m165p783K3458
$$ y = [9386, 9054, 13879, 22243, 26123, 11472, -9680, -18362, -7784, 10574, 18129, 25627, 26149, 25111, 6197, -16472, -13273, -8141, -14063, -12833, -6155, -4184, 2461, 1177, -7674, -600, -4846, -14135, 142, 1435, 13028, 18799, 7702, -3269, 6450, 8548, 3814, -7685, -8080, -2240, 8041, 17236, 23084, 19922, 13410, 6672, -4113, -7733, -5034, -9957, -5557, 4805, 10501, 10764, 22647, 16858, -9615, 11264, 25210, 19656, 20034, 6161, -8223, -6583, -18606, -30895, -29590, -13616, -612, -3929, -10533, -1334, 2443, 13182, 4089, 2575, 3660, -11881, -18242, -26908, -36097, -34734, -21354, -21066, -27368, -26123, -9699, -6819, -12827, -21120, -20991, -9926, 4317, 3499, 9296, 18198, 3019, -4785, -14156, -22137, -34216, -34722, -16268, -4273, -8942, -6495, 1210, -8237, -13529, -17694, -25477, -2019]
5260b019J6664J82N105o934j9657K5l752lj6011j033J7724J1760J291O054K467
5245A1863m081N583n115k827l795l844M63J2959P028j4743m385l427l689J0153
5231B143J7037j210o918j1029j416O873l322O297J261p984p958m657J3279N70
5217B966j2112j811K247J906L640J206o409j7256l730N152J5066J2049Q361J6167
5203B7442O520q163j3902q571J95K01L431J5177J7314Q527k2359k2883j1337O373
5189b035r81o189j8522j242J1684R060P08J0251j1796m260M912P143j1212O102
5175f377O209N713j493m483K352L669j5139r288k429M23J3391L141J7776j2288
5161A177j6407j0837L231J8226O495J492N081n447j1051Nj656K25N685Q502j094
$$ y = [-2019, 14645, 14827, 19932, 12998, -6659, -6634, -10386, -10389, -26400, -27433, -9709, 2051, 3342, 9396, 11863, 7782, 13365, 8250, 5423, 1628, -2216, -1753, 11206, 18234, 3491, -894, -4321, -8010, 2143, 19180, 17970, 11052, 23, -1393, 5480, 2158, 8455, 9716, 1732, -6226, -10883, 2396, 2966, -9146, -10957, -8710, -6804, -3164, -1958, -8367, -25623, -29353, -24201, -9135, 2914, 11275, 27442, 33962, 25799, 11897, 3326, 3521, 3722, 7153, 22330, 39644, 48171, 25812, 2929, -8408, -2035, -3016, -9205, -27727, -28969, -17285, -8225, -7517, 2734, -9062, -13322, -8410, -1267, -12479, -6377, -168, 5545, 4052, -431, 1921, 5590, -9549, -18837, -21266, -20843, -7452, -4311, 13465, 1177, -15230, -26067, -22836, -4610, 1885, 3377, 8458, 3011, -8040, -8035, -9691, -9466, -3781, 4721, 3627]
5146C627j1341n981P234N780M438J5118m325M086o651r440p929j5686n560N28
5132b6102n310o546n283O582J7311J3959Q576K264r811r97R330n886l221K924
5118b210j0872N065R477n397J149J207K959l378o842R466J9381p440q644O298
5104A0219L159N631M930j561M43J993j6114k2803J1476P146O332k2435P962J2147
5090H525n461k328k1687q489J0048M035r014M451R947Q739o299k380R506r05k402
5075c714j0633q640k6408r946J9184J7744J6147L993j838M047L299J6297o233
5062A3299r438q913l742J9428j7591o104m551N686j2849q867K0370M761M719m561
5048h353m138K462Q19m160J0882q5n779L837r84N207J5073K803r058j0059q861
$$ y = [3627, -7714, -13695, -6461, -681, 3757, 18875, 14550, 18636, 11985, 2545, -5384, -21070, -26630, -26102, -31412, -37958, -43241, -36659, -19348, -5389, 3187, 5451, -4360, -5357, 3973, -1913, -5134, -2210, -13082, -8017, 1460, -3937, -2788, -1581, 1378, -2000, -8842, 624, 20005, 12565, 3921, 10219, 13378, 19009, 23939, 22378, 22821, 24814, 8700, -14103, -2627, 4519, 10851, -11584, -3622, 8525, 3064, 736, -20951, -29440, -19392, -15357, -24371, -19920, -9973, -1234, -7533, -9913, -407, -1312, -3714, -14347, -22987, -49395, -59341, -40157, -22413, -6266, -2273, -4111, -64, 3235, 19532, 13299, 3861, -5052, -8794, 10634, -6957, -13061, -17612, -11926, -24775, -33642, -13272, -8511, -3792, -8353, -12491, -10029, -9210, -13370, -2488, -2573, -8352, -4515, -5499, -292, 14781, 17584, 8526, -1533, -10394]
5033a0394J167L91N094m985P343j090p011n541Q101m999J1745K2454O848k6078
5019C045j8403J053N955j018m02R056J1498j197j1005j816M397r753L607j829
5005f812J764K3037O276L096j0822j4143j6544O949J6767K0107N986j4460k1831
4992f30m4n264k755k76p314j5950O874Q144R976L67Q297J1519q647O96n905j5499
4976a6411j4637J438k698o431J7020J0748l745J4770k96l947q683r353n482o759
4962c4466O879J4120J2233K038L008J98n792k252N925J7276Q10j0886k3Q586R114
4947B6768k002m593n717P066Q494j0302L099L815j0539j5233O626m151R287p619
4933D999r953P112k461j439O602R759k092j0096j4040Q602J3218j2317o526k192
$$ y = [-10394, -9227, -8836, -3742, -8727, -1384, -2474, -9485, -15026, -6925, -11924, -179, 22275, 29123, 3045, -15358, -14305, -8350, -9368, -9770, -714, 10784, 9587, -1418, -3234, 1163, -8590, -4983, -6812, -5048, 17989, 24265, 27361, 16539, 2396, -14148, -7199, 9568, 29675, 35661, 21201, -630, -674, -5938, -8693, -8969, -16283, -32233, -25359, -17215, -7239, -6872, 1425, 12944, 4297, 4993, -912, -16411, -31048, -29610, -32308, -38739, -21719, -10971, -14716, 54, -242, -4189, -12872, -22225, -27707, -34466, -27587, -13467, -1234, 804, 3812, 4010, -1782, -4034, 1891, 19167, 19977, 9091, 9068, 17654, 26768, 24766, 20173, 14456, 21522, 30016, 19714, 22813, 26628, 16089, 856, 7482, 3331, 12618, 4999, -4954, 2158, -303, -1742, 4860, 14619, 12527, 2431, -11609, -3007, 10211, -2106, -8632, -10824]
4919a0824P919l994j2905K362J0356P604j523q49l338j6771r894j913J5865Q449
4905i456O432o91K758q848j1015n11Q999m927K016J2023L006l955k1558j1750
4891c7477N111J0219J2918K609K635R19Q307o229J348m868J3082J2194m575J0546
4877B6739o116R0O686j3635p045m238J730r549j8188m534J1517J4574N390R281
4863A2702j352j8491j7026k373M842K7357M368j7239j1087J4904M801j192j469
4850a255o432n670J6424J9445j1943J057J6736j7932j1615l501j0914j9388j4656
4837d9644Q959J3819k434M252L0494M904j2822j829P210M659N597K292k578M266
4823A7145o122j9419j2856k785o909j0081J363J6032J3797M96p793o133p07K0350
$$ y = [-10824, -2905, -6899, -19804, -17442, -7086, 518, -1005, -1854, -5192, -21963, -31857, -33770, -17905, -9456, -3024, -3715, -957, -9805, -20820, -21331, -12332, -17259, -15243, -3220, -214, -4169, -25727, -37477, -32366, -22147, -9229, -6620, -3985, -3066, 5241, -988, 360, -4508, 8574, 20768, 16193, 26739, 20623, 20713, 27399, 13764, 6719, 2481, 4211, -5338, -23526, -28060, -16543, -1969, 3421, 12702, 11350, -7141, -24167, -26540, -21698, 5659, 10027, -7212, -18299, -3395, 1406, 214, -1255, -7687, -13357, 3067, 22512, 10569, 11626, 28362, 10430, -1185, -4686, -15600, -34988, -49644, -40685, -26866, -29300, -25048, 5446, 10350, -2472, -4301, 2909, 7568, 13165, 15457, 12879, 17145, 11023, -8396, -21252, -24037, -30946, -41027, -39664, -23632, -9835, -9339, -17132, -23265, -23972, -3622]
4809c622J7577N917o90J058q242l221o989n800n328J0843J3937M293q79J7829
4795C6683K712K24J0862n975r457p119j6741k1829N472J6197j284r656j348K149
4781H90j5775j34R194p87P556Q163M617J1175j279k438j1630l312j2414J650K720
4766a804j4629r190J1704R732p942j1819L890J747L309M728L454J674Q965o868
4752c049j9542m110J868J1650K0630q396k1925L509k311j0192n520J228J3405
4739b2755L991n88R132k217p108O832K3333O287K814k2948j4532j0124R502J3097
4725e284k817k028o984J0235J163J031P050k4958j6408r35J7393j2378J2061K4149
4711A290J9809l751k7689r027N608R799J25K416j496j4386O713N836l757j12J1129
$$ y = [-3622, 13955, 19872, 19182, 20240, 11998, 8777, 1788, -4012, -9340, 1503, 15440, 19733, 18854, 36683, 39395, 39619, 50481, 44506, 35049, 27930, 11189, -10640, -5168, 11029, 9745, 89, -1259, 890, -14885, -15019, -5825, -6612, 944, 9107, 13724, 24899, 23620, 21182, 9552, 6240, -6174, -4524, -1804, -16433, -25623, -13919, -4187, -12129, -23948, -20058, -18311, -15002, -10274, -6820, -5146, 3819, -3049, -22591, -26701, -24833, -13183, 7447, -949, -22874, -19365, -21676, -31868, -37388, -36160, -22755, -18764, -19352, -10220, -12437, -19545, -12713, 10620, 16907, 19721, -3227, -17759, -27883, -18381, -5284, -8101, -10129, -17113, -6878, -5715, -4684, 2366, -22592, -39000, -39935, -22542, -34920, -22859, 1290, 21099, 17348, -10341, -19368, -13760, -3961, -3836, -1420, -2916, -17302, -10589, -4753, -8510, -8622, 2507]
4696B507Q262l240o983J780r178j2909N7J3046J344N586M052n306q514J0922R286
4681A0712j2957L449N138l856k08m373l159n375j5728j455J4078m591O326j28
4667a2127O426j2921J2619j864r394k79K096L914R984Q499O735j070j2104R820
4653A0334M914j9986L881p73p232J6763N982J4115m025q494m059J192M49j4144
4639a083j8286j54l22r687O626O099n404Q395N96Q25k415K475l887j5348P258
4624b4312K960k738n330R819J5761l990j3800k138M975O652R888n912j658l524
4610a3347K673P437j2366m13L583k988m313J0095J1290Q376J69M728n503L574
4596A2995K0737m901j7797j9271j3747M701M186L975P355O883Q997o224n368R71
$$ y = [2507, 10769, 7529, 546, 2326, -6852, -19761, -19704, -6658, -5314, 272, 4324, -982, -9496, 1426, 10712, -2245, 1204, 6342, 2486, 2278, -2095, -5254, -10629, -26357, -27812, -13734, -18325, -11999, -12127, -5701, -18622, -6003, -7867, -17261, -17540, -15444, -11530, -1546, 6953, 13688, 12618, 514, 10334, 15248, -4738, -857, -1630, -8862, 7901, 13883, 27998, 23973, 15479, 11420, 12612, 13061, -1083, -19369, -19523, -19845, -29532, -22906, -16807, -22211, -13816, -13220, -12395, -14810, -12335, -16222, -31570, -24312, -21352, -24090, -29420, -19601, -3840, -7830, -21630, -23768, -18793, -12141, -2253, -8165, -9823, -13347, -10674, -3237, -15603, -16016, -12433, -15421, -19734, -9639, 1651, 10027, 10196, 14924, 9421, 12995, 33732, 28831, 11034, -8237, -21984, -17283, -13097, -9122, -1767, 5116, 14113, 7889, 2521, 3492]
4582C492m683j6759j1275k706J0331J9659J4138j033j107j0080l934J2933p939
4569A037m181N457m843O095M192m920J4084L936k881P518p585l978j590p585J381
4554F137J7012j79q302j049p464L960p542L525J3430J864j0104K193k0804j2459
4540a9782j944r638L475K3601N611k896N045K201M372r664q672L945J56M595m516
4525d111O770m170M439J601r474p6J706n196j135n032r586P669R924N429M91R527
4509H776K780q291p465j970J2719p569j2310j2163P416J421L320N623J5907K019
4495A0213l559J224N520J2520j6579o398O777j9125j781J4464J1947n425j6949
4482g151J1981J8857j5124r867J4267M440j9927L964J2429j8051q48P821n165
$$ y = [3492, -1191, -17950, -29225, -31931, -21600, -1941, 12197, 11164, 10057, -23, -3957, 8976, 1037, -3144, 2313, -2530, 3565, 7757, 2837, 16921, 20857, 17976, 25494, 17909, 13931, 12341, 4756, 6137, 23149, 22970, 14668, 13619, 6155, 10115, 2573, 6098, 19528, 21392, 11288, 13481, -7323, -19782, -21726, -31364, -27889, -4288, 1323, -1573, 3472, 5673, 10045, 381, -8291, -4346, -4190, 405, -4111, 2659, -1511, 2928, 4529, -4945, -5021, -3315, -8511, -9646, -14678, -24264, -16595, -6671, -1242, -751, 8776, 11556, 3265, -4200, -6170, 6549, -1020, -13330, -25493, -18077, -16656, -13336, -7713, 8194, 10213, 6654, 7878, 13398, 25918, 9339, 2941, 9718, -9407, -11188, 3276, 15223, 9798, -7151, 4830, 23687, 8563, -1304, 12963, 17403, -2524, 1440, 13869, -4182, -5030, 2791, -2374]
4469b374M352J2920Q668q862k6588k1905l671K1503J2462m371j0483k651l734
4456b4734J7916J0161K02M328K081l130j2975L275k839Q848P975L140Q471k989
4442A9730K376J03j869L987r646j9603k832O618n428J211J8958j4994k1670O477
4428a6582J1870k612M041K99o831K097L754L009r562q125M286L882J3738K032
4414E296K149L013j1531j805N931l502k581K902m136r173P129O263j3403n567
4400a9015L506L326L181P218p246j0455p515N811J5486K3187R017j2673R363n451
4386A7740k7744k006j3424N789R638J0345M871P674k418j4198j7753l55J9494
4373b347O684j4294J31k561K86K5760Q559j0237j4614k1J1271j5598k706J2378
$$ y = [-2374, 1978, 14898, 23566, 14704, -11884, -33789, -37460, -15957, -3495, -7866, -18349, -21000, -24734, -6818, 3343, 3545, 7873, 9954, 6824, -6151, -2876, -5715, 3133, 11108, 14248, 22719, 19730, 22106, 22209, 20340, 24327, 14681, -4922, -7754, -1136, -6564, -5353, 13605, -1389, -23059, -16582, -4712, -7324, -3283, -2984, -9815, -7718, -3964, -955, -10517, -18642, -14356, -10474, 3264, 5296, 7445, 10458, -1073, -2878, 3053, -449, -3030, -128, -4264, -13437, -6308, -45, -13448, -19015, -15509, -12183, -9002, -1784, -9030, -19485, -27000, -21189, -5703, 17484, 26501, 13828, 23191, 17740, -10004, -12010, -25434, -19645, -10007, 338, 5209, 12883, 10465, -3733, -21486, -21841, -2347, 4337, -9957, -9826, -12387, -12101, 13659, 22218, 11981, -2633, -2654, 8617, -6981, -9687, 2691]
4359B691k0914j2512q649q769J7382L200r010J0057J2524N598K952q956J2O377
4345h017J1258J1883j681p933j1248o936J2288Q267o484j0620J0778J7406l610
4332A5351n302N740L788j3552k4575j3550K317P509Q42p63R46p51K0142L195m930
4317c593j4601k855K47R072O11J4876P5L338K42n969K231O647r098k1040j4024
4302c3841Q563K408k709J6673J1449N978Q321O709j6536j8422j3736P747J3676
4289c720r347O729O937J2445K662j24j3324L859k554q102R463R642j019j0481
4275C066P055P642o710p185o075j1779J5409R277K060j4708j6040R036Q946J1117
4261A1111N25k132N65k182k3269j4213J0967L826m224O58J1266J4990M004o11
$$ y = [2691, -18223, -30735, -39384, -48153, -30771, -27571, -36581, -26524, -14000, -8402, -5450, -14406, -14394, -8017, 3241, 15124, 13443, 5510, -5738, -12674, -386, 7881, 1397, -9223, 1555, 18961, 15351, 10049, 15789, 19577, 6025, -18550, -32100, -29783, -22274, -21432, -22195, -21249, -22000, -1858, 1337, -3593, -18194, -21049, -20802, -11730, -11119, 3757, 3832, 7170, 7412, 1443, 3674, 10321, 1223, -19817, -33841, -25278, -22870, -25579, -8906, 2543, 8521, 16842, 23551, 7015, -11407, -25143, -17396, -3720, -13067, -6338, 599, 13044, 15706, 15582, 2258, 6117, 3563, -4539, 4924, 14566, 13547, 3066, 10121, 17763, 11053, 3868, -2207, -13986, 1423, 10700, 12760, -1948, -17988, -8952, -6, 11111, 11636, 9504, 10069, 7887, -15382, -29595, -18628, -14802, -19026, -18368, -7102, 7888, 11892, 11281]
4247A1281O463N496k0071k662L945j5472j5567J0622R203o632R081Q863R508l311
4233A0747o443p963M071K219j3015q66K04M846J5765k000k14j839m654K00j9025
4218a7967M587j626l158o81J806M080K773P527P090o223p406J935J29J1886O372
4203A1124J1124n954j777m805q614r513j0239j1146J413J6479K182j0086O117
4190a3695O608K650J3072K7471j8284k6480J2131J1275q030j1734j7110m26K0056
4177b496M434M950K352r741n156q845K681J3407l706r180l946L824O736k3215
4163b7901K516J5584j46j0103m239J3222J5874N106N228m698j7154L475J289p695
4149i642J112O731j1715K022R668L843L101k335K700m430r39J691o209P645k113
$$ y = [11281, 17744, 23240, 3169, 507, 4452, -11020, -26587, -15965, -6762, -13394, -4313, 4550, 14058, 10747, 4304, -3659, 412, 2631, -10384, -11250, -11046, -6200, 9565, 7565, 7351, 5512, 858, 1058, -17967, -13380, -15006, -18164, -18845, -17039, -12959, -10186, -2659, 4431, -1792, -9198, -7263, -7134, 4752, 11124, 22248, 16294, 14517, 9712, 1098, -8415, -18654, -29800, -28387, -11908, -9726, -19812, -13695, -7087, -4437, 8635, 36106, 17822, -8658, 3473, 14748, 6718, -5016, -22126, -22552, -2496, 1938, 6888, 9240, -501, -5657, -14502, -11821, 1586, -2120, -11300, -15246, -11422, -4686, -27901, -25385, -9801, -9947, -20050, -24289, -11067, 4807, 9913, 15141, 10443, -6711, -3236, -1947, -9642, -8530, -1799, -13514, -11492, -1824, 2019, 5120, 2785, 5485, 1055, 116, 1807, -4402, 3243, 1130]
4134A130l310j4739l965J7715K825l136O116k192j7347j7451J6451J8492L767
4121D356l593O009k2377n724k912K836J1234O949j133m835J458J5373J0805m885
4107A3561m043n00j3387k3721o003J2734J7248J5658J0022J509j4798j678J8915
4094B5517m405j4542k7908j3408m759J2572Q388n646J566l492L672R552J0817
4081b076r821m621p7L136R26n704l54J2450K15r854J9104M814R949j648r167j1545
4065d273j9753r535J8397N378j1751K0999L3609o500r527p808k671o400p737J1764
4051D192J2146j03J821q610l877j4095k576O285N565l990M146o915J2071m112
4037A948p672K02k056n954j54P774j186L900k033R037Q559k794J741n655P262
$$ y = [1130, -2180, -16919, -20884, -3169, -344, -3480, 2636, 444, -16903, -34354, -17903, 589, 4356, 763, 6772, -15605, -21329, -24241, -21405, -10171, -3222, -4355, -9190, -7732, 7641, 18446, 13561, 9518, 9018, -4369, -28090, -34093, -21359, -4111, 11547, 21569, 23078, 8280, 6602, 25517, 21112, 6570, -21338, -34746, -39505, -26933, -18545, -24191, -22625, -26117, -22445, -12893, -2076, -11897, -16518, -16595, -13459, -12533, -18237, -18591, -6141, -5926, -15780, 3324, 8138, 18087, 16439, 7272, -4273, -24026, -33561, -15164, -9786, -21537, -538, 33071, 26571, 17044, 9236, 6565, 165, -7572, 4192, 16338, 16235, 18056, 9446, 5569, -8526, -11102, -4817, 748, -3242, 904, -6011, 6060, 1948, -5724, -5522, -7578, -13532, -13686, -5912, -7098, -3198, -5231, 3806, 12365, 9571, 11312, 5657, 12919]
4022A2919r887p298r886q748J4058K406L41O34m003p293l255J0040N601p100n720
4007a7191O374J5330j554j0511N409J2240J228Q751m187l554j1368l807j1024
3994a3864o87K318Q473m671l102K8670R500j0894j8958K292l631r30m971o735
3980a7190J982K201Q586J0690r420K434J5791j825o010j2686j6882O509N259Q44
3966i717p198N910J3929J1872j6483j1556N408m685n139j65J6675K891o110Q542
3952D174J30o543o438J442k513q5M747J0856j646n03P381Q030K805j2867k3282
3937a4312o089k986J2345N744p428L418l454o37K073P887N20k940p27j1353j149
3922a9088J4953N170p6J695l94N815p67o280M912J4309o884N152J932j6131j3862
$$ y = [12919, 3032, -4266, -14152, -22900, -8842, -6436, -6095, -5461, -9464, -16757, -20012, -9972, -4371, -11471, -17191, -10817, 4513, 2959, -7552, -2143, 10097, 11325, 20076, 15889, 12335, 967, -2840, -13864, -14551, -12233, -3760, -8431, -11533, 17137, 26637, 15743, -3215, -923, -4554, -5484, -10455, -17190, -15208, -13007, -4421, 6269, -3151, -717, 15074, 13249, 7239, -5447, -22329, -15820, -10561, -9717, -16915, -11005, 2924, 14796, -1687, -13243, -7835, -12520, -17659, -17824, -1149, 1742, -4368, 4174, 4304, -2239, -8677, -7235, -9748, -9833, -5086, 5770, 4124, 3621, 11002, 19032, 21837, 8970, -14312, -20401, -23387, -11042, -5298, -12726, -9308, -12762, -13399, -11326, -3439, -2919, -5859, -6586, -17939, -19088, -4135, 1035, 959, 2654, 2260, 8075, 7308, 1028, 5940, 20249, 13365, 18517, 20449, 4318, -9544]
3907i544Q11Q482J4504r216k0037J470O442R71J6791Kq494l796j190J1391M413
3892A3000n52M492M63j3491r584L093M736P777k741k186o41R229K3150J109j8628
3877A9226k640M445o053p274P356J6691n564q102l998l310M032n175J9479q016
3863B1097k7932j1462Q076K270k896l953Q921Q953m882o010j0683j0220j4905
3850d3626J9557K6360K938N807l39M462j0838o522N226J0105J2035K636J093P462
3836C6356o789l544J631R81P77m201n812l554r154M17J517o00l1p023k0205L762
3820a5472J7195O565J055r853J212J575L380q082P23J8378J3909k4391o730N172
3806D636j0155j3270Q024q449J0557P396p293n737q40J1849l801J4201o014J969
$$ y = [-9544, -8733, -251, 14253, 5037, -15000, -13530, -7088, -6117, 10674, 10676, 2182, -1614, -2804, 8587, 13000, 12448, 16940, 17403, 3912, -5672, -2579, 2157, 9934, 7193, 5007, 4366, 13595, 36745, 37854, 19226, 16586, 21031, 14978, 7704, 15060, 31751, 26187, 18085, 14087, 10777, 14809, 9634, 29113, 21097, -6835, -18297, -10221, -7951, -10847, -14800, -5879, 3074, -1808, -7818, -18501, -28721, -43626, -24069, 2291, 5229, 11036, 10697, 15159, 4321, -2201, 3025, 13130, 25165, 27801, 28894, 36356, 29567, 26023, 27654, 28635, 29412, 25211, 19399, 15845, 6691, 7108, 8625, 8025, 7994, 971, -19234, -15472, 1723, 8288, 9343, -510, 702, 2277, 5657, -2425, -1702, 16676, 30585, 6194, -536, 4636, -5519, -18789, -10765, -19214, -8657, -1261, -8554, -14291, -15131, -3282, -7083, 7118, 1104, 3073]
3792C073J6225j0902J14J613K588o933Q33j14l83j9318j4358p223m791J4433J7041
3777h102O778J5265M258k9626n157Q765J0472k416Q127O984N35o766N919n03q222
3762F311M838k894r746L876J4227K651Q564q434j0020j876j583j5640J246J2609
3748D129P076L341P753j9674M591N736j9174L146p498K659M744J525j229l391
3734f266Q943R887r996m812M588N334j4401P511r523j1800J2440J0109l136o548
3720g670n114L240l051J012P003m326m298R468J048N903k0007m660J1315J3715
3706C578J798Q277K174j0003L219J6597O377k2811k1233j5809k647j844K0204
3693a2123J8984q627o31P963N750j9434j2990M95r219Q68O041k927o78L231K6238
$$ y = [3073, 19298, 8396, 8510, 10123, 12711, 5778, 6611, 6497, 6114, -13204, -27562, -34785, -39576, -25143, -8102, -1324, 13941, 18199, -11427, -16584, -7819, 2653, 237, 8364, 15348, 15883, 9117, 15036, 14533, 6311, 11149, 8255, -1491, 2385, 16612, 19263, 27827, 19393, 9373, 7497, 5914, -9726, -8480, 4129, 11205, 14546, 22299, 2625, 7216, 12952, -6222, -3076, -10574, -7915, -3171, -1646, -2875, -6266, 2677, 12564, 2568, -2244, 2344, 7678, -6723, 788, -8735, -20535, -8095, 2014, -1122, -7670, -12784, -9544, -12595, -11583, -4580, -8906, -13204, -3736, -2688, 3215, -16792, -21452, -10137, 3578, 5376, 13653, 15827, 5824, 9043, 25640, 32017, 9206, -12027, -27836, -30483, -32327, -12123, 6861, -1766, -2397, 5566, 11316, -8118, -21108, -20613, -29832, -28964, -22923, -25850, -26528, -23297, 2941]
3678B941J5434o386j8797J1974q286j0354k311J9294J6459r713l970j052m43r229
3664d439j2577J0733J0407O593R43j6592k60J5781k7039P19R088M819K0014j92
3650A7998n498J678j2263J0002n226k0260r897K0159R930P603l960K82M871j0388
3636E031p221j1148o382q820L722J2262j316J3872J1641O242o849o959P506J3184
3622B4765j443k7113j9747M29P947P411J1200L467Q788J0560p295j9275j0828
3609a1134J1189J2885l125r497k842R466J473N394n566j1667m507J591K1647K150
3595A7457n463n185p355p231j0008N45J0422j666r739j949P385J2925M182J0441
3581A4761q474j9286p088M267r029J8087R11J493K473j407J724L30P945J0624
$$ y = [2941, 18375, 11989, -6808, 5166, -3120, -13474, -15785, 3509, 19968, 10255, 6285, 5233, 4790, -4439, -17016, -6283, 4124, 10717, 11660, -4932, -5192, 10589, -16450, -15731, -6643, -1824, 18190, 17998, 12500, 14178, 1915, 11917, 6691, -13569, -23466, -3307, 6623, 14226, 10266, 10548, 15419, 5031, -2190, -13338, -19720, -28540, -24818, -12556, -13872, 0, 11641, 17883, 11034, 4075, 11581, 24765, 23322, -3791, -23538, -23109, -15162, -7751, 3449, 6916, 15704, 26264, 18969, -306, -11134, 55, 12940, 9815, 318, -2524, 6942, 8415, 13809, 8243, -3424, -7931, -6340, 15307, 17457, 11994, 6809, -546, -7777, -17785, -17240, -6818, -8484, -18223, -20172, -12787, 138, 4320, 14761, 6287, -12999, -20087, -15820, -24849, -6762, -5851, -4358, -1885, -3292, -1568, -1238, 6707, 17331]
3567A7331l563l331J350j9702O312J1251J6932r788j2671j4931L534Q502M173
3554E399j0344q997N423k679L284N29j298m584O187R160q832j729P029l498m423
3539i373j4532o622K861J2548N938k735q878J2362J873Q718J723r37L392m098
3525B240p890P515J5493M272J621p853o816J6687J409N918j0510j6856j3331J1620
3511C519O857J3115j370n43K540R57j8499j1133K060P943P960j5071j1270l42
3497a3277K2673m066k0578r113K1162J3127j3674j6129K3668R738r601j8218m234
3484a8522j0465Q904J3262J9258o160j2235j752k326J0256N637o785N314K385
3471F771j7961o861O230J6813j059j6190n026j270L022L315N306j1661n103j708
$$ y = [17331, 13768, 10437, 11787, -7915, -1603, 9648, 26580, 16792, 4121, -10810, -7276, 1226, 5399, -4945, -13942, -8519, -11198, -7914, -7385, -8683, -13267, -7080, 2080, -6752, -8481, -1452, -4950, -9373, -23905, -30527, -27666, -15118, -9180, -11915, -20793, -8431, -6558, 2160, 3883, 2946, 6338, 2240, -5650, 1865, 17358, 21630, 23251, 15398, 8582, 25269, 26678, 32596, 22086, 5230, -8101, 3519, 10376, 23491, 22121, 21578, 24118, 25075, 6576, -4557, -2497, 5446, 13406, -1665, -12935, -13277, 9396, 5330, -15248, -24361, -3199, 9928, -3746, -19875, 3793, 13531, 3930, -14288, -18522, -28987, -20083, -6821, 12437, 6277, -5958, -7710, -10036, 220, 5857, -928, 4386, 6771, -11190, -18051, -11821, 4992, 3933, -12257, -17283, -18553, -15531, -12216, -6910, -18571, -23674, -25382]
3457b5382m469J2880J2223J8907L495j4816j121j2215l976N602K988J5592L699
3444A3407j4285q901q436l695J4497O300m501j8788L985K312J1743M625l463l100
3430h300N675N93j2710J3437k977k813J0218j632m492M749l529m294j86J4969
3416H708K064o918O49j546m458j994q303q204n114l805J7066J1795M454J481q37
3401E038M775p201j8277p248j3293O282O447m047P835J0711P421m713Q155J5048
3387A6933N535l968M434q627m711p421P041L496o241K170Q909p505j7558L183
3373d330K078r24J5544O9m510r148j5061j8464R000K4164R330k691j1089j0621
3359a6653k73J1389l161J032J2697j4181j7386n162o482L396J0862J2096P091
$$ y = [-25382, -29851, -16971, -4748, 14159, 17654, 2838, 1717, -10498, -14474, -8872, -5884, 9708, 13407, -878, -9779, -18215, -21910, -7413, -1113, -5614, -24402, -20417, -18105, -6362, -1737, -5200, -8300, -2625, -2032, -14742, -1305, -4282, -7095, 3123, 1491, -3001, 1748, -1781, -6075, -6261, 8708, 10772, 3854, 4503, 2957, -1501, -3495, -11798, -20002, -25116, -28921, -11855, -60, 4394, 5875, 5038, 9813, 2612, -15665, -22913, -36206, -29924, -23477, -27524, -19689, -8978, -1557, -6270, 1885, 16933, 22468, 18500, 22934, 14307, 9596, 2175, 9216, 12712, 6471, 8641, 17550, 10045, -7513, -4330, -2252, -3176, 12368, 12437, 7927, -1221, -16282, -34746, -25746, -1582, 7748, 5057, -6032, -16653, -16926, -5537, -8698, -7666, 5031, -9150, -26536, -31698, -38180, -34784, -23922, -11826, -4735]
3346d735J699j1521m765O649M885j1757p588J4521l900K994M927J363M718l933
3332f443n761m657J1930J2029n793j1080j3947J2657K284j0000J816K1974K68
3319E277O007Q424K216r909o517K718n682M744R51k1956m705K0148M023q599p648
3304a0508n214O503J0946N011r7j2499k0528m55J6334O997J017J1536K507q206
3290C344o498N11R293P790j2676n835l693P417K3303r043k6606j886L382o333
3276a7530j6769J769R312K165j957M073R36l418J995M052J2402K168J5769j793
3262A3174p732n043K873L671j8475P098O354J3988R906m066j3694j1972j7797
3249b1715P444Q381M849J2554l157j368L040p129k3136Q236J5157Q040N594r042
$$ y = [-4735, -3036, -14557, -19322, -12673, -7788, -19545, -27133, -12612, -16512, -13518, -8591, -7228, -2510, -6443, -12204, -16861, -4931, 7098, 1305, -9775, -23722, -11065, -8781, -18781, -16965, 5009, 5277, 11284, 19708, 21924, 12015, 5498, 8216, 2534, 7278, 8229, -13727, -18432, 1716, 5739, -2860, -10508, -15722, -9219, 1727, 6738, 6641, -5858, -26386, -26841, -10507, -3510, -2493, 9043, 11550, 3344, -3154, -2643, 6650, 14440, 1764, -4071, -7764, -347, 22956, 13913, -12693, -14579, -11197, -17530, -34299, -32530, -23218, -21053, -23010, -18937, -18001, -21419, -19424, -15372, -2970, -802, 14967, 13174, 5442, 399, 3272, 6943, -11532, -4434, 1920, 15908, 25814, 21748, 8054, -3918, -21715, -14271, -5890, -1041, 11513, 8356, 6988, 10028, 2899, -20237, -12001, 3156, 11196, 16790, 7748]
3235G748j7896n159O817J0729Q895n446j2690p44L713n057R661Q662M534l205
3221A0562o345m39J1601M577J357m657j8700O213k887j3499M245j6631r60K15
3207b5348j0477R649J2448J6269M845p743m888n891j995j102N049M263k31L373
3193a779j7038q939P047k33Q713R35j1721n566R502j289L011L256P891P570J1621
3178A2981o724j6879l611J0765k243k2018k66Q541Q581l794K003n463j7730L776
3164c2081J2756Q998J9636k1390o073P610j229Q363J100j5716m360Q304M074J2182
3150B174P99j1j0543n544Q211J253k443o001N852o508k641j6117O137n497K009
3135b8870Q632O760N535j6877k603L539N868K4342O842p165J646m339m967P276
$$ y = [7748, -10148, -15307, -8490, 2239, 11134, 5688, -7002, -7746, -4033, -9090, 571, 9233, 13767, 10562, 4217, 3778, 15379, 19956, 21313, 16656, -2044, 4169, 1282, -12217, -7972, -24603, -25563, -25348, -35825, -26176, -13728, 2541, 7386, -357, -5245, -11136, -13131, -14233, -9184, -4921, -5152, -1779, -18817, -27756, -20709, -20942, -12229, -11294, -23015, -28581, -19079, -20368, -17357, -14101, -6210, 1360, 12981, 6257, -10622, -14233, -3468, -5711, -27729, -27995, -19454, -10873, -14667, -12664, -18127, -35857, -32081, -19325, -10327, 9309, -12081, -18154, -10544, -11773, -3410, -2310, -18026, -22386, -14082, -10008, 2174, 2973, 2962, -7581, -13125, -4914, -3661, -6104, -12105, -6253, -12761, -15402, -31519, -25382, -30879, -28870, -20238, -13478, -7943, -24820, -27423, -23884, -18016, 6326, 13168, 6003, 7649, 3310, -1657, 5619]
3121E619N897j6086j1776j2028j1782P546J9198J538J994k987M528n63P448o553
3107h007l0J0997L760o217k039J5677L283k2894j0585p593n909O303J656J1143
3093a0455J8744P610m140j496N97M070j473j1856n124k702M066J0083k05N465
3079A3184j005K813R120j6331j2798Q445o341m054p624p773R128J5451Q346L027
3065A3588j596k2753j4164r89P876J9587K712j4226j4562p07J412Q768N686P349
3051b019n214j628K854m610M215Q70J1979P860j3739N20L140k915o683N782r77
3036e65O12j4469J559m954P216M545j0247K266M865p501q43P802m309q046j6721
3021c8790K407J0420R597P223l906O40J1234J2432Q26n278j1081o816Q490K0368
$$ y = [5619, 11516, -4570, -16346, -28374, -40156, -32610, -13412, -11874, -9880, -12867, -8339, -8902, -1454, -8007, -8037, 2960, 6720, 503, -1536, 14141, 17424, -5470, -16055, -23648, -29557, -23254, -21598, -10455, 8289, 15899, 11759, 10263, 10860, 14930, 13457, 1601, -3523, -6225, -2159, 7924, 7719, 13184, 12179, 14992, 24112, 7781, -5017, 3428, -2913, -6967, -14591, -22364, -13236, 2215, 10561, 13588, 11992, -10761, -24925, -25914, -18038, 1549, 4261, -9965, -24527, -25234, -23822, -15054, -9368, -2019, -7233, -8861, -6007, -10617, -6402, -5532, 6447, 14307, 568, 1088, 4228, 1313, -5370, 412, -565, 47, -14422, -12863, -17817, -10601, -6056, -16303, -14037, -9172, -16673, -17516, -9714, -14023, -22069, -38790, -36383, -25963, -16366, -9143, -13049, -12409, -1175, 11257, 12083, 6805, -4276, -11092, -2602, 17766]
3007A7766J2091n728k5787j1564l386r621j9734K175M854j400K412P91J9943J2609
2993d579p952n071R359M042J625k941r575k82J3698L897J3165R85j5940r874Q814
2978f29r183m283N270K383q929J868J4203J2234k587l770J021j249j50k518o253
2963b572Q063K257o045r122m481j1952L169l000M696J3895M163n086r27M024j013
2948c931M295n261j442J5866R490q026j1021j0164M578O564M555m130r859k980
2934a1466J8783m256j6940j3603J5996J4313K952m810j5821j081J858K080L55
2921a1640J9443r076k2534J219J5574K2422q521q144J920o897j6112N090K1167
2908C911M964n883k462l421j0127M000J485J3520j9389r366J9266J3879k50q342
$$ y = [17766, 29857, 24129, -1658, -13222, -16608, -26229, -45963, -43788, -38934, -40334, -37922, -37131, -17188, -4579, -12531, -17602, -8243, -4201, -2576, -5517, -15092, -15374, -1676, 2221, 15386, 16371, 431, -9443, -629, -9812, -14095, -8825, -6442, -15371, -13503, 700, 12934, 10347, 6577, 7598, 6349, 6199, 3681, -2572, 5491, 7748, 1703, -7419, -11900, -23852, -20683, -23683, -18987, -5092, -929, -6015, -6942, -2918, -3931, 364, -4897, -6339, 9527, 19017, 10991, -30, -10194, -5616, 948, 5503, 1373, -8486, -11466, 7317, 3061, -13879, -27482, -11486, 2827, 5779, 969, -14852, -15933, -14075, -11995, -11640, 7803, -1273, -23807, -22588, -7014, 15408, 6887, -1257, 663, -6234, -22346, -17256, 3911, 8875, 2992, 530, -2891, -13018, -9018, -7533, 5987, -13402, -22768, -3502, 10377, 10127, 1785]
2894A785m322m522k132K7462J287k1481j4482M982J6987J9269j0813j7707J4031
2881A0344L156J1490J0032p086q517j9128j3093L658K2888O902J4474j3889j9094
2868B137q9j839j3818R389J0737L407O133M94p707j5480N449Q744p022J5155N984
2853B1674M729o177j2087j4349q107o506K779M90J4237K312r005N052J024Q419
2839D485Q281j2356l401J1206q873k4669o102Q776J5536J887j823N279M11J1447
2825A0084L351j315p081j6183k919O212j83Q588M811k497q707J054P751m807j4613
2810a6454R976J2741Q71j4794k894K061n552J9095J4454r138j6634j2200N620
2797a2848J306O929k829q707J2915o370K317l882P815M237K0425p150j0492K0762
$$ y = [1785, -2537, -7059, -9191, 18271, 19558, -1923, -16405, -11423, 5564, 24833, 14020, -3687, 10344, 13500, 24990, 35022, 27936, 19419, 291, -12802, -9144, 13744, 20646, 35120, 21231, 2137, 2048, 209, -13609, -4220, 6517, 9924, 16057, 16551, 8844, -6636, -1187, 7557, 535, 15690, 21674, 26403, 20226, 8139, -6210, -14317, -20823, -18044, -17554, -3317, -1005, -10010, -4958, -3934, 4485, 12766, 410, -2991, 8215, -658, -25327, -31429, -22653, -7117, -5230, -7053, -1774, -1363, 10084, 13435, 12120, 5039, -11144, -14063, -7851, -8034, 554, 5365, 2868, -5839, -4785, 2966, -1841, -16454, -6478, 6263, 7134, -7660, -10554, -8493, -14045, 5050, 19504, 10366, -6268, -18468, -12848, -11542, -4613, -7442, -16149, -3234, -9604, -7287, -11169, -3354, 883, 21308, 14158, 3666, 24428]
2783B4428J5093j5839l296O885k936r594p117m695P96k1510l972p055J1055K6493
2769H736p692j3660j6779M861J3819O148o715j230K857K305K863J631m627l082
2755a0565M902M691j2427l203K865O870q67j2497O512o301L363j6487J0734J4570
2741g840p736j1267L972L621J3559K567l895J2782J3561r568N748j907j6090k988
2727e481J0959j137j1612j5419R954J091j4432j1334J9258J9967l063K878k791
2714a162K066J3735J898l244m12K883L601n64k874j2608j0309j0604L257O422
2700g915K2330J9842j6248j2809P053O384K590j3674R872l413O82j632l062q796
2686A204J4628n910j8224j5085q970J4977M111j0138j6234j3031N755J1851K84
$$ y = [24428, 39521, 23682, 20386, 27271, 24335, 14741, 7624, 2929, 3725, -17785, -21757, -28812, -17757, 8736, 1044, -12616, -29395, -24534, -10715, -4567, -11282, -12512, -9655, -7350, -4487, -2856, -7483, -10565, -5663, -972, -13399, -16602, -13737, -6867, -7734, -20231, -13719, -20020, -16657, -33144, -22410, -7840, -15576, -26843, -22871, -19250, -5691, -3124, -7019, 5763, 19324, 9756, 15504, 13597, -2493, -5481, 5478, 4341, -7271, -22690, -12736, -11645, -26077, -37411, -18153, 1814, -1249, 1629, -1162, 904, 14639, 16537, 13293, 12881, 15764, 19365, 18801, 15927, 3319, -6990, -17594, -14337, -7915, 14415, 34257, 18009, 5200, 12253, 18637, 21227, 7553, 17425, 14012, 14694, 13062, 10000, 1204, 15832, 9922, -8302, -23387, -32357, -17380, -13269, -23407, -39641, -52672, -46917, -35066, -34782]
2673c4782J1275k42l969L623P939l971m537K1089K3414m947j5672j3122K222R575
2659b105O084O498r52j3825N975M802k279r607r104j7601N799J0922J1233O043
2645A883J594O031l127L02k014n582m56P98J1879K620J179j5143j5157M332N684
2630e177J883j271j5967K200J8801O770j1665J3776J6583O502k7724o250Q035
2617F496p022m048o911p876Q423P34n287K734J9410P792j1180j4470n107Q373
2603g939J598j1769p56J7988K0039L408n693o153J4081l993j5240j7666L356J5159
2589F420J1292j3754j2753J2832Q510O402j0805l108R888N897r560j8118j658
2576h515N032n431P146k168J907J0848J2841L391j1960m445J2753L554n528k2544
$$ y = [-34782, -23507, -23749, -27718, -24095, -16156, -20127, -24664, -3575, 19839, 14892, -780, -13902, -11680, -2105, 3979, 10477, 9525, -4300, 1675, 6477, 4198, -5409, -14513, -32114, -26315, -15393, -4160, 1883, 3477, 9508, 6381, 6683, 4669, -913, -1369, -571, 11308, 13928, 15107, -36, -15193, -10861, -5177, -3294, -4565, -20532, -18332, 469, 7239, -4426, 9350, 25933, 32435, 4711, -1539, 6496, -526, -4574, -11485, -19361, -10938, -10204, -15491, -12757, 6653, 14445, 3265, -11205, -16312, -7939, -6341, -18110, -18866, -878, 19161, 22569, 16876, 10723, 24804, 20811, 5571, -12095, -8739, 6420, 17712, 3958, -8795, 4037, 12547, 18949, 8144, 5036, 14924, 20821, 11261, -6857, -8515, -3483, -8914, -1768, -3936, -2029, 8819, 21660, 25051, 13091, 8646, 21399, 24953, 19425, -3119]
2562c119j2141j420k514P217O129R41r175n436Q171J6316n77p687J874J1276m558
2547E297j6657l354Q00P75n446J1070N100K886l512N035J3663K42q510p523n207
2532e341m844o042j0960O125J3844Q420Q564r58K614p677q795K7717J0510j0564
2518B2613q012j6336m665K565k138J4322r84o635n614r79k816K612j109k984J2126
2503A966J4998J3473j217l2850r155M918P080l251p994N501J5635L580n373o678
2489F33p810O056J2827n90K810n303k6753j708K0847j97k2354K494J7802p986
2475i232k2347j8542Q181P794R239J5972k263j5677Q175K985J5911Q893R221M986
2461B3296n323j5666p253l695P336m299j4888Q499M906j404k6722k3800J3930
$$ y = [-3119, -15260, -16680, -19194, -11977, -5848, -4907, -14082, -19518, -11347, 4969, 4392, -3295, -1421, 9855, 5297, -11360, -14714, -13914, -13139, -18585, -7515, -2415, 471, -3041, 1994, 15657, 15899, 7389, -134, -5341, -10185, -16227, -27187, -21062, -7218, 1202, 9766, 8808, 11422, 3745, -5050, 22667, 33177, 22613, 14601, -1735, -6400, -3835, -5973, 8349, 7365, 730, -4884, -5863, -8679, -6067, -7176, -10160, 1966, 16964, 30437, 29220, -3630, -12785, -7867, -787, -4038, -12032, -6531, 9104, 12684, 7311, 633, -7177, -1121, 11706, 11116, 13926, 8623, -18130, -19838, 1009, 812, -21542, -19048, -1246, -9232, -31579, -50121, -41940, -34146, -24907, -8935, -11198, -26875, -18700, -15715, 196, 9089, 18310, 23296, 17973, 2307, -4946, -8641, -1305, -5604, -20492, -11993, -7087, -8491, -35213, -59013, -45083]
2448d5083K6881K2583J8943J4984j0520j6138r9J5526P006L278q249j0675k014
2435A6423J725r869l049j3512k4347R219J3098J555L679j6482k0748r35J4671
2422b8572K8429J5750j0505k855l75k0358L048J4637O015O464O59j5788L899p70
2408c22k198P460j77K107n64k404r818m100J7179l915L166m05J959j3041j5988
2393b1061l050Q094K2575M302j3410m352p335K703j588n400N458J3957k057k641
2379c805Q366J394J2378l075k22j2583j7146k947m656N298J5700K6604J359j8596
2365H069k443k158k494j503J5319O653j5200k99M317m564j3953j923P087O450
2351C358Q119k951l691j7016n127P41n958Q846N462J1552Q054j2668r294n370
$$ y = [-45083, -18202, 4381, 23324, 38308, 27788, 11650, 11551, 27077, 34083, 37361, 29112, 18437, 16423, 18148, 8279, 5230, -8282, -32629, -23410, -10312, -8757, -5078, -21560, -42308, -43243, -28572, -143, 15607, 5102, 2247, 1872, -18486, -15438, -801, 5214, 11678, 12337, -3451, 448, -322, -2520, 4940, 4763, 6870, 6306, 3902, -5916, -10016, 7163, 3248, 6414, 6009, 7968, -5073, -21061, -24111, -16017, 6558, 10860, -2550, -6902, -14237, -11534, -13122, -18522, -13064, 893, -1164, -3805, 4561, 5955, 18333, 15258, 15036, 2453, -14693, -17640, -22296, -16998, -1298, 25306, 26665, 8069, 5626, 3468, 974, -529, 14790, 21443, 6243, 5944, 10261, 5697, -8256, -10179, -3092, 3358, 11477, 8526, 4835, -12181, -17308, -16567, -22525, -13679, -8217, 3335, 11389, -1279, -10573, -15943]
2337a5943n689J3087J3693Q262k897l064P537O284n188r041j163J030n936N160
2323F132O171J1312o456j195L610r969j5690n464j236L544L061J5008P858k395
$$ y = [-15943, -21632, -8545, 5148, 13410, 10513, 7449, 14986, 21270, 16082, 7041, 5878, 6908, 972, 6132, 12303, 23615, 17159, 15964, 19574, 9605, -6085, -11549, -12785, -9241, -6180, 8828, 16686, 14291]
$$ [...]
##END NTUPLES=NMR SPECTRUM
##END=
