##TITLE=Analysis number 319502
Compound Code cc 34814
Book Reference 458/124/1
Project Code adrs
Chemist Name stevem
##JCAMPDX= 6.0         $$ Bruker NMR JCAMP-DX V2.0
##DATA TYPE= NMR SPECTRUM
##DATA CLASS= NTUPLES
##ORIGIN= Bruker BioSpin GmbH
##OWNER= nmr
$$ XWIN-NMR		Version 3.5
$$ Wed May 17 11:26:41 2006 GMT Daylight Time (UT+1h)  MAYBRIDGE\nmr@NMR_250MHZ
##.OBSERVE FREQUENCY= 250.131544655141
##.OBSERVE NUCLEUS= ^1H
##.ACQUISITION MODE= SIMULTANEOUS (DQD)
##.ACQUISITION SCHEME= undefined
##.AVERAGES= 16
##.DIGITISER RES= 18
##SPECTROMETER/DATA SYSTEM= dpx250
##.PULSE SEQUENCE= zg30
##.SOLVENT NAME= CDCl3
##.SHIFT REFERENCE= (INTERNAL, CDCl3, 0, 16.522)
##AUDIT TRAIL= $$ (NUMBER, WHEN, WHO, WHERE, WHAT)
$$ ##TITLE= Audit trail, XWIN-NMR		Version 3.5
$$ ##JCAMPDX= 5.01
$$ ##ORIGIN= Bruker BioSpin GmbH
$$ ##OWNER= nmr
$$ C:\u/data/dgb/nmr/ADRS/4580/pdata/1/auditp.txt
$$ ##AUDIT TRAIL=  $$ (NUMBER, WHEN, WHO, WHERE, WHAT)
(   1,<2006-05-17 11:26:19.90 +100>,<MAYBRIDGE\nmr>,<NMR_250MHZ>,
      <created by zg, POWCHK disabled, PULCHK disabled
       configuration hash MD5:
       84 BC 41 DB A1 6E 1D 46 DA 25 12 A5 C1 ED C5 3A
       data hash MD5: 64K
       FA FC 48 A5 46 91 B3 E3 8B EC A0 2E 09 25 E0 ED>)
(   2,<2006-05-17 11:26:34.56 +100>,<MAYBRIDGE\nmr>,<NMR_250MHZ>,
      <Start of raw data processing
       ef LB = 0.3 FT_mod = 6 PKNL = 1 SI = 32K 
       data hash MD5: 32K
       61 7E F2 92 B4 54 D6 00 4D 35 9A B2 03 54 42 5C>)
(   3,<2006-05-17 11:26:36.21 +100>,<MAYBRIDGE\nmr>,<NMR_250MHZ>,
      <apk 
       data hash MD5: 32K
       E7 42 F3 4E 18 C0 B9 88 AA 1C A2 68 C5 4A 9B 13>)
(   4,<2006-05-17 11:26:36.99 +100>,<MAYBRIDGE\nmr>,<NMR_250MHZ>,
      <abs ABSG = 5 
       data hash MD5: 32K
       B6 98 D2 4C AA F6 2C 41 64 00 E5 3E A5 48 77 7A>)
$$ ##END=
$$ 
$$ hash MD5
$$ C8 F5 ED 61 8E 33 B6 D7 3F C6 F3 9A 02 E6 47 3A
##$RELAX= 
##$RELAX= 
##$RELAX= 
##$RELAX= 
##$RELAX= 
##$RELAX= 
##$RELAX= 
$$ Bruker specific parameters
$$ --------------------------
##$DU= <C:\u>
##$EXPNO= 4580
##$NAME= <ADRS>
##$PROCNO= 1
##$TYPE= <nmr>
##$USER= <dgb>
##$AMP= (0..31)
100 100 100 100 100 100 100 100 100 100 100 100 100 100 100 100 100 100 
100 100 100 100 100 100 100 100 100 100 100 100 100 100 
##$AQSEQ= 0
##$AQ_mod= 3
##$AUNM= <au_zg>
##$AUTOPOS= <18 >
##$BF1= 250.13
##$BF2= 250.13
##$BF3= 250.13
##$BF4= 250.13
##$BF5= 500.13
##$BF6= 500.13
##$BF7= 500.13
##$BF8= 500.13
##$BYTORDA= 1
##$CFDGTYP= 0
##$CFRGTYP= 5
##$CHEMSTR= <none>
##$CNST= (0..31)
1 1 145 1 1 1 1 1 1 1 1 1 1 1 1 1 1 1 1 1 1 1 1 1 1 1 1 1 1 1 1 1 
##$CPDPRG= <>
##$CPDPRG1= <>
##$CPDPRG2= <>
##$CPDPRG3= <>
##$CPDPRG4= <mlev>
##$CPDPRG5= <mlev>
##$CPDPRG6= <mlev>
##$CPDPRG7= <mlev>
##$CPDPRG8= <mlev>
##$CPDPRGB= <>
##$CPDPRGT= <>
##$D= (0..31)
0 1 0 0 0 0 0 0 0 0.06 0 0 0 0 0 0 0.0002 0 0 0 0 0 0 0 0 0 0 0 0 0 0 
0 
##$DATE= 1147861578
##$DBL= (0..7)
120 120 120 120 120 120 120 120 
##$DBP= (0..7)
150 150 150 150 150 150 150 150 
##$DBP07= 0
##$DBPNAM0= <>
##$DBPNAM1= <>
$$ [...]
##$SUBNAM7= <"">
##$SUBNAM8= <"">
##$SUBNAM9= <"">
##$SW= 20.6930455092707
##$SWIBOX= (0..15)
0 0 3 0 0 0 0 0 0 0 0 0 0 0 0 0 
##$SW_h= 5175.983436853
##$TD= 65536
##$TD0= 1
##$TE= 296.16
##$TE2= 300
##$TE3= 300
##$TEG= 300
##$TL= (0..7)
0 120 120 120 120 120 120 120 
##$TP= (0..7)
150 150 150 150 150 150 150 150 
##$TP07= 0
##$TPNAME0= <>
##$TPNAME1= <>
##$TPNAME2= <>
##$TPNAME3= <>
##$TPNAME4= <>
##$TPNAME5= <>
##$TPNAME6= <>
##$TPNAME7= <>
##$TPOAL= (0..7)
0.5 0.5 0.5 0.5 0.5 0.5 0.5 0.5 
##$TPOFFS= (0..7)
0 0 0 0 0 0 0 0 
##$TUNHIN= 0
##$TUNHOUT= 0
##$TUNXOUT= 0
##$USERA1= <user>
##$USERA2= <user>
##$USERA3= <user>
##$USERA4= <user>
##$USERA5= <user>
##$V9= 5
##$VALIST= <valist>
##$VCLIST= <CCCCCCCCCCCCCCC>
##$VD= 0
##$VDLIST= <DDDDDDDDDDDDDDD>
##$VPLIST= <PPPPPPPPPPPPPPP>
##$VTLIST= <TTTTTTTTTTTTTTT>
##$WBST= 1024
##$WBSW= 4
##$XGAIN= (0..3)
0 0 0 0 
##$XL= 0
##$YL= 0
##$YMAX_a= 331735
##$YMIN_a= -482829
##$ZGOPTNS= <>
##$ZL1= 120
##$ZL2= 120
##$ZL3= 120
##$ZL4= 120
##$ABSF1= 16.522
##$ABSF2= -4.171173
##$ABSG= 5
##$ABSL= 3
##$ALPHA= 0
##$AQORDER= 0
##$ASSFAC= 0
##$ASSFACI= 0
##$ASSFACX= 0
##$ASSWID= 0
##$AUNMP= <proc_1d>
##$AZFE= 0.1
##$AZFW= 0.1
##$BCFW= 0
##$BC_mod= 0
##$BYTORDP= 0
##$COROFFS= 0
##$CY= 12.5
##$DATMOD= 1
##$DC= 0
##$DFILT= <>
##$DTYPP= 0
##$F1P= 14.0000005364418
##$F2P= -0.99999901652339
##$FCOR= 0.5
##$FTSIZE= 32768
##$FT_mod= 6
##$GAMMA= 0
##$GB= 0
##$INTBC= 1
##$INTSCL= 1
##$ISEN= 128
##$LB= 0.3
##$LEV0= 0
##$LPBIN= 0
##$MAXI= 10000
##$MC2= 0
##$MEAN= 0
##$ME_mod= 0
##$MI= 0
##$NCOEF= 0
##$NC_proc= -3
##$NLEV= 6
##$NOISF1= 0
##$NOISF2= 0
##$NSP= 0
##$NTH_PI= 0
##$NZP= 0
##$OFFSET= 16.522
##$PC= 1
##$PHC0= 170.9605
##$PHC1= 6.096021
##$PH_mod= 1
##$PKNL= yes
##$PPARMOD= 0
##$PSCAL= 4
##$PSIGN= 0
##$REVERSE= no
##$SF= 250.13
##$SI= 32768
##$SIGF1= 0
##$SIGF2= 0
##$SINO= 400
##$SIOLD= 32768
##$SREGLST= <1H.CDCl3>
##$SSB= 0
##$STSI= 32768
##$STSR= 0
##$SW_p= 5175.98343685301
##$SYMM= 0
##$S_DEV= 0
##$TDeff= 65536
##$TDoff= 0
##$TI= <Analysis number 999999
Compound Code 99
Book Reference 9
Project Code 9>
##$TILT= no
##$TM1= 0
##$TM2= 0
##$TOPLEV= 0
##$USERP1= <user>
##$USERP2= <user>
##$USERP3= <user>
##$USERP4= <user>
##$USERP5= <user>
##$WDW= 1
##$XDIM= 32768
##$YMAX_p= 463257429
##$YMIN_p= -225605
$$ End of Bruker specific parameters
$$ ---------------------------------
##NTUPLES= NMR SPECTRUM
##VAR_NAME=  FREQUENCY,     SPECTRUM/REAL,   SPECTRUM/IMAG
##SYMBOL=    X,             R,               I
##VAR_TYPE=  INDEPENDENT,   DEPENDENT,       DEPENDENT
##VAR_FORM=  AFFN,          ASDF,            ASDF
##VAR_DIM=   32768,         32768,           32768
##UNITS=     HZ,            ARBITRARY UNITS, ARBITRARY UNITS
##FACTOR=    0.157963299565203, 1,           1
##FIRST=     4132.6476996994, 0,             0
##LAST=      -1043.33573715361, 0,           0
##MIN=       -1043.33573715361, -225605,     0
##MAX=       4132.6476996994, 463257429,     0
$$ Real data points
##PAGE= N=1
##DATA TABLE= (X++(R..R)), XYDATA
$$ [...]
16425a705K4350K9007j3316k036r6965o8046r148J02371J3689j4960J6054K432
16413a8273m962m6091j7110O614N4914J3489q410l4462O0967K5957k1942o0399
16401d9708k4027k1113N5182Q0667m2993j5664L4651n9499N536M2213J33n2123
16389d6745N0709k1018O5522n525k4636p0863j1999L9464m0725m0969j2659M0962
16377g8482J1537k3190N3912N7194L0296j8496K494j4312q252K915k75N795K488
16364B3624n4703M3631L244j3974m3285m1915K2314L7646j414l3248K3727k4969
16352e9322R696K0394j1531J7091j5260k149J7629m6006q2930l5515O8045J8631
16340a01227K2931O2899R5603p709n8342r641n4517j8646L0302%l5121k4460K241
$$ y = [-1705, 22645, 51652, 38336, 36300, -60665, -128711, -137859, -35488, -21799, -36759, -20705, -18273, -23235, -69326, -86436, -79822, -24908, -11419, -19829, -54291, 6676, 32633, 10691, -49708, -73735, -94848, -39666, 41001, -1992, -17656, 16995, -42504, -36968, 5245, 5378, -46745, 3964, -17054, 48468, 42943, 18307, -52556, -64555, -25091, -65816, -106785, -119444, -78482, -66945, -90135, -36223, 20971, 51267, 32771, 35265, 20953, 12701, 15616, 15341, 21136, 23624, -31079, 12552, 15796, 1822, -41463, -83378, -61064, -23418, -24832, -58080, -34353, -59322, -49626, -29232, -40763, -23672, -38932, -41081, -23452, -69458, -152388, -187903, -119858, -101227, -78296, -15397, 80206, 72497, 14155, 4514, -50003, -68649, -38347, -38347, -73468, -97928, -95687]
16327i5687k1440K0844R5840M9100K0600J975l6414j6905k2435K008k534J6476
16315A1428N7804k7147J2978j9563n1094q6496q9505l3104J15651L2023m9678
16304a26703j473k8299m649J9049j9096J232P4200L7449M259K9015j87J7774J6155
16291A8726m6555k1603J6317M1897o303l5535L5929L0320J0157n5090m8746K7693
16279c2793N4157o5909k9187j1229j450k8953p173M7223O4577L0528r166m2563
16267c1938k100j8451K0736l2430R551l0544P126K1371k4419k490L6814j3634
16255f0408o4420K0174R802Q9277O6687L5294L2346n0275r1916j03925M9927L5434
16243c2003J0543N3773q698m2355L4455j1187m9964k7226n4960M5168N3422k1056
$$ y = [-95687, -117127, -96283, -443, 48657, 69257, 71232, 34818, 17913, -4522, -2514, -5048, 11428, 69232, 42085, 55063, 35500, -15594, -102090, -191595, -224699, -109048, -77025, -126703, -128176, -156475, -161124, -142075, -161171, -159939, -85739, -48290, -44031, -15016, -15203, 2571, 18726, -27829, -49432, -33115, 8782, 2479, -33056, 2873, 33193, 43350, -11740, -60486, -32793, 21364, -44545, -73732, -84961, -86411, -115364, -122537, -75314, -10737, 19791, 10625, -31938, -34038, -52489, -31753, -64183, -54632, -85176, -78050, -56679, -81098, -83588, -46774, -60408, -124828, -104654, -94852, -5575, 61112, 96406, 128752, 78477, -13439, -117364, -67437, -32003, -21460, 32313, 23615, -18740, 15715, 4528, -45436, -72662, -127622, -82454, -29032, -50088]
16231e0088L0850O0304k2136J5343k5703O259N7267o9513p0012K2108m330L0563
16219a9088N4785K3466L4321m1025K6723J3176P1P517l9188l5010Q088K4399j662
16206E6573j9049n9510o005R465k4902K3255L8611M1079q3701J240K4537l0264
16194b8671k910K3926J7806k8216n1658L4529M8099n2015m5980j4465m4596p563
16182a51714L9686N4790J0292l5465N2154R886O1031l7417j0441M6130J8977M81
16170E8390m1673J7014K2568j6451n2166l0889N4173K2329l1715p1909k3261L7168
16158e6422M2959n534m2469j9658K6457l913m7237n2818M8892L4856j5735K343
16146h8279M1847P186J3020p7716r853q275n21m249L8495M1546L0033O624K450
$$ y = [-50088, -19238, 41066, 18930, 34273, 8570, 14829, 72096, 2583, -67429, -45321, -49651, -19088, 35697, 59163, 93484, 52459, 79182, 92358, 92429, 99946, 60758, 25748, 33836, 58235, 56573, 37524, -21986, -27991, -18526, -43428, -20173, 18438, 59517, -24184, -22944, 1593, -28671, -31581, -7655, 10151, -18065, -69723, -35194, 12905, -39110, -85090, -99555, -144151, -151714, -112028, -57238, -46946, -82411, -30257, -20371, 40660, 3243, -7198, 38932, 57909, 58390, 16717, 33731, 56299, 39848, -12318, -43207, 10966, 33295, 1580, -70329, -93590, -56422, -13463, -18997, -61466, -81124, -54667, -58580, -105817, -158635, -109743, -74887, -90622, -88279, -46432, -39246, -26226, -103942, -113795, -122070, -122591, -126840, -88345, -46799, -16766, -10142, -7692]
16133g692L573m2682L1239k7200N9009K9421n3471o3028j2662J3212J8440O7227
16121A5386J9733M7852k0080j6225k1741K598p99j0021n3974K2923O2813r4883
16109d6418o6322m188L002J0607K9671P0854k4146l300O7690O821J155Q5407n9241
16096G1592r2083K2160L6676o960o0824L6887J6698o5805j9898L6101J4819J0818
16084A81L7212m3739k5764P886M8358K5623N699J6206j2925M0899J995o2882k6108
16071A2641O4065K3128l6606n2993o0497l2625l6021m519l6136J17530L6910n3128
16059e8251l9689Q5447M1482k9017j9718J656l3873o655J6934K2020K403n0416
16047f7677l2603M8599r246j7507L2871k508k325j3493L4011J6969l71j4551K5607
$$ y = [-7692, -4119, -46801, -15562, -42762, 16247, 45668, -7803, -70831, -83493, -70281, -51841, 15386, 35119, 82971, 62891, 46666, 24925, 27523, 26724, 16703, -37271, -14348, 48465, -46418, -112740, -116928, -113926, -103319, -73648, -2794, -26940, -30240, 37450, 44271, 45426, 130833, 71592, -20491, 1669, 38345, 31385, -29439, 7448, 24146, -41659, -61557, -25456, -10637, 181, 37393, -6346, -32110, -24224, 24134, 49757, 55456, 71662, 58737, 99636, 101631, 38749, 12641, 76706, 99834, 63228, 10235, -50262, -82887, -118908, -123427, -159563, -42033, -5123, -58251, -97940, -12493, 28989, -28, -19746, -18090, -51963, -58618, -41684, -19664, -17261, -67677, -100280, -51681, -60927, -78434, -45563, -48071, -50396, -63889, -29878, -12909, -13280, -27831, -2224]
16034b224j0681r040p629J9035K5689r189l9416j4818J0677J668J0513L2496l8311
16021c1230n9584N873J7308N9948k0741l6886l3708O4818Q476k7996k9338J0907
16009g2153j8224j418J5966l8753L889M9522K5992j2652K6215m9721k8310O137
15997i3510J3761L3638K9642j1086o558j8045O6128N1253Q858l0712O570P6244
15985A26183K0071n9003k1752m2475j02619O386J0569L6735J0586l4502J9546
15974c0275M9368M4718M5274o718p5997k8038N756M4792j7490p1653k2551j34
15962f2948O875N6070k01K5198L1961n0797k9666m151k2402j4457R773r777k5805
15949i0327J0596N5902k455o281L6187J8228L2489j8963J4519P06j2229q2031
$$ y = [-2224, -12905, -21945, -29574, -10539, 15150, 5961, -33455, -48273, -37596, -35928, -25415, 7081, -31230, -90814, -84941, -67633, -7685, -28426, -65312, -99020, -34202, -25726, -53722, -83060, -72153, -90377, -91795, -75829, -114582, -110693, -61171, -35179, -47831, -21616, -71337, -99647, -93510, -79749, -46111, -16469, -27555, -34113, -52158, 13970, 65223, 74081, 43369, 49939, 126183, 146254, 87251, 65499, 23024, -79595, -73209, -62640, -25905, -15319, -49821, -30275, 19093, 63811, 109085, 102367, 26370, -1668, 4088, 48880, 31390, -40263, -62814, -62948, -56073, -3, -204, 24994, 56955, 6158, -23508, -27659, -50061, -64518, -54745, -64522, -90327, -79731, -23829, -26284, -32565, 3622, 21850, 54339, 35376, 49895, 50601, 38372, -43659]
15937d3659Q851K2265O4979k9428o5179K3448L3832j3180J22K0221k334k501k3736
15924f299N143l3147n7280l1956P6076N3811j4411O532l1389l4216l0954j7432
15912a15522n9772K9417N4985K4130L6571P6074K3000j7542o99j6242m0780m9104
15900e5484m0515m545L4872P078j0058p3972j3866Q583N0648q557j1125l9019
15888a55960L4709M9530o719m606o294n8316J4512N0090J00977L6426l5650j09946
15876i1247l3016K4427O4936P1902N5655R279q2113p7638J3795K3660K3546m1301
15864c8115J9326K989J8257L3371L1750j8954j05631o5763k3442r362O180J4490
15852a34904L9677L9829N1272P5025j3581j7172o1482l2816k486Q5382p677k1348
$$ y = [-43659, -34808, -12543, 52436, 23008, -42171, -18723, 15109, 1929, 2051, 22272, 19938, 17437, -6299, -1156, -34303, -91583, -123539, -47463, 6348, -8063, -1531, -32920, -67136, -98090, -115522, -175294, -145877, -90892, -66762, -30191, 45883, 68883, 51341, 50642, 34400, -6380, -55484, -95999, -100544, -65672, -58594, -68652, -142624, -156490, -147907, -97259, -105816, -116941, -155960, -121251, -71721, -78440, -83046, -89340, -147656, -133144, -83054, 17923, 54349, 18699, -91247, -124263, -99836, -34900, 37002, 92657, 101936, 19823, -57815, -44020, -20360, 3186, -38115, -18789, -15800, 2457, 35828, 67578, 48624, -57007, -122770, -146212, -155574, -149394, -134904, -95227, -55398, -4126, 70899, 57318, 40146, -21336, -54152, -56638, 28744, 21067, -281]
15840b81l0691L0398R209k6502O6339l6449o0101k0090j4695L5901N3089M4397
15828E0524k8146m9861K3528l0478j2449K9122k0402l730K0293k9674k9587n171
15816h6031j8799K4706J9742k6157O5880L2787l5801l6654Q829l1673j0980M9524
15804d4627J1502R9042J5858k6614Q089M4792P034n5470p1153k8795m3180J204
15792h2318L9576O669k9768j7394L2390J4539P2429M7417m2695K7132k524l8470
15780B6983r5661l5331m719N499j1057K1320J3594M709J8687J0547q985l8553
15768i2967K432k5720P8113M3345j4182K263J122P2080m7826J8222M6071m7334
15756C5619k968J3709o596j3251L4460j132j08117m8378n4700N75J5054P3256
$$ y = [-281, -30972, -574, 8635, -17867, 48472, 12023, -48078, -68168, -82863, -46962, 6127, 50524, 22378, -27483, -3955, -34433, -46882, -17760, -38162, -41892, -21599, -51273, -80860, -86031, -104830, -80124, -60382, -86539, -20659, 12128, -23673, -60327, -51498, -83171, -94151, -44627, -33125, 65917, 81775, 55161, 63250, 108042, 115076, 59606, -11547, -40342, -83522, -82318, -42742, -36073, -65841, -83235, -50845, -36306, 36123, 83540, 40845, 67977, 65453, 26983, -68678, -104009, -108728, -103229, -114286, -92966, -79372, -74663, -55976, -45429, -54414, -92967, -90535, -116255, -38142, 5203, -8979, -6716, -5594, 66486, 18660, 36882, 82953, 35619, 32651, 46360, 39764, 26513, 60973, 59841, -48276, -96654, -151354, -150779, -135725, -62469]
15744f2469j6894l7796L7754O3528n086K6613J2201K2364m2571j3236j147l1702
15732d8441k9092J755K8108K383k6800o807L6782k2989M06Q9836O2767m6949j4979
15719B5980J6485o7756m6111M90L890q231K9165K8067j8066L1156o838L236J7824
15706I291j3873k8124k0537P4070j6303o9200l0601K4425Q676l305p93N143J0087
15693e1044M0869n021n882k648J3625L5485R553m5106L6572J6092R750m748l5985
15680A1512j6310N0952K6080p8087k6392N4359J0934O3011l192p4425o2833J3504
15668c0887J1018L4623K1104N6011j2681m2544M845N902l4855J0164k5903j6355
15656a9558N8737Q9189q841k1403k0987q1540K4582L2845j2081n288k3343j3115
$$ y = [-62469, -79363, -117159, -79405, -15877, -20963, 5650, 17851, 40215, -2356, -15592, -16739, -48441, -77533, -75778, -47670, -45287, -72087, -78894, -42112, -65101, -64695, 25141, 87908, 40959, 25980, 42465, -25291, -71402, -70912, -67022, -75253, -46088, -18021, -36087, -4931, -11769, -8533, 9291, -4582, -32706, -53243, 20827, 4524, -64676, -95277, -70852, -62176, -65481, -66274, -61131, -51044, -10175, -15196, -21078, -23726, -10101, 25384, 34937, -10169, 26403, 42495, 52245, 47497, 11512, -4798, 46154, 72234, -5853, -32245, 22114, 33048, 96059, 92867, 18442, -44391, -30887, -19869, 14754, 35858, 91869, 79188, 36644, 41489, 47391, 12536, 22700, -3203, -19558, 39179, 128368, 119527, 98124, 77137, -4403, 20179, 53024, 40943, 35655, 12312, -803]
15644h03m133q98l2688o79J00730N3325m2598n0791n5409M134k6314l2616k0237
15631a08977M1931l0059P173p85K2693L921p839k3482K6550O6228J2221p4071
15619f4496j4626K9153L9977N449J8744P605l4177j1389K844J8926m958k9297
15607c6245j1101K6555J664k1011J6076J06495l67j03670n2866L8832K3065j9802
15595c2375p6923m530O4582m53q339n425k587j3643P2964O8293n0505j6312n949
15582a1202K3279n2208J5126K9315J2962m224J3798q013q945L125j4238k8425
15570b9650Q741J7992M763M077L1118m833K8389M65n2068l336M2580L338L2886
15557H4462p9995n1572K5907k2235M166N4323j4330K997n393j8992o282L6416
$$ y = [-803, -4936, -5834, -38522, -39201, 61529, 114854, 72256, 21465, -33944, -29810, -56124, -88740, -108977, -67046, -97105, -89932, -90717, -68024, -64103, -71942, -95424, -68874, -2646, 9575, -64496, -79122, -49969, -9992, -4543, 14201, 21806, -12371, -23760, -20916, -1990, -6948, -36245, -47346, -20791, -19127, -40138, -24062, 82433, 82066, -21604, -74470, -35638, -12573, -32375, -109298, -113828, -49246, -49699, -58038, -63463, -66050, -79693, -6729, 61564, 11059, -5253, -11202, 12077, -40131, -25005, 4310, 17272, 13048, 26846, 18833, 9888, 13013, -1225, -29650, -20909, -2917, 1846, 5923, 37041, 32208, 60597, 61062, 8994, 5658, 48238, 51576, 84462, 4467, -47105, -21198, -43433, -39267, 15056, 726, 3723, -1670, -20662, -26944, 9472]
15545I472N7136j6534j770J8335k4028J1283M8347j4375p9018k1938n4214k9502
15533i6806O5084R308j0754M6929N4779o9728p590K903j6621J4800r536L0994
15521A3762k9052l3872n0034J9008K6661r614R4081R0060n734r1557o1225K7930
15509i586K2043J4197K132P9603P7593o6745p5115l3766K2705l0942K7237j1745
15497A7611k6238l5025K7146j9109j348L9526k5054L89J8655K6775l2481k8215
15485c7368P189J1236L361J042l3430N0825L7936q756j4636j5377j949n592L5634
15472C0115N8399K4797p2642m1173O6125M1569j4900N303j5321l1052p7312N432
15460b0660M9422R1305P495r651j2160N770k3172m0807m4837J6472K2266l396
$$ y = [9472, 66608, 50074, 48304, 66639, 42611, 53894, 102241, 87866, 8848, -13090, -67304, -96806, -31722, -22414, -33168, 13761, 68540, -1188, -8778, -5875, -22496, -7696, -17232, 13762, -15290, -49162, -99196, -80188, -53527, -63141, 30940, 121000, 115266, 23709, -37516, -9586, 12457, 26654, 28786, 108389, 185982, 119237, 44122, 10356, 33061, 2119, 29356, 17611, -8627, -43652, -16506, -35615, -36963, 2563, -22491, -22102, -3447, 23328, -9153, -37368, -30179, -18943, -15582, -14540, -47970, 2855, 40791, 32035, 17399, 2022, 73, -5519, 30115, 88514, 113311, 40669, -504, 65621, 107190, 92290, 97593, 82272, 51220, -26092, -20660, 28762, 120067, 127562, 117911, 105751, 111521, 88349, 47542, 2705, 19177, 41443, 38047]
15448C8047R985r601M1327l014l9933l0720M4125N9703m837p4240p4317K5955
15436a7520Q441L8188L0013P638J9265Q732k9011k9523n1605k3191N6220M4510
15424F2157Q275J4332J1607J9067M8310K091l8385l2064o6264O0543L6277k0245
15412A05701k6461J33n643k2342m3123R649L1188Q1285J4745j06753j10137m065
15400g5823J2520K1871M0460L8765n6678n4588K5736L3483N2886J1917J7664r275
15388E8938n7153q248J7859l5442r0791K9923K3149l500L6282K1001k1518J1819
15376a7681n6242j3927M0678j0029R902j9104j5574L973K4711M1377K6831K8008
15364D2923k4332k7177M6246j9217l957j081R9921o7019j07594m1738J8452M5756
$$ y = [38047, 48032, 38431, 79758, 76744, 36811, 6091, 50216, 109919, 105082, 30842, -43475, -17520, -9079, 29109, 59122, 66760, 86025, 94757, 65746, 36223, -15382, -38573, 17647, 62157, 70432, 84764, 96371, 115438, 163748, 165839, 127454, 95390, 29126, 89669, 125946, 105701, 79240, 79373, 73730, 51388, 8265, 17914, 49102, 130387, 145132, 38379, -71758, -75823, -63303, -41432, -972, 37793, -18885, -73473, -47737, -14254, 38632, 50549, 68213, 58938, 1785, -6463, 11396, -24046, -114837, -84914, -61765, -65265, -28983, -7982, -29500, -17681, -73923, -87850, -47172, -57201, -47299, -66403, -81977, -78004, -53293, -11916, 14915, 42923, 18591, -8586, 37660, 18443, 14486, 13405, 113326, 46307, -61287, -103025, -84573, -38817]
15352c8817O630l5975j1915j6683Q932K5182l342N099N5400L7060n3277M490J6931
15339b85L836m9138L1420J8880n161J8245K2479J0218L316p941K2341J001K3720
15326I2931p4513J7899j7187n3251l0051Q0350P2721K6730l4976m7020m505P513
15314C6641M744k0674J3478K4898l3338r82l8405Q865K2272r013L2231J3689l2082
15301B2324k8452m423k2976k4224J2811N7871k4874q7275k2082N4526J6363L9421
15289a0990q474j6567J5741J6612R928o1325p496k6729j3212J6885Q4551j1555
15277a2631p332o779K6374M2546J0015K7383M822o5123l3381p057K4639J1893
15265A5369L9653K9407k7497k1592r036m948j4905J837K4516r998m0264j7204
$$ y = [-38817, -32187, -68162, -80077, -96760, -87828, -62646, -65988, -60889, -5489, 31571, -21706, -17216, -285, 3551, -45587, -14167, 4713, -448, 17797, 40276, 50494, 53810, 45869, 68210, 69211, 92931, 18418, 36317, 19130, -34121, -64172, 16178, 88899, 115629, 80653, 33633, 29128, 36641, 41385, 20711, 34189, 59087, 25749, 24767, -13638, -4773, 17499, 8486, 40717, 54406, 22324, -6128, -10551, -33527, -57751, -44940, 12931, -11943, -99218, -121300, -66774, -50411, -10990, -19464, -36031, -20290, -3678, 6250, -55075, -62571, -89300, -102512, -85627, -1076, -12631, -19963, -26742, -368, 42178, 52193, 79576, 84398, 19275, -14106, -21163, 3476, 15369, 55022, 84429, 56932, 35340, 26304, 21356, 6451, 8288, 32804, 22806, -17458, -34662]
15253c4662N0678j7797m417n450J2438L5760r42n5020k8497O3407L8453Q224l3050
15240B9125l8755L6178K9466o5840l1667j8835k019k8178k2902m41Q5564L3192
15228D888m3375J978Q892N3130J3658n6296n204N7962N9120l2110l6921k9501
15216c779p1025J0716N6228J7957J6580j8256q1477J1986M055K3028r967j6642
15204f0596n7162k2487P6625L7080j2838M1796L0958m603o6257L8013m7327n326
15192e2124j6939Q4020n515M3247K7326n2455l0111N0749K2610k3698J0071o8519
15180a1338K7712J7718Q587j2278K2066N3526M646m3737P652K5409j3874N7909
15168A43998m2357p0607K0990n6120l7933M9825L8743R643j9899K0220k981L2579
$$ y = [-34662, 16016, -1781, -6198, -11648, 790, 36550, 35608, -19412, -47909, 15498, 53951, 62175, 29125, -9630, 26548, 56014, -9826, -41493, -60328, -62347, -90525, -113427, -113868, -28304, 4888, -38487, -36509, -27617, 25513, 39171, -17125, -22329, 35633, 94753, 62643, 25722, -3779, -74804, -64088, -7860, 10097, 26677, 8421, -73056, -61070, -57015, -33987, -43954, -60596, -117758, -140245, -63620, -26540, -39378, 2418, 33376, 28773, -37484, 529, -46798, -52124, -69063, 14957, 9442, 52689, 80015, 27560, -2551, 48198, 70808, 47110, 57181, -11338, 16374, 34092, 42679, 30401, 52467, 105993, 110639, 66902, 74554, 99963, 86089, 143998, 101641, 31034, 52024, -4096, -42029, 7796, 46539, 56182, 36283, 56503, 53522, 86101]
15156H6101m2277l932m197l1222l0870l0174J5539l653n0552m0947N2937P8729
15144d518K3447K8871k8758o7639j3999n321K7056O5033n738j9192J8991P0039
15132H8272L1309n6227o2975J0632J7491m4947j2757l7679P429j1807k3124j5362
15120a09745J02877J7428Q507m4703k2919k6125k3782L0329P0857k2878m1760
15109f1914J7426L692M7113K0158O615M6816q809j7455k3726Q592k328j1129l4235
15096i184L4965l662m1371N2464M6186N0290j6010k7976n2201j4992k9288k2652
15084c3431J650n1696O4649p54m5910L9028K0604j9513k5198K6855J1549K6921
15072A4754o9484k0662L3472J3992K7048o4183m1883K5901Q1980J2600k0604J0512
$$ y = [86101, 43824, 39892, 35695, 4473, -26397, -56571, -41032, -44685, -95237, -136184, -83247, -4518, 18929, 47800, 19042, -48597, -62596, -67917, -40861, 24172, 18434, -758, 18233, 88272, 119581, 63354, 379, 11011, 28502, -16445, -29202, -66881, -59452, -71259, -94383, -109745, -6868, 10560, 19067, -25636, -48555, -74680, -98462, -68133, 2724, -20154, -61914, -44488, -40796, 6317, 26475, 33090, 79906, 71097, 53642, 29916, 38508, 36180, 25051, -9184, 25781, 22119, -19252, 33212, 79398, 129688, 113678, 85702, 33501, 18509, -10779, -33431, -31781, -83477, -18828, -19582, -65492, -26464, -5860, -25373, -50571, -23716, -12167, 14754, -54730, -75392, -41920, -27928, -880, -65063, -106946, -81045, 935, 13535, -7069, 3443]
15060C443N2210m0642K6211n213P049o176q663L2218J4353k818o4090k1768M654
15047i232J1866L9498P253k1594J2752J111n2456l4732m4783J011j5126P4094
15035c0338J255o5464n1127m993K7584J1618M8459J8697m229J612j4680J6324
15023d5282K9372j4348j2384K4254O698o8230l4058K4700J7776n857j06J401R833
15010f6231L8593m2646p9333k3623J9593j2840Q2410R7360j7379m6770k2174l0595
14998a03635K8794N0982K8634m9477l9375j0401J992L8705p902L3766J8552m7089
14986e6454K7531Q9346J339n7118n0470m0573Q518m1763L9961O2504j464m9011
14974f7654L5501P255o9773m1671L4610N9197r163M0512j4288j5792J8065o9449
$$ y = [3443, 55653, 15011, 41222, 36009, 43058, 36882, 28219, 60437, 74790, 71972, 7882, -13886, -9232, 2634, 42132, 49385, 27791, 40543, 41654, -10802, -45534, -90317, -89306, -104432, -30338, -29083, -94547, -145674, -150667, -123083, -111465, -63006, -44309, -48538, -46926, -61606, -45282, -15910, -30258, -42642, -18388, -11690, -79920, -113978, -89278, -71502, -77359, -77465, -76064, -66231, -27638, -70284, -149617, -173240, -153647, -166487, -84077, 13283, -4096, -50866, -73040, -103635, -74841, -23859, 4775, -44702, -84077, -94478, -92486, -53781, -61683, -27917, -9365, -56454, -28923, 60423, 61762, 4644, -45826, -86399, -77881, -119644, -79683, -17179, -18643, -67654, -32153, -24898, -94671, -136342, -101732, -42535, -51698, -11186, -25474, -41266, -23201, -92650]
14962i2650o1501J8956J5115L0726J5060N7042q7184j18814L4888L6745J4611
14951a37006N3785O1253l4417J2828K9755J3427j0791M1399M309k5541j0267l7231
14939c8497L107L0157M4253l0296j45183j9034Q7811m133N5048j3303j4863L747
14927d1186j7961m072L5757N7012j5176j5763m506J5803K8096k9942o446k0327
14915a8711o9011k7159K4934k1229N264M249L8710j4424O806l5496N9393K3609
14903b3065j6992k2828k4488m1015N9048Q9608j7307k5039J4276K0693k6817Q8566
14891G4640O0115m0418p4547o1929L6374O4635J7458q173l9624k48m7483o38j4856
14878c4694q314j10044n0699Q9239Q4941M3729J2563m1624l1841q645J9144M5860
$$ y = [-92650, -154151, -135195, -120080, -89354, -74294, -17252, -104436, -223250, -188362, -151617, -137006, -83221, -21968, -56385, -43557, -13802, -375, -11166, 30233, 34542, 9001, -1266, -38497, -35390, -5233, 39020, 8724, -136459, -155493, -67682, -71815, -16767, -30070, -44933, -41186, -59147, -63219, -27462, 29550, 14374, -1389, -5895, 9908, 38004, 8062, 1616, -18711, -87722, -114881, -89947, -111176, -105912, -101663, -62953, -77377, -70571, -106067, -46674, -23065, -40057, -62885, -87373, -128388, -69340, 20268, 2961, -22078, -7802, 12891, -13926, 74640, 134755, 94337, 19790, -42139, -5765, 58870, 76328, 68155, 28531, 28283, -19200, -19838, -34694, -43008, -153052, -203751, -114512, -29571, 14158, 26721, -14903, -46744, -55389, -36245, 9615]
14866I615K3847q9314n9089J8973M9563P053J4200k217J3577o9319p1706R478
14854a45339M3830j0615J7358j5088k6327J4372M9821L2293N85j8360m5354J2492
14842i0332K2513m636L94k0134L3712N9485N5633j4156j429N1559j2238n3671
14830B6700l7462l9936o570N5276M8554l2298j2160K4508N6545j2428j9151p0049
14818a8471n4816j7798M739M4463j0831k7331P3518J5198J176l539N955k9571
14806a7308Q20M782K8881M2582j1250j20453p7840M2958j6097M1326O6388J3453
14794a758L5773k0246l3405J7275p8658l824R6244K6704j9151l9764Q477j7530
14782b9863J3514M9785L3269o6077l1602l2934P157M0561O5732J0490k7469j031
$$ y = [9615, 33462, -55852, -114941, -95968, -46405, -39352, -25152, -27369, -13792, -83111, -154817, -145339, -101509, -112124, -94766, -109854, -136181, -121809, -71988, -39695, -39110, -57470, -102824, -90332, -67819, -72455, -72061, -92195, -58483, 1002, 56635, 42479, 41050, 92609, 80371, 26700, -10762, -50698, -57268, -1992, 46562, 14264, 2104, 26612, 83157, 70729, 51578, -18471, -73287, -91085, -86346, -41883, -52714, -80045, -6527, 8671, 9847, 6308, 12263, -17308, -16488, -11706, 17175, 59757, 48507, -71946, -149786, -106828, -122925, -81599, -15211, -1758, 34015, 13769, -19636, -2361, -81019, -84843, 11401, 38105, 18954, -20810, -12333, -29863, -16349, 33436, 66705, 628, -30974, -63908, -56751, -16190, 49542, 60032, 32563, 31532]
14770C1532O518k1322n317N7292k4730J0135L9078O4259n9475n7823J90q1786
14758d1449j4239L1702M446J5894q0762L5434P136O768l1455m6973L5608M5889
14746c2001Q343j3971p798J5002j0332M0617K799l1877P312L2658M0235N9980
14734A10967l1622o5854l7437L2759J9127m9925j00972l0489K9834l117j7612
14723a44341K7282l435k690K6065l8178M0636J5566k0094k3915n237O2566J22208
14711E6433J9563o2901Q882n3836n4978L1679N8001k143P021O0925M69m1444j0909
14698A6762l1704k0249O3744j0321J2145l862k4805l8595o3288j1860M9212K1769
14686d1052M0654l0426k4761O1517K5677j1420K436j129l3754L8512k1878o2461
$$ y = [31532, 38050, 16728, 11411, 68703, 43973, 54108, 93186, 157445, 97970, 40147, 40337, -41449, -55688, -23986, -19540, -3646, -84408, -48974, -41838, -35070, -66525, -113498, -77890, -32001, -23658, -37629, -45427, -30425, -40757, -140, 2659, -29218, -21906, 10752, 50987, 110967, 79345, 13491, -23946, 8813, 27940, -21985, -122957, -153446, -123612, -126729, -144341, -117059, -120494, -123184, -97119, -135297, -94661, -79095, -99189, -123104, -128341, -65775, 56433, 75996, 13095, 21977, -31859, -86837, -55158, 2843, 700, 7721, 68646, 69115, 27671, 16762, -14942, -35191, 28553, 18232, 30377, 26515, 1710, -36885, -100173, -112033, -62821, -41052, -398, -30824, -55585, 5932, 31609, 20189, 22625, 21496, -12258, 26254, 4376, -58085]
14674e8085j8103K9766k0249n1979M6881M8868K7114n3134o6600L0757J454J9527
14662f3783N7125M2346L4051N2996k983j02738L12m0898m2759N8193L6468M5263
14650G3593Km7947q7184p896O8589L3968P600K6329l436l117N975l3588r056J9095
14636D2927k1764j8998k2687j8644O0737o027m2057O802M4178N3885k2710l2927
14624B2715J3919m9485l5512L2173L8683n8189J0799j27P186Q278j7493k6698
14612e3751O512M9857l5843l4755L0623J7321k4523N3827l0874l1566L5766n1459
14600f8865L4028l2761j2635L7089P4974l2420j2701N1260q099K0364j4127o8605
14588c2498j0759J9212j0588N9644P3910n2910R200j29J7348J3152k364l6064
$$ y = [-58085, -76188, -46422, -66671, -118650, -71769, -22901, 4213, -48921, -115521, -84764, -83310, -63783, -6658, 35688, 69739, 122735, 119752, 17014, 17326, -23572, -66331, -8138, 28330, 73593, 73595, 25648, -61536, -69432, -843, 33125, 40725, 67054, 63618, 60501, 66476, 32888, 23832, 42927, 21163, 2165, -20522, -39166, 21571, 15544, -26513, -19711, 24467, 78352, 55642, 22715, 36634, -12851, -48363, -16190, 22493, -35696, -24897, -25024, -17838, -9560, -27053, -53751, -47239, 2618, -33225, -67980, -37357, -20036, -44559, 9268, -21606, -53172, -17406, -68865, -34837, -67598, -80233, -43144, 31830, -590, -13291, 37969, 29870, 50234, 36107, -32498, -43257, -24045, -34633, 25011, 98921, 46011, 55211, 55082, 72430, 85582, 83218, 47154]
14576D7154o7022j6502M2713m2891o2396k7447P2162M5823l9324l2107p460J0151
14564g7146M2208m268k4964l7709j3787L957J6376Q1613L0397k4877J8054P3128
14552H2982m1617J2445M4495k3610k5336k5334J4999p533l0038O4219M9084q018
14540A06738n310n8320j9799J8553M422k364j4253k7442Q478M032O3792r335l8333
14527C0859n2051P158j8770l7153L3527K1991m0281N947j5045l9119n2171P3202
14515h1906M1965m3394P074p051j788K582k5807k0914L5142j4975L5311k9181
14503a02942k0699N4871N7779n6457j5724P4618j4997o890O209J5570p480L4306
14491A8164L4741l1011p844k5258M408m461J6522L9987j4583m9950O897K1536
$$ y = [47154, -19868, -36370, 6343, -36548, -98944, -126391, -54229, -8406, -47730, -79837, -87297, -77146, -34938, -39206, -64170, -101879, -115666, -111709, -95333, -13720, 16677, -8200, 9854, 82982, 41365, 53810, 98305, 74695, 49359, 24025, 39024, 31491, 1453, 65672, 114756, 106738, 101428, 43108, 23309, 41862, 46284, 43920, 29667, 2225, 10703, 14735, 78527, 69192, 30859, -21192, -14034, -32804, -69957, -36430, -14439, -54720, -48773, -63818, -102937, -155108, -81906, -39941, -83335, -76261, -83312, -85100, -82518, -108325, -129239, -94097, -109072, -73761, -102942, -123641, -68770, -10991, -67448, -83172, -8554, -23551, -30441, -24232, -8662, -16142, 18164, 52905, 21894, 14050, -11208, -6800, -11261, 5261, 45248, 30665, -19285, -12388, 9148]
14479I148j5696P590P0418q652l5973j8294Q609J7034q2701k2380J2217j3538
14467g2218K208L3176J0357O385r387J777M7789K8058m4567o2976k075l4776L1457
14454f4792j5027j5505j8441j383O5328M6195J9994K0910r078n2340o2690k456
14442h9285K3908m7192j9599O6050J3014l515l937L8489J5180k9647N3102K083
14430A8651m5807R640q147k926K4966O203J1247M1898K0781q8259j01529j5688
14418a28970P8035q076M766J7216o7259R485r14j9918K710M3783O3454L5299J7262
14405D6873n7432j7004j7051n3619l8952P4698P2094m0211p884k631J3020J7117
14393a0982l363p016l387O1906J3537j0204O934j6326m8459J7168J9536m4931
$$ y = [9148, -6548, 1042, 71460, 62808, 26835, 8541, 17150, 34184, -48517, -70897, -58680, -72218, -70010, -36834, -26477, -20092, -29479, -27702, 20087, 48145, 3578, -59398, -61473, -96249, -64792, -79819, -95324, -113765, -115148, -49820, -3625, 16369, 37279, 28201, -24139, -86829, -89285, -65377, -112569, -132168, -66118, -53104, -56619, -60556, -22067, -6887, -36534, 16568, 18651, -27156, -17516, -25663, -28589, -3623, 2580, 13827, 55725, 76506, -11753, -113282, -128970, -50935, -59011, -54245, -37029, -104288, -94803, -95717, -115635, -112925, -69142, -5688, 29611, 46873, -10559, -27563, -44614, -98233, -137185, -62487, 9607, -30604, -38488, -41119, -28099, -10982, -14345, -21361, -24748, 37158, 50695, 40491, 47425, 31099, -17360, -192, 19344, -25587]
14381b5587k9429M6952K0662K8129j2477l8651q3232m0160j5928J0792M9980P2569
14369a6380k1028m6125l4633N6414K3861l2560m3373K7006M9775K7518l647o057
14357a9229R568k6334N359K3234K5680M8765j4850k8108k6319K771l8981K5797
14345a2647M2813J4407J5219K480j127n0717n0785J7530J8708j7493j8570M0067
14333a15K5598k7242l806k7110k9078M6116K4306n513j0367k815J0603K3335j25
14320B3787p58k8303j5333k6917J1980j2927O4728k3961l9683R307n635J2539
14308c1176K4928o995J2259o0925l835P040p181o68O868K8001K6397m613o3434
14295g3334l2112q761O4110o4233l6574N5586K5802P1916j4227m6317l5384K5794
$$ y = [-25587, -55016, -8064, 12598, 40727, 28250, -10401, -93633, -133793, -149721, -138929, -88949, -16380, -37408, -83533, -118166, -61752, -37891, -70451, -113824, -86818, -37043, -9525, -13172, -19229, -9661, -35995, -30636, -7402, 18278, 67043, 52193, 24085, -2234, 537, -38444, -12647, 30166, 44573, 59792, 62272, 61145, 10428, -40357, -22827, -4119, -21612, -40182, -115, 25483, -1759, -5565, -32675, -61753, -15637, 8669, 3156, -7211, -10026, 577, 23912, 23787, 23029, -5274, -20607, -47524, -35544, -48471, 16257, -7704, -47387, -38080, -43715, -31176, -6248, -13243, -984, -61909, -65744, -58704, -65885, -66553, -59685, -31684, -5287, -9900, -73334, -105446, -114207, -50097, -114330, -150904, -95318, -69516, 2400, -11827, -58144, -93528, -67734]
14283f7734l9565M1517P5826n273j8641O831n2740K6484Q180K5880o3258j9475
14271h1968K9541k5655k4208j806o439J8728M2393J8267Q476p4212m0013M2131
14259i4765O0785J7615k8330M897j1464k3640m5611o47N3754J7122J3520K4770
14247a1994l1862k6117K8255N4451P1284q354q8336p4684l5279L7456L6429L546
14235d5205N802J10676O5141n4699m4861K570l0418k9039K4466J7483l4688k4049
14223c6821l6860P1220J6853m5937J2798j3193j6811j2189J5558O691j8362j6318
14211g3371N3735L0806J3012j9449N4102N181l3154J986K6055m4706o8067p5214
14199a29084K9632M7947M7099j5201r669J007M2142K8576M0403n5599m6992o0394
$$ y = [-67734, -107299, -65782, 10044, 4771, -13870, -7039, -59779, -33295, -25115, 765, -62493, -81968, -52427, -78082, -102290, -104096, -110535, -91807, -49414, -31147, -22671, -96883, -136896, -94765, -33980, -16365, -44695, -39798, -51262, -74902, -120513, -121160, -67406, -50284, -36764, -11994, -43856, -69973, -41718, 12733, 84017, 75663, -12673, -87357, -122636, -85180, -48751, -45205, -39403, 71273, 136414, 81715, 36854, 39424, 9006, -20033, 4433, 21916, -12772, -36821, -73681, -2461, 14392, -31545, -18747, -31940, -48751, -60940, -45382, -38691, -57053, -73371, -19636, 11170, 24182, 4733, 58835, 64016, 30862, 32848, 58903, 14197, -53870, -129084, -99452, -51505, -4406, -19607, -29276, -28269, 13873, 42449, 82852, 27253, -19739, -80133]
14187h0133N588N4763M8651K2802l7581j496J7369k3034n6269K7156L5345n0492
14175c7331k7030L2105L9338K6237n1566j8906M949M212Q249K2156J3161J1859
14163B7433k2109l6180J1411j1468o647M6084J4722m0355l5426n1862m3580k9809
14151a77786P832Q5306J05635M2292j2620o6120j1737l8378R746N8246m161M1728
14139C9983L1316k0932o3450m5274J6231M7011K6428k234l6269o6987K1930O9632
14127A7385k5099m5768j9042J2092L1775J7387k7756k6581K8684K2239N6469K8267
14115G0052Q863K3021J5019l4810N596K8001q3306n4156J2032L8588k6768o5644
14103f3512N212j4414k3387J5348P516L4759j5930l0485K2400L2022N9125J6009
$$ y = [-80133, -74545, -19782, 28869, 51671, 14090, 12594, 29963, 6929, -49340, -22184, 13161, -37331, -64361, -32256, 7082, 33319, -18247, -37153, -32204, -27992, -19743, 2413, 15574, 27433, 5324, -30856, -19445, -30913, -37560, 8524, 23246, -17109, -52535, -104397, -147977, -177786, -169954, -84648, 20987, 63279, 50659, -15461, -27198, -65576, -55830, 2416, -1745, 39983, 71299, 50367, -13083, -58357, -42126, 4885, 31313, 29079, -7190, -74177, -52247, 17385, -7714, -53482, -72524, -60432, -28657, -11270, -39026, -65607, -36923, -14684, 41785, 70052, 78915, 101936, 116955, 82145, 87741, 115742, 32436, -21720, -9688, 28900, 2132, -63512, -58300, -72714, -96101, -80753, -73237, -38478, -54408, -84893, -62493, -30471, 28654, 44663]
14091D4663l6373l5767J2168j8180k1410L0529Q449n226M8038P5718l5234l5234
14079C2141M0888N922M503o2996n0779Q685L2824K3303J4403K6301j3592l3920
14067B7683l4315m2831L8554L3385l2019n2695j9550l080M8408j6538J8015N0574
14055A5591j8579m7546n887J1507L2700m328k4822L108J0852K3831j0546j6328
14043c0447J346M7246L1168k5608o6382j9831j2832K7163L8706j5427N9046L671
14031C7819j6277J1452O989O080o1459p4230j1036L6509j5458m5400K021O9683
14019e3307O2820M1064P376k9713Q538J3309o3744m2233L5191o18J3454m348n8445
14006g0656n502L9415J6069j0370k6594l386l9918k2255N6012N8518J0765R896
$$ y = [44663, 8290, -27477, -15309, -33489, -54899, -24370, -15921, -21147, 26891, 102609, 67375, 32141, 73029, 78951, 83454, 20458, -30321, -21636, 11188, 34491, 48894, 75195, 61603, 27683, -6632, -49463, -10909, 22476, -9543, -62238, -81788, -84868, -36460, -52998, -34983, 15591, -2988, -50534, -56421, -44914, -12214, -16542, -41364, -38256, -27404, -3573, -14119, -30447, -29101, 18145, 49313, 23705, -42677, -62508, -75340, -48177, -9471, -24898, 34148, 37819, 21542, 32994, 39983, 46063, -15396, -89626, -100662, -64153, -79611, -125011, -122990, -53307, 9513, 50577, 57953, 28240, 36778, 50087, -13657, -55890, -20699, -21317, -7863, -12211, -70656, -76158, -36743, -20674, -31044, -57638, -61024, -100942, -123197, -67185, -8667, 2098, 11994]
13994A1994o2180P661J3814M7501L8669k9439m0827L8394L1147k9560k2824p809
13982c459K6191K5915j0488j02444J7070K1028l072J1215J1243J3554M016J1490
13970B2259J2930J3090m1312j8777M5525J502k3953n6018J8622O1484J0875o190
13958D0037K5447J1038j9376m1506n4989O81j1879k7410k3253J2396L6198K9983
13946b2633K055o0556o5109O9004L6738k9710J1902J0831k5907P269J4663L0011
13934b1442J01148K3329N771j9540k9036L6141m361M1409M62n6658P9O5446r882
13921A32866q8751m9987j6144j4542J2534O2761M3157o3703r4273O1216L708m5822
13909e6980N578j9174L0092K5071K2024K8591J8754K3193m0777n3019J0773P3206
$$ y = [11994, -50186, -42525, -28711, 18790, 57459, 28020, -12807, 25587, 56734, 27174, 4350, -3459, 22732, 48647, 38159, -64285, -47215, -26187, -29259, -18044, -6801, 6753, 10769, 22259, 35189, 48279, 6967, -11810, 33715, 35217, 11264, -44754, -26132, 35352, 46227, 40037, 65484, 76522, 57146, 15640, -39349, -38668, -50547, -77957, -101210, -88814, -52616, -22633, -20578, -81134, -146243, -77239, -40501, -70211, -58309, -47478, -73385, -66116, -51453, -21442, 79706, 103035, 108806, 89266, 60230, 96371, 92010, 133419, 133881, 77223, 77302, 142748, 132866, 44115, -5872, -22016, -36558, -24024, 38737, 81894, 18191, -76082, -14866, -11158, -56980, -51402, -70576, -40484, -15413, 6611, 35202, 53956, 77149, 36372, -16647, -5874, 67332]
13897F7332O468m3864l1006o6403j1064K5521l1543j5325J5695j1825K8194J616
13885f6204J995J6534j1245M5032K4766l4504k8311P956n5301N323L2741P4976
13873A3758J3477J0494K4223J2583k8609J5882j4303j6900k2173l5022J568J5833
13861i189Q900K3956o169N3671m732m6797j7144j2524l8848K3442k4130k6754
13849g6318M3609P7461j2719m7433J3845n457r35N4570l3494l0939l3482R960
13837d1332M7585K661k0425L5894l1698N5962J9600o4770j6633K2370p1214k2213
13825h4213J7259K927l0048M086P5115R5446K433j6083M3129q096o4510K0054
13813E7499K9159m5547l3844q71r3519J575P2047O6790K153l074J1419L4182J02789
$$ y = [67332, 73800, 29936, -1070, -67473, -78537, -53016, -84559, -99884, -84189, -96014, -67820, -66204, -64209, -47675, -58920, -13888, 10878, -23626, -51937, -43981, -99282, -93959, -61218, 13758, 27235, 37729, 61952, 74535, 45926, 61808, 47505, 30605, 8432, -26590, -25022, -9189, -289, 23667, 17498, 71169, 66437, 19640, 2496, -10028, -48876, -25434, -49564, -76318, -32709, 44752, 32033, -15400, -1555, -7012, -7947, 46623, 13129, -17810, -51292, -41332, 6253, 8914, -11511, 24383, -7315, 48647, 68247, 3477, -13156, 9214, -62000, -84213, -66954, -64027, -94075, -89989, -14874, 80572, 83005, 66922, 110051, 101955, 37445, 57499, 86658, 41111, 7267, 6396, -87123, -85548, -13501, 53289, 55442, 52368, 63787, 97969, 200758]
13800B00758n4525n1913K302K7218p8413p4951l0933K1598K4416J7554M854k4651
13788a6686N3396Q1227J8364p126n4570k3266P16M4766J8901j0032l9278j8886
13776D7526l8707k3743K301j341p155L8844J2852l9044L4387k633L3401j5016
13764D1672J8214L597L764m7260J7514K7056j8570n5995j30845l805L1779O0814
13752e2065M4069K1531k7583R127p1098N455p472M1536K5539m5165M4937J8071
13740F882J5280l2909k8034k1059j1005O0650j4230m0967O8348Q5306j5355k8022
13728D4885q626p115K2458L9839j8854l7595j4603j9579J8171N3487j3393k6593
13716C2482o436L0086l8983j9697Q6273n0777o676O829M5722k1057M5745O446
$$ y = [200758, 146233, 94320, 96622, 123840, 45427, -29524, -60457, -38859, -14443, 3111, 7965, -16686, 36710, 117937, 136301, 129175, 74605, 51339, 52055, 96821, 115722, 105690, 66412, 47526, 8819, -14924, -12623, -13964, -21119, 17725, 30577, -8467, 25920, 23287, 56688, 41672, 59886, 63483, 67247, 19987, 37501, 64557, 45987, -10008, -140853, -144658, -112879, -52065, -7996, 13535, -14048, -4921, -76019, -70564, -78036, -36500, -10961, -56126, -11189, 6882, 22162, -10747, -38781, -59840, -70845, -10195, -24425, -65392, 2956, 88262, 72907, 44885, 36259, 29144, 51602, 91441, 72587, 34992, 20389, 810, 18981, 72468, 59075, 32482, 26046, 56132, 17149, -2548, 83725, 32948, 26272, 33101, 78823, 57766, 103511, 109957]
13704A09957j3420n7454o1621K7548K109k0948j6639L9942R0710P54m9898m2034
13692I006l1828L2710P9356j4307J8169n9946J0633L8744M2997k7945j891n4347
13680D1351l2542o9672m2417L2540R0575K4747k6012K877L2564k0601L2728k3406
13668D2732j2810j1642K0806J5178Q2052M6269k7055n5995N9067L168M2378K9953
13656B34101J8516j0195m2463m1942M8809m3263r2854k0877L6229m429j1470k5014
13644D5148j8329J8355R840J3316n0745j6764K5262j0341J1434M8659o252m8748
13632B0835J4740P816J0138L4786L1458P379L9586j8263o081o011M7919O4234
13620B48536l1074J7234M2707m0634k1332l6638l3379J134M85k5373K9828r892
$$ y = [109957, 96537, 39083, -22538, 5010, 7119, -13829, -30468, 9474, 100184, 100938, 51040, 9006, -22822, 9888, 89244, 74937, 93106, 33160, 43793, 82537, 125534, 97589, 95698, 41351, 8809, -60863, -103280, -70740, 19835, 44582, 18570, 21447, 54011, 33410, 66138, 42732, 29922, 18280, 39086, 54264, 136316, 182585, 155530, 99535, 158602, 161770, 204148, 234101, 252617, 242422, 199959, 158017, 206826, 163563, 70709, 49832, 86061, 81632, 70162, 45148, 26819, 45174, 55014, 68330, 17585, 821, 26083, 15742, 27176, 75835, 69583, 20835, 35575, 43391, 53529, 88315, 119773, 127152, 166738, 148475, 142394, 136383, 184302, 248536, 217462, 234696, 277403, 236769, 215437, 178799, 145420, 146554, 147039, 121666, 151494, 141602]
13608A41602J2234k2353q206l177l3877n6726k5945P326J7621O8597j0928J5277
13596A01445j0193k2985O853K3585K9018L40k3704m0096o1436o5398L851J21685
13584F2965O1503o2833k288M7990K4070k6030j8816K9146O0856j1819j1173o2138
13572I1433J1088K9714m7598m3781K5892O036P497J1113O5511j7293Q4228L8807
13560B62647n9279l2572k2911q4967m23k4516j6948L7150M6024N3885l646n858
13548A48586o519J5258p810m5923l9178j6719P1990Q5111n4116O074J6514m7940
13536A25328o8648O77j1720l2969j7863k0127k4573M013Q362m592j0318M5153
13524g277O4503l8128k5176K8359K7608k8501l6513J0669O9172K7100m464j7756
$$ y = [141602, 153836, 131483, 123277, 120100, 86223, 29497, 3552, 10878, 28499, 97096, 86168, 101445, 91252, 68267, 75120, 98705, 127723, 128063, 104359, 64263, 2827, -62571, -58720, 62965, 124468, 61635, 59347, 107337, 131407, 105377, 86561, 115707, 176563, 164744, 153571, 91433, 102521, 132235, 84637, 40856, 66748, 72784, 80281, 91394, 156905, 139612, 223840, 262647, 203368, 170796, 147885, 62918, 62495, 37979, 21031, 58181, 104205, 158090, 154444, 148586, 142067, 157325, 149515, 103592, 64414, 47695, 119685, 204796, 150680, 156754, 173268, 125328, 56680, 57357, 45637, 12668, -5195, -25322, -49895, -45882, -37520, -42112, -52430, -7277, 57226, 19098, -6078, 22281, 49889, 21388, -15125, -4456, 64716, 91816, 87352, 69596]
13512F9596K1415m3398j3444j4764m798O2657M7144o733j6199N645k5697K7121
13500A08545M5310q6298p3932j7659L1855P8396M5918J6988K2173L9173j067m4586
13488A64816k3525J2993j6197j316m0151J1020R912O5140j5553n8229o7902p8136
13476c7128J4850K3281M9785K7452P780l0430L4385K7865k4834j0788L8850N5838
13464A76906k9660n1075L0897j8398p1224l025M2146M4618R8709l189l8892N8562
13452B36375k657K9607O5196P2911L6891J2994J09813N6036J3934L8894O4774
13441G34768k7272m9521o1769q8792j6093k9913p3229m8031n4321o9481o3295
13430A53051p526O0218k6584M321J5213l4990M8884J09442K5975m2780K9057m3877
$$ y = [69596, 91011, 47613, 34169, 19405, 14607, 77264, 124408, 117675, 101476, 107121, 81424, 108545, 153855, 67557, -6375, -24034, 7821, 86217, 132135, 149123, 171296, 210469, 209402, 164816, 141291, 154284, 138087, 136771, 96620, 107640, 117552, 182692, 167139, 108910, 41008, -37128, -22278, 1003, 50788, 78240, 86020, 55590, 89975, 117840, 93006, 82218, 121068, 176906, 147246, 96171, 127068, 108670, 37446, 34421, 76567, 121185, 219894, 216705, 177813, 236375, 233718, 263325, 328521, 401432, 438323, 451317, 561130, 617166, 631100, 669994, 734768, 707496, 657975, 596206, 507414, 491321, 461408, 388179, 340148, 285827, 216346, 153051, 145525, 205743, 179159, 183480, 198693, 163703, 212587, 322029, 348004, 305224, 334281, 290404]
13418B90404j3133J0750J2961J5284K0497J29965R6305L3612O5498P2227K6916
13407G61286j2421j04774q6578k0142j04494o6999k4214o070M6416P166k4833
13396C64343j2422l7648l1830m5549l9414K806L4785K313k7588J3511M111o3368
13384A64050l8706L7524R467k9069m999J6575k2880n4471P6995L3104K7940k1637
13372A93893k8963o790k3233Q484K253k8744o090k0799P3129k3912K1477N4219
13360B14924J631o1967r071N9311k0804R885K1623k0732l1978k858j5363k2813
13348A21788K1564L4531K3118J8611j9047J009N205r7289J646J19749k91k7612
13336B02982M6344L7633j2002m8787M8302n5031q1824l6769L3722L1374m2135
$$ y = [290404, 277271, 288021, 300982, 316266, 336763, 466728, 563033, 596645, 662143, 734370, 761286, 748865, 644091, 557513, 537371, 432877, 365878, 341664, 335594, 382010, 389176, 364343, 351921, 314273, 282443, 236894, 197480, 200286, 235071, 237384, 209796, 223307, 227418, 164050, 125344, 162868, 172335, 143266, 138267, 154842, 131962, 77491, 154486, 187590, 215530, 193893, 164930, 158140, 134907, 143391, 145644, 116900, 110810, 90011, 163140, 139228, 160705, 214924, 216555, 154588, 145517, 204828, 184024, 193909, 215532, 194800, 162822, 159964, 144601, 121788, 143352, 177883, 201001, 219612, 200565, 201574, 206779, 109490, 111136, 230885, 230594, 202982, 249326, 286959, 274957, 226170, 274472, 219441, 137617, 100848, 134570, 165944, 123809]
13325A23809R211K1050J2220J0196k411r901J1130j584j6469Q0956K2819K4907
13313B85933m5189l2834J0715M1260k5129K765j0743l5678P999R0611l7804q5430
13301A66476R397M1110L8708l7732l9885n9836o1713L8502M3266J4298k9485K9119
13289A52225J11413J6670l4951l4610p8431N8908K655l808k3849o0365m0711R210
13277G4356K5583M4098Q443l4682k4701Q7555J4838j2749J0303Q154m442K8783
13265B25539J7542n1364J3357l4675m3784L8212K1188O5192J3494o4328j8195
13254A82178M8389k4170o2128o405l648K5175l1384J8584K9810J2647L0008r39
13242B18117j9398K3304J4637J8598L5544M573o6861o0780m1793k3358J0218J19214
$$ y = [123809, 133020, 154070, 166290, 176486, 174075, 164174, 175304, 173720, 157251, 238207, 261026, 285933, 240744, 207910, 218625, 259885, 234756, 237521, 226778, 191100, 199099, 289710, 251906, 166476, 175873, 216983, 255691, 217959, 178074, 118238, 56525, 95027, 138293, 152591, 123106, 152225, 263638, 280308, 245357, 210747, 132316, 191224, 193879, 190071, 166222, 105857, 65146, 74356, 99939, 144037, 152480, 117798, 93097, 180652, 195490, 182741, 193044, 201198, 196756, 225539, 243081, 191717, 205074, 170399, 126615, 164827, 186015, 251207, 264701, 200373, 182178, 230567, 206397, 144269, 137864, 134216, 159391, 128007, 146591, 176401, 189048, 219056, 218117, 198719, 222023, 236660, 255258, 290802, 295375, 228514, 167734, 125941, 102583, 112801, 232015]
13230B32015N3525l4354L399J927O3729L3306o287J9362K5651o412m6738o1667
13218B77456N2932J6990n0710m6471L3401K2909M1831N429l5590k0056K3738M4173
13206C66032j8765j235j1211J6361L1390m5696L1756j2942n3425M804J2199J3325
13194C32593L70l3582K2121J7889j2031m6294j434J4015J8634L303j7090k2072
13182B76422l6778l6238L4684r091K2327J6281M252M4404k833k9227J6489M054
13170C04746k7488n4355N4460L2265J7388j4849m3625o429N8937J8303J1915l9145
13158C12123n6005J3932L4405L4350M2288l4074L351k0026k48L7423Q756m2363
13146C33912k1475L9063K7254N231N6369O438N1559N6543l6164q2267m2302J3562
$$ y = [232015, 285540, 251186, 254585, 256512, 320241, 353547, 347260, 366622, 392273, 385861, 339123, 277456, 330388, 347378, 296668, 250197, 283598, 306507, 348338, 353767, 318177, 298121, 321859, 366032, 347267, 346032, 334821, 351182, 382572, 336876, 368632, 355690, 302265, 307069, 319268, 332593, 332963, 299381, 321502, 339391, 327360, 281066, 279632, 293647, 312281, 315584, 298494, 276422, 239644, 203406, 238090, 228999, 251326, 267607, 271859, 316263, 313430, 284203, 300692, 304746, 277258, 222903, 277363, 309628, 327016, 312167, 268542, 262113, 321050, 339353, 351268, 312123, 256118, 270050, 304455, 338805, 381093, 347019, 350370, 330344, 330096, 367519, 376275, 333912, 312437, 351500, 378754, 383985, 440354, 446792, 498351, 554894, 518730, 436463, 394161, 407723]
13134D07723o08L7331k332r16Q909k3891O277J9795P2365M4083L8985L8040L7459
13121F83220k9816K2677N8129j229J771O920J592n1136l2306j6275l5808J704
13109F09443p0265m4027j3558k049m774J06464O6939K3286P949j7102l7398J9802
13097F44710K6943n593q893l7752m7324L1624N2606j4838k709k6505j2698L6207
13085F35778k525K7273j1046j2546l0681J3733j3981J9065R492L4240m709j5395
13073F48698M2635l5995L2601K0906M3490J9861M3391J8323q599K6894j5382n6086
13061G80737M5337p309j2206k7611j9457L7185N6264J7629j890L4770j9081N8042
13049I42410R4398m0184r3483r1631m8109O8568K6479q095q9222M3940J23851
$$ y = [407723, 407115, 444446, 442114, 441198, 450107, 426216, 432493, 452288, 524653, 568736, 607721, 645761, 683220, 653404, 676081, 734210, 732981, 734752, 741672, 743264, 692128, 659822, 643547, 607739, 609443, 539178, 495151, 481593, 479544, 474770, 581234, 648173, 671459, 679408, 662306, 624908, 644710, 671653, 666060, 657167, 619415, 572091, 603715, 656321, 641483, 638774, 612269, 599571, 635778, 633253, 660526, 649480, 636934, 606253, 619986, 606005, 625070, 634562, 668802, 664093, 648698, 691333, 655338, 687939, 708845, 752335, 772196, 815587, 833910, 825311, 852205, 836823, 780737, 826074, 818765, 806559, 778948, 759491, 796676, 852940, 870569, 868679, 903449, 884368, 942410, 1036808, 996624, 903141, 811510, 763401, 831969, 858448, 850353, 761131, 805071, 928922]
13038I28922J1620M1662N8079L3107j7070q907N3113J9130O093L435M3702J8313
13026A191199J3385K2527N7767R16J4705K1398j236j2372k0251k5728K912j7810
13014A247412J0212L0770J8209J5738K7218j548K1074L8642J9838K8958l4662
13003A421861L7326Q0479n5485j2767J13592L6780M335L8729K2844N8166J6710
12992A762570j9132J5763O6745M4826J7123J1769L5962O1045L4135O1116J4944
12981B106866q677P385L3908K7298N8210P5981P3730k8046l987J1864L4709L2917
12969B422158N6240N370M737K7055K6609P5536L0726L4771O0073P0453J7883K0562
12957B852173l459M5550O3535N2667K3503M8376P0556J38823P9282j865J6949
$$ y = [928922, 940542, 982204, 1040283, 1073390, 1056320, 1047413, 1100526, 1119656, 1125749, 1129184, 1172886, 1191199, 1204584, 1227111, 1284878, 1285794, 1300499, 1321897, 1320661, 1308289, 1288038, 1262310, 1265222, 1247412, 1257624, 1288394, 1306603, 1322341, 1349559, 1348011, 1369085, 1407727, 1427565, 1456523, 1421861, 1459187, 1539666, 1484181, 1471414, 1585006, 1621786, 1626121, 1664850, 1687694, 1745860, 1762570, 1743438, 1759201, 1825946, 1870772, 1887895, 1899664, 1935626, 1996671, 2030806, 2091922, 2106866, 2098189, 2105574, 2139482, 2166780, 2224990, 2300971, 2374701, 2346655, 2342668, 2354532, 2389241, 2422158, 2478398, 2483768, 2488505, 2515560, 2542169, 2617705, 2648431, 2683202, 2743275, 2813728, 2831611, 2852173, 2848714, 2894264, 2957799, 3010466, 3033969, 3082345, 3152901, 3291724, 3371006, 3369141, 3386090]
12946C386090N5998M4232Q2520J59756J42589K5265K6525O0602R0536J26975J61577
12935D362665R8325R7801N0879M9563M7755J74527J27348O3073J03199J22787
12925E297922J31890J72507J82147J06496R7182J72270K20800J40639J29986J66296
12915F818135J94348J88631J85080J74959K20604K57507K06044K69358K46411
12906H761077K73896K45770L03847K92396K73827K78548L33236L80343L21246
12897A1464186L22575L51797M59383M34629M25477L88630M54613N13865M99509
12888A5314664M59303N15059N52335N22490N48739M71211N23391N88273O60850
12879B0156315O60260O26666N73965O48245O03541O57811N68301N26947N63380
$$ y = [3386090, 3442088, 3486320, 3568840, 3728596, 3871185, 3896450, 3922975, 3983577, 4074113, 4201088, 4362665, 4460990, 4558791, 4609670, 4659233, 4706988, 4881515, 5008863, 5071936, 5175135, 5297922, 5429812, 5602319, 5784466, 5890962, 5988144, 6160414, 6381214, 6521853, 6651839, 6818135, 7012483, 7201114, 7386194, 7561153, 7781757, 8039264, 8245308, 8514666, 8761077, 9034973, 9280743, 9584590, 9876986, 10150813, 10429361, 10762597, 11142940, 11464186, 11786761, 12138558, 12597941, 13032570, 13458047, 13846677, 14301290, 14815155, 15314664, 15773967, 16289026, 16841361, 17363851, 17912590, 18383801, 18907192, 19495465, 20156315, 20816575, 21443241, 22017206, 22665451, 23268992, 23926803, 24495104, 25022051, 25585431]
12870B5585431N19528N11572M58447L34313L94132M21490L63592L40730K45278
12861B9174513K11323J53058J06204q008r2856q1359j00149j79218k02598k64215
12851B8716695k49705l22232m10334l93418m33043l74229l76359m11750m86542
12842B5259083n02201m91702m87232m70470n59916n81529n62066m07612l71293
12833B0825062m36171l84785m55601n14562m45458l86163m52687m42791m16836
12824A6890008m40469l80736l38058l29572l21594k51043l04724m05618m20320
12815A3697874l26935k58637k46315l04346k54090l05019k99401k43161k47109
12806A1212861k03395k22211k37592k58052k50272k33828k09168j77854j74282
$$ y = [25585431, 26104959, 26616531, 27074978, 27409291, 27803423, 28224913, 28588505, 28929235, 29174513, 29385836, 29538894, 29645098, 29637090, 29544234, 29462875, 29362726, 29183508, 28980910, 28716695, 28466990, 28144758, 27734424, 27341006, 26907963, 26533734, 26157375, 25745625, 25259083, 24756882, 24265180, 23777948, 23307478, 22747562, 22166033, 21603967, 21196355, 20825062, 20388891, 20004106, 19548505, 19033943, 18588485, 18202322, 17749635, 17306844, 16890008, 16449539, 16068803, 15730745, 15401173, 15079579, 14828536, 14523812, 14118194, 13697874, 13370939, 13112302, 12865987, 12561641, 12307551, 12002532, 11703131, 11459970, 11212861, 11009466, 10787255, 10549663, 10291611, 10041339, 9807511, 9598343, 9420489, 9246207]
12797I246207j78426j55095j94917k29510j67593j43290j08070j29736k16964
12788G722606j68070j28245j44467j70210k18011j49166j56695j73861j10847
12779F303034p8864r0265j67205j15666q5136j02124j7432o8752j53414j10048
12769E314128j04189j23659j06854q7471o7281p8724r4411j31632p8518j26539
12759D314850o5189R322n9221j13598j26078q6336n7856p2927o4045k5790o1913
12748C591219p4155o189k4114p553n9011q4792n1576m6841m7328p6825p3979m2539
12736B996317J6040j02324o6647k7945k0075k4006n3207r6219m204m7689p2223
12725B497818j7467n3213j01509k6080l5171n0621m2510l2829k1565j2975n5642
$$ y = [9246207, 9067781, 8912686, 8717769, 8488259, 8320666, 8177376, 8069306, 7939570, 7722606, 7554536, 7426291, 7281824, 7111614, 6893603, 6744437, 6587742, 6413881, 6303034, 6224170, 6133905, 5966700, 5851034, 5765898, 5663774, 5646342, 5577590, 5424176, 5314128, 5209939, 5086280, 4979426, 4891955, 4824674, 4745950, 4651539, 4519907, 4441389, 4314850, 4249661, 4258983, 4199762, 4086164, 3960086, 3873750, 3815894, 3742967, 3678922, 3653132, 3591219, 3517064, 3510875, 3486761, 3479208, 3420197, 3335405, 3283829, 3236988, 3189660, 3112835, 3038856, 2996317, 3012357, 2910033, 2843386, 2815441, 2795366, 2771360, 2718153, 2621934, 2617730, 2570041, 2497818, 2480351, 2427138, 2325629, 2299549, 2264378, 2213757, 2171247, 2138418, 2116853, 2103878, 2048236]
12714B048236L031k6589J3129q347j4454o4856j8866m7656p0019m8495k7374q4632
12702A653108Q08P2352L8273l7110q3764l7160j605q768n4147k3453J4367J4931
12690A547832o2776n6704n7591m0875P9586J7159l4463l5221p0238j9251N5908
12679A323366N2103m0415n8808k9394j9191N275l4132n7600m3616J8109R603L405
12667A128705J8500m2138q6629J7033J6344n8688m9548p015J7262k0903L0605
12656I63528M2632l602m7530n1637L1520j4674j7623J2515j3639j6431P0949K7875
12644I83883r964n8154L2592n708n4552n2803m9710l3351O535M4836K1664M290
12632H29558k9728j2842q176Q914L2467K0600m313N127o2275k4845K3083K6141
$$ y = [2048236, 2051267, 2024678, 2037807, 2029460, 2015006, 1950150, 1931284, 1883628, 1813609, 1765114, 1737740, 1653108, 1653916, 1726268, 1764541, 1727431, 1643667, 1606507, 1604902, 1596134, 1541987, 1518534, 1532901, 1547832, 1485056, 1428352, 1370761, 1329886, 1409472, 1426631, 1392168, 1356947, 1286709, 1267458, 1323366, 1375469, 1335054, 1276246, 1246852, 1227661, 1232936, 1198804, 1141204, 1097588, 1115697, 1125300, 1128705, 1147205, 1105067, 1018438, 1035471, 1051815, 993127, 943579, 936564, 953826, 932923, 963528, 1006160, 1002558, 955028, 903391, 934911, 920237, 902614, 915129, 901490, 885059, 956008, 983883, 973919, 915765, 948357, 942649, 888097, 835294, 785584, 752233, 758768, 803604, 825268, 829558, 799830, 786988, 778812, 787726, 820193, 840793, 836480, 841607, 779332, 754487, 777570, 803711]
12620H03711n9153n2667J4285J7462j633l9006p0394j3551K2815l6414j06003
12609D79452m0486P0394J45372K0166K5381Q9680N9099k7872L5852K7969q661
12598H76346m3986l5731k6672j9497o7096m7920n824o460j9048J5523J3875q0433
12586E53077n9616J0654K0518K8444l157j1075N111k2963l9423k3253J6439P4731
12574E49487k9616j09184n3205M3774k1649p120J8913k185J9463J3250n942m8985
12562C67001j6639K4186L5428L776L2078M226k2846k221p638L9572l7747p5876
12550C43300j5056K5542l5267M0214K9748m3152P382p409j2025m9896K201Q4940
12538C70522Q779n8l7390k9885M3944L3272J1618j5278q263m156m9063l6781O1094
$$ y = [803711, 744558, 691891, 706176, 723638, 722005, 682999, 612605, 599054, 621869, 585455, 479452, 438966, 509360, 654732, 674898, 700279, 789959, 849058, 821186, 857038, 885007, 876346, 832360, 796629, 769957, 750460, 683364, 635444, 629620, 623160, 604112, 619635, 633510, 553077, 493461, 504115, 524633, 553077, 549920, 538845, 543956, 520993, 481570, 458317, 474756, 549487, 519871, 410687, 357482, 401256, 379607, 372487, 391400, 389215, 408678, 421928, 415986, 367001, 350362, 374548, 409976, 413752, 445830, 450056, 427210, 424989, 417351, 456923, 419176, 343300, 328244, 353786, 318519, 358733, 388481, 345329, 352711, 345302, 333277, 283381, 285582, 370522, 379301, 379243, 341853, 311968, 355912, 389184, 400802, 385524, 377261, 373105, 324042, 287261, 348355]
12525C48355M5570P095k3362l5661k6536l3870j0255k742K9696J200N6118k4062
12513C31546k6139J2332P1038K9065p1703k321N1956K65o2495r6259k3715P8804
12501B92374k3021j4707K9757J3978J7697k9525l3227M9421Q77K2225k5055k9611
12489B71183j6333j293n1548n838N4513L2293j8325j5133o338L8207M5652N1477
12477C78517o3486o2808k2760k4475j8473M4921M0001j8269k1347m6977K6899
12466B11743P1743P95m916N2501L6019K8814k2145n6281k7008o4794J5314n494
12454B36291k0288N3167j0949r099j8601k866K0210j0435j3613N3816N8116L2271
12442C68020k9744l1998K4248N204l318N8120J814q2498j8824M7659m5616k9819
$$ y = [348355, 393925, 401020, 377658, 341997, 315461, 281591, 271336, 268594, 298290, 299490, 355608, 331546, 305407, 317739, 388777, 417842, 346139, 343818, 395774, 396039, 333544, 237285, 213570, 292374, 269353, 254646, 284403, 298381, 316078, 286553, 253326, 302747, 303624, 325849, 300794, 271183, 254850, 253557, 202009, 196171, 250684, 282977, 264652, 249519, 243181, 281388, 327040, 378517, 315031, 252223, 229463, 204988, 186515, 231436, 271437, 253168, 231821, 184844, 211743, 283486, 284281, 279365, 331866, 367885, 396699, 374554, 318273, 291265, 226471, 241785, 236291, 216003, 269170, 258221, 249122, 230521, 227655, 247865, 237430, 223817, 277633, 335749, 368020, 338276, 306278, 330526, 335730, 332412, 390532, 392346, 309848, 291024, 338683, 293067, 263248]
12430B63248L1521o538j5570o4839n8925M6134Q6402J4158o5708J5167l561L6532
12418B78021K2887n4957j0801K8946L7511J1214n5420m5615J9744j0845M3315
12407B64000L3686L083m3502m2180l4554R595N8058J3610k2618L8L0494k2999
12395B46711M4292J6535p8548n3122M56J13806Q8619q231n5852o3172j2381J1405
12383B50518j6614K6691o036J3460M6562j6335n7215o8950M827k548M6667j2194
12371B08833J3325j6253l1587R460l795k0548j4813N1020o6964J1328J01906j1842
12359B30070n9496N919K1557k2323l2951M4973k7116l9246J7479K1642L3702k6950
12347A67260J601o936N1550k4916j2007j4478l1855j5718M361P661k970J2628
$$ y = [263248, 294769, 288231, 272661, 207822, 148897, 195031, 281433, 295591, 229883, 245050, 241489, 278021, 300908, 245951, 235150, 264096, 301607, 312821, 257401, 211786, 231530, 220685, 264000, 297686, 300769, 257267, 215087, 180533, 190128, 248186, 261796, 239178, 239216, 269710, 246711, 291003, 307538, 228990, 175868, 176324, 290130, 378749, 370518, 314666, 251494, 239113, 250518, 233904, 260595, 254559, 268019, 314581, 298246, 241031, 172081, 176908, 174360, 221027, 208833, 222158, 205905, 174318, 183778, 179983, 159435, 144622, 195642, 128678, 140006, 241912, 230070, 170574, 176493, 198050, 175727, 142776, 187749, 160633, 121387, 138866, 160508, 194210, 167260, 168861, 161925, 213475, 188559, 176552, 162074, 130219, 114501, 118862, 126523, 123553, 136181]
12335A36181j9397m5249m002k6171k1464J734N2729M6157L2235j7474q666L0295
12323A56908p47q482M5473J7853k1210K1380R964l4377j7433o1147k4576j1209
12311G2397k9620K5529M2103K1487j5145k8663p037K6943M8019J847j9457n5252
12299H3151J0802M5251p633k0532n182K505l8764j4625P1096j8923m0470p254
12287E9422J4189l0448k7429N9768j3124o0900j3455N8767J7174J9899j1312j7784
12275E4767r0378l4984O9660R1700L2734N7459N6975q9421o8919Q657Q627K6852
12263A23729Q340r78K4137J9971m3738j0272j4674m2348m2981j7371M7674O1794
12251A13283M5850k4072k0170m5240K864k5257k4097J7715K6026P805l1016O0921
$$ y = [136181, 116784, 71535, 67533, 41362, 19898, 21632, 74361, 120518, 152753, 135279, 126613, 156908, 156161, 147679, 193152, 211005, 189795, 211175, 221139, 186762, 169329, 108182, 83606, 72397, 42777, 68306, 110409, 131896, 116751, 88088, 81051, 107994, 156013, 157860, 138403, 83151, 93953, 139204, 131571, 111039, 105857, 108362, 69598, 54973, 126069, 107146, 66676, 59422, 73611, 43163, 15734, 75502, 62378, 1478, -11977, 46790, 63964, 83863, 72551, 54767, -35611, -70595, -935, 90765, 123499, 180958, 237933, 148512, 79593, 88250, 96877, 123729, 132069, 131091, 155228, 175199, 131461, 121189, 106515, 64167, 21186, 3815, 51489, 113283, 159133, 135061, 114891, 69651, 72515, 47258, 23161, 40876, 66902, 74707, 43691, 104612]
12239A04612J01852o4535q7207k4296K8955J631K530L8768K654J4715r0810n8034
12227b9165L3505L1665k1752m964J985Q278K7403M2674M8673O5127l8061o8344
12215I7024q913m8950o7188l5871J5348P9190K8466M2378l3953o8664m6133j2918
12203f0184P9043R4852j9960k6296j387L299j5823K9854j6857l6329L8532l230
12191F5514O596K5254J4720k0058r1504l6335M3288J0509Q060n036O196J7055
12179D4259m706M2188M1662K7471n8462m5791m933J373n770o2440K0865N7581
12167E3297J5639k2471l1435k260j6666J9513k6111j9025m420j1574k4792N352
12155f4953P1030K1130J0176j7921O0652J6336K4021J0216q843o3393J4633K5974
$$ y = [104612, 206464, 141929, 54722, 30426, 59381, 61012, 63542, 102310, 104964, 119679, 28869, -29165, 4340, 36005, 14253, 9289, 11274, 19552, 46955, 89629, 138302, 203429, 165368, 97024, 88111, 39161, -28027, -63898, -48550, 30640, 59106, 101484, 67531, -1133, -47266, -60184, 18859, 113711, 93751, 67455, 66068, 69367, 53544, 83398, 66541, 30212, 68744, 65514, 72110, 97364, 112084, 92026, 522, -35813, 7475, 17984, 26044, 21008, 27204, 44259, 39553, 81741, 123403, 150874, 92412, 46621, 41688, 43061, 37291, -25149, -4284, 53297, 68936, 46465, 15030, 12770, -3896, 15617, -10494, -29519, -33939, -45513, -70305, -64953, 6077, 27207, 37383, 19462, 80114, 96450, 120471, 130687, 121844, 58451, 73084, 99058]
12143I9058m3692j9203m679N5417N1811J8202m2679l9039j0723Q015K1069l6328
12131E7229O613L9079l8980r665K3245p723J1263k148K0296l9237k3400n495j2728
12118A8349k1617O8120P6460p4607r5881m7415K4546O4827N9616k4023K7282M1677
12106A17334K7246K8268m0186q4222K0818K2348q91l8601J808k4355K7697M9773
12094A07037l3752o7454J0133P3938k3762l8925N202M644k391k0322k8592M1068
12082B6824O852j1010J5776k053n848j6371N5761m8167J5445k1158p653j5506
12070g108J3360O7289N6697m7382n0216j933L8669O8592k9526p1197n8380p637
12058b8772O5526J2290k0809k7132k7078K5205k1272k4953l2856j3296M6746L2920
$$ y = [99058, 55366, 36163, 31484, 86901, 138712, 156914, 114235, 75196, 64473, 72488, 93557, 57229, 63842, 102921, 63941, 54276, 77521, 69798, 81061, 78913, 99209, 59972, 36572, 31077, 18349, -3268, 64852, 141312, 66705, -29176, -76591, -52045, 12782, 72398, 48375, 75657, 117334, 144580, 172848, 132662, 48440, 69258, 91606, 90715, 52114, 53922, 29567, 57264, 107037, 73285, 5831, 15964, 89902, 66140, 27215, 32417, 37061, 34670, 14348, -14244, 26824, 33676, 22666, 38442, 36389, 30541, 14170, 69931, 21764, 37209, 16051, 8398, -7108, 6252, 73541, 130238, 82856, 32640, 30707, 69376, 137968, 108442, 37245, -21135, -28772, 36754, 49044, 28235, 1103, -25975, -770, -22042, -46995, -79851, -93147, -46401, -13481]
12046a3481l9394J0049P689R647M1386j2926M87O198j4718J5142q662l3550Q899
12033b3234O83r373j5756q979O8207R1114l5358r9322k2246N0245J6799j7064
12021d284j3423L5213p532l5049K5453l0935k588j1119k7471P7126L7197K2727
12009F5315J203k4585n788K6353M0966J193j7357J1726k6681o7124l3707n6970
11997h5456j3678L5582j2132Q267K2030L1642P5097N2722r39o7204p8819N032
11985b7856P7491j2980p528R0813P342p4305o9712k9353O5385L1647Q341O093
11973F5378n4058k2017M2323J205k6854j228O588N9579j656k4459o9639l8573
11961f3411J4661P7118N3734J0097k1290o0190Q334J9180J2978M6922o2205o7475
$$ y = [-13481, -52875, -42826, -35137, -25490, 15896, 2970, 3457, 9655, -5063, 10079, 1417, -32133, -23234, -22551, -31924, -47680, -56659, 11548, 102662, 67304, -32018, -54264, -4019, 12780, -4284, -17707, 17506, 9974, -25075, 378, -30557, -33145, -44264, -71735, 5391, 42588, 65315, 66518, 41933, 36145, 62498, 103464, 104657, 87300, 99026, 72345, 5221, -28486, -85456, -99134, -63552, -75684, -67417, -45387, -13745, 61352, 114074, 113135, 45931, -32888, -27856, 49635, 36655, 29127, 119940, 127282, 52977, -16735, -46088, 19297, 50944, 59285, 65378, 11320, -10697, 31626, 32831, 5977, 4749, 11337, 70916, 69260, 44801, -24838, -63411, -48750, 28368, 82102, 92199, 70909, 10719, 19053, 38233, 51211, 98133, 35928, -31547]
11949c1547l5318N0032O8640k1347o1533j7657J7154M0432J6051l9274J0043J5959
11937A1635J4505l0613p7418M0794Q6048M6806n2134p6439n5965m3912m9511J735
11925a84469R6886N5317K7130M903K5285l7962m3878L4255M4680l4041p0377j2144
11913i4415K3966n268m8169j9263L8465Q1700J7232K1097P5723Q052p2910r4651
11901f8441J9558R750P457o2752j1333K1853L1650J139K9527k5334M013k0959
11889f3872P2610L7662l8959k4427M5781L1586n4787K5872p857k0282P8596p501
11877G4422k4730J3005n3696p5069p1312l0200J05820M9416K4531n0805n0372
11866h8990O3212M4429m9594k1926N694m0350k730K9969M09j79M4061Q1337L3085
$$ y = [-31547, -66865, -16833, 51807, 30460, -31073, -48730, -31576, 8856, 24907, -14367, -4324, 11635, 26140, -4473, -81891, -41097, 44951, 91757, 39623, -36816, -92781, -136693, -186204, -184469, -87583, -32266, -5136, -233, 25052, -12910, -56788, -22533, 22147, -11894, -82271, -94415, -70449, -75717, -123886, -143149, -104684, -22984, -5752, 15345, 91068, 99120, 26210, -68441, -48883, -39133, -31676, -94428, -105761, -83908, -52258, -51119, -21592, -46926, -42913, -63872, 8738, 46400, 7441, -16986, 28795, 60381, 5594, 31466, 23609, 3327, 81923, 74422, 49692, 62697, 9001, -66068, -137380, -167580, -61760, -12344, 12187, -38618, -88990, -25778, 18651, -30943, -52869, -47175, -87525, -90255, -60286, -59877, -60056, -15995, 65342, 98427]
11853I8427M9852k0324j3882m1541k9593M7283L3110n3971k5528o6702j5737j2337
11841e0943N9557k2737l4702K8745P3297J028o2537M841Q233r478p670J4735k0025
11828a7656j3265m2937j5033J7413Q652N4879J9585k6973K757K4173q6021m7353
11816a21779L886p197N7377p982N962O3789N7220j3088j3356l7423N5922Q108
11804E1439r3999k4377j5230N0259p946J900j2685j2909M227l6678J0403k549
11792h8145n8777O4967O7170J174o3064J9063N7360j0885l6543M8771L0937n8406
11780b6378J8994K2065L2864m718m3771p181j840L953j9421k7742k4209P254K1676
11767d8454M8944K3940K7417j9060r9390K1285L5061K4337o1757p1714K80O7279
$$ y = [98427, 148279, 127955, 114073, 72532, 42939, 90222, 123332, 69361, 43833, -22869, -38606, -50943, 8614, -14123, -48825, -20080, 53217, 54245, -8292, -3451, 4782, -4696, -12366, 2369, -17656, -30921, -73858, -88891, -71478, -62826, -7947, 11638, -15335, -12578, 11595, -74426, -121779, -117893, -125090, -67713, -75695, -69733, -5944, 51276, 38188, 24832, -12591, 43331, 51439, -42560, -66937, -82167, -31908, -39854, -37954, -50639, -63548, -59321, -95999, -85596, -88145, -146922, -81955, -14785, -13611, -76675, -57612, -252, -11137, -47680, 1091, 32028, -26378, -7384, 14681, 47545, 42827, -944, -8125, -9965, -6012, -25433, -53175, -77384, -70130, -48454, 490, 24430, 51847, 32787, -66603, -45318, -10257, 14080, -47677, -119391, -119111, -51832]
11755e1832J9675o767J0657l3909L6204J4637J7943O052J1071M2430K4964n208
11743H5917k1208j2088l0867o585J169j774J1973j832r344m802Q178m7710j9285
11730d8258K4927Q835J8649M9997J4798o4911k7136j177l1624j871o752k5869
11718i0392M3865M6075l999k727N9596P3146Q8749M54l3554n6686j22058m3190
11706d0721Q062l7198J0381N2639K050K1052m5596K1712l7267m3003N8776K2874
11694f239O6923k489K3134k5071l8755N568j5161p486l5465n131P5962J2819m3551
11681E058k0266L3278j0421l6985j4994K9507n015l1105K7764J8254N368l6518
11669c6075k7240L2064O950N2394J3183k0510N3763o5k225k0045m6836o2217n9464
$$ y = [-51832, -32157, -38924, -28267, -62176, -25972, -11335, 6608, 12660, 23731, 66161, 91125, 85917, 64709, 52621, 21754, 15169, 16338, 14564, 26537, 24705, 15361, 10559, 18737, -28973, -48258, -23331, -14496, 4153, 54150, 68948, 4037, -23099, -24276, -55900, -57771, -64523, -90392, -46527, -452, -4451, -7178, 52418, 125564, 214313, 214767, 181213, 124527, 2469, -40721, -32659, -69857, -59476, -6837, -4787, 16265, -29331, -7619, -44886, -87889, -29113, -6239, 60684, 58195, 81329, 56258, 17503, 23071, 7910, 424, -35041, -40172, 35790, 48609, 5058, -15208, 18070, 7649, -29336, -44330, -14823, -19838, -50943, -23179, -4925, 443, -36075, -63315, -31251, -24301, 28093, 41276, 20766, 74529, 74464, 72239, 52194, 5358, -56859, -116323]
11656a16323Q438L7566R2434L755k9771l9200j4113r280k9186l9672K5013L8098
11644g2241N0362r103m5747l0539l6037L3414O2486J3628p187L971N3874m819
11632A2062n404j3268j4067K3033L1455L4708k2830l5173O892o263K6373L7039
11620G4557o7293o9991N2045J8707J8598m7273m4912J0645M7716k2099L379J7242
11608h679J3113n7898m2639M4802Q652J8930O0772j9420k0436L983Q167J8000
11596B7347k929k7279j9925m785k5921L3097K0546N211n5176k7476j7572K5782
11584f9080m9293J3895P6716J01237K9623l1080j01112k4533O857k1126N707L4905
11572b7284k7452j7010L8952J9028l1535j8718m0661M2405M6590J16176K5661
$$ y = [-116323, -107885, -70319, 22115, 25870, -3901, -43101, -57214, -66494, -95680, -135352, -110339, -72241, -21879, -30982, -76729, -107268, -143305, -109891, -47405, -33777, -40964, -36993, 16881, 12062, 6658, -6610, -20677, 2356, 33811, 68519, 45689, 10516, 17408, 11145, 37518, 74557, 7264, -62727, -10682, 8025, 26623, -20650, -65562, -54917, -7201, -29300, -25921, -8679, 4434, -53464, -96103, -51301, -42649, -23719, 37053, 17633, -2803, 1180, 9347, 27347, 24418, -2861, -22786, -27571, -53492, -20395, 151, 5362, -49814, -77290, -94862, -69080, -118373, -104478, -27762, 73475, 103098, 72018, -29094, -53627, -46770, -67896, -62189, -27284, -54736, -71746, -32794, -13766, -45301, -64019, -104680, -62275, -15685, 100491, 126152]
11561A26152r6985n0238J409o429j5171N50O526l3591K1572M723N8668L3783q375
11548D2594j8510J2403L9905n3564j7762l7379o11P9753Q4883q3863p9240L9911
11536H520J3484J3523n6275j0236p7136K3509L8883L671J7669J7696K9320J8986
11524D1614l3993J6493k4253m8202J2236N2554j0354j9430j6112K1660k1395J4909
11512a4273P538k8945L1663j5704k1317J2537J5672M9582o544j4579L4989M8962
11500I9581m1532K3782l227j3336l0782j1807n8386m2775k9762O5566J9641L9324
11488A6287P0256m208l046q5392q023J5221J3185j4585j6729L899j0712K4203
11476C56M7683j6836L252j2089R677j7808j0779L1939l2646k3617M0690K1504
$$ y = [126152, 29167, -21071, -19662, -26091, -41262, -40712, -34186, -67777, -46205, -41482, 17186, 50969, 42594, 24084, 36487, 76392, 22828, 5066, -32313, -32924, 46829, 131712, 47849, -31391, 8520, 22004, 35527, -20748, -30984, -108120, -84611, -45728, -42057, -24388, -6692, 22628, 41614, 7621, 24114, -139, -48341, -36105, 16449, 6095, -13335, -29447, -7787, -29182, -14273, -6735, -35680, -4017, -19721, -41038, -28501, -12829, 36753, 30209, 15630, 50619, 99581, 58049, 81831, 78604, 65268, 34486, 22679, -35707, -78482, -108244, -42678, -23037, 16287, 86543, 82335, 79289, -6103, -14126, 1095, 14280, -305, -17034, -13135, -23847, 356, 48039, 31203, 34455, 22366, 32043, 14235, 3456, 35395, 2749, -20868, 19822, 41326]
11464D1326q5295L958l90L2890O5026j9464K0360O2556p1621o1044m453N861L4740
11451B4450J8982K615l2403J5609L2536m862o637m0097k3556o742k5700M1957
11439c848L0798j9743J1080L1381J5677j9141L091n733L9823L1047K9358N134
11427A48924m0066j0126k3221n3552M0426J5200p7610k5357O3225M2177m5954
11416C4066o1133K2714L156M7918O9134L5923j2471k2744o0086l4032m615J6250
11404C4080l3439k1954n8291j5308O0779R1067L9677M1066n9001j5121o0719l7783
11392c4947K8894O0637J7005P610j4744j2341O968N380l2598L792K1219j7627
11380C9248R539M2462m3225n5161m0147M143N9042L1819L9165J566l4561j2378
$$ y = [41326, -43969, -40011, -40401, -7511, 57515, 38051, 58411, 120967, 49346, -11698, -16151, -10290, 24450, 43432, 46047, 13644, 29253, 61789, 56927, 50290, 10193, -13363, -20105, -45805, -3848, 26950, 7207, 18287, 49668, 65345, 46204, 49295, 43562, 83385, 114432, 143790, 148924, 108858, 98732, 75511, 21959, 62385, 77585, -25, -25382, 37843, 80020, 34066, -27067, -4353, -1197, 46721, 115855, 151778, 139307, 116563, 56477, 22445, 17830, 34080, 641, -21313, -79604, -94912, -34133, 56934, 96611, 137677, 78676, 63555, 2836, -34947, -6053, 54584, 71589, 79199, 64455, 52114, 59082, 64462, 31864, 35656, 56875, 39248, 48787, 91249, 48024, -7137, -47284, -43141, 15901, 47720, 86885, 88451, 53890, 41512]
11368D1512m639r265J4673k6540L6944P900n1965o210j170K5461K2840p924N410
11355D7027j8264l1504M6958j390j0150O374J02697N9872l9497n6205l6929n3535
11343A5454O613m655J3646M6729J0242r4434l3230P8057J0314k4526m5698M6502
11331B5014J5057k5187L991Q433q0170l5816N2748K7552R87k2744k8817m5871
11319a04823l2735J1912k552M3105L1327j8299L1286K704O5385N1654l6045q3768
11307d0849l0459l7517K1987Q0213N803j864K2164K1166p1067m3456O2419M2784
11295C1324J086L2390L3410J4596P329l2391j9811K281l4001o1141k4085K9958
11283a9055m1405N6232M3713K2410O068J1063l1959j9796j6900j763O635L8027
$$ y = [41512, 36873, 27608, 42281, 15741, 52685, 60585, 8620, 2410, 1240, 26701, 49541, 41617, 47027, 28763, -2741, 44217, 42827, 32677, 39051, 141748, 201620, 162123, 105918, 68989, 15454, 22067, 17412, 31058, 77787, 88029, -6405, -39635, 38422, 48736, 24210, -21488, 25014, 40071, 14884, 18875, 27308, -52862, -88678, -35930, -8378, -7391, -30135, -58952, -104823, -137558, -125646, -128198, -85093, -53766, -72065, -40779, -38075, 27310, 78964, 42919, -40849, -71308, -108825, -86838, -6625, -822, -2686, 19478, 40644, -30423, -73879, -11460, 31324, 32410, 64800, 98210, 112806, 120135, 87744, 67933, 70214, 36213, -24928, -49013, -19055, -60460, -4228, 39485, 61895, 67963, 79026, 47067, 27271, 10371, 8608, 15243, 53270]
11271E3270O9923j1806l8477j9603J746m581j4801m8878M5763J5198j9444j4292
11259A4018N790K7763m096O4711L8866o1603p1830L6294K5584L4291j6710l8531
11247E4547m5675p8686k2601R9288Q0543L5854k1135k0184j06431p831L8574J8361
11235B4624j6688p6820j829N8976N6359L6019k1582L4856Q419K0506l9218j7886
11223F5736o0810k5481O555o1996m6350r696O3521L52M2978Q3588O8712J6149
11211A43258m1140J2860n8843k8472J0054j8859K9377J6674l9887m0149K7956
11200A2829P0943M2157l220j5758n1663k4039K8947J0050p6463j00213K4811N8283
11188b3336K0852K5958L6791N8037J6762N731m7226l714j4120J0173l4762r410
$$ y = [53270, 123193, 111387, 72910, 53307, 55053, 50472, 35671, -13207, 32556, 47754, 28310, 14018, 19808, 47571, 43475, 108186, 147052, 85449, 13619, 49913, 75497, 109788, 93078, 54547, 8872, -69814, -92415, 6873, 87416, 123270, 102135, 81951, -24480, -32311, 6263, 24624, 7936, -68884, -70713, -11737, 44622, 80641, 59059, 93915, 102334, 122840, 83622, 65736, 4926, -20555, -14000, -75996, -122346, -132042, -68521, -68169, -25191, 58397, 127109, 143258, 102118, 114978, 56135, 27663, 37717, 18858, 48235, 64909, 25022, -15127, 12829, 83772, 125929, 122709, 106951, 55288, 31249, 60196, 70246, -6217, -106430, -81619, -23336, -2484, 23474, 60265, 118302, 135064, 140795, 93569, 89855, 75735, 85908, 51146, 41736]
11176D1736j3613k965o045L7177Q0187N6499K8732J19929J40842J97122M46287
11165A125888N40776M70819L11501j69826o33596n51491k99622j71289j42814
11156D80346m8886l0653q1934m3147j855r043n6047o2695M894N4933P6697M4214
11144C26824o0224o5845Q41J917m3319q4608L1799K0833o4963p4626k9814P9551
11132C8366N2790L0053J099J9067m1082m934o481m776J8185J2220k3076j9831
11120G1600J5183L191K5127n5004l2381J9965L6305m496q3898o311N9280K522
11108E1083l8171M0323l6826k9494m635J2792j764Q7318k2490l4649L807J3270
11096D0564j2793n5367R172o101K9657K4906q664L3763j9946j3299m1751p588
$$ y = [41736, 28123, 25158, 19113, 56290, 136477, 192976, 221708, 341637, 482479, 679601, 1125888, 1666664, 2137483, 2448984, 2279158, 1645562, 1094071, 794449, 623160, 480346, 431460, 400807, 318873, 275726, 273871, 264828, 208781, 146086, 150980, 205913, 282610, 326824, 266600, 200755, 201596, 203513, 160194, 75586, 107385, 128218, 63255, -11371, -41185, 38366, 91156, 121209, 122308, 141375, 100293, 95359, 88878, 84102, 102287, 114507, 91431, 71600, 86783, 89974, 115101, 60097, 27716, 47681, 83986, 79490, -4408, -10719, 48561, 51083, 12912, 53235, 16409, -13085, -17720, -4928, -6692, 80626, 58136, 23487, 27294, 40564, 27771, -27596, -18424, -24525, 5132, 30038, 21374, 55137, 35191, 21892, -19859, -27447]
11084b7447M2562q616K483O3973q0358m9374N174O2297q070j6413j5025L6983
11072H169M9368o389n6368K754M3430j9059k3207l2626p063L7448M7813l5582
11060H688j0586P846r280m0477M896N2783j7781o7229M1372J805r34L3226L3259
11047C7588m740l1244m8902l5849R424R299K452O9912M8116l6758q1005n683J8370
11034d9020K062N356P637k2196J3876J5414k9684M5656L8211m745k561j4632r2355
11021h6981j9625P2822N7851R9P5365k0948L4892J1749l8121l8626K5015J1803
11009H5295l3796N1960N9413j2618N307q079o5598l427k9566R821J0824k158P5752
10996A43130K470k2891O2122J4460l197n6540k0282r385K1416J839j3735m8990
$$ y = [-27447, 15115, 6499, 8982, 72955, -7403, -56777, -51603, 10694, 2624, -13789, -28814, 8169, 57537, 51148, -5220, -2466, 40964, 21905, -1302, -33928, -40991, -3543, 44270, 8688, -1898, 5948, -3332, -43809, -38913, 13870, -3911, -71140, -29768, -27963, -28897, 4329, 37588, 32848, 1604, -47298, -83147, -73723, -64424, -61972, 7940, 56056, 19298, -61707, -67390, -49020, -46958, -41602, -33965, -56161, -42285, -26871, -56555, -10899, 27312, 22567, 20006, 5374, -86981, -106606, -33784, 24067, 24166, 99531, 78583, 113475, 125224, 87103, 48477, 73492, 85295, 51499, 103459, 162872, 150254, 155561, 147482, 81884, 78457, 48891, 58712, 69536, 67378, 143130, 145600, 122709, 184831, 199291, 196094, 139554, 119272, 109887, 131303, 133142, 119407, 70417]
10984G0417j8800l3357o890l6082k923L2505q170J1046j4040j2448l4868M2126
10972a1484Q848K5292P0591P621J5253j9108l2027l3345J3035m0093k6799o2675
10960h4891j1884P9732J9129p879N1232J5583M5277J0936q4644p1327N5194J6356
10948C2814j408k3017m5537K6940k9007m4438q7390M4154O6859R2043O3512q0165
10936A5360j6367L7595K1396M8960M6504n8491l655k2586l7281n6174P483J4678
10924b578N4966M2959P042L7964J3427k1787n0952k5362j9991l354l0689J0826
10912A2471M9575j3324l0015l8548j0851L3401P5283N8594j4945o5814n8750m978
10900g901N8814L8497M5192O654k1508K9670M7414k6618l0664L191K0242N4065
$$ y = [70417, 51617, 18260, 11370, -24712, -27635, 4870, -3300, 7746, -6294, -18742, -53610, -11484, -2636, 22656, 93247, 100868, 116121, 97013, 64986, 31641, 44676, 4583, -22216, -84891, -96775, -17043, 2086, -5793, 45439, 61022, 106299, 117235, 32591, -38736, 16458, 32814, 31406, 8389, -37148, -10208, -39215, -83653, -171043, -126889, -60030, 32013, 95525, 15360, -1007, 36588, 57984, 106944, 153448, 94957, 91302, 68716, 31435, -24739, -17256, -2578, 52388, 95347, 102389, 140353, 153780, 131993, 81041, 55679, 35688, 32334, 1645, 12471, 62046, 48722, 18707, -19841, -30692, 2709, 77992, 136586, 121641, 55827, -2923, -7901, 50913, 89410, 134602, 141256, 119748, 149418, 196832, 170214, 139550, 142741, 162983, 217048]
10888B17048J3770L7470J13152K27153K07745J84516M9654J11388L1967q2219
10878A111644j69604j94610j08870j08670k1521J0073k587o700M4210k4320o1298
10867D67747n4707j277N2866J17844J24730O7966K6613o9737m8860k182l5182
10856F45821R095j6106o6531L757L832M99L7868L4787J4343n9497o4625Q406N858
10843E57507Q8841O5563n3050p1801m8389O598K0249O7227J8888N0021m4203o2674
10831E94777R044N7303k12l2461p507k8966j3366m541K4465M3151L7040L6949
10819G15676Q4209R9936J85519K19944J25642N08j38157k66794j58268j02687
10809G65528o3188Q398M3511P6432P2165O2066m212K1011M223J2783J5693R4003
$$ y = [217048, 230818, 268288, 381440, 608593, 816338, 1000854, 1050508, 1161896, 1193863, 1111644, 942040, 747430, 638560, 529890, 508369, 518442, 515855, 509155, 553365, 529045, 467747, 413040, 411763, 464629, 582473, 707203, 775169, 801782, 732045, 683185, 681003, 645821, 654916, 638810, 572279, 576036, 579868, 580367, 618235, 653022, 667365, 607868, 543243, 551649, 557507, 646348, 711911, 658861, 587060, 538671, 545269, 565518, 632745, 651633, 701654, 657451, 594777, 603821, 661124, 660912, 628451, 620944, 591978, 578612, 574071, 598536, 641687, 678727, 715676, 799885, 899821, 1085340, 1305284, 1430926, 1431434, 1293277, 1026483, 868215, 765528, 702340, 710738, 754249, 830681, 902846, 964912, 960700, 981711, 985934, 998717, 1014410, 1108413]
10797A108413L6190J03341P5608j2537m5048k6392l8092N0897J17699J62052J30138
10786A662269J55504J13224O0869Q4232J23203J31076J16511K34717L91196N74056
10776C646857P24453Q34973P24405M77234P987j54830J06923M33750O73484Q65706
10766H340942R54430J019410J334674J830014K304831K926542L835720N453093
10758B7999656P912935J1788749J8363875L0939216N6397986R5879734J16032156
10751C65314307Q3511617J4431505r0264416j22811372q1756631m6492153k7133260
10744I4799597j7025507j1652596q468966o263785m732813l748680l091699k516985
10736C7298566k130004j675472j228273q80796o26625p18557r34739r71251p41142
$$ y = [1108413, 1144603, 1247944, 1323552, 1311015, 1265967, 1239575, 1201483, 1252380, 1370079, 1532131, 1662269, 1817773, 1930997, 1991866, 2076098, 2199301, 2330377, 2446888, 2681605, 3072801, 3646857, 4371310, 5206283, 5930688, 6407922, 6415909, 6261079, 6368002, 6801752, 7475236, 8340942, 9295372, 10314782, 11649456, 13479470, 15784301, 18710843, 22546563, 27999656, 35912591, 47701340, 66065215, 97004431, 153402417, 249282151, 365314307, 448825924, 463257429, 372993013, 250181641, 168425010, 121932857, 94799597, 77774090, 66121494, 57652528, 51388743, 46655930, 42907250, 39815551, 37298566, 35168562, 33493090, 32264817, 31384021, 30757396, 30038839, 29104100, 28132849, 27391707]
10727B7391707n49324p18070j038004j392575j327786r89293q25057p68626p21591
10718A9061381o94680o86003o16824o47750o15575m84147m70800n63591m71508
10709A3810503l91833l65499k95099k73476k69720k82645l27931l70166m51088
10700A0783046n15650l78661k74378k15287j81639j75482j58256j59063j65380
10691H559250j51216k33889l23555l12563k66227k22575j93590j73127j73651
10682F508857j38255j66254j93264j94878j15494j46996j38933j37957j26089
10673E150737j54748j44602j54473j71825j50545j03368o5754j0284k5838j42757
10663D026543k12556j75183j00838r7898p0987j24480r8400m0123k0249j06559
$$ y = [27391707, 26842383, 26124313, 25086309, 23693734, 22365948, 21376655, 20551598, 19782972, 19061381, 18366701, 17680698, 17063874, 16416124, 15800549, 15316402, 14845602, 14282011, 13810503, 13418670, 13053171, 12758072, 12484596, 12214876, 11932231, 11604300, 11234134, 10783046, 10267396, 9888735, 9614357, 9399070, 9217431, 9041949, 8883693, 8724630, 8559250, 8408034, 8174145, 7850590, 7538027, 7271800, 7049225, 6855635, 6682508, 6508857, 6370602, 6204348, 6011084, 5816206, 5700712, 5553716, 5414783, 5276826, 5150737, 4995989, 4851387, 4696914, 4525089, 4374544, 4271176, 4205422, 4195138, 4169300, 4026543, 3813987, 3638804, 3537966, 3440068, 3369081, 3244601, 3146201, 3106078, 3085829, 2979270]
10653B979270q7850o2465l5366q6021r2938m3093o8386m6343j09374m7462L351
10642B303323l3385O897p6065q2041K348k0563q0893r0701j63077j01668q0390
10631A583785r8706n3128p12J00671J521K0328j52618k17936j38778k2238q4303
10620I37886r5801L0940N3889N4472M0949N1296m3886k0034M3896K1498m080J9524
10608A090549q0665n1375K1432L7618L4408q431R273n2596m0945j5474m0304o0540
10596H42950K2514K6390k8873o8168m6997j2303L794l9927q4434l7560o485l2431
10584E38470p6093o4914p6364K260L3280m0404N912K1546k8950Q225J3839m3840
10572B92967n5629n693n156k0134R40J9577O612n2798l7333j2673J00571J32949
$$ y = [2979270, 2891420, 2828955, 2793589, 2707568, 2614630, 2571537, 2503151, 2456808, 2347434, 2299972, 2303323, 2269938, 2276835, 2200770, 2118729, 2121077, 2100514, 2019621, 1928920, 1765843, 1664175, 1583785, 1485079, 1431951, 1431239, 1531910, 1533431, 1553759, 1401141, 1183205, 1044427, 1022189, 937886, 842085, 873025, 926914, 981386, 1022335, 1073631, 1029745, 1009711, 1053607, 1075105, 1071025, 1090549, 1009884, 958509, 979941, 1017559, 1051967, 1043536, 1052809, 1000213, 959268, 943794, 903490, 842950, 865464, 891854, 862981, 794813, 747816, 735513, 739307, 699380, 614946, 577386, 570901, 538470, 462377, 397463, 321099, 323359, 356639, 316235, 322147, 343693, 314743, 322968, 336807, 292967, 237338, 231645, 226489, 206355, 207295, 226872, 233484, 180686, 143353, 130680, 231251, 364200]
10560C64200J48203N362l5699r3099j02286J8196J7203L2084J1593K8455l8883
10549C55329m1795Q031j8154K6105k2645q4276M7319j8228l2516k0873L8214J4017
10537B50528j2352J6477P699O311j9944n362P222R890O583L178n3814n6912M8284
10524B07788Q3917L1398k1710k6467p3277l2991M4159O1980l0224j9859N7143
10513B81857j7096n9159m257K0308J9939m071k9231j4018k1481L0250K431l3894
10501A71578L0061J5071o1849m1264p0908M566P3461N1630Q04n9021m9079K2015
10489H7065N2327N335m1079K5421K0541p9517l0952J5703j2807O1226M5041L8432
10477A86736K847l5459l9967n2838k196L3321K6M4839j7993l5016O5582K9462
$$ y = [364200, 512403, 517765, 482066, 388967, 286681, 304877, 322080, 354164, 365757, 394212, 355329, 313534, 321565, 303411, 329516, 306871, 222595, 269914, 251686, 219170, 198297, 236511, 250528, 238176, 254653, 262352, 268663, 248719, 243357, 250579, 260469, 267052, 270230, 216416, 159504, 207788, 291705, 323103, 301393, 274926, 201649, 168658, 212817, 274797, 244573, 224714, 281857, 264761, 205602, 201345, 221653, 241592, 237521, 208290, 194272, 172791, 203041, 205472, 171578, 201639, 216710, 154861, 113597, 42689, 47255, 120716, 172346, 173150, 114129, 65050, 87065, 139392, 144727, 103648, 129069, 149610, 70093, 39141, 54844, 42037, 103263, 148304, 186736, 189583, 154124, 114157, 61319, 59123, 92444, 92470, 137309, 119316, 84300, 149882, 179344]
10465A79344K089j0064j1998J1297K9265o5302o7052o4912M3956L0016N4922J9966
10453A51527r0175j1671j6270J7405M5902n6456m6773J0810L4851K1562L6015
10442I6727L6850k8104p7928p1735r660L3176L0911Q0171r050m2486r3036k3445
10430g7609Q2762N0519k8924o0876k2143L3989K5507j0618Q121k9829j17901L914
10418a43088J01745M8456L5211n6277K0495K3096q0877k1242O2188O0939m826
10407D5820L780k7489n0502M9070L9446o3659j5897L7652K2575k2227k9437J9699
10395H831M437L6415m779k0478l4316j7550m3831j1656M856j0258R2261P618m0570
10382b9020l9694k4435M0454P9248j2503j6740K6376K6021k2892p471L1430k348
$$ y = [179344, 181433, 171369, 159371, 170668, 199933, 134631, 67579, 2667, 46623, 76639, 131561, 151527, 61352, 49681, 33411, 50816, 96718, 40262, -6511, 4299, 39150, 60712, 96727, 133577, 105473, 27545, -44190, -53850, -20674, 10237, 90408, 81358, 38872, -54164, -77609, 5153, 55672, 26748, -34128, -56271, -22282, 3225, -7393, 728, -29101, -147002, -143088, -41343, 7113, 42324, -13953, 6542, 29638, -51239, -72481, -10293, 50646, 45820, 49600, 22111, -28391, 20679, 60125, -3534, -19431, 18221, 40796, 18569, -10868, 8831, 13268, 49683, 44904, 24426, -9890, -27440, -71271, -82927, -78071, -88329, 3932, 11550, -29020, -68714, -93149, -52695, 26553, 14050, -2690, 23686, 49707, 26815, 19344, 50774, 48426]
10370D8426J07325Q7927m7538p8825k941M6163j9041n5248l4416k8975k5274M0490
10358C8073j1516M7186J0984k9765L0066O8551J3462p1236q0443m3791O2133N8349
10346I2053j783n5511M3556M068L9125K1032O0735N7469P7466J36444K79573M91575
10334A245802N85556M10569J39250k75995o08960n01483k78864j50006j26831
10325D39038o5921J2474o4088l2335n5702p925J0380R67M5529l6848p0164l8475
10313A36930l3745N2705J5665K820k1240M067o1864l0465J5572L4877K0299P1769
10301B07390m2425o2464K0810k0402j2206K6439k2149k9945k9298J4891J620O089
10289E8350K5101K9823l315O4239O9177p5689m1341m483M9773P281j443j6551
$$ y = [48426, 155751, 243678, 196140, 117315, 114374, 160537, 141496, 86248, 51832, 22857, -2417, 38073, 26557, 73743, 84727, 54962, 85028, 153579, 167041, 95805, 15362, -28429, 33704, 92053, 90270, 34759, 78315, 82383, 121508, 142540, 203275, 260744, 338210, 474654, 754227, 1245802, 1831358, 2241927, 2381177, 2105182, 1496222, 994739, 715875, 565869, 439038, 373117, 385591, 321503, 289168, 233466, 225541, 235921, 236888, 282417, 245569, 175405, 136930, 103185, 155890, 171555, 174375, 153135, 157202, 95338, 64873, 80445, 115322, 135621, 207390, 164965, 102501, 123311, 102909, 90703, 117142, 94993, 65048, 35750, 50641, 52261, 58350, 83451, 113274, 109959, 174198, 243375, 167686, 126345, 121862, 171635, 178916, 177473, 160922]
10277A60922J5577p12k7451k3674j4773q685j16204n4295J3939K7176J8221J1017
10265A058K7832O377L8551L5141N6134l1557o2937l0603N4230K0294q4917j3033
10253A6570J2751j6675O802M2850o459L558r410l023J13383j492n9769o5197n0152
10240a6263j6521L6838J7290L8960J557Q2630Q3613K2325l9561j05853j9628K9728
10228A15115J4685l6140N4567M172M2295K042j6940p8771k6138Q902J9189K5354
10216A28332l1548j9354L0525j8561n6935r438J3214J4627L5777l960l2443J189
10204E1425L8362L8398p608m7886j9215n6740J1166N8755K8621j618l2551N2065
10192A13174j5755J8933l443m5727K2752P0737N6340n8695J0984L2814k6924j2297
$$ y = [160922, 176499, 175787, 148336, 124662, 109889, 101204, -15000, -69295, -55356, -28180, -9959, 1058, 28890, 35267, 73818, 108959, 165093, 133536, 70599, 39996, 94226, 114520, 29603, 16570, 29321, 12646, 19448, 62298, 55839, 59397, 49987, 46964, 160347, 158855, 99086, 33889, -16263, -32784, 4054, 21344, 60304, 61861, 144491, 228104, 250429, 210868, 105015, 85387, 115115, 129800, 93660, 148227, 152399, 194694, 196736, 179796, 101025, 74887, 83789, 102978, 128332, 96784, 77430, 107955, 89394, 32459, 23021, 36235, 50862, 86639, 82679, 50236, 51425, 89787, 128185, 120577, 72691, 53476, -3264, 7902, 66657, 95278, 93660, 61109, 113174, 97419, 116352, 112909, 67182, 89934, 160671, 217011, 158316, 169300, 202114, 175190, 162893]
10180A62893l3973o0468j8414n693m1866M534J6220O2117J585l2429p939K0582
10168F7149M735J4849k5716n2097k9517K3159L7938l3662n287L8228q258l3195
10156a674O3548L3194n1286O33j9371j3373J5767m1249m686K3884m4228l7565
10144g6406r316j2891L1431K9776Q7607m2553K860M3289k9622n2337l4757P251
10132e5668O4081j1107Q362n019o2036n8447N7278N6564O1927m9639J8140M939
10120B9375j749N062K7180Q723J3405m1346k1034J8474j5358N8739J0634M744
10108I6849N1151M4685J2945m4589o6913Q637n2170m8780K1350K4760l7308j6695
10096f078j0639K1571j3311k2691K0699k980j9270m863N4502j0392O5658l502
$$ y = [162893, 128920, 68452, 50038, 44345, 2479, 7013, 23233, 85350, 86935, 54506, 46567, 67149, 71884, 86733, 61017, 8920, -20597, 2562, 40500, 6838, 1551, 39779, 31521, -1674, 61874, 95068, 43782, 44415, 25044, 11671, 27438, -13811, -18497, 5387, -38841, -76406, -85722, -98613, -67182, -37406, 50201, 7648, 10508, 53797, 24175, -28162, -62919, -55668, 8413, -2694, 5668, 649, -61387, -119834, -62556, -5992, 55935, 6296, 24436, 29375, 27626, 32688, 59868, 68591, 81996, 40650, 19616, 38090, 22732, 81471, 92105, 96849, 148000, 192685, 205630, 161041, 94128, 102765, 50595, 1815, 23165, 47925, 10617, -6078, -16717, 4854, -8457, -31148, -10449, -13429, -32699, -37562, 16940, 6548, 72206, 68704]
10084F8704l4897l6769K5309O7041K3971k4711n873j9585r3572K220Q6423N1838
10072A10099j4155m0741j8924l8420L8980J0501m3291j0811l8281M7357K0623
10061B2937l9875o7275n375J8738O6280R7162N1317J242n939k5916k8980j5492
10049F8824j1134l8771k5071J523K6053J6712J4131j2790m9718l4249q183P95
10037e1878k9483p395J5570O0050M0669L3479O0645J8976j6037m6248k2508K3028
10025G8868m7784J3801J0083j6271l583L4562k0820J9283o9100j1331N599l9650
10013d6343N325M7479J4714n502o8190r6619j6012p380N0819N5921P5289P7073
10001H6574J0795o0822m4076j753k0074J5493k890m3000q30M9998O4240n0082
$$ y = [68704, 33807, -2962, 22347, 89388, 113359, 88648, 82775, 63190, -30382, -28162, 58261, 110099, 95944, 55203, 36279, -2141, 36839, 47340, 4049, -6762, -45043, 2314, 22937, -16938, -84213, -89588, -70850, -4570, 92592, 143909, 145151, 139212, 113296, 84316, 68824, 57690, 18919, -6152, -4629, 21424, 38136, 52267, 39477, -10241, -44490, -52673, -51878, -81361, -88756, -73186, -13136, 27533, 61012, 121657, 140633, 124596, 78348, 55840, 78868, 31084, 44885, 54968, 38697, 35114, 69676, 48856, 68139, -961, -12292, -6693, -46343, -41018, 6461, 21175, 15673, -52517, -149136, -165148, -172528, -121709, -65788, 9501, 86574, 97369, 36547, -7529, -9282, -29356, -13863, -16753, -59753, -60583, -10585, 53655, 3573]
9989C573o93J0536K641j443k3646o2789K7856P3998M9449l9053l5628J1060K5328
9976D1189j1138l385n7997l3606K34O31K7268J46899L3478k5756n3826m5255o0874
9963d2138m9015N228Q9939j484l2337K4553J8117j733m0781k7000J9582L0432
9951f637K1996j5410J0088m4908j6741L8833J0882j4756o6889j2296M8451M4197
9939c190j139m9959R750M979J4404K2743J4231J3451O6406l9672n5548n867N5346
9926D5935J8934n1849J889J1109l8263K2519O2386m8052p4226k403O706M7295
9914A980L3469L1339M6031N814o9968n7882l6420l8830M4662M5323k4016J5253
9902c245k5665M0666j6387M877L1609k4174m8224J3181N2574Q765j5229K0295
$$ y = [3573, 2880, 13416, 16057, 14614, -9032, -71821, -43965, 30033, 79482, 40429, 4801, 15861, 41189, 30051, 26666, -31331, -64937, -64703, -64072, -36804, 110095, 143573, 117817, 63991, 18736, -42138, -91153, -85925, 4014, 2530, -29807, -5254, 12863, 11130, -29651, -56651, -37069, -6637, 15359, -51, 10037, -34871, -51612, -12779, -1897, -16653, -83542, -95838, -47387, -3190, -4329, -54288, -44538, -39559, -25155, -2412, 11819, 25270, 91676, 52004, -3544, -9411, 45935, 64869, 13020, 14909, 26018, -12245, 10274, 72660, 24608, -49618, -52021, -45315, 1980, 35449, 66788, 112819, 118633, 48665, -9217, -45637, -84467, -39805, 5518, -18498, -3245, -28910, 11756, -4631, 246, 31855, 7681, -40543, -27362, 25212, 33977, 18748, 39043]
9890C9043l830j06748l4829N7961n2282O947K9836K8990m1396k2024L9435L1545
9878b7352J2262l9251j1335K8662M4589K3075k5048K7150j9734O566N3547K8913
9866A02044l476k0646l950N0709l7703n7015q3203j3243K5030J18098R2552K7788
9854A96985k8219k7217M190J7035n3640J1249l1081j948K9155M3253K4258o036
9842A77984L5104K9235M6755J20210J74043J97591J68539J18341n4241k12492
9832H01069k19214j70686r4679j8591m907j4087k3525n5745j4031M69r966k1742
9820A54365l1977J9247j1615J3250K1040L5777P5441L9977K2100m6011o453N3209
9808C38350N6242k0727j12821r083J25n3960q7216j8064J0586O135J8457M5233
$$ y = [39043, 35213, -71535, -106364, -48403, -100685, -93738, -63902, -34912, -76308, -98332, -58897, -27352, -15090, -54341, -65676, -37014, 7575, 30650, 5602, 32752, 13018, 19584, 73131, 102044, 98568, 77922, 73972, 124681, 86978, 29963, -53240, -66483, -41453, 76645, 169197, 196985, 168766, 141549, 145739, 162774, 109134, 120383, 89302, 87354, 116509, 159762, 184020, 177984, 213088, 242323, 289078, 409288, 583331, 780922, 949461, 1067802, 1013561, 801069, 581855, 411169, 316490, 297899, 292992, 278905, 255380, 199635, 185604, 186073, 176107, 154365, 122388, 141635, 130020, 143270, 164310, 200087, 275528, 315505, 337605, 291594, 285141, 338350, 394592, 373865, 261044, 251961, 252086, 198126, 110910, 92846, 103432, 109567, 128024, 173257]
9796A73257p1677p1328n084J470J2872M4814P657j3223k4929L7188J7865l6695
9784G2187j834J9110J0122M3267P861j0149N2094L8449K7466k4172J00507K23145
9772E58053L11984M11869M77363N03208L15021R1811j58926m48450m31945l87936
9762A242052l08708k39667j08770k9565o4766J3969m7494r1024n2897n5577L0498
9751B88051L2166J0699K9627k5037l1803L4732j4860o8409p4502k8363m3014J9120
9739A28407N2902k219j8012n1713n0554K4096P880J0471P555M394L4247Q190k7212
9726A28432J5938l2127K5750J0385l5068J9655K6082M1076p2837m1973Q266p056
9714H6523m5733o5904o2107J5140J15177J9106J6018p482J7393K5552m166J6787
$$ y = [173257, 101580, 30252, 25168, 26638, 39510, 84324, 91981, 78758, 53829, 91017, 108882, 72187, 70353, 89463, 99585, 142852, 150713, 140564, 192658, 231107, 258573, 234401, 334908, 558053, 870037, 1281906, 1759269, 2262477, 2577498, 2669309, 2510383, 2061933, 1629988, 1242052, 933344, 693677, 584907, 555342, 490576, 504545, 457051, 366027, 313130, 257553, 288051, 320217, 330916, 360543, 335506, 303703, 338435, 323575, 255166, 180664, 152301, 109287, 128407, 181309, 179090, 161078, 109365, 58811, 82907, 90787, 101258, 108813, 113207, 147454, 155644, 128432, 144370, 112243, 137993, 148378, 113310, 132965, 159047, 200123, 127286, 85313, 93579, 86523, 40790, -25114, -87221, -72081, 43096, 62202, 78220, 70738, 88131, 113683, 109517, 126304]
9702A26304l195r2856J4767M9477n763O878K4191L0142J7553p4752L6012j0220
9690A18538k0820N3794K1249k7644n6135j9015k3603k796m0211o4558J7785m026
9678d7442l3736J2816Q5809l7565J8279M6255m0895m4780j7964P841k08j2334
9666f3924Q071L2998L028m7779o209M7727N5922M2953K0079J1571n8716k0671
9654B5050J3678M71l9457k7430p866k3186k5195l025K3733M5650K8902N2007J911
9641F5243k300j5426K7362L5591k5065M421K820r7735m2263n259j7141n588J04894
9628B9554O898l3597M368k3372L0194N4098l2716n1338n9894l0055Q790r02j2654
9615a10626J9164O560O351l2461j8795K8535N4788J7183k2254m8068K2527L3360
$$ y = [126304, 123109, 30253, 45020, 94497, 88734, 95612, 119803, 149945, 167498, 92746, 128758, 118538, 97718, 151512, 172761, 145117, 88982, 69967, 46364, 43568, 3357, -61201, -43416, -47442, -81178, -68362, 17447, -20118, -1839, 44416, 3521, -41259, -59223, -51382, -51590, -63924, -55853, -22855, -19827, -67606, -73815, -26088, 29834, 72787, 92866, 104437, 45721, 25050, 38728, 39199, -258, -27688, -35554, -58740, -83935, -86960, -63227, -17577, 11325, 63332, 65243, 62943, 47517, 74879, 110470, 85405, 89826, 92646, -5089, -47352, -52611, -69752, -75340, 29554, 36452, 2855, 7223, -16149, 14045, 68143, 35427, -15911, -75805, -105860, -97070, -97972, -110626, -91462, -84902, -78551, -111012, -129807, -101272, -46484, -29301, -51555, -99623, -77096, -43736]
9603d3736L8478K9811K2680L802l8756p9848j4881J7012L1803j6512k7901J6031
9591f2017l3856K202O0940K9123l7720J2350L268l5798o785N7138P352J2418K9821
9578C8436J5376l4122l7507k4322n2463l6079j2718M7387N5335K5797l9677L0293
9566b4264J3368J7754J9386J4972j2422m3373k8063P537L2051l0757j5901L5226
9554a4486M0069K2210P900J4877J5175j0008m4106p1233m2557K3039N3493K0502
9542A4875k3226j2490K9066O3724j9822j2888j4198j1897K0227o9053K910l613
9530c6385m4069k3269M1961K0757N2923K4092q986n3961n8514k307L3943n892
9518e9707l7450J5628N3419N0996j5224N387K5243m606l5733K748n4514j809n697
$$ y = [-43736, -5258, 24553, 47233, 51035, 12279, -67569, -82450, -65438, -33635, -50147, -78048, -62017, -95873, -93671, -32731, -3608, -41328, -28978, -25710, -61508, -68293, -11155, -3803, 8615, 38436, 53812, 19690, -17817, -42139, -94602, -130681, -143399, -96012, -40677, -14880, -54557, -24264, -10896, 6858, 26244, 41216, 28794, -14579, -42642, -35105, -3054, -33811, -49712, -14486, 25583, 47793, 55693, 70570, 85745, 75737, 31631, -39602, -82159, -59120, -5627, 14875, -8351, -20841, 8225, 71949, 52127, 39239, 25041, 13144, 33371, -35682, -32772, -36385, -80454, -103723, -61762, -41005, 11918, 36010, 27024, -26937, -85451, -87758, -53815, -59707, -97157, -81529, -28110, 22886, 7662, 13049, 38292, 33686, -2047, 701, -53813, -55622, -61319]
9505f1319m7449L4180N7214R1827P5112j7912k3337j6744j8224o464M8461l8913
9493G6432q3701k1451K7141K6343j6053O776L8707k3520R512k2493l5733l5326
9481e3366N1504M1090J0474m5735q7673o9790j0550O6640L3970M6371K5388l5013
9469b6690m3771j9472K3310K1249P020M4635M6108l3066l2965J650l8014n1479
9457a01485N9369N8634O125j4522l4347N6914k9305M489J4409k8401m4438N8906
9445F348K0190M003R531l2822k8134j4274M2910O5435J2087l9767o608k3822l6098
9432b1021l2209o967o990J10516K2821o5118p9241M455J6163O215J6281L7149
9420B054L765m0256j8249L4785J0557l4220J3641L0681O991k5129l229m716M978
$$ y = [-61319, -108768, -74588, -17374, 74453, 149565, 131653, 108316, 91572, 73348, 66884, 115345, 76432, -7269, -28720, -1579, 24764, 8711, 15487, 54194, 30674, 40186, 17693, -18040, -53366, -1862, 39228, 49702, 3967, -83706, -153496, -164046, -97406, -63436, -17065, 8323, -26690, -70461, -89933, -66623, -45374, -38354, 6281, 52389, 19323, -13642, -11992, -50006, -101485, -42116, 16518, 22643, 8121, -26226, 30688, 1383, 5872, 20281, -8120, -52558, 6348, 26538, 30541, 40072, 7250, -20884, -35158, 7752, 73187, 85274, 45507, 38899, 15077, -21021, -53230, -60197, -67187, 43329, 66150, 1032, -78209, -73754, -57591, -51376, -35095, 2054, 5819, -34437, -52686, -17901, -7344, -41564, -27923, 2758, 9749, -15380, -18609, -23325, -18347]
9407a8347O4134K6233j14711k4655K2844L048J7133K1329O3509k0057K2746k9224
9395C3982m0245k6319L225j6165l5849j0786K200J2766J1941L660N2571p898n6648
9382g3565l8900K4369N3346o324L988P6774k35k9809j4115J2223r4600K687N1997
9369c2164K9788L6670k3507J1833j4620r289J2518m1184m5891p7342O4233L3343
9357e5612l0473M9531M1646M9775j1741l8450n6123j458J9293Q9502j3816l1030
9345A1044j272j5260j1757K195j4970N5340M1685l9088J5216l7066l4137R0574
9333F2504J2582o5031p1373k627K3035k1872L2030O9603r651l0525K7959K7004
9321E3638j09225l3276K2796N4077N341m3562K0836L8023m9751j5169J3992N9975
$$ y = [-18347, 45787, 72020, -42691, -67346, -44502, -41454, -24321, -2992, 60517, 40460, 63206, 33982, -6263, -32582, -29357, -45522, -81371, -92157, -89957, -77191, -65250, -61590, -9019, -16917, -73565, -112465, -88096, -34750, -41074, -37086, 39688, 39453, 9644, -4471, 7752, -86848, -84161, -32164, -2376, 34294, 10787, 22620, 8000, -1289, 11229, -29955, -75846, -153188, -88955, -55612, -86085, -36554, 5092, 54867, 43126, 4676, -51447, -52905, -33612, 55890, 42074, 11044, 9772, -5488, -17245, -15050, -30020, 25320, 67005, 27917, 43133, 6067, -28070, 62504, 75086, 10055, -61318, -63945, -40910, -62782, -30752, 38851, 29200, -1325, 26634, 53638, -55587, -88863, -66067, -11990, -6649, -50211, -29375, 8648, -41103, -56272, -42280, 17695]
9309A7695L755O1889l6317o6976K2093M9560J3326l3656n1964Q2220M2346l6069
9297F7902k7629m9930m2169K638K8275K0942j1020n5992J4148Q1966r063o337
9285A3731m692l0615n4088k7972M6889R3652L9371m2140R650K1861l8630j9650
9273G367L857L079l41r603N1285N5589j658k0564L4543L3673m6349l9138K2924
9260I4664k6881p2088L3936P9905M8713M6882n864o808J4519P793q4258k4403
9248A06110J3405l8663k1046p4820j9028O9670R3140K375k0349J5813j1948J964
9236A16623k106k2061k2855N4747N2473N3072L2866l5634p4255k902j0445l1836
9224A07687M8540L8036Q05L4896j0368m0431O735L4336j176j8921K2012K3426
$$ y = [17695, 21450, 83339, 47022, -19954, 2139, 51699, 65025, 31369, -20595, 61625, 103971, 67902, 40273, -9657, -51826, -49188, -20913, 29, -10991, -66983, -52835, 29131, 20068, 13731, 9039, -21576, -75664, -103636, -56747, 36905, 76276, 34136, 43786, 65647, 27017, 7367, 11224, 14303, 13962, 4359, 55644, 111233, 109575, 89011, 123554, 157227, 110878, 71740, 94664, 67783, -4305, 29631, 109536, 158249, 205131, 199267, 192459, 206978, 214771, 130513, 106110, 119515, 80852, 59806, -15014, -34042, 35628, 128768, 131143, 110794, 126607, 114659, 116623, 114517, 92456, 69601, 124348, 176821, 229893, 262759, 227125, 152870, 149968, 139523, 107687, 156227, 194263, 195068, 229964, 219596, 179165, 185900, 220236, 219060, 200139, 222151, 245577]
9212B45577r624m2819n2068M9212L0983L3052J1787j4641k4760K1303N4207n7116
9200B45093r4691j4981M7303K4138O864R8163K441P191k1628k1449j2877m715
9188B60852M7214P1503K7722L2570J7273N9057K1798N0003K7306M8575M4564L1149
9176G39586j0323P3857J04862Q9319M3288P1671R4229J47677J59100J71228K02945
9165A887439K75834L10457L77283L95118N09723P13867J008572J264075J646322
9156H388690K042963K388166K531998K028120R65197l06465j495218k131557k176639
9147A2235255j923712j608305j222899r97521q35254n67331m65188m25664l73443
9138C815938l08340k31172j83986j17078j51628j37639r3054j36473j01821q7987
$$ y = [245577, 235953, 193134, 141066, 190278, 221261, 254313, 266100, 251459, 226699, 248002, 302209, 245093, 150402, 135421, 182724, 206862, 213726, 311889, 314330, 321521, 299893, 278444, 265567, 260852, 308066, 379569, 407291, 439861, 457134, 516191, 537989, 587992, 615298, 663873, 708437, 739586, 729263, 803120, 907982, 997301, 1040589, 1112260, 1206489, 1354166, 1513266, 1684494, 1887439, 2163273, 2473730, 2851013, 3246131, 3755854, 4469721, 5478293, 6742368, 8388690, 10431653, 12819819, 15351817, 17379937, 18345134, 18038669, 16543451, 14411894, 12235255, 10311543, 8703238, 7480339, 6482818, 5647564, 5080233, 4615045, 4189381, 3815938, 3507598, 3276426, 3092440, 2975362, 2823734, 2686095, 2593041, 2456568, 2354747, 2266760]
9128B266760j26076n7081j10282p4383l5885r961j00324j01325N3292p930j13676
9117A583129p9823k5819p6078l2006o6893o0248j2699o7909o8328k5656M3886
9106A111556J7831m8022n3889p389k8358k5758q4491k5863Q0710l3639j03000
9095G99688r0590n2252K1091M4154n658O7624m0691j07172m6057N3757k9105n7421
9083E57368j09648l9140q30m43n237l8979J4203R1886L7062p477k0993p4225m324
9070C99223K7773L4187n3282o710J0863J0800K9062l8823j11104k8625N7219j6630
9058C13953o2596l9365R223M7984l3457l1319j4156l6813N0884P2717k8889J143
9046B49309p013K253J1012o0303o5736L3270K2559P745K7914K5973l6689j2043
$$ y = [2266760, 2140684, 2083603, 1973321, 1898938, 1863053, 1853092, 1752768, 1651443, 1704735, 1696805, 1583129, 1503306, 1477487, 1401409, 1369403, 1302510, 1242262, 1229563, 1161654, 1093326, 1067670, 1111556, 1129387, 1081365, 1027476, 1020087, 991729, 965971, 881480, 855617, 936327, 902688, 799688, 709098, 656846, 677937, 722091, 716433, 784057, 743366, 636194, 590137, 643894, 614789, 557368, 447720, 408580, 407750, 407307, 402070, 363091, 377294, 469180, 506242, 498765, 477772, 403547, 399223, 426996, 461183, 407901, 401191, 412054, 422854, 451916, 413093, 301989, 273364, 330583, 313953, 251357, 211992, 221215, 269199, 235742, 204423, 190267, 153454, 204338, 277055, 248166, 249309, 242296, 244549, 255561, 195258, 129522, 162792, 185351, 193096, 221010, 246983, 210294, 198251]
9034A98251j8500J7540L5243L4640j5170n0298n6535k8928N84J5149K1147K5042
9022A78165l0710q020k2059j9426J5211J0654K0259n457n6549l557J8066J4490
9010A11067K5834L6841l7973j1913N893j3569j0523K237j7512l2904K985J8480
8998G8943k2215r889L6878N7188k7657j7582J0886L3413o1725l0486l0191K3701
8986D1264K2151k7757o753M9589P5824m0210k2235J1217K2625p067k2472k2127
8974G4049K0067n5049j2216k391K7845R54m038J2268k5372k3235K6498K0255k0060
8961C9575l3813p3385j9201q618J1645J03648j1799p634N067L6333J5078k9112
8949B7784J9133Q6662L5943J9670k7663r3990j3665k3398J3459k6415j6284M5272
$$ y = [198251, 179751, 197291, 232534, 267174, 252004, 201706, 145171, 116243, 116827, 131976, 153123, 178165, 147455, 139435, 117376, 97950, 113161, 123815, 144074, 138617, 82068, 78511, 96577, 111067, 136901, 173742, 135769, 123856, 129749, 116180, 105657, 107894, 90382, 57478, 60463, 78943, 56728, 46839, 83717, 140905, 113248, 95666, 106552, 139965, 78240, 47754, 17563, 41264, 63415, 35658, 28905, 78494, 154318, 114108, 91873, 103090, 125715, 118648, 96176, 74049, 94116, 39067, 26851, 24460, 52305, 53259, 49221, 61489, 36117, 12882, 39380, 59635, 39575, 5762, -67623, -86824, -95442, -83797, 19851, 8052, 418, 5485, 41818, 56896, 27784, 46917, 133579, 169522, 189192, 161529, 67539, 53874, 30476, 43935, 17520, 1236, 46508]
8937D6508l6692l2394K5475J4764J2046N7485l840o7009N366L8864K529l2603
8925C0499j0192o177J4387J5897j9651O093J2751o778k6062O682J2334J0235Q215
8912D8233O4748O913k4691p8843l01K6514O0992k3094j5247N7413n279j8657k8022
8899G0679J3843l0343o55j6660K5072K0131o077j6574J8333N3301M6805m4129
8887A33726l8845P3360J0238J778k2348l1169L6507o1592o5688m1479R199K2668
8875B6355j3552J9642J05227P3484R454q290j8372N2049P4620M4491L3093k3434
8863C74767q1340p9478p0866o6569r281L8201L6937l6350k647p1539l6024L3758
8851B9569q7M491K219N5756L4333J6581n5881r3589r637N9396N6935J0561k0306
$$ y = [46508, 9816, -22578, 2897, 17661, 29707, 87192, 83352, 16343, 21709, 60573, 63102, 30499, 20307, 14130, 28517, 44414, 24763, 30856, 43607, 36829, 10767, 17449, 29783, 40018, 48233, 112981, 119894, 95203, 16360, 16059, 42573, 103565, 80471, 65224, 122637, 117358, 98701, 70679, 84522, 54179, 53524, 36864, 61936, 82067, 75990, 59416, 77749, 131050, 177855, 133726, 94881, 168241, 178479, 180257, 157909, 126740, 163247, 101655, 35967, -5512, 3687, 26355, 12803, 32445, 137672, 211156, 220610, 212320, 193948, 245997, 320617, 365108, 398201, 374767, 293427, 213949, 143083, 76514, 67233, 105434, 142371, 106021, 103374, 31835, -4189, 29569, 29482, 33973, 36192, 91948, 126281, 142862, 86981, -6608, -16245, 43151, 100086, 110647, 90341]
8838I0341O2625K7995o0822k8780m4493n7592L1059O6259l4030J8223j7864L92
8826E3313J7191p175m7798o039k1469Q661P8791J2337j7269k4803M127L9070q506
8813H0431Q30L3186k9245N110O8047k0345m071n6191j6603j5105j2119r201K8713
8800E3437R0108L7419j2403m9081R821p3622m9059L1626P9555N4703J2399k1368
8788A63535p1795j4811j1138q2464l1434L3526J1424j12138J1316O538L9683N4034
8776c724O782L4857L9791Q745L512l9092j2415j7417j3649J19135P2037N7326
8764B55888J6051j5757k8211n1876l0262n9379k2753N0489J4975k9441L9306K0428
8752A59458q4773l288L6266K0876N0389j4114l2623j9743k3607M391K973l7557
$$ y = [90341, 152966, 180961, 120139, 91359, 46866, -10726, 20333, 86592, 52562, 70785, 52921, 53313, 70504, 63329, 15531, 9492, -11977, -3316, 75475, 87812, 70543, 45740, 49867, 88937, 80431, 81261, 114447, 85202, 90312, 158359, 138014, 133943, 77752, 61149, 46044, 33925, 24724, 53437, 143545, 180964, 168561, 119480, 129301, 55679, 6620, 38246, 117801, 172504, 184903, 163535, 91740, 76929, 65791, -16673, -48107, -14581, -3157, -115295, -103979, -97441, -57758, -3724, 3058, 37915, 77706, 86451, 89963, 50871, 38456, 21039, 7390, 126525, 198562, 255888, 271939, 256182, 227971, 176095, 145833, 86454, 63701, 114190, 129165, 99724, 139030, 159458, 74685, 71397, 107663, 128539, 178928, 164814, 132191, 112448, 88841, 93232, 96205, 58648]
8740E8648o599k8751J4322P4568L8878j1702M2941Q387k5609L6671M1441q2596
8728A60599l9454K8822R9674K6466k6969k4441k0058L5775n690K3582J2527L5562
8716C06395l9863q0430P470L0563j237J0013O943j6493o0652n2008N2560J7313
8704A80574K6387L7964L1254K8772n4360j5713O7241J9779M087N4799k8052K0505
8692C73237J9258k0945J7159O0169m1099m2760k5706l6399J093k081k8209J7866
8680B91583O0359Q3175n117m6433k0716O3240k1958m7351M1197O4739K8116J3594
8668E04428l2436l1606M320k8638J3841O1930N2081K1825l3542M3177J7187k997
8656E89570j8075K1463J0653K9854M2221r809L6141l4918q3893M3428R9647N1874
$$ y = [58648, 52049, 23298, 37620, 112188, 151066, 139364, 182305, 190692, 165083, 201754, 243195, 160599, 121145, 149967, 249641, 276107, 249138, 224697, 204639, 240414, 234724, 258306, 270833, 306395, 266532, 186102, 193572, 224135, 222898, 232911, 239854, 223361, 162709, 110701, 163261, 180574, 206961, 244925, 276179, 304951, 250591, 234878, 302119, 321898, 325985, 380784, 352732, 373237, 392495, 371550, 388709, 448878, 407779, 365019, 339313, 302914, 304007, 301926, 273717, 291583, 351942, 435117, 430000, 383567, 362851, 426091, 404133, 356782, 397979, 462718, 490834, 504428, 471992, 440386, 444706, 416068, 429909, 491839, 543920, 565745, 532203, 575380, 592567, 589570, 571495, 592958, 603611, 633465, 675686, 665877, 702018, 667100, 583207, 626635, 726282, 778156]
8644G78156L6074J654o7260m3251K6195Q1765J9173K4406k1881J8216l3753O244
8632H25738N2594N3597L7851N9738o7678J2150P9466L8306N8206J01320P6767
8621A328055n306O0620J7168J3079M4692K5941j4190q516m319n3980o144M3513
8609A440613K8362j0728l9338N7341K6162P904l761k3520K2000M0660L1380M045
8597A581120L5999j3515o536L5241Q749k9179o1928k4173k0252r1029o7810k5018
8585A321669o4016j17112p5257r2246n8918l6104j089n1552L404k1278j10388
8574F97113n6363L1851K8451j9886J0123p4840o3667k9550L637m0733n8242j2198
8562D15696l062j3756j4489p6435r185k1202K5385M4173K5439N6953p558j11598
$$ y = [778156, 814230, 815884, 748624, 705373, 731568, 813333, 832506, 856912, 835031, 853247, 819494, 825738, 878332, 931929, 969780, 1029518, 961840, 973990, 1053456, 1091762, 1149968, 1251288, 1328055, 1322749, 1383369, 1400537, 1413616, 1458308, 1484249, 1470059, 1461543, 1457224, 1403244, 1397100, 1440613, 1468975, 1458247, 1418909, 1476250, 1502412, 1510316, 1506555, 1483035, 1505035, 1545695, 1577075, 1581120, 1617119, 1603604, 1597068, 1632309, 1641058, 1611879, 1549951, 1525778, 1505526, 1414497, 1346687, 1321669, 1257653, 1140541, 1065284, 973038, 914120, 878016, 876927, 825375, 828779, 807501, 697113, 640750, 672601, 701052, 681166, 691289, 616449, 552782, 523232, 526869, 486136, 427894, 415696, 412634, 398878, 384389, 307954, 298769, 277567, 302952, 347125, 372564, 429517, 421959, 310361]
8550C10361k0238L4673j1175p2497N2223N1202j4233q234k0948k3847k4411j7335
8538B35541K1059J2662M5275r110q9767j7229j2991j4574k8761n07L6076N5682
8526B33356j2961K1924R603j0862k3866r4176l1851O1235J8467K1731J8154j1371
8514A99383J0909l3085m7142n1771Q3477K6722q3075l3191m46J4976N7334k1774
8502A22317m0469M1216K1808j256l3203l3442K4313j212J5791R854q3346N607
8490D7978K5387l8748o3806J7771l116l3601Q8339R7254K4506L7759J5278L8646
8478B53647j1063n9356o3201m8582O308j2934m21L6597j3791m6547k3573k5382
8466h298K601K387j2240K9211n8341k4100O9139O0477p083l7691j0056J1478L2085
$$ y = [310361, 290123, 324796, 313621, 241124, 293347, 344549, 330316, 322082, 301134, 277287, 252876, 235541, 256600, 269262, 314537, 305427, 215660, 198431, 185440, 170866, 142105, 141598, 177674, 233356, 220395, 242319, 251922, 241060, 217194, 123018, 91167, 152402, 170869, 192600, 210754, 199383, 210292, 177207, 130065, 78294, 161771, 188493, 105418, 72227, 71781, 86757, 144091, 122317, 81848, 123064, 144872, 143616, 110413, 76971, 101284, 100072, 115863, 125717, 42371, 47978, 73365, 34617, -29189, -11418, -14534, -48135, 40204, 137458, 161964, 199723, 215001, 253647, 242584, 183228, 120027, 71445, 77753, 64819, 64398, 100995, 87204, 40657, 17084, -8298, -5697, -3310, -15550, 13661, -44680, -68780, 359, 60836, 53753, 16062, 6006, 17484, 49569]
8453D9569J001N393M0903K2240m3303o7594K0128j1238K4123J6000M1631J1409
8441A10262n8751M1944j0906l0412m3662k4736K6m264j6236K721r131l4134K2670
8428e4609N1435M305N098j3761k8593n175K2954J2920Q145P7440K2343p4083J9373
8415D7792M9640O2092m6924k8614j9374l7608N241N1453r302j8994L1714k5476
8403F1640m7081R046k4571j17618j6447L4921O3724M9555k9617m5421m3884J4704
8391i1049N7669N2940n719N6365j8574m0790K8865k779K3817M1050l3070k2078
8379D6647l91J2101k3719O4049M4787q3469n12J8782k8601k2103j0407k7401R438
8366g99k4091k2793l7321j3935K4649M8076K7810L69K0057m0670r149K041k1573
$$ y = [49569, 50570, 55963, 96866, 119106, 75803, 8209, 28337, 17099, 41222, 57222, 98853, 110262, 51511, 93455, 82549, 52137, 8475, -16261, -16235, -20499, -36735, -34014, -43145, -77279, -54609, -3174, 1131, 6229, -7532, -36125, -41300, -18346, -5426, 2719, 80159, 102502, 28419, 47792, 97432, 159524, 112600, 83986, 64612, 27004, 32245, 83698, 74396, 55402, 87116, 61640, 14559, 23605, -966, -118584, -135031, -100110, -36386, 13169, -16448, -61869, -105753, -91049, -33380, 19560, 13841, 70206, 51632, 10842, 39707, 36928, 60745, 101795, 68725, 46647, 46256, 58357, 34638, 98687, 143474, 60005, 59493, 78275, 49674, 27571, 17164, -10237, -799, -24890, -47683, -85004, -98939, -74290, -26214, 1596, 1965, 22022, -18648, -27797, -25756, -47329]
8353d7329q915M2649K290l5543N397m033O2875K1867J799l2869O5819M9501L6157
8340A59665n5863n9396o565L4273Q515n8018L3564N8083l394p348o080m8033r115
8327D0288o624m237k8925j6433n4938r159N4130J6824m9226q184K1820L8653N0587
8314D4576l4956J161M1425n8082r3752Q7k5761O1076L9583L5768k1077l4678k3570
8301f8200K3949N2165J5842m0373l3640m6762k1849M5819R6726L1008j8425o9502
8289c3242j3285N7511K8758l0681J6891p365K9659M0472K1605l0959m3144J3087
8277D9307K0839l762N1638L973o930P857j0817r3201m0837j1786L3750J2076o766
8264E341k3210k6749J3971O290L4111Q3559N038m4716m8549k7987q564j4423L8725
$$ y = [-47329, -56244, -13595, -11305, -46848, -41451, -45484, 17391, 39258, 41057, 8188, 74007, 123508, 159665, 103802, 44406, 37841, 72114, 80629, 22611, 56175, 114258, 110864, 103516, 97436, 49403, 40288, 33664, 29427, 502, -15931, -70869, -80028, -25898, -9074, -58300, -66484, -44664, -6011, 44576, 9620, 10781, 52206, -5876, -99628, -99541, -125302, -64226, -24643, 11125, -9952, -44630, -68200, -44251, 7914, 23756, -16617, -50257, -97019, -118868, -73049, 23677, 54685, 36260, -33242, -46527, 10984, 39742, 9061, 25952, 18587, 48246, 88718, 110323, 79364, 36220, 49307, 70146, 66384, 118022, 121995, 115065, 122922, 112105, 18904, -21933, -33719, 31, 12107, 5341, -17869, -44618, -30647, -24357, 9754, 93313, 98351, 53635, 5086, -22901, -31465, -45888, -7163]
8251g163K6430k1486O933J01489P948p6941J0872N1778l0703k632Q220j0248k9402
8238C5095O801j1662m2680m3168k624J6188L1546N5163l8138r455N3570k4443
8226B6193j8630J3832m321l0355l7504n9348L4346Q8123M5641K237l091J6967
8214G4090k615m7496r4089J793J1412J8846L6256L2443L0022L8026K6505p0267
8202E4926k4864j3786M4464j0745k9339k913j9985n323k8745J1932O937L4304
8190A6863J0933m1654p0713M0444J812j6541L2484M1372L0302L7148o120k3854
8178E2476j4469j0783k8979m597l3830j1824J7771Q066k0385J29L6088O8133M8479
8165A06275K578m3564n4343K7783M5993J0981L1459J6910O104k2270n0716k5060
$$ y = [-7163, 19267, -2219, 4714, 106203, 114151, 37210, 48082, 99860, 69157, 66525, 74745, 64497, 35095, 41896, 30234, -12446, -55614, -58238, -42050, -10504, 44659, 6521, -2934, 50636, 26193, 7563, 21395, 17074, -13281, -50785, -110133, -75787, 12336, 57977, 60214, 57123, 74090, 71475, 23979, -70110, -68317, -56905, -38059, -1803, 30640, 60662, 98688, 125193, 54926, 30062, 16276, 60740, 49995, 20656, 17743, -2242, -7565, -36310, -24378, -17441, 16863, 27796, -13858, -84571, -44127, -42315, -58856, -26372, 15000, 45302, 82450, 76330, 52476, 38007, 27224, -1755, -6352, -40182, -52006, -34235, -26169, -46554, -46425, -10337, 57796, 106275, 108853, 65289, 10946, 38729, 84722, 95703, 127162, 144072, 150176, 127906, 77190, 52130]
8153E2130l9498n4211L5903J8134n495O161l5178M4704N4296J870L171K5780N6221
8140A63988l6976l9716l9996k4809J8879m8542p0547M7639O0349L8587J5351m3425
8128D0782j5687J8934p220K0841P7418m2834k0485p0816k0467N7829j1497N400
8116C2198M3205K624k9030l7143p1885l5651J1051j7664o746Q6634R7053K0927
8104I5573L0183o0131j6631r89J4458j2228L3023O3968j0147p9653n1813J7893
8092B3506L9836j491l8509l1970o5246P336R454R963J0031K5994J8879j8956R2594
8079H1421J3549j3751l7522k1288j2038l4548o0578j4903N7268K4346j3777K4374
8067g447L8895P376J0371J5975O093J6932k084K6378K3884j937L2459j0430j3068
$$ y = [52130, 12632, -41579, -5676, 12458, 6963, 13124, -22054, 22650, 76946, 78816, 81987, 107767, 163988, 127012, 87296, 47300, 22491, 41370, -7172, -77719, -30080, 30269, 68856, 84207, 40782, 25095, 44029, 36809, 57650, 135068, 92234, 71749, 933, -19534, 38295, 26798, 32198, 75403, 78027, 48997, 11854, -60031, -95682, -84631, -102295, -109041, -22407, 74646, 95573, 125756, 65625, 48994, 48005, 62463, 50235, 83258, 147226, 137079, 57426, 5613, 23506, 63342, 61851, 23342, -8628, -73874, -66538, -57084, -47121, -37090, -11096, 7783, -11173, 81421, 94970, 81219, 43697, 22409, 10371, -24177, -84755, -99658, -42390, -18044, -31821, -7447, 31448, 38824, 49195, 65170, 71263, 88195, 86111, 112489, 136373, 134436, 166895, 156465, 143397]
8054A43397J242j80N602P9972O092o2008M1287P1782M1050k5037o4668m5733m2272
8041A50526P0283L1617j8300K9720K4066O8708P346q347l1335r3387k165L2800
8029B61532N375n8341j0661j314P3470L2649m5593n9050K9001J0528R579K7896
8017B75071m6789k3249L7329R6778J02271l9100N7194J31894J99745J92966J48038
8006A132148P5516p0592j16145j86590j00378o5970m6137j0781L407J7562O9314
7995G01354J11992N3214O8874o8592j65376j12651n8286N626q3915l2880m8277
7984C71083j709o3145n1665K9454j3308q279k154k8638j3213M3953L5532p322
7972B90589K099K0641K4003P1157N6451k9672L8705J11919P1193N5903P1834P8039
$$ y = [143397, 144639, 144459, 150061, 230033, 236125, 174117, 215404, 287186, 328236, 303199, 238531, 192798, 150526, 220809, 252426, 234126, 263846, 287912, 356620, 363966, 355619, 324284, 230897, 228732, 261532, 266907, 208566, 197905, 196591, 270061, 302710, 257117, 198067, 227068, 237596, 247175, 275071, 228282, 205033, 242362, 339140, 441411, 402311, 459505, 591399, 791144, 984110, 1132148, 1207664, 1137072, 1020927, 834337, 733959, 667989, 621852, 611071, 614478, 632040, 701354, 813346, 866560, 935434, 866842, 701466, 588815, 530529, 536155, 452240, 419360, 371083, 369374, 306229, 254564, 284018, 270710, 262431, 260277, 231639, 218426, 262379, 297911, 290589, 292688, 313329, 337332, 408489, 464940, 435268, 473973, 585892, 657085, 712988, 784822, 862861]
7960H62861J257r5089n9766j17825l2088R478L2936J07050J28211P963r5812q8366
7948F60810j04742r2226k1148k1454K1617q6402j17582k8176n169L8502m729J350
7936B40651r746m6959l3906J2484m8700K8987M6829j0048M0267k20J1435k2532
7924B08542L6188O1411P7987M91k8036o1178p8434p156J0809o338M8165q794o9241
7911A84416n3562L8706J5191j6449m2328m9001N6772N0183j9233k8934j1835K5323
7899A49249K3263l8127m4660l6159K6138L8667M1027m9777p9055j1957N3432l8242
7887C3799K0712L4753j9825K971N459K2091n7840j3200K4434O7537l6122l7633
7875D7136q3787n6399K3300R6467O8720r528k239l2890k7570L1632J1157J0719
$$ y = [862861, 864118, 769029, 709263, 591438, 559350, 568828, 601764, 708814, 837025, 844988, 749176, 660810, 556068, 463842, 442694, 421240, 442857, 356455, 238873, 210697, 205528, 244030, 239301, 240651, 230905, 183946, 150040, 162524, 113824, 142811, 189640, 179592, 219859, 219639, 231074, 208542, 244730, 306141, 384128, 384619, 356583, 295405, 216971, 209815, 220624, 214286, 262451, 253657, 184416, 130854, 169560, 184751, 168302, 125974, 76973, 133745, 183928, 164695, 135761, 123926, 149249, 172512, 134385, 89725, 53566, 79704, 118371, 159398, 109621, 30566, 18609, 72041, 33799, 54511, 89264, 69439, 72410, 77869, 99960, 42120, 28920, 53354, 120891, 84769, 47136, -36651, -93050, -69750, 26717, 95437, 85909, 83670, 50780, 23210, 54842, 65999, 76718]
7863G6718m8170r927K310J756n3361M0451J5163k1606p1079K001L5840j0232J7809
7850b2327O777N3877N0484k9960j1026m1369J456R6360o972p4901J6786J2143
7838E1328l739m99K0456j2329J5395M7037M5852n5119q8840r254j3086j7680L8313
7825A7835l0321m970K6996J9555J101K9775K6400n5731l7620k9472j5117K7961
7813b3608K5034J7071Q140j1059m2289K0856K0740J596K3242J6557k8929R223
7801C6574L8584m0373J1763L0848J4262l9116L873l0998L5292P1406J0875k0895
7789A22095m4611j14821m1117J5140M5564J4548j3440j7000n3469L154j7460N1201
7777e0216J3804j1400O120J3056M3914o5831l9423j2780N2031P9441M8606p4402
$$ y = [76718, 28548, 18621, 20931, 22687, -30674, 9777, 24940, 3334, -67745, -65744, -29904, -40136, -22327, -15550, 38327, 88811, 58851, 47825, 6456, 7912, 104272, 97300, 22399, 39185, 51328, 47589, 47090, 67546, 55217, 70612, 117649, 163501, 108382, 19542, 10288, -2798, -20478, 17835, -12486, -17456, 9540, 29095, 30196, 59971, 86371, 30640, -6980, -36452, -51569, -23608, 1426, 18497, 26637, 15578, -26711, -5855, 14885, 16481, 39723, 56280, 27351, 36574, 75158, 34785, 46548, 77396, 91658, 52542, 56415, 25417, 60709, 132115, 142990, 122095, 77484, -37337, -78454, -63314, -17750, -3202, -16642, -33642, -87111, -83957, -101417, -50216, -36412, -47812, -41692, -28636, 15278, -50553, -89976, -102756, -50725, 28716, 77322, 2920]
7765B920L070N5566j9345l3011K1005O858l5161j5480J5310J5740l5331p9512
7753i7371r37n805K8450K3169K1084m07m6487j8112P3947K7623J0080n612l536
7740F086k4611l8380p053L0571K3330n463K5797j7679j109K7715k2736M655J3732
7727A4855m2286k1342K641q639m2240N4716J8593J4815K4351j7667l8416m6288
7715h6907n4381M1887M5287J6196l9719l603j4216K7057n491k0462O2816k186
7703c3722K1354Q964J7949M6313J4714n9250o6489m3410M6361O2421M7805K0418
7691H3428k9894m2815M6407k4123M591N2561p1485j1502j0784o9048j1351M5755
7679c8260l534m4200Q901j1746k8412q932O8197J5217L09j5224M3991k276M4807
$$ y = [2920, 5990, 61556, 42211, 9200, 30205, 37063, 1902, -13578, 1732, 17472, -17859, -97371, -98308, -104113, -75663, -52494, -31410, -31817, -78304, -96416, -22469, 5154, 15234, 9622, 6086, -18525, -56905, -63958, -33387, -10057, -15520, 10277, -7402, -8511, 19204, -3532, 1123, 14855, -27431, -48773, -46132, -54771, -97011, -42295, -23702, -8887, 15464, -2203, -40619, -86907, -141288, -99401, -54114, -37918, -77637, -81240, -95456, -68399, -73890, -94352, -31536, -33722, -12368, -3404, 14545, 60858, 75572, 16322, -50167, -93577, -47216, 15205, 63010, 83428, 53534, 10719, 57126, 33003, 37594, 90155, 18670, 7168, -3616, -72664, -84015, -38260, -41794, -85994, -77093, -88839, -117251, -126183, -57986, -42769, -42460, -57684, -13693, -15969, 28838]
7666B8838L1634J4483o2996j1313l0260J2915k2121M2112O066P3414m3170k9746
7654I856k0750J4806k9477n7156J271o564k4033K8848J5493j3784K6592P7734
7642B2836J5616r369K6415j8343l5466O653M3297j4181K319p27K3054o7300J4168
7629H972o0564k6129M065m6260J6235N4884k1066j8687K3761M1815j180k2168
7617d6322O3803J01368o0681p8946r3146r631P9649O7092k1617p1331j9051J8874
7605f9939K7757J543n51k1195j7151m22J447l9160N2391N0847o1385l2892O0671
7592d8039j1963J9214O6871k2468J8815J2148l2369L9131K4942p6621k2782K1427
7580a1694m149J8169m1944L4242j4042K1951L1723K7594k0894l6134l866K8341
$$ y = [28838, 60472, 74955, 11959, 646, -29614, -16699, -38820, 3292, 9358, 82772, 39602, 9856, -10894, 3912, -25565, -82721, -81450, -88014, -112047, -83199, -67706, -81490, -54898, 22836, 38452, 29083, 55498, 37155, 1689, 8342, 51639, 37458, 39777, 39050, 62104, -5196, 8972, -51592, -77721, -73656, -119916, -103681, -48797, -69863, -88550, -64789, -22974, -24154, -46322, 17481, 118849, 58168, -20778, -113924, -123555, -43906, 23186, 1569, -69762, -88813, -69939, -42182, -40639, -41190, -62385, -79536, -79958, -78511, -117671, -65280, -14433, -75818, -108710, -48039, -60002, -40788, 26083, 3615, 22430, 34578, 2209, 41340, 66282, -10339, -33121, -11694, -15843, 2326, -39618, -5376, -19418, 2533, 34256, 61850, 40956, 4822, 956, 29297]
7568B9297k458J9175j9482m952K849r214P458K2453l5025n7522k6250k5995L1288
7555f8378L0916J6365k8256l1311M1284j663J294O1555k3469M3832L2017j2412
7543F1774l1319k2424m5133j3214p838j1556m4719k7112Q7628K4370J3113K5437
7531I007M0664j9150j1881l965P743l4686l0426k531L4070M2420j3407k6302O202
7518b242L1664R92M88J8537l6625m724j0774K3754N510K196K0959L706k5520m9770
7504b1849K127r631L6002k8249m3324K8087L6866n1400o6732J03666M7846k0714
7492A2695n9454m6291Q6859O6279P928k052j936q9718j8008L5528L227j6631M8102
7479B6528l5631m3986m6725q200L0513M6472k0134m6361P6877J42147L3161n1313
$$ y = [29297, 26839, 46014, 26532, 21580, 24429, 15215, 22673, 45126, 10101, -47421, -73671, -99666, -68378, -37462, -21097, -49353, -80664, -39380, -41043, -39749, 21806, -1663, 42169, 74186, 61774, 30455, 8031, -37102, -50316, -58154, -69710, -114429, -141541, -53913, -29543, -16430, 9007, 49671, 30521, 18640, 14675, 22418, -12268, -42694, -45225, -11155, 31265, 17858, -8444, -2242, 29422, 30414, 30902, 49439, 12814, 8090, -2684, 21070, 26580, 28776, 49735, 53441, 27921, -21849, -19722, -29353, 6649, -21600, -64924, -36837, 29, -51371, -118103, -14437, 33409, 12695, -46759, -93050, -6191, 60088, 68016, 65964, 64028, -25690, -43698, -8170, -4943, -21574, 26528, -9103, -53089, -99814, -108014, -77501, -31029, -51163, -97524, -20647, 121500, 154661, 103348]
7467A03348o4680o2118l5134j996j0414L495l0261M7425M9922m4298p166O4383
7455A2506O0050L7446j4960L583k3235L6216P306k5341L656o3028n0711K4843
7443H331l6779k6353K1803P0163J8124p978n616o0421o823k4873L0562J9732M3372
7430D3244N9098K4670o5608j00187m8659l15K6648O1609O9240M4148R063j05544
7418A7407n5497l5904M2967J1132n2290K3598L2391O9923K5661l3950o1388p8551
7406i4501L9529L4263q2857k9584L3644k6430K3458M4938Q495J9717M0110L9307
7394E0089n9966O522N8719J4153J6111n4847k8515j6136p131K4754K1776K4875
7382E0404p9145l8621O7860r887J385N8549P324j2945L299k5981l0896k0636m1121
$$ y = [103348, 38668, -23450, -58584, -60580, -70994, -67499, -97760, -50335, -413, -44711, -51877, 12506, 72556, 110002, 95042, 98625, 75390, 111606, 118912, 93571, 97227, 34199, -16512, 8331, -28448, -54801, -32998, 37165, 55289, 47311, 41695, -18726, -25549, -50422, -19860, -128, 43244, 102342, 127012, 61404, -38783, -87442, -87757, -61109, 500, 69740, 113888, 122951, 17407, -38090, -73994, -31027, -19895, -72185, -48587, -16196, 53727, 79388, 45438, -15950, -94501, -54972, -20709, -103566, -133150, -99506, -125936, -102478, -57540, -49045, -29328, 10782, 50089, -9877, -3355, 55364, 69517, 85628, 30781, 2266, -13870, -21001, 3753, 25529, 50404, -28741, -67362, 498, -9389, -8004, 50545, 57869, 44924, 48223, 22242, -8654, -29290, -70411]
7369g0411R871M0336p785K1949J5975M9053j9279n3444k9651L4782l0769m8117
7357h7490O6345J6309O5048N7134l2452q3992o0113K6412L6788J272L0655j444
7345C4472l3333k3487l4002J3685l3104K6074O324L4562L7632K513k0162m7740
7333c6566j2412k6597L5335J261j0196M9942N4036n4619j27552k4638L2513M447
7321a15046M4832P4325K2295O837k4852K6154r470n1277n1379L6707r144k8481
7309g8499L0996K3267n839m6773p236L5044k3064n8089j4846J9744P2674Q840
7297d3781l4009K9205M4183l7069m5288j3576L1703J0539K8224M8894L0167m373
7285D4819p88j0879M1875J8788n5651q88o1809m3730M4655n360k3961j1954n7184
$$ y = [-70411, -60540, -20204, -27989, -6040, 9935, 58988, 39709, -13735, -43386, -8604, -39373, -87490, -21145, -4836, 60212, 117346, 84894, 902, -59211, -32799, 3989, 5261, 35916, 34472, 1139, -22348, -56350, -42665, -75769, -49695, -43371, -8809, 28823, 31336, 11174, -36566, -48978, -75575, -40240, -38979, -49175, 767, 54803, 184, -127368, -152006, -119493, -115046, -70214, 4111, 26406, 33243, 8391, 34545, 25075, -26202, -77581, -40874, -50018, -78499, -47503, -24236, -30075, -76848, -84084, -49040, -72104, -130193, -145039, -125295, -52621, -43781, -77790, -48585, -4402, -41471, -86759, -100335, -68632, -58093, -29869, 19025, 49192, 44819, 44031, 33152, 75027, 93815, 38164, 37276, -24533, -68263, -23608, -28968, -52929, -64883, -122067]
7272a22067P2521Q8925n6202l2645l1168Q962M7521n206k2771l4948O2660N557
7260a8861M4319J2327R743j9102K6301K8165j5587p4528K781J6074P4582k304
7248H3910J0290l5355o0124l554j107R263p3434m2938j0713M1893L1825J0869
7236c9175J3463L6530q860k8578l2574M3122J8002k9547j7281p854M7771J00077
7224I5096M7377n5409l2294k2532m5415j5284J6824L117L995P530N457K9796O658
7211D4916K7624l7561m8348P452M2879L4574J1541p4722m5150l417L2048R80l4717
7198d1901o891N8480K0877j9251j2036n7453M0553M1022P588J800j8924n20l7788
7185b4444L5633j401K0070P661j311j1095M4669o0536q0734K1341J7857N9k7097
$$ y = [-122067, -49546, 39379, -16823, -49468, -80636, -71674, -24153, -29359, -52130, -87078, -24418, -18861, 25458, 37785, 47528, 28426, 54727, 82892, 67305, -7223, -4442, 11632, 86214, 83910, 94200, 58845, -1279, -4833, -5940, 3323, -70111, -113049, -123762, -81869, -50044, -39175, -25712, 10818, 1958, -26620, -59194, -16072, 1930, -27617, -44898, -52752, -4981, 95096, 142473, 87064, 54770, 32238, -13177, -28461, -11637, -8520, -4525, 3005, 8462, 38258, 44916, 72540, 34979, -13369, -5917, 36962, 71536, 83077, 8355, -36795, -40212, -8164, -7184, -41901, -48792, 9688, 30565, 11314, -722, -58175, -17622, 23400, 30988, 32788, 13864, 13344, -24444, 11189, 9788, 29858, 37519, 36208, 25113, 69782, 9246, -71488, -50147, -32290, -32231, -59328]
7172e9328L8377L5051j8446J1320N278J107J5330K8566M7300l5220j9768j8553
7160C1014k737K2810K0973n573n874K541j8364m1060j8467J1100j9101q840n154
7147c6732K3575l1990K1480q437o758O543L6061P8881r553n9927k56j3151j8949
7134a9213m390K8J0297L3141K7965k6510l0858K339j5092N916K0478L5122L6624
7121G5847n8735J2065q92l7685m2523L9042J7164L9188K396L5368J8488j8826
7109H0897p3571j6791L4752J9450j2776l912k6663l8824j4612N0218k3344K16
7097b4960j0717J0539N6209L1575m8080k0205q279n770N3193N909r583k2547K4995
7084C2279J3713J8460k8573p0122M7882R305l4838n9918n5187N3297L8187L2431
$$ y = [-59328, -20951, 14100, -4346, 6974, 12252, 13359, 28689, 57255, 104555, 69335, 49567, 31014, 28277, 51087, 72060, 66487, 60613, 63154, 44790, 3730, -14737, -3637, -22738, -31578, -36732, -13157, -45147, -23667, -32104, -38862, -32319, 3742, 82623, 73070, 13143, 12887, -264, -19213, -23603, -23575, -13278, 19863, 47828, 21318, -9540, -7201, -22293, -16377, 4101, 39223, 75847, 17112, 29177, 28285, -9400, -51923, -12881, 4283, 43471, 45867, 81235, 99723, 80897, 7326, -9465, 25287, 44737, 31961, 28049, 1386, -37438, -52050, -1832, -25176, -24960, -35677, -25138, 31071, 62646, 14566, -5639, -13918, -19688, 33505, 39414, 29831, 7284, 32279, 45992, 64452, 35879, -34243, 13639, 22944, -11894, -71812, -126999, -73702, -35515, -3084]
7072c084M7627l3677k1635N4946j5304n6933J1064k977K707m266k184L682K9971
7059I937P261l9534l4381K9284N3290O8504j2095l2264J6037J7850L2274j850
7047A14313l7510m6271m2984q5448M6002J14792r044k2043j2522l4357l2374N414
7035d2032l2367j3227R2006N9271q2022o0434L3379Q932j4517N822l8316M7969
7023c5536K0381J2142J0813N3982J1220j4964r9340q2690k866l6802q843M6086
7011a26417J3000Q2954M5636K9468l9758k1840j6156M1391N1383j4900K5127k6621
6999D3267n9972o1210l3582M47Q3121L2795j7702m3308R1989L7619q092j116M356
6986F8612K5356m4506j7630Q043J3763n3066l8462k3824l1811M3203M1674J3764
$$ y = [-3084, 44543, 10866, -10769, 44177, 28873, -28060, -16996, -19973, -17266, -21532, -23716, -20034, 9937, 17198, -22336, -56717, -27433, 25857, 94361, 82266, 50002, 66039, 83889, 116163, 114313, 76803, 30532, -12452, -97900, -51898, 62894, 53850, 31807, 19285, -15072, -47446, -42032, -74399, -87626, 4380, 63651, -18371, -78805, -45426, -36494, -51011, -45189, -83505, -35536, -15155, -3013, 7800, 61782, 73002, 58038, -41302, -123992, -126858, -163660, -172503, -126417, -113417, -30463, 15173, 44641, 4883, -16957, -33113, 8278, 59661, 44761, 69888, 43267, -16705, -77915, -111497, -111050, -27929, 4866, -12836, -56144, 35845, 73464, 65372, 64256, 68612, 93968, 49462, 31832, 39875, 53638, 572, -37890, -61714, -93525, -50322, -8648, 5116]
6974E116j5362l5406L5413L2949l0098K1078N9697o5283l2246K864N018O828R451
6961A9n4735m1936M4319L0825q699m2127N6389q398J0380K5344j5674M423k8092
6948b7962K0572L4440l135p7838k7488L3997L451L9883J3207l7961l1800P742
6936e2892j7367J2687p394n396O2319J4323K9206N3855O32l3525m2240n548l5333
6923b6673o7944K669L2687K5070K669L642n6938l8825N54J01359M0233r373j0402
6910a272M7258j4540p4803Q827O2577Q006k6350M541J0012l5653j3343N1848j8915
6897H193q7862l2271O6700J6561n5885L30N7894o2846J52N6119J8214m3125j5819
6884g3645N5951J4622P65r374n354j1127L2957p8028M129M7237O6329j1327M0961
$$ y = [5116, -10246, -45652, -10239, 22710, -7388, 13690, 73387, 8104, -24142, -21278, -16260, -9432, 19, -54716, -96652, -52333, -21508, -30207, -72334, -15945, -24343, -13963, 11381, -4293, 130, -27962, -7390, 27050, 23915, -53923, -81411, -47414, -43963, -4080, 9127, -28834, -60634, -52892, -70259, -57572, -64966, -70362, -8043, 6280, 35486, 89341, 89973, 56448, 14208, 8660, -26673, -94617, -91948, -59261, -34191, -31522, -27880, -84818, -123643, -123089, -21730, 18503, 9130, -1272, 45986, 31446, -43357, -34530, 28047, 36053, 9703, 14244, 24256, -11397, -24740, 27108, 8193, -79669, -111940, -45240, -28679, -84564, -84234, -26340, -89186, -89034, -32915, -14701, -57826, -73645, -17694, -3072, -2307, -11681, -17035, -28162, 4795, -73233, -69104, -21867, 44462, 33135, 74096]
6871G4096k6555o2870l8419q046j225K674L902j2100K4000J4412n1943J7860N4724
6858i490J2857j1617n9946r232K4734K7965M4365l5124Q656M7400K5357n4778
6846A1147L8206M1095m5814k4743L5882l0137q6231o6283l8368J5779Q3353J5026
6834e1088m4274k3740l3782J9830N4074K5454K1714M6467J9613p79j4191N7k2508
6821c153L1380k5598p4046K3636J3348j576J2802K324q710M5689k8569J5413k8020
6808b5080l1673M8201r34q2062l546N2124K6733j8186O3263j9746o7767j008M1331
6795a8350k3617j6343j5448K7212n002J5246N0878p625O2208O768K1342l0147
6783F7122l6959p0173r9053k9769M615K8474P7241N8593K1265Q605o202l4733
$$ y = [74096, 47541, -15329, -53748, -61794, -63019, -60345, -56443, -68543, -44543, -30131, -82074, -64214, -9490, 3367, -8250, -68196, -77428, -52694, -24729, 19636, -15488, -6832, 40568, 65925, 11147, 49353, 90448, 44634, 19891, 55773, 25636, -60595, -126878, -165246, -149467, -66114, -51088, -95362, -119102, -152884, -133054, -78980, -53526, -31812, 14655, 34268, 33489, 19298, 19355, -3153, 28227, 2629, -71417, -47781, -34433, -36009, -23207, -20883, -29593, 16096, -12473, 2940, -25080, -56753, -8552, -9486, -91548, -95094, -42970, -16237, -34423, 28840, 9094, -58673, -59681, -18350, -41967, -58310, -73758, -46546, -51548, -36302, 14576, 6951, 69159, 75927, 97269, 67122, 30163, -40010, -139063, -168832, -164217, -135743, -58502, 91, 21356, 29961, 23759, -10974]
6771a0974n7512J3253J1499n5855R708J5671M278l859J2099l67J1901J7513m2501
6758g5146J7212k160k094J3257m7601j08072L3850Q0722L3920j1588J0636k1869
6746g8933R580N2403O4767K1808K7253k3026j0146j6745n5633m6144Q021L9420
6734g375l8797J7377M6392J8458L493m4700l9349k8485K3121L7961P289o539n2402
6721f3556J13840J6866l9276L5529P4934p75j3940K3058j3963o3065m3769l1832
6709e949l7057q535L0036L3571K0853j4267j4506K0196j281l9851m8899l7640
6697a03329L8429J9386j3081K4393l334J0623K3353O0747L3432L6258L8661n1225
6685A14313j5441k8399n0585k8522n1539L3175L6334k0032M218M5754K2945l2655
$$ y = [-10974, -68486, -55233, -43734, -99589, -89881, -74210, -69932, -73791, -61692, -62059, -50158, -32645, -75146, -57934, -60094, -62188, -48931, -96532, -204604, -170754, -90032, -56112, -67700, -57064, -78933, -69353, -16950, 47817, 69625, 96878, 73852, 63706, 46961, -8672, -54816, -46795, -7375, -46172, -28795, 17597, 36055, 39548, -5152, -44501, -72986, -49865, -11904, -4615, -11154, -63556, 50284, 67150, 27874, 63403, 138337, 137562, 123622, 146680, 132717, 69652, 25883, -5949, -43006, -51541, -21505, 12066, 32919, 18652, 4146, 24342, 23061, -16790, -65689, -103329, -64900, -45514, -58595, -34202, -37536, -26913, -3560, 57187, 90619, 126877, 165538, 114313, 98872, 70473, 19888, -8634, -60173, -26998, 9336, -10696, -6478, 39276, 62221, 29566]
6673B9566J7354L2341j8183n8132j4668K0132M2282j2811K539L2698p8028m7417
6661e2327P9116K5621O591j3369l806l5472Q018L9742k0651p144P870j106L9805
6648G2888j3958j6027q958m9404o6749M693J5221m204l0974M1409O4197J4896
6636B3030q498L5708l8189n6038M0004J5646J7082R530k0763J6176K0724R302
6624F3714Q652j1837k6577k6926k3425j1678J8466L944M133q0018M312l5499J1126
6611a01613N2151j1780k4670o65P3069M1768J8211j2029m7244j5855l4586m0964
6599a04207J2703L9739J3337r890j7058M7024K7060N1169M7651k4130p5611o1278
6587e3491P61J3681k4915M3004P0909j7392k4129o6174j9966N1826k65l2260J2136
$$ y = [29566, 46920, 79261, 61078, 2946, -11722, 8410, 50692, 37881, 40420, 73118, -4910, -52327, 26789, 52410, 59001, 45632, 41826, 6354, 14372, 54114, 33463, 26319, 34189, 33083, 72888, 58930, 42903, 33945, -15459, -82208, -77515, -62294, -66498, -97472, -56063, 8134, 23030, 14532, 50240, 12051, -43987, -3983, 11663, 28745, 38275, 17512, 33688, 54412, 63714, 72366, 60529, 33952, 7026, -16399, -28077, -9611, -5667, -1534, -81552, -77240, -112739, -101613, -49462, -61242, -85912, -86577, -13508, 28260, 46471, 34442, -12802, -28657, -63243, -104207, -91504, -51765, -38428, -48318, -65376, -18352, 8708, 59877, 107528, 83398, 7787, -53491, -52730, -39049, -63964, -20960, 49949, 32557, 8428, -57746, -77712, -25886, -26151, -58411, -46275]
6574d6275M5244n4545n6153L824Q6022M3504J1351j8208j9593m3244k4256m8060
6562a20389J9755K0457J3107O5030L48K3663Q761j23316j2806O9615J9795N7842
6550D1862K3304n6389L5059k2113J0897K9905l6772L5739m1747n811L036l0696
6538a3726O907M0225K3327l9956J3835m0356P988j1955j6936N885K0077J3257
6526H572P472l6344k0809m6506L4431L2003k2195K1815M2983l0856O731q182J8222
6513G337j912p0954R5170J8404o7112L8071L8527q7059o5807J2392N7759P590
6501a7594Q4425O535o0877p4752Q36N0339j4074m9196k7695L6219O777Q283l0576
6488h1350k8382M2525J3773r811m8290K8135L5131K8015J6445j9740m0948j9992
$$ y = [-46275, -1031, -55576, -111729, -107905, -21883, 21621, 32972, 14764, -4829, -48073, -72329, -120389, -100634, -80177, -67070, -2040, -1692, 21971, 30732, -92584, -105390, -35775, -15980, 41862, 65166, 8777, 43836, 21723, 32620, 62525, 25753, 61492, 19745, 13934, 16970, -13726, -6819, 33406, 56733, 16777, 30612, -9744, -1756, -13711, -30647, -24762, -4685, 8572, 16044, -20300, -41109, -87615, -53184, -21181, -43376, -21561, 21422, -9434, -2703, -10885, 7337, 5425, -65529, 29641, 48045, -19067, 19004, 57531, -29528, -95335, -82943, -25184, -17594, 66831, 73366, 12489, -62263, -61427, -11088, -25162, -74358, -102053, -65834, -59057, -50774, -81350, -109732, -67207, -53434, -63245, -111535, -83400, -48269, -20254, -3809, -23549, -64497, -84489]
6476h4489M683J83j3414M2427p597K3176J10413m4913k3299n935j3738l479K5171
6463I189J3540n033j3755N725L1974L909l1020R654j2035k3453k8704o084L4502
6450a1591K6239m4465J714L6197N6054J1623j7336p2758k3652r376k1242j5801
6438h4394j5109N5034J9233K2871j7100n2317Q402r130N4463O8296j169l6362
6426A2718o1526n7479R333K9169O6939O7311m3045k9649m4877O62r086R766k2504
6413g2268K7557M3617M7359J573j02567l4067K3485M2865J0838K3933j1275n2795
6401e1745J9637M7368N7682j4089j08117o5011J6092J0982L5949J9341n469k3380
6389f0760n7511K7494Q8015O7443K2096m2636j07316k7937L3442N9084K0058l4214
$$ y = [-84489, -79806, -79623, -93037, -50610, -58207, -35031, 75382, 30469, 7170, 1235, -12503, -15982, 9189, 22729, 17696, 3941, 9666, 41640, 45549, 14529, 24183, 12148, -11305, -40009, -46093, -11591, 14648, -29817, -28103, 8094, 64148, 75771, 58435, -14323, -37975, -47351, -68593, -84394, -99503, -44469, -25236, -2365, -19465, -71782, -63380, -72510, -18047, 50249, 49080, 12718, -48808, -106287, -96954, -67785, -846, 66465, 23420, -6229, -51106, -50444, -59530, -49764, -72268, -44711, -1094, 46265, 47838, -54729, -88796, -65311, -22446, -11608, 12325, 1050, -51745, -32108, 15260, 72942, 58853, -49264, -114275, -98183, -87201, -51252, -31911, -37380, -60760, -118271, -90777, -2762, 64681, 86777, 44141, -63175, -91112, -57670, 1414, 21472, -12742]
6377a2742O685j2761l5765J5467O5454P182J7810l2049l7351K3178N1391J1236
6365F7735j7422J9307J8485k2068k8133O497p938n7580l518j351N6260l1613K114
6352G75R055j4114L8652J877m4157k0238o799L277j6211m6830J6950K7300p951
6339e8414L9133j5316J5653M2626M7939K4908n9764r2537J0613J9905m4241k596
6327g2091J14976j2847o7705n0467N0110J3290O7363n8257q2569J7678L0822K101
6315d7596M709M6987P322j5106k4647L0863j9430k9880M8700K2200N222k3705
6303E639P4066N7629R46n3464n5504l1457r157J5473k8168j2871o7852J4153L6937
6290e3630J17278l0923j02861N6753K7532p0890L49J1987J0106J2446j9953j8071
$$ y = [-12742, -6057, -18818, -54583, -39116, 26338, 33520, 51330, 19281, -18070, 5108, 56499, 67735, 50313, 69620, 88105, 66037, 37904, 44401, 36463, -21117, -24635, -25986, 30274, -1339, 775, 9830, -4284, 34368, 36245, -7912, -28150, -34949, -31672, -47883, -94713, -77763, -50463, -58414, -19281, -34597, -18944, 23682, 71621, 96529, 36765, -55772, -45159, -25254, -69495, -72091, 42885, 30038, -37667, -88134, -38024, -24734, 42629, -15628, -98197, -80519, -49697, -47596, -42887, 4100, 11422, -3684, -28331, 2532, -16898, -46778, 1922, 24122, 29344, 5639, 79705, 137334, 138280, 84816, 29312, -2145, -11302, 4171, -23997, -36868, -104720, -90567, -53630, 63648, 32725, -70136, -13383, 14149, -56741, -56392, -44405, -34299, -21853, -41806, -59877]
6278e9877j9055O90O568J9974M2159n9772M0285P686L0256j5561j8963k161Q7665
6265E9894j729n2593M773n438o9439k0504k9021l6133J8980O9678N0340N164k9885
6252c5913m4421o0811Q015K6490O5574P5591M841l4862l7246j1077L1865k6505
6240c8459o5097m2342k4027J15920L8912k6998m9317N5415m65o1652l817P6024
6228b5903j6914j7200K1002M3269l9929j0211j8940o0880J9452L6262J1196r562
6216f8358r992l7608O59O6859J0209k3194r783N987m367J6692J1558k7482m1250
6203a10070q643k8751P4207O0688M1480N6731o0418n6192o4983m2955M778L0790
6191a03338N1000N1486k4048k7717o7295k5865L5250N3345P6284L0000n8506q2790
$$ y = [-59877, -78932, -78242, -71674, -51700, -9541, -69313, -29028, -21342, 8914, -6647, -25610, -27771, 59894, 58165, 5572, 10345, 4907, -64532, -85036, -114057, -150190, -131210, -61532, -11192, -6028, -35913, -80334, -141145, -133130, -106640, -41066, 34525, 39366, 4504, -32742, -43819, -11954, -38459, -103556, -145898, -169925, -54005, -15093, -42091, -91408, -35993, -36458, -98110, -101927, -25903, -42817, -60017, -39015, 4254, -35675, -45886, -64826, -125706, -106254, -69992, -58796, -68358, -78350, -115958, -115299, -48440, -38231, -61425, -71208, -65221, -69588, -52896, -41338, -68820, -110070, -118713, -147464, -73257, -12569, 28911, 85642, 25224, -30968, -95951, -138906, -134128, -103338, -52338, -852, -24900, -52617, -119912, -145777, -110527, -57182, 19102, 49102, -9404, -92194]
6179i2194J9981L8850K3852K951k9958k8046J9845K6796K5713P3767K4601n1322
6167E4836M260m2449q169k9660k529L4975l3906k9126J4238n864k1256m7570O826
6154a05394M7547n1229L1229L8219M0892L7625J2746O064J5907l3822j9635n5880
6142c5731N8186k7264o2857J0360N464R061M9734l5636m7140M4985L477L0015
6130B654N6969K0084j252J6716q3848k2574N455j1035M524j4705J910j6857K5177
6117a6782N0502L1569j9791j4065n0190k5346J1898J5087j1771L5489m3041m265
6105d0706L8722J3062r284o8756J8497K7513m4690j0627J2310K8357Q211O305
6093b1086J089k2901J5670M4550J0230k4080k9761l8133K0595O6121J6396k5699
$$ y = [-92194, -72213, -33363, -9511, -6560, -36518, -64564, -44719, -17923, 7790, 81557, 106158, 54836, 59096, 16647, 8478, -21182, -23711, 11264, -22642, -51768, -37530, -43394, -64650, -112220, -105394, -57847, -109076, -77847, -39628, 1264, 38889, 51635, 57699, 73606, 39784, 20149, -35731, 22455, -4809, -67666, -57306, -51842, -42781, 6953, -28683, -75823, -30838, -27361, 2654, 59623, 79707, 78455, 95171, 11323, -11251, -5796, -16831, -12307, -27012, -25102, -41959, -16782, 33720, 65289, 45498, 31433, -18757, -44103, -32205, -17118, -28889, 6600, -36441, -40706, -1984, 11078, 1794, -66962, -48465, -20952, -65642, -76269, -63959, -35602, -27391, -21086, -19997, -42898, -27228, 17322, 27552, 3472, -26289, -64422, -43827, 22294, 38690, 12991]
6081A2991j8371j7922M6247K0855j0440m0020N5172K1799k4055N0204J4435K9539
6069A40434l1574p6852m4756j6489j0109Q785m8605l4299M3047M6074M880M0965
6057B1501L1708l7275l1829N7804J9551m3612K9598j5705k7457o771J0787N067
6045A3367m0130J4286P8528J3662m5426j3680Q636q128L3096j2828M21Q252J2825
6032F2881K1149j8483m3085j5643K8045R206o996N6976j083k4925o2749q096l2591
6019c5394k4q794j3683N819j9587j339l34r202p505P012M7665O067o2512K6729
6005f5082J8498L5089M0133M9338m0811j0018r05p3191l7970J277R372l6571K3381
5992h7460l5564K7085M8113O396q4036m6109J7257L5963O1483L1787K6216L8363
$$ y = [12991, -5380, -23302, 22945, 43800, 33360, -6660, 48512, 70311, 46256, 96460, 110895, 140434, 108860, 32008, -12748, -29237, -39346, -30561, -79166, -113465, -70418, -24344, -19464, 21501, 53209, 15934, -15895, 41909, 61460, 17848, 47446, 31741, 4284, -2487, 8300, 13367, -26763, -12477, 66051, 79713, 34287, 20607, 29243, 21115, 54211, 41383, 41804, 50056, 62881, 84030, 65547, 22462, 6819, 34864, 44070, 37074, 94050, 92967, 68042, 5293, -2803, -35394, -35418, -44212, -57895, -52076, -71663, -73002, -73336, -82538, -90043, -83031, -35366, -29299, -91811, -65082, -46584, -11495, 28638, 77976, 37165, 27147, 26242, -46949, -84919, -83642, -74270, -110841, -87460, -123024, -95939, -47826, -41430, -125466, -171575, -154318, -118355, -56872, -25085, 1131, 39494]
5980C9494K8668m3222l4558l181n5399K7638N0942J8867k156J8746k7144l0736
5968a2041n035P870K7963L817j9967j3746j101J7142j8739n1136K0847M7845K709
5955F428n2838l5889O1852Q362R706O7229n2169m9129j2563Q350j2960j0273M6928
5942a6966K3803m07j5829j4172L6155J0709l0213l1860k8578L7416N3437N8925
5930H2420l7926k9981l0952k5400K4428J7766P5939l5872o6845j0079m0641M3106
5918c4037J2988n579J7704j606o944N72j1947l959Q011L8666L0666L5101K5563
5905A05199p6766j54818j8920P3795M0003K7270M6245N0520o7438j2628J1870
5894B4332L3096J3561n7426m387J2944l0817j4493m5638K8105M4097M3978m2496
$$ y = [39494, 68162, 24940, -9618, -12799, -68198, -40560, 10382, 29249, 27093, 45839, 18695, -12041, -17076, -9206, 18757, 22574, 2607, -11139, -12240, 4902, -13837, -64973, -44126, 3719, 6428, -46410, -82299, -20447, -12085, -2379, 64850, 12681, -36448, -49011, -40661, -53621, -63894, -16966, 6837, 6430, -9399, -23571, 12584, 23293, -6920, -38780, -67358, -29942, 23495, 82420, 44494, 14513, -16439, -41839, -17411, 355, 76294, 40422, -26423, -36502, -77143, -34037, -21049, -26628, -8924, -10530, -17474, -16902, -28849, -32808, -24797, 13869, 44535, 79636, 105199, 28433, -126385, -145305, -71510, -31507, -4237, 42008, 92528, 25090, 12462, 24332, 57428, 70989, 13563, 9176, 22120, -8697, -23190, -68828, -40723, 3374, 47352, 4856]
5882D856j9786K2452j4169Q561k5086K600j0459J2278J0044k9885J3253M8033
5870B2692N7922k7567m9125n6161k9595J3574N321N2560J4955n2322j6594N8346
5858e994l178j4240j5005L0343K5446j781l7196J3417J4534k3279k1012J6270
5846b1675O848N007M766j1920p203L5727Q080o150n0424l0824l8822j2510K3891
5833i5209j3450q036J3091K4889J8087j9525K1362J3397O4231j6119l6400J529
5821c2153k7781n1509j4469R0628N5512L726k8015j403J7286K5351l9513p3861
5809g6201J6127L7120j1064k6495M5366n540n104O6996K5205o472o319J1878R796
5796G5293Q086K7290k5802k4361j5072m1821m4107p333J5623K4307N6057J1386
$$ y = [4856, -14930, 7522, -6647, 1914, -23172, -20572, -31031, -18753, -8709, -38594, -25341, 22692, 80614, 53047, 3922, -52239, -81834, -68260, -62939, -10379, 4576, -47746, -64340, -5994, -9172, -23412, -38417, -8074, 17372, 15591, -21605, -8188, 6346, -16933, -37945, -21675, -14827, -9820, -5054, -16974, -24177, 11550, 19630, 13480, -36944, -67768, -106590, -119100, -95209, -108659, -116695, -103604, -78715, -60628, -80153, -58791, -45394, 18837, 2718, -33682, -32153, -59934, -111443, -125912, -35284, 20228, 23954, -4061, -5464, 11822, 37173, -2340, -76201, -60074, -22954, -34018, -60513, -15147, -20687, -25791, 41205, 66410, 59938, 53619, 65497, 75293, 83379, 110669, 84867, 60506, 45434, 3613, -40494, -47827, -32204, -7897, 48160, 59546]
5784E9546k8294q492m9974k8244k0091J9032l6702M5072O5932L6384j0654n80
5772D2935k0594K850k3767o69k4317m4568M2770J8551l028k3151n891l779j0551
5759e3209L0690q224j1033p999N2808j6211m6542O0539l3190L5511M5927n0034
5747i67n8267j3751L5774M543m4082J6114M4993K7889J750K4293j396m0411L846
5734C28J1430m798K3244P445k351J519L5481k6770q343j4953o9602L3032m6050
5721f0388q823N6413M9001K110p450P5j9377L0633N1687m0567j0441M1763M1733
5708A26369q1121n9440L6170j8321l3929L0666O18m5169l6891l45M3643M4226
5696F476R014k5260j3910L7530l756N2297l001n0715j7004J7093J3153m5740l4377
$$ y = [59546, 31252, 22760, -27214, -55458, -75549, -56517, -93219, -48147, 17785, 54169, 43515, 42935, 22341, 25191, 1424, 755, -23562, -68130, -25360, -6809, -9837, -32988, -38879, -42658, -53209, -22519, -30743, -41776, -49775, 3033, -13178, -59720, 819, -32371, 3140, 49067, -967, -59234, -72985, -37211, -32668, -76750, -60636, -15643, 12246, 13996, 38289, 36893, -3518, 328, 11758, 6960, 30204, 37649, 35298, 36817, 72298, 45528, 37185, 22232, -47370, -14338, -60388, -69211, -12798, 36203, 38313, 30863, 30938, 11561, 42194, 93881, 53314, 42873, 84636, 126369, 45248, -14192, 21978, 3657, -30272, 394, 1012, -44157, -81048, -81393, -37750, 6476, 15490, -9770, -23680, 13850, 10094, 62391, 59390, 8675, -8329, 8764, 21917, -23823, -58200]
5683e8200q266J8920N430j632J9185r551J3060L4964K571l08J7261l1177o635
5670d378K0135J173k371J523M5633P4825l7721p2091o4246j9294J2206k2888L3374
5657c4120k8060p6341J745P1772N3053K8609m284l6971k6712J4662K3402J9711
5645F466J129j4967k7013j9439l4335K1226o1542j7394K3149j7963N2583M0860
5633d7240M4377j6407n4849M2619J3229n773J4757J087j8011o3575n4266L4978
5621a09074N5595J7432N242P2314L0464k9841N488k1722k0137p0842m5679L7945
5609g2815M087R55Q884O2275M1530j8212O836j2997k1045J00366J287l4748j0321
5596E6082Q1764L2155l5456l6945p9408l1177q996k5929M1861N8966L9958k5242
$$ y = [-58200, -66466, -47546, -42116, -43748, -24563, -34114, -21054, 13910, 16481, 16173, 33434, 2257, -4378, 15757, 16930, 14559, 16082, 61715, 136540, 98819, 26728, -37518, -56812, -44606, -67494, -34120, -62180, -138521, -136776, -65004, -11951, 16658, 12374, -24597, -51309, -36647, -13245, 6466, 7595, -7372, -34385, -53824, -88159, -66933, -128475, -145869, -122720, -140683, -88100, -47240, -2863, -19270, -74119, -31500, -18271, -24044, -9287, -8200, -26211, -89786, -144052, -109074, -53479, -36047, -30805, 41509, 71973, 42132, 47620, 25898, 5761, -65081, -110760, -72815, -68728, -67773, -58889, 3386, 44916, 26704, 33540, 20543, -502, 99864, 101151, 66403, 56082, 137846, 170001, 134545, 97600, 18192, -12985, -21981, -47910, -6049, 52917, 92875, 67633]
5584F7633q1649n4164J0273K0028P102L8305n5350m8032L729M1517M7982m7284
5572d9910j7508M3733J201j8639J6264L7931m1825l5755K6458L6751L1628P4033
5560A04362O490J6489l9920l4537P0478K7360q7083j8438o5857l7690M4887N5856
5548D2397L9449l6667N273o2905k3690K5865K7334L8660m1669n4210j5499K7279
5536b8383L0837l497o369m1971n957L595m8802K6090K7091K2846l0386k0281K8470
5523d6717L3448J4067J5284P3668L2415m5296L686m0330m9703j3673R730M4227
5511C0806l2461K1746M951l6484M2609O0246n756o1404q7622K8802O67K0868j7195
5498c0227n833O6473P659m9219j6064M1397r700m8270q680k2351L9204L4010k5602
$$ y = [67633, -14016, -68180, -57907, -37879, -30777, 7528, -47822, -95854, -92125, -50608, -2626, -49910, -67418, -23685, -22484, -41123, -24859, 13072, -28753, -64508, -38050, -1299, 30329, 104362, 110852, 127341, 87421, 52884, 123362, 150722, 63639, 45201, -20656, -58346, -13459, 42397, 81846, 45179, 50452, -12453, -36143, -10278, 17056, 55716, 14047, -40163, -55662, -28383, 2454, -1043, -7412, -49383, -55340, -51745, -100547, -74457, -47366, -24520, -54906, -75187, -46717, -13269, 798, 16082, 89750, 122165, 76869, 80555, 40225, -9478, -23151, -13421, 30806, -1655, 20091, 25042, -11442, 31167, 91413, 85657, 24253, -63369, -34567, -33900, -13032, -30227, -36060, 30413, 38072, -11147, -27211, 14186, 4486, -43784, -52464, -74815, -35611, -1601, -27203]
5485b7203K9920K3659n1871j2312r732j7202K399L1427L0691n2962K9158K7467
5473C439p074J2600r866o043K0422K4027o383k5814l7610n632M669J3916k0007
5460c9356p270q216K0010N6412J5048n7424p4821q481j1286M9429L0429l604O156
5447c2974O93p463R963J5171J1392P5375K4450n0414m3549j8444K1544N7955q512
5434E5187m620j6342o5731o7536J1104P7912P383O124R252M0441l8404k9985m106
5421a9321J9326K990l3365M931k4684M2913L0947k0460n7961q725J8252l5438
5409h0595o784P7604K4392j004j8424K3061j8127k4269l274J3141k8718k2528
5397f5525K3514J5668J1850m4810j6691J8636J5289P284N202M8444p727o9694
$$ y = [-27203, 2717, 26376, -25495, -37807, -47539, -64741, -62342, -30915, -224, -53186, -24028, 3439, -3635, 8965, -901, -6944, 13478, 37505, 31122, 5308, -32302, -37934, -33265, -19349, -39356, -46626, -54842, -34832, 21580, 36628, -20796, -95617, -104098, -115384, -65955, -35526, -39130, -32974, -32281, -39744, -29781, -14610, -3218, 72157, 96607, 46193, 2644, -15800, 5744, 63699, 55187, 50567, 34225, -31506, -99042, -87938, -10026, -2643, 3481, 12733, 53174, 14770, -15215, -19321, 5, 2995, -30370, -25439, -50123, -7210, 23737, 3277, -54684, -63409, -45157, -80595, -87379, -9775, 14617, 13613, -4811, 18250, 123, -24146, -27420, -14279, -42997, -65525, -42011, -26343, -14493, -59303, -75994, -57358, -42069, -34785, -29583, 18861, 11134, -58560]
5385e8560L1524L0667K915n0565o6794j8839L1622M8512K4037J8281K2043K420
5373A7263J3836K5132k3694k6626O5107J4326p5917R434L4263M4738l9509l5572
5361B2781K4906k1392o6440q992J5563K9240N921J1895J5209M1522n4238l5533
5349a9558l2404m6512n4212K5047M2527K3818L5796K6117J9200l4890j932L2997
5337A5994j1449m3785l3251k2129L9387P5496k2473j4648M0381k2738q2502J2425
5325f9292N245Q619J5681l8375l8781O8753Q8961m9437j827M440k7563o692L4568
5312e700m316K2389k3783o3169l2737k4154O6819K0980k0386L6311N9093L1097
5300F2444j4367k9034n9374l0032q163M8237R5992j3108k3527J0651j3209n0379
$$ y = [-58560, -27036, 3631, 6546, -44019, -110813, -129652, -98030, -49518, -25481, -7200, 14843, 17263, 31099, 56231, 32537, 5911, 71018, 85344, 9427, 18861, 53124, 97862, 58353, 22781, 47687, 26295, -40145, -49137, -33574, -4334, 1587, 13482, 28691, 70213, 15975, -19558, -51962, -98474, -152686, -127639, -85112, -61294, -25498, 619, 19819, -15071, -17003, 15994, 4545, -39240, -72491, -94620, -55233, 20263, -2210, -16858, 23523, 785, -81717, -69292, -64047, -55428, -39747, -78122, -116903, -48150, 40811, -8626, -10453, -6013, -33576, -40268, -5700, -10016, 12373, -11410, -74579, -107316, -131470, -64651, -43671, -64057, -27746, 31347, 62444, 48077, 19043, -40331, -70363, -78526, -30289, 65703, 52595, 29068, 39719, 26510, -23869]
5288b3869l2097j4803j9146k5274N2213M5976R468L518q440M237l160m923j9366
5275c5666J6155K5228L1918k3880p0921j5724M792n731j0656m5949J8301j1726
5263a23859L8802r213J6761l5714J6939O8982K8453j3944q424K6296m9041K849
5251d1113O061L671M1319k1029k2641o396m0146K6199K2793p5478p532N9330K8030
5238b6932L4257R09J416N667k9095O72K0098L3557r981L0241L7597p2829j01474
5225g5897l7787N9875M3148L4736Q504k5789j1081R437L3308O9421q5570j6365
5213E940L0760J1861k7783L388k9879p3197m3410L2182K4277R201N9723L5451
5201C8514l7825o1129J2324N7445N4523N792N5431J8231K0017r868m792L789j0842
$$ y = [-23869, -55966, -70769, -89915, -115189, -62976, -17000, -7532, -4014, -12454, -8217, -11377, -16300, -35666, -19511, 5717, 37635, 13755, -57166, -72890, -68098, -73829, -84485, -130434, -112133, -123859, -85057, -94270, -77509, -113223, -96284, -27302, 1151, -12793, -21217, 5079, -43962, -41113, -35052, -31381, 9938, -11091, -33732, -40128, -80274, -54075, -31282, -106760, -114292, -54962, -26932, 7325, 8234, 9650, 15317, -13778, -13106, 6992, 40549, 30568, 60809, 98406, 25577, -75897, -113684, -53809, -10661, 24075, 32579, 6790, -4291, 5146, 38454, 107875, 22305, 5940, 36700, 48561, 20778, 24166, -5713, -78910, -122320, -90138, -65861, -56660, 3063, 38514, 689, -60440, -48116, 9329, 63852, 69644, 125075, 143306, 163323, 153455, 148663, 152452, 141610]
5188A41610o2966m140K3634J0916k9694p7762r5688p821J6381L9813N5002j9410
5176a0125n1049L3578l1795j1352O8852P9619k514k6020j5398K4830L8048j4209
5164H2465l4888o7943m7906M9891R1465J419q7337p0993P0277P1344k3923m7923
5152a4052n5376l8936K0653P5052m9762o740R2339J8142p210j8221q150p719K5232
5139B5252J827j3003k0117o9191j5751n783L9540J8640M9019o0216q4239o7612
5127b01634K9118O5604Q8048K9008K341L6342K6795j7912r1218m1425N2499O0939
5115C8505o752j5820j6557p0405j664N8217j69N3857j0099n6939l5437K7883J6657
5102a8723k4743L2634j3760k6018k4840k1736N0516M0500J1695L2280m887l1447
$$ y = [141610, 78644, 74504, 98138, 109054, 79360, 1598, -94090, -101911, -85530, -45717, 9285, -10125, -61174, -27596, -59391, -70743, -1891, 77728, 75214, 49194, 33796, 58626, 96674, 82465, 47577, -20366, -68272, -18381, 73084, 74503, -12834, -83827, -13550, 57794, 33871, -14052, -69428, -108364, -87711, -12659, -62421, -69161, 23178, 41320, 34110, 15889, 7739, 20, 25252, 27079, 14076, -6041, -75232, -90983, -96766, -57226, -38586, 10433, -49783, -134022, -201634, -172516, -106912, -18864, 10144, 12485, 48827, 75622, 57710, -33508, -74933, -22434, 38505, 31753, 15933, -624, -71029, -72693, -14476, -14645, 39212, 29113, -27826, -63263, -35380, -18723, -43466, -10832, -24592, -50610, -75450, -97186, -46670, -6170, 5525, 37805, 32918, 1471]
5090A471j5582J2058K5343k1616q136K0773q354j4361k6161P0169R4803j7084
5078A13323o8628o0463j5225M1585k3914k2186k2110N6118L0466M18o8353J210
5066c7759J7763J5779P547p20m6739K7895P896J7970k9850L008O321Q386l1634
5053c4137K6019k222k2429O639O5493N6624l1357k7652o892L2300k2131k7484
5041A2771J4242J9513j0406K8877j1705K245j7524n3538n6392m6296O0614j9167
5029g6766O698N8579J5127J5961M9842K3609n4093n0761n911K5592r48L6268J6311
5016E9508Q765J8147J8746k302j2020p3478n2270o0274J8238J3459L4829J5469
5004a3183M6101J5199m0905m3419j76J5140J5801K0060k583J670P8558n260n4773
$$ y = [1471, -14111, -2053, 23290, 1674, -6462, 14311, 5957, -8404, -34565, 35604, 130407, 113323, 44695, -15768, -30993, 10592, -13322, -35508, -57618, -1500, 28966, 29384, -38969, -37759, -19996, -4217, 3330, 2610, -44129, -16234, -8338, 9632, -20218, -17210, -10889, -2503, -34137, -8118, -10340, -32769, -26130, 39363, 95987, 64630, 36978, 30086, 62386, 40255, 12771, 27013, 46526, 36120, 64997, 53292, 55537, 38013, -15525, -71917, -118213, -57599, -76766, -70068, -11489, 3638, 19599, 69441, 93050, 38957, -11804, -17715, 7877, 6929, 43197, 59508, 68273, 86420, 105166, 102864, 90844, 17366, -34904, -95178, -76940, -63481, -28652, -13183, 32918, 48117, 7212, -36207, -36383, -21243, -5442, 14618, 12035, 13705, 92263, 87003, 32230]
4991C2230n0969o4474l0349J6148J08054k3439l9951O9660Q6435j3328j08887
4980a8870k851N9103k6641m6084o0547j8456O4032K2611L9759o51p938j5088r0853
4967a02474j5216K9493P055N9653k2128O312K8422j550N110j1432m6651l387N7719
$$ y = [32230, -18739, -83213, -113562, -97414, 10640, -12799, -52750, 16910, 103345, 90017, -18870, -21721, 37382, 10741, -35343, -95890, -114346, -50314, -27703, 12056, 11405, 3467, -11621, -102474, -117690, -88197, -81142, -21489, -43617, -37305, -8883, -10433, -5323, -16755, -63406, -66793, -9074]
$$ [...]
##END NTUPLES=NMR SPECTRUM
##END=
