##TITLE=Analysis number 313916
Compound Code cc 34904
Book Reference 441/145
Project Code adrs
Chemist Name colinb
##JCAMPDX= 6.0         $$ Bruker NMR JCAMP-DX V2.0
##DATA TYPE= NMR SPECTRUM
##DATA CLASS= NTUPLES
##ORIGIN= Bruker BioSpin GmbH
##OWNER= NMR
$$ XWIN-NMR		Version 3.5
$$ Wed Sep 28 08:26:21 2005 GMT Daylight Time (UT+1h)  MAYBRIDGE\NMR@NMR_250MHZ
##.OBSERVE FREQUENCY= 250.131544655141
##.OBSERVE NUCLEUS= ^1H
##.ACQUISITION MODE= SIMULTANEOUS (DQD)
##.ACQUISITION SCHEME= undefined
##.AVERAGES= 16
##.DIGITISER RES= 18
##SPECTROMETER/DATA SYSTEM= dpx250
##.PULSE SEQUENCE= zg30
##.SOLVENT NAME= CDCl3
##.SHIFT REFERENCE= (INTERNAL, CDCl3, 0, 16.522)
##AUDIT TRAIL= $$ (NUMBER, WHEN, WHO, WHERE, WHAT)
$$ ##TITLE= Audit trail, XWIN-NMR		Version 3.5
$$ ##JCAMPDX= 5.01
$$ ##ORIGIN= Bruker BioSpin GmbH
$$ ##OWNER= NMR
$$ C:\u/data/dgb/nmr/ADRS/10040/pdata/1/auditp.txt
$$ ##AUDIT TRAIL=  $$ (NUMBER, WHEN, WHO, WHERE, WHAT)
(   1,<2005-09-28 08:26:02.44 +100>,<MAYBRIDGE\NMR>,<NMR_250MHZ>,
      <created by zg, POWCHK disabled, PULCHK disabled
       configuration hash MD5:
       62 19 C7 07 E1 42 D1 B7 37 6C 3D D0 77 39 F9 E6
       data hash MD5: 64K
       3A 82 A5 80 FF D1 BC F5 19 F6 59 A9 53 E6 0C D6>)
(   2,<2005-09-28 08:26:13.78 +100>,<MAYBRIDGE\NMR>,<NMR_250MHZ>,
      <Start of raw data processing
       ef LB = 0.3 FT_mod = 6 PKNL = 1 SI = 32K 
       data hash MD5: 32K
       8E 5A 85 8C 41 DC D5 5C CC 1F 0C 14 5D 6F 01 5B>)
(   3,<2005-09-28 08:26:15.46 +100>,<MAYBRIDGE\NMR>,<NMR_250MHZ>,
      <apk 
       data hash MD5: 32K
       00 BB FB 15 0B 79 E9 36 D1 A4 76 4F 1A 77 CA 1E>)
(   4,<2005-09-28 08:26:16.22 +100>,<MAYBRIDGE\NMR>,<NMR_250MHZ>,
      <abs ABSG = 5 
       data hash MD5: 32K
       D2 3D E9 62 99 CF 04 1D 45 A1 59 FB 0C 1A D8 1F>)
$$ ##END=
$$ 
$$ hash MD5
$$ 82 40 2A DE AB AA 10 DA 9A 42 97 BA 8E 3F CA 0F
##$RELAX= 
##$RELAX= 
##$RELAX= 
##$RELAX= 
##$RELAX= 
##$RELAX= 
##$RELAX= 
$$ Bruker specific parameters
$$ --------------------------
##$DU= <C:\u>
##$EXPNO= 10040
##$NAME= <ADRS>
##$PROCNO= 1
##$TYPE= <nmr>
##$USER= <dgb>
##$AMP= (0..31)
100 100 100 100 100 100 100 100 100 100 100 100 100 100 100 100 100 100 
100 100 100 100 100 100 100 100 100 100 100 100 100 100 
##$AQSEQ= 0
##$AQ_mod= 3
##$AUNM= <au_zg>
##$AUTOPOS= <2 >
##$BF1= 250.13
##$BF2= 250.13
##$BF3= 250.13
##$BF4= 250.13
##$BF5= 500.13
##$BF6= 500.13
##$BF7= 500.13
##$BF8= 500.13
##$BYTORDA= 1
##$CFDGTYP= 0
##$CFRGTYP= 5
##$CHEMSTR= <none>
##$CNST= (0..31)
1 1 145 1 1 1 1 1 1 1 1 1 1 1 1 1 1 1 1 1 1 1 1 1 1 1 1 1 1 1 1 1 
##$CPDPRG= <>
##$CPDPRG1= <>
##$CPDPRG2= <>
##$CPDPRG3= <>
##$CPDPRG4= <mlev>
##$CPDPRG5= <mlev>
##$CPDPRG6= <mlev>
##$CPDPRG7= <mlev>
##$CPDPRG8= <mlev>
##$CPDPRGB= <>
##$CPDPRGT= <>
##$D= (0..31)
0 1 0 0 0 0 0 0 0 0.06 0 0 0 0 0 0 0.0002 0 0 0 0 0 0 0 0 0 0 0 0 0 0 
0 
##$DATE= 1127892361
##$DBL= (0..7)
120 120 120 120 120 120 120 120 
##$DBP= (0..7)
150 150 150 150 150 150 150 150 
##$DBP07= 0
##$DBPNAM0= <>
##$DBPNAM1= <>
$$ [...]
##$SUBNAM7= <"">
##$SUBNAM8= <"">
##$SUBNAM9= <"">
##$SW= 20.6930455092707
##$SWIBOX= (0..15)
0 0 3 0 0 0 0 0 0 0 0 0 0 0 0 0 
##$SW_h= 5175.983436853
##$TD= 65536
##$TD0= 1
##$TE= 295.16
##$TE2= 300
##$TE3= 300
##$TEG= 300
##$TL= (0..7)
0 120 120 120 120 120 120 120 
##$TP= (0..7)
150 150 150 150 150 150 150 150 
##$TP07= 0
##$TPNAME0= <>
##$TPNAME1= <>
##$TPNAME2= <>
##$TPNAME3= <>
##$TPNAME4= <>
##$TPNAME5= <>
##$TPNAME6= <>
##$TPNAME7= <>
##$TPOAL= (0..7)
0.5 0.5 0.5 0.5 0.5 0.5 0.5 0.5 
##$TPOFFS= (0..7)
0 0 0 0 0 0 0 0 
##$TUNHIN= 0
##$TUNHOUT= 0
##$TUNXOUT= 0
##$USERA1= <user>
##$USERA2= <user>
##$USERA3= <user>
##$USERA4= <user>
##$USERA5= <user>
##$V9= 5
##$VALIST= <valist>
##$VCLIST= <CCCCCCCCCCCCCCC>
##$VD= 0
##$VDLIST= <DDDDDDDDDDDDDDD>
##$VPLIST= <PPPPPPPPPPPPPPP>
##$VTLIST= <TTTTTTTTTTTTTTT>
##$WBST= 1024
##$WBSW= 4
##$XGAIN= (0..3)
0 0 0 0 
##$XL= 0
##$YL= 0
##$YMAX_a= 443523
##$YMIN_a= -349840
##$ZGOPTNS= <>
##$ZL1= 120
##$ZL2= 120
##$ZL3= 120
##$ZL4= 120
##$ABSF1= 16.522
##$ABSF2= -4.171173
##$ABSG= 5
##$ABSL= 3
##$ALPHA= 0
##$AQORDER= 0
##$ASSFAC= 0
##$ASSFACI= 0
##$ASSFACX= 0
##$ASSWID= 0
##$AUNMP= <proc_1d>
##$AZFE= 0.1
##$AZFW= 0.1
##$BCFW= 0
##$BC_mod= 0
##$BYTORDP= 0
##$COROFFS= 0
##$CY= 12.5
##$DATMOD= 1
##$DC= 0
##$DFILT= <>
##$DTYPP= 0
##$F1P= 14.0000005364418
##$F2P= -0.99999901652339
##$FCOR= 0.5
##$FTSIZE= 32768
##$FT_mod= 6
##$GAMMA= 0
##$GB= 0
##$INTBC= 1
##$INTSCL= 1
##$ISEN= 128
##$LB= 0.3
##$LEV0= 0
##$LPBIN= 0
##$MAXI= 10000
##$MC2= 0
##$MEAN= 0
##$ME_mod= 0
##$MI= 0
##$NCOEF= 0
##$NC_proc= -3
##$NLEV= 6
##$NOISF1= 0
##$NOISF2= 0
##$NSP= 0
##$NTH_PI= 0
##$NZP= 0
##$OFFSET= 16.522
##$PC= 1
##$PHC0= -73.18845
##$PHC1= 9.198721
##$PH_mod= 1
##$PKNL= yes
##$PPARMOD= 0
##$PSCAL= 4
##$PSIGN= 0
##$REVERSE= no
##$SF= 250.13
##$SI= 32768
##$SIGF1= 0
##$SIGF2= 0
##$SINO= 400
##$SIOLD= 32768
##$SREGLST= <1H.CDCl3>
##$SSB= 0
##$STSI= 32768
##$STSR= 0
##$SW_p= 5175.98343685301
##$SYMM= 0
##$S_DEV= 0
##$TDeff= 65536
##$TDoff= 0
##$TI= <Analysis number 999999
Compound Code 99
Book Reference 9
Project Code 9>
##$TILT= no
##$TM1= 0
##$TM2= 0
##$TOPLEV= 0
##$USERP1= <user>
##$USERP2= <user>
##$USERP3= <user>
##$USERP4= <user>
##$USERP5= <user>
##$WDW= 1
##$XDIM= 32768
##$YMAX_p= 348101441
##$YMIN_p= -183920
$$ End of Bruker specific parameters
$$ ---------------------------------
##NTUPLES= NMR SPECTRUM
##VAR_NAME=  FREQUENCY,     SPECTRUM/REAL,   SPECTRUM/IMAG
##SYMBOL=    X,             R,               I
##VAR_TYPE=  INDEPENDENT,   DEPENDENT,       DEPENDENT
##VAR_FORM=  AFFN,          ASDF,            ASDF
##VAR_DIM=   32768,         32768,           32768
##UNITS=     HZ,            ARBITRARY UNITS, ARBITRARY UNITS
##FACTOR=    0.157963299565203, 1,           1
##FIRST=     4132.6476996994, 0,             0
##LAST=      -1043.33573715361, 0,           0
##MIN=       -1043.33573715361, -183920,     0
##MAX=       4132.6476996994, 348101441,     0
$$ Real data points
##PAGE= N=1
##DATA TABLE= (X++(R..R)), XYDATA
$$ [...]
23102I8854l0955k766j3943k927l2260l7401o014j6770m538p07L7407L3961j6154
$$ 98854 67899 65133 51190 48263 16003 -21398 -27412 -44182 -48720 -49427 -12020 21941 5787
23089E787J0023j4430K5449K2640k9920l8524M087L0427m686l2629k1104M8362
$$ 5787 15810 1380 26829 49469 19549 -18975 -14888 15539 10853 -21776 -42880 5482
23077E482M0178J5372Q438J3827L3675N1871j4793J530J4011r375l2889m6328
$$ 5482 45660 61032 69470 83297 116972 168843 154050 155580 169591 160216 127327 80999
23065H0999J30k673l1950K0502O5031k8977m069J936k0438m4815J5796J0558k2014
$$ 80999 81129 78456 46506 67008 132039 103062 98993 100929 80491 35676 51472 62030 40016
23052D0016P936L2252M5904J9622Q408m2319l1599j8673k4864l3834J3120J4381
$$ 40016 47952 80204 126108 145730 154138 111819 80220 61547 36683 2849 15969 30350
23040C0350M2330J9961j3187K3887j1409m9600k4060M398R418M0656o805j0345
$$ 30350 72680 92641 79454 103341 91932 42332 18272 22670 32088 72744 65939 55594
23028E5594K1956j0386J3373K3808k6303l6602p263M4767L7085l0090l9695L442
$$ 55594 77550 67164 80537 104345 78042 41440 34177 78944 116029 85939 46244 49686
23016D9686J5213L0205q387r393l2993k4870j3068j3582J7252K5807l0049P792
$$ 49686 64899 95104 86717 77324 44331 19461 6393 -7189 10063 35870 5821 13613
23004A3613R496j0944j7052M3247L4516J8325n6767k0304Q176P460j0415k6073
$$ 13613 23109 12165 -4887 38360 72876 91201 34434 14130 22306 29766 19351 -6722
22992f722J665k173J8369J0194L1913K3494l2357l8253K349L158j0943K2140L197
$$ -6722 -5057 -7230 11139 21333 53246 76740 44383 6130 8479 11637 694 22834 26031
22979B6031J1718K3922K4981K9645M416l9861P022K0795L4191K0201n982j0267
$$ 26031 37749 61671 86652 116297 120713 80852 87874 108669 142860 163061 157079 146812
22967A46812j1790L2079k2802m2094j4141j2239O693l5138j4448R215O710j7747
$$ 146812 135022 167101 144299 102205 88064 75825 82518 47380 32932 42147 48857 31110
22955C1110M7030J9162r25J6072K9045K855l1481k9030M946J3098j7476k454J3487
$$ 31110 78140 97302 96377 112449 141494 144349 112868 83838 88784 101882 84406 81952 95439
22942I5439j4763j6493p811K3762K4016l786j4675J4891N734k0813P047R295j901
$$ 95439 80676 64183 56372 80134 104150 100364 85689 100580 106314 85501 92548 101843 99942
22929I9942L5456j4319k9182K3133j8358m4728J6689J2792J6105J7684k1709k5
$$ 99942 135398 121079 91897 115030 96672 51944 68633 81425 97530 115214 93505 93480
22917I3480j8791k8093R001L9169M675l3034K816J3740P781n109K8663L540l469
$$ 93480 74689 46596 55597 94766 99441 66407 69223 82963 90744 85635 114298 117838 114369
22904A14369J8182J1110l1540K6730q319M053k5393J2848j7542j5152L3733J9240
$$ 114369 132551 143661 112121 138851 130532 134585 109192 122040 104498 89346 123079 142319
22892A42319l151j3429O44k851M478j0144o2272n9548K1233J5846M0423L0451
$$ 142319 139168 125739 126383 123532 128010 117866 55594 -3954 17279 33125 73548 103999
22880A03999j1299j1280J6521l8077k1602m5595k2525K2997N5605P0234O5575
$$ 103999 92700 81420 97941 59864 38262 -7333 -29858 -6861 48744 118978 184553
22869A84553N6075M7337L8391q226j4347n7840l2095J2700j4064j41J4726j4815
$$ 184553 240628 287965 326356 318130 303783 245943 213848 226548 212484 212343 227069 212254
22857B12254o3057n7446J4456j5255M6310N1890L6218j0393k0560N4897R4485
$$ 212254 149197 91751 106207 90952 137262 189152 225370 214977 194417 249314 343799
22846C43799N8361l268o564j4619j8229j5234o6788p1644k3582N2070M5354N0247
$$ 343799 402160 398892 392328 377709 359480 344246 277458 205814 182232 234302 279656 329903
22834C29903M817o4638j7062q866M653n1697k4981K1210j4304J939l913L2646
$$ 329903 334720 270082 253020 244154 248807 197110 172129 193339 179035 180974 177061 209707
22822B09707m082J2746o760K7432J9760J1567j5127P105j6835k1763M4800M092
$$ 209707 205625 218371 211611 239043 258803 270370 255243 262348 245513 223750 268550 272642
22810B72642K2097M6470K6652q030J990L9793L4178M6466J8899L4201J15118J45467
$$ 272642 294739 341209 367861 359831 361821 401614 435792 482258 501157 535358 650476 795943
22798G95943K69388M95046M47381J85893p354l33321m72624l53615j97870j70910
$$ 795943 1065331 1560377 2007758 2193651 2186297 1852976 1380352 1026737 828867 657957
22788F57957j11230k5787l794J2467Q530k9999l3754O167k4396k6932K9599L3042
$$ 657957 546727 520940 517146 529613 538143 508144 474390 480557 456161 429229 458828 491870
22776D91870L2134K982K0190J0785J8909O9747J7154K880J6461M6187K2718M3938
$$ 491870 524004 526986 547176 557961 576870 646617 663771 666651 683112 729299 752017 795955
22764G95955M5283N4394J2341J925l711J694P5691L2447M8227M0708N4022M5271
$$ 795955 841238 895632 907973 909898 906187 907881 983572 1016019 1064246 1104954 1158976 1204247
22752A204247L2012J06755R6732M0103P6957P6716O8999J01164J01868J26234
$$ 1204247 1236259 1343014 1439746 1479849 1556806 1633522 1702521 1803685 1905553 2031787
22742B031787J91447J85000K03542J99592K19643K05152J79618K51501L56349
$$ 2031787 2223234 2408234 2611776 2811368 3031011 3236163 3415781 3667282 4023631
22733D023631M78880N43684P48094R67838J344811J573114J541414J785956K069442
$$ 4023631 4502511 5046195 5794289 6762127 8106938 9680052 11221466 13007422 15076864
22724A5076864K584079L785683N907791R342191J5699333K9028652N5133853R0323451
$$ 15076864 17660943 21446626 27354417 36696608 52395941 81424593 136558446 226881897
22716B26881897Q2476319L8743225n035197o3383407q7187889o9633579m3698436
$$ 226881897 309358216 348101441 343066244 279682837 192494948 122861369 79162933
22709G9162933k5869236j5883545j0019874o373994m114116k768128k026979j723573
$$ 79162933 53293697 37410152 27390278 21016284 16902168 14134040 12107061 10383488
22701A0383488j629596j489323j174467q79398o89598n11085m11911l84216l63971
$$ 10383488 8753892 7264569 6090102 5210704 4521106 4010021 3598110 3213894 2849923
22692B849923l13211k34062k32298k06882j79725j29311q2263q3064o8326q2826
$$ 2849923 2536712 2302650 2070352 1863470 1683745 1554434 1472171 1389107 1320781 1237955
22682A237955q7600q1538r1840j11468k1887j1138o1718o2667l1955j8583Q29
$$ 1237955 1150355 1068817 976977 865509 843622 832484 770766 708099 676144 657561 658390
22671F58390p2483k8613j9186o3754m4966j7677L7940p98l0698p554p2697l3782
$$ 658390 585907 557294 538108 474354 429388 411711 449651 448853 418155 410601 337904 304122
22659C04122K3670j4047l019l664J1573L097O066j4527j1691k7192J1716o3848
$$ 304122 327792 313745 310726 307062 318635 321732 327798 313271 301580 274388 286104 222256
22647B22256k7593J4294J5573J3340J363K3408M2327L7739J5886J2063J10340
$$ 222256 194663 208957 224530 237870 239233 262641 304968 342707 358593 370656 480996
22636D80996K67465N01273N12052K45470j0962l83301m62150l46960k95660j75927
$$ 480996 748461 1249734 1761786 2007256 1996294 1612993 1150843 803883 508223 332296
22626C32296j29294j02258k6046J112k689J2279l1775j1883j1080J212L7828J1511
$$ 332296 203002 100744 74698 75810 73121 85400 53625 41742 30662 31874 69702 81213
22614H1213n645K3644J3723k6359j9829K1300m280N691N36O167K0824n8343l737
$$ 81213 75568 99212 112935 86576 66747 88047 83767 89458 89994 96161 116985 58642 54905
22601E4905k7650j8821L009k0543J5775l4325O000K9403M7663O5106R2671Q6840
$$ 54905 27255 8434 11443 -9100 6675 -27650 -21650 7753 55416 120522 213193 300033
22589C00033J0985l8295j29741j60568j08907n226P1952O837P05R859l317j2413
$$ 300033 311018 272723 142982 -17586 -126493 -131719 -59767 -52930 -52225 -42366 -45683 -58096
22577e8096k5513K8307J7986o162k4873J3067J1599K1851j3351j2731k2329j7020
$$ -58096 -83609 -55302 -37316 -43478 -68351 -55284 -43685 -21834 -35185 -47916 -70245 -87265
22565h7265j6859k9735m0742r319L2004L2699R1988J02059N7665J6152k232k5963
$$ -87265 -104124 -133859 -174601 -183920 -151916 -119217 -27229 74830 132495 148647 146415 120452
22553A20452r613k4068l0647k0438j8796J2516k5787q091N882o448p402J6660
$$ 120452 110839 86771 56124 35686 16890 29406 3619 -4472 1410 -5038 -12440 4220
22541D220K1408o472L0512M6765k7235k4563o987m8070o6039J5411m3360l5852
$$ 4220 25628 19156 49668 96433 69198 44635 37648 -10422 -76461 -61050 -104410 -140262
22529a40262N6797L4751L891M9514R493m571l232j9995j1897J3754j176k9467
$$ -140262 -83465 -48714 -44823 4691 14184 9613 6381 -13614 -25511 -11757 -12933 -42400
22517d2400K574j8740K651o229Q892k0352k3798j2246M4659J9010K394l5607j7975
$$ -42400 -39826 -58566 -55915 -62144 -53252 -73604 -97402 -109648 -64989 -45979 -43585 -79192 -97167
22504i7167K4044K7767K4418l1938k2031J4060M0964n885k0594J0748L0988L3770
$$ -97167 -73123 -45356 -20938 -52876 -74907 -60847 -19883 -25768 -46362 -35614 -4626 29144
22492B9144l0761l5243K5386J3499J5468J7321m812l2300l1405J9966K2755O2697
$$ 29144 -1617 -36860 -11474 2025 17493 34814 30002 -2298 -33703 -13737 9018 71715
22480G1715L468j2350j4586l8857j8430k1593L2605k0651l4514L3863M3474N8970
$$ 71715 75183 62833 48247 9390 -9040 -30633 1972 -18679 -53193 -19330 24144 83114
22468H3114N0192J56103J70943K9384p6946j21412j44068p8689l4499K3947k5062
$$ 83114 133306 289409 460352 489736 412790 291378 147310 68621 34122 58069 33007
22457C3007j3056k9942p1381k6938N0166K3023K1233K2666K7763Q214K566j0585
$$ 33007 19951 -9991 -81372 -108310 -58144 -35121 -13888 8778 36541 44755 47321 36736
22445C6736l3561k4497R525N1149K0776o863J5260k9381l4400J640Q33r316P645
$$ 36736 3175 -21322 -11797 39352 60128 53265 68525 39144 4744 6384 7217 -2099 5546
22432E546j099j4872P07j6109l6512k5159L7931O8065M9320J2505j307l0775j7888
$$ 5546 4447 -10425 -9718 -25827 -62339 -87498 -49567 18498 67818 80323 79016 48241 30353
22419C0353Q647j3068m4683o9397n008N838J9669J6405J2250L8671Q747j3542
$$ 30353 39000 25932 -18751 -88148 -93156 -87318 -67649 -51244 -38994 -323 8424 -5118
22407e118k3975m620j6960o1182J4477O4484j5807K0545M867k4376J836Q909M6866
$$ -5118 -29093 -33713 -50673 -111855 -97378 -32894 -48701 -28156 -23289 -47665 -45829 -36920 9946
22394I946q449k9425m5962m1110j1991j3586N7631Q940K4349L4035M948j0948
$$ 9946 1497 -27928 -73890 -115000 -126991 -140577 -82946 -74006 -49657 -15622 -10674 -21622
22382b1622K1673Q246l3026p8487J4500M2507j983K5946r366j9892j5509J5398
$$ -21622 51 8297 -24729 -103216 -88716 -46209 -48192 -22246 -31612 -51504 -67013 -51615
22370e1615l508j2273k1123j2877L9572K3554j1913O475R465J5562j9549k1618
$$ -51615 -55123 -67396 -88519 -101396 -61824 -38270 -50183 -43708 -34243 -18681 -38230 -59848
22358e9848J2592L962L5518k886O455J3947n620l1831l883K0981m759m1441M715
$$ -59848 -47256 -43294 -7776 -10662 -4207 9740 4120 -27711 -31594 -10613 -15372 -56813 -52098
22345e2098J594k0056n4011J5468K4581k168K3124J4860n381J0086o159P785J7824
$$ -52098 -50504 -70560 -124571 -109103 -84522 -86690 -63566 -48706 -54087 -44001 -50160 -42375 -24551
22332b4551J8272k0491O158J4325j2611k0270L6003J6555j6774p088l848j2437
$$ -24551 -6279 -26770 -20612 -6287 -18898 -39168 -3165 13390 -3384 -10472 -14320 -26757
22320b6757j4102J4316o700Q94J0747k8112k1846O210K5782R937j1696L6840n674
$$ -26757 -40859 -26543 -33243 -32349 -21602 -49714 -71560 -65350 -39568 -29631 -41327 -4487 -10161
22307a0161j8449J430j1352j9575j3484M0980J1263O053R255J1349L7890n6157
$$ -10161 -28610 -27180 -38532 -58107 -71591 -30611 -19348 -13295 -4040 7309 45199 -10958
22295a0958m2160L058K240J0555l987k7344k2471L686r961l112j0018L1607M3807
$$ -10958 -53118 -50060 -47820 -37265 -41252 -68596 -91067 -87381 -97342 -100454 -110472 -78865 -35058
22282c5058N323K4185N668r994m5128J4926N1325L6185k7356j9071l3364j8641
$$ -35058 -29735 -5550 118 -9876 -55004 -40078 11247 47432 20076 1005 -32359 -51000
22270e1000Q498Q329M2405j0530j4179k6657l1022K2748K1720j7383R574j6030
$$ -51000 -42502 -34173 8232 -2298 -16477 -43134 -74156 -51408 -29688 -47071 -37497 -53527
22258e3527j4602N1381K1414R781k7754J9545P125m374m207k3021m7535j0100
$$ -53527 -68129 -16748 4666 14447 -13307 6238 13363 8989 4782 -18239 -65774 -75874
22246g5874K3806L2071L8305K536l2816n578o181J534k1590m052j7808K8450M6874
$$ -75874 -52068 -19997 18308 20844 -11972 -17550 -23731 -22197 -43787 -47839 -65647 -37197 9677
22233I677J1239j0902l6469l2198K4919j3414J9039j3006q714k2290q922L1180
$$ 9677 20916 10014 -26455 -58653 -33734 -47148 -28109 -41115 -49829 -72119 -81041 -49861
22221d9861Q963J3889m670j4638J6579L60Q144J3387J4365J7581k3822L3349J6553
$$ -49861 -40898 -27009 -31679 -46317 -29738 -29378 -21234 -7847 6518 24099 277 33626 50179
22208E0179k4199k9898l7420j7285p759k3771M74K3172P9395K8988o4493l2695
$$ 50179 25980 -3918 -41338 -58623 -66382 -90153 -89679 -66507 12888 41876 -22617 -55312
22196e5312L0621K6765K53k572k2209m8791J3088M3853L4645k0078N2135P864
$$ -55312 -24691 2074 2327 -245 -22454 -71245 -58157 -14304 20341 263 52398 60262
22184F0262l9412K4453K5115m6016m5559j0345O447K2200J9393J4478j6773k2386
$$ 60262 20850 45303 70418 24402 -21157 -31502 -25055 -2855 16538 31016 14243 -8143
22172h143o2645L941M4302J2993j5504q507l339L2632L0054j0163P315N5574O492
$$ -8143 -70788 -66847 -22545 -9552 -25056 -33563 -36902 -4270 25784 15621 22936 78510 85002
22159H5002m3190k6778N514k2143l8350R701N4168J1020l8586l8877L035J643
$$ 85002 41812 15034 20548 -1595 -39945 -30244 23924 34944 -3642 -42519 -39484 -37841
22147c7841m872n663L2647P207R004j8703j1629M1314N87J8824k1432P532j2573
$$ -37841 -42713 -48376 -15729 -8522 482 -18221 -29850 11464 12051 30875 9443 16975 4402
22134D402j7253O81p542k3321k8380N0798M6895k3441j8708L5458N8099M8233
$$ 4402 -12851 -12170 -19712 -43033 -71413 -20615 26280 2839 -15869 19589 77688 125921
22122A25921L8552M5760O8627J45106K56280M60882N24871K71543Q0202k90599
$$ 125921 164473 210233 278860 423966 680246 1141128 1665999 1937542 2017744 1727145
22112A727145m59531m57931l21936j41053j08107n0472n6714j1264k7651m4269
$$ 1727145 1267614 809683 487747 346694 238587 188115 131401 120137 92486 48217
22102D8217k1796N2983L7575l2694m5062l2274J0223K6275J1932n703m4542l8582
$$ 48217 26421 79404 116979 84285 39223 6949 17172 43447 55379 49676 5134 -33448
22090c3448m4331L3057N3593J4076j377p97J9482L2545k418j5119m0096l9502
$$ -33448 -77779 -44722 8871 22947 21570 20773 40255 72800 70382 55263 15167 -24335
22078b4335j0890M661J2221n778j5714k1771M0418j345m6833K9488j157L424K9385
$$ -24335 -35225 -30564 -18343 -24121 -39835 -61606 -21188 -22533 -69366 -39878 -41035 -37611 -8226
22065h226l4597K2958L6339j5315l7441l7115L810K6349M3364K3736Q327k8704
$$ -8226 -42823 -19865 16474 1159 -36282 -73397 -69587 -43238 126 23862 32189 3485
22053C485J4849K7950N327K4853j2297n1910m8685J7632J1456k5265M30R887K4453
$$ 3485 18334 46284 51611 76464 64167 12257 -36428 -18796 -7340 -32605 -32175 -22288 2165
22040B165M6305q177m3512j3911R943l859k592L391L516J3463l8469p382J235
$$ 2165 48470 40293 -3219 -17130 -7187 -11046 -13638 -10247 -6731 6732 -31737 -39119 -37884
22027c7884k2902j5623j9340L6760r785k1072K5053P043j5319M1217L5901M9861
$$ -37884 -60786 -76409 -95749 -58989 -68774 -89846 -64793 -57750 -73069 -31852 4049 53910
22015E3910j7089l4717L697J2801K481K2122J0513l0431k7460k3169N929m6928
$$ 53910 36821 2104 5801 18602 21083 43205 53718 23287 -4173 -27342 -21413 -68341
22003f8341j6344J6565K0221J5185J2491J3603j9863O10L0756q958n3151k7917
$$ -68341 -84685 -68120 -47899 -32714 -20223 -6620 -26483 -25873 4883 -4075 -57226 -85143
21991h5143N103K8469j860J1538O61j4084r32L2030L5246K7091n6918l4112k7303
$$ -85143 -80040 -51571 -53431 -41893 -41232 -55316 -56248 -24218 11028 38119 -18799 -52911 -80214
21978h0214J4238K9375j7345l587L6926K8735M0786J1677p5714j0636l8947j063
$$ -80214 -65976 -36601 -53946 -57533 -20607 8128 48914 60591 -15123 -25759 -64706 -65769
21966f5769L9455k6987m979N916K2663N2043J6975q432m9814j1757j2578j2781
$$ -65769 -26314 -53301 -58280 -52364 -29701 22342 39317 30885 -18929 -30686 -43264 -56045
21954e6045J7092l2934n7288J9773M6552k621k3817J0752O744J5664J5518K7523
$$ -56045 -38953 -71887 -129175 -109402 -62850 -65471 -89288 -78536 -71792 -56128 -40610 -13087
21942a3087L7603L4285J346j1485m3442m650k2742k5128R131j140J4499j3943
$$ -13087 24516 58801 60147 48662 5220 570 -22172 -47300 -38169 -39309 -24810 -38753
21930c8753L6604L5007r042k4229K9590O8376m7290l9605q450l0390k6504j9544
$$ -38753 -2149 32858 23816 -413 29177 97553 50263 10658 2208 -28182 -54686 -74230
21918g4230L7367J3460M081m987J2954P60l2760k2996J3720J2712K9683J842l3626
$$ -74230 -36863 -23403 -19322 -24309 -11355 -10595 -43355 -66351 -52631 -39919 -10236 -8394 -42020
21905d2020j6140n61K8561o158K3110k3368R422J4042J0349l6230J3901m8938
$$ -42020 -58160 -58721 -30160 -36318 -13208 -36576 -27154 -13112 -2763 -38993 -25092 -74030
21893g4030l4961p20N8923O3950J4043k5128m1002n96k7147L8419k9222m3338
$$ -74030 -108991 -109711 -50788 13162 27205 2077 -38925 -39521 -66668 -28249 -57471 -100809
21881a00809L724Q301M5648J4419j6342N516R298L2985j2391J2778M2433M814
$$ -100809 -97085 -88784 -43136 -28717 -45059 -39543 -30245 2740 -9651 3127 45560 50374
21869E0374l0938n1346j1033K5270p524k642k6523L8591J6284m5296N399J8413
$$ 50374 19436 -31910 -42943 -17673 -25197 -27839 -54362 -15771 513 -44783 -39384 -20971
21857b0971j289P17j0044Q72J2686q636l8570M088L1358P5889L376n1409l2155
$$ -20971 -22260 -21543 -31587 -30715 -18029 -26665 -65235 -61147 -29789 46100 49476 -1933 -34088
21844c4088P849J191L204K026j5703J2955j7833Q3J6921j1192k3019j5261r826
$$ -34088 -26239 -25048 -21844 -19818 -35521 -22566 -40399 -40316 -23395 -34587 -57606 -72867 -82693
21831h2693M3862J3810K8644J4311j6591j8816l1771l4946L5133J2428k425J4451
$$ -82693 -38831 -25021 3623 17934 1343 -17473 -49244 -84190 -49057 -36629 -39054 -24603
21819b4603l969q627R932K3972K42k4543k9260j8320O785L7286J8114K6007j4443
$$ -24603 -28572 -37199 -27267 -3295 -3053 -27596 -56856 -75176 -68391 -31105 -12991 13016 -1427
21806a427k6972K0678j1087l2434M860J8546K0839m392k052L2513J9817l9222
$$ -1427 -28399 -7721 -18808 -51242 -46382 -27836 -6997 -11389 -13441 19072 38889 -333
21794c33m8776m3099O601N257L5298J164K1845L2149l202k1829n230J7160N278
$$ -333 -49109 -92208 -85607 -80350 -45052 -43888 -22043 10106 6904 -14925 -20155 -2995 2283
21781B283P574J0262K4883q328l1042m707m243m3131k8991L0257o414J9231J0137
$$ 2283 9857 20119 45002 36674 5632 925 -3318 -46449 -75440 -45183 -51597 -32366 -22229
21768b2229L117p027j4108J2638M8538r223P726l6o639j5722J1322K4281l0501
$$ -22229 -19112 -26139 -40247 -27609 20929 11706 19432 19396 12757 -2965 8357 32638 2137
21755B137n8048j7256J3294j7000j7323K6876o76n600N941K4508l173k821R906
$$ 2137 -55911 -73167 -59873 -76873 -94196 -67320 -67996 -73596 -67655 -43147 -46320 -49141 -39235
21742c9235J2552m7860l0211J6468J0498K8513J5409j4121k2969k609J9770P333
$$ -39235 -26683 -74543 -104754 -88286 -77788 -49275 -33866 -47987 -70956 -73565 -53795 -46462
21730d6462M420N5204L509l770j4511k4250m5418M173j2047K0038Q332M0500N5525
$$ -46462 -42042 13162 16671 12901 -1610 -25860 -71278 -67105 -79152 -59114 -50782 -10282 45243
21717D5243K3745n982J2101j3204k4032L5329J5703k2063k3974l2672J0535k2155
$$ 45243 68988 63006 75107 61903 37871 73200 88903 66840 42866 10194 20729 -1426
21705a426P336J6414K0051K283o8232l5758K1003K3316j7421K546j4412N2390
$$ -1426 5910 22324 42375 44658 -23574 -59332 -38329 -15013 -32434 -29888 -44300 8090
21693H090M1309J0260m4231l9152k1926J1439J9475R56K7736p955J765k899l6882
$$ 8090 49399 59659 15428 -23724 -45650 -34211 -14736 -13780 13956 6001 7766 4867 -32015
21680c2015j1350J7933K9552K0805O976j7116k8505j3328J1801J4477J3485m4447
$$ -32015 -43365 -25432 4120 24925 31901 14785 -13720 -27048 -15247 -770 12715 -31732
21668c1732l7548N883L4208l6240q261l932Q385L3683K2764l3858l2954R423p689
$$ -31732 -69280 -63397 -29189 -65429 -73690 -77622 -69237 -35554 -12790 -46648 -79602 -70179 -77868
21655g7868J4710J8345K2047o2J6987J1630m1815k8887j535L054j2935L1848o897
$$ -77868 -63158 -44813 -22766 -22828 -5841 5789 -36026 -64913 -66448 -63394 -76329 -44481 -51378
21642e1378j4682N3689l893J1038K4402n322m6343p390L0840l2157j4554J4376
$$ -51378 -66060 -12371 -16264 -5226 19176 13854 -32489 -39879 -9039 -41196 -55750 -41374
21630d1374J0075L0702q325k5445Q383J2307K6234K4960n0043l8569O815m505
$$ -41374 -31299 -597 -8922 -34367 -25984 -13677 12557 37517 -12526 -51095 -44280 -48785
21618d8785J4797J1638K2385j927l8203k8566k858O357J2422L4031N6879R754
$$ -48785 -33988 -22350 35 -1892 -40095 -68661 -71519 -65162 -52740 -18709 38170 47924
21606D7924m4289l7787M571M306J3444J3400j238J1351L603K4505L4063p208l7855
$$ 47924 3635 -34152 -29581 -25275 -11831 1569 331 11682 15285 39790 73853 66645 28790
21593B8790J8146j2015j0659J8835m5081j4187n195k6476j8052J4815j8640j8495
$$ 28790 46936 34921 24262 43097 -1984 -16171 -21366 -47842 -65894 -51079 -69719 -88214
21581h8214L1606K9045J2766j2138j3179n743M056N4081K7239k590J7409J7303
$$ -88214 -56608 -27563 -14797 -26935 -40114 -45857 -41801 12280 39519 36929 54338 71641
21569G1641k9896k5127l8219p539K1591L375k8312k3052L6977L7159J8181J5070
$$ 71641 41745 16618 -21601 -29140 -7549 -4174 -32486 -55538 -18561 18598 36779 51849
21557E1849J209n657j7968K7296k8594q0210K213K1628N488K9671J3704j7466
$$ 51849 53058 47401 29433 56729 28135 -52075 -49862 -28234 -22746 6925 20629 3163
21545C163J536J1613j5666l7640m5847j2279K6248R195m2379Q06r681k634M8267
$$ 3163 4699 16312 646 -36994 -82841 -95120 -68872 -59677 -102056 -101250 -110931 -113565 -65298
21532f5298L3524o582L77K0013j8966k9418L8580L6437q749N0536K88j0616k1839
$$ -65298 -31774 -38356 -37979 -17966 -36932 -66350 -27770 8667 -82 50454 50742 40126 18287
21519A8287l9157J2046L106R402L9677K5036P494q2367n1681k3711J5654K4678
$$ 18287 -20870 -8824 -5718 3684 43361 68397 75891 -6476 -58157 -81868 -66214 -41536
21507d1536Q69l0248O942O0844O044k0168k35j5042j6829q847J0127M9921J4387
$$ -41536 -40667 -70915 -63973 -3129 2915 -17253 -17488 -32530 -49359 -58206 -48079 1842 16229
21494A6229O854P368j5824j0949J147j659M5965n692m8843o5190K81L1643L0950
$$ 16229 23083 30451 14627 3678 4825 3166 49131 43439 -5404 -70594 -70313 -38670 -7720
21481g720L7286J0428p449j0810R010l528m9114p767J7648Q181O0923L9745l0697
$$ -7720 29566 39994 32545 21735 30745 27217 -21897 -29664 -12016 -3835 57088 96833 66136
21468F6136n2386L6411J6786l8448l3042l4555l4939L0872N1061J2259k7629j0549
$$ 66136 13750 50161 66947 28499 -4543 -39098 -74037 -43165 7896 20155 -7474 -18023
21456a8023M1696J3951K4959P106k2564J8486M43k7121k3692k1753k6964m570
$$ -18023 23673 37624 62583 69689 47125 65611 66054 38933 15241 -6512 -33476 -38046
21444c8046j0743j1400L8448K5904K3097N955M275J8464L244l2205k068p785k0638
$$ -38046 -48789 -60189 -21741 4163 27260 33215 37490 55954 59198 26993 24925 17140 -3498
21431c498J7045Q023o431J1029k0517K1515R323m6933N815j9567J6293l19k989
$$ -3498 13547 21570 15139 26168 5651 27166 36489 -10444 -4629 -24196 -7903 -8222 -11211
21418a1211N0317N419m4034j9456l285p523l1876L2119M0490P685o1298k0490
$$ -11211 39106 44525 491 -18965 -22250 -29773 -61649 -29530 10960 18645 -42653 -63143
21406f3143J4037j4843l460K6825N51K0087j1775M781J6413j6142m0996N549N0489
$$ -63143 -49106 -63949 -67409 -40584 -40033 -19946 -31721 -26940 -10527 -26669 -67665 -62116 -11627
21393a1627J4522m945q121n4673J2868N7812j6087n0893k2887J4491J9644J3599
$$ -11627 2895 -2050 -10171 -64844 -51976 5836 -10251 -61144 -84031 -69540 -49896 -36297
21381c6297R896M227j9597j6106K1391J2711P234r064N273M0460l367k9869J4449
$$ -36297 -26401 -22174 -41771 -57877 -36486 -23775 -16541 -25605 -20332 20128 16761 -13108 1341
21368A341K840j380k7329L704L1358j9323k0343j1854n119N0473k209K405k3179
$$ 1341 4181 2801 -24528 -20824 10534 -8789 -29132 -40986 -46105 4368 2159 4564 -18615
21355a8615j0908N911m826k2860K5935L3284M3022r949k5874j4893K1069K665
$$ -18615 -29523 -23612 -28438 -51298 -25363 7921 50943 40994 15120 227 21296 23961
21343B3961N954L007J2241J994l1967l5891j1862m290L084k4965j1472J3929p60
$$ 23961 29915 32922 45163 47157 15190 -20701 -32563 -36853 -33769 -58734 -70206 -56277 -57037
21330e7037j4049l3312k611N1904J9321m9531J9010N9063K2902k5523l4754M555
$$ -57037 -71086 -104398 -107009 -55105 -35784 -85315 -66305 -7242 15660 -9863 -44617 -40062
21318d0062L6557l7040l6964l265O9495L2206J9747j7340k8459j3844R52O989
$$ -40062 -3505 -40545 -77509 -80774 -11279 20927 40674 23334 -5125 -18969 -18017 -11028
21306a1028J6645J53j9623l6606L0533K1750L6783K3879k0813n9893n3033P31
$$ -11028 5617 5770 -13853 -50459 -19926 1824 38607 62486 41673 -18220 -71253 -70522
21294g0522k1678k1163O93J2381L5492K5874N1533L379L190J862k9796L0759L5154
$$ -70522 -92200 -113363 -112670 -100289 -64797 -38923 12610 15989 19179 21041 -8755 22004 57158
21281E7158m2641l3118p293j7789J8601M5833N3460j006n8415k8123K7050j8661
$$ 57158 14517 -18601 -25894 -43683 -25082 20751 74211 73205 14790 -13333 13717 -4944
21269d944k3453j0040L4744J8916l5050m0563q545L6495j684r364O37N1907K3365
$$ -4944 -28397 -38437 -3693 15223 -19827 -60390 -68935 -32440 -34124 -43488 -42851 9056 32421
21256C2421n3960j0815r730j7068L9852O4796l3450o5422k3128N6571O0124Q513
$$ 32421 -21539 -32354 -42084 -59152 -19300 45496 12046 -53376 -76504 -19933 40191 48704
21244D8704l4859J3826K4977m0251m9325k5261j4217J8050L3000J2921J3903M671
$$ 48704 13845 27671 52648 12397 -36928 -62189 -76406 -58356 -25356 -12435 1468 6139
21232F139m4719K3464L9409M521m151o178k4140k7868q944j791K400m890k0107
$$ 6139 -38580 -15116 24293 28814 24663 18485 -5655 -33523 -42467 -44258 -41858 -46748 -66855
21219f6855P260L5965N4154r728K0218J2284m8873l2195M2330K1547j090n610
$$ -66855 -59595 -23630 30524 20796 41014 53298 4425 -27770 14560 36107 35017 29407
21207B9407j7676l599l4933l6092O09M0041k2614k4559o366N790J6782O036k3430
$$ 29407 11731 8132 -26801 -62893 -62284 -22243 -44857 -69416 -75782 -69992 -53210 -47174 -70604
21194g0604j3413K2116M140N6952K9985p070l5051K0310J4098N352L2334j8839
$$ -70604 -84017 -61901 -57761 -809 29176 22106 -12945 7365 21463 26815 59149 40310
21182D0310m6192j5007p428q683O0893K7875M202K0120j7509k0998k8710N3214
$$ 40310 -5882 -20889 -28317 -37000 23893 51768 55970 76090 58581 37583 8873 62087
21170F2087K1252j2567m1713m7806L709k583j60J1313J3490k6107J2975l914p989
$$ 62087 83339 70772 29059 -18747 -15038 -17621 -17781 -6468 7022 -19085 -6110 -10024 -18013
21157a8013k2348l552J0549J1534j732J7489J4833L0024J0422n2733K386J7563
$$ -18013 -40361 -43913 -33364 -21830 -23562 -6073 8760 38784 49206 -3527 -1141 16422
21145A6422j5363m2190k3793K2351n311K0028J0965p774k3695j4880J6334j0729
$$ 16422 1059 -41131 -64924 -42573 -47884 -27856 -16891 -24665 -48360 -63240 -46906 -57635
21133e7635L3738K1163k1339o305O165j3156J9089K6952p0572l1486N4265M3199
$$ -57635 -23897 -2734 -24073 -30378 -24213 -37369 -18280 8672 -61900 -93386 -39121 4078
21121D078K6987K9958k293k28l8191l2909J0813l7972l8570j2202K0948J4224
$$ 4078 31065 61023 58730 58502 20311 -12598 -1785 -39757 -78327 -90529 -69581 -55357
21109e5357J4213L7489K2163J4553j6434L7357J5635m9770l0983j1737P0132K9552
$$ -55357 -41144 -3655 18508 33061 16627 53984 69619 19849 -11134 -22871 47261 76813
21097G6813k4313l2555j1814k2413p737j6578l8583j3460K8724J2033K8356J5665
$$ 76813 52500 19945 8131 -14282 -22019 -38597 -77180 -90640 -61916 -49883 -21527 -5862
21085e862k6794j2982J1362j0563n595K1860k1576r908Q269N5081K9896j4310
$$ -5862 -32656 -45638 -34276 -44839 -50434 -28574 -50150 -60058 -51789 3292 33188 18878
21073A8878l2589K1517P298l7702l0123j1480J6235M5029l7620m1267J8992J2540
$$ 18878 -13711 7806 15104 -22598 -52721 -64201 -47966 -2937 -40557 -81824 -62832 -50292
21061e0292N2081J8406l7516k8628N427M0147K5267n0563k0626k4235M708k482
$$ -50292 1789 20195 -17321 -45949 -40522 -375 24892 -25671 -46297 -70532 -65824 -68306
21049f8306J2970j7213J3806n253L7021J1767j6635K5149R419k2869Q077l472
$$ -68306 -55336 -72549 -58743 -63996 -26975 -15208 -31843 -6694 2725 -20144 -12067 -15539
21037a5539k6188k8823l438L1704J7793J3551o162L21J7420j2627p839M7842J8149
$$ -15539 -41727 -70550 -73988 -42284 -24491 -10940 -17102 -16781 639 -11988 -19827 28015 46164
21024D6164k7276l5375j8825J3472L3179k4354q519K3457J5406L1790N338k0748
$$ 46164 18888 -16487 -35312 -21840 11339 -13015 -21534 1923 17329 49119 54457 33709
21012C3709j7477j470m3422J5019O434J5973k674o364k1646J1225L9782j6151
$$ 33709 16232 14762 -28660 -13641 -7207 8766 6092 -272 -21918 -10693 29089 12938
21000A2938l875q762j9107r817Q89K4177l3811q35J0156K5880K068r365O062M81
$$ 12938 9063 301 -18806 -28623 -27734 -3557 -37368 -38203 -28047 -2167 -99 -9464 -3402 -2921
20986b921L7957k0854j306m291j4063J0468M631K8447J7478k425k1615l9075J6422
$$ -2921 35036 14182 12876 8585 -5478 4990 9621 38068 55546 53121 31506 -7569 8853
20973H853j1803k9194m075O817M2917j6905l0236L604M185j1153N0312o142k123
$$ 8853 -2950 -32144 -36219 -29402 13515 -3390 -33626 -30022 -25837 -36990 13322 7180 5057
20960E057j0325j6954N570K4227L394j6425l9137k5506L3277J9918L108m363J0125
$$ 5057 -5268 -22222 -16652 7575 10969 -5456 -44593 -70099 -36822 -16904 -13796 -18159 -8034
20947h034Q029k403K3259j7218k346M7784l722j1512o9489k318K1504j7860K1580
$$ -8034 -5 -2408 20851 3633 1287 49071 45349 33837 -35652 -37970 -16466 -34326 -12746
20934a2746P460k6754J7395j3913n3477m5019k000J9848J7451K948J6132K7299
$$ -12746 -5286 -32040 -14645 -28558 -82035 -127054 -129054 -109206 -91755 -88807 -72675 -45376
20922d5376J7129J4844P826O845O631j9681n434k04l3728l6272N9857M2407m113
$$ -45376 -28247 -13403 -5577 1268 7899 -11782 -17216 -17420 -51148 -87420 -27563 14844 10731
20909A0731K1481j3688O585k1543K1859l3659j2117j1423K0664J9237J7782j667
$$ 10731 32212 18524 25109 3566 25425 -8234 -20351 -31774 -11110 8127 25909 24242
20897B4242J4974n027J9402O742J296j9546j8061l4531l077J8580N772m367Q506
$$ 24242 39216 34189 53591 60333 61629 42083 24022 -10509 -13586 4994 10766 6399 14905
20884A4905P067l759o7289j5966n424k9505N942J2749r90J8796Q887j4656R593
$$ 14905 21972 18213 -49076 -65042 -70466 -99971 -94029 -81280 -82270 -63474 -54587 -69243 -59650
20871e9650j1839L2781L7718O287m214n628J3212O715K3268o74k1093k0444J6195
$$ -59650 -71489 -38708 -990 5297 1083 -4545 8667 15382 38650 37976 16883 -3561 12634
20858A2634L0931k743m0291l1781J7788j9322j9218m5729J6330P886n0099K2173
$$ 12634 43565 40822 531 -31250 -13462 -32784 -52002 -97731 -81401 -73515 -123614 -101441
20846a01441K7885k314K3060N371o132r619J0729L1402j6351j0118j7587q242
$$ -101441 -73556 -75870 -52810 -47439 -53571 -63190 -52461 -21059 -37410 -47528 -65115 -73357
20834g3357k5319r150M9343k4084N153N7986K6176k8864K1975L4281M4844M0004
$$ -73357 -98676 -107826 -58483 -82567 -77414 -19428 6748 -22116 -141 34140 78984 118988
20822A18988O531n0129m0972m0738k9397j157L8517K2323j9412l1256K8J4250
$$ 118988 125519 75390 34418 -6320 -35717 -36874 1643 23966 4554 -26702 -26674 -12424
20810a2424O574j2940k0158l3500L5734K2637j68J1968O667j690J401p0597l7193
$$ -12424 -5850 -18790 -38948 -72448 -36714 -14077 -14245 -2277 4390 2700 4101 -66496 -103689
20797a03689p351K9706J8072k0822K561O5053M2058k2880m5191l464l456K3839
$$ -103689 -111040 -81334 -63262 -84084 -81523 -16470 25588 2708 -42483 -45947 -49403 -25564
20785b5564J1673L8176J9763j7821j4326l6518j4007L5791M7616K1539j5009j6194
$$ -25564 -13891 24285 44048 26227 11901 -24617 -38624 -2833 44783 66322 51313 35119
20773C5119n3806n0151J5736N6860J1243K628j9794k5810M095M648K9092K9778
$$ 35119 -18687 -68838 -53102 3758 15001 17629 -2165 -27975 -23880 -19232 9860 39638
20761C9638K5858k5848k5208l744M907K1023r769l8211r385J1335J7005L1847
$$ 39638 65496 39648 14440 10696 15603 36626 26857 -11354 -20739 -9404 7601 39448
20749C9448n850l9721k3753k378K1166O811N927k3314j4665j0507l654K1131L3626
$$ 39448 33598 -6123 -29876 -32254 -11088 -4277 1650 -21664 -36329 -46836 -50490 -29359 4267
20736D267j4128n99J3229l0063K3850j5790l3183L1262O6994O0032j0445l7716
$$ 4267 -9861 -10460 2769 -27294 -3444 -19234 -52417 -21155 45839 105871 95426 57710
20724E7710m299M309j5292k3187j6276k4769l2736P38P024q354J9132L4816j0034
$$ 57710 53411 57720 42428 19241 2965 -21804 -54540 -53802 -46778 -55132 -36000 -1184 -11218
20711a1218n51J9997m077j8431l607J3991L2940j227j4059n803J9671l0799k1508
$$ -11218 -11769 8228 4151 -14280 -17887 -3896 29044 27817 13758 7955 27626 -3173 -24681
20698b4681O524o727M2890J5620k7328q997J152N5753j8614n4408J4283n460l030
$$ -24681 -18157 -24884 18006 33626 6298 -2699 -1547 54206 35592 -18816 -4533 -9993 -13023
20685a3023J9320R311J8864N4866P276j9285n1635o0078o211L8444n15l0167J0135
$$ -13023 6297 15608 34472 89338 96614 77329 25694 -34384 -40595 -2151 -2666 -32833 -22698
20672b2698L6960k5606n7532J614N0292J3537j0629Q225k6318l2169j2276L048
$$ -22698 14262 -11344 -68876 -67262 -16970 -3433 -14062 -5837 -32155 -64324 -76600 -73552
20660g3552l423J6745M243J9016j1733k4256R289Q241J8843L9771M7805k6765
$$ -73552 -76975 -60230 -55987 -36971 -48704 -72960 -63671 -55430 -36587 3184 50989 24224
20648B4224l0683M1947J4259j0273j9240K018n448m702N353Q494k4251M212J7316
$$ 24224 -6459 35488 49747 39474 20234 22252 16804 12102 17455 25949 1698 5910 23226
20635B3226K9511l8277J3699J0170m5347K3548k6212k2121j3900m755j6608J9408
$$ 23226 52737 14460 28159 38329 -7018 16530 -9682 -31803 -45703 -50458 -67066 -47658
20623d7658M2652K8660L420J4673K733l6888l3378P387M71J696O335L529J8327
$$ -47658 -5006 23654 27074 41747 44480 7592 -25786 -18399 -17928 -16232 -9897 -6368 11959
20610A1959L2645j8991m6368j9708k1346j8132k0388K1081K4103L824j7876l0817
$$ 11959 44604 25613 -20755 -40463 -61809 -79941 -100329 -79248 -55145 -51321 -69197 -100014
20598a00014K7928j1328L2037O8799K9491J5752k0232k389j4334r191P082k8937
$$ -100014 -72086 -83414 -51377 17422 46913 62665 42433 40044 25710 16519 23601 -5336
20586e336l1973R587j0221K571J9986L2872j0976q3586k7993N114Q826J4688J3547
$$ -5336 -37309 -27722 -37943 -35372 -15386 17486 6510 -77076 -105069 -99955 -91129 -76441 -62894
20573f2894k4348K2411M7711j0092j4449K7035R85J9551K7591l7867K7220Q040
$$ -62894 -87242 -64831 -17120 -27212 -41661 -14626 -13641 5910 33501 -4366 22854 30894
20561C0894J0482K4970l0231o4114K5439M378j6796k82J7881m2056k5466J2495
$$ 30894 41376 66346 36115 -27999 -2560 1818 -14978 -15260 2621 -39435 -64901 -52406
20549e2406J8008M3085j1282j4076m070J8981l5775k6608N1481L4188k7661J515
$$ -52406 -34398 8687 -2595 -16671 -20741 -1760 -37535 -64143 -12662 21526 -6135 -4620
20537d620P2J2258N771K0788k0413k2936K262M2157L0646j6431J3630k8294q0293
$$ -4620 -4548 7710 13481 34269 13856 -9080 -6818 35339 65985 49554 63184 34890 -45403
20524d5403r238L7652N428K530J4914o1594n4476M9032M3195o920k1677k5123
$$ -45403 -54641 -16989 -11561 -9031 5883 -55711 -110187 -61155 -17960 -24880 -46557 -71680
20512g1680n058J0593k4749L1082J3915P274m780K1557O194k2814n426j7934k0388
$$ -71680 -76738 -66145 -90894 -59812 -45897 -38623 -43403 -21846 -15652 -38466 -43892 -61826 -82214
20499h2214J2583L9126L8947K297O972M6661j5431n2169l7470L1938K486l1978
$$ -82214 -69631 -30505 8442 10739 17711 64372 48941 -3228 -40698 -8760 -6274 -38252
20487c8252J8592Q815J7961q3J4003M203p0476l4887J3320L7674M9278K2198M00
$$ -38252 -19660 -10845 7116 7033 21036 25239 -45237 -80124 -66804 -29130 20148 42346 42746
20474D2746k1448q233k2966k3575K4971M1886m2621j3611k3892J3742q030n736
$$ 42746 21298 13065 -9901 -33476 -8505 33381 -9240 -22851 -46743 -33001 -41031 -46767
20462d6767J2752k1447n732k4858K6294J0571K9984M4283n448l1352k1092Q563
$$ -46767 -34015 -55462 -61194 -86052 -59758 -49187 -19203 25080 19632 -11720 -32812 -24249
20450b4249Q66L212J997K7209j7640l0196K7332L5131k1159j1003N068j705K8189
$$ -24249 -23383 -20171 -18174 9035 -8605 -38801 -11469 23662 2503 -8500 -3432 -5137 23052
20437B3052N700j4164J1959l56j1174j9321J2600K1081M3389j1095k3823K4932
$$ 23052 28752 14588 26547 26191 15017 -4304 8296 29377 72766 61671 37848 62780
20425F2780k1981j8266M879P705k0346j9650J7393j6281J1947K2208K8012k219
$$ 62780 40799 22533 27412 35117 14771 -4879 12514 -3767 8180 30388 58400 56181
20413E6181l4072O68j7338r983j7474j3734J2102K2221J2417Q614M4122K881n0976
$$ 56181 22109 22777 5439 -4544 -22018 -35752 -23650 -1429 10988 19602 63724 66605 15629
20400A5629k2214L7606K1905j8660p073J8307L5664J4276j9423J7632j8574m4868
$$ 15629 -6585 31021 52926 34266 27193 45500 81164 95440 76017 93649 75075 30207
20388C0207n1440l328K2746k8K5400K2029k2536n6079j2345j5085N809K5809J6302
$$ 30207 -21233 -24561 -1815 -1843 23557 45586 23050 -33029 -45374 -60459 -54650 -28841 -12539
20375a2539j2510k2140J1736j5442j3196j7156N378L7226L4498O196Q448j3367
$$ -12539 -25049 -47189 -35453 -50895 -64091 -81247 -75869 -38643 -4145 2051 10499 -2868
20363b868o47K6126N324K18k1127n144p24O939o26J6781j8745q57J3956j3044
$$ -2868 -3515 22611 27935 28153 7026 1882 1158 8097 7471 24252 5507 4650 18606 5562
20349E562q347j3853Q978o584K905j5319m614R672J519j3616K2627k0032n2670
$$ 5562 -2785 -16638 -7660 -14244 -11339 -26658 -31272 -21600 -20081 -33697 -11070 -31102 -83772
20336h3772Q662M2161O281J3982K8199M3105o4803N480L4440j3226J8867L5481
$$ -83772 -75110 -32949 -26668 -12686 15513 58618 -6185 -705 33735 20509 39376 74857
20324G4857J8544k8614l6112r539K1513j1861l4305P80K4038j1311k171J7638
$$ 74857 93401 64787 28675 19136 40649 28788 -5517 -4737 19301 7990 5819 23457
20312B3457J277M4204K454m9139N094k7456k2292L6966R86l2518p129J4170j2470
$$ 23457 24734 68938 71392 22253 27347 -109 -22401 14565 15551 -16967 -24096 -9926 -22396
20299b2396q113k7143p842N709L6329O175P404J133J5890K1775J7427K2683K1373
$$ -22396 -30509 -57652 -65494 -59785 -23456 -17281 -9877 -8744 7146 28921 46348 69031 90404
20286I0404J1626K4688j2706m7310p4467k0897k4256n3165o523O564K3265m345
$$ 90404 102030 126718 114012 66702 -7765 -28662 -52918 -106083 -112606 -106042 -82777 -87122
20274h7122M1253N1814p180j0371k5774o109J8238r546j7335o687K6258J5863
$$ -87122 -45869 5945 -1235 -11606 -37380 -43489 -25251 -34797 -52132 -58819 -32561 -16698
20262a6698n061L6842L2018k2233k0860J546L8784k6233k7397K3260N439j6477
$$ -16698 -21759 15083 47101 24868 4008 5554 44338 18105 -9292 13968 19407 2930
20250B930k3147K0351j6056k7048L15J500K0803M3799m418k9580N356l256j0816
$$ 2930 -20217 134 -15922 -42970 -42655 -41155 -20352 23447 19029 -10551 -5195 -8451 -19267
20237a9267p71J4280K4330m9810l9924K1365M1198o247k9405n0210K7637L8042
$$ -19267 -20038 -5758 18572 -31238 -71162 -49797 -8599 -14846 -44251 -94461 -66824 -28782
20225b8782k241m9832Q473M8455m01k1558k6065J1185J39J7961j7289K0812R156
$$ -28782 -31023 -80855 -72382 -23927 -24328 -45886 -71951 -60766 -60627 -42666 -59955 -39143 -29987
20212b9987k1677l326R705N230l1541j6253L3056K1868L466Q196P987l6923j1970
$$ -29987 -51664 -54990 -45285 -40055 -71596 -87849 -54793 -32925 -29459 -21263 -13276 -50199 -62169
20199f2169K994j2077l644L8592L3319J310m175k4407J3038Q01M498n161L7333
$$ -62169 -59175 -71252 -74896 -36304 -2985 -1675 -5850 -30257 -17219 -16418 -11920 -17081 20252
20186B0252P664j2494k4458J5307j0318J493M0710n137m7864j2398K4818K5o3541
$$ 20252 27916 15422 -9036 6271 -4047 -2554 38156 33019 -14845 -27243 -2425 -2400 -65941
20173f5941R931K5153L1219J1168l2917K1269M7560k3825P822K5264l9515j3555
$$ -65941 -56010 -30857 362 11530 -21387 -118 47442 23617 31439 56703 17188 3633
20161C633K972p837J3664J7486J3111l6452l9839p817j5856o03M651j0951k6414
$$ 3633 6605 -1232 12432 29918 43029 6577 -33262 -41079 -56935 -57538 -52887 -63838 -90252
20148i0252o3353J2425N5942L9844J0961j1394k8871K5961M9803j8664j2104K1098
$$ -90252 -153605 -141180 -85238 -45394 -34433 -45827 -74698 -48737 1066 -17598 -29702 -8604
20136h604n207M304m050l416L0861k043m5026J746L4977K9909o517r950L280K3695
$$ -8604 -13811 -9507 -13557 -16973 13888 11845 -33181 -31435 3542 33451 26934 16984 20264 43959
20122D3959J8070O138k5334k2123r62R75j3081p731k2738J4L4372l9245J0197
$$ 43959 62029 68167 42833 20710 19748 20723 7642 -89 -22827 -22813 11559 -27686 -17489
20109a7489J7613N712l0096R50l6811M2251K5725l1917j1519J2446n883M2585
$$ -17489 124 5836 -24260 -23310 -60121 -17870 7855 -24062 -35581 -23135 -29018 13567
20097A3567M5991l3155n491k0645K025L0709k0577r689R235k1611M0176J931k8161
$$ 13567 59558 26403 20912 267 2292 33001 12424 2735 11970 -9641 30535 32466 4305
20084D305k5005j7137N0975J5676n4789j5097K4635j5000l7184K0387O1024J8142
$$ 4305 -20700 -37837 13138 28814 -25975 -41072 -16437 -31437 -68621 -48234 12790 30932
20072C0932K4045j2982k9789K5792j2871q037O171M685j6151l2230l9283j1479
$$ 30932 54977 41995 12206 37998 25127 17090 23261 27946 11795 -20435 -59718 -71197
20060g1197K4891J5608p676J1635J4903k0287j9422M774L3013J8765m6k6955j9176
$$ -71197 -46306 -30698 -38374 -26739 -11836 -32123 -51545 -46771 -13758 5007 4961 -21994 -41170
20047d1170l4920M0437O0010j7006p1715k3191k02J2124N547J8689K2807P379
$$ -41170 -76090 -35653 24357 7351 -64364 -87555 -87757 -75633 -70086 -51397 -28590 -21211
20035b1211j7599O932l3151J0381J9731K0549m709j8990J1622O099l0944J4434
$$ -21211 -38810 -31878 -65029 -54648 -34917 -14368 -19077 -38067 -26445 -20346 -51290 -36856
20023c6856L4083P733j2488N0239p506K2930K1083l9248n8558r913k5959L4829
$$ -36856 -2773 4960 -7528 42711 35205 58135 79218 39970 -18588 -28501 -54460 -19631
20011a9631L0138n1281O646L9560J8241J9717J7963k4610N970k6039j1487K4141
$$ -19631 10507 -40774 -34128 5432 23673 43390 61353 36743 42713 16674 5187 29328
19999B9328J7871J031O900O595j5043k8009K8816J2203l4911k9362O311j5568
$$ 29328 47199 48230 55130 61725 46682 18673 47489 59692 24781 -4581 1730 -13838
19987a3838r182L1548K1631j7902q72j264j8011l3871J5454K9948j3766J6825
$$ -13838 -23020 8528 30159 12257 11385 10121 -7890 -41761 -26307 3641 -10125 6700
19975F700r679l826L0827K6517l6821l2011l3111j9913J5647L430L9172r418j7087
$$ 6700 -2979 -6805 24022 50539 13718 -18293 -51404 -71317 -55670 -52240 -13068 -22486 -39573
19962c9573k2607r635L9679M319M3271K0324J1128k6602q974j0746k8650o37m0964
$$ -39573 -62180 -71815 -32136 -27817 15454 35778 46906 20304 11330 584 -28066 -28703 -69667
19949f9667J1071J9235K455m200l5300K0022L6457R94K5616K523J4348J194o581
$$ -69667 -58596 -39361 -36906 -41106 -76406 -56384 -19927 -18933 6683 9206 23554 24748 18167
19936A8167l4783k6131j1557n856K9000j2276k834M8827M3551m4268n3438J8257
$$ 18167 -16616 -42747 -54304 -60160 -31160 -43436 -46270 2557 46108 1840 -51598 -33341
19924c3341p152l7235l1175J2479K5645J1922J0091K1660J4378m2599L4149K6847
$$ -33341 -40493 -77728 -108903 -96424 -70779 -58857 -48766 -27106 -12728 -55327 -21178 5669
19912E669R906J6140N739l7927n9577l8143L2726K530L7030K3719k4218N733R155
$$ 5669 15575 31715 37454 -473 -60050 -98193 -65467 -62937 -25907 -2188 -26406 -20673 -11518
19899a1518L2613L854M229k1000j7150N468L6113o278l1404J2116o906j7971j9822
$$ -11518 21095 24949 29178 8178 -8972 -3504 32609 26331 -5073 7043 137 -17834 -37656
19886c7656q69j3176N386J374M52J3571K8342L7395K2187l5206m0500r719n774
$$ -37656 -38525 -51701 -46315 -44941 -44489 -30918 -2576 34819 57006 21800 -18700 -28419 -34193
19873c4193L131j689K2170J944o67N0601K5722o3653j8592K5509j6446K2357k568
$$ -34193 -31062 -32751 -10581 -8637 -9304 41297 67019 3366 -15226 10283 -6163 16194 13626
19860A3626j5151R717J3732K793K6061k8008j9345p222p859j7818O771L291R372
$$ 13626 -1525 8192 21924 24717 50778 22770 3425 -3797 -11656 -29474 -22703 -19412 -10040
19847a0040L62J0851J1428k9564R940K8092L8526j2596l6336R222j8315j3295
$$ -10040 -9678 1173 12601 -16963 -7023 21069 59595 46999 10663 19885 1570 -11725
19835a1725J7645k8333j1227J005L4655J0989k2432k1467N6033L3065j8746l7677
$$ -11725 5920 -22413 -33640 -32635 2020 13009 -9423 -30890 25143 58208 39462 1785
19823A785J1906O743O110j6226J8961l5266J304L2749n8o569l2842J7162l9743
$$ 1785 13691 20434 26544 10318 29279 -5987 -4683 28066 28008 21439 -11403 5759 -33984
19810c3984l7174j3414J7251J00342p139k6621o468j7199j441K4978M0603j9419
$$ -33984 -71158 -84572 -67321 33021 25882 -739 -7207 -24406 -25847 -869 39734 20315
19798B0315k8154p031J5N741l195l6411O292K2944l312k6846K221P263L1554R760
$$ 20315 -7839 -14870 -14855 -9114 -12309 -48720 -42428 -19484 -22796 -49642 -47421 -40158 -8604 1156
19784A156n356J2110o3089m5954l4697j9931K4853N6168M7128L5354n84J0944
$$ 1156 -4200 7910 -55179 -101133 -135830 -155761 -130908 -74740 -27612 7742 7158 18102
19772A8102j2945n7814l3823M1893M8135M4783j9531k9177k0598n8096q884L5035
$$ 18102 5157 -52657 -86480 -44587 3548 48331 28800 -377 -20975 -79071 -87955 -52920
19760e2920J8787M1044k6701R448j3954K2795K9452P505j8152j8855L3088K5142
$$ -52920 -34133 6911 -19790 -10342 -24296 -1501 27951 35456 17304 -1551 31537 56679
19748E6679Q962j1624k3648k0450R715n294J8939o634J410k1085J1470k2132k6677
$$ 56679 65641 54017 30369 9919 19634 14340 33279 26645 28055 6970 18440 -3692 -30369
19735c0369j636J8835J4020j994L0289N362k875k1211o031J3908m9752R262K9541
$$ -30369 -32005 -13170 850 -1144 29145 34507 31632 10421 4390 18298 -31454 -22192 7349
19722G349J6024P558k4644m2253J8526L1482l123n0093O102k491M5884L2240j8795
$$ 7349 23373 30931 6287 -35966 -17440 14042 10919 -39174 -33072 -35563 10321 42561 23766
19709B3766P423j3282L0697M245j831l9456j3428k0364K247j046J0830r997N942
$$ 23766 31189 17907 48604 52849 51018 11562 -1866 -22230 -19983 -21029 -10199 -20196 -14254
19696a4254L0977J536k4138J8675O3616r626m1311j3396m125l4801R149o908M325
$$ -14254 16723 18259 -5879 12796 76412 66786 25475 12079 7954 -26847 -17698 -24606 -20281
19683b0281N194J6516O22k1682j4346M740K0385K2142K084K3858K0842p472O845
$$ -20281 -15087 1429 2051 -19631 -33977 -29237 -8852 13290 15374 39232 60074 52602 59447
19670E9447l790n5344l9786L520J3208P711L6948K7344q507J7944m225k6723r747
$$ 59447 55657 313 -39473 -35953 -22745 -15034 21914 49258 40751 58695 54470 27747 18000
19657A8000k633N461m011K7281R105j4115k4297k7271k8229K2203J1475m2110
$$ 18000 15367 20828 16817 44098 53203 39088 14791 -12480 -40709 -18506 -7031 -49141
19645d9141l335M1098j7889k3745j4649K9907N6357R136j0932M499K177l4310
$$ -49141 -52476 -11378 -29267 -53012 -67661 -37754 18603 27739 16807 21306 23483 -10827
19633a0827K8384L8993j5442k2758l9314J0641n3296q246j2069L283J5993j9539
$$ -10827 17557 56550 41108 18350 -20964 -10323 -63619 -71865 -83934 -80651 -64658 -84197
19621h4197j5339J489j8358K8117J5732J2255P163N322J3229M013K5217N8268
$$ -84197 -99536 -98047 -116405 -88288 -72556 -60301 -53138 -47816 -34587 -30574 -5357 52911
19609E2911k7426o1023m1648J4647K8868P407q447L4867l00L993J7394M75m386
$$ 52911 25485 -35538 -77186 -62539 -33671 -26264 -34711 156 -144 3849 21243 21718 17332
19596A7332J171l0430l2150J3842L5807Q456j7084m4629J3599O733k68N999K4594
$$ 17332 18503 -11927 -44077 -30235 5572 14028 -3056 -47685 -34086 -27353 -27621 -21622 2972
19583B972J9965L0714K3090j906K075j8413R90N6775n841o1631n4662J665K9263
$$ 2972 22937 53651 76741 74835 76910 58497 59487 116262 110421 48790 -5872 -4207 25056
19570B5056K355j7637m9262N192J5123N388m0799K8817N9306K0849J6829l8088
$$ 25056 27411 9774 -39488 -34296 -19173 -13785 -54584 -25767 33539 54388 71217 33129
19558C3129n4409j8497O591J0143L4111J0261m1143k9565J4302k6899J1854M679
$$ 33129 -21280 -39777 -33186 -23043 11068 21329 -19814 -49379 -35077 -61976 -50122 -45443
19546d5443Q253L1325N0747L1520n2479m1598L7362L6678O63j4982l3408J6141
$$ -45443 -37190 -5865 44882 76402 23923 -17675 19687 56365 57028 42046 8638 24779
19534B4779J3557P52J4122K0434k2780L066m451j4227k6178l6693K5782K2363
$$ 24779 38336 39088 53210 73644 50864 53930 49479 35252 9074 -27619 -1837 20526
19522B0526k6107p634L2981K0806j5501K3402J7368p939l3191M84k629J1392j7540
$$ 20526 -5581 -13215 19766 40572 25071 48473 65841 57902 24711 25195 22566 33958 16418
19509A6418r99J7278J6189m070L890P506j3733j8077k9296J0616K194j7125j8934
$$ 16418 15419 32697 48886 44816 48706 56212 42479 24402 -4894 5722 7916 -9209 -28143
19496b8143r498L6081J8920j3138j7957J0058k0951K9259L2791Q719n38l3293
$$ -28143 -37641 -1560 17360 4222 -13735 -3677 -24628 4631 37422 46141 45603 12310
19484A2310k6911L7177K8627M575k770l6137j3727N7679o723n3503j8632l4395
$$ 12310 -14601 22576 51203 55778 53008 16871 3144 60823 54100 597 -18035 -52430
19472e2430k1991L5097L184J544J7645J5481L5035K4144m3422l0034p227j937
$$ -52430 -74421 -39324 -36140 -34596 -16951 -1470 33565 57709 14287 -15747 -22974 -24911
19460b4911K6342M6060K9457J6690k978k550k1560q3873l7742L4757N6491L7286
$$ -24911 1431 47491 76948 93638 90660 88110 66550 -17323 -55065 -20308 36183 73469
19448G3469o4777k2375k3432M8213J4958k3027k7848j8616o128L6037N8140j5987
$$ 73469 8692 -13683 -37115 11098 26056 3029 -24819 -43435 -49563 -13526 44614 28627
19436B8627j4430j5628j9319J1198J107N564k1779K4871L0108k7235k5253J3490
$$ 28627 14197 -1431 -20750 -9552 -8445 -2881 -24660 211 30319 3084 -22169 -8679
19424h679P878K101K9780J6419L1394l4126o725l3172j7059k1218K9841N1206
$$ -8679 -801 1300 31080 47499 78893 44767 38042 4870 -12189 -33407 -3566 47640
19412D7640o633n4735K0628O710k4676k6925n850K1971N0019k5166j4529K3603
$$ 47640 41007 -13728 6900 13610 -11066 -37991 -43841 -21870 28149 2983 -11546 12057
19400A2057q502k2644o996l9758M917N570J3731K0061N750J1670m602K5142J5086
$$ 12057 3555 -19089 -26085 -65843 -60926 -55356 -41625 -21564 -15814 -4144 -8746 16396 31482
19387C1482l7632j3909J9709Q047J499O282L0363m3695r149K2979L9091l2019
$$ 31482 -6150 -20059 -350 7697 9196 15478 45841 2146 -7003 15976 55067 23048
19375B3048J7727j2008L689j9661k2254n674M5539K9374q5323l4852L9748L7479
$$ 23048 40775 28767 32456 12795 -9459 -15133 30406 59780 -25543 -60395 -20647 16832
19363A6832J3462j5339l6069l6151K4744K8222J9685k620j7820n0306R023N1444
$$ 16832 30294 14955 -21114 -57265 -32521 -4299 15386 12766 -5054 -55360 -46337 5107
19351E107j2727j3562l4314L3229P2687M712l8878j7456N332M839K3713K0174
$$ 5107 -7620 -21182 -55496 -22267 50420 55132 16254 -1202 4130 8969 32682 52856
19339E2856j8219k5677J3463l262R742K3953L332O748j2102j5463j509L2766M1573
$$ 52856 34637 8960 22423 19161 28903 52856 56188 62936 50834 35371 33862 66628 108201
19326A08201L2792l5343n9387J127o263J9539m800j9226k9634k3643J5111K4842
$$ 108201 140993 105650 46263 47390 41127 60666 55866 36640 7006 -16637 -1526 23316
19314B3316O594j4517J1579M8829J9525j9460j8637l2145j2283j274L8945K0706
$$ 23316 29910 15393 26972 75801 95326 75866 57229 25084 12801 11527 50472 71178
19302G1178j8795p82j7019M598K8105P891j3768k7184l2512R708N0035J0191L347
$$ 71178 52383 51601 34582 39180 67285 75176 61408 34224 1712 11420 61455 71646 74993
19289G4993L9170O8203R9336J60349J74848N9355L3893L8857l013K6505r480j37860
$$ 74993 114163 182366 281702 442051 616899 676254 710147 749004 745991 772496 763016 625156
19277F25156j29159m5672O1222J08270N7696Q262p7691j7695j6726M784m9336
$$ 625156 495997 450325 511547 619817 677513 685775 608084 590389 573663 578447 529111
19266E29111r4179j24745j12969n0366k9938k4151p606m6949J1236J7292J4511
$$ 529111 434932 310187 197218 146852 116914 92763 85157 38208 49444 66736 81247
19255H1247j1537j753j4174k8909k7913l492k26J4576K2778l935k4874o1862J240
$$ 81247 69710 67957 53783 24874 -3039 -6531 -6757 7819 30597 26662 1788 -60074 -58834
19242e8834O1279M4547L2848K7210l4344l2161j7184K217n531L307M205j9389
$$ -58834 2445 46992 79840 107050 72706 40545 23361 25578 20047 23354 27559 8170
19230H170k5873j954n3134k81L4467K3981k4512l1526M2573J4709k8621k1172
$$ 8170 -17703 -19657 -72791 -73072 -38605 -14624 -39136 -70662 -28089 -13380 -42001 -63173
19218f3173L3966L9793K1483J5387j6764J1498l5424k5691Q078n055j3823L5716
$$ -63173 -29207 10586 32069 47456 30692 42190 6766 -18925 -10847 -15902 -29725 5991
19206E991J7992j9290k302L3064L3615M6017j7987n5185p1819l2001L0188N1379
$$ 5991 23983 4693 2391 35455 69070 115087 97100 41915 -29904 -61905 -31717 19662
19194A9662J132m497j808n2379m0834J4487M0529Q968j3471l4937j3665M0681
$$ 19662 20794 16297 14489 -37890 -78724 -64237 -23708 -14740 -28211 -63148 -76813 -36132
19182c6132n752m2774K616R511M1939K9062k0867K432L4001M7418N370n1734J0812
$$ -36132 -41884 -84658 -82042 -72531 -30592 -1530 -22397 -19965 14036 61454 66824 15090 25902
19169B5902J8776l9668r537j929L0665J7553o122p988R151k0494J1806J2469K024
$$ 25902 44678 5010 -4527 -6456 24209 41762 35640 27652 36803 16309 28115 40584 42608
19156D2608J8841K4238k6999j5300k9277j6085P590J0623N0745J2282k7512j6430
$$ 42608 61449 85687 58688 43388 14111 -1974 5616 16239 66984 79266 51754 35324
19144C5324m165m4289Q432j4928O047j2270J6346O775k3369J2064L3498l429p405
$$ 35324 31159 -13130 -4698 -19626 -13579 -25849 -9503 -2728 -26097 -14033 19465 16036 8631
19131H631m2239J2869J1077J2974l432K285K684L7723k7583j1734l6905J6940
$$ 8631 -33608 -20739 -9662 3312 -120 2165 4849 42572 14989 3255 -33650 -16710
19119a6710K6882J2871P296P736K2372j6638r308p495K4816N479k3944k0174j684
$$ -16710 10172 23043 30339 38075 60447 43809 34501 27006 51822 57301 33357 13183 11499
19106A1499J8180J2143j8054Q898J0732K701R290k1223k1555q245l1588J7166
$$ 11499 29679 41822 23768 32666 43398 46099 55389 34166 12611 4366 -27222 -10056
19094a0056K681L7378K835m345k8224l8349j1351L0333M8040N874m470k2635o553
$$ -10056 -7375 30003 32838 28493 269 -38080 -49431 -19098 28942 34816 30346 7711 1158
19081A158M2252p526N764r428q659P323r573l8227m574L3033N287o134j0153K803
$$ 1158 43410 35884 41648 32220 23561 30884 21311 -16916 -21490 11543 16830 10696 543 3346
19067C346J7763j4915J8842j6165j9612j6494n708M3395L7851L688o833P285j5227
$$ 3346 21109 6194 25036 8871 -10741 -27235 -32943 10452 48303 51991 45158 52443 37216
19054C7216j2568J574J2536R599L579k6499r024K2842q499m6316j1690q486K5363
$$ 37216 24648 26222 38758 48357 51936 25437 16413 39255 30756 -15560 -27250 -35736 -10373
19041a0373Q970j9177M0544J3860k2907k1701J4244M126K8105L2267J192k2799
$$ -10373 -1403 -20580 19964 33824 10917 -10784 3460 7586 35691 67958 69150 46351
19029D6351P09q054m1191J9256J2480J699P980j3102j6342j9510k28n350N2299
$$ 46351 47060 39006 -2185 17071 29551 31250 39230 26128 9786 -9724 -9952 -15302 36997
19016C6997K8481J1655k0346j0209O694O2962J3140k3334l7291N782L261q834
$$ 36997 65478 77133 56787 46578 53272 116234 129374 106040 68749 74531 77792 68958
19004F8958k0928k1273r965n466m308J3833j2275N0956J8810J705m848J8183l3946
$$ 68958 48030 26757 16792 11326 7018 20851 8576 59532 78342 80047 75199 93382 59436
18991E9436o5931k977L8663L4784J7986k457m542M554j7254n6906l6253R026L0088
$$ 59436 -6495 -9472 29191 63975 81961 79504 74962 79516 62262 5356 -30897 -21871 8217
18978H217N721J8383K2035L1382K0185N682J6157m6339k6542p137k6349L755M5828
$$ 8217 13938 32321 54356 85738 105923 111605 127762 81423 54881 47744 21395 25150 70978
18965G0978J7931l0333j1784j209L0589J9802n5474j6419M4061N07l80r446J3019
$$ 70978 88909 58576 46792 45583 76172 95974 40500 24081 68142 68649 68269 58823 71842
18952G1842l607l3745q860o857K6347J1444M1730j5945j0115k9023j3310j23n2700
$$ 71842 68235 34490 25630 18773 45120 56564 98294 82349 72234 43211 29901 29778 -22922
18939b2922j986L0753j8891O577R0j760L9531K1310k5671j8748J3937L8673K7444
$$ -22922 -24908 5845 -13046 -6469 -6379 -8139 31392 52702 27031 8283 22220 60893 88337
18926H8337Q989j0055r121l9374j1166j0281j8330M4889m8071m984M6972N7097
$$ 88337 97326 87271 78150 38776 27610 17329 -1001 43888 -4183 -9167 37805 94902
18914I4902r851m6460p5397K5223L1793m699m540O905J7801j9679l3771J8676
$$ 94902 85051 38591 -36806 -11583 20210 15511 10971 17876 35677 15998 -17773 903
18902I03M1268K5261j0561m3519j9115P887M6582Q785K2719P042K7799m5533m8145
$$ 903 42171 67432 56871 13352 -5763 2124 48706 57491 80210 87252 115051 69518 21373
18889B1373K0953L0081J6081P018J0110K5918J4484K294L6o2748j031j8332J1508
$$ 21373 42326 72407 88488 95506 105616 131534 146018 148312 148348 85600 84569 66237 77745
18876G7745K3510q961n1556n7090L6739K6204j8315l2740m1017j5121K1630K9748
$$ 77745 101255 92294 40738 -16352 20387 46591 28276 -4464 -45481 -60602 -38972 -9224
18864i224M5420L1144P572j0729K2744L063o1561m4896J0292L0989R337K0197
$$ -9224 36196 67340 74912 64183 86927 89990 28429 -16467 -6175 24814 34151 54348
18852E4348L6133J4753K1936P122L7616o1998m3330M5629K9393J01K6231k5779
$$ 54348 90481 105234 127170 134292 171908 109910 66580 112209 141602 141703 167934 142155
18840A42155j0903l0457k8898K5747K823n7624k898K4449n815j5407O151j4814
$$ 142155 131252 100795 71897 97644 100467 42843 39945 64394 58579 43172 49323 34509
18828C4509J5642J2284n0147j46O0698L6245r222k7362O007M6778K3802J0045
$$ 34509 50151 62435 12288 12142 72840 109085 99863 72501 78508 125286 149088 159133
18816A59133k278n2581q645n215j3279Q578Q633m327k4892k1814o573M0088P1821
$$ 159133 156855 104274 95629 90414 77135 85713 94346 90019 65127 43313 36740 76828 148649
18803A48649j8029j8174j5285N0670K0206n4967m9812m9202K4666K3111l329K0307
$$ 148649 130620 112446 97161 147831 168037 113070 63258 14056 38722 61833 58504 78811
18791G8811K6580J4556J1485J555Q164l0828r107P838K5024R388N49M8710J1390
$$ 78811 105391 119947 131432 132987 141151 110323 101216 109054 134078 143466 144015 192725 204115
18778B04115l467M725J7036R828j2295J023r012n251R306Q4443J01307J47017
$$ 204115 200648 205373 222409 232237 219942 220965 211953 206702 216008 300451 401758 548775
18766E48775J63103n995o8161j10243p0144p0214r5995l5993r13P261j0487J9740
$$ 548775 711878 705883 637722 527479 457335 387121 291126 255133 254220 261481 250994 270734
18754B70734j6261l9714j9312j3114p768l9396k5166L9328L0007L7715M4400L1521
$$ 270734 254473 214759 195447 182333 174565 135169 110003 149331 179338 217053 261453 292974
18742B92974k4343m5079l3435J005K6144L6272K7255l9088L7422L612j3279L2396
$$ 292974 268631 223552 190117 191122 217266 253538 280793 241705 279127 282739 269460 301856
18730C01856m413k0821k2332j527N226L476K6007J886K557l6707k5545L7030K7956
$$ 301856 297443 276622 254290 252763 257989 261465 287472 289358 291915 255208 229663 266693 294649
18717B94649J7182q975l901J1587m46j5749M300J5188K143K3651P564M1596J0296
$$ 294649 311831 302856 298955 310542 310096 294347 298647 313835 315978 339629 347193 388789 399085
18704C99085k0818k2225k1324K531K7966k4929m956K7545L1700L4200P0106O2214
$$ 399085 378267 356042 334718 337249 365215 340286 335330 362875 394575 428775 498881 561095
18692E61095m0434K0598P4986M2732N0622r540n849M6343O7306J06219J89098
$$ 561095 520661 541259 616245 658977 709599 700059 694210 740553 807859 914078 1103176
18681A103176J59691P2304q395J2162Q3483Q3008K9895r361k6906P394J08014
$$ 1103176 1262867 1335171 1326776 1338938 1422421 1505429 1535324 1525963 1499057 1506451 1614465
18670A614465J88998J79186N9431P9148J66473K89644K60715J10365M7958Q8939
$$ 1614465 1803463 1982649 2042080 2121228 2287701 2577345 2838060 2948425 2996383 3085322
18660C085322K30822L42140K59152J09814J28655K97007L98201L82939M33379
$$ 3085322 3316144 3658284 3917436 4027250 4155905 4452912 4851113 5234052 5667431
18651E667431N20424O90077R78455J351092J698235K237496L315502N388613R170937
$$ 5667431 6187855 6877932 7856387 9207479 10905714 13143210 16458712 21847325 31018262
18642C1018262J6381576K6355265K7882817J3458699l837219m728928P816566
$$ 31018262 47399838 73755103 101637920 115096619 111259400 106530472 114347038
18635A14347038J1633410k288724j8382315j9332016p319491R504364K1089078
$$ 114347038 125980448 123691724 105309409 85977393 78657902 88162266 109251344
18628A09251344J5352643k298351j0645278j225567Q936479J226077j7738975
$$ 109251344 124603987 122305636 111660358 110434791 119371270 120597347 102858372
18621A02858372k7689104k4050218j6110334j0040680o262796l913543k633228
$$ 102858372 75169268 51119050 35008716 24968036 18705240 14791697 12158469
18614A2158469j902176j292089r12491o25846n46416m63922m01787m48592m50982
$$ 12158469 10256293 8964204 8051713 7425867 6879451 6415529 6013742 5565150 5114168
18605E114168l28264k45149k16074j92427j02026r0460j76665j85173n3732N058
$$ 5114168 4785904 4540755 4324681 4132254 4030228 3939768 3763103 3577930 3524198 3529256
18595C529256k32342m36007l84667k38673j56911k29628k79005j63842n7713R571
$$ 3529256 3296914 2860907 2476240 2237567 2080656 1851028 1572023 1408181 1350468 1360039
18585A360039N7761M6528n2160j01320k7614q889o4240j12207j25849j31859j01104
$$ 1360039 1417800 1464328 1412168 1310848 1283234 1274345 1210105 1097898 972049 840190 739086
18574G39086n1490m1233J3672l4578K534k7432n6372M952k1544j3167j2249j8874
$$ 739086 687596 646363 660035 625457 627991 600559 544187 549139 527595 514428 502179 483305
18562D83305Q218K7727Q5236K4437m4922o6802l6377O205l42j2243j5024l2259
$$ 483305 491523 519250 604486 628923 584001 517199 480822 487027 486685 474442 459418 427159
18550D27159k3375K1542j2542o3409k2830n737K3893Q625k1026j9556n5502l4254
$$ 427159 403784 425326 412784 349375 326545 320808 344701 353326 332300 312744 257242 222988
18538B22988j5086k8626J1359l446K5360m5406k1941J1543K6603P690m6149l0909
$$ 222988 207902 179276 190635 187189 212549 167143 145202 156745 183348 191038 144889 113980
18526A13980K422n004k1821K6939m3640n579M4893M4878K3813L690j3175K5611
$$ 113980 116402 111398 89577 116516 72876 67297 112190 157068 180881 184571 171396 197007
18514A97007L8242J5116l7918l6656j453k2582n3340l7003J1729l6080J3237L2958
$$ 197007 235249 250365 212447 175791 174338 151756 98416 61413 73142 37062 50299 83257
18502H3257l877p843j2535J6632Q48J1899j0778k2414j7692j0718O524m7716m0532
$$ 83257 79380 71537 59002 75634 76482 88381 77603 55189 37497 26779 33303 -14413 -54945
18489e4945K9991L4791n8273K4828O0313l20J753K2078p244N724K139J1436j2279
$$ -54945 -24954 9837 -48436 -23608 36705 36385 38138 60216 52972 58696 60835 72271 59992
18476E9992Q029j2689m0792k5446L6749L464j3836M80J0794K5516K77j4648N978
$$ 59992 68021 55332 14540 -10906 25843 29307 15471 15951 26745 52261 52538 37890 43868
18463D3868Q680J607J8324k0860k3528M3457K5367j1068m733K3403J1264J5769
$$ 43868 52548 54155 72479 51619 28091 71548 96915 85847 81114 104517 115781 131550
18451A31550J0354k0467k2712k7114j2265l750M165k6242o381j0733j6652K0634
$$ 131550 141904 121437 98725 71611 59346 55596 59761 33519 27138 16405 -247 20387
18439B0387M5535L6655j4052m5062k7155K1659R967j04P292q460K681J7801l2879
$$ 20387 65922 102577 88525 43463 16308 37967 47934 47830 55122 46662 49343 67144 34265
18426C4265n744K9090L5365k0705k3007R862M0737J7951k5247j5857j5439j8951
$$ 34265 28521 57611 92976 72271 49264 59126 99863 117814 92567 76710 61271 42320
18414D2320k706L7492j43k9562k3039o820J7322N1613J6765n4217k3197N2306
$$ 42320 39614 77106 76963 47401 24362 17542 34864 86477 103242 49025 25828 78134
18402G8134Q439m0991k4479j1273L3231J0902j8312j5639J6534j1094J2317N411
$$ 78134 86573 45582 21103 9830 43061 53963 35651 20012 36546 25452 37769 43180
18390D3180O542K7592J2476n077P722q555k906l8159J9957L9661J2834q690l2593
$$ 43180 49722 77314 89790 84713 92435 83880 80974 42815 62772 102433 115267 106577 73984
18377G3984n5242l5744L3442Q049K5730J9010N241j5792m3381o156k901R458J5071
$$ 73984 18742 -17002 16440 24489 50219 69229 74470 58678 15297 9141 6240 15698 30769
18364C0769L292L5573j538k5886k3357j9061L0791L0985l8390j0858J0813L211
$$ 30769 34061 69634 68096 42210 18853 -208 30583 61568 23178 12320 23133 26344
18352B6344J9445K7380N452p802j4568j1142j8677l6629K9247J8429k57M0605
$$ 26344 45789 73169 78621 70819 56251 45109 26432 -10197 19050 37479 37222 77827
18340G7827K4639k971k4579j2383n033J7603J1337j1204k4232j0545l0708l3224
$$ 77827 102466 99495 74916 62533 57500 75103 86440 75236 51004 40459 9751 -23473
18328b3473m3359K479L9434M3312m0957j31k4021l3856Q211M4311k482L872L6730
$$ -23473 -66832 -64353 -24919 18393 -22564 -22695 -46716 -80572 -72361 -28050 -30532 -26660 10070
18315A0070L9473N583M625L037k8334o664K633K2981j5571N48O581K3039K406
$$ 10070 49543 55126 59751 62788 34454 27790 30423 53404 37833 38381 44962 68001 70407
18302G0407k0967P003m991r278P773P523k1826k4214j4019R504L9840m426M9178
$$ 70407 49440 56443 51452 42174 49947 57470 35644 11430 -2589 6915 46755 42329 91507
18289I1507R942p484J7779J9015R0914J41945J31188N7646P1906m000m6817O494
$$ 91507 101449 93965 111744 130759 221673 363618 494806 552452 624358 620358 573541 580035
18277E80035m079l0693j08885j38362q9119k4655j6879j2666j0581l1910l3520
$$ 580035 575956 545263 436378 298016 208897 184242 167363 154697 144116 112206 78686
18266G8686J3196L6090Q8373J28991R0118J41090J09492M9585l550k9933j0212
$$ 78686 91882 127972 216345 345336 435454 576544 686036 735621 732071 702138 691926
18255F91926k5856o3683j05640j53696r4720o7635m1624m8486K9628J7324k2234
$$ 691926 666070 602387 496747 343051 248331 180696 139072 90586 120214 137538 115304
18244A15304q05k3255N377j503q552j3193K4689m568L0593q939n6286j8220j4793
$$ 115304 114499 91244 96621 95118 86566 73373 98062 93494 124087 115148 58862 40642 25849
18231B5849K5101M8574K9464m2606J7978K9636k5040o5107k2366K61k9872K436
$$ 25849 50950 99524 128988 86382 104360 133996 108956 43849 21483 21744 -8128 -5692
18219e692M226J6517K2685k7033R307K3099J2726j3765O069k206K6933L3133m115
$$ -5692 -1466 15051 37736 10703 20010 43109 55835 42070 48139 45933 72866 105999 101884
18206A01884p680P498j7310R282k327P36L034l179o846j4863K7290j2741p383
$$ 101884 94204 101702 84392 93674 91347 92083 95117 91938 85092 70229 97519 84778 77395
18193G7395J2124J6315j1781K890J6134J3981k2800m7670K89J2294J0455R07J3011
$$ 77395 89519 105834 94053 96943 113077 127058 104258 56588 56877 69171 79626 80533 93544
18180I3544N435k3267m004R774k912L1377L1894j0558j9980p03L4602J410M973
$$ 93544 98979 75712 71708 81482 78570 109947 141841 131283 111303 110600 145202 146612 151585
18167A51585q771l4804K6748J9457j0936k4049K1078K9875K8756O86k1230J4654
$$ 151585 142814 108010 134758 154215 143279 119230 140308 170183 198939 199625 178395 193049
18155A93049L9616K2633k1172l6705L110K9975l1628O8743L7857O149k7131k995
$$ 193049 232665 255298 234126 197421 200531 230506 198878 267621 305478 311627 284496 281501
18143B81501Q345L8119J7385N155j4941M5K75j9301M1384P7325P8431M042K3669
$$ 281501 289846 327965 345350 350505 335564 335609 335884 316583 357967 435292 513723 517765 541434
18130E41434Q4269O1812k5081N0543M2421L6373P0843J53574J58391J80791K31799
$$ 541434 625703 687515 662434 712977 755398 791771 862614 1016188 1174579 1355370 1587169
18119A587169K86578L86608N47117O47968Q17707J218408J895920K960715N267304
$$ 1587169 1873747 2260355 2807472 3455440 4273147 5491555 7387475 10348190 15615494
18110A5615494J0181246J9800496K8919727J3291093j4717172k4110147j8280504
$$ 15615494 25796740 45597236 74516963 87808056 73090884 48980737 30700233
18103C0700233j0994892o450251l994303k557993j701916j137697p68941n39171
$$ 30700233 19705341 13255090 9260787 6702794 5000878 3863181 3094240 2555069
18095B555069m11815l23766k47992k05248j44500j57885j25957r1298n3863k8029
$$ 2555069 2143254 1819488 1571496 1366248 1221748 1063863 937906 846608 792745 764716
18085G64716q0120n9873o3995o5069p2644l8882L3511N952P798m8948l1886j0960
$$ 764716 684596 624723 560728 495659 423015 384133 417644 423596 431394 382446 350560 339600
18073C39600j9781o653j6580L300q256j2095k8409j4533l1342N230P139J2563
$$ 339600 319819 313166 296586 299886 291630 279535 251126 236593 205251 210481 217620 230183
18061B30183L919k0323k9548j5054j7216o445l4155N6031R690Q459K5841R0201
$$ 230183 234102 213779 184231 169177 151961 145516 111361 167392 177082 185541 211382 301583
18049C01583J00809J25205R1892l2506r0292j26234p5110o3672m8891l7644o5479
$$ 301583 402392 527597 619489 586983 496691 370457 295347 231675 182784 145140 79661
18038G9661k755J3759J9853M4462j9601l775K713M2945j3186n1793r842J9527
$$ 79661 76906 90665 110518 154980 135379 131604 134317 177262 164076 112283 102441 121968
18026A21968j6020k4764j7731n507j4683K2979K7801J0612q183m555J5360L403
$$ 121968 105948 81184 63453 57946 43263 66242 94043 104655 96472 91917 107277 110680
18014A10680O926Q029O267l3109l1904Q208O061k269K2796q3j5876p818j9893
$$ 110680 117606 125635 131902 98793 66889 75097 81158 78889 101685 101602 85726 77908 58015
18001E8015J5531N0734Q351K805L3321l7260n9430k3067K2588j0491J6870K6417
$$ 58015 73546 124280 132631 135436 168757 131497 72067 49000 71588 61097 77967 104384
17989A04384O2197J23161J75876J19171O2061Q606Q4866O6694J2883n0517j33658
$$ 104384 166581 289742 465618 584789 646850 655456 740322 807016 819899 769382 635724
17978F35724j06894l3122J08414J42256N2161m8867m6365N0912O9651p532j15910
$$ 635724 528830 495708 604122 746378 798539 749672 703307 754219 823870 816338 700428
17967G00428j51139j43487j06112p8865m2978l839M9336N9836R6936J59709K54461
$$ 700428 549289 405802 299690 220825 177847 174008 223344 283180 380116 539825 794286
17956G94286L02436L10761K32964J18685n9181k34293l20665k53351k01237j24425
$$ 794286 1096722 1407483 1640447 1759132 1699951 1465658 1144993 891642 690405 565980
17946E65980q6204p3994m9769o9879n7720q738k4443k3221J5550K1785k4455l5543
$$ 565980 479776 405782 356013 286134 228414 219676 195233 172012 187562 209347 184892 149349
17934A49349j1459J5207l7582j1999K8534J7800l542p403j0701j2265l8889n9238
$$ 149349 137890 153097 115515 103516 132050 149850 146308 138905 128204 115939 77050 17812
17922A7812J0928P1353K5989J9535M436m6905m555p75j074J7657J6512N98K8329
$$ 17812 28740 100093 126082 145617 150053 103148 98593 97818 96744 114401 130913 131511 159840
17909A59840l154l3213j4729k3489K4357j5884J1081J8210J3535j6989Q526j0952
$$ 159840 156686 123473 108744 85255 109612 93728 104809 123019 136554 119565 128091 117139
17897A17139k7747j9319K4486o535l9873l7052j2496J4009N7563N691j5843R93
$$ 117139 89392 70073 94559 88024 48151 11099 -1397 12612 70175 75866 60023 61016
17885F1016J1520R08M388r803K655J6624k0718j1966k3922k3934R8415M9788l2709
$$ 61016 72536 73444 77832 68029 70684 87308 66590 54624 30702 6768 105183 154971 122262
17872A22262r049J3176J4825O021o8683K678K5548K1858o003n0717L4010L1540
$$ 122262 113213 126389 141214 147235 78552 81230 106778 128636 122633 71916 105926 137466
17860A37466k4390J3557r639j6179n2973l088K1688J7547L9557O0622K4902p23
$$ 137466 113076 126633 116994 100815 47842 44754 66442 83989 123546 184168 209070 208347
17848B08347K0134O5245k0518j1214K0044j5029L5667m3791q2312m4605N441J6902
$$ 208347 228481 293726 273208 261994 282038 267009 302676 258885 176573 131968 137409 154311
17836A54311k7679Q842J6804L0842M153j776k1965L2119M5441O0087N101l8009
$$ 154311 126632 135474 152278 183120 187273 185497 163532 195651 241092 301179 306280 268271
17824B68271k9233k5297L8338M6312k7612j8259j6495j8773n850K7511Q202l7946
$$ 268271 239038 213741 252079 298391 270779 252520 236025 217252 211402 238913 247115 209169
17812B09169j819K8961M2208j8397k9220l5154k732J1992J7577J2089J1557P894
$$ 209169 207350 236311 278519 260122 230902 195748 193016 205008 222585 234674 246231 254125
17800B54125k4296K0531K4654l4602k8788m3514L0511L7250M4605L499L0566q507
$$ 254125 229829 250360 275014 240412 211624 168110 198621 235871 280476 283975 314541 306034
17788C06034k9396j1289K767J1153J7482M9792P365l1979l288K2548n112M760
$$ 306034 276638 265349 268116 279269 296751 346543 353908 321929 318641 341189 336077 340837
17776C40837L3221M6362N3296J3730J946J2488L8777P170K623K6897J2124J2236
$$ 340837 374058 420420 473716 487446 489392 501880 540657 547827 550450 577347 589471 601707
17764F01707o828J8338J2339k1304L6927N3111O1179l199M989P8080R2184J10207
$$ 601707 594879 613217 625556 604252 641179 694290 755469 752270 757259 835339 927523 1037730
17752A037730J67064J88867K04789J70967J92725K37952K54002J33574R9171N5519
$$ 1037730 1204794 1393661 1598450 1769417 1962142 2200094 2454096 2587670 2686841 2742360
17742B742360j8584K8758M9255N7390P877N4311J71743K93159M06842N45628O40758
$$ 2742360 2723776 2752534 2801789 2859179 2867056 2921367 3093110 3386269 3793111 4338739 4979497
17731D979497P82156J016222J344913J839188K602151L898579O267652J0912537
$$ 4979497 5761653 6777875 8122788 9961976 12564127 16462706 22730358 33642895
17723C3642895J8466470K3219848J8204132J0624564K194403j40687K274948n27741
$$ 33642895 52109365 75329213 93533345 104157909 106352312 106211625 108486573 107958832
17715A07958832o487482j6533725k2062893j8734640j2337028p390725m307210
$$ 107958832 101471350 84937625 62874732 44140092 31803064 24412339 20105129
17708B0105129k399825j103476J1397J191827K695440N010076R257730J6714992
$$ 20105129 17705304 16601828 16613225 17805052 20500492 25510568 34768298 51483290
17700E1483290K3923743K1035388J3193854M254907r25304J524409Q3542n224199
$$ 51483290 75407033 96442421 109636275 113891182 112965878 114490287 114573829 109349630
17692A09349630j5042879k3213344k1908414j5476198r786376o156135m011981
$$ 109349630 94306751 71093407 49184993 33708795 23922419 17766284 13754303
17685A3754303k633202j791010j339883r69317o65977n04023n03868m52175l82385
$$ 13754303 11121101 9330091 7990208 7020891 6354914 5850891 5347023 4894848 4512463
17676D512463k32654j27894j48536k55550l85205l68687k44936j38548j21134
$$ 4512463 4279809 4151915 4003379 3747829 3362624 2993937 2749001 2610453 2489319
17667B489319j09596j18461j49216j18683j6306j9266o605K2206L689N5132L0954
$$ 2489319 2379723 2261262 2112046 1993363 1977057 1957791 1951186 1973392 1977081 2032213 2063167
17656B063167o0780q9173n730M405m9261j40254k55910k76102k29164j03306m7005
$$ 2063167 2002387 1913214 1907484 1911889 1862628 1722374 1466464 1190362 961198 857892 810887
17645H10887j13586p2147l2362m2144k6609K6768l2549r5480o7564L9566K7144
$$ 810887 697301 625154 592792 550648 524039 550807 518258 422778 355214 394780 421924
17634D21924R863J6830r022l1979J4526m6635k3197n105l7035K838J8531L7133
$$ 421924 431787 448617 439595 407616 422142 375507 352310 347205 310170 313008 331539 368672
17622C68672J6786m6258m7622K9133k788J3233K1095K7198M3850J324j5980j5120
$$ 368672 385458 339200 291578 320711 317923 331156 352251 379449 423299 424623 408643 393523
17610C93523n1996m9810j7233r562R318M9925M0224K2211L0525P1702R1420J68644
$$ 393523 341527 291717 274484 264922 274240 324165 364389 386600 417125 488827 580247 748891
17598G48891O4877j11005m8520m4646r7136m3340l3444L1508L4623R0769J61218
$$ 748891 813768 702763 654243 609597 512461 469121 435677 467185 501808 592577 753795
17587G53795Q8630j9635j45593j17787o5927l6045l3620m654K6688J00870J05458
$$ 753795 842425 822790 677197 559410 493483 457438 423818 419164 445852 546722 652180
17576F52180L8477j0364j05590q5666J8240q495p7961m0872N7222Q0244J21479
$$ 652180 690657 680293 574703 489037 507277 498782 420821 379949 437171 517415 638894
17565F38894Q4111J858j20300j08214q9061q0719K014m2434J0549L491j8821R03
$$ 638894 723005 724863 604563 496349 407288 326569 328583 286149 296698 300189 281368 282271
17553B82271O854k5823R967K2793n9636l4085n1500l3646L195N3379M499M269
$$ 282271 289125 263302 273269 296062 236426 202341 150841 117195 120390 173769 178268 182537
17541A82537j5644M566L2517J7993K180k1399j0779k081M519K0810J1196k0176
$$ 182537 166893 171459 203976 221969 224149 202750 191971 189890 194409 215219 226415 206239
17529B06239m1025l1164l559k1468k5890J8847r93j7114l6947o0263m1351M0938
$$ 206239 165214 134050 130491 109023 83133 101980 100987 83873 46926 -13337 -54688 -13750
17517a3750P0151L9425P5516J2521M1710K7669j706N012l635j0623j0071m3379
$$ -13750 56401 95826 171342 183863 225573 253242 251536 256548 252913 242290 232219 188840
17505A88840k9305Q366K1481K9522q033r749K5894J2409J6083k3814j8082j2025
$$ 188840 159535 167901 189382 218904 210871 201122 227016 239425 255508 231694 213612 201587
17493B01587J3336J8182N4587M7916L3356m4405m0541j6664j5382l3445l559K9122
$$ 201587 214923 233105 287692 335608 368964 324559 284018 267354 251972 218527 214968 244090
17481B44090M337l6312R638J3293K4383P411j2324j1763k7047n04J4405L0647
$$ 244090 248427 212115 221753 235046 259429 266840 254516 242753 215706 215202 229607 260254
17469B60254o063O0662J4385l2520k630M307J3192o012j4991l7436k8169j4598
$$ 260254 254191 314853 329238 296718 294088 298395 311587 305575 290584 253148 224979 210381
17457B10381J2106m767J3488M251j0931j1144M0280L4789K4057m2804l3060K5523
$$ 210381 222487 217720 231208 235459 224528 213384 253664 288453 312510 269706 236646 262169
17445B62169O4042M4677Q1755J53234J34572j6299r1184q0221r6245j7363l198
$$ 262169 326211 370888 452643 605877 740449 724150 632966 552745 456500 439137 435939
17434D35939l010O1326K3978L0684p196M2470O9595N7097Q0498J44995K92732
$$ 435939 432929 494255 518233 548917 541721 584191 653786 710883 791381 936376 1229108
17423A229108N32141Q54420Q74417M53462l1514o03948q12242o76243m06164k44382
$$ 1229108 1761249 2615669 3490086 3943548 3912034 3308086 2495844 1819601 1413437 1169055
17413A169055j06709q1475o2161n3525l3834J3715O8001J3466J1322L3244j129
$$ 1169055 1062346 980871 918710 865185 831351 845066 913067 926533 937855 971099 969970
17402I69970K8066P826L5226N8782K9178N2406J14890J33764K03182L19213M16671
$$ 969970 998036 1005862 1041088 1099870 1129048 1181454 1296344 1430108 1633290 1952503 2369174
17391B369174L88316L74401K57640J22796o1361k39679k15910j8318P3070J31827
$$ 2369174 2757490 3131891 3389531 3512327 3450966 3211287 2995377 2977059 3050129 3181956
17381C181956K26617L27480L83915N19296P30667R15465J037769J214312J258721
$$ 3181956 3408573 3736053 4119968 4639264 5369931 6285396 7323165 8537477 9796198
17372I796198J379608J656513K223037L305631N013873P916224J3228172K3267796
$$ 9796198 11175806 12832319 15055356 18360987 23374860 31291084 44519256 67787052
17364F7787052M0080101N6778507O3706123N5060533K7150387j1488439m3389300
$$ 67787052 107867153 164645660 228351783 283412316 310562703 299074264 255684964
17357B55684964n9311179n8826526m5744757l0287032j8916474j1888734p691265
$$ 255684964 196373785 137547259 91802502 61515470 42598996 30710262 23018997
17350B3018997n096860l367122k240212j522729j083719r29480r22004r47097
$$ 23018997 17922137 14555015 12314803 10792074 9708355 8778875 7856871 6909774
17342F909774r17529p99092o77459n27831m54744l85907l23990k04015j48288
$$ 6909774 5992245 5193153 4515694 3987863 3533119 3147212 2823222 2619207 2470919
17333B470919j1503L7594K15833K51904J51566J7079j90956l09313l92185l42430
$$ 2470919 2459416 2497010 2712843 2964747 3116313 3133392 2942436 2633123 2240938 1898508
17323A898508k62349k56184j90671j09805j03349o7237j8490n1981j00103n8070
$$ 1898508 1636159 1379975 1189304 1079499 976150 908913 890423 838442 738339 680269
17313F80269p905j2380l7097o092l1876l274q178r393l1249l876L647L445N2534
$$ 680269 672364 659984 622887 616795 584919 581645 573467 564074 532825 528949 532596 536041 588575
17300E88575k8120k9782l0137k8067Q043l1554k7667k1448k8025K0158Q490n8532
$$ 588575 560455 530673 500536 472469 480512 448958 421291 399843 371818 391976 400466 341934
17288C41934n9372l9662j3687K965J0636J1914K1035j4279j0939j343L0434j7481
$$ 341934 282562 242900 229213 232178 242814 254728 275763 261484 250545 249202 279636 262155
17276B62155m3128j1236M1433J5522o468m1838q571K4930K087P940n0003K160
$$ 262155 219027 207791 249224 264746 258278 216440 207869 232799 234886 242826 192823 194983
17264A94983j6983q696L2931J0385p437N862L7614J3373L9385J6272k7188m0713
$$ 194983 178000 169304 202235 212620 205183 211045 248659 262032 301417 317689 290501 249788
17252B49788m8111L5540L7875p28n334P654l7437k7858p6138N370Q939N908J0297
$$ 249788 201677 237217 275092 274364 269030 276684 239247 211389 135251 140621 149560 155468 165765
17239A65765P308Q96L9448N2023L0486O719m2548l6052n5383p3539l4988m253
$$ 165765 173073 173969 213417 265440 295926 302645 260097 224045 168662 95123 60135 55882
17227E5882N0872k4342j6463Q858m439j1677O637L8153J465n4249l5382J9069
$$ 55882 106754 82412 65949 74807 70368 58691 65328 103481 104946 50697 15315 34384
17215C4384N4005J6116M073j9037o1640k2892j7520j8230m187N1548O2547K3921
$$ 34384 88389 104505 108578 89541 27901 5009 -12511 -30741 -34928 16620 79167 103088
17203A03088O3503J6684K3624N781L834J0604j0522K731m0705l2919j0355L2695
$$ 103088 166591 183275 206899 212680 216514 227118 216596 219327 178622 145703 135348 168043
17191A68043M861j3050j1658n3689n0685K3844N500O334M5724J6202K479j6187
$$ 168043 172904 159854 148196 94507 43822 67666 73166 79500 125224 141426 143905 127718
17179A27718j8751p293j1641j9414O753N9219O4682p66j4234k2708L2438O7268
$$ 127718 108967 101674 90033 70619 77372 136591 201273 200507 186273 163565 196003 263271
17167B63271j4116n3553q2916k8506K5933N5316M1821R809M8805P7160P3270M9663
$$ 263271 249155 195602 112686 84180 110113 165429 207250 217059 265864 343024 416294 465957
17155D65957J05616M9134J4438K2054N913K8857J2062O772m5919r5225j08012
$$ 465957 571573 620707 635145 657199 663112 691969 704031 710803 664884 569659 461647
17144D61647p9848p8176n5831j1035L4361J7297j7483N5573M2377O3305J17119
$$ 461647 381799 303623 247792 236757 271118 288415 270932 326505 368882 432187 549306
17133E49306J26473J21200R2125N7215K0387J1746n214o3973q5712j20303j51208
$$ 549306 675779 796979 889104 946319 966706 978452 973238 909265 823553 703250 552042
17122E52042j25479r4184l5700K126k2744R000M1149J9143k508L869J3479P433
$$ 552042 426563 332379 296679 298805 276061 285061 326210 345353 342845 346714 360193 367626
17110C67626j913o001j9792p170J5927k9226m540N355N749J3996K3606J3885J7780
$$ 367626 365713 359712 339920 332750 348677 319451 314911 320266 326015 340011 363617 377502 395282
17097C95282j1183q319M043J0400q156k2332k2132K7319J8026K6654M8870P5532
$$ 395282 384099 375780 379823 390223 382067 359735 337603 364922 382948 409602 458472 534004
17085E34004K2810K0958J1652K3969M756P318J3444L869K1445O0771J14397J33210
$$ 534004 556814 577772 589424 613393 618149 625467 638911 642780 664225 724996 839393 972603
17073I72603J89678K30141J19579m2907r6382m5071L7803P4050J19181K61597
$$ 972603 1162281 1392422 1512001 1469094 1372712 1327641 1365444 1439494 1558675 1820272
17063A820272L15554J73498J59417O4967o613l3299L8604J59254K89849L60062
$$ 1820272 2135826 2309324 2468741 2533708 2527095 2493796 2532400 2691654 2981503 3341565
17053C341565N63688P09936O39012N17746N77180P11189J051990J690247K817474
$$ 3341565 3905253 4615189 5254201 5771947 6349127 7060316 8112306 9802553 12620027
17044A2620027M647588Q040805J5076783K7124816L3390885J0503577j8959917
$$ 12620027 17267615 25308420 40385203 67510019 100900904 111404481 92444564
17037I2444564k6728435j9650322j1263800n418202j176598L157215R353259J9677736
$$ 92444564 65716129 46065807 34802007 29383805 28207207 31364422 40717681 60395417
17029F0395417L1101556K1464506r616024k6418989k3090313j4275986p300335
$$ 60395417 91496973 112961479 103345455 76926466 53836153 39560167 32259832
17022C2259832k248254K596550R328646K0238520L0449088J6870698j2891417
$$ 32259832 30011578 32608128 41936774 62175294 92624382 109495080 96603663
17015I6603663k5853809k1202980j2907347o856076k613233J290275O419609J4902785
$$ 96603663 70749854 49546874 36639527 29783451 27170218 28460493 34880102 49782887
17007D9782887K6861577K5685945j937424k4073311k5054973j7213254j0603252
$$ 49782887 76644464 102330409 100392985 76319674 51264701 34051447 23448195
17000B3448195o593809m225524k750054j681702r28177o40497n85443n60107n05184
$$ 23448195 16854386 12628862 9878808 8197106 7268929 6628432 6042989 5482882 4977698
16991D977698n03556n51260n08737l65339k13379j3713K03660L32160J39700j93327
$$ 4977698 4474142 3922882 3414145 3048806 2835427 2821714 3025374 3357534 3497234 3303907
16981C303907l34929m33460m46628l03029k12205j17883j18026q4525j5813j0164
$$ 3303907 2968978 2535518 2088890 1785861 1573656 1455773 1337747 1253222 1237409 1227245
16971A227245K7055J15842R435j79755j58435p3163k4747q4872n3952n6395m4658
$$ 1227245 1254300 1370142 1379577 1199822 1041387 968224 943477 858605 804653 748258 703600
16960G03600m6028k7375k4542j9302n1318j6262O742j9153n441J8926k620J553
$$ 703600 657572 630197 605655 586353 535035 518773 525515 506362 500921 519847 517227 518780
16948E18780O536k9329n6275J6138J2196j2389k4139k3981n0697o9284m7455J5710
$$ 518780 525316 495987 439712 455850 468046 455657 431518 407537 356840 287556 240101 255811
16936B55811n576l5088j8797J2082m337m664K3958K776m2900O117q304j7747k021
$$ 255811 250235 215147 196350 208432 204095 199431 223389 226165 183265 189382 181078 163331 161310
16923A61310j751m587j2445L602K5491K9460M699l1861j2165P4051J7889q9818
$$ 161310 159559 154972 142527 146129 171620 201080 205779 173918 161753 235804 253693 163875
16911A63875n5407k9203l1398M7995N0617K1983j020O918J9050j1970l0997J3954
$$ 163875 108468 79265 47867 95862 146479 168462 167442 174360 193410 181440 150443 164397
16899A64397k5015l4576j7958O987L3026q219L6872N7139K719p5400m7527J402
$$ 164397 139382 104806 86848 93835 126861 118642 155514 212653 215372 139972 92445 93847
16887I3847k6434j6135J0804J4957K5260Q8J2479M2073J7136j5739k0253o8321
$$ 93847 67413 51278 62082 77039 102299 102387 114866 156939 174075 158336 138083 69762
16875F9762l2893p417R306M1347M2119P3639j7176l0036m0099m4880j2901K288
$$ 69762 36869 29452 38758 80105 122224 195863 178687 148651 108552 63672 50771 53059
16863E3059o001M765q556k4179J169O225K2402J5965m6607m6552k7932o535K3608
$$ 53059 47058 51823 43267 19088 20257 26482 48884 64849 18242 -28310 -56242 -62777 -39169
16850c9169O6593L7340J8438m7284k9219p618J5728L6811l9380k3889M2384j1070
$$ -39169 27424 64764 83202 35918 6699 -919 14809 51620 12240 -11649 30735 19665
16838A9665j7203K3688R127K0068j3981L757K2334J3764l0682k996n263j0279
$$ 19665 2462 26150 35277 55345 41364 45121 67455 81219 50537 47541 42278 31999
16826C1999K593j718K076J6428K1559k1294K640K1872j2798k2787J0871q285k1504
$$ 31999 34592 32874 34950 51378 72937 51643 54283 76155 63357 40570 51441 43156 21652
16813B1652m755m087Q516Q873J3143J3310M53q250q58R409j4459k2405M534j7381
$$ 21652 16897 12810 21326 30199 43342 56652 57105 48855 47997 57406 42947 20542 25076 7695
16799G695k2816J1322L2499L0360L1651p035j4075j8131j4389k3853M2154N067
$$ 7695 -15121 -3799 28700 59060 90711 83676 69601 51470 37081 13228 55382 60449
16787F0449K8209K563j7170k5547n5015j3760J2915N9136j7743k959K4138J682
$$ 60449 88658 91221 74051 48504 -6511 -20271 -7356 51780 34037 31078 55216 56898
16775E6898K1911L8193N297J7159K3499l791K9063J4589K9131R9989J73690L04532
$$ 56898 78809 117002 122299 139458 162957 159166 188229 202818 231949 331938 505628 810160
16763H10160L03280K71156K42611J1924j93399k83327k81962k61155j88716q6319
$$ 810160 1113440 1384596 1627207 1639131 1445732 1162405 880443 619288 430572 344253
16753C44253q3582j15461l5052m307J1772M5511N187l3850l9488k7505J6156J0588
$$ 344253 260671 145210 110158 105851 117623 163134 168321 134471 94983 67478 83634 94222
16741I4222J3341o7054m2732j997J0209J1611j4301K0577J2103M411k34m8533
$$ 94222 107563 40509 -2223 -4220 5989 17600 3299 23876 35979 40390 40156 -8377
16729h377n484P194K1746K7052N531k7181l022j9867r579o714P337J6171j6610
$$ -8377 -13861 -6667 15079 42131 47662 20481 17459 -2408 -11987 -18701 -11364 4807 -11803
16716a1803m980p963l318K848k2072m062K1800n437m5779j2697M7144M6373K8529
$$ -11803 -16783 -24746 -28064 -25216 -47288 -51350 -29550 -34987 -80766 -93463 -46319 54 28583
16703B8583m985j8599J9838L7584l4494p698J4458q336j6042L1645M3250j0919
$$ 28583 23598 4999 24837 62421 27927 20229 34687 26351 10309 41954 85204 74285
16691G4285p923j2057j4551r42o719J0369l0913j986J0820k1054K5727J9339k5748
$$ 74285 66362 54305 39754 38812 32093 42462 11549 9563 20383 -671 25056 44395 18647
16678A8647j8251K7370P677J1134K0000J0569p125n7092Q163L477J4754J8077
$$ 18647 396 27766 35443 46577 66577 77146 70021 12929 21092 24569 39323 57400
16666E7400J203l3221Q033j5257j1055K593l0376K1842p259k0153k0914N0101
$$ 57400 58603 25382 33415 18158 7103 9696 -20680 1162 -6097 -26250 -47164 2937
16654B937K5520J5818j6781k6800j4102J179K6555J5002j607j6954J2581Q827
$$ 2937 28457 44275 27494 694 -13408 -12229 14326 29328 27721 10767 23348 32175
16642C2175j772J9807o854k9176o520l7602J2027J1248j0984R251L438q834J3250
$$ 32175 30403 50210 43356 14180 7660 -29942 -17915 -6667 -17651 -8400 -4962 -13796 -546
16629e46p469j6385j4095m488K4516J1965Q430K1179Q663K786j5976r337n9613
$$ -546 -8015 -24400 -38495 -42983 -18467 -6502 1928 23107 31770 34556 18580 9243 -50370
16616e0370k5854m521j4471J5614N3469J5188j4163O130o115J8672L9418l0108
$$ -50370 -76224 -80745 -95216 -79602 -26133 -10945 -25108 -18978 -25093 -6421 32997 2889
16604B889l4408O49K1143j2923J2953j0468j9038k2010K9069L7656L4768k0398
$$ 2889 -31519 -30870 -9727 -22650 -9697 -20165 -39203 -61213 -32144 5512 40280 19882
16592A9882l8366R403j1343L6526K1296q923m3131k6089m2116M4098R626r45n4870
$$ 19882 -18484 -9081 -20424 16102 37398 28475 -14656 -40745 -82861 -38763 -29137 -30082 -84952
16579h4952l229N2654L0837J8263K4769L996k68k2481m3029k1014O359L2536K3408
$$ -84952 -88181 -35527 -4690 13573 38342 42338 42070 19589 -23440 -44454 -38095 -5559 17849
16566A7849p483J0073k9433L0715K569R304L108k2900q367l2444M911K6371J108
$$ 17849 10366 20439 -8994 21721 24290 33594 36702 13802 5435 -27009 -22098 4273 5381
16553E381J5091j9176l0558J7971j2484j4398j515M0162K6419J155L0298L3821
$$ 5381 20472 1296 -29262 -11291 -23775 -38173 -39688 474 26893 28048 58346 92167
16541I2167l4217m1313K702M1901K5196N122k4889n8467P134K5141k726m4019
$$ 92167 57950 16637 19339 61240 86436 91558 66669 8202 15336 40477 37751 -6268
16529f268l6628J8542j509k378L1714M183J7895L1079R351k7964j8022k0464l249
$$ -6268 -42896 -24354 -25863 -28241 3473 7656 25551 56630 65981 38017 19995 -469 -3718
16516c718k7238K0575N2072P681l4591l9699j085P474L9206N4516K7788O912j8850
$$ -3718 -30956 -10381 41691 49372 14781 -24918 -26003 -18529 20677 75193 102981 109893 91043
16503I1043k5734O274j3829l1620k2756l232M5570J3379J3590j6191m7459j7220
$$ 91043 65309 71583 57754 26134 3378 146 45716 59095 72685 56494 9035 -8185
16491h185Q965K2822R331J437L1142M4843J8234k3444m7665l1213m0447j5389
$$ -8185 780 23602 32933 34370 65512 110355 128589 105145 57480 26267 -14180 -29569
16479b9569L7975L8534M8580O9276J00850J50542J32351j0523n5933j12858r4725
$$ -29569 8406 46940 95520 164796 265646 416188 548539 538016 482083 369225 274500
16468B74500l5253l1816j0953R471O5217J28119J15985j1787j09466j18222p1018
$$ 274500 239247 207431 196478 205949 271166 399285 515270 503483 394017 275795 204777
16457B04777k1746q51k3875O935J12060J68840J39650L5170j21057j54142j22588
$$ 204777 183031 182180 158305 165240 277300 446140 585790 620960 499903 345761 223173
16446B23173o4827k9823K0002N2695M0950R8362J37206N4161j01124j56182n7087
$$ 223173 158346 128523 148525 201220 242170 340532 477738 531899 430775 274593 217506
16435B17506n2112n5252k3737l3404k085j7738l2908j3154j3046k120K7182K3395
$$ 217506 165394 110142 86405 53001 50916 33178 270 -12884 -25930 -28050 -868 22527
16423B2527p269j6571k0600j6692J1113M364J3330K472l9559J0619K9080K2009
$$ 22527 15258 -1313 -21913 -38605 -27492 -23128 -9798 -7326 -46885 -36266 -7186 14823
16411A4823p776N024P669P380j1348n398n102K544K5914J4241q567m9390j0715
$$ 14823 7047 12071 19740 27120 15772 10374 5272 7816 33730 47971 39404 -9986 -20701
16398b0701J7817K4083p830p177K1799j2109k3688j5567N0866J2167j515R652
$$ -20701 -2884 21199 13369 6192 27991 15882 -7806 -23373 27493 39660 38145 47797
16386D7797k7842k2432J6657o41J9153l5220k2523K3103M854K0663K89j0611P752
$$ 47797 19955 -2477 14180 13539 32692 -2528 -25051 -1948 2906 23569 23858 13247 20999
16373B0999L465J4448K28l1416m8690r12K2107J3968J5983j3885k6697j6460N292
$$ 20999 24464 38912 39140 7724 -40966 -41878 -19771 -5803 10180 -3705 -30402 -46862 -41570
16360d1570M1826Q182L4482P60K2670K4862q60m6224l5991k6110Q042j1201k8675
$$ -41570 256 8438 42920 43680 66350 91212 90352 44128 8137 -17973 -9931 -21132 -49807
16347d9807p128Q006J2163L479L3679K023M288J5877o192l0274l3670Q121m915
$$ -49807 -56935 -48929 -36766 -33287 392 2415 6703 22580 16388 -13886 -47556 -39435 -44350
16334d4350K405L0341o343R609K783j359O725m2232n3696J1506P2831M0609L150
$$ -44350 -41945 -11604 -17947 -8338 -5555 -6914 -189 -42421 -96117 -84611 -11780 28829 31979
16321C1979l0276n331j7455l0025O814n864m3193M3484N497q555M3274k182J1124
$$ 31979 1703 -3628 -21083 -51108 -44294 -50158 -93351 -49867 -44370 -52925 -9651 -11833 -709
16308g09J0129N29q853j0370j2273j4227j3144k1687J606M0200K6589o446M605
$$ -709 9420 9949 1096 -9274 -21547 -35774 -48918 -70605 -68999 -28799 -2210 -8656 -4051
16295d051J9538k85k4741K3671p894j5293j0428p092J6277J6203j8632k0600R073
$$ -4051 15487 15202 -9539 14132 6238 -9055 -19483 -26575 -10298 5905 -12727 -33327 -24254
16282b4254N1446L6904k3788r668l2022k4454J3536L6835Q870j6104k4865K6731
$$ -24254 27192 64096 40308 30640 -1382 -25836 -12300 24535 33405 17301 -7564 19167
16270A9167J4318Q529q037j4449L8213j8654k0395L0604k7695k3277J0568K2098
$$ 19167 33485 42014 33977 19528 57741 39087 18692 49296 21601 -1676 8892 30990
16258C0990j0518P496j3155j2609l0895j8120K829m1295j156N1159l074k4240
$$ 30990 20472 27968 14813 2204 -28691 -46811 -43982 -85277 -86433 -35274 -38348 -62588
16246f2588K4229m8397k4646K039o487J609R437K8618M9053K5312J5263o646P694
$$ -62588 -38359 -86756 -111402 -109363 -115850 -114241 -104804 -76186 -27133 -1821 13442 6796 14490
16233A4490j7166m6325j4435R293J8383j9011R237k9198p721M7250L6759J0170
$$ 14490 -2676 -49001 -63436 -54143 -35760 -54771 -45534 -74732 -82453 -35203 1556 11726
16221A1726m1928L0668J2360J7876J7252l0673k1833r97R530P752l822m9992J0157
$$ 11726 -30202 466 12826 30702 47954 17281 -4552 -5549 3981 11733 7911 -42081 -31924
16208c1924L797J8862Q834k8395K318K6633J6254j8524K2026K0392j35Q363j2395
$$ -31924 -28127 -9265 -431 -28826 -26508 125 16379 -2145 19881 40273 40138 48501 36106
16195C6106q842n0443k7755K1909K7085J3921R108j8416k1919J2427N7485j460
$$ 36106 27264 -23179 -50934 -29025 -1940 11981 21089 2673 -19246 -6819 50666 49206
16183D9206o7796n3056q374J1302J3924M455k881J9076L7462o0312m9482K0446
$$ 49206 -18590 -71646 -80020 -68718 -54794 -50339 -53220 -34144 3318 -56994 -106476 -86030
16171h6030J5753N321j0424j2449O9245K2831j618k3235K8536l3963l5192J9179
$$ -86030 -70277 -64956 -75380 -87829 -18584 4247 2629 -20606 7930 -26033 -61225 -42046
16159d2046L1444Q008j3750l261R449k454M495J3586L5237Q484k5139l2117k4421
$$ -42046 -10602 -2594 -16344 -19605 -10156 -12610 -8115 5471 40708 49192 24053 -8064 -32485
16146c2485M8172L0822l1556K0k8742m0808L0415j4074j5098L6589l9982k52M9649
$$ -32485 15687 46509 14953 14973 -13769 -54577 -24162 -38236 -53334 -16745 -56727 -56979 -7330
16133g330j9309K577K3610k67l4534k7312J9708O244J2941R010k4282J4772J9084
$$ -7330 -26639 -24062 -452 -719 -35253 -62565 -42857 -36613 -23672 -14662 -38944 -24172 -5088
16120e088K6647l399k5684j6970M0883j1515j6954k652K5045O257l4988K5643
$$ -5088 21559 18160 -7524 -24494 16389 4874 -12080 -14732 10313 16570 -18418 7225
16108G225l427l1044M384J6294J4943L5651J5416k5183j7106L271j9401K8892
$$ 7225 3798 -27246 -22862 -6568 8375 44026 59442 34259 17153 20424 1023 29915
16096B9915J4738l9634R410j4108n3380q516K1858J4465o625j2890j2362P803
$$ 29915 44653 5019 14429 321 -53059 -61575 -39717 -25252 -31877 -44767 -57129 -49326
16084d9326K1998J7230J9868J0287O918n739k1280j0395r068L9734q69j4320L1409
$$ -49326 -27328 -10098 9770 20057 26975 21236 -44 -10439 -19507 20227 19358 5038 36447
16071C6447K8913k4666j8724l1250k0866L7047K3701l9837j6729j1966J0964J5468
$$ 36447 65360 40694 21970 -9280 -30146 6901 30602 -9235 -25964 -37930 -26966 -11498
16059a1498L1838M121j4183M540j8870O007J2170j9758L2519j1788k7964j0876
$$ -11498 20340 24461 10278 14818 -4052 1955 14125 -5633 26886 15098 -12866 -23742
16047b3742M4874l4256n874K0354o285k2605l2578J6065K2312j674O443L3526
$$ -23742 21132 -13124 -18998 1356 -4929 -27534 -60112 -44047 -21735 -23409 -16966 16560
16035A6560j6716k576M5410J5750O951k7247p24l3541k9643K1419o265j676J1202
$$ 16560 -156 -2732 42678 58428 65379 38132 37408 3867 -25776 -4357 -10622 -12298 -1096
16022a096Q120J2077l2615l4300J2359K3809K6580l6615j1451J0056Q635J4887
$$ -1096 7024 19101 -13514 -47814 -35455 -11646 14934 -21681 -33132 -23076 -14441 446
16010D46L1709Q990k4440o438J2347J4068j5250M4573L3885j0999l3981l1284
$$ 446 32155 41145 16705 10267 22614 36682 21432 66005 99890 88891 54910 23626
15998B3626K7391J8259L3838k8892m0697R123k4922L791m920O645J0712K4320
$$ 23626 51017 69276 103114 74222 33525 42648 17726 21517 16597 23242 33954 58274
15986E8274q291n3324m3013q975M782M8441j2198P91J3517j8158K613j7399j5314
$$ 58274 49983 -3341 -46354 -55329 -50547 -2106 -14304 -13513 4 -18154 -15541 -32940 -48254
15973d8254K6087j9797K035J9958L0723K6213o199J5496L9878k0475J6698J068
$$ -48254 -22167 -41964 -39929 -19971 10752 36965 30766 46262 86140 65665 82363 83431
15961H3431j7375o9628l4768L3488J1717J6836j7203l5235j1003L2800L7568m662
$$ 83431 66056 -3572 -38340 -4852 6865 23701 6498 -28737 -39740 -6940 30628 25966
15949B5966j6320J4052J973j2029J4015j0141J4541J4719m5258m2394L8337r88
$$ 25966 9646 23698 25671 13642 27657 17516 32057 46776 1518 -40876 -2539 -3527
15937c527J0023j412l424k9427k6101L258K1369J7499K4651L3566j1395k7623
$$ -3527 6496 5084 1660 -27767 -53868 -50610 -29241 -11742 12909 46475 35080 7457
15925G457n4941q944o670J7355O253P388J1523k5648q156M0808L6656L7965o126
$$ 7457 -47484 -56428 -63098 -45743 -39490 -32102 -20579 -46227 -54383 -13575 23081 61046 54920
15912E4920j7729k6007K130J2404l3135k7336p482L0340J9970q538K5886L2389
$$ 54920 37191 11184 13314 25718 -7417 -34753 -42235 -11895 8075 -463 25423 57812
15900E7812L009J2843l206m3029j3435K5202k3826j6064N036k3727k4461k944
$$ 57812 60821 73664 70458 27429 13994 39196 15370 -694 4342 -19385 -43846 -46790
15888d6790k4962L7874K1592K1804O4489K1150K7718k6851k8270n4052L36K8194
$$ -46790 -71752 -33878 -12286 9518 74007 95157 122875 96024 67754 13702 14038 42232
15876D2232k0110j3185j0398J1360j5336j0825k3032N3253p586m6857K5402m709
$$ 42232 22122 8937 -1461 9899 -5437 -16262 -39294 13959 6373 -40484 -15082 -19791
15864a9791j9618J778J2172l9435k0992K4277j065P91q742K6174K6066k009J4902
$$ -19791 -39409 -37631 -25459 -64894 -85886 -61609 -62674 -61883 -70625 -44451 -18385 -20394 -5492
15851e492N723o381J473l51K8205J9669l5794N847M9795l0060o5966j5238K3245
$$ -5492 231 -6150 -4677 -5028 23177 42846 7052 12899 62694 32634 -33332 -48570 -25325
15838b5325J688J9695n591K0665M2726K1813o1508k6673R155K6791J7290k8683
$$ -25325 -23637 -3942 -9533 11132 53858 75671 14163 -12510 -3355 23436 40726 12043
15826A2043j2093j5758N03j5364m8761K7130L8458K7850J6004l3790k4669j5908
$$ 12043 -50 -15808 -15305 -30669 -79430 -52300 -13842 14008 30012 -3778 -28447 -44355
15814d4355L9238K011N355l8643Q05n950N390L7028J7539k7801j7721j5167J0125
$$ -44355 -5117 -3106 2249 -36394 -35589 -41539 -36149 879 18418 -9383 -27104 -42271 -32146
15801c2146N627l0787M322J3655J784l9876l1084J8624M3300L2765O575j6337
$$ -32146 -26519 -57306 -52984 -39329 -37545 -77421 -108505 -89881 -46581 -13816 -7241 -23578
15789b3578J2481j7002k6790L9398O5751K6769p387k0531l3396m2794k5831o38
$$ -23578 -11097 -28099 -54889 -15491 50260 77029 69642 49111 15715 -27079 -52910 -53548
15777e3548L6620n897j5208j2397m644k284K0204J5569J4936M034j4545p088J7219
$$ -53548 -16928 -22825 -38033 -50430 -55074 -57358 -37154 -21585 -6649 -2615 -17160 -24248 -7029
15764g029M7017P15m8358O679K2166j4883n3360J1641L2641j954K2327j2899L6840
$$ -7029 39988 40703 -7655 -976 21190 6307 -47053 -35412 -2771 -4725 17602 4703 41543
15751D1543R679J1962m1515J1139J4352k4422j233O913n494l1311j3166j6688
$$ 41543 51222 63184 21669 32808 47160 22738 21505 28418 22924 -8387 -21553 -38241
15739c8241J64L2342j4411j1464O768K7021M8996K3312j2177n0746j6898M413
$$ -38241 -38077 -5735 -20146 -31610 -24842 2179 51175 74487 62310 11564 -5334 -921
15727i21K9353k956n7790J1622Q713j1237l8098J9595L9608l4173j6526N2331
$$ -921 28432 25476 -32314 -20692 -11979 -23216 -61314 -41719 -2111 -36284 -52810 -479
15715d79M3399J5792K5042k047m9216j3803J8991j5701q236M321j671J977k6431
$$ -479 42920 58712 83754 81707 32491 18688 37679 21978 13742 18063 16392 18369 -8062
15702h062J708N7086m007l7271L295j0057M2959L2969L964m1049m9829K6013M170
$$ -8062 -6354 50732 46725 9454 12749 2692 45651 78620 82584 41535 -8294 17719 21889
15689B1889M912J9308l8693k9791J2576K5227J9925q846m547K4999o560j7384
$$ 21889 26801 46109 7416 -22375 -9799 15428 35353 26507 21960 46959 40399 23015
15677B3015m1900j717k2265J2358j1494q295K2999j9203L7812M0463k7310q000
$$ 23015 -18885 -20602 -42867 -30509 -42003 -50298 -27299 -46502 -8690 31773 4463 -3537
15665c537Q748J5017L2372k5701N046R73K173k6974l473l9446N97K5908L32k0701
$$ -3537 5211 20228 52600 26899 31945 32918 35091 8117 4644 -34802 -34205 -8297 -7965 -28666
15651b8666k3420l366m141M4968L7762J8666l2995l9620m115j169L6510K8533
$$ -28666 -52086 -55452 -59593 -14625 23137 41803 8808 -30812 -34927 -36096 414 28947
15639B8947K0220j0541l2824J073k1017L533K209J0915m0353n1051M314o853Q726
$$ 28947 49167 38626 5802 6875 -14142 -10609 -8400 2515 -37838 -88889 -84575 -91428 -82702
15626h2702q128j9927Q703N5260J4785K6853j619M8944M3592k5513j4655L152
$$ -82702 -90830 -110757 -102054 -46794 -32009 -5156 -6775 42169 85761 60248 45593 48745
15614D8745k1944j9616J020k1340L1434K202J4865J177J3636J6137n0132l3910
$$ 48745 26801 7185 8205 -13135 18299 20501 35366 36543 50179 66316 16184 -17726
15602a7726J0286Q394P465M284J526O296J0548M075J626Q609L9913l3239p3372
$$ -17726 -7440 954 8419 12703 14229 20525 31073 35148 36774 45383 85296 52057 -21315
15589b1315m8126n022p796N8397J6538k5608N746Q287l3390J0703k894J4699N0648
$$ -21315 -69441 -74463 -82259 -23862 -7324 -32932 -27186 -18899 -52289 -41586 -44480 -29781 20867
15576B0867P711j8936j0413k1347K1613o206j9823N357L8785L0277k4443N687
$$ 20867 28578 9642 -771 -22118 -505 -6711 -26534 -21177 17608 47885 23442 29129
15564B9129O449R978m01K6616M527j9606O1l3431k4643m3832O296J1094O35l3568
$$ 29129 35578 45556 45155 71771 76298 56692 56753 23322 -1321 -45153 -38857 -27763 -27128 -60696
15550f0696n878K9850j6881r487l5196k226L8105J1164j1607N1846L3859j9259
$$ -60696 -66574 -36724 -53605 -63092 -98288 -100514 -62409 -51245 -62852 -11006 22853 3594
15538C594L272K3920j895L170o4489j8183N5546L8326j6322J5691Q619k3553m5868
$$ 3594 6866 30786 28891 32061 -32428 -50611 4935 43261 26939 42630 51249 27696 -18172
15525a8172L19M0900k7264o5648l9127L9100N2080L7299o793k2503L9258N182
$$ -18172 -17853 23047 -4217 -69865 -108992 -69892 -17812 19487 12694 -9809 29449 34631
15513C4631j1978j6596N011K985M038o060q993O370J0250O597o023j7615K5842
$$ 34631 22653 6057 11068 14053 18091 12031 3038 9408 19658 26255 20232 2617 28459
15500B8459J6515k5318N23j6149J0250k9316j5372o317R208M0552k25K0297k141
$$ 28459 44974 19656 20179 4030 14280 -15036 -30408 -36725 -27517 13035 12810 33107 30966
15487C0966l8077j004m5912j6246M1221p560K2305J2012Q724j1139k4518j1500
$$ 30966 -7111 -8115 -54027 -70273 -29052 -36612 -14307 -2295 6429 -4710 -29228 -40728
15475d0728j8396K6666J3842k0774j6838j1213J2015k4981p333L0624M6057k059
$$ -40728 -59124 -32458 -18616 -39390 -56228 -67441 -55426 -80407 -87740 -57116 -11059 -13118
15463a3118l0733M663J5574l92K082m137j5564k281q134l4795K0703N8826K2070
$$ -13118 -43851 -39188 -23614 -24006 -21924 -26061 -41625 -43906 -52040 -86835 -66132 -7306 14764
15450A4764l3727j5426m4475n2301J4470M2352K6889O342k2641l44K6896J6896
$$ 14764 -18963 -34389 -78864 -131165 -116695 -74343 -47454 -41112 -63753 -64097 -37201 -20305
15438b0305J2236K7623K6503J7795j208m7132k8720j2751j2025K2085L4104J0990
$$ -20305 -8069 19554 46057 63852 62644 15512 -13208 -25959 -37984 -15899 18205 29195
15426B9195k2400l1135J8753N1429J0809l4858m5023L171L9946O793k5061n7210
$$ 29195 6795 -24340 -5587 45842 56651 21793 -23230 -20059 19887 26680 1619 -55591
15414e5591K055M1342M2695k2994J191j582j8618p447j4680K825J5635J6691J696
$$ -55591 -53536 -12194 30501 7507 8698 7116 -11502 -18949 -33629 -30804 -15169 1522 3218
15401C218k136J1461J0837J4741q051J4089k6931m8711r998J9222M4314K2401
$$ 3218 1082 12543 23380 38121 30070 44159 17228 -31483 -41481 -22259 22055 44456
15389D4456J3844q100j2757J8889j3348k985R131p409j8804l2436o644m816O800
$$ 44456 58300 50200 37443 56332 42984 39999 49130 41721 22917 -9519 -16163 -20979 -14179
15376a4179K9981O182N28j9927O625m0218l7785P1719L6111o0351k1491l820L0654
$$ -14179 15802 21984 22512 2585 9210 -31008 -68793 2926 39037 -21314 -42805 -46625 -15971
15363a5971N1536L3174M068k2572M223N0915O1496M6181J6970k9286o2853m0463
$$ -15971 35565 68739 72807 50235 54458 105373 166869 213050 230020 200734 137881 97418
15351I7418m9733j7923m0793m5509K7023J6919J9074J1346j1329k9910m1913L2511
$$ 97418 47685 29762 -11031 -56540 -29517 -12598 6476 17822 6493 -23417 -65330 -32819
15339c2819O8297Q09J1328k0263r787J1527k0859k6271L300l9644l74J8903M7151
$$ -32819 35478 36287 47615 27352 17565 29092 8233 -18038 -14738 -54382 -54756 -35853 11298
15326A1298J6206k3187K9354l573l170J6058m0023N167J4201n577n6843l6356
$$ 11298 27504 4317 33671 30098 26928 42986 2963 8130 22331 16754 -40089 -76445
15314g6445J8449M1150q366k9279M7490L0222q003n294j9293k8037o511j6909
$$ -76445 -57996 -16846 -25212 -54491 -7001 23221 15218 9924 -9369 -37406 -43917 -60826
15302f0826O526M0258K7479L2163j5934l5766k4617O38k0861l5196j2404p157
$$ -60826 -54300 -14042 13437 45600 29666 -6100 -30717 -30079 -50940 -86136 -98540 -105697
15290a05697J0418L5729K2813L5357J1112k548N235j6285l1396j3239q02J8084
$$ -105697 -95279 -59550 -36737 -1380 9732 7184 12419 -3866 -35262 -48501 -49303 -31219
15278c1219J6912J3461O260k7578l666M0545J6733J7004n2706j098J5849m1763
$$ -31219 -14307 -846 5414 -22164 -25830 14715 31448 48452 -4254 -5352 10497 -31266
15266c1266j3596l2813K0442K8460J1571o545m3342J4651M4301O0502L3707j5299
$$ -31266 -44862 -77675 -57233 -28773 -17202 -23747 -67089 -52438 -8137 52365 86072 70773
15254G0773m6891J1798M910k7673j3197k8145l0369K0456J8221K5957M5861J2560
$$ 70773 23882 35680 40590 12917 -280 -28425 -58794 -38338 -20117 5840 51701 64261
15242F4261J0395l9029n6828m129K2676J1599l0986M4160L1033l2161L0205K6541
$$ 64261 74656 35627 -21201 -25330 -2654 8945 -22041 22119 53152 20991 51196 77737
15230G7737K2239J61n4963k4300K6559j2749o4811l2845J4222M2118L1249j0878
$$ 77737 99976 100137 45174 20874 47433 34684 -30127 -62972 -48750 -6632 24617 13739
15218A3739k5910j0918n433m8749p724M9986M8328K1271Q270q77j5414J438J1623
$$ 13739 -12171 -23089 -28522 -77271 -84995 -35009 13319 34590 42860 41983 26569 28007 39630
15205C9630j8618k7184j8700J5889J7743K2761J3624L2964q589n381l0556k4439
$$ 39630 21012 -6172 -24872 -8983 8760 31521 45145 78109 69520 64139 33583 9144
15193I144J652P815J7828k226l5578m6591L3833M5079n1532k1374J8427l1976
$$ 9144 10796 18611 36439 34213 -1365 -47956 -14123 30956 -20576 -41950 -23523 -55499
15181e5499k6893L4608M7595J5502K5387J5020k2228o713r755P675j3027m833
$$ -55499 -82392 -47784 -189 15313 40700 55720 33492 26779 17024 24699 11672 6839
15169F839k5419l6096K077L828l022L800r928J8818M9618k662j7395N040k0300
$$ 6839 -18580 -54676 -52599 -48771 -51793 -47993 -57921 -39103 10515 7853 -9542 -4502 -24802
15156b4802k46M6092J3376m5703k1914N889O876K765j3675j7042r441P847O6435
$$ -24802 -25048 21044 34420 -11283 -33197 -27308 -20432 -17667 -31342 -48384 -57825 -49978 16457
15143A6457P781l9434Q541L5947L4472M351j0878j5061m3214K4441M9521L1000
$$ 16457 24238 -15196 -6655 29292 63764 68115 57237 42176 -1038 23403 72924 103924
15131A03924k9739j3034l2304l2558o798J6415r500J1541K4870l5393P27J985
$$ 103924 74185 61151 28847 -3711 -10509 5906 -3594 7947 32817 -2576 -1849 136
15119A36k3001l100L8098J2118r983m8735j8010p580N1792M9240M8055J5057p2925
$$ 136 -22865 -25965 12133 24251 14268 -34467 -52477 -60057 -8265 40975 89030 104087 31162
15106C1162k1890k0333l4648q91N7264P7026K4355k0413k8091j0719R512l7216
$$ 31162 9272 -11061 -45709 -46600 10664 87690 112045 91632 63541 52822 62334 25118
15094B5118m952k9996l6247M148J6658K7796l879K1626J5233Q910J1828n862k1960
$$ 25118 20166 -9830 -46077 -41929 -25271 2525 -1354 20272 35505 44415 56243 50381 28421
15081B8421j7807J3956K2162k8398m5330J0091L6871O270o3344l3792K5902l14
$$ 28421 10614 24570 46732 18334 -26996 -16905 19966 26236 -37108 -70900 -44998 -45312
15069d5312K1131P881l484j4568j4929l1492n478J2642K7453K4573J114K472k057
$$ -45312 -24181 -16300 -19784 -34352 -49281 -80773 -86251 -73609 -46156 -21583 -20469 -17997 -20054
15056b0054R539K6381J9022M7807l5606k7177J0568j7021k7278K5829j8905J7815
$$ -20054 -10515 15866 34888 82695 47089 19912 30480 13459 -13819 12010 -6895 10920
15044A0920O935k4048k1663P896L3730L4163l2053J3068l8210k4390K6330L1682
$$ 10920 17855 -6193 -27856 -19960 13770 47933 15880 28948 -9262 -33652 -7322 24360
15032B4360J4578j7066Q680K9152k4319K907k2590O747m627k2484J1282r57l2604
$$ 24360 38938 21872 30552 59704 35385 38292 15702 22449 17822 -4662 6620 5663 -26941
15019b6941Q913M0507q25K438j3324J1919P017K1890N803k4815k5095j3630M4017
$$ -26941 -18028 22479 21654 24092 10768 22687 29704 51594 57397 32582 7487 -6143 37874
15006C7874L9247K2675L0188K2463l2172m2120k8480o527J9898L044j0068j7359
$$ 37874 77121 99796 129984 152447 120275 78155 49675 43148 63046 66090 56022 38663
14994C8663J4942l0301R696j7440l4122k7232K235N1748n018l898k1484o828l0131
$$ 38663 53605 23304 33000 15560 -18562 -45794 -43559 8189 3171 -727 -22211 -29039 -59170
14981e9170K3031o638J5592K074j1190J3493J2569P428j8328K4355N0599k3658
$$ -59170 -36139 -42777 -27185 -25111 -36301 -22808 -10239 -2811 -21139 3216 53815 30157
14969C0157n2437j42M6617P740k1217K2220J0591n542l5864j0551K6829r01k5442
$$ 30157 -22280 -22422 24195 31935 10718 32938 43529 37987 2123 -8428 18401 17500 -7942
14956g942k8726O082J8071O428o675j8266m677j636r839J694M1430J0220n398
$$ -7942 -36668 -30586 -12515 -6087 -12762 -31028 -35705 -37341 -47180 -45486 -4056 6164 766
14943G66M152M5747L1048m1656j8315p900m5218o530J7750J9245j8677j1293n54
$$ 766 4918 50665 81713 40057 21742 13842 -31376 -37906 -20156 -911 -19588 -30881 -31435
14930c1435K8377J3176J9305J0042m220j9261O204k7018M548o783R781P934K7516
$$ -31435 -3058 10118 29423 39465 35245 15984 22188 -4830 -282 -7065 2716 10650 38166
14917C8166o874l8924m9499P473L8567N5886K1311m0926j5017j4698m4195k3192
$$ 38166 31292 -7632 -57131 -49658 -11091 44795 66106 25180 10163 -4535 -48730 -71922
14905g1922R009J9727P191J2542N527j2137P735j1366M435l312K5311J2476j5729
$$ -71922 -62913 -43186 -35995 -23453 -17926 -30063 -22328 -33694 -29259 -32571 -7260 5216 -10513
14892a0513k5883J6262j1648J0814K545K5622K9441K8963j9766m6729n056K0331
$$ -10513 -36396 -20134 -31782 -20968 -18423 7199 36640 65603 45837 -892 -5948 14383
14880A4383J5439m7775l948J1606r948k096j3531l520J8126L8937P028l0918n1429
$$ 14383 29822 -17953 -21901 -10295 -20243 -22339 -35870 -39390 -21264 17673 24701 -6217 -57646
14867e7646m5171j7788K9000K781K6546O3030N2182K0172j7268m1962m5820m7035
$$ -57646 -102817 -120605 -91605 -88824 -62278 752 52934 73106 55838 13876 -31944 -78979
14855g8979N0771M6722k3320L0297J84l0367J8535J4391K9994L1183J2164K7365
$$ -78979 -28208 18514 -4806 25491 25675 -4692 13843 28234 58228 89411 101575 128940
14843A28940p199R18O115m8183n6932J2237M5113j8476k4218k1000J0756K4645
$$ 128940 121741 122659 128774 80591 23659 35896 81009 62533 38315 17315 28071 52716
14831E2716K6808n0873J1140K4838j0948n1020K4584O548j1516k2314r044J5021
$$ 52716 79524 28651 39791 64629 53681 2661 27245 33793 22277 -37 -9081 5940
14819E940j8905J9958j1875q713K723M352j7481K27k5774J995P42K8191K7319
$$ 5940 -12965 6993 -4882 -13595 -10872 -6520 -24001 -23774 -49548 -47553 -46811 -18620 8699
14806H699l7664K0522N902j6491k3228k4133J7645K802m781N9136N2452j8907
$$ 8699 -28965 -8443 -2541 -19032 -42260 -66393 -48748 -45946 -50727 8409 60861 41954
14794D1954j9013J7463l026k739j4799J9544L672l6552K680q856n0180K891k559
$$ 41954 22941 40404 37378 34639 19840 39384 43056 6504 9184 328 -49852 -46961 -49520
14781d9520n853m365K9366L6500K8121k6962L700J9780p240l5331k9762j0516
$$ -49520 -55373 -59738 -30372 6128 34249 7287 10987 30767 23527 -11804 -41566 -52082
14769e2082K788l073K7492j6566K7330K381J075P859j7252j1938j4945J006M7743
$$ -52082 -49294 -52367 -24875 -41441 -14111 -11730 -10655 -2796 -20048 -31986 -46931 -45925 1818
14756A818J1601l219l975J4984L321k4864l0958J2777J0684j1026j2922J7752
$$ 1818 13419 10200 6225 21209 24530 -334 -31292 -18515 -7831 -18857 -31779 -14027
14744a4027o997L200o122L572J4917O964K9215m622p0894k990K6288p414l0961
$$ -14027 -21024 -17824 -23946 -20374 -5457 1507 30722 26100 -44794 -47784 -21496 -28910 -59871
14731e9871l103j4279L9918M7199j354J3531j5920j8016j1491K114J370k2549
$$ -59871 -62974 -77253 -37335 9864 8510 22041 6121 -11895 -23386 -21272 -19902 -42451
14719d2451k2162K3451J9047j5028L8443L1093P052n1056l9708k3296K0676O5166
$$ -42451 -64613 -41162 -22115 -37143 1300 32393 39445 -11611 -51319 -74615 -53939 11227
14707A1227L8516p064J5741j2667o605m6157j0097M507q344m869p002M876L0730
$$ 11227 49743 42679 58420 45753 39148 -7009 -17106 -12599 -20943 -25812 -32814 -27938 2792
14694B792N3024j2936m9595l6362M581j1376M79R173L6534K40j3836l9L9211J7329
$$ 2792 55816 42880 -6715 -43077 -38496 -49872 -49393 -40220 -3686 -3446 -17282 -17321 21890 39219
14680C9219r460k530J691j4079J119M5877J4609k7259k9377L92K4951l0222k4052
$$ 39219 29759 27229 28920 14841 15960 61837 76446 49187 19810 20202 45153 14931 -9121
14667i121J8126O681q1525j1782n133M9223K0944k9624n941j8221O214M1896J2337
$$ -9121 9005 15686 -65839 -77621 -82754 -33531 -12587 -42211 -48152 -66373 -60159 -18263 -5926
14654e926n641j4311J6995J4191K0156R192k0627k3253j472k8349k4023j0405
$$ -5926 -11567 -25878 -8883 5308 25464 34656 14029 -9224 -10696 -39045 -63068 -73473
14642g3473Q799L7429J824k2471n197k7605q180N0661L2928L1074j5494p189j8850
$$ -73473 -64674 -27245 -25421 -47892 -53089 -80694 -88874 -38213 -5285 25789 10295 3106 -15744
14629a5744k2172K1476J8533r806J1312L587j7177J6305L1075j5968j6644J9531
$$ -15744 -37916 -16440 2093 -7713 3599 7186 -9991 6314 37389 21421 4777 24308
14617B4308j3931k611l495Q062r260m317l840K0818r270n1172m3788k7423j5815
$$ 24308 10377 7766 4271 12333 3073 -1244 -5084 15734 6464 -44708 -88496 -115919 -131734
14604a31734P504K2200L9111L3648J0841N0313j5462k6914J3295J2210j9769K6534
$$ -131734 -124230 -102030 -62919 -29271 -18430 31883 16421 -10493 2802 15012 -4757 21777
14592B1777O560J186j825j6362j737j7562J5274j5906j1069J4214j8930j0313
$$ 21777 28337 29523 27698 11336 9599 -7963 7311 -8595 -19664 -5450 -24380 -34693
14580c4693Q583J7667K3300J088j6815p2315o1377L3014N0565K6856R546k5938
$$ -34693 -26110 -8443 14857 15945 -870 -73185 -134562 -101548 -50983 -24127 -14581 -40519
14568d0519q260J5000J9462l4436o4822L8010K5196j7317k0225N0971L8312j3862
$$ -40519 -48779 -33779 -14317 -48753 -113575 -75565 -50369 -67686 -87911 -36940 1372 -12490
14556a2490j9620K3982L1322j888L292m5J4380R835m1191n7149J3249J4544L900
$$ -12490 -32110 -8128 23194 21306 24598 24553 38933 48768 7577 -49572 -36323 -21779 -17879
14543a7879k653J3505K2862J1525q414k1821m3628L4694J3009j2280p894K6232
$$ -17879 -20532 -7027 15835 27360 18946 -2875 -46503 -11809 1200 -11080 -18974 7258
14531G258N0268K1876L535k8120N056m23p856l1938k6041J1743K7082j7282m8912
$$ 7258 57526 79402 82937 54817 59873 59450 51594 19656 -6385 5358 32440 15158 -33754
14518c3754j3243O585L356o368k684r779m7686K2471O3375M3622k0406K747L2986
$$ -33754 -46997 -40412 -37056 -43424 -46108 -55887 -103573 -81102 -17727 25895 5489 8236 41222
14505D1222j6158k8064J8964R6m0131o999K571m1513K3348M9573N192l2001j1314
$$ 41222 25064 -3000 15964 16060 -24071 -31070 -28499 -70012 -46664 2909 8101 -23900 -35214
14492c5214j4116K8511J1675R172l616N4999l4365k5638k4658K3390J1825j8527
$$ -35214 -49330 -20819 -9144 28 -3588 51411 17046 -8592 -33250 -9860 1965 -16562
14480a6562J0506J4363N7525K4515n141p5902r3546j138M5053k819l6113m825
$$ -16562 -6056 8307 65832 90347 85206 9304 -84242 -85380 -40327 -43146 -79259 -84084
14468h4084N7385M5172J7307k8392j3317P230j4135j7656K7700K4844M43k652
$$ -84084 -26699 18473 35780 7388 -5929 1301 -12834 -30490 -2790 22054 22497 19845
14456A9845L6250L4302K8767q0402m9614k5488l021O780j961K3861J4062j0343
$$ 19845 56095 90397 119164 38762 -10852 -36340 -39361 -32581 -34542 -10681 3381 -6962
14444f962J3452M7848J8991q717K3764L8972J3570l2473k0939m0450j6962J6240
$$ -6962 6490 54338 73329 64612 88376 127348 140918 108445 87506 47056 30094 46334
14432D6334l3568j7974j1544j9533l3194m5966K1848N7159M2465L2570N285oj0146
$$ 46334 12766 -5208 -16752 -36285 -69479 -115445 -93597 -36438 6027 38597 43882 43876 33730
14419C3730n140J1977l0702k5193K883j9505m3712J1057M6506L8776k6349l0502
$$ 33730 28590 40567 9865 -15328 -12445 -31950 -75662 -64605 -18099 20677 -5672 -36174
14407c6174l8483k3808J1178K1010R617J9832L8487l3175n3612K9352m005k5591
$$ -36174 -74657 -98465 -87287 -66277 -56660 -36828 1659 -31516 -85128 -55776 -59781 -85372
14395h5372K910L4005l9643j2776J0102N2438L8148K8051k8116k832j3707L8376
$$ -85372 -82462 -48457 -88100 -100876 -90774 -38336 -188 27863 -253 -3085 -16792 21584
14383B1584o429k2856j5242L1676J0208j8826k3367m8445j7559N790L5565l374
$$ 21584 15155 -7701 -22943 8733 18941 115 -23252 -71697 -89256 -83466 -47901 -51275
14371e1275J8534K2297o197J9778j373J667o016p268L1594o463J9105j073l8589
$$ -51275 -32741 -10444 -16641 3137 1764 3431 -2585 -9853 21741 15278 34383 33310 -5279
14358e279K7562o132j3325K6779j2594o4918k0145L8967J7634N488J5484J5315
$$ -5279 22283 16151 2826 29605 17011 -47907 -68052 -29085 -11451 -5963 9521 24836
14346B4836r141O105P413L079q899j4932J5113K2890q683l0279K8471k2720o476
$$ 24836 15695 21800 29213 32292 23393 8461 23574 46464 37781 7502 35973 13253 6777
14333F777o077j2723j8217K7424K6726N455k5440Q276J6085l2430k4088m1233
$$ 6777 700 -12023 -30240 -2816 23910 29365 3925 12201 28286 -4144 -28232 -69465
14321f9465L3952N8901N417k2340R408M6587K2416k6588j285l420l3376l1147
$$ -69465 -35513 23388 28805 6465 15873 62460 84876 58288 57003 53583 20207 -10940
14309a0940l7632Q347K610L257J5031m183P354P9178m236n9716m4842J5431L1645
$$ -10940 -48572 -40225 -37615 -34358 -19327 -23510 -16156 63022 58786 -930 -45772 -30341 1304
14296A304k8522k8818J4138K1479O488K8979J2479n292r008j7114o401J2078N9385
$$ 1304 -27218 -56036 -41898 -20419 -13931 15048 27527 22235 13227 -3887 -10288 1790 61175
14283F1175K2324k0777l4057k4175k0590k2444p561J1586J3810K2464P42l0343
$$ 61175 83499 62722 28665 4490 -16100 -38544 -46105 -34519 -20709 1755 2497 -27846
14271b7846k060N2178J9766n6145m5603L2779M5493L0597j022m1526l1229k395
$$ -27846 -29906 22272 42038 -14107 -59710 -26931 18562 49159 48137 6611 -24618 -27013
14259b7013l04J6212k8059N312M3197K345j06J9515J4923n291j3900k7998j7543
$$ -27013 -27317 -11105 -39164 -33852 9345 11690 11584 31099 46022 40731 26831 -1167 -18710
14246a8710L432J1794J7930J4497J9345j2634K0828j6214J7352K7162P560j9595
$$ -18710 -15278 -3484 14446 28943 48288 35654 56482 40268 57620 84782 92342 72747
14234G2747m7769k3376P31R017R732k9913m2450j2627n738J5970K0525p00K0835
$$ 72747 24978 1602 2333 11350 21082 -8831 -51281 -63908 -69646 -53676 -33151 -33851 -13016
14221a3016M4065j9604q125m7383K407M3257r110l7054k2423L0660M9464J8435
$$ -13016 31049 11445 3320 -44063 -41656 1601 -7509 -44563 -66986 -36326 13138 31573
14209C1573m11k1343M2891J5597j1290j3927l5307j2632r612Q325n545l6300l8191
$$ 31573 31162 9819 52710 68307 57017 43090 7783 -4849 -14461 -6136 -11681 -47981 -86172
14196h6172j6586L7555J5539J7420Q936J9565m885j1389O742q082K2271L4219
$$ -86172 -102758 -65203 -49664 -32244 -23308 -3743 -8628 -20017 -13275 -21357 914 35133
14184C5133r525q047k3184l293J1123R295K7097J9306k4921j1386p183o505L170
$$ 35133 25608 17561 -5623 -8916 2207 11502 38599 57905 32984 21598 14415 7910 11080
14171A1080j37j2913J8069j407j827J6909K6420m3261j3760k0254n675j9598J2620
$$ 11080 10943 -1970 16099 14692 12865 29774 56194 12933 -827 -21081 -26756 -46354 -33734
14158c3734J2686l463O79L3698R704n2385N515L8461L0190J387l019j4266j3963
$$ -33734 -21048 -24511 -23832 9866 19570 -32815 -27300 11161 41351 42738 39719 25453 11490
14145A1490l2389k3614J5604K3525n595K0116l225L7008l076p134L853J023m3901
$$ 11490 -20899 -44513 -28909 -5384 -10979 9137 5912 42920 39844 32710 36563 37586 -6315
14132f315l4241L9839j8104k5547M863P3R87J3069P447k980J6468K2982K111O115
$$ -6315 -40556 -717 -18821 -44368 -39505 -39432 -38445 -25376 -17929 -20909 -4441 18541 20652 26767
14118B6767J54P019j8878q763K1575M7302l0265l0289k8568k8705K6508R875q956
$$ 26767 26921 33940 15062 6299 27874 75176 44911 14622 -13946 -42651 -16143 -6268 -15224
14105a5224j1579l224O9534K8518j5509j2068m2513k2534M6121K0940M392J1553
$$ -15224 -26803 -30027 39507 68025 52516 40448 -2065 -24599 21522 42462 46854 58407
14093E8407l664j6859r347J2211l7676m4251m389K7461N9971k2519J947k933k542
$$ 58407 54743 37884 28537 40748 3072 -41179 -45568 -18107 41864 19345 21292 18359 15817
14080A5817k527j5746r532m291j1445Q275M9605O853m112K6089j4643n7157l1325
$$ 15817 13290 -2456 -11988 -16279 -27724 -19449 30156 37009 32897 58986 44343 -12814 -44139
14067d4139k8134J8092q219j8492M9764j4287J6357J7113J1990j5246K0188j8768
$$ -44139 -72273 -54181 -62400 -80892 -31128 -45415 -29058 -11945 45 -15201 4987 -13781
14055a3781k4112J0203L9360k499l1488j4563k2033M5390K6174O850o723n367
$$ -13781 -37893 -27690 11670 9171 -22317 -36880 -58913 -13523 12651 19501 12778 7411
14043G411l3743N457M9896J5579K7913j6457k9499k2081n6251r331N465p659J612
$$ 7411 -26332 -20875 29021 44600 72513 56056 26557 4476 -51775 -61106 -55641 -63300 -61688
14030f1688J3389K0911L4911L1667j4452k5355K6659n324k267R08m5243j9122
$$ -61688 -48299 -27388 7523 39190 24738 -617 26042 20718 18451 19359 -25884 -45006
14018d5006J6559j5860K7253O3181N081J911k2686l7606l4143q982j1270k8693
$$ -45006 -28447 -44307 -17054 46127 51208 53119 30433 -7173 -41316 -50298 -61568 -90261
14006i0261K2J8235N7673L5889L551l3896J9981J3125r903k6197k2743J866K0176
$$ -90261 -90239 -72004 -14331 21558 25109 -8787 11194 24319 14416 -11781 -34524 -32658 -12482
13993a2482k719p612j3501K3810J561j6759M8856j9538J5704j3072n5213L0669
$$ -12482 -15201 -22813 -36314 -12504 -10943 -27702 21154 1616 17320 4248 -50965 -20296
13981b0296j013Q089L519l220J9837j5297k8886L6151Q0j2896k146j5549O982
$$ -20296 -21309 -13220 -9701 -12921 6916 -8381 -37267 -1116 -1036 -13932 -16078 -31627 -24645
13968b4645m832j8071j1240k972M236K0665o438M0772j2347l2463l8725j057J2894
$$ -24645 -29477 -47548 -58788 -61760 -57524 -36859 -43297 -2525 -14872 -47335 -86060 -87117 -74223
13955g4223J6591m559l0852M6705M5829j986l0955L4310L7603k3299L5118J0973
$$ -74223 -57632 -62191 -93043 -46338 -509 -2495 -33450 860 38463 15164 50282 61255
13943F1255o0253k5682j7259J4057L8293M13m5667l0112J6409M291k4520K2125
$$ 61255 1002 -24680 -41939 -27882 10411 10824 -34843 -64955 -48546 -44255 -68775 -46650
13931d6650J2995K5748M2058j1086P821r322N000J5961K366m1785J6710L018o071
$$ -46650 -33655 -7907 34151 23065 30886 21564 26564 42525 44891 3106 19816 22834 16763
13918A6763J5436K5874L822L0573J4445k9381q0692k0361M2950k765J5868K902
$$ 16763 32199 58073 61895 92468 106913 77532 -3160 -23521 19429 16664 32532 35434
13906C5434j3873l3430j3328J6981k1140P721L4812J372k6497m1864j2500K1419
$$ 35434 21561 -11869 -25197 -8216 -29356 -21635 13177 14549 -11948 -53812 -66312 -44893
13894d4893J9096J0072K069m0005k1643K7022L4102K2883m088n6175l431K4393
$$ -44893 -25797 -15725 -13656 -53661 -75304 -48282 -14180 8703 4615 -51560 -54991 -30598
13882c0598j9730K9783J3005j4477l2223n044r833m0042L694P0206J9974K993
$$ -30598 -50328 -20545 -7540 -22017 -54240 -59284 -69117 -109159 -105465 -35259 -15285 -12292
13870a2292L4136N5389M4809J0640J830k4078m9514n8576k5094J0762J6689L9727
$$ -12292 21844 77233 122042 132682 134512 110434 60920 2344 -22750 -11988 4701 44428
13858D4428j6365l5352m1723R025o663j1406L714j9830O6334M1535k5510L4982
$$ 44428 28063 -7289 -49012 -39987 -46650 -58056 -54342 -74172 -7838 33697 8187 43169
13846D3169j5036l9423J335O767m3606k559J7150K5273K900K9322J2480l308j6886
$$ 43169 28133 -11290 -9955 -3188 -46794 -49353 -32203 -6930 -4030 25292 37772 34464 17578
13833A7578j4407K3263K629r297k1670J829O6249L2488j0459j9807j3650o4326
$$ 17578 3171 26434 29063 19766 -1904 -75 66174 98662 88203 68396 54746 -9580
13821i580J1525l0407K1779j507p79O967O446P191m329Q813M057L2332j1308K56
$$ -9580 1945 -28462 -6683 -8190 -8969 -2002 4444 11635 7306 16119 20176 52508 41200 41456
13807D1456L1534k1448j1460n3128o555k265K2658R099j5811M2151Q84p2327n126
$$ 41456 72990 51542 40082 -13046 -19601 -21866 792 9891 -5920 36231 37115 -35212 -40338
13794d0338j7305J2482K4340J6465k0359J2325K6626K4681K558k896l1409o807
$$ -40338 -57643 -45161 -20821 -4356 -24715 -12390 14236 38917 41475 38579 7170 363
13782C63N741R289m0105k4778K0514N7524K5402n3616k8740M4993K3536R98J6932
$$ 363 6104 15393 -24712 -49490 -28976 28548 53950 334 -28406 16587 40123 41121 58053
13769E8053M6454J0492k473r040m8904j2048K0545Q990M0157J6549k0917l3645
$$ 58053 104507 114999 112526 103486 54582 42534 63079 72069 112226 128775 107858 74213
13757G4213j281K0050L8307K7087K8567N6599J60859K29547J92727K5299j44077
$$ 74213 72932 92982 131289 158376 186943 243542 404401 633948 826675 851974 707897
13746G07897j85871j27921q7644q0501l7556l7695l6962J0074o597m2882n8568
$$ 707897 522026 394105 306461 225960 188404 150709 113747 123821 117224 74342 15774
13735A5774J3919J5813P80Q4j6945k3419K737M350k0488J4582L2480K1385M941
$$ 15774 29693 45506 46286 46370 29425 6006 8743 13093 -7395 7187 39667 61052 65993
13722F5993j7200j9777N5790J7902m8974l7685R111J9479L3104N3929N9753M2190
$$ 65993 48793 29016 84806 102708 53734 16049 25160 44639 77743 131672 191425 233615
13710B33615O3336J06667J51957K19530L25753N16589O65060L49340k51670o43811
$$ 233615 296951 403618 555575 775105 1100858 1617447 2282507 2631847 2380177 1736366
13700A736366n16507l49831k57465j76691j33760p1950k4075j9383K9541m8924
$$ 1736366 1219859 870028 612563 435872 302112 230162 206087 186704 216245 167321
13690A67321j5948n567o3333o747k8464l0720j8224o600N887J2415L887J3074
$$ 167321 151373 145806 82473 75726 47262 16542 -1682 -8282 -2395 10020 13907 26981
13678B6981K1066q812j3581j1049R708J7626K2180Q63M852L7604O3028L0774L8152
$$ 26981 48047 39235 25654 14605 24313 41939 64119 64982 69834 107438 170466 201240 239392
13665B39392L1795P7339J48466K07466K93697N18413O77291M86938j47832n68448
$$ 239392 271187 348526 496992 704458 998155 1516568 2193859 2680797 2532965 1964517
13655A964517o17708m34877k86979j91411q5296l0535o4516m6991l6005r167l859
$$ 1964517 1346809 911932 624953 433542 348246 317711 253195 206204 170199 161032 157173
13644A57173o3548m4006q666Q606N7181L8752n8288o1780L3458j888k9592M547
$$ 157173 93625 49619 40953 49559 106740 145492 87204 25424 58882 56994 27402 31949
13632C1949L3767j6757k76L688q860k4936K0613M0628j5481j1059K8297N6083
$$ 31949 65716 48959 48683 52371 43511 18575 39188 79816 64335 53276 81573 137656
13620A37656K5445J7208L7746L9408R4705J55670K32718J51640l8877j88792j53102
$$ 137656 163101 180309 218055 257463 352168 507838 740556 892196 853319 664527 511425
13609E11425j61319j21302n3321l5663m3758m4427m4810P937K403L261m5553l2792
$$ 511425 350106 228804 175483 139820 96062 51635 6825 14762 17165 20426 -25127 -57919
13597e7919K526m49M807K3409J3933M7365P745l9208r051k568Q173j051L8696
$$ -57919 -55393 -55842 -51035 -27626 -13693 33672 41417 2209 -6842 -9410 -1237 -2288 36408
13584C6408L0076p330k4039n1880j5872k3703K2158M1271N691r262k3730K0131
$$ 36408 66484 59154 35115 -16765 -32637 -56340 -34182 7089 12780 3518 -20212 -81
13572h1N3964L808j4318j6382j0231j3352M0991L100k4742k0533J9997K0813k1057
$$ -81 53883 57691 43373 26991 16760 3408 44399 47499 22757 2224 22221 43034 21977
13559B1977l6627K4530K9809J2659l1544r390J1748J1171j2465K6542O122m2905
$$ 21977 -14650 9880 39689 52348 20804 11414 23162 34333 21868 48410 54532 11627
13547A1627m3203K3155M3930N509j0428M0794J8672k9917J5368p016J3933k0622
$$ 11627 -31576 -8421 35509 41018 30590 71384 90056 60139 75507 68491 82424 61802
13535F1802n3611j7805K9681M1374K2272l1136J2609J9846j7046j9766j3162j7910
$$ 61802 8191 -9614 20067 61441 83713 52577 65186 85032 67986 48220 35058 17148
13523A7148J466K5400K9796m2917m4964L253J359o123M1955l2639K8960K6478
$$ 17148 18614 44014 73810 30893 -14071 -10818 -9459 -15582 26373 -6266 22694 49172
13511D9172m013N368L6359o215l7828m6522L5130k368M20M701m2816J2657J6289
$$ 49172 45159 50527 86886 80671 42843 -3679 31451 29083 29503 34204 -8612 4045 20334
13498B0334k7365J5630k5551p337L2552L1951K729L808l3250j4969M949O502k6238
$$ 20334 -7031 8599 -16952 -24289 8263 40214 42943 46751 13501 -1468 3481 9983 -16255
13485a6255k5208O222K0259O006j2324J1218k4185j4623K0139O5164K5786l6590
$$ -16255 -41463 -35241 -14982 -8976 -21300 -10082 -34267 -48890 -28751 36413 62199 25609
13473B5609m0150P012m51j9793k2607k773L1140M5432j4665O571j6261j5166n225
$$ 25609 -14541 -7529 -7980 -27773 -50380 -53153 -22013 23419 8754 15325 -936 -16102 -21327
13460b1327J7260M605j6245M3633N3809L7577Q934m2874k1347n6512j8488r210
$$ -21327 -4067 538 -15707 27926 81735 119312 128246 85372 64025 7513 -10975 -20185
13448b0185K2046j602k871L595j861j4552k4225J8810P297l192n1963r34K8354
$$ -20185 1861 259 -2612 983 -878 -15430 -39655 -20845 -13548 -16740 -68703 -69637 -41283
13435d1283L2541L3393M2790k2051o8473j4999O501R242L3652K6157k250k9309
$$ -41283 -8742 24651 67441 45390 -23083 -38082 -31581 -22339 11313 37470 35220 5911
13423E911L95k7483l350j9409J3840o459K8135L1722j6494l4456j432j520M816
$$ 5911 6306 -21177 -24527 -43936 -30096 -36555 -8420 23302 6808 -27648 -29080 -30600 -25784
13410b5784K1396j5268j5702K6379L2577L4808J2540l1774l4369m920K545j0393
$$ -25784 -4388 -19656 -35358 -8979 23598 58406 70946 39172 4803 -117 2428 -7965
13398g965m4035j4799M4955N4014l5536j9475J8764J0954N293j2177k9496k760
$$ -7965 -52000 -66799 -21844 32170 -3366 -22841 -4077 6877 12170 -7 -29503 -32263
13386c2263K5941m283K7625J705p239k6203k9700m2148R520M7008L9541Q162l2851
$$ -32263 -6322 -10605 17020 18725 11486 -14717 -44417 -86565 -77045 -30037 9504 17666 -15185
13373a5185K9495L6344J1814p912p253j5521j9133k1289N592k4245j6835k9120
$$ -15185 14310 50654 62468 54556 47303 31782 12649 -8640 -3048 -27293 -44128 -73248
13361g3248K4495Q7103K6375n0865j5112M0445k9791p766k1606k1724K8864N820
$$ -73248 -48753 38350 64725 13860 -1252 39193 9402 1636 -19970 -41694 -12830 -7010
13349g010J5364K4731J0986O753p985K6384q813k3394K0786P698k6723l0366m1273
$$ -7010 8354 33085 44071 50824 42839 69223 60410 37016 57802 65500 38777 8411 -32862
13336c2862N7956q132m1742J4259o936o3659j2040L9033J2394J1259L4073p727
$$ -32862 25094 16962 -24780 -10521 -17457 -81116 -93156 -54123 -41729 -30470 3603 -4124
13324d124r85j7409j2430l1949j6462L212L835J5585K2224J0599N6562m061l1354
$$ -4124 -5109 -22518 -34948 -66897 -83359 -80147 -76312 -60727 -38503 -27904 28658 24597 -6757
13311f757K6559J8613M7985J7778n5460j6640J2189o733K8743k5040m212J5079
$$ -6757 19802 38415 86400 104178 48718 32078 44267 37534 66277 41237 37025 52104
13299E2104J4685k2191l9607n425M156j82r787k8911m908L285L4612R170j7806
$$ 52104 66789 44598 4991 -434 3722 3540 -6247 -35158 -40066 -36781 -2169 7001 -10805
13286a0805R332j4023J8801J6862l1844K4048N578l7240n5431q416L0432J9258
$$ -10805 -1473 -15496 3305 20167 -11677 12371 17949 -19291 -74722 -83138 -52706 -33448
13274c3448k678J2739K3807N696m66j3148J0359j3244l5221K483O3814j740n7407
$$ -33448 -36126 -23387 420 6116 5650 -7498 2861 -10383 -45604 -43121 20693 18953 -38454
13261c8454m8065j3526l0315o872Q2219m222J4082k244j5480J0978M583p615k5226
$$ -38454 -86519 -100045 -130360 -137232 -55013 -59235 -45153 -47397 -62877 -51899 -47316 -54931 -80157
13248h0157m049K0513K2659M3955J5346R716n2197r349K6287O710j1408k0233
$$ -80157 -84206 -63693 -41034 2921 18267 27983 -24214 -33563 -7276 -566 -11974 -32207
13236c2207j8996K771K4204k918L8498L4847J7747j8379l6204k432J1104M7899
$$ -32207 -51203 -48432 -24228 -27146 11352 46199 63946 45567 9363 6931 18035 65934
13224F5934N010j8493o4553J6470N4092K0061l7413k6754Q90j873j8044J6063
$$ 65934 70944 52451 -12102 4368 58460 78521 41108 14354 15244 13371 -4673 11390
13212A1390K2643o00k5108k3045J6595J2288n650n851M9041j6657m7564Q851L94
$$ 11390 34033 33433 8325 -14720 1875 14163 8513 2662 51703 35046 -12518 -3667 -3273
13199c273j0104m356M0926K9916j6044m6491M606K5498J2125j3477l526j3805
$$ -3273 -13377 -17733 23193 53109 37065 -9426 -4820 20678 32803 19326 15800 1995
13187A995L3345K5822p857m1652o3337r691L1722K3720k3353m870L4240J5274
$$ 1995 35340 61162 53305 11653 -51684 -61375 -29653 -5933 -29286 -34156 84 15358
13175A5358j3695M3972j5496l3360j7164j10M413k2899k4958L250j1692J9385
$$ 15358 1663 45635 30139 -3221 -20385 -20495 -16082 -38981 -63939 -60689 -72381 -52996
13163e2996M8641L2541R200k6064l8666m0717p698M3382K0418J9959N601j9328
$$ -52996 -4355 28186 37386 11322 -27344 -68061 -75759 -32377 -11959 8000 13601 -5727
13151e727P726j5366J4800q96j411m103Q000o299j8103l6878K3644J4482j8406
$$ -5727 1999 -13367 1433 537 -874 -4977 3023 -3276 -21379 -58257 -34613 -20131 -38537
13138c8537J6111K098K9667J0402K1022l0920l7092p897L1744N264J447r004l0940
$$ -38537 -22426 -20328 9339 19741 40763 9843 -27249 -35146 -3402 1862 3309 -5695 -36635
13125c6635j3432Q022M0899L5035n1413j0014R278j0303k961r639j4915r479J3599
$$ -36635 -50067 -42045 -1146 33889 -17524 -27538 -18260 -28563 -31524 -41163 -56078 -65557 -51958
13112e1958K8980M6198J7692k6205k7767L8874K8699m3762k4156K0316J4807J5133
$$ -51958 -22978 23220 40912 14707 -13060 25814 54513 10751 -13405 6911 21718 36851
13100C6851j3767l8347n5441m913l251K396K0783M5138K8626K4810O200k383o210
$$ 36851 23084 -15263 -70704 -75617 -78868 -76472 -55689 -10551 18075 42885 49085 46702 40492
13087D0492l2005o3974O401r613L4359J9762J820k7974m3146J323L6795M3513
$$ 40492 8487 -55487 -49086 -58699 -24340 -4578 -2758 -30732 -73878 -72555 -35760 7753
13075G753K4447P81j961K2684J6884o705k3313O112j5596l1676n8842k3933K7026
$$ 7753 32200 32981 31020 53704 70588 63883 40570 46682 31086 -590 -59432 -83365 -56339
13062e6339K575m80J5953n624R240k056k0647M7967K0288N310n713l747q68Q55
$$ -56339 -53764 -54244 -38291 -43915 -34675 -36731 -57378 -9411 10877 16187 10474 6727 5859 6714
13048F714j8863n461k4271j87J2262Q203L9452K4418n901j8053K7260l357Q770
$$ 6714 -12149 -17610 -41881 -42068 -29806 -21603 17849 42267 36366 18313 45573 42216 50986
13035E0986L5k7471k6632k142J8565O83l1963l4965j6711L3805M9893L9650l1311
$$ 50986 51021 23550 -3082 -5224 13341 14024 -17939 -52904 -69615 -35810 14083 53733 22422
13022B2422m2944J2420k4049m8709o4221O171Q8986N1845n224m5039L9381J9007
$$ 22422 -20522 -8102 -32151 -80860 -145081 -138910 -49924 1921 -3303 -48342 -8961 10046
13010A0046m4102J9678J2715n3650K001L7493J3985j6638j319l1341J9138J0976
$$ 10046 -34056 -14378 -1663 -55313 -53312 -15819 -1834 -18472 -19791 -51132 -31994 -21018
12998b1018l1782l9791Q50J6048p004J2467P232M0801M6538j2068l6045J9476
$$ -21018 -52800 -92591 -91741 -75693 -82697 -70230 -62998 -22197 24341 12273 -23772 -4296
12986d296m598j3637K4280j9647J6301j9592j7337M2629L8719J6742p063k8496
$$ -4296 -8894 -22531 1749 -17898 -1597 -21189 -38526 4103 42822 59564 52501 24005
12974B4005N62k987l7283j2354J3579K6502L0780K1054J6031l7182k0820N366
$$ 24005 24567 21580 -15703 -28057 -14478 12024 42804 63858 79889 42707 21887 27253
12962B7253k625m356P464J83J5599l7526l5621q981p299K3694m5616O802k2191
$$ 27253 24628 20272 27736 27919 43518 5992 -29629 -38610 -45909 -22215 -67831 -61029 -83220
12949h3220l7453q872P4736P0319M4844l5677j8513j9550K0964j637k0990j0929
$$ -83220 -120673 -129545 -54809 15510 60354 24677 6164 -13386 7578 5941 -15049 -25978
12937b5978j9055K7162m053j0139m312j412r69L1268j5090l383O6150K4935n7196
$$ -25978 -45033 -17871 -21924 -32063 -36375 -37787 -38756 -7488 -22578 -25961 40189 65124 7928
12924G928L078R05l8134L830O708L3450M482J6088j4931m7580j8276j274K8206
$$ 7928 11006 11911 -26223 -22393 -15685 17765 22247 38335 23404 -24176 -42452 -43726 -15520
12911a5520q50O0627N4333k7023q2037l2597j2820L1901K7754M1170m0005k0886
$$ -15520 -16370 44257 98590 71567 -10470 -43067 -55887 -23986 3768 44938 4933 -15953
12899a5953l4476p039L1444k4643P937L5336K9204j2333k1443L8247P478r488
$$ -15953 -50429 -57468 -26024 -50667 -42730 -7394 21810 9477 -11966 26281 33759 24271
12887B4271J6179k1813Q386j4169j5925k8490j2824J8880p583J6012k4847J791
$$ 24271 40450 18637 27023 12854 -3071 -31561 -44385 -25505 -33088 -17076 -41923 -40132
12875d0132K4621J5477R999N976l7101m2227L163J7860K7591N1223k7532n128
$$ -40132 -15511 -34 9965 15941 -21160 -63387 -60224 -42364 -14773 36450 8918 3790
12863C790k2711m4205J5334L5336K995j355J8231k0625k4981j062K2248L0673
$$ 3790 -18921 -63126 -47792 -12456 -9461 -10816 7415 -13210 -38191 -39253 -17005 13668
12851A3668K8719J5706j3763l0185M0876L9792k1922o5601K547k4831p875n456
$$ 13668 42387 58093 44330 14145 55021 94813 72891 7290 9837 -14994 -22869 -28325
12839b8325N0931O3977j3716p375m3612k9930k6816O33K7697J0428R741P835k71
$$ -28325 22606 86583 72867 65492 21880 -8050 -34866 -34233 -6536 3892 13633 21468 21197
12826B1197m302k18m5905N810L0346R618J0254J6376L808m920k9429P717l6088
$$ 21197 16895 16677 -29228 -23418 6928 16546 26800 43176 46984 42064 12635 20352 -15736
12813a5736n0372L798l149L7699M2208j484r019j028k49j0974j1223k6224J1624
$$ -15736 -66108 -62310 -65459 -27760 14448 12964 3945 2917 2668 -8306 -19529 -45753 -34129
12800c4129J6642k4643k8862J1296J4811M1068O5447L3064j5758m2501p08L0976
$$ -34129 -17487 -42130 -70992 -59696 -44885 -3817 61630 94694 78936 36435 35727 66703
12788F6703K7402l8586j7161j2305l103K2977j4736k5040l7762L694R659M5074
$$ 66703 94105 55519 38358 26053 22950 45927 31191 6151 -31611 -27917 -18258 26816
12776B6816o28k4859k4018M459l446K4074L4850J6549j7805l4661j2860J2944
$$ 26816 26188 1329 -22689 -18230 -21676 2398 37248 53797 35992 1331 -11529 1415
12764A415k4575K025K1691K3685l157p843K11j0328q040K4669J6658r989k3979
$$ 1415 -23160 -21135 556 24241 21084 13241 13452 3124 -4916 19753 36411 26422 2443
12751B443m5189j860M5633K6327r136k3328J3405Q302n142n6153q390M4388j4785
$$ 2443 -42746 -44606 1027 27354 18218 -5110 8295 16597 11455 -44698 -53088 -8700 -23485
12738b3485J6022J666M631K9300J2992k4196r690R601l5112k473L2196N9375m611
$$ -23485 -7463 -5797 -1166 28134 41126 16930 7240 16841 -18271 -20744 11452 70827 66216
12725F6216n6895k3475J7495L8606K1590j2582n754J8116j012m9181j1159j2950
$$ 66216 9321 -14154 3341 41947 63537 50955 45201 63317 62305 13124 1965 -10985
12713a0985J7483o587j5036k2758k68j1022M4000K5565K214k0271j361K0704j9078
$$ -10985 6498 -89 -15125 -37883 -38151 -49173 -5173 20392 22606 2335 974 21678 2600
12700B600l2135J9318K1930L1813K7112L35m7376p3739o3949O100Q906O0910j5214
$$ 2600 -29535 -10217 11713 43526 70638 70973 23597 -50142 -114091 -107991 -99085 -38175 -53389
12687e3389K5123L9162P735K9707J7968j8871k3989o005J2863n495j0850R353
$$ -53389 -28266 10896 18631 48338 66306 47435 23446 17441 30304 24809 13959 23312
12675B3312m262j6811K9068Q927l3783l7433j2878l155N2461N695R76R777k1104
$$ 23312 19050 2239 31307 40234 6451 -30982 -43860 -47015 5446 11141 12117 21894 790
12662G90K0968j1590J13k2033k8633j7768k0429K512j639N866K3952p639J4528
$$ 790 21758 10168 10281 -11752 -40385 -58153 -78582 -76070 -77709 -71843 -47891 -55530 -41002
12649d1002J7558M847N170m41l0481N117K7896N590J4064L5017j6984j4243j2207
$$ -41002 -23444 -18597 -13427 -13868 -44349 -39232 -11336 -5746 8318 43335 26351 12108 -99
12636i9m5092l4932K7778L7144J9884o460k969j1072k3701L3966J2882P039j4224
$$ -99 -45191 -80123 -52345 -15201 4683 -1777 -4746 -15818 -39519 -5553 7329 14368 144
12623A44K3739j3559K566l4133n024j1727J1219n856k9066K4414K8053R979J8960
$$ 144 23883 10324 12890 -21243 -26267 -37994 -26775 -32631 -61697 -37283 -9230 749 19709
12610A9709J0049K1164k6695m1429k1214j0350N353j2313M97J2214K600J7583
$$ 19709 29758 50922 24227 -17202 -38416 -48766 -43413 -55726 -55229 -43015 -40415 -22832
12598b2832J5848M2287L2071J9000k5372l6912k9183m5563K2578O0588L2512j1422
$$ -22832 -6984 35303 67374 86374 61002 24090 -5093 -50656 -28078 32510 65022 53600
12586E3600l4034k316l2423p250N437K0436M4611L2844K7369k3327o4145j6327
$$ 53600 19566 17250 -15173 -22423 -16986 3450 48061 80905 108274 84947 20802 4475
12574D475j3753K5783P115p3731k3833N1323K2026K247K1525M6469j7758k3451
$$ 4475 -9278 16505 23620 -50111 -73944 -22621 -595 1652 23177 69646 51888 28437
12562B8437k6715j2540M149N058J0692J4652N900m707J0478J2356k5072K7368
$$ 28437 1722 -10818 -6669 -1611 9081 23733 29633 24926 35404 47760 22688 50056
12550E0056L8004k8062k2960j8288l7264j3754J3851j4870P90o079m2361q653
$$ 50056 88060 59998 37038 18750 -18514 -32268 -18417 -33287 -32497 -38576 -80937 -89590
12538h9590M794L1464k762J9788K7398J5716l2347M813J3938J4668O618r357j2682
$$ -89590 -84796 -53332 -56094 -36306 -8908 6808 -25539 -20726 -6788 7880 14498 5141 -7541
12525g541J9815L3412K6154K8137j2542l6167j88j0856j9026k315l9160J460R810
$$ -7541 12274 45686 71840 99977 87435 51268 51080 40224 21198 18883 -20277 -18817 -9007
12512i007j666m357j7919o609R089k4522J0593J8469J4383J8947j4556L7882L7958
$$ -9007 -10673 -15030 -32949 -39558 -30469 -54991 -44398 -25929 -11546 7401 -7155 30727 68685
12499F8685j2067l0754l2639m9651j3213M671K4716K6823l5975j7289K3059J4758
$$ 68685 56618 25864 -6775 -56426 -69639 -64968 -40252 -13429 -49404 -66693 -43634 -28876
12487b8876K8015P756k81l5202K621K3511J8662r724N718N1580K2711r904m7756
$$ -28876 -861 6895 6614 -28588 -25967 -2456 16206 6482 12200 63780 86491 76587 28831
12474B8831l8180K5147J4831l9815J3793L6661J1234o439p666k514K2719l41m5966
$$ 28831 -9349 15798 30629 -9186 4607 41268 52502 46063 38397 35883 58602 58261 12295
12461A2295l1625L0551k893Q770N7018k79m4197p112j2499k080k447o768J2009
$$ 12295 -19330 11221 8328 17098 74116 73837 29640 22528 10029 7949 5502 -1266 10743
12448A0743K976R564m101J8957l7521o471J3378j7788K3037K6149J9355j4332
$$ 10743 13719 23283 19182 38139 618 -5853 7525 -10263 12774 38923 58278 43946
12436D3946l3785R758J532p623q561j4969J0790j9288p559J9257q649K0853J4502
$$ 43946 10161 19919 21451 13828 5267 -9702 1088 -18200 -25759 -6502 -15151 5702 20204
12423B0204R947j4832O280J7593o571l4318J0928M941l278L6315J916j3485k0540
$$ 20204 30151 15319 21599 39192 32621 -1697 9231 14172 10894 47209 49125 35640 15100
12410A5100j4003K8880k8955j2487p430J6370Q586R589J1197L660O072l597n3099
$$ 15100 1097 29977 1022 -11465 -18895 -2525 6061 15650 26847 30507 36579 32982 -20117
12397b0117j1450K1571j5504l4821K155K1771M3761K2778J638m627J445l8212
$$ -20117 -31567 -9996 -25500 -60321 -58166 -36395 7366 30144 31782 27155 28600 -9612
12385i612j1353R957K9040j3495M6002Q762q1005n2815R557N090j1617k9782J3452
$$ -9612 -20965 -11008 18032 4537 50539 59301 -21704 -74519 -64962 -59872 -71489 -101271 -87819
12372h7819K4974n89J7090L3128N885N916J0540L2722L6902m0787k0308J337j9694
$$ -87819 -62845 -63434 -46344 -13216 -7331 -1415 9125 41847 78749 37962 17654 18991 -703
12359g03J288k0638q463O457J0531p112r270k517K4227k0349N648L1752K9034
$$ -703 585 -20053 -28516 -22059 -11528 -18640 -27910 -30427 -6200 -26549 -20901 10851 39885
12346C9885K3337k0682k8694M660R644L2553K0117m0478j2429m66j6847K4004
$$ 39885 63222 42540 13846 18506 28150 60703 80820 40342 27913 27447 10600 34604
12334C4604N0432j5002l3542j6238J2086R724R392j0082N076L6261k9991r217
$$ 34604 85036 70034 36492 20254 32340 42064 51456 41374 46450 82711 52720 43503
12322D3503l6691J0440J9409j1212o121m1247m672L0875N774J5968R831o827l2373
$$ 43503 6812 17252 36661 25449 19328 -21919 -26591 4284 10058 26026 35857 29030 -3343
12309c343J3695l2869m7133J9534K2754n240k6479q753N4274K6345j7187j6568
$$ -3343 10352 -22517 -69650 -50116 -27362 -32602 -59081 -67834 -13560 12785 -4402 -20970
12297b0970j0227K2427Q150j7648p587r496J5576q461k322M03k1858L1266P2007
$$ -20970 -31197 -8770 -620 -18268 -25855 -35351 -19775 -28236 -30558 -30155 -52013 -20747 51260
12284E1260K3883j2756m6867K07k7730l9894J4566J1133J957j8048K9655M1828
$$ 51260 75143 62387 15520 15727 -12003 -51897 -37331 -26198 -24241 -42289 -12634 29194
12272B9194J045k914j2382M358O441r595N954j2314j7967J2221L931n763Q332
$$ 29194 30239 27325 14943 19301 25742 16147 22101 9787 -8180 4041 7972 2209 10541
12259A0541n098r362k0927q330L4085K7695K9978k9547N127O806p157j8007p110
$$ 10541 5443 -3919 -24846 -33176 909 28604 58582 29035 34162 40968 33811 15804 8694
12246H694l119l696J0627p132k3889k0167Q034L6359K8647J9489q883j4970k9397
$$ 8694 5575 1879 12506 5374 -18515 -38682 -30648 5711 34358 53847 44964 29994 597
12233E97J9904o322q937k8598l6947L2084R762l32n712K6955p391k9171l432o30
$$ 597 20501 14179 5242 -23356 -60303 -28219 -18457 -18789 -24501 2454 -4937 -34108 -37540 -38170
12219c8170L3702J1559j6864J1470P537K8332j4597j7604k6073J6394n303M464
$$ -38170 -4468 7091 -9773 1697 9234 37566 22969 5365 -20708 -4314 -9617 -5153
12207e153k7869j4700O432k9957k6751j2201L0608J0599Q242M8267N4073J7912
$$ -5153 -33022 -47722 -41290 -71247 -97998 -110199 -79591 -68992 -60750 -12483 41590 59502
12195E9502p0532m7282O333j66k979j4184Q566k5138L7180L3991K2953R100n943
$$ 59502 -11030 -58312 -51979 -52145 -55124 -69308 -60742 -85880 -48700 -14709 8244 17344 11401
12182A1401O227j4760j3144L0549J3852K851N269N226L83n1325k6098K2439O440
$$ 11401 17628 2868 -10276 20273 34125 36976 42245 47471 47854 -3471 -29569 -7130 -690
12169f90j6092K7200L2505l093k0822r192K2679J9545M23K713n555L854n5749
$$ -690 -16782 10418 42923 39830 19008 9816 32495 52040 52463 55176 49621 53475 -2274
12156b274l3206K625J4613J2468l727J5006R478L744L1706L7423m160m2353l6526
$$ -2274 -35480 -32855 -18242 -5774 -9501 5505 14983 18727 50433 87856 83696 41343 4817
12143D817L16J9359K0175j4562m0383k8908M8290l936m3251j368M8793O3703o0594
$$ 4817 5133 24492 44667 30105 -10278 -39186 9104 5168 -38083 -39451 9342 73045 12451
12130A2451k4294o689J0014K9075j3768n408l1587j0923L8803K8396O532l1335
$$ 12451 -11843 -18532 -8518 20557 6789 1381 -30206 -41129 -2326 26070 32602 1267
12118A267j6911l034k0493M2100J4586Q894n1225J8711K1653L3939n66J366k2999
$$ 1267 -15644 -18678 -39171 2929 17515 26409 -24816 -6105 15548 49487 48921 50287 27288
12105B7288l6048j8396q828J6372K2921q17j6077j852K1160Q941K1995J2649k861
$$ 27288 -8760 -27156 -35984 -19612 3309 2492 -13585 -15437 5723 14664 36659 49308 46447
12092D6447J362N802Pq297J0264L2o197k1125l2095j2041L9089P270L547k4453
$$ 46447 47809 53611 53618 45321 55585 55617 49420 28295 -3800 -15841 23248 30518 34065 9612
12078I612k7744J168M461r643p977j6628j0946L710N9728K2608k6824m965k0077
$$ 9612 -18132 -16964 -12503 -22146 -30123 -46751 -57697 -53987 5741 28349 1525 -3440 -23517
12065b3517L0979M8331J2953l0673j2912L4784R760m0220L0449L5755J4431o633
$$ -23517 7462 55793 68746 38073 25161 59945 69705 29485 59934 95689 110120 103487
12053A03487n9831J0148J514K6547L3026j4607l5503o1884j9069J3677L3141K1485
$$ 103487 43656 53804 55318 81865 114891 100284 64781 2897 -16172 -2495 30646 52131
12041E2131o68j3483K5088o96k7398J950l2908k2742j242K512J396L64l0934o630
$$ 52131 51463 37980 63068 62372 34974 36924 4016 -18726 -19968 -17456 -16060 -15696 -46630 -53260
12027e3260N0795K259j6462k29J7877J1564k3169M017J708J2444l1198R648j2776
$$ -53260 -2465 -206 -16668 -16897 980 12544 -10625 -6608 -4900 7544 -23654 -14006 -26782
12014b6782J3064j003o1n694l84J7282P4185N8759j6698k8465n3996j0492n0854
$$ -26782 -13718 -14721 -14782 -20476 -20860 -3578 70607 129366 112668 84203 30207 19715 -31139
12001c1139j2512J0470J2104J7491m6824L0587K833J1454n679j4494N59Q749J900
$$ -31139 -43651 -33181 -21077 -3586 -50410 -19823 -16990 -5536 -11215 -25709 -25150 -16401 -14501
11988a4501r225L456k7171j9417j9378L8380L5059K0181K0207O977M0289K0318
$$ -14501 -23726 -20270 -47441 -66858 -86236 -47856 -12797 7384 27591 34568 74857 95175
11976I5175k6624k6529P354k8890l5566L1197J641J6394k640j3070m2909l0698
$$ 95175 68551 42022 49376 20486 -15080 16117 17758 34152 31512 18442 -24467 -55165
11964e5165K8619K4210R164J6233J9210K312L353M788K3420k367m7308j5518j8322
$$ -55165 -26546 -2336 6828 23061 42271 44583 47936 52724 76144 73777 26469 10951 -7371
11951g371q939K2940J2662j3070N1967K1707j4005m5223k3536M0992Q291n0001
$$ -7371 -16310 6630 19292 6222 58189 79896 65891 20668 -2868 38124 46415 -3586
11939c586n777J3251J5824L212m1450n985R96m957k5695o14M7637L2731p729k3710
$$ -3586 -9363 3888 19712 22924 -18526 -24511 -23515 -28472 -54167 -54781 -7144 25587 17858 -5852
11925e852J4229Q216k5619o4033K733L0118k0484R972O0989P828J2689J4020K9126
$$ -5852 8377 16593 -9026 -73059 -70326 -40208 -60692 -50720 10269 18097 30786 44806 73932
11912G3932j0888k4140l1598Q328l4265p6209j764K0440J4478M5664K9951L813
$$ 73932 63044 38904 7306 15634 -18631 -94840 -96604 -76164 -61686 -16022 13929 17742
11900A7742P30R434J335o084Q875K0522j2838k7168j4600n895r509R641M3212
$$ 17742 18472 27906 29241 23157 32032 52554 39716 12548 -2052 -7947 -17456 -7815 35397
11887C5397J1434n291l9265j9313j1456P819j3487j5976J4560J4219K1854L7001
$$ 35397 46831 41540 2275 -17038 -28494 -20675 -34162 -50138 -35578 -21359 495 37496
11875C7496J046m8988k5775K6136O74J1494K2438J0848j7853l9050K5758j1412
$$ 37496 38542 -10446 -36221 -10085 -9411 2083 24521 35369 17516 -21534 4224 -7188
11863g188ML8516N6206l0833q3615l0835L1303K4190J8911q713k3445Q859o051
$$ -7188 -7184 31332 87538 56705 -26910 -57745 -26442 -2252 16659 7946 -15499 -6640 -12691
11850a2691J5311J355m0223J9218M4000M480k7754K323j2289m5499J9977M9673
$$ -12691 2620 3975 -36248 -17030 26970 31450 3696 6019 -6270 -51769 -31792 17881
11838A7881J8232j4209J143r65o555p916j6037O087l553O442J8457m6109j8584
$$ 17881 36113 21904 23047 22082 15527 7611 -8426 -2339 -5892 550 19007 -27102 -45686
11825d5686K6396K2038k145L2641K7497l5505J51M0563K3369N958k0273k5980
$$ -45686 -19290 2748 603 33244 60741 25236 25387 65950 89319 95277 75004 49024
11813D9024n8213m4116J0542r69K6752r908L3003m883k5387J3266M953K7808K4589
$$ 49024 -9189 -53305 -42763 -43732 -16980 -26888 6115 1232 -24155 -10889 -5936 21872 46461
11800D6461m26k3190o770l0095R409l1594m3531k044L0332L8465j1459J9991q795
$$ 46461 46035 22845 16075 -14020 -4611 -36205 -79736 -81780 -51448 -12983 -24442 -4451 -13246
11787a3246m4356j3693O161L8482p368N343m409L9260j8031k7369k1507J7462
$$ -13246 -57602 -71295 -65134 -26652 -34020 -28677 -33086 6174 -11857 -39226 -60733 -43271
11775d3271L4941k33l33j4765k4690k8091J2354L5280R123M7988R416k3184L441
$$ -43271 -8330 -8563 -8896 -23661 -48351 -76442 -64088 -28808 -19685 28303 37719 14535 17976
11762A7976m540J2603k7676R390O0787J4942o6992n013N9105J1021m7293l5521
$$ 17976 13436 26039 -1637 7753 68540 83482 16490 11477 70582 81603 34310 -1211
11750a211m791K2593k750J503M1608J9732k7960l9252j222K5448j4662j3456J7792
$$ -1211 -6002 16591 13841 15344 56952 76684 48724 9472 8250 33698 19036 5580 23372
11737B3372j0663j4752L6953L2629n422k6344k9178k9167m9348K8420j6941J2963
$$ 23372 12709 -2043 34910 67539 62117 35773 6595 -22572 -71920 -43500 -60441 -47478
11725d7478K8378N0599k742J7190J4371k3902P334J0322j8754k4200j3251J361
$$ -47478 -19100 31499 28757 45947 60318 36416 43750 54072 35318 11118 -2133 -772
11713g72m816m82j9750o500M4568J6045K8470K2862l6717q160J133o360k6359
$$ -772 -5588 -6070 -25820 -32320 12248 28293 56763 79625 42908 34748 35881 29521 3162
11700C162j2829J7882L4837J6547l6049n598o957j9371J1050p678J0439j8406
$$ 3162 -9667 8215 43052 59599 23550 17952 10995 -8376 2674 -5004 5435 -12971
11688a2971l8079P714J1011J0109K411J2633L3l909P776O148N963O869K9225J1652
$$ -12971 -51050 -43336 -32325 -22216 -19805 -7172 -7139 -11048 -3272 2876 8839 15708 44933 56585
11674E6585N24o942q649Q038J1126O377n279j2720l0589k1368j8482k653j9107
$$ 56585 57109 50167 41518 49556 60682 67059 61780 49060 18471 -2897 -21379 -24032 -43139
11661d3139J8754K3845k7472K159L788J0873j4851k6556J7753L8420J7924J4532
$$ -43139 -24385 -540 -28012 -25853 -22065 -11192 -26043 -52599 -34846 3574 21498 36030
11649C6030n181J0306L224m2658m744R97k9122K0865q95m7377K355J602k316R693
$$ 36030 30849 41155 44379 1721 -3023 -2026 -31148 -10283 -11178 -58555 -56200 -54598 -56914 -47221
11635d7221k7213R334K0720J320K4162N814K0120L5935p395K9274k8260J6087
$$ -47221 -74434 -65100 -44380 -43060 -18898 -13084 7036 42971 35576 64850 36590 52677
11623E2677J3549l6355k4282j0538n2550K3903O480q460N80N823J5493K9236j0531
$$ 52677 66226 29871 5589 -4949 -57499 -33596 -27116 -35576 -34996 -29173 -13680 15556 5025
11610E025j084l335k8116j5431j1075K8769R514m4787O048k302l6771K298L4232
$$ 5025 3941 606 -27510 -42941 -54016 -25247 -15733 -60520 -54472 -56774 -93545 -91247 -57015
11597e7015J6906J608k0139L5576Q655J563J3900j7986q707M276l417J4393j5887
$$ -57015 -40109 -38501 -58640 -23064 -14409 -12846 1054 -16932 -25639 -21363 -24780 -10387 -26274
11584b6274l4569O715M7242J0760J0257j1156l3084j4441j4388J2776K379J8362
$$ -26274 -60843 -54128 -6886 3874 14131 2975 -30109 -44550 -58938 -46162 -43783 -25421
11572b5421K5313M2191M081K4163l8814l4714J5195k805J9298k059K5444K4915
$$ -25421 -108 42083 46164 70327 31513 -3201 11994 9189 28487 26428 51872 76787
11560G6787k2095m7089J2106k8044L036J3951j8694J9026J617k9205k5113L3446
$$ 76787 54692 7603 19709 -8335 -5299 8652 -10042 8984 10601 -18604 -43717 -10271
11548a0271L6547n999q360j4957J9550j5022l921M166M2780j1275k2707k8142
$$ -10271 26276 20277 11917 -3040 16510 1488 -2433 1733 44513 33238 10531 -17611
11536a7611j5400k2218L1011P015Q095J0365j0055j8517K4358k8715o0636r045
$$ -17611 -33011 -55229 -24218 -17203 -9108 1257 -8798 -27315 -2957 -31672 -92308 -101353
11524a01353N3908N4241L2117P055k665m4917l3586K8811q761L808K6993M0361
$$ -101353 -47445 6796 38913 45968 43303 -1614 -35200 -6389 -15150 -11342 15651 56012
11512E6012J7208R076R351k9252l7730q679J0352P699k376j5063J2910J2958n4198
$$ 56012 73220 82296 91647 62395 24665 15986 26338 34037 31661 16598 29508 42466 -11732
11499a1732M037L0204o6305m7510K2912K2889M4911o800j6720m618k4513J9868
$$ -11732 -7695 22509 -43796 -91306 -68394 -45505 -594 -7394 -24114 -28732 -53245 -33377
11487c3377n239J9917k745k1172Q873k092J0649p584K6655K2880K572k2626m3740
$$ -33377 -38616 -18699 -21444 -42616 -33743 -35835 -25186 -32770 -6115 16765 19337 -3289 -47029
11474d7029J3111J1990K538j2392L91q898k885m339N4095J4120j4727M2071j3781
$$ -47029 -33918 -21928 -19390 -31782 -31391 -40289 -43174 -47513 6582 20702 5975 48046 34265
11461C4265l655j2748k4269J2451K62K4125M611J1840j3916n3782q025M0096J3139
$$ 34265 30610 17862 -6407 6044 6306 30431 35042 46882 32966 -20816 -28841 11255 24394
$$ [...]
##END NTUPLES=NMR SPECTRUM
##END=
