##TITLE=Analysis number 314105
Compound Code cc 34946
Book Reference 441/155
Project Code adrs
Chemist Name colinb
##JCAMPDX= 6.0         $$ Bruker NMR JCAMP-DX V2.0
##DATA TYPE= NMR SPECTRUM
##DATA CLASS= NTUPLES
##ORIGIN= Bruker BioSpin GmbH
##OWNER= NMR
$$ XWIN-NMR		Version 3.5
$$ Wed Oct  5 17:00:11 2005 GMT Daylight Time (UT+1h)  MAYBRIDGE\NMR@NMR_250MHZ
##.OBSERVE FREQUENCY= 250.131544655141
##.OBSERVE NUCLEUS= ^1H
##.ACQUISITION MODE= SIMULTANEOUS (DQD)
##.ACQUISITION SCHEME= undefined
##.AVERAGES= 16
##.DIGITISER RES= 18
##SPECTROMETER/DATA SYSTEM= dpx250
##.PULSE SEQUENCE= zg30
##.SOLVENT NAME= CDCl3
##.SHIFT REFERENCE= (INTERNAL, CDCl3, 0, 16.522)
##AUDIT TRAIL= $$ (NUMBER, WHEN, WHO, WHERE, WHAT)
$$ ##TITLE= Audit trail, XWIN-NMR		Version 3.5
$$ ##JCAMPDX= 5.01
$$ ##ORIGIN= Bruker BioSpin GmbH
$$ ##OWNER= NMR
$$ C:\u/data/dgb/nmr/ADRS/10520/pdata/1/auditp.txt
$$ ##AUDIT TRAIL=  $$ (NUMBER, WHEN, WHO, WHERE, WHAT)
(   1,<2005-10-05 16:59:52.40 +100>,<MAYBRIDGE\NMR>,<NMR_250MHZ>,
      <created by zg, POWCHK disabled, PULCHK disabled
       configuration hash MD5:
       62 19 C7 07 E1 42 D1 B7 37 6C 3D D0 77 39 F9 E6
       data hash MD5: 64K
       B9 30 12 03 AF 7F E0 CB FC 86 EF 37 B7 06 DC BC>)
(   2,<2005-10-05 17:00:03.87 +100>,<MAYBRIDGE\NMR>,<NMR_250MHZ>,
      <Start of raw data processing
       ef LB = 0.3 FT_mod = 6 PKNL = 1 SI = 32K 
       data hash MD5: 32K
       A7 B6 55 B6 18 8B 20 C0 EE 27 A6 31 4B 9D 74 81>)
(   3,<2005-10-05 17:00:05.54 +100>,<MAYBRIDGE\NMR>,<NMR_250MHZ>,
      <apk 
       data hash MD5: 32K
       42 50 69 CD E4 F4 D8 13 38 09 B3 9F 53 28 1F 8E>)
(   4,<2005-10-05 17:00:06.21 +100>,<MAYBRIDGE\NMR>,<NMR_250MHZ>,
      <abs ABSG = 5 
       data hash MD5: 32K
       83 DF 64 44 E7 F5 3C FD 6D 93 74 2A 17 6F 9D 39>)
$$ ##END=
$$ 
$$ hash MD5
$$ BB 3D A5 1B 78 C5 3B 8F 3D 05 B7 47 D9 F1 7C C2
##$RELAX= 
##$RELAX= 
##$RELAX= 
##$RELAX= 
##$RELAX= 
##$RELAX= 
##$RELAX= 
$$ Bruker specific parameters
$$ --------------------------
##$DU= <C:\u>
##$EXPNO= 10520
##$NAME= <ADRS>
##$PROCNO= 1
##$TYPE= <nmr>
##$USER= <dgb>
##$AMP= (0..31)
100 100 100 100 100 100 100 100 100 100 100 100 100 100 100 100 100 100 
100 100 100 100 100 100 100 100 100 100 100 100 100 100 
##$AQSEQ= 0
##$AQ_mod= 3
##$AUNM= <au_zg>
##$AUTOPOS= <58 >
##$BF1= 250.13
##$BF2= 250.13
##$BF3= 250.13
##$BF4= 250.13
##$BF5= 500.13
##$BF6= 500.13
##$BF7= 500.13
##$BF8= 500.13
##$BYTORDA= 1
##$CFDGTYP= 0
##$CFRGTYP= 5
##$CHEMSTR= <none>
##$CNST= (0..31)
1 1 145 1 1 1 1 1 1 1 1 1 1 1 1 1 1 1 1 1 1 1 1 1 1 1 1 1 1 1 1 1 
##$CPDPRG= <>
##$CPDPRG1= <>
##$CPDPRG2= <>
##$CPDPRG3= <>
##$CPDPRG4= <mlev>
##$CPDPRG5= <mlev>
##$CPDPRG6= <mlev>
##$CPDPRG7= <mlev>
##$CPDPRG8= <mlev>
##$CPDPRGB= <>
##$CPDPRGT= <>
##$D= (0..31)
0 1 0 0 0 0 0 0 0 0.06 0 0 0 0 0 0 0.0002 0 0 0 0 0 0 0 0 0 0 0 0 0 0 
0 
##$DATE= 1128527991
##$DBL= (0..7)
120 120 120 120 120 120 120 120 
##$DBP= (0..7)
150 150 150 150 150 150 150 150 
##$DBP07= 0
##$DBPNAM0= <>
##$DBPNAM1= <>
$$ [...]
##$SUBNAM7= <"">
##$SUBNAM8= <"">
##$SUBNAM9= <"">
##$SW= 20.6930455092707
##$SWIBOX= (0..15)
0 0 3 0 0 0 0 0 0 0 0 0 0 0 0 0 
##$SW_h= 5175.983436853
##$TD= 65536
##$TD0= 1
##$TE= 294.16
##$TE2= 300
##$TE3= 300
##$TEG= 300
##$TL= (0..7)
0 120 120 120 120 120 120 120 
##$TP= (0..7)
150 150 150 150 150 150 150 150 
##$TP07= 0
##$TPNAME0= <>
##$TPNAME1= <>
##$TPNAME2= <>
##$TPNAME3= <>
##$TPNAME4= <>
##$TPNAME5= <>
##$TPNAME6= <>
##$TPNAME7= <>
##$TPOAL= (0..7)
0.5 0.5 0.5 0.5 0.5 0.5 0.5 0.5 
##$TPOFFS= (0..7)
0 0 0 0 0 0 0 0 
##$TUNHIN= 0
##$TUNHOUT= 0
##$TUNXOUT= 0
##$USERA1= <user>
##$USERA2= <user>
##$USERA3= <user>
##$USERA4= <user>
##$USERA5= <user>
##$V9= 5
##$VALIST= <valist>
##$VCLIST= <CCCCCCCCCCCCCCC>
##$VD= 0
##$VDLIST= <DDDDDDDDDDDDDDD>
##$VPLIST= <PPPPPPPPPPPPPPP>
##$VTLIST= <TTTTTTTTTTTTTTT>
##$WBST= 1024
##$WBSW= 4
##$XGAIN= (0..3)
0 0 0 0 
##$XL= 0
##$YL= 0
##$YMAX_a= 434338
##$YMIN_a= -406174
##$ZGOPTNS= <>
##$ZL1= 120
##$ZL2= 120
##$ZL3= 120
##$ZL4= 120
##$ABSF1= 16.522
##$ABSF2= -4.171173
##$ABSG= 5
##$ABSL= 3
##$ALPHA= 0
##$AQORDER= 0
##$ASSFAC= 0
##$ASSFACI= 0
##$ASSFACX= 0
##$ASSWID= 0
##$AUNMP= <proc_1d>
##$AZFE= 0.1
##$AZFW= 0.1
##$BCFW= 0
##$BC_mod= 0
##$BYTORDP= 0
##$COROFFS= 0
##$CY= 12.5
##$DATMOD= 1
##$DC= 0
##$DFILT= <>
##$DTYPP= 0
##$F1P= 14.0000005364418
##$F2P= -0.99999901652339
##$FCOR= 0.5
##$FTSIZE= 32768
##$FT_mod= 6
##$GAMMA= 0
##$GB= 0
##$INTBC= 1
##$INTSCL= 1
##$ISEN= 128
##$LB= 0.3
##$LEV0= 0
##$LPBIN= 0
##$MAXI= 10000
##$MC2= 0
##$MEAN= 0
##$ME_mod= 0
##$MI= 0
##$NCOEF= 0
##$NC_proc= -3
##$NLEV= 6
##$NOISF1= 0
##$NOISF2= 0
##$NSP= 0
##$NTH_PI= 0
##$NZP= 0
##$OFFSET= 16.522
##$PC= 1
##$PHC0= -55.65231
##$PHC1= 3.769444
##$PH_mod= 1
##$PKNL= yes
##$PPARMOD= 0
##$PSCAL= 4
##$PSIGN= 0
##$REVERSE= no
##$SF= 250.13
##$SI= 32768
##$SIGF1= 0
##$SIGF2= 0
##$SINO= 400
##$SIOLD= 32768
##$SREGLST= <1H.CDCl3>
##$SSB= 0
##$STSI= 32768
##$STSR= 0
##$SW_p= 5175.98343685301
##$SYMM= 0
##$S_DEV= 0
##$TDeff= 65536
##$TDoff= 0
##$TI= <Analysis number 999999
Compound Code 99
Book Reference 9
Project Code 9>
##$TILT= no
##$TM1= 0
##$TM2= 0
##$TOPLEV= 0
##$USERP1= <user>
##$USERP2= <user>
##$USERP3= <user>
##$USERP4= <user>
##$USERP5= <user>
##$WDW= 1
##$XDIM= 32768
##$YMAX_p= 508457473
##$YMIN_p= -165833
$$ End of Bruker specific parameters
$$ ---------------------------------
##NTUPLES= NMR SPECTRUM
##VAR_NAME=  FREQUENCY,     SPECTRUM/REAL,   SPECTRUM/IMAG
##SYMBOL=    X,             R,               I
##VAR_TYPE=  INDEPENDENT,   DEPENDENT,       DEPENDENT
##VAR_FORM=  AFFN,          ASDF,            ASDF
##VAR_DIM=   32768,         32768,           32768
##UNITS=     HZ,            ARBITRARY UNITS, ARBITRARY UNITS
##FACTOR=    0.157963299565203, 1,           1
##FIRST=     4132.6476996994, 0,             0
##LAST=      -1043.33573715361, 0,           0
##MIN=       -1043.33573715361, -165833,     0
##MAX=       4132.6476996994, 508457473,     0
$$ Real data points
##PAGE= N=1
##DATA TABLE= (X++(R..R)), XYDATA
$$ [...]
21091 5462 19684 8010 4724 5645 -11040 -18780 -19996 -10763 -12530 -26074 -35692 -30822 -17885 -6603
21077 -6603 15803 20840 15212 8509 -11639 -23853 -17287 4394 7388 -8967 -22729 -20647 -10549
21064 -10549 -20171 -17561 -16203 -20919 -21186 -14459 -2075 6896 6519 -7835 -17430 -13368 -17607 -18872
21050 -18872 -5608 5756 332 8130 22080 10770 -1572 -8363 -17174 -27238 -38810 -43275 -31859
21037 -31859 -23855 -21012 -27476 -31375 -31629 -17037 -9109 -17118 -7306 -11672 -17251 -12141 -12885 -8920 13249
21022 13249 20234 13834 12747 1590 -3722 -13296 -11323 -915 6808 6408 12981 11950 -10834 -21393
21008 -21393 -29644 -37415 -21249 -20446 -15374 -17271 -30432 -12256 4941 -9479 -16567 -14895 -24020
20995 -24020 -29229 -32200 -26317 -10496 -1189 -12281 -4900 1639 -5584 -16180 -17034 -24608 -29262 -17032
20981 -17032 -17038 -27060 -32165 -24946 -17052 -15529 -19879 -9361 -13539 -15857 -6678 10789 -2921 -13858
20967 -13858 -8290 -2946 -6819 -2422 -5749 -11744 -4141 -2865 -19207 -23256 -22801 -17685 -3695 -11280
20953 -11280 -15031 -25176 -26601 -31273 -22536 -14902 -9215 1337 -6002 -8157 -2386 1875 12517 16580
20939 16580 6728 3210 -8581 -8343 -10527 -9840 -12635 -14072 -8999 -10965 -19188 -29369 -30187 -20775 -19464
20924 -19464 -13034 -488 14150 6694 -11398 -5816 431 -5892 -6884 -15975 -10097 -7334 -10876 -4710
20910 -4710 -4928 -6522 -10731 -7772 5703 2845 -9550 -22273 -23816 -13368 -11640 -6358 -7135 -2706
20896 -2706 11275 15526 11829 1431 -11215 -14122 -8985 -16781 -12435 -4985 -3172 11661 9719 14051
20882 14051 7329 6056 -4307 1172 7759 4295 -2843 -9315 -18286 -26233 -31211 -7115 834 4676
20868 4676 5258 -932 -11109 -10877 -20435 -5813 17230 18633 395 -15588 -10250 -9943 -13274 -11960
20854 -11960 -10660 -13670 -13968 -19131 -18838 -8844 -10118 -11489 -11214 -4619 -2004 267 -5298 1669 -6272
20839 -6272 -18530 -14607 -3000 2569 -2980 2684 -2862 -9606 -17079 -8758 -4728 1899 10033 8709
20825 8709 4726 5654 4347 -3735 -8418 -11798 -7531 -3124 10926 6649 -5488 -3132 -12330 -16277
20811 -16277 -6074 -7032 -19066 -22564 -12468 -1707 4655 22815 21459 11 -5665 -592 8053
20798 8053 9506 10877 12523 11802 5966 -12527 -13627 -13398 -10898 -14165 -15050 -16804 -20884 -30553 -20092
20783 -20092 -3391 7625 6236 -2480 -8525 -9362 -24112 -18673 -5203 -5259 -4676 -2648 -1620 -1996 12282
20768 12282 19323 1309 -827 2215 -11619 -19502 -21928 -13815 -2467 7609 3859 -165 1658
20755 1658 -10452 -17253 -7904 -2830 -12024 -15279 -18578 -17550 -14626 -12815 -25232 -26190 -21087 -10058
20741 -10058 -15952 -12069 7039 24789 17529 1996 -10906 -14607 -16663 -21780 -11763 -10531 -11200
20728 -11200 -9274 -7983 -10085 4293 -1618 -13383 -22895 -20216 -16153 -12014 -13087 -10816 495 7603
20714 7603 11442 7974 -11848 -19798 -26980 -39309 -33616 -21004 -7711 -4125 -9190 -11017 -10138 -14207
20700 -14207 -13787 -11173 -1351 -11935 -4880 -1518 -3824 -4030 -14364 -14821 -5118 1944 -6933 -12905 -19612
20685 -19612 -18607 -373 9051 11569 20490 25391 18452 -480 4267 12012 6787 -13908 -7524 -6091
20671 -6091 -16933 -12793 10319 23801 8472 -7232 -7324 -11512 -11376 -8300 -18388 -24055 -13662 -3757
20657 -3757 3109 14287 12108 17918 13527 -8568 -3881 -11382 -13570 -5589 -19649 -28765 -35085 -25610
20643 -25610 -18407 -19476 -28259 -41528 -26929 -6579 9875 13143 4341 -293 -3508 -4645 -18012
20630 -18012 -21336 -11665 -22715 -25350 -27928 -20454 -15461 -9878 -14883 -23727 -21186 -18791 -13173 2576
20616 2576 581 -2538 -720 -8213 -2861 -3291 -2762 -1274 -1007 -3559 -6165 -5279 5198 -1589 -1176 2336
20600 2336 4832 3434 -7538 -7193 10600 12002 -6033 -14017 -14266 -17562 -22221 -15078 -15702 -15471 488
20585 488 10031 17122 17965 11963 8140 -12091 -21183 -23573 -23106 -27361 -24188 -19265 -9470 -697 -16309
20570 -16309 -28411 -30143 -37513 -44519 -30973 -21710 -19146 -20578 -19222 -21046 -6039 6716 1284
20557 1284 -1335 -1194 -13890 -11493 -14428 -11110 14120 26330 10573 7162 7815 12409 21640 16606
20543 16606 2122 10550 20563 16633 18411 19085 5007 -12137 -7217 -5439 -5711 -6999 -5422 -10653
20529 -10653 -2939 5777 49 1581 13988 11154 4979 11913 13226 21885 13623 13499 10654 9402
20515 9402 -6970 -2839 3416 16983 13634 4027 -4309 -3171 -5066 -11398 -16521 -2405 5707 486
20501 486 4268 7746 109 -11936 -9169 -11777 -23051 -29962 -17540 -12676 -8532 -6225 -1739 -701
20487 -701 1156 2289 2377 -974 -3085 -3873 -4737 -2705 5037 2015 4616 3618 -2577 -12734 -23473 -15918
20471 -15918 -7514 -7920 -4053 4773 -8521 -17594 -2741 19014 18927 14006 115 -9535 -1278 -4658
20457 -4658 -14450 213 1405 -5962 7524 13388 10262 -4921 -4685 4886 -339 -9995 -12829 -22268
20443 -22268 -32420 -30044 -21344 -12385 -787 4877 1134 -8663 -19877 -29837 -30370 -21424 -28543 -22701
20429 -22701 -25002 -22429 -30353 -31828 -13344 -5926 -21723 -25574 -6667 7873 2861 -143 -14472
20416 -14472 -12716 -8010 5204 12710 -2063 -3441 -5002 -14975 -23680 -27688 -32863 -31847 -12571 -9014
20402 -9014 -14187 -24254 -31089 -25816 -27055 -28095 -23648 -23200 -26504 -17943 -9005 -9184 -18567 -25893 -30928
20387 -30928 -16386 -13644 -14734 -3046 8038 7531 -7161 -2048 -3209 -9924 -11809 3094 1129
20374 1129 -4005 -4645 -8639 -1112 858 -10134 -10774 -11890 -9590 -18586 -27242 -24291 -7661 -2499 3568
20359 3568 994 -11455 -11909 7199 21055 24293 14262 409 -9713 -18670 -33225 -37794 -25803
20346 -25803 -17199 -6308 -4082 -9445 -9844 -12016 -15726 -14616 -245 6901 913 -17582 -15257 5345
20332 5345 4161 -1979 -6656 -19379 -16882 -17456 -17651 -1935 45 -5528 -15580 -20254 -20344 -11225 -2153
20317 -2153 -11122 -15619 -4114 -13222 -18951 -22241 -15124 -13199 -27282 -21514 -19591 -12081 -7730 2421
20303 2421 5046 5234 -6691 -6958 11298 15008 13163 11557 10295 -7935 -7693 2539 5787 -552
20289 -552 -9785 -17857 -13769 -11037 -4187 -873 -964 -10392 -16052 -12622 -932 -15625 -26641 -27045 -26384
20274 -26384 -15419 -7863 -19931 -34635 -36153 -18657 -13830 -19444 -10706 -11299 -8704 536 5719 -15145
20260 -15145 -23221 -17142 -12888 -9737 -9108 -8848 -4108 3950 8268 -8451 -14231 -1029 9662 6594
20246 6594 9686 5810 14289 17780 4784 -11660 -5967 8013 5229 13839 6463 -3763 -3899 -5818
20232 -5818 -12765 -11307 -8363 4480 541 -7392 -11366 -14530 -12289 -10232 -13263 -14949 -6238 6263
20218 6263 2472 6173 17067 21415 13833 3455 -7692 -3986 2872 8223 571 2059 20179 15732
20204 15732 5253 -10780 -16869 -21435 -9473 -6247 -9308 -5913 -8932 -13769 -16243 -10925 3935
20191 3935 8864 -697 -9296 -3546 152 -7331 -18437 -19052 -14372 -3826 -1177 -4975 -13068 -11446
20177 -11446 2538 2030 5072 -3550 -9492 -10606 -12592 -14608 -17576 -14581 -12465 -1314 1450 -12226
20163 -12226 -25374 -16306 -12981 2170 8283 -5739 -22370 -25477 -34954 -29769 -7040 -3260 -17157
20150 -17157 -21462 -7342 6644 10203 32326 35075 21166 -1755 -8970 -5361 346 -14453 -12024
20137 -12024 -4217 -7342 -9055 -16799 -19093 -24351 -1073 2441 -7631 -15346 -21038 -33142 -29733 -21485
20123 -21485 -14632 -26707 -22710 -15974 -13753 -20386 -7310 2422 10508 5798 8163 6264 9946 3478
20109 3478 6703 11922 3566 9891 -6082 -18573 -20683 -10627 -4479 -8488 -11051 -9021 10062 21934
20095 21934 14483 10755 -6712 -10237 -68 4262 21773 7611 -8582 -8869 -16509 -19042 -15635
20082 -15635 -13456 -16573 -15891 -5213 2776 -6386 -11368 -3910 5058 8704 -13709 -13678 -28399 -37866
20068 -37866 -26442 -17435 -1320 -5171 -1730 1811 -10571 -7237 1707 8156 -453 -15167 -13862
20055 -13862 5393 4976 -9578 -6472 3350 11814 19976 14420 3261 -5361 -6252 -9686 -14288 -16471
20041 -16471 7703 28910 27571 24140 14510 3485 -4745 -8005 -15036 -19273 -23767 -17005 -11695 -15090
20027 -15090 -21708 -10318 -4821 -4898 -2402 -5403 -13114 -16916 -18384 -25725 -20485 -15376 -14894 -14844 -13545
20012 -13545 -4000 9839 9257 12014 11791 6743 2008 -10847 -20222 -19860 -3526 14268 22058 12561
19998 12561 2236 -5070 -10171 14287 6232 -10171 -20745 -19993 -16905 -21467 -13825 -6498 -8016 -7783
19984 -7783 -6132 -16707 -17219 -15670 -10728 -3841 1157 6672 -4308 -15914 -13335 -17890 -14606 -18362
19970 -18362 -7041 469 8761 -2010 -7114 -8049 -6154 -12194 -6038 -5454 -8693 4869 10816 6634
19956 6634 -8210 -20865 -31801 -35727 -36069 -27394 -12777 -13240 -16360 -19645 -8668 -4177 2942 5458
19942 5458 -150 -6351 66 -7403 -9212 -2146 -7413 7500 6481 7254 1931 -14097 -9133 792
19928 792 -556 1629 -9204 -9660 3135 -1679 -18617 -20388 -21506 -20058 -11092 14257 36455 40078
19914 40078 32398 40608 47782 42330 26237 28737 29738 40212 50246 71187 85951 83845 86712
19901 86712 95912 91186 65644 51906 35465 31906 46709 66059 84211 72713 72948 81357 67056
19888 67056 46500 28993 10357 9556 8138 6902 10215 22826 34347 9697 1398 14027 27301
19875 27301 24281 19852 9142 4291 10184 -1104 177 7654 16303 2766 -11383 -1414 -721 -14684
19861 -14684 -32140 -28769 -17007 -14068 -9311 -12182 -23779 -24868 -35372 -35842 -38044 -36579 -37717 -20806
19847 -20806 -10504 -23876 -28913 -31924 -30062 -10491 3122 -5687 5160 2486 -2093 -4531 -10712
19834 -10712 -20345 -32455 -14812 -3845 -4134 -10781 -7840 -1790 745 800 -4473 -9213 -9229 -800 -3697
19819 -3697 4744 2393 -14886 -13575 1940 899 -6599 7420 10769 14227 5105 -4034 -14641 -24124
19805 -24124 -17954 -3096 13351 11475 -492 -12218 -8773 -11898 -21996 -7603 -7106 2186 5817
19792 5817 8860 13846 6387 4205 -7627 -25461 -28350 -32746 -29997 -32284 -32146 -24154 -14313 -9307
19778 -9307 -18204 -27026 -33245 -26151 -11599 -13996 -16728 -777 -9249 -4538 10367 14835 20143 7773
19764 7773 -3370 -8296 -10502 -16812 -4543 -508 -1140 2733 878 3533 -6029 -6932 -10797 -7113 -2645
19749 -2645 -8760 -4780 -3328 -4530 5395 1365 -1818 -7474 -6177 -271 -12796 -7910 -1972 -9576
19735 -9576 -22098 -26275 -26909 -18844 -15155 -10736 -6367 -11604 -23765 -18540 121 -3482 -8752 -19148
19721 -19148 -17751 -9510 10479 2958 -4618 9332 12041 8040 11713 6722 -7595 -14110 -5842 -5814
19707 -5814 -13813 -19152 -14854 -7972 -3622 -5948 5761 11380 -11333 -11550 -4423 5154 580 -11194
19693 -11194 -10325 -8326 -9029 -10575 -9643 -4242 976 5805 -5129 -18095 -4484 -4477 -19919 -12829 -17692
19678 -17692 -27753 -27436 -27906 -23936 -19567 -10718 -7172 -11222 -14100 -18384 -13495 -129 7346 4340
19664 4340 1927 10786 12742 15669 13346 13903 -272 -12127 -10331 -12691 -14392 -16313 -7517 -12395
19650 -12395 -6656 -453 10868 17693 -2573 -17627 -7524 -2531 14731 12781 8385 5137 2637
19637 2637 -12179 -30347 -29929 -30230 -35302 -49728 -48421 -41943 -32367 -18175 -19684 -15371 -17433 -309
19623 -309 -8686 -16942 -2556 1824 -4938 -26698 -39733 -22829 -11820 -6806 -7212 -4807 -8211 -20568
19609 -20568 -26544 -7445 1111 1095 -15914 -18052 -11731 -9744 -11467 -6992 4319 -2260 -1837 118
19595 118 -22449 -35999 -34457 -28758 -24273 -12835 5329 19195 16235 4275 -4057 -12607 -5873
19582 -5873 -7317 -1867 2027 2018 -9634 -9336 -12474 -23918 -9559 -9214 -16574 -13106 -9432 7401 13252
19567 13252 4436 4863 6854 -638 6830 4206 -3462 -5447 -463 14730 12529 475 -16931 -13866
19553 -13866 -12991 -11732 -16149 -12696 -5320 -760 -11584 -16675 -9029 -10686 -26466 -31162 -30436 -8523
19539 -8523 2592 135 -2395 -15745 -27385 -28123 -28642 -27269 -13585 -5279 -6501 -2569 -4299 -21637
19525 -21637 -15884 -15020 -19460 -32020 -40749 -40911 -38218 -33583 -36682 -19111 -16921 -37738 -20977 9050
19511 9050 4164 -1036 -15002 -18801 -7746 -2485 -6295 -17023 -22128 -20496 -20747 -24339 -25783 -27137
19497 -27137 -15823 -325 2414 -2843 -10756 -5266 -7573 -9733 3646 11655 -3120 -7828 -194
19484 -194 5810 -928 -2179 9374 -1289 -10472 -16900 -20676 -13864 -11249 -9588 -9036 -9080 -4247 17260
19469 17260 21859 24573 23271 15992 8674 -2951 -16532 -15002 -8842 -11918 -12368 -20737 -15536 -8329
19455 -8329 539 -931 -8884 -20983 -17545 -14181 -12483 -15782 -18202 -8434 -13922 -10056 14642 14991
19441 14991 20188 27272 27590 7163 -3180 -14072 -9143 -5897 -155 -5187 -20439 -12863 -7943 -14761
19427 -14761 -22106 -24725 -27958 -19220 -1110 6785 -1024 -14320 -20407 -10934 -8931 2952 -5757 -19027
19413 -19027 -21865 -14035 -21039 -29338 -13558 3306 5047 6431 -611 -16741 -27667 -20703 -9869
19400 -9869 -3129 -9252 -8512 484 4485 11094 -2505 -15635 -3260 7208 1053 -1611 -1818 -4223
19386 -4223 -30621 -37267 -15797 6582 -1296 -9080 -15448 -19590 -19420 -22444 -22448 -5774 14862 5442
19372 5442 1655 6404 2668 -1487 8821 15560 23768 13477 -7524 407 5896 1058 4267 -10508
19358 -10508 -10258 -2429 -869 -4711 -301 10416 10069 8827 1741 -18717 -26682 -29947 -18311 -11945
19344 -11945 -12565 -14530 -28014 -32913 -21178 -21200 -19350 -17070 302 12412 6274 -3966 -1366 -5711
19330 -5711 -21349 -21552 -5860 6179 -945 6405 -1083 -16830 -20599 -20155 -14050 -13286 -13726 -12462 -9525
19315 -9525 -16119 -29216 -20483 -8542 -2647 3426 6088 -7689 -7214 4696 3140 7083 -1226 -10264
19301 -10264 -18331 -19786 -4406 18425 4225 4263 5530 -1634 -13876 -18428 -21596 -32584 -32351 -25400
19287 -25400 -17370 -14758 -10507 -19253 -2802 9696 14871 4375 -1416 -11778 -18180 -17263 -13151 -9451
19273 -9451 -5390 -1383 6292 -3311 288 5839 -2920 -5716 -7511 -12272 -18880 -25566 -21610 -28787 -30628
19258 -30628 -16793 -16270 -18604 -25281 -33347 -22204 -11142 -22157 -24263 -12538 2847 -1344 -5160
19245 -5160 -11956 -16130 -13246 -14541 -17087 -8241 -9410 -23658 -25820 -10297 14580 14750 3425 4828
19231 4828 8894 350 -11350 -11172 -17176 -15137 -14650 -9003 1209 -6002 -9762 -9475 -20982 -30051 -14327
19216 -14327 -9892 -10621 -20783 -27126 -19832 -3606 -6057 -11250 -19371 -16734 -5973 1341 -809 2714
19202 2714 -778 1207 -1188 -8827 -4420 -8135 -4993 241 3417 11110 17782 10729 15134 4614
19188 4614 1961 -7538 -4738 741 -1460 -6546 5660 8103 6096 919 10510 27419 16884 -2007
19174 -2007 6945 7146 18027 19752 22116 23748 27937 33554 14800 11508 21000 21015 33603 60825
19160 60825 90690 85255 91000 94738 122272 170118 227849 300470 365440 403033 389300 377157
19148 377157 386426 403018 421425 388346 322714 299850 303854 336452 372541 389962 379821 354431
19136 354431 342876 336323 297088 217241 148455 94420 61226 44254 38022 27720 21462 18995
19124 18995 7561 6984 14351 20645 26061 27511 29146 50111 44697 36553 28912 22870 17073 115
19110 115 6840 14522 10672 -277 -1053 -10138 -14999 -1004 14443 21076 27346 38451 36386 19865
19096 19865 17646 8257 -1532 4839 18101 14899 9674 20004 30140 30585 34263 33653 19910 6244
19082 6244 -588 153 -6308 -13988 -10183 2694 4785 4570 -12275 -28440 -25236 -26396 -31952 -28222
19068 -28222 -6086 11021 8766 12401 22706 8967 -1342 2046 15098 9581 -7552 1122 8603
19055 8603 7894 -4089 -6999 -7534 -14233 -20920 -19165 -13305 -2676 7846 15161 11292 -2615 2570
19041 2570 12695 -759 1261 7431 7090 6256 5386 -6754 -8109 -5467 -16606 -16566 -3824 8297
19027 8297 13405 10686 25906 18011 6012 9690 12931 8993 637 -20296 -31436 -26971 -22285 -19147
19013 -19147 -13850 -3321 -7324 -11183 -14248 -14779 -19404 -15217 -10910 -7854 -4787 -7653 -14875 -11582
18999 -11582 4198 10544 11130 12229 -3231 -15318 -21362 -10604 -10139 -20158 -9174 1042 -10119
18986 -10119 -5143 -15342 -14042 -12582 2019 9232 6788 -11579 -15470 -25787 -26171 -24006 -16871 -13578
18972 -13578 -14455 -14343 -7301 -1548 6573 14225 -2472 -14152 -13685 -12949 -11588 11321 24911 35603
18958 35603 35450 33741 36072 24958 17788 13886 15592 17614 6337 -2990 -14078 -29896 -20129 -7804
18944 -7804 -10680 -6760 -9281 2876 3005 1346 14440 8860 3500 6680 11312 -4902 -6927 352
18930 352 -6106 -15644 -21741 -27260 -19803 -10634 -4936 3218 -2481 -9538 -15847 -13697 -2166 -14160
18916 -14160 -27347 -26908 -23392 -16173 -2980 6501 6355 2722 -1267 -5360 -6773 -5041 -8680 -8366 -6088
18901 -6088 -12264 -7413 -5572 -7461 -10849 -14771 -9464 -15483 719 13307 3032 -19455 -15905 -9626
18887 -9626 -12242 -9180 -4080 1122 11367 3549 7091 9632 -4017 -7291 -3356 -7653 -12179 -4047
18873 -4047 14851 15813 16292 24529 18924 11222 15934 11321 -8352 377 18006 1381 -7652 -8151
18859 -8151 -2655 -3394 -1809 3087 6144 10502 23655 23225 25240 10824 -2851 1306 6489 12279
18845 12279 13678 7293 -2760 8801 9519 -4970 -2113 -14737 -13704 -4566 14159 22126 11143
18832 11143 -5334 -15228 -15033 -12985 -6582 5362 8938 21892 14731 225 8516 19888 23671
18819 23671 18279 2837 2326 22845 35037 27320 18458 14675 3937 -1954 -1890 3070 4770 27788
18805 27788 37773 36840 32602 27973 23638 23984 15287 14011 16167 11395 15090 19095 20202 21849 20844
18790 20844 30812 35072 35777 24160 21238 22764 37282 44074 42769 37003 31811 28884 16549 19824
18776 19824 25321 30427 18866 741 -1353 8968 22844 27719 25394 33414 53604 76598 102082
18763 102082 129536 155462 169411 143026 108012 83572 74721 59069 50343 57686 62097 58528
18751 58528 73024 75402 72790 67112 64316 55428 45520 33312 30157 40234 29209 9060 -6404
18738 -6404 -6199 -52 -1887 -1731 4254 3112 -5458 -10288 608 6556 5501 6139 4193 -6715 -5771
18723 -5771 116 -343 13145 33307 39445 22196 5855 10709 23192 15324 5067 1701 -5159
18710 -5159 -12103 -14525 -5216 880 641 6531 7352 -15299 -23950 -9907 4121 10218 -623 2321
18696 2321 22145 33392 37638 26811 10601 8869 17464 22045 13617 13496 21103 15648 14012 8273
18682 8273 24313 37532 37693 25629 6719 10596 23076 22977 26304 26652 23209 18569 29806 41710
18668 41710 38638 22912 32172 38901 45780 57892 60695 52826 42922 42687 35251 30130 26358 26070
18654 26070 36153 39924 27338 18979 15533 4892 7492 30435 28267 29585 21955 24632 34234
18641 34234 34526 40401 42030 42864 50946 78960 92724 88894 78228 86103 93554 95132 86377 83913
18627 83913 92241 114024 118963 135845 145427 130857 127891 131801 128491 115791 104968 109239 110561
18614 110561 98898 85851 85531 84151 76868 79599 98505 109217 114751 113257 107202 114141 106846
18601 106846 102733 91057 95539 112530 116889 118912 121592 120790 113679 109834 121958 129821 129899 141016
18587 141016 152533 156082 159411 163651 176629 182531 165612 171438 201750 214863 221777 236340 234227
18574 234227 251814 263065 274444 292579 316172 343660 380168 401458 423003 450419 486834
18563 486834 566917 661418 760624 852168 921877 940116 968234 1026469 1106406 1156553 1186837
18552 1186837 1246318 1340408 1458400 1568218 1640588 1653268 1671306 1730603 1835497 1891848 1886771
18541 1886771 1880779 1902963 1965323 2034844 2126850 2288661 2501389 2749384 3030887 3304719
18531 3304719 3551795 3813595 4134007 4506624 4915524 5294354 5684206 6155405 6736875
18522 6736875 7409401 8148481 8959822 9879092 11001243 12459156 14335489 16808793 20415369
18513 20415369 25880996 33462368 42931247 54396805 66279591 72945138 71885610 68526273
18505 68526273 69116007 72610776 71861631 64488675 56867910 54748915 58616121 66687788
18497 66687788 73388350 73025589 67377947 63477408 63816752 62599218 53552187 39048312
18489 39048312 26320211 18115555 13317472 10352745 8440623 7197032 6355380 5639429
18481 5639429 4935198 4304341 3790829 3376073 3046109 2833489 2698543 2597652 2506969 2369658
18471 2369658 2189924 2023057 1885481 1769104 1653393 1532747 1429421 1344545 1246065 1155413
18461 1155413 1099162 1063516 991394 913168 860099 842872 839946 838044 828965 803810 765342 715161
18449 715161 698348 665051 600618 522671 460876 431277 411242 392686 371621 356108 337078
18438 337078 313874 326415 326257 320166 315207 315312 292360 259001 249008 258463 259052 249739 229624 210790
18424 210790 211590 207902 192802 190893 180408 165087 166591 164806 151438 153162 149956 142686 143161 134941
18410 134941 141030 150020 149460 145584 129839 109504 90738 91370 86971 74072 57156 59346 67807
18397 67807 81679 84227 66886 71216 87086 107188 107868 105747 83873 71802 76310 92128 88352
18384 88352 86595 77945 60304 36418 28863 34764 34260 13801 -8472 -5745 17934 36173 50220
18371 50220 57946 57789 52913 55904 42912 40981 38925 24855 42391 44738 59427 78858 90972
18358 90972 83292 71287 79687 85363 94930 100241 88833 83587 74907 72405 70025 54483 42184
18345 42184 56488 54320 44506 44718 30691 20947 -2509 6749 20985 29045 31654 38324 30881 29964
18331 29964 27759 24368 26149 18869 26380 31119 28922 33533 36801 47567 53773 53027 58597 55362
18317 55362 49163 47115 50003 50260 47887 39086 39088 45568 44265 49070 51332 48442 52823 46935 38287
18302 38287 39216 38434 26554 16141 22507 19720 12197 20494 28197 31061 28977 33593 34471 28110 35657
18287 35657 53136 53627 62370 54381 31408 26854 30795 31971 43164 53773 67953 70270 69366 57001
18273 57001 39827 41808 37996 47260 54745 53052 45793 43374 57988 65439 54372 40128 35947
18260 35947 45256 53178 65205 63640 59022 52327 46887 43493 52066 48964 44492 27689 19728 17495
18246 17495 17807 21338 37678 42619 42363 40741 29341 23788 32183 24430 25997 40351 48281 45186
18232 45186 41774 41840 41389 38650 42432 41265 38367 34220 41727 34159 25186 33148 33060 14720 11186
18217 11186 -1298 -10980 -491 10246 20988 19123 15558 16333 7581 -18641 -17498 -10701 -8266
18204 -8266 4359 12431 12353 18926 26533 17051 2542 -5193 8466 18218 29066 44968 41291 43505
18190 43505 39864 29436 16582 9784 17385 11488 14172 24557 29422 40548 29253 24888 34375
18177 34375 38823 41900 45840 45439 40208 32430 43947 47233 36637 31149 23702 30831 43126 59888
18163 59888 50256 41942 42564 49586 51630 41870 47316 67636 58971 62233 69771 75237 78905 85462
18149 85462 91120 84237 83118 93331 98339 105474 111583 99830 87809 85615 98244 122582 141334
18136 141334 147015 164583 194073 235462 251662 285490 315065 352855 415052 458419 501469 556857
18124 556857 613216 669088 742441 815988 900510 986147 1091447 1219152 1356982 1505853 1662828
18113 1662828 1846328 2101405 2470901 2991499 3811836 5195001 7486106 10612423 14239945
18104 14239945 18582542 22907109 21390973 14870187 8842061 5190912 3263217 2226085
18096 2226085 1625331 1254543 1005399 823312 669778 564129 480647 404854 354651 319331
18086 319331 300750 280529 251616 237226 216274 198372 187604 167336 141067 129313 145396
18075 145396 166971 170377 159376 133857 125085 114099 106235 106900 109040 108129 110841 107236 110200 120838
18061 120838 126148 137501 159703 173548 196372 242219 296629 345266 380873 411540 406969 402497
18049 402497 394723 365709 308916 242407 190833 154567 128063 104098 90597 90053 110914 132924
18037 132924 145921 172654 214064 255316 303069 345001 383920 395180 377510 375868 357545 346070
18025 346070 311537 244573 184637 137091 103406 90707 73773 54865 53174 55563 44102 46970
18013 46970 35040 34720 48863 41910 49024 38126 32834 39388 44559 30500 26268 33243 30270 4631
17999 4631 10577 21069 24897 15784 9487 -2572 -9321 1698 10661 15844 16794 15301 20273 16831
17985 16831 -1540 10205 4085 -15809 -7346 -1298 1701 -605 324 -14872 -41747 -24954 8890
17972 8890 25594 21695 7159 6379 12951 14659 10890 3556 -6808 -14615 -19763 -22075 -10676 3427
17958 3427 15880 17615 -721 -1015 96 6733 13954 23743 21484 26679 28300 18906 15255 12001
17944 12001 6761 -1951 10663 3770 1449 -102 6135 12893 12323 10289 8583 -10683 -11443 7961
17930 7961 30805 42057 34887 24967 10979 6431 8243 10987 10997 5357 26293 37058 37637 37539 36355
17915 36355 29649 35276 41665 46832 48748 47672 27022 13736 15982 15291 12045 899 12673 12514
17901 12514 9095 2136 -3194 9312 24067 11256 4138 14012 15248 11198 31166 22785 5823
17888 5823 3507 3771 8236 25969 24606 25385 24165 20086 15936 22776 21046 21892 34380 33867 34012
17873 34012 28526 32196 33573 40911 55912 69289 73011 65679 68694 95046 126918 140456 182631
17860 182631 226094 266280 329231 379704 402316 400959 403939 419846 422969 405830 362176 335897
17848 335897 331858 365899 401995 409916 397122 373777 364029 382735 359147 289862 217203 163990
17836 163990 130207 105823 75937 55887 57349 53356 55819 55254 52448 39733 34009 37729 26491
17823 26491 33531 39544 25222 13422 19844 21252 19419 15649 15534 31194 35431 36735 28990 35035
17809 35035 42440 37507 35348 31565 24120 24131 17784 8851 11386 7804 21069 28226 19404 24825 22101
17794 22101 19020 19266 21579 15137 3171 -5617 4949 9885 12640 11840 22420 28132 18359 5765
17780 5765 4311 13878 16946 25200 28058 21469 25684 38656 44084 40025 36289 32491 28289 14097
17766 14097 4008 4000 14201 18612 26291 29592 19729 24765 36747 31789 27669 21557 31823 37977
17752 37977 38858 27470 24078 29949 29230 39360 35452 40359 32821 38446 53055 45376 42872 46989
17738 46989 33928 24310 26667 33449 35508 24724 4467 6376 33011 37930 39996 45449 49260
17725 49260 48531 58072 65279 61149 52177 51276 63400 57790 36080 30149 23554 4213 -2150 -3354
17711 -3354 -9738 -15537 -15110 2645 13016 18649 12438 19593 16541 11457 9793 14939 16347 13843
17697 13843 14935 18220 20010 23878 20958 22656 6281 -552 -879 6310 -4167 -4427 -6195 -9242
17683 -9242 5979 -3545 -16616 6008 17568 19745 20069 30464 27503 25984 29385 26263 26023 30059
17669 30059 34151 40709 36994 32093 8150 42 2156 11187 21250 19921 19539 24314 30195 41042
17655 41042 43097 36760 31924 34621 29921 28300 28082 41254 39965 34341 42036 49674 48350 30900
17641 30900 12473 13702 18565 17010 17405 30069 41319 39805 32055 29289 28161 37731 34678 42420
17627 42420 58940 70242 80921 82530 93449 106894 115312 115051 108694 105696 105079 108866 112639 125279
17613 125279 120508 115696 109034 112612 114915 118694 112797 114423 122559 134344 148065 163894 181189
17600 181189 191103 202973 241284 281937 318688 375513 442106 520984 575739 590393 579273 568197
17588 568197 552186 530512 493197 428504 356939 306317 279409 281243 272057 266072 268428 257204
17576 257204 256629 276115 324117 388219 471205 551706 614959 650596 637581 633971 638908 625308
17564 625308 602895 553798 493818 440967 400189 364715 351577 326610 307916 296564 275253
17553 275253 268080 269686 271464 268247 286585 313634 346005 378912 394765 439201 465558 498877
17541 498877 543809 560720 585292 605718 612738 624452 648496 650466 671425 699997 740133 788104
17529 788104 845887 933418 1015835 1139623 1290091 1442650 1609392 1792838 1972468 2148913
17519 2148913 2368319 2612347 2845329 3031781 3206939 3401764 3654277 3931198 4236456
17510 4236456 4578792 4972008 5444278 5990038 6631326 7386165 8288938 9409365 10807034
17501 10807034 12538281 14847571 18219580 23152368 29850868 38433458 48878708 58340239
17493 58340239 63635883 65382432 63737272 62382496 61150262 57116343 49992840 39338583
17485 39338583 29037380 22066904 18314548 16594245 16084926 16325204 17151068 18725313
17477 18725313 21561482 26220147 32873797 41586378 52410034 62226990 67508121 68935774
17469 68935774 66594671 64408171 62339144 57285987 48930620 36858663 25189047 16988355
17461 16988355 12038437 9088612 7228998 5979367 5102272 4414484 3846367 3356079 2933343
17452 2933343 2591818 2318594 2131045 2007272 1916776 1848420 1755429 1653784 1577322 1532315
17442 1532315 1511649 1463610 1383708 1309564 1239478 1172360 1136569 1071617 973411 874217 774291
17431 774291 686312 619368 567014 527630 499290 460317 414807 383767 357621 334207 317387
17420 317387 317865 324804 321627 308891 288730 274054 284173 279652 278258 284792 276940 263728 260212
17407 260212 264299 254212 245211 235607 231783 224035 216417 206059 195986 185437 183712 174940 159852
17394 159852 147256 150583 160356 158703 146443 155062 164530 157614 157964 154964 149209 154540 178742 178644
17380 178644 180662 184499 178805 190526 189339 198208 223171 245771 275408 321601 409320 511493
17368 511493 618770 743128 859405 939042 958539 924941 828808 710082 613749 523321 456267
17357 456267 402893 353022 302572 250649 192635 158669 141620 119770 109286 112466 109807 104371
17345 104371 92224 77558 62724 66971 78740 75807 65261 47214 32302 56603 75283 74698
17333 74698 59098 61077 59408 57277 59941 70440 63683 51559 65561 76279 76136 78996 68524
17320 68524 62512 52059 46528 41309 48031 41557 31193 43752 60119 65913 65192 53705 51458
17307 51458 46734 43120 52689 75208 70916 59861 69030 64286 59405 51441 39073 43242 46229 43268
17293 43268 45116 52949 48333 46536 40707 31800 44036 49251 45809 48862 44118 52605 65925 69955
17279 69955 75218 64863 61984 59257 56944 47506 55145 56267 55014 58320 48888 40080 33938 37292
17265 37292 41294 40648 31859 14022 19636 37372 33405 30849 35829 42796 51765 54370 58490 55753
17251 55753 55211 49597 38761 39738 38869 28579 22495 5768 2842 31335 53657 60201 59518 46130
17237 46130 44537 58446 64914 70645 64846 56133 54611 50520 48110 40934 32798 21501 14431 10556
17223 10556 10290 18509 24592 36012 48837 64999 71432 71351 59621 48196 38948 35310 27320 28629
17209 28629 28370 19841 12448 31180 26762 29248 23069 15334 17513 12071 13035 12948 14501 19708 21539
17194 21539 25964 18823 16883 13982 14753 25129 30227 24848 -2495 9862 28091 48066 54083
17181 54083 56708 65008 66726 60614 46450 39306 28345 19831 29478 40207 44357 46856 49037 48406
17167 48406 56264 49471 41814 37143 40861 59912 69318 72714 75224 76706 63616 51631 42371 32386
17153 32386 30876 23902 30420 52555 49514 48140 66100 71663 61756 49511 53786 41157 23692
17140 23692 8739 13503 21200 15159 24870 24423 20460 13765 19287 18697 3745 -6764 5722 25539
17126 25539 31437 31888 25713 26261 14852 5922 8707 15465 42850 45281 34155 28400 33203 33118 32431
17111 32431 20908 11953 11851 20787 47838 59838 46115 35588 38766 45313 44411 32506 24187
17098 24187 12758 10895 27147 43023 46980 46355 47762 62904 60708 57065 57202 66304 72288 65034
17084 65034 70000 73286 60254 50221 53495 52699 58802 58613 54040 51712 52218 59350 66381 76605
17070 76605 70577 68161 61452 49982 51700 58377 58835 53326 53486 62614 46828 38568 65319 96087
17056 96087 115332 117406 103091 99453 96079 88328 79233 73783 86073 99489 117835 148873 177361
17043 177361 203961 207889 206055 188810 170189 148598 127622 126919 120258 133715 154712 152271 127591
17030 127591 120572 108715 100496 106738 122006 129546 139062 135672 146744 164363 165881 159571 140228
17017 140228 121311 122398 125921 134463 142744 132061 139637 153897 145737 152245 141838 136991 141500
17004 141500 155085 161164 180172 192918 206809 208621 203096 211084 209940 205034 209256 211923 219820
16991 219820 219704 227583 256826 283034 300742 329983 353854 362629 403129 456181 513691 586091
16979 586091 681975 763373 759644 681343 626162 625718 639645 663863 716372 794481 865862 951243
16967 951243 1047871 1086325 1072177 1058439 1101296 1190901 1300418 1442785 1590534 1705886 1807615
16956 1807615 1911968 1985306 2069674 2216889 2437089 2695020 2925261 3134670 3368636 3605569
16946 3605569 3826883 4106577 4427480 4765085 5199509 5776720 6441836 7076445 7683309
16937 7683309 8340910 9230871 10491225 12343253 15269729 20029579 27063462 35866730
16929 35866730 45986852 57705198 63839283 55190085 40743150 29831473 24153191
16922 24153191 22445085 23921641 28479407 35524098 44158700 54292115 63546684 60741895
16914 60741895 47295413 34516629 27143664 24641615 25998332 30598426 37439198 45826274
16906 45826274 55732787 60573808 51924506 37962683 27346190 21651969 19661688 20613603
16898 20613603 24410377 30470656 37855447 46672309 54889966 51739889 38292620 25175239
16890 25175239 16568666 11533611 8559300 6688284 5439877 4604204 4030711 3572649
16882 3572649 3150362 2777310 2491979 2262814 2050055 1853104 1703652 1610214 1558495 1525167
16872 1525167 1535272 1582574 1602869 1560288 1487294 1418080 1381323 1409149 1528871 1687945 1841411
16861 1841411 1944069 1965092 1885422 1728188 1520413 1280433 1073439 932803 834737 785484
16851 785484 747384 743089 761455 771889 795935 843063 895605 940028 981925 1024937 1086669 1170842
16839 1170842 1265201 1370686 1516004 1720620 1975362 2303652 2673991 3044303 3283788 3321731
16829 3321731 3161282 2843566 2497804 2240999 2114483 2099272 2189463 2343618 2563160 2847557
16819 2847557 3159623 3461316 3758626 4033619 4287567 4532833 4830233 5197753 5664117
16810 5664117 6212484 6838605 7551110 8360659 9281653 10300085 11411728 12574323 13793096
16801 13793096 15134503 16734446 18824397 21767235 26103196 32584312 42233195 56173818
16793 56173818 75222070 98648672 123704179 146022979 159051213 158473959 143945083
16786 143945083 118774997 89435725 62729478 41975661 27897574 19206108 13964214
16779 13964214 10682540 8515284 7033915 6021788 5325365 4840652 4478179 4139630 3799054
16770 3799054 3433791 3069506 2721212 2404069 2139039 1979765 1893179 1868125 1885769 1895283
16760 1895283 1922958 1969744 1973003 1904616 1768160 1589909 1399266 1232707 1108491 1039751
16750 1039751 1029829 1051760 1099325 1187865 1272132 1331272 1333504 1251394 1106131 928500 753286
16739 753286 619284 529475 475536 434029 413529 411161 407852 397899 383124 373550 365156 357142
16727 357142 352117 348937 367205 376417 350628 303584 268538 273315 279451 254753 258123 246790 251918
16714 251918 265900 239298 222932 215710 216948 216714 210808 205135 196404 195679 202787 207417 190666 172372
16700 172372 163171 154978 138367 132918 124842 121186 108391 103859 110855 103436 109387 124839 131745
16687 131745 142671 132313 120076 108885 115425 122885 131829 127985 127197 129229 119002 104961 107676
16674 107676 114533 116635 106467 98598 108356 116327 125160 124546 131484 142147 132827 109607 65823
16661 65823 31057 10110 -7737 8077 46106 73690 94877 106950 141275 156239 161076 154429
16649 154429 140043 136019 127323 126280 130490 125602 121382 124841 119047 115928 112328 90775 82255 66205
16635 66205 53854 67720 73868 89059 104927 96583 84345 64011 44612 29353 24290 35983
16623 35983 37848 22108 27785 39509 29958 28297 26562 25291 31336 53739 66569 53271 54897
16610 54897 57395 62949 61001 48233 42994 35917 31612 38268 39977 50643 55480 54537 73215 78917
16596 78917 71160 50870 48998 52618 48407 26116 23606 21207 25627 24731 28923 41162 41159 31640 25935
16581 25935 33527 38047 27508 24060 20371 22170 35735 42607 49097 37478 20867 16180 17386
16568 17386 23870 29394 30715 27695 5040 1095 16486 24054 19575 16682 5347 -602 -142 6132
16554 6132 16729 28877 25063 27239 33216 34642 39708 35371 26170 22076 23611 27252 22085 -1429
16540 -1429 -10777 6930 8269 12921 9552 22824 25598 32979 38561 32420 28756 17350 18013 17573
16526 17573 9100 16792 16099 16741 13428 11911 4323 -6061 -1681 -4749 -10703 -6907 -1228 11671
16512 11671 24880 22261 7746 3008 9320 25921 23307 21888 19426 4635 -2094 -1030 12380
16499 12380 12948 11343 6060 1015 11105 9295 397 -2070 812 19619 27813 17855 -3240 -12200
16485 -12200 -5255 3815 9844 2567 4994 8000 11797 16421 9227 9762 14771 18832 584 -3901
16471 -3901 181 -5877 -2502 4272 6820 -5279 -2625 7999 14140 11856 19144 27991 26253 21499
16457 21499 16122 -5204 -10935 -2577 20939 15797 7453 13022 12010 18649 36623 38675 51402
16444 51402 31519 6930 3933 13641 15889 29645 29329 21810 20789 18098 18218 27217 18221 13879
16430 13879 20073 21762 31909 45706 34604 26498 27451 12752 26900 25612 9271 9027 27058
16417 27058 28823 34626 32553 39350 44503 34061 20634 21563 18007 25730 27748 18626 11062 11266
16403 11266 13928 18093 7060 -975 4509 2168 -9464 5950 11842 4997 -8317 -6575 7394
16390 7394 18181 22969 14909 22389 27612 21970 29881 37454 36004 20181 17647 29232 40992 51540
16376 51540 54605 62607 49476 58474 63352 59989 67098 80842 107329 143124 197147 259295 309956
16363 309956 337115 295886 219554 167370 143803 142915 139802 155626 192014 242716 296593 331766
16351 331766 325584 267434 209698 168568 139186 144074 175765 206662 234989 269920 293057 283831
16339 283831 245226 203094 175206 152835 141016 154099 183751 221529 259264 280025 271713 217320
16327 217320 159253 109426 79951 52976 34244 23203 24188 29202 31929 35016 28027 24487 28815
16314 28815 37463 35181 29853 20804 26497 34344 31186 27039 23773 16822 3682 967 -3730 -1599
16300 -1599 6411 6866 1176 13780 27388 29968 25036 8570 7467 7055 -7536 -17253 -6006 -1012
16286 -1012 8290 7086 -11 1078 7866 2727 -2879 -10041 -4264 -1564 -3470 2969 5124 1879 4460
16271 4460 6734 1885 -1430 -4150 -9181 -3214 -3283 500 9693 6351 1821 -2002 -16817 -24076 -14727
16256 -14727 -6114 -9004 -13988 -14374 -11313 3700 9271 10716 13616 5910 19573 24974 9999 6992
16242 6992 -4433 -307 9173 1539 -10616 -7649 11899 21936 24740 28356 34897 18865 14917
16229 14917 13574 10581 11160 20178 32545 50863 63530 65458 73113 88053 102760 114069 132713
16216 132713 140319 158212 187308 216917 267596 366595 482730 609613 718810 794451 818275
16205 818275 760367 640242 491448 344487 227756 145053 95275 71249 58106 62586 49897
16194 49897 31209 20516 20634 25271 27684 13182 4982 8611 13321 5237 -9731 -2518 6669 -2908
16180 -2908 -18239 -11070 6342 9738 9258 16625 5703 1297 12959 20528 10653 -931 158 -4872
16166 -4872 -5936 -6932 -5432 148 3494 5120 -5886 -9996 2390 -3767 -10430 -9278 363 1623
16152 1623 -3222 -4741 -2803 -8914 -4280 -4577 -19839 -27217 -28361 -34924 -23751 -2364 -1783 -15706
16138 -15706 -6675 5217 -4750 -18473 -17307 -539 13862 3660 -725 -14153 -10312 90 3952
16125 3952 -8324 -20894 -9593 -4833 -15260 -13941 -468 9111 6789 2602 -12857 -14938 -15219
16112 -15219 -9990 -8385 -6060 -1188 -10350 -13289 -14090 -8269 5342 -1557 -8286 -18068 -27972 -18078
16098 -18078 -9124 -8745 -3415 4927 -2170 -11878 -16332 -17188 -21612 -31945 -30521 -41165 -30403 -17104
16084 -17104 -23558 -35293 -26419 -17254 -21686 -22787 -17587 -21555 -28602 -26720 -19523 -4968 8156 4133
16070 4133 -319 8161 17632 19615 23957 14215 2103 -4012 -15674 -16355 -4541 6879 7710 2283
16056 2283 -5226 2550 14462 24683 20717 6090 -8043 -20433 -15397 -199 721 -1463 3313
16043 3313 2636 9948 32325 42682 27096 15482 10061 10576 22822 14831 10957 7685 -3568 1871
16029 1871 14527 11092 16538 27262 10380 -3641 9353 3906 -12856 -8416 1379 -1276 -5455
16016 -5455 -3699 3322 6400 -524 -2500 -7587 -5227 10349 18450 23180 27994 21327 15288 4693
16002 4693 -782 -9564 -20545 -25049 -15638 3876 6882 12097 8685 7873 -745 -5729 -11571 -9108
15988 -9108 -12265 -7944 1485 3486 -1695 -4496 -11857 -7487 -6837 -6997 -3761 -856 -1272 1554 -748
15973 -748 -9117 -19719 -17416 -12607 2107 3344 -4997 -1720 12896 -2966 -13252 -22047 -19471 -15706
15959 -15706 -4597 -6971 -22010 -26963 -29778 -31062 -13694 -17544 -10058 9206 14260 10015 3934
15946 3934 -2386 -639 -12277 -37078 -32766 -24602 -20879 -6576 401 8551 12556 7852 5903 3307
15932 3307 -554 1163 6914 4435 -18732 -18323 -11162 -27699 -33103 -23818 -16307 -7205 -11444 -10099
15918 -10099 -8457 -5211 -9362 -8821 1674 -4899 -12945 -23157 -24447 -22526 -12503 -10912 -25320 -13054
15904 -13054 -3152 5926 24915 18030 1802 1536 9345 -427 -9295 -9705 -11319 -12962 -34324 -23787
15890 -23787 -9567 -15973 -14066 -9679 -9653 -3760 -17074 819 5918 -5644 -17534 -25762 -30526 -26796
15876 -26796 -22546 -5245 3558 4064 -6170 3006 3609 14852 18625 19759 24347 29661 26969 20467
15862 20467 10932 14601 -6559 -5740 10749 18408 18819 21283 10687 -1043 -7930 -9620 -19111 -7555
15848 -7555 1891 -4924 -6125 -22282 -18990 -9196 -4327 -4956 -4642 -31 -9064 -22287 -12249 -3504
15834 -3504 -7405 -4872 -582 -3086 -3997 -1258 8781 7780 -4534 -12261 -25326 -23491 -3985 2726
15820 2726 -1830 10539 13196 20527 28634 28385 15087 9079 -2572 -2525 5179 -4633 -5709 -5948 -10531
15805 -10531 -5942 -21059 -28799 -32643 -29828 -23739 -19480 -11215 -14091 2734 17308 18638 5853
15792 5853 3119 -5677 -18360 -25823 -15671 -7745 -2287 6585 15310 3945 -11860 -27495 -22487
15779 -22487 -7513 -11676 -7990 -12936 -8420 -12760 -21216 -27622 -17030 -7774 -8991 -15265 -8888 -12019
15765 -12019 -8603 -4500 -13346 -18247 -9847 -8808 -2829 1929 13998 -487 -33937 -35881 -13261
15752 -13261 -14972 -23814 -18262 -14713 -18462 -14965 -26952 -34845 -29136 -33558 -45934 -34855 -20654
15739 -20654 -22863 -27909 -22702 -17492 -9498 -3595 243 -6988 -10794 3347 9302 4307 5676 772
15725 772 -4021 -14039 -1135 -3942 -684 1915 200 -3312 -18414 -22513 -18743 -2827 -537 -19377
15711 -19377 -31682 -16334 -5173 -7252 -18731 -21422 -17082 -20321 -17089 -4110 5323 -2400 -11583
15698 -11583 -5069 -7764 -15916 -17785 -6105 -13142 -1261 1547 -3400 -5530 -3425 -2856 2217 -4420
15684 -4420 -25146 -16250 -14188 -17398 -26728 -19766 -1031 5020 5017 12107 14002 3939 -4611 -9568 -3613
15669 -3613 6198 -3454 -4646 1066 6616 -5743 -4863 -1834 5400 10090 1877 2618 11786 -6086 -14533
15654 -14533 -15239 -17372 -28352 -27049 -11991 -4575 -11622 -10713 -7516 -8075 -8910 -5164 1472 -5892 -7995
15639 -7995 -2181 11841 12226 11005 7370 -8327 -12782 -2313 -5386 -18738 -18187 -15481 -12308 -5545
15625 -5545 -9535 2079 25720 18800 4122 -9776 -17857 -13022 -3798 -2382 -11921 -7062 -2686 -8785
15611 -8785 -22757 -23126 -19058 -16874 -18136 -22130 -24084 -24842 -24783 -13085 -20497 -26561 -22789 -15123 -3915
15596 -3915 -476 -7513 -8357 -168 -3761 -9748 -15227 -13816 -3911 -210 -210 -3957 -18294 -10975 10426
15581 10426 19306 14560 9458 3767 6471 730 5203 -2687 -7849 -4266 -11134 -14818 -19049 -7440
15567 -7440 -8667 -15295 -17073 -23449 -25617 -13907 -14813 -20679 -28163 -40403 -40266 -36721 -19526 -2453
15553 -2453 -2655 -3049 -2033 -8860 -1450 -2956 -8462 692 2370 -7341 -12201 -20340 -14346 -14479 -11760
15538 -11760 -15564 -14532 -14674 -12422 -4997 -10386 -17869 -9936 -10029 -7611 -5779 922 8345 17794 9024
15523 9024 5066 3342 1548 2043 12543 10895 -5819 -15287 -13766 -15447 -2824 3064 -3684 83
15509 83 184 4718 -8904 -15000 -7095 3706 1752 10719 9427 5374 5123 -6245 -4152 -1934 -9417
15494 -9417 -26107 -37070 -17656 -1623 -10088 2279 6450 3195 -4434 -7374 -8333 -9373 -5840 -922
15480 -922 -2983 -7383 -13526 -10200 -8939 -15390 -18363 -3172 -2069 -6047 -9015 -20326 -19144 -4822
15466 -4822 23019 20788 15118 3490 3265 8525 12793 2412 -14202 -12236 -15783 -19902 -12695 -8941
15452 -8941 -13899 -20239 -17393 -15997 -19993 -21814 -18046 -17472 -17037 -22570 -27708 -28103 -33143 -31720 -17944
15437 -17944 -2390 9181 -4836 -19293 -24872 -28887 -37803 -28632 -29396 -24765 -12644 -9618 -11758
15424 -11758 -7059 -10791 -19387 -20290 -16795 -19537 -27597 -27065 -25546 -31898 -22514 -18865 -6096 -11811 -28374
15409 -28374 -20701 -25254 -26482 -30193 -27046 -14919 -19061 -12869 -14576 -7037 -8065 -12021 -5403 -7573
15395 -7573 -15385 -10674 -17742 -27473 -25084 -18484 -6918 -11984 -17519 -11481 9910 23954 12605 -4796
15381 -4796 -11003 -19162 -8239 -6603 -11661 -14293 -10900 -9036 -13832 -1349 -3685 -12303 -11563 -4649
15367 -4649 2183 3345 2618 -10240 -3946 5580 2289 -3110 -14564 -21289 -15170 -14796 -23383 -15722 3421
15352 3421 4852 -2082 -24634 -34194 -21304 777 9368 3376 485 -9185 -16879 -10315 -6361 -24437
15338 -24437 -28905 -13423 -7205 -2358 473 -11663 -14947 -19270 -31409 -29274 -24612 -18075 -392
15325 -392 651 5232 10545 -3029 -14277 -15245 -3450 -4418 -7807 1068 1236 -1628 -8405 -1810 -7387
15310 -7387 -19916 -15765 -6744 6865 2460 7054 12527 2878 1455 4332 7716 172 -4535 962
15296 962 -2139 -11237 -12165 -10737 -13562 -11627 -13171 -10523 -9070 -7937 6933 223 -11880 -20296 -31105
15281 -31105 -31936 -33326 -27441 -20586 -25444 -24357 -24860 -11381 -6778 -9112 -10827 -14594 -13959 -9434 -3576
15266 -3576 -6242 -4364 -6212 -8467 208 15479 23408 12613 -2133 -22113 -20264 -15364 -17874 3137
15252 3137 5462 -396 -6225 -15047 -11790 -13716 -1062 4970 -2099 -4648 -10786 -5168 6946 21505
15238 21505 9292 -6531 -15177 -25322 -14530 -2180 -2865 -11484 -8906 -10184 -2217 5977 2311
15225 2311 -8030 -949 4139 10476 3954 -1410 -5659 -7330 -13235 -23426 -18798 -8370 -13052 -25697
15211 -25697 -17205 -24768 -23241 -16199 -10606 -2687 -4252 -9019 -7877 -12867 -22477 -27299 -21672 -8625
15197 -8625 7394 852 -6973 -6546 -5472 -3915 -6872 -2794 -5792 707 13653 3567 -4670 -4809
15183 -4809 -7307 -11140 -24031 -26810 -14050 -13113 -12791 -13904 -11582 -9905 -22969 -29182 -35639 -32761
15169 -32761 -13853 10658 28585 31917 11714 -220 -1720 -3472 2417 11460 15525 1223 -11233
15156 -11233 -5569 2696 -21 -3902 -14562 -12547 -205 -11320 -16915 -11701 -12484 -2590 -2534 -11869
15142 -11869 -16719 -5696 1112 -4971 -959 -12026 -15365 -22514 -9183 -17090 -27530 -19184 -27803
15129 -27803 -15184 -6654 -5108 -20384 -20743 -20292 -21038 -16098 -10049 -25925 -30971 -22663 -21972 -28010 -25093
15114 -25093 -23554 -26226 -19799 -22825 -31215 -20220 -14342 -18408 -17901 -22922 -31639 -20875 -11227 -12343
15100 -12343 -9155 -3570 -6730 -15322 -23267 -16242 -14233 -11079 -38 1600 8449 29846 26341 -1738
15086 -1738 -6196 1738 -3557 -1093 -5317 -2758 794 4241 -5479 -26291 -27532 -34674 -37392 -29486
15072 -29486 -7979 658 -9647 -16495 -12549 5492 13503 1837 -4939 -6920 4800 7392 -6757
15059 -6757 -7608 -11285 -17502 -17297 -23444 -12675 -10450 -26463 -27780 -25378 -22798 -13918 -9336 -15193 -12184
15044 -12184 -4662 5476 14786 10720 -8894 -12781 -11484 -12576 -12235 -9749 -5462 2680 -150 4941
15030 4941 8711 826 -1912 12391 18665 7577 -2706 11829 9267 -3768 840 5552 4938 -8874
15016 -8874 -8990 -4725 -6457 -2697 -6443 -3516 8000 18687 23347 11236 2905 -842 -8649 -13738
15002 -13738 599 8186 6872 11096 11425 12114 21763 16597 7568 9988 30529 44096 55088 76021
14988 76021 76586 94361 100105 108886 114369 123324 129043 135314 157622 168322 190015 230435 278856
14975 278856 357190 486950 699934 1005235 1348263 1776998 2141332 1905377 1283943 746888
14965 746888 431696 275436 201019 160906 113496 82491 55262 41321 41565 44765 29565 11255
14953 11255 6372 -2223 -303 8719 13792 13849 3636 -3264 -2790 8667 5264 15711 20709 16983
14939 16983 2177 -8685 -10949 -11585 -13913 -8784 -2140 -9017 981 7785 -3550 3170 12313 794
14925 794 -1755 -8463 -2616 -8288 -31337 -23848 -7508 -17108 -20280 -16917 -35561 -37084 -16752 -3527
14911 -3527 -17222 -16819 -9408 -550 -7097 -2471 -589 197 257 -6556 -6835 -5397 -7565 -19469 -14810
14896 -14810 -1652 5569 8028 5792 2773 2405 -3929 -423 -1388 -3438 -3658 -9184 -11469 -7944 -7215
14881 -7215 -1684 11583 13821 17417 3829 -5002 -10574 -12793 2214 18212 7960 15276 9147
14868 9147 -2628 -6382 -2336 -5462 -22553 -38250 -40523 -20570 -20974 -21138 -26520 -32899 -24076 -4617
14854 -4617 -1195 -6507 889 11033 18265 9583 -4488 -6073 -2454 -12828 -17911 -29159 -33648 -22219
14840 -22219 -3274 313 -13447 -10144 -4063 -10692 -24930 -15551 14464 18529 11133 5374 2708
14827 2708 7596 5123 1684 -6573 12039 18861 12045 3378 2647 -6772 -8493 -7071 -7410 -9903 -13510
14812 -13510 -17422 -9174 -13945 -15552 -14376 -11686 -4139 5045 21753 26491 12754 -2462 -10412 -13633
14798 -13633 -14357 -19099 -9365 -522 -1578 -14863 -17540 -7996 2915 1951 -2096 -1327 -6668 -7600 -22818
14783 -22818 -31102 -26186 -10684 -1882 -3039 -4048 -1721 7043 7665 4063 7624 12442 10336 15479
14769 15479 10908 9398 5675 5998 -9547 -15011 -26502 -18236 -7789 -10703 -14544 -16235 -12487 2683
14755 2683 8875 10051 7361 -4484 -11554 -14486 -12546 -3931 -987 -19195 -13881 -17684 -12503 -6632
14741 -6632 -25884 -28300 -21491 -15762 -13934 -2682 2981 2706 23778 14726 9606 -5251 -15193 -15961
14727 -15961 -28463 -9016 5297 -41 7664 -374 -5021 -9938 -24744 -33400 -33683 -17867 -17114 -17179
14713 -17179 -13315 -8907 -13303 -14191 -25337 -20492 -13191 -14969 -27737 -22437 -15788 -20321 -12074 -12436
14699 -12436 -1998 -7170 -11832 -7512 -5245 2324 11424 16536 13243 7921 -5226 -14700 -7546 4834
14685 4834 5518 579 -2643 -8206 -825 -4614 -22305 -22246 -20142 -2906 2349 -5055 -4886 -4776 -14758
14670 -14758 -11336 -11982 -13819 -1774 6497 6086 8709 4802 2381 11203 19578 15985 18795 14894 6334
14655 6334 2082 3447 4497 -3779 4423 5899 -12258 -10121 -1366 -7900 -13480 -8690 -3584 -4534 -14231
14640 -14231 -3673 8316 3826 2774 16524 15456 6442 -1819 -21360 -30496 -18484 7538 13439
14627 13439 10780 4014 1914 10428 12309 -3526 6042 16774 19165 10924 3042 7071 -2208 -17534
14613 -17534 -9013 -12997 -14827 -4559 -12853 -10804 4763 17929 8368 326 -109 -7358 -12474 -18969
14599 -18969 -20993 -13891 -8730 10732 -681 -15947 -42256 -55194 -46766 -36432 -27258 -22520 -20541
14586 -20541 -18087 -23114 -32275 -39144 -45274 -47290 -24915 -3725 -258 827 -399 3640 -5402 -10493
14572 -10493 -8777 -4462 7402 12396 12671 15516 21538 18125 16852 3461 16503 28801 24724 15587
14558 15587 14930 9209 -107 -1787 -4478 -15965 -13753 -15071 -12084 -4082 -1927 -8428 -17032 -25862
14544 -25862 -11316 2978 11923 12662 6382 -7582 -14144 -27150 -24468 -5858 8437 9042 -13487
14531 -13487 -13307 -10220 -10428 9040 14922 12930 16795 15918 13806 10373 13155 16148 15007 2015 -6986
14516 -6986 -7072 5446 9345 8185 2820 316 3793 6887 13572 8873 1941 5618 5278 -10503 -9172
14501 -9172 -3686 -2837 11048 5242 1386 -8529 -7718 6225 11236 4902 -13879 -19209 -6950 -2102
14487 -2102 -1838 -1359 -297 286 7946 15163 10189 5053 19609 24469 11178 2064 -7384 -7828 -2698
14472 -2698 -2316 5505 18229 20543 15053 18040 17031 -1218 -8705 -7892 -11513 6122 17015 15022
14458 15022 11621 7206 -5536 -14385 -10307 -14488 4122 1409 -9993 -12072 -8250 8145 8741 9241
14444 9241 11141 -4142 -10001 -9322 -4863 -7816 -10535 -10850 -10159 -4251 -5986 -17489 -15483 -19469 -27651
14429 -27651 -25571 -20740 -12675 2332 10777 1182 -2692 -5142 3234 -5921 -21117 -16250 -506 9456
14415 9456 892 -5564 3904 5291 -4840 -11051 -9391 -6430 -3640 885 8049 12561 6192 6823 4726
14400 4726 10076 6163 -8810 -27626 -36879 -22983 -6295 5676 -2575 -16418 -17429 -18969 -6361
14387 -6361 9922 11891 1713 3581 2347 903 -11583 -19874 -22810 -6378 -612 7243 13435 17610
14373 17610 9706 -5298 -8004 -4530 -10849 -18797 -291 -5985 -13014 -9433 -3258 3791 5738 12533
14359 12533 15945 -407 -8118 -3832 5052 14185 21928 15124 -2035 -13367 -15678 -26134 -23674
14346 -23674 -28625 -22488 -17786 -20958 -14230 -7318 -18338 -13189 4387 4838 -2694 -5246 8721 13300
14332 13300 7597 9912 1758 -11507 -14255 -8906 3680 15668 7887 -3053 2056 3726 3222 4423
14318 4423 -4648 -4377 -9136 -8989 -6753 -2844 10474 3410 -9684 -5757 -17521 -22210 -34133 -34268
14304 -34268 -27694 -26802 -29615 -21920 -20769 -30016 -22675 -31617 -22828 -6689 -12171 -1703 3175 -75
14290 -75 -1705 -8765 -11564 -2335 -3712 -10509 -18580 -35703 -32888 -20805 -20534 -18411 -16067 -4104 -4990
14275 -4990 -17967 -23144 -19495 -5676 1109 9662 16851 11257 3317 7158 4442 1076 13562 14547
14261 14547 16810 1026 -10393 10 11669 8604 5843 4180 3860 5386 -8839 -17485 -5904
14248 -5904 -3340 -13926 -31636 -29093 -19139 -33408 -36906 -28756 -1513 8503 9943 8363 4434
14235 4434 44 -3553 -10899 -1589 12075 24245 26630 18425 12039 7327 10456 14169 10546 3789
14221 3789 -1450 -3383 -783 3462 5744 7643 624 -4704 -7160 -2280 -5721 -8697 176 6059 3698
14206 3698 3011 1610 -11230 -9136 -5169 4356 5003 -15205 -12241 -609 2156 4003 590 -204 14253
14191 14253 26073 17501 2327 -11127 -9761 -10076 -7109 -5953 -348 282 3563 7096 -1682 5802
14177 5802 10250 15024 -815 -2144 -4216 5705 -196 -9941 -3990 17119 26413 21525 -873 -13869
14163 -13869 4908 20309 23285 16146 28277 33888 34738 32618 5291 -1748 -2943 8194 9397
14150 9397 -2452 5827 19256 20043 34690 32220 27223 29482 34043 38682 25088 22542 35087 51680
14136 51680 54172 62950 80302 96353 109910 123314 147126 156500 163290 173302 180930 203725 244989
14123 244989 274067 279742 298417 343725 402264 487106 628631 840477 1108663 1442097 1869317
14112 1869317 2260645 2384966 2253662 1869758 1335514 872174 563260 386639 281900
14103 281900 203951 146785 130039 117550 100516 92218 84362 71892 58965 38021 23735 28218
14091 28218 30510 34354 29908 29181 33754 32144 25101 23236 21429 23828 27969 23797 17184 9089 447
14076 447 4359 14501 16724 3854 168 5161 -5002 2941 -6785 -8244 -7997 -7836 -9695 -16552 -17557
14061 -17557 -10334 6176 3819 2272 -2486 -561 -998 463 5942 -7971 -22401 -16554 -20581 -16005
14047 -16005 -6007 -465 8363 8323 10886 -4916 -21564 -2059 11689 20820 23510 18968 20301 22455
14033 22455 9033 132 3327 -334 -9571 -109 3813 -1745 -15319 -2257 1043 8776 1529 -2271
14019 -2271 1992 4981 3939 -1124 -5248 -24 -3336 1921 -7445 -13412 -14013 -12130 -8690 -7513 -4034
14004 -4034 -6311 6224 17627 11819 11263 7723 550 -17668 -29497 -26307 -20061 -5286 -3661 -897
13990 -897 10321 31512 32576 26417 6912 -7599 -9259 -9758 7328 14702 9493 11440 17760 22584
13976 22584 33264 33484 16625 3266 -6469 -1491 567 -11562 -18058 -17473 -24513 -11982 -12143 -9801
13962 -9801 -1140 14590 17102 3827 10049 22184 18933 5211 -4711 -1438 807 -18846 -27474
13949 -27474 -19041 -19205 -26465 -29300 -24073 -12749 -11230 8106 16148 26948 28491 20517 18522 8980
13935 8980 -4593 -616 4928 15030 15367 3395 -12180 -15269 -6223 319 5104 8931 6972 13384
13921 13384 14800 20563 19355 14721 21689 16745 8272 597 -7013 -4321 1588 11769 1625 -7301
13907 -7301 -7235 -4182 -9528 -13567 -7191 6373 -2024 8625 8924 -5833 -9709 -3891 2985 7201 14121
13892 14121 13602 7311 7657 7742 4503 -69 9447 19496 10299 296 -7630 -11895 -14635 -9351 -9909
13877 -9909 -11314 -16963 -27606 -11943 1116 -242 -3301 2102 1893 1592 -1045 -14670 -20984 -23611
13863 -23611 -20749 -6448 -8883 1639 19589 15288 2592 -1257 -3419 -8106 -4961 -1651 -2593 3941
13849 3941 19492 17500 297 10477 25474 24895 31916 39553 28483 26607 25162 11827 12296 8369
13835 8369 9189 6945 9257 13162 2442 -9388 -10881 -7915 -9517 -3153 10840 14474 15135 15869 14631
13820 14631 2345 -5985 -608 9304 26441 30156 24040 21503 24850 26310 21582 7971 -6576
13807 -6576 1377 3832 7776 9140 -2241 -4185 16992 23036 18068 8054 300 -4428 -6077 -1261
13793 -1261 3820 -3702 -5601 -6469 -10704 -6903 12861 14435 15576 7037 4366 13121 23657 15217
13779 15217 14277 13387 18577 16103 5857 3845 2169 -6531 -3765 729 1437 346 -2497 10513 29704
13764 29704 20055 10045 1369 9034 17727 10921 -5353 -4838 11569 11402 18802 17163 11095 10632
13750 10632 8192 599 -201 1979 18455 16115 4308 -9773 -11022 -8127 578 5259 2330 4434
13736 4434 -4638 -13416 -14971 -9177 -8114 -9711 -11583 -5302 -3574 -1944 -14442 -17586 1824 15740
13722 15740 13309 7269 1004 -1414 -158 -5179 141 9182 11213 9256 6403 16285 20992 17986
13708 17986 19692 8862 -7036 -5592 -6820 -4438 2020 -1644 -5070 4523 9351 -7223 -12558 -8402
13694 -8402 1553 -3983 6848 20600 20353 21222 9148 9771 -7808 -20795 -26255 -19791 -6097 -5293
13680 -5293 -5312 -172 -3259 -54 -850 7325 8580 8015 12139 17455 6192 -11581 -7678 10472 12475
13665 12475 8175 10310 14049 14055 4759 -4993 -13888 -15531 -15101 -4824 1698 -4548 9040 11964 6661
13650 6661 1458 7464 8936 13876 12752 21660 16985 11141 7645 3776 -11107 -2804 6785 1151
13636 1151 3914 9191 19056 26038 26506 21262 21065 18007 20108 21837 22553 25674 36654 32516 19058
13621 19058 14263 8094 3547 -13229 -12576 3095 -3505 -12101 -8417 3858 9373 13110 18467 19922
13607 19922 14399 -3787 1395 -6141 -8277 -2804 -13293 -18363 -3627 -5563 -4010 7580 6473
13594 6473 -1567 -4596 7349 1328 4326 2015 2973 -1665 -8358 -3498 -2635 -6729 -8461 -18573 -13587
13579 -13587 -14416 -11422 -2947 -1571 15320 26237 19716 733 8714 11652 17383 12179 3717 -14094
13565 -14094 -14870 -18901 -14317 -1990 1928 14336 16042 21984 22453 20524 8972 -4044 -12871 -13421
13551 -13421 -19950 -17508 -26245 -27904 -27836 -15916 4436 8957 17923 17460 5749 897 1942 3562
13537 3562 11277 16062 2046 3227 18970 26179 21733 15310 8264 -6461 -18878 -15511 -62
13524 -62 11857 19681 29083 10177 -551 -883 -11392 2088 14963 13687 6877 -993 4651 12813
13510 12813 19214 17315 13656 5355 10397 16493 18867 18833 23083 27899 27630 26525 39199 42136 28406
13495 28406 21205 25464 38080 35430 44385 65901 75639 63723 68819 72981 70239 74426 78142 86970
13481 86970 113315 142009 153735 171056 185265 212615 258632 319701 394092 505645 637191
13470 637191 786282 930505 1024400 1017549 897608 721232 539886 390024 286955 203952
13460 203952 170802 149321 104124 74700 44426 26099 30477 29268 16957 18445 19379 21956 35284
13447 35284 41349 40549 32113 21378 20682 16274 24814 39480 40584 41350 30803 21034 25356 37260
13433 37260 32715 15727 22154 25904 25707 11316 21097 16591 8970 9146 8942 -2590 -3979 1835
13419 1835 5453 28786 33012 17570 13379 -920 2290 976 -10789 -9723 -8060 2575 13663
13406 13663 18827 23372 21355 22639 37446 25985 14132 12171 -2167 4796 17234 15795 21109
13393 21109 26239 21760 2135 -4530 -8048 -11963 -3458 6423 11876 9691 11694 5699 10956 7347
13379 7347 3887 20021 20854 17190 14931 9428 24963 22759 32797 39688 38354 38319 43608 30508
13365 30508 30011 22165 19286 19249 20063 26021 40736 41211 27081 9801 13635 15327 -1272 -143 4334
13350 4334 21336 14085 3392 7787 27535 44214 33127 16425 6703 6508 17153 15297 10551
13337 10551 17736 24609 31306 32819 34577 35114 43453 47163 29989 5080 3789 3741 -2645 6287 21889
13322 21889 31457 29898 16942 22140 30832 36518 37713 38942 27402 15925 6038 557 9289 28579
13308 28579 24577 7098 8655 12124 28386 27101 28691 35572 31614 38074 33269 23001 20722 21132
13294 21132 22593 32147 33031 34198 40330 49725 42751 27026 13961 31996 34618 26874 34177 34719
13280 34719 24991 10699 9216 125 -608 2186 6074 5835 12023 15952 17652 24106 20756 21657 20292
13265 20292 1587 5999 9738 12741 10965 8408 6438 14451 17483 16789 14028 7744 7961 11198 19983
13250 19983 24182 14152 9132 25994 26661 16915 16023 26280 24296 31452 30978 17782 18555 25268
13236 25268 36891 39392 33675 21439 7040 13355 35673 34933 19957 23731 21867 -882 -717
13223 -717 17189 18490 15927 9452 27406 57648 55908 52420 50467 38637 34561 40089 42733 40131
13209 40131 56399 67305 69345 49521 23359 18535 27877 36234 31631 34193 33133 34432 32579
13196 32579 34444 30420 27871 21530 16829 15511 13837 11573 16566 12584 14816 12642 16790 22881
13182 22881 21108 18617 16665 12481 19638 43879 47352 46998 44842 44815 49602 49018 55518 34018 24185
13167 24185 29744 33303 22617 15516 16791 24499 28544 30947 45443 68056 77533 72920 57257
13154 57257 53311 54555 57489 64858 67138 78847 78563 97990 101391 105066 126500 139025 166634
13141 166634 196829 231504 242698 235887 243416 273932 297297 330208 371730 418960 492958 610407
13129 610407 779231 989483 1222711 1439585 1588471 1606672 1503167 1291785 1010471 760989
13119 760989 563491 415697 325191 265526 211570 183816 162917 144147 132259 117364 115582
13108 115582 116644 104871 85257 83378 87050 87870 82702 72210 67648 64824 52742 54196 61478
13095 61478 65212 60069 47330 54297 60339 62255 61394 50887 53526 71992 77447 55612 57626 68312
13081 68312 65311 67942 55121 51248 62182 40356 21866 33656 32161 38005 50246 56351 70190
13068 70190 61812 43549 38595 33757 40061 38893 42665 52432 56788 55716 54807 59251 60893 50122
13054 50122 40858 28722 18404 27715 36147 40995 50332 44658 38138 25024 31786 38379 41219 43058
13040 43058 41937 54591 72851 67918 55289 44442 47918 53185 45998 53000 71674 60011 39443
13027 39443 39678 40013 49973 54189 57497 60444 74057 79773 70018 58394 71863 80722 63195 54892
13013 54892 51821 52999 42936 54926 54855 43509 38598 61288 64251 59968 59875 75761 76848 66689
12999 66689 72365 90614 73488 63215 70841 66151 72044 58848 52294 66650 70842 71789 82214
12986 82214 98161 96315 86092 81781 71921 68320 72904 50509 47677 51997 59878 60978 70914 69713
12972 69713 76880 77396 81961 63039 63453 71921 69052 67110 74169 76454 78999 70153 76837 75056 88316
12957 88316 97496 100715 100504 97927 107478 147829 196384 251834 279117 280083 279361 251325 207606 184003
12943 184003 173341 170931 157567 139966 132195 106488 86384 77762 82034 81862 82868 70842 78742
12930 78742 86837 101310 103056 97393 93699 98399 94077 88611 80357 78687 82003 78832 78815 80691 70916
12915 70916 66467 57591 50653 43382 49631 60196 70949 74929 64666 51198 59578 81830 90283
12902 90283 108427 120543 120009 122501 120247 108972 116315 109062 98156 91237 83625 69106 80539
12889 80539 100650 112742 126026 134034 143231 148651 168839 182814 213071 246025 273311 294766
12877 294766 329510 361189 369373 378737 387740 373670 346373 322680 286191 262242 244546 234602
12865 234602 241915 240429 230504 220121 201017 192885 194940 189644 181203 189185 196886 202341 210687 213554
12851 213554 212631 200921 185438 168759 156668 127341 118928 125714 126571 134309 138835 151184 160666
12838 160666 171579 193324 197253 199059 187097 182835 189469 196926 216538 228641 249816 279287
12826 279287 327738 384233 444782 493564 505369 498360 473619 441114 408016 386164 371986 356178
12814 356178 355455 366538 377628 395674 404257 401818 411285 432773 460342 483030 489524 501246 522299
12801 522299 530565 537304 564527 597825 639706 693821 764344 825308 893754 961606 1042952 1163183
12789 1163183 1299410 1415877 1534918 1658721 1755064 1800477 1797573 1730290 1637534 1540070 1422558
12778 1422558 1282719 1170281 1070285 982247 916233 880142 835857 813334 816363 828003 836098
12767 836098 837701 843025 857729 873094 903324 927328 947234 965753 997268 1041874 1108989 1173191
12755 1173191 1226519 1310939 1415095 1512673 1623559 1725633 1865705 2023653 2182316 2356657
12745 2356657 2537449 2729275 2922638 3081048 3222473 3332536 3377216 3402386 3428694 3459874
12735 3459874 3525853 3619728 3772600 3982015 4226994 4508440 4842257 5208100 5616179 6108824
12725 6108824 6668483 7331855 8081596 8935848 9905635 10983451 12192153 13560869 15091410
12716 15091410 16823972 18765939 20905431 23244892 25717165 28271607 30931367 33796328
12708 33796328 37077692 41101661 46256674 53050985 62283251 75210886 93611803 119298713
12700 119298713 153277662 194825561 239907580 279028398 299631812 293958679 262450166
12693 262450166 213014984 159376969 113795393 80886711 59131768 45042218 35637083
12686 35637083 29025276 24144459 20460966 17689448 15656197 14197472 13051657 11995836
12678 11995836 10883751 9718252 8537277 7415306 6451667 5665655 5043492 4537649 4144383
12669 4144383 3825757 3553485 3297992 3052805 2825790 2625087 2439197 2287954 2174092
12660 2174092 2073750 1990968 1937788 1885703 1790614 1701610 1605781 1530407 1457916 1384860 1311909
12649 1311909 1239280 1174777 1112893 1064940 1016099 979523 953363 920416 890085 854559 825350
12638 825350 820061 822863 823290 827859 820775 801938 762319 713312 669062 644399 620823 600932 572684
12625 572684 560047 558975 525135 493814 474061 466794 459045 437536 413404 413377 405528 390253 388206
12612 388206 392510 392754 396274 382774 373989 367463 353286 326857 290082 277113 269007 244740 224353
12599 224353 230109 231247 245544 259650 247817 234266 224884 229521 236504 240814 231401 207554 196831
12586 196831 176894 161653 152663 156615 155641 159726 167827 171345 164586 172725 204096 218599 217741 237597
12572 237597 241201 222449 178734 122563 72551 39670 60499 106269 155567 206798 259391 303542
12560 303542 328341 356362 387108 417687 458587 498998 573670 681800 808898 932823 1043984
12549 1043984 1183135 1317520 1386465 1373952 1281982 1125641 945996 781183 631157 499543
12539 499543 382069 325460 271508 228280 195804 166904 150073 131318 120987 123335 119435 113097
12527 113097 97612 96171 106068 116665 124791 135382 133793 117158 91323 76592 69028 65015 65509
12514 65509 72331 71706 79071 97020 100723 100015 95969 95209 115880 137807 139206 153747 145129 124780
12500 124780 106131 98242 78352 61731 58132 74863 73190 70676 77418 81517 74506 81238 79028
12487 79028 74348 80008 75899 96497 111822 108634 118808 128631 113879 106264 93350 79332 70018
12474 70018 59110 32433 28654 37233 32720 31098 37071 38877 41875 55619 58070 49507 42685 38003
12460 38003 38475 52078 46542 46202 51953 46339 37264 33788 37594 33795 28967 29200 25746 43341 56950
12445 56950 63835 65042 62930 65007 69390 61074 52586 32476 41010 52181 53112 63070 62638 59173
12431 59173 54105 43617 51738 55797 61346 57053 45529 37181 28892 23936 26636 32765 22613 13425
12417 13425 10562 3652 -1818 -12645 -17202 -2542 11633 3850 1180 7378 2937 -5492 -16716
12404 -16716 -21828 -22663 -12206 5684 11125 14492 14559 6540 -11956 -15735 -11751 -67 -8077 -14000
12390 -14000 -2119 8739 20385 31970 32490 35466 22921 26191 28256 21491 27411 29441 29307 33765
12376 33765 27335 9060 -3254 -8608 -3512 -10540 -18902 -24315 -8784 3522 19855 29543 34041
12363 34041 37630 31386 14030 18943 22199 17602 24464 23161 19096 5205 13208 27307 24238 37423
12349 37423 36171 36520 46955 52528 48656 41806 24223 17177 17991 23635 31970 36981 22282 12842
12335 12842 9527 10523 3371 9816 16153 24751 28498 31902 28020 28533 26879 17167 11649 18753 18627
12320 18627 13696 16056 16157 16629 24815 33049 31106 25977 22365 33202 34288 33913 25837 23364 40305
12305 40305 59306 48685 33385 25677 30112 40429 33717 41535 51134 47475 44178 44875 47296 57401
12291 57401 58813 50887 61816 72318 86499 87520 86094 101947 132787 159187 169003 169395 186570
12278 186570 209831 235806 272547 304234 371063 437240 524018 630724 742969 834206 857343
12267 857343 845776 914707 1066671 1280653 1536118 1775808 1929018 1951178 1849502 1605040
12257 1605040 1245889 884227 605002 422750 305805 225989 176787 133647 104907 96006
12247 96006 96684 102257 88748 85702 82033 85119 92509 77359 55424 44095 46446 44607 34770 25504
12233 25504 26011 32762 37193 44551 55333 58745 54524 49728 53392 52542 43982 48585 53561 47251 43116
12218 43116 48640 42049 42527 35451 22336 20681 15829 6090 17879 30444 29941 29023 15514 5503
12204 5503 7083 12540 26750 16406 906 9039 19518 9824 7888 8118 -3904 -5401 -876 5055
12190 5055 8416 22473 25715 11046 245 -5395 -13585 -14465 -17713 -21073 -13872 -15577 -19898 -24099
12176 -24099 -18919 -14718 -13502 685 15245 -6226 -12576 -4770 -1479 -2673 2125 10179 20988
12163 20988 13921 4181 11544 3209 -1117 -3521 -7394 5253 22728 31331 36524 32485 32203 36560
12149 36560 23380 22553 25253 17226 7992 24296 32151 23180 16197 21853 24920 23129 21951 19656
12135 19656 13167 1583 4118 -478 -6878 -3696 9114 5007 7309 23971 31559 24945 9572
12122 9572 10354 19396 24325 35334 31501 18309 6159 -3419 -11582 -23528 -14682 -13912 -23812 -5298
12108 -5298 16710 18754 6077 -10864 -9181 357 -5149 -18246 -3258 17450 3253 -2741 3616
12095 3616 -356 1202 13240 11454 8090 19736 10131 -5726 -12152 -1011 1142 -6484 -353 2262
12081 2262 -11975 -20498 -5538 -2027 7803 7363 -4350 -10142 -16562 -6706 -4587 1774 21596 23569
12067 23569 9017 6483 11989 28417 29177 25440 11348 -6765 -10112 -6155 -11810 -642 6241
12054 6241 24532 31165 32393 32966 18527 8351 803 -9618 -3527 4737 6381 -7544 -2428 13701
12040 13701 6807 -884 4509 -1093 -3506 -1498 -6716 -18338 -36648 -35702 -24818 -16464 -12398 -11102
12026 -11102 -9719 -10440 -3760 575 -8937 -16532 -1799 6243 10392 7256 10539 5168 4983 -5327
12012 -5327 -3819 15075 19560 10177 19043 17661 9324 8531 11988 9017 6031 -9234 -13138 -6360
11998 -6360 -6286 -18300 -9964 5955 1725 -12359 7521 755 -15659 -20298 -15450 -13935 -10325 -3658
11984 -3658 -6155 -26146 -31395 -34900 -32034 -24476 -19287 -13826 -6122 -5424 -16170 -8217 -6983 -9292
11970 -9292 -14523 -13091 1600 -2940 -16796 -20784 -4947 3100 -776 -14773 -4743 -5122 -12087 -17129
11956 -17129 -28255 -25044 -11460 -5729 -2506 479 -14293 -18666 -6805 7252 7598 2235 554
11943 554 -1938 -8853 1747 11902 6480 6114 -4115 -3160 -4197 7146 5294 -2009 905 -4553
11929 -4553 6743 17120 11283 -2322 6837 10769 14824 22607 18840 6192 6553 3094 3224 -5082
11915 -5082 -10020 -2566 2775 6635 7508 15071 1212 3975 7261 7088 -10163 -30523 -38330 -41232
11901 -41232 -32581 -26502 -26239 -16307 -23019 -33151 -25262 -25227 -12940 -1412 -2718 14220 19327 8752
11887 8752 -11234 -7620 -9091 -24630 -21680 -1766 9533 5816 -5643 -11217 -4821 -6480 -420
11874 -420 -5178 -22347 -20821 -15265 -11890 -5413 -524 6314 16658 15779 12558 8677 -4634 -4099 -4570
11859 -4570 -10492 -8567 8220 11426 2111 -2379 -5149 -11402 -5695 -6455 -5356 -15 -2690 -8827 -3630
11844 -3630 1341 873 -4029 107 589 -5781 2937 7575 7603 2577 -9428 -7835 -7448 -3524 -6745 -3891
11828 -3891 -4797 -9668 671 2119 -569 -1864 -3972 -9775 -17687 -23557 -18143 -14093 -18217 -23152 -16043
11813 -16043 -9182 -4763 -7180 -2835 -11296 -12372 -5045 2415 9419 3124 -682 -11978 -3631 7084
11799 7084 19212 14170 7361 -11043 -19958 -15695 -5366 -17110 -18804 -20316 -8661 248 -4391
11786 -4391 -988 5739 10905 12554 1533 -12024 -6738 -9333 2942 5057 -12141 231 10078
11773 10078 -2648 -19831 -30868 -21252 -19249 -12731 4942 5537 3415 22099 22246 16545 15526 23993
11759 23993 13205 5031 -1604 -879 -63 974 212 -4714 -1169 -1263 -18887 -16995 1534 10252 2810
11744 2810 -10332 -15796 -24609 -33881 -38421 -32189 -29176 -23377 -12797 -7798 -17401 -15122 2159 3588
11730 3588 -2335 2229 10493 8808 23715 33150 31797 20280 12872 18333 20933 12196 16434 5539
11716 5539 6113 17907 10798 7999 6778 -5560 -7535 349 -3373 -5133 12654 29299 25814 -462
11702 -462 -9588 -6718 -6411 -1249 7484 8806 -4274 -13788 -20287 -31115 -25633 1781 9148 2074
11688 2074 -3715 3446 8007 635 -2559 5997 3527 7621 18185 23458 13912 20990 16969 10378
11674 10378 15298 20389 18216 11365 19172 21575 19168 15588 16072 17464 15801 14491 6878 25840
11660 25840 29314 12103 -1868 -4415 679 2026 1076 9505 16244 27011 21598 5447 -9715
11647 -9715 -3067 -4625 -6217 1727 14570 8887 -5689 -11213 -2606 12625 16922 8985 1142 5500
11633 5500 3134 -6240 -3857 -2346 9951 9450 16009 13413 -3640 -3843 8467 4588 -5504 -3875
11619 -3875 4597 4218 12325 22747 14644 -3397 -20918 -15239 -16069 -12137 -6468 -13039 -11563 -5935
11605 -5935 -13634 -17703 -17554 -12216 12617 25233 26019 23301 22411 16706 9977 10896 4782 -5149 -12975
11590 -12975 -4084 -847 7870 11571 13027 19027 23728 15481 6528 9142 -2109 -6657 4302 20875
11576 20875 30568 32975 27604 33580 36669 47995 37004 31984 31982 21924 10419 12756 13203 11839
11562 11839 5980 1378 5477 17657 20953 8030 10290 23109 36945 56123 68483 62367 55794
11549 55794 40945 40185 53648 76700 93195 96156 95129 105064 120570 119823 118622 133740 148825
11536 148825 171834 209501 245071 306329 392710 490022 585700 654170 685217 664155 596854
11525 596854 484802 377040 287730 210010 164813 132231 112946 95520 83153 73141 72913
11514 72913 64415 43632 46627 55781 50280 44431 34778 35549 25807 20613 13094 10203 18474 16880
11500 16880 14556 17933 10727 21773 33098 22008 16741 21418 8397 5485 1841 -3405 9658
11487 9658 10460 12622 7782 9223 19999 10903 6050 5718 8772 13157 19441 16763 13366 13826 21030
11472 21030 33634 33867 26566 24179 19720 17714 20927 14425 16702 18985 24917 32934 28222 26928
11458 26928 39592 49106 32696 22217 21552 9369 981 1659 15891 20356 5779 5789 15896 6956
11444 6956 -45 -15397 -24020 -14384 -10942 6847 28795 25334 12763 7341 6012 9718 10098 12230
11430 12230 18251 21601 10430 646 9239 7214 2922 -1057 3667 21111 20463 20066 5468 -2917
11416 -2917 3238 -7761 -16374 -16291 -14597 -17810 -3336 11166 15725 25133 43770 36136 21101 17167
11402 17167 18852 17623 12095 20122 16470 17622 16524 24566 29992 13803 2750 8800 21254 24218
11388 24218 23198 32507 33089 23451 24328 26377 21275 30321 41545 39717 44512 44516 43153 43638 40177 46347
11372 46347 59973 71272 97991 121399 125111 104730 78026 67201 49837 24002 10198 23730
11360 23730 24337 24730 34356 46563 45203 45112 55975 53541 38118 22364 24875 14643 20332 19426
11346 19426 19070 20818 31409 38848 57990 66525 69476 76356 90947 107361 105062 95806 69908
11333 69908 36835 21175 30964 39817 38867 32094 26879 22028 9593 -1498 -10563 -15027 -10207 -12258
11319 -12258 -6849 1751 17016 20939 22336 27719 37633 41356 33277 10732 3958 5662 13170 14572
11305 14572 14053 16243 19810 25482 21480 13270 31446 38765 31590 21669 8933 3939 8653 3572
11291 3572 -12258 -1967 10246 21378 19143 12554 22189 29024 35611 36434 28103 27117 32477 29657
11277 29657 28933 14630 9232 6073 3705 11884 25083 26594 35707 39907 33576 26509 30419 28703
11263 28703 32280 31710 29652 21509 23441 28647 44332 47095 24246 16744 22891 25891 25616 24908 29876
11248 29876 31490 20612 12655 30456 56532 61361 46589 29230 27957 26522 32731 34993 21370
11235 21370 3204 12397 14119 7913 8529 17046 31327 31032 26689 33650 30057 28626 32148 37952
11221 37952 37249 18965 5370 32214 36008 20250 18673 34420 28673 22083 21431 17462 19954 37357
11207 37357 34665 41547 42413 37060 26310 19652 11635 15044 21308 32790 35831 39729 44221 50351
11193 50351 43251 30817 13535 7516 18752 15988 19973 32756 39341 35924 30752 22897 36748
11180 36748 58404 60466 46363 34407 44397 49199 44558 58665 64669 70478 97366 113921 137395
11167 137395 159597 168910 141567 107003 92036 77241 68295 57049 56446 55191 34726 40637 35632
11154 35632 31310 23359 16273 21105 45922 45408 50287 42632 34873 27146 42509 40684 38213 48935
11140 48935 51120 46049 51917 54837 68845 71553 70791 53819 42911 46404 69224 82270 99987
11127 99987 102960 103361 92533 84378 79562 59515 39476 37369 48563 32484 11951 11207 28587
11114 28587 41078 46387 41123 35379 30133 26019 25108 29780 22628 17823 15044 19479 17246 22249
11100 22249 37417 38157 28353 34512 26873 24381 20461 19776 34216 23842 10919 4660 3203 17675
11086 17675 12826 7448 12591 19313 21379 38380 49643 39086 26701 14883 -1950 2992 11034
11073 11034 18845 34150 47927 53136 57967 45086 28086 27028 16550 8281 3366 16284 27656
11060 27656 35733 39150 35000 39386 41051 42858 59949 62900 67064 68099 38399 27908 28464 37898
11046 37898 41320 39740 44181 39996 39037 46832 47659 40787 36199 49408 56369 49203 24582 28362
11032 28362 43748 51721 59217 58680 42901 44045 53388 56077 60900 65456 51285 37278 16096
11019 16096 29017 33333 41651 64277 69768 54905 43140 52631 51833 42515 43817 36374 33686 52777
11005 52777 58071 62208 52679 43122 45129 39000 56479 54350 48678 37080 24552 22974 29923 27108
10991 27108 28648 43635 52220 62794 81141 93890 108096 97600 86465 78604 80318 77371 78887
10978 78887 80206 83355 89942 109138 119845 140472 145357 159365 174830 181247 194395 208476 206372
10965 206372 205578 218285 213668 212088 213009 222424 245820 267482 297852 347131 385311 427506 481779
10952 481779 578947 713712 907760 1155052 1493432 1907150 2332163 2681302 2778091 2466799
10942 2466799 1936020 1410059 990142 701624 524331 408029 333781 275432 236526 208816
10932 208816 190945 178968 148707 144629 148019 135401 121163 109784 121080 119822 118682 115626
10920 115626 105469 105523 115697 102811 95079 95298 97627 103256 109663 108181 99852 96392 90137 81737
10906 81737 88694 94803 102820 93675 85187 70701 57363 61507 65437 74424 71779 78111 86811 95177
10892 95177 99718 88073 69590 71687 61991 60979 74496 88590 90293 79008 72978 78208 78978
10879 78978 83509 94143 93566 85714 83739 80132 91228 105831 107370 95231 85622 75718 81753 62233
10865 62233 63962 76806 78614 81061 102269 110586 114528 118754 110803 96148 84482 94996 85575
10852 85575 79656 81671 93234 103055 106868 102843 106997 106674 98781 93444 82136 69325 73001 83586
10838 83586 87277 86177 81907 82964 71998 75222 71524 75548 83558 87906 117504 129533 131544 130166
10824 130166 129299 121796 123685 116824 112424 114700 113230 111702 110705 108840 117968 113549 105594 94510
10810 94510 96170 99729 96860 101661 111046 97913 96328 88908 88183 90904 84375 106841 131933 142473
10796 142473 140810 133203 125952 101010 91403 92477 105700 114851 116426 113681 108038 111478 126379
10783 126379 152291 183447 222575 287397 342395 396400 439086 448093 415781 354713 296787 243514
10771 243514 193404 164852 151674 162680 148965 135670 137397 145847 139080 139556 138527 121096 113025
10758 113025 106656 107606 108849 131528 134799 149155 149730 142935 127114 122774 124949 132110 119986 110347
10744 110347 112380 112141 95671 85718 91970 99850 98216 108450 102061 94227 108444 131830 152677
10731 152677 179770 180916 173175 170453 173818 168227 164836 167021 178252 178297 165961 156235 132927 110451
10717 110451 101263 114785 132643 140067 115773 106467 125011 149080 166204 181433 192799 215282
10705 215282 228305 221904 230112 234239 241402 248339 243327 245608 256865 258791 266063 277247 277807 280889
10691 280889 297028 306401 295161 294004 290625 292659 284480 288269 287273 292517 300908 308449 312242 301130
10677 301130 273006 253376 240933 237599 229953 246894 264156 271695 263566 227887 247102 266513
10665 266513 284490 297433 300056 300807 306784 313968 317868 334686 345666 365687 433102 538573
10653 538573 662237 760576 836395 837391 777486 680326 608029 567948 533656 506872 485415 469096
10641 469096 482505 497817 517350 532603 553493 548543 548967 559110 559407 558096 550880 542985 539688
10628 539688 551600 559608 563259 574346 601299 625604 633140 634631 648686 663488 686238 699735
10616 699735 707933 699192 690740 693276 705071 709210 708256 701534 730492 768477 797332 832826 853196
10603 853196 862797 874573 891200 918169 952427 980764 1026939 1075784 1119826 1151112 1166303 1177388
10591 1177388 1187536 1205817 1210700 1225631 1267498 1338893 1422788 1515001 1623695 1743839 1849909
10580 1849909 1949789 2064046 2197652 2308137 2422875 2546036 2687759 2830607 2944003 3073152
10570 3073152 3212667 3355342 3488817 3625116 3785912 3991230 4233172 4509633 4846235
10561 4846235 5228620 5675422 6168694 6701867 7252165 7851393 8536020 9342283 10269966
10552 10269966 11322376 12522819 13906474 15507745 17309615 19312128 21507568 23924899
10544 23924899 26533507 29238137 31952768 34620303 37423773 40702663 44666508 49360415
10536 49360415 54826991 61370371 69645042 80625863 95642971 116859473 147676409
10529 147676409 192113508 252089825 324867029 403888282 475427851 508457473 472219396
10522 472219396 378971878 273451509 188408925 130590417 93640489 69918295 54139541
10515 54139541 43183880 35237669 29274215 24741781 21374050 18893145 17071665 15730917
10507 15730917 14690093 13752083 12696816 11435667 10056600 8776022 7712210 6887073
10499 6887073 6266766 5782260 5354359 4958852 4577902 4222745 3905396 3599076 3323052
10490 3323052 3104211 2956222 2864157 2769984 2651576 2511859 2354485 2195305 2051133 1903235
10480 1903235 1765213 1650528 1532393 1447524 1385610 1327536 1271102 1248716 1242396 1236077 1214357
10469 1214357 1189968 1164351 1134083 1103667 1114257 1131146 1146780 1136070 1113719 1082931 1027009
10458 1027009 966975 908231 865226 814464 767134 738926 718984 704193 664970 635814 620564
10447 620564 608663 589316 566168 545539 547215 562046 557188 551522 523279 502834 487039 466118
10435 466118 456939 441104 415146 365725 326831 297946 281188 281490 286862 302316 320204 331744
10423 331744 333255 333907 331795 318124 310188 297168 269268 246630 228341 217081 202215 188034
10411 188034 186710 196216 216892 231640 228518 216534 201744 198095 204635 237119 267267 285111
10399 285111 258527 146031 -18427 -144316 -165833 -86710 20361 99536 146642 175876 186712
10388 186712 186243 206745 217008 216287 204037 198702 185930 204642 232128 235721 213674 209456 206782
10375 206782 186794 157955 125117 107087 103322 104515 92762 74753 74368 80311 81894 66144 62607
10362 62607 61009 52420 67619 66080 63091 56847 46742 54086 60894 67348 74827 73825 71279 50313
10348 50313 56853 71945 80515 79659 98195 101255 98299 113842 140490 152345 160513 153223 123079
10335 123079 135054 194201 228541 220628 187942 149210 121519 100241 87064 83187 83355 90026
10323 90026 80677 83686 81122 81957 86055 89570 101966 107215 101597 109858 122169 127586 121045 131064
10309 131064 158540 156505 140759 129163 115775 101474 91863 93882 89735 73688 75293 77007 67105
10296 67105 63780 67323 78427 72582 69287 84527 83332 93612 93938 84384 82697 84035 82019 92102
10282 92102 95528 93311 87682 88676 88658 104159 133819 166593 195130 212474 227997 236560 238758 246761
10268 246761 258765 292615 307205 315950 336701 366471 395357 419125 456450 506975 588973 688696
10256 688696 816786 979506 1196167 1449380 1732654 1974634 2102435 2099936 1938827 1660061
10246 1660061 1339253 1044677 820875 649292 533610 460386 414360 381943 360469 368049
10236 368049 389054 405387 404374 408164 419007 424199 427698 429088 452546 475023 487827 530484
10224 530484 575771 619305 690046 765520 852488 954798 1063235 1190968 1384028 1628518
10214 1628518 1927326 2311033 2767190 3284482 3816691 4291398 4633890 4722006 4517425 4048045
10204 4048045 3440295 2819936 2249097 1794876 1443635 1170882 947935 794549 685741
10195 685741 601025 520909 456716 418599 390645 352362 298084 250365 233116 221009 207762
10184 207762 197243 191104 182576 169089 144145 126119 128962 102300 95216 86162 86830 85570 68881
10171 68881 54685 33826 32356 42143 54158 61956 62829 68850 61503 42481 27200 34200 33911 38026
10157 38026 44554 45060 40899 40735 54506 67853 60189 58958 59755 66211 50518 37718 27954 11893
10143 11893 10169 22371 25754 13888 12611 16887 25983 20963 30953 52178 54198 52184 56135 46400
10129 46400 66063 66006 57419 71303 82342 82475 98482 103012 103814 109872 120295 115698 141767 158457
10115 158457 176997 202358 218691 239210 259094 289322 325469 366173 423235 472532 571165
10104 571165 704490 875949 1133550 1483135 1891043 2303362 2632189 2684255 2361188 1819392
10094 1819392 1276022 880675 628223 464806 355755 286631 243172 195315 153972 115817
10084 115817 77375 54601 55898 56932 59267 46321 47755 44207 30114 24760 22799 19037 21767
10071 21767 5910 11253 12691 9704 -1649 -4665 -1594 -5159 -5680 -15078 -23036 -25670 -13464 12426
10057 12426 23941 25906 28862 31584 28893 27137 20090 16928 13706 5899 3139 6996 19169 24139
10043 24139 15116 19073 16242 7514 13565 21031 10483 13951 15999 19868 28108 18799 17353 9439
10029 9439 2467 2958 -2366 -11921 -717 10643 9215 -1390 39 11178 15501 21145 32418 30719
10015 30719 14805 7086 11802 19897 23226 8122 -4394 6384 19075 -7493 -22570 -27435 -31397
10002 -31397 -22326 -18296 -10368 2096 -1805 -8077 -13629 -17198 -23552 -23480 -11838 -2107 -174 6855
9988 6855 2016 -10922 -20442 -13838 -12273 -25157 -3209 7189 11978 8501 3322 10596 17568 18081
9974 18081 2968 4405 3421 -3696 -1356 1933 -10257 -10930 3069 3907 3543 22611 14365 15604 4371
9959 4371 -8135 2988 -4051 -14978 -9252 -11147 -13602 -7914 -9055 -1719 7878 6354 7967 4525
9945 4525 5468 6195 1057 -21038 -23699 -14282 -10453 -16544 -28244 -39025 -40026 -25727 -32333 -24307
9931 -24307 -32318 -27987 -28173 -14476 -1351 3717 -8502 -30919 -37147 -25648 -29237 -15537 -11265
9918 -11265 -6917 -8161 -1783 19393 26882 10000 -17756 -27926 -27940 -29243 -22530 -21251 -20319 -22978
9904 -22978 -14150 -8838 -8877 5395 -4829 -1967 4251 -1055 4913 21823 19250 11282 1640 5043
9890 5043 -4378 -11812 -12078 -14118 -9134 13734 -953 -21892 -6722 18713 6493 -18087 -15131
9877 -15131 -3875 -9007 -16618 -8232 -18094 -8047 -7053 8988 23514 18459 4420 -9862 -9973 -5838
9863 -5838 -8506 10392 20452 19105 24786 20223 11687 5691 12470 5966 5693 6137 -1200 5605 5456
9848 5456 18048 17166 -2774 -11849 -5087 -4390 -7113 5943 7770 145 2865 14244 22893 18927
9834 18927 7239 -8892 -11085 3660 17979 20063 15154 32810 50666 45351 50630 59183 70172
9821 70172 46445 24988 16706 20665 12520 15774 6150 -3741 -12238 -21390 -15483 -14573 -4673 -14369
9807 -14369 -23328 -25531 -16570 -12170 319 -1911 -14032 -6034 -12230 -26108 -3885 657 1945 6616
9793 6616 5229 5627 9454 12682 6327 10371 19755 3254 2679 15098 28142 34269 43789 46193 47432
9778 47432 38876 18601 6580 8569 18637 8815 -4839 -6733 -22172 -23737 -4810 -2497 -3945
9765 -3945 -4593 2136 -5730 -8549 -15447 -24881 -22673 -14067 11455 -1127 -3242 5301 4016 11418 5940
9750 5940 338 -141 3017 667 5682 -3027 -8565 3454 5583 3031 -5524 -7061 -4477 -12394 -10540
9735 -10540 -1076 4102 -8390 -15486 -9142 -4372 -7316 -9277 -601 21620 23575 26979 32166 37379
9721 37379 38966 29958 10377 4491 43 -14764 -16654 -4995 40 -5296 9072 8938 -11831 -22539
9707 -22539 -14493 -6721 -5507 -550 -15 11571 27893 25524 10846 21161 31222 24308 21124 6669
9693 6669 -11797 -1159 15875 6731 1265 -2627 462 -5907 -7786 -5699 2321 -3831 -8871 1249
9679 1249 2897 -1774 10434 11647 6631 2333 -8626 -12146 -2459 -771 11114 13753 13651 18400
9665 18400 17957 16092 19025 10266 3737 -5632 -11570 3928 13051 11439 2083 -6969 -4606 2287 4741
9650 4741 1993 2157 3007 14134 13005 12390 16178 7772 3761 4803 7554 23068 27113 11141 3545
9635 3545 -1628 1393 11500 1819 -1226 -2581 -1342 6554 9654 6593 9730 6777 11642 13089 22681
9620 22681 14270 5741 8848 7169 4373 2207 2430 12995 14270 18270 23927 8525 -5241 -6388
9606 -6388 -3329 5582 8089 4548 -5362 -9071 1862 4391 -4751 4342 7722 4459 15276 18029
9592 18029 25005 23188 18284 4523 6746 23904 32812 25878 21447 29284 20293 -1984 -14610 -13195
9578 -13195 -7967 -6685 -6088 2266 -2884 1084 -3172 -8666 -7437 -17553 -1144 8579 14344 26637
9564 26637 16785 19758 26182 29225 17827 14727 31026 22927 14858 12163 17303 34836 34696 31384
9550 31384 32331 27849 17239 -933 -6806 -6668 -2522 14755 2682 -4106 3469 -7450 -9204 -8449
9536 -8449 -11839 -7663 -16483 -17109 -16866 -13459 -1119 18938 21863 11380 6563 2345 7669 15043 14393
9521 14393 11719 15900 7809 7260 4682 9705 32533 38576 42279 44049 37075 38481 32199 30504 27390
9506 27390 15921 15694 11091 18047 4971 -6472 -7465 -6420 -12521 -12808 -6670 -9641 4287 3847 11364
9491 11364 22638 4304 -7396 -12952 -7469 -10847 -16073 -27570 -21635 2702 9374 6240 2913
9478 2913 -10182 -10377 -8170 -16897 -14555 -10813 -3549 611 -2921 -11038 -1579 5709 1383 -14329 -9027
9463 -9027 249 12229 15323 13778 5828 -9471 -5518 6193 16190 22801 20929 15705 5891 9296
9449 9296 15796 5186 -3108 -11396 -4961 -5957 -4607 11075 24420 32093 31919 19779 24566 26310
9435 26310 11870 3190 -1665 -18917 -13659 -14686 -11489 -3310 -4455 -6044 -7964 -5083 -13292 -11571
9421 -11571 -8580 -5015 -9248 -17055 85 7649 -6830 -8331 17935 29450 19979 7179 23825
9408 23825 31010 29705 16345 2734 -2390 12479 24217 27552 34175 42682 48606 46163 40633 31274
9394 31274 31591 28065 40430 46859 37208 40960 31605 35564 54806 55884 39291 20303 21542 25728
9380 25728 28533 43459 43358 40673 16661 13959 17029 28838 32577 29093 20661 17901 18769 12544
9366 12544 22875 29185 32426 33590 28730 28377 31735 32651 23081 26123 39809 51876 50746 35372
9352 35372 34491 43524 45054 41222 32480 26475 30847 33662 15414 16062 21524 43274 48729 44484 35245
9337 35245 24084 21672 19719 17228 24702 25814 23912 40485 45765 39276 32854 24250 20923 33618
9323 33618 46519 52437 58455 61288 53318 46131 39942 53332 67046 66800 55125 63197 57623 50415
9309 50415 44486 41695 39005 39344 37210 33973 46643 62215 67936 61123 54705 52830 65744 75684
9295 75684 64886 55429 67098 60571 54192 53521 49522 48609 47958 50168 61657 64846 62384 71995 64781
9280 64781 52555 57588 65444 55455 66166 83568 88118 89887 88199 81865 80648 80670 77598 79932
9266 79932 71364 66259 59462 68907 66429 65674 75218 78919 68209 60374 68540 82450 98105 118472
9252 118472 134810 144960 153121 154624 159951 146319 121990 115440 109967 104304 101996 102109 105745 111999
9238 111999 116256 103644 89006 86826 79702 78293 93413 93819 84777 82699 71644 68264 69493 78848
9224 78848 91564 84309 80248 102458 97174 79032 70759 74650 85351 72727 48247 43006 56137
9211 56137 69745 67056 69214 65293 67825 84566 96666 97937 86406 86474 96747 95751 99220 109028
9197 109028 104760 104483 102567 107535 100129 97440 94977 76228 81691 96450 92700 82581 83771 85066
9183 85066 84527 84876 97142 113061 120410 112869 115328 123926 118338 114336 116675 120452 128740 148035
9169 148035 150419 153914 147725 138912 136246 146369 150552 152952 174124 183718 169811 166654 171975 172048
9155 172048 173381 166756 164615 169530 172543 158302 141810 147470 166651 180133 177607 164219 156824
9142 156824 166809 183196 190413 183381 190434 188719 202939 212724 204434 211441 211760 202329 200896 224112
9128 224112 246613 262601 286366 299562 309645 324936 334713 320136 321457 322242 323717 322114 319176
9115 319176 324289 331427 307684 293988 301668 302978 299273 303000 307276 316438 318330 328110 336679 338140
9101 338140 339065 334256 334238 333432 344797 358963 375592 402662 400361 400676 402513 417600 433209 435400
9087 435400 447551 446947 441736 444492 448629 461913 477754 482611 485136 512795 535584 558827 574239
9074 574239 579083 578365 590887 594262 612707 641529 653958 678571 699788 705565 735884 761084 785997
9061 785997 805621 824243 846831 881832 908000 936358 986051 1037839 1072827 1129300 1177488 1243248
9049 1243248 1301109 1355701 1423076 1487386 1557774 1633247 1704108 1775527 1861744 1959829 2053190
9038 2053190 2150959 2249931 2356411 2493849 2650868 2806246 2986228 3192588 3416501 3675039
9028 3675039 3953127 4243858 4570239 4938249 5339721 5771585 6266070 6824179 7435327 8110853
9018 8110853 8857400 9675517 10546847 11508641 12570155 13761214 15084564 16587002 18313915
9009 18313915 20285656 22534412 25140282 28256153 32058461 36741625 42599463 49975213
9001 49975213 59210653 70513121 83676505 97806379 111176359 121081461 124323661 118896354
8993 118896354 105899889 89118712 72385694 57922133 46355512 37426507 30581121
8986 30581121 25320171 21235751 18009287 15424897 13342550 11661181 10294404 9143140
8978 9143140 8176673 7336947 6619308 6000008 5454699 4973655 4559169 4202351 3890853 3628003
8968 3628003 3378521 3149587 2936071 2742062 2562877 2392106 2263681 2141474 2009364 1905928
8958 1905928 1812828 1722241 1634945 1555899 1461568 1373359 1310864 1259055 1206199 1147223 1093367
8947 1093367 1048552 993266 953839 928765 903847 865561 836386 823474 805530 775465 762076
8936 762076 749526 740651 711668 686217 667462 646926 625452 600114 560476 538553 521290 504355
8924 504355 512415 506512 491579 470363 449874 439725 426501 412181 389120 397991 403131 384385
8912 384385 368482 348119 351511 348964 336303 323695 307446 281718 281940 276108 250904 247354 257841
8899 257841 236082 223346 229793 230952 229221 242403 234248 230822 216557 207094 213822 208381 194846
8886 194846 188990 182108 178408 177507 164852 152969 149531 149413 141642 154760 163421 159552 154929 144396
8872 144396 151970 161313 141529 103513 81070 71382 71803 83667 103397 118457 129392 140748 159189
8859 159189 170482 159804 153155 154805 143262 144962 145706 162600 157801 138981 131076 130352 112212
8846 112212 120328 134887 135910 147236 152070 155875 162232 162877 170586 184315 195899 207988 227365
8833 227365 272052 344490 443813 564308 704959 862393 941971 882794 698664 515162 382729
8822 382729 291199 233697 193589 174028 155446 135392 104286 100052 99199 104500 102661 105661 107033
8809 107033 106332 100441 104028 102898 86989 87239 96886 90023 92118 70289 67036 64711 56220 55575 60182
8794 60182 49717 45800 39288 35862 37616 46613 45003 38212 37265 27120 38324 29804 23684 26180
8780 26180 37213 40318 37069 21310 20973 25382 31072 29029 35258 31893 39648 44467 46776 53783
8766 53783 59472 53995 44777 38898 35544 29781 36947 42295 33555 36235 50429 36306 36985 44241
8752 44241 43742 31978 36685 24933 7354 16712 23875 25288 36688 46681 54517 44202 34286 29116
8738 29116 29311 30268 33530 37704 32992 27744 33346 33990 38151 46229 42321 24617 22886 20854 24231
8723 24231 20205 8539 7715 -4228 1454 7142 10793 7777 8623 -3559 1032 24507 14386 -6777
8709 -6777 -8711 -3817 6476 15503 24289 10639 4858 -3662 137 5471 15616 13404 -2100 1693
8695 1693 -405 -5307 4713 14159 20499 12100 1634 15035 23809 22175 17549 10645 2031 -1997
8681 -1997 -1585 1082 2430 8564 25034 22399 21121 8384 13724 22649 33965 36384 46786 44253
8667 44253 54586 60505 60229 65405 51592 31013 19761 24277 20880 21984 23722 18296 17022 23164
8653 23164 21884 29594 42988 51719 62314 71189 51453 33768 36845 49547 50638 50548 46177 43967
8639 43967 44608 41129 27619 21385 24138 25773 19763 12075 18211 19146 21135 15894 27332 35846 37237
8624 37237 31341 23236 28373 35741 25304 13592 25795 27239 30954 43776 40462 35350 24062
8611 24062 21787 31825 28607 25641 23375 15018 17125 20392 16799 28393 40149 34448 41633 49694
8597 49694 47660 52075 56743 47261 41489 46188 47769 52968 61176 67604 67277 68847 70674 65149 74088
8582 74088 72208 79257 99626 101342 95803 115302 120931 116898 126088 128797 125791 126467 122927 118367
8568 118367 116959 115528 115100 107307 104813 105792 112623 112895 92466 90471 96415 81613 67198 54505
8554 54505 40296 36454 43573 39221 39564 23818 18880 17336 29588 26686 35432 35084 12189 8049
8540 8049 14278 14096 7449 12025 19449 20434 8638 4978 7193 11068 10409 15362 13851 28749 23355
8525 23355 5162 10777 8499 16159 16616 29102 44397 39989 30511 24392 22321 23389 18177 7924
8511 7924 3957 3152 -9688 -15381 -13630 -11788 3012 16633 21353 15698 -2936 -6871 -1903 -2213
8497 -2213 -11236 -6229 -10886 -9571 -7111 1101 4650 4856 10621 214 4255 3591 -1005 2417 6015
8482 6015 -921 -8821 -13106 -15117 -15967 -19065 -23435 -11051 -1857 -2343 10611 19817 2093 -6709 -6873
8467 -6873 -15710 -29556 -37605 -42030 -37123 -25472 -18470 -15313 -6108 4497 11417 10638 2923 -1537
8453 -1537 -5525 8231 431 -5777 -5557 -7876 -15849 -12532 -6455 -9841 -19329 -16659 -20192 -21407 -16698
8438 -16698 -9259 -4597 -3272 -9779 -9737 -502 7798 13985 3147 5000 -7586 -8434 -9365 -8124 -13268
8423 -13268 -12883 -12640 -13891 -22158 -16262 -11467 -14966 -15376 -28846 -24145 -10645 -5669 -15727 -7510 -4842
8408 -4842 -13506 -16157 -6449 -122 2521 -945 9838 25396 12931 2078 -785 -18918 -36844
8395 -36844 -23162 -9997 -1498 -7225 -6744 -13588 -8397 -4123 -784 -4300 -617 676 -10925 -1233
8381 -1233 4757 5823 12238 12354 -3592 -1251 -9270 -5466 9751 532 -13728 -6858 2597 1914 10578
8366 10578 9683 6333 6377 7088 11834 15698 -14146 -29768 -12259 281 9908 28226 50001 66951
8352 66951 66307 60824 29155 -8402 -31841 -34285 -7959 12335 27726 2833 -20904 -29065 -19908
8339 -19908 -20400 -10194 6889 6922 -2934 -18272 -29441 -23424 -5703 -9257 -12897 -21118 -2457 2788
8325 2788 -4774 -15833 -12380 1195 1223 6968 3360 7216 -5345 -3362 -1421 -6440 -17277 -29152
8311 -29152 -32876 -22702 -21974 -24789 -16696 -2092 8832 11070 6447 2548 10805 19728 7650 3307
8297 3307 12016 18868 9268 5526 5867 10712 15026 8308 -2993 -308 9816 14720 9998 5923 -3459
8282 -3459 6195 7133 4689 -1123 -4358 10099 7882 -8256 2723 5177 -2012 4917 13745 15020
8268 15020 11205 12619 7000 -9918 -6338 6302 19858 11794 18492 12708 5528 -1843 -3876 6692
8254 6692 11655 3035 9201 1236 -3968 -976 -2338 -7913 -10592 -10563 -2642 -8 7 2817 8794 13878
8238 13878 11145 28964 24346 14013 14703 9444 9547 12337 13085 17119 20690 19421 13036 17040 9461
8223 9461 4082 1490 12807 19180 19647 741 -19330 -14220 2953 15792 6684 -558 -12581 -22272
8209 -22272 -24706 -23511 -32398 -28536 -29982 -32849 -28438 -29245 -20911 -9685 -16959 -23464 -20410 -9301
8195 -9301 -1935 105 -4470 -1922 -1744 3567 -6185 -9376 -5110 -1658 933 -3133 -8254 -13060 -5553
8180 -5553 383 -7942 -8502 -10686 -6979 -15087 -9645 -4825 1343 8232 -2002 -18491 -14855 -6631 -1931
8165 -1931 -7595 1937 1705 -3946 -3132 5318 6815 -6863 5866 7119 -9376 -12592 -8728 -19438
8151 -19438 -19474 -20207 -15264 3923 -4157 -3208 -8096 -4522 2448 7199 6953 7021 383 -9489 -8354 -3420
8135 -3420 -10407 -19023 -11453 4838 7859 4345 155 2754 5272 15195 20936 33411 63608 74431
8121 74431 81796 102462 105423 75939 41891 26852 29911 23572 14654 20955 17592 26898 26284 11471
8107 11471 -5918 -2845 8852 11278 6438 5250 3022 14967 11319 8904 -2477 -14146 -19293
8094 -19293 -5385 6862 5501 -7672 -17678 -7975 -2392 -10220 -7476 3660 24547 35404 56691
8081 56691 66568 91523 114506 104387 86587 68312 52381 27831 22856 25912 25380 21597 10704
8068 10704 20680 19030 11970 23695 41610 43303 40808 45682 40948 34882 40729 20778 -4724 -8265
8054 -8265 -3608 -7495 -10995 9450 10541 6455 13130 17631 20221 5823 -1032 1092 7078 16392
8040 16392 25371 19679 12174 15985 17702 24220 28251 42372 64334 69689 58540 43336 17091
8027 17091 10674 16546 23481 36273 40448 27438 20908 8409 10791 17903 14082 25287 40729
8014 40729 49241 59925 55466 37387 30421 40604 51924 52689 52575 45586 38936 38991 38164 43887 46790
7999 46790 49204 51559 42090 47811 53535 51366 52079 50192 50160 50729 55266 58222 52817 50973 58314 52148
7983 52148 41716 31375 29405 31189 34030 42710 52798 61044 58417 61642 64664 66289 90980 114753
7969 114753 123813 127981 116364 85801 71074 68297 59870 59661 49294 55168 45980 43468 42873 46529
7955 46529 39460 13524 637 13022 13154 10422 18189 25883 35040 34170 29368 27610 44883 44889 37428
7940 37428 37413 45611 51985 54969 62816 70920 80871 74166 73080 67347 65221 67764 53875 61601 77150
7925 77150 66902 72978 75368 64860 64267 58011 54221 38547 26541 26420 19093 43552 54126 34442
7911 34442 29601 35199 33768 20013 15706 4853 -562 -802 7895 11899 19173 21693 19640 24802
7897 24802 32560 39557 23531 4317 6811 18524 25053 30694 22009 31281 21814 21490 28767 33439
7883 33439 20939 10861 13664 14382 14477 20551 26873 16790 11772 11834 8027 7493 10805 8050 7963 7666
7867 7666 15815 13869 2852 -9190 -13008 2136 -4857 -1581 1596 -9903 -28481 -26710 -12213
7854 -12213 -5600 -8354 -16380 -15657 -15638 -14089 -23380 -5025 -1651 -16704 -32305 -26260 -15650 -9718
7840 -9718 -17459 -17312 -12624 -7793 3740 -5626 -22093 -32175 -27880 -20328 -8556 -6805 -7746 -14190
7826 -14190 -22827 -26076 -17100 -12786 -18015 -22537 -8484 -5060 -8459 -6336 -13808 -7656 4256 -11516
7812 -11516 -23330 -16215 -2824 -9286 -1682 4900 7182 -3956 -16480 -28006 -24484 -20064 -18089
7799 -18089 -12623 -10872 -13387 -10428 -2419 712 3040 3720 -2216 2576 -4176 -5240 544 2408 -10555
7784 -10555 -5917 -5840 -15120 -16774 870 6640 -4223 -16146 -30274 -26407 -18204 -18170 -19942 -12654 -7205
7769 -7205 8820 10115 4587 -9244 -20091 -14744 -14086 -4759 -3617 -9294 -5803 -3592 -6712 -10675
7755 -10675 -2869 -3355 -7187 -20681 -33996 -34898 -24555 -24053 -14366 -3799 -45 -4809 -12924 -29447
7741 -29447 -31202 -32275 -17140 3758 5063 -6101 -760 2775 16057 18991 12675 2600 9417
7728 9417 9665 2567 -4181 -5786 -8649 -8149 -23213 -22082 -22177 -21201 -18252 -13321 -4901 -1156 -5893 -8425
7712 -8425 -5669 1650 3632 -7727 4914 4564 -341 -14531 -34537 -26549 -3688 -3090 3113 584
7698 584 -613 1423 7928 4275 -9077 -10223 -9215 -14080 -24574 -35610 -34716 -24837 -21817 -26901 -25385
7683 -25385 -23333 -24711 -17071 -7949 -3212 3914 -1808 -11612 -7086 415 2111 -3945 -8444 -4565 -7599
7668 -7599 -15536 -24015 -39125 -37123 -28528 -25716 -25436 -23878 -7281 2357 759 1392 7022 -5733 -14731
7653 -14731 -13065 -6021 368 -8696 -25561 -31982 -29245 -13916 -5085 582 974 -7638 -10814 -2024
7639 -2024 768 -8049 -7752 -8971 -7129 -10292 -4760 419 -107 706 -6186 -17984 -24754 -27694 -21270
7624 -21270 -21596 -27504 -22756 -19334 -34159 -43102 -48546 -36414 -26908 -20461 -36594 -32188 -12566 -4502
7610 -4502 -301 1158 -2822 -15409 -19488 -13924 -13059 -20569 -34044 -41520 -37723 -29598 -28459 -14363
7596 -14363 -11309 -16003 -23554 -28445 -39804 -36631 -39646 -39385 -31081 -19066 -14003 -14140 -13606 -9964 -22022
7581 -22022 -26768 -18024 -20800 -23490 -13753 -14228 -13815 -15572 -15292 -13908 1783 5399 -12361 -18713 -7276
7566 -7276 8196 25757 22939 2021 -1864 884 -1749 -473 730 -7982 -18607 -9824 2563 5157
7552 5157 -10761 -17489 -6222 1797 4321 898 -7644 -13150 -12800 -18614 -17993 -6156 -3641 -2186 -10714
7537 -10714 -20958 -22913 -24494 -35001 -20118 -15085 -18469 -14624 -24981 -26331 -13465 -10199 -17232
7524 -17232 -10747 -21206 -25998 -24605 -25979 -28998 -35657 -32062 -21974 -10249 -9488 -15283 -19990 -7790
7510 -7790 -4410 1090 -2536 -7211 -14390 -14491 -14598 -17649 -17938 -17363 -30306 -41742 -43137 -29620 -25635
7495 -25635 -11237 -1926 2706 -15144 -20603 -23900 -26766 -15603 967 4271 3047 -2649 -10122 -18424
7481 -18424 -30286 -33497 -22128 -9510 437 -445 -9816 -16067 -10911 -24005 -22210 -23770 -13206 -11553
7467 -11553 -19492 -13811 -19186 -13613 -16524 -12671 -11654 -18659 -26717 -18851 -7969 844 -7943 2237
7453 2237 -5287 -7364 -9984 -13279 8082 3711 -4712 -11808 -5559 1122 4806 -6672 -24083 -21508
7439 -21508 -9043 -13508 -16025 -16467 -19702 -32095 -27642 -20653 -22888 -26666 -22260 -25352 -23768 -19762
7425 -19762 -31036 -27570 -9493 -3963 1316 340 -17761 -23096 -16182 -14035 -4963 -10695 -11384 -2504
7411 -2504 2915 433 -8000 -8860 -8352 -15349 -26544 -15465 -16284 -16013 -14617 -10119 3228 9791 4017
7396 4017 696 -945 -11992 -13277 -4216 -12929 -20432 -16222 -14021 1005 -635 -8901 -7610 -12232
7382 -12232 -5751 5717 8213 6871 8450 2800 3025 -15319 -28457 -28992 -9582 -8516 -23464 -32318
7368 -32318 -30366 -22674 -20572 -17493 -16529 -23471 -21347 -15506 -17043 -22104 -20022 -9706 -18652 -26466 -22172
7353 -22172 -25743 -31653 -27590 -23323 -16613 -21328 -25277 -35526 -29811 -32683 -32292 -28324 -20171 -590
7339 -590 7909 5343 -4073 -7874 -15278 -23576 -8759 663 17283 15856 7594 6179 -637 -8394 -5023
7324 -5023 -3997 -5890 -15043 -20971 -16844 -14279 -18191 -25058 -19313 -23687 -19707 -9503 -4974 -6924 -3188
7309 -3188 -5089 -2946 -3429 8845 17235 21911 22490 13193 13441 13532 -3642 -18360 -6393 -7212 -22022
7294 -22022 -17814 -1271 5548 6820 8722 12207 7944 4100 12359 12745 8865 -6876 -23435 -23113
7280 -23113 -15841 -7065 -3173 -12194 -4904 -8017 3171 -4840 -16029 -19579 -18270 -12755 -10002 -20738
7266 -20738 -25055 -27449 -22044 -16931 -16192 -16127 -6123 -3495 4728 -1856 1466 5333 -8266 -19491 -27990
7251 -27990 -33445 -17726 -4107 -197 -4871 4611 12464 1344 5167 -3446 -2918 2895 -1618 -23386
7237 -23386 -16736 -9807 -19711 -32846 -35187 -22784 -6497 -5172 -3254 -182 -6639 -11246 -2921 -2715
7223 -2715 -1177 11513 18231 14847 -994 -9379 -5174 -770 -1474 -4996 3970 2230 -7043 4074
7209 4074 6956 7414 -3002 -11983 -6526 4219 13636 15703 18752 15061 4718 8697 8945 2380 7820
7194 7820 2674 -9503 -29356 -35583 -27868 -8127 -10129 -12749 -7413 -2624 -18885 -25995 -27701 -23731
7180 -23731 -18879 -11063 -6128 -10514 -13009 -19340 -18927 -23402 -22337 -16344 -12781 -16341 -10513 -6317 -8962
7165 -8962 -5807 -14298 -28588 -32590 -20828 -19218 -20630 -27018 -33384 -36211 -28653 -9263 2691 -5810
7151 -5810 -11916 -11082 -5830 6321 -10664 -16938 -13636 -18043 -20510 -29184 -17572 -9517 -18353 -18715 -17792
7136 -17792 -15578 -2725 -11968 -12708 -6408 504 -1056 -160 -13565 -23567 -14549 -4348 -7325 463
7122 463 7333 -10165 -24760 -22067 -20411 -14025 -5910 -2512 -6899 -5846 -14425 -17032 -20046 -18345 -15475
7107 -15475 -26163 -29344 -27982 -12805 -2625 283 -2761 -11983 -15250 -1479 9671 -2440 -9033
7094 -9033 -12368 -13065 -5846 -7357 -16559 -25287 -27409 -28420 -14851 -6571 -1816 -1390 -6023 -22029 -18187
7079 -18187 -20246 -20123 -17896 -13343 -15136 -33859 -26502 -10858 -15656 -1672 -3079 -780 10423 13208
7065 13208 6165 -14943 -27245 -28791 -16751 -19527 -31379 -30898 -23464 -28517 -30815 -17601 -18899 -6873
7051 -6873 -6110 -19911 -23063 -17790 -9988 5338 -9233 -26042 -25968 -26860 -16830 2340 -2657 -7824
7037 -7824 -4210 -10881 -11456 -18838 -44122 -47176 -39592 -31165 -27411 -27189 -25419 -15853 1589 -257 -1658
7022 -1658 -7861 -18209 -21937 -26549 -8837 -892 -9677 -11265 -13934 -6684 -3870 -13087 -18748 -12508
7008 -12508 -11345 -16128 -10324 -4705 -14786 -25897 -28407 -12514 -21056 -25257 -21031 -24412 -33236 -28816
6994 -28816 -22303 -9543 2904 1211 6920 -9102 -16174 -24712 -15420 -14948 -16389 -23465 -26574 -22913
6980 -22913 -25571 -15024 -955 291 212 -8715 -8100 -13018 -11712 -5678 -12292 -12861 -19798 -19462 -11197
6965 -11197 -14444 -4962 -2078 543 -15193 -19356 -7970 -8936 -5078 6319 5233 -4079 -13470 -6810
6951 -6810 -16298 -17087 -13579 -12702 -10237 -7369 -6303 -2097 1870 14232 -5232 525 5822 -5160 7596
6936 7596 16083 7084 -2234 2821 6104 2651 5622 5334 -3579 -15197 -15590 -11045 -6617 -8238 -12211
6921 -12211 -18635 -8670 -5708 -3084 -6393 -12335 -7912 -8936 -18539 -10780 1101 -5727 670 969 2595
6906 2595 -3147 -2067 14920 9425 11230 6787 21389 9488 1646 3465 1426 4572 4313 -13047
6892 -13047 -15758 -5247 -2607 -3085 -7237 -19587 -28664 -11878 -4334 -8764 -16875 -18693 -24827 -17472
6878 -17472 -6664 -4916 -4156 -2374 6902 3750 5821 409 10767 7565 -7931 -6977 -4134 -13571
6864 -13571 -18706 -23800 -28227 -15118 -19437 -14606 -21192 -18719 -28595 -31457 -34322 -27093 -26202 -29676 -18105
6849 -18105 -537 1404 -8119 -20799 -26872 -15674 -11322 -11567 -13493 -2126 -111 524 2223 -1157
6835 -1157 2613 6010 18782 21621 19475 9594 -3363 -4436 -1718 11261 23732 24859 13400 -4241
6821 -4241 -25691 -34643 -25970 -19797 -15169 -1457 2500 6268 4756 2912 7213 6462 9525 8578 6774
6806 6774 3311 6583 2745 -2245 -306 -833 -1393 -22391 -29868 -19475 -10061 -4416 -4863 1756 1672 -5250
6790 -5250 -28560 -31405 -16229 -8498 3337 1699 -2020 4851 18944 27829 25021 13866 -3379
6777 -3379 -10904 -14559 -21599 -25863 -15085 -8503 -5105 -7364 -1984 9172 2417 -1575 -12571 -8386
6763 -8386 2923 9266 2 -861 2297 -6966 4508 -9023 -17058 -19248 -24442 -25530 -18347 -20088
6749 -20088 -9665 -1664 3236 -6504 -27260 -25782 -25566 -37499 -26100 -9302 294 105 -596 -5028
6735 -5028 -11628 -10050 -1678 507 -4301 -6971 -5664 -6803 -6602 -9038 -6681 -2054 -6932 -21116 -37815
6720 -37815 -45992 -36091 -31870 -33529 -26003 -22780 -31738 -29850 -21103 -12501 -14181 -9387 -7800 -7394 -13073
6705 -13073 -15973 -14865 -22882 -26150 -23639 -28570 -22301 -20388 -13805 -10980 -12913 -1961 11745 18247
6691 18247 17212 -1195 -12709 -21249 -25614 -29279 -22459 -18335 -1833 -2693 -7876 -7054 -7415 -7843 6023
6676 6023 99 -12498 -4145 -12285 -3405 -7896 -5508 -1891 6515 12465 4526 -2871 -2528 -6255 -7215
6661 -7215 -8687 -8823 -9542 3875 384 -8700 -1985 -19995 -18013 -10016 -4925 -5596 -1886 10952 12441
6646 12441 -2782 -7910 4852 2329 3049 -498 -2709 -6062 -14185 -28800 -21381 -26223 -24001 -16458
6632 -16458 -28001 -28026 -17639 -15197 -7039 -17753 -22555 -20701 -8790 3535 12689 10076 4330 3749
6618 3749 2796 617 7518 8841 -17267 -16989 -9119 -14818 -22590 -18856 -17096 -12065 -7006 -3669 13807
6603 13807 30726 25297 28546 21472 -3105 10771 30296 24025 16073 5383 8425 10358 17254
6590 17254 18625 613 -2274 -5438 -13799 -13825 -20303 -21726 -17441 -19653 -14049 -15241 -12553 -10247 -4904
6575 -4904 -16649 -28461 -38455 -33710 -24099 -14724 969 -2808 2236 -8172 -17443 -15317 -28699 -22644
6561 -22644 -19179 -12228 -11507 -13467 -9341 -11237 -6986 2050 8903 13371 5751 7988 -10437 -17237 -19454
6546 -19454 -16773 -14094 -5665 2420 -7910 -21177 -21858 -20046 -27830 -39077 -36599 -27816 -26578 -23651
6532 -23651 -25920 -26930 -35888 -31765 -28330 -23638 -12487 -5731 -8565 582 10187 7725 6021 -634
6518 -634 8220 11935 -3076 -9876 -6229 -6302 -5487 -5900 211 404 -12699 -22425 -16222 -16291 -5339 -14146
6502 -14146 -19598 -15087 -9700 2751 12733 -8797 -17557 -2171 6534 12443 20082 21344 13588 2572
6488 2572 1291 -118 -12708 -16080 -17904 -14418 -14310 -12708 -1310 13480 10068 -6903 -14300 -20069
6474 -20069 -6765 -5098 -29022 -28241 -11572 -3254 -3812 3376 -10738 -21176 -19581 -12592 -482 1993
6460 1993 -2709 -8144 -7443 -12567 -20263 -15412 -7257 -4062 -8764 -9106 -11487 -14093 -18185 -17693 -17410 -18110
6444 -18110 -21573 -8229 -8226 -10462 -20265 -29525 -28901 -10113 5563 10759 25088 36462 42729 35844
6430 35844 14238 1257 2972 -8435 2300 1150 -4181 -5664 1572 11623 14203 8061 3664
6417 3664 -12325 -9464 -6257 1918 -3093 -1627 -5354 -4783 -7490 -14451 -2694 -1817 -10065 -6201 -8370
6402 -8370 -5658 -5715 -1641 4847 345 -7274 -7845 -7453 -3277 -8344 -9047 -2367 -1510 -11074 -19897 -23818
6386 -23818 -10107 -9951 -19471 -20147 -16650 -6329 -5912 -3296 -15156 -12709 -17950 -27658 -11423 2136
6372 2136 904 1724 -3262 -23859 -30818 -25208 -23281 -22342 -9467 11 -3417 -4996 -2929 -7142 -9540
6357 -9540 -19050 -25200 -10433 -3804 -5698 2869 3982 1881 6429 4030 3242 -3266 -14196 3540
6343 3540 15120 15391 15592 9825 6818 10791 22229 31962 19764 21588 13863 16402 10209 -992
6329 -992 -3814 -74 2226 8685 13536 10801 1201 -6219 -16526 -11338 -11491 -6749 -17794 -18309 -6996
6314 -6996 -4330 -12060 -11331 260 20541 14051 2256 -804 7953 2645 -560 -12370 -11359 -14778
6300 -14778 -26085 -22606 -9884 5396 1268 140 -6790 -5046 -7476 -11822 -14706 -6355 -969 7513
6286 7513 7199 1978 -1025 6493 -7292 -21279 -5018 16024 5488 549 -1929 -919 1022 21370
6272 21370 42796 39085 18386 -3133 -10075 -7494 -15863 -23997 -15762 -8828 -13976 -5847 1875 3792
6258 3792 5279 4818 9014 13861 2279 -21889 -29246 -27097 -28046 -22598 -7001 -273 -4449 7234
6244 7234 1278 -146 5808 2857 -2763 -560 -4521 -12451 -3776 -2623 -6113 -8887 -17742 -18128 -13255
6229 -13255 -27089 -37032 -42333 -36365 -38586 -35236 -26303 -16858 -12353 -12392 -15051 -13165 -9154 -16399 -17233
6214 -17233 -9071 -15374 -24803 -16163 4522 16683 33712 17089 5632 -1303 -9227 -16525 -8645
6201 -8645 -4188 -4443 -22286 -28980 -10224 762 -10347 -7960 -15514 -9789 -17691 -20518 -15073 -11716
6187 -11716 -10918 -13834 -18354 -21489 -23179 -8084 -7015 -21416 -15414 -17343 -19653 -1704 5993 12229
6173 12229 1192 -8473 -6419 -11451 -9679 -2472 -4643 -10335 -10212 -6675 -5946 2030 -2002 -9458 -3785
6158 -3785 4859 2478 -3891 -6732 -21856 -28046 -20576 -23582 -29623 -20358 -3663 -6928 -3931 -7946
6144 -7946 -11749 -13036 -7826 -12300 -15351 -26621 -25562 -34108 -30015 -19068 -23459 -9799 7509 -3381
6130 -3381 -2624 -7566 -190 -3553 -17706 -8863 -4635 -8461 -5095 5727 -5085 -4567 -4001 -13055 -16083
6115 -16083 -18320 -12485 3595 7222 2550 5475 23634 12615 296 4820 -1181 -7265 -7777 -7805
6101 -7805 541 22604 31635 28333 13227 4668 6005 13222 10678 3916 14710 21547 12248 2977
6087 2977 306 1019 -8375 -12717 7522 12696 6069 1951 -365 -8499 -4194 -13960 -20064 -18720 -16035
6072 -16035 -23089 -28995 -19768 -13610 -17679 -3788 -1526 -18205 -13093 -18544 -22263 -17315 -26351 -42814
6058 -42814 -44641 -25132 -6814 -11173 -20459 -34776 -27465 -7126 10313 15385 16707 11847 12538 6084
6044 6084 1022 13638 16803 12477 4438 749 -1335 -11651 -16441 -2867 -1219 -10527 -16771 -28524
6030 -28524 -15106 -345 15212 26999 18366 -593 669 -8011 -11255 -9778 -16056 -11918 -7363
6017 -7363 -6878 4381 10636 4957 6160 6366 7073 15051 4951 -13289 -14713 -20959 -22992 -13564 298
6002 298 -6886 -5461 -1113 -5545 -12547 -22283 -22955 -9239 -812 -144 -9997 -7353 -3294 7752 32534
5987 32534 38158 27834 15081 12585 6375 -6699 -16632 -20274 -26915 -20817 -8124 -6000 5880
5974 5880 18336 15861 2740 2567 6832 1636 -12321 -17321 -14104 -19373 -19491 -11364 -11705 -12919 -6694
5959 -6694 -3857 2112 -11176 -6585 -2803 8989 3627 -4931 -13725 -16251 -11989 -11418 171 1292
5945 1292 -4597 -13298 -10239 6439 5778 6664 -1352 172 685 -1073 -4369 -2447 -4351 -13591 -11301
5930 -11301 -7807 -14129 -8798 -2299 -4118 -10126 -17675 -20682 -21277 -21353 -14802 -5670 -11845 -20412 -8695
5915 -8695 6801 21247 17539 10500 2708 -14832 -14782 -15177 -18697 -23991 -16582 -10209 -20225 -16855 -7711
5900 -7711 1399 13052 4756 -2754 -4420 -12152 -17613 -27628 -20663 -2301 12307 13691 7330 12379
5886 12379 12897 5249 -4293 5434 11882 15835 19867 18524 627 -8878 -7296 1278 8562 6221 -1238
5871 -1238 -5717 2689 842 -1305 3526 8378 323 -9507 -6863 -2276 -3315 3114 -898 -8685 -14907
5856 -14907 -19181 -20482 -11123 -3660 -994 1342 4004 -4228 -5162 -6037 -2793 4839 8911 467 -3572
5841 -3572 -5297 -3229 -671 -9581 -10337 -13333 -19422 -25734 -19374 -6366 3898 2560 1057 11268
5827 11268 -913 -13093 -6556 2349 2757 4179 -31 -9876 -10884 4115 19313 10662 -7677 -13664
5813 -13664 -19101 -5978 -2656 -11705 -9716 8347 1427 -3180 -2584 -12693 2661 -6 -2047 -9020
5799 -9020 -9413 -10869 -17580 -28138 -22814 -10916 5487 10806 316 -154 -2986 -16500 -5642 2842
5785 2842 10595 11954 19872 12633 7690 2483 -1572 -4855 -4700 -12833 -12608 -16918 -14885 -21634 -21979 3263
5769 3263 18449 14413 451 4291 -5235 -8693 -8956 -1331 526 -11188 -11896 -8695 -18439 -4368
5755 -4368 14945 40696 52870 35709 19018 12713 4080 -5985 -12791 -25731 -28790 -17686 1213
5742 1213 4935 -9134 -13696 -3175 -12100 -23985 -18117 -2120 7002 11073 770 -7131 -1533 7852
5728 7852 9904 9969 17205 4284 -20185 -25705 -16509 -21419 -18068 -9658 -15029 -11271 -3074 6839 -10682
5713 -10682 -12849 -18604 -9574 8878 10987 3880 -8514 -18728 -20571 -35244 -27575 -30818 -45947
5700 -45947 -38569 -21591 -16968 -8236 -13412 -4433 -7961 -12901 -24405 -35718 -24657 -10135 -9254 -19227
5686 -19227 -18839 -19341 -15131 781 -27 5482 12676 23867 20445 14180 12198 3732 -15621 -21707 -14642
5671 -14642 -9747 -2636 -10855 -12982 -4873 18122 23590 15365 6507 4392 10534 -302 -10744 -6350
5657 -6350 -8962 -18023 -17427 -27342 -17721 -5458 10235 11426 4145 2020 19523 25922 7795 -2847
5643 -2847 1974 3574 1860 2951 4692 -4742 -10180 -17534 -21425 -16784 -12945 -18767 -7696 -10420 -9076
5628 -9076 -5931 -13881 -24967 -39409 -28402 -11203 -12902 -10496 -20497 -25974 -25483 -31054 -15078 -8850
5614 -8850 -8311 -10262 -4227 -2311 -859 3256 -5145 -13854 -3734 1525 5721 2964 -6416 -18992 -17329
5599 -17329 3912 9691 4787 -7992 -10871 1082 1029 13994 19568 15437 9899 8728 -13676 -19538
5585 -19538 -10278 -9834 -18768 -19926 -14315 -18156 -16358 -11797 -3491 -2406 -5747 -5301 214 584 -4249
5570 -4249 -10421 -14935 -10598 -11856 -216 15222 17248 1639 3143 -7892 -11052 -11126 -9535 352
5556 352 10297 714 -6699 -19814 -41500 -35953 -32653 -18513 -19601 -11878 -9431 -8780 -13333 -3435 2449
5541 2449 -3763 -7227 4715 5623 7478 15016 17676 5708 11179 1103 -749 -7366 -3374 3563
5527 3563 14688 -913 -3554 -3037 -8359 -11894 -27012 -30403 -34873 -23474 -18480 -8336 -15851 -16576
5513 -16576 -16037 -27793 -26684 -23292 -25478 -20303 -9381 -2956 -1595 -1250 10540 7498 11976 6799
5499 6799 22113 14455 5931 6319 7181 5163 7203 -14027 -25962 -14829 -9245 -15776 -13048 -11036
5485 -11036 1105 -392 -9786 -4683 -2849 -1575 -7410 -4820 2584 7028 11866 14806 16080 3126
5471 3126 226 1783 -5217 -12544 -9508 1237 1197 -9777 -11155 -12708 -14823 -7517 -492 2739 8243
5456 8243 19340 10474 12128 12095 12098 13400 5943 15474 24808 15952 -330 2185 8866 2482 -3757 -5445
5440 -5445 570 1459 6783 10325 12372 5732 9195 19875 15888 13930 10942 18919 14316 -526 -8150
5425 -8150 -19154 -11369 -7903 -10716 -25303 -32313 -39314 -35463 -34763 -40066 -41012 -34688 -18412 -18600 -21192
5410 -21192 -22473 -21649 -15422 -7474 -2356 -10559 -18053 -18516 -31943 -26778 -14489 -23733 -29207 -27428 -20506
5395 -20506 -8400 -17244 -10168 -4029 -3541 2113 -1465 -23675 -26907 -20344 -6920 2661 12453 -2762
5381 -2762 -11357 -1649 -3668 -10902 -4318 14560 19310 5989 -8848 -11176 -8899 -24490 -39674 -43147
5367 -43147 -33199 -29085 -13992 -11454 -8020 -10337 -8541 1042 -2531 2264 6699 1948 1235 17218
5353 17218 25205 24724 24693 10699 1842 -6511 -9867 7811 11281 -3357 -3813 16189 14977 15435 -1473
5338 -1473 -11712 -6784 8004 8642 -12533 -24880 -16374 -13458 -17790 -14413 -8074 -6045 -3960 -16387
5324 -16387 -19741 3158 9397 8288 7906 -349 -6611 -10045 -15607 -13025 1549 11486 4255 -3179
5310 -3179 -5304 -16324 -29568 -38081 -24676 -8558 -1242 -17385 -30093 -12245 -6526 -13854 -13021
5297 -13021 -4778 -2454 -2740 -12111 -14851 -7954 3770 13336 5654 -8447 -4287 -3810 -9635 -8418 -11572
5282 -11572 -18783 -16120 16581 20004 11421 6487 1701 32 -560 1595 -1616 7206 5443 4316 2515
5267 2515 4604 10145 22342 24956 15916 4533 -6053 -4376 -13281 -22397 -12378 -5191 -9372 -6788
5253 -6788 -987 89 2208 12425 5891 1440 5856 -1925 1383 6057 -6922 -23087 -27661 -17560
5239 -17560 -15868 -25416 -23331 -15989 -37733 -27090 -10555 -1866 11108 3773 -3707 -7340 -6329 -14707
5225 -14707 -7524 9009 20615 11091 -4559 -8967 -24480 -39290 -28283 -7231 6895 9672 18279
5212 18279 11437 3367 10769 10963 22840 25394 8429 -3484 -610 8491 15315 13755 2907 5456
5198 5456 13373 5736 -1499 -892 -15357 -21869 -10199 4497 -645 -9161 -12588 -9056 -7302 5481
5184 5481 3766 6809 6648 1432 4657 9745 2794 5304 667 -7892 -4466 -3996 -8454 -17455 -15634
5169 -15634 -720 8859 6769 2378 -4387 -4504 9098 2627 -8365 -3918 12230 10525 5234 2226
5155 2226 3125 8948 7195 -5846 -8772 3240 4202 -404 13123 8198 -9162 -9436 -693 5920 -8652
5140 -8652 -16966 -10227 -19184 -24275 -6826 1329 2090 3433 -4036 -9071 -16713 -16228 -11302 2973 10755
5125 10755 1520 8220 7222 12879 11503 23313 19475 22828 30730 15278 -2948 -7380 -1844 -4525
5111 -4525 -2929 5126 8377 11483 6967 3446 3478 -1215 4317 7777 -9458 -15911 -15962 -11748 -24930
5096 -24930 -34102 -31151 -20425 -5553 -3057 -1448 -4106 -3664 3930 11298 15080 5200 5203 5508 9852
5081 9852 21023 26035 35611 27579 20258 19152 14258 18900 5236 -4702 -4548 5324 5849 1961 -2616
5066 -2616 -6984 -10853 -22231 -25140 -9216 455 5026 2487 -8864 1233 4737 -15703 -26311
5053 -26311 -25205 -4300 -2452 -3229 -3477 -3503 -5243 -909 -3819 1966 9330 9344 8580 4541 -518 -1345
5037 -1345 -5821 -5622 -11699 -6393 1339 2044 -7024 3916 2982 -4775 -4940 1855 10703 5301 2777 -2985
5021 -2985 -15402 -9117 -6851 862 -4546 -9149 -9194 -9487 -16715 -16746 -3615 -485 -10918 -23380 -24707
5006 -24707 -18310 1267 590 -3257 -1423 -11522 -1017 729 1765 -3627 -7175 -2489 5975 8404
4992 8404 4427 8912 -1756 -25418 -35806 -27572 -15806 -11635 -11362 -5683 6287 7151 2791 556
4978 556 4514 1926 -6976 -6691 8683 25570 34480 18973 7003 -14985 -25303 -16903 -4793 -4383
4964 -4383 -4823 2417 -966 -2642 -5022 -1640 6192 353 -7226 -10854 -5052 1866 -14362 -12405 -5546
4949 -5546 -931 15548 26181 22529 9326 -2806 -7297 -15745 -24336 -30208 -35839 -25984 -16773 -3702
4935 -3702 -901 -9310 -7023 -15844 -11166 -12914 -18442 -13831 -10138 -7951 -546 -16246 -28291 -32814
4921 -32814 -25245 -16736 -14704 3115 -8392 -11185 -7699 -3106 4921 4703 1983 350 -6476 -3522
4907 -3522 -13770 -10872 -6883 1251 -9277 -18157 -7300 -3812 5471 13019 13231 20308 17799 10088
4893 10088 1050 -4909 1331 3859 -4871 -7245 -14002 -14106 3045 15870 5259 -16609 -13611 -10221
4879 -10221 -20597 -11946 2611 574 -8518 920 11624 10662 1300 -2853 -1697 -13543 -21726 -18850
4865 -18850 3433 8083 5890 -3380 -4164 4930 -769 643 14056 20486 12353 -1829 -4743 -1715
4851 -1715 6126 2344 -1850 -6846 -15327 -17028 -12072 -22011 -21926 -2795 4687 5600 1148 9652 8019
4836 8019 2122 -1745 -8581 1151 -302 -1799 -3208 -8125 -14272 154 20683 7174 -859 -11356
4822 -11356 -1911 7863 11312 15464 28340 36676 25860 9450 906 551 -1522 -2014 -662 1393
4808 1393 1816 3878 4395 24888 34585 27921 12916 -919 -2549 -2840 -3200 1342 1523 -8818 -14498
4793 -14498 -12169 -3212 662 -5920 -4932 1567 -2094 -7025 -1140 -10266 -10387 -6426 -16647 -9490 7452
4778 7452 16326 17112 12784 6481 5822 7381 9270 2463 4455 16198 8811 -1115 -12623 -13691 -5389
4763 -5389 -8072 -16100 -12092 407 296 -7641 -11912 -15427 -19010 -3678 -1169 -17903 -19558 -21110
4749 -21110 -11793 -21938 -15043 -10663 -6019 -5836 1587 8321 10259 9754 17737 12802 22858 18813 13820
4734 13820 9801 11881 16661 9213 12609 10674 11673 5885 1135 11953 442 -12027 -9294 -4164
4720 -4164 1107 -12516 -19602 -4355 -1502 1542 3129 15205 13484 6635 4158 -5505 -11795 2943
4706 2943 12514 23883 28351 20145 4628 -7817 -12335 -20150 -7737 -773 5519 25832 29159 22106
4692 22106 7957 905 -9386 -7636 -10063 -3593 7780 18401 20208 11037 12032 22157 20808 21526
4678 21526 21393 2705 185 3177 -761 -10009 -7336 -16647 -20325 -14321 -11176 -2693 5535 11167 21577
4663 21577 37208 32483 12667 7463 8139 11529 -6043 -23694 -23958 -17147 -11657 -8719 -15002 -9436
4649 -9436 -1247 -13402 -20603 -15588 -5249 -5031 -1651 -5816 -7685 -21327 -23969 -13289 -4074 -4470
4635 -4470 7480 18134 7203 -2174 2007 17252 14961 -3773 -6757 -8134 -5603 -6476 -9869 -1890
4621 -1890 3127 -4828 -186 7229 8458 7292 15586 23181 20555 9419 2531 10934 14416 10265 10586
4606 10586 -5170 -10965 -7424 -5761 3467 18301 21172 7129 16725 26091 22216 13557 -8004 -5972
4592 -5972 5216 -6354 -2535 -5474 -9544 -13361 -10167 -8894 -13310 -23071 -26534 -14804 -518 17933
4578 17933 33799 39388 37875 23098 -500 -13499 -17378 -15619 -16475 -15224 -23167 -18469 -13244 -9872
4564 -9872 -8235 -7631 3991 24614 17437 -7287 -9288 -5314 -968 -6988 -2559 -4234 -6947 6588
4550 6588 -4080 -1212 6631 -4540 -15533 -14911 -7416 -2075 -7021 -22316 -15196 -6279 -2438 -12115
4536 -12115 -15491 -17425 -13467 -19575 -25147 -11389 -12004 -17036 -12863 -895 11725 15575 13514 4674
4522 4674 4297 -1395 -4169 -904 -8381 -13767 -15973 -11516 -8658 3729 11428 19935 13678 9031 7002
4507 7002 -9605 -20447 -34583 -37665 -17030 -7376 15197 20366 229 -15714 -4050 5092 2638
4494 2638 -2869 -7977 -20507 -9732 -11355 -18288 -23834 -25641 -25706 -19542 -21564 -12371 -5548 -4916 -2057
4479 -2057 -6549 2236 20665 35374 34601 36744 19915 14968 13093 12522 11901 6839 4715 8351 12203
4464 12203 11976 2011 3666 17912 20198 18494 15222 24939 20773 18768 24096 31408 20011 -2902
4450 -2902 -12034 -6900 3446 3590 2229 -1346 1556 9412 3481 562 -14286 -13351 -5441 15433 5579
4435 5579 -10707 -11978 -11978 -14633 -3510 4788 -4252 -13561 -11722 -15131 -5338 3061 -7461 -10146 5076
4420 5076 3505 609 5305 10423 9668 10993 8057 7326 -2330 -2209 2402 -4162 4525 19636 17867
4405 17867 17795 -1398 -10780 -11550 -9649 -2705 10104 10526 7981 -7569 -3640 8570 11048 7844 5988
4390 5988 2057 2154 507 2326 8469 15834 11679 1774 4714 18368 4835 -2403 3356 13012 19078
4375 19078 14858 22968 15557 -1545 -1085 5078 14006 18386 14845 7815 2276 -2705 -6971 -7476 -8453
4360 -8453 -16354 -9890 803 2796 -4816 -5398 -5251 -1488 8745 3161 8532 8413 3388 4836 -5865
4345 -5865 -11153 -17468 1330 8505 8259 -16118 -26244 -13797 -96 23318 14180 4597 8134 8278
4331 8278 1545 -6073 2438 14580 7685 9199 3253 546 2224 -2800 271 -3707 -12760 -27176
4317 -27176 -26512 -22514 -20505 -3611 -6491 305 10611 22175 29507 27256 15276 10882 11442 4481
4303 4481 52 -251 -9821 -8140 -2388 -3635 -3250 3173 8638 19919 25693 18183 4721 4807 12373
4288 12373 15523 23281 26925 17830 156 -8500 -10588 -10675 -1859 14467 8410 -2677 -6846 -7990
4274 -7990 -6439 -7969 -3071 -3307 -2428 2579 -2079 -5018 -13669 -18225 -6818 14933 29386 16053
4260 16053 17002 26565 20645 6040 -5374 -7726 -10044 -5436 -2993 -1274 -4547 -18978 -20276 -18533
4246 -18533 -12540 -12756 -16046 -11856 -12858 2581 16210 11842 6528 11751 7992 21780 20620 21156
4232 21156 27960 29293 22661 16571 12964 2954 2018 13840 22287 26523 40009 47792 45387 28414
4218 28414 4369 754 -6535 -2998 1711 5348 6947 9438 16091 19304 27758 11714 1626 8017
4204 8017 18338 11763 4053 -375 7051 7914 -4584 -7422 -12985 8308 19497 28201 29500 33390
4190 33390 38786 22207 6140 -6237 -2773 5342 8374 4913 10275 7659 2532 6303 6733 30949
4176 30949 27696 16761 8340 -2880 -12001 -15239 -9263 -10688 -10846 -1721 -384 2025 11425 6328
4162 6328 -1237 2375 -621 -9955 -11070 -12345 3799 16384 8997 6210 -2525 -16289 -31227 -24293
4148 -24293 -29282 -20952 -14528 6134 17647 15264 14400 10640 -5796 2032 -2225 -6948 -2640 -3194
4134 -3194 771 13315 9549 5822 13572 -573 -7881 -6348 4808 -11097 -16318 10248 26395
4121 26395 22552 19851 15509 15124 -9577 -24218 1683 10557 -3240 -13497 -19406 -11332 -7287 -3444
4107 -3444 -8199 -21712 -9942 -920 -478 496 -5021 -9444 -9328 -7912 4233 19824 20177 14192 12951
4092 12951 5585 -8623 -6747 3776 1859 -1528 -12657 -23919 -15581 -9830 -11181 -22932 -24864
4079 -24864 -17054 -9579 -6533 -2972 -2648 -6455 -11722 -8969 -21653 -24510 -14523 -8898 -6488 -6879 -7286
4064 -7286 1536 89 -7683 -1710 -213 1539 7930 9785 -4093 -6179 12598 11424 6389 5429 -14506
4049 -14506 -24495 -16017 -8681 2926 10908 2034 -2577 -9931 -1544 3787 3398 5611 -1323 4110 8220
4034 8220 3395 -3178 7557 12355 18333 15824 1485 4289 11327 12691 18884 14013 7279 4379
4020 4379 2075 5109 -253 -12732 -21832 -17676 -16533 -4522 1517 2999 -3650 -2660 -10572 -15176 4132
4005 4132 10356 1350 12861 10974 6387 11537 19794 28380 20356 12812 5556 -3371 -7970 4911
3991 4911 9760 -5958 -11798 -16893 -23207 -25944 -16726 -17898 -24225 -7431 4248 -2925 -11167 -730
3977 -730 -3643 -1505 3491 -1058 4744 11291 15846 9449 8274 9254 10831 477 -19788 -21422 -8063
3962 -8063 -4024 -6330 -2774 -4520 4784 13654 8391 -6009 -4857 6040 16367 3783 -4169 689
3948 689 1341 -4228 5668 19286 7413 -7127 -6885 9971 564 -21591 -21726 -21789 -3732 6062 11701
3933 11701 15425 20763 17514 20788 19184 15590 13189 7474 2308 -4703 -10852 -1465 8759 -7733
3919 -7733 -13417 -33407 -33685 -35238 -8057 1262 -3714 -8714 -21293 -20085 -20362 -19575 -11549 -5034 -8564
3904 -8564 -519 8795 2025 -158 6806 6013 -657 3835 658 -7123 -6100 -9314 -6708 -5510 -9565
3889 -9565 -6111 -9213 -12080 -4615 -9775 -15410 -6918 -991 -8003 -5125 -3087 -7531 -19151 -27033 -16750
3874 -16750 -16839 -25828 -40595 -33014 -43910 -46522 -29935 -19053 -1216 13677 12613 5852 -6936
3861 -6936 -4381 -4628 -2084 -3229 -7771 -4966 1105 2599 -6567 -6153 4430 -5 4524 13171 5607
3846 5607 7657 4903 -13035 -24413 -11134 1681 -12467 -17225 -1934 1984 10343 16591 16814 8870
3832 8870 -1653 8538 20979 22070 26012 40526 40766 19854 19814 24267 21331 15219 7790 7659 11372
3817 11372 -4388 -903 10020 10050 7645 -1780 4054 5714 5723 -8853 -12426 3165 1820 -2588 -6649
3802 -6649 5864 23726 23141 14208 10362 14016 14276 7811 -5202 -10209 -11514 -16989 -13028 -11807 -9216
3787 -9216 -75 -4931 -6198 -402 -10603 -11678 -10030 -1092 6194 3905 -1758 -1713 -4535 -6305 -12551
3772 -12551 -15062 -3845 11418 16883 10916 7447 -17225 -19816 -22616 -19859 -13821 157 14409
3759 14409 7278 -9040 -10967 -7390 4652 10403 11420 20984 4675 -5364 4174 8275 -4925
3746 -4925 -13405 -13794 -8902 -5168 -11216 -4394 1843 14944 19869 18823 20027 25273 14719 18870 13080
3731 13080 1726 -5210 -3368 -5399 -8753 -10005 2809 11166 8097 10956 3612 -4080 -3883 -3168 11793
3716 11793 33267 30332 5261 -15407 -12739 -12677 -14960 -14529 -9457 -349 5471 4135 11160 19502 23921
3701 23921 20278 17011 13480 2118 253 -25 -1018 -20156 -33993 -26587 -9433 2080 22148 20888
3687 20888 16210 7891 2996 12662 12679 2177 16098 28995 16707 14420 25885 27570 17622 25393
3673 25393 26209 18222 20039 17774 21904 10296 -2731 -2788 2638 14827 16502 4499 5844 22217
3659 22217 36164 31718 20298 17363 9221 5004 5236 -1704 1970 8748 22590 23381 17057 17931 21030
3644 21030 12993 9060 13426 11763 16120 23984 21055 25976 12250 4081 -20271 -20112 -13602 -14522 -16494
3629 -16494 -7511 -1572 -2166 355 13974 18018 11419 4177 8471 8513 6924 10615 9628 5462 16886
3614 16886 33992 33536 16655 4740 6121 6904 1555 -4782 -1132 9900 11408 -3066 2344 14920
3600 14920 22871 22927 9502 -166 -6387 -14488 608 12855 25628 15834 -14586 -27292 -19509 -16653
3586 -16653 -2910 15536 16656 15779 27710 14145 17527 13903 7667 -2421 -8216 -10307 937
3573 937 10958 -67 -3651 -5734 -4440 -706 -4179 -10315 2036 7394 5053 12827 15522 11331
3559 11331 12357 11719 11600 12223 -2989 -3376 7317 13764 22721 18783 20846 17028 -6748 -15619 -8389
3544 -8389 -1225 -3115 -5360 -5936 -11258 -8507 -113 5049 3030 4913 -767 -4904 6267 13396 14502
3529 14502 4917 -9090 7017 16848 8738 3051 -4326 6636 4517 318 -2300 -8751 -15697 -6718
3515 -6718 -7925 -13244 -15307 5158 19729 13902 3844 3591 231 -4535 1332 11353 9918 -522
3501 -522 3046 11077 9155 11326 16059 13322 6576 -1964 -7285 -5797 5000 9131 11341 1445 2255
3486 2255 6955 26450 32771 29060 19798 4157 924 -5701 -12922 -6799 5630 7157 -6649 7237
3472 7237 19087 -6055 -11312 157 6109 -381 -4392 2462 13158 3047 -5276 -22117 -29820
3459 -29820 -11950 -11944 -10543 8621 21336 13758 10308 7026 -7907 -2398 4297 1685 9818 6656
3445 6656 7828 10452 9207 17177 17195 12696 2482 2828 -1650 7040 -4604 -10012 -16779 -17876 -14111
3430 -14111 -3464 -5487 -17837 -21572 -25386 -14053 -2941 -2645 -1845 1373 -29 -1462 -4251 -756
3416 -756 6492 16226 1841 569 2902 7069 -2008 2502 15261 10769 11470 10845 21943 25497 7677
3401 7677 -3493 8162 13890 5517 -2279 1345 346 441 7524 10265 7219 10977 6421 -2270 -8759
3386 -8759 -3380 6042 1566 -1268 4102 11583 11157 9463 11761 34570 33731 16732 10288 -553 -6171
3371 -6171 5047 5488 -3030 -15950 -7577 4273 14869 9361 6680 15219 14709 -7349 -14680 -12443
3357 -12443 -5928 -4912 -13461 -14807 -10920 -5787 -9194 -1154 17523 8907 4892 15607 5497 7364
3343 7364 14699 12805 -5096 -2258 -678 6167 13566 14861 10815 12173 11254 -2590 -3048 1826 -5438
3328 -5438 -4135 10898 9731 1300 8057 -4461 -29936 -31647 -23235 -7117 6187 13422 -1298
3315 -1298 -5744 1048 -5802 -13729 -4093 -14195 -5486 12129 30151 33407 15826 3148 2546 6637
3301 6637 14441 23355 19704 -7654 -7508 1071 7346 1177 3446 9673 8495 582 2954 14867 17102
3286 17102 13950 -5921 -15787 -13966 -13843 98 -6025 -3341 -7857 963 15084 12993 4877 -5130
3272 -5130 -16446 -24527 -18515 -7404 -3960 -7705 -9487 -3445 -6723 -1939 5563 9043 -339 -5958
3258 -5958 7630 14205 -4264 -9513 -10248 -14788 -13705 -9135 -13397 -14607 -14262 -17549 -3756 -4338 -19184
3243 -19184 -21386 -13183 -16455 -18178 -1930 4948 -2992 -2658 -4715 -6046 -2837 -11607 -21689 -23737
3229 -23737 -14387 -7621 -8605 -14921 -13032 -198 9714 17785 11004 3787 5252 10636 23159 25390
3215 25390 29014 32028 27611 26160 25261 21154 23967 30601 28952 22946 16898 11996 13084 15134 9404
3200 9404 11672 6047 -2269 -7474 -3596 10232 14584 5853 -2677 -5853 10303 18755 15371 20165
3186 20165 26268 6667 -193 2861 -5014 -3887 11898 12584 3809 -7265 13591 34330 39093 21317
3172 21317 7776 -3011 -2855 4377 7567 9951 13473 21429 19268 13784 -8521 -21284 -789 5903
3158 5903 3072 -5109 6632 20315 17952 17787 7272 7633 5075 6778 16537 23704 12018 3446
3144 3446 2853 5457 18597 8306 10722 11387 7786 12034 20569 16014 14107 14907 11117 5096 3325
3129 3325 15709 11787 1731 10615 12720 19441 16492 18391 8483 12905 3367 -6254 -14385 -7486
3115 -7486 4373 3473 15666 25990 18850 786 -8457 -2504 -7912 -8677 -10650 2878 11018 3914
3101 3914 4835 13839 2293 -28763 -33641 -4863 50 -5948 -4103 11414 20165 20484 8724 -6513
3087 -6513 -15316 -7566 -6446 -20223 -28871 -45132 -32111 -16496 -9455 6778 13920 -3077 -14374
3074 -14374 461 21477 41839 45682 27260 6068 8168 -2347 -17005 -11599 -1381 -3172 -525
3061 -525 11627 21949 10733 -7069 -10325 -7036 3717 6157 -1226 -1232 2085 -3196 -6082 -5676 -10327
3046 -10327 -2126 8825 21592 11459 3955 20402 27721 24673 13328 -3110 -17489 -10740 -234
3033 -234 5200 10925 22678 27400 9699 -8558 -16447 -12187 -5891 -10301 -4627 -5159 -8278 -22765
3019 -22765 -20014 -23178 -12569 -6966 8527 8566 3865 1428 4347 -10068 -1823 18563 20601 21890
3005 21890 19626 6482 -9108 -1619 12458 10192 14922 11163 19282 26146 20446 2651 -6571 -3558
2991 -3558 6086 6258 -1282 877 -363 16095 24876 30275 29746 18960 -1718 -16396 -3175 2015
2977 2015 7435 8500 16236 17126 16279 16610 16178 18150 4444 2184 14475 16205 16251 17870 6336 16355
2961 16355 23813 10138 638 3288 -2006 905 255 528 10541 9647 7402 1313 -580 -2735 5822
2946 5822 6064 6335 16802 21564 20615 23295 17623 9779 21843 13966 10870 26844 29757 15386 21424
2931 21424 27744 18258 172 -9234 4067 6842 16269 21680 16076 18147 14778 8133 12517 18147
2917 18147 13475 12629 12036 12572 3985 -6013 641 5245 42 2246 7576 9665 4447 4866 3451 9665
2901 9665 17305 11368 -7226 -15088 -7819 722 4185 -2583 7207 17766 16968 20668 18952 8473
2887 8473 5506 -2777 -1510 3687 8878 1001 8318 22490 19766 9274 19545 14639 3443 -6609
2873 -6609 -14935 -22799 -20669 -11065 -4277 -12566 -6917 -15723 -22975 -13553 -13970 -15084 -1829 -1226 -292
2858 -292 12353 21444 16467 5515 5676 12914 10890 3104 2475 -6110 -3062 1417 15046 19521 11381
2843 11381 6859 -6965 -14760 -11661 -374 8790 15894 23049 5560 2559 -342 1687 -6913 -12297
2829 -12297 -3362 7730 30394 29529 18640 -1818 -7347 -3060 -11781 -15594 8623 24995 24648 29992
2815 29992 30875 25456 1286 4361 14602 7162 3052 -7155 -6958 4943 7667 3492 2063 7186
2801 7186 19606 17981 12841 23093 10643 6500 1468 1264 11451 17001 -3256 -15929 -605
2788 -605 14865 24808 16800 6568 11204 1839 9910 8228 9404 16624 8029 -3500 -9052 -11307
2774 -11307 -8673 -4127 -9255 -6733 -10391 753 -1707 1932 11184 9573 989 4134 1681 -14594
2760 -14594 -14063 -20075 -23791 -23625 -24702 -26148 -13368 -18835 -8124 6941 9378 5369 9147 5966
2746 5966 9742 15989 19304 21411 24304 24296 1304 -483 6791 2162 3641 -632 -174 -7653 -10189 -13695
2730 -13695 -13547 -6024 7647 19014 26014 8708 11206 6604 10785 15935 10010 -1984 -2145 -7511
2716 -7511 -19742 -27419 -21595 -16663 -10831 -356 206 2949 1196 749 -1527 -4787 -10698 -2613 7454
2701 7454 6738 19193 22058 8784 -8977 -16303 -9595 -11692 -16053 -21679 -6245 -1047 -4156 -4727
2687 -4727 -7643 436 7979 15382 8052 12849 12743 20172 29715 19129 12696 10943 3080 -3334 -10950
2672 -10950 -2648 -33 11114 14285 4099 98 -1114 2630 13829 314 6125 6601 5901 11687
2658 11687 15878 8447 815 -6052 6367 17355 17224 5798 -5355 -16202 -23680 -26463 -26563 -16151
2644 -16151 -1758 2442 18932 31310 26415 15082 1838 -13612 -10056 -18841 -17695 -11762 -4504
2631 -4504 1666 1909 -13127 -13359 -11872 -2694 1678 -15009 -22627 -13520 -849 -6478 -14664 -8268 -44
2616 -44 2056 4102 2396 13735 14922 1933 1956 4617 13442 9763 6213 5146 -13941 -1281 23023
2601 23023 24830 11161 -2228 -14429 -21603 -5728 9012 16878 8308 9567 4761 -18377 -20445
2588 -20445 6969 21733 13423 6330 4895 10653 -493 -5838 -2327 -2114 -1281 289 3581 15009
2574 15009 18127 26902 21636 23096 -352 -6269 8133 26232 36706 29946 24462 25259 18076 12441
2560 12441 -1567 -5389 9495 21200 24212 13847 11043 20390 37578 36353 21480 15794 4984
2547 4984 -5973 -1866 -1319 1837 11620 15423 19708 20139 14293 22487 10641 -3740 301 1131 -13979
2532 -13979 -12970 -9801 -8437 -8450 -6862 11442 8150 28 6454 22391 8784 -2367 -579 -2230
2518 -2230 -12963 -6728 -1581 16514 39971 31043 11706 9749 11380 -88 3516 17190 21500
2505 21500 28607 43156 37013 19531 5907 -5100 -7446 -5060 -9893 -5551 4715 19275 9767
2492 9767 -1213 83 9722 5963 -4980 -1138 -5001 -4564 -9768 -9345 -11717 -462 5210 13284 8663
2477 8663 3374 -1661 17817 24956 1322 -8474 -6733 6920 11865 18987 15061 -5850 -5649 -14505
2463 -14505 -37626 -44511 -40636 -18997 -9373 -7912 -3998 -9510 -12811 -3788 -552 8266 15438 30212
2449 30212 31835 29995 18256 7166 7551 9327 -6646 -22994 -28597 -19765 -11850 -817 -13200
2436 -13200 -17009 -11723 -12358 -14534 -19560 -15156 -1830 10348 2015 1881 6237 4372 -3877 -7668 2201
2421 2201 10070 -1733 -15490 -4324 21654 32624 14894 -15452 -18750 -1144 13855 11455 5420
2408 5420 14681 17281 9860 -6419 -9451 6991 12264 -3637 -15127 -4056 -7277 -21556 -18530
2395 -18530 -4479 4377 1367 -15282 -7610 -4574 -7569 -10886 1038 3473 -4182 -12058 -5662 827
2381 827 3826 -1925 -11284 -3378 4162 1645 -6427 -8062 -9551 -6828 109 2110 -739 -12405 -17916
2366 -17916 -12035 -9103 -17771 -29235 -27379 -19327 -1093 6692 12719 23805 12121 1239 -5532
2353 -5532 -21670 -27373 -7242 -5358 -2530 3352 -1285 -9756 -9296 9853 14114 11717 9929 8732
2339 8732 2240 9397 7530 11270 7585 3884 -1080 7469 21838 7688 1300 6134 9192 7716
2325 7716 -7035 -15101 -2096 -8382 -5633 6255 10558 18947 19252 20124 19769 19147 36225 21392 14893
2310 14893 10149 20252 17320 4203 390 3318 11825 13070 3576 -3975 -8609 8172 22225 7196
2296 7196 2831 6214 12298 5330 -5223 -8523 -2807 -1993 -11304 -8899 2318 17360 15116 23418
2282 23418 21909 12351 7211 12155 358 -5516 -9035 -16772 -9446 2681 12649 -4364 -12739 -6113
2268 -6113 5075 16451 14550 29085 30000 26714 17786 10336 2304 -376 10208 17978 9630 -3366
2254 -3366 -10549 -2497 11588 6792 -6386 -2184 7425 4096 -719 9494 9353 7546 56 -2258
2240 -2258 -14593 -7491 -1893 507 -3269 -1289 -11589 -11375 -14473 -12851 -12821 -10178 301 -7899 -6198
2225 -6198 -961 15205 16079 16987 10210 253 15865 15502 -726 -786 2504 8939 15117 8813 3158
2210 3158 1685 4531 18031 7363 5042 3407 2659 1440 -216 -7659 -18471 -12212 -21175 -16802
2196 -16802 -13704 -5276 -8178 -1574 9319 24006 10379 -208 -3502 4221 11217 3708 9140 12112
2182 12112 9958 2285 -9723 -14750 -16188 -18170 -11510 -6979 9847 18684 15590 891 -1361 2904
2168 2904 -3169 8418 17974 12430 -3993 -3706 6897 12773 11410 -403 -5188 -642 6356 27569
2154 27569 32110 24812 15808 -3436 -13434 -5476 10272 10177 12514 4821 -8219 -14369 -1661 3486
2140 3486 10716 20106 12855 -11 1300 12378 9176 5571 2595 6953 9304 -4838 -598 -7806
2126 -7806 -11707 -12921 -18781 -18390 -18556 -22974 -16863 -8649 -15115 -19728 -15653 -14907 -10640 -1173 -767 9388
2110 9388 8486 13983 9901 3731 -7000 -8181 -5005 -11889 -14211 -13496 -13248 -391 21970 7088 -10186
2095 -10186 -8844 -6961 -13439 -21842 -24637 -19651 -17139 -7409 -477 4107 5619 -4036 1859 3066 16183
2080 16183 10427 -5128 14009 23938 15263 7752 4621 -17110 -56132 -61409 -24833 -12407 -12872
2067 -12872 -12658 -385 -5975 -16791 -17135 -5923 3102 3319 2945 9222 4625 -187 17980 16276 6593
2052 6593 10786 18515 15465 20136 9725 7407 11749 14013 25916 22788 9393 -1043 -3812 3184
2038 3184 5340 -2039 -8787 -7969 -15435 -7465 5707 12764 10177 2437 -103 9216 10863 17999 26564
2023 26564 29274 23295 10317 12444 13907 19163 11682 -178 -3591 -12526 -14290 -5019 4883 -44
2009 -44 -10705 -8856 5677 -11769 -22779 -15265 -7145 -9778 -14496 -6760 -3598 -5869 -19382 -5476
1995 -5476 -5521 821 3135 -10123 -2555 -6114 -16129 -2823 4896 19199 19018 17462 24445 3877
1981 3877 -10666 -16933 -11600 -5263 -21218 -29754 -26578 -19565 -1801 7427 3295 13228 4122 -2371
1967 -2371 17256 22513 11363 11102 17641 26556 15387 -4569 -11080 -17412 -1367 978 -3192 4817
1953 4817 -1111 -7935 2128 4069 4531 254 7695 15968 25535 14573 7208 6594 18752 21452 13277
1938 13277 4341 2674 -9727 -7905 -2943 -2482 4481 -980 -309 6231 254 -2696 -2407 -7194 -5011
1923 -5011 -14933 -24309 -18337 -13430 -12388 -6702 11759 9624 -523 -8880 -611 10566 21726 20677
1909 20677 7009 11949 9608 12768 18371 9392 11613 11991 16142 29759 35666 28758 31644 37610
1895 37610 30800 7112 -13396 -13196 578 5710 -3596 4765 12970 13122 25800 29426 27067 21227
1881 21227 10947 -4324 -15028 -17084 -13505 -15020 -9111 -3613 -8773 -8813 -11773 -16632 -14236 -10463
1867 -10463 -135 3862 11779 13876 16885 18821 28531 14219 11943 25027 20597 3355 9509 11972
1853 11972 19278 8167 -7243 -1264 -341 -7711 2356 2903 6613 18487 13598 14887 8558 7195
1839 7195 -4413 -16149 -8468 -4085 -6067 -5633 16007 19102 8422 6836 8323 3265 -9579 -19977
1825 -19977 -23619 -26136 -32825 -22201 -11965 -13171 -15664 3044 4398 67 -5137 -4051 9348 11715
1811 11715 10495 -5959 -2424 -6815 -2465 -4239 -7594 18380 23933 7460 -6218 -24265 -26484
1798 -26484 -23290 -26886 -11153 -11362 -6216 -7604 -11810 -11352 -23031 -17856 -21743 -30667 -26031 -17597 -15717
1783 -15717 -14873 -13486 -4760 -6663 -14008 -21133 -34421 -41635 -24499 -22501 -20453 -12104 -6510 -6121 -3081
1768 -3081 14758 1152 -13059 -1707 -226 -6566 -1610 -4552 -4183 -18452 -32014 -29774 -9541
1755 -9541 -10962 -4599 -2075 -1991 801 3713 7266 13946 7811 1398 -1401 -7848 -23319 -20226 -21662
1740 -21662 -22142 -27779 -20060 -7855 -4397 -2082 13639 10077 -2324 -5133 1170 10937 11216 1517
1726 1517 -5663 5777 -5200 -13136 -15151 -21908 -16428 -5308 13396 12556 18005 20074 6815 15102
1712 15102 11395 -640 -7751 1929 4903 2365 -1513 9354 13395 15545 6721 6971 18456 23439
1698 23439 20772 20632 10203 -325 2321 7095 7659 14934 1502 -13561 -19364 -13170 -4201 -892
1684 -892 745 -9135 -24498 -16823 -15967 -8623 6287 -464 5260 -3522 -4286 -5173 -10959 -6684 8299
1669 8299 14672 13169 8569 20591 11021 15455 23155 14828 11858 7855 12786 -3358 -24413 -20322
1655 -20322 -10935 19204 15884 5920 19806 11890 -2571 -16556 -20476 -7994 3711 5880 -9229
1642 -9229 -10859 -17018 -16215 -22255 -22312 -7475 -11888 -23831 -24932 -19841 -11954 -13932 4300 5725 10515
1627 10515 22815 19926 7813 3660 9765 9683 9554 9170 -5282 -15696 -13692 9794 21839 25512
1613 25512 27268 26010 19702 9303 591 9885 14665 7323 4103 12872 11897 1568 13199 23275
1599 23275 21030 9371 7490 21646 17281 12763 -1087 -16923 1133 9365 10460 3661 -3969
1586 -3969 -14283 1402 15828 8992 5426 -1866 -3814 -4030 -4547 4079 18871 21442 8873 7158
1572 7158 3632 -12530 -19307 -19363 -2974 13130 22240 10026 4122 4462 11641 5242 3722 -4478 -2341
1557 -2341 11992 15331 11968 6553 12805 17326 12670 2272 -14604 -8977 1305 4623 2119 1645
1543 1645 -3626 -13182 -25061 -17221 -5153 -4193 -8559 -10421 -7613 -4973 -10972 -16304 -9830 -10247 -16063
1528 -16063 -14285 20110 32550 24481 16552 17934 15196 13236 4913 15824 6838 -8161 -9065 1727
1514 1727 -5053 -8717 -9324 -9223 -3928 2139 20836 30052 28421 31390 27601 19207 -2343 -11391 -20700
1499 -20700 -18618 2102 4759 3510 -794 -5851 3726 760 -11037 -5290 -6481 -7343 3193 7037
1485 7037 1052 2079 8827 2184 -235 7562 9375 19706 10516 12399 12753 8450 15647 8576 9974
1470 9974 -2866 -10624 -1548 -384 -18611 -18786 -5328 -4376 -7843 3944 17914 -3872 -20302 -19469
1456 -19469 -11215 1179 3480 17062 10685 6338 4552 -2120 -4485 14314 16859 -1290 -5196 -1460
1442 -1460 -8548 -25499 -23376 -7216 2433 12578 17706 16954 16377 18656 14209 2301 -17098 -11629
1428 -11629 -258 -3926 -2693 1249 6877 5922 18298 28252 15578 15582 16187 3999 -5796 -7752 5937
1413 5937 2215 -11181 -20607 4943 -2206 -17811 -21339 -13411 -10379 -5066 773 -329 2279 6995
1399 6995 13186 17173 14029 4035 -1986 -4025 -6136 2016 10411 15487 10491 -2565 -5557 -3061 981
1384 981 8789 5697 10057 14613 11073 7547 5909 9941 15072 21908 13608 7300 2225 933 -3149
1369 -3149 2638 -11807 -10590 -9999 -9401 4936 1112 -10085 -11199 -506 2254 1388 9713 6082 23872
1354 23872 27563 28192 24616 15704 12710 15793 22116 5229 -5642 -7670 -2679 -9551 -778 -3453
1340 -3453 -12031 -11107 -19878 -12719 2332 2197 -10708 -11812 -2882 -3913 -1876 405 12099 12785 9774
1325 9774 1748 11771 19063 313 -9277 -2605 12364 13587 3937 -19184 -14469 3969 21042
1312 21042 14368 7267 12078 17870 11149 21489 26621 22401 8382 -299 -1484 3327 4992 8284
1298 8284 10588 7484 2832 1289 -11694 -8539 11464 18849 11430 6607 14927 -318 -17398 -940
1284 -940 11214 11458 1012 12533 9311 2636 13220 17531 14207 24382 17031 16813 19682 14788
1270 14788 12924 11866 10453 8689 13187 18415 10467 7588 3369 13317 10455 4909 -3119 -3720 -4516
1255 -4516 -7618 -8492 -8946 755 4940 7204 -5419 -4363 6277 16595 12857 10711 12517 28496
1241 28496 21413 12092 -5800 -11860 -5475 -4366 7733 18497 2960 -2381 -7291 627 1397 -6757
1227 -6757 11410 13190 6468 3573 7272 -5142 -4657 -6306 -17017 -13983 -5891 -23928 -28398 -28126
1213 -28126 -9209 -8036 -10962 -2136 8732 1278 -2287 1571 6890 13426 2297 -8756 -6737 -7539
1199 -7539 -10187 3116 11223 7299 18656 17567 9357 1897 9740 6664 6073 14465 10739 13602 18243
1184 18243 11917 13462 3120 -11750 -6015 4085 15288 27015 21122 4349 -11662 -14713 -24107
1171 -24107 -23896 -6137 -6055 -10947 -11376 -17419 -17337 1410 10574 6405 4670 8049 5260 -18435 -23921
1156 -23921 -18730 -5527 -5189 -10838 -13011 -17968 -22006 -2041 -2048 260 -16665 -21811 -12645 -6348 -817
1141 -817 8686 -8318 -21396 -29060 -20825 -21767 2865 11748 4624 2543 25336 22734 11524 9064
1127 9064 15855 12344 7454 -10788 -12937 -11494 -3560 7066 13172 12689 18022 12996 13115 15701 14533
1112 14533 5889 2468 8726 10993 14981 14575 22992 27240 10219 7860 5784 16206 18896 9667
1098 9667 -708 7124 4043 4811 4541 5616 10819 -2728 -4230 6051 10847 5745 -7397 -12879
1084 -12879 -9942 -8903 -3588 -5270 -5584 5488 4921 -11489 -15106 -10773 -19117 -22724 -26369 -29473 -17472
1069 -17472 -1570 1304 -14953 -12711 -2930 -8394 -4325 6578 3052 -9086 -12615 705 -3336
1056 -3336 -1475 -14543 -20969 -26985 -27458 -22797 -1733 -1980 -10727 -11040 -21533 -31767 -16923 -15847
1042 -15847 -8773 -4905 -9610 2675 9001 3706 -7334 -29462 -40290 -39868 -23720 -13611 -21305
1029 -21305 -26032 -18888 -14840 -16875 -10688 -9025 -7174 839 12212 7290 -1848 -2450 -12273 -19409 -10341
1014 -10341 -12766 -12161 4890 3364 12281 16303 23272 39788 31693 7717 -17037 -24477 -17081 -25372
1000 -25372 -8121 1648 6383 6845 251 6031 11760 -972 -2075 -5539 -10964 316 10935 9972
986 9972 -7645 -4910 2509 3720 -10028 -5924 5911 4807 4480 9551 9398 6946 3880 4540 -13318
971 -13318 -22348 -22051 -19551 -1022 -6020 -17409 -13928 -8815 2078 4439 627 -7195 -3828 1218
957 1218 8249 1607 1360 970 14647 28118 15351 -2792 -18405 -11397 -4497 4568 2588 -5081
943 -5081 -7119 997 -5545 -11660 1173 -968 -21226 -12076 -16436 -22437 -17704 -17646 -18962 -14589 -13929
928 -13929 -10084 -2794 3672 9474 863 -6776 -12920 -14678 -11192 1423 21158 15293 11604 13477
914 13477 6759 1911 6122 6252 -8864 -9639 -4508 5693 14112 21286 12625 149 -2458 5861 23131
899 23131 21244 13946 -7781 -1255 4579 -10998 -9152 3167 -3259 -8785 -16823 -22488 -21396 -9477
885 -9477 0 -1297 -13523 -9207 -2911 -1352 -17904 -25046 -23120 -14052 -12377 2594 5633 17235
871 17235 6171 11318 10424 -2002 -3419 -15227 -26071 -29981 -6140 8187 6227 4244 1901 6323
857 6323 12287 14671 6597 -2768 -5463 -4454 -10350 -16268 -18254 -6416 -5128 -17888 -30756 -14769
843 -14769 4744 -2291 -16082 -33294 -31535 -25173 -27095 -26287 -24089 -21390 -9987 2443 18798 15164
829 15164 -663 -11657 -16080 -15175 -9714 -13421 -12894 -3441 4251 1955 -8329 -7796 -20416 -18986 3325
814 3325 1704 -9234 -13347 -8820 -8143 -466 8539 18575 14752 -8073 -25657 -30163 -16614 -9159
800 -9159 -9847 -2911 9251 5928 844 3241 2415 -21375 -23825 -17346 -30998 -26364 -10244 -9714 -16261
785 -16261 -11057 2884 -1355 -10974 -17331 -11635 -16011 -14649 -6186 901 142 5555 16529 20765 28902
770 28902 9852 -7862 -22084 -27437 -19421 -7977 9908 8392 2887 15111 17537 13008 14326
757 14326 13272 14454 8322 4192 -12142 -25237 -23693 -20051 -19235 -22797 -21956 -22274 -19885 -18592 -23850
742 -23850 -17851 -9034 -4313 -9622 -4626 6330 4717 19043 27143 24183 17347 16074 15092 13014 7463
727 7463 1250 8777 3919 -12394 -16586 -4567 2896 -7337 395 -1378 -21831 -24379 -16596 -17323
713 -17323 -22119 -12887 -6934 -4763 988 4568 19399 25569 7677 -17002 -17572 -14136 -5172 -4628 -1813
698 -1813 5671 818 -20529 -12460 -6338 -9500 -15169 -26229 -15053 1367 -6999 -15123 -26796 -20814
684 -20814 -12324 -14600 -11531 -15176 -32804 -32379 -29052 -23750 -3487 15284 11704 1451 -5638 9770
670 9770 10700 -10943 -11613 -1711 -2014 522 4381 10230 11313 17850 30159 22034 20469 22189 10713
655 10713 858 4564 -6080 -6586 -6093 -572 -11864 -28295 -26034 -7968 -423 -4271 -10925 -20403
641 -20403 -17215 -13432 -16894 -8219 4540 8592 9658 20971 9238 10151 8303 -4110 -17487 -28129
627 -28129 -12646 -10423 -26855 -31369 -33269 -34737 -36663 -40240 -38299 -32580 -34370 -9791 6892 14828
613 14828 8929 1755 -18375 -12673 -5859 -11171 -11294 -20387 -22260 -11420 -14669 -15414 -29990 -17370
599 -17370 -15004 -26529 -13913 -5921 -816 749 1106 -4028 3244 2979 5080 3230 -4266 1434 4693
584 4693 12998 14068 3836 -10550 -3715 -5639 -12216 -7104 -14076 -14165 1048 -11254 -19097 -20523 -22119
569 -22119 -30256 -34052 -33518 -27026 -12239 -7260 -9154 2488 575 -10038 -6356 -6226 -3738 -22495
555 -22495 -14809 -2466 3860 -126 -3102 -1897 6603 21735 21692 -9771 -18187 -19923 -30753 -20933
541 -20933 -16194 -19304 -34145 -36486 -21170 -9727 -22253 -24133 -4990 520 -1120 -1901 -10629 -19011
527 -19011 -6347 5639 2256 -11370 -11775 4061 10482 11556 3348 2902 3049 6800 -3981 -14087
513 -14087 -17998 -13279 3676 7304 -4240 -3397 -11107 -12764 -26712 -27339 -27027 -16542 -13231 -8821 -18335
498 -18335 -13248 -21423 -21578 -15134 -7074 -3426 -6764 -2047 -1709 1579 -7075 -21080 -35442 -41507 -41761
483 -41761 -26957 -14137 -18413 -11368 9749 21815 33946 25128 6536 -6296 1092 2040 1484 -12539
469 -12539 -19984 -13252 -7521 -164 -679 7529 -424 -8009 -3697 -896 -7272 -5812 3297 -4300 -6813
454 -6813 -11382 -23457 -42352 -29548 -9543 -7966 -12013 -28000 -24710 -25269 -30536 -31611 -26695 -28708
440 -28708 -15161 -21389 -22751 -23294 -15092 -24690 -17721 -15772 -35162 -35783 -25882 -19237 -7840 -6501 4169
425 4169 10655 7215 9925 4151 -1937 -7477 -11615 -13189 2039 2630 6301 12063 7177 -3623 -1931
410 -1931 8573 9920 7400 -11278 -5137 -125 -9307 -16741 -17778 -1969 9272 15470 18521 13675
396 13675 7927 30 932 10512 14121 9711 5763 -11797 -16613 -22198 -15796 436 6148 -2141 -12661
381 -12661 -14972 -15063 -16847 -14691 3063 8298 -4818 -9308 -4781 -3701 -1796 -7771 -19605 -24547 -10838
366 -10838 -6074 -13524 -794 7162 -717 -3713 -10421 -7907 2447 1532 -2981 -4583 466 -5497 -7154
351 -7154 932 3201 6868 22172 12366 2955 2973 -11771 -14435 -11772 -13520 -10953 -5932 -4630 3832
336 3832 -6895 -14847 -11720 -11670 -19536 -17858 -10512 -21376 -23495 -5181 1931 8896 4724 -2283 -8934
321 -8934 -3994 -15789 -28049 -29364 -37034 -30408 -32648 -33048 -34230 -33717 -32069 -32550 -39088 -42208 -22290
306 -22290 -17395 -15878 -9185 -4490 10008 13992 -5503 -20755 -24995 -22549 -13666 -18775 -23686 -22329
292 -22329 -32243 -44077 -40037 -30739 -22805 -20236 -31232 -48914 -45362 -28909 -24738 -20767 -11239 -7086
278 -7086 -8523 -9589 -12451 -11143 -16456 -5429 -1022 -10219 -19550 -15700 -30660 -25435 -15228 -8358
264 -8358 -4442 339 8046 4344 -9977 -3144 -2377 -6546 -21211 -23885 -19716 -10527 -1706 331 -2175
249 -2175 -316 10206 15981 13712 3627 693 278 -3016 58 -7147 -4840 -724 -2020 -4870 -11843
234 -11843 -20511 -21729 -16016 -22071 -26299 -22131 -9191 -5673 -12563 -16442 -14222 -7942 -9478 -14981 -7838
219 -7838 -1288 -9877 -18853 -21802 -19937 -14129 -9452 -3358 -5701 -326 -7833 -21030 -16334 -5715 -1020
204 -1020 -786 -13479 -23298 -19983 -26577 -16233 -12795 -26728 -31236 -22060 -11711 -6025 -8754 -5923
190 -5923 -17026 -9332 8346 4819 5538 1454 2377 -1493 -7829 -12494 -8609 1107 1345 -4345 -3388 -7704
174 -7704 -16157 -18569 -9061 -8484 -9258 -15890 -11151 -16055 -24100 -21907 -22441 -13787 -12137 -19032 -26186 -16361
158 -16361 -9405 -11334 -15152 -28297 -25212 -30463 -29745 -25051 -23012 -16648 -17307 -17739 -11504 -12853 -9833
143 -9833 -15134 -15510 -5624 -7544 -16376 -21616 -23865 -16655 -13661 -13388 -9118 -3962 6448 1599 1708 64
127 64 -11803 -18774 -21342 -24919 -18412 -6240 -6308 -16362 -21795 -19929 -9849 -10622 -15139 -19637 -9679
112 -9679 -13990 -27516 -22636 -18075 -17379 -8254 -3335 -14199 -30007 -35547 -31560 -25824 -26762 -25630 -17052
97 -17052 -7673 -6797 -8858 -8288 -7304 -11900 -20734 -24651 -23720 -13093 -12640 -5458 -7908 -7139 -7570 -12888 -6460
80 -6460 -2966 -2706 -12701 -22222 -13061 -3736 1080 -5825 -12555 -14250 -5502 2811 -1120 2596 -3141 -12165
64 -12165 -25353 -12122 -4247 -1777 -8514 -8397 -3792 -9251 -4605 -9047 -20437 -18725 -17799 -15058 -14493
49 -14493 -19596 -18586 -823 1543 -13685 -15823 -16339 -17493 -10141 -9122 -5641 -10975 -12944 -14856 -12501
34 -12501 -13427 -20249 -21671 -20561 -23382 -16857 -6822 -12225 -19204 -25121 -25555 -19776 -14783 -5054 -3652
19 -3652 -2267 -7481 -9296 -17541 -21750 -15448 -12702 -8917 -9250 -16478 -18164 -18063 -10946 -16201 -20639 -32718
3 -32718 -23695 -11952 -19044
0 -19044
$$ Imaginary data points
##PAGE= N=2
##DATA TABLE= (X++(I..I)), XYDATA
32767 75814 73168 77961 87870 95693 95558 89171 82115 74404 71118 78775 78720 84034 78863 75508 84232
32752 84232 81971 91428 102997 98646 85882 81949 87781 91681 91669 98607 100919 102825 113278 114575
32738 114575 99668 97068 96844 102268 108656 106365 104373 109671 117249 111611 112259 108813 103862 107776
32724 107776 113974 115167 123419 122135 122918 128251 127165 127184 138299 146002 127297 114808 112226 112854
32710 112854 117799 127421 128209 125925 120032 128876 137677 133151 126658 120053 117467 116340 112069 116995
32696 116995 115897 121279 136692 140286 142804 139856 142191 145386 145398 147047 148840 155386 158829 156823
32682 156823 160691 156942 151866 152324 161277 168337 172729 171139 166659 168031 170934 168345 162384 163909
32668 163909 167456 167650 173111 175565 164573 165271 168175 178838 188353 184753 176769 165695 167241 169406
32654 169406 162519 160107 158250 170536 178132 179625 186307 180845 181267 189132 194153 188690 182589 184035
32640 184035 176862 177819 190133 200619 197532 204591 207282 196736 186063 184503 192829 185740 190800
32627 190800 199676 200419 208008 203146 196148 200629 194346 198497 200126 202119 210591 213748 206557 205099
32613 205099 209408 212711 214435 216585 212885 201470 200235 194842 178320 178452 200028 200113 185740 191211
32599 191211 206354 210160 207007 212369 207272 207264 213795 216929 214471 210471 211071 221942 224578 228224 226802
32584 226802 228006 219824 215428 225081 244379 245559 239045 231768 235766 248135 247186 234259 215660
32571 215660 214657 222610 235162 247470 246178 233644 217118 223872 236630 233267 235382 240483 245464
32558 245464 234881 227113 241813 255638 248358 236571 239263 248108 256459 262357 266462 260704 260787 263701
32544 263701 255877 255550 254023 260711 257951 249358 242508 241316 244381 270412 277106 269995 265341 263917
32530 263917 272750 269317 259796 263983 255394 257552 253307 259285 271498 278234 271211 263258 258567 259084
32516 259084 263740 259229 270103 275057 278330 276579 279648 280935 275475 278063 278326 277338 284359 287787
32502 287787 281776 284326 284794 272311 273329 286793 294215 299447 294478 287325 284143 286012 285697 291453
32488 291453 290975 286925 288557 289210 285963 292482 287434 272460 273146 295843 292324 279621 291793 308492
32474 308492 303987 301007 301011 290385 293618 290992 285872 299613 305476 319360 322268 314967 307764 306434
32460 306434 299797 302341 303012 302940 291208 292765 290656 294626 302037 304068 318111 323049 314939 318004
32446 318004 319089 310442 306172 304448 304405 300417 300006 294352 290724 288141 290576 295046 307271 305803 309842
32431 309842 309695 303429 311739 314532 322560 316707 295710 286553 288017 296041 300410 308559 330458 333898
32417 333898 321579 317970 307120 299248 294950 295919 310150 317496 327319 330924 338542 334710 321220
32404 321220 306079 309933 309388 316739 320497 327888 343086 330055 326687 326485 324329 320657 328712 324025
32390 324025 316430 307950 296266 297992 304574 300815 309151 320347 325948 332283 334335 332431 325859 332457
32376 332457 326583 319676 332634 339302 335652 329159 315906 310613 307921 318325 323841 314893 318847
32363 318847 327545 325964 324630 329325 323216 310142 313158 317221 335763 341412 344716 351116 354201 355201
32349 355201 360187 343351 329411 326237 325840 318514 321830 331767 332794 319841 305547 312748 326480
32336 326480 329571 328478 326696 335846 345106 340691 339709 343555 361988 365405 351184 342442 339808 340135
32322 340135 334984 329695 330462 339360 348519 342774 336386 337846 350446 358254 361701 353435 348164 347440
32308 347440 363940 369024 362539 360937 355294 359338 360792 348587 351835 357611 359852 370186 370801 358224
32294 358224 356491 362437 365701 367451 354531 347551 354803 360886 352304 346467 354539 363505 362221 360634
32280 360634 371067 370833 376439 357469 338061 335380 331717 344251 347953 349362 344316 341934 344339
32267 344339 352729 343411 345742 363860 384294 397230 382595 368845 361563 356296 358292 359360 370724
32254 370724 374133 365054 362321 367386 344235 340637 345849 355366 364319 371660 360723 373580 381868
32241 381868 380213 363227 351219 362355 374923 376726 372828 382036 379985 365479 363818 357603 345396
32228 345396 341701 341567 342856 342302 358086 361897 372187 370154 362294 372064 374536 363113 350151 347855
32214 347855 352252 363560 359981 339570 337271 347268 364050 368409 366323 356123 341404 341254 362039
32201 362039 369979 366169 361732 367994 367096 365879 368795 353944 350175 348296 356194 357320 357902 353803
32187 353803 348763 346978 348341 347639 347051 353518 364144 363437 362698 367529 354047 353614 363429 365879 375911
32172 375911 367284 354765 348941 344355 342584 340551 351882 362050 359830 360444 362738 374179 384062
32159 384062 376293 370865 371294 376919 382382 374406 381904 387523 387284 382964 384824 382603 372897 377327 375728
32144 375728 375606 374652 371241 367153 361548 352050 364534 367482 363208 357497 363089 360485 358870 355782
32130 355782 350631 349969 348866 343235 355971 379107 378421 366196 367474 371847 364548 357983 375241 387692
$$ [...]
##END NTUPLES=NMR SPECTRUM
##END=
