##TITLE=Analysis number 319327
Compound Code cc 35510
Project Code adrs
Chemist Name fudan
##JCAMPDX= 6.0         $$ Bruker NMR JCAMP-DX V2.0
##DATA TYPE= NMR SPECTRUM
##DATA CLASS= NTUPLES
##ORIGIN= Bruker BioSpin GmbH
##OWNER= nmr
$$ XWIN-NMR		Version 3.5
$$ Wed May 10 13:55:15 2006 GMT Daylight Time (UT+1h)  MAYBRIDGE\nmr@NMR_250MHZ
##.OBSERVE FREQUENCY= 250.131544655141
##.OBSERVE NUCLEUS= ^1H
##.ACQUISITION MODE= SIMULTANEOUS (DQD)
##.ACQUISITION SCHEME= undefined
##.AVERAGES= 16
##.DIGITISER RES= 18
##SPECTROMETER/DATA SYSTEM= dpx250
##.PULSE SEQUENCE= zg30
##.SOLVENT NAME= CDCl3
##.SHIFT REFERENCE= (INTERNAL, CDCl3, 0, 16.522)
##AUDIT TRAIL= $$ (NUMBER, WHEN, WHO, WHERE, WHAT)
$$ ##TITLE= Audit trail, XWIN-NMR		Version 3.5
$$ ##JCAMPDX= 5.01
$$ ##ORIGIN= Bruker BioSpin GmbH
$$ ##OWNER= nmr
$$ C:\u/data/dgb/nmr/ADRS/4050/pdata/1/auditp.txt
$$ ##AUDIT TRAIL=  $$ (NUMBER, WHEN, WHO, WHERE, WHAT)
(   1,<2006-05-10 13:54:51.42 +100>,<MAYBRIDGE\nmr>,<NMR_250MHZ>,
      <created by zg, POWCHK disabled, PULCHK disabled
       configuration hash MD5:
       84 BC 41 DB A1 6E 1D 46 DA 25 12 A5 C1 ED C5 3A
       data hash MD5: 64K
       E5 FB CF 1B 9E FD A8 03 69 73 9C 2F 8D 2E A4 77>)
(   2,<2006-05-10 13:55:05.59 +100>,<MAYBRIDGE\nmr>,<NMR_250MHZ>,
      <Start of raw data processing
       ef LB = 0.3 FT_mod = 6 PKNL = 1 SI = 32K 
       data hash MD5: 32K
       37 B4 85 63 A2 72 D4 E4 12 65 65 55 19 7E 2C 96>)
(   3,<2006-05-10 13:55:07.26 +100>,<MAYBRIDGE\nmr>,<NMR_250MHZ>,
      <apk 
       data hash MD5: 32K
       5E 4D F7 0E 54 9D DC CB 52 86 DC 37 27 06 FA 56>)
(   4,<2006-05-10 13:55:08.00 +100>,<MAYBRIDGE\nmr>,<NMR_250MHZ>,
      <abs ABSG = 5 
       data hash MD5: 32K
       F4 54 40 EB 1C 28 30 B6 B5 03 F5 25 85 F0 4B E5>)
$$ ##END=
$$ 
$$ hash MD5
$$ D7 9F 1C BD D7 58 26 A2 C4 5E 0A 48 44 E6 38 14
##$RELAX= 
##$RELAX= 
##$RELAX= 
##$RELAX= 
##$RELAX= 
##$RELAX= 
##$RELAX= 
$$ Bruker specific parameters
$$ --------------------------
##$DU= <C:\u>
##$EXPNO= 4050
##$NAME= <ADRS>
##$PROCNO= 1
##$TYPE= <nmr>
##$USER= <dgb>
##$AMP= (0..31)
100 100 100 100 100 100 100 100 100 100 100 100 100 100 100 100 100 100 
100 100 100 100 100 100 100 100 100 100 100 100 100 100 
##$AQSEQ= 0
##$AQ_mod= 3
##$AUNM= <au_zg>
##$AUTOPOS= <37 >
##$BF1= 250.13
##$BF2= 250.13
##$BF3= 250.13
##$BF4= 250.13
##$BF5= 500.13
##$BF6= 500.13
##$BF7= 500.13
##$BF8= 500.13
##$BYTORDA= 1
##$CFDGTYP= 0
##$CFRGTYP= 5
##$CHEMSTR= <none>
##$CNST= (0..31)
1 1 145 1 1 1 1 1 1 1 1 1 1 1 1 1 1 1 1 1 1 1 1 1 1 1 1 1 1 1 1 1 
##$CPDPRG= <>
##$CPDPRG1= <>
##$CPDPRG2= <>
##$CPDPRG3= <>
##$CPDPRG4= <mlev>
##$CPDPRG5= <mlev>
##$CPDPRG6= <mlev>
##$CPDPRG7= <mlev>
##$CPDPRG8= <mlev>
##$CPDPRGB= <>
##$CPDPRGT= <>
##$D= (0..31)
0 1 0 0 0 0 0 0 0 0.06 0 0 0 0 0 0 0.0002 0 0 0 0 0 0 0 0 0 0 0 0 0 0 
0 
##$DATE= 1147265690
##$DBL= (0..7)
120 120 120 120 120 120 120 120 
##$DBP= (0..7)
150 150 150 150 150 150 150 150 
##$DBP07= 0
##$DBPNAM0= <>
##$DBPNAM1= <>
##$DBPNAM2= <>
$$ [...]
##$SUBNAM7= <"">
##$SUBNAM8= <"">
##$SUBNAM9= <"">
##$SW= 20.6930455092707
##$SWIBOX= (0..15)
0 0 3 0 0 0 0 0 0 0 0 0 0 0 0 0 
##$SW_h= 5175.983436853
##$TD= 65536
##$TD0= 1
##$TE= 295.16
##$TE2= 300
##$TE3= 300
##$TEG= 300
##$TL= (0..7)
0 120 120 120 120 120 120 120 
##$TP= (0..7)
150 150 150 150 150 150 150 150 
##$TP07= 0
##$TPNAME0= <>
##$TPNAME1= <>
##$TPNAME2= <>
##$TPNAME3= <>
##$TPNAME4= <>
##$TPNAME5= <>
##$TPNAME6= <>
##$TPNAME7= <>
##$TPOAL= (0..7)
0.5 0.5 0.5 0.5 0.5 0.5 0.5 0.5 
##$TPOFFS= (0..7)
0 0 0 0 0 0 0 0 
##$TUNHIN= 0
##$TUNHOUT= 0
##$TUNXOUT= 0
##$USERA1= <user>
##$USERA2= <user>
##$USERA3= <user>
##$USERA4= <user>
##$USERA5= <user>
##$V9= 5
##$VALIST= <valist>
##$VCLIST= <CCCCCCCCCCCCCCC>
##$VD= 0
##$VDLIST= <DDDDDDDDDDDDDDD>
##$VPLIST= <PPPPPPPPPPPPPPP>
##$VTLIST= <TTTTTTTTTTTTTTT>
##$WBST= 1024
##$WBSW= 4
##$XGAIN= (0..3)
0 0 0 0 
##$XL= 0
##$YL= 0
##$YMAX_a= 569981
##$YMIN_a= -629862
##$ZGOPTNS= <>
##$ZL1= 120
##$ZL2= 120
##$ZL3= 120
##$ZL4= 120
##$ABSF1= 16.522
##$ABSF2= -4.171173
##$ABSG= 5
##$ABSL= 3
##$ALPHA= 0
##$AQORDER= 0
##$ASSFAC= 0
##$ASSFACI= 0
##$ASSFACX= 0
##$ASSWID= 0
##$AUNMP= <proc_1d>
##$AZFE= 0.1
##$AZFW= 0.1
##$BCFW= 0
##$BC_mod= 0
##$BYTORDP= 0
##$COROFFS= 0
##$CY= 12.5
##$DATMOD= 1
##$DC= 0
##$DFILT= <>
##$DTYPP= 0
##$F1P= 14.0000005364418
##$F2P= -0.99999901652339
##$FCOR= 0.5
##$FTSIZE= 32768
##$FT_mod= 6
##$GAMMA= 0
##$GB= 0
##$INTBC= 1
##$INTSCL= 1
##$ISEN= 128
##$LB= 0.3
##$LEV0= 0
##$LPBIN= 0
##$MAXI= 10000
##$MC2= 0
##$MEAN= 0
##$ME_mod= 0
##$MI= 0
##$NCOEF= 0
##$NC_proc= -5
##$NLEV= 6
##$NOISF1= 0
##$NOISF2= 0
##$NSP= 0
##$NTH_PI= 0
##$NZP= 0
##$OFFSET= 16.522
##$PC= 1
##$PHC0= 164.4333
##$PHC1= 8.370872
##$PH_mod= 1
##$PKNL= yes
##$PPARMOD= 0
##$PSCAL= 4
##$PSIGN= 0
##$REVERSE= no
##$SF= 250.13
##$SI= 32768
##$SIGF1= 0
##$SIGF2= 0
##$SINO= 400
##$SIOLD= 32768
##$SREGLST= <1H.CDCl3>
##$SSB= 0
##$STSI= 32768
##$STSR= 0
##$SW_p= 5175.98343685301
##$SYMM= 0
##$S_DEV= 0
##$TDeff= 65536
##$TDoff= 0
##$TI= <Analysis number 999999
Compound Code 99
Book Reference 9
Project Code 9>
##$TILT= no
##$TM1= 0
##$TM2= 0
##$TOPLEV= 0
##$USERP1= <user>
##$USERP2= <user>
##$USERP3= <user>
##$USERP4= <user>
##$USERP5= <user>
##$WDW= 1
##$XDIM= 32768
##$YMAX_p= 412653808
##$YMIN_p= -244714
$$ End of Bruker specific parameters
$$ ---------------------------------
##NTUPLES= NMR SPECTRUM
##VAR_NAME=  FREQUENCY,     SPECTRUM/REAL,   SPECTRUM/IMAG
##SYMBOL=    X,             R,               I
##VAR_TYPE=  INDEPENDENT,   DEPENDENT,       DEPENDENT
##VAR_FORM=  AFFN,          ASDF,            ASDF
##VAR_DIM=   32768,         32768,           32768
##UNITS=     HZ,            ARBITRARY UNITS, ARBITRARY UNITS
##FACTOR=    0.157963299565203, 1,           1
##FIRST=     4132.6476996994, 0,             0
##LAST=      -1043.33573715361, 0,           0
##MIN=       -1043.33573715361, -244714,     0
##MAX=       4132.6476996994, 412653808,     0
$$ Real data points
##PAGE= N=1
##DATA TABLE= (X++(R..R)), XYDATA
$$ [...]
23686C6941K2277J0339p5761P001N7330r129N307o98K1k1065l3518l488L720l4237
$$ 36941 59218 69557 -6204 797 58127 48998 54305 53607 53628 32563 -955 -4443 -723 -34960
23672c4960o3330J8464K3617M9119J7888M9071K72m1204n2722J600j984o416L2168
$$ -34960 -98290 -79826 -56209 -7090 10798 59869 60141 18937 -33785 -32185 -34169 -40585 -8417
23659h417J3583j9043J3313k6922N0722n838n3381r429M7057j5688j7948K9577
$$ -8417 5166 -13877 -564 -27486 23236 17398 -35983 -45412 1645 -14043 -31991 -2414
23647b414j0411k5840J726K6970K5873j9341o2171q739L9355J7334j2268m701
$$ -2414 -12825 -38665 -36939 -9969 15904 -3437 -65608 -74347 -34992 -17658 -29926 -34627
23635c4627K2167k2033P941Q82J3987M0241q8668o0466Q9269L2740l3234J1832
$$ -34627 -12460 -34493 -26552 -25670 -11683 28558 -60110 -120576 -31307 1433 -31801 -19969
23623a9969J7087M795k8893K491K3634O09n0539K6393p3899q907m085j2174L863
$$ -19969 -2882 1913 -26980 -24489 -855 -246 -50785 -24392 -98291 -107198 -111283 -123457 -119594
23610a19594L3210j2559j3288j94j1403K8447K9444P5125J1253o680n5239m0229
$$ -119594 -86384 -98943 -112231 -112425 -123828 -95381 -65937 9188 20441 13761 -41478 -81707
23598h1707L2986L0760j6178l0650K054M4477M433J258m9695l8852O2141J6109
$$ -81707 -48721 -17961 -34139 -64789 -62735 -18258 -13825 -12567 -62262 -101114 -38973 -22864
23586b2864o257m6136K785R303K4229j6184m5141K720J8115l747k63J3918Q173
$$ -22864 -29121 -75257 -72472 -63169 -38940 -55124 -100265 -97545 -79430 -83177 -83440 -69522 -61349
23573f1349J7276K1384K943L106J7415J3479L3091k8763k5724J8895j7338J691
$$ -61349 -44073 -22689 -19746 -16640 775 14254 47345 18582 -7142 11753 -5585 -3894
23561c894l1231l2674M1865k594l432N351j0982o51N2739k9250n4192N0085L4789
$$ -3894 -35125 -67799 -25934 -28528 -31960 -26609 -37591 -38242 14497 -14753 -68945 -18860 15929
23548A5929k7859k7566L5228K7814l2115n9489l8047J9620N9051N1560l854k7581
$$ 15929 -11930 -39496 -4268 23546 -8569 -68058 -106105 -86485 -27434 24126 20272 -7309
23536g309o4480l0272L1559J9216K2001J8815K9066j2478o29j8851k9657J6212
$$ -7309 -71789 -102061 -70502 -51286 -29285 -10470 18596 6118 5489 -13362 -43019 -26807
23524b6807l1661K923j6426n7336K4953O7552K4677j4270K6374M2612J0450K0698
$$ -26807 -58468 -55545 -71971 -129307 -104354 -36802 -12125 -26395 -21 42591 53041 73739
23512G3739O055k0866K6624L4943k1451j2815L9686L7705p5831l8367n6504L7729
$$ 73739 79794 58928 85552 120495 99044 86229 125915 163620 87789 49422 -7082 30647
23500C0647K8105J6302k2079m5710o456M5660K7299K0284n3487l3733m2496k056
$$ 30647 58752 75054 52975 7265 809 46469 73768 94052 40565 6832 -35664 -37720
23488c7720J280K0289L0947J6116n071k648L8829l2051m6838J354k0999j0557
$$ -37720 -36440 -16151 14796 30912 25841 23193 62022 29971 -16867 -15513 -36512 -47069
23476d7069j2590j4650l316K5071M9921K6734J7587r732j3347o7377m2227k7161
$$ -47069 -59659 -74309 -77625 -52554 -2633 24101 41688 31956 18609 -48768 -90995 -118156
23464a18156L4055J23080K0815n1066J5194n753j0113q9669Q475L0066K995N9363
$$ -118156 -84101 38979 59794 8728 23922 18169 8056 -81613 -73138 -43072 -40077 19286
23452A9286K7370m1745J1158K4891m2000J6727P4689Q162m2117k7040j2623l8948
$$ 19286 46656 4911 16069 40960 -1040 15687 90376 98538 56421 29381 16758 -22190
23440b2190m4418j1206J41n1811k099P2025N5263L3439k8134k2909j0918R754
$$ -22190 -66608 -77814 -77673 -129484 -131583 -59558 -4295 29144 1010 -21899 -32817 -23063
23428b3063K748j8331k863l2567n5030P365M1754M0642m730p09r394n4112N692
$$ -23063 -20315 -38646 -41509 -74076 -129106 -121741 -79987 -39345 -44075 -44784 -54178 -108290 -102598
23415a02598M5905P6994q0934n0296k0669K0514J0600M1562Q590K046o298n9838
$$ -102598 -56693 20301 -60633 -110929 -131598 -111084 -100484 -58922 -50332 -48286 -54584 -114422
23403a14422j9214N6326L5861n6479J1986M4052M5434L4169o185n0199M87J024
$$ -114422 -133636 -77310 -41449 -97928 -85942 -41890 3544 37713 31528 -18671 -18184 -17160
23391a7160n904R559J2136R33M35k0033N16L1498J2743p4383J5820L9650l173
$$ -17160 -23064 -13505 -1369 -436 -1 -20034 -19518 11980 24723 -49660 -33840 5810 2637
23378B637m1268j6057k4394K7612l1630R823L9473R421K8249N1407M03j7041K5679
$$ 2637 -38631 -54688 -79082 -51470 -83100 -73277 -33804 -24383 3866 55273 55676 38635 64314
23365F4314k3538n1600J189N0091k4666j6944p075j3057P27l5721j084K0150r845
$$ 64314 40776 -10824 -9635 40456 15790 -1154 -8229 -21286 -20559 -56280 -57364 -37214 -47059
23352d7059l0594O832O6171P923m4355J282K5096l1912j0651M3686j6440J5702
$$ -47059 -77653 -70821 -4650 3273 -41082 -39800 -14704 -46616 -57267 -13581 -30021 -14319
23340a4319M3924M8815J5875p053l7802p93j0799Lk4094K1740L0411k2379m5847
$$ -14319 29605 78420 94295 87242 49440 48647 37848 37851 13757 35497 65908 43529 -2318
23327b318J5081O6784q009l405o5721J1728J8001m2867n2689O658Q4669K0386
$$ -2318 12763 79547 71538 68133 2412 14140 32141 -10726 -63415 -56757 27912 48298
23315D8298L6958p970l4170J7234j5167J6635o606l7892m7188k0287q07r195j9486
$$ 48298 85256 77286 43116 60350 45183 61818 55212 17320 -29868 -50155 -50962 -60157 -79643
23302g9643N3976R5448K7355n7721p281r340k0736J8472q187J0056l3234k8903
$$ -79643 -25667 69781 97136 39415 32134 22794 2058 20530 12343 22399 -10835 -39738
23290c9738J7861k9942o0476L9566K0705l4781l2883M1961M1111l775m0824N5555
$$ -39738 -21877 -51819 -112295 -72729 -52024 -86805 -119688 -77727 -36616 -40391 -81215 -25660
23278b5660j1761o4205M853P308M3264N9039k3016l4649k6712p51N647M3425L1540
$$ -25660 -37421 -101626 -96773 -89465 -46201 12838 -10178 -44827 -71539 -72290 -66643 -23218 8322
23265H322J3522K758K3824l0453L0680R1867K0289j7935o1630J8825l6799m7415
$$ 8322 21844 24602 48426 17973 48653 140520 160809 142874 81244 100069 63270 15855
23253A5855q217j1034j4853m142L2910n189n2478m9488K3352J0926j8354N3624
$$ 15855 7638 -3396 -18249 -22391 10519 5330 -47148 -96636 -73284 -62358 -80712 -27088
23241b7088N5634M5663K7136K3539l981j6300l4201o7416J080L1363J7218J6800
$$ -27088 28546 74209 101345 124884 120903 104603 70402 2986 4066 35429 52647 69447
23229F9447Q434l0597k2684l4293k8574J9824L8773N7065M1885m3029l9193q4155
$$ 69447 77881 47284 24600 -9693 -38267 -18443 20330 77395 119280 76251 37058 -47097
23217d7097k4254o6549L6492O6021L153J9336J9389p471j754j4915O217p967J2729
$$ -47097 -71351 -137900 -101408 -35387 -32234 -12898 6491 -980 -2734 -17649 -11432 -19399 -6670
23204f670L1422j9371P229J1608N127l1113m599o2398j2447J7196K8837l2243
$$ -6670 24752 5381 12610 24218 29345 -1768 -6367 -68765 -81212 -64016 -35179 -67422
23192f7422k7254m9888L790N8893o09J3562o633J0707M9881o976j1144l7815j5793
$$ -67422 -94676 -144564 -140774 -81881 -82490 -68928 -75561 -64854 -14973 -21949 -33093 -70908 -86701
23179h6701R374O9248P1219m1690l0627K402J3691M2264j5116k2976k3790j8045
$$ -86701 -77327 -8079 63140 21450 -9177 -6775 6916 49180 34064 11088 -12702 -30747
23167c0747L4911m0183m9176K9143j5743O6909L6717m863m2045l2724J5169j5066
$$ -30747 4164 -36019 -85195 -56052 -71795 -4886 31831 26968 -15077 -47801 -32632 -47698
23155d7698k9874J4310O2674O556k4239q627n6400L7466J6808m7745j0859K8541
$$ -47698 -77572 -63262 -588 5968 -18271 -26898 -83298 -45832 -29024 -76769 -87628 -59087
23143e9087l3298J0740m3535N1978N4533j4713K0607j6030k0465J8944K7717q585
$$ -59087 -92385 -81645 -125180 -73202 -18669 -33382 -12775 -28805 -49270 -30326 -2609 -11194
23131a1194k3533N7275O1491j7765l4514J4507j6134j9418k1698o043R414K8283
$$ -11194 -34727 22548 84039 66274 31760 46267 30133 10715 -10983 -17026 -7612 20671
23119B0671l6677l6966K7219j3118l6357j3045M8167K3468K4183J376l8849J4931
$$ 20671 -16006 -52972 -25753 -38871 -75228 -88273 -40106 -16638 7545 8921 -29928 -14997
23107a4997L5513l2550m4820J3858O236j8796M658L2436J4200l8546o5721r041
$$ -14997 20516 -12034 -56854 -42996 -36760 -55556 -50898 -18462 -4262 -42808 -108529 -117570
23095a17570L0706J1715O728N398k250R459K1367K2082K0782M1485J6644j9693
$$ -117570 -86864 -75149 -68421 -63023 -65273 -55814 -34447 -12365 8417 49902 66546 46853
23083D6853o4201j6936n9314n3024M5069Q3231L1399r85K3032l1729m8942N839
$$ 46853 -17348 -34284 -93598 -146622 -101553 -18322 13077 12092 35124 3395 -45547 -39708
23071c9708O0382J9621r960l5321R285j5674O8646J0226n1719m8660K6242l3646
$$ -39708 20674 40295 30335 -4986 4299 -11375 57271 67497 15778 -32882 -6640 -40286
23059d0286n617L4669l0454p3K3441M4900J3123N5694K774k7800n5782o1722J5151
$$ -40286 -45903 -11234 -41688 -41761 -18320 26580 39703 95397 98171 70371 14589 -47133 -31982
23046c1982j1035l2484j998N326K4317K8172o223l6346k8165Q4174M0418m9434
$$ -31982 -43017 -75501 -77499 -72173 -47856 -19684 -25907 -62253 -90418 -6244 34174 -15260
23034a5260n8743P918k7017q460O5551J6915m2940j4065O390J4518P879M5096
$$ -15260 -74003 -66085 -93102 -101562 -36011 -19096 -62036 -76101 -69711 -55193 -47314 -2218
23022b218L9491K3612m8097m9872K9818k2536N137j2702k3911L0726J0883l1591
$$ -2218 37273 60885 12788 -37084 -7266 -29802 -24665 -37367 -61278 -30552 -19669 -51260
23010e1260M84L2584K2682L2847j5213m0483n9118l0585j5489J6954K4231L1146
$$ -51260 -50776 -18192 4490 37337 22124 -18359 -77477 -108062 -123551 -106597 -82366 -51220
22998e1220r90J4784O989o5693k8073O8680J1258J5082M5422L1989N318j0420
$$ -51220 -52210 -37426 -30437 -96130 -124203 -55523 -44265 -29183 16239 48228 53546 43126
22986D3126m8580k8343j3665k6060M1132N4540J5006K4634o429k0942l2982M932
$$ 43126 -5454 -33797 -47462 -73522 -32390 22150 37156 61790 55361 34419 1437 6369
22974F369K5720P689k7047j3330J8940K8819L2081n247j8367l7617l3443L3952
$$ 6369 32089 39778 12731 -599 18341 47160 79241 73994 55627 18010 -15433 18519
22962A8519k2358r064L0424L1772N3378j3623m7539o5882k4180M7145M3005l141
$$ 18519 -3839 -12903 17521 49293 102671 89048 41509 -24373 -48553 -1408 41597 38456
22950C8456l851k7366k8063P6179q44k6075k750m808J3700J2007O3565j0824l2324
$$ 38456 34605 7239 -20824 55355 54511 28436 25686 20878 34578 46585 110150 99326 67002
22937F7002o9199n8764m5219L2024Q7603J965r122j2668L952k3640L488K0985
$$ 67002 -2197 -60961 -106180 -74156 13447 15412 6290 -6378 -2426 -26066 -22578 -1593
22925a593l8558l3041L3760j2414J706M06l34N403K4727k6341k857N8196K4327
$$ -1593 -40151 -73192 -39432 -51846 -50140 -49734 -50068 -44665 -19938 -46279 -49136 9060 33387
22912C3387K24M3367M8911o8384p976p419k4773J3784J6115K1590j0855j2449
$$ 33387 33611 76978 125889 57505 49529 42110 17337 31121 47236 68826 57971 45522
22900D5522j3808J836J2923N290J1267j18661m2071J0115M6601J0013j6956P8917
$$ 45522 31714 33550 46473 51763 63030 -55631 -97702 -87587 -40986 -30973 -47929 30988
22888C0988P7494k9414r1776k6688K4918K9900K7053k7675M4423K6810l3665p0777
$$ 30988 108482 79068 -12708 -39396 -14478 15422 42475 14800 59223 86033 52368 -18409
22876a8409M2055K0916j9783n0110q919L538p176k0465m8191j2015L6864m990
$$ -18409 23646 44562 24779 -25331 -34250 -30712 -37888 -58353 -106544 -118559 -81695 -86685
22864h6685J3453k4203m3636L26J3985N1385j2298k009P3762K1212k2877N5438
$$ -86685 -73232 -97435 -141071 -140745 -126760 -75375 -87673 -89682 -15920 5292 -17585 37853
22852C7853L0638l5164m399q1180m762M5036J6281O4478R358m9870n8770M0820
$$ 37853 68491 33327 28928 -52252 -57014 -11978 4303 68781 78139 28269 -30501 10319
22840A0319K3377K1877l4924j499K2265k2723l918J5950p218j0208l081j4209
$$ 10319 33696 55573 20649 19150 41415 18692 14774 30724 23506 13298 10217 -3992
22828c992k1246M7371K9309k4615j9923M2998j4676p2222J8213K0544j5718J9367
$$ -3992 -25238 22133 51442 26827 6904 49902 35226 -36996 -18783 1761 -13957 5410
22816E410m7006m5160j8339M9260N2255L8429j0251k3983K6668L1759k4272j4343
$$ 5410 -41596 -86756 -105095 -55835 -3580 34849 24598 615 27283 59042 34770 20427
22804B0427j2746k3375k5045Q900j3597n6365J5980K8741J7411j6356m0502k0829
$$ 20427 7681 -15694 -40739 -31839 -45436 -101801 -85821 -57080 -39669 -56025 -96527 -117356
22792a17356J9422O1610L2597K4797p170j7786n1328k7562R713R979j6001L6210
$$ -117356 -97934 -36324 -3727 21070 13900 -3886 -55214 -82776 -73063 -63084 -79085 -42875
22780d2875k544p450j7741k9651K403M0883o43N1645o148n1875o1688l695K670
$$ -42875 -45419 -52869 -70610 -100261 -97858 -56975 -57618 -5973 -12121 -63996 -125684 -129379 -126709
22767a26709m111L6627L3106l103P352N0298O855J0450m2831m9818m9642M170
$$ -126709 -130820 -94193 -61087 -64190 -56838 -6540 315 10765 -32066 -81884 -131526 -127356
22755a27356L4063M9777L1278o0869Q108N4449N075n852K4901N1869k7367L5645
$$ -127356 -93293 -43516 -12238 -73107 -64999 -10550 -5475 -11327 13574 65443 38076 73721
22743G3721L492k5476j5876j3960k5219L0163n163L083N806k2607L1556J7957
$$ 73721 77213 51737 35861 21901 -3318 26845 21682 24765 30571 7964 39520 57477
22731E7477l9110p556J2593m9201m8032K0514M6111L2045M856l4334l7020j4915
$$ 57477 18367 10811 23404 -25797 -73829 -53315 -7204 24841 29697 -4637 -41657 -56572
22719e6572K708L0868L4759M247r239l3744J4542m7478O778L0076p214L8290K1481
$$ -56572 -53864 -22996 11763 16010 6771 -26973 -12431 -59909 -53131 -23055 -30269 8021 29502
22706B9502P144K6327p257k1166j3340k1008k0985K631l1910O717k2098K9268
$$ 29502 36646 62973 55716 34550 21210 202 -20783 -18152 -50062 -43345 -65443 -36175
22694c6175L2634J027O0729m4374l0105L028K267P078k6650L2961J3392m9587
$$ -36175 -3541 -2514 58215 13841 -16264 -13236 -10969 -3891 -30541 2420 15812 -33775
22682c3775k0070J0246N5137M2740j519l1035k3428p3942r555O931J5526l0016
$$ -33775 -53845 -43599 11538 54278 52759 21724 -1704 -75646 -85201 -78270 -62744 -92760
22670i2760o852j6193M8226K1289j209k4320J8898L5220j9672J2118M286N0167
$$ -92760 -99612 -115805 -67579 -46290 -47499 -71819 -52921 -17701 -37373 -25255 -20969 29198
22658B9198m3022k8100N026j1313J2977r178L1290J503J2186n9332m2328l243
$$ 29198 -13824 -41924 -36898 -48211 -35234 -44412 -13122 -11619 567 -58765 -101093 -104336
22646a04336K2782j6359q855o373M1105J8510P917Q8611N4354K3210k0445k4709
$$ -104336 -81554 -97913 -106768 -113141 -72036 -53526 -45609 43002 97356 120566 100121 75412
22634G5412o8412l8140K0262l4655M982N157M4323L9646m0873n080N1838M0572
$$ 75412 7000 -31140 -10878 -45533 -40551 -35394 8929 48575 7702 2622 54460 95032
22622I5032j8743j0005k645j3275o1415k0692J2914N286r474P019J0611j4126
$$ 95032 76289 66284 63639 50364 -11051 -31743 -18829 -13543 -23017 -15998 -5387 -19513
22610a9513J8715M1524K0577m9633p725M7703q2954K3239k052m8997n8233n043
$$ -19513 -798 40726 61303 11670 3945 51648 -31306 -8067 -10119 -59116 -117349 -122392
22598a22392M5654L9111j8688j6235j0277L7202O1916l3786m760N6143j6011r625
$$ -122392 -76738 -37627 -56315 -72550 -82827 -45625 16291 -17495 -22255 33888 17877 8252
22586H252k7082m5763J2975K6059k4472k8947K2986R306L3708M171J6971k4155
$$ 8252 -18830 -64593 -51618 -25559 -50031 -78978 -55992 -46686 -12978 -8807 8164 -15991
22574a5991k6008R052J505j8176K0043p091K3351k3811K2328j940o250k1315n9667
$$ -15991 -41999 -32947 -31442 -49618 -29575 -36666 -13315 -37126 -14798 -16738 -22988 -44303 -103970
22561a03970M1469L686k6783j316O852N8105L7617j352l588k7800k1847n076K7966
$$ -103970 -62501 -58815 -85598 -86914 -80062 -21957 15660 14308 10720 -17080 -38927 -44003 -16037
22548a6037J1171j6721r482m3646K4630M8483r265q391k2373k1336L315k78P51
$$ -16037 -4866 -21587 -31069 -74715 -50085 -1602 -10867 -19258 -41631 -62967 -59652 -59930 -59179
22535e9179P375M471L3579N1349J9829m3263o6778l1539L3233l773Q945K4830
$$ -59179 -51804 -47333 -13754 37595 57424 14161 -52617 -84156 -50923 -54696 -45751 -20921
22523b0921N0990J0580m0477k0379j3196M8784L3719l6977n0926j4234m0373j2786
$$ -20921 30069 40649 172 -20207 -33403 15381 49100 12123 -38803 -53037 -93410 -106196
22511a06196O5726K9052M256p753J8398k8193O677J3869j2652l0830l6164j3572
$$ -106196 -40470 -11418 -7162 -14915 3483 -24710 -18033 -4164 -16816 -47646 -83810 -97382
22499i7382M7845k9996L9767L3912K4382J961J6231j596m2723k2890M533O8812
$$ -97382 -49537 -79533 -39766 -5854 18528 20489 36720 35124 -7599 -30489 -25956 42856
22487D2856M2860J476k5917q047j4093m8747o8328O07M3569L2946R930K4702k0863
$$ 42856 85716 87192 61275 53228 39135 -9612 -77940 -77333 -33764 -818 9112 33814 12951
22474A2951k0281m4202k8787J5761J5132J1733L1530M9903l3100j4898l5554m9924
$$ 12951 -7330 -51532 -80319 -64558 -49426 -37693 -6163 43740 10640 -4258 -39812 -89736
22462h9736J5763J572j7798j8121M851M5321L4475l312m2272k3046q169L4360
$$ -89736 -73973 -72401 -90199 -108320 -103469 -58148 -23673 -26985 -69257 -92303 -100472 -66112
22450f6112K471N918L8400m060j029J6025j979j4659k8278o185J0629J6774K7182
$$ -66112 -63641 -57723 -19323 -23383 -24412 -8387 -10366 -25025 -53303 -59488 -48859 -32085 -4903
22437d903k5061k2039K9718m6415m4631l0660K9219K8307o719k9842J5484L1304
$$ -4903 -29964 -52003 -22285 -68700 -113331 -143991 -114772 -86465 -93184 -123026 -107542 -76238
22425g6238K7358L4624N0132n3392k7821N1079M0154n7383J436M2622N1185k4304
$$ -76238 -48880 -14256 35876 -17516 -45337 5742 45896 -11487 -10051 32571 83756 59452
22413E9452n9689m8778m347N0265J6790p136j7523n6541P975Q1999K1587l0418
$$ 59452 -237 -49015 -53362 -3097 13693 6557 -10966 -67507 -59532 22467 44054 13636
22401A3636k9151j9046m5455j7504J2330K6007R603J5661N3203O9066J6467p426
$$ 13636 -15515 -34561 -80016 -97520 -85190 -59183 -49580 -33919 19284 88350 104817 97391
22389I7391L6145J6022o2117o7040k8748j2582k8337k6100j2411M3650J6231L7860
$$ 97391 133536 149558 87441 20401 -8347 -20929 -49266 -75366 -87777 -44127 -27896 9964
22377I964Q9370J1253M982l3695R541k4352l9050M186K0583k5628j619k9506R539
$$ 9964 99334 110587 115569 81874 91415 67063 28013 32199 52782 27154 25535 -3971 5568
22364E568j2683P531J2093J583k49o709N515J4199n732l7987m2113M6327J7527
$$ 5568 -7115 416 12509 14092 13843 7134 12649 26848 21116 -16871 -58984 -12657 4870
22351D870P148j9658j6891m3827l978L182L8362J9040L6071O2807l8681q2762
$$ 4870 12018 -7640 -24531 -68358 -72336 -69154 -30792 -11752 24319 87126 48445 -34317
22339c4317N5761L0813o6724n273J02300N7018m3617K289m0922o8514m7670K9729
$$ -34317 21444 52257 -14467 -19740 82560 139578 95961 98250 57328 -11186 -58856 -29127
22327b9127p19k2262r860P9o699J3638J1503N0815J3561k2175J0359P6058m8806
$$ -29127 -29846 -52108 -61968 -61889 -68588 -54950 -43447 7368 20929 -1246 9113 85171 36365
22314C6365p3957Q1479J1596k4896p432J3914K3192r316j2296r086k7857m5136
$$ 36365 -37592 43887 55483 30587 23155 37069 60261 50945 38649 29563 1706 -43430
22302d3430K3478M9559J0292k414n840q3445K9070O3265k2112k4289k4365L889
$$ -43430 -19952 29607 39899 37485 31645 -51800 -22730 40535 18423 -5866 -30231 -26342
22290b6342M576J3854k3770L1772K2454k2058k1328R026M1587L1216j1649p0055
$$ -26342 -21766 -7912 -31682 90 22544 486 -20842 -11816 29771 60987 49338 -20717
22278b0717k8815j1765k7567M1J8765N3188k340R571R867o9046K6863P8137M729
$$ -20717 -49532 -61297 -88864 -88823 -70058 -16870 -19210 -9639 228 -68818 -41955 36182 40911
22265D0911k0184l5835p106k8481N9780R584k0376q492J4696K5461O4405o7956
$$ 40911 20727 -15108 -22214 -50695 9085 18669 -1707 -10199 4497 29958 94363 26407
22253B6407k6905O4048q2231r1593M5811N2822m569N289J1111j410J188J9p4630
$$ 26407 -498 63550 -18681 -110274 -64463 -11641 -16210 -10921 190 -1220 -32 -13 -74643
22240g4643J8276J1611Q732L4994P4780J0300j7536j1608o239o9937k1577l9968
$$ -74643 -56367 -44756 -36024 -1030 73750 84050 66514 54906 48667 -21270 -42847 -82815
22228h2815P583R0735j6551o509L0140L3917m5041j4526n9631l180k9612K7175
$$ -82815 -75232 15503 -1048 -7557 22583 56500 11459 -3067 -62698 -65878 -95490 -68315
22216f8315j7767K0539R049o2796L4036P4118L53j2091q258L3343n160j3179M025
$$ -68315 -86082 -65543 -56494 -119290 -85254 -11136 -10783 -22874 -31132 2211 -2949 -16128 -12103
22203a2103L8675K3583k5375o606P40o803K0509M2208r1085j4470l5319J2705
$$ -12103 26572 50155 24780 18174 18914 12111 32620 74828 -16257 -30727 -66046 -53341
22191e3341J99J5918O8403P5593l7826n7879m8017N7327l5215j4825J5324k0867
$$ -53341 -53142 -37224 31179 106772 68946 11067 -36950 20377 -14838 -29663 -14339 -35206
22179c5206K5458L2545J8558j6761j4602m0660K93O134L4565J7340R667n711q831
$$ -35206 -9748 22797 41355 24594 9992 -30668 -30375 -24241 10324 27664 37331 31620 22789
22166B2789k6049m3349M769K7572K2665k43j4802j6215P270k6011M5711J8698
$$ 22789 -3260 -46609 -41840 -14268 8397 8154 -6648 -22863 -15593 -41604 4107 22805
22154B2805k6373J6484M6172p732m47k982n6680p324O0706R089O2387l0684r9897
$$ 22805 -3568 12916 59088 51356 50909 47927 -8753 -16077 44629 53718 116105 85421 -14476
22141a4476o9760n527M9270M711K5561M8554R773r275m4732k0566j4646j7957
$$ -14476 -84236 -89763 -40493 -35782 -10221 38333 48106 38831 -5901 -26467 -41113 -59070
22129e9070M6249N205l30K2778j1239N207j0640J4779K9872l8821M611j1157J8407
$$ -59070 -12821 -7616 -7946 14832 3593 8800 -1840 12939 42811 3990 8601 -2556 15851
22116A5851o5962j5040K2491J5463J4736q659l717k0836l722j5676M3676M8650
$$ 15851 -50111 -65151 -42660 -27197 -12461 -21120 -24837 -45673 -49395 -65071 -21395 27255
22104B7255k4257p5806q616N1300k8282j0692J6839K6042k9131j830M0154k6082
$$ 27255 2998 -72808 -81424 -30124 -58406 -69098 -52259 -26217 -55348 -57178 -17024 -43106
22092d3106m472Q056N1848L1690n6204q0547P835K2951K5810M5574j8059p220
$$ -43106 -47578 -39522 12326 44016 -12188 -92735 -84900 -61949 -36139 9435 -8624 -15844
22080a5844l01j9443p01N990r244K727P0435j1264k357P902K4278k0775j482K6709
$$ -15844 -16145 -35588 -36289 -30299 -39543 -36816 33619 22355 19998 27900 52178 31403 29921 56630
22066E6630j5122n774P425k1829K5048Q175J5773J0311p746k3863m0203J5291
$$ 56630 41508 35734 43159 21330 46378 54553 70326 80637 72891 49028 8825 24116
22054B4116p260l8519P956J3926K0992O772M034q217J2838r315o29l0510o454
$$ 24116 16856 -21663 -13707 219 21211 27983 32017 23800 36638 27323 26694 -3816 -10270
22041a0270K5173M1916L547m2821J4674M1152K9224l8313l6027L5547q073k9222
$$ -10270 14903 56819 60366 17545 32219 73371 102595 64282 28255 63802 55729 26507
22029B6507l6388l9409j0507O0974M9128N326j2256j8243p3498j2936N2898j4498
$$ 26507 -9881 -49290 -59797 1177 50305 55631 43375 25132 -48366 -61302 -8404 -22902
22017b2902j7324K0242L1493M9169r137o0926j1858o549J0927K7506K9438M9351
$$ -22902 -40226 -19984 11509 60678 51541 -9385 -21243 -27792 -16865 10641 40079 89430
22005H9430J4407K4962R293m5219l7782r334p1382j3456N3496Q3842r171j4736
$$ 89430 103837 128799 138092 92873 55091 45757 -25625 -39081 14415 98257 89086 74350
21993G4350l6273m8745k3177L2602l1473n979L6500k5544J0839J3452L3346m634
$$ 74350 38077 -10668 -33845 -1243 -32716 -38695 -2195 -27739 -16900 -3448 29898 25264
21981B5264l6015j4580K8893k7486K7541K4788O6615m848m2435o1035L371P576
$$ 25264 -10751 -25331 3562 -23924 3617 28405 95020 90172 47737 -13298 -9927 -2351
21969b351M5289L4220r5169l9727R860R579M3683J1416m5815j0511L541l4308
$$ -2351 42938 77158 -18011 -57738 -47878 -38299 5384 16800 -29015 -39526 -35985 -70293
21957g0293o798O8248l4947q688M07O195K4432L7999J532q98L4265M2573l815
$$ -70293 -77091 -8843 -43790 -52478 -52071 -45876 -21444 16555 18087 17189 51454 94027 90212
21944I0212n4135o6768J2154N1799L5796L3840J4471l4778k5503K159M8009M0046
$$ 90212 36077 -30691 -18537 33262 69058 102898 117369 82591 57088 59247 107256 147302
21932A47302k1632J333k6162m0437k6953k2853l1221l3249J6053N5751r594j2553
$$ 147302 125670 127003 100841 60404 33451 10598 -20623 -53872 -37819 17932 8338 -4215
21920d215K1255j4152j9824R143O6050o067p7514p4624o942m96Q4372p088K5285
$$ -4215 17040 2888 -16936 -7793 58257 52190 -25324 -99948 -106890 -107386 -23014 -30102 -4817
21907d817N187L903J954k0174M070m1485K8435O8967o7535k9601J9912j4601k6504
$$ -4817 370 4273 6227 -13947 -9877 -51362 -22927 46040 -21495 -51096 -31184 -45785 -72289
21894g2289m6500M48Q687O7103j1129K0371L4280k3804n017O918k1054k2285Q179
$$ -72289 -118789 -118341 -109654 -42551 -53680 -33309 971 -22833 -27850 -20932 -41986 -64271 -56092
21881e6092K5377R003K5102L2254k5996m5003N3771J0265j2505p950J0556k987
$$ -56092 -30715 -21712 3390 35644 9648 -35355 18416 28681 16176 8226 18782 15795
21869A5795n1030K5112J8808k5351l9988l8291L8528J0495j5683M7465M8075k6947
$$ 15795 -35235 -10123 8685 -16666 -56654 -94945 -56417 -45922 -61605 -14140 33935 6988
21857F988m4199K0934r420O0884K0362p3742O747l7489L5723L5131M7370k7143
$$ 6988 -37211 -16277 -25697 35187 55549 -18193 -11446 -48935 -13212 21919 69289 42146
21845D2146j5212r966K453R52j2632m598L5903Q055L5133j3079m3930k3406K4892
$$ 42146 26934 16968 19421 20373 7741 3143 39046 47101 82234 69155 25225 1819 26711
21832B6711K5700J8704m3534j3646l259N2995K2605j5754m96K2782m5539m7259
$$ 26711 52411 71115 27581 13935 10676 63671 86276 70522 70026 92808 47269 10
21820A0k5248Q220L953j7126l918L3102l755o574N8395K3562m8276j1525l6191
$$ 10 -25238 -17018 -13065 -30191 -34109 -1007 -4762 -11336 47059 70621 22345 10820 -25371
21807b5371o4887J3480L3737P00k6445O849j0112Q389K9789k7419L7621N5149
$$ -25371 -90258 -76778 -43041 -42341 -68786 -61937 -72049 -63660 -33871 -61290 -23669 31480
21795C1480O8724K0982m0644J1554j9392n891n387k5256l5128r429k0289n2784
$$ 31480 100204 121186 80542 92096 72704 66813 61426 36170 1042 -8387 -28676 -81460
21783h1460n6276N7159K5674Q836j6401l7716K3606j2328N480N2929K5792l9912
$$ -81460 -137736 -80577 -54903 -46067 -62468 -100184 -76578 -88906 -83426 -30497 -4705 -44617
21771d4617j1597J5999L7212N4043N219q6135l7454L8063O2546k8188p2313o512
$$ -44617 -56214 -40215 -3003 51040 56259 -29876 -67330 -29267 33279 5091 -67222 -73734
21759g3734M0452J9600q718N0961j7358j3669O032J74j430R396M0717j8271M23
$$ -73734 -33282 -13682 -22400 28561 11203 -2466 3566 3740 2310 11706 52423 34152 34575
21746C4575J1742L0712R337m9431O681J775j1883n0605n3442J5030J3941M0320
$$ 34575 46317 77029 86366 36935 43616 45391 33508 -17097 -70539 -55509 -41568 -1248
21734a248P522j2908J7087L117k7161j8218P596p34O9740R125l9194O213j7439
$$ -1248 6274 -6634 10453 13570 -13591 -31809 -24213 -24947 44793 53918 14724 20937 3498
21721C498n3923j7479m9314L6172M1606J5316l3810J126L5558r005m0789K500
$$ 3498 -50425 -67904 -117218 -81046 -39440 -24124 -57934 -56808 -21250 -30255 -71044 -68544
21709f8544N6605M8874m0428l3719k2893L5835Q2917K238n9833r913m478L3031
$$ -68544 -11939 36935 -3493 -37212 -60105 -24270 58647 60885 1052 -8861 -13339 19692
21697A9692k1784o8787M5597K1619k5861j2388K8321L3154J3104m7798o3350K8413
$$ 19692 -2092 -70879 -25282 -3663 -29524 -41912 -13591 19563 32667 -15131 -78481 -50068
21685e0068L5835P5603J4991n1657q386m064q309l0831l8725l7438l232L3606
$$ -50068 -14233 61370 76361 24704 16318 12254 3945 -26886 -65611 -103049 -106281 -72675
21673g2675K5641J8311J712M9386j3160n5045K0933j703L7019P4558m0781o8853
$$ -72675 -47034 -28723 -27011 22375 9215 -45830 -24897 -26600 10419 84977 44196 -24657
21661b4657j8132L2939P475j7114L2557k3859k3660l8876k1469K554L6400M5929
$$ -24657 -42789 -9850 -2375 -19489 13068 -10791 -34451 -73327 -94796 -92242 -55842 -9913
21649i913m051k702K8913K871o1942L9514K8927j6158j3243k9405j3663K4110
$$ -9913 -13964 -16666 12247 15118 -46824 -7310 21617 5459 -7784 -37189 -50852 -26742
21637b6742p695J5584q96m068J21n5929J1172L0260K0246k7577j3290N2466O212
$$ -26742 -34437 -18853 -19749 -23817 -23696 -79625 -68453 -38193 -17947 -45524 -58814 -6348 -136
21624a36p9482o23N0851M0565l284m3681r215r398j7690P9355L2826k2990m390
$$ -136 -79618 -80241 -29390 11175 7891 -35790 -45005 -54403 -72093 7262 40088 17098 12708
21611A2708L7502l6935j4159k015O360O754k3031l7386j5469K3952L4068L3229
$$ 12708 50210 13275 -884 -2899 3461 10215 -12816 -50202 -65671 -41719 -7651 25578
21599B5578J9731K9613K792l4639m8278m7990l2664J7759n7450p7028J7067Q5728
$$ 25578 45309 74922 77714 43075 -5203 -53193 -85857 -68098 -125548 -202576 -185509 -99781
21587i9781L7714m1146Q277K3020M7154L7275K4958n3757k0208m2738k3439O0402
$$ -99781 -62067 -103213 -94936 -71916 -24762 12513 37471 -16286 -36494 -79232 -102671 -42269
21575d2269L2334j2027j5072M1466O5230K146m6937k6843k5114k7468R969J8948
$$ -42269 -9935 -21962 -37034 4432 69662 71808 24871 -1972 -27086 -54554 -44585 -25637
21563b5637J2764k7433k9456K5559K879M8591k4927J693M2724k1577k6175l6501
$$ -25637 -12873 -40306 -69762 -44203 -41324 7267 -17660 -15967 26757 5180 -20995 -57496
21551e7496J0922k4453L401J1242Q958J3328j2629l5479K258o3L8240K3970L7664
$$ -57496 -46574 -71027 -67626 -56384 -47426 -34098 -46727 -82206 -79948 -80011 -41771 -17801 19863
21538A9863n361j6797j2383M3930L8282r724N5906Q905k0665l2727p318n3708
$$ 19863 14502 -2295 -14678 29252 67534 57810 113716 122621 101956 69229 61911 8203
21526H203o3571j0208l448J480L6640k201J0213R030k6731l4304n702N4382L0544
$$ 8203 -55368 -65576 -69024 -67544 -30904 -33105 -22892 -13862 -40593 -74897 -80599 -26217 4327
21513D327K081k4344k5728J07810N1301p2542n9459M9996L9146M7902j7662p8401
$$ 4327 6408 -17936 -43664 64146 115447 42905 -16554 33442 72588 120490 102828 24427
21501B4427o342o3177j3926L7978J9548J4551p302R605K2069k5231M859m966k9169
$$ 24427 18085 -45092 -59018 -21040 -1492 13059 5757 15362 37431 12200 17059 12093 -17076
21488a7076j8684j6848J5879L9781N1080M9548j9118o2345n2950k952k8395k9928
$$ -17076 -35760 -52608 -36729 3052 54132 103680 84562 22217 -30733 -33685 -62080 -92008
21476i2008K4168N3434k619j3798r172m6823J3764J2020R971K611p619J9117k8905
$$ -92008 -67840 -14406 -17025 -30823 -39995 -86818 -73054 -61034 -51063 -48452 -56071 -36954 -65859
21463f5859k7458l0130O958J3161M1464Q0293K4977j8268j1101O855k1933l8870
$$ -65859 -93317 -123447 -116489 -103328 -61864 18429 43406 25138 14037 20892 -1041 -39911
21451c9911O5155P6365j5945L7690J7301j0828j5264J5260k140r8211p1730J5040
$$ -39911 25244 101609 85664 123354 140655 129827 114563 129823 127683 29472 -42258 -27218
21439b7218K1465P712J4632o143k7418K9238R100j4185l7402j6106L6464L4410
$$ -27218 -5753 1959 16591 10448 -16970 12268 21368 7183 -30219 -46325 -9861 24549
21427B4549o090l4429j9005p498K4095o2880K3711Q6725Q433r039J0531K0924
$$ 24549 18459 -15970 -34975 -42473 -18378 -81258 -57547 29178 37611 28572 39103 60027
21415F0027k4925k0555n0407k5245K7579n309J8697m9656K0148M3450k2045k773
$$ 60027 35102 14547 -35860 -61105 -33526 -38835 -20138 -69794 -49646 -6196 -28241 -31014
21403c1014Q6838l6995J7221L8277n05l1475n3071r088P543K506K2610L1036m0384
$$ -31014 55824 18829 36050 74327 73822 42347 -10724 -19812 -12269 -9763 12847 43883 3499
21390C499k685k362Q832j7759o738L4113q056l749k8636m261J0122L2773L5821
$$ 3499 814 -1548 7284 -10475 -17213 16900 8844 5095 -23541 -27802 -17680 15093 50914
21377E0914M5665J1165r857K0984K8740j8855k5198l2301n7438k6334K0190j0105
$$ 50914 96579 107744 97887 118871 147611 128756 103558 71257 13819 -12515 7675 -2430
21365b430k3533k4455R714K3315j0482p564k4722j9389K9396N2589J2655L3856
$$ -2430 -25963 -50418 -40704 -17389 -27871 -35435 -60157 -79546 -50150 2439 15094 48950
21353D8950K2123k849J1001j3416j7266o3109J0052N1464k4472K4460p4698m4886
$$ 48950 71073 68224 79225 65809 48543 -14566 -4514 46950 22478 46938 -27760 -72646
21341g2646L5855J7260q638J2353k5110q019o461J8547p341N8734m523N878L3654
$$ -72646 -36791 -19531 -28169 -15816 -40926 -48945 -55406 -36859 -44200 14534 10011 15889 49543
21328D9543l5022J5476O6127j8465p642L8431k5985K9302l7157j0177J5287k4278
$$ 49543 14521 29997 96124 77659 70017 108448 82463 111765 74608 64431 79718 55440
21316E5440J3552J7019m1335l2489l1382j1690J0360K4874J3350k7821n4087K0465
$$ 55440 68992 86011 44676 12187 -19195 -30885 -20525 4349 17699 -10122 -64209 -43744
21304d3744Q817M7059n4169j3695j7782j8024O0182K5840R50k7492m7308L4363
$$ -43744 -34927 12132 -42037 -55732 -73514 -91538 -31356 -5516 -4566 -32058 -79366 -45003
21292d5003R3646L2824k6338l7439K0364k686L6578M1156p3953j23665L217L6572
$$ -45003 48643 81467 55129 17690 38054 35368 71946 113102 39149 -84516 -81299 -44727
21280d4727Q2201l411j995K7704R821k0317l4124o1068q0326O483M8843k063L8028
$$ -44727 37474 34063 32068 59772 69593 49276 15152 -45916 -126242 -119759 -70916 -72979 -34951
21267c4951L7383r608k4565K1795K8295K0755j1815k6571L4522L8629j9552m5774
$$ -34951 2432 -7176 -31741 -9946 18349 39104 27289 718 35240 73869 54317 8543
21255H543j1550N0917K5646M3651q012j13491o5557j2759N9964j0228k7782P963
$$ 8543 -3007 47910 73556 117207 109195 -4296 -69853 -82612 -22648 -32876 -60658 -52695
21243e2695O3427j2306J9275M1140j6583O5767J2475n5414q6046J8922Q3209L2193
$$ -52695 10732 -1574 17701 58841 42258 108025 120500 65086 -20960 -2038 81171 113364
21231A13364l5194m6906M08m3350M0702O3524k8891l6615n1042J0368L8168P947
$$ 113364 78170 31264 31672 -11678 29024 92548 63657 27042 -24000 -13632 24536 32483
21219C2483M1810m8215o8846j3933l0362P8527l965m2755L0626M1307j05043J439
$$ 32483 74293 26078 -42768 -56701 -87063 -8536 -12501 -55256 -24630 16677 -88366 -86927
21207h6927J18684L1513l6918j6220l6442q853k135M43R176K0666lq9333j8046
$$ -86927 31757 63270 26352 10132 -26310 -35163 -37298 -36855 -27679 -7013 -7016 -96349 -114395
21194a14395J0849P3557N1209P511j0300m5318O604k3310k753r160l838L0017
$$ -114395 -103546 -29989 21220 28731 18431 -26887 -20283 -43593 -46346 -55506 -59344 -29327
21182b9327K9093p282J2588k9821J1717L8772L0095j5030j25n4307m7201J6008
$$ -29327 -234 -7516 5072 -24749 -13032 25740 55835 40805 40680 -13627 -60828 -44820
21170d4820n942R304j186J1478K2539J7843l2606j22N2101q52o018k8793L302
$$ -44820 -50762 -41458 -42644 -31166 -8627 9216 -23390 -23512 28589 27737 21719 -7074 -3772
21157c772l0875K1034l9622J5444J7666m5595k5405J9796N4443M9714K386n9375
$$ -3772 -34647 -13613 -53235 -37791 -20125 -65720 -91125 -71329 -16886 32828 35214 -24161
21145b4161L1383O8316j2006l9680n0647J9592j08L3710K2503l4272k0639L6696
$$ -24161 7222 75538 63532 23852 -26795 -7203 -7311 26399 48902 14630 -6009 30687
21133C0687j2193k204k9066r336J6801M426J6640M0155K3866m0137o2057l1465
$$ 30687 18494 16290 -12776 -22112 -5311 -885 15755 55910 79776 39639 -22418 -53883
21121e3883J8893J9488m5097k3406P5574O3035j3995m5342k8603J2094N0632j8201
$$ -53883 -34990 -15502 -60599 -84005 -8431 54604 40609 -4733 -33336 -21242 29390 11189
21109A1189k7620p66R138o390k7800J926K8226N1148K7021J348J3224J7785p729
$$ 11189 -16431 -17197 -8059 -14449 -42249 -40323 -12097 39051 66072 67420 80644 98429 90700
21096I0700j6435l358k5984o6554M201L2498l227M3930O049m815K055l9828J159
$$ 90700 74265 70907 44923 -21631 -17430 15068 11841 55771 61820 57005 59060 19232 20391
21083B0391M7229L8540M302k1718j00384Q579j1768o9208K1135j5349K6552J2623
$$ 20391 67620 106160 110462 88744 -11640 -3061 -14829 -84037 -62902 -78251 -51699 -39076
21071c9076j0163m8649L117R243P4866K8801Q221L9440k575n4834J619M2221o9783
$$ -39076 -49239 -97888 -94771 -85528 -10662 18139 26360 65800 63225 8391 10010 52231 -17552
21058a7552o4812L7142N1333L5110j9020K3417k1473J1160J7928l9666n2840M609
$$ -17552 -82364 -45222 6111 41221 22201 45618 24145 35305 53233 13567 -39273 -34664
21046c4664O0307O222M2701l4587o4579l158J6345K4120k0263j1984j3157m3727
$$ -34664 25643 31865 74566 39979 -24600 -27758 -11413 12707 -7556 -19540 -32697 -76424
21034g6424j7702M1986J1170j6272J535k4238J5025K9526L6840N5024l3685k8461
$$ -76424 -94126 -52140 -40970 -57242 -55707 -79945 -64920 -35394 1446 56470 22785 -5676
21022e676k4336M78p848o5108O796N7387N2883L4381K2696l552n6339n9715L5139
$$ -5676 -30012 -29534 -37382 -102490 -95694 -38307 14576 48957 71653 68101 11762 -47953 -12814
21009a2814M8772o1118j258M9013j1657n95P922K6514n4722j9496n5806j536J5386
$$ -12814 35958 -25160 -26418 22595 10938 10343 18265 44779 -9943 -29439 -85245 -86781 -71395
20996g1395M0997L1161j2319j4142J4891N1723j7644j3968L1882J9596j4784K6237
$$ -71395 -30398 763 -11556 -25698 -10807 40916 23272 9304 41186 60782 45998 72235
20984G2235J3092j1400m1136l324l0569n7947m7689P0203K9213J383J1847L2026
$$ 72235 85327 73927 32791 29467 -1102 -59049 -106738 -36535 -7322 -5939 5908 37934
20972C7934N0920k7053m6295l4482K0356J1164J1933n109K964O7189l9000k8629
$$ 37934 88854 61801 15506 -18976 1380 12544 24477 19368 22332 89521 50521 21892
20960B1892R2j0511O584Q259j8197l0472m7962o2450M5041Q0566J5773l4468k2950
$$ 21892 21984 11473 18057 26316 8119 -22353 -70315 -132765 -87724 -7158 8615 -25853 -48803
20947d8803J1791K7081m544k747N1220K9982o747k8285l986r935l1581J5227J7456
$$ -48803 -37012 -9931 -14475 -17222 33998 63980 57233 28948 24962 15027 -16554 -1327 16129
20934A6129l0171m9116k2399M2928K3649N1857l4325l0147N4014N2336m0774o0433
$$ 16129 -14042 -63158 -85557 -42629 -18980 32877 -1448 -31595 22419 74755 33981 -26452
20922b6452K4259j225k4996k6930j028j0289O7573j2470J9729o565n5131k9855
$$ -26452 -2193 -3418 -28414 -55344 -56372 -66661 912 -11558 8171 1606 -53525 -83380
20910h3380J9039L8497l0374k5100O0043K5031R575l0696j140L9217P2664k9431
$$ -83380 -64341 -25844 -56218 -81318 -21275 3756 13331 -17365 -18505 20712 93376 63945
20898F3945k0397L7759j8483k7592m3997l31O0431L2227p5762K8893M6157l4966
$$ 63945 43548 81307 62824 35232 -8765 -9096 51335 83562 7800 36693 82850 47884
20886D7884m9874J0168J1481l2307K5274N9954L2942K376o567K6926L4394o4686
$$ 47884 -1990 8178 19659 -12648 12626 72580 105522 107898 101331 128257 162651 97965
20874I7965q2791n1581O4795J02435J0251r5632p2986m4709n752K5945Q0685L3745
$$ 97965 15174 -36407 28388 130823 141074 45442 -27544 -72253 -78005 -52060 28625 62370
20862F2370K9490r106o2023l8554L3261L79k5167o0423P501K7721K4514L10k1165
$$ 62370 91860 82754 20731 -17823 15438 15817 -9350 -69773 -62272 -34551 -10037 -9727 -30892
20849c0892J8947J2246k4077l983r96j6180p52L4406l6235l7826N816N7274O898
$$ -30892 -11945 301 -23776 -27759 -28755 -44935 -45687 -11281 -47516 -85342 -79526 -22252 -15354
20836a5354l5554l6405L5774N5918j586J7376m761m0032k8541j2769j5508k6206
$$ -15354 -50908 -87313 -51539 4379 2793 20169 15408 -24624 -53165 -65934 -81442 -107648
20824a07648M1642J3022n8169Q441M8666K1592N2393J8948N1437k2981m4239J5814
$$ -107648 -66006 -52984 -111153 -102712 -54046 -32454 19939 38887 90324 67343 23104 38918
20812C8918j6027n153J5037l7466l0462k510j0664L8344K7813P827p1035j1045
$$ 38918 22891 17738 32775 -4691 -35153 -37663 -48327 -9983 17830 25657 -45378 -56423
20800e6423K4977J6422j8854j588Q3045O3473m0088P111k5943n6443m8854K7284
$$ -56423 -31446 -15024 -33878 -35466 47579 111052 70964 78075 52132 -4311 -53165 -25881
20788b5881J0274q116J3633j4895l7905j6117j515L9869j3561o539L3107K8437
$$ -25881 -15607 -23723 -10090 -24985 -62890 -79007 -80522 -40653 -54214 -60753 -27646 791
20776G91J5584j2473n0507j2619m2786p957L7861K1567N528L5327K688l8265k6992
$$ 791 16375 3902 -46605 -59224 -102010 -109967 -72106 -50539 -45011 -9684 -6996 -45261 -72253
20763g2253L7029n450r860k1639J101P2494N7926k0900J0677N6402k0481n6304
$$ -72253 -35224 -40674 -50534 -72173 -71072 1422 59348 38448 49125 105527 85046 28742
20751B8742j1832m3471j2738M9089L0419k0436m3665k2935j1318M0285M4907j7231
$$ 28742 16910 -26561 -39299 9790 40209 19773 -23892 -46827 -58145 -17860 27047 9816
20739I816k7757M2119L6604k4577n0396Q829p735n06L7493J3411k6010o2059L8603
$$ 9816 -17941 24178 60782 36205 -14191 -5362 -13097 -13603 23890 37301 11291 -50768 -12165
20726a2165j6467o913J5698K9165j0109M9404J7982m6720j1625L8406M3863m2156
$$ -12165 -28632 -35545 -19847 9318 -791 48613 66595 19875 8250 46656 90519 48363
20714D8363j992p0p536k8793m1429n9244J1592Q5109M6502k3788k0914n2123m8008
$$ 48363 46371 46301 38765 9972 -31457 -90701 -79109 6000 52502 28714 7800 -44323 -92331
20701i2331M9446O6331j8224j8469j6943K0809m011M508o6209L7898K4869k0813
$$ -92331 -42885 23446 5222 -13247 -30190 -9381 -13392 -8884 -75093 -37195 -12326 -33139
20689c3139l2080K0213K1938L5317O16o611m9373J9665L2683M3683K6903o551
$$ -33139 -65219 -45006 -23068 12249 12865 6254 -43119 -23454 9229 52912 79815 73264
20677G3264j7457k3088L4552q336l4229k6055m1632j4720p631k7833N1921L3158
$$ 73264 55807 32719 67271 58935 24706 -1349 -42981 -57701 -65332 -93165 -41244 -8086
20665h086m208Q132K6517M811J1674L718L4169J0873J2577J858N519j6699l8589
$$ -8086 -12294 -4162 22355 27166 38840 42558 76727 87600 100177 102035 107554 90855 52266
20652E2266J0503J4543m2335P435m414k6976o029o895L0567J802q855L0088j3874
$$ 52266 62769 77312 34977 42412 37998 11022 4993 -1902 28665 30467 21612 51700 37826
20639C7826k7509l1311K3022N327k5198J0476k9712j7673Q403M7770K7370l2099
$$ 37826 10317 -20994 2028 7355 -17843 -7367 -37079 -54752 -46349 1421 28791 -3308
20627c308m288L1645O6570L3185m2531o5624l7299j4554P68N8653L5374n2531
$$ -3308 -7596 24049 90619 123804 81273 15649 -21650 -36204 -35436 23217 58591 6060
20615F060j0134j7744n7696O0062O1645J7671k4l7062k1794N847P0145L2087O885
$$ 6060 -4074 -21818 -79514 -19452 42193 59864 59840 22778 984 6831 76976 109063 115948
20602A15948l8416J6592J3355J943O240j386o3513j1046K3001j0172l1071o160
$$ 115948 77532 94124 107479 109422 115662 114276 50763 39717 62718 52546 21475 15315
20590A5315l955j5410j4930K5645J6044N9377K7921n9572j11257m2501L8587O0893
$$ 15315 11360 -4050 -18980 6665 22709 82086 110007 50435 -60822 -103323 -64736 -3843
20578c843k9980m7622O8174P9671M316J3901L154j8098j934k8463m2606J1557
$$ -3843 -33823 -81445 -13271 66400 70716 84617 87771 69673 67739 39276 -3330 8227
20566H227P8820n45k9956k185k8004L987J2619l633J7770n945j03110m5882P3705
$$ 8227 87047 86502 56546 54361 26357 30344 42963 39330 57100 51155 -51955 -97837 -24132
20553b4132M2023k6393k4322k6887L3283L6105o102M5414j1825j3498N1076m363
$$ -24132 17891 -8502 -32824 -59711 -26428 9677 3575 48989 37164 23666 74742 70379
20541G0379o81r450K864n0815p06L7266L0260k8771j6710K5074N336j5268l3132
$$ 70379 69698 60248 63112 12297 11591 48857 79117 50346 33636 58710 64046 48778 15646
20528A5646J6167l0687k2702k6909L0417K9225k6635j1729N0343J2762M3404M7777
$$ 15646 31813 1126 -21576 -48485 -18068 11157 -15478 -27207 23136 35898 79302 127079
20516A27079j6842p9922j5324J4206L2190Q145m0206m8115l0807J4457N17J2914
$$ 127079 110237 30315 14991 29197 61387 69532 29326 -18789 -49596 -35139 -34622 -21708
20504b1708K721l0004L5657Q5736J9006l4321l2338j3348K1748J2535m0916O364
$$ -21708 -18987 -48991 -13334 72402 91408 57087 24749 11401 33149 45684 4768 11132
20492A1132Q252o3374M998K1770j0734J1399m184O4443L2155n6812l382L5399
$$ 11132 19384 -43990 -38992 -17222 -27956 -16557 -20741 43702 75857 19045 15663 51062
20480E1062K632n4583j0614M1828M0741N463j19462J7510O3163R245n7625J3360
$$ 51062 53694 -889 -11503 30325 71066 76529 -42933 -25423 37740 46985 -10640 2720
20468B720M3009j2110o8590n8526q944N2396L7917j0562k7151k4740J4276K3125
$$ 2720 45729 33619 -34971 -93497 -102441 -50045 -12128 -22690 -49841 -74581 -60305 -37180
20456c7180j9681O0550N6352M7953K7443m2k7554k8199j5059m9279k7168k7385
$$ -37180 -56861 3689 60041 107994 135437 135395 107841 79642 64583 15304 -11864 -39249
20444c9249p525j842L6805P897L1365J849k907J3108j930K6258K4062L0956j2402
$$ -39249 -46774 -48616 -11811 -3914 27451 29300 26393 39501 37571 63829 87891 118847 106445
20431A06445k932o2361l8586j1637m7087K1O9383N863K4096l2668m9829J2806
$$ 106445 103513 41152 2566 -9071 -56158 -56137 13246 19109 43205 10537 -39292 -26486
20419b6486L4275M4457K5632n7741l1156L6973j4804j0252q257o0581o544k0343
$$ -26486 7789 52246 77878 20137 -11019 25954 11150 898 -7359 -67940 -74484 -94827
20407i4827K5353J9293L7253K8846L7778k4780j8974j2997l1863K2020N4941J7687
$$ -94827 -69474 -50181 -12928 15918 53696 28916 9942 -3055 -34918 -12898 42043 59730
20395E9730J4191k920N1497l615J0332l7596q3806k4670j8230N6127K7253j2030
$$ 59730 73921 71001 122498 118883 129215 91619 7813 -16857 -35087 21040 48293 36263
20383C6263k1118N496p86k7621K1950j3714L6489n1900O587l9572r603N1071M2358
$$ 36263 15145 20641 19855 -7766 14184 470 36959 -14941 -8354 -47926 -57529 -6458 35900
20370C5900l031m6053j7549P6664k193K483J1325l2037l1656k590j3854K520K918
$$ 35900 32869 -13184 -30733 45931 43738 46221 57546 25509 -6147 -8737 -22591 -20071 -17153
20357a7153L059L672L1544k146l7592o532m576L3715k246r761K0486L8780N2801
$$ -17153 -14094 -10422 21122 18976 -18616 -25148 -29724 3991 1745 -8016 12470 51250 104051
20344A04051n4452k6816K8217k3677m3866J120O4327J1511O88K2537l9601m2541
$$ 104051 49599 22783 51000 27323 -16543 -15423 48904 60415 61103 83640 44039 1498
20332A498Q354R394n6L7598K1836J7471J6064j646n61m6176k9471k0714J7246
$$ 1498 9852 19246 19190 56788 78624 96095 112159 110513 109952 63776 34305 13591 30837
20319C0837j8103k8337K070J3015L6035r10m799k9950Q900K0220o1875l4410m2733
$$ 30837 12734 -15603 -13533 -518 35517 34607 29808 -142 8758 28978 -32897 -67307 -110040
20306a10040Q642N8584N5135q441J8054L6605J6683K1480K4910O570N4566N1472
$$ -110040 -101398 -42814 12321 3880 21934 58539 75222 96702 121612 128182 182748 234220
20294B34220m1097r8205k0331l6392j9610J8740j1177J2338M133k1250o436q555
$$ 234220 193123 94918 74587 38195 18585 37325 26148 38486 42619 21369 14933 6378
20282F378l714j1720N523N573M8414l705k5563j0864K9514j8850J0747j3822O893
$$ 6378 2664 -9056 -3533 2040 50454 46749 21186 10322 39836 20986 31733 17911 24804
20269B4804j2943k1351K8851M9733l110K1545k3575l7997p599k7118r435j5399
$$ 24804 11861 -9490 19361 69094 65984 87529 63954 25957 18358 -8760 -18195 -33594
20257c3594O3889r746n9788l0593K072K7695J4586J76J6430L1865j536k1185l5314
$$ -33594 30295 20549 -39239 -69832 -67760 -40065 -25479 -25303 -8873 22992 21456 271 -35043
20244c5043P0338N9284l2501n4302Q86n82m4892k6222j9704M7099J14059K7360
$$ -35043 35295 94579 62078 7776 8662 8080 -36812 -63034 -82738 -35639 78420 105780
20232A05780o307k4872m2944J6748k0359j095J1684K2876M1953R2031k3147o2751
$$ 105780 99473 74601 31657 48405 28046 26951 38635 61511 103464 195495 172348 109597
20220A09597R444j4075r243k8118k5003J2317j0238K7745k3278k1244p804j983
$$ 109597 119041 104966 95723 67605 42602 54919 44681 72426 49148 27904 20100 18117
20208A8117R147K6100J1389q811R507K0168k9336m2635k9332J385K9454O5119
$$ 18117 27264 53364 64753 55942 65449 85617 56281 13646 -15686 -14301 15153 80272
20196H0272Q8171j1669q0216k7330K7244q259K1582M2906M4291n1731l5670L5765
$$ 80272 168443 156774 76558 49228 76472 68213 89795 132701 176992 125261 89591 125356
20184A25356P641k2879k3584k8105j8659J8280K5185k7809L0765K4503K4962l438
$$ 125356 132997 110118 86534 58429 39770 58050 83235 55426 86191 110694 135656 132218
20172A32218n7886m6118k536N8119O2974J8506l7465n9768l5153l4289K8097p337
$$ 132218 74332 28214 25678 83797 146771 165277 127812 68044 32891 -1398 26699 19362
20160A9362R404o265J1464L0014l1554n1160k8892L3638M5182M5694k8045O211
$$ 19362 28766 22501 33965 63979 32425 -18735 -47627 -13989 31193 76887 48842 55053
20148E5053J167j8165l4271L5211N2166L745k7651O2854O2247k3164m3436k142
$$ 55053 56220 38055 3784 38995 91161 94906 67255 130109 192356 169192 125756 123614
20136A23614l8774j24901o0410P6996O5045o8407L9409M4613J0043Q998j9045
$$ 123614 84840 -40061 -100471 -23475 41570 -26837 12572 57185 67228 76226 57181
20125E7181q220l3269J4692O1623l130J3906l3179l3322O85l6384o496k491K2513
$$ 57181 48961 15692 30384 92007 88877 102783 69604 36282 36967 583 -5913 -8404 14109
20112A4109R545J2283l2140o5750J1544M9154N6480K5854N1225q651l1438n211
$$ 14109 23654 35937 3797 -61953 -50409 -1255 55225 81079 132304 123653 92215 87004
20100H7004m0163l7429n0722p7574K4786P0571J5278j5917k8075K6955L9892K3150
$$ 87004 46841 9412 -41310 -118884 -94098 -23527 -8249 -24166 -52241 -25286 14606 37756
20088C7756j3952j6400R427M8039p623m6448l7395j2231K2767j2474J1405J8000
$$ 37756 23804 7404 16831 64870 57247 10799 -26596 -38827 -16060 -28534 -17129 871
20076H71M0378k2773l533p3453M506M5488M3981j6509K5352N6364n2440n5948
$$ 871 41249 18476 14943 -58510 -54004 -8516 35465 18956 44308 100672 48232 -7716
20064g716P9748M4112l2000l0501K7450j1000l0791l0324j068J9752j5204k4074
$$ -7716 72032 116144 84144 53643 81093 70093 39302 8978 7910 27662 12458 -11616
20052a1616O287l1637O402J2401N7841R102p058K0914J839J501J5327J6520L5952
$$ -11616 -5329 -36966 -30564 -18163 39678 48780 41722 62636 64475 65976 81303 97823 133775
20039A33775m0337l2953n4417K9814K0386K9602L7960J9093N674m5610o2856j6472
$$ 133775 93438 60485 6068 35882 56268 85870 123830 142923 148597 102987 40131 23659
20027B3659M4069r147m6222j4336J5803M318j59k2040m1422J8702J5488o276m9212
$$ 23659 67728 58581 12359 -1977 13826 18144 17985 -4055 -45477 -26775 -11287 -17563 -66775
20014f6775L1515j1069k8660N2063Q716p1P231P3722K0488n1803j7423L2259N7826
$$ -66775 -35260 -46329 -74989 -22926 -14210 -14281 -7050 66672 87160 35357 17934 50193 108019
20001A08019L4241o7817p3690k8656J1348l0360K2115o7832k535Q1627O4040L1955
$$ 108019 142260 74443 753 -27903 -16555 -46915 -24800 -92632 -95167 -13540 50500 82455
19989H2455K4534l1447j6079m1144n8381k4804L987r976P0832K1667J4012N1074
$$ 82455 106989 75542 59463 18319 -40062 -64866 -60879 -70855 -23 21644 35656 86730
19977H6730k0575k4849j3026j063M0756L8944p048m7490j5850m112R256K6646
$$ 86730 66155 41306 28280 27217 67973 106917 99869 52379 36529 32417 41673 68319
19965F8319k4151K4436k3524m0210O0693J2284L5620l1798l380J0110N712k0175
$$ 68319 44168 68604 45080 4870 65563 77847 113467 81669 78289 88399 94111 73936
19953G3936p408k800J1252L4835m414k2904n6077j278K0461m417j5075k1103o5297
$$ 73936 66528 63728 74980 109815 105401 82497 26420 25142 45603 41186 26111 5008 -60289
19940f0289K6813R1814m184M7258P018q877j2775J752p3203l1662j1557J0748
$$ -60289 -33476 58338 54154 101412 108430 99553 86778 88530 15327 -16335 -27892 -17144
19928a7144K9854L3341N0321m2306n2633L7927K4426R542k7543q873K4017M1787
$$ -17144 12710 46051 96372 54066 1433 39360 63786 73328 45785 36912 60929 102716
19916A02716M7965M2495j5388J528j8347m8922J051L0860j4007k575j5223q223
$$ 102716 150681 193176 177788 179316 160969 112047 113098 143958 129951 127376 112153 103930
19904A03930j763M6381K4322o4745n7406O847N2976k6136P813n9768o2783Q9203
$$ 103930 102167 148548 172870 108125 50719 57566 110542 84406 92219 32451 -30332 58871
19892E8871K5454m4869L4104O1108k582j344j0866m4714k9368L7045O6327l4448
$$ 58871 84325 39456 73560 134668 132086 130742 119876 75162 45794 82839 149166 114718
19880A14718o0548j9047M23J2670j9376p787k4721j914O1063N5554n3527J5930
$$ 114718 54170 35123 35546 48216 28840 21053 -3668 -5582 55481 111035 57508 73438
19868G3438N0680k5362J8848J9004q193j5106P183j7413L0803j1515l8471j5625
$$ 73438 124118 98756 117604 136608 128415 113309 120492 103079 133882 122367 83896 68271
19856F8271j832J6661K4525Q317K4383L648k4534l4355o0004j3435K9124J8094
$$ 68271 66439 83100 107625 115942 140325 143973 119439 85084 25080 11645 40769 58863
19844E8863K8250k666L2975l808j1373J8153P6040m8249l5695o195L687K4430
$$ 58863 87113 84447 117422 113614 102241 120394 196434 148185 112490 106295 109982 134412
19832A34412m5258o019l6373n969j577n493K0273M8271R942k4910m5033j2373
$$ 134412 89154 83135 46762 40793 39216 33723 53996 102267 112209 87299 42266 29893
19820B9893j6730L3246M7705L1442n774j6366J9536J9272m4354O221j3905m615
$$ 29893 13163 46409 94114 125556 119782 103416 122952 142224 97870 104091 90186 85571
19808H5571R520N4509n427l3110J2697M750j7402m5649l2809K3544M1639m2113
$$ 85571 95091 149600 144173 111063 123760 128510 111108 65459 32650 56194 97833 55720
19796E5720n0598M6278j9874M013O1171P4544J6914m9356l1685K5265L5465J1709
$$ 55720 5122 51400 31526 35539 96710 171254 188168 138812 107127 132392 167857 179566
19784A79566q2501q4467r42L5309L4398L9086N287k2652k5407o875J7041j1382
$$ 179566 97065 12598 11656 46965 81363 120449 125736 103084 77677 70802 87843 76461
19772G6461l9701l3153J2222P461j9549N2137J1650j1477N627K7719J7085o1445
$$ 76461 36760 3607 15829 23290 3741 55878 67528 56051 61678 89397 106482 45037
19760D5037l2351J9206L1805K8076L0028J5783m8062l2684K4981L9896K6475K2876
$$ 45037 12686 31892 63697 91773 121801 137584 89522 56838 81819 121715 148190 171066
19748A71066o197m2069l4498l2006l6851N15M6162K2854K2431j904p1638J476
$$ 171066 164869 122800 88302 56296 19445 19960 66122 88976 111407 109503 37865 39341
19736C9341R584N0112M5768l9651k1813J3035m0798j0956J6739n1220J3174j816
$$ 39341 48925 99037 144805 105154 83341 96376 55578 44622 61361 10141 23315 21499
19724B1499L9929Q4227k536k9668N2283J4707k9549n2163o6949n1621O440Q2130
$$ 21499 61428 145655 143119 113451 165734 180441 150892 98729 31780 -19841 -13401 68729
19712F8729L5271L4961k3215r359O0961m9483k3986p334m3998p5083l2370L5506
$$ 68729 104000 138961 115746 106387 167348 117865 93879 86545 42547 -32536 -64906 -29400
19700b9400J0329J8749J0733Q665l8548p1933q295J12198N8019L2988j5950m3829
$$ -29400 -19071 -322 10411 19076 -19472 -91405 -99700 12498 70517 103505 87555 43726
19688D3726q00p595J8433m5334Q3739N6764N288n7735j6450o2038j1872N4705
$$ 43726 42926 35331 53764 8430 92169 148933 154221 96486 80036 17998 6126 60831
19676F0831P0042N1551j3387N019q2440p4884P682L9596L6871L0952j4863j1365
$$ 60831 130873 182424 169037 174056 91616 16732 24414 64010 100881 131833 116970 105605
19664A05605L4100P3314n2583m3247j2095N574L1960J2662J0543m092k7936k4992
$$ 105605 139705 213019 160436 117189 105094 110668 142628 155290 165833 161741 133805 108813
19652A08813j3483J4207M7103k509J9878j9138l1008k4958j7277k430P47K1201
$$ 108813 95330 109537 156640 154131 174009 154871 123863 98905 81628 79198 79945 101146
19640A01146K2808K8784J8745L8451l8962n4600r572L2023J8583j7877o2013p1022
$$ 101146 123954 152738 171483 209934 170972 116372 106800 138823 157406 139529 77516 6494
19628F494k4324K2486L049M2003J637k3399L2903M878m4989K736L7183p317l0503
$$ 6494 -17830 4656 7705 49708 51345 27946 60849 65727 20738 23474 60657 53340 22837
19615B2837R412J6053L1421J8121J3435K5222Q0233j5556m1154p140o0481J7107
$$ 22837 32249 48302 79723 97844 111279 136501 216734 201178 160024 152884 92403 109510
19603A09510K9113o112o667m0442J3932J857R290K7353j3675K9061q93l8271k5576
$$ 109510 138623 132511 125844 85402 99334 101191 110481 137834 124159 153220 152327 114056 88480
19590H8480k3202l5460l3239N6185P7559K6946l828j9270k5682l9201j0541N0661
$$ 88480 65278 29818 -3421 52764 130323 157269 153441 134171 108489 69288 58747 109408
19578A09408J7646j5478O72o5091m6375J5310j4909K0198J2246L4579J9804j8822
$$ 109408 127054 111576 112248 47157 782 16092 1183 21381 33627 68206 88010 69188
19566F9188l7764l969M1392O2683K8614o817p4645l023L6597L5904k0956m306
$$ 69188 31424 27455 68847 131530 160144 153327 78682 75659 112256 148160 127204 122898
19554A22898o3761o793J243j4085J5731M9618M2492k323K0534J2775l0966J0867
$$ 122898 59137 52344 53587 39502 55233 104851 147343 145020 165554 178329 147363 158230
19542A58230K4966k367o492j9900k3806J4916K8269P951P951J9864K370n7632
$$ 158230 183196 180829 174337 154437 130631 145547 173816 181767 189718 209582 211952 154320
19530A54320L6569L2457k1917l8661r088K689n565N1816k22k5540P227K0324l6448
$$ 154320 190889 223346 201429 162768 153680 156369 150804 202620 202398 176858 184085 204409 167961
19517A67961n956M7718K5077j120k1020L976q757L0534J05336K5857l6680r7441
$$ 167961 162005 209723 234800 233680 212660 216636 207879 238413 343749 369606 332926 235485
19505B35485l277K5969L9625j1208q397O5028R1662J44959Q168n9139k2823r9317
$$ 235485 232208 258177 297802 286594 278197 343225 434887 579846 588014 528875 506052 406735
19493D06735q326O710K3027P918k5120P42M47k0526N755J4463j4209o7619l9230
$$ 406735 398409 405119 428146 436064 410944 411686 412133 391607 397362 411825 397616 329997 290767
19480B90767l4936J0606L4893K5688L2884n4503j9835J5300J6367M2631m3754
$$ 290767 255831 266437 301330 327018 359902 305399 285564 300864 317231 359862 316108
19469C16108q640Q904k9388l2804j4207M2604R324o290J1942m0790p7597k6318
$$ 316108 307468 316372 286984 254180 239973 282577 291901 285611 297553 256763 179166 152848
19457A52848l1245M5890l949k1527Q3940R849p7710l2873L8191p583n477N6442
$$ 152848 121603 167493 163544 142017 225957 235806 158096 125223 163414 155831 150354 206796
19445B06796r015L2847j0488k5960o802l7286j0179L4713J2369M4642K1535k2317
$$ 206796 197781 230628 220140 194180 187378 150092 139913 174626 186995 231637 253172 230855
19433B30855J6042p160L1961J3719m8056m6875k8940J9076K1376r3327j6920N3242
$$ 230855 246897 239737 271698 285417 237361 190486 161546 180622 201998 108671 91751 144993
19421A44993j6812p089m943M1679J0350j5175p685j6361N4032N7205K173j0806
$$ 144993 128181 121092 116149 157828 168178 153003 145318 128957 182989 240194 242367 231561
19409B31561K182J373k991k830n513L687J625m402K9025J1011K1002j4050k8662
$$ 231561 233743 235116 232125 229295 223782 227469 229094 224692 253717 264728 285730 271680 243018
19396B43018p46p169O201N8532J3906J6581n7873m785l4940r3685m4127N1682
$$ 243018 242272 235103 241304 299836 313742 330323 272450 267665 232725 139040 94913 146595
19384A46595J00877J6624O024k5558n4889J9795K8007j8382m8644L2640N7743
$$ 146595 247472 264096 270120 244562 189673 209468 237475 219093 170449 203089 260832
19373B60832L9312m7273Q75n425k7051j619O0621M6446j092j2276k2576k2865
$$ 260832 300144 252871 253746 248321 221270 219651 280272 326718 325626 313350 290774 267909
19361B67909j1984K9218J958M4178L4680K4050K1326O8298J32846J77527J82562
$$ 267909 255925 285143 287101 331279 365959 390009 411335 479633 612479 790006 972568
19350I72568J29071Q1004K8261m1497r7783o7031o1506P8909J64786J04647L9494
$$ 972568 1101639 1182643 1210904 1169407 1071624 1004593 943087 1021996 1186782 1291429 1330923
19339A330923q1013j66036j76700o0933l7320j10032o5335o1693o9821J757o8
$$ 1330923 1249910 1083874 907174 846241 808921 698889 633554 571861 502040 503797 503729
19328E03729o73J6685l0472q7301m6366P4659P0306O1417R2517J1330k9259k2516
$$ 503729 503056 519741 489269 401968 355602 430261 500567 561984 654501 665831 636572 614056
19316F14056K6656r968N8303J8443l2303O040p0052k8224M392K7728l5260j6882
$$ 614056 640712 630744 689047 707490 675187 681227 611175 582951 587343 615071 579811 562929
19304E62929K6759P5884J80902K06651J92758J69132N5612q7268j30898j06573
$$ 562929 589688 665572 846474 1053125 1245883 1415015 1470627 1383359 1252461 1145888
19294A145888m5854J34706J84693J19813M6800r0423j98008j81577j61369j53554
$$ 1145888 1100034 1234740 1419433 1539246 1586046 1495623 1297615 1116038 954669 801115
19284H01115p9905p6111l3585J6050J505L7427o4356q377j9257k630l5040n1378
$$ 801115 721210 645099 611514 627564 629069 666496 602140 593763 574506 571876 536836 485458
19272D85458l2314J4182Q8256K7216o6670K4866m4134k495k8374l5144K709o9986
$$ 485458 453144 467326 555582 582798 516128 540994 496860 494365 465991 430847 433556 363570
19260C63570N56Q3861L0736n0751m8631k7206J453O034N5120M7528q120n6734
$$ 363570 364126 447987 478723 427972 379341 352135 353588 359622 414742 462270 454150 397416
19248C97416j4773J8896M1075m7735J0940O3617L4862j3483r585J3975l0385K1796
$$ 397416 382643 401539 442614 394879 405819 469436 504298 490815 481230 495205 464820 486616
19236D86616M1043L1022J3605j3649j5355n3288Q182M9487K121l2647l863N2998
$$ 486616 527659 558681 572286 558637 543282 489994 498176 547663 549784 517137 513274 566272
19224E66272l6687o7121J303k000m4886J014M3019J4415k6539R409K5505o8688
$$ 566272 529585 462464 463767 461767 416881 417895 460914 475329 448790 458199 483704 415016
19212D15016p6008J2223q457J0785J1394j419j620k7170p06j1628l2074J4276
$$ 415016 339008 351231 342774 353559 364953 363534 361914 334744 334038 322410 290336 304612
19200C04612J9766n025L9834K1999O9109K5121K6712K8865K0036n8000j7850M3769
$$ 304612 324378 319353 359187 381186 450295 475416 502128 530993 551029 493029 475179 518948
19188E18948l8125l7509K4440N7045n0602M563j3112l9787o8588K3881O7940P8479
$$ 518948 480823 443314 467754 524799 474197 478760 465648 425861 357273 381154 449094 527573
19176E27573M0790l3718p6991o5783n200M836j4049n0961m6612K8895J26447Q5457
$$ 527573 568363 534645 457654 391871 386671 391507 377458 326497 279885 308780 435227 520684
19164E20684l0089p5829j9834K5253p166j9292k9262k2296M9653M6932L6690k5428
$$ 520684 490595 414766 394932 420185 413019 393727 364465 342169 391822 438754 475444 450016
19152D50016P61N3543L4666q557m4649l5044k9778j9246l1301M9511M1540P2198
$$ 450016 450777 504320 538986 530429 485780 450736 420958 401712 370411 419922 461462 533660
19140E33660K3069j08646k5561j2352J3071N7036J7439L1664m2549m5208p7910
$$ 533660 556729 448083 422522 410170 423241 480277 497716 529380 486831 441623 363713
19129C63713j2644K9217m939N651m634L748l839j0026l8247m647N4412K9902P437
$$ 363713 351069 380286 375347 380998 376364 380112 376273 366247 328000 323353 377765 407667 415104
19116D15104N3768k7628k9142m742R782j6300J5521J0735j4786l1523K6058P0147
$$ 415104 468872 441244 412102 407360 417142 400842 416363 427098 412312 380789 406847 476994
19104D76994M0616K4500j0659J4419o584R14L751R640r399R427K6172J6294p7429
$$ 476994 517610 542110 531451 545870 539286 540200 543951 553591 544192 553619 579791 596085 518656
19091E18656J6719K8570m2512n7599m2187L6664Q8398O2417n666M9056l135K8041
$$ 518656 535375 563945 521433 463834 421647 458311 546709 609126 603460 652516 649381 677422
19079F77422K3991l2287l4245n075K079k1680O8248J16907J04759N2624M4628
$$ 677422 701413 669126 634881 629806 631885 610205 678453 795360 900119 952743 997371
19068I97371O7459J31034j7767j60824q0736m6396J0308L7654r336n0127J9152
$$ 997371 1064830 1195864 1178097 1017273 936537 890141 900449 938103 928767 878640 897792
19057H97792O7978J37947J34464J5142q5258j31287j43568m8055l3772k3176M685
$$ 897792 965770 1103717 1238181 1253323 1168065 1036778 893210 845155 811383 788207 792892
19046G92892j1236o3583K601L5559m7961l4558Q1188J9357N9351O9379N907P4460
$$ 792892 781656 718073 720674 756233 708272 673714 754902 774259 833610 902989 908896 983356
19034I83356K10538J82010J22713O3347k290m2711j07880q2907j7932p819L8912
$$ 983356 1193894 1375904 1498617 1561964 1559674 1516963 1409083 1326176 1308244 1300425 1339337
19023A339337J33831J06436J31021K1138j38421j68194k50476j94315p6678m9581
$$ 1339337 1473168 1579604 1710625 1731763 1593342 1425148 1174672 980357 903679 854098
19013H54098p1643J4716m1900j8876J2550m5850K1357M810P0461L7506J1821j4500
$$ 854098 782455 797171 755271 736395 748945 703095 724452 729262 799723 837229 849050 834550
19001H34550N3919J11956l8641m1588j9207M0715M231k6198L1601P3354Q777P298
$$ 834550 888469 1000425 961784 920196 900989 941704 945935 919737 951338 1024692 1033469 1040767
18989A040767l5269K2552Q8397J37339J57830J20248R9961J2184J9197q4556q1120
$$ 1040767 1005498 1028050 1116447 1253786 1411616 1531864 1631825 1644009 1663206 1578650 1497530
18978A497530l6367o2279k6641N9045J31295J76725J49886J4569r1710j61824
$$ 1497530 1461163 1398884 1372243 1431288 1562583 1739308 1889194 1903763 1812053 1650229
18968A650229k07763k19933j27882n7781K4921Q1948L4440k2802p3873k6449k5024
$$ 1650229 1442466 1222533 1094651 1036870 1061791 1143739 1178179 1155377 1081504 1055055 1030031
18957A030031l1299K3933J21006J30644P0996N7397P6009Q5472J43263K76953
$$ 1030031 998732 1022665 1143671 1274315 1345311 1402708 1478717 1564189 1707452 1984405
18947A984405K85355J29424n1959j26785j33544m0339R7617J79549K07379L646
$$ 1984405 2269760 2399184 2347225 2220440 2086896 2046557 2144174 2323723 2531102 2534748
18937B534748k82202k50686j89741j04908l1018r9756j04275k29O7682q963m7615
$$ 2534748 2252546 2001860 1812119 1707211 1676193 1576437 1472162 1471933 1539615 1530652 1483037
18926A483037P200P0617J60816J43297M3542N7234J10654R9251N4185J32856J89481
$$ 1483037 1490237 1560854 1721670 1864967 1908509 1965743 2076397 2175648 2229833 2362689 2552170
18915B552170K79245K35820L6165j49379q5421q461N4428K26630K08681k1340
$$ 2552170 2831415 3067235 3103400 2954021 2868600 2860139 2914567 3141197 3349878 3328538
18905C328538k47523k91071j77688j95369j51465r9294l8228k7692l7783K168
$$ 3328538 3081015 2789944 2612256 2416887 2265422 2166128 2127900 2100208 2062425 2064593
18895B064593K2958K6135M4988N6446J1546j07646m9047L7247K3126P314L6036
$$ 2064593 2087551 2113686 2158674 2215120 2226666 2119020 2069973 2107220 2130346 2137660 2173696
18884B173696l1894Q7830J15056N8158N1427n2963m3818K691K1810L8388J01133
$$ 2173696 2141802 2229632 2344688 2402846 2454273 2401310 2357492 2360183 2381993 2420381 2521514
18873B521514N9126O1271P5911K2901j8468M3817P0591J08937P1607Q8808J03491
$$ 2521514 2580640 2641911 2717822 2740723 2722255 2766072 2836663 2945600 3017207 3106015 3209506
18862C209506J35904O5559R0477J62735L07131L15451L48680M36212M11633K59011
$$ 3209506 3345410 3410969 3501446 3664181 3971312 4286763 4635443 5071655 5483288 5742299
18852E742299J75644Q7529J11145L11997N88668P45828O52705L76641K02642O6973
$$ 5742299 5917943 6005472 6116617 6428614 7017282 7763110 8415815 8792456 8995098 9062071
18842I062071J08074L84469Q11370J130970J384093J632655K022689K633822L895885
$$ 9062071 9170145 9554614 10365984 11496954 12881047 14513702 16536391 19170213 23066098
18833B3066098O085728R844979J6283934K6636277L5130466L2085115J9123502
$$ 23066098 29151826 38996805 55280739 81917016 117047482 149132597 168256099
18826A68256099M586787q738334k0494167j3200938K951739J8459920K4093480
$$ 168256099 172842886 164104552 143610385 130409447 133361186 151821106 175914586
18819A75914586J6526637K480521r066408k4744203l2454786k4664734j7240081
$$ 175914586 192441223 194921744 185855336 161111133 128656347 103991613 86751532
18812H6751532j2722493r299968o525686m524713l201225k153102j386301o85532
$$ 86751532 74029039 64729071 58203385 53678672 50477447 48324345 46938044 46252512
18804D6252512K93062J383762K159329J852909P05749j4643o06458j807022j526161
$$ 46252512 46545574 47929336 50088665 51941574 52647323 52632680 52026222 50219200 48693039
18795D8693039J88290J475568J263130J27593n68834j224812k603989k799216
$$ 48693039 48881329 50356897 51620027 51747620 51178786 49953974 47349985 44550769
18787D4550769j538140m29065O20397J995399M235071P684175J3582966K3433497
$$ 44550769 43012629 42583564 43203961 45199360 49434431 57118606 70701572 94135069
18779I4135069L5792640M0143275L0836034J2342807m358610k0658414k1868416
$$ 94135069 129927709 170070984 200907018 213249825 208891215 188232801 166364385
18772A66364385n790856J2485157K5900856K4968594J1294789n369529k1185282
$$ 166364385 160573529 173058686 198959542 223928136 235222925 229853396 208668114
18765B08668114l6214391l2590763k3092290j6925320j2643935r104635o301585
$$ 208668114 172453723 139862960 116770670 99845350 87201415 78096780 71795195
18758G1795195m488776l389648k720710k069533j103480K60747J925435K641387
$$ 71795195 67306419 63916771 61196061 59126528 58023048 58283795 60209230 62850617
18750F2850617J761268J41431j388743l257357l656683j584366P06585J720913
$$ 62850617 64611885 64753316 63364573 60107216 56450533 54866167 55572752 57293665
18742E7293665R76895m68866j825438l568297m727350l770023k761236k455169
$$ 57293665 58270560 57801694 55976256 52407959 47680609 43910586 41149350 38694181
18734C8694181k368507j985869j555209j206775r97680q84650q10938o51307n72537
$$ 38694181 36325674 34339805 32784596 31577821 30580141 29695491 28884553 28233246 27660709
18725B7660709p43202q97765p59747o47649m50607l20814l09486l41904m80359
$$ 27660709 26917507 26019742 25259995 24612346 24161739 23840925 23531439 23189535 22709176
18716B2709176n36752l62643j46247j91123m58361n74126l81996l69450m33020
$$ 22709176 22172424 21809781 21663534 21472411 21014050 20439924 20057928 19688478 19255458
18707A9255458m81162m70854l96290l10912j69648k6940q881M4337k449q7453
$$ 19255458 18774296 18303442 17907152 17596240 17426592 17399652 17390771 17435108 17432659 17345206
18697A7345206l48181o01537n42737l76302k10257j09141r8185j77500l03777
$$ 17345206 16997025 16395488 15852751 15476449 15266192 15157051 15058866 14881366 14577589
18688A4577589l41952l53977k46772j74639j56333j24207j52930k25803q1823
$$ 14577589 14235637 13881660 13634888 13460249 13303916 13179709 13026779 12800976 12719153
18679A2719153O3474J66339J51373J58708j17929n05919o29563m52207k73253
$$ 12719153 12782627 12948966 13100339 13259047 13141118 12635199 12005636 11553429 11280176
18670A1280176j45786j75970k95672l20859l79235l72838l17484l07150j78044
$$ 11280176 11134390 10958420 10662748 10341889 9962654 9589816 9272332 8965182 8787138
18661H787138n3516q2385r1463j51899j64667j91700k17880j46399j34435j12271
$$ 8787138 8733622 8651237 8559774 8407875 8243208 8051508 7833628 7687229 7552794 7440523
18651G440523p0849L5479P0107n4709p1899j41689j72948q8000m1493m7979J0965
$$ 7440523 7369674 7405153 7475260 7420551 7348652 7206963 7034015 6946015 6904522 6856543 6867508
18640F867508J35225K23913K34093Q7307j1672l7408m4191J2838O8649J46232
$$ 6867508 7002733 7226646 7460739 7548046 7536374 7498966 7454775 7467613 7536262 7682494
18630G682494K81118M00381M14871K88830M2368j67440k03155j49152m4527J66835
$$ 7682494 7963612 8363993 8778864 9067694 9110062 8942622 8739467 8590315 8545788 8712623
18620H712623L46731M80246M19847L4624k95719l93144n82619o01479m01627k32622
$$ 8712623 9059354 9539600 9959447 9994071 9698352 9305208 8722589 8121110 7719483 7486861
18610G486861J5711J88292K24888l629j39608j36350k31409l38465k86942k66290
$$ 7486861 7502572 7690864 7915752 7912123 7772515 7636165 7404756 7066291 6779349 6513059
18600F513059k51940k28084k07597j73023o5461q3542j2602O0981J31377J10559
$$ 6513059 6261119 6033035 5825438 5652415 5586954 5503412 5490810 5551791 5683168 5793727
18590E793727K87449M49335N07001N17886K70908p8144m59229m83079k36869k8182
$$ 5793727 6081176 6530511 7037512 7555398 7826306 7748162 7288933 6805854 6568985 6540803
18580F540803J55966L15300M91308O87845M47150J18449j46728k97517k79486
$$ 6540803 6696769 7012069 7503377 8191222 8638372 8756821 8610093 8312576 8033090
18571H033090l06439l49670l12575j70685l9843L1555J49607K13733K17953J41595
$$ 8033090 7726651 7376981 7064406 6893721 6853878 6885433 7035040 7248773 7466726 7608321
18561G608321Q979J00508J31430J07978K71639O13922J095036J726577K195844
$$ 7608321 7617300 7717808 7849238 7957216 8228855 8842777 9937813 11664390 13860234
18552A3860234J442950k41050j207240q85984m05470J43089R28318J711996K003252
$$ 13860234 15303184 15062134 13854894 12968910 12563440 12706529 13634847 15346843 17350095
18543A7350095J116918j95220o73385j20739L15589J0716l81537k43058M44121
$$ 17350095 18467013 18271793 17598408 17477669 17793258 17803974 17422437 17179379 17623500
18534A7623500J399530K185024K690029L177897M804380Q433198J4428922K3258611
$$ 17623500 19023030 21208054 23898083 27075980 31880360 40313558 54742480 78001091
18526G8001091K9446510K5425902J3010909K32999j2108823k2261750j7944637
$$ 78001091 107447601 132873503 145884412 146117411 134008588 111746838 93802201
18519I3802201r685276k656965N533043J6263923K6225165K6199537J5237022
$$ 93802201 84116925 81459960 86993003 103256926 129482091 155681628 170918650
18512A70918650o33111j3604524k5744356k4884897j7408746j2194129q751497
$$ 170918650 170285539 156681015 130936659 106051762 88643016 76448887 67697390
18505F7697390o001911l771143k342985k024419k368673k689674k010010j288100
$$ 67697390 61695479 57924336 55581351 53556932 51188259 48498585 46488575 45200475
18497D5200475j248241j449074j232701o41243M42089J185417P58506p00877j520953
$$ 45200475 43952234 42503160 41270459 40629216 41071305 42256722 43015228 42314351 40793398
18488D0793398p59832j9803L48880P12275J431832K784903N052187Q612937J4611915
$$ 40793398 40033566 40013763 40362643 41074918 42506750 45291653 50343840 58956777 73568692
18479G3568692K5260030L8716021M2452867L0562532J1436229m056475k3286719
$$ 73568692 98828722 137544743 179997610 210560142 221996371 217939896 194653177
18472A94653177l3502836k3432419j2042848j920553J1020807K7602752L8726396
$$ 194653177 161150341 137717922 125675074 123754521 134775328 162378080 201104476
18465B01104476L2916501J3715762n898613k4063558l9152337l4275894k4528014
$$ 201104476 234020977 247736739 241838126 217774568 178622231 144346337 119818323
18458A19818323j8321499j3900443j0293258p533275n501583m122549l190671
$$ 119818323 101496824 87596381 77303123 69769848 64268265 60145716 56955045
18451E6955045k459143j991618j849198j809416j692819j696582j768453j674398
$$ 56955045 54495902 52504284 50655086 48845670 47152851 45456269 43687816 42013418
18443D2013418j518711j274090j035487q50759q54710q83445q55126q06758p15602
$$ 42013418 40494707 39220617 38185130 37334371 36479661 35596216 34741090 33934332 33218730
18434C3218730q32857p76288o62501p13077n38313n09507p26810q19543q08105
$$ 33218730 32385873 31609585 30947084 30234007 29695694 29186187 28459377 27639834 26831729
18425B6831729o79732o35962n93644n53506m60502l77337l37255l90473l30798
$$ 26831729 26151997 25516035 24922391 24368885 23908383 23531046 23193791 22803318 22472520
18416B2472520l37460l32281l64647k87774j96254j69186j72607M2092K37926
$$ 22472520 22135060 21802779 21438132 21150358 20954104 20784918 20612311 20654403 20892329
18407B0892329N9279l36502n25025o02167m87284k81957j18857o7219q8339j5594
$$ 20892329 20951608 20615106 20090081 19487914 19000630 18718673 18599816 18532597 18444258 18428664
18397A8428664J403K2545J0614J47704L89526M34070K95767k4669j63647R8245
$$ 18428664 18430067 18452612 18463226 18610930 19000456 19434526 19730293 19705624 19541977 19640222
18387A9640222N91383J478558K630356M173412N868844N495222K435572j286336
$$ 19640222 20231605 21710163 24340519 28513931 34382775 39877997 42313569 41027233
18379D1027233k276407k091476j431949N05017K826667M861749M642059K061356
$$ 41027233 38750826 36659350 35227401 35732418 38559085 43420834 48062893 50124249
18371E0124249J62110J845583L938892N913330R581468J6563376K9246096M9416186
$$ 50124249 50286359 52131942 56070834 61984164 71565632 88129008 117375104 166791290
18363A66791290N5838992K4546745k5877002l8629146j9014687p31169K0618335
$$ 166791290 222630282 247177027 221300025 182670879 163656192 162925023 183543358
18356A83543358M5818566M5936052N093440m6660194n0730348l4200475k4201532
$$ 183543358 229361924 275297976 280391416 233731222 183000874 148800399 124598867
18349A24598867j8102463j2893343r046939o593808m850329l565928k533075j398283
$$ 124598867 106496404 93603061 84556122 77962314 73111985 69546057 67012982 65614699
18341F5614699l07756L95168J133716K406061M423499P684507J2827937J9326832
$$ 65614699 65306943 65702111 66835827 69241888 73665387 81349894 94177831 113504663
18333A13504663K8405442M4731946O1030524M5141373k924278l9588396l0400501
$$ 113504663 141910105 186642051 247672575 292813948 289889670 250301274 219900773
18326B19900773j3052954Q904891L7104967N1999571K4147183l1593583n4900251
$$ 219900773 206847819 215752710 252857677 304857248 329004431 297410848 242510597
18319B42510597l9696343k8705240k4045272k0245869j4961621j0639658p613834
$$ 242510597 202814254 174109014 150063742 129817873 114856252 104216594 96602760
18312I6602760n221629k797423p51247o92614k737456m364563l752429k916441
$$ 96602760 91381131 88583708 87832461 87139847 84402391 80037828 76285399 73368958
18304G3368958k035274j159317J7826J518565L755695P499973J1731463J2234657
$$ 73368958 71333684 70174367 70192193 71710758 75466453 82966426 94697889 106932546
18296A06932546Q384096P089747J6480057K4016238J4116164q323714k2042831
$$ 106932546 115316642 122406389 138886446 162902684 177018848 168695134 146652303
18289A46652303j6510839p693466J023143J1542040K1249776J9042708M64585
$$ 146652303 130141464 122447998 123471141 135013181 156262957 175305665 175770250
18282A75770250k0772584k2974533j3947187o903196m651139o990646j0124397
$$ 175770250 154997666 132023133 118075946 111172750 106521611 99530965 89406568
18275H9406568q589018o205089m652945l345654k125782j346763j009437j018285
$$ 89406568 80817550 74612461 69959516 66613862 64488080 63141317 62131880 61113595
18267F1113595j423602j699956j635809j342823j024913p40457l04580J44901
$$ 61113595 59689993 57990037 56354228 55011405 53986492 53246035 52941455 53086356
18259E3086356P06959R21187P71053P05385J238495J940414K961650M778386P727927
$$ 53086356 53793315 54714502 55485555 56190940 57429435 59369849 62331499 67109885 74837812
18250G4837812J2483965J9874627K9347623M0123161M3288621K8542762o72092
$$ 74837812 87321777 107196404 136544027 176667188 219955809 248498571 247826479
18243B47826479j8732685k0758581j2900398J437205J5077309K5943061K4210325
$$ 247826479 229093794 208335213 195434815 196872020 211949329 237892390 262102715
18236B62102715M833918j9918767k9469088l2905704k6543332j8538775j2961520
$$ 262102715 266936633 247017866 217548778 184643074 158099742 139560967 126599447
18229A26599447q432876m263190J68550O068098J5361348L0547746M8612465M7420625
$$ 126599447 118166571 113903381 114071931 120140029 135501377 166049123 214661588 262082213
18221B62082213J3440830k8713994l3508166j6347429N08094K0700130L8356811
$$ 262082213 275523043 246809049 213300883 196953454 197461548 218161678 256518489
18214B56518489K9992761n529969l4476272l0037081k3392605k2795963j6967278
$$ 256518489 286511250 280981281 246505009 216467928 193075323 170279360 153312082
18207A53312082r327446k815605L486826J1424839K1393824L2126321M7614569
$$ 153312082 143984636 141169031 144655857 156080696 177474520 209600841 257215410
18200B57215410O6538375O3793306K5106717k2107184l6814122l5555281j4614491
$$ 257215410 323753785 387547091 412653808 390546624 353732502 318177221 303562730
18193C03562730J7258444L8500149K5978873j0607162l1578077l0293418l8917619
$$ 303562730 320821174 359321323 385300196 374693034 343114957 312821539 273903920
18186B73903920m3632523l2990820k2915660j6375016j1100085o233039l448898
$$ 273903920 230271397 197280577 174364917 157989901 146889816 140656777 137207879
18179A37207879m620890p810076q180947o402064m741777l060856j164037P74432
$$ 137207879 132586989 124776913 116595966 110193902 105452125 102391269 101227232 102001664
18171A02001664M19818k627178n677398m947905l369270k410429k040837k012403
$$ 102001664 102421482 99794304 94116906 89169001 85799731 83389302 81348465 79336062
18163G9336062k530127l026448k924693k274251j537853r63396q15866o84554
$$ 79336062 76805935 73779487 70854794 68580543 67042690 66079294 65263428 64578874
18155F4578874q5275J21098p89014k143025k548469k222912j827992j399685r93576
$$ 64578874 64493599 64614697 63825683 61682658 59134189 56911277 55083285 53683600 52690024
18146E2690024n05547J74016J003979J708969J327296J95886o53733m55143o30319
$$ 52690024 52184477 52358493 53362472 55071441 56398737 56594623 55940890 55485747 54855428
18137E4855428j246286j979927k325430k351419j946027j409578r97545n30014
$$ 54855428 53609142 51629215 49303785 46952366 45006339 43596761 42599216 42069202
18129D2069202j26050j49746q67958j434041j323454r82169o62328o19990q75382
$$ 42069202 41943152 41793406 40925448 39491407 38167953 37185784 36523456 35903466 35028084
18120C5028084j080026j003167q46701m60042j73814K1314K56453M66436R28150
$$ 35028084 33948058 32944891 32098190 31638148 31464334 31485648 31742101 32208537 33136687
18111C3136687J591383K771144M072555O194599J0674454J6060226J1800839k590381
$$ 33136687 34728070 37499214 41571769 47766368 58440822 74501048 86301887 83711506
18103H3711506j4254069j0728146o935988n613878m601342l296181j991185r81809
$$ 83711506 69457437 58729291 51793303 46179425 41578083 38281902 36290717 35308908
18095C5308908k59131J80117N34973O22439J6266o86058q78529q81595j312448
$$ 35308908 35049777 35229894 35764867 36387306 36403572 35717514 34838985 33957390 32644942
18086C2644942j765986j558277q71207n80305n30409m83037l45466j42146j55520
$$ 32644942 30878956 29320679 28449472 27869167 27338758 26855721 26510255 26368109 26212589
18077B6212589m66341n92891m09231j34556J30758L21795L38015J61740M7829
$$ 26212589 25746248 25153357 24744126 24609570 24740328 25062123 25400138 25561878 25609707
18068B5609707R0841L20810O73884J060630J481602K084668L155232M730893P456123
$$ 25609707 25700548 26021358 26695242 27755872 29237474 31322142 34477374 39208267 46664390
18059D6664390J2169912K0163435L0842944L2828583J4933508j2296227k1584318
$$ 46664390 58834302 78997737 109840681 142669264 157602772 145306545 123722227
18052A23722227j6127721j2954439r773485m064571K393262J0438432K1810920
$$ 123722227 107594506 94640067 84866582 80802011 83195273 93633705 115444625
18045A15444625K9718194J9005872p870449k5930255k0360303j3058440j0897182
$$ 115444625 145162819 164168691 156298242 130367987 110007684 96949244 86052062
18038H6052062j0719408q938466o250794m814231l745449k722250k119893j862600
$$ 86052062 75332654 66394188 60143394 55329163 51583714 48861464 46741571 44878971
18030D4878971j747455j499485j310990j252594j101989p38647l72206k83985
$$ 44878971 43131516 41632031 40321041 39068447 37966458 37227811 36855605 36571620
18022C6571620j11547K04614M08028L47044K86640Q56685J888555L118627M772235
$$ 36571620 36460073 36664687 37072715 37419759 37706399 38563084 40451639 43570266 48342501
18013D8342501P246549J1635655J9383545K8341305K8595251J7506038P988518
$$ 48342501 55589050 67224705 86608250 114949555 143544806 161050844 169039362
18006A69039362J3064163J0857843o890534k2282706j8113890r416057r18207
$$ 169039362 182103525 192961368 186070834 163788128 145674238 136258181 135339974
17999A35339974J0661815J7728236J2927414M498453Q417614J0609269o430294
$$ 135339974 146001789 163730025 176657439 181155892 189573506 200182775 193752481
17992A93752481k7822843k7804275j8393197j3898457j2786655j1147794q105757
$$ 193752481 165929638 138125363 119732166 105833709 93047054 81899260 73793503
17985G3793503n748907m302146l607017l283296k869266k424282j923243j643865
$$ 73793503 68044596 63742450 60135433 56852137 53982871 51558589 49635346 47991481
17977D7991481j439641j241417j025064q71574o87000o88998n91596l38205n5726
$$ 47991481 46551840 45310423 44285359 43413785 42726785 42037787 41446191 41107986 41052260
17968D1052260J86814K68913L92746J043490K285896M058237O844235J1579087
$$ 41052260 41239074 41507987 41900733 42944223 45230119 49288356 56132591 67711678
17960F7711678J8251558K1166193J1888044n997166j6121938j3782067r688155
$$ 67711678 85963236 107129429 119017473 113020307 96898369 83116302 73428147
17953G3428147n937264k299884J508211O231764J2795393J7947089J2766507k352732
$$ 73428147 67490883 65190999 66699210 72930974 85726367 103673456 116439963 114087231
17945A14087231j4113251j2789641j0304810r113031o776905m279852k349008
$$ 114087231 99973980 87184339 76879529 67766498 60989593 56709741 54360733
17938E4360733r17666J11805J327357L414350P096954J3000150K3498131M2219328
$$ 54360733 53443067 53554872 54882229 58296579 65393533 78393683 101891814 144111142
17930A44111142O3529149N4816105N100636m8740867m8756580l2291432k3218322
$$ 144111142 207640291 262456396 267557032 218816165 170059585 137768153 114549831
17923A14549831j7196524j2356456q644210o119741m149641k697582j685604j062100
$$ 114549831 97353307 84996851 76352641 70232900 66083259 63385677 61700073 60637973
17915F0637973m68709L48470J706742L816046P173424J2788004K3088349M0719377
$$ 60637973 60169264 60517734 62224476 66040522 73213946 86001950 109090299 149809676
17907A49809676N6001061L9772644p429265m4294692l5265031k0129128r274541
$$ 149809676 205810737 245583381 238154116 193859424 158594393 138465265 129190724
17900A29190724K769982J9843436M2072891N0292481K0500009l0719896m8998778
$$ 129190724 131960706 151804142 193877033 244169514 264669523 233949627 184950849
17893A84950849l4460723k4167772j8270454j3396347r430766o456266m661396
$$ 184950849 150490126 126322354 108051900 94655553 85224787 78768521 74107125
17886G4107125l590432k797281k176548j517622o75033L54927J815368M223769
$$ 74107125 70516693 67719412 65542864 64025242 63350209 63705136 65520504 69744273
17878F9744273Q287084J5342551K8062661M4817240M3498922R734089l4343791
$$ 69744273 78031357 93373908 121436569 166253809 209752731 219486820 185143029
17871A85143029m0237982k6994722j9191588j4277257j0094910o935983n019032
$$ 185143029 144905047 117910325 98718737 84441480 74346570 67410587 62391555
17864F2391555l886525l337098k897777k491001k199450j900440j593449j217681
$$ 62391555 58505030 55167932 52270155 49779154 47579704 45679264 44085815 42868134
17856D2868134r91897r85037r97991j015438j079466j248631j194791j062578
$$ 42868134 41876237 40891200 39893209 38877771 37798305 36549674 35354883 34292305
17848C4292305j045406r46081p96149n99321l65114l10361m19721o84448r49259
$$ 34292305 33246899 32300818 31504669 30905348 30540234 30229873 29810152 29125704 28176445
17839B8176445q63698p09453p09275p27140o36732n48600m44050l91254l10067
$$ 28176445 27312747 26603294 25894019 25166879 24530147 23981547 23537497 23146243 22836176
17830B2836176l13932m19249m90923m78498m74602m82954m76872m70608m69999
$$ 22836176 22522244 22102995 21612072 21133574 20658972 20176018 19699146 19228538 18758539
17821A8758539l11461k33380l02930k93435l00934k94822k62578l26194l05378
$$ 18758539 18447078 18213698 17910768 17617333 17316399 17021577 16758999 16432805 16127427
17812A6127427k97677k63023k16464k54500k39296k63963k53384j67965k20919
$$ 16127427 15829750 15566727 15350263 15095763 14856467 14592504 14339120 14171155 13950236
17803A3950236k29056k34034k87250k32360k09503k21758j53102j68196k12764
$$ 13950236 13721180 13487146 13199896 12967536 12758033 12536275 12383173 12214977 12002213
17794A2002213k42102k39800j69264r0944j48082k19880k25454k03180j63917
$$ 12002213 11760111 11520311 11351047 11260103 11112021 10892141 10666687 10463507 10299590
17785A0299590j71438q5229j63734j66019n9029o3886j02430j15609j31395j05620
$$ 10299590 10128152 10042923 9879189 9713170 9654141 9590255 9487825 9372216 9240821 9135201
17775I135201J9186Q5995L3914j27995q1938R5372K53684K38833P5430k20128
$$ 9135201 9154387 9240382 9274296 9146301 9064363 9159735 9413419 9652252 9727682 9507554
17765I507554l09346l15520k72907r7837J5059O9658r7971l84717m05976l61086
$$ 9507554 9198208 8882688 8609781 8511944 8527003 8596661 8498690 8113973 7707997 7346911
17755G346911k50796k78835k23641j48027j44087j42842j42257j20443p5182K345
$$ 7346911 7096115 6817280 6593639 6445612 6301525 6158683 6016426 5895983 5820801 5823146
17745E823146p9162m3334r785R732J15966J48110Q3673o921K0052J41638J04222
$$ 5823146 5743984 5700650 5690865 5700597 5816563 5964673 6048346 6041425 6061477 6203115 6307337
17734F307337o9919k13197k18305j16244l0947J43435K66828K56879M1467k31647
$$ 6307337 6237418 6024221 5805916 5689672 5658725 5802160 6068988 6325867 6367334 6135687
17724F135687l00058l20470l19450j55319q4534P7059J36669J29453j01084k58620
$$ 6135687 5835629 5515159 5195709 5040390 4955856 5032915 5169584 5299037 5197953 4939333
17714D939333k67403k88625k90327k26278r6201O948Q1557K6983L48r6509o4270
$$ 4939333 4671930 4383305 4092978 3866700 3770499 3777447 3859004 3885987 3886335 3789826 3725556
17703C725556k839p0149j37342j61846j21481j32777j23131n8766J2567m391j5479
$$ 3725556 3722717 3652568 3515226 3353380 3231899 3099122 2975991 2917225 2929792 2925401 2909922
17692B909922n7342L9792J60240K60828M49334L39789R6928r4242p3198n7022
$$ 2909922 2852580 2892372 3052612 3313440 3762774 4102563 4199491 4105249 4032051 3975029
17682C975029k5726J50069K86617J53928j12131l07080k78643k61016l10272k39748
$$ 3975029 3949303 4099372 4385989 4539917 4427786 4120706 3842063 3581047 3270775 3031027
17672C031027q2052j5538K6954M0416K4258J711P4629J86637N6271j63558k07576
$$ 3031027 2948975 2933437 2960391 3000807 3025065 3026776 3101405 3288042 3344313 3180755 2973179
17661B973179j67593j07955j890Q7779J27226L8056j06781k23367k05900j52785
$$ 2973179 2805586 2697631 2695741 2783520 2910746 2948802 2842021 2618654 2412754 2259969
17651B259969j50775j20055j06215o208J1421m3778L4511l9830r9611k9624N2596
$$ 2259969 2109194 1989139 1882924 1876716 1888137 1844359 1878870 1839040 1739429 1709805 1762401
17640A762401l9073n9271n7441l4211q678o3523k7923j7495o577m5905n548n7591
$$ 1762401 1723328 1664057 1606616 1572405 1563727 1500204 1472281 1454786 1448209 1402304 1396756 1339165
17628A339165m1736j10739r836j406n840J07075k189k8496l8934j7131m8477m1258
$$ 1339165 1297429 1186690 1176854 1175448 1169608 1276683 1274494 1245998 1207064 1189933 1141456 1100198
17616A100198k8780K6648M8188j4653m9026j7491L0722k8942o9270l9340Q9250
$$ 1100198 1071418 1098066 1146254 1131601 1082575 1065084 1095806 1066864 997594 958254 1047504
17605A047504N3554m5373j4039p0734k2570k9599J890o8278m7533P0651j8781
$$ 1047504 1101058 1055685 1041646 970912 948342 918743 920633 852355 804822 875473 856692
17594H56692n5434p7p963L2397k9510k4326N200l6275l6355j4705l746L4413k2558
$$ 856692 801258 801181 793218 825615 796105 771779 776979 740704 704349 689644 685898 720311 697753
17581F97753j1911Q5240L2900q7669m5134l33P605N5387l795k9270q534j7937
$$ 697753 685842 771082 803982 716313 671179 670846 678451 733838 730043 700773 692239 674302
17569F74302j8337M116k0960k6509l4680l097p8325m2338M0995K9468J3586P3829
$$ 674302 655965 660081 639121 612612 577932 574835 496510 454172 495167 524635 538221 612050
17557F12050J283m3136M506l7833p9701j0279J8979k670P4472J9174J438k2241
$$ 612050 613333 570197 574703 536870 457169 446890 465869 463199 537671 556845 558283 536042
17545E36042j2514O6251P3209P8215J70166J70427K1480p2529l9989n2043j01371
$$ 536042 523528 589779 662988 741203 911369 1081796 1103276 1030747 990758 938715 837344
17534H37344n0368n8916o1833P1620K21170J86333O8773K6562P4992J02755R5411
$$ 837344 786976 728060 666227 737847 959017 1145350 1214123 1240685 1315677 1418432 1513843
17523A513843q9377k29326k24161j30332j39236l3567J7740Q9457N8049J17240
$$ 1513843 1424466 1195140 970979 840647 701411 667844 685584 775041 833090 950330
17513I50330J50184N0371j21365k03063j15628p7465k3774J654m6023j5165p784
$$ 950330 1100514 1150885 1029520 826457 710829 633364 609590 611244 565221 550056 542272
17502E42272k4298j3475J1989K5488j3104R56Q7534J72358J95037J55120L5975
$$ 542272 517974 504499 516488 541976 528872 529828 617362 789720 984757 1139877 1175852
17491A175852K6135K0697M0436L2423r7646r5314m123L8973J26039J73979J24922
$$ 1175852 1201987 1222684 1263120 1295543 1197897 1102583 1098460 1137433 1263472 1437451 1562373
17480A562373R5171J33967J06593p9622j56605n2616J26716O1359j18711j57875
$$ 1562373 1657544 1791511 1898104 1818482 1661877 1609261 1735977 1797336 1678625 1520750
17470A520750r1514o0284m7535o0309n4607o0614N422L9855J9343m2429j37466
$$ 1520750 1429236 1368952 1321417 1261108 1206501 1145887 1151309 1191164 1210507 1168078 1030612
17459A030612j18250o7504j31886r1583o2717J7469R502k6105j7769j06074l4548
$$ 1030612 912362 844858 712972 621389 558672 576141 585643 559538 541769 435695 401147
17448D01147L5345J8241N7878R9620R8182P4873O2524J12375O0130L407p9441
$$ 401147 436492 454733 512611 612231 710413 785286 847810 960185 1020315 1023722 944281
17437I44281j45490n9942p804K2512J02402J23584O6705J24401J52110k278j15414
$$ 944281 798791 738849 731045 753557 855959 979543 1046248 1170649 1322759 1320481 1205067
17426A205067j74418j38292j03140K8787K0856r9331k0722M4590P8880O3791K4856
$$ 1205067 1030649 892357 789217 818004 838860 739529 718807 763397 842277 906068 930924
17415I30924p4341j17750j42152k0363l4906n2461k9533m9080K0076J9067k4053
$$ 930924 856583 738833 596681 576318 541412 488951 459418 410338 430414 449481 425428
17404D25428m8599k6564n088j1285O021N3818O5684J76471K69699K61767J37175
$$ 425428 376829 350265 345177 333892 339913 393731 459415 635886 905585 1167352 1304527
17393A304527j27661k89220j82783q3941k5869r767p8548j04254m1955l3405m0645
$$ 1304527 1176866 887646 704863 620922 595053 585286 506738 402484 360529 327124 286479
17382B86479L177O6608L3449k1483r593N5426J06560J09252J42906K81760K23524
$$ 286479 289656 356264 389713 368230 358637 414063 520623 629875 772781 1054541 1278065
17371A278065K8282j29209k10589j52141p917m7287J981J52686K54760K11225
$$ 1278065 1306347 1177138 966549 814408 806491 759204 761185 913871 1168631 1379856
17361A379856l2352k58748k30539j74466r5648q1668n6459L365M0907J9955n032
$$ 1379856 1347504 1088756 858217 683751 588103 506435 449976 453341 494248 514203 509171
17350E09171l4372m2171j1113j034o0277j5715L9886J8271J74405K34871K89997
$$ 509171 474799 432628 421515 420481 360204 344489 384375 402646 577051 811922 1101919
17339A101919J41043p7776k13612k49236j40852p0952o3060n9324l1201l645q199
$$ 1101919 1242962 1165186 951574 702338 561486 490534 427474 368150 336949 333304 325105
17328C25105l2197N860J7679o3880m8986Q010J3383M3452l138J65j06012l2155
$$ 325105 292908 298768 316447 252567 203581 211591 224974 268426 265288 265453 159441 127286
17316A27286K5972o032k895k7731r177K404K7773J6591j3127l8307o2340M437
$$ 127286 153258 147226 144331 116600 107423 109827 137600 154191 141064 102757 40417 44854
17304D4854L4638M5450k8704m0191R349P4591O003j309n1095P835J6108K8082
$$ 44854 79492 124942 96238 56047 65396 139987 145990 144681 93586 101421 117529 145611
17292A45611m852l9349j7684K1240k5714j5302N777J722l7164n9283N4378L0659
$$ 145611 140759 101410 83726 104966 79252 63950 69727 71449 34285 -24998 29380 60039
17280F0039M5696j7261p836J6957J4314k3133k8875K2083K7871M4960p481k8707
$$ 60039 105735 88474 80638 97595 111909 88776 59901 81984 109855 154815 147334 118627
17268A18627l996k3456k1018k1316J0997l7345j3188N2416Q8542O605r8810j3958
$$ 118627 114631 91175 70157 48841 59838 22493 9305 61721 150263 156868 58058 44100
17256D4100J0021l174L3701L9787j9713l1746j2399Q258k2766j8317L2398K2604
$$ 44100 54121 50947 84648 124435 104722 72976 60577 68835 46069 27752 60150 82754
17244H2754p1431k6267J4092M583J6040N3169N4796J1334k6581L0669m3109p8490
$$ 82754 11323 -14944 -852 3731 19771 72940 127736 139070 112489 143158 100049 21559
17232B1559o6750l506J0505J1456J2889J7729k530m989l5510M8003R993m963N845
$$ 21559 -45191 -48697 -38192 -26736 -13847 3882 1352 -3637 -39147 8856 18849 13886 19731
17219A9731r022m928K035j6115l1447N1540j0043j1316N144m027l4115k4827L1413
$$ 19731 10709 5781 7816 -8299 -39746 11794 1751 -9565 -4421 -8448 -42563 -67390 -35977
17206c5977M5928o647K835N8017M2606J5781m6865p1346k946L9134j0258n8572
$$ -35977 9951 3304 6139 64156 106762 122543 75678 4332 1386 40520 30262 -28310
17194b8310l5130L7371K4968J7608j8718m3925m5510l0521j4690L2863L1985L9607
$$ -28310 -63440 -26069 -1101 16507 -2211 -46136 -91646 -122167 -136857 -103994 -72009 -32402
17182c2402K0239L2514j6069n6921M3036O2364R520o510k9935m0733p7064k861
$$ -32402 -12163 20351 4282 -52639 -9603 52761 62281 55771 25836 -14897 -91961 -94822
17170i4822J3022K3840J6596j8977m8635J2945P402O1879K1951l4688k4465j5763
$$ -94822 -81800 -57960 -41364 -60341 -108976 -96031 -88629 -26750 -4799 -39487 -63952 -79715
17158g9715j9197M5513Q7161O1419j3597q975l8752j8462K1415l4495o6640K5499
$$ -79715 -98912 -53399 33762 95181 81584 72609 33857 15395 36810 2315 -64325 -38826
17146c8826k496O761J0260J4417K1820Q3942q798n5432o1063n7286k4580m622
$$ -38826 -41322 -34561 -24301 -9884 11936 95878 87080 31648 -29415 -86701 -111281 -115903
17134a15903K7888j444K4070K8871m6039l3783O757R830l6538N1817J1614l885
$$ -115903 -88015 -89459 -65389 -36518 -82557 -116340 -109583 -99753 -136291 -84474 -72860 -76745
17122g6745L789K5257N5651M27j2250k8587l547J30K375k2306l0690k6537N7300
$$ -76745 -72956 -47699 7952 8379 -3871 -32458 -36005 -35875 -33500 -55806 -86496 -113033 -55733
17109e5733M7498N5431J1649q192N111m2050m2435J0655p150K7058L0113k2128
$$ -55733 -8235 47196 58845 50653 55764 13714 -28721 -18066 -25216 1842 31955 9827
17097I827p402Q490j0308m2940j6527k6263J7506R557K3861n559j2487J4493P90
$$ 9827 2425 10915 607 -42333 -58860 -85123 -67617 -58060 -34199 -39758 -52245 -37752 -36962
17084c6962j7445J6609j5319k3906l7929l7392Q71M4877J7173K5340K5806p906
$$ -36962 -54407 -37798 -53117 -77023 -114952 -152344 -151473 -106596 -89423 -64083 -38277 -46183
17072d6183j2350k3906j9639J101P63M3982Q2408j7130o1015L6334M0987L885
$$ -46183 -58533 -82439 -102078 -100977 -100214 -56232 26176 9046 -51969 -15635 25352 29237
17060B9237j131l3546l5649M435L2049p8051k4582n32k997Q396l065O096l8602
$$ 29237 28106 -5440 -41089 -36654 -4605 -82656 -107238 -107770 -110767 -102371 -105436 -99340 -137942
17047a37942K3864L8092M549j9437k4010m5778K8090N8689l9424j6270N6962K1739
$$ -137942 -114078 -75986 -71437 -90874 -114884 -160662 -132572 -73883 -113307 -129577 -72615 -50876
17035e0876N9433K3490L1808o013l0261l105k6326m1049N2K7907j6021J1928j3088
$$ -50876 8557 32047 63855 57842 27581 24476 -1850 -42899 -42847 -14940 -30961 -19033 -32121
17022c2121n0789l6459P2924O072l1543J480J6058L2980l5753L1533r940o7922
$$ -32121 -82910 -119369 -46445 -40373 -71916 -70436 -54378 -21398 -57151 -25618 -35558 -103480
17010a03480K6006P7466M6190k0032m5749q6745m034K0480J9710J7218K9794K8233
$$ -103480 -77474 -8 46182 26150 -19599 -106344 -110378 -89898 -70188 -52970 -23176 5057
16998E057J7194J9109N4570l5258m5225P161j247N700j6661m284k0866k5270L4579
$$ 5057 22251 41360 95930 60672 15447 22608 21361 27061 10400 6116 -14750 -40020 -5441
16985e441j9273Q59k4280k4677k9567L0796L5372J1315Q014L8501P989K6554m700
$$ -5441 -24714 -23855 -48135 -72812 -102379 -71583 -36211 -24896 -16882 21619 29608 56162 51462
16972E1462k2723n2150m065L1360q613k6361m4294K4375L4573j140n62l747J7279
$$ 51462 28739 -23411 -27476 3884 -4729 -31090 -75384 -51009 -16436 -17576 -18138 -21885 -4606
16959d606q677j248j2298j383K1146k7675m338k9872n497p034j0830K486L862
$$ -4606 -13283 -14531 -26829 -28212 -7066 -34741 -39079 -68951 -74448 -81482 -92312 -89826 -85964
16946h5964N1769o4153l0586L7924M4894j5208j7054M7992J6786o2046k0362J178
$$ -85964 -34195 -98348 -128934 -91010 -46116 -61324 -78378 -30386 -13600 -75646 -96008 -94830
16934i4830n194K7949O9139l1557p4476l3936J5769K9667P1424K1809k8603n8441
$$ -94830 -100024 -72075 -2936 -34493 -108969 -142905 -127136 -97469 -26045 -4236 -32839 -91280
16922i1280k2236P8164K4292K1845J3695J504K2019P6378O497p4547m1380j0926
$$ -91280 -113516 -35352 -11060 10785 24480 25984 48003 124381 130878 56331 14951 4025
16910D025L886J8389P0119O1697j9125k3282o669j6738j689J2292O4440J2596
$$ 4025 7911 26300 96419 158116 138991 115709 109040 92302 90613 102905 167345 179941
16898A79941l3712j7771m6281j9681M4955l0911j0077J6375j661j4584j8124K8703
$$ 179941 146229 128458 82177 62496 107451 76540 66463 82838 81177 66593 48469 77172
16886G7172P2185O9087L0290L0052k1785l1158J0707l787k8818M4836J867j5317
$$ 77172 149357 218444 248734 278786 257001 225843 236550 232763 203945 248781 250648 235331
16874B35331J4219j5452L1655Q6839O391J5246J0357n0645k2170l9786j3221L2137
$$ 235331 249550 234098 265753 352592 358983 374229 384586 333941 311771 271985 258764 290901
16862B90901j8674K2366K0882K2244j4535j2503N302r943m0739j6194J6839o94
$$ 290901 272227 294593 315475 337719 323184 310681 315983 306040 265301 249107 265946 265252
16850B65252j4178o6105o1444K4226K699K7677l4781J5033l834R970j8028m9206
$$ 265252 251074 184969 123525 147751 150450 178127 143346 158379 154545 164515 146487 97281
16838I7281j6276K1257K0096p5456k3371M8188J4107l7700l0448O571K0181J1609
$$ 97281 81005 102262 122358 46902 23531 71719 85826 48126 17678 24249 44430 56039
16826E6039o5861L3898P4718m0126l11l170k6381k9373K1638J5670L6363j9687
$$ 56039 -9822 24076 98794 58668 58357 55187 28806 -567 21071 36741 73104 53417
16814E3417j5094m3147l5435M4250K5127j9241j0697l4409J3024M9746K4940M6447
$$ 53417 38323 -4824 -40259 3991 29118 9877 -820 -35229 -22205 27541 52481 98928
16802I8928L70P7j7496L8343m734l2567l4238j2996n8807l4084K4392L2870K6821
$$ 98928 99298 99375 81879 120222 115488 82921 48683 35687 -23120 -57204 -32812 58 26879
16789B6879n406Q261J1158l6590j2693L8113k1202P9288L6387m0976p3816l1332
$$ 26879 21473 29734 40892 4302 -8391 29722 8520 87808 124195 83219 9403 -21929
16777b1929N2576L1246N3711l5763l2318m4842o7450j5927Q049J4129M3720L4238
$$ -21929 30647 61893 115604 79841 47523 2681 -64769 -80696 -72647 -58518 -14798 19440
16765A9440k7500K8339J3917o0765l4152l496n06J2772K0318J9031L9104L8234
$$ 19440 -8060 20279 34196 -26569 -60721 -64217 -64723 -51951 -31633 -12602 26502 64736
16753F4736q0632K9588L0594m7642O143j544o855J8975k0907m6097J1616N3352
$$ 64736 -15896 13692 44286 -3356 2787 1243 -5612 13363 -7544 -53641 -42025 11327
16741A1327J4910n0012k7898j3300J8594r246L4526M9860J5358m2892k584K3585
$$ 11327 26237 -23775 -51673 -64973 -46379 -55625 -21099 28761 44119 1227 -1357 22228
16729B2228k1849J3660k8626O847K7653M2075K8812j2113k2000l9766K952N1885
$$ 22228 379 14039 -14587 -7740 19913 61988 90800 78687 56687 16921 19873 71758
16717G1758m582j9171j9620m3937r22N9640k3078l1417R0889N117q1381Q956l2634
$$ 71758 67176 48005 28385 -15552 -16474 43166 20088 -11329 79560 84677 3296 12252 -20382
16704b0382o1438o879L7386J5162L4465q808J6740j1761k2304L1853K8876q761
$$ -20382 -81820 -88699 -51313 -36151 -1686 -10494 6246 -5515 -27819 4034 32910 24149
16692B4149J6269m9081o5815j1143L9837L7059R810m935j7944O3005N819l2918
$$ 24149 40418 -8663 -74478 -85621 -45784 -8725 1085 -3850 -21794 41211 47030 14112
16680A4112k0330L1354J7316j4540N1942r370m3967L555J5480J3082n8406l1284
$$ 14112 -6218 25136 42452 27912 79854 70484 26517 30072 45552 58634 228 -31056
16668c1056n084L330L8612N988l7978l7906L5380L2441N5726J3117K1903J6823
$$ -31056 -36140 -32810 5802 11790 -26188 -64094 -28714 3727 59453 72570 94473 111296
16656A11296L409l8674l935m2678l3864l8621M1051M4056J9771J7423k9420p8901
$$ 111296 114705 76031 72096 29418 -4446 -43067 -2016 42040 61811 79234 49814 -29087
16644b9087n539j6345l2459O5947N8305K7390p9073p2039p033J6439K2017q142
$$ -29087 -34626 -50971 -83430 -17483 40822 68212 -10861 -82900 -89933 -73494 -51477 -59619
16632e9619L4371k295k5441m1669m746K445L3204K8556N482l0685n7797L2720
$$ -59619 -25248 -27543 -52984 -94653 -99399 -96954 -63750 -35194 -29712 -60397 -118194 -85474
16620h5474M1427L8880j7211m753K1584K9781p908l2795l5316j3844l4473k242
$$ -85474 -44047 -5167 -22378 -27131 -5547 24234 16326 -16469 -51785 -65629 -100102 -102344
16608a02344p384K6590K2727K7096l9276q883K0279L6636P7485k447m0613k7184
$$ -102344 -109728 -83138 -60411 -33315 -72591 -81474 -61195 -24559 52926 50479 9866 -17318
16596a7318K4565o8712o2204J8240j423N823L3214M9206K6098J409l065r925j0822
$$ -17318 7247 -61465 -123669 -105429 -106852 -101029 -67815 -18609 7489 8898 5833 -4092 -14914
16583a4914J8426J3283p3204n7869o591M324L7796K3121O7114o060o1318n6833
$$ -14914 3512 16795 -56409 -114278 -120869 -116545 -78749 -55628 11486 5426 -55892 -112725
16571a12725j0140J8788M920J5675L686J6716J7789n3863J2481k192j9308K8106
$$ -112725 -122865 -104077 -99157 -83482 -79796 -63080 -45291 -99154 -86673 -88865 -108173 -80067
16559h0067O8475M7474m270l4466J5373j982k0163l7774m7678j659n272Q46j0688
$$ -80067 -11592 35882 31612 -2854 12519 10537 -9626 -47400 -95078 -96737 -102009 -101163 -111851
16546a11851M7624K9136J9271J0726J7734L6561Q984j5943K4662n7530m9392J1725
$$ -111851 -64227 -35091 -15820 -5094 12640 49201 58185 42242 66904 9374 -40018 -28293
16534b8293r961J3181L310P5556R1854M5588k5570p0765q5948n0557J6421L7029
$$ -28293 -38254 -25073 -21763 53793 145647 191235 165665 94900 8952 -41605 -25184 11845
16522A1845k0928o2838j3676J1577M7016J276l9026J9342J3231l187m3229m0746
$$ 11845 -9083 -71921 -85597 -74020 -27004 -25728 -64754 -45412 -32181 -35368 -78597 -119343
16510a19343M1751J7351L856R945j2274k242l4672M0942M664o653L165k9950K9386
$$ -119343 -77592 -60241 -56385 -46440 -58714 -60956 -95628 -54686 -50022 -56675 -53510 -83460 -54074
16497e4074L4711K5373O431O390K2181o0384q4602l1905M2754K6654o777M1754
$$ -54074 -19363 6010 12441 18831 41012 -19372 -103974 -135879 -93125 -66471 -73248 -31494
16485c1494L3351r503K7986j091K8013N5377K5345l207m8101o9860m3950k7889
$$ -31494 1857 -7646 20340 19249 47262 102639 127984 124777 76676 6816 -37134 -65023
16473f5023M499K158L5066J07940K4994k9006k3708L2334K6888l2875o1548k9070
$$ -65023 -60524 -58366 -23300 84640 109634 80628 56920 89254 116142 83267 21719 -7351
16461g351o4069k6318P2531R2601m5373o5666o1988L0858P6422j7303L2425m327
$$ -7351 -71420 -97738 -25207 67394 22021 -43645 -105633 -74775 1647 -15656 16769 12442
16449A2442L3630k0130k3012j1446K7472j9898k6505k4301l8134j0406k3946L9913
$$ 12442 46072 25942 2930 -8516 18956 -942 -27447 -51748 -89882 -100288 -124234 -84321
16437h4321O7402J5383j3805j5294l8663l016N462N615J8329j2372j5165L165
$$ -84321 -16919 -1536 -15341 -30635 -69298 -72314 -66852 -61237 -42908 -55280 -70445 -67280
16425f7280m481R2263J6279n1533J1797K6322K9503n0411l5384L6700J8914k1484
$$ -67280 -71761 20502 36781 -14752 -2955 23367 52870 2459 -32925 3775 22689 1205
16413A205m0785L689m9777q300K3558L0387K5137k7623p5937K2486K4188K5404
$$ 1205 -39580 -35891 -85668 -93968 -70410 -40023 -14886 -42509 -118446 -95960 -71772 -46368
16401d6368Q4522L1381k5536l0264p8464l6867N6721L2415L6528j5781j3711n508
$$ -46368 38154 69535 43999 13735 -64729 -101596 -44875 -12460 24068 8287 -5424 -10932
16389a0932J4727J9387k6733j320M911J3094J4013m0218l7718m6979j8660o009
$$ -10932 3795 23182 -3551 -4871 40 13134 27147 -13071 -50789 -97768 -116428 -122437
16377a22437L4296K5456J4369k5079r510M5802K7671m2331j6125n0151L5795K4165
$$ -122437 -88141 -62685 -48316 -73395 -82905 -37103 -9432 -51763 -67888 -118039 -82244 -58079
16365e8079m518K6125L2782r702m7097q157j66K6250M1454r0446k3400L7645k2110
$$ -58079 -62597 -36472 -3690 -13392 -60489 -68646 -68812 -42562 -1108 -91554 -114954 -77309 -99419
16352i9419P4567R3474q1570p0210N100l8836K298M2820K4425N1480J6927o0025
$$ -99419 -24852 68622 -12948 -83158 -78058 -116894 -114596 -71776 -47351 4129 21056 -38969
16340c8969m5709J3029L1511J0429q005m4106L4794M3581l087j7607M217O587
$$ -38969 -84678 -71649 -40138 -29709 -37714 -81820 -47026 -3445 -6532 -24139 -19922 -13335
16328a3335J1238Q575O028J2381q7177m202O3178N7397l9333p4427k7043J9092
$$ -13335 -2097 6478 12506 24887 -62290 -66492 -3314 54083 14750 -59677 -86720 -67628
16316f7628L2631K1465J1168n2452n976j952k4237j3049M262k8607K9303L2334
$$ -67628 -34997 -13532 -2364 -54816 -60792 -62744 -86981 -100030 -95768 -124375 -95072 -62738
16304f2738j1229L4731J9785K9957J8276l922J403J7833k6375j0011k7443J3202
$$ -62738 -73967 -39236 -19451 10506 28782 24860 26263 44096 17721 7710 -19733 -6531
16292f531j9159l9903o96K6773n891l869l5934j0691J4136K2289K1223m4119j9528
$$ -6531 -25690 -65593 -66289 -39516 -45407 -49276 -85210 -95901 -81765 -59476 -38253 -82372 -101900
16279a01900M3976J563N471m4304j3066J7843K6521k949n6039j1667l9344q486
$$ -101900 -57924 -56361 -50890 -95194 -108260 -90417 -63896 -66845 -122884 -134551 -173895 -182381
16267a82381J4300O1245J0560n387N2665N673m114l0978M3499K7183k8121J0000
$$ -182381 -168081 -106836 -96276 -101663 -48998 -43325 -47439 -78417 -34918 -7735 -35856 -25856
16255b5856P144k7060J1046K197o1028P6785K3793p40N94p0685p2156j6689R2705
$$ -25856 -18712 -45772 -34726 -32529 -93557 -16772 7021 6281 6875 -63810 -135966 -152655 -59950
16242e9950M3814m0219k559J0705K5208K816r466N492k7776K9839k2367j8073
$$ -59950 -16136 -56355 -58914 -48209 -23001 -20185 -29651 -24159 -51935 -22096 -44463 -62536
16230f2536k651j0830r205j6653k9705O096Q190J1711K416l324K504j2996k2884
$$ -62536 -65187 -76017 -85222 -101875 -131580 -125484 -117294 -105583 -103167 -106491 -103987 -116983 -139867
16217a39867K6641L7452Q305J9124K5023k7640J0233j382n1272k3163j559o453
$$ -139867 -113226 -75774 -67469 -48345 -23322 -50962 -40729 -42111 -93383 -116546 -118105 -124558
16205a24558M736N1038n134l0376k1584j0723L7598j599l3885m040N8548O797
$$ -124558 -119822 -68784 -73918 -104294 -125878 -136601 -99003 -100602 -134487 -138527 -79979 -73182
16193g3182n131J8235J3031Q401p534K1634l7043q167Q5969J5587j7975k4794
$$ -73182 -78313 -60078 -47047 -38646 -46180 -24546 -61589 -69756 16213 31800 13825 -10969
16181a0969r168m0586o185n0131P958R581K9863J5278L5051p757j3132l7117J7590
$$ -10969 -20137 -60723 -66908 -117039 -109081 -99500 -69637 -54359 -19308 -27065 -40197 -77314 -59724
16168e9724L808j3452N227m4869Q36N121m1738K398l8414M9810J22834J389k9165
$$ -59724 -55916 -69368 -64141 -109010 -108174 -103053 -144791 -142393 -180807 -130997 -8163 -6774 -35939
16155c5939n1240R88Q9618N5078j9372Q520o3841p6661m531O0503K686l2634M1499
$$ -35939 -87179 -86191 3427 58505 39133 47653 -16188 -92849 -97380 -36877 -34191 -66825 -25326
16142b5326N0803j4287j4147J7520k6513m9231M3260J3848o1034k0047K8241M5575
$$ -25326 25477 11190 -2957 14563 -11950 -61181 -17921 -4073 -65107 -85154 -56913 -11338
16130a1338L5370l1983r385j1015k0452J7985L8165J7311k2693k9729L9446K199
$$ -11338 24032 -7951 -17336 -28351 -48803 -30818 7347 24658 1965 -27764 11682 13881
16118A3881l406J2980N3177l2854j3944m1443m11N909k5196m8256J4860j802M118
$$ 13881 10475 23455 76632 43778 29834 -11609 -12020 -6111 -31307 -79563 -64703 -66505 -62387
16105f2387k9449J6833N8234R5712k567n3200K1209P5313K3123o8885n3948L91
$$ -62387 -91836 -75003 -16769 78943 76376 23176 44385 119698 142821 73936 19988 20379
16093B0379j6480j9771K0769N777q9124l3542J9393K8812L9483Q5271J3195L5608
$$ 20379 3899 -15872 4897 10674 -78450 -111992 -92599 -63787 -24304 60967 74162 109770
16081A09770k3782n6724J7851O936n8150n3j3568o4118M8741M2087o1368o3132
$$ 109770 85988 29264 47115 54051 -4099 -4152 -17720 -81838 -33097 8990 -52378 -115510
16069a15510O861N1426R466k7030m227k5987L6666M3114k4076l1223J2347N0858
$$ -115510 -108649 -57223 -47757 -74787 -79014 -105001 -68335 -25221 -49297 -80520 -68173 -17315
16057a7315N120J4487K8116k2410J1744J1770o2867q4166j1425M525k0363n1840
$$ -17315 -12195 2292 30408 7998 19742 31512 -31355 -115521 -126946 -122421 -142784 -194624
16045a94624L0812J7333O9943r823l3193L1970J5857K3313R854n9114p1187j2167
$$ -194624 -163812 -146479 -76536 -86359 -119552 -87582 -71725 -48412 -38558 -97672 -168859 -181026
16033a81026N0174O7712N9805j5148k3446k3150q545N682l8901L822L769M9119
$$ -181026 -130852 -63140 -3335 -18483 -41929 -65079 -73624 -67942 -106843 -103021 -99252 -50133
16021e0133J6524M4712N8470k3451n8939j26015l2429N6680P2410N9807k0542
$$ -50133 -33609 11103 69573 46122 -12817 -138832 -171261 -114581 -42171 17636 -2906
16010b906l7553J0548p31j7765l6825J7845O0525P006j0061L9809J7145m0161
$$ -2906 -40459 -29911 -30642 -48407 -85232 -67387 -6862 144 -9917 29892 47037 6876
15998F876l1076L3845M1335K6122J695l1162j5381k8610n0254j0495M8701N915
$$ 6876 -24200 9645 50980 77102 78797 47635 32254 3644 -46610 -57105 -8404 -2489
15986b489k5299j5480J6772J221o051P173j3261O024M197K3584j0472J7086K4426
$$ -2489 -27788 -43268 -26496 -25275 -31326 -24153 -37414 -31390 -27193 -3609 -14081 3005 27431
15973B7431K1590n1297o4157J7311K3365n2650m0839J9441j5158K6367L4101k4835
$$ 27431 49021 -2276 -66433 -49122 -25757 -78407 -119246 -99805 -114963 -88596 -54495 -79330
15961g9330l053J7499J2487J64j4114K2393K5096K3895m9317J6243M20J3942L9104
$$ -79330 -82383 -64884 -52397 -52233 -66347 -43954 -18858 5037 -44280 -28037 -27617 -13675 25429
15948B5429j230o1459L5885j0362l2897o5800J4828Q561l0950N7964M4239L7308
$$ 25429 24199 -37260 -1375 -11737 -44634 -110434 -95606 -87045 -117995 -60031 -15792 21516
15936B1516j9104n0268J8824m389m0787J0674L9987j3216j1733J7098O503J8182
$$ 21516 2412 -47856 -29032 -33421 -74208 -63534 -23547 -36763 -48496 -31398 -24895 -6713
15924f713J5292o3611j511R1888K3963l3350l7960l432M2945Q384l0607M8500
$$ -6713 8579 -55032 -56543 35345 59308 25958 -12002 -15434 27511 35895 5288 53788
15912E3788L1959l5963o6849o3645n408L4279L0420K426m284M228k8891J8958
$$ 53788 85747 49784 -17065 -80710 -86118 -51839 -21419 -18993 -23277 -19049 -47940 -28982
15900b8982J2168K8624P746n1749j6960p369J9201L6589r528O026m4380J1351
$$ -28982 -16814 11810 19556 -32193 -49153 -56522 -37321 -732 -10260 -4234 -48614 -37263
15888c7263P4737N554k8600m8961k6102l447n9758O8892P8985N742j5380n5503
$$ -37263 37474 43028 14428 -34533 -60635 -64082 -123840 -54948 24037 29779 14399 -41104
15876d1104j9556O452K0679M3632N8397J3370M2206k3650p0079K0855R71j8382
$$ -41104 -60660 -54208 -33529 10103 68500 81870 124076 100426 30347 51202 52173 33791
15864C3791M228k2667k2914P884n8068j4896K3022J5532K9657P268O696j0474
$$ 33791 38019 15352 -7562 322 -57746 -72642 -49620 -34088 -4431 2837 9533 -941
15852i41j8915R977M1275L5079K9357k5299k2797L769q213j8330L9402N275n936
$$ -941 -19856 -9879 31396 66475 95832 70533 47736 51505 43292 24962 64364 69639 63703
15839F3703K1096j4889n6402R355M2873k4296K1037j4952m2688l4825j6800L9801
$$ 63703 84799 69910 13508 22863 65736 41440 62477 47525 4837 -29988 -46788 -6987
15827f987J1941L0977K5628j5101P069M9498l8121m8123k6138j8974k065O975
$$ -6987 4954 35931 61559 46458 53527 103025 64904 16781 -9357 -28331 -30396 -23421
15815b3421J8956K3003N5023n1848p1989p000M452J9029l6368l6594L6972K1287
$$ -23421 -4465 18538 73561 21713 -50276 -57276 -52824 -33795 -70163 -106757 -69785 -48498
15803d8498k0472l0301j9958n51j059N4966O0612j1033J5152J1826n4511J1912
$$ -48498 -68970 -99271 -119229 -119780 -120839 -65873 -5261 -16294 -1142 10684 -43827 -31915
15791c1915N3965L5872q1097l6964K1935L5797k5653q807Q415k5543k397n438
$$ -31915 22050 57922 -23175 -60139 -38204 -2407 -28060 -36867 -28452 -53995 -56392 -61830
15779f1830P3297L7398k9341m1873m3993J7884j1827n3858L6195Q4619M3846J1839
$$ -61830 11467 48865 19524 -22349 -66342 -48458 -60285 -114143 -77948 6671 50517 62356
15767F2356k0996K1510m6008n8963l0181l7270O4079K7724J744m8651k4171K6171
$$ 62356 41360 62870 16862 -42101 -72282 -109552 -45473 -17749 -16005 -64656 -88827 -62656
15755f2656O3883L9321q365O990L8458J1457k1149m9029o4709k7734J326j1905
$$ -62656 1227 40548 32183 39173 77631 89088 67939 18910 -45799 -73533 -72207 -84112
15743h4112p985R449j2124k6050J4650K864M4377N6950l6294L1611K7600J067
$$ -84112 -92097 -82648 -94772 -120822 -106172 -103308 -58931 -1981 -38275 -6664 20936 22003
15731B2003K9603N6645L392n2016n2918J9524L171k4966m2850l7193k089k9185
$$ 22003 51606 108251 111643 59627 6709 26233 29404 4438 -38412 -75605 -77694 -106879
15719a06879L1546K7202k3866l3633p1K0428N3724K3477k31k3114J9084Q662J2283
$$ -106879 -75333 -48131 -71997 -105630 -105701 -85273 -31549 -8072 -8303 -31417 -12333 -3671 8612
15706H612n9844l0595O6097M9589k4523p7043l5618M8684L1200o933k5762j5931
$$ 8612 -51232 -81827 -15730 33859 9336 -67707 -103325 -54641 -23441 -30374 -56136 -72067
15694g2067L7681N579P5570M7750l0867o3361r6415k4046L5033o587j4187J0252
$$ -72067 -34386 -28807 46763 94513 63646 285 -96130 -120176 -85143 -91730 -105917 -95665
15682i5665L7069J8138N8168Q6857l2579o6748j7226j0335J6519N670m5313m8703
$$ -95665 -58596 -40458 17710 104567 71988 5240 -11986 -22321 -5802 -132 -45445 -94148
15670i4148O0546P4499L1470j2334n6073k2785k0506N1957M1264k3728m0651J0659
$$ -94148 -33602 40897 72367 60033 3960 -18825 -39331 12626 53890 30162 -10489 170
15658A70J5383j4728Q079L7278n678J0220n8487p2449J3372n040j2197O858J7025
$$ 170 15553 825 8904 46182 40504 50724 -7763 -80212 -66840 -71880 -84077 -77219 -60194
15645f0194L6238J4347k371n206K1376J8414K0095o9732l1324O409K203J0525
$$ -60194 -23956 -9609 -11980 -17186 4190 22604 42699 -27033 -58357 -51948 -49745 -39220
15633c9220P044m853N5375k1234Q589k1621j5223J0937L2741l2775l7444L3447
$$ -39220 -32176 -37029 18346 -2888 5701 -15920 -31143 -20206 12535 -20240 -57684 -24237
15621b4237J924r207j7597K4642L0004O2862Q96J9818k5134o9218k0321K4352
$$ -24237 -22313 -31520 -49117 -24475 5529 68391 69287 89105 63971 -5247 -25568 -1216
15609a216N3769k4085r946J6675N054K0465j0943k4436J9041l9744m3722m9129
$$ -1216 52553 28468 18522 35197 40251 60716 49773 25337 44378 4634 -39088 -88217
15597h8217j0901M1774J032j3516L5351N613m745K1852K1094l2559K3240L617
$$ -88217 -99118 -57344 -56312 -69828 -34477 -28864 -33609 -11757 9337 -23222 18 3635
15585C635l2549K4764M9833K2303N59K7512l1692n4387m8850K302K8101J5266
$$ 3635 -28914 -4150 45683 67986 68545 96057 64365 9978 -38872 -36570 -8469 6797
15573F797l2747L3346L2437J639l5092l6362N1707J6346o7495M397k0935o5815
$$ 6797 -25950 7396 39833 41472 6380 -29982 21725 38071 -29424 -25027 -45962 -111777
15561a11777l7970M6945K0147J1670m95j0868M3033N9461k3897o6935M720N0780
$$ -111777 -149747 -102802 -82655 -70985 -71480 -82348 -39315 20146 -3751 -70686 -65966 -15186
15549a5186j298M646K1935l3817k2169j2841k4072p68L2981M4429J3250n56L896
$$ -15186 -16484 -11838 10097 -23720 -45889 -58730 -82802 -83570 -50589 -6160 7090 6534 10430
15536A0430K165n3793p088r250O63N384m4460K5116M3724N0335k0206L8300l0983
$$ 10430 12595 -41198 -48286 -57536 -56873 -51489 -95949 -70833 -27109 23226 3020 41320 10337
15523A0337j4930j4518m2926j0990O7960P151l1946l9763J8323N3735M2333l081
$$ 10337 -4593 -19111 -62037 -73027 -5067 2084 -29862 -69625 -51302 2433 44766 41685
15511D1685k689m0362p2339n0125J2036k2019K260L8155J4210o6640q994L2824
$$ 41685 38996 -1366 -73705 -123830 -111794 -133813 -131553 -93398 -79188 -145828 -154822 -121998
15499a21998K0949M0856K2033R222l0433n0969j6927Q876k106J03372L2510l0317
$$ -121998 -101049 -60193 -38160 -28938 -59371 -110340 -127267 -118391 -120497 -17125 15385 -14932
15487a4932r320K1835N118m0470K5473L5868k1292K5274L1026j7021l7901p241
$$ -14932 -24252 -2417 2701 -37769 -12296 23572 2280 27554 58580 41559 3658 -3583
15475c583l0041O22K1293L7042N981J4376J8723o0740l9749M1622M3573j9535
$$ -3583 -33624 -33002 -11709 25333 31314 45690 64413 3673 -36076 5546 49119 29584
15463B9584o029m6823K9533q361M1291p417k590N4788K5667n7707m5896k870K5014
$$ 29584 23555 -23268 6265 -2096 39195 31778 29188 83976 109643 51936 6040 3170 28184
15450B8184n775m8113m9150m7904p943L4121N5470k2707l2569J719K3696k6263
$$ 28184 22409 -25704 -74854 -122758 -130701 -96580 -41110 -63817 -96386 -94667 -70971 -97234
15438i7234o0016L448J1044J7832J2149R919J5429M1762M1978j1479j2552m0392
$$ -97234 -157250 -153802 -142758 -124926 -112777 -102858 -87429 -45667 -3689 -15168 -27720 -68112
15426f8112K2306N0968Q606k518k5827k2657j2725j6635J4942J8959j0310K0407
$$ -68112 -45806 5162 13768 11250 -14577 -37234 -49959 -66594 -51652 -32693 -43003 -22596
15414b2596J2553o2446L6987j1140j8895N9611m1932k8377J0549M7979l3631j02226
$$ -22596 -10043 -72489 -35502 -46642 -65537 -5926 -47858 -76235 -65686 -17707 -51338 -153564
15402a53564m395K3956M4119M0560P441N1403M4265q620n151R433J1221M7159
$$ -153564 -157959 -134003 -89884 -49324 -41883 9520 53785 45165 40014 49447 60668 107827
15390A07827m745q3715r1991L278M8465J015j8388m0004j289J4974O6455M3484
$$ 107827 103082 19367 -72624 -69346 -20881 -19866 -38254 -78258 -79547 -64573 1882 45366
15378D5366j6681k399m7257M07N2216J2929K4327J8908k2749l8955K9267O98n1178
$$ 45366 28685 26286 -20971 -20564 31652 44581 68908 87816 65067 26112 55379 56077 4899
15365D899P375m0807k7901K3736j2149j887J8741J3568M5902J0080J5344r73P497
$$ 4899 12274 -28533 -56434 -32698 -44847 -46734 -27993 -14425 31477 41557 56901 55928 63425
15352F3425k227m3011k1708l6461K3856K1158L8520J118o1841l5848l2601J7193
$$ 63425 61198 18187 -3521 -39982 -16126 5032 43552 44670 -17171 -53019 -85620 -68427
15340f8427L6037N5842K7333l5906j7432J4235o118l221k7517L1963N2961K9129
$$ -68427 -32390 23452 50785 14879 -2553 11682 5564 2343 -25174 6789 59750 88879
15328H8879l6864m593o935O840K2099J6148O354J6161l9148l5958J6478j9097
$$ 88879 52015 47422 40487 47327 69426 85574 91928 108089 68941 32983 49461 30364
15316C0364J2670l2227q2627k1372K7665J7101J2617M8472n2821J2165O9990j0935
$$ 30364 43034 10807 -71820 -93192 -65527 -48426 -35809 12663 -40158 -27993 41997 31062
15304C1062o7345J0238L3022L9724O3114j6918k5106k0551p813k1328L388o314
$$ 31062 -36283 -26045 6977 46701 109815 92897 67791 47240 39427 18099 21487 15173
15292A5173k5496k932o69j5196j6791j9717J9975L7314J1819j6800K6846j3643
$$ 15173 -10323 -13255 -13924 -29120 -45911 -65628 -45653 -8339 3480 -13320 13526 -117
15280a17J2363j5809l2149n3994L1935J632J9762O618l5073L370K4126j48j3953
$$ -117 12246 -3563 -35712 -89706 -57771 -56139 -36377 -29759 -64832 -61462 -37336 -37484 -51437
15267e1437J3914M3837l2415L5020J6262J4106j8537l0292m3095j3161l934k5625
$$ -51437 -37523 6314 -26101 8919 25181 39287 20750 -9542 -52637 -65798 -69732 -95357
15255i5357O8251O0492k1924l6849M5535J8379L4730M3197k4163n3665m7328J2363
$$ -95357 -27106 33386 11462 -25387 20148 38527 73257 116454 92291 38626 -8702 3661
15243C661j4488Q318N7456l0302m4859l4306K3421M20J6756K3760l3184l0856
$$ 3661 -10827 -2509 54947 24645 -20214 -54520 -31099 -30679 -13923 9837 -23347 -54203
15231e4203L7286k4179J1876K0971n903K1251M0098K3293j9176j2222q001l9730
$$ -54203 -16917 -41096 -29220 -8249 -14152 7099 47197 70490 51314 39092 31091 -8639
15219h639O0360L7267P077q0323k5983j713M3048J9624L4833j3043q4891J165
$$ -8639 51721 88988 96065 15742 -10241 -11954 31094 50718 85551 72508 -12383 -11218
15207a1218l8620l3565M4935J1326j0454L3984N3035k3245j1043k0068j0749N122
$$ -11218 -49838 -83403 -38468 -27142 -37596 -3612 49423 26178 15135 -4933 -15682 -10560
15195a0560J73l6791k8700K4161M2041O686k5674J2522J7719L3294n1822n3078
$$ -10560 -10387 -47178 -75878 -51717 -9676 -2990 -28664 -16142 1577 34871 -16951 -70029
15183g0029o428N6556m204j6532k6552k4168j1599j398K8686N141J1411m425n3309
$$ -70029 -76457 -19901 -24105 -40637 -67189 -91357 -102956 -104354 -75668 -70527 -59116 -63541 -116850
15170a16850M0122O7802J258J893q170j1183j0730M0883J04010K8317o0552m6891
$$ -116850 -76728 -8926 -7668 -5775 -13945 -25128 -35858 5025 109035 137352 76800 29909
15158B9909k4893P698K663m4157m4431j2841K474L879k1406J0967J03908J05402
$$ 29909 5016 12714 15377 -28780 -73211 -86052 -83578 -79699 -101105 -90138 13770 119172
15146A19172q7499m9271N0901o1519K0003M9670K6509K1923o6533l2749P32K8877
$$ 119172 31673 -17598 33303 -28216 -8213 41457 67966 89889 23356 -9393 -8661 20216
15134B0216j3714j9238m3779J8774R610m168O709j5597k5937L4034O1703p098
$$ 20216 6502 -12736 -56515 -37741 -28131 -32299 -25590 -41187 -67124 -33090 28613 21515
15122B1515N2080o180J4824O0545k4189l9517m3756o7123r859j2469N3438K8351
$$ 21515 73595 67415 82239 142784 118595 79078 35322 -31801 -41660 -54129 -691 27660
15110B7660n8161j072m116j9001l531M2294L6118k7315k7094n9135J7995l4076
$$ 27660 -30501 -31573 -35689 -54690 -58221 -15927 20191 -7124 -34218 -93353 -75358 -109434
15098a09434n0637j0688K3715N9540K2472j6392m7087J5974N7073J8010O445N3980
$$ -109434 -160071 -170759 -147044 -87504 -65032 -81424 -128511 -112537 -55464 -37454 -31009 22971
15086B2971L6980k7287P639m397K1918P028n2857j9167J9341K605m6264m148N259
$$ 22971 59951 32664 40303 35906 57824 64852 11995 -7172 12169 14774 -31490 -35638 -30379
15073c0379P6N5078L3306J2344l9606q681l5791o5022K5774J2181J6859k9501
$$ -30379 -30303 24775 58081 70425 30819 22138 -13653 -78675 -52901 -40720 -23861 -53362
15061e3362M4575l437k5500L6013N3024Q712K5560q4580k393q72m1663k8931L6216
$$ -53362 -8787 -12224 -37724 -1711 51313 60025 85585 1005 -1388 -2260 -43923 -72854 -36638
15048c6638K6823j2677j6252l955j4469l5285l4217l129P2364N8812K2239M429
$$ -36638 -9815 -22492 -38744 -42699 -57168 -92453 -126670 -129799 -57435 1377 23616 28045
15036B8045k4795K015L707k1060R15M3679N7392j5314k0331K3968m660q685J9486
$$ 28045 3250 5265 8972 -12088 -11173 32506 89898 74584 54253 78221 73561 64876 84362
15023H4362l3948q0599l1500M1244j4859j2920K4848K4834J2789J9208J2055n4541
$$ 84362 50414 -30185 -61685 -20441 -35300 -48220 -23372 1462 14251 33459 45514 -9027
15011i027m4242k3075K9305l8383j6140K437l0524K0079N5865R7669J5358P692
$$ -9027 -53269 -76344 -47039 -85422 -101562 -99125 -129649 -109570 -53705 43964 59322 67014
14999F7014l7750p7598j5556j0835J5338J9885M2019j2418j9884n558K9593K0550
$$ 67014 29264 -48334 -63890 -74725 -59387 -39502 2517 -9901 -29785 -35343 -5750 14800
14987A4800l5518L5233K7978j6099q198j6374K2641O1192k5655N9959m9109n4368
$$ 14800 -20718 14515 42493 26394 18196 1822 24463 85655 60000 119959 70850 16482
14975A6482k0387r921K020L1222J2602k3752o4791J2091Q0198J0826m6554K007
$$ 16482 -3905 -13826 -11806 19416 32018 8266 -56525 -44434 35764 46590 36 2043
14963B043k7288j7363M8196m6116l3106L0257j3274j6717n336R263J2968J3948
$$ 2043 -25245 -42608 5588 -40528 -73634 -43377 -56651 -73368 -78704 -69441 -56473 -42525
14951d2525K6322K6990K582k727m370q832K337M7555j6366n0593J5216L9849l287
$$ -42525 -16203 10787 13369 10642 6272 -2560 -223 47332 30966 -19627 -4411 35438 32151
14938C2151m0623l4134K0981r548J2840j1004J0139P77j5478K2009j8851k0321
$$ 32151 -8472 -42606 -21625 -31173 -18333 -29337 -19198 -18421 -33899 -11890 -30741 -51062
14926e1062m3514R5664L4715m5691K5748q229j0643J449J7428M3122K106k9898
$$ -51062 -94576 1088 35803 -9888 15860 7631 -3012 -1563 15865 58987 61093 31195
14914C1195K2381o519o533j0223k9525l0222m5939N6868K8318k6649l6814N3563
$$ 31195 53576 47057 40524 30301 776 -29446 -75385 -18517 9801 -16848 -53662 -99
14902i9Q9539K5946o7603n1807P312L9088l0901k1381K773M3071J8199J8981R534
$$ -99 89440 115386 47783 -4024 3288 42376 11475 -9906 -7133 35938 54137 73118 82652
14889H2652n6012k3680M8400K0770l7121p971L0374L7932K2786l972q22n082p8609
$$ 82652 26640 2960 51360 72130 35009 27038 57412 95344 118130 114158 113336 108254 29645
14876B9645m2176M0811J2588K0057j1389o040k2169J281L1261M9178n954p5998
$$ 29645 -12531 28280 40868 60925 49536 43496 21327 22608 53869 103047 97093 21095
14864B1095k2051K8424M3878k6272K4089o509n9388m7826l521N7386K0042K4233
$$ 21095 -956 27468 71346 45074 69163 62654 3266 -44560 -48081 9305 29347 53580
14852E3580k2440k8902o385L6385O3510j3606k9317m6037j740m4395j2291M9838
$$ 53580 31140 2238 -4147 32238 95748 82142 52825 6788 5048 -39347 -51638 -1800
14840a800M3764R578k9045j7782L0551K6183K1452j2529Q522J0254j6735R956
$$ -1800 41964 51542 22497 4715 35266 61449 82901 70372 78894 89148 72413 82369
14828H2369n585j9207l1148l3488l4769M0933L4909R173M4834k0877n9654j629
$$ 82369 76784 57577 26429 -7059 -41828 -895 34014 43187 88021 67144 7490 5861
14816E861K1579J9743L6801Q307k6563j067m9208J9802N2793j7199q8601o457
$$ 5861 27440 47183 83984 92291 65728 64661 15453 35255 88048 70849 -17752 -24209
14804b4209m000N3174J4432m426M0272O9760M415p5244p4667k5304m9678q819
$$ -24209 -28209 24965 39397 34971 75243 145003 149418 74174 -493 -25797 -75475 -84294
14792h4294M7478P3238R693m7905j9383J6096k9737m0462R308n9610M1229R2089
$$ -84294 -36816 36422 46115 -1790 -21173 -5077 -34814 -75276 -65968 -125578 -84349 7740
14780G740L8943L2842n0176m7724M685L6420j7950o2024l5208j5835M6890J0078
$$ 7740 46683 79525 29349 -18375 -13690 22730 4780 -57244 -92452 -108287 -61397 -51319
14768e1319J0578N5995N899l3578j153K179j7771J7656j0398M5496M8598j2003
$$ -51319 -40741 15254 21153 -12425 -13578 -11399 -29170 -11514 -21912 23584 72182 60179
14756F0179k5063m1839K6123J7955k7896l2010m9482l0932k5125k0982K8630M9093
$$ 60179 35116 -6723 19400 37355 9459 -22551 -72033 -102965 -128090 -149072 -120442 -71349
14744g1349K7563j7440K7833M7681k0799P616j1123r179M042l6021l1953J6880
$$ -71349 -43786 -61226 -33393 14288 -6511 1105 -10018 -19197 -15155 -51176 -83129 -66249
14732f6249K9527M5944L315o6852j9054j621k0431L4548J5845k5742k957J2925
$$ -66249 -36722 9222 12537 -54315 -73369 -74990 -95421 -60873 -45028 -70770 -73727 -60802
14720f0802O8321K0999k3176l8842K1795J0392J5034l881J0025j8607m3741N6938
$$ -60802 7519 28518 5342 -33500 -11705 -1313 13721 9840 19865 1258 -42483 14455
14708A4455P0339n509m3200k2765J1718j1718n088k7892k344R200M2909J2579
$$ 14455 84794 79285 36085 13320 25038 13320 8232 -19660 -22004 -12804 30105 42684
14696D2684k700P82j3485M3155J7815k5214q0968l6114O4432j777q0057J0334
$$ 42684 39984 40766 27281 70436 88251 63037 -17931 -54045 10387 8610 -71447 -61113
14684f1113K9149N019n39J1328O6625J7462l2689l2411L2690k5732o2616m0959
$$ -61113 -31964 -26945 -27484 -16156 50469 67931 35242 2831 35521 9789 -52827 -93786
14672i3786J6530L0799M9768L2616n222j9237J7381k3048O041o7568o440M0462
$$ -93786 -77256 -46457 3311 35927 30705 11468 28849 5801 11842 -55726 -62166 -21704
14660b1704J2851j8341K7684j9537K4881K916P847k2615j3456L700m6657k205
$$ -21704 -8853 -27194 490 -19047 5834 8750 16597 -6018 -19474 -15774 -62431 -64636
14648f4636N769j5923P0764K4225k5148o2881o306l7363j0N4088K8607M07k3796
$$ -64636 -58867 -74790 -4026 20199 -4949 -67830 -74136 -111499 -111509 -57421 -28814 -28407 -52203
14635e2203n27O124N1247l5223l9814P969K2460O6715N3191P043l4046l7475k6034
$$ -52203 -52730 -46606 4641 -30582 -70396 -62427 -39967 26748 79939 86982 52936 15461 -10573
14622a0573R847l4670k6364N5709l5705j6255L0363k1643K8482M6455j9932P664
$$ -10573 -726 -35396 -61760 -6051 -41756 -58011 -27648 -49291 -20809 25646 5714 13378
14610A3378n216K3671k1907l122m5556j5395K4148J808k7072K2850L6104K8899
$$ 13378 8162 31833 9926 6804 -38752 -54147 -29999 -28191 -55263 -32413 3691 32590
14598C2590K2927J860l7018l7327r736M665L6216P402L5186k4955L4005L1766
$$ 32590 55517 57377 20359 -16968 -26704 -22039 14177 21579 56765 31810 65815 97581
14586I7581P360k1518j097p0080m5647o3356k1702K4101J0381j4637q9154J4666
$$ 97581 104941 83423 82326 12246 -33401 -96757 -118459 -94358 -83977 -98614 -187768 -173102
14574a73102O9497Q0887m9571j4232J3627N5648K7647m8243k2192J8523K4919
$$ -173102 -103605 -22718 -72289 -86521 -72894 -17246 10401 -37842 -60034 -41511 -16592
14563a6592j3894q663J3159m0329N1670O9982N5853o655j1824m7451n5226k2385
$$ -16592 -30486 -39149 -25990 -66319 -14649 55333 111186 104531 92707 45256 -9970 -32355
14551c2355k9200M5727L2434k1678l0929O003K1706M1525M2560j1980r7977k8943
$$ -32355 -61555 -15828 16606 -5072 -36001 -29998 -8292 33233 75793 63813 -34164 -63107
14539f3107K8442J8576J4586j4039k1609p529O709M3344J5480M881K7155m3409
$$ -63107 -34665 -16089 -1503 -15542 -37151 -44680 -37971 5373 20853 25734 52889 9480
14527I480l8274l69M1877L4891m1980k9008l1154Q902Q493J7804K1775O555Q611
$$ 9480 -28794 -29163 12714 47605 5625 -23383 -54537 -45635 -37142 -19338 2437 8992 17603
14514A7603M8248N4779j4812J3576K5508l7779j4334l0494J8835o61l9774r9305
$$ 17603 65851 120630 105818 119394 144902 107123 92789 62295 81130 80469 40695 -58610
14502e8610K5092N9198m067j855J7621j0353J6957J2382l1176l5401J4329N3200
$$ -58610 -33518 25680 21613 19758 37379 27026 43983 56365 25189 -10212 4117 57317
14490E7317M4257j8875p097r680n970L9842K06k1190r3956o5581K5479M1264J2218
$$ 57317 101574 82699 75602 65922 59952 99794 100000 78810 -15146 -80727 -55248 -13984 -1766
14477a766j6883K8828j7063k1622k6828N7808J917p3509j577N3559J5444q8o3290
$$ -1766 -18649 10179 -6884 -28506 -55334 2474 4391 -69118 -70695 -17136 -1692 -1780 -65070
14464f5070k6948K6226R294O8426J4431j2118K4652k9508n5543M6208O5488j4615
$$ -65070 -92018 -65792 -56498 11928 26359 14241 38893 9385 -46158 50 65538 50923
14452E0923l9249N335K0857M509l9725q358O6227j6792K0656j3021J6725l554
$$ 50923 11674 17009 37866 42375 2650 -5708 60519 43727 64383 51362 68087 64533
14440F4533j3080k6858k5962J316J0519o499M9974N4986m5390M155K8430K1223
$$ 64533 51453 24595 -1367 -51 10468 3969 53943 108929 63539 67694 96124 117347
14428A17347L282k4262l5952k9038K2682j3690j6531k487l0613p1907p2684K9183
$$ 117347 120629 96367 60415 31377 54059 40369 23838 21351 -9262 -81169 -153853 -124670
14416a24670J3537L8370J2481K5301N7465N8748j0537k2352K715j6677J5588j8366
$$ -124670 -111133 -72763 -60282 -34981 22484 81232 70695 48343 51058 34381 49969 31603
14404C1603k5018k1503K0095M8240k660r0693J1587Q400n956j2724J4279L0641
$$ 31603 6585 -14918 5177 53417 50757 -39936 -28349 -19949 -25905 -38629 -24350 6291
14392F291p415K5021j6602j9074J9132k8453R147m3992K8876J8162j1140J892
$$ 6291 -1124 23897 7295 -11779 7353 -21100 -11953 -55945 -27069 -8907 -20047 -18155
14380a8155m0182o3530J4175M9171L3761K4673J1991n9176j6136K3208M759M7976
$$ -18155 -58337 -121867 -107692 -58521 -24760 -87 11904 -47272 -63408 -40200 -35441 12535
14368A2535n5635j0134L0366l9070m7108P6604M4271J2728J9337J8671j0260J43
$$ 12535 -43100 -53234 -22868 -61938 -109046 -32442 11829 24557 43894 62565 52305 52448
14356E2448n9473o7181k8922L1906L4887K2698l3557l7j3984j8937M950M5600
$$ 52448 -7025 -74206 -103128 -71222 -36335 -13637 -47194 -47231 -61215 -80152 -75202 -29602
14344b9602O9105J7781l2731j2672Q111l9517n476k6821N8798K0414o6195J180
$$ -29602 39503 57284 24553 11881 19992 -19525 -25001 -51822 6976 27390 -38805 -37625
14332c7625J1439l5730O0390M160k8583j7180L6040K3200j9069j2213p2694J7008
$$ -37625 -26186 -61916 -1526 2634 -25949 -43129 -7089 16111 -2958 -15171 -87865 -70857
14320g0857O8103j0476m2905M4305K568k552K9619j0634J9770J834k9206M0639
$$ -70857 -2754 -13230 -56135 -11830 -9262 -11814 17805 7171 26941 28775 -431 40208
14308D0208M2886K232J1656J452J363p6277k3705n13L665j3867O6570j4506m5024
$$ 40208 83094 85326 96982 98434 99797 23520 -185 -698 2967 -10900 55670 41164 -3860
14295c860k703q687K7643j5469k1769l7041k7190N9129r748l9465r853N2199Q5015
$$ -3860 -6563 -15250 12393 -3076 -24845 -61886 -89076 -29947 -39695 -79160 -89013 -36814 48201
14282D8201K7068J3434j8875j6392O713k2631o8337K229j2151J8247P7036k7797
$$ 48201 75269 88703 69828 53436 60149 37518 -30819 -28590 -40741 -22494 54542 26745
14270B6745l0640j8148L4183L471j8060j9108N8338j8116j3666J6594J058j1120
$$ 26745 -3895 -22043 12140 15611 -2449 -21557 36781 18665 4999 21593 22651 11531
14258A1531J6223l537K0097K0130j6484k7051q3917J5281J3340m456k0723K3303
$$ 11531 27754 24217 44314 64444 47960 20909 -63008 -47727 -34387 -38843 -59566 -36263
14246c6263p296J7166K8020k7001l6437J0115N9065P908k219J6498K868j7543
$$ -36263 -43559 -26393 1627 -25374 -61811 -51696 7369 15277 13058 29556 32424 14881
14234A4881l6732r485O3501J8569j0444o3061k5001M0080J7509K7424J7439l4290
$$ 14881 -21851 -31336 32165 50734 40290 -22771 -47772 -7692 9817 37241 54680 20390
14222B0390L3648L3209l4824p0958J5425L7643o068l6667l9795l9414L7435j3615
$$ 20390 54038 87247 52423 -18535 -3110 34533 28465 -8202 -47997 -87411 -49976 -63591
14210f3591L3624L50q005J2645M750L417p266j2118M9989j9768l245L5159p0873
$$ -63591 -29967 -29617 -37622 -24977 -20227 -16810 -24076 -36194 13795 -5973 -9218 25941 -44932
14197d4932k0731K0752j257r736j2086r587k6000n6213j913K7970Q254J398L3711
$$ -44932 -65663 -44911 -46168 -55904 -67990 -77577 -103577 -159790 -161703 -133733 -125479 -124081 -90370
14184i0370K0720M2233L529M92J4040J4641N9192L2335n6774o5473L950l9936
$$ -90370 -69650 -27417 -23888 -23396 -9356 5285 64477 96812 40038 -25435 -21485 -61421
14172f1421R765L7167M7372q604m5102K3297L5645M345m8890l7078K953l904K7255
$$ -61421 -51656 -14489 32883 24279 -20823 2474 38119 42464 -6426 -43504 -40551 -44455 -17200
14159a7200j62L8666K038K6069n6972o3425J4792K0685n0534k6761n600O8334
$$ -17200 -17362 21304 23342 49411 -7561 -70986 -56194 -35509 -86043 -112804 -118404 -50070
14147e0070M914k6891K1711P018K0819j4657Q1191M3540j7480m9819m7800m8690
$$ -50070 -45156 -72047 -50336 -43318 -22499 -37156 44035 87575 70095 20276 -27524 -76214
14135g6214o898P0791L4624L2513l7967k1524M1307J2973k9757l1801K2790J2992
$$ -76214 -83112 -12321 22303 54816 16849 -4675 36632 49605 19848 -11953 10837 23829
14123B3829L600L120n4583j1499J6687k7747m976M517J4394K1854m9358K7486
$$ 23829 27429 30549 -24034 -35533 -18846 -46593 -51569 -47052 -32658 -10804 -60162 -32676
14111c2676k7901k8782K3587L2595L8988M8242l0994K5107L1259l2030J8311r533
$$ -32676 -60577 -89359 -65772 -33177 5811 54053 23059 48166 79425 47395 65706 56173
14099E6173j0461n7666k7212j9779K7407J3128o7782n7464O4053J1804J4336M3877
$$ 56173 45712 -11954 -39166 -58945 -31538 -18410 -86192 -143656 -79603 -67799 -53463 -9586
14087i586L7722q642l028K5440o2489n9357K9801N0920K9138o9447q7788O6043
$$ -9586 28136 19494 16466 41906 -20583 -79940 -50139 781 29919 -39528 -127316 -61273
14075f1273Q7529L4863M82n7149l5969k0887m7890N5661L9242n0011o1060L7872
$$ -61273 26256 61119 61601 4452 -31517 -52404 -100294 -44633 -5391 -55402 -116462 -78590
14063g8590R5234o9706l9018o695K7348K1375R444j4822k0436k045N800J8881
$$ -78590 16644 -53062 -92080 -98775 -71427 -50052 -40608 -55430 -75866 -77911 -72111 -53230
14051e3230k0140j9825K6581N8335l6256l4473N264R323j823N577J4559j7798
$$ -53230 -73370 -93195 -66614 -8279 -44535 -79008 -73744 -64421 -66244 -60667 -46108 -63906
14039f3906k6487J0992j3682l3238j4205K2083K5226J3882N3943Q383p9943K7875
$$ -63906 -90393 -79401 -93083 -126321 -140526 -118443 -93217 -79335 -25392 -17009 -96952 -69077
14027f9077M8571J8058j5044J6793l3233L1930L2213m366m3915j0579J0570L7574
$$ -69077 -20506 -2448 -17492 -699 -33932 -2002 30211 25845 -18070 -28649 -18079 19495
14015A9495l3855m9358M0586J9678l1018k1139l7955N138j6853j2183j4626k0244
$$ 19495 -14360 -63718 -23132 -3454 -34472 -55611 -93566 -88428 -105281 -117464 -132090 -152334
14003a52334O9625M4463R564M4611L3282r287j4870j9316j0990L3363p370j1461
$$ -152334 -82709 -38246 -28682 15929 49211 39924 25054 5738 -5252 28111 20741 9280
13991I280l0663K6125j5879j1539J3953J6634k4925n4362k4796k1041l5962k7125
$$ 9280 -21383 4742 -11137 -22676 -8723 7911 -17014 -71376 -96172 -117213 -153175 -180300
13979a80300N8858R0314L9103M106p708r668j6806r942q030l5370l0514J4633
$$ -180300 -121442 -31128 7975 12081 4373 -5295 -22101 -32043 -40073 -75443 -105957 -91324
13967i1324k9913K9895P4970l5849N337m7507k9686K3132M1690l6142n0408J8461
$$ -91324 -121237 -91342 -16372 -52221 -46884 -94391 -124077 -100945 -59255 -95397 -145805 -127344
13955a27344O5942k5420m1282J2578l946N0556N7358K5861o619J980l1240j1375
$$ -127344 -61402 -86822 -128104 -115526 -119472 -68916 -11558 14303 7684 9664 -21576 -32951
13943c2951j074J2492k8207o234N3303J901j1467p0723n4450j9693J0197J06325
$$ -32951 -34025 -21533 -49740 -55974 -2671 -770 -12237 -82960 -137410 -157103 -146906 -40581
13931d0581N250J3576J9505j1404O8265M4398p2423m1199j9215K5075m693k1274
$$ -40581 -35331 -21755 -2250 -13654 54611 99009 26586 -14613 -33828 -8753 -13446 -34720
13919c4720P4358J9711K927J3822k8721m5567n3718l3115O3484L072n5932L7946
$$ -34720 39638 59349 62276 76098 47377 1810 -51908 -85023 -21539 -18467 -74399 -36453
13907c6453J06689K6952k6533k0382N436K251m2920J4916M7998N102j5980q3243
$$ -36453 70236 97188 70655 50273 55709 57960 15040 29956 77954 83056 67076 -16167
13895a6167j3501M8111k7438l804j8412k5855K5285K1526L6002P671q0857Q109
$$ -16167 -29668 18443 -8995 -12799 -31211 -57066 -31781 -10255 25747 33418 -47439 -39330
13883c9330N2015L2602L5113L0548o2984M21l2913m2796p4495j195P2488L7283
$$ -39330 12685 45287 80400 110948 47964 48385 15472 -27324 -101819 -103014 -30526 6757
13871F757M8814l4314o2095k5046P437K0536L157k8687L5890K7412k2996o1388
$$ 6757 55571 21257 -40838 -65884 -58447 -37911 -34754 -63441 -27551 -139 -23135 -84523
13859h4523L885N4900K4386O0023N9259n2138q6765m8283p766k213L151K5799
$$ -84523 -80638 -25738 -1352 58671 117930 65792 -20973 -69256 -77022 -79235 -76084 -50285
13847e0285L9411O442p585m2180J8162O3098q832j4825J5059J1372J62L5307o895
$$ -50285 -10874 -4432 -12017 -54197 -36035 27063 18231 3406 18465 29837 29999 65306 58411
13834E8411K6882L0980j5528m9529m1625M2263l5796J1771L41J6774N911P931
$$ 58411 85293 116273 100745 51216 9591 51854 16058 27829 28170 44944 50855 58786
13822E8786o1371r346R881l8400J9439J7946J1356k2690j474o268L9092k1572
$$ 58786 -2585 -11931 -2050 -40450 -21011 -3065 8291 -14399 -15873 -22141 16951 -4621
13810d621J2914R586l3306l1260J5231L0933M195N0988J6513P205Q427j824l5148
$$ -4621 8293 17879 -15427 -46687 -31456 -523 3672 54660 71173 78378 86805 84981 49833
13797D9833r227k6962Q7504L9382l5578k6423o7885m2511K3731r195M0871K4357
$$ 49833 40606 13644 101148 140530 104952 78529 10644 -31867 -8136 -17331 23540 47897
13785D7897j6895k0200J2641N480J132J70N1852r598J6883J5425r995j7433J7797
$$ 47897 31002 10802 23443 28923 30055 30225 82077 72479 89362 104787 94792 77359 95156
13772I5156M4789L174R13K7416K1055O2920K0715n6396o1143r6017l7928k501
$$ 95156 139945 143119 144032 171448 192503 255423 276138 219742 158599 62582 24654 22153
13760B2153j4345j047L3610J3913J3473o2757p9468J0727J7255j66k22k063j3551
$$ 22153 7808 6761 40371 54284 67757 5000 -74468 -63741 -46486 -46652 -46874 -48937 -62488
13747f2488j5893J383l704Q749J3669N4507L9407p172N292J8176l1189j5429K802
$$ -62488 -78381 -76998 -80702 -71953 -58284 -3777 35630 28458 33750 51926 20737 5308 8110
13734H110M6640M9677j7879K7672L3664L8414J05233L0965q284L187R26k1384
$$ 8110 54750 104427 86548 114220 147884 186298 291531 322496 314212 317399 318325 296941
13722B96941l0953l7875m4782J615m2589o9003l0090K5677k6993J8953k0825J1525
$$ 296941 265988 228113 183331 184946 142357 73354 43264 68941 41948 60901 40076 51601
13710E1601J3321J4620J2163K298J0173r739l7400M2566j3664j9659j6056n5034
$$ 51601 64922 79542 91705 94003 104176 94437 57037 99603 85939 66280 50224 -4810
13698d810k8147p2539L9166K7851K9036O8085J9322l463N741J5385L7087K492
$$ -4810 -32957 -105496 -66330 -38479 -9443 58642 77964 74501 80242 95627 132714 135206
13686A35206K6422J4860j3111K944R6677J8299n8245n5161r4940n599J1219q806
$$ 135206 161628 176488 163377 166321 262998 281297 223052 167891 72951 67352 78571 69765
13674F9765o7084p2602N6602O2514J7342p704K6166K3099k3487m5797L552L855
$$ 69765 2681 -69921 -13319 49195 66537 58833 84999 108098 84611 38814 42366 46221
13662D6221J4282l6996K156M4173l6524r0348l245m4834l8100L6832K6525O4995
$$ 46221 60503 23507 25663 69836 33312 -57036 -60281 -105115 -143215 -106383 -79858 -14863
13650a4863K9022L1330n9382m031N0425n4739M5843M4017L1763j310m4521J4788
$$ -14863 14159 45489 -13893 -17924 32501 -22238 23605 67622 99385 98075 53554 68342
13638F8342j6433k6499l730m2081N213L6737L4010L390j8025q1850J2374k3292
$$ 68342 51909 25410 21680 -20401 -15188 21549 55559 58949 40924 -40926 -28552 -51844
13626e1844J8093K5740k6848j1215j9682J8304K4506K2405j0334n3912j4255L4616
$$ -51844 -33751 -8011 -34859 -46074 -65756 -47452 -22946 -541 -10875 -64787 -79042 -44426
13614d4426k8839j85k7757L5672P29j7120M8807L0163m676N365j720l3377r036
$$ -44426 -73265 -73450 -101207 -65535 -64806 -81926 -33119 -2956 -7632 -2267 -3987 -37364 -46400
13601d6400L4385P9425l0660l5184l6512o250J2582N7340K8702l8269M729k7269
$$ -46400 -12015 67410 36750 1566 -34946 -41196 -28614 28726 57428 19159 23888 -3381
13589c381k7563M1172Q0510q421m5820k5568j6604J252m559k5220k7802m2545
$$ -3381 -30944 10228 90738 82317 36497 10929 -5675 -4423 -8982 -34202 -62004 -104549
13577a04549j5551K1892O1671M9694K8623k579m9227k3488M2063K0050j0367k2121
$$ -104549 -120100 -98208 -36537 13157 41780 39201 -10026 -33514 8549 28599 18232 -3889
13565c889k2280k4368K1498K345P8092K7974o8531n9500K347N6806J8215J5870
$$ -3889 -26169 -50537 -29039 -26694 51398 79372 10841 -48659 -46312 10494 28709 44579
13553D4579J7815m1519k6382R535j7536j1216r006O1018K6734K4150o736k2902
$$ 44579 62394 20875 -5507 4028 -13508 -24724 -33730 27288 54022 78172 71436 48534
13541D8534p727k4147L8996m8156k5858m5121L574N638l6866n5027j0632N901
$$ 48534 40807 16660 55656 7500 -18358 -63479 -59905 -54267 -91133 -146160 -156792 -150891
13529a50891O4134Q7076N4103N1025l839q0245m7753l2339J4798m1634J628j8545
$$ -150891 -86757 319 54422 105447 101608 21363 -26390 -58729 -43931 -85565 -83937 -102482
13517a02482R34Q2322L553k7949L8217K7082k9154M308k8269M7264k9753l950
$$ -102482 -101548 -19226 -15673 -43622 -5405 21677 -7477 -3169 -31438 15826 -13927 -17877
13505a7877J17995L9059N789j494m7867m2638r981j8406k7755m1108p775N5179
$$ -17877 100118 139177 144966 143472 95605 52967 42986 24580 -3175 -44283 -52058 3121
13493C121L0799j4956j7018j8461J1303j5715k616o033O808K2947k6947m4132
$$ 3121 33920 18964 1946 -16515 -5212 -20927 -23543 -29576 -22768 179 -26768 -70900
13481g0900M4890M5632L5804Q874l8042k3111j0570p667m219k8273o376J3065
$$ -70900 -26010 19622 55426 64300 26258 3147 -7423 -15090 -19309 -47582 -53958 -40893
13469d0893L7231L5655k329J4181J7622L064M6631k4973j9230q58o1217j6583
$$ -40893 -3662 31993 29664 43845 61467 64531 111162 86189 66959 66101 4884 -11699
13457a1699m0031k0192k8365J5220J5528J6564M8984o569j4469l0458k430j2042
$$ -11699 -51730 -71922 -100287 -85067 -69539 -52975 -3991 -10560 -25029 -55487 -57917 -69959
13445f9959m5226K4803J4701J9241j7553m0989O492J5285O1745M5393j3155n5204
$$ -69959 -115185 -90382 -75681 -56440 -73993 -114982 -108490 -93205 -31460 13933 778 -54426
13433e4426k8934O1912L4145k5920l893k4195L7518j3537j2698Q9242M79m1457
$$ -54426 -83360 -21448 12697 -13223 -17116 -41311 -3793 -17330 -30028 59214 59693 18236
13421A8236k1438M2502M4832n2534N125L4235J8939Q205N869l2224l7676m7227
$$ 18236 -3202 39300 84132 31598 36723 70958 89897 98102 103971 71747 34071 -13156
13409a3156M2362P2602l6530m149j7259k122r361J9349J9770l0865n6880j8918
$$ -13156 29206 101808 65278 61129 43870 41748 32387 51736 71506 40641 -16239 -35157
13397c5157p281O8973M1945k6830n5906l4601N3486J2730j2477j7500l3319k4371
$$ -35157 -42438 26535 68480 41650 -14256 -48857 4629 17359 4882 -12618 -45937 -70308
13385g0308j5918k3780M4986M7876J1578m4002l4468k2408q45M201L6149j140
$$ -70308 -86226 -110006 -65020 -17144 -5566 -49568 -84036 -106444 -107289 -103088 -66939 -68079
13373f8079l4964j1077Q6036J4474o2341r089L4787Q2324J0487m6274m3791N3795
$$ -68079 -103043 -114120 -28084 -13610 -75951 -85040 -50253 32071 42558 -3716 -47507 6288
13361F288M012k8028j1784j0901L7707K8881m6226p1442q979L7488k0342K2065
$$ 6288 10300 -17728 -29512 -40413 -2706 26175 -20051 -91493 -100472 -62984 -83326 -61261
13349f1261K098K2983k3860j1895M0061K1471J3442M2734M8895q269n4553m5744
$$ -61261 -59163 -36180 -60040 -71935 -31874 -10403 3039 45773 94668 86399 31846 -13898
13337a3898J9774L6759J1225M8247K730m9187p0229p1174m0339J7431Q899L8904
$$ -13898 5876 42635 53860 102107 104837 55650 -14579 -85753 -126092 -108661 -99762 -60858
13325f0858K9430n6368N048L9877K1713n828O7335L3986r720m4673j2201J3901
$$ -60858 -31428 -87796 -82748 -42871 -21158 -26986 40349 74335 64615 19942 7741 21642
13313B1642p440k8234k7792k533k8129J0352j1183N9988M938J8849j4830m9824
$$ 21642 14202 -14032 -41824 -44357 -72486 -62134 -73317 -13329 -8391 10458 -4372 -54196
13301e4196Q124O7284N1034K3520o4449o0806P384j1788N1106L791k8725j3166
$$ -54196 -46072 21212 72246 95766 31317 -29489 -22105 -33893 17213 21004 -7721 -20887
13289b0887l1479N2784m1155L3414J4590n050K4023M5687Q628q2843p3775j5738
$$ -20887 -52366 418 -40737 -7323 7267 2217 26240 71927 80555 -2288 -76063 -91801
13277i1801J3734o47J5516O176n300J8070K824M4695q329q879J890l4935n980
$$ -91801 -78067 -78714 -63198 -57022 -62322 -44252 -41428 3267 -5062 -13941 -12051 -46986 -52966
13264e2966J1752J3869k9179j8887O0840N8028m9412m5468q862M5452J2656R293
$$ -52966 -41214 -27345 -56524 -75411 -14571 43457 -5955 -51423 -60285 -14833 -2177 7116
13252G116j8805j1316N4021L9832L1197p928k4834l3515k0424J8912L8614o7557
$$ 7116 -11689 -23005 31016 70848 102045 94117 69283 35768 15344 34256 72870 5313
13240E313k9284J7737J0009K6334L0106Q3589J9536n2750n7838l4314n2457O4148
$$ 5313 -23971 -6234 3775 30109 60215 143804 163340 110590 52752 18438 -34019 30129
13228C0129Q971K2454j9486J702M5372p4623l4810m0767K3957P8451K587K0325
$$ 30129 39100 61554 42068 43770 89142 14519 -20291 -61058 -37101 41350 43937 64262
13216F4262k033L0040L6281R179l928r4545p3342r087k340Q261L4904k6487j6366
$$ 64262 62229 92269 128550 137729 133801 39256 -34086 -43173 -45513 -37252 -2348 -28835 -45201
13203d5201m748k606O818M5575O9564J444q2290j3466N762P951l80L564o9169
$$ -45201 -49949 -52555 -45737 -162 69402 70846 -11444 -24910 -19148 -11197 -11577 -8013 -77182
13190g7182L3609K685k138K3387M9832J5169Q469P043j1991R042n3444j9141M989
$$ -77182 -43573 -40888 -43026 -19639 30193 45362 53831 60874 48883 57925 4481 -14660 -9671
13177i671L182l3093J2905L7942M3707J2616q9778j4204r543M3r4581M066O2830
$$ -9671 -6489 -39582 -26677 11265 54972 67588 -22190 -36394 -45937 -45894 -140475 -136409 -73579
13164g3579p963L0021J614L6991N5538m1915l027K1829l2988k5387j9589J2976
$$ -73579 -81542 -51521 -49907 -12916 42622 707 -2320 19509 -13479 -38866 -58455 -45479
13152d5479K7665P294J5607O980l9502j5389K4873N0079M3870K0055Q258k1481
$$ -45479 -17814 -10520 5087 12067 -27435 -42824 -17951 32128 75998 96053 104311 82830
13140H2830k0061l8393L237j0845p3670j5420L1417M880K274N7077K4592j7885
$$ 82830 62769 24376 27613 16768 -56902 -72322 -40905 -36025 -33751 23326 47918 30033
13128C0033k7069k5658m5165J4143O0706K9969k2331j5450l4039l0344K0610n41
$$ 30033 2964 -22694 -67859 -53716 6990 36959 14628 -822 -34861 -65205 -44595 -45136
13116d5136k4465m879K9139O3806K6660l3766p991k6845m2878K9888L9593K3288
$$ -45136 -69601 -74480 -45341 18465 45125 11359 3368 -23477 -66355 -36467 3126 26414
13104B6414K1883j212l3539J2187P0674K739l3428j1558Q2162K4461m1017j4025
$$ 26414 48297 47085 13546 25733 96407 99146 65718 54160 136322 160783 119766 105741
13092A05741l2184q0752o1063K7377N4479k951p9523r844p023P788K8670J4356
$$ 105741 73557 -7195 -68258 -40881 13598 10647 -68876 -78720 -85743 -77955 -49285 -34929
13080c4929K1427k8714M1414j6707m6600Q359P2435r817q311m6904l9222J1889
$$ -34929 -13502 -42216 -802 -17509 -64109 -55750 16685 6868 -1443 -48347 -87569 -75680
13068g5680M3217M5640L1423K6282L0454l9596l5658j3610J6057n7593K0946O8992
$$ -75680 -32463 13177 44600 70882 101336 61740 26082 12472 28529 -29064 -8118 60874
13056F0874N4717n356K0299J2943n4621l3639j0140j3835l6352o662k7089j7461
$$ 60874 115591 110235 130534 143477 88856 55217 45077 31242 -5110 -11772 -38861 -56322
13044e6322K3413N2215L9113j2407K4907k6798l8860j2987K6954N3520L2091m8178
$$ -56322 -32909 19306 58419 46012 70919 44121 5261 -7726 19228 72748 104839 56661
13032E6661O829k6777j1346K1556O244j5135N530p634j3083j1207j8812l8295
$$ 56661 63490 36713 25367 46923 53167 38032 43562 35928 22845 11638 -7174 -45469
13020d5469L4874L8525Q220j4784j2047k5330L7511K5491m4575j9483j242O410
$$ -45469 -10595 27930 36150 21366 9319 -16011 21500 46991 2416 -17067 -18309 -11899
13008a1899j4998P188R076l1997n6862l9993Q6782L8069M9497p941k9700J474
$$ -11899 -26897 -19709 -10633 -42630 -99492 -139485 -52703 -14634 34863 26922 -2778 -1304
12996a304N9613J2855k5871l5967L789L4515R1569K8954l8200p0681l5807k8365
$$ -1304 58309 71164 45293 9326 13115 47630 139199 168153 129953 59272 23465 -4900
12984d900m1784k0756P188k0494J8209j871J3973L4785k9700O1184K1339l0188
$$ -4900 -46684 -67440 -60252 -80746 -62537 -64408 -50435 -15650 -45350 15834 37173 6985
12972F985l1381J5148P1853k4751p3620k6997J797l258k1492J1017R6266K8239
$$ 6985 -24396 -9248 62605 37854 -35766 -62763 -60966 -64224 -85716 -74699 21567 49806
12960D9806o1327k4284n524J8242J2443q903J0768J6802K1991K4837J1080r166
$$ 49806 -11521 -35805 -41329 -23087 -10644 -19547 -8779 8023 30014 54851 65931 56765
12948E6765m4253Q827J6856R871k4931K226l1529o101m1709j9370J1732K3226
$$ 56765 12512 21339 38195 48066 23135 25361 -6168 -12269 -53978 -73348 -61616 -38390
12936c8390M0122M4739l3694o3635l2255N0629P470n352k0461k7855K971j4897
$$ -38390 1732 46471 12777 -50858 -83113 -32484 -25014 -30366 -50827 -78682 -75711 -90608
12924i0608N3087K8489L125J2765J8851l831j6903l5778Q670M6975k532J6244
$$ -90608 -37521 -9032 -5907 6858 25709 21878 4975 -30803 -22133 24842 22310 38554
12912C8554j2297M0493j3762o128j9534p5294N53P6170K4714k431K0798N3254
$$ 38554 26257 66750 52988 46860 27326 -47968 -47415 28755 53469 51038 71836 125090
12900A25090k234n7598l7167n7631k6952K7545K8267L6923r751J1636l2927L667
$$ 125090 122856 65258 28091 -29540 -56492 -28947 -680 36243 26492 38128 5201 8868
12888H868m5761j08455p488N9126Q0310K0744J472J7205R91n729k3219j5206n6146
$$ 8868 -36893 -145348 -152836 -93710 -13400 7344 8816 26021 27012 21283 -1936 -17142 -73288
12875g3288J2277O9503m7228k8136N3193K0509j1477M175J0380k5976k7202j3093
$$ -73288 -61011 8492 -38736 -66872 -13679 6830 -4647 -472 9908 -16068 -43270 -56363
12863e6363N5952K789l0821J0474k7416k9113k3044K9134N9584O2715k3295l3837
$$ -56363 -411 2378 -28443 -17969 -45385 -74498 -97542 -68408 -8824 53891 30596 -3241
12851c241k5011K4768l3541m8608M0164K304k012N1688K8360k3146j04286P700
$$ -3241 -28252 -3484 -37025 -85633 -45469 -43165 -45177 6511 34871 11725 -92561 -84861
12839h4861M3967O9366L7977n5591o3712l2182L9584K8460m560l7031m1387K9269
$$ -84861 -40894 28472 66449 10858 -52854 -85036 -45452 -16992 -21552 -58583 -99970 -70701
12827g0701O0512Q1278k0026o2351o314k5830m153K270J2264N3102J0435k8390
$$ -70701 -10189 71089 51063 -11288 -17602 -43432 -47585 -45315 -33051 20051 30486 2096
12815B096m410l5456n044K9228L8382J7936M1910k8546l8892k5725j600M6629
$$ 2096 -2314 -37770 -42814 -13586 24796 42732 84642 56096 17204 -8521 -10121 36508
12803C6508k834J3929j1525m1532J979o8825J9921N3033L9473M8243o0773l8755
$$ 36508 33674 47603 36078 -5454 -3475 -72300 -52379 654 40127 88370 27597 -11158
12791a1158l5926L683j6642p083k8915k1083o006L0242L8371M785k2872K1194
$$ -11158 -47084 -43401 -60043 -67126 -96041 -117124 -123130 -92888 -54517 -49732 -72604 -51410
12779e1410J7390K2429l2032K5925J6619r303L964M3229k15p0174J9929O1836
$$ -51410 -34020 -11591 -43623 -17698 -1079 -10382 -6418 36811 36596 -33578 -13649 48187
12767D8187K4801k0996m538n7578n297J5103K0184J2508K5472j7555n5772k870
$$ 48187 72988 51992 47454 -10124 -15421 -318 19866 32374 57846 40291 -15481 -18351
12755a8351L1035L0147N218m7250m7629O0287J2269j9384l3305j8863l8804J9973
$$ -18351 12684 42831 48049 799 -46830 13457 25726 6342 -26963 -45826 -84630 -64657
12743f4657j8513J7281J5817M2225K0521L3363q3972n8633L429q630l640K4545
$$ -64657 -83170 -65889 -50072 -7847 12674 46037 -37935 -96568 -93139 -101769 -105409 -80864
12731h0864K3052l0963l8456L754O2873K0259j770L8427K1931M974J4120J4274
$$ -80864 -57812 -88775 -127231 -123477 -60604 -40345 -42115 -3688 18243 23217 37337 51611
12719E1611M6404j8176p1095n7661n058O0183J00669k3866m1890q3053K3453O1747
$$ 51611 98015 79839 8744 -48917 -53975 6208 106877 83011 41121 -41932 -18479 43268
12707D3268o0400r590K0012j0161o4586l0439l9367N4638Q4355J4010l183M116
$$ 43268 -17132 -26722 -6710 -16871 -81457 -111896 -151263 -96625 -12270 1740 -1443 2673
12695B673o7608J5983L5775K3440L7129r649l180L1829J2094n0923J6566j7450
$$ 2673 -64935 -48952 -13177 10263 47392 37743 34563 66392 78486 27563 44129 26679
12683B6679N3031K3526o0912l4101m9909k2980R8992L3812n350o320M939m758
$$ 26679 79710 103236 42324 8223 -41686 -64666 34326 68138 62788 56468 61407 56649
12671E6649n0009k9498l2938m618J6574J0146k831n5824N6444N8336j3998n4488
$$ 56649 6640 -22858 -55796 -60414 -43840 -33694 -36525 -92349 -35905 22431 8433 -46055
12659d6055m103l1592k0009P039K1646L2946K7603o772J560k6993j9849J3612
$$ -46055 -50158 -81750 -101759 -94720 -73074 -40128 -12525 -19297 -17737 -44730 -64579 -50967
12647e0967j9528n7515J672j5844J4588P6620K7590k0822p056J4995l6660P1998
$$ -50967 -70495 -128010 -126338 -142182 -127594 -50974 -23384 -44206 -51262 -36267 -72927 -929
$$ [...]
##END NTUPLES=NMR SPECTRUM
##END=
