##TITLE=Analysis number 319507
Compound Code cc 35925
Book Reference 472/101/2
Project Code adrs
Chemist Name victoriam
##JCAMPDX= 6.0         $$ Bruker NMR JCAMP-DX V2.0
##DATA TYPE= NMR SPECTRUM
##DATA CLASS= NTUPLES
##ORIGIN= Bruker BioSpin GmbH
##OWNER= nmr
$$ XWIN-NMR		Version 3.5
$$ Wed May 17 12:49:28 2006 GMT Daylight Time (UT+1h)  MAYBRIDGE\nmr@NMR_250MHZ
##.OBSERVE FREQUENCY= 250.131544655141
##.OBSERVE NUCLEUS= ^1H
##.ACQUISITION MODE= SIMULTANEOUS (DQD)
##.ACQUISITION SCHEME= undefined
##.AVERAGES= 16
##.DIGITISER RES= 18
##SPECTROMETER/DATA SYSTEM= dpx250
##.PULSE SEQUENCE= zg30
##.SOLVENT NAME= CDCl3
##.SHIFT REFERENCE= (INTERNAL, CDCl3, 0, 16.522)
##AUDIT TRAIL= $$ (NUMBER, WHEN, WHO, WHERE, WHAT)
$$ ##TITLE= Audit trail, XWIN-NMR		Version 3.5
$$ ##JCAMPDX= 5.01
$$ ##ORIGIN= Bruker BioSpin GmbH
$$ ##OWNER= nmr
$$ C:\u/data/dgb/nmr/ADRS/4620/pdata/1/auditp.txt
$$ ##AUDIT TRAIL=  $$ (NUMBER, WHEN, WHO, WHERE, WHAT)
(   1,<2006-05-17 12:48:48.60 +100>,<MAYBRIDGE\nmr>,<NMR_250MHZ>,
      <created by zg, POWCHK disabled, PULCHK disabled
       configuration hash MD5:
       84 BC 41 DB A1 6E 1D 46 DA 25 12 A5 C1 ED C5 3A
       data hash MD5: 64K
       C9 90 51 47 BC BE 3E 6F BE 7D 62 EF C1 87 41 19>)
(   2,<2006-05-17 12:49:08.37 +100>,<MAYBRIDGE\nmr>,<NMR_250MHZ>,
      <Start of raw data processing
       ef LB = 0.3 FT_mod = 6 PKNL = 1 SI = 32K 
       data hash MD5: 32K
       15 C6 92 0A C7 88 36 64 B1 83 17 15 62 85 DB 54>)
(   3,<2006-05-17 12:49:12.38 +100>,<MAYBRIDGE\nmr>,<NMR_250MHZ>,
      <apk 
       data hash MD5: 32K
       05 D2 0B 95 0E 31 25 1B 17 6F D5 A6 54 60 E6 E1>)
(   4,<2006-05-17 12:49:13.92 +100>,<MAYBRIDGE\nmr>,<NMR_250MHZ>,
      <abs ABSG = 5 
       data hash MD5: 32K
       09 8C C5 1D 9E 93 C1 29 FF C7 59 C0 3A B9 4D 44>)
$$ ##END=
$$ 
$$ hash MD5
$$ 39 AB 18 5E CF 07 EC E6 7F D0 F9 B2 6B 41 01 4C
##$RELAX= 
##$RELAX= 
##$RELAX= 
##$RELAX= 
##$RELAX= 
##$RELAX= 
##$RELAX= 
$$ Bruker specific parameters
$$ --------------------------
##$DU= <C:\u>
##$EXPNO= 4620
##$NAME= <ADRS>
##$PROCNO= 1
##$TYPE= <nmr>
##$USER= <dgb>
##$AMP= (0..31)
100 100 100 100 100 100 100 100 100 100 100 100 100 100 100 100 100 100 
100 100 100 100 100 100 100 100 100 100 100 100 100 100 
##$AQSEQ= 0
##$AQ_mod= 3
##$AUNM= <au_zg>
##$AUTOPOS= <29 >
##$BF1= 250.13
##$BF2= 250.13
##$BF3= 250.13
##$BF4= 250.13
##$BF5= 500.13
##$BF6= 500.13
##$BF7= 500.13
##$BF8= 500.13
##$BYTORDA= 1
##$CFDGTYP= 0
##$CFRGTYP= 5
##$CHEMSTR= <none>
##$CNST= (0..31)
1 1 145 1 1 1 1 1 1 1 1 1 1 1 1 1 1 1 1 1 1 1 1 1 1 1 1 1 1 1 1 1 
##$CPDPRG= <>
##$CPDPRG1= <>
##$CPDPRG2= <>
##$CPDPRG3= <>
##$CPDPRG4= <mlev>
##$CPDPRG5= <mlev>
##$CPDPRG6= <mlev>
##$CPDPRG7= <mlev>
##$CPDPRG8= <mlev>
##$CPDPRGB= <>
##$CPDPRGT= <>
##$D= (0..31)
0 1 0 0 0 0 0 0 0 0.06 0 0 0 0 0 0 0.0002 0 0 0 0 0 0 0 0 0 0 0 0 0 0 
0 
##$DATE= 1147866526
##$DBL= (0..7)
120 120 120 120 120 120 120 120 
##$DBP= (0..7)
150 150 150 150 150 150 150 150 
##$DBP07= 0
##$DBPNAM0= <>
##$DBPNAM1= <>
$$ [...]
##$SUBNAM7= <"">
##$SUBNAM8= <"">
##$SUBNAM9= <"">
##$SW= 20.6930455092707
##$SWIBOX= (0..15)
0 0 3 0 0 0 0 0 0 0 0 0 0 0 0 0 
##$SW_h= 5175.983436853
##$TD= 65536
##$TD0= 1
##$TE= 295.16
##$TE2= 300
##$TE3= 300
##$TEG= 300
##$TL= (0..7)
0 120 120 120 120 120 120 120 
##$TP= (0..7)
150 150 150 150 150 150 150 150 
##$TP07= 0
##$TPNAME0= <>
##$TPNAME1= <>
##$TPNAME2= <>
##$TPNAME3= <>
##$TPNAME4= <>
##$TPNAME5= <>
##$TPNAME6= <>
##$TPNAME7= <>
##$TPOAL= (0..7)
0.5 0.5 0.5 0.5 0.5 0.5 0.5 0.5 
##$TPOFFS= (0..7)
0 0 0 0 0 0 0 0 
##$TUNHIN= 0
##$TUNHOUT= 0
##$TUNXOUT= 0
##$USERA1= <user>
##$USERA2= <user>
##$USERA3= <user>
##$USERA4= <user>
##$USERA5= <user>
##$V9= 5
##$VALIST= <valist>
##$VCLIST= <CCCCCCCCCCCCCCC>
##$VD= 0
##$VDLIST= <DDDDDDDDDDDDDDD>
##$VPLIST= <PPPPPPPPPPPPPPP>
##$VTLIST= <TTTTTTTTTTTTTTT>
##$WBST= 1024
##$WBSW= 4
##$XGAIN= (0..3)
0 0 0 0 
##$XL= 0
##$YL= 0
##$YMAX_a= 360241
##$YMIN_a= -511674
##$ZGOPTNS= <>
##$ZL1= 120
##$ZL2= 120
##$ZL3= 120
##$ZL4= 120
##$ABSF1= 16.522
##$ABSF2= -4.171173
##$ABSG= 5
##$ABSL= 3
##$ALPHA= 0
##$AQORDER= 0
##$ASSFAC= 0
##$ASSFACI= 0
##$ASSFACX= 0
##$ASSWID= 0
##$AUNMP= <proc_1d>
##$AZFE= 0.1
##$AZFW= 0.1
##$BCFW= 0
##$BC_mod= 0
##$BYTORDP= 0
##$COROFFS= 0
##$CY= 12.5
##$DATMOD= 1
##$DC= 0
##$DFILT= <>
##$DTYPP= 0
##$F1P= 14.0000005364418
##$F2P= -0.99999901652339
##$FCOR= 0.5
##$FTSIZE= 32768
##$FT_mod= 6
##$GAMMA= 0
##$GB= 0
##$INTBC= 1
##$INTSCL= 1
##$ISEN= 128
##$LB= 0.3
##$LEV0= 0
##$LPBIN= 0
##$MAXI= 10000
##$MC2= 0
##$MEAN= 0
##$ME_mod= 0
##$MI= 0
##$NCOEF= 0
##$NC_proc= -4
##$NLEV= 6
##$NOISF1= 0
##$NOISF2= 0
##$NSP= 0
##$NTH_PI= 0
##$NZP= 0
##$OFFSET= 16.522
##$PC= 1
##$PHC0= 166.954
##$PHC1= 3.834076
##$PH_mod= 1
##$PKNL= yes
##$PPARMOD= 0
##$PSCAL= 4
##$PSIGN= 0
##$REVERSE= no
##$SF= 250.13
##$SI= 32768
##$SIGF1= 0
##$SIGF2= 0
##$SINO= 400
##$SIOLD= 32768
##$SREGLST= <1H.CDCl3>
##$SSB= 0
##$STSI= 32768
##$STSR= 0
##$SW_p= 5175.98343685301
##$SYMM= 0
##$S_DEV= 0
##$TDeff= 65536
##$TDoff= 0
##$TI= <Analysis number 999999
Compound Code 99
Book Reference 9
Project Code 9>
##$TILT= no
##$TM1= 0
##$TM2= 0
##$TOPLEV= 0
##$USERP1= <user>
##$USERP2= <user>
##$USERP3= <user>
##$USERP4= <user>
##$USERP5= <user>
##$WDW= 1
##$XDIM= 32768
##$YMAX_p= 529287913
##$YMIN_p= -250876
$$ End of Bruker specific parameters
$$ ---------------------------------
##NTUPLES= NMR SPECTRUM
##VAR_NAME=  FREQUENCY,     SPECTRUM/REAL,   SPECTRUM/IMAG
##SYMBOL=    X,             R,               I
##VAR_TYPE=  INDEPENDENT,   DEPENDENT,       DEPENDENT
##VAR_FORM=  AFFN,          ASDF,            ASDF
##VAR_DIM=   32768,         32768,           32768
##UNITS=     HZ,            ARBITRARY UNITS, ARBITRARY UNITS
##FACTOR=    0.157963299565203, 1,           1
##FIRST=     4132.6476996994, 0,             0
##LAST=      -1043.33573715361, 0,           0
##MIN=       -1043.33573715361, -250876,     0
##MAX=       4132.6476996994, 529287913,     0
$$ Real data points
##PAGE= N=1
##DATA TABLE= (X++(R..R)), XYDATA
$$ [...]
20014 -33799 -31482 -15493 12115 45819 76403 50835 -8720 -27014 -36122 -47272 -101921 -55110
20002 -55110 -59745 -85544 17081 -38506 -19630 23554 7037 -51033 -21265 96687 61417
19991 61417 -4567 -50827 -63658 -100054 -56165 -67639 -14384 64261 35437 -35418 -73377 -80458
19979 -80458 -129006 -62898 -66578 -90039 -52366 20125 6546 -14459 -8437 -21881 34556 88990
19967 88990 100516 67893 72704 58028 22487 20617 64087 79394 67221 125192 136259 51367
19955 51367 34393 70358 67023 45611 59926 56335 28754 -8187 -9930 -18002 482 -27136
19943 -27136 -39219 -35803 -11036 55275 129487 170835 138287 97957 46185 15615 -48682 -13815
19931 -13815 7982 -1186 -31485 -45488 -170229 -187386 -134293 -117969 -66373 -8676 101117
19920 101117 126908 94365 -4293 -14603 55717 57599 15409 26503 108935 152425 55249 -77672
19908 -77672 -55948 -37853 10200 43463 22228 -7536 15608 5747 695 -11781 -111922 -98612
19896 -98612 -6937 5870 -17677 -59447 -65267 -30840 -7690 14239 414 17185 29856 53998
19884 53998 88017 47388 54631 18567 40238 29514 13661 3833 27441 55107 46806 72020
19872 72020 66609 48342 53159 43869 54696 39517 -3726 -36290 -66623 -55157 -42783 -76808
19860 -76808 -28584 62832 52897 -9442 -77441 -95437 -121150 -112181 -60594 14737 124513 156788
19848 156788 100780 112007 93096 93370 97886 39570 -31553 -104128 -188811 -121613 10551 43479
19836 43479 46167 59839 86673 88155 80257 69104 60570 -2424 7793 108183 108260 44816 22246
19823 22246 -9839 -17331 -42249 -26442 -7153 14286 58647 15831 -6911 -59224 -99259 -18269
19811 -18269 24506 28757 -17239 -10322 -23433 -71232 -101630 -97500 -131688 -121233 -83734 -80510
19799 -80510 -93541 -56111 15471 58894 48125 2535 -61950 -14822 -31502 -50832 -63577 -106532
19787 -106532 -74700 -95506 -116771 -68096 -28463 -55935 -43864 -22672 -43178 -65000 -70314 -45107
19775 -45107 74581 129624 98487 73830 6877 -81025 -45999 1854 7194 46920 103663 80413
19763 80413 44034 56159 51800 31136 45293 72747 79046 99646 40295 -48722 -46249 55743
19751 55743 -3520 -14656 -32725 -49013 -96271 -67060 -24421 62238 96982 77387 101395 31781
19739 31781 66492 136070 100303 -14930 -53602 -56554 -4407 -520 515 33547 -11560 -16253
19727 -16253 -46967 -57426 -34820 5393 3527 19379 10395 23098 6625 -26244 -29450 -18835
19715 -18835 -96268 -83197 -23339 -14859 -52789 -1934 -35589 -92877 -46233 14596 -13845 -33697
19703 -33697 -45801 -617 -32948 -106171 -119310 -72923 -36377 -1638 18962 6460 -26658 -6169
19691 -6169 72799 102988 7847 -21952 31412 92954 96927 109289 24778 -13043 8517 43817
19679 43817 96464 91638 19107 -2752 -35970 18551 1372 -71236 11567 97729 99489 -3993
19667 -3993 -34819 -860 -88559 -103758 -98167 -93241 -48555 -41564 -53513 -73599 -63840 -67690 -96
19654 -96 -5014 -5838 29202 21298 12013 32679 18029 37292 54376 15945 6689 -14669 -92124
19641 -92124 -64560 11586 -11330 45844 43570 -9389 32445 114507 120573 56477 27108 22128
19629 22128 38708 70814 77034 73445 117042 95469 37280 530 -48673 -53094 -28398 -43501
19617 -43501 -84950 -34959 -17501 -60369 -58226 -78273 -114529 -99221 -36095 -6192 -15211 -44754
19605 -44754 -9176 17677 -43834 -85022 -90355 -78913 -55245 -86762 -182965 -148351 -33457 -4899
19593 -4899 -40477 -91652 -49338 17229 91020 97316 38415 -37531 -95596 -81748 -100393 -93064
19581 -93064 15727 74285 42226 73848 132378 67941 -36196 24025 58420 51836 23103
19570 23103 68231 45981 22195 43827 84226 66456 52277 50107 25236 -35399 -103029 -55228
19558 -55228 1881 30599 6156 22492 5433 -23873 -29885 1359 32537 -2293 20663 123207
19546 123207 123534 110224 57504 -14608 -44034 -49308 -11449 -43878 -39202 -16997 -39288 -22210
19534 -22210 35625 23017 -57801 -25462 -17450 -33694 -20323 -15721 3457 25604 3883 -25732
19522 -25732 -65501 -21615 -7253 22137 10059 20207 -13822 -42765 -147614 -191449 -82179
19511 -82179 -35105 -60691 -66887 26596 59579 37657 21927 13064 20626 -8456 -14048 -89583
19499 -89583 -120055 -66649 3400 25438 8952 -514 32895 19674 25693 53863 60838 119679
19487 119679 39357 -53879 -70056 -67568 -42737 24356 57538 59223 62824 136079 86227 19980
19475 19980 80277 80630 51498 62419 62258 104369 110127 106654 55299 6325 24784 -4333 -33248
19462 -33248 -24072 13950 14395 -4780 -5953 79758 63574 1313 2812 66142 67705 68914 85992
19449 85992 110674 79055 32758 -5034 14789 18625 56235 103853 125217 121739 26991 -20246
19437 -20246 -33635 8482 1195 42454 44285 75603 41873 -42741 -50310 -52956 7871 84882
19425 84882 49035 -4769 -9752 1526 8387 67599 74867 52681 53956 20034 33674 -9661
19413 -9661 -93954 -75423 -58958 -53078 -34306 41125 -7053 -46308 16891 48785 68281 39970
19401 39970 -15735 -35170 12767 -22616 -21090 58255 126646 70553 17495 36041 76516 38552
19389 38552 -40310 -68605 -76427 -45057 -981 12340 77106 109517 72400 28431 48343 64191
19377 64191 73675 107436 70448 51383 80615 45073 52504 24849 19746 56912 114709 156714
19365 156714 111948 71740 2255 38771 70109 99924 158836 186429 185049 187835 197918 299962
19353 299962 289253 189796 158790 191149 141709 145891 109506 78107 154367 202969 312837
19342 312837 399959 454145 479014 434868 435981 376259 311313 224446 137117 142875 158738 133131
19330 133131 129020 216286 318615 358787 388808 366193 300991 285555 221006 198267 215272
19319 215272 194479 128323 137928 146204 141956 139432 71886 104724 134450 97207 110500 108900
19307 108900 106772 131388 166056 99991 123534 154581 144740 165664 136301 160321 252894 258396
19295 258396 291121 256839 210548 148675 158888 226639 217772 163785 156224 220969 203027 132030
19283 132030 71019 36079 8583 69347 188224 223378 163855 131026 134775 143518 159044 146414
19271 146414 152279 116401 94523 64206 55377 86240 32769 -19240 62092 52861 9764 -19370
19259 -19370 -29810 -36895 -56979 19576 82786 103001 112131 156458 134668 167856 145518 87795
19247 87795 67309 -12553 -54332 -27587 15101 35166 89710 121734 146129 168865 181481 159781
19235 159781 141189 143399 106982 73858 92917 143348 181786 230784 281315 211684 198122 211856
19223 211856 248820 244181 200636 138448 150017 120119 85799 149013 191266 133471 111423 63666
19211 63666 19098 273 -15260 63282 140565 162283 163339 140024 74767 620 -19155 -38416
19199 -38416 -2517 8033 28048 39430 93535 61141 121640 207683 223652 186373 160628 127472
19187 127472 69679 -18020 6141 64378 139701 118234 50838 55232 37977 -97196 -115711
19176 -115711 -63153 -34369 -9769 -4140 23440 21110 62021 155935 143490 67427 22946 49721
19164 49721 3900 4854 -28727 -90589 -66205 -20787 78276 71416 63816 126657 87798 59717
19152 59717 72283 114858 106887 84987 74298 93494 74933 44974 78978 80462 49222 39822
19140 39822 -29301 -52010 -56617 -35564 44271 -21189 -78339 -55968 19479 46164 12032 -27322
19128 -27322 -61952 -43061 -8820 -5024 17510 29033 77011 39724 12636 89882 111911 114070
19116 114070 133099 117906 86502 39295 -22755 -61956 122 1664 -30984 -86789 -77440 -33778
19104 -33778 21719 25377 19770 8500 48737 55279 83701 79722 65858 66164 94574 149137 163189
19091 163189 172211 167350 159331 133977 74248 43934 6303 13123 64885 113331 126219 174031
19079 174031 99005 4009 46951 127579 170259 149173 89413 494 -21140 15379 -12790
19068 -12790 -57657 41741 88683 118807 107238 141560 157815 226978 187598 126248 121596 139949
19056 139949 120846 120200 154654 93350 41604 8070 51278 107782 83579 70856 98726 105808
19044 105808 144675 168101 155738 130742 87949 83734 115914 75355 87009 82500 160541 193170
19032 193170 167813 73091 46665 35519 88789 205734 178253 109708 117443 198993 193389 128000
19020 128000 161751 123689 52060 51951 2357 76368 125159 85324 125555 148837 147264 131509
19008 131509 124714 138682 110940 81183 56170 49160 63098 57277 63307 46353 77915 50654
18996 50654 26130 17035 48547 53946 108252 94096 115012 105519 108980 130050 155696 153895 103138
18983 103138 97159 168794 232107 209755 218844 177874 94172 78568 21171 -6485 -14397 36193
18971 36193 74401 79489 8069 57748 98136 77106 61228 64202 93762 144001 216467 260557
18959 260557 261008 202335 132586 42909 22263 57193 94949 99109 101159 119703 210954 231361
18947 231361 224976 217029 257938 335883 308447 349179 391074 375010 382446 413968 395266 354505
18935 354505 241993 198840 245095 272679 303915 399697 440076 418942 333552 285572 295274
18924 295274 337176 318415 301152 330159 318557 354410 369819 313617 258004 280387 308496
18913 308496 278994 263211 264248 338620 397668 381412 316088 346030 326577 338367 370989 371004
18901 371004 353897 355967 372697 421491 517069 532838 537345 520845 500034 490659 501729 577278
18889 577278 550649 486798 494664 550843 635658 628773 564457 556099 526947 514198 546012 552628
18877 552628 530764 464080 481818 512199 505130 551662 572239 553606 669655 753611 777412
18866 777412 877684 927244 923013 999653 975123 1025573 1183410 1277021 1437903 1627994 1845017
18855 1845017 2042771 2318734 2588986 2794560 3240098 3783020 4427703 5277426 6530450
18846 6530450 8622009 11715650 15988189 21186322 26875736 32071085 35571693 36434124
18838 36434124 34785432 31231347 27170115 23776690 21958452 21969294 24103755 28516448
18830 28516448 35406387 44526245 54830945 64702762 72222614 75874558 75004815 69842612
18822 69842612 61687159 52470244 43975311 37125213 32644580 30468510 30504556 32807778
18814 32807778 37282083 43123684 49163927 53926061 55843179 54052968 49132608 42341071
18806 42341071 35154530 28767817 23931989 20608611 18296322 16548608 15324450 14398674
18798 14398674 13628579 12976657 12352433 11809095 11243776 10765899 10278469 9826417 9427312
18789 9427312 9017381 8635440 8341454 8021405 7724650 7455199 7194477 6955307 6811519
18780 6811519 6663737 6554979 6397628 6292489 6178986 6045341 5955618 5866872 5763234 5735151
18770 5735151 5747017 5772000 5863468 6059241 6175702 6321152 6314451 6482482 6928382 7597646
18760 7597646 8682355 10385765 13259709 17659061 22960233 27795084 31057174 32159594
18752 32159594 31562179 31658159 33401281 35172476 35433772 33264401 29019419 25134941 23677917
18743 23677917 24632077 26664020 28513489 29194895 28429606 27227627 27043875 27695957 27922195
18734 27922195 26748180 23603573 19343119 15820729 13560715 12037739 11057855 10346805
18726 10346805 9727009 9225392 8863472 8597727 8301349 8025333 7814599 7637785 7578937
18717 7578937 7532574 7481972 7516485 7705773 7915511 8201938 8732138 9580410 11007778 13398458
18707 13398458 17338423 22999510 29475491 34873991 37998329 38332263 37142910 37444647
18699 37444647 39355172 40888360 40439895 37178575 32469478 29296293 29251688 31886936
18691 31886936 35208400 37605990 38275608 36821012 35174120 35168137 35930153 35670834 33300240
18682 33300240 28469201 22849149 18519639 15732814 13910428 12605438 11675311 10883139
18674 10883139 10238363 9693050 9179970 8759496 8356858 7915570 7520139 7226539 6951502
18665 6951502 6672165 6419953 6183031 5945821 5736790 5573331 5393114 5140593 4908838
18656 4908838 4759021 4620738 4483670 4402118 4250471 4039984 3881046 3789984 3691249 3577973
18646 3577973 3523026 3460763 3322602 3165338 3103761 3110958 3062890 2954561 2895790 2928366 2907469
18635 2907469 2790962 2659481 2608242 2613407 2554238 2427591 2391773 2396653 2402516 2319012 2254092
18624 2254092 2117509 2143359 2140046 2016031 1908238 1865657 1825938 1824628 1763952 1722069 1726594
18613 1726594 1697517 1660706 1657255 1628002 1558135 1496401 1473029 1421927 1344474 1297371 1300133 1271778
18601 1271778 1216211 1188402 1123170 1108912 1025084 971093 955519 996987 904332 918113 964831
18590 964831 935904 880131 835902 812142 821679 862463 854423 843083 797926 720864 704773 627302
18578 627302 671302 763198 831362 845143 838966 785976 795599 787968 731733 642594 621915 628741
18566 628741 765129 817061 795087 693600 606651 546369 468967 390853 361500 361907 414323
18555 414323 433140 406897 394545 316279 299281 327243 299130 345497 330677 333223 358778 405507
18543 405507 488476 504801 430529 348639 331048 353762 335745 368823 383800 411596 444231
18532 444231 465132 447790 430705 469114 468785 484770 481369 438137 417638 442623 477901 562803
18520 562803 602566 621103 601832 565804 534587 580056 584510 506367 470126 437883 418701 455075
18508 455075 482996 384483 321146 295972 265167 259615 220039 190105 221329 223548 240269 194059
18496 194059 225773 271617 299759 265418 255676 226315 243178 271885 281733 277406 348847 382706
18484 382706 402894 426775 476454 489110 435516 434078 456250 533413 521046 542407 612157 599220
18472 599220 522060 590638 704331 721288 650820 576558 531990 456258 386761 419001 437420
18461 437420 393679 395938 482477 511707 500541 546799 521115 473961 441974 413541 414747 472948
18449 472948 503860 433081 443007 407177 405793 397766 356355 318619 302146 317443 289827 248020
18437 248020 205175 211129 261679 328544 378339 391270 447027 444339 348618 245371 239817 260762
18425 260762 222615 235562 274897 302338 344652 305216 235128 212813 250104 257799 326646 357603
18413 357603 327465 288667 302789 346523 321041 311649 317092 338128 235945 168153 150184 166832
18401 166832 181221 112520 126672 207530 338350 309895 290482 314150 298953 278155 216000
18390 216000 235669 268739 263243 213178 223185 313167 363096 319583 268509 236176 225290 235166
18378 235166 208926 187792 203258 283431 343025 355630 382046 380763 382940 406597 434559 445269
18366 445269 525245 664111 755657 741419 772825 845235 943783 976254 941904 838583 796089
18355 796089 787145 747520 628795 605699 622923 628163 636943 695657 774101 883692 1010470
18344 1010470 1105024 1228438 1384565 1642050 2099981 2569625 3126872 3983107 5385103
18335 5385103 7719145 11572616 17517359 25221959 33086402 39604382 41962542 39038791
18327 39038791 33154459 25469957 18401930 13818272 11060313 9298201 8129960 7379827
18319 7379827 6775215 6259581 5907758 5490154 5175308 5022774 4944310 4824340 4721098 4674423
18309 4674423 4632465 4606363 4611964 4535603 4448954 4329667 4280252 4248132 4117211 3938353 3872051
18298 3872051 3912153 3925967 3934404 3939458 4042391 4182739 4331398 4606337 4998178 5516704
18288 5516704 6191558 7110106 8476462 10556170 13812251 19127210 27366701 38693446
18280 38693446 52799975 67286480 78028803 83084138 80153964 69401341 56183047
18273 56183047 42812961 31899664 24835348 20394229 17398285 15370548 13862241 12664281
18265 12664281 11750321 10956630 10347802 9842707 9392154 9004001 8659032 8346062 8051234
18256 8051234 7735269 7508130 7250543 7019377 6787528 6648726 6566886 6450844 6392008 6335261
18246 6335261 6154914 6015676 5887788 5722645 5637511 5596931 5522574 5481569 5625136 5939897
18236 5939897 6326927 6817802 7587413 8848108 10854192 14078438 19316786 26973629 35686889
18227 35686889 43868173 49174069 48551888 43263562 35595094 26733823 19771308 15513032
18219 15513032 12920034 11205377 10039814 9096171 8373191 7862947 7391055 7046774 6734952
18210 6734952 6370914 6091227 5923592 5756957 5616102 5438205 5191517 5009090 4864459
18201 4864459 4694715 4519583 4424401 4381362 4352442 4245731 4148727 3990269 3977269 3916573
18191 3916573 3730855 3421980 3228755 3102897 3019274 2997660 2871569 2770212 2770811 2599049
18181 2599049 2400584 2333735 2279477 2217003 2138869 2175005 2209500 2093356 1988189 1904932 1862031
18170 1862031 1867226 1941749 1870505 1686399 1616321 1603178 1533617 1508166 1531252 1558151 1527789
18159 1527789 1531189 1470426 1405139 1483144 1601561 1603951 1617284 1541560 1457189 1441432 1404022
18148 1404022 1318587 1310953 1254015 1246434 1272843 1253937 1190755 1196725 1182942 1192422 1216645 1238933
18136 1238933 1273879 1353564 1354386 1407564 1462024 1437016 1312385 1256884 1298782 1339120 1428127
18125 1428127 1509368 1541253 1610259 1754534 2010210 2319366 2757923 3314731 3891772 4854932
18115 4854932 6290302 8657939 12864932 20873047 35828225 56479726 72824046 80964215
18107 80964215 77103891 55980633 34773855 23487665 17597502 14014547 11848965 10522227
18099 10522227 9523470 8683833 8040370 7465555 7009247 6605279 6260628 5973235 5713315
18090 5713315 5409209 5167896 5024478 4864356 4681088 4449223 4274831 4172376 3965864
18081 3965864 3829684 3710195 3638601 3473079 3335386 3244632 3123777 3056226 3033420 2978913
18071 2978913 2845123 2702643 2695080 2706631 2581179 2449391 2433805 2448264 2446966 2468709 2464698
18060 2464698 2369186 2230371 2166263 2076034 2025592 2025909 2077234 2114238 2060481 2059524 2111568 2128129
18048 2128129 2117921 2178422 2157002 2185584 2301003 2375897 2336898 2351499 2349406 2318864 2305273
18037 2305273 2423824 2681204 2855048 3054443 3332712 3653989 4124888 4817465 5554366
18028 5554366 6898900 9111424 12376646 16809779 22055443 27280342 31319501 33479693
18020 33479693 34069506 34234823 35013731 36155146 36575376 35114421 31778293 27556116 24029469
18011 24029469 22199213 22356260 24531834 28181555 32335839 35691741 37461328 37644466
18003 37644466 37200647 37164967 37574103 37483022 35796637 32120916 27094010 22152716 18299064
17994 18299064 15550231 13651669 12271059 11279452 10632548 10124517 9668143 9282569 8890352
17985 8890352 8532149 8305032 8147894 8017121 7914469 7866548 7886904 7961694 8222499 8716754
17975 8716754 9619086 11083329 13269677 16348201 19956264 23438195 25960667 27274074
17967 27274074 27526403 27382518 27589811 28019061 27918304 26677753 24170078 21198984 18886247
17958 18886247 17734071 18007572 19610328 22143059 25115920 27555446 28722965 28646845
17950 28646845 28138928 27792200 27778860 27492394 26065507 23264035 19730358 16248060 13494421
17941 13494421 11533788 10178925 9243960 8527920 7996673 7606350 7324917 6968161 6652262
17932 6652262 6424539 6184624 5941972 5668278 5411933 5163562 4964869 4810793 4610799
17923 4610799 4450194 4288782 4181308 4059124 3854664 3735053 3649090 3540015 3434605 3311951
17913 3311951 3167823 3078785 3020515 2942116 2888203 2762535 2607199 2493201 2457647 2429735
17903 2429735 2389407 2317777 2299017 2297418 2205567 2185143 2134363 2084516 1989011 1907118 1886917
17892 1886917 1880889 1853780 1811564 1816993 1771475 1650884 1667118 1598002 1568445 1492894 1436764
17881 1436764 1433071 1425468 1387615 1358213 1302593 1199840 1181500 1157626 1121731 1095402 1088852 1011776
17869 1011776 949041 901881 866318 877483 883641 936490 985679 912666 852433 809882 796571
17858 796571 878497 914670 875660 904397 894024 789767 732139 731225 759939 725763 661892 577533
17846 577533 513966 529599 488090 504018 505797 552701 522360 496323 512641 549587 424780
17835 424780 315854 321570 363227 377247 369619 311619 274165 324231 331675 322574 370366 420039
17823 420039 363579 299679 300690 365358 331137 261102 251083 304252 297186 292514 299054 320292
17811 320292 395538 447202 420767 374806 403314 410260 443053 458498 456818 425467 404335 394983
17799 394983 335236 314476 304712 256484 243945 259598 278659 173350 102479 101961 111165 123583
17787 123583 114007 113185 54103 16804 125133 195010 175238 206016 256710 245922 185493 154312
17775 154312 114079 98786 41372 13235 19478 69183 124456 125938 127293 121201 97036 125472
17763 125472 116602 57961 118328 170627 195596 245201 318097 350484 371590 425857 454259 403619
17751 403619 360731 316824 241642 196359 202745 191533 98424 62944 51405 30117 58912 49771
17739 49771 61913 81870 35792 -4624 -414 16999 33038 45360 43296 94551 133729 106730
17727 106730 51360 17563 17091 23802 77287 63890 106618 72025 97405 140474 130426 143261
17715 143261 109414 152503 227074 241117 190432 163772 108591 77840 61371 13993 63903
17704 63903 124196 132727 161085 231786 257999 249476 220974 222500 161227 112618 109660 110748 104527
17691 104527 106356 75538 60374 65384 20061 -3835 17465 72373 158416 125948 21223 7022
17679 7022 -32365 35312 51286 19771 -39 -21888 1761 41327 43498 -3831 -20263 32709
17667 32709 149443 196661 157548 139160 78843 42428 112938 101076 86751 94173 107016 50914
17655 50914 16512 34923 99989 112709 102585 78522 65644 45643 2198 3531 8200 -7684
17643 -7684 -9021 -1151 -11689 -86864 -80320 -18724 29988 72492 30148 -47083 65194 117831
17631 117831 60988 44403 51921 150086 154279 75145 3465 46726 9943 -10165 -42192 -121917
17619 -121917 -55468 96459 83478 49090 76405 61348 82691 114097 28900 -15813 18891
17608 18891 50833 20567 -48038 -186915 -163168 -68215 -23709 -26716 -21899 5649 13848 3131
17596 3131 7880 -33505 6609 55385 21558 -39347 -58792 -92285 -68714 -26509 -23898 41901
17584 41901 18396 -11972 51252 123996 53006 1236 -3288 38054 95272 100734 49984 43273
17572 43273 71546 106879 79246 32479 10130 -4110 -16264 -8354 -18188 -20353 -17544 35096
17560 35096 33529 23149 -805 26388 56700 80023 75337 150559 137755 108607 126108 57968
17548 57968 34046 65153 99198 32961 -10264 -39964 -98459 -95410 -32720 85733 153177 117956
17536 117956 117285 83528 47501 38024 14650 -6977 -12031 -9113 -27957 -90992 4589 92573
17524 92573 129537 64992 86902 117338 102741 209246 208197 160052 147090 91880 115546 169530
17512 169530 157916 151032 101740 89620 78602 65649 121172 109564 90329 146297 159066 144241
17500 144241 195139 260252 243209 138106 89147 65892 37705 18132 88704 180184 182608
17489 182608 126100 29091 9644 -32837 -83312 -44743 -3863 3230 -21986 49007 49342 7512
17477 7512 39695 96151 75236 45693 58910 137237 145355 95151 115179 106693 167803 237797
17465 237797 181091 150206 178138 182480 160156 112726 67234 139388 94050 68798 113085 149027
17453 149027 189689 206571 213160 181432 199067 160156 174412 211911 296234 380511 484790
17442 484790 491802 469684 414002 275752 231297 222494 184382 108184 9166 -8795 42465 73369
17430 73369 72652 143458 108238 41504 59985 149856 151221 202514 185366 116437 124334 142707
17418 142707 182196 149810 73557 52027 79822 -15433 -28019 48043 90459 90733 28934 43689
17406 43689 80695 16875 -86496 -146543 -63219 29829 -1505 -29024 -23825 -33665 -59461 -28601
17394 -28601 46263 31395 -1705 11085 -16553 1283 49455 13484 10187 -29329 21894 68217
17382 68217 64752 71775 84538 105936 28567 -44878 -77399 -92119 -110911 -93202 -66894 -37297
17370 -37297 -29083 876 -28170 -49558 -47778 -22738 -34255 -73668 -58411 27783 66143 12900
17358 12900 -30547 -56962 -84106 -92780 -82320 -11544 40810 -38865 -45388 -37685 -106600 -132410
17346 -132410 -117738 -89243 -28020 25275 29467 -22945 -77202 -126695 -191517 -200515 -126328 -95329
17334 -95329 186 91035 79974 5626 -85438 -95560 -47144 32188 48750 23023 -2385 -17160
17322 -17160 -21933 -22614 13377 52732 5900 -116337 -144261 -81226 -129395 -102340 -46560 -95
17310 -95 5697 -53516 -60604 -76206 -60435 -10801 -12821 -33283 -44553 -88411 -79700 -38171 41998
17297 41998 43716 28139 -56917 -39386 -38366 -31235 -25113 -42116 -55147 -45281 -30782 50425 22671
17284 22671 -31230 -56790 -43857 -65813 -61069 23087 104463 116269 190210 165835 157033 46539
17272 46539 -47757 -84453 -53380 -44151 -56807 -109007 -66924 15250 -33287 -123439 -149011 -81250
17260 -81250 -2023 43421 48199 96302 96635 9281 -18139 45297 22382 33542 -4155 16075
17248 16075 13152 20146 -24849 -38617 -21022 -63483 -105990 -47344 -16390 -26832 8625 25040
17236 25040 -43871 -105081 -111536 -16408 14934 74811 90014 76615 10561 54163 21159 23913
17224 23913 63198 61825 34571 21816 34345 9023 -25859 -28397 -103461 -73930 -30054 -39792
17212 -39792 5963 42962 73739 59941 -13977 31694 77013 150385 166263 117003 129314 53661
17200 53661 -48309 -93829 -114808 -89117 -87765 -32160 -24882 -100568 -79877 12497 1622 -33581
17188 -33581 -67039 -84717 -118507 -132972 -173116 -87526 -45774 -79030 -97439 -71326 -2864 -14838
17176 -14838 -36538 -28447 -79007 -80670 39296 72013 92600 104426 108537 68292 -62690 -114433
17164 -114433 -55336 1829 44528 97703 58019 93703 164265 111076 43552 31103 17460
17153 17460 73613 58367 56596 53473 55133 -37571 -89129 -109219 -95870 -21387 -45263 -85783
17141 -85783 -14302 79202 120756 57332 -3504 15850 1427 49400 4211 -23585 26267 -13282
17129 -13282 -98607 -83917 -62087 -92193 -93440 -75713 -105619 -43257 51738 61574 82529 92789
17117 92789 77259 100972 75123 54948 11483 -10716 -65716 -100664 -131442 -60594 23228 550
17105 550 24636 -1445 -22538 -38767 -58643 -45142 -42489 -65783 -38756 16625 95702 137734
17093 137734 147843 174675 137561 130984 121256 36019 3963 2944 -15351 -60353 -111594 -102616
17081 -102616 -50399 7518 36420 70045 54347 47924 86842 -2262 -35924 -900 33243 -8078
17069 -8078 -35308 -25068 -19799 -29336 1771 76618 55984 51618 95331 107605 39618 -13389
17057 -13389 36563 2767 11628 29304 22540 63194 103238 36604 51151 55942 8889 13145
17045 13145 -16422 -70984 -106447 -93994 -9230 7550 48895 64472 69733 42462 54728 37443
17033 37443 19033 -5701 -11840 -221 -34804 -84218 -1205 95177 76973 117204 91741 35381
17021 35381 23917 -11959 -38513 -87290 -32466 -31599 26695 67515 70295 15115 -28984 -12804
17009 -12804 56397 -34746 -8791 26224 102643 128370 137744 128617 83262 97323 109340 73957
16997 73957 101294 141872 93670 -16255 -74069 -42846 3593 -18645 -80236 -55431 -67770
16986 -67770 -114305 -56688 -45500 -86831 -73070 -71072 -44648 -26106 67397 -350 -120492 -94119
16974 -94119 10534 36995 -14334 -9291 -33518 -27307 14713 13334 -31391 -92450 -90117 -87790
16962 -87790 7330 39875 41018 76457 87354 100787 103386 78744 58217 48341 26815 10411
16950 10411 14786 31908 28112 -35295 -58968 -25466 -40078 -16922 -32322 7854 -11180 -85530
16938 -85530 -47768 -22968 -24825 -11731 -7046 -34307 -42203 -73684 -11205 24763 42532 18708
16926 18708 14996 65156 77800 71271 15792 -100197 -86685 -57615 -20312 -39667 5127 -12433
16914 -12433 10182 35732 18234 27008 -899 32902 54298 14096 36021 101752 83257 86781
16902 86781 60764 66756 25152 -23334 -16964 2503 -19195 880 -24723 -42111 8988 59936
16890 59936 78231 103240 101881 78493 47642 14719 -39875 -2991 5392 10272 6684 54540
16878 54540 92382 79043 27045 16127 45382 40547 40154 62022 18231 -48728 -12479 34590
16866 34590 -14627 -71293 -92733 -111928 -66471 -93105 -60690 -76072 -115953 -105176 -70657 -98655
16854 -98655 -117529 -141165 -93248 4377 61525 108133 120077 2652 -50235 -61340 -59457 -59039
16842 -59039 -27136 -11857 -9370 -394 5243 23611 29366 36281 109100 31927 -13244 -11988 -5019
16829 -5019 -3756 -21246 -48146 -68591 -37773 -40760 -63812 19589 57141 119756 132984 107481
16817 107481 61685 -1656 -45315 -115686 -118766 -81934 -54877 -29649 -40651 1946 -23735 -49285
16805 -49285 4338 36195 93039 85890 11735 -42434 -105454 -93854 -32070 67522 -5127 -7446
16793 -7446 43117 55717 72426 8368 -86956 -83384 -135008 -140401 -81000 -79651 -138218 -49891
16781 -49891 50250 65866 14666 -37716 -40446 -34246 4281 46060 50490 95491 90144 30831
16769 30831 63471 81357 26322 -10139 -23225 19993 73773 49759 -63690 -62371 -69373 -58162
16757 -58162 -30601 -4916 32499 32902 8798 -14814 -67526 -102627 -120985 -75542 22519 109650
16745 109650 63058 -22447 -2166 33753 57371 42737 57421 89443 29146 -13319 -25374
16734 -25374 -16453 -20728 -47726 -16517 25922 8810 -28229 -4334 17182 7775 31336 78491
16722 78491 21893 -61410 -78367 -56391 -50931 -69788 -7952 22854 -20486 -114853 -80313 1964
16710 1964 37678 41130 98397 10674 -51736 -3511 -19298 -66246 -85321 -76911 -15819 -253
16698 -253 39752 82624 38192 113538 127898 34111 -36062 -105588 -83587 -43212 -38149 4833
16686 4833 -11837 15385 55087 54930 66130 70362 52247 98031 130508 163518 102847 43205
16674 43205 19209 -12014 -445 -59706 -14477 39888 -10202 -8188 -52174 -25830 -6141 54711
16662 54711 141713 150542 118996 133106 94336 57097 19603 8185 -44174 -66750 -124915 -88409
16650 -88409 -6069 28676 -9579 -5381 -13845 -48917 -64565 -97764 -98525 -108708 -74982 -68518 -44148
16637 -44148 -108898 -173694 -120447 -79756 -128983 -122130 -47634 87308 137217 119544 31562 -4458
16625 -4458 -3951 19441 -49499 -99960 -95886 -67582 -97474 -37134 -38566 -47185 -22911 13367 10304
16612 10304 4634 40029 111319 129944 96038 17337 -54612 -63035 -71585 10306 -35511 -91540
16600 -91540 -64401 12874 86747 127706 179553 191380 177208 128637 49629 26529 4094 -23991
16588 -23991 -77287 -112965 -46542 -17146 19258 85129 151965 198709 131026 14002 42288
16577 42288 66378 46240 670 -7826 38777 92913 122995 55359 16567 -39526 1357 24445
16565 24445 -36421 -28466 -42174 -97956 -91564 -25950 -14818 -8348 5559 39534 71599 51987
16553 51987 62375 61770 -712 -47314 -18869 -13637 -34090 -77319 -136337 -45615 11009 40295
16541 40295 71227 55656 100127 154615 115072 94471 10324 -9954 41055 30787 47136 54198
16529 54198 54564 51923 47783 77163 68293 25922 19573 27451 50522 -20226 -50677 -25739 -7672
16516 -7672 -19166 -45497 -117501 -100532 -115317 -51969 1791 47546 72457 69346 79859 84815
16504 84815 -11401 -114976 -125210 -151926 -133291 -118488 -38916 40167 29132 -34819 -74498
16493 -74498 -123937 -100665 4765 69011 38343 -7699 66756 86309 93047 130207 104150 82844
16481 82844 69212 13562 -65492 -44000 -11638 -45437 -81593 -67050 -50458 -64491 -20016 -63104
16469 -63104 -89174 -70629 -72579 10211 73051 43113 22341 210 14552 18501 54196 18512
16457 18512 -19069 55200 140433 62820 17074 -7193 388 -18024 -19399 2252 -15586 15548
16445 15548 -6977 -53873 -74991 -76835 -33047 -65203 -156200 -170123 -72838 -97887 -100725 -108208
16433 -108208 -72051 -82912 -27506 21016 33300 43394 28707 72982 72761 -25661 159 -48532
16421 -48532 -63214 -75689 -77859 -58110 -85857 -92956 -121283 -61733 22325 76538 90299 56315
16409 56315 50020 -15396 -30085 -41801 -54074 -22323 25567 99389 146949 133756 59250 -13620
16397 -13620 -29998 27246 69533 89822 75840 85476 73600 76159 67544 20630 9306 29412
16385 29412 42748 63948 4066 -9540 -13442 -19057 -33891 -74184 -122656 -51234 -6968 -17641
16373 -17641 -22379 18355 69761 34503 -1936 19804 8326 -26967 -114007 -103435 -50606 -42662
16361 -42662 56080 95767 47121 27238 5729 15604 -12281 10901 -26878 2976 -10607 -51724
16349 -51724 -28933 19312 16847 70116 124987 86415 81464 86965 77238 -3745 -37682 -12339
16337 -12339 1546 5648 -295 -77440 -68045 -35944 -30111 -5450 14390 -28279 -68347 -115201
16325 -115201 -125409 -74148 -10994 -10799 4925 3258 -41846 -24112 4432 -26143 -7276 37252
16313 37252 4979 15777 13130 -4923 -4760 14688 23638 29973 23168 -29814 -94932 -122324 -86971
16300 -86971 -67312 -26984 26005 79774 132525 136066 19302 3308 8634 40017 94439 70561
16288 70561 29356 3992 4088 36100 91588 118279 102080 109377 86833 48106 91827 92437 50954
16275 50954 -17551 -50031 -52490 145 14360 -47921 -89619 -67105 -30313 -51885 -25729 34519
16263 34519 72212 16033 -30369 -58456 689 54907 87951 76122 82352 104357 61833 21342
16251 21342 12966 37510 40650 -33846 -94717 -100077 -131287 -134677 -117070 -90450 -107563 -75080
16239 -75080 -58601 -52398 -35733 -27194 25341 51604 8808 -62838 -59752 -12942 91278 106233
16227 106233 50208 72037 53428 12342 26606 -13364 -64034 -90240 -40024 -104716 -174779
16216 -174779 -115727 -50120 -10419 -8626 5691 -4896 -67920 -77666 -68623 -51269 -41070 -13667
16204 -13667 4000 -4661 -69015 -48202 -3019 10919 -8920 71078 173721 163077 93546 -9304
16192 -9304 -49347 -15110 -15797 -34331 4641 40877 36928 62109 14986 -58903 -88710 -122483
16180 -122483 -122819 -39054 -6885 -30112 -87700 -65978 -96507 -179790 -163504 -62617 -29739 -47441
16168 -47441 -13137 4 53744 49864 -8203 -49988 -70671 -34718 -36169 -113743 -193063 -215643
16156 -215643 -159015 -118399 -31421 -31588 -28162 -22893 -10018 16333 23926 81352 28098 50465
16144 50465 53650 29721 41357 79892 28580 19549 -52647 -47628 -20999 -4431 26472 15602
16132 15602 19131 23062 40327 34261 11626 20935 30092 39577 74263 94514 41880 4814 -30406
16119 -30406 -72897 -4798 15438 30055 32710 -55677 -85222 -28614 -35474 -69246 -95039 -36802
16107 -36802 -55546 2592 32840 -53710 -35667 61483 17437 -56426 -26042 24190 -24037 -86955
16095 -86955 -48440 3553 12329 -13029 -24555 -110850 -77098 30690 55767 12194 25745 10777
16083 10777 -27334 -78975 -88025 -33691 28653 65175 55258 10761 -31059 41508 72487 -4998
16071 -4998 -32134 -37782 -9893 35004 60104 61013 75218 33273 -35761 -64835 -26914 -20984 -58806
16058 -58806 -106254 -90297 -71215 -90708 -20939 98939 113335 -16388 -68856 58315 77549
16047 77549 54205 48771 -12638 58943 90583 109571 107732 26152 -87704 -141235 -159080 -123077
16035 -123077 -74161 -55923 -61743 -56652 -56802 -99465 -67942 -59218 -33276 -37592 -52143 -70625 -134170
16022 -134170 -94323 -84004 -70445 -47161 50478 67471 36376 6383 59089 88772 103510
16011 103510 125718 170171 144434 37639 8147 -87547 -141178 -91034 -7538 -470 21054
16000 21054 43868 62535 33562 27768 35135 -11744 -1221 37502 55871 11593 -5144 -7462
15988 -7462 -44568 9613 16818 40194 92190 83068 97721 92091 7967 -56747 -49879 -66699 -64605
15975 -64605 -93122 -70002 55637 -2508 -82109 -93788 -3625 37988 52245 167302 257329
15964 257329 223461 79271 20435 33323 15813 40373 34082 24124 897 39249 23907 -8718
15952 -8718 -32842 -57315 -43954 -4513 98 5506 22889 7689 -27938 -67151 -58940 -9716
15940 -9716 42904 89235 54039 -25554 -14833 12594 -11834 -86001 -101341 -60585 -12287 -52798
15928 -52798 -70243 -54841 -39759 -49099 -38038 -5593 -9784 -50629 -55693 -59493 -58747 -1531 38609
15915 38609 49871 63143 131507 83307 66424 66923 84525 128116 131208 61442 34856 -14046
15903 -14046 -40012 15151 58640 84898 140865 108270 85849 38203 -43174 -11240 8155 22899
15891 22899 13061 -45470 -97786 -54509 34613 38239 18345 40248 69100 32917 -36752 5499
15879 5499 4153 -37139 -38091 487 -8303 -61506 -15835 53440 60640 88833 136495 46395 -5798
15866 -5798 -13858 -13969 -26383 -107 -2982 27781 936 5478 13075 16116 1228 51763 94332
15853 94332 47603 -8792 -111638 -122586 -131063 -80353 -14921 44416 100277 170704 170740 143902
15841 143902 73532 58327 88314 59968 -5184 -28149 -5602 31297 8329 44859 -52552
15830 -52552 -90004 -126306 -112217 -35417 100980 91151 30469 47322 20067 52086 73699 -17316
15818 -17316 -44732 -4616 13187 3256 46548 70944 41887 -76547 -80512 -68111 -92952 -145055
15806 -145055 -165398 -111567 -81355 -140475 -49738 65741 53834 6481 -15779 -35250 15820
15795 15820 16315 28321 20736 30874 78112 71702 38750 45014 68194 54930 34932 9112 66600
15782 66600 146300 105819 33217 76225 44156 5317 18091 77818 56315 902 -23292 -71087
15770 -71087 -53301 -32375 -27876 -34754 -36694 -1071 -28663 -99550 -113561 -55023 -38605 -110333
15758 -110333 -151337 -123368 -40068 73999 84601 91139 33586 31580 83754 95575 18044 -41963
15746 -41963 -9969 29155 64082 53034 86772 65670 25301 53653 42760 24292 18148 -18738
15734 -18738 -81732 -115791 -129023 -86053 -82419 -83367 -44172 -93465 -127930 -121800 -86086 -24811
15722 -24811 168 -14170 -17771 25287 31998 44539 4972 -23980 -4297 -10429 -11124 -21406 160
15709 160 71402 41351 -21968 37592 35166 -6530 12719 -38374 -4549 -16711 -67170 -93256
15697 -93256 -134584 -73856 -26117 -67535 -57472 2721 -11715 36426 9529 17393 7895 34569
15685 34569 -9490 -62428 -43093 -56443 -15388 -22989 -65416 -81922 -94002 -126938 -142294 -152271
15673 -152271 -152263 -108358 -63434 -64932 -6928 11215 31373 44905 57099 31207 -10000 426
15661 426 19084 68169 51604 683 20266 73577 133461 106209 15524 -49470 -23289 -47441
15649 -47441 -104472 -109382 -23300 14305 5843 23551 71676 44740 1427 46554 25543 -20829
15637 -20829 -8051 27689 73997 29856 21203 40181 4050 -26864 236 -16431 -80397 -127125
15625 -127125 -136680 -99217 -18027 13898 8955 10628 -14343 -15480 -2588 -26405 75840 93515
15613 93515 17831 -88 -22623 -20073 -9328 37211 31729 -49313 -65221 -92420 -28302 25417
15601 25417 33307 -70752 -97484 -52189 -81310 -130061 -81536 -45106 -91173 -67126 -33179 -64156
15589 -64156 -62187 -36734 5586 -30136 -47993 -38616 -65935 -62440 -65892 -56040 -62082 -132627 -179037
15576 -179037 -150470 -116486 -34642 4420 -11491 -68118 -116798 -104092 -9811 25650 59670
15565 59670 71702 21407 -31803 -14517 25245 62415 98244 76816 76117 82620 66160 26452
15553 26452 26776 -10956 -57561 -48856 11438 80043 29882 11213 -24405 55490 56127 38255 -23289
15540 -23289 -22643 454 -17955 -78564 -119081 -99146 -38779 -63330 -25020 -7198 -35445 -62715
15528 -62715 -73059 -13641 -44744 -106352 -42674 -18173 -22382 15995 -42493 1153 21548 51120
15516 51120 4474 -90328 -95838 -79352 -83979 -86782 -85950 -53661 -58310 -36389 22645 14904 -4666
15503 -4666 -7457 83238 81043 12759 -8644 -74529 -74679 -95533 -30146 34259 -19072 -8139 38228
15490 38228 -7192 -12581 -3247 7096 23457 46676 19985 -66831 -129696 -82769 18769 25580
15478 25580 22915 14920 -48366 -48815 -3164 15207 15370 6770 -64141 -104617 -95163 -13589 40970
15465 40970 -36418 -133321 -76897 -82515 -94104 -63559 38079 64065 -5809 -57143 -55610 8237
15453 8237 -10723 -86622 -96705 -48577 -75523 -77509 -87295 -76495 -49051 1055 -8030 20975
15441 20975 51661 37054 4116 -6666 6986 2931 40641 -58834 -38197 27644 67787 48483
15429 48483 3930 -20120 -39717 6409 64068 117919 101383 40315 -21895 -76285 -41523 18550
15417 18550 94938 84091 21967 11741 311 -23017 42053 19727 -9559 -64286 -52562 -4806
15405 -4806 -7125 -25310 -54822 -56717 -58610 -84266 -46898 -45923 -51155 -27635 -3783 26042 3037
15392 3037 -42064 -76861 -58055 -47616 -40352 -70242 11249 31119 -18050 -41305 -41834 -61786
15380 -61786 -14814 20458 61691 96294 1601 -68851 -113481 -77553 -61538 -88630 -76494 -71528
15368 -71528 -23460 31582 20864 -20406 -20598 -15967 -39876 -22994 49032 87323 -15061 -89230
15356 -89230 -65993 -8069 55348 -9790 -71914 -82794 -43718 -41769 -23255 -24668 -15471 34034
15344 34034 93707 65512 23721 40800 85708 58804 -11827 1840 804 9386 -18261 -64558
15332 -64558 -62743 -26834 -14834 -27747 -37494 13421 63915 95996 103183 7170 -32843 -19845
15320 -19845 14600 11279 14982 -18442 -31858 -43618 3614 -11165 -53965 -97821 -73629 -33910
15308 -33910 -8567 -26087 -58394 -17626 -5668 -51694 -113294 -171921 -200730 -162531 -63335 -37345
15296 -37345 -38285 -53421 -24615 44548 7294 -36708 -16888 -9471 66359 94928 68768 107463
15284 107463 168798 122637 64347 -6162 20733 49004 57562 21331 -6829 32444 108607 122380
15272 122380 64073 65701 85494 55509 36877 36413 74505 75748 -31239 -17454 -11035 -1175
15260 -1175 40798 63019 34260 54168 49982 9561 -31198 46052 126847 91893 -12197 -58160
15248 -58160 -58376 -34765 -7844 110929 112822 121219 133114 73061 37509 43891 38897 100961 88207
15235 88207 23788 -31823 -27675 -11213 -20350 -56150 -84477 -119581 -116769 -60686 -25268 -6081
15223 -6081 -32180 -23554 -62335 -53246 -25447 -6262 828 -46690 19488 21458 3280 33197 19401
15210 19401 -60588 -135963 -149850 -107935 -41524 57240 51510 31103 50769 67109 46126 38881
15198 38881 43715 46498 46289 83375 73347 24101 -33735 -100344 -113591 -57943 -25562 -40174
15186 -40174 -3214 42980 41964 12539 42841 102136 79143 7042 33133 85832 171724 160158
15174 160158 78125 55864 19010 -3260 -14966 -11786 -13865 -1747 26176 44989 80542 128553
15162 128553 145113 129884 72674 61423 151253 96105 45788 44752 59386 68472 78837 41810
15150 41810 -55718 -109734 -195579 -192510 -123140 -80542 -40396 -28110 -64049 -67824 -11821 -6796
15138 -6796 -5016 6182 -28343 -42622 -53890 -146715 -168006 -136523 -89442 -37523 -10075 -22339
15126 -22339 -35793 -21109 5945 7457 -22754 -34008 43112 47997 63363 55889 24151 32528
15114 32528 78573 72770 50407 6450 40930 7297 -80486 -113685 -152750 -164931 -94914 -66437
15102 -66437 -88281 -99530 -5127 64442 70045 35708 9469 -41714 -71693 -101696 -74753 -23365
15090 -23365 32163 34770 -27484 -23756 -17299 9847 38495 64296 -20677 -14428 4070 39295
15078 39295 121390 92833 120654 186739 109751 104228 66303 -33738 -37131 -9701 -14844 12061
15066 12061 70557 111392 52358 35668 34865 32628 -23854 -96771 -83319 -32331 -14366 17704
15054 17704 76016 115052 145847 141290 119187 -11224 -30486 38358 38936 30093 91609 109140
15042 109140 90947 41085 36679 40552 75861 13518 -58801 -29818 61558 100575 80940 17027
15030 17027 -55851 -84397 -85373 -34422 16664 65848 64445 54515 -3760 -37593 -53954 -76678
15018 -76678 -94167 -83230 -10229 14819 31828 52105 -21728 -43510 -38209 -50184 -58478 -111499
15006 -111499 -100858 -44742 36928 89995 80583 8138 -33433 -15823 -9820 24729 -14036 -54091
14994 -54091 -78904 -91188 -16395 -28681 -96764 -71558 -50532 -65405 -72885 -28713 15134 70908
14982 70908 75916 23785 -32899 -22902 -45935 -57462 14533 3148 -12880 -57032 -59106 -24862
14970 -24862 39358 40287 -34410 -107765 -64764 -18226 -46099 -40502 1009 30580 6138 -28907
14958 -28907 -65202 -49357 24009 87928 9456 -44442 -13483 4682 -13774 5074 2508 -87
14946 -87 -62614 -83709 -73184 -71692 356 44230 57481 5664 -26742 -22519 -70608 -83260 -14092
14933 -14092 21896 -12508 -31507 -45047 -105856 -129820 -100938 -61380 -39894 -56420 -41404 9082
14921 9082 23968 -40851 -86945 -33170 -30697 -25072 -51048 -47971 -44376 -37753 -29664 28119 82728
14908 82728 93851 30551 -4613 13925 66841 86686 5535 -105448 -124812 -53472 -65989
14897 -65989 -58905 -98593 -125244 -94876 -52420 -12340 28835 5073 -39316 -16367 18765 -11248
14885 -11248 -8563 38974 26537 -4332 652 -33861 -15731 -24838 -31914 37065 128849 140861
14873 140861 180193 140003 68776 24373 11392 7742 -23413 -57308 -68765 -60004 -31655 -31351
14861 -31351 -54826 -58111 -48304 -8632 48768 22156 -5119 -34970 -53407 -50041 -53582 -7236
14849 -7236 -13369 -49195 -54099 -30598 -7542 -46049 -76356 -51925 32221 60144 45140 48896
14837 48896 18320 9576 40966 7278 -17281 -1096 11295 -7032 31871 96444 104582 18481
14825 18481 6342 27886 -16444 -12621 3527 -14050 -12050 10378 -5197 -21334 12713 -3734
14813 -3734 12304 10990 10611 35559 102215 130504 100189 138232 90963 107829 71242 54887
14801 54887 10933 6491 24964 26606 9392 58289 46139 -18367 -41487 -8084 29140 77391
14789 77391 76149 29514 18041 -58682 -41163 -15823 -4339 -4661 -1056 2316 6911 39762 33432
14776 33432 -35184 -85578 -6374 36299 10916 52609 112824 93163 26556 -32677 -49777 -105848
14764 -105848 -114001 -103824 -17637 342 56029 55080 30883 97168 78687 2927 -1351 11963
14752 11963 -9502 33425 -2926 13343 87503 38285 40122 25826 8940 33199 102022 90034
14740 90034 22259 -18309 -8818 6061 35815 50539 -12270 -15827 -32868 -10742 26957 -7245
14728 -7245 -21699 26406 44944 22 1541 38775 39809 29761 13020 64069 109952 104865
14716 104865 57146 34023 -57532 -86152 -116002 -74093 -69906 -30987 -5726 -51519 -111012 -109573
14704 -109573 -107917 -36143 -58709 -125293 -105178 -86408 -19582 -73065 -48109 -50606 -70129 -21220
14692 -21220 27965 5878 13843 -17261 -72639 -41701 -6617 9978 45285 52615 48347 73762
14680 73762 1300 -60979 -113506 -85776 -40250 -25192 46401 88333 82215 61391 -32058 -64860
14668 -64860 -58586 -24010 -52456 -108643 -115330 -36443 -63871 -71705 -90791 -98517 -97453 -78694 -128111
14655 -128111 -27954 89672 93795 63048 72503 83626 102427 50030 -38641 -145905 -147881
14644 -147881 -185000 -226509 -151010 -123125 -75706 -42402 4906 -1371 42999 48787 -27025 31131
14632 31131 14232 -35202 -84047 -115681 -72680 -30389 39466 20006 26778 75750 20692 19321
14620 19321 123220 155932 15707 -128550 -146194 -130801 -76852 -8657 37348 44860 3632
14609 3632 -46532 -129399 -146027 -55233 -5438 106806 121036 101736 65144 45187 6973 -85798
14597 -85798 -88384 -15571 -16939 46934 65562 34873 -25269 -67309 -60792 1739 14672 102380
14585 102380 146736 152592 160021 76444 34329 57999 70524 8241 -55231 -33926 -9813 -23182
14573 -23182 19385 43086 27346 -45086 -22099 28821 41358 43918 46904 -26751 -14992 12180
14561 12180 -5204 21292 14900 25149 62 -12502 64330 97869 44173 339 -46581 -29545
14549 -29545 -602 70434 6289 -55842 -64171 -24879 16418 14333 22526 -59156 -153410 -174474
14537 -174474 -42359 -3670 -28975 -35907 -58008 -19968 25895 52653 71829 63843 103920 120094
14525 120094 120972 28316 -73559 -80990 -55821 404 49242 40877 11005 16404 -8450 -93244
14513 -93244 -75377 10314 24223 -21828 -72331 -13461 24043 22607 -47324 -51373 26086 81748
14501 81748 59591 79093 71112 -24952 -93350 -58654 21068 28992 -23959 9678 89635 115353
14489 115353 121215 162869 140167 138063 100144 53843 75120 76979 56300 70382 19340 -37785
14477 -37785 -80409 -96558 7827 100046 86787 79416 85457 35858 40988 106128 142180 144607
14465 144607 119766 97940 102069 129273 80641 59810 45084 85636 72637 20581 -3887 63902
14453 63902 151410 124523 69410 97967 145454 96415 28844 -14866 -45498 -35898 -9068 25088
14441 25088 69080 42427 10292 -26968 -55652 11333 21707 14775 39029 30721 81098 107783
14429 107783 39837 27261 11254 40705 65498 58938 73180 56021 34714 -18694 -12212 74891
14417 74891 103505 55972 -7292 25231 58915 43800 70973 46870 5852 -12527 -763 31041
14405 31041 57496 67535 45627 70727 116419 144608 123948 70178 63877 -5813 -111188 -73071
14393 -73071 2392 56079 61871 920 31652 68756 56047 27885 18545 5085 31547 74737
14381 74737 59593 26750 -11071 42046 3245 -19083 6776 46685 30121 -22462 -19014 10159
14369 10159 -27428 -57311 -44968 -1222 -43994 -27230 53158 40790 32467 22446 42937 98053
14357 98053 89528 29982 35276 87595 57902 -17291 -29684 -41136 -37103 37925 -13705 -21033
14345 -21033 35273 66704 58287 55734 -211 -23153 -40347 9248 67056 31441 -9997 -19109
14333 -19109 15805 26486 -12407 -92337 -105572 -54999 -63366 -30404 23578 -15933 -22373 -10952
14321 -10952 10551 -12599 -17010 18943 40224 -2064 44845 20355 -40892 -79716 -57623 -13329
14309 -13329 -2356 24085 -26134 -39421 54178 91570 91256 34553 -11922 50800 51545 -7693
14297 -7693 -57415 -28085 26736 -10770 -77428 -110001 -75043 -45834 -83444 -87977 -88609 -92898 -89102
14284 -89102 -45151 -11502 -41625 -98928 -190719 -194677 -183581 -140511 -86028 -39304 -20674 -36291
14272 -36291 -60015 -38738 49582 22803 -49093 -69450 -39345 3210 -15322 -24324 42108 68973
14260 68973 110779 94253 4364 2877 4610 -4063 -14367 1828 -4514 -5178 -20178 -16395 25864
14247 25864 47425 21808 70385 91047 71489 32773 -6296 -90344 -91012 -87440 -10118 58774
14235 58774 39221 42429 29856 58195 8981 -24215 -8037 -32355 -90820 -101505 -16085 14953
14223 14953 -5122 -11952 -36775 -91770 -114464 -52059 -17873 -26697 -326 33931 70970 71449
14211 71449 17121 -48993 -91749 -55032 -49989 37053 55479 -9035 -19434 34822 5017 -36686
14199 -36686 -2536 72778 39033 34797 -10328 31604 25792 16314 57337 -61567 -183486 -174517
14187 -174517 -127001 -169547 -180859 -118899 -89058 -58615 2772 3525 22944 66977 60437 158992
14175 158992 197653 116559 5824 -102277 -76881 17134 71685 55288 46583 22602 -7522
14164 -7522 -62674 -46167 -5393 -5120 -21471 -23404 43132 43999 -41920 -78297 -39911 -20522 -8968
14151 -8968 -11738 -283 -31130 -46018 -67767 -98265 10966 84519 59383 4215 -14460 3901
14139 3901 -3902 -96586 -136067 -68616 -89947 -92568 -66757 -53405 -26567 4132 66016 95967
14127 95967 85334 119625 98115 12122 -39983 15719 39040 41064 6142 -49075 -19994 -16801
14115 -16801 -20286 -26739 -9900 29921 32075 19231 29287 8535 28251 75637 61178 27620
14103 27620 38242 84010 104135 68783 -9121 -68792 -44489 -25110 -19174 -76751 -137440 -116644
14091 -116644 -90264 -54052 -63659 -41529 534 -30020 -30696 -21278 -67709 -108798 -95809 -84632
14079 -84632 6353 53538 68410 65549 115545 120872 71457 47950 25894 10751 42064 26144
14067 26144 25610 45090 54264 64754 26745 -5246 11154 34211 56495 46928 41398 2020 -49809
14054 -49809 -53217 -6971 1869 -990 46474 86905 94696 82780 -12913 -52238 -1332 53904
14042 53904 107639 176300 197953 185556 137897 64360 38630 52128 33763 -18846 5390 -16211
14030 -16211 -32423 -40084 -82962 -88784 -81474 -75906 -93994 -79834 -72959 -84994 6382 30937 28703
14017 28703 77218 73740 -21546 216 -18252 -31177 -33275 -27315 -7562 5434 6882 -15631
14005 -15631 -51323 -71269 -92756 -145301 -87199 -23131 -20625 -42250 -103827 -90922 -15972 -3418
13993 -3418 -72833 -135964 -102360 -14567 38564 64954 74098 42565 34231 -6985 -50915 -11215
13981 -11215 -22114 -112136 -115416 -53337 -21520 85791 113666 92119 51681 78527 61337 -60065
13969 -60065 -53283 -16249 -44976 -117642 -63086 -44744 11163 31119 46805 62201 26183 -14656
13957 -14656 -20057 38220 119642 77564 50619 3303 -55401 -38577 83008 103107 82654 143326
13945 143326 162170 122379 52923 -20537 -49291 -2744 -8721 6992 14380 -22602 -108306 -49291
13933 -49291 31710 -5858 -47673 -32443 6651 60560 35109 29940 11871 -36989 -22652 -31283
13921 -31283 -54261 -49441 33407 42819 34211 89820 56528 21097 52793 85977 56743 47562
13909 47562 33304 11662 -62020 -51838 -31327 -54759 34239 57036 22312 -56159 -73376 -35081
13897 -35081 9974 37668 -16824 -14823 -61196 -93410 -89354 -83103 -69624 -41388 -67046 -31005
13885 -31005 74793 7489 -16039 -1362 -38821 -27193 -61837 -42301 46243 59105 688
13874 688 -46587 -87797 -37631 34853 59040 7550 -50582 -31100 45000 101320 81837 99247
13862 99247 77896 61423 13017 -22046 -48640 -24869 -29855 -376 34607 3035 49337 57207
13850 57207 23578 10007 11914 76118 95610 163879 108470 -18636 -119493 -139166 -136477 -125018
13838 -125018 -34381 -12825 19225 -27755 -66853 -5382 53321 76068 44617 30360 13387
13827 13387 14633 97594 108663 69449 -657 21728 -42333 -81629 -23116 24993 -25696 -86488
13815 -86488 -48957 44345 85597 50508 34331 104344 102620 56247 33250 17500 45322 49436
13803 49436 34970 -1502 -40299 -12817 9800 5257 -12743 4082 16145 5349 34 -524
13791 -524 -23900 -102420 -112860 -102280 -37328 -21128 -32596 -70928 -121260 -129262 -87637 -86545
13779 -86545 -68168 -65690 -79303 -130768 -89631 -73977 -31458 -37658 -12600 -10230 -9552 -35025 33789
13766 33789 1786 -2906 -67754 -65345 -39518 -36402 31316 82890 40661 -31404 -32007 8114 15988
13753 15988 47016 68262 90148 3275 -7210 47524 94178 66077 -31783 4254 99342 73860
13741 73860 -12004 752 -39247 -51983 -46199 67123 85230 70526 42830 58790 50312 33986
13729 33986 37232 63052 30033 -21253 -79182 -164725 -137255 -38076 -35588 12007 32553 29386
13717 29386 45676 -5527 -44306 -53236 -72209 -28000 -81600 -55866 -38161 -68623 -45832 -37483
13705 -37483 14691 -14267 -9421 -41016 -61814 -37476 41255 80383 58133 48446 16302 60517
13693 60517 28345 -49932 -55932 -29055 -78444 -20107 102960 141244 160213 123520 126030 190306
13681 190306 168431 199155 140715 59676 -14707 -2609 63135 72920 61238 52402 52749 90802
13669 90802 115630 105005 47393 50457 14054 14524 21984 -30243 7633 -62221 -81468 -16402
13657 -16402 -18014 -193 13836 -45853 -31215 -12993 14066 23514 -1029 -77739 -91276 -34952
13645 -34952 7030 43394 50372 34426 -27804 458 8733 -13065 -52835 -87599 -145204 -107972
13633 -107972 -9299 50575 57886 6262 -10580 -50857 -45707 33456 12442 39314 -10278 -21726
13621 -21726 -15975 11711 -6389 -14478 19166 34521 43562 41312 62273 63604 22729 31471 32337
13608 32337 10959 -17465 -42876 -67777 -46175 -42194 -41839 -1746 -69560 -89037 -102645 -69513
13596 -69513 -92745 -23933 66752 109468 121801 151417 92586 42529 22197 -302 -66692 -102739
13584 -102739 -8553 40855 661 -67770 -72183 -28467 47696 29935 31987 63813 15077 -80678
13572 -80678 -24520 24246 -17596 -25740 -8994 4326 14631 51176 -240 15609 61449 36179
13560 36179 74648 75200 15673 -18529 9941 69954 19503 8518 115913 110651 39775 -17243
13548 -17243 -100295 -174896 -120319 -11396 -8235 -37826 -47039 -62537 -22484 54710 80261 23372
13536 23372 -5972 -20415 9483 48731 96147 94167 137861 100692 57971 30064 21050 45603
13524 45603 5711 -8133 74792 54871 -25823 -61652 -38662 -35828 -8184 23776 46167 72002
13512 72002 34715 -25350 -16891 -27459 -21160 11292 1645 48475 137779 94194 21056 -94832
13500 -94832 -46626 46209 45289 22416 9655 -28731 -66318 -77213 -58373 -48040 -12130 9038
13488 9038 24806 68250 55325 6837 -13072 -54355 -46596 -62405 -10935 -27180 4550 24289
13476 24289 59366 76207 937 -5894 16875 -17343 -61183 -77878 -81264 -32218 21816 6522
13464 6522 28770 33722 99736 50487 9674 15758 23474 29259 59873 84475 52533 -24619 -88723
13451 -88723 -49746 32377 32855 -23666 -46327 91679 166560 140101 33307 25777 -788 6171
13439 6171 43764 99760 110255 162594 162862 122295 87530 -16365 -36772 -21248 9334 63839
13427 63839 101694 33542 30326 79871 -18140 -108916 -86303 19455 92565 84666 -1973 -111577
13415 -111577 -68390 -1360 46146 -9947 -30631 -13157 21794 -44668 -90554 -93118 -110256 -134587
13403 -134587 -91645 -12369 12467 4683 -12473 -72857 -45591 68956 86695 100325 86259
13392 86259 12373 -79835 -56891 40653 58609 -4555 -37337 -18087 53141 2104 9470 15550
13380 15550 21662 -26197 47537 113712 130320 118425 35231 -30048 -13230 -16515 30531 -27689
13368 -27689 -89322 -29962 11766 11816 45561 105359 159293 140701 125119 43502 8243 64087
13356 64087 32927 -5432 -21108 12310 55515 23837 1543 -37468 -44836 -90570 -68003 -16234
13344 -16234 42566 54361 39271 45974 115546 133057 90441 47015 30376 280 -38105 -106305
13332 -106305 -196407 -182892 -111850 -125264 -82729 -77065 -123119 -179466 -197211 -130372 -61037 -74528
13320 -74528 -61581 5347 13625 -149 58147 98721 37047 13180 74458 96170 115546 83754
13308 83754 81804 84899 97934 43658 3370 -24356 -2430 -8512 3793 3568 26364 10696 19472
13295 19472 -53187 -85568 -115831 -104747 -79301 -140080 -211212 -110840 -70090 -29869 -37578 34606
13283 34606 78912 65421 37284 45719 56291 64276 16243 -30298 -56563 -45217 -49237 -102365
13271 -102365 -96853 -79769 -81700 -103774 13954 132567 90556 86382 103643 72311 79286 -2272
13259 -2272 5961 -9107 -21628 -20942 17852 82720 153458 142914 45497 -44095 -100832 -67961
13247 -67961 -56991 -88012 -47227 -26603 -40136 -84620 -62869 -1285 12363 -47723 -52112 -6758
13235 -6758 -20238 15318 36604 34613 38256 95340 51457 20977 15649 12673 -57393 -29346 -13386
13222 -13386 -18573 -65877 -99156 -8869 44163 62814 56456 100912 96759 10627 -49379 16012
13210 16012 24094 -6908 -2364 3771 -17931 -40499 -67785 -53865 23037 58039 67899 61498 25114
13197 25114 -49094 -47417 -14117 -17496 20295 78459 99048 158706 132924 102167 160875 230294
13185 230294 232963 187317 161317 138037 119007 42064 9635 -16182 20792 63771 36352 -8523
13173 -8523 -73101 -63223 -14291 23012 -5106 -20471 16532 -1917 48845 79888 114005 153749
13161 153749 133155 171631 197165 205139 156254 118849 117119 93686 108012 29492 5232 28093
13149 28093 759 50298 -5265 -104802 -96215 -35698 -43368 -26690 -27348 -73179 -52426 -60165 9503
13136 9503 -26800 -74888 -9235 77739 141872 151369 115958 103935 76843 22673 -9917 18123
13124 18123 28646 20930 -13475 26710 60116 40729 10337 -41084 -30362 5330 -22514 21232
13112 21232 43010 45143 78495 80960 114190 92094 -15186 24107 64874 48643 -27841 -30901
13100 -30901 -16490 -81748 -79081 -67340 2382 11468 -35126 -124476 -117257 -75308 -20804 30205
13088 30205 64812 29422 48438 70404 4266 -62923 -58987 -41217 -18704 22135 73749 125608
13076 125608 109700 68616 69062 15290 26493 29069 22461 21942 49063 69972 62880 64921 6885
13063 6885 74616 188100 197939 148761 111171 102527 43028 67855 60667 33785 4174 22215
13051 22215 -30684 -67261 -57023 -42672 -11293 -34574 -16485 -28354 -43041 -12796 -4291 -89519
13039 -89519 -112975 -75571 -64146 -35312 6807 9532 56303 68499 43021 55103 91494 146836
13027 146836 154589 123364 105888 85942 96195 132521 94131 83182 49545 76478 126336 54963
13015 54963 14524 10793 53574 85876 98678 58078 -65434 -84845 -87921 -51205 -65294 -51591
13003 -51591 31218 44104 9261 57148 193134 146419 127570 115235 92655 40847 21211
12992 21211 -28022 -50350 -1693 58565 1260 -11152 1792 -3637 -22836 -14983 79445 88809
12980 88809 24750 89936 147823 157430 23470 -26613 -10396 -48034 -63601 -49961 -103093 -113573
12968 -113573 -40737 54465 72085 35758 34554 -29047 -82893 21339 177793 169739 85170
12957 85170 56732 120889 114814 45331 120017 100017 58033 80768 121420 78114 81996 110051
12945 110051 68756 40523 -33157 -27650 2272 -87926 -99293 -91445 -30937 -88985 -78206 -28603
12933 -28603 23342 -8253 3332 -4365 -6077 -38318 -96346 -88169 1205 16246 33153 87909
12921 87909 114434 170961 143491 101334 59203 34317 49996 76945 48359 34933 11889 -38563
12909 -38563 -21465 72115 110419 100778 79294 19459 -10889 -19069 -59034 -80877 -60647 -43350
12897 -43350 -55830 -16495 24383 18431 -27373 -61140 -75998 -46835 15140 41424 66402 123026
12885 123026 91450 57279 87915 126046 60936 74441 104748 45480 -48041 -67241 -87597
12874 -87597 -27852 56527 47291 4338 -34784 13687 12124 57233 87812 107252 137814 108459
12862 108459 69289 127522 120497 94277 72621 69475 -18945 -37578 19105 41837 94559 47162
12850 47162 10156 61954 55965 75059 127073 136302 140986 143650 83371 83365 51652 3146 -8753
12837 -8753 2209 73089 110964 26421 -36827 10572 34634 -15586 -4880 7756 13025 19584
12825 19584 -69598 -64169 9958 56992 126208 130607 138113 114765 5261 -55440 -29318 51814
12813 51814 39720 8817 82606 84274 24052 604 -44489 -56449 11419 53077 29202 70900
12801 70900 113208 79443 72921 48288 -14865 -45438 -43492 -7856 60267 73822 17242 7698
12789 7698 -13897 28417 45243 76182 69102 63853 33096 71721 109561 102941 75175 30137
12777 30137 65483 99257 110294 40532 -23029 -43763 -56597 -31649 -102357 -148879 -105564 -89438
12765 -89438 -21619 52371 46543 -29877 5875 68071 22284 -16162 -64336 -59404 -3868 42719
12753 42719 103373 107973 99334 105392 125400 94954 46116 38835 72179 31953 43126 18949
12741 18949 -32256 -32828 17069 -4560 10482 32353 -9384 -18668 -34848 -48071 -26005 6602
12729 6602 7078 -2704 -1045 -36785 -11541 29632 17309 13983 78567 47178 -7342 23074 73394
12716 73394 92856 44900 43731 66383 -31341 -74402 -32736 -39870 -89544 -85111 -51691 -17928
12704 -17928 46945 58256 30002 -1390 55582 64079 39631 64073 79555 106014 88237 97358
12692 97358 78930 25418 -42748 -75748 -98247 -57350 41865 81703 44602 19019 65645 123943
12680 123943 52890 67010 100606 35636 20357 826 48359 114001 109611 92176 157245 181433
12668 181433 147510 115031 142944 203851 167607 118258 81581 18170 36971 -3850 -14007
12657 -14007 -7343 28002 30500 57818 55892 77945 113655 79489 39901 44818 50157 -11727 -19594
12644 -19594 -31802 32532 144815 152142 117736 61109 137029 92085 80203 25794 -2478 115562
12632 115562 191000 180001 142763 71157 63765 50467 56892 17138 8758 46277 48069 8131
12620 8131 54486 100244 25907 26516 41572 55304 46609 24161 -71439 29440 177649 162115
12608 162115 113419 98521 80739 93696 26476 46314 85423 68338 70098 24656 46961 18854
12596 18854 -21122 2737 54557 56366 66191 28605 19940 -65781 -57344 41877 181429 242726
12584 242726 184877 141494 174077 181297 153817 95772 135466 83897 69183 64481 36179 8314
12572 8314 -31221 -95319 -17708 70691 91254 118642 123794 75366 70479 81628 39708 84245
12560 84245 57107 15373 -24466 59102 36576 -43556 -40820 56196 45313 71055 56232 83323
12548 83323 49776 49364 48486 68768 56551 10984 30254 78065 59798 39286 58902 93010
12536 93010 74183 64880 59381 56823 50086 131772 179706 160967 137308 175226 136071 89487
12524 89487 95242 104294 113526 65716 37111 28803 16372 -931 10282 57974 15349 -38391
12512 -38391 14491 41380 40088 58988 84966 130932 196693 189871 173933 96513 87961 71726
12500 71726 113579 143775 119925 72238 32583 -8000 -6335 40549 74983 72609 47428 -5334
12488 -5334 19834 20209 61360 87396 114991 164392 112102 61587 59582 82305 120945 137234
12476 137234 112746 51698 53621 66226 93507 59498 33475 16581 42937 103768 75828 33503
12464 33503 27622 1269 89210 204997 229646 195057 232731 166255 149067 81739 47193 89806
12452 89806 178162 144735 102340 107855 130213 164905 193761 234854 202874 168328 185231 145150
12440 145150 160890 149176 143794 151827 155902 113519 48410 90730 136495 126271 174397 113757
12428 113757 73408 122620 150626 168702 108883 124856 176770 113514 58302 80005 80903 38892
12416 38892 9312 42966 31560 98898 117739 67522 66216 89528 135204 118747 117000 151780
12404 151780 199914 228476 194399 199180 199792 200009 225358 257698 271064 242096 245895 212774 183505
12391 183505 166676 133564 128330 130511 101835 89910 74160 116679 179681 201807 209981 208946
12379 208946 204297 215313 211530 202844 305776 309624 281382 297841 259929 205047 206642 197892
12367 197892 198854 198083 191260 207486 158775 75853 28493 65407 82412 21284 19423 -16703 -25490
12354 -25490 -33249 7835 41817 61038 138984 225209 203546 185958 177793 187099 151167 129934
12342 129934 143308 130517 101343 60286 126833 181028 139421 100778 80081 65930 127259
12331 127259 131646 147482 142187 95988 97246 101281 127284 125910 115349 111507 113495 123101 162441
12318 162441 168308 175068 195441 191266 134818 24981 30479 131392 156618 196519 235382 220618
12306 220618 218794 242279 229388 297560 365578 435606 464223 509766 593235 722925 796083
12295 796083 770142 751917 749886 739821 687248 626722 559593 487739 454995 468656 465448 394874
12283 394874 364385 398660 446587 517851 505941 529240 526144 597747 629512 565126 529418 482278
12271 482278 544036 689013 765102 795650 802518 790699 810038 874884 899216 884749 908651
12260 908651 881867 832338 755092 642883 645286 697641 706108 638820 672218 659936 625568 589638
12248 589638 602187 557581 586575 534614 430826 454823 476118 520566 534707 555939 545975
12237 545975 608533 690328 718139 714345 780643 841667 809093 735960 731238 715630 663894 601564
12225 601564 452395 442760 456312 455194 420968 333380 277451 253359 326133 374172 346015 345372
12213 345372 291414 282005 328851 234579 196406 141790 147311 134484 143878 202311 194084 241214
12201 241214 296569 302745 202435 174367 171149 190325 203828 183813 179333 176804 174029 152559
12189 152559 196162 238969 299610 304845 305596 307925 288552 252090 280250 295824 266451 193720
12177 193720 151813 110243 39072 61611 89984 129259 138215 193814 179941 164631 168904 210371
12165 210371 182886 109240 105285 110903 156806 170742 210125 232572 224728 215588 208970 221169
12153 221169 218346 240195 174374 61732 82798 133270 218385 190688 159921 168079 111760 122454
12141 122454 100533 106274 163259 230344 185471 200036 259889 288163 321653 240844 149177 131066
12129 131066 157781 186068 217131 232102 216397 210992 303148 313998 250489 290070 281010 281125
12117 281125 270462 304331 300304 298032 266556 201373 206105 272171 327438 323107 315614 379626
12105 379626 467510 455239 422448 364900 329447 355015 328922 310557 280577 242728 270766
12094 270766 227291 166503 157576 231258 306422 325043 335404 361544 414085 477813 463024 446420
12082 446420 440346 375836 349442 417475 440096 424853 436006 390248 352907 330563 380550 379043
12070 379043 377995 421058 479613 413356 375607 465180 493060 527107 496400 443759 460157 424186
12058 424186 356442 367152 402841 442084 396735 357755 339049 369180 356266 334557 338414 330496
12046 330496 371466 520013 533714 514554 507938 515187 524466 572498 544572 504326 497149 492349
12034 492349 452819 416805 403474 424033 427986 424162 461728 486939 512064 492610 449123 471986
12022 471986 468036 388478 317359 325925 366654 412881 400430 431417 411890 453462 546073 594715
12010 594715 512533 469686 482968 550030 625169 631068 565577 489093 503026 530365 550918 566927
11998 566927 596477 575015 556440 594548 578724 559752 533276 545122 532464 636622 793351
11987 793351 806502 791823 829919 854897 816082 793505 795756 747409 743626 774560 815852 851695
11975 851695 813958 745016 701110 696170 738428 732868 711799 697596 719781 743626 819566 837149
11963 837149 737240 674869 645414 642868 749692 793432 765981 818056 831844 810530 885041
11952 885041 905204 883089 873142 838573 881793 905425 875549 877087 947531 967247 983830 1001721
11940 1001721 1010060 1000814 961308 1043664 1045505 1107971 1102396 1146157 1215339 1182137 1099398 1050316
11928 1050316 1068849 1124506 1135993 1145727 1283311 1341475 1307570 1337901 1422491 1480108 1486435
11917 1486435 1449381 1429310 1481509 1636359 1699325 1758312 1841443 1929481 2017111 1972163 1942357
11906 1942357 2020317 2153767 2211302 2275707 2408224 2570316 2689011 2886277 3058008 3138808
11896 3138808 3337220 3539943 3751174 4003367 4345856 4646731 4952275 5267394 5651751
11887 5651751 6185106 6892898 7698581 8660835 9857541 11304936 13011398 15027456 17652978
11878 17652978 20990548 25246453 30851150 38223494 47637842 59218311 72721831 86864773
11870 86864773 99825162 109231381 113235997 111209122 103965623 93671256 82642018 72446943
11862 72446943 64044783 57746041 53248990 50370579 48893990 48637912 49500411 51500177
11854 51500177 54540379 58531545 63232987 68360213 73521160 78457590 82924259 86848854
11846 86848854 90238716 93285962 96399577 100143590 104960974 111133541 118413820 126121389
11838 126121389 133232561 138228795 139952833 138011530 132935794 125830372 118269729 111431428
11830 111431428 106065414 102519377 100467055 99464332 98889637 98138748 96797688 94581113
11822 94581113 91395283 87516659 83203162 78699337 74335983 70458653 67360856 65252287
11814 65252287 64385104 64980520 67277665 71634355 78334262 87526782 99089556 112126718
11806 112126718 125155119 135954936 142192704 142326747 136137610 125042517 111469099
11799 111469099 97493783 84673011 73761619 64817170 57667972 52026671 47532529
11792 47532529 43860749 40803433 38181587 35935078 33972000 32176244 30564514 29016823
11784 29016823 27641936 26378085 25242093 24134559 23088640 22225235 21433360 20646660
11776 20646660 19890802 19234714 18596486 17987728 17417338 16863553 16297551 15781649 15255555
11767 15255555 14787583 14370565 14013108 13640027 13277336 12840225 12454123 12112909 11770602
11758 11770602 11456999 11221030 10992178 10625184 10338522 10128396 9859129 9532543 9272064
11749 9272064 9079349 8911797 8736185 8522647 8354766 8153229 7912750 7647623 7449905
11740 7449905 7332966 7183426 6976501 6736742 6561940 6442681 6194452 6024308 5919701
11731 5919701 5727880 5587673 5465376 5384474 5289537 5157010 4973079 4851102 4745063 4618850
11721 4618850 4503117 4351863 4241414 4176824 4025767 3925456 3914221 3907358 3853899 3729725
11711 3729725 3625670 3599584 3454884 3324535 3208389 3132257 3088747 3069479 2994817 2901471
11701 2901471 2835892 2800691 2812619 2809170 2727607 2657662 2592774 2518519 2441395 2414060 2446339
11690 2446339 2445687 2444654 2436861 2347572 2202001 2124468 2045851 1967804 1885475 1780086 1734181 1685068
11678 1685068 1664686 1650915 1584123 1482817 1409976 1368908 1298227 1239198 1232096 1261488 1214074
11667 1214074 1139972 1219053 1197853 1131831 993771 931277 914391 938535 890821 826213 753025
11656 753025 681858 686791 661489 658874 701326 717121 626437 525952 574558 604495 571271 593565
11644 593565 510755 421927 469057 487097 460709 476751 491655 509983 459188 452218 490203 494328
11632 494328 428095 432500 504171 498787 501061 531962 533416 522512 516360 467678 384908 397349
11620 397349 454174 472346 394145 322728 335260 352230 335972 307139 359236 305332 284766
11609 284766 284708 261343 220374 212185 317533 364427 326454 307145 253241 259938 230397 228479
11597 228479 329407 325119 313595 273072 252706 275424 281841 267235 296898 230329 299203 323876
11585 323876 294498 323688 244881 276332 316449 348840 397456 368979 301550 358575 337722
11574 337722 290551 314088 304912 304480 300558 208605 202889 182207 236162 212280 221830 245028 288941
11561 288941 337663 304209 276168 306020 336586 268604 180522 200969 224696 205030 156788
11550 156788 141915 161360 185399 200062 215829 218531 186926 123969 179510 214297 214847 164462
11538 164462 91058 75447 120580 105479 28947 58898 131682 157427 136037 88606 114511
11527 114511 131508 174273 178780 97658 94362 98339 97168 142613 94400 75841 92254 62100
11515 62100 7893 35219 86845 31021 26540 49983 79190 48888 -13240 9739 86547 54629
11503 54629 107260 190401 140214 109847 100331 60744 2530 14790 80881 125334 133227 162077
11491 162077 185305 251832 244070 193880 155699 147383 130776 137565 105210 101719 120714 138173
11479 138173 110113 146007 166245 202171 149695 147893 201898 209826 254330 281812 289949 230669
11467 230669 148573 218024 256382 241778 166119 104301 107355 101745 58940 127195 105801 146291
11455 146291 216614 221982 236612 267411 286193 276735 242339 191602 229206 332662 341358 288593
11443 288593 265661 390351 526690 537458 571547 622444 640481 703146 724341 740695 689876
11432 689876 655999 609295 597884 626564 634835 613722 548062 438268 463036 503300 504904 545190
11420 545190 537779 518823 512682 520513 547237 555496 584133 653990 670602 656398 664206 651344
11408 651344 673109 736531 788803 811677 831640 834567 836563 821191 715509 635587 662110 702789
11396 702789 738604 660611 611196 604761 625013 587692 534009 498521 521235 525286 582561 532975
11384 532975 513793 494293 465254 476535 492402 507993 578621 602698 590813 633421 737248
11373 737248 792680 834257 824666 840339 880582 848346 774086 708902 613432 489989 446358
11362 446358 439220 388399 321893 298188 323213 342542 352730 277326 238719 305593 331148 308892
11350 308892 257254 228169 298668 357555 284899 223348 190540 188992 185727 206695 154128 98411
11338 98411 150090 178499 198800 189191 190821 240042 278019 239725 231493 200396 151436 69995
11326 69995 43466 54741 61000 14034 22524 120733 248536 248130 166418 168004 176481 148941 120030
11313 120030 150458 180888 185509 159585 129468 130171 119189 116168 157067 188267 190341 190260 214128
11300 214128 241906 222659 184246 143387 100779 74797 29497 29164 86240 186362 204865 148583
11288 148583 85037 116719 164624 222798 200574 213714 202989 210135 199380 166934 70802 60607
11276 60607 142219 220299 179500 188093 197470 246961 259281 246568 286278 233284 181731 151663
11264 151663 138602 142692 111421 74604 100570 126843 99912 42015 1172 21075 90800 47218
11252 47218 15491 48323 49443 81692 125433 226670 266459 235028 199459 146393 143996 67285
11240 67285 86406 135817 146384 87535 162574 180132 139822 111186 203568 246523 339025 411496
11228 411496 404952 366307 329232 290990 274452 260210 261612 253649 211043 203475 130061 77517
11216 77517 84340 151301 214436 185376 204788 248345 298570 292760 240272 245652 195823 202342
11204 202342 210956 181268 161600 206340 339612 418467 393471 391537 420587 376150 316536 342083
11192 342083 332325 368305 391224 325144 263532 241605 286639 404326 493034 429968 342194
11181 342194 295421 307814 345292 353802 356118 367179 319126 305047 355144 381215 369729 351407
11169 351407 332983 345818 431508 504962 406338 385990 396448 412184 451666 514639 589368
11158 589368 580837 609788 715139 764370 818145 873736 882104 880371 788171 658769 569810 548912
11146 548912 563116 550065 496322 499914 508129 512411 535137 590319 641729 673366 661924 710330
11134 710330 710520 729933 751818 703801 664331 719976 726390 748582 757331 712641 651844 620081
11122 620081 703199 818155 904350 913264 889541 832390 746294 723442 738669 713391 717161 686677
11110 686677 603230 614311 582842 617697 626194 616279 602322 553716 590278 608162 552169 553223
11098 553223 574047 493716 458664 489594 523555 540534 570690 657621 699723 760768 807668
11087 807668 808125 833508 833785 730882 650822 567695 508662 468051 491567 521675 449316 382499
11075 382499 326219 317697 307351 274141 186669 206552 293663 317010 321625 310784 249647 297456
11063 297456 294398 284935 303490 318598 236553 221733 241762 255713 294368 314158 323010 298684
11051 298684 254281 222344 197841 253771 239413 248872 178053 149426 170243 250659 306422 262962
11039 262962 233632 215501 216416 270331 296756 298257 256016 278501 238383 254961 245829 224790
11027 224790 237832 289333 396558 363505 280796 272827 236473 248233 212881 230575 245683
11016 245683 230471 281561 341349 291032 239716 257604 220180 130200 84634 72664 96090
11005 96090 113994 179216 168284 211281 221886 172721 212427 207794 245935 270883 252287 287870
10993 287870 261529 211412 264843 359528 396299 386912 311768 282868 373366 428248 364202 357605
10981 357605 327463 318848 322225 332235 365846 318000 301857 353918 375938 306478 240140 315861
10969 315861 386637 444419 426100 405467 336141 320941 362603 398739 410585 348427 269801
10958 269801 242318 294961 372373 397830 399226 388656 370289 391862 435393 424043 366371 367614
10946 367614 394074 352966 369836 389388 419061 460896 461708 458296 468588 446991 387998 393020
10934 393020 411404 436739 518792 490271 466341 427047 389673 331808 329945 315846 378247 445423
10922 445423 553134 552676 492252 464544 482053 569722 590392 477075 505932 485957 442843
10911 442843 398555 403251 382666 387086 385648 394412 424419 403902 412208 396628 339691 458199
10899 458199 524416 526941 462769 443805 385073 376221 347768 380090 460491 545071 577464 512702
10887 512702 496815 521522 484591 517124 539069 470187 454047 455707 432589 408639 439917 469435
10875 469435 496327 484306 510634 508636 541424 592743 602088 568958 546057 541688 576701 633783
10863 633783 673617 747530 845823 839800 740439 743648 766640 753634 790473 782423 773145 783793
10851 783793 890927 959720 994699 1093179 1135530 1125007 1099085 1051178 1030867 1015263 1012424
10840 1012424 995527 949356 881291 840908 888856 943175 951722 927707 969398 982723 1003615
10829 1003615 1023298 1041509 1029622 1059341 1039709 1008957 958901 908720 946276 952674 943909 946789
10817 946789 1059543 1175794 1240249 1252007 1219569 1155729 1129432 1143525 1138075 1148174 1092245
10806 1092245 1129786 1154126 1189952 1212463 1183494 1165953 1197954 1218522 1227952 1302597 1421181
10795 1421181 1412068 1444521 1509735 1474240 1469682 1538608 1561634 1572137 1598578 1623076 1666488 1722143
10783 1722143 1776951 1786049 1866496 2023327 2181643 2326624 2501076 2745569 3088788 3623974
10773 3623974 4156367 4561055 4762793 4782053 4473059 4210321 3989215 3814066 3771616 3788040
10763 3788040 3899791 4090533 4252444 4437926 4692088 5015381 5407787 5759611 6259574
10754 6259574 7077508 8219297 9988129 12731845 15853475 18231761 19691683 19584048
10746 19584048 18054422 17653203 18736425 20922317 24157297 28621074 34593795 42382159
10738 42382159 52328803 64648630 79291648 95382743 110887147 122979207 129185447
10731 129185447 128240049 120582514 108673084 95533880 83303737 73050398 65295810
10724 65295810 59876663 56510748 54903627 54673146 55598947 57605962 60613811 64517893
10716 64517893 69214530 74337976 79272890 83379171 86092256 87345320 87628184 87867068
10708 87867068 88884668 91196768 95180255 101057978 108746895 117849658 127415128 136116068
10700 136116068 142370601 144997250 143499351 138443933 131133914 123210557 116103442 110586215
10692 110586215 106844186 104478944 102941762 101388616 98993951 95409370 90543038 84908295
10684 84908295 79181472 73856615 69324245 65618423 62787259 60836202 60013179 60343563
10676 60343563 62040642 65432733 70787573 78429515 88466639 100534521 113348323 124651261
10668 124651261 131792276 132802435 127212967 116362528 102988520 89662748 77866517
10661 77866517 67980099 59991762 53634225 48491375 44369128 40921564 38107638 35707543
10653 35707543 33668725 31937684 30356330 28878873 27561268 26368166 25191452 24050547
10645 24050547 23028303 22097017 21258959 20514050 19848501 19186528 18534579 17881784 17277691
10636 17277691 16680312 16113539 15640282 15131194 14605651 14150902 13747480 13371098 13010542
10627 13010542 12588092 12206857 11859401 11583510 11352818 11012039 10765657 10518522 10300139
10618 10300139 10028916 9701395 9346968 9126415 8910221 8675983 8467821 8357881 8216952
10609 8216952 8051497 7815310 7641004 7482842 7340409 7166873 6909638 6703679 6494024
10600 6494024 6283255 6136399 6007113 5900337 5704839 5512046 5393192 5275570 5247260 5124557
10590 5124557 5004892 4874839 4769907 4595745 4449949 4323667 4218862 4172605 4120874 4005312
10580 4005312 3958562 3934814 3889475 3757634 3645778 3551711 3428741 3317478 3260727 3189997
10570 3189997 3043308 2943591 2892728 2798760 2746995 2749161 2709914 2649504 2584970 2559666 2502994
10559 2502994 2454270 2381238 2371626 2437517 2462627 2404669 2426606 2365101 2288159 2220077 2165898
10548 2165898 2138517 2114653 2028060 1979270 1999900 1971606 1931316 1923211 1897264 1812442 1750628
10537 1750628 1726806 1698324 1660447 1625029 1540803 1453353 1361324 1221513 1208210 1200946 1183992
10526 1183992 1151560 1126327 1080132 969727 951232 964019 995024 975308 934511 952788 916144
10515 916144 905898 899791 898287 849697 780265 756214 793113 807289 732885 648782 605404 627648
10503 627648 654397 717793 799994 866712 903902 840487 777453 803024 871109 908901 891262
10492 891262 894698 977224 933618 944772 917087 940788 941634 948970 962632 1014982 966994 934706
10480 934706 908000 809731 602538 464074 359082 402729 550062 684129 708473 693353
10470 693353 598120 536833 523755 603610 709944 786821 868478 899989 898281 912679 983074
10459 983074 1028302 1015237 1081060 1097567 1104927 1050877 1025473 940361 976617 1026457 1023686 1019058
10447 1019058 1075480 1151388 1161508 1215039 1210271 1212337 1121496 1140256 1133898 1126774 1107084 998426
10435 998426 929506 1012219 1167091 1196455 1238757 1262532 1186317 1154484 1179227 1171265 1152442
10424 1152442 1184297 1275580 1289784 1283133 1346468 1373175 1420204 1411460 1391519 1357064 1339111 1334410
10412 1334410 1392064 1453114 1487695 1554958 1643668 1711395 1738950 1711047 1750577 1766395 1768344
10401 1768344 1853738 1969736 2106071 2253680 2339593 2392803 2454914 2531530 2690663 2808826
10391 2808826 2904057 3044057 3199398 3393529 3641510 3842291 4100870 4425172 4831494 5395261
10381 5395261 5882973 6325546 6796238 7305794 7848044 8497399 9233628 10264361 11617650
10372 11617650 13316714 15159182 16951171 18398912 19481840 20586799 22213725 24803278
10364 24803278 28475245 33354453 39951181 49063332 61933902 80944247 110427154 157553115
10356 157553115 231545408 333608217 439489648 512101110 529287913 475337765 368830004
10349 368830004 268071888 199022125 154955972 126211283 106837125 93269781 83211885
10342 83211885 75469003 69451632 64764704 61128316 58283022 56076484 54030458 51767400
10334 51767400 49289647 46433592 43394200 40539227 38117624 36139756 34423730 32886679
10326 32886679 31524138 30280246 29097941 27980165 26942584 25989131 25009802 24107080
10318 24107080 23318340 22605979 21906466 21160345 20448095 19742331 19155456 18622998 18124738
10309 18124738 17671132 17303366 16847593 16435531 16015098 15561280 15181561 14720384 14237260
10300 14237260 13687979 13167934 12778574 12492162 12252998 11977440 11707680 11452906 11104821
10291 11104821 10838312 10598892 10299797 9947150 9659245 9405701 9265799 9174496 9004362
10282 9004362 8835704 8685722 8538653 8291891 8062008 7856593 7657372 7415693 7248115
10273 7248115 7151477 6987499 6784557 6620083 6451656 6259486 6031419 5933219 5875706 5685602
10263 5685602 5424691 5216716 5035727 4889029 4746399 4669852 4616805 4597161 4510734 4400464
10253 4400464 4283259 4163337 4023528 3899043 3759758 3655254 3585100 3611826 3640000 3538408
10243 3538408 3507612 3447378 3409031 3366875 3286711 3283067 3259509 3240653 3135289 2987090 2933121
10232 2933121 2938734 2991428 2956882 2949704 2998074 3022742 2924784 2795515 2659147 2441577 2208548
10221 2208548 2023989 1946855 1975248 1975256 1940642 1853887 1770302 1623950 1540088 1526925 1539125 1566099
10209 1566099 1640879 1822151 1920028 1872594 1733461 1478851 1295319 1233685 1279217 1295366
10199 1295366 1226022 1122008 988447 948340 903300 880472 877412 794077 760625 667937 600214
10188 600214 528968 482281 451155 461212 509365 470267 512872 510262 421908 376163 432849 444743
10176 444743 423975 437027 460546 398296 321290 243393 240768 224600 185680 192214 155370 61014
10164 61014 78099 109415 128388 142901 117886 75636 33314 51241 82736 90901 84871 177211
10152 177211 246126 160044 154362 221481 244895 190647 142835 145122 137837 193794 224139 235239
10140 235239 211457 255898 305585 265621 199609 223080 256711 265847 262921 163341 127673 188236
10128 188236 229699 227250 136978 144700 173163 155002 168365 136026 158645 127878 163941 175403
10116 175403 140352 129010 123152 137032 181356 173730 150052 205188 220692 183545 191113 160245
10104 160245 157742 127503 170401 159516 133681 152100 147959 195220 213390 178871 196505 189792
10092 189792 164212 112907 95631 119026 158208 150991 125355 97069 67943 51964 83780 110176
10080 110176 160189 174596 170768 166828 59025 2122 73988 125444 122487 35743 -41815 -85606
10068 -85606 -54688 -1260 -24143 -95169 -83405 -50495 -67487 -104036 -64084 5267 41177 88286
10056 88286 28144 -12786 55218 30500 19371 -54182 -100892 -102126 -71853 2427 -10537 -20095
10044 -20095 14769 47408 58228 71174 112333 132524 187129 113004 114073 123769 125813 154010
10032 154010 95219 43690 7430 -64942 -33563 35171 41658 -298 32291 79681 54644 24241
10020 24241 -109047 -109049 -98847 -69982 -46926 -57438 -57711 -15111 -58488 -83141 -80611 -160803 -187739
10007 -187739 -182346 -186520 -135308 -46497 -32883 -76174 -20574 -8921 -44597 -20886 50425 117560
9995 117560 42103 42911 56849 12457 -39686 -71106 -70441 -63494 -78102 -63594 -54120 -47978 -40250
9982 -40250 9940 24042 23337 75894 119757 84579 62399 105988 94474 67554 25190 -22179
9970 -22179 -56306 -50811 -81922 -64933 -20628 57988 47287 -29067 -42539 -77324 4506 -13532
9958 -13532 -54041 -17754 8431 7948 1320 9383 -15483 -43161 -91400 -102567 -91708 -79522 -55118
9945 -55118 -37704 23813 55053 107605 112770 142170 125312 151533 231186 278135 333330 495523
9933 495523 685904 891862 1207681 1638973 2121759 2518339 2614146 2377054 1911860 1471808
9923 1471808 1153087 845998 721697 627428 548343 416943 333819 299697 303736 299910 270023
9912 270023 223386 230965 237672 249556 331107 289709 159598 73822 32543 1451 23118 -2289
9900 -2289 30359 47328 108671 188515 238456 187696 91864 41633 77319 128248 110707 88640
9888 88640 81783 83335 132370 152184 157593 90754 21021 -31492 -18334 -32046 -63259 -32597
9876 -32597 18214 21407 -35213 -72227 -50711 -21289 -52524 -54014 -70718 -62609 -79460 -131016
9864 -131016 -153674 -171652 -46912 6539 -6676 -17321 -33157 -37534 -98908 -58308 56028
9853 56028 103068 82278 60999 92386 115013 119011 112453 111489 71436 98687 57592 -42116 -141539
9840 -141539 -159057 -31801 -51006 -118510 -64940 -53959 -87734 -14414 53020 79342 61823
9829 61823 39833 47589 30861 23335 45945 89966 70076 19759 7920 34654 38392 17538
9817 17538 -6069 -6124 42885 85880 77665 50553 23137 -27260 -33758 -16319 28426 97563 98577
9804 98577 90524 34733 50053 62141 60141 30437 -22921 -22953 39910 60267 68908 49418 39777
9791 39777 66177 94516 67369 55318 88953 161140 187744 188555 254735 367161 440553 475605
9779 475605 432338 339961 274864 152107 59873 -5396 8366 57321 121477 116546 82707 17642
9767 17642 12583 -34237 -60926 13744 64675 69180 48051 -270 -93493 -63296 -86720 -99728
9755 -99728 -53972 7653 9355 15402 -19002 -50176 -67802 -40938 29564 10165 12460 68539
9743 68539 54617 19223 10211 28189 4687 8824 -32919 -33859 16283 72470 82319 95135 72398
9730 72398 23449 -8395 -74947 -31334 30153 85486 -33663 -81468 -77334 -29655 52719 7089
9718 7089 -54769 -86450 -105599 -96597 -37557 -27608 -54508 -120651 -119540 -118668 -82706 -37200 -12191
9705 -12191 -43257 7192 29222 19646 14332 16863 46630 9467 -29305 57115 124350 92563
9693 92563 14008 537 -42004 -56186 -46902 -2564 30453 61352 40803 -10322 -74567 -26254
9681 -26254 37570 41529 13077 5627 -68903 -85761 -13191 46508 -378 -3339 -4885 -17653 -39923
9668 -39923 -57744 -22093 -45853 -75679 -27197 -83376 -148272 -111858 -123405 -87302 -3060 -368
9656 -368 -71596 -106709 -119837 -136995 -92818 -83254 -52115 -92367 -102048 -33670 1917 9696 -16703
9643 -16703 17527 44831 54110 27763 30273 30791 39569 98385 58252 55488 60483 93231 47548
9630 47548 16415 10132 72524 94846 78031 34171 108233 116798 64506 4675 3229 28599
9618 28599 -41273 -39504 18500 28023 -14618 -9568 -41483 -87514 -30561 39130 91958 37314
9606 37314 -50689 -23481 -35829 -17002 -60276 -60614 -78362 -86269 2944 27482 57143 26124
9594 26124 -29551 -28447 8606 58935 107587 83082 118476 58275 42393 54759 90784 127768
9582 127768 54530 -23810 25912 26276 23056 1511 -34888 -74649 -114331 -47543 -35266 -10808
9570 -10808 52793 71516 42077 69194 46325 67761 88569 39710 53005 67114 19951 -80060
9558 -80060 -80861 -36551 23033 66779 81235 30261 -17501 36413 75029 89637 82338 8577
9546 8577 -38996 -57842 -13154 -395 -10626 -45198 -23561 33302 94323 127341 170449 148896
9534 148896 183487 170163 179922 152009 104664 149380 91182 40021 31951 13267 46434 51848
9522 51848 16713 -32113 9859 41178 110092 71458 53367 40081 8259 40005 26431 73684
9510 73684 59668 57807 67779 150879 178745 72473 13759 21062 2331 22543 14982 -5363
9498 -5363 35003 5499 10772 68756 63706 -31002 -464 22211 29046 16807 -87780 -109088
9486 -109088 -3965 15344 -8969 46221 84002 121978 44500 60041 134816 194024 185776 147940
9474 147940 76693 86413 117858 118929 100174 102823 111339 10585 33464 94805 76693 87339
9462 87339 97126 89236 83955 40273 92775 138164 161259 107728 -7069 67020 158227 225836
9450 225836 268459 237815 202159 245177 272582 227030 240189 289206 284600 293924 283236 263213
9438 263213 212240 130456 243335 304626 300735 263413 284941 332343 270433 239697 251761 224296
9426 224296 264611 326044 340579 348535 383162 407241 340094 316067 357988 387305 377675 337143
9414 337143 360221 401393 463582 453840 467866 500849 525873 542804 601269 619075 666884 619811
9402 619811 574211 615891 686597 666419 584970 596985 604919 616509 635021 644968 659208 776464
9390 776464 862312 924190 939158 918289 947231 1035295 1076218 1055266 1147898 1169615 1253698 1318669
9378 1318669 1448548 1569980 1638244 1707410 1814185 1893168 1936783 2077095 2264065 2451901
9368 2451901 2604426 2710041 2844258 3061976 3286602 3579322 3935818 4249126 4660480 5079791
9358 5079791 5383890 5789019 6249290 6844386 7539515 8188845 8820874 9548670 10310924 11084095
9348 11084095 11842763 12429603 12948884 13355765 13582329 13578931 13420672 13166240 12736257 12192111
9338 12192111 11663653 11027969 10413498 9826161 9272588 8657469 8156445 7698287 7234837
9329 7234837 6794682 6387334 6010752 5657510 5481124 5278320 5003008 4796816 4599904 4418089
9319 4418089 4225206 3992657 3741496 3572420 3431369 3325728 3221352 3081684 2915057 2752181
9309 2752181 2710881 2626107 2527576 2448192 2378912 2287952 2178592 2132919 2117038 1998475 1894282
9298 1894282 1868733 1801489 1799838 1800365 1753073 1693072 1619668 1551348 1561024 1491685 1400521 1332212
9286 1332212 1231428 1214228 1209463 1201295 1229136 1232988 1229959 1272079 1263441 1138748 1056700 1001890
9274 1001890 956973 954444 923651 862997 864562 878340 859667 831341 762356 755862 797120 759721
9262 759721 672143 660562 643576 670241 722458 627741 553332 517335 501793 557176 604876 570687
9250 570687 506514 545937 539995 534096 470192 453072 489278 510829 517885 448876 374313 394922
9238 394922 502942 510767 455435 411734 338257 323106 306660 302506 342607 389459 381117 365046
9226 365046 378827 383882 423020 434720 450589 435799 482911 518834 544442 482932 372652 354105
9214 354105 354515 270046 248125 190799 165882 204426 260220 251461 271460 213190 182940 183415 175351
9201 175351 217204 245528 165380 128328 181068 177617 180718 223285 304383 301861 255540 191353
9189 191353 191884 262432 287887 280129 253338 274439 226610 158427 93590 84635 110428 188431
9177 188431 199728 175649 142826 80582 51971 48528 13183 35920 3028 32913 59311 38808
9165 38808 5094 40877 84305 96423 54045 26014 15078 39783 83070 76659 44577 15407
9153 15407 27687 26808 16571 -20927 -60771 42858 79651 54389 96435 127596 90237 81304
9141 81304 134885 152587 163126 138006 42340 -81809 -73496 -61199 -52094 -42256 -55599 -39404
9129 -39404 24890 36885 18746 80617 83284 -15941 -51831 1129 -31272 -90349 -48254 -12052
9117 -12052 64553 35751 55268 110573 87476 137262 112358 111131 128594 109687 95333 73473
9105 73473 86649 58487 91212 139337 111701 115352 112897 82181 29779 -12941 -4130 10919
9093 10919 48401 964 49527 94684 72794 44235 29169 -11155 -73266 -106114 -120090 -72414
9081 -72414 -18207 10564 28492 82868 16629 -15014 -16073 18522 133544 145122 88939 75301
9069 75301 29777 8023 -31924 -132452 -102512 -59503 -52907 -78746 -29649 70073 80186 48365
9057 48365 76892 65458 35914 28145 8229 8207 9935 -11299 14515 31266 31905 3174 -88630
9044 -88630 -81800 -64057 11810 117751 92234 36525 -4314 -92963 -133817 -101490 -100545 -106975
9032 -106975 -10471 66212 61425 50328 41414 -5799 -23735 -58101 -27323 2724 8064 -37003
9020 -37003 -48196 -27140 10924 4069 7430 11189 13716 -60034 -83379 -63668 -41917 -5559 21060
9007 21060 31399 25234 45978 69054 78906 29367 23072 35423 35081 17589 -6879 -22120 -40697
8994 -40697 -30446 -9668 8985 2474 -28502 -72619 -30422 37322 119841 92479 27057 3250
8982 3250 34105 -34886 -121588 -170245 -154945 -122553 -114822 -44092 -35629 -4913 11021 22757
8970 22757 17496 -12703 -26244 -10699 -29717 6953 -5640 -16668 -53536 -63955 -33602 -116320
8958 -116320 -126455 -74648 -33902 17893 89789 48682 91354 78295 89397 69618 10411 -26273
8946 -26273 -23019 21634 37107 58811 27150 -34168 -6163 1832 52131 40542 6712 81027
8934 81027 60620 35356 13453 -13231 -23680 -14875 -7381 26515 -20413 -65459 -117162 -141550
8922 -141550 -111099 -29533 -96938 -193263 -191671 -195632 -162470 -105696 -80578 -62281 -50569 41041
8910 41041 44031 44838 53115 102293 149218 92004 94585 77387 102657 167019 120011 -4598 -41622
8897 -41622 -67262 -38020 -38300 -43176 -1667 -16778 -38497 -81585 -93937 -88762 -57150 -17919 -23556
8884 -23556 21045 98323 98883 63066 11895 -16018 -2476 14008 20455 28390 4211 20413 28282
8871 28282 40834 41837 46958 38764 4005 -874 -42978 -87051 -142434 -121798 -40200 75707
8859 75707 126976 159493 113885 14541 -13839 -98426 -147641 -78419 -48290 3296 26140 -10095
8847 -10095 -71680 -92615 -99279 -150739 -135222 -149630 -88751 10007 67150 72140 56916 80922
8835 80922 78305 72078 73861 88874 22580 -3198 -34535 -58945 -38273 -81099 -105246 -112163 -93838
8822 -93838 -52975 -1733 -43462 -34221 -20700 -24530 -45898 -24843 -20544 -30035 4901 -8593 -31448
8809 -31448 -17959 -65417 -199353 -224455 -164133 -77641 -24394 -20526 -3076 6989 -73648 -110189
8797 -110189 -75534 -47979 -17285 17048 39226 45644 -3833 -40632 13327 25355 -49 -7279
8785 -7279 -77286 -63137 -32858 -78867 -85934 -73194 -94609 -102686 -51132 -24677 -28359 -43554 -91097
8772 -91097 -110983 -120005 -48528 34130 3211 -35578 -78738 -64964 -62198 -84522 -60856 -20755
8760 -20755 -16054 -13863 -1347 74051 96668 107374 122725 174335 141535 69715 91840 126332
8748 126332 66117 -2151 39497 52058 -3210 -65991 -18691 -35669 -31330 30703 18370 -17475
8736 -17475 -43183 -14146 34934 50299 14007 66779 97794 91752 39548 -9798 14791 -18195
8724 -18195 -68688 -125143 -117546 -126762 -126417 -158375 -128331 -59194 -46410 11818 44083 45632 -9827
8711 -9827 -40855 -80642 -168006 -118208 -33395 -27452 3028 2126 27247 -5619 -59797 -45464 -1429
8698 -1429 73115 17362 25552 48492 26589 -103052 -85048 -49984 -28173 -18096 -28079 -56875
8686 -56875 -40120 -88401 -82443 -53220 -4446 -87293 -54951 -67115 -79691 -67689 -114418 -44206
8674 -44206 38807 -46582 -123320 -100933 -40495 31046 42809 18525 46221 26226 26534 17953
8662 17953 65156 77115 -47558 -64249 -5156 -68160 -100426 -63501 -721 -46914 -56079 -46577
8650 -46577 -58269 -83938 -61511 -43427 -9970 -24373 -23151 25355 36865 26724 22919 49710
8638 49710 38423 -58372 -84136 -117802 -87559 -19837 -21919 -59243 -84531 -61522 -26659 3892
8626 3892 -10884 -18662 -81801 -48616 19026 25545 10650 -32962 13466 70782 67207 -12102 -56456
8613 -56456 -39329 32118 33773 53555 22268 -9397 -24974 34349 33482 -1898 -14457 -46768
8601 -46768 -53302 -20484 53207 52927 33101 -46459 -5013 -41208 -54131 -3061 43653 32364
8589 32364 26372 71887 82822 62120 63626 28461 6749 32645 35239 29336 9643 -26744 -44482
8576 -44482 39984 113686 101158 96502 44488 46326 -15603 -44763 -7749 -23988 -41548 -47814
8564 -47814 -54795 -17197 58364 55092 32892 57597 -8360 -101597 -71568 -31579 1645 -18111
8552 -18111 -24319 -7662 -16005 -10734 42610 51007 -31790 -44835 -24863 8471 8625 -42867 -88003
8539 -88003 -67873 -53713 -60044 -35504 -8718 16384 126470 225975 192145 126026 51975 -49849
8527 -49849 -180244 -149617 -51225 7782 19045 34325 -6891 -25826 -46739 -24260 -10307 -22874
8515 -22874 -72037 -45884 -75973 -91457 -52589 -69618 -12663 4835 -12290 -34051 -27003 20815
8503 20815 44203 -46772 -66446 15080 3818 -58507 -7199 54 -46531 -23347 -7181 36999
8491 36999 21658 -25569 1602 42161 -28451 -96667 -38523 1001 -56468 -86309 -177565 -196160
8479 -196160 -153238 -86714 -88252 -14273 38912 -4080 -37300 -50160 -29123 -29539 15075 32511
8467 32511 4960 -19379 9779 -1006 -45872 -54095 -27938 -74202 -145999 -114490 -56322 5151
8455 5151 22919 -11658 22710 1735 156 3103 11707 61431 111664 73634 19954 -15657 -26229
8442 -26229 -35013 -7659 -2927 -36854 -10828 -39817 -53114 10897 -4973 -35061 7872 9822
8430 9822 -3878 -60572 -71502 -55928 -64602 -89724 -90573 -17603 -24825 -45105 -48567 -6245 12788
8417 12788 6173 -6523 -91139 -51189 -66936 -33893 4851 -11128 -49908 -54185 -76638 -94867
8405 -94867 -75984 -14459 -51095 -100295 -133298 -83269 -93786 -43192 -23911 -45775 -63117 -139210
8393 -139210 -141376 -126925 -86814 -63921 -39196 3518 -4444 -11971 -480 10399 33407 43860
8381 43860 21110 -21656 3183 31088 1024 -25326 -47056 -46129 -65590 -30208 -4735 -4780 -11572
8368 -11572 -56758 -37725 -39915 11885 22595 -3264 15354 -9693 -65806 -15579 18393 -1301
8356 -1301 12268 1506 -16610 -53004 -64237 -22442 30202 105453 120729 111252 68593 23449
8344 23449 -55748 -94587 -55545 1652 -20886 -31363 -20273 674 15033 -29745 -42297 -31466
8332 -31466 20141 -22969 -21799 -18040 -30819 -10832 13510 -41524 -40195 -53590 -64728 -47149
8320 -47149 -43718 26085 25595 -34029 -98505 -67790 -65458 -35291 6657 -9200 -40201 -25036 -52661
8307 -52661 -70862 -67135 -89248 -106235 -24197 35573 -69230 -98218 -80701 1451 24729 23133
8295 23133 38135 43326 54641 65905 15840 -5565 -97640 -127549 -65301 -28484 -33546 -10784
8283 -10784 901 5777 -12826 16970 35520 101716 125304 81576 13958 93502 101100 -32165
8271 -32165 -8434 36033 62633 68183 27487 19481 54454 -2847 -78464 -103409 -93000 -88690
8259 -88690 -161648 -119040 -80320 -79314 -115143 -124037 -74875 -21824 -44601 -57291 -100373 -73512
8247 -73512 -56919 -74637 -70750 -67614 -83848 -46239 -8886 -15644 17316 -26927 -32180 -13088 -25950
8234 -25950 17597 -16279 -77686 -56023 -33099 -19755 -20551 -57243 -45445 -23622 -58458 -68671
8222 -68671 -217 19951 -5820 -30909 -66112 -80134 -6302 78434 79060 72538 88193 18548
8210 18548 65799 81750 56063 -1162 22386 18918 13241 22030 20191 -37397 -22012 -2554 -64452
8197 -64452 -60594 -47459 -60546 -44374 -21039 1638 -21878 -49801 -62530 -37566 22911 80633
8185 80633 142648 139687 179465 127377 20887 -42242 3123 4855 23354 -47872 -56582 -85197
8173 -85197 -70787 -66947 -56388 -93690 -41100 -3086 8909 50798 -2343 64315 100360 85840
8161 85840 93247 82695 30166 38411 80310 80817 46953 48360 116175 63715 27517 35970 -62219
8148 -62219 -97038 -41689 -6066 14588 45342 11931 -61448 -163990 -196960 -103592 -53735 -32145
8136 -32145 7080 -42729 -65872 -13651 48542 17522 -42677 -55227 -47554 -13172 9411 8695
8124 8695 -42981 -13710 18149 86109 99705 51043 22786 24071 20497 18459 -65069 -84371 -42414
8111 -42414 -73240 -81688 -77971 -37661 -29383 -34600 -31511 -33061 -83976 -118148 -68256 12303 27036
8098 27036 -8290 71460 54244 73996 36257 23405 1827 -50294 -98186 -48921 -25074 16463
8086 16463 50099 65848 15824 49100 68895 20995 38013 -4002 -67394 -76004 -3704 37550
8074 37550 -4921 -56283 -34998 -39808 -36607 -30400 -43016 -42484 -44046 -23829 -68850 -57895 -35120
8061 -35120 -3576 61808 101755 107045 55323 21915 4623 50121 41408 31851 47601 2547
8049 2547 -20643 -4806 -80930 -121153 -131221 -26117 5005 19748 -19361 -96707 -35420 88693
8037 88693 62741 -2280 -28914 -35435 -45067 -66387 -80448 -46005 -21495 -91572 -112538 -131694
8025 -131694 -97758 -12891 30083 3903 -29470 -58748 -44796 -57615 -112093 -77645 -55936 -96695
8013 -96695 -188036 -157263 -159291 -142540 -97344 -45106 -784 10329 18964 -11194 -31388 11309
8001 11309 2532 -215 -16795 11911 -7681 24315 30357 1410 7499 76885 70555 57707 52928
7988 52928 61973 41453 51647 77152 627 -22887 -22798 -55888 -59014 -14269 34661 59169 24868
7975 24868 -58377 -77979 -12695 -90556 -122565 -57012 11276 20648 -3193 -24111 -21271 -20038
7963 -20038 33657 47332 7168 37772 -12089 -52720 -70152 -50903 -74046 -81322 -64572 -10834
7951 -10834 35133 75481 82815 102193 117634 82123 -11075 -11473 3053 -8131 -20715 17570
7939 17570 35734 42452 28918 -23576 -38502 -40220 -30247 16917 -56349 -50585 -5199 -22340 -85586
7926 -85586 -32611 11834 6470 12387 -16560 36898 36171 27288 10373 -3233 -44665 -20450 -81467
7913 -81467 -92392 -108535 -132658 -51635 4318 -42870 -96982 -71283 -28559 -56507 -98522 -224352
7901 -224352 -222714 -148686 -30687 32418 -973 -89900 -128349 -139651 -72440 -65947 -28150 -40305
7889 -40305 -620 70537 77296 43913 45710 20572 -28192 41337 58958 75616 82239 29941
7877 29941 54229 128537 229659 174878 53860 69826 7850 -51221 -35637 30703 78274
7866 78274 34629 -46903 -24798 40740 60440 38322 -13393 -44658 -92774 -65422 -55111 -64069
7854 -64069 -48614 -120663 -116817 -31800 8081 -20356 -3429 -6794 74777 58422 31366 48536
7842 48536 12817 -40515 -94041 -112652 -72464 -123489 -153766 -80000 -5435 -21811 34949 11027
7830 11027 41465 54271 16934 55819 26956 -3317 25976 35958 113113 92054 66042 73289
7818 73289 85812 45714 -39260 -56845 -37665 -25679 86852 74922 25859 -24227 -113088 -200236
7806 -200236 -223373 -205467 -87825 -33370 -29442 17356 35702 -8462 -32058 -43321 -53677 -46761
7794 -46761 -65302 -62637 -22216 67394 20169 -4713 42509 6424 -15675 2872 -33638 -79100
7782 -79100 -40943 -23766 29992 24534 -37613 -58494 -88345 -80398 -8672 24324 63872 47955
7770 47955 6806 -26116 -11287 -27347 -54166 -40499 -5242 7595 9496 19672 21319 81311
7758 81311 74103 37064 46540 63088 30204 -48841 -35902 -15148 -62354 -25811 -26091 -11495 -1913
7745 -1913 -15424 -2214 -40839 -91202 -120493 -95348 -28704 -29012 -53857 -39394 8158 -1092 -19926
7732 -19926 -7359 38436 22395 -38908 -152403 -177499 -80567 -14865 40437 28881 70347 113983
7720 113983 31160 18582 -38933 -20503 -5073 -69970 -98305 1344 2511 -16703 -23349 -44148
7708 -44148 37240 86150 95500 44998 66707 51035 18367 94137 124150 54783 -18699 -93290
7696 -93290 -66961 25083 5846 -8264 41095 28397 -5959 18547 -1541 -18376 22583 1475
7684 1475 -22505 -64545 3557 53611 38664 24178 7358 15564 93305 63517 9011 -66730
7672 -66730 -8580 -3554 8325 -26557 -46491 -43550 4574 41160 8417 4326 37900 71513
7660 71513 51987 -22281 -24536 -18518 3789 16374 12227 4164 38791 -22924 -63716 -4359 50713
7647 50713 18094 -4721 -22012 -42552 -55476 -63514 -17133 -14142 -8453 -23771 -79033 -53814
7635 -53814 -30304 -46152 15662 54830 7053 -69368 -39123 -37134 10115 44872 58039 -19853
7623 -19853 -48582 21266 35096 33059 64504 11778 -20974 43424 27756 10554 6756 66515
7611 66515 95652 76069 88215 11259 13846 -3407 -6156 8832 25033 -22976 -93241 -96359
7599 -96359 -80609 -87557 -15455 54210 -10392 -61351 -20171 -38227 -44173 -64409 -65542 -86367
7587 -86367 -113065 -71586 -20930 -58573 -96958 -95426 -74933 -53481 -110194 -100967 -60598 16553
7575 16553 13513 25752 40180 33783 68757 110886 72720 18819 27092 13933 15046 23720 20051
7562 20051 -50298 -106403 -42581 -3522 -6469 54822 23667 -10536 -258 -40359 -81390 -84896
7550 -84896 -119423 -97099 -86081 -78980 -59401 21860 -458 -32121 -39757 40451 -10279 -3628
7538 -3628 35329 45414 20401 48922 53025 11833 -35799 -50022 -58888 -44366 -26381 -70912
7526 -70912 -146584 -186290 -168591 -42724 -2933 12790 90262 103345 87853 103807 108926 84969
7514 84969 77939 48380 10561 -52557 -83305 -108749 -113262 -144612 -136199 -145328 -135416 -62075 -78569
7501 -78569 -96071 5965 44390 -20871 17731 -20381 -50311 -87252 -42179 -52846 -69865 16715
7489 16715 -14585 -20080 42800 85541 86334 37738 -10760 -74410 -81685 -1820 39226 -28554 -37042
7476 -37042 -9667 -43426 -109092 -102851 -68672 -36117 -3556 -24445 -27447 32166 39648 -39162
7464 -39162 -20799 -54122 -93398 -48910 17816 103977 149992 48317 25305 67637 93555 41117
7452 41117 -21178 -74957 -95694 -23506 -5577 -8505 44043 83206 30881 8853 59580 37076
7440 37076 -35242 -48929 -33564 -7817 60735 50952 44307 120006 148099 122927 60035 -14081
7428 -14081 -97870 -73924 -19934 -47696 -69838 -76751 -39784 11441 14351 22337 29936 33976 66623
7415 66623 67300 35372 -17455 -56951 -115544 -138898 -53645 -19082 27835 -2907 -66893 -88072
7403 -88072 -131110 -150467 -80456 -35356 801 -2269 -61092 -40385 -27380 -37997 -32073 -4590
7391 -4590 -5427 -111588 -227485 -127213 -47342 -48910 -63478 -52169 -42516 -34501 -58168 -70346
7379 -70346 -60762 -66358 -81709 -92457 -84738 -106163 -109622 -83158 38664 89551 61711 24506
7367 24506 -3968 -69347 -85562 -75538 -48939 -89742 -95467 -62159 -17800 61697 75585 45182
7355 45182 -6441 -37503 17163 96162 104944 84391 69590 21620 45195 23017 -44510 13753
7343 13753 54060 95884 144708 97678 53953 17743 57382 104713 63556 20586 -9965 -9981
7331 -9981 -34114 -78145 -89236 -66512 -29207 -34758 -71044 -87193 -96520 -84130 -97617 -73028
7319 -73028 -87670 -156743 -119257 -69820 -29683 -65674 -111200 -136896 -86971 -16294 19304 38306
7307 38306 36116 19357 -7818 -64342 -40156 -25115 -53387 -20161 -51671 -36243 -57114 -86401
7295 -86401 -61416 -97731 -115554 -93207 -77817 -56091 -48430 -26813 -18558 -39286 -86069 -120267
7283 -120267 -154986 -138979 -119261 -91043 -94649 -103136 -14359 23828 19960 12761 40172 18308
7271 18308 8775 34477 16721 -6475 22925 -46020 -74927 -64992 -68814 -14726 45997 20021
7259 20021 12651 36328 112860 166225 195955 202218 102706 18120 -40819 -50313 -75024 -72822 -67590
7246 -67590 24921 128037 154361 112871 39932 -78684 -38323 -41190 -91576 -84021 14317 83516
7234 83516 122774 134538 84591 19924 52918 70423 84139 68435 39619 13693 -40296 -61202
7222 -61202 -44933 -9973 17301 24501 2261 -24838 -10230 -19815 -68887 -7774 51286 6174
7210 6174 6251 35838 55034 41604 30927 14312 47770 42106 80613 99780 44349 -23715 -20067
7197 -20067 -29207 -50540 -82967 -66121 -75824 -124356 -92179 -61693 -83291 -30083 8455 34711
7185 34711 27850 16338 -30574 -66596 -78117 33368 56160 51973 81658 65932 7302 -37087
7173 -37087 -24700 -22136 -73732 -78838 -44082 23541 100345 124887 110237 28509 49791 40301
7161 40301 32814 33488 -16012 -1468 13683 3576 65441 116472 88926 79406 52466 59168 98193
7148 98193 137859 123487 46165 24036 8208 10718 52955 113062 70492 26691 24301 12411
7136 12411 43034 103213 131560 41161 -21458 -72186 -96895 -53222 24094 -30175 -37330 40789
7124 40789 64346 14919 -64368 -148927 -65791 -6004 -13575 -32630 -41810 4035 36408 30843
7112 30843 -4917 -37437 15548 105531 57111 42899 7876 16742 3801 -23785 -32626 -50032
7100 -50032 -75016 -89430 -57103 26295 57846 19131 -57057 -75362 -60927 -52681 139 -41830
7088 -41830 -98325 -25338 71100 76570 19455 -65128 -60097 2203 -9408 -1994 14044 -28519
7076 -28519 -20811 -4765 -12195 -11714 -31705 -49042 -52210 13002 37457 31554 59598 3265 -45548
7063 -45548 -23139 -18452 -27474 -54920 -44597 -10306 -58905 -109168 -80381 -38847 -19622 9100
7051 9100 -6782 -88838 -97165 -130644 -42105 10433 47316 74604 44996 30059 -15753 -589
7039 -589 62144 73700 65561 16380 -13005 -47853 -43550 -15230 -16174 6664 5785 48319 26883
7026 26883 33062 41433 4796 32475 86693 105426 114662 59512 14020 -63316 -120714 -115871 -91754
7013 -91754 -31738 83546 116381 172272 203738 150181 112426 93169 15344 -13546 -11124 12331
7001 12331 -33862 -27888 -12254 -19427 -6361 16557 -21876 -45405 -13367 1101 -45470 -77954
6989 -77954 -35915 -24771 -101870 -100406 -81566 -99219 -51130 -42730 -61790 -74942 -103584 -97934
6977 -97934 -44662 -56469 -99485 -84089 -19756 17857 82989 85839 9445 -28595 37478 101076
6965 101076 97591 68354 18426 18720 -8854 -64384 -58466 -36733 -90023 -134822 -185815 -170382
6953 -170382 -111344 -101398 -106518 -89815 -6788 36549 77726 99912 59369 61012 55199 139848
6941 139848 92838 31185 22648 1340 -26682 -70070 -58209 -58409 -31201 -90466 -125826 -98996
6929 -98996 -56403 -40197 -17192 -68863 -147101 -147251 -47578 16327 -58026 -54236 -24529 -42096
6917 -42096 3254 16795 30964 54262 -7301 -50372 -70233 -23159 -27594 -25944 6874 -27881
6905 -27881 -28959 -11899 -53014 -73187 -39519 -79880 -82786 -40197 12403 4208 21342 -2740
6893 -2740 30659 73989 27546 13329 27741 55735 26248 61916 45567 -314 -10049 -65791
6881 -65791 -59121 -57381 -46137 10053 81700 103834 126390 35428 -66787 -86455 -15188 601
6869 601 -29163 -82546 -50364 -55015 -46754 -69249 -10749 54874 21327 -61590 -79361 -49871 -44476
6856 -44476 -34220 30062 15660 -2920 -5669 -22095 1682 -27406 -16144 -18523 583 20092
6844 20092 18384 -53279 -84418 -59525 -4332 -17319 -11291 -72067 -44010 -42819 1041 4380 -21547
6831 -21547 8808 -34460 -21405 -77563 -119006 -155734 -131994 -99466 -19536 8818 22910 36157
6819 36157 30261 -22729 -7435 -26205 -58580 -20526 -13554 31849 35148 9555 25501 -33407
6807 -33407 -147255 -99247 -47128 -47177 7946 64165 101802 118147 122099 98768 45247 20024
6795 20024 53452 86896 40666 -71833 -53304 -18818 -86772 -132575 -87595 -3700 -3897 -33486
6783 -33486 -70986 -104578 -90664 -58515 4514 19448 49523 56241 -11753 32864 79634 92023
6771 92023 53566 18547 47258 -4581 -11689 22340 24011 23988 3072 -10780 -57149 -59851 -43199
6758 -43199 -375 86789 59115 16542 -8789 34895 54260 33096 20854 33558 -2055 -12017
6746 -12017 63193 59388 -49024 -60620 -686 3138 76350 76515 25598 27783 50312 69600 126504
6733 126504 89489 47491 21876 -25635 -24920 -41617 17977 50655 18441 -4308 41719 -4298
6721 -4298 -64647 6068 39713 63006 27121 20204 88277 56442 44291 -13185 -32899 -18106
6709 -18106 46799 -12538 -54621 25850 60056 30158 17983 -27019 -56723 -67616 12788 24697
6697 24697 -26801 -15848 11411 52062 94026 147540 190147 136522 106390 29198 3283 31956
6685 31956 43602 14562 -838 32467 -4428 -75358 -57095 -69851 -95175 -100247 -125252 -63596
6673 -63596 19809 5533 -18689 -28244 -93745 -128859 -106645 -7906 26968 21079 -24869 -51484
6661 -51484 -119930 -118943 -134981 -126534 -98162 -63227 -103733 -80619 -11750 -9633 -8661 4893 38495
6648 38495 35617 -13848 -96587 -124274 -116174 -123047 -144917 -151377 -115449 -94491 -58860 -39854 -87690
6635 -87690 -53121 -43740 -81888 -97102 -80101 12157 26442 -9539 -39998 1953 42387 58044
6623 58044 88598 62774 95 -43414 -57523 -39576 -52920 -61210 -6178 25616 -10083 24834
6611 24834 63746 100861 98075 39871 -16442 -53689 -4620 39342 40322 54103 69682 54947
6599 54947 -62517 -153007 -112124 -100811 -101367 -21733 36930 38895 9780 19422 96773 121361
6587 121361 90083 82234 84500 43988 -41850 -44999 2810 66778 88012 -2540 -70208 -64884
6575 -64884 -61378 -34420 -10578 -20101 -70128 -97168 -90034 -95133 -88890 -105856 -126820 -79877 -69968
6562 -69968 -39290 -21827 -69135 -80182 -78679 -77737 -33378 -22968 17082 53299 121436 151912
6550 151912 124570 104022 135872 201107 179180 71808 60667 51154 -25516 -41509 -12046 810
6538 810 1322 -38990 -42595 52017 115955 61846 -1931 -47420 -44640 -28887 -23493 -37351 8645
6525 8645 107723 108881 81079 75409 28559 -34036 -22146 142921 161747 54727 10028 63060
6513 63060 54478 26012 44081 34761 42148 23572 43118 26019 -22439 -25126 -66233 -118693 -53939
6500 -53939 -70946 -74158 -72299 -3241 -21376 11934 -31476 -55090 -132606 -69557 -14431 33944
6488 33944 65598 85831 17524 -11549 22835 47459 79218 87053 38690 -27628 -72467 -69959
6476 -69959 -18245 -31841 -51935 -23089 36437 28028 86178 130860 40671 50856 49520 -59124
6464 -59124 -133198 -127868 -838 57534 40383 -35393 -98110 -85450 -85453 -16500 48946 32148 65833
6451 65833 52520 -18690 -40456 -54237 -38497 53350 30941 -33570 -4001 -2721 75395 128904
6439 128904 123969 66620 51860 59515 91048 94815 73967 35744 -6969 -29445 -55405 -24679
6427 -24679 7778 10130 -10006 1604 40417 -38521 -35595 28558 86661 84264 34081 -15271
6415 -15271 17621 6033 -33799 -40613 -80528 -79398 -44887 -100396 -118048 -46847 -16304 -58808
6403 -58808 -57823 -47084 -57728 -62388 -39489 -1863 54615 76656 -28750 -106113 -116242 -87378
6391 -87378 -77143 -141431 -120803 -102761 -78747 -47320 39957 140064 178151 115642 27072 29745
6379 29745 17718 26801 43942 16621 28700 -19966 -42875 28451 38888 -27026 -39776 -13854
6367 -13854 30136 96121 49503 2208 8907 -26695 -59108 -35997 1701 36282 26068 -15062
6355 -15062 12084 -23802 -12202 23757 31982 -26846 6417 30699 -37101 -3635 60095 127845
6343 127845 154593 124793 53950 -44475 -78300 -37925 51173 72993 96084 97295 110867 96310
6331 96310 47202 -15559 -28996 -13278 24072 85767 92472 61138 12941 43653 79720 78193
6319 78193 31385 50823 30576 -71936 -81793 -19052 32825 45185 -43789 -160224 -210332 -136003
6307 -136003 -53864 -32273 -26442 -49165 -16671 -55830 -148680 -125654 -49184 -9225 -29711 750
6295 750 32325 -40629 16289 39118 -31043 -81724 -79067 17559 51882 62287 -9457 -35903
6283 -35903 -80108 -108089 -78270 -93541 -57177 -99414 -186638 -137094 -121441 -79246 -44927 -18772
6271 -18772 -38598 6735 54131 61429 -567 -26177 -25678 -4950 -21477 4503 18740 28379 21696
6258 21696 23325 12390 20724 -31487 -84731 -85444 -104481 -81490 -58046 -124622 -105189 -73820 -8785
6245 -8785 74856 71708 38653 41546 12421 -16895 -30764 27675 6193 -1182 -43787 -76917 -78357
6232 -78357 -29866 38666 63456 61153 112148 111503 49642 24727 -51534 -82882 -20970 45093
6220 45093 37735 26989 63558 61320 31685 86330 75362 -19529 -73914 -69587 -50808 31901
6208 31901 55883 31956 -221 7695 -38181 -109662 -111666 -101377 -112289 -96472 -80111 -110743
6196 -110743 -35870 -16892 -5339 -2007 14479 -12374 -38885 -20283 -51101 -124802 -39313 -10304
6184 -10304 -35775 -75320 -62818 -74717 -57059 -36738 23670 95804 139262 98446 1298 -62274
6172 -62274 -68024 -71210 2335 -8089 -73811 -121210 -145762 -124446 -136928 -100030 5299 21357
6160 21357 -34915 -60654 -88177 -54416 -48668 -24708 54608 56996 2787 -22671 -19303 4771
6148 4771 56923 107497 47841 24663 3235 -42931 -62132 -52134 -59085 -126350 -110162 -88659
6136 -88659 -64097 -55984 -58571 -74403 -70416 -23268 -54347 -83575 -31706 10233 -47973 -141747
6124 -141747 -151060 -77054 -43055 -50572 -20594 -57631 -70682 -91386 -133153 -159774 -143818 -107837
6112 -107837 -74850 -42121 2736 22522 12896 -17459 -39919 -6836 41427 12779 -3714 36115
6100 36115 52826 33524 10001 15300 38455 26197 -7700 15258 12351 -95290 -126233 -44486
6088 -44486 -40765 -74411 -77102 -130543 -116007 -54521 -46673 -40340 -40506 -38139 22524 29524 37029 27824
6074 27824 48652 89841 1956 -62076 -17475 -2153 -53664 -14520 -49948 -65684 -57809 -44645
6062 -44645 -14563 33630 40227 -15480 -22204 4640 -22350 -40569 8580 29126 -16534 33880
6050 33880 52466 24427 -26941 -50074 -83438 -71275 -52353 -47065 -29747 13834 4657 45945
6038 45945 52943 32452 43161 45494 814 -42535 -43239 -31019 70054 166358 143447 56655
6026 56655 33441 34666 25408 39371 44854 73057 116592 115473 46546 54020 89256 23737 55856
6013 55856 65979 105929 83643 -18560 -87525 -60446 -43930 -46782 11674 -2965 -28776 -81092
6001 -81092 -111075 -65396 -30271 -3143 10066 11583 -45303 -100694 -84287 -4182 -7774 32063
5989 32063 22386 33651 76748 106043 72553 97793 51489 -33675 -104631 -133860 -75234 40707
5977 40707 98559 71483 -459 45104 50851 -9715 18369 55190 20807 4121 -25913 32393
5965 32393 53783 18057 -5518 -10405 -13490 -30928 -46258 -31810 -33599 10576 47623 46591 4534
5952 4534 19615 1492 -24167 -6602 45906 39328 -16236 -45348 1642 1851 60550 75450 19213
5939 19213 -58637 -64558 -90102 -76216 -82891 -15805 13535 -30649 -24802 28257 2239 19338
5927 19338 67246 59783 54084 48644 12040 -34742 -45921 10813 17245 -35716 -72649 1168 43385
5914 43385 54091 93650 56934 -21864 96 32135 35443 17183 36711 83051 77094 62378
5902 62378 52356 70188 53371 -24185 10300 15480 -10940 -21923 -70355 -106419 -10576 26154
5890 26154 41935 -12645 12916 70611 113272 15047 -24831 -73800 -38895 -10787 -15932 -18948
5878 -18948 -32352 14761 70876 93547 82829 57888 -18552 -9389 -5631 -48183 -70679 -118343
5866 -118343 -141754 -108468 -86842 -98885 -68669 -27506 -13973 -8500 -49279 -59670 -40506 -59407
5854 -59407 -98408 -82296 -33963 -42706 -22771 2397 3275 -24129 -12202 -36660 -89274 -65785
5842 -65785 -20988 -103037 -152999 -119083 -100454 -18125 17841 -3674 30053 32492 6171 20461
5830 20461 -23314 -40680 -72799 -68298 -72322 -34326 33287 7993 -27722 -43895 20287 106103
5818 106103 40150 52464 23169 22594 -18304 -58122 -44484 -21545 -52774 -58472 7225 62441
5806 62441 3537 6101 16116 -36005 -37639 15977 37441 81960 125360 101187 18939 -45036
5794 -45036 -18150 -26018 9389 9155 10833 20391 1749 -50057 -75949 -39917 -48814 -76831 -35840
5781 -35840 31094 52246 -4416 -56824 -60046 -82668 -133640 -143334 -78585 -26047 13854 27877
5769 27877 93636 70873 13485 -50434 -43338 -4956 5019 -12702 -9643 -33938 -51914 -45916 -9493
5756 -9493 -28624 8090 36101 33024 19868 -40846 -41998 -24353 -58476 -118498 -207609 -164761
5744 -164761 -101231 -101480 -80122 10 40040 -570 -37559 -90342 -67222 19987 44349 46670
5732 46670 -31070 -32160 21256 30360 -9248 -21952 -40884 -79145 -130677 -116660 -66530 11835
5720 11835 55305 29712 -16640 5972 45868 69629 65172 98364 115223 146973 65202 41455
5708 41455 79044 52250 8513 -26116 -93023 -90582 -45527 -23368 -34908 -39282 -37805 -17200
5696 -17200 -26925 -35056 -22764 -4851 -75965 -81195 -98161 -50790 8084 1107 -48132 -2807 -25534
5683 -25534 -100207 -119844 -105688 -108047 -66487 -48873 -78993 -139606 -108214 -101138 -105237 -49910
5671 -49910 -39550 -16828 -67717 -52424 -24877 -19537 25976 45164 15176 -89531 -119798 -134877
5659 -134877 -54359 -44364 27500 11529 8356 98952 87847 31651 19898 -14643 -17323 29799
5647 29799 70709 11193 -65414 -70938 -39087 -46218 37042 95629 77520 38304 7030 -10882
5635 -10882 9139 34384 72575 73753 49241 -11056 -33710 11144 63089 71929 58612 -17978
5623 -17978 -77607 -74402 -13600 67101 34808 -24622 1719 55374 25334 -18753 -43664 -29966
5611 -29966 -39891 -29392 20415 -20297 11573 9030 32260 36051 -2652 -61650 -74777 -91191
5599 -91191 -43109 -29702 36396 67249 26910 30419 70010 94125 102107 73430 29565 -16471
5587 -16471 7673 -18059 -58113 -71890 -50798 5809 -5654 -17200 27180 36231 23107 -4289
5575 -4289 -27581 -13139 7304 -17486 -16628 53771 67840 60226 32720 -29311 -44347 -66191 28072
5562 28072 135776 231099 202993 164218 183055 76743 31278 42415 47229 -1236 -42292 -13389
5550 -13389 -28054 -54281 -96798 -37102 -7227 -38226 -101938 -135708 -104793 -2218 87045 152238
5538 152238 137590 32750 10511 54868 38318 3876 -12695 -88272 -70276 -48657 -51404 -75780
5526 -75780 -112070 -153535 -151206 -65162 26110 39496 44551 89565 71928 32167 -7187 242
5514 242 -7427 51260 43562 73333 43960 21080 -79923 -138971 -95186 -42017 -29332 -24997 12393
5501 12393 -4412 -49918 -41296 -47901 -21774 -51648 -56192 -111831 -83600 -93695 -42283 67053
5489 67053 47281 -47351 -95089 -21516 3125 58609 73125 -15028 -70137 -102929 -55790 -32314
5477 -32314 28890 56239 6363 -43693 -28035 -35341 -4864 10571 35080 10109 9429 31659
5465 31659 66319 41927 30974 77170 30543 15528 -2212 -20018 36902 28668 -13863 -26250
5453 -26250 24463 40419 62103 93711 24832 -35145 5120 39406 32543 -33573 -36334 21755
5441 21755 -9786 13185 36797 -18085 -71688 -26896 59590 63318 114007 116613 163522 119851
5429 119851 61148 -10883 -109801 -79219 -32549 -55017 -57746 -14472 -391 48815 25706 48883
5417 48883 130954 106189 56964 -32272 -99267 -99549 -54295 -3077 13876 20326 -3753 60399
5405 60399 65796 -32734 -61314 -21038 56173 107723 63162 47743 -11234 -55217 -47118 -70860
5393 -70860 -34927 -22510 7938 33077 35236 55857 -12201 -31079 -1909 -10094 -38380 27258
5381 27258 11445 -27107 -26298 -46478 -55316 -87967 -129703 -209452 -212134 -113817 -66994 -63920 -16453
5368 -16453 18192 29778 -2599 -38100 -9994 13772 5979 -49137 -25968 42313 135954 82690
5356 82690 20175 6146 64610 62515 50680 -6408 -56826 -80343 -29609 -37754 -61717 -38296
5344 -38296 -30317 -31094 -33815 -23284 -41506 -13949 27937 9967 8858 5986 10918 20254 54402
5331 54402 59964 64151 20680 -52467 -133337 -137075 -139142 -87274 -7216 27426 1036 -7152 -33674
5318 -33674 -41553 -75045 -84245 -86725 -62157 -35823 21748 20853 8785 4466 39064 45490 84848
5305 84848 53924 -26663 -10691 25587 8741 80560 86145 75331 8568 -34090 3002 -2805
5293 -2805 -11142 18178 31584 -14733 -2912 3719 7193 22347 59613 107919 127278 141127 96891
5280 96891 101590 77804 77919 -6963 -58418 -61453 -36834 -55013 -19930 55252 70568 31454 83377
5267 83377 114464 133986 110564 84587 37927 38390 38708 45947 14395 15485 8339 -4782 -65603
5254 -65603 -123496 -83867 -17708 -17635 -7213 -1728 12965 2189 34580 78567 58722 60669 56227
5241 56227 103505 97194 91659 -11967 -87665 -5122 21719 35628 93525 53667 43949 -27665
5229 -27665 -77756 -160131 -152609 -98483 -16220 51208 86607 83958 66578 46958 31898 8207
5217 8207 -53662 -74602 -130703 -99519 -40030 -45234 -102971 -93796 -81695 -87495 -119941 -136069 -22499
5204 -22499 78038 111294 113241 33138 17619 80823 -16847 -97937 -96227 11125 68913 25682
5192 25682 16578 41765 71534 65987 38437 59792 41633 28118 71379 38942 -25421 3425
5180 3425 57188 43681 102796 231546 230197 96597 7772 23698 22172 40563 75399 81547
5168 81547 116071 73031 -11716 -9172 -59339 -92623 -64173 -13694 -19464 -23865 15036 11600 -31385
5155 -31385 -56475 2161 8064 81497 71219 19881 3122 73449 119784 81851 38979 16754
5143 16754 -8305 -78778 -42311 9088 -10928 -10298 -12355 -11829 -52695 -53368 -21457 -44647 -13225
5130 -13225 53929 39882 -40116 -90393 -50755 -17826 -87311 -96593 -147069 -58889 -32054 -46238
5118 -46238 24990 38575 55286 56904 -14806 -15742 -41301 -96175 -91601 -46536 -14656 -52615 -32438
5105 -32438 58056 86071 85303 87369 73118 72273 97135 96722 88499 48402 39274 -17104 29253 55273
5091 55273 35873 -4430 -24431 -43858 -54403 -18386 -41177 -111107 -40766 59637 27717 8523
5079 8523 -29050 -72096 -56804 -24848 24276 49382 -5906 -60363 -34592 -15117 -27046 -26901
5067 -26901 -86234 -119768 -118005 -30637 3663 -42462 -87148 -96994 -69353 -36631 34218 66415
5055 66415 36700 7411 -29619 14522 45634 19057 34795 60039 56904 17606 -17293 -58613
5043 -58613 -66424 -84860 -71953 -28859 -4075 11402 25692 -18108 -27751 24333 -35050 -92439
5031 -92439 -46362 27304 62139 35036 22202 22986 4801 4424 -3192 -17441 5512 27901 -55745
5018 -55745 -15723 -60516 -108672 -67878 -79726 -109996 -21711 -23771 -67033 -93046 -100741 -17454
5006 -17454 30337 8622 -57520 -8781 -30351 -53490 -29512 83138 145846 67902 -6192 -50780
4994 -50780 -82466 -24711 65568 27018 29996 37958 58658 82619 36331 -10787 -80522 -78558
4982 -78558 -66425 -84408 -112444 -29712 61704 60663 81148 107862 3293 4313 14024 -40794
4970 -40794 -71952 -127197 -119494 -70513 -47688 -6875 -5480 -60197 -86582 4064 4241 -12249 10774
4957 10774 30195 -18303 -48065 -13503 30745 66657 9517 -76069 -104852 -99381 -59148 -6716
4945 -6716 -3218 -28446 -57575 -61328 -29736 47124 140111 171594 134771 51375 -105 -58229
4933 -58229 -8877 73757 72633 53835 61673 99770 99373 104940 81030 77912 52616 12713 -11318
4920 -11318 5819 11043 -23149 -3390 39853 103253 96295 82266 97371 80123 14893 8047
4908 8047 41701 65098 97372 96204 128749 98795 100123 89230 69647 30003 61621 46317
4896 46317 37285 10068 17057 60655 80638 74443 58484 -9388 -13721 65439 36071 23204 25948
4883 25948 73867 149505 101158 42759 42717 34858 -36467 -54170 -8970 22090 63647 5801 -18069
4870 -18069 -4502 9931 42410 2724 -30066 -57859 -14218 47329 31330 41304 58401 103952
4858 103952 81126 -10091 -71807 -36648 -17469 -72815 -97317 -55675 -16183 -19113 -17567 24875
4846 24875 63618 15125 -12866 19053 26414 26383 61783 55365 -3722 59245 65536 9520 67297
4833 67297 53699 -32063 -43155 -58279 -116918 -124246 -47215 -33835 -104599 -57712 -63420 -43584
4821 -43584 -136 -12837 6912 -10814 25665 40717 21093 -5245 -22275 -25273 -1180 50701
4809 50701 41776 5371 -21983 -27654 -56913 -62586 -56817 -78734 -57906 -10280 -2745 19782 -21750
4796 -21750 -83380 -69442 -33926 -23785 -35447 -34408 -20040 31647 5325 -4672 -12496 16252
4784 16252 56855 89382 105215 159271 95460 19014 9883 -11317 -72502 -124729 -76593 -22778
4772 -22778 58242 77794 33109 18796 8552 -487 -74091 -69624 -48869 2342 77886 54422
4760 54422 21620 9601 -2710 23431 48590 -10296 -89709 -97206 -1507 23645 -30649 -21168
4748 -21168 11444 82791 107878 27749 -41513 -76751 -37032 21641 15474 31873 13286 -27088
4736 -27088 -15447 -66577 -57410 -36340 -50238 -26645 -52397 6985 95285 77795 46142 30806
4724 30806 43644 92688 37392 -2727 -15146 6790 3308 16876 7075 -29363 73132 99358
4712 99358 51864 454 -1051 73700 77459 56324 5971 -3881 34317 97201 95612 17930 -26488
4699 -26488 -66362 -106093 -65218 -27017 12491 22415 20538 17604 49119 75879 64662 -8070
4687 -8070 25403 83006 206469 232168 116181 18154 -36551 -48477 -88722 -102133 -25504 4351
4675 4351 35139 90753 97512 20921 10724 18562 57133 152866 196250 165868 104874 97477 51648
4662 51648 53806 38757 15168 28320 -27143 -77970 -60202 -18164 27940 99198 65973 58512
4650 58512 42696 -34586 -64772 -81510 -70526 -49349 9387 -19311 -61437 -88627 -158753 -122574
4638 -122574 -61370 -35570 -683 36589 38157 76291 94131 97452 96484 82450 54417 82360
4626 82360 91301 55595 -18194 -47730 -27320 -35921 -60021 16747 36738 49455 51673 37564
4614 37564 5974 13711 7170 50246 -6829 -53221 -79168 -43045 -987 38613 67829 73635
4602 73635 -17998 -22773 45849 12855 6505 12847 -24421 -41608 -57702 -30160 -11500 7708
4590 7708 21597 79704 61693 12586 -20841 -59927 -47584 12444 55835 35319 -34989 -82613
4578 -82613 -73390 -43146 29229 43061 82769 88237 102329 25445 -31367 1820 -20739 -85591
4566 -85591 -160648 -153760 -34144 118218 114611 26343 17626 -1807 -6074 -357 -28569 -15326
4554 -15326 11799 -61828 -72291 -84020 -92634 -42140 -30096 -77738 -78813 7601 62560 51060
4542 51060 77608 112756 131137 61464 79591 69461 39242 22284 6773 24512 -26168 -24485
4530 -24485 -26858 2432 7792 4715 -28080 -46007 -39333 -5954 -74260 -52901 57069 88170
4518 88170 62058 7139 -1277 -56808 -87559 -96180 -121881 -73650 -88831 -70756 26036 89790
4506 89790 28294 66957 103870 88443 -15631 -32998 38477 141680 151047 190291 182870 121192
4494 121192 138715 145850 100885 25686 -19493 -40845 -63176 -38705 -20258 -56799 -26284 -17121
4482 -17121 43306 -31059 -51775 -41617 -32614 36503 73860 74713 61754 70974 17180 19022 93613
4469 93613 92694 36159 -13507 7128 -32879 -22406 -4541 23782 21621 10908 22952 68987
4457 68987 63026 30006 -12636 10383 -10867 -78405 -55078 3053 45286 54206 63522 4255
4445 4255 -5721 16308 4913 74326 111631 91098 143362 90911 26289 -29772 -78879 -21528
4433 -21528 4504 -3073 18206 90336 123342 115215 91591 18112 -17082 29633 71568 72979
4421 72979 38059 16908 7416 25098 29457 182204 211934 150264 74583 32434 8795 -41753
4409 -41753 -84920 -60305 -52496 -39762 -37659 -37923 -49371 -98550 -54226 -31049 -13091 26584 89429
4396 89429 104706 91775 31147 -32814 -14027 -36639 -48810 -36490 -44873 -6104 -67528 -47319
4384 -47319 4136 -33550 -104298 -48319 -4823 93555 128945 86005 79895 62339 33719 99083
4372 99083 63719 -20719 -31872 -8815 -10306 -27534 23436 -15168 -27618 -23682 -57809 -88236
4360 -88236 -124118 -94333 -34938 -48928 -52374 -7156 84990 57347 -12495 -28128 -24701 24527
4348 24527 92276 70343 47817 37423 71288 63129 33146 14875 29638 -36100 -70154 2741
4336 2741 29232 31373 52047 -4063 -9682 36692 -5693 -4646 17237 16598 -11653 -26007 12846
4323 12846 77668 118819 99564 73211 28166 -25224 -49277 -51497 -34508 45249 31537 28172
4311 28172 -11002 -107876 -131037 -6921 38685 24932 -47471 -76294 -78242 -42293 45482 67900
4299 67900 124074 102101 49869 95596 105219 10744 -11473 47908 82318 43273 -1050 12870
4287 12870 29785 47235 -3419 -20602 -23736 58102 127406 109175 98283 71493 110955 82708
4275 82708 53761 -9297 -20856 -4757 35188 63164 93629 85724 47859 88288 121632 26674
4263 26674 -71533 4517 632 -70545 -63404 -69754 -74235 61290 91089 36324 -15415 -21721 -2906
4250 -2906 21039 55157 59319 59686 81093 30094 -58637 -55382 -9939 23979 1614 -51071 -58231
4237 -58231 -20430 44000 76257 68536 31074 -30157 -50924 -53287 -26664 15426 -7036 -109145
4225 -109145 -102809 -35008 1670 -31910 -50314 -1092 6826 -32774 -4730 13704 59244 57548
4213 57548 46637 16070 6791 11737 3337 39408 -19094 -69111 -31519 -44710 -92361 -88375 -32915
4200 -32915 -47548 -71272 -26600 -7782 20512 28221 18474 -29474 -64789 -112998 -94377 -75721
4188 -75721 -97957 -96196 -55198 -36325 -33087 -61538 -47136 -966 71990 91785 96304 62413
4176 62413 22143 6616 4423 49801 121361 76567 42100 56641 5881 -5154 44164 44936
4164 44936 -3543 4213 11851 -37587 -23086 -21957 6396 -2628 -589 5764 21647 59623 169585
4151 169585 232074 167404 117818 71217 60837 -37424 -669 55502 45187 73522 122110 124894
4139 124894 124241 78214 29419 24234 23536 3433 -40239 -44085 -7219 43358 46433 -44694 -67364
4126 -67364 -110116 -62434 54814 -14121 -29507 55526 46345 66550 167289 176632 126780 65645
4114 65645 33700 6729 -23949 -30133 5273 -59339 -64433 -62800 -14360 -10438 25778 31751 22297
4101 22297 45955 79693 67403 77494 108427 96539 134446 123410 58844 -33056 -49464 574
4089 574 45634 71179 66490 50126 50925 77800 62069 28994 -21593 -111983 -98114 -92058 -66626
4076 -66626 -49042 -60715 -63190 -5776 -52647 -38179 7039 31143 -19213 7879 -4198 -12279
4064 -12279 35448 -4725 21091 43750 -16903 -46288 79780 108211 42726 41124 13222 31384
4052 31384 29586 62007 116218 125161 41704 -40434 -116647 -96567 -18372 -13787 34048 69161
4040 69161 51244 -18394 -111106 -82871 8912 54114 67923 54407 -7584 -74054 -43548 -23785
4028 -23785 -9182 -47469 -96627 -65877 -37922 -72198 -36953 10304 69246 53756 49261 4882
4016 4882 -4338 -29317 -14523 -39305 -90789 -76914 -42348 32746 -2550 -90791 -125350 -110058
4004 -110058 -43518 29444 -55578 -118840 -134159 -45434 20528 28957 64162 139147 136923 67315
3992 67315 69476 50519 56243 10265 -39946 -9077 -14808 -12748 66060 71709 91643 47052 2380
3979 2380 -12486 -29852 36695 88656 87762 36037 18804 -876 -17493 55007 61864 91453 60623
3966 60623 -3778 -98588 -75051 18840 40391 3023 -66675 -69323 -24929 10476 61000 99945
3954 99945 110039 126501 101385 68545 43565 54019 44263 42170 -48769 -78270 -56305 11986
3942 11986 1016 -48556 -41865 -12839 7050 -16745 17054 68981 33309 -12561 4957 13391
3930 13391 -14130 27327 40353 57720 31031 2898 -38924 -95480 -83974 -77175 -48758 -32209
3918 -32209 -96425 -127303 -71913 -13292 17736 -15175 -31603 -46809 -47688 -26864 6410 57083
3906 57083 67680 78643 74766 14211 -62376 -95545 -18502 -7414 -6332 -5336 -61154 -76132 -82623
3893 -82623 -48914 -70718 -71536 -29181 39850 71805 65206 48117 12218 -2476 -57131 -77860
3881 -77860 -7231 50948 10836 65936 14926 -37878 -119038 -160338 -137460 -115543 -97551 -103442
3869 -103442 -94475 -83573 -81428 -40550 335 -27583 -17532 -8484 12871 58695 116274 36317
3857 36317 -50813 -4776 1906 22856 40660 71794 68774 29947 16094 54460 -33572 -83862
3845 -83862 -83699 -12820 1590 42125 28684 15587 91850 97017 56774 71126 31711 27240 4875
3832 4875 -1989 -29729 -46176 22169 27199 25227 -17461 -31266 -2669 10124 -41102 40260 126782
3819 126782 87821 -9003 -20071 -9169 17691 4151 -43705 -55955 -21004 -8301 13463 -25581
3807 -25581 -25989 21861 -20929 -32951 -87280 -198068 -170184 -90526 -49681 -3715 33808 75143
3795 75143 117947 72656 43876 -25452 -835 18358 61517 52955 61016 35692 2662 -28236
3783 -28236 3862 -18868 -83258 -22727 19115 67976 42408 14001 -51496 -36085 -25590 -66353
3771 -66353 -21507 8580 -54360 -140917 -72989 -48790 -60631 -65457 -61462 -44343 -37488 25877
3759 25877 19771 -15793 53485 115801 93300 -1113 -46018 -15440 -20154 -28028 32893 7257
3747 7257 -40281 2427 117772 154446 183414 169156 142462 64412 57936 29081 21938 -6741
3735 -6741 32048 100334 118535 129380 61839 -41343 -101322 -114170 -85756 -53420 405 50654
3723 50654 48686 12446 41313 50405 67422 42642 6524 3463 1260 10489 97860 46225 -36691
3710 -36691 16148 47953 -28879 -24976 557 18292 16982 -5458 -36092 -41058 10793 -26620
3698 -26620 -52921 -72391 -26158 -32111 -39988 -20423 -13233 44394 64335 48675 137271 190958
3686 190958 258942 213870 102384 -27710 -20165 64514 149200 155982 97002 60184 30786 47681
3674 47681 57665 87656 113813 99524 77523 25977 27177 45163 8868 -54748 -36412 -17021
3662 -17021 -23824 -29641 -34274 -674 79081 108238 132506 186243 196858 198781 181784 113835 58403
3649 58403 37416 125 17969 70857 75617 70828 19301 -10008 36964 70393 69588 97045 75015
3636 75015 41657 34682 50447 27543 19964 19838 43491 25234 -2748 45990 131866 141035 151048
3623 151048 137110 85564 68394 120578 175016 168815 170561 114405 10864 -92549 -99518 -102796
3611 -102796 -94767 -55580 -88611 -86450 -44137 -120260 -145136 -56223 -65426 -75835 -31087 -502
3599 -502 -48015 -77604 -15008 -20527 -66576 -5928 23324 14679 43229 4750 -16347 -22209 -62277
3586 -62277 -39899 2912 -47961 -38549 2058 -23119 -105918 -48564 -17346 -30778 -61768 -36070
3574 -36070 -48302 -70941 -28539 43394 63447 -34646 -108491 -125185 -122123 -101319 -97960 -48720
3562 -48720 25937 55944 71952 82575 11433 -16527 43595 39843 750 -74483 -152199 -194197
3550 -194197 -193102 -121633 -55352 -62843 -106913 -83027 -64990 -55175 -25795 -14029 -50698 -18865
3538 -18865 43246 71463 125265 103690 62791 2180 47034 7847 5414 71194 68093 54361
3526 54361 10771 -4857 -2168 -12883 54719 65774 22833 -6172 52791 82878 40088 89149
3514 89149 -3635 -44414 -51786 -27193 5273 6126 20970 4891 26945 30295 -1490 -63044 -118214
3501 -118214 -138265 -79307 -58853 -44062 -27461 -12611 3711 21782 29292 15305 30648 118461
3489 118461 92983 40108 41140 46256 47239 56726 125037 108008 67708 18966 16781 -23866 -10140
3476 -10140 -4332 48062 101794 87380 36675 -14623 -50609 -7941 -45144 -89921 -34465 -46406
3464 -46406 -30436 -538 52578 43046 -28624 -85428 -81057 -67949 3468 -3487 10701 53684
3452 53684 89638 89628 54927 32596 66642 66938 100926 59413 20303 -1142 4691 -67386 10435
3439 10435 46045 42695 50198 35323 28564 74893 30012 25396 -15707 -35701 -52010 -21656 -39919
3426 -39919 -41139 -39833 -6682 -20948 19062 -26252 -112496 -92638 1842 49317 49316 776 14185
3413 14185 39755 13165 -27091 53249 88983 29764 11636 10609 61773 141747 97208 86366
3401 86366 111970 86207 13729 -17144 21426 -19346 -65469 -57175 -44960 -65024 -107708 -79748
3389 -79748 -82287 -89536 -35897 -8994 -33387 39629 75598 6170 -67402 -45312 -7459 -25913
3377 -25913 -14798 61794 54630 27113 7960 4783 20632 85777 64681 34720 72413 54637
3365 54637 114808 113635 157651 114039 77915 24081 -41474 -44658 -82033 -54565 43906 10095
3353 10095 34238 70653 20347 -53497 -82983 -35592 -15870 5045 -58053 -63632 -51239 -32756
3341 -32756 -40226 -3543 346 -39164 -80524 -109039 -89462 -55853 -54574 -70736 21804 29542 -29547
3328 -29547 3558 40611 64493 30311 3586 30680 -5124 -27498 -7858 40937 71336 70659
3316 70659 62003 38583 -24130 -122681 -120172 0 40066 -3089 60392 77547 33001 -8758
3304 -8758 36551 89911 92970 37038 -54533 -61897 -73773 -55327 -33043 44060 65490 96372
3292 96372 94074 59181 67834 48335 44069 9095 14591 35559 21219 -90018 -124803 -115585 -27755
3279 -27755 -58951 -50908 -68493 -96745 -124012 -138687 -183782 -172941 -181249 -102787 -53787 -62935
3267 -62935 -15155 11791 14817 -38432 -84763 28500 70256 14110 -75406 -30815 11171 65279
3255 65279 18810 -78258 -45397 16425 2774 4215 11675 33619 7328 15083 85941 148328
3243 148328 116474 51373 -16561 3792 46853 49907 1824 -34702 16077 47850 50090 75491
3231 75491 71705 977 -23217 -19136 -12634 76002 60587 28489 5710 -23859 42162 39640 67569
3218 67569 9819 -16653 -18473 22951 5378 -14871 -14798 -42340 -96290 -140169 -157710 -147598 -144640
3205 -144640 -88623 -35298 -40300 -5567 1805 -74097 -21654 7763 26062 38366 15415 -13941
3193 -13941 6101 36190 -16368 -22378 -39833 9663 52632 -15944 -59516 -19885 -14770 1674
3181 1674 28311 -7051 13712 -23564 -17924 10429 36131 13626 4734 -34988 -35179 -30294 -108439
3168 -108439 -104857 -12807 -41645 -40848 -65314 -36236 36252 67718 84704 96015 25240 -3616
3156 -3616 -43125 -50896 -55353 -52832 -81180 -104860 -69121 -70823 -102880 -149102 -48744 36153 40799
3143 40799 78401 122856 123178 117315 63121 -2599 -6257 -26076 -92541 -113239 -50700 3033 27629
3130 27629 79478 88195 65222 72168 84590 31737 15191 -12877 2472 5370 -12199 24165
3118 24165 52663 19599 705 13870 41097 -25496 -4657 19867 9309 13439 -18337 -37233
3106 -37233 -1542 7510 8894 33331 18122 9320 -27753 13020 -17952 -38794 6870 -26208
3094 -26208 -22910 51508 36517 52454 45009 21338 53615 50390 -4138 -48758 -9708 12835
3082 12835 32600 -3651 21723 19926 -46917 -34051 5456 -21962 -52466 -48278 -22859 -39779
3070 -39779 -41127 39021 27671 44791 96686 96219 66217 48226 44458 -73 -5460 -7311 -14887
3057 -14887 -28630 -21334 8076 93049 99552 42565 30359 46465 27270 48086 12175 4943
3045 4943 -15684 -981 -44332 -63233 -55182 -20330 25840 77164 99893 81836 135166 103740
3033 103740 49139 971 40545 22173 -279 52368 72648 58884 49439 25336 3726 19103
3021 19103 14155 3569 -2009 -9172 -35271 -7119 76412 31595 38841 2370 -66785 -103974 -68696
3008 -68696 2611 25628 -18470 -72851 -87560 -39800 37329 85271 2063 -22580 -78769 -91922
2996 -91922 -31823 -1380 -40500 -83780 -46947 -30179 -84440 -77224 -47976 -79225 -81059 -28371
2984 -28371 -44903 -60479 39540 78842 6053 -69437 -81207 -76668 -35042 -59176 -4862 28790
2972 28790 72269 46793 30856 -5217 -66281 -111644 -117463 -18793 50552 20129 -5581 -27813
2960 -27813 17877 -53700 -54139 64774 120630 76551 32343 11562 12864 16764 -49495 -25019
2948 -25019 -16993 -58324 -68230 -105998 -56502 -26156 -10427 16499 66633 30971 -3511 -27652
2936 -27652 1011 17646 31332 11428 -33413 -67075 -86994 -36722 58113 47151 -9329 -13941
2924 -13941 52200 70650 14555 20263 76 21810 -24944 -89845 -74147 -57463 -48081 -82377
2912 -82377 16594 51189 49654 42145 -13776 -36633 13717 30696 64941 117523 168595 190640
2900 190640 220498 174485 180086 121758 52884 -27590 -20008 56741 74944 71715 19003 61183
2888 61183 89426 34817 9461 18266 35741 62235 51628 12862 47554 64047 126835 138031
2876 138031 157088 151969 135042 127776 92216 61524 74585 112042 83355 45618 -13151 -44660
2864 -44660 -40036 30272 73831 11700 62057 72564 73739 101857 89926 42188 10760 48969
2852 48969 98750 87647 60890 -21843 -11008 38007 21009 30717 70311 73513 55354 66480
2840 66480 51804 16948 49236 64810 74486 63384 38140 1587 -9844 12806 65459 65470 70624
2827 70624 20512 -25610 -28787 -5041 39144 40395 -20489 -68565 -36433 41114 3010 -43503
2815 -43503 -43079 -31731 456 66685 62157 37849 96118 135245 74483 39463 -34581 -17930
2803 -17930 25585 100206 103390 137604 86926 68880 3350 -25010 5961 24082 35182 31115
2791 31115 -100163 -164278 -146232 -121620 -78111 -54353 -3566 65271 -6635 -13970 35126 -27855
2779 -27855 -73849 -54558 -95106 -63692 -43768 -33050 36146 29028 -66286 -121114 12734 111466
2767 111466 69701 24499 -26742 -49910 -28083 -24037 60072 92895 107833 101974 33258 -12971
2755 -12971 -13965 -10979 -27568 512 -32801 28394 64655 31175 -4125 -7098 -17572 32214 -17275
2742 -17275 13002 -4031 -872 24071 -32449 -112216 -57271 -5622 -9793 -28677 -62498 -69966
2730 -69966 -90789 -32052 47158 -15373 -85926 -104840 -52692 27966 95460 104179 32751 16712
2718 16712 24763 -20311 -75085 -78402 -34529 -57072 -33937 6640 -16356 20856 24226 35850
2706 35850 75357 14628 -87225 -120483 -44772 16434 -50145 -76092 -62930 -24986 21747 73521
2694 73521 121724 104997 90381 49543 62223 59854 68912 52923 -43106 -103924 -114267 -98221
2682 -98221 -34597 -40739 -19171 -10119 -61340 -74008 -90565 -86459 -71018 -63072 -76914 -97258 -132480
2669 -132480 -122998 -120272 -130805 -150799 -80596 -33036 -44021 -49086 15914 46957 68271 69660
2657 69660 38867 52844 5839 -19848 -2424 -11790 -27548 2266 17699 -71407 -19988 62620
2645 62620 -1662 -50557 -79843 -106598 -57318 -31695 17739 91971 100191 108335 76993 18478
2633 18478 -54895 -75618 -57234 -57955 -23517 -65193 -40127 7965 943 40359 51278 43230 55575
2620 55575 81588 48089 58098 82758 27662 -26887 -16408 37696 33822 -44181 -55079 -14799
2608 -14799 8680 16995 24121 48304 54278 24410 -36446 -27819 -17426 64743 98525 74459 34429
2595 34429 60245 50336 48243 -25245 52228 41780 -15338 67020 94195 110067 127496 124378
2583 124378 122081 66505 36432 66264 -4906 -44014 -2552 59668 61419 7673 -14858 -1427
2571 -1427 69859 118967 94945 119768 111098 34292 -22999 -38018 -34179 -13536 -18006 22414 2668
2558 2668 45714 105514 72587 65960 70244 30004 15889 51743 89617 136304 140174 76844 8236
2545 8236 -16966 65861 102465 57092 -37291 -57436 -52699 -10144 3197 -14329 -26417 -30823
2533 -30823 -26679 37399 70728 45996 53060 107264 119618 158647 228907 206332 139483 61682
2521 61682 23265 11580 53289 65993 73625 99313 123842 75270 -26129 -47333 -40844 -16907
2509 -16907 -52426 -33932 -40604 -8088 93243 90175 46152 -19322 -96636 -103769 -7408 59695
2497 59695 36024 3847 2048 10692 -3170 -31762 -65693 -133883 -136889 -94246 -61954 -62189 -151813
2484 -151813 -95057 -23301 63357 56367 41526 -3380 -8325 39672 35414 32307 -10453 -30593
2472 -30593 -68484 -130627 -107458 -102029 -53789 -43698 -73857 -94648 -86301 -70228 -38739 -35499
2460 -35499 -52118 -56902 -55306 -35319 4649 6462 28642 -23995 -80430 -63761 -23614 58682
2448 58682 21998 -46492 -46742 -43643 -47968 -55758 -23208 25902 -5555 -5014 -18311 31495 51054
2435 51054 46392 -33391 -65122 -33656 -25693 -51882 776 59258 42863 86405 54280 -23760
2423 -23760 -57609 7574 55246 87364 77183 68183 15753 1956 58080 101450 68972 -12305
2411 -12305 -57711 -126395 -115814 -78837 -77589 -31685 1913 33851 -36623 -53572 -30862 -9225
2399 -9225 7560 40821 65300 35231 -3999 5782 21292 104308 147284 140405 107153 49892
2387 49892 11840 -3688 -57818 -24320 138 -7537 63945 143574 164416 126141 101837 49047
2375 49047 -29184 -8781 -1374 -29555 -12393 30826 24030 -19446 -22247 15421 3645 -53001
2363 -53001 -119652 -104676 -46324 -29744 38120 92422 111740 121434 112713 47534 -26815 1877
2351 1877 8057 -5220 -48327 -27900 27365 64963 54274 14491 -13104 -31135 -1098 -24475
2339 -24475 -142333 -195122 -142350 -78423 -62913 10438 -11767 11323 -8533 51155 59622 26649
2327 26649 57398 4877 -47266 -59238 -88052 -107438 -89487 -52346 -12887 -46885 -95982 -17935
2315 -17935 7739 57273 28269 -60995 -80535 -94365 -73699 -44204 25894 144603 105379 29715
2303 29715 73623 73528 51450 60818 74428 4547 -87814 -89383 -90800 -81128 -42174 -32166 -20249
2290 -20249 32849 38326 9756 -53992 -84025 -37371 -23630 -75269 -81447 -46446 -47369 -62843 -79029
2277 -79029 -21944 -114310 -145124 -99093 -67206 -99300 -102772 -119710 -107751 -67496 -69639 -12627
2265 -12627 3809 225 2329 -21105 1939 32602 45334 79900 50129 -21048 -66013 -89816
2253 -89816 -35560 48516 14509 -29413 -12267 75385 67350 -14500 -59740 -84855 -88809 -122879
2241 -122879 -43780 -30190 -45109 20175 30207 -59593 -67292 21575 16440 53357 61527 41185
2229 41185 54218 55643 45519 43088 22396 37153 82520 43786 -24412 -35319 -10993 -24396
2217 -24396 17295 117604 154819 146241 102451 54609 74104 46221 32252 86552 119394 151261
2205 151261 113970 90356 106778 61134 35082 32335 8568 56642 88324 121341 113843 130616
2193 130616 137746 112085 100788 124542 94529 65506 40143 -8252 5942 59151 15934 -36910
2181 -36910 -9981 9495 25061 73229 62478 85653 41919 -11281 14499 74732 39268 -5617
2169 -5617 34759 10562 -67579 -54578 -70846 -50988 -98035 -99109 -55761 -39745 -38294 5769
2157 5769 24294 19042 26627 62741 69440 30594 -7992 16021 -20865 12912 32202 -2010 -28598
2144 -28598 -16164 15075 42696 86800 85381 21000 -40486 -18313 -42620 -18286 78705 93435
2132 93435 102481 116585 105661 63574 18311 -1010 18162 75530 85681 29473 -22489 -31823
2120 -31823 -62197 -99885 -61570 -3262 27920 838 -43550 -104403 -87420 -18906 -54016 -63285
2108 -63285 -84680 -44231 26262 21723 -8578 4978 132746 192059 106830 57527 -85815 -107709
2096 -107709 -32609 -46888 -96042 -48656 -19648 -33764 -14639 29487 40073 16567 -3437 -66802
2084 -66802 -86581 -57633 -24780 -36248 -16164 1256 -1158 -84841 -123794 -57417 49480 52453
2072 52453 46315 -36158 -70561 -7593 76465 91875 17614 -28758 -592 -49083 -43406 1872
2060 1872 39023 38869 -18921 -11863 -34094 -64580 -66149 -75421 -72755 -61833 -41583 31299 11660
2047 11660 52028 55039 3617 -22172 2712 48953 44131 75623 122479 113098 40378 61107
2035 61107 46241 7921 8664 41653 72970 20363 -53807 -9413 -33631 -83228 -122477 -121317
2023 -121317 -114160 -96469 -19987 31826 -14860 -29445 -40182 -38365 -27533 -29040 -72170 -73696
2011 -73696 -103121 -115068 -24773 31312 15621 -27728 -40118 -99801 -73436 -37996 -54203 -33902
1999 -33902 25280 72502 74604 39760 -36793 -15444 27275 32194 14253 7803 -64807 -71213 -28971
1986 -28971 7330 -44116 -59296 -58402 18692 33660 -18314 20055 68984 79520 81029 44871
1974 44871 -113 -53417 -54821 23259 60104 23963 54304 28077 -17919 2761 81145 70531
1962 70531 -37880 -103944 -76004 -6221 -1753 19660 4528 -8149 32759 28661 42469 47688
1950 47688 16020 31137 -16946 -77185 -55744 -106728 -107609 -75878 -83731 -87534 2938 5698 -65025
1937 -65025 -40123 16826 -4572 -72779 -55495 -5446 -51289 -78414 -92580 -66767 -108424 -147462
1925 -147462 -60269 -22051 70370 19257 -80312 -75862 -87083 -65517 -51052 -47902 -20060 -8934
1913 -8934 -32600 -57386 3720 -12814 -51786 -54251 -30274 -35502 10268 -15423 -80009 -110123
1901 -110123 -129192 -119956 -28546 28823 100955 38088 37002 104146 36040 -16748 -5427 12652
1889 12652 -37104 -13995 34570 103387 114983 134269 -8260 -49255 -19609 26549 49374 60107
1877 60107 64081 23292 72624 64798 -12542 -11865 13572 6901 7032 35961 70792 103375 87918
1864 87918 67448 50619 98010 129640 103045 77747 94931 -9707 -33612 -39180 -72337 -88118
1852 -88118 -66064 -23229 -2066 41694 63116 129155 96009 62788 59488 -49589 -94118 -80076
1840 -80076 -18363 18571 -33470 -10902 62414 65723 103283 34323 -11846 -23942 -78610 -125461
1828 -125461 -28425 54529 839 -8816 17796 25799 71484 81019 55588 82775 145296 193866
1816 193866 190915 152506 89057 32907 4796 -4411 9268 -3158 -67079 -102950 -74040 -36753
1804 -36753 22224 15139 -54099 -101116 -88744 -132593 -63435 -6499 1131 -15278 33704 24761
1792 24761 25074 28415 -33694 -36415 -8659 -36884 -101858 -41989 -16573 -13451 40819 84304 114314
1779 114314 121914 60338 23464 59471 89194 63518 -2546 40676 43579 3119 -49066 -80793
1767 -80793 -74739 19163 89803 68324 34568 12930 82324 47123 2942 51414 13754 -20971
1755 -20971 -38589 -34928 -17148 -3326 38143 108434 134368 119984 116216 130926 122575 71401
1743 71401 3726 4424 26936 26176 -16498 -3593 -3612 -30729 -55688 -42813 -55848 1811 45450
1730 45450 91664 127963 82642 83018 80231 -16543 -62795 -35211 47964 100408 80732 35799
1718 35799 -13993 -11230 38553 9774 -127 38602 44271 -710 39833 18158 32873 -32422
1706 -32422 -49206 4454 54470 34112 -14675 -52951 -92456 -76219 -30001 54464 111708 108631
1694 108631 112256 122367 35240 -48857 -89936 -94591 -73493 -34095 -16012 -19627 49210 68914
1682 68914 56862 48364 34648 37175 5744 56267 102878 88062 76538 86632 106208 92272
1670 92272 65079 71963 48745 27348 18636 -42127 -73265 -61267 -47639 -55150 -33189 -18041
1658 -18041 -59755 -129066 -42568 -1831 -12738 -5683 7584 61395 83521 99484 70641 52186
1646 52186 100530 81310 45354 -36265 -3557 6593 -42444 -70168 -95767 -5420 -57781 -105655
1634 -105655 -169803 -178400 -164489 -131575 -108248 -99933 -104267 -130953 -75746 -9175 20797 16637
1622 16637 -19286 -40882 -77537 -24535 5805 -112800 -182405 -178608 -201359 -151550 -99389 -46048
1610 -46048 -69467 -76695 -67037 -80060 -39008 -50132 9468 35176 52168 8627 35878 76931
1598 76931 49884 -16973 -69190 -104156 -134611 -225347 -206806 -52678 48397 51030 20205 -48495
1586 -48495 -52590 -120896 -132801 -66276 11228 92333 53788 26707 41797 -10244 -44732 -65332
1574 -65332 -31520 -22604 -74564 -101938 -61789 -47579 7540 -16256 34989 23249 27445 54847
1562 54847 11148 -31461 -66993 1270 85529 44287 13265 -48464 -160058 -164420 -185003 -131904
1550 -131904 -57046 3027 -12523 -102316 -107120 -92515 -61166 -49680 -29657 15125 -5098 -18705
1538 -18705 -33970 -44043 13004 25359 -27458 -102455 -125872 -95257 -98952 -29378 10013 41303
1526 41303 36381 5826 -38463 -57123 -46717 -79445 -110709 -87275 -86573 -105299 -76580 -47509
1514 -47509 -54332 -33302 -2824 3731 54336 57129 31706 99555 138389 81715 21339 14931 6847
1501 6847 28900 14631 -6649 -19033 5892 40900 49727 32302 37810 44191 -44193 -67658 -77066
1488 -77066 -81434 -4668 -20978 -63791 -42962 -7903 44541 87867 80017 55956 57941 63743 85204
1475 85204 117610 15764 -23921 -10798 13318 3400 -2166 -25656 -36535 -8399 -35774 -10644
1463 -10644 50244 55835 10396 29482 48444 4481 15869 34373 26348 35551 39813 67779 66336
1450 66336 71950 74638 40446 -8696 -19837 2670 -6811 -54514 -97961 -78003 -31873 12698
1438 12698 22357 46856 32531 24664 57576 -46025 -55046 -49975 -34595 -53509 -70611 -56182
1426 -56182 -25819 -20555 -30790 50171 45132 -60065 -40057 10529 -44592 -27768 -3326 -22009
1414 -22009 -27878 -1111 -13874 8132 49652 71074 21337 16040 15806 69777 47815 -79661
1402 -79661 -10850 8946 6481 83631 78648 125061 87605 43199 48231 74653 70459 7137 -23289
1389 -23289 6790 35177 28690 -13062 -56377 -66806 1196 59529 74740 34960 25958 41731
1377 41731 -10527 -58811 -111899 -121525 -94337 -44074 12100 -24506 -28126 9134 46145 51544
1365 51544 2688 20614 19849 -35795 -7526 77487 123068 107039 169887 178019 132823 29055
1353 29055 -13894 -7481 -31861 5046 77676 194933 214809 146450 125644 113059 45831 -6175
1341 -6175 -42883 -13317 53095 45996 -21077 7236 71510 106437 51523 -246 -16540 4323
1329 4323 -15919 34043 16869 -5634 -16389 3831 64380 46329 52751 41128 2950 4785
1317 4785 32036 97335 79007 -16643 -46697 6859 65165 65015 29837 -67515 -62971 -17297 -41259
1304 -41259 -94094 -68659 -20127 388 36364 57120 61368 83196 135874 126527 83004 54143
1292 54143 58025 65185 61098 17341 9600 -20295 -31040 -25707 -6829 24151 76164 75556 -11746
1279 -11746 -92548 -57238 -84081 -35471 -66557 -74321 -101091 -81337 -45036 -24090 -35208 -53567
1267 -53567 -98818 -111841 -103506 -87064 -25468 30071 31602 13713 30700 -14422 -26292 -29586
1255 -29586 4823 44134 -16004 -75354 -62471 -44402 23604 26762 91050 145998 104683 39073
1243 39073 -7886 -382 19943 53229 45949 25085 2419 -18495 -11575 10297 19043 9883 -6618
1230 -6618 -43579 27912 103689 49008 80193 71403 29526 -21455 -29580 -53482 -61304 -51033 -21342
1217 -21342 -76077 -161583 -109801 -55917 8141 -4309 58718 65621 36345 -3907 -59047 -66131
1205 -66131 11989 33025 7277 53936 22315 -14961 14191 41609 -6863 -116778 -86963 -93858
1193 -93858 -93457 -46092 -29422 -48752 -35638 -21304 -47345 -30831 21430 12640 -28362 -97683
1181 -97683 -78138 -98128 -64639 7289 26545 -18707 -6462 7568 100539 126608 85199 40751
1169 40751 -38229 -74289 -89756 -77208 -85803 -80139 -36882 -38083 -68226 -27093 -32999 -29122 -33715
1156 -33715 -100565 -128955 -93559 -66171 -46214 -66944 -77161 8609 41324 59985 21636 -11077
1144 -11077 -41068 -105013 -73230 -62666 -16502 37394 51665 43164 -24513 15906 24263 -20121
1132 -20121 -83402 -26977 49381 75241 21000 -39546 -44612 -57409 -52903 -29290 16368 57230
1120 57230 68135 16427 -51592 -52457 -63956 -86596 -82866 -60313 -58126 -66572 -38072 -44403 32071
1107 32071 98976 131353 129495 71490 92739 108311 119391 130858 21940 -25312 -3656 41089
1095 41089 -3376 -114827 -123789 9703 19306 -45154 -69811 -83631 -36023 -57379 -47947 -32329
1083 -32329 -37510 -79036 -16037 44932 41948 31449 7416 -20277 -48928 15699 87055 29062
1071 29062 -71153 -44347 -32110 11517 66179 89036 63195 49947 42779 39676 30348 80877
1059 80877 66529 54400 26674 86025 77063 13892 -9361 -5779 -86370 -81665 6017 101234
1047 101234 47705 -42116 -1395 45485 12088 -39262 -16714 -4844 -17719 -39029 -28463 -27714
1035 -27714 -56074 -70108 -121024 -97237 -67603 -88377 -57355 -22458 -55425 -81270 -61375 388
1023 388 13774 9013 45307 63855 59656 -40568 -13906 2337 -48823 -20879 32668 80528
1011 80528 154710 149583 95571 115704 74151 -11863 -61821 -123590 -131065 -102989 -98894 -96906 -70683
998 -70683 -60893 -2113 -963 -28744 -119328 -102203 -5356 -34098 17254 -8926 -34273 5017
986 5017 24962 43958 9404 -46400 -46428 -88346 -135468 -142402 -109319 -68955 -108213 -124700 -78625
973 -78625 -55842 -57395 -27343 -40442 -57517 63532 59832 -20490 -11981 -13355 1349 54752 39092
960 39092 -47292 -56078 -12463 62654 102973 114577 85896 35489 53214 -20253 -51044 -54694
948 -54694 -69511 -17260 27475 -8746 25059 54206 26617 116850 93488 49653 63619 30875
936 30875 25865 49410 25803 14454 -14707 -67787 -60238 -21284 46517 26490 21076 -29145 -32685
923 -32685 -4544 -35804 -78044 -63237 -19194 16243 19964 -74429 -148478 -96537 -23125 63527
911 63527 70041 12796 42796 112869 109050 100471 123900 124630 74235 90037 82099 94573 57728
898 57728 28730 -9194 -39299 -40383 -98872 -34651 -27729 -79610 -113275 -108308 -55260 61727
886 61727 76013 27493 19241 -69226 -76558 -31717 -39578 -74228 -109860 -97219 -147429 -131034 -88066
873 -88066 -106424 -140442 -148257 -116321 -131950 -53441 -28716 -25851 12012 50220 61533 -35646
861 -35646 -70930 -24928 9137 72343 136004 148857 96563 70313 52448 27100 18508 41975
849 41975 50396 46548 60396 78636 15025 -9769 -39617 -65096 -83176 -21728 34730 72279
837 72279 115532 94351 34651 15778 64004 15044 58651 106526 142472 138978 113541 108669
825 108669 83391 94932 95868 90690 83793 47512 -9528 49901 90660 90689 30140 -12770 -30338
812 -30338 -113985 -144321 -81452 -69994 -72544 -29595 23338 40645 46461 15095 18351 43943 49659
799 49659 82173 43888 -21656 -28911 49320 61114 14003 -68855 -69548 -51801 -15431 -62979 -90770
786 -90770 -58743 22938 29791 24992 52819 -26945 -63766 -67239 -7353 -36257 -31872 -23418 -19685
773 -19685 -29763 -28156 -37628 -72181 -76758 -25993 31932 58577 102896 101797 93621 57594 -11233
760 -11233 -101027 -36718 36760 11208 -20460 -3553 -60575 -70701 -82797 -55544 13402 65214
748 65214 82074 60784 73646 101866 59803 119561 148631 133529 77844 48444 32954 -14457
736 -14457 -23653 -29955 -45931 -26135 -85206 -141930 -145366 -99103 -109871 -57850 -10618 52402 36744
723 36744 14517 25484 20020 2019 -30569 -24232 54830 80845 67934 -22097 -4157 79002
711 79002 141815 217510 148795 48162 1960 -38523 -54922 -37311 -12645 41627 71984 59083
699 59083 6737 -9254 -57906 -59423 -31466 -31170 -97948 -47908 -8564 845 -8071 1388 -1179
686 -1179 -36138 -53895 -49417 -39119 37932 4792 26865 120863 111579 88373 68941 -9739 -56006
673 -56006 -82146 -147861 -107189 -79767 -168973 -176794 -27417 37827 998 5934 8442 35226
661 35226 21780 -53882 -62425 -22903 47254 82448 30189 17440 67532 47326 2054 43440
649 43440 96969 47739 30688 70444 48983 34237 52334 47328 39221 70516 80646 15774
637 15774 -2290 23183 40567 31059 -58369 -75754 -70118 -94679 -153360 -116029 -86507 -91606 -110738
624 -110738 -176534 -118683 -120662 -113532 -57820 2637 39222 62339 77865 71995 55503 27859
612 27859 46253 107797 53253 1098 17806 32950 17037 -40804 -57151 -35300 -45076 -79806
600 -79806 -33045 -46552 -13214 -6004 18457 5850 2880 -64858 -121678 -67926 -5825 47321
588 47321 72164 36200 9403 -48247 -35093 11835 18703 -5266 -5131 78735 62239 26368 9008
575 9008 -47164 -17999 8180 3573 3063 29826 61401 52030 49880 27177 20962 -19985 -31532
562 -31532 42438 59015 89963 89169 31763 13303 25327 63177 -14612 -70876 -22555 25440
550 25440 13834 -46990 -18733 -14940 -43008 -64261 -11494 18005 -5598 28889 51521 -97601
538 -97601 -152130 -39197 17166 29951 -18655 -88544 -13904 36977 50347 123284 120564 43867
526 43867 7760 28033 10408 6687 5444 -18548 -7665 -4064 -21712 -49710 -27475 93283
514 93283 112101 25662 3035 21466 27 -3026 -51298 -65300 -107232 -93345 -24467 56965
502 56965 41078 42334 72962 76232 69442 49903 57570 22731 4771 21331 62445 77716 -25545
489 -25545 -103376 -78039 -19612 1337 18467 231 -65406 -172347 -228247 -162486 -99624 6128
477 6128 16492 22262 57038 56111 -11954 -13148 7670 18966 -20902 -21082 8563 1078 49034 147563
463 147563 226495 150923 60860 78945 108651 134705 85187 37836 -1171 -19333 -52447 -69123
451 -69123 -78287 -32254 52225 50090 -3182 2631 -16977 -19746 39239 131778 130366 3669 -134139
438 -134139 -108311 -56830 12585 87938 43135 52083 48534 29923 57668 103305 105061 11652
426 11652 13610 35737 31185 52870 18897 -27846 -66004 -82902 -30300 -22477 3574 -8500 -41836
413 -41836 -25015 -38938 -94875 -134594 -137902 -86828 4615 35902 43532 3470 -105820 -189341
401 -189341 -132549 -35789 19448 5773 -2046 -17089 -8540 40523 18632 42379 76894 70179
389 70179 6330 -11868 -62086 -67092 -42460 -63720 -12883 10822 -14615 -8468 66533 93831
377 93831 33874 -1188 15239 -70344 -135400 -47468 12603 12340 19940 26067 57353 116426 139512
364 139512 125238 127041 69406 40756 22035 -14491 -2229 -2082 15073 68502 97840 61437
352 61437 46643 20767 9655 22079 32033 58030 117539 109014 103721 140354 103441 82637 62311
339 62311 69298 71108 9498 -45132 -36042 -29500 -10062 -27074 -89334 -71499 -16229 88720 41481
326 41481 -64513 -70368 7246 54497 56182 20784 -15720 -24836 -46332 51721 95160 78879
314 78879 63440 77438 64619 56308 64642 37975 31760 68077 16421 -43705 -31298 17523 17005
301 17005 -26421 38986 43421 -4899 -15752 22248 -1412 -66538 -136471 -79976 11079 7340
289 7340 -47980 -90121 -102712 -24351 35560 8862 -37666 -19166 29905 13368 -19695 -51514
277 -51514 -37820 2448 3006 -29484 -62519 -19394 -1353 -17787 16783 48800 -21860 -24910 10302
264 10302 25112 18163 -18630 -51918 -61620 -50899 18891 29699 18367 -6203 -22690 6214
252 6214 -9895 -14515 -38206 -14070 19953 -34039 -75450 -105747 -110900 -61394 -13800 -10322 5111
239 5111 47976 15190 -22702 -59521 6301 50005 23943 50237 75353 42314 82512 84862
227 84862 75837 94538 88622 28074 16766 2267 4572 -2128 10563 -32156 -42332 -19455 25626
214 25626 -516 -7675 -16535 18674 -6638 -20402 31714 24101 -57645 -55826 -45881 -33722 -16427
201 -16427 -994 24175 20662 85630 127518 112479 54164 80953 101087 149651 157166 87694
189 87694 13230 -36472 -24093 17548 27513 51245 56265 10001 29670 66090 25699 -8358
177 -8358 -6194 12656 -62630 -43153 19423 44989 68272 81674 81838 68780 104696 115172 82894
164 82894 53709 37840 56091 28815 24406 9946 -16826 -18281 -58647 -55251 -53914 -103593 -88828
151 -88828 -99593 -107241 -76416 -62766 -55264 -48830 -49019 -45223 -27688 14620 8979 -12646 -29286
138 -29286 -53185 -1044 34728 43609 47210 16354 11080 -15578 -24767 7961 53885 23043 29789
125 29789 66735 83634 78942 26275 -18778 4072 21002 -17991 -37082 -11237 17792 -15032
113 -15032 36807 45522 5671 -10614 -8869 -24773 6998 83483 98364 143777 139918 108441 21770
$$ [...]
##END NTUPLES=NMR SPECTRUM
##END=
