##TITLE=Analysis number 317930
Compound Code cc 38301
Book Reference 468/43
Project Code adrs
Chemist Name colinb
##JCAMPDX= 6.0         $$ Bruker NMR JCAMP-DX V2.0
##DATA TYPE= NMR SPECTRUM
##DATA CLASS= NTUPLES
##ORIGIN= Bruker BioSpin GmbH
##OWNER= nmr
$$ XWIN-NMR		Version 3.5
$$ Wed Mar  8 10:54:17 2006 GMT Standard Time (UT+0h)  MAYBRIDGE\nmr@NMR_250MHZ
##.OBSERVE FREQUENCY= 250.131544655141
##.OBSERVE NUCLEUS= ^1H
##.ACQUISITION MODE= SIMULTANEOUS (DQD)
##.ACQUISITION SCHEME= undefined
##.AVERAGES= 16
##.DIGITISER RES= 18
##SPECTROMETER/DATA SYSTEM= dpx250
##.PULSE SEQUENCE= zg30
##.SOLVENT NAME= DMSO
##.SHIFT REFERENCE= (INTERNAL, DMSO, 0, 16.522)
##AUDIT TRAIL= $$ (NUMBER, WHEN, WHO, WHERE, WHAT)
$$ ##TITLE= Audit trail, XWIN-NMR		Version 3.5
$$ ##JCAMPDX= 5.01
$$ ##ORIGIN= Bruker BioSpin GmbH
$$ ##OWNER= nmr
$$ C:\u/data/dgb/nmr/ADRS/280/pdata/1/auditp.txt
$$ ##AUDIT TRAIL=  $$ (NUMBER, WHEN, WHO, WHERE, WHAT)
(   1,<2006-03-08 10:53:59.15 +000>,<MAYBRIDGE\nmr>,<NMR_250MHZ>,
      <created by zg, POWCHK disabled, PULCHK disabled
       configuration hash MD5:
       84 BC 41 DB A1 6E 1D 46 DA 25 12 A5 C1 ED C5 3A
       data hash MD5: 64K
       C3 FC 10 6A 15 6E 68 CE 2C 13 AD 5C 96 59 15 22>)
(   2,<2006-03-08 10:54:10.15 +000>,<MAYBRIDGE\nmr>,<NMR_250MHZ>,
      <Start of raw data processing
       ef LB = 0.3 FT_mod = 6 PKNL = 1 SI = 32K 
       data hash MD5: 32K
       7A 67 2C 5F F3 8D 07 14 EA 40 72 24 FF BF F5 C4>)
(   3,<2006-03-08 10:54:11.79 +000>,<MAYBRIDGE\nmr>,<NMR_250MHZ>,
      <apk 
       data hash MD5: 32K
       FD 78 3D FD B6 6F 5F C5 E4 34 5C 2F AA 35 51 41>)
(   4,<2006-03-08 10:54:12.59 +000>,<MAYBRIDGE\nmr>,<NMR_250MHZ>,
      <abs ABSG = 5 
       data hash MD5: 32K
       09 D0 AD D6 3F 32 E9 61 34 38 F1 FD C1 7B 5E 04>)
$$ ##END=
$$ 
$$ hash MD5
$$ 0A 6F CE 0F 1B 8D 1D 27 B3 4F F9 FD 38 12 1E 30
##$RELAX= 
##$RELAX= 
##$RELAX= 
##$RELAX= 
##$RELAX= 
##$RELAX= 
##$RELAX= 
$$ Bruker specific parameters
$$ --------------------------
##$DU= <C:\u>
##$EXPNO= 280
##$NAME= <ADRS>
##$PROCNO= 1
##$TYPE= <nmr>
##$USER= <dgb>
##$AMP= (0..31)
100 100 100 100 100 100 100 100 100 100 100 100 100 100 100 100 100 100 
100 100 100 100 100 100 100 100 100 100 100 100 100 100 
##$AQSEQ= 0
##$AQ_mod= 3
##$AUNM= <au_zg>
##$AUTOPOS= <11 >
##$BF1= 250.13
##$BF2= 250.13
##$BF3= 250.13
##$BF4= 250.13
##$BF5= 500.13
##$BF6= 500.13
##$BF7= 500.13
##$BF8= 500.13
##$BYTORDA= 1
##$CFDGTYP= 0
##$CFRGTYP= 5
##$CHEMSTR= <none>
##$CNST= (0..31)
1 1 145 1 1 1 1 1 1 1 1 1 1 1 1 1 1 1 1 1 1 1 1 1 1 1 1 1 1 1 1 1 
##$CPDPRG= <>
##$CPDPRG1= <>
##$CPDPRG2= <>
##$CPDPRG3= <>
##$CPDPRG4= <mlev>
##$CPDPRG5= <mlev>
##$CPDPRG6= <mlev>
##$CPDPRG7= <mlev>
##$CPDPRG8= <mlev>
##$CPDPRGB= <>
##$CPDPRGT= <>
##$D= (0..31)
0 1 0 0 0 0 0 0 0 0.06 0 0 0 0 0 0 0.0002 0 0 0 0 0 0 0 0 0 0 0 0 0 0 
0 
##$DATE= 1141815238
##$DBL= (0..7)
120 120 120 120 120 120 120 120 
##$DBP= (0..7)
150 150 150 150 150 150 150 150 
##$DBP07= 0
##$DBPNAM0= <>
##$DBPNAM1= <>
$$ [...]
##$SUBNAM7= <"">
##$SUBNAM8= <"">
##$SUBNAM9= <"">
##$SW= 20.6930455092707
##$SWIBOX= (0..15)
0 0 3 0 0 0 0 0 0 0 0 0 0 0 0 0 
##$SW_h= 5175.983436853
##$TD= 65536
##$TD0= 1
##$TE= 294.16
##$TE2= 300
##$TE3= 300
##$TEG= 300
##$TL= (0..7)
0 120 120 120 120 120 120 120 
##$TP= (0..7)
150 150 150 150 150 150 150 150 
##$TP07= 0
##$TPNAME0= <>
##$TPNAME1= <>
##$TPNAME2= <>
##$TPNAME3= <>
##$TPNAME4= <>
##$TPNAME5= <>
##$TPNAME6= <>
##$TPNAME7= <>
##$TPOAL= (0..7)
0.5 0.5 0.5 0.5 0.5 0.5 0.5 0.5 
##$TPOFFS= (0..7)
0 0 0 0 0 0 0 0 
##$TUNHIN= 0
##$TUNHOUT= 0
##$TUNXOUT= 0
##$USERA1= <user>
##$USERA2= <user>
##$USERA3= <user>
##$USERA4= <user>
##$USERA5= <user>
##$V9= 5
##$VALIST= <valist>
##$VCLIST= <CCCCCCCCCCCCCCC>
##$VD= 0
##$VDLIST= <DDDDDDDDDDDDDDD>
##$VPLIST= <PPPPPPPPPPPPPPP>
##$VTLIST= <TTTTTTTTTTTTTTT>
##$WBST= 1024
##$WBSW= 4
##$XGAIN= (0..3)
0 0 0 0 
##$XL= 0
##$YL= 0
##$YMAX_a= 424789
##$YMIN_a= -584409
##$ZGOPTNS= <>
##$ZL1= 120
##$ZL2= 120
##$ZL3= 120
##$ZL4= 120
##$ABSF1= 16.522
##$ABSF2= -4.171173
##$ABSG= 5
##$ABSL= 3
##$ALPHA= 0
##$AQORDER= 0
##$ASSFAC= 0
##$ASSFACI= 0
##$ASSFACX= 0
##$ASSWID= 0
##$AUNMP= <proc_1d>
##$AZFE= 0.1
##$AZFW= 0.1
##$BCFW= 0
##$BC_mod= 0
##$BYTORDP= 0
##$COROFFS= 0
##$CY= 12.5
##$DATMOD= 1
##$DC= 0
##$DFILT= <>
##$DTYPP= 0
##$F1P= 14.0000005364418
##$F2P= -0.99999901652339
##$FCOR= 0.5
##$FTSIZE= 32768
##$FT_mod= 6
##$GAMMA= 0
##$GB= 0
##$INTBC= 1
##$INTSCL= 1
##$ISEN= 128
##$LB= 0.3
##$LEV0= 0
##$LPBIN= 0
##$MAXI= 10000
##$MC2= 0
##$MEAN= 0
##$ME_mod= 0
##$MI= 0
##$NCOEF= 0
##$NC_proc= -5
##$NLEV= 6
##$NOISF1= 0
##$NOISF2= 0
##$NSP= 0
##$NTH_PI= 0
##$NZP= 0
##$OFFSET= 16.522
##$PC= 1
##$PHC0= 158.5721
##$PHC1= 4.780387
##$PH_mod= 1
##$PKNL= yes
##$PPARMOD= 0
##$PSCAL= 4
##$PSIGN= 0
##$REVERSE= no
##$SF= 250.13
##$SI= 32768
##$SIGF1= 0
##$SIGF2= 0
##$SINO= 400
##$SIOLD= 32768
##$SREGLST= <1H.DMSO>
##$SSB= 0
##$STSI= 32768
##$STSR= 0
##$SW_p= 5175.98343685301
##$SYMM= 0
##$S_DEV= 0
##$TDeff= 65536
##$TDoff= 0
##$TI= <Analysis number 999999
Compound Code 99
Book Reference 9
Project Code 9>
##$TILT= no
##$TM1= 0
##$TM2= 0
##$TOPLEV= 0
##$USERP1= <user>
##$USERP2= <user>
##$USERP3= <user>
##$USERP4= <user>
##$USERP5= <user>
##$WDW= 1
##$XDIM= 32768
##$YMAX_p= 449209094
##$YMIN_p= -438016
$$ End of Bruker specific parameters
$$ ---------------------------------
##NTUPLES= NMR SPECTRUM
##VAR_NAME=  FREQUENCY,     SPECTRUM/REAL,   SPECTRUM/IMAG
##SYMBOL=    X,             R,               I
##VAR_TYPE=  INDEPENDENT,   DEPENDENT,       DEPENDENT
##VAR_FORM=  AFFN,          ASDF,            ASDF
##VAR_DIM=   32768,         32768,           32768
##UNITS=     HZ,            ARBITRARY UNITS, ARBITRARY UNITS
##FACTOR=    0.157963299565203, 1,           1
##FIRST=     4132.6476996994, 0,             0
##LAST=      -1043.33573715361, 0,           0
##MIN=       -1043.33573715361, -438016,     0
##MAX=       4132.6476996994, 449209094,     0
$$ Real data points
##PAGE= N=1
##DATA TABLE= (X++(R..R)), XYDATA
$$ [...]
21449 -117074 -144619 -194149 -268199 -223272 -117064 -236149 -247448 -224970 -202206 -192470 -121645
21438 -121645 -178666 -96677 -15219 54213 129129 116143 60678 7563 -14092 -5507 30506 -35982
21426 -35982 -98528 -88561 -80577 -299156 -305964 -212351 -121747 -148060 -187829 -38241 -6446 1036
21414 1036 16664 25020 -22432 -99877 -128365 -251344 -260832 -75139 17974 44951 44460 -44376
21402 -44376 -158164 -110782 19378 135998 114864 135761 194638 160886 67203 9909 23354
21391 23354 153925 117279 45856 30240 121521 33310 4300 13643 -54304 -71045 -23290 45571
21379 45571 40712 77936 136611 237991 48042 -127398 -120988 -27759 -91466 -60282 6131
21368 6131 -82810 -134767 -154389 -86945 -115415 -234336 -295755 -186255 -106262 -99852 -134956 -180697
21356 -180697 -189873 -108008 3324 -44866 -116819 -62284 -94500 -116259 -10924 41218 -41295
21345 -41295 -104516 -116265 -202793 -268818 -269823 -92840 -32493 -157651 -201397 -119541 -89318
21334 -89318 -44540 -35509 73284 171910 166618 5420 -73468 -79617 -92078 -34012 26909 86444
21322 86444 137985 176969 119319 77025 70153 6456 -36508 -61162 -142228 -173565 -138327 -21225
21310 -21225 7719 -7908 -12868 13774 -52959 -46823 -69508 -71765 -44335 -78594 -114368 -30919
21298 -30919 -34604 -23592 -52422 -58882 77676 99940 177596 36061 -155302 -147342 -71392 112452
21286 112452 246741 208032 50910 -29523 51420 113445 102739 -74654 -160395 -143916 76060
21275 76060 98734 6656 4702 -27328 -34471 6824 33172 -7612 -85179 -80359 -53625 -2198
21263 -2198 1682 56545 -5516 -20469 65145 49061 6527 -40369 -10057 20955 -47703 -47700 -52746
21250 -52746 -101016 -169377 -280252 -229605 -136417 -98143 -36115 -31564 -18235 -52185 -2541 -50327
21238 -50327 -135053 -120674 -33911 145777 192183 161105 79548 -22985 -62656 -119678 -96153
21227 -96153 -83665 -69053 -49491 -5251 9348 155226 160814 68941 -38812 -25958 38310
21216 38310 -41734 -83758 -53133 -27040 -173989 -179025 -98160 -153813 -246095 -236390 -279934 -280977
21204 -280977 -279573 -164078 -50989 -139122 -14897 -6296 -34347 53022 72699 56819 10933
21193 10933 -24765 14813 20173 -14484 -84818 -44290 59982 51463 30020 94198 29383 -60755
21181 -60755 -6928 58193 62344 75940 -6790 -118519 -189421 -118615 -44819 2739 -81336 -218913
21169 -218913 -123442 -43208 10206 -69631 53807 46310 31219 59326 10082 -60001 29839
21158 29839 64086 -54355 -3509 41280 -4226 96823 162808 119746 78389 -67861 -128581
21147 -128581 -3720 70296 85901 -2558 -22832 -83145 -141878 -210066 -64702 28243 -80255
21136 -80255 -188232 -235680 -122512 -114405 -130073 -138512 -119131 -73529 -101652 -82858 -108769 -90660
21124 -90660 -63121 -95260 4065 91842 21721 77183 156881 84704 -21199 -70606 -263856
21113 -263856 -433454 -321834 -183218 -106269 -75148 -92208 -195876 -227090 -304406 -219658 -162212
21102 -162212 -55888 7596 10778 -29804 -126309 -127896 -110855 -10393 -67561 -135533 -139532 -219054
21090 -219054 -311304 -205560 -120625 -23149 30942 39533 27182 -26740 -35094 16823 79577 57390
21078 57390 -42134 -35814 -41417 16893 2038 9719 -33646 -62843 57456 148554 153569 128692
21066 128692 117404 110113 124810 85820 217190 229288 56559 22008 44915 -610 -74874
21055 -74874 -87894 -88979 -86422 -68408 -21009 -12026 -102522 -100560 30326 93432 129245 164990
21043 164990 90373 48975 117831 67869 11858 37349 15390 -1027 57936 -60526 -140951
21032 -140951 -80490 -97161 -68495 -10275 33201 44790 60644 25535 -69225 6491 11426 -67730
21020 -67730 -40974 -12742 -12120 -136944 -133857 -86590 -106944 -226717 -171451 31148 149727
21009 149727 228807 259551 172180 29764 -76104 -150378 -55768 -30292 -51651 -48332 -93824
20998 -93824 -223709 -125383 20487 -3002 31376 86271 69827 71542 -25601 -61243 -63545 4917
20986 4917 56269 82568 60011 32281 -89275 -132254 -27605 56258 52500 95982 7675 -89496
20974 -89496 -62958 -63850 -68505 -68470 -74329 -83565 -87032 29 50644 10224 -17959 -20176 -28245 15972
20960 15972 66566 53502 43679 18135 -62022 -92586 -43289 31466 3208 -34621 -51340 6327
20948 6327 68333 174160 56635 -152119 -220325 -119091 -126097 -24249 37447 59177 -11452
20937 -11452 -96666 -72223 -48517 -101574 -45323 4046 60659 25361 -19422 -3006 22198 -152459
20925 -152459 -144648 -118212 -145537 -54039 -78475 -65054 -75623 -118022 -67462 -48221 -111200 -53703
20913 -53703 -7844 -28288 18749 45610 80685 33823 15108 -75046 -74301 89910 110310 109614
20901 109614 79480 7463 -55140 -46145 3073 591 -48314 -133873 -132867 -186203 -169866 -202467
20889 -202467 -243524 -269136 -172538 -108287 -168825 -221599 -30671 -51743 -123855 -165560 -48789
20878 -48789 30026 -24251 -36149 55108 90082 128631 104812 54919 -5247 -45913 -151702
20867 -151702 -269810 -165615 -44937 -48601 -42137 -129234 -93889 -90038 -177051 -224865 -247964
20856 -247964 -176148 -158074 -100198 -95484 -275925 -323802 -137949 10051 -20635 -108270 -122910
20845 -122910 -68784 -41764 -18776 -90127 -72281 54738 48839 87708 64945 81676 56480
20834 56480 11325 5782 -65309 -95592 -75148 -88392 -107943 -110535 -50745 56965 67604 13704
20822 13704 205858 189586 216919 156234 168928 193024 35980 -31013 4322 67762 110042
20811 110042 97369 -22500 -187595 -190747 -130114 -50132 -80695 -176576 -195353 -197513 -157081
20800 -157081 -156254 -67165 -39485 -96666 -191449 -213692 -212509 -74413 -103709 -181892 -147165 -91791
20788 -91791 -33509 -28661 -156793 -205189 -116398 -81732 -28 -45830 -163564 -117815 -163023
20777 -163023 -134760 -140788 -119566 -129992 -136649 -118203 5954 19448 80366 148326 114961 35523
20765 35523 -110446 -116142 -132695 -121843 -6190 161941 118304 -55422 27579 123342 102027
20754 102027 -29644 -73650 -73827 -139165 -123407 95235 167139 77717 -9037 -58742 -122624
20743 -122624 -135234 -34498 4807 89647 30939 30196 27754 15997 50304 -77831 -163721 -230166
20731 -230166 -245770 -228604 -202396 -159231 -124345 -194243 -120885 -16043 -26831 -28358 -86399
20720 -86399 -81101 -40310 3143 -24394 -115161 -119505 -110891 -199301 -138477 -82685 -143961 -228393
20708 -228393 -270679 -203723 -72833 -108608 -84116 -63609 -131780 -174510 -124951 4520 43297
20697 43297 -19538 -181431 -152463 -143882 -162569 -200817 -135522 -117419 -180969 -227458 -259777 -274114
20685 -274114 -177808 -8301 73560 11552 -13021 27982 -4242 58153 85344 63465 -1156
20674 -1156 15467 34583 -105101 -207699 -113263 -71726 -44317 -121215 -188994 -209261 -140565
20663 -140565 -87441 -66425 16810 51719 72567 63766 53068 -8645 34618 94478 71762 49735
20651 49735 24028 32963 33486 -78274 -91658 -43726 -46562 -4079 16397 -42734 -204429 -162027
20639 -162027 -74886 -56092 -81394 -21064 -7394 -126949 -164996 -204318 -244388 -202985 -104154
20628 -104154 -43298 -8790 30644 18942 -67374 -79194 -183481 -156987 -212621 -192340 -198972
20617 -198972 -242496 -259935 -181912 -296892 -351462 -292451 -134215 -127130 -108111 -52951 15543
20606 15543 111595 65480 -58138 20214 109647 52705 -30739 -171028 -184258 -79393 -24374
20595 -24374 -47971 -94987 -61119 -53775 -85906 -33267 132829 110984 -4032 -105778 -230226
20584 -230226 -234774 -218184 -224627 -164155 -193039 -140211 -70617 -41628 -56646 -136587 -158431 -114373
20572 -114373 -114100 -126635 -15687 143019 108207 61001 19276 -67064 -66865 -59172 1113 20443
20560 20443 -115290 -156571 -143248 -27196 27020 12737 -8819 -63054 -164173 -135630 -175647
20549 -175647 -196819 -172073 -43006 59621 49 8214 -18880 -85708 -81952 -73419 -61546 -77640
20537 -77640 -168991 -299235 -289920 -352309 -296868 -187741 -114764 -32612 -12132 42987 28389
20526 28389 62832 50137 56333 25389 -24337 -1311 65705 145793 131167 6552 2916 61826
20514 61826 30738 -30378 -7816 43847 -42180 -37170 -11700 -41982 -99713 -46668 -43103 -36893
20502 -36893 -52995 -17763 50016 38689 86015 121255 78863 143734 165287 16566 32250
20491 32250 24110 52845 -76781 -98046 -130925 -120407 -176204 -124399 -27982 34189 11546 -13332
20479 -13332 12619 -49014 -109196 -205010 -218166 -124880 -49635 -70263 -121167 -192784 -244271 -125421
20467 -125421 -2459 42629 26819 -69367 -87976 -139559 -182990 -67359 -1596 -22261 -91736
20456 -91736 -160647 -46807 12758 13742 -9909 -29616 -123085 -302173 -228697 -88671 -92746 -168653
20444 -168653 -110562 -164196 -181682 -198998 -198641 -290591 -283794 -196781 -142603 -31687 25362 -23585
20432 -23585 -85495 -54109 -1390 -41287 12456 8255 60993 41209 -26719 -75119 -50858 -73195
20420 -73195 -148680 -180163 -121322 -105533 -202004 -47574 77037 194826 69923 -4148 13545
20409 13545 100104 56850 55644 31027 -138691 -138361 -36866 -92672 -120634 -51583 -14232 -25367
20397 -25367 -61264 -29268 -37095 -44011 40228 63763 113203 90249 141932 232299 236549 153110
20385 153110 135797 106252 -23101 -100489 -142990 -106223 -96152 -1638 -84931 -100067 -102820
20374 -102820 -28307 -8224 43766 16533 -18075 -142569 -212012 -95670 -188 -34320 -205004
20363 -205004 -224895 -95781 -2324 25162 -46692 -194560 -129493 -83905 -36846 -96846 -209771
20352 -209771 -205674 -181463 -98071 -86370 -50653 46208 122448 148997 71598 110288 86049 84675
20340 84675 85362 93124 73201 22648 7286 18144 58934 103811 84938 -69088 -174974 -156884
20328 -156884 -47289 20532 30562 -51395 -20983 -47267 -92363 -84220 -37616 -162965 -215567
20317 -215567 -203552 -129358 -103913 -144652 -182105 -125271 -109660 -19891 41762 21494 38056
20306 38056 50932 36171 72935 64088 32871 24795 83239 73542 -11759 -82028 -48033 7437
20294 7437 -25725 -94536 -142180 -65015 6345 -3859 13581 94536 128057 207981 79055 -62326
20282 -62326 -121897 -135079 -127358 -98613 -117362 -126865 -33226 83601 158033 107745 117456 81370
20270 81370 23593 -118421 -122836 22887 53114 61786 92338 36952 5597 -18489 -18801 -34578
20258 -34578 35257 84082 80870 110182 107678 85861 7223 -2288 -10987 -13133 -25278 -89745 -174480
20245 -174480 -93157 -95158 -85141 -54985 -13247 -33690 -104946 -39668 19382 26835 -28042 -53698
20233 -53698 -116220 -212057 -292225 -265295 -123527 -7985 -95866 -225639 -193379 -163203 -166655
20222 -166655 -121915 -126775 -101579 -168608 -111170 -103746 -44176 -66868 -98837 -131808 -130117 -56960
20210 -56960 -99643 -143032 -185294 -193814 -167245 -17128 15727 -53133 -95850 -104178 -139951 -107354
20198 -107354 -63627 -39513 -35417 -115435 -107591 -71267 -60312 -29830 -66613 -57885 21592 -21756
20186 -21756 -70970 -65279 -144602 -64339 -78555 -111514 13857 6739 -33809 11003 -45658 -105737
20174 -105737 -23311 -17524 -10771 121167 234701 183184 17726 -33446 -46745 -1811 -5238
20163 -5238 -105708 -129242 10801 15725 72602 52975 67625 40730 -105066 -104360 -14580 -141180
20151 -141180 -141862 -19105 94580 -1203 -87339 -64436 -93458 -56342 24964 53714 -12734
20140 -12734 -101745 -119493 -39653 3924 21374 2473 -101233 -137279 -80738 -82697 -130188 -96785
20128 -96785 -61335 -59041 -161024 -222931 -71098 -85047 -63537 -53746 -78719 -126047 -205692 -44166
20116 -44166 9697 39445 121377 75785 -30051 -9509 75684 7426 -68470 -114297 -141408
20105 -141408 -128811 -120999 -73780 40268 66697 -8520 -46522 -22345 48553 75202 129479
20094 129479 43393 37313 -49830 -128868 -60045 -69963 -43735 -16610 -41093 -103970 -106961 -151106
20082 -151106 -201463 -68025 -12438 -17560 -122323 20069 -22980 -19946 27374 -66352 -78328
20071 -78328 -123973 -62801 54236 108695 66770 36860 -149723 -181391 -165011 -198026 -209333
20060 -209333 -92677 23837 21201 1536 -40040 -147344 -103988 -118953 -31564 44096 11466
20049 11466 -16212 26002 33798 21598 25900 102515 94156 -15815 -214348 -179810 -39962 -30313
20037 -30313 -25212 60455 188281 143098 -55831 -96331 -201015 -180098 -188091 -40780 -19241
20026 -19241 -32555 63334 115063 170092 163761 93306 18698 8178 -1164 25019 29604 28043
20014 28043 14346 5682 84040 159169 109280 28019 9989 -20365 33685 -7032 -81000 -84735
20002 -84735 -154162 -172956 -154483 -3106 68082 -81290 -298362 -224624 -68926 31664 -7136
19991 -7136 -43814 -3811 -57835 -37147 -6446 47983 99694 192651 248137 140599 63955 -21875
19979 -21875 -28881 27707 16908 -49208 2029 124536 223388 41225 -72619 -17579 -75807
19968 -75807 -39407 14396 -21693 -95575 -147876 -223466 -194698 -128001 -59785 52410 43723 -84740
19956 -84740 -164865 -209731 -292488 -268428 -292457 -257429 -193195 -155241 -149917 -134076 -95178 -87084
19944 -87084 -32767 7478 1947 -15038 17437 52180 -100935 -129964 -150612 -174796 -201911 -166260
19932 -166260 -123665 -78734 -172870 -185975 -85347 -59217 -46088 4873 36067 -85768 -221542
19921 -221542 -200684 -97386 -114088 -69375 77949 30043 -1762 -43020 -60181 -29929 -80134
19910 -80134 -43654 -44002 15794 62027 -40067 -132004 -48534 73818 -59016 -85092 20316
19899 20316 3066 -150976 -132887 -86073 -82535 73595 196234 69202 -139219 -146195 -33335
19888 -33335 -37354 -61198 -115114 -106980 -35125 9424 25982 58185 87256 38833 -90225 -63712
19876 -63712 -21487 2440 20776 -46551 -92862 -58269 -3446 -17005 -77410 -137854 -166310 -183721
19864 -183721 -207697 -132972 10014 30523 -12774 -55842 -111555 -50850 65700 82303 117647
19853 117647 143537 178080 59747 -63179 23755 61250 -1902 -147121 -164673 -6434 72034
19842 72034 72816 9184 148099 114398 -37268 -74870 -101892 -110194 -173634 -138146 -164996 -80372
19830 -80372 5808 -38880 -92238 -87776 -144198 -102403 -122234 -142356 -34852 -17648 -103389 -125025
19818 -125025 -68325 -22414 33447 -90542 -191482 -215638 -111642 -71412 -119614 -163907 -162820
19807 -162820 -191470 12273 34956 -105502 -200968 -204309 -78027 -61235 -97634 -123227 -146421
19796 -146421 -146468 -86408 -44998 56983 -7404 -114116 -100197 -53968 -120726 -126138 -113007 -163564
19784 -163564 -169829 -153098 -154790 -125448 -106346 -210796 -262303 -53841 51939 -183 -71685
19773 -71685 -80090 -171742 -129028 -67703 41900 197306 245818 179792 162460 151877 93492
19762 93492 118554 33208 -49976 69856 22529 48137 40431 52239 22390 -17711 -59201 -32502
19750 -32502 -139106 -74997 -46965 36511 116338 121200 179032 237440 184215 105411 247912
19739 247912 239297 236800 255285 228206 335392 322824 211960 154854 150271 61413 11858 -13927
19727 -13927 -71959 -127995 -149755 -89490 -158853 -153059 -58031 -62791 -3212 50004 -8312 -145532
19715 -145532 -216513 -237713 -258698 -132264 -128725 -138208 -36584 89086 113500 29503 71117
19704 71117 75269 29078 -40888 39193 81748 147634 162121 69425 90853 74218 -80591 -116753
19692 -116753 -134622 25107 41177 -84867 -57856 -45379 18487 92857 160475 181685 94008
19681 94008 51824 72957 22725 29415 138805 139167 104856 67046 31583 -26617 -48852 -89801
19669 -89801 -18334 -15012 -64833 -95900 -69623 -28580 17750 59262 148775 110640 -35194 -68270
19657 -68270 -31058 -3425 -11977 -78987 -163805 -146455 -117016 -99823 -74075 -92989 -146729 -162270
19645 -162270 -88839 -106011 -42030 -46596 20679 32945 -31147 -34601 -8215 100172 8871 -65133
19633 -65133 -7764 65063 26234 -102177 -61697 22346 101862 107899 116818 42891 -38545 -34031
19621 -34031 -42209 -134735 56334 171512 83821 33511 -60982 4770 152224 100069 77666
19610 77666 48742 94857 89310 53663 85800 -7348 -99568 -151895 -278626 -375882 -304904 -231674
19598 -231674 -49705 80163 57580 -66219 -110110 -100843 -45351 -59196 -3750 33296 24124
19587 24124 59080 74072 77897 4203 31491 76587 66019 32831 -533 -75985 -140293 -120866
19575 -120866 -156469 -138234 -186300 -74301 -82604 -2783 62665 28222 721 103222 44060
19564 44060 38254 1755 -103798 -160413 -172340 -64856 40869 -1374 -81755 -163306 -301825
19553 -301825 -228338 -42608 -59993 -59484 67991 69941 17479 -53426 -32427 -388 16699 60103
19541 60103 -15304 -93101 -104266 -192843 -97867 70332 115870 3971 -199073 -143017 -27468
19530 -27468 -88806 -88299 -155511 -139992 -114372 -88745 -43327 -61451 7457 91494 156297 180080
19518 180080 182414 142587 112899 61950 66410 12264 -61245 20507 71317 -25715 -133989 -122804
19506 -122804 -99367 -81853 -22328 -22128 -91894 -202756 -113971 57283 171051 11119 -162021
19495 -162021 -304003 -264365 -165495 -184799 -238129 -201688 -166397 -121673 -83828 -101313 -131679
19484 -131679 -122679 -131952 -82526 -78149 -47453 -18501 -34991 -38313 -4509 -39550 -104183 -85935
19472 -85935 -67031 -51681 -105494 -38189 -36767 -14946 -56085 -63464 -45273 -86333 -26322 -34993
19460 -34993 -8689 -28290 -101260 -62948 -6477 -77965 -68157 -98961 -172479 -111457 -36394 -51178
19448 -51178 3634 -3194 -30159 48706 44948 89458 147242 169689 144055 103450 54100 -57686
19436 -57686 -91073 -59834 -13767 -149445 -178488 -188230 -36760 19462 -20453 -137441 -174205
19425 -174205 -146850 -13125 -13825 -68946 -26228 -46763 -55908 -40413 -10856 86785 25143 41706
19413 41706 108726 163897 21409 22464 148373 231256 132777 84245 -10541 -187307 -162850
19402 -162850 -135360 -5065 26285 -16735 55480 49104 46894 134606 248469 329388 218980
19391 218980 -6679 -81059 4448 28765 111371 269023 429588 557699 585949 574088 677839
19380 677839 665016 526760 316769 150384 160681 111399 157567 200903 80065 17164 -31323
19369 -31323 -12625 81202 95963 85617 118215 156844 150668 125166 179144 132346 82630 33972
19357 33972 110623 212200 366864 603966 585490 541721 596735 644575 542462 380356 347630
19346 347630 310031 253634 174952 128675 116775 148609 252772 349637 410480 355990 357035
19335 357035 456580 595305 681094 691295 743850 827874 742575 802669 815096 731528 564191
19324 564191 445237 373777 349838 289420 290558 282975 143407 233551 291167 190445 162960
19313 162960 312541 355199 314889 328201 296703 214953 262255 419127 484270 372208 285658
19302 285658 329413 242940 220722 233933 215161 221872 191386 101290 199740 345169 430040
19291 430040 377579 273902 301137 409559 401369 459756 635842 656307 572722 626542 659097
19280 659097 498142 440316 474500 444757 323494 243865 240561 321012 334740 134153 73633
19269 73633 76364 139597 216683 245953 245396 158137 109911 167896 206237 167833 164350 174244 242408
19256 242408 220345 170788 171633 59260 -28660 -62179 -7587 56729 140150 176959 242353 279863
19244 279863 288966 262459 286885 278929 217050 245416 208814 200328 307496 307941 261800 166900
19232 166900 232152 327697 344402 370637 374293 299859 295702 410368 426336 347623 359511 420670
19220 420670 480300 536487 509974 387561 205512 162661 90743 84039 109967 -37528 -51902
19209 -51902 64419 101034 190629 226234 142315 22508 -4820 -60375 -101705 14437 126398
19198 126398 46563 4147 145561 167679 126867 115896 102024 79317 35440 65851 -34636
19187 -34636 -97158 -78681 -63024 -116949 -173642 -49550 135660 221337 180184 216373 190199
19176 190199 150377 32473 30484 161088 172800 92200 68646 147674 98579 -59719 -85244
19165 -85244 -120808 -181891 -82830 -104319 -119000 -127025 -81708 -63879 -66624 -104504 -107193 -38219
19153 -38219 40372 134001 176733 162886 116102 23569 3477 79998 222149 185176 42038
19142 42038 -52653 -55823 19173 68856 95410 74481 69904 124236 209263 165841 -6058 15790
19130 15790 29351 68314 116702 87881 110317 308461 394656 245341 194439 165696 245021
19119 245021 164528 -25112 46736 74453 114662 214446 155696 76306 32037 28151 108512
19108 108512 168506 204090 285822 241091 90498 38432 143628 193178 250382 252743 213776
19097 213776 226571 106278 46442 107749 94171 114919 139242 61129 84004 40648 37196
19086 37196 74185 49597 111223 147771 169047 165108 106142 85163 91137 235552 325904 400050
19074 400050 295613 276240 383444 305451 228822 263826 207338 84205 62274 125507 171184
19063 171184 218067 172866 250617 353896 302689 309245 376057 454220 366593 188908 186100
19052 186100 157231 68021 1440 25706 -28658 -210284 -160124 -46153 152347 167148 117758
19041 117758 93652 103030 75824 80065 67598 75841 63430 29954 -30828 -5481 51199 68766
19029 68766 144741 197799 101241 98557 231970 238984 269295 275202 291934 296965 358923 379442
19017 379442 335762 251694 144834 121075 157991 165774 138284 66425 18486 93309 40063
19006 40063 71817 292962 392952 362788 348117 334618 347538 440073 506910 522572 390835
18995 390835 86628 98445 259121 346725 284571 142513 148305 180098 201533 194466 173844
18984 173844 157095 221095 125646 47508 109474 111178 74545 -53420 22801 25162 -95256
18973 -95256 -107589 3270 145644 295430 324376 330718 329130 384186 399919 295577 244012
18962 244012 230387 292587 347136 354324 395267 454305 445096 440898 394891 500606 646745 554050
18950 554050 431921 428901 350757 303005 349523 343329 400581 482389 389792 276087 303750
18939 303750 332527 425015 421615 385522 345277 470354 451430 364869 426612 483590 527954
18928 527954 534140 453681 347191 441760 556256 660217 623274 603299 586187 542267 635454
18917 635454 558324 491082 623905 737242 735922 748626 927075 1042191 1090031 1044698 973544
18906 973544 1032080 1060347 1096933 1253574 1512757 1725923 1999198 2346906 2577400 2821505
18896 2821505 3017897 3109186 3066397 3049156 3017959 3066582 3009829 3037014 3292998 3634287 4081759
18885 4081759 4570929 5262685 6028998 7015198 8208943 9932425 12284839 15641857 20265973
18876 20265973 26866763 37179794 53840300 79791189 112375200 134563046 134117963
18869 134117963 115858151 88824009 64132756 46921803 36073881 29038432 24207455
18862 24207455 20714729 18140369 16306377 15012963 13885157 12912993 12164028 11478190
18854 11478190 10977437 10690509 10501212 10289320 10214857 10260187 10313732 10163302 10015731 10025986
18844 10025986 10088941 10244243 10354753 10488492 10752522 11082505 11612830 12494663 13656657
18835 13656657 15201181 17402691 20258806 24210384 29696376 37623007 49737933 69186665
18827 69186665 99820610 139232880 169240157 174150682 158799681 133985892 114175279
18820 114175279 108935943 120720005 146739949 171189337 174181195 155735568 124763042
18813 124763042 93293195 69893955 54549694 44405203 37234677 32070669 28265859
18806 28265859 25370393 23260232 21576676 20001485 18808252 17794894 16915999 16260485
18798 16260485 15810127 15399170 14969893 14479956 14111704 13897589 13518152 13038737 12599408
18789 12599408 12211591 12085387 12029043 12050957 12301653 12691227 13284415 14114924 15477241
18780 15477241 17290612 19664075 23161478 28155942 35405244 46531456 64176496 92758112
18772 92758112 133155004 170089138 180225802 163181023 129587319 93783292 67010720
18765 67010720 49766439 38800179 31423451 26339138 22723464 20109396 18059448 16252582
18757 16252582 14669666 13433324 12296261 11302966 10385511 9564012 8858954 8270364 7854165
18748 7854165 7541309 7277097 7018296 6658640 6073497 5543486 5009165 4440134 3910287
18739 3910287 3466746 3249663 3057966 2884419 2731123 2592147 2428787 2307760 2215435 2072687
18729 2072687 1940143 1880544 1879483 1789153 1639225 1505181 1392528 1345579 1243620 1157436
18719 1157436 1240309 1254276 1140083 1107876 1102784 1140601 1173537 1084887 1053076 1049080 868956
18708 868956 777493 712611 710624 737074 729934 629270 605297 649536 589179 492393 349800
18697 349800 435925 522937 486182 493911 412283 364787 321924 202439 157282 226967 254864
18686 254864 106136 15947 104109 104556 87902 144788 51621 144046 329800 281630 119034
18675 119034 63448 78789 183607 181526 170309 218671 307568 389171 430136 432325 427479 454441
18663 454441 418888 312334 348343 454546 376644 239876 221698 200762 226927 154593 93109
18652 93109 147417 178381 202573 266833 314277 335510 350573 458774 405658 192164 183599
18641 183599 224279 117933 -38262 -151679 -144300 -28031 32740 104845 100613 47221 61824
18630 61824 123119 176664 142539 101865 199740 160551 171907 216972 186965 161757 191447 76773
18618 76773 57104 100868 77295 -23321 -26425 83983 207542 185346 206101 285863 250348
18607 250348 222919 207823 251264 233592 253487 255589 214971 183520 180703 190989 185708 63039
18595 63039 32772 130510 178671 179440 229451 179596 149555 237747 179918 282248 316314 235325
18583 235325 217055 138522 128730 141416 118041 51567 89266 163232 253893 272091 190097 175938
18571 175938 160296 288658 336453 416926 344416 220336 168486 229047 244018 278692 279930
18560 279930 190299 94184 -88848 -115972 66483 168459 275878 311552 312046 249717 201242
18549 201242 223135 149790 117286 191256 214031 158166 129022 136686 101696 159775 193098 183999
18537 183999 130375 65652 79841 123497 252510 147657 81117 109786 191170 306591 376621
18526 376621 403170 423491 442835 294815 296895 271939 352124 372749 318483 429376 512116
18515 512116 424139 413129 342228 276236 177046 172445 200930 271679 361925 377877 407793 455924
18503 455924 474082 417008 440506 396033 370551 395074 444403 407604 419395 383258 356025
18492 356025 300408 276684 349164 380193 499494 419346 284021 373924 417176 352402 365585
18481 365585 369790 444970 384470 316905 319996 343676 305230 332898 347033 319971 348056 378013
18469 378013 356239 352895 353153 310561 264480 214695 139339 84849 84300 67893 127439 178709
18457 178709 201868 273277 196627 252897 399669 435774 428701 369893 407503 385177 323021
18446 323021 291463 254363 189165 246228 211671 91529 43772 30944 67288 163325 202680
18435 202680 233426 186460 128105 278575 401504 344397 209378 40023 12744 -15062 -48977
18424 -48977 -74739 -24750 150476 154577 175176 223348 272178 297995 273289 190427 249535 416808
18412 416808 458958 424688 303700 302457 295220 330542 297117 340261 359110 396369 334206 244659
18400 244659 215816 247934 309360 387000 433658 437917 438332 379873 468259 496787 494713 364163
18388 364163 300334 188417 91826 70650 119606 285019 389149 483055 288697 280821 395616
18377 395616 466126 541739 413291 374398 442871 480531 344026 271372 242191 343857 399269
18366 399269 400135 427820 474527 411998 312807 347601 479779 578837 593291 706686 752400
18355 752400 816093 774409 767937 752119 804231 826961 880786 966339 1007442 1018356 1033389 1111537
18343 1111537 1114163 1077096 1146230 1261087 1275525 1290387 1305675 1282546 1202636 1186142 1156782
18332 1156782 1123639 1107861 1074267 986232 883034 921494 989291 1061919 1107073 946969 934033
18321 934033 1102220 1208358 1247947 1148392 1136777 1190440 1298221 1525663 1726052 1809028
18311 1809028 1895287 1952065 2010760 2006612 2028599 2003697 1918276 1834372 1796654 1922920 1968536
18300 1968536 2024087 2043230 2222983 2394312 2554730 2767359 3100738 3374789 3738933 4163889
18290 4163889 4605484 5035210 5606487 6038096 6471523 6926214 7373143 7975709 8769794
18281 8769794 9775282 11037138 12762911 15119400 18287921 22662601 28753044 37731755
18273 37731755 51348816 72773190 105202779 147248481 188399005 218813589 239752802
18266 239752802 254693347 261249206 250745681 222978635 184065310 140579381 103050102
18259 103050102 76998184 60424091 49700376 42256807 36722072 32494859 29272764
18252 29272764 26661805 24341426 22544146 21184063 19903456 18649261 17384127 16224719
18244 16224719 15276158 14494387 13847690 13345745 13026133 12895325 12958044 13077785 13252258
18235 13252258 13612013 14239643 15316206 16976021 19175216 22370616 27168232 34310937
18227 34310937 45376576 63196328 91636371 131693796 172661160 200624702 215824331
18220 215824331 221728862 219442673 206717885 183049807 151885123 117250280 86452496
18213 86452496 64364842 50240765 41119905 34812407 30088595 26324701 23291371 20855449
18205 20855449 18874823 17193536 15522193 14166515 12978590 11760633 10697903 9814735
18197 9814735 8996044 8215307 7672692 7062220 6659200 6309599 5805456 5386194 5047797
18188 5047797 4783319 4624224 4262951 3842369 3482215 3200709 3004527 2872084 2706954
18179 2706954 2542868 2467822 2482998 2378760 2224798 2065938 1980306 1934712 1816511 1711026
18169 1711026 1627065 1637408 1670622 1569044 1483922 1371887 1327535 1273761 1125242 965000
18159 965000 956526 1007047 1001383 930988 980911 966190 935659 944517 850836 855859 866823 879859
18147 879859 889972 889813 798726 691614 704591 699816 707302 653096 618560 541414 457146 505848
18135 505848 469095 373192 462164 599935 542879 440186 395317 354864 232509 117636 238789
18124 238789 399459 332317 232051 162110 272187 167360 199401 249995 161737 91976 202618
18113 202618 361528 390989 438490 448863 439909 428148 377112 350531 373257 378353 378065 376892
18101 376892 419269 438563 464919 495686 428261 370843 422496 571367 510133 429285 422609
18090 422609 271897 238165 261810 275738 115669 132791 216313 204338 172178 218817 245069
18079 245069 335874 390292 321400 269005 324732 376373 377374 380213 420322 343418 208662 159457
18067 159457 139529 134152 159148 183208 189615 167793 234977 302998 346247 349500 317113 238035
18055 238035 244384 295145 238122 230992 234791 286157 331580 346520 287203 332388 296387 264575
18043 264575 211424 273119 261887 226754 251115 308263 298211 209007 89262 120342 47287
18032 47287 36859 154674 139605 142807 192146 266906 324419 286681 207865 242386 347444
18021 347444 315276 289562 232191 227197 316369 211412 154218 124087 55300 131883 294763
18010 294763 422453 469696 342244 149970 83547 140355 149579 69628 138745 180440 210920
17999 210920 226967 232244 266108 253145 193662 153214 241349 335246 316759 292739 164937
17988 164937 89687 78844 -3361 -10707 63771 140521 174850 206942 212578 258894 272922 228939
17976 228939 227971 169440 125094 226923 338130 373965 395911 403614 367832 219134 69496
17965 69496 122574 253200 203458 94246 167337 270648 375489 370941 353469 343238 393306
17954 393306 467372 382084 292267 138859 187571 251315 234310 255363 275184 299191 319991
17943 319991 339994 337030 331123 301190 158450 169683 319536 437662 464829 443301 418556
17932 418556 528846 477031 466085 419783 357472 343632 435929 520040 589668 547699 500398
17921 500398 488735 435829 492051 580084 471211 385733 516731 512917 413260 438365 514278
17910 514278 545289 506116 590019 778338 893709 863817 811459 786703 803620 989457 1064619
17899 1064619 956022 811696 759009 761288 878981 777145 713080 708866 821720 780714 663644
17888 663644 732069 887768 951783 934384 855988 807659 873725 851205 922162 1038840 1097111
17877 1097111 1147526 1105575 1143366 1101388 1258367 1421996 1397353 1410437 1457093 1525420 1615695
17866 1615695 1720742 1697113 1727521 1809616 1899709 2059705 2325373 2574902 2823578 2914309
17856 2914309 2944576 2969909 3219751 3490897 3737622 4033107 4478796 4948335 5178099 5492687
17846 5492687 5924363 6389385 6892102 7444637 8090244 9023491 10167086 11667959 13451503
17837 13451503 15739545 18673929 22381334 27350975 34208291 43829439 57702403 77700834
17829 77700834 105360662 138970666 171147365 193418036 204701463 210672192 214839818
17822 214839818 212203578 196308720 168262894 135457132 105659818 82645175 66213366
17815 66213366 54553792 46100543 39921783 35117739 31312197 28378966 26020041 23869647
17807 23869647 22045755 20477040 19087078 17787231 16576034 15429370 14620335 13802417
17799 13802417 12977446 12325113 11777465 11331139 11000284 10887087 10808854 10827242 10955221 11160028
17789 11160028 11388892 11745120 12201411 12864953 13622880 14860475 16506480 18553151 21383779
17780 21383779 25170144 30489421 37917328 48550806 64013113 86063331 115626394
17773 115626394 148860592 175790992 189636666 193279871 193107000 190840904 181076688 160660991
17765 160660991 132872357 104556825 80943649 63596072 51386690 42653025 36413481
17758 36413481 31926926 28289306 25366878 22940865 20882449 18971217 17446496 16082874
17750 16082874 14743096 13577681 12373834 11316351 10349903 9477856 8689430 7970552 7294788
17741 7294788 6779490 6262502 5879211 5618794 5375559 5105523 4958177 4906025 4901975 4760274
17731 4760274 4697212 4534103 4409591 4252459 4137202 3923327 3602679 3417165 3402541 3221725
17721 3221725 2977490 2790240 2654599 2464523 2369218 2254524 2033011 1822842 1831184 1714214
17711 1714214 1582660 1584508 1468995 1380005 1223372 1172421 1264141 1219425 1106234 1103559 1156082
17700 1156082 1173697 1176742 1155415 1079049 1138159 1052641 1032655 1046991 1089394 1110313 1007739
17689 1007739 1039499 1214052 1271713 1372151 1402216 1380577 1301840 1168368 1008051 972938
17679 972938 1003813 982163 899713 813964 801536 836854 985360 1057629 966938 998443 1017072
17668 1017072 840230 749741 731965 688010 740049 575628 576622 591035 580063 629412 509941
17657 509941 362698 335218 461614 526523 446096 414758 441319 489744 495051 437878 406137
17646 406137 384609 229287 188816 169722 82286 161429 110991 -53251 -45423 -49242 -27732
17635 -27732 96312 330522 328287 213278 106235 157214 174498 224169 191808 110313 141557
17624 141557 90528 33516 -6160 -17025 14741 31679 14164 59643 180907 256953 234118
17613 234118 180123 166484 115133 150198 358200 373386 430976 433348 253096 162748 123823
17602 123823 230571 309158 291642 313350 255613 191194 203936 189635 134988 39351 12620
17591 12620 4857 -22726 -60786 3110 -11996 42416 78429 -42187 -96029 30655 171574
17580 171574 127364 41923 67184 109172 128229 267684 240754 172317 105895 34768 15338
17569 15338 91254 206444 132075 136208 221415 55160 -44367 -63303 -27905 81355 142692
17558 142692 88806 127173 80947 12166 -7469 -32541 -12 40782 74530 110738 100490
17547 100490 101591 50540 4801 -41497 -101543 -56507 23907 73425 97863 35115 -61893 -108218
17535 -108218 67686 151162 107683 -12486 -110525 -91943 -29172 20888 -28281 56582 125497
17524 125497 103943 -6241 -76975 -37737 32342 19574 49318 37913 2574 -11712 101542
17513 101542 66814 87336 95917 130864 175609 222946 230327 212441 124612 -109780 -132237 -115799
17501 -115799 -10683 51393 -54942 6764 31931 11661 49378 15240 4982 55899 45480
17490 45480 -9778 -57742 -26574 -7547 -5397 12608 -74613 -73108 -68088 -61666 -46208 -46823 62438
17477 62438 118346 4317 21081 119976 136331 163210 241772 147872 32576 -65426 -84759
17466 -84759 -82619 -176200 -209597 -72760 37827 -18452 -13306 -5992 -85975 -69311 47723 120510
17454 120510 152828 137110 127285 177084 60783 -106295 -148023 -106434 -56798 -163138 -242627
17443 -242627 -272368 -242417 -169273 -178754 -166699 -110317 -38878 -66225 -11822 64143 19808 -10078
17431 -10078 2061 -42722 -174015 -220033 -230833 -212287 -210705 -63106 -76543 -146760 -137425 -111117
17419 -111117 -136285 -148989 -79498 -36286 -104292 -63387 107634 235542 239536 180485 21001
17408 21001 -27043 -40555 -29656 648 109557 119913 120199 178905 141522 140095 115205 113753
17396 113753 163272 48037 -65197 -43563 41175 21908 -56397 -61549 -30938 82482 110902
17385 110902 129666 95966 -47116 -100962 -11911 25678 39053 55126 44701 97025 68416
17374 68416 109509 160432 177728 121941 55720 40004 99568 156749 121334 45009 65539 35672
17362 35672 25045 13495 33016 -63061 -136845 -126418 -52907 31733 46173 25952 12471 61817
17350 61817 -23666 24278 79126 101037 131376 154090 25612 -43656 -56493 -33794 -73309
17339 -73309 -5821 -25553 -151682 -117483 -71106 -115303 -171484 -226186 -129141 -2909 -69472
17328 -69472 -114630 16386 100038 68072 105701 178352 226293 257799 135855 6274 32926
17317 32926 132489 166446 285796 290000 221171 146443 153272 212645 323300 399268 466468 599689
17305 599689 668236 591747 600213 665566 801890 831406 697960 612692 565216 394356 266075
17294 266075 197126 134542 89084 210284 252451 169192 156780 205414 247871 122436 118213
17283 118213 10343 -53058 -84842 -5714 37950 60954 145175 121257 69616 73685 135975
17272 135975 183622 182187 181914 83546 14224 19883 -62965 -31202 104950 183307 193148 223245
17260 223245 270668 451406 491428 461462 308959 255419 345460 413375 492912 576721 606091
17249 606091 636859 706959 760356 739513 683622 574368 465900 495106 436414 482421 618397
17238 618397 538347 408053 183611 158698 168078 201510 201916 158140 56189 17839 79728
17227 79728 74352 -15533 -31633 119755 208673 225454 225807 90372 35897 -39444 -157900 -270332
17215 -270332 -344206 -290704 -117790 -9962 131002 157571 47875 -23709 -83762 -102067 -55413
17204 -55413 -39266 -19748 -189393 -197910 -83033 76940 87068 29689 71848 28750 -29141
17193 -29141 -26139 -74316 -177570 -212920 -75577 -89941 -137715 -63164 -58833 -21096 29402 44659
17181 44659 74074 43873 17380 -56734 -140727 -17768 186007 228303 246169 185449 122539
17170 122539 136137 -13684 -32052 29661 104643 136730 85959 -67189 -76028 17466 111897
17159 111897 175296 152945 109172 137223 129943 156847 129661 105757 99393 64295 130129 173965
17147 173965 119604 87420 78093 70802 24274 44226 70870 -24798 -142045 -143041 -121227 -61197
17135 -61197 -124546 -264337 -239964 -21901 94889 3189 -137 -59082 -141208 -104192 -152255
17124 -152255 -158920 -138245 -103578 -62135 -66655 -33205 -11212 -53232 -93311 -125212 -201461 -326736
17112 -326736 -198887 40626 79389 -18234 -31881 -97123 -8419 28884 128505 87800 -2941
17101 -2941 -55224 -33016 12145 59041 -15545 23116 111951 113680 -23829 -74979 -23252 13925
17089 13925 -16718 -69331 -91547 -21594 -12564 -98967 -90121 -119634 -145091 -106345 -94794 -28819
17077 -28819 -105323 -142295 -229113 -236624 -240004 -230976 -109426 -6052 59437 41230 47639 17798
17065 17798 34228 -8606 -128412 -140999 -166968 -129420 -117480 -223001 -221748 -196142 -140634
17054 -140634 -51333 34463 -24747 -96292 -118516 -143876 -190925 -215436 -135660 -199809 -206399 -204393
17042 -204393 -73120 -61464 -90885 -141798 -144612 -111152 -120590 -211581 -298557 -362251 -358390 -338497
17030 -338497 -167882 -27200 -21729 -3026 -157574 -190455 -89227 -150203 -84946 -24528 56862
17019 56862 79316 -98139 -284846 -336986 -244264 -120164 -132265 -74943 -10900 28018 -12995
17008 -12995 -83756 -228702 -187262 -17328 11169 -47394 -73747 -141007 -199621 -160445 -159371
16997 -159371 -106401 -13906 -125523 -169327 -168352 -223015 -171458 -42282 -24299 11243 13439 75181
16985 75181 67612 24401 86099 28994 -102677 -88643 -41883 -98955 -111960 -34015 49548 6907
16973 6907 -12406 -60451 -116069 -104580 -119622 -137889 -147119 -136229 -140909 -112983 -111501 -101388
16961 -101388 -75665 -155187 -118990 -171419 -199625 -12927 102392 145219 76052 -52884 18416
16950 18416 67004 26699 51535 37766 80266 42274 69865 66901 -56946 -124901 -72167 -62612
16938 -62612 -30703 -39873 -50384 6751 -4085 -46558 -79783 -50185 72027 39826 74283 32476
16926 32476 -52404 -48952 -77669 -91163 -56438 36066 12101 -10168 -67375 -102167 10257 -20847
16914 -20847 -40291 -86349 -108360 -127848 -158825 -82976 -110490 -120206 -156767 -230099 -353923 -290947
16902 -290947 -165151 -89274 -27434 -32621 -21159 72482 26218 -43595 -23061 -37792 1916
16891 1916 35844 104031 135033 78581 43958 29825 10545 22344 50880 -21226 -179569 -200276
16879 -200276 -111347 -139777 -136483 -90006 -116649 -201236 -256635 -135733 -67930 21540 108051
16868 108051 62732 -77316 -50392 -7377 14684 19468 115419 121184 107011 -10206 -90061
16857 -90061 -39438 13540 105059 26051 -36477 -9927 35438 53295 27003 50511 46348 3681
16845 3681 -1703 -46 24509 124383 136812 42436 -63718 -161047 -258251 -216081 -164391 -227725
16833 -227725 -215999 -133548 25411 154878 158535 39209 -47944 -29014 5387 -21732 -103196
16822 -103196 -73603 -100207 -188934 -237890 -204850 -193596 -182910 -213211 -92222 -93394 -101596 -151228
16810 -151228 -102310 -15082 18952 4079 -11642 -33452 43456 192966 266716 173437 30031
16799 30031 -36612 -91178 -79615 52637 51670 -70261 -131645 -130819 -79651 -68641 33423 9495
16787 9495 -116988 -108708 -19578 63530 28012 98737 201104 67963 -87597 -24522 -29677
16776 -29677 -74862 -56221 -106653 20676 82715 38002 -54174 -110699 -83115 -85380 -153890 -132185
16764 -132185 -184696 -154029 -112759 -49447 -11642 -19275 -71941 -85306 20501 42007 77735
16753 77735 50318 57613 -16887 69596 61905 84673 91884 14134 60945 35308 -67943 23231
16741 23231 77576 -12710 -93966 -88093 -101168 -96042 14216 28815 -47105 -83504 -38221 13350
16729 13350 102302 87199 78113 113120 217328 127913 34092 -15793 25502 68088 75776 121334
16717 121334 39196 55175 45670 -73339 -68151 -19269 89926 36558 5437 -37160 25235
16706 25235 19338 -20462 -24059 -20139 64419 96056 107696 53944 32445 49867 14730 -36926
16694 -36926 -88592 -53068 -43212 -62164 -86443 -55738 -81260 -66588 -61855 -110357 -136221 -183590
16682 -183590 -168239 -105249 -43188 -867 -39920 -105907 -167819 -186465 -267001 -259920 -169335 -59064
16670 -59064 2322 46506 91844 51892 -10418 -94612 -53239 35992 -20686 -79234 -42965 -166610
16658 -166610 -240706 -182502 -35272 119506 131565 -18450 -179756 -288012 -255644 -227274
16648 -227274 -239318 -203656 -111107 -102665 -94030 -48600 37832 81595 69544 -9738 -40202 26439
16636 26439 38603 81088 132328 16983 -66881 4288 9259 3085 -68179 -91846 -162685 -201040
16624 -201040 -191804 -175251 -117707 -102691 -111237 -140490 -134104 -91503 -91615 -133458 -47302 -149310
16612 -149310 -132895 -67249 -44423 -77053 -126436 -87588 -87442 -115918 -4984 50627 33102 -115486
16600 -115486 -161528 -174288 -137374 -149252 -96066 -25103 -62176 -129770 -247058 -186431 -154418
16589 -154418 -177382 -129650 -195870 -204230 -153332 -125799 -97793 -195938 -19754 37626 36156 1265
16577 1265 -27618 -70741 -72124 -158711 -107160 43615 83005 10947 -24938 -165125 -201166 -75256
16565 -75256 -137357 -138444 -159849 -270322 -304461 -252230 -217976 -176727 10650 -33793 -128798
16554 -128798 -243041 -293436 -182182 -36698 54331 -47277 -75353 25501 56428 -107504
16544 -107504 -238722 -234388 -110861 36400 36433 -62495 -128126 -207431 -149581 -52770 -46760 -77317
16532 -77317 -39008 -108623 -150990 -64287 41309 -45186 -117209 -52534 -117673 -208754 -268300
16521 -268300 -228393 -271198 -293708 -185737 -87190 -7914 -17403 6068 113237 150953 11578
16510 11578 -90252 -105244 -129648 -51628 -16416 -31517 -71883 -48574 -67994 -65641 -62554 -37464
16498 -37464 -38039 -13597 -2411 -37068 -35541 -58913 -177182 -315541 -383693 -299881 -178279 -161856
16486 -161856 -146765 -117684 3607 66385 -5475 -52350 -65721 -90014 -4109 55873 44887
16475 44887 107761 178410 136624 176574 192538 115921 55482 36649 16205 -69140 -87836 -40716
16463 -40716 -101268 -106191 -100648 -88487 -108239 -173714 -187675 -151504 -57045 -24594 -25951 -12256
16451 -12256 -112152 -191490 -123759 -24498 23061 -80185 -104283 -128865 -130524 -6660 18318
16440 18318 16443 7318 -48400 -144958 -118499 -39897 22666 59132 37258 15955 19325 93637
16428 93637 177907 118825 12913 -61850 -91788 -17465 109274 -8454 -60146 -125073 -170020
16417 -170020 -109632 -54151 18587 -118706 -316105 -283555 -152507 -113291 -111316 -73426 -98627
16406 -98627 -143053 -95523 -86910 -79175 -187603 -115423 -119453 -113569 -65090 -104076 -98743 -166514
16394 -166514 -143742 -137762 -113229 -195804 -249247 -112103 -33792 -1366 -94174 -42103 42157
16383 42157 62133 27219 107257 126606 -12088 -100582 -32662 -110837 -108003 -95383 9042
16372 9042 53805 1371 -37087 -61827 -65916 -60057 -110889 -55349 -4358 22204 9725 -65683
16360 -65683 -82022 -123853 -138909 -143797 -131017 -110404 -139053 -131773 -147392 -225842 -205339 -62348
16348 -62348 -40082 -37469 -94408 -120552 -181795 -189824 -94378 47052 94734 103993 101726 68308
16336 68308 15644 -43078 -158243 -159352 -201744 -161076 -148910 -112514 -91047 -163404 -91014 28860
16324 28860 122522 74246 46004 15758 -5450 59599 67773 -82811 -129832 -145263 -161616 -82696
16312 -82696 -113879 -109334 -71167 -88785 -98167 -123676 -85323 -27789 -155470 -121061 -113544 -111933
16300 -111933 -212213 -213711 -142626 -88277 -59475 29649 33435 -97699 -245225 -152023 -155643
16289 -155643 -139783 -152055 -213402 -175799 -127408 -140792 -33001 -148085 -187044 -177287 -225046
16278 -225046 -205017 -80781 2390 -34808 -72244 -32735 3445 -13440 -59006 -77602 -20029
16267 -20029 -121858 -73089 9324 41512 51502 5393 7779 -42760 -39899 -62545 25517 68166
16255 68166 81652 9461 -19349 54066 -52865 -25122 38137 5686 24768 -21631 -16226 9521
16243 9521 63645 156410 115125 33242 35093 98688 146748 27769 -17651 18241 54794 85235
16231 85235 32423 -13798 -23917 65219 140357 59403 16631 -124256 -139439 -103040 34494
16220 34494 33349 -117624 -63563 25667 -32392 -140427 -146684 -89633 -51730 -152313 -196201
16209 -196201 -206398 -263235 -186732 -83565 -70859 -73898 12884 75080 22805 -54619 -70036
16198 -70036 -39547 -7740 17902 30077 81488 72394 94237 20420 13336 91574 127758 138057
16186 138057 22576 -89009 -213002 -267524 -181497 -43134 5373 87490 72328 -108348
16176 -108348 -139946 -136108 -45651 -20679 -42703 -63618 -62786 -1866 23967 -377 89832 -11728
16164 -11728 -19578 -12431 -86449 -128385 -156403 -122306 -117664 -108111 -84006 19664 76495 -7793
16152 -7793 -134267 -137133 -66467 -78377 -17339 25019 -32119 61826 152578 79302 38874 117803
16140 117803 85991 4938 63403 120556 159481 87157 105057 3387 -73627 -50611 78757
16129 78757 12903 58666 37887 82878 47999 -38230 -16671 11292 -65913 -31442 -35512 -23584
16117 -23584 -12292 14452 37109 78277 173604 154415 143792 -9718 16621 136492 133569
16106 133569 77785 16468 -18749 -39566 98097 113234 53954 33791 -12383 -63472 -161246
16095 -161246 -15578 166905 240327 131882 51301 -30661 -169956 -222567 -227991 -205096 -114633
16084 -114633 -62142 -63938 -98023 -190937 -232290 -112038 -139411 -88160 -19588 64109 35844
16073 35844 -43315 -102147 -7323 63800 110428 123839 98408 50540 66739 75015 57357 50689
16061 50689 97146 -11245 -88720 -110563 -187001 -196548 -198394 -111791 -39779 -23831 -6465 -72361
16049 -72361 1769 19157 -34535 -135023 -138961 -102511 -135463 -130842 3458 47292 50251 121989
16037 121989 154174 112906 51078 -9118 -57050 -1092 -25071 -40904 -66116 -4609 -23158
16026 -23158 -31379 -68492 -170908 -248645 -243426 -110631 -7721 -7598 36288 65354 12641 79832
16014 79832 86896 -826 -126616 -108664 -105318 -71539 39308 41087 -38188 -8202 24602 -54369
16002 -54369 13661 117724 25985 -1037 10925 -65241 -204464 -304128 -233592 -208244 -155073
15991 -155073 -170479 -193820 -294929 -264304 -205739 -82247 -186813 -129152 -124072 -52339 -110589
15980 -110589 -84832 13506 -32069 -65795 -119639 -121351 13103 143030 -3082 -147005 -130609
15969 -130609 -114567 -35677 9701 -4469 -51670 -109774 -185811 -182729 38453 138344 213749
15958 213749 150460 114182 -31155 -75243 747 -96096 -201869 -144879 -59754 -149084 -111186
15947 -111186 -30672 47062 -19582 -60346 -37916 66514 154663 53664 -17556 69672 92721
15936 92721 57150 -35163 -87682 -77767 -37547 14700 -108482 -223189 -175329 -86775 -113132
15925 -113132 -92225 -9934 6845 -56127 -78850 -91682 -112163 -62264 -78457 -60759 -89467
15914 -89467 -79276 -89168 -30062 -11991 35914 73406 13830 33817 -89055 -77231 -56602 -60549
15902 -60549 -17996 -13485 -97294 -3946 63146 67034 -3151 110911 136796 -71091 -151258 -158582
15890 -158582 -83678 7961 73220 -13624 -63628 -86226 -136151 -119129 -49279 71444 164008
15879 164008 150534 81869 24392 -112132 -117056 -99786 -153291 -164799 -122280 -12076 -83825
15868 -83825 -174887 -113217 -85130 -40858 40307 10452 -62037 -29908 -8500 -119342 -254619
15857 -254619 -164018 -44976 -35647 -3168 20189 -49158 -22387 47721 87765 111551 140740
15846 140740 123274 -35895 -98261 -88894 -47977 -36652 -113662 -161758 -172130 -169579 -248498 -223734
15834 -223734 -97951 -29842 -20711 -33746 -27591 15763 121511 140474 181643 153537 182147
15823 182147 178308 97446 24884 53924 67151 50732 171980 241114 150977 163227 101616
15812 101616 81505 46375 -39087 52636 160123 144739 85530 -21257 -87221 -52201 46670
15801 46670 -882 -21264 -4766 -58596 -83060 -31106 -134371 -150732 -58422 -49326 -85506 -88238
15789 -88238 -21585 61224 38412 -64155 -57810 -82110 -149077 -103346 1484 8952 41247 -39282
15777 -39282 32026 -57061 -110370 -200197 -195611 -226698 -128847 -14841 -65068 -161794 -87514 -84703
15765 -84703 -90072 -37300 102418 189983 172742 151940 98415 -6529 -50099 -28353 -112738
15754 -112738 -129389 -118460 -190764 -170302 -57952 85734 108655 359178 754136 1319918
15744 1319918 2318860 3863152 4733725 4523461 3514357 2212659 1338375 927096 645326
15735 645326 522697 460387 415568 391614 380081 299126 313951 267511 248092 331548 314602
15724 314602 177136 106808 169334 164079 92438 2179 -70678 -44515 6890 74535 78874 149201
15712 149201 157288 170392 89916 -46287 -96978 -27025 19016 57650 -57817 -61692 -29854
15701 -29854 -91172 -118048 -187735 -160461 -183899 -164867 -151999 -150211 -92438 -37927 33262 54398
15689 54398 122283 181934 85365 45728 105020 45026 -53643 -104247 -116679 -32613 64562 75574
15677 75574 65102 130763 144990 92861 97037 619 -18679 22485 -1744 -57151 36948 44112
15665 44112 1629 35953 132406 173378 137811 142040 76715 17374 -20580 3036 -160264 -151431
15653 -151431 -53390 22871 79782 99815 95965 72609 38037 -18079 55382 25747 -25265 -28699
15641 -28699 -14176 -57721 -79067 -23039 -91485 -79711 -38371 2239 -34544 73559 28683
15630 28683 -38416 -99501 -167135 -173094 -84658 -55654 20973 36788 53163 12900 38915 91540
15618 91540 95706 80872 22022 -17471 -8873 36765 58947 -52732 -41951 38779 36680 -15038
15606 -15038 -46672 -45744 -47575 -53323 -196435 -133484 -95390 28331 151086 199517 143957 86695
15594 86695 58665 2012 -4650 3554 26209 88251 117016 64736 1044 -825 79958 185718
15582 185718 190396 135949 23568 -16700 -129232 -117251 -124198 -175303 -69924 -37406 -56532
15571 -56532 23073 48504 26583 68805 103252 44404 -62404 -160195 -143518 -136892 -156554 23089
15559 23089 76875 -18407 -64302 -19683 -43101 -35817 -8866 52816 109399 130547 117027 100549
15547 100549 39518 6999 44896 43571 34068 124224 -36828 -135095 -151725 -150513 -184764 -133000
15535 -133000 -231500 -181684 -62306 44295 -87621 -150993 -131666 -68730 -67790 -22355 23656
15524 23656 -57877 -120781 -116900 -103680 -56360 -82513 -187678 -116092 -10041 -33627 4159
15513 4159 27695 22173 -30547 -135146 -163724 -133337 -113374 -133387 -136588 -41190 101524 118688
15501 118688 111720 181521 198797 50664 36627 89311 117609 189955 255741 106078 -56234
15490 -56234 -97972 56525 88165 49556 -12325 -44401 -144954 -106142 -33885 -418 2675
15479 2675 -58533 -127297 -79469 -97557 -93285 52923 98199 32792 18461 -76672 -91269 -27137
15467 -27137 -56822 -43388 18286 61989 62427 72888 183988 147339 -30883 16336 189197
15456 189197 166806 94274 43313 -39358 -75913 20207 40158 8315 737 11886 -79203 -92003
15444 -92003 -28955 -67882 -136657 -67577 -76610 -62580 -113030 -105257 -116159 -48875 127131 195208
15432 195208 113709 9987 9301 59243 -20141 -44778 -35333 -28282 -45266 -18029 88107 37486
15420 37486 43560 7402 6318 -55371 -65630 11241 42327 22175 41909 54558 -25491 -129841
15408 -129841 -113069 -78397 15676 -76440 -17511 23479 37117 22984 -26175 -103469 -160159
15397 -160159 -144047 -181206 -145191 -130489 -49835 -36161 -81912 -101610 -197758 -70564 84741
15386 84741 24101 3348 77224 120425 109697 128983 176389 134069 112778 -334 -126087
15375 -126087 -3495 119826 47921 61751 100453 110789 44683 -74530 378 79196 483
15364 483 10268 34791 -34201 -101839 -141272 -136062 -96674 11598 -29020 -56415 -96650 -157047
15352 -157047 -257357 -357887 -354247 -199577 -64292 -151797 -179169 -141441 -64793 42588 216843
15341 216843 177002 154498 65803 93570 127384 77565 -109224 -192166 -153237 -29735 90743
15330 90743 118052 129426 153314 52910 -16697 -85421 -42120 16168 101943 187907 140715
15319 140715 72826 148037 126350 124616 137158 89385 91688 10902 -125217 -178909 -77347
15308 -77347 11773 -36144 -47036 -79518 -50864 -56700 -108858 -79103 -45150 -14504 -9649 23511
15296 23511 12381 102562 181222 275958 218298 106864 30097 -34395 -28230 -13244 61970 89393
15284 89393 26721 -6021 18425 101523 78246 -10540 -86692 -118380 -98321 -11414 -71223 -183212
15272 -183212 -257930 -200324 -91855 -64220 -63571 -61167 -17673 -10053 -83142 -49919 -40355 -60865
15260 -60865 26657 114622 74222 -23663 -43265 -4240 -216 -18714 -6514 44892 -14070 14771
15248 14771 62522 326 -111224 -124932 -101555 -115308 -145052 -129772 -80453 -16190 -95325
15237 -95325 -125662 25403 9532 2589 -70536 21734 45527 72406 86331 63417 9973 9995
15225 9995 31407 77602 45875 56240 25062 -60521 -71883 93951 43239 -96226 -77806
15214 -77806 34473 -3320 -156713 -216171 -158213 -153806 -225349 -260607 -226445 -174309 -59211
15203 -59211 -12197 37250 17896 35950 -98043 -77606 -77337 -121858 -166827 -92983 42617 99960
15191 99960 15546 -69576 -130942 -66940 -12918 -9930 32336 6967 -52794 -40591 -38984 -36897
15179 -36897 -66399 -27411 103359 140380 69475 -96428 -145589 -191667 -65692 15674 -26444
15168 -26444 -12592 -48518 -60345 -26441 -25116 34321 66722 30181 -56877 -117340 -209475 -245689
15156 -245689 -147898 -95025 -160463 -195658 -112956 -129934 -119929 -18568 -2294 -16381 52649
15145 52649 113443 42559 -19100 -108059 -180175 -281334 -316814 -154177 -126050 -67457 -921
15134 -921 309 11545 2718 -39141 -56728 -73810 -99450 -104496 -115685 -17426 31995 40646 35022
15121 35022 -77369 -195567 -82196 11762 72504 153290 230031 161137 65003 -67554 -230485
15110 -230485 -142413 -66581 -39163 2102 -11006 -95448 -174497 -180462 -165371 -135451 -175866 -204652
15098 -204652 -203423 -132600 -82444 -19551 19669 126335 24031 -97738 -182044 -123698 -108755
15087 -108755 -118682 -106044 -70924 -98796 -87309 15996 42619 10725 -45613 -35329 11421
15076 11421 60586 232 -52585 -77114 -119372 -18327 8369 -61318 14515 -4143 -31423
15065 -31423 -5751 -28418 -78176 -107798 -11856 -23708 29933 -56343 -189632 -190021 -74151 -57652
15053 -57652 -15071 33576 48738 53905 -15093 22011 100261 91712 129280 96807 -115632 -153309
15041 -153309 -109322 -108869 -70666 -149896 -188412 -183442 -97059 27379 107480 128967 110955 45388
15029 45388 -30966 -97340 -59589 9183 61994 99331 21982 -81327 -106377 -82082 84699
15018 84699 153202 136999 156832 127133 20371 5626 113134 135924 21186 24610 43488
15007 43488 89481 20608 -38429 -58040 -112128 -149453 -164438 -162186 -65975 35452 -31867 -101993
14995 -101993 -140981 -71233 -21332 -29096 32211 87654 -35720 63255 233585 253728 131899
14984 131899 -22749 -39877 59932 111693 85271 -53022 -57162 37336 -22076 -23180 26257
14973 26257 67392 57496 29840 42090 -45710 -3117 116131 118200 47022 -63459 -112076 -119153
14961 -119153 -49956 70142 75973 19803 -43094 -109345 -125853 -84513 -39772 -100068 -49077
14950 -49077 -4813 -73845 -143312 -289118 -214032 -107695 -82870 -4994 90242 52025 173041
14939 173041 203087 157135 39252 -23782 -9153 63905 53957 49425 15487 27411 58600 43906
14927 43906 -76300 -32677 -14209 26648 94081 -2740 20356 120521 78665 -785 -32524
14916 -32524 12326 10304 -26877 -1010 -86014 -95493 -140935 -125895 25360 -106070 -216299
14905 -216299 -291017 -250203 -240045 -67531 63557 35828 -68060 -133745 -76044 -82080 -84794
14894 -84794 -92969 -128890 -37285 -43614 -136665 -173702 -74114 -51136 -42603 -49406 -109043 -109013 -62987
14881 -62987 -3104 245 49698 53257 5327 50544 10475 80432 41266 -115065 -160466 -140613
14869 -140613 -36533 135425 165767 -5918 -81151 -65217 -73000 -37826 -10522 -39450 -33177
14858 -33177 -4410 9186 -48208 -7736 -1767 2947 -35174 -29786 -24324 -74593 -50585 26593
14846 26593 45245 75685 151856 72176 8398 70604 138326 138313 -57475 -114670 -146269 -104550
14834 -104550 -104673 -98439 -102429 -158935 -177481 -103917 -83398 -82401 -15688 14433 -32914 13341 90922
14821 90922 56558 23143 34173 44562 -65868 -110904 -122223 -142313 -148621 -158009 -99755 -42926
14809 -42926 -21366 304 18889 -81732 -73465 -123240 -117195 -72734 -10997 -80533 -76167 -67651
14797 -67651 -31075 13897 -1813 23944 -38837 -73646 -119533 -47997 46552 8243 18669 123457
14785 123457 157299 71747 27894 -1543 -50989 -107407 49064 88515 187828 155872 103655
14774 103655 43489 -92232 -67769 -55143 -139881 -180168 -232478 -130756 -86290 -37087 -96506
14763 -96506 -94441 -160001 -147161 -172405 -267932 -363917 -389564 -346494 -172222 -13857 8310
14752 8310 -64038 -83910 -21092 2405 35451 46885 16033 -2750 -77279 -124408 -18355 77935
14740 77935 123994 194396 98514 -40945 -61949 -43712 82878 95447 43017 -11444 72783
14729 72783 93677 -13744 -6333 8260 32621 46909 -21833 -2244 73100 -4761 -24902 19143
14717 19143 67376 90774 101621 55919 -40096 98647 160540 84861 64721 70304 94167 40995
14705 40995 -1463 130288 137700 107032 108210 57456 92767 168627 120063 123050 143201 131898
14693 131898 151252 163325 96687 118082 121502 144467 153715 68028 10512 5497 -71555 -20541
14681 -20541 53357 -8881 -47431 -14433 57666 158603 143131 48778 -40958 -115581 -81946
14670 -81946 33676 57005 40419 80460 57945 -32862 -147689 -210884 -213398 -126811 -37244
14659 -37244 17493 19532 -72964 -36482 -86836 -163807 -28034 87497 41342 33633 31538 -51010
14647 -51010 -86733 14901 -50929 -157539 -127608 2525 -42615 2401 65573 -72078 -132032
14636 -132032 -93302 -20592 115585 126935 160229 136521 -4869 -17153 43723 -55623 -123810
14625 -123810 -116905 -106191 -97365 -138702 -123016 -121134 -83024 -88663 -61764 33914 36039 1423
14613 1423 29729 87671 127446 75065 30467 4688 -20871 9216 -50548 -118439 -162674 -165024
14601 -165024 -63260 -63332 -147142 -92887 -49431 -62179 -10223 38281 -49834 -113607 -87806 20681
14589 20681 51151 37507 -4066 -43545 -48758 -137681 -218267 -215035 -112814 6816 -14232 -36787
14577 -36787 -18486 -52857 7740 -19049 -14593 44963 45096 57429 -66710 -152105 -79208 76020
14565 76020 154064 83613 -82157 -144266 -18393 30875 16598 96227 144798 180517 150795
14554 150795 62614 78089 227028 140706 135610 224398 198325 187816 165621 157889 105020 97526
14542 97526 118939 81873 -13735 -39831 -16184 -92626 -56555 19782 40625 15820 55210 -9691
14530 -9691 -26736 -53210 -7126 26944 63496 107620 155236 130478 2204 -137710 -124682
14519 -124682 -96963 -151877 -111007 -130159 -235146 -297436 -248660 -70045 -119262 -129576 -115900
14508 -115900 -178605 -158344 -165987 -125755 43125 11003 -27450 23265 56069 52105 5370 -56758
14496 -56758 -107145 -119357 -130880 -145333 -128631 -78037 -112433 2164 98954 37965 -61619
14485 -61619 -157942 -19328 122921 130506 130096 75729 50320 107016 142615 72357 30090 -54035
14473 -54035 -13863 -38781 -27686 50233 -59552 -122351 -69970 -28978 -50750 -57282 56431
14462 56431 39295 17114 17293 108993 119681 65455 -16767 -27460 -84594 -22712 -51364 -143206
14450 -143206 -136848 -170315 -253111 -161478 -89958 -107104 -158313 -214771 -179948 -73003 -56540
14439 -56540 -60150 -47243 -35599 -11231 160913 187816 213368 241826 222090 116987 126165 171611
14427 171611 216048 208408 256050 244212 206069 153463 186062 34291 35797 95807 71661 84181
14415 84181 79617 110250 -12235 -49420 80200 51527 -11063 -29927 32126 126245 62714
14404 62714 -78147 -62799 -24953 30697 139532 148367 3571 325 -34473 -84219 -31387
14393 -31387 38186 62160 20592 19319 60954 -4417 -60598 -37229 25053 23504 -81514 -35233
14381 -35233 112556 35176 -82651 -147177 -202232 -116816 -33033 131670 221969 150814 135540
14370 135540 26128 -140797 -5947 95249 84798 69029 175353 282466 242169 207869
14360 207869 158713 95833 100894 63755 21912 -26127 -117349 -21446 -15015 -25106 -65000 -31949
14348 -31949 -42388 -54705 -128369 17929 32063 6110 -46280 -42518 30609 8926 -87233 -50455
14336 -50455 -10303 -1385 17269 46922 51157 43566 126253 88868 -54760 -49782 -6017 81663
14324 81663 152930 75271 -81 17879 -17 17840 -42527 55679 175030 139546 164020
14313 164020 175450 114527 144532 249200 255900 218469 179345 142249 5572 -29160 37576
14302 37576 1069 -37581 11023 4790 -43926 -125938 -121752 -38393 58795 15387 -24724 -20855
14290 -20855 -28349 -24497 28906 148553 197447 78015 7770 -12965 53680 -98202 -47790
14279 -47790 1078 11333 43241 69315 76364 3406 -9789 93227 123110 161502 169315 191191
14267 191191 154901 162963 147160 172197 43129 33064 73924 69382 154019 -34942 -89554
14256 -89554 -121245 -229357 -291699 -177916 -75173 -39642 -19552 13558 76566 132853 11356
14245 11356 14737 -42477 -106258 -27841 38755 32115 116632 149084 147436 114602 28603 -39572
14233 -39572 11816 4642 10113 4813 121068 153128 63479 149862 138339 21249 -44640 -101277
14221 -101277 -73577 -130120 94840 167480 111269 109634 73681 33469 42968 42027 120952 104315
14209 104315 89176 92803 91680 164760 263010 174721 83190 84419 43973 97737 130594 52288
14197 52288 -28787 -23593 -52222 -61012 -23189 53989 27213 68053 6952 36962 57976 -3248
14185 -3248 -5712 -64812 -50940 -36679 -94901 -27971 2164 -33879 1122 65870 53501 42550
14173 42550 65751 30190 -66490 -54758 73221 153741 62808 -8465 11068 65648 697
14162 697 76674 119441 61457 9946 36958 77346 48086 136572 202717 179676 205287 171553
14150 171553 116990 34138 -60562 19610 63266 66042 74568 69388 94919 57730 106496 86403
14138 86403 127064 236819 213918 198720 187967 246821 251389 176935 204351 217248 94698
14127 94698 14218 5466 76434 31331 54013 136325 94552 41405 101033 129705 183742 233377
14115 233377 181183 106220 73020 60987 82855 74811 -18371 -99753 -62907 8759 22699 9337
14103 9337 -78588 -17301 121448 84485 89127 67731 51326 9456 78951 160866 93728 14702
14091 14702 79295 155369 69307 82455 119273 182726 234202 293246 356888 420056 436370 434309
14079 434309 380650 257495 188902 253157 205996 211920 153827 174155 249990 308050 306866 247183
14067 247183 222384 117642 125912 85545 43602 105487 95327 45892 73922 69155 34265 104948
14055 104948 5985 -83036 -42289 41100 164593 125190 104755 95444 82039 148477 96263
14044 96263 12721 96581 179351 118260 29921 -28786 42768 74688 -10930 102092 126546
14033 126546 4798 -57319 -49221 -31348 205 -62181 -90900 -59011 -32603 -33901 -39799 -18073
14021 -18073 -16333 -29761 -80493 -93516 -12889 -26759 45469 -33560 -149461 -181050 22212
14010 22212 105737 60569 64877 140125 158550 114519 89295 41101 50513 11431 -16315 25176
13998 25176 96382 124089 137953 152937 215217 309883 194572 70133 69079 107652 52794
13987 52794 110151 81487 231829 246249 95031 123502 203064 152297 101548 183959 192667
13976 192667 121751 199365 235626 213745 195646 197843 96067 -21928 -876 2987 164801
13965 164801 208556 172694 158948 148481 131028 166624 196549 191836 170212 135329 172904 119221
13953 119221 88172 82267 132293 85567 55704 35360 -5734 50333 88464 56396 -57253
13942 -57253 -71948 23036 75095 144548 295675 316441 239858 284887 313614 143066 84099
13931 84099 105467 79172 106772 112956 166385 105758 29539 17975 -56202 38900 104217 82343
13919 82343 94371 12679 50702 85119 89537 150445 27118 -38469 40595 76608 12343 30163
13907 30163 3204 -6294 -2906 74621 74014 71805 160811 174666 145977 90401 5418 -25342 84699
13894 84699 272904 271315 171441 89007 -21899 -72757 -6312 -32603 89260 20952 -31499
13883 -31499 53449 110236 106387 98211 13401 63165 102883 197195 186168 95590 40207 50355
13871 50355 78522 92471 109777 65329 -35194 -22926 2396 44499 26147 35511 147346
13860 147346 162183 185191 215581 225890 218878 132743 160790 132013 113133 216087 277305
13849 277305 314990 211771 155237 141554 53310 -21207 132280 268745 251553 168024 109814
13838 109814 155086 157876 50487 114200 92527 -20005 -62439 11619 21807 12021 -82473
13827 -82473 -54761 -14694 17981 -32442 -42520 -16291 80681 118803 57038 -49650 -130707
13816 -130707 -94180 -51587 79833 79975 37566 62759 132701 94808 56353 127379 219621 246588
13804 246588 246734 255243 200102 178350 128726 207748 105602 50971 185292 160191 162211 271395
13792 271395 277604 236393 134470 123053 158155 180846 243526 236870 158944 143295 36693
13781 36693 25896 13326 100849 187783 185647 180409 120507 55967 124712 106840 6349 -18334
13769 -18334 78335 165935 143798 23525 -60138 -67051 -4407 52213 205766 172621 40644
13758 40644 8817 8867 -71480 -24904 -15764 -43910 -9795 98286 207990 219804 156094 32579
13746 32579 75711 107940 130617 258897 290711 193125 168383 163627 115361 81535 72960 546
13734 546 -27869 42994 190095 270217 207207 195232 165982 206404 272207 297929 183769 79300
13722 79300 102921 -21416 26652 85070 47385 -158295 -250350 -98698 25585 80396 144281
13711 144281 83931 -35063 10148 118446 127295 152640 108768 119904 197612 174019 29749
13700 29749 64449 191280 213271 275659 290210 263367 143000 259753 306564 272037 123301
13689 123301 92892 142210 194289 143619 106551 94193 93918 90072 215965 237176 140603 112342
13677 112342 108674 43106 -44287 -8785 84037 186625 250028 289845 232612 147580 109216
13666 109216 94490 198400 260652 234093 230962 245867 193170 98534 170135 187736 224287
13655 224287 231901 228332 220584 280563 318224 232130 183113 325458 346488 301550 226207 250324
13643 250324 337179 226385 141551 147587 233160 181867 135085 168604 129503 55205 126917
13632 126917 114227 216305 319766 253960 220071 276165 225807 243299 164798 93197 66242
13621 66242 135847 189469 301168 219871 143843 135423 136812 127547 224338 316941 226721 168613
13609 168613 185087 139961 119042 116541 148574 130103 217957 97650 98900 88393 40272 37427
13597 37427 78998 68120 171095 313279 298605 226277 229023 316840 343040 297243 259468
13586 259468 241475 286443 201124 145739 122309 104917 44178 67858 87426 113357 179364
13575 179364 229850 252259 187051 285872 241298 104469 8828 -13197 -45570 -11673 151268
13564 151268 293323 252841 179895 197206 200890 167092 360323 413588 359333 217043 100423
13553 100423 108885 153351 177599 219412 210668 174881 110524 169314 136498 67677 -31248 8830
13541 8830 28435 -69777 -63527 2410 75734 79311 79773 116395 126061 69143 -276 133146 207054
13528 207054 182153 229083 223726 276744 335802 312962 264198 162480 81200 75012 52515 75805
13516 75805 197722 288162 337052 320786 194732 166338 92424 102260 85847 161101 193377
13505 193377 114656 145408 263135 351955 348570 281751 199410 159769 124762 107550 53428
13494 53428 133033 198274 262720 258794 320331 262638 32801 38100 207770 326944 281749
13483 281749 213020 227446 190899 136821 107216 145535 207819 183951 171130 81135 8542
13472 8542 39711 158186 312768 419183 362157 252276 320603 386403 332069 238218 205860
13461 205860 227154 238325 198168 148065 152021 67655 206 80519 185283 211797 214602 173881
13449 173881 231385 187289 132270 181363 139506 202163 207664 159947 109358 119665 102420 170440
13437 170440 195742 163098 261412 279890 290936 389404 383420 275384 153461 150507 70162
13426 70162 132185 200266 189622 299079 347976 237781 218957 289756 292749 232059 240412 249671
13414 249671 279886 292218 228844 239172 227985 154759 116523 237773 321664 338215 232100
13403 232100 178652 156855 129020 67677 143357 272448 248634 154966 163476 112658 179057
13392 179057 341415 320749 183957 207400 244946 175907 111417 153894 207486 252076 208836
13381 208836 152308 107406 255639 319050 286220 290798 290309 226570 186136 198322 158934 182995
13369 182995 165178 198360 224072 172017 250575 136049 95386 164743 214726 207064 88146
13358 88146 149276 295949 364057 331058 306269 340306 272972 245884 118306 123932 154554
13347 154554 124244 152907 189552 157960 93372 66224 193704 327415 317345 269361 289839
13336 289839 228003 268460 282346 261224 324414 339993 276337 292657 276477 198078 154919
13325 154919 172466 68888 111313 206872 204297 229277 326595 198461 90747 212751 392705
13314 392705 302806 238792 231402 177471 265393 342283 369492 413461 385600 351821 251521
13303 251521 202101 107387 28520 25958 145250 271751 181891 98490 138919 169715 206756
13292 206756 272238 178515 122244 272183 285509 352448 367276 332273 325478 334475 298577 210475
13280 210475 200054 253976 257977 213639 224389 271704 273220 258682 410357 444259 409660 311630
13268 311630 227084 141424 94490 153020 142281 122802 125796 177199 347380 354412 285812 270138
13256 270138 190652 94202 25720 9026 -4592 22797 31699 -1297 70322 158741 29914
13245 29914 53257 166997 138352 -22977 50999 225072 203863 87281 144578 294259 262453
13234 262453 262713 184803 136361 229280 266161 314432 385959 386187 370625 301625 311160 295790
13222 295790 329568 397194 399978 351724 199096 130520 57182 101877 70985 108965 244874
13211 244874 323512 356507 356619 260253 162960 186412 142309 87980 10817 114450 155876 100095
13199 100095 116998 227942 316118 371322 410640 311349 161764 74037 31913 35813 158612
13188 158612 235937 303653 310801 178879 31757 24683 141655 193466 204680 263718 168004
13177 168004 211767 325458 332578 353426 414048 412657 394337 440379 356606 319915 294576 343865
13165 343865 407773 370885 377258 387280 403308 346146 312045 199382 204055 173321 274554
13154 274554 481724 527754 468307 374262 306859 356934 298676 325517 446103 531632 580688
13143 580688 569620 606221 513547 366950 290775 248369 254245 415213 491314 453363 434942
13132 434942 423628 483110 415734 254859 207944 209464 127785 175258 179240 213923 259637 289879
13120 289879 309251 286093 229584 233492 249616 367721 483030 467679 312702 225088 164438
13109 164438 233492 326546 342692 439663 450082 420922 460828 534628 463474 390596 387585 333035
13097 333035 433660 422595 328791 355019 385780 391976 396718 350097 310686 248048 138585
13086 138585 174296 255641 364427 303053 263330 315756 304373 301596 322881 362742 323809
13075 323809 387287 336463 341103 374619 367844 461544 449663 545507 492401 465344 641942 920282
13063 920282 1101012 1352333 1582495 1641075 1506494 1390607 1241885 1044116 907922 792084
13053 792084 838329 820548 751963 617333 549781 514535 611333 667907 675579 677393 621492 532527
13041 532527 590382 697669 659839 596366 551340 420858 466932 472308 461553 437517 431003
13030 431003 459966 501514 542141 677220 756168 780164 734970 754615 801530 930840 1240922
13019 1240922 1705706 2346542 3191996 3965002 4305843 3894209 3072025 2285073 1645467
13010 1645467 1242105 1098412 1043491 933637 772612 631565 583689 652119 625726 699713
13000 699713 759626 705375 662462 603975 565030 546729 555387 604536 558830 494209 553141 705234
12988 705234 700384 760927 669891 671266 719140 803731 862720 802283 813512 858606 984116 1128299
12976 1128299 1224040 1452480 1832529 2525515 3488842 4328800 4694638 4412563 3779916 2975292
12966 2975292 2271256 1886329 1766594 1810385 1774440 1849596 1962227 2077048 2021339 1990116
12956 1990116 1997451 1971531 2006583 2046809 2022258 1986266 1912591 1835401 1685055 1579272 1564045
12945 1564045 1542709 1543981 1561983 1575683 1537265 1541363 1544966 1631264 1753101 1941160 1999892
12934 1999892 2100793 2275486 2461022 2589663 2886732 3044572 3278822 3554052 3837303
12925 3837303 4018182 3889500 3547434 3366488 3064988 2793063 2590146 2398571 2327214 2232890
12915 2232890 2105108 1935741 1805085 1792613 1743465 1721961 1696331 1803181 1678866 1658045
12905 1658045 1627855 1577714 1655631 1682380 1712025 1730969 1827094 1962046 2138577 2266061 2365867
12894 2365867 2343276 2308826 2367611 2316027 2105832 1913975 1640152 1549636 1624377 1529365 1426948
12883 1426948 1326599 1210572 1080379 1101623 1118199 1020003 1087049 1176201 1040874 930098
12873 930098 977126 919290 874152 799358 927995 973141 873168 802287 812519 717797 599640
12862 599640 686221 656668 637404 754900 784269 826558 888414 870394 773650 660561 618983
12851 618983 649625 857325 946418 831782 694975 667680 762591 842982 772050 752611 896020
12840 896020 937531 816872 768453 723823 689447 656264 656319 701932 747515 732415 667784 678280
12828 678280 657017 626366 665793 647684 617962 629165 674794 676331 630236 657814 710053 782935
12816 782935 746780 741921 783000 848473 913976 852419 836817 975342 800729 723440 750589
12805 750589 781895 780391 837690 789963 741026 797789 841598 899788 838463 747153 691916 619806
12793 619806 704321 791876 895131 885418 902167 889406 812899 811428 899672 889725 890656 940951
12781 940951 982003 982063 907614 805982 815796 857916 803773 783610 798937 844905 948911 1043394
12769 1043394 1089019 1036951 1084111 1172825 1163015 1167325 1272901 1282151 1226341 1274104 1296721 1317835
12757 1317835 1355588 1372621 1290995 1212622 1163820 1115291 1050424 933768 999285 1135843 1229829
12746 1229829 1174767 1123098 1158094 1234127 1262220 1302193 1279616 1293726 1498796 1561309 1512409
12735 1512409 1421803 1403346 1426054 1409309 1355228 1425408 1520438 1576504 1526019 1526419 1556448 1572427
12723 1572427 1545275 1401804 1407630 1413493 1509399 1520276 1382450 1346902 1374252 1256876 1228851
12712 1228851 1217897 1188873 1112913 1250531 1422586 1393802 1348770 1402290 1421224 1426483 1430121
12701 1430121 1508649 1451479 1387042 1519296 1572433 1453236 1388532 1345527 1376842 1460094 1386607
12690 1386607 1360035 1338292 1310660 1309431 1294463 1374043 1380084 1456264 1306781 1208107 1124836
12679 1124836 1059639 1138483 1286518 1450321 1470577 1449174 1453508 1436066 1475929 1542814 1645878
12668 1645878 1656497 1787333 1858150 1956970 2099276 2234515 2235305 2301428 2330614 2392759 2433654
12657 2433654 2567238 2659437 2626822 2654186 2801551 2828828 2754199 2686302 2698687 2608590 2504981
12646 2504981 2476967 2528632 2559895 2613358 2712062 2911603 3078147 3182134 3375946 3513498
12636 3513498 3661423 3772818 3969043 4119272 4047993 4076618 4231249 4356247 4453804 4518976
12626 4518976 4579609 4465474 4334132 4301004 4298746 4240937 4240718 4231753 4387685 4508862 4587994
12615 4587994 4494928 4337794 4176975 4069174 4072288 4193661 4218698 4233867 4289366 4299664 4412289
12604 4412289 4552715 4561579 4573624 4607012 4741735 4972661 5156416 5278824 5402507 5436476
12594 5436476 5477068 5463466 5391334 5279162 5152515 5070364 5090465 5046209 4919470 4763129
12584 4763129 4728730 4730387 4841360 4833948 4780042 4786558 4932137 5002372 4905913 4985030 4977946 4950096
12572 4950096 5068805 5210100 5121606 5050531 5176383 5251237 5271755 5267442 5339719 5433979 5582883
12561 5582883 5710222 5720229 5818177 5908908 6063131 6261183 6539625 6775861 6854111 6962524
12551 6962524 7175717 7473571 7717211 7969213 8195891 8594010 8954104 9263899 9683469
12542 9683469 9987165 10226490 10625507 11172766 11668664 12234472 12924246 13573896 14298315
12533 14298315 15129409 16045387 17094938 18254117 19527974 20806975 22441979 24322919
12525 24322919 26463738 28885902 31675612 34852778 38649060 43199843 48626020 55296142
12517 55296142 63388879 73447832 86017402 101560825 120427945 142942848 168406938
12510 168406938 195199011 220717914 242010321 256780083 263646821 262584375 254330164
12503 254330164 240933679 224606479 207694480 192177439 179288775 169788747 163832565
12496 163832565 161161005 161646599 164980985 170298922 176577884 183072075 189390225 196364429
12488 196364429 205576601 218680674 237557339 263003178 294578130 330105868 366078490
12481 366078490 398701863 424690318 441856207 449209094 446775230 435450281 417226925
12474 417226925 395067055 372552765 352826378 337721251 327744932 322012164 318211837
12467 318211837 313498284 305544874 293403223 277989982 261576916 246793150 235585628
12460 235585628 228931695 226175406 226210176 227625875 229584811 232389609 237148188 245377279
12452 245377279 258348030 277162347 302309268 333090314 366564606 398066070 421554882
12445 421554882 431709529 425454165 403319833 369198581 328680057 287170369 248300159
12438 248300159 214145410 185458839 161756831 142252783 126197408 112968329 101715378
12431 101715378 91995305 83543827 76094540 69414310 63396980 57986916 53134975 48844252
12423 48844252 45178812 41836880 38824755 36129511 33641663 31358312 29446984 27634373
12415 27634373 26052179 24546962 23198067 22044661 20923067 19844809 18837530 18019509
12407 18019509 17232214 16364148 15668636 14972425 14292433 13753822 13214487 12657533 12223865
12398 12223865 11840636 11414252 10832950 10449970 10173815 9804516 9476383 9191973 8937524
12389 8937524 8685572 8422792 8082378 7879013 7677963 7498759 7374967 7096606 6803618
12380 6803618 6570949 6499559 6376294 6274233 6146805 5974712 5854426 5721722 5581655 5484846
12370 5484846 5587345 5544089 5408534 5333432 5327869 5293248 5284801 5217161 5179483 5194813 5274806
12359 5274806 5264795 5261291 5265473 5191336 5209413 5309851 5416093 5529703 5693567 6039419 6383088
12348 6383088 6706980 7269010 7891175 8431128 9049963 9572717 9815064 9821815 9613024 9275414
12338 9275414 8671042 8221871 7890957 7696734 7345816 7064453 6893575 6869022 7088116 7361629
12328 7361629 7603394 8060190 8597309 9207235 9789326 10322240 10390113 10098677 9660435 9035853
12318 9035853 8272330 7603472 7162919 6705543 6384219 6213637 5917257 5837317 5786781 5701705
12308 5701705 5584182 5484280 5471178 5418775 5355673 5273375 5275439 5136931 5124861 5101339 5121953
12297 5121953 5233851 5246766 5220109 5121546 5136790 5262573 5527528 5546802 5622411 5941907
12287 5941907 6042925 6101188 6219487 6283400 6291765 6407654 6511813 6490819 6456839 6600926
12277 6600926 6817304 7029379 7184229 7279869 7326980 7501403 7643119 7854844 7966394 7991808
12267 7991808 8213060 8641709 8912255 9174546 9396473 9700532 10054865 10212620 10617433
12258 10617433 11071320 11506945 12025437 12672770 13249081 13975884 14729385 15429075 16193565
12249 16193565 16883069 17806899 18953823 20239826 21513001 22908539 24512531 26227418
12241 26227418 28129859 30399890 32928809 35784782 39005499 42701523 47018659 52202612
12233 52202612 58277009 65422227 74141927 84770375 97814566 113830522 133365346
12226 133365346 157433915 186679203 221471400 261039910 303454295 344685490 379524767
12219 379524767 402815470 411029111 403597572 383512019 355594790 325275748 297207116
12212 297207116 274191091 257271901 246114997 239314895 235017221 231553262 228014594
12205 228014594 224555542 222354865 222793785 227006988 235568021 248235225 263491741 278902943
12197 278902943 291855525 300756422 306561104 311493564 318290855 329216724 345161367
12190 345161367 365306489 387569182 409284649 427908482 441142692 447195414 444736227
12183 444736227 432572703 411313739 382731786 350050076 317201138 287182927 262134057
12176 262134057 242883494 228867879 218709551 210632268 203217415 195483585 187737645
12169 187737645 180738604 175625907 173369755 174474287 179074435 187275316 198961531 213426380
12161 213426380 229543362 245581299 259552302 269110587 272431886 268320542 256527167
12154 256527167 238348093 215950494 191919925 168414760 147245896 128871169 113235721
12147 113235721 100154953 89245835 79973901 72107715 65256589 59338538 54098635 49668792
12139 49668792 45707995 42094052 38876864 36097983 33595857 31311783 29302478 27456973
12131 27456973 25905888 24474790 22995810 21697310 20555682 19553438 18671935 17825358
12123 17825358 17008049 16227808 15574605 15106261 14706444 14230138 13607212 13121683 12659748
12114 12659748 12207458 11834141 11491273 11119514 10715860 10384709 10090084 9906377 9583800
12105 9583800 9293504 8999682 8762741 8604298 8488667 8278090 8137171 8073807 7903963 7688460
12095 7688460 7559509 7536237 7446842 7203217 7063860 7003684 6939265 6837302 6543386 6354402
12085 6354402 6256125 6277740 6175038 6225417 6186396 6144460 6160931 6042533 5864373 5762118
12075 5762118 5782682 5767349 5817974 5905428 5982196 5873450 5731692 5751186 5753558 5899308 5925160
12064 5925160 5901558 5919205 5955323 5979017 6001817 6076575 6155530 6147898 6097686 6013882 5955234
12053 5955234 5965850 5992416 6091667 6263926 6354401 6471705 6637912 6901068 7069491 7223259
12043 7223259 7433299 7602678 7718569 7772660 7737804 7720481 7811824 7890296 7967975 8011103 8007002
12032 8007002 7988290 7917397 7935552 7957733 7973968 8041532 8073805 8046684 7958460 7966370 8063235
12021 8063235 8108187 8215289 8364645 8553535 8636211 8659703 8790172 8938010 9046599 9182159
12011 9182159 9343526 9551300 9594257 9448067 9357236 9361714 9344023 9189819 9150930 9255870
12001 9255870 9419400 9502801 9437607 9533529 9571017 9587785 9657857 9614175 9778961 9948955 10111225
11990 10111225 10221915 10359690 10434411 10544122 10766456 10939687 11032505 11198648 11355773 11509761
11980 11509761 11609905 11671310 11754385 11738515 11739478 11772813 11878025 11951143 12036505 12045326 12087810
11969 12087810 12146247 12216620 12382570 12571240 12683117 12694825 12866781 13017768 13310822 13529064
11959 13529064 13622787 13737234 13816568 13870184 13882450 13961245 14052012 14233346 14283516 14408456
11949 14408456 14536549 14617189 14710543 14777643 14880081 14976531 15084209 15110123 15103650 15143560 15197478
11938 15197478 15272930 15395605 15440557 15427389 15641658 15701505 15755720 15750275 15745126 15775927 15731539
11927 15731539 15766020 15818412 15664267 15495957 15510881 15637565 15673313 15493363 15347408 15196030
11917 15196030 15027423 14978276 14925004 14854289 14913945 14863941 14794923 14633471 14443992 14340589
11907 14340589 14197357 14181451 14097397 14065506 14051553 13973790 13759045 13518296 13444329 13482575
11897 13482575 13447657 13204476 13026370 12826043 12644535 12363449 12129717 11939616 11879791 11869156
11887 11869156 11765462 11579710 11423020 11278226 11103138 11012547 10768508 10426604 10306830
11878 10306830 10240805 10126124 10026529 9970797 9926511 9857758 9780068 9585425 9374677 9307000
11868 9307000 9151065 8982682 8896890 8891970 8788529 8636838 8556186 8442183 8233821 8110851
11858 8110851 8022906 7929739 7771961 7670354 7623754 7428247 7288243 7190973 7117877 6963608
11848 6963608 6817641 6757326 6587085 6537106 6472407 6450553 6373285 6302080 6189006 6097792 6104785
11837 6104785 6122734 5988645 5762706 5633691 5685583 5683988 5645321 5487497 5288479 5230207
11827 5230207 5115462 5014512 4922187 4833451 4803299 4684110 4519133 4456952 4517187 4492178
11817 4492178 4501025 4457962 4425811 4429767 4399981 4354874 4268733 4137224 4097942 3996466 3943526
11806 3943526 3954546 3884738 3810605 3858893 3900689 3844902 3763712 3784165 3806016 3855469 3849047
11795 3849047 3811577 3822078 3796648 3732625 3788031 3942031 4100591 4122020 4145751 4221743 4342997
11784 4342997 4431312 4717470 4823734 4800348 4732863 4550461 4315070 4317956 4272567 4120460
11774 4120460 4056854 4033904 3921746 3833019 3672439 3518446 3473272 3556748 3581612 3552532 3605286
11763 3605286 3641403 3731884 3764803 3911415 3908663 3986244 4049900 4091431 4154971 4226645 4191444
11752 4191444 4195415 4161458 4140901 4112674 3944573 3852610 3772301 3783354 3788912 3733419 3582051
11741 3582051 3341815 3131321 3066401 3124811 3105421 3010451 2912519 2862400 2870161 2887153 2809434
11730 2809434 2686107 2785636 2885164 2856874 2820019 2887778 2972307 3040406 3088217 3027480 3056885
11719 3056885 3182701 2961891 2767442 2726067 2651703 2495525 2299456 2197891 2020886 1923723
11709 1923723 1897631 1897474 1945255 1914256 1842291 1725754 1756693 1815159 1803307 1713798 1662203
11698 1662203 1639634 1602442 1502055 1539931 1478623 1300938 1204972 1259593 1339101 1379720 1507599
11687 1507599 1449393 1413014 1362435 1357068 1262460 1241288 1164713 1163368 1199924 1132860 1050806 989964
11675 989964 966389 1110718 1247116 1228106 1192584 1180232 1140426 1150046 1205048 1122284 1003213
11664 1003213 996263 1105278 1014442 933073 911167 839935 897550 1062041 1024291 930004 1020956
11653 1020956 1167942 1099631 882017 770084 791465 825875 833852 864402 866051 888092 946981
11642 946981 918880 909207 846385 827242 796076 760961 870059 920710 881529 782749 745880
11631 745880 771024 765132 664680 681352 634753 725148 807786 799398 740843 672085 573644 549629
11619 549629 531275 561430 542913 607090 499289 526033 555835 624243 601965 604534 648473
11608 648473 775757 898269 858271 854283 834464 791544 777494 750579 631869 735928 653347
11597 653347 582619 654028 686960 706247 705106 657953 724949 722957 750021 792327 745811 700072
11585 700072 565990 601883 631034 620220 710909 912103 922331 802077 701020 600398
11575 600398 597195 620829 579242 417918 353353 389378 525055 580612 613655 605958 598420 581504
11563 581504 545672 588353 590132 733598 706718 522934 442051 457513 472648 400630 256781
11552 256781 302091 469265 575752 537121 477932 512886 414008 374219 406729 323828 344011
11541 344011 420875 458819 375245 404088 454358 353895 301534 427385 456881 482330 477674
11530 477674 412494 375462 424527 401718 402875 435792 454798 415145 387044 361759 311848 325500
11518 325500 321829 346469 385616 439953 533306 587490 541125 442428 419215 434053 450377 510192
11506 510192 531940 578859 435602 465717 529435 612060 636762 607793 567883 526592 547213
11495 547213 511106 457337 480484 435613 368387 323174 383982 438089 377801 277418 155553
11484 155553 200685 344672 387225 346860 337177 367075 265994 281375 486303 485687 449211
11473 449211 419089 338798 306828 280345 242010 192229 328370 390882 323907 322844 435033
11462 435033 450455 484547 456026 311971 187291 108861 91576 186807 243365 218177 208422
11451 208422 287583 321508 305591 185005 186405 240880 254575 312423 276185 284061 195230 256744
11439 256744 263364 206619 232265 150973 150646 206536 148890 115504 55149 98055 202848 225928
11427 225928 252996 200836 138685 193244 363754 490812 369234 280728 221873 160342 184616
11416 184616 187639 272483 352137 408665 435376 437895 337337 135490 129724 162029 198069 349291
11404 349291 383581 351853 305455 234912 230984 190922 133584 141395 191045 139198 80907 87742
11392 87742 168353 168527 196467 198259 323046 314109 235397 308654 284396 258851 247763 236449
11380 236449 160008 101401 174487 182523 199060 307984 291580 182703 206887 207191 113514 36905
11368 36905 135984 253086 265870 234403 171441 108257 170958 241887 250825 259717 214128 191939
11356 191939 113942 175440 207616 252656 266573 235570 199098 260921 236895 64762 104086
11345 104086 159412 128898 138197 184790 247790 273131 357456 339901 281924 164067 175336
11334 175336 158246 44917 -713 8097 43430 129675 223369 304556 249240 183173 214127
11323 214127 233005 133909 116359 65138 24935 91582 156731 64379 94975 157708 169310
11312 169310 146470 220506 258204 208987 215481 287363 309316 274831 263433 219367 143924 162620
11300 162620 200093 187688 227594 251219 164730 -49865 57814 199378 162681 158384 160495
11289 160495 131267 117287 34774 71384 173779 166832 172055 218259 196069 336175 393812
11278 393812 331017 184065 173462 210066 323167 408224 239196 97143 118535 128715 90777
11267 90777 9159 -25362 -9991 130367 165176 157067 203208 196457 129647 140711 180111 218129
11255 218129 174360 153197 173932 128663 17386 -19042 -29612 -18410 8455 103753 143982
11244 143982 59795 123516 182450 187422 139276 245608 248177 275421 338697 295528 313794 297865
11232 297865 238335 263085 241997 300960 328901 454027 406842 280754 216853 238546 142489
11221 142489 62849 52977 58048 48149 85114 85201 -8398 33539 64323 113351 113059 125432 130061
11208 130061 106852 63602 167603 198719 24543 8543 39810 82120 105901 135303 127453
11197 127453 95596 57348 94594 223877 325415 416093 373484 208723 104358 76570 79762
11186 79762 100384 96320 196314 153627 56590 93389 134595 149669 72943 70683 72753 112842
11174 112842 171759 160443 119933 118104 53593 39916 -5926 35096 35645 2533 -36338 -89582
11162 -89582 -63119 19447 165497 198094 187010 172479 162611 79335 -56913 -142593 -21158
11151 -21158 122952 165418 171937 231002 238402 147070 209955 173150 157687 206221 220523 244261
11139 244261 172205 202730 173140 138345 35710 -74086 -112400 -58761 -56784 -94068 -2090
11128 -2090 107736 67570 57525 9211 3897 -11263 -133313 -28693 48170 118293 57564
11117 57564 -77656 -31364 76777 233654 328936 227542 225108 195952 236482 282738 297053
11106 297053 137822 118280 103386 9714 25169 99696 158760 92897 62287 -107015 -165108
11095 -165108 -143765 34121 126908 42081 -88209 -131132 -43975 -42590 8910 93055 57002
11084 57002 -3065 42410 93658 42058 69798 96325 42210 14092 172199 199291 305843
11073 305843 182447 -23509 -76995 69148 13589 -24219 11137 8882 66415 110238 187988
11062 187988 92757 86212 151790 145272 81116 19501 13558 -86811 -37822 28531 30315 136559
11050 136559 185591 184745 198892 267490 331166 230798 140535 41138 145694 227391 249718
11039 249718 296723 352761 411241 369276 280592 313416 411197 439124 413204 361173 385618
11028 385618 500414 582624 738971 759623 807087 810725 910322 796601 726576 703174 680892
11017 680892 622757 614947 725545 867230 995300 1096853 1116011 1093731 1050380 872731 717922
11006 717922 757312 717002 657591 637298 786006 918396 885505 787129 687637 677596 557843
10995 557843 468557 452736 432266 442502 449693 581374 665024 743931 722226 618016 556068
10984 556068 432490 247587 117027 66607 11897 -54108 -1982 100886 148857 138818 152244
10973 152244 110949 105667 192116 244287 181539 116371 132913 107415 110312 194910 130711 -4335
10961 -4335 62075 145595 177484 116872 177368 285975 288948 245240 70551 33391 109871 121210
10949 121210 63956 -4818 63555 115234 151668 108042 -28092 3903 60067 38412 254056
10938 254056 342764 362428 276339 237324 295499 252908 238454 166293 76628 -15850 12091
10927 12091 115099 105812 11525 35238 73333 194445 117053 77852 51164 109345 255075
10916 255075 230011 168707 177497 166856 253180 193944 199145 246367 308331 170156 34898
10905 34898 88079 210364 62718 -76463 -65455 -17335 -60483 -27965 75398 117354 119284
10894 119284 165942 69063 -78447 -65649 109068 141891 67346 99272 177365 233428 220729
10883 220729 103116 59848 25981 -12080 -9094 72609 145738 160583 176088 125416 118621 129337
10871 129337 257267 266887 353938 381595 334674 268130 204056 204586 262984 279997 234694 210878
10859 210878 225049 275024 220380 195181 218079 173307 175052 151880 124090 64583 88719 158758
10847 158758 224680 254642 225389 97665 83723 226300 370085 459517 262529 177274 147793
10836 147793 201050 268757 244303 95731 -47803 -51462 39823 61327 40859 180587 258512
10825 258512 122173 165277 284848 287963 314912 355302 320320 226612 140206 182409 251630
10814 251630 298016 176855 -8119 -32944 -44530 74146 214638 207988 179850 120049 1107
10803 1107 29054 8917 -24532 12080 181255 199936 184122 154939 77391 93591 107408 136627
10791 136627 107365 10417 -50513 116221 163329 98507 -11750 -27630 13284 142798 220015
10780 220015 223509 112330 154814 231286 193571 197740 187402 131991 86707 35824 34497 38996
10768 38996 124306 172255 117551 36294 68280 135984 226169 239234 177021 168539 252901 332967
10756 332967 291614 188101 62719 38574 89427 111223 246702 243168 302652 423566 494740
10745 494740 489079 571266 381904 243790 251791 162922 203919 372316 360772 370196 367563 238429
10733 238429 194663 245137 315171 304630 319805 401375 451474 359186 325511 326273 248808 218919
10721 218919 290389 399119 462881 433754 383602 461213 553348 497423 485966 604890 637207
10710 637207 605121 600055 618221 575955 568237 512693 439462 359512 434794 433696 343223 358609
10698 358609 364273 392242 387422 388875 364445 323532 252629 299338 420266 399247 267009 214087
10686 214087 245764 209196 151068 182792 247346 291869 297917 362392 409232 370658 393108 430621
10674 430621 450245 393770 403932 383847 457036 509328 590541 672015 642256 642193 637958 622396
10662 622396 578182 589002 602208 560944 659492 696226 848251 885020 837787 803737 796000
10651 796000 922231 1028959 1197473 1235739 1519079 2009931 2262194 2282165 2171139 1692121
10641 1692121 1506716 1531051 1490181 1435596 1478644 1564720 1655658 1695174 1819563 1982474 2057313
10630 2057313 2130513 2194169 2372863 2675012 2898759 3280505 3745215 4259569 4651870 5003679
10620 5003679 5318534 5783188 6419811 6987842 7935675 9203260 10983120 13580747 17158442
10611 17158442 21791087 28021732 36264748 46039738 55391017 62237629 65351023 64776784
10603 64776784 62170673 59600240 58892992 61144139 67255489 78084290 94339490 114464140
10595 114464140 133162138 144234669 145094826 137176750 125128136 114236492 107928684
10588 107928684 107819334 114450453 128368528 149761360 175300914 196873953 205881302
10581 205881302 199498114 181040800 157360322 136138288 121272289 113459165 112484474
10574 112484474 118028103 129029183 142387642 152252489 152755622 142988042 125891769 106688667
10566 106688667 89967040 77931034 70718689 67523686 67758436 70319628 73438513 74561550
10558 74561550 71819812 65337389 56177300 46320935 37343000 30128606 24817434 20889355
10550 20889355 18051893 15962728 14231255 12721263 11444709 10290988 9372413 8534721
10542 8534721 7802856 7194162 6640001 6124589 5681264 5225715 4799904 4491097 4241837
10533 4241837 3939087 3689550 3474131 3217661 3019437 2908330 2785065 2643068 2402051
10524 2402051 2248100 2153328 2039406 1817288 1705810 1595272 1510228 1486716 1429334 1265185
10514 1265185 1245752 1281019 1254178 1189839 1048851 951659 853684 782399 651920 648093 729495
10503 729495 626828 595288 572127 617601 559173 439514 451251 379046 336930 469001 471907
10492 471907 374839 365697 401044 374532 368667 447618 488402 487773 511411 422438 413509 533621
10480 533621 545780 465540 438117 451575 363616 252085 224004 255122 237193 321749 337223
10469 337223 427655 497061 413090 287004 175888 58190 36563 87876 141587 159976 85552
10458 85552 105077 85310 73923 93614 118599 12830 -52989 -58091 30918 65570 9932 -57575
10446 -57575 -7211 73902 113875 77981 78715 62364 36701 -95075 -44182 -14299 75201 123771
10434 123771 3163 -47588 -26403 32812 -30445 -131537 -186801 -166698 -93337 -162934 -141485
10423 -141485 -83679 19418 46944 151454 132700 50661 -64763 -189859 -169710 -151446 -98358
10412 -98358 -176949 -77076 70878 49092 61035 54672 100490 108729 46150 43845 107246 148211
10400 148211 125803 22752 -34326 604 89917 54475 24888 35973 65632 135711 167759
10389 167759 124426 147317 133224 124563 227085 200530 137047 146239 129427 -7591 25912
10378 25912 187658 233260 197296 155230 118312 35441 18534 92162 101599 41035 72868 109659
10366 109659 43515 22801 40400 127528 225119 250540 115613 -18197 -197888 -166477 -105461
10355 -105461 -83810 -58637 92879 122299 54721 -158034 -204111 -122783 -48671 -34463 -138589
10344 -138589 -202710 -180446 -147295 -143082 -41879 36195 94117 161257 195669 169148 122373
10333 122373 42634 55131 26096 30890 156118 204980 156830 107936 71469 26371 -3415
10322 -3415 -49136 -2283 131505 227352 199812 88466 -12478 -72878 -79738 -46605 -39074 59117
10310 59117 118614 101983 138431 88284 -28431 -75132 -9637 -2972 12648 99045 23119 109518
10298 109518 21078 -53676 28497 7720 -13273 18036 -134935 -204139 -165599 -202252 -178316
10287 -178316 -155476 -136871 -146533 -104708 -39005 2616 49950 -14692 -93871 -93637 -111723 -68573
10275 -68573 -124380 -66300 14542 97811 108715 65098 -3065 87055 197903 232341 234195 252588
10263 252588 177661 63843 13744 -76539 -169496 -152446 -160712 -136816 -89913 -75288 71221
10252 71221 162181 144048 98317 51583 55318 31943 37964 109760 161532 149045 19868 -68231
10240 -68231 -109871 -120322 -51118 107933 45508 90710 58221 78371 -9831 -90584 -122938
10229 -122938 -63856 -19991 36661 30625 -5884 61057 104003 144575 95207 103656 50904 4397
10217 4397 49852 117060 91775 -17209 -60532 -43855 -115028 -135683 -18018 92603 200765
10206 200765 205365 125172 93425 62519 45521 32224 16757 24627 70505 116235 121322 18439
10194 18439 23345 74738 143183 162098 120753 24071 85744 92369 112351 195909 78198 51547
10182 51547 -1331 -124814 -108101 -124881 26677 64163 61602 95065 135032 300199 389774
10171 389774 383608 385211 457409 390579 346955 275118 280667 238474 340922 470612 600188
10160 600188 721138 646165 679254 766527 817958 753274 653646 521435 487635 415392 406951
10149 406951 616715 781608 953592 992779 971207 953122 1039471 864743 644704 630116
10139 630116 597695 512478 487096 628380 840341 977013 1021670 871227 739583 513002
10129 513002 439087 479647 451440 392263 487149 458514 427031 400490 432248 364089 295802
10118 295802 274755 191546 141602 181895 201496 223088 218661 141304 9773 23536 56093
10107 56093 88640 117974 118721 30704 52005 55377 5410 -28936 -52638 -62207 79512 250868
10095 250868 217884 20881 -35966 74219 97017 -5366 -36757 -61810 4491 -45554 -43697
10084 -43697 100428 237115 224704 172776 124528 63988 -26221 -47308 21086 39067 -25155
10073 -25155 -85409 13592 -36231 -158 51021 49304 5521 -45804 -130370 -114303 -78900 -77519
10061 -77519 -104474 -48868 -30891 19565 66134 22055 -12190 -56674 -45779 3961 33269 -25012
10049 -25012 13374 59480 76294 24432 -7632 12689 70917 -20434 -100497 -130729 -49127 -11891
10037 -11891 -14196 59092 48993 -72055 -95371 -53847 -143919 -268639 -263768 -220994 -230511 -283336
10025 -283336 -336785 -216057 -66591 17688 -11504 -22640 4485 -104738 -60737 22821 6009
10014 6009 6150 -14353 -44196 33485 128283 108241 109551 129036 92212 135502 89900 -8789
10002 -8789 -4298 -75737 -88768 -22622 -53527 -75366 -73672 10657 -26542 -44819 -67644 -66670 -64703
9989 -64703 18268 141429 138906 -11325 -22793 -37958 -125363 -198560 -85402 -161267 -207966
9978 -207966 -51862 -29872 -119334 -38270 35265 76377 -1923 -100938 -133906 -80071 -74686 -123502
9966 -123502 -111753 -17856 4461 -7906 20973 -2598 2554 57058 39600 -33935 -26648 -56785
9954 -56785 -160245 -160189 -29608 -69783 -144175 -129159 -186637 -110963 -19530 94941 34092 74600
9942 74600 51250 58682 125704 97802 31137 1758 54651 63087 4447 -62244 5670 97146
9930 97146 95920 4225 -38671 4364 -68371 -161582 -194232 -153294 -73833 -118657 -95785 -32086
9918 -32086 69963 112723 76315 148294 76977 2730 -49926 -145412 -147011 -99430 -11559 47832
9906 47832 95553 84658 48160 49788 74459 115601 111846 133087 123740 82772 81882 103164 70873
9893 70873 72590 106710 51353 -85867 -85041 -156053 -162451 -72287 7103 -29515 -39521 63126
9881 63126 -75507 -98026 -26792 -58606 -73351 32900 134064 110167 -15983 -89027 -47061
9870 -47061 -25341 71183 81180 167235 215330 91070 17760 -94426 -101968 -61684 -60857 -16060
9858 -16060 41244 24442 40724 32021 -8063 -88851 -92175 -48618 70616 42464 26272 -25759
9846 -25759 -138832 -209518 -211215 -42527 -1791 -114510 -132787 -99243 -103846 -70471 -36973 -40953
9834 -40953 -4310 25379 69457 20940 -105203 -126850 -174093 -177445 -91997 -105102 -13267 100522
9822 100522 48735 82574 19670 -53892 -37378 -51175 -23757 55171 -31269 -13005 -19883 -64755
9810 -64755 -97212 -23882 121684 103211 113215 153016 161184 163238 189918 222613 137383 228061
9798 228061 224198 192935 178649 190819 230282 176011 121088 46750 44527 88937 111369 178065
9786 178065 166051 211416 107575 136721 191884 294272 410838 391838 407729 459202 525540
9775 525540 718621 975769 1450646 2076661 3389802 5937395 10141243 14773586 17239012
9766 17239012 16369211 13046459 8930451 5571950 3540089 2506511 1842776 1510042 1352500
9757 1352500 1283909 1201113 1093442 946043 882003 858499 698524 578575 488229 370943
9747 370943 338116 434871 571118 573612 443787 473254 375445 284346 133621 -10693 87990
9736 87990 153106 132919 122408 40916 83110 124989 83388 -54033 -80092 -40744 55195 94343
9724 94343 104249 5195 -18402 -20087 118386 170498 80621 33491 8824 -557 -59020 -96557
9712 -96557 -150251 -129262 -13476 -31877 -49742 49664 -31241 -47702 -53480 -57206 19251 37993
9700 37993 -114512 -35194 -90703 -139373 -129790 -210865 -150904 78291 119186 87938 -50774
9689 -50774 -159116 -32702 116883 95691 -8559 -69754 -61325 -68090 -153020 -71405 22483
9678 22483 -8256 6741 25346 4526 55169 -12428 -90772 -119209 -17300 20930 21432 -5193
9666 -5193 -41177 -65968 -4633 102146 108769 -21136 5450 132474 249343 211507 30193
9655 30193 31074 -14036 -49748 -64212 -27112 86667 168043 131476 229238 517463 595211 805319
9643 805319 943723 924784 884388 591964 242117 85326 -11325 -9096 -44296 -109144 -106517
9632 -106517 -95698 8294 30680 68767 -9811 -84093 -86480 -98698 -45566 -23526 7683 -30106
9620 -30106 -63645 -172463 -202548 -268367 -290687 -313456 -234475 -67445 -23450 -107119 -237484
9609 -237484 -189587 -62400 -168162 -176016 -112226 -234895 -267740 -236228 -220810 -225691 -194902
9598 -194902 -141060 -26466 -95606 -63067 -2645 -81232 -102489 -68837 33105 7145 -85294
9587 -85294 -11854 -54891 -64225 -93249 -119702 -105402 -16423 56999 119435 33229 -32986 -51241
9575 -51241 -12873 -16730 619 99074 38842 -24751 55788 60544 85745 64641 126510 171673
9563 171673 79394 -139397 -85236 -4584 79397 141270 110632 19234 -17305 14267 20598 -26156
9551 -26156 -67442 -118007 -117604 -107543 -70189 27236 56861 123728 197297 114798 -10685 -94833
9539 -94833 -72331 -103292 -15260 88046 124657 71810 -27888 -63545 -39825 21909 -101166
9528 -101166 -124757 -98042 -113942 -143885 -302620 -379906 -380012 -247141 -108104 -3919 -5612
9517 -5612 -42848 -3321 -95288 -87338 -127935 -118681 -94708 -34290 -34397 -77270 -53764 -87520 -164518
9504 -164518 -211645 -158094 -163843 -129196 -146810 -177558 -183420 -220259 -199983 -84005 -57327 -21959
9492 -21959 -2021 61816 55389 -31866 -183000 -171130 -103623 -128749 -62080 50191 93979 20704
9480 20704 62735 37136 22470 -19068 -91519 -148591 -166446 -115281 -123858 -199480 -196360 -224353
9468 -224353 -267067 -208554 -180708 -202283 -132374 -62454 35580 78483 35251 21990 -19402 22208
9456 22208 -53173 -177882 -137769 -71905 1110 -77 -18592 -52440 -32489 1273 156662 85191
9444 85191 -65702 -194773 -242829 -138911 -116528 -84521 41052 81493 -2021 54227 -18607
9433 -18607 15595 29671 34597 56290 49905 35191 -5351 -8278 8636 31314 71410 33714
9421 33714 16180 62486 17384 -57367 -29122 -67999 -140686 -102089 -73713 -64568 -82742 -119026
9409 -119026 -162763 -88449 -39974 -38568 -74431 -32335 -16817 -20711 -66942 9051 83160 130653
9397 130653 195399 141636 107827 164046 166000 67278 -81441 -206268 -213101 -165720 -117219 -47636
9385 -47636 -17789 56048 45811 -40239 -122510 -135897 -125586 -17114 33492 23677 1032 -52914
9373 -52914 -58540 -71242 -10233 -17283 -70041 -135729 -209209 -200302 -161823 -53691 -32279 -41075
9361 -41075 -128782 -131130 -155517 -105276 2266 -58387 -88979 -50631 24895 19354 -26746 42798
9349 42798 125046 72238 17977 65419 55201 27066 39194 48228 50407 -17447 3507 18654
9337 18654 25648 65452 99829 71515 47039 -17649 -224186 -198795 -76700 -79594 -102271 -70638
9325 -70638 -83816 -103418 -140096 -119423 19346 112283 55412 66203 -59727 -183813 -192965
9314 -192965 -119365 22454 -36458 -13481 -11279 -43081 -137947 -130158 -100070 -75327 -4320 103772
9302 103772 62156 -38390 -80320 379 18172 -22725 -43186 -45662 51362 85514 11849 9439
9290 9439 375 -50167 -9219 86895 18367 -36462 31679 42362 62088 -86483 -158471 -37800
9278 -37800 75599 54616 17672 46499 1591 -138156 -113161 -47227 -119705 -135161 -45059
9267 -45059 24795 44451 32038 -85799 -159237 -106187 -48664 -54815 -96664 -117121 -4323 68814
9255 68814 -13012 -119346 -215744 -288697 -208806 -81284 -51650 -63546 -49987 22065 50364
9244 50364 -21666 -69480 -434 -117100 -172456 -220615 -162297 -152937 37926 115626 15367
9233 15367 -91575 -66584 -136821 -147002 34107 48382 109595 121779 114257 12674 11343 -6621
9221 -6621 2970 39040 37695 39215 26884 81321 47417 26629 -15292 -51470 -160384 -149787
9209 -149787 -172795 -213772 -156413 24113 21978 -145741 -198904 -182255 -73095 40989 10827
9198 10827 6709 -31619 -36899 -53675 -123876 -41835 -82947 -123915 -51669 -11331 -14133 86060
9186 86060 148575 18321 12872 1446 -119033 -207223 -188999 -167807 -124540 -24816 -943 36943
9174 36943 30917 44375 36929 16298 -85575 -26301 119192 84019 61164 153583 93965 -29256
9162 -29256 -36960 -15491 -34204 3098 -63128 -44977 -19521 -221388 -315086 -315659 -229547 -145036
9150 -145036 -118680 -126475 -43738 48006 81251 12072 -97098 -131385 -94719 -72301 -6003 -23030
9138 -23030 -78796 -89188 -9575 -34094 -88454 -120011 -190066 -146691 -167583 -272682 -240929 -159467
9126 -159467 -127010 -41377 -57903 -131524 -61631 -29049 -46420 -53268 -77434 55305 116298 78483
9114 78483 65873 139465 266612 262604 264102 111362 -14719 -187574 -213815 -150800 -163455
9103 -163455 -251843 -262158 -120866 -125316 -123925 -93767 -10720 2439 26897 -74489 -175587
9092 -175587 -147551 -196866 -200276 -237751 -186191 -177049 -102096 -108114 -128886 -129990 -46349 -34445
9080 -34445 966 -50745 -76612 -46048 19311 -18266 -98175 -120876 -161161 -61609 19632 114832
9068 114832 211252 222304 15470 -95813 -34368 20307 31159 20262 89588 154591 123157
9057 123157 -21154 -114967 -136058 -88906 -31221 -101819 -98005 -105714 -53494 91473 145425 122212
9045 122212 -476 13424 74705 -7991 -12798 -61764 -33326 63238 184325 51536 -49478
9034 -49478 -35965 42399 151408 194364 124509 56689 69729 58486 79350 57987 -4766 -35027
9022 -35027 -111151 -169180 -110361 -93390 -34866 29954 -61158 -149437 -139066 -77325 -86352 -64788
9010 -64788 -50568 -9693 30824 43251 -16062 -73372 -80199 -80587 -113937 -121339 -104456 -57017 -20432
8997 -20432 -74308 -74005 -76267 -11292 49728 35608 -64479 -86181 -60854 -125432 -106329 -116270
8985 -116270 -162966 -139016 -153747 -126951 -136417 -164323 -189947 -140459 -141811 -139880 3364 -41172
8973 -41172 -107037 -11400 99596 11607 -49450 -43723 -130099 -161343 -149936 -156012 -189149 -87991
8961 -87991 -11510 -56734 -44590 -78938 20992 8209 -51875 -11207 -72703 -88726 -46542 -16434
8949 -16434 27068 58894 59223 -41861 -7718 -31443 -30976 21384 24468 2541 -115949 -130962
8937 -130962 -17032 7930 50960 55472 -9531 -136625 -184761 -228665 -222243 -126515 -174280 -181860
8925 -181860 -130913 -60884 -48336 -11993 76274 -40390 -62501 24070 8853 -111030 -108702
8914 -108702 -117382 -84329 -53382 24823 -48471 -71995 -39695 -80028 -31115 -6106 -46837 -35974
8902 -35974 35171 -64876 -155058 -96025 -50737 -147250 -79319 36761 85997 31138 -50875
8891 -50875 -137225 -132384 -40633 5907 -70743 -94867 -25676 -50517 -15106 67587 -4387 -36996
8879 -36996 -77177 -137906 -60546 14871 2323 -33978 -65299 33458 145802 144039 112697 31639
8867 31639 -8265 -34936 15164 105349 143619 201876 125397 1219 56520 45540 -63601
8856 -63601 -161607 -6171 40238 -80587 -147842 -96525 -55605 -60366 -51408 -44220 -32147 -30490
8844 -30490 -72215 -201293 -198277 -32870 57069 -6976 -30352 -39939 70746 173224 179930 162165
8832 162165 147338 92232 -42991 -65898 -98742 -178454 -321317 -371361 -296825 -257077 -183368
8821 -183368 -160152 -96647 -8543 46333 36335 94112 62804 35884 -26613 112 -98762 -174947
8809 -174947 -113255 -179552 -346732 -297847 -242615 -190312 -145513 -66483 28405 -5569 -88310
8798 -88310 -121854 -49788 -11273 12231 -13019 -57571 -43247 -118990 -249559 -226641 -143773 -65845
8786 -65845 -47694 -76393 -100866 -112150 -114444 -34337 35934 58068 61650 82222 151989 273661
8774 273661 201297 91026 -90250 -185806 -159002 -61231 -28651 15851 97723 15224 -70993
8763 -70993 -76149 -77626 -52143 -86433 -109910 -118342 -81566 -32209 -82224 -81119 -57575 -49001 -45088
8750 -45088 -54261 18580 -27314 -101696 -61905 42688 122959 46396 -77036 -61271 124327
8739 124327 65834 -23530 11421 -48203 -114535 -171560 -170387 -159772 -71102 -87134 -151177 -173128
8727 -173128 -96415 -13630 -36946 15480 104971 -54424 -129442 93 98426 187402 117254
8716 117254 -25363 -25339 -39714 -4273 -22383 -70956 -79833 -80401 -50314 -23858 -14851 44040 26601
8703 26601 -102117 -252459 -202173 -10901 316921 397433 343436 202248 154523 71891 10314
8692 10314 -16838 13906 -2842 11588 -45949 -120251 -130497 -49364 -1993 10283 34246 120317
8680 120317 44586 -6214 38139 -7891 -58688 34816 66597 26920 53754 35975 2695 79778
8668 79778 102176 96603 89927 49603 -8801 -46923 -55335 13044 111362 134641 92933 79940
8656 79940 38643 92167 35732 55078 -16317 -38340 -18698 -7417 -57609 -11434 27916 -5027
8644 -5027 36838 16113 -171951 -255298 -158408 -33471 1869 40580 39496 -98830 -35192 143211
8632 143211 151104 58054 -27130 -70135 -29220 38048 55778 29035 72852 121938 88574 60281
8620 60281 39036 42882 -35984 -132287 -191508 -144955 -16681 82666 118133 106627 17026 -31937
8608 -31937 -14114 -20675 51457 46540 71850 140576 156700 73236 27657 -33243 -123782 -101307
8596 -101307 112752 125033 161796 110324 154422 225701 223312 169872 59901 106272 175390
8585 175390 220354 211104 173258 179223 84605 30554 42265 -22595 -136648 5828 81020 101599
8573 101599 137621 47614 79739 191278 215151 288091 228809 165964 98494 61534 -17226
8562 -17226 -49144 49914 51861 8994 30195 105395 108375 133738 86034 48677 50649 62277
8550 62277 -5267 -62516 65338 176813 75770 21473 30485 119992 174915 179796 124501 50787
8538 50787 76516 165214 92941 8872 -22987 2313 33741 148247 193025 114192 205988 305141
8526 305141 310033 416958 539391 649895 942629 1597708 2798658 4089617 4552579 3993991
8516 3993991 2918138 1921743 1224555 845836 675235 552716 501717 555111 508109 396801
8506 396801 356395 351851 389629 324973 166833 -26537 -55072 23537 108010 49931 43631 26081
8494 26081 21225 58381 27761 -14656 51330 136417 214977 291394 414364 541194 568638 439468
8482 439468 385493 505920 747788 1030155 1399845 1957377 2999584 5278813 8136120
8473 8136120 9070068 8064662 5978218 3891790 2470442 1709412 1220529 950018 927512
8464 927512 828205 735691 710031 584671 569775 417686 312877 294295 219333 165732 97579
8453 97579 110625 175071 156085 130174 188749 260388 259042 304542 325363 290889 286677 334981
8441 334981 186797 167182 224707 223610 249876 243512 356870 491884 716664 1133613 1814440
8430 1814440 2751680 4022679 4603491 4190652 3191344 2079209 1458275 1097365 847009
8421 847009 654253 511074 373509 344639 331349 317330 390777 332123 375979 497260 456682
8410 456682 393724 386060 355037 174651 64196 59577 50660 109862 95394 106924 225321 312800
8398 312800 310351 247963 189690 89863 75413 98598 104362 73993 20828 -113 -33260 47341
8386 47341 109991 74943 4553 -104207 -61277 86485 176158 227198 303408 302995 333338 255454
8374 255454 195036 167466 138947 163302 189358 68986 465 -48140 -59513 -65810 -19555 533
8362 533 98407 25795 -63464 -59008 8205 95057 41617 72877 64981 34194 13123 -71169 -125497
8349 -125497 -132630 -177467 -83462 27586 -32413 -34236 43830 102849 11915 36554 159981 147454
8337 147454 116161 -23278 24105 82962 58215 120633 150484 105370 18321 70204 146146
8326 146146 -2595 -49310 -14505 -48406 -116295 -145495 -132157 -52259 62210 53006 27093
8315 27093 122494 174072 236979 146619 92350 182263 236635 184715 42811 23132 -16603 -20087
8303 -20087 122383 137054 84470 93355 126968 191911 215300 97866 55523 61085 123616 181858
8291 181858 193668 234160 316716 357294 360080 384890 391640 306436 191002 209988 265749 238132
8279 238132 142071 156871 212061 98296 105333 23292 -132764 -157669 -43337 43644 127486
8268 127486 140153 91085 -50197 -33897 121412 177478 209879 267118 232878 102585 98716
8257 98716 159709 122940 147861 184118 75101 38380 17542 -6930 114138 93646 38526
8246 38526 139569 184273 107356 168139 103126 127641 179538 125959 64054 70332 66070 21400
8234 21400 -54542 -8151 67781 70686 164422 209254 196459 217046 172601 63559 88981 126805
8222 126805 124276 102175 102441 41670 -100064 -101042 -104384 -98784 -96411 -101598 -193616 -108319 -235311
8209 -235311 -207279 -161847 -106090 -43797 -33849 8802 -14902 -19612 -80983 -156001 -190379 -50983
8197 -50983 -79200 -164369 -156718 -112067 -130472 -134991 -76184 47224 57711 40885 59661 82081
8185 82081 100705 85233 -12080 -4093 -147704 -88546 24436 -1603 20058 36426 12084 138570
8173 138570 144886 62290 -10133 112920 124823 74132 32216 64983 -3949 -133012 -86687
8162 -86687 -43989 -65747 -90699 -48989 -74169 -79147 11668 -84100 -87253 -46756 52167 92381
8150 92381 55707 -26209 -23470 -49844 -115820 -91006 -155065 -156879 -183358 -188750 -129588 -88615
8138 -88615 -113769 -169877 -46091 4809 402 -5837 19262 35400 80433 5132 29421 65329
8126 65329 30144 -64525 -45779 19370 9935 18030 87413 122820 89160 54094 135380 47362
8114 47362 -67284 -121465 -103894 43288 94050 47801 -13583 4291 66648 75588 48817 -12955
8102 -12955 -88800 -75038 -84660 -162966 13401 84767 22464 -63628 -8661 107812 103083 98337
8090 98337 149790 37877 30935 122065 181055 64634 30029 -4442 25230 23371 38711 121
8078 121 -3496 -67474 -90000 50484 83157 111744 76924 29378 16528 -61395 -137836 -154573
8066 -154573 -164666 -135253 -128095 -18878 68492 100549 249574 256692 151530 37712 -60087
8055 -60087 -69394 -37730 -35226 -8173 52678 11721 -40599 7355 43797 -28623 -56867 -11490
8043 -11490 -18857 -19274 -70100 -88744 -36493 -144509 -181802 -221751 -186493 -127980 -124629 -178719
8031 -178719 -61636 22596 35980 -60043 -81076 4797 31331 91178 -26083 -50435 -25622
8020 -25622 47311 72061 186175 203736 28655 -92306 993 35007 25483 50057 100221
8009 100221 173550 203493 65715 93753 106554 53980 -65486 -71259 13297 59549 52752 54528
7997 54528 93078 32424 29335 66735 77002 8444 -37201 -34628 -18046 -22234 -21945 -90394 -129669
7984 -129669 -45168 155024 121056 -59775 -39708 -15931 43821 -65730 -31018 74653 145609
7973 145609 249682 288257 338109 242704 226438 165417 15389 -24382 20931 48626 -17337
7962 -17337 -94860 -18958 74002 61888 102261 53277 122857 115963 118778 29279 -5558 69397
7950 69397 148376 195956 131681 93032 -85141 -138296 -85688 -63899 34713 57588 -17463 21605
7938 21605 -8596 -68524 -67097 22133 248518 228495 96074 216298 251595 323417 298039
7927 298039 204286 146382 90700 91401 102257 28815 87205 100071 106511 95535 92487 -42131
7915 -42131 -83526 -208479 -262978 -197958 -57029 -89033 -118493 -124227 -77784 -93189 -127437 -104667
7903 -104667 -99151 -51323 44468 34591 46186 139538 283248 191984 -6826 -29500 55406 3319
7891 3319 -46725 -137656 -123532 -64751 -40227 25789 125955 113813 80918 79939 30610 77737
7879 77737 73877 71273 -22006 -25141 -23560 -35951 -77103 4696 48089 81338 9234 -8962 146932
7866 146932 176669 112757 4530 -24886 74685 198969 142768 29145 -409 69722 192135
7855 192135 131496 109692 93055 57520 126013 178356 134875 129070 166740 39480 -34526 51656
7843 51656 9548 -30894 -25648 -108293 -164729 -209010 -191377 -142133 -52176 -9411 -26997 -148148
7831 -148148 -116719 -59595 -77599 -172887 -137646 -23814 16828 46637 -73422 -93096 -76935
7820 -76935 -102653 -99615 -75858 -120786 -112079 -134483 -67983 -88885 6581 76727 11548 -38715
7808 -38715 -143637 -262278 -198833 -171798 -195977 -219885 -146115 -43178 36146 160483 163860
7797 163860 42306 -22574 24264 -41184 106694 89937 13369 1244 5320 43327 -21912
7786 -21912 -93365 -165467 -253109 -166369 -65196 59779 116651 125194 40299 -64272 -44861
7775 -44861 -15844 7520 99449 131952 49877 2780 -33554 -92714 -40656 -37444 103159 116229
7763 116229 17162 5735 -22094 -88783 -178013 -255707 -147173 -139616 -215760 -234754 -171016 -90380
7751 -90380 -97254 -69598 -113500 -108171 8132 -16833 -48437 -47483 -46933 -143691 -93614 -54728 -153811
7738 -153811 -152412 -76110 -52613 8187 -675 55065 58473 45561 951 9405 -4867 -33513
7726 -33513 53172 67412 -70179 -67510 5022 -2540 -100090 -100572 -46181 -12153 -22037 -162465
7714 -162465 -192256 -129229 -93817 -6434 -40656 -4132 101686 110688 -89769 -29836 14846
7703 14846 6255 -26579 -6102 -21918 16649 -63412 -120301 -144931 -128534 -112990 -115239 -47282
7691 -47282 73127 44494 19565 17759 -56740 -108760 -73751 30910 88997 157318 51054
7680 51054 -69034 -67852 470 78854 121815 121303 -26602 -184909 -133837 -72696 -7913 -11257
7668 -11257 49395 83619 167856 129603 55865 32454 61610 85744 176631 191636 71916 75752
7656 75752 38170 59727 101707 -7217 -18725 120443 119600 -92244 -202716 -89536 8762
7645 8762 -33039 -49932 -40387 -68017 -116838 -64074 61638 132183 82639 16363 57094 6338
7633 6338 -48374 -29043 61258 41107 8463 41201 21752 44143 2459 13966 -115984 -251493
7621 -251493 -203547 -77519 73378 103434 152553 197836 164737 46480 112122 186431 137645
7610 137645 3064 -32844 -39906 -31648 -838 -48987 72785 126599 133688 62602 -2422 -15602
7598 -15602 -99556 -105508 -77033 46092 95225 95137 42553 -60765 -98076 -105268 -101213 -49677 -20813
7585 -20813 9017 25381 63 -105008 -146337 -58036 31323 97572 139088 169008 103578 35724
7573 35724 192 126273 238552 220757 162262 67411 -24699 -67680 -54163 -11758 34770
7562 34770 92859 80840 78129 11298 -92346 -85334 -125637 -156161 -83677 -98596 -177282 -60958
7550 -60958 42362 37500 2514 -41735 -48930 -51995 -42087 -11398 9927 -89896 -88345 -122392 -34389
7537 -34389 -59413 -110725 -30757 -9638 67926 102524 -7864 -125792 -182620 -70149 -36425
7526 -36425 -4374 13478 18503 -113827 -119173 -92086 -121546 -155741 -177155 -60809 62014 6189
7514 6189 -105417 -122720 -89848 -96370 -198920 -299758 -273427 -251171 -146910 -96798 -144080
7503 -144080 -183890 -162864 -123335 -83377 -28975 -100634 -170336 -204431 -181115 -137557 -214046 -208587
7491 -208587 -140675 -52594 -5957 -33263 -45816 -78271 -116477 -136979 -132810 -31928 -37614 -97223
7479 -97223 -73159 -92247 -183374 -147750 -38197 -13512 22306 12240 -7616 -35667 -39328 108951
7467 108951 122070 111793 167116 150763 53900 -41670 -58649 -50394 25788 39627 152467 119455
7455 119455 77218 87425 82180 -99658 -105190 9111 -51058 -144678 -146558 -51061 -124355 -105240
7443 -105240 -61027 -4534 -77115 -118663 -112088 -239929 -285594 -113871 -36192 38091 97892
7432 97892 183099 67676 -5165 -98585 -69655 910 2219 -86545 -109942 -76493 -94467 -70539
7420 -70539 -105832 -32136 8178 -65655 -70067 -33140 35477 4600 10376 -29518 -163008 -186143
7408 -186143 -133188 -112354 -186091 -91388 54276 77633 127407 3070 -71391 4161 33053
7397 33053 13567 37441 83941 -6989 7839 -8250 -6968 -6590 18206 -167349 -225905 -242466
7385 -242466 -190982 27057 112657 -7338 44566 75229 30230 -73097 -60149 -19082 -15918
7374 -15918 83365 134199 142983 256693 238136 108068 14801 -75604 -139592 -131713 -237038 -159104
7362 -159104 -31442 -28453 -102094 -268060 -260890 -139209 -36708 -21013 -39198 -105217 -203130
7351 -203130 -244166 -180466 -92326 -1005 5643 23000 57000 112424 119982 106121 95562 72821
7339 72821 -2425 19243 -23246 -39606 -90203 -137651 -93304 -82532 -63840 -77660 -64684 -87321
7327 -87321 -99066 -26141 92307 149665 14729 15403 -61693 -134172 -170778 -106037 -71290 -89952
7315 -89952 -131655 -141607 -116072 -146940 -88991 -52619 -100366 -30875 5023 72949 110055 64549
7303 64549 52076 3820 -128702 -66118 53781 144148 71689 -57392 19640 14357 -59080
7292 -59080 87926 114266 -10526 -63591 9555 16942 14593 -35324 -2730 -3049 -10702 -16946 -25461
7279 -25461 100783 74754 -48978 -99719 -85509 -32533 -52101 -29182 -42411 -4881 -44728
7268 -44728 -166028 -36195 36933 7405 -52497 -9924 8682 -117204 -191115 -123490 -30882
7257 -30882 -71218 -46594 24049 111570 100289 39691 47584 78461 50301 -63585 -56156 68018
7245 68018 77038 -17138 36174 61976 48216 14093 44536 63429 28113 74652 -628 -23704
7233 -23704 51456 146314 132167 104945 47227 -25828 17921 46057 23613 40190 18278 36200
7221 36200 73886 71478 -38414 -86696 -58917 30109 59399 74728 13128 -47012 -14419 -15026
7209 -15026 -1641 -35207 -21230 -25526 5323 69359 2549 -165971 -131602 32179 136757
7198 136757 56386 -63158 -131775 -78817 -78986 -136725 -127149 -77292 -152718 -148036 -122893 -108395
7186 -108395 -32371 -51410 -79020 -117186 -115040 -68792 -29617 14753 -29425 -80134 -110982 -184178
7174 -184178 -114096 -110056 -155184 -178193 -275832 -271900 -190643 -222829 -211163 -162298 -164138 -81903
7162 -81903 -33381 -67209 -138609 -174805 -136391 -127489 -120046 -163131 -175128 -130284 -142452 -148754
7150 -148754 -170244 -203292 -80443 62815 123804 180157 78096 51767 78666 73231 243397
7139 243397 291397 64169 -22629 -84530 -92479 -57709 -93070 -100865 -81026 -20093 19768 26281
7127 26281 -10127 -37438 -2927 -8242 2700 17194 169464 158061 118054 -7371 -22056 -37077
7115 -37077 78962 99448 -19168 -130312 -106246 4970 62167 61931 -8981 -155318 -102293
7104 -102293 -72233 -166408 -169943 -127787 -127610 -193347 -173898 -72371 17246 92003 133562 176052
7092 176052 102990 53303 -32361 -52732 53213 82604 -25566 -108265 -174099 -219024 -226819
7081 -226819 -86296 -67990 -145509 -194566 -72051 61198 -54224 -110234 -205642 -254155 -218941
7070 -218941 -184373 -189085 -116358 -81119 -91558 -13883 -87875 -153589 -139643 -110302 -83804 -161325
7058 -161325 -162293 -13025 76441 61342 112380 151214 110908 66090 50029 50517 96006 168145
7046 168145 148301 6890 -40820 -63667 -16130 -34159 -158889 -137102 24137 168731 138705
7035 138705 13942 -94865 2012 -21269 -7787 45375 91441 26992 -4007 -74335 -162485
7024 -162485 -23871 -52301 -44814 -7817 -26615 -23782 63248 74273 -74008 13447 -10929 -67278
7012 -67278 -74238 -84167 -9985 -26247 -147585 -169092 -93018 -109830 -56697 -62753 -79347 483
7000 483 43174 29720 -14306 105432 122405 -24106 -94589 -91402 -56530 -75540 -43911 6166
6988 6166 141762 238695 162994 91116 63177 -82270 -71151 -18580 29399 22732 -12445 44415
6976 44415 28916 -61550 -21453 -7180 -112219 -102282 -130145 -207235 -108197 -53640 12622 109989
6964 109989 165247 117400 177693 236648 182876 141228 177071 118016 126136 93240 -101034 -156389
6952 -156389 -80884 -18936 -56750 -81463 31712 -36341 -69783 -1963 -27047 39087 134337
6941 134337 120563 124758 118186 41303 133479 147892 51488 -31680 8442 -29233 -95527 -140431
6929 -140431 -30499 140702 171136 86302 10270 -17104 -41435 -71218 -78879 -47119 -119074
6918 -119074 -152832 -30930 16684 -25063 -52476 -81951 -94439 -112272 -140125 -96793 -90140 -37240
6906 -37240 -19790 -58721 -116082 -102894 -42594 52137 77320 111261 129093 26478 45773 68583
6894 68583 55144 67205 140462 148340 130197 -7358 -27920 -112419 -107829 -11639 133856 219604
6882 219604 118764 24871 -28777 -59595 -112154 -140897 -2826 31769 8240 -18367 64512
6871 64512 90648 124636 344 33826 106789 87575 -55285 -49297 -107298 -89274 16792
6860 16792 53245 -37446 -195736 -299788 -268803 -119058 -91515 -95709 -67046 -191478 -182668
6849 -182668 -163544 -106033 -22628 -7106 13105 32124 55961 133864 162212 91014 35812 14379
6837 14379 -40690 -94156 -220959 -165728 -226096 -270396 -203110 -130728 -82344 51867 97917
6826 97917 119053 40382 15508 88911 115843 131616 121936 54178 84918 145972 124349 46222
6814 46222 25028 -10745 28699 38052 -53252 -98823 -71394 -33405 -18710 86584 199734 171931
6802 171931 99099 34613 -8707 -80433 -151088 -128070 -113469 -90431 -52903 -55095 -37763 57752
6790 57752 -24292 -75564 -109431 -128861 -84266 -34182 -4860 86126 104993 206224 119915 111180
6778 111180 144545 126871 166118 109034 30172 -23358 -99899 -155175 -160017 -1749 83749 12894
6766 12894 -47174 -148392 -55113 -46092 -89989 -91790 -128236 -149435 -130444 13188 166437 201837
6754 201837 139212 -6937 -94909 -94200 -52980 -28605 33936 -18213 -51453 -46796 -93362 -60396
6742 -60396 -23025 75828 45344 -25494 -31195 6600 48497 38240 12550 72811 112388 144110
6730 144110 171126 138054 67252 109104 91716 2934 105276 113348 89546 119883 479
6719 479 -50077 -51308 -82780 -131327 -66086 66812 85637 69264 -5840 33623 61283 -35513
6707 -35513 -61682 -107024 -61987 7429 67258 83984 46583 -34050 27997 75016 -20414 -49716
6695 -49716 149 33872 13377 -68110 -63403 -85768 6400 81538 74293 18541 43468 59510
6683 59510 37955 4746 1633 84268 -1076 -46809 -141292 -254175 -45988 100123 94660 68905
6671 68905 93877 59580 -57974 -125604 -144431 -145392 5068 87056 69167 117435 138494 126979
6659 126979 -28065 -70475 8987 85131 -46980 -128610 -2398 34946 -87370 -74573 -67519
6648 -67519 -54603 -64395 -56087 -95557 -50011 -7665 -4275 -131379 -181882 -137853 -95035 17791
6636 17791 128873 144434 110667 96657 72259 -46678 -1057 -103133 -164565 -29850 32435
6625 32435 -32740 -31895 -79437 -98663 -123657 -169666 -186950 -165188 -10743 25345 46015 -27041
6613 -27041 -44380 -91159 -124310 -88627 -16153 46639 8204 29439 2886 -104432 -163625 -133940
6601 -133940 -83446 -114958 -37098 -24090 -119582 -145198 -196392 -188761 -117439 -111485 -208379 -202759
6589 -202759 -205747 -134425 -57447 -42546 -60412 -56571 -57644 -68220 90976 135600 85847 152809
6577 152809 31793 15446 193639 226261 129526 82086 69375 159789 145023 186875 257580
6566 257580 285563 173162 53662 -131660 -180332 -188256 -52542 -56424 13965 4345 -5860
6555 -5860 -13873 -126203 -217530 -207652 -169550 -227061 -212740 -14312 6043 -44924 -7335 -35112
6543 -35112 -153010 -77159 -15737 -17304 -16199 3687 49727 -43666 -12219 -47175 -24620 138650
6531 138650 147949 -73626 -168667 -144825 -65495 8968 27477 -152569 -188279 -145576 -171307
6520 -171307 -168084 -85401 -51062 24868 99473 164886 82134 10333 -34803 -62289 1440 71084
6508 71084 -5953 15675 35726 -31693 39161 60059 -3974 15848 -10705 -96481 -100411 9861
6496 9861 68757 64550 80658 26780 24785 68028 257729 197633 51481 -25089 -69608 -129755
6484 -129755 -164448 -89103 -109743 -132400 -21605 58303 48184 22910 27304 45898 -62127
6473 -62127 -114181 -147733 -105533 -4281 48408 55605 19988 5802 -25888 -77805 825 53738
6461 53738 34392 27984 -48137 51248 102823 77049 41853 -54759 -95333 -200411 -48900 70273
6449 70273 26307 86821 195583 155957 64353 29529 57647 133631 85019 -70900 -94470
6438 -94470 -65049 -49536 -9287 62808 -7504 -184813 -284881 -247298 -225665 -82264 4101
6427 4101 -37667 -126299 -154613 -222224 -172459 -73137 -42868 19916 77149 -318 -107988 -135523
6415 -135523 -101920 -15671 -62688 -5230 160429 173842 90919 1579 -61390 -135150 -87049
6404 -87049 -20441 -42013 -98635 -5849 -44642 -126882 -20111 84381 25443 70043 17175
6393 17175 20084 72433 5059 -171835 -155669 -100008 -8037 28548 26925 19041 -58296 26775
6381 26775 47808 -67267 -118429 -50060 144276 101009 -70362 -183105 -178202 -123015 -10630
6370 -10630 102333 79927 118883 130302 72793 90339 208353 235940 276176 58555 -1324
6359 -1324 -78934 -121246 -107105 -145895 -153056 -85188 -6166 -2401 -6556 -25009 -58486 -167344
6347 -167344 -225257 -104354 -27748 26388 51342 27439 10606 -10523 -65059 -88916 -66849
6336 -66849 -31632 21138 -2499 5113 -8667 -62885 -101876 -178543 -188636 -179833 -154935 -218775
6324 -218775 -221971 -178400 -116408 38428 50698 -66512 -27404 -1231 -40022 14351 -41219
6313 -41219 -44004 -347 77569 -11923 -49461 -35308 9236 5465 -163302 -177854 -51843 -10023
6301 -10023 55150 48899 5504 -94123 -46264 -44322 -171153 -243754 -152689 -6202 -27317 -70909
6289 -70909 -29431 24000 -15077 -65526 -42357 31486 7148 -51633 -23586 17133 35962 17673
6277 17673 15425 15513 45643 -18378 63617 25152 -94856 -145792 -89738 -150212 -148152 -44117
6265 -44117 -109413 -81518 68708 135669 4197 -102687 -147042 -91715 -33421 -26006 -138132
6254 -138132 -206751 -162828 -149185 -34365 78295 55865 125782 293590 277912 183163 48424
6243 48424 87700 194573 94026 -119230 -201352 -152502 -26625 -52322 -37064 10797 32799
6232 32799 69172 -36082 -51357 49735 95266 60082 59435 -73968 -186564 -161106 -140796
6221 -140796 -47525 86763 112976 128020 133876 100861 15080 34117 75209 53884 -51192
6210 -51192 -220403 -244819 -231608 -145970 -27691 -24388 31253 40343 144777 23936 -119651
6199 -119651 -147907 -195963 -269292 -146674 -96530 -25693 35754 50015 23366 10497 1850 -6649
6187 -6649 16036 80338 82047 82131 121029 35617 105456 73157 67269 -25937 -41104 8161 18039
6174 18039 4295 -47850 -47830 -27109 -76958 -62514 43766 16578 -33251 -4121 58529 71370
6162 71370 7691 -43950 -89955 -63186 -60702 -105664 -86617 -38992 -21728 -31663 -86827 -27256
6150 -27256 48836 95935 152694 163726 22950 -80742 16141 52628 50648 80874 119283 98272
6138 98272 7888 33769 -45293 -41286 -25614 -33435 -128797 -247438 -178603 -162387 -122715 -153261
6126 -153261 -70108 -33435 7217 89425 -44764 -97779 -111901 -57342 -119019 -178569 -181127 -152545
6114 -152545 10425 -31945 -103223 -90491 22161 36548 37980 106757 126279 108485 14903
6103 14903 -68555 -28746 8034 76828 78599 -29877 -25845 86921 180025 189884 246423 198684
6091 198684 97825 95242 95894 63147 -153304 -121063 -160327 -156918 -101135 -29597 -66445 -103897
6079 -103897 -129234 -123812 -70009 -83766 -72907 -78235 -44139 -109849 -94166 -125306 -161988 -120628
6067 -120628 -111543 -156375 -154783 -2781 63432 32335 -66882 -66715 -9828 22741 10817 10898 -23153
6054 -23153 68453 120461 82568 5669 -26878 -71010 -61774 -39229 97741 105339 16652 -102222
6042 -102222 54465 75458 112707 45519 60964 27303 43105 163333 37083 83292 10179
6031 10179 -102133 -40170 116241 235449 128393 -33562 -94537 -171426 -184736 -129619 -80519
6020 -80519 -76525 -45051 -46424 15896 85760 -11196 -38317 -44073 -42771 13643 39639 68775 -82070
6007 -82070 -102583 -113871 -80989 -48554 -136639 -44138 30129 44025 69375 74426 23375 36349
5995 36349 151362 212264 234672 187093 204096 61520 72972 127722 59145 15547 -15772
5984 -15772 13913 23415 62892 85619 94186 30258 -45443 -49224 -80755 -149674 -151527 -66527 -22431
5971 -22431 -38394 -112949 -66063 11628 92282 145510 158925 95787 -40974 -74251 -57637 23156
5959 23156 42731 -34818 -36923 -44697 -68665 -171560 -215410 -103314 -27917 8854 85323 106969
5947 106969 87303 -6447 -113260 -57232 -26765 -1645 -71718 -79624 -109436 -197469 -206302 -187567
5935 -187567 -185440 -140337 -68226 -56398 -166097 -153771 -48572 -119355 -214261 -106155 31045
5924 31045 70823 67374 212763 264030 192975 164659 134829 83944 -36534 -101360 -127021 -86966
5912 -86966 63891 145836 122159 162027 208268 96092 -4914 -18474 22075 105558 75874
5901 75874 -40657 -116540 -70174 -49166 -55589 -89887 -66021 16921 28429 72930 59676 47566
5889 47566 66036 29905 21312 -74029 -75195 64513 69106 6324 -39663 -82810 -75707 3675
5877 3675 45790 76615 -65511 -37968 48623 -11623 -78283 -45495 20067 47789 61250 29096
5865 29096 -32774 34016 -24862 -123461 19383 -16482 -120773 -148805 -187553 -183493 -154893 -40710
5853 -40710 -13651 117289 144411 121080 67196 2121 -39220 -133437 -179932 -138967 -63740 -3807
5841 -3807 18475 16284 -71221 -85254 4323 26445 -24003 -59276 21515 123994 120624 -32325
5829 -32325 -64258 4469 29945 -2496 -49438 -35779 -70956 -31078 49873 57049 89540 45427
5817 45427 101011 149522 71043 49381 60995 -5318 -86455 -115326 -147688 -22581 83775
5806 83775 150725 111111 39152 30055 95743 106196 35204 1642 47559 2604 -63405 -105327
5794 -105327 -106012 -45846 -174822 -220589 -121239 -107496 -149517 -98673 -31536 -57900 -81682 1862
5782 1862 42664 -82669 -100732 -76559 -36789 13239 15321 -21883 -110363 -113932 -184751 -155092
5770 -155092 -86926 -161577 -317763 -387777 -356458 -290068 -118159 -135435 -19564 -13085 -132342
5759 -132342 -238402 -136267 -155229 -157028 -77204 -88137 -32152 90707 43277 -50248 -87745
5748 -87745 -54013 -34402 -39445 13860 -70467 -123718 -31834 34436 -30366 -24069 -39374 10430
5736 10430 -28625 11699 -59824 -135905 -145536 -5489 94214 149604 80124 -56348 -28967 -14569
5724 -14569 -107833 -121334 -119328 -94018 -18471 -73805 28167 30512 -46370 319 175512 160947
5712 160947 74164 88393 108678 10936 -69937 -111724 -88515 -67866 -10222 -34015 15162 9879
5700 9879 -35471 -126460 -84566 11037 -67578 -156533 -41027 55831 12321 -128341 -153431 -145422
5688 -145422 -124743 -53670 -148279 -293389 -265919 -138583 -143482 -67565 -50979 15722 -32394
5677 -32394 -28585 51652 86744 -21406 -7003 -6181 -34529 -85144 -89259 -47446 -45851 -45698 -18514
5664 -18514 -99337 -239574 -242507 -131132 -75278 80329 206669 120218 147820 147612 62718 66258
5652 66258 -8040 -98866 -111009 -19876 91268 170049 268380 234192 97494 73908 -24932
5641 -24932 -29194 53355 32828 49537 32799 -24201 -80051 -167082 -229428 -196245 -124911 -81269
5629 -81269 93131 224606 172969 117761 39885 86578 91607 -31601 -2914 -73509 13204
5618 13204 -19693 -114998 -175915 -130549 -51690 -35112 23645 52942 85304 1772 -47205 -39822
5606 -39822 29406 -12039 -87703 -93637 -141197 -111890 -136713 -129853 -6615 20310 -27342 -128355
5594 -128355 -83188 32425 33107 112174 68328 -69515 -15500 57084 76220 9862 5793 40548
5582 40548 3616 -7372 10185 78604 53711 65586 100083 149266 202308 292584 176351 69533
5570 69533 -14471 -42836 4688 -10514 -133836 -150163 -106057 -35868 88266 117271 59327
5559 59327 4002 -70774 -67948 5432 -20206 -89306 -94992 -7825 -110098 -168306 -114644 11525
5547 11525 -47008 62414 90063 96492 25825 -79017 -51040 -148874 -144974 -11802 75810 6777
5535 6777 61663 89307 106333 9414 -56859 -73862 20707 49894 12827 -52720 35750 -41237
5523 -41237 -20186 -79574 -108934 -77697 -38564 908 -77778 -159933 -71312 127728 178266 153408
5511 153408 168608 41365 -36831 -69658 -101589 -77337 -53179 -48307 -20836 -25835 3899 91463
5499 91463 -41268 -56962 2529 -38290 22180 90760 -43757 -3716 -1363 40504 36303 -32458
5487 -32458 -87144 -101165 -127970 -93175 -39401 -70094 -67329 -70667 43374 -4146 29197 68454
5475 68454 107241 67524 43034 -41140 -56730 12850 23947 -20692 36374 52783 48836 -112994
5463 -112994 -85838 -2867 -33938 -135441 -164928 -164583 -144267 -118155 -189747 -192257 -121142 -19312
5451 -19312 -26184 -88477 -82413 -33940 29854 24270 3787 14348 37376 -29307 -63026 50450
5439 50450 176800 74371 -97693 -135441 -310039 -300099 -194919 -177372 -57885 113987 89076
5428 89076 -4152 -64312 -100238 -141974 -58579 -18616 -4231 30844 108847 38503 18997 79150
5416 79150 19776 -119736 -196379 -91849 -80875 -31556 -7507 -78615 -107915 -13526 51561
5405 51561 -25376 -7036 7958 -39240 -90976 -81395 -103351 -137210 -126326 1678 -95451 -212325
5393 -212325 -267375 -334800 -295098 -204464 -77525 -149671 -100220 31388 96792 217553 168944
5382 168944 88864 111100 47846 27808 37204 51821 50768 -19377 -138848 -112458 -44020 -69912
5370 -69912 -100498 -133417 -127510 -37570 -88346 -59334 80997 164302 122965 -20565 -93813 -58164
5358 -58164 -46690 -40562 -70348 -79534 -53510 -34884 -43344 -47804 -58944 -172407 -126019 -171581
5346 -171581 -259808 -326267 -275067 -111382 -23157 -35182 26840 90047 124977 71335 -73062
5335 -73062 -116446 -51687 -37879 -47230 -181723 -178279 25374 138538 115455 8862 -75886
5324 -75886 -107181 -122053 -190 108962 141408 150621 95939 -7565 -94008 -141020 -93980
5313 -93980 -25971 48420 81503 -37560 -95971 -18686 -915 -80835 18285 70563 -9615 -28453
5301 -28453 -95917 -37319 51503 124731 187443 85865 109124 135736 70978 -53012 -74569
5290 -74569 50222 128104 11048 -173310 -173304 -183598 -231796 -239356 -158233 -120070 -7140 60837
5278 60837 -8689 -63786 -92615 -114101 -68898 -32456 -61005 -84143 -81674 -33848 -4886 -76478
5266 -76478 38957 96615 114863 121520 149742 10822 -43384 85299 71416 -27757 21322
5255 21322 116113 153691 42960 -9047 -97710 -125724 -104659 -36717 44816 2226 69446 66101
5243 66101 15218 -7051 -41927 -33578 -31595 -65441 -62709 -2751 -31833 -13483 -36037 -25619
5231 -25619 -124241 -157152 -109488 -28864 -67948 -36991 -66115 -35126 -2313 -1324 -50420 -68430
5219 -68430 31964 58166 89048 47962 38574 44810 34448 -16185 -15730 81945 4936 12794 -37698
5206 -37698 1665 50361 81947 155487 27720 -175738 -203009 -262625 -326178 -288083 -132363
5195 -132363 -99004 -251729 -173119 -42374 3550 -12026 -112219 -160830 -187617 -113443 -97529
5184 -97529 40265 55679 -23174 -44829 -35093 121893 162989 65699 108493 141326 105660 104084
5172 104084 168055 192067 95086 56108 -37334 -61348 55532 -15112 -99229 -38896 -98969
5161 -98969 -183828 -175474 -107616 -123364 -129498 -136948 -45341 -103394 -147693 -186427 -207357 -115532
5149 -115532 -2405 58635 -134893 -69447 -9590 -103409 -23591 117912 125686 46714 55715
5138 55715 -10526 2504 51978 63744 77983 174429 171571 115921 -39 26605 57204 40091
5126 40091 86574 144221 55300 -38230 -57507 36703 51131 -12793 -106610 -88146 -101659 -49577
5114 -49577 -99178 -176854 -203711 -105077 -16659 -128019 -120547 -108022 -140112 -218796 -150931 -98233
5102 -98233 -67981 26421 121454 144742 1933 -45209 39680 115967 10995 -66633 34066
5091 34066 117707 34167 -3562 -59695 -43868 -115373 -98181 -56604 -48018 -91061 -140524 -177250
5079 -177250 -168426 -105408 -36797 -2354 40359 -24098 -141423 -205804 -157116 -71931 -86508 -42628
5067 -42628 8143 -17936 -23650 -60356 -3382 41342 14266 -12421 -122214 -57372 -2423 66650
5055 66650 139197 60033 -4058 -33944 29030 4228 29044 62641 71406 67073 -44371 -99585
5043 -99585 -106365 -65677 -110420 -54595 7485 -128210 -127738 4025 -4014 -35171 -13169 -60650
5031 -60650 -72692 125649 195975 130986 111799 144745 79842 22597 6759 96004 138072 95596
5019 95596 32094 -49773 25489 -55196 -55472 -26810 -115417 -159323 -109053 -76052 -40592 -64148
5007 -64148 -39356 -48541 -56853 103311 112723 91110 12782 -13564 51391 70921 34387 -8075
4995 -8075 66365 169212 155851 83821 22502 -155620 -171597 -89991 -143365 -131413 -114353 -217118
4983 -217118 -169727 -164134 -31394 86570 -25830 -79219 -22539 7111 -42269 -19531 -76162
4972 -76162 -67508 -21514 -23120 -119543 -225189 -200778 -129442 -15571 57927 59129 96851 -17517
4960 -17517 -107685 2412 32693 63983 41806 -103316 -133755 -52562 -10766 76444 46540
4949 46540 38307 -12672 -31103 -9563 -61617 -121290 -88980 9549 10589 47209 -31675 14863
4937 14863 95627 -34769 -126522 -74065 -97905 -5586 64736 101452 -8605 -117389 -101737
4926 -101737 33472 89701 60692 1753 28643 14702 30155 -66468 -47546 -58057 25355
4915 25355 19540 66958 143496 104791 129260 84943 -41166 -56861 -19881 -88085 -130413 -65725
4903 -65725 -75543 -72398 -110039 -136458 -224740 -259036 -157918 -45872 2762 8747 4120 -94881
4891 -94881 -96304 -107669 -20615 679 37938 -17323 -125529 -201772 -139341 -103093 -20472 94129
4879 94129 116390 97731 34908 37003 29478 -45724 26278 99068 55359 -27262 35674 53232
4867 53232 5687 -111482 -39431 29970 97243 -7315 -56339 -20978 45122 40423 33322 9000
4855 9000 -138796 -263301 -170327 -74513 -103690 -39869 38187 -26551 -32807 22558 -24546 27375
4843 27375 28080 14762 36292 21405 -20395 -97875 -167460 -130350 -61256 -15587 -45765 -75936
4831 -75936 -113743 -39446 75437 30909 14980 -54818 -129977 -20250 -29777 -28715 -97225 -189399
4819 -189399 -189317 -240182 -121463 -89787 -148560 -182971 -195342 -243820 -170592 30222 157295 67423
4807 67423 21243 54931 -27923 -183578 -84241 3215 -65901 -103901 -8255 39417 -41026 -56640
4795 -56640 -117095 -106849 -125758 -30983 114440 126947 133732 107731 -54784 -166266 -222660
4784 -222660 -197799 -98257 26452 163894 318655 255259 74514 14192 48066 19467 -81345
4773 -81345 -130418 -141267 -97979 26985 26648 -69146 -26361 11681 -37091 -37115 -96886 -142952 -59310
4760 -59310 17256 35680 111231 241143 157982 34573 19162 -87861 -95080 -33337 -67496
4749 -67496 -78755 10485 -40922 -46688 -3225 115974 33083 -90880 -43812 20925 16783 -32681
4737 -32681 -62659 -43751 -68132 -111887 -87588 -78949 -98094 -84893 -64140 20886 -13007 -81704
4725 -81704 -72128 -1209 72572 12575 1117 -4926 5775 -85385 -199221 -78968 -13925 -6799
4713 -6799 61987 171573 147551 -92628 -140267 -122461 -122054 -235814 -293411 -206779 -49874 35659
4701 35659 34122 3898 -6726 -51220 22175 86366 41948 129572 192997 193219 1032 42105
4689 42105 144626 37576 -134968 -253649 -189555 -55199 -18140 57546 123610 155843 48851
4678 48851 41730 -3140 -79595 -98461 -55800 -68809 -63232 -57853 -24976 -19432 -29986 -66769 -148565
4665 -148565 -146597 -182918 -120280 -106673 -159343 -120691 -94009 -44024 34762 175543 139471 -14756
4653 -14756 40182 82404 121468 144042 133646 74058 772 27508 38973 77827 169661 144994
4641 144994 104420 -92414 -144168 -115248 -26096 61859 114431 176898 174922 115149 91740 183461
4629 183461 117555 53850 29861 21952 26669 33773 32661 -159261 -139428 27043 123188 139608
4617 139608 145084 156197 50463 -70467 -41279 -57288 -43792 89290 26914 18698 38522
4606 38522 7279 -43885 -43153 44899 47029 -5146 -11336 -4019 -27504 8374 82035 30920 44570
4593 44570 114299 -2218 -122750 -155663 -191516 -204373 -213684 -137956 -162855 -38387 124045
4582 124045 144771 120171 124290 67009 -19726 -46645 -48958 -65535 -54245 -89012 -93670 -144646
4570 -144646 -203841 -179705 -20253 77903 117438 197236 206442 120614 -35950 15311 29753
4559 29753 125257 41222 -96265 -104906 -111641 30940 125223 91442 13051 -77035 -6893 34936
4547 34936 44885 23032 -18687 -76916 -13988 3370 -24538 18823 68107 54308 84376 54801
4535 54801 125441 131413 52382 1413 16348 23903 -58025 -55842 -152375 -241020 -185178 -92853
4523 -92853 -116994 -168284 -220439 -212821 -168491 -127600 -54299 74691 178953 62452 56272 155568
4511 155568 127649 101416 30402 -26827 -82386 -56132 -75337 -64044 11562 -37047 -53323 -77279
4499 -77279 -160487 -81596 -19974 43499 -586 3707 25806 -13671 -27241 -10762 -77300 -30587
4487 -30587 110208 95475 26691 -11027 -13408 -54529 -45239 8405 29384 136383 126274 -39179
4475 -39179 -136763 -121636 -32110 -117845 -177210 -274125 -241184 -142507 -78077 3266 30533 74520
4463 74520 34639 -33761 4125 -30438 -46100 -93325 -87970 -26951 -37221 -108286 -117455 -169731
4451 -169731 -241137 -203657 -152061 -67217 54225 86710 89463 67064 46743 8765 -85452 -136191
4439 -136191 -113179 -3653 -58458 -93299 23423 64032 191847 217655 146583 43738 -73123
4428 -73123 32923 78797 98017 33914 39055 -4516 24703 152235 208908 146417 173615 154087
4416 154087 192207 251597 173343 57509 120055 86436 105883 154744 89576 102395 103516 42701
4404 42701 11550 59559 113135 50203 -48822 -89796 -167592 -222091 -159119 -77651 32789 -12558
4392 -12558 -96156 -92191 10817 64444 -5550 93026 168868 46570 -47250 -80162 -129576 -43438
4380 -43438 21409 15121 -182300 -178584 -150691 -69985 25834 1283 -19271 -43592 34946 21144
4368 21144 -106780 -89404 -95002 -59279 -101600 -56932 82907 69026 41351 93278 119012 76227
4356 76227 58104 40188 -62520 -87227 -17386 -21253 -61225 -79539 -171340 -99126 -34604 -44590
4344 -44590 -63216 -37673 12199 9155 -85525 -61015 82222 218392 168390 185825 40364
4333 40364 -148011 -108170 -4243 82693 97963 154617 166504 91942 133572 133945 60239 -60619
4321 -60619 -95244 17932 171195 130427 122808 64868 -43683 -10801 -23221 -179531 -311167
4310 -311167 -202200 -39167 23199 -25685 -82043 -64236 46883 154341 70494 48246 68998
4299 68998 158125 162484 168193 57672 9131 35460 64866 17143 -76491 -99972 46444 18681
4287 18681 59278 76464 -24584 64991 143105 115790 147628 90341 85728 -11281 -51510 -73509
4275 -73509 -124060 -163709 -89166 47567 131200 88919 85511 119739 17009 -12141 77032 41450
4263 41450 52120 -3474 -35315 -70181 -1744 22789 49722 73464 54317 61676 46591 33723
4251 33723 -75236 -98622 -91382 -86881 39458 139835 132998 1552 -19851 83729 88719 -49475
4239 -49475 -12519 5409 -3911 65343 76638 -37177 -46302 70728 51883 -40698 -46449 -123579
4227 -123579 -145839 -148042 -143154 -240376 -161073 45847 72321 113064 61167 -70780 -61048 41016
4215 41016 106357 114978 111735 131069 77288 48419 30343 -45100 -80562 -3605 65497 -7977
4203 -7977 57858 73447 90771 98759 74516 -16024 -65301 -74567 -53011 190 -86653 -121905
4191 -121905 -24219 -65770 -83349 -116424 -159725 -121268 -128608 -68783 21016 95806 111665 70729
4179 70729 66715 120256 183251 151191 26448 -107993 -21651 23491 -9863 11975 -14554 -90196
4167 -90196 -26687 -18255 -114569 -151064 -110819 -83132 -40081 -159069 -194864 -141737 -128487 -188382
4155 -188382 -200165 -259872 -288293 -203033 -182884 -177863 -273453 -254901 -106518 -48354 -61719 -134238
4143 -134238 -110919 -65367 8912 -5110 -5060 48380 162321 162998 38881 -107 27744 195258
4131 195258 228480 127564 82646 53657 -80442 -136042 -166833 -96459 -37500 -67846 -58234
4120 -58234 -25494 -11511 -18610 41286 24972 -87300 -113544 -34433 -96837 -39168 -62064 -70813
4108 -70813 78452 161759 183083 225404 231544 138692 -50599 -225561 -75723 7475 -42945
4097 -42945 -45485 -98480 33455 126389 34032 20361 27625 -56621 -91791 -21248 114549 244367
4085 244367 154537 94422 -4082 -28688 47120 71125 804 -24168 -23398 -801 76167 86579
4073 86579 58085 121692 239061 222258 72381 -27448 -33941 -15065 4984 -14740 -34503 -41917
4061 -41917 25336 31554 20492 -11142 -44196 -80875 -128517 -113622 -27906 62186 66514 36944
4049 36944 114262 163342 48243 4004 -13100 -22581 19925 184030 87811 86403 88927 32869
4037 32869 100110 45038 30811 69533 -14192 9292 -41256 -79125 -105920 -49232 -32062 -66542
4025 -66542 -79349 -104961 -158552 -90705 -151384 -218978 -115387 -21071 -75249 18875 115334 69043
4013 69043 -11329 -25100 5101 69080 86169 63485 -110095 -145159 -140098 -77833 -82767 -150141
4001 -150141 -186077 -176992 -89682 -29722 6346 31295 15069 50224 -13093 -59240 -31579 -59075
3989 -59075 -67105 -129255 -62690 84632 126255 44463 18945 -65578 -87429 -38092 45140 165033
3977 165033 153098 106299 55529 -21562 -133596 -66324 -48383 -55190 -98219 -155401 -89695 -108386
3965 -108386 -186636 -225821 -71728 86803 128049 -42492 -118514 -73466 20932 8532 -37681
3954 -37681 -32691 -43386 -18828 12166 15158 97318 158495 140692 77466 82374 132686 132877 -24355
3941 -24355 3161 485 -98527 -189374 -202807 -150256 -63563 -36252 24615 109565 117055 62394
3929 62394 -27870 -136027 -138963 -137950 -85290 -151 43183 101959 20347 -34187 -13525 19471
3917 19471 2022 -44042 -71018 -49475 -96747 -133618 -152172 -157106 -107456 -162708 -125320 -160815
3905 -160815 -129036 -116698 -101997 33512 82892 -27094 -104256 -78568 -54730 -19614 69984
3894 69984 123350 45890 -66443 -47971 -65817 -114032 -73054 5781 -16129 -60977 -98847 -16710
3882 -16710 57071 114857 94275 130114 160644 177135 74205 -54959 -113690 -76944 84654
3871 84654 90774 117728 81032 -4006 -9711 -64916 -152678 -242820 -298578 -231326 -119513 -115225
3859 -115225 -102258 -19779 82232 124629 225799 119678 16549 28258 -12545 -78792 -3591
3848 -3591 32594 67550 200111 153306 131298 75930 65491 37837 -65154 -142995 -103185 -110230
3836 -110230 -35735 16648 -1041 -80474 -115646 -109455 -192130 -128159 -115133 22620 39163 26366
3824 26366 -26603 -114546 -115118 -19617 -100351 -68405 -23263 -50477 -163685 -165095 -40994 14598
3812 14598 -13024 9938 -53108 -82061 -20536 39970 -22863 25548 44844 49154 28334 -44594
3800 -44594 -50873 -58 43849 99780 115900 66432 63795 -72991 -65563 -61386 81132 189582
3788 189582 103108 44287 -59607 -121229 -32721 171687 121695 -51768 -30343 -68266 -95368
3777 -95368 -121272 -186286 -208879 -159164 -16693 -9288 -26065 4531 13030 5487 -9178 -4445
3765 -4445 21760 66620 67182 15786 -9569 50826 111466 164089 66264 -1196 -49870 -55403 -66499
3752 -66499 -26947 -36940 -51545 35488 116501 112391 -63119 -74415 -17601 23220 30453 -25426
3740 -25426 -3248 71709 373 -22249 -2536 12640 -5164 -51520 515 -73189 -36419 110924
3728 110924 192825 70119 -13948 -38199 14452 135970 130176 29202 52880 103241 -25622
3717 -25622 -150241 -171147 -50859 106636 68691 -27066 -31180 -73344 -106150 -55319 -123992
3706 -123992 -169756 -71660 26155 7336 9027 17380 -32323 39882 -9720 -27913 -59469 -93977
3694 -93977 -126588 -84007 62628 150352 79775 -49062 -17872 -14905 -24167 37627 96976 144408
3682 144408 120066 89 -67103 -94682 -135589 -180704 -149089 -13017 96387 72985 4217
3671 4217 20016 43760 156671 164170 70466 -57990 -70982 -4469 88037 79882 133566 132745
3659 132745 141530 77679 85723 73007 130331 97375 141656 168611 49704 8295 -60844 -34469
3647 -34469 -94169 -189220 -178271 -120489 -201459 -235997 -210737 -126130 -106980 -131038 -28029 90069
3635 90069 89181 39343 -117754 -93873 -137075 -114631 10877 -66796 -30070 63722 98307 82361
3623 82361 -5036 -96174 -151071 -105333 -73393 -84453 -69269 -33316 -28328 69891 125498 111343
3611 111343 68055 52255 61002 42190 -82696 -4668 109783 -21970 -167511 -19307 90678
3600 90678 55138 -98372 -77298 -34193 41163 133794 138366 84576 -18952 -31633 -13580 -20711
3588 -20711 84319 124826 12289 -4530 -17709 -77750 1878 59716 20627 -133602 -62520
3577 -62520 60993 72526 35694 34119 26448 -42291 -23793 -31155 -48789 -53775 -13261 7021
3565 7021 39684 -20133 64070 43624 -48621 -87282 -129458 -113422 -33882 -71971 -115169 -82412
3553 -82412 24951 112108 103281 88476 10489 -66767 -124446 -74533 4002 -6311 11113 -10299
3541 -10299 63081 40727 32342 -28261 -96170 -32001 -55314 -172654 -166972 -103258 -43487 -100155
3529 -100155 -87803 -100827 -182533 -138259 -170013 -113540 -50 41148 83172 37288 -7184
3518 -7184 -109988 -218381 -186697 -60424 41850 135610 92642 -25519 -45849 -42737 -33541
3507 -33541 -19395 15897 94711 40739 -75482 -59238 81604 72833 21857 -105560 -86609
3496 -86609 -63722 -17726 -43003 -48865 -39232 -66325 -110215 -109236 -56047 2351 -8401 5007 41511
3483 41511 67065 207061 83548 56032 137874 91712 61559 -25472 -152776 -152463 -118726 -11348
3471 -11348 157514 169560 122720 132436 64645 6588 -29062 -92899 -95954 13551 40002 5129
3459 5129 -71198 -121126 -61816 -10890 53344 53177 -2400 -121686 -108304 -12201 2631 -3111
3447 -3111 41052 106145 207430 150012 168297 202740 111005 35102 71639 96120 134483 89002
3435 89002 -35482 -51275 -16445 24636 78928 103955 128658 150222 88102 52832 -76940
3424 -76940 -180291 -162703 -33699 -3438 -155036 -203927 -91640 -196170 -132351 14225 34006
3413 34006 46857 -28270 29444 -30963 33089 193634 298988 203200 177207 45532 -24999
3402 -24999 32312 57691 126365 118318 85125 138448 116283 -101634 -118125 -114520 -105487 -43177
3390 -43177 -120545 -86532 -68677 -38052 -27055 -84523 -43173 -54631 -75265 -51407 -71255 22154
3378 22154 -19882 -53728 -61388 -8888 108460 56961 125711 41653 -167742 -181573 -45274
3367 -45274 -14138 -6312 -73054 -22348 18459 -98605 -109000 -86972 -94386 -19028 115206 71119
3355 71119 -29675 -21996 54110 183739 281848 159145 12852 -29527 -34533 122832 213687
3344 213687 119425 29925 39834 71567 146660 160843 194463 215369 67568 2504 58553 80812
3332 80812 27299 -36256 -41167 -32013 6271 37147 81171 128544 190948 130947 62014 96207
3320 96207 127045 203044 211467 11352 -27619 -46772 -47944 44067 78768 -92782 -116845 -295380
3308 -295380 -359715 -249493 -194850 -235280 -262018 -170031 -211844 -310536 -200946 -181918 -204048
3297 -204048 -132087 -74575 -48103 -90793 -175128 -153811 -122094 -49530 59054 -13622 -57275
3286 -57275 -49811 8211 18689 -9098 -57641 3092 77577 64523 29297 -26910 93408 87383
3274 87383 46418 -22315 69298 127240 213387 99610 -84770 -56085 52514 16246 22305
3263 22305 36981 -22383 -79526 -66717 -41148 10240 -33590 -60427 -59678 -60161 -52097 -78177 -111530
3250 -111530 -40693 99609 24299 -26082 50709 23858 -141653 -225167 -146874 -32620 46007
3239 46007 4906 -20186 -25794 15072 -19264 -127008 -105906 30127 90309 63083 178374
3228 178374 164861 141800 152972 128666 79507 -18431 -55758 -50946 -24880 1110 -55860 -91325
3216 -91325 -62160 30701 77643 21201 -62398 -67597 -48443 -75685 -64709 -59318 24229 -105513
3204 -105513 -68634 35375 50688 120130 66047 -9216 -24994 -78765 -129555 -87558 -7514
3193 -7514 10292 -100126 -121776 -78509 -69603 -89830 -103158 -150508 -100222 -18856 44655 71149
3181 71149 26353 -57789 -40829 -8216 -14211 -56456 3856 53966 1762 105365 117123 1119
3169 1119 31475 38149 14168 66766 5388 3440 -20560 13387 55281 108814 161405 173379
3157 173379 15806 -113630 -113866 -54217 -41983 -233732 -291202 -222320 -179844 -190542 -193218 -243550
3145 -243550 -205513 55026 138627 257367 345499 235818 209660 241328 125006 86612 192238
3134 192238 264907 170235 81315 62411 46612 89572 77041 110825 76274 200787 273284
3123 273284 256073 199337 174840 121773 93209 -33850 -139069 -166143 -38887 132210 147680
3112 147680 178427 131920 146564 169187 121761 34945 -7059 -25849 -70236 -127644 -100262 -106293
3100 -106293 -1186 96406 177612 34200 90649 139783 157559 77879 8541 -98528 -65979
3089 -65979 -15156 6257 -117601 -44531 -34028 -42941 11976 9738 21018 64322 -77024 -89285
3077 -89285 -63662 -32504 20028 50795 5084 -45242 -73799 59851 125381 13674 -35224
3066 -35224 -12365 -25004 7013 86173 21192 -77642 -162241 -172907 -51230 -68863 -69141 -55695
3054 -55695 -66900 5114 -83619 -198391 -201032 -110019 -105671 -94629 -126863 -99626 18409 114189
3042 114189 94940 87403 106946 102543 14300 -8687 -49264 -145608 -192263 -223678 -164327 -47410
3030 -47410 52049 45550 31719 94002 -17997 -41960 54945 -70747 -30967 -33061 -104198 -64952
3018 -64952 -11787 48553 87160 154940 50142 3713 7491 -39524 -156218 -174162 -141296 -124158
3006 -124158 7477 104973 54164 -55273 -76784 -68914 -76778 -2600 114232 36539 -24502
2995 -24502 27993 7516 -40519 -60220 -63063 -16033 -4963 73036 90346 81844 36552 51825
2983 51825 91053 -11543 29704 17500 -53879 -19091 18507 69874 51538 -51222 -185616
2972 -185616 -157485 -177190 -274544 -199318 -134494 -117133 -46995 -60307 -189061 -229380 -99672
2961 -99672 11551 9016 -21020 -76409 -42017 -57285 -94102 -135864 -116906 -60095 88538 148484
2949 148484 116965 86032 -7119 -50400 -3505 19735 -839 -104 -143194 -191397 -226451 -190364
2937 -190364 -82498 46148 183683 101064 -13973 -80217 -64601 -26057 -39573 -122417 -139858
2926 -139858 -93774 -104188 -140485 -48688 38757 142941 172223 51531 13715 -42871 -119218
2915 -119218 -138763 -140572 -80760 -23673 21306 67488 87723 23605 19237 -71708 8704 10825
2903 10825 -26825 -23897 13073 28580 49369 70045 103275 21750 -40329 -22433 -42918 -49008
2891 -49008 -62869 -27684 9583 7597 24105 -25026 -81713 -63846 -98146 -69160 -152865 -215938
2879 -215938 -208386 -202131 -160774 -111626 -40706 68312 86458 42863 -79262 -87575 -50663 -131567
2867 -131567 -206373 -184657 -85417 -52391 -37706 -30519 114155 62436 -35555 -60377 111785
2856 111785 193957 219701 339951 296821 200728 203664 131045 176280 235737 272805 198116 150034
2844 150034 69964 3398 56973 137751 94252 91367 149899 134619 160407 176485 180906 126516
2832 126516 130825 164459 190027 189573 223506 179069 164733 153185 118886 82171 3164 -2889
2820 -2889 849 -23982 -53356 18198 109562 82293 6348 5679 45556 53059 43003 75546 171345
2807 171345 199532 57804 -12478 -23851 -56784 -58481 1088 25650 75335 18535 -91005
2796 -91005 -135577 -66889 -24529 1172 -72443 -78906 3014 39284 115612 116759 74423 64859
2784 64859 -17694 -78178 -49843 -52052 -42089 85489 28349 -73979 -96602 -29534 19266 -42058
2772 -42058 -100639 -117803 -73942 -66390 -135831 -73572 -47939 122645 155445 127300 -10313 -83914
2760 -83914 -28465 41098 86196 41629 22912 78823 36764 21238 79204 65149 63567 20406
2748 20406 -116777 -179299 -165090 -90854 -10083 -50245 -61934 103798 130540 92454 84520 71508
2736 71508 -25970 -115557 -102514 -16656 -75856 -69666 -133372 -170980 -76168 -140661 -151070 -210748
2724 -210748 -184816 -301790 -396636 -372513 -187762 -242858 -273195 -234655 -185322 -100384 -1562
2713 -1562 87455 140208 79228 109088 151089 126285 170780 83751 90743 73555 84945 152812
2701 152812 176234 196656 56821 -29673 -164013 -214774 -154198 41202 253038 184757 126466
2690 126466 135161 122380 74157 10728 -74647 -21370 15888 -3442 30927 20581 90973 180538
2678 180538 167130 122546 109283 42432 106073 69160 -77795 -149784 -113737 -58247 -79888
2667 -79888 52611 -13741 -60657 33381 35600 -154792 -174219 -118580 -212258 -141583 -78941 -24356
2655 -24356 41153 -23936 -23826 -87082 -146044 -75598 -9178 -73992 -45442 -123346 -67069 77578
2643 77578 99980 60954 -58529 21599 97962 132800 213264 120247 17955 -17188 88198
2632 88198 97826 53871 -13339 -72413 -68550 -70382 -61736 -33668 -83632 -141252 -92117 -66855 -22175
2619 -22175 20764 65027 96059 165887 118620 37308 -65684 -76976 40467 138022 199396
2608 199396 98168 58953 93252 84084 73733 84263 164502 210607 193822 71318 -31331
2597 -31331 136853 257444 305443 317369 245232 133198 146841 121673 119601 148662 160865
2586 160865 102904 101404 32802 -66985 -68410 -101790 -164682 -121104 -127331 -238423 -263436 -307520
2574 -307520 -301762 -187581 -114585 -120658 -19259 -15842 -28040 -14400 49059 111537 66911 -2115
2562 -2115 23224 121645 47193 -31475 -78665 -95400 28356 -11864 41704 12198 -108476 -64930
2550 -64930 28341 85518 99752 179957 170497 211206 220849 140686 154181 182328 8820 -68364
$$ [...]
##END NTUPLES=NMR SPECTRUM
##END=
