##TITLE=Analysis number 317725
Compound Code cc 38304
Book Reference 468/35
Project Code adrs
Chemist Name colinb
##JCAMPDX= 6.0         $$ Bruker NMR JCAMP-DX V2.0
##DATA TYPE= NMR SPECTRUM
##DATA CLASS= NTUPLES
##ORIGIN= Bruker BioSpin GmbH
##OWNER= nmr
$$ XWIN-NMR		Version 3.5
$$ Wed Mar  1 12:50:24 2006 GMT Standard Time (UT+0h)  MAYBRIDGE\nmr@NMR_250MHZ
##.OBSERVE FREQUENCY= 250.131544655141
##.OBSERVE NUCLEUS= ^1H
##.ACQUISITION MODE= SIMULTANEOUS (DQD)
##.ACQUISITION SCHEME= undefined
##.AVERAGES= 16
##.DIGITISER RES= 18
##SPECTROMETER/DATA SYSTEM= dpx250
##.PULSE SEQUENCE= zg30
##.SOLVENT NAME= CDCl3
##.SHIFT REFERENCE= (INTERNAL, CDCl3, 0, 16.522)
##AUDIT TRAIL= $$ (NUMBER, WHEN, WHO, WHERE, WHAT)
$$ ##TITLE= Audit trail, XWIN-NMR		Version 3.5
$$ ##JCAMPDX= 5.01
$$ ##ORIGIN= Bruker BioSpin GmbH
$$ ##OWNER= nmr
$$ C:\u/data/dgb/nmr/ADRS/17220/pdata/1/auditp.txt
$$ ##AUDIT TRAIL=  $$ (NUMBER, WHEN, WHO, WHERE, WHAT)
(   1,<2006-03-01 12:49:41.56 +000>,<MAYBRIDGE\nmr>,<NMR_250MHZ>,
      <created by zg, POWCHK disabled, PULCHK disabled
       configuration hash MD5:
       84 BC 41 DB A1 6E 1D 46 DA 25 12 A5 C1 ED C5 3A
       data hash MD5: 64K
       63 E4 65 29 78 7F B7 CC 67 B5 49 53 47 CC 42 AB>)
(   2,<2006-03-01 12:50:00.19 +000>,<MAYBRIDGE\nmr>,<NMR_250MHZ>,
      <Start of raw data processing
       ef LB = 0.3 FT_mod = 6 PKNL = 1 SI = 32K 
       data hash MD5: 32K
       8F 2B 60 AB E2 93 81 BF 9F 15 35 FA 7B 24 39 D9>)
(   3,<2006-03-01 12:50:05.79 +000>,<MAYBRIDGE\nmr>,<NMR_250MHZ>,
      <apk 
       data hash MD5: 32K
       81 AA 86 52 DE 25 BD 03 0D 13 B7 84 50 AB BD B1>)
(   4,<2006-03-01 12:50:07.44 +000>,<MAYBRIDGE\nmr>,<NMR_250MHZ>,
      <abs ABSG = 5 
       data hash MD5: 32K
       80 DF 4A 36 54 28 44 86 EA 7E 31 46 C3 D9 FE 61>)
$$ ##END=
$$ 
$$ hash MD5
$$ A4 A1 B6 38 90 2D EA 24 28 55 7F 00 23 C6 16 8E
##$RELAX= 
##$RELAX= 
##$RELAX= 
##$RELAX= 
##$RELAX= 
##$RELAX= 
##$RELAX= 
$$ Bruker specific parameters
$$ --------------------------
##$DU= <C:\u>
##$EXPNO= 17220
##$NAME= <ADRS>
##$PROCNO= 1
##$TYPE= <nmr>
##$USER= <dgb>
##$AMP= (0..31)
100 100 100 100 100 100 100 100 100 100 100 100 100 100 100 100 100 100 
100 100 100 100 100 100 100 100 100 100 100 100 100 100 
##$AQSEQ= 0
##$AQ_mod= 3
##$AUNM= <au_zg>
##$AUTOPOS= <29 >
##$BF1= 250.13
##$BF2= 250.13
##$BF3= 250.13
##$BF4= 250.13
##$BF5= 500.13
##$BF6= 500.13
##$BF7= 500.13
##$BF8= 500.13
##$BYTORDA= 1
##$CFDGTYP= 0
##$CFRGTYP= 5
##$CHEMSTR= <none>
##$CNST= (0..31)
1 1 145 1 1 1 1 1 1 1 1 1 1 1 1 1 1 1 1 1 1 1 1 1 1 1 1 1 1 1 1 1 
##$CPDPRG= <>
##$CPDPRG1= <>
##$CPDPRG2= <>
##$CPDPRG3= <>
##$CPDPRG4= <mlev>
##$CPDPRG5= <mlev>
##$CPDPRG6= <mlev>
##$CPDPRG7= <mlev>
##$CPDPRG8= <mlev>
##$CPDPRGB= <>
##$CPDPRGT= <>
##$D= (0..31)
0 1 0 0 0 0 0 0 0 0.06 0 0 0 0 0 0 0.0002 0 0 0 0 0 0 0 0 0 0 0 0 0 0 
0 
##$DATE= 1141217378
##$DBL= (0..7)
120 120 120 120 120 120 120 120 
##$DBP= (0..7)
150 150 150 150 150 150 150 150 
##$DBP07= 0
##$DBPNAM0= <>
##$DBPNAM1= <>
$$ [...]
##$SUBNAM7= <"">
##$SUBNAM8= <"">
##$SUBNAM9= <"">
##$SW= 20.6930455092707
##$SWIBOX= (0..15)
0 0 3 0 0 0 0 0 0 0 0 0 0 0 0 0 
##$SW_h= 5175.983436853
##$TD= 65536
##$TD0= 1
##$TE= 293.16
##$TE2= 300
##$TE3= 300
##$TEG= 300
##$TL= (0..7)
0 120 120 120 120 120 120 120 
##$TP= (0..7)
150 150 150 150 150 150 150 150 
##$TP07= 0
##$TPNAME0= <>
##$TPNAME1= <>
##$TPNAME2= <>
##$TPNAME3= <>
##$TPNAME4= <>
##$TPNAME5= <>
##$TPNAME6= <>
##$TPNAME7= <>
##$TPOAL= (0..7)
0.5 0.5 0.5 0.5 0.5 0.5 0.5 0.5 
##$TPOFFS= (0..7)
0 0 0 0 0 0 0 0 
##$TUNHIN= 0
##$TUNHOUT= 0
##$TUNXOUT= 0
##$USERA1= <user>
##$USERA2= <user>
##$USERA3= <user>
##$USERA4= <user>
##$USERA5= <user>
##$V9= 5
##$VALIST= <valist>
##$VCLIST= <CCCCCCCCCCCCCCC>
##$VD= 0
##$VDLIST= <DDDDDDDDDDDDDDD>
##$VPLIST= <PPPPPPPPPPPPPPP>
##$VTLIST= <TTTTTTTTTTTTTTT>
##$WBST= 1024
##$WBSW= 4
##$XGAIN= (0..3)
0 0 0 0 
##$XL= 0
##$YL= 0
##$YMAX_a= 475886
##$YMIN_a= -567304
##$ZGOPTNS= <>
##$ZL1= 120
##$ZL2= 120
##$ZL3= 120
##$ZL4= 120
##$ABSF1= 16.522
##$ABSF2= -4.171173
##$ABSG= 5
##$ABSL= 3
##$ALPHA= 0
##$AQORDER= 0
##$ASSFAC= 0
##$ASSFACI= 0
##$ASSFACX= 0
##$ASSWID= 0
##$AUNMP= <proc_1d>
##$AZFE= 0.1
##$AZFW= 0.1
##$BCFW= 0
##$BC_mod= 0
##$BYTORDP= 0
##$COROFFS= 0
##$CY= 12.5
##$DATMOD= 1
##$DC= 0
##$DFILT= <>
##$DTYPP= 0
##$F1P= 14.0000005364418
##$F2P= -0.99999901652339
##$FCOR= 0.5
##$FTSIZE= 32768
##$FT_mod= 6
##$GAMMA= 0
##$GB= 0
##$INTBC= 1
##$INTSCL= 1
##$ISEN= 128
##$LB= 0.3
##$LEV0= 0
##$LPBIN= 0
##$MAXI= 10000
##$MC2= 0
##$MEAN= 0
##$ME_mod= 0
##$MI= 0
##$NCOEF= 0
##$NC_proc= -4
##$NLEV= 6
##$NOISF1= 0
##$NOISF2= 0
##$NSP= 0
##$NTH_PI= 0
##$NZP= 0
##$OFFSET= 16.522
##$PC= 1
##$PHC0= -110.2922
##$PHC1= 8.507743
##$PH_mod= 1
##$PKNL= yes
##$PPARMOD= 0
##$PSCAL= 4
##$PSIGN= 0
##$REVERSE= no
##$SF= 250.13
##$SI= 32768
##$SIGF1= 0
##$SIGF2= 0
##$SINO= 400
##$SIOLD= 32768
##$SREGLST= <1H.CDCl3>
##$SSB= 0
##$STSI= 32768
##$STSR= 0
##$SW_p= 5175.98343685301
##$SYMM= 0
##$S_DEV= 0
##$TDeff= 65536
##$TDoff= 0
##$TI= <Analysis number 999999
Compound Code 99
Book Reference 9
Project Code 9>
##$TILT= no
##$TM1= 0
##$TM2= 0
##$TOPLEV= 0
##$USERP1= <user>
##$USERP2= <user>
##$USERP3= <user>
##$USERP4= <user>
##$USERP5= <user>
##$WDW= 1
##$XDIM= 32768
##$YMAX_p= 291454090
##$YMIN_p= -330585
$$ End of Bruker specific parameters
$$ ---------------------------------
##NTUPLES= NMR SPECTRUM
##VAR_NAME=  FREQUENCY,     SPECTRUM/REAL,   SPECTRUM/IMAG
##SYMBOL=    X,             R,               I
##VAR_TYPE=  INDEPENDENT,   DEPENDENT,       DEPENDENT
##VAR_FORM=  AFFN,          ASDF,            ASDF
##VAR_DIM=   32768,         32768,           32768
##UNITS=     HZ,            ARBITRARY UNITS, ARBITRARY UNITS
##FACTOR=    0.157963299565203, 1,           1
##FIRST=     4132.6476996994, 0,             0
##LAST=      -1043.33573715361, 0,           0
##MIN=       -1043.33573715361, -330585,     0
##MAX=       4132.6476996994, 291454090,     0
$$ Real data points
##PAGE= N=1
##DATA TABLE= (X++(R..R)), XYDATA
$$ [...]
17737f1996j4171L8414J75651o075N0872M4051n1855o7924L7098J5581l4064n2627
17725G2955J1015Q2393j7254o5236k1623n5649N3707k4483O689k1754K7138M0647
17713H8545P808M8245J34492P8457m1109q7861k4063j3742O5552Q1859P6477J46225
17701E60885K87726L51478L27803K26799L03356K41320K76203J38434R654j42178
17691B581480k75647k89290k48669k80454k24512j38097q0853n7661m8911L7178
17681I74564L8625n8204j63373m3832q5769r0730o5965j00754j31972j03755j51829
17670A7006K7665R3547j8830K9165q660p5719l8202Q779Q5292O7268J2613m6466
17658A53458L5400l8789k4334m4053j6163k4457n5283O5241K4024K2526m0841
$$ y = [-61996, -76167, -37753, 137898, 131823, 182695, 226746, 174891, 106967, 144065, 159646, 125582, 72955, 83970, 166363, 149109, 83873, 62250, 6601, 60308, 35825, 42514, 20760, 47898, 88545, 96353, 144598, 279090, 357547, 316438, 228577, 204514, 190772, 256324, 338183, 414660, 560885, 848611, 1200089, 1527892, 1754691, 2058047, 2299367, 2575570, 2714004, 2723658, 2581480, 2305833, 2016543, 1767874, 1487420, 1262908, 1124811, 1043958, 986297, 937386, 974564, 1013189, 954985, 791612, 747780, 662011, 571281, 505316, 404562, 272590, 168835, 17006, 44671, 138218, 119388, 148553, 139893, 64174, 25972, 34751, 120043, 187311, 199924, 153458, 188858, 150069, 125735, 81682, 65519, 41062, -14221, 51020, 75044, 97570, 56729]
17647E6729k0407J30441L2956K3557J4514N1743O8848K9882J08282N4954M1559
17636E93058O2380R1983j4497j03309j30945q0582k4281o8603r9403n8137J9438
17625A87102J1579l712l1324p5237l364N0212n0949J9181r5024L5976L7072n2695
17613B8817L0919K1187L3120L8623L0535m8288m297K3606K2080j8005K9197P0489
17601B57983j5890m929k3546q063L1535J2782O4646j05415r5848J1874j0073l6154
17589G8902l542j3430O2109K6386q857Q1742O0088m7736n7609J3492L6374k7012
17577B00907j83092J986L7251M6227P1828l2941k3279q0062M2391Q3253J8907
17566A83376K1791K3999q9755j17424p783R8890O3967L7686K6394n8224m006R8442
$$ y = [56729, 36322, 166763, 199719, 223276, 237790, 289533, 358381, 388263, 496545, 551499, 593058, 655438, 747421, 732924, 629615, 498670, 418088, 393807, 325204, 225801, 167664, 187102, 198681, 194969, 163645, 88408, 85044, 135256, 84307, 103488, 8464, 44440, 81512, 28817, 59736, 80923, 114043, 152666, 183201, 134913, 130616, 154222, 176302, 158297, 187494, 257983, 242093, 237164, 213618, 205555, 237090, 249872, 314518, 209103, 113255, 125129, 115056, 78902, 75360, 61930, 124039, 150425, 141568, 223310, 283398, 235662, 178053, 191545, 227919, 200907, 17815, 19801, 57052, 103279, 175107, 142166, 118887, 38825, 81216, 164469, 183376, 205167, 229166, 139411, 21987, 14204, 113094, 177061, 214747, 241141, 182917, 178911, 277353]
17554B77353J2110K8269l2030n807N4720m3233n3174q76k3481J8282K7234n5402
17542B03965L1548J01957R2034K2853l8739q0015l2533K3912K1305k3889J1596
17531C33994l4084M7532m2723Q1843P6570J11633O9398O7682o9810l3330N8987
17520F67692m7347K5020P1139r000m4909N4803J26601J07237K6565O8501O9764
17509A116066K17076K30675J44996K15624J87837N8848M6488J81356Q6400R1407
17499B576773J88212J28811L77582L94658M21433O73334Q21203J065509J319170
17490G966685J832301K805393M338469O913809J1107825J6540661J9969264J7596854
17482H9071261J1263756O710715N237050L179758k297955r180598j4125124j6712960
$$ y = [277353, 289463, 317732, 285702, 279895, 334615, 291382, 238208, 237332, 213851, 232133, 259367, 203965, 235513, 337470, 429504, 452357, 413618, 333603, 301070, 324982, 346287, 322398, 333994, 299910, 347442, 304719, 386562, 463132, 574765, 644163, 711845, 642035, 608705, 667692, 620345, 645365, 716504, 707504, 662595, 717398, 843999, 951236, 977801, 1046302, 1116066, 1333142, 1563817, 1708813, 1924437, 2112274, 2171122, 2217610, 2398966, 2485366, 2576773, 2764985, 2893796, 3271378, 3666036, 4087469, 4760803, 5582006, 6647515, 7966685, 9798986, 12604379, 16942848, 23856657, 34964482, 51505143, 71474407, 89071261, 100335017, 107045732, 112282782, 115462540, 113164585, 103983987, 89858863, 73145903]
17474G3145903j7006416j4751429j1087653p546715m892710l356223k281271j664230
17466A0559256j256563j075157p59294n84181m96963m97021n45694m30700m09123
17457D504560l39295k59963j78937k04251j92085j17931j7494M5070J30458J36231
17447C506363K52821K45603K08072J90265K36138K99611N25256P20229O99174
17438F883532P61798J126837J653283K467599M012565O618943J0746562J5655977
17430D9927096J8595193J5974605R868474N673145M214310K168622k844946r126056
17422I4450443j3560849j5582825j5633938j3559475j0274688o965117m576778
17415A4296773l081365k208460j596800j123921p80152n77252m07551l47383m06923
$$ y = [73145903, 56139487, 41388058, 30300405, 22753690, 17860980, 14504757, 12223486, 10559256, 9302693, 8227536, 7468242, 6884061, 6387098, 5890077, 5344383, 4913683, 4504560, 4165265, 3905302, 3726365, 3522114, 3330029, 3212098, 3194604, 3239674, 3370132, 3506363, 3759184, 4004787, 4212859, 4403124, 4639262, 4938873, 5464129, 6184358, 6883532, 7645330, 8772167, 10425450, 12893049, 16905614, 23524557, 34271119, 49927096, 68522289, 84496894, 94365368, 100038513, 104252823, 106421445, 103576499, 94450443, 80889594, 65306769, 49672831, 36113356, 25838668, 18873551, 14296773, 11215408, 9006948, 7410148, 6286227, 5506075, 4928823, 4521272, 4173889, 3766966]
17406C766966k51978k53461k46306k76743k38119l19566k85445j16792j00045
17397A678511j29112j31484p7869j38919j89595j04132j4275K9093o6562j00244
17387G55412n886L6583l9148k0026o3441o9565l6588j4739m7263O4603J2777K7889
17375F00608J17190J8010k6649j51993j11780R449o7140k3702p8047p7056L8579
17364B47469M3305N8502j1270o3705J4210N9332K3667k458n1051k3294J0581J3835
17352C19123J6273j16514j13904N3677M7563r832k483J496j7896l8199n0524L7129
17340A25909P5790L5025L2381q9432o6918m8999J0630Q8130M0508P6629l5272
17329B44381j1142L8171l6747N6709j4124q0739n4886K6715q1763n909m8091p7541
$$ y = [3766966, 3514988, 3261527, 3015221, 2738478, 2500359, 2180793, 1895348, 1778556, 1678511, 1549399, 1417915, 1340046, 1201127, 1011532, 907400, 893125, 922218, 855656, 755412, 749526, 786109, 746961, 726935, 663494, 593929, 557341, 542602, 495339, 559942, 572719, 600608, 717798, 735808, 709159, 557166, 445386, 454835, 387695, 363993, 285946, 208890, 247469, 290774, 349276, 338006, 274301, 288511, 347843, 371510, 369052, 318001, 294707, 305288, 319123, 335396, 218882, 104978, 158655, 206218, 196386, 193903, 195399, 177503, 139304, 88780, 125909, 201699, 236724, 269105, 179673, 112755, 63756, 74386, 162516, 203024, 279653, 244381, 233239, 271410, 234663, 291372, 277248, 196509, 141623, 168338, 86575, 80666, 32575, -44966]
17317d4966M0222j1373m7572P5259Q511J4297L7787L2310p3524L743J0888J0342
17305E5924Q4322O8335k839j09717K0347M6365r122L1744n3628j03403N3987M7738
17293A30053j7706L1086K0162l3423J7073n3756l4084j4724p4706j4620P5344
17282C0699J19994J9243o3131o5992q502j148o1833n8280k0157L3552O6671N0043
17270D1159m169m0089n1921L0638J5320M3558J46937l1997n0886J8969q1290o3446
17258b7217L7017M9078k1229k2703J589l4717r6527M2562J07821M1313L1919J5540
17246A24446J324n773o2629l2289k3455M6309P4632M4466m5594L4878l6685K4368
17234A43998p597l3506n6363o0135J3390L1453P1264N3210p6609J0557M9840P134
$$ y = [-44966, -4744, -16117, -63689, 11570, 20081, 34378, 72165, 104475, 30951, 34694, 45582, 55924, 140246, 208581, 205742, 96025, 116372, 162737, 153615, 185359, 131731, 28328, 82315, 130053, 112347, 143433, 163595, 130172, 147245, 93489, 59405, 44681, -30025, -44645, 30699, 150693, 169936, 106805, 40813, 32311, 31163, -30670, -88950, -109107, -75555, -8884, 41159, 36990, -3099, -55020, -24382, -9062, 34496, 181433, 149436, 98550, 117519, 36229, -27217, 9800, 58878, 37649, 14946, 16535, -18182, -114709, -72147, 35674, 76987, 108906, 124446, 125770, 119997, 57368, 25079, 1624, 47933, 122565, 167031, 121437, 156315, 119630, 143998, 136401, 102895, 46532, -13603, -213, 31240, 102504, 155714, 79105, 89662, 139502, 146636]
17222A46636k158k0059n2125r730k7117n065j2077k6971J29036K6626o2153n7064
17210B7779l4925M1576L9010L7765q9020n8518p471l262l948R135M3676L3306
17198C5103m1055l0862J19908J57638J5332n5288m0762n0534m4882j8970O4680
17187A10308J0570K7806M1798K3122k6181l9746j3192M0053O5686P1228K2895
17176C34347J27119J45371J93328K58658K13710O3815J28477L1695r2498j81145
17166A222877k19891k02665j94366j34473j48424q2753r7960m4770Q0091M9537
17156B27203m3030o1855o6065n2196M045O3036M7878j2354K5259J5554k7973j0531
17144A08971j31483m0165M6958J12637k7707q0430J0322j2148m109O2944q43J8431
$$ y = [146636, 144478, 124419, 72294, 62564, 35447, 30382, 18305, -8666, 120370, 146996, 84843, 27779, -7146, 34430, 73440, 111205, 22185, -36333, -43804, -47066, -51014, -41879, 1797, 35103, -5952, -36814, 83094, 240732, 256064, 200776, 160014, 109480, 64598, 45628, 110308, 120878, 148684, 190482, 213604, 187423, 147677, 134485, 174538, 240224, 311452, 334347, 461466, 606837, 800165, 1058823, 1272533, 1336348, 1464825, 1496520, 1404022, 1222877, 1002986, 800321, 605955, 471482, 323058, 240305, 142345, 97575, 177666, 227203, 184173, 122318, 56253, 4057, 8102, 71138, 119016, 106662, 131921, 147475, 119502, 108971, -22512, -62677, -15719, 96918, 69211, -11219, -897, -13045, -17154, 45790, 44947, 63378]
17132F3378K8030M0595J2317N641N1940O9729O5844J22030P2785J34340J97228
17121H63857Q9478J20491J51626J29988J79868k6179J751j15773k61703k40232
17111H93172j87216j32559j65462q9656r4104n2994n3658m1233R1992P1489k7307
17100B12464j3270M1585J9627P5340N5711R990m8885k0353J8644o3403j32687
17089A54763M9313k6629p0241k9138L1090N1712J716l748M5520J6092L2529P4318
17077C27297m7483p5454K0493M0805O1033Q7773l2268r4037p2677J6411l8044
17066A93849o8646k2033k3276n3976k6900N753R3536K1508m6678M0004L7973L3666
17054A84780M3849P9251J18044K9078p3302j1033J955o3093o8269N902j17663
$$ y = [63378, 91408, 132003, 144320, 149961, 201901, 271630, 337474, 459504, 532289, 666629, 863857, 953335, 1073826, 1225452, 1355440, 1535308, 1509129, 1510880, 1395107, 1133404, 893172, 705956, 573397, 407935, 318279, 224175, 171181, 117523, 76290, 168282, 239771, 212464, 199194, 240779, 260406, 335746, 391457, 401447, 352562, 332209, 350853, 287450, 154763, 204076, 177447, 107206, 78068, 109158, 160870, 162586, 158838, 204358, 220450, 252979, 327297, 279814, 204360, 224853, 265658, 326691, 414464, 382196, 288159, 215482, 231893, 193849, 125203, 103170, 79894, 25918, -982, 4771, 98307, 119815, 73137, 113141, 151114, 184780, 228629, 307880, 425924, 455002, 381700, 370667, 372622, 309529, 241260, 247162, 129499]
17043A29499q0404J5913J15674K004r8770j7445k8331m967K3023l7519L4017o254
17031D6440k5771r1228k2198k7880L1617N0162Q7888N753O2086J22496J3501K1807
17019B74673N2566r4733o2512l281J18153M1711J8150Q0442J34734Q317j7291
17008E50929L8764j6743N422q06l6920j2362k988J490o7311m230J611n9688j73461
16995B23707k9589l6615k1906K1753K2481m7703j3171j950Q2377J05707n4090
16984B51001j03610K8954N2487J8731j9679L010p9176p7358Q224q390Q5438N867
16972A65499l3187M5578J13618J62708J53112O7597Q1871P0793P1018m8542o8624
16961G81441l6892q4033k8662o1361L5827K8316J7702M9010k5413l9078q1170
$$ y = [129499, 49095, 65008, 180682, 182686, 83916, 66471, 38140, 33173, 56196, 18677, 52694, 46440, 20669, -70559, -92757, -120637, -89020, -38858, 49030, 54783, 116869, 239365, 252866, 274673, 327239, 232506, 169994, 166713, 284866, 326577, 344727, 425169, 559903, 568220, 550929, 589693, 572950, 578372, 577566, 540646, 528284, 525296, 526786, 459475, 455245, 456856, 397168, 223707, 194118, 157503, 135597, 157350, 179831, 132128, 118957, 117007, 199384, 305091, 251001, 147391, 176345, 228832, 247563, 227884, 230894, 151718, 74360, 82584, 74194, 159632, 165499, 132312, 177890, 291508, 454216, 607328, 674925, 756796, 827589, 898607, 850065, 781441, 744549, 660516, 631854, 570493, 606320, 634636, 652338, 701348, 675935, 636857, 555687]
16950E55687o2487l2383l8315m3061l1321m7047q1629L4070m4631q5336k9734
16939I3813J1284P467O8804J49890J06144R888J1511M1826p0824L2572k4045r6399
16927C41931o0297N8136n1504j60091j18816k6044R2554J61337N0519N0534N6689
16916C94948R6416M0696R7864m0157k8656p964K8318n4593q8082m2338n7020P816
16904C47248k4496q1696j12828j04332K4003K0528L1917L0444n8589j279Q3481
16893A54401J2176l0579M9320L869q3796J2293J5396O5258l6131o5340P4678J15257
16881B86802Q3226L2391l685O6375j4518m6819k7485o3872k7392j52949J3002
16870A45076O4432L2944k2686L9378q0519m6502P5498J4455m1531p829q4459o4699
$$ y = [555687, 493200, 460817, 422502, 379441, 348120, 301073, 219444, 253514, 208883, 123547, 93813, 105097, 112564, 181368, 331258, 437402, 447290, 458801, 500627, 429803, 462375, 438330, 341931, 281634, 339770, 288266, 128175, 9359, -16685, 75869, 237206, 287725, 338259, 394948, 491364, 532060, 629924, 589767, 561111, 553147, 581465, 526872, 438790, 396452, 339432, 347248, 322752, 241056, 128228, 23896, 47899, 68427, 100344, 130788, 72199, 70920, 154401, 166577, 135998, 185318, 189187, 105391, 117684, 133080, 198338, 162207, 96867, 171545, 286802, 370028, 402419, 398734, 465109, 450591, 403772, 376287, 312415, 285023, 132074, 145076, 209508, 242452, 219766, 259144, 178625, 132123, 207621, 222076, 180545, 172716, 88257, 23558]
16858B3558J02494Q9797l4944p2697p1541J4567m882k6271m9778p0134Q2956L4071
16846A7196n7934Q7882P1728M3263R739q2144j4452J4231O393n9748o0415L7695
16834A3434l6873j0104K4552m8266l6769O981q562O3923M3058M8414o864m4863
16822H061j9186l0262r3767J0333P1877L3202J9519j7107k850J1996l144j5417
16810b6745n6857K6747J9144J9185Q4321n9888l8835n6523j806n3390R0300M582
16798d9765L1867J9027p726J6896M2215k8756M0685j5377k4876L0377N24n771
16786D9320l8324j1877p2096r0738L1578K6154M415p421L0502J0102m8849R9949
16774a7285J13018l2699k815K0268k076n2658P332m0358o962L8012O419O8619
$$ y = [23558, 126052, 215849, 180905, 108208, 36667, 51234, 46352, 20081, -29697, -99831, -16875, 17196, -40738, 47144, 118872, 162135, 171874, 89730, 75278, 89509, 95902, 36154, -24261, 13434, -23439, -33543, -8991, -57257, -94026, -87045, -95607, -31684, 11374, 59788, 52924, 8061, -11125, -41387, -135154, -124821, -52944, -19742, -223, -17330, -20180, -8184, -11328, -26745, -83602, -56855, -37711, -18526, 65795, 5907, -32928, -89451, -91257, -144647, -54347, -49765, -17898, 1129, -6597, 10299, 52514, 23758, 64443, 49066, 24190, 54567, 55091, 49320, 10996, -881, -72977, -163715, -132137, -105983, -101568, -108989, -78487, -68385, -117234, -17285, 95733, 63034, 60219, 80487, 78411, 25753, 33085, -7273, -14235, 23777, 30196, 98815]
16762I8815k4557q5279j46774K7093r684n143l7570P7158Q7551j0029j07465n3959
16750a89843N9714M8624q4644P3687O2449J2637m4380m8457O77j3629k1852M2138
16738a02879O4080J00196p5504p7460M092K2365K8250k1806p8444j6954J02288
16727e1776O5399k9419l2893M079r154Q5380J1993O241q8332l3900K3411k9269
16715g8240o1521J01036P5252k5500r5030l2201k1647o280N7926J15364j361j16302
16703h8504j55629l5620O4355J58975J12425N3831o0842j04836p6260L6180m9175
16692a45100J228p0863l1636Q658M4450L7928K9294P0151L2202n9866n7876n5304
16680a96734O6379P335l4815j923O3822R5632l5247j16351n7171L2768j7609J7388
$$ y = [98815, 74258, -11021, -157795, -130702, -140386, -145529, -183099, -105941, -18390, -28419, -135884, -189843, -130129, -81505, -166149, -92462, -30013, -17376, -61756, -110213, -109536, -123165, -145017, -102879, -38799, 61397, -14107, -91567, -87475, -65110, -36860, -58666, -137110, -154064, -51776, 13623, -15796, -48689, -44610, -53764, 31616, 43609, 49850, -38482, -72382, -48971, -78240, -139761, -38725, 36527, 11027, -84003, -116204, -137851, -144131, -86205, 29159, 27798, -88504, -244133, -279753, -215398, -56423, 56002, 109833, 48991, -55845, -132105, -95925, -145100, -143872, -214735, -246371, -237713, -193263, -155335, -126041, -55890, -23688, -83554, -141430, -196734, -130355, -123020, -157835, -159758, -95936, -304, -35551, -151902, -209073, -176305, -193914, -176526]
16668a76526O8096R328O6099L9863k6536j655L7041M5781Q034o1893o6842o4854
16656a24064r2265o477J01545l742k0026M0062O1854k3743n7262K6759J4935k1173
16644a03597j1224m5457j4607Q5608J9173j2977o4091M0473m3662l7764m4413
16633b32538K8479R4350L5680k3307M3135k7560L8072L8501k2882m2989j9839
16622i0898L337N8704R443j0016j6507N7886J3416j11677j22087l8654N6434J17940
16610g2679R1542o096j8000p7071j2120k5644q4063j4524J14105k5609j6258N1782
16598i4635K106L147l6294J0019M262j3227Q926j8235j0146Q9183J00775K5394
16586G1275j01478l218J1890J065o6902J4934k8843M9071K8595r138K2436M7361
$$ y = [-176526, -108430, -99102, -33003, 6860, -19676, -21331, 15710, 61491, 69525, 7632, -59210, -124064, -216329, -222806, -121261, -125003, -145029, -104967, -43113, -66856, -124118, -97359, -82424, -103597, -114821, -160278, -174885, -89277, -70104, -83081, -147172, -106699, -150361, -188125, -232538, -204059, -109709, -74029, -97336, -54201, -81761, -43689, -5188, -28070, -71059, -90898, -87561, -28857, -19414, -29430, -45937, 11949, 25365, -86312, -208399, -247053, -190619, -72679, 18863, 12767, -5233, -82304, -94424, -120068, -204131, -218655, -104550, -130159, -146417, -94635, -92529, -89382, -125676, -115657, -111395, -124622, -115696, -133931, -144077, -54894, 45881, 71275, -30203, -33421, -21531, -20466, -87368, -72434, -101277, -52206, -23611, -32749, -10313, 37048]
16574C7048L3994n6098M9035l7842n4398j01427k0792N3649l7182j5387P2797
16563g6603K3775k1141n7181o014j6789k53K2726O7215P5246k6710k3065L0091
16551h703o770K3246L970j8763j9723k5004J2068k0783k1995k567K9934m5822
16539a00912n429Q5922J4160n7766l0848N160Q249j412N0453J8216p7784j8955
16527a10946m4762j526K4906Q092L1126Q7406L5760K922k3183m9803M8567m4268
16515c5709j2635n0311K0916Q9472k2449o3565M98N7538K3243j8035Q733J1115
16503H811l6231J750m1928n0689j4179R3734K0005L3347L9837N602J0426M0769
16491A11254L1154o6058p5852j6826j0416M3814P4680l6078l6257m6931m3122
$$ y = [37048, 71042, 14944, 63979, 26137, -28261, -129688, -150480, -96831, -134013, -149400, -76603, -52828, -73969, -131150, -137164, -153953, -154206, -131480, -64265, 10981, -15729, -38794, -8703, -15473, 7773, 11743, -7020, -26743, -51747, -39679, -60462, -82457, -85024, -55090, -100912, -106341, -20419, -6259, -64025, -94873, -89713, -81464, -82876, -32423, -14207, -91991, -110946, -155708, -157234, -132328, -124236, -93110, -5704, 30056, 32978, 9795, -40008, 8559, -35709, -48344, -98655, -77739, 11733, -10716, -74281, -73783, -16245, 6998, -11037, -2304, 8811, -27420, -25670, -67598, -118287, -132466, -38732, -18727, 14620, 54457, 60059, 70485, 111254, 142408, 76350, 498, -16328, -26744, 17070, 91750, 55672, 19415, -27516, -70638]
16480g0638k4276P6357m200o6790j1144K0399l0815L3584J682m2921m9624P6983
16468i1403K7755J2648P6137n68m8435k5500L7809M900j10413m8498P3130J2095
16456h0343o5577l2421K8883K7278L7249O8308M3349L2292j14569l301M1637J2539
16444d676o4376n998J7955Q9395K1574j9966o5176r3762l6827L0196N2766l8837
16432a17732N7434K9262l9682n1428j4616N7204o5390k9855K4560L6064P5689
16421c8490N1714k0101j4532o07m4016k9208L6518P760k6270L6205L941l8523
16409g5609n6372O6538J3445j6302M4123M0478q830j9273l4847R6140L7566l4687
16397E2370r4002o5159P0506p921L436k1843L1673r583K8588R443j1268n5938
$$ y = [-70638, -94914, -18557, -22757, -89547, -100691, -80292, -111107, -77523, -75841, -118762, -168386, -91403, -63648, -51000, 25137, 24569, -23866, -49366, -11557, -6657, -117070, -165568, -92438, -80343, -145920, -178341, -149458, -122180, -84931, -16623, 26726, 59018, -55551, -58852, -17215, -4676, -69052, -75050, -57095, 32300, 53874, 33908, -31268, -125030, -161857, -131661, -78895, -117732, -60298, -31036, -70718, -122146, -136762, -79558, -144948, -174803, -150243, -114179, -38490, 13224, -6877, -21409, -22016, -66032, -95240, -58722, -50962, -77232, -41027, -37086, -75609, -131981, -65443, -51998, -68300, -24177, 16301, 7471, -11802, -46649, 49491, 87057, 52370, -41632, -106791, -36285, -44206, -40770, -62613, -30940, -40523, -11935, -2492, -13760, -69698]
16385f9698L4274l515n6207k1644n0221k0554m6504o1740l4776Q9012J86719J29933
16373G5079j5778p0416o3180L7050M4853n4637m6453j0390L3903N7340K6702n9721
16361d5648l0015N6724l767m0628m0116N3282K7488L7077m6236j8989r542J2319
16349d8051j2356o4019j6063k3533K7510J3918P325l5095P9022m58l4127k9267
16337a35194L4817k8300K5496Q1740k053K805L4112k407l6787k9966m4506M4948
16325e5295K4179M636J1208L081L0599q402K6681Q3227r1728l9253M0321M549
16313C3803L1567m0350L69o1154q3929m0644N9317m2168r286o8470k7384l9001
16301b87330J17379J04486L1093K1646R765k1209j5157j6502K4415N9231M9873
$$ y = [-69698, -35424, -38939, -95146, -116790, -167011, -187565, -234069, -295809, -330585, -241573, -54854, 75079, 59301, -11115, -74295, -37245, 7608, -47029, -93482, -103872, -69969, -12629, 14073, -45648, -75663, -18939, -22706, -63334, -103450, -50168, -22680, 14397, -31839, -50828, -60370, -48051, -60407, -124426, -140489, -164022, -136512, -122594, -115269, -150364, -71342, -71800, -105927, -135194, -100377, -128677, -103181, -21441, -23494, -20689, 13423, 11016, -25771, -55737, -100243, -55295, -31116, -26480, -15272, -12191, 18408, 10006, 36687, 119914, 28186, -11067, 29254, 33803, 65370, 25020, 25389, -35765, -119694, -160338, -101021, -143189, -152475, -220945, -248329, -287330, -169951, -65465, -34372, -12726, -2961, -24170, -39327, -55829, -31414, 27817, 77690]
16290G7690k0797l6854K9235k3660k7887J5546l3445p0789k7452J7798L8262K6381
16278c5972J3929L6741j955P2136l952r1406n5215J4957R3984q025J6530k013
16266D9739n5969o3158L7072K6082p6357O6371Q8745m9060n9180J6205o3120l9298
16254a21928J3707M7231l201l4736n4761k6007J3598N633m159J82J08617k2177
16242g8001k5908N0633O4751m18k3305O0328j5269n1524m7842K673N8598k3144
16230b8428J9507M7181o071p3975q5642o6864r5224M853J49422O7719O416q3470
16218a44576j760R968K6719L0891M707q6193p7360J3498Q4471Q9657q9902n3350
16206a93230K6543M5288r4721j9682P0735O8356J28347M6219j25395j3132N281
$$ y = [77690, 56893, 20039, 49274, 25614, -2273, 13273, -20172, -90961, -118413, -100615, -62353, -35972, -22043, 14698, 12743, 84879, 80927, -10479, -65694, -50737, 43247, 35222, 51752, 49739, -6230, -69388, -32316, -6234, -82591, -16220, 72525, 23465, -35715, -19510, -82630, -121928, -108221, -60990, -64191, -98927, -153688, -179695, -166097, -160464, -164623, -164441, -55824, -78001, -103909, -53276, 11475, 11057, -12248, 48080, 32811, -18713, -66555, -63882, -5284, -28428, -8921, 38260, 32189, -41786, -127428, -194292, -289516, -284663, -135241, -67522, -61106, -144576, -146336, -136368, -109649, -78758, -74051, -160244, -237604, -224106, -139635, -49978, -139880, -193230, -166687, -121399, -216120, -235802, -165067, -96711, 31636, 77855, -47540, -60672, -55391]
16195e5391N9274M4936N4697m4560R760j1528j2443R579k4776k2349O808j2401
16183A606m2880L914K6946K2054Q690k4611m5214n3643K7373L0927K7099J9784
16171B045K7959K062m7735O9040K4373k3568j0928j08285j9870L4317L4894N3961
16159C8265M1326K7832r1674q5946k2404j8886N8358R803j1808M0583K9870l6425
16147b1106J0639O3752j500k5477r188m7919K5511k0597Q724k8123p2529K03M5543
16134g2067L6210R133j784o0611r894n15n032R751p8970k0488k2796N9020N7054
16121a00989R3008N0336J538m9270k5591m7224m3391l6534j5073Q0705J00313
16110G828K5221k5731q6604M0922P3661l7110j03970m2839q0596k6501J11049
$$ y = [-55391, 3883, 48819, 103516, 58956, 68716, 57188, 44745, 54324, 29548, 7199, 14007, 1606, -41274, -37360, -10414, 11640, 20330, -4281, -49495, -103138, -75765, -44838, -17739, 2045, 30004, 32066, -15669, 53371, 77744, 54176, 43248, -65037, -84907, -50590, -15696, 38265, 79591, 107423, 15749, -70197, -92601, -111487, -53129, -43326, -55134, -14551, 15319, -21106, -10467, 53285, 51785, 26308, 17120, -30799, -5288, -25885, -17161, -45284, -117813, -117610, -72067, -35857, -26724, -28508, -89119, -99013, -99528, -104560, -94809, -173779, -194267, -217063, -158043, -100989, -7981, 42355, 43893, -5377, -30968, -78192, -121583, -158117, -173190, -92485, 7828, 33049, 7318, -79286, -38364, 35297, -1813, -105783, -148622, -229218, -255719, -144670]
16099a44670P5009K8805K2119l082m5799p2815L90M2562P6835k7041k3484M8361
16087b2810K7915o1519o4939K0253j9254P5610N8932P880M728J5142M7032j9337
16075F9633p3611n2919n324K6778j1182m9558O2155R3817J5906o3515p634m5940
16063d1394k9891k9525k6117J20981L7129k3694n2395R553R0651L289j4223k9903
16051A4461l0433l1972n2741L9846r49l9142o5829n746L9414J00776q0122n171
16039a17608O3169n8526r5195N6894P6781l278o1573j9775O9961K015M7821n69
16027c9883P0856L4402L7383l6567k7436n5444o2550m5900k1355o3201M2330J10940
16015e6425L2653J970r806M7012J2591j9338l9619m5939L1946K693N2959M8858
$$ y = [-144670, -69661, -40856, -18737, -21819, -67618, -140433, -140043, -97481, -20646, -47687, -71171, -22810, 5105, -56414, -121353, -101100, -120354, -44744, 14188, 22068, 26796, 41938, 88970, 69633, -3978, -56897, -62221, -35443, -46625, -96183, -34028, 59789, 75695, 12180, 4546, -41394, -71285, -100810, -126927, -5946, 31183, 7489, -44906, -35353, 55298, 58587, 44364, 14461, -15972, -47944, -100685, -60839, -61788, -100930, -166759, -172505, -133091, -32315, -112437, -117608, -54439, -112965, -208160, -151266, -74485, -77763, -139336, -159111, -89150, -87135, -39314, -39883, 30973, 65375, 102758, 66191, 38755, -16689, -79239, -125139, -146494, -209695, -167365, -56425, -23772, -21802, -31608, 15404, 27995, 8657, -30962, -76901, -44955, -42262, 10697, 59555]
16003E9555N4568J4747l8426j1212j2133k8183j6270j1711M8547L0936m0561l7560
15991A2297m039n7525o9695l6856M4487k3447k6577o2633M120J03973J12914j4016
15979a6997J3386K081M6024m5787p377j316n0060n997O6657K3741m2077o5117
15967h2839J3569j7326l4319j0464p4323M619P618J9472L942j4357K4865n2511
15955b12054m4267J28792J21550r089l2841N7003q906n4602j06876o369k4493
15944a92152J1600K0694M9423K1236m2888J3077k3576l8837k6934k5507M2880
15933a90984L5252j3440J19193Q7636m5769J0838l4311j01813N9937K0169M721
15922d8571m3472m8528O062L4239L3483n2330m019k2727J4385N4977k2595n9564
$$ y = [59555, 114123, 128870, 90444, 79232, 67099, 38916, 22646, 10935, 59482, 90418, 49857, 12297, 8258, -49267, -118962, -155818, -111331, -134778, -161355, -223988, -219868, -115895, -2981, -16997, -3611, -1530, 44494, -1293, -8670, -9986, -60046, -66043, 614, 24355, -17722, -82839, -69270, -86596, -120915, -131379, -205702, -201083, -193465, -173993, -170051, -184408, -159543, -212054, -256321, -127529, -5979, -15068, -47909, 9094, 188, -54414, -161290, -167659, -192152, -180552, -159858, -110435, -89199, -132087, -119010, -142586, -181423, -208357, -233864, -190984, -155732, -169172, -49979, 37657, -8112, 2726, -31585, -133398, -73461, -53292, -48571, -92043, -140571, -134509, -100270, -66787, -119117, -123136, -145863, -131478, -76501, -99096, -158660]
15910a58660n0758m5246m698O8565Q4364j5661q2341L7345J04749L4526r3625
15899a21440o6889l2111M8955M2429k3357J26946K3783n1532L9094L3883L3404
15888E3165J7414j04178M3627m115p1801K9669l8778J7370j2696p1604M6300J8048
15876g7579J0848R7052l766n3344Q429J6043J696o5573n3563p5911J12713J26757
15864D3802m5552j1131l641M2725O6777r1777j04092J918M9091O2098L0521l7564
15852C175l5440P1625M3734p1199j76674R8166M6091k4717o3838o7013l5550j1532
15840b23172N6930L2614P258M1819l4069l2695L1916J0449J14225j3193j6402
15829b4320j03449O3135K6471r5076J6850K2748k1561M2981O0431K4903m6943
$$ y = [-158660, -209418, -254664, -259362, -190797, -106433, -122094, -204435, -167090, -62341, -27815, -121440, -188329, -220440, -171485, -129056, -152413, -25467, -1684, -53216, -14122, 19761, 53165, 70579, -33599, 10028, 5913, -65888, -36219, -74997, -57627, -70323, -141927, -95627, -77579, -66731, 30321, 26555, -26789, -18360, -2317, -621, -66194, -119757, -195668, -82955, 43802, -1750, -12881, -16522, 26203, 92980, 1203, -102889, -100971, -51880, 10218, 40739, 3175, -32265, 39360, 83094, 11895, -164779, -66613, -20522, -45239, -109077, -176090, -211640, -223172, -166242, -133628, -126370, -84551, -118620, -151315, -119399, -108950, 5275, -7918, -24320, -127769, -64634, -38163, -133239, -116389, -93641, -115202, -72221, -11790, 13113, -33830]
15818c3830O0339j9865o5465l3679M4869j01842n4424o640R5359J175K2446p561
15806i9118m6466k3453l6947L39J7232Q217J8173M0442J37741M2312J9857p9630
15794a301o4431m9670N2457N8536m2941J5106K7161O1535j5551r640L043P180
15782D1484N0964k7203k31M1256J230o714m0656m9802j8048k3298j3509L858Q0655
15769C9986J4894q7859m1033L955J0608K7079r3830k2305L8472M581p180J18544
15757E912l2993l1785N0110j2550m0189m0258m3887k198N7657L1311%m1816N6681
15744d4005J0213q2453j08713L1670L6356j019P024P9597l0100j6997L7675p9892
15732a60644m3160R3655N4812P0579J503K259o4719l9252L3064J5391m8494p0431
$$ y = [-33830, 26509, 6644, -58821, -92500, -47631, -149473, -203897, -210537, -115178, -114003, -91557, -99118, -145584, -169037, -205984, -205645, -188413, -180196, -162023, -121581, 16160, 58472, 78329, -1301, -65732, -115402, -62945, -4409, -47350, -32244, -5083, 56452, 40901, 31261, 34304, 41484, 92448, 65245, 65014, 106270, 107500, 100786, 60130, 10328, -7720, -31018, -44527, -40669, 39986, 54880, -32979, -74012, -70057, -59449, -32370, -126200, -148505, -110033, -105452, -112632, 5912, -27081, -58866, -8756, -21306, -61495, -101753, -145640, -147838, -90181, -58870, -58870, -100686, -44005, -33792, -116245, -224958, -193288, -156932, -157951, -150927, -71330, -101430, -118427, -80752, -160644, -203804, -110149, -55337, 15242, 16745, 19004, -45715, -84967, -51903, -36512, -85006, -155437]
15720a55437J8872P2906K9759N7020J11923p3715q8746k1264Q5076j5694j13284
15709i2584r724L3212M8473J1365K4977K7563L556k3668m11l2707k5894m5863
15697h1705O3977K0615M55k0202q8957r1341L7195P3676n517M1163O6542m8731
15685c2830l5155L4713K05o345J4758l379K8611L8173N3577m1115r0683J0748
15673b8722L0763K1820p9705k3903M5281L762k9669L8300N1748K1445K6406m647
15661G2879p2960p1567J407p5277R57j7995q484j02922J9793p039J03100N3493
15649a04615m4568M277O6786J18045l4307n6705k8194k2904O2065J15663K8825
15638A04368j00237p2369Q23l5679M5987P7839M4256p00j22071l4826J3173q267
$$ y = [-155437, -136565, -63659, -33900, 23120, 135043, 61328, -27418, -48682, 36394, 20700, -92584, -102308, -69096, -20623, -9258, 15719, 43282, 46838, 23170, 22759, -9948, -35842, -81705, -17728, 2887, 3342, -16860, -105817, -197158, -159963, -86287, -91804, -50641, 15901, -32830, -67985, -33272, -33067, -39412, -24654, -28033, 578, 38751, 92328, 51213, -39470, -28722, 2041, 23861, -55844, -79747, -34466, -30704, -60373, -22073, 29675, 51120, 77526, 72879, -81, -71648, -70241, -145518, -144561, -162556, -171040, -273962, -254169, -261208, -158108, -104615, -149183, -144906, -78120, 39925, 5618, -51087, -79281, -102185, -40120, 75543, 104368, 4131, -68238, -67415, -103094, -57107, 20732, 64988, 64288, -57783, -92609, -79436, -87703]
15626h7703L6665J7432j7637q0335j14771L5475R8093P3359N4159Q373k7775j3066
15614a7731j05489m0363J7298Q6857j8066p7016N1508J16103Q6324j8652n9281
15603B1492j12788k0913M9327P8075M7594k5861k5960j24169j5877R2711l7266
15592g3635L147N5884K1646P087K6806m7169q6291n2183K8182N6275M2468j9457
15580c7240M2567L4044K8126r746J187K7198p1519j4183m6463q815K6043L0752
15568A951M4344L1601n6034j7641p5078j1896J15017l0589p7816P671M4013j9522
15556d3979L5386N197M894j892q1587M161m8752l8152N9368R2365L4067q7977
15544f6901J981j4369k1469L570N411J05661P5777L7367P728p2402K1745j06360
$$ y = [-87703, -51038, -33606, -51243, -131578, -246349, -210874, -112781, -39422, 14737, 23110, -4665, -17731, -123220, -163583, -146285, -59428, -77494, -154510, -103002, 13101, 99425, 80773, 21492, -91296, -112209, -62882, 15193, 62787, 36926, 10966, -113203, -129080, -36369, -73635, -70488, -14604, 7042, 14129, 40935, -6234, -92525, -144708, -116526, -60251, -17783, -37240, 5327, 39371, 67497, 57751, 58938, 86136, 14617, 434, -46029, -54844, -28801, 1951, 46295, 77896, 21862, 4221, -70857, -82753, 32264, 1675, -76141, -68470, -24457, -43979, -8593, -3396, 1498, -394, -81981, -77820, -126572, -164724, -105356, -12991, 21076, -66901, -64920, -79289, -100758, -97188, -91777, 13884, 89661, 127028, 134756, 62354, 84099, -22261]
15532b2261r4581m7011M5592R5518j9180m4065l621L3571R3192k4811j364K0017
15520C0996n444J4291k2486j6683J8568m110q0202J369n1634k2121o426j3719
15508a57601o6937P2973j2671P7905N7373m552j9706k0561m2837J391J06393l8045
15496d6875L32n314q9205r3856K7161N6469Q6954M1167N5621M6786m5524n2025
15484a8309n379K9250M1424K4036m2309k7302p5476K4049k5780o2552L016k581
15472a37913K9863R4878J2220o6381N2151J08790P0398r1284q9124n6819l413
15461g6634m3358m7483P3616K1837j5994l7894j668J3585j5196L3906J622o448
15449a00109J2282N4446K1001P6402P8840j9166p3399l3526l5482j4319L8552
$$ y = [-22261, -116842, -163853, -118261, -22743, -41923, -85988, -89609, -56038, 37154, 12343, 10979, 30996, 25552, 39843, 17357, 674, 19242, 15132, -65070, -63701, -115335, -137456, -143882, -157601, -224538, -151565, -164236, -86331, -28958, -33510, -53216, -73777, -116614, -115223, -8830, -46875, -46543, -51857, -141062, -234918, -207757, -151288, -64334, -23167, 32454, 79240, 33716, -18309, -23688, 5562, 46986, 71022, 28713, 1411, -74065, -50016, -75796, -138348, -135332, -137913, -108050, -13172, -952, -67333, -15182, 93608, 164006, 72722, -16402, -73221, -76634, -119992, -167475, -93859, -72022, -88016, -125910, -127578, -113993, -129189, -95283, -93661, -100109, -87827, -33381, -12380, 64022, 142862, 123696, 50297, 16771, -18711, -33030, 5522]
15438E522j2203l8422K3548Q0859j6480o8660Q1542l0150q5J4996p4682l2988
15426f7203M2412m8943M774M8630L5128N632M5095q068k9609k0166L9316n6851
15414i853p9167P4838R9471n921j40405k7551M7439k4384M232Q1430p5885N3188
15402b568K2971p5691m0541P3813P3554k7516n1948N9608P5744j5733K867Q8992
15390A83552O1846j24564o4265L0525l9495n1057j4631J1549J7939l809j6646
15379i056q3077j9630K8437J9757j6582M9446N4516K6163j8524J5142l5821k6405
15367a5634k718l072J05678o0331o5284p3314K760L9423K8915P09N1198L3860
15355D2190M2188N5177Q189o0055l4490P6402K0257p3540J1439j3232m807j9760
$$ y = [5522, -6681, -45103, -21555, 59304, 42824, -25836, 55706, 25556, 25471, 40467, -34215, -67203, -24791, -73734, -68960, -20330, 14798, 20430, 65525, 57457, 27848, 7682, 46998, -9853, -89020, -14182, 85289, 79368, -61037, -88588, -41149, -65533, -61301, 20129, -55756, -2568, 20403, -55288, -95829, -22016, 51538, 24022, -27926, 31682, 107426, 91693, 94560, 183552, 245398, 120834, 56569, 87094, 47599, -3458, -18089, -6540, 11399, 7590, -9056, -92133, -111763, -83326, -63569, -80151, -30705, 23811, 49974, 31450, 46592, 10771, -15634, -18352, -21424, 84254, 23923, -41361, -114675, -111915, -72492, -43577, -42868, 8330, 42190, 84378, 139555, 147744, 87689, 53199, 129601, 149858, 76318, 87757, 74525, 69718, 49958]
15343D9958m381p0278l0796O5222L9330p2596M2101N9184M0494r0660J8318M2875
15331H8771l1679k9536Q7914L2582J7219J1373q3165p2169P4627r145K3241j4596
15319I5437j7638R4633p746j8625o8301o7575J6815j7973j45013m6168J12464
15308f9690j6517n2764R8757O587j452q2689j5164K8237N4572J7524q8148m7317
15296a68064M2598k4758J748J22668O4251o8971k2342L698R4797l979K5598K1644
15284H8888o057M1065O6492j41757o7019O0651N2336K6416M0476l0762K1161l8231
15272A13659n0819n3555O5958R7440o0780o0913j7823J377L5108j03351K2107
15261a1592K4827M592J4368L1928l5798Q167N0031L4834j9657l1978R778k9862
$$ y = [49958, 45577, -24701, -55497, 9725, 49055, -23541, 18560, 77744, 118238, 27578, 45896, 88771, 57092, 27556, 115470, 148052, 165271, 176644, 93479, 21310, 95937, 86792, 110033, 95437, 77799, 172432, 164686, 146061, 77760, 10185, 27000, 9027, -135986, -182154, -69690, -86207, -138971, -40214, -33627, -35079, -117768, -132932, -104695, -50123, -32599, -120747, -168064, -125466, -150224, -148476, -25808, 38443, -30528, -52870, -49172, 45625, 41646, 67244, 88888, 82831, 123896, 190388, 48631, -18388, 42263, 94599, 121015, 161491, 130729, 151890, 113659, 62840, 9285, 75243, 172683, 111903, 50990, 33167, 34544, 69652, -33699, -11592, 13235, 17827, 32195, 64123, 28325, 36492, 86523, 121357, 101700, 69722, 79500, 49638]
15249D9638k9036L0527q428n090n9647j0510K8533l3619L8056Q51n4911n4095
15237a07731n2316J2892m2555O3537J16621l722J0488P6620M9384j23787q2115
15226h2684M3688J2264J5381l4974m3063j1496p9498R9316J19715j8423l7641
15215a7415n1302p554m8199J792l980O0121O8189N166k7942j9981o249j03270
15203a50624m6763L7512K4954N8935l1327J7861M200L3377N6270j093L0452n0839
15191a7085P4838p1099K8087M9246m2988m731J2825J0410m1260q0655K2854K8685
15179c0873L377l7711L00Q9008j6995l9328N9050N1573K1311n8392o8566L9021
15167A1775R2280M8594j3860p3556J2861M7583j9J8692p421l0265K7127L6242
$$ y = [49638, 20602, 51129, 42701, 37611, -22036, -32546, -4013, -37632, 424, 1275, -53636, -107731, -160047, -147155, -189710, -126173, -9552, -13274, -2786, 73834, 123218, -569, -82684, -38996, -26732, -11351, -46325, -89388, -100884, -180382, -81066, 38649, 20226, -17415, -68717, -76271, -124470, -122678, -126658, -66537, 1652, 6818, -21124, -41105, -47354, -150624, -197387, -159875, -134921, -75986, -107313, -89452, -85252, -51875, 4395, 3302, 33754, -17085, 57753, -13346, 14741, 63987, 20999, 16268, 29093, 39503, -1757, -82412, -59558, -30873, -27496, -65207, -64907, 24101, 7106, -32222, 26828, 78401, 99712, 41320, -27246, 11775, 104055, 152649, 138789, 65233, 78094, 125677, 125658, 144350, 136929, 106664, 133791, 170033]
15155A70033q3608j18710L8523N0458n5295O2278R9250m0538q5394L1972N5156
15144A24125O3340l6949k0647L5138j2342m7648q786m0677n2118k8130L2827o072
15132B061l3352j4125K4698m9876q5426J15536J05161N2692K7038m2774j5049
15121H6584p4808k369m101K6539J3313j7856l7561K5592K0100J6455j9513l5785
15109c410q180K8789m669k2193k4566o591J1852K7255J0798L2298L4907n3047
15097B3243k9481j6492j594O8132j08143q159J0962k1949L2998N7434l8178l3995
15085f5222j12774o9884Q1435R0382N8229j4586J4470m8363K3062O3484P2438
15074I2671k0040n628l2619l5858K1628K7132m0561n7819M6509N6780k8379J11625
$$ y = [170033, 86425, -32285, 6238, 56696, 1401, 63679, 162929, 122391, 36997, 68969, 124125, 187465, 150516, 129869, 165007, 152665, 105017, 96231, 55554, 3436, -24694, 8133, 2061, -31291, -45416, -20718, -70594, -156020, -40484, 64677, 117369, 144407, 101633, 86584, 11776, 9407, 5306, 31845, 45158, 27302, -10259, 15333, 35433, 51888, 32375, -3410, -11590, 17199, 12530, -9663, -34229, -40820, -28968, -1713, 9085, 41383, 76290, 23243, -6238, -22730, -24324, 43808, -64335, -72494, -61532, -83481, -50483, 6951, -31227, -65222, -177996, -247880, -166445, -76063, -17834, -32420, -17950, -66313, -43251, 20233, 92671, 72631, 67003, 34384, -1474, 20154, 47286, 6725, -51094, -4585, 52195, 23816, 135441]
15062A35441N4883k7952j6377m7897j8455J2554L4295o2800r2711l5672K9851
15051c4840l4185L1820J03124l6824L8426M4398K8008m8825l2202o725r664l25
15039D2186P0343k3014N1242J03703j3675j05453L3109o5295n6829Q1359M4173
15028A61849l5715n1322m6298l0748K8747N452j6979p005j5394M5424N4553l5167
15016E7397q6786q1973n4433L507J25623J43438O9104q2843r8271l7710j3446
15005e6393Q1587P8988q0731o0757k8132O5407J75112J41882O862j99858j58311
14994c4344o8750J9359Q9307j0786r1508J7084J45061R840L4497k3665r8730J3775
14982A140k6680J0410K2574L631l2185K9868O241o8702r8623K2195P1641N3505
$$ y = [135441, 190324, 162372, 145995, 98098, 79643, 92197, 126492, 63692, -29019, -64691, -34840, -69025, -37205, 65919, 29095, 67521, 111919, 139927, 91102, 58900, 52175, 42511, 42186, 112529, 89515, 140757, 244460, 230785, 125332, 158441, 93146, 36317, 117676, 161849, 126134, 74812, 28514, -2234, 26513, 31965, 14986, 7981, -7413, 38011, 92564, 57397, -29389, -111362, -165795, -162288, -36665, 106773, 175877, 93034, -5237, -42947, -56393, 25194, 104182, 23451, -37306, -65438, -31, 175081, 316963, 323825, 123967, -34344, -103094, -83735, 5572, -5214, -96722, -79638, 65423, 75263, 109760, 86095, -12635, 1140, -25540, -15130, 7444, 11075, -21110, 8758, 14999, -53703, -152326, -130131, -58490, -4985]
14970d985l5885m98M8708j5147k6977l0904J7903N6474K081J07243j0434o1375
14958D6204k9794n7994k6974K1185J972m3418j9347L1816Q567q4828j7758L5539
14946a34830J23281M8565j8362j23537q615K5279J3867k4083M182L6739M3168
14935a4346O926K2484N1959q0051p4614K5420O8611R575k8728L4112l1496n9366
14923f9514k7836M5309L800K5131J10739J2598L0056L8176j8080m5291m4018m0400
14911B0670k2544Q6274q6583l5975K7197O4395j7446p6579j1445o238L2323L62
14899b5589o4792l3557K9412Q7848O3267O086m7895j21119q3841N0085Q4736k4211
14887g9570n0589N0978R2008J0718k2650P6820J17575m7700q4618j07584L0600
$$ y = [-4985, -40870, -41368, 7340, -7807, -34784, -65688, -47785, 8689, 10770, 118013, 107579, 46204, 16410, -41584, -68558, -47373, -45401, -88819, -108166, -76350, -67783, -152611, -170369, -134830, -11549, 37016, 18654, -104883, -113498, -88219, -74352, -98435, -94253, -57514, -14346, -7420, 15064, 67023, -13028, -87642, -62222, 6389, 15964, -12764, 21348, -10148, -69514, -97350, -52041, -48241, -23110, 87629, 100227, 130283, 168459, 150379, 105088, 61070, 20670, -1874, 84400, -2183, -38158, -10961, 53434, 35988, -40591, -52036, -58274, -25951, -25589, -90381, -123938, -94526, -6678, 56589, 62675, 14780, -106339, -190180, -140095, -55359, -79570, -130159, -79181, 12827, 23545, 895, 77715, 195290, 147590, 62972, -44612, -14012]
14876a4012P6759l6851m0697k3118L7760L1817L343m6240j7213j0751l65k341
14864d1909O5294o1523l7512P0045K7795N8032K0920j5835N9776l2324j484j3132
14852I8143l6031o4859m486M5656J2154o4510O0138J04492j38861r365J092L7992
14840D1555J271M0879J13123J2958p4318j0596K7408J11N4725L483q5949r0122
14828C4528p1090L8166O5772O3405R664j5725J8826j02716p2879J8528j0668m2713
14816f6902R9384M058K1592P0537M4265j0923l6009K7960K0662j4741m2861m9357
14804F7665m9069Q8769J7016m4398n8697k3315K019L8244j0488n6793L76M1996
14792A3325n0996q6888O3969M6551O1291l5254k4914L8669N9646N4441L9345l3726
$$ y = [-14012, 62747, 25896, -14801, -37919, -159, 31658, 35001, -11239, -28452, -39203, -39568, -41909, 23385, -38138, -75650, -5605, 22190, 80222, 101142, 85307, 145083, 112759, 111275, 98143, 62112, -2747, -7233, 38423, 50577, -13933, 46205, 150697, 11836, 2471, 3563, 41555, 42826, 83705, 196828, 209786, 135468, 124872, 152280, 152391, 207116, 210599, 124650, 34528, -36562, 1604, 67376, 130781, 140445, 124720, 143546, 40830, -32049, -13521, -24189, -66902, 32482, 36540, 58132, 128669, 172934, 162011, 126002, 153962, 174624, 159883, 117022, 67665, 18596, 107365, 124381, 79983, 21286, -2029, -10, 38234, 27746, -29047, -28671, 13325, -37671, -124559, -60590, -14039, 47252, 11998, -12916, 25753, 85399, 139840, 179185, 145459]
14780A45459k1076L4291j6413k5884P8666m1538r4910p9143R2105M4020J2367
14769A27944l2398l229O9025N0046O6341m635o2020j1160j6061l2929M3272L0412
14757B24608J3115J2998l0957n6310l0672O615N8404r4600j80723L0841K8912
14746a7769r5345M0477J00871J07606P6785J0577L4626r4920j06626K4262L806
14735H4350j38173n5643P14P178M7485R4116K7911l6047j8042L8747N9099K7479
14723A39174l4010p1603j8749l3230M751n3683M4864M2405k4793j13334j06226
14712b24434l3471N3211J02776K9986j1049J3990J6708L9954P3455L7387j61944
14701f3431m8699Q6147P3185L3311o9149o739L8003P0072l6644q1649J1403N877
$$ y = [145459, 124383, 158674, 142261, 116377, 195043, 153505, 58595, -20548, 71557, 115577, 127944, 95546, 92317, 161342, 211388, 277729, 273094, 211074, 199914, 183853, 150924, 194196, 224608, 237723, 250721, 219764, 163454, 132782, 139397, 197801, 103201, -77522, -46681, -17769, -113114, -72637, 28234, 135840, 212625, 223202, 257828, 162908, 56282, 80544, 84350, -53823, -109466, -108752, -101574, -54089, 40027, 67938, 31891, 13849, 52596, 111695, 139174, 105164, 33561, 14812, -18418, -13667, -67350, -22486, 19919, -4874, -118208, -224434, -257905, -204694, -101918, -71932, -82981, -68991, -52283, -12329, 61126, 98513, -63431, -112130, -25983, 47202, 80513, 11364, 4625, 42628, 112700, 76056, -5593, 5810, 11687]
14689A1687K7158n045l867J7623r096L8616N2305r9170j844L5970k0323R262M555
14676E7831n5279N9476L698M929o643l6368K3001k7134p2574L924L9688N1476
14664D6025N7737n7906l6818j29001k3265L8687N8983P27k7028m4398Q105J7761
14652i0391J7620M6035m1558n5574o4238l9101J22385M5478L2937P8259K5611
14641G7463J310o2010q1357l7701o1694J3074p3425q0799J18629J99704R9863
14630A13057k6045o2040q890l0558O3513J9785P7440r7207j37493N701l3974K0314
14618i6397k9216O3730J78126J6966q7686n0799j2625j8030K7457N3201j0036
14607C4691p6796m6704J6090k7069k2328m50l1194Q1295J7046k6121k9693M4282
$$ y = [11687, 38845, 33800, 29933, 47556, 38460, 77076, 129381, 30211, 28367, 64337, 44014, 53276, 57831, 2552, 62028, 65726, 70655, 64012, 27644, 50645, 23511, -49063, -45139, -5451, 46025, 103762, 45856, 9038, -119963, -143228, -104541, -45558, -44831, -71859, -116257, -108152, -90391, -72771, -26736, -68294, -123868, -188106, -227207, -104822, -59344, -26407, 51852, 77463, 78773, 16763, -64594, -102295, -163989, -150915, -224340, -305139, -186510, 13194, 113057, 87012, 24972, 16082, -14476, 49037, 68822, 146262, 49055, -88438, -82737, -116711, -96397, -125613, -61883, 116243, 133209, 45523, -5276, -17901, -35931, -8474, 44727, 34691, -42105, -88809, -72719, -99788, -122116, -122566, -153760, -72465, -55419, -81540, -111233, -66951]
14595f6951N7973p708l8863n9770J4549P3791r0156l2487N2159J2348n7489l1732
14583a74336L0199M5042l8364J7932M8369o81L1351P1492o148j1373o8103m9620
14571a04240k8812Q3941N5699o928l2138M6088P9550k0448j27522m1197K3485
14560g2522O3126K6525M7956P0611J5431o619l7029M4042L5786k9630m2779l9385
14548G5513K6866N7493j4733q2721r8051K5643P092J6615M0603J4333N0525l5364
14536H3814q9040k5488L1961J11008M6724n3227j427L4793j8557L0656P890l9129
14524A19978o3986M3737M2051M9117O4748l2468k0183q9330j6904J05498J7507
14513B19765j22714j4970l6534k5358O6938K6404J7467R788j1237k1581P6038
$$ y = [-66951, -8978, -16686, -55549, -115319, -100770, -26979, -117135, -149622, -97463, -85115, -142604, -174336, -144137, -99095, -137459, -119527, -71158, -71839, -40488, 31004, 24856, 13483, -54620, -104240, -133052, -49111, 6588, -340, -32478, 13610, 93160, 72712, -54810, -96007, -72522, -9396, 17129, 65085, 135696, 151127, 144508, 107479, 151521, 187307, 157677, 114898, 75513, 102379, 159872, 145139, 62418, -35633, -9990, -2898, 13717, 54320, 68653, 119178, 83814, -5226, -30714, 1247, 112255, 158979, 105752, 104325, 139118, 120561, 151217, 159107, 119978, 55992, 99729, 141780, 190897, 255645, 223177, 202994, 113664, 96760, 202258, 219765, 97051, 82081, 45547, 20189, 87127, 113531, 130998, 140786, 129549, 107968, 184006]
14502A84006q4668k7891N1578R1020m3192q928N387K8070l1681J4773j6034L0372
14490A92812Q9058l3133j11643q5577p5046K0545Q8381N8041l3763P999J625L6334
14478A55633m9812o5798J22225Q709L3854j8823o9355M694j8233K8816q1081o6829
14466a6000k027P9017P233N2821P6793l2803j03128l4990N1615L4722O7779p1212
14454A09820j4847N9l8332J5295L6003J0590l2217J2150j7052k7170o5426o8183
14442g9310Q8768P7758r213L9393L777M1781k6188n7545q0265o4206K703R4993
14430C2446k7074P403l9146M282r602l1129N5457Q1633l6217m6962q6146P3295
14418b1760O2134k762R002L0218R1072K0632o3802l8641k5849R113O971N155l7019
$$ y = [184006, 99338, 71447, 123025, 214045, 170853, 161925, 167312, 195382, 163701, 178474, 162440, 192812, 281870, 248737, 137094, 51517, -23529, -2984, 85397, 143438, 109675, 117674, 119299, 155633, 105821, 40023, 162248, 170957, 204811, 185988, 116633, 121327, 103094, 131910, 50829, -16000, -18027, 60990, 68223, 121044, 197837, 165034, 61906, 26916, 78531, 113253, 181032, 109820, 94973, 95032, 56700, 71995, 107998, 118588, 86371, 98521, 81469, 54299, -11127, -79310, 9458, 87216, 78003, 117396, 121173, 162954, 136766, 79221, -1044, -65250, -62547, 32446, 5372, 12775, -26371, -22089, -31691, -62820, -7363, 74270, 38053, -8909, -95055, -21760, 40374, 37612, 46614, 76832, 167904, 188536, 124734, 86093, 60244, 69357, 76328, 81483, 44464]
14405D4464n005j0190N8105n7740o5024J21418O4909o8275j9486K8673n5675k137
14393C4037m0440P7545j2115k3497R473K2394J4251k6765O6930r827j02352r641
14381gJ7247K5047K319j7518L8085M6376k9491P595m2842k9731k0729J08947q008
14368I7290L6258j3652m6297m52j4425m8255R434p3532l6228n4957n171J0723
14356a39264Q837M5039R0399K4827N8866O6492o7549m8625q8337k0989N9675M2099
14344C1470J301l4141N7748K3375j7821n334l964j2217r6975n3502M3346L3731
14332c2983Q899n4264K0418j1590k195M3368m145j8701l7255J6912k6030L181
14320i4385j8465L3706L9939o9555P6645P5808M4148j02754l1836l1397R8065
$$ y = [44464, 39459, 29269, 87374, 29634, -35390, 86028, 150937, 82662, 63176, 91849, 36174, 34037, -6403, 71142, 59027, 35530, 45003, 67397, 81648, 54883, 121813, 111986, 9634, -7, 17240, 42287, 44606, 27088, 65173, 111549, 82058, 89653, 46811, 17080, -3649, 105298, 97290, 133548, 119896, 73599, 73147, 58722, 10467, 19901, -53631, -89859, -144816, -149987, -139264, -130427, -85388, 5011, 29838, 88704, 155196, 87647, 39022, -49315, -70304, -10629, 31470, 32771, -1370, 56378, 79753, 61932, 56598, 52634, 40417, -56558, -110060, -66714, -32983, -24084, -78348, -57930, -69520, -71715, -28347, -32492, -51193, -88448, -71536, -97566, -94385, -112850, -79144, -39205, -108760, -32115, 43693, 87841, -14913, -46749, -78146, 19919]
14309A9919P8371J0979L864Q093m8903q727j4332K1978M9804k3176n1779j1974
14297C4117j381l3864m83m6478P6639N1586j0621N894L262p5852R789L3639P2265
14284A18512J52857J2971l3253n2328j36676l0242Q2364L3932L4107K8850L0372
14273B41466m827J7417L912l6744l2357p2335J3832n2452l5735J3136M1804R2884
14261A90001O9294M075k5063p6932n4939Q2141k0534K501j40762k01621q7174
14250b59013N377M9274j1618Q8834M9210k7456m5184N2824Q6943J05167J3036
14239A07394k1368q6680K7282P5550R964j4522m7050l5062M8579J4871n3671L0832
14227E6119L2089K0819L2611m0383j2903m0812q5981P8410l5233L4629N7022k1809
$$ y = [19919, 98290, 109269, 113133, 121226, 72323, 63596, 49264, 71242, 121046, 97870, 46091, 34117, 32736, -1128, -1611, -48089, 28550, 80136, 69515, 75409, 78671, 2819, 12608, 46247, 118512, 271369, 284340, 251087, 198759, 62083, 31841, 114205, 148137, 182244, 211094, 241466, 236639, 254056, 257968, 221224, 188867, 116532, 130364, 77912, 42177, 55313, 97117, 190001, 259295, 263370, 238307, 161375, 106436, 188577, 168043, 170544, 29782, -171839, -259013, -253636, -204362, -215980, -127146, -77936, -105392, -150576, -97752, -10809, 94358, 107394, 86026, -654, 26628, 102178, 112142, 97620, 50570, 15508, 64087, 78958, 25287, 56119, 88208, 109027, 141638, 101255, 88352, 47540, -38441, 39969, 4736, 39365, 96387, 74578]
14215G4578O47K2642M1059L7219n8583k3124l7313O831O637n1517m1903j31137
14203a53964K9504Q3701N6295j215m3278J6025l8866l6171k5186k2221O2679N3327
14191a9370J2385J2695m3305J9236M0706M5668j6189j6833L962R375m3920l25
14179D085J3927K2592O0979j5361o9711j3885K7769M4606m0130l5504j7849O4903
14167D6421k5386J3698M9221k7076k7618j4528r457k5742M2632j1389L8418P0439
14155A19633m1795n9613L364N1295N8811n5989l0509l0812O94N0319J9286o7426
14143A7258L5508P0255L7463l6407K248o2929j4881N2969n4634J6388M8220l6213
14131G5245M855m948K5381q334j12558k1804l6721K9650L7567M092l160J7373
$$ y = [74578, 75225, 97867, 138926, 176145, 117562, 94438, 57125, 63956, 70593, 19076, -22827, -153964, -124460, -40759, 15536, 14321, -28957, -12932, -51798, -87969, -113155, -135376, -72697, -19370, -6985, 5710, -37595, -18359, 22347, 68015, 51826, 34993, 38955, 48330, 4410, 4085, 18012, 40604, 101583, 86222, 16511, 2626, 30395, 75001, 34871, -633, -18482, 46421, 21035, 34733, 83954, 56878, 29260, 14732, 5275, -20467, 22165, 10776, 49194, 119633, 77838, 18225, 21589, 72884, 131695, 75706, 45197, 14385, 15079, 65398, 84684, 17258, 52766, 123021, 160484, 124077, 126325, 63396, 48515, 101484, 46850, 63238, 111458, 75245, 80100, 75152, 100533, 92199, -20359, -42163, -78884, -49234, -11667, -7575, -10735, 6638]
14119F638K2787N3239k0111r4389k3852P1482N6853N2094R6796l3396o0499j4119
14107A13523M8616q9016n4784J10580m3918n8181r3547l5003Q5783J743k2355
14096c6559l6787l6263M3731N4612p6084l0067J09219R7450k8091J1392p0178
14085B375j2290J9417J7375l0287K2316P5951N4358Q2457m2662j14903o2353m9782
14073c8028k3418J3635M1165o5696l5944O0402k5920j3056k62J34124J35605k705
14061A79902r0889n3098J72419L9663j13863k6797n2983j8483l2676K876M018
14050A0089M0390J0973k73l2478O3529L90l1063Q4517o6760q1719q7340n292J39664
14037D4627k525m4197j403N8903m110L3399k2918p135m877k2572J9126J7964J5470
$$ y = [6638, 29425, 82664, 62553, -31836, -55688, 15794, 72647, 124741, 221537, 188141, 127642, 113523, 162139, 73123, 18339, 128919, 85001, 26820, -66727, -101730, -15947, -14204, -36559, -73346, -109609, -65878, -11266, -87350, -117417, -8198, 89252, 61161, 72553, 2375, -9915, 9502, 26877, -3410, 18906, 94857, 149215, 231672, 189010, 74107, 11754, -38028, -61446, -47811, -6646, -72342, -108286, -47884, -73804, -86860, -87122, 47002, 182607, 179902, 89013, 35915, 208334, 247997, 134134, 107337, 54354, 35871, 3195, 6071, 10089, 50479, 61452, 61179, 28701, 92230, 92620, 61557, 146074, 79314, -2405, -89745, -95037, 44627, 42102, -2095, -3498, 55405, 51295, 84694, 61776, 54641, 49764, 27192, 46318, 64282, 79752]
14024G9752L6808J9907N006K6456M6727n8417p7893j49081k8172K476m8955J04613
14012d0773J48262M2789P5049j37020j50962N1609J3391k4696k9216k3996L1263
14001d4300P6960P1283M7961L1216j20071j09232k1939Q5455P8084K7961m499
13990A18879J645m9359q1252l3770L8622M1299L0354N6923J04917L5854l6780
13979B27332k0214O436j27375j49431M1996O6264O6468L8787o309L295p311k5880
13967A14058o3794K111K4494j693O8047l9567l9202k3749J2646m5927p5591p1853
13955a40020M3745J3380n598L6628M5709K707n3296O0126o0333j14161o8881M7051
13943a92943J16792m273K65j8633J2596Q4657J3755m5619P271L337L6057n802
$$ y = [79752, 116560, 136467, 141473, 167929, 214656, 156239, 78346, -70735, -98907, -96431, -145386, -40773, 107489, 150278, 225327, 88307, -62655, -11046, 2345, -22351, -51567, -75563, -44300, 32660, 103943, 151904, 183120, 63049, -46183, -68122, 17333, 95417, 123378, 118879, 120524, 71165, -10087, -43857, -5235, 36064, 66418, 123341, 228258, 264112, 227332, 207118, 213554, 86179, -63252, -21256, 45008, 111476, 150263, 143954, 147249, 139938, 114058, 50264, 52375, 76869, 75176, 143223, 103656, 64454, 40705, 53351, 7424, -68167, -140020, -96275, -82895, -88493, -51865, -6156, -3449, -56745, 3381, -56952, -171113, -239994, -192943, -76151, -80424, -80159, -98792, -86196, -1539, 12216, -33403, -26132, -22795, 13262, 7460]
13931G460J3814R650q1642k3400J3030N4567Q6259R391m0228m9855R10O3175O7442
13918A30573q1K4356q1313O5182P060o0963L1625j4250n0445k2994P5480N8270
13906A62500L1671R5596M3040n5396j08059r6428j13472J06383L2556k9928j4502
13895E3961M4930k3342r2112j47634M586Q4106J2258K3137M6131K758j0008K448
13883A219N0086Q8638k2382r1530j64981j311j2856P0430P1458J22908j4873o2358
13871C4448j8865n9132o787K1619r3802J6915Q8976r015J879J1032p210j6249
13859c6191M2794P1775K5847k7012j4342j1106L9200p626K5408J5407n8344p7648
13847a1838l9503J13081n4495j07686J2360J01620j4140m5290l0973j6042n3773
$$ y = [7460, 21274, 30924, -50718, -74118, -61088, -6521, 79738, 89129, 48901, -954, -44, 63131, 130573, 130492, 154848, 73535, 138717, 145777, 84814, 116439, 102189, 51744, 28750, 104230, 162500, 194171, 289767, 332807, 277411, 169352, 72924, -40548, 65835, 98391, 68463, 53961, 98891, 75549, -16563, -164197, -159611, -75505, -63247, -40110, 6021, 8779, -1229, 1219, 51305, 139943, 117561, 26031, -138950, -140261, -153117, -82687, -11229, 111679, 96806, 34448, 15583, -43549, -50336, -28717, -122519, -105604, -16628, -25643, -23764, -12732, -19942, -36191, 6603, 78378, 104225, 77213, 62871, 51765, 90965, 83339, 108747, 124154, 65810, -11838, -51341, 61740, 7245, -100441, -88081, 13539, -601, -45891, -76864, -92906, -146679]
13836a46679M2262P8779M6518L9053q6760O165P493M0346k9982m4776o5996K3819
13824h9758m5871l5431J23101J53836k6425m0573p3609r8924j5596N5036Q2297
13813a1917L5453K42n3219j14267m6581M6442O8288k4116L9928P8921R8575M587
13801A22336n0945q4551P5087L4368j12572L9509M5376K5259p1857J0759j1097
13790B1672o3495N4009P8619n2313p5661Q1060L3930J1752k5067L2583j9154L4570
13778A12505o6237n2040k458l8376m555o982O0772J557J3529L2609J02707R950
13766A62981l7385p2311m166k4277l7576L0503K3028N7478k0992q1426q1667n3040
13754a38850J21321J2906r5114N2301J42408R3892r0683j2939P0080j1751r1888
$$ y = [-146679, -104417, -25638, 20880, 59933, -26827, -20662, -13169, 27177, -2805, -47581, -113577, -89758, -135629, -171060, -47959, 105877, 79452, 38879, -34730, -133654, -149250, -94214, -11917, 23536, 23778, -29441, -143708, -190289, -143847, -75559, -99675, -59747, 19174, 117749, 122336, 71391, -13160, 61927, 96295, -16277, 23232, 68608, 93867, 22010, 32769, 21672, -41823, 12186, 90805, 38492, -37169, 43891, 77821, 89573, 64506, 97089, 77935, 112505, 46268, -5772, -8230, -46606, -51161, -58143, 2629, 4186, 17715, 50324, 153031, 162981, 125596, 53285, 49119, 24842, -12734, 17769, 40797, 98275, 77283, -4143, -85810, -138850, -17529, -4623, -99737, -47436, 94972, 188864, 98181, 85242, 155322, 143571, 51683]
13743E1683q6628L9697K7526R2903k5905r39j2389o7935k849l2756R065J06425
13731I7898L7452j02198j018R7912k149J8735p9452p1740l9867n1066J8995J1356
13719f5142N9681R0814J0516K7146J6199k4576m3738k6161K5246K4912n2414j01642
13707e9159J3898Q2482N6765o9475l7935k3765q8233L2788O7212m0095k1857j0479
13695i7853M5601O6382j5355n9149j4817O8857o6q971K0012L3112N8249m3108
13683E2894o5580M2886M2751M9174l8392l998p4114K7143J23945j5178j563L2431
13671A72399K965k5886j2917p6641n7625o1554N9602J01859N5983j0464j5062
13660A32659j65027o6482J2581J06825M6841n3377K611L1099K8555m3186p7820
$$ y = [51683, -34945, 4752, 32278, 125181, 99276, 98337, 85948, 18013, 15164, -17592, -8527, 97898, 135350, 33152, 32134, 130046, 127897, 146632, 67180, -4560, -44427, -95493, -76498, -65142, -5461, 85353, 95869, 123015, 139214, 114638, 70900, 44739, 69985, 94897, 42483, -59159, -45261, 37221, 93986, 24511, -13424, -37189, -125422, -92634, -25422, -65517, -87374, -97853, -52252, 14130, -1225, -60374, -75191, -6334, -6400, -15371, 4641, 37753, 96002, 52894, -12686, 30200, 72951, 122125, 83733, 79735, 5621, 32764, 156709, 141531, 139968, 172399, 175364, 149478, 136561, 59920, 2295, -59259, 343, 102202, 158185, 147721, 132659, -32368, -98850, -86269, 20556, 67397, 14020, 16631, 47730, 76285, 33099, -44721]
13649d4721J1100j768l2501Q4564M5099K7157L0847l1268m6126N5837m9688m6547
13637A985l1504K0262O936l7482Q9506n7010r3545L8285N9231j2139N391k5617
13625c5701M256k452M4364L8537q1285j0951K7415P0730j280M422O6895l8314
13613H6636K3306o7574J7775N2691m9037o7261J3514Q4139m9685j26733j813K6349
13601e7693M348m3483j7613N7593l0945L4959P5217J07946N7026m4768j42653
13590f6j6018m0325o2343p7471L5294M9643N9215O1376l1540l3696L942p4530
13578a26519K5759M7222J6513J634P4166L6387M0108J9863J0373O10r203o8096
13566F8817k6645k1373L7432J448o0819l7120j3017m4313K0169N5606M3432L0341
$$ y = [-44721, -33621, -35389, -67890, 16674, 61773, 88930, 119777, 88509, 42383, 98220, 48532, 1985, -29519, -9257, -2321, -39803, 49703, -7307, -100852, -62567, -3336, -15475, -10084, -35701, -31445, -33897, 10467, 49004, -32281, -43232, -15817, 54913, 53633, 58055, 124950, 86636, 109942, 42368, 60143, 112834, 63797, -3464, 10050, 94189, 44504, -82229, -84042, -57693, -53345, -96828, -114441, -56848, -87793, -52834, 22383, 130329, 187355, 142587, -66, -16084, -56409, -118752, -196223, -160929, -111286, -52071, 9305, -22235, -55931, -51989, -126519, -100760, -53538, -37025, -35391, 38775, 75162, 115270, 135133, 145506, 146116, 136913, 68817, 42172, 20799, 58231, 59679, -1140, -38260, -51277, -95590, -75421, -19815, 23617, 53958]
13554E3958n3615o042q292Q0938O0906J1485N3489l232p2577j20101n0206O3281
13542I992k7440j0230J10179L3873N48j487K1645o9368p846K1430p6251r7050
13530i2005J4461P0611K0502P6987O7721l6700p4360j10701l7618M1520k553K1282
13518d0853K48K2382m0854M1038R6642l8786j5105o107m8646n9595l6350j8775
13506a44761J341J5234J15409L2211m6369l2383M2166N49J422L7043J06518K822
13494A31202k9663K2208p4292n5952k4268l4825K0548P7661l8724m7758O12J0022
13482d3229l4645R9554N7925k3860m0334o9599m0129L7172M407L3708O2462N6066
13470I9498q1871J5684l6083K3899R721o9774M3845j0272l2160M1745N1718J9008
$$ y = [53958, 343, -5699, -13991, 66947, 127853, 139338, 192827, 189595, 117018, -3083, -53289, 9992, -17448, -27678, 82501, 116374, 116922, 115435, 137080, 67712, 59866, 81296, 5045, -92005, -77544, -6933, 13569, 90556, 158277, 121577, 47217, -63484, -101102, -59582, -62135, -40853, -40605, -18223, -59077, -18039, 78603, 39817, 24712, 18605, -30041, -89636, -125986, -144761, -143420, -128186, -12777, 19434, -26935, -59318, -17152, -16603, -15181, 21862, 128380, 131202, 101539, 123747, 49455, -6497, -30765, -65590, -45042, 32619, -6105, -53863, -53251, -43229, -77874, 21680, 79605, 55745, 15411, -54188, -94317, -57145, -52738, -19030, 43432, 99498, 17627, 33311, -2772, 21127, 30848, -38926, 4919, -5353, -37513, 4232, 55950, 74958]
13458G4958N0714j10477r4464l173K6645K9752l1521M6724M5324o8284K695r322
13446d0429J5721K2180J0693N7185Q6159j2804j3238p2473M0845J4666r3239O2443
13434G7709M5525l9255p7722l855K917P6830J2843o6211o8497j7999J1336L147
13422d3232r176J2970O7607P4311P3380m4015p0871k0324o1282j0574P0974k5537
13410A4231M5302r0997O4710N372n9832J5851K4973J06479O1628j2912r7730K2270
13398I9345M7413K3864J6996m8029k9380o4778L0086J34927o0889j29008m359
13387A6188l0045j40648M3311J05570J2866R2397N2135N543k8344l7295N9898
13376A51576M6222k4745o4452o0645J704q2001M0722N9557k8897n804P2747K9459
$$ y = [74958, 125672, 15195, -79269, -82442, -55797, -26045, -57566, -10842, 34482, -33802, -31107, -40429, -24708, -2528, 8165, 65350, 151509, 138705, 125467, 52994, 93839, 108505, 15266, 77709, 123234, 83979, 6257, 2402, 5319, 82149, 94992, 28781, -39716, -57715, -46379, -43232, -52408, -39438, 28169, 102480, 175860, 131845, 60974, 40650, -20632, -31206, 39768, 14231, 59533, -31464, 33246, 38618, -21214, -5363, 19610, 126089, 187717, 174805, 77075, 99345, 146758, 170622, 187618, 139589, 110209, 45431, 75517, 210444, 149555, 20547, 16188, -13857, -154505, -111194, -5624, 7242, 99639, 151774, 157317, 128973, 91678, 151576, 197798, 173053, 108601, 47956, 49660, -32341, 8381, 67938, 39041, 33237, 105984, 135443]
13364A35443j13605N2949J23623j9698j07174L0631J0631K6863K8909K380M7303
13353B18255m4078l7849M4621p8844j32950p954K2010R8067q17j4098Q1343J30978
13341B78684J9309o8924o0855j4058n2195N552O9807k7815j11591k8978P1474
13330H0410O7964j3375J3133L1601l3690L996J445M7918m168l4678J4097j972
13318A72681o2815N9379k984r585k4170J5257k2406Q5998J9221k1497k0862K3478
13306B11695O9942J9662o0181L7144O3461K2133r3736n4155k538n879j5353j01542
13294I0653n654o2646Q149N4242J32566k1475q2236r544J3566M6071P4364O417
13282B44473r5491j9404K0980M1414Q7610O5332J0803R399l7061k9974o6295k2360
$$ y = [135443, 21838, 74787, 198410, 178712, 71538, 102169, 112800, 139663, 168572, 170952, 218255, 174177, 136328, 180949, 102105, -30845, -38799, -16789, 81278, 80461, 66363, 147706, 278684, 297993, 229069, 168214, 154156, 101961, 107513, 177320, 149505, 37914, 8936, 80410, 148374, 134999, 148132, 179733, 146043, 150039, 151484, 199402, 195234, 160556, 174653, 172681, 109866, 169245, 166261, 156676, 132506, 147763, 125357, 211355, 230576, 209079, 188217, 211695, 281637, 301299, 241118, 278262, 341723, 363856, 270120, 215965, 213427, 207548, 192195, 90653, 84999, 22353, 30502, 84744, 217310, 195835, 113599, 104055, 117621, 163692, 238056, 244473, 148982, 129578, 150558, 191972, 279582, 344914, 355717, 365116, 328055, 298081, 231786, 209426]
13270B09426P5902O4853m8046K051L1769j9266K908M1512o1063j11648l3200N3850
13258B09048o890N6406J22797o3048j16447l589L0572l5600J9428l9133o4259
13247A09285l6873m3104J099N5645J8915N8707q669l86Q146n2658k6807Q868O2700
13234A54868M2790k05J6688n17j3489q2317l8768r2883R1668N3536j8435n76P8777
13221A91137k4225p407J0350M9917L5874o3410K3932L7582l555M3086J6277J4371
13209C23929j20092j08902m0808p502l2432J01797N9240N8289J07648q054j02092
13198B31021L3920Q8386r611p0785j0492M7442N3431k3214O6064J01317O7016
13187E74495R4997R0825L6723P6986K64163L17812L8652q3005j10615j03207j75535
$$ y = [209426, 285328, 350181, 302135, 304186, 335955, 316689, 319597, 361109, 300046, 188398, 155198, 209048, 202158, 258564, 381361, 318313, 201866, 198277, 228849, 193249, 212677, 173544, 109285, 72412, 29308, 30407, 86052, 104967, 163674, 155005, 154619, 162765, 110107, 83300, 92168, 154868, 197658, 197453, 214141, 213624, 200135, 117818, 79050, -13833, 77835, 131371, 112936, 112360, 191137, 166912, 159505, 169855, 219772, 255646, 192236, 216168, 253750, 250195, 293281, 309558, 323929, 203837, 94935, 54127, 46625, 14193, 115990, 175230, 233519, 341167, 333113, 231021, 264941, 353327, 343716, 272931, 262439, 309881, 363312, 340098, 406162, 507479, 574495, 669492, 760317, 797040, 874026, 1138189, 1456001, 1494653, 1411648, 1301033, 1197826, 1022291]
13176A022291r7204j09787n4145p1517P9989l5446n0399J0725N875j8276p7556
13165F04550K358K0136R7682M5921M9414J35876P022K7339J22518J35945M8881
13154A297642M9428Q0578Q4290J01938J5761l6932l4720r3201j47254j41346o2118
13143A114066o2240r5896L411k1434j18528K0191M8181j3687K526o3673o1740
13132G51177L6828J02917q3512q5923K0783p7061q7850M2997R3458P1328J78358
13121I63500K22870K00030P8376k247r9684k04243j16509p4393o3566j73023j73300
13110E57811p7083r1698J7658N2705k5279m5939o2826l6601J06665M0963j11103
13099C25273q2281L6443J15892o314o6767j05341k7225M1572l9105L4457J10371
$$ y = [1022291, 925087, 815300, 761155, 689638, 769627, 734181, 683782, 694507, 700382, 682106, 604550, 606908, 627044, 724726, 770647, 820061, 955937, 962959, 990298, 1112816, 1248761, 1297642, 1347070, 1427648, 1511938, 1613876, 1629637, 1592705, 1557985, 1464784, 1317530, 1176184, 1114066, 1051826, 955930, 959341, 937907, 819379, 839570, 887751, 874064, 876590, 812917, 751177, 788005, 890922, 807410, 721487, 742270, 665209, 577359, 620356, 713814, 785142, 963500, 1186370, 1386400, 1464776, 1462529, 1362845, 1158602, 1042093, 967700, 904134, 731111, 557811, 480728, 389030, 406688, 459393, 434114, 388175, 325349, 288748, 395413, 436376, 325273, 242992, 279435, 395327, 389013, 322246, 216905, 189680, 231252, 192147, 226604, 336975]
13088C36975K9753n8308k3877p0675q8609j2295m0028k0139J31185P3107J224
13077B58313M9509P43J8190q9036J531K4268P565m9413n3779k5287R424L6128
13065A88156l250Q0656k8499k3628K82J4544n2122n7714R291L4554O7114o120
13053B23264k0055n7463m1028n6828q704P9649M0478j7686M8232M2788q1334J0074
13041A61387J8503p4547j2222M8880O277P5370N6302L4817o832o6528N156N0814
13029B97377j3008P8496K4525r9977j16919r765J4682l44P5037J0223j13134k4373
13017A22820N1849j5055O917N504L8875R3297q6656l9430M6422K575j4229J7055
13005B29944P5370J1291m4530p8438n34k6644j3961m6874J8154k4709M2605N7975
$$ y = [336975, 366728, 308420, 284543, 213868, 125259, 112964, 72936, 52797, 183982, 257089, 258313, 307822, 308565, 326755, 237719, 239250, 263518, 271083, 221670, 167891, 142604, 152028, 188156, 184906, 265562, 237063, 213435, 213717, 228261, 176139, 118425, 127716, 162270, 229384, 223264, 203209, 145746, 104718, 47890, 39186, 118835, 159313, 141627, 189859, 232647, 151313, 161387, 179890, 105343, 93121, 142001, 148278, 223648, 279950, 314767, 307935, 241407, 246563, 297377, 284369, 362865, 387390, 287413, 170494, 160729, 175411, 175067, 250104, 260327, 147193, 122820, 174669, 159614, 166531, 172035, 210910, 304207, 217551, 178121, 224543, 227118, 212889, 229944, 305314, 316605, 272075, 193637, 193103, 166459, 152498, 105624, 123778, 99069, 141674, 199649]
12993A99649J3537l1079L3407P7836J3241J9909n5783p7812J3085j2136j8280
12982A75574K4067K2608O1580r317l2705L2942l9200J9449L8856J08935P9692
12971D82481M7525j19182j33975p691J905J4130M8397m8991R1047P8566l4055
12960D20157p3089K4039L6291j6588l4097Q0876Q909k0044l3160m4156M6518L6817
12948D32473n1671l0601K643K0869O4467O0072Q555K2396n5256J755J9641k9122
12936D66221P928J6547l9767p7846r0787j487O2076O9779l5717k3583L616M6669
12924D03649M7802M2837o461n1643J7667q2005J0248R5443K9723l6175l0443n9966
12912C80676L39L2093Q6342m1268l296k4276p4480j4333P8899l1507J5400N7974
$$ y = [199649, 213186, 182107, 215514, 293350, 306591, 326500, 270717, 192905, 205990, 193854, 175574, 199641, 222249, 283829, 274512, 241807, 274749, 235549, 254998, 293854, 402789, 482481, 530006, 410824, 276849, 269158, 271063, 285193, 333590, 284599, 375646, 454212, 420157, 347068, 371107, 407398, 390810, 356713, 437589, 446498, 426454, 393294, 349138, 395656, 432473, 380802, 350201, 352844, 373713, 438180, 498252, 506807, 529203, 473947, 475702, 495343, 466221, 474149, 490696, 450929, 373083, 282296, 280809, 342885, 412664, 376947, 353364, 356980, 403649, 451451, 494288, 487827, 436184, 453851, 371846, 382094, 477537, 507260, 471085, 440642, 380676, 381015, 413108, 499450, 458182, 454886, 430610, 356130, 341797, 420696, 389189, 404589, 462563]
12900D62563k7239n4741r262L2503K4759j2564L2169N2652J9404J8042n0148o5878
12888D22260L520j5476R340J2727j6131k0401k2322L2495Q3441p303K685q2137
12876D02698J2230J20719p161N644J6358N9663n4809j02258k6009j9495P4055
12865D81635R9154Q7524j8483q6027j10436N5566R0958J33088J13663M5218m6808
12854H45052r847n0337k20m217j6111q2588j07255l3838N6069J01121m2052l929
12842F51848k2249l7843M1612J8936k7229k3869m5768m7787O4494P5909L8634
12831F86688M1182k4454j03329P3541R0691M1567P1414m2116n8955K0009p9787
12820G16451n2364o325N588n0383P7281J31604Q9778J4774K679J3401p086J4562
$$ y = [462563, 435324, 380583, 371321, 403824, 428583, 416019, 448188, 500840, 520244, 538286, 488138, 422260, 425780, 410304, 419644, 432371, 416240, 395839, 373517, 406012, 489453, 482150, 484835, 402698, 414928, 535647, 528486, 534130, 550488, 610151, 555342, 453084, 427075, 407580, 481635, 580789, 668313, 649830, 563803, 453367, 508933, 599891, 732979, 846642, 891860, 845052, 835205, 784868, 784648, 780431, 764320, 681732, 574477, 540639, 596708, 697829, 655777, 651848, 629599, 591756, 633368, 652304, 625075, 601206, 555438, 507651, 572145, 648054, 686688, 727870, 703416, 600087, 673628, 764319, 805886, 877300, 835184, 776229, 796238, 716451, 664087, 657762, 663350, 612967, 690248, 821852, 911630, 926404, 929083, 942484, 935398, 949960]
12808I49960j4838K4613K6836l8052j935o9428K548J07303N3731K2749M9956N5465
12796A168908O4510k7313Q8747J28388P6537K5521P4159L877r768j0904l8348
12785A544314O4217L7731j3146J2951J46134J02044Q4093J30998J81136R4441
12775B384913m8818L806j01533n3596J04952J21944O5707j0816J23104K29057
12765B818720J28995J54731J70669K10751J69077K46627L19127K88313J75857
12756D682867L15259K62558K58480L20577M81972O25623P14667P68647Q91008
12747I321658J043673J122250J400568J510253J811687K252142K885105M125775
12739B5473111N800723Q102656J1880126J7325884K4138753L0779357L3219565
$$ y = [949960, 935122, 959735, 986571, 948519, 946584, 877156, 879704, 987007, 1040738, 1063487, 1113443, 1168908, 1233418, 1206105, 1294852, 1423240, 1499777, 1525298, 1599457, 1603334, 1593566, 1582662, 1544314, 1608531, 1646262, 1633116, 1646067, 1792201, 1894245, 1978338, 2109336, 2290472, 2384913, 2336095, 2339901, 2238368, 2184772, 2289724, 2411668, 2477375, 2466559, 2589663, 2818720, 2947715, 3102446, 3273115, 3483866, 3652943, 3899570, 4218697, 4507010, 4682867, 4998126, 5260684, 5519164, 5839741, 6321713, 6947336, 7662003, 8430650, 9321658, 10365331, 11487581, 12888149, 14398402, 16210089, 18462231, 21347336, 25473111, 31273834, 39376490, 51256616, 68582500, 92721253, 123500610, 156720175]
12732A56720175K8853780J7528867K087354j2438455k2352681k6799951k6148949
12725A17450140k2121516j6846197j1679444p309611l802311j036483J304888
12718E5959466L373901N028210N636794M994386L589035K922331L660609O138424
12710I1303156J0370067J4938286J8646297K0896291K2135943K3589749K5652982
12703B27532771K6297775K1145093P972794p794911k0045282k6882924k7843774
12696B00381542k3455628j6526248r842854m876229k270749k171097m351595p526784
12688A29360358r922902j0256244q313332n439539l020549j967956k582448l382534
12680H4474854l533907l072279j776253J042398N274737J1190516J9252609K9260707
$$ y = [156720175, 185573955, 203102822, 205190176, 192751721, 170399040, 143599089, 117450140, 95328624, 78482427, 66802983, 59493372, 55691061, 54654578, 55959466, 59333367, 64361577, 69998371, 74992757, 78581792, 81504123, 85164732, 91303156, 101673223, 116611509, 135257806, 156154097, 178290040, 201879789, 227532771, 253830546, 274975639, 282948433, 275153522, 255108240, 228225316, 200381542, 176925914, 160399666, 150556812, 145680583, 143409834, 141238737, 136887142, 129360358, 119437456, 109181212, 100867880, 95428341, 92407792, 90439836, 87857388, 84474854, 80940947, 77868668, 76092415, 77134813, 82409550, 93600066, 112852675, 142113382]
12672A42113382L8850104M3889420M0223256K5066296J311632k1553357l5878238
12665B34022495m2175445m1267809l4708814k6274519j9043580j3495308r508575
12658D7548445o902692n263725m157942l316195k730212k440630k082127j748005
12650A8906917j566848j402296j311576j137816j057945r08013p83282o96667
12642A0042474n06440l81400m68308l34894l18171l54483l28441k54755k79997
12633F815585j65913j32384k39782l04529k16955k59287l12340j12608j75842
12624D895945k12476j76526r3879m2144n1008j37846p1399n9938k04099j81514
12614C665116j61431j53807j07195j17653o9679n2613r6300m5019m4173j52350
$$ y = [142113382, 180963486, 224852906, 265076162, 290142458, 291454090, 269900733, 234022495, 191847050, 150579241, 115870427, 89595908, 70552328, 57057020, 47548445, 40645753, 35382028, 31224086, 27907891, 25177679, 22737049, 20654922, 18906917, 17340069, 15937773, 14626197, 13488381, 12430436, 11522423, 10739141, 10042474, 9536034, 9154634, 8686326, 8351432, 8033261, 7678778, 7350337, 7095582, 6815585, 6649672, 6517288, 6277506, 5972977, 5756022, 5496735, 5184395, 5071787, 4895945, 4683469, 4506943, 4413064, 4370920, 4319912, 4182066, 4110667, 4050729, 3846630, 3665116, 3503685, 3349878, 3242683, 3125030, 3055351, 3002738, 2906438, 2861419, 2817246, 2664896]
12604B664896l1163J3667k5869o9611J9805j27998p0356n3101j69419p5017q8580
12593A987254k3070l8657o9700J8794R3971Q3546K4081j0458k325M0703q4072
12582B020067j08499p9593k9391j63684j08483j06098p4310n4073M2236l3070
12572A305102j6562m9626n2753K879N6884k8687p0702M1037j2337o1613O293P3455
12560A193370k8491m0785R188J35714L3713j50034n6836J07825J18268J02783
12550A424715J69054K70379K44421J86037J28741O9914j59970j71275j62807k16310
12540A782899k19994j77113j35164j07179j11448j4785M0849O220j6821q0540
12530I66924o409n3062q4042r8542k6091r416j04834o0278L3516N9452L1938j5948
$$ y = [2664896, 2633733, 2647400, 2621531, 2551920, 2571725, 2443727, 2373371, 2320270, 2150851, 2075834, 1987254, 1964184, 1925527, 1855827, 1874621, 1968592, 2052138, 2076219, 2065761, 2063436, 2104139, 2020067, 1911568, 1831975, 1802584, 1638900, 1530417, 1424319, 1350009, 1295936, 1338172, 1305102, 1288540, 1238914, 1186161, 1189040, 1245924, 1217237, 1146535, 1187572, 1175235, 1113622, 1119915, 1193370, 1164879, 1124094, 1133282, 1268996, 1302709, 1152675, 1095839, 1203664, 1321932, 1424715, 1593769, 1864148, 2108569, 2294606, 2423347, 2493261, 2333291, 2162016, 1999209, 1782899, 1562905, 1385792, 1250628, 1143449, 1032001, 1017216, 1058065, 1064285, 1047464, 966924, 960515, 907453, 823411, 724869, 698778, 689362, 584528, 524250, 557766, 617218, 649156, 633208]
12518F33208O2579m8819p5850l1687J23430l9358j06715o0307k1949L2785L073
12507D70390Q8651k4504J9538J1903M8077l5748o5193R381J6880R820K0842m5991
12495E24046p5957O0534M7746k0963N408N3915J9544o4687o0024L6242J6425n5913
12483D86316l4464O5367l8056Q0074J62526J83851O8510K4620N4879P5993J27671
12472A257287K53895L59533J98601R1853P7175j28143j93023k36074k66308q7161
12462A327635q0206j82796j41457q7331j04215k8275j0181m8009j05384M351P4259
12451F18391J3696o2834N2035J00869j198L05j5087J3578R922m5631r7205o792
12439E80049J31449Q2062M4334p5689m0993R7078J07044q539j14509P3822M7295
$$ y = [633208, 695787, 646968, 571118, 539431, 662861, 623503, 516788, 456481, 434532, 467317, 470390, 559041, 534537, 554075, 565978, 614055, 578307, 513114, 522495, 539375, 549195, 570037, 524046, 448089, 508623, 556369, 535406, 540814, 594729, 614273, 549586, 489562, 525804, 542229, 486316, 451852, 517219, 479163, 559237, 721763, 905614, 974124, 998744, 1053623, 1129616, 1257287, 1511182, 1870715, 2069316, 2161169, 2238344, 2110201, 1917178, 1681104, 1414796, 1327635, 1247429, 1064633, 923176, 835845, 731630, 703355, 693174, 645165, 539781, 544132, 618391, 632087, 569253, 621288, 722157, 720959, 721264, 706177, 719755, 729677, 684046, 586841, 580049, 711498, 793560, 837894, 762205, 721212, 818290, 925334, 916795, 802286, 876108, 923403]
12428I23403n3424j15495K6908J18009O4991n4215K291Q3079M3642p0543J8432
12417I87078J22882M3284j8952O052P8454O9363k3573k3459J4160O6130R725J85450
12405A516594J09013P3223n391K158L1366m9074K3863L7463N0291k962P2087j284
12393A857347Q4475J59782K0626k7529M6149Q7834J40149P2335J8771Q242J11783
12382B579964K28122J80719J27403R6320K19677K38993K72205L02563K24586K90277
12372D760829L84927L89191L89178M55976N03798N12634O04537P67635Q37234
12363I605939J103435J410519J816705K236057K736076L184391M003877N291424
12355C1388423P089335R882509J4477190K1162866L0008463L9284173M5185700
$$ y = [923403, 869979, 754484, 781392, 899401, 964392, 910177, 912468, 995547, 1039189, 968646, 987078, 1109960, 1153244, 1134292, 1140344, 1218798, 1288161, 1264588, 1241129, 1255289, 1321419, 1331144, 1516594, 1625607, 1698830, 1693439, 1695597, 1726963, 1677889, 1701752, 1739215, 1789506, 1786544, 1858631, 1857347, 1941822, 2101604, 2122230, 2094701, 2140850, 2228684, 2368833, 2441168, 2459939, 2468181, 2579964, 2808086, 2988805, 3116208, 3212528, 3432205, 3671198, 3943403, 4245966, 4470552, 4760829, 5145756, 5534947, 5924125, 6380101, 6883899, 7396533, 8001070, 8768705, 9605939, 10709374, 12119893, 13936598, 16172655, 18908731, 22093122, 26096999, 31388423, 38477758, 48360267, 62837457, 84000323, 114008786, 153292959, 198478659]
12348A98478659M2655350K9760266R682227j1343092k7843161l6704858l7590095
12341A67095296l2715768k5097727j7027264r914809m102258p8133J964352J994028
12333H2117717P60989k69571l07543R05616L526956P288802J0933396J2679743
12325A17636105J1308607P281299K631036k07022L91892M732831J1787428J9641381
12317A75203557K5645337K7247585K2891314J3887358L455762n919512j3649927
12310B48761474j9227770k2563926k4142545k4044393k2204306j8759376j4485401
12303A03333757j0058299o301929l987925l567101m480946n539920n839717n186117
12295E8371803l677879j416898J104950M001596P624712J2029468J7095003K2483324
$$ y = [198478659, 241134009, 270894275, 280576502, 269233410, 241390249, 204685391, 167095296, 134379528, 109281801, 92254537, 82339728, 78237470, 78159337, 80123689, 82117717, 82878706, 82609135, 82301592, 83207208, 86734164, 94022966, 104956362, 117636105, 128944712, 136226011, 138857047, 138650025, 139041917, 143774748, 155562176, 175203557, 200848894, 228096479, 250987793, 264875151, 268330913, 262411401, 248761474, 229533704, 206969778, 182827233, 158782840, 136578534, 117819158, 103333757, 93275458, 86973529, 82985604, 79418503, 74937557, 69397637, 63557920, 58371803, 54693924, 53277026, 54381976, 58383572, 66008284, 78037752, 95132755, 117616079]
12287A17616079K6976327K7462696K1043453Q140488o807750j9026473k6295890
12280A49108930k8383643k6021980k1218430j6061526j1538729q423623o294479
12273C1166520m675382l699714k906709k307072j923662j442641j117340r10430
12265A2183570p34238o21698m67619l72900k27008j52328j17131j43431l10651
12256I036566l99644n24799n51304o58600n50180n75004l62570l13433k39777
12247D861255j90630j36547j71745j56064q3386j64557j62398k4453O3529L0224
12237C865228Q5383J77221M2055n5503n4112K2581k1602m7311p526J83210K76170
12226D465794K87034K23711J14311j27522j40910j89442k55674k95699k63468
$$ y = [117616079, 144592406, 172055102, 193098555, 201239043, 194431293, 175404820, 149108930, 120725287, 94703307, 73484877, 57423351, 45884622, 37460999, 31166520, 26491138, 22791424, 19884715, 17577643, 15653981, 14211340, 13094000, 12183570, 11449332, 10827634, 10360015, 9987115, 9760107, 9607779, 9490648, 9347217, 9036566, 8636922, 8112123, 7560819, 6902219, 6352039, 5777035, 5414465, 5101032, 4861255, 4670625, 4534078, 4362333, 4206269, 4122883, 3958326, 3795928, 3771475, 3835004, 3865228, 3950611, 4127832, 4169887, 4114384, 4060272, 4082853, 4061251, 4013940, 4006414, 4189624, 4465794, 4752828, 4976539, 5090850, 4963328, 4822418, 4632976, 4377302, 4081603, 3818135]
12217C818135l12970k51226j25768j59809j11344p1034n1028n2637j73222n1374
12207B457723j41535q6028l8605L1987k8022M6220K06433K96251K28337K01468
12197C174229K28338K13287J56733J3330k40388k99506k80673k91763k33726j34445
12187B305416j02058j00242n647p8855L3414j9009j419M1550R9501J96543J12232
12176B481426J34489K64484K00726P8535L0858J1205j36446k05879k38000j40528
12166B480870j19604p9347j26377o6775o2071K0090J22668N0781M8064M3183L7412
12155B348894J5111j7494N8331Q1789j1380k9219L996L7768K897O3417J39759
12144B693869M8604R2769J01651Q5366J4721N1304R144j24175j03282q1143j34770
$$ y = [3818135, 3505165, 3253939, 3128171, 2968362, 2857018, 2785984, 2734956, 2682319, 2509097, 2457723, 2316188, 2230160, 2191555, 2223542, 2195520, 2241740, 2448173, 2744424, 2972761, 3174229, 3402567, 3615854, 3772587, 3785917, 3545529, 3246023, 2965350, 2673587, 2439861, 2305416, 2203358, 2103116, 2097469, 2018614, 2052028, 2033019, 2031600, 2073150, 2172651, 2369194, 2481426, 2615915, 2880399, 3081125, 3159660, 3190518, 3201723, 3065277, 2859398, 2621398, 2480870, 2361266, 2281919, 2155542, 2088767, 2026696, 2046786, 2169454, 2220235, 2268299, 2311482, 2348894, 2364005, 2346511, 2404842, 2486631, 2475251, 2446032, 2450028, 2487796, 2490693, 2554110, 2693869, 2742473, 2835242, 2936893, 3022259, 3036980, 3088284, 3097428, 2973253, 2869971, 2788828, 2654058]
12133B654058j71378j47546K1954r9678r2354r7085q5369n3819j615n3377o7575
12122A806216K764m2731j3267p180l1939L7091J14820K6546M0987M4903J54988
12111B133198J12725J03973n909n9752j91523k02060j59115j11203o9710j45370
12101A405254r9614q7373P8013l3625o0772o6896M0720L8836p5226M2428L9653
12090A221398p0571j6482l7687q0841j6106J9514m4219J7105K4236p1409m7197
12079H97741m0537n4464p0801k1952M5393P2727j7322j54129K2034J01419L7471
12068H17580l2892p7632k913M8278O6401P905l8234l8710j10526j7110K6924l9563
12056F09508n4132j6057k3312k4268N6695R8569M6109m4269m6003k4447q344l2197
$$ y = [2654058, 2482680, 2335134, 2357088, 2257410, 2165056, 2067971, 1982602, 1928783, 1927168, 1873791, 1806216, 1808980, 1766249, 1752982, 1745802, 1713863, 1750954, 1865774, 1892320, 1933307, 1978210, 2133198, 2245923, 2349896, 2343987, 2284235, 2092712, 1890652, 1731537, 1620334, 1550624, 1405254, 1305640, 1218267, 1296280, 1262655, 1201883, 1134987, 1175707, 1214543, 1139317, 1181745, 1221398, 1150827, 1134345, 1096658, 1015817, 999711, 1019225, 975006, 992111, 1016347, 944938, 897741, 857204, 802740, 731939, 709987, 755380, 828107, 810785, 656656, 678690, 780109, 817580, 784688, 707056, 704143, 752421, 818822, 826727, 788493, 749783, 639257, 622147, 649071, 609508, 555376, 539319, 516007, 491739, 548434, 647003, 693112, 648843, 602840, 578393, 570049, 537852]
12044E37852M7280p797o9111k3470K8466Q6215n0263m9706p8389p3217o6503p2134
12032B09223K2445P2645J31287Q780P914m4668o4553q2583m8456l238K7949P0537
12020C07282K0936n6560k6510k6575O7925M4378Q5338m9684j03087l9242R563
12009B33764N97J12565L9589j15727j3398l9633K5481L2569n5936P733L9642l2670
11997B34576l8536l2057j2140Q1678p6175q2115J07032K7456M2219N842n463k1109
11985B31208k5524O7752m4122j60021j03031M8696J31720p461l7894l0037L7429
11974A08715K5134p1539J2962R816P8957N4173j6067m4981l5660J13N3820K8208
11962B03651k9921k0157K0691J455J7539l3236o6041L9447K2952l2030o9679j00632
$$ y = [537852, 585132, 577335, 508224, 484754, 513220, 599435, 549172, 499466, 421077, 347860, 281357, 209223, 231668, 304313, 435600, 444380, 452294, 407626, 343073, 260490, 212034, 208796, 236745, 307282, 328218, 271658, 245148, 218573, 286498, 330876, 416214, 366530, 263443, 224201, 233764, 234361, 346926, 386515, 270788, 257390, 217757, 243238, 275807, 219871, 227604, 267246, 234576, 196040, 163983, 151843, 233521, 157346, 75231, 182263, 209719, 251938, 257780, 252317, 231208, 205684, 273436, 229314, 69293, -33738, 14958, 146678, 139217, 101323, 71286, 108715, 133849, 62310, 75272, 85088, 164045, 218218, 202151, 157170, 121510, 121623, 175443, 203651, 173730, 153573, 174264, 175719, 193258, 160022, 93981, 133428, 156380, 124350, 54671, -45961]
11950d5961L0411M8085P7733K4038n0776p5821k5283j4956Q5522N8374m1346j5181
11938E4839p479O0867k0900j30811l6774K2759J06345M6996N3160J05527R6717
11927C51246j3825j05210r8104O990Q3921J26171J2142m2096J5843K1519M0736
11916C99333Q8508J30759J02025J42123J22821J69754J28457L7633n7063j20469
11906A143881j33497j45402j03706j56952q951J8028o9029j38450Q257j1536j1535
11895C91108j7610L4849O991K5973K0277J8738L9988J34912R5495Q1144q787R3657
11883I16735J56169M7228l052Q7537J35959J3160n7662m0671l3419j29371k10536
11872H82077j03669n0668n737o6683j3694q4207j25478k625P6093m4439j03587
$$ y = [-45961, -15550, 32535, 110268, 134306, 83530, 7709, -17574, -32530, 52992, 111366, 70020, 54839, 47360, 108227, 87327, -43484, -80258, -57499, 48846, 95842, 149002, 254529, 351246, 337421, 232211, 134107, 141097, 225018, 351189, 363331, 321235, 337078, 358597, 399333, 487841, 618600, 720625, 862748, 985569, 1155323, 1283780, 1321413, 1264350, 1143881, 1010384, 864982, 761276, 604324, 595373, 613401, 544372, 405922, 414179, 402643, 391108, 373498, 408347, 415338, 441311, 461588, 480326, 520314, 655226, 750721, 831865, 823078, 916735, 1072904, 1120132, 1117080, 1204617, 1340576, 1353736, 1296074, 1255403, 1221984, 1092613, 882077, 778408, 727740, 722003, 655320, 641626, 557419, 431941, 429316, 505409, 460970, 357383]
11861C57383r7957N797O7601P325J8685m4005J6972K4262J5922O2865K39517J45007
11849H19374M3107L8964O8241J6858j10566j79772j28979q249p6197j36038j3984
11838C32759l7217o4718k7406n6434j30793j0082J1940q3568p2793j1003J01902
11827d7413L0000N163j9432q5456N7185P0903N1524k0657j05381n8588N9734Q9745
11815B7327L3047j8102n5723o534J5313Q0247l5872P1964n377p0075p0180K3407
11803a0558n646R4327J7086q3170q2656o313L8024L8021j5018j6300n6065J4966
11791g3302L1603J0204n9838k9580L6429N4822k105l176N5195L4570p827n517
11779D1478J4212m6597M8729J04570j46237r0776R5100J11497q995j08049l5169
$$ y = [357383, 259426, 265223, 332824, 340149, 358834, 314829, 331801, 356063, 371985, 434850, 674367, 819374, 862481, 901445, 969686, 986544, 875978, 696206, 567227, 558978, 482781, 346743, 332759, 295542, 230824, 203418, 146984, 16191, 6109, 18049, -65519, -138312, -149315, -47413, -17413, -12250, -31682, -117138, -59953, 10950, 62474, 41817, -63564, -122152, -62418, 27327, 60374, 42272, -13451, -19985, -4672, 75575, 39703, 111667, 106290, 36215, -33965, -10558, -16204, 78123, 95209, 12039, -70617, -76930, -38906, -885, -15903, -32203, -88268, -73302, -41699, -31495, -91333, -120913, -84484, -29662, -31767, -34943, 20252, 54822, 46995, 41478, 55690, 9093, 57822, 162392, 16155, -74621, 20479, 131976, 122981, 14932, -20237]
11768b0237j4837P9534L4939k3451M121M5957l4075k186m2627m8451Q7641m2209
11756B4119m696j4666p0679j10485M6783K6114K2712L2192j8557M0320J5062k4338
11744c6119N5022n700m576j0403K5492K1670o8009o0239n9899J612R8281J06459
11732F3591L5178p2074O194O152j4019P7970M3331m4367j02732l7310l092K2921
11720a8257l1153j4879K3524M5253O264J4533N5982Q215o8638K9611j1948j6412
11708B2095J6533m0075o7110n2132l1268K9017K6723N7534o8703r3586m8037l7906
11696b86915P4533Q0153r718o0123R6517M8310J9098L1767k3025M902k1654M804
11684d1351o4890M1776P741O1419L9498L8618K2688j18978p637r108n531M2120
$$ y = [-20237, -35074, 44460, 79399, 55948, 60069, 106026, 71951, 69765, 27138, -21313, 66328, 24119, 19423, 4757, -65922, -176407, -129624, -103510, -80798, -48606, -67163, -26843, -11781, -36119, 18903, 13203, 8627, -1776, 23716, 45386, -22623, -82862, -142761, -141149, -42868, 63591, 98769, 26695, 32889, 39041, 25022, 102992, 146323, 101956, -776, -38086, -41178, -18257, -49410, -64289, -40765, 4488, 10752, 25285, 81267, 89482, 20844, 50455, 38507, 22095, 38628, -1447, -68557, -120689, -151957, -122940, -96217, -38683, -107386, -200972, -249009, -286915, -212382, -132229, -141947, -202070, -105553, -57243, -38145, -6378, -29403, -24501, -46155, -41351, -106241, -64465, -56724, 4695, 44193, 82811, 105499, -13479, -21116, -30224, -35755, 6365]
11672F365K816j0762n1451J8645n9416n4285L0291J802M1113j2403n4813o0654
11660b02752R1400M3330l9912j8566J34637P2010q4674N1695j4229j23460J0455
11649h0066J8689o9546J9725O530l4967N0714O5817J2019j09950J7985M9303K8262
11637b5485J14248j6290j11679K4015m6492N4299n874M5228p37o6937j4767M9173
11625a298J3608K4634m361q0293k3716J0140K5450K8711M0503m222M2525p133
11613F4548l7549l3418j36675j6835O4438O0355j7321j1261P2795q9884N407M8975
11601b6425j736r716K194J35567N3339m4720j20839q7633m112P1294Q7492J7928
11589G2633m6999L1547M8686q7210o5702J13288q6313l7509P9384N4329l6713
$$ y = [6365, 9181, -1581, -53032, -34387, -93803, -148088, -117797, -115995, -74882, -87285, -142098, -202752, -111352, -68022, -107934, -126500, 8137, 80147, -4527, 47168, 32939, -90521, -80066, -61377, -130923, -111198, -104668, -139635, -88921, -23104, -11085, -121035, -103050, -53747, -25485, 88763, 72473, -39206, -15191, -61683, -7384, -13258, 31970, 31233, -35704, -50471, -1298, 12310, 36944, 32583, -47710, -71426, -61286, -35836, -7125, 33378, 29156, 71681, 64548, 26999, -6419, -143094, -159929, -95491, -35136, -52457, -63718, 9077, -80807, -75400, -26425, -28161, -37877, -35683, 99884, 153223, 108503, -12336, -99969, -104081, -32787, 54705, 72633, 25634, 57181, 105867, 18657, -47045, 66243, -20070, -57579, 21805, 76134, 39421]
11578C9421m4640K7425m5375j4081M4844n0234o8673l6658J29911J04566J2358
11567I8864n7412j16703m5019k0089n2376P6292K3171N98L0622R75k5883n5022
11555a41982j5537n073J932R9920R7728l4910l0374o0666l0960R5279P037m0365
11543e7971M4060L2800l5225m0541L3692O4156K2488m2285k7395O3215n8828q8377
11531i0211J2445N8093K7298M2364n7217j02537k6544k8500o482L6941P6569m1673
11519i9454R87J4511L4927m0709k7643l8089p2885R3663J19532j9268o5836K3907
11507g6357J0739N0505M9079l4491J7184p2823o6249l3974M3964J1755J6500O6951
11495a7217l8248m5101L7238N0626J7825O758l6466K2963O9830j4380m6898K6418
$$ y = [39421, -5219, 22206, -23169, -37250, 7594, -42640, -111313, -147971, -18060, 86506, 98864, 41452, -75251, -120270, -140359, -192735, -116443, -93272, -92674, -62052, -61077, -86960, -141982, -157519, -162592, -160660, -60740, 36988, 2078, -28296, -88962, -119922, -24643, -17606, -57971, -13911, 18889, -16336, -56877, -23185, 40971, 63459, 21174, -6221, 56994, -1834, -90211, -77766, -19673, 7625, 49989, -7228, -109765, -136309, -164809, -171291, -134350, -57781, -99454, -98467, -83956, -49029, -89738, -117381, -155470, -228355, -134692, -15160, -34428, -100264, -76357, -65618, -15113, 33966, -525, 16659, -56164, -122413, -156387, -112423, -100668, -84168, -17217, -55465, -100566, -63328, -12702, 5123, 11881, -24585, -1622, 68208, 53828, 6930, 33348]
11483C3348J3710J453p0546j15407j3217K16456J60937q9247q5520m6466J2330
11472A7831m3594L2107Q7053K8844j21582q4783O9863P0404o0004l800j6649k3075
11460d7385N4380O0570n6484m5696l096m0289J57048o6529q6866N5322M6216L4670
11448F1861l9413p4502r8908M2876K5524l3330J9113j4236L6854N6092K0065M1766
11436D3762k0752o2780k3344R5523J5523m6239n6847N0356J5276p5568p298N104
11424f7284P3023q073k952m3435K0208o228n843j5434j5431m301J6754j7084O3341
11411a2739L9297L5189L8365p1332n6565P800n3269L5859Q0247O5549L6595n2509
11399I2487j8676m9656l7827N583M2156k1978R477Q1798K7777j59167o7580K7149
$$ y = [33348, 47058, 48511, -22035, -137442, -150659, 65797, 226734, 137487, 51967, 5501, 17831, -25763, 6344, 93397, 122241, 659, -84124, -14261, 56143, -3861, -7661, -24310, -47385, 6995, 67565, 11081, -34615, -37711, -78000, 79048, 12519, -74347, -19025, 27191, 61861, 22448, -52054, -150962, -108086, -82562, -115892, -96779, -111015, -74161, -18069, 1996, 43762, 23010, -39770, -63114, 32409, 47932, 1693, -55154, -4798, 10478, -65090, -72388, -67284, 5739, -2334, -5286, -48721, -28513, -34741, -40584, -56018, -71449, -75750, -58996, -76080, -12739, 26558, 61747, 100112, 28780, -27785, -19985, -73254, -37395, 42852, 108401, 144996, 92487, 73811, 24155, -13672, -8089, 34067, 12089, 21566, 103364, 131141, -28026, -95606, -68457]
11387f8457J3507k189l2902R034Q9585O7246p442j5331o5200l9470m577n7064
11375a13260N6406K9096q7208n0701K2549M01R4294N4615J3298L2677J32739M3105
11363B28011j2159q5776o599l940n7246o9492n5323O011K6112l6720M850O580
11351e5691r2325q3889Q2951J09641O3167P0164m3374L0393Q534j11892m3633
11340f5954M1486L0107p2252j6034R3724j4989m1655K5345R4503j8537n4318M4578
11328D6004L4612K4203p4974n6065K9935J8946o4922P088q554o4977J1943K7286
11316f9475l4798J0414M738K1494J6711N2247Q9293l1346q3671l5767l919O2355
11304a724j14641P870L5679o7940M4101Q4899j8849M7040l991O981k2189n4148
$$ y = [-68457, -54950, -57139, -90041, -81007, 8578, 75824, 68382, 53051, -12149, -51619, -56196, -113260, -56854, -27758, -114966, -165667, -143118, -142717, -48423, 6192, 19490, 52167, 184906, 228011, 215852, 130076, 123477, 119537, 62291, -7201, -62524, -56513, -30401, -67121, -62271, -55691, -148016, -231905, -148954, -39313, 23854, 94018, 50644, 81037, 89571, -22321, -65954, -24468, 5639, -66613, -82647, 11077, -3912, -45567, -20222, 74281, 55744, 1426, 46004, 80616, 104819, 29845, -26220, 3715, 22661, -42261, -35173, -43727, -108704, -96761, -69475, -104273, -93859, -89121, -67627, -50916, 1331, 90624, 59278, -24393, -60160, -64079, -1724, -116365, -108495, -72816, -140756, -96655, -11756, -30605, 16435, 12444, 19425, -2764, -56912]
11292e6912m4258K327l7136j935P5210K3126l1568k3146o858Q530M1258Q1018
11280B9656N0941J1484k4697R372j499j04901j34445k7297N426O6614O4382K8160
11268b6804p414M0331n4310q2116L3292R1724J13515j351r3926j13432P703m8900
11256a41688j8350J03043K4103p1229n5829J5625o7692K852R8470K5303J27152
11245D1760n4713p7051o7563Q8098J70302K8624j04566l2352J2908j52050m2833
11234a89436K1524M2914M178N1842M291J0540l6609P274J212M463k1987K3491
11222g6303J29221M60j5076j38844r3521J14915K6911m382R3634P0250n5970j39291
11210h7996M1898Q8680P7947J86235J56696P8155R2214J49810J55538O4935j7388
$$ y = [-56912, -101170, -98843, -135979, -137914, -62704, -39578, -71146, -94292, -101150, -92620, -51362, 29656, 80597, 92081, 67384, 76756, 75257, -29644, -164089, -191386, -185960, -119346, -54964, -26804, -34218, 6113, -48197, -130313, -97021, -5297, 108218, 106867, 12941, -100491, -92788, -141688, -160038, -56995, -32892, -104121, -159950, -144325, -212017, -209165, -110695, -85392, 41760, -12953, -90004, -157567, -69469, 100833, 129457, 24891, -7461, 5447, -146603, -189436, -167912, -124998, -120820, -68978, -64687, -54147, -90756, -83482, -82270, -77807, -99794, -76303, 52918, 53378, 38302, -100542, -194063, -79148, -52237, -56619, 37015, 107265, 51295, -87996, -46098, 42582, 120529, 306764, 463460, 541615, 633829, 783639, 939177, 1004112, 986724]
11199I86724Q7615j9343j34332r9854o1428p3376j19421j01891m0745o5038k6294
11188C32617R666n8546j37450n387P1026P6946l4011K6682n3282j2719l951l8070
11176A73521o9484L6095R4526Q4172J06094J15437M7029j3796j7060p819Q3504
11165F32219j7716J7487K5432Q7497J2324n8288l1528j9825Q659R3971J6886J26394
11153H93512J38136O7683O4039N278j4132p2872o0555l7256l2045j48750n4745
11142G48293N3562P7042j2805p0705q0904m9933l3248n1733m543K685r1795o7847
11130D18069J7032P6482K2750n8637r3925n1281q694K147p5103o3524k9991O940
11118A62265j0728P0495o7166j6073J6475j5656m4731R5868J01616Q4155l218
$$ y = [986724, 1074339, 1054996, 920664, 820810, 759382, 686006, 566585, 464694, 423949, 358911, 332617, 342283, 283737, 146287, 140900, 211926, 288872, 254861, 281543, 228261, 215542, 211591, 173521, 104037, 140132, 234658, 318830, 424924, 540361, 587390, 573594, 556534, 548715, 632219, 614503, 631990, 657422, 744919, 757243, 698955, 667427, 647602, 656261, 750232, 767118, 893512, 1031648, 1099331, 1163370, 1168648, 1154516, 1081644, 1021089, 983833, 951788, 803038, 748293, 801855, 878897, 866092, 795387, 714483, 664550, 631302, 579569, 575026, 577711, 485916, 418069, 435101, 511583, 534333, 475696, 381771, 330490, 321796, 323943, 248840, 185316, 155325, 162265, 151537, 222032, 154866, 138793, 155268, 139612, 94881, 190749, 292365, 376520, 373302]
11107C73302n727L5355J43373N5359J00362O0295J73028J03998M2314P3797m4916
11096A110540k24238j43701j03390j11306j08491r3843j33185k9680n8158j2676
11086I1872K4405l2974P6833M6910q3353o8623o4736m9235J04993L6188n9765
11075B2515l8567l176j6181o0505l8131M6859M7037o2l5980N8964k6793n7149
11063a01169L6605m3055K4468j8643R250K7463p1775M6695N6993M3049j7314L2144
11051B4711K5408p321K3261q7623P5633L9474p6213n2949J4643N236m8249k3340
11039h7329k1490M8939J55556Q8238L6857j26519p2978J09672J4079m9270N8594
11028A54349M372n5931J4029l3652j27631m3263k6488l038P0177K7867q955J4900
$$ y = [373302, 367575, 402930, 546303, 601662, 702024, 762319, 935347, 1039345, 1081659, 1155456, 1110540, 886302, 742601, 639211, 527905, 419414, 325571, 192386, 162706, 104548, 91872, 116277, 83303, 160136, 207046, 123693, 55070, -9666, -58901, 46092, 82280, 22515, -16052, -19228, -35409, -95914, -134045, -87186, -40149, -40211, -76191, -17227, -44020, -101169, -64564, -107619, -83151, -101794, -92544, -65081, -136856, -90161, -33168, 9881, -7433, 24711, 50119, 42798, 66059, -21564, 54069, 93543, 17330, -35619, -20976, -15740, -63989, -87329, -108819, -59880, 95676, 183914, 220771, 94252, 21274, 130946, 145025, 95755, 154349, 158721, 102790, 116819, 83167, -44464, -87727, -114215, -117253, -47076, -19209, -28164, -13264]
11016a3264Q18J86N1400N9996n3028j06392m8442N7498K7824k7060J9439Q093
11004b2932m3171m8943P1547N9026L1648J9073n4678m1509K7362k9916r570P420
10992c4643K5249j2721m2371J8422J90J11058N1217q950j05793N1915J9535l226
10980F9882l2955n7548M8048N5433j1368N6825L3481o710p0487p3806J3506P8792
10968A03093K135n8353j1459n4633q5626L5401L4515N144L0647J4849M7125r893
10956E2945n4452N7762M3349K2736j4588q3981K0162J5249n4908J8406M7889J08656
10944A79225L2349k0518j7158m7215j4024j9920K0384K98l4847l7566J3668k28
10932E4448r1287q2081M4149P648j2489J3700j3655m3593J3890r01j3594m2043
$$ y = [-13264, -12446, -12260, 39140, 99136, 46108, -60284, -108726, -51228, -23404, -50464, -31025, -22932, -66103, -115046, -43499, 15527, 47175, 66248, 11570, -29939, -2577, -32493, -42063, -34643, -9394, -22115, -64486, -46064, -45874, 65184, 116401, 107451, 1658, 53573, 73108, 69882, 36927, -20621, 27427, 82860, 71492, 128317, 161798, 155088, 84601, 10795, 24301, 103093, 105228, 46875, 35416, -19217, -104843, -69442, -34927, -29783, 864, 15713, 62838, 52945, -1507, 56255, 99604, 122340, 107752, 23771, 43933, 59182, 4274, 22680, 70569, 179225, 211574, 191056, 173898, 126683, 112659, 92739, 113123, 113421, 78574, 41008, 54676, 54448, -36839, -118920, -74771, -67123, -79612, -65912, -79567, -123160, -109270, -110171, -123765, -165808]
10920a65808J9470j2752o878j8437K4691O9842J27559o7733q4797J05381N6010
10909D6548n0942P945L8570k8383p3212N5826M407j21215m758J43172P8661M4540
10897A41159l7416o4047J696J4720p5109M7414K9089n4197J7950O8102j9749k2279
10885D7333k8260J1009m8147j5066P8651n7030l2282N993L6012J13447L3459L2754
10873A77873r5597j45443J7561L8055n0031p4055N219K6256Q8044P5002L8749
10862A01633m5358J2601L1548l2987l4626n2830M0844r4777j44512j1359Q2756
10851a47067J5077O0884Q7116L5477k4333O280m477o4809l3188J6822R0242M2822
10839H0846J2674J4983k7519R0449j4698j19156n8065M108j6180j3993L8920L4097
$$ y = [-165808, -146338, -159090, -165968, -184405, -159714, -89872, 37687, -30046, -114843, -9462, 46548, -4394, 3551, 42121, 13738, -59474, -3648, 759, -120456, -125214, 17958, 96619, 141159, 103743, 39696, 41392, 56112, -18997, 28417, 57506, 3309, 21259, 89361, 69612, 47333, 19073, 30082, -18065, -33131, 45520, -11510, -43792, -37799, -1787, 111660, 145119, 177873, 82276, -63167, -45606, -7551, -57582, -131637, -126418, -100162, -12118, 62884, 101633, 56275, 68876, 100424, 67437, 32811, -20019, 20825, -73952, -218464, -229823, -147067, -131990, -71106, 16010, 51487, 27154, 33434, 28957, -35852, -69040, -52218, 38024, 80846, 93520, 108503, 80984, 171433, 156735, 37579, -20486, -16378, -32558, -46551, -7631, 26466]
10827B6466m9370m5359q739R5961R7950K058l6445M616K5200p912m646o1909k359
10814C5512Q966P1435Q0280P8769q362m4101L1961K5102l7351j30400j8003Q552
10802A02360J45866o0063p833J8474o1326m3682M0148L3753l7271P7317j9130
10791A88613p6145K8609L9296m8217J1395K249m7690j2834r479M1002j4513j42747
10779d0461L9597P3948p2417l5688M9907J4949l1362K0212N8720N137j4876L7881
10767A05547K6077n435p6281l2827n2299p1619J04052N9491P008M7993R5606O1264
10755B68577q6292L4378j3446j19292l9145J6746J141p4324j3952N9095M4975
10744G8461l8718o9084o6384M0753R0528n1343n6678l8882L5726N5277M2144K9062
$$ y = [26466, -22904, -68263, -77002, 18959, 116909, 118967, 82522, 87138, 112338, 104426, 99780, 37871, 35512, 44478, 115913, 196193, 274962, 266600, 222499, 254460, 279562, 242211, 111811, 93808, 102360, 248226, 188163, 180330, 198804, 137478, 93796, 133944, 167697, 130426, 207743, 188613, 112468, 141077, 180373, 132156, 143551, 145800, 98110, 85276, 75797, 116799, 102286, -40461, -864, 73084, 667, -35021, 14886, 29835, -1527, 18685, 77405, 82542, 67666, 105547, 131624, 126189, 49908, 17081, -35218, -106837, -2785, 56706, 63714, 111707, 207313, 268577, 182285, 216663, 203217, 83925, 44780, 61526, 62667, -11657, -25609, 33486, 78461, 39743, -29341, -95725, -54972, 35556, -15787, -72465, -111347, -75621, -20344, 21800, 50862]
10732E0862L3416P6359p958j7185p0431L0140k6211J409j9368o9025j4916j7680
10720e0588O5566Q7323r658N924n199p5382k3169k9597K4436n932J6021N4786
10708E4531j0260j26883m3444j9617j8624J7293M0771N9622N9360n5328p4452
10697a17031j3729Q6898N8202q3218q9014P1879J14466p257j7076J0945L6796
10686E1861j3595n9094k8411P183k4345M5705J24455M586j35468m7251K6328k1010
10674f9056m71M4558j0011P3279L2064m1969j5299J1688p2506r6213J6387O8434
10662e9115j6547J3943O8596m8762p5957N4494J3743j08704K5042R8426O1477
10651B6636k5288j0426k4564j7723p321l8252K3197P6681n836L5295N5294l6168
$$ y = [50862, 84278, 160637, 152679, 135494, 65063, 95203, 68992, 70401, 51033, -17992, -32908, -50588, 14978, 102301, 92643, 98567, 93368, 17986, -5183, -34780, -10344, -16276, -255, 54531, 44271, -82612, -126056, -145673, -164297, -147004, -106233, -46611, 12749, -42579, -117031, -130760, -43862, 14340, -68878, -157892, -86013, 28453, 21196, 4120, 15065, 51861, 38266, -20828, -49239, -42056, -66401, -20696, 103759, 108345, -27123, -74374, -48046, -69056, -69527, -24969, -34980, 38299, 70363, 28394, 13095, 24783, -47723, -143936, -127549, -59115, -75662, -61719, 6877, -41885, -117842, -63348, -49605, -158309, -133267, -34841, 26636, 1348, -9078, -33642, -51365, -58686, -96938, -73741, 2940, -2896, 32399, 87693, 51525]
10639E1525o6180r564R9264k4304p7209Q7835K1358m7013l2043j03158l4332J5610
10627a18211J1110n6249L6536Q7853O3237o0876P293J11712n412j0803K891o6248
10615B833m9246l9433k804M1302P962m2996o0527J1613j01852k4782J24783P1509
10603f1638L091R4537J7969k0920r2347r7311K0477Q2025J00458K6739m6570j10631
10591h4121l7274P3518J26304J1232p9727m1580P8279L8493j03705O773P0714
10580E8906m1434q4705M9991Q519K2074O4572K4198l389N9225N9899O5928K1984
10568C05768p7337j12846j04342k1594k5944m6349M048L7988m710M5681o228M2910
10556C7045L1610l4259m1434R210Q1918N2516k9026l3682p0589l4331o054o3234
$$ y = [51525, -14655, -24219, 75045, 50741, -26468, 61367, 82725, 35712, 3669, -99489, -133821, -118211, -107101, -163350, -126814, -38961, 24276, -36600, -29307, 82405, 76993, 66190, 69081, 2833, -46413, -85846, -88650, -47348, -39386, -82382, -142909, -131296, -233148, -257930, -133147, -61638, -58547, 35990, 53959, 33039, -59308, -156619, -136142, -54117, 46341, 73080, 26510, -84121, -121395, -47877, 78427, 89659, 9932, -31648, 46631, 85124, -18581, -11808, 58906, 17472, -67233, -17242, -8723, 13351, 77923, 102121, 98732, 157957, 217856, 283784, 305768, 228431, 115585, 11243, -10351, -36295, -82644, -78596, -40608, -45318, 363, -5865, 37045, 68655, 34396, -7038, 2172, 84090, 136606, 107580, 73898, 3309, -31022, -37076, -100310]
10544a00310j7208M5219P3737K2585j3923q4530P5483J12475L0626l6175p9937
10533B8042q5742j140j2405M2466Q9034K994n2390o6565n5008q389N2493l5911
10521a02521P4451k8388j2915J35003J593j8996k4674m7926q98j95L963k0437
10509d1940k663K2313N0466p0948p4061q668J2963M8754l7228K028P8413l8140
10497e8711J6602J00643q27n7942l788m0638R7101O6873Q2221M9043r2296j94576
10485c6295j3291P7697p0633j0451P3589P471j5525K4169L3223j768j4746J7632
10473G1072N1628n4898j8033M556K7289J03530J37647m1704m1219q1235p8906
10462G9727n508o9855r8236n5300l8241M236P9551J5774l7751J38827R574K5067
$$ y = [-100310, -117518, -72299, 1438, 24023, 10100, -74430, 1053, 113528, 144154, 107979, 28042, -57700, -58840, -71245, -28779, 60255, 63249, 10859, -55706, -110714, -119103, -66610, -102521, -28070, -56458, -69373, 65630, 67223, 48227, 23553, -24373, -25271, -25466, -21503, -41940, -44603, -22290, 28176, -42772, -116833, -125501, -112538, -63784, -101012, -98984, -20571, -58711, -42109, 58534, 57707, -235, -4023, -44661, 52440, 119313, 201534, 250577, 158281, -36295, -49586, 28111, -42522, -52973, 20616, 28087, 12562, 36731, 69954, 68186, 53440, 71072, 122700, 67802, 49769, 54325, 81614, 185144, 322791, 281087, 239868, 158633, 79727, 74219, 4364, -93872, -149172, -187413, -183177, -103626, -87852, -125603, 13224, 22798, 47865]
10450D7865k6218j9471m7779J7366l20l2541q243M0386J5747k1510K0581k178
10438a6315o6161K0367J4924Q1783m8406q1962m0511P8860K2883r841j9532l577
10426f7488J808j4527M3241k940k745R9707M7638j02063p1079K7735j3929n770
10414f0412R029R9131Q9964N7862o3717l5839k184O5408m6742m9837k4729K3255
10402F1189l3717j01029L4626M4241n6487n3746l308m7040r9124O3141M5575K6218
10390a19461R9724O6052N0930K2196j08789n0478j1553J7960k9107j6942j1734
10379i1202J8034J5318N8708K12J8556M230q378O014M8634K0253n4649n1018o8150
10366h3438Q59R9256j8718k0031l1049J9702P9698K9696O9445M6102O6246q4569
$$ y = [47865, 21647, 2176, -45603, -28237, -28557, -61098, -69341, -28955, -13208, -34718, -14137, -16315, -82476, -62109, -47185, 34598, -13808, -95770, -136281, -57421, -34538, -44379, -63911, -67488, -65680, -80207, -36966, -39906, -42651, 57056, 104694, 2631, -68448, -40713, -54642, -60412, -51383, 47748, 137712, 195574, 131857, 96018, 93834, 159242, 112500, 62663, 37934, 61189, 27472, -73557, -38931, 5310, -51177, -104923, -108231, -155271, -254395, -191254, -145679, -119461, -19737, 46315, 97245, 119441, 10652, -39826, -51379, -33419, -62526, -79468, -91202, -73168, -57850, 858, 1070, 19626, 23856, 15478, 21492, 70126, 90379, 35730, -15288, -83438, -82579, 16677, -2041, -22072, -53121, -33419, 46279, 75975, 145420, 191522, 257768, 173199]
10354A73199j37100p2735O2073k6849J5927P3674M9352O1229P9233p711j00637
10343A69655r4706L8766p3808m3888Q7001l1836k4312n1490q526L6356N0872M3723
10331I7807l5926l1231p067j03023j08685N8901J74338M2744m2003m9236L4782
10320C1401J7735p1451J2276M0638o4561p1310J7953L9498O6540n4781n8452K8781
10308f5733O168L9557l2258M731K6892j260k5675J0291l4088L8735J32106J05501
10296B04967q540p4690j83282o9693j428L3544N4952N9633J7999M7462l8515l6353
10284F056j6908J3599K6349L3582m1087J6341K5146k3104r9779p2151M8554J63929
10272H0527r427m7660l9159P821r518m0051J7988Q3977p0606K7223J8580L1804
$$ y = [173199, 36099, -36636, 25437, -1412, 14515, 88189, 137541, 198770, 278003, 270292, 169655, 74949, 113715, 39907, -3981, 83020, 51184, 26872, -24618, -33144, 3212, 54084, 97807, 61881, 30650, 23583, -79440, -188125, -129224, 45114, 87858, 45855, -3381, 31401, 49136, -22315, -10039, 30599, -33962, -105272, -87319, -47821, 18719, -36062, -94514, -65733, -59565, -20008, -52266, -47535, -20643, -21903, -47578, -37287, -71375, -32640, 99466, 204967, 196427, 121737, -61545, -131238, -132666, -99122, -44170, 15463, 33462, 80924, 42409, 6056, -10852, 2747, 29096, 62678, 21591, 37932, 63078, 39974, -59805, -131956, -83402, 80527, 71100, 23440, -15719, -7898, -17416, -57467, -39479, 44498, -26108, 1115, 19695, 51499]
10260E1499q7145m6134K5374K0819J3218Q631K3335k7413L9461N2995j0312K9156
10248I3484m9424k3257M3560J2131p5425p561Q2167n2984q3138l0387K3482M6469
10236b0883N360P0808l252N3442J9072L926n715l7414l6373O1319J9805m5221
10224H4874j01244m8893l4453K9724K0607P6099O7988K0631n1509N9780O9473
10213A93077n0889J8349m8502p5766k7525L0182N2574Q7880O2429K160j1543k3824
10201B08602q1429l4606j7097o2678j17769l0199L8842l3429P4450Q5879K4196
10190E4762j6559o3937p921K4012p1828L8091N4989J19312L9041m2402J156M2245
10178A70961M3772m6133m5921m8320n8107o8077J1413M5944J10080p811q2955
$$ y = [51499, -35646, -81780, -56406, -35587, -22369, -13738, 9597, -17816, 21645, 74640, 64328, 93484, 44060, 20803, 64363, 76494, 1069, -6492, 75675, 22691, -60447, -90834, -67352, -20883, -15523, 55285, 52033, 105475, 124547, 128473, 122758, 85344, 48971, 110290, 130095, 84874, -16370, -65263, -99716, -69992, -49385, 26714, 94702, 115333, 63824, 123604, 193077, 142188, 160537, 112035, 36269, 8744, 38926, 91500, 179380, 241809, 243969, 232426, 208602, 127173, 92567, 75470, 12792, -104977, -135176, -96334, -129763, -55313, 30566, 54762, 38203, -25734, -33655, -9643, -81471, -43380, 11609, 130921, 169962, 127560, 128716, 170961, 214733, 168600, 122679, 74359, 16252, -51825, -40412, 5532, 115612, 107801, 24846]
10167B4846l5392o9274j6020K7236k03m570o678j4249n7790M7056J17338o0570
10155d8270n4725O2065J18177J0360n513m2076m7087n397Q7387p355k5516j227
10143D0823N3157j3315j00716n4074J8124m6319L6477Q4212J18165m0365o5193
10132C0976l1962M3025K4773l9604N356m7335J7316j988J7377J09233q044k2237
10120I6886n1346q5657o3686j6204N6759Q8494N6885M333m6888j7681l2567m0018
10108e0690K6879L7728R3307Q865m8330o4622k3140N7153r516j01775l957J1603
10096f6495m1906R5038J07272P928n3869l9802o8784r676O5506J27723O8865r4318
10084I7482p9131L2225J4467L430j10232p4447j695L3112j3066L0132J00668N6158
$$ y = [24846, -10546, -79820, -95840, -68604, -68807, -73377, -80055, -94304, -152094, -105038, 12300, -48270, -102995, -40930, 77247, 87607, 82094, 40018, -7069, -12466, 74921, 67566, 42050, 40823, 93980, 80665, -20051, -74125, -56001, -102320, -65843, 18369, 136534, 96169, 30976, -986, 42039, 66812, 27208, 32564, -14771, 2545, 557, 17934, 127167, 119123, 96886, 45540, -40117, -103803, -120007, -63248, 25246, 82131, 86464, 39576, 21895, -10672, -50690, -23811, 13917, 107224, 116089, 67759, 3137, -20003, 37150, 27634, -74141, -78098, -66495, -108401, -13363, 93909, 101837, 47968, 8166, -60618, -70294, -4788, 122935, 191800, 97482, 18351, 50576, 65043, 68473, -41759, -116206, -117901, -84789, -97855, -67723, 32945, 89103]
10072H9103k532n3063j38716l4993N6183O1312J070m2886R629R9732L3804l5819
10060D2824p0626l3843P3609N7204l0832m6868O6796m7416m0966L8827O4178j5844
10048E7043K4532J48010J27309o6947o7616R579j03057o7458n6445m9668K1736
10037b2982l4673j674K3191j0343O6705O7570Q937L8564o0688r7670k7490J929
10025d8624N6752K3939l2403l8405M092M3554k9565l4426K8530r66R9027R0806
10013A62311L0568p2472j34232J185o3867p9798N9820L0756k628O6761K5526J5320
10001C9250J778P5979P725p2987m0877l6137n0583P0887J3663o0035M8814L3853
9989C1330m5976l145K7488m4704l8282r9260Q835J03939n386N3362P1589l6553
$$ y = [89103, 86571, 33508, -105208, -140201, -84018, -22706, -21636, -64522, -54893, 44839, 78643, 42824, -27802, -61645, 11964, 69168, 38336, -8532, 58264, 10848, -30118, 8709, 72887, 57043, 81575, 229585, 356894, 289947, 222331, 231910, 128853, 61395, 4950, -44718, -22982, -57655, -59329, -36138, -46481, 20224, 87794, 96731, 135295, 74607, -23063, -50553, -48624, 8128, 32067, -336, -38741, -34649, 8905, -20660, -55086, -26556, -27522, 71505, 162311, 192879, 120407, -13825, -12640, -76507, -156305, -96485, -65729, -68357, -1596, 23930, 39250, 41028, 117007, 124732, 51745, 10868, -25269, -75852, -4965, 8698, -51337, -2523, 31330, -14646, -17791, 9697, -35007, -73289, -172549, -163714, -59775, -65161, -11799, 59790, 23237]
9977B3237K1649o76o2960J6831N9410q1865N527M1849N7374M0780o9772m7105
9965D279M6651J7624l8675m2096l3229J3931L6737m243j9491Q177j19281p7618
9953b07234M5632N0825P5203K0882j26864o2669M9603Q2866J24219J1459m4742
9942A9180n2460M4100K9269l0676l8510p8646l6248M4120J4597K8785J9811J3301
9930b3377k7645L7391p885Q107k3057J8724L9774n3225l1072r2508j01599L7054
9918b19318J6966l3176J3996N9310Q9717K397L5221K6065K538l5713J2542N6092
9906B6637p383k7398o2460M7216J3522o3315l0406J2768R3261J1586N232k391
9894A6869j3545M1421j1615k6995Q9533J2480m0415l4220j0034m2136l715l3137
$$ y = [23237, 44886, 44210, -18750, -1919, 57491, -24374, -18847, 23002, 80376, 121156, 51384, 4279, 50930, 68554, 29879, -12217, -45446, -31515, 5222, 979, -18512, -10335, -129616, -207234, -161602, -110777, -35574, -14692, -141556, -204225, -154622, -71756, 52463, 63922, 19180, -33280, 10820, 40089, 9413, -29097, -107743, -143991, -99871, -85274, -56489, -36678, -23377, -51022, -13631, -21516, -13409, -36466, -17742, 22032, -31193, -62265, -154773, -256372, -219318, -202352, -235528, -221532, -162222, -72505, -70108, -34887, -8822, -6284, -41997, -29455, 26637, 19254, -8144, -70604, -23388, -9866, -73181, -103587, -90819, 2442, 14028, 19260, 16869, 3324, 44745, 33130, 6135, 95668, 108148, 67733, 33513, 23479, -18657, -22372, -55509]
9882e5509K3009n765L1498m4039M4163O3304n3477r367l7945j5544j0757L487
9870f6942j12184L0016Q8904M3401k8076j4833L7442m1275K9252k8785j1409L7586
9858c6903M4967L2755l2448l7077q357O2930J02449m5066j13670q644M734K685
9846c1645J2575P4737N8354o4938J6971N7420j4252n8731j0168q382L7090l4478
9834C4553l0583o0707N7775J1841k2808j5638O1157L0296J9111j046k3718N0681
9822A10914j36811n7727N3930L9711R234n3062K7416k8247K1426l6460l1652J06462
9810B5134l5917p0312N9359J1031k1163m7368m652K7638p7172o944M9064p1317
9798a62619N168L624K5507j239J5509M3044L4225J779j152m6508k8669l7200M5881
$$ y = [-55509, -32500, -38265, -6767, -50806, -6643, 56661, 3184, -6183, -44128, -59672, -70429, -66942, -179126, -149110, -60206, -16805, -44881, -59714, -22272, -63547, -34295, -63080, -74489, -36903, 8064, 40819, 8371, -28706, -37063, 25867, 128316, 83250, -30420, -39064, -34330, -31645, -19070, 55667, 114021, 49083, 66054, 123474, 109222, 50491, 40323, 31941, 69031, 34553, 3970, -56737, 1038, 12879, -9929, -25567, 35590, 65886, 84997, 83951, 60233, 110914, -25897, -83624, -29694, 10017, 19251, -33811, -6395, -34642, -13216, -49676, -81328, 25134, -10783, -81095, -21736, -10705, -31868, -79236, -83888, -56250, -133422, -140366, -91302, -162619, -157451, -153827, -128320, -129559, -114050, -71006, -36781, -35002, -36154, -82662, -111331, -148531, -102650]
9785a02650L9292J2418o765P3079L0217j0801j09906q0932N6594L3638J0654J6286
9773c8876j2543L3565J0646R123K9466j9414n9732L421q082p8745O8416R4300
9761C1545J8869K1142j2873p779q240Q7013j7071m523o3816l6518n9888l7328
9749h9467J9706N0618K1962l0050K0465q0212r3896j729N7337J01903n736k8780
9737e7879p749M7403J2769o4613J5927P7617R8707l473r0743J8854q713O730l0748
9724A4089r8577M007L1631P816M6892l134l632o4496r5732J1767J22091L6696
9712I418n4619K3436m2765k2250l8653n9256L141O8701Q6105m6953j05588N0683
9700a28600J24790J05584n3763k8209m3236K9061L39o4427n7160q2075m305m5611
$$ y = [-102650, -63358, -50940, -57705, 15374, 45591, 34790, -75116, -156048, -99454, -65816, -55162, -38876, -51419, -17854, -7208, 1915, 31381, 11967, -47765, -44344, -52426, -131171, -62755, 31545, 50414, 71556, 58683, 50904, 42664, 129677, 112606, 108083, 44267, 7749, -52139, -89467, -69761, -19143, 2819, -27231, -6766, -86978, -180874, -182603, -125266, -23363, -29099, -57879, -65628, -18225, -5456, -70069, -54142, 23475, 122182, 118709, 27966, 46820, 38107, 44837, 14089, -84488, -80481, -48850, -41034, 5858, 2724, -908, -65404, -161136, -149369, -27278, 9418, -45201, -21765, -64530, -86780, -125433, -184689, -181548, -112847, -26742, -73695, -179283, -128600, -3810, 101774, 48011, 19802, -23434, 5627, 5966, -58461, -115621, -197696, -202001, -247612]
9688b47612N4166P9998K1588k6398p0597O7821J9709J0436N9674J0191r240o1793
9676i2057J8128k5718n9720j2529O9067M6977k0714k6075j3930N5696k7535k8157
9664a16567M1138k1594M3138Q9998n2584j24352N9198J81935O8795L3414q3439
9653A19080n7745q565l0615j17364r172q620M8669r06m7602k1755k655K2776j7229
9640a31703J0130M5080N7287N6404l7399n2423Q6375J8763m3648K4941j0588j1374
9628A1845q7112j06663J6494O0370J03649j3361k3116j2643O3798N670j6192l9040
9616c6301j3934o9643P5621R2056j2487l3684Q3883Q2375p5268p448k7301o1395
9604c526N8420O9764k8861j566l8249r9764P967J5256j8565j8546O0256N9248
$$ y = [-247612, -193446, -113448, -91860, -118258, -188855, -121034, -101325, -90889, -31215, -21024, -30264, -92057, -73929, -99647, -159367, -171896, -102829, -55852, -76566, -102641, -116571, -60875, -88410, -116567, -75429, -97023, -53885, 36113, -16471, -140823, -81625, 100310, 169105, 202519, 119080, 61335, 52770, 22155, -95209, -104381, -113001, -64332, -65238, -112840, -134595, -137250, -114474, -131703, -121573, -76493, -19206, 37198, -201, -52624, 33751, 52514, 8866, 33807, 23219, 11845, -75267, -181930, -165436, -105066, -1417, -14778, -37894, -50537, 13261, 18931, 2739, -36301, -50235, -119878, -44257, 47799, 35312, 1628, 85511, 167886, 92618, 85170, 57869, -3526, 54894, 124658, 95797, 94231, 55982, -43782, -35815, -20559, -39124, -57670, 2586, 61834]
9592F1834r161J9790k4268m0993N7604J09l3307k1931j3639J4405J3308o4973
9580d1222k7580O7008l591l1449Q0948M3225N6959l5410n6318j0831M2247L7864
9568A21850M0742N5339J3891n0174j8596o1855k151K1479P4898p2018m1179n9425
9556B2801m1858L794N2004M6861m4771m7855j0174k2819j00950j3070Q3975O7388
9544d674M1256M5946j1283k0102n0855l3578r3677j3435M8072L4658J07140n7439
9532g971K2832Q3385n6615J5052J9567k7193K5788q650p9633P562M3480N633p7633
9519c4396k2925Q824Q8842N7857r5610J0796l3484k5928l2175j8557P9143M4742
9507B7129k9633M3677Q835l9773l0153n6290j5658N7754J5305M8933k7261p5288
$$ y = [61834, 52673, 72463, 48195, 7202, 64806, 64915, 31608, 9677, -3962, 10443, 23751, -41222, -68802, -1794, -5385, -36834, 44114, 87339, 144298, 108888, 52570, 41739, 83986, 121850, 162592, 217931, 231822, 181648, 163052, 101197, 99046, 120525, 195423, 123405, 82226, 22801, -19057, -15263, 36741, 83602, 38831, -9024, -19198, -42017, -142967, -156037, -72062, -4674, 36582, 82528, 71245, 51143, 288, -33290, -126967, -140402, -92330, -57672, 49468, -7971, 14861, 98246, 41631, 56683, 76250, 49057, 74845, 66195, -13438, -5876, 37604, 43237, -34396, -57321, -48497, 40345, 98202, 2592, 13388, -20096, -46024, -78199, -96756, -17613, 27129, -2504, 41173, 50008, 10235, -19918, -76208, -91866, -34112, -18807, 30126, 2865, -72423]
9495g2423N7985L2785N6638O3893K195o8602N3987p5649m118K3366l8225j07721
9483g5889K2945N5605K1384k1484l1856L2692O1695l8941j11727o8327N8016L4939
9471f0948L9657j1357l0967K6771P2736k3381K4760j8724j3103n0336l14K6583
9459a8623Q2482M5954J9008j20928l8579M7262j6756m2596j3574O8553N3771p7702
9447a1728p7456J3653j53L3056N9484M6135N1854O2434j4536K7214j2503j1756
9435A65698q1776p0363P0776O244l2894n040n261O7087N3082q8610r4767k9307
9423d5131J9191N2493o417L162M3781L6595m2819k346M7609j9676L2096K7965
9411A46503n5594j593L3494N4916M422k2398O1007K377n1847o5130k8522l7574
$$ y = [-72423, -14438, 18347, 74985, 138878, 141073, 72471, 126458, 50809, 46691, 70057, 31832, -75889, -52944, 2661, 24045, 2561, -29295, 3397, 65092, 26151, -85576, -153903, -95887, -60948, -21291, -32648, -63615, -36844, 35892, 12511, 37271, 18547, 5444, -44892, -45206, -18623, 63859, 109813, 128821, 7893, -30686, 16576, -180, -42776, -56350, 12203, 65974, -11728, -89184, -75531, -75684, -42628, 16856, 62991, 114845, 177279, 162743, 189957, 177454, 165698, 83922, 13559, 84335, 90579, 57685, 52645, 47384, 114471, 167553, 78943, -15824, -45131, -25940, 26553, 20136, 23298, 67079, 103674, 60855, 58509, 106118, 86442, 118538, 146503, 90909, 89316, 122810, 177726, 182148, 159750, 220757, 223134, 171287, 106157, 77635, 40061]
9399D0061J4684n565J6587M0410L3345J8345l6198K337l8833J3474j8371J1515
9387I1791J3795O6690K7500L4404k0687J992K2910n1048j1502l0339j06189p905
9375C1412k150N787M3949Q0317m7017r9928k0946n285k8702K5900J29882L6330
9363A49549j7495q0530m846M5814M0888o5508M5746R2676o0072l4959K3381p024
9351A27620n7500r2587M9821M9463J37453k8050J0696J4544p1548M9373l9553
9340A49732j12347K6293r2439l236Q2571j7353P2717Q7366J6382P2016m8126j3521
9328B20055R4884n8524p1855o8325q5442j261M3406Q814J04133O3683L3872M5579
9316C29019k7281r815r047j00252k0646o2191J9820K6471p1567k8438R0969M5340
$$ y = [40061, 54745, 49180, 65767, 106177, 139522, 157867, 121669, 124006, 85173, 98647, 80276, 91791, 105586, 172276, 199776, 234180, 213493, 215485, 238395, 187347, 175845, 145506, 39317, 31412, 29262, 35049, 78998, 159315, 112298, 12370, -8576, -13861, -42563, -16663, 113219, 149549, 132054, 51524, 46678, 92492, 133380, 67872, 113618, 206294, 146222, 111263, 134644, 127620, 70120, -22467, 27354, 76817, 214270, 186220, 196916, 211460, 139912, 189285, 149732, 37385, 63678, -28761, -31997, 50574, 33221, 105938, 193304, 209686, 281702, 233576, 220055, 314939, 256415, 184560, 116235, 30793, 29532, 72938, 81752, 185885, 249568, 283440, 329019, 301738, 291923, 282876, 182624, 161978, 99787, 119607, 146078, 74511, 46073, 137042, 182382]
9304A82382j5402o9445r1505J19849N2011o0155O533K8224M0694n5059l6068N1800
9292A53859N701j9766l4576m3087q9214K6683N1068O1392P0346m9171r6749K2926
9280E9412L2909k3846q6966o8314N4560J28381m2941J7322O1500j0520L4143l4143
9268A21497K0459J05630P502P7436j03615n8125P1124O2626o5741M5529O7722
9257C52044j3542o4870M87Q5534O0022l5885r2091m6632o5704k9656k9529r8464
9245B1714O8135J19232n794j8621l4246L029O2344K7129n6243K784l5096l4627
9233A19740J021r0019l5956N7831P3939L4061N2302M7750k3373p9615N577l6353
9221A26905L6836l3261L2590N975J8477J18754o6426q7829k3347j966O489k7605
$$ y = [182382, 166980, 97535, 6030, 125879, 177890, 117735, 124268, 152492, 193186, 138127, 102059, 153859, 159560, 139794, 105218, 62131, -27083, -400, 50668, 112060, 182406, 133235, 36486, 59412, 92321, 68475, -18491, -86805, -32245, 96136, 53195, 70517, 132017, 121497, 155640, 121497, 141956, 247586, 255088, 332524, 228909, 170784, 241908, 304534, 238793, 284322, 352044, 338502, 273632, 274119, 359653, 419675, 383790, 291699, 245067, 179363, 149707, 120178, 21714, 89849, 209081, 203287, 184666, 150420, 153449, 215793, 242922, 186679, 189463, 154367, 119740, 120761, 30742, -5214, 52617, 126556, 160617, 212919, 260669, 237296, 157681, 163258, 126905, 163741, 130480, 163070, 169045, 187522, 306276, 239850, 152021, 128674, 126708, 133197, 105592]
9209A05592K8030P2476P2122k8043p5177J13537n7096p2289m0042q805r108J3755
9197A14952Q4042m2904q559k4405L7255j7528j14970K8614N6557N7474O7403j148
9185B36783M6875j3851k3325j8502M0009Q7595L7483M0087m1993m682l9975k0120
9173C26384l2087j8364Q1817L0673k8422J5454k8162l5709Q1294O1494Q6176J11743
9161F52291J28031n8510j5939J30983J01406Q768J19363K69897K88039K56758
9151A881087K59755M30039O93618R14282J299147J977600K773391L119002K527259
9142A5875180R27034o20412j748187k401013k623311k310106j627252j169444
9134D302489q00019o34197m66979l82525j89078k62950j20933m4236j40581j74281
$$ y = [105592, 133622, 206098, 278220, 250177, 175000, 288537, 231441, 159152, 119110, 110305, 101197, 114952, 198994, 156090, 147531, 123126, 160381, 142853, 27883, 56497, 113054, 170528, 237931, 236783, 283658, 269807, 246482, 227980, 267989, 355584, 393067, 433154, 391161, 386479, 346504, 326384, 294297, 275933, 357750, 388423, 360001, 375455, 347293, 311584, 392878, 454372, 540548, 652291, 780322, 721812, 705873, 836856, 938262, 947030, 1066393, 1336290, 1624329, 1881087, 2140842, 2570881, 3264499, 4178781, 5477928, 7455528, 10228919, 13347921, 15875180, 16802214, 16181802, 14433615, 12032602, 9409291, 7099185, 5471933, 4302489, 3502470, 2868273, 2401294, 2018769, 1829691, 1566741, 1445808, 1401572, 1260991, 1086710]
9124A086710p2516j00036j53976j14931j14169k3159r287K9972k122j31692k5603
9113C69191K6800O180k1733l9706N766P3815J08444J6733n2694j4911J8214L5224
9101E31323L8233n6257j40106n6501k0556L2975J11179q2753o2030l1916P4898
9090C38489N7601L5901K5101m622q8512K4566O7787P9093n7414p8197O0706P3923
9078E34422K0442K7661J2906k1853j9498r557M9882K2997o7747n8634o6324p2978
9066C51719o020M1581R3949r815o9662k2422k799l0497J9080n8481k5751k3818
9054B57064L0882q056m817l7811R4087J13942j7730J3356N1860N61L2051K1748
9042E47137o5551m4123K8279J00829L1841N4147K2627L0473R5971J35908N9632
$$ y = [1086710, 1014194, 914158, 760182, 645251, 531082, 507923, 498636, 528608, 526486, 394794, 369191, 395991, 402171, 380438, 340732, 346498, 420313, 528757, 545490, 492796, 477885, 496099, 531323, 569556, 513299, 373193, 316692, 296136, 329111, 440290, 357537, 295507, 263591, 338489, 396090, 431991, 457092, 452470, 363958, 388524, 456311, 535404, 477990, 399793, 460499, 534422, 554864, 582525, 595431, 573578, 554080, 544523, 594405, 617402, 549655, 491021, 424697, 351719, 345699, 387280, 481229, 471414, 401752, 379330, 376531, 346034, 365114, 306633, 280882, 257064, 287946, 279890, 275073, 237262, 331349, 445291, 427561, 440917, 492777, 493338, 525389, 547137, 481586, 437463, 465742, 566571, 598412, 652559, 675186, 705659, 801630, 937538, 997170]
9031I97170j7006J17142M1840r3671p3025j34016l4432j06694n0549n7241q7710
9020E01808j20053K7646Q5518Q3217K9501m947l7121k7191p5992j0031O7866N8403
9008E78624j0956m3587k1715k1150N6209J00227l0819j20129o0683l9245M3615
8997D30391l1672K1936j7184M7379P0297L0941L454j1572r0328K9154N9435J22738
8985F64969J12824J12831R440M3959O5576R8392O3478N0174j00648j59810j17650
8974H43535J5155p0269j00509q3728n3029o3211K2860L3597L6905n9891K1415
8963E42830O348n9215L1796l0601m211O607q9659p6247k1580k0249J0800j2797
8951B83822j0698L6045l1494J09532j3772q4098J0411k4672M1568L3377m6573
$$ y = [997170, 980164, 1097306, 1139146, 1045475, 972450, 838434, 804002, 697308, 646759, 589518, 501808, 381755, 409401, 494919, 578136, 607637, 602690, 565569, 538378, 462386, 452355, 520221, 578624, 567668, 524081, 502366, 481216, 537425, 637652, 606833, 486704, 426021, 386776, 430391, 398719, 420655, 403471, 450850, 521147, 552088, 555542, 543970, 453642, 482796, 542231, 664969, 777793, 890624, 900064, 944023, 1009599, 1107991, 1171469, 1221643, 1120995, 961185, 843535, 858690, 788421, 687912, 604184, 551155, 487944, 510804, 544401, 581306, 521415, 542830, 549178, 489963, 521759, 491158, 486947, 493554, 403895, 327648, 306068, 285819, 296619, 283822, 273124, 309169, 277675, 387207, 373435, 289337, 299748, 275076, 316644, 350021, 303448]
8940C03448r574J86848K00127l6664m1667N2288J55764J06657o910l1883o1928
8929H16506j08982p3062n8591r7982k8252j19287J3902J12602P5106j09732j44942
8918B77286P0298J9788M8778o5871r3520r2513k1135K7457N1464l0287k6899m3914
8906A20932M9185m1976O0980L4464P233M6405N7615O0383J6613l9057n2409n0559
8894B69809p1675l2437M0332N2344N1251k6700O7908P4509P5931m944k0424r274
8882D66630l4511l8451J453O4094j5329m0390k1881m9708M2357M0673o1453n8499
8870B94985J7656j00493J2618J3638j7508n6024Q9772M2090k5858K5223n5971
8859B40128O216P3363R1482j8101j41139r2368J03415J40585P0177l0600l5578
$$ y = [303448, 293874, 480722, 680849, 644185, 602518, 654806, 810570, 917227, 910317, 878434, 816506, 707524, 634462, 575871, 477889, 449637, 330350, 344252, 456854, 531960, 422228, 277286, 347584, 367372, 416150, 350279, 256759, 164246, 143111, 170568, 222032, 191745, 164846, 120932, 170117, 128141, 189121, 223585, 230818, 277223, 334838, 395221, 411834, 372777, 320368, 269809, 198134, 165697, 206029, 258373, 309624, 282924, 350832, 425341, 501272, 496328, 475904, 466630, 432119, 393668, 395121, 459215, 443886, 403496, 381615, 331907, 374264, 414937, 353484, 294985, 312641, 212148, 224766, 238404, 220896, 164872, 254644, 296734, 270876, 296099, 240128, 246344, 319707, 411189, 393088, 251949, 159581, 262996, 403581, 473758, 443158, 407580]
8848D07580o1228K6587J02952k4145k6357l2073m7776J8902j06437N8221R8357
8837D14583k6910Q701O7613n6280l8045m0478J086L7021L0039O3619J486q7369
8825C75066O11o7656n4069j6146M0001l8695l4041J3704K1979p6847l0918M82
8813A33471J82218J10975p983p8485p0275L0609N4242P6048K3011l5163p0955
8802C47713M7245J3117l3133j6000L6835K1223M4744n1226K3599Q031l2521L4716
8790D44343k6184K5155J33318O6054m9866L3962l1846k6344k8709Q391M0793o2466
8778E26601n4524p6571j8135Q9287n9701k6092n7425j7346n746O4498j6546k9175
8766C19125k4175q467J8257j5315Q4469N7561N222k7915J4387K7567q3757q40
$$ y = [407580, 346352, 372939, 475891, 451746, 425389, 393316, 345540, 364442, 258005, 316226, 414583, 387673, 396374, 463987, 407707, 369662, 329184, 330270, 367291, 397330, 460949, 462435, 375066, 375677, 308021, 253952, 237806, 277807, 239112, 205071, 218775, 240754, 163907, 132989, 133471, 315689, 426664, 418681, 340196, 269921, 300530, 354772, 430820, 453831, 418668, 347713, 394958, 408075, 374942, 358942, 395777, 417000, 461744, 410518, 434117, 442148, 409627, 444343, 418159, 443314, 576632, 642686, 592820, 626782, 594936, 568592, 539883, 548274, 589067, 526601, 472077, 395506, 377371, 466658, 406957, 380865, 323440, 306094, 300348, 364846, 348300, 319125, 294950, 286483, 304740, 289425, 373894, 431455, 436677, 408762, 423149, 450716, 366959, 366119]
8754C66119J23926N1371j2802k1449o0757r5245R1983J06423O2480J593j6722
8743E96920j13080J61j8582o0843k4282L6904J9665M1392J3461j96091j3666R6516
8731C78475L1746O8161J15025k5803o6944k5615J834q3404k2344l3303j6641R7165
8719D18352J60693m1216K6806k4718m6672m9243J1269M9373O5127O4500K6036
8708F60307p7739o3465q2416P0019P492J1525r936k5158m1719J5872k6702N5667
8696D93747P1898K3445l0066m5605K1133R1868J8059m014P0373j1527o7361o669
8684F25281j52511j04263R3098O1049J2878O2104O4919n6505p1899J17851n3055
8673E98947Q433j0782l0832q308j14395r8058L6845K2500N6380r455r1972o6615
$$ y = [366119, 490045, 541416, 528614, 507165, 446408, 351163, 443146, 549569, 612049, 613642, 596920, 483840, 484001, 465419, 404576, 380294, 417198, 436863, 478255, 491716, 295625, 281959, 378475, 410221, 478382, 593407, 567604, 500660, 475045, 476879, 393475, 371131, 337828, 321187, 418352, 579045, 537829, 564635, 539917, 493245, 444002, 455271, 504644, 569771, 634271, 660307, 582568, 519103, 436687, 506706, 514198, 525723, 515787, 490629, 448910, 464782, 438080, 493747, 565645, 589090, 559024, 513419, 534552, 626420, 644479, 640465, 710838, 699311, 631950, 625281, 472770, 368507, 461605, 522654, 535532, 597636, 662555, 606050, 534151, 652002, 598947, 607380, 596598, 565766, 557458, 443063, 345005, 381850, 404350, 460730, 451275, 359303, 292688]
8661B92688N1163J07811J04M487l8309j0332M7167o8823n7542K1421K1210L2536
8649D03581M4171L1516n9035j8280M8913j8278n469K2473o9360L0767Q3140n0894
8637D43245l0124J9448P4794M998N906o5619r4766j37128k50O0955P5616J1934
8625C69009k7590p99J2287l552K3366P7613p646L0438P380r0502m361P9186M8158
8612E12987L1506r4710q7883p8985l912M0417Q5952P3278Q3449N208o1236m2667
8600D63404N213p7055P7255J75230K0322q5568n8217m0921j244j34197m5202L9818
8588C38838m4942o4428J38474Q750N280J0760l2435o2959l1109K1653M2975r5633
8576B35224k5598J35734O913o7846p541k6924k9324n4907j04040P5010K21191
$$ y = [292688, 343851, 451662, 451766, 456253, 417944, 407612, 454779, 385956, 328414, 349835, 371045, 403581, 447752, 479268, 420233, 401953, 450866, 432588, 427119, 449592, 380232, 410999, 494139, 443245, 413121, 432569, 507363, 512361, 518267, 452648, 357882, 220754, 220504, 281459, 357075, 369009, 341419, 340620, 352907, 349355, 372721, 450334, 442688, 473126, 480506, 390004, 385643, 464829, 512987, 544493, 449783, 361900, 282915, 279003, 319420, 405372, 478650, 562099, 567307, 506071, 463404, 468617, 391562, 468817, 644047, 664369, 578801, 520584, 479663, 478419, 344222, 299020, 338838, 293896, 229468, 367942, 376692, 381972, 392732, 360297, 297338, 266229, 287882, 330857, 235224, 209626, 345360, 352273, 284427, 276886, 249962, 220638, 165731, 61691, 136701, 357892]
8565C57892K1631m9936K5884M4849k8978l6980p5172O009K7547k741L6006P0263
8553C96274K5259r9481m7561m6843K9255o128J5024K5618j4609k0208k5086k6608
8541B04906l9288l112l4870J6575L6150K3801l3443r6761n8915M1012J54287j3244
8529A97098q0020k3589J4103R5248J8459P6776j0077N2724k8973j3102k1144m7200
8517B30303Q589l6027n2069o1116K1605K6791J1794r629m0026j7125k3381o1392
8505a683J08946J926m810J6174n3927k780N8308M9361m6703o2050L9291Q3699
8493A85752O3634K9984j38866n5895J3032n6338M4869P7438J4445k7535m5781
8482A04739l9854k683J34270m74k6487L3233o0297m0808j7325N905m7206j8360
$$ y = [357892, 379523, 329587, 355471, 400320, 371342, 334362, 259190, 265199, 292746, 290005, 326011, 396274, 421533, 322052, 274491, 227648, 256903, 250775, 265799, 291417, 276808, 256600, 231514, 204906, 165618, 162506, 127636, 144211, 180361, 204162, 170719, 73958, 15043, 56055, 210342, 197098, 117078, 93489, 107592, 202840, 221299, 298075, 287998, 340722, 311749, 298647, 277503, 230303, 238892, 202865, 150796, 89680, 111285, 138076, 149870, 140241, 100215, 83090, 59709, -1683, 107263, 109189, 104379, 120553, 66626, 63846, 122154, 171515, 124812, 62762, 102053, 185752, 249386, 279370, 140504, 84609, 97641, 41303, 86172, 163610, 178055, 150520, 104739, 64885, 62202, 196472, 195998, 169511, 202744, 142447, 101639, 84314, 90219, 43013, 24653]
8470B4653N2020R1316K0404l3014j39524o0445n91Q375L6489L4418j6259M1344
8458E9186M0984k3592l6662M1119R9109K1712k8435Q047q4619J1823J8679k1543
8446A05808N7995J7660L3782p5379l2074j5394l6732o7225J9414j7140P0944P7502
8434A39161K5404P0126L4187k5968p6594m975m7201l116J1410o4639K7146M1829
8422A26770J5003K7067l4808n8557r76N283J7972P7343o2516k3301j52440k4661
8410h7821J00526J28130N2763m4760M378N9114m5175m6381n3617j5282K6682l1005
8398D7552L7641K9217k8485o3508J841R7226J29621r789m3197k1458N1309J04181
8386C32151J53457K89081K33994Q1507j64270r0635j03667j53491j81296p1713
$$ y = [24653, 76673, 167989, 188393, 155379, 15855, -44590, -45181, -36806, -317, 34101, 17842, 59186, 100170, 76578, 39916, 81035, 180144, 201856, 173421, 181468, 96849, 108672, 127351, 105808, 163803, 181463, 215245, 139866, 107792, 92398, 55666, -11559, 7855, -9285, 61659, 139161, 164565, 234691, 268878, 242910, 166316, 161341, 114140, 111024, 122434, 57795, 84941, 126770, 141773, 168840, 134032, 75475, 74499, 79782, 97754, 175097, 112581, 89280, -63160, -87821, 12705, 140835, 193598, 148838, 153216, 212330, 167155, 120774, 67157, 51875, 78557, 47552, 85193, 114410, 85925, 22417, 24258, 121484, 251105, 241316, 198119, 176661, 227970, 332151, 485608, 774689, 1008683, 1090190, 925920, 835285, 731618, 578127, 396831, 325118]
8376C25118m7857q6591m0244j5584P7428J35709r1265j15988N0860k383M6287
8365B35490n1588j8199L299K9549N7375k4251j8095L6137K421l7506p9078m5737
8353H9817J41434K54261K57723J96433K3675n086k5239k25102k55739r0421j56588
8342B05168p5963M2003m1491k2815J13647M5008m0523o0383K7898N819j7907l5608
8330A44853J5557k6267j43J22857n9930j55109R0486P3736k6693N7089k4779q1494
8318A30163k4364o972j0713K3893P7533k4771k4940L7024j22754l3956M3981n38
8306F3586k0722K7231r493N0819N9521L7172j2374j00318r5781Q5884J01763k81
8294A87007P2942n3650j5320K6354j3709m6480L9929j3940j05407l0794M5014
$$ y = [325118, 277261, 190670, 150426, 134842, 212270, 347979, 256714, 140726, 191586, 189203, 235490, 183902, 165703, 169002, 198551, 255926, 231675, 213580, 249717, 252138, 214632, 135554, 89817, 231251, 485512, 743235, 939668, 963343, 958257, 933018, 707916, 452177, 361756, 205168, 129205, 171208, 129717, 106902, 220549, 265557, 225034, 164651, 192549, 198368, 180461, 144853, 160410, 134143, 134000, 256857, 196927, 41818, 132304, 206040, 179347, 236436, 211657, 130163, 105799, 98827, 88114, 112007, 189540, 164769, 139829, 176853, 54099, 20143, 64124, 63586, 42864, 70095, 60602, 111421, 170942, 208114, 195740, 95422, -359, 85525, 187288, 187007, 259949, 206299, 190979, 217333, 203624, 157144, 197073, 183133, 77726, 46932, 91946]
8283I1946J8993R0724M7610o9064n2659j03454l9269M6591L3435R4413l9435l9193
8271H0638n8242o3219J6187Q1613O7084P0529L2014n0283l6827L6656j1895p4684
8259H9571l5622L8532P7974q502J0138N8061p820n1145P935J8217P6489L7941
8247C11769j28126j07463M6100l1947m2516J09095M3076k2795o7507m4380o2202
8236C104j3598O4625r063p6000M3046R053L0098k698j7556L7597Q2541J09105
8224B60254J9083o8903q1908J6695L6868m7083j9895K4962j1468j012n6633L9686
8212A10646q108Q0083K1085R466j9912n3395J8255M9701k1212n6212q3064j21101
8200g3768K5549J33272J01494J02295j7657j10244r7687O1020P5030k8170j7024
$$ y = [91946, 110939, 201663, 249273, 180209, 127550, 24096, -15173, 31418, 64853, 159266, 119831, 80638, 22396, -40823, -24636, 56977, 124061, 194590, 226604, 176321, 139494, 176150, 164255, 89571, 53949, 92481, 170455, 161953, 172091, 230152, 222332, 171187, 179122, 197339, 273828, 311769, 183643, 76180, 122280, 90333, 47817, 156912, 199988, 177193, 109686, 65306, 3104, -10494, 54131, 45068, -30932, 12114, 21167, 51265, 48567, 31011, 68608, 151149, 260254, 279337, 210434, 128526, 145221, 182089, 135006, 115111, 140073, 128605, 127593, 70960, 110646, 102538, 182621, 203706, 213172, 193260, 139865, 158120, 207821, 186609, 130397, 47333, -73768, -48219, 85053, 186547, 288842, 271185, 160941, 63254, 124274, 199304, 171134, 154110]
8189A54110J6452L6788J152q6267R6810O6947p457k6429p9252K0585O9557J0170
8177B73166J05132K5623r455j0344m0450p9524j1666k0825L0926N712M7859n4193
8165B61961m8302L6353J5502l2063J5290o4292l7645R9617R2779j21K4325N0116
8153D13520K338q1345q2431L8547J21772L3745M8581Q2284M9322Q5022K63516
8142I74871L95567L01384L60996L80124K06254m3414k31851k86353k39884k86434
8132A531260l20808j59184j24597j24972r533J8885k7109j5147m5214j08205j10597
8121E04779M3128k7071o2746J6977J56585O597j39248l1375N4247O5270O1850
8110F48993J0477P7028q1033N152m3068n4233P0152J04375P7536Q0307J36372
$$ y = [154110, 170562, 207350, 208502, 122235, 219045, 285992, 278535, 252106, 172854, 193439, 262996, 273166, 378298, 403921, 394466, 384122, 343672, 264148, 252482, 231657, 262583, 268295, 316154, 261961, 213659, 250012, 265514, 233451, 248741, 184449, 146804, 246421, 339200, 339079, 363404, 413520, 415858, 334513, 252082, 290629, 412401, 446146, 494727, 577011, 626333, 711355, 974871, 1370438, 1671822, 2032818, 2412942, 2619196, 2575782, 2343931, 2057578, 1817694, 1531260, 1210452, 1051268, 926671, 801699, 792166, 811051, 783942, 768795, 723581, 615376, 504779, 547907, 520836, 458090, 475067, 631652, 638249, 499001, 467626, 521873, 587143, 648993, 659470, 736498, 655465, 660617, 617549, 563316, 633468, 737843, 815379, 895686, 1032058]
8099A032058N6569J92810K81849M67690Q13694R73995R30642N38713J20953k11755
8089E197218m96362q06265p32059n63132m81528m42903k86648j60568j33084j0721
8079A083948j17030o4178K679n523p0616p0687j9598o5071M1476L5879l5042j0304
8067G05933n4205J18690J55523L6432l74j5074k5526M9739J10929J29845Q7267
8056A299179J66966M28896P52330J041235O85207N8688k00915l53021l81807k01389
8046C295369N6125J72575J06656k21l03998l47455m15178m12012l72008k45691
8036A534162k14712j04090j22079m2541n6611j13163j11154L6466O1477M3482
8026I11237m5558k0110j2863L7610O1978l176N9967P7308J27007O0840M5135J69262
$$ y = [1032058, 1088627, 1281437, 1563286, 2030976, 2844670, 3818665, 4749307, 5288020, 5408973, 5197218, 4700856, 3894591, 3162532, 2599400, 2117872, 1674969, 1388321, 1227753, 1094669, 1083948, 966918, 902740, 905419, 899896, 829280, 758593, 738995, 673924, 715400, 751279, 716237, 705933, 651728, 770418, 925941, 962373, 961999, 946925, 921399, 971138, 1082067, 1211912, 1299179, 1466145, 1895041, 2647371, 3688606, 4373813, 4432501, 4231586, 3878565, 3496758, 3295369, 3351494, 3524069, 3630725, 3630504, 3326506, 2979051, 2563873, 2151861, 1779853, 1534162, 1319450, 1215360, 1093281, 1050740, 994129, 880966, 769812, 806278, 867755, 911237, 865679, 845569, 832706, 870316, 932294, 929118, 989085, 1066393, 1193400, 1254240, 1299375, 1468637]
8014A468637K86281N54810J026071J518791J837225K291290K357822P38315r46793
8005A1132449j656830j990624k002713j530773q66518n37646m15047j99413j75771
7996A757114o0905o1512r5895j81683j84646j44955k1322q6505p9623j17575J0776
7985G33269l9419j23514p0567L6876M4951m609N2610L8088L3911N3324L8311l963
7973G89268L0117J8875k4008l0560p5213p5548K4122J7856k2129n2379l3528k3968
7961E42905j62100l5739M7930k9653L5430K2833r3747l8343q414k2706k1005K9856
7949B67247l0428N6753R9237K9134N0376Q671j05509r5909J1766M3494p799J715
7937C28748n5087J0023M4898N6075J09688M4295O4097k1461J5725J05530J40378
$$ y = [1468637, 1754918, 2309728, 3335799, 4854590, 6691815, 8983105, 11340927, 12079242, 11132449, 9475619, 7484995, 5482282, 3951509, 3084991, 2547345, 2132298, 1932885, 1757114, 1696209, 1634697, 1538802, 1357119, 1172473, 1027518, 1006196, 919691, 840068, 722493, 733269, 693850, 570336, 499769, 536645, 581596, 576987, 629597, 667685, 701596, 754920, 793231, 789268, 819385, 838260, 814252, 783692, 708479, 632931, 657053, 674909, 652780, 600401, 566873, 542905, 380805, 345066, 392996, 363343, 398773, 421606, 327859, 289516, 281102, 258396, 237391, 267247, 236819, 293572, 392809, 421943, 472319, 480990, 375481, 279572, 291338, 334832, 327033, 328748, 273661, 283684, 328582, 384657, 494345, 538640, 602737, 581276, 597001, 702531, 842909]
7926H42909O475l1632j46480j08827k8116m2823o7539j34748k5561J22683K3759
7915D10100P998o141m1780r3743l8365J6009k68J3625r163n3723L405M973K0212
7902B33139q856P7535N7362j35166j4697O319n7315L730K7829J2966J08154J5583
7890C26583n4861j5078M2680K3927J0953l2029L720L4200Q2842j4813r378p4171
7878C24575K9480J7064l5880m8607J0191o4380M9587L1645p7297j9302n9384q916
7866A48776J07011Q3881M5436L7695J2997k585j7775j8426l9495M23L5679k6307
7854C67310l3122j0604J7974k0392l5765p5219l6095l0342Q7273k2287l8702K4574
7842A94603M8630Q6196M1557K3545J0312J9684k071m5542J5324o5377j9188K148
$$ y = [842909, 849384, 817752, 671272, 562445, 534329, 491506, 423967, 289219, 263658, 386341, 410100, 418098, 411957, 370177, 276434, 238069, 254078, 253810, 267435, 258272, 204549, 207954, 212927, 233139, 224283, 301818, 359180, 224014, 209317, 215636, 158321, 162051, 189880, 202846, 311000, 326583, 271722, 256644, 299324, 323251, 334204, 302175, 305895, 340095, 422937, 408124, 398746, 324575, 354055, 371119, 335239, 286632, 296823, 232443, 282030, 313675, 236378, 217076, 157692, 148776, 255787, 339668, 385104, 422799, 435796, 433211, 415436, 397010, 357515, 357938, 393617, 367310, 334188, 323584, 341558, 321166, 285401, 210182, 174087, 143745, 231018, 208731, 170029, 194603, 243233, 329429, 370986, 394531, 404843, 424527, 422456, 376914, 392238, 326861, 307673, 309821]
7830C09821j0134k0159P4953N0098L3628j7172K7770M077K468M2487R1331K2159
7818F11327j2152j2907n0731o1663L6996N8227k1892p7120n5150J8443l296k1066
7806D09016O8863R378m2654n6910K5589R4097l0126n6396K8711j9128m174k110
7794D24156j4055k7019o2426j5866N6391K3406K9641M4223m2586m4354L5898M9809
7782D57218p447N672J5666R09O0002l2237j0021l7767J6814J5806m1089J174J7339
7769D62039J3877L5078j18214p5489J11034l0722L4824J4492N1669l2268m4759
7758D21561N5597R7839J6857p3489n5606r8961J83J548P4855K1903q9555j25511
7746B47221N553J64306P1064o0930j11261r1603q332Q2267M1080l5392O5090M5838
$$ y = [309821, 299687, 279528, 354481, 404579, 438207, 421035, 448805, 452882, 455350, 497837, 589168, 611327, 599175, 586268, 535537, 473874, 510870, 569097, 547205, 470085, 414935, 433378, 430082, 409016, 477879, 487257, 444603, 387693, 413282, 507379, 477253, 420857, 449568, 430440, 426266, 424156, 410101, 383082, 320656, 304790, 361181, 384587, 414228, 458451, 415865, 371511, 407409, 457218, 449771, 455443, 471109, 472018, 532020, 499783, 489762, 451995, 468809, 484615, 443526, 444700, 462039, 475916, 510994, 392780, 317291, 428325, 397603, 432427, 446919, 498588, 466320, 421561, 477158, 574997, 591854, 518365, 462759, 363798, 363981, 365529, 440384, 462287, 372732, 247221, 252774, 417080, 488144, 427214, 315953, 224350, 216018, 298285, 339365, 303973, 369063, 414901]
7734D14901J0543j49017q3418m1186K967O7522K4225N0206k3228R998o2338j8592
7722B02583j207o8121N7918Q1874O3478l8419j112L5598L6925J9610m1265j3709
7710C34153M5650l3195J3720Q4916m079n6820r583L904q7786n805O1761q2346
7698B64490j40752j0069M0019k8237K1383k4588k3207o3916k2438K1514J0674
7687D4873M1888O1655M7101Q822k4020k9633o2796O5754N2600j5203r3156m065
7675I3820R799k560O0965K4188k6592J1948n190M7855M9071k368m4744k5594n938
7662A84660J3855K8615k4040p0187N3723n432l3995J3343l9478r2742Q9385L5979
7650A53686j23924r2160R3182K0629r030N2690L3874j1352j1266l0206Q0290O978
$$ y = [414901, 425444, 276427, 193009, 151823, 154790, 222312, 246537, 296743, 273515, 283513, 221175, 202583, 201376, 133255, 191173, 273047, 336525, 298106, 296994, 332592, 369517, 389127, 347862, 334153, 379803, 346608, 360328, 445244, 441165, 384345, 374762, 378666, 290880, 285075, 346836, 264490, 123738, 113669, 153688, 125451, 146834, 122246, 99039, 35123, 12685, 34199, 44873, 86761, 148416, 195517, 204339, 180319, 150686, 87890, 153644, 206244, 191041, 97885, 93820, 103619, 101059, 162024, 186212, 159620, 171568, 166378, 214233, 263304, 260936, 216192, 190598, 184660, 198515, 227130, 203090, 132903, 186626, 181194, 147199, 160542, 121064, 28322, 117707, 153686, 29762, -62398, 30784, 51413, 42383, 95073, 128947, 117595, 106329, 76123, 156413, 163391]
7638A63391p0873o6749L3134J39581k3367j29996r3282K2262L1736O1504n0560
7627A6781N2119O743K412J3143j6765j9269L3709j0996j2066Q1902J3755j5051
7615A46417o3704m4562J8041K2765j52842L4798J70657J7958j35739o5729N4008
7604B068R4479Q2945l3649J6545j5680p4644j0864N864k0518Q0884K9374r2215
7592F4589r826L6752M7075o2334k7255k925p409j17998l8687J11872J47589J4925
7580A56368n9600J5889r9544j6896l0373J5243m6023m2683j4635M4463R637l821
7568g1975O8614l0150j6139m0073j02715J59O8573P3872J22305j4407j6848k5485
7556A5731m1832j1230k0603L6503j4050j7896J8710j1953o082L5229l6907n0442
$$ y = [163391, 92518, 25769, 58903, 198484, 175117, 45121, -48161, -25899, 5837, 67341, 16781, 68900, 75643, 78055, 91198, 74433, 55164, 88873, 77877, 65811, 147713, 161468, 146417, 82713, 38151, 56192, 78957, -73885, -39087, 131570, 149528, 13789, -51940, 2068, 96547, 179492, 145843, 162388, 146708, 72064, 61200, 67064, 46546, 127430, 156804, 64589, 54763, 91515, 138590, 76256, 49001, 46076, 38667, -79331, -118018, -6146, 141443, 156368, 96768, 112657, 13113, -3783, -34156, -18913, -64936, -107619, -122254, -77791, -68154, -71975, -3361, -33511, -49650, -89723, -192438, -192279, -123706, -49834, 72471, 58064, 41216, 15731, -26101, -37331, -57934, -21431, -35481, -53377, -34667, -46620, -52702, -17473, -54380, -104822]
7544a04822N9007k0676m4751Q6649L6419r594K2975m5550p5303n6245K9802l2866
7532a54955L368N1707M3466j9061K8709J05382K3428K2969j24796o1392R0786
7521I611P5971o5570J5580J06579J0034o704o8867j1660Q767N0405K7228r2832
7509E8542n2686m6687m4937j8687J11060N0309k4846n4141l4938j6006k0893q4319
7497a78229k3258P8504N8267m3985K3579R2653m0666K9821M0991q6590o821L1578
7485b4156K2061K6448j6645l341O0470L6178Q349q0832p6023L1066p113l0085
7473e3623k5087l0840K6988N2370L3631o5220l9456J14145k3405q1625p2022O4637
7461i9507J05855l38K6948q048m6405J0392J4141M852J7110p9427K0026M0082
$$ y = [-104822, -45815, -66491, -111242, -24593, 11826, 2232, 25207, -20343, -95646, -151891, -122089, -154955, -151587, -99880, -56414, -75475, -46766, 58616, 82044, 105013, -19783, -81175, 9611, 85582, 20012, 35592, 142171, 152205, 145501, 76634, 64974, 73741, 124146, 151374, 58542, 5856, -40831, -85768, -104455, 6605, 56914, 32068, -22073, -57011, -73017, -93910, -178229, -201487, -122983, -64716, -108701, -85122, 7531, -33135, -3314, 37677, -48913, -55734, -24156, -2095, 24353, 7708, 4367, 64837, 101015, 109364, 28532, -47491, -16425, -23538, -53623, -78710, -109550, -82562, -30192, 3439, -61781, -101237, 12908, -10497, -92122, -164144, -99507, 6348, 6010, 32958, 24910, -21495, -11103, 3038, 7890, 25000, -54427, -34401, 5681]
7449E681o587J392N0096l4063m1935m2133N733q1894j6084P7261N1818q1324l3361
7436a45400M1382Q0105O7464Q1389j0256l5416n0385m1821K9160n8379n0880N3546
7424c9491K0538l4661l1388K7537Q724M0183J41299r1707p7951k2665K5630J34504
7412A00552o444n4239n8045j3216M4653O7402J7302k8697j28600j02150j3733
7401a75215J4714O1000R9098P5401K9097r9821k9433K7350N9514j766q810l4206
7389A6923k4410O8737J0569j3011q1661l4827L6793L815Q447P8508K3965p3089
7377B0759l8110M1869M4006n9866j8127L127r7029j47231k9762J964K8688J12092
7365a37620l1215m4757J8408J5284K039J7788N8152j2725R7602L3279p1135J3977
$$ y = [5681, -906, 486, 50582, 16519, -25416, -67549, -61816, -143710, -159794, -82533, -30715, -112039, -145400, -104018, -23913, 43551, 124940, 114684, 79268, 28883, -12938, 16222, -42157, -93037, -39491, -18953, -53614, -85002, -57465, -48741, -8558, 132741, 41034, -36917, -59582, -33952, 100552, 94108, 39869, -18176, -31392, 13261, 80663, 97965, 69268, -59332, -161482, -175215, -160501, -99501, -403, 74998, 104095, 4274, -25159, 2191, 61705, 59939, 51129, 16923, -7487, 61250, 71819, 58808, -22853, -57680, -20887, -17072, -8625, 69883, 93848, 20759, -17351, 24518, 68524, 8658, -9469, -6342, -103371, -250602, -280364, -278400, -249712, -137620, -168835, -213592, -195184, -179900, -177861, -160073, -101921, -114646, -17044, 16235, -54900, -40923]
7353d0923O9235j2033r5622k8686l556r2887L8452J02833j4646J6405N2933K6338
7341A7843n5898K5289M5220P023l077l1662j9397O4859j488l4760k9866J0414
7329e500P6857P2412l9892j53367p1277o8989p309J260J2429m077J6806l4931
7317b05578m6908R0419J22157L4547J164p333M4593K0l9745p5878L5268n593l9929
7304i2796M7576O6814K2359L9520L3394k3883n9582r3460j5375J9179J05821Q398
7292E7965N986r36l7765K706m0817M4115P2129j4665k8494l1551K2416M151o2140
7279f900Q6106k834k2072p876l9242p856k5782j2527R700q558L4276m3650k2734
7266f9949L1610j4941j4360N7258L2064q0908m8614M142M4402K7330L5982l1713
$$ y = [-40923, 28312, 16279, -79343, -108029, -111585, -204472, -166020, -63187, -77833, -61428, -8495, 17843, -38055, -12766, 32454, 39477, 36400, 4738, -14659, 50200, 48712, 13952, -15914, -5500, 71357, 143769, 103877, -49490, -120767, -189756, -197065, -195805, -183376, -187453, -170647, -205578, -252486, -162067, -39910, -5363, -4199, -11532, 33061, 33081, -6664, -82542, -47274, -52867, -92796, -45220, 21594, 43953, 83473, 116867, 92984, 33402, -60058, -75433, -56254, 49567, 57965, 63951, 63015, 25250, 27956, -12861, 31254, 103383, 88718, 60224, 28673, 51089, 55240, -6900, 79206, 76372, 54300, 46424, 7182, -674, -26456, -38983, -29283, -37841, -3565, -47215, -69949, -38339, -53280, -67640, -10382, 21682, -59226, -107840, -103698, -59296, -31966, 4016, -27697]
7254b7697o3589j6138R7873P5615k9388k4510l3074n379J01767P2954r430p9919
7242E9085k8844Q8135K2868p3214o9567J4399N5486q2041L8682J9914k3657q1187
7230e9941m8906J0573L375Q5488L4721j02051J751l4578k0580k1826J00446O4987
7218A3459M109o6466j04317j3452L7458L1179N0890N5830K57P9247N553l0045
7206F3702o8860o0076n9322n1194R2965L5428o6556l4160L0399J5339j46333m0621
7194b89289L8810N2145J21822N1005J02329P0864j08569l1102j4034q5200k3001
7183a14220l3956J20213N8147l8218L1886j3990R166r80m1832m2958l0011n5764
7171a52517q756o633N0358l1733N6475L2877m9188K2697K8836P3124j471j8839
$$ y = [-27697, -91286, -107424, -9551, 66064, 36676, 12166, -20908, -26287, 75480, 148434, 139004, 59085, 30241, 118376, 141244, 68030, -1537, 12862, 68348, -13693, 24989, 44903, 21246, -59941, -108847, -98274, -94899, -9411, 25310, -76741, -74990, -109568, -130148, -151974, -51528, 13459, 17568, -48898, -153215, -166667, -129209, -98030, -47140, 8690, 8947, 88194, 93747, 63702, -5158, -65234, -124556, -175750, -82785, -47357, -113913, -148073, -117674, -102335, -248668, -289289, -250479, -198334, -76512, -25507, 76822, 147686, 39117, 8015, -6019, -91219, -114220, -148176, -27963, 30184, -8034, 23852, 9862, 19028, 18048, -23784, -66742, -96753, -152517, -161273, -167906, -117548, -149281, -92806, -59929, -109117, -86420, -57584, 15540, 14069, -4770]
7159d770L8633O944n5900k1048K6809L0798k035l2706j13689k4052K0049j3967
7147a44934J0268j4325Q9672P1033k6890m6601p5331m1123j5407j6743P1323P6981
7135f2077R7063L1062O2409l0990l2379k0848L9560j4810j19999J9432J024O2523
7123C1970N972N2243o0899j08485j9073M204J9517k7216K1173Q1666r51r2917
7111i2796k4937p079q530M8431j73L2111m9505n2563k6137j63R0507J33662O9185
7098A12013P1939N59q1270m0250P503l2374K0183l2045J5871K0117l4030M4143
7086G2359L4674l1455J0354l2882r6301J8665O2609P4811R347K8731L0180j4945
7074A66147l2297k3834m8735J3957K9051q9653n5043M494L4703j4889j9468j3691
$$ y = [-4770, 33863, 40807, -15093, -36141, -9332, 21466, 19431, -13275, -126964, -151016, -130967, -144934, -134666, -148991, -59319, 11714, -15176, -61777, -137108, -178231, -193638, -210381, -139058, -62077, 34986, 66048, 128457, 97467, 65088, 44240, 83800, 68990, -51009, -31577, -30553, 31970, 37942, 90185, 29286, -79199, -98272, -94068, -74551, -101767, -80594, 1072, 121, -92796, -117733, -124812, -133342, -84911, -85084, -52973, -102478, -155041, -181178, -181341, -90834, 42828, 112013, 183952, 184511, 103241, 62991, 70494, 38120, 58303, 26258, 42129, 62246, 28216, 72359, 107033, 75578, 85932, 53050, -43251, -24586, 38023, 112834, 122181, 150912, 181092, 166147, 133850, 110016, 61281, 75238, 104289, 14636, -40407, -35913, -1210, -16099, -35567, -49258]
7062d9258M557M1303K8483J646n7084P582L1541q9742O1919J4667n2461O8647
7050A1800Q8157o0915p9648J2413j8437m9324M5063Q1181M352k5009k0105j09925
7038a20397P6806L5001k6283M4258M9777n7761j0290j5335K9530N008L3503o2246
7026a8429K4620N7412l9921r7859J7831J03397J30832M4731r0037r4213n4160
7015a5796j7037L4093P1041K2560l4994q816L3757j07806j01339J13311N5437
7004D4411j02139N9404K2440J6699Q225r6735o302K4765j29743n0124P7593O0
6992a31446m879l0502J07209L1332k8723M706N4250l137J16027j2556m4248o9477
6980a1444l6462J23698m9005j12148J3984k9144L4252p804r8572Q3811O1372P2619
$$ y = [-49258, -44701, -3398, 25085, 26731, -30353, -22771, 8770, -80972, -19053, -4386, -56847, 11800, 99957, 39042, -40606, -28193, -46630, -95954, -50891, 30290, 34642, 9633, -10472, -120397, -43591, -8590, -34873, 9385, 59162, 1401, -8889, -24224, 5306, 10314, 43817, -18429, 6191, 63603, 23682, -74177, -56346, 47051, 177883, 222614, 132577, 38364, -15796, -32833, 1260, 72301, 94861, 59867, 51051, 84808, -22998, -124337, -11026, 44411, -57728, 1676, 24116, 40815, 49040, -47695, -53997, -29232, -158975, -209099, -131506, -131446, -136325, -166827, -59618, -28286, -57009, -52303, 1947, -1190, 114837, 102281, 58033, -11444, -47906, 75792, 26787, -85361, -71377, -100521, -66269, -74073, -172645, -88834, -27462, 45157]
6968D5157Q0034m3599J481n0522o8145k366J637j1145P4423Q985m9548m5758p0167
6955a29533M5104K6423K1409m3056J6686O035M7572n6845j35338p848p613M2731
6943a74273J9843l7065K5241J75697K4617j01794m9146N44J5160l2555J5415O1126
6931e7190N9130k2022k0558L6817P4157M3422n9989k6311K7544l143K3005J3816
6919H8678p96R42q1637p4718M651R4964J0603K7857J18598q0451l1204q4771l81
6906g665o7981j02880Q9527P5001m2979o3197j6964O6475N6373k0632L1581J3055
6894I714l8850k9801R8029L419l6538p0398M3183P6743n5992j12328P2049J10047
6882F9277R7857k5733k9795q9767j7788M3965o9733j01067j22331O1660J01716
$$ y = [45157, 125191, 81592, 83073, 32551, -35594, -37960, -36323, -47468, 26955, 35940, -13608, -59366, -129533, -84429, -58006, -36597, -79653, -62967, -56932, -9360, -66205, -201543, -209391, -217004, -174273, -154430, -191495, -166254, 9443, 34060, -67734, -116880, -116336, -101176, -133731, -118316, -57190, 1940, -20082, -40640, -3823, 70334, 113756, 53767, 27456, 55000, 51857, 74862, 88678, 87882, 88824, 7187, -67531, -62880, 32084, 42687, 70544, 189142, 108691, 77487, -7284, -7665, -75646, -178526, -88999, -13998, -56977, -120174, -137138, -70663, -14290, -34922, -3341, 9714, -29136, -58937, 39092, 42511, 5973, -64425, -21242, 55501, -491, -112819, -40770, 69277, 167134, 141401, 111606, 21839, 4051, 48016, -21717, -122784, -245115, -183455, -81739]
6871h1739J35057N8422R2349r0104p6091p2094o4151k843L8337m4410J2714O1391
6859c3162J5367n1873j14444l8773M5373N8092J9633n0363k0309O3768O8472k7060
6847f5279N535l1716M7254L304k0754O8312k521o3719p6241Q831K4439L9001L8618
6834b4936m9793J0780j1938k522M4762J055K933L2788p6736N2214J7000J7547
6822A3154l4150m4462M9637k8744J31780J895j11823q7251l7846J9025L4532J1510
6810h2743Q8241M5193O468N3050P753n1847m6565L6356O27j27927q0778M6646
6798a05526R2695P9695l1329J7087j0686J3060K8317m2692j40376k1916M0153
6787h1518J1596J6342L1194m4395P9188J4298O638j1965J0912J00817o0700j20154
$$ y = [-81739, 53318, 111740, 204089, 113985, 37894, -34200, -98351, -101194, -62857, -107267, -94553, -33162, -17795, -69668, -184112, -222885, -177512, -119420, -99787, -150150, -170459, -106691, -38219, -65279, -59744, -91460, -44206, -40902, -61656, 6656, 4135, -59584, -135825, -126994, -102555, -63554, -24936, -74729, -63949, -75887, -78409, -33647, -32592, -29659, 3129, -73607, -21393, -4393, 13154, -20996, -65458, -15821, -44565, 87215, 89110, -22713, -109964, -147810, -128785, -94253, -82743, 5498, 50691, 57159, 110209, 117962, 66115, 19550, 55906, 56533, -71394, -152172, -105526, -12831, 66864, 35535, 52622, 41936, 54996, 83313, 40621, -99755, -121671, -81518, -69922, -53580, -22386, -66781, 12407, 26705, 33343, 21378, 32290, 133107, 72407, -47747]
6775d7747j9672l1175L0500Q3580r297q932N0696o0957r4049O8964j505R186M7632
6762A7224n6680K0038N4146n5276k5034r27K0409R4237r0829j09247J1931O5308
6750e4700N1793k2183p7353K3985N888O2679N7889L982p3383n6973M42r4421k3626
$$ y = [-47747, -67419, -98594, -68094, 15486, 6189, -2743, 47953, -13004, -107053, -38089, -39594, -30408, 17224, -39456, -19418, 34728, -20548, -45582, -46509, -26100, 68137, -22692, -131939, -120008, -54700, -2907, -25090, -102443, -78458, -72570, -9891, 47998, 51980, -21403, -78376, -77934, -172355, -195981]
$$ [...]
##END NTUPLES=NMR SPECTRUM
##END=
