##TITLE=Analysis number 315876
Compound Code cc 38341
Book Reference 459/89
Project Code adrs
Chemist Name janh
##JCAMPDX= 6.0         $$ Bruker NMR JCAMP-DX V2.0
##DATA TYPE= NMR SPECTRUM
##DATA CLASS= NTUPLES
##ORIGIN= Bruker BioSpin GmbH
##OWNER= NMR
$$ XWIN-NMR		Version 3.5
$$ Tue Dec  6 14:00:02 2005 GMT Standard Time (UT+0h)  MAYBRIDGE\NMR@NMR_250MHZ
##.OBSERVE FREQUENCY= 250.131544655141
##.OBSERVE NUCLEUS= ^1H
##.ACQUISITION MODE= SIMULTANEOUS (DQD)
##.ACQUISITION SCHEME= undefined
##.AVERAGES= 16
##.DIGITISER RES= 18
##SPECTROMETER/DATA SYSTEM= dpx250
##.PULSE SEQUENCE= zg30
##.SOLVENT NAME= CDCl3
##.SHIFT REFERENCE= (INTERNAL, CDCl3, 0, 16.4418)
##AUDIT TRAIL= $$ (NUMBER, WHEN, WHO, WHERE, WHAT)
$$ ##TITLE= Audit trail, XWIN-NMR		Version 3.5
$$ ##JCAMPDX= 5.01
$$ ##ORIGIN= Bruker BioSpin GmbH
$$ ##OWNER= NMR
$$ C:\u/data/dgb/nmr/ADRS/13480/pdata/1/auditp.txt
$$ ##AUDIT TRAIL=  $$ (NUMBER, WHEN, WHO, WHERE, WHAT)
(   1,<2005-12-06 13:59:39.73 +000>,<MAYBRIDGE\NMR>,<NMR_250MHZ>,
      <created by zg, POWCHK disabled, PULCHK disabled
       configuration hash MD5:
       62 19 C7 07 E1 42 D1 B7 37 6C 3D D0 77 39 F9 E6
       data hash MD5: 64K
       AD 0B CB C8 A4 96 2D 45 19 D2 56 24 A0 F5 40 DE>)
(   2,<2005-12-06 13:59:52.65 +000>,<MAYBRIDGE\NMR>,<NMR_250MHZ>,
      <Start of raw data processing
       ef LB = 0.3 FT_mod = 6 PKNL = 1 SI = 32K 
       data hash MD5: 32K
       0F D1 E3 AF 3F F0 4C 0A A0 B8 9E 8D 37 C3 A1 78>)
(   3,<2005-12-06 13:59:54.42 +000>,<MAYBRIDGE\NMR>,<NMR_250MHZ>,
      <apk 
       data hash MD5: 32K
       6D 69 49 90 65 47 25 75 50 78 A1 1B 8E 63 1C E2>)
(   4,<2005-12-06 13:59:55.13 +000>,<MAYBRIDGE\NMR>,<NMR_250MHZ>,
      <abs ABSG = 5 
       data hash MD5: 32K
       6B 4B 8E 39 8C 40 18 4C E6 B8 CF 56 7F ED 04 25>)
$$ ##END=
$$ 
$$ hash MD5
$$ 3C C9 E1 EA F1 9F 98 12 0B 13 88 81 56 CD D0 D4
##$RELAX= 
##$RELAX= 
##$RELAX= 
##$RELAX= 
##$RELAX= 
##$RELAX= 
##$RELAX= 
$$ Bruker specific parameters
$$ --------------------------
##$DU= <C:\u>
##$EXPNO= 13480
##$NAME= <ADRS>
##$PROCNO= 1
##$TYPE= <nmr>
##$USER= <dgb>
##$AMP= (0..31)
100 100 100 100 100 100 100 100 100 100 100 100 100 100 100 100 100 100 
100 100 100 100 100 100 100 100 100 100 100 100 100 100 
##$AQSEQ= 0
##$AQ_mod= 3
##$AUNM= <au_zg>
##$AUTOPOS= <10 >
##$BF1= 250.13
##$BF2= 250.13
##$BF3= 250.13
##$BF4= 250.13
##$BF5= 500.13
##$BF6= 500.13
##$BF7= 500.13
##$BF8= 500.13
##$BYTORDA= 1
##$CFDGTYP= 0
##$CFRGTYP= 5
##$CHEMSTR= <none>
##$CNST= (0..31)
1 1 145 1 1 1 1 1 1 1 1 1 1 1 1 1 1 1 1 1 1 1 1 1 1 1 1 1 1 1 1 1 
##$CPDPRG= <>
##$CPDPRG1= <>
##$CPDPRG2= <>
##$CPDPRG3= <>
##$CPDPRG4= <mlev>
##$CPDPRG5= <mlev>
##$CPDPRG6= <mlev>
##$CPDPRG7= <mlev>
##$CPDPRG8= <mlev>
##$CPDPRGB= <>
##$CPDPRGT= <>
##$D= (0..31)
0 1 0 0 0 0 0 0 0 0.06 0 0 0 0 0 0 0.0002 0 0 0 0 0 0 0 0 0 0 0 0 0 0 
0 
##$DATE= 1133877578
##$DBL= (0..7)
120 120 120 120 120 120 120 120 
##$DBP= (0..7)
150 150 150 150 150 150 150 150 
##$DBP07= 0
##$DBPNAM0= <>
##$DBPNAM1= <>
$$ [...]
##$SUBNAM7= <"">
##$SUBNAM8= <"">
##$SUBNAM9= <"">
##$SW= 20.6930455092707
##$SWIBOX= (0..15)
0 0 3 0 0 0 0 0 0 0 0 0 0 0 0 0 
##$SW_h= 5175.983436853
##$TD= 65536
##$TD0= 1
##$TE= 294.16
##$TE2= 300
##$TE3= 300
##$TEG= 300
##$TL= (0..7)
0 120 120 120 120 120 120 120 
##$TP= (0..7)
150 150 150 150 150 150 150 150 
##$TP07= 0
##$TPNAME0= <>
##$TPNAME1= <>
##$TPNAME2= <>
##$TPNAME3= <>
##$TPNAME4= <>
##$TPNAME5= <>
##$TPNAME6= <>
##$TPNAME7= <>
##$TPOAL= (0..7)
0.5 0.5 0.5 0.5 0.5 0.5 0.5 0.5 
##$TPOFFS= (0..7)
0 0 0 0 0 0 0 0 
##$TUNHIN= 0
##$TUNHOUT= 0
##$TUNXOUT= 0
##$USERA1= <user>
##$USERA2= <user>
##$USERA3= <user>
##$USERA4= <user>
##$USERA5= <user>
##$V9= 5
##$VALIST= <valist>
##$VCLIST= <CCCCCCCCCCCCCCC>
##$VD= 0
##$VDLIST= <DDDDDDDDDDDDDDD>
##$VPLIST= <PPPPPPPPPPPPPPP>
##$VTLIST= <TTTTTTTTTTTTTTT>
##$WBST= 1024
##$WBSW= 4
##$XGAIN= (0..3)
0 0 0 0 
##$XL= 0
##$YL= 0
##$YMAX_a= 537441
##$YMIN_a= -652559
##$ZGOPTNS= <>
##$ZL1= 120
##$ZL2= 120
##$ZL3= 120
##$ZL4= 120
##$ABSF1= 16.4418
##$ABSF2= -4.251373
##$ABSG= 5
##$ABSL= 3
##$ALPHA= 0
##$AQORDER= 0
##$ASSFAC= 0
##$ASSFACI= 0
##$ASSFACX= 0
##$ASSWID= 0
##$AUNMP= <proc_1d>
##$AZFE= 0.1
##$AZFW= 0.1
##$BCFW= 0
##$BC_mod= 0
##$BYTORDP= 0
##$COROFFS= 0
##$CY= 12.5
##$DATMOD= 1
##$DC= 0
##$DFILT= <>
##$DTYPP= 0
##$F1P= 14.0000005364418
##$F2P= -0.99999901652339
##$FCOR= 0.5
##$FTSIZE= 32768
##$FT_mod= 6
##$GAMMA= 0
##$GB= 0
##$INTBC= 1
##$INTSCL= 1
##$ISEN= 128
##$LB= 0.3
##$LEV0= 0
##$LPBIN= 0
##$MAXI= 10000
##$MC2= 0
##$MEAN= 0
##$ME_mod= 0
##$MI= 0
##$NCOEF= 0
##$NC_proc= -4
##$NLEV= 6
##$NOISF1= 0
##$NOISF2= 0
##$NSP= 0
##$NTH_PI= 0
##$NZP= 0
##$OFFSET= 16.4418
##$PC= 1
##$PHC0= -68.03439
##$PHC1= 4.725888
##$PH_mod= 1
##$PKNL= yes
##$PPARMOD= 0
##$PSCAL= 4
##$PSIGN= 0
##$REVERSE= no
##$SF= 250.130020057991
##$SI= 32768
##$SIGF1= 0
##$SIGF2= 0
##$SINO= 400
##$SIOLD= 32768
##$SREGLST= <1H.CDCl3>
##$SSB= 0
##$STSI= 32768
##$STSR= 0
##$SW_p= 5175.98343685301
##$SYMM= 0
##$S_DEV= 0
##$TDeff= 65536
##$TDoff= 0
##$TI= <Analysis number 999999
Compound Code 99
Book Reference 9
Project Code 9>
##$TILT= no
##$TM1= 0
##$TM2= 0
##$TOPLEV= 0
##$USERP1= <user>
##$USERP2= <user>
##$USERP3= <user>
##$USERP4= <user>
##$USERP5= <user>
##$WDW= 1
##$XDIM= 32768
##$YMAX_p= 402456123
##$YMIN_p= -58610
$$ End of Bruker specific parameters
$$ ---------------------------------
##NTUPLES= NMR SPECTRUM
##VAR_NAME=  FREQUENCY,     SPECTRUM/REAL,   SPECTRUM/IMAG
##SYMBOL=    X,             R,               I
##VAR_TYPE=  INDEPENDENT,   DEPENDENT,       DEPENDENT
##VAR_FORM=  AFFN,          ASDF,            ASDF
##VAR_DIM=   32768,         32768,           32768
##UNITS=     HZ,            ARBITRARY UNITS, ARBITRARY UNITS
##FACTOR=    0.157963299565203, 1,           1
##FIRST=     4112.58755463535, 0,            0
##LAST=      -1063.39588221766, 0,           0
##MIN=       -1063.39588221766, -58610,      0
##MAX=       4112.58755463535, 402456123,    0
$$ Real data points
##PAGE= N=1
##DATA TABLE= (X++(R..R)), XYDATA
$$ [...]
13563b6084J591j3288n777J3936J0910Q83M378k285Q230J704O770q002j2209N448
$$ -26084 -24493 -37781 -43558 -29622 -18712 -17829 -13451 -15736 -7506 -5802 968 -7034 -19243 -13795
13549a3795N933O22q508m083J684M202J396J1190J175N579K327k946M007M578
$$ -13795 -7862 -7240 -15748 -19831 -18147 -13945 -12549 -1359 -184 5395 7722 4776 8783 13361
13535A3361n837p840l522j4154r597K964r735N617M308j642m954N053K3046k019
$$ 13361 7524 -316 -3838 -17992 -27589 -24625 -34360 -28743 -24435 -26077 -31031 -25978 -2932 -4951
13521d951l011j1853R008Q729j2459l604N560J8210Q054r155l160N580J60j1670
$$ -4951 -7962 -19815 -10807 -2078 -14537 -18141 -12581 5629 13683 4528 1368 6948 7108 -4562
13507d562J0793o436j5036r32M660K437Q040j774j1701q270P605p236L159K2700
$$ -4562 6231 -205 -15241 -16173 -11513 -9076 -1036 -2810 -14511 -22781 -15176 -22412 -19253 3447
13493C447r1o786Q539j0004k6162M218P086P170j293j0987j465k588L775N328
$$ 3447 3356 -3430 5109 -4895 -31057 -26839 -19753 -12583 -13876 -24863 -26328 -28916 -25141 -19813
13479a9813O402L47M697j0010j4114M913P231P039q052n94P291K402k576J1078
$$ -19813 -13411 -13064 -8367 -18377 -32491 -27578 -20347 -13308 -21360 -21954 -14663 -12261 -14837 -3759
13465c759N441j0308j0030l710q815K113O942M884P541Q80J054Q733L58l29K083
$$ -3759 1682 -8626 -18656 -22366 -31181 -29068 -22126 -17242 -9701 -8821 -7767 966 1324 995 3078
13450C078K673l067n920O989M963J270j2498j4274n442L345N089O119K989j3581
$$ 3078 5751 2684 -3236 3753 8716 9986 -2512 -16786 -22228 -18883 -13794 -7675 -4686 -18267
13436a8267j908j871O716J7764N049r002j7474n843K5804N908Q375L245l191j4501
$$ -18267 -20175 -22046 -15330 2434 7483 -1519 -18993 -24836 968 6876 15251 18496 15305 804
13422H04k0602O072P347O259p936r076k402q151n382J0573J4884j4688l306J6217
$$ 804 -19798 -13726 -6379 -120 -8056 -17132 -19534 -27685 -33067 -22494 -7610 -22298 -25604 -9387
13408i387o266Q58q74N419J3339l430Q238Q980q361j1135J041R263n079J6189
$$ -9387 -15653 -14795 -15669 -10250 3089 -341 7897 16877 8516 -2619 -1578 7685 2606 18795
13394A8795O247j2378j0463j0020k702J198J326j605j815J0139l424r07l528K173
$$ 18795 25042 12664 2201 -7819 -10521 -9323 -7997 -9602 -11417 -1278 -4702 -5609 -9137 -6964
13380f964RO11K1545l815q783K337R9L981j9501n469l788M990J2979J3928j482
$$ -6964 -6955 -6344 15201 11386 2603 4940 5039 9020 -10481 -15950 -19738 -14748 -1769 12159 10677
13365A0677j0071l407r104J3762J2464m166L383O812o901j1244N301m77j3423
$$ 10677 606 -2801 -11905 1857 14321 10155 13538 20350 13449 2205 7506 7029 -6394
13352f394r633J0589J1673q679j0232N013J3014n399m404N527n545j0250R019
$$ -6394 -16027 -5438 6235 -2444 -12676 -7663 5351 -48 -4452 1075 -4470 -14720 -5701
13339e701J361K227L947N085J0595O515J0174J6431n448L892J6582L9141K3842
$$ -5701 -4340 -2113 1834 6919 17514 24029 34203 50634 45186 49078 65660 104801 128643
13326A28643J4679O158j2180j4021k0983k3573j6747p491J1846n704j7185J5163
$$ 128643 143322 149480 137300 123279 102296 78723 61976 54485 66331 60627 43442 58605
13314E8605K3907J4118K6864K7622N570j0705l222l735j2215j9555j2256j1337
$$ 58605 82512 96630 123494 151116 156686 145981 142759 139024 126809 107254 94998 83661
13302H3661k2243m529J2374n96k85J3221Q076L148J551J2900K7937K6679K0835
$$ 83661 61418 56889 69263 68667 68382 81603 89679 92827 94378 107278 135215 161894 182729
13289A82729p50k0597j8820l1514k5199j3792r460o896j906L034k294M257J6266
$$ 182729 181979 161382 142562 111048 85849 72057 62597 55701 53795 56829 54535 58792 75058
13276G5058K2870K5656J9683K1248K9509r604r696k3065l6416l6242o724J888
$$ 75058 97928 123584 143267 164515 194024 184420 174724 151659 115243 79001 72277 74165
13264G4165j0067k9795p243n389Q587l659j1103M766Q669P909j2771K740J6296
$$ 74165 64098 34303 27060 21671 30258 26599 15496 20262 28931 36840 24069 26809 43105
13251D3105r574j0369M187j4271n344P129J1663K93k970J7947Q690m200N90j2152
$$ 43105 33531 23162 27349 13078 7734 14863 26526 26819 23849 41796 50486 46286 46876 34724
13237C4724k2996j3197M7N41J3411N2l845k93R568O475J0281R838o098j555q224
$$ 34724 11728 -1469 -1422 -881 12530 12582 8737 8444 18012 24487 34768 44606 38508 36953 28729
13222B8729o958l051J273r254L736J3559O754p079j6906J898J4846M94m235K784
$$ 28729 21771 18720 19993 10739 14475 28034 34788 27709 10803 12701 27547 28041 23806 26590
13208B6590j693k118j1130O34Q439j066O596J901k580j2697J1549Q365j5384o684
$$ 26590 24897 22779 11649 12283 20722 19656 26252 28153 25573 12876 24425 32790 17406 10722
13194A0722N047m145M686Q539p955o002k445N336J3069j4644j0382J0489J0299
$$ 10722 15769 11624 16310 24849 16894 10892 8447 13783 26852 12208 1826 12315 22614
13181B2614J1426O551j0193k420m640Q672K1613m774k442n483l082m093M181J1114
$$ 22614 34040 40591 30398 27978 23338 32010 53623 48849 46407 40924 37842 33749 37930 49044
13167D9044J2568K8649K9910J2712J9827J5753J3802L9628M5764L4213K5117N087
$$ 49044 61612 90261 120171 132883 152710 168463 182265 221893 267657 301870 326987 332074
13155C32074K108j2317k0876j4164l2231l4313j8949j3426R725o176p647O44N19
$$ 332074 334182 321865 300989 286825 254594 220281 201332 187906 197631 191455 183808 184452 184971
13142A84971O742N667Q250l998r71N168M940K4410L9652K6021J9895J9111J9350
$$ 184971 191713 197380 205630 201632 200661 205829 210769 235179 274831 300852 320747 339858 359208
13129C59208L0538L2618J0651P610Q571j3135j4421j6896j4310k2996l2467k5740
$$ 359208 389746 422364 433015 440625 449196 436061 421640 404744 390434 367438 334971 309231
13117C09231r976l4045k6051J517o716j5217p825o674M516j6737q517O847R7k965
$$ 309231 299255 265210 239159 240676 233960 218743 210918 204244 208760 192023 183506 190353 190450 187485
13103A87485J4361R576J1251M462J4377M3936M6192J9822J5309R697l219j3396
$$ 187485 201846 211422 222673 227135 241512 285448 331640 351462 366771 376468 373249 359853
13091C59853k4674k3297l4335m2414m4652k0624k0084j7924k4680j9717J108k881
$$ 359853 335179 311882 277547 235133 190481 169857 149773 131849 107169 87452 88560 85679
13079H5679l475q987j8611j1740o823N594J8436J250K069l313k4625k1274L474
$$ 85679 82204 73217 54606 42866 36043 41637 60073 61323 63392 60079 35454 14180 17654
13066A7654J8044Q023n004k046M56j1506P965J3392r945j0601J995p28j133n856
$$ 17654 35698 43721 38717 36671 37127 25621 33586 46978 37033 26432 28427 27699 26566 20710
13052B0710j1170j943k651J296R749K722K115K908j1563q910J5565k502Q94Q631
$$ 20710 9540 7597 4946 6242 15991 18713 20828 23736 12173 3263 18828 16326 17220 25851
13038B5851K442R890j4704n121o151j6659J1136M884O705k511J2160R648L35J004
$$ 25851 28293 38183 23479 18358 12207 -4452 6684 11568 18273 15762 27922 37570 37905 38909
13024C8909k2756j3380l745j1247q050O611P208L267K175j135n571O577O328K1805
$$ 38909 16153 2773 -972 -12219 -20269 -13658 -6450 -3183 -1008 -2143 -7714 -1137 5191 26996
13010B6996J149l294n825k610l574j356j334J511O583J1623L179n862m500r121
$$ 26996 28145 24851 19026 16416 12842 11486 10152 11663 18246 29869 33048 27186 22686 13565
12996A3565o680o725R056J4565R305m752j1017K60L155n537L969p922j0964J357
$$ 13565 6885 160 9216 23781 33086 28334 17317 17577 20732 15195 19164 11242 278 1635
12982A635p534q116J8298L133n737R329k997n637L26P280Q969P272J380n51j1703
$$ 1635 -5899 -14015 4283 7416 1679 11008 8011 2374 2700 9980 18949 26221 27601 27050 15347
12967A5347J335R531P327J296R231J6622l053k496N247k01k246m078r545j1658
$$ 15347 16682 26213 33540 34836 44067 60689 57636 55140 60387 60186 57940 53862 44317 32659
12953C2659N130M248q980R904M191n646M082q94j265R516k898q430J3305J7596
$$ 32659 37789 42037 33057 42961 47152 41506 45588 44694 43429 52945 50047 41617 54922 72518
12939G2518p873j0809p262q80P947K2093J5262m017r383j239r4P203k691r21m025
$$ 72518 64645 53836 46574 45694 53641 75734 90996 86979 77596 76357 76263 83466 80775 79854 75829
12924G5829j2007k609j326l101n228j788j6106Q98K922O381J023p570M5N891J0468
$$ 75829 63822 61213 59887 56786 51558 49770 33664 34562 37484 43865 44888 37318 37363 43254 53722
12909E3722N672o132K859J3304j890k363L568k406R312J9610J3320J8363j1510
$$ 53722 59394 53262 56121 69425 67535 65172 68740 66334 75646 95256 108576 126939 115429
12896A15429L819n906o223k4906j3958j743J513q764r099K346R75J1043J652l709
$$ 115429 119248 113342 107119 82213 68255 66512 68025 59261 50162 52508 53483 64526 66178 62469
12882F2469r389O326k502J5361R388l106J472L408Q479J0600P694J697M574j0766
$$ 62469 53080 59406 56904 72265 81653 78547 80019 83427 91906 102506 110200 111897 116471 105705
12868A05705j8278O52p796j4787q059K246J5254K0807N658N567q704n562L850
$$ 105705 87427 88079 80283 65496 57437 59683 74937 95744 101402 106969 98265 92703 96553
12855I6553N35Q816Q040j1113j649K582K059r431k4778n046J6270K2285J694M209
$$ 96553 97088 105904 113944 102831 101182 103764 105823 96392 71614 66568 82838 105123 106817 111026
12841A11026J6587J4254o439n163J2985J0184J2437K6445J8775R856l391l769
$$ 111026 127613 141867 135428 130265 143250 153434 165871 192316 211091 220947 217556 213787
12829B13787j5336j3803j5253l459n345Q415N524j0066k5754o081J7890j0438
$$ 213787 198451 184648 169395 165936 160591 169006 174530 164464 138710 132629 150519 140081
12817A40081j4931j533O633p107o387R41n952k222Q56r337Q230N875j2883q081
$$ 140081 125150 123617 130250 123143 116756 117697 111745 109523 110379 101042 109272 115147 102264 94183
12803I4183R872Q941L798M032l72j1541J0434J1576J7083J3368J9564N141Q802
$$ 94183 104055 112996 116794 120826 120454 108913 119347 130923 148006 161374 180938 186079 194881
12790A94881J6529J0910J919q146j0268m84J2128M821J6105J2450P307Q697L68
$$ 194881 211410 222320 224239 216093 205825 205341 217469 222290 238395 250845 258152 266849 267217
12777B67217J3662K0143K265J6778J3388j068K3576J5360R693J7560K9130K1149
$$ 267217 280879 301022 303287 320065 333453 332385 355961 371321 381014 398574 427704 448853
12765D48853R905J6250J2443J2845Q033J5595J7809M0624K9534O069J8257K4941
$$ 448853 458758 475008 487451 500296 508329 523924 541733 582357 611891 617960 636217 661158
12753F61158L9234K8901L1487K5163K7291K7525L2867N7162M8907N4805M8870
$$ 661158 700392 729293 760780 785943 813234 840759 873626 930788 979695 1034500 1083370
12742A083370M9011P5632Q8866R1967J05539J10207J20427J12777J21481J40126
$$ 1083370 1132381 1208013 1296879 1388846 1494385 1604592 1725019 1837796 1959277 2099403
12732B099403J56699J81445K04176K34028K76409L30034L76660M18655M97783
$$ 2099403 2256102 2437547 2641723 2875751 3152160 3482194 3858854 4277509 4775292
12723D775292N43142O23953P55851Q99688J102155J354181J707484K189029K875725
$$ 4775292 5318434 5942387 6698238 7597926 8700081 10054262 11761746 13950775 16826500
12714A6826500L772666M933969O352204P750343Q554397P926678N583925K191494
$$ 16826500 20599166 25533135 31885339 39635682 48190079 56116757 61700682 63892176
12706F3892176j086664l547256n110588n917740n975364n350179m320017l115563
$$ 63892176 62805512 59258256 54147668 48229928 42254564 36904385 32584368 29468805
12698B9468805j954610r42357m8042P04869J214655J349670J196494J073219J223073
$$ 29468805 27514195 26571838 26523796 27228665 28443320 29792990 30989484 32062703 33285776
12689C3285776J674785K441596L440974M507230N297341N636839N653787N771890
$$ 33285776 34960561 37402157 40843131 45350361 50647702 56284541 61938328 67710218
12681F7710218O100222O222650N456119L304126L16182k430530m217013n063996
$$ 67710218 73810440 80033090 85489209 88793335 89109517 86678987 82461974 77397978
12673G7397978n228642m826826l962972k949678k305116k170333k486971k952158
$$ 77397978 72169336 67342510 63379538 60429860 58124744 55954411 53467440 50515282
12665E0515282l199532l074406k602892j967745j323991q91355p80849q11885
$$ 50515282 47315750 44241344 41638452 39670707 38346716 37455361 36674512 35862627
12657C5862627o75698l91631J1291O10691J542830K853420M553143O476038Q313657
$$ 35862627 35186929 34795298 34806589 35417280 36960110 39813530 44366673 50842711 59156368
12648E9156368R388220Q771710N852060J328857l124501o274683q155156r123680
$$ 59156368 68544588 77316298 83168358 84497215 81372714 75098031 66942875 57819195
12640E7819195r230156q464801p146916n685403m386438l352428k572800j973648
$$ 57819195 48589039 40124238 32977322 27291919 22905481 19553053 16980253 15006605
12632A5006605j519833j188427r66970q16171p26429o83043o44910o13151n85439
$$ 15006605 13486772 12298345 11331375 10515204 9788775 9105732 8460822 7847671 7262232
12623G262232n52710n10575m85799m60080l98650l58500l03033k76903k61154
$$ 7262232 6709522 6198947 5713148 5253068 4854418 4495918 4192885 3915982 3654828
12614C654828k26883j96099j46046j52809j46671j39281j19983j08273r0899r8020
$$ 3654828 3427945 3231846 3085800 2932991 2786320 2647039 2527056 2418783 2327884 2229864
12604B229864j09019p8983p9182o8024o6767o0767p0997p4464q1213o1316n5380
$$ 2229864 2120845 2041862 1962680 1894656 1827889 1767122 1696125 1621661 1540448 1479132 1423752
12593A423752n4208m0543k7264l0054n1424m3843k9495k6513k7710l7052j8969
$$ 1423752 1369544 1329001 1301737 1271683 1220259 1176416 1146921 1120408 1092698 1055646 1036677
12582A036677k2035k2022k0919j7506r003j5260k3035k0800k8629k0918k1071
$$ 1036677 1014642 992620 971701 954195 945192 929932 906897 886097 857468 836550 815479
12571H15479k1221j7733j9491j0253j5638k5065O101p050k6853j7056j9091n382
$$ 815479 794258 776525 757034 746781 731143 706078 712179 705129 678276 661220 642129 636747
12559F36747j7870O352R604M764Q709o170r173j1605j6763L067L934j6267k4690
$$ 636747 618877 625229 634833 639597 648306 642136 632963 621358 604595 607662 611596 595329 570639
12546E70639j5256j1946q030j2423j7357q277l987j0392p626j7833n613m330Q012
$$ 570639 555383 543437 535407 522984 505627 497350 493363 482971 475345 457512 451899 447569 455581
12533D55581J860R304J6017L4782L4111L1782M5752N6174M8396L6814J9282j5429
$$ 455581 457441 466745 482762 517544 551655 583437 629189 685363 733759 770573 789855 774426
12521G74426l0868k8964m6021o1495n0833m8686m2166l1086k3556k2609k2310
$$ 774426 743558 714594 668573 607078 556245 507559 465393 434307 410751 388142 365832
12510C65832k2739k1697j3349o253n283l449K572j6906o634k5963j6662k822P555
$$ 365832 343093 321396 308047 301794 296511 293062 295634 278728 272094 246131 229469 226647 234202
12497B34202m282j0709k87Q564J2421k598j3293q6q679k2166k679k866o363J1000
$$ 234202 229920 219211 218924 227488 239909 237311 224018 223932 215253 193087 190408 187542 181179 192179
12483A92179j458j0238Q138M117l178j4311n454k104k1391j9310M573J5995N366
$$ 192179 190721 180483 188621 192738 189560 175249 169795 167691 146300 126990 131563 147558 152924
12470A52924K760J074k429j679J863J7161K8653q188m685j1255L5J8111M857J149
$$ 152924 155684 156758 154329 152650 154513 171674 200327 192139 187454 176199 176234 194345 199202 200351
12456B00351O547r488J1480M473j070o975k799m261p978O280K131j836k98n933
$$ 200351 206898 197410 208890 213363 212293 205318 202519 198258 190280 196560 198691 196855 196557 190624
12442A90624l077l339j853j1838j3097n724r006J1668J2574M73J188K163N049
$$ 190624 187547 184208 182355 170517 157420 151696 142690 154358 166932 167405 168593 170756 175805
12429A75805M344R28J3014L022p824N50l5l761j0561L61N605J0950j0928l594
$$ 175805 180149 181077 194091 197113 189289 189839 189804 186043 175482 175843 181448 192398 181470 177876
12415A77876J0740K420j0713j2574Q33j3816K885l744l605J5641O071m231p482
$$ 177876 188616 191036 180323 167749 168582 154766 157651 153907 150302 165943 172014 167783 160301
12402A60301j8919o582R046J4996n54J1506M223J5146P275K520J4089r44j4300
$$ 160301 141382 134800 143846 158842 158288 169794 174017 189163 196438 198958 213047 212103 197803
12389A97803j4497M279J629r672k3852l991O668P929j9094o7M987j818r200L370
$$ 197803 183306 187585 189214 179542 155690 151699 158367 166296 147202 147135 152122 150304 141104 144474
12375A44474o425p244L962J5509J615k611J40J3415J106q86o550k0505k086m707
$$ 144474 138049 130805 134767 150276 151891 149280 149420 162835 163941 163055 156505 136000 133914 129207
12361A29207J020J4667R45j014N65p359O5Q220R07M474J670Q612k220K521R614
$$ 129207 130227 144894 145839 144825 145390 138031 138096 146316 147223 151697 153367 161979 159759 162280 171894
12346A71894M236N059J1326M590Q266L692j5539L335J5860n350j9088p906J7900
$$ 171894 176130 181189 192515 197105 205371 209063 193524 196859 212719 207369 188281 180375 198275
12333A98275J3794J8666J3434R991J3768L3811L3102M5420K8717K7420L6921K3585
$$ 198275 212069 230735 244169 254160 267928 301739 334841 380261 408978 436398 473319 496904
12321D96904O750j7142l5567k6423l0147l2643j1246O133k3026k9793l6618j5780
$$ 496904 503654 486512 450945 424522 394375 361732 350486 356619 333593 303800 267182 251402
12309B51402M346j2627k5717q691j005l799k3636Q964J472j249R984j6821j7897
$$ 251402 255748 243121 217404 208713 207708 203909 180273 189237 190709 189460 199444 182623 164726
12296A64726M559j2413N306J7493O113P315J0853J852j939K2951K4510K6071R025
$$ 164726 169285 156872 162178 179671 185784 193099 203952 205804 203865 226816 251326 277397 286422
12283B86422p647q651j899p588l261N182J451L913J7629K0783J3627J3464J2152
$$ 286422 278775 270124 268225 260637 257376 262558 264009 267922 285551 306334 319961 333425 345577
12270C45577K703J5458K2130J7634K0303R200j981J8830L5230K2727J4406P522
$$ 345577 348280 363738 385868 403502 423805 433005 431024 449854 485084 507811 522217 529739
12258E29739J3056L5138J3928K0321L6401K9060M5415L9989K7946K3819L7237
$$ 529739 542795 577933 591861 612182 648583 677643 723058 763047 790993 814812 852049
12247H52049L2671L7061L6585K9826M5135L5300L6269M4617N3797M4294N7264
$$ 852049 884720 921781 958366 988192 1033327 1068627 1104896 1149513 1203310 1247604 1304868
12236A304868O9204P9515R0624J05053J04245J20829J46020J43647J42424J60320
$$ 1304868 1374072 1453587 1544211 1649264 1753509 1874338 2020358 2164005 2306429 2466749
12226B466749J57404J62820K03526K43991K78985L41323L85206M47419N25184
$$ 2466749 2624153 2786973 2990499 3234490 3513475 3854798 4240004 4687423 5212607
12217E212607O19280P33017Q44264R80613J157683J394044J691308K084916K611096
$$ 5212607 5831887 6564904 7409168 8389781 9547464 10941508 12632816 14717732 17328828
12208A7328828L385471M444180N815001P469975R206708J0412837J0238199Q097864
$$ 17328828 20714299 25158479 30973480 38443455 47650163 58063000 68301199 76399063
12200G6399063M330838J24652l380272n743847p044285p393904o882216n707896
$$ 76399063 80729901 80854553 77474281 71730434 64686149 57292245 50410029 44702133
12192D4702133m205052k712771j440517n72262k24250k24671k60131j14285K64427
$$ 44702133 40497081 37784310 36343793 35771531 35547281 35322610 35062479 34948194 35212621
12183C5212621Q56628J682308K669243L501995L720706L227312K366688J718324
$$ 35212621 36069249 37751557 40420800 43922795 47643501 50870813 53237501 54955825
12175E4955825J673466K283864L348495M584827N554384N751302M861285L078139
$$ 54955825 56629291 58913155 62261650 66846477 72400861 78152163 83013448 86091587
12167H6091587J000463p98954k227753l483491m686942n649652o187723o216208
$$ 86091587 87092050 86293096 84065343 80581852 75894910 70245258 64057535 57841327
12159E7841327n806463n089445m164904l201127k289754j660315j425528j460445
$$ 57841327 52034864 46945419 42780515 39579388 37289634 35629319 34203791 32743346
12151C2743346j482898j334522j006114n62552K7456Q06572J764522K899672M165766
$$ 32743346 31260448 29925926 28919812 28357260 28384716 29191288 30955810 33855482 38021248
12142C8021248N448541O437009O617189N359383K640932o72894l485835n358900
$$ 38021248 43469789 49906798 56523987 61883370 64524302 63851408 60365573 55006673
12134E5006673o406488o784413o537875n758705m768426l817598l058263k456556
$$ 55006673 48600185 41815772 35277897 29519192 24750766 20933168 17874905 15418349
12126A5418349j998215j657605j390852j160230r61343q05642o86378n63907m73235
$$ 15418349 13420134 11762529 10371677 9211447 8250104 7444462 6758084 6194177 5720942
12117E720942m09467l84516l60960l28275l00639k82202k61831k36126k18300
$$ 5720942 5311475 4926959 4565999 4237724 3937085 3654883 3393052 3156926 2938626
12108B938626j92411j62245j34216j13746j19023j17631j00024q0797o6214q4439
$$ 2938626 2746215 2583970 2449754 2336008 2216985 2099354 1999330 1918533 1852319 1767880
12098A767880q3339p7716o5366n6199m5918n6977n7603n8848m4374m7562n4568
$$ 1767880 1684541 1606825 1541459 1485260 1439342 1382365 1324762 1265914 1221540 1173978 1119410
12087A119410m8410n1925l6264j5932l0826k5950j7559j5102k1957j5134j4091
$$ 1119410 1071000 1019075 982811 966879 936053 910103 892544 877442 855485 840351 826260
12076H26260j4098n06k794j9418l3699j3029j0488k6943k6325k3645j6472j9296
$$ 826260 812162 811656 808862 789444 755745 742716 732228 705285 678960 655315 638843 619547
12064F19547j7548j1676K635J0246j702r516l1464k8399j1202j3522K733N193
$$ 619547 601999 590323 592958 603204 601502 591986 560522 532123 520921 507399 510132 515325
12052E15325p053j4180P041L600j390J4324N137l635M863J3280Q516j3152j1375
$$ 515325 508272 494092 501133 504733 503343 517667 522804 519169 524032 537312 545828 532676 521301
12039E21301K543k4419j2052j4701j8345j4948K025J0106k4467k5832n865j5689
$$ 521301 523844 499425 487373 472672 454327 439379 441404 451510 427043 401211 395346 379657
12027C79657N113J519O94K560J033n825k870n10L127P446P770J1212M708j228
$$ 379657 384770 386289 386983 389543 390576 384751 381881 381371 384498 391944 399714 410926 415634 414406
12013D14406q94J0332N439k7097k9742j9433j3099j5750j3898j4040p493j3126
$$ 414406 413512 423844 429283 402186 372444 353011 339912 324162 310264 296224 288731 275605
12001B75605l577j6880k0780J034K831M693r103q564R62j7316j9361P672Q882
$$ 275605 272028 255148 234368 235402 238233 242926 233823 225259 226221 208905 189544 197216 206098
11988B06098j4249o009m396L345L1787K893k0349q591o902O381P554q159n083
$$ 206098 191849 185840 181444 184789 216576 219469 199120 190529 183627 190008 197562 189403 184320
11975A84320l477j2644O008J0574J702j083R386J520j1170j8531j6853N527q779
$$ 184320 180843 168199 174207 184781 186483 185400 194786 196306 185136 166605 149752 155279 146500
11962A46500Q356k289J081L765r607o257J3417r662j6831j344N732M728k433r447
$$ 146500 154856 152567 153648 157413 147806 141549 154966 145304 128473 127129 132861 137589 135156 125709
11948A25709l85Q785L719j5234R836R198j5829l327K178R613K8775L659j5075
$$ 125709 125324 134109 137828 122594 132430 141628 125799 122472 124650 134263 163038 166697 151622
11935A51622q729o584r731j716J059J248N646K820l993l067l052o306n870o233
$$ 151622 142893 136309 126578 124862 125921 127169 132815 135635 131642 128575 125523 119217 113347 107114
11921A07114j041L519q1q34R031L215j1230m701p051O353J1324p431k775J0890
$$ 107114 106073 109592 109511 108677 117708 120923 109693 104992 97941 104294 115618 108187 105412 116302
11907A16302j410N796j1886j4971N594K0291J0866j0686o7n626q363n537p70l67
$$ 116302 114892 120688 108802 93831 99425 119716 130582 119896 119829 114203 105840 100303 99533 99166
11893I9166r673m208J840O209J0457Q11l794o602R928j213r150j4668j9273P595
$$ 99166 89493 85285 87125 93334 103791 104602 100808 94206 104134 102921 93771 79103 59830 67425
11879F7425J2803m317M491l257M484L955k123j3758j969J3668R797R54p01M553
$$ 67425 80228 75911 80402 77145 81629 85584 83461 69703 67734 81402 91199 92153 91452 96005
11865I6005J288l857M877k879j0450j7361P57P385M339J189j0538Q120M654J023
$$ 96005 97293 93436 98313 95434 84984 67623 68380 75765 80104 81293 70755 78875 83529 84552
11851H4552k0334o238j7056O546J3160R21k638q031k99l03K926M197j3551n531
$$ 84552 64218 57980 40924 47470 60630 61551 58913 50882 50583 50280 53206 57403 43852 38321
11837C8321P098J5982J1182n287j4802M748J685N526k3972p913O661j347j174
$$ 38321 45419 61401 72583 67296 52494 57242 58927 64453 40481 32568 39229 37882 36708
11824C6708J266j1960J2672Q059m829m518n342m67K4360O255o303n609K6n148
$$ 36708 37974 26014 38686 46745 41916 37398 32056 31589 55949 62204 55901 50292 50318 45170
11810D5170M705p77J3234o031o991o879k034m095Q816J4320L119m385o990j690
$$ 45170 49875 49098 62332 56301 49310 42431 40397 36302 45118 59438 62557 58172 51182 49492
11796D9492j734q779J1156O908j051J4731K859n954n094j610P941M512Q120N900
$$ 49492 47758 38979 50135 57043 55992 70723 73582 67628 62534 60924 68865 73377 81497 87397
11782H7397M861j254q427N707L772J1703o573N440K2543K8398K2671J4752M3924
$$ 87397 92258 91004 82577 88284 92056 103759 97186 102626 125169 153567 176238 190990 234914
11769B34914K8144L2481N0948J8132J6343R370L163n290k4825k7286n1286m0024
$$ 234914 263058 295539 346487 364619 380962 390332 393495 388205 363380 336094 284808 244784
11757B44784k0448j2647k64n187n350j3176m462R882K2700K760R721R254K0596
$$ 244784 224336 211689 211425 206238 200888 187712 183250 193132 215832 218592 228313 237567 258163
11744B58163J1264K4513K0892J4943J7051K3882K0030J0108J7211J6870J1871
$$ 258163 269427 293940 314832 329775 346826 370708 390738 400846 418057 434927 446798
11733D46798J0222R25k2866r940k5913j8708j6338k4055k4914j7289j4920m681
$$ 446798 457020 457945 435079 425139 399226 380518 364180 340125 315211 297922 283002 278321
11721B78321k8175j9141M994j1876k1506n010m033K111L915J0271J0117J3600
$$ 278321 250146 231005 235999 224123 202617 197607 193574 195685 199600 209871 219988 233588
11709B33588L145J2522K2014L8019K6103K3148J4820r686j9641l5712j7399k2364
$$ 233588 236733 249255 271269 309288 335391 358539 373359 363673 344032 308320 290921 268557
11697B68557l9631m4678m590j7352k2504k4855j4619j2447O576j1927j2598l240
$$ 268557 228926 184248 179658 162306 139802 114947 100328 87881 94457 82530 69932 66692
11685F6692J6372n367m75j9850j9327J088j108j4000J033o076o697R809o119n742
$$ 66692 83064 77697 77222 57372 38045 39133 38025 24025 25058 18982 12285 22094 15975 10233
11671A0233N684P45l393J810n080J1876J1959J316PQ432m623j106O06o171p698
$$ 10233 15917 16662 13269 15079 9999 21875 33834 35150 35157 43589 38966 37860 38466 32295 24597
11656B4597J1357j080j3514r419M591j4526n757K595M951j821o561j0513N999
$$ 24597 35954 34874 21360 11941 16532 2006 -3751 -1156 3795 1974 -4587 -15100 -9101
11643i101L127P645J4642j0691Q355n062k2025m07M244J6404L343p311J0694K5381
$$ -9101 -5974 1671 16313 5622 13977 8915 -13110 -13517 -9273 7131 10474 3163 13857 39238
11629C9238J8543m188j7043k0005q021p019K274Q176M386J4492r810p931l258
$$ 39238 57781 53593 36550 16545 8524 1505 3779 11955 16341 30833 21023 13092 9834
11616I834L493j1911j1743O183M056m906K112J99j590J61N126Q720P41p03r206
$$ 9834 13327 1416 -10327 -4144 -88 -4994 -2882 -2683 -4273 -4112 1014 9734 10475 9772 566
11601E66j141j878q256J1007R908J6577M886K084Q312M077q628R50L976j9280
$$ 566 -575 -2453 -10709 298 10206 26783 31669 33753 42065 46142 37514 38464 42440 23160
11587B3160j0781J7591M362o4o108J864q803J0185J6712Q981K8340K4459K4945
$$ 23160 12379 29970 34332 34268 28160 30024 21221 31406 48118 57099 85439 109898 134843
11574A34843K6475P413p118k2035j1827p417r6k2585j5220k4199j6486j1942L229
$$ 134843 161318 168731 161613 139578 127751 120334 120238 97653 82433 58234 41748 29806 33035
11561C3035j297r234m624O272N068l389j065o868q052m144J2468l786o256k240
$$ 33035 31738 22504 17880 24152 29220 25831 24766 17898 9846 5702 18170 14384 8128 5888
11547E888O728P790K2170Q236j2328M268L451O518k509J658R348R032J6542K5887
$$ 5888 12616 20406 42576 50812 38484 42752 46203 52721 50212 51870 61218 70250 86792 112679
11533A12679Q68m441K2011L1846K2753K8333M901p419k0144n748k475j6874j6634
$$ 112679 113547 109106 131117 162963 185716 214049 218950 211531 191387 185639 183164 166290 149656
11520A49656j2314j9063j8028j222j8280j1064M747M71r780j9870k4318K535P268
$$ 149656 137342 118279 100251 99029 80749 69685 74432 74903 65123 45253 20935 23470 30738
11507C0738M508q103p095J1979L226o525J3652Q926N574j2596j5467r844o532
$$ 30738 35246 27143 20048 32027 35253 28728 42380 51306 56880 44284 28817 18973 12441
11494A2441r147Q387k519k303R895J749m575K89m41K2783L1799K7319K9962K8648
$$ 12441 3294 11681 9162 6859 16754 18503 13928 14217 13776 36559 68358 95677 125639 154287
11480A54287J6246r948k2083k0321l1143k5167j8216j0146j102m526o187k612
$$ 154287 170533 160585 138502 118181 87038 61871 43655 33509 32407 27881 21694 19082
11468A9082K085M185n679n699j4141n818R960O755m239J184m105o536J0066j79
$$ 19082 21167 25352 19673 13974 -167 -5985 3975 10730 6491 7675 3570 -2966 7100 6921
11454F921J702k085Q364k32p066n463K576K228m966j4561n082Q039P758J1127
$$ 6921 8623 6538 14902 14670 7604 2141 4717 6945 1979 -12582 -17664 -9625 -1867 9260
11440I260L05J626k381Q508m391L021o686r326N752p86o31p18P567P77p805n191
$$ 9260 9565 11191 8810 17318 12927 15948 9262 -64 5688 4902 4271 3553 11120 11897 4092 -1099
11424a099M177L772P555m416m650J8577K163j3509N17J2102J9694O232k1876j1752
$$ -1099 3078 6850 14405 9989 5339 23916 26079 12570 13087 25189 44883 51115 29239 17487
11410A7487M215j7441m726J4713P673M062k715j0708j2513J2688J4734k150o341
$$ 17487 21702 4261 -465 14248 21921 25983 23268 12560 47 12735 27469 25319 18978
11397A8978L569N388m465l735q73m113Q05n58k2n255J94j1706n554J2002j815
$$ 18978 22547 27935 23470 19735 18862 14749 15554 14996 14974 9719 9913 -1793 -7347 4655 2840
11382B840j4034l822Q930J1181k669P504m087k773q166Q640R986j2389r35r983
$$ 2840 -11194 -15016 -6086 5095 2426 9930 5843 3070 -5096 3544 13530 1141 206 -9777
11368i777p988J1269K057J294m156O664L396j1077j9292O463l294K033J9456J1780
$$ -9777 -17765 -6496 -4439 -3145 -7301 -637 2759 -8318 -27610 -21147 -24441 -22408 -2952 8828
11354H828k876j6199J5610K2879j940j0243l394m913q698l060M162j765k254L213
$$ 8828 5952 -10247 5363 28242 26302 16059 12665 7752 -946 -4006 156 -1609 -3863 -650
11340f50k974K357P112m322m17l628N317j190n485j0891J030J3410L830l1j3419
$$ -650 -3624 -1267 5845 1523 1106 -2522 2795 1605 -3880 -14771 -13741 -331 3499 3468 -9951
11325i951L13K352p994pQ034J0079M613r101j5365q403j344J8049R650n497k457
$$ -9951 -9638 -7286 -15280 -15287 -7253 2826 7439 -1662 -17027 -25430 -26774 -8725 925 -4572 -7029
11310g029o181j719J0981K337L218l218m353L493J1813N43n989N17j8122l509
$$ -7029 -13210 -14929 -3948 -1611 1607 -1611 -5964 -2471 9342 9885 3896 4413 -13709 -17218
11296a7218Q435P886J991J2304P703m997j2050j5647l86J534L960m393K803N464
$$ -17218 -8783 -897 1094 13398 21101 16104 4054 -11593 -11979 -10445 -6485 -10878 -8075 -2611
11282b611Q213j3840n309n733l672O590J5670o008m864O01N334J778k0679r806
$$ -2611 5602 -8238 -13547 -19280 -22952 -16362 -692 -6700 -11564 -10963 -5629 -3851 -24530 -34336
11268c4336l878J3801j354J9120P518l528Q312L733L484j37P227N723j7266q827
$$ -34336 -38214 -24413 -25767 -6647 871 -2657 5655 9388 12872 12735 19962 25685 8419 -408
11254d08m511Q932o843j1357n65J2884P323N333j7463L772J6435k30j1650j0608
$$ -408 -4919 4013 -2830 -14187 -14752 -1868 5455 10788 -6675 -2903 13532 13302 1652 -8956
11240h956N845R295J443j2857p007J6433K246n978k647M736J6421K266j1493j3177
$$ -8956 -3111 6184 7627 -5230 -12237 4196 6442 464 -2183 2553 18974 21240 9747 -3430
11226c430j1690l653K20P128o017N036N182K79L36J4436p479j8202Q32J173L252
$$ -3430 -15120 -18773 -18553 -11425 -17442 -12406 -7224 -6945 -6609 7827 348 -17854 -17022 -15849 -12597
11211a2597J0726L651P855j7253n00J328r713J801K782L385L000q106M19L206
$$ -12597 -1871 1780 9635 -7618 -8118 -6790 -16503 -14702 -11920 -8535 -5535 -13641 -13222 -10016
11197a0016Q970J246n864j0849o218P914K0177o839m107o068l738o006J627P19
$$ -10016 -1046 200 -5664 -16513 -22731 -14817 5360 -1479 -5586 -11654 -15392 -21398 -19771 -19052
11183a9052R748J2498j3131r055J1133J2160L841n025m951l313N453l929q114
$$ -19052 -9304 3194 -9937 -18992 -7859 4301 8142 3117 -1834 -5147 306 -3623 -11737
11170a1737J799P21J377j571L421K093L68k370L677M238J1918k3j5427o954m526
$$ -11737 -9938 -9217 -7840 -9411 -5990 -3897 -3529 -5899 -2222 2016 13934 13911 -1516 -8470 -12996
11155a2996J2049K28M050k697j874J751k053n353O103N432l126j1881N909k713
$$ -12996 -947 -719 3331 634 -1240 511 -1542 -6895 -792 4640 1514 -10367 -4458 -7171
11141g171Q694p69j0735J202J9846l636j2015j6070m972J942P985M360K0942p041
$$ -7171 1523 754 -9981 -8779 11067 7431 -4584 -20654 -25626 -23684 -15699 -11339 9603 2562
11127B562j5752P069K209P227m768o448l865l270k610J3624N163j5650j4589j3114
$$ 2562 -13190 -6121 -3912 3315 -1453 -7901 -11766 -15036 -17646 -4022 1141 -14509 -29098 -42212
11113d2212O887J4309L193Q552P738M035N88M064p116k3468j6135N295J5455J4958
$$ -42212 -35325 -21016 -17823 -9271 -1533 2502 3090 7154 38 -23430 -39565 -34270 -18815 -3857
11099c857O839K878p811j434N147o403j2841m067j4217J3537K1106L873k033O09
$$ -3857 2982 5860 -1951 -3385 1762 -4641 -17482 -21549 -35766 -22229 -1123 2750 717 1326
11085A326j982K383L797j458J31j430r064m702o425l244J7361J0094j2563p732
$$ 1326 -656 1727 5524 4066 4197 2767 -6297 -10999 -17424 -20668 -3307 6787 -5776 -13508
11071a3508p695J1938Q277O284j5763q858J647M243m160O770j1495L672k702q807
$$ -13508 -21203 -9265 -988 5296 -10467 -19325 -17678 -13435 -17595 -10825 -22320 -18648 -21350 -30157
11057c0157j83k120K438R525K368o805O255K3820L778r538j3548R53R289P459
$$ -30157 -30340 -32460 -30022 -20497 -18129 -24934 -18679 5141 8919 -619 -14167 -13214 -3925 3534
11043C534N347J35N351j454n998N420j2091n621M53K257Q198p704J7833k876j5009
$$ 3534 8881 9016 14367 12913 6915 12335 244 -5377 -4924 -2667 5531 -2173 15660 12784 -2225
11028b225r254p484P79j340M239L552K524R30q217o059J2558J0968K542m633p228
$$ -2225 -11479 -18963 -18184 -19524 -15285 -11733 -9209 -8279 -16496 -22555 -9997 971 3513 -1120 -8348
11013h348o249p179o663L616Q070L920M913p424o50J5417J7655M983r354o330
$$ -8348 -14597 -21776 -28439 -24823 -16753 -12833 -7920 -15344 -15994 -577 17078 22061 12707 6377
10999F377r209n374n804J687o44k626K11J8576O009j110n933L668l291j553p350
$$ 6377 -2832 -8206 -14010 -12323 -12967 -15593 -15382 3194 9203 8093 2160 5828 2537 984 -6366
10984f366l491J7146J0588m339j4866k651R296L876n364q31k918j984j178o610
$$ -6366 -9857 7289 17877 13538 -1328 -3979 5317 9193 3829 2998 80 -1904 -3082 -9692
10970i692j7616n021K0727J3699M947j7950l261K426j16L361m401m738L968L923
$$ -9692 -27308 -32329 -11602 2097 7044 -10906 -14167 -11741 -11857 -8496 -12897 -17635 -13667 -9744
10956i744L019o442j489o931Q99N765J2101o791P448K055j091O964J1116L855
$$ -9744 -6725 -13167 -14656 -21587 -20688 -14923 -2822 -9613 -2165 -110 -1201 5763 16879 20734
10942B0734j5186j0735O00P49P679K563J039p16k004o798o6k116N638l530r077
$$ 20734 5548 -5187 -4587 -3838 3841 6404 7443 6727 4723 -2075 -2141 -4257 1381 -2149 -11226
10927a1226J8518L301k3243j2027l269k121P569O516J381K436J573r29j5275L165
$$ -11226 7292 10593 -12650 -24677 -27946 -30067 -22498 -15982 -14601 -12165 -10592 -11521 -26796 -23631
10913b3631J2195q159r719L404J6913J7438j122o993j938k023q089K193R756k972
$$ -23631 -11436 -19595 -29314 -25910 -8997 8441 7319 326 -1612 -3635 -11724 -9531 225 -2747
10899b747j6640o017q211r155Q689J9265n891j0217M358K2207P122l386M144p270
$$ -2747 -19387 -25404 -33615 -42770 -34081 -14816 -20707 -30924 -26566 -4359 2763 -623 3521 -3749
10885c749j2975q314O80P714Q148m722j1397j1108P003j100Jm619n157Q788M732
$$ -3749 -16724 -25038 -24358 -16644 -8496 -13218 -24615 -35723 -28720 -29820 -29819 -34438 -39595 -30807 -26075
10870b6075J0905J1488j214q141l066j327K843n680m83M8M511R702L85L181N015
$$ -26075 -15170 -3682 -4896 -13037 -16103 -17430 -14587 -20267 -20750 -20702 -16191 -6489 -6104 -2923 2092
10855B092K297j6309j230Q130M890L914N94M516O097Q92J3839M299m858K7846
$$ 2092 4389 -11920 -13150 -5020 -130 3784 4378 8894 14991 15883 29722 34021 29163 57009
10841E7009K5983O818n98n272k2680j5484m229J7165N290j6753j1922j7255K448
$$ 57009 82992 89810 89212 83940 61260 45776 41547 58712 64002 47249 35327 18072 20520
10828B0520J102l868j5438p08o89k300r923p623j8476M400K6385Q022k77n111
$$ 20520 21622 17754 2316 1608 919 -1381 -11304 -18927 -37403 -33003 -6618 1404 1127 -3984
10814c984M963j311M802J0397J7671J0282j3114j2194q795j3796J1745R771L761
$$ -3984 979 -332 4470 14867 32538 42820 29706 17512 8717 -5079 6666 16437 20198
10801B0198N822O062N664J8886J5108N22L913L897J0918J4349n683j516m252q235
$$ 20198 26020 32082 37746 56632 71740 72262 76175 80072 90990 105339 99656 98140 93888 85653
10787H5653q813k8305o551P881m898k473j3046r283J2397N837j5361p907K281
$$ 85653 76840 48535 41984 49865 44967 42494 29448 20165 32562 38399 23038 15131 17412
10774A7412O742r37l943l519q438j3485N160L794j413O25L67K910p973L352j0811
$$ 17412 24154 23217 19274 15755 7317 -6168 -1008 2786 1373 1998 2365 5275 -2698 654 -10157
10759a0157j1091L754Q009m12J850o132J1696J1761K643L071J4037j457Q387l403
$$ -10157 -21248 -17494 -9485 -9897 -8047 -14179 -2483 9278 11921 14992 29029 27572 35959 32556
10745C2556N019J2414J0190K1795P710m266j3296q827p224k2324p66R659k408
$$ 32556 37575 49989 60179 81974 89684 85418 72122 63295 56071 33747 32981 42640 40232
10732D0232j5487p012L28j5777K94j0646Q623J6307L007n304M784R870j0346j2460
$$ 40232 24745 17733 18061 2284 2578 -8068 555 16862 19869 14565 19349 29219 18873 6413
10718F413Q88l535j007J189k422M407L136L508o726J717j1152q064J226K243k768
$$ 6413 7301 3766 2759 3948 1526 5933 9069 12577 5851 7568 -3584 -11648 -10422 -8179 -10947
10703a0947L91j966R635L001j5425r313M521O689M725O92l784M924pq347M268
$$ -10947 -10556 -12522 -2887 114 -15311 -24624 -20103 -13414 -8689 -7997 -11781 -6857 -6864 -15211 -10943
10688a0943J3040j8591k302O186l605j5356o119N855R976J408J0496M942N719
$$ -10943 2097 -16494 -18796 -12610 -16215 -31571 -37690 -31835 -21859 -20451 -9955 -5013 706
10675G06m374j7691O203M781N080m507o760J4238J3056l623r239K385k2R930r156
$$ 706 -3668 -21359 -15156 -10375 -5295 -9802 -16562 -2324 10732 7109 -2130 255 233 10163 1007
10660A007n438J4381J5156j0130j3901L373p325j5153Q719J3321j0804l398J4361
$$ 1007 -4431 9950 25106 14976 1075 4448 -2877 -18030 -9311 4010 -6794 -10192 4169
10647D169j1131n748J260J1932P655L555q444o903j2860k859J2935M9n316j621
$$ 4169 -6962 -12710 -11450 482 8137 11692 3248 -3655 -16515 -19374 -6439 -6390 -11706 -13327
10633a3327O075r25j110j3502o001j72Q533Q110o033r890R774J7863k230q768
$$ -13327 -7252 -8177 -9287 -22789 -28790 -28962 -20429 -12319 -18352 -28242 -18468 -605 -2835 -11603
10619a1603J1690j0577j8955N164P576M315M384P210j1628j1969O290J3219L297
$$ -11603 87 -10490 -29445 -24281 -16705 -12390 -8006 -796 -12424 -24393 -18103 -4884 -1587
10606a587r921j0972p535J5928K1638R346q500j706k1314j4953j1628n847M867
$$ -1587 -11508 -22480 -30015 -14087 7551 16897 8397 6691 -14623 -29576 -41204 -47051 -42184
10593d2184J7048O407o638j2024J9297M220j2775N96O360O139p134n380L406N715
$$ -42184 -25136 -18729 -25367 -37391 -18094 -13874 -26649 -26053 -19693 -13554 -20688 -26068 -22662 -16947
10579a6947o18N070m332J307L762o68J2617M885k0445J3260N223J148N020j5994
$$ -16947 -17565 -12495 -16827 -15520 -11758 -12426 191 5076 -15369 -2109 3114 4262 9282 -6712
10565f712j3780q789m441O333p668j0235J846K0716J9163Q412j6443o430J1311
$$ -6712 -20492 -29281 -33722 -27389 -35057 -45292 -43446 -22730 -3567 4845 -11598 -18028 -6717
10552f717N231J0456j2823j9476j481N580J1502K1166K820j3447k0952J2774J286
$$ -6717 -1486 8970 -3853 -23329 -24810 -19230 -7728 13438 16258 2811 -18141 -5367 -4081
10539d081J2872O643o674n517p96p038j603M984J3035j4057j862O619K416o368
$$ -4081 8791 15434 8760 3243 2447 -4591 -6194 -1210 11825 -2232 -4094 2525 4941 -1427
10525a427L354J024j3553j2310r545l206k023o19J0367K962j945N429r90Q515
$$ -1427 1927 2951 -10602 -22912 -32457 -35663 -37686 -38305 -27938 -24976 -26921 -21492 -22482 -13967
10511a3967L187k74j4996n659K250J0894J2309j225M989m421o388k362J024O385
$$ -13967 -10780 -11054 -26050 -31709 -29459 -18565 -6256 -7481 -2492 -6913 -13301 -15663 -14639 -8254
10497h254p072m132n178l628L139J1827O989N545k614L503Q055M741j5712j4767
$$ -8254 -15326 -19458 -24636 -28264 -25125 -13298 -6309 -764 -3378 125 8180 12921 -2791 -17558
10483a7558p048N652Q060J6794Q80j0122k830J834r883j1221J3726J1577K991
$$ -17558 -24606 -18954 -10894 5900 6780 -3342 -6172 -4338 -14221 -25442 -11716 -139 2852
10470B852L498o112j1034m705J9663j975k905l848j3193m422J5653J0276n65j5242
$$ 2852 6350 238 -10796 -15501 4162 2187 -718 -4566 -17759 -22181 -6528 3748 3183 -12059
10456a2059N026l630J176J1713J6337j8717n723j406l708Q138k911j8860k4J6439
$$ -12059 -7033 -10663 -9487 2226 18563 -154 -5877 -7283 -10991 -2853 -5764 -24624 -24648 -8209
10442h209O046j1379n506L398J788K701j163p792j048L486k906n160J592O649
$$ -8209 -2163 -13542 -19048 -15650 -13862 -11161 -12324 -20116 -21164 -17678 -20584 -25744 -24152 -17503
10428a7503J4053n996J69O768p694l533l198l847o417K286R912O168j6146n101
$$ -17503 -3450 -9446 -9277 -2509 -10203 -13736 -16934 -20781 -27198 -24912 -15000 -8832 -24978 -30079
10414c0079K5906J242j2113O333m959j3444L175Qp44J336L49j1o48J955L487J3273
$$ -30079 -4173 -2931 -15044 -8711 -13670 -27114 -23939 -23931 -24675 -23339 -22990 -23001 -23649 -21694 -18207 -4934
10398d934M857P913M18p332Q135n123j4923m251k642K803J0118K449R969K268
$$ -4934 -77 7836 8254 922 9057 3934 -10989 -15240 -17882 -15079 -4961 -2512 7457 9725
10384I725o659r130O56n094q960r28M616J2076J2986j093o568j3234o378M78k032
$$ 9725 3066 -6064 -5408 -10502 -19462 -20390 -15774 -3698 9288 8195 1627 -11607 -17985 -17507 -19539
10369a9539K866J306j913P397J0339j3307k351j7638M683J6533k473O468L135
$$ -19539 -16673 -15367 -17280 -9883 456 -12851 -15202 -32840 -28157 -11624 -14097 -7629 -4494
10356d494L81L484K217o039q297K673J0125L748L872j661l880p416o014P265k586
$$ -4494 -4113 -629 1588 -4451 -12748 -10075 50 3798 7670 6009 2129 -5287 -11301 -4036 -6622
10341f622l749j8J52j081O67R226Q57k75j2374o443L76k704q240P220J3970L597
$$ -6622 -10371 -10389 -10237 -11318 -10651 -1425 -568 -843 -13217 -19660 -19284 -21988 -30228 -23008 -9038 -5441
10325e441r054L695N127j0990q581J0652O846J931k734j5842O233J0746O573k686
$$ -5441 -14495 -10800 -5673 -16663 -25244 -14592 -7746 -5815 -8549 -24391 -18158 -7412 -839 -3525
10311c525N162k11O732l581j2695J0222j1836n040J034J015J168r158l523K108
$$ -3525 1637 1426 8158 4577 -8118 2104 -9732 -14772 -13738 -12723 -11555 -20713 -24236 -22128
10297b2128J2285R852J0996m483j4528p908J0525J005Q668O443K805P624K709
$$ -22128 -9843 9 11005 6522 -8006 -15914 -5389 -4384 4284 10727 13532 21156 23865
10284B3865J755M66m675p986j0445p344j2620K607J6813M329o048j0412K6J838
$$ 23865 25620 26086 21411 13425 2980 -4364 -16984 -14377 2436 6765 717 -9695 -9669 -7831
10270g831Q467J082j2162k026J295P942O321n536K2725R308r887M18j7266K950
$$ -7831 636 1718 -10444 -12470 -11175 -3233 3088 -2448 20277 29585 19698 20116 2850 5800
10256E800N560p177K701o686q467o190L069P918j124J3082R109M338n326M023
$$ 5800 11360 4183 6884 198 -8269 -14459 -11390 -3472 -4596 8486 17595 21933 16607 20630
10242B0630o021j4077J3051n029K827j0541j0897J5678O036j0806j0599j1039
$$ 20630 14609 532 13583 8554 11381 840 -10057 5621 11657 851 -9748 -20787
10230b0787P439k71L629R587n150l803n421K564M927J0436O191k392j561j0160
$$ -20787 -13348 -13619 -9990 -403 -5553 -9356 -14777 -12213 -7286 3150 9341 6949 5388 -4772
10216d772n756J417J4232O172j945k584K426m912L264j060q14J892n695m331r074
$$ -4772 -10528 -9111 5121 11293 9348 6764 9190 4278 7542 6482 5668 7560 1865 -2466 -11540
10201a1540o79P804l067N007J4921P940K348p087j131j817j0167j7108Q101k265
$$ -11540 -12219 -4415 -7482 -2475 12446 20386 22734 15647 14516 12699 2532 -14576 -6475 -8740
10187h740p475m62K811J1393M216K218P573J0223k974L373l976n169J8688j1465
$$ -8740 -16215 -16677 -13866 -2473 1743 3961 11534 21757 18783 22156 18180 13011 31699 20234
10173B0234j4556l525M772J287j7421r211r598n929J4334R910O621L561j0276
$$ 20234 5678 2153 6925 8212 -9209 -18420 -28018 -33947 -19613 -9703 -3082 479 -9797
10160i797j499p227K242J0043P442R653R44n889L946Q644j682M892M65j3471j0849
$$ -9797 -11296 -18523 -16281 -6238 1204 10857 11801 5912 9858 18502 16820 21712 22177 8706 -2143
10145b143j3000o269j422M969L188R490K2071K92K86r733j1652l237o540n274
$$ -2143 -15143 -21412 -22834 -17865 -14677 -5187 16884 17176 17462 7729 -3923 -7160 -13700 -18974
10131a8974R873J2740q12j767k698j0339K023J0218J9368J3427J38j5726k1333
$$ -18974 -9101 3639 2827 1060 -1638 -11977 -9954 264 19632 33059 33197 17471 -3862
10118c862O16o14K284N067L168q065k102K077L788j954o118r4P664r324n982M841
$$ -3862 -3246 -3860 -1576 3491 6659 -1406 -3508 -1431 2357 403 -5715 -5809 1855 -7469 -13451 -8610
10102h610R346O682m467j0476P529p853O86J4098J1004j767p771j8q184r811n92
$$ -8610 736 7418 2951 -7525 4 -7849 -7163 6935 17939 16172 8401 8383 199 -9612 -10204
10087a0204J421k313n908q33J5812l342p801Q656R114k086q911L011J5064j1874
$$ -10204 -8783 -11096 -17004 -17837 -2025 -5367 -13168 -4512 4602 2516 -6395 -3384 11680 -194
10073a94o455P431O818K543K071j5965j7489J505N562k796k87J5696Q16n071k423
$$ -194 -6649 782 7600 10143 12214 -3751 -21240 -19735 -14173 -16969 -17256 -1560 -744 -5815 -8238
10058h238j3441m66K170J8331J2625j591q584j5854K920Q414m878o053N37N458
$$ -8238 -21679 -22145 -19975 -1644 10981 9390 806 -15048 -12128 -3714 -8592 -14645 -14108 -8650
10044h650J2816J4515L641J183J4293K137j9916j0180J0553m319L962r754J57
$$ -8650 4166 18681 22322 23505 37798 39935 20019 9839 20392 16073 20035 10281 10438
10031A0438l567p086N006q494j571L118k912P187J5003r118m445k616l47Q567
$$ 10438 6871 -215 4791 -3703 -5274 -2156 -5068 2119 17122 8004 3559 943 596 9163
10017I163o084q409M317k005O668M029M053o165p873k662J5837L157P103k562
$$ 9163 3079 -5330 -1013 -3018 3650 7679 11732 5567 -2306 -4968 10869 14026 21129 18567
10003A8567j0217l145N089P153o944m512O221J124N63j166j1222l717M538J793
$$ 18567 8350 5205 10294 17447 10503 5991 12212 13336 13899 12733 1511 -2206 2332 4125
9989D125j9895o054R407O323l638J134J0011j803n590L521J1223M982O851K428
$$ 4125 -15770 -21824 -12417 -6094 -9732 -8598 1413 -390 -5980 -2459 8764 13746 20597 23025
9975B3025q72q413k2795p407L049J4067N693R805L528l471j5389m407J0013J2189
$$ 23025 22153 13740 -9055 -16462 -13413 654 6347 16152 19680 16209 820 -3587 6426 18615
9961A8615j4721k5646p148j0596k027L082J3852J0930K7907P362L63J634m673
$$ 18615 3894 -21752 -28900 -39496 -41523 -38441 -24589 -13659 14248 21610 21973 23607 18934
9948A8934k246k199N354J2043j5896j7175l586O742P35o670P234l758L105K115
$$ 18934 16688 14489 19843 31886 15990 -1185 -4771 1971 2706 -3964 3270 -488 2617 4732
9934D732J499k096J5415O484j0584l581j649M715q562k971J0078J9770k097l202
$$ 4732 6231 4135 19550 26034 15450 11869 10220 14935 6373 3402 13480 33250 31153 27951
9920B7951p638p654p128j08l541k239N564N589L145P512O04l107k534j2920p713
$$ 27951 20313 12659 5531 5423 1882 -357 5207 10796 13941 21453 22057 18950 16416 3496 -4217
9905d217j159L346J0590P399n474l991P16O382o08O999L218j4132p300P438J8203
$$ -4217 -5376 -2030 8560 15959 10485 6494 7210 13592 12984 19983 23201 9069 1769 9207 27410
9890B7410K3715q56n522q429p150n102j078m167n171R47q398o196J4440J7311
$$ 27410 51125 50269 44747 36318 29168 24066 22988 18821 13650 14597 6199 3 14443 31754
9876C1754M884n810K392l058l514q723j887L77m503M065J5341Q268j869k504l445
$$ 31754 36638 30828 33220 30162 26648 17925 16038 16415 11912 15977 31318 39586 37717 35213 31768
9861C1768r284m305J1141K4044Q896R98J4207J1399k85q912r48j09o295q829L643
$$ 31768 22484 18179 29320 53364 62260 63258 77465 88864 88579 79667 78719 78610 72315 63486 67129
9846F7129p702k59p286J0636L599m681j0534m284K243j685n007j6892M959k829
$$ 67129 59427 59168 51882 62518 66117 61436 50902 46618 48861 47176 42169 25277 30236 27407
9832B7407J5091O165L294o286Q60j0911j603O654r819L28q388q824m036K308l210
$$ 27407 42498 48663 51957 45671 46531 35620 34017 40671 30852 31180 22792 13968 9932 12240 9030
9817I030k916j732p842N965J7317O15m815l443n955n56L793k017k869R335J894
$$ 9030 6114 4382 -3460 2505 19822 20437 15622 12179 6224 5668 9461 7444 4575 13910 15804
9802A5804M39P587M99J7117o077j1708O860P044k801J6145K999r045N648J6206
$$ 15804 16243 23830 24329 41446 35369 23661 30521 37565 34764 50909 53908 44863 50511 66717
9788F6717J2347j5680j8465j2967j9809O10J5014R682L830K1472n741j7966r791
$$ 66717 79064 63384 44919 31952 12143 12753 27767 37449 41279 62751 57010 39044 29253
9775B9253P79J0959J3959N315L266n970j0716j961O194O918j112j1100l631Q232
$$ 29253 30032 40991 54950 60265 63531 57561 46845 44884 51078 57996 56884 45784 42153 50385
9761E0385J4947q073l492P688N019M519J0498p031j4197m34j268N638K602p725
$$ 50385 65332 57259 53767 61455 66474 70993 81491 74460 60263 59829 58561 64199 66801 59076
9747E9076m931r780m279o71o393j2253P644N916L391m033l065J84K224N247m197
$$ 59076 54145 44365 40086 39415 33022 20769 28413 34329 37720 33687 30622 30806 33030 38277 34080
9732C4080p611J527N36k864J815P277n322m67q854K294k44L333J0432J0923l263
$$ 34080 26469 27996 28532 25668 27483 34760 29438 28971 20117 22411 22167 25500 35932 46855 43592
9717D3592l792m0M283J3939J63L874L921O322M339N227j4713n285p064j1091J7417
$$ 43592 39800 39760 44043 57982 58145 62019 65940 72262 76601 81828 67115 61830 54766 43675 61092
9702F1092Q39J280o9j0803n781M741M114J704j2687m143J1503K400n928n133q040
$$ 61092 61931 63211 63142 52339 46558 51299 55413 57117 44430 40287 51790 54190 48262 43129 35089
9687C5089R721J0757m342j08m879o97R703J4840m796j5507o925K408L590P500
$$ 35089 44810 55567 51225 51117 46238 45541 55244 70084 65288 49781 42856 45264 48854 56354
9673E6354q24j133J7789J6139Q431k8104j2774J6311N270p187j6947M818K3831
$$ 56354 55530 54397 72186 88325 96756 68652 55878 72189 77459 70272 53325 58143 81974
9660H1974J4347j0057j7100q962q95J5397O850l076j1984q833m264L288l80J2308
$$ 81974 96321 86264 69164 60202 59307 74704 81554 78478 66494 57661 53397 56685 56305 68613
9646F8613k552j877L668j117P201o679j4381J49o510J0410Q417m74J7058q635
$$ 68613 66061 64184 67852 66735 73936 67257 52876 53025 46515 56925 65342 64868 81926 73291
9632G3291j0805J6871R163j746j147k269o221K54j605K834J0610N371J248M686
$$ 73291 62486 79357 88520 86774 85627 83358 77137 77391 75786 78620 89230 94601 95849 100535
9618A00535J9163O748p637m735p113N224J2600o100k308L05L194k577j945j1344
$$ 100535 119698 126446 118809 114074 106961 112185 124785 118685 116377 116682 119876 117299 115354 104010
9604A04010p843J18n932K22J8601J4595K3882J2492J0371J7942o210j666j1470
$$ 104010 96167 96285 90353 90575 109176 123771 147653 160145 170516 188458 182248 180582 169112
9591A69112J522k603J589j5110k4110K667o34j0072r851N84O470l081j3769P15
$$ 169112 170634 168031 169620 154510 130400 133067 132433 122361 112510 113094 119564 116483 102714 103429
9577A03429j2221j2054p345J582J0113L415m94j314J8347R569L323O153R736J5773
$$ 103429 91208 79154 71809 73391 83504 86919 86425 85111 103458 113027 116350 122503 132239 148012
9563A48012J0124p85J0129J0833Q445J5916L3860L5432J3740n41R456m035j2076
$$ 148012 158136 157351 167480 178313 186758 202674 236534 271966 285706 285165 294621 290586 278510
9550B78510P522P310J4554J1741m814j1940O21n151j0753o206j0081K513M105
$$ 278510 286032 293342 307896 319637 314823 302883 303504 298353 287600 281394 271313 273826 277931
9537B77931J243j0696Kj2588J410P284J4092J4537j451j6435M521m523j2761r241
$$ 277931 279174 268478 268480 255892 257302 264586 278678 293215 291764 275329 279850 275327 262566 253325
9523B53325R666k684j1637j3887R846J362L240R653l535p153k434M625R632P873
$$ 253325 262991 260307 248670 234783 244629 245991 249231 258884 255349 248196 245762 250387 260019 267892
9509B67892N450M065J0250J290Q69J5735L0025N1487L5650K5404L8106M0260J6451
$$ 267892 273342 277407 287657 288947 289816 305551 335576 387063 422713 448117 486223 526483 542934
9496E42934P892J6215J2462J548j2374j2310j0117k477j7347p584j6390k3030
$$ 542934 550826 567041 579503 581051 568677 556367 546250 543773 526426 518842 502452 479422
9484D79422p703N601N615J9059K2780r077o986m431k2171j6686q972j9468j2740
$$ 479422 471719 477320 482935 501994 524774 515697 508711 504280 482109 465423 456451 436983 424243
9471D24243j3944j9308j4245k4456q600l923j1918m687m167O337K7786K764r066
$$ 424243 410299 390991 376746 352290 343690 339767 327849 323162 318995 325332 353118 355882 346816
9458C46816K830j02J8509L2971L7182J9165L2262L4455K1154K4495J1543J0067
$$ 346816 349646 349544 368053 401024 438206 457371 489633 524088 545242 569737 581280 591347
9446E91347j2485j6964k2963j9092k077L530K7843M2632M6878L1101J5153Q520
$$ 591347 578862 561898 538935 519843 517766 521296 549139 591771 638649 669750 684903 693423
9434F93423J3200O718M402l1901j8239j8093k5262k9611k6018l0564m1306o732
$$ 693423 706623 713341 717743 685842 667603 649510 624248 594637 568619 538055 496749 490017
9422D90017M479j6163j2344j2903k5746j7459r108k1201k6239m106J793K193J5299
$$ 490017 494496 478333 465989 453086 427340 409881 400773 379572 353333 349227 351020 353213 368512
9409C68512O744R20j7552O838J8319K3836L6481J7796J6803J3650K4663K2832
$$ 368512 375256 376176 358624 365462 383781 407617 444098 461894 478697 492347 517010 539842
9397E39842J1540J8824j009M475P019J1401J2825J7990J2687J280n657j420m443
$$ 539842 551382 570206 569197 573672 580691 592092 604917 622907 635594 636874 631217 629797 625354
9384F25354J944j0287j3412O59o924J0709J6941K0229L6664K0095J3696K5320
$$ 625354 627298 617011 603599 604258 597334 608043 624984 645213 681877 701972 715668 740988
9372G40988K4368L0402M1640P8474J21276J11764Q8992N5657O4922J01263J14480
$$ 740988 765356 795758 837398 915872 1037148 1148912 1237904 1293561 1358483 1459746 1574226
9361A574226R1040N4003k2704n8132o0043n8705n4642m5381o9887r6284q0010
$$ 1574226 1665266 1719269 1696565 1638433 1578390 1519685 1465043 1419662 1349775 1253491 1173481
9350A173481q5412p3032o1639n4657m4947j7044q188q899J4161J7990J5244K6380
$$ 1173481 1088069 1015037 953398 898741 853794 836750 828562 819663 833824 851814 867058 893438
9338H93438K6934K8296L3188M4357N7327P8409R9098J24037J53333K06268L01136
$$ 893438 920372 948668 981856 1026213 1083540 1161949 1261047 1385084 1538417 1744685 2045821
9327B045821L65551M22983L71891K39065J55887J39791J40816J56472J97047K77726
$$ 2045821 2411372 2834355 3206246 3445311 3601198 3740989 3881805 4038277 4235324 4513050
9317D513050K31727P8494n0561j18038j30135j32361r8751j18243j37701j81990
$$ 4513050 4744777 4823271 4772710 4654672 4524537 4392176 4293425 4175182 4037481 3855491
9307C855491j52432q4574n6886q8940j07628r2611m3128j2436l2317l1225n7326
$$ 3855491 3703059 3618485 3561599 3472659 3365031 3272420 3229292 3216856 3184539 3153314 3095988
9296C095988r8447j22861j03410o8987n0580n0318k0175L5143O9952J24866K13974
$$ 3095988 2997541 2874680 2771270 2702283 2651703 2601385 2581210 2616353 2686305 2811171 3025145
9285C025145K94941L83877M76390M74958M09177L77232L42883K35705J27336Q2624
$$ 3025145 3320086 3703963 4180353 4655311 5064488 5441720 5784603 6020308 6147644 6230268
9275F230268O4823J26548K32315K98751K60171J45713J18586J75436J96302J59695
$$ 6230268 6295091 6421639 6653954 6952705 7212876 7358589 7477175 7652611 7848913 8008608
9265H008608J27989J25468J05141J4170m5637j09608k40466l49966l61772l59805
$$ 8008608 8136597 8262065 8367206 8381376 8335739 8226131 7985665 7635699 7273927 6914122
9255F914122l87676l95225l60619l06796k68758k49821k16627j82374j46093p8875
$$ 6914122 6526446 6131221 5770602 5463806 5195048 4945227 4728600 4546226 4400133 4321258
9245D321258K3484R5101Q6628O9597J01901R3869O2042P5376Q1199P3072J12748
$$ 4321258 4344742 4439843 4526471 4596068 4697969 4791838 4853880 4929256 5010455 5083527 5196275
9234E196275K24274L05814L01540K83855L14046M02888M92690N44019N44739N23281
$$ 5196275 5420549 5726363 6027903 6311758 6625804 7028692 7521382 8065401 8610140 9133421
9224I133421M51860L76804L36084K50913J01426P845l4355n2095o6456k6213P2614
$$ 9133421 9585281 9962085 10298169 10549082 10650508 10658353 10623998 10571903 10505447 10479234 10551848
9213A0551848K37584N23145R91217J632111K301031K459252J637048K39250o62336
$$ 10551848 10789432 11312577 12303794 13935905 16236936 18696188 20333236 20572486 19910150
9204A9910150q51414p83574o25094k47195J77526J58504l40931r05773j257439
$$ 19910150 19058736 18275162 17650068 17402873 17580399 17738903 17397972 16492199 15234760
9195A5234760j427304j578099j582329j395278j077505p33404m55941k38324j14707
$$ 15234760 13807456 12229357 10647028 9251750 8174245 7440841 6984900 6746576 6631869
9186F631869L405R9054J43948K40675M00958N83167O44137M96753L49930L85473
$$ 6631869 6635274 6734328 6878276 7118951 7519909 8103076 8747213 9243966 9593896 9979369
9176I979369M52114L53792J99810K61293N02134P69086J093487J675532K531596
$$ 9979369 10431483 10785275 10985085 11246378 11748512 12517598 13611085 15286617 17818213
9167A7818213L512234M332731N236852N836175M573341J951422N5677m37011l13332
$$ 17818213 21330447 25663178 30900030 36736205 41309546 43260968 43316645 42879634 42566302
9158D2566302n07476j110599j717291k280304k672412k608012k137368j475649
$$ 42566302 42058826 40948227 39230936 36950632 34278220 31670208 29532840 28057191
9150B8057191q12146l73337k50263j99856j6205K16409L32343j2145q86202j227651
$$ 28057191 27245045 26871708 26621445 26421589 26405384 26621793 26954136 26941991 26055789 24828138
9140B4828138p63203j71984r0256n68681q61617p97515q83004j163677j207316
$$ 24828138 24064935 23892951 23802695 23234014 22372397 21574882 20691878 19528201 18320885
9131A8320885r84075p66642n03062o215P07680J579472K357403K775950K877069
$$ 18320885 17336810 16570168 16067106 16060891 16768571 18348043 20705446 23481396 26358465
9122B6358465K518884J732102J153066J070668J473265K227043K578138K366224
$$ 26358465 28877349 30609451 31762517 32833185 34306450 36533493 39111631 41477855
9114D1477855K791431L862427M772200N275960M730604L200916K190684K117129
$$ 41477855 44269286 48131713 52903913 58179873 62910477 66111393 68302077 70419206
9106G0419206J383596o60260k340869l254678m092225m621463m643118m438335
$$ 70419206 71802802 71142542 68801673 65546995 61454770 56833307 52190189 47751854
9098D7751854m445564m437682m031963l315840k448131j413265j60453R35184
$$ 47751854 43306290 38868608 34836645 31520805 29072674 27659409 27498956 28434140
9090B8434140J187034R47910P84696L42693m13408r60848j061054p12179p61049
$$ 28434140 29621174 30569084 31353780 31696473 31283065 30322217 29261163 28548984 27787935
9081B7787935j709609k358856k045030j395916r27286l49863O49142J922148K742287
$$ 27787935 26078326 23719470 21674440 20278524 19351238 19001375 19650517 21572665 24314952
9072B4314952K595687K074485J673944P96082q4951k724R17390K347967M323556
$$ 24314952 26910639 28985124 30659068 31455150 31370199 31367475 32284865 34632832 38956388
9063C8956388O852996R076382Q978626N759553J893863r95659l184092n421317
$$ 38956388 45809384 54885766 63864392 69623945 71517808 70522149 67338057 61916740
9055F1916740p293786p794603p032124n788251m503285l164176j760768k52560
$$ 61916740 54622954 46828351 39796227 34007976 29504691 26340515 24579747 24327187
9047B4327187J321460K486598K787069K716981K681685J876801L46551j669701
$$ 24327187 25648647 28135245 30922314 33639295 36320980 38197781 38544332 36874631
9039C6874631l492317m110352m066905l877421l582996k996359k228859j593261
$$ 36874631 33382314 29271962 25205057 21327636 17744640 14748281 12519422 10926161
9031A0926161j130580q10987n84381m28666k86407j82314p1739J2599J13605K36827
$$ 10926161 9795581 8984594 8400213 7971547 7685140 7502826 7431087 7443686 7557291 7794118
9021G794118L58449M91250O50819Q85972J257578J842580K737295L850893M422362
$$ 7794118 8152567 8643817 9294636 10180608 11438186 13280766 16018061 19868954 24291316
9012B4291316L205954Q96266l69845l90039k5027M64911J124886J200114j68317
$$ 24291316 27497270 28393536 28023691 27633652 27608625 28073536 29198422 30398536 30230219
9003C0230219j925623k715567k876558l036150l120411k819883k191158j544286
$$ 30230219 28304596 25589029 22712471 19676321 16555910 13736027 11544869 10000583
8995A0000583j084655p93007n90962m30959l18985k49357k18774k02171j44971
$$ 10000583 8915928 8122921 7531959 7101000 6782015 6532658 6313884 6111713 5966742
8986E966742r6617p6006n0156n5678q8309j37467j53251j56832j44283j18411
$$ 5966742 5870125 5794119 5743963 5688285 5599976 5462509 5309258 5152426 5008143 4889732
8976D889732j05683p7551n1990j3981o502k531K2393O3169J23952J82576J86305
$$ 4889732 4784049 4706498 4654508 4640527 4634025 4631494 4653887 4717056 4841008 5023584 5209889
8965E209889J36531J20498J86495K47363K70265K95140L08437K36800J48041J58535
$$ 5209889 5346420 5466918 5653413 5900776 6171041 6466181 6774618 7011418 7159459 7317994
8955G317994K04068J45975M2223l933o9154j47818j99332k03309j85384k70028
$$ 7317994 7522062 7668037 7710260 7706327 7637173 7489355 7290023 7086714 6901330 6631302
8945F631302l45349l25700k85073k28283j75852q6056k738L1660L2633K7520J7283
$$ 6631302 6285953 5960253 5675180 5446897 5271045 5184989 5182251 5213911 5246544 5274064 5291347
8934E291347l472j8864l4369r1639j37672j47833j14275r1078q5272p2882m2691
$$ 5291347 5287875 5269011 5234642 5143003 5005331 4857498 4743223 4652145 4566873 4493991 4451300
8923D451300K8023J15940J95186K17640J53988R4719J34617J94951K35109K95389
$$ 4451300 4479323 4595263 4790449 5008089 5162077 5256796 5391413 5586364 5821473 6116862
8913F116862L24262K13473L8172o3633n6242l7945k6565n355M496k4838j08243
$$ 6116862 6441124 6654597 6692769 6629136 6572894 6534949 6508384 6503029 6507525 6482687 6374444
8902F374444j43249j61876k02378k17780j80970j40124j60044j65172r3751j4298
$$ 6374444 6231195 6069319 5866941 5649161 5468191 5328067 5168023 5002851 4909100 4894802
8892D894802p069m6673Q824J34279K31436K52410K16475J56856J6577j19449j78712
$$ 4894802 4887733 4841060 4849884 4984163 5215599 5468009 5684484 5841340 5857917 5738468 5559756
8881E559756k18665k76632l96668m06364l37934k69493k25192j79627j27289m4671
$$ 5559756 5341091 5064459 4667791 4261427 3923493 3654000 3428808 3249181 3121892 3077221
8871C077221K8031R2568J22486J51166K06214K38342K48263K02129J43305J21106
$$ 3077221 3105252 3197820 3320306 3471472 3677686 3916028 4164291 4366420 4509725 4630831
8861D630831J20008J07035R4647M3426n746j7431k570K2325J0501j6329K3695
$$ 4630831 4750839 4857874 4952521 4995947 4990201 4972770 4970200 4992525 5003026 4986697 5010392
8850E010392J11125K10992K54354K57710K68054L29804M84527O61785Q58818J145278
$$ 5010392 5121517 5332509 5586863 5844573 6112627 6442431 6926958 7588743 8447561 9592839
8840I592839J576689K229674L095858L738329L110388Q57325j178644j876515
$$ 9592839 11169528 13399202 16495060 20233389 23343777 24201102 23022458 21145943
8832B1145943k074345k419908k650001k379143j827991j302485r53446p05645
$$ 21145943 19071598 16651690 14001689 11622546 9794555 8492070 7538624 6832979
8824F832979n10030l79092k85720k19350j51793r8594k3432N3416R3722J33640
$$ 6832979 6322949 5943857 5658137 5438787 5286994 5188400 5164968 5218384 5312106 5445746
8814E445746K02425K78329L70090M65746N69629O37102P31032R25231J110353
$$ 5445746 5648171 5926500 6296590 6762336 7331965 7969067 8700099 9625330 10735683
8805A0735683J108516Q94868P79641Q74787J108159J395786J762905K363659L247615
$$ 10735683 11844199 12739067 13518708 14393495 15501654 16897440 18660345 21024004 24271619
8796B4271619M348959N453988O302829O903903P015288O073914L974613J976280
$$ 24271619 28620578 34074566 40377395 47281298 54296586 60370500 64345113 66321393
8788F6321393M85594j993435m782768n964509n894968n599330n349924m874674
$$ 66321393 66806987 64813552 60030784 54066275 48171307 42571977 37222053 32347379
8780C2347379m154299l366474k657163k108137j752165j502677j280122j016623
$$ 32347379 28193080 24826606 22169443 20061306 18309141 16806464 15526342 14509719
8772A4509719p61593n68902l94664j66577R9149L22426N22898Q28503J233333
$$ 14509719 13748126 13179224 12784560 12617983 12717132 13039558 13562456 14390959 15624292
8763A5624292J594983J634001J575774J770003K217644K520888K367404J931061
$$ 15624292 17219275 18853276 20429050 22199053 24416697 26937585 29304989 31236050
8755C1236050J897473K500748L379280M250454N046570N858564O713473P738493
$$ 31236050 33133523 35634271 39013551 43264005 48310575 54169139 60882612 68621105
8747F8621105Q688691Q209478N578283K685566J499218J312446M50466j780508
$$ 68621105 77309796 85519274 91097557 93783123 95282341 96594787 97045253 95264745
8739I5264745l965740m611766n091490o908242q473207q271458p144861o153616
$$ 95264745 91299005 86687239 81595749 74687507 66214300 57942842 50797981 44644365
8731D4644365n345015m302213l173265k493346k078451j559802r95920m84270
$$ 44644365 39299350 34997137 31823872 29330526 27252075 25692273 24696353 24212083
8723B4212083j48586K6153K11480L90768M64877M87746N57434O91981P27194P60539
$$ 24212083 24063497 24089650 24301130 24691898 25156775 25644521 26201955 26893936 27621130 28381669
8713B8381669J155985J728091J976404J716684J561092K029946K826719L596462
$$ 28381669 29537654 31265745 33242149 34958833 36519925 38549871 41376590 44973052
8705D4973052M203878M793407N301484N638336N879889N739837M409476K753250
$$ 44973052 49176930 53970337 59271821 64910157 70790046 76529883 80939359 83692609
8697H3692609K692460L217019K801374J382578m92010l084328o093385p933532
$$ 83692609 86385069 89602088 92403462 93786040 93294030 90209702 84116317 76182785
8689G6182785q529797q547052q038117o968414n614865m358638l403579k737172
$$ 76182785 67652988 59105936 51067819 44099405 38484540 34125902 30722323 27985151
8681B7985151k281754k025821j776190j539368j260373r63417o19259k70237K6664
$$ 27985151 25703397 23677576 21901386 20362018 19101645 18138228 17518969 17248732 17275396
8672A7275396L24656O38085Q46326R59465J061275J072658Q09750N36699N39555
$$ 17275396 17600052 18238137 19084463 20043928 21105203 22177861 22987611 23524310 24063865
8663B4063865O62389O67307O69550Q62496J315206J809595K245379K766914L438726
$$ 24063865 24726254 25393561 26063111 26925607 28240813 30050408 32295787 35062701 38501427
8654C8501427M004359M323729M181970L398145K420999J307858m94453l154029
$$ 38501427 42505786 46829515 51011485 54409630 56830629 58138487 57644034 54490005
8646E4490005n258366n922465n858943n627660n123408m175323l123978k357140
$$ 54490005 49231639 43309174 37450231 31822571 26699163 22523840 19399862 17042722
8638A7042722j878779j521182j248734j080993r96016r06125p58959o23577m89837
$$ 17042722 15163943 13642761 12394027 11313034 10317018 9410893 8651934 8028357 7538520
8629G538520l19863j65135j5239J22257K72218L96810M62473M31926L61159L28352
$$ 7538520 7218657 7053522 7038283 7160540 7432758 7829568 8292041 8723967 9085126 9413478
8619I413478L25141K90635P8692j58376k59086k22936j23065L5245K93930P02875
$$ 9413478 9738619 10029254 10107946 9949570 9690484 9467548 9344483 9379728 9673658 10376533
8609A0376533J251456J906559K490373K498072J432967j73169j288822j813152
$$ 10376533 11627989 13534548 16024921 18522993 19955960 19782791 18493969 16680817
8601A6680817k098039k265707k195921j861655j429571j040667p47658n55411
$$ 16680817 14582778 12317071 10121150 8259495 6829924 5789257 5041599 4486188
8593D486188m17113l29151k68408k26527k04570j90872j67805j33605j11994j07879
$$ 4486188 4069075 3739924 3471516 3244989 3040419 2849547 2681742 2548137 2436143 2328264
8583B328264q7559p1533m2935J0375L6338N6112J00300J22400J16945P5246L5574
$$ 2328264 2240705 2169172 2126237 2136612 2172950 2229062 2329362 2451762 2568707 2643953 2679527
8572B679527J0068k6124m4423k2428N269K7885M8704N0051P379n1303r3505j12550
$$ 2679527 2689595 2663471 2619048 2596620 2601889 2629774 2678478 2728529 2735908 2684605 2591100 2478550
8560B478550j04910j44801j60551j71234j44555j16572j05282r3793o9191m0655
$$ 2478550 2373640 2228839 2068288 1897054 1752499 1635927 1530645 1436852 1367661 1327006
8550A327006l8415k0986j531j2519K548K0301K8238J9418J4921K6725L4375M2691
$$ 1327006 1288591 1267605 1266074 1253555 1256103 1276404 1304642 1324060 1338981 1365706 1400081 1442772
8538A442772N1338N6010N5054L0474J8660J8704K9992N5079N7108M3537L8906
$$ 1442772 1494110 1550120 1605174 1635648 1654308 1673012 1703004 1758083 1815191 1858728 1897634
8527A897634M6660L7397J1778K357K0718K4520J8668K5913M4241M4350L9698K8970
$$ 1897634 1944294 1981691 1993469 1995826 2016544 2041064 2059732 2085645 2129886 2174236 2213934 2242904
8515B242904K1653K4485L2602K4200M7917Q4908J06294J56741K10337K34487L07564
$$ 2242904 2264557 2289042 2321644 2345844 2393761 2478669 2584963 2741704 2952041 3186528 3494092
8504C494092M05089N28475O21349O42002N99071N69217N52306M68422K67537J06413
$$ 3494092 3899181 4427656 5049005 5691007 6290078 6859295 7411601 7880023 8147560 8253973
8494H253973K5687j7814j11557j83901k39295l79706n48714o06333n78053n25741
$$ 8253973 8279660 8261846 8150289 7966388 7727093 7347387 6798673 6192340 5614287 5088546
8484E088546m89220m27764l40065k58115j91850j18797p8491n0783m398P520K6039
$$ 5088546 4599326 4171562 3831497 3573382 3381532 3262735 3184244 3133461 3129063 3136583 3162622
8473C162622N7879R8467J38011J01778N9337N5296R3648J49940K00071J90628
$$ 3162622 3220501 3318968 3456979 3558757 3618094 3673390 3767038 3916978 4117049 4307677
8463D307677J61078J08573Q0959J20853J83995J88296J39852J37277J87029K21587
$$ 4307677 4468755 4577328 4658287 4779140 4963135 5151431 5291283 5428560 5615589 5837176
8453E837176K91452L83497M92155N70838N44331M45805L60093L05522K48317K46429
$$ 5837176 6128628 6512125 7004280 7575118 8119449 8565254 8925347 9230869 9479186 9725615
8443I725615L40460L43066R5004k04209l41197m05151m31903m48741m88176n97756
$$ 9725615 10066075 10409141 10504145 10299936 9958739 9553588 9121685 8672944 8184768 7587012
8433G587012o84419o34534n42757m73559m40636l91028l59880l39684k86716k31417
$$ 7587012 6902593 6268059 5725302 5251743 4811107 4420079 4060199 3720515 3433799 3202382
8423C202382k15004j87885j70404j64805j43910j31063j06736q6484p4573o0956
$$ 3202382 2987378 2799493 2629089 2464284 2320374 2189311 2082575 1996091 1921518 1860562
8413A860562k3888j4581M618N9684P7704J16590J64241K23156L24706M57041N85594
$$ 1860562 1836674 1822093 1826711 1886395 1964099 2080689 2244930 2468086 2792792 3249833 3835427
8402C835427O68138O85659O35438N63711N30566N15481M78035K88052M4434j73842
$$ 3835427 4503565 5189224 5824662 6388373 6918939 7434420 7912455 8200507 8244941 8071099
8392H071099l50503m17723l76257l88119n04839n93219n73980m93509m40674m09119
$$ 8071099 7720596 7302873 6926616 6538497 6033658 5440439 4866459 4372950 3932276 3523157
8382C523157l48662k56694k08645j48453r9328p6180q5757o3619o3543n9501j8435
$$ 3523157 3174495 2917801 2709156 2560703 2461375 2385195 2299438 2235819 2172276 2112775 2094340
8371B094340j392J5850K9416N5107P2411J17840J45337J49657J47493J59583J76352
$$ 2094340 2092948 2108798 2138214 2193321 2265732 2383572 2528909 2678566 2826059 2985642 3161994
8360C161994K12048K20206K18143K32252K59536L04578L50243M28092N32336O33413
$$ 3161994 3374042 3594248 3812391 4044643 4304179 4608757 4959000 5387092 5919428 6552841
8350F552841P40109Q15390R45001J123703J336824J628559K057803K702374L635672
$$ 6552841 7292950 8108340 9053341 10177044 11513868 13142427 15200230 17902604 21538276
8341B1538276N133948P538996J1266060J6004179J9472589J8612364J3589174
$$ 21538276 26672224 34211220 45477280 61481459 80954048 99566412 113155586
8334A13155586O296942k031108r364863j3716735j5102555j4833874j3504705
$$ 113155586 119452528 117421420 108056557 94339822 79237267 64403393 50898688
8327E0898688j1204541q407035n897860m046981k784168j977132j430992j067375
$$ 50898688 39694147 31287112 25389252 21342271 18558103 16580971 15149979 14082604
8319A4082604q53203o76376n16975l16187j35562M1827J02000J87671L68659N64628
$$ 14082604 13229401 12553025 12036050 11719863 11584301 11626128 11728128 11915799 12284458 12849086
8309A2849086Q26709J148222J722790K610155L497111M046490M667181M967942
$$ 12849086 13675795 14824017 16546807 19156962 22654073 26700563 31367744 36335686
8301C6335686L957955J628120l01624p36396l35905L08663J391480K586866K635482
$$ 36335686 40293641 41921761 41620137 40883741 40547836 40856499 42247979 44834845 47470327
8292D7470327J738675J354610J955956K747495L508489M952920P299224R319346
$$ 47470327 49209002 50563612 52519568 55267063 58775552 63728472 71027696 80347042
8284H0347042R368940P684737M866386P21585l668672o437511o808305n231898
$$ 80347042 89715982 97400719 102267105 102988690 99320018 92882507 86074202 80842304
8276H0842304k979282j738940k821464m691776n155478n212265o070327o566912
$$ 80842304 77863022 76124082 73302618 68610842 63455364 58243099 52172772 45605860
8268D5605860n643403m236452l554774l424121l214190k866670k468984k155936
$$ 45605860 39962457 35726005 32171231 28747110 25532920 22666250 20197266 18041330
8260A8041330j865930j532467j176984q49271n97740m58263l94761l45977l11505
$$ 18041330 16175400 14642933 13465949 12616678 12018938 11560675 11165914 10819937 10508432
8251A0508432k74693j97332j10576J7514J91367L68730N81052Q44098J186928
$$ 10508432 10233739 10036407 9925831 9943345 10134712 10503442 11084494 11928592 13115520
8242A3115520J625987K232532L146109M563660O740907R672300J2430923J3454936
$$ 13115520 14741507 16974039 20120148 24683808 31424715 41097015 53527938 66982874
8234F6982874J1977651Q669919L931014k180610p789416j0776675j1459081j1099786
$$ 66982874 78960525 87630444 91561458 89380848 81591432 70814757 59355676 48255890
8226D8255890j0129109q489291o429903m545802l146919k204131j588629j186310
$$ 48255890 38126781 29637490 23207587 18661785 15514866 13310735 11722106 10535796
8218A0535796r53420q17705p03997o31036n67251m87260m28014l87226l45897
$$ 10535796 9582376 8764671 8060674 7429638 6862387 6375127 5947113 5559887 5213990
8209E213990l06098k76285k42502j92679j38263j15426p4893m9442k2358j4630
$$ 5213990 4907892 4631607 4389105 4196426 4058163 3942737 3867844 3818402 3796044 3781414
8199C781414l0649l3817m5697k3320M625M8068J06089J32586J60217J51731Q7266
$$ 3781414 3750765 3716948 3671251 3647931 3652556 3700624 3806713 3939299 4099516 4251247 4338513
8188D338513k285q7099j21274r1155m4610O9830K29470M49618P07771Q93359Q85191
$$ 4338513 4336228 4249129 4127855 4036700 3992090 4061920 4291390 4741008 5448779 6342138 7227329
8177G227329O55033L21695O2161j3275J12044K45394K83357J43467j36914m68424
$$ 7227329 7882362 8204057 8266218 8252943 8364987 8610381 8893738 9037205 8900291 8431867
8167H431867p13009q23577q62127q27920p33385n65154l91325k36714j37539l8386
$$ 8431867 7718858 6895281 6033154 5205234 4471849 3906695 3515370 3278656 3141117 3102731
8157C102731O7369J52956J76560J75877J60927J33549J11515R7035P6399R2288
$$ 3102731 3170100 3323056 3499616 3675493 3836420 3969969 4081484 4178519 4254918 4347206
8147D347206J38696J48739J59305K22497K75044K43226K11163K82750L57552L96955
$$ 4347206 4485902 4634641 4793946 5016443 5291487 5534713 5745876 6028626 6386178 6783133
8137F783133M78203N10720M02489K16179J50776K75383N10781Q47800J346790
$$ 6783133 7261336 7772056 8174545 8390724 8541500 8816883 9327664 10175464 11522254
8128A1522254J914462K335797K475366K484811K138521J137140R5148o40351j257655
$$ 11522254 13436716 15772513 18247879 20732690 22871211 24008351 24103499 23463148 22205493
8119B2205493j646909j722006j631841j559746j513130j409023j211691r84437
$$ 22205493 20558584 18836578 17204737 15644991 14131861 12722838 11511147 10526710
8111A0526710p52124n19910k96948k12637l09334l71389l49078l65388m11992
$$ 10526710 9774586 9254676 8957728 8745091 8435757 8064368 7715290 7349902 6937910
8102F937910l62131k74527k38823k32078j68962r9122l1313N4407J18684K15342
$$ 6937910 6575779 6301252 6062429 5830351 5661389 5562267 5530954 5585361 5704045 5919387
8092E919387K92182L46630L97464M26186M51406M87459N39933O92317J032943
$$ 5919387 6211569 6558199 6955663 7381849 7833255 8320714 8860647 9552964 10585907
8083A0585907J611267K631507M043482N260414N967408N433750L399966J036962
$$ 10585907 12197174 14828681 18872163 24132577 30099985 35533735 38933701 39970663
8075C9970663j000787k401922l128771l309225k892592k052358j127915l96177
$$ 39970663 38969876 36567954 33439183 30129958 27237366 25185008 24057093 23660916
8067B3660916M0396L39476O46805J101382J675155K368310L274004M700962O998422
$$ 23660916 23701312 24040788 24687593 25788975 27464130 29832440 33106444 37807406 44805828
8058D4805828J0574834J5728562K1670645K6188674K8665750K9569023K3943638
$$ 44805828 55380662 71109224 92779869 118968543 147634293 177203316 201146954
8051B01146954J0559339k247175j2620936k1751945k6687781k6821104k4164863
$$ 201146954 211706293 209459118 196838182 175086237 148398456 121577352 97412489
8044I7412489k0647715j6504929j2072077q311927n567287l655076k277485j156254
$$ 97412489 76764774 60259845 48187768 39875841 34308554 30653478 28375993 27219739
8036B7219739j76596N66344J109801J522208J577378R30587m3483n59456r58620
$$ 27219739 27043143 27609487 28719288 30241496 31818874 32749461 32705978 32146522 31187902
8027C1187902j436517j495151j099199n50580p9805M06657R73678J611305K285883
$$ 31187902 29751385 28256234 27157035 26606455 26526650 26933307 27906985 29518290 31804173
8018C1804173L018002L836897M710554N770808P364368J0043195J4693865K3034813
$$ 31804173 34822175 38659072 43369626 49140434 56504802 66547997 81241862 104276675
8010A04276675L7137491N5060557O8651389P0953605N0502964J5873442j4627623
$$ 104276675 141414166 196474723 265126112 336079717 386582681 402456123 387828500
8003C87828500l5792105m6983731n2103658n1928313m6398195l7141881k6992119
$$ 387828500 352036395 305052664 252949006 201020693 154622498 117480617 90488498
7996I0488498j8651261j2791967q907154o366736m794615l745721k917768k324006
$$ 90488498 71837237 59045270 50138116 43771380 38976765 35231044 32313276 29989270
7988B9989270j998786j728977j422092j220977j174604j117810r45217q08554
$$ 29989270 27990484 26261507 24839415 23618438 22443834 21326024 20380807 19572253
7980A9572253p12212n73849l31572p8706J80122M71351Q03897J167903J525673
$$ 19572253 18860041 18286192 17954620 17875914 18056036 18527387 19331284 20499187 22024860
7971B2024860J903944K381845L071251M183355O047722R049580J3443506J8170710
$$ 22024860 23928804 26310649 29381900 33565255 39612977 48662557 62106063 80276773
7963H0276773K0681276K1098056K0983379J5341731L016360m991288p896268j3890289
$$ 80276773 100958049 122056105 143039484 158381215 161397575 156406287 148510019 134619730
7955A34619730k0454620k1454426j8269816j5129181j2792624j0088343p244739
$$ 134619730 114165110 92710684 74440868 59311687 46519063 36430720 29185981
7948B9185981n021586l567479k673412k100979j703673j400106j178057j022798
$$ 29185981 24164395 20596916 17923504 15822525 14118852 12718746 11540689 10517891
7940A0517891q48146p17875o10447n25330m77602m47272l76548l22479k77941
$$ 10517891 9669745 8951870 8341423 7816093 7338491 6891219 6514671 6192192 5914251
7931E914251k23679j94668j95860j99168j98071j85311j88040j68573j62706j06062
$$ 5914251 5690572 5495904 5300044 5100876 4902805 4717494 4529454 4360881 4198175 4092113
7921D092113o5478k2044K7481Q1056J29475J36493Q9391m5814j58326j81625k13814
$$ 4092113 4026635 4004591 4032072 4113128 4242603 4379096 4468487 4422673 4264347 4082722 3868908
7910C868908k98210l35594k93110k32073k03571j70157j35689j11580r8448o7467
$$ 3868908 3570698 3235104 2941994 2709921 2506350 2336193 2200504 2088924 1990476 1923009
7900A923009m7116m0864m5667l5988l1584l4135n0485m9069m0215j9025j960j2704
$$ 1923009 1875893 1835029 1789362 1753374 1721790 1687655 1637170 1588101 1547886 1528861 1526901 1514197
7888A514197r001r119L052o478J988M1542N1332N9112P3688Q3687M8396l2464
$$ 1514197 1505196 1496077 1499129 1492651 1494639 1536181 1587513 1646625 1720313 1804000 1852396 1819932
7876A819932p8470q1166q4515q7164r3961n3730m8884n1785l6532l7986l2239
$$ 1819932 1741462 1660296 1575781 1488617 1394656 1340926 1292042 1240257 1203725 1165739 1133500
7865A133500m9337p1375n3468l2827k6005j9445k2119j8940m745R704P893J1967
$$ 1133500 1084163 1012788 959320 926493 900488 881043 858924 839984 835239 844943 852836 864803
7853H64803N392L671R29n766k0478l4081m3724k5411j5492j9794k4357l177P479
$$ 864803 870195 873866 874795 869029 848551 814470 770746 745335 729843 710049 685692 682515 689994
7840F89994j107L399J7840J908O115J5188M2047O3534M9237M8048O5101O1017
$$ 689994 688887 692286 710126 712034 718149 733337 775384 838918 888155 936203 1001304 1062321
7828A062321K6384q069n5315o7277o0016q2523q6650o4437o7513p1336o0853m4354
$$ 1062321 1088705 1080636 1025321 958044 898028 815505 728855 664418 596905 525569 464716 420362
7816D20362k9125k1338j4845j1316P775R734K4647M4741L7382L8462K3664j1321
$$ 420362 391237 369899 355054 343738 351513 361247 385894 430635 468017 506479 530143 518822
7804E18822o852j7517K792O794j5060k0891j6598p171p601K658Q455J887k3453
$$ 518822 511970 494453 497245 504039 488979 468088 451490 444319 436718 439376 447831 449718 426265
7791D26265k7374j5223k3254M479Q0M296K052l123J562J0011J1536J2768p074
$$ 426265 398891 383668 360414 364893 364973 369269 371321 368198 369760 379771 391307 404075 397001
7778C97001k6966m957o644k605m374k3034k3968k1661j6959l833J7482J1533p18
$$ 397001 370035 365078 358434 355829 351455 328421 304453 282792 265833 262000 279482 291015 290297
7765B90297O060J0971P814J5698n95N473J0848j3510j1731N767J4077m101j3239
$$ 290297 296357 307328 315142 330840 330245 335718 346566 333056 321325 327092 341169 337068 323829
7752C23829k861k130n568N438M680J3367J876q427M766l73k2403k4552N838N895
$$ 323829 320968 318838 313270 318708 323388 336755 338631 330204 334970 334597 312194 287642 293480 299375
7738B99375Q176n729j85j324J5158M175m651j1161j0682P317M4671M1415J2498
$$ 299375 307551 301822 301637 300313 315471 319646 314995 303834 293152 300469 345140 386555 399053
7725C99053Q770k1734j0721j0071l0161j7751k2616j4984p917o367J1672P433
$$ 399053 407823 386089 375368 365297 335136 317385 294769 279785 271868 265501 277173 284606
7713B84606j0610j162K239J5098M85R334l567j1438M695k648l525p254j1817K540
$$ 284606 273996 272834 275073 290171 290656 299990 296423 284985 289680 287032 283507 276253 264436 266976
7699B66976p28o857o104j4648k1460k4880n679J3850p588j5872p093L076O458
$$ 266976 266248 259391 253287 238639 217179 192299 186620 200470 192882 177010 169917 172993 179451
7686A79451R286J4532P402L0912L7923N5404L6849J1333j2397q756q506j281l274
$$ 179451 188737 203269 210671 241583 279506 334910 371759 383092 370695 361939 353433 352152 348878
7673C48878j6395l0069q796k065m723L625J7528J6618J4882J7088K1168N0009
$$ 348878 332483 302414 293618 291553 286830 290455 307983 324601 339483 356571 377739 427748
7661D27748O8599Q8215J18701J61170J90309J71839J00256O271n1341j31302j59042
$$ 427748 496347 584562 703263 864433 1054742 1226581 1326837 1333108 1281767 1150465 991423
7650I91423j60761j61147j32910r7562m9629k5884l3215k6797j7719j3547j4283
$$ 991423 830662 669515 536605 439043 389414 363530 330315 303518 285799 272252 257969
7639B57969n251L661J3797N782l809P332N853J0534p313k3083r524j3130L096
$$ 257969 252718 256379 270176 275958 272149 279481 285334 295868 288555 265472 255948 242818 245914
7626B45914j096M528k744O639J9786J6484K6013M3106M1462N2405N9783R8076
$$ 245914 244818 249346 246602 253241 273027 289511 315524 358630 400092 452497 512280 610356
7614F10356J34569K10795L38407M44665M34040K38210m5894k06442k32841k71635
$$ 610356 744925 955720 1294127 1738792 2172832 2411042 2365148 2158706 1925865 1654230
7604A654230l18645k94529k29916j59476j07218q0137n9205l6630l6254k2405
$$ 1654230 1335585 1041056 811140 651664 544446 464309 405104 368474 332220 309815
7594C09815j2670q585j5035k4455k4869j3875P1n994k0089j6823K00J974Q028
$$ 309815 297145 288560 273525 249070 224201 210326 210397 204403 184314 167491 167691 169665 177693
7581A77693J4163j1907q325K5125J0876J2650J7615M573R903R956K2498L1761
$$ 177693 191856 179949 171624 196749 207625 220275 237890 242463 252366 262322 284820 316581
7569C16581M7234P9706J15927J46893J52294J34992P3899m709o5904j07909j21163
$$ 316581 363815 443521 559448 706341 858635 993627 1067526 1062817 996913 889004 767841
7558G67841j32251j35304j07515p1154m1135l2885k9552k6679k4465j2306j862
$$ 767841 635590 500286 392771 321617 280482 247597 218045 191366 166901 154595 152733
7547A52733k1099j5282q868m059j4580n503J254M954K1298J5748o6n199q854l194
$$ 152733 131634 116352 107484 103425 88845 83342 84596 89550 110848 126596 126530 121331 112477 109283
7533A09283L834N4m739k167N956M604m910j209j9752N875O946L010o68M13P087
$$ 109283 113117 113171 108432 106265 112221 116825 111915 110706 90954 96829 103775 106785 106117 106530 113617
7518A13617J976p481L48O61j3004m576j912l09K3283J0339q321o882M865j3285
$$ 113617 115593 108112 108460 109121 96117 91541 89629 89320 112603 122942 114621 107739 112604 99319
7504I9319K161J714p9J0130r199N360l18J996K588r968k1313k1930P016K1482
$$ 99319 101480 103194 103115 113245 104046 109406 109088 111084 113672 103704 82391 60461 67477 88959
7490H8959J3979j824j7845j9216j552r152k837J0924J998O539l844k960L612k983
$$ 88959 102938 101114 83269 64053 62501 53349 50512 61436 63434 69973 66129 63169 66781 63798
7476F3798J1328J6118K973J905k504J2378J1953r281j8149N7O975j1313j0051
$$ 63798 75126 91244 94217 96122 93618 105996 117949 108668 90519 90576 97551 86238 76187
7463G6187M720l639N327M285R464j89j144J852J436O271J182l735j2987O0J4264
$$ 76187 80907 77268 82595 86880 96344 96155 95011 96863 98299 104570 105752 102017 89030 89090 103354
7448A03354k656k6767j0295j115J6910J6757L001R298J1935j0750k768o703L330
$$ 103354 100698 73931 63636 62521 79431 96188 99189 108487 120422 109672 106904 100201 103531
7435A03531k669j4884j0043M899j1296J454K962p576J790j696p267J3297R131
$$ 103531 100862 85978 75935 80834 69538 70992 73954 66378 68168 66472 59205 72502 81633
7422H1633l113j8333p780K942P967p542n399l097j5588K423K4635L108N299J579
$$ 81633 78520 60187 52407 55349 63316 55774 50375 47278 31690 34113 58748 61856 67155 68734
7408F8734j9527j3219J8667K2156J2741Q0m142o643q650m01N670M929j2359o165
$$ 68734 49207 35988 54655 76811 89552 89632 85490 78847 70197 69796 75466 80395 68036 61871
7394F1871m87O873p396o859J318k273k554p75O21J219j0667j3139j4112L558J6909
$$ 61871 61384 68257 60861 54002 55320 53047 50493 49718 50339 51558 40891 27752 13640 17198 34107
7379C4107O283k521n555n290l508L819j752L365o31J1894J1130m598L194Q625
$$ 34107 40390 37869 32314 27024 23516 27335 25583 28948 28317 40211 51341 46743 49937 58562
7365E8562J513k034P55P376J3102N848k38o742K33j4154j6752K0185P384l63j3719
$$ 58562 60075 58041 58796 66172 79274 85122 84884 78142 78375 64221 47469 67654 75038 74675 60956
7350F0956j8889N44l486L989Q098m346l842j0507l878J0197R766J683k515r234
$$ 60956 42067 42611 39125 43114 51212 46866 43024 32517 28639 38836 48602 50285 47770 38536
7336C8536j5306K317M600N150R701J3210m333k1167q997k640j1587J2535J3000
$$ 38536 23230 25547 30147 35297 44998 58208 53875 32708 23711 21071 9484 22019 35019
7323C5019o012N367K385r67O399J5881J2362R880m871K293o498j7277o596M582
$$ 35019 29007 34374 36759 35792 42191 58072 70434 80314 75443 77736 71238 53961 47365 51947
7309E1947K827J074n693K392J8509n173n520o932L634J230r801k939J9660R741
$$ 51947 54774 55848 50155 52547 71056 65883 60363 53431 57065 58295 48494 45555 65215 74956
7295G4956Q828N979k0213j2800q88L021m797k7271o847M301o363j332K5674K215
$$ 74956 83784 89763 69550 56750 55862 58883 54086 26815 19968 24269 17906 16574 42248 44463
7281D4463r302p910J6911J2164Q351J052p513L180L749j808L275K836J977m298
$$ 44463 35161 27251 44162 56326 64677 65729 58216 61396 65145 63337 66612 69448 71425 67127
7267F7127Q13M914J2895J0096k3362q669j706j8993j4802P42j1320p477M964M651
$$ 67127 67940 72854 85749 95845 72483 63814 62108 43115 28313 29055 17735 10258 15222 19873
7253A9873R795P092K477J415j3904j286J1322j1727j652N31k61K171R937l645
$$ 19873 29668 36760 39237 40652 26748 25462 36784 25057 23405 23936 23675 25846 35783 32138
7239C2138j2372m051j866Q360K6260l066N379j911m474L97k126j53n34k114O0
$$ 32138 19766 15715 13849 22209 48469 45403 50782 48871 44397 44794 42668 42515 41981 39867 39927
7224C9927R50j3480R712O200J266J36k4747j4382j173Q701l333O36Q946j2890
$$ 39927 40877 27397 37109 43309 44575 44711 19964 5582 4409 13110 9777 10413 19359 6469
7210F469j021P032J2079N346k279j8583M029J1243J1873l748j3579n651O444Q651
$$ 6469 5448 12480 24559 29905 27626 9043 13072 24315 36188 32440 18861 13210 19654 28305
7196B8305k881o005M179P606o697K609j450k092j700j860M661m828j5695J831
$$ 28305 25424 19419 23598 31204 24507 27116 25666 23574 21874 20014 24675 19847 4152 5983
7182E983L759J2875J993m052J9148J1377L394j2776q29Q27M639k295j2805j4324
$$ 5983 9742 22617 24610 20558 39706 51083 54477 41701 40872 41699 46338 44043 31238 16914
7168A6914k0184l618L874k265k902R291K1999J4817L551k0284P414J6638r899
$$ 16914 -3270 -6888 -3014 -5279 -8181 1110 23109 37926 41477 21193 28607 45245 35346
7155C5346l332L467j0797j2549R585J3020R544J50j6775n772m39L461J7314R553
$$ 35346 32014 35481 24684 12135 21720 34740 44284 44434 27659 21887 21448 24909 42223 51776
7141E1776J0321j810n58R542j2225k0975j7538q645P12n563P204P124O99O549
$$ 51776 62097 60287 59729 69271 57046 36071 18533 9888 10600 5037 12241 19365 20064 26613
7127B6613N53M305O198j037P418J1072p044J3559q418j6490j6312j284R093L706
$$ 26613 27166 31471 37669 36632 44050 55122 48078 61637 53219 36729 20417 19133 28226 31932
7113C1932j0807n675m509l029J8566J4240L902k385L72q388M620J107J0966M481
$$ 31932 21125 15450 10941 7912 26478 40718 44620 42235 42607 34219 38839 39946 50912 55393
7099E5393J880l762K79p905k2208q328R745J2534N625q906j170O595j0410l055
$$ 55393 57273 53511 53790 45885 23677 15349 25094 37628 43253 34347 33177 39772 29362 26307
7085B6307O439o431L1J386r456J2652o344n142Q997l330M745o299m293o404J6348
$$ 26307 32746 26315 26346 27732 18276 30928 24584 19442 28439 25109 29854 23555 19262 12858 29206
7070B9206J3233l172l265n850P28J0034n531M959R063j2689n539R9p85r797m20
$$ 29206 42439 39267 36002 30152 30880 40914 35383 40342 49405 36716 31177 31276 30491 20694 20274
7055B0274q555l06k480J1122J519k646r134J337M561k333k224L902j1661o169
$$ 20274 11719 11413 8933 20055 21574 18928 9794 11131 15692 13359 11135 15037 3376 -2793
7041b793j972J493M62R878P685k054m499p145K951k293J2862m179J358J1014j0639
$$ -2793 -4765 -3272 -2810 7068 14753 12699 8200 1055 4006 1713 14575 10396 11754 22768 12129
7026A2129j2698l551J6420J6640q390k723J0537m453p121N489J4168L501J449
$$ 12129 -569 -4120 12300 28940 20550 17827 28364 23911 16790 22279 36447 39948 41397
7013D1397j215j2751j2769l018j4359J0575j425k712j522m6R281M432M130M302
$$ 41397 40182 27431 14662 11644 -2715 7860 6435 3723 2201 2155 11436 15868 19998 24300
6999B4300k843k112n293l4N258N376n094j8461k51M383m06o994P615K2514J4154
$$ 24300 21457 19345 14052 14018 19276 24652 19558 1097 846 5229 4823 -2171 5444 27958 42112
6984D2112P886r962n174j480j1195k2010n495Q502J8413j932J742J830J3606P994
$$ 42112 49998 40036 34862 33382 22187 177 -5318 3184 21597 19665 21407 23237 36843 44837
6970D4837J3118m030j857k173r315K087r862l96N994J127j2756j1321O429P213
$$ 44837 57955 53925 52068 49895 40580 42667 32805 32409 38403 39530 26774 15453 21882 29095
6956B9095l096m067J2186K638j848N345n0N843p314n387l649n940O07J1433r922
$$ 29095 25999 21932 34118 36756 34908 40253 40203 46046 38732 33345 29696 23756 24363 35796 25874
6941B5874j1298K546j1872K030J0240O434o785m754k14m462p83J2366k873J942
$$ 25874 14576 17122 5250 7280 17520 23954 17169 12415 12201 7739 6956 19322 16449 18391
6927A8391K0324j592r518j3714m268M882R596M802J867r969r499Q99j513r025
$$ 18391 38715 37123 27605 13891 9623 14505 24101 28903 30770 20801 11302 12201 10688 1663
6913A663M711k890j2929N465K7794J3710j0330j537P744k2202J156Q98j0962k333
$$ 1663 6374 3484 -9445 -3980 23814 37524 27194 25657 33401 11199 12355 13253 2291 -42
6899d2M593k540J895J2308R291j3941o664N293J2214J6818k289j5827q783j5779
$$ -42 4551 2011 3906 16214 25505 11564 4900 10193 22407 39225 36936 21109 12326 -3453
6885c453O263j595Q851o679m824L395R346M845Q845L89J195j803l377P664n104
$$ -3453 2810 1215 10066 3387 -1437 1958 11304 16149 24994 25383 26578 24775 21398 29062 23958
6870B3958k2037j097K2762K6080N949p867j2172j3175J973L837n062j6447k1432
$$ 23958 1921 824 23586 49666 55615 47748 35576 22401 24374 28211 23149 6702 -14730
6857a4730k929K1180Q264J379r005J3733q380o463J2558J1694P676J2281m446
$$ -14730 -17659 3521 11785 13164 4159 17892 9512 3049 15607 27301 34977 47258 42812
6844D2812p511L935J658J0689R308r471j4964j512K0332J1828K2964K7014P57
$$ 42812 35301 39236 40894 51583 60891 51420 36456 34944 55276 67104 90068 117082 117839
6831A17839j1858Q666O406j8652k3853r456K074j536j2729K1o50K42j8609j5535
$$ 117839 105981 114647 121053 102401 78548 69092 71166 69630 56901 56922 56272 56514 37905 22370
6817B2370j0244o359R203J4797m092L898k630M477l345o446j2422R964K5770R177
$$ 22370 12126 5767 14970 29767 25675 29573 26943 31420 28075 21629 9207 19171 44941 54118
6803E4118J125m325k993j0845N507J0573Q736K56R352R045j7481k2308Qk981r171
$$ 54118 55243 50918 47925 37080 42587 53160 61896 62152 71504 80549 63068 40760 40768 37787 28616
6788B8616J2725L707K742j1952n045J1322J3662j4269Q827M917m803M025P996
$$ 28616 41341 45048 47790 35838 30793 42115 55777 41508 50335 55252 50449 54474 62470
6775F2470M54p305K0608K2292J295K708K216j75M948J2070K6141L229J8755L2590
$$ 62470 62924 55619 76227 98519 99814 102522 104738 104563 109511 121581 147722 150951 169706 202296
6761B02296L6457M8405P3454O6857K2934L115j8720k0628k6055j5411j6002r508
$$ 202296 238753 287158 360612 427469 450403 453518 434798 414170 388115 372704 356702 347194
6749C47194k212J5961K3340M3894O3359O3588P1929J03364J33721J81118K48548
$$ 347194 344982 360943 384283 428177 491536 555124 627053 730417 864138 1045256 1293804
6738A293804L40246M85421O69156Q98547J148936J092380L40228n42842p80685
$$ 1293804 1634050 2119471 2788627 3687174 4836110 5928490 6268718 5725876 4945191
6729D945191p02709p40729q07094o86001m78407l24915k32628j51019j02487o0039
$$ 4945191 4242482 3501753 2694659 2008658 1530251 1205336 972708 821689 719202 659163
6719F59163l6947j8271k0911j8231k5478k0733l5986l1214j9277J781j668K083
$$ 659163 622216 603945 583034 564803 539325 518592 482606 451392 432115 433896 432228 434311
6707D34311Q721k1271m3122l7545l2625k4224l6399k9110j4071r564N147K9474
$$ 434311 443032 421761 378639 341094 308469 284245 247846 218736 204665 195101 200248 229722
6695B29722L6295N7947J6994l3201l8551l1492l0192l9904k7725p020j5163k1136
$$ 229722 266017 323964 340958 307757 269206 237714 207522 167618 139893 132873 117710 96574
6683I6574j9021L10P75j3481m029J0968o228j0611K734L222J4394K7955L1681
$$ 96574 77553 77863 78638 65157 61128 72096 65868 55257 57991 61213 75607 103562 135243
6670A35243j1316j5870J840L06k0679k2971k2231j7506J2481J7007J5685p976
$$ 135243 123927 108057 109897 110203 89524 66553 44322 26816 39297 56304 71989 64013
6658F4013j2523L845K636l360N840q088k330J0842l662O440R039j0594k4002l981
$$ 64013 51490 55335 57971 54611 60451 52363 50033 60875 57213 63653 72692 62098 38096 34115
6644C4115J1127R026J54L204J0912M875n973K155m146o299j375J0945L043p469
$$ 34115 45242 54268 54422 57626 68538 73413 67440 69595 65449 59150 57775 68720 71763 64294
6630F4294j3213M760k514O814J2255n21M235R753L1876M3779N7198P0477K9703
$$ 64294 51081 55841 53327 60141 72396 71875 76110 85863 117739 161518 218716 289193 318896
6617C18896n976j1265j1976k2377l9179m0275k6823j8947j1510j0297Q146Q749
$$ 318896 312920 301655 289679 267302 228123 187848 161025 142078 130568 120271 128417 137166
6605A37166L02j1699m188n046j4200p412q830l897Q284J7981M1863O0963L5959
$$ 137166 137468 125769 121581 116535 102335 94923 86093 82196 90480 108461 150324 211287 247246
6592B47246q754n666r25k3486m4511k5820j3128l0631j7305q197j1066k489q36
$$ 247246 238492 232826 231901 208415 163904 138084 124956 94325 77020 68823 57757 55268 54432
6579E4432q195j1504r817O88N855k081M759M823K594K560J5648J1115q173J1406
$$ 54432 46237 34733 24916 25604 31459 29378 34137 38960 41554 44114 59762 70877 62704 74110
6565G4110L1926M4716L0406K14j6564j0699q362j6267l2908k5590n935J411j7247
$$ 74110 106036 150752 181158 181372 164808 154109 145747 129480 96572 70982 65047 66458 49211
6552D9211j8766r92O691j906j6430J3174j2247j0217L995M546Q039q119q885P889
$$ 49211 30445 29453 36144 34238 17808 30982 18735 8518 12513 17059 25098 16979 8094 15983
6538A5983q359M270K822J03k710P575N044j4598M617J1373k027J473O09P815j302
$$ 15983 7624 11894 14716 14819 12109 19684 24728 10130 14747 26120 24093 25566 26175 33990 32688
6523C2688n991M507J37J920m735O36P954l572k020J6069L4444L3614L6500L929
$$ 32688 26697 31204 31341 33261 28526 29162 37116 33544 31524 47593 82037 115651 152151 156080
6509A56080l4413l8108j7730o737n538p439j6178J1108L389j884n277J0711P590
$$ 156080 121667 83559 65829 59092 53554 46115 29937 41045 44434 42550 37273 47984 55574
6496E5574Q92l832j9274N496J1183J335r108k5285j3471J1743o343l867L506P084
$$ 55574 56466 52634 33360 38856 50039 51374 42266 16981 3510 15253 8910 5043 8549 15633
6482A5633j2348O8J5201j55j6362M974K469j467q239l279j940M50N950M888n201
$$ 15633 3285 3353 18554 18399 2037 7011 9480 8013 -226 -3505 -5445 -4995 955 5843 642
6467F42k312q079J0939R472j476O75j854L86N865p941j5725m993k120j397n642
$$ 642 -1670 -9749 1190 10662 9186 9861 8007 8393 14258 6317 -9408 -14401 -16521 -17918 -23560
6452b3560K638N546J4172J2204j4123k5832p555P597K6166J1964M685j4499L271
$$ -23560 -20922 -15376 -1204 11000 -3123 -28955 -36510 -28913 -2747 9217 13902 -597 2674
6439B674J141j4374o754P664o749N79O486M522J1210r250K491J5623r117J015
$$ 2674 3815 -10559 -17313 -9649 -16398 -15819 -9333 -4811 6399 -2851 -360 15263 6146 7161
6425G161k269J735K491j915o096Q188J1463r322j4899j5773O836K1489R523j8611
$$ 7161 4892 6627 9118 7203 1107 9295 20758 11436 -3463 -19236 -12400 9089 18612 1
6411Am543l106M643N108J469O40j5045o641J0699p855m974n317J6826J6833L289
$$ 1 -4542 -7648 -3005 2103 3572 4212 -10833 -17474 -6775 -14630 -19604 -24921 -8095 8738 12027
6396A2027k06j6877J3406R324J568o674n033k511N788P50k1k964j6896N170j495
$$ 12027 11821 -5056 8350 17674 19242 12568 7535 5024 10812 11562 11541 8577 -8319 -3149 -4644
6381d644j582R608J3082k35n111R638j1303j4314p487J2348J7832O819l145n669
$$ -4644 -6226 3382 16464 16229 11118 20756 9453 -4861 -12348 0 17832 24651 21506 15837
6367A5837r03j465J3094n863j5278m716j348O837J1965M851N85m047P760P674
$$ 15837 14934 13469 26563 20700 5422 706 -642 6195 18160 23011 23596 19549 27309 34983
6353C4983j9806l673J3564l089o388Q866Q333m753j7499J306M740L754L448L993
$$ 34983 15177 11504 25068 21979 15591 24457 32790 28037 10538 11844 16584 20338 23786 27779
6339B7779j124j338l377J219R877p001j7061k0969j699J9639j464m124j847q65
$$ 27779 26655 25317 21940 23159 33036 26035 8974 -11995 -13694 5945 4481 357 -1490 -2355
6325b355J4946O090q17M418M2k512k3911j4132n247J1247R886J2722o472n181
$$ -2355 12591 18681 17864 22282 22324 19812 -4099 -18231 -23478 -12231 -2345 10377 3905 -1276
6311a276j7204p808M670m964l686J0615J3313J3235J3940o098p472J6906J1552
$$ -1276 -18480 -26288 -21618 -26582 -30268 -19653 -6340 6895 20835 14737 7265 24171 35723
6298C5723j9258K91j688Q331L586M946j015j2470J545m259j1929q512M725J5284
$$ 35723 16465 16756 15068 23399 26985 31931 30916 18446 19991 15732 3803 -4709 16 15300
6284A5300K606J588J164j1293k1411j504P30K695L459J4486l319j9306n098Q243
$$ 15300 17906 19494 20658 9365 -12046 -13550 -12820 -10125 -6666 7820 4501 -14805 -19903 -11660
6270a1660K851N974J493J55P710j9J481L004m263O721j37J237m752n240j1963
$$ -11660 -8809 -2835 -1342 -1187 6523 6504 7985 10989 6726 13447 13310 14547 9795 4555 -7408
6255g408J4667J4577Q135L84r583m573J0097N9j6476q101k2175m950J3683O911
$$ -7408 7259 21836 29971 30355 20772 16199 26296 26355 9879 1778 -20397 -25347 -11664 -4753
6241d753J4920o074O623Q934M143N971k199j4574o149L311m304q552j2931p888
$$ -4753 10167 4093 10716 19650 23793 29764 27565 12991 6842 10153 5849 -2703 -15634 -23522
6227b3522J1568p02k506M527J1678j9J1372p988q983M078j698j9921O188J5407
$$ -23522 -11954 -12656 -15162 -10635 1043 1024 12396 4408 -4575 -497 -2195 -22116 -15928 -521
6213e21J465m624m125O69N6O4K218j2721J3318N273N642K537L488J066o590o023
$$ -521 944 -3680 -7805 -7136 -7080 -7016 -4798 -17519 -4201 1072 6714 9251 12739 13805 7215 1192
6197A192r952j7390j997J0194N649j0481J3844J3616j037L608l251n537N418k149
$$ 1192 -8760 -26150 -28147 -17953 -12304 -22785 -8941 4675 3638 7246 3995 -1542 3876 1727
6183A727n673j5351J6753J1832q480p360n043l593P076M367n681R389Q998j292
$$ 1727 -3946 -19297 -2544 9288 808 -6552 -11595 -15188 -8112 -3745 -9426 -37 8961 7669
6169G669l763m27M599O593Q574o785m437J0385r69R254m599j2544m323j7140P852
$$ 7669 3906 3479 8078 14671 23245 16460 12023 22408 21439 30693 26094 13550 9227 -7913 -61
6154f1J2884J79m408n928j0419J517J4707J3709n942K516j0352p79Q792P021P038
$$ -61 12823 13002 8594 2666 -7753 -6236 8471 22180 16238 18754 8402 7623 16415 23436 30474
6139C0474j7366j6172J1683k122K34l501j2008j290J2716J1647q0k518r784n477
$$ 30474 13108 -3064 8619 6497 6731 3230 -8778 -10068 2648 14295 14215 11697 1913 -3564
6125c564K10J74p591M294J5831R476O98k695j5628l261M595O56L164J902k223
$$ -3564 -3354 -3180 -10771 -6477 9354 18830 19528 16833 1205 -2056 2539 3195 6359 8261 6038
6110F038l580L661J915J4027o140r911r809j335J1267J4554Q578m683l472n975
$$ 6038 2458 6119 8034 22061 15921 6010 -3799 -5134 6133 20687 29265 24582 21110 15135
6096A5135Q07p308l191n344l687L632J5375J2941N380P056j1777o459q790O57
$$ 15135 15942 8634 5443 99 -3588 44 15419 28360 33740 40796 29019 22560 13770 14427
6082A4427K076m476l396j0507L826R159o624m933k166P258p639q124o184O038
$$ 14427 16503 12027 8631 -1876 1950 11109 4485 -448 -2614 4644 -2995 -11119 -17303 -11265
6068a1265J3098n972p153q110j281M218J4510J1528l460j2647N023m97R330Q578
$$ -11265 1833 -4139 -11292 -19402 -20683 -16465 -1955 9573 6113 -6534 -1511 -2008 7322 15900
6054A5900M757k500J60j1620q504J3523L142j3298j1511k836Q156P906M445N193
$$ 15900 20657 18157 18317 6697 -1807 11716 14858 1560 -9951 -12787 -4631 3275 7720 12913
6040A2913P11M402q76L6L64O623l2564q156J0468O719N240o291O028l323l955
$$ 12913 13624 18026 17150 17186 17550 24173 -8391 -16547 -6079 640 5880 -411 5617 2294 -1661
6025a661Q632o029j4698J275R548N763o620m432k604j724o149J89J4328J7688
$$ -1661 6971 942 -13756 -12481 -2933 2830 -3790 -8222 -10826 -12550 -18699 -18510 -4182 13506
6011A3506n23r171o442J217m660k610Q966J0143l239r42k624m096n710j6825l146
$$ 13506 12983 3812 -2630 -1413 -6073 -8683 283 10426 7187 6245 3621 -475 -6185 -23010 -26156
5996b6156J4562R951J261p79q194o295N855J0683P395R478M09l931j3486J2488
$$ -26156 -11594 -1643 -382 -1161 -9355 -15650 -9795 888 8283 17761 18170 14239 753 13241
5982A3241J2927o36o889Q180R188o851k2238k0852m213N67P750O190P149J910
$$ 13241 26168 25532 18643 26823 36011 29160 6922 -13930 -18143 -17576 -9826 -3636 3513 5423
5968E423Q557n005p050K748L469M646Q716o129n691n418j0933m382q231J1180
$$ 5423 13980 8975 1925 4673 8142 12788 21504 15375 9684 4266 -6667 -11049 -19280 -8100
5954h100O972P536O188p717J250J1595P947j9366j3683r785L450R302Q6j5156
$$ -8100 -1128 6408 12596 4879 6129 17724 25671 6305 -7378 -17163 -13713 -4411 -4325 -19481
5940a9481R614L15M745J1531J2662R414o521n512L971M630o476j0411P935l09
$$ -19481 -9867 -9552 -4807 6724 19386 28800 22279 16767 20738 25368 18892 8481 16416 16107
5926A6107j8661r174J0339J4991n380j8858M199m507O198J3679P952j5380q848
$$ 16107 -2554 -11728 -1389 13602 8222 -10636 -6437 -10944 -4746 8933 16885 1505 -7343
5913g343l135O106R28K031K61L820n401p208J928o443K172J4327k008q446r597
$$ -7343 -10478 -4372 -3444 -1413 -1152 2668 -2733 -9941 -8013 -14456 -12284 2043 35 -8411 -18008
5898a8008M508J3606p979M21K1869J712q649K23m858k980L556n292L459o221n068
$$ -18008 -13500 106 -7873 -7452 14417 16129 7480 7703 2845 -135 3421 -1871 1588 -4633 -9701
5883i701N711M340n742p502P778M775r650J1836J5317k888q321q006j424L015
$$ -9701 -3990 350 -5392 -12894 -5116 -341 -9991 1845 17162 14274 5953 -2053 -3477 -462
5869d62P464J5145n228K043J3144R039o451j5050j1725L814L124j2235j3726N072
$$ -462 7002 22147 16919 18962 32106 41145 34694 19644 7919 11733 14857 2622 -11104 -6032
5855f032n174l405p353j523J963J5027J0619L36R602o076j0357q764L485J0076
$$ -6032 -11206 -14611 -21964 -23487 -21524 -6497 4122 4458 14060 7984 -2373 -11137 -7652 2424
5841B424K177l529j532J291J369j6352j61j5943j8337J5340J9190K6503p54q892
$$ 2424 4601 1072 -460 831 2200 -14152 -14313 -30256 -48593 -33253 -14063 12440 11686 2794
5827B794J1476P323j8556l530o40n784o070K22j5681M066P527J3236J1573J827
$$ 2794 14270 21593 3037 -493 -1133 -6917 -12987 -12765 -28446 -24380 -16853 -3617 7956 9783
5813I783j4525m4Q357k787O318j386j5850j8951K2504K2765l022j2645J941m131
$$ 9783 -4742 -4786 3571 784 7102 5716 -10134 -29085 -6581 16184 13162 517 2458 -1673
5799a673m99o251n578J2978L327N91m89M644j701o73Q190J2333m765j7776j8407
$$ -1673 -2172 -8423 -14001 -1023 2304 2895 2406 7050 5349 4676 12866 25199 20434 2658 -15749
5784a5749l153J6960M601m997K986J0239j0453j2087R611J2840k314N142l711
$$ -15749 -18902 -1942 2659 -2338 648 10887 434 -11653 -2042 10798 8484 13626 9915
5771I915L23r135r398M342r213J2871J004O822K2643N530p02r957r355j928L581
$$ 9915 10238 1103 -8295 -3953 -13166 -295 709 7531 30174 35704 35002 25045 15690 13762 17343
5756A7343J4138j759j7634O997J1429j0114j0424j990k68k496N169Q89k18q588
$$ 17343 31481 29722 12088 19085 30514 20400 9976 7986 7718 5222 10391 11280 11062 2474
5742B474l196J4834l098l355P829k438M050j6226m890j976J5087J9506p431j3002
$$ 2474 -722 14112 11014 7659 15488 13050 17100 874 -4016 -5992 9095 28601 21170 8168
5728H168O83P426j558p368j52l491l220j075K417k836o077k79K793P930M498Q775
$$ 8168 8851 16277 14719 7351 7199 3708 488 -587 1830 -1006 -7083 -7362 -4569 3361 7859 16634
5712A6634R301L334j7821j3616k171p657j4399L688J4213J6019P439o198j7814
$$ 16634 25935 29269 11448 -2168 -4339 -11996 -26395 -22707 -8494 7525 14964 8766 -9048
5699i048L059j187k455P138j0712J794O078j308J927J232N291k115q388J7534
$$ -9048 -5989 -7176 -9631 -2493 -13205 -11411 -5333 -6641 -4714 -3482 1809 -306 -8694 8840
5685H840R813m054r439p747j3347j3149R269P479o604q52m669Q429O564L453m481
$$ 8840 18653 14599 5160 -2587 -15934 -29083 -19814 -12335 -18939 -19791 -24460 -16031 -9467 -6014 -10495
5670a0495j4563j5813J3847J1312L573L258J0165L31j587j731n631q018K956o196
$$ -10495 -25058 -40871 -27024 -15712 -12139 -8881 1284 1615 28 -1703 -7334 -15352 -12396 -18592
5656a8592l597K241m83J0140P528J4783J1428j6010j7243K850N227L76J0290n744
$$ -18592 -22189 -19948 -20431 -10291 -2763 12020 23448 7438 -9805 -6955 -1728 -1352 8938 3194
5642C194n802j087J1536k113p495j5332l746K8966J4135m564L994j7402l727N007
$$ 3194 -2608 -3695 7841 5728 -1767 -17099 -20845 8121 22256 17692 21686 4284 557 5564
5628E564j6966r348J3056J4215R193n418j1292l721P251M074O239j3419l586N584
$$ 5564 -11402 -20750 -7694 6521 15714 10296 -996 -4717 2534 6608 12847 -572 -4158 1426
5614A426q469o537Q370K147N734l833N26p758o268P979J7625J022J571L30k987
$$ 1426 -7043 -13580 -5210 -3063 2671 -1162 -636 -8394 -14662 -6683 10942 11964 13535 13865 10878
5599A0878m573j569k048j151p352R669L690O36p05m02J206p9k890j6996j0147
$$ 10878 6305 4736 2688 1537 -5815 3854 7544 8180 7475 7073 8279 8200 5310 -11686 -21833
5584b1833J2596j774M564j7477j2879J6370J1402L557n794L348L371m468j3504
$$ -21833 -9237 -11011 -6447 -23924 -36803 -20433 -9031 -5474 -11268 -7920 -4549 -9017 -22521
5571b2521Q082M811Q759j0449p125M565J399m556P980O860M060J2409k847o904
$$ -22521 -14439 -9628 -869 -11318 -18443 -13878 -12479 -17035 -9055 -2195 1865 14274 11427 4523
5557D523P844j839n087J52L872n121p365n786L018J439o996q6J4244J0677j1728
$$ 4523 12367 10528 5441 5593 9465 4344 -3021 -8807 -5789 -4350 -11346 -11432 2812 13489 1761
5542A761p159p75q063p593j3303R441J7267l313N664K370p466j763l147J3736
$$ 1761 -5398 -6173 -14236 -21829 -35132 -25691 -8424 -11737 -6073 -3703 -11169 -12932 -16079 -2343
5528b343L756j2986j1404K0392O807N407J186n359l505P682Q622O119q746j3895
$$ -2343 1413 -11573 -22977 -2585 4222 9629 10815 5456 1951 9633 18255 24374 15628 1733
5514A733j2580N646L194P89l899p712k654J712K07j3157Q476J4160J3814K76j1295
$$ 1733 -10847 -5201 -2007 -1218 -5117 -12829 -15483 -13771 -13564 -26721 -18245 -4085 9729 10005 -1290
5499a290j1689N074J2979J4793R544j6486j6400m934Q10j286O463l349p817n981
$$ -1290 -12979 -7905 5074 19867 29411 12925 -3475 -8409 -7599 -8885 -2422 -5771 -13588 -19569
5485a9569O721N925P216P91j010K111j5193M160J8022R956r660j0021k053r263
$$ -19569 -12848 -6923 293 1084 74 2185 -13008 -8848 9174 19130 9470 -551 -2604 -11867
5471a1867J3460P441k249K013l608j2327J400J1116q25r827R314o826k465J924
$$ -11867 1593 9034 6785 8798 5190 -7137 -5737 5379 4554 -5273 4041 -2785 -5250 -3326
5457c326J2868m739o822P558o413l236L109o80m49q085j0070J277J3827J463n07
$$ -3326 9542 4803 -2019 5539 -874 -4110 -1001 -1681 -2130 -10215 -20285 -19008 -5181 -3718 -4225
5442d225O086N602m705Q535j4315m713J749j1890j272J72O036J196J7049J0617
$$ -4225 1861 7463 2758 11293 -3022 -7735 -5986 -17876 -19148 -18976 -12940 -11744 5305 15922
5428A5922j6319p29k76k425k588P091l76j6155p264M868m787N685J0070L53J366
$$ 15922 -397 -1126 -1402 -3827 -6415 676 300 -15855 -23119 -18251 -23038 -17353 -7283 -6930 -5564
5413e564n583m630N59K613j538J7104K640k764p355k032J2695J5641j2433J1112
$$ -5564 -11147 -15777 -15218 -12605 -14143 2961 5601 2837 -4518 -6550 6145 21786 9353 20465
5399B0465j231k1114j0026M04J1651R285O248j2772Q85n421n584J2080j3034j6899
$$ 20465 19234 -1880 -11906 -11502 149 9434 15682 2910 3795 -1626 -7210 4870 -8164 -25063
5385b5063o161p11J6172j093J2017L787j489K541j1838N271J9737N175n502j2294
$$ -25063 -31224 -31935 -15763 -16856 -4839 -1052 -2541 0 -11838 -6567 13170 18345 12843 549
5371E49n638R471k056m661o71R42O832R271m982L687J5494n451r051j0964j7561
$$ 549 -5089 4382 2326 -2335 -3006 -2064 4768 14039 9057 12744 28238 22787 13736 2772 -14789
5356a4789j817J1910N851N396J415r522J73j387m863N341O138J611j3836j1147
$$ -14789 -16606 -4696 1155 6551 7966 -1556 -1383 -2770 -7633 -2292 3846 5457 -8379 -19526
5342a9526O569J858J961l104J0633Q305m643K859L976n904M057K099p033n353
$$ -19526 -12957 -11099 -9138 -12242 -1609 6696 2053 4912 8888 2984 7041 9140 2107 -3246
5328c246p543m163l054J3437O164l803j295m929K010J5929Q510m391j0161j662
$$ -3246 -10789 -14952 -18006 -4569 1595 -2208 -3503 -8432 -6422 9507 18017 13626 3465 1803
5314A803r71O674n500N631K13M852J2262j3052j5925P84j920j3775L869J1317
$$ 1803 832 7506 2006 7637 7850 12702 24964 11912 -4013 -3229 -5149 -18924 -15055 -3738
5300c738M788N424o958Q80J5374J4048q506p586o976J804r188k45K3625j1390
$$ -3738 1050 6474 -484 396 15770 29818 21312 13726 6750 8554 -634 -879 22746 11356
5286A1356k4548n227R174J3503o465q388k42K591P923J233K41j4050k072p833
$$ 11356 -13192 -18419 -9245 4258 -2207 -10595 -10837 -8246 -323 910 1151 -12899 -14971 -22804
5272b2804R272J2479K459O910L836l736p737r740j1106l671P199J6955J2600P53
$$ -22804 -13532 -1053 1406 8316 12152 8416 679 -9061 -20167 -23838 -16639 316 12916 13669
5258A3669M053j0854r293p606j1520J2250m44m796J7164K019j2522K186Q438K113
$$ 13669 17722 6868 -2425 -10031 -21551 -9301 -9745 -14541 2623 4642 -7880 -5694 2744 4857
5244D857M408q993q700J038K0161K440n593n522j0033o657k713J312j4505l961
$$ 4857 9265 272 -8428 -7390 12771 15211 9618 4096 -5937 -12594 -15307 -13995 -28500 -32461
5230c2461K3832R837q6o173P06m182o588J0260P226m900o290j572O4N908J2898
$$ -32461 -8629 1208 1122 -5051 -4345 -8527 -15115 -4855 2371 -2529 -8819 -10391 -10327 -4419 8479
5215H479N592K277K477K401j7858o073j7377L128k458J0414J4265p13j2470j499
$$ 8479 14071 16348 18825 21226 3368 -2705 -20082 -16954 -19412 -8998 5267 4554 -7916 -9415
5201i415J5722N699R20p222p720r367L28K282L074j2239j004J7226J4689J0032
$$ -9415 6307 12006 12926 5704 -2016 -11383 -11055 -8773 -5699 -17938 -18942 -1716 12973 23005
5187B3005m354j6834k543j397n159l726j3635l108R729n288K073J1935P246j93
$$ 23005 18651 1817 -726 -2123 -7282 -11008 -24643 -27751 -18022 -23310 -21237 -9302 -2056 -2249
5173b249N670K463k374K97J4659o2j0834n683K571n804J6418l408j8242o649k150
$$ -2249 3421 5884 3510 3807 18466 18404 7570 1887 4458 -1346 15072 11664 -6578 -13227 -15377
5158a5377o695l494K9619M718o457l045M52l003q881m538M688J2332J124j0922
$$ -15377 -22072 -25566 4053 8771 2314 -731 -279 -3282 -12163 -16701 -12013 319 1443 -9479
5144i479o647k712r36M561O537O392N601J2972m516j9068n058m089J7590j377
$$ -9479 -16126 -18838 -19774 -15213 -8676 -2284 3317 16289 11773 -7295 -12353 -16442 1148 -229
5130b29J365J5137Q99o350j1218Q348O831j4714k571N801P321K613k342o546j291
$$ -229 1136 16273 17172 10822 -396 7952 14783 69 -2502 3299 10620 13233 10891 4345 3054
5115C054J1398m491j8043l178N355o291j0300j985R25N912N433k505j1107N246
$$ 3054 14452 9961 -8082 -11260 -5905 -12196 -22496 -24481 -23556 -17644 -12211 -14716 -25823 -20577
5101b0577O277K181o364p466P145J2830m222n372l627N215k289K221L222j02q327
$$ -20577 -14300 -12119 -18483 -25949 -18804 -5974 -10196 -15568 -19195 -13980 -16269 -14048 -10826 -10928 -19255
5086a9255r832m289Q373Q578j0453o431R818J5257l497p155r60J363J2474k102
$$ -19255 -29087 -33376 -25003 -16425 -26878 -33309 -23491 -8234 -11731 -18886 -19846 -18483 -6009 -8111
5072h111K577q68O301K629j2135j869n304p5O540K253J8534j668j608M094o629
$$ -8111 -5534 -6402 -101 2528 -9607 -11476 -16780 -16855 -10315 -8062 10472 8804 7196 11290 4661
5057D661j3492m992J142R43O882n012p024J0429j570j0890O136l145m821p517
$$ 4661 -8831 -13823 -12681 -11738 -4856 -9868 -16892 -6463 -8033 -18923 -12787 -15932 -20753 -28270
5043b8270R348J0104K0533O643l645n322L200j386j664j9938K631J2707j9p680
$$ -28270 -18922 -8818 11715 18358 14713 9391 12591 11205 9541 -10397 -7766 4941 4922 -2758
5029b758n084N651J0331k451l026p63p695j848M613n241L22k499k700n51J621
$$ -2758 -7842 -2191 8140 5689 2663 1900 -5795 -7643 -3030 -8271 -7949 -10448 -13148 -13699 -12078
5014a2078K992J9336J0810q587j4861j9570J0576M227J417M551n684j3047P684
$$ -12078 -9086 10250 21060 12473 -2388 -21958 -11382 -7155 -5738 -1187 -6871 -19918 -12234
5001a2234K805j749P168j4165j614o622K858M463N531l448j0159J6881J0766O758
$$ -12234 -9429 -11178 -4010 -18175 -19789 -26411 -23553 -19090 -13559 -17007 -27166 -10285 481 7239
4987G239l234k81J49j815J2122k120m331L708J036m272j1906l042Q785j573q608
$$ 7239 4005 3724 3873 2058 14180 12060 7729 11437 12473 8201 -3705 -6747 2038 465 -8143
4972h143k653j34K155J698l283J7450K9999J023j5873k0533M096n541m277N031
$$ -8143 -10796 -10930 -8775 -7077 -10360 7090 37089 38112 22239 1706 5802 261 -4016 1015
4958A015M222l778M323N539j1550k079R550R947r010n204j794j228M513K874r411
$$ 1015 5237 1459 5782 11321 -229 -2308 7242 17189 8179 2975 1181 -47 4466 7340 -2071
4943b071m34l632l380l371N219O408m081Q480P193r076j236L963j2189k382Q885
$$ -2071 -2505 -6137 -9517 -12888 -7669 -1261 -5342 3138 10331 1255 19 3982 -8207 -10589 -1704
4928a704k358L853P28M514M809p901q687p76k535k742r31j2331l051K0475J6219
$$ -1704 -4062 -209 519 5033 9842 1941 -6746 -7522 -10057 -12799 -13730 -26061 -29112 -8637 7582
4913G582n209l84j3818J0029J0407m993j4295j1259m407q543o67l010J8575J4046
$$ 7582 2373 1989 -11829 -1800 8607 3614 -10681 -21940 -26347 -34890 -35557 -38567 -19992 -5946
4899e946O225r696o182l422O470R41K527p806J349J1594O655o77R297N143j0996
$$ -5946 279 -9417 -15599 -19021 -12551 -11610 -9083 -16889 -15540 -3946 2709 2032 11329 16472 5476
4884E476k616j926k4789n552Q102J2061M518M082j003M683M247j5135J964K1316
$$ 5476 2860 934 -23855 -29407 -21305 -9244 -4726 -644 -1647 3036 7283 -7852 -5888 15428
4870A5428R574o292j711o504j2032r522J8543J4517l479p719K121p154j936j726
$$ 15428 25002 18710 16999 10495 -1537 -11059 7484 22001 18522 10803 12924 5770 3834 2108
4856B108o477j181Q18N365j0415J132m869L961j099j0519J728J7471P641k809
$$ 2108 -4369 -5550 -4732 633 -9782 -8650 -13519 -9558 -10657 -21176 -19448 -1977 5664 2855
4842B855N304N096p894m607j5932l272J5245Q407r165q476o326J0395J173K256
$$ 2855 8159 13255 5361 754 -15178 -18450 -3205 5202 -3963 -12439 -18765 -8370 -7197 -4941
4828d941L283j1045l212q60L100Q519q310R019m143P035m653k318P250k229o566
$$ -4941 -1658 -12703 -15915 -16775 -13675 -5156 -13466 -4447 -8590 -1555 -6208 -8526 -1276 -3505 -10071
4813a0071o377j1427J206L68J408N126R052j244l623m790j278r298J2713K4774
$$ -10071 -16448 -27875 -26669 -26301 -24893 -19767 -10715 -11959 -15582 -20372 -21650 -30948 -18235 6539
4799F539k283m691L118N040L571k727j8734j6350O126R850O044p196l000Q170
$$ 6539 4256 -435 2683 7723 11294 8567 -10167 -26517 -20391 -10541 -4497 -11693 -14693 -6523
4785f523J0635M215j1167j2727m101p297j472Q931j179n997j4741R33K074k790
$$ -6523 4112 8327 -2840 -15567 -19668 -26965 -28437 -19506 -20685 -26682 -41423 -40490 -38416 -41206
4771d1206O160N717K0054K14j831J502L097K182m485q29Q944r56k956j0596L141
$$ -41206 -35046 -29329 -9275 -9061 -10892 -9390 -6293 -4111 -8596 -9425 -481 -1437 -4393 -14989 -11848
4756a1848J4827M726j082K810n925Q330j0631j3270M633j499n623O863l366l587
$$ -11848 2979 7705 6623 9433 3508 11838 1207 -12063 -7430 -8929 -14552 -7689 -11055 -14642
4742a4642N459M870q891J1229J0588Q8o094J146K128N062M383j2436o419K461
$$ -14642 -9183 -4313 -13204 -1975 8613 8701 2607 3753 5881 10943 15326 2890 -3529 -1068
4728a068J0159K806R837q943q145r879p549N775J3144N784P13J961j186n244K740
$$ -1068 9091 11897 21734 12791 4646 -5233 -12782 -7007 6137 11921 12634 14595 13409 8165 10905
4713A0905m533m466j892l92l755j3038m008L292J093L199n990P92J3255M177L875
$$ 10905 6372 1906 14 -378 -4133 -17171 -21179 -17887 -16794 -13595 -19585 -18793 -5538 -1361 2514
4698B514M139j0876j6293M299N717O189P08N763j3732M691j800O177j922L170
$$ 2514 6653 -4223 -20516 -16217 -10500 -4311 -3603 2160 -11572 -6881 -8681 -2504 -4426 -1256
4684a256L375j5716j4775M268R354J452J0143K727j730J62j4081o238Q369k346
$$ -1256 2119 -13597 -28372 -24104 -14750 -13298 -3155 -428 -2158 -1996 -16077 -22315 -13946 -16292
4670a6292J233K573O170L959j6483M428K9364J6907j511n224o376j3034m160r377
$$ -16292 -15059 -12486 -6316 -2357 -18840 -14412 14952 31859 30348 25124 18748 5714 1554 -7823
4656g823K487j382r539n69Q519M489Q24n777j1562j1959P646J9906J0744L880
$$ -7823 -5336 -6718 -16257 -16826 -8307 -3818 -2994 -8771 -20333 -32292 -24646 -4740 6004 9884
4642I884J5512J383p321j2087j0994j6582j0743q623P041J9924N778k95J9018
$$ 9884 25396 26779 19458 7371 -3623 -20205 -30948 -39571 -32530 -12606 -6828 -7123 11895
4629A1895m436j6992p232l129k414J5100k3j2862q412n01J712p051N880O053O78
$$ 11895 7459 -9533 -16765 -19894 -22308 -7208 -7231 -20093 -28505 -29006 -27294 -34345 -28465 -22412 -21734
4614b1734M644L014n334J6367m409P312L495r74k335k520m745p01j1775j451K18
$$ -21734 -17090 -14076 -19410 -3043 -7452 -140 3355 2381 46 -2474 -7219 -7920 -19695 -21146 -20928
4599b0928L777J1583M180m847k452r091p446o632O383R591J5930P587k875j2160
$$ -20928 -17151 -5568 -1388 -6235 -8687 -17778 -25224 -31856 -25473 -15882 48 7635 4760 -7400
4585g400q314L956J030J1555K3436q2o310j0890n69o289K588L34m015j0618J2578
$$ -7400 -15714 -11758 -10728 827 24263 24181 17871 6981 6412 123 2711 3045 -970 -11588 990
4570I90O730M198n158q310j416N830k346J987N288J298Q30r154Q1N148L252Q180
$$ 990 7720 11918 6760 -1550 -2966 2864 518 2505 7793 9091 9921 767 848 5996 9248 17428
4554A7428k85m728l754R260M075N92N64j5716J3626r6j8209k12j3763j716J4798
$$ 17428 17143 12415 8661 17921 21996 22588 23152 7436 21062 20966 2757 2545 -11218 -12934 1864
4539A864P575O216O35j2173o338j1800j349R519M482M381N900J146j7210j3062
$$ 1864 9439 15655 16290 4117 -2221 -14021 -15370 -5851 -1369 3012 8912 10058 -7152 -20214
4525b0214o26L917O987N91l330n78M778k78j535J966R256j021j2871M053j547
$$ -20214 -20840 -16923 -9936 -9345 -12675 -13253 -8475 -8753 -10288 -8322 934 -87 -12958 -8905 -10452
4510a0452N893K411j6616q661J6824J5331J7331J0027j4617j4755r755j3091j83
$$ -10452 -4559 -2148 -18764 -27425 -10601 4730 22061 32088 17471 2716 -7039 -20130 -20313
4497b0313P937Q684K2j2334j9383N926J1537J3098R71n338o500o499j809J3656
$$ -20313 -12376 -3692 -3670 -16004 -35387 -29461 -17924 -4826 -3855 -9193 -15693 -22192 -24001 -10345
4483a0345J706p578MJ353p31n224P546J6258K484R476m638q829n363P673J0067
$$ -10345 -8639 -16217 -16213 -14860 -15591 -20815 -13269 2989 5473 14949 10311 1482 -3881 3792 13859
4468A3859K997j287p828l833J3234R874m011r886q999j6933m064J854K5474Q238
$$ 13859 16856 15569 7741 3908 17142 27016 23005 13119 4120 -12813 -16877 -15023 10451 18689
4454A8689m694m651p188p272J1573R276K270n99q429k120O603M83K467j0619j8499
$$ 18689 13995 9344 2156 -5116 6457 15733 18003 17404 8975 6855 13458 13941 16408 5789 -12710
4439a2710m18Q823L931n535P452J206L157L514J116q085J562P808m25O0J3179
$$ -12710 -13128 -4305 -374 -5909 1543 2749 5906 9420 10536 2451 4013 11821 11396 11456 24635
4424B4635j0214j0051m578m909m650J949J5442L474J122J8912M470j1220o61k55
$$ 24635 14421 4370 -208 -5117 -9767 -7818 7624 11098 12220 31132 35602 24382 23721 23466
4410B3466j0809j3987J826j265n715J2059m056j0509o518m964j0367M162M293
$$ 23466 12657 -1330 496 -769 -6484 5575 1519 -8990 -15508 -20472 -30839 -26677 -22384
4397b2384O731O546J669J1879P043j4729o385Q777p92L713n145j120q808M593
$$ -22384 -15653 -9107 -7438 4441 11484 -3245 -9630 -853 -1645 2068 -3077 -4197 -13005 -8412
4383h412P320k655m731l036J1678Q004k924m273j2654O060m985m750R692J0241
$$ -8412 -1092 -3747 -8478 -11514 164 8168 5244 971 -11683 -5623 -10608 -15358 -5666 4575
4369D575M407N498N087o74j2254o541n751L395J0168m862j6911L517j1996j4656
$$ 4575 8982 14480 19567 18893 6639 98 -5653 -2258 7910 3048 -13863 -10346 -22342 -36998
4355c6998q338Q121J9011K326p65m711m282J5576J9111M771J318l322J138j3385
$$ -36998 -45336 -37215 -18204 -15878 -16643 -21354 -25636 -10060 9051 13822 15140 11818 12956 -429
4341d29k791J1379k485j2424K226p938r004P073l714P006L134J7863p490r72k907
$$ -429 -3220 8159 5674 -6750 -4524 -12462 -21466 -14393 -18107 -11101 -7967 9896 2406 1434 -1473
4326a473j219r882j3501M362M649k35R747L572J4363O113j9500j389P066M06L455
$$ -1473 -2692 -12574 -26075 -21713 -17064 -17299 -7552 -3980 10383 16496 -3004 -4393 2673 3079 6534
4311F534m889j5035Q141Q663j0351m2J674M694o343j2058r05J4983J0127l791
$$ 6534 1645 -13390 -5249 3414 -6937 -6979 -5305 -611 -6954 -19012 -19917 -4934 5193 1402
4297A402j523j340J353m585J935L55p893r020n639J0737R537l997N294R628J5705
$$ 1402 -121 -1461 -108 -4693 -2758 -2403 -10296 -19316 -24955 -14218 -4681 -8678 -3384 6244 21949
4282B1949N913k078m040j4428l99N244j2043J339R886j2383K691J3402K740n342
$$ 21949 27862 25784 21744 7316 6917 12161 118 1457 11343 -1040 1651 15053 17793 12451
4268A2451j0983N366O77K749K577n898j1611l011K597l893L837j916K550O273
$$ 12451 1468 6834 7511 10260 12837 6939 -4672 -7683 -5086 -8979 -5142 -7058 -4508 1765
4254A765L972l427j3560q189K817p326J0393J8779J413j2186m083N78j031L015
$$ 1765 5737 2310 -11250 -19439 -16622 -23948 -13555 5224 6637 -5549 -9632 -9054 -10085 -7070
4240g070L666K1775o042k1211k828L181N247L445K307R842O69j0165p715n421
$$ -7070 -3404 18371 12329 -8882 -11710 -8529 -3282 163 2470 12312 12981 2816 -4899 -10320
4226a0320n224J9088M706m794j4019l961j133N619J168M046Q149q684k0339K427
$$ -10320 -15544 3544 8250 3456 -10563 -14524 -15657 -10038 -8870 -4824 3325 -5359 -25698 -23271
4212b3271O642K88l556P96Q673J158J6143M601K8K000k020n697J5154j3881k0350
$$ -23271 -16629 -16341 -19897 -19101 -10428 -9270 6873 11474 11502 13502 11482 5785 20939 7058 -13292
4197a3292P905O094j1447j850l712o643m293J0210L973M444J3385Q102J05j4947
$$ -13292 -5387 707 -10740 -12590 -16302 -22945 -27238 -17028 -13055 -8611 4774 12876 12981 -1966
4183a966J1204k229k3279m264P852N844L356J1606M185N240o563q155J0247l455
$$ -1966 9238 7009 -16270 -20534 -12682 -6838 -3482 8124 12309 17549 10986 2831 13078 9623
4169I623q80l852n598R361j226n016j065p197m229j0057K793r307M050Q228P096
$$ 9623 8743 4891 -707 8654 7428 2412 1347 -5850 -10079 -20136 -17343 -26650 -22600 -14372 -7276
4154g276L816J292j179j631j0255k315J1697N729j3145k785Q800J995J273j4116
$$ -7276 -3460 -2168 -3347 -4978 -15233 -17548 -5851 -122 -13267 -16052 -7252 -5257 -3984 -18100
4140a8100m876R248J2617M69M397P177O169n255j3220J269M833j50P79L731O179
$$ -18100 -22976 -13728 -1111 -642 3755 10932 17101 11846 -1374 -105 4728 4578 5357 9088 15267
4125A5267p861M499l02R038N041q417j619Q597o39o02N029M768J579j2986k0882
$$ 15267 7406 11905 11603 20641 25682 17265 15646 24243 23604 23002 28031 32799 34378 21392 510
4110E10n868o798p687M737N825O922K069o04J2051K4663r562k7666J338j795r874
$$ 510 -5358 -12156 -19843 -15106 -9281 -2359 -290 -894 11157 35820 26258 -1408 -70 -1865 -11739
4095a1739J334J6859Q56j770k320M659l084K927J911l768K977n519j1745j2343
$$ -11739 -10405 6454 7310 5540 3220 7879 4795 7722 9633 5865 8842 3323 -8422 -20765
4081b0765o765j096P115J6955J9777J2875J182M195j5032r598O701j3179m488
$$ -20765 -27530 -28626 -21511 -4556 15221 28096 29278 33473 18441 8843 15544 2365 -2123
4068b123j2055Q804M803Q764m869m624m049J879O630l639P023J1783n771N475
$$ -2123 -14178 -5374 -571 8193 3324 -1300 -5349 -3470 3160 -479 6544 18327 12556 18031
4054A8031j3101j2062j4137L009n052o026K204l30K040m694Q420J9339K228J808
$$ 18031 4930 -7132 -21269 -18260 -23312 -29338 -27134 -27464 -25424 -30118 -21698 -2359 -131 1677
4040A677n814J7732L95k545k280r23q346J248j1812p556k777o607J3597J1905
$$ 1677 -4137 13595 13990 11445 9165 8242 -104 1144 -10668 -18224 -21001 -27608 -14011 -2106
4026b106N199J4345j114j4496o27o35M054J050p341J328j152k273j292m421R223
$$ -2106 3093 17438 16324 1828 1201 566 4620 5670 -1671 -343 -1495 -3768 -5060 -9481 -258
4011b58O802k815J1930O394r134r504j908r996O40L003Q606j9j3398K058k558
$$ -258 6544 3729 15659 22053 12919 3415 1507 -8489 -7849 -4846 3760 3741 -9657 -7599 -10157
3996a0157O805P465N00k323j2469K650R018n485j181m439M70o557j639P632K800
$$ -10157 -3352 4113 4613 2290 -10179 -7529 1489 -3996 -5177 -9616 -9146 -15703 -17342 -9710 -6910
3981f910J0490R167j1508o588Q018P039o745j6638r191K120j156J885O74L512
$$ -6910 3580 12747 1239 -5349 2669 9708 2963 -13675 -22866 -20746 -21902 -20017 -19343 -15831
3967a5831R720J7876j0852j2975l778k246p292k956m403K748J881O368J1021o953
$$ -15831 -6111 11765 913 -12062 -15840 -18086 -25378 -28334 -32737 -29989 -28108 -21740 -10719 -17672
3953a7672j2821M234J6323P132n215j6354l959P788L807P84j7058m921J9850J8794
$$ -17672 -30493 -26259 -9936 -2804 -8019 -24373 -28332 -20544 -16737 -15953 -33011 -37932 -18082 712
3939G12r583N734p584k258O581K78q555J1180R683J5264L827q930j7760m529J4326
$$ 712 -8871 -3137 -10721 -12979 -6398 -6120 -14675 -3495 6188 21452 25279 16349 -1411 -5940 8386
3924H386J1836p80r258P69R741P15j8977k253j098M686P046j999m54j179Q990
$$ 8386 20222 19442 10184 10953 20694 21409 2432 179 -919 3767 10813 8814 8360 7181 16171
3909A6171M187m615k076l337q593o331L895P66k129o556m1K320M758O380K220
$$ 16171 20358 15743 13667 10330 1737 -4594 -699 67 -2062 -8618 -8659 -6339 -1581 4799 7019
3894G019N034j6711j1171J1214o578m858Q296L449q246k356o36L180n53p436j7530
$$ 7019 12053 -4658 -15829 -4615 -11193 -16051 -7755 -4306 -12552 -14908 -15544 -12364 -12917 -20353 -37883
3879c7883J8331J2225P595J2231P115j4889o735J5794L772k303O96Q214J3718
$$ -37883 -19552 -7327 268 12499 19614 4725 -2010 13784 17556 15253 15949 24163 37881
3866C7881j4141j0569k336m944j0797Q714J1214j4917o174N849J9647J2008k7163
$$ 37881 23740 13171 10835 5891 -4906 3808 15022 105 -6069 -220 19427 31435 4272
3853D272k0890j788K333J1334J1338J2891r76p702j2661p298N141j447M273J4046
$$ 4272 -16618 -18406 -16073 -4739 6599 19490 18514 10812 -1849 -9147 -4006 -5453 -1180 12866
3839A2866p20j4291o570l371o857J2859R181M641m263m225k845K28l751M87p039
$$ 12866 12146 -2145 -8715 -12086 -18943 -6084 3097 7738 3475 -750 -3595 -3367 -7118 -6631 -13670
3824a3670p728j0231N895M657K391M138L498r408J693J0302J4056O33P54m1O233
$$ -13670 -21398 -31629 -25734 -21077 -18686 -14548 -11050 -20458 -18765 -8463 5593 6226 6980 6939 13172
3809A3172M622j4172n083j153j33j3004r453j7468K102Q134R873O074M305o5m185
$$ 13172 17794 3622 -1461 -2614 -2747 -15751 -25204 -42672 -40570 -32436 -22563 -16489 -12184 -12249 -16434
3794a6434j0092K446M861R683J1239k923n875j4563l19M416j209j5454k2530P112
$$ -16434 -26526 -24080 -19219 -9536 1703 -1220 -7095 -21658 -21977 -17561 -18770 -34224 -56754 -49642
3780d9642K3269p592N049J5130Q241m560o442R702L96Q543j1654r224J2539J014
$$ -49642 -26373 -33965 -28916 -13786 -5545 -10105 -16547 -6845 -6449 2094 -9560 -18784 -6245 -5231
3766e231n011k230N774N850J1066O13j715K972j4367k5175o240R295J1451M681
$$ -5231 -10242 -12472 -6698 -848 10218 10831 9116 12088 -2279 -27454 -33694 -24399 -12948 -8267
3752h267r957K015L970J0817l363l643J331j1087p307J248J3257Q9n401J027m056
$$ -8267 -18224 -16209 -12239 -1422 -4785 -8428 -7097 -18184 -25491 -24243 -10986 -10897 -16298 -15271 -19327
3737a9327j2025J054J0396J2202k325K15P265j2389o025O922N198L59n406M552
$$ -19327 -31352 -30298 -19902 -7700 -10025 -9810 -2545 -14934 -20959 -14037 -8839 -8480 -13886 -9334
3723i334l338q500P700J2309j807m421N748N992O545q057j4416o191Q16L665P147
$$ -9334 -12672 -21172 -13472 -1163 -2970 -7391 -1643 4349 10894 2837 -11579 -17770 -16954 -13289 -6142
3708f142N009J811n758j2613n403J401O829O631P75l146K001J0439J0639j816
$$ -6142 -1133 678 -5080 -17693 -23096 -21695 -14866 -8235 -7460 -10606 -8605 1834 12473 10657
3694A0657j95M296m811q124J271k670p997j3667J688m612Q449J3566n849J243
$$ 10657 10462 14758 9947 1823 3094 424 -7573 -21240 -19552 -24164 -15715 -2149 -7998 -6755
3680f755J1196o345k931J1425k957J619o759q230n510P011L624j082n943k395
$$ -6755 4441 -1904 -4835 6590 3633 5252 -1507 -9737 -15247 -8236 -4612 -5694 -11637 -14032
3666a4032k375j0399k1733L853L0932O75j482M598P535J719k360r70N944J205
$$ -14032 -16407 -26806 -48539 -44686 -13754 -13079 -14561 -9963 -2428 -709 -3069 -4039 1905 3110
3652C110k023j9903j1362J9415m702j1847O095j0771N668J2639P783l818k48K719
$$ 3110 1087 -18816 -30178 -10763 -15465 -27312 -21217 -31988 -26320 -13681 -5898 -9716 -9964 -7245
3638g245m25P990L494q800j1237L104P205j979J3649O242J4673n039j1577l0732
$$ -7245 -7670 320 3814 -4986 -16223 -13119 -5914 -7893 5756 11998 26671 21632 10055 -20677
3624b0677j0484N788R832R792p07q916O495J1035J5466n25j9824l977p558j814
$$ -20677 -31161 -25373 -15541 -5749 -6456 -15372 -8877 2158 17624 17099 -2725 -6702 -14260 -16074
3610a6074N948P891J6228P503j6621r901l457j2233k404J6105p626J3055O146
$$ -16074 -10126 -2235 13993 21496 4875 -5026 -8483 -20716 -23120 -7015 -14641 -1586 4560
3597D560p179O219O416q199k588k20o472N206K376K206O75K044M474j7802l51
$$ 4560 -2619 3600 10016 1817 -771 -991 -7463 -2257 119 2325 3000 5044 9518 -8284 -8635
3582h635J4108J0695p67p487r185p720j1383p483J970Q531j163O920J2696J297
$$ -8635 5473 16168 15401 7914 -1271 -8991 -20374 -27857 -25887 -17356 -18519 -11599 1097 2394
3568B394q815L22R715j549O119m330j4432k68K4201M388m125k5417o281R504M64
$$ 2394 -6421 -6099 3616 2067 8186 3856 -10576 -10844 13357 17745 13620 -11797 -18078 -8574 -8110
3553h110j665r155j1166Q490R297R472J554K414l588j5942j2529m263O347Q109
$$ -8110 -9775 -18930 -30096 -21606 -12309 -2837 -1283 1131 -2457 -18399 -30928 -35191 -28844 -20735
3539b0735R200J241R347J747J404J181Q260k0077k395j2416q219K174Q947N831
$$ -20735 -11535 -10294 -947 800 2204 3385 11645 -8432 -10827 -23243 -31462 -29288 -20341 -14510
3525a4510L822L037n429j2864O785Q039q934n06J6777R082P37k6L889m943N82
$$ -14510 -10688 -7651 -13080 -25944 -19159 -11120 -20054 -20560 -3783 5299 6036 6010 9899 4956 5538
3510E538M126j199j6482j0641O770J1405m412j6322N738J9722Q287J0219N761
$$ 5538 9664 8465 -8017 -18658 -11888 -483 -4895 -21217 -15479 4243 12530 22749 28510
3497B8510J104r005M990K386o371M374J0287k839j8587j5780L274K125R588k3181
$$ 28510 29614 20609 25599 27985 21614 25988 36275 33436 14849 -931 2343 4468 14056 -9125
3483i125j5388N070K424q358K036l539P76L940m66R98J5280R153q859j5069J388
$$ -9125 -24513 -19443 -17019 -25377 -23341 -26880 -26104 -22164 -22630 -21632 -6352 2801 -6058 -21127 -19739
3468a9739P085k160j260R263l236Q598j4350p574q439r25J3543K5829J34J145
$$ -19739 -12654 -14814 -16074 -6811 -10047 -1449 -15799 -23373 -31812 -32737 -19194 6635 6769 7914
3454G914o501j3001m362p819j4655N015J3492J3210o779J0895J2318j8197q603
$$ 7914 1413 -11588 -15950 -23769 -38424 -33409 -19917 -6707 -13486 -2591 9727 -8470 -17073
3441a7073L576j0082M261K2062J6331q082q127Q511J474p188p585j317k1028m898
$$ -17073 -13497 -23579 -19318 2744 19075 10993 2866 11377 12851 5663 -1922 -3239 -24267 -29165
3427b9165J4971N520m68j200p74Q582J547p421M295O139p580L185j822O517J68
$$ -29165 -14194 -8674 -9142 -10342 -11116 -2534 -987 -8408 -4113 2026 -5554 -2369 -4191 2326 2494
3412B494j0265q626K237l519J8274k314r831j9514p5K373P04J225P579P660o995
$$ 2494 -7771 -16397 -14160 -17679 595 -1719 -11550 -31064 -31139 -28766 -28062 -26837 -19258 -11598 -18593
3397a8593N327M97P342N072j2163O587p23l228n289J7437L708k2885j745L639
$$ -18593 -13266 -12769 -5427 -355 -12518 -5931 -6654 -9882 -15171 2266 5974 -16911 -18656 -15017
3383a5017n351J4037J517j8742K484q071j1953O159Q814J2392J6188L308k747
$$ -15017 -20368 -6331 -4814 -23556 -21072 -29143 -41096 -34937 -26123 -13731 2457 5765 3018
3370C018p594J2368K684K344j1368N667n239O490K428J0526M832j0848j1299r155
$$ 3018 -4576 7792 10476 12820 1452 7119 1880 8370 10798 21324 26156 15308 4009 -5146
3356e146J453L716j720j141J174P097N887j0864n666N505J0799J176R257k609
$$ -5146 -3693 23 -1697 -2838 -1664 5433 11320 456 -5210 295 11094 12270 21527 18918
3342A8918j6531j4669l411O259R131L788r289J3018p822l92k263r57p23L628j1861
$$ 18918 2387 -12282 -15693 -9434 -303 3485 -5804 7214 -608 -1000 -3263 -4220 -4943 -1315 -13176
3327a3176J033J7501n9j4278K459k627J64M845J0082k996j2757j4071R917q53
$$ -13176 -12143 5358 5299 -8979 -6520 -9147 -8983 -4138 5944 2948 -9809 -23880 -13963 -14816
3313a4816k849j26k606J6680N670j2131j0817J2453L775J5129J709K894R745J0661
$$ -14816 -17665 -17791 -20397 -3717 1953 -10178 -20995 -8542 -4767 10362 12071 14965 24710 35371
3299C5371j2770j3534j7072J558R38r47n824O092J4566o907m843P465Q45n302
$$ 35371 22601 9067 -8005 -6447 -5509 -6456 -12280 -6188 8378 1471 -3372 4093 4938 -364
3285c64n806P3o559q76j5360N439J8794O088O21j2688j4708p936M62n537N317
$$ -364 -6170 -6097 -12656 -13532 -28892 -23453 -4659 1429 2050 -10638 -25346 -33282 -32820 -38357 -33040
3270c3040K8206J0839j0242r138j142j309J829L270Q67q082j441Q231k613r912
$$ -33040 -4834 6005 -4237 -13375 -14517 -15826 -13997 -10727 -9860 -17942 -19383 -11152 -13765 -23677
3256b3677j2R409J1737j0921k261R185O888K072N579K127L76j6009l737L588n371
$$ -23677 -23689 -14280 -2543 -13464 -15725 -6540 348 2420 7999 10126 10502 -5507 -9244 -5656 -11027
3241a1027p699R655J1587N464q103m346j785q473j232J2288l944k2256l991O479
$$ -11027 -18726 -9071 2516 7980 -123 -4469 -6254 -14727 -15959 -3671 -7615 -29871 -33862 -27383
3227b7383J955J1514J4177M869L444j004r644j1900l025k500n61O817J0426q609
$$ -27383 -25428 -13914 263 5132 8576 7572 -2072 -13972 -16997 -19497 -20058 -13241 -2815 -11424
3213a1424o161j401M713m03R041k696rQ080n221K775k0293q269O638J625Q728
$$ -11424 -17585 -18986 -14273 -14676 -5635 -8331 -8340 -260 -5481 -2706 -22999 -31268 -24630 -23005 -14277
3198a4277M340R872J2321j486j6547m627o791n290N035Q840n255L565j0503N229
$$ -14277 -9937 -65 12256 10770 -5777 -10404 -17195 -22485 -17450 -8610 -13865 -10300 -20803 -15574
3184a5574J2560j401j9331o623J7151P238M264Q62N104J5371o27j0146n276K587
$$ -15574 -3014 -4415 -23746 -30369 -13218 -5980 -1716 -854 4250 19621 18994 8848 3572 6159
3170F159J2522p79j5928j5091R627j373M438J1211m125n228K133p332n95k271
$$ 6159 18681 17902 1974 -13117 -3490 -4863 -425 10786 6661 1433 3566 -3766 -4361 -6632
3156f632m495j2594J6015J2793q020O658J3599m619l776M903j262j9039j6054
$$ -6632 -11127 -23721 -7706 5087 -2933 3725 17324 12705 8929 13832 12570 -6469 -22523
3143b2523j0358O555J1120j790K171R992M329M150P348L884l211r647n244l772
$$ -22523 -32881 -26326 -15206 -16996 -14825 -4833 -504 3646 10994 14878 11667 2020 -3224 -6996
3129f996r731M668l633Q225k24k457M112k202j4533q135J3081M022L846k052J0651
$$ -6996 -16727 -12059 -15692 -7467 -7691 -10148 -6036 -8238 -22771 -30906 -17825 -13803 -9957 -12009 -1358
3114a358P201m366k0853j353M879J518k656j15O922p854l998J266j410j4836J3155
$$ -1358 5843 1477 -19376 -20729 -15850 -14332 -16988 -17103 -10181 -18035 -22033 -20767 -22177 -37013 -23858
3099b3858J0222K4607J74R108R75n66j0116q447k562n937l302j0759N536N094
$$ -23858 -13636 10971 11145 20253 21228 20662 10546 2099 -463 -6400 -9702 -20461 -14925 -9831
3085i831O753m824n157m809o124L790P316O546N492N696O38Q363n202r600j171
$$ -9831 -3078 -7902 -13059 -17868 -23992 -20202 -12886 -6340 -848 4848 5486 13849 8647 -953 -2124
3070b124J2000m832p166O137R657Q424o273p592j867K1910q969k0317j7160m88
$$ -2124 9876 5044 -2122 4015 13672 22096 15823 8231 6364 28274 19305 -1012 -18172 -18660
3056a8660K021N939l980j0100N620M243O221J1674K208j33j790k0876j1151N721
$$ -18660 -16639 -10700 -14680 -24780 -19160 -14917 -8696 2978 5186 5053 3263 -17613 -28764 -23043
3042b3043m335Q46O458J6776p3M562l720m585o140K155J0984j176O446R94k10
$$ -23043 -27378 -26532 -20074 -3298 -3371 1191 -2529 -7114 -13254 -11099 -115 -1291 5155 6149 5939
3027E939M178p791k0744j4185O644K747O889P108J09N189J3662l114O315J3965
$$ 5939 10117 2326 -18418 -32603 -25959 -23212 -16323 -9215 -9106 -3917 9745 6631 12946 26911
3013B6911L985q029q731L875q367N592j7444k4362O450R17p136j444K063R54J2746
$$ 26911 30896 22867 14136 18011 9644 15236 -2208 -26570 -20120 -19203 -26339 -27783 -25720 -24766 -12020
2998a2020J6753O698r120l804j99J77j4604r025N730K094n113O016P104k21J1337
$$ -12020 4733 11431 2311 -1493 -1692 -1515 -16119 -25144 -19414 -17320 -22433 -16417 -9313 -9534 1803
2983A803J1525Q586L948k0130j0675j9329l714J4624J5605l861r126k996l976
$$ 1803 13328 21914 25862 5732 -4943 -24272 -27986 -13362 2243 -1618 -10744 -13740 -17716
2970a7716j101k308J0712M315L177R858r687j3161p939j2271Q34O845P091J8392
$$ -17716 -18817 -21125 -10413 -6098 -2921 6937 -2750 -15911 -23850 -36121 -35287 -28442 -21351 -2959
2956b959J057p600p527J5983O550q814q854J3937K51j2335p910P924N871N763
$$ -2959 -1902 -9502 -17029 -1046 5504 -3310 -12164 1773 2024 -10311 -18221 -10297 -4426 1337
2942A337N755k612p010O010M067n146j0935q596M843k001J93m187J9372O711J21
$$ 1337 7092 4480 -2530 3480 7547 2401 -8534 -17130 -12287 -14288 -14095 -18282 1090 7801 7922
2927G922q347R94k914n859O510j1422q6K1938J2043j0065r716o343r606l401K993
$$ 7922 -425 569 -2345 -8204 -1694 -13116 -13202 8736 20779 10714 998 -5345 -14951 -18352 -15359
2912a5359Q069Q819O292o32o108j5208L464L775L506R364J0599j9794j7319m01
$$ -15359 -7290 1529 7821 7189 1081 -14127 -10663 -6888 -3382 5982 16581 -3213 -20532 -20933
2898b0933L430J2770p231l656J8780O139q968k999n018j133R280Q009o168N19
$$ -20933 -17503 -4733 -11964 -15620 3160 9299 331 -2668 -7686 -8819 461 8470 2302 2821
2884B821k982j945J054q368j476J0246m876n263L958Q327J8781k473L801k453
$$ 2821 -161 -2106 -1052 -9420 -10896 -650 -5526 -10789 -6831 1496 20277 17804 21605 19152
2870A9152l313j1739l314K485p082R73k067p757J0194J8861M338j2306n416j079
$$ 19152 15839 4100 786 3271 -3811 -2838 -4905 -12662 -2468 16393 20731 8425 3009 1930
2856A930K861j6054j3417P91J630n08K680k552O676J4617O397K333q602j6998
$$ 1930 4791 -11263 -24680 -23889 -22259 -22767 -20087 -22639 -15963 -1346 5051 7384 -1218 -18216
2842a8216p728J8842J0877j3904K52L886p804j4958J9023J6322l140j3416o089
$$ -18216 -25944 -7102 3775 -10129 -9877 -5991 -13795 -28753 -9730 6592 3452 -9964 -16053
2829a6053J264M91k69l376J7125R161r838m766l371L016J493r665j264J1933J31
$$ -16053 -14789 -14298 -14567 -17943 -818 8343 -1495 -6261 -9632 -6616 -5123 -14788 -16052 -4119 -3988
2814c988j3432M14O203Q472j0990j3552Q286N761N283k032o153R809P078p488
$$ -3988 -17420 -17006 -10803 -2331 -13321 -26873 -18587 -12826 -7543 -9575 -15728 -5919 1159 -6329
2800f329p908k828j4281Q825J3013N682M568L018j1369j432O320O360j7831l978
$$ -6329 -14237 -17065 -31346 -22521 -9508 -3826 742 3760 -7609 -9041 -2721 3639 -14192 -18170
2786a8170j776k2632K820K2988P356M232K48J40j0597j3411N046R514l699o353
$$ -18170 -19946 -42578 -39758 -16770 -9414 -5182 -4934 -4794 -15391 -28802 -23756 -14242 -17941 -24294
2772b4294R555q318M70J4966J3930J3905J806j5031j4604j0425K539K738R777
$$ -24294 -14739 -23057 -22587 -7621 6309 20214 22020 6989 -7615 -18040 -15501 -12763 -2986
2759b986N751J0625J5242j3103j6054N768N936Q257j1960j5668r037O299Q531
$$ -2986 2765 13390 28632 15529 -525 5243 11179 19436 7476 -8192 -17229 -10930 -2399
2746b399R983K635p405j1582j1833L237J3094o419n963P041j366O782P399k790
$$ -2399 7584 10219 2814 -8768 -20601 -17364 -4270 -10689 -16652 -9611 -10977 -4195 3204 414
2732D14M446N198n061j0943n057P240m45J1898Q375r010n352O182M977j0462k4183
$$ 414 4860 10058 4997 -5946 -11003 -3763 -4208 7690 16065 7055 1703 7885 12862 2400 -21783
2717b1783m814P647J9043j528o616K707O141p36L276m579j1972p02k751K76P53
$$ -21783 -26597 -18950 93 -1435 -8051 -5344 797 61 3337 -1242 -13214 -13916 -16667 -16391 -15638
2702a5638J0201j217n901J227M134r571P351J856P445L033m682L085j2801o030
$$ -15638 -5437 -6654 -12555 -11328 -7194 -16765 -9414 -7558 -113 2920 -1762 1323 -11478 -17508
2688a7508o09p078J6970J3508j4229j2173M415J5017J4936m460j6875o380J374
$$ -17508 -18117 -25195 -8225 5283 -8946 -21119 -16704 -1687 13249 8789 -8086 -14466 -13092
2675a3092l474K699M213N681p574j1639o57R400J6302M489j2680n74R09o5n156
$$ -13092 -16566 -13867 -9654 -3973 -11547 -23186 -23843 -14443 1859 6348 -6332 -6906 -5997 -6062 -11218
2660a1218m12K2838N258j1524p661j236O398l337j153L276q5j1298N525M652p799
$$ -11218 -11630 11208 16466 4942 -2719 -3955 2443 -894 -2047 1229 1144 -10154 -4629 23 -7776
2645g776N746O943j830K474N414j707j7919p987j2950j98J5885Q173p04p920P089
$$ -7776 -2030 4913 3083 5557 10971 9264 -8655 -16642 -29592 -29790 -13905 -5732 -6436 -14356 -7267
2630g267J1462k814p202q366Q422r358l56Q243J3258K304P8j2353j6499l463J1831
$$ -7267 4195 1381 -5821 -14187 -5765 -15123 -15479 -7236 6022 8326 8404 -3949 -20448 -23911 -12080
2615a2080j40m816m665N240J3750J0081P662m438j3903p100R522R423k134P96
$$ -12080 -12220 -17036 -21701 -16461 -2711 7370 15032 10594 -3309 -10409 -887 8536 6402 7198
2601G198P19k163L952J2609J58r485j3042l512O119M66P207j259m984R924O914
$$ 7198 7917 5754 9706 22315 22473 12988 -54 -3566 2553 3019 10226 8967 3983 13907 20821
2586B0821o292j0744k545j597m571p348M006p512j80L065J848k324P46K699k399
$$ 20821 14529 3785 1240 -357 -4928 -12276 -8270 -15782 -15962 -12897 -11049 -13373 -12627 -9928 -12327
2571a2327l468K098J1670J5799K975j6310r056j496o480j0535R56J0925O563j0849
$$ -12327 -15795 -13697 -2027 13772 16747 437 -8619 -10115 -16595 -27130 -26174 -15249 -8686 -19535
2557a9535M734J316o974K0960J2712J291r20M909q374n908m394J2661J2368N326
$$ -19535 -14801 -13485 -20459 501 13213 14504 13584 18493 10119 4211 -183 12478 24846 30172
2543C0172j111r606j0016j0618m428K2369P607j5936j2217j7421j493O281J831
$$ 30172 29061 19455 9439 -1179 -5607 16762 24369 8433 -3784 -21205 -22698 -16417 -14586
2530a4586j6330Q238P125k833p179J866N930J7540J0825q083k779m570k023j722
$$ -14586 -30916 -22678 -15553 -18386 -25565 -23699 -17769 -229 10596 2513 -266 -4836 -6859 -8581
2516h581M513L315N783j290n925j3179Q237J8537P372k630j5554j0487m18k603
$$ -8581 -4068 -753 5030 3740 -2185 -15364 -7127 11410 18782 16152 598 -9889 -10307 -12910
2502a2910O936n212R711Q66J574P946O431r803J377M58J0320N153J09j511n655
$$ -12910 -5974 -11186 -1475 -609 965 8911 15342 5539 6916 7374 17694 22847 22956 21445 15790
2487A5790j2941p201n328Q256L776R045N318j1840K196L886K93o359J927r432
$$ 15790 2849 -4352 -9680 -1424 2352 11397 16715 4875 7071 10957 11250 4891 6818 -2614
2473b614p533J0889N688J2963j4837o509R165J550j0881m16K679N373l310r538
$$ -2614 -10147 742 6430 19393 4556 -1953 7212 8762 -2119 -2535 144 5517 2207 -7331
2459g331M290J8520M488j6001Q28o853n539P600J1921k940p716q38J1633m325
$$ -7331 -3041 15479 19967 3966 4794 -2059 -7598 2 11923 8983 1267 429 12062 7737
2445G737l855J2258o251j6338j8248N900J1992J5118l702k357K369O736J631j737
$$ 7737 3882 16140 9889 -6449 -24697 -18797 -6805 8313 4611 2254 4623 11359 12990 11253
2431A1253j1349l608L869j7502j2307K940Q740K711P291k948m3j1884n055J4552
$$ 11253 -96 -3704 165 -17337 -29644 -26704 -17964 -15253 -7962 -10910 -10953 -22837 -27892 -13340
2417a3340J3017k559k045o46m545l765k197k591K301M67J1100M918m133j972l413
$$ -13340 -323 -2882 -4927 -5573 -10118 -13883 -16080 -18671 -16370 -15903 -4803 115 -4018 -5990 -9403
2402i403j322N945O995P847L382M915l621m53m921j1189o897o185J858L194J6303
$$ -9403 -10725 -4780 2215 10062 13444 18359 14738 14285 9364 -1825 -8722 -14907 -13049 -9855 6448
2387F448K296m994J440O719n61J663N657n406n599K977j3769j0601o761K603R071
$$ 6448 8744 3750 5190 11909 11348 13011 18668 13262 7663 10640 -3129 -13730 -20491 -17888 -8817
2372h817l101M974R006l214J0413O747j005j6333m878M871J517l24j9679j2944
$$ -8817 -11918 -6944 2062 -1152 9261 16008 15003 -1330 -6208 -1337 180 -144 -19823 -32767
2358c2767J6094K2846L046r9o728j9290j814K0784j0507j6097M375N778K5470
$$ -32767 -16673 6173 9219 9120 2392 -16898 -18712 2072 -8435 -24532 -20157 -14379 11091
2345A1091J5189n366k0414N329R497r928l270N346o810M432K643R745p986p436
$$ 11091 26280 20914 500 5829 15326 5398 2128 7474 664 5096 7739 17484 9498 2062
2331B062J558M003m710R015N223k783m680m993O127k641Q440j4138j4508k218
$$ 2062 3620 7623 2913 11928 17151 14368 9688 4695 10822 8181 16621 2483 -12025 -14243
2317a4243M194m884k543J538q57j772j35M611P445J533q21r967j8190l92R982
$$ -14243 -10049 -14933 -17476 -15938 -16795 -18567 -18702 -14091 -6646 -5113 -5934 -15901 -34091 -34483 -24501
2302b4501j72J9413J2770n400k900J2112l391q781m282j138k880q460n643P966
$$ -24501 -24673 -5260 7510 2110 -790 11322 7931 -850 -5132 -6270 -9150 -17610 -23253 -15287
2288a5287O129J6572j585n600l207K57r57p239j581K2250J6596r514l732r944
$$ -15287 -9158 7414 5829 229 -2978 -2721 -3678 -10917 -12498 9752 26348 16834 13102 3158
2274C158k3074j3509J4865J2777Q050J4990k823K238P417k930m548j5234N834
$$ 3158 -19916 -33425 -18560 -5783 2267 17257 14434 16672 24089 21159 16611 1377 7211
2261G211J0437q691j7789o735r452R23O63J1722Q065P71j841N199q070j4057J664
$$ 7211 17648 8957 -8832 -15567 -25019 -24096 -23433 -11711 -3646 -2875 -4716 483 -7587 -21644 -19980
2246a9980M906J5937P657q909l504p57O205p30j3419j4338J0246O094o724R943
$$ -19980 -15074 863 8520 -389 -3893 -4650 1555 825 -12594 -26932 -16686 -10592 -17316 -7373
2232g373J0201M237J505nk235K269j580j5264L878O089Q291j0149O439n642j613
$$ -7373 2828 7065 8570 8565 6330 8599 7019 -8245 -4367 1722 10013 -136 6303 661 -952
2217i52K011M602Q71K0592o841p322R666q932j2079j4601k941J0991N398l78o484
$$ -952 1059 5661 6532 27124 20283 12961 22627 13695 1616 -12985 -15926 -4935 463 85 -6399
2202f399n036K392J7451j01j0284k633P147l04M087k589K454l874K215O62o471
$$ -6399 -11435 -9043 8408 8307 -1977 -4610 2537 2233 6320 3731 6185 2311 4526 5188 -1283
2187a283Q98p470L299Q294j0739o543n872J609P043o104j664K314R940J4204J3586
$$ -1283 -385 -7855 -4556 3738 -7001 -13544 -19416 -17807 -10764 -16868 -18532 -16218 -6278 7926 21512
2172B1512n655j8395j3546J1499N961k714j963j4295j5117P594O279J9157P455
$$ 21512 15857 -2538 -16084 -4585 1376 -1338 -3301 -17596 -32713 -25119 -18840 317 7772
2159G772j410O098R218M218o294n406j0350j2510j3794P968Q508O687J0736R896
$$ 7772 6362 12460 21678 25896 19602 14196 3846 -8664 -22458 -14490 -5982 705 11441 21337
2145B1337p405j0899p754k781R936o943r7N4o732j188N160M923P391m133j0583
$$ 21337 13932 3033 -4721 -7502 2434 -4509 -4606 -4552 -11284 -12472 -7312 -2389 5002 869 -9714
2130i714j603k203K677N67p639O249J2414P39L473J447L502P971P84j0661j573
$$ -9714 -11317 -13520 -10843 -10276 -17915 -11666 748 1487 4960 6407 9909 17880 18664 8003 6430
2115F430m220J647K996L397j083j658j258K252M045r441J177O561J0163K314q910
$$ 6430 2210 3857 6853 10250 9167 7509 6251 8503 12548 3107 4284 10845 21008 23322 14412
2100A4412l713k735j7096l0J0081N800n663n976o369k145J834k82N516J0846N424
$$ 14412 10699 7964 -9132 -9162 919 6719 1056 -4920 -11289 -13434 -11600 -11882 -6366 4480 9904
2085I904N635J086j1488Q291L671j0206k4976r796M889l182N50J5174M349j0475
$$ 9904 15539 16625 5137 13428 17099 6893 -18083 -27879 -22990 -26172 -25622 -10448 -6099 -16574
2071a6574j1422N644P816J3123K575M991l520j2789N286J5731O088k1599K30N138
$$ -16574 -27996 -22352 -14536 -1413 1162 6153 2633 -10156 -4870 10861 16949 -4650 -4420 718
2057G18l612m272J5132J0206k155j2002k0315l099N614l315j2304k256O419R418
$$ 718 -2894 -7166 7966 18172 16017 4015 -16300 -19399 -13785 -17100 -29404 -31660 -25241 -15823
2043a5823O837k782r16M705P770j303m317j0294R734P862L904p761l554L394Q691
$$ -15823 -8986 -11768 -12684 -7979 -209 -1512 -5829 -16123 -6389 1473 5377 -2384 -5938 -2544 6147
2028F147L752J506m079m313p218K003P241o643j1267O86K035J0520J4916r398
$$ 6147 9899 11405 7326 3013 -4205 -2202 5039 -1604 -12871 -12185 -10150 370 15286 5888
2014E888J663L190L980j0769j4646J2443P626m955k026r9N712k164Q5J2353j0542
$$ 5888 7551 10741 14721 3952 -10694 1749 9375 4420 2394 2295 8007 5843 5928 18281 7739
1999G739k4454O185K2617L057r759l692j4899n103K436J7093M180J47J685J070
$$ 7739 -16715 -10530 12087 15144 5385 1693 -13206 -18309 -15873 1220 5400 5547 7232 8302
1985H302P236J654J022P209J209o342M927O435j2945j4608L253K093r853l918
$$ 8302 15538 17192 18214 25423 26632 20290 25217 31652 18707 4099 7352 9445 -408 -4326
1971d326k645P198R255q185M67J3404P718O41m27l829l055J379k0299K221j268
$$ -4326 -6971 227 9482 1297 1764 15168 22886 23527 23100 19271 16216 17595 -2704 -483 -1751
1956a751q49n115J1932M809O785p502N556l085j1001q888l061J0786J4962k096
$$ -1751 -2600 -7715 4217 9026 15811 8309 13865 10780 -221 -9109 -12170 -1384 13578 11482
1942A1482j5216j2384o776P886n969L564O614J1539J871L210p178p298n639k743
$$ 11482 -3734 -16118 -22894 -15008 -20977 -17413 -10799 740 2611 5821 -1357 -8655 -14294 -17037
1928a7037P951J3100K0122j8277j4878N233o901L671Q496J2994J830k88n298j469
$$ -17037 -9086 4014 24136 5859 -9019 -3786 -10687 -7016 1480 14474 16304 16016 10718 9249
1914I249K927k1890r105P319L195j762J6967J698j517l001O924m912n880m170
$$ 9249 12176 -9714 -18819 -11500 -8305 -10067 6900 8598 7081 4080 11004 6092 212 -3958
1900c958l437m069P786p27l107J3100K495J723Q375k154o836M413L807J759l285
$$ -3958 -7395 -11464 -3678 -4405 -7512 5588 8083 9806 18181 16027 9191 13604 17411 19170 15885
1885A5885R310K06o812n170n45N472Q92j2121j1592m849N213j911J598P840j0492
$$ 15885 25195 25401 18589 13419 12874 18346 19238 7117 -4475 -9324 -4111 -6022 -4424 3416 -7076
1870g076r068q814R792N996k1L608l425M230K7382K927r251m462L544K330K619
$$ -7076 -16144 -24958 -15166 -9170 -9191 -5583 -9008 -4778 22604 25531 16280 11818 15362 17692 20311
1855B0311n402K502m66R193L518J375j4852q644j1847m149k07n121R219M559P225
$$ 20311 14909 17411 16945 26138 29656 31031 16179 7535 -4312 -8461 -8668 -13789 -4570 -11 7214
1840G214O470r502j9511p119J5149Q663N982J0601p711j988o248L267O066r626
$$ 7214 13684 4182 -15329 -22448 -7299 1364 7346 17947 10236 8248 2000 5267 11333 1707
1826A707Q185N081l001j0658k363P675p285R004J6573R149J010j0586j0808r70
$$ 1707 9892 14973 11972 1314 -1049 6626 -659 8345 24918 34067 35077 24491 13683 12713
1812A2713j8083j4505J1154n198k760O393M16J1997O7l060L320o619o330M198
$$ 12713 -5370 -19875 -8721 -13919 -16679 -10286 -9870 2127 2194 -866 2454 -4165 -10495 -6297
1798f297N584l081p274j1185L923J3712l874j970L298L879J0577n93j6099j0140
$$ -6297 -713 -3794 -11068 -22253 -18330 -4618 -8492 -10462 -7164 -3285 7292 6699 -9400 -19540
1784a9540J1116J1110Q781q293p254K221N252R179R028o625j7095J460O547N911
$$ -19540 -8424 2686 11467 3174 -4080 -1859 3393 12572 21600 14975 -2120 -660 5887 11798
1770A1798K004K632r60m80M176O467q392m740o513J476J5165r259j0247n69J347
$$ 11798 13802 16434 15474 14994 19170 25637 17245 12505 5992 7468 22633 13374 3127 2558 3905
1755C905l897J1583Q364o541m460P503o644o478J5244M877N400M150l527q312
$$ 3905 8 11591 19955 13414 8954 16457 9813 3335 18579 23456 28856 33006 29479 21167
1741B1167L680o52j79J870p433K420K279k01k572j191M414l724J715j697j0826
$$ 21167 24847 24195 24016 25886 18453 20873 23152 22951 20379 19188 23602 19878 21593 19896 9070
1726I070j9569K385J5281N985J8227r324k4839n129j880o944o278J7224N764O583
$$ 9070 -10499 -8114 7167 13152 31379 22055 -2784 -7913 -9793 -16737 -23015 -5791 -27 6556
1712F556K076q44M344j1097k2078j1608O701J3077Q637m476k844J1780M904j0808
$$ 6556 8632 7788 12132 1035 -21043 -32651 -25950 -12873 -4236 -8712 -11556 224 5128 -5680
1698e680R976j0262L534K150k092k1225o162j309J4128M811Q130m682j3003l607
$$ -5680 4296 -5966 -2432 -282 -2374 -23599 -29761 -31070 -16942 -12131 -4001 -8683 -21686 -25293
1684b5293k893o099J2796J5394R721j209p562j8404J6136O415o312o816J1113
$$ -25293 -28186 -34285 -21489 -6095 3626 2417 -5145 -23549 -7413 -998 -7310 -14126 -3013
1671c013J8740K666j8713K147J2276j2283j0017L628K298P121N302n035k1997
$$ -3013 15727 18393 -320 1827 14103 1820 -8197 -4569 -2271 4850 10152 5117 -16880
1658a6880Q131J1306N303N798Q796j1838j2654M709r432j2811n221Q031p1o00
$$ -16880 -8749 2557 7860 13658 22454 10616 -2038 2671 -6761 -19572 -24793 -16762 -16833 -17433
1644a7433O672n153j752K0739k195j2128K863j0000m727J7239K759m291j841k882
$$ -17433 -10761 -15914 -17666 3073 878 -11250 -8387 -18387 -23114 -5875 -3116 -7407 -9248 -12130
1630a2130L015N274j0148J3159J071j4583m200O426Q676J4402q195J446o588j316
$$ -12130 -9115 -3841 -13989 -830 241 -14342 -18542 -12116 -3440 10962 2767 4213 -2375 -3691
1616c691j276P231l962k013P496j567k685L668j230K827l599p956o881L482J18
$$ -3691 -4967 2264 -1698 -3711 3785 2218 -467 3201 1971 4798 1199 -6757 -13638 -10156 -10038
1601a0038j1097K790O863P373J7546J040n327M159j5793q482J4416Q578j4273
$$ -10038 -21135 -18345 -11482 -4109 13437 14477 9150 13309 -2484 -10966 3450 12028 -2245
1588b245J530j136p585l190J0748O581J6478l027K193k778J892Q632M859m520
$$ -2245 -715 -1851 -9436 -12626 -1878 4703 21181 18154 20347 17569 19461 28093 32952 28432
1574B8432j3446j301J621r771o957M387L197o034M07M535j1959r67m839O186M844
$$ 28432 14986 13685 15306 5535 -1422 2965 6162 128 535 5070 -6889 -7856 -12695 -6509 -1665
1559a665J2199k419P498J0950k05j7828l024J248r22J1745Q679N681o894j3794
$$ -1665 10534 8115 15613 26563 26358 8530 5506 6754 5832 17577 26256 31937 25043 11249
1545A1249o225M957L672m60j5688o294K046P71J424J9374M321q002r829j96k208
$$ 11249 5024 9981 13653 13193 -2495 -8789 -6743 -5972 -4548 14826 19147 11145 1316 1120 -1088
1530a088K1384n542j1515m923J838o564O085q71O624N991l233r906j2616Q326
$$ -1088 20296 14754 3239 -1684 154 -6410 -325 -1196 5428 11419 8186 -1720 -14336 -6010
1516f010J2295k360l311N282j365m792J18l73%K747k912K089q280m282k584L324
$$ -6010 6285 3925 614 5896 4531 -261 -143 -516 -516 2231 -681 1408 -6872 -11154 -13738 -10414
1500a0414J2089o765o699O647M002L235J6053j2944n247R46Q176j739j6004n133
$$ -10414 1675 -5090 -11789 -5142 -1140 2095 18148 5204 -43 903 9079 7340 -8664 -13797
$$ [...]
##END NTUPLES=NMR SPECTRUM
##END=
