##TITLE=Analysis number 317699
Compound Code cc 38404
Book Reference 438/94
Project Code adrs
Chemist Name antons
##JCAMPDX= 6.0         $$ Bruker NMR JCAMP-DX V2.0
##DATA TYPE= NMR SPECTRUM
##DATA CLASS= NTUPLES
##ORIGIN= Bruker BioSpin GmbH
##OWNER= nmr
$$ XWIN-NMR		Version 3.5
$$ Wed Mar  1 09:07:39 2006 GMT Standard Time (UT+0h)  MAYBRIDGE\nmr@NMR_250MHZ
##.OBSERVE FREQUENCY= 250.131544655141
##.OBSERVE NUCLEUS= ^1H
##.ACQUISITION MODE= SIMULTANEOUS (DQD)
##.ACQUISITION SCHEME= undefined
##.AVERAGES= 16
##.DIGITISER RES= 18
##SPECTROMETER/DATA SYSTEM= dpx250
##.PULSE SEQUENCE= zg30
##.SOLVENT NAME= CDCl3
##.SHIFT REFERENCE= (INTERNAL, CDCl3, 0, 16.4627)
##AUDIT TRAIL= $$ (NUMBER, WHEN, WHO, WHERE, WHAT)
$$ ##TITLE= Audit trail, XWIN-NMR		Version 3.5
$$ ##JCAMPDX= 5.01
$$ ##ORIGIN= Bruker BioSpin GmbH
$$ ##OWNER= nmr
$$ C:\u/data/dgb/nmr/ADRS/17150/pdata/1/auditp.txt
$$ ##AUDIT TRAIL=  $$ (NUMBER, WHEN, WHO, WHERE, WHAT)
(   1,<2006-03-01 09:07:11.14 +000>,<MAYBRIDGE\nmr>,<NMR_250MHZ>,
      <created by zg, POWCHK disabled, PULCHK disabled
       configuration hash MD5:
       84 BC 41 DB A1 6E 1D 46 DA 25 12 A5 C1 ED C5 3A
       data hash MD5: 64K
       BF 51 5A 1F 49 AE D4 0D C6 0C 99 D0 2D 42 EA 04>)
(   2,<2006-03-01 09:07:25.51 +000>,<MAYBRIDGE\nmr>,<NMR_250MHZ>,
      <Start of raw data processing
       ef LB = 0.3 FT_mod = 6 PKNL = 1 SI = 32K 
       data hash MD5: 32K
       49 96 E2 E3 AF 10 57 D7 5D 2D 91 94 C4 BE BB 44>)
(   3,<2006-03-01 09:07:27.53 +000>,<MAYBRIDGE\nmr>,<NMR_250MHZ>,
      <apk 
       data hash MD5: 32K
       A5 F7 EF D1 E3 F3 5E 82 D4 7B B0 41 E4 39 9B 91>)
(   4,<2006-03-01 09:07:28.36 +000>,<MAYBRIDGE\nmr>,<NMR_250MHZ>,
      <abs ABSG = 5 
       data hash MD5: 32K
       9C 0B 2B C9 5C 12 C6 DE DD 80 DA 1B D8 5E 40 4B>)
$$ ##END=
$$ 
$$ hash MD5
$$ 8F 58 01 02 0B 05 36 61 C9 69 43 66 79 EC 09 0A
##$RELAX= 
##$RELAX= 
##$RELAX= 
##$RELAX= 
##$RELAX= 
##$RELAX= 
##$RELAX= 
$$ Bruker specific parameters
$$ --------------------------
##$DU= <C:\u>
##$EXPNO= 17150
##$NAME= <ADRS>
##$PROCNO= 1
##$TYPE= <nmr>
##$USER= <dgb>
##$AMP= (0..31)
100 100 100 100 100 100 100 100 100 100 100 100 100 100 100 100 100 100 
100 100 100 100 100 100 100 100 100 100 100 100 100 100 
##$AQSEQ= 0
##$AQ_mod= 3
##$AUNM= <au_zg>
##$AUTOPOS= <5 >
##$BF1= 250.13
##$BF2= 250.13
##$BF3= 250.13
##$BF4= 250.13
##$BF5= 500.13
##$BF6= 500.13
##$BF7= 500.13
##$BF8= 500.13
##$BYTORDA= 1
##$CFDGTYP= 0
##$CFRGTYP= 5
##$CHEMSTR= <none>
##$CNST= (0..31)
1 1 145 1 1 1 1 1 1 1 1 1 1 1 1 1 1 1 1 1 1 1 1 1 1 1 1 1 1 1 1 1 
##$CPDPRG= <>
##$CPDPRG1= <>
##$CPDPRG2= <>
##$CPDPRG3= <>
##$CPDPRG4= <mlev>
##$CPDPRG5= <mlev>
##$CPDPRG6= <mlev>
##$CPDPRG7= <mlev>
##$CPDPRG8= <mlev>
##$CPDPRGB= <>
##$CPDPRGT= <>
##$D= (0..31)
0 1 0 0 0 0 0 0 0 0.06 0 0 0 0 0 0 0.0002 0 0 0 0 0 0 0 0 0 0 0 0 0 0 
0 
##$DATE= 1141204028
##$DBL= (0..7)
120 120 120 120 120 120 120 120 
##$DBP= (0..7)
150 150 150 150 150 150 150 150 
##$DBP07= 0
##$DBPNAM0= <>
##$DBPNAM1= <>
$$ [...]
##$SUBNAM7= <"">
##$SUBNAM8= <"">
##$SUBNAM9= <"">
##$SW= 20.6930455092707
##$SWIBOX= (0..15)
0 0 3 0 0 0 0 0 0 0 0 0 0 0 0 0 
##$SW_h= 5175.983436853
##$TD= 65536
##$TD0= 1
##$TE= 293.16
##$TE2= 300
##$TE3= 300
##$TEG= 300
##$TL= (0..7)
0 120 120 120 120 120 120 120 
##$TP= (0..7)
150 150 150 150 150 150 150 150 
##$TP07= 0
##$TPNAME0= <>
##$TPNAME1= <>
##$TPNAME2= <>
##$TPNAME3= <>
##$TPNAME4= <>
##$TPNAME5= <>
##$TPNAME6= <>
##$TPNAME7= <>
##$TPOAL= (0..7)
0.5 0.5 0.5 0.5 0.5 0.5 0.5 0.5 
##$TPOFFS= (0..7)
0 0 0 0 0 0 0 0 
##$TUNHIN= 0
##$TUNHOUT= 0
##$TUNXOUT= 0
##$USERA1= <user>
##$USERA2= <user>
##$USERA3= <user>
##$USERA4= <user>
##$USERA5= <user>
##$V9= 5
##$VALIST= <valist>
##$VCLIST= <CCCCCCCCCCCCCCC>
##$VD= 0
##$VDLIST= <DDDDDDDDDDDDDDD>
##$VPLIST= <PPPPPPPPPPPPPPP>
##$VTLIST= <TTTTTTTTTTTTTTT>
##$WBST= 1024
##$WBSW= 4
##$XGAIN= (0..3)
0 0 0 0 
##$XL= 0
##$YL= 0
##$YMAX_a= 465175
##$YMIN_a= -455305
##$ZGOPTNS= <>
##$ZL1= 120
##$ZL2= 120
##$ZL3= 120
##$ZL4= 120
##$ABSF1= 16.46272
##$ABSF2= -4.230452
##$ABSG= 5
##$ABSL= 3
##$ALPHA= 0
##$AQORDER= 0
##$ASSFAC= 0
##$ASSFACI= 0
##$ASSFACX= 0
##$ASSWID= 0
##$AUNMP= <proc_1d>
##$AZFE= 0.1
##$AZFW= 0.1
##$BCFW= 0
##$BC_mod= 0
##$BYTORDP= 0
##$COROFFS= 0
##$CY= 12.5
##$DATMOD= 1
##$DC= 0
##$DFILT= <>
##$DTYPP= 0
##$F1P= 14.0000005364418
##$F2P= -0.99999901652339
##$FCOR= 0.5
##$FTSIZE= 32768
##$FT_mod= 6
##$GAMMA= 0
##$GB= 0
##$INTBC= 1
##$INTSCL= 1
##$ISEN= 128
##$LB= 0.3
##$LEV0= 0
##$LPBIN= 0
##$MAXI= 10000
##$MC2= 0
##$MEAN= 0
##$ME_mod= 0
##$MI= 0
##$NCOEF= 0
##$NC_proc= -4
##$NLEV= 6
##$NOISF1= 0
##$NOISF2= 0
##$NSP= 0
##$NTH_PI= 0
##$NZP= 0
##$OFFSET= 16.46272
##$PC= 1
##$PHC0= 247.052
##$PHC1= 6.928236
##$PH_mod= 1
##$PKNL= yes
##$PPARMOD= 0
##$PSCAL= 4
##$PSIGN= 0
##$REVERSE= no
##$SF= 250.130014826542
##$SI= 32768
##$SIGF1= 0
##$SIGF2= 0
##$SINO= 400
##$SIOLD= 32768
##$SREGLST= <1H.CDCl3>
##$SSB= 0
##$STSI= 32768
##$STSR= 0
##$SW_p= 5175.98343685301
##$SYMM= 0
##$S_DEV= 0
##$TDeff= 65536
##$TDoff= 0
##$TI= <Analysis number 999999
Compound Code 99
Book Reference 9
Project Code 9>
##$TILT= no
##$TM1= 0
##$TM2= 0
##$TOPLEV= 0
##$USERP1= <user>
##$USERP2= <user>
##$USERP3= <user>
##$USERP4= <user>
##$USERP5= <user>
##$WDW= 1
##$XDIM= 32768
##$YMAX_p= 544297312
##$YMIN_p= -468653
$$ End of Bruker specific parameters
$$ ---------------------------------
##NTUPLES= NMR SPECTRUM
##VAR_NAME=  FREQUENCY,     SPECTRUM/REAL,   SPECTRUM/IMAG
##SYMBOL=    X,             R,               I
##VAR_TYPE=  INDEPENDENT,   DEPENDENT,       DEPENDENT
##VAR_FORM=  AFFN,          ASDF,            ASDF
##VAR_DIM=   32768,         32768,           32768
##UNITS=     HZ,            ARBITRARY UNITS, ARBITRARY UNITS
##FACTOR=    0.157963299565203, 1,           1
##FIRST=     4117.82061554137, 0,            0
##LAST=      -1058.16282131164, 0,           0
##MIN=       -1058.16282131164, -468653,     0
##MAX=       4117.82061554137, 544297312,    0
$$ Real data points
##PAGE= N=1
##DATA TABLE= (X++(R..R)), XYDATA
$$ [...]
$$ plain form
26008 -46634 -109947 -51973 -58183 -17164 61938 63050 -2570 34108 16697 -6436 23760 788
25996 788 24504 -28976 -86997 -93425 -83122 -83005 -79381 -87433 -52027 -1875 -26451 -101507 -123653
25983 -123653 -141516 -98077 -90793 -115537 -72622 -46730 -71219 -55204 -7237 -30635 -69405 -23514
25971 -23514 2217 10656 -4093 -64617 -53434 -33489 -76883 -146803 -44998 -39690 -85594 -92225
25959 -92225 -23964 12414 1126 14744 -10073 22887 47046 -46691 -85385 -7899 -2376 50162
25947 50162 56324 31878 -13127 36455 70893 15665 -44523 -42210 31552 97411 161822 103116
25935 103116 5076 -36030 -75096 -51172 -32811 36437 55064 25852 35612 42501 8680 7363
25923 7363 1457 -6248 -19571 -34407 13971 65256 51139 30318 -65902 -51501 14546 42428
$$ packed form
26008d6634o3313N7974o210M1019P9102J112o5620L6678j7411k3133L0196k2972
25996G88K3716n3480n8021o428J0303J17L624q052L5406N0152k4576p5056k2146
25983a23653j7863M3439P284k4744M2915K5892k4489J6015M7967k3398l8770M5891
25971b3514K5731Q439j4749o0524J1183J9945m3394o9920J01805N308m5904o631
25959i2225O8261L6378j1288J3618k4817L2960K4159r3737l8694P7486N523N2538
25947E0162O162k4446m5005M9582L4438n5228o0188K313P3762O5859O4411n8706
25935A03116r8040m1106l9066K3924J8361O9248J8627k9212R760O889l3821j317
25923G363n906p705j3323j4836M8378N1285j4117k0821r6220J4401O6047K7882
$$ plain form
25911 42428 -15920 -118414 -129509 -91693 -75683 -32000 -83502 -83518 -104778 -121543 -86858 -23496
25899 -23496 -24269 -58319 -68811 -111605 -143674 -96533 -79077 -146315 -171150 -156194 -100718 -30537
25887 -30537 19533 -10174 -57022 -30274 -6930 2907 -46970 -10609 20097 27171 24027 -52142
25875 -52142 -106415 -108294 -25036 16969 -18114 -16510 41032 99050 80332 87065 63043 17258
25863 17258 22022 42101 51619 52354 2755 -46798 -40529 10462 -14258 -19129 -21226 3483 48678
25850 48678 1747 715 39254 -36797 -48504 3934 41507 -5973 -50033 -78820 -60194 -55848
25838 -55848 -12874 1803 -59848 -91528 -164686 -128220 -57389 -70687 -50483 -111734 -128523 -51394
25826 -51394 51322 74798 16194 -34836 -51266 -44457 -26468 -33850 -36389 -52863 -2452 17346
$$ packed form
25911D2428n8348j02494j1095L7816J6010M3683n1502j6k1260j6765L4685O3362
25899b3496p73l4050j0492m2794l2069M7141J7456o7238k4835J4956N5476P0181
25887c0537N0070k9707m6848K6748K3344R837m9877L6361L0706P074l144p6169
25875e2142n4273j879Q3258M2005l5083J604N7542N8018j8718O733k4022m5785
25863A7258M764K0079R518P35m9599m9553O269N0991k4720m871k097K4709M5195
25850D8678m6931j032L8539p6051j1707N2438L7573m7480m4060k8787J8626M346
25838e5848M2974J4677o1651l1680p3158L6466P0831j3298K0204o1251j6789P7129
25826e1394J02716K3476n8604n1030j6430O809J7989p382k539j6474N0411J9798
$$ plain form
25814 17346 -62588 -113219 -88389 -57256 -57178 -49840 -93608 -113386 -143952 -116795 -74516 -53426
25802 -53426 -32151 -67443 -87775 -59854 4455 22833 34979 22713 2957 -50666 -82756 -54891
25790 -54891 10489 -55353 -89268 -85859 -34777 20553 66408 29130 86162 68909 44502 -26379
25778 -26379 -67164 -48925 -32795 28405 35936 71636 19496 70739 23294 -72232 -73722 -112437
25766 -112437 -119816 -121256 -106693 -80077 -61113 -60711 -48832 -14083 72048 108929 59283 48835
25754 48835 -7164 -26782 -23304 5367 4187 -43174 -18795 2829 23947 -16225 -27186 41132
25742 41132 156221 226368 155230 156485 139165 124938 131673 107692 46123 18243 -2930 74405
25730 74405 105765 66103 -56888 -65487 6782 -9669 -13412 35280 -11544 -99445 -110104 -70547
$$ packed form
25814A7346p9934n0631K4830L1133P8P338m3768j9778l0566K7157M2279K1090
25802e3426K1275l5292k0332K7921O4309J8378J2146j2266j9756n3623l2090K7865
25790e4891O5380o5842l3915L409N1082N5330M5855l7278N7032j7253k4407p0881
25778b6379m0785J8239J6130O1200P531L5700n2140N1243m7445r5526j490l8715
25766a12437p379j440J4563K6616J8964M02J1879L4749Q6131L6881m9646j0448
25754D8835n5999j9618L478K8671j180m7361K4379K1624K1118m0172j0961O8318
25742D1132J15089P0147p1138J255j7320j4227O735k3981o1569k7880k1173P7335
25730G4405L1360l9662j22991q599P2269j6451l743M8692m6824q7901j0659L9557
$$ plain form
25718 -70547 36620 61386 -5409 13017 735 -7172 49078 98054 41438 37000 53324 12137
25706 12137 -32485 29427 29770 34959 38529 20832 47165 91130 103030 89193 25645 18019 17494
25693 17494 -39847 29821 71555 113069 82315 17394 -69163 -103271 -125052 -29613 17101 25683
25681 25683 80159 128008 104064 105199 89407 25287 19615 113647 131921 111829 40823 63838
25669 63838 74773 71247 97348 36556 25421 70463 31087 -17263 58820 45301 68726 59153
25657 59153 -6880 11651 40876 45442 25447 -16855 -33789 -49768 -43404 -71834 -33911 -3770
25645 -3770 -62109 -84403 -35878 -27911 -86777 -107380 -108741 -111235 -61220 -24096 20780 13577 -30865
25632 -30865 -115197 -158127 -160139 -139214 -108727 -74824 -101956 -101903 -90225 -103714 -41989 -64951
$$ packed form
25718g0547J07167K4766o6795J8426j2282p907N6250M8976n6616m438J6324m1187
25706A2137m4622O1912L43N189L570j7697K6333M3965J1900j3837o3548p626n25
25693A7494n7341O9668M1734M1514l0754o4921q6557l4108k1781R5439M6714Q582
25681B5683N4476M7849k3944J135j5792o4120n672R4032J8274k0092p1006K3015
25669F3838J0935l526K6101o0792j1135M5042l9376m8350P6083j3519K3425r573
25657E9153o6033J8531K9225M566j9995m2302j6934j5979O364k8430L7923L0141
25645c770n8339k2294M8525P967n8866k0603j361k494N0015L7124M4876p203m4442
25632c0865q4332m2930k012K0925L0487L3903k7132N3J1678j3489O1725k2962
$$ plain form
25620 -64951 -103896 -76612 -82185 -31518 -24105 -20527 -31539 -18284 -38175 -35158 -10417 -2438 -9977
25607 -9977 14404 -17382 -66177 -86366 -79012 -62301 -18735 -27743 -28872 -94067 -131966 -71436
25595 -71436 -1242 2967 22020 40670 -27323 -61954 -92993 -50676 -40976 -43470 57414 94820
25583 94820 113083 53554 30463 93285 144564 108567 54335 -16906 -83617 -56817 21233 53859
25571 53859 46051 -17360 -41139 -51354 -38999 -3215 -2602 -70690 -48583 -61489 -2826 20665
25559 20665 -62342 -40743 -13807 -57827 -131823 -179680 -111650 -99881 -54749 -3902 3066 -39017
25547 -39017 -82945 -85076 -119458 -140224 -102019 -56366 6986 49841 18014 -29566 -38223 -93627
25535 -93627 -91264 -66102 -53161 -46119 -45345 -48018 -4225 27004 -11693 37349 91339 98843 40403
$$ packed form
25620f4951l8945K7284n573N0667P413L578j1012J3255j9891L017K4741P979p539
25607i977K4381l1786m8795k0189P354J6711M3566r008j129o5195l7899O0530
25595g1436P0194M209J9053J8650o7993l4631l1039M2317R700k494J00884L7406
25583I4820J8263n9529k3091O2822N1279l5997n4232p1241o6711K6800P8050L2626
25571E3859p808o3411k3779j0215J2355L5784O13o8088K2107j2906N8663K3491
25559B0665q3007K1599K6936m4020p3996m7857O8030J1769M5132N0847O968m2083
25547c9017m3928k131l4382k0766L8205M5653O3352M2855l1827m7580q657n5404
25535i3627K363K5162J2941P042P74k673M3793L1229l8697M9042N3990P504n8440
$$ plain form
25522 40403 -3358 -29784 -1847 -55109 -88828 -48540 -43503 -6357 53840 71258 11071 -8343
25510 -8343 5965 -9086 -39579 -49617 -54741 1297 42996 48534 32109 -54750 -109547 -44631
25498 -44631 -24490 -27229 3118 -32925 -118326 -165219 -164789 -58494 10495 3759 -2144 -13969
25486 -13969 51176 58536 3756 12139 15095 46277 46358 77905 134195 105592 61713 91728 71042
25473 71042 25268 -21647 -32622 -8426 13084 18184 51095 40813 -20407 -38917 -35999 -52188
25461 -52188 -66156 -65497 24713 54952 100047 158371 115272 73900 65367 81691 25434 11479
25449 11479 33742 -38120 -81195 -136372 -155822 -120068 -108438 -86574 -116544 -123856 -79436 -63518
25437 -63518 -14158 16621 31472 83864 81151 38316 -11103 -45137 -26866 -10442 11665 41812
$$ packed form
25522D0403m3761k6426K7937n3262l3719M0288N037L7146O0197J7418o0187j9414
25510h343J4308j5051l0493j0038n124N6038M1699N538j6425q6859n4797O4916
25498d4631K0141k739L0347l6043q5401m6893M30J06295O8989o736n903j1825
25486a3969O5145P360n4780Q383K956L1182Q1L1547N6290k8603m3879L0015k0686
25473G1042m5774m6915j0975K4196K1510N100L2911j0282o1220j8510K918j6189
25461e2188j3968O59R0210L0239M5095N8324m3099m1372q533J6324n6257j3955
25449A1479K2263p1862m3075n5177j9450L5754J1630K1864k9970p312M4420J5918
25437f3518M9360L0779J4851N2392k713m2835m9419l4034J8271J6424K2107L0147
$$ plain form
25425 41812 75251 104950 136872 125862 15991 -35663 2259 49580 36770 11092 4213 4554
25413 4554 -2161 8857 95243 77653 70063 60575 28176 390 -105507 -140948 -165506 -127918
25401 -127918 -117369 -69257 31727 -27744 -88931 -100968 -76970 -67956 -60130 -50169 -54985 -42657
25389 -42657 -25621 -20367 -62824 -136524 -176009 -151371 -75510 -9731 47701 89876 83635 109180
25377 109180 130462 120855 98571 59858 28034 19630 35653 18187 -26487 -67014 -23175 -14624
25365 -14624 22096 66427 18041 83148 167750 172347 94543 61568 -26613 -32446 961 -37058
25353 -37058 -58012 -53837 -26163 -38399 -68422 -95301 -47548 76417 91042 79358 57123 38514
25341 38514 2311 -257 28948 61242 77109 48222 38665 76634 103625 79302 37769 -4083
$$ packed form
25425D1812L3439K9699L1922j1010j09871n1654L7922M7321j2810k5678o879L41
25413D554o715J1018Q6386j7590p590r488l2399k7786j05897l5441k4558L7588
25401a27918J0549M8112J00984n9471o1187j2037K3998R014P826R961m816J2328
25389d2657J7036N254m2457p3700l9485K4638P5861O5779N7432M2175o241K5545
25377A09180K1282r607k2284l8713l1824q404J6023j7466m4674m0527M3839Q551
25365a4624L6720M4331m8386O5107Q4602M597p7804l2975q8181n833L3407l8019
25353c7058k0954M175K7674j2236l0023k6879M7753J23965J4625j1684k2235j8609
25341C8514l6203k568K9205L2294J5867k8887r557L7969K6991k4323m1533m1852
$$ plain form
25329 -4083 -44802 -64420 -103727 -120995 -102208 -3037 -18198 -23454 -22353 -914 22898 68276
25317 68276 103616 90171 98860 83483 47724 -18697 -88431 -56660 -23628 -26307 -66660 -91222
25305 -91222 -81091 -88752 -38654 12647 21257 31100 14568 -52746 -87303 -180318 -242966 -220619
25293 -220619 -147110 -89549 26148 58299 52595 64119 50853 65016 111477 89040 46067
25282 46067 28946 40794 57290 -8018 -41171 -44664 22730 75704 62724 15481 37236 64046
25270 64046 64579 38848 -26671 -24401 -29239 53541 -9258 -35006 44331 112982 91092 37651
25258 37651 79708 28245 -34406 -66017 -36393 -6894 -90319 -46890 -12301 2958 44183 50163
25246 50163 46296 27730 -33006 -24254 60932 136757 109547 64388 -41596 -85275 -41883 -22865
$$ packed form
25329d083m0719j9618l9307j7268J8787R9171j5161n256J101K1439K3812M5378
25317F8276L5340j3445Q689j5377l5759o6421o9734L1771L3032k679m0353k4562
25305i1222J0131p661N0098N1301Q610R843j6532o7314l4557r3015o2648K2347
25293b20619P3509N7561J15697L2151n704J1524j3266J4163M6461k2437m2973
25282D6067j7121J1848J6496o5308l3153l493O7394N2974j2980m7243K1755K6810
25270F4046N33k5731o5519K270m838Q2780o2799k5748P9337O8651k1890n3441
25258C7651M2057n1463o2651l1611K9624K9499q3425M3429L4589J5259M1225N980
25246E0163l867j8566o0736Q752Q5186P5825k7210m5159j05984m3679M3392J9018
$$ plain form
25234 -22865 -37449 -65728 -57547 18111 13715 -13144 6617 76806 20230 42956 48969 24186
25222 24186 -59480 -117568 -81835 -56380 -39316 -9279 24640 -22058 -36396 -10034 -74017 -35479
25210 -35479 86960 47408 3801 32792 33551 40337 59497 40027 23271 -6770 -27544 -79599
25198 -79599 -89908 -18222 -31531 -97890 -147281 -16445 -2786 -50053 -104298 -146615 -138480 -103980
25186 -103980 -36175 -14910 -19230 -18936 -7502 -81613 -51761 -69473 -88024 -61325 -29441 -95317
25174 -95317 -118100 -77871 4745 16645 69714 97773 48910 45656 -7961 -32566 -32501 -25488 -7490
25161 -7490 43894 107670 90783 93962 50745 -3050 -78449 -122338 -123728 -37416 94175 112406
25149 112406 41967 15610 23543 34105 27264 6555 -10595 8647 13624 14730 10099 2066 6812
$$ packed form
25234b2865j4584k8279Q181P5658m396k6859J9761P0189n6576K2726O013k4783
25222B4186q3666n8088L5733K5455J7064L0037L3919m6698j4338K6362o3983L8538
25210c5479J22439l9552m3607K8991P59O786J9160j9470j6756l0041k0774n2055
25198g9599j0309P1686j3309o6359m9391J30836J3659m7267n4245m2317Q135L4500
25186a03980O7805K1265m320K94J1434p4111K9852j7712j8551K6699L1884o5876
25174i5317k2783M0229Q2616J1900N3069K8059m8863l254n3617k4605O5P013J7998
25161g490N1384O3776j6887L179m3217n3795p5399m3889j390Q6312J31591J8231
25149A12406p0439k6357P933J0562o841k0709j7150J9242M977J106m631q033M746
$$ plain form
25136 6812 82014 87000 49911 103252 54150 40782 -44776 -85287 -101215 -42563 -1425 28252
25124 28252 26775 -11687 -20494 -8146 -13132 33734 21949 27525 -48251 -52986 -55696 -24104 -27638
25111 -27638 68949 30729 -13084 -8257 -17495 -68806 -78139 -57977 -14670 -12494 49357 82398
25099 82398 96800 69589 -33067 -72212 -16415 -29695 -9764 -15824 23546 122890 200908 217361
25087 217361 75962 31787 52459 31763 -2498 16898 52282 1751 -66392 -81958 -108391
25076 -108391 -103539 -47874 -50000 -32137 -104615 -32428 -21365 -35850 -79822 -51979 70209 87809
25064 87809 9378 -45661 -19994 46487 85731 19594 16002 51217 33571 19967 -4967 -49588
25052 -49588 -19039 21964 -72806 -91982 -37262 -120728 -171286 -127108 -98363 -74757 -49474 -2464
$$ packed form
25136F812P5202M986l7089N3341m9102j3368q5558m0511j5928N8652M1138K9677
25124B8252j477l8462q807J2348m986M6866j1785N576p5776m735k710L1592l534
25111b7638R6587l8220m3813M827r238n1311r333K0162M3307K176O1851L3041
25099H2398J4402k7211j02656l9145N5797j3280J9931o060L9370R9344P8018J6453
25087B17361j41399m4175K0672k0696l4261J9396L5384n0531o8143j5566k6433
25076a08391M852N5665k126J7863p2478P2187J1063j4485m3972K7843J22188J7600
25064H7809p8431n5039K5667O6481L9244o6137l592L5215j7646j3604k4934m4621
25052d9588L0549M1003r4770j9176N4720q3466n0558M4178K8745K3606K5283M7010
$$ plain form
25040 -2464 -19333 -138326 -176623 -159538 -110437 -116110 -77278 -31217 -5076 -8123 -76133 -11497
25028 -11497 59841 -31827 -73673 4191 73491 -24651 -20673 42381 22691 92182 142379 111693
25016 111693 44986 46503 -2587 -3408 4286 39553 69412 4267 17267 45843 2045 -31848
25004 -31848 32537 -30336 -60857 -87339 -134811 -72636 -26084 -9051 37558 106871 173149 140009
24992 140009 23467 -10634 -30068 -34192 -32080 -31698 5944 -25714 -55559 -68098 -70653 -72078
24980 -72078 -53105 40945 51066 54348 115466 167588 89824 64841 59424 23833 31288 45957
24968 45957 22985 672 41367 85889 60219 46180 32219 -6719 820 36909 142468 97928
24956 97928 -9849 -42021 -36854 -16268 23653 -42232 -35413 -25248 -94066 -168414 -130092 -149396
$$ packed form
25040b464j6869j18993l8297J7085M9101n673L8832M6061K6141l047o8010O4636
25028a1497P1338r1668m1846P7864O9300r8142L978O3054j9690O9491N0197l0686
25016A11693o6707J517m9090q21P694L5267K9859o5145J3000K8576m3798l3893
25004c1848O4385o2873l0521k6482m7472O2175M6552J7033M6609O9313O6278l3140
24992A40009j16542l4101j9434m124K112L82L7642l1658k9845j2539k555j425
24980g2078J8973R4050J0121L282O1118N2122p7764k4983n417l5591P455J4669
24968D5957k2972k2313M0695M4522k5670j4039j3961l8938P539L6089J05559m4540
24956I7928j07777l2172N167K0586L9921o5885O819J0165o8818p4348L8322j9304
$$ plain form
24944 -149396 -87954 -39414 -42584 -26586 31649 74425 88434 85913 108257 72236 -13937 -36268
24932 -36268 35602 -4204 4158 31442 40426 24369 57633 84533 29680 -11083 -22746 17248
24920 17248 99424 72358 -45658 -69376 -27540 -29168 -67505 -56630 -23704 24875 30398 25118
24908 25118 -42523 -24891 25666 -15105 -53205 10820 72582 32111 -15056 -21126 12130 25231
24896 25231 78097 83258 69633 4386 -33990 -94861 -89286 -121019 -145267 -53185 -14074 -27432
24884 -27432 29667 5877 2316 -44674 -94897 -108460 -81613 -54927 642 -2026 44760 36837
24872 36837 55230 29293 216 35180 -36173 -79761 -55975 66151 63248 33998 57902 92344
24860 92344 36123 26472 -16925 -121206 -172248 -187946 -108443 -24866 -32224 -38161 -101507 -124219
$$ packed form
24944a49396O1442M8540l170J5998N8235M2776J4009k521K2344l6021q6173k2331
24932c6268P1870l9806Q362K7284Q984j6057L3264K6900n4853m0763j1663L9994
24920A7248Q2176k7066j18016k3718M1836j628l8337J0875L2926M8579N523n280
24908B5118o7641J7632N0557m0771l8100O4025O1762m0471m7167o070L3256J3101
24896B5231N2866N161j3625o5247l8376o0871N575l1733k4248R2082L9111j3358
24884b7432N7099k3790l561m6990n0223j3563K6847K6686N5569k668M6786p923
24872C6837J8393k5937k9077L4964p1353m3588K3786J22126k903k9250K3904L4442
24860I2344n6221r651m3397j04281n1042j5698P9503Q3577p358n937o3346k2712
$$ plain form
24848 -124219 -96422 -135158 -113489 -75262 -48073 -26013 33325 74168 126702 174939 109636
24837 109636 37926 -43524 -53131 -106008 -105432 -94435 -93813 -59224 -52946 34907 97655 54431 23575
24824 23575 -41859 -81748 -41984 8052 13295 -39439 -4071 48876 59467 58432 43570 62165
24812 62165 60955 51028 71727 54062 15845 -43621 -50384 -40117 -56413 -50028 -52926 -47043 -29240
24799 -29240 -4659 2978 -5940 17280 17739 50294 54844 27958 23879 6118 -13249 -78886 -97065
24786 -97065 -134288 -98178 -109584 -99017 -114277 -51473 37 19088 28079 10698 34268 -3573
24774 -3573 30521 -16912 -51804 40452 63605 50752 37295 51439 22334 18727 13388 36205
24762 36205 -8491 -44673 5342 47172 7464 -45208 1435 76099 103574 46373 7185 39086
$$ packed form
24848a24219K7797l8736K1669L8227K7189K2060N9338M0843N2534M8237o5303
24837A09636p1710q1450r607n2877N76J0997O22L4589O278Q7853O2748m3224l0856
24824B3575o5434l9889L9764N0036N243n2734L5368N2947J0591j035j4862J8595
24812F2165j210r927K0699j7665l8217n9466o763J0267j6296O385k898N883J7803
24799b9240K4581P637q918K3220M59L2555M550k6886m079j7761j9367o5637j8179
24786i7065l7223L6110j1406J0567j5260O2804N1510J9051Q991j7381K3570l7841
24774c573L4094m7433l4892R2256K3153j2853j3457J4144k9105l607n339K2817
24762C6205m4696l6182N0015M1830l9708n2672M6643P4664K7475n7201l9188L1901
$$ plain form
24750 39086 61578 59788 11917 -129738 -152403 -128475 -141901 -160537 -131404 -144892 -152911 -160728
24738 -160728 -140643 -72384 -41980 -71517 -98374 -79884 -17027 -38124 -52687 -17840 -40210
24727 -40210 5753 32745 -12289 -53073 -44998 -29223 -10508 4837 40836 -11472 -55022 -45898
24715 -45898 -1901 10172 1148 6624 -37285 -70410 -65116 -71198 -83510 -70391 5663 53587
24703 53587 30422 -49328 -102529 -38341 71346 40247 -4484 -53891 -44942 6087 65758 77838
24691 77838 19435 38395 24205 2830 -21132 -19190 4985 89640 135097 73868 -14284 -47713
24679 -47713 22968 57113 68727 -1294 -48496 2373 31832 -20387 -31853 20048 39318 -1130
24667 -1130 -3692 26552 47191 73678 127808 138522 111856 116396 43917 8222 -21534 -91536
$$ packed form
24750C9086K2492j790m7871j41655k2665K3928j3426j8636K9133j3488q019p817
24738a60728K0085O8259L0404k9537k6857J8490O2857k1097j4563L4847k2370
24727d0210M5963K6992m5034m0784Q075J5775J8715J5345L5999n2308m3550R124
24715d5898M3997J2073r024N476m3909l3125N294o082j2312J3119P6054M7924
24703E3587k3165p9750n3201O4188J09687l1099m4731m9407Q949N1029N9671J2080
24691G7838n8403J8960j4190k1375k3962J942K4175Q4655M5457o1229q8152l3429
24679d7713P0681L4145J1614p0021m7202N0869K9459n2219j1466N1901J9270m0448
24667a130k562L0244K0639K6487N4130J0714k6666M540p2479l5695k9756p0002
$$ plain form
24655 -91536 -70340 -51766 -92873 -70940 -11171 -5541 -15065 -17339 -97918 -124583 -51608 -37672
24643 -37672 -46178 -40429 -63246 -107193 -49773 31898 -21019 -136930 -162368 -93163 -61733 -122324
24631 -122324 -108269 -87338 -92491 -35694 100356 147712 101153 10530 15208 29104 50725 56025
24619 56025 7318 -41290 -33748 -55667 -72153 -32244 11001 42183 -3315 -3886 -20292 -67497
24607 -67497 -46539 15134 7687 -65352 -55468 27239 76858 65566 -1695 -112612 -112691 -47046
24595 -47046 -33397 34572 74674 45293 17887 -32441 -72476 -96764 -53098 11572 34431 96185
24583 96185 120840 154564 148725 105623 182268 215286 124450 93852 43347 31981 82807 44005
24571 44005 5900 -34993 -15728 -17144 -21163 67352 55523 49104 31267 24066 46261 22900
$$ packed form
24655i1536K1196J8574m1107K1933N9769N630r524k274q0579k6665P2975J3936
24643c7672q506N749k2817m3947N7420Q1671n2917j15911k5438O9205L1430o0591
24631a22324J4055K0931n153N6797J36050M7356m6559r0623M678J3896K1621N300
24619E6025m8707m8608P542k1919j6486L9909M3245L1182m5498n71j6406m7205
24607f7497K0958O1673p447p3039R884Q2707M9619j1292o7261j10917p9O5645
24595d7046J3649O7969M0102k9381k7406n0328m0035k4288M3666O4670K2859O1754
24583I6185K4655L3724n839m3102P6645L3018r0836l0598n0505j1366N0826l8802
24571D4005l8105m0893J9265j416m019Q8515j1829o419j7837p201K2195k3361
$$ plain form
24559 22900 -6205 12958 91077 71830 -21823 -60001 -42542 -44786 -26389 20802 30402 19665
24547 19665 -12225 2848 -57877 -101200 -81884 -57829 -25652 -5165 89457 88753 53309 -14604
24535 -14604 -104406 -97627 -79584 -51682 -20330 -30062 -18652 -37074 34903 67868 95111 173719
24523 173719 130642 143354 67577 7765 24263 8686 -6823 -19327 -6245 -42606 -73057
24512 -73057 -54179 -66869 -70148 -102491 -119230 -93856 -62233 1296 -45025 -125585 -163728 -213536
24500 -213536 -210183 -127246 -98139 -153765 -169728 -162363 -162810 -75620 -56720 -31844 -205 3081
24488 3081 -46335 -75452 -80675 -45287 -50922 -95027 -114497 -133147 -54634 -2579 -1177 28419
24476 28419 22242 -24781 -29267 21876 64544 104583 129238 89859 86235 20332 -14990 6139
$$ packed form
24559B2900k9105J9163P8119j9247r3653l8178J7459k244J8397M7191R600j0737
24547A9665l1890J5073o0725m3323J9316K4055L2177K0487R4622p04l5444o7913
24535a4604q9802O779J8043K7902L1352r732J1410j8422P1977L2965K7243P8608
24523A73719m3077J2712p5777n9812J6498j5577j5509j2504J3082l6361l0451
24512g3057J8878j2690l279l2343j6739K5374L1623O3529m6321q0560l8143m9808
24500b13536L353Q2937K9107n5626j5963P365m47Q7190J8900K4876L1639L286
24488C081m9416k9117n223L5388n635m4105j9470j8650P8513N2055J402K9596
24476B8419o177m7023m486N1143M2668M0039K4655l9379l624o5903l5322K1129
$$ plain form
24464 6139 -29462 -70986 -90887 -61230 -56643 -113458 -124127 -71369 -13052 32232 27906 48660
24452 48660 35800 46716 6133 -11580 -122557 -121074 -58295 -13486 -74219 -163724 -164888 -130399
24440 -130399 -127341 -103684 -60942 13959 27139 92060 73484 32525 14700 96070 66951 -47242
24428 -47242 -134678 -156890 -107402 -90866 -99746 -62283 -61129 -64142 -69005 -8373 93518 59414
24416 59414 -22911 -90559 -41814 -6401 -12489 18077 16656 -11946 30793 57407 21900 5660
24404 5660 -25311 17916 -19040 -73600 -51100 30529 40739 35802 -12335 -34967 -55513 -114977
24392 -114977 -98007 -61047 -37068 -103446 -95901 -120882 -168453 -103707 25005 84484 75656 12646
24380 12646 -16700 -32257 -20498 -44092 -50966 -90935 -87852 -146819 -218433 -231976 -179094 -34810
$$ packed form
24464F139l5601m1524j9901K9657M587n6815j0669N2758N8317M5284m326K0754
24452D8660j2860J0916m0583j7713j10977J483O2779M4809o0733q9505j164L4489
24440a30399L058K3657M2742P4901J3180O4921j8576m0959j7825Q1370k9119j14193
24428d7242q7436k2212M9488J6536q880L7463J154l013m863O0632J01891l4104
24416E9414q2325o7648M8745L5413o088L0566j421k8602M2739K6614l5507j6240
24404E660l0971M3227l6956n4560K2500Q1629J0210m937m8137k2632k0546n9464
24392a14977J6970L6960K3979o6378P545k4981m7571O4746J28712N9479q828o3010
24380A2646k9346j5557J1759k3594o874l9969L083n8967p1614j3543N2882J44284
$$ plain form
24368 -34810 -6687 -14888 29220 10484 25071 5551 48127 -27999 -107036 -165335 -130176 -103347
24356 -103347 -152658 -90476 -47056 27927 37465 16715 7701 -11445 -57416 -31280 9548 12903
24344 12903 57265 28934 -38270 -71161 -36325 -7228 33737 31688 -64364 -38239 47188 -10812
24332 -10812 -73703 -51458 -25550 43826 67938 56097 33862 -17765 -56248 -48744 -69109 -53898
24320 -53898 -50687 -99433 -135327 -124684 -82270 -37415 -90181 -44504 24942 64208 78773 61792
24308 61792 -7026 -19485 17816 47725 156843 134814 57931 5655 8559 231 -29060 1757
24296 1757 34252 86436 57639 39122 116198 168766 85400 -4510 -45647 -82030 -62807 -27661
24284 -27661 -24155 -31462 33558 54220 30084 82140 115735 135551 111013 49794 -57350 -56814
$$ packed form
24368c4810K8123q201M4108j8736J4587j9520M2576p6126p9037n8299L5159K6829
24356a03347m9311O2182M3420P4983R538k0750r014j9146m5971K6136M0828L355
24344A2903M4362k8331o7204l2891L4836K9097M0965k049r6052K6125Q5427n8000
24332a0812o2891K2245K5908O9376K4112j1841k2235n1627l8483P504k0365J5211
24320e3898L211m8746l5894J0643M2414M4855n2766M5677O9446L9266J4565j6981
24308F1792o8818j2459L7301K9909J09118k2029p6883n2276K904q328k9291L0817
24296A757L2495N2184k8797j8517P7076N2568q3366q9910m1137l6383J9223L5146
24284b7661L506p307O5020K0662k4136N2056L3595J9816k4538o1219j07144N36
$$ plain form
24272 -56814 -20242 7278 -37608 -99795 -78137 13651 1257 -34540 10266 -25651 -7953 38865
24260 38865 58579 107015 118390 65764 -7944 -31167 168 38735 28974 -23120 -64822 -16571
24248 -16571 -45248 -37295 -31289 -44421 -44643 -123577 -125835 -116374 -95925 -32615 -6840 -86172 -120388
24235 -120388 -71017 -58359 -79591 -100559 -146969 -170381 -146890 -93010 45223 113512 63497
24224 63497 25370 -34406 -51129 -1777 -43284 -60100 12918 20449 57597 84356 96087 111482
24212 111482 60193 46802 69901 109569 87476 49815 124051 133804 15602 -47187 -60818
24201 -60818 -16642 6409 -38906 -77769 -94499 -80544 3142 32030 -32393 -30662 11156 12414
24189 12414 -18329 -65850 -69997 -5957 34299 32549 -55281 -62830 -21178 -35571 -34020 22235
$$ packed form
24272e6814L6572K7520m4886o2187K1658R1788j2394l5797M4806l5917J7698M6818
24260C8865J9714M8436J1375n2626p3708k3223L1335L8567r761n2094m1702M8251
24248a6571k8677P953O006j3132k22p8934k258R461K0449O3310K5775p9332l4216
24235a20388M9371J2658k1232k0968m6410k3412K3491N3880J38233O8289n0015
24224F3497l8127n9776j6723M9352m1507j6816P3018P531L7148K6759J1731J5395
24212A11482n1289j3391K3099L9668k2093l7661P4236R753j18202o2789j3631
24201f0818M4176K3051m5315l8863j6730J3955Q3686K8888o4423J731M1818J258
24189A2414l0743m7521m147O4040M0256j750q7830p549M1652j4393J551N6255
$$ plain form
24177 22235 37493 -3996 -65462 -57991 -69633 -43420 37688 70953 90899 -18786 -28070 -28645
24165 -28645 -41703 20813 62757 49953 24387 -61310 -71746 18062 114991 133007 116763 45814
24153 45814 26654 21592 3485 17090 95351 150514 71964 3766 -91119 -125456 -96455 -17900
24141 -17900 4109 -22545 -20384 6280 22483 298 -1277 -18945 -13181 42906 87389 85641
24129 85641 38211 -8642 -7194 -14190 6283 -26523 -37509 -69866 -108680 -65562 -18171 -77597
24117 -77597 -139227 -106452 -83020 -94488 -94864 -64282 6463 42985 2252 -15263 25308 13388
24105 13388 21377 10390 3148 -18260 -10152 37003 5710 -97915 -121730 -121919 -134929 -111771
24093 -111771 -107978 -2828 -1188 -74331 -20121 27450 -7808 -47469 8075 228 -17782 -12206
$$ packed form
24177B2235J5258m1489o1466P471j1642K6213Q1108L3265J9946j09685r284n75
24165b8645j3058O2516M1944j2804k5566q5697j0436Q9808R6929J8016j6244p0949
24153D5814j9160n062j8107J3605P8261N5163p8550o8198r4885l4337K9001P8555
24141a7900K2009k6654K161K6664J6203k2185j575j7668N764N6087M4483j748
24129H5641m7430m6853J448o996K0473l2806j0986l2357l8814M3118M7391n9426
24117g7597o1630L2775K3432j1468l76L0582P0745L6522m0733j7515M0571j1920
24105A3388P989j0987p242k1408Q108M7155l1293j03625k3815j89j3010K3158
24093a11771L793J05150J640p3143N4210M7571l5258l9661N5544p847j8010N576
$$ plain form
24081 -12206 -1797 35551 27029 -5169 -29109 -23791 -35155 -3499 30565 -6345 -80013 -112356
24069 -112356 -63096 9162 16363 38108 77569 66636 66332 65545 100970 -2332 -24750 -21391
24057 -21391 -44707 -52679 -95878 -90918 -76996 -5133 -1623 -51697 -53853 45280 32572 34413 19772
24044 19772 -30608 -32111 -23965 -35962 -53748 -70655 -98312 -58717 -31327 28650 -46005 -75413
24032 -75413 -20257 -39837 -76354 -86607 841 75825 91496 91482 35283 -46051 -67133 -100244
24020 -100244 -48669 82442 24016 -11117 111766 147599 128172 91810 30699 16615 65149
24009 65149 48110 40372 2608 -21541 -28686 -53089 -93909 -58856 -89096 -131778 -74019 -97867
23997 -97867 -79835 -64542 -7768 31895 35787 62600 45050 -49918 -107146 -53390 -17253 18844
$$ packed form
24081a2206J0409L7348q522l2198k3940N318j1364L1656L4064l6910p3668l2343
24069a12356M9260P2258P201K1745L9461j0933l04p87L5425j03302k2418L359
24057b1391k3316p972m3199M960J3922P1863L510n0074k156R9133j2708J841j4641
24044A9772n0380j503Q146j1997j7786j6907k7657L9595K7390N9977p4655k9408
24032g5413N5156j9580l6517j0253Q7448P4984J5671j4n6199q1334k1082l3111
24020a00244N1575J31111n8426l5133J22883L5833j9427l6362o1111j4084M8534
24009F5149j7039p738l7764k4149p145k4403m0820L5053l0240m2682N7759k3848
23997i7867J8032J5293N6774L9663L892K6813j7550r4968n7228N3756L6137L6097
$$ plain form
23985 18844 -4598 -7637 23087 -5167 28522 30811 81647 74589 50283 42234 41654 14394 46152
23972 46152 140699 110319 -22966 -104609 -111847 -181267 -201257 -103579 -80142 -93338 -50192 -40299
23960 -40299 -42234 -2663 5851 -81181 -84634 -74836 -67822 -65402 1552 9388 13630 68955 32653
23947 32653 -9879 50268 122070 43408 -40583 -47579 29304 60788 -8743 -22158 70446 75656
23935 75656 -3507 -83090 -121524 -128157 -42459 -16074 -42062 -50588 -46274 -13377 -28370 -82720
23923 -82720 -43254 -14741 -22311 6356 24466 -804 -40279 -89263 -114342 -54745 -28560 248
23911 248 -5109 1470 9845 -26929 9143 90606 10938 -6731 -7927 -22714 -45018 -15439 -72005
23898 -72005 -4556 29586 -30592 -39141 37822 30206 24578 143592 120123 15592 -21884 28210
$$ packed form
23985A8844k3442l039L0724k8254L3689K289N0836p058k4306q049n80k7260L1758
23972D6152R4547l0380j33285q1643p238o9420j9990R7678K3437j3196M3146R893
23960d0299j935L9571Q514q7032l453R798P014K420O6954P836M242N5325l6302
23947C2653m2532O0147P1802p8662q3991o996P6883L1484o9531j3415R2604N210
23935G5656p9163p9583l8434o633Q5698K6385k5988q526M314L2897j4993n4350
23923h2720L9466K8513p570K8667J8110k5270l9475m8984k5079N9597K6185K8808
23911B48n357O579Q375l6774L6072Q1463p9668j7669j196j4787k2304K9579n6566
23898g2005O7449L4142o0178q549P6963p616n628J19014k3469j04531l7476N0094
$$ plain form
23886 28210 47036 28926 33031 49770 99490 16336 -13338 60856 78308 34024 3307 22607
23874 22607 3191 -61964 -15659 10025 -40797 13578 30646 -22445 -27282 -31904 -13513 51460
23862 51460 1154 -66925 -104005 -126200 -135211 -124506 -46813 40653 95329 147657 122646 59638
23850 59638 -4699 -23428 -32085 -6846 37067 46264 -40540 -21251 67323 47395 26114 31907
23838 31907 13015 19490 46748 112262 84318 52222 13195 26991 35416 -73000 -111561 -161297
23826 -161297 -207040 -158397 -149498 -91783 -92147 -56104 -68103 -79931 6988 18550 -37041 -44245
23814 -44245 -13432 17716 -2499 36116 31013 34779 26682 41002 22590 22520 -7763 -587 5483
23801 5483 -6325 -62531 -110605 -139202 -140415 -74588 -26633 -19861 15434 11281 -69436 -175122
$$ packed form
23886B8210J8826j8110M105J6739M9720q3154k9674P4194J7452m4284l0717J9300
23874B2607j9416o5155M6305K5684n0822N4375J7068n3091m837m622J8391O4973
23862E1460n0306o8079l7080k2195r011J0705P7693Q7466N4676N2328k5011o3008
23850E9638o4337j8729q657K5239M3913R197q6804J9289Q8574j9928k1281N793
23838C1907j8892O475K7258O5514k7944l2096l9027J3796Q425j08416l8561m9736
23826a61297m5743M8643Q899N7715l64L6043j1999j1828Q6919J1562n5591p204
23814d4245L0813L1148k0215L8615n103L766q097J4320j8412p0l0283P176O070
23801E483j1808n6206m8074k8597j213O5827M7955O772L5295m153q0717j05686
$$ plain form
23789 -175122 -154478 -138843 -92316 -14322 15124 30393 -10984 -18555 365 -8448 8667 -8979
23777 -8979 -22990 -137823 -155109 -72345 -116776 -182322 -136915 -57105 -10029 20502 50381 66675
23765 66675 36723 78747 85148 67737 109205 84453 -10537 -66381 -71434 -66608 -30867 24989
23753 24989 -14636 -33172 -62107 -48136 -55250 -39737 -20143 -31724 -43785 36975 61548 87155
23741 87155 102123 63109 27547 -7742 44612 19307 58848 74765 50613 14026 30878 19493
23729 19493 -16959 -20364 -84970 -162343 -148892 -40015 -3167 39111 2442 28136 57251 30665
23717 30665 49991 85754 27982 41114 143560 100195 31791 9556 27003 -10377 -55084
23706 -55084 21100 52788 60504 19863 -28942 -45151 -15949 63323 34820 -22293 -61590 -73576
$$ packed form
23789a75122K0644J5635M6527P7994K9446J5269m1377p571J8920q813J7115j7646
23777h979j4011j14833j7286Q2764m4431o5546M5407P9810M7076L0531K9879J6294
23765F6675k9952M2024O401j7411M1468k4752r4990n5844n053M826L5741N5856
23753B4989l9625j8536k8935J3971p114J5513J9594j1581j2061Q0760K4573K5607
23741H7155J4968l9014l5562l5289N2354k5305L9541J5917k4152l6587J6852j1385
23729A9493l6452l405o4606p7373J3451J08877L6848M2278l6669K5694K9115k6586
23717C0665J9326L5763n7772J3132J02446m3365o8404k2235J7447l7380m4707
23706e5084P6184L1688P716m0641m8805j6209K9202P9272k8503n7113l9297j1986
$$ plain form
23694 -73576 -108754 -111482 -106090 -83393 -132340 -104926 -118981 -157230 -162607 -71233 -39173 55845
23682 55845 100875 94165 107194 16455 -62616 -83369 -73105 -81758 8564 17936 -12115 -59559
23670 -59559 -82256 -31852 -16531 -8946 13476 14572 -74156 -78549 -67181 -58281 -95003 -60700
23658 -60700 -29972 50771 60551 34632 95764 91893 4732 4208 7487 -11374 14332 20437 -35818
23645 -35818 -7921 7549 53262 63742 -23200 -134531 -142398 -94786 -50153 -12158 1502 -4347
23633 -4347 -14308 -21469 8693 51097 25354 29157 1731 -55361 -20612 -28781 -21053 -15053 -20645
23620 -20645 -34209 15897 -12452 -39867 -42509 4775 81216 92442 25954 -19940 13310 23862
23608 23862 32271 -41246 -43019 -24759 14295 38123 79048 32432 57550 46392 40205 59655
$$ packed form
23694g3576l5178k728N392K2697m8947K7414j4055l8249n377R1374L2060R5018
23682E5845M5030o710J3029r0739p9071k0753J0264q653R0322R372l0051m7444
23670e9559k2697N0404J5321P585K2422J096q8728m393J1368Q900l6722L4303
23658f0700L0728Q0743R780k5919O1132l871q7161n24L279j8861K5706O105n6255
23645c5818K7897J5470M5713J0480q6942j11331p867M7612M4633L7995J3660n849
23633d347r961p161L0162M2404k5743L803k7426n7092L4749q169P728O000n592
23620b0645j3564N0106k8349k7415k642M7284P6441J1226o6488m5894L3250J0552
23608B3862Q409p3517j773J8260L9054K3828M0925m6616K5118j1158o187J9450
$$ plain form
23596 59655 47306 -3117 5949 -52723 -55233 -41602 -26742 43721 28901 -57525 -33435 -16374
23584 -16374 -55261 -85130 -94208 -166464 -168056 -170120 -195398 -90000 76916 42868 -3755 26109
23572 26109 30949 -37323 -68049 -61053 -43635 -59425 -51862 1795 68652 134825 44289 -53261
23560 -53261 7498 42681 74149 54013 -64773 -101148 -57962 -99572 -109262 -62497 -6256 88885
23548 88885 54882 -4933 -110369 -141619 -124720 -99378 -38815 -53416 -77488 -110687 -88412
23537 -88412 -46744 -57844 -25532 45675 54288 47140 18917 -27973 -54503 -124414 -116507 -47575
23525 -47575 -104035 -138719 -102719 -55204 -100567 -79854 10178 65020 70372 28792 -27228 26100
23513 26100 62114 15834 47141 100357 63946 10693 5733 40045 -15061 -60109 -95340 -50584
$$ packed form
23596E9655j2349n0423R066n8672k510J3631J4860P0463j4820q6426K4090J7061
23584a6374l8887k9869r078p2256j592k064k5278J05398J66916l4048m6623K9864
23572B6109M840o8272l0726O996J7418j5790P563N3657O6857O6173r0536r7550
23560e3261O0759L5183L1468k0136j18786l6375M3186m1610r690M6765N6241R5141
23548H8885l4003n9815j05436l1250J6899K5342O0563j4601k4072l3199K2275
23537h8412M1668j1100L2312P1207Q613p148k8223m6890k6530o9911P907O8932
23525d7575n6460l4684L6000M7515m5363K0713R0032N4842N352m1580n6020N3328
23513B6100L6014m6280L1307N3216l6411n3253m960L4312n5106m5048l5231M4756
$$ plain form
23501 -50584 -61775 -7953 26367 36707 -130758 -169917 -86245 35524 20847 -9326 25763
23490 25763 111428 150925 150710 103579 36262 -5233 53387 37749 38994 68737 59887 62314 17628
23477 17628 -31505 19398 1026 63159 106586 80126 28240 -15580 -23263 7086 -92804 -125862
23465 -125862 -160597 -146888 -126920 -69737 -51295 -58000 -59460 -23279 19105 -7469 -442 -63496
23453 -63496 -38464 -40684 11168 -16 -15214 -35959 -40823 -34508 -43042 -39544 16243 -6963 -18802
23440 -18802 -9280 -44343 -41834 -55758 -82926 -140104 -74486 27793 3338 1361 -29971 -6379
23428 -6379 32220 65061 10269 -3222 -18176 -30808 -34598 -125068 -126822 -75359 -90806 -14669
23416 -14669 5241 -13761 -2798 28480 2731 15782 -17903 -76579 -84889 -48486 64 30031
$$ packed form
23501e0584j1191N3822L4320J0340j67465l9159Q3672J21769j4677l0173L5089
23490B5763Q5665L9497k15m7131o7317m1495N8620j5638J245K9743q850K427m4686
23477A7628m9133N0903j8372O2133M3427k6460n1886m3820p683L0349r9890l3058
23465a25862l4735J3709J9968N7183J8442o705j460L6181M2384k6574P027o3054
23453f3496K5032k220N1852j1184j5198k0745m864O315q534L498N5787k3206j1839
23440a8802R522l5063K509j3924k7168n7178O5618J02279k4455j977l1332K3592
23428f379L8599L2841n4792j3491j4954j2632l790r0470j754N1463j5447P6137
23416a4669J9910j9002J0963L1278k5749J3051l3685n8676q310L6403M8550K9967
$$ plain form
23404 30031 63987 51 -13218 -13768 56193 125309 100288 -6146 -5057 28676 57006 124076
23392 124076 132673 68508 37688 -33692 -34205 -28459 -71874 -112443 -42749 31736 12655 2750
23380 2750 60369 48886 -15058 -82965 -97879 -46386 -30919 4900 11548 -30573 -50240 34619
23368 34619 56276 70540 57437 60527 54479 102158 123215 92983 97352 43082 36468 54050
23356 54050 71630 17627 5504 -12490 32108 52013 49773 -54638 -63867 10188 47988 67537
23344 67537 26062 -78603 -22981 43926 93904 74764 80822 68803 -6558 12638 54079 35350
23332 35350 -14630 -64007 -24682 -24670 -59972 -30384 -4140 -62205 -115992 -103216 -39331 -2128
23320 -2128 8781 -6391 13080 9918 -120835 -125853 -135504 -93421 -37669 -10164 -79565 -112808
$$ packed form
23404C0031L3956o3936j3269n50O9961O9116k5021j06434J089L3733K8330O7070
23392A24076Q597o4165l0820p1380n13N746m3415m0569O9694P4485j9081r905
23380B750N7619j1483o3944o7907j4914N1493J5467L5819O648m2121j9667Q4859
23368C4619K1657J4264j3103L090o048M7679K1057l0232M369n4270o614J7582
23356E4050J7580n4003j2123j7994M4598J9905k240j04411r229P4055L7800J9549
23344F7537m1475j04665N5622O6907M9978j9140O058j2019p5361J9196M1441j8729
23332C5350m9980m9377L9325J2l5302K9588K6244n8065n3787J2776O3885L7203
23320b128J0909j5172J9471l162j30753n018r651M2083N5752K7505o9401l3243
$$ plain form
23308 -112808 -102170 -170429 -164042 -89340 -39772 -1368 31941 24360 -37071 -45358 -30641 -62475
23296 -62475 -50709 -78355 -71834 -18744 -30395 -45114 -55973 -104755 -157797 -118633 -53366 -19800
23284 -19800 -45660 -30104 -44233 -50605 -10689 -10665 31802 12801 -43826 -81224 -50700 -9473
23272 -9473 12950 3618 -106226 -204796 -230853 -137090 -21107 17541 58874 60970 -6219 -91290
23260 -91290 -41467 31812 -4652 -12301 -78987 -113357 -51762 -9070 -39769 -55954 -63696 -67857
23248 -67857 -91008 -62829 -28977 -38930 -18739 27699 -10679 -31520 19456 100066 132717 148094
23236 148094 96203 53253 164062 151957 125669 62249 36049 40983 75535 39761 -45975
23225 -45975 -55755 -23384 4028 -30550 -18231 34372 53372 97490 92270 33924 4323 23752
$$ packed form
23308a12808J0638o8259O387P4702M9568L8404L3309p581o1431q287J4717l1834
23296f2475J1766k7646O521N3090j1651j4719j0859m8782n3042L9164O5267L3566
23284a9800k5860J5556j4129o372L9916K4M2467j9001n6627l7398L0524M1227
23272i473K2423r332j09844r8570k6057R3763J15983L8648M1333K096o7189q5071
23260i1290M9823P3279l6464p649o6686l4370O1595M2692l0699j6185p742m161
23248f7857k3151K8179L3852r953K0191M6438l8378k0841N0976Q0610L2651J5377
23236A48094n1891m2950J10809j2105k6288o3420k6200M934L4552l5774q5736
23225d5975r780L2371K7412l4578J2319N2603J9000M4118n220n8346k9601J9429
$$ plain form
23213 23752 54648 84241 64712 -1049 -69054 -40204 -23741 -23628 39400 57130 27449 -4146
23201 -4146 -22542 -56285 -97845 -68146 -96403 -62195 -41645 -44421 -57966 -70434 -64531 -45053
23189 -45053 -67193 -29230 1733 -13283 13101 21225 2717 -87483 -68744 -3059 13831 35445
23177 35445 37041 25674 69689 36396 25733 123494 116439 75584 96668 99447 26216 486
23165 486 22411 97613 129366 122183 154296 144693 78052 79343 75539 113721 128542 112743 120724
23152 120724 213559 313395 443973 641117 983903 1514906 2120047 2597876 2733608 2594268
23142 2594268 2169731 1552644 982801 594100 447926 328485 187257 112501 114582 183758
23132 183758 128811 20569 12660 31504 68060 41 -12067 5822 59406 64462 111964 69248
$$ packed form
23213B3752L0896K9593j9529o5761o8005K8850J6463J13O3028J7730k9681l1595
23201d146j8396l3743m1560K9699k8257L4208K0550k776j3545j2468N903J9478
23189d5053k2140L7963L0963j5016K6384Q124j8508r0200J8739O5685J6890K1614
23177C5445J596j1367M4015l3293j0663R7761p055m0855K1084K779p3231k5730
23165D86K1925P5202L1753p183L2113r603o6641J291l804L8182J4821j5799P981
23152A20724R2835R9836J30578J97144L42786N31003O05141M77829J35732j39340
23142B594268m24537o17087n69843l88701j46174j19441j41228p4756K081O9176
23132A83758n4947j08242p909J8844L6556o8019j2108J7889N3584N056M7502m2716
$$ plain form
23120 69248 27176 64063 71646 51399 -15566 -44348 -86686 -98482 -98746 -93948 -33222 -18133
23108 -18133 14113 47839 7551 -83971 -144392 -167444 -164102 -211196 -156227 -48023 -2302 -28210
23096 -28210 -37038 -40203 -24140 -60355 -103478 -69936 -41481 8920 30010 14218 42627 -83065
23084 -83065 -97776 -18243 1084 -1004 27487 48422 34197 -896 63954 98684 24241 -8723
23072 -8723 -15038 10092 49252 64075 88440 57810 61110 121674 128834 148282 68768 33210
23060 33210 71477 54036 -5358 23861 87155 45041 36395 39569 126114 169492 188404 123163
23048 123163 51137 21721 -29051 -62605 -59895 -78146 -66032 -16440 -8858 -74972 -70757 -10950
23036 -10950 -6038 -6186 57707 65529 46751 50915 52593 8300 65297 36639 -49636 -74346 -99880
$$ packed form
23120F9248m2072L6887P583k0247o6965k8782m2338j1796k64M798O0726J5089
23108a8133L2246L3726m0288r1522o0421k3052L342m7094N4969J08204M5721k5908
23096b8210q828l165J6063l6215m3123L3542K8455N0401K1090j5792K8409j25692
23084h3065j4711P9533J9327k088K8491K0935j4225l5093O4850L4730p4443l2964
23072h723o315K5130L9160J4823K4365l0630L300O0564P160J9448p9514l5558
23060C3210L8267j7441n9394K9219O3294m2114q646L174Q6545M3378J8912o5241
23048A23163p2026k9416n0772l3554K710j8251J2114M9592P582o6114M215N9807
23036a0950M912j48O3893P822j8778M164J678m4293N6997k8658q6275k4710k5534
$$ plain form
23023 -99880 -97983 -67031 3650 27154 37783 57765 69875 57783 32301 33309 -1039 5272
23011 5272 23427 32000 14093 -40253 -82345 -4033 8110 -1589 37765 26464 35050 86308
22999 86308 79922 103589 59096 2111 12224 35759 -322 -28974 -35059 -47814 -18945 12590
22987 12590 52907 43655 12650 -45929 -44237 32768 103099 99316 24352 -2375 2564 53556
22975 53556 21315 57289 62695 34269 21594 31123 23140 10828 -89447 -113107 -77364 -74596
22963 -74596 -69833 -71580 3939 12367 -930 27940 74500 98743 142508 114051 86560 30250
22951 30250 -44416 -46988 -46914 -18689 -10402 36485 60951 51837 108057 61813 62070 -20942 10018
22938 10018 51270 28770 13003 73949 111838 107264 157474 161059 138543 127032 54889 3089
$$ packed form
23023i9880J897L0952P0681K3504J0629J9982J2110j2092k5482J008l4348O311
23011E272J8155Q573j7907n4346m2092P8312J2143r699L9354j1301Q586N1258
22999H6308o386K3667m4493n6985J0113K3535l6081k8652o085j2755K8869L1535
22987A2590M0317r252l1005n8579J692P7005P0331l783p4964k6727M939N0992
22975E3556l2241L5974N406k8426j2675R529p983j2312j00275k3660L5743K768
22963g4596M763j747P5519Q428j3297K8870M6560K4243M3765k8457k7491n6310
22951C0250p4666k572P4K8225Q287M6887K4466r114N6220m6244K57q3012L0960
22938A0018M1252k2500j5767O0946L7889m574N0210L585k2516j1511p2143n1800
$$ plain form
22926 3089 24858 40612 48639 68450 140500 186637 190788 170902 118092 64644 48162 69028
22914 69028 13619 -13612 -33072 -58251 -31142 -20114 35333 83435 98675 26137 4042 42
22902 42 -39972 30945 76672 10018 -4386 -5610 -76330 -83370 -120167 -46081 11184 11155 11399 7263
22888 7263 -19509 -123610 -132337 -80336 -35656 31847 130562 122076 127473 200078 259722 187893
22876 187893 74346 -695 -63797 -116058 -35903 22657 13652 20707 15521 71192 132014 155349
22864 155349 137440 162394 96645 38435 40815 49339 53833 -15206 -1999 -16205 26433 36856
22852 36856 97338 158843 121307 72403 61890 35780 -7522 -2000 146243 213268 175215 173909
22840 173909 153078 170862 178991 125244 122313 114934 33338 -17772 -9818 -48093 665 17379
$$ packed form
22926C089K1769J5754Q027J9811P2050M6137M151j9886n2810n3448j6482K0866
22914F9028n5409k7231j9460k5179K7109J1028N5447M8102J5240p2538k2095m000
22902D2m0014P0917M5727o6654j4404j224p0720p040l6797P4086N7265k9K44m136
22888G263k6772j04101q727N2001M4680O7503R8715q486N397P2605N9644p1829
22876A87893j13547p5041o3102n2261Q0155N8560r005P055n186N5671O0822K3335
22864A55349j7909K4954o5749n8210K380Q524M494o9039J3207j4206M2638J0423
22852C6856O0482O1505l7536m8904j0513k6110m3302N522J48243O7025l8053j306
22840A73909k0831J7784Q129n3747k931p379q1596n1110P954l8275M8758J6714
$$ plain form
22828 17379 -7831 12927 -10908 279 29304 52176 71842 74330 95418 164385 148101 153995
22816 153995 108141 100587 82122 26723 16373 25760 22463 24893 62399 118491 129295 114378
22804 114378 107419 76198 -13125 18769 103889 79581 97448 37372 54701 87622 127964 127370
22792 127370 46884 49105 100406 123815 146988 118729 51852 18609 -17088 -51056 -58486 -82087
22780 -82087 -55369 9796 75224 63152 54666 88748 177012 192859 175158 172023 113202 93615
22768 93615 128003 64840 37759 42119 73061 90718 95782 136446 126605 113488 129785 243260
22756 243260 272320 264142 256461 186577 83989 79761 85002 105009 68848 -9067 -19811 -12347
22744 -12347 91109 120496 159088 269594 267004 199049 126180 50280 18690 9183 34524 113140
$$ packed form
22828A7379k5210K0758k3835J1187K9025K2872J9666K488K1088O8967j6284N894
22816A53995m5854p554j8465n5399j0350R387l297K430L7506N6092J0804j4917
22804A14378o959l1221q9323L1894Q5120k4308J7867o0076J7329L2921M0342n94
22792A27370q0486K221N1301K3409K3173k8259o6877l3243l5697l3968p430k3601
22780h2087K6718O5165O5428j2072q486L4082Q8264J5847j7701l135n8821j9587
22768I3615L4388o3163k7081M360L0942J7657N064M0664r841j3117J6297J13475
22756B43260K9060q178p681o9884j02588m228N241K0007l6161p7915j0744P464
22744a2347J03456K9387L8592J10506k590o7955p2869p5900l1590r507K5341P8616
$$ plain form
22732 113140 101009 119509 146050 106582 81605 115711 165646 25070 -37807 -47413 -60833
22721 -60833 -55851 24520 81797 113661 203757 214555 254907 319247 305182 178432 89743 69751
22709 69751 75065 78613 84265 122348 124800 124615 117139 147477 155244 137660 183505 267611 340690
22696 340690 364713 358771 337112 331732 389814 440293 379133 370687 373905 336900 302696 248483
22684 248483 209959 259070 274010 246166 248313 328952 368532 350629 361683 450883 579284
22673 579284 656438 746966 878869 1084125 1511623 2093159 2675946 3215013 3291776 2951873
22663 2951873 2368845 1718460 1310611 1089369 984061 933765 850986 787288 753137 704880
22653 704880 677683 628335 553176 576291 605497 615407 591017 509396 477082 565844 627762 647045
$$ packed form
22732A13140j2131J8500K6541l9468k4977L4106M9935j40576o2877r606j3420
22721f0833M982Q0371N7277L1864R0096J0798M0352O4340j4065j26750q8689j9992
22709F9751N314L548N652L8083K452j85p476L0338P767j7584M5845Q4106P3079
22696C40690K4023n942k1659n380N8082N0479o1160q446L218l7005l4204n4213
22684B48483l8524M9111J4940k7844K147Q0639L9580j7903J1054Q9200J28401
22673E79284P7154R0528J31903K05256M27498N81536N82787N39067P6763l39903
22663B951873n83028o50385m07849k21242j05308n0296q2779o3698l4151m8257
22653G04880k7197m9348p5159K3115K9206R910k4390q1621l2314Q8762O1918J9283
$$ plain form
22641 647045 656516 643675 696864 740384 751516 784035 802661 804426 842601 842493 866595 820213
22629 820213 845024 932576 1052810 1126604 1164314 1296546 1373849 1463187 1577597 1759075 1936145
22618 1936145 2011698 2202631 2411953 2541715 2713913 2898401 3071928 3284131 3493387 3688321
22608 3688321 4048944 4529610 5151743 5961309 6972534 8148526 9499699 11134556 13161820
22599 13161820 15838367 19775773 25243654 32900216 43401691 58568263 83345748 127866277
22591 127866277 207599910 321197149 434688877 525787200 544297312 478275840 377491671
22584 377491671 257860638 164868507 111694062 81656866 62980407 50105122 40589746
22577 40589746 33286070 27765249 23441723 20054262 17422509 15387908 13824264 12520745
$$ packed form
22641F47045R471j2841N3189M3520J1132L2519J8626J765L8175j08K4102m6382
22629H20213K4811Q7552J20234P3794L7710J32232P7303Q9338J14410J81478J77070
22618A936145P5553J90933K09322J29762J72198J84488J73527K12203K09256J94934
22608C688321L60623M80666O22133Q09566J011225J175992J351173J634857K027264
22599A3161820K676547L937406N467881P656562J0501475J5166572K4777485M4520529
22591A27866277P9733633J13597239J13491728R1098323J8510112o6021472j00784169
22584C77491671j19631033r2992131n3174445l0037196j8676459j2875285r515376
22577D0589746p303676n520821m323526l387461k631753k034601j563644j303519
$$ plain form
22569 12520745 11446333 10474684 9646544 8839319 8050166 7350620 6642960 6031872 5572117
22560 5572117 5156704 4798354 4442686 4138744 3927829 3672700 3502114 3340277 3272126 3108726
22550 3108726 2955566 2756032 2433031 2210785 2134724 2105208 1979717 1828902 1727249 1677628
22540 1677628 1798753 1824188 1793178 1710702 1528979 1335341 1134387 989019 906251 914866
22530 914866 914216 967433 1016593 1017717 933218 908661 908708 852576 714966 603018 603002 564206 497706
22517 497706 539325 630978 683610 650004 824118 1087739 1541513 2148638 2782844 3248178
22507 3248178 3377925 2944976 2356950 1799865 1354165 1097027 926540 760630 722499 675147
22497 675147 648753 699477 714573 651210 604353 496822 436629 415206 391348 350180 279102
$$ packed form
22569A2520745j074412r71649q28140q07225p89153o99546p07660o11088m59755
22560E572117m15413l58350l55668l03942k10915k55129j70586j61837o8151j63400
22550C108726j53160j99534l23001k22246p6061k9516j25491j50815j01653m9621
22540A677628J21125K5435l1010q2476j81723j93638k00954j45368q2768Q615
22530I14866o50N3217M9160J124q4499k4557M7n6132j37610j11948j6l8796o6500
22517D97706M1619R1653N2632l3606J74114K63621M53774O07125O34206M65334
22507C248178J29747m32949n88026n57085m45700k57138j70487j65910l8131m7352
22497F75147k6394N0724J5096o3363m6857j07531o0193k1423k3858m1168p1078
$$ plain form
22486 279102 301627 298324 317139 326320 370419 386836 416588 284111 214018 215818 158783 130470
22474 130470 151637 234272 399891 497315 550474 632111 729778 816372 863646 822963 731936
22463 731936 640784 580501 633602 571683 395210 310842 336920 345973 402346 479829 571151
22452 571151 543590 451474 384949 290783 217678 243614 205913 189096 181382 190093 153025 105987
22440 105987 140014 182906 213311 213704 140523 109131 128439 181594 204447 143885 184964 215336
22428 215336 236303 370326 511006 524525 528221 539806 530135 456111 338815 218858 135575
22417 135575 143015 159240 182947 226376 237582 244412 212874 194370 180896 251697 224604 189985
22405 189985 109592 115944 93441 25651 -3761 49744 60945 89088 37621 43834 106271 151572
$$ packed form
22486B79102K2525l303J8815R181M4099J6417K9752j32477p0093J800n7035k8313
22474A30470K1167Q2635J65619R7424N3159Q1637R7667Q6594M7274m0683r1027
22463G31936r1152o0283N3101o1919j76473q4368K6078R053N6373P7483R1322
22452E71151k7561r2116o6525r4166p3105K5936l7701j6817p714Q711l7068m7038
22440A05987L4027M2892L0405L93p3181l1392J9308N3155K2853o0562M1079L0372
22428B15336K0967J34023J40680J3519L696J1585r671p4024j17296j19957q3283
22417A35575P440J6225K3707M3429J1206O830l1538j8504j3474P0801k7093l4619
22405A89985q0393O352k2503o7790k9412N3505J1201K8143n1467O213O2437M5301
$$ plain form
22393 151572 151635 134267 163146 124295 77339 20008 -36100 -8402 -3590 14619 87631 100368
22381 100368 132022 115857 119392 92193 78827 93082 24587 13358 64509 64278 45954 29675
22369 29675 73021 72632 45934 19614 61509 82071 39638 9329 3871 25714 -47282 -98577
22357 -98577 -82012 -25965 16284 59182 109617 184764 207533 169683 156626 130227 62950 47073
22345 47073 34211 40424 -2284 33466 8967 -24478 2458 -28646 -15466 75807 95200 125245
22333 125245 143771 79884 53059 115365 113780 104064 153082 140796 91955 59103 78366 95784
22321 95784 162579 197861 104554 122280 163166 98716 39600 14606 93671 154064 193066 195789
22309 195789 174406 183768 168181 115487 110015 83092 68248 -20248 -54030 -55405 -25008 -21995
$$ packed form
22393A51572O3j7368K8879l8851m6956n7331n6108K7698M812J8209P3012J2737
22381A00368L1654j6165L535k7199j3366J4255o8495j1229N1151k31j8324j6279
22369B9675M3346l89k6698k6320M1895K0562m2433l0309n458K1843p2996n1295
22357i8577J6565N6047M2249M2898N0435P5147K2769l7850j3057k6399o7277j5877
22345D7073j2862O213m2708L5750k4499l3445K6936l1104J3180R1273J9393L0045
22333A25245J8526o3887k6825O2306j585r716M9018j2286m8841l2852J9263J7418
22321I5784O6795L5282r3307J7726M0886o4450n9116k4994P9065O0393L9002K723
22309A95789k1383R362j5587n2694n472k6923j4844q8496l3782j375L0397L013
$$ plain form
22297 -21995 66974 163260 129275 106042 44213 -3606 88518 122336 56514 -30464 -42325 243
22285 243 49711 101659 91867 51735 70269 97194 70420 84472 121490 79792 100083 114056
22273 114056 74715 57785 100372 180600 256999 311305 405186 486157 441064 296837 144361
22262 144361 68523 18372 -3118 -7329 -5973 23857 16309 12460 5664 41048 59439 16542
22250 16542 29546 85286 90255 103197 57868 50238 -2167 24442 52235 18128 -56575 -88226
22238 -88226 -18568 18571 -9941 -84018 -129830 466 50570 21373 47397 95060 113501
22227 113501 103329 105749 113675 36427 -33514 -51428 14949 -23933 -56752 -84039 -49275 -63664
22215 -63664 -58859 -101107 -35140 3390 -29772 -58325 18001 62600 15276 -47602 -14449 35616
$$ packed form
22297b1995Q8969R6286l3985k3233o1829m7819R2124L3818o5822q6978j1861M2568
22285B43M9468N1948r792m0132J8534K6925k6774J4052L7018m1698K0291J3973
22273A14056l9341j6930M2587Q0228P6399N4306R3881Q0971m5093j44227j52476
22262A44361p5838n0151k1490m211J356K9830p548l849o796L5384J8391m2897
22250A6542J3004N5740M969J2942m5329p630n2405K6609K7793l4107p4703l1651
22238h8226O9658L7139k8512p4077m5812J30296N0104k9197K6024M7663J8441
22227A13501j0172K420P926p7248o9941j7914O6377l8882l2819k7287L4764j4389
22215f3664M805m2248O5967L8530l3162k8553P6326M4599m7324o2878L3153N0065
$$ plain form
22203 35616 34094 41647 22674 -54544 -40183 -54264 -52228 -26543 5509 -66698 -167328 -153794
22191 -153794 -118307 -49881 -25735 -26172 -38734 -1708 5499 37868 31807 -6365 -43501 -23183
22179 -23183 -24366 -84878 -90851 -26426 95790 73343 7965 6989 64820 75189 58802 4108
22167 4108 -64999 -77960 -87557 -94323 -129914 -101485 -72938 -911 44909 65127 62920 72765 44413
22154 44413 53185 77010 75983 72550 52982 35662 -12438 -15291 8908 -550 2528 25751 34527
22141 34527 -16939 -97510 -29712 43283 -2939 -11715 -12229 4331 34373 46921 78736 44033
22129 44033 -38439 -87645 -128815 -55102 -100309 -116273 -102728 -9847 -10030 41015 88328 88833
22117 88833 101673 73515 -6332 -79448 -69344 -31850 15268 4068 19663 38718 -17093 -37129
$$ packed form
22203C5616j522P553j8973p7218J4361j4081K036K5685L2052p2207j00630J3534
22191a53794L5487O8426K4146m37j2562L7026P207L2369o061l8172l7136K0318
22179b3183j183o0512n973O4425J22216k2447o5378r76N7831J0369j6387n4694
22167D108o9107j2961r597o766l5591K8429K8547P2027M5820K0218k207R845k8352
22154D4413Q772K3825j027l433j9568j7320m8100k853K4199r458L078K3223Q776
22141C4527n1466q0571O7798P2995m6222q776n14J6560L0042J2548L1815l4703
22129D4033q2472m9206m1170P3713m5207j5964J3545R2881j83N1045M7313N05
22117H8833J2840k8158p9847p3116J0104L7494M7118j1200J5595J9055n5811k0036
$$ plain form
22105 -37129 5686 -48939 -13050 -4154 11629 51140 88183 38140 -66459 -94930 6813
22094 6813 11155 -11689 -35650 -53646 -59212 -24258 -6728 -27108 -58919 -62021 -82637 -99785
22082 -99785 -95390 -23125 -33850 -58451 -55211 -70696 -19282 -48334 -28642 49203 34335 -9780
22070 -9780 12812 33231 -28312 -27755 -39377 -62884 -33090 13434 27158 14131 -18314 56952
22058 56952 113291 77530 -2610 -17750 8781 43471 23877 17307 -13454 -9998 -51072 -56724
22046 -56724 -47331 -32289 -26634 -34437 -67819 -50716 525 31770 -3733 34493 36635 7144
22034 7144 47258 42703 87594 136077 142846 184957 269785 357083 559723 973375 1587483 2116641
22022 2116641 2566649 2770660 2523303 1984781 1433411 961411 657940 513719 398826
$$ packed form
22105c7129M2815n4625L5889Q896J5783L9511L7043n0043j04599k8471J01743
22094F813M342k2844k3961j7996n566L4954J7530k0380l1811l102k0616j7148
22082i9785M395P2265j0725k4601L240j5485N1414k9052J9692P7845j4868m4115
22070i780K2592K0419o1543N57j1622k3507K9794M6524J3724j3027l2445P5266
22058E6952N6339l5761q0140j5140K6531L4690j9594o570l0761L456m1074n652
22046e6724R393J5042N655p803l3382J7103N1241L1245l5503L8226K142k9491
22034G144M0114m555M4891M8483O769M2111Q4828Q7298K02640M13652O14108N29158
22022B116641M50008K04011k47357n38522n51370m72000l03471j44221j14893
$$ plain form
22013 398826 308745 213675 213007 234425 231932 184821 117318 144602 173483 77059 -21164 -43662
22001 -43662 39033 43868 -68899 -89310 -17914 -26535 -23899 -76638 -35062 -7771 -4485 5852
21989 5852 9299 20371 20678 33986 2990 27420 -27648 -55110 -55010 -40356 -48780 -20467 29838
21976 29838 -6508 -16365 -11455 -11655 -60074 -183093 -171785 -129968 -27383 8257 294 92328
21964 92328 122120 57170 69883 88984 62141 25173 6632 31274 46549 77722 20325 1488
21952 1488 9214 20775 15858 -55003 -111822 -34999 48843 36089 -35635 -71811 -63361 -51553
21940 -51553 -122997 -150865 -90233 -56296 -16211 29781 11779 -45577 -71953 -1678 -3528 -31236
21928 -31236 -44453 -18436 -69712 -46086 42571 62101 61985 2117 7030 47 27072 -22797
$$ packed form
22013C98826r0081r5070o68K1418k493m7111o7503K7284K8881r6424r8223k2498
22001d3662Q2695M835j12767k0411P1396q621K636n2739M1576K7291L286J0337
21989E852L447J1072L07J3308l0996K4430n5068k7462J00J4654q424K8313N0305
21976B9838l6346r857M910k00m8419j23019J1308M1817J02585L5640p963R2034
21964I2328K9792o4950J2713J9101k6843l6968j8541K4642J5275L1173n7397j8837
21952A488P726J1561m917p0861n6819P6823Q3842j2754p1724l6176Q450J1808
21940e1553p1444k7868O0632L3937M0085M5992j8002n7356k6376P0275j850k7708
21928c1236j3217K6017n1276K3626Q8657J9530j16n9868M913o983K7025m9869
$$ plain form
21916 -22797 -39404 -41832 46284 23008 -10860 25542 48276 39811 144994 111420 -7846 -61153
21904 -61153 -86712 -78072 -116133 -84413 15871 37109 -6705 10967 -2371 -25440 -92304 -93808
21892 -93808 -86325 -83335 -77515 -54039 -36937 -20447 -79425 -82131 3648 80355 -10976 -61142
21880 -61142 -42966 -36733 -38589 -71386 -22935 88983 85902 -18470 -30021 44511 -14254 -112059
21868 -112059 -94377 -81171 -76875 -38440 -44474 -74709 -62971 -22392 -30254 -18200 -40098 -30139
21856 -30139 -74913 -68295 -25640 -20323 33047 78930 127116 114584 51662 51338 35095 8585
21844 8585 98983 172960 161838 87357 100617 93440 88731 22664 -64422 -94782 -55312 -46631
21832 -46631 -6536 85528 185607 104742 -4531 -68089 -116027 -57336 -80635 -116978 -110931
$$ packed form
21916b2797j6607k428Q8116k3276l3868L6402K2734q465J05183l3574j19266n3307
21904f1153k5559Q640l8061L1720J00284K1238m3814J7672j3338k3069o6864j504
21892i3808P483K990N820K3476J7102J6490n8978k706Q5779P6707r1331n0166
21880f1142J8176O233j856l2797M8451J11918l081j04372j1551P4532n8765r7805
21868a12059J7682J3206M296L8435o034l0235J1738M0579p862J2054k1898R959
21856c0139m4774O618M2655N317N3370M5883M8186j2532o2922l24j6243k6510
21844H585R0398P3977j1122p4481J3260p177m709o6067q7086l0360L9470Q681
21832d6631M0095R2064J00079q0865j09273o3558m7938N8691k3299l6343O047
$$ plain form
21821 -110931 -53635 -65585 -113852 -93972 1763 -4732 -35698 -52033 -94947 -99341 -114605 -83189
21809 -83189 -35068 -19482 -41140 -12090 48031 132700 148903 81330 64552 103112 87990 23144
21797 23144 -27754 -56213 -69273 -28692 -102610 -157956 -93570 -12651 -4600 -50649 -105889 -128244
21785 -128244 -136753 -138728 -156121 -76552 -32004 -30722 5476 43858 36261 37860 44793 -1049 -13674
21772 -13674 1237 7729 25856 64142 70782 6639 -33356 -29818 6778 10447 30627 58366
21760 58366 99361 107547 36516 -47255 -85003 -80193 -26763 2343 80766 83189 70434 48843
21748 48843 58484 90342 55288 38063 -11656 -42321 -73444 -46236 3392 3470 -41188 -17987
21736 -17987 34565 34837 9875 -16711 -25168 -86105 -93248 -31304 55334 59935 -69190 -109249
$$ packed form
21821a10931N7296j1950m8267J9880R5735o495l0966j6335m2914m394j5264L1416
21809h3189M8121J5586k1658K9050O0121Q4669J6203o7573j6778L8560j5122o4846
21797B3144n0898k8459j3060M0581p3918n5346O4386Q0919Q051m6049n5240k2355
21785a28244q509j975j7393P9569M4548J282L6198L8382p597J599O933m5842j2625
21772a3674J4911O492J8127L8286O640o4143l9995L538L6596L669K0180K7739
21760E8366M0995Q186p1031q3771l7748M810N3430K9106P8423K423j2755k1591
21748D8843R641L1858l5054j7225m9719l0665l1123K7208M9628P8m4658K3201
21736a7987N2552K72k4962k6586q457o0937p143O1944Q6638M601j29125m0059
$$ plain form
21724 -109249 -32281 -46537 -131422 -105491 -83065 -89053 -69922 -56225 -5405 34243 57840 -19904
21712 -19904 -50646 -47764 -58975 -31431 -14003 -11497 -59037 -96928 -14095 25268 -6891 -43899
21700 -43899 -47926 -68993 -69440 -8045 46697 -291 -33401 -57592 -69641 -44234 -74152 -133588
21688 -133588 -167930 -172791 -160438 -23317 8161 -69817 -21170 -18596 -4717 11521 -38224 -51160
21676 -51160 -35032 -10518 -41304 -58951 -94885 -126990 -76509 -76816 -56976 -21619 7899 44911
21664 44911 33485 32832 29552 16779 46547 72324 89951 94104 51651 48553 55452 2642 6252
21651 6252 -10721 -7145 -24541 -43016 -46621 -60199 -77411 -159823 -185160 -105218 -25488 16923
21639 16923 26275 -4244 10092 1222 13273 11153 55209 103987 11977 -8060 -29157 -56633
$$ packed form
21724a09249P6968j4256q4885K5931K2426n988J9131J3697N0820L9648K3597p7744
21712a9904l0742K882j1211K7544J7428K506m7540l7891Q2833L9363l2159l7008
21700d3899m027k1067m47O1395N4742m6988l3110k4191j2049K5407k9918n9436
21688a33588l4342m861J2353J37121L1478p7978M8647K574J3879J6238m9745j2936
21676e1160J6128K4514l0786j7647l5934l2105N0481l07J9840L5357K9518L7012
21664D4911j1426o53l280j2773K9768K5777J7627M153m2453l098O899n2810L610
21651F252j6973L576j7396j8475l605j3578j7212q2412k5337P9942P9730M2411
21639A6923R352l0519J4336q870J2051k120M4056M8778r2010k0037k1097k7476
$$ plain form
21627 -56633 -55387 -60130 -62502 -49689 -31950 -136802 -97398 -62654 -58433 -77450 11696 -2702
21615 -2702 49549 34837 -38299 -113200 -91103 -82319 -36920 11496 57762 96570 28832 -4046
21603 -4046 -84355 -92759 -84019 -6262 25944 19744 -70510 -44076 -6034 28963 -13266 -68771
21591 -68771 -1537 16033 9973 18957 1292 -14962 -77502 -105609 -68921 -21719 57360 6261
21579 6261 -36913 33652 58743 61910 -1464 -2811 -26102 16444 67266 47555 44534 -4269
21567 -4269 -46068 -89746 -100572 -32109 24265 24434 22413 31310 108055 104580 51212 -2645 -20775
21554 -20775 20442 41895 60094 -26666 -102596 -139449 -166353 -52499 25884 -37143 -134041
21543 -134041 -122210 -74679 -37212 -51393 -4168 49016 74248 96703 84046 42971 48441 -49398
$$ packed form
21627e6633J246m743k372J2813J7739j04852L9404L4744M221j9017Q9146j4398
21615b702N2251j4712p3136p4901K2097Q784M5399M8416M6266L8808o7738l2878
21603d046q0309q404Q740P7757L2206o200r0254K6434L8042L4997m2229n5505
21591f8771O7234J7570o060Q984j7665j6254o2540k8107L6688M7202P9079n1099
21579F261m3174P0565K5091L167o3374j347k3291M2546N0822j9711l021m8803
21567d269m1799m3678j0826O8463N6374J69k021Q897P6745l475n3368n3857j8130
21554b0775M1217K1453J8199q6760p5930l6853k6904J13854P8383o3027r6898
21543a34041J1831M7531L7467j4181M7225N3184K5232K2455j2657m1075N470r7839
$$ plain form
21531 -49398 -39523 2862 43672 41446 7303 30081 44068 8668 -45900 -34250 14603 -22227
21519 -22227 -20801 -39527 -14399 -31670 45798 90118 17906 83303 61763 25400 12901 -12267
21507 -12267 -14867 -2468 -30902 -9271 28003 -9293 3080 -22992 -99435 -52331 34987 62111
21495 62111 -22513 -4641 -58289 -75726 -9091 18980 15222 31699 42666 137387 166390 164520
21483 164520 154756 135742 49472 6187 -11528 -5290 -23724 -80334 -8052 31563 35212 42118
21471 42118 -89044 -127232 -48087 -22752 -58987 -37883 7983 39055 7377 -26605 -67345
21460 -67345 -58749 -28426 48356 37560 44843 44564 72725 75214 80232 71865 44383 32895 -45019
21447 -45019 -12911 13369 -13967 -15885 -42953 -34190 -66674 -48077 -26400 -47021 -108715 -46885
$$ packed form
21531d9398R875M2385M0810k226l4143K2778J3987l5400n4568J1650M8853l6830
21519b2227J426j8726K5128j7271P7468M4320p2212O5397k1540l6363j2499k5168
21507a2267k600J2399k8434K1631L7274l7296J2373k6072p6443M7104Q7318K7124
21495F2111q4624J7872n3648j7437O6635K8071l758J6477J0967R4721K9003j870
21483A64520r764j9014q6270m3285j7715O238j8434n6610P2282L9615L649O906
21471D2118j31162l8188P9145K5335l6235K1104M5866L1072l1678l3982m0740
21460f7345Q596L0323P6782j0796P283k79K8161K489N018q367k7482j1488p7914
21447d5019L2108K6280k7336j918k7068Q763l2484J8597K1677k0621o1694O1830
$$ plain form
21435 -46885 -15962 -59522 -84751 -48814 -47352 -822 29490 -28255 -71713 -11434 34539 95859
21423 95859 93515 45568 58736 3194 15887 -3402 11877 31118 57534 78321 92602 105762
21411 105762 122687 44172 10315 27856 -24074 -70890 -81692 -30750 77664 163618 110947
21400 110947 80024 77402 5083 -8823 61077 57338 25480 46604 3498 2533 -47077 -40319
21388 -40319 15386 11873 19925 84771 79764 61646 17430 -16679 -40290 -11366 -21136 -89244
21376 -89244 -115180 -203030 -158222 -86378 -48738 -6665 -54953 -73602 -72386 -8999 -12509 25518
21364 25518 -15684 -96941 -138989 -136977 -41490 62928 40798 -25183 -78835 -60506 -43055 -45421
21352 -45421 -54978 -12999 1804 79708 91806 67388 -10576 -72240 -67698 -39124 -44557 -64947
$$ packed form
21435d6885L0923m3560k5229L5937J462M6530L0312n7745m3458O0279M5973O1320
21423I5859k344m7947J3168n5542J2693j9289J5279J9241K6416K0787J4281J3160
21411A05762J6925p8515l3857J7541n1930m6816j0802N0942J08414Q5954n2671
21400A10947l0923k622p2319j3906O9900l739l1858K1124m3106r65m9610O758
21388d0319N5705l513Q052O4846n007j8118m4216l4109k3611K8924r770o8108
21376h9244k5936q7850M4808P1844L7640M2073m8288j8649J216O3387l510L8027
21364B5518m1202q1257m2048K012R5487J04418k2130o5981n3652J8329J7451k366
21352d5421r557M1979J4803P7904J2098k4418p7964o1664M542K8574n433k0390
$$ plain form
21340 -64947 -1912 72556 52367 23147 51077 -34657 -70435 2557 13370 -16172 -21960 58024
21328 58024 66449 74846 57684 809 6007 -15628 9353 1513 15829 -15067 -109795 -69381
21316 -69381 -14443 -52061 -68234 10258 17083 -6906 -59428 5214 43967 -45579 -60081 -102913
21304 -102913 -125607 -98107 -98979 -138225 -188803 -187874 -164734 -66907 -2475 2162 -14593 -60304
21292 -60304 -61725 -14920 -27901 -5131 61835 104698 26210 -45286 6083 72461 108878 27888
21280 27888 -55038 -46327 -27383 -31232 -20667 56998 -31342 -83971 -46888 -94491 -118340 -52181
21268 -52181 -78746 -61689 7357 4706 -12551 6321 45549 -6233 -25041 -16825 35356 91789
21256 91789 89989 94226 68811 75658 56090 -1869 -15734 -59459 7491 66737 29309 25855
$$ packed form
21340f4947O3035P4468k0189k9220K7930q5734l5778P2992J0813k9542n788P9984
21328E8024Q425Q397j7162n6875N198k1635K4981p840J4316l0896r4728M0414
21316f9381N4938l7618j6173P8492O825k3989n2522O4642L8753q9546j4502m2832
21304a02913k2694K7500q72l9246n0578R29K3140R7827O4432M637j6755m5711
21292f0304j421M6805j2981K2770O6966M2863p8488p1496N1369O6378L6417q0990
21280B7888q2926Q711J8944l849J0565P7665q8340n2629L7083m7603k3849O6159
21268e2181k6565J7057O9046k651j7257J8872L9228n1782j8808Q216N2181N6433
21256I1789j800M237k5415O847j9568n7959j3865m3725O6950N9246l7428l454
$$ plain form
21244 25855 36491 8808 -21924 -5150 75806 98345 18325 -3160 28923 -5889 -57526 -72570
21232 -72570 -101077 -116635 -36686 32824 24844 71133 32738 -20636 -10849 -4684 -39717 -79843
21220 -79843 -77326 -41176 -5015 -28481 -95829 -117944 -17707 30290 -38386 -94630 -5666 26048
21208 26048 -39521 -13173 64692 47633 76700 82709 59472 87175 28657 72885 152408 91750
21196 91750 3709 6588 -7872 -92136 -169321 -129231 -6411 59086 63719 34881 43488 12839
21184 12839 -7345 -26083 -29656 -5011 -15816 -6724 23883 5492 20919 8778 42315 73029
21172 73029 59439 55172 67782 32671 -32755 -42963 -94113 -143778 -123736 -135853 -174433 -136926
21160 -136926 -72278 -41066 -8230 95168 150522 117636 103005 60640 24885 -11778 -8375
$$ packed form
21244B5855J0636k7683l0732J6774Q0956K2539q0020k1485L2083l4812n1637j5044
21232g2570k8507j5558P9949O9510p980M6289l8395n3374R787O165l5033m0126
21220g9843K517L6150L6161k3466o7348k2115J00237M7997o8676n6244Q8964L1714
21208B6048o5569K6348P7865j7059K9067O009k3237K7703n8518M4228P9523o0658
21196I1750q8041K879j4460q4264p7185M0090J22820O5497M633k8838Q607l0649
21184A2839k0184j8738l573K4645j0805R092L0607j8391J5427j2141L3537L0714
21172G3029j3590m267J2610l5111o5426j0208n1150m9665K0042j2117l8580L7507
21160a36926O4648L1212L2836J03398N5354l2886j4631m2365l5755l6663L403
$$ plain form
21149 -8375 -919 17786 -37827 -101537 -117916 -75573 -51070 -9999 -30465 -74646 -67044 -40636
21137 -40636 11215 7344 -55458 -52084 -79586 -75336 -22890 -18641 -29139 -65777 -101604 -60681
21125 -60681 -106155 -99667 -66728 -2131 -19316 -68452 -80052 -76658 -36509 25927 81743 82265
21113 82265 64826 47144 13500 22166 -38593 -44780 -37979 -7772 20074 71832 53121 -3470
21101 -3470 -19986 18409 -36257 -18726 56586 78319 33708 -32847 -105572 -59536 -21383 43020
21089 43020 37309 34053 28772 -5857 -51266 -69367 -56502 -79736 -77931 -60846 -75061 -21759
21077 -21759 34490 83643 74423 90210 79250 96344 75703 112893 89109 -6581 -36071 2584
21065 2584 47726 25637 -12631 -4942 28375 48224 43802 42707 27293 495 -6318 2446 -6411
$$ packed form
21149h375P456J8705n5613o3710j6379M2343K4503M1071k0466m4181P602K6408
21137d0636N1851l871o2802L374k7502M250N2446M249j0498l6638l5827M0923
21125f0681m5474O488L2939O4597j7185m9136j1600L394M0149O2436N5816N22
21113H2265j7439j7682l3644Q666o0759o187O801L0207K7846N1758j8711n6591
21101c470j6516L8395n4666J7531P5312K1733m4611o6555p2725M6036L8153O4403
21089D3020n711l256n281l4629m5409j8101J2865k3234J805J7085j4215N3302
21077b1759N6249M9153r220J5787j0960J7094k0641L7190k3784r5690k9490L8655
21065B584M5142k2089l8268P689L3317J9849m422j095j5414k6798o813Q764q857
$$ plain form
21052 -6411 46464 152032 164910 105964 103258 37707 3456 -7849 -20296 15567 -24452 -42794
21040 -42794 -18655 -11522 -11781 16236 -25570 -120607 -102344 47093 90352 51144 25522 -55122
21028 -55122 -81990 -116424 -89717 9671 100067 66295 78684 38637 65977 87508 109587 126099
21016 126099 131442 155344 207269 253142 310921 396759 491833 543371 570716 721213 893970
21005 893970 1181819 1522618 1901241 2118681 2062103 1792881 1485585 1154800 865230 670698
20995 670698 506334 395643 371333 342914 333220 281558 202257 128676 150945 224537 221096
20984 221096 136863 82156 26291 21976 63016 46371 -4484 -117462 -141433 -29437 83663
20973 83663 80575 96597 129331 193451 105189 18698 52440 81137 89116 151480 130643 71072
$$ packed form
21052f411N2875J05568J2878n8946k706o5551l4251j1305j2447L5863m0019j8342
21040d2794K4139P133k59K8017m1806r5037J8263J49437M3259l9208k5622q0644
21028e5122k6868l4434K6707R9388R0396l3772J2389m0047K7340K1531K2079J6512
21016A26099N343K3902N1925M5873N7779Q5838R5074N1538K7345J50497J72757
21005H93970K87849L40799L78623K17440n6578k69222l07296l30785k89570j94532
20995F70698j64364j10691k4310k8419r694n1662p9301p3581K2269P3592l441
20984B21096q4233n4707n5865m315M1040j6645n0855j12978k3971J11996J13100
20973H3663l088J6022L2734O4120q8262q6491L3742K8697P979O2364k0837n9571
$$ plain form
20961 71072 63640 18651 -6652 15503 50873 95386 84303 89639 70084 -2053 -24226 170
20949 170 -53598 -133225 -138475 -124248 -127233 -35102 55859 18595 -20425 -30032 23163 63533 -10443
20936 -10443 -50377 -5355 -15425 -67622 -50348 7748 -18667 -120189 -111178 -34357 -58251 -36279
20924 -36279 15251 26553 31387 15492 -61949 -44029 -46591 -46452 -103382 -43295 18923 -13731
20912 -13731 -68554 -106482 -59918 -23291 -86882 -78631 -69652 27755 74573 38647 7271 -38775
20900 -38775 -15040 -14008 -16833 -30889 13654 31017 16564 41184 111513 81769 87837 49838
20888 49838 54508 46365 3829 -39277 51577 102677 131795 124605 109123 54010 -13861 -59863
20876 -59863 -29644 -4965 -44577 -23901 35210 42809 -38166 -45600 19058 25024 18530 90807
$$ packed form
20961G1072p432m4989k5303K2155L5370M4513j1083N336j9555p2137k2173K4396
20949A70n3768p9627n250J4227k985R2131R0961l7264l9020r607N3195M0370p3976
20936a0443l9934M5022j0070n2197J7274N8096k6415j01522R011P6821k3894K1972
20924c6279N1530J1302M834j5895p7441J7920k562J39n6930O0087O2218l2654
20912a3731n4823l7928M6564L6627o3591Q251Q979R7407M6818l5926l1376m6046
20900c8775K3735J032k825j4056M4543J7363j4453K4620P0329k9744O068l7999
20888D9838M670q143m2536m3106R0854N1100K9118p190j5482n5113o7871m6002
20876e9863L0219K4679l9612K0676N9111P599q0975p434O4658N966o494P2277
$$ plain form
20864 90807 91309 -38118 5619 16398 -17488 -26280 45110 94188 135711 80436 32073 -37026
20852 -37026 -76013 -14801 33116 59430 43195 91783 103026 65360 41604 68306 88192 80431
20840 80431 82898 5048 -43857 -32041 -53698 -19656 -3635 -62701 -22777 -11698 -5491 -38789
20828 -38789 -129203 -131649 -64666 -89883 -29562 42396 53413 73014 102221 11461 -54895 -51364
20816 -51364 -46341 -35116 -67008 -20056 -66611 -96069 -107246 -112337 -138250 -135922 -91003 -3175
20804 -3175 1746 44592 96060 41395 11395 69652 61843 112751 168901 145853 105039 28630
20792 28630 -16511 35257 60069 81501 116861 92474 -39 -14636 89307 22713 2064
20781 2064 41847 34122 5422 20395 -7477 17109 -31078 -103647 -80069 -39161 -47675 -18723
$$ packed form
20864I0807N02j29427M3737J0779l3886q792P1390M9078M1523n5275m8363o9099
20852c7026l8987O1212M7917K6314j6235M8588J1243l7666k3756K6702J9886p761
20840H0431K467p7850m8905J1816k1657L4042J6021n9066L9924J1079O207l3298
20828c8789r0414k446O6983k5217O0321P1958J1017J9601K9207r0760o6356L531
20816e1364N023J1225l1892M6952m6555k9458j1177n091k5913K328M4919Q7828
20804c175M921M2846N1468n4665l0000N8257p809N0908N6150k3048m0814p6409
20792B8630m5141N1768K4812K1432L5360k4387r2513j4597J03943o6594k0649
20781B064L9783p725k8700J4973k7872K4586m8187p2569K3578M0908q514K8952
$$ plain form
20769 -18723 -8004 -11262 80389 77663 91502 163933 140543 44529 29437 68449 51086 -9810
20757 -9810 -28067 5778 62747 5283 -75698 -101029 -32046 24360 -24851 -30554 10032 47186
20745 47186 63157 95991 54507 26714 14524 24416 100105 125289 58565 74742 47555 2927
20733 2927 -25356 -39262 -52007 24466 76044 14039 61814 108084 119881 127840 108254 96926
20721 96926 88260 140186 127796 99714 131176 86159 14068 31607 19106 60947 61331 40852
20709 40852 74160 64857 46659 21128 68815 71020 66941 80794 99129 43823 19484 2931
20697 2931 45681 91062 98516 47671 88872 80668 27672 -14114 -539 -38252 -79270 -76839
20685 -76839 -32013 42278 20047 61281 63422 48760 80467 55290 6779 -60821 -128529 -75880
$$ packed form
20769a8723J0719l258R1651k726J3839P2431k3390r6014j5092L9012j7363o0896
20757i810j8257L3845N6969n7464q0981k5331O8983N6406m9211n703M0586L7154
20745D7186J5971L2834m1484k7793j2190R892P5689K5184o6724J6177k7187m4628
20733B927k8283j3906j2745P6473N1578o2005M7775M6270J1797P959j9586j1328
20721I6926q666N1926j2390k8082L1462m5017p2091J7539j2501M1841L84k0479
20709D0852L3308r303j8198k5531M7687K205m079J3853J8335n5306k4339j6553
20697B931M2750M5381P454n0845M1201q204n2996m1786J3575l7713m1018K431
20685g6839M4826P4291k2231M1234K141j4662L1707k5177m8511o7600o7708N2649
$$ plain form
20673 -75880 -39724 -62889 -41962 6858 82235 108324 84018 166856 142772 -9905 -24751
20662 -24751 15706 36958 53336 33102 53389 36720 21569 72650 145498 81258 -2867 -35316
20650 -35316 -34036 33866 5156 70202 95751 105263 51149 20010 49916 127441 182328 224013
20638 224013 212819 217177 162935 129035 115073 93870 75476 52223 19584 13477 99970 101000
20626 101000 61428 98133 79838 38921 66857 140463 273226 273079 170946 122186 199828
20615 199828 284318 281192 243476 135705 139679 121329 177707 168770 129249 117293 105919 150626
20603 150626 99105 54730 123662 166727 182774 130032 113047 60267 69773 97389 203943
20592 203943 269224 287305 228810 203470 230114 177956 149107 191912 127744 112594 179293
$$ packed form
20673g5880L6156k3165K0927M8820P5377K6089k4306Q2838k4084j52677j4846
20662b4751M0457K1252J6378k0234K0287j6669j5151N1081P2848o4240q4125l2449
20650c5316J280O7902k8710O5046K5549R512n4114l1139K9906P7525N4887M1685
20638B24013j1194M358n4242l3900j3962k1203j8394k3253l2639o107Q6493J030
20626A01000l9572L6705j8295m0917K7936P3606J32763j47j02133m8760P7642
20615A99828Q4490l126l7716j07771L974j8350N6378q937l9521j1956j1374M4707
20603A50626n1521m4375O8932M3065J6047n2742j6985n2780R506K7616J06554
20592B03943O5281J8081n8495k5340K6644n2158k8849M2805o4168j5150O6699
$$ plain form
20581 179293 189466 185403 223512 236557 223408 248205 304615 276197 220880 193268 150674 115835
20569 115835 29611 -52004 -39255 -664 5974 -13344 -19049 55521 73726 72268 106977 129235
20557 129235 128732 202156 212296 176085 140038 143793 159123 129468 103545 65394 91715 126048
20545 126048 113215 80757 47595 90590 115301 89757 61415 87337 163903 186763 178349 161182
20533 161182 157249 129671 75952 -18127 -68754 -36163 46264 125769 144038 134714 115164 134759
20521 134759 202128 195998 213425 177986 156990 93955 120346 157911 185486 140235 112270 121038
20509 121038 197323 277684 236954 157235 238012 250830 197084 170686 191547 191748 205648 128839
20497 128839 163041 187545 165099 68056 92821 95355 89244 155691 219321 247500 178719 132911
$$ packed form
20581A79293J0173m063L8109J3045j3149K4797N6410k8418n5317k7612m2594l4839
20569A15835q6224q1615J2749L8591O638j9318n705P4570J8205j458L4709K2258
20557A29235n03P3424J0140l6211l6047L755J5330k9655k5923l8151K6321L4333
20545A26048j2833l2458l3162M2995K4711k5544k8342K5922P6566K2860q414j7167
20533A61182l933k7578n3719r4079n0627L2591Q2427P9505J8269r324j9550J9595
20521A34759O7369o130J7427l5439k0996o3035K6391L7565K7575m5251k7965Q768
20509A21038P6285Q0361m0730p9719Q0777J2818n3746k6398K0861K01J3900p6809
20497A28839L4202K4504k2446r7043K4765K534o111O6447O3630K8179o8781m5808
$$ plain form
20485 132911 159440 113162 55815 137538 247606 311568 309992 232283 174948 147058 145761 133827
20473 133827 147687 152193 147855 236722 231126 261855 278948 283103 330340 365357 393592 339808
20461 339808 302355 326463 318861 287672 274077 307470 307326 301174 334273 326982 385233 438879
20449 438879 437088 478643 538147 500455 494525 514226 595825 584010 535142 480934 447788 512796
20437 512796 558170 602198 627604 622482 638636 664727 654187 591509 545350 569599 544525 535421
20425 535421 556067 583550 668736 669966 603046 623660 636974 664206 705634 705704 753834 762208
20413 762208 737558 677595 656073 772211 874347 922624 932942 884704 877640 966402 1066241
20402 1066241 1047015 995515 1020786 1053095 1089025 1104152 1187350 1150163 1150070 1203020 1320791 1421690
$$ packed form
20485A32911K6529m6278n7347Q1723J10068O3962j576p7709n7335k7890j297j1934
20473A33827J3860M506m338Q8867n596L0729J7093M155M7237L5017K8235n3784
20461C39808l7453K4108p602l1189j3595L3393j44o152L3099p291N8251N3646
20449D38879j791M1555N9504l7692n930J9701Q1599j1815m8868n4208l3146O5008
20437E12796M5374M4028K5406n122J6154K6091j0540o2678m6159K4249k5074r104
20425E35421K0646K7483Q5186J230o6920K0614J3314K7232M1428P0M8130Q374
20413G62208k4650n9963k1522J16138J02136M8277J0318m8238p064Q8762R9839
20402A066241j9226n1500K5271L2309L5930J5127Q3198l7187r3N2950J17771J00899
$$ plain form
20390 1421690 1508768 1642689 1701861 1738371 1799835 1803896 1839757 1963104 2128453 2264325 2580438
20379 2580438 2976660 3414304 3911655 4373051 4850381 5246031 5476385 5467658 5341283 5261990
20369 5261990 5305280 5501691 5776046 6048488 6404971 6854602 7147396 7333998 7460691 7688635
20359 7688635 8087004 8574279 9238504 10049743 11045749 12264891 13743418 15560295 17748791
20350 17748791 20355380 23577331 27583403 32613780 39206763 47975946 59894116 76346762
20342 76346762 99528399 132573854 178749765 238276011 303659567 359083269 386764122
20335 386764122 375993339 331450523 269414936 207984624 158312332 121875975 95799988
20328 95799988 77027186 63312259 52867943 44783555 38444898 33292034 29110838 25692652
$$ packed form
20390A421690Q7078J33921N9172L6510O1464M061L5861J23347J65349J35872L16113
20379B580438L96222M37644M97351M61396M77330L95650K30354q727j26375p9293
20369E261990M3290J96411K74355K72442L56483M49631K92794J86602J26693K27944
20359G688635L98369M87275O64225Q11239R96006J219142J478527J816877K188496
20350A7748791K606589L221951M006072N030377O592983Q769183J1918170J6452646
20342G6346762K3181637L3045455M6175911N9526246O5383556N5423702K7680853
20335C86764122j0770783m4542816o2035587o1430312m9672292l6436357k6075987
20328I5799988j8772802j3714927j0444316q084388o338657n152864m181196l418186
$$ plain form
20320 25692652 22968265 20700333 18796963 17148923 15636857 14303239 13174356 12171245
20312 12171245 11296765 10548206 9892410 9388611 8953675 8589943 8210082 7751525 7305443
20303 7305443 7066123 6985247 6974301 7086394 7250729 7332338 7221534 6764296 6092794 5496468
20293 5496468 4982363 4576239 4213591 3924279 3535496 3127022 2885436 2722443 2568261
20284 2568261 2414354 2306110 2157892 2046442 1972379 2014083 2104757 2199111 2287650 2384390
20274 2384390 2384029 2277310 2116948 1904464 1697892 1560347 1432013 1376441 1295114 1213930
20264 1213930 1200473 1099123 1064845 993405 914245 864109 869772 898824 849436 879234 911506
20253 911506 923341 910965 870240 856676 853589 829365 745067 779072 850126 763328 719984 683028
$$ packed form
20320B5692652k724387k267932j903370j648040j512066j333618j128883j003111
20312A2171245q74480p48559o55796n03799m34936l63732l79861m58557m46082
20303G305443k39320q0876j0946J12093J64335Q1609j10804m57238o71502n96326
20293E496468n14105m06124l62648k89312l88783m08474k41586j62993j54182
20284B568261j53907j08244j48218j11450p4063M1704R0674R4354Q8539R6740
20274B384390l61j06719j60362k12484k06572j37545j28334n5572q1327q1184
20264A213930j3457j01350l4278p1440p9160n0136N663K9052m9388K9798L2272
20253I11506J1835j2376m0725j3564l087k4224q4298L4005P1054q6798m3344l6956
$$ plain form
20241 683028 579095 528608 526440 543707 494883 436048 397167 445367 449611 440525 461006 489549
20229 489549 476871 440716 415552 480869 496823 525160 532637 511283 564648 542847 595452 595127
20217 595127 538419 495985 502331 475968 529813 583756 608389 623337 539677 479534 480280 479349
20205 479349 539372 539722 496522 497178 463419 469443 514046 523069 520948 527225 621642 677083 718770
20192 718770 674545 676821 631092 707237 742925 720055 649787 571408 507008 526937 617881 629585
20180 629585 746184 908586 988334 1015841 1029287 1021413 904973 853722 768601 642358 654235
20169 654235 687444 613735 605287 657524 727702 786416 858988 916256 955110 1108674 1328796
20158 1328796 1542413 1769315 2068947 2211196 2218692 2112399 1935054 1626683 1320649 1054852
$$ packed form
20241F83028j03933n0487k168J7267m8824n8835l8881M8200M244r086K0481K8543
20229D89549j2678l6155k5164O5317J5954K8337P477k1354N3365k1801N2605l25
20217E95127n6708m2434O346k6363N3845N3943K4633J4948q3660o0143P46r31
20205D79349O0023L50m3200O56l3759O024M4603R023k121O277R4417N5441M1687
20192G18770m4225K276m5729P6145L5688k2870p0268p8379o4400J9929R0944J1704
20180F29585J16599J62402P9748K7507J3446p874j16440n1251q5121j26243J1877
20169F54235L3209p3709q448N2237P0178N8714P2572N7268L8854J53564K20122
20158A328796K13617K26902K99632J42249P496j06293j77345l08371l06034k65797
$$ plain form
20148 1054852 900823 789174 766540 718940 638001 630251 650443 663131 712842 786327 796177
20137 796177 766568 705074 613439 560097 549060 544082 521850 485313 402432 431874 558828
20126 558828 659866 770647 926547 1068058 1168847 1194771 1131298 1056225 914527 801007
20116 801007 792792 875281 938386 989986 1064515 1185099 1236210 1205405 1143107 1129598 1080175
20105 1080175 1025238 983232 941070 952126 966779 1018527 1105738 1080715 1029682 868987 750110
20094 750110 646762 457045 356643 346010 338883 336691 296362 327077 322393 335939 332198 291224
20082 291224 326701 332212 320891 320216 329047 304416 204996 125253 105418 185995 158690 142555
20070 142555 190587 228145 167357 137303 180809 217310 223290 212582 188183 105142 110785 171169
$$ packed form
20148A054852j54029j11649k2634m7600q0939p750K0192J2688M9711P3485R850
20137G96177k9609o1494r1635n3342j1037m978k2232l6537q2881K9442J26954
20126E58828J01038J10781J55900J41511J00789K5924o3473p5073j41698j13520
20116H01007q215Q2489O3105N1600P4529J20584N1111l0805o2298j3509m9423
20105A080175n4937m2006m2162J1056J4653N1748Q7211k5023n1033j60695j18877
20094G50110j03348j89717j00402j0633p127k192m0329L0715m684J3546l741m0974
20082B91224L5477N511j1321o75Q831k4631r9420p9743j9835Q0577k7305j6135
20070A42555M8032L7558o0788l0054M3506L6501N980j0708k4399q3041N643O0384
$$ plain form
20058 171169 223918 221272 168786 145090 139909 115408 107109 165755 203469 201537 188723 165528
20046 165528 179840 196527 175672 222376 244147 216584 209204 242222 185172 187478 160807 137742
20034 137742 149577 160587 157793 183578 202191 248173 212720 211497 199352 213931 192475 195186
20022 195186 181913 156778 160946 193015 206743 223971 221960 177718 122538 185498 203094 176850
20010 176850 133029 90177 60787 85433 180490 208316 248685 243823 130398 131595 178727 165480
19998 165480 143353 195243 259701 259237 242769 241087 216456 240743 315369 306254 216050 193188
19986 193188 228111 252130 267649 277082 185201 144215 161756 152468 79563 75648 164986 201336
19974 201336 192773 115658 37766 59934 64427 74890 2214 -31480 27158 150257 131388 85300
$$ packed form
20058A71169N2749k646n2486k3696n181k4501q299N8646L7714j932j2814k3195
20046A65528J4312J6687k0855M6704K1771k7563p380L3018n7050K306k6671k3065
20034A37742J1835J1010k794K5785J8613M5982l5453j223j2145J4579k1456K711
20022A95186j3273k5135M168L2069J3728J7228k011m4242n5180O2960J7596k6244
20010A76850m3821m2852k9390K4646R5057K7826M0369m862j13425J197M7132j3247
19998A65480k2127N1890O4458m64j6468j682k4631K4287P4626r115r0204k2862
19986A93188L4923K4019J5519R433r1881m0986J7541r288p2905l915Q9338L6350
19974B01336q563p7115p7892K2168M493J0463p2676l3694N8638J23099j8869m6088
$$ plain form
19962 85300 127319 209118 251269 246132 226192 195075 160687 150024 151240 226186 214078 196955
19950 196955 275257 237068 126382 126393 181338 241933 218480 156534 144844 166389 168755 162160
19938 162160 162558 187995 198452 131250 81687 110041 114861 147046 133849 202380 191369 181596
19926 181596 145210 76055 87367 159889 140624 98734 120446 162966 187051 142365 138276 178878
19914 178878 152618 138670 102726 93098 142872 219704 210022 170473 103430 40971 47231 73732
19902 73732 121882 195801 173752 152968 209630 224637 203976 209298 165377 160295 158099 207998
19890 207998 236340 225250 231406 260509 265038 185661 204686 183266 196763 186714 196843 224384
19878 224384 246950 245159 228451 257182 254474 262812 214207 236133 275883 300616 273419 172078
$$ packed form
19962H5300M2019Q1799M2151n137j9940l1117l4388j0663J216P4946j2108j7123
19950A96955P8302l8189j10686J1N4945O0595k3453o1946j1690K1545K366o595
19938A62160L98K5437J0457o7202m9563K8354M820L2185j3197O8531j1011r773
19926A81596l6386o9155J1312P2522j9265m1890K1712M2520K4085m4686m089M0602
19914A78878k6260j3948l5944r628M9774P6832r682l9549o7043o2459O260K6501
19902G3732M8150P3919k2049k0784N6662J5007k0661N322m3921n082k196M9899
19890B07998K8342j1090O156K9103M529p9377J9025k1420J3497j0049J0129K7541
19878B24384K2566j791j6708K8731k708Q338m8605K1926L9750K4733k7197j01341
$$ plain form
19866 172078 241641 252376 262882 244698 235627 277752 357809 347542 328945 398405 346502 331076
19854 331076 373389 431351 431510 404695 404885 402094 340463 330524 397210 454697 450487 448805 499048
19841 499048 600854 664357 753393 735755 702349 647024 628167 690130 758378 745527 732615
19830 732615 646392 594546 525372 496929 565326 595267 635679 747415 771769 696925 581131
19819 581131 538466 591086 627339 625452 563256 409602 308216 278813 299076 286728 201615
19808 201615 163679 148088 151719 126761 121761 157672 122002 171348 172523 229590 333824 403648
19796 403648 382383 397324 414001 407758 486807 549672 588253 634020 714338 780244 810632 851353
19784 851353 805335 858050 935027 893084 784087 698610 749449 741486 819543 879820 914589
$$ packed form
19866A72078O9563J0735J0506j8184r071M2125Q0057j0267j8597O9460n1903j5426
19854C31076M2313N7962J59k6815J90k791o1631r939O6686N7487m210j682N0243
19841D99048J01806O3503Q9036j7638l3406n5325j8857O1963O8248j2851j2912
19830G32615q6223n1846o9174k8443O8397K9941M0412J11736K4354p4844j15794
19819E81131m2665N2620L6253j887o2196j53654j01386k9403K0263j2348q5113
19808B01615l7936j5591L631k4958n000L5911l5670M9346J175N7067J04234O9824
19796D03648k1265J4941J6677o243P9049O2865L8581M5767Q0318O5906L0388M0721
19784H51353m6018N2715P6977m1943j08997q5477N0839p963P8057O0277L4769
$$ plain form
19773 914589 946681 993698 992016 874565 858841 850302 883674 1003133 1045161 863009 712874
19762 712874 679766 641447 626535 645656 642488 584389 559478 515822 521593 527652 460158 410030
19750 410030 414002 465624 463933 441952 386262 386775 338791 355194 317149 201097 216564 280270
19738 280270 315827 325380 341544 312522 331007 319725 359714 400826 396032 336318 335248 343355
19726 343355 333154 295283 329604 434880 457059 497273 472540 384074 385358 437394 468996
19715 468996 488780 444761 384550 387663 357385 353664 381498 432146 413892 416725 466438 520259
19703 520259 504825 459286 501693 478357 507675 535716 621343 641080 583464 603506 537383
19692 537383 604152 654365 609364 618495 642817 659550 755318 822614 900971 1002446 1001008 1034677
$$ packed form
19773I14589L2092M7017j682j17451j5724q539L3372J19459M2028j82152j50135
19762G12874l3108l8319j4912J9121l168n8099k4911m3656N771O059o7494n0128
19750D10030L972N1622j691k1981n5690N13m7984J6403l8045j16052J5467O3706
19738B80270L5557R553J6164k9022J8485j1282L9989M1112m794n9714j070Q107
19726C43355j0201l7871L4321J05276K2179M0214k4733q8466J284N2036L1602
19715D68996J9784m4019o0211L113l0278l721K7834N0648j8254K833M9713N3821
19703E20259j5434m5539M2407k3336K9318K8041Q5627J9737n7616K0042o6123
19692E37383O6769N0213m5001R131K4322J6733R5768O7296P8357J01475j438L3669
$$ plain form
19680 1034677 1132534 1153204 1237175 1315315 1353660 1345042 1307054 1228080 1167527 1201974 1383775
19669 1383775 1542493 1758170 1898104 2001098 2133564 2357255 2631985 2845792 2914887 2778884
19659 2778884 2471734 2161161 1875221 1623989 1436410 1338406 1260688 1224349 1284138 1255743
19649 1255743 1197591 1088679 1086836 1124044 1149011 1153301 1161914 1180012 1257442 1354654 1435193 1470737
19637 1470737 1597907 1726016 1705393 1742729 1841637 2038452 2289129 2602664 2926478 3261207
19627 3261207 3580075 3788877 4078538 4481988 4974690 5519097 6063018 6527548 6895321
19618 6895321 7171435 7601406 8164116 9133983 10605186 12714360 15641906 19780667 26198735
19609 26198735 36881824 53882727 75019757 93463218 108018319 115997128 115372066
$$ packed form
19680A034677R7857K0670Q3971P8140L8345q618l7988p8974o0553L4447J81801
19669A383775J58718K15677J39934J02994J32466K23691K74730K13807O9095j36003
19659B778884l07150l10573k85940k51232j87579r8004p7718l6339N9789k8395
19649A255743n8152j08912j843L7208K4967M290Q613J8098P7430R7212Q0539L5544
19637A470737J27170J28109k0623L7336R8908J96815K50677L13535L23814L34729
19627C261207L18868K08802K89661M03450M92702N44407N43921M64530L67773
19618F895321K76114M29971N62710R69867J471203K109174K927546M138761O418068
19609B6198735J0683089J7000903K1137030J8443461J4555101P978809o25062
$$ plain form
19602 115372066 110266697 101500816 90927313 89952396 102164753 118965834 134649229
19595 134649229 149143752 160099970 171197309 179640378 176790054 168615164 157556728
19588 157556728 144245149 130917458 114642193 101760455 103221181 116068969 128552748
19581 128552748 137257604 138287005 129101888 115216776 96405786 71728448 51067483
19574 51067483 38207730 30495012 25449852 21696475 18758107 16593123 14878368 13455779
19566 13455779 12170502 11155981 10291147 9582924 8899043 8319053 7777119 7151612 6540623
19557 6540623 6012786 5600032 5342261 5084212 4849890 4652163 4596120 4600939 4585230 4577463
19547 4577463 4641531 4702371 4771791 4793743 4675077 4563534 4432498 4374744 4411786 4540046
$$ packed form
19602A15372066n105369q765881j0573503r74917J2212357J6801081J5683395
19595A34649229J4494523J0956218J1097339Q443069k850324q174890j1058436
19588A57556728j3311579j3327691j6275265j2881738J460726J2847788J2483779
19581A28552748Q704856J029401r185117j3885112j8810990k4677338k0660965
19574E1067483j2859753p712718n045160l753377k938368k164984j714755j422589
19566A3455779j285277j014521q64834p08223o83881n79990n41934o25507o10989
19557F540623n27837m12754k57771k58049k34322j97727n6043M819j5709p767
19547D577463O4068O0840O9420K1952j18666j11543j31036n7754L7042J28260
$$ plain form
19537 4540046 4734554 4881127 4998564 5083716 5029922 5004227 5121971 5276996 5519519 5839217
19527 5839217 6170046 6617986 7112484 7736532 8557280 9412588 10125474 10765939 11334264
19518 11334264 11948655 12670221 13506621 14451815 15631359 17234594 19310123 21788820 24809115
19509 24809115 28680898 33596248 39947304 48380862 59766556 75237495 96773281 126812407
19501 126812407 167853834 220348287 278746530 330579276 360824539 358991483 326133939
19494 326133939 274016549 217856800 169009445 131327964 103684441 83467068 68573633
19487 68573633 57280382 48590809 41739711 36288633 31887678 28228467 25328885 23077041
19479 23077041 21223218 19640258 18319544 17162630 16158840 15257093 14325092 13410251
$$ packed form
19537D540046J94508J46573J17437Q5152n3794k5695J17744J55025K42523L19698
19527E839217L30829M47940M94498O24048Q20748Q55308P12886O40465N68325
19518A1334264O14391P21566Q36400R45194J179544J603235K075529K478697L020295
19509B4809115L871783M915350O351056Q433558J1385694J5470939K1535786L0039126
19501A26812407M1041427N2494453N8398243N1832746L0245263j833056l2857544
19494C26133939n2117390n6159749m8847355l7681481k7643523k0217373j4893435
19487F8573633j1293251q689573o851098n451078m400955l659211k899582k251844
19479B3077041j853823j582960j320714j156914j003790r01747r32001r14841
$$ plain form
19471 13410251 12439660 11524236 10607050 9736624 9032240 8461508 7959384 7461938 7043113
19462 7043113 6797855 6515103 6285328 6146105 6019646 5869435 5672700 5375897 5091350
19453 5091350 4797469 4504844 4242743 4157836 4112539 4089277 4030167 3884208 3700672 3543032
19443 3543032 3296121 3123157 2922699 2748044 2553282 2434212 2322929 2272745 2178496 2113092
19433 2113092 2077944 2014819 2040043 2019707 1966232 1872564 1819440 1813314 1811572 1749107 1735513 1665927
19421 1665927 1632282 1661797 1733239 1728430 1717667 1814306 1858936 1901244 1881034 1816221 1764043
19410 1764043 1719020 1567635 1531141 1516468 1469799 1398505 1446110 1511847 1494361 1490235 1495081
19399 1495081 1350807 1238885 1187103 1122876 1054247 1029350 990424 972908 1008935 1050369 1045762
$$ packed form
19471A3410251r70591r15424r17186q70426p04384n70732n02124m97446m18825
19462G043113k45258k82752k29775j39223j26459j50211j96735k96803k84547
19453E091350k93881k92625k62101q4907m5297k3262n9110j45959j83536j57640
19443C543032k46911j72964k00458j74655j94762j19070j11283n0184r4249o5404
19433B113092l5148o3125K5224k0336n3475r3668n3124o126j742o2465j3594o9586
19421A665927l3645K9515P1442m809j0763R6639M4630M2308k0210o4813n2178
19410A764043m5023j51385l6494j4673m6669p1294M7605O5737j7486m126M846
19399A495081j44274j11922n1782o4227o8629k4897l8926j7516L6027M1434m607
$$ plain form
19388 1045762 1001301 927794 884468 864076 857366 903368 917862 971019 975793 928317 940082 973498
19376 973498 1008929 988281 935389 860592 939276 975120 980164 996468 978293 985371 955164 986235
19364 986235 1097787 1197467 1310989 1340199 1382572 1390056 1473737 1555561 1663911 1773344 1895297
19353 1895297 1996860 2069835 2187024 2234974 2326288 2483659 2542366 2541208 2468106 2496281 2602318
19342 2602318 2813938 2987641 3159624 3305459 3434463 3537247 3651632 3789164 4171305
19333 4171305 4749853 5428413 6189650 7121206 8447206 10360068 13169681 17880849 26077688
19324 26077688 39629130 56718696 68986640 72785884 66684063 54888892 49355142
19317 49355142 54294178 67737441 80427594 84557161 79005214 64119704 52557223
$$ packed form
19388A045762m4461p3507m3326k0392o710M6002J4494N3157M774m7476J1765L3416
19376I73498L5431k0648n2892p4797P8684L5844N044J6304j8175P078l0207L1071
19364I86235J11552R9680J13522K9210M2373P484Q3681Q1824J08350J09433J21953
19353A895297J01563P2975J17189M7950R1314J57371N8707j158p3102K8175J06037
19342B602318K11620J73703J71983J45835J29004J02784J14385J37532L82141
19333D171305N78548O78560P61237R31556J326000J912862K809613M711168Q196839
19324B6077688J3551442J7089566J2267944L799244o101821j1795171n533750
19317D9355142M939036J3443263J2690153M129567n551947j4885510j1562481
$$ plain form
19310 52557223 51135125 58862779 69337785 74479897 72555132 62169131 51376274 48712832
19302 48712832 55212864 66748426 73752163 72561687 61185231 43851485 30678415
19295 30678415 22787777 18057029 14986326 13009386 11777679 11000713 10441315 9967881
19287 9967881 9612560 9312264 9132917 9080706 9240526 9553804 9946301 10480321 11415587 12864107
19277 12864107 15061241 18712806 24949569 35890022 53323172 73283939 85919227
19270 85919227 88456780 79199587 66117277 62319057 70886726 87842264 101028032 103654472
19262 103654472 93971397 75346974 63235813 63799885 74651454 86653179 91265630
19255 91265630 86733629 72650739 61360839 60980249 71455162 85693672 92134610 87891954
$$ packed form
19310E2557223j422098P727654J0475006N142112j924765j0386001j0792857k663442
19302D8712832O500032J1535562P003737j190476j1376456j7333746j3173070
19295C0678415p890638m730748l070703j976940j231707p76966n59398m73434
19287I967881l55321l00296j79347n2211J59820L13278L92497N34020R35266J448520
19277A2864107K197134L651565O236763J0940453J7433150J9960767J2635288
19270H5919227K537553r257193j3082310l798220Q567669J6955538J3185768K626440
19262A03654472r683075j8624423j2111161N64072J0851569J2001725M612451
19255I1265630m532001j4082890j1289900l80590J0474913J4238510O440938m242656
$$ plain form
19247 87891954 70775546 49372065 34190645 24988918 19493115 16063413 13664927 11987961
19239 11987961 10583960 9279132 8169453 7342599 6688029 6174928 5865059 5613513 5334616
19230 5334616 4933531 4532088 4169131 3967678 3841174 3666566 3445188 3206935 2986860
19221 2986860 2777694 2568313 2416770 2266694 2145947 2112765 2070020 2102580 2036835 1961129
19211 1961129 1833350 1810006 1737466 1662429 1618507 1553085 1559026 1536550 1504508 1545006 1527464
19200 1527464 1513857 1640815 1721952 1865960 2041167 2217966 2419793 2590617 2713371 2746560
19190 2746560 2868575 3029604 3331749 3665936 3923656 4127251 4320569 4547985 4901201
19181 4901201 5369639 6010916 6807805 7791898 9139993 11113402 14226004 19606266 29221972
$$ packed form
19247H7891954j7116408k1403481j5181420r201727n495803l429702k398486j676966
19239A1987961j404001j304828j109679q26854o54570n13101l09869k51546k78897
19230E334616m01085m01443l62957k01453j26504j74608k21378k38253k20075
19221B986860k09166k09381j51543j50076j20747l3182m2745L2560o5745p5706
19211A961129j27779k3344p2540p5037m3922o5422N941k2476l2042M0498j7542
19200A527464j3607J26958Q1137J44008J75207J76799K01827J70824J22754L3189
19190B746560J22015J61029L02145L34187K57720K03595J93318K27416L53216
19181D901201M68438O41277P96889R84093J348095J973409L112602N380262R615706
$$ plain form
19172 29221972 44217024 60224755 69729317 70909844 62941987 54011551 53658047 64341597
19164 64341597 83164841 102402804 116680082 117072953 103780575 85350529 66679539
19157 66679539 55866360 55621927 63549636 71641825 72840370 65659762 50158905 35070584
19149 35070584 25641516 20370467 17162135 14904212 13268977 12068272 11128785 10443017
19141 10443017 9963171 9567006 9341109 9300849 9351960 9351439 9387481 9510888 9819453 10391669
19131 10391669 11195362 12321288 13970300 16375349 20176506 26523706 37726753 56466069
19123 56466069 80075003 97664841 103644559 96149359 80721191 73267343 80333023 100578115
19115 100578115 126490678 150300915 161561988 151631527 129649893 101979388 80194002
$$ packed form
19172B9221972J4995052J6007731R504562J180527p967857q930436l53504J0683550
19164F4341597J8823244J9237963J4277278L92871j3292378j8430046j8670990
19157F6679539j0813179k44433P927709Q092189J198545p180608j5500857j5088321
19149C5070584r429068n271049l208332k257923j635235j200705r39487o85768
19141A0443017m79846l96165k25897m0260N1111n21L6042J23407L08565N72216
19131A0391669Q03693J125926J649012K405049L801157O347200J1203047J8739316
19123E6466069K3608934J7589838N979718p495200j5428168p453848P065680K0245092
19115A00578115K5912563K3810237J1261073r930461k1981634k7670505k1785386
$$ plain form
19108 80194002 72653447 77850069 88115516 92585223 87551327 71287498 50672561 35630860
19100 35630860 26575165 21023593 17301105 14644807 12872316 11625792 10569940 9740846
19092 9740846 8970824 8196044 7556018 6927346 6312382 5784139 5365221 5126258 4898782
19083 4898782 4681624 4484892 4324352 4248475 4191753 4018600 3732446 3421533 3117402 3017852
19073 3017852 2968875 2901309 2801363 2796438 2839871 2817173 2802281 2675742 2569651 2494184 2342174
19062 2342174 2241790 2137717 2188435 2195738 2136414 2010515 1895306 1783326 1615112 1519224
19052 1519224 1469449 1415929 1402393 1368835 1230885 1058065 958780 928236 857849 787311 792600
19041 792600 762275 787420 803953 777524 735803 692863 635902 610190 615948 657109 675988 667754
$$ packed form
19108H0194002p540555N196622J0265447M469707n033896j6263829k0614937j5041701
19100C5630860r055695n551572l722488k656298j772491j246524j055852q29094
19092I740846p70022p74780o40026o28672o14964n28243m18918k38963k27476
19083D898782k17158j96732j60540p5877n6722j73153k86154l10913l04131r9550
19073C017852m8977o7566r9946m925M3433k2698j4892j26539j06091p5467j52010
19062B342174j00384j04073N0718P303n9324j25899j15209j11980j68214r5888
19052A519224m9775n3520j3536l3558j37950j72820r9285l0544p0387p0538N289
19041G92600l0325K5145J6533k6429m1721m2940n6961k5712N758M1161J8879q234
$$ plain form
19029 667754 659777 699180 693649 700151 605474 519454 529953 530914 548484 568839 560385 547574 587005
19016 587005 660014 703007 738173 605171 565568 540864 456882 473095 511512 516487 541001
19005 541001 562942 582736 527201 525854 553301 506087 501661 522501 513910 553598 539942 542962
18993 542962 525464 519183 506238 504888 577261 656511 616724 533961 496792 502907 498259 510505
18981 510505 511342 522748 483824 393696 399531 432711 420396 414143 466812 547932 624470 592644
18969 592644 474879 454490 492854 524278 579659 559559 506768 425854 371561 405499 485271
18958 485271 511543 467670 597079 691978 672769 625857 610475 653229 699732 692314 650473
18947 650473 559615 561368 510528 466966 429555 450853 516699 578727 513133 485498 450664 504227
$$ packed form
19029F67754p977L9403n531O502r4677q6020J0499R61J7570K0355q454j2811L9431
19016E87005P3009M2993L5166j33002l9603k4704q3982J6213L8417M975K4514
19005E41001K1941J9794n5535j347K7447m7214m426K0840q591L9688j3656L020
18993E42962j7498o281j2945j350P2373P9250l9787q2763l7169O115m648J2246
18981E10505Q37J1406l8924r0128N835L3180j2315o253N2669Q1120P6538l1826
18969E92644j17765k0389L8364L1424N5381k0100n2791q0914n4293L3938P9772
18958D85271K6272m3873J29409R4899j9209m6912j5382M2754M6503p418m1841
18947F50473r0858J753n0840m3562l7411K1298O5846O2028o5594k7635l4834N3563
$$ plain form
18935 504227 532201 518410 565270 587399 547892 542136 462441 481721 521926 550346 483561 443731
18923 443731 493627 521227 573192 657264 693891 727078 670171 732009 794287 846774 848089 844836
18911 844836 879844 891130 918098 1003280 1124312 1219165 1288404 1377526 1559975 1783374 1972797
18900 1972797 2202357 2395555 2545917 2555063 2604631 2657894 2687509 2669811 2635589 2666690 2731634
18889 2731634 2718480 2757288 2989850 3312184 3713887 4166205 4840455 5749236 6962748 8620710
18879 8620710 10928700 14389281 19610380 28061022 41774610 61501003 83775345 107237756
18871 107237756 126773150 135749650 136581213 127380693 107686046 85943585 64056269
18864 64056269 44545723 31574467 23605681 18578784 15147151 12679768 10892862 9648460
$$ packed form
18935E04227K7974j3791M6860K2129l9507n756p9695J9280M0205K8420o6785l9830
18923D43731M9896K7600N1965Q4072L6627L3187n6907O1838O2278N2487J315l253
18911H44836L5008J1286K6968Q5182J21032R4853O9239Q9122J82449K23399J89423
18900A972797K29560J93198J50362R146M9568N3263K9615j7698l4222L1101O4944
18889B731634j3154L8808K32562L22334M01703M52318O74250R08781J213512J657962
18879H620710K307990L460581N221099Q450642J3713588J9726393K2274342K3462411
18871A07237756J9535394Q976500Q31563r200520j9694647k1742461k1887316
18864F4056269j9510546j2971256p968786n026897l431633k467383j786906j244402
$$ plain form
18856 9648460 8750518 8065554 7570932 7286433 7134625 7096399 7169390 7200550 7184804 7215878
18846 7215878 7186488 7151383 7084194 7014211 6971631 6868960 6782655 6776823 6802051 7042113 7542695
18835 7542695 8249341 9212592 10589569 12402171 14847087 18059289 22533301 29360320
18827 29360320 40283206 57351365 80320511 108642260 140870203 167740582 188737974
18820 188737974 199095033 192684689 175925929 150956979 118843912 90236146 65785081
18813 65785081 46750548 34414688 26609525 21405450 17772548 15110853 13087755 11543659
18805 11543659 10344763 9446663 8746274 8232203 7909997 7669946 7490610 7275315 7101999
18796 7101999 6861402 6654600 6552879 6424785 6286560 6195184 6143175 6078877 6015776 5891675
$$ packed form
18856I648460q97942o84964m94622k84499j51808l8226P2991L1160j5746L1074
18846G215878k9390l5105o7189o9983m2580j02671q6305n832K5228K40062N00582
18835G542695P06646R63251J376977J812602K444916L212202M474012O827019
18827B9360320J0922886J7068159K2969146K8321749L2227943K6870379K0997392
18820A88737974J0357059o410344j6758760k4968950l2113067k8607766k4451065
18813F5785081j9034533j2335860p805163n204075l632902k661695k023098j544096
18805A1543659j198896q98100p00389n14071l22206k40051j79336k15295j73316
18796G101999k40597k06802j01721j28094j38225r1376n2009o4298o3101j24101
$$ plain form
18786 5891675 5778153 5880062 6137335 6518100 7145484 8034919 9329654 11157652 14128108
18777 14128108 18869999 26378573 37595453 50668756 64260173 76633117 82838140
18770 82838140 83950295 79578075 68248222 54953486 42047335 29979551 21665621
18763 21665621 16482175 13111581 10615039 8624415 7279523 6276101 5517425 4949313
18755 4949313 4450865 3951901 3584697 3348460 3236858 3003441 2821330 2759807 2657872 2593263
18745 2593263 2525859 2425430 2390363 2297771 2187583 2127820 2030628 1917045 1747345 1568320
18735 1568320 1444043 1452226 1454829 1350160 1316787 1277064 1248900 1249996 1188822 1152475 1165952
18724 1165952 1151852 1185055 1152838 1113732 1076006 1137783 1199281 1228179 1233945 1220830 1172363
$$ packed form
18786E891675j13522J01909K57273L80765O27384Q89435J294735J827998K970456
18777A4128108M741891P508574J1216880J3073303J3591417J2372944O205023
18770H2838140J112155m372220j1329853j3294736j2906151j2067784q313930
18763B1665621n183446l370594k496542j990624j344892j003422p58676n68112
18755D949313m98448m98964l67204k36237j11602k33417j82111o1523j01935o4609
18745B593263o7404j00429l5067r2592j10188n9763r7192j13583j69700j79025
18735A568320j24277Q183K603j04669l3373l9723k8164J096o1174l6347J3477
18724A165952j4100L3203l2217l9106l7726O1777O1498K8898N766j3115m8467
$$ plain form
18713 1172363 1110284 1030190 1021000 961180 896172 852835 790840 807442 774295 648803 611784
18702 611784 635884 605854 592871 604499 631506 667794 606085 591837 639319 583399 525129
18691 525129 507644 508772 493725 429135 390589 466541 521608 556487 573061 631997 649068 622936
18679 622936 627767 645700 625919 605974 643813 633149 630717 602208 650255 672087 681574 793292
18667 793292 788665 724655 669052 620841 626292 668215 721423 768633 742132 748547 749184 701778
18655 701778 620829 627871 668370 591956 607871 648782 683742 799741 933635 1033562 1042572
18644 1042572 1018024 956571 898785 834287 854065 1031371 1146759 1207687 1262015 1262229 1158203
18633 1158203 1086544 1079018 1025926 1022535 1076273 1156414 1136799 1079555 940104 764440 641704
$$ packed form
18713A172363o2079q0094r190n9820o5008m3337o1995J6602l3147j25492l7019
18702F11784K4100l0030j2983J1628K7007L6288o1709j4248M7482n5920n8270
18691E25129j7485J128j5047o4590l8546P5952N5067L4879J6574N8936J7071k6132
18679F22936M831J7933j9781j9945L7839j0664k432k8509M8047K1832R487J11718
18667G93292m627o4010n5603m8211N451M1923N3208M7210k6501O415O37m7406
18655G01778q0949P042M0499p6414J5915M0911L4960J15999J33894R9927R010
18644A042572k4548o1453n7786o4498J9778J77306J15388O0928N4328K14j04026
18633A158203p1659p526n3092l391N3738Q0141j9615n7244j39451j75664j22736
$$ plain form
18622 641704 495189 436746 394646 522298 546577 496333 457982 425460 438040 411857 389100
18611 389100 480757 506818 459778 452098 518467 470383 445283 492948 429661 382909 470419 583548
18599 583548 612037 588009 667467 674581 665861 681527 737156 707680 802859 901665 965507 1042073
18587 1042073 1073499 1073994 1009331 956903 877700 845851 913652 958242 974012 960336 881593 897220
18575 897220 968053 954271 938500 810107 695339 666613 619106 573580 533163 542059 648600
18564 648600 728240 720496 684363 643066 614946 545800 586838 612149 648950 620814 592497 541834
18552 541834 433690 445191 469097 507162 609014 539496 428819 387198 378145 444977 452007
18541 452007 461201 517750 545433 573170 581617 638866 701435 678354 671854 704012 630311 603067
$$ packed form
18622F41704j46515n8443m2100J27652K4279n0244l8351l2522J2580k6183k2757
18611C89100R1657K6061m7040p680O6369m8084k5100M7665o3287m6752Q7510J13129
18599E83548K8489k4028P9458P114q720J5666N5629k9476R5179R8806O3842P6566
18587A042073L1426M95o4663n2428p9203l1849O7801M4590J5770j3676p8743J5627
18575H97220P0833j3782j5771j28393j14768k8726m7507m5526m0417Q896J06541
18564F48600P9640p744l6133m1297k8120o9146M1038K5311L6801k8136k8317n0663
18552E41834j08144J1501K3906L8065J01852o9518j10677m1621r053O6832P030
18541D52007R194N6549K7683K7737Q447N7249O2569k3081o500L2158p3701k7244
$$ plain form
18529 603067 608423 667277 694782 702458 734776 714079 686434 688860 672800 689298 617355 566678
18517 566678 532597 513998 505741 522739 619722 618534 601537 570951 558831 597809 565803 542460
18505 542460 571094 557725 536613 541217 497924 486528 498164 539287 617297 632077 634602 575263
18493 575263 449091 480307 566341 588313 531179 446751 488108 585593 697244 683106 631931
18482 631931 562177 606028 608350 557181 470913 396796 470302 538388 596333 531487 416029
18471 416029 365537 352418 359086 395959 455039 416837 384873 378779 421917 419941 395258 378105
18459 378105 454431 515204 520325 477925 479266 467252 408549 374603 394332 388889 396190 467489
18447 467489 466805 404312 395250 341132 282187 286752 324451 400986 347458 323730 364718 378951
$$ packed form
18529F03067N356N8854K7505P676L2318k0697k7645K426j6060J6498p1943n0677
18517E66678l4081j8599q257J6998R6983j188j6997l0586j2120L8978l2006k3343
18505E42460K8634j3369k1112M604m3293j1396J1636M1123P8010J4780K525n9339
18493E75263j26172L1216Q6034K1972n7134q4428M1357R7485J11651j4138n1175
18482F31931o9754M3851K322n1169q6268p4117P3506O8086N7945o4846j15458
18471D16029n0492j3119O668L6873N9080l8202l1964o094M3138j976k4683j7153
18459C78105P6326O0773N121m2400J341j2014n8703l3946J9729n443P301P1299
18447D67489o84o2493r062n4118n8945M565L7699P6535n3528k3728M0988J4233
$$ plain form
18435 378951 342307 344399 337120 328991 306766 309477 284599 233886 309922 323872 316376 285366
18423 285366 239898 153766 117331 130446 161053 151296 174168 252844 333779 287260 267428 354349
18411 354349 378306 339798 353643 271963 202351 212317 213511 172783 157887 148408 135148 164689
18399 164689 241545 264684 242661 199922 207878 210436 231720 270561 329100 319930 337640 328455
18387 328455 228940 149631 133519 191323 305821 293592 229095 228999 285656 239441 257320 280651
18375 280651 309564 264499 177658 156389 222113 281984 252525 197781 189166 238531 273117 286010
18363 286010 278657 233993 317510 418026 339391 326960 385727 379011 392404 426308 511062 576316
18351 576316 611572 669931 780472 787704 886073 939027 930035 907036 803111 636365 546993
$$ packed form
18435C78951l6644K092p279q129k2225K711k4878n0713P6036J3950p496l1010
18423B85366m5468q6132l6435J3115L0607r757K2872P8676Q0935m6519j9832Q6921
18411C54349K3957l8508J3845q1680o9612R966J194m0728j4896r479j3260K9541
18399A64689P6856K3139k2023m2739P956K558K1284L8841N8539r170J7710r185
18387C28455r9515p9309j6112N7804J14498j2229o4497r6N6657m6215J7879K3331
18375B80651K8913m5065q6841k1269O5724N9871k9459n4744q615M9365L4586J2893
18363B86010p353m4664Q3517J00516p8635j2431N8767o716J3393L3904Q4754O5254
18351E76316L5256N8359J10541P232R8369N2954q992k2999j03925j66746q9372
$$ plain form
18340 546993 522306 477206 465996 466836 423994 385044 401972 290088 303172 374175 443452 451645
18328 451645 463843 407289 299627 294644 287052 311945 331064 321201 356214 432350 408236 329639
18316 329639 363556 413591 380340 329542 281643 275678 256727 222975 194130 197760 242024 356225
18304 356225 485651 585722 688598 821242 945480 1030714 1105155 1189304 1115521 960128
18294 960128 864824 789283 737568 644480 549389 477779 434181 449610 451198 413663 409090 459745
18282 459745 483283 519896 521889 507303 517413 589981 659826 736807 705090 702571 667207 579683
18270 579683 515355 503826 494000 443507 414520 394076 368998 381557 379408 290032 293336 322126
18258 322126 376057 414024 485210 598843 685554 733019 818360 909537 936858 1057050 1106359
$$ packed form
18340E46993k4687m5100j1210Q40m2842l8950J6928j11884J3084P1003O9277Q193
18328D51645J2198n6554j07662m983p592K4893J9119r863L5013P6136k4114p8597
18316C29639L3917N0035l3251n0798m7899n965j8951l3752k8845L630M4264J14201
18304C56225J29426J00071J02876J32644J24238Q5234P4441Q4149p3783j55393
18294I60128r5304p5541n1715r3088r5091p1610m3598J5429J588l7535m573N0655
18282D59745K3538L6613J993j4586J0110P2568O9845P6981l1717k519l5364q7524
18270E79683o4328j1529r826n0493k8987k0444k5078J2559k149q9376L304K8790
18258C22126N3931L7967P1186J13633Q6711M7465Q5341R1177K7321J20192M9309
$$ plain form
18247 1106359 1077725 1067200 1013033 992065 935759 857167 829650 732912 645545 472842 392780
18236 392780 401679 393764 383996 364553 438448 405981 282189 246476 288486 277545 266504 294812
18224 294812 319729 330275 309982 381951 405139 382595 454115 485275 486284 489392 457819 369170
18212 369170 346782 318100 290223 283875 223652 199777 167388 154452 193873 274005 302696 348363
18200 348363 324440 324549 332597 462481 496203 511749 500232 441848 385767 393713 314588 250447
18188 250447 234578 210614 270395 316706 335303 322753 289802 287893 294679 228762 187137 147439
18176 147439 152463 159089 204104 254181 260568 247736 203155 206086 215504 187482 244802 242500 263822
18163 263822 296669 314584 254910 238404 268738 259286 246870 198227 201157 283531 348023 329407
$$ packed form
18247A106359k8634j0525n4167k0968n6306p8592k7517r6738q7367j72703q0062
18236C92780Q899p915r768j9443P3895l2467j23792l5713M2010j0941j1041K8308
18224B94812K4917J0546k0293P1969K3188k2544P1520L1160J009L108l1573q8649
18212C69170k2388k8682k7877o348o0223k3875l2389j2936L9421Q0132K8691M5667
18200C48363k3923J09Q048J29884L3722J5546j1517n8384n6081P946p9125o4141
18188B50447j5869k3964N9781M6311J8597j2550l2951j909O786o5917m1625l9698
18176A47439N024O626M5015N0077O387j2832m4581K931R418k8022N7320k302K1322
18163B63822L2847J7915n9674j6506L0334r452j2416m8643K930Q2374O4492j8616
$$ plain form
18151 329407 305191 292846 353548 435569 397962 411654 401650 384695 447055 483627 456809
18140 456809 426494 414775 459958 510883 532609 584984 575727 641592 651268 669527 691984 687741
18128 687741 732877 797940 857877 849853 916584 973626 1118582 1305021 1483301 1768344 2101383
18117 2101383 2464364 2864055 3389683 4087556 5179767 6799165 9125739 12683671 18856489
18108 18856489 30810207 54159094 90787517 118811185 125396856 110418275 70772224
18101 70772224 41384393 26377020 18559188 13856814 10704564 8565494 7136135 6091556
18093 6091556 5197629 4482527 3903852 3485061 3178236 2919670 2704194 2477935 2290478
18084 2290478 2117923 1911908 1719918 1564116 1433790 1287296 1224465 1206827 1232181 1084052
$$ packed form
18151C29407k4216j2345O0702Q2021l7607J3692j0004j6955O2360L6572k6818
18140D56809l0315j1719M5183N0925K1726N2375r257O5865R676J8259K2457m243
18128F87741M5136O5063N9937q024O6731N7042J44956J86439J78280K85043L33039
18117B101383L62981L99691N25628O97873J092211J619398K326574L557932O172818
18108A8856489J1953718K3348887L6628423K8023668O585671j4978581l9646051
18101G0772224k9387831j5007373p817832m702374l152250k139070j429359j044579
18093F091556q93927p15102n78675m18791l06825k58566k15476k26259j87457
18084B290478j72555k06015j91990j55802j30326j46494o2831j7638K5354j48129
$$ plain form
18074 1084052 964857 837929 757361 720667 762707 763941 779872 791000 761342 700062 660004
18063 660004 596952 483181 408889 441765 432658 365470 365588 382041 358918 340157 309529 329091
18051 329091 361324 368020 278771 234293 238437 262244 229853 230669 275327 232483 282097 331755
18039 331755 303841 367272 382247 251327 155412 236842 302180 261490 229534 187447 186471 160599
18027 160599 124296 155163 101380 133140 163251 179668 113508 71772 59118 112516 97418
18016 97418 344 -82735 -59984 49952 144924 171720 158575 126630 152806 160282 90062 14150
18004 14150 42573 174915 218018 159284 180800 248468 224268 122202 67000 60061 138431
17993 138431 166536 171243 145587 80487 73840 129291 246609 222444 182181 175284 132927 141195
$$ packed form
18074A084052j19195j26928q0568l6694M2040J234J5931J1128k9658o1280m0058
18063F60004o3052j13771p4292L2876r107o7188J18J6453k3123j8761l0628J9562
18051C29091L2233O696q9249m4478M144K3807l2391Q16M4658m2844M9614M9658
18039C31755k7914O3431J4975j30920r5915Q1430O5338m0690l1956m2087r76k5872
18027A60599l6303L0867n3783L1760L0111J6417o6160m1736j2654N3398j5098
18016I7418r7074q3079K2751J09936R4972K6796j3145l1945K6176P476p0220p5912
18004A4150K8423J32342M3103n8734K1516O7668k4200j02066n5202o939P8370
17993A38431K8105M707k5656o5100o647N5451J17318k4165m0263o897m2357Q268
$$ plain form
17981 141195 122313 145366 134118 107483 77899 104772 95806 -9246 -27603 26771 34311 27160
17969 27160 29552 60201 54434 49591 87214 149146 131421 122835 142157 226337 183618 213248
17957 213248 177056 189131 286414 227085 130685 104583 124501 161115 201860 270288 274129 191568
17945 191568 144392 163361 88325 13674 -14920 62533 145148 191026 198500 152598 95609 72840
17933 72840 158616 161881 116396 112065 102702 77828 14614 33529 109906 95735 114589 141766
17921 141766 68476 56999 52709 -13934 9275 66390 143700 193659 247613 245567 191604 109740
17909 109740 95106 76058 24332 20325 -5784 -3552 75959 112765 137587 172146 137451 64060
17897 64060 51683 25816 39372 41076 46701 25830 -54512 -53821 -71976 -50164 -68725 -16229
$$ packed form
17981A41195j8882K3053j1248k6635k9584K6873q966j05052j8357N4374P540p151
17969B7160K392L0649n767m843L7623O1932j7725q586J9322Q4180m2719K9630
17957B13248l6192J2075R7283n9329r6400k6102J9918L6614M0745O8428L841q2561
17945A91568m7176J8969p5036p4651k8594P7453Q2615M5878P474m5902n6989k2769
17933G2840Q5776L265m5485m331r363k4874o3214J8915P6377j4171J8854K7177
17921A41766p3290j1477m290o6643K3209N7115P7310M9959N3954k046n3963q1864
17909A09740j4634j9048n1726m007k6109K232P9511L6806K4822L4559l4695p3391
17897F4060j2377k5867J3556J704N625k0871q0342O91j8155K1812j8561N2496
$$ plain form
17885 -16229 -30167 -21727 29782 28374 -3130 67109 91549 42807 -11993 12090 47361 30442
17873 30442 31584 61484 50828 75371 131371 118653 124293 117852 126218 182362 231610 240749 194206
17860 194206 101999 56118 31977 109085 238404 342815 175910 176254 230060 169771 117556
17849 117556 97754 105119 82151 77929 6038 -64952 -32301 66338 94792 162347 185817 175492
17837 175492 132641 116350 110478 100809 54511 17030 -56784 -42814 10240 41282 60027 39319
17825 39319 44924 96614 96079 161558 95167 74176 38632 26267 -54670 -75588 -28633 -17585
17813 -17585 -39818 -85106 -143915 -127706 -73541 -113019 -83815 -67056 -21956 20348 38313 79308
17801 79308 66469 62235 57883 -29225 17609 24776 -10851 13940 37001 67725 81558 17435
$$ packed form
17885a6229j3938Q440N1509j408l1504P0239K4440m8742n4800K4083L5271j6919
17873C0442J142K9900j0656K4543N6000j2718N640o441Q366N6144M9248R139m6543
17860A94206r2207m5881k4141P7108J29319J04411j66905L44N3806o0289n2215
17849A17556j9802P365k2968m222p1891p0990L2651R8639K8454O7555K3470j0325
17837A75492m2851j6291n872r669m6298l7481p3814J3970N3054L1042J8745k0708
17825C9319N605N1690n35O5479o6391k0991l5544j2365q0937k0918M6955J1048
17813a7585k2233m5288n8809J6209N4165l9478K9204J6759M5100M2304J7965M0995
17801G9308j2839m234m352q7108M6834P167l5627K4791K3061L0724J3833o4123
$$ plain form
17789 17435 62907 28245 27014 49164 86613 103480 137443 92742 98833 71412 27284 40959
17777 40959 12315 57541 11609 47838 127079 108247 120619 89216 15570 -57744 -85726 -40538
17765 -40538 -60949 -99572 613 54444 -20823 -62192 -67335 -98046 -82150 -19264 38528 58562
17753 58562 67057 57105 13436 9722 -59117 -65845 -35084 -41619 -83706 -128060 -119062 -141083 -128843
17740 -128843 -19221 51305 -2625 14403 698 36121 98253 65101 65519 39252 -53878 -108024
17728 -108024 -3444 38073 25047 22231 94611 102753 67883 35675 25127 64134 60863 70682
17716 70682 39267 25627 -17873 -71354 -133835 -53804 -31873 -75084 -112718 -100172 -73275 -16364
17704 -16364 72805 128859 127283 105325 83219 93287 126211 146957 107281 120131 77302 38424
$$ packed form
17789A7435M5472l4662j231K2150L7449J6867L3963m4701O091k7421m4128J3675
17777D0959k8644M5226m5932L6229P9241j8832J2372l1403p3646p3314k7982M5188
17765d0538k0411l8623J00185N3831p5267m1369n143l0711J5896O2886N7792K0034
17753E8562Q495r952m3669l714o8839o728L0761o535m2087m4354Q998k2021J2240
17740a28843J09622P0526n3930J7028j3705L5423O2132l3152M18k6267r3130n4146
17728a08024J04580M1517j3026k816P2380Q142l4870l2208j0548L9007l271R819
17716G0682l1415j3640m3500n3481o2481Q0031K1931m3211l7634J2546K6897N6911
17704a6364Q9169N6054j576k1958k2106J0068L2924K0746l9676J2850m2829l8878
$$ plain form
17692 38424 20260 110484 66041 5487 31703 -8801 8181 71610 73439 57862 121707 179588
17680 179588 116253 111688 118395 93380 28691 -20077 -52931 -30190 -20018 -22227 17480 47003
17668 47003 -13568 34156 87291 50842 98992 105449 69857 -25472 -42915 13218 49587 78681
17656 78681 112444 80979 95381 151901 122710 62328 95825 29982 -68401 -105957 -114829 -128228
17644 -128228 -130254 -86586 -115096 -112416 -73405 -43357 69195 91085 27450 58748 119521 60915
17632 60915 76250 67849 -13754 -96755 -62607 -6598 13763 61742 46052 84902 49737 -15791
17620 -15791 -50951 9643 22347 -844 213 57737 52975 16889 56125 74892 77700 86149
17608 86149 3181 33989 132431 116316 114351 76221 71800 70933 41317 -37118 -57786 23001
$$ packed form
17692C8424j8164R0224m4443o0554K6216m0504J6982O3429J829j5577O3845N7881
17680A79588o3335m565O707k5015o4689m8768l2854K2741J0172k209L9707K9523
17668D7003o0571M7724N3135l6449M8150O457l5592r5329j7443N6133L6369K9094
17656G8681L3763l1465J4402N6520k9191o0382L3497o5843r8383l7556q872j3399
17644a28228k026M3668k8510K680L9011L0048J12552K1890o3635L1298O0773n8606
17632F0915J5335q401q1603q3001L4148N6009K0361M7979j5690L8850l5165o5528
17620a5791l5160O0594J2704k3191J057N7524m762l6086L9236J8767K808Q449
17608H6149q2968L0808R8442j6115j965l8130m421q67k9616p8435k0668Q0787
$$ plain form
17596 23001 62757 74203 83962 131664 149499 89995 61957 51359 48297 44640 -15890 -35111
17584 -35111 -16028 34735 55799 21824 13541 -2147 -68541 -102644 -80842 -49926 -14681 -8779
17572 -8779 -43972 -92006 -108279 -68878 8373 103621 86451 40948 -21504 -73297 -5996 32166
17560 32166 8582 -28898 -21917 -39621 -89352 -12475 51487 -17110 7646 52938 44823 -4478
17548 -4478 -2569 -17329 -27237 -11028 -56018 -71625 -65995 31857 18547 -13003 35448 32119 23100
17535 23100 -7926 26507 58406 40093 1127 -13851 38594 62791 194716 212038 143829
17524 143829 74958 69129 71227 8576 -6314 7436 50791 33272 39201 101077 105084 91724
17512 91724 61395 127856 117204 81838 123301 81235 15739 52537 22515 -12301 69611 115960
$$ packed form
17596B3001L9756J1446R759M7702J7835n9504k8038j0598l062l657o0530j9221
17584c5111J9083N0763K1064l3975q283j5688o6394l4103K1802L0916L5245N902
17572h779l5193m8034j6273L9401P7251R5248j7170m5503o2452n1793O7301L8162
17560C2166k3584l7480O981j7704m9731P6877O3962o8597K4756M5292q115m9301
17548d478J909j4760r908J6209m4990j5607N630R7852j3310l1550M8451l329r019
17535B3100l1026L4433L1899j8313l8966j4978N2445K4197J31925J7322o8209
17524A43829o8871n829K098o2651j4890J3750M3355j7519N929O1876M007j3360
17512I1724l0329O6461j0652l5366M1463m2066o5496L6798l0022l4816Q1912M6349
$$ plain form
17500 115960 37847 34601 82415 83604 74508 65042 59432 65321 73544 108848 83697 93251 75996
17487 75996 53820 37096 7827 64877 61682 22808 -15125 -3773 34592 42250 217 47547
17475 47547 85342 89527 52245 37580 88545 58140 48519 -2022 -41431 15889 32243 57767
17463 57767 105753 124881 48562 25436 13504 18041 51280 115065 102989 98399 49710 60643
17451 60643 74584 -14216 12612 90545 81078 35278 16078 70148 158956 216513 214535 302877
17439 302877 468868 567786 607672 461100 283692 141796 55584 -18212 -59668 -120190 -97991
17428 -97991 -69004 -23432 -41412 22553 39010 20253 5279 77934 135335 171023 157749 160833
17416 160833 103478 44850 -115988 -157616 -48823 -29689 -37944 -79526 -64878 -37060 -42514
$$ packed form
17500A15960p8113l246M7814J189r096r466n610N889Q223L5304k5151R554j7255
17487G5996k2176j6724k9269N7050l195l8874l7933J1352L8365P658m2033M7330
17475D7547L7795M185l7282j4665N0965l0405r621n0541l9409N7320J6354K5524
17463E7767M7986J9128p6319k3126j1932M537L3239O3785j2076m590m8689J0933
17451F0643J3941q8800K6828P7933r467m5800j9200N4070Q8808N7557j978Q8342
17439C02877J65991R8918L9886j46572j77408j41896q6212p3796m1456o0522K2199
17428i7991K8987M5572j7980O3965J6457j8757j4974P2655N7401L5688j3274L084
17416A60833n7355n8628j60838m1628J08793J9134q255m1582J4648K7818n454
$$ plain form
17405 -42514 -28849 -69593 -40374 38255 143030 190381 145454 84654 -6284 -47407 -26225
17394 -26225 19462 23279 4263 13094 56422 149057 165493 155064 78230 14031 -27984 -27947 -48659
17381 -48659 -117708 -99335 -53477 -26368 -11633 -65228 -156719 -135440 -13037 8320 -28116
17370 -28116 -36562 -47231 -60083 -106112 -101117 -70570 3667 37616 -6820 -17566 -61309 -12860
17358 -12860 34854 -72127 -82767 -68036 -59316 27773 6863 -50258 -35645 -11424 1988 32353
17346 32353 45137 8304 -5303 42335 87804 38850 -41697 -10182 26905 -52461 -86158 -98960
17334 -98960 -51460 50725 55744 32620 -40057 -14264 -22076 -39777 -22618 -39781 -9831 56852
17322 56852 80274 13906 -20694 -38929 3840 25379 43905 5945 16333 -52629 -19539 52705
$$ packed form
17405d2514J3665m0744K9219P8629J04775M7351m4927o0800r0938m1123K1182
17394b6225M5687L817j9016Q831M3328R2635J6436j0429p6834o4199m2015L7k0712
17381d8659o9049J8373M5858K7109J4735n3595r1491K1279J22403K1357l6436
17370b8116q446j0669j2852m6029M995L0547P4237L3949m4436j0746m3743M8449
17358a2860M7714j06981j0640J4731Q720Q7089k0910n7121J4613K4221J3412L0365
17346C2353J2784l6833j3607M7638M5469m8954q0547L1515L7087p9366l3697j2802
17334i8960M7500J02185N019k3124p2677K5793p812j7701J7159j7163K9950O6683
17322E6852K3422o6368l4600j8235M2769K1539J8526l7960J0388o8962L3090P2244
$$ plain form
17310 52705 91388 99647 92405 62473 40905 30 -58735 -88908 -51153 -49003 -44772 -29977
17298 -29977 -29621 9292 46026 -17170 -70145 -27481 36648 52727 4406 33475 16157 14096
17286 14096 8660 -58716 37232 62254 45915 87720 117500 155523 142251 85595 2675 -27448
17274 -27448 -52002 -1416 58655 100862 39530 69007 124513 185310 120619 -33356 -9275
17263 -9275 68048 113183 125884 91317 78005 71706 63488 49430 5779 -24039 -66772 -80022
17251 -80022 -102860 -121988 -79992 -50168 -70462 -75339 -46255 29460 78796 -3379 -8281 30250
17239 30250 88556 56374 53088 42850 -1772 7624 55404 53392 7156 -50606 -58506 -53730 24068
17226 24068 -13803 -74832 -34603 -7325 47586 40484 -15768 -33150 -43503 43313 20640 -38245
$$ packed form
17310E2705L8683Q259p242k9932k1568m0875n8765l0173L7755K150M231J4795
17298b9977L56L8913L6734o3196n2975M2664O4129J6079m8321K9069j7318k061
17286A4096n436o7376R5948K5022j6339M1805K9780L8023j3272n6656q2920l0123
17274b7448k4554N0586O0071M2207o1332K9477N5506O0797o4691j53975K4081
17263i275P7323M5135J2701l4567j3312o299q218j4058m3651k9818m2733j3250
17251h0022k2838j9128M1996K9824k0294m877K9084P5715M9336q2175m902L8531
17239C0250N8306l2182l286j0238m4622R396M7780k012m6236n7762p900M776P7798
17226B4068l7871o1029M0229K7278N4911p102n6252j7382j0353Q6816k2673n8885
$$ plain form
17214 -38245 -51406 -19343 67838 59907 63905 54203 22401 13352 791 48467 68211 107149
17202 107149 87123 59041 66432 23523 11745 35671 37810 -48130 -123609 -118892 -57780 -20680
17190 -20680 8695 32 -72369 -73267 -6964 -21044 -30970 -52571 -83596 -92205 -141072 -179894 -102064
17177 -102064 -44303 -36087 -34487 -91929 -53347 -18289 -36682 -68728 -74271 -97735 -105018 -86037
17165 -86037 -39221 -39403 -74687 -1746 -17615 -64640 -75889 -21159 -71206 -91998 -69277 -106977
17153 -106977 -84063 -38873 -46665 -90878 -61602 -36557 -73798 -57218 9768 14924 -57877 -128878
17141 -128878 -210319 -183296 -94473 35082 26919 27111 1281 -2757 8427 -4975 -28285 -10119
17129 -10119 4885 -34344 -72498 -33441 23833 55934 43757 33746 11465 29855 71862 31365
$$ packed form
17214c8245j3161L2063Q7181p931L998r702l1802r049j2561M7676J9744L8938
17202A07149k0026k8082P391m2909j1778K3926K139q5940p5479M717O1112L7100
17190b0680K9375q663p2401q98O6303j4080r926k1601l1025q609m8867l8822P7830
17177a02064N7761Q216J600n7442L8582L5058j8393l2046n543k3464p283J8981
17165h6037M6816j82l5284P2941j5869m7025j1249N4730n0047k0792K2721l7700
17153a06977K2914M5190p792m4213K9276K5045l7241J6580O6986N156p2801p1001
17141a28878q1441K7023Q8823J29555q163J92k5830m038J1184j3402k3310J8166
17129a0119J5004l9229l8154L9057N7274L2101j2177j0011k2281J8390M2007m0497
$$ plain form
17117 31365 -25029 -34271 -51602 10359 53618 43593 25152 42764 53280 16887 -25972 -55142
17105 -55142 -32484 9663 22591 -22752 -61147 -29008 2746 56320 97462 93646 -485 11478
17093 11478 65288 14130 38002 -13 -79042 -48292 -59233 -29965 18853 -5979 4733 1902
17081 1902 19349 1487 -29165 42992 120151 70480 -26067 -102342 -53019 19933 23412 -44651
17069 -44651 -50667 49875 43432 -21003 -33683 5026 35059 59971 -17738 -103445 -116243 -47162
17057 -47162 -8567 -13161 22702 86899 122872 94534 67667 94669 112046 57116 -49001 -49688
17045 -49688 -97143 -100642 -93531 -121462 -179815 -96774 -81773 -87421 -40940 38205 49828 71039
17033 71039 64909 50757 -31904 -46459 -29075 -861 13982 74573 14234 -24038 32770 73110
$$ packed form
17117C1365n6394r242j7331O1961M3259j0025j8441J7612J0516l6393m2859k9170
17105e5142K2658M2147J2928m5343l8395L2139L1754N3574M1142l816r4131J1963
17093A1478N3810n1158K3872l8015p9029L0750j0941K9268M8818k4832J0712k831
17081A902J7447j7862l0652P2157P7159m9671r6547p6275M9323P2952L479o8063
17069d4651o016J00542o443o4435j2680L8709L0033K4912p7709q5707j2798O9081
17057d7162L8595m594L5863O4197L5973k8338k6867K7002J7377n4930j06117o87
17045d9688m7455l499P111k7931n8353Q3041J5001n648M6481P9145J1623K1211
17033G1039o130j4152q2661j4555J7384K8214J4843O0591o0339l8272N6808M0340
$$ plain form
17021 73110 65761 32979 30332 -2614 38757 3965 -21551 55750 110559 45196 9051 -60880
17009 -60880 -111689 -87181 -12105 39093 14712 -20302 -22347 -36422 -9673 -22038 -73030 -103830
16997 -103830 -54613 -18177 -49038 -51909 -32893 24856 -29241 -27089 -293 12206 5044 -60189
16985 -60189 -115849 -53301 -6254 -20070 -69755 -45815 -36527 -28807 -50283 -67436 -68545 -32377
16973 -32377 21606 26460 -5864 -10683 24812 30935 47551 86963 15387 -44632 -89761 -82809
16961 -82809 -50593 -64684 -99117 -70200 -48947 -33671 681 -41419 -78639 -30340 -8501 -7447
16949 -7447 -29470 -23295 -50557 -50864 -37558 -28330 -32679 31089 68509 97104 111569 97650 94508
16936 94508 22995 -16697 -54724 -42989 -8040 -15441 -5193 -26796 -16378 40492 30510 -5747
$$ packed form
17021G3110p349l2782k647l2946M1371l4792k5516P7301N4809o5363l6145o9931
17009f0880n0809K4508P5076N1198k4381l5014k045j4075K6749j2365n0992l0800
16997a03830M9217L6436l0861k871J9016N7749n4097K152K6796J2499p162o5233
16985f0189n5660O2548M7047j3816m9685K3940R288P720k1476j7153j109L6168
16973c2377N3983M854l2324m819L5495O123J6616L9412p1576o0019m5129O952
16961h2809L2216j4091l4433K8917K1253J5276L4352m2100l7220M8299K1839J054
16949g447k2023O175k7262l07J3306R228m349O3768L7420K8595J4465j3919l142
16936I4508p1513l9692l8027J1735L4949p401J0248k1603J0418N6870r982l6257
$$ plain form
16924 -5747 322 -17672 -31128 11613 15420 -8841 4731 62512 59774 -18966 -9111 -27244 32663
16911 32663 68259 117228 48578 -22149 -30352 1815 -6428 38266 7114 -31522 -58153 -48063
16899 -48063 33550 73491 38262 21764 39770 19772 -10922 50513 -762 5182 51136 247
16887 247 -42757 -50486 -14546 -17475 45150 112858 14384 12171 31044 36743 -20169 -28130 -23856
16874 -23856 27981 37321 27668 57615 50729 13116 25648 44728 -29307 -71166 -32098 -34219
16862 -34219 -70511 -63163 4258 47333 69773 55331 61754 13792 -15673 -3215 2464 42160
16850 42160 69107 68252 -33604 -71555 -61157 -31662 40438 33870 51145 51219 22737 -26563 -61784
16837 -61784 -106647 -33597 10815 21294 -9486 -42005 -33866 -40781 -21299 -25278 -69043 -88166
$$ packed form
16924e747O069j7994j3456M2741L807k4261J3572N7781k738p8740R855j8133N9907
16911C2663L5596M8969o8650p0727q203L2167q243M4694l1152l8636k6631J0090
16899d8063Q1613L9941l5229j6498J8006j9998l0694O1435n1275N944M5954n0889
16887B47m3004p729L5940k929O2625O7708r8474k213J8873N699n6912p961M274
16874b3856N1837R340r653K9947o886l7613J2532J9080p4035m1859L9068k121
16862c4219l6292P348O7421M3075K2440j4442O423m7962k9465J2458N679L9696
16850D2160K6947q55j01856l7951J0398K9495P2100o568J7275P4k8482m9300l5221
16837f1784m4863P3050M4412J0479l0780l2519Q139o915J9482l979m3765j9123
$$ plain form
16825 -88166 -33278 19600 21178 -36001 -11506 -13028 -62591 -87860 -49089 4864 -34813 -22601
16813 -22601 -9284 -41530 -133662 -81647 32178 49004 57609 36162 -26426 -22560 -25504 78189
16801 78189 118291 49130 -26399 -60088 -23498 14790 -11013 -34054 23934 -16997 -47112 -56987
16789 -56987 -69915 -25619 -64634 -13539 -6998 -78795 -123777 -136898 -175512 -160508 -145603 -141854
16777 -141854 -109496 -128694 -102237 -119876 -136226 -110703 -81047 -60932 -94906 -213006 -216069
16766 -216069 -129927 -89565 -113689 -65150 -39295 -93114 -119062 -134537 -169784 -113395 -61473
16755 -61473 -2374 19612 -12245 -47574 -64977 -27426 76796 78781 2791 -23756 60152 97311
16743 97311 57655 2600 -34005 -75944 -78657 -22324 -21209 -4160 26279 13763 -59051 -128577
$$ packed form
16825h8166N4888N2878J578n7179K4495j522m9563k5269L8771N3953l9677J2212
16813b2601J3317l2246r2132N2015J13825J6826Q605k1447o2588L866k944J03693
16801G8189M0102o9161p5529l3689L6590L8288k5803k3041N7988m0931l0115r875
16789e6987j2928M4296l9015N1095O541p1797m4982j3121l8614J5004J4905L749
16777a41854L2358j9198K6457j7639j6350K5523K9656K0115l3974j18100l063
16766b16069Q6142M0362k4124M8539K5855n3819k5948j5475l5247N6389N1922
16755f1473N9099K1986l1857l5329j7403L7551J04222J985p5990k6547Q3908L7159
16743I7311l9656n5055l6605m1939k713N6333J115J7049L0439j2516p2814o9526
$$ plain form
16731 -128577 -139559 -164572 -78283 -2611 -4796 -5021 -8582 -24037 54743 26771 -2500 4288
16719 4288 1348 -34329 28539 49103 -32368 -66755 -44210 -78019 -52882 -18207 1750 -6571
16707 -6571 2866 -10413 -31519 28268 68909 75839 40450 47635 41451 -7861 -58216 -49917 -49870
16694 -49870 -52195 -74435 -12255 -14986 -65744 -95534 -62786 11477 41267 -36766 -47814 -64772
16682 -64772 -46617 -8909 28406 33602 39660 54030 17969 -80455 -66428 -37864 29971 35387
16670 35387 -13982 -53081 2289 -6587 -24213 849 10073 -8856 43218 69689 48190 13976
16658 13976 21866 -12375 18502 85982 91376 41150 -32699 -118031 -166567 -138222 -147152 -41388
16646 -41388 61459 26251 8821 9985 -28395 -50595 -56870 -76487 -109181 -85850 -47362 -42288
$$ packed form
16731a28577j0982k5013Q6289P5672k185k25l561j5455P8780k7972k9271O788
16719D288k940l5677O2868K0564q1471l4387K2545l3809K5137L4675J9957q321
16707f571R437j3279k1106N9787M0641O930l5389P185o184m9312n0355Q299M7
16694d9870k325k2240O2180k731n0758k9790L2748P4263K9790p8033j1048j6958
16682f4772J8155L7708L7315N196O058J4370l6061r8424J4027K8564O7835N416
16670C5387m9369l9099N5370q876j7626K5062R224j8929N2074K6471k1499l4214
16658A3976P890l4241L0877O7480N394n0226p3849q5332m8536K8345q930J05764
16646d1388J02847l5208j7430J164l8380k2200o275j9617l2694K3331L8488N074
$$ plain form
16634 -42288 -18051 52542 49120 50121 15891 7959 -1615 20614 18571 -74891 -102211 -81454 -101087
16621 -101087 28236 57747 46925 36847 55405 35459 75644 101199 54170 31788 7557
16610 7557 10024 -71191 -34815 -6767 -37616 -61733 -124931 -141106 -70751 -69004 -24178 -51925
16598 -51925 -52110 -43635 2609 22941 67475 59996 -6885 -14669 -10738 5513 2642 72279 94325
16585 94325 108860 71206 78534 118630 149067 140441 123480 62730 27388 -7709 36013 70319
16573 70319 46646 70922 77503 82248 57712 -14050 -67652 -85812 -100120 -63803 -74789 -125740
16561 -125740 -109537 -119537 -78482 -40993 -31965 -21392 53991 15517 -63306 -68280 -56118 -13406
16549 -13406 39585 47674 114944 151987 113541 62548 -21275 -57767 -53141 -82642 8680 117795
$$ packed form
16634d2288K4237P0593l422J001l4230p932r574K2229k043r3462k7320K0757j9633
16621a01087J29323K9511j0822j0078J8558j9946M0185K5555m7029k2382k4231
16610G557K467q1215L6376K8048l0849k4117o3198j6175P0355J747M4826k7747
16598e1925j85Q475M6244K0332M4534p479o6881p784L931J6251k871O9637K2046
16585I4325J4535l7654P328M0096L0437q626j6961o0750l5342l5097M3722L4306
16573G0319k3673K4276O581M745k4536p1762n3602j8160j4308L6317j0986n0951
16561a25740J6203j0000M1055L7489R028J0573P5383l8474p8823m974J2162M2712
16549a3406N2991Q089O7270L7043l8446n0993q3823l6492M626k9501R1322J09115
$$ plain form
16537 117795 112227 47089 43733 37165 20759 54675 67398 67327 98135 203068 255654 195800
16525 195800 48004 30104 23650 76045 87650 74129 46083 64062 28381 34367 38166 -3199
16513 -3199 773 419 6287 -6376 1534 19504 2490 -51785 -55006 -28397 -22110 3828 8091
16500 8091 41206 112047 109122 71844 16540 -12341 -63266 -134197 -115306 -104499 -47583 47101
16488 47101 76417 16371 -14128 20734 31911 14508 -11698 -6050 43935 21725 -69476 -118643
16476 -118643 -175862 -184277 -175999 -114453 -65740 -20876 -48040 -32179 5781 67107 56247 -18933
16464 -18933 -20628 -49540 -50655 -27459 -19237 -22761 -61964 -67584 -5289 -20893 -69720 -79187 -47445
16451 -47445 -102639 -155531 -185388 -188282 -131011 -130949 -140908 -37853 41709 25221 -30447 -115490
$$ packed form
16537A17795n568o5138l356o568j6406L3916J2723p1L0808J04933N2586n9854
16525A95800j47796j7900o454N2395J1605j3521k8046J7979l5681N986L799m1365
16513c199L972l54N868j2663P910J7970j7014n4275l221K6609O287K5938M263
16500H091L3115P0841k925l7278n5304k8881n0925p0931J8891J0807N6916R4684
16488D7101K9316o0046l0499L4862J1177j7403k6206N648M9985k2210r1201m9167
16476a18643n7219q415Q278O1546M8713M4864k7164J5861L7960O1326j0860p5180
16464a8933j695k8912j115K3196Q222l524l9203n620O2295j5604m8827r467L1742
16451d7445n5194n2892k9857k894N7271O2r959J03055P9562j6488n5668q5043
$$ plain form
16439 -115490 -167871 -112725 -85329 -84299 -94417 -73569 -28605 6227 -31514 -25658 55578 -37281
16427 -37281 -126818 -40886 -7035 -7800 -8028 -40006 -88269 -86276 -75458 -55966 -68744 -83791 -98414
16414 -98414 -91086 -135054 -133691 -15984 9531 27862 -9877 -74198 -30308 24873 21586 19494
16402 19494 -40317 -56834 18299 92337 60533 32846 -36829 -93500 -2698 45383 34231 -53121
16390 -53121 -97033 -110150 -115629 -74336 -21470 6948 12340 -61021 -120091 -62076 -13693 -58288
16378 -58288 -91495 -40010 -30262 -8894 13815 -69747 -108591 -89530 -60091 -10799 15033 24737
16366 24737 3481 -44625 -70717 7342 80326 62312 18448 29739 4487 -23322 -56135 -47243
16354 -47243 -91702 -38317 -45053 -121428 -176513 -94128 44457 66309 20560 -21627 -92232 -97951
$$ packed form
16439a15490n2381N5146K7396J030j0118K0848M4964L4832l7741N856Q1236r2859
16427c7281q9537Q5932L3851p65k28l1978m8263J993J0818J9492j2778j5047j4623
16414i8414P328m3968J363J17707K5515J8331l7739o4321M3890N5181l287k092
16402A9494n9811j6517P5133P4038l1804k7687o9675n6671R0802M8081j1152q7352
16390e3121m3912j3117n479M1293N2866K8418N392p3361n9070N8015M8383m4595
16378e8288l3207N1485R748K1368K2709q3562l8844J9061K9439M9292K5832R704
16366B4737k1256m8106k6092P8059P2984j8014m3864J1291k5252k7809l2813Q892
16354d7243m4459N3385o736p6375n5085Q2385J38585K1852m5749m2187p0605n719
$$ plain form
16342 -97951 -100689 -42388 36768 68062 35481 25611 13907 21712 9453 -33672 -85226 -95684
16330 -95684 -116769 -133223 -85478 -14054 -46822 -49032 -64369 -26622 -20097 -41188 -28652 -38004
16318 -38004 3097 15507 -9407 20539 -14173 -49936 -54659 -42426 -28460 -42688 34181 39456
16306 39456 6952 -45845 -53098 70484 34097 -59308 -1923 52836 96449 95800 92160 20313
16294 20313 77960 51946 -13854 -40390 18258 107329 62864 55572 67526 3988 -101881 -93067
16282 -93067 -77273 -45297 -3702 5145 -10095 -33439 -6798 35959 8532 -11900 -52212 -85675
16270 -85675 -117637 -67316 -29169 -154785 -224965 -213703 -189901 -155038 -85500 -57291 -109986
16259 -109986 -109754 -74704 -50061 -75466 -36609 -33749 -14953 -49874 -58698 -17624 -68283 -59855
$$ packed form
16342i7951k738N8301P9156L1294l2581r870j1704P805j2259m3125n1554j0458
16330i5684k1085j6454M7745P1424l2768k210j5337L7747O525k1091J2536r352
16318c8004M1101J2410k4914K9946l4712l5763m723J2233J3966j4228P6869N275
16306C9456l2504n2797p253J23582l6387r3405N7385N4759M3613o49l640p1847
16294B0313N7647k6014o5800k6536N8648Q9071m4465p292J1954o3538j05869Q814
16282i3067J5794L1976M1595Q847j5240k3344K6641M2757k7427k0432m0312l3463
16270h5675l1962N0321L8147j25616p0180J1262K3802L4863O9538K8209n2695
16259a09986K32L5050K4643k5405L8857K860J8796l4921q824M1074n0659Q428
$$ plain form
16247 -59855 -24355 18429 -50411 -107780 -97132 -66544 -102363 -71831 -44393 -100122 -109473 -78333
16235 -78333 -109005 -66669 -55699 -61650 20890 17017 12770 54703 34920 -46284 -84119 -104922
16223 -104922 -61975 -34350 -12754 -50776 -54120 18653 -27466 -72787 -78741 13293 12043 -4019
16211 -4019 -74283 -109555 -112721 -106723 -105628 -115467 30953 71314 918 37476 71265 46901
16199 46901 -57720 -148351 -172891 -137253 -119010 -90898 -15913 87880 78216 19842 23538 8612
16187 8612 -63644 -117145 -110322 -63882 -77490 -97624 -20369 13846 21250 -6962 -12959 -95542
16175 -95542 -97959 -96535 17342 44252 -21301 -21489 -45586 -85303 -62470 32559 94256 25989
16163 25989 -62426 -87212 -58617 -33924 24835 30915 1895 -67439 -48017 -21951 37308 -14819
$$ packed form
16247e9855L5500M2784o8840n7369J0648L0588l5819L0532K7438n5729r351L1140
16235g8333l0672M2336J0970n951Q2540l873m247M1933j9783q1204l7835k0803
16223a04922M2947K7625K1596l8022l344P2773m6119m5321n954R2034j250j6062
16211d019p0264l5272l166N998J095r839J46420M0361p0396L6558L3789k4364
16199D6901j04621r0631k4540L5638J8243K8112P4985J03793r664n8374L696j4926
16187H612p2256n3501O823M6440j3608k0134P7255L4215P404k8212n997q2583
16175i5542k417J424J13877K6910o5553j88k4097l9717K2833R5029O1697o8267
16163B5989q8415k4786K8595K4693N8759O080k9020o9334J9422K6066N9259n2127
$$ plain form
16151 -14819 -44048 -95980 -89427 -69173 -54333 -99616 -123033 -113892 -121456 -133393 -138097 -92376
16139 -92376 -59541 -82713 -127810 -58898 -65121 -92362 -70246 -30358 -42157 -54429 22670 54263
16127 54263 24315 46952 17823 -31515 -93827 -162118 -118705 -64066 -98523 -143992 -131091 -84383
16115 -84383 18529 34984 63717 46113 25151 43797 -7033 -81708 -103716 -126878 -151945
16104 -151945 -182731 -101715 -39334 -2463 -27620 -52819 -116618 -164465 -26254 39344 1834
16093 1834 8773 43332 48502 41760 -40933 -88564 -114315 -102358 -81497 -71587 -45595 44381 100409
16080 100409 77441 -635 -1824 19682 -2630 -29833 -31090 22222 77646 189548 181048 68981
16068 68981 -3245 -63430 -83326 -68929 -62977 -56533 -52395 -95622 -68672 -87091 -92557 -81272
$$ packed form
16151a4819k9229n1932O553K0254J4840m5283k3417R141p564j1937m704M5721
16139i2376L2835k3172m5097O8912o223k7241K2116L9888j1799j2272P7099L1593
16127E4263k9948K2637k9129m9338o2312o8291M3413N4639l4457m5469J2901M6708
16115h4383J02912J6455K8733j7604k0962J8646n0830p4675k2008k3162k5067
16104a51945l0786Q1016O2381L6871k5157k5199o3799m7847J38211O5598l7510
16093A834O939L4559N170o742q2693m7631k5751J1957K0861R910K5992Q9976N6028
16080A00409k2968p8076j189K1506k2312k7203j257N3312N5424J11902q500j12067
16068F8981p2226o0185j9896J4397N952O444M138m3227K6950j8419n466J1285
$$ plain form
16056 -81272 -47510 -97517 -64288 -30123 -22056 -27650 -7966 -4430 -8446 28638 31389 -38668 -50299
16043 -50299 -75397 -118501 -78371 -28530 19633 -10262 -29675 -44406 14265 76008 86604 14037
16031 14037 -11189 36955 -1666 47364 53746 53332 19063 -4138 34902 73005 69418 60465 56301
16018 56301 39894 22630 40537 82131 32678 9103 -79366 -71085 -87796 -19675 61335 90855
16006 90855 82689 -27798 -50953 13634 43625 91154 85356 -34198 -91407 -78153 -46467 -2354
15994 -2354 1786 90035 86587 -11088 -7166 22901 53428 26710 72999 111730 50031 -27247
15982 -27247 -73841 -39891 2109 12560 -5601 13362 21121 45823 52302 -49494 -72122 -105891
15970 -105891 -92100 -70048 -13770 -34856 -64141 -62238 -103368 -130619 -133121 -21838 6762 4731
$$ packed form
16056h1272L3762n0007L3229L4165Q067n594J9684L536m016L7084K751p0057j1631
16043e0299k5098m3104M0130M9841M8163k9895j9413j4731N8671O1743J0596p2567
16031A4037k5226M8144l8621M9030O382m14l4269k3201L9040L8103l587q953m164
16018E6301j6407j7264J7907M1594m9453k3575q8469Q281j6711O8121Q1010K9520
16006I0855q166j10487k3155O4587K9991M7529n798j19554n7209J3254L1686M4113
15994b354M140Q8249l448r7675L922L0067L0527k6718M6289L8731o1699p7278
15982b7247m6594L3950M2000J0451j8161J8963P759K4702O479j01796k2628l3769
15970a05891J3791K2052N6278k1086k9285J903m1130k7251k502J11283K8600k031
$$ plain form
15958 4731 -8107 9630 32512 126106 145920 125903 76134 56789 37234 18663 -17328 -71101
15946 -71101 -71952 -54887 -49176 -46219 -25757 -9784 63353 49863 -11049 -59041 21116 101401
15934 101401 84262 60867 74848 164338 96061 50947 37588 51668 45096 53654 27289 1308
15922 1308 -14660 -21895 -19043 -57528 -46290 -60849 14737 49584 50721 35793 22404 3012
15910 3012 -19304 -65859 -90092 -86041 -106174 -53727 -44579 -70750 -53318 -18168 38304 74930
15898 74930 10053 -7527 -49637 -124433 -131974 -79644 -63550 -49084 -61164 -118986 -141962 -98195
15886 -98195 -106590 -86508 -58277 -15607 -36296 -27299 -31732 17375 1596 -92353 -72916 -4379
15874 -4379 16997 -3115 -27768 -49303 -47074 -37525 -79843 -147283 -152289 -63248 26837 35893 45257
$$ packed form
15958D731j2838J7737K2882R3594J9814k0017m9769j9345j9555j8571l5991n3773
15946g1101q51J7065N711K957K0462J5973P3137j3490o0912m7992Q0157Q0285
15934A01401j7139k3395J3981Q9490o8277m5114j3359J4080o572Q558k6365k5981
15922A308j5968p235K852l8485J1238j4559P5586L4847J137j4928j3389j9392
15910C012k2316m6555k4233M051k0133N2447R148k6171J7432L5150N6472L6626
15898G4930o4877j7580m2110p4796p541N2330J6094J4466j2080n7822k2976M3767
15886i8195q395K0082K8231M2670k0689Q997m433M9107j5779r3949J9437O8537
15874d379K1376k0112k4653k1535K229R549m2318o7440n006Q9041R0085R056R364
$$ plain form
15861 45257 6450 -35637 -51298 -73775 -49756 -24262 -26151 -47372 -52310 -28402 -9328 -952
15849 -952 -21224 -829 26046 11577 52009 25383 -17830 -75007 -52913 -10136 -34023 -41744
15837 -41744 -57544 -79262 -57937 -51005 13449 1006 30146 772 -74102 -99953 -130891 -87605
15825 -87605 -38451 -37269 -42402 -17303 20363 32248 21688 -65189 -64745 -80324 -151754 -83585
15813 -83585 19763 32708 15322 -70381 -107826 -110080 9955 63849 124358 119593 49451 31055
15801 31055 8356 -3025 19495 6963 -50845 -72551 -64531 -62177 -81172 -69394 13941 116841
15789 116841 101826 52446 -13354 -89679 -77483 -47655 -96 45834 27288 -57684 -41503
15778 -41503 -91625 -170402 -57825 75515 30506 -13716 38856 -24500 -130637 -132953 -123431
$$ packed form
15861D5257l8807m2087j5661k2477K4019K5494j889k1221m938K3908J9074Q376
15849i52k0272K0395K6875j4469M0432k6626m3213n7177K2094M2777k3887p721
15837d1744j5800k1718K1325O932O4454j2443K9140k9374p4874k5851l0938M3286
15825h7605M9154J182n133K5099L7666J1885j0560q6877M44j5579p1430O8169
15813h3585J03348J2945j7386q5703l7445k254J20035N3894O0509m765p0142j8396
15801C1055k2699j1381K2520j2532n7808k1706Q020K354j8995J1778Q3335J02900
15789A16841j5015m9380o5800p6325J2196K9828M7559M5930j8546q4972J6181
15778d1503n0122p8777J12577J33340m5009m4222N2572o3356j06137k316R522
$$ plain form
15767 -123431 -89288 -20420 -20934 -16295 -50397 -75776 -73649 -89243 -96362 -63290 -27463 -7010
15755 -7010 20217 3998 -27051 -38461 -75260 -90756 -28203 4379 15140 23708 6831 44402
15743 44402 48925 55909 46083 73699 84490 73998 134257 128280 109917 67398 25278 45249
15731 45249 51187 33871 -3410 -36070 -4212 6813 1354 7707 30102 93814 10993 -87298
15719 -87298 -105138 -23571 84913 151511 127748 132446 59842 -46838 -41838 6951 930 3566
15707 3566 55109 13246 29770 -968 -71701 -129813 -148205 -202582 -184045 -136208 -63931 -42825
15695 -42825 -47069 -44505 -72979 -156970 -158846 -199008 -123629 -100763 -70394 -52034 -69818 -53543
15683 -53543 -45730 7528 70038 89575 97013 63141 68124 82568 75744 99985 151465 84002
$$ packed form
15767a23431L4143O8868n14M639l4102k5379K127j5594p119L3072L5827K0453
15755g010K7227j6219l1049j1410l6799j5496O2553L2582J0761Q568j6877L7571
15743D4402M523O984r826K7616J0791j0492O0259n977j8363m2519m2120J9971
15731D5249N938j7316l7281l2660L1858J1025n459O353K2395O3712q2821r8291
15719h7298j7840Q1567J08484O6598k3763M698p2604j06680N000M8789o021K636
15707C566N1543m1863J6524l0738p0733n8112j8392n4377J8537M7837P2277K1106
15695d2825m244K564k8474q3991j876m0162P5379K2866L0369J8360j7784J6275
15683e3543P813N3258O2510J9537P438l3872M983J4444o824K4241N1480o7463
$$ plain form
15671 84002 61462 53922 -29066 -85049 -80417 -64050 -87150 -127066 -82573 -67220 -70814 -47783
15659 -47783 -23359 48850 103812 39319 -4921 -19659 -23065 30585 31923 5703 -21352 48719
15647 48719 6539 -70875 -79670 -41588 58617 131002 102547 -14705 40437 51562 64182
15636 64182 99889 31468 41902 70410 29792 -23884 -42274 -35461 -76303 -85903 -105174 -130105
15624 -130105 -77136 -66239 -59077 -59311 -55656 -29994 -54461 6844 88116 31853 -32227 -52623
15612 -52623 -441 -20070 -49571 5953 82888 120795 60065 -21146 -36383 18801 51189 6663
15600 6663 -38161 -41273 -3161 -63620 -68201 -14323 -9494 -12093 853 7929 12610 78389 24635
15587 24635 -5297 16917 28793 -45498 -45877 -40107 -64001 -35335 -42651 -100704 -111616 -74378
$$ packed form
15671H4002k2540p540q2988n5983M632J6367k3100l9916M4493J5353l594K3031
15659d7783K4424P2209N4962o4493m4240j4738l406N3650J338k6220k7055P0071
15647D8719m2180p7414q795L8082J00205P2385k8455j17252N5142J1125J2620
15636F4182L5707o8421J0434K8508m0618n3676j8390O813m0842r600j9271k4931
15624a30105N2969J0897P162k34L655K5662k4467O1305Q1272n6263o4080k0396
15612e2623N2182j9629k9501N5524P6935L7907o0730q1211j5237N5184L2388m4526
15600F663m4824l112L8112o0459m581N3878M829k599J2946P076M681O5779n3754
15587B4635k9932K2214J1876p4291l79N770k3894K8666p316n8053j0912L7238
$$ plain form
15575 -74378 -58687 -28098 19143 61156 100268 94996 44674 57672 84714 40801 604 -45905
15563 -45905 -29550 39439 58328 -24348 22497 75365 72109 70953 117209 155349 179164 145823
15551 145823 92836 93584 18347 -43872 -24516 -26611 -33192 -104785 -108485 -95923 -83389 -39123
15539 -39123 31618 64028 -3310 -68229 -137050 -77957 -16677 49476 109965 131195 62741 -1741
15527 -1741 -67165 -62545 -36467 -124374 -177284 -179486 -180086 -126337 -48180 20960 64171 85848 28224
15514 28224 -56526 -101924 -89126 -71480 -39777 -41089 -41166 -33005 -56250 -52439 -27028 16166 23623
15501 23623 58830 60915 31362 55975 90492 156277 101809 56308 -31806 39906 87246 21915
15489 21915 -30580 -79339 -72921 -61246 -24238 76136 116988 113955 58629 6775 53211 65928
$$ packed form
15575g4378J5691L0589M7241M2013L9112n272n0322J2998K7042m3913m0197m6509
15563d5905J6355O8989J8889q2676M6845N2868l256j156M6256L8140K3815l3341
15551A45823n2987P48p5237o2219J9356k095o581p1593l700J2562J2534M4266
15539c9123P0741L2410o7338o4919o8821N9093O1280O6153O0489K1230o8454o4482
15527a741o5424M620K6078q7907n2910k202o00N3749P8157O9140M3211K1677n7624
15514B8224q4750m5398J2798J7646L1703j312p7Q161k3245L811K5411M3194P457
15501B3623L5207K085k9553K4613L4517O5785n4468m5501q8114P1712M7340o5331
15489B1915n2495m8759O418J1675L7008J00374M0852l033n5326n1854M6436J2717
$$ plain form
15477 65928 37795 54541 94685 46616 -22780 -46014 -125411 -91046 -55837 -39803 -8678 -2614
15465 -2614 -2779 28875 64634 75661 40980 4041 13736 19642 60577 92959 131009 122372 94245
15452 94245 98825 67171 7432 -4964 5258 27725 54806 135373 81444 82112 66381 34665
15440 34665 32750 93873 95553 14472 -36176 6387 24490 1467 -21006 -21401 -45502 -34876
15428 -34876 -61909 -108871 -37944 -341 -56286 -64703 -91362 -11138 18558 94523 138240 110955
15416 110955 66869 -38810 -85650 -56684 29288 -5737 -18410 -28858 -1911 94806 140033
15405 140033 64900 -19272 3406 -7996 52334 123116 80992 41200 -13594 2391 22308
15394 22308 49072 10315 -50119 -16907 35463 48601 -41865 -159572 -134143 -58752 -20472
$$ packed form
15477F5928k8133J6746M0144m8069o9396k3234p9397L4365L5209J6034L1125O064
15465b614j65L1654L5759J1027l4681l6939R695N906M0935L2382L8050q637k8127
15452I4245M580l1654n9739j2396J0222K2467K7081Q0567n3929O68j5731l1716
15440C4665j915O1123J680q1081n0648M2563J8103k3023k2473l95k4101J0626
15428c4876k7033m6962P0927L7603n5945q417k6659Q0224K9696P5965M3717k7285
15416A10955m4086j05679m6840K8966Q5972l5025j2673j0448K6947R6717M5227
15405A40033p5133q4172K2678j1402O0330P0782m2124l9792n4794J5985J9917
15394B2308K6764l8757o0434L3212N2370J3138r0466j17707K5429P5391L8280
$$ plain form
15383 -20472 -38880 -49761 -4666 123630 129128 26076 -16415 18386 80568 52399 61842 62823
15371 62823 -10380 -45261 -40836 -22791 -30243 -22554 -19339 -30882 -65001 -143712 -54080 29875
15359 29875 26381 -56256 -35085 -38132 -15528 22546 -19834 -17369 -52404 -112016 -164512 -99297
15347 -99297 -23514 -4318 -6158 39486 38845 18334 28694 -11726 -69966 2472 59397 -9102
15335 -9102 -35343 -23080 -58305 -63952 -52843 -97453 -22601 -53715 -71907 -98051 -43552 -74739
15323 -74739 -85774 -60627 5527 88934 16150 -22427 29581 29629 13102 46058 64752 50687
15311 50687 37081 51632 15677 12963 -31664 40476 71610 112085 152012 157929 166956 46326
15299 46326 -18603 -42270 -55089 -49703 -59595 -30101 -35838 -55840 -62398 -37226 -12149 -25653
$$ packed form
15383b0472j8408j0881M5095J28296N498j03052m2491L4801O2182k8169R443R81
15371F2823p3203l4881M425J8045p452P689L215j1543l4119p8711Q9632Q3955
15359B9875l494q2637K1171l047K2604L8074m2380K465l5035n9612n2496O5215
15347i9297P5783J9196j840M5644o41k0511J0360m0420n8240P2438N6925o8499
15335i102k6241J2263l5225n647J1109m4610P4852l1114j8192k6144N4499l1187
15323g4739j1035K5147O6154Q3407p2784l8577N2008M8j6527L2956J8694j4065
15311E0687j3606J4551l5955k714m4627P2140L1134M0475L9927N917R027j20630
15299D6326o4929k3667j2819N386r892K9494n737k0002o558K5172K5077j3504
$$ plain form
15287 -25653 -24752 19488 5227 -61647 -64939 5691 -23154 19330 64220 57630 57042 123791 184876
15274 184876 209887 241883 226265 238844 314160 350782 375066 445662 442967 356540 276242 155839
15262 155839 95584 114684 146577 140629 75067 -15038 8076 82646 99682 108773 103229 -1066
15250 -1066 -35017 -52181 -76103 -29341 14360 -20755 -24698 -18924 45151 67686 58166 18296
15238 18296 13514 23949 58043 133099 119082 132968 94818 -53771 -52014 -7261 -31255 11523
15226 11523 20828 -23627 -10508 -9462 7922 5970 9568 -30599 -38721 -102748 -78916 -67920 -102801
15213 -102801 -112896 -83086 -66672 -13739 1380 46293 14512 -50354 -62943 -102147 -89510
15202 -89510 -23851 -14037 -9107 -7275 31456 30618 1719 90567 131001 64523 -17683 1820 -10688
$$ packed form
15287b5653R01M4240j4261o6874l292P0630k8845M2484M4890o590n88O6749O1085
15274A84876K5011L1996j5618J2579P5316L6622K4284P0596k695q6427q0298j20403
15262A55839o0255J9100L1893n948o5562r0105K3114P4570J7036R091n544j04295
15250a066l3951j7164k3922M6762M3701l5115l943N774O4075K2535r520l9870
15238A8296m782J0435L4094P5056j4017J3886l8150j48589J757M4753k3994M2778
15226A1523R305m4455J3119J046J7384j952L598m0167q122o4027K3832J0996l4881
15213a02801j0095K9810J6414N2933J5119M4913l1781o4866j2589l9204J2637
15202h9510O5659R814M930J832L8731q38k8899Q8848M0434o6478q2206J9503j2508
$$ plain form
15189 -10688 -39693 -40281 6921 -3739 -55768 -104511 -116709 -58490 -61111 -29298 -11534 -15040
15177 -15040 -25231 -24385 2384 1721 -31608 7665 -8731 -99159 -133583 -143278 -116191 -112637 -76824
15164 -76824 -6668 -23602 -65200 -4726 -2245 -50253 -52891 -4260 -1401 4765 -20785 -40350
15152 -40350 2602 133609 115588 150315 97897 3736 -3153 43280 41617 41032 42177 61468
15140 61468 65078 20827 12306 18837 -25485 -101272 -59910 -46651 -113923 -187471 -165181 -89558
15128 -89558 -45412 -3456 26510 100513 130868 80309 12229 -55010 -56915 -8794 -20633 -15566
15116 -15566 57978 66390 -6133 -10411 -77905 -90646 -37219 -16836 -44254 -152287 -131035 -153633
15104 -153633 -150983 -105160 -60682 -65638 -14527 34359 20036 16424 -56638 -74132 -13069 -37957
$$ packed form
15189a0688k9005n88M7202j0660n2029m8743j2198N8219k621L1813J7764l506
15177a5040j0191Q46K6769o63l3329L9273j6396r0428l4424r695K7087L554L5813
15164g6824P0156j6934m1598O0474K481m8008k638M8631K859O166k5550j9565
15152d0350M2952J31007j8021L4727n2418r4161o889M6433j663n85J145J9291
15140F1468L610m4251q521O531m4322p5787M1362J3259o7272p3548K2290P5623
15128h9558M4146M1956K9966P4003L0355n0559o8080o7239j905M8121j1839N067
15116a5566P3544Q412p2523m278o7494j2741N3427K0383k7418j08033K1252k2598
15104a53633K650M5823M4478m956N1111M8886j4323l612p3062j7494O1063k4888
$$ plain form
15092 -37957 -27221 17458 -2234 19365 74000 9946 -70916 -80803 -124034 -123288 -91554 -53786
15080 -53786 -15535 34292 46187 39244 -25093 -7017 35651 51532 22977 -89740 -143753 -159150
15068 -159150 -83362 -6860 31387 4749 -2841 -46916 -109209 -118804 -65977 -18004 49131 19147
15056 19147 -69556 -40169 12915 -16536 -3874 43564 87785 71308 12096 -14884 -40110 -84599
15044 -84599 -110035 -92949 -75191 -29786 -23461 5522 -17006 -94031 -88490 -76953 -107474 -111211
15032 -111211 -51420 5936 62310 61522 15728 4663 -32859 -127921 -183833 -174704 -131739 -66434
15020 -66434 -129937 -87963 -45334 -22438 22351 -42644 -61357 -6171 49041 45329 -42761 -26675
15008 -26675 18311 21616 21001 4248 -10079 -65777 -135804 -98671 -36751 -37795 -11014 -23901
$$ packed form
15092c7957J0736M4679j9692K1599N4635o4054q0862r887m3231P46L1734L7768
15080e3786L8251M9827J1895o943o4337J8076M2668J5881k8555j12717n4013j5397
15068a59150P5788P6502L8247k6638p590m4075o2293r595N2827M7973O7135k9984
15056A9147q8703K9387N3084k9451J2662M7438M4221j6477n9212k6980k5226m4489
15044h4599k5436J7086J7758M5405O325K8983k2528p7025N541J1537l0521l737
15032a11211N9791N7356N6374p88m5794j1065l7522r5062n5912R129M2965O5305
15020f6434o3503M1974M2629K2896M4789o4995j8713N5186N5212l712q8090J6086
15008b6675M4986L305o15j6753j4327n5698p0027L7133O1920j044K6781j2887
$$ plain form
14996 -23901 -48931 -27417 -52308 -62297 38790 76015 9177 -13585 -4978 -100926 -117496 -21670
14984 -21670 -6378 -3737 44380 33410 -4729 -55090 -46667 -69516 -93298 2885 8092 -63970
14972 -63970 -51112 -26564 53373 85434 57406 -8094 -37074 -121270 -144250 -102470 -120041 -115695
14960 -115695 -46309 5815 46608 108761 173603 150449 90826 49613 36101 -7100 -103398
14949 -103398 -200389 -187697 -98370 -98121 -110192 -132085 -69761 8049 -10183 -23613 -12110 -7193
$$ packed form
14996b3901k5030K1514k4891r989J01087L7225o6838k2762Q607r5948j6570R5826
14984b1670J5292K641M8117j0970l8139n0361Q423k2849k3782R6183N207p2062
14972f3970J2858K4548P9937L2061k8028o5500k8980q4196k2980M1780j7571M346
14960a15695O9386N2124M0793O2153O4842k3154n9623m1213j3512m3201r6298
14949a03398r6991J2692Q9327K49j2071k1893O2324P7810j8232j3430J1503M917
$$ [...]
##END NTUPLES=NMR SPECTRUM
##END=
