##TITLE=Analysis number 317128
Compound Code cc 38409
Book Reference 438/89
Project Code adrs
Chemist Name antons
##JCAMPDX= 6.0         $$ Bruker NMR JCAMP-DX V2.0
##DATA TYPE= NMR SPECTRUM
##DATA CLASS= NTUPLES
##ORIGIN= Bruker BioSpin GmbH
##OWNER= nmr
$$ XWIN-NMR		Version 3.5
$$ Thu Feb  9 18:43:30 2006 GMT Standard Time (UT+0h)  MAYBRIDGE\nmr@NMR_250MHZ
##.OBSERVE FREQUENCY= 250.131544655141
##.OBSERVE NUCLEUS= ^1H
##.ACQUISITION MODE= SIMULTANEOUS (DQD)
##.ACQUISITION SCHEME= undefined
##.AVERAGES= 16
##.DIGITISER RES= 18
##SPECTROMETER/DATA SYSTEM= dpx250
##.PULSE SEQUENCE= zg30
##.SOLVENT NAME= CDCl3
##.SHIFT REFERENCE= (INTERNAL, CDCl3, 0, 16.461)
##AUDIT TRAIL= $$ (NUMBER, WHEN, WHO, WHERE, WHAT)
$$ ##TITLE= Audit trail, XWIN-NMR		Version 3.5
$$ ##JCAMPDX= 5.01
$$ ##ORIGIN= Bruker BioSpin GmbH
$$ ##OWNER= nmr
$$ C:\u/data/dgb/nmr/ADRS/15750/pdata/1/auditp.txt
$$ ##AUDIT TRAIL=  $$ (NUMBER, WHEN, WHO, WHERE, WHAT)
(   1,<2006-02-09 18:42:43.22 +000>,<MAYBRIDGE\nmr>,<NMR_250MHZ>,
      <created by zg, POWCHK disabled, PULCHK disabled
       configuration hash MD5:
       84 BC 41 DB A1 6E 1D 46 DA 25 12 A5 C1 ED C5 3A
       data hash MD5: 64K
       83 E5 52 25 87 DA 5A 4B 4F 22 E3 2D 62 0C F7 5D>)
(   2,<2006-02-09 18:43:04.36 +000>,<MAYBRIDGE\nmr>,<NMR_250MHZ>,
      <Start of raw data processing
       ef LB = 0.3 FT_mod = 6 PKNL = 1 SI = 32K 
       data hash MD5: 32K
       A9 AB 19 30 12 88 58 8B 8E 2B 6F 33 01 ED 6D 9A>)
(   3,<2006-02-09 18:43:07.83 +000>,<MAYBRIDGE\nmr>,<NMR_250MHZ>,
      <apk 
       data hash MD5: 32K
       92 9E 89 AB F2 DB 42 93 87 C7 9D D3 78 57 94 C0>)
(   4,<2006-02-09 18:43:09.17 +000>,<MAYBRIDGE\nmr>,<NMR_250MHZ>,
      <abs ABSG = 5 
       data hash MD5: 32K
       8C 50 1A F7 10 34 39 B2 BD B6 D3 32 5F 3A 71 5F>)
$$ ##END=
$$ 
$$ hash MD5
$$ ED 0D 9F CD 93 8B 98 F3 DB 71 E7 11 94 74 E2 23
##$RELAX= 
##$RELAX= 
##$RELAX= 
##$RELAX= 
##$RELAX= 
##$RELAX= 
##$RELAX= 
$$ Bruker specific parameters
$$ --------------------------
##$DU= <C:\u>
##$EXPNO= 15750
##$NAME= <ADRS>
##$PROCNO= 1
##$TYPE= <nmr>
##$USER= <dgb>
##$AMP= (0..31)
100 100 100 100 100 100 100 100 100 100 100 100 100 100 100 100 100 100 
100 100 100 100 100 100 100 100 100 100 100 100 100 100 
##$AQSEQ= 0
##$AQ_mod= 3
##$AUNM= <au_zg>
##$AUTOPOS= <9 >
##$BF1= 250.13
##$BF2= 250.13
##$BF3= 250.13
##$BF4= 250.13
##$BF5= 500.13
##$BF6= 500.13
##$BF7= 500.13
##$BF8= 500.13
##$BYTORDA= 1
##$CFDGTYP= 0
##$CFRGTYP= 5
##$CHEMSTR= <none>
##$CNST= (0..31)
1 1 145 1 1 1 1 1 1 1 1 1 1 1 1 1 1 1 1 1 1 1 1 1 1 1 1 1 1 1 1 1 
##$CPDPRG= <>
##$CPDPRG1= <>
##$CPDPRG2= <>
##$CPDPRG3= <>
##$CPDPRG4= <mlev>
##$CPDPRG5= <mlev>
##$CPDPRG6= <mlev>
##$CPDPRG7= <mlev>
##$CPDPRG8= <mlev>
##$CPDPRGB= <>
##$CPDPRGT= <>
##$D= (0..31)
0 1 0 0 0 0 0 0 0 0.06 0 0 0 0 0 0 0.0002 0 0 0 0 0 0 0 0 0 0 0 0 0 0 
0 
##$DATE= 1139510561
##$DBL= (0..7)
120 120 120 120 120 120 120 120 
##$DBP= (0..7)
150 150 150 150 150 150 150 150 
##$DBP07= 0
##$DBPNAM0= <>
##$DBPNAM1= <>
$$ [...]
##$SUBNAM7= <"">
##$SUBNAM8= <"">
##$SUBNAM9= <"">
##$SW= 20.6930455092707
##$SWIBOX= (0..15)
0 0 3 0 0 0 0 0 0 0 0 0 0 0 0 0 
##$SW_h= 5175.983436853
##$TD= 65536
##$TD0= 1
##$TE= 294.16
##$TE2= 300
##$TE3= 300
##$TEG= 300
##$TL= (0..7)
0 120 120 120 120 120 120 120 
##$TP= (0..7)
150 150 150 150 150 150 150 150 
##$TP07= 0
##$TPNAME0= <>
##$TPNAME1= <>
##$TPNAME2= <>
##$TPNAME3= <>
##$TPNAME4= <>
##$TPNAME5= <>
##$TPNAME6= <>
##$TPNAME7= <>
##$TPOAL= (0..7)
0.5 0.5 0.5 0.5 0.5 0.5 0.5 0.5 
##$TPOFFS= (0..7)
0 0 0 0 0 0 0 0 
##$TUNHIN= 0
##$TUNHOUT= 0
##$TUNXOUT= 0
##$USERA1= <user>
##$USERA2= <user>
##$USERA3= <user>
##$USERA4= <user>
##$USERA5= <user>
##$V9= 5
##$VALIST= <valist>
##$VCLIST= <CCCCCCCCCCCCCCC>
##$VD= 0
##$VDLIST= <DDDDDDDDDDDDDDD>
##$VPLIST= <PPPPPPPPPPPPPPP>
##$VTLIST= <TTTTTTTTTTTTTTT>
##$WBST= 1024
##$WBSW= 4
##$XGAIN= (0..3)
0 0 0 0 
##$XL= 0
##$YL= 0
##$YMAX_a= 365140
##$YMIN_a= -367607
##$ZGOPTNS= <>
##$ZL1= 120
##$ZL2= 120
##$ZL3= 120
##$ZL4= 120
##$ABSF1= 16.46099
##$ABSF2= -4.232182
##$ABSG= 5
##$ABSL= 3
##$ALPHA= 0
##$AQORDER= 0
##$ASSFAC= 0
##$ASSFACI= 0
##$ASSFACX= 0
##$ASSWID= 0
##$AUNMP= <proc_1d>
##$AZFE= 0.1
##$AZFW= 0.1
##$BCFW= 0
##$BC_mod= 0
##$BYTORDP= 0
##$COROFFS= 0
##$CY= 12.5
##$DATMOD= 1
##$DC= 0
##$DFILT= <>
##$DTYPP= 0
##$F1P= 14.0000005364418
##$F2P= -0.99999901652339
##$FCOR= 0.5
##$FTSIZE= 32768
##$FT_mod= 6
##$GAMMA= 0
##$GB= 0
##$INTBC= 1
##$INTSCL= 1
##$ISEN= 128
##$LB= 0.3
##$LEV0= 0
##$LPBIN= 0
##$MAXI= 10000
##$MC2= 0
##$MEAN= 0
##$ME_mod= 0
##$MI= 0
##$NCOEF= 0
##$NC_proc= -4
##$NLEV= 6
##$NOISF1= 0
##$NOISF2= 0
##$NSP= 0
##$NTH_PI= 0
##$NZP= 0
##$OFFSET= 16.46099
##$PC= 1
##$PHC0= 108.6495
##$PHC1= -17.33857
##$PH_mod= 1
##$PKNL= yes
##$PPARMOD= 0
##$PSCAL= 4
##$PSIGN= 0
##$REVERSE= no
##$SF= 250.130015257843
##$SI= 32768
##$SIGF1= 0
##$SIGF2= 0
##$SINO= 400
##$SIOLD= 32768
##$SREGLST= <1H.CDCl3>
##$SSB= 0
##$STSI= 32768
##$STSR= 0
##$SW_p= 5175.98343685301
##$SYMM= 0
##$S_DEV= 0
##$TDeff= 65536
##$TDoff= 0
##$TI= <Analysis number 999999
Compound Code 99
Book Reference 9
Project Code 9>
##$TILT= no
##$TM1= 0
##$TM2= 0
##$TOPLEV= 0
##$USERP1= <user>
##$USERP2= <user>
##$USERP3= <user>
##$USERP4= <user>
##$USERP5= <user>
##$WDW= 1
##$XDIM= 32768
##$YMAX_p= 392452501
##$YMIN_p= -573102
$$ End of Bruker specific parameters
$$ ---------------------------------
##NTUPLES= NMR SPECTRUM
##VAR_NAME=  FREQUENCY,     SPECTRUM/REAL,   SPECTRUM/IMAG
##SYMBOL=    X,             R,               I
##VAR_TYPE=  INDEPENDENT,   DEPENDENT,       DEPENDENT
##VAR_FORM=  AFFN,          ASDF,            ASDF
##VAR_DIM=   32768,         32768,           32768
##UNITS=     HZ,            ARBITRARY UNITS, ARBITRARY UNITS
##FACTOR=    0.157963299565203, 1,           1
##FIRST=     4117.38790641739, 0,            0
##LAST=      -1058.59553043562, 0,           0
##MIN=       -1058.59553043562, -573102,     0
##MAX=       4117.38790641739, 392452501,    0
$$ Real data points
##PAGE= N=1
##DATA TABLE= (X++(R..R)), XYDATA
$$ [...]
$$ plain form
19510 414015 397789 422075 444244 440411 445520 470114 535646 536230 512262 517868 535563 571450
19498 571450 607434 648906 691128 676424 650007 620974 591834 597823 608194 606360 638522 697440
19486 697440 730486 839528 937281 1062732 1194367 1262297 1166716 1053596 977709 965990 998735
19475 998735 1000354 955700 932961 896004 895518 935493 1024981 1112183 1111266 1080649 1029344 954100
19463 954100 914691 956902 1026243 1084165 1177762 1267447 1291980 1357069 1338305 1263322 1237552
19452 1237552 1256234 1332992 1467342 1692714 1991085 2273809 2418933 2375163 2162907 1893998
19442 1893998 1629246 1458795 1366729 1296793 1275585 1243199 1211704 1184593 1211953 1259035 1347486
19431 1347486 1419692 1520536 1716629 2021888 2302306 2474524 2477968 2378129 2300237 2274618
$$ packed form
19510D14015j6226K4286K2169l833N109K4594O5532N84k3968N606J7695L5887
19498E71450L5984M1472M2222j4704k6417k9033k9140N989J0371j834L2162N8918
19486F97440L3046J09042R7753J25451J31635O7930r5581j13120p5887j1719L2745
19475I98735J619m4654k2739l6957m86L9975Q9488Q7202r17l0617n1305p5244
19463I54100l9409M2211O9341N7922R3597Q9685K4533O5089j8764p4983k5770
19452A237552J8682P6758J34350K25372K98371K82724J45124m3770k12256k68909
19442A893998k64752j70451r2066o9936k1208l2386l1495k7111K7360M7082Q8451
19431A347486P2206J00844J96093L05259K80418J72218L444r9839p7892k5619
$$ plain form
19421 2274618 2326081 2470868 2611271 2670095 2705578 2771700 2817511 2763839 2657311 2599132 2560996
19410 2560996 2615156 2739893 2923276 3092408 3182166 3245893 3280323 3292237 3329045 3439896
19400 3439896 3589999 3716708 3901872 4173106 4506427 4972054 5480897 6119215 6793252
19391 6793252 7410542 7890903 8330605 8755350 9203871 9770389 10518256 11425567 12529514
19382 12529514 13956042 15769611 18002815 20806348 24327018 28897426 35064003 43621685
19374 43621685 55908722 73898440 100537154 139259391 190171707 243142676 280569612
19367 280569612 288204584 263087332 217406171 168058440 126864698 96666551 75185453
19360 75185453 59764186 48494584 40046707 33579168 28560394 24591455 21381979 18751366
$$ packed form
19421B274618N1463J44787J40403N8824L5483O6122M5811n3672j06528n8179l8136
19410B560996N4160J24737J83383J69132Q9758O3727L4430J1914L6808J10851
19400C439896J50103J26709J85164K71234L33321M65627N08843O38318O74037
19391F793252O17290M80361M39702M24745M48521N66518P47867R07311J103947
19382A2529514J426528J813569K233204K803533L520670M570408O166577Q557682
19374D3621685J2287037J7989718K6638714L8722237N0912316N2970969L7426936
19367B80569612P634972k5117252m5681161m9347731m1193742l0198147k1481098
19360G5185453j5421267j1269602q447877o467539n018774l968939l209476k630613
$$ plain form
19352 18751366 16608225 14964462 13671455 12539020 11570382 10829965 10234940 9753068 9271755
19343 9271755 8760318 8217385 7632205 7037125 6470885 5987776 5600368 5200356 4806937
19334 4806937 4472399 4213536 4018374 3924524 3906850 3869268 3795394 3651705 3460755 3279503
19324 3279503 3040895 2788977 2654963 2584815 2516745 2551486 2680522 2747965 2735060 2596587
19314 2596587 2366627 2127838 1855122 1681451 1594232 1546735 1529904 1508161 1492174 1536443
19304 1536443 1518940 1457119 1391274 1362730 1350599 1331656 1322674 1321751 1282055 1243422 1246739 1313204
19292 1313204 1381790 1373279 1337003 1357604 1398206 1475967 1569809 1574620 1557082 1525261 1479088 1375370
19280 1375370 1274264 1217695 1177323 1120515 1055620 997549 977586 973766 940724 919803 855806
$$ packed form
19352A8751366k143141j643763j293007j132435r68638p40417n95025m81872m81313
19343I271755n11437n42933n85180n95080n66240m83109l87408m00012l93419
19334D806937l34538k58863j95162r3850j7674l7582p3874j43689j90950j81252
19324C279503k38608k51918j34014p0148o8070L4741J29036O7443j2905j38473
19314B596587k29960k38789k72716j73671q7219m7497j6831k1743j5987M4269
19304A536443j7503o1821o5845k8544j2131j8943q982r23l9696l8633L317O6465
19292A313204O8586q511l6276K0601M0602P7761R3842M811j7538l1821m6173j03718
19280A375370j01106n6569m0372n6808o4895n8071j9963l820l3042k0921o3997
$$ plain form
19269 855806 764535 677126 621712 631649 625848 574959 549078 554956 566152 531671 522380 585211
19257 585211 579586 527268 484000 479067 484685 476070 458887 436961 454965 483600 465808 442428
19245 442428 428201 420450 432229 408271 411438 382445 366765 365867 393343 395743 440118 464168
19233 464168 437511 434598 478981 491456 514043 529244 517911 501182 500883 502428 533844 523333
19221 523333 505898 484864 525119 527598 529837 509680 498922 436709 386060 382237 355730 329171
19209 329171 347318 331237 349473 371809 372068 424856 450257 442910 436361 419290 379700 354560
19197 354560 384614 402315 417517 449737 478176 561698 612173 655655 669874 628811 582528
19186 582528 582970 566366 567602 552080 574678 673753 668638 573739 572423 604123 609770 636477 613968
$$ packed form
19269H55806r1271q7409n5414R937n801n0889k5881N878J1196l4481r291O2831
19257E85211n625n2318m3268m933N618q615j7183k1926J8004K8635j7792k3380
19245D42428j4227p751J1779k3958L167k8993j5680q98K7476K400M4375K4050
19233D64168k6657k913M4383J2475K2587J5201j1333j6729k99J545L1416j0511
19221E23333j7435k1034M0255K479K239k0157j0758o2213n0649l823k6507k6559
19209C29171J8147j6081J8236K2336K59N2788K5401p347o549j7071l9590k5140
19197C54560L0054J7701J5202L2220K8439Q3522N0475M3482J4219m1063m6283
19186E82528M42j6604J236j5522K2598R9075n115r4899j316L1700N647K6707k2509
$$ plain form
19173 613968 529347 475547 454506 434644 455281 469811 492307 510224 497369 466946 462855 443996
19161 443996 452069 498502 512394 476314 466124 438935 431383 455641 427578 411697 393616 379658
19149 379658 429653 448201 472394 523803 510908 438827 384267 354253 287488 284997 333956 370730
19137 370730 394972 387241 408936 429808 439053 451224 472473 493483 464846 418952 399550 433204
19125 433204 455559 497418 529288 491248 463697 463472 470074 454688 526586 581745 580910 548442
19113 548442 532384 549664 569105 622708 674155 710652 694021 682165 659556 610681 626223
19102 626223 658332 650431 614668 607828 646705 688276 673607 645756 606251 589321 614826 607401
19090 607401 596441 579233 575252 525241 505248 519573 513446 514547 506689 434165 384674 349837
$$ packed form
19173F13968q4621n3800k1041j9862K0637J4530K2496J7917j2855l0423m091j8859
19161D43996Q073M6433J3892l6080j0190k7189p552K4258k8063j5881j8081j3958
19149C79658M9995J8548K4193N1409j2895p2081n4560l0014o6765k491M8959L6774
19137C70730K4242p731K1695K0872R245J2171K1249K1010k8637m5894j9402L3654
19125D33204K2355M1859L1870l8040k7551k25O602j5386P1898N5159q35l2468
19113E48442j6058J7280J9441N3603N1447L6497j6631j1856k2609m8875J5542
19102F26223L2109p901l5763o840L8877M1571j4669k7851l9505j6930K5505p425
19090F07401j0960j7208l981n0011j9993J4325o127J101p858p2524m9491l4837
$$ plain form
19078 349837 365063 365036 356011 342770 331122 294368 280910 306412 296968 287895 286362 329009 355811
19065 355811 343562 349481 392527 483084 530621 579483 590805 572942 569829 574717 590899 585538
19053 585538 581544 569787 558863 564902 602076 664047 636681 629837 588294 576454 562977 604460
19041 604460 675688 677210 644451 653917 662116 649505 610638 575402 558575 521760 461661 439062
19029 439062 408550 394655 376451 379550 414511 392053 383909 399870 389418 371351 362781 361245
19017 361245 339975 325379 329847 322619 316151 341812 360237 375768 354245 331359 349437 363203
19005 363203 338084 328067 329025 315225 316067 317371 302702 321366 316837 287796 297280 293546 264054
18992 264054 277355 285503 310556 295591 300845 278756 271840 288564 298994 302131 327404 320821
$$ packed form
19078C49837J5226k7r025j3241j1648l6754j3458K5502r444r073j533M2647K6802
19065C55811j2249N919M3046R0557M7537M8862J1322j7863l113M888J6182n361
19053E85538l994j1757j0924O039L7174O1971k7366o844m1543j1840j3477M1483
19041F04460P1228J522l2759R466Q199j2611l8867l5236j6827l6815o0099k2599
19029D39062l0512j3895j8204L099L4961k2458q144J5961j0452j8067q570j536
19017C61245k1270j4596M468p228o468K5661J8425J5531k1523k2886J8078J3766
19005C63203k5119j0017R58j3800Q42J304j4669J8664m529k9041R484l734k9492
18992B64054J3301Q148K5053j4965N254k2089o916J6724J0430L137K5273o583
$$ plain form
18980 320821 356011 402098 449394 518133 569465 655830 661885 636490 581487 541746 487837 451004
18968 451004 433856 413943 410421 385465 361529 351808 382144 383399 401698 433366 468895 480059
18956 480059 492108 476350 468559 473744 492832 528838 486795 480560 491995 453473 419669 390635
18944 390635 411457 462396 441112 436535 490026 514173 541484 558629 520288 517585 531595 536153
18932 536153 564932 616296 708595 813388 884745 993450 1072626 1121017 1153260 1181580 1160973
18921 1160973 1074724 967335 859785 759802 696145 654497 617407 582264 574555 618878 588480
18910 588480 539417 490290 484253 534000 565405 567436 583602 608527 608655 623565 647466 657319
18898 657319 615797 580763 570645 593919 582191 568674 589227 627980 653069 616407 622777 627535
$$ packed form
18980C20821L5190M6087M7296O8739N1332Q6365O055k5395n5003l9741n3909l6833
18968D51004j7148j9913l522k4956k3936r721L0336J255J8299L1668L5529J1164
18956D80059J2049j5758p791N185J9088L6006m2043o235J1435l8522l3804k9034
18944C90635K0822N0939k1284m577N3491K4147K7311J7145l8341k703J4010M558
18932E36153K8779N1364R2299J04793P1357J08705P9176M8391L2243K8320k0607
18921A160973q6249j07389j07550r9983o3657m1648l7090l5143p709M4323l0398
18910E88480m9063m9127o037M9747L1405K031J6166K4925J28J4910K3901R853
18898F57319m1522l5034j0118K3274j1728j3517K0553L8753K5089l6662O370M758
$$ plain form
18886 627535 648604 680378 642238 607850 645769 685621 743289 821197 903580 1012740 1055555
18875 1055555 1104575 1145989 1119100 1057664 1024996 965472 911883 858585 791712 711226 672636
18864 672636 666809 713095 788674 794566 825865 860082 857924 871136 910897 949266 931557 909325
18852 909325 942096 941613 935708 966968 1041871 1032364 1040908 1035788 1041055 1036314 1034623 1035140 1066981 1075083
18838 1075083 1082375 1111177 1127412 1153190 1187586 1199609 1225050 1262312 1317670 1380087 1458162
18827 1458162 1492483 1517349 1510081 1533558 1599650 1655502 1739180 1867718 1974850 2096308 2266296
18816 2266296 2437169 2636966 2858886 3097138 3403055 3752176 4136819 4550094 4954604
18807 4954604 5441020 6020066 6722636 7531202 8571653 9984494 11986123 14980639 19334999
$$ packed form
18886F27535K1069L1774l8140l4388L7919L9852N7668P7908Q2383J09160M2815
18875A055555M9020M1414k6889o1436l2668n9524n3589n3298o6873q0486l8590
18864F72636n827M6286P5579N892L1299L4217k158J3212L9761L8369j7709k2232
18852I09325L2771m83n905L1260P4903r507Q544n120N267m741j691N17L1841Q102
18838A075083P292K8802J6235K5778L4396J2023K5441L7262N5358O2417P8075
18827A458162L4321K4866p268K3477O6092N5852Q3678J28538J07132J21458J69988
18816B266296J70873J99797K21920K38252L05917L49121L84643M13275M04510
18807D954604M86416N79046P02570Q08566J040451J412841K001629K994516M354360
$$ plain form
18798 19334999 24604925 29554157 34518118 41358043 50282032 57359847 60279264 62376022
18790 62376022 67491656 73525368 76468484 76197964 77575196 84196481 93541651 99644121
18782 99644121 101338992 104828180 113609521 119755463 116844717 109724290 107293156 108342422
18774 108342422 105421994 96976662 88979296 86694330 88560411 88611628 83507399 77503224
18766 77503224 74853994 73018887 67270140 57750569 48688859 42052533 35970898 29509671
18758 29509671 23394365 18723421 15495569 13229404 11473112 10119094 9062840 8229297
18750 8229297 7529553 6914062 6367544 5859422 5399421 4996495 4621224 4266148 3981641
18741 3981641 3717788 3407983 3172335 2975809 2835606 2644474 2443686 2253591 2104396
$$ packed form
18798A9334999N269926M949232M963961O839925Q923989P077815K919417K096758
18790F2376022N115634O033712K943116k70520J377232O621285R345170O102470
18782I9644121J694871L489188Q781341O145942k910746p120427k431134J049266
18774A08342422k920428q445332p997366k284966J866081N1217n104229o004175
18766G7503224k649230j835107n748747r519571r061710o636326o081635o461227
18758B9509671o115306m670944l227852k266165j756292j354018j056254q33543
18750H229297o99744o15491n46518n08122m60001m02926l75271l55076k84507
18741C981641k63853l09805k35648j96526j40203j91132k00788j90095j49195
$$ plain form
18732 2104396 1998552 1900756 1784093 1699234 1601281 1519148 1424277 1348678 1319532 1302854 1254031
18721 1254031 1191825 1138923 1147503 1134254 1089811 1056873 1069554 1064819 1057844 1041494 1032690 1044429
18709 1044429 1083375 1159602 1321889 1503610 1724732 1959794 2156052 2221815 2126898 1962264
18699 1962264 1711623 1484447 1316656 1219410 1126028 1047191 987870 935398 921965 921724 886059
18688 886059 885915 920645 975222 1002296 1031002 1064781 1078584 1075960 1054247 1015869 976938 941977
18676 941977 895912 899279 896225 893898 930769 959131 974309 971722 970029 961669 964866 928326 889942
18663 889942 896595 898570 923669 955306 961622 969303 946680 921500 944325 938164 891984 881303
18651 881303 885594 873207 897536 896489 861467 858522 902626 950779 941800 944447 942596 955064 993006
$$ packed form
18732B104396j05844r7796j16663q4859r7953q2133r4871p5599k9146j6678m8823
18721A254031o2206n2902Q580j3249m4443l2938J2681m735o975j6350q804J1739
18709A044429L8946P6227J62287J81721K21122K35062J96258O5763r4917j64634
18699A962264k50641k27176j67791r7246r3382p8837n9321n2472j3433k41l5665
18688H86059j44L4730N4577K7074K8706L3779J3803k624k1713l8378l8931l4961
18676I41977m6065L367l054k327L6871K8362J5178k587j693q360L197l6540l8384
18663H89942O653J975K5099L1637O316P681k2623k5180K2825o161m6180j0681
18651H81303M291j2387K4329j047l5022k945M4104M8153q979K647j851J2468L7942
$$ plain form
18638 993006 1042121 1126591 1238360 1360282 1469557 1554024 1603547 1586134 1559721 1512184 1496361
18627 1496361 1525563 1539889 1571444 1623907 1741941 1886156 2041001 2139728 2249882 2376040
18617 2376040 2424165 2514319 2680022 2823018 2980386 3142019 3351540 3633925 3984614 4436898
18607 4436898 5100378 6059708 7436442 9570420 12868395 17038451 21053337 25076338
18599 25076338 29317327 31727272 31690978 30779945 30534752 31330306 32663606 34390725 37539068
18590 37539068 41365389 43402798 43695424 42853409 41807915 40698887 38306382 34973070
18582 34973070 31812133 29685677 28822958 28655862 28864744 30125055 31684799 31307451 28880681
18573 28880681 25447784 21854990 18137739 14627295 11972951 10253062 9144090 8387971
$$ packed form
18638I93006M9115Q4470J11769J21922J09275Q4467M9523j7413k6413m7537j5823
18627A496361K9202J4326L1555N2463J18034J44215J54845R8727J10154J26158
18617B376040M8125R0154J65703J42996J57368J61633K09521K82385L50689M52284
18607D436898O63480R59330J376734K133978L297975M170056M014886M023001
18599B5076338M240989K409945l6294r11033k45193P95554J333300J727119L148343
18590C7539068L826321K037409K92626q42015j045494j109028k392505l333312
18582C4973070l160937k126456q62719j67096K08882J260311J559744l77348k426770
18573B8880681l432897l592794l717251l510444k654344j719889j108972p56119
$$ plain form
18565 8387971 7884350 7607056 7487099 7536417 7756525 8098285 8614776 9415870 10499844
18556 10499844 12141680 14806638 19080523 25665867 33551091 40787530 48407404 56585710
18548 56585710 60819788 60417957 58566083 58234334 59422283 60874269 63192656 68568234
18540 68568234 75436622 79762125 81337724 80959573 80448450 80073015 76708992 70473015
18532 70473015 64137208 59814177 57586206 56206564 55496195 57112661 59893534 59041793
18524 59041793 54061761 47265674 40169612 32665044 25302792 19453964 15432697 12681562
18516 12681562 10702517 9214519 8094508 7170705 6436477 5887613 5507139 5103772 4734524
18507 4734524 4438195 4099793 3801985 3579703 3371168 3232032 3129281 3041849 2948934 2858425
$$ packed form
18565H387971n03621k77294j19957M9318K20108L41760N16491Q01094J083974
18556A0499844J641836K664958M273885O585344P885224P236439P619874Q178306
18548E6585710M234078m01831j851874l31749J187949J451986K318387N375578
18540F8568234O868388M325503J575599l78151n11123l75435l364023o235977
18532G0473015o335807m323031k227971j379642p10369J616466K780873q51741
18524E9041793m980032o796087p096062p504568p362252n848828m021267k751135
18516A2681562j979045j487998j120011r23803p34228n48864l80474m03367l69248
18507D734524k96329l38402k97808k22282k08535j39136j02751q7432r2915r0509
$$ plain form
18497 2858425 2758701 2705715 2703601 2716304 2776844 2838398 2934962 2945070 2907206 2951706 3100591
18486 3100591 3196638 3229155 3211821 3214182 3265196 3176446 3084419 3108583 3215646 3357905 3564895
18475 3564895 3866841 4210572 4597957 5189366 5950412 6943462 8285979 10282515 13365762
18466 13365762 18305984 26472765 38569070 53150638 66074891 74065133 77571216 77838829
18458 77838829 73216374 62881715 48898661 35799266 25978184 19476701 15227357 12337641
18450 12337641 10337518 8849471 7692111 6868709 6334778 5950707 5690216 5498600 5348594
18441 5348594 5349283 5407859 5448436 5469904 5507060 5512686 5549375 5607154 5696403 5790538 5896157 6066678
18429 6066678 6232572 6475345 6873810 7498737 8357622 9447104 10981107 13094588 15890850
$$ packed form
18497B858425r9724n2986k114J2703O0540O1554R6564J0108l7864M4500J48885
18486C100591R6047L2517j7334K361N1014q8750r2027K4164J07063J42259K06990
18475C564895L01946L43731L87385N91409P61046R93050J342517J996536L083247
18466A3365762M940222Q166781J2096305J4581568J2924253P990242L506083K67613
18458G7838829m622455j0334659j3983054j3099395r821082o501483m249344k889716
18450A2337641k000123j488047j157360q23402n33931l84071k60491j91616j50006
18441E348594O89N8576M0577K1468L7156N626L6689N7779Q9249R4135J05619J70521
18429F066678J65894K42773L98465O24927Q58885J089482J534003K113481K796262
$$ plain form
18420 15890850 19774259 25606029 35179466 50685879 72602829 98316472 121249969
18413 121249969 137518453 145400941 144580137 133294146 114346787 91405107 69589331
18406 69589331 51385862 37988768 28795934 22657393 18508180 15467749 13124355 11248190
18398 11248190 9729606 8518464 7598797 6914403 6439421 6153766 6010501 5873478 5772289
18389 5772289 5710739 5660826 5592024 5510279 5428730 5309131 5202843 5080671 4940416 4866363
18379 4866363 4817195 4840134 4945161 5173820 5573277 6138436 6930861 7976687 9444701
18370 9444701 11578666 14900996 20424868 29616285 42624629 57330983 68837461 75078648
18362 75078648 76702748 74831560 67615507 55603906 41730853 30006028 21733943 16335042
$$ packed form
18420A5890850L883409N831770R573437J5506413K1916950K5713643K2933497
18413A21249969J6268484P882488q20804j1285991j8947359k2941680k1815776
18406F9589331j8203469j3397094r192834o138541m149213l040431k343394j876165
18398A1248190j518584j211142r19667o84394m74982k85655j43265j37023j01189
18389E772289o1550m9913o8802q1745q1549j19599j06288j22172j40255p4053
18379D866363m9168K2939J05027K28659L99457N65159P92425J045826J468014
18370I444701K133965L322330N523872R191417J3008344J4706354J1506478O241187
18362G5078648J624100j871188p216053j2011601j3873053j1724825q272085n398901
$$ plain form
18354 16335042 12772435 10317469 8546055 7246583 6260142 5464181 4840169 4345589 3966032
18345 3966032 3647436 3442655 3309096 3189466 3115667 3050790 3008430 2974602 2939586 2991270
18335 2991270 2954184 2862910 2768646 2640528 2534980 2419874 2289859 2226365 2206432 2261322
18325 2261322 2323380 2376803 2431488 2511841 2643383 2765878 2902010 3045646 3204913 3327831
18315 3327831 3517937 3740821 3995884 4234286 4513572 4817218 5168932 5553854 6012179
18306 6012179 6572885 7213931 8011387 9170908 10885634 13518280 17690383 23743852 30097096
18297 30097096 34589109 38327825 44461601 53406715 58886695 59563757 60279587 66454049
18289 66454049 74902601 79558745 80651855 84212667 92055323 97520561 95052582 87546877
$$ packed form
18354A6335042l562607k454966j771414j299472r86441p95961o24012m94580l79557
18345C966032l18596k04781j33559j19630p3799o4877m2360l3828l5016N1684
18335B991270l7086r1274r4264j28118j05548j15106j30015o3494j9933N4890
18325B261322O2058N3423N4685Q0353J31542J22495J36132J43636J59267J22918
18315C327831J90106K22884K55063K38402K79286L03646L51714L84922M58325
18306F012179N60706O41046P97456J159521J714726K632646M172103O053469O353244
18297C0097096M492013L738716O133776Q945114N479980O77062P15830O174462
18289F6454049Q448552M656144J093110L560812P842656N465238k467979p505705
$$ plain form
18281 87546877 82293119 80931802 78417302 71273906 63366037 60204650 60942915 58011273
18273 58011273 50786032 43221728 38993832 35545466 30355577 24251649 19146087 15789174
18265 15789174 13599932 12005820 10867560 10032683 9467999 9130559 8831145 8552032 8411896
18256 8411896 8448425 8767039 9383229 10481412 12583664 15766065 18869515 20984261 23020410
18247 23020410 26743664 31427014 33513909 33402523 33963397 37532075 41564160 43310117
18239 43310117 43699135 46124663 50482964 52656995 50113951 45978810 43696841 42926332
18231 42926332 40375419 35892476 32194957 31457293 31158552 28553114 24488772 21331259
18223 21331259 19477107 17084826 13924114 10822719 8508145 6912919 5814973 5039476
$$ packed form
18281H7546877n253758j361317k514500p143396p907869l161387P38265k931642
18273E8011273p225241p564304m227896l448366n189889o103928n105562l356913
18265A5789174k189242j594112j138260q34877n64684l37440k99414k79113j40136
18256H411896L6529L18614O16190J098183K102252L182401L103450K114746K036149
18247B3020410L723254M683350K086895j11386N60874L568678M032085J745957
18239D3310117L89018K425528M358301K174031k543044m135141k281969p70509
18231D2926332k550913m482943l697519p37664k98741k605438m064342l157513
18223B1331259j854152k392281l160712l101395k314574j595226j097946p75497
$$ plain form
18215 5039476 4478406 4017135 3603167 3313051 3055441 2780784 2539540 2263608 2010573
18206 2010573 1845661 1751863 1662987 1587788 1495243 1407433 1306592 1211530 1104230 976852
18196 976852 943703 872226 792128 713074 629027 565241 500636 463060 467725 469097 459111 399176
18184 399176 351740 343857 346827 326330 327148 309811 263410 246023 296602 345524 315448 293272
18172 293272 318514 333195 344776 388484 388209 386742 374084 366818 361349 382699 393626 396425 440606
18159 440606 422105 398751 378177 400268 440138 457390 428935 399642 373355 357046 310703
18148 310703 315276 326524 306797 273916 281162 307846 320446 377955 400119 433872 478639 506203
18136 506203 515880 531978 510505 527636 549193 561216 593596 638547 731341 795727 804504 852591
$$ packed form
18215E039476n61070m61271m13968k90116k57610k74657k41244k75932k53035
18206B010573j64912r3798q8876p5199r2545q7810j00841r5062j07300j27378
18196I76852l3149p1477q0098p9054q4047o3786o4605l7576M665J372r986n9935
18184C99176m7436p883K970k0497Q18j7337m6401j7387N0579M8922l0076k2176
18172B93272K5242J4681J1581M3708k75j467j2658p266n469K1350J0927K799M4181
18159D40606j8501k3354k0574K2091L9870J7252k8455k9293k6287j6309m6343
18148C10703M573J1248j9727l2881P246K6684J2600N7509K2164L3753M4767K7564
18136E06203R677J6098k1473J7131K1557J2023L2380M4951R2794O4386Q777M8087
$$ plain form
18124 852591 924135 1022116 1126753 1236680 1385668 1569111 1756384 1980081 2220232 2560884
18114 2560884 3001343 3532351 4237576 5330249 7050855 9941471 14946442 24516458 43983181
18105 43983181 69346682 73920960 59714970 37420556 23114110 15763807 11395939
18098 11395939 8520867 6630452 5337191 4367297 3612477 3052696 2658044 2274398 1923499
18089 1923499 1653432 1449445 1322653 1232016 1114241 971641 866643 827850 820594 812371
18079 812371 744602 730569 726896 737982 754424 711914 741448 747980 739294 748365 788093 760797
18067 760797 754839 807755 838334 886812 933151 946735 966902 974111 990982 1030824 1097627 1192269
18055 1192269 1280485 1309136 1293411 1254365 1179341 1107677 991353 908073 749917 597213 501622
$$ packed form
18124H52591P1544R7981J04637J09927J48988J83443J87273K23697K40151L40652
18114B560884M40459N31008P05225J092673J720606K890616N004971R570016J9466723
18105D3983181K5363501M574278j4205990k2294414j4306446p350303m367868
18098A1395939k875072j890415j293261r69894p54820n59781l94652l83646l50899
18089A923499k70067k03987j26792r0637j17775j42600j04998l8793p256q223
18079H12371o7769j4033l673J1086J6442m2510K9534O532q686R071L9728k7296
18067G60797n958N2916L0579M8478M6339J3584K0167P209J6871L9842O6803R4642
18055A192269Q8216K8651j5725l9046p5024p1664j16324q3280j58156j52704r5591
$$ plain form
18044 501622 453564 416555 399324 366716 282502 266381 244669 242122 239937 257118 247802 229404
18032 229404 280213 308402 347714 318257 279315 304228 326058 362011 362851 398365 446322 476520
18020 476520 509856 567335 577401 572377 637626 685265 702784 725159 755430 791946 820437 862068
18008 862068 842208 868215 940621 958856 927719 884570 796396 713969 637037 573750 479612
17997 479612 409076 364832 305846 242773 187130 189775 195014 174751 166157 192612 180561 148127
17985 148127 156028 161455 114783 72506 95469 148378 186680 240448 262708 244368 250298 288866
17973 288866 301463 314396 319254 294205 295467 289172 303540 350718 364183 366821 346212 365538
17961 365538 410710 434086 400135 367181 371997 346743 245952 216698 221637 199142 198945 196393
$$ packed form
18044E01622m8058l7009j7231l2608q4214j6121k1712k547k185J7181r316j8398
18032B29404N0809K8189L9312k9457l8942K4913K1830L5953Q40L5514M7957L0198
18020D76520L3336N7479J0066n024O5249M7639J7519K2375L0271L6516K8491M1631
18008H62068j9860K6007P2406J8235l1137m3149q8174q2427p6932o3287r4138
17997D79612p0536m4244n8986o3073n5643K645N239k0263q594K6455j2051l2434
17985A48127P901N427m6672m2277K2963N2909L8302N3768K2260j8340N930L8568
17973B88866J2597J2933M858k5049J262o295J4368M7178J3465K638k0609J9326
17961C65538M5172K3376l3951l2954M816k5254j00791k9254M939k2495j97k552
$$ plain form
17949 196393 222867 235305 276639 353505 421151 488755 537848 579976 589718 541764 484523 456731
17937 456731 398155 320674 265863 249161 232571 188102 143448 157793 142666 134684 157198 145680
17925 145680 123632 112046 128490 135534 170596 210756 178113 162121 205138 209784 237663 278392
17913 278392 334517 321012 319425 326442 336952 323191 313857 274161 251985 228949 212698 219142
17901 219142 248351 261887 275200 337780 437933 558623 681297 794977 900522 930831
17891 930831 914752 842964 725005 641644 570840 479212 380155 346028 310043 244882 205842
17880 205842 217589 196157 199325 217656 230366 248253 265747 271158 242844 228414 221265 249738
17868 249738 277787 311543 349148 353194 385897 429804 435361 433636 446146 462906 449324 423438
$$ packed form
17949A96393K6474J2438M1334P6866O7646O7604M9093M2128R742m7954n7241k7792
17937D56731n8576p7481n4811j6702j6590m4469m4654J4345j5127p982K2514j1518
17925A45680k2048j1586J6444P044L5062M0160l2643j5992M3017M646K7879M0729
17913B78392N6125j3505j587P017J0510j3761r334l9696k2176k3036j6251O444
17901B19142K9209J3536J3313O2580J00153J20690J22674J13680J05545L0309
17891I30831j6079p1788j17959q3361p0804r1628r9057l4127l5985o5161l9040
17880B05842J1747k1432L168J8331J2710J7887J7494N411k8314j4430p149K8473
17868B49738K8049L3756L7605M046L2703M3907N557j725J2510J6760j3582k5886
$$ plain form
17856 423438 353869 257739 177892 146940 123941 119532 180667 237286 261139 255584 276664 365442
17844 365442 396007 411248 425246 453181 420594 368921 323992 286610 266576 260685 243513 230088
17832 230088 244883 213699 167269 166914 231925 255374 276294 268176 254458 284852 302131 317850
17820 317850 312975 317044 274022 237665 222208 195115 172704 187570 181655 198737 170924 142222
17808 142222 109912 101486 142408 118251 62154 49928 99267 86868 59521 97215 94468 70498
17796 70498 94814 95376 74138 123523 202650 226583 201236 186731 168917 181532 262489 313857
17784 313857 347622 361579 406981 414341 431038 440978 436925 465003 489261 473194 452891 394299
17772 394299 359425 332614 320858 339069 360531 287933 257451 255007 229456 200219 183767 163777
$$ packed form
17856D23438o9569r6130p9847l0952k2999m409O1135N6619K3853n555K1080Q8778
17844C65442L0565J5241J3998K7935l2587n1673m4929l7382k0034n891j7172j3425
17832B30088J4795l1184m6430l55O5011K3449K0920q118j3718L0394J7279J5719
17820C17850m875M069m3022l6357j5457k7093k2411J4866n915J7082k7813k8702
17808A42222l2310q426M0922k4157n6097j2226M9339j2399k7347L7694k747k3970
17796G0498K4316N62k1238M9385P9127K3933k5347j4505j7814J2615Q0957N1368
17784C13857L3765J3957M5402P360J6697R940m053K8078K4258j6067k0303n8592
17772C94299l4874k6811j1756J8211K1462p2598l0482k444k5551k9237j6452j9990
$$ plain form
17760 163777 128684 85090 109683 122717 84043 114874 130773 140697 135646 113739 53058 26986
17748 26986 24769 21759 24724 54121 79429 112173 131645 165382 198635 233892 286720 341279
17736 341279 338875 316607 322444 290515 258169 240870 277419 294446 308624 325217 321692 303194
17724 303194 302943 295719 272214 258484 209707 178077 166658 146233 126480 86069 66002 42501
17712 42501 -5345 -40652 -35715 -28404 -33232 -34892 18905 33552 -36320 -39708 -4520 33524 37753
17699 37753 29890 40543 -1556 -11189 31906 60122 47876 27251 11271 16823 18993 58842
17687 58842 65054 52689 43270 74654 74878 82024 60882 82605 93566 95631 89869 94310 99003
17674 99003 52259 11355 17952 44181 59154 70714 62496 38853 8396 48588 90052 35372
$$ packed form
17760A63777l5093m3594K4593J3034l8674L0831J5899R924n051k1907o0681k6072
17748B6986k217l010K965K9397K5308L2744J9472L3737L3253L5257N2828N4559
17736C41279k404k2268N837l1929l2346j7299L6549J7027J4178J6593l525j8498
17724C03194k51p224k3505j3730m8777l1630j1419k0425j9753m0411k0067k3501
17712D2501m7846l5307M937P311m828j660N3797J4647o9872l388L5188L8044M229
17699C7753p863J0653m2099r633M3095K8216j2246k0625j5980N552K170L9849
17687E8842O212j2365r419L1384K24P146k1142K1723J0961K065n762M441M693
17674I9003m6744m0904O597K6229J4973J1560q218k3643l0457M0192M1464n4680
$$ plain form
17662 35372 6018 -5506 32397 65854 70431 52705 64597 108319 89710 81645 120853 120230
17650 120230 134560 126103 114651 150153 203819 243672 251694 248777 253914 270962 311886 311000 321638
17637 321638 283475 227488 227705 219422 186889 163224 192469 150188 90962 59950 116728 161958
17625 161958 155354 154383 131697 137705 154532 146308 110996 129621 140786 149362 158605 187797 220042
17612 220042 241151 276568 282156 268902 258799 270497 274774 279343 283001 248953 200055 128343
17600 128343 103474 105410 141551 158402 128302 151696 120174 79790 84712 94605 93131 83634
17588 83634 89897 74499 61990 58849 54176 67966 100829 105958 109396 111624 106104 88948 112536
17575 112536 108391 79308 93069 150058 157629 124224 130559 173025 188242 203220 198642 230377
$$ packed form
17662C5372k9354j1524L7903L3457M577j7726J1892M3722j8609q065L9208o23
17650A20230J4330q457j1452L5502N3666L9853Q022k917N137J7048M0924q86J0638
17637C21638l8163n5987K17q283l2533k3665K9245m2281n9226l1012N6778M5230
17625A61958o604r71k2686O008J6827q224l5312J8625J1165Q576R243K9192L2245
17612B20042K1109L5417N588j3254j0103J1698M277M569L658l4048m8898p1712
17600A28343k4869J936L6141J6851l0100K3394l1522m0384M922R893j474r497
17588H3634O263j5398j2509l141m673J3790L2863N129L438K228n520j7156K3588
17575A12536m145k9083J3761N6989P571l3405O335M2466J5217J4978m578L1735
$$ plain form
17563 230377 261864 266215 238850 259138 332405 379430 417273 442626 490973 485509 435558 409590
17551 409590 434892 403389 342023 290939 290664 293406 281103 291059 285580 257108 291157 362157
17539 362157 418114 420064 438482 542914 627543 716497 798775 884544 994465 1106727 1150029
17528 1150029 1148125 1074537 990227 910296 854828 742701 638706 578586 528220 464653 461590
17517 461590 482199 497387 525329 543642 515917 507155 495654 491493 518999 534084 597901 682992
17505 682992 719430 760835 785764 781105 747894 756852 782868 763718 720962 727047 702057 711445
17493 711445 724102 747978 742285 711491 653562 664709 685135 613099 577517 572584 543708 485355
17481 485355 460412 462115 404654 393492 395488 362550 341315 349663 317056 300068 298495 287098
$$ packed form
17563B30377L1487M351k7365K0288P3267M7025L7843K5353M8347n464m9951k5968
17551D09590K5302l1503o1366n1084k75K742j2303R956n479k8472L4049P1000
17539C62157N5957J950J8418J04432Q4629Q8954Q2278Q5769J09921J12262M3302
17528A150029j904p3588q4310p9931n5468j12127j03995o0120n0366o3567l063
17517D61590K0609J5188K7942J8313k7725q762j1501m161K7506J5085O3817Q5091
17505F82992L6438M1405K4929m659l3211Q958K6016j9150m2756O085k4990R388
17493G11445J2657K3876n693l0794n7929J1147K0426p2036l5582m933k8876n8353
17481D85355k4943J703n7461j1162J996l2938k1235Q348l2607j6988j573j1397
$$ plain form
17469 287098 280410 270028 221057 177230 186526 201744 209723 173029 158276 210082 230571 203329
17457 203329 129700 125883 159466 166422 172398 167165 152210 163608 154822 138737 147995 168503 179594
17444 179594 216926 312827 342587 374942 430695 552056 748126 843166 812453 749919 699925
17433 699925 694126 726452 777408 788483 754698 756049 774159 800324 770949 750024 718693 685300
17421 685300 666696 649836 596510 534063 500285 451549 401966 362368 334003 331457 327841 291590
17409 291590 245050 236304 212252 168474 176711 163875 166859 151878 133548 179261 196360 179162
17397 179162 167296 179307 209786 210637 242636 288390 335611 364515 386795 408001 426672 437028
17385 437028 512580 589802 590341 559948 546552 539122 520715 492654 467477 452747 432876 423552
$$ packed form
17469B87098o688j0382m8971m3827R296J5218P979l6694j4753N1806K0489k7242
17457B03329p3629l817L3583O956N976n233j4955J1398q786j6085R258K0508J1091
17444A79594L7332R5901K9760L2355N5753J21361J96070R5040l0713o2534m9994
17433F99925n799L2326N0956J1075l3785J351J8110K6165k9375k0925l1331l3393
17421F85300j8604j6860n3326o2447l3778m8736m9583l9598k8365k546l616l6251
17409B91590m6540q746k4052m3778Q237j2836K984j4981j8330M5713J7099j7198
17397A79162j1866J2011L0479Q51L1999M5754M7221K8904K2280K1206J8671J0356
17385D37028P5552P7222N39l0393j3396p430j8407k8061k5177j4730j9871r324
$$ plain form
17373 423552 365717 342889 298270 320299 266218 230834 246033 197539 162634 165545 184921 159946
17361 159946 141525 183103 202807 225788 289265 338783 375767 399084 413554 370606 371442 387153
17349 387153 386040 386904 377907 376395 356713 315698 300347 309669 293962 301682 344958 360150 355946
17336 355946 387490 363331 337975 309840 322891 287810 264542 280691 255668 206034 169228
17325 169228 131112 102596 93216 107347 132339 147364 156164 175429 202411 165660 106952 91544
17313 91544 89525 85083 83399 123896 150937 161188 180265 195976 220329 245854 263293 308946
17301 308946 354663 323250 327044 330015 351803 400992 386116 348156 360663 374703 361323 367408
17289 367408 402379 417860 440938 425149 425575 408368 400540 441516 451750 438695 412507 388078
$$ packed form
17373D23552n7835k2828m4619K2029n4081l5384J5199m8494l4905K911J9376k4975
17361A59946j8421M1578J9704K2981O3477M9518L6984K3317J4470m2948Q36J5711
17349C87153j113Q64q997j512j9682m1015j5351R322j5707P720M3276J5192m204
17336C55946L1544k4159k5356k8135J3051l5081k3268J6149k5023m9634l6806
17325A69228l8116k8516r380J4131K4992J5025Q800J9265K6982l6751n8708j5408
17313I1544k019m442j684M0497K7041J0251J9077J5711K4353K5525J7439M5653
17301C08946M5717l1413L794K971K1788M9189j4876l7960J2507J4040j3380O085
17289C67408L4971J5481K3078j5789M26j7207p828M0976J0234j3055k6188k4429
$$ plain form
17277 388078 357492 366293 362840 365606 318242 316930 318636 321724 358756 365979 364769 371228 377346
17264 377346 369320 354492 339351 334794 326884 302660 286729 297404 298342 280794 279317 216574 184680
17251 184680 210838 200509 183320 171363 148033 143504 200741 196037 157930 198264 234607 224293
17239 224293 228100 226600 238686 218614 215717 242337 244962 237940 215533 222143 274308 303343 310375
17226 310375 273826 294787 310987 310516 315109 305398 289847 283818 294305 293902 254777 245450 241110
17213 241110 205347 188701 166787 153211 164706 182490 187019 179106 212565 228542 223337 218723
17201 218723 224542 231362 249901 274011 247675 229986 194925 193067 175561 172338 187977 216163
17189 216163 249017 256476 301160 341273 321028 325559 346236 365821 353622 331204 358877 363184
$$ packed form
17277C88078l0586Q801l453K766m7364j312J706L088L7032P223j210O459O118
17264C77346q026j4828j5141m557p910k4224j5931J0675R38j7548j477o2743l1894
17251A84680K6158j0329j7189j1957k3330m529N7237m704l8107M0334L6343j0314
17239B24293L807j500J2086k0072k897K6620K625p022k2407O610N2165K9035P032
17226C10375l6549K0961J6200m71M593r711j5551o029J0487m03l9125r327m340
17213B41110l5763j6646k1914j3576J1495J7784M529p913L3459J5977n205m614
17201B18723N819O820J8539K4110k6336j7689l5061j858j7506l223J5639K8186
17189B16163L2854P459M4684M0113k0245M531K0677J9585j2199k2418K7673M307
$$ plain form
17177 363184 346058 318211 326911 313451 265402 282426 266746 285083 276265 257587 261426 232072
17165 232072 235813 250543 237866 227134 211022 170281 178441 181527 195593 182052 138872 166371
17153 166371 157704 140918 182278 193703 182778 176111 162394 155280 130726 90668 89123 103921
17141 103921 112678 127813 120130 107197 109935 107037 90299 88041 103431 87812 77862 97849 117927
17128 117927 98940 107642 128122 131460 92743 79177 101793 119446 129837 112495 92315 86991
17116 86991 37990 89281 100718 102399 104727 86032 47552 29642 19407 14579 -12899 -52811
17104 -52811 -29780 1084 12113 42890 54218 -3971 -14533 -14260 -41093 -27537 -3513 33534
17092 33534 59687 37628 36045 42173 44465 38875 35693 -643 -40307 -39820 -39134 3735 15545
$$ packed form
17177C63184j7126k7847Q700j3460m8049J7024j5680J8337q818j8678L839k9354
17165B32072L741J4730j2677j0732j6112m0741Q160L086J4066j3541m3180K7499
17153A66371q667j6786M1360J1425j0925o667j3717p114k4554m0058j545J4798
17141A03921Q757J5135p683j2933K738k898j6738k258J5390j5619r950J9987K0078
17128A17927j8987Q702K0480L338l8717j3566K2616J7653J0391j7342k0180n324
17116H6991m9001N1291J1437J681K328j8695l8480j7910j0235m828k7478l9912
17104e2811K3031L0864J1029L0777J1328n8189j0562K73k6833J3556K4024L7047
17092C3534K6153k2059j583O128K292n590l182l6336l9664M87O86M2869J1810
$$ plain form
17079 15545 -13888 -29340 -27354 -69733 -88754 -100835 -101986 -53320 -73 -11437 297 28834
17067 28834 12155 7667 15765 -2019 -43388 -75371 -58336 -32503 -31941 -59962 -51674 -847 -41852
17054 -41852 -76118 -63381 -54837 -62458 -80057 -89354 -56734 -61735 -92097 -93319 -59682 -20628 -12273
17041 -12273 -11532 2986 -50138 -80389 -58860 -86944 -60363 -17710 -43811 -73893 -99882 -77066
17029 -77066 -48578 -22104 -19431 -40415 -39941 -19525 -8198 -28471 -48050 -85717 -91359 -54169
17017 -54169 -102508 -109396 -102135 -112239 -107126 -110525 -96290 -62941 -32726 -93442 -83701 -88034 -78996
17004 -78996 -53360 -44003 -51795 -53869 -50384 -37715 -47508 -95239 -132369 -83053 -53075 -62077 -72660
16991 -72660 -68854 -60626 -54085 -73056 -55475 -20310 4956 14317 -11219 -29485 -32961 -52075 -39777
$$ packed form
17079A5545k9433j5452J986m2379j9021j2081j151M8666N3247j1364J1734K8537
17067B8834j6679m488Q098j7784m1369l1983J7035K5833N62k8021Q288N0827m1005
17054d1852l4266J2737Q544p621j7599r297L2620n001l0362j222L3637L9054Q355
17041a2273P41J4518n3124l0251K1529k8084K6581M2653k6101l0082k5989K2816
17029g7066K8488K6474K673k0984M74K0416J1327k0273j9579l7667n642L7190
17017e4169m8339o888P261j0104N113l399J4235L3349L0215o0716R741m333R038
17004g8996K5636R357p792k074L485J2669r793m7731l7130M9316K9978r002j0583
16991g2660L806Q228O541j8971J7581L5165K5266R361k5536j8266l476j9114J2298
$$ plain form
16978 -39777 13460 51648 41329 72791 86453 74962 61812 82220 104517 55398 43270 63817
16966 63817 64512 50832 20418 19128 45475 39118 52047 35504 3069 -30337 -17771 -2030
16954 -2030 8695 13879 8414 15722 -3405 9191 4753 22267 19039 14448 35862 32678 18112
16941 18112 20345 -5023 -32015 -41802 -19732 11939 6258 -18274 -24562 -34424 -35143 -10558 6451
16928 6451 -14774 -34207 -65391 -46825 -34393 -14106 8151 45917 31304 -3069 -13108 -3242
16916 -3242 18901 52721 43893 56949 35404 -27321 -50077 -47308 -102087 -149486 -151003 -119907
16904 -119907 -88943 -62041 -25818 21184 13625 -22592 -40251 -31086 -16079 -36872 -39577 -18117
16892 -18117 -35813 -54385 -72172 -89558 -88477 -78803 -86726 -108602 -116168 -110448 -112563 -119335 -103514
$$ packed form
16978c9777N3237L8188j0319L1462J3662j1491j3150K0408K2297m9119j2128K0547
16966F3817O95j3680l0414j290K6347o357J2929j6543l2435l3406J2566J5741
16954b030J0725N184n465P308j9127J2596m438J7514l228m591K1414l184j4566
16941A8112K233k5368k6992r787K2070L1671n681k4532o288r862p19K4585J7009
16928F451k1225j9433l1184J8566J2432K0287K2257L7766j4613l4373j0039R866
16916c242K2143L3820q828J3056k1545o2725k2756K769n4779m7399j517L1096
16904a19907L0964K6902L6223M7002p559l6217j7659R165J5007k0793k705K1460
16892a8117j7696j8572j7787j7386J081R674p923k1876p566N720k115o772J5821
$$ plain form
16879 -103514 -98996 -105778 -112641 -100927 -81382 -78416 -94794 -77125 -60896 -62224 -36986 -19909
16867 -19909 -35460 -51156 -53820 -33207 -13274 -12836 -40459 -91412 -137100 -130056 -95434 -74180
16855 -74180 -83359 -77018 -98314 -114603 -110908 -100158 -87564 -95586 -80781 -55138 -65497 -72181 -54633
16842 -54633 -66097 -65784 -57832 -53850 -67320 -53234 -60282 -73654 -110517 -117545 -63997 -53396 -58019
16829 -58019 -41889 -35853 -36124 -23204 -9131 11519 -13224 -12886 -43986 -45845 -68300 -75936 -53583
16816 -53583 -46300 -78259 -75516 -56165 -39865 -64020 -47782 -57913 -52789 -44474 -43234 -43967 -73648
16803 -73648 -41738 -26656 -59693 -77228 -43429 -57457 -91848 -65033 -22413 -46894 -34609 -24391
16791 -24391 -14069 -14376 -29721 -33467 -47552 -59977 -62360 -77979 -91679 -83877 -52785 -45498 -37085
$$ packed form
16879a03514M518o782o863J1714J9545K966j6378J7669J6229j328K5238J7077
16867a9909j5551j5696k664K0613J9933M38k7623n0953m5688P044L4622K1254
16855g4180r179O341k1296j6289L695J0750J2594q022J4805K5643j0359o684J7548
16842e4633j1464L13P952L982j3470J4086p048j3372l6863p028N3548J0601m623
16829e8019J6130O036k71J2920J4073K0650k4743L38l1100j859k2455p636K2353
16816e3583P283l1959K743J9351J6300k4155J6238j0131N124Q315J240p33k9681
16803g3648L1910J5082l3037j7535L3799j4028l4391K6815M2620k4481J2285J0218
16791b4391J0322l07j5345l746j4085j2425k383j5619j3700P802L1092P287Q413
$$ plain form
16778 -37085 -59332 -100533 -105336 -87522 -80397 -102014 -111900 -101113 -105674 -97651 -73575 -39771 -67220
16765 -67220 -109217 -145069 -138873 -108769 -127970 -117693 -69031 -65293 -79150 -68839 -38612 -54470
16753 -54470 -48115 -10271 10715 17961 -44904 -59344 -23922 -34668 -70885 -49971 -40848 -42915
16741 -42915 -17107 11058 -25847 -60880 -84839 -73556 -43319 -62939 -91292 -90316 -52218 -62343
16729 -62343 -96080 -59044 -27305 -47973 -35265 -54178 -40399 -37286 -23915 -8969 -274 -27144
16717 -27144 -40570 -4109 25118 9447 21647 5638 -4006 -23077 -37335 -50911 -31084 -53218
16705 -53218 -90289 -89339 -39781 -323 -8745 16947 17407 3266 -58523 -75210 -48499 -51199 -29013
16692 -29013 -51696 -65521 -15401 -25190 -81105 -85215 -20208 -23926 -19352 -24599 -48035 -33478 14585
$$ packed form
16778c7085k2247m1201m803J7814P125k1617r886J0787m561Q023K4076L3804k7449
16765f7220m1997l5852O196L0104j9201J0277M8662L738j3857J0311L0227j5858
16753e4470O355L7844K0986P246o2865j4440L5422j0746l6217K0914R123k067
16741d2915K5808K8165l6905l5033k3959J1283L0237j9620k8353R76L8098j0125
16729f2343l3737L7036L1739k0668J2708j8913J3779L113J3371J4946Q695k6870
16717b7144j3426L6461K9227j5671J2200j6009r644j9071j4258j3576J9827k2134
16705e3218l7071R50M9558L9458q422K5692M60j4141o1789j6687K6711k700K2186
16692b9013k2683j3825N0120r789n5915m110O5007l718M574n247k3436J4557M8063
$$ plain form
16679 14585 34354 52312 47481 14256 8127 1699 -33504 -38052 -43805 -87930 -79144 -62636 -77952
16666 -77952 -71486 -52517 -35909 -9413 -13405 -10565 -13180 -19138 1977 25510 1804 -45790 -94341
16653 -94341 -83827 -39126 -19511 -38480 -59328 -30267 -11807 30225 13241 -27568 -38606 -17872
16641 -17872 -5282 -42298 -36667 -20699 -15296 -22024 -13681 9157 -7030 9792 38800 58945
16629 58945 66029 81727 89779 64671 38042 11149 6810 9032 34858 14026 -36802 -44951 -47354
16616 -47354 -40293 4779 4766 -20421 -67919 -72681 -46667 -5241 -35560 -52731 -36070 -19476 -31170
16603 -31170 8531 35071 -6220 -9508 19224 27637 30685 -10183 -2613 11470 1122 8907 -9874
16590 -9874 -18673 3100 -16706 -44975 -64689 -91881 -80926 -68039 -37694 1435 4637 -60532
$$ packed form
16679A4585J9769J7958m831l3225o129o428l5203m548n753m4125Q786J6508j5316
16666g7952O466J8969J6608K6496l992K840k615n958K1115K3533k3706m7594m8551
16653i4341J0514M4701J9615j8969k0848K9061J8460M2032j6984m0809j1038K0734
16641a7872J2590l7016N631J5968N403o728Q343K2838j6187J6822K9008K0145
16629E8945P084J5698Q052k5108k6629k6893m339K222K5826k0832n0828q149k403
16616d7354P061M5072j3k5187m7498m762K6014M1426l0319j7171J6661J6594j1694
16603c1170L9701K6540m1291l288K8732Q413L048m0868P570J4083j0348P785j8781
16590i874q799K1773j9806k8269j9714k7192J0955J2887L0345L9129L202o5169
$$ plain form
16578 -60532 -76968 -50836 -32273 -16888 -27662 -44180 817 23028 15226 -20017 -62416 -77568
16566 -77568 -71043 -46141 -47349 -77678 -38055 -31404 -51091 -45079 -67143 -98497 -88745 -70909 -79148
16553 -79148 -24384 -3333 6275 13819 32548 19055 -11109 -40106 -44779 -31836 -49394 -89860
16541 -89860 -93989 -79459 -88945 -91243 -88347 -68008 -45694 -47672 -91687 -136170 -75040 -4365 -20182
16528 -20182 -41153 -28448 -14919 -13371 9019 -4853 -9492 -37842 -42530 -27187 32721 18889
16516 18889 -10438 -41045 -5218 -5263 -22209 -379 -35340 -68279 -44944 -84251 -70661 -55290
16504 -55290 -65628 -39295 -16939 -3855 3616 18628 23251 -7327 8809 40588 42298 20627
16492 20627 -3339 7222 31879 45908 37212 15065 16368 19122 47038 45664 -21305 -35165
$$ packed form
16578f0532j6436K6132J8563J5385j0774j6518M4997K2211p802l5243m2399j5152
16566g7568O525K4902j208l0329L9623O651j9687O012k2064l1354R752J7836q239
16553g9148N4764K1051R608P544J8729j3493l0164k8997m673J2943j7558m0466
16541h9860m129J4530r486k298K896K0339K2314j978m4015m4483O1130P0675j5817
16528b0182k0971J2705J3529J548K2390j3872m639k8350m688J5343N9908j3832
16516A8889k9327l0607L5827m5j6946K1830l4961l2939K3335l9307J3590J5371
16504e5290j0338K6333K2356J3084P471J5012M623l0578J6136L1779J710k1671
16492B0627k3966J0561K4657J4029q696k2147J303K754K7916j374o6969j3860
$$ plain form
16480 -35165 -40812 -46713 -61432 -75345 -24826 -33705 -47084 -37111 -30592 -32969 -53564 -70110 -89879
16467 -89879 -84601 -81713 -79059 -63543 -1616 12915 10957 4754 2361 1616 5865 -41533 -55073
16454 -55073 -46901 10331 11111 10165 -13816 -44028 -52377 -73607 -61991 -73845 -120600 -131890 -102794
16441 -102794 -50181 -35664 -36267 -19399 6386 -27168 -60233 -67083 -43803 -27463 -23576 -55850
16429 -55850 -24884 -29929 -26914 -4900 -14373 11044 14879 -7634 -21201 -50766 -64669 -57403 -46865
16416 -46865 -38780 -34404 -62769 -51987 -50239 -53261 -60033 -69050 -64278 -56653 -76288 -31343 -893
16403 -893 -7836 -43331 -45550 -76846 -92467 -45076 -19847 -17160 -43229 -59379 -81260 -58119 -37654
16390 -37654 -5346 -4710 -17465 -59753 -81710 -97243 -105312 -80958 -44557 11309 1370 -6487 -39664
$$ packed form
16480c5165n647n901j4719j3913N0519q879j3379R973O519k377k0595j6546j9769
16467h9879N278K888K654J5516O1927J4531j958o203k393p45M249m7398j3540
16454e5073Q172N7232P80r46k3981l0212q349k1230J1616j1854m6755j1290K9096
16441a02794N2613J4517o03J6868K5785l3554l3065o850K3280J6340L887l2274
16429e5850L0966n045L015K2014r473K5417L835k2513j3567k9565j3903P266J0538
16416d6865Q085M376k8365J0782J748l022o772r017M772P625j9635M4945L0450
16403h93o943l5495k219l1296j5621M7391K5229K687k6069j6150k1881K3141K0465
16390c7654L2308O36j2755m2288k1957j5533q069K4354L6401N5866r939p857l3177
$$ plain form
16377 -39664 -48218 -25015 -28399 -37017 -5884 -7213 -13551 -7163 -58478 -120194 -125597 -57427 -32573
16364 -32573 -20507 -48626 -75239 -57380 -52521 -68578 -47531 5458 -39155 -28481 -5766 -5333
16352 -5333 -4035 -29600 -103207 -84944 -89722 -94051 -75585 -68341 -49355 -37110 -20789 -34484 -25277
16339 -25277 -22522 -22867 -47233 -50191 -4233 -691 13100 -20703 -27795 -20017 -32534 -18473 -4804
16326 -4804 -12968 -3661 -2516 15043 49807 56388 11749 -6170 4637 72834 105435 81804 73194
16313 73194 46752 35346 29812 4877 -23595 -2766 44123 61378 76657 77818 68788 84129
16301 84129 123300 143834 149155 150975 181264 199037 172597 164180 154103 112807 99890 99995 60391
16288 60391 20343 27396 14746 -991 -3903 -24361 -15647 -6362 -24321 -19365 -48464 -37117 -14831
$$ packed form
16377c9664q554K3203l384q618L1133j329o338O388n1315o1716n403O8170K4854
16364c2573J2066k8119k6613J7859M859j6057K1047N2989m4613J0674K2715M33
16352e333J298k5565p3607J8263m778m329J8466P244J8986J2245J6321j3695R207
16339b5277K755l45k4366k958M5958L542J3791l3803p092P778j2517J4061J3669
16326d804q164R307J145J7559L4764O581m4639j7919J0807O8197L2601k3631q610
16313G3194k6442j1406n534k4935k8472K0829M6889J7255J5279J161r030J5341
16301H4129L9171K0534N321J820L0289J7773k6440q417j0077m1296j2917J05l9604
16288F0391m0048P053j2650j5737k912k0458Q714R285j7959M956k9099J1347K2286
$$ plain form
16275 -14831 5843 -16252 -19293 16236 34913 37713 78169 49214 16156 31886 42835 16631
16263 16631 -255 -4194 9136 -18814 -38306 -13015 -926 -6238 -72435 -92490 -37297 -2495
16251 -2495 -14030 -39654 -44780 -39905 -23779 -4049 32201 43665 12503 16425 -20626 -57268
16239 -57268 -72008 -50689 -15467 12609 6160 -26764 -10335 -11757 -16202 -13832 -16527 5 -19437
16226 -19437 -30138 -26806 -14747 -39610 -16758 11552 21124 49553 80578 75812 33301 35075
16214 35075 37129 -1608 11644 31361 21941 3286 -9478 4526 9535 49279 95913 29631
16202 29631 -6032 6372 -14390 -30893 21238 7046 522 1965 -5355 9363 31282 18405
16190 18405 -15255 -34565 -22707 5782 18350 27752 12553 19474 1526 -38321 -50955 -72273
$$ packed form
16275a4831K0674k2095l041L5529J8677K800M0456k8955l3058J5730J0949k6204
16263A6631j6886l939J3330k7950j9492K5291J2089n312o6197k0055N5193L4802
16251b495j1535k5624n126M875J6126J9730L6250J1464l1162L922l7051l6642
16239e7268j4740K1319L5222K8076o449l2924J6429j422m445K370k695J6532j9442
16226a9437j0701L332J2059k4863K2852K8310R572K8429L1025m766m2511J774
16214C5075K054l8737J3252J9717r420j8655j2764J4004N009L9744M6634o6282
16202B9631l5663J2404k0762j6503N2131j4192o524J443p320J4718K1919j2877
16190A8405l3660j9310J1858K8489J2568R402j5199O921j7948l9847j2634k1318
$$ plain form
16178 -72273 -55417 11080 29517 -9172 -11405 -5968 18337 18980 40781 53249 -4571 -48592
16166 -48592 -70296 -72524 -62027 -24857 -54423 -69652 -41873 -3233 19894 -30064 -84716 -104612
16154 -104612 -48412 -11545 -2577 -1436 -21091 -28607 -50428 -35065 10491 19609 246 17630
16142 17630 7778 -35980 -24196 15001 22745 -32621 -28645 24512 65625 30050 -11589 -21108
16130 -21108 -27200 -7760 -9411 -24797 -54843 -35325 -51707 -63502 -71275 -74046 -74425 -56843 -27924
16117 -27924 17260 4312 17497 6282 -7698 -4843 3874 10794 -8054 -23959 -16952 34116
16105 34116 51314 31748 26399 -9478 -25799 -19725 -38490 -13200 10641 17524 -6622 616
16093 616 -1071 -41128 -2945 30653 19117 28675 -5075 -48686 -27777 -1507 8987 1054 -17089
$$ packed form
16178g2273J6856O6497J8437l8689k233N437K4305O43K1801J2468n7820m4021
16166d8592k1704k228J0497L7170k9566j5229K7779L8640K3127m9958n4652j9896
16154a04612N6200L6867Q968J141j9655p516k1821J5363M5556R118j9363J7384
16142A7630r852m3758J1784L9197P744n5366L976N3157M1113l5575m1639r519
16130b1108o092J9440j651j5386l0046J9518j6382j1795p773k771l79J7582K8919
16117b7924M5184j2948J3185j1215j3980K855Q717O920j8848j5905P007N1068
16105C4116J7198j9566n349l5877j6321O074j8765K5290K3841O883k4146P238
16093F16j687m0057L8183L3598j1536R558l3750m3611K0909K6270J0494p933j8143
$$ plain form
16080 -17089 -4194 44647 39492 38014 49519 34726 61348 42544 54105 52424 50414 50057 55520
16067 55520 30013 20839 21030 46628 55876 13023 -43780 -29067 -6373 6528 35683 -21054
16055 -21054 -19244 1109 9497 2976 -19375 -36947 -21772 -5656 21541 54126 60041 32270
16043 32270 -2420 -31518 -26692 -26981 -39754 -42309 -53937 -42843 -8439 -20473 13475 12505 -22799
16030 -22799 -11319 5641 9177 6198 24939 50293 42394 15536 12664 23542 25263 -7305 -22837
16017 -22837 -35161 -48308 -26409 11187 11017 23597 15741 11596 -1501 -30397 -43177 -25650
16005 -25650 426 38841 28653 -28186 -8685 10065 47096 80883 58654 67028 70556 75226
15993 75226 43275 -3053 12867 -12977 -59805 -69538 -35998 -29914 -28520 2981 -9906 -24924
$$ packed form
16080a7089J2895M8841n155j478J1505j4793K6622j8804J1561j681k010l57N463
16067E5520k5507r174J91K5598R248m2853n6803J4713K2694J2901K9155n6737
16055b1054J810K0353Q388o521k2351j7572J5175J6116K7197L2585N915k7771
16043C2270l4690k9098M826k89j2773k555j1628J1094L4404j2034L3948r70l5304
16030b2799J1480J6960L536k979J8741K5354p899k6858k872J0878J721l2568j5532
16017b2837j2324j3147K1899L7596j70J2580p856m145j3097k8896j2780J7527
16005b5650K6076L8415j0188n6839J9501J8750L7031L3787k2229Q374L528M670
15993G5226l1951m6328J5920k5844m6828r733L3540O084J394L1501j2887j5018
$$ plain form
15981 -24924 -3025 3062 11140 -34823 -22328 23070 33778 -9040 -21241 -42829 -76935 -55271
15969 -55271 -49110 11181 55007 20781 -21475 -31521 -26733 5946 10795 -11247 -31002 -18316
15957 -18316 22082 45437 41919 -13851 -47251 -23781 31018 49381 41344 39069 20321 34205
15945 34205 66269 34772 25008 43614 40766 25024 29551 17043 -16479 -42855 -62285 -50425
15933 -50425 2644 -14764 -57321 -44647 -35865 -56963 -56387 -25941 -46383 -44491 -23184 -32829 -40206
15920 -40206 -10852 7301 3192 -7010 26810 25941 41009 65696 39969 22758 32366 60844
15908 60844 34371 -10364 -13852 -11961 -1567 13508 28847 55478 57978 44440 28456 -6460
15896 -6460 -2344 29990 22478 -24524 12032 37233 24126 16421 -11189 -916 -9193 20124 38157
$$ packed form
15981b4924K1899O087Q078m5963J2495M5398J0708m2818j2201k1588l4106K1664
15969e5271O161O0291M3826l4226m2256j0046M788L2679M849k2042j9755J2686
15957a8316M0398K3355l518n5770l3400K3470N4799J8363q037k275j8748J3884
15945C4205L2064l1497r764J8606k848j5742M527j2508l3522k6376j9430J1860
15933e0425N3069j7408m2557J2674Q782k1098N76L0446k0442J892K1307r645p377
15920d0206K9354J8153m109j0202L3820q69J5068K4687k5727j7211R608K8478
15908F0844k6473m4735l488J891J0394J5075J5339K6631K500j3538j5984l4916
15896f460M116L2334p512m7002L6556K5201j3107p705k7610J0273q277K9317J8033
$$ plain form
15883 38157 23329 -6528 -19349 19728 39125 45074 18397 23676 24479 6261 1779 3410 -18128
15870 -18128 -32728 -35097 26364 34861 62093 64804 73876 57612 70997 55582 21585 29272 46627
15857 46627 30621 14737 7991 31081 3480 17470 55235 52372 30662 -3132 8217 10707
15845 10707 14315 28527 48822 33489 -9653 -10459 -19894 2338 -15126 -20071 22660 25932 2651
15832 2651 -12216 -15624 12693 26534 30237 8847 1099 30034 48250 63511 58522 -556 -24482
15819 -24482 -19762 -733 17710 14413 -5457 20915 40320 44033 28879 40226 2508 -30006
15807 -30006 -67705 -71838 -54043 -59697 -74389 -24960 -23124 -32886 -44779 -44688 -7150 24396 21814
15794 21814 4526 6183 33061 30339 37419 61682 60507 87185 111294 97310 86829 94761 121194
$$ packed form
15883C8157j4828k9857j2821L9077J9397N949k6677N279Q03j8218m482J631k1538
15870a8128j4600k369O1461Q497K7232K711R072j6264J3385j5415l3997P687J7355
15857D6627j6006j5884o746K3090k7601J3990L7765k863k1710l3794J1349K490
15845A0707L608J4212K0295j5333m3142q06r435K2232j7464m945M2731L272k3281
15832B651j4867l408K8317J3841L703k1390p748K8935J8216J5261m989n9078k3926
15819b4482M720J9029J8443l297j9870K6372J9405L713j5154J1347l7718l2514
15807c0006l7699m133J7795n654j4692M9429J836r762j1893R1L7538L1546k582
15794B1814j7288J657K6878k722P080K4263j175K6678K4109j3984j0481P932K6433
$$ plain form
15781 121194 86622 37639 3439 -1855 2930 14720 47731 67672 44853 12343 11815 15729
15769 15729 9135 4578 67873 102505 98958 86309 86493 108656 143154 124751 106153 87261 74187
15756 74187 52685 30772 85554 103908 73260 54974 62866 76652 125175 109737 84008 91395
15744 91395 103156 102868 93484 95651 90194 65181 57146 57723 70856 68241 81812 94159 92665 105314
15730 105314 74637 54510 36227 60558 86546 92893 71874 90512 96083 88001 74557 68870
15718 68870 67622 52374 47868 26731 10991 25002 81608 54837 9377 44110 65972 53794
15706 53794 48868 26957 20927 12182 11017 28025 35743 35246 70071 68723 15192 6984 12745 5562
15692 5562 18640 17335 38114 51665 34406 65887 53551 53419 106526 105609 78173 84112 115555
$$ packed form
15781A21194l4572m8983l4200n294M785J1790L3011J9941k2819l2510n28L914
15769A5729o594m557O3295L4632l547j2649J84K2163L4498j8403j8598j8892j3074
15756G4187k1502k1913N4782J8354l0648j8286P892J3786M8523j5438k5729P387
15744I1395J1761k88r384K167n457k5013q035N77J3133k615J3571J2347j494J2649
15730A05314l0677k0127j8283K4331K5988O347k1019J8638N571q082j3444n687
15718F8870j248j5248m506k1137j5740J4011N6606k6771m5460L4733K1862j2178
15706E3794m926k1911o030q745j165J7008P718m97L4825j348n3531q208N761p183
15692E562J3078j305K0779J3551j7259L1481j2336j32N3107r17k7436N939L1443
$$ plain form
15679 115555 116795 67879 51541 30470 36307 74033 105465 99438 103898 58030 42688 69700
15667 69700 87537 58557 79020 93572 59167 40183 -4189 -22011 -34934 -633 51736 42389
15655 42389 6162 10561 20421 40194 62801 81146 65180 11000 -26019 -14066 -30585 849
15643 849 -1703 1883 41353 30569 4866 -24226 -33481 -37247 -9942 16357 22228 47387 57342
15630 57342 8455 -9202 15096 45518 25916 16766 15862 -2767 -10981 332 26785 31237 15642
15617 15642 25739 10999 -14619 2679 53234 13045 -20365 -25392 -29346 -23901 -12188 12745
15605 12745 74228 110372 104008 109884 113161 126985 112399 103681 70965 47280 50182 46604 50076
15592 50076 70138 86883 83511 106832 73441 23952 1445 9381 13762 13961 38221 60472 44802
$$ packed form
15679A15555J240m8916j6338k1071N837L7726L1432o027M460m5868j5342K7012
15667F9700J7837k8980K0463J4552l4405j8984m4372j7822j2923L4301N2369r347
15655D2389l6227M399R860J9773K2607J8345j5966n4180l7019J1953j6519L1434
15643H49k552L586L9470j0784k5703k9092r255l766K7305K6299N871K5159R955
15630E7342m8887j7657K4298L0422j9602r150r04j8629q214J1313K6453M452j5595
15617A5642J0097j4740k5618J7298N0555m0189l3410n027l954N445J1713K4933
15605A2745O1483L6144o364N876L277J3824j4586q718l2716k3685K902l578L472
15592E0076K0062J6745l372K3321l3391m9489k2507P936M381J99K4260K2251j5670
$$ plain form
15579 44802 54780 88331 85558 77114 87909 65702 48468 52174 16697 18450 43647 95604 83172
15566 83172 44375 -483 -14501 -2428 -46312 -65042 -3707 48147 63680 23100 -26113 -33420
15554 -33420 -18766 9392 10532 -4594 -25035 -13515 -15664 5931 47505 23051 55375 77085
15542 77085 105119 93906 70440 46716 25246 33369 14501 -1830 -31493 -17025 68236 71828
15530 71828 45023 39754 21274 2742 -21769 -4233 33924 46882 10865 -4196 -16080 -12308
15518 -12308 -21887 -44482 -46478 -5169 28661 47094 62200 44526 -3411 14935 28293 4810
15506 4810 737 20557 15076 12649 59197 82049 74275 56671 62959 80167 72724 92057 77320
15493 77320 32429 30048 -5031 8034 87355 119109 122124 100490 63970 23429 36472 86312
$$ packed form
15579D4802R978L3551k773q444J0795k2207j7234L706l5477J753K5197N1957j2432
15566H3172l8797m4858j4018J2073m3884j8730O1335N1854J5533m0580m9213p307
15554c3420J4654K8158J140j5126k0441J1520k149K1595M1574k4454L2324K1710
15542G7085K8034j1213k3466k3724k1470Q123j8868j6331k9663J4468Q5261L592
15530G1828k6805n269j8480j8532k4511J7536L8157J2958l6017j5061j1884L772
15518a2308r579k2595j996M1309L3830J8433J5106j7674m7937J8346J3358k3483
15506D810m073J9820n481k427M6548K2852p774j7604O288J7208p443J9333j4737
15493G7320m4891k381l5079J3065P9321L1754L015k1634l6520m0541J3043M9840
$$ plain form
15481 86312 82283 65085 33227 10287 9408 -27895 -37057 -8019 2385 48274 72770 91129
15469 91129 93455 91794 80872 36536 17520 214 -42731 -17435 13741 41176 46964 49690
15457 49690 64212 54279 67940 96458 147367 130020 112215 88368 63796 55821 56851 127037
15445 127037 144529 108843 71332 25937 -4585 -15849 -26552 -10441 11902 -18753 -27591 -5343
15433 -5343 18650 66548 75421 71302 79854 84584 92469 88317 53696 49097 66178 44461 62678
15420 62678 75781 89639 88493 84714 93625 89425 92628 108563 111687 90921 66753 30534 34856
15407 34856 9186 21956 13328 17952 9576 26606 54472 60442 45527 66186 77870 64194
15395 64194 57930 56180 60034 71588 51744 29846 50422 60967 50598 20643 52410 77401
$$ packed form
15481H6312m029j7198l1858k2940q79l7303r162K9038J0404M5889K4496J8359
15469I1129K326j661j0922m4336j9016j7306m2945K5296L1176K7435N788K726
15457D9690J4522r933J3661K8518N0909j7347j7805k3847k4572p975J030P0186
15445A27037J7492l5686l7511m5395l0522j1264j0703J6111K2343l0655q838K2248
15433e343K3993M7898Q873m119Q552M730P885m152l4621m599J7081k1717J8217
15420F2678J3103J3858j146l779Q911m200L203J5935L124k0766k4168l6219M322
15407C4856k5670J2770q628M624q376J7030K7866N970j4915K0659J1684j3676
15395F4194o264j750L854J1554j9844k1898K0576J0545j0369k9955L1767K4991
$$ plain form
15383 77401 95291 107505 90610 53735 48475 42452 61149 28139 38982 51516 41239 34334
15371 34334 4245 27931 17583 6264 57643 74245 41720 8002 -6027 2914 67817 126385
15359 126385 137981 113352 83785 76001 90173 92007 72326 42007 12115 5077 16026 15231
15347 15231 42066 85068 95546 68879 103565 108183 68528 73810 87023 102082 108993 96973
15335 96973 76207 89948 84938 93527 107426 107259 107666 88800 75564 57742 37919 45244 94890
15322 94890 84159 73227 77304 105387 115247 102809 101652 58663 53796 69498 73329 106553 115518
15309 115518 55696 19095 -1459 53600 69267 56878 38242 56716 80058 41782 18912
15298 18912 38641 21958 35032 13623 28331 44146 44454 37867 26695 51832 71592 73720
$$ packed form
15383G7401J7890J2214j6895l6875n260o023J8697l3010J0843J2534j0277o905
15371C4334l0089K3686j0348j1319N1379J6602l2525l3718j4029Q941O4903N8568
15359A26385J1596k4629k9567p784J4172J834j9681l0319k9892p038J0949p95
15347A5231K6835M3002J0478k6667L4686M618l9655N282J3213J5059O911j2020
15335I6973k0766J3741n010Q589J3899j67M07j8866j3236j7822j9823P325M9646
15322I4890j0731j0932M077K8083R860j2438j157m2989m867J5702L831L3224Q965
15309A15518n9822l6601k0554N5059J5667j2389j8636J8474K3342l8276k2870
15298A8912J9729j6683J3074k1409J4708J5815L08o587j1172K5137J9760K128
$$ plain form
15286 73720 72298 54937 64566 75629 85111 48080 42539 48213 69892 75953 74159 74211 65828 82657
15272 82657 90348 77793 75004 66061 72549 72470 42648 30495 62840 68318 64307 7034 -8700
15259 -8700 30857 57377 54363 41163 2637 -4791 8418 43267 64678 96844 125420 84671
15247 84671 82360 85651 80509 56706 11490 -4509 26900 54151 47766 79380 92115 89238 131323
15234 131323 105942 101343 136229 148605 136740 127587 152105 186128 160726 136912 140914 142516
15222 142516 121475 142090 132929 114888 127501 130052 151617 140832 104881 70004 68639 124098
15210 124098 133764 141956 150456 149660 140928 125129 131308 159140 158858 147065 130332 162064 140968
15197 140968 117023 112391 107119 126699 143501 169185 194014 242852 280939 293532 270893 255621
$$ packed form
15286G3720j422j7361R629J1063R482l7031n541N674K1679O061j794N2q383J6829
15272H2657P691j2555k789q943O488p9k9822j2153L2345N478m011n7273j5734
15259h700L9557K6520l014j3200l8526p428J3209L4849K1411L2166K8576m0749
15247H4671k311L291n142k3803m5216j5999L1409K7251o385L1614J2735k877M2085
15234A31323k5381m599L4886J2376j1865r153K4518L4023k5402k3814M002J602
15222A42516k1041K0615r161j8041J2613K551K1565j0785l5951l4877j365N5459
15210A24098R666Q192Q500p96q732j5799O179K7832k82j1793j6733L1732k1096
15197A40968k3945m632n272J9580J6802K5684K4829M8838L8087J2593k2639j5272
$$ plain form
15185 255621 265769 273029 268628 272341 249998 205337 154074 137753 154388 147635 123858 132473
15173 132473 128108 113137 114758 94427 87608 97146 84573 94402 98370 104056 96414 123363 101900
15160 101900 83841 125603 153565 148932 167820 160541 127294 81372 56260 74357 127706 130689
15148 130689 99251 82552 88620 129417 125948 116446 114895 110499 76442 98929 158912 160902 119380
15135 119380 96452 120358 122921 124146 137670 166110 162522 153960 131802 122578 115296 84302 97750
15122 97750 116984 89774 93524 110917 98552 98090 125345 153773 161558 140606 144406 171514 137751
15109 137751 144050 145675 186301 173415 141933 139679 172594 131955 117085 136077 126466 140096
15097 140096 131486 129269 110743 117843 119074 127421 110639 95332 113442 98192 117379 81584
$$ packed form
15185B55621J0148P260m401L713k2343m4661n1263j6321J6635o753k3777Q615
15173A32473m365j4971J621k0331o819R538j2573R829L968N686p642K6949k1463
15160A01900j8059M1762K7962m633J8888p279l3247m5922k5112J8097N3349K983
15148A30689l1438j6699O068M0797l469r502j551m396l4057K2487N9983J990m1522
15135A19380k2928K3906K563J225J3524K8440l588q562k2158r224p282l0994J3448
15122I7750J9234k7210L750J7393j2365m62K7255K8428P785k0952L800K7108l3763
15109A37751O299J625M0626j2886l1482k254L2915m0639j4870J8992r611J3630
15097A40096q610k217j8526P100J231Q347j6782j5307J8110j5250J9187l5795
$$ plain form
15085 81584 51331 26655 35884 43493 47394 82467 119629 113820 97691 77700 122004 166494
15073 166494 180455 134119 162129 179996 204277 147355 102522 143839 164919 161090 149907 138813
15061 138813 176822 169413 198483 240241 245118 243017 229127 227873 216996 222426 258404 296896
15049 296896 291196 237180 195745 182109 187292 208092 182775 139831 93155 83440 108194 88380
15037 88380 75652 158427 216892 216934 223712 191790 184128 167619 126729 150568 166604 171587 162909
15024 162909 174030 160639 147603 173338 155370 134036 108118 100031 60219 61257 94362 101430
15012 101430 89728 114257 128644 139200 148547 186516 166827 144624 143980 141695 149771 137341
15000 137341 150413 156299 204717 179915 162102 157767 159338 142357 151831 170382 195437 167176
$$ packed form
15085H1584l0253k4676R229P609L901L5073L7162n809j6129j9991M4304M4490
15073A66494J3961m6336K8010J7867K4281n6922m4833M1317K1080l829j1183j1094
15061A38813L8009p409K9070M1758M877k101j3890j254j0877N430L5978L8492
15049B96896n700n4016m1435j3636N183K0800k5317m2944m6676r715K4754j9814
15037H8380j2728Q2775N8465M2O778l1922p662j6509m0890K3839J6036M983q678
15024A62909J1121j3391j3036K5735j7968k1334k5918q087l9812J038L3105P068
15012A01430j1702K4529J4387J0556R347L7969j9689k2203o44k285Q076j2430
15000A37341J3072N886M8418k4802j7813m335J571j6981R474J8551K5055k8261
$$ plain form
14988 167176 157928 188368 174299 194213 172585 172461 172948 172883 158526 140822 144607 142250 139133 132912
14974 132912 170436 196830 165225 152862 144973 167082 185865 170938 171680 165010 163671 144559
14962 144559 168997 178350 169992 148599 182915 181005 168989 164797 144240 136827 155439 204242
14950 204242 227171 202689 192894 217334 220327 198070 218728 189086 175597 162314 166066 211731
14938 211731 221500 203992 240693 250904 216248 182820 196398 208267 226916 211604 226082 237849
14926 237849 245006 265325 226959 211063 227273 216513 218354 222948 262149 266188 233749 212121
14914 212121 181541 215819 208541 198363 211395 222857 243423 232574 241301 235829 220346 207312
14902 207312 185738 140463 95925 99426 126081 140303 198867 214156 185070 103320 87724 131950
$$ packed form
14988A67176r248L0440j4069J9914k1628j24M87o5j4357j7704L785k357l117o221
14974A32912L7524K6394l1605j2363p889K2109J8783j4927P42o670j339j9112
14962A44559K4438R353q358k1393L4316j910j2016m192k0557p413J8612M8803
14950B04242K2929k4482r795K4440K993k2257K0658k9642j3489j3283L752M5665
14938B11731R769j7508L6701J0211l4656l3428J3578J1869J8649j5312J4478J1767
14926B37849P157K0319l8366j5896J6210j0760J841M594L9201M039l2439k1628
14914B12121l0580L4278p278j0178J3032J1462K0566j0849Q727n472j5483j3034
14902B07312k1574m5275m4538L501K6655J4222N8564J5289k9086q1750j5596M4226
$$ plain form
14890 131950 154972 171082 210226 164043 136837 142490 164655 161977 164749 164092 162107 223505 213903
14877 213903 151291 171046 169061 136475 169411 219521 200967 203413 189089 168004 193438 221123
14865 221123 221119 184686 173269 200914 238234 215489 168554 182528 180386 174463 184550 143345 185950
14852 185950 188480 172264 231398 240157 238928 251664 233446 240870 281208 304811 286904 239204
14840 239204 206387 186438 213906 254598 226667 231929 244278 251466 249324 231975 219882 218425
14828 218425 238903 258217 225488 195515 208211 250161 248406 234120 189002 165241 161100 155048
14816 155048 159727 171071 171587 165454 222076 250201 265118 239564 178529 150017 157219 202914
14804 202914 222032 199048 190169 174612 190752 188187 223729 243745 241062 259211 259020 254166 274654
$$ packed form
14890A31950K3022J6110L9144m6183k7206N653K2165k678K772o57j985O1398r602
14877B13903o2612J9755j985l2586L2936N0110j8554K446j4324k1085K5434K7685
14865B21123ml6433j1417K7645L7320k2745m6935J3974k142n923J0087m1205M2605
14852A85950K530j6216N9134Q759j229J2736j8218P424M0338K3603j7907m7700
14840B39204l2817j9949K7468M0692k7931N262J2349P188k142j7349j2093j457
14828B18425K0478J9314l2729k9973J2696M1950j755j4286m5118k3761m141o052
14816A55048M679J1344N16o133N6622K8125J4917k5554o1035k8512P202M5695
14804B02914J9118k2984q879j5557J6140k565L5542K0016k683J8149j91m854K0488
$$ plain form
14791 274654 271480 277072 287164 273362 273358 276388 263049 255089 286591 311989 284777 224832 178898
14778 178898 191951 233464 237564 242378 265341 278982 271294 246588 246158 216834 250922 260137 293459
14765 293459 307377 303800 286838 281140 286217 283573 292372 297013 266328 261383 266066 269308 287325
14752 287325 300534 296128 320628 303420 305951 317662 293068 308907 273099 237504 210201 220961
14740 220961 238111 233712 229872 230576 229265 225390 271948 291400 275963 258434 232185 263031 294422
14727 294422 299074 283995 297600 296599 282285 317232 304020 306118 293939 262303 269643 293780
14715 293780 299044 318607 328992 307637 260978 267222 285076 316056 285772 272160 251629 234415
14703 234415 284983 303737 334316 321302 326935 307946 318968 303164 301276 277799 243434 237077
$$ packed form
14791B74654l174N592J0092j3802mL030j3339p960L1502K5398k7212n9945m5934
14778A78898J3053M1513M100M814K2963J3641p688k4706m30k9324L4088R215L3322
14765B93459J3918l577j6962n698N077k644Q799M641l0685m945M683L242J8017
14752B87325J3209m406K4500j7208K531J1711k4594J5839l5808l5595k7303J0760
14740B20961J7150m399l840P04j311l875M6558J9452j5437j7529k6249L0846L1391
14727B94422M652j5079J3605j001j4314L4947j3212K098j2179l1636P340K4137
14715B93780N264J9563J0385k1355m6659O244J7854L0980l0284j3612k0531j7214
14703B34415N0568J8754L0579j3014N633j8989J1022j5804j888k3477l4365o357
$$ plain form
14691 237077 268971 313018 314480 349267 364322 384190 376697 360385 325285 326029 330578 357924
14679 357924 370171 349360 363054 348425 327294 343970 362387 380397 356299 362271 356560 345482
14667 345482 371069 382427 335085 311009 323504 316754 321130 335846 324505 327954 349391 356509
14655 356509 348353 326785 326537 311734 276507 285711 336919 358640 350620 354311 373737 389619 367690
14642 367690 329109 349873 376475 382688 400760 439543 453899 436770 429971 411481 404953 419417
14630 419417 391796 368504 385478 390130 381958 360033 380333 385865 386475 375134 428854 502803
14618 502803 553016 592258 610562 674843 766273 867739 977824 1162729 1370335 1576212
14608 1576212 1794794 1961566 2156174 2312330 2410476 2459411 2485785 2420103 2264464 2095739
$$ packed form
14691B37077L1894M4047J462L4787J5055J9868p493j6312l5100P44M549K7346
14679C57924J2247k0811J3694j4629k1131J6676J8417J8010k4098N972n711j1078
14667C45482K5587J1358m7342k4076J2495o750M376J4716j1341L449K1437P118
14655C56509q156k1568k48j4803l5227R204N1208K1721q020L691J9426J5882k1929
14642C67690l8581K0764K6602O213J8072L8783J4356j7129o799j8490o528J4464
14630D19417k7621k3292J6974M652q172k1925K0300N532O10j1341N3720P3949
14618E02803N0213L9242J8304O4281R1430J01466J10085J84905K07606K05877
14608A576212K18582J66772J94608J56156R8146M8935K6374o5682j55639j68725
$$ plain form
14598 2095739 1947559 1749401 1516353 1333804 1187549 1055212 907268 815380 755937 710267
14588 710267 676317 644879 629874 559171 519531 552099 565010 548834 549392 521530 537094 557718
14576 557718 594894 630747 629354 638240 634148 603252 579217 548704 549524 591215 576132 534737
14564 534737 530372 521183 489907 458501 494896 536340 549708 540520 520163 503792 488679 472759
14552 472759 444146 429119 469197 472689 475758 483011 478430 447186 447827 451343 443024 452085 449911
14539 449911 462252 480863 494521 488951 448948 468100 512268 531994 510305 500569 485615 443061
14527 443061 400194 402150 437845 447416 458095 503763 534236 547542 593918 622999 604907 612734
14515 612734 669039 734448 754408 729563 707099 697471 692431 643900 606353 605809 591607 576254
$$ packed form
14598B095739j48180j98158k33048j82549j46255j32337j47944r1888n9443m5670
14588G10267l3950l1438j5005p0703l9640L2568J2911j6176N58k7862J5564K0624
14576E57718L7176L5853j393Q886m092l0896k4035l0513Q20M1691j5083m1395
14564E34737m365r189l1276l1406L6395M1444J3368r188k0357j6371j5113j5920
14552D72759k8613j5027M0078L492L069P253m581l1244O41L516q319R061k174
14539D49911J2341J8611J3658n570m0003J9152M4168J9726k1689r736j4954m2554
14527D43061m2867J956L5695R571J0679M5668L0473J3306M6376K9081j8092P827
14515F12734N6305O5409J9960k4845k2464r628n040m8531l7547n44j4202j5353
$$ plain form
14503 576254 535596 535546 549386 584608 628076 600267 574466 559221 555227 588906 582278 613238
14491 613238 651828 625287 571226 541548 552472 583101 619458 651695 634488 617799 611421 576734
14479 576734 559682 589810 597056 618283 610101 583505 582806 616101 622381 631489 681811 686173 669166
14466 669166 645978 641403 640276 629931 634659 664793 648538 641439 619729 611268 618328 674279 711020
14453 711020 707165 722035 713180 722821 745617 712789 711105 780033 783256 778089 775579 775616 753535
14440 753535 741862 759022 794832 789317 810600 840306 833872 846351 922802 901622 919072 931899
14428 931899 988992 1070174 1121583 1196915 1326208 1458242 1584916 1782496 1956857 2064162
14418 2064162 2139640 2187434 2194857 2233289 2295159 2340205 2375898 2426809 2469682 2487945 2456151
$$ packed form
14503E76254m0658n0J3840L5222M3468k7809k5801j5245l994L3679o628L0960
14491F13238L8590k6541n4061k9678J0924L0629L6357L2237j7207j6689o378l4687
14479E76734j7052L0128P246K1227q182k6596o99L3295O280R108N0322M362j7007
14466F69166k3188m575j127j0345M728L0134j6255p099k1710q461P060N5951L6741
14453G11020l855J4870q855R641K2796l2828j684O8928L223n167k510L7k2081
14440G53535j1673J7160L5810n515K1283K9706o434J2479P6451k1180J7450J2827
14428I31899N7093Q1182N1409P5332J29293J32034J26674J97580J74361J07305
14418B064162P5478M7794P423L8432O1870M5046L5693N0911M2873J8263l1794
$$ plain form
14407 2456151 2336731 2210482 2087411 1912222 1760303 1651926 1485712 1353563 1270260 1223270
14397 1223270 1184438 1124173 1073722 1058176 1032769 984195 937658 913413 892803 905535 905320 906262
14385 906262 932413 945994 947006 930558 943921 941616 900748 863853 859798 876391 892305 903792
14373 903792 918692 907180 887813 903161 945472 973144 967436 906487 883473 923030 945255 931803
14361 931803 918908 954167 963856 951588 956694 967163 943462 923927 955847 949243 930955 921040
14349 921040 921402 891986 883373 901460 895215 874161 873386 872308 909722 944616 959915 1018649 1064182
14336 1064182 1076602 1079585 1118021 1170858 1193100 1203898 1213615 1199622 1206226 1229408 1247499 1238351
14324 1238351 1254315 1273245 1268502 1261624 1298984 1283091 1305093 1354009 1389601 1407230 1387473 1426439
$$ packed form
14407B456151j19420j26249j23071j75189j51919j08377j66214j32149q3303m6990
14397A223270l8832o0265n0451j5546k5407m8574m6537k4245k0610J2732k15R42
14385I06262K6151J3581J012j6448J3363k305m0868l6895m055J6593J5914J1487
14373I03792J4900j1512j9367J5348M2311K7672n708o0949k3014L9557K2225j3452
14361I31803j2895L5259R689j2268N106J0469k3701j9535L1920o604j8288r915
14349I21040L62k9416q613J8087o245k1054p75j078L7414L4894J5299N8734M5533
14336A064182J2420K983L8436N2837K2242J0798R717j3993O604K3182J8091r148
14324A238351J5964J8930m743o878L7360j5893K2002M8916L5592J7629j9757L8966
$$ plain form
14312 1426439 1427590 1439492 1474856 1505827 1509864 1525203 1584551 1643914 1691769 1725581 1771609 1849290
14300 1849290 1940805 1923724 1879666 1837155 1772329 1734037 1732896 1691609 1633153 1610564 1644444
14289 1644444 1707802 1763784 1766604 1796914 1810479 1825055 1858820 1886000 1908533 1918817 1899790
14278 1899790 1896722 1878414 1828020 1829258 1872775 1901128 1892576 1941318 1983962 2002245 2005530 2030037
14266 2030037 1988277 1949191 1960040 2008659 2047057 2036920 2039941 2039122 2092727 2155347 2186023 2199918
14254 2199918 2202796 2174352 2175362 2265201 2301698 2315388 2318610 2369099 2389147 2414190 2472579 2564243
14242 2564243 2639523 2687330 2697821 2729394 2808210 2857044 2891008 2925522 2985061 3036507 3063557
14231 3063557 3083186 3162041 3227948 3275054 3340852 3399172 3494973 3636800 3781327 3867726 3934685
$$ packed form
14312A426439J151J1902L5364L0971M037J5339N9348N9363M7855L3812M6028P7681
14300A849290R1515j7081m4058m2511o4826l8292j141m1287n8456k2589L3880
14289A644444O3358N5982K820L0310J3565J4576L3765K7180K2533J0284j9027
14278A899790l068j8308n0394J238M3517K8353q552M8742M2644J8283L285K4507
14266B030037m1760l9086J0849M8619L8398j0137L021q19N3605O2620L0676J3895
14254B199918K878k8444J010Q9839L6497J3690L222N0489K0048K5043N8389R1664
14242B564243P5280M7807J0491L1573P8816M8834L3964L4514N9539N1446K7050
14231C063557J9629P8855O5907M7106O5798N8320R5801J41827J44527Q6399O6959
$$ plain form
14220 3934685 4041196 4122834 4185055 4230468 4261254 4272968 4333566 4415845 4470743 4536412 4591103
14209 4591103 4658065 4789236 4910662 5083319 5242987 5406772 5549755 5678593 5821992 5965585
14199 5965585 6223946 6485232 6717296 6970874 7250521 7517700 7846553 8227333 8597380
14190 8597380 9024167 9461567 9916103 10388063 10928338 11572675 12223747 12940373 13753262
14181 13753262 14685832 15737227 16894379 18226631 19784145 21591160 23735696 26189193
14173 26189193 29032089 32286608 36071501 40541803 45873827 52308679 60243114 70435279
14165 70435279 83974291 102377196 127001859 157853829 193016522 230397235 269366659
14158 269366659 309232067 345921919 373279798 388359288 392452501 386752582 369366315
$$ packed form
14220C934685J06511Q1638O2221M5413L0786J1714O0598Q2279N4898O5669N4691
14209D591103O6962J31171J21426J72657J59668J63785J42983J28838J43399J43593
14199E965585K58361K61286K32064K53578K79647K67179L28853L80780L70047
14190H597380M26787M37400M54536M71960N40275O44337O51072P16626Q12889
14181A3753262R32570J051395J157152J332252J557514J807015K144536K453497
14173B6189193K842896L254519L784893M470302N332024O434852P934435J0192165
14165G0435279J3539012J8402905K4624663L0851970L5162693L7380713L8969424
14158B69366659L9865408L6689852K7357879J5079490M093213n699919j7386267
$$ plain form
14151 369366315 339616742 301672878 261464442 222266393 184460404 149142222 118638826
14144 118638826 94400159 76139600 62448099 52061226 43943223 37424291 32015193
14137 32015193 27469127 23661320 20446157 17652730 15283954 13330060 11705549 10354680
14129 10354680 9220038 8266270 7445999 6669906 5978713 5434080 4966012 4580085 4227153
14120 4227153 3895219 3584999 3297624 3000275 2751268 2474188 2282522 2091466 1885436
14111 1885436 1711866 1521497 1346149 1192962 1025480 889621 813560 700568 610254 506046
14101 506046 379063 281019 134222 50442 -59234 -137284 -203649 -295119 -383369 -444511 -459525
14090 -459525 -457666 -510467 -509483 -483617 -496360 -522842 -543858 -551796 -554689 -566865 -566456 -573102 -562706
$$ packed form
14151C69366315k9749573l7943864m0208436l9198049l7805989l5318182l0503396
14144A18638826k4238667j8260559j3691501j0386873q118003o518932n409098
14137C2015193m546066l807807l215163k793427k368776j953894j624511j350869
14129A0354680j134642r53768q20271p76093o91193n44633m68068l85927l52932
14120D227153l31934l10220k87375k97349k49007k77080j91666j91056k06030
14111A885436j73570j90369j75348j53187j67482j35859p6061j12992r0314j04208
14101E06046j26983r8044j46797q3780j09676p8050o6365r1470q8250o1142j5014
14090d59525J859n2801R84K5866j2743k6482k1016p938k893j2176M09o646J0396
$$ plain form
14077 -562706 -509227 -530042 -556044 -532473 -533009 -510738 -470960 -460862 -468084 -467767 -450874 -478389
14065 -478389 -499811 -472012 -482009 -487789 -491648 -495254 -542204 -535122 -557682 -572195 -553730 -535459
14053 -535459 -517478 -521044 -562137 -536898 -496904 -432053 -411164 -435285 -443351 -420870 -384112 -369008
14041 -369008 -401585 -411773 -409594 -409792 -393628 -361352 -355074 -392532 -407484 -403809 -383178 -411030
14029 -411030 -424948 -411300 -382168 -390516 -409501 -354696 -342008 -309401 -271431 -225060 -151427 -56254
14017 -56254 47272 132296 201484 226433 238829 257222 254563 230461 207346 160839 103061 70146
14005 70146 14739 -9790 -2767 -2002 2369 -317 -23642 -37692 20284 95971 104138 86907 90782
13992 90782 81288 56227 55121 31571 9256 7361 -24272 -125737 -153336 -120308 -76071 -34372
$$ packed form
14077e62706N3479k0815k6002K3571n36K2271L9778J0098p222L17J6893k7515
14065d78389k1422K7799r997n780l859l606m6950P082k2560j4513J8465J8271
14053e35459J7981l566m1093K5239L9994O4851K0889k4121q066K2481L6758J5104
14041c69008l2577j0188K179j98J6164L2276O278l7458j4952L675K0631k7852
14029d11030j3918J3648K9132q348j8985N4805J2688L2607L7970M6371P3633R5173
14017e6254J03526Q5024O9188K4949J2396J8393k659k4102k3115m6507n7778l2915
14005G0146n5407k4529P023P65M371k686k3325j4050N7976P5687Q167j7231L875
13992I0782r494k5061j106k3550k2315j895l1633j01465k7599L3028M4237M1699
$$ plain form
13980 -34372 -43927 -74540 -92035 -69598 -55940 -89521 -91560 -115205 -117619 -103632 -104698 -105605 -82959
13967 -82959 -20415 16770 46431 65499 115429 192010 265480 328451 394303 441730 527959 608358
13955 608358 715017 820612 969894 1110484 1272927 1467594 1692137 1921503 2125339 2295730
13945 2295730 2394920 2451528 2449668 2318670 2168967 1988495 1798985 1661656 1492019 1350910
13935 1350910 1212633 1060713 890611 744352 614566 525964 373568 267737 200625 134679
13925 134679 132635 119075 81057 52248 29018 7461 -8626 18447 77236 115411 195075 251686
13913 251686 317281 370132 445279 464866 449075 424914 387506 309981 158432 72236 42817
13902 42817 27054 -7247 -17631 -18451 -32585 -51806 -81680 -109095 -106708 -103129 -69103 -42583
$$ packed form
13980c4372r555l0613j7495K2437J3658l3581k039k3645k414J3987j066r07K2646
13967h2959O2544L7185K9661J9068M9930P6581P3470O2971O5852M7427Q6229Q0399
13955F08358J06659J05595J49282J40590J62443J94667K24543K29366K03836J70391
13945B295730R9190N6608j860j30998j49703j80472j89510j37329j69637j41109
13935A350910j38277j51920j70102j46259j29786q8602j52396j05831o7112o5946
13925A34679k044j3560l8018k8809k3230k1557j6087K7073N8789L8175P9664N6611
13913B51686O5595N2851P5147J9587j5791k4161l7408p7525j51549q6196k9419
13902D2817j5763l4301j0384q20j4134j9221k9874k7415K387L579L4026K6520
$$ plain form
13890 -42583 -41796 -58453 -31985 -167 25143 14028 -17597 -8214 -16222 -50068 -127205 -148338
13878 -148338 -156519 -131546 -98647 -82027 -66846 -61904 -31703 -12065 12447 4788 3690 49732
13866 49732 57895 97718 105791 189147 316839 406249 508041 640236 748225 856821 976049
13855 976049 1034712 1036470 1026639 985487 893242 771843 639686 483244 347298 214542 154205
13844 154205 80983 -47128 -84122 -80717 -84358 -102494 -107555 -165101 -224960 -205351 -187497 -195409
13832 -195409 -199292 -212156 -207278 -200782 -220200 -263072 -254872 -289520 -300379 -318585 -341047 -296783
13820 -296783 -263405 -269202 -288311 -303832 -294032 -272951 -253159 -238845 -251352 -262582 -258775 -272652
13808 -272652 -263906 -274827 -261512 -278864 -282763 -278357 -294077 -333340 -338521 -301585 -311138 -322396
$$ packed form
13890d2583P87j6657K6468L1818K5310j1115l1625R383q008l3846p7137k1133
13878a48338q181K4973L2899J6620J5181M942L0201J9638K4512p659j098M6042
13866D9732Q163L9823Q073Q3356J27692Q9410J01792J32195J07989J08596J19228
13855I76049N8663J758r831m1152r2245j21399j32157j56442j35946j32756o0337
13844A54205p3222j28111l6994L405l641j8136n061n7546n9859J9609J7854p912
13832a95409l883j2864M878O496j9418m2872Q200l4648j0859j8206k2462M4264
13820b96783L3378n797j9109j5521R800K1081J9792J4314j2507j1230L807j3877
13808b72652Q746j0921J3315j7352l899M406j5720l9263n181L6936r553j1258
$$ plain form
13796 -322396 -303020 -320620 -292215 -268702 -286496 -297887 -270839 -264348 -252978 -222477 -241454 -215932
13784 -215932 -230676 -233834 -248805 -264571 -262710 -247527 -234558 -197291 -197416 -224163 -237823 -269908
13772 -269908 -306170 -314108 -322328 -295080 -298243 -289479 -265728 -240948 -237998 -242696 -260159 -262914 -260045
13759 -260045 -232228 -224283 -263050 -293897 -347968 -363470 -360059 -325846 -232416 -217903 -195850 -161957
13747 -161957 -182877 -186477 -234817 -262497 -269053 -248784 -209931 -210721 -228746 -248453 -281994 -299429
13735 -299429 -284507 -252084 -263454 -312484 -365641 -337854 -264905 -232506 -249187 -257803 -241699 -210104
13723 -210104 -208642 -218995 -170699 -112638 -60029 -39988 -55254 -72984 -85881 -31325 -990 44741
13711 44741 104215 178381 270890 445783 588758 749800 952113 1154239 1343205 1535176
$$ packed form
13796c22396J9376j7600K8405K3513j7794j1391K7048O491J1370L0501j8977K5522
13784b15932j4744l158j4971j5766J861J5183J2969L7267j25k6747j3660l2085
13772b69908l6262p938q220K7248l163Q764K3751K4780K950m698j7463k755K869
13759b60045K7817P945l8767l0847n4071j5502L411L4213R3430J4513K2053L3893
13747a61957k0920l600m8340k7680o556K0269L8853p90j8025j9707l3541j7435
13735b99429J4922L2423j1370m9030n3157K7787P2949L2399j6681q616J6104L1595
13723b10104J462j0353M8296N8061N2609K0041j5266j7730j2897N4556L0335M5731
13711D4741N9474P4166R2509J74893J42975J61042K02313K02126J88966J91971
$$ plain form
13701 1535176 1665759 1774714 1828528 1854369 1782451 1636281 1445533 1224011 1003007 785373
13691 785373 590607 471164 363878 264200 166115 72518 3582 -31675 -48390 -77811 -99608
13680 -99608 -138790 -191795 -203888 -224014 -203634 -189118 -249089 -286315 -271720 -225508 -179537 -210264
13668 -210264 -244783 -255257 -228374 -223263 -249379 -235420 -183680 -190775 -176425 -196245 -208874 -213895
13656 -213895 -221413 -218065 -211698 -176931 -176108 -195764 -178795 -204499 -238096 -236444 -247385 -293327 -297928
13643 -297928 -293623 -263461 -235886 -248287 -257031 -242430 -245709 -230808 -228860 -245987 -263386 -272462
13631 -272462 -267321 -327601 -292139 -247590 -239444 -252409 -276257 -275945 -271774 -247756 -227363 -164880
13619 -164880 -139459 -137655 -149951 -194812 -201932 -166763 -159042 -134335 -128913 -159504 -140428 -170964
$$ packed form
13701A535176J30583J08955N3814K5841p1918j46170j90748k21522k21004k17634
13691G85373j94766j19443j07286r9678r8085r3597o8936l5257j6715k9421k1797
13680i9608l9182n3005j2093k0126K0380J4516n9971l7226J4595M6212M5971l0727
13668b10264l4519j0474K6883N111k6116J3959N1740p095J4350j9820j2629n021
13656b13895p518L348O367L4767Q23j9656J6969k5704l3597J652j0941m5942m601
13643b97928M305L0162K7575j2401q744J4601l279J4901J948j7127j7399r076
13631b72462N141o0280L5462M4549Q146j2965k3848L12M171K4018K0393O2483
13619a64880K5421J804j2296m4861p120L5169P721K4707N422l0591J9076l0536
$$ plain form
13607 -170964 -179656 -160359 -178005 -197448 -210614 -224973 -242612 -241551 -226257 -185128 -193077 -196746
13595 -196746 -181879 -139194 -90268 -52798 -31202 -41297 4022 73281 149995 218669 261111
13584 261111 281574 278949 308322 310459 279653 254775 189185 171687 160230 111005 52865 11395
13572 11395 -51842 -76527 -63091 -70336 -77930 -70255 -101620 -103245 -94141 -124974 -130265 -149224 -180949
13559 -180949 -219543 -209177 -217846 -241721 -232819 -232793 -240635 -229207 -217175 -262257 -254396 -231833 -214841
13546 -214841 -197176 -176091 -172633 -197138 -222488 -199325 -216744 -196617 -156153 -180130 -226943 -238267
13534 -238267 -206009 -210728 -230303 -222799 -194269 -152701 -139724 -123679 -128903 -126895 -167080 -182542
13522 -182542 -134252 -123065 -158559 -160032 -160586 -159138 -169924 -179134 -175161 -212565 -236107 -180236 -189937
$$ packed form
13607a70964q692J9297j7646j9443j3166j4359j7639J061J5294M1129p949l669
13595a96746J4867M2685M8926L7470K1596j0095M5319O9259P6714O8674M2442
13584B61111K0463k625K9373K137l0806k4878o5590j7498j1457m9225n8140m1470
13572A1395o3237k4685J3436p245p594P675l1365j625R104l0833n291j8959l1725
13559a80949l8594J0366q669k3875Q902K6p842J1428J2032m5082P861K2563J6992
13546b14841J7665K1085L458k4505k5350K3163j7419K0127M0464k3977m6813j1324
13534b38267L2258m719j9575P504K8530M1568J2977J6045n224K008m0185j5462
13522a82542M8290J1187l5494j473n54J448j0786r210L973l7404k3542N5871r701
$$ plain form
13509 -189937 -155017 -148892 -141106 -132863 -153365 -195392 -184038 -159600 -162907 -170047 -178578 -169523 -152774
13496 -152774 -160860 -171983 -180583 -203404 -211747 -176554 -153347 -102031 -85204 -72105 -59768 -60809
13484 -60809 -77657 -84932 -103006 -129959 -142329 -134401 -136691 -150935 -121879 -124484 -151722 -148226 -132297
13471 -132297 -118846 -123731 -129934 -111681 -99991 -106087 -132436 -191191 -207819 -179534 -154510 -110829
13459 -110829 -140783 -182670 -204151 -217942 -216490 -222377 -216867 -211740 -218851 -220700 -234613 -223229 -194032
13446 -194032 -177169 -178862 -170789 -161806 -162634 -172243 -170201 -157099 -193093 -202727 -158435 -148041 -146238
13433 -146238 -165444 -173251 -147778 -138036 -139553 -165559 -160161 -177645 -180945 -151416 -131060 -140700 -129772
13420 -129772 -118504 -127777 -125841 -150588 -195101 -215837 -227746 -168503 -156816 -178102 -181888 -197083
$$ packed form
13509a89937L4920O125P786Q243k0502m2027J1354K4438l307p140q531R055J6749
13496a52774q086j1123q600k2821q343L5193K3207N1316J6827J3099J2337j041
13484f0809j6848p275j8074k6953j2370P928k290j4244K9056k605k7238L496J5929
13471a32297J3451m885o203J8253J1690o096k6349n8755j6628K8285K5024M3681
13459a10829k9954m1887k1481j3791J452n887N510N127p111j849j3913J1384K9197
13446a94032J6863j693Q073Q983q28r609K042J3102l5994r634M4292J0394J803
13433a46238j9206p807K5473R742j517k6006N398j7484l300K9529K0356r640J0928
13420a29772J1268r273J936k4747m4513k0736j1909N9243J1687k1286l786j5195
$$ plain form
13408 -197083 -173801 -157375 -122819 -93365 -54739 -15697 -47127 -62459 -78027 -114587 -174539
13397 -174539 -183085 -182298 -201998 -197996 -141075 -158099 -180637 -164497 -170825 -146901 -135938 -161116
13385 -161116 -195457 -187286 -155713 -130264 -147782 -154945 -175128 -175659 -172661 -182934 -211539 -170553
13373 -170553 -111141 -84619 -70392 -79244 -116833 -139066 -102549 -62244 -55945 -64742 -96056 -112746
13361 -112746 -94915 -87611 -97941 -129995 -163495 -218826 -228918 -208290 -203166 -204505 -209379 -216340
13349 -216340 -208846 -165627 -162163 -191379 -165881 -109993 -76465 -70481 -74059 -62115 -63480 -67148 -67575
13336 -67575 -83251 -66474 -52735 -49341 -75555 -109496 -96360 -99641 -82664 -88522 -68516 -56048
13324 -56048 -103465 -115061 -96889 -94217 -62721 -73888 -119903 -133384 -124707 -104023 -112681 -95414
$$ packed form
13408a97083K3282J6426L4556K9454L8626L9042l1430j5332j5568l6560n9952
13397a74539q546P87j9700M002N6921j7024k2538J6140o328K3924J0963k5178
13385a61116l4341Q171L1573K5449j7518p163k0183n31K998j0273k8605M0986
13373a70553N9412K6522J4227q852l7589k2233L6517M0305O299q797l1314j6690
13361a12746J7831P304j0330l2054l3500n5331j0092K0628N124j339m874o961
13349b16340P494M3219L464k9216K5498N5888L3528N984l578J1944j365l668m27
13336f7575j5676J6777J3739L394k6214l3941J3136l281J6977n858K0006J2468
13324e6048m7417j1596J8172K672L1496j1167m6015j3481Q677K0684q658J7267
$$ plain form
13312 -95414 -72470 -70618 -77368 -81854 -68619 -75550 -91656 -70205 -77146 -111697 -95905 -94101 -84243
13299 -84243 -97277 -76048 -36817 -25760 -61648 -100202 -107099 -151335 -176997 -144120 -135703 -150877
13287 -150877 -145357 -175199 -151163 -129948 -137850 -143556 -140739 -128013 -128785 -142012 -144497 -138267 -126976
13274 -126976 -107230 -141957 -175112 -170632 -153225 -134378 -115387 -111448 -119043 -85211 -80289 -44585
13262 -44585 -15367 3957 3527 -35406 -53490 -94199 -77028 -74636 -85770 -120778 -111970 -111402 -82832
13249 -82832 -45060 -56999 -85568 -75458 -78326 -74697 -81894 -97854 -152303 -156618 -149007 -121912 -100946
13236 -100946 -117126 -105624 -120926 -128034 -127691 -121953 -128265 -104299 -85546 -108426 -140685 -150277 -140648
13223 -140648 -123467 -113336 -132541 -108889 -77605 -94373 -113801 -108317 -88247 -56324 -59462 -90592
$$ packed form
13312i5414K2944J852o750m486J3235o931j6106K1451o941l4551J5792J804R858
13299h4243j3034K1229L9231J1057l5888l8554o897m4236k5662L2877Q417j5174
13287a50877N520k9842K4036K1215p902n706K817J2726p72j3227k485O230J1291
13274a26976J9746l4727l3155M480J7407J8847J8991L939p595L3832M922L5704
13262d4585K9218J9324m30l8933j8084m0709J7171K392j1134l5008Q808N68K8570
13249h2832L7772j1939k8569J0110k868L629p197j5960n4449m315P611K7095K0966
13236a00946j6180J1502j5302p108L43N738o312K3966J8753k2880l2259r592R629
13223a40648J7181J0131j9205K3652L1284j6768j9428N484K0070L1923l138l1130
$$ plain form
13211 -90592 -82486 -61638 -32766 -49440 -57308 -49030 -31323 -26416 -59911 -68434 -47587 -12362 -31257
13198 -31257 -86031 -75221 -36132 -59552 -94941 -115378 -96762 -100970 -124100 -116469 -95250 -66168
13186 -66168 -50687 -68903 -53326 -35533 -63280 -76873 -118072 -167128 -152793 -92940 -63681 -69366
13174 -69366 -77735 -80331 -57982 -4755 52884 54668 2217 -5346 55666 48370 -24382 -32947 -14830
13161 -14830 -28986 -2642 18108 24083 15386 31675 50113 52387 42037 -1970 -16225 45082
13149 45082 89961 116506 132031 140776 137596 107961 96061 111084 125501 137287 125233 79804
13137 79804 50470 27164 64257 69355 60026 54819 55591 28651 12390 19465 71002 66667 80240
13124 80240 143217 176009 163145 153955 143811 73456 7991 33173 29819 2628 2824 13952
$$ packed form
13211i0592Q106K0848K8872j6674p868Q278J7707M907l3495q523K0847L5225j8895
13198c1257n4774J0810L9089k3420l5389k0437J8616m208k3130P631K1219K9082
13186f6168J5481j8216J5577J7793k7747j3593m1199m9056J4335N9853K9259n685
13174f9366q369k596K2349N3227N7639J784n2451p563O1012p296p2752q565J8117
13161a4830j4156K6344K0750N975q697J6289J8438K274j0350m4007j4255O1307
13149D5082M4879K6545J5525Q745l180k9635j1900J5023J4417J1786j2054m5429
13137G9804k9334k3306L7093N098r329n207P72k6940j6261P075N1537m335J3573
13124H0240O2977L2792j2864r190j0144p0355o5465K5182l354k7191J96J1128
$$ plain form
13112 13952 74614 121715 93223 33206 -4576 21697 961 -7792 -17567 -11803 601 -21748
13100 -21748 -31986 -16331 32749 -17945 -76057 -55069 -31823 -3118 49148 63602 34529 22588
13088 22588 8445 45804 57521 37903 60091 43243 73786 59946 68325 104929 106112 111550
13076 111550 147172 99856 73591 54907 -3995 -21387 -425 7058 23808 27257 48250 45289
13064 45289 -6753 -30188 -1626 -1688 -4556 26016 8176 -14579 -23067 4149 11736 -26945 -67900
13051 -67900 -60954 -35085 -53980 -72539 -88209 -96516 -100404 -106512 -88575 -101699 -132544 -120974
13039 -120974 -101062 -84654 -23677 -16715 -17028 -4588 29006 43522 10838 12277 17789 4090
13027 4090 -21749 -473 12995 10041 -30204 -40736 -46992 -65814 -55389 -49427 -22145 -27034 -2392
$$ packed form
13112A3952O0662M7101k8492o0017l7782K6273k0736q753r775N764J2404k2349
13100b1748j0238J5655M9080n0694n8112K0988K3246K8705N2266J4454k9073j1941
13088B2588j4143L7359J1717j9618K2188j6848L0543j3840Q379L6604J183N438
13076A11550L5622m7316k6265j8684n8902j7392K0962P483J6750L449K0993k961
13064D5289n2042k3435K8562o2k868L0572j7840k2755q488K7216P587l8681m0955
13051f7900O946K5869j8895j8559j5670q307l888o108J7937j3124l0845J1570
13039a20974J9912J6408O0977O962l13J2440L3594J4516l2684J439N512j3699
13027D090k5839K1276J3468k954m0245j0532o256j8822J0425N962K7282m889K4642
$$ plain form
13014 -2392 -11637 -44562 -19953 -32879 -39974 -21577 -22197 -29608 -11820 -7746 -25032 -24265 11325
13001 11325 10506 31282 44711 46288 21488 -1317 -25819 -31497 -5168 -10979 -47345 -72122 -81813
12988 -81813 -102201 -113156 -97386 -42858 -15528 -22435 -37813 -56926 -94470 -53627 -8112 27543
12976 27543 19903 6163 -18104 -27496 -29450 -29367 -21566 -24526 -12446 27271 35233 23678 25563 -11528
12962 -11528 -4574 27546 7445 -3763 43100 57187 50900 27574 23716 -14351 -21991 20302
12950 20302 47801 65783 32531 19742 1769 -23167 -13044 -31896 -24901 -16216 -77924 -90993
12938 -90993 -69487 -47876 -18810 -13156 14454 39015 12617 -47361 -46410 -67277 -69197 -25864
12926 -25864 -7830 -40555 -43006 -14229 -12932 14911 51767 68076 43183 -18073 -36068 1452
$$ packed form
13014b392r245l2925K4609j2926p095J8397o20p411J7788M074j7286P67L5590
13001A1325q19K0776J3429J577k4800k2805k4502n678K6329n811l6366k4777r691
12988h1813k0388j0955J5770N4528K7330o907j5378j9113l7544M0843M5515L5655
12976B7543p640j3740k4267r392j954Q3P801k960J2080L9717P962j1555J885l7091
12962a1528O954L2120k0101j1208M6863J4087o287k3326l858l8067p640M2293
12950B0302K7499J7982l3252j2789j7973k4936J0123j8852O995Q685o1708j3069
12938i0993K1506K1611K9066N654K7610K4561k6398n9978R51k0867j920M3333
12926b5864J8034l2725k451K8777J297K7843L6856J6309k4893o1256j7995L7520
$$ plain form
12914 1452 32659 14860 19546 13086 42366 48275 68353 43394 36838 33625 32073 41076 38432
12901 38432 9678 10170 1759 32212 37630 65665 102591 114873 84326 81151 70636 44745 55235
12888 55235 14750 -749 22957 50056 14886 -17625 -44742 -8784 29470 36385 55389 60960
12876 60960 42298 17214 13584 6127 12238 28444 71649 107029 116939 97351 107603 88590
12864 88590 35451 34517 35193 -11619 18894 50944 63867 35998 -11573 -14894 17177 33288 16659
12851 16659 17847 52459 60306 13143 10262 69744 72346 88619 93297 66467 45519 27443 31704
12838 31704 43939 58018 56078 54814 56153 53397 57861 63853 74440 67208 61686 79965 47591
12825 47591 35982 39582 31803 5390 163 30831 49160 49906 54150 63062 11433 29914 63693
$$ packed form
12914A452L1207j7799M686o460K9280N909K0078k4959o556l213j552R003k644
12901C8432k8754M92q411L0453N418K8035L6926J2282l0547l175j0515k5891J0490
12888E5235m0485j5499K3706K7099l5170l2511k7117L5958L8254O915J9004N571
12876F0960j8662k5084l630p457O111J6206M3205L5380R910j9588J0252j9013
12864H8590n3139r34O76m6812L0513L2050J2923k7869m7571l321L2071J6111j6629
12851A6659J188L4612P847m7163k881N9482K602J6273M678k6830k0948j8076M261
12838C1704J2235J4079j940j264J339k756M464N992J0587p232n522J8279l2374
12825D7591j1609L600p779k6413n227L0668J8329P46M244Q912n1629J8481L3779
$$ plain form
12812 63693 71641 95267 92086 110892 108998 97479 103693 142811 152732 120579 118850 124636 102036
12799 102036 83828 52078 25595 32964 6107 -14632 38603 71940 50440 16145 26424 48602
12787 48602 52188 51915 43994 26920 59256 56105 51747 65939 86725 72832 31819 16260 34706
12774 34706 81470 117901 99641 72447 64761 60335 56318 70235 92523 121868 91764 75525
12762 75525 73500 101657 66475 61708 62193 72133 86350 86717 93046 119659 125438 87312 94216 115265
12748 115265 146185 148515 125127 121573 98265 114376 108140 81755 54612 34559 24612 2056
12736 2056 47546 98137 105525 110894 128618 95616 70312 61950 75946 125866 145771 162089
12724 162089 114841 92601 87744 70941 88812 73331 37779 16664 53136 46645 53115 53161 52501
$$ packed form
12812F3693P948K3626l181J8806j894j1519O214L9118R921l2153j729N786k2600
12799A02036j8208l1750k6483P369k6857k0739N3235L3337k1500l4295J0279K2178
12787D8602L586k73p921j7074L2336l151m358J4192K0786j3893m1013j5559J8446
12774C4706M6764L6431j8260k7194p686m426m017J3917K2288K9345l0104j6239
12762G5525k025K8157l5182m767M85R940J4217L67O329K6613N779l8126O904K1049
12748A15265L0920K330k3388l554k3308J6111o236k6385k7143k0053r947k2556
12736B056M5490N0591P388N369J7724l3002k5304q362J3996M9920J9905J6318
12724A62089m7248k2240m857j6803J7871j5481l5552k1115L6472o491O470M6o60
$$ plain form
12711 52501 12242 16889 59734 111465 107046 123011 146691 207077 268222 307170 297821 280901
12699 280901 252089 198399 203514 193292 150255 90498 91977 125728 126977 109912 93183 118736
12687 118736 101145 105496 89746 97423 142503 149330 132025 138107 152676 187188 188115 137674 108801
12674 108801 102937 113936 163471 244242 252288 262004 278702 286476 302212 331436 310500 283418
12662 283418 228937 219406 204632 157799 115621 95972 117169 145353 160311 140977 108222 110798
12650 110798 112108 126496 115591 99168 69727 86053 125169 163962 207506 163417 121637 147658
12638 147658 148274 193857 228419 207718 229957 245620 221769 290872 320558 310386 266155 202630
12626 202630 160243 159067 140411 140735 180176 159114 162862 172765 171801 151519 139186 152662 179949
$$ packed form
12711E2501m0259M647M2845N1731m419J5965K3680O0386O1145L8948r349j6920
12699B80901k8812n3690N115j0222m3037n9757J479L3751J249j7065j6729K5553
12687A18736j7591M351j5750P677M5080O827j7305O082J4569L4512R27n0441k8873
12674A08801n864J0999M9535Q0771Q046R716J6698P774J5736K9224k0936k7082
12662B83418n4481r531j4774m6833m2178j9649K1197K8184J4958j9334l2755K576
12650A10798J310J4388j0905j6423k9441J6326L9116L8793M3544m4089m1780K6021
12638A47658O16M5583L4562k0701K2239J5663k3851O9103K9686j0172m4231o3525
12626B02630m2387j176j8656L24L9441k1062L748R903r64k0282j2333J3476K7287
$$ plain form
12613 179949 178510 188251 236286 232004 224526 218704 195250 185088 172986 158311 160529 212519 206972
12600 206972 168191 186834 249244 254440 217873 190180 184895 180490 190514 202647 188934 226795
12588 226795 225606 204905 149559 123669 176820 175466 197220 235231 242593 194296 173032 188257
12576 188257 226638 221293 212481 189881 219674 241037 257178 231867 224124 220099 205060 207715
12564 207715 254561 288310 297602 290966 303032 307730 269619 207106 216661 223210 231379 234009 256864
12551 256864 259106 247880 230464 202286 158415 145609 203988 234507 228745 266385 315940 334369
12539 334369 322880 297159 264398 248186 232242 236657 315834 387687 411996 467203 487848 453913
12527 453913 401017 386143 390001 347098 308790 277282 282741 287503 276464 284800 277903 260308
$$ packed form
12613A79949j439R741M8035m282p478n822k3454j0162j2102j4675K218N1990n547
12600B06972l8781J8643O2410N196l6567k7693n285m405J0024J2133j3713L7861
12588B26795j189k0701n5346k5890N3151j354K1754L8011P362m8297k1264J5225
12576A88257L8381n345q812k2600K9793K1363J6141k5311p743m025j5039K655
12564B07715M6846L3749R292o636J2066M698l8111o2513R555O549Q169K630K2855
12551B56864K242j1226j7416k8178m3871j2806N8379L0519n762L7640M9555J8429
12539C34369j1489k5721l2761j6212j5944M415P9177P1853K4309N5207K0645l3935
12527D53913n2896j4874L858m2903l8308l1508N459M762j1039Q336o897j7595
$$ plain form
12515 260308 254964 261380 294729 307513 243906 211243 217327 271997 308077 290652 296523 302390
12503 302390 314256 333959 297745 247771 256464 258920 277495 298622 322048 320991 333601 414175
12491 414175 500525 617654 728807 737365 649568 514238 402020 392924 413348 425273 400857
12480 400857 343452 320943 321997 341630 353820 369726 400220 412896 403948 401345 381008 344246
12468 344246 341903 345735 335280 341230 334326 320157 377313 403473 389384 382809 368100 327980
12456 327980 325262 325476 333138 361082 421639 452814 493041 550990 574496 578266 549719 498860
12444 498860 458480 431869 412237 426250 442223 404312 364889 383502 357788 345790 344876 365705
12432 365705 397020 382023 402229 446088 437026 453692 524221 569973 660401 757276 862074
$$ packed form
12515B60308n344O416L3349J2784o3607l2663O084N4670L6080j7425N871N867
12503C02390J1866J9703l6214m9974Q693K456J8575K1127K3426j057J2610Q0574
12491D14175Q6350J17129J11153Q558q7797j35330j12218r096K0424J1925k4416
12480D00857n7405k2509J054J9633J2190J5906L0494J2676q948k603k0337l6762
12468C44246k343L832j0455N950o904j4169N7156K6160j4089o575j4709m0120
12456C27980k718K14P662K7944O0557L1175M0227N7949K3506L770k8547n0859
12444D98860m0380k6611j9632J4013J5973l7911l9423J8613k5714j1998r14K0829
12432C65705L1315j4997K0206M3859r062J6666P0529M5752R0428R6875J04798
$$ plain form
12421 862074 911997 882299 811063 742544 694227 634751 605768 608221 578870 587466 630844 646708
12409 646708 674465 719886 743222 737541 725068 738089 739239 770496 837335 888022 923391 949211
12397 949211 958356 923873 883337 877812 883906 914250 975913 1039204 1080357 1172960 1390769 1608737
12385 1608737 1755548 1775807 1667286 1509162 1318956 1123653 973697 900704 876798 875931
12375 875931 911992 905922 869825 924975 983962 971912 932666 861928 830351 843817 818678 763685
12363 763685 740039 753244 751711 760318 785890 738786 720545 741844 735931 749607 786596 810754
12351 810754 848454 919134 981067 1035049 1051953 983183 837093 700635 564550 510978 489203
12340 489203 450651 481200 521489 515984 495827 470986 444255 467960 488575 485034 449629 448385
$$ packed form
12421H62074M9923k9698p1236o8519m8317n9476k8983K453k9351Q596M3378J5864
12409F46708K7757M5421K3336n681j2473J3021J150L1257O6839N0687L5369K5820
12397I49211R145l4483m0536n525O094L0344O1663O3291M1153R2603K17809K17968
12385A608737J46811K0259j08521j58124j90206j95303j49956p2993k3906q67
12375H75931L6061o070l6097N5150N8987j2050l9246p0738l1577J3466k5139n4993
12363G63685k3646J3205j533Q607K5572m7104j8241K1299n913J3676L6989K4158
12351H10754L7700P0680O1933N3982J6904o8770j46090j36458j36085n3572k1775
12340D89203l8552L0549M0289n505k0157k4841k6731K3705K0615l541l5405j244
$$ plain form
12328 448385 452960 428431 423365 433584 475789 469525 460823 469275 452612 476446 487390 471134
12316 471134 470592 471670 482674 493865 496249 472534 476128 483002 488945 488783 518529 513062 492832
12303 492832 470467 427178 415597 425963 418816 431417 430327 445947 473993 459273 416216 409894
12291 409894 433094 447058 472719 499814 446796 409686 446915 470338 465025 488116 520762 525259
12279 525259 490319 477705 490074 503256 526481 531042 550640 536709 489649 490165 500794 499711
12267 499711 493541 510079 482482 505677 523038 544330 519611 490246 482883 505293 492213 537114
12255 537114 579804 590853 628966 643587 612840 597649 572831 544192 546936 530817 523285 535571
12243 535571 541466 542639 560513 607158 592867 522046 539362 516365 515957 502010 505347 473029
$$ packed form
12328D48385M575k4529n066J0219M2205o264q702Q452j6663K3834J0944j6256
12316D71134n42J078J1004J1191K384k3715L594O874N943j62K9746n467k0230
12303D92832k2365m3289j1581J0366p147J2601j090J5620K8046j4720m3057o322
12291D09894K3200J3964K5661K7095n3018l7110L7229K3423n313K3091L2646M497
12279E25259l4940j2614J2369J3182K3225M561J9598j3931m7060N16J0629j083
12267D99711o170J6538k7597K3195J7361K1292k4719k9365p363K2410j3080M4901
12255E37114M2690J1049L8113J4621l0747j5191k4818k8639K744j6119p532J2286
12243E35571N895J173J7874M6645j4291p0821J7316k2997m08j3947L337l2318
$$ plain form
12231 473029 498025 509003 502912 482331 471585 488939 531269 551600 555049 528043 552686 583235
12219 583235 612417 640321 641119 676048 686144 675268 658109 673512 670148 707409 799237 870605
12207 870605 889342 868504 805165 735808 701100 699927 654193 602490 599686 631360 644401 640646
12195 640646 584396 595237 652956 647241 603073 605783 599902 608551 641562 598115 581066 579972
12183 579972 595256 629040 648493 638885 636293 635452 620328 616638 655167 651219 660622 683305 692444
12170 692444 705763 718558 747057 741461 793364 854209 921333 1023091 1063492 1021007 947909
12159 947909 878679 806080 762763 764216 790162 839367 859921 777230 756170 771400 770157 770057
12147 770057 766302 758705 751422 765654 734188 727297 717694 723903 764248 780871 777338 794526 783955
$$ packed form
12231D73029K4996J0978o091k0581j0746J7354M2330K0331L449k7006K4643L0549
12219E83235K9182K7904P98L4929J0096j0876j7159J5403l364L7261R1828P1368
12207H70605J8737k0838o3339o9357l4708j173m5734n1703k804L1674J3041l755
12195F40646n6250J0841N7719n715m4168K710n881Q649L3011m3447j7049j094
12183E79972J5284L3784J9453r608k592q41j5124l690L8529l948R403K2683R139
12170F92444J3319J2795K8499n596N1903O0845O7124J01758M0401m2485p3098
12159I47909o9230p2599m3317J453K5946M9205K0554q2691k1060J5230j243j00
12147G70057l755p597p283J4232l1466o891r603O209M0345J6623l533J7188j0571
$$ plain form
12134 783955 778649 753631 776117 758703 721980 745906 749213 767152 789648 783360 812202 807644
12122 807644 812196 829643 884318 882246 852111 838315 832065 828380 807013 775475 762994 777266
12110 777266 796365 847020 889547 911201 907217 916089 888491 847464 842912 885614 902454 918674
12098 918674 903626 922296 914210 925206 931983 934825 912633 902961 876968 869034 882027 947263
12086 947263 950950 927373 924609 923315 922823 924036 940472 924679 943096 985679 1013144 1042585 1014551
12073 1014551 988264 992721 976025 953768 984502 976882 1020087 1062015 1004235 985354 1006042 1031379
12061 1031379 1074012 1080496 1091292 1113868 1124774 1134821 1117293 1123966 1162347 1169050 1170098 1149251
12049 1149251 1124156 1171984 1156241 1152327 1156177 1142407 1178560 1153065 1162949 1195319 1213420 1242574
$$ packed form
12134G83955n306k5018K2486j7414l6723K3926L307J7939K2496o288K8842m558
12122H07644M552J7447N4675k072l0135j3796o250l685k1367l1538j2481J4272
12110G77266J9099N0655M2527K1654l984Q872k7598m1027m552M2702J6840J6220
12098I18674j5048J8670q086J0996O777K842k2192r672k5993p934J2993O5236
12086I47263L687k3577k764j294m92J213J6436j5793J8417M2583K7465K9441k8034
12073A014551k6287M457j6696k2257L0734p620M3205M1928n7780j8881K0688K5337
12061A031379M2633O484J0796K2576J0906J0047j7528O673L8381O703J048k0847
12049A149251k5095M7828j5743l914L850j3770L6153k5495R884L2370J8101K9154
$$ plain form
12037 1242574 1278407 1272642 1276067 1298431 1300565 1286558 1275677 1256444 1280017 1283658 1287205 1310622
12025 1310622 1284755 1252103 1243908 1258220 1249218 1233598 1256492 1298514 1308531 1303232 1315425 1305191
12013 1305191 1259521 1259262 1266951 1290837 1320936 1361877 1362897 1359349 1357942 1366544 1389547 1375042 1393826
12000 1393826 1434427 1435286 1423120 1408832 1441165 1457881 1485221 1505832 1505309 1502702 1524246 1534720
11988 1534720 1499980 1504718 1528802 1523530 1501120 1506582 1530171 1562140 1547563 1544792 1570747 1583597
11976 1583597 1553089 1538242 1569954 1617016 1617602 1613454 1626336 1653654 1699423 1716491 1729798 1702122
11964 1702122 1655788 1647756 1661965 1683188 1711621 1746595 1749982 1760156 1774081 1809368 1815659 1824689
11952 1824689 1857015 1880560 1868327 1872439 1885557 1920757 1935327 1952223 1913553 1955904 1986946
$$ packed form
12037A242574L5833n765L425K2364K134j4007j0881j9233K3573L641L547K3417
12025A310622k5867l2652q195J4312r002j5620K2894M2022J0017n299J2193j0234
12013A305191m5670k59P689K3886L0099M0941J020l548j407Q602K3003j4505J8784
12000A393826M0601Q59j2166j4288L2333J6716K7340K0611n23k607K1544J0474
11988A534720l4740M738K4084n272k2410N462K3589L1969j4577k771K5955J2850
11976A583597l0508j4847L1712M7062N86m148J2882K7318M5769J7068J3307k7676
11964A702122m6334q032J4209K1223K8433L4974L387J0174J3925L5287O291R030
11952A824689L2326K3545j2233M112J3118L5200J4570J6896l8670M2351L1042
$$ plain form
11941 1986946 1970635 1971803 1965720 1973704 1956671 1972522 2003278 2017415 2023333 2046456 2047808 2024684
11929 2024684 2021792 2023400 2032995 2053197 2055672 2095070 2174253 2228877 2226919 2199569 2174192 2164841
11917 2164841 2168105 2206493 2231330 2256587 2281217 2308948 2296247 2236427 2198593 2204609 2241233 2279548
11905 2279548 2318889 2398100 2431129 2445075 2463882 2475553 2458474 2460625 2506496 2536999 2519313
11894 2519313 2485799 2505741 2598358 2619607 2579904 2579299 2626178 2685803 2711088 2725650 2712103 2733367
11882 2733367 2778172 2791490 2803315 2815840 2838020 2888831 2929655 2951672 2936877 2905251 2928916
11871 2928916 2978397 3024120 3013351 3001569 3013821 3027375 3021996 3032088 3071786 3075639 3121389 3155120
11859 3155120 3181281 3231885 3241701 3244511 3279488 3322702 3353969 3378030 3404432 3396173 3401898 3404507
$$ packed form
11941A986946j6311J168o083P984j7033J5851L0756J4137N918K3123J352k3124
11929B024684k892J608R595K0202K475L9398P9183N4624j958k7350k5377r351
11917B164841L264L8388K4837K5257K4630K7731j2701n9820l7834O016L6624L8315
11905B279548L9341P9211L3029J3946J8807J1671j7079K151M5871L0503j7686
11894B519313l3514J9942R2617K1249l9703o05M6879N9625K5285J4562j3547K1264
11882B733367M4805J3318J1825J2525K2180N0811M0824K2017j4795l1626K3665
11871B928916M9481M5723j0769j1782J2252J3554n379J0092L9698L853M5750L3731
11859C155120K6161N0604R816K810L4977M3214L1267K4061K6402q259N725K609
$$ plain form
11847 3404507 3422568 3407725 3431022 3458104 3508981 3526215 3589413 3639876 3665867 3678198 3661550
11836 3661550 3669637 3688048 3727495 3748984 3758038 3818162 3876548 3906135 3929870 3951098 3975830 3984210
11824 3984210 4034118 4080108 4095290 4088327 4093475 4125880 4211012 4258696 4271484 4299839 4322268 4314737
11812 4314737 4290748 4348641 4418734 4495120 4528169 4605191 4730763 4829743 4873893 4917857 4953299
11801 4953299 4949810 4895992 4821731 4803627 4829004 4861355 4876729 4943131 4995278 4994245 5009169 5056396
11789 5056396 5117593 5144801 5138448 5180272 5192872 5197766 5196545 5229165 5245707 5300410 5351176 5388675
11777 5388675 5419987 5501898 5535708 5562283 5557121 5570907 5631512 5653971 5681111 5729820 5787282
11766 5787282 5844379 5876991 5906698 5982080 6012808 6028521 6073823 6121126 6142632 6168676 6232266
$$ packed form
11847C404507J8061j4843K3297K7082N0877J7234O3198N0463K5991J2331j6648
11836C661550Q087J8411L9447K1489R054O0124N8386K9587K3735K1228K4732Q380
11824C984210M9908M5990J5182o963N148L2405Q5132M7684J2788K8355K2429p531
11812D314737k3989N7893P0093P6386L3049P7022J25572R8980M4150M3964L5442
11801D953299l489n3818p4261j8104K5377L2351J5374O6402N2147j033J4924M7227
11789E056396O1197K7208o353M1824J2600M894j221L2620J6542N4703N0766L7499
11777E388675L1312Q1911L3810K6575n162J3786O0605K2459K7140M8709N7462
11766E787282N7097L2612K9707P5382L0728J5713M5302M7303K1506K6044O3590
$$ plain form
11755 6232266 6298033 6303799 6333707 6330178 6354939 6367490 6380964 6449269 6506378 6547822 6605244 6616079
11743 6616079 6626178 6651532 6682836 6718856 6785797 6844689 6910900 6938693 7003627 7039932 7028654
11732 7028654 7039924 7069523 7075502 7097539 7161131 7223728 7237384 7288355 7319540 7348890 7352046 7350681
11720 7350681 7359402 7386041 7416560 7473746 7532719 7565369 7601652 7595431 7600436 7616207 7638959 7692862
11708 7692862 7715669 7692263 7714576 7799349 7847819 7850976 7871532 7815862 7807852 7823084 7836316 7865342
11696 7865342 7929506 7973580 7971480 7925347 7957563 8000189 7977166 8016989 8079860 8062537 8067922 8118085
11684 8118085 8122116 8104197 8105607 8089073 8052514 8049541 8116596 8139127 8119692 8144951 8161482 8136192
11672 8136192 8148837 8161679 8174164 8189763 8196514 8174240 8177053 8197565 8201700 8197207 8181377 8146717
$$ packed form
11755F232266O5767N766K9908l529K4761J2551J3474O8305N7109M1444N7422J0835
11743F616079J0099K5354L1304L6020O6941N8892O6211K7793O4934L6305j1278
11732G028654J1270K9599N979K2037O3592O2597J3656N0971L1185K9350L156j365
11720G350681Q721K6639L0519N7186N8973L2650L6283o221N005J5771K2752N3903
11708G692862K2807k3406K2313Q4773M8470L157K0556n5670q010J5232J3232K9026
11696G865342O4164M4074k100m6133L2216M2626k3023L9823O2871j7323N385N0163
11684H118085M031j7919J410j6534l6559k973O7055K2531j9435K5259J6531k5290
11672H136192J2645J2842J2485J5599O751k2274K813K0512M135m493j5830l4660
$$ plain form
11660 8146717 8070439 8056263 8106739 8157909 8175097 8157676 8148233 8102057 8084886 8062219 8029518
11649 8029518 7998815 7972251 7953533 7936070 7887982 7871953 7867157 7848887 7835087 7867026 7862234 7828624
11637 7828624 7809374 7775625 7777254 7772754 7728660 7664995 7629993 7584160 7564980 7522951 7494544 7456951
11625 7456951 7447322 7456495 7432000 7379706 7342824 7269031 7213665 7219870 7205077 7155327 7101878 7096750
11613 7096750 7103339 7076277 7021944 6974387 6951357 6920429 6884306 6862975 6808379 6778616 6775756 6740654
11601 6740654 6680954 6605611 6601226 6593522 6615515 6601314 6551334 6492501 6407400 6351019 6285822 6259962
11589 6259962 6267183 6247522 6227904 6208450 6205887 6197448 6188818 6169426 6101305 6062651 6030341 5967714
11577 5967714 5890647 5839329 5800797 5767689 5716363 5663104 5646169 5592809 5555240 5576544 5552403
$$ packed form
11660H146717p6278j4176N0476N1170J7188j7421r443m6176j7171k2667l2701
11649H029518l0703k6564j8718j7463m8088j6029m796j8270j3800L1939m792l3610
11637G828624j9250l3749J629m500m4094o3665l5002m5833j9180m2029k8407l7593
11625G456951r629R173k4495n2294l6882p3793n5366O205j4793m9750n3449n128
11613G096750O589k7062n4333m7557k3030l0928l6123k1331n4596k9763k860l5102
11601F740654n9700p5343m385p704K1993j4201m9980n8833q5101n6381o5197k5860
11589F259962P221j9661j9618j9454k563q439q630j9392o8121l8654l2310o2627
11577E967714p7067n1318l8532l3108n1326n3259j6935n3360l7569K1304k4141
$$ plain form
11566 5552403 5499748 5438119 5408588 5361140 5310377 5272881 5247385 5191150 5156746 5150456 5119686
11555 5119686 5058879 4997461 4983376 4966224 4947290 4930670 4878815 4825358 4790613 4790181 4779043 4780947
11543 4780947 4755023 4733338 4697094 4708793 4713722 4675392 4633331 4601830 4522467 4482684 4457920
11532 4457920 4434906 4378745 4321378 4276365 4220313 4204137 4178363 4146314 4108334 4126066 4134146
11521 4134146 4112019 4093437 4085310 4005531 3944599 3924045 3872434 3807010 3817470 3790476 3744196
11510 3744196 3729874 3722309 3724828 3723640 3665795 3608725 3552033 3526743 3530332 3487089 3480758 3447838
11498 3447838 3450102 3429620 3413145 3374086 3357567 3361731 3327368 3264671 3270787 3295126 3253494 3277864
11486 3277864 3283863 3320090 3272222 3187023 3149783 3133169 3106612 3091122 3093771 3064407 3010884 2960951
$$ packed form
11566E552403n2655o1629k9531m7448n0763l7496k5496n6235l4404o290l0770
11555E119686o0807o1418j4085j7152j8934j6620n1855n3457l4745m32j1138J904
11543D780947k5924k1685l6244J1699M929l8330m2061l1501p9363l9783k4764
11532D457920k3014n6161n7367m5013n6052j6176k5774l2049l7980J7732Q080
11521D134146k2127j8582q127p9779o0932k0554n1611o5424J0460k6994m6280
11510C744196j4322p565K519j188n7845n7070n6692k5290L589m3243o331l2920
11498C447838K264k0482j6475l9059j6519M164l4363o2697O116K4339m1632K4370
11486C277864N999L6227m7868q5199l7240j6614k6557j5490K649k9364n3523m9933
$$ plain form
11474 2960951 2926886 2889336 2900486 2911539 2881324 2845234 2847333 2865849 2846003 2840084 2839456 2831915
11462 2831915 2807206 2739280 2690620 2665832 2654538 2635295 2655174 2658154 2670405 2659986 2633987
11451 2633987 2579755 2542043 2530133 2515144 2500594 2462351 2430784 2433249 2438750 2453577 2456323 2461968
11439 2461968 2442894 2394752 2402498 2388812 2375994 2348785 2330332 2284712 2257356 2264231 2256470 2232037
11427 2232037 2237010 2241241 2217897 2191342 2196592 2212098 2227052 2230109 2209581 2218072 2215872 2237549
11415 2237549 2257806 2273205 2222292 2188288 2183078 2144933 2039185 1995703 1990118 1999949 2032329 1987690
11403 1987690 1922496 1911236 1912635 1914400 1928035 1889657 1880168 1863403 1851277 1849768 1827862 1834827
11391 1834827 1846502 1840457 1822284 1805042 1777624 1782072 1774992 1757621 1746014 1740533 1733334 1746367
$$ packed form
11474B960951l4065l7550J1150J1053l0215l6090K099J8516j9846n919o28p541
11462B831915k4709o7926m8660k4788j1294j9243J9879K980J2251j0419k5999
11451B633987n4232l7712j1910j4989j4550l8243l1567K465N501J4827K746N645
11439B461968j9074m8142P746j3686j2818k7209j8453m5620k7356O875p761k4433
11427B232037M973M231k3344k6555N250J5506J4954L057k0528Q491k200K1677
11415B237549K0257J5399n0913l4004n210l8145j05748m3482n585R831L2380m4639
11403A987690o5194j1260J399J765J3635l8378r489j6765j2126j509k1906O965
11391A834827J1675o045j8173j7242k7418M448p080j7371j1607n481p199J3033
$$ plain form
11379 1746367 1741652 1705039 1680042 1689975 1710724 1678462 1677099 1653280 1662638 1653270 1635982 1620188
11367 1620188 1623303 1594760 1583837 1595626 1607810 1610387 1652414 1627614 1600836 1572507 1553327 1569333
11355 1569333 1609649 1625047 1575388 1562265 1561984 1516374 1489681 1490851 1508923 1459114 1424312 1463736
11343 1463736 1533641 1528372 1473072 1489501 1521176 1534468 1486221 1432576 1434998 1485012 1488341 1467360
11331 1467360 1418589 1412770 1410397 1401119 1413281 1446667 1446899 1387142 1344132 1327742 1369311 1391254
11319 1391254 1389370 1371085 1363521 1356843 1388917 1423843 1431898 1488967 1503242 1597480 1742526 1914712
11307 1914712 1922038 1763320 1547180 1453306 1424447 1405209 1429816 1434145 1396447 1350561 1303207
11296 1303207 1249787 1247563 1260773 1275453 1280269 1247726 1262284 1227412 1185448 1185735 1184864 1162323
$$ packed form
11379A746367m715l6613k4997R933K0749l2262j363k3819R358r368j7288j5794
11367A620188L115k8543j0923J1789J2184K577M2027k4800k6778k8329j9180J6006
11355A569333M0316J5398m9659j3123k81m5610k6693J170J8072m9809l4802L9424
11343A463736O9905n269n5300J6429L1675J3292m8247n3645K422N0014L329k0981
11331A467360m8771n819k373r278J2162L3386K32n9757m3010j6390M1569K1943
11319A391254j884j8285p564o678L2074L4926Q055N7069J4275R4238J45046J72186
11307A914712P326j58718k16140r3874k8859j9238K4607M329l7698m5886m7354
11296A303207n3420k224J3210J4680M816l2543J4558l4872m1964K87q71k2541
$$ plain form
11284 1162323 1170290 1143435 1158377 1150364 1152022 1169868 1172967 1180340 1225414 1254973 1208256 1211720
11272 1211720 1221593 1175079 1125991 1115713 1136929 1217452 1228169 1206663 1155155 1193447 1263635
11261 1263635 1280581 1288172 1302323 1346303 1489150 1671459 1891591 2127430 2237197 2274410
11251 2274410 2254149 2166094 1951597 1732873 1643995 1592227 1564885 1603957 1680283 1833277 2113079
11240 2113079 2590406 3425193 4634744 5662528 5815186 4922304 3724894 2723439 2035922
11231 2035922 1672065 1483087 1345571 1226228 1153086 1135896 1084724 1049734 1040073 1003181 936533
11220 936533 935275 888558 877557 908037 909419 902315 898769 872515 854377 825889 828972 894743
11208 894743 900902 883326 856865 871914 887708 894881 872235 841791 791972 774886 790099 800925
$$ packed form
11284A162323P967k6855J4942q013J658J7846L099P373M5074K9559m6717L464
11272A211720R873m6514m9088j0278K1216Q0523J0717k1506n1508L8292P0188
11261A263635J6946P591J4151M3980J42847J82309K20132K35839J09767L7213
11251B274410k0261q8055k14497k18724q8878n1768k7342L9072P6326J52994K79802
11240B113079M77327Q34787J209551J027784J52658q92882j197410j001455o87517
11231B035922l63857j88978j37516j19343p3142j7190n1172l4990r661l6892o6648
11220I36533j258m6717j1001L0480J382p104l546k6254j8138k8488L083O5771
11208H94743O159j7576k6461J5049J5794P173k2646l0444m9819j7086J5213J0826
$$ plain form
11196 800925 775635 729311 727491 726754 701049 718136 733907 738596 784345 798237 748895 720700
11184 720700 740688 776061 770407 784274 785745 809700 816856 795279 840024 836333 823007 782727
11172 782727 782434 777626 754094 748542 770910 777796 752365 777214 783640 766591 747910 749059 778204
11159 778204 726234 683045 696320 723722 755714 738690 697058 682240 661681 686187 687874 632743
11147 632743 628728 687040 718615 726659 730098 736501 742091 740769 755760 770410 780767 796492 827738
11134 827738 826861 849514 903363 963397 1124901 1356412 1521415 1564542 1523090 1551542 1579315
11123 1579315 1455624 1210711 967173 846556 818880 776730 699753 677518 693892 683711
11113 683711 667690 666249 663814 647537 634904 673782 729524 774507 776893 718525 706599 752494
$$ packed form
11196H00925k5290m6324j820p37k5705J7087J5771M689M5749J3892m9342k8195
11184G20700J9988L5373n654J3867J471K3955P156k1577M4745l691j3326m0280
11172G82727k93m808k3532n552K2368O886k5431K4849O426j7049j8681J149K9145
11159G78204n1970m3189J3275K7402L1992j7024m1632j4818k0559K4506J687n5131
11147F32743m015N8312L1575Q044L439O403N590j322J4991J4650J0357J5725L1246
11134H27738q77K2653N3849O0034J61504K31511J65003M3127m1452K8452K7773
11123A579315j23691k44913k43538j20617k7676m2150p6977k2235J6374j0181
11113F83711j6021j441k435j6277j2633L8878N5742M4983K386n8368j1926M5895
$$ plain form
11101 752494 753235 713363 720490 747314 754971 748116 739192 760154 761065 728001 701869 713881 679624
11088 679624 654031 633622 606879 599898 569655 572849 528006 523911 559363 608830 627788 600209
11076 600209 586009 606654 579452 543523 563399 575921 563842 554800 561324 591807 628095 645266
11064 645266 670143 650125 667390 665332 639781 625412 592811 625047 689320 736569 791268 882929
11052 882929 954891 981631 957256 863494 813933 768083 728910 667362 610516 591714 631217
11041 631217 618773 601489 590557 603607 572697 599940 661588 707714 681202 630357 598975
11030 598975 571662 594835 622867 610380 581285 564051 548430 578487 609778 585717 583080 572473
11018 572473 566170 561429 511233 487749 493809 487555 515522 520516 533318 515929 482958 504851
$$ packed form
11101G52494P41l9872P127K6824P657o855q924K0962R11l3064k6132J2012l4257
11088F79624k5593k0409k6743o981l0243L194m4843m095L5452M9467J8958k7579
11076F00209j4200K0645k7202l5929J9876J2522j2079r042O524L0483L6288J7171
11064F45266K4877k0018J7265k058k5551j4369l2601L2236O4273M7249N4699R1661
11052H82929P1962K6740k4375r3762m9561m5850l9173o1548n6846j8802L9503
11041F31217j2444j7284j0932J3050l0910K7243O1648M6126k6512n0845l1382
11030E98975k7313K3173K8032j2487k9095j7234j5621L0057L1291k4061k637j0607
11018E72473o303m741n0196k3484O060o254K7967M994J2802j7389l2971K1893
$$ plain form
11006 504851 476463 487291 519916 549297 533210 551703 562161 544593 514435 503583 489854
10995 489854 521155 537141 495641 503553 520705 499893 491778 498402 500187 502117 483674 470066
10983 470066 469373 437990 451048 502150 526350 546485 592040 602487 594085 604773 624242 634061
10971 634061 624946 625259 615104 591977 554973 532463 508137 461839 418626 400484 431099 464875
10959 464875 532389 540564 540049 500515 442201 427769 439133 437789 469533 459687 431624 421678 433272
10946 433272 443698 455721 448285 430796 411648 480723 544959 520031 479020 485217 470119 474439
10934 474439 510133 518831 515360 514833 507118 487830 488515 518816 471236 441678 467214 455458 431464
10921 431464 445411 490746 523139 522221 552625 550893 541904 552988 583386 579077 550075 554458 532059
$$ packed form
11006E04851k8388J0828L2625K9381j6087J8493J0458j7568l0158j0852j3729
10995D89854L1301J5986m1500P912J7152k0812q115O624J785J930j8443j3608
10983D70066o93l1383J3058N1102K4200K0135M5555J0447q402J0688J9469R819
10971F34061r115L13j0155k3127l7004k2510k4326m6298m3213j8142L0615L3776
10959D64875O7514Q175n15l9534n8314j4432J1364j344L1744r846k8063r946J1594
10946D33272J0426J2023p436j7489j9148O9075O4236k4928m1011O197j5098M320
10934D74439L5694Q698l471n27p715j9288O85L0301m7580k9558K5536j1756k3994
10921D31464J3947M5335L2393r18L0404j732q989J1084L0398m309k9002M383k2399
$$ plain form
10908 532059 490581 497312 499957 457295 454836 503549 551104 575435 573555 566536 593856 629158
10896 629158 602514 598912 626601 639128 635568 620126 638790 619565 593558 543283 488829 480889
10884 480889 473297 464296 458691 473038 478964 473696 446479 418844 403723 410681 436165 445006 459891
10871 459891 480510 447832 401299 406865 412250 397344 415586 427958 426110 449092 456349 475512
10859 475512 438811 438715 393924 355663 361579 362030 384509 400461 402140 410476 404760 386676 383067
10846 383067 401738 423321 394531 371584 366321 389671 425786 428064 415573 421368 441545 443522
10834 443522 421782 444066 429914 416384 434941 450547 446932 471335 456618 467655 487075 446042
10822 446042 402939 421894 453948 478889 480123 437462 401549 438335 470650 473634 453972 441542
$$ packed form
10908E32059m1478O731K645m2662k459M8713M7555K4331j880p019K7320L5302
10896F29158k6644l602K7689J2527l560j5442J8664j9225k6007n0275n4454p940
10884D80889p592r001n605J4347N926n268k7217k7635j5121O958K5484Q841J4885
10871D59891K0619l2678m6533N566N385j4906J8242J2372j848K2982P257J9163
10859D75512l6701r6m4791l8261N916M51K2479J5952J679Q336n716j8084l609
10846C83067J8671K1583k8790k2947n263K3350L6115K278j2491N795K0177J977
10834D43522k1740K2284j4152j3530J8557J5606l615K4403j4717J1037J9420m1033
10822D46042m3103J8955L2054K4941J234m2661l5913L6786L2315K984j9662j2430
$$ plain form
10810 441542 428128 422973 404894 393004 378818 417640 461659 493811 499267 481343 435858 392323
10798 392323 378979 424703 454263 445753 460950 475385 464207 489628 535039 564382 548164 535530
10786 535530 512057 482292 483376 510841 486933 430126 404240 367386 373829 375463 352741 374075
10774 374075 420266 402509 397794 400364 427088 424178 407974 422083 433719 377284 338845 341296
10762 341296 368566 395093 421385 428019 438975 453891 462879 497582 506872 511802 592499 713282
10750 713282 790119 816715 776865 716443 666946 614418 567427 525123 502679 514801 502125
10739 502125 488717 510734 520382 522512 496854 474064 445113 466367 446162 474265 469002 469774
10727 469774 467780 491476 496673 529168 502720 492055 520938 530957 538604 537761 580058 620457
$$ packed form
10810D41542j3414n155j8079j1890j4186L8822M4019L2152N456j7924m5485m3535
10798C92323j3344M5724K9560q510J5197J4435j1178K5421M5411K9343j6218j2634
10786E35530k3473k9765J084K7465k3908n6807k5886l6854O443J634k2722K1334
10774C74075M6191j7757m715K570K6724k910j6204J4109J1636n6435l8439K451
10762C41296K7270K6527K6292O634J0956J4916Q988L4703R290M930Q0697J20783
10750G13282P6837K6596l9850o0422m9497n2528m6991m2304k2444J2122j2676
10739E02125j3408K2017R648K130k5658k2790k8951K1254k0205K8103n263P72
10727D69774j994K3696N197L2495k6448j0665K8883J0019P647q43M2297M0399
$$ plain form
10715 620457 653350 679357 722390 782092 898160 1089657 1351711 1781569 2523161 3675189
10705 3675189 4038549 3397364 2288182 1484752 1126942 900813 749787 661306 606738 565078
10695 565078 541142 513403 530072 538244 510065 461152 411510 371349 397791 387985 349428 339668
10683 339668 388886 398639 394401 413486 395821 367360 371710 358399 324274 360764 422417 450117
10671 450117 447458 424619 403024 375339 367765 391114 357587 370768 386771 404398 441786 459390
10659 459390 470863 421999 372756 396065 429074 434224 406830 387051 394806 372911 366018 385477
10647 385477 411963 414538 370255 356994 367903 391527 399983 445571 427784 377153 392167 406013
10635 406013 432689 424040 375504 378209 362922 340176 381783 422712 416966 396736 379062 395503
$$ packed form
10715F20457L2893K6007M3033N9702J16068J91497K62054M29858P41592J152028
10705C675189L63360o41185j109182q03430l57810k26129j51026q8481n4568m1660
10695E65078k3936k7739J6669Q172k8179m8913m9642m0161K6442r806l8557r760
10683C39668M9218R753m238J9085j7665k8461M350j3311l4125L6490O1653K7700
10671D50117k659k2839k1595k7685p574K3349l3527J3181J6003J7627L7388J7604
10659D59390J1473m8864m9243K3309L3009N150k7394j9779P755k1895o893J9459
10647C85477K6486K575m4283j3261J0909K3624Q456M5588j7787n0631J5014J3846
10635D06013K6676q649m8536K705j5287k2746M1607M0929n746k0230j7674J6441
$$ plain form
10623 395503 395653 357063 374448 385222 370149 398975 483889 544822 522409 504135 481180 475753
10611 475753 446560 394799 357142 376868 433330 429657 430008 463040 451216 437907 438855 413376
10599 413376 416870 465533 476164 432301 384345 336147 330207 340795 378979 377304 374639 361395
10587 361395 362830 397877 448156 467708 452695 445420 435298 417509 403067 383971 373733 406671
10575 406671 455679 484648 481427 432401 443980 450164 451946 473883 472050 462973 416001 375675
10563 375675 333871 357384 354416 282896 281872 340586 382629 380891 381524 363369 386285 374876
10551 374876 350864 365783 385523 427962 459590 447377 410928 429801 451844 453111 454983 458198
10539 458198 449028 423471 431408 487885 448906 427688 419656 386834 416848 440126 402693 382856
$$ packed form
10623C95503J50l8590J7385J0774j5073K8826Q4914O0933k2413j8274k2955n427
10611D75753k9193n1761l7657J9726N6462l673L51L3032j1824j3309R48k5479
10599D13376L494M8663J0631m3863m7956m8198n940J0588L8184j675k665j3244
10587C61395J435L5047N0279J9552j5013p275j0122j7789j4442j9096j0238L2938
10575D06671M9008K8969l221m9026J1579O184J782K1937j833r077m6972m0326
10563C75675m1804K3513k968p1520j024N8714M2043j738O33j8155K2916j1409
10551C74876k4012J4919J9740M2439L1628j2213l6449J8873K2043J267J872L215
10539D58198r170k5557P937N6477l8979k1218q032l2822L0014K3278l7433j9837
$$ plain form
10527 382856 395499 394404 395511 429979 412732 358766 346604 342222 351632 370078 386016 379978
10515 379978 391555 411469 399850 380675 385643 415051 380565 433419 479484 486276 463734 423891
10503 423891 438569 438921 425758 441111 480029 475519 438487 427071 423246 441102 425109 419048
10491 419048 414113 403381 429485 444140 445760 453200 503169 533787 510985 499005 475874 458671
10479 458671 465224 481209 485767 443159 399597 428516 484824 490737 468836 479642 497706 455561
10467 455561 437327 424394 428189 433405 441360 452357 466090 506799 508442 474221 463931 452363
10455 452363 461135 477655 528305 582421 653331 743422 815023 924284 1007666 1071021 1092724
10444 1092724 1063895 1045090 1057100 1022719 913119 809572 726476 646052 594988 526630 499689
$$ packed form
10527C82856J2643j095J107L4468j7247n3966j2162m382R410J8446J5938o038
10515C79978J1577J9914j1619j9175M968K9408l4486N2854M6065O792k2542l9843
10503D23891J4678L52j3163J5353L8918m510l7032j1416l825J7856j5993o061
10491D19048m935j0732K6104J4655J620P440M9969L0618k2802j1980k3131j7203
10479D58671O553J5985M558m2608m3562K8919N6308N913k1901J0806J8064m2145
10467D55561j8234j2933L795N216P955J0997J3733M0709J643l4221j0290j1568
10455D52363Q772J6520N0650N4116P0910R0091P1601J09261Q3382O3355K1703
10444A092724k8829j8805J2010l4381j09600j03547q3096q0424n1064o8358k6941
$$ plain form
10433 499689 530567 511007 512530 515304 485252 440694 450359 468330 462895 428584 410332 417146
10421 417146 378114 421610 453809 440027 437930 473280 459309 446472 467082 467088 410323 409403 400385
10408 400385 418217 441059 429514 433151 425825 431973 425396 421644 442209 408526 394994 410671
10396 410671 435922 414389 391723 404440 410144 423451 424789 396334 388850 421329 463061 457001
10384 457001 472492 473336 468992 435722 431984 412927 409375 420051 409819 406826 468432 473970 456809
10371 456809 424499 457930 486089 487740 481322 511297 534098 507183 486535 472150 418431 404553
10359 404553 412363 443661 492816 513552 517814 515616 537707 513067 470525 450475 426196 426628
10347 426628 411238 417004 458592 454776 453772 457295 471466 453589 437909 449423 432789 417570
$$ packed form
10433D99689L0878j9560J523K774l0052m4558R665J7971n435l4311j8252O814
10421D17146l9032M3496L2199j3782k097L5350j3971j2837K0610On6765r20r018
10408D00385J7832K2842j1545L637p326O148o577l752K0565l3683j3532J5677
10396D10671K5251k1533k2666J2717N704J3307J338k8455p484L2479M1732o060
10384D57001J5491Q44m344l3270l738j9057l552J0676j0232k993O1606N538j7161
10371D56809l2310L3431K8159J651o418K9975K2801k6915k0648j4385n3719j3878
10359D04553P810L1298M9155K0736M262k198K2091k4640m2542k0050k4279M32
10347D26628j5390N766M1588l816j004L523J4171j7877j5680J1514j6634j5219
$$ plain form
10335 417570 452315 448968 435158 462375 515795 524333 495089 491010 487534 475867 464445 470830
10323 470830 473994 463081 449271 456874 448528 452392 489186 532318 527748 571857 592514 573000
10311 573000 544024 524406 511720 477629 476864 488230 481887 480324 487514 475737 494932 508037
10299 508037 495941 496734 493598 460684 486288 473881 439091 422937 465940 474274 491844 521482
10287 521482 532563 515592 524128 565408 538087 518603 534687 541455 563619 555792 539527 512777
10275 512777 521617 541369 551527 554878 541948 542931 573723 592054 590297 563147 503559 509748 495167
10262 495167 493051 498322 486929 476048 505409 521028 513254 511909 516310 502162 543583 593636
10250 593636 550349 535692 515337 503112 489012 494967 463368 454373 508992 547181 556022 580539
$$ packed form
10335D17570L4745l347j3810K7217N3420Q538k9244m079l476j1667j1422O385
10323D70830L164j0913j3810P603q346L864L6794M3132m570M4109K0657j9514
10311E73000k8976j9618j2686l4091p65J1366o343j563P190j1777J9195J3105
10299E08037j2096P93l136l2914K5604j2407l4790j6154M3003Q334J7570K9638
10287E21482J1081j6971Q536M1280k7321j9484J6084O768K2164p827j6265k6750
10275E12777Q840J9752J0158L351j2930R83L0792J8331j757k7150n9588O189j4581
10262D95167k116N271j1393j0881K9361J5619p774j345M401j4148M1421N0053
10250E93636m3287j4657k0355j2225j4100N955l1599q995N4619L8189Q841K4517
$$ plain form
10238 580539 556645 537481 565122 572320 592271 617589 615068 608802 593541 601585 621924 636568
10226 636568 630428 628228 641897 618033 592541 543666 567695 589827 625721 683310 681457 706503
10214 706503 747959 781075 766561 772101 733786 732222 723788 700251 675985 695321 724860 759285
10202 759285 778405 755453 731420 734597 734136 719248 708798 694313 699416 698830 726067 702601 723136
10189 723136 742972 766999 808560 844616 835924 858917 905473 952731 924464 868305 844375 852939
10177 852939 818677 720084 645082 574236 513697 528506 550688 551662 561898 586251 639349 602749
10165 602749 582087 591814 578382 542519 551553 591999 596914 592463 570142 569259 575015 577217 574028
10152 574028 559587 553570 554199 573163 571104 561945 541959 509160 497100 509229 519770 503541
$$ packed form
10238E80539k3894j9164K7641P198J9951K5318k521o266j5261Q044K0339J4644
10226F36568o140k200J3669k3864k5492m8875K4029K2132L5894N7589j853K5046
10214G06503M1456L3116j4514N540l8315j564q434k3537k4266J9336K9539L4425
10202G59285J9120k2952k4033L177m61j4888j0450j4485N103n86K7237k3466K0535
10189G23136J9836K4027M1561L6056q692K2993M6556M7258k8267n6159k3930Q564
10177H52939l4262r8593p5002p0846o0539J4809K2182R74J0236K4353N3098l6600
10165F02749k0662R727j3432l5863R034M0446M915m451k2321q83N756K202l189
10152E74028j4441o017O29J8964k059r159j9986l2799j2060J2129J0541j6229
$$ plain form
10140 503541 471965 456721 488838 512094 508311 476457 516666 549132 534854 506915 507239 515028
10128 515028 505926 538230 564938 567514 584950 567703 500239 476386 506259 509587 572281 620652
10116 620652 581713 587450 547719 492041 483146 510974 526379 556119 573257 545036 561741 552132
10104 552132 561506 560032 568771 543239 536041 550525 567787 563212 561447 521056 509791 541286 545732
10091 545732 580963 608078 614360 622358 579858 544478 555117 595131 607601 598937 587466 589417
10079 589417 597567 616927 643659 621396 598184 599289 623144 638003 644405 633102 618043 621993
10067 621993 601396 607580 631350 607294 578148 571846 576342 605237 608825 593505 580481 626069
10055 626069 632322 632617 615698 606473 615801 628563 615107 590849 553902 554064 573425 621251 639288
$$ packed form
10140E03541l1576j5244L2117K3256l783l1854M0209L2466j4278k7939L24P789
10128E15028r102L2304K6708K576J7436j7247o7464k3853K9873L328O2694M8371
10116F20652l8939N737l9731n5678q895K7828J5405K9740J7138k8221J6705r609
10104E52132R374j474Q739k5532p198J4484J7262m575j765m0391j1265L1495M446
10091E45732L5231K7115O282P998m2500l5380J0639M0014J2470q664j1471J951
10079E89417Q150J9360K6732k2263k3212J105K3855J4859O402j1303j5059L950
10067F21993k0597O184K3770k4056k9146o302M496K8895L588j5320j3024M5588
10055F26069O253K95j6919r225R328J2762j3456k4258l6947J62J9361M7826J8037
$$ plain form
10042 639288 629167 606582 609761 615378 590760 633738 663339 677181 637615 589606 607523 580645
10030 580645 581074 602315 660754 713600 715596 730637 780549 877675 988113 1129040 1122434 966174
10018 966174 775665 700621 641557 617345 600860 595940 549712 530742 538910 545737 574707 576083
10006 576083 597308 597945 575738 562120 545937 546686 541586 580807 606517 580320 573415 573557 578225
9993 578225 586616 580250 542990 520238 523169 491791 481792 509736 528548 529191 556887 626674 651070
9980 651070 587670 558531 563593 542906 548729 572530 556611 585167 642616 671493 639129 632108
9968 632108 677737 733894 761479 745787 696776 622695 576978 545877 535198 540842 581540 585858
9956 585858 550504 557994 558083 531147 529268 524379 496685 475600 475418 523712 528584 517148 526141 568699
$$ packed form
10042F39288j0121k2585L179N617k4618M2978K9601J3842l9566m8009J7917k6878
10030E80645M29K1241N8439N2846J996J5041M9912R7126J10438J40927o606j56260
10018I66174j90509p5044n9064k4212j6485m920m6228j8970Q168O827K8970J376
10006E76083K1225O37k2207j3618j6183P49n100L9221K5710k6197o905J42M668
9993E78225Q391o366l7260k2752K931l1378r999K7944J8812O43K7696O9787K4396
9980F51070o3400k9139N062k0687N823K3801j5919K8556N7449K8877l2364p021
9968F32108M5629N6157K7585j5692m9011p4081m5717l1101j0679N644M0698M318
9956E85858l5354P490Q9k6936j879m889k7694k1085j82M8294M872j1436Q993M2558
$$ plain form
9942 568699 573886 550075 527681 560918 539561 519025 553386 567121 548875 570378 538075 542281
9930 542281 523682 483808 497824 511614 499297 513774 553260 548958 571399 591322 563999 541202
9918 541202 513149 508164 503818 490008 495289 536945 536940 509758 562399 609361 642519 629019 602279
9905 602279 596232 561496 548374 540688 591855 633196 597911 604688 602178 651637 654878 675937 643255
9892 643255 645729 676504 655461 648244 639755 681753 711718 692612 692124 702074 729023 786543 835952
9879 835952 922592 1003717 1134578 1421147 1968720 2578823 2703631 2300255 1687144 1202019
9869 1202019 940658 817718 763906 704693 629594 580254 572023 545407 500029 481842 464985
9858 464985 487658 497833 511993 516610 516176 531223 509718 527488 560327 573623 520865 477607
$$ packed form
9942E68699N187k3811k2394L3237k1357k0536L4361J3735j8246K1503l2303M206
9930E42281j8599l9874J4016J3790j2317J4477L9486m302K2441J9923k7323k2797
9918E41202k8053m985m346j3810N281M1656nk7182N2641M6962L3158j3500k6740
9905F02279o047l4736j3122p686N1167M1341l5285O777k510M9459L241K1059l2682
9892F43255K474L0775k1043p217q489M1998K9965j9106m88R950K6949N7520M9409
9879H35952Q6640Q1125J30861K86569N47573O10103J24808m03376o13111m85125
9869A202019k61361j22940n3812n9213p5099m9340q231k6616m5378j8187j6857
9858D64985K2673J0175J4160M617m34J5047k1505J7770L2839J3296n2758m3258
$$ plain form
9846 477607 474306 490058 508771 521300 535590 515757 481723 492210 486448 472055 473638 500805
9834 500805 542865 540066 543543 545835 544274 503330 499726 572488 586363 608119 617317 651849 727490
9821 727490 878919 1158196 1428683 1519862 1365813 1098229 869965 724766 631750 567609
9811 567609 546640 508546 475674 488002 449221 465182 507769 513108 490455 464211 441446 463211
9799 463211 477981 486989 523338 519329 464510 430711 415167 398970 416630 418309 413613 408713 393310
9786 393310 368461 355923 380570 408182 403534 378724 361515 411925 473205 439092 406235 425107
9774 425107 431362 395898 362088 359731 373784 394907 423574 430652 448882 478201 453264 409234
9762 409234 363864 342018 346131 364562 364345 395833 399767 386772 345455 351297 361898 348880 382161
$$ packed form
9846D77607l301J5752J8713J2529J4290j9833l4034J0487n762j4393J583K7167
9834E00805M2060k799L477K292j561m0944l604P2762J3875K1756R198L4532P5641
9821G27490J51429K79277K70487R1179j54049k67584k28264j45199r3016o4141
9811E67609k0969l8094l2872J2328l8781J5961M2587N339k2653k6244k2765K1765
9799D63211J4770R008L6349m009n4819l3799j5544j6197J7660J679m696m900j5403
9786C93310k4849j2538K4647K7612m648k4810j7209N0410O1280l4113l2857J8872
9774D25107O255l5464l3810k357J4053K1123K8667P078J8230K9319k4937m4030
9762D09234m5370k1846M113J8431k17L1488L934j2995m1317N842J0601j3018L3281
$$ plain form
9749 382161 418337 417855 410019 445932 400738 320857 323210 344820 368523 372769 340818 339199 341806
9736 341806 350547 336309 330753 283771 292349 282598 273205 284991 285633 278734 289301 310700 305164
9723 305164 324917 331327 344070 324679 300834 295881 253598 256891 231792 285103 299135 295448
9711 295448 298392 287248 261443 246019 274699 301177 293108 277099 265590 265403 275329 251893 257860
9698 257860 265090 272029 287002 317099 286976 251787 252311 213781 221777 203494 210266 256730 318312
9685 318312 326383 319849 296613 310960 332313 303972 307264 296872 268481 265337 266790 259560 252586
9672 252586 244283 256740 261699 267240 288067 322967 274424 237065 258089 257170 235682 268151 291640
9659 291640 269340 237441 242652 215725 195102 190649 200958 206498 208601 278861 305258 281091
$$ packed form
9749C82161L6176m82p836L5913m5194p9881K353K1610K3703M246l1951j619K607
9736C41806Q741j4238n556m6982Q578r751r393J1786O42o899J0567K1399n536
9723C05164J9753O410J2743j9391k3845m953m2283L293k5099N3311J4032l687
9711B95448K944j1144k5805j5424K8680K6478q069j6009j1509j87R926k3436N967
9698B57860P230O939J4973L0097l0123l5189N24l8530P996j8283O772M6464O1582
9685C18312Q071o534k3236J4347K1353k8341L292j0392k8391l144J453p230o974
9672B52586q303J2457M959N541K0827L4900m8543l7359K1024r19k1488L2469K3489
9659B91640k2300l1899N211k6927k0623m453J0309N540K103P0260K6397k4167
$$ plain form
9647 281091 247753 248877 261836 256832 278275 244789 222783 215613 225966 247650 237815 222238
9635 222238 231787 229640 229628 244687 235582 219525 216126 188411 181876 237290 247618 255052 247720 245173
9621 245173 235866 249359 244047 226707 235574 253650 210795 212408 232834 227660 225692 202433 175241
9608 175241 196056 219396 223208 213322 211810 212711 239015 268412 244628 255588 249575 199720 226870
9595 226870 227033 208135 199077 208327 207575 205319 178960 157828 149382 144961 173666 211378 179713
9582 179713 129043 119412 147690 147526 184736 181353 213935 268034 282173 239850 226279 218520 193824
9569 193824 169914 181525 214465 226467 195906 190175 189577 190989 184007 217730 210587 188743 209698
9556 209698 201493 162375 203148 225193 207409 219024 198086 181323 184613 174633 202847 191488
$$ packed form
9647B81091l3338J124J2959n004K1443l3486k2006p170J0353K1684r835j5577
9635B22238R549k147j2J5059r105j6057l399k7715o535N5414J0328P434p332k547
9621B45173r307J3493n312j7340Q867J8076m2855J613K0426n174j968k3259k7192
9608A75241K0815K3340L812r886j512R01K6304K9397k3784J0960o013m9855K7150
9595B26870J63j8898r058R250p52k256k6359k1132q446m421K8705L7712l1665
9582A79713n0670r631K8278j64L7210l383L2582N4099J4139m2323j3571p759k4696
9569A93824k3910J1611L2940J2002l0561n731n98J412o982L3723p143k1844K0955
9556B09698q205l9118M0773K2045j7784J1615k0938j6763L290r980K8214j1359
$$ plain form
9544 191488 191288 186674 200413 182496 166725 114412 156950 207854 209420 212966 225949 230101 217310
9531 217310 186414 153652 163417 153945 140359 165387 181022 207923 185283 163050 165270 151702
9519 151702 167873 192275 194923 184671 182808 190042 202890 173186 145230 156649 154413 153176 117527
9506 117527 98189 108003 139552 121631 91039 101717 136463 125416 114275 140568 143379 148956
9494 148956 134296 135327 125433 119397 139268 124237 126791 115060 123033 110546 101983 100076 120225
9481 120225 130589 150050 163436 149805 116195 113596 140124 192280 213649 206184 237651 227841
9469 227841 194336 167639 172190 189871 181586 194391 218342 161601 104417 99194 110372 126310
9457 126310 147443 129741 118438 124776 109323 75620 99198 108236 84932 51792 41480 54568
$$ packed form
9544A91488k00m614J3739j7917j5771n2313M2538N0904J566L546J2983M152j2791
9531B17310l0896l2762R765r472j3586K5028J5635K6901k2640k2233K220j3568
9519A51702J6171K4402K648j0252j863P234J2848k9704k7956J1419k236j237l5649
9506A17527j9338R814L1549j7921l0592J0678L4746j1047j1141K6293K811N577
9494A48956j4660J031r894o036J9871j5031K554j1731P973j2487q563j907K0149
9481A20225J0364J9461J3386j3631l3610k599K6528N2156K1369p465L1467r810
9469B27841l3505k6697M551J7681q285J2805K3951n6741n7184n223J1178J5938
9457A26310K1133j7702j1303O338j5453l3703K3578R038k3304l3140j0312J3088
$$ plain form
9445 54568 83055 94691 78374 109116 104441 111025 110591 86991 76571 79408 140459 151264 145659
9432 145659 109012 107900 102805 86499 91067 76942 54773 60172 99204 103453 54320 58660 51718
9419 51718 84768 103640 91983 59653 10029 -4216 -25446 -11236 19870 40457 39850 30758
9407 30758 28222 61782 94013 144951 164522 176539 164946 210179 194145 168452 187876 192314
9395 192314 162877 105523 86239 83906 82288 60107 80801 82378 86960 86765 92376 70526 77351
9382 77351 58022 38329 58471 57234 28150 27181 34872 71444 70040 57009 105714 106723 78034
9369 78034 53033 75190 46207 32186 47993 80905 132002 119306 88312 71738 39948 32213
9357 32213 48741 45131 58282 74899 93971 118481 116041 52399 14518 9384 18533 3553 20902
$$ packed form
9445E4568K8487J1636j6317L0742m675O584m34k3600j0420K837O1051J0805n605
9432A45659l6647j112n095j6306M568j4125k2169N399L9032M249m9133M340o942
9419E1718L3050J8872j1657l2330m9624j4245k1230J4210L1106K0587o07r092
9407C0758k536L3560L2231N0938J9571J2017j1593M5233j6034k5693J9424M438
9395A92314k9437n7354j9284k333j618k2181K0694J577M582j95N611k1850O825
9382G7351j9329j9693K0142j237k9084r69P691L6572j404j3031M8705J009k8689
9369G8034k5001K2157k8983j4021J5807L2912N1097j2696l0994j6574l1790p735
9357C2213J6528l610J3151J6617J9072K4510k440o3642l7881n134R149j4980J7349
$$ plain form
9344 20902 57719 45678 56391 84765 89830 41225 51036 67279 66060 107865 108377 114108 103371
9331 103371 87306 76538 83526 90402 108219 110924 82043 72699 72962 92279 40520 14457 10262
9318 10262 39011 51123 73724 89441 70722 50008 41381 66298 56761 70467 80192 80238 101407
9305 101407 91596 68047 33554 57478 118766 148672 161499 171695 160160 115513 78903 59018
9293 59018 68289 65165 58357 91066 76430 64389 45043 58665 112167 95768 55997 49472 62615
9280 62615 60414 61504 58252 31066 35058 36689 59292 90721 92466 96562 143793 127033 113092
9267 113092 161342 212326 244071 318885 414382 503501 582003 637283 672118 635082 504279
9256 504279 391458 344966 291015 255806 268902 285459 268527 291582 341980 419704 477439
$$ packed form
9344B0902L6817j2041J0713K8374N065m8605R811J6243j219M1805N12N731j0737
9331A03371j6065j0768O988O876J7817K705k8881r344K63J9317n1759k6063m195
9318A0262K8749J2112K2601J5717j8719k0714q627K4917r537J3706R725M6K1169
9305A01407r811k3549l4493K3924O1288K9906J2827J0196j1535m4647l6610j9885
9293E9018R271l124o808L2709j4636j2041j9346J3622N3502j6399l9771o525J3143
9280F2615k201J090l252k7186L992J631K2603L1429J745M096M7231j6760j3941
9267A13092M8250N0984L1745P4814R5497Q9119P8502N5280L4835l7036j30803
9256E04279j12821m6492n3951l5209J3096J6557j6932K3055N0398P7724N7735
$$ plain form
9245 477439 553922 583415 587626 573059 565014 514021 479614 495730 454830 424829 413309 412622
9233 412622 389075 410572 440287 464338 561931 622576 671201 825458 1026099 1242041 1378092
9222 1378092 1349896 1191147 957197 748512 587960 465704 392103 352709 337802 353449
9212 353449 357425 340115 311020 326503 366800 367787 371730 429213 477635 482195 435036 375757 340887
9199 340887 252250 188666 148143 134321 162205 177055 206597 216901 242482 316504 394684 472561
9187 472561 537522 519334 482570 415089 313693 199183 155558 124613 99870 79892 15741
9176 15741 -3318 10127 7998 38364 48374 16860 -5453 5793 25859 61506 83583 72208
9164 72208 47590 -2912 19605 9830 -37432 -30744 10558 450 -1882 -15044 -8675 -7094 22417
$$ packed form
9245D77439P6483K9493M211j4567q045n0993l4407J6116m0900l0001j1520o87
9233D12622k3547K1497K9715K4051R7593O0645M8625J54257K00641K15942J36051
9222A378092k8196j58749k33950k08685j60552j22256p3601l9394j4907J5647
9212C53449L976j7310k9095J5483M0297R87L943N7483M8422M560m7159n9279l4870
9199C40887q8637o3584m0523j3822K7884J4850K9542J0304K5581P4022P8180P7877
9187D72561O4961j8188l6764o7481j01396j14510m3625l0945k4743j9978o4151
9176A5741j9059J3445k129L0366J0010l1514k2313J1246K0066L5647K2077j1375
9164G2208k4618n0502K2517r775m7262O688M1302j0108k332j3162O369J581K9511
$$ plain form
9151 22417 45774 52548 34992 27538 34891 7736 -63735 -71810 2437 11193 23230 11152 -46845
9138 -46845 -83258 -41992 17782 15329 -20272 -57971 -86398 -46993 -16243 10107 -16433 -27695
9126 -27695 -23761 -29270 -34782 -38660 -24184 -5123 7381 -21533 -58224 -46715 -66262 -74236 -48050
9113 -48050 -66060 -86114 -71084 -6591 54423 51050 -23154 -46331 -69807 -83676 -82758 -63166
9101 -63166 -32342 15476 27488 35896 14302 -57408 -87299 -87333 -69688 -43213 -39076 9432 27779
9088 27779 7786 -18597 -33164 -41007 -85242 -110229 -70684 -79830 -66462 -44735 -49267 -58777 -55531
9075 -55531 -62191 -29150 -37899 -22417 10867 -5401 -32595 -25242 -46380 -28848 -23077 -41230 -65862
9062 -65862 -74381 -73469 -82022 -39481 -28926 -4270 -9046 -37063 -33735 -26947 8089 25973 44594
$$ packed form
9151B2417K3357O774j7556p454P353k7155p1471q075P4247Q756J2037j2078n7997
9138d6845l6413M1266N9774k453l5601l7699k8427L9405L0750K6350k6540j1262
9126b7695L934n509n512l878J4476J9061J2504k8914l6691J1509j9547p974K6186
9113d8050j8010k0054J5030O4493O1014l373p4204k3177k3476j3869R18J9592
9101f3166L0824M7818J2012Q408k1594p1710k9891l4J7645K6475M137M8508J8347
9088B7779j9993k6383j4567p843m4235k4987L9545r146J3368K1727m532r510L246
9075e5531o660L3041q749J5482L3284j6268k7194P353k1138J7532N771j8153k4632
9062f5862q519R12q553M2541J0555K4656m776k8017L328O788L5036J7884J8621
$$ plain form
9049 44594 38357 -13594 -43952 -16569 11807 -20517 -36944 8262 -24784 -42541 -33913 19496
9037 19496 -25337 -56359 -78063 -81710 -60633 -53437 -58980 -56850 -69299 -77139 -125924 -117819 -44578
9024 -44578 -14401 -5598 -15578 -42573 -45655 -53698 -57081 -21662 -2629 20184 -24861 -48868 -46388
9011 -46388 -28139 -27649 -43048 -30993 -35430 2939 23373 29044 20448 -28712 -38037 -6653 11622
8998 11622 2289 -6627 -19441 1624 35754 64170 43534 -6639 -11378 -28589 -57857 -54585 -14114
8985 -14114 23533 37424 8311 -27530 -41516 -52578 -64787 -92526 -95510 -34559 -5117 -24931
8973 -24931 -58794 -69332 -70112 -62378 -66408 -61221 -55348 -77702 -64092 -49312 -63801 -82078 -83468
8960 -83468 -88342 -40491 -51890 -59292 -58254 -53306 -64218 -35727 -29938 -61542 -82398 -58665 -68341
$$ packed form
9049D4594o237n1951l0358K7383K8376l2324j6427M5206l3046j7757Q628N3409
9037A9496m4833l1022k1704l647K1077P196n543K130j2449p840m8785Q105P3241
9024d4578L0177Q803r980k6995l082q043l383L5419J9033K2813m5045k4007K480
9011d6388J8249M90j5399J2055m437L8369K0434N671q596m9160r325L1384J8275
8998A1622r333q916j2814K1065L4130K8416k0636n0173m739j7211k9268L272M0471
8985a4114L7647J3891k9113l5841j3986j1062j2209k7739k984O0951K9442j9814
8973b4931l3863j0538p80P734m030N187N873k2354J3610J4780j4489j8277j390
8960h3468m874M7851j1399p402J038M948j0912K8491N789l1604k0856K3733r676
$$ plain form
8947 -68341 -40112 -33858 -10954 34531 19910 11921 29115 36356 17780 24365 33069 33097 16939
8934 16939 47167 24986 -30190 -47260 -59089 -44832 -69652 -73939 -53391 -96792 -91220 -54409
8922 -54409 -52190 -85835 -56273 -86767 -94887 -71279 -64934 -27599 -41268 -64105 -65746 -20342 18347
8909 18347 58413 36129 28187 -19480 -54942 -51525 -30257 -35289 -87597 -61243 -19669 1737
8897 1737 -4998 -25067 -36346 -34820 -22083 -48251 -6655 22526 23284 13676 16682 12108 -19046
8884 -19046 -43145 -29107 7443 40925 22713 54612 29160 24083 43560 28874 29767 5692
8872 5692 26300 46779 34971 38609 34380 37425 48628 119898 189271 222540 250716 281110 335538
8859 335538 339903 350879 391413 501349 655179 866337 1221489 1802278 2633768 3344061
$$ packed form
8947f8341K8229O254K2904M5485j4621p989J7194P241j8576O585Q704K8j6158
8934A6939L0228k2181n5176j7070j1829J4257k4820m287K0548m3401N572L6811
8922e4409K219l3645K9562l0494q120K3608O345L7335j3669k2837j641M5404L8689
8909A8347M0066k2284p942m7667l5462L417K1268n032n2308K6354M1574K1406
8897A737o735k0069j1279J526J2737k6168M1596K9181P58r608L006m574l1154
8884a9046k4099J4038L6550L3482j8212L1899k5452n077J9477j4686Q93k4075
8872E692K0608K0479j1808L638m229L045J1203P1270O9373L3269K8176L0394N4428
8859C35538M365J0976M0534J09936J53830K11158L55152N80789Q31490P10293
$$ plain form
8849 3344061 3370385 2736296 1890708 1248339 854751 595458 423253 302239 212933 167919
8839 167919 161345 105540 52260 68403 86593 42264 40886 56603 22930 -22667 -20006 -32749
8827 -32749 -59654 -102442 -117515 -114314 -80477 -110759 -92856 -54015 -40134 -59197 -74069 -86634
8815 -86634 -71730 -52284 -46421 -45900 -45801 -9233 -24591 -76303 -76366 -46517 -35579 -20569 -18846 -9302
8801 -9302 9263 20103 -2579 -55630 -105856 -107832 -121203 -113662 -82488 -101241 -128547 -87469
8789 -87469 -23051 -19306 -61584 -33532 -14350 -63640 -101405 -115787 -123227 -87322 -83003 -87398 -80615
8776 -80615 -92000 -129269 -129570 -95651 -55515 -37947 -65037 -72001 -71742 -52795 -42010 -42439 -49608
8763 -49608 -40233 -24748 -9640 -39815 -76650 -115112 -80069 -74320 -75486 -87973 -90167 -70393 -83541
$$ packed form
8849C344061K6324o34089q45588o42369l93588k59293j72205j21014q9306m5014
8839A67919o574n5805n3280J6143J8190m4329j378J5717l3673m5597K661j2743
8827c2749k6905m2788j5073L201L3837l0282J7903L8841J3881j9063j4872j2565
8815h6634J4904J9446N863N21R9L6568j5358n1712o3K9849J0938J5010J723R544
8801i302J8565J0840k2682n3051n0226j976j3371P541L1174j8753k7306M1078
8789h7469O4418L745m2278K8052J9182m9290l7765j4382p440L5905M319m395O783
8776h0615j1385l7269l01L3919M0136J7568k7090o964K59J8947J0785m29p169
8763d9608R375J5485J5108l0175l6835l8462L5043N749j166j2487k194J9774j3148
$$ plain form
8750 -83541 -117594 -123475 -58109 -36067 -59275 -48778 -17660 7807 -28857 -95468 -103541 -52737
8738 -52737 -35761 -26125 -47604 -67088 -79878 -35577 -34536 -30894 -17072 -25003 -29110 -19843 -40888
8725 -40888 -114083 -148734 -115154 -87906 -70741 -73131 -61239 -55910 -42816 -84834 -97534 -103010
8713 -103010 -123887 -159772 -178659 -157778 -139413 -92708 -85940 -79572 -76013 -42180 -1316 -41898
8701 -41898 -48986 -70095 -80693 -106480 -126660 -127227 -117054 -108300 -90582 -66032 -39395 -49338 -50331
8688 -50331 -56826 -65737 -83848 -56041 -41103 -15050 -55536 -79072 -96628 -80690 -70773 -63757 -59866
8675 -59866 -74147 -94439 -86535 -84221 -67784 -49602 -47357 -53948 -82120 -79707 -47471 -37460 -19038
8662 -19038 -27110 -49552 -59203 -38462 -49650 -46604 -87252 -66941 -68306 -65072 -55504 -40343 -32181
$$ packed form
8750h3541l4053n881O5366K2042k3208J0497L1118K5467l6664o6611q073N0804
8738e2737J6976R636k1479j9484j2790M4301J041L642J3822p931m107R267k1045
8725d0888p3195l4651L3580K7248J7165k390J1892N329J3094m2018j2700n476
8713a03010k0877l5885j8887K0881J8365M6705O768O368L559L3833M0864m0582
8701d1898p088k1109j0598k5787k0180n67J0173Q754J7718K4550K6637r943r93
8688e0331o495q911j8111K7807J4938K6053m0486k3536j7556J5938R917P016L891
8675e9866j4281k0292P904K314J6437J8182K245o591k8172K413L2236J0011J8422
8662a9038q072k2442r651K0741j1188L046m0648K0311j365L234R568J5161Q162
$$ plain form
8649 -32181 -27880 6742 35326 19414 -28592 -67625 -93157 -82157 -60816 -99882 -134341 -167921
8637 -167921 -157899 -112789 -121709 -102921 -42385 -31848 -18767 -3695 -46632 -58587 -36132 -49678
8625 -49678 -109542 -119413 -64458 -62739 -64302 5841 76589 151994 245715 287254 259111 157873
8613 157873 85187 68268 35326 1195 15619 8215 35834 34051 6703 25462 -1365 -29711
8601 -29711 -53146 -45247 -29880 15905 58939 57573 37845 27252 23040 11410 -17659 -14779 -11891
8588 -11891 -13857 -11594 -4708 25622 59282 42731 21479 -8174 32933 90752 103690 119405
8576 119405 151663 219983 278595 360264 520039 605781 547022 429364 321563 199564 112469
8565 112469 61431 39275 7393 19064 4211 22301 61365 98841 87384 43874 -42544 -47075
$$ packed form
8649c2181M301L4622K8584j5912m8006l9033k5532J1000K1341l9066l4459l3580
8637a67921J0022M5110q920J8788O0536J0537J3081J5072m2937j1955K2455j3546
8625d9678n9864r871N4955J719j563P0143P0748P5405R3721M1539k8143j01238
8613A57873p2686j6919l2942l4131J4424p404K7619j783k7348J8759k6827k8346
8601b9711k3435P899J5367M5785M3034j366j9728j0593m212j1630k9069K880K888
8588a1891j966K263O886L0330L3660j6551k1252k9653M1107N7819J2938J5715
8576A19405L2258O8320N8612Q1669J59775Q5742n8759j17658j07801j21999q7095
8565A12469n1038k2156l1882J1671j4853J8090L9064L7476j1457m3510q6418m531
$$ plain form
8553 -47075 -43269 1715 1372 -7179 -2126 -1020 13694 16221 27980 32769 11280 1131 20391
$$ packed form
8553d7075L806M4984l43q551N053J106J4714K527J1759M789k1489j0149J9260
$$ [...]
##END NTUPLES=NMR SPECTRUM
##END=
