##TITLE=Analysis number 316989
Compound Code cc 38413
Book Reference 438/84/2
Project Code adrs
Chemist Name antons
##JCAMPDX= 6.0         $$ Bruker NMR JCAMP-DX V2.0
##DATA TYPE= NMR SPECTRUM
##DATA CLASS= NTUPLES
##ORIGIN= Bruker BioSpin GmbH
##OWNER= nmr
$$ XWIN-NMR		Version 3.5
$$ Thu Feb  2 13:37:55 2006 GMT Standard Time (UT+0h)  MAYBRIDGE\nmr@NMR_250MHZ
##.OBSERVE FREQUENCY= 250.131544655141
##.OBSERVE NUCLEUS= ^1H
##.ACQUISITION MODE= SIMULTANEOUS (DQD)
##.ACQUISITION SCHEME= undefined
##.AVERAGES= 16
##.DIGITISER RES= 18
##SPECTROMETER/DATA SYSTEM= dpx250
##.PULSE SEQUENCE= zg30
##.SOLVENT NAME= CDCl3
##.SHIFT REFERENCE= (INTERNAL, CDCl3, 0, 16.522)
##AUDIT TRAIL= $$ (NUMBER, WHEN, WHO, WHERE, WHAT)
$$ ##TITLE= Audit trail, XWIN-NMR		Version 3.5
$$ ##JCAMPDX= 5.01
$$ ##ORIGIN= Bruker BioSpin GmbH
$$ ##OWNER= nmr
$$ C:\u/data/dgb/nmr/ADRS/15550/pdata/1/auditp.txt
$$ ##AUDIT TRAIL=  $$ (NUMBER, WHEN, WHO, WHERE, WHAT)
(   1,<2006-02-02 13:37:28.19 +000>,<MAYBRIDGE\nmr>,<NMR_250MHZ>,
      <created by zg, POWCHK disabled, PULCHK disabled
       configuration hash MD5:
       84 BC 41 DB A1 6E 1D 46 DA 25 12 A5 C1 ED C5 3A
       data hash MD5: 64K
       A0 B8 66 B2 13 0E AE B8 50 E4 A5 3C 2C 82 B5 1C>)
(   2,<2006-02-02 13:37:44.34 +000>,<MAYBRIDGE\nmr>,<NMR_250MHZ>,
      <Start of raw data processing
       ef LB = 0.3 FT_mod = 6 PKNL = 1 SI = 32K 
       data hash MD5: 32K
       E4 98 FD F5 8D 4E 3E 7A FE BD 1D 2D E4 7E CF E6>)
(   3,<2006-02-02 13:37:46.56 +000>,<MAYBRIDGE\nmr>,<NMR_250MHZ>,
      <apk 
       data hash MD5: 32K
       DC B1 A6 92 65 F9 19 26 FB 8A 89 2D 89 37 88 64>)
(   4,<2006-02-02 13:37:47.48 +000>,<MAYBRIDGE\nmr>,<NMR_250MHZ>,
      <abs ABSG = 5 
       data hash MD5: 32K
       4A 60 34 29 F7 78 8F 40 9F 8A EC 1F 38 96 7F 3A>)
$$ ##END=
$$ 
$$ hash MD5
$$ E0 B1 BB 25 50 B5 B8 18 03 17 7F 64 81 91 DA 60
##$RELAX= 
##$RELAX= 
##$RELAX= 
##$RELAX= 
##$RELAX= 
##$RELAX= 
##$RELAX= 
$$ Bruker specific parameters
$$ --------------------------
##$DU= <C:\u>
##$EXPNO= 15550
##$NAME= <ADRS>
##$PROCNO= 1
##$TYPE= <nmr>
##$USER= <dgb>
##$AMP= (0..31)
100 100 100 100 100 100 100 100 100 100 100 100 100 100 100 100 100 100 
100 100 100 100 100 100 100 100 100 100 100 100 100 100 
##$AQSEQ= 0
##$AQ_mod= 3
##$AUNM= <au_zg>
##$AUTOPOS= <23 >
##$BF1= 250.13
##$BF2= 250.13
##$BF3= 250.13
##$BF4= 250.13
##$BF5= 500.13
##$BF6= 500.13
##$BF7= 500.13
##$BF8= 500.13
##$BYTORDA= 1
##$CFDGTYP= 0
##$CFRGTYP= 5
##$CHEMSTR= <none>
##$CNST= (0..31)
1 1 145 1 1 1 1 1 1 1 1 1 1 1 1 1 1 1 1 1 1 1 1 1 1 1 1 1 1 1 1 1 
##$CPDPRG= <>
##$CPDPRG1= <>
##$CPDPRG2= <>
##$CPDPRG3= <>
##$CPDPRG4= <mlev>
##$CPDPRG5= <mlev>
##$CPDPRG6= <mlev>
##$CPDPRG7= <mlev>
##$CPDPRG8= <mlev>
##$CPDPRGB= <>
##$CPDPRGT= <>
##$D= (0..31)
0 1 0 0 0 0 0 0 0 0.06 0 0 0 0 0 0 0.0002 0 0 0 0 0 0 0 0 0 0 0 0 0 0 
0 
##$DATE= 1138887446
##$DBL= (0..7)
120 120 120 120 120 120 120 120 
##$DBP= (0..7)
150 150 150 150 150 150 150 150 
##$DBP07= 0
##$DBPNAM0= <>
##$DBPNAM1= <>
$$ [...]
##$SUBNAM7= <"">
##$SUBNAM8= <"">
##$SUBNAM9= <"">
##$SW= 20.6930455092707
##$SWIBOX= (0..15)
0 0 3 0 0 0 0 0 0 0 0 0 0 0 0 0 
##$SW_h= 5175.983436853
##$TD= 65536
##$TD0= 1
##$TE= 293.16
##$TE2= 300
##$TE3= 300
##$TEG= 300
##$TL= (0..7)
0 120 120 120 120 120 120 120 
##$TP= (0..7)
150 150 150 150 150 150 150 150 
##$TP07= 0
##$TPNAME0= <>
##$TPNAME1= <>
##$TPNAME2= <>
##$TPNAME3= <>
##$TPNAME4= <>
##$TPNAME5= <>
##$TPNAME6= <>
##$TPNAME7= <>
##$TPOAL= (0..7)
0.5 0.5 0.5 0.5 0.5 0.5 0.5 0.5 
##$TPOFFS= (0..7)
0 0 0 0 0 0 0 0 
##$TUNHIN= 0
##$TUNHOUT= 0
##$TUNXOUT= 0
##$USERA1= <user>
##$USERA2= <user>
##$USERA3= <user>
##$USERA4= <user>
##$USERA5= <user>
##$V9= 5
##$VALIST= <valist>
##$VCLIST= <CCCCCCCCCCCCCCC>
##$VD= 0
##$VDLIST= <DDDDDDDDDDDDDDD>
##$VPLIST= <PPPPPPPPPPPPPPP>
##$VTLIST= <TTTTTTTTTTTTTTT>
##$WBST= 1024
##$WBSW= 4
##$XGAIN= (0..3)
0 0 0 0 
##$XL= 0
##$YL= 0
##$YMAX_a= 491586
##$YMIN_a= -369979
##$ZGOPTNS= <>
##$ZL1= 120
##$ZL2= 120
##$ZL3= 120
##$ZL4= 120
##$ABSF1= 16.522
##$ABSF2= -4.171173
##$ABSG= 5
##$ABSL= 3
##$ALPHA= 0
##$AQORDER= 0
##$ASSFAC= 0
##$ASSFACI= 0
##$ASSFACX= 0
##$ASSWID= 0
##$AUNMP= <proc_1d>
##$AZFE= 0.1
##$AZFW= 0.1
##$BCFW= 0
##$BC_mod= 0
##$BYTORDP= 0
##$COROFFS= 0
##$CY= 12.5
##$DATMOD= 1
##$DC= 0
##$DFILT= <>
##$DTYPP= 0
##$F1P= 14.0000005364418
##$F2P= -0.99999901652339
##$FCOR= 0.5
##$FTSIZE= 32768
##$FT_mod= 6
##$GAMMA= 0
##$GB= 0
##$INTBC= 1
##$INTSCL= 1
##$ISEN= 128
##$LB= 0.3
##$LEV0= 0
##$LPBIN= 0
##$MAXI= 10000
##$MC2= 0
##$MEAN= 0
##$ME_mod= 0
##$MI= 0
##$NCOEF= 0
##$NC_proc= -4
##$NLEV= 6
##$NOISF1= 0
##$NOISF2= 0
##$NSP= 0
##$NTH_PI= 0
##$NZP= 0
##$OFFSET= 16.522
##$PC= 1
##$PHC0= -55.06077
##$PHC1= 6.083216
##$PH_mod= 1
##$PKNL= yes
##$PPARMOD= 0
##$PSCAL= 4
##$PSIGN= 0
##$REVERSE= no
##$SF= 250.13
##$SI= 32768
##$SIGF1= 0
##$SIGF2= 0
##$SINO= 400
##$SIOLD= 32768
##$SREGLST= <1H.CDCl3>
##$SSB= 0
##$STSI= 32768
##$STSR= 0
##$SW_p= 5175.98343685301
##$SYMM= 0
##$S_DEV= 0
##$TDeff= 65536
##$TDoff= 0
##$TI= <Analysis number 999999
Compound Code 99
Book Reference 9
Project Code 9>
##$TILT= no
##$TM1= 0
##$TM2= 0
##$TOPLEV= 0
##$USERP1= <user>
##$USERP2= <user>
##$USERP3= <user>
##$USERP4= <user>
##$USERP5= <user>
##$WDW= 1
##$XDIM= 32768
##$YMAX_p= 540732705
##$YMIN_p= -368394
$$ End of Bruker specific parameters
$$ ---------------------------------
##NTUPLES= NMR SPECTRUM
##VAR_NAME=  FREQUENCY,     SPECTRUM/REAL,   SPECTRUM/IMAG
##SYMBOL=    X,             R,               I
##VAR_TYPE=  INDEPENDENT,   DEPENDENT,       DEPENDENT
##VAR_FORM=  AFFN,          ASDF,            ASDF
##VAR_DIM=   32768,         32768,           32768
##UNITS=     HZ,            ARBITRARY UNITS, ARBITRARY UNITS
##FACTOR=    0.157963299565203, 1,           1
##FIRST=     4132.6476996994, 0,             0
##LAST=      -1043.33573715361, 0,           0
##MIN=       -1043.33573715361, -368394,     0
##MAX=       4132.6476996994, 540732705,     0
$$ Real data points
##PAGE= N=1
##DATA TABLE= (X++(R..R)), XYDATA
$$ [...]
15382a4894O282M918L681K824k566q016n048Q371n648L506K969k429j821k863
15368a0734R07N8m577P259M708l655o923l184m784k73n8m712r63K973J2308J867
15352i783m378M20K450k199j910O115j759m285k932J003J620P325P357p27k457
15337d140p328k309L308J846p11J965N151j834n730J472N998o472p871l992J167
15322a9480M035k884P030L92j402K865Q40n28m248M907J0156j956p852n608J591
15307a2142K165L198J082q823j40o00k849L801J1427L038l915L043N83j88n112
15292e432l459J391O414o098n046P591M035k526K338j250m291P54M37q08M723
15277a227m523j1649m689J0415P771L67p544m686K688j855L699J2570J914o888
$$ y = [-14894, -8612, -3694, -13, 2811, 245, -7771, -12819, -4448, -10096, -6590, -3621, -6050, -7871, -10734, -9827, -9769, -14346, -7087, -2379, -6034, -12957, -16141, -20925, -21198, -21256, -25968, -26931, -23958, -11650, -9783, -14161, -13741, -11291, -13490, -15400, -9285, -11044, -15329, -18261, -17258, -15638, -8313, -956, -1683, -4140, -11468, -13777, -10469, -8623, -9334, -7369, -2218, -4052, -9782, -8310, -2312, -8784, -16655, -20647, -19480, -15445, -18329, -11299, -10907, -12309, -9444, -8604, -9132, -13380, -8473, 1683, -273, -8125, -13733, -12142, -9977, -6779, -5697, -14520, -14660, -15260, -18109, -14308, -2881, 157, -3758, -715, -132, -320, -5432, -8891, -7500, -1086, -7184, -12230, -4639, -604, -3130, -792, -2042, -6333, -5579, -5142, -5950, -1227, -5750, -17399, -22088, -11673, -3902, -3535, -11079, -15765, -13077, -14932, -11233, 1337, 3251, -3637]
15263c637K727M702n876J203m508q0p218n260k24k183N333P361j0j5841l627j232
15247b8370m925K984N016L987L650N883J454q24p656m730K0o72O704L579J653
15232a2247k177r699L057P781J4333L891j0939n423J009m180l35P718J917n776
15218a1070k597N621k868J618K473N291O244L31l705j2986n211J589K993J1781
15204d96P173O981q35n675J377r189q187n461J421Q649K951m753K139M757l506
15189b654r010K318N524O273m338k396k406m289r63P84L042p02j512Q31k582J432
15173a0648O003O607n664p706l637J875J1756k01j8054n677P770K134Q695K149
15159d598l456L928o180k949P895m853l405L084O16L996m737n606K220M256j494
$$ y = [-3637, -910, 3792, -2084, -881, -5389, -5469, -12687, -17947, -18171, -20354, -15021, -7660, -7670, -23511, -27138, -28370, -33295, -30311, -25295, -21308, -17658, -11775, -10321, -11145, -18801, -23531, -23511, -24183, -17479, -13900, -12247, -14424, -24123, -21066, -13285, 1048, 4939, -6000, -11423, -10414, -14594, -14929, -7211, -5294, -11070, -13667, -8046, -10914, -9296, -6823, -1532, 4712, 5043, 1338, -11648, -16859, -15270, -12277, -496, 6677, 13658, 12823, 7148, 8525, -664, -8851, -14312, -12891, -4242, -1291, -6044, -3905, 852, -2654, -11664, -9346, -3822, 2451, -1887, -4283, -6689, -10978, -11941, -11157, -8115, -8817, -10329, -9498, -12080, -10648, -4645, 1962, -3702, -11408, -15045, -13170, -1414, -1615, -19669, -25346, -17576, -15442, -6747, -4598, -8054, -4126, -10306, -13255, -5360, -10213, -13618, -10534, -9918, -5922, -10659, -16265, -14045, -9789, -11283]
15144a1283J85l03K776m431o253k744l019j921l170R868o27J549J49k868J840
15129b0252J2460M080L557j825J469p215J313L779n26l644J2709J192k325j084
15115C688r679J325l694k689n773J612k307R124R11q829k674o646K893P623L067
15100a2048L263o471r158o15k54K898J527P966L896J869L617K746o010q827k422
15085a8023R313R706j904j2404k070R205J477K392L758j220p336m777L194p499
15071a6188N88J836N633N914L944q815o217j58Q083Q475K439j2314r291l114O780
15056a2405L256N222o56p9j611K648m652n673l930J603J078m854P665L996L309
15041e083l884o901k701P796Q110N12m192p207L101k688L533N756m425o252r011
$$ y = [-11283, -11098, -11401, -8625, -13056, -19309, -22053, -25072, -26993, -30163, -20295, -20922, -19373, -19224, -22092, -20252, -7792, -3712, -155, -1980, -511, -7726, -6413, -2634, -3160, -6804, 5905, 7097, 4772, 3688, -5991, -4666, -8360, -11049, -16822, -15210, -17517, -8393, -7482, -16311, -18985, -25631, -22738, -15115, -12048, -8785, -15256, -24414, -25029, -25283, -22385, -20858, -12892, -8996, -7127, -3510, -764, -6774, -15601, -18023, -8710, 996, -908, -13312, -15382, -6177, -4700, -2308, 1450, 230, -7106, -11883, -8689, -16188, -15600, -13764, -8131, -2217, 1727, -7088, -13305, -13463, -5380, 3095, 5534, -6780, -16071, -19185, -12405, -9149, -3927, -4583, -4662, -6273, -3625, -8277, -13950, -17880, -16277, -15199, -20053, -12388, -8392, -5083, -8967, -15868, -18569, -10773, -2663, -2151, -6343, -13550, -10449, -13137, -9604, -3848, -8273, -14525, -23536]
15026b3536N121J9620m527M17j121n710N413m758n703J244J931Q129L891K676
15012C087j540r383j299j863p590n923p99k83L900R436M633K229p151O45Q723
14997c178j92n22l16J188N59r73m198j409Q19P71q12J915j258Q17K790K81j926
14980e644j064M255k992r490l985j896j297q42K859M392k798O546j108J08J737
14965a1219K206K609K462J072n59q001q688M360R74L871N033l06m981K23N919
14950e025K844k052j000o55j284n825o570j67l086M876J2975L413q902r354k994
14935b2806o97M775R597n854p776L746L870L337M052o029o042j695K408N87K041
14920a6486j578q992p82L689P94N058n515k664P044l29J968N383L782J712L735
$$ y = [-23536, -18415, 1205, -3322, -2905, -4026, -9736, -4323, -9081, -14784, -13540, -11609, -3480, 411, 3087, 1547, -7836, -9135, -10998, -18588, -24511, -25310, -25593, -21693, -12257, -7624, -5395, -12546, -11901, -3178, -3370, -3892, -4208, -3020, -2461, -3434, -7632, -9041, -8222, -7451, -8263, -6348, -7606, -6789, -3999, -3718, -5644, -6708, -2453, -5445, -14935, -18920, -20816, -22113, -22955, -20096, -15704, -18502, -11956, -13064, -12956, -11219, -9013, -6404, -3942, -2870, -3429, -11430, -20118, -15758, -14784, -10913, -5880, -6186, -11167, -10944, -5025, -2181, -4233, -5233, -5888, -7172, -12997, -19567, -19734, -22820, -17944, -4969, -1556, -10458, -19812, -22806, -23503, -18728, -9131, -14985, -22761, -19015, -15145, -11808, -7756, -13785, -19827, -21522, -19114, -18527, -16486, -18064, -27056, -27838, -24149, -23355, -18297, -23812, -26476, -19432, -19761, -17793, -12410, -8628, -6916, -3181]
14905c181q64l871L839P656n559M21J626p834j1457q563N009J2031P160J819M679
14890B911K34j5357j4007J428J1544L833j506p70M395J625o728j625N277j161
14876i907n826p47j333j424J1350J1259m706q74m735j655K763R84L883l486M74
14861c980Q563L968r016o879K060J1038J0010n429p400Q2M590J765j1053j0623
14847a2304J141N891J2942P939j444k128p008N031k550o296p718O003K548q256
14833f209k240M334K274j577L098p959n920l916j699O202J2478J46j1350k379
14819a4717m32O600O674q677K626N558J396m338p246L289k193J085J1080K905
14805C610J511M494J192k278l813j0913L068L137k580k950m017J388m763k592
$$ y = [-3181, -4045, -7916, -4077, 3579, -1980, -1559, 67, -7767, -19224, -27787, -22778, -10747, -3587, -1768, 2911, 3145, -12212, -26219, -24791, -13247, -9414, -10920, -11690, -7295, -5670, -12398, -14023, -8746, -9907, -15733, -16480, -17813, -19237, -7887, 3372, -1334, -2208, -6943, -8598, -5835, -4851, -968, -4454, -3980, 4583, 8551, -465, -7344, -5284, 5754, 15764, 10335, 2935, 3017, 7607, 9372, -1681, -12304, -11163, -5272, 7670, 15609, 14165, 12037, 5029, 10060, 7510, 1214, -6504, -501, 2047, -6209, -8449, -4115, -1841, -3418, -320, -8279, -14199, -18115, -19814, -13612, -1134, -988, -12338, -14717, -15149, -8549, -1875, -10552, -7926, -2368, -972, -5310, -12556, -9267, -11460, -10375, 705, 3610, 5121, 9615, 10807, 8529, 4716, -6197, -3129, 8, -2572, -5522, -9539, -8151, -12914, -15506]
14791a5506N147Q468P771n299j3233k594P251l786p999j405K031K812l544L044
14777a6842K027k47Q30J591Q186k854K04J398R408n688n742J661q56k103J351
14762g676r30P232R97M531L425j977M99l801q177Q971r39j5157j45J917r09J449
14746a0690L679K619k144n196M634P741k871r174j846m08K694k162P318O466O16
14731A276j1610j0414O075K559n97Q093m915J0704Q568m290j7678j900O891M911
14717b327j422k12J08l476p452O328J5333n123n623j1481L14J2017K051k167O956
14702C824k647n878p299q435R96R303L597L678k527k567N89n361k032K865O640
14687e254o619j594k122P133O442p068k149j372P306Q67p165m896L146O461J0700
$$ y = [-15506, -10359, -1891, 5880, 581, -12652, -15246, -7995, -11781, -19780, -21185, -19154, -16342, -19886, -16842, -14815, -15062, -14232, -12641, -4455, -7309, -7105, -5707, 3701, -1987, -7729, -6068, -6924, -9027, -7676, -8606, -1374, -377, 4154, 7579, 5602, 6101, 2300, -5877, 3094, 2155, -13002, -13147, -11230, -12139, -10690, -7011, -4392, -6536, -11732, -7098, 643, -2228, -11402, -13248, -13656, -10962, -13124, -5806, 660, 1276, -10334, -20748, -14673, -12114, -12711, -4618, -9533, 1171, 9739, 5449, -12229, -14129, -7238, -2327, -3749, -3961, -3853, -7329, -14781, -8453, 6880, 1757, -3866, -15347, -15033, -3016, -965, -3132, 3824, 1177, -4701, -12000, -20435, -19439, -10136, -6539, -2861, -5388, -7955, -7366, -12727, -14759, -11894, -5254, -11873, -13467, -15589, -8456, -2014, -9082, -11231, -12603, -5297, -4430, -11595, -16491, -13345, -6884, 3816]
14672C816K034n849o227n344K695K696m918k191J030J76q833m840N598J01L639
14657a6417K363N354P038q993L809l458r272R765J700P81Q78O22M188n386j304
14642h332O852j695k876k320k105J686l91r451K219M675K801M508M889L593N1
14627D104L481p611m041P11n77n572r866m09J05O27Q070N43r11L653L821m248
14611h120k752K35n849l657L187R941L492N106L335k455r728J459M880J190o147
14596e883M9L159m300J014n19J15n526k76K944P271o540k184M015M718m105Q44
14580e204J801l723L785N978n840k398o36K414l745J654j273mm287k397N96m52
14564a3731N666P218l749R6l440r42j350k96O268M263j687m3n311j688P193O916
$$ y = [3816, 5850, 1, -6226, -11570, -8875, -6179, -11097, -13288, -12258, -12082, -20915, -25755, -20157, -20056, -16417, -14054, -8700, -1662, -10655, -6846, -10304, -19576, -9811, -8111, -7330, -6452, -5830, -1642, -7028, -8332, -1480, -3175, -6051, -8371, -10476, -8790, -9181, -18632, -16413, -11738, -8937, -4429, 460, 4053, 4104, 7585, -26, -4067, -3356, -3933, -9505, -19371, -19780, -19675, -19048, -10978, -10435, -11346, -7693, -3872, -8120, -10872, -10637, -16486, -20143, -16956, -7015, -3523, 1583, 4918, 2463, -7265, -5806, -926, 264, -5883, -5834, -2675, -6975, -5961, -6480, -6365, -11891, -12167, -9223, -1952, -8492, -10676, -6661, -1943, -6048, -5204, -3403, -7126, -3341, 2637, -3203, -5601, -6237, -3823, -7568, -5914, -7187, -7191, -11478, -13875, -13279, -13731, -8065, -847, -4596, -4500, -7940, -8882, -10232, -10528, -4260, 3, -1684, -1727, -7038, -8726, -1533, 5383]
14548E383j351j6517n879O497K760m407J880L006O83l173j403K378m269k088k133
14533a8633Q759k336P70l648l421N444N321P024K904M468l496L905q36L051k791
14518F485n465l494j832k800j500l802n268j57M97K44L481M370M534M985J154
14503A432L749J029M605l263p691M567j165l210m328R87n965n101l174o87j471
14488a9686m335R396K752K519j78O598L075n486L466Q272Q644J676K914O057p49
14473B4935q98Q465Q033N612J0519K248o834j1590j4225r811L207p314j1827n411
14459d891P194M898K934K728J918j926k762n330o517o632M03M516j862p786K230
14444a0885o62o64j74J429O358R503M500l583m767o297L298K505m957O100M310
$$ y = [5383, 4032, -12485, -18364, -11867, -9107, -13514, -11634, -8628, -7945, -11118, -12521, -10143, -14412, -16500, -18633, -9874, -12210, -11440, -15088, -18509, -13065, -7744, -720, 2184, 6652, 3156, 7061, 6225, 9276, 6485, 1020, -2474, -4306, -7106, -8606, -12408, -17676, -17833, -17336, -17092, -13611, -9241, -4707, 278, 1432, 5181, 6210, 10815, 7552, -139, 4428, 3263, 53, -4275, -3288, -9253, -14354, -17528, -18215, -19686, -24021, -14625, -11873, -9354, -9532, -2934, 141, -5345, -1879, 6393, 15037, 16713, 19627, 25684, 24935, 24037, 32502, 40535, 46147, 56666, 58914, 52080, 40490, 26265, 16454, 19661, 12347, 520, -4891, 2303, 7201, 10135, 12863, 14781, 12855, 10093, 4763, -1754, -8386, -7983, -3467, -5329, -13115, -10885, -11547, -12211, -12385, -10956, -4598, 4905, 9405, 5822, 1055, -5242, -1944, 561, -4396, 1704, 6014]
14429F014k676p738m136l384K794N155K866J531m981q855J641M526q638q13N628
14414a1066k632j0918n125N881l446j775P62P430J0049M095J2959k706P2m77m018
14399i15n014p207j350q023j000L540J456L325N856K059K617n64k142j11k078
14384i551k22j047K933N286L543L811l192n666K33L978n20j3765N033O864q419
14369a0701r682R771J0024q721o197J816l380j952N335k112j527m056J589M420
14355a5373K17Q08J507m188K336K044k200l074m030K310P324r97K879P617J500
14340a320J816O200p363J300N128L16l305n93m662m240l271K732R658M061n340
14325A117Q69L315L12q733n269N39J938n268J219J993Q743L839r9k026J145K311
$$ y = [6014, 3338, -4400, -8536, -11920, -9126, -3971, -1105, 426, -4555, -13410, -11769, -7243, -15881, -16694, -11066, -13698, -24616, -29741, -23860, -27306, -29081, -28319, -20889, -10840, -6745, 6214, 3508, 3580, 3103, -915, -5929, -13136, -14486, -22509, -23509, -19969, -18513, -15188, -9332, -7273, -4656, -5220, -7362, -7473, -9551, -9773, -10820, -7887, -2601, 942, 4753, 1561, -4105, -3872, 106, -414, -14179, -9146, -2282, -10701, -20383, -10612, -588, -9309, -15506, -13690, -17070, -19022, -13687, -15799, -17326, -21382, -19793, -15373, -15156, -14348, -12841, -17029, -14693, -12649, -14849, -17923, -21953, -19643, -12319, -13316, -10437, -2820, -1320, 496, 6696, -667, 633, 5761, 6077, 2772, 2179, -2483, -6723, -9994, -7262, 2396, 6457, 1117, 1986, 5301, 5613, -3120, -8389, -7850, -5912, -11180, -9961, -7968, 775, 4614, 4515, 2489, 3634, 5945]
14309E945J980J95J209k119j5263o23j808j2607l824N307K970K028n397l461Q028
14294a7440J2317M186J279k932p311J504N142l587o466m263N747R280P619m684
14280C91j849Q87J245J589L813p405j586K965r32m825r835j297P932J535J36q330
14264a5566l391N722L764P044P311o850j1590j022L912n627O268N266K162p769
14250a0366r02O37p97m929O766K764k18k445l655P825O292j818n363k559q42k877
14234a2487J4951R153r893n189K384O540j419p887m339N247O584L380N092p868
14220D249j2041j255k112O30l080n210K663M637L370k11O590N138j82J414j234
14205C366m243K778M329J219l893L134m54J086m025k455r150j07l332l090R341
$$ y = [5945, 7925, 8120, 9329, 7210, -8053, -8676, -10484, -23091, -26915, -21608, -18638, -16610, -22007, -25468, -17440, -5123, -937, 342, -2590, -9901, -8397, -3255, -6842, -13308, -17571, -11824, -2544, 5075, 391, -1458, -571, 674, 2263, 6076, -1329, -2915, 50, -882, -5707, -15542, -16839, -8907, -7372, -7236, -15566, -18957, -13235, -9471, -2427, 4884, -1966, -13556, -14578, -10666, -16293, -10025, -4759, -2597, -10366, -11268, -10631, -11428, -16357, -9591, -6827, -7045, -9490, -13145, -5320, 972, -846, -6209, -8768, -9610, -12487, 2464, 11617, 1724, -3465, -1081, 5459, 4040, -3847, -8186, -2939, 3645, 7025, 12117, 4249, -7792, -9047, -11159, -10529, -13609, -18819, -16156, -11519, -8149, -8360, -1770, 3368, 3186, 4600, 3366, -877, 1901, 6230, 7449, 3556, 6690, 6236, 7322, 3297, 842, -8308, -8415, -11747, -14837, -5496]
14190e496J2575P576n009R399J4225n171j6226j1566L632O591O811N204M767N693
14176C3005k956l830J387j783n308j0707o399L650L652o20k31j451l635j944j512
14161A318o972o65m813K800k184k1J332L246J591j119N01L62q29M286M114j128
14145A819N924P156R474O502R55j0526q194o9L688n198o010n259K185k834o80
14130a067O752l250K578k973j1254k807M654J2953J1044j42Q6l206p826q773p317
14115a0548m739l582K748K239K40M630r42l923k545N709M263m981J563M020N893
14100D5p128j1940n322J209Q026N513J5403K780r458l342J15l626k677J265P2
14085i065k08r64M020o620m3O332L215J513m506l721n345Q24L38J2k15o90R72
$$ y = [-5496, 7079, 14655, 9646, 19045, 33270, 28099, 11873, 307, 3939, 10530, 17341, 22545, 27312, 33005, 30049, 26219, 27606, 25823, 20515, 9808, 3409, 7059, 10711, 10091, 9860, 8409, 4774, 2830, 1318, -5654, -6319, -11132, -8332, -10516, -10537, -9205, -5959, -4368, -5487, -4986, -4624, -5453, -1167, 2947, 1819, 7743, 14899, 24373, 30875, 31830, 21304, 13110, 13041, 16729, 11531, 5521, 262, 2447, -387, -1067, 5685, 2435, 5013, 2040, -9214, -12021, -7367, 5586, 16630, 16488, 16574, 13368, 5542, -3231, -10548, -15287, -18869, -16121, -13882, -13642, -9012, -9954, -13877, -16422, -10713, -6450, -11431, -9868, -5848, 45, -7083, -19023, -24345, -23136, -15110, -9597, 5806, 8586, -872, -4214, -4099, -7725, -10402, -9137, -9065, -9273, -10237, -6217, -12837, -12880, -6548, -3333, -1820, -6326, -10047, -15392, -14568, -14230, -14218, -14433, -15123, -14151]
14068a4151l664O321l081l18o532J181M735K967R532M634p919l200J683O443p221
14053h590n407K800K914m853l848l511K338M750O838n66p955O337J1463k277J772
14038B205J195P86n895Q50r095j3560O187K639j589O63N768R252J540q870o896
14023a4820j103k638l68P516K669M039j71l531J0463P890q709m491O103M788j0156
14008b519k531N71L024K92p777K369K229l329p170R252K089q160m775M61K087
13993a3887Q254n780j4493k485M683K394q29Q42m68L057O848J882Q837j951O1
13978c035M914K688l532j1386m499K620L185n159j648K688R417j040j878r626
13964a6291k23K596J77O210P149M46N66r44o238m785J0510J0058r35r364q954
$$ y = [-14151, -17815, -11494, -14575, -14893, -21425, -20244, -15509, -12542, -3010, 1624, -6295, -9495, -7812, -1369, -8590, -13997, -11197, -8283, -13136, -16984, -20495, -18157, -13407, -6569, -7135, -15090, -8753, 2710, 433, 2205, 3400, 4186, -1709, -859, -9954, -23514, -17327, -14688, -16277, -15614, -9846, -594, 946, -7924, -14820, -15923, -18561, -18929, -11413, -8744, -4705, -4876, -8407, 2056, 9946, 1237, -3254, 2849, 7637, -2519, -5050, -4479, -1455, -1163, -8940, -6571, -4342, -7671, -14841, -5589, -3500, -11660, -16435, -15974, -13887, -5633, -11413, -25906, -28391, -23708, -21314, -22143, -21301, -21769, -18712, -11864, -9982, -1145, -3096, -3035, 1879, 4567, 1035, -10351, -14850, -12230, -9045, -14204, -15852, -13164, -3747, -4787, -6665, -16291, -16514, -13918, -13741, -7531, -382, 64, 630, -314, -6552, -11337, -827, 9231, 8296, -1068, -10022]
13949a0022l957M024J3034J276N44l41R23p009N092p612J448L458L083n564l312
13934d935J578l955J601K468j2549q700j938L531O515N549O961K091j178k849
13920e810M983M771J501M366J441k820l208l416M257l032r80K140J564J641K060
13905I458L152Q524J0390N594M848r552j1652j0185o693o03o984j151K924N061
13891C131M257K679p167J951O13M589M120j412M37k398q958j3652M439L707N236
13876A572R794l708o766q491l323Q034K616l309N911K384n003r755N269p83j430
13861f988L23m71Q72R783m134k190n90L026N961l468q037m637k313M428N77K645
13845e213M003j058m067j106l76L162J333L770J352K040k127l17j506l982N334
$$ y = [-10022, -13979, -9955, 3079, 4355, 4899, 4558, 5481, -1528, 3564, -4048, -2600, 858, 3941, -1623, -4935, -3357, -7312, -5711, -3243, -15792, -24492, -26430, -22899, -16384, -10835, -3874, -1783, -2961, -5810, -827, 3944, 5445, 9811, 11252, 8432, 5224, 1808, 6065, 3033, 2053, 4193, 5757, 7398, 9458, 12610, 21134, 31524, 37118, 41966, 32414, 20762, 10577, 3884, 3281, -3703, -4854, -1930, 3131, 7388, 10067, 2900, 4851, 5464, 10053, 14173, 12761, 13198, 10800, 1842, -11810, -7371, -3664, 1572, 11366, 7658, 892, -7599, -10922, -2888, -272, -3581, 2330, 4714, -289, -10044, -4775, -5558, -6988, -6665, -7136, -6264, 3519, -615, -2805, -3395, -369, 5592, 2124, -5913, -10550, -12863, -8435, -7858, -5213, -1210, -2268, -6335, -7441, -7817, -4655, -3322, 448, 1800, 3840, 1713, 1396, -110, -4092, 1242]
13830A242Q355k674J74l081J153L939l691R50l842j0499q75J181J389M26K075
13815c778j099L683m23j118K737j101q674l508P024J272Q21K723l125l87O582
13800A629P80l649R87M135q474q668p466p619O132J1360O716l936l036M744j508
13785g873j238K318J514M46L73k495m442J978O238K736M794O617o237j807M214
13770G136k297j885j472k200l963l093J831J582n54j71m123k988R02O403R876
13755D984l93N794N579K876l397j972J69n203n195J821K267m488n078o297J644
13740f889L617M265P495m009m167k882J264m216J431J079J783O759N907J79O948
13725A8564R180L755j784j0172j0611J1816L567q494k268O588p244r363p067L662
$$ y = [1242, 9597, 6923, 7097, 4016, 5169, 9108, 5417, 6367, 2525, -7974, -8849, -7668, -6279, -5853, -3778, -4877, -1194, -1617, -2735, 2, -1099, -9773, -13281, -6257, -4985, -4164, -1441, -4566, -4953, 1629, 2409, -1240, -253, 3882, -4592, -13260, -20726, -28345, -22213, -10853, -4137, -8073, -11109, -6365, -7873, -9111, -6793, -5279, -4833, -4460, -6955, -11397, -9419, -3181, -445, 4349, 10966, 4729, 2922, 7136, 4839, 2954, 1482, -718, -4681, -7774, -5943, -4361, -4915, -5086, -9209, -12197, -11295, -4892, 4984, 4591, 10385, 15964, 18840, 15443, 13471, 13640, 8437, 3242, 5063, 7330, 2842, -2236, -8533, -6889, -3272, 993, 8488, 4479, 312, -2570, -1306, -5522, -4091, -3012, -1229, 5530, 11437, 11616, 18564, 27744, 31499, 29715, 19543, 8932, 20748, 24315, 15821, 13553, 20141, 12897, 3534, -3533, 129]
13711A29J0831M339K474K642P98q258J612P676N826j0226j9041o102Q935q31l760
13696b956L452N471j898P760R469M05o679J766m655j7013p139L739J600K287j113
13681e504k649N531l914P12K287O982P124j464p994L93M80n609J871K760p124
13666f118l751m464o159m690J2155J3079J357l475q779L482P388L500Q31J973
13652F329k062m944k595M740l61m04J920L476j830K597l107j1292p746K429k410
13637a5260L463L964l048p033l959K979M997k586J733K748O078J2193N176P70
13623A2215k196o75l891N177O078N644k625L550K987J50k774j1899k642L639k039
13608A0699p006j0630j223K686q92k618L953K713k812n656O057P642j730J70O092
$$ y = [129, 10960, 15299, 17773, 20415, 21213, 12955, 14567, 22243, 28069, 17843, -1198, -7300, 1635, 804, -2956, 496, 5967, 4069, 11829, 21298, 21703, 15024, 16790, 12135, -4878, -12017, -8278, -6678, -4391, -5504, -8153, -2622, -6536, -5824, -3537, 3445, 10569, 9105, 1111, 1504, 1984, -3625, -1754, 1006, -6118, -9869, -14333, -20492, -25182, -13027, 52, 1409, -2066, -10845, -7363, 25, 3525, 4356, 6329, 4267, -677, -3272, 1468, 1107, 703, 2623, 6099, 4269, 6866, 3759, -7533, -15279, -12850, -15260, -11797, -7833, -10881, -17914, -21873, -18894, -13897, -16483, -14750, -12002, -5924, 6269, 11445, 12215, 10019, 9344, 5453, 10630, 16708, 22352, 19727, 23277, 26264, 26414, 23640, 11741, 9099, 12738, 10699, 3693, -6937, -8160, -5474, -6366, -8984, -5031, -2318, -5130, -10786, -4729, 2913, 1183, 1353, 7445]
13593G445l693r81O52n213p579M168M468o264J790o749q29K0119P059K393R97
13578A7783l516j434r908J77J559l775O098K118K020o10m863o23r75O617J470
13563A2138K266J738j384p4o644m910Q684K329n89l767k73j887kM346K350K141
13547A6462J971l133o051P407j382q116J0577k256l165p692m352J184j120L002
13533C336O736L121l469l755p466k316j602K50K979l60n279l374j015R070J783
13518a361L6M801M753J2362O487j1252n017N360j709o394o067r4J1540k404J112
13503A2153O092n478j1651k029L960L847j075l407P318j759l913J326p406n110
13489g132K460R64O177J3735J2248N173R094k770k694l224q38r470o802k628o684
$$ y = [7445, 3752, 2771, 3423, -1790, -9369, -5201, -733, -6997, -5207, -11956, -12785, 7334, 14393, 16786, 17783, 14267, 12833, 2925, 3102, 4661, 886, 6984, 9102, 11122, 10512, 5649, 5026, 4051, 10668, 12138, 14404, 16142, 14758, 14684, 8040, 3130, 11814, 14143, 13554, 9787, 9514, 7627, 7625, 11971, 14321, 16462, 18433, 15300, 9249, 16656, 15274, 7158, 17735, 15479, 12314, 4622, 270, 1454, 334, 3336, 10072, 13193, 9724, 5969, -1497, -3813, -5415, -5165, -2186, -2546, -7825, -11199, -12214, -3144, -1361, -1325, 3476, 8229, 20591, 27078, 15826, 10809, 16169, 14460, 8066, 1999, 1905, 13445, 11041, 12153, 18245, 12767, 1116, -913, 3047, 6894, 5819, 2412, 9730, 7971, 4058, 5384, -2022, -7132, -4672, -3708, 2469, 16204, 28452, 33625, 42719, 39949, 37255, 34031, 33193, 23723, 16921, 14293, 7609]
13474G609m633L194O781j510L597L884Q654L348o140p308l853L655K441J55q117
13459A1757r51k51J379O85M894L84o886J290O256j367m82O89j071n201J776P803
13443B0704k014j718j405n305J335Q170P493J352m442r21k753r47k60k275J240
13428A8254Q894J1504J364l371j272k844j716Q267J760p77n23p123k741k012J0129
13413C7793m324r651r98K487j370j0590K750P16L217J0507J147K177J87J684j414
13398C4318m21o107r710K179N788K263o82m510r83J895j671q730l426k951l53
13383F899J472K574p74k359M532N354k771n359K825Q447L392N701O14k223o323
13368B2001o075N391n00M47k38n803P18K158j193R5m916N542L532M199J605k224
$$ y = [7609, 2976, 6170, 12951, 11441, 15038, 18922, 27576, 30924, 24784, 17476, 13623, 17278, 19719, 19874, 11757, 10806, 10555, 11934, 12619, 17513, 17897, 11011, 12301, 18557, 17190, 16708, 17397, 16326, 11125, 12901, 20704, 18690, 16972, 15567, 10262, 11597, 19767, 27260, 28612, 24170, 23249, 20496, 19549, 19289, 17014, 18254, 27148, 38652, 40016, 36645, 35373, 32529, 30813, 39080, 40840, 40063, 39540, 32417, 29676, 27664, 37793, 33469, 23818, 22820, 25307, 23937, 13347, 16097, 16813, 20030, 30537, 31684, 33861, 34048, 35732, 34318, 33897, 27790, 18080, 20259, 26047, 28310, 27628, 23118, 22135, 24030, 22359, 13629, 10203, 7252, 6899, 8371, 10945, 10171, 7812, 12344, 17698, 14927, 9568, 12393, 20840, 24232, 29933, 30547, 28324, 22001, 15926, 21317, 20817, 21264, 21026, 15223, 15941, 18099, 16906, 17001, 12085, 17627, 21159, 25358, 26963, 24739]
13352B4739m990j515N722M514p121p922l177L049j399K126m508o594K558O907
13338A2389Q665M447N753O258k709J634m062m729j605l25r38l838K101O246O235
13323C5522j646n661r59J084l218m016K077n488k575k98o17m99j210J6116Q249
13308C6861n596k907j2297o490M576M368L621L653k396l540o841N082R241j872
13294B5463k724r25j0522j97J2512m155j4253n625n33J681R476M681J495K726
13280A9100k961r834l411J31P250M529J611L461O36j084N938j315k264R15j762
13265B0940Q929k156j386K16r70L772P62N220J671n018j917r258K290Q197n358
13250B5934L864Q45M486q9L363j0132L855R828j802n814N096N253o90j3144r783
$$ y = [24739, 19749, 18234, 23956, 28470, 21349, 13427, 10250, 13299, 11900, 14026, 9518, 2924, 5482, 12389, 21054, 25501, 31254, 37512, 34803, 36437, 32375, 27646, 26041, 25716, 24778, 20940, 23041, 29287, 35522, 33876, 28215, 27256, 28340, 25122, 21106, 23183, 17695, 15120, 14822, 14205, 13706, 12496, 28612, 36861, 31265, 28358, 16061, 9571, 14147, 18515, 22136, 25789, 23393, 19853, 13012, 18094, 27335, 25463, 22739, 21814, 11292, 11095, 23607, 19452, 5199, -426, -959, 722, 10198, 14879, 16374, 19100, 16139, 6305, 2894, 3025, 10275, 14804, 16415, 19876, 20512, 19428, 25366, 24051, 21787, 22702, 20940, 29869, 27713, 26327, 26543, 25573, 29345, 30107, 35327, 36998, 31980, 30063, 20805, 23095, 31292, 25934, 29798, 30643, 35129, 35040, 38403, 28271, 32126, 41954, 40152, 34338, 39434, 44687, 43997, 30853, 21070]
13235B1070N085J514L461m905j760K514l137m750m158M576j594P536L222k643
13221B6031n390J119J104J042n966M109R509L267l914n251k287J956K389o826
13207B0892r814K23N324M231j2211j284J3591J8115m885n645k043J495M407l63
13193C2033j8167n341J7789R892p155o337M128J0305l936j6552j1359P96J0935
13180A7031N517K909j53j402j1947k576R094M533Q554k616Q2o84L27M073j793
13165C0949l269M3J592n041Q827J7265q13j1811o189O849R092j946K715n47M699
13150E2415o479j1654q195q031M303o05m467m374L199o563n304r472o406m603
13136a6236j316J154J0398O592J1363J147m753J1138J0507J0780N585R41p065
$$ y = [21070, 26155, 27669, 31130, 26225, 24465, 26979, 23842, 19092, 14934, 19510, 17916, 25452, 28674, 26031, 20641, 21760, 22864, 23906, 17940, 22049, 31558, 34825, 30911, 25660, 23373, 25329, 27718, 20892, 11078, 11301, 16625, 20856, 8645, 7361, 20952, 39067, 34182, 28537, 26494, 27989, 32396, 32033, 13866, 8525, 26314, 36206, 29051, 22714, 26842, 37147, 33211, 16659, 5300, 6096, 17031, 22548, 25457, 25304, 23902, 11955, 9379, 18473, 23006, 31560, 28944, 29026, 28342, 28669, 32742, 30949, 27680, 27723, 29315, 24274, 33101, 50366, 49553, 37742, 31553, 38402, 47494, 45548, 48263, 47716, 52415, 45936, 34282, 26087, 18056, 22359, 21754, 17287, 12913, 16112, 9549, 4245, -5227, -11633, -16236, -17552, -16398, -6000, 592, 11955, 13102, 8349, 19487, 29994, 40774, 46359, 47300, 40235]
13123D0235Q23R551M565Q086J435n825P902J116p09P955J4889Q206J3082J3277
13109A24588J7197J0660J3715J4038J2356J8081K6581K3899K9369N2488P7437
13098D20409J15058J68711K33534L01540L31993L47223L76318L71106K74918J42191
13088C083001K9929n3610j75829l05585l67644l54116l33772l21963k84451k21355
13078F94605j45036j02597o9101m6093m2448k5590k0249k1632k2716j5687j4217
13067A69239j0996m830m240n205J109J179r966p14K176M156O325k437r728q436
13053A27632j582J689j2263o140j867p74P264L612J0938K5141K8276K1375O991
13040B10292m164j8757k5459k0693j0028q447p376m711n821j3221l520J2430M596
$$ y = [40235, 41058, 50609, 55174, 63260, 64695, 58870, 66772, 67888, 67179, 75134, 90023, 98229, 111311, 124588, 141785, 152445, 166160, 180198, 192554, 210635, 237216, 261115, 290484, 342972, 420409, 535467, 704178, 937712, 1239252, 1571245, 1918468, 2294786, 2665892, 2940810, 3083001, 3112930, 3059320, 2883491, 2577906, 2210262, 1856146, 1522374, 1200411, 915960, 694605, 549569, 446972, 377871, 331778, 289330, 263740, 243491, 221859, 199143, 183456, 169239, 158243, 153413, 149173, 143968, 145077, 146256, 136290, 135576, 137752, 141908, 148233, 145796, 136068, 127632, 126050, 127739, 115476, 109336, 107469, 106695, 113959, 117571, 128509, 153650, 181926, 203301, 210292, 206128, 187371, 161912, 141219, 131191, 122744, 115368, 110657, 104836, 91615, 88095, 100525, 105121]
13027A05121j138m851j895L653J883k663L223p671l080m485k00l054l583j646
13013G9614o418J322l744N560P631K509k347M244k56O072M864K8112L3024J9928
12999A80115J3318O401j6104k7082j9213l457p714j3008q263m231K639l279n036
12986I5086k426P544O681o709j3175k224l261p467p195j1182j1881M67L623n437
12972D2444J837O496N257M416J5496P781N186J2953N764j831k494o248P435K5538
12958A30030R960l267k576k237j1134j5383j1096m124o96Q634J69k188k667l822
12944H9603L341J6592J2398p831j2618J686J0265m64M175J1753N645k891P591
12931A39245Q582J2377J2036K645J3517K6808K5849K9414K8513L5375M0073L9126
$$ y = [105121, 103983, 99132, 97237, 100890, 102773, 100110, 103333, 95662, 92582, 88097, 87897, 84843, 81260, 79614, 73196, 74518, 70774, 76334, 83965, 86474, 84127, 88371, 88115, 94187, 99051, 127163, 160187, 180115, 193433, 199834, 183730, 156648, 137435, 133978, 126264, 113256, 104993, 100762, 103401, 100122, 95086, 92660, 100204, 106885, 100176, 87001, 84777, 81516, 74049, 66854, 55672, 43791, 44258, 47881, 42444, 44281, 50777, 56034, 60450, 75946, 83727, 88913, 101866, 107630, 105799, 103305, 97057, 104492, 130030, 139990, 136723, 134147, 131910, 120776, 105393, 94297, 90173, 89477, 98111, 98280, 96092, 93425, 89603, 92944, 109536, 121934, 114103, 101485, 103171, 113436, 112972, 117147, 128900, 134545, 131654, 139245, 147827, 160204, 172240, 174885, 188402, 215210, 241059, 270473, 298986, 334361, 374434, 413560]
12919D13560K6099J1540j688j1499k0981k9056l9734m9819n5853m2239l0608k6818
12907A42904k3093j8883n578o459r237r318q86K759K062o178j368p960p827m911
12893D6027q431p327o028L441P653j592M196J7886J6266K701L802P196J0550J7163
12879A13503J5920J4873J9123J1068l99r071q439j684m225L264j0893j6667j3741
12866A12632j4341j1699j0842m480j2236q528M72J6030K7305L2294M6884O9371
12854B42862P8099O7926N6347N8783M8215K1913R85j2759j5671k0262l5940m7013
12842D43485m0650j8794j1288j7745j9498p038j712k699m755q145o782k960l296
12829B98123j1958m838J151q3L601j181J814J3421K5684K4805J6599J7694J3653
$$ y = [413560, 439659, 451199, 449511, 438012, 417031, 387975, 348241, 298422, 242569, 200330, 169722, 142904, 119811, 100928, 95350, 88891, 79654, 70336, 69450, 72209, 74271, 68093, 66725, 58765, 50938, 46027, 37596, 30269, 24241, 27682, 35335, 33743, 37939, 55825, 72091, 74792, 78594, 85790, 96340, 113503, 129423, 144296, 163419, 174487, 174088, 165017, 156578, 154894, 150669, 153933, 143040, 126373, 112632, 98291, 86592, 75750, 71270, 59034, 50506, 50978, 67008, 94313, 126607, 173491, 242862, 320961, 388887, 445234, 504017, 552232, 574145, 575130, 562371, 546700, 526438, 490498, 443485, 402835, 384041, 372753, 355008, 335510, 328472, 326760, 324061, 319306, 311161, 304379, 301419, 298123, 286165, 281327, 282478, 282395, 285996, 284815, 286629, 300050, 325734, 350539, 367138, 384832, 398485]
12816C98485Q634J2580K00K318r78M046R34m917K019l587l388q981p028j471J3681
12801D12547J5128L1500M9143N2867M2342N4655N7927N4301M6119K3773K1598
12790H61900J0444j3765l4132l8611m2924m2482m4763m1719l0386l0876l3017
12779E19669k3606j1695q153j6951k716q9K785J356J8298J9579J7201K3449K8995
12766E68122K5889J9230J1739P988J3362M018Q69k613p512r937j1753j1345j6701
12753E91356r68R286J768P937J6694J9072K2871K2179K2632L0937L8435L3944
12741H16143K0418K0954K6689K2021J8540J7909R926Q600J3678J3817J8600K7474
12729A034769L5418M4530N1977N2089N8468N0918M9909N6207M6177M7268N4478
$$ y = [398485, 407119, 419699, 419899, 422217, 421239, 425285, 426219, 421302, 423321, 419734, 416346, 407365, 400337, 398866, 412547, 427675, 459175, 508318, 561185, 603527, 658182, 716109, 770410, 816529, 840302, 861900, 872344, 858579, 824447, 785836, 742912, 700430, 655667, 613948, 583562, 552686, 519669, 496063, 484368, 476215, 459264, 456548, 456459, 459244, 460600, 478898, 498477, 515678, 539127, 568122, 594011, 613241, 624980, 632968, 646330, 650348, 651217, 648604, 641092, 631155, 619402, 608057, 591356, 590388, 599674, 601442, 609379, 626073, 645145, 668016, 690195, 712827, 743764, 782199, 816143, 836561, 857515, 884204, 906225, 924765, 942674, 952600, 961200, 974878, 988695, 1007295, 1034769, 1070187, 1114717, 1166694, 1218783, 1277251, 1328169, 1378078, 1434285, 1480462, 1527730, 1582208]
12718A582208M4583M5256N0556N2736N6200P8230Q5346Q2649J07078J13543J40604
12707B438989J55795J57741J72845K02970K16650K02792K20044K23850K32327
12698D224003K25174K19113K25911K54368K88886L30933M05885M98678O26112
12689G299063P72203R48282J180468J491188J872982K252076K557563K872081
12681B1245906L297142L730222M105944M600646N533680P197453J0022497J5014443
12673G4747933K3769663L7030893N0414465N7244160N8571531O0346979O3800334
12666D25925958N6939793L7326202J5428108J306058j1625736l2597295n3425879
12659D39277209o2870074n9810775n6811794n6449112n1203575l9203661k5709347
$$ y = [1582208, 1626791, 1672047, 1722603, 1775339, 1831539, 1909769, 1995115, 2077764, 2184842, 2298385, 2438989, 2594784, 2752525, 2925370, 3128340, 3344990, 3547782, 3767826, 3991676, 4224003, 4449177, 4668290, 4894201, 5148569, 5437455, 5768388, 6174273, 6672951, 7299063, 8071266, 9019548, 10200016, 11691204, 13564186, 15816262, 18373825, 21245906, 24543048, 28273270, 32379214, 36979860, 42513540, 49710993, 59733490, 74747933, 98517596, 135548489, 185962954, 243207114, 301778645, 362125624, 425925958, 482865751, 520191953, 535620061, 536926119, 525300383, 492703088, 439277209, 376407135, 316596360, 259784566, 203335454, 152131879, 112928218, 87218871]
12652H7218871j6507052j1174738q120193o314412n194453m475728l974443l541806
12644B7916046l133923k761219k385266k010851j683343j409317j187249j032894
12636A2311984r44747q92864q65000q14708p66131p06622o51363n84685n12752
12627E573112m48594l82445l31440k84326k43654k11161j79908j54768j50989
12618C185827j43177j31616j16463j14073j24152j19780j08329j06839r8493j07109
12608B015796r6715p5449p3085o4939n4506m6867l8000k8709k0610l2317l5738
12597A448861m5269m1417m0280l9569n2501n0393l6350l7446l6635k5435j8346
12586A025220j1557L120p709j6428m971r477j1094j0545j9586l0061k6735l2951
$$ y = [87218871, 70711819, 59537081, 51416888, 45102476, 39908023, 35432295, 31457852, 27916046, 24782123, 22020904, 19635638, 17624787, 15941444, 14532127, 13344878, 12311984, 11367237, 10474373, 9609373, 8794665, 8028534, 7321912, 6670549, 6085864, 5573112, 5124518, 4742073, 4410633, 4126307, 3882653, 3671492, 3491584, 3336816, 3185827, 3042650, 2911034, 2794571, 2680498, 2556346, 2436566, 2328237, 2221398, 2122905, 2015796, 1919081, 1843632, 1770547, 1705608, 1651102, 1604235, 1566235, 1537526, 1516916, 1484599, 1448861, 1403592, 1362175, 1321895, 1282326, 1229825, 1179432, 1143082, 1105636, 1069001, 1043566, 1025220, 1013663, 1016783, 1009074, 992646, 987675, 978198, 967104, 956559, 936973, 906912, 880177, 847226]
12574H47226l3354m0614l2811k7898l7445l7274l1443l5458k6457k0595r165n516
12562E09196l500m632j0044p88Q104Q422K270N048q94j0198j1382j7817j3194
12549D60591k2656k0711k1186j7271k2395k3699j1294j7351j9540j1720k357p995
12537B62416j939o222l598J692R615Q716Q488J5690J2256J4287J7018N55P292
12524C46266N722j8967k5345k3146j7424j3754j6093j6065p678L338R873K5434
12512B52161K6985K6968L4607M1755K4758J8668J0079J394j7641k8063k8173l1147
12500C32351l6931l5109l7369k1709j5264j7232j8337l477o152k1639q269o065
12488A04798k3259k2115k4832j9531k8041m8778m7761m0902k2714k0075j6437
$$ y = [847226, 813872, 773258, 740447, 712549, 675104, 637830, 606387, 570929, 544472, 523877, 514712, 509196, 505696, 501064, 491020, 490232, 498336, 506758, 509028, 514076, 513182, 502984, 491602, 473785, 460591, 437935, 417224, 396038, 378767, 356372, 332673, 321379, 304028, 284488, 272768, 270411, 262416, 260477, 254255, 250657, 252349, 261964, 270680, 279168, 294858, 307114, 321401, 338419, 338974, 346266, 351988, 333021, 307676, 284530, 267106, 253352, 237259, 221194, 213516, 216854, 226727, 252161, 279146, 306114, 340721, 382476, 407234, 425902, 435981, 437375, 419734, 391671, 363498, 332351, 295420, 260311, 222942, 201233, 185969, 168737, 150400, 146923, 140771, 119132, 110863, 104798, 81539, 59424, 34592, 15061, -12980, -61758, -109519, -150421, -173135, -193210, -209647]
12477b09647J1525M4605M8656N1225O2686O7113O5699O0102M3630K8438K6112
12466C00144J8080N156j45P214J6782L9340M7127N4178P0637P9010N9022M7151
12454G43696L6382P669j7099m5394o2036o0943o2559o6555n7662l8714l3802j9124
12442C23859q037j6155j2896r679j0159p904K511k198j0557j2386j6202p961m135
12429B08101n224k444p515j114M960l437q457L645J4197P835p586L42K753o105
12415A99951n957O919J0516K080l062q742j4680j5408j8628r113m078n325p893
12402A26580r837j1807j3336L511K644O2m970J721R624J100j1511j0516J1760
12389I5025P293J33n184L694N580n773q774J999R054R562J829j604k241m747O45
$$ y = [-209647, -198122, -153517, -104861, -53636, 9050, 76163, 141862, 201964, 245594, 274032, 300144, 318224, 323380, 323235, 330449, 347231, 386571, 433698, 487876, 558513, 637523, 696545, 743696, 780078, 787747, 770648, 725254, 663218, 602275, 539716, 473161, 415499, 376785, 342983, 323859, 315822, 299667, 286771, 277092, 266933, 259029, 261540, 259342, 248785, 236399, 220197, 212236, 208101, 202877, 200433, 192918, 191804, 196764, 193327, 184870, 188515, 202712, 210547, 202961, 203303, 206056, 199951, 193994, 200913, 211429, 213509, 210447, 201705, 187025, 171617, 152989, 143876, 139798, 134473, 126580, 116743, 104936, 91600, 95111, 97755, 97817, 92847, 94568, 104192, 105292, 93781, 83265, 95025, 102318, 102451, 97267, 100961, 106541, 100768, 91994, 93993, 103047, 112609, 114438, 112834, 110593, 105846, 106491]
12374A06491j800m68M478j1761j2184J304j732P972O973J043J2990M407J6893
12361A34606L1724L2258J3570o016q178j6786j3358m861m807j4056j9213N47n377
12348A20053j2394m457l752n132j045j74N440Q073m157n962j119M564k466m793
12334I2679j0215j1274j257K569j034n677q876K120J2257J1352Q694O668J418
12321I9424r075m328j186k600m660m606M42r6Q59j0118j0685j5465p068m65L479
12306C3852L396K264L141o493l691q57q80O058M733m337n068M867K218k915J079
12291C7367P95O64j813L985l144n818L882P50K249J530j244j252q491n767O065
12276B9758M439r656l927K483k930O976M387l961N825J470L799J1254J4272R133
$$ y = [106491, 104691, 104223, 108701, 96940, 84756, 86060, 84328, 92300, 99273, 100316, 113306, 117713, 134606, 166330, 198588, 212158, 206142, 197964, 181178, 167820, 162959, 158152, 144096, 124883, 125430, 120053, 107659, 103202, 99450, 94318, 93273, 93099, 98539, 106612, 102455, 96493, 95374, 99938, 97472, 92679, 82464, 71190, 69933, 72502, 71468, 65791, 56915, 59035, 71292, 82644, 91338, 98006, 99424, 90349, 86021, 84835, 82235, 77575, 72969, 73411, 73315, 74174, 64056, 53371, 37906, 30838, 30373, 33852, 37248, 39512, 42653, 36160, 32469, 31612, 30732, 36790, 41523, 37186, 32118, 36985, 39203, 36288, 37367, 38162, 38826, 37013, 40998, 37854, 32036, 35918, 36668, 38917, 40447, 39203, 37951, 29460, 23693, 29758, 34197, 24541, 20614, 23097, 20167, 27143, 31530, 27569, 33394, 34864, 38663, 49917, 64189, 73322]
12262G3322J0868K0362L0206L1977M546j7659j9535j1829Q317M741K584N950J2194
12249A56044J6775K6984J6932L2932L4670M6385P1867J21453J87430K68130L15560
12238A295162L33050L51694L73227L36703K44384J10823J3388q3121k14382l26108
12228B434820l65546l51881l26403l16819k74083k10819j33561q9235n8504m2219
12218B65750k4306k3170j7342j2752j5823j5701j6129k0282k0158m401p93K640
12206I7533j5771j1588l365J338L718j459Q34R27k818L265J2924O979k510J338
12192I1345M148m075p551l855l968j2117j2417l219K056J009n034o410j1821L78
12178B8469l696Q89q042j388qL359O767j540l52m205R86k922L391M383O133p83
$$ y = [73322, 84190, 104552, 134758, 166735, 171281, 153622, 134087, 122258, 130575, 135316, 137900, 143850, 156044, 172819, 199803, 216735, 249667, 284337, 330722, 402589, 524042, 711472, 979602, 1295162, 1628212, 1979906, 2353133, 2689836, 2934220, 3045043, 3058431, 2975310, 2760928, 2434820, 2069274, 1717393, 1390990, 1074171, 800088, 589269, 455708, 366473, 307969, 265750, 241444, 218274, 200932, 188180, 172357, 156656, 140527, 120245, 100087, 95686, 94893, 97533, 81762, 70174, 66809, 68147, 71865, 70406, 71240, 72167, 69349, 72614, 85538, 92517, 90007, 91345, 95493, 91418, 83867, 80012, 76044, 63927, 51510, 48291, 50347, 51356, 46322, 39912, 28091, 28469, 24773, 25662, 17620, 16232, 16224, 19583, 26350, 24810, 24458, 20253, 21239, 18317, 21708, 26091, 32224, 31441]
12162C1441K094k421J722l388L32j670j447l28j058J0876N670m937l498n253j605
12147B6530J0347K873m984p104j20M984Q05j6502k96N477J618k886k973k028m12
12132A5329p138l609O51J2201l575j5996o547R710J3953N599J530J903K759J328
12118B8098j97M777l540o791J242l847r081l827P522l42M75K059j025K609L727
12103B1859o143K400j46l309o674k260O75k268J672M996j957k761k577L676K377
12088I560m341m466K677J0333p588n570o257K460N34o290N48k663N016P05p703
12073a3045m27J0269N318n085o35M764j3572K91O731l855K869M029k742k747M152
12058c685K352n435L597L279O96K55R46k125K610K348l142M171O344k230J299
$$ y = [31441, 33535, 31114, 32836, 29448, 29780, 28110, 26663, 26335, 25277, 36153, 41823, 36886, 33388, 28135, 26530, 36877, 39750, 34766, 27662, 27542, 32526, 33331, 16829, 16533, 22010, 23628, 20742, 17769, 15741, 15329, 8191, 4582, 5233, 17434, 13859, -2137, -8684, 1026, 14979, 20578, 22108, 24011, 26770, 28098, 27901, 32678, 29138, 22347, 23589, 19742, 10661, 6834, 14356, 14014, 14489, 16548, 15523, 18132, 21859, 15716, 18116, 17970, 14661, 7987, 5727, 6402, 4134, 5806, 10802, 8845, 6084, 3507, 7183, 9560, 5219, 753, 3430, 13763, 6175, 605, -5652, -3192, -2658, -8948, -8400, -11063, -6047, -5342, -13045, -13472, -3203, 2115, -2970, -3605, 1159, -12413, -12122, -5391, -9246, -6377, -2348, -5090, -7837, -3685, -1333, -6768, -3171, 108, 804, 1059, 2005, -120, 2490, 4838, 1696, 5867, 12211, 9981, 11280]
12043A1280K523n67j008l664n554J44N379K994l915K817j376K72M425j070l565
12028I115K328n83j0136r620j793j547j839N544Q568O231K22n402K001J36k691
12013E34N517k522k06J816R08M869j152r337j129J567L071j0825n360l428L737
11998a1940P224P594L63n526p243l533K406P09J62K712L540M193L096m079j0928
11983a1250O337K379j6850q356L276O967Q02k249k255P392L102K070O208M83m164
11968f108j818K519Q28j217o437J130J093Q392O652O966J662l574j0823k166N355
11953B454L13L466K670O89l212K24K307O589o16l584j3060r167R675M916M937
11938H601J452p102N29J2233N237R80j922p575l733n35O225K706k277j267n546
$$ y = [11280, 13803, 13236, 12228, 8564, 3010, 3154, 8533, 11527, 7612, 10429, 9053, 9325, 13750, 12680, 9115, 11443, 10860, 724, -8896, -10689, -12236, -14075, -8531, 37, 6268, 6490, 1088, 3089, 3225, 534, 6051, 3529, 3323, 5139, 6047, 10916, 9764, 427, -702, 865, 3936, -6889, -12249, -15677, -11940, -4716, 2878, 3241, -2285, -9528, -13061, -10655, -9946, -9784, -7072, -3532, 661, 3757, -322, -11250, -4913, -2534, -19384, -27740, -24464, -17497, -16695, -18944, -21199, -13807, -10705, -8635, -2427, -1944, -6108, -7926, -5407, -4579, -5796, -12233, -11103, -10010, -1618, 5034, 12000, 13662, 10088, -735, -2901, 2454, 2767, 6233, 8903, 9592, 6380, 6604, 8911, 15500, 14884, 11300, -1760, -10927, -1252, 3664, 8601, 10053, 2951, 3480, 15713, 20950, 21930, 20008, 12433, 8700, 8165, 14390, 17096, 14819, 13552, 8006]
11923H006O821j469n13K762P294K55P629R397J4740J6243L429J0685R463J2445
11909A07187J1110M545Q280Q140m038o349q896j1031m453q686j1802j3968k507
11896F7532r900j0274q218j0993m212m814r089J205L979L929n715k84M03j0249
11882C300K620O947M894R185P76m881l441m948p569j313j822k311J4392p82k792
11867A2255o740j805q042Q81J600o900k866K729O621J854N46n397r736j0113k945
11852b8058P436J1439J2591L079k521k761L096J5441K931n676j2282m346p948
11839g579k417m783l254J0955M122m034o3Q601j16N41K350J55J184P241J1808
11824B4711J4712j400j2053m260o227o866J077J2790L418m163p614M330L501j0608
$$ y = [8006, 14827, 13358, 12845, 15607, 22901, 23156, 30785, 40182, 54922, 71165, 74594, 85279, 94742, 107187, 118297, 122842, 131122, 139262, 135224, 128875, 119979, 108948, 104495, 95809, 84007, 70039, 67532, 57632, 47358, 39140, 28147, 23935, 19121, 10032, 11237, 15216, 19145, 13430, 13146, 13549, 3300, 5920, 12867, 17761, 26946, 27722, 22841, 19400, 14452, 6883, 5570, 3748, 1437, 15829, 15047, 12255, 5515, 3710, -4332, -3451, -1851, -8751, -11617, -8888, -2267, -413, 133, -5264, -15000, -25113, -28058, -20622, -9183, 3408, 6487, 3966, 1205, 4301, 19742, 22673, 16997, 4715, 369, -7579, -9996, -14779, -18033, -7078, -2956, -6990, -7053, 1548, 1432, 1973, 4323, 4478, 5662, 12903, 24711, 39423, 38023, 25970, 21710, 15483, 8617, 9694, 22484, 25902, 21739, 14125, 18455, 21956, 11348]
11810A1348l587K694j050r870p69N650k085k752M011L771K780j21j165l585K867
11795H137K290k294L649K161p872l240l36N34M138p8l073j399m140r37j698j055
11779e213K923J0383J2683M887K648k383K818K735M877N379Q850L176J2956J6736
11765H3455K5285j560k6801k7109k2160j6238o174m173m569j183m555r50K416
11752d316K491q470K891j31J867l581N406J3022P053K193m268l903p345m081L79
11737g93n789K527O529M337K82L888M869j0100o446J359M095N910M558o621l185
11722E420r356j775O60J492L869l448P86L260o552o249n192n396K796M419n626
11707b0892p373j214j887K055L256L836R778j039l192L967l297P747P4k037O635
$$ y = [11348, 7761, 10455, 9405, -465, -1234, 4416, 2331, -421, 3590, 7361, 10141, 10020, 8855, 5270, 8137, 10427, 8133, 11782, 13943, 6071, 2831, 2495, 3029, 7167, 7089, 4016, 2617, -1523, -2460, -4158, -5213, -2290, 8093, 20776, 25663, 28311, 25928, 28746, 31481, 36358, 41737, 50587, 53763, 66719, 83455, 108740, 107180, 80379, 53270, 31110, 14872, 8698, 4525, -44, -1227, -5782, -6732, -4316, -1825, -10295, -7404, -7535, -5668, -9249, -3843, 9179, 16232, 18425, 14157, 10254, 2909, -1172, -793, -6582, -4055, 2474, 6811, 7093, 10981, 15850, 5750, -696, 663, 4758, 10668, 15226, 8605, 5420, -3936, -5711, -5051, -3559, 310, -3138, -2352, 908, -5644, -11893, -17085, -22481, -19685, -15266, -20892, -28265, -29479, -31366, -29311, -26055, -22219, -12441, -13480, -16672, -12705, -16002, -8255, -8181, -10218, -3583]
11692c583N18k083n919o309P211J0513M33P59l819k667l209J933M341N287p728
11677d322j289J1767K396L447K53J071N79K376O633N314o625j6763m316J149K721
11662D391N934n610M91L508n671n979L141l86J496J017K789r99l437M28l284K60
11646a911j284n521R16P965K378m731j870O106J053J518j21k731o572k573m758
11631a2136l795K287J0483M845L883J657q930m11M327q120L057L049j452o681
11617g937P090R390k121o940n679o696l436Q037j08o607j3242m824J5760P284
11603a0029J589L44K536m81Q22P738K283j957q610j0549O25J823Q139M434N966
11588D673j271n635j0315k617m403k919M554Q127M375l271N396L246O467Q317
$$ y = [-3583, -3065, -5148, -11067, -17376, -10165, 348, 781, 1540, -2279, -4946, -8155, -6222, -1881, 3406, -4322, -5611, 6156, 8552, 11999, 12252, 13323, 13902, 16278, 22911, 28225, 21600, 4837, 521, 1670, 4391, 10325, 4715, 5206, 8714, 3043, -2936, 205, -181, 1315, 2332, 5121, 4122, 685, 1113, -2171, -1911, -3195, -8716, -7800, 165, 2543, -2188, -4058, 2048, 3101, 4619, 4498, 1767, -4805, -7378, -12136, -15931, -13644, -3161, 1684, 5567, 7224, -1706, -2117, 2210, -5910, -2853, 196, -1256, -7937, -847, 8543, 6422, -518, -6197, -12893, -16329, -8292, -8400, -15007, -28249, -33073, -17313, -10029, -8440, -8096, -5560, -6041, -5219, 2519, 4802, 2845, -5765, -16314, -15689, -13866, -5727, -1293, 4673, 3402, -2233, -12548, -15165, -19568, -22487, -17933, -9806, -5431, -8702, -3306, -60, 6407, 14724]
11574A4724J741o825m688k172l498n357P26l109M148K119k738j58l560j549J586
11559h610n703j629O382J2710n077l81N773k631k421m500p601M939K617k099j319
11544i550R631j779J224l818j2009K791J1127P477o15k049j390P010l491j0914
11530f355j974J267l838k606j0223O779R585L721P565o14q319m35L68l88n258
11515a0725p275n095L033J2547J0015m859M1k440j29O83K167J009q442k011N811
11500e670K347O675M605Q70q389k755k073L90K532m476j706K461j337M265K342
11485H1o414N89o771L975J060l56L606L193M39n348K059q513O936K975n287m880
11469a2656M712q44l775M154Q414P6k774j258o002J409J620l147P45L802l562
$$ y = [14724, 16465, 9640, 4952, 2780, -718, -6075, -5349, -8458, -4310, -2191, -4929, -5087, -8647, -10196, -8610, -14313, -15942, -9560, 3150, -1927, -2308, 3465, 834, -1587, -6087, -13688, -8749, -6132, -8231, -9550, 81, -1698, -474, -4292, -16301, -13510, -2383, 5094, 4479, 2430, 1040, 8050, 4559, -6355, -8329, -7062, -10900, -13506, -23729, -16950, -7365, -3644, 3921, 3307, -5012, -5447, -5079, -5467, -10725, -18000, -23095, -20062, -7515, 2500, -2359, -2318, -4758, -4887, -4204, -2037, -1028, -9470, -11481, -5670, -3323, 3352, 7957, 8827, 438, -2317, -4390, -4000, -1468, -5944, -7650, -5189, -6526, -2261, 81, -6333, -5744, -12515, -8540, -7480, -7836, -4230, -1037, -598, -5946, -3887, -12400, -5464, -2489, -7776, -12656, -7944, -8788, -12563, -8409, 5, 81, -2693, -3951, -9953, -8544, -6924, -10071, -9326, -5524, -9086]
11454i086m699J464m237R70K888N426l566j900L314j1330k260L588J102L727L55
11439a4244N620K816q15o85n67K935j779K083o01l793k44M009p53J770j357q567
11423a4172o491R77N486K341M026l413j284R568Q100j514r10p004k953m647p322
11408a9212m516N358M287J2864p713k701R940O101M119J385l291l439K499M711
11394A0392J063k000m298l569p281J029k9J64j777j759M50m372R54J183m079J680
11378a2249M564O877m537j614k570K01M008M514N270L301o063j554q562q744L146
11363a4012O926N344O414n588n903l901J55m02k270j018l608p929J615N907Q699
11348i571N630l915o408N116P099P03k157M329M367J237K517j0814o854P866m296
$$ y = [-9086, -13785, -12321, -16558, -15588, -12700, -7274, -10840, -12740, -9426, -20756, -23016, -19428, -18326, -14599, -14244, -8624, -5808, -6623, -7308, -7875, -4940, -6719, -4636, -5237, -9030, -9274, -5265, -6018, -4248, -5605, -14172, -20663, -19686, -14200, -11859, -7833, -11246, -12530, -2962, 5138, 3624, 2714, -4290, -7243, -11890, -19212, -23728, -18370, -14083, -1219, -8932, -11633, -1693, 4408, 8527, 9912, 6621, 3182, 5681, 10392, 11455, 9455, 5157, 1588, -5693, -4664, -4693, -4529, -6306, -8065, -7615, -11987, -11033, -9850, -13929, -12249, -7685, -808, -5345, -6959, -9529, -9328, -5320, -806, 4464, 7765, 1702, 148, -8414, -17158, -14012, -7086, -1742, 4672, -916, -6819, -10720, -10565, -10967, -13237, -14255, -17863, -25792, -24177, -18270, -9571, -3941, -7856, -14264, -9148, -2049, -1346, -3503, 826, 5193, 6430, 8947, -1867, -8721, -855, -5151]
11333e151j3311M868M375m742N40m00Q065K215l500N699k441m124o074o214K345
11318a7850M942R890J732o03O947l243o531m963n377Q177L810j489o357l010L381
11303a0544k22M847r417o049L959L528J233l36K449l793N373O071M636l451n385
11288g101p534o272N797O538M870J227K534K852n983p468o905K367J754j188O994
11273g518J038Q24N936R107O402o260j3037m862N627J71k330P86L274l053p59
11258d654J439K0p791j0112J025O604Q098j752p551n43M036M419L411j441n200
11243i992J42m291m427q55J282Q876M564j779p141j168P27q61l272P419J79l77
11227a0974l458K190K078n061K307Q652o24o601o682L573M047N371L938r003o186
$$ y = [-5151, -18462, -13594, -9219, -13961, -13421, -13821, -5756, -3541, -7041, -1342, -3783, -7907, -13981, -20195, -17850, -12908, -3018, -1286, -1889, 5058, 1815, -4716, -9679, -15056, -6879, -3069, -4558, -10915, -13925, -10544, -10766, -5919, -15336, -21385, -17426, -13898, -12665, -13001, -10552, -14345, -8972, -2901, 1735, -1716, -7101, -14635, -20907, -15110, -8572, -3702, -2475, 59, 2911, -3072, -10540, -17445, -15078, -13324, -14512, -7518, -6480, -5656, 280, 9387, 15789, 9529, -3508, -8370, -2743, -2572, -4902, -4116, -842, -3895, -4654, -3215, -3195, -10986, -21098, -20073, -13469, -5371, -7123, -14674, -15217, -11181, -6762, -3351, -4792, -9992, -9850, -14141, -18568, -19423, -18141, -9265, -4701, -6480, -13621, -14789, -14062, -14923, -18195, -10776, -10597, -10974, -14432, -12242, -10164, -15225, -12918, -4266, -4890, -11491, -18173, -14600, -10553, -5182, -1244, -10247, -16433]
11212a6433J0723o680l989n93N810M774O438M774m973l280K755L844j393j1115
11198i338j41J451Q012k590j285J359j949n720J268O275K605J5172O025r757j4221
11183b834r784j17M74m969J986J1703j719j062K619n234m089K503O286L392r205
11168a0050m93j888P80j097K191Q666M287n117L861m235o04j261o772Q79K542
11153h311k243n269l04N080j920n022l342l572n07K763O32m105M936J0086M972
11138f126n940k256P29N573K636O009P839J1098L313O138J6466K6861K0932L247
11124I6519k4545l2017j2165j5227j2928p072p077J630Q46n837M78R585l280k12
11110a1302p759j518j949n253j328M098L419Q173K650M545l557o450o783q34j052
$$ y = [-16433, -5710, -12390, -16379, -16972, -11162, -6388, 50, 4824, -149, -3429, -674, 3170, 1777, -9338, -9479, -8028, -16, -2606, -3891, -2532, -4481, -10201, -8933, -2658, -53, 15119, 21144, 11387, -2834, -12618, -12735, -12261, -17230, -15244, -3541, -5260, -6322, -3703, -8937, -13026, -10523, -4237, -845, -10050, -10543, -12431, -11651, -12748, -10557, -1891, 2396, -2721, 1140, -3095, -3699, -4960, -11732, -10853, -8311, -10554, -15823, -16127, -11047, -12967, -17989, -21331, -24903, -25410, -22647, -22015, -26120, -21184, -11098, -6126, -12066, -14322, -13593, -8020, -5384, 625, 8464, 19562, 22875, 29013, 45479, 72340, 93272, 96519, 71974, 39957, 27792, 12565, -363, -7435, -14512, -12882, -12036, -17873, -17395, -7810, -11090, -11302, -19061, -20579, -22528, -27781, -29109, -25011, -21592, -13419, -10769, -6224, -9781, -16231, -23014, -23848, -24900]
11095b4900O136Q968L582N143j056n346Q611M711L607P237P319N653J045m896
11081B5814p958L444n97p94n805k125r410r692J057P60o833p736K269N073k893
11066a5426O532Q002L585k740J817j769K519J222k056l285O297j099j706q04N694
11051F783L35J64K923n227j0301l053P39J0242P860m59K099p710o210k72m215
11036f302n778j013M242M630k595q38J245n938J08L393r807L732J304P60O871
11021e986P555L353N705P558K283o485o137K079k402n467n895k731l815n093Q007
11006g471P115J553l428k369m611N977m141J063L182j045k703k793l929J680P547
10991d373J4669L306J67L083j371n367m983l279K09Q09J607M274r168j3267j2911
$$ y = [-24900, -18764, -9796, -6214, -1071, -2127, -7473, 1138, 5849, 9456, 16693, 24012, 29665, 30710, 25814, 17856, 21300, 20703, 19909, 14104, 11979, 2569, -7123, -6066, -5306, -12139, -19875, -17606, -12533, -15426, -8894, -892, 2693, -47, 1770, 1, 2520, 3742, 1686, -1599, 4698, 3599, 1893, 1089, 6783, 7118, 7282, 10205, 4978, -5323, -8376, -7637, 2605, 10465, 10006, 12105, 4395, -1815, -2087, -6302, -12080, -13093, -8851, -4221, -6816, -7654, -6409, -12347, -12239, -8846, -18653, -14921, -13617, -12857, -5986, 1569, 4922, 10627, 18185, 20468, 13983, 7846, 9925, 7523, 2056, -3839, -6570, -10385, -15478, -7471, -356, 1197, -2231, -4600, -9211, -3234, -7375, -6312, -3130, -4175, -6878, -9671, -13600, -11920, -4373, 10296, 13602, 13769, 16852, 15481, 10114, 5131, 1852, 2061, 2870, 4477, 8751, -417, -13684, -26595]
10976b6595R865J5615O14l737Q461M993q30k654p456o522N12L477J697M788P701
10961I929K373N54l270q003m156O507o333k865j896m623N422O89k325J438J5866
10946I307R409k459J15K954k146r892j0600p654J938K26N503J516K05k423p66
10931d767k833p14O51N501K333k812r93K109K600j777K07r67j158n287j4284m53
10915b2644M800N355R218N611m598M552m5q937m64R63j816j485j000j872L498
10900h864K768q824l247N156p11L654P89k985k95N076N36J858L464k106m13R117
10884D973O054p55o633o326O001M233M33J761q634o664J514o64k037l934j639
10869a2317l896O917O340J877p423k845m716n204K133L999N081K307Q58N538L184
$$ y = [-26595, -16730, -1115, -501, -4238, 4223, 9216, 8386, 5732, -1724, -8246, -7734, -4257, -2560, 2228, 9929, 12302, 12856, 9586, 1583, -2573, 3934, -2399, -5264, -7160, -11783, -6361, -5672, -7997, -6559, 9307, 18716, 16257, 16372, 19326, 17180, 7288, -3312, -10966, -9028, -8802, -3299, -1783, -1578, -4001, -4767, -7600, -8314, -7663, -2162, 171, -2641, -3634, -1525, 1075, -702, -495, -1462, -2620, -7907, -22191, -22644, -17844, -12489, -3271, 2340, -2258, 2294, 2249, -6688, -7152, -6189, -8005, -9490, -10490, -12362, -8864, -6096, -14920, -18167, -13011, -13722, -10068, -9279, -12264, -12559, -7483, -6947, -5089, -1625, -3731, -4144, 4973, 11027, 10272, 3639, -2687, 3314, 7547, 7980, 9741, 1107, -5557, -4043, -4707, -6744, -10678, -12317, -16213, -9296, -2956, -1079, -8502, -11347, -16063, -21267, -19134, -15135, -10054, -7747, -6889, -1351, 1833]
10854A833L924K724p871l597j941j942J663n319m259n085N64n538j0304K50J3136
10839b1762R786R556K054n550p72N731l932m534o058n016M908J7555P72p635o851
10824a1748J12Q826Q18p088q823P73O558K0r2r406l153J1094Q256K363l298N232
10808D44M779r05l877l991N113j40n832k610l286Q9J295O02L905o612o73j012
10792a2711k745K252N852J2259O651L638j084q778j5814p551K171j267J0388P774
10778A035k667l876R127L502n589n888n729k703R712R871k419K975K373J279n891
10763E112j554k90j2039N19K46J266j248M051K808K435m060q33l907j924k904
10748a2322k086n064L733K750o899J1635J2719P230R560l545q112q463j545j0285
$$ y = [1833, 5757, 8481, 610, -2987, -4928, -6870, -5207, -10526, -14785, -19870, -19306, -24844, -35148, -34898, -21762, -11976, -2420, -366, -5916, -6688, -957, -4889, -9423, -15481, -20497, -15589, 1966, 2738, -4897, -11748, -11636, -2810, -1992, -9080, -17903, -17130, -10572, -10552, -10644, -20050, -23203, -12109, -3853, -1490, -4788, 444, 5223, 4318, 441, -3550, 1563, 1423, -4409, -7019, -10305, -10216, -8921, -8319, -4414, -11026, -11699, -12711, -15456, -13204, -7352, 4907, 11558, 15196, 14112, 5334, -10480, -18031, -15860, -17127, -6739, 1035, -1632, -5508, 3619, 7121, 1532, -4356, -10085, -12788, -3076, 6795, 4376, 7351, 9724, 11003, 5112, 3558, 3268, -8771, -8252, -8006, -6740, -7988, -3937, -1129, 1306, -2754, -3587, -7494, -9418, -12322, -14408, -19472, -15739, -12989, -19888, -8253, 4466, 11696, 21256, 17711, 9599, 1136, -409, -10694]
10734a0694l377p4M377J1921J45l204p65j816M571Q938N293j205L642p139m162
10719F451l140k137K530k991k380K886L300M375n733p859q84j999N896O570p94
10704D091N031j259j584l511r693R64Q760M012J1798J1298M37q849o136j967n215
10689H177p311k477L155r27k872L749N333J789j812O660O95j4938j1591p4L325
10674i119J565R143L654J789j238p665L747R733J506m183P97L219j354m62J286
10659A2418O834P013j1220j996j156j3649m586j680K330j007K685j126l101O04
10645g637L944N61j454q310j361O641Q187m351o880n953J6213R453j063m118P24
10630D596j840M9N411Q484l02m321k10q552J251J723k003J091l118L35j522j144
$$ y = [-10694, -14071, -14145, -9768, 2153, 2298, -906, -1671, -3487, 1084, 10022, 15315, 14110, 17752, 10613, 6451, 3311, 1174, 3704, 713, -1667, 1219, 4519, 8894, 3161, -4698, -5582, -7581, -1685, 4885, 4091, 9122, 7863, 6279, 2768, -6925, -5961, 2799, 6811, 18609, 29907, 30344, 21495, 15359, 13392, 8177, 866, -1611, 1544, 617, -2255, 1494, 6827, 8616, 6804, 13464, 14159, -779, -12370, -12444, -9119, -7554, 1589, 5243, 7032, 5794, -1871, 1876, 11609, 13115, 8932, 9729, 12948, 11594, 11132, 12418, 19252, 26265, 15045, 13049, 11893, -1756, -6342, -8022, -5692, -6699, -4014, -5140, -8241, -7637, -3693, -3132, -4586, -12896, -14257, -7616, 571, -3780, -10660, -16613, -400, 9053, 7990, 3872, 4596, 2756, 2805, 8216, 16700, 16398, 12077, 11867, 3315, 4566, 6289, 4286, 5377, 2259, 2594, 1072, -72]
10614g2J063J88L71P409l981n264m342K559K371Q72K194J787K678J210OL758m098
10597H709m737j195K852p67j375k364K94ll500l764l496K499N14J736j007q87
10581f491K91K908N977r13K089l299j0081j368O005J5661O946j1156o314M97n107
10566d355L934N997m108K609K757k691k014J926P492O157o381q589k404k584j268
10551c522j672N877J1203J177m493k168K943J369K160n81Q859O643L662L901l889
10536C1469k590P622Q858J0507Q635J1278J8617L3198P0344J20558K39998M43563
10524A002057M83233J13427l31747n16006l10599j56971q5238n7704l4910k3242
10514H2300j3534j0333r904j1398o665q933L78l231m673j596P76m79l789j809
$$ y = [-72, 991, 1179, 1550, 8959, 4978, -286, -4628, -2069, 302, 1174, 3368, 5155, 7833, 9043, 9049, 12807, 8709, 3972, 2777, 5629, 4862, 3487, 1123, 1417, 1414, -2086, -5850, -9346, -6847, -6333, -4597, -5604, -6491, -6200, -3292, 2685, 1772, 3861, 562, -9519, -10887, -4882, 10779, 17725, 6569, 255, 752, -4355, -421, 5576, 1468, 4077, 6834, 4143, 2129, 4055, 11547, 17704, 11323, 2734, 330, -2254, -3522, -5194, 683, 11886, 13063, 8570, 6402, 9345, 10714, 12874, 12293, 21152, 27795, 31457, 35358, 31469, 28879, 36501, 45359, 55866, 64501, 75779, 94396, 127594, 197938, 318496, 558494, 1002057, 1485290, 1598717, 1266970, 750964, 440365, 283394, 198156, 140452, 105542, 82300, 68766, 58433, 48529, 37131, 30466, 21533, 21911, 18680, 14007, 12411, 13187, 12708, 8919, 7110]
10500G110R274K889p968o147l674j673L946K36r12k777p61n064n738M870M752
10485a637j237L878N107M642L283K990j0260K292J618L970K035k232n228l446
10471E775J281K233j86K016P145j034k059M417p480l865J932M773k339K659K975
10456A8243o772m069L563j962q769P464k04k525l721j921P05Q646N608o631k555
10441E100o7N910M460K294m298no163K514k421k563K191p501M719K085q007J333
10425d19M561Q63O082M697M547m875j264m787j476l076m486L42l302P62r41N36
10409b236R570R120J1405j408j4266q269J762m83o536l624l80l867P865M691m02
10394B942N95j113l08P033p871K057M598M685n96j1015j0894P092Q029k793p0
$$ y = [7110, 16384, 19273, 11305, 5158, 1484, -189, 3757, 3993, 3081, 304, -457, -5521, -11259, -6389, -1637, -2874, 1004, 6111, 10753, 14036, 17026, 6766, 9058, 10676, 14646, 16681, 14449, 9221, 5775, 7056, 9289, 9103, 11119, 18264, 17230, 15171, 19588, 12108, 8243, 10175, 14948, 12609, 15268, 18243, 11471, 7402, 10965, 9003, 234, 7698, 7494, 4969, 1248, -673, 32, 8678, 14286, 7655, 5100, 5033, 10943, 15403, 17697, 13399, 13394, 7231, 9745, 7324, 4761, 6952, -549, 4170, 6255, -1752, -419, 4142, 5005, 11087, 15784, 20331, 15456, 14192, 9405, 7929, 4853, 367, 709, -2593, -1831, -2772, -2236, 7334, 16454, 27859, 26451, 12185, 3916, 5678, 5195, -1341, -4965, -5345, -9212, -1347, 3344, 2942, 3537, 2424, 2116, 9149, 1278, 3335, 7933, 12618, 12022, 1007, -9887, -2795, 5234, 2441, 2371]
10379B371O26j8J185l060k007q096l469P694O178O326K821R50K159l687N00K767
10363A3240l659K90L185j648J89l079k947r807k320K493O696N378m050m91Q319
10348A1789Q547M454O164J8657J2468J2474J3523P377p241j4709k4090j4627p933
10335B6853P63L047l690j228J2390L725m455j801P115n821P223P483K220R019
10321F2843M530n08J3535K8789K9430M6085P6817J31116K34906L78485M64011
10310A470039L10501o7165l99775m52674l11790j72926r8069p3498n4326k9740
10300A20577j0447n407j4643j2464j0638r007p292L196p679j4825n894k721k027
10287B0729l162M800j543m97M04K257l375K202j318l980P23o314j143J398J590
$$ y = [2371, 2997, 2979, 4164, 1104, -903, -8999, -12468, -4774, 1404, 7730, 10551, 11501, 13660, 9973, 10473, 13240, 9581, 9871, 13056, 11408, 11597, 8518, 5571, -4236, -6556, -4063, 2633, 8011, 3961, 3470, 11789, 20336, 24790, 30954, 49611, 62079, 74553, 88076, 95453, 88212, 73503, 49413, 34786, 26853, 27616, 30663, 26973, 25745, 38135, 41860, 37405, 35604, 42719, 36898, 44121, 51604, 53824, 62843, 67373, 66865, 80400, 109189, 138619, 184704, 261521, 392637, 627543, 1006028, 1470039, 1780540, 1713375, 1313600, 860926, 549136, 376210, 278141, 204643, 150317, 120577, 110130, 104723, 90080, 77616, 66978, 57971, 50679, 53875, 46196, 31371, 25477, 22756, 20729, 17567, 22367, 20824, 20327, 20731, 22988, 19613, 21815, 20497, 16517, 17240, 10926, 9783, 11181, 12771]
10272A2771n42L602o65r598l664j525o605J2627Q932m140j021j0465r71n156K210
10257d210l958r60J2754J850o685N143K619J0444J3676j317k436N770P412M790
10243D4892J001Q438K5581K4733K2364K0674J2739L997l66m620r388j4771j5471
10230A19803j8300k1592j6091p777j6518k2304j5955N570Q18o904K558M317k682
10217D943K237M559J677K227o866r206M05j030k44K756P598O421m870j415n544
10202C648l612R380m748m497N72m294M337J1645J2498m545j187K332K30k590Q678
10187B7847K276j467j44R767O23k591O532M833J1391K1028K9166O2608J12492
10174B84361J67229J47572L4176p2202p7728K3358R0250M4130p6574j71119j43485
$$ y = [12771, 12229, 15831, 15166, 5568, 1904, 379, -6226, 6401, 15333, 11193, 10172, -293, -1264, -6420, -4210, -8168, -9128, 3626, 5476, -1209, 3934, 6553, 16997, 30673, 29356, 26920, 32690, 40102, 44892, 45893, 54331, 79912, 104645, 127009, 147683, 160422, 164419, 164053, 159433, 150045, 135274, 119803, 101503, 79911, 63820, 56043, 39525, 17221, 1266, 6836, 7654, 750, 3308, 7625, 4943, 7180, 11739, 13416, 15643, 8777, -429, -24, -1054, -1298, 1458, 9056, 15477, 10607, 9192, 3648, 36, 9416, 4668, 171, 743, -3551, 786, 12431, 24929, 20384, 19197, 21529, 21759, 19169, 27847, 30123, 28656, 28512, 38279, 38902, 36311, 42843, 47676, 59067, 80095, 109261, 171869, 284361, 451590, 599162, 633338, 561136, 483408, 506766, 597016, 641146, 564572, 393453, 249968]
10163B49968q3906m4490l0314k3756p170p502j2840n609j110K730o060m125k712
10150B3104N81J421O462o362l462l647k122l226o876m396k092o11r52O333M668
10135H823K261l252J427p917o144Q450l760m946n477P945K322p075j082J52N074
10120c199j874k378k557O1L365P636J942J695n320j0280J584k626j437M738R339
10105F89J0090j27N726j593n729l408O559Q62M897j0405q880K256O477L284M599
10090A5297j230N512M641j468L22j2748o903N322L114j468Q880P63q789J020P600
10075A9865L580K31l272o01j688N467p472j246k536M566k861o939l333n050j39
10060a428Q698Q923j692L68l936n854M887N11J608j0533J349Q44k772Q473K438
$$ y = [249968, 166062, 121572, 91258, 67502, 60332, 52830, 39990, 34381, 33271, 36001, 29941, 25816, 23104, 23685, 25106, 31568, 25206, 21744, 18097, 15975, 12749, 5873, 1477, -615, -1226, -2178, 4155, 8823, 11084, 7832, 9259, 1342, -4802, 3648, -112, -5058, -10535, -2590, -268, -7343, -8425, -8273, -3199, -5073, -7451, -10008, -9947, -6582, 1054, 2996, 4691, -629, -10909, -9325, -11951, -13388, -8650, 689, 10779, 10652, 16378, 14785, 9056, 5648, 12207, 13069, 17966, 7561, -1319, 937, 7414, 10698, 15297, 14067, 19579, 24220, 22752, 23074, 10326, 3423, 8745, 11859, 10391, 19271, 20034, 11245, 12265, 19865, 23445, 23676, 20404, 19803, 18115, 23582, 16110, 14864, 12328, 16894, 14033, 7094, 3761, -1289, -1428, 7270, 16193, 14501, 14869, 10933, 5079, 9966, 10477, 12085, 1552, 2901, 3745, 973, 9446, 11884]
10045A1884m134J682L666o978m137k902Q902J258n83M488j407K993j116l296N306
10030A5626K779n92j221K742j215k359p131j787O589J1222J0606n387o438l742
10016A9692p170m970m054l989M544L030N24m89P781L387j479P7m27k574j692m499
10000G692K36J178r417l964N993N748p760o998N428J1132k543o754k465L090N246
9985E842l010J572J5738O717R249J1880o909j7367j9160M94N846K855J865M889
9971B0501R789N832m83p13k278j2812j5961q733O305M741P939k541L679J061L847
9956B0173o421p660K479J606K198k592n957M131J992M555J983J189J428O36r118
9941A0622L616j038M95j549l517l611K086J0389K955J338o371j0292q572N300
$$ y = [11884, 7750, 9432, 13098, 6120, 1983, -919, 7983, 9241, 8658, 13146, 11739, 14732, 13616, 10320, 15626, 18405, 17813, 16592, 19334, 18119, 15760, 8629, 6842, 13431, 24653, 35259, 29872, 23434, 19692, 12522, 7552, 3498, -491, 4053, 7083, 7607, 7118, 14899, 18286, 16807, 16884, 16457, 13883, 12191, 7692, 7928, 9106, -311, -4275, 1718, 7466, -294, -7292, -1864, 9268, 6725, -29, -2494, 596, 5842, 2832, 4404, 20142, 26859, 36108, 47988, 41079, 23712, 4552, 5046, 10892, 13747, 15612, 20501, 30290, 36122, 35639, 34926, 32648, 19836, 3875, -4858, 1447, 6188, 14127, 11586, 15265, 16326, 20173, 13752, 6092, 8571, 10177, 12375, 9783, 3826, 7957, 9949, 14504, 16487, 17676, 19104, 19740, 10622, 14238, 13200, 13695, 12146, 8629, 5018, 7104, 17493, 20448, 21786, 15415, 5123, -3449, 1851]
9927A851M493M937P181Q01M158J0473n35k833q387j1296j486J131o254n115J4256
9912A3375N352r37l345n351L177O054p63j051M64m817P668Q923j241r30n025r278
9896A2275o837J1763O562o001n518M026P40N486M131M583O470L892m196K447N70
9881D0393M441n399j0765k336j345M053k779l269K610K07o38m576n317p612J065
9866H733M998l722K909j6o12p84P657J023k203p621L587q85k186j1989J0130Q686
9850A7705K489j853j158L402k870K21j484p57m159l769m667M259n082J009p95
9835B491j991N755R549k975p331L365P500Q749K644R85p734n430R772j809p288
9820A6252j4562k963r00J0981Q261j669n351O728P343O267j654j238q830J442
$$ y = [1851, 6344, 11281, 18462, 19263, 23421, 33894, 33359, 30526, 22139, 10843, 9357, 10488, 4234, -881, 13375, 18727, 17790, 14445, 9094, 12271, 18325, 17562, 16511, 16975, 12158, 19826, 28749, 27508, 26578, 21553, 12275, 5438, 17201, 23763, 17762, 12244, 16270, 17010, 22496, 26627, 31210, 37680, 41572, 37376, 39823, 40393, 44834, 39435, 28670, 26334, 24989, 29042, 26263, 22994, 25604, 25811, 25173, 20597, 15280, 7668, 8733, 13731, 10009, 12918, 12902, 12290, 11506, 19163, 20186, 17983, 10362, 13949, 13064, 10878, -1111, 9019, 17705, 20194, 18341, 17183, 20585, 17715, 17936, 16452, 15695, 11536, 7767, 3100, 7359, 2277, 3286, 2491, 500, 6255, 15804, 12829, 5498, 8863, 16363, 25112, 27756, 28741, 21007, 15577, 25349, 23540, 16252, 1690, -1273, -2173, 8808, 17069, 15400, 10049, 16777, 24120, 30387, 28733, 27495, 18665, 20107]
9806B0107J5163K5176M0916L3087L589k1617l6773k7744k6009q217L677j0663
9794A0692q994m492K677R326P770J659m119P604R123j057j270p987j452l053l192
9779A3235m014N357M19K357J0148K596J444j319q38l714l190J509j1422k1J0647
9764B3194l380q219M597P20o28m111N666J9164J6812n377k7349l3538k1314O688
9750b7075K3351K8491K2549J3453m356k174M344j3176k6238j8378j8560o005J0708
9737a3066K3674J6515Q139j040j2249q127P812J0334m996o505j655m577j70O638
9723B0727r279Q93O365j196n828M53j809j449L465N171k099K742J858o612n471
9708G931k310P243O836M722P399L845m706n389k000m250J150m634N534R211J388
$$ y = [20107, 35270, 60446, 101362, 134449, 138038, 116421, 79648, 51904, 25895, 17678, 21355, 10692, 1698, -2794, -117, 9209, 16979, 18638, 14519, 22123, 31246, 30189, 28919, 20932, 19480, 16427, 13235, 9221, 14578, 14997, 17354, 27502, 30098, 31542, 30223, 29385, 25671, 22481, 23990, 12568, 12547, 23194, 19814, 11595, 16192, 16912, 16284, 12173, 17839, 37003, 53815, 48438, 21089, -12449, -33763, -27075, -3724, 24767, 47316, 60769, 56413, 54239, 58583, 45407, 19169, 791, -17769, -23774, -13066, 10608, 27123, 35262, 34222, 21973, 13846, 21658, 31992, 26996, 20491, 18836, 14259, 14089, 20727, 11448, 12341, 18706, 17510, 11682, 12135, 10326, 8877, 12342, 17513, 15414, 18156, 20014, 13402, 7931, 5621, 12864, 19700, 24422, 31821, 35666, 30960, 25571, 23571, 19321, 20471, 15837, 21371, 30582, 31970]
9693C1970r683r145J668L211q03K223j66j240J1424N156k252j0158K060L277n78
9678B6964P769J366l198l795n968j767J1318L587R159J6001M934J323p088j545
9664E9060m83j8J641J0097P329J1912K295P886m126q259m029m564r885j4645O757
9649F0968K31N681L323j920o425P09j791q134P645J4530J6879J164M831N626R764
9634A13081J6877P567J3923J7092K1426K4729K2448K8592M7260O2015Q3547J37713
9622E96270K06997K99104M36494N51297M87942J56554k63647n26879n22214l86571
9612A035347k53742j72587j30025q3532o2031n5990l6615k9891j8603k3090j5477
9601A53764j8439p875j357k690p118p604k584q675n704m574n743N092r451n295
$$ y = [31970, 22287, 13142, 14810, 18021, 17218, 19441, 19275, 18035, 29459, 34615, 32363, 22205, 24265, 27542, 26964, 34733, 36099, 32901, 29106, 23138, 21371, 32689, 36276, 45435, 61436, 66370, 67693, 60605, 59060, 58577, 58559, 60200, 70297, 77626, 89538, 91833, 99719, 95593, 87334, 83305, 78741, 68856, 54211, 60968, 61199, 66880, 70203, 68283, 61858, 62567, 60776, 52642, 60287, 74817, 91696, 92860, 97691, 103317, 113081, 129958, 137525, 151448, 168540, 189966, 214695, 237143, 265735, 312995, 375010, 458557, 596270, 803267, 1102371, 1538865, 2090162, 2578104, 2734658, 2471011, 1944132, 1421918, 1035347, 781605, 609018, 478993, 395461, 333430, 277440, 240825, 210934, 192331, 169241, 153764, 135325, 127450, 126093, 123403, 116285, 108681, 106097, 97422, 91718, 87144, 81401, 86493, 77042, 71747]
9587G1747J124n816p732l772j0266O4K816N798N85n694m655m170L79J0090P456
9572E7954J064L482L237P196J654j1668l813N353O173Q353j298Q652J0012K1069
9558A17420M1244N8607P4888P2656M0660M896k696l0622o1928q7738p0032m0000
9546A17355j5622j2410j3868j0631j081p093q936J013m92M687L797j813O249k517
9532E8638o252l526K876L528J663l794N227J170n542O68j247j298L002K971M551
9517F2635M555l112k761l24K251j869M481o827o755N24n705l142n17J363N34L20
9501D5651L948K295j053o536j2535l522k357L230k456j607M943J94R05l528p25
9486B6847o35r27n74P561M582J682k004j0346O609J053N842q14j739K308L893
$$ y = [71747, 72871, 67055, 59323, 55551, 45285, 45349, 48165, 53963, 54548, 48854, 44199, 40029, 40408, 50498, 57954, 59018, 62500, 65737, 72933, 74587, 62919, 59106, 64459, 70632, 78985, 77687, 86339, 96351, 117420, 158664, 217271, 292159, 364815, 405475, 410371, 407675, 377053, 315125, 227387, 157355, 117355, 101733, 89323, 75455, 64824, 63743, 56650, 47714, 48727, 48235, 52922, 56719, 54906, 61155, 58638, 52386, 48860, 51736, 55264, 56927, 53133, 58360, 59530, 53988, 54656, 53409, 52111, 55113, 58084, 62635, 67190, 64078, 61317, 60993, 63244, 61375, 65856, 59029, 52274, 52798, 47093, 43951, 43434, 44797, 45331, 45651, 49599, 51894, 50841, 44305, 31770, 28248, 25891, 29121, 26665, 25058, 30001, 30195, 31100, 27572, 26847, 26212, 25285, 24711, 32272, 36854, 38536, 36532, 26186, 32795, 33848, 39690, 38876, 37137, 39445, 43338]
9471D3338M047o046m522R648J0782K395K197J726n127p678L568M259n599L341
9457E6329M831K498J065p449L369q97m953m690m162l83m201p301N80J2492k777
9442D4351o760J317L303J192l029M286O864Q297J1561k80n168K713M888L037p696
9427F8876l555N403l809P702j778k858n120K33J2052J675o399K106r91m497j1294
9412E7746l892j211k20j792L527r26j5079q895m236J270M685j780j793M634J0747
9397D2785n044o523Q317R674K482M797R538M022j109p303o127k945m979J744N737
9382E5066J7565K166L16l4L74L088J53o017N676J2697L520L873L358M7q03M146
9366A05191Q222l821j8482q481k817J394M127J0595K356n192M349K982m782M525
$$ y = [43338, 47385, 41339, 36817, 46465, 57247, 59642, 61839, 63565, 58438, 50760, 54328, 58587, 52988, 56329, 61160, 63658, 64723, 57274, 60643, 59746, 54793, 50103, 45941, 45558, 41357, 34056, 34636, 47128, 44351, 37591, 38908, 42211, 43403, 40374, 44660, 51524, 59821, 71382, 71102, 65934, 68647, 73535, 76572, 68876, 65321, 70724, 66915, 74617, 72839, 69981, 64861, 65094, 77146, 78821, 72422, 74528, 73537, 69040, 57746, 53854, 52643, 52423, 50631, 54158, 53232, 38153, 29258, 25022, 26292, 30977, 29197, 27404, 32038, 42785, 37741, 31218, 39535, 49209, 51691, 56488, 66026, 70048, 68939, 61636, 55509, 52564, 47585, 49329, 55066, 72631, 74797, 75113, 75079, 75453, 78541, 78694, 72677, 78353, 91050, 94570, 98443, 101801, 101848, 101045, 105191, 113413, 109592, 91110, 82629, 79812, 81206, 85333, 95928, 98284, 93092, 97441, 100423, 95641, 100166]
9352A00166n74q964j0299K403L282j492Q183M643L189n700o235K669N162P113
9338A03546J066M149Q156J832j2811p009m636Q287Q061j040J481J0180R638M164
9324A35064J417L33L340K998k814n988l828j45J140J252q300k664P016M119J226
9309A34166J2515K436o616K277o32n068m851m444l384q932K183P153P290J1348
9295A45441P952N04N999k355r107l083l218l004j62N930N045m952o936k532K044
9280A37566l655Q921P398j0837o999k552n782l72R24j663j844l878P046Q823K918
9265A36014R915O973J802L370j045n010P80N838q39p300Q811R829P029O79p659
9250A69187L185Q845m087J167L248n33q424j5941k682j2755j3206p169j1527q60
$$ y = [100166, 99592, 90628, 80329, 82732, 86014, 84522, 92705, 97348, 100537, 94837, 88602, 91271, 96433, 103546, 104612, 108761, 116917, 118749, 105938, 98929, 94293, 102580, 110641, 109601, 111082, 121262, 130900, 135064, 136481, 136814, 140154, 143152, 140338, 134350, 130522, 130377, 131517, 132769, 124469, 121805, 128821, 132940, 134166, 146681, 149117, 142501, 144778, 144146, 139078, 134227, 129783, 126399, 117467, 119650, 126803, 134093, 145441, 153393, 153897, 159896, 157541, 148434, 145351, 142133, 139129, 138967, 144897, 149942, 144990, 138054, 135522, 137566, 133911, 142832, 150230, 139393, 132394, 129842, 124060, 123688, 124612, 122949, 121105, 117227, 124273, 133096, 136014, 145929, 152902, 154704, 158074, 157029, 152019, 152799, 158637, 157798, 150498, 159309, 169138, 176167, 176846, 169187, 172372, 181217, 177130, 178297, 181545, 181012, 172588, 156647, 153965, 141210, 128004, 120835, 109308, 108448]
9236A08448M314J125J0089Q052P207J4879M832N160L816L772L158L329O828L530
9222A88539K576J704n775l803O574n836j1436N693N80N832J1574J872J2893P841
9208B18828k724k756M960N424j0559j0449k093J0850J2581J296O445J0339n09
9195B41633L007P566J5663J6502J3383J3699J3513J5840J9513L2442L4075M0056
9183D66892L7152L0623K1507l955k5074m2751m4035l5775m5939m1748k5920k2789
9171B68188j2736j0671n030q318l980M715k355O35j0938m789R84p817K957q54
9157B09991l319l098n039p888k500M487R122K663N721M688J0551J5033J7108R086
9143B66606O238j647Q712J2658J9971J8493L187q526q661j8765j6958j3776K226
$$ y = [108448, 112762, 113887, 123976, 132028, 139235, 154114, 158946, 164106, 167922, 171694, 174852, 178181, 185009, 188539, 191115, 192819, 187044, 183241, 189815, 183979, 172543, 178236, 178816, 184648, 196222, 198094, 210987, 218828, 216104, 213348, 218308, 223732, 213173, 202724, 200631, 211481, 224062, 225358, 231803, 242142, 241633, 244640, 252206, 267869, 284371, 297754, 311453, 324966, 340806, 360319, 392761, 426836, 466892, 504044, 534667, 556174, 552219, 527145, 484394, 440359, 404584, 358645, 316897, 290977, 268188, 255452, 244781, 239751, 231433, 227453, 232168, 229813, 230448, 219510, 214721, 215705, 207888, 210845, 209991, 206672, 203574, 198535, 190647, 188147, 192634, 201756, 204419, 210140, 214828, 225379, 240412, 257520, 266606, 272844, 271197, 279909, 292567, 312538, 331031, 334218, 325692, 317031, 298266, 281308, 267532, 269758]
9130B69758K399J4495J3850o502j4864q754l964K276J2722L0757L9330N1566P3112
9117D76181R2131Q6621O7694L4183J0327p838j9983k6139k6979k3625j4562p047
9105F40964k3416k3949k1765n324l082n214R401J2142M389j521k695j4626p747
9092E57557M237k71k736Q389R541R325J6772K5840J8166J2698J2399P461J2170
9079F91548J2324K0263K5446J5088J6829J2012N268J83j1433l222l981p829k209
9066G70287J7787K3842K2685L3297L4387K8317L7526N7832O1749O8537O1453M4180
9054A261879J4865j2788l2523m0974l9883k3545j3886j2606k1265j3299j4987
9043A050988j4112l012j599m828J550P787J2453J5605K1718J7833K5375L7060
$$ y = [269758, 272157, 286652, 300502, 294000, 279136, 270382, 266418, 268694, 281416, 312173, 351503, 403069, 476181, 568312, 654933, 722627, 756810, 767137, 759299, 739316, 713177, 686198, 662573, 648011, 640964, 617548, 593599, 571834, 566510, 563428, 558214, 567615, 579757, 584146, 582625, 579930, 565304, 557557, 561794, 561523, 558787, 567176, 576717, 586042, 602814, 628654, 646820, 659518, 671917, 679378, 691548, 703872, 724135, 749581, 764669, 781498, 793510, 798778, 798961, 787528, 784306, 780325, 772496, 770287, 788074, 811916, 834601, 867898, 902285, 930602, 968128, 1025960, 1087709, 1156246, 1217699, 1261879, 1276744, 1263956, 1231433, 1190459, 1150576, 1127031, 1113145, 1100539, 1079274, 1065975, 1050988, 1036876, 1033864, 1032265, 1027437, 1028987, 1036774, 1049227, 1064832, 1086550, 1104383, 1129758, 1166818]
9031A166818L4748K9434K8673M0960M0082K7620J9997Q209J0672P972m444P63
9019A411504R198J5664K0989K6591K3115K7339K4928L4538M3902N3071O2535O6132
9007A819506O3595N6786N2774M2621M9185M9747N1537N9179N6546M8577N0458
8996B400511M9834N0137O2713P4713Q7294J01980J06259J17485J23502J28907
8986C303335J21213J17558J09132J12438J16271J17130J30635J46227J62098J83802
8976D619839K07204K10275K21560K33474K33814K56767L02509L34445L61636L99296
8966G380819M31681M41442M57475M71233M81555N03759N55333O07986O63097P57727
8956A2752107Q56141R46908J071443J241860J428184J631080J864414K121899
$$ y = [1166818, 1201566, 1231000, 1259673, 1300633, 1340715, 1368335, 1388332, 1396541, 1407213, 1415185, 1410741, 1411504, 1420702, 1436366, 1457355, 1483946, 1507061, 1534400, 1559328, 1593866, 1637768, 1690839, 1753374, 1819506, 1883101, 1939887, 1992661, 2035282, 2084467, 2134214, 2185751, 2244930, 2301476, 2350053, 2400511, 2450345, 2500482, 2563195, 2637908, 2725202, 2827182, 2933441, 3050926, 3174428, 3303335, 3424548, 3542106, 3651238, 3763676, 3879947, 3997077, 4127712, 4273939, 4436037, 4619839, 4827043, 5037318, 5258878, 5492352, 5726166, 5982933, 6285442, 6619887, 6981523, 7380819, 7812500, 8253942, 8711417, 9182650, 9664205, 10167964, 10723297, 11331283, 11994380, 12752107, 13608248, 14555156, 15626599, 16868459, 18296643, 19927723, 21792137, 23914036]
8948B3914036K424052K758123L122952L557358M098393M775837N649142O775831
8940E7075724Q230804J0062208J2416310J5520780J9640043K5131385L2403104
8933A80480358M1745140N2941566O4389264P1838131O8389085M8163159J2786002
8926E40732705k6828459n6876052o9759752o7827262n8364337m7292608l7391950
8919A76392285k9352535k3083706j8293521j4653258j1905145r797847q160153
8912F1146120o837929n771934m892754m141533l520068l006324k595642k283581
8904B8096355k036005j837504j667713j540843j447733j363705j276705j188056
8896A5738091j098857j012860r46333q67026p74570o94933o28734n45370m80654
$$ y = [23914036, 26338088, 29096211, 32219163, 35776521, 39874914, 44650751, 50299893, 57075724, 65306528, 75368736, 87785046, 103305826, 122945869, 148077254, 180480358, 222225498, 275167064, 339556328, 411394459, 479783544, 527946703, 540732705, 513904246, 457028194, 387268442, 319441180, 261076843, 213784235, 176392285, 147039750, 123956044, 105662523, 91009265, 79104120, 69306273, 61146120, 54308191, 48536257, 43643503, 39501970, 35981902, 32975578, 30379936, 28096355, 26060350, 24222846, 22555133, 21014290, 19566557, 18202852, 16926147, 15738091, 14639234, 13626374, 12680041, 11813015, 11038445, 10343512, 9714778, 9169408, 8688754]
8887H688754m40105l97680l59735l39008l16546l00596k89292k68125k46496k30231
8877E500940k04548k04764j95575j99964j98131j79155j70424j62357j36100j20264
8867C729658j07354r3484q7996q4414q7690q2239r3553j05232j04572r5992r6689
8856B690443q5417o4736o4624p1760p5901n9678o6525n8974m9288l2628k7610
8845B033302k0666l1014m2306l4119l5293l3845m8933n1174m8968n1225n4986
8834A580773n2043n0558m5717m4759l5351l4776k8507m0776k6468j2394q017r712
8822A191695n495j0378q820q002j6144k2303k3766k1866k9525l3801m1027l6415
8810I34153l2009k8025j4983k5893j9586j9261j7687j7743j3435j7667j8841j7600
$$ y = [8688754, 8248649, 7850969, 7491234, 7152226, 6835680, 6535084, 6245792, 5977667, 5731171, 5500940, 5296392, 5091628, 4896053, 4696089, 4497958, 4318803, 4148379, 3986022, 3849922, 3729658, 3622304, 3528820, 3440824, 3356410, 3268720, 3186481, 3092928, 2987696, 2883124, 2787132, 2690443, 2605026, 2540290, 2475666, 2403906, 2328005, 2268327, 2201802, 2142828, 2093540, 2060912, 2033302, 2012636, 1981622, 1939316, 1905197, 1869904, 1836059, 1787126, 1735952, 1686984, 1635759, 1580773, 1528730, 1478172, 1432455, 1387696, 1352345, 1317569, 1289062, 1248286, 1221818, 1209424, 1201407, 1191695, 1186200, 1175822, 1167002, 1159000, 1142856, 1120553, 1096787, 1074921, 1045396, 1011595, 970568, 934153, 902144, 874119, 859136, 833243, 813657, 794396, 776709, 758966, 745531, 727864, 709023, 691423]
8798F91423M95L57j64j4793p658p400o360j814j149p551j1607p492j5227j9837
8784E91223j5158j8504j6251j6015j9602j3633l828m377o115p667k393k407j0135
8771D55138m607j170k119R079Q151K725M29M9q304j4828k0579k0607j1425r320
8757C82612m057M184J2838J5213J8572L6129K3041j4373m5817n8206o2416n1569
8745B56151n0563n3944o1721m7676k4268N788M5716P3878Q5151Q4034O5775L7984
8733D16305K1539O866o283r342j3682j3708m318N610L503Q916j2485j6718j8837
8720C67366j3056j4401j4651q274M16r8P089J3548J6211J8299P418R193J3216
8707D02276M413J5199K9294M0268M6840L0221K634l3124m3699l5432k6823k3475
$$ y = [691423, 691918, 692275, 692111, 677318, 669660, 662260, 655900, 654086, 652937, 645386, 633779, 626287, 611060, 591223, 576065, 557561, 541310, 525295, 505693, 492060, 488232, 483855, 477740, 470073, 467680, 465273, 455138, 450531, 449361, 447242, 456321, 464472, 467197, 467626, 467675, 459371, 444543, 423964, 403357, 391932, 382612, 378555, 382739, 395577, 410790, 429362, 465491, 488532, 474159, 428342, 370136, 307720, 256151, 205588, 151644, 89923, 42247, 17979, 23767, 69483, 143361, 228512, 312546, 378321, 416305, 437844, 444710, 438427, 429085, 415403, 401695, 397377, 402987, 406490, 415406, 402921, 386203, 367366, 354310, 339909, 325258, 316984, 317400, 317302, 324391, 337939, 354150, 372449, 379867, 389060, 402276, 406689, 421888, 451182, 491450, 538290, 568511, 571145, 538021, 494322, 458890, 432067, 408592]
8695D08592k9543j1389n019j4351k115n270o12k428L393R85n98L468K132J417
8681C48662k465n097n001r634j428O119O677l639r383j1548j5361p672o406j1641
8667B72183j0965j4458m25O00L464P056J0188J2145J8429K0310M5045Q0490J33098
8654E77160J40716L1728q8321j53917j04990o4202m2979k4347j9446j6378j2983
8643B22041m634j458j898m898n0R470L472o067m202o997m921o668n124K86r0r586
8627A78676n812M646P998J1281J0982L501J3944J5217J2893J3835J6066J5736
8615B98963J6506K4709P3646J34224J10998q904j21837j39315r2134m6386l2435
8604B18035k7787j5386m832n366j635l833o144j269J932N360o242j4124k809J679
$$ y = [408592, 379049, 367660, 362641, 348290, 346175, 340905, 340293, 337865, 341258, 342243, 341645, 345113, 347245, 348662, 346197, 341100, 336099, 326465, 325037, 331156, 337833, 334194, 324811, 313263, 297902, 290230, 283824, 272183, 261218, 246760, 246335, 246935, 250399, 257455, 267643, 279788, 298217, 318527, 363572, 444062, 577160, 717876, 749604, 661283, 507366, 402376, 338174, 295195, 270848, 251402, 235024, 222041, 217407, 215949, 214051, 209153, 209103, 218573, 222045, 215978, 211776, 204779, 199858, 193190, 188066, 188352, 188262, 178676, 172864, 177510, 185508, 196789, 207771, 211272, 225216, 240433, 253326, 267161, 283227, 298963, 315469, 340178, 413824, 548048, 659046, 650142, 528305, 388990, 296856, 250470, 218035, 190248, 174862, 170030, 164664, 163029, 159196, 153052, 151783, 153715, 159075, 152833, 138709, 135900, 137579]
8590A37579K193N871Q968R071Rp462L951L18Q03n300k797k856q533j1194k289
8575A28332J456p78Q29r148o039o270j702K953j565J829o549l636L175L609M503
8560A10999o070r476l86L933r80o33J368M491N867Q099l490r854p217j0862o729
8545G9060M853O34l37l1k42O40J96j362p259k829L798L584L954M146Pj651R26
8528H8087j992j735L931N616j947J426Q329Q894q641q960o643L665L490P134P694
8513A08348R244Q86j6103j2896O293P538N011L026l074L412j742j3431j944J886
8499I6454q50M416Q70O09M595j100p102m594o300l428M560m211l761Q82k716m155
8483G4169R451L180o285n806K500M564N673K523R25J825L562J958k933J214M639
$$ y = [137579, 139772, 145643, 154611, 163682, 163691, 156229, 160180, 160498, 161301, 156001, 153204, 150348, 141815, 130621, 128332, 129788, 129010, 129839, 120691, 114652, 108382, 106680, 109633, 108068, 109897, 103348, 99712, 102887, 106496, 110999, 104929, 95453, 95067, 99000, 98020, 97387, 98755, 103246, 109113, 117212, 113722, 103868, 96651, 85789, 79060, 83913, 84547, 84210, 84179, 83937, 84577, 84773, 83411, 76152, 73323, 77121, 80705, 84659, 88805, 88812, 87161, 88087, 86095, 84360, 88291, 93907, 91960, 93386, 101715, 110609, 101968, 93008, 86365, 90030, 93520, 100654, 108348, 117592, 118478, 102375, 89479, 95772, 103310, 108321, 111347, 108273, 111685, 109943, 96512, 94568, 96454, 95604, 100020, 100890, 101499, 106094, 104994, 97892, 93298, 86998, 83570, 88130, 83919, 80158, 81040, 78324, 74169, 83620, 86800, 80515, 74709, 77209, 81773, 87446, 89969, 90894, 92719, 96281, 98239, 95306, 96520, 101159]
8468A01159J992M423k507o604j335O759M341L908L232Q57M489O771O505L103j069
8453A36024M865N320j962Q69o472j2728j5637j987O02j838p350m406L616M32J889
8438A01237l984n170o361L219K231m057j791N028O639J0927k324K449L695M194
8424A15932j691j451m555O893J2582J5182L672q020J101P699J7554J1939M272
8411A81109J4263J8081J2099J434l81O503R821Q878P474R666J8088J1445R464
8398C07944Q308p168k0065j6689j7313j8888k6150j2421n206o105j5770j3680
8386A56797j029j0247o649L49l640k323j836j3644j1500m886l884N332m183k715
8372I5942L062k716P26P185l9j1909o894q07l059j105j044q83N481j3516l978
$$ y = [101159, 103151, 107574, 105067, 98463, 97128, 103887, 108228, 112136, 115368, 116225, 120714, 127485, 133990, 137093, 136024, 140889, 146209, 144247, 145116, 138644, 125916, 110279, 108292, 108894, 107056, 99706, 95300, 98916, 99348, 101237, 97253, 92083, 85722, 88941, 91172, 87115, 85324, 90352, 96991, 107918, 105594, 108043, 111738, 115932, 114241, 112790, 108235, 115128, 127710, 142892, 146564, 138544, 139645, 147344, 164898, 176837, 181109, 195372, 213453, 225552, 226986, 226605, 233108, 242929, 251807, 259281, 268947, 287035, 298480, 307944, 316252, 309084, 289019, 272330, 255017, 236129, 209979, 197558, 192352, 186247, 170477, 156797, 155768, 145521, 138872, 139221, 135581, 133258, 131422, 117778, 106278, 101392, 97508, 102840, 98657, 95942, 99004, 96288, 97014, 104199, 104160, 92251, 85357, 84550, 81491, 80386, 79342, 78459, 83940, 70424, 66446]
8357F6446j007J440q108P63n324j330o449l420L204J712k627o57P679o378m145
8342D1799n756k142J0732K280m177P56j138r93L933k531L640J548l916J889l003
8327D2921j779p258k974J2332P358N596O614J330p162o671N294O149r344p164
8313D5242j819O349O096n536r634K255m07J949L597N666k456l608r75l86L65n0
8297D6648K621m549m003k244n860l255j930O749R441n86q411P303K861j140J001
8282D4646J0247m02j537k427j946O871J7860J3207M403m128j5824j7412q482k688
8268D2388K682o311n932J1451P142P96l649l524N53l87n339Q84k74J72j2871r056
8252A8725M703J269j171J6868P77p896j516j633L218N706N898p647Q015N946j011
$$ y = [66446, 65439, 66879, 58771, 59534, 54210, 52880, 46431, 43011, 46215, 47927, 45300, 44643, 52322, 45944, 41799, 36043, 33901, 44633, 46913, 42736, 43492, 42354, 41361, 45294, 42763, 46403, 47951, 44035, 45924, 42921, 41142, 33884, 30910, 43242, 50600, 56196, 62810, 64140, 56978, 50307, 55601, 61750, 52406, 45242, 43423, 49772, 55868, 50332, 40698, 42953, 42546, 44495, 48092, 53758, 51302, 47694, 46719, 46333, 46698, 46648, 49269, 44720, 40717, 38473, 32613, 29358, 27428, 34177, 43618, 43032, 34621, 41924, 44785, 43645, 44646, 54893, 54491, 52954, 50527, 48581, 55452, 73312, 86519, 90922, 86794, 70970, 53558, 45076, 42388, 45070, 38759, 32827, 44278, 51420, 52216, 48567, 45043, 45596, 45209, 39870, 40754, 40480, 40652, 27781, 18725, 23428, 24697, 23526, 40394, 41171, 33275, 31759, 30126, 33344, 39050, 44948, 37301, 45316, 51262, 50251]
8237E0251M709R278L334n642o170l248L897P766q49L954j568l999K061K101o41
8222F5234m664m355N091j593L874L954j185m320J390j0439j5168n140n602J0041
8208C7118J830p48j154m848l648q33N159M380L965L75M059m591M15M348l284l762
8192C8781j657K179J075l887J4513J9498J0765j881j2342m950j2903p893M730
8179D6028L274n84K039l341k88J759M504O468q54j892o421k996K628M39l57q839
8163D1567k915j242l457m112L477P73K481k213J597J1700J408j932O34R804J0234
8148F7804J5288J2516Q536R385q85j3589j3081j7645j2027q352n489j393j721
8135C9347o39o606J732P92p946K68j347O482K56j593j0107r810L733J5149K3126
$$ y = [50251, 54960, 64238, 67572, 61930, 55760, 52512, 56409, 64175, 63326, 67280, 65712, 61713, 63774, 65875, 65234, 60570, 56215, 61306, 59713, 63587, 67541, 66356, 62036, 63426, 52987, 37819, 32679, 27077, 37118, 38948, 38200, 37046, 32198, 28550, 27717, 32876, 37256, 41221, 41596, 45655, 41064, 41479, 45827, 42543, 38781, 37124, 39303, 40378, 36491, 51004, 70502, 81267, 79386, 67044, 62094, 49191, 41298, 46028, 49302, 48718, 50757, 47416, 47128, 48887, 53391, 59859, 59005, 57113, 50692, 47696, 50324, 50763, 50406, 41567, 38652, 37410, 33953, 29841, 33318, 34091, 36572, 34359, 35956, 47656, 49064, 47132, 47766, 57570, 67804, 83092, 95608, 104144, 113529, 112644, 99055, 85974, 68329, 56302, 47950, 42461, 41068, 39347, 38708, 32102, 33834, 34626, 26680, 26948, 25601, 32083, 32339, 30746, 20639, 10829, 14562, 29711, 52837]
8120E2837M69j5086j9007j8177j3959K908J9365L2464K4144P411Q293Q294L253
8107I3209k1500j7925j3085j5192n96J0759R966L283J798l040j1065m100K727
8094C5239j245o363q590j838j3588K186J1789K327L079J278j419m301m355K151
8080A6350Q764J1600j0881j4542k434Q058j129j152l454L007J0432N750j237m690
8066B4442p327k650L016K132J706P20n708J10M224j448n63O526r48p144m499L958
8050A6547M944o18K250m494O086r64q521k069k355n30O374R165o98j0888l263
8035A0966M819K322l1R134K207P57J322k623n346m385k141p115q08O973N192P726
8019B8969L723p147o691k64M265R28k991J598J409p405Q586M358r05p276n166
$$ y = [52837, 53306, 38220, 19213, 1036, -12923, -10015, 9350, 41814, 65958, 73369, 81662, 89956, 93209, 71709, 53784, 40699, 25507, 24911, 35670, 45636, 48919, 50717, 47677, 36612, 32512, 35239, 33994, 27631, 19041, 17203, 3615, 5801, 17590, 19917, 22996, 24274, 22855, 18554, 14199, 16350, 25114, 36714, 25833, 11291, 8857, 16915, 15786, 14634, 11180, 14187, 24619, 30369, 29132, 24442, 17115, 14465, 17481, 19613, 21319, 22039, 16331, 16441, 20665, 19217, 18654, 25180, 24232, 17088, 12589, 16547, 21491, 20873, 23123, 18629, 24715, 23751, 15230, 13161, 10806, 10276, 16650, 25815, 25117, 14229, 10966, 15785, 18107, 18076, 27210, 29417, 30174, 31496, 28873, 23527, 19142, 17001, 9886, 9078, 16051, 21243, 28969, 32692, 25545, 18854, 18590, 22855, 23783, 20792, 22390, 23799, 16394, 24980, 29338, 28433, 21157, 15991]
8004A5991J163L400J309m293R33L779M754j395n445P616K621r596l940M758P542
7989B9197K104n584Q204l342K784J41m919o20q888j522m611m354L409q599j029
7974B371M302K514R880M649q25P721L668k881o397n356o018J571M560J229k956
7959A8032J086N434j118o476J964M147M501K69O181J647J381O437K011q125j0324
7944B7047r084m84j472P537M402p013R768j804p548O662Q513j999m459Q07j3499
7929A7374m501n869K918N054J5040O086j478M780q585P025N249m542m950n341
7915B8260j297n449J687J2412J2241N30l651k155j682j0144q44K563m09m713N465
7900C2814K648M941N4q155m996j1308l074M349R257K618o65L536O303l821M337
$$ y = [15991, 17154, 20554, 21863, 17570, 18503, 22282, 27036, 25641, 20196, 27812, 30433, 20837, 16897, 21655, 29197, 31301, 25717, 33921, 30579, 33363, 33504, 28585, 27965, 19077, 17555, 12944, 8590, 11999, 3400, 2371, 6673, 9187, 19067, 23716, 22891, 30612, 34280, 31399, 25002, 19646, 13628, 15199, 19759, 20988, 18032, 19118, 24552, 23434, 16958, 18922, 23069, 27570, 27839, 34020, 35667, 37048, 43485, 45496, 37371, 27047, 17963, 17479, 16007, 23544, 27946, 20933, 30701, 28897, 21349, 28011, 36524, 34525, 30066, 30873, 17374, 12873, 7004, 9922, 14976, 30016, 36102, 34624, 39404, 30819, 37844, 43093, 38551, 33601, 28260, 26963, 21514, 23201, 35613, 47854, 48384, 44733, 42578, 40896, 30752, 29908, 32471, 32062, 27349, 32814, 35462, 40403, 40457, 32302, 27306, 15998, 12924, 17273, 26530, 29148, 28483, 32019, 38322, 34501, 38838]
7885C8838O124j0308j0227n140n694M973q2p26L494Q833m321o386o925J688R100
7870B3241K995M949K586k796o43L44L121m6J777K996K295p901K403L541P860j081
7854D5641r386m692k887M0P321N925J1370L550k74m54r67r390j0163p943M471
7839C2162K182N81m240L55P714P515n406m338j693N77l54L713J927k142L5k92
7823C8296O003j05n509J296K861j1787O199P898j822p216J688O247l1R845N798
7808E9661L574L975J1996O250J646k343j562r747o095N11k417q536J343P825O13
7793F6694l168m04k375j3022o360n358M268J0474M748Q18o413j170Q540O440l914
7778E9798j770R769q925m474k364l238O374j642O341K722j391o105l004J782J735
$$ y = [38838, 44962, 34654, 24427, 19287, 13593, 18566, 18484, 17758, 21252, 30085, 25764, 19378, 12453, 14141, 23241, 26236, 31185, 33771, 30975, 30332, 30676, 33797, 33751, 35528, 38524, 40819, 32918, 35321, 38862, 46722, 45641, 36255, 31563, 28676, 28716, 36037, 41962, 53332, 56882, 56608, 56154, 55187, 45797, 35634, 27691, 32162, 34344, 34925, 30685, 31040, 38754, 46269, 40863, 36525, 34832, 35409, 35055, 38768, 40695, 38553, 38588, 38296, 44299, 44194, 38685, 39981, 42842, 31055, 37254, 45152, 43330, 36114, 37802, 44049, 44018, 53863, 59661, 63235, 67210, 79206, 85456, 87102, 84759, 83197, 73450, 67355, 67866, 65449, 56913, 58256, 66081, 66694, 63526, 63122, 60747, 47725, 41365, 36007, 40275, 50749, 55497, 56315, 49902, 48732, 57272, 63712, 59798, 58028, 67797, 58872, 54398, 52034, 48796, 55170, 53528, 59869, 62591, 61200, 55095, 52091, 53873, 55608]
7763E5608l46K234J938j227K652J990r980l434O908J454o14m361P117l042n906
7748E0991j541O37m024L284J556o656j678n69M443M10m603J153N915j559l762
7733D3997n593o090O979k196K097O671N57l563o921k064P576J73m839l674j0456
7718B2654m806j625j035K298K463K705N66N943J950j3316n378l35Q605J4420O905
7703D2014n860j2420l152m08k081K287J399q345m544m700M048J3951Q68m500M429
7688B2986L673q355n844n897l421m210J1783P311K91K329p531k710l102o611n443
7673d751O374j420P172k938M8P267K209l602k126N035L666m204M728o548j662
7658I248L79L824Q48o055J084j466n940J184j886N282P427M023j026O111J981
$$ y = [55608, 55262, 57496, 59434, 58207, 60859, 62849, 52869, 49435, 56343, 57797, 57183, 52822, 59939, 56897, 50991, 49450, 50087, 46063, 49347, 50903, 44247, 42569, 42000, 46443, 46853, 42250, 43403, 49318, 47759, 43997, 38404, 32314, 39293, 37097, 39194, 45865, 46422, 42859, 35938, 33874, 41450, 41623, 36784, 33110, 22654, 17848, 16223, 15188, 17486, 19949, 22654, 23220, 29163, 31113, 17797, 12419, 12084, 20689, 35109, 42014, 36154, 23734, 20582, 20174, 18093, 20380, 21779, 13434, 8890, 4190, 8238, 22189, 23057, 18557, 22986, 26659, 18304, 12460, 6563, 3142, -1068, 10715, 18026, 18317, 20646, 13115, 10405, 7303, 692, -4751, 1623, 203, 7375, 4437, 4485, 11752, 13961, 10359, 8233, 13268, 16934, 12730, 17458, 10910, 9248, 9627, 13451, 14299, 8244, 9328, 7862, 1922, 3106, 1220, 6502, 13929, 17952, 16926, 23037, 25018]
7643B5018j0288n537O312j54j518m034o601q08K93J0973l79q817K858j353j680
7628D285j980O286J1273L919l909r384k1367p702L531Q914J0942R138k092n122
7614F732k794o764J075J1402P762j189p004q926J315M394l530R27M040j731R88
7599F697M18j1883J394R071P215p081k806M994P587k600p290l912Q668K576L278
7584A6326m196l128M71M659R99K397m61N4m932r85n598r246M7J106J396r54j290
7567c335n200M078J2012K380o719m457P510R284r381o497P404M923k77n749l739
7552B237J766L13J139J737m372M157j938p798m891J2456R802J21o610K734K655
7537A3508j929j575K056r01k311m797j514j027R436Q166J84m397J843N32n862
$$ y = [25018, 14730, 9193, 15505, 15351, 13833, 9799, 3198, 2390, 2683, 13656, 13277, 4460, 7318, 5965, 4285, 2305, 8591, 19864, 23783, 19874, 10490, -10877, -18579, -15048, -6134, 4808, 13946, 11854, 6732, 3938, -2826, -1751, 9651, 17413, 16224, 9220, 294, 1609, 6003, 2473, 3400, 7440, 5709, 6697, 7115, -4768, -3374, 5697, 12912, 5831, 3025, 8019, 15606, 13006, 5716, 1804, 10472, 13048, 16326, 12130, 9002, 9473, 14132, 15131, 17528, 17067, 17121, 12189, 11204, 5606, -3640, -3593, -2487, -1091, -2045, -3335, -8535, -4457, 7555, 9935, 3216, -1241, 6269, 15553, 6172, -325, 7079, 12002, 11725, 5976, 2237, 4003, 4316, 5455, 7192, 2820, 6977, 5039, -2759, -7650, 4806, 14608, 14729, 8119, 10853, 13508, 11579, 10004, 12060, 11159, 8848, 4051, 2537, 1510, 10946, 19112, 19296, 14899, 16742, 17274, 11412]
7522A1412m641J356O371k891n525J728k91M46j51o940n853k180M709J985l74o845
7506g684r13P418J5750k899q891M18o21P75P917j842m930l792L64k817j644k878
7490f269m71L112L658j488o519k783j79M932j403K614O603L618N39Q207K826L98
7474A7395r813q198k816q41m216K022J2147m14K01J57m592P691m971J120L371
7459H243r956K328k956M60p352L64N324J0133n945j446J701K871k040k740l56
7444a367p433M983O78n388k617l862j756k244J992J235J1490J1179L193n144l728
7429A211k885o061m054M675K344n452j0648K799Q967J076n653k234L044J715L140
7414h016j848R37N032M589J005J45L993n898j322L270M313o718j498R183N271
$$ y = [11412, 6771, 8127, 14498, 11607, 6082, 7810, 7519, 7965, 7814, 874, -4979, -7159, -2450, -465, -839, -7684, -8597, -1179, 14571, 11672, 2781, 3199, 2578, 3353, 11270, 9428, 4498, 706, 1070, -1747, -3391, -6269, -6740, -3628, 30, -1458, -7977, -10760, -10939, -6007, -7410, -4796, 1807, 5425, 5964, 14171, 16997, 17395, 7582, -616, -3432, -4273, -8489, -6467, 5680, 5266, 5467, 5624, 1032, 8723, 3752, 4872, 8243, -1713, 615, -2341, -1881, -9233, -8869, -3545, 6588, 643, -803, 898, 3769, 1729, -1011, -1367, -8800, -3817, -3139, -8527, -11144, -15006, -16762, -19006, -17014, -15779, -4289, 6890, 10083, 4939, 1211, -1674, -7735, -11789, -7114, -4770, -10222, -20870, -18071, -9104, -8028, -13681, -15915, -12871, -11156, -8016, -9864, -8927, -3895, 694, 1699, 1844, 5837, -61, -1383, 1887, 6200, -518, -2016, 7167, 12438]
7399A2438m487r825p239Q921J1552J135m560o376J164m071j976m551j031O246
7385b660L706P9M908p638p158M109K964J725J1512n189q493k82k253n57K948M844
7369B565L493j9l781o415K535O687L76j201j1060n652J240M196K673J0359N264
7354A1260m061L607O35J232j185n664l949L367m301n347K496N403J734R463K878
7339A7568j1420p056j031N468k674q784M133k045o99L339k951K360Q695q63K010
7324F050M291P488n668k891K258M259k789k438j234K802l573O117p593m413M854
7309G520K905l093k331j433o887j1237l785J7552J4985J3364M072p635j6751j3852
7295f606o409O834N924l640q96q332j506M837L915P994L041k052k114K749q456
$$ y = [12438, 7951, -1874, -9113, -192, 11360, 12495, 7935, 1559, 2723, -1348, -3324, -7875, -8906, -2660, 1046, 1125, 6033, -1605, -8763, -4654, -1690, 35, 11547, 6358, -2135, -2417, -4670, -5227, -2279, 2565, 6058, 6039, 2258, -4157, -1622, 5065, 5441, 4240, -6820, -12472, -11232, -7036, -4363, 5996, 11260, 7199, 10806, 11441, 12673, 11488, 5824, 1875, 5242, 941, -4406, -1910, 3493, 5227, 14690, 17568, 6148, -908, -1939, 3529, 855, -7929, -3796, -5841, -6540, -3201, -6152, -3792, 4903, 4040, 6050, 10341, 17829, 12161, 9270, 11528, 15787, 12998, 10560, 9326, 12128, 8555, 14672, 7079, 2666, 7520, 10425, 7332, 5001, 3568, -3319, -14556, -18341, -789, 14196, 27560, 31632, 23997, 7246, -6606, -13015, -6181, -257, -3897, -4793, -13125, -14631, -9794, -5879, 2115, 5156, 3104, 990, 3739, -4717]
7280d717L293j658j07M324k639m744L964L328L09N226k936k986O390j71r472q190
7264a0786J375L893l492N548J6969K301o227J440n623p497J676Q313N613P43M667
7249A8913N5m808j5382n418K811l46%p116J644O476Q72N298l135j844k111L530
7233e61N384j102JJ049j73n211L801M07j987J0O000N51l405r179m743R658J967
7216B467Q46O3k004j364r82L950k529n510j1489L459M718L5O680J0520J0375P08
7200A9943n970l92N63r564q69q399q47K900o02n92R85K173O41n180l945Q40K166
7183f149n47N904p82k085N841L711o880m617L280j963Q992J155p218m138k374
7168g870k420l46O794j286o833j612j670K049N328p81N741N099j665p857L707
$$ y = [-4717, -1424, -3082, -3189, 1135, -1504, -6248, -2284, 1044, 1353, 6579, 3643, 657, 7047, 6876, -2596, -10786, -9411, -5518, -9010, -3462, 13507, 15808, 9581, 11021, 5398, -2099, -423, 7890, 13503, 14246, 18913, 18968, 14160, -1222, -6640, -3829, -4175, -4175, -11291, -9647, -3171, -2299, 2999, -136, -1980, -4091, -561, 4823, 3721, 3722, 4771, 4598, -613, 3188, 3595, 1608, 1618, 7618, 8169, 4764, -4415, -9158, 500, 2467, 3313, 3376, 1372, 8, -974, 2976, 447, -5063, -16552, -13093, -8375, -8340, -1660, 8860, 19235, 19943, 13973, 13581, 14144, 4580, 3711, -4688, -5535, -2635, -3237, -3829, -2844, -671, -30, -5210, -9155, -8315, -6149, -6696, -792, -1574, -3659, 2182, 5893, -987, -5604, -2324, -4287, 4705, 5860, -1358, -5496, -7870, -10290, -10636, -3842, -5128, -11961, -13573, -15243, -13194, -7866, -8647, -2906, 2193, 528, -7329, -3622]
7153c622k273K21O736P025n126r828K420l666r38k569K78K435R376J0155k810
7138G814m630K191J733j608k531o787j5365j3701P893Q055p824P434J4310K257
7124g59k856n861q13l232n52P554J1300K482N793k552j0756p352p967R46Q892
7109e733J638m496K749j255m580j709k180k6J58k290K413l793K299J4599M974
7094B768n344j553N51L160O065n540o25O52p39R874J45r492l033k491O549l582
7078b635r13o208q17R63k801P206J6105J1800l36l811l288m612n651m565r766
7063i329l864m03M508P700j042N636k169R01R976o491q714o57k538K542j569k711
7047h224Q443N001k600j413L354l426k206J172P90O26J032m685p056j704N129
$$ y = [-3622, -5895, -5674, 1062, 8087, 2961, -6867, -4447, -8113, -9051, -11620, -11342, -8907, 469, 10624, 7814, 3184, 5375, 7108, 5500, 2969, -3818, -19183, -32884, -24991, -16936, -24760, -17326, -3016, -759, -3615, -9476, -10289, -13521, -14073, -6519, 4781, 7263, 13056, 10504, -252, -7604, -15571, -14625, -5733, -4095, -8591, -5842, -7097, -11677, -13386, -15566, -15592, -15434, -17724, -15311, -19104, -16805, -2206, 2768, -2576, -4129, -3578, -418, 5647, 107, -518, 134, -605, 9269, 9414, -78, -3111, -5602, 947, -2635, -3548, -9756, -10573, -9610, -12411, -5205, 10900, 22700, 22364, 18553, 15265, 10653, 5002, 437, -9329, -13193, -13596, -9088, -1388, -2430, 3206, 1037, 1938, 11914, 5423, -3291, -3948, -6486, -3944, -5513, -8224, 219, 5220, 2620, 1207, 4561, 1135, -1071, 101, 891, 1517, 2549, -2136, -9192, -10896, -5767]
7032e767j261N46J3640O118j249j2073j4518r222L497J1846j453M335M031M88
7018a042P172Q663l984q308o625l188N92J777m80J787K376q06o440O412O400m416
7002a10j243N595L48P902n056J999m134n188l952j84K706k577L505K918N516n907
6986B138k321K530J780k570j178o710Q74P259L018M563L979m395o161m173K476
6971A109N234l669m901l860L407Q21O654N88K247k16p950M336L079j460q493l429
6955f503J046j346K480R75o715n301j356L091J2528M733p521k260K553L717k508
6940b387J810Q392K444k083r36n336l752J834l670l970q16m331L698O353Q25M113
6924B188L44p714L171P91M532Q54o694n254Q358J643m845p370n452K909Q11L843
$$ y = [-5767, -7028, -6482, 7158, 13276, 12027, -46, -14564, -23786, -20289, -8443, -9896, -5561, -1530, -1042, 6130, 14793, 10809, 2501, -4124, -7312, -6720, -4943, -5423, -3636, -1260, -2066, -8506, -2094, 4306, -110, -1353, 4242, 4590, 12492, 7436, 9435, 5301, 113, -3839, -4023, -1317, -3894, -389, 2529, 8045, 2138, -183, 2347, 4127, 1557, 379, -6331, -5457, 1802, 4820, 9383, 13362, 8967, 2806, -1367, 1109, 6343, 2674, -2227, -6087, -2680, -1859, 4795, 5383, 7630, 7414, -536, 3800, 6879, 5419, -3074, -6503, -5457, -6803, -4323, -3348, -10063, -15364, -16720, -13629, -1101, 3632, -3889, -6149, -3596, 121, -2387, -577, 7815, 10259, 8176, 7240, 1904, -1848, -14, -3684, -7654, -8470, -12801, -9103, -2750, -1925, 2188, 2532, -5182, -2011, -1220, 3312, 4166, -2528, -7782, 576, 2219, -2626, -9996, -15448, -12539, -11728, -7885]
6908g885P56m810q03O965N245J982l457M414J881j34o99m688N046j327J471N05
6892D462k475K194j819J030k271j22j049l177k956l449P128k545j157l065N194
6877d077M89L47k121M911k231q859L255R620k435n829K000L981P027n163k998
6862b083q166p19L349J1796l41n347j818l293j3283k370O272j224P836N069n79
6847d901J441J624j05m654n977L099k481n038Q217K345K003L300k837k054N327
6832f91M906k078k456J656l538P81K608m580l908k981L146J058M3K514K918k605
6816c207j2841J66J702O580M895J0409M690q146q250j0138k023P382O354k151
6802d578l567O910L739J085j643k010K742o60j512J088j212k670O489J988n919
$$ y = [-7885, -7129, -11939, -12742, -5777, -532, 1450, -2007, 2407, 4288, 4154, 3455, -1233, 3813, 2486, 3957, 4462, 1987, 4181, 2362, 3392, 1121, 999, -50, -3227, -6183, -9632, -2504, -5049, -6206, -9271, -4077, -3588, -3241, -5362, -451, -2682, -11541, -8286, 1334, -1101, -6930, -4930, -949, 6078, 915, -2083, -10249, -10968, -7619, 4177, 3836, -1511, -3329, -6622, -19905, -22275, -16003, -17227, -9391, -4322, -4901, -3460, -1836, -1941, -6595, -12572, -9473, -11954, -16992, -8775, -6430, -4427, -1127, -3964, -6018, -691, 4215, 2137, -319, 1337, -2201, -1420, 1188, -3392, -7300, -10281, -7135, -6077, -6034, -3520, -602, -3207, -16048, -15882, -14180, -7600, -2705, 7704, 12394, 4248, -4002, -14140, -16163, -8781, -2427, -4578, -8145, -1235, 2504, 3589, 1946, -64, 2678, 2018, 506, 1594, 382, -2288, 4201, 6189, 270]
6787B70n806l064J940Q92j282J201j643R81k754O182O523J76k867l165J540M917
6771D041l229r249j3725P994P646O076K528m047j60m077n573N769N201J201l03
6756I3j347J1087M643n105r688k752L004J440P530p746K990J191k117j140J616
6741C699n356k666n051p51Q346O870Q28l665n529l728M158N658m446k178N387
6726A576N118m767l383n466r63m64P619Q997K684j593J270l993p015K225K149
6711C994J286M876j090m410k653K566Q203n155p451q133L828M605m738q641O883
6696f030K335R363K421k152L060N393q247p317j074M587l192o983l869J490N346
6681d869O042l655p511k972k918M593j178M04P893O521k201P31L50M773o97k428
$$ y = [270, -5536, -8600, -6660, -5768, -7050, -5849, -7492, -6511, -9265, -3083, 3440, 3616, 749, -2416, -876, 4041, 812, -8437, -22162, -14168, -6522, -446, 2082, -1965, -2125, -6202, -11775, -6006, -805, 396, 93, -1254, 9833, 14476, 9371, -317, -3069, -65, 1375, 8905, 1159, 4149, 5340, 3223, 2083, 3699, -1657, -4323, -9374, -10125, -1779, 5091, 5919, 2254, -3275, -7003, -2845, 2813, -1633, -3811, 1576, 6694, 1927, -1456, -6922, -7885, -8349, -730, 8267, 10951, 9358, 10628, 6635, -380, 1845, 3994, 5280, 10156, 9066, 4656, 2003, 4569, 12772, 7617, 166, -7967, -4139, 466, -4272, -12913, -6030, -3695, 5668, 8089, 5937, 8997, 14390, 6143, -1174, -2248, 2339, -853, -7836, -11705, -10215, -4869, 1173, -2482, -9993, -12965, -15883, -11290, -12468, -12064, -4171, 2350, 149, 880, 1230, 6003, 5306, 2878]
6665B878j418l275o716m084J181N746o46J429N337k444k633q925L483O505k962
6650f544l527k653n09K468M779p96N49j707Q959O793N857n792q30j054j0000q323
6634a2330L194Q967L06k820N333o309m59R875p37l892K539m763l008J74P61l244
6618f413K120P458J130M698l182L776m253o622p271M19L897n615N683K236J021
6603i18k58k89m767O511L177K325J754m104p301k55J1899m755l572L482J1071
6588A4000R490q77k712m238k500J803P08N249N65O863J0307J1509M123o902q658
6573C8730q514m136M87j566K44k811J495k366j3535p634p420m132p51k838l091
6558a7838m217L177P150N185M178J86n444l285N127O009M65m863n012N501M889
$$ y = [2878, 1460, -1815, -8531, -12615, -11434, -5688, -6334, -4905, 432, -2012, -4645, -13570, -10087, -3582, -6544, -10071, -12724, -13233, -10765, -5986, -6782, -6233, -7940, 1019, 7812, 13669, 7877, 7047, 5993, -4007, -12330, -9136, -169, 137, -2683, 2650, -3659, -4118, 5757, 5020, 1128, 3667, -1096, -4104, -3930, -3169, -6413, -4293, 3165, 4295, 8993, 5811, 9587, 5334, -1288, -8559, -8140, -4243, -9858, -4175, -1939, -918, -1176, -1465, -6232, 279, 3456, 5781, 7535, 3431, -3870, -4125, 7774, 3019, -553, 2929, 14000, 23490, 22613, 19901, 15663, 13163, 14966, 15674, 20923, 21488, 28351, 38658, 50167, 54290, 47388, 38730, 30216, 26080, 26567, 25001, 25245, 22434, 23929, 21563, 8028, 394, -7026, -11158, -11909, -14747, -17838, -22055, -18878, -11728, -6543, -2365, -2179, -7623, -10908, -5781, 228, 693, -4170, -9182, -3681, 1208]
6543A208j388n577j454L442j564l040P186k601j1317j207l871R187O278o858j1788
6528b3364n666J4735J3008Q531L344k691p655m648j073O089K485J0L443P128k704
6513A0972j0793q023r610j081O375J081O022K243J0278M879p241j1974M491l871
6499f252R91r28m267O014k152L80J16j754K235k918m299k566R564N284q365o63
6483i580L900o297JQ619j38j592J561r010n351L467P413J0568J19p72K691m715
6467H84q422n115J086M087p425J4301O122m743L022l064P162n012l624O971l306
6452B924n744l578J176N592j2039l609J954J79P232J262m056j922L999J2882J571
6437G823n049k368m009m119n384o585J0470J1097J310K259j918o546l391K969
$$ y = [1208, -180, -5757, -7211, -3769, -5333, -8373, -1187, -3788, -15105, -16312, -20183, -10996, -4718, -11576, -23364, -29030, -14295, -1287, 7244, 10588, 7897, 242, -4406, -5479, 610, 3095, 3105, 6548, 13676, 10972, 179, -7844, -17454, -18535, -12160, -11079, -5057, -2814, 7464, 12343, 5102, -6872, -2381, -6252, -5261, -6189, -10456, -4442, -6594, -6214, -6098, -7852, -5617, -8535, -12834, -15400, -5836, -552, -8917, -9580, -5680, -11977, -11976, -3357, -3495, -5087, -3526, -12536, -17887, -14420, -7007, 3561, 3680, 2908, 5599, 884, -7538, -12653, -11567, -7480, -14905, -604, 5518, 775, 3797, 733, 7895, 2883, -741, 6230, 2924, -2820, -6398, -5222, 370, -11669, -15278, -13324, -13145, -5913, -4651, -8707, -10629, -6630, 6252, 7823, 2774, 406, -3603, -7722, -13106, -19691, -9221, 1876, 3186, 5445, 3527, -3019, -6410, -3441]
6423c441K341N81o099L93N510K373r3P078q91O881o430r383o289m769l673J1772
6407d139M346K506K698L469L623P29n541n740j051L159K709m486k00k59k031K877
6391B669P85M408n724o452N102K257Q12n880P37k155j737O932L763Q535k70j1432
6375B350j4257n689N973K098O475J302k024p490j574K195N395J206j798o134J12
6360a1860N846L62k267j178J1847J026r55p0m81M012K518m13m574o761n20L428
6344d0j638j184j4288J298O939P10O31K584k839m71n351J446J605J958k66k278
6328a1184K073O509o42n777L562Q575L185l267o742n844j110k004r70K548j256
6313a2344K707M795L276m910n676j0695n666Q564P206N203K160m281j17J383j367
$$ y = [-3441, -1100, -519, -6618, -6225, -715, 1658, 1565, 8643, 7752, 14633, 8203, -1180, -7469, -12238, -15911, -4139, 207, 2713, 5411, 8880, 12503, 13232, 7691, 1951, 900, 4059, 6768, 2282, 2082, 1823, -208, 2669, 3454, 7862, 2138, -4314, 788, 3045, 3857, -2023, -1286, -3441, -5178, 1754, 5517, 14052, 13782, 2350, -11907, -17596, -11623, -9525, -3050, -1748, -3772, -11262, -12836, -10641, -5246, -4040, -5838, -11972, -11860, -6014, -5652, -7919, -9097, 2750, 3776, 2821, 2751, 2270, 6282, 8800, 8387, 3813, -2948, -3468, -40, -1678, -2862, -17150, -15852, -8913, -8203, -7572, -4988, -7827, -8298, -13649, -12203, -10598, -8640, -8906, -11184, -9111, -2602, -3244, -9021, -5459, 3116, 6301, 3034, -3708, -9552, -10662, -12666, -13636, -11088, -12344, -9637, -4842, -1566, -6476, -12152, -22847, -28513, -19949, -12743, -7540, -5380, -9661, -9778, -8395, -9762]
6298i762l513r655M105J263K317R348L737r49O333n666n366k047J857L276J714
6283c008k424m939R65r55j812q53O755K398K707N337q201M779K458j524k892q329
6267i538p29k998m098Q04N972K987p486l680R451M916l078j205m664J815N058
6252f473l201j438P12o351m36L464J0794J2517K810o201j0463m695L092N195N503
6237D829l491P97j314l651K5L372p80j133l073K421J408N878O861j074n707M415
6221I783Q48q715K647Q327k521R72o03l960o276j840k820r693L884J4934K472
6206G439p249N570J690K873M167l576k616m208K14j279o46p064p426n569R390
6191h290Q642m687Q49P90n180K668l869j339j09m420N041K752M719O550N2Q134
$$ y = [-9762, -13275, -22930, -18825, -17562, -15245, -5897, -2160, -3109, 3224, -2442, -7808, -9855, -7998, -4722, -3008, -5432, -10371, -9406, -10361, -12173, -13026, -6271, -3873, -1166, 4171, -4030, 749, 3207, 1683, -1209, -9538, -10267, -13265, -17363, -16559, -10587, -7600, -15086, -18766, -9315, -4399, -7477, -8682, -13346, -11531, -6473, -9674, -11112, -10400, -16751, -17187, -13723, -2929, 9588, 12398, 6197, -4266, -8961, -5869, -674, 4829, 1338, 2135, 821, -2830, -2805, 567, -213, -1346, -4419, -1998, -590, 5288, 12149, 11075, 5368, 9783, 10631, 1916, 4563, 12890, 10369, 11341, 10738, 6778, 502, -1338, -4158, -13851, -9967, 4967, 7439, 190, 5760, 7450, 10323, 14490, 10914, 8298, 4090, 4304, 3025, 2379, -4685, -12111, -17680, -8290, 352, -4335, -3486, -2696, -7876, -5208, -9077, -10416, -10525, -14945, -9904, -7152, -2433, 4117, 4169, 12303]
6175A2303q639n555K947O64J23k340L056J591l457o415J0392L757r349o238l019
6160a0179J620o83j669N512k951j397l213k584k936L365L118L105N234l380O656
6145c82J074o808K059j149M706L326L881m31k386j025o537l29N823J4952J007
6130A7781p089m058p428L408l516k40J6l92N462k501k302j671P02q564l233Q47
6114a2778J021Q83P886M689j2027n974j0028p27p71P338Q623r31O915O514M247
6099D880N223R897j014o033N434m156q567q321n682l253m949m20M075j435q381
6084b2702j789R892N284M02m682m434k721N192J1579P821M15p524j1952m005j367
6069b0591L7L265K417m132j032M167J141M342l54N668K301M640J932m710p963
$$ y = [12303, 3664, -1891, 1056, 1720, 1843, -497, 2559, 4150, 693, -5722, 4670, 8427, -922, -7160, -10179, -8559, -9242, -10911, -5399, -8350, -9747, -12960, -15544, -18480, -15115, -11997, -8892, -3658, -7038, -382, 692, -6116, -4057, -5206, -500, 2826, 6707, 6276, 3890, 2865, -3672, -4001, 1822, 16774, 17781, 10692, 6634, -794, 2614, -902, -1142, -1126, -1518, 3944, 1443, -859, -2530, -1828, -10392, -13625, -12778, -11757, -10874, -2988, 1701, -10326, -16300, -26328, -27055, -27826, -20488, -11865, -12796, -5881, 633, 4880, 10103, 20000, 18986, 12953, 18387, 14231, 5664, -2657, -8339, -11592, -16541, -16961, -12886, -14321, -22702, -24491, -14599, -9315, -8913, -13595, -18029, -20750, -15558, -3979, 3842, 4257, -3267, -15219, -19224, -20591, -20554, -17289, -14872, -19004, -20036, -15869, -14728, -10386, -10740, -5072, -2771, 1869, 3801, -909, -8872]
6054h872p670l522L988M738n017j88L276M062J955j029N643L068J0010J014j1380
6039G6j0952M869L035l938K846L480m555J124j625N856N04j0564m405K701j088
6024a2636J3848J239o727j862M236J627j33J431o604n468m541p893L10m981O409
6009b1745K071r32M636R509M599O920M284l565Q06o00n527l315j0948m15L805
5994a0417l030M528Q073L320n562k733Q795K619O03O621q764k658M669q790j947
5979d673J305n616p353L005P031N061R44r77L566o480K283j24K457N314l885m951
5963c093R711N570O17j041p011k137k370n123o724P731L812o190j1160q916Q817
5948a7507J2705J0762P381l298o59K550j1284j1409Q9m332l462M221k106n604
$$ y = [-8872, -16542, -20064, -16076, -11338, -16355, -16543, -13267, -9205, -7250, -8279, -2636, 432, 10442, 11456, 76, -10876, -6007, -2972, -6910, -4064, -584, -5139, -4015, -5640, 216, 720, -9844, -14249, -11548, -12636, 1212, 2451, -4276, -6138, -1902, -275, -408, 1023, -5581, -11049, -15590, -23483, -23173, -28154, -21745, -19674, -20606, -15970, -6461, -1862, 5058, 9342, 5777, 6583, 5983, 456, -2859, -13807, -14222, -10417, -13447, -8919, -846, 2474, -3088, -5821, 2974, 5593, 6196, 12817, 4053, 1395, 6064, -2726, -4673, -3368, -8984, -16337, -13332, -6301, -1240, -296, -1273, 2293, -4187, -1904, -2028, 429, 5743, 1858, -3093, 6618, 12188, 12805, 11764, 4753, 2616, 246, -4877, -11601, -3870, -58, -6248, -17408, -26324, -17507, -4802, 5960, 13341, 10043, 9384, 11934, 650, -10759, -10670, -15002, -18464, -14243, -16349, -21953]
5934b1953R2q74M039j716M634O959l554K661N481K801R13J824N333n24N223L38
5918A1677n051n430p847o936k65Q75N892M485J843L93l634j316o606m198J0179
5903e939R94m097O552P314n686o493j204N7O868L646J587M604N58R08q712r29
5887B8Q318n298p075j089o015J401Q145j590q150o765n69J42m879J0370L420R76
5871h630k057K594l534K432o925Q008L896P259Q44l710O655K437j0749j0956n34
5856a2970N447K545k000K241Q061k513o939K873K992O83k746p716o167m24L362
5841a3271L205l576L541L885m92m731O462M32q743L7N756Q055r03j560j343k27
5825c473K740j056j694L426K920N044k317K31o57l026J026q73Q063k947n672m590
$$ y = [-21953, -21861, -22735, -18696, -20412, -15778, -8819, -12373, -9712, -4231, -1430, -517, 1307, 6640, 6116, 11339, 11677, 6626, 1196, -6651, -13587, -13852, -12977, -7085, -2600, -757, -364, -3998, -5314, -11920, -16118, -5939, -4945, -9042, -2490, 4824, -862, -7355, -8559, -8502, -1634, 2012, 3599, 8203, 8761, 9669, 957, 28, 8346, 3048, -4027, -5116, -11131, -9730, -1585, -3175, -11325, -18090, -18659, -18517, -23396, -13026, -9606, -8630, -10687, -8093, -11627, -9195, -16120, -8112, -4216, 3043, 3887, 177, 6832, 9269, -1480, -12436, -12970, -7523, -4978, -6978, -4737, 3324, 811, -6128, -3255, -263, 420, -2326, -10042, -16209, -16633, -13271, -10066, -13642, -10101, -6216, -6708, -11439, -4977, -4545, -13288, -13251, -7495, 560, -343, -1903, -3246, -3473, -733, -1789, -3483, -57, 2863, 7907, 5590, 5821, 5164, 2138, 3164, 2291, 10354, 7407, 1735, -2855]
5809b855m820j842m134l452Q20N798J4043J6473j159q060N87m316k024l208L172
5794E023j866j578j740l212p551J856J449K843O673q226o254N436M120n95O748
5779C126j358n633K511j0492j448L307K311j653K496Q426N21m458M818J986j402
5764C058k033n804j0517m430J559J3111K048j116J387K007o2l462j656J0469k220
5749B339l861l323K274p65N45J222P831j90m159l843p495J636K885j233j387r95
5733h519Q76Q064M347k757n527L30j807p088p508J619Q353O886o31L743Q256k897
5717E740k366q440N981l319m073P418k922o68m740L12Q001N922L358q513n61J829
5701B959m701J272j2593r28Lk463J692n95P220n35R14l191q356J893Q472J807
$$ y = [-2855, -7675, -9517, -13651, -17103, -16283, -10485, 3558, 20031, 18872, 10812, 11399, 7083, 5059, 1851, 5023, 3157, 1579, -161, -3373, -10924, -9068, -7619, -4776, 1897, -6329, -12583, -7147, -3027, -3622, 3126, 1768, -3865, -1354, -11846, -13294, -9987, -7676, -9329, -6833, 1593, 2114, -2344, 2474, 4460, 3058, 1025, -4779, -15296, -19726, -18167, -5056, -3008, -4124, -2737, -730, -792, -4254, -5910, 4559, 2339, -1522, -4845, -2571, -3336, -2791, -1569, 6262, 6072, 1913, -1930, -9425, -7789, -4904, -6137, -7524, -8519, -7643, 421, 4768, 2011, -3516, -3186, -4993, -12081, -19589, -17970, -9617, -2731, -3362, 381, 8637, 5740, 3374, -5066, 915, -2404, -6477, 941, -1981, -2649, -7389, -7077, 924, 6846, 10204, 1691, 1130, 2959, -1742, -470, -13063, -13991, -13988, -16451, -14759, -15354, -8134, -8669, -7755, -10946, -19302, -17409, -8937, -7130]
5685g130M053k765j1801k50Q633k078L851l54K563r90M143L052L622k446M48K937
5669E488j132K61m084k571o00M596m161J249M544J564L907K91n658j1254l546
5654a1106l648O592O253l76N56Q82J588l744J344j104k041q98J411j433N618o95
5638h01O68q289N397J567P90K312K990k686k344J336N402j920k940k271k593p988
5622a1370K982P393j367k766K480N883p81N67Q57M141K600m369o324J92O5o961
5606f778M993J969J908k116l570r39j745j273o637j824M636P307J700n286L046
5591d609P296o253n394K510N864j64N787n086q571m716K617M338N550p888p041
5576a5760K969J436q22M558J228p45O754r69P945m341o019o530m325k481R181
$$ y = [-7130, -3077, -5842, -17643, -17893, -9260, -11338, -7487, -7841, -5278, -6268, -2125, 927, 4549, 2103, 2551, 5488, 4356, 4617, 533, -2038, -2638, 1958, -2203, -954, 3590, 5154, 9061, 9352, 3694, -7560, -11106, -14754, -8162, -1909, -2285, -1729, -847, 741, -3003, -1659, -2763, -4804, -5702, -4291, -5724, -106, -801, -133, -8422, -3025, -1458, -668, 1644, 4634, 1948, -396, 940, 6342, 4422, 1482, -789, -3382, -11370, -8388, -995, -2362, -5128, -2648, 3235, 2454, 3021, 3878, 8019, 10619, 6250, -74, 118, 183, -6778, -1785, 184, 2092, -24, -3594, -4533, -6278, -7551, -14188, -16012, -11376, -4069, -2369, -7655, -4609, 2687, -3566, -8960, -6450, -586, -750, 5037, -49, -8620, -13336, -10719, -6381, -831, -8719, -15760, -12791, -11355, -12177, -7619, -6391, -7136, -382, -1351, 6594, 2253, -3766, -10296, -14621, -17102, -7921]
5561g921Q252n047o529R552N222m452p457m228L819M899J881j579K382k641Q78
5546b969L705J153N118N940O71m606l574o682J587o0j04l001O71n749M354j510
5530e056q372j982J11r49m269K881O026K457L562M53l364J885l857m200K506P758
5514d410n430r61O551m22Q05J468n774K152M770J545n95M466N287r53K369p71
5498A0097m950o241k198l931K029J34k542L569J685j839M283j0040j2976N356
5484a7564N181L96m61K385l195M760N774M078J266l639q949J856J522J297j4588
5469a9881N75J3204P56N542K691P20k498j706p58P852K606l103J406j530q596
5454b720J473J829N743P83N377n076l980j722n461O528J834o46m780p476m027
$$ y = [-7921, 331, -4716, -11245, -1693, 3529, -923, -8380, -12608, -8789, -3890, -2009, -3588, -1206, -3847, -2969, 736, 1889, 7007, 12947, 13618, 9012, 5438, -1244, 343, 283, 179, -2822, -2151, -7900, -3546, -5056, -13428, -15410, -15299, -16248, -20517, -17636, -11610, -9153, -5591, -5138, -8502, -6617, -10474, -14674, -12168, -4410, -9840, -10801, -4250, -4672, -3867, -2399, -8173, -6021, -1251, 294, -301, 4165, 9452, 8499, 10868, 10097, 5147, -1094, -3292, -7223, -5194, -5060, -7602, -4033, -2348, -4187, 96, -9944, -22920, -17564, -12383, -11987, -12448, -10063, -13258, -8498, -2724, 1354, 2620, -1019, -9968, -8112, -6590, -5293, -19881, -19306, -6102, -5346, 196, 2887, 3607, 1109, -597, -1355, 6497, 9103, 6000, 7406, 5876, -2720, -1247, 582, 6325, 7108, 12485, 7409, 3429, 1707, -3754, 2774, 4608, 3962, -818, -8294, -12321]
5439a2321j20L173O292P712N829J0229l092L146q6j4771J127j576j1392o959Q34
5424a1975K83k824R929J987l516J793m147R454r62j0141o079Q216L896O727j273
5409A368m721n940o094O473R75l25l104m611J88Q279O511K917O671O464m973q285
5393A793q537j362J789R005M956r47q124l956m731N817Q311R82m836j670o418
5378g928q115k560J594L384O970J518l151o352l889l33Q159J0244K00P25N172
5363E638m095k452j1445j973n933L727M185l67J281J253L397N984J519o230j697
5348g208K736Q142K432n020jN06K600m049k828m086n468M09K451j251J498M122
5332e015J428q556J80K349k29O280J015k848M43K016N14N482J239j808k694J962
$$ y = [-12321, -12441, -9268, -2976, 4736, 10565, 20794, 17702, 20848, 20762, 5991, 7118, 5542, -5850, -12809, -11975, -11692, -14516, -4587, -2600, -6116, -4323, -8470, 984, 22, -10119, -16198, -7982, -4086, 2641, 1368, -3353, -9293, -15387, -8914, -7939, -8264, -11368, -15979, -15791, -7512, -1001, 1916, 8587, 15051, 10078, 1793, -6744, -8106, -6317, 2688, 7644, 6697, -1427, -5383, -10114, -4297, 4014, 4996, 160, -1510, -7928, -16043, -18603, -17009, -13625, -6655, -5137, -8288, -14640, -18529, -18862, -10703, -459, -259, 466, 5638, 1543, -909, -12354, -14327, -20260, -16533, -12348, -12715, -11434, -10181, -6784, -800, 719, -5511, -7208, -4472, 3670, 6102, 1082, 1081, 1587, 4187, 138, -2690, -6776, -12244, -11835, -9384, -10635, -9137, -5015, -3587, -12143, -11963, -9614, -9843, -3563, -2548, -5396, -4953, -2937, -2423, 3059, 4298, 2490, -204, 1758]
5316A758J332L726j2247Q26Q190m055P49L17K504P290Q072J582l472L959l281
5301A7250q622j0450n648L696M649R612K817J52j2510q899k600p845m442R062
5287a3778O726O079J6081Q88o468m519j676P839k006l186m717k583Q22P0K349
5272A921q283j3175j0425K764N596R228O859N383o263q008L127O035R7L883l69
5257a630n766K666K974K001k398n041j973P345L367n409m903o503o20R245k04
5242f849k430N877l638q320J269L428P873O063l31k716J121k568o17j785j751
5227e374p354O91P816M046m947k466L260J946k212j1059J986k331K934M681l348
5212a1731N229R816n88j0019m279O7J0175L847O392j392r92p268r78O721Q782
$$ y = [1758, 3090, 6816, -5431, -4605, 3585, -470, 279, 596, 3100, 10390, 18462, 20044, 16572, 20531, 17250, 8628, -1822, -7470, -3774, 875, 10487, 13304, 13456, 946, -7953, -10553, -18398, -22840, -13778, -7052, -973, 15108, 15996, 9528, 5009, 3333, 11172, 9166, 5980, 1263, -1320, -498, -428, 1921, -6362, -19537, -29962, -27198, -21602, -12374, -5515, -132, -6395, -14403, -11276, -5241, -5144, -1261, -1630, -7396, -4730, -1756, 245, -2153, -7194, -9167, -1822, 1545, -3864, -8767, -15270, -15890, -6645, -6849, -9279, -3402, -7040, -15360, -14091, -10663, -2790, 3273, 2942, 226, 1347, -1221, -1838, -3623, -5374, -12728, -12037, -4221, -175, -5122, -7588, -4328, -2382, -4594, -15653, -13667, -15998, -13064, -8383, -11731, -6502, 3314, 2726, -7293, -11572, -11505, -1330, 2517, 8909, 7517, 6525, -743, -1721, 5000, 13782]
5197A3782N806O91K678M438P158R28J549J60j369r464p264n361l700q065m164
5182b197j599k550M560j0106J937N516J935j857L909j910o106q493P313K09o942
5167a6381M762K627l991j84J432N029l716P15L396n204o04M092J990M892j428
5152b573l029K544Q581O041n650m314l497l976m92n094j479L559L234R413n91
5137B677n154J100r06l849q949r284J291K855K364R109L157j624o564Q576J2195
5122F994Q343j0848j7574N870M177J363P68M3l040m502m75P40O61Q244J73j815
5106h78l035m068O57K144n881k590J0318M944p164O633j036o979j395n004k777
5091a6111O120Q267J0755O384n458j097L33p334j895L871K380k474l813j135n700
$$ y = [13782, 19588, 20279, 22957, 27395, 34553, 35481, 37030, 37190, 35821, 26357, 19093, 13732, 10032, 1967, -2197, -3796, -6346, -1786, -11892, -9955, -4439, -2504, -4361, -452, -2362, -8468, -16961, -9648, -9439, -16381, -11619, -8992, -12983, -13167, -11735, -6706, -10422, -9707, -6311, -11515, -12119, -8027, -6037, -1145, -2573, -5602, -3058, 5523, 11564, 5914, 1600, -1897, -5873, -6365, -11459, -12938, -9379, -6145, 3268, 2677, -2477, -1377, -2283, -6132, -15081, -24365, -23074, -20219, -17855, -8746, -5589, -7213, -13777, -5201, 6994, 15337, 4489, -13085, -7215, -3038, -1675, -907, -864, -3904, -8406, -8881, -8141, -7480, 764, 937, -878, -3913, -7981, -7324, -5180, -11061, -13651, -3333, 1611, -5553, 1080, 44, -6935, -8330, -13334, -16111, -9991, -1724, 9031, 15415, 9957, 8860, 9193, 1859, -36, 3835, 6215, 3741, -72, -1207, -6907]
5076f907m124M676O434O336K274n850l117k841N4k996P87L009j968q301q270N635
5060a5169Q540r78j550l3n129r50K275J883R046K366k102L018K455n325q908n819
5044a6380K44O488n75n719O956J4150k410o405m747L773M278P346O192K834l435
5029A2590p096j956m903J582J93j371k421m083n732N559R209k228k102j526n21
5014d806j502K775L136O432N84q117j1370Q18M376K932n32L793j055k705k138
4999g379M443J14L75L034j2873K146K308N91M993K341p893n940O040M860K144
4984f96j215m096L273J639k542P55l72P07Q4L612k45J046Q135J895p246k787N29
4967B476m292j17K797m088k742N575l396j678r171l113P937O557p84k778L743
$$ y = [-6907, -11031, -6355, 79, 6415, 8689, 2839, -278, -3119, -3065, -6061, -5274, -2265, -4233, -12534, -20804, -15169, -6629, -7607, -9157, -9190, -14319, -15269, -12994, -11111, -2065, 301, -1801, 1217, 3672, -1653, -10561, -16380, -16136, -9648, -10223, -15942, -8986, 5164, 2754, -3651, -8398, -4625, -347, 6999, 13191, 16025, 12590, 5494, 3538, -1365, 217, 410, -961, -3382, -7465, -13197, -7638, 1571, -657, -2759, -4285, -4806, -6308, -3533, -397, 6035, 6619, -1498, -12868, -12050, -7674, -4742, -5274, -1481, -2536, -5241, -7379, -2936, -2822, -2447, 587, -12286, -10140, -7832, -7241, -2248, 93, -7800, -13740, -7700, -2840, -696, -1911, -6007, -2734, -1095, -3637, -2882, -3254, -2547, -2463, 1149, 904, 1950, 10085, 11980, 4734, 1947, 2476, -1816, -1933, 864, -3224, -5966, -391, -3787, -5465, -14636, -17749, -9812, -3255, -4039, -6817, -3074]
4952c074J143l913l533K142O652M001L8o297m479M008P453j433q874l535J023
4937h678M88K922j223m807L300J065O427K554l115m416N773k948l195K812k000
4922e041j0179M260O559m974J109k268o093N401L814q050k249J4197m221k814
4908a0549Q493J406L326J31l44O84L021O46K563k468n45J689N019L845k966J31
4892A4082m3k540k069P399l333N685o586l061l677o682J990k974p620M519M819
4877i1K759Q800J532j086n514r414j722j124N144M085o549M486N545j70o020l530
4861b869L813m727J1536J629q854J032k360K451K727p100n596o46n70K142K664
4846d728k182K362p010n018l762L145N507O479K308n128P376J289k109k065N68
$$ y = [-3074, -1931, -5844, -9377, -7235, -583, 3418, 3456, -2841, -7320, -3312, 4141, 2708, -6166, -9701, -8678, -8190, -5268, -6491, -11298, -7998, -6933, -506, 2048, -1067, -5483, 290, -2658, -5853, -3041, -5041, -15220, -10960, -4401, -9375, -8266, -10534, -16627, -11226, -7412, -15462, -17711, -3514, -7735, -10549, -2056, -650, 2676, 2807, 2463, 3147, 6168, 6814, 9377, 6909, 6364, 8053, 13072, 16917, 13951, 14082, 14039, 11499, 9430, 16829, 13496, 19181, 12595, 9534, 5857, -825, 1165, -1809, -9429, -4910, -91, 2668, 11468, 13000, 11914, 6400, -3014, -4736, -5860, -716, 3369, -3180, 1306, 6851, 6681, 661, -2869, 944, -3783, 7753, 9382, 528, 1560, -800, 1651, 4378, -2722, -8318, -8964, -9534, -7392, -4728, -6910, -4548, -11558, -16576, -20338, -17193, -11686, -5207, -2899, -8027, -651, 638, -1471, -3536, -2968]
4831b968j717O66Q597J708m81L762l650P3n386K635j769o174J730O686j245k423
4815D4n106q478J508q62M891O590p62M148P902j849k481o51k554K013l352K410
4799C411J966j767k413r045N766M762K705J211l22q938l514k67L086N101M142
4784E884k750M439l648l10L792p335j4565o004O447Q430J678L251K428k141j84
4769e88j253M949M687K803k535q174K484O827r274k705L237Q131J027N99l030
4754G185o425o34M898K667l483m355n27k469k910m690J7390P817m492q409j0234
4739h671n276Q126M974j018l831N064P712K433j797k276r132j1646K630N529K627
4724d552m795p266n548K156P247l995m850N475N472n58J143L843l396j743K72
$$ y = [-2968, -4685, -4019, 4578, 6286, 5805, 9567, 5917, 5990, 604, 3239, 1470, -4704, -2974, 3712, 2467, 44, -5062, -13540, -12032, -12894, -8003, -1413, -2175, 1973, 9875, 8026, 5545, 4894, 2340, 4353, 1001, 3411, 5377, 3610, 1197, -7848, -2082, 2680, 5385, 6596, 6274, -2664, -6178, -6445, -3359, 1742, 5884, 3134, 7573, 3925, 3615, 7407, 72, -14493, -20497, -14050, -5620, -3942, -691, 1737, -404, -588, -1841, 3108, 7795, 10598, 8063, -111, 2373, 9200, -74, -2779, 458, 8589, 9616, 10215, 7185, 760, 126, 5024, 7691, 4208, -147, -674, -3143, -6053, -10743, 6647, 14464, 9972, 1563, -8671, -13947, -5821, -847, -1865, -5696, -632, 7080, 9513, 7716, 5440, -3692, -15338, -12708, -7179, -4552, -9347, -16613, -22161, -20005, -12758, -16753, -21603, -16128, -10656, -11214, -10071, -6228, -9624, -11367, -11095]
4709a1095N234N648l116j400L326J743J633J730J045n671j188l620P33J1196j538
4694D660q19k103j5307m480R015N306o35L015j802M792O420j551n27k28k118K43
4678C881r805k809p395Q94K817J287O127P100P339m159p527n060J531n52m641
4663a0972k374M05K709L129J560m20l381n08k419O135Q287M490L938o556o241
4648b218L270M342n814n27M958L791M36j143L717m682n586k293n698K037J563
4633c847j855q84K44O698J892j0761n51M367l265l695L042L843J868L215K876
4618C187M806J885n684k169p572r50l355P513m32M37M776J450k546R34j738P590
4602H132P014n602k629K75M802j5565l290n21P000O660J835k067l587M257J677
$$ y = [-11095, -5861, -213, -3329, -4729, -1403, 340, 1973, 3703, 4748, -923, -2111, -5731, -4998, 6198, 4660, 3841, 1738, -13569, -18049, -9034, -3728, -4363, -1348, -3150, 1642, 8062, 6511, 5984, 5756, 3638, 3881, -5924, -8733, -16128, -15234, -12417, -11130, -5003, 2097, 9436, 5277, -2250, -7310, -5779, -6331, -10972, -13346, -12941, -10232, -7103, -5543, -5963, -9344, -9852, -12271, -6136, 2151, 6641, 10579, 4023, -2218, 1052, 5394, -420, -947, 4011, 7802, 8238, 7095, 10812, 6130, 544, -1749, -7447, -5410, -3847, -5702, -6586, -6342, 356, 2248, -8513, -9064, -4697, -7962, -11657, -8615, -4772, -2904, 311, 3187, 7993, 9878, 4194, 2025, -5547, -6497, -9852, -2339, -2771, -2334, 2442, 3892, 1346, 2280, 542, 8132, 15146, 9544, 6915, 7190, 11992, -3573, -6863, -7384, -384, 6276, 8111, 6044, 2457, 6714, 8391]
4587H391j1162n041m643L393j320o117M55L287R347N119N000K690M497q188n380
4572C28L179m383m989p407J884j46K901m009M151L314N96N905K430q115l484N062
4556b783M256n306m761r2M840P895P722r055j0436j196P518m07p444O066P58o085
4540h510l392L078J4463n07p886j240K487M221J3K252n108l940O439M006k734
4525C642j256O828n87r86L148m934j0752n735l656J173Q305m263L483J1708n117
4510A001l930O739O940m884K84j11J285j111k883p246o274k748N433Q445J849
4495B789o69N71q783o517L192Q601N256j503m746q744J65M632O798N863L689J337
4479A1931j1093m318l235J109K752K665k220N318N626M134o471j054k027K276
$$ y = [8391, -2771, -7812, -12455, -9062, -10382, -16499, -16044, -12757, -3410, 1709, 6709, 9399, 13896, 5708, 328, 3507, -876, -5865, -13272, -11388, -11534, -8633, -12642, -8491, -5177, -4581, 1324, 3754, -4361, -7845, -2783, 1473, -3833, -8594, -8686, -3846, 4049, 11771, 2716, -7720, -8916, -1398, -1805, -9249, -3183, -2425, -8510, -11902, -8824, 5639, 5132, -2754, -3994, -1507, 2714, 2727, 4979, -129, -4069, 2370, 6376, 3642, 2386, 9214, 8627, 7641, 10789, 5855, -4897, -10632, -14288, -13115, -4810, -9073, -5590, 6118, 1001, -2929, 3810, 10750, 5866, 6150, 6039, 7324, 6213, 3330, -3916, -10190, -12938, -7505, 940, 2789, 2120, 2691, -6092, -12609, -9417, -816, 4440, 2937, -1809, -10553, -10388, -5756, 1042, 6905, 10594, 11931, 838, -3480, -6715, -5606, -2854, -189, -2409, 2909, 8535, 12669, 6198, 5144, 3117, 5393]
4465E393k999j924K70M830Q22Q240M027M768L096q509k346l088n646r09R67o068
4449I24j767M841j239m456j273K309N988N435k073j261J335p057k504l382k762
4434f942Q567P951n756j2808L742O891L849M715L06p780o54K023m290N746k53
4419E307r035j866n411r9R528P350q90m329J050n599n818o202L775R46M158M785
4403b350L092k024K209M891N520l802m214j461k024m707Q9j06N855J190n610n29
4387c981N635J1698p84m212k127p609Q630K420j595m782o864j0240m959L304q68
4372a6334n113K591R491M499J362j174p126l867J4094O933N68P001j185j2404
4358f64n230k938q934M449O107N18n266l318Q58O194O613K125j400L240N12j665
$$ y = [5393, 2394, 470, 740, 5570, 6392, 14632, 18659, 23427, 26523, 18014, 15668, 12580, 6934, 6025, 6992, 924, -843, 3998, 2759, -1697, -2970, -661, 5327, 10762, 8689, 7428, 8763, 1706, -798, -4180, -6942, 1625, 9576, 3820, -8988, -5246, 1645, 5494, 10209, 10515, 2735, 2081, 4104, -186, 5560, 5307, -3728, -5594, -11005, -11104, -1576, 5774, 4884, 555, 1605, -3994, -9812, -16014, -12239, -11293, -7135, -2350, 742, -1282, 927, 5818, 11338, 7536, 3322, 1861, -163, -4870, -4781, -4887, 968, 2158, -3452, -3981, 1654, 13352, 12568, 8356, 6229, -1380, 7250, 9670, 8075, 3293, -3571, -13811, -18770, -15466, -16334, -21447, -18856, -9365, -4866, -3504, -4678, -11804, -15671, -1577, 5356, 5924, 12925, 11740, -664, -5894, -8832, -17766, -13317, -7210, -6692, -11958, -15276, -14418, -8224, -1611, 514, -886, 2354, 2866, 1201]
4342A201J299m21K955J018O328n428j0544n477l908J159J15K777N957R010M311
4327A0352j802k810l291P47n572p567j402k315k17L598l451k197J338Q667o35
4312f557J656J0627N840o908j436M62p366l306R105J961J273M103L816M456m934
4297A2792o133o60l077j598m426r50M173N138L609O32j6003o508N000L65Q148
4282E02L134k08N194R12J731n32m640o434m29J624Q600J88p782K59p60o522k01
4265e364l600m067k405L712K437L095j71J702Q108J911K600l465m518J0238J461
4250A1674q060j609M422J265j2295j9m387J447K768K048o489k224J712l11N69
4235i489Q209o450M749L999Q307N742q464M4j048p967K151L01j0272j2311J975
$$ y = [1201, 2500, 2079, 5034, 6052, 12380, 6952, -3592, -9069, -12977, -11818, -11703, -8926, -2969, 6041, 10352, 8550, 5740, 2449, 3196, -2376, -9943, -11345, -13660, -13877, -10279, -13730, -15927, -14589, -5922, -6557, -4901, 5726, 11566, 4658, 3222, 3684, -3682, -6988, 2117, 4078, 5351, 9454, 13270, 17726, 12792, 6659, 5999, 2922, 1324, -3102, -4052, 121, 5259, 8868, 9500, -6503, -13011, -8011, -7646, 502, 3636, 3428, 8622, 9534, 11265, 10733, 6093, -341, -770, 854, 9454, 9642, 1860, 2119, 1359, -5163, -5364, -8964, -13031, -15436, -11724, -9287, -6192, -6363, -4661, 3447, 5358, 7958, 4493, -25, 10213, 11674, 3614, 2005, 6427, 7692, -4603, -4622, -9009, -7562, -4794, -2746, -9235, -11459, -9747, -10058, -9489, -1280, -7730, -2981, 1018, 9325, 15067, 6603, 6647, 5599, -2368, -217, 84, -10188, -22499, -20524]
4220b0524j729n97Q066J0166J791o637L006P238J943j815K760p681L645K36j900
4205b032r570m452K862k964J663J640L138L049l612l977K73J439Q987r3q980M055
4189h574M502O363m481k120J18l670L856N245q68O133O221N807K29j0687k625
4174E449r62p873L913L344l466K288O258n363M41R687L650l758j1725p10R63J960
4158D096k992q955l641j93L309J0264k418n585j235M630M01p227q265M497J834
4143a1480M786J1916l09n590M113J956l574j273k126J406K587P07r984l217O154
4128c928J1007k279j0578n75k7O33R244n20p645r082R172J2514m49m17l228j3255
4112i413k661Q012R148l784o739m794J0017L649j0743j3617p61L0J204J4313j232
$$ y = [-20524, -22253, -22850, -14784, -4618, -2827, -9464, -6458, 780, 2723, 908, 3668, -4013, -368, -132, -2032, -11602, -16054, -13192, -16156, -14493, -12853, -9715, -6666, -10278, -14255, -13982, -12543, -3556, -3649, -12629, -8574, -4072, 2291, -2190, -4310, -4192, -7862, -4006, 1239, 371, 6504, 12725, 18532, 18761, 8074, 5449, 4487, -3386, 527, 3871, 405, 2693, 8951, 3588, 4029, 13716, 17366, 13608, 1883, 1173, 2136, 4096, 1104, -7851, -11492, -11685, -8376, 1888, -530, -6115, -7350, -2720, -2319, -9546, -17811, -13314, -11480, -6694, 5222, 4913, -677, 3436, 5392, 1818, 545, -1581, -175, 2412, 3119, -6865, -10082, -3928, 7079, 4800, -5778, -6353, -6380, -5747, 3497, 2977, -4668, -13750, -4578, 7936, 7487, 7070, 3842, -9413, -12074, -4062, 5086, 1302, -5437, -10231, -214, 3435, -7308, -20925, -21686, -21656, -20452, -6139, -7371]
4097g371p825q65N581J286j797n134N707R658j000K867r061k656n341k661P908
4082a0704J138j333k524M291K555k02r82o992J0736K281m566J427P295N04j85
4067B739k663J416j502o787r320N517R565J074o584N09l514J542j644r26N856
4052d722n426n501K980n091o89P61l237J704K60Q392J0132L406O499k250k457
4037D761K962k333o811N494P406j002n08j927r991J330M554J208m036r697k370
4022a0960K426l958M196l72m171K242K29Q94L133K322n9k680M797N365p840M47
4006c989O59l435n29N815O575O011O57m866o972l559L085O789j00l675J219m013
3990c28p650J883L30j191K244K259j921q154J246J4450J0739l893r89q743n257
$$ y = [-7371, -15196, -16061, -10480, -9194, -10991, -16125, -10418, -760, -1760, 1107, -7954, -10610, -15951, -18612, -10704, -9566, -10899, -13423, -9132, -6577, -6779, -7761, -14753, -4017, -1736, -6302, -4875, 2420, 2924, 2739, 76, 1492, -10, -6797, -16117, -10600, -1035, 39, -6545, -6036, -9550, -8008, -9652, -10578, -4722, -10148, -15649, -12669, -17760, -18449, -17688, -20925, -19221, -18961, -10569, -437, 2969, 9468, 7218, 4761, 7723, 5390, -1421, 4073, 11479, 10477, 9969, 8042, -1949, -619, 3935, 5143, 1107, -8590, -10960, -8534, -12492, -8296, -8668, -12839, -10597, -10368, -9474, -6341, -4019, -4078, -6758, -1961, 3404, -4436, -3989, -3330, -6765, -7294, -1479, 5096, 11107, 11764, 6898, -74, -3633, -548, 6241, 6141, 2466, 3685, -328, -7978, -6095, -5765, -6956, -4712, -2453, -4374, -12528, -11282, 3168, 13907, 10014, 9025, 282, -4975]
3975d975p927Q836l791k622J688L102m024l848J866j348N235j940M855M165J35
3960e93k676k776j851o5n353k939K798P686J1453k145j674O981j246J163m354
3945D409n595J828K551n916k072J28L861N318p675K590K896O507K176o459k854
3930A693l819p068n045K619P927N582r43M258N3j905m507J966N683m965j1137
3915i608J590O858m103P52L777R718L28l878j0049m133K491P346L862l139n114
3900c302J713R60q595l189P38P568L643O589l224r714m708O327L047l715J657
3885d205L735M85l528j381l159p029R549Q140o266j0066N78J0458M166r09j0126
3870i558N06P350qn159p68K974R5L327m957L272N148M220j440j70Q74Q00K632
$$ y = [-4975, -12902, -4066, -7857, -10479, -8791, -5689, -9713, -13561, -11695, -13043, -7808, -9748, -4893, -728, -593, -3269, -6045, -7896, -7961, -13314, -16253, -13455, -5769, 5684, 3539, 1865, 8846, 7600, 8763, 4409, -1186, 642, 3193, -2723, -4795, -4667, -806, 4512, -3163, -573, 2323, 8830, 11006, 4547, 1693, -2126, -9194, -14239, -11620, -3693, 1889, 946, 5204, 5257, 3352, -1155, 811, 6494, 1529, -9608, -8018, -1160, -5263, -4511, -734, 8984, 9312, 5434, -4615, -8748, -6257, 1089, 4951, 1812, -3302, -1589, -629, -9224, -12413, -11675, -4107, -464, 6125, 2901, -6813, -11521, -5194, -2147, -5862, -4205, -470, 15, -3513, -4894, -8053, -15082, -5533, 2607, -3659, -13725, -13147, -2689, 1477, 568, -9558, -9052, -1702, -1710, -6869, -7637, -4663, -4568, -1241, -6198, -2926, 2222, 6442, 5002, 4832, 5706, 6506, 9138]
3853I138O642j176o093J360r218j895k68N603o190r912k648l285Q103R50K510
3838f379l218O78N629k153J626j026m42K128J0508M158m398j1465m465j076k668
3823a2563Q49n141O772O962m255p176R56P966J072k903ql719m118K839K667m607
3807a4407j579P786L951l791l074m541j292K941p77K446R765l465p069R352M739
3792I85l193o738M219N757O445K236k2N384m056o307K734k161K977J358n701m715
3776g98K843K12M206l004J955l780L109o879Q29J582P071M942n561l037K008J659
3760G357m521K458r494j623M390M790k648K56m645q866Q818m794p497J090N269
3745i660N184M342o78m607q006K402O961j135K470j153L712o221K38j397m289
$$ y = [9138, 15780, 14604, 8511, 9871, 653, -1242, -1510, 4093, -2097, -12009, -14657, -17942, -9839, -8889, -6379, -9597, -8919, -3290, -5443, -3817, -4843, -5285, -3157, 7351, 11509, 7111, -4354, -8819, -9895, -12563, -11714, -16855, -10083, -3121, -7376, -14552, -13596, -5630, -4558, -7461, -7469, -11188, -15306, -12467, -9800, -14407, -15986, -8200, -4249, -8040, -11114, -15655, -16947, -14006, -14783, -12337, -2572, -6037, -13106, -3754, 985, -2208, -8946, -4727, 1030, 7475, 9711, 9689, 15073, 11017, 4710, 7444, 5283, 8260, 9618, 3917, -798, 2045, 2257, 6463, 3459, 5414, 1634, 4743, -2136, -1307, 275, 7346, 12288, 6727, 3690, 5698, 7357, 2836, 5294, -4200, -5823, -1433, 3357, 709, 965, -3680, -12546, -3728, -8522, -16019, -14929, -9660, -4476, -134, -812, -5419, -13425, -11023, -4062, -5197, -2727, -3880, -168, -6389, -6151, -7548, -11837]
3730a1837o349K677N785L727k163J959P315L236m348K961l061P554K062r797o240
3715f519R74m317j721Q526o36L51J295J718O85P985k375k611j322o987N38J833
3699b583K471l817k421J288J0146O030q190l570j405L517J059j212P60j04r47
3684A022o494J262O439L322p290m993j350J1155M819l027l214p24K018K803j770
3669C978J762j860m315n202o390L721N512J409k092j886J599l591n536N213R789
3654B111J700L831r50j370j01n54l391k650o50m550M805l850l575r7J85J0546
3638A440J92n095M595L794P485j97p095j547j173j461p742O819Q540L35o755n464
3622c329m314K687O659K772L516j511l763K170m96j805k429l678l55j781n261
$$ y = [-11837, -18186, -15509, -9724, -5997, -8160, -6201, 1114, 4350, 2, 2963, -98, 7456, 9518, -279, -6519, -5545, -9862, -11583, -3057, -3693, -3342, -2047, -329, 356, 8341, 5966, 3355, 2033, -4954, -4416, -2583, -112, -3929, -6350, -5062, 5084, 11114, 2924, -646, -2051, 1466, 2525, 1313, 2073, 1969, 1022, -5472, -4210, 2229, 5551, -1739, -6732, -8082, 3073, 7892, 4865, 1651, 927, 2945, 5748, 3978, 5740, 3880, -435, -5637, -12027, -8306, -2794, -1385, -3477, -5363, -3764, -7355, -12891, -7678, 2111, 3811, 7642, 6692, 5322, 5221, 4667, 1276, -1374, -2024, -6574, -1769, -5619, -9194, -9291, -9106, 1440, 1632, -3463, 1132, 4926, 12411, 12214, 5119, 3572, 2399, 938, -6804, 15, 8555, 8890, 2135, -3329, -7643, -4956, 1703, 4475, 7991, 6480, 2717, 4887, 4391, 2586, 157, -3521, -3876, -5657, -10918]
3607a0918O630K766J371l795K852J096P336J2215j848p797p45N41n274m690L30
3592G0l18L077L470L077k461j0019L262q09j802r17R695L679n697k869M2M612
3576F092M741K951o198n425m695m581j521J405j435M532K471q64N71J247k027
3561b736J871O394K506Q789J9n480l625q493q77n039p437P466P551q825r001k035
3545a8952J75L439J0036O995K426j808m270n157M322N155N987N041j530q389k018
3530A452m275J016K53k513J733M640q21j0674M585L633j370j0890L567J0503K360
3515C199M24q193m611L895M925P244M393k519K512N716m591m080o027o021O216
3500B482O475m844j0606o244J009k41m6K054j604P062O212R151j236K065k405
$$ y = [-10918, -4288, -1522, -151, -3946, -1094, 2, 7338, 19553, 17705, 9908, 9163, 9704, 4430, -260, 70, -248, 2829, 6299, 9376, 6915, -3104, 158, -651, -2453, -3370, 6325, 10004, 4307, 1438, 1480, 6092, 10833, 13784, 7586, 2161, -2534, -7115, -8636, -7231, -8666, -4134, -1663, -2527, -1956, -709, -2736, -865, 5529, 8035, 16824, 16843, 11363, 7738, -755, -1632, -6671, -14108, -6642, 909, -7916, -16917, -18952, -18777, -15338, -5302, 1693, 4119, 2311, -1959, -7116, -2794, 2361, 8348, 13389, 11859, 3470, 1452, -2823, -1807, -1554, -4067, -2334, 2306, 1485, -9189, -4604, -971, -2341, -13231, -9664, 839, 3199, 3623, -4570, -9181, -5286, -361, 6883, 11276, 8757, 11269, 16985, 12394, 8314, 2287, -3734, 2482, 8957, 4113, -6493, -12737, -11728, -11969, -12015, -9961, -11565, -4503, 1709, 10860, 9624, 11689, 9284]
3485I284n661N64Q024n176m167M841k779p422k497l753j929m168J571K671Q713
3470a884l833k406M156l062J059K719l398J686N626O509K268J354M596K101r88
3455A6503j698j96n080J300O174K72m227l255j157J417L217p235k461o951q994
3440a2371k278q097M173L259M786R353q86N94p757o463J2851O166n591m333J454
3425e140l847Q380k454J863K409N147k67q861k401k22L69L228n09P42L364n84
3409A217J119N598K003k307K728R236M815M962j373o197j1459j1706K810K422
3395C868J733m270k628n678k013k882L974K664R608K826r52L097Q6M603k741N04
3379A1799M021r508lj635J858R58p212L220Q535k903n057O647J6m150L940J007
$$ y = [9284, 3623, 4187, 12211, 7035, 2868, 7709, 4930, -2492, -4989, -8742, -10671, -14839, -13268, -10597, -1884, -5717, -8123, -3967, -7029, -5970, -3251, -6649, -4963, 663, 7172, 9440, 10794, 15390, 17491, 16503, 14805, 14609, 9529, 10829, 17003, 17275, 13048, 9793, 8636, 10053, 13270, 6035, 3574, -3377, -12371, -14649, -22746, -18573, -15314, -10528, -1175, -2061, -1467, -9224, -15687, -2836, 3330, -2261, -6594, -5140, -8987, -607, -3061, -1198, 1211, 6358, 6091, -2770, -5171, -5393, -5024, -1796, -2305, -1563, 1801, 1217, 2336, 7934, 9937, 7630, 10358, 19594, 24409, 29371, 27998, 21801, 10342, -1364, 1446, 3868, 5601, 1331, -1297, -6975, -8988, -11870, -7896, -5232, 4376, 7202, 6250, 9347, 9433, 14036, 11295, 11799, 15820, 6312, 6309, 4674, 6532, 7490, 278, 3498, 12033, 9130, 4073, 10720, 10736, 6586, 10526, 11533]
3363A1533o137J263Q050l642o136K158L369O558L170o942M38l966M219N150j126
3348A7959j3228n430m805p589k76P292J425L198l56j417R72j706K627Q49M27o277
3332f335J831J626q31m172L639k069j576r00l99N328L347r9k273p13Q317l606
3316A115p57J409L454K696J901l892K292l117n513L09M239J23O725K131J122J17
3300A4354m253P93l318j0N047J764r026p970J386K109j474l977P24P459M624P622
3284A5854l822J807m489K293l603k669k528m755K706M079L677K42L691K560p17
3269A4326J532l237m484j706j1043J360K72O704K269j821j996n141q2l460l593
3254a0100q97k955J963j094M313o528r527q35L531K0269J4436R25q710j4479p034
$$ y = [11533, 5396, 6659, 14709, 11067, 4931, 7089, 10458, 17016, 20186, 13244, 13682, 9716, 13935, 19085, 17959, 4731, -699, -5504, -13093, -13369, -6077, -4652, -1454, -1810, -3227, -2255, -3961, -1334, -485, -58, -6335, -4504, -2878, -3709, -7881, -4242, -6311, -7887, -8787, -9186, -3858, -511, -610, -2883, -3596, 4721, 1115, 358, 1767, 5221, 7917, 9818, 5926, 8218, 5101, -412, -103, 4136, 4259, 10984, 13115, 14237, 14354, 10101, 10894, 7576, 7566, 12613, 14377, 5351, -2619, -1233, 876, -598, -4575, -3851, 3608, 8232, 15854, 12032, 13839, 9350, 11643, 8040, 5371, 2843, -1912, 794, 4873, 8550, 8792, 12483, 15043, 14326, 15858, 12621, 8137, 6431, -4612, -3252, -2980, 3724, 5993, 4172, 2176, -2965, -3047, -6507, -10100, -10997, -13952, -11989, -13083, -8770, -15298, -24825, -25660, -22129, -1860, 12576, 13501, 4791, -9688, -16722]
3239a6722K118N933J1110J719l421j39L119j072M665K400k108p011M530q75n080
3224h34n930K370O445j840m088k26K20J167R149Q082j884K73L640r17j1084l191
3208A352J000r66L338O60J849p263q540K656j35O058L794J858k232J090o119o398
3192g998n148J883M210N203l832K890J908O536P928o706p062k828j13o6P37j903
3176d361J460K695K764M011j946K826O742K256n878K24m072k288J387m351r211
3161g742O019J559L16K380o66n515k85M010k368K81m815L224O339L2n770l627
3145f628J802R702K406l038k843r688j0109O658Q162k37P35p512k135N966M813
3130a946O790L915j518M241n537o974m33L361o296k904O18O691O126k886p885
$$ y = [-16722, -14604, -8671, 2439, 4158, 737, 598, 3717, 2645, 7310, 9710, 7602, 591, 5121, 4246, -834, -6764, -4394, 2051, 211, -3877, -4103, -3883, -2716, 6433, 14515, 12631, 12904, 16544, 15627, 4543, 1352, 2352, 1386, 4724, 5384, 7233, -30, -8570, -5914, -6049, 9, 3803, 5661, 3429, 4519, -1600, -7998, -13146, -11263, -7053, -1850, -5682, -2792, -884, 5652, 13580, 6874, -188, -3016, -3129, -3195, -2458, -4361, -2901, -206, 2558, 6569, 4623, 7449, 14191, 16447, 10569, 10793, 6721, 4433, 5820, 1469, -7742, -1723, -164, 152, 2532, 1866, -3649, -3934, 76, -2292, -2011, -6826, -3602, 2737, 2769, -3001, -6628, -4826, 4876, 7282, 4244, 1401, -8287, -18396, -11738, -3576, -3813, -3078, -10590, -12725, -6759, -1946, 4844, 8759, 7241, 11482, 5945, -1029, -1462, 1899, -4397, -7301, -6683, 8, 6134, 3248, -4637]
3115d637K485K459M737J944r14l350o625M719N438o62o561M192N292l407o439
3100a329p113K43M859j154N965J212q73k273J01L533J791K66J094j291q898j125
3084d992N652M030J968k432k599K92M843n561p935P307J1108l62j507j958o437
3069A417L477O330J0927K24k455n813k246M789J618K247k0p518J658o528k016
3054F091n489j826q04j62L480L528j223k750o555J866Q584O33o727j251k762J770
3038c597o498o548P234J3688O319l939J576o371n495k773N494J1153P76j902o646
3023B471k739Q055P702k04o384O47Q066J330J612q200m558L93O092J0862J830
3008B6975o101p188j5O555n622J013M039p462j0057r628N259N732M082L856k305
$$ y = [-4637, -2152, 307, 5044, 6988, 6074, 2724, -3901, 818, 6256, 5594, -967, 3225, 8517, 5110, -1329, -8442, -8199, -3340, -4494, 1471, 2683, 1810, -463, -362, 3171, 4962, 5228, 6322, 5031, -3867, -4992, 660, 4690, 6658, 4226, 1627, 1919, 6762, 1201, -6734, 573, 11681, 11319, 9812, 7854, 1417, 4894, 11224, 22151, 22375, 19920, 14107, 11861, 16650, 18268, 20515, 20495, 12977, 14635, 8107, 6091, 602, -1224, -2028, -2190, 1290, 4818, 3595, 845, -5710, -3844, 4740, 5373, -1354, -2605, -5367, -3597, -10095, -16643, -9409, 4279, 10598, 6659, 8235, 1864, -3631, -6404, -910, 10243, 11019, 9117, 2471, -268, 7787, 15489, 15285, 8901, 9548, 17614, 18944, 20556, 12356, 7798, 8191, 14283, 25145, 26975, 20874, 13686, 13671, 20226, 14604, 15617, 19656, 12194, 2137, -7491, -2232, 3500, 7582, 11438, 9133]
2993I133K355m658l659j269K880P06N85j677j281l462q80n35O762p70J538l48
2977E420q54l693l586q829o87J148l083o074L683N126M096J3558O904l668n27
2962H934K500p32j301k284j154L323p964o739L785L418L996k431m628l515L43
2947d449O425j714J0252N050l110k509q233o185j557P989R865L295m531j1573
2933i85P25L962J072l086o841K25M684K387J590L0N89O068L183r829O46O27J514
2916F561K7o118m482N953P475m710n794O37j845j669J225L78o004m618o093K550
2900a6527M517m52P635O200J453j161m68m103K243m771r815j103K506K217P801
2885c828K199l109J141P408p518j720m495M05P217O773M597l936o130r221J500
$$ y = [9133, 11488, 6830, 3171, 1902, 4782, 5488, 6073, 4396, 3115, -347, -1227, -1762, 5000, 4230, 5768, 5420, 4566, 873, -2713, -11542, -12229, -11081, -14164, -20238, -16555, -11429, -7333, 6225, 13129, 9461, 8934, 11434, 10702, 9401, 7117, 5963, 9286, 1322, -5417, -1632, 1786, 5782, 3351, -1277, -4792, -4449, 1976, 262, 10514, 15564, 12454, 9945, 1712, -4473, -6030, 1959, 11824, 15119, 10588, -985, -260, 3702, 4774, 1688, -5153, -4928, -244, 2143, 3733, 3763, 4352, 10420, 13603, 3774, 4420, 5047, 6561, 6588, 470, -4012, 1941, 9416, 4706, -1088, -451, -2296, -3965, -2740, -2362, -8366, -12984, -19077, -16527, -12010, -12462, -4827, 1373, 2826, 1665, 1197, -2906, -663, -5434, -15249, -16352, -13846, -11629, -3828, -1629, -4738, -3597, 3811, -3707, -5427, -9922, -9517, -2300, 4473, 9070, 5134, -996, -10217, -8717]
2870h717Q237m005P352k96L180N524j2844K593J348l032L722q28j0371P1J102
2855f964K391O385P386J678l028q87M823p839l377L735R82K118o755o132K929
2840b555M995M461j0326n925K933L214M6J510L956J78J927L221o492j2711m697
2825a6265K566L400J3N475P252m77O193m002r704Q25O074l327k383k429J034n361
2809a1116K3Q075l232m578N97P507Q767m283q588m101J450m07J122r00J2235M447
2793G018J278o020j0783j642N080N313J602M996K114M156Q037j755q161j0573
2779F60j0790o319j288M994Q568l072M597J133Q008K159q902R061Q049m090r070
2764C698m430M13L793l634j0632n031N433P991L940Q86j1059K241R761k277m754
$$ y = [-8717, -480, -4485, 2867, 2571, 5751, 11275, -1569, 1024, 2372, -660, 3062, 2234, -8137, -8066, -6964, -4573, 1812, 9198, 10876, 7848, 6961, 11784, 3945, 568, 4303, 5285, 7403, 648, -5484, -2555, 2440, 6901, -3425, -9350, -6417, -3203, -3157, -1647, 2309, 2487, 4414, 7635, 1143, -11568, -16265, -13699, -10299, -10286, -4811, 2441, 1964, 8157, 4155, -5549, -4724, 1350, -1977, -4360, -6789, -5755, -11116, -11093, -3018, -6250, -10828, -10231, -2724, 6043, 1760, -6828, -10929, -9479, -9886, -8764, -9664, 2571, 7018, 8296, 2276, -8507, -10149, -5069, 244, 1846, 6842, 8956, 13112, 21149, 19394, 11233, 660, -10130, -16449, -17737, -12743, -4175, -7247, -2650, -1517, 6491, 8650, -252, 8809, 16858, 12768, 3698, -732, -319, 3474, -160, -10792, -15823, -10390, -2399, 1541, 2427, -8632, -6391, 3370, 1093, -3661]
2749c661j55P6N43l363p566J33M154N104N60K472r42J056O36M26K919P52m702
2732a558j705l906m903J592Q214L291O32K503l304j0889k763m6l96M694J751L12
2716f481N26K673M871P686m74q674l473j489J927J424n996K391l566r50j754L056
2700h303J166n073K471P116L237L261K983k175k485K523q389k772M753N311j999
2685A625n783P38J598M574j145M550J463j873K012M52N817L151K379m125q339
2670G094l542p146N958J2677K732p383N91P053P450o326r539k885O56J597p160
2655A827o985L185P572M445J35p271l410q32M648O503k264k573M77L656k82M822
2639A3653O845M060j1838n136n380j467o321m326l092q23O768k539j007O383M577
$$ y = [-3661, -3816, -3740, -3197, -6560, -14126, -13993, -9839, -4735, -4175, -1703, -2645, -1589, -953, -527, 2392, 3144, -1558, -3263, -7169, -12072, -10480, -2266, 1025, 1657, 4160, 856, -10033, -12796, -12842, -13238, -8544, -6793, -6481, -5955, -3282, 1589, 9275, 8801, 127, -3346, -4835, -2908, -1484, -7480, -5089, -8655, -9605, -11359, -8303, -7137, -12210, -9739, -2623, 614, 3875, 6858, 4683, 2198, 4721, -3668, -6440, -1687, 3624, 1625, -4158, -3420, -1822, 2752, 1607, 6157, 7620, 5747, 7759, 8211, 14028, 17179, 19558, 15433, 7094, 3552, -3594, 2364, 15041, 17773, 10390, 10981, 18034, 25484, 19158, 9619, 6734, 7390, 8987, 1827, -5158, -1973, 5599, 10044, 10179, 2908, -502, -1334, 3314, 9817, 7553, 4980, 5457, 9113, 8831, 13653, 20498, 24558, 12720, 7584, 2204, 737, -5584, -9910, -13002, -13825, -7057, -9596, -10603, -4220, 357]
2624C57K576M726j701M978k779n657l190m941O976l023K732p81j233N682L957
2609H679r909J312M925m206L563J3705J117q619j0902p870j44J802O030m67m036
2594e020Q692P453J256j0651n941k90p523l383p763j959J293M689J381J0539N590
2579a637N565J924r454m168K028K303j253n856j811M412O546N026j659n052J609
2564a477J595n460M396N777J4K589o139r058j315Q036J292O05L95P97J230p86
2548B491P642K523j929m450m186J682M099J14O28n651o214l473O063R183m191
2533D331o667k508L423O223j428j672L17k707j1407K77O660m006q37M913R031
2518C943M551O385j2366r613M822J0256l484n871j101j463M137J904j390o319
$$ y = [357, 2933, 7659, 5958, 10936, 8157, 2500, -690, -5631, 1345, -1678, 1054, 273, -960, 4722, 8679, -1230, 82, 5007, 801, 4364, 18069, 19186, 10567, -335, -8205, -8349, -6547, -517, -984, -5020, 3672, 11125, 12381, 1730, -4211, -4501, -12024, -15407, -23170, -25129, -23836, -19147, -17766, -7227, -1637, 3928, 5852, -3602, -7770, -5742, -3439, -4692, -10548, -12359, -7947, -1401, 3625, 1966, -3086, -1477, 118, -5342, -946, 4831, 4845, 7434, 1295, -7763, -9078, -1042, 250, 855, 1250, 2047, 3277, 2491, 10133, 12656, 10727, 6277, 2091, 3773, 7872, 7986, 8614, 2963, -3251, -6724, -661, 8522, 4331, -2336, -4844, -1421, 4802, 3374, 1702, 2019, -688, -12095, -11818, -5158, -9164, -10001, -5088, 3943, 8494, 14879, 2513, -7100, -2278, 7978, 4494, -1377, -2478, -3941, 196, 2100, 710, -5609]
2504e609M460J4103q5R33n61r728m091P007o846L30K254P223l888K198k436q544
2488c280l39P02j96m09N677J981J31m074m411n672j978M295M372R515P90k143
2472D961m467K472o202M324J2421p085l211R60l154j587J1243L425n647p245j639
2457d31k260k553L062L646J162P041K098M301m64J300j132o982q302K588L297
2442F371k551J248J013n156l046M192O023R1p372L45J2579m766p201n573j27k863
2426f793N75K519l267K773J78p96o23j803J666N695J234J935p69j334O251J322
2410H763j2491m917n97j603r052J842Q359L392P140k597n514m10R576L684l189
2395B386n80l072J0366m298K768J558J871n387k868j38N726J153j503J596j469
$$ y = [-5609, -1149, 12954, 12869, 13802, 13241, 3513, -578, 6429, -417, -87, 2167, 9390, 5502, 7700, 5264, -3280, -3619, -2917, -3113, -3522, 2155, 4136, 4267, 193, -4218, -9890, -11868, -7573, -3201, 6314, 7104, 4961, 494, 2966, -3236, 1088, 13509, 6424, 3213, 4173, 1019, -568, 10675, 14100, 8453, 1208, -431, -2691, -5244, -2182, 1464, 2626, 9667, 11765, 16066, 15602, 16902, 15770, 8788, 486, 3074, 6371, 3820, 5068, 6081, 925, -2121, 2071, 8094, 8185, 813, 1158, 13737, 8971, 1770, -3803, -3930, -6793, -6218, -3699, -6966, -4193, -4015, -4811, -5434, -7237, -5571, 124, 1358, 3293, 2524, 1190, 7441, 8763, -3728, -8645, -9242, -10845, -19897, -18055, -9696, -6304, 836, -1761, -7275, -7685, 1891, 5575, 2386, 1806, -1266, 9100, 4802, 7570, 9128, 10999, 5612, 2744, 2606, 8332, 9485, 7982, 9578, 8109]
2380H109N185k817p196k397R261j184o128k107k682n31N82o516k536P797Q672
2365E512R777R428M502R130J0289m66j0649r786m893n785o190n822m504M806j934
2350C415j1133k233N138Q074M09K030L794K032o454n248J459m233L025M879l058
2335A896l668p83R463k971L619O08J800j775k862o54l344j660L197K160K40p39
2319D527l156r510k56O361p124m61Q517M264J735k919j2948k22Q669Q950j967
2304D460p057J177n213j021p03L328Q8l442k163L668K416R063P061r232L843M926
2288A1199J029p271o20k778r63P272O64l683J669j260k767j17L958m509p341J1432
2272E914P446l540k038K335J387n278o176O60o816R96J1079k74j691m459l497
$$ y = [8109, 13294, 10477, 3281, 884, 10145, 8961, 2833, 726, -1956, -2487, -1905, -8421, -10957, -3160, 5512, 15289, 24717, 29219, 38349, 48638, 48172, 37523, 27737, 22844, 17059, 10869, 5047, 543, 5349, 3415, -7718, -9951, -4813, 3261, 3670, 5700, 9494, 11526, 5072, -176, 1283, -2950, 75, 4954, 1896, -1772, -2555, 6908, 3937, 7556, 8164, 9964, 8189, 5327, 4673, 1329, -331, 2866, 5026, 5266, 4527, 1371, -8139, -8395, -2034, -9158, -9619, -1102, 3162, 4897, 1978, -10970, -11192, -2523, 6427, 4460, -2597, -1420, -6633, -7654, -8357, -5029, -4941, -8383, -10546, -6878, -4462, 4601, 11662, 2430, 6273, 11199, 12228, 4957, 4337, 1559, 596, 7868, 8532, 4849, 6518, 5258, 2491, 2374, 6332, 1823, -5518, 5914, 13360, 9820, 7782, 10117, 11504, 6226, 50, 710, -6106, -5110, 5969, 5695, 4004, -455, -3952]
2257c952j334K469l35J971m80O372m104k472l146N973P203j191M426k880p639
2242H81J184L999M2J120k99k501j876r05L201m892m189Q24N705J233o380r471
2226a2324J0580M585m201n593k554R53R630j481J614Q127J2314J596J872p207
2212A7911k469n41O38r17k992m983l027M57r11O095J0183p143p121k759q660m266
2196a0505M763M203N764L513m079q509p878k574Q797M662J229m182K382o157o68
2181i239m8P613K084k382r845p881J878Q234R594J105j058N879L775p205j36J650
2165D018n668N721O812J045K322j407j0507j4949J530M234M454j758k16p559J719
2150a0209O440L104N514n064m666o036J215m304m117L154n956L16N702M032K201
$$ y = [-3952, -5286, -2817, -3152, -1181, -1661, 4711, 607, -1865, -5011, 962, 8165, 6974, 11400, 8520, 881, 2065, 6064, 6106, 7226, 6927, 4426, 2550, 1645, 4846, -46, -4235, -3411, 2294, 3527, -2853, -12324, -1744, 2841, -1360, -6953, -9507, -8554, 1076, -405, 1209, 9336, 21650, 23246, 25118, 17911, 15442, 14901, 15539, 14622, 11630, 6647, 3620, 4077, 3166, 9261, 19444, 12301, 5180, 2421, -6239, -10505, -5742, -1539, 4225, 7738, 3659, -4850, -12728, -15302, -6505, -1843, -614, -4796, -2414, -8571, -9239, -9287, -1674, 410, -1972, -11817, -19698, -17820, -9586, 8, 1113, 55, 5934, 9709, 2504, 2368, 4018, -1650, 4071, 10883, 11928, 14250, 12843, 2336, -12613, -11083, -6849, -2395, -4153, -4369, -11928, -10209, -3769, -665, 4849, -215, -4881, -10917, -9702, -14006, -18123, -14969, -20925, -20609, -14907, -10875, -8674]
2135h674R125O599L01n130q004J129j59M34J665m8J579j970j460J054o352K980
2119f931N465K558n346m130J1344Q586L001j0879r774J556J570p153l934J2188
2105a879N178K507O718j420r234K613n185L475O599k471r608q081N046N336m767
2090e173j639J768p89K230J978J640m668Q90K3j846o88r138J114R980P768J637
2074E087P27j012j885l312K842k172k241K177P865L369m406j06j816L50K094l588
2058C973q563r163J301K091J0711m4l084L763n290n96O442J0775j22p414O6R694
2042A4540j138q763n592p59P419M057o04K225k252k153o674n261J440R997J038
$$ y = [-8674, 451, 7050, 7351, 2221, -5783, -4654, -4813, -4379, -2714, -2762, -1183, -3153, -4613, -3559, -9911, -6931, -1466, 1092, -4254, -8384, 2960, 11546, 14547, 3668, -6106, -4550, -2980, -10133, -14067, -1879, 3299, 5806, 12524, 11104, 1870, 4483, -702, 2773, 9372, 6901, -2707, -10788, -5742, -406, -5173, -6812, -5044, -5833, -3603, -1625, 15, -4653, -3763, -3740, -5586, -6274, -15412, -14298, -4318, 3450, 5087, 5814, 4802, 2917, -395, 2447, 275, -1966, 211, 8076, 11445, 7039, 6933, 5117, 5467, 7561, 3973, -4590, -13753, -12452, -10361, 350, 306, -2778, 985, -4305, -4901, 1541, 12316, 12194, 4780, 4846, 14540, 13402, 4639, -953, -1712, 5707, 9764, 9160, 11385, 9133, 6980, 306, -4955, -3515, 6482, 7520]
$$ [...]
##END NTUPLES=NMR SPECTRUM
##END=
