##TITLE=Analysis number 316931
Compound Code cc 38414
Book Reference 382/162
Project Code adrs
Chemist Name simons
##JCAMPDX= 6.0         $$ Bruker NMR JCAMP-DX V2.0
##DATA TYPE= NMR SPECTRUM
##DATA CLASS= NTUPLES
##ORIGIN= Bruker BioSpin GmbH
##OWNER= nmr
$$ XWIN-NMR		Version 3.5
$$ Thu Feb  2 07:31:45 2006 GMT Standard Time (UT+0h)  MAYBRIDGE\nmr@NMR_250MHZ
##.OBSERVE FREQUENCY= 250.131544655141
##.OBSERVE NUCLEUS= ^1H
##.ACQUISITION MODE= SIMULTANEOUS (DQD)
##.ACQUISITION SCHEME= undefined
##.AVERAGES= 16
##.DIGITISER RES= 18
##SPECTROMETER/DATA SYSTEM= dpx250
##.PULSE SEQUENCE= zg30
##.SOLVENT NAME= DMSO
##.SHIFT REFERENCE= (INTERNAL, DMSO, 0, 16.522)
##AUDIT TRAIL= $$ (NUMBER, WHEN, WHO, WHERE, WHAT)
$$ ##TITLE= Audit trail, XWIN-NMR		Version 3.5
$$ ##JCAMPDX= 5.01
$$ ##ORIGIN= Bruker BioSpin GmbH
$$ ##OWNER= nmr
$$ C:\u/data/dgb/nmr/ADRS/15500/pdata/1/auditp.txt
$$ ##AUDIT TRAIL=  $$ (NUMBER, WHEN, WHO, WHERE, WHAT)
(   1,<2006-02-02 07:31:26.68 +000>,<MAYBRIDGE\nmr>,<NMR_250MHZ>,
      <created by zg, POWCHK disabled, PULCHK disabled
       configuration hash MD5:
       84 BC 41 DB A1 6E 1D 46 DA 25 12 A5 C1 ED C5 3A
       data hash MD5: 64K
       02 7A 56 7E B5 61 BF 46 3E E2 D9 33 19 93 D5 56>)
(   2,<2006-02-02 07:31:38.01 +000>,<MAYBRIDGE\nmr>,<NMR_250MHZ>,
      <Start of raw data processing
       ef LB = 0.3 FT_mod = 6 PKNL = 1 SI = 32K 
       data hash MD5: 32K
       B3 77 F0 7F EF 54 89 33 4E 7D 22 EC 86 E4 E2 05>)
(   3,<2006-02-02 07:31:39.79 +000>,<MAYBRIDGE\nmr>,<NMR_250MHZ>,
      <apk 
       data hash MD5: 32K
       9A 23 8D 3B D4 5E 48 B2 96 75 8F 6C 97 F1 F9 7D>)
(   4,<2006-02-02 07:31:40.54 +000>,<MAYBRIDGE\nmr>,<NMR_250MHZ>,
      <abs ABSG = 5 
       data hash MD5: 32K
       69 43 51 94 BD A4 3B 1B 40 A2 C7 14 B7 FE 5C AA>)
$$ ##END=
$$ 
$$ hash MD5
$$ BE 2C 97 2E E0 AB C3 F1 49 77 71 CA 99 66 E2 EC
##$RELAX= 
##$RELAX= 
##$RELAX= 
##$RELAX= 
##$RELAX= 
##$RELAX= 
##$RELAX= 
$$ Bruker specific parameters
$$ --------------------------
##$DU= <C:\u>
##$EXPNO= 15500
##$NAME= <ADRS>
##$PROCNO= 1
##$TYPE= <nmr>
##$USER= <dgb>
##$AMP= (0..31)
100 100 100 100 100 100 100 100 100 100 100 100 100 100 100 100 100 100 
100 100 100 100 100 100 100 100 100 100 100 100 100 100 
##$AQSEQ= 0
##$AQ_mod= 3
##$AUNM= <au_zg>
##$AUTOPOS= <37 >
##$BF1= 250.13
##$BF2= 250.13
##$BF3= 250.13
##$BF4= 250.13
##$BF5= 500.13
##$BF6= 500.13
##$BF7= 500.13
##$BF8= 500.13
##$BYTORDA= 1
##$CFDGTYP= 0
##$CFRGTYP= 5
##$CHEMSTR= <none>
##$CNST= (0..31)
1 1 145 1 1 1 1 1 1 1 1 1 1 1 1 1 1 1 1 1 1 1 1 1 1 1 1 1 1 1 1 1 
##$CPDPRG= <>
##$CPDPRG1= <>
##$CPDPRG2= <>
##$CPDPRG3= <>
##$CPDPRG4= <mlev>
##$CPDPRG5= <mlev>
##$CPDPRG6= <mlev>
##$CPDPRG7= <mlev>
##$CPDPRG8= <mlev>
##$CPDPRGB= <>
##$CPDPRGT= <>
##$D= (0..31)
0 1 0 0 0 0 0 0 0 0.06 0 0 0 0 0 0 0.0002 0 0 0 0 0 0 0 0 0 0 0 0 0 0 
0 
##$DATE= 1138865485
##$DBL= (0..7)
120 120 120 120 120 120 120 120 
##$DBP= (0..7)
150 150 150 150 150 150 150 150 
##$DBP07= 0
##$DBPNAM0= <>
##$DBPNAM1= <>
$$ [...]
##$SUBNAM7= <"">
##$SUBNAM8= <"">
##$SUBNAM9= <"">
##$SW= 20.6930455092707
##$SWIBOX= (0..15)
0 0 3 0 0 0 0 0 0 0 0 0 0 0 0 0 
##$SW_h= 5175.983436853
##$TD= 65536
##$TD0= 1
##$TE= 294.16
##$TE2= 300
##$TE3= 300
##$TEG= 300
##$TL= (0..7)
0 120 120 120 120 120 120 120 
##$TP= (0..7)
150 150 150 150 150 150 150 150 
##$TP07= 0
##$TPNAME0= <>
##$TPNAME1= <>
##$TPNAME2= <>
##$TPNAME3= <>
##$TPNAME4= <>
##$TPNAME5= <>
##$TPNAME6= <>
##$TPNAME7= <>
##$TPOAL= (0..7)
0.5 0.5 0.5 0.5 0.5 0.5 0.5 0.5 
##$TPOFFS= (0..7)
0 0 0 0 0 0 0 0 
##$TUNHIN= 0
##$TUNHOUT= 0
##$TUNXOUT= 0
##$USERA1= <user>
##$USERA2= <user>
##$USERA3= <user>
##$USERA4= <user>
##$USERA5= <user>
##$V9= 5
##$VALIST= <valist>
##$VCLIST= <CCCCCCCCCCCCCCC>
##$VD= 0
##$VDLIST= <DDDDDDDDDDDDDDD>
##$VPLIST= <PPPPPPPPPPPPPPP>
##$VTLIST= <TTTTTTTTTTTTTTT>
##$WBST= 1024
##$WBSW= 4
##$XGAIN= (0..3)
0 0 0 0 
##$XL= 0
##$YL= 0
##$YMAX_a= 502468
##$YMIN_a= -316351
##$ZGOPTNS= <>
##$ZL1= 120
##$ZL2= 120
##$ZL3= 120
##$ZL4= 120
##$ABSF1= 16.522
##$ABSF2= -4.171173
##$ABSG= 5
##$ABSL= 3
##$ALPHA= 0
##$AQORDER= 0
##$ASSFAC= 0
##$ASSFACI= 0
##$ASSFACX= 0
##$ASSWID= 0
##$AUNMP= <proc_1d>
##$AZFE= 0.1
##$AZFW= 0.1
##$BCFW= 0
##$BC_mod= 0
##$BYTORDP= 0
##$COROFFS= 0
##$CY= 12.5
##$DATMOD= 1
##$DC= 0
##$DFILT= <>
##$DTYPP= 0
##$F1P= 14.0000005364418
##$F2P= -0.99999901652339
##$FCOR= 0.5
##$FTSIZE= 32768
##$FT_mod= 6
##$GAMMA= 0
##$GB= 0
##$INTBC= 1
##$INTSCL= 1
##$ISEN= 128
##$LB= 0.3
##$LEV0= 0
##$LPBIN= 0
##$MAXI= 10000
##$MC2= 0
##$MEAN= 0
##$ME_mod= 0
##$MI= 0
##$NCOEF= 0
##$NC_proc= -4
##$NLEV= 6
##$NOISF1= 0
##$NOISF2= 0
##$NSP= 0
##$NTH_PI= 0
##$NZP= 0
##$OFFSET= 16.522
##$PC= 1
##$PHC0= 87.40334
##$PHC1= 7.119939
##$PH_mod= 1
##$PKNL= yes
##$PPARMOD= 0
##$PSCAL= 4
##$PSIGN= 0
##$REVERSE= no
##$SF= 250.13
##$SI= 32768
##$SIGF1= 0
##$SIGF2= 0
##$SINO= 400
##$SIOLD= 32768
##$SREGLST= <1H.DMSO>
##$SSB= 0
##$STSI= 32768
##$STSR= 0
##$SW_p= 5175.98343685301
##$SYMM= 0
##$S_DEV= 0
##$TDeff= 65536
##$TDoff= 0
##$TI= <Analysis number 999999
Compound Code 99
Book Reference 9
Project Code 9>
##$TILT= no
##$TM1= 0
##$TM2= 0
##$TOPLEV= 0
##$USERP1= <user>
##$USERP2= <user>
##$USERP3= <user>
##$USERP4= <user>
##$USERP5= <user>
##$WDW= 1
##$XDIM= 32768
##$YMAX_p= 326070276
##$YMIN_p= -417680
$$ End of Bruker specific parameters
$$ ---------------------------------
##NTUPLES= NMR SPECTRUM
##VAR_NAME=  FREQUENCY,     SPECTRUM/REAL,   SPECTRUM/IMAG
##SYMBOL=    X,             R,               I
##VAR_TYPE=  INDEPENDENT,   DEPENDENT,       DEPENDENT
##VAR_FORM=  AFFN,          ASDF,            ASDF
##VAR_DIM=   32768,         32768,           32768
##UNITS=     HZ,            ARBITRARY UNITS, ARBITRARY UNITS
##FACTOR=    0.157963299565203, 1,           1
##FIRST=     4132.6476996994, 0,             0
##LAST=      -1043.33573715361, 0,           0
##MIN=       -1043.33573715361, -417680,     0
##MAX=       4132.6476996994, 326070276,     0
$$ Real data points
##PAGE= N=1
##DATA TABLE= (X++(R..R)), XYDATA
$$ [...]
26925F838J4495m5324j6027L9195O214l358N0246l0068o1141J2734j8207L141
26913d1262m140M4813K1689m7660K80K467L6817M2397k4580j8408o755j1955J0570
26900D273j8391N3124L4461m4676k0564r766l8690k592K5809N4678L6651J7629
26888I1946M5892k9548q5927l3538l928J3427k2777L153M222J9103R4196j3377
26876H2844r9022l5083K3546l0610j1518N2419o702Q339M0029J4452q383Q980
26864C9291j1840J0801l3625k2992R847K2801K9882L3925J9815l0463q011l7300
26852B2131k009L9150L5868q452k0665j2394r094K3137m0631n087J3755J9103
26840E4812l5519p050N0234J3277k6168l3462l5179M1407P9827K3959l8212j6057
$$ plain form
26925 6838 21333 -23991 -40018 -823 5391 2033 52279 22211 -38930 -26196 -44403 -41262
26913 -41262 -45402 -589 21100 -26560 -26280 -23813 13004 55401 30821 12413 5658 -6297 4273
26900 4273 -14118 39006 73467 28791 8227 -1539 -40229 -42821 -17012 37666 74317 91946
26888 91946 137838 108290 22363 -11175 -15103 -1676 -24453 -21300 -17078 2025 96221 82844
26876 82844 -16178 -51261 -27715 -58325 -69843 -17424 -24126 -15787 24242 38694 30311 39291
26864 39291 27451 38252 4627 -18365 -8518 14283 44165 78090 97905 67442 59431 22131
26852 22131 20122 59272 95140 86688 66023 53629 44535 67672 27041 21954 35709 54812
26840 54812 19293 12243 62477 75754 49586 16124 -19055 22352 102179 126138 87926 71869
26828G1869j8830k2070M1674L5346j1103O629l3161j01680o2706L5121M0613k9975
26816d8273j688L9724K7055J8157l2906o5666m300M1111k4544l633j1594K5481
26804d1076L9032J8108K4397K3831o4606r9491r098J7378K8954r301k9451L9256
26792f2067P5312M1676L256n7996k6772L3753j6942m5612n9716P342O3577N5303
26780A1114o3351j9955j2724N895K3493R1336J2655J5446L3953o4589k3115L9393
26768D9551k402N812J6926j5557j5173p6459l1107n079R7086J9254l1508n8846
26756d7502l305k7032n1297O2925p839K6350J0229J99k2295o2937j6903R719L0521
26743i9167k4195K2075P9355L2712l7228n5237J6789N2104k1985L0329l28j6484
$$ plain form
26828 71869 53039 30969 72643 107989 96886 103515 70354 -31326 -94032 -58911 -18298 -48273
26816 -48273 -49961 -10237 16818 34975 2069 -63597 -67897 -26786 -51330 -54963 -66557 -41076
26804 -41076 -2044 16064 40461 64292 -314 -99805 -108903 -91525 -62571 -71872 -101323 -62067
26792 -62067 13245 54921 58177 181 -26591 7162 -9780 -55392 -115108 -107766 -44189 11114
26780 11114 -52237 -72192 -84916 -79021 -55528 35808 48463 63909 97862 33273 10158 49551
26768 49551 47149 52961 69887 54330 39157 -37302 -68409 -73488 23598 42852 11344 -47502
26756 -47502 -50807 -77839 -129136 -66211 -74050 -47700 -37471 -37272 -59567 -122504 -139407 -129688 -99167
26743 -99167 -123362 -101287 -21932 10780 -26448 -81685 -64896 -12792 -34777 -4448 -4776 -21260
26731b1260J1242K650j2138L4725r342j5274J5094k0242M5150J4434k5862j2977
26719F200j8246N5867N9564J2784q1054q902K2550j6721k8065J9081k7451o2694
26707f7087k6312L9676M2974K3660n5811m5590M1418J4048N8342O2069m0465l1513
26695A5409r951P95m1878M0729M4656j3832l4542O148N402k354K8450o867m0927
26682h762k2299m7674j8275j0686l1997R980J0886Q4377R2601j2373l7502j665
26670F611q823K1096N6081Q508j6142k769p080j3951m1343k0737k2198k9535J8529
26657e1753O6541K3619K1639R556l4334o3798J4018L9729O483m4939l8499K5656
26645b6082l418k5124L0330J6607n6227j600m0918m2158O3581Q6620L2516l2673
$$ plain form
26731 -21260 -10018 -7368 -19506 15219 5877 -9397 5697 -14545 30605 45039 19177 6200
26719 6200 -12046 43821 103385 116169 35115 26213 48763 32042 3977 23058 -4393 -67087
26707 -67087 -93399 -53723 -10749 12911 -42900 -88490 -47072 -33024 25318 87387 46922 15409
26695 15409 5458 6253 -35625 5104 49760 35928 1386 7534 12936 10582 39032 32165 -8762
26682 -8762 -31061 -78735 -97010 -107696 -139693 -129713 -118827 -34450 58151 45778 8276 6611
26670 6611 -2212 18884 74965 83473 67331 64562 57482 43531 2188 -18549 -40747 -70282 -51753
26657 -51753 14788 38407 60046 69602 35268 -28530 -14512 25217 31700 -13239 -51738 -26082
26645 -26082 -29500 -54624 -24294 -7687 -63914 -65514 -106432 -148590 -85009 1611 34127 1454
26633A454J9632r464L1997j6324l6814q02j3948n440k2266j2040J1287L0883K2345
26620E00n1378o5130K6486O2831K302k7486L9560O4322L4868k0238k963k9995
26608C3679m6052k1043j6763m6238N6433m472l4622m0281k0348P0271J2182k1711
26596g8965n3717K1826L6831n781J1735L0823K310K8649K4199r883k4626K3380
26584F781r225j13332L7833N7490L5660K1789m0712L924M2256L0284k0625M467
26572E6590l6365K782N3806k9205k6715k8938K1877J5386k9831j3501J9451j7340
26560a2003r888l8098K5436N9537k3232l0391J5334k7877J6063l484k97k9650
26548e8550K8627j7350L6159K095l7771j8238k601L010O260n123l519M0123N6241
$$ plain form
26633 1454 21086 11622 43619 27295 -9519 -10321 -24269 -29709 -51975 -64015 -52728 -21845 500
26620 500 -50878 -116008 -89522 -26691 -24389 -51875 -12315 52007 86875 66637 63674 33679
26608 33679 -12373 -33416 -50179 -96417 -39984 -44456 -79078 -119359 -139707 -69436 -57254 -78965
26596 -78965 -132682 -110856 -74025 -79806 -68071 -37248 -34938 -6289 17910 8027 -16599 6781
26584 6781 -2444 -115776 -77943 -20453 15207 36996 -3716 208 42464 72748 52123 56590
26572 56590 20225 23007 76813 47608 20893 -8045 13832 29218 -613 -14114 5337 -12003
26560 -12003 -21891 -59989 -34553 24984 1752 -28639 -13305 -41182 -25119 -28603 -28900 -58550
26548 -58550 -29923 -47273 -11114 -9019 -46790 -65028 -67629 -64619 -58359 -63482 -67001 -26878 29363
26535B9363k6986L3250r168j2277J5487L8731j4297n0158o4652l7222O1197N4771
26523A8039J3956J059k876j5685j4990N5223O4555M0875n3339m780k035J542n8536
26510D3008n6005l4515m5196N2413J12549J518l0690N572k4132M598j4349l6380
26498b1609o1136L5353M2333N835K975j0398l3342k8780K7419k8961m2686K145
26486a10852J5846J8136L476L7917M8030L2513J8228m401M6186l3908j3941n464
26474E1766l1533o0622k2717J0043l9331n0377L302Q1475R9865O3995k770r8812
26462D284p4655n300m9174L0105P8336O6004m1678l9906M8590r73l1263K3084
26450G454q461J8550L6220k0365j4939L0186m61l8509l2223k9280k6350j0083
$$ plain form
26535 29363 2377 35627 26459 14182 29669 68400 54103 3945 -60707 -97929 -36732 18039
26523 18039 31995 33054 30178 14493 -497 54726 119281 160156 106817 102037 100002 101544 43008
26510 43008 -12997 -47512 -92708 -40295 72254 73772 43082 48654 24522 29120 14771 -21609
26498 -21609 -82745 -47392 -5059 776 3751 -6647 -39989 -68769 -41350 -70311 -112997 -110852
26486 -110852 -95006 -76870 -73394 -35477 12553 45066 63294 58893 105079 71171 57230 51766
26474 51766 20233 -40389 -63106 -53063 -92394 -142771 -139469 -57994 41871 105866 103096 4284
26462 4284 -70371 -75671 -124845 -94740 -16404 49600 7922 -31984 16606 15633 -15630 7454
26450 7454 -1007 17543 53763 33398 18459 48645 48184 9675 -22548 -51828 -78178 -88261
26438h8261K3890R75K8942N081p467P334j579k954M0080L1111K4604p6616k3772
26425c8632K23K9808L0196j5058J3314j026n1001l4583N8573K1628k5182L6158
26413B4418p0997J8820J6607m5662K5232J6927j0473J3392q206J3432j3825J9892
26401d43l162p801J14211J7571j6874n1545k376N9592J4592k3788l6711J4472
26389G7738K5035l0575p5627j9878J5946J9102r943k2394q062j5884L65O2942
26377A8765P4051m0255K547j1168o5883p9402L1108O8972L9902M475k4634j4000
26365D478N910O957Q003J2324N083j9443l8209N087L100K4806k6354j1641N6184
26352C6285N3358K571n5141l8213m7609L0746M3265m2108r016Q6779O7111j3298
$$ plain form
26438 -88261 -64371 -63396 -34454 -29373 -36840 -29506 -31085 -34039 6041 37152 61756 -14860 -38632
26425 -38632 -38409 -8601 21595 6537 19851 18825 -32176 -66759 -8186 13442 -11740 24418
26413 24418 -46579 -27759 -11152 -56814 -31582 -14655 -25128 -11736 -19942 -6510 -20335 -443
26401 -443 -3605 -11406 102805 120376 103502 51957 49581 109173 123765 99977 63266 77738
26389 77738 102773 72198 -3429 -23307 -7361 11741 1798 -20596 -28658 -44542 -44177 18765
26377 18765 92816 52561 55108 43940 -21943 -101345 -70237 -1265 38637 43112 18478 4478
26365 4478 10388 17345 25348 37672 42755 23312 -14897 -9810 -6710 18096 -8258 -19899 36285
26352 36285 89643 92214 37073 -1140 -48749 -18003 25262 -16846 -25862 60917 128028 114730
26340A14730k2978m0030l1834k2068p338J1465k1927J4368m0329l2778J0101N6006
26328a2612J8707j9316o4681m2933L5655k054M3558R691k3974J4945N8978L6000
26316E1964K9823j7382q853k049K3494L1973l9332k9593j5799O260K1475r881
26304D2100n841p924n1178L942k3762M3044l0462M919J5941j6279k8836L1439
26292b2897M5723R153n324O193k7802j5902k8917k329L0028l3344K9329M3793
26280B7704p570l4584l7455l2615L2479p00j5988k4751N041L6322K6266m3384
26268f9235l9609M2529M8264P4212J9403m2560m7611k2290K0181L0493Q47m5483
26256c0859J0014l1488n670k8409q641M9281M8109n341k0512n610K9647L7916
$$ plain form
26340 114730 91752 51722 19888 -2180 -9518 1947 -19980 -5612 -45941 -78719 -68618 -12612
26328 -12612 6095 -13221 -77902 -120835 -85180 -87234 -43676 -33985 -57959 -43014 15964 51964
26316 51964 81787 64405 55552 53503 76997 108970 69638 40045 24246 30506 51981 42100
26304 42100 36259 28335 -22843 -18901 -42663 381 -30081 -25162 -9221 -25500 -54336 -22897
26292 -22897 22826 31979 26655 32848 5046 -10856 -39773 -42102 -12074 -45418 -16089 27704
26280 27704 20134 -14450 -51905 -84520 -52041 -52741 -68729 -93480 -88439 -52117 -25851 -69235
26268 -69235 -108844 -66315 -18051 56161 75564 33004 -14607 -36897 -16716 13777 14624 -30859
26256 -30859 -20845 -52333 -58003 -86412 -95053 -45772 2337 -3004 -23516 -29126 521 38437
26244C8437R940k6900j8028L191o895l089j844j1217Q0556o59o9291k8018K998
26231c0819J9277O8402m801k2635m0919N1905N2411K1904L7720m7280o6662l7476
26219A027k7992N031N6831L7139Q858L8939l1132m6293n466q504N1428l6804j0660
26206C2402K0396J6675l525k5256o938r463m4967l65q048L3212j6564K6906K5082
26193C9547j6021J8406j2214k1389l17L7497O72r6006l1561M0612J3549N4544
26181B7319J9939l7156j9779J2575L3983O925R453L118k6256k7784j7914M138
26169a1439L2756M5978j7589n6717q946M88m4748K9257N483l1513J4709L2530
26157i751M7275j5207l1188K8005j6522j3507K8278K0782l0279l61N4923M16p2815
$$ plain form
26244 38437 48377 21477 3449 6640 -255 -3344 -5188 -16405 64151 63492 -5799 -33817 -30819
26231 -30819 -11542 56860 52059 29424 -11495 40410 92821 114725 152445 105165 38503 1027
26219 1027 -26965 -21934 34897 72036 80894 119833 88701 42408 36942 28438 79866 43062 32402
26206 32402 52798 69473 65948 40692 33754 24291 -20676 -21041 -29089 4123 -12441 14465 39547
26193 39547 23526 41932 29718 8329 8012 45509 46181 -49825 -81386 -40774 -27225 27319
26181 27319 47258 10102 -9677 2898 36881 43806 53259 56377 30121 2337 -15577 -11439
26169 -11439 21317 67295 49706 -7011 -15957 -15469 -60217 -30960 -25477 -56990 -42281 -9751
26157 -9751 37524 22317 -8871 19134 2612 -10895 17383 38165 7886 7525 62448 62864 -9951
26144i951p715J2788J6992L6945R977J4540M991q2268k281K8574j4644J642K1237
26131C0827N515K0848K1705l902J47m8467o0559O7627m1270p3126L9718O3673
26119B2736L4211J2870P41J917k2401j6067J9198k9762J4095P055L4832K9782
26107A09207k3454n4178J856k2620q5937K5052O7442j0459n8331K603j1358j1540
26095g1717J000J5637K243m3188K4252L7250Q720n873j7327K0950J875M308k587
26082b4457n7424p0521K0237J8703k8466M2030L4803N7502k873j9178L2957L3280
26070C6593n2542J0577L4552m1188j2457j3539j3981l6067J990n295L5347J9682
26058c6328q627N230N3626m3172j2096M6628M2332j5178r817n086N7018O648m0059
$$ plain form
26144 -9951 -17666 -4878 12114 49059 59036 73576 78567 -3701 -5982 22592 7948 9590 30827
26131 30827 36342 57190 78895 74993 75140 26673 -33886 33741 -7529 -80655 -40937 22736
26119 22736 56947 69817 70558 72475 50074 34007 53205 23443 37538 44593 79425 109207
26107 109207 85753 31575 33431 10811 -75126 -50074 17368 6909 -51422 -48819 -60177 -71717
26095 -71717 -70717 -55080 -52837 -96025 -71773 -34523 -25803 -31676 -49003 -28053 -26178 -21870 -24457
26082 -24457 -81881 -152402 -132165 -113462 -141928 -99898 -65095 -7593 -10466 -29644 3313 36593
26070 36593 -15949 -5372 29180 -12008 -24465 -38004 -51985 -88052 -86062 -91357 -56010 -36328
26058 -36328 -44955 -39725 13901 -29271 -41367 5261 47593 32415 22598 17512 74530 81178 41119
26045D1119j7666o790K677j2005J1262J5970M7253O517Q947O04m5691l976k137
26032D6084p234l9617J5016O208l3600n129l1939P874O3498P4082k824k5764m07
26019F6248n7592k0941J6357L8950o8293k7341K4701L086q783k1877N6854q8o6412
26006f5131n412K6797M4736J8395P242O6362r87o1268l7255K3973j659L1191l6714
25993A0270j6666J9831N0897O7212k783o0003m2810J6745J692k2303M3853L7196
25981A03131K726n2726p0328J152m639M449m84M876P94M247L1789J4234r908k5162
25967D151J5414P5834p081m0251L4667k53k6554n3192O0700J4323p5005l8744
25955c5991M838K9685L4451J8441M182R641M678m9939n1804J6780O186j6321O2644
$$ plain form
26045 41119 23453 16663 19340 7335 18597 34567 81820 88337 97284 97888 52197 48221 46084
26032 46084 38850 -767 14249 20457 -13143 -18272 -50211 -42337 21161 95243 92419 66655 66248
26019 66248 8656 -12285 4072 43022 -25271 -52612 -27911 -24825 -33608 -55485 1369 1281 -65131
26006 -65131 -70543 -43746 990 19385 26627 92989 92002 30734 -6521 17452 15793 46984 10270
25993 10270 -6396 13435 64332 131544 128761 68758 25948 42693 44385 22082 65935 103131
25981 103131 105857 53131 -17197 -16045 -20684 -16235 -16719 -11843 -11049 -6802 24987 39221 29313 4151
25967 4151 19565 95399 88318 48067 82734 82481 55927 2735 63435 77758 2753 -35991
25955 -35991 -31153 -1468 32983 51424 55606 65247 69925 19986 -31818 -15038 -8852 -25173 37471
25942C7471L6144M3630M3773p5277q3165J909o33m8547O398P0784k8367n4443
25930e0323r445K9471L3922K6721m0097n2760L338L2395L1991j2470j6151k063
25918b5471P274k0658j0447J6219m01J6496K4962M7575q761j7445j2744j0975
25906E624J5547N2827k8299r4010l2898j2091J0486K5558M6201L8375O820k5440
25894H700j03883m9499L5570O9776J3922N47j4181r551j5673L1399N9740m862
25882B2005k6771l6083l2500N0410K2963r82j2229J1471l4523j7727M7812J607
25870d547M005k6383m2580K6245O5720L3068n4725L0645L9258J7774l0657l5413
25858B2410n1407K6978j8068l0440K5415M0963R039P491j9380m1193L404j8935
$$ plain form
25942 37471 73615 117245 161018 85741 2576 4485 3852 -44695 -38297 32487 4120 -50323
25930 -50323 -59768 -30297 3625 30346 -9751 -62511 -59173 -26778 5213 -7257 -23408 -25471
25918 -25471 -18197 -38855 -49302 -33083 -33484 -16988 7974 55549 46788 29343 16599 5624
25906 5624 21171 73998 45699 -48311 -81209 -93300 -82814 -57256 -11055 27320 34140 8700
25894 8700 -95183 -144682 -109112 -39336 -25414 -24867 -39048 -48599 -64272 -32873 26867 22005
25882 22005 -4766 -40849 -73349 -22939 24 -958 -13187 -1716 -36239 -53966 -6154 -4547
25870 -4547 -542 -26925 -69505 -43260 22460 55528 803 31448 70706 88480 57823 22410
25858 22410 -28997 -2019 -20087 -50527 -25112 15851 24890 32381 13001 -28192 -24788 -43723
25846d3723k0021J3194k1283J6939P4949L9098m4431m1566l001M4044j1025l4171
25834c0997J8280P794k916p0672k9326N6528J4973j4058K3320M4456J3036j7111
25822A3307l9832l7358J566K6586L4569K0896j2486N3159L4635o0625p0987K9853
25810f717J6022K3896j7907j2524K9292P978l7172K722K2872m108K157j2673P302
25797B1140m897o047m865n7978m5544M2548P4400J081k5469R266K3294k6360l8513
25784c7944N6086K7934n0310n7670J5137M5096L2554M9290N698k9790p833J0794
25772E9042n1852j7246k4038l3107Q955j6551j9018r20M8125L1400l2389j0657
25760e8256l870M0841L6003K0424j7041Q92M3546j5922L27l5232Q689j5604m5081
$$ plain form
25846 -43723 -63744 -50550 -71833 -54894 20055 59153 14722 -26844 -29845 14199 3174 -30997
25834 -30997 -12717 -4923 -7839 -78511 -107837 -51309 -36336 -50394 -27074 17382 30418 13307
25822 13307 -26525 -63883 -62317 -35731 -1162 19734 7248 60407 95042 34417 -36570 -6717
25810 -6717 9305 33201 15294 2770 32062 40040 2868 5590 28462 24354 26511 13838 21140
25797 21140 16243 10196 5331 -52647 -98191 -55643 18757 19838 -5631 3635 26929 569 -37944
25784 -37944 18142 46076 -4234 -61904 -46767 -1671 30883 80173 85871 56081 48248 59042
25772 59042 7190 -10056 -34094 -67201 -58246 -74797 -93815 -94735 -46610 -15210 -47599 -58256
25760 -58256 -62126 -21285 14718 35142 18101 18993 62539 46617 46944 11712 20401 4797 -40284
25747d0284j5719o610O308J6261L4928L3823L7198j8831l6392J2420j9161m6228
25735d2287j9086l2420N1072J8354J2260n0893m2003Q122R0277M6395J8790m1995
25723A6586j9198p897K40K3978J1216j0886L0049K793j6768l9109o0848K8757
25711d1087K3204M794K5317j01384o8436J0534K6722N4841M3947J070k6195q989
25699e5662m0684L1956L6502K8486q901j9104M4645J0531O4152j2947J4275P436
25687A00685n100n9954j7333l4870J465l5398l636P7124j0598l2849k1158j64
25675d1786L7625K2896j2274m417p233j6216p52J4579K3670k8513J0735N665j8713
25662a4734L4786K3827j0895j0312N920j0493n4436M828l1228L175K0605O5521
$$ plain form
25747 -40284 -56003 -62613 -56305 -40044 -5116 28707 65905 47074 10682 23102 3941 -42287
25735 -42287 -61373 -93793 -42721 -24367 -12107 -63000 -105003 -96881 -6604 39791 58581 16586
25723 16586 -2612 -10509 -10269 13709 24925 14039 44088 46881 30113 -8996 -69844 -41087
25711 -41087 -17883 -13089 12228 -89156 -157592 -147058 -120336 -65495 -21548 -20478 -46673 -55662
25699 -55662 -96346 -64390 -27888 598 -8303 -27407 17238 27769 91921 78974 93249 100685
25687 100685 95585 35631 18298 -16572 -15107 -50505 -54141 22983 12385 -20464 -41622 -41786
25675 -41786 -4161 18735 6461 2044 -5189 -21405 -22157 -7578 16092 -12421 -1686 3979 -14734
25662 -14734 20052 43879 32984 22672 28592 18099 -36337 -31509 -62737 -59562 -38957 26564
25650B6564j3368K0217L0023k2421k0176m2640K4332j5161Q37j7054k5983l2545
25638h7375k135P375P511P4536K6741k6441k5264J9493L2374N2165Q236l5611
25626E1605M5404K5640o2992m4719l3547R301M1267M9029M0952k5904o0763l3480
25614A793l2443k438k0269Q684K6200r998k2747l3143L320K9623L4829M4557l2357
25601d389N44J249L497J3244L0503L2955j786n4435J351J9207j9703J1585K7752
25588F1574l4204l5374j0481J4086q802K1716m78J9798L3605M1501J1964k1780
25576I3125m5105L9691k4337J7636L5092n789q9302k3129Q3492M7085m9306n5721
25564B3432p8987J5686K0590m876j8884J7170l7867n198L9154N660l4593j0244
$$ plain form
25650 26564 13196 33413 63436 41015 20839 -21801 2531 -12630 -11793 -28847 -54830 -87375
25638 -87375 -89510 -82135 -74624 -88 26653 212 -25052 -5559 26815 78980 87216 51605
25626 51605 97009 122649 59657 14938 -18609 -9308 31959 80988 121940 96036 35273 1793
25614 1793 -30650 -33088 -53357 -44673 -18473 -28471 -51218 -84361 -81041 -51418 -16589 27968 -4389
25601 -4389 -3845 -2596 901 14145 44648 77603 75817 21382 22733 41940 22237 33822 61574
25588 61574 27370 -8004 -18485 -4399 -13201 8515 8037 27835 61440 102941 114905 93125
25576 93125 48020 87711 63374 81010 116102 110313 21011 -2118 81374 128459 79153 23432
25564 23432 -55555 -39869 -19279 -24155 -43039 -25869 -63736 -68934 -29780 -24120 -58713 -68957
25552f8957J5459n650r892l994M2974L0926l019P5253M1650j9314o0537k6685
25540H214N9077J4842K451j5975m3162q030j0128k6876m017k8706m3534q1117
25528a76961k3768Q144L4073J1450L8954m531j2344P8401K5467J5288j465l1684
25516c8976j1233P224L7945n225M0412M0414K7202O412l0004j796m4401k0401
25504G573j2134j8537l2557m637P4113P0722J5730j9095r0478n0901L3837m0033
25492f6397o181J9973N3941J0515N029m754J566L6741j1811j4495N6061Q798p7147
25479A1839j9625J2131M7038J962l7874J4065L7398k6145Q380K953n2746j0838
25467a1462J6954K0000k3133m1587N84K1414L1440J0984n058J1741K9863j2010
$$ plain form
25552 -68957 -53498 -59148 -69040 -73034 -30060 866 -2153 73100 114750 95436 34899 8214
25540 8214 67291 82133 84584 68609 25447 17417 7289 -19587 -23604 -52310 -95844 -176961
25528 -176961 -200729 -192585 -158512 -147062 -108108 -112639 -124983 -46582 -21115 -5827 -7292 -38976
25516 -38976 -50209 -42985 -5040 -10265 30147 70561 97763 104175 74171 72375 27974 7573
25504 7573 -4561 -23098 -55655 -60292 13821 84543 100273 81178 -9300 -60201 -26364 -66397
25492 -66397 -72578 -52605 1336 11851 16880 12126 13692 50433 38622 24127 80188 88986 11839
25479 11839 -7786 4345 51383 53345 15471 29536 66934 40789 49169 52122 -624 -11462
25467 -11462 5492 25492 2359 -39228 -38644 -17230 14210 25194 20136 31877 61740 49730
25455D9730O867J1216q658n5179j4865N665L9623K52k2698J6745K1726k2347r181
25442A8896N425L6804n3069k0264n701J6294R7748l9861n7911m999p824J1290
25430c172J7389L4357M3954o0768m6915l3754r207L3564P5507m266l4035L8328
25418E0982K2188l2481l2988L118k1200k3099K0607k69q301k0363J9854k1405
25406d3357J6844k5153J384J04153k8755n3064M2263O2947N033j5382M0834r7862
25394I885r1888O077J2211j7094N6267R6861Q612O311k5009j3773o9522N120p193
25381b3135J653M554j6065j2955Q824k7269Q016L8881J8506K0643m1521l3137
25369e3005j314J2184Q745k2895J7294j5591J8215l1075K7794L3782J250L2045
$$ plain form
25455 49730 56597 67813 59155 3976 -10889 -5224 34399 34651 11953 28698 50424 28077 18896
25442 18896 24321 61125 8056 -12208 -17909 -1615 96133 56272 -1639 -6638 -14462 -3172
25430 -3172 14217 48574 92528 31760 -15155 -48909 -58116 -24552 50955 46689 12654 50982
25418 50982 73170 40689 7701 10819 -10381 -33480 -12873 -13142 -21443 -41806 -21952 -43357
25406 -43357 -26513 -51666 -50282 53871 25116 -27948 14315 77262 82295 66913 107747 9885
25394 9885 -82003 -75926 -63715 -80809 -24542 72319 80931 87242 62233 48460 -21062 -15942 -23135
25381 -23135 -21482 -16928 -32993 -45948 -37124 -64393 -56377 -17496 1010 21653 -19868 -53005
25369 -53005 -54319 -42135 -33390 -56285 -38991 -54582 -36367 -67442 -39648 -5866 -4616 27429
25357B7429R7864q269m6322l322O803n9498l4010j6312k1363M0967M9976n493
25345B8450n2004m7502k4177J0035M0480K2625j060q985l8575l0155j0033P5477
25333c5424J1217k3416j0293J1107J92J9854j8150K08K4550L7759L1579P168O3
25320E6414j560J2192l4251l644L3049P34R942r494k9033o1618J5986L225k7650
25307c5708n4M1042o2248m3344M6245j0528J0916K7992j5969k020J2849L90m4123
25294g4560L2202M3382o009k3676k6532N792K0092J5092J8955k2376K0807L1819
25282C4988k0511j7293j1119N7176K4621m7371j2785l7556L960N1195L2606J1345
25270F9256J3558m5376j8197q556J6224J7036n9011l1098j5998L5101K1467L107
$$ plain form
25357 27429 125293 117024 70702 67380 74183 14685 -19325 -35637 -57000 -16033 33943 28450
25345 28450 -23554 -71056 -95233 -85198 -44718 -22093 -23153 -32138 -70713 -100868 -110901 -35424
25333 -35424 -24207 -47623 -57916 -46809 -46617 -26763 -44913 -44705 -20155 17604 49183 56351 56414
25320 56414 54854 67046 32795 29151 62200 62934 72876 63382 34349 -27269 -11283 -8058 -35708
25307 -35708 -35762 5280 -56968 -100312 -54067 -64595 -53679 -25687 -41656 -43676 -30827 -30437 -74560
25294 -74560 -42358 1024 -4985 -28661 -55193 -49401 -29309 -14217 4738 -17638 3169 34988
25282 34988 14477 -2816 -13935 43241 67862 20491 7706 -29850 -25890 25305 57911 69256
25270 69256 82814 37438 19241 10685 26909 43945 -15066 -46164 -62162 -27061 -5594 -2487
25258b487K7689M0964K98j9235l924l4545l1808K0758J7421m617l848L9225N1455
25245I7346K9825l0225n6064n7914P585J7157k8944J3135J5249Q716j7008q7026
25233h8168O425N7873K4018n868q1056r776r159K8081P8292j4882J4560o7308
25221f6968m0493L6606M2011J8772k5736J0887l110K7848K887l6023n713J9843
25209a9189K6611J2910K7604l013l4932k3576L9540q455m0974m5970k7809J8179
25197g9074K5660r227R792M5182L520r1J9664k8015J9361l4247k9626O919J6654
25184c3528R083o324j7603K4770j1333L233M5042n728l9709K418K0966K8549O123
25171B5959m9238k3420j1146m3870n2007O4859P3347M7455j8287j8810J0857j7181
$$ plain form
25258 -2487 25202 66166 66464 47229 43305 8760 -23048 -2290 15131 10514 6666 45891 97346
25245 97346 127171 96946 40882 -17032 -9447 7710 -21234 -8099 7150 15866 -1142 -88168
25233 -88168 -81743 -23870 148 -5720 -86776 -96552 -105711 -77630 662 -14220 340 -66968
25221 -66968 -107461 -70855 -28844 -10072 -35808 -24921 -28031 -183 2704 -33319 -39032 -19189
25209 -19189 7422 20332 47936 44923 9991 -13585 25955 17500 -23474 -69444 -97253 -79074
25197 -79074 -53414 -62641 -52849 -7667 -4147 -4238 15426 -12589 6772 -27475 -57101 -50182 -33528
25184 -33528 -24445 -30769 -48372 -23602 -34935 -31702 13340 7612 -32097 -29679 -8713 19836 25959
25171 25959 -23279 -46699 -57845 -101715 -153722 -88863 -15516 31939 13652 -5158 5699 -11482
25159a1482K1385N6238K8613j4389m5206K399M0388m0430j4795j5642O68l8516
25147c0769Q461k6952p420J0332m0729k6903Q2152j9089k7874J960l089k6572
25135a06492K8478k2129l7926M8596M9602M3289r965j0053J1105n546L292j2465
25123b0214M2421m35m180j5486j562N3027K3987k0809m2836r120O788O685j1156
25110G110L8536M2056k7816l5233K539J0164o7132o0528K9461M1146M2698N5255
25098G8256J4027o7245n798p913N550q722m632j84Q511L9114J4522l3088k5376
25085G022O710J0546k6191o95j9626L2525O0483K1292l6730j7060j6647N6830
25073G8459k899n1878m5700O885r893L8611K2500K082K8921j764o4994j0807j6336
$$ plain form
25159 -11482 9903 66141 94754 80365 35159 37558 77946 37516 22721 7079 7747 -30769
25147 -30769 -22308 -49260 -56680 -46348 -87077 -113980 -31828 -50917 -78791 -76831 -79920 -106492
25135 -106492 -78014 -100143 -138069 -89473 -39871 3418 -6547 -16600 -5495 -11041 -7749 -20214
25123 -20214 22207 21772 17592 2106 544 53571 77558 56749 13913 4793 11581 18266 7110
25110 7110 45646 87702 59886 24653 27192 37356 -29776 -90304 -60843 -19697 23001 78256
25098 78256 92283 25038 19240 11327 16877 8155 3523 3339 11850 50964 65486 32398 7022
25085 7022 13732 24278 -1913 -2608 -22234 10291 70774 92066 55336 38276 21629 78459
25073 78459 75560 23682 -22018 -15133 -25026 13585 36085 38167 67088 65324 330 -10477 -26813
25060b6813Q2795l553k6074p095J0762J1472k449m5287J9261M4224L7490q7345
25048G388k4788j3270p786J6249J712o4097J955k2384L2034O2070P2323k7745
25036C3661r1420l7356O373K7309O1803J7298l3874j030M0323l0325p1661J2901
25024f5998J758J264q931q989j9545L2937J997o6848K5642L5972J0232K8415k1903
25011e3997k045j5761n0137K07M1260N7791J7101P952j2737k3775j2872o515J7983
24998c5545M4664J9467l0099J388n248L8408J6644J3051J8601q995k1846j7522
24986C2968J6889k2660q9054p4876K1553P0950q717k318l0290p79O6832N0787
24974C1285m507K6402O3164m621k2988j2490l6174k5697k9006j2591l7637l572
$$ plain form
25060 -26813 55982 52429 26355 19260 30022 41494 39045 -6242 13019 57243 94733 7388
25048 7388 -17400 -30670 -38456 -22207 -20495 -84592 -82637 -105021 -72987 -10917 61406 33661
25036 33661 -57759 -95115 -88742 -61433 370 17668 -16206 -17236 23087 -7238 -78899 -65998
25024 -65998 -64240 -62976 -71907 -80896 -100441 -67504 -65507 -132355 -106713 -70741 -60509 -32094 -53997
25011 -53997 -56042 -71803 -121940 -121733 -80473 -22682 -5581 2371 -10366 -34141 -47013 -53528 -35545
24998 -35545 9119 28586 -1513 -125 -5373 33035 49679 62730 81331 72336 50490 32968
24986 32968 49857 27197 -61857 -136733 -115180 -44230 -52947 -55265 -85555 -86334 -19502 31285
24974 31285 26778 53180 116344 111723 88735 76245 40071 14374 -14632 -27223 -64860 -68432
24962f8432M606M5460J0787J7008N3k9016K9903P03L7576l1511m6406k0258K4460
24949b5067N6642K7946m6693J4021M7098m1039K480J7822j2735m7377j0171J6810
24937b63L4697k2821Q365K7422n4571l9988P3372L3061o9117k7536J8643k4294
24925d3030M3518K0335K6111L4325L1877l3017m6318n7594J5386N8007n3495j9893
24913b3788K1441j213J8914j5454r589O703K1256m8827k6881l2093P263O1057
24901b1211l7701J4993J6806l115K6654J824k726n536J1795P869l5190k5822K4433
24888b6927l4692Q494L7251M2558l8739O185K2235J2320k5401K0065O118j1667
24876A7800m3078n3896k4981k0147O2431N1836r033p8036P163Q6760N3101m1392
$$ plain form
24962 -68432 -63826 -18366 -7579 9429 9482 -19534 10369 11072 48648 17137 -29269 -49527 -25067
24949 -25067 31575 59521 12828 26849 73947 32908 35388 53210 40475 -6902 -17073 -263
24937 -263 34434 11613 19978 47400 -7171 -47159 26213 59274 -9843 -37379 -18736 -43030
24925 -43030 488 20823 46934 81259 113136 80119 33801 -23793 -8407 49600 -3895 -23788
24913 -23788 -2347 -3560 15354 -100 -9689 -2986 18270 -30557 -57438 -89531 -82268 -21211
24901 -21211 -58912 -43919 -27113 -30228 -3574 -1750 -4476 -10012 1783 9652 -25538 -51360 -26927
24888 -26927 -61619 -53125 -15874 26684 -12055 -5870 16365 28685 3284 23349 29467 17800
24876 17800 -25278 -79174 -104155 -124302 -61871 -10035 -19068 -97104 -89941 -3181 49920 8528
24864H528j6363n92Q112J05l1805O5842J3237O4326r300m8715o149l727M901k569
24850D5831j3873k2379m1833k5793k1680j4665N9166O83j4501L1657j1128k4230
24838e2745J7083j7699K9668L8481K5539l8337m2056j0560L998N936J1861N1770
24826B2939J117j2748j2757P930j7109o4715M629L3015j0528k2922N3255K5438
24814G544J8289O348m9486j8453l4118q187L2465n7773q49N1820K7410n233K8819
24801a404L7942j2306o5631r879j0113m1104K2593o179L2238P5219l6851n873
24789b1348K0444M9044j9927n0321M7082j7502m7591J513R601J0435k5660J099
24777d3131J3736k9093O864K7809J7533L5869k55R529L4797l237O192P667r117
$$ plain form
24864 8528 -7835 -8427 -315 -210 -32015 33827 47064 111390 102090 53375 47226 43499 48400 45831
24850 45831 31958 9579 -32254 -58047 -79727 -94392 -35226 -34543 -49044 -17387 -28515 -52745
24838 -52745 -35662 -53361 -23693 14788 40327 1990 -40066 -50626 -46628 -40692 -28831 22939
24826 22939 24056 11308 -1449 6481 -10628 -75343 -70714 -37699 -48227 -71149 -17894 7544
24814 7544 25833 32181 -17305 -35758 -69876 -78063 -45598 -103371 -104220 -52400 -24990 -30223 -1404
24801 -1404 36538 24232 -41399 -51278 -61391 -102495 -79902 -86081 -53843 21376 -15475 -21348
24789 -21348 -904 48140 28213 -22108 24974 7472 -40119 -38606 -29005 -18570 -44230 -43131
24777 -43131 -29395 -58488 -51624 -23815 -6282 29587 29332 38861 73658 70421 76613 84280 75163
24764G5163m0084p842j3361p114j4159M8815L4371k6080j2013L9R578J0775J0395
24751F8483l1047m6499M0423J8595L0241L559m4733l8685J692r384j9256J9592
24739g019L0496K2553K7545L4726n646K5631l438j9580L191N9011p6149p4160
24727A7161k2536n443q060j2183L1879q5589j6512K9651L1188J8385j9778k101
24715d3938k676J2953j6436J9010K04K0418k8852J2783M3366J9187N428l2697
24703H750J3585J939J0332J8704r698k4475k4288J4895L3075K4019J0157l8830
24691C8165j9082Q5626O1243m2390n4830P209O6138J2496J5058k5820j2935l8846
24679I2032m1356O589O244K911k9429l1672l0499l7811J1172l8960m0356J12031
$$ plain form
24764 75163 35079 27237 13876 6762 -7397 41418 75789 49709 37696 37735 47313 58088 68483
24751 68483 37436 -9063 31360 49955 80196 83755 39022 337 2029 -7355 -26611 -7019
24739 -7019 23477 46030 73575 108301 102655 128286 124848 105268 108459 167470 91321 17161
24727 17161 -5375 -10818 -18878 -31061 818 -84771 -101283 -71632 -40444 -22059 -41837 -43938
24715 -43938 -46614 -33661 -50097 -31087 -30883 -10465 -39317 -26534 16832 36019 41447 8750
24703 8750 22335 24274 34606 53310 43612 19137 -5151 9744 42819 66838 76995 38165
24691 38165 19083 104709 165952 123562 68732 75941 142079 154575 169633 143813 130878 92032
24679 92032 50676 57265 63509 66420 36991 5319 -25180 -62991 -51819 -90779 -131135 -19104
24667a9104N9915l0676J324m5248L2205L0699k0755K7061m9421n3455m325M8406
24655b3374P4947r502j9101K5761l9786J7942Q611r231J712K0525l8240M529R72
24642A5765K7816k2752m2452J4675N8736M9856O4437j1702p2855l6753K5726O879
24630G7376o9738r2038k6961J5156N3061P3872n5609m4931P4565M6487P02k6742
24618B5200l6477p801J2773l2570j2101q604K2257K4974K0557L8752j0863l4448
24606A649m5628k4344j5730J7152J6408N4071K9862m8733k4058P172J675K149
24594b8355l6726j1790K1136M9746K3791j3871j5051j3441l1287M965J0828N0590
24582A0535K1792j3929k7076Q3061q735l7368J0668k8731m9161K6926k6221k7634
$$ plain form
24667 -19104 40811 10135 11459 -33789 -1584 29115 8360 35421 -14000 -67455 -71780 -23374
24655 -23374 51573 42071 22970 48731 8945 26887 35498 26267 27979 48504 10264 14793 15765
24642 15765 43581 20829 -21623 -6948 51788 101644 166081 154379 81524 44771 70497 77376
24630 77376 7638 -84400 -111361 -96205 -43144 30728 -24881 -69812 4753 51240 51942 25200
24618 25200 -11277 -19078 -6305 -38875 -50976 -59580 -37323 -12349 8208 46960 36097 1649
24606 1649 -43979 -68323 -84053 -66901 -50493 3578 33440 -15293 -39351 -32179 -30504 -28355
24594 -28355 -65081 -76871 -55735 -5989 17802 3931 -11120 -24561 -55848 -50883 -40055 10535
24582 10535 32327 18398 -8678 74383 65648 28280 38948 10217 -38944 -12018 -38239 -65873
24570f5873L0586L2070Q018L1173J8451q3188r3477M0754L1028k110J0463k1940
24558f4045M7125J1193M681k3187L1273j6206n508k6722j2980k6696k9791L5726
24546g5137M1497K4111K4977M9536N1131l1111n711j4452o840k5817p2122p0329
24534a10267J8533J9386L5285O192j1364L4195k0579M7352J6638J8135l8084o1593
24522d6171j4444J9148K8188l6631k1006K0767J3093P926m1268J4596m453L1334
24510b8921N4879l08L988J2294N120m6189J7112J9068m3668R976j30q4998J1233
24497g0544N7691m776J4515M7791P1511p115k2037l0718o5542k5685k372q688
24485d5969m890L2633M941n1841Q791j5122L045P982k409K0319J2909q887J5875
$$ plain form
24570 -65873 -35287 -3217 4801 35974 54425 -28763 -122240 -81486 -50458 -52568 -42105 -64045
24558 -64045 -16920 -5727 -1046 -24233 7040 -9166 -14674 -41396 -54376 -81072 -110863 -75137
24546 -75137 -33640 -9529 15448 64984 116115 85004 79293 64841 58001 32184 -39938 -110267
24534 -110267 -91734 -72348 -37063 -30871 -42235 -8040 -28619 18733 35371 53506 15422 -46171
24522 -46171 -60615 -41467 -13279 -49910 -70916 -50149 -37056 -29130 -70398 -55802 -60255 -28921
24510 -28921 25958 25650 29638 41932 47052 863 17975 37043 -6625 3351 3221 -81777 -70544
24497 -70544 -12853 -17629 -3114 44677 116188 109073 87036 56318 -9224 -34909 -37281 -45969
24485 -45969 -50859 -18226 -13285 -65126 -56335 -71457 -68412 -60430 -62839 -42520 -29611 -38498 -22623
24472b2623L7123K5164n1853l6361k433P419J5191J6426K1449P564J7512j5026
24460A9552l4883K1792J857J4925J5276j676p462p3647J5186P5243L3438M996
24448H4597L2943K2878m2954p198m771k2111n4663J6652J8532k5196M946K5388
24436D9043k4036k3553J3608J7954J6544J7417l0366Q38j0719j9917K0987n9975
24424c2175n0018j9491M5930J2078J7332J8664R286O097j0150m2960j4893M3831
24412a6469l6678O081M1204r514L950M580M0025K8159k4138m160J5384q984l2569
24399F871m488L701M7326P5845L657l5482k5904n4348q1262k6624P527L2589k4415
24386g5007M2837N0068m3097r0427K8817L0667l2553R017J5286p369k0460j5116
$$ plain form
24472 -22623 14500 39664 -12189 -48550 -50983 -43564 -28373 -11947 9502 17066 34578 19552
24460 19552 -15331 6461 8318 23243 38519 36843 29381 -44266 -29080 46163 79601 84597
24448 84597 117540 140418 97464 90266 85495 63384 8721 25373 43905 18709 23655 49043
24436 49043 25007 1454 15062 33016 49560 66977 36611 37449 26730 6813 27800 -32175
24424 -32175 -82193 -101684 -55754 -43676 -26344 -7680 1606 7703 -2447 -45407 -60300 -16469
24412 -16469 -53147 -47066 -5862 -15376 -11426 -6846 33179 61338 37200 33040 48424 39440 6871
24399 6871 2383 6084 53410 129255 132912 97430 71526 17178 -64084 -90708 -83181 -50592 -75007
24386 -75007 -32170 17898 -25199 -115626 -86809 -56142 -88695 -79678 -64392 -71761 -92221 -107337
24374a07337M2028N3540J9212m3317r947N582j1549L899N0682L2909L6649j1931
24362F0420K29l186p3715l5444K7537K2544K5941L7584L3724p154o0681m3857
24350a6058K6721j910k2026q263M5549J1013k2608m9150j1228M311K4327L9826
24338B0504l8407l2632L2311K0761K8800k805l7818j7894K7665j6680p660k2724
24326d6579k2911P782K7734Q2874M5675l5676k8889n521M6214m0914o3401k5726
24314e9338n831K4365L0154m079k6221L2242N1428N8646q7870l4666J5048N7518
24302E1396N45p51J3397l8039l4681j9533R290l4732j4220J3505J3480l391j594
24289d5328N0842P591m1173k7407k558N9489Q390l6204k0791k8653k8150N2416
$$ plain form
24374 -107337 -65309 -11769 7443 -35874 -45821 -40239 -51788 -47889 2793 35702 72351 60420
24362 60420 60649 57463 -16252 -51696 -24159 -1615 24326 61910 95634 88480 27799 -16058
24350 -16058 10663 8753 -13273 -21536 24013 35026 12418 -36732 -47960 -43649 -19322 20504
24338 20504 -17903 -50535 -18224 2537 31337 28532 -9286 -27180 485 -16195 -23855 -46579
24326 -46579 -69490 -61708 -33974 48900 94575 58899 30010 24489 70703 29789 -33612 -59338
24314 -59338 -65169 -40804 -10650 -14729 -40950 -8708 42720 101366 13496 -21170 -6122 51396
24302 51396 51941 51190 64587 26548 -8133 -27666 -18376 -53108 -67328 -53823 -40343 -43734 -45328
24289 -45328 5514 13105 -28068 -55475 -58033 1456 9846 -26358 -47149 -75802 -103952 -51536
24277e1536M2957l910M0318J8387l1621j5005N783L3833k9850K1345j0265K862
24265B3298l0545n8958K7535j0801j1764r470K3293M2138K6793n4704l231M1079
24253D663K760K5409j9553l8383L7401n46m5325J2801N5689K2978k2288m3672
24241h066J2547M2940j2752J1822K9833o1474n5392M033P867m2709o873N076K2588
24228e0560l422J3978L2784M8305m0800o5957N9077J24335J166r0538o1264k0735
24216e3631m364n4214J6605K1905L9448J06025K2987l5164m0991J6386L669J8732
24204E7393l261k0735n607M453Q356J738j1899p453j1807r4113K3080J18809N3486
24191A12440L800k145l5935K4531o5932l3181o367M8484O895r668l0685j6450
$$ plain form
24277 -51536 -8579 -12489 27829 46216 14595 -410 5373 39206 9356 30701 20436 23298
24265 23298 -7247 -66205 -38670 -49471 -61235 -70705 -47412 -5274 21519 -33185 -36416 4663
24253 4663 7423 32832 13279 -25104 12297 11751 -33574 -20773 34916 57894 35606 -8066
24241 -8066 4481 47421 34669 46491 76324 14850 -40542 -36509 -28642 -71351 -78224 -73148 -50560
24228 -50560 -53982 -40004 -7220 41085 285 -65672 -6595 117740 118906 28368 -32896 -53631
24216 -53631 -57995 -112209 -95604 -73699 -34251 71774 94761 59597 18606 34992 38661 57393
24204 57393 54132 33397 27790 32243 40599 42337 30438 22985 11178 -82935 -59855 58954 112440
24191 112440 116240 114095 78160 102691 36759 3578 -2789 45695 52590 42922 12237 -4213
24179d213J2211L1781l5692j4839j2987J2360j2104k2502K5458j5174p712k6854
24167g0267P602L9987J2158L3656m0621l8421k4178P3019N937R286M9859N0870
24155A08887k9348l398j760K4327l6339n142J2203k2865l2756l4565K3796j2073
24143i033k2818J6099L578k0693M1883j4318j0039N6508K897J9757j9856j8626
24131B5339P712r382p6565m0921M320K8344N9441R561K315j0851j2471j6666J6924
24118a2900M683k1552J5996K8271n813j2866J4297l1679j9304l785N9736K3290
24106C8374k1603l2483J6463n5656j8357N9509R8060J5428j2814p6397O957K7363
24094D4844n668l385p185n6827p071L1378l0981j6071K37l6433O7262J8234m6028
$$ plain form
24179 -4213 7998 39779 4087 -10752 -23739 -11379 -23483 -45985 -20527 -35701 -43413 -70267
24167 -70267 -62665 -22678 -10520 23136 -17485 -55906 -80084 -7065 -1128 8158 58017 108887
24155 108887 79539 76141 74381 98708 62369 57227 69430 46565 13809 -20756 3040 -9033
24143 -9033 -31851 -15752 -12174 -32867 9016 -5302 -15341 41167 44064 63821 43965 25339
24131 25339 33051 23669 -52896 -93817 -89497 -61153 -1712 7849 10164 -687 -13158 -29824 -12900
24118 -12900 -8217 -29769 -13773 14498 8685 -4181 10116 -21563 -40867 -44652 15084 38374
24106 38374 16771 -15712 751 -54905 -73262 -13753 84307 99735 86921 10524 17481 44844
24094 44844 39176 35791 28606 -28221 -35292 -3914 -34895 -50966 -50729 -87162 -19900 -1666 -47694
24081d7694Q226K5760L1453K9199Q954L2423J1688l0354q0405m4071M7756m5903
24069e2968j3206M9060J8747K4105o7034m8369K2845O5025M76r149j5811q799
24057c5078j8336m4471M3280P8301O335n8635J4770N845o244J0863j5254K1383
24045B759k9241L066J660j7187J3174O7396L9969K0797l0037q1917J789J6500
24033H728k6758K159J2269M2081M5739n4169m9961n511o709K0945L0725Q643j4091
24020A4090m3512k990l8898j5832M6692K2220Q04k7614l6643j3260N4810Q758
24008c1375J9871n4209j9515M2982K6815m8289r073R7337O2415o4000J3235L998
23996D0192l8776k8097L0053L0323k0674K2087L4087J6283L4548m9121m8146n1875
$$ plain form
24081 -47694 -39468 -13708 17745 46944 55898 88321 100009 69655 -10750 -54821 -7065 -52968
24069 -52968 -66174 -17114 1633 25738 -41296 -89665 -66820 -1795 -1319 -10468 -26279 -35078
24057 -35078 -53414 -97885 -54605 23696 30031 -28604 -13834 -7989 -14233 -3370 -18624 2759
24045 2759 -26482 -23416 -21756 -38943 -25769 41627 81596 102393 72356 -9561 -7772 8728
24033 8728 -18030 -15871 -3602 38479 84218 30049 -19912 -25423 -32132 -11187 19538 28181 14090
24020 14090 -29422 -32412 -71310 -87142 -40450 -18230 -17426 -45040 -81683 -94943 -40133 -31375
24008 -31375 -11504 -65713 -85228 -42246 -15431 -63720 -72793 24544 86959 22959 36194 40192
23996 40192 1416 -26681 3372 33695 13021 35108 69195 85478 120026 70905 22759 -29116
23984b9116l6596J946L506M354o639j3433o2472j2415M7662K1056l602j9559N2786
23971e2522Q2344L1049m0460k7644K4029K8135j0690L07M0287n9202n6411j1456
23959e2234K8331K6929N2166k0199m3698k909j7053J0457q184m6055k2914L5608
23947e9755J6600L5293J864k4032p504J6710m1304K1457P263P062J5887k0875
23935c1334K6441L2023J7749l1563o42N9161k5359l8068k9960Q593L3778j9042
23923A777j3851o393M9978L6120r08k8166r234r031j396j6233P852L8274L7550
23910H6339L1478l9381l9334J1386j1222j9255J0386n6676p0354K9357J0457J0235
23898d6584L8724O4650l6734n7497l9688L3561Q0643J0511o4966m7524n8578j3972
$$ plain form
23984 -29116 -65712 -63766 -60260 -55906 -62545 -75978 -138450 -150865 -103203 -82147 -85749 -105308 -52522
23971 -52522 29822 60871 20411 -7233 16796 44931 34241 34548 74835 15633 -40778 -52234
23959 -52234 -23903 3026 55192 34993 -8705 -11614 -28667 -18210 -26394 -72449 -95363 -59755
23947 -59755 -43155 -7862 -5998 -30030 -37534 -20824 -62128 -40671 -33408 -26346 -10459 -31334
23935 -31334 -4893 27130 44879 13316 12674 71835 46476 8408 -21552 -12959 20819 1777
23923 1777 -12074 -18467 31511 67631 66723 38557 29323 20292 18896 2663 10515 48789 86339
23910 86339 117817 78436 39102 50488 39266 20011 30397 -26279 -96633 -67276 -56819 -46584
23898 -46584 -7860 56790 20056 -37441 -77129 -43568 37075 47586 -17380 -64904 -123482 -137454
23886a37454K5286L2223N5623K7064j4354k7145k324L7698K3708O4914L8394j8309
23874A05324n1357l1165m873P964l6135k991j5364l3682J6701l6938k5897L6279
23862g2134P801L5174k6969r868j9996J8690K8746n1376J6041M1999J1499k8824
23850d9217j0139p316J2479N076l0894l2126M7207L3646K7013M3855o9986l3182
23838f3584l733L4384P8267m488k2050l1134m5661L9112R655K420k4972m104l073
23825c8961m5262l7545J7430K8286J3517k1589M3062O0476j9535j1233M456N0156
23813D3258J3019o1762N8986M9465K5630l7411l2847L9656k1201j2321l6602o0814
23801c2944J2964M9303j4746j023M567n9541J5229J7220K1725J3197k5335L2668
$$ plain form
23886 -137454 -112168 -79945 -24322 2742 -11612 -38757 -41081 -3383 20325 85239 123633 105324
23874 105324 53967 22802 17929 25893 -10242 -13233 -28597 -62279 -45578 -82516 -108413 -72134
23862 -72134 -64333 -29159 -56128 -65996 -85992 -67302 -38556 -89932 -73891 -31892 -20393 -49217
23850 -49217 -59356 -66672 -54193 -49117 -80011 -112137 -64930 -31284 -4271 39584 -30402 -63584
23838 -63584 -67317 -32933 45334 40846 18796 -12338 -57999 -18887 -9232 -6812 -31784 -35888 -38961
23825 -38961 -84223 -121768 -104338 -76052 -62535 -84124 -41062 19414 -121 -11354 -6898 43258
23813 43258 56277 -5485 53501 102966 128596 91185 58338 97994 76793 64472 27870 -32944
23801 -32944 -19980 29323 14577 13554 18121 -41420 -26191 -8971 12754 25951 616 33284
23789C3284j3027J9547L8058j3850m7950j3138L373j5115K822k7938J1792N422
23777a6720J063j1652M9897K6298j1502k2815m2590L697l1340r059K2532l538
23765d5729j3652m857K4148j8237P737M3651L0319o196n7970M5254q642k5318
23753b9492m5642J3723N2370K5810l2081L390p203J7196l5109j0954L6882k5940
23741c7050O5287K5733K6190j4993k862k9422k3074Q013k0429k4147n273j8785
23729e0812k5541J7576L2074J0833J92j4563L6599N0320n7161p2331L3601L4935
23717d278J07184M8025k7868q6771l4241K864j5932L7999n240k5663K008K7998
23705B6085N062k3362o038k6122l7837L3940m678j7372L2367M5202q43j7794o7731
$$ plain form
23789 33284 20257 39804 77862 64012 16062 2924 6297 -8818 -5996 -33934 -22142 -16720
23777 -16720 -15657 -27309 22588 48886 37384 14569 -28021 -24324 -55664 -64723 -42191 -45729
23765 -45729 -59381 -64238 -40090 -58327 -50590 -6939 23380 17184 -40786 4468 -4174 -29492
23753 -29492 -75134 -61411 -9041 16769 -15312 -11922 -19125 -1929 -37038 -47992 -11110 -37050
23741 -37050 28237 53970 80160 65167 62305 32883 9809 17822 -2607 -26754 -32027 -50812
23729 -50812 -76353 -58777 -26703 -15870 -15678 -30241 6358 56678 -483 -72814 -39213 -4278
23717 -4278 102906 150931 123063 36292 2051 4915 -11017 26982 21742 -3921 -1913 26085
23705 26085 31147 7785 1747 -24375 -62212 -28272 -32950 -50322 -17955 27247 26404 8610 -59121
23692e9121J935M0074L8847j508K6272l1018m9727j4680N871j7452K168q361N3199
23679a3501P5101l6768k3562j5688k0011l3891M0991J2571j7949J2262r363n2362
23667h2170k9126N3636N8277J7579j5455l0566l7868k6096q757J3327J7231n556
23655g5544M6461L7686J8259P423m6312l823K1388L0102j2428j7716m0156n0372
23643h5032l6897L7841L7393N0069Q802j3929J9107l5357l961L1159J6516k4019
23631A692k4136k1654j6214M8693N2700N0063J968p3633l8359r601O859J7097
23619d525J8622n8173N146K5011j8195J178K9483j8803o751r144K492J7805O878
23606h976L240P402K0741n6434m6422R047J8822j474L0232K68J0412k3167q9053
$$ plain form
23692 -59121 -57186 -17112 21735 20227 46499 15481 -34246 -48926 -43055 -60507 -58339 -66700 -13501
23679 -13501 61600 24832 1270 -14418 -34429 -68320 -27329 -14758 -32707 -20445 -29808 -82170
23667 -82170 -111296 -57660 617 18196 2741 -27825 -65693 -91789 -100546 -87219 -69988 -75544
23655 -75544 -29083 8603 26862 34285 -12027 -15850 5538 35640 23212 5496 -34660 -85032
23643 -85032 -121929 -84088 -46695 3374 12176 -1753 17354 -18003 -21964 9195 25711 1692
23631 1692 -22444 -44098 -60312 -11619 41081 91144 93112 19479 -18880 -28481 -21622 -4525
23619 -4525 14097 -44076 -38930 -13919 -32114 -30936 -1453 -20256 -27007 -36151 -33659 -15854 -8976
23606 -8976 -5736 1666 22407 -34027 -80449 -71402 -52580 -54054 -23822 -23554 -13142 -36309 -125362
23593a25362J001O1135M5554M3098l4864M9846O4470o5436r6750m2433k4379O1502
23581f2618L8628K8177k508q014j0391J65K8274l7452j3915M9433N5367n8711
23569F435o5111N500Q1684M7949n5154m540j2467J3287J3853k5584l1831R023
23557a6956K0903j5063k4733j1641K0641l3086p6L6419k4118M5319O9571j1231
23545E5949j3344L4206j2002R261J3256l4729r6344l055m992J1731k6200M583
23533f1680M1286L7018j3544m110M6586K1975J4037l3874K1099J6239N1626J0952
23521A47610o6641p4274q732l4015K0745O3616L2485K4779K8588p1055o2372l6809
23509c6075j1227j0950M3887Q3763l4691n6871M8541J06886j5124n5087m3650
$$ plain form
23593 -125362 -124361 -63226 -17672 25426 -9438 40408 104878 39442 -57308 -99741 -124120 -62618
23581 -62618 -23990 4187 1679 -6335 -16726 -16561 11713 -25739 -39654 9779 65146 6435
23569 6435 -58676 -53176 28508 76457 21303 16763 4296 17583 31436 5852 -25979 -16956
23557 -16956 3947 -11116 -35849 -47490 -26849 -59935 -60011 -23592 -47710 -2391 67180 55949
23545 55949 42605 76811 64809 74070 87326 52597 -43747 -46802 -51794 -40063 -66263 -61680
23533 -61680 -20394 16624 3080 -1030 45556 67531 81568 47694 68793 85032 136658 147610
23521 147610 80969 6695 -2037 -36052 -15307 48309 80794 105573 134161 63106 734 -36075
23509 -36075 -47302 -58252 -14365 69398 34707 -22164 26377 133263 118139 63052 19402
23498A9402Q685k8131l0319n1197k8330O6177K1161j4466p837l4582P812J4368
23486e7257N2093J9337l5186J4454R728j9451J729K5108L9291o084l4012k9940
23474b0190l4520l2529j0461N8497K8619j9203J6965l1133k6494P9488N5696o4844
23462a09k2669L6744M3165l2638k9547l81p828p883O162O4968k92P71k0304K310
23448C2469k1465l1916l02J7311K5789M1032l8754o7534N1452j074L29j2259K516
23435b406R04K8846N2620k7510m4807r92K1810k8910l1893M0572N3374n849p9492
23422b3733k0122j3027j400L2076o85o5259Q648J7391m2004J1518M2837N4418
23410F58N702P23k8469k1794J0492J4398K770K6430J0038K88R669k0369n257L857
$$ plain form
23498 19402 28087 -44 -30363 -81560 -109890 -43713 -22552 -37018 -44855 -79437 -71625 -57257
23486 -57257 -5164 14173 -21013 -6559 3169 -16282 -14553 10555 49846 43762 9750 -20190
23474 -20190 -54710 -87239 -97700 -39203 -10584 -29787 -12822 -43955 -70449 9039 64735 -109
23462 -109 -22778 13966 57131 24493 -5054 -5435 -13263 -21146 -14984 49984 49692 50463 30159 32469
23448 32469 11004 -20912 -21214 -3903 21886 62918 24164 -43370 8082 7008 7337 -4922 -2406
23435 -2406 -1502 27344 79964 52454 7647 6655 28465 -445 -32338 8234 61608 55759 -23733
23422 -23733 -43855 -56882 -58282 -26206 -26891 -92150 -83502 -66111 -108115 -96597 -53760 658
23410 658 6360 7083 -21386 -43180 -32688 -18290 -15520 10910 20948 21236 30905 10536 5279 9136
23396I136o4345m1130K49N1590L7840K5875k8939k4213k1986K290l8155J9407
23384g2381N975K8320L7120m9370n5095O5255K3235R497N9208J1764j9102j7050
23372B7376K658m2787l7331K3442k049J1117M6338j2344n6115M5083N0130l1886
23360B3632o3768m9583l3265K0494O9119l0834L4724O6223o20m8504j1342k1915
23348d5639j0269P361p951l0313N5988L2334K4355M3047J5676k9733l4067m3910
23336b3121L589n1318k0185P1668k0518k990k5551l7919J6458L7436J4111N306
23324c3034L8301k7596j6488l9430K5497K2789J8154Q2752K2852Q12m8734q9709
23312d3834k5554m741J1643n125L5621M1157J8242L9559j5783j8773j8650o9524
$$ plain form
23396 9136 -55209 -96339 -96090 -44500 -6660 19215 -9724 -33937 -55923 -53633 -91788 -72381
23384 -72381 -66406 -38086 -966 -50336 -105431 -40176 -16941 -7444 51764 63528 44426 27376
23372 27376 30034 -12753 -50084 -26642 -28691 -17574 28764 16420 -39695 5388 55518 23632
23360 23632 -40136 -89719 -122984 -102490 -33371 -64205 -29481 36742 36122 -12382 -23724 -45639
23348 -45639 -55908 -48547 -56498 -86811 -30823 1511 25866 68913 84589 54856 20789 -23121
23336 -23121 -19532 -70850 -91035 -19367 -39885 -42875 -68426 -106345 -89887 -52451 -38340 -33034
23324 -33034 5267 -22329 -38817 -78247 -52750 -29961 -11807 70945 93797 94609 45875 -43834
23312 -43834 -69388 -74129 -62486 -67611 -31990 9167 27409 66968 51185 32412 13762 -55762
23300e5762j3443O4342J8195p5785N960j0751P576J2147j107l3616N853N4311
23288b2080r832r188j7431k8304K1468k676k3413L4107L0535J0238j4791p1170
23276a02537K7418L8369M8774O5812n5171l272Q650K566j8837n005N1194o291
23264E1670N0365n9297q3330o0804K9993Q2918j4674Q956j4338p6274O959N4625
23252b3231O4134k542M9196n361o4022m1905k6227j7969M4171O3453K174n5472
23240a3601L2972K6327P435L0474J1553l6691l3472J7914N706n4218N427P4047
23228G3873L1192m3702p974j2060J9339q0502j1498K3897k5583l0858J018l6266
23216i9124L458M2123j3304n2539O624J2396J1143O4082O2943j1125k3302m0996
$$ plain form
23300 -55762 -69205 -4863 13332 -62453 -56493 -67244 -59668 -47521 -48628 -82244 -76391 -22080
23288 -22080 -31912 -41100 -58531 -86835 -65367 -68043 -91456 -57349 -26814 -16576 -31367 -102537
23276 -102537 -75119 -36750 12024 77836 22665 19393 28043 30609 11772 6767 57961 51670
23264 51670 102035 42738 -40592 -101396 -71403 11515 -3159 5797 -8541 -84815 -77856 -23231
23252 -23231 40903 38361 87557 82196 18174 -23731 -49958 -67927 -23756 39697 41871 -13601
23240 -13601 19371 45698 53133 83607 95160 58469 24997 42911 48617 -5601 -174 73873
23228 73873 105065 61363 53389 41329 60668 -19834 -31332 -7435 -33018 -63876 -62858 -99124
23216 -99124 -95666 -53543 -66847 -119386 -112762 -100366 -89223 -25141 37802 26677 3375 -37621
23204c7621j5872Q7621M1778j7139k6672k8408o4087k1838L7224N6477M7865n5752
23192C576j3624L8062K752p0087j8281J7874j492m3371K2878m9654q137N9326
23180f0178J6340O718K3479o744j1190j1952l318N27M3613j5965l7837K3989k7383
23167e9901K934O2453P757l34k4678P100L3786n3735m6579m6155J2228K8506k8025
23154a04643K848P3535k8441k0150M5547J9375N5607K283j3880O729J834K2284
23142F2928n3742l8986q436N4711j5776o7545o0301M5027L0224k8435J9016L7366
23130b3949O0338J8114L6879m9925p7371K6152Q614l4636k5114j0087J259L0986
23118c8740J2550N939J9187j948q676j3193l5370K5004m0360l6327M4728N0356
$$ plain form
23204 -37621 -53493 34128 75906 58767 32095 3687 -60400 -82238 -45014 11463 59328 3576
23192 3576 -10048 28014 30766 -39321 -57602 -39728 -41220 -84591 -61713 -111367 -119504 -60178
23180 -60178 -43838 -37120 -13641 -20385 -31575 -43527 -46845 -46318 -2705 -18670 -56507 -32518 -59901
23167 -59901 -56967 5486 13243 12909 -11769 -4669 29117 -24618 -71197 -117352 -105124 -76618 -104643
23154 -104643 -101795 -28260 -56701 -76851 -31304 -11929 43678 45961 32081 38810 40644 62928
23142 62928 9186 -29800 -38236 16475 699 -66846 -127147 -82120 -51896 -80331 -61315 -23949
23130 -23949 36389 54503 91382 41457 -35914 -9762 -1148 -35784 -60898 -70985 -69726 -38740
23118 -38740 -26190 -20251 -1064 -3012 -11688 -24881 -60251 -35247 -75607 -111934 -67206 -16850
23106a6850K8389K1351P8161Q356q3067o7705M398L8045L5437q838n5943O147
23094a2119o5476n2241K5424L0602J7406K2998j1861J0426j0648o907j421R3918
23082D0101m079p308O803n1822m5370k021J6596O322K6898J4493k6938Q102M1335
23069B3112j0612k4840j7269j7293k3745L8299L9177K805l3020J3922l1064k6419
23057f6947J934r467M577L4978K2344n888J2438r414o9798M640P9611L2544P46
23044C2298j1979j0644j3272Q116k9824n5190l4245J1825J5600O3884L2645j4978
23032e764l4880K5543k19k7258n460N355n296k2249k287j2324P280J8455K646
23019e6458K3549K8203K0396k0966k0085M643J9369l911Q096K3373o129L4220
$$ plain form
23106 -16850 11539 32890 111051 119407 36340 -31365 -26967 11078 46515 37677 -18266 -12119
23094 -12119 -77595 -129836 -104412 -73810 -56404 -33406 -45267 -34841 -45489 -52396 -53817 40101
23082 40101 36022 28714 35517 -16305 -61675 -63696 -47100 -40778 -13880 613 -26325 -18223 23112
23069 23112 12500 -12340 -29609 -46902 -70647 -32348 6829 9634 -23386 -9464 -40528 -66947
23057 -66947 -65013 -74480 -69903 -34925 -12581 -18469 -6031 -15445 -85243 -80603 -992 31552 32298
23044 32298 20319 9675 -3597 4519 -25305 -80495 -114740 -102915 -87315 -23431 9214 -5764
23032 -5764 -40644 -15101 -15320 -42578 -48038 -42683 -47979 -70228 -72515 -84839 -77559 -59104 -56458
23019 -56458 -32909 -4706 15690 -5276 -25361 -20718 -1349 -5260 2836 26209 20080 54300
23007E4300j5090l1501J1127l2892k4054J287j5629n9736k2897L3651L8487O43
22995f2304O9288P2242l1539m1203m4589j5279L2530o1994P770L7381r8971J6687
22983a19981J05016L7469j1338K0800o2742K912J8240K6641o519j9144N967m7264
22971d9943j740q455j8241K9569N534l7392l0120k685L9798L476N1338M4958j9444
22958F653l2399O3731j2152l211l5719j5905n0431j2187M9056K0363p1814j7954
22946a11969M6067L6189k791N2730R4175k9722l7584n6645j6398m3322Mk903k2893
22933i5062K7249j1264k738J0582j6859j4676N1335L2972K2499j4949l3161J5907
22921b8165J4021k642n0395l7348N8792j3321K9739K7453R015K2109n5607j1948
$$ plain form
23007 54300 39210 7709 18836 -14056 -38110 -36823 -52452 -112188 -135085 -101434 -62947 -62304
22995 -62304 6984 79226 47687 6484 -38105 -53384 -20854 -82848 -75078 -37697 -136668 -119981
22983 -119981 -14965 22504 11166 31966 -30776 -27864 -9624 17017 10498 -8646 -2679 -49943
22971 -49943 -51683 -60138 -78379 -48810 -43276 -80668 -110788 -113473 -73675 -70199 -18861 26097 6653
22958 6653 -25746 37985 25833 22622 -13097 -29002 -79433 -91620 -42564 -22201 -94015 -111969
22946 -111969 -65902 -29713 -32504 20226 114401 84679 47095 -9550 -25948 -69270 -69266 -72169 -95062
22933 -95062 -67813 -79077 -81815 -71233 -88092 -102768 -51433 -18461 4038 -10911 -44072 -28165
22921 -28165 -14144 -16786 -67181 -104529 -45737 -59058 -29319 -1866 7149 29258 -26349 -38297
22909c8297K6105o14O26K1481K7538l5858n4821q0535k9797N0797J11968J0220
22897H813l3945l3425l1842L1163J1588K1192K7656P077m7724p920k000L4527
22885a4840L3066n1898r306P821N6910n0980m2095K5206M3429N0507K0875P8l087
22872F5686K558J0021m3444J3521M1636k6182N246k7035l118k3390r785J6161
22860B1875J7532l0950L63m7951L6240l1028n6148J0240J290N631J9542Q3744
22848C0380K2833n390j1270l1635J1592l2819L5482K2515j8634j1556q258l7056
22836c3816p1486P4180M9204k5635P51k998n3651K5137k4120j3384P101L7510
22824c1207N466J4452k6232m5859q3l6548M2013J3022Q927P7562L3161J4634m9235
$$ plain form
22909 -38297 -12192 -12806 -12180 9301 36839 981 -53840 -134375 -164172 -113375 -1407 8813
22897 8813 -25132 -58557 -90399 -59236 -47648 -26456 1200 8277 -39447 -47367 -49367 -14840
22885 -14840 18226 -33672 -42978 -35157 21753 -29227 -71322 -46116 -2687 47820 68695 68773 65686
22872 65686 68244 78265 34821 48342 89978 63796 69042 42007 38889 15499 5714 21875
22860 21875 39407 8457 8820 -39131 -2891 -33919 -90067 -79827 -78537 -72906 -53364 30380
22848 30380 53213 47823 36553 4918 16510 -16309 19173 41688 23054 11498 3240 -33816
22836 -33816 -105302 -31122 18082 -7553 -6802 -9800 -63451 -38314 -62434 -75818 -68717 -31207
22824 -31207 -25741 -11289 -37521 -83380 -83463 -120011 -77998 -64976 -56049 21513 54674 69308 20073
22811B0073m6922j9801L3161j253n9337k1291L713K8085J7848l2644L0277k7646
22799g5737L068O3462K5228l9714l6315j1762M8272k4281J840L2055L7978o926
22787A7168j0129l2346J0841k166p8940l0470K1212J16687P6795o3220j8042Q77
22775H267Q255J8848m8273j8668q496p295M2523N4611j2505j5775L3605p875J3647
22762F0869l1666k2712J0067l3944p4091K9167J9125l66j7812r118P791l6589
22750i9279O0874O7468n289n893J9161q004n1575n4335N997R3797k1042l1528
22738b9648M7634J3956O04p543r389m284J7754m3301o6793j1913N0351N2463J0090
22725A9981m323m425J7398K5293j8998m8321j5621O678j3696l6631j3678K1576
$$ plain form
22811 20073 -26849 -46650 -13489 -14742 -74079 -95370 -91657 -63572 -45724 -78368 -48091 -75737
22799 -75737 -72669 -9207 16021 -23693 -60008 -71770 -23498 -47779 -45939 -13884 24094 17168
22787 17168 7039 -25307 -14466 -16632 -95572 -126042 -104830 11857 88652 25432 7390 8267
22775 8267 16522 35370 -12903 -31571 -40067 -47362 -4839 49772 37267 21492 55097 47222 60869
22762 60869 29203 6491 16558 -17386 -91477 -62310 -43185 -43551 -61363 -70481 -62690 -99279
22750 -99279 -38405 29063 23774 17881 37042 29038 -22537 -76872 -70875 22922 1880 -29648
22738 -29648 17986 31942 32546 25003 15614 11330 29084 -14217 -81010 -92923 -42572 9891 19981
22725 19981 15658 11233 28631 53924 34926 -13395 -29016 -22338 -36034 -72665 -86343 -64767
22713f4767l75P695O4687P1502m2997k2619r397J066k8304j0045n013l3915l2290
22700a04772q02P3927M261l2995j0268M403o919M5088M0704O7220n609j13627
22688c9389p1969R857l2813J6989M9994K4110m3555K5238N0388O0565M231k0228
22676C3418J6496K5468j933m4953l51r031O339K1041k9664J4595k2603k9135P4387
22663E4074J3677j9622J1039l5804M996j4052L2665j7019k0195J5767O1543o7349
22651A9720Q936q1916k804L6581J4101J7851K8593J5165j0852N8696J9605j5843
22639A07833l1385l1296m4586N580N5260J5001N087r480L969m9443m9713k7179
22627e0352j0178L9210m05J9989L4387j832l5056k9447K9437M4039P849J5019
$$ plain form
22713 -64767 -65142 -57447 7240 78742 35745 13126 3729 4795 -23509 -33554 -38567 -72482 -104772
22700 -104772 -105574 -31647 -27386 -60381 -70649 -66246 -73165 -28077 12627 79847 74238 -39389
22688 -39389 -111358 -101501 -134314 -117325 -67331 -43221 -86776 -61538 -11150 49415 53646 33418
22676 33418 49914 75382 73449 28496 28145 19114 25453 46494 16830 31425 8822 -20313 54074
22663 54074 67751 48129 59168 23364 28360 14308 46973 29954 9759 25526 87069 19720
22651 19720 28656 -53260 -56064 -19483 -5382 12469 41062 56227 45375 104071 123676 107833
22639 107833 76448 45152 566 6146 61406 76407 81494 72014 75983 26540 -23173 -50352
22627 -50352 -60530 -21320 -21725 -1736 32651 30819 -4237 -33684 -4247 39792 47641 62660
22615F2660K3446m1543n8199j9884k4079n5427l2638Q233K6242L9649J8314k5873
22603g9099J4308J6755K2715N075L3085J6617Q134j6427J100j0801l5847l4471
22591e8856k9619k8999K75K6118O9686p547o004j8620N2031M7947o2550l783J2848
22578g073K8154k9870l7731K5024L2857m9265j8635K7257L659m3953J159J1198
22566e7219M255J0411K6010M569K8831P418k7626r702j4328p10L0635K289j0224
22553e391J3383M7900k9383q3134k82M4099K630k5622J6838o8618J4322K9411
22541d3847M713k8888m8160o7830O5359Q2700O5829l6261k8985m9152j9861N4205
22529e0178M6187o4911L4041k4264j7198J0100K0063L8091L0292J0843k8056p1376
$$ plain form
22615 62660 86106 44563 -13636 -33520 -57599 -113026 -145664 -137431 -111189 -71540 -53226 -79099
22603 -79099 -64791 -48036 -25321 -20246 12839 29456 37590 21163 22263 11462 -24385 -58856
22591 -58856 -88475 -117474 -117199 -91081 -21395 -28942 -34946 -53566 -1535 46412 -16138 -19921 -7073
22578 -7073 21081 -8789 -46520 -21496 11361 -37904 -56539 -29282 -25623 -69576 -68417 -57219
22566 -57219 -52964 -42553 -16543 -11974 16857 24275 -3351 -13053 -27381 -28091 2544 4833 -5391
22553 -5391 7992 55892 26509 -56625 -56907 -12808 -10178 -35800 -18962 -87580 -73258 -43847
22541 -43847 -39134 -68022 -116182 -184012 -118653 -35953 29876 -6385 -35370 -84522 -104383 -50178
22529 -50178 -3991 -68902 -34861 -59125 -76323 -66223 -46160 -8069 22223 33066 5010 -66366
22517f6366O095P2548K8382j8412k0228m934l5625j5055N277M4412l09l2077j1521
22504d7813J4293K4812K504J0941J0857N378o635j5411j3001l6228K3806j2585
22492c9082J3537N1603N2055j534k7709n26J4351n418P006K384K3769m5902j0694
22479C3840k7192r0497o186J8582k948q496O9616K8723o1583j2548L1662N7160
22467C0133n1863J8554J9751j9755j8603J2498J4925N097j97j2955J4411j4358
22455b362m6169p4747r048L9694M805J8280J1982j8158n9593K5327J044O744K7683
22442g4518R6165M4025P011l9007l8106P313l4014J2577J0484p375L9342J412
22430B5309J5706k9234l4619k1588k354j169j276m8321n373N6708N252j5481L4217
$$ plain form
22517 -66366 -60271 12277 40659 22247 2019 -2915 -38540 -53595 -48318 -3906 -4215 -36292 -47813
22504 -47813 -33520 -8708 -6204 4737 15594 20972 14337 -1074 -14075 -50303 -26497 -39082
22492 -39082 -25545 26058 78113 76579 48870 48344 62695 57277 64283 66667 90436 44534 33840
22479 33840 6648 -83849 -90035 -71453 -74401 -82897 -13281 15442 -46141 -58689 -27027 30133
22467 30133 -21730 -3176 16575 -3180 -21783 -9285 5640 10737 10540 -2415 11996 -2362
22455 -2362 -48531 -123278 -132326 -92632 -87827 -69547 -57565 -75723 -135316 -109989 -108945 -102201 -74518
22442 -74518 21647 65672 72683 33676 -4430 2883 -31131 -18554 -8070 -15445 23897 25309
22430 25309 41015 11781 -22838 -44426 -46780 -47949 -49225 -97546 -102919 -46211 -40959 -56440 -22223
22417b2223j0615q301K5976R080k5657R126K6571O80j9467K7419l5097m5555N87
22404f7476M9859J7483k400p893M5088P737l4072o447Q216K1475R078m7757k604
22391i713O265M2861m305K2063o3013J5970j6414j5867L034Q359j7377M98j6403
22378d4042O3939n637o530n32Q119k1862M3148L7672P105m5393l7963k7493L3923
22365D454K4638j085j1026k2555L6759K2573k2133j3628J5708k8441m0047j6009
22353e0792L657l460j7868L0578L4831L5758k896j5122j9371J1584j1769K3213
22341A8343k8026k3492j3552p357l0693K2235J7675l6638J5132j233m537R548
22329f2595j0663O752K5419P4056P485k206j256K1777l2701l6573M6501J3477
$$ plain form
22417 -22223 -32838 -41139 -15163 -6083 -31740 -22614 3957 4637 -14830 12589 -22508 -68063 -67476
22404 -67476 -17617 -134 -2534 -10427 34661 42398 8326 1879 10095 31570 40648 -7109 -9713
22391 -9713 -3448 39413 35108 57171 -5842 10128 -6286 -22153 -19119 -10760 -28137 -27639 -44042
22378 -44042 19897 14260 7730 7198 15317 -6545 36603 74275 81380 35987 -1976 -29469 4454
22365 4454 29092 28007 16981 -5574 31185 53758 31625 17997 33705 5264 -34783 -50792
22353 -50792 -47135 -50595 -68463 -37885 -3054 32704 29808 14686 -4685 6899 -4870 18343
22341 18343 -9683 -33175 -46727 -54084 -84777 -62542 -44867 -81505 -66373 -67606 -72143 -62595
22329 -62595 -73258 -66506 -41087 32969 40454 38248 36992 58769 26068 -10505 35996 49473
22317D9473K4810k0438l1329m1544N127j7767J7151q078M806j7530j7407m1217
22305i3943j7320O3228P4496P124m5963k1737j6005m8144K801j3153L1978N6703
22293a9935K3626l894n758N125K7928L9436R911p5927l3451O3738N1534l0971
22281E1362k2188n6733o0681l1715K7690L2438J7686k3209p146j2936P623J4823
22269f2986N163K2616j0826n861R216M0116L5436L8744R448l3550l157o822o7040
22256b9503j1431o490j689L1552K938p30K070M3420k5109r546J3966K7329j0630
22243B6147j6371r942p5867K0685N0570l241l5512L9272L8290p504l2291M4760
22231C8996j8246l753p971m4969m8638j5461R011O4255J08036j8419m8171m3628
$$ plain form
22317 49473 74283 53845 22516 -19028 -13901 -31668 -14517 -22595 -17789 -35319 -52726 -93943
22305 -93943 -111263 -48035 26461 33585 -12378 -34115 -50120 -98264 -95463 -108616 -76638 -19935
22293 -19935 3691 -203 -5961 -836 27092 66528 76439 512 -32939 30799 82333 51362
22281 51362 29174 -27559 -88240 -119955 -92265 -59827 -42141 -65350 -72496 -85432 -77809 -62986
22269 -62986 -57823 -35207 -46033 -51894 -42678 -2562 32874 71618 81066 47516 44359 37537 -29503
22256 -29503 -40934 -47424 -49113 -17561 -14623 -15353 -13283 30137 5028 -4518 9448 36777 26147
22243 26147 9776 -166 -76033 -55348 -4778 -8019 -43531 -4259 34031 26527 -5764 38996
22231 38996 20750 16997 9026 -35943 -84581 -100042 -91031 -26776 81260 62841 14670 -28958
22219b8958J0296M2336k5299Q062M6959p430j4750n3619m5356K3062N7557K492
22207A5352M670n4656l2554J8258L2207K5908L200j0897n143O668j9828M0418
22195B3603K7449j9756r547l3116K3867M8938R73l8152j9313J8965J1927M883
22183D0721m0335k2719K8402J5713n2203M579L1178O29o0720N91L1296J118j8866
22170d0616J4536J3484M535K0376o8511k6432J7748J2838J5941P684K5694K3189
22158B0466o3111n1381r453m013p989R588L0964K814j4045J7148L4042K5819j2066
22145b1217p4870m325L8110L1758M5557L4042k3750q985l5016m0824K1596M3213
22133E289J5169K3212l885l8047j9265J266K6735n1930l2641J8404M336L1709
$$ plain form
22219 -28958 -18662 23674 -1625 6437 53396 45966 31216 -22403 -67759 -44697 12860 15352
22207 15352 20022 -34634 -67188 -48930 -16723 9185 12385 1488 -3655 3013 -16815 23603
22195 23603 51052 31296 21749 -11367 12500 61438 62411 24259 4946 23911 35838 40721
22183 40721 386 -22333 6069 21782 -30421 -25842 5336 5965 -54755 -54164 -22868 -21750 -40616
22170 -40616 -26080 -12596 -8061 12315 -56196 -82628 -64880 -52042 -36101 -28417 -2723 20466
22158 20466 -42645 -94026 -103479 -107492 -115481 -105893 -74929 -72115 -86160 -69012 -34970 -9151 -21217
22145 -21217 -96087 -100412 -62302 -30544 15013 49055 25305 16320 -18696 -59520 -37924 5289
22133 5289 20458 43670 39785 1738 -17527 -16261 10474 -41456 -74097 -55693 -51357 -19648
22121a9648K6361P812k9562n250K3741l3185l0385L0696N0970m6728j3976M6566
22109G412Q253k5660j1939j2200K2296J0840j6919o4054l7853K2384M7318k2733
22097g2855k6968J8166O247M6854L2087n276j7247j4979M4077Q324k6069k5286
22085c2925j2174m67l5293J613j7185J3015L3142j7463j5797J2579L6910m1096
22073g5141J9771L6958o3348n4846k715o572O8438Q3541J8047m971Q170K112O675
22060C6119k0759N3154j5926l3010l2831j3308j1519n3351k6883j593n621L8320
22048h7208M5517k2368K5589M1022K7251k452k4000J8223P707N964K6381J286
22036F2912n869L6146k1393l2702n5873j9141L5781M2069K395j5024k3048m6833
$$ plain form
22121 -19648 6713 14525 -15037 -20287 3454 -29731 -60116 -29420 21550 -25178 -39154 7412
22109 7412 15665 -9995 -21934 -34134 -11838 -998 -17917 -81971 -119824 -97440 -50122 -72855
22097 -72855 -99823 -81657 -75410 -28556 3531 -1745 -18992 -33971 10106 18430 -7639 -32925
22085 -32925 -45099 -45566 -80859 -79246 -96431 -83416 -50274 -67737 -83534 -70955 -34045 -75141
22073 -75141 -55370 -18412 -81760 -136606 -139321 -145893 -77455 6086 24133 19162 27332 29444 36119
22060 36119 15360 68514 52588 19578 -13253 -26561 -38080 -91431 -118314 -119907 -125528 -87208
22048 -87208 -41691 -64059 -38470 2552 29803 27351 3351 21574 29281 35245 61626 62912
22036 62912 57043 93189 71796 39094 -16779 -35920 -139 41930 44325 29301 6253 -40580
22024d0580l8705j2488K4273N0287j3629l9867l233j204M4656q3J3714N329k0529
22011c2059J2807N9844M2636k9233m8298k8697Q3j2813J3919O108p6840j3133
21999a05676m780J6763p406Q4748L1903j1897j9627k6954j9161J1217K9090M2343
21987B0563j7298j6818o017K9215J3483j6120N523J9634j525o9348k1526N2228
21975h006L2615j7821L9716M0697k6863k846l4552o1589n9082K9841K0859Q0041
21963C3010L7992p6394m2796j1268K180n4309j5172L7228Q326J8209m69O1186
21951b277J6829l6519j8484n667k0465Q175L8380k5767M7190M3734m584p8017
21939c7472l3205O2394L1801M079m6300j5334l236r18J1462o0594k1326J1404
$$ plain form
22024 -40580 -79285 -91773 -67500 -17213 -30842 -70709 -73942 -75146 -30490 -30573 -16859 -11530 -32059
22011 -32059 -19252 40592 83228 53995 5697 -23000 -22917 -35730 -21811 -15703 -92543 -105676
21999 -105676 -110456 -93693 -101099 -16351 15552 3655 -15972 -42926 -62087 -50870 -21780 20563
21987 20563 3265 -13553 -19570 9645 23128 7008 12531 32165 30640 -38708 -60234 -8006
21975 -8006 24609 6788 46504 87201 60338 57492 22940 -38649 -97731 -67890 -47031 33010
21963 33010 71002 -5392 -48188 -59456 -57276 -111585 -126757 -89529 -81203 -62994 -63463 -2277
21951 -2277 14552 -21967 -40451 -46118 -66583 -58408 -20028 -45795 1395 45129 40545 -37472
21939 -37472 -70677 -8283 23518 27597 -18703 -34037 -37273 -38191 -26729 -87323 -108649 -97245
21927i7245K9440K3610L8363K7991j0151L038K4976n229l5332k7664K4679O611
21915C087j4845k2768r538k63L027l2794l7812k2125L0713K293O5801M9323Q706
21902B2805o0571l5804J6944M7730J5K3557R897L535k8989P005N1834j4953j3912
21889B9093J1119p989n8277q9991j1323N5694M9242K447m4998N03j380k56J3211
21876e2905k6989j9095P7427L6334P580j6874m4221l787j199k8387J0913J1397
21864d9806n135L3622L0846k8713l812j6470j5010q717J8295K3412P2910K1716
21852G3138l6587l3259q1019k3848m2422M8582q942p770M1310P860P1003l6551
21840b8505m0008R562J3567M141m9223M5197M7870j0280K802J5718P8010K764
$$ plain form
21927 -97245 -67805 -44195 -5832 22159 12008 15046 40022 34793 -539 -28203 -3524 3087
21915 3087 -11758 -34526 -44064 -44327 -41300 -74094 -111906 -134031 -103318 -101025 -35224 14099 22805
21902 22805 -37766 -73570 -56626 -8896 -8881 14676 24573 28108 -881 6124 57958 43005 29093
21889 29093 40212 32223 -26054 -116045 -127368 -71674 -22432 -19985 -64983 -64480 -65860 -66116 -52905
21876 -52905 -79894 -98989 -21562 14772 22352 5478 -38743 -42530 -43729 -72116 -61203 -49806
21864 -49806 -54941 -21319 9527 -19186 -22998 -39468 -54478 -63195 -44900 -21488 51422 73138
21852 73138 36551 3292 -77727 -101575 -143997 -95415 -104357 -112127 -70817 -62957 8046 -28505
21840 -28505 -68513 -58951 -45384 -41243 -90466 -45269 2601 -7679 -4877 10841 88851 91615
21828I1615j5662o071p79m3222j5506M1024P7330M016n2941l0568m7805l5519
21816c4088J0876k8527L5898j2775k605L9155j8833m2372j5745L4618N2696M2612
21804F0910J3258l7598m6407K1350P174L6426m981n795L4466m9746r08L1475O0759
21791A20383l3588o9955o864P4341N6839k4382k7290O5688M2193m691J3189N519
21779B11382J0530O1169K0508P8403J19965J19642K08955K66727K36158J88863
21769A522302P1285k6745j24464k16752k36372k15011j79762j73911j15212m7045
21759B58313m0664n2331n7799N7426Q1514n1081q8857l7315J3657l3578j0551
21748C8734l3863k3036Q370m709l8247J8433N7454l0665j5685M1773N077J661
$$ plain form
21828 91615 75953 69882 69103 25881 10375 51399 128729 132745 79804 49236 1431 -34088
21816 -34088 -23212 -51739 -15841 -28616 -31221 7934 -10899 -53271 -69016 -34398 18298 60910
21804 60910 74168 36570 -9837 11513 18687 55113 50132 44337 78803 29057 28149 59624 120383
21791 120383 86795 16840 9976 84317 141156 116774 89484 155172 197365 192674 205863 211382
21779 211382 221912 283081 303589 381992 501957 621599 830554 1097281 1333439 1522302
21769 1522302 1593587 1566842 1442378 1225626 989254 774243 594481 420570 305358 258313
21759 258313 217649 165318 107519 164945 246459 195378 106521 69206 82863 49285 38734
21748 38734 4871 -18165 -9795 -14504 -52751 -34318 23136 -7529 -23214 18559 23636 25297
21736B5297N7905M72l5569j6203m9234k9377K3569o602N22M5829L4336M9724k5432
21723G5237n1444j0920j3289k9100L3245N3172Q990j5323m1088N16J2284l9063
21711a6783K9782N110j4118l652k1028k0736J3056m854m8947j5873J9695P1068
21699g280K5365j7235M946M9420L7311n6942r0436k6207j1338J5782J8075o869
21687f5408P996P787L4736L2991k1635k1183J2179j5661K7933l468p1753k5767
21675a01253K5656N210k0738J7976O6358M3519n8104J3117K7478l9883k4522r360
21663e4546j9740J0483P637k0455M9841L7000J7772k5732M1456n0776m7533J2623
21651d1970K8635K1496j3468N3464J1190m3201l3185M3140M2484L009j6064k3972
$$ plain form
21736 25297 83202 83674 48105 31902 -17332 -46709 -23140 -29742 -29220 16609 50945 100669 75237
21723 75237 23793 12873 -416 -29516 3729 56901 65891 50568 9480 9996 22280 -16783
21711 -16783 12999 18109 3991 339 -20689 -41425 -28369 -33223 -82170 -98043 -78348 -7280
21699 -7280 18085 850 5796 55216 92527 35585 -54851 -81058 -92396 -76614 -58539 -65408
21687 -65408 -57412 -49625 -14889 18102 -3533 -24716 -12537 -28198 -265 -3733 -75486 -101253
21675 -101253 -75597 -70387 -91125 -73149 -6791 36728 -21376 -8259 19219 -20664 -45186 -54546
21663 -54546 -74286 -63803 -56166 -76621 -26780 10220 27992 2260 43716 -7060 -54593 -41970
21651 -41970 -13335 8161 -5307 48157 59347 16146 -17039 26101 68585 71594 55530 31558
21639C1558k715K936j7492m6193k7467L8350L4211l56j5178m034K5470n003m3895
21626b9808J0692q182k4500o09K3758K0488M0107p200k6375k7561J2065k2576
21614c9701K0483K9745N173j3063j6871j2275l560J1308M5601K4548p5986P472
21602a7126P8211J5806M2922L8180n0706j00345J2764K1710J7739R727L531k8343
21590D4070r301J344K0999L1481j2403O32j3689L0614N3458L9559Q1931R9267
21578C67962J22595J67842K67348L08463L20282J92717J2794r0146j92690k61509
21568A215658l06633k66680k50245j00965n0482l4582n9901k2314M1046j9165
21558A45737L3194J202n2275p3907l105K9396J3280m6325L35K2566L2943j8231
$$ plain form
21639 31558 28843 31779 14287 -31906 -59373 -21023 13188 12832 -2346 -6380 19090 14087 -29808
21626 -29808 -19116 -27298 -51798 -52407 -28649 -8161 31946 24746 -1629 -29190 -17125 -39701
21614 -39701 -19218 10527 15700 2637 -14234 -26509 -30069 -18761 26840 51388 -24598 -17126
21602 -17126 61085 76891 119813 157993 107287 6942 19706 41416 59155 68882 72413 44070
21590 44070 34769 36113 57112 88593 76190 76822 63133 93747 147205 186764 268695 367962
21578 367962 490557 658399 925747 1234210 1554492 1747209 1760003 1669857 1477167 1215658
21568 1215658 909025 642345 392100 291135 240653 206071 146170 123856 164902 145737
21558 145737 178931 180133 127858 53951 50846 80242 93522 47197 47532 70098 103041 84810
21546H4810j3647k3243L2010J2467m0090P083L2999l912l7128j8976K9751P4764
21534A36888m0285m0154J1748J6271p966j4176j6491K0540j5470l4233l3423M5476
21522B8725Q9317l3464l9578K787M2285K1015Q593m1839k3247J7489l565r110
21510E9408M248K2765l5727k3240l0711p830j613o995K2180N6434P2607j6710
21498A14816l2032j1181l1776M913J0813k8714l5977K7213O1569M6626k9813r371
21486H7086N1195n8095p4016J8699O281M2003l0610n6157J3500L1175n6931K3000
21474b870L0378K062M2374l0985k1348P5988M3788n0815p3480k8545m8920J3471
21462d8902N8692N4984m1882m1354K8307L9594l971J6366K5898L933r748n890
$$ plain form
21546 84810 71163 47920 79930 92397 52307 59390 92389 88477 51349 32373 62124 136888
21534 136888 96603 56449 68197 84468 76502 62326 45835 66375 50905 16672 -16751 28725
21522 28725 118042 84578 45000 47787 90072 111087 119680 77841 54594 72083 68518 59408
21510 59408 63656 86421 50694 27454 -3257 -11087 -12700 -19695 2485 58919 131526 114816
21498 114816 82784 71603 39827 44740 55553 26839 -9138 18075 79644 126270 96457 87086
21486 87086 138281 80186 6170 24869 31150 73153 42543 -13614 -114 31061 -25870 -2870
21474 -2870 27508 29570 71944 40959 19611 95599 139387 88572 15092 -13453 -62373 -48902
21462 -48902 9790 64774 22892 -18462 9845 49439 45468 61834 87732 91665 81917 76027
21450G6027j6142p634J7280K9245k5827q159o943N099L801l7294M5L4036O7848
21437A31382K832l7166o9358j2882j4163n4220K0389P5245K1814q570k4155l1609
21425d61J263N358K0747Q388p0993l6788J2895P936L1486L4187M5332m7187o7558
21412e5395j7628m268Q4579K8449n363n651k4051J9063L7812n624N4565K5263
21400A31751J9155K5032k3672m3408m3950K2091K8325k7492j4463K0504j5232
21389G8641M808n2956m26o740o071M4521J7000J7647l7063J8135K3J0501j0607
21376G7413P1465k3456m3819J8401l2645L312l5202j2471j1141J9429K5991n3300
21364C977K8463J2908K7449L603J6276N2307K1695o1956l6620m847J9460K3356
$$ plain form
21450 76027 59885 52251 69531 98776 72949 64790 57847 62946 66747 29453 29498 63534 131382
21437 131382 134214 97048 27690 14808 645 -53575 -33186 42059 63873 55303 31148 -461
21425 -461 802 6160 26907 35295 -35698 -72486 -59591 -51655 -20169 14018 59350 12163 -55395
21412 -55395 -73023 -77291 7288 35737 30374 24723 672 19735 57547 51923 106488 131751
21400 131751 150906 175938 152266 108858 64908 86999 115324 87832 73369 93873 78641
21389 78641 83449 30493 30067 23327 17256 61777 78777 96424 59361 77496 77519 88020 77413
21376 77413 148878 125422 81603 100004 67359 70671 35469 22998 11857 31286 57277 3977
21364 3977 32440 45348 72797 76400 92676 144983 166678 104722 68102 63255 82715 106071
21352A06071P3765N7677M1158j7751n3113p382k4381m1011n5985k7502K9989K2583
21340A04118m0411o2025k0015N520K1100N4910K1282K813K6290J8076k4458l3817
21328G3383J528J9481N4437J5391j8922J1295N721m5770p468J9403M8379R728
21316A86586p4720j7618m637M2498L8086J7970p1020j6550M6985J0403l5105o59
21304A22219K6843J3013j9565o1744j415L0639m7415n9077l9513R243P9410K9809
21292H2447k6440j9509k9354l732P5723N5917k920O054R83J0446O4567N415j6079
21279B03518j2920p717M293J2133l3515j2527j920o988n5484l2487J9863O3390
21267A39639L3304l0968R274n8491l4712o746K5537K2706K8559P346o9588k8478
$$ plain form
21352 106071 179836 237513 278671 260920 207807 200425 176044 135033 79048 51546 81535 104118
21340 104118 63707 1682 -18333 -12813 8287 63197 84479 87292 113582 131658 107200 73383
21328 73383 74911 94392 148829 164220 145298 156593 162314 116544 109076 128479 176858 186586
21316 186586 111866 94248 89611 132109 170195 188165 117145 100595 147580 157983 122878 122219
21304 122219 149062 162075 142510 80766 79351 109990 62575 3498 -36015 -26772 52638 82447
21292 82447 56007 36498 7144 3412 79135 135052 132132 138186 139169 149615 214182 219597 203518
21279 203518 190598 182881 187174 199307 165792 153265 151345 144357 88873 56386 76249 139639
21267 139639 172943 141975 151249 92758 58046 51300 76837 99543 128102 135448 65860 37382
21255C7382N4650P3529M6378N8202N0124M7559k13m1335R25n103j2126r642n7556
21242B42774m2931J9036R970K6546J5465M293M872l5592J5500N4011K3733P3737
21230D11414J04053O9710N3850N7839O4430Q1784N6431M2397P0400L2306j30173
21219I14441j33002q6622o0167l4395m6415n547m1503p183n690o0223m8247J8797
21207D04244j0838M7993N2221l510j3650Q0584Q5410M2615N1945M3327p0334k0368
21195F89639k3104n0969m5782R044n01l0859J4292l1874K5761L6632l0524J067
21183E62822M0647M812O6874n078j8080O732n124n303K9257j7296o6752m3044
21171E50467K2802P1634M5422J0624l2143K2987M7689L6978L7616K1299k1669
$$ plain form
21255 37382 92032 165561 211939 270141 320265 367824 367611 326276 327201 322098 309972 300330 242774
21242 242774 199843 218879 228849 255395 270860 275153 280025 244433 259933 313944 337677 411414
21230 411414 515467 585177 639027 696866 761296 843080 899511 941908 1012308 1044614 914441
21219 914441 781439 694817 634650 600255 553840 548293 506790 499607 493917 433694 385447 404244
21207 404244 393406 441399 493620 490110 476460 557044 642454 685069 737014 780341 710007 689639
21195 689639 666535 615566 569784 578828 578327 547468 561760 529886 555647 592279 561755 562822
21183 562822 603469 608281 675155 670077 651997 658729 653605 648302 677559 660263 593511 550467
21171 550467 573269 644903 690325 700949 668806 691793 739482 776460 814076 835375 813706
21160H13706L2464O2303N01K0688K5311N7852Q0577N2508L2815O1812M513M5537
21148A290587M1385N8464J47008O9130P1562J36076N0648J32213K08315K77296
21138B482684L15948L69647L99691L70544L11346J67896P446r5574j92270j33713
21128D003645J2768J04926J56726K02082K49222L22294K60879K69683K99054L95431
21118F276710M51801N02337O51897Q28220R59711J133753J379525J694809K077546
21109A5956309K577822L161122M103125N431337P348847J0241604J4737084K2010430
21101H5567680L3166040M7302516N6517306N2002347L6822491J4691896r495647
21094C16574629l0485750m4340377n1434799m9829647l8497150k6186604j7456612
$$ plain form
21160 813706 846170 908473 908974 929662 954973 1012825 1093402 1145910 1178725 1240537 1245050 1290587
21148 1290587 1331972 1390436 1537444 1606574 1678136 1814212 1864860 1997073 2205388 2482684
21138 2482684 2798632 3168279 3567970 3938514 4249860 4417756 4425202 4329628 4137358 4003645
21128 4003645 4016413 4121339 4278065 4480147 4729369 5051663 5312542 5582225 5881279 6276710
21118 6276710 6728511 7230848 7882745 8710965 9670676 10804429 12183954 13878763 15956309
21109 15956309 18534131 21695253 25798378 31229715 38578562 48820166 63557250 85567680
21101 85567680 118733720 166036236 222553542 274555889 311378380 326070276 316574629
21094 316574629 286088879 241748502 190313703 140484056 101986906 75800302 58343690
21087E8343690j2014923q542518o306703m821078l749247k936751k433721j972143
21079A5566606j700652j431738j203356j043465q80294p20585o19377n38730m57992
21070F970417k75326j79349k10422k89749l32785k71312k27618j40538m0423J6041
21060E018936P0071L8759j0826r6459k41271l99664m95485m59248l84730l19058
21050B721025k49320j51181j30268j32777j16826j02103j09911j30898r9244q5362
21040A413135p1356o9424m3762n6667k1601r6817j16403o5957l1527p682J1230
21029H43169q5081k2849p7887l1561M1932P253j3415m7031J0870J3886r765O364
21017F35885n9809p7396n3065l4293o9046l7938m675n2131l9493j3788M2273J8921
$$ plain form
21087 58343690 46328767 37786249 31479546 26658468 22909221 19972470 17538749 15566606
21079 15566606 13865954 12434216 11230860 10187395 9307101 8586516 7967139 7428409 6970417
21070 6970417 6695091 6515742 6305320 6015571 5682786 5411474 5183856 5043318 5002895 5018936
21060 5018936 5089007 5127766 5116940 5020481 4779210 4379546 3884061 3424813 3040083 2721025
21050 2721025 2471705 2320524 2190256 2057479 1940653 1838550 1728639 1597741 1498497 1413135
21040 1413135 1341779 1272355 1228593 1171926 1150325 1053508 937105 871148 839621 831939 843169
21029 843169 758088 735239 657352 625791 667723 674976 661561 614530 625400 639286 629521 635885
21017 635885 576076 498680 445615 411322 342276 304338 299663 247532 208039 194251 236524 255445
21005B55445k1395L9936J8714Q1j896p1828o7667M0098j4298l9763j9925Q754
20993A26256l4573l7160J7837K5955M5374k1242j8388j0545l706l281Q7J540J3120
20980A01274o3665O5583L4795m5161p0802n7576k9484j22126r2031o4689p3798
20969d17680J1378M1249P0464L5472P8893J02501L2400O8227M1639k4222m8027
20958g706k995O5320K9055k3742k9618J4848l461m5441q4750L282l615k4611R488
20945a03946k6700q019O330K5855J4665L4884K7054N5579Q8791J1519o599o5190
20933E4223j4806J4448l282K3689K9002L8454L4867J9243k8298J3493J3976l6102
20921A58907o6343O654k3570J948j2055j0370J3393L9953k4846j9255j152k1090
$$ plain form
21005 255445 234050 273986 292700 292781 290885 219057 151390 191488 177190 137427 117502 126256
20993 126256 91683 54523 72360 98315 143689 122447 104059 93514 89808 86527 86614 88154 101274
20980 101274 37609 103192 137987 92826 22024 -35552 -65036 -187162 -279193 -343882 -417680
20969 -417680 -406302 -365053 -294589 -259117 -180224 -77723 -45323 22904 64543 40321 -7706
20958 -7706 -10701 54619 83674 59932 30314 45162 41701 -3740 -88490 -85208 -88823 -113434 -103946
20945 -103946 -130646 -138665 -132335 -106480 -91815 -56931 -29877 25702 114493 126012 119413 54223
20933 54223 39417 53865 50583 74272 103274 141728 176595 195838 167540 181033 195009 158907
20921 158907 92564 99218 75648 77596 65541 55171 68564 108517 83671 64416 63264 42174
20909D2174n1996n126N5729L6220M3587l801j5492K689k1996l0653O095j166k4572
20896C1692l283L3355n1508p767N2396L8314M5466k6722K552J2917K1101j9840
20884A28673n991j6351j3099k5154j1501L1210P0565R697J528r598L6191k7888
20872A68282k101j7696M296P267k1770j72j9768m0446k2053o555l2072O3540P2040
20859A52792K0389L4926l3763O7822J7271n769Q761L7573P7019p502l7027N9714
20847C92206J26546J01320J1308J2795J02334J58491K19982K69422L15000N29217
20837B238621Q37782J188992J979643K656118K257373Q26600j72577n81270j299422
20828I931860k224289k236658j588029j010274o98590m14322l08594j91593j66871
$$ plain form
20909 42174 -9822 -14948 40781 77001 120588 116787 101295 103984 81988 51335 57430 56264 31692
20896 31692 28409 61764 10256 2489 54885 93199 138665 111943 114495 127412 148513 128673
20884 128673 122682 106331 93232 68078 56577 87787 158352 168049 169577 159979 196170 168282
20872 168282 166181 148485 152781 160048 138278 138106 118338 77892 55839 49284 17212 80752 152792
20859 152792 173181 208107 174344 242166 259437 253668 262429 300002 377021 369519 332492 392206
20847 392206 518752 620072 631380 644175 746509 905000 1124982 1394404 1709404 2238621
20837 2238621 3076403 4265395 6245038 8901156 11158529 11985129 11812552 11231282 9931860
20828 9931860 7707571 5470913 3882884 2872610 2174020 1759698 1451104 1259511 1092640
20819A092640j39533j50341j38629o4408n4066p8428m6960o2742m7682l2919m7306
20808B29626m7781o789o1119l9870j2672P8767j0454j3573L5675j3199K5825K4798
20796A89234k5451q7855M7834O1445l9319n9183n5105L589l1223L2591M0867M864
20784H2288K6732J0354k3526k5259K1238j001n8787k3676l867k5466J6215M67
20772d288m6253L9023Q8102J923k2155k2660P243o350m4336J5565N2116L1721
20760H9651K0966k1622n4726l1633k5261r741K6584q866o498K5815N0598r543
20748D5724J7795J8862j6109l1762L4591m6492l1438q183K8809K3959n4936j131
20736b0311K3711n0683r756O218L1987M0141k9776J8234m029n6616P253J7554
$$ plain form
20819 1092640 953107 802766 664137 599729 545663 467235 420275 357533 309851 276932 229626
20808 229626 181845 175056 113937 74067 61395 140162 129708 116135 151810 138611 164436 189234
20796 189234 163783 75928 123762 185207 145888 86705 31600 35189 3966 36557 77424 82288
20784 82288 109020 119374 95848 70589 91827 90826 32039 8363 4496 -20970 -4755 -4288
20772 -4288 -50541 -11518 76584 78507 56352 33692 40935 34585 -9751 5814 57930 89651
20760 89651 110617 88995 34269 2636 -22625 -32366 -5782 -14648 -21146 4669 55267 45724
20748 45724 63519 82381 66272 34510 69101 22609 -8829 -17012 11797 35756 -19180 -20311
20736 -20311 3400 -47283 -57039 -50821 -18834 21307 -8469 9765 5736 -50880 -43627 -26073
20724b6073n6774j0491k4266p481Q794K3270j2392k2625L5557K9361l55n700j8350
20711h7525J5902M6156K9308k6781L663l4472o0334j3799L8586M6282J0921j6548
20699d8641j7137m986K208L4760j753J3521J1425K7564l7034m3575J6686M4691
20687b271l7102M8798J3395l7698l247j4621n973K151m0657l6279L5043J1963
20675f6498M329K5787m183L8023M8063n4909m3806M5380L0498o392M0983k4147
20663C3128k7744p3208k7836n550M448L0825N5861l3086p797k2744L9032L1461
20651c210l2278M2701K9698l633m7547j05906M204P5816N4907p669m6603j2305
20639e1825Q342j2112m5175l6319M2147J7241k168l62K1923n723r036K3531K2324
$$ plain form
20724 -26073 -82847 -93338 -117604 -125085 -116291 -93021 -105413 -128038 -92481 -63120 -63475 -69175 -87525
20711 -87525 -71623 -25467 3841 -22940 -19277 -53749 -114083 -127882 -89296 -43014 -32093 -48641
20699 -48641 -65778 -70764 -68556 -33796 -35549 -22028 -10603 16961 -20073 -63648 -46962 -2271
20687 -2271 -39373 9425 22820 -14878 -18125 -32746 -38719 -36568 -77225 -113504 -78461 -66498
20675 -66498 -62169 -36382 -40565 -2542 45521 -9388 -53194 -7814 22684 16292 57275 33128
20663 33128 5384 -67824 -95660 -101210 -96762 -65937 -10076 -43162 -50959 -73703 -34671 -3210
20651 -3210 -35488 7213 36911 33278 -14269 -120175 -115971 -40155 14752 7083 -39520 -51825
20639 -51825 -43483 -55595 -100770 -137089 -94942 -77701 -79869 -80231 -58308 -64031 -73067 -49536 -27212
20626b7212K2886p875q5132n0474K1701M0731q056O0918M052L5420k7772n7122
20614g7935K3703J4931R019j7956K9538p1454p8518P7314N708K7993P9113r084
20602A2372l5899J6080J4393J7477M365j9409k0724j1028k937L8594O3678k6598
20590E0364j9454j6451k0519q6692K870L7560N0777m9131m0797k8048L8146M5457
20578c5918P3206j3398o8003J0436q310l5763M3182K5439n626K2464M3818M47
20566E1974o7392k0724R35k4358n742N9998K2285m0408k7023q012L194Q789M383
20553d2101n4183N500R843O8099Q77Q414J0935O8195L6328k7030l9386J7472L6429
20540I9392J633n8311m6048l5944J5810r198j402M8510K7206j9846r084L057K8196
$$ plain form
20626 -27212 -4326 -12201 -97333 -147807 -126106 -85375 -93431 -32513 -28461 6959 -20813 -77935
20614 -77935 -54232 -39301 -30282 -48238 -18700 -90154 -168672 -91358 -85650 -57657 21456 12372
20602 12372 -23527 -7447 6946 24423 28788 9379 -11345 -22373 -25310 13284 76962 50364
20590 50364 30910 14459 -6060 -92752 -89882 -52322 -1545 -50676 -91473 -119521 -81375 -35918
20578 -35918 37288 23890 -44113 -33677 -41987 -77750 -34568 -9129 -14755 7709 51527 51974
20566 51974 -15418 -36142 -35207 -59565 -65307 -5309 16976 -23432 -50455 -58467 -55273 -46484 -42101
20553 -42101 -96284 -90784 -80941 -12842 -11965 -3551 7384 75579 111907 84877 45491 62963 99392
20540 99392 101025 42714 -3334 -39278 -23468 -32666 -34068 14442 41648 21802 12718 15775 43971
20527D3971j8359q438n4958l8316Q963k5j8572L9249L4151k561m6025l2833j262
20514i5015J575l1280J6846P6247J3951k0078O160l4410j0601j7314m458K314
20502i6063K9883J9900P966l3664O848O142k4368K4271L8906Q506n714K6384n0109
20489d1112K2432k3775j5386O5628L1202k3500K996l347k7762L907L212l577m8589
20476e7671J8892N7727L1237P1009Q170L027o5051o1521J1685L5517k200k65R157
20463E9713l7000l2837k585j3966K7621j2319j3339o690Q129k984j3524o570k5281
20450g1632k0274Q2550M2824M6651R592r0813L123M6674k0968k7216j2947K42
20438a2194n055p448M6233Q8993J4138l4348k7383M5793k1526m3692P1048M6067
$$ plain form
20527 43971 25612 17174 -37784 -76100 -67137 -67162 -85734 -46485 -12334 -14895 -60920 -93753 -95015
20514 -95015 -93440 -124720 -107874 -31627 -17676 -37754 -31594 -66004 -76605 -93919 -98377 -96063
20502 -96063 -66180 -46280 -38314 -71978 -65130 -58988 -83356 -59085 -20179 -11673 -17387 8997 -41112
20489 -41112 -18680 -42455 -57841 7787 38989 15489 18485 15138 -12624 -8717 -5505 -9082 -57671
20476 -57671 -38779 18948 50185 121194 129364 132391 67340 5819 17504 53021 50821 50556 59713
20463 59713 22713 -10124 -12709 -26675 946 -11373 -24712 -31402 -23273 -26257 -39781 -46351 -71632
20450 -71632 -91906 -9356 33468 80119 89711 -1102 2021 48695 27727 511 -12436 -12194
20438 -12194 -17249 -24697 21536 110529 124667 90319 62936 108729 87203 43511 114559 160626
20426A60626N127R953M8438L2905M4132P0935J07916R2466K32354K58404K57270
20415A320526J23942K1982n190j07762j45943k08521k50162k18016j24524l2043
20405C74289J5050q8882p4417m1659n3725n4794m507k0334K1659j5599l5079k1954
20393D8O3718j4564n0008M6548j7675r854j0658J3414L3236q426O019k7116j766
20380B2916k9028M1347j7683k3423L4596l5219m8930L1191K8500k8233k2407J2369
20368c4004k159J0830L1027o8275j4170L1250M5346K246k5112L0392K881K89o147
20355D394l3043K9732L0681K347J6598l1232j4605l8923l9067L6459Q1280J5159
20343E9780k0386l4484k0148k081K3437j4231J7924J1210L4922n703M6522n2386
$$ plain form
20426 160626 165753 175706 224144 257049 301181 372116 480032 572498 804852 1063256 1320526
20415 1320526 1444468 1466450 1461260 1353498 1207555 999034 748872 530856 406332 374289
20405 374289 389339 300457 226040 184381 130656 75862 71355 51021 72680 57081 22002 48
20393 48 63766 49202 -806 45742 28067 18213 7555 20969 54205 45779 51798 24682 22916
20380 22916 -6112 35235 17552 -5871 28725 -6494 -55424 -24233 4267 -23966 -46373 -34004
20368 -34004 -36163 -25333 5694 -62581 -76751 -45501 -155 2091 -23021 7371 10252 10541 4394
20355 4394 -28649 1083 31764 34111 50709 19477 4872 -34051 -73118 -36659 44621 59780
20343 59780 39394 4910 -15238 -17319 6118 -8113 9811 21021 55943 50240 96762 44376
20331D4376m3971n2004N77N0790Q94N955j3617k1873k9406M7466L6605K0007K9117
20318G4916M8305J9886m5497j7147l372m5072k0300M7M7580k1881m415R242k8984
20305A3308l234K6985P3028K4681m5397j1022r4497j0413N4273M1082K2573l9111
20293E2256l5249m045j2115P148N8802N840j6710l3691p4737m2572J5402K3716
20281e5955J7915J4874l3952l0212J5384j4317K0280J4607l1885L7726J6550l5197
20269f4182J3j8457K2211M2209J410n0211l1115j522N5528L4157J154k6517K0401
20256a4921N4444K8783P872l5131L471l3478k1035N7224N1581J4918o6839q9049
20244d2160M3954L3748k1726k900n1226N366L2802O9816N9465J5097J8985N1210
$$ plain form
20331 44376 405 -51599 -51022 -232 662 6617 -7000 -28873 -58279 -10813 25792 45799 74916
20318 74916 123221 143107 97610 80463 77091 32019 11719 11766 59346 37465 33050 42292 13308
20305 13308 10074 37059 110087 134768 89371 78349 -16148 -26561 27712 68794 91367 52256
20293 52256 17007 12962 847 7995 66797 72637 55927 22236 -52501 -95073 -79671 -55955
20281 -55955 -38040 -23166 -57118 -87330 -71946 -86263 -65983 -51376 -83261 -45535 -28985 -64182
20269 -64182 -64169 -82626 -60415 -18206 -16796 -67007 -98122 -99644 -44116 -9959 -8805 -35322 -14921
20256 -14921 39523 68306 76178 41047 44518 11040 -9995 47229 98810 113728 46889 -42160
20244 -42160 1794 35542 13816 10916 -40310 -34944 -2142 67674 127139 142236 161221 212431
20232B12431N9013J38873J63847K63575K23283J63414J95267Q0653k0166r8520
20222A381670j75710k18546k17537k13031j26852j03034p2179r7385k2821p51
20212A33824K670K0865l7666R324l8581k3653k1589r484M1891k3830k6944k1886
20200D941p310n315L5482j6171n1062J1152N0611K9702k7738P01M232n4945k3954
20187d9674j6943L2516J4839M153R874L0130o1104n9145J9198J7736j2908K174
20175f9154N8675N2172N4958l0832p0878K6578L8915K8835k5032k2825o7050J434
20163b4204M2832l594o0776j2514L6959K0343K2571O9284M6827N21j12731q2293
20151e6775m867O5486M6066L1184P091n8560k6305j4038K6136m1390n9051q209
$$ plain form
20232 212431 271444 410317 574164 837739 1061022 1224436 1419703 1500356 1480190 1381670
20222 1381670 1205960 987414 769877 556846 429994 326960 254781 157396 134575 133824
20212 133824 136494 157359 119693 129017 90436 66783 45194 35710 77601 53771 26827 4941
20200 4941 -2369 -7684 27798 11627 -39435 -28283 22328 52030 24292 24993 29225 -25720 -49674
20187 -49674 -66617 -34101 -19262 -15109 -5235 24895 -36209 -95354 -76156 -58420 -71328 -69154
20175 -69154 -10479 41693 96651 65819 -5059 21519 60434 89269 64237 41412 -25638 -24204
20163 -24204 18628 15034 -45742 -58256 -21297 -954 21617 90901 137728 138249 25518 -56775
20151 -56775 -61642 3844 49910 81094 88185 29625 3320 -10718 15418 -25972 -85023 -93232
20139i3232M4126L2155k1257L301L5776O5995K9993l3658n4711l9131j7959J832
20127d6770N916j1962l1513j3098K0123M1189K3099J1420n06k2160m2273l8826
20115a05361o097J6292j1256J0370K1979j3961j4643M2151K9797j0170l2511n5243
20103a28653n4194L4354K1734M8339M8393N7284k2536R58k3389l4793l1818l738
20091h8059n238n073M5499K4467L3674k7077o0318L8402K8001l4506M0966N3132
20079D3870J6450k1412l834K9756k9875O04L9495k3979k4998Q714l7300M3497
20067D0988M4435J020j6018k5120n2906m2777K4394L4710l3865K6983o1213m6532
20055a05901M1467J2129M3827M4105l2991m1227k3442j7310K4974M0407O2829
$$ plain form
20139 -93232 -49106 -16951 -38208 -34907 869 66864 96857 63199 8488 -30643 -48602 -46770
20127 -46770 -40854 -52816 -84329 -97427 -77304 -36115 -13016 -1596 -2102 -24262 -66535 -105361
20115 -105361 -111458 -95166 -106422 -96052 -74073 -88034 -102677 -60526 -30729 -40899 -73410 -128653
20103 -128653 -182847 -148493 -126759 -78420 -30027 27257 4721 5679 -17710 -52503 -84321 -88059
20091 -88059 -93297 -98370 -52871 -28404 5270 -21807 -82125 -43723 -15722 -50228 -9262 43870
20079 43870 60320 38908 35074 64830 34955 35559 75054 51075 26077 34791 -2509 40988
20067 40988 85423 86443 70425 45305 -7601 -50378 -25984 8726 -25139 1844 -59369 -105901
20055 -105901 -64434 -52305 -8478 35627 2636 -38591 -62033 -79343 -54369 -13962 48867
20044D8867R1960n6034n6017L7394M9603M2340r8501j00910j796N3465N0179k3063
20032C7487q470R820O518L7614K8285j4041o6410l1357K8401o128n9549l567N4224
20019A2827k0437p99p867k8768m2075M7122m501n045M6399K9639O2829O448m4277
20006E1495l882n8950j9254l6453M7787K518j7075K0742K4438m0484q016J0228
19994b6906M2313Q976j6863P4697j3534r9687M125K6180J3081M015J3354J1796
19982D1547l225N5646J5792o2781k0655o651k271L6012r5096j4243K7652L5008
19970F735J6308l2320N014l3491j8190K4291J2783K7406K9969K5672J0941M1137
19958A16255O4863l0822k4788q127M2169l6077n8752K2181K605k7219J5404P9258
$$ plain form
20044 48867 140827 84793 28776 66170 115773 158113 59612 -41298 -43094 10371 60550 37487
20032 37487 29017 38837 45355 82969 111254 97213 30803 -554 27847 21719 -37830 -41397 12827
20019 12827 -7610 -8409 -16276 -45044 -87119 -39997 -44498 -49543 -3144 26495 89324 95772 51495
20006 51495 47613 -11337 -30591 -67044 -19257 -16739 -33814 -13072 11366 -29118 -37134 -26906
19994 -26906 15407 24383 7520 82217 68683 -31004 -26879 -699 12382 16397 29751 41547
19982 41547 38322 93968 109760 46979 26324 19673 17402 53414 -41682 -55925 -28273 6735
19970 6735 23043 -9277 -4263 -37754 -55944 -31653 -18870 8536 38505 64177 75118 116255
19958 116255 181118 150296 125508 117381 159550 123473 64721 86902 89507 62288 77692 156950
19946A56950Q7060R87k0519K8872N0598j132l3017k7012k4972q482K0668K3543
19934B53544O692L6342J5027P5185L6231l177K224p1870q3088l6591j1555m2343
19922A76621L288J5427L1334R297k0202j4473N494m7298k6906l080K3256q295
19910A44463m0378k7239k1430r310n5640m1885L5526L016L2383J0337o615M616
19898B7844m4544l5568l4888O862L506P0918J8863o1747j0845l1871l1825m2483
19886a65778k1518N3214M3351O630l1259L3600N0231r217o5819k1550N2249R7199
19874B1333N5196J8587M9153l4656l8452K404k3083k7912k873J6664N8728L4194
19862A29283m0618l6534J1986l1854l4143q94K5585l8079j2348K3963K6098R098
$$ plain form
19946 156950 244010 244997 224478 253350 303948 302816 269799 242787 217815 209333 230001 253544
19934 253544 260236 296578 311605 386790 423021 419844 422068 350198 267110 230519 218964 176621
19922 176621 179909 195336 226670 235967 215765 201292 206786 159488 132582 129502 152758 144463
19910 144463 104085 76846 55416 46106 -9534 -51419 -15893 -12877 19506 29843 23228 27844
19898 27844 -16700 -52268 -87156 -80294 -76788 -5870 12993 -48754 -59599 -91470 -123295 -165778
19886 -165778 -187296 -134082 -90731 -84101 -115360 -81760 -31529 -40746 -106565 -128115 -75866 21333
19874 21333 76529 95116 144269 109613 71161 73565 50482 22570 19697 36361 95089 129283
19862 129283 88665 52131 64117 32263 -1880 -2774 22811 -15268 -27616 -3653 22445 31543
19850C1543j3680K2747Q620k0206k1913M7943L313J4561l968J7658L0739k3276
19838I4081q6942l4497L1392N0405N0456N2814L1350J24n17n0500J8516N9243
19826B15925K4136m611n663k5597k0114l2618k9794j0320j6673M2235K9750j6099
19814A50557J0356L9943q689j0301Q459R0303K14478K04706K47063K61740K56128
19803A464743J29013L27p8499j85069k37374k80061k71113j99927r8522k5931
19793B17587k7730M18k8967k5640j3565q685j968L035m6882n1072j813P4304M2364
19780A31386l535j8484J7495l002q448K6018O818N1771m5005o2353p0274k3199
19768h12J9200j0242j869R349J0905J2976n210N7783N1354J915o816n2522J0140
$$ plain form
19850 31543 17863 40610 49230 29024 7111 55054 58367 72928 68960 86618 117357 94081
19838 94081 7139 -27358 4034 54439 104895 157709 189059 189183 188666 138166 156682 215925
19826 215925 240061 235450 229787 204190 184076 151458 121664 111344 94671 136906 166656 150557
19814 150557 160913 200856 192167 181866 190325 280628 495106 699812 946875 1208615 1464743
19803 1464743 1593756 1594083 1515584 1330515 1093141 813080 541967 342040 243518 217587
19793 217587 189857 190275 161308 135668 122103 113418 111450 114485 67603 16531 14718 89022 131386
19780 131386 127851 109367 126862 123860 115412 141430 148248 200019 155014 92661 22387 -812
19768 -812 18388 8146 6277 15626 26531 39507 34297 92080 143434 145349 138533 86011 96151
19755I6151N3979M928K1942J9847j3422j6022p2470k2560j518j743L5376j5809
19743H8679M130J780M6364L7750k3130k9391p797m2721j4820j1941L6534O0611
19731A46048r207M0022L2144L0812L9923M7265N9390J1026k2569o0948m2516M6478
19719C17868K7212J2683j4929o1506m9084j4058J3204J1708K5223N7798K9790
19708C55909M2186J0343L6387k259Q8286M1860J07807J08305N6608Q6318J1417
19697I43167n6300l6660j03968j43986p4122M220k9095K2514k9638Q092J8866
19686E23090O093j711K8791L165m8647m5132q1030k7965j3577N5368K1987j4299
19674D06133O132J8032j1640j9244m9114k7913M0784O0979K1931k1030M6799M7466
$$ plain form
19755 96151 150130 155058 177000 196847 183425 167403 94933 72373 70855 69112 104488 88679
19743 88679 92809 94589 140953 178703 155573 126182 118385 75664 60844 48903 85437 146048
19731 146048 136841 176863 209007 239819 279742 327007 386397 397423 374854 313906 271390 317868
19719 317868 345080 357763 342834 281328 232244 218186 231390 243098 268321 326119 355909
19708 355909 398095 408438 444825 442566 530852 572712 680519 788824 845432 931750 943167
19697 943167 886867 850207 746239 602253 528131 532351 503256 525770 496132 504224 523090
19686 523090 529183 527472 556263 559428 510781 465649 384619 356654 343077 398445 420432 406133
19674 406133 412265 430297 418657 399413 350299 322386 363170 424149 446080 425050 471849 519315
19662E19315l7643l3889l7058J3921K3167L9963K7311L0557N3903j3110k8474
19651E57963m0266k7407K5488K6697N0363K7649Q375j4482p024j6436M9446P4005
19639G14371L7992j1116k7337N1027L2450J9026Q907q103K9985M2849K9130R2191
19627A011372P9272J10769J15298J28464J94477J51438R9256P1265K4245J0497
19617A996353m5681K1324N0563J16416J15874J65136P1086L5095K6504K4438Q2897
19606B660005J11442J18025J51076K47276K92936L45720M57048O72557P08412
19597E764497O50645O58124N85936N51317N87926M94111M68735O17210Q92676
19588A1271177J139162J464985J854275K372171L066748L989718N329848P328438
$$ plain form
19662 519315 481672 447783 410725 424646 447813 487776 515087 545644 599547 586437 557963
19651 557963 517697 490290 515778 542475 592838 620487 628862 614380 607356 590920 640366 714371
19639 714371 752363 741247 713910 764937 797387 816413 825320 817217 847202 890051 919181 1011372
19627 1011372 1090644 1201413 1316711 1445175 1639652 1791090 1890346 1961611 1985856 1996353
19617 1996353 1950672 1971996 2022559 2138975 2254849 2419985 2491071 2526166 2552670 2577108 2660005
19606 2660005 2771447 2889472 3040548 3287824 3580760 3926480 4383528 5056085 5764497
19597 5764497 6415142 7073266 7659202 8210519 8798445 9292556 9761291 10378501 11271177
19588 11271177 12410339 13875324 15729599 18101770 21168518 25158236 30488084 37816522
19580C7816522J0415774J5198959K2965895L4882567M9074890N6467550M9382894
19573B76205051L1341427P902386j4621854l3498692m6370205n1652386m6314537
19566A22991190l3850005k2521567j5004025j0353211p378698n500478m113585
19559B4269621l255690k618059k072090j618946j259647j013270q73185p47332
19551A0811402o07512n29206o34269o02384o10423o17957o12884o03307n70313
19542E423147m40318l63084l15476k95742k50059j95696j52554q3795j2757j6794
19532C296872r4108p7950j23615k53556k40868j49519r7194l4980K1824j0771
19522B236135p8597j27471j30289j47113j68056j77261q2993j28144p5711q991
$$ plain form
19580 37816522 48232296 63431255 86397150 121279717 170354607 226822157 276205051
19573 276205051 307546478 315448864 300827010 267328318 220958113 169305727 122991190
19566 122991190 89141185 66619618 51615593 41262382 33883684 28383206 24269621
19559 24269621 21013931 18395872 16323782 14704836 13445189 12431919 11558734 10811402
19551 10811402 10203890 9674684 9040415 8438031 7827608 7209651 6596767 5993460 5423147
19542 5423147 4982829 4619745 4304269 4008527 3758468 3562772 3410218 3326423 3313666 3296872
19532 3296872 3202764 3124814 3001199 2747643 2506775 2357256 2260062 2225082 2246906 2236135
19522 2236135 2157538 2030067 1899778 1752665 1584609 1407348 1324355 1196211 1120500 1111509
19512A111509p5759o4678n0914n3679o3591k2055m8571o3368l607j5876m7060
19501F02351p394k9010K4711J7366r0777n5082m9128k8410l4827L5881N37p5082
19489C11136j9537L8830J36R700J0238o5443P53K6396k9916j9922J0742m0732
19477B32381j0614Q0466O331m4085P648K9136l7793o3539j7037l1659j174J592
19465A51653K2305L8144J1703l9261j9607j0453l426k1919o5864j7603K1109l2757
19453C4024p602j4199l5478n4468m5179o3656j40551o7826P215K5530rN0691P1372
19440b40136N6150K1193M7542J1868O7216K3094O791K165J0915k623l3901N727
19428b3999J5058l1475P39K1763j1951m347J7510n9537o4555r5279j5891P1929
$$ plain form
19512 1111509 1035750 971072 920158 866479 802888 780833 732262 668894 665287 649411 602351
19501 602351 594957 565947 590658 608024 517247 462165 413037 384627 349800 385681 386218 311136
19489 311136 291599 330429 330565 340265 350503 285060 285813 312209 282293 262371 273113 232381
19477 232381 221767 302233 308564 264479 272127 301263 263470 199931 182894 151235 150061 151653
19465 151653 173958 212102 223805 184544 164937 154484 151058 129139 63275 45672 66781 34024
19453 34024 26422 12223 -23255 -77723 -122902 -186558 -327109 -394935 -387720 -362190 -362199 -311508 -240136
19440 -240136 -183986 -162793 -115251 -103383 -36167 -13073 -6282 -4117 6798 4175 -29726 -23999
19428 -23999 -8941 -40416 -39677 -17914 -29865 -34212 -16702 -76239 -140794 -236073 -251964 -180035
19416a80035J17795P2107O7093M3330K0852K0864p741J6274O793l3032n4082m97
19404H9721l3204K288P532K5581M9571o689l9527J892K804J9558q123l3377m1825
19391C6202O005P683j8612J8779P095m9835N779K4533j6432J5081N8254j6692
19379G7840K783j562o2256m5553J0486O0465N5519n2818k3165K7452o355L450
19367D6286o1857L658K9890o2086j701K9517N750k1225J018K4788q3747k0608
19355a10317J9611K8094P831O9565M0168K0882k1274l4826j2125o410q855m780
19343a2436k0593k5606q341K6240r46J3761P9408n786m0157M436j7734R167L6370
19330C7783J8884k2218l3752m7414k386m7399j58M1513j4933j2661K7012J01252
$$ plain form
19416 -180035 -62240 9867 76960 120290 141142 162006 154265 170539 177332 144300 90218 89721
19404 89721 56517 58805 66337 91918 141489 134800 95273 97165 99969 119527 111404 78027 36202
19391 36202 42207 49890 31278 50057 57152 7317 13096 37629 21197 36278 94532 77840
19379 77840 80623 79061 16805 -28748 -18262 42203 97722 44904 21739 49191 42836 46286
19367 46286 -15571 -11913 17977 -44109 -45810 -16293 -10543 -31768 -30750 -5962 -89709 -110317
19355 -110317 -90706 -62612 -54781 14784 54952 75834 54560 19734 7609 1199 -7656 -12436
19343 -12436 -33029 -58635 -66976 -40736 -41682 -27921 51487 45701 5544 9980 -7754 1413 37783
19330 37783 56667 34449 697 -46717 -49103 -96502 -96660 -55147 -70080 -82741 -55729 45523
19318D5523J6542m1764m1298J2621k0239j7720n4768J1563M8131J8921m0383K4417
19306c8454K9123K3269K4236j4353o8877n20P3575J9223p0664p610l2209Q21J2252
19293e0188K1193k2246K0789P4609N4054r7588n5472O0546K3851l3892l2024J997
19281c4371j4815L7699q681k1656L838J5105L1818K9358j5603r0176p9709M9656
19269i7537L9396J5650P845M8867j615j1357J2279N6172M7034K5529r448k6363
19257A06452L4129k7730k8630k341j4771j5006K0770K2179j3311l0138n985m899
19245D0719K0820l0229j9697p5562l6432N6901N9155M8402L2780N379j4811K3817
19233A11242o521N7467K7074j716O018O1654j7515k8949k180L9939P1448l802
$$ plain form
19318 45523 62065 20301 -20997 -8376 -28615 -46335 -101103 -89540 -41409 -22488 -62871 -38454
19306 -38454 -9331 13938 38174 23821 -45056 -45576 27999 47222 -23442 -31052 -63261 -62440 -50188
19293 -50188 -28995 -51241 -30452 44157 98211 623 -54849 5697 29548 -4344 -36368 -34371
19281 -34371 -49186 -11487 -20168 -41824 -37986 -22881 8937 38295 22692 -67484 -147193 -97537
19269 -97537 -58141 -42491 -34646 14221 12606 1249 13528 69700 116734 142263 132815 106452
19257 106452 140581 112851 84221 81880 67109 52103 72873 95052 81741 51603 45618 40719
19245 40719 61539 31310 11613 -63949 -100381 -43480 15675 64077 96857 102236 87425 111242
19233 111242 104721 162188 189262 187546 193564 255218 237703 208754 206574 246513 317961 314159
19221C14159r4625l6799M754L4731N5220j019J2915k1132M8200K0046k9204L569
19209C10815J814m7132k4906k113K3340k6790k3795m0580l9427l0484m0427k7818
19197C2497l0018N6431K4704Q397J4075k0233j533j1039K8681P0454K8731M997
19185B06144N7846o083j8692K4503N9973L8624N4272L8896o42K5682R8243m3156
19173E35610j7519l2658o89k4418m3552r5554K900J52135Q9926K7765K4231J0242
19161F28419l8281K0573o6803j08378o5713j7104p0902K1772j845l444K8662O3773
19149C90729J5827J5308j0661j01045p7688J0558N481r86m8656r4278q0088k6084
19137a583n134P0802N3938m1443m8422L5704P6551J12782L4744n4981j9510L802
$$ plain form
19221 314159 219534 182735 187489 222220 277440 276421 289336 268204 316404 336450 307246 310815
19209 310815 312629 265497 240591 238478 261818 235028 211233 170653 131226 100742 60315 32497
19197 32497 2479 58910 83614 92011 106086 85853 84320 73281 101962 172416 201147 206144
19185 206144 263990 257907 239215 263718 323691 362315 416587 455483 454841 480523 578766 535610
19173 535610 518091 485433 484744 460326 416774 321220 324120 476255 566181 593946 618177 628419
19161 628419 590138 610711 543908 435530 369817 352713 281811 303583 301738 298294 326956 390729
19149 390729 406556 421864 411203 310158 232470 243028 248509 247523 198867 104589 24501 -1583
19137 -1583 -6717 64085 118023 76580 28158 63862 140413 253195 287939 232958 213448 217250
19125B17250n315q6123j4702K5020J9358l4402q0701k1794K1011P1515J2633m241
19113A19509n7076k5537R2346K2468R5266L1959L6345L7533K5022j9696n8039
19102C00100Q100l2278p5031j7023m4066n4828m6455J6871N2078L2385K2823M5495
19090B08171n9760k4967K0161j870L1729l8211q602J1955K1513J7423P298n8589
19078A26251j6878J3473K591L962P260j3382n1009M749l8741l1982K7692K0500
19066E4486L2952k063J2925P775k5221N226M3409l3570j4153L8512P346p731R284
19053A29177K257N4334M1283n918m8218m2181l2644k1437l9030L7318j3915K385
19041F3411M798o25N1530O1891K71o7232j2676L9328R6763J37923J54320J83313
$$ plain form
19125 217250 211935 125812 111110 136130 155488 121086 40385 18591 39602 111117 123750 119509
19113 119509 62433 36896 129242 151710 246976 278935 315280 352813 377835 358139 300100
19102 300100 308200 275922 200891 183868 139802 84974 38519 55390 107468 139853 162676 208171
19090 208171 148411 123444 143605 141735 173464 135253 126651 138606 160119 177542 184840 126251
19078 126251 109373 122846 125437 129399 136659 123277 72268 77017 38276 6294 33986 54486
19066 54486 87438 85375 98300 106075 80854 86080 129489 95919 81766 120278 127624 119893 129177
19053 129177 131434 185768 227051 221133 172915 130734 98090 76653 37623 74941 61026 63411
19041 63411 68209 67584 119114 181005 181276 114044 101368 140696 237459 375382 529702 713015
19029G13015Q2687K9129J2828n0412j60873j90784j11163o0924j03400n6173j1115
19018I2815m2997M3839J6287m7167J1622o2548o3618k5350J0897J6776j6456J8000
19006d7900M3643J423L2701j8659P826o017j9135k8632k0733L9597L1629N7779
18994G3522l8015m7030k7347J0908M520O6k0149j6039m6341o233N2448j5202J3449
18981f1443J18447o130L766O247k8371l7954M800M8612O4058K2859K9485R2010
18969B56386J8528q0889p6533j3344M9904n1975k6019J3078M068k5472k9795r068
18957B8869k741k702N7178j0277n4663o0073j514l5220K0093J0436K372M7992
18945b50J8543j4538k5360k709K7468R840N1468J0977o1800n396L5892l8455r7275
$$ plain form
19029 713015 795702 824831 837659 787247 626374 435590 324427 263503 160103 103930 92815
19018 92815 49818 93657 109944 62777 74399 11851 -51767 -77117 -66220 -49444 -65900 -47900
19006 -47900 -4257 -2834 29867 11208 19034 13017 -6118 -34750 -55483 -15886 15743 73522
18994 73522 35507 -11523 -38870 -27962 -23442 -23376 -43525 -59564 -105905 -112138 -59690 -74892 -61443
18981 -61443 57004 50874 54640 60887 32516 -5438 -638 47974 112032 134891 164376 256386
18969 256386 274914 194025 117492 104148 154052 102077 76058 89136 93204 67732 37937 28869
18957 28869 26128 23426 80604 70327 15664 -44409 -45923 -81143 -61050 -50614 -48242 -250
18945 -250 18293 3755 -21605 -24314 3154 12994 64462 75439 13639 8243 44135 5680 -91595
18932i1595O0463R9961J4736K9621L4068K8316K5326O898j2331L5991R5390Q0459
18920D07303K8151K2482K3750N7176P6801J62134K47815K15860J84871J18094
18910A544437J06802J5333j35106k51528k60662k12287j53925j02320j53892o4623
18900C32229j6166l5431n2521m0375k8496k3141P019o087P311j9908j5714p1602
18888C7118q141o1566l5281M9357L5212n3061l3022J4617N1038M552L0921K6906
18876E8650k041J5509j8782k058l5940l5890L824N1318J1341k3451L9823J8329
18864H0632k2299j3162j9974j3523N0450L3920k4390n2538l5299r973l0810M313
18852e2653K7562k2787m4998L679J7084O9409L1224l1494p307j0020J6763L4695
$$ plain form
18932 -91595 -31132 68829 83565 113186 147254 175570 200896 207794 195463 231454 326844 407303
18920 407303 435454 457936 481686 538862 615663 777797 1025612 1241472 1426343 1544437
18910 1544437 1651239 1666572 1531466 1279938 1019276 806989 653064 550744 396852 332229
18900 332229 316063 280632 228111 187736 159240 136099 143118 137031 144342 124434 108720 37118
18888 37118 28977 -32589 -67870 -18513 16699 -36362 -69384 -54767 -3729 823 31744 58650
18876 58650 56609 72118 53336 51278 15338 -20552 -16728 34590 45931 22480 62303 80632
18864 80632 58333 45171 25197 11674 62124 96044 71654 19116 -16183 -26156 -56966 -52653
18852 -52653 -25091 -47878 -92876 -89197 -72113 -2704 28520 -2974 -10281 -20301 -3538 31157
18840C1157o471q671k608j3473l403l0017O3391L528k017m7227k170N184J8921
18827F124N0701k1692r502N0692M7772N364p2232r7572j3965p125K4859l555K4428
18814a5703P588Q480j7888J8311R0591M17n1746q9690K6515K7014l2657l5246
18802f4014J1385M1941k1874p049N5037Q531l397J1671m0387j8025k7947q730
18790f2858N7383M2111k2227j8414m7064l5126N770L8415J02578j5103K7622k7709
18778D5378q90j4412l0363M470j409J3024m914j7895L843K370L3658q5800j1378
18765f4318L9657P75J5301K6963m2612n9482q717m512K9452N062O211J5565L3872
18752f783k687J1076j0889j6635K449M5806K3442L0156K4039m8206p642l2949
$$ plain form
18840 31157 24686 16015 13407 -66 -3469 -33486 29905 33433 31416 -15811 -17981 -12797 6124
18827 6124 56825 35133 25631 76323 124095 129459 57227 -40345 -54310 -61435 -36576 -40131 -15703
18814 -15703 -8115 365 -17523 788 91379 91796 40050 -49640 -23125 3889 -28768 -64014
18802 -64014 -52629 -10688 -32562 -39611 15426 23957 20560 32231 -8156 -26181 -54128 -62858
18790 -62858 -5475 36636 14409 -4005 -51069 -86195 -80425 -42010 60568 45465 73087 45378
18778 45378 44488 30076 -287 4183 2774 15798 10884 -7011 -3168 -798 32860 -52940 -64318
18765 -64318 -24661 -23886 -8585 18378 -24234 -83716 -92433 -96945 -67493 -62431 -56220 -40655 -6783
18752 -6783 -9470 1606 -9283 -25918 -23469 22337 45779 75935 99974 51768 44126 11177
18740A1177k2776r226p190L0535M3973n2693o7389K4863J6178j9803m4622j0863
18728a07836N1040L1376K9404J4843J9923o2198m7521J0260K9028R64m9307M575
18716g5449J0713O057l905j1388K0522J9009N7896k3020j5024L6304L3185L2174
18704H7074q171M1383M4832k4660o1065K9104M501k6909l5315l8311Q143Q0125
18692A00731k4398J432L9505q200k1036P119q101m3624j1175l9531Q293N7759
18680E8774j9469J3223J1038K1252j0914o5436l7927M1250K6406K3935q638p5008
18668b1514j8073L6695L6695J2332l2564N97O8O546k0027j084o2250N4459M8435
18655D0315l331O204o198n493o749m0105K0373L8261l9323m2796j6922L3258K2252
$$ plain form
18740 11177 -11599 -20825 -28015 2520 46493 -6200 -73589 -48726 -32548 -52351 -96973 -107836
18728 -107836 -56796 -25420 3984 18827 38750 -23448 -70969 -60709 -31681 -30717 -80024 -75449
18716 -75449 -64736 -58679 -62584 -73972 -53450 -34441 23455 435 -14589 21715 54900 87074
18704 87074 78903 120286 165118 140458 79393 108497 112998 86089 50774 12463 20606 100731
18692 100731 76333 77765 117270 109070 88034 95153 87052 43428 32253 -7278 1015 58774
18680 58774 39305 52528 63566 84818 73904 8468 -29459 11791 38197 62132 53494 -21514
18668 -21514 -39587 -2892 33803 46135 13571 14168 14236 20782 755 -329 -62579 -8120 40315
18655 40315 36984 43188 36990 31497 24748 -15357 5016 43277 3954 -38842 -55764 -22506 -254
18642b54j3871k481L2987k5703O029j1929N04L8824l2605L400K3872r75k4584
18629f786l6733J9061J4776L8426k573m1844k5426J0463l0262J0850J1133P3417
18617C4502P1912k9317n878J1262q355J3251k6848o3829o838N1577K6176K9020
18605I6635j6292m8235k773r426L6182k8511m9696m9858M0560k1845k4309J8840
18593e8728r919P5453R3661m3014L0493K5696k8494R224k5300J3858j267J347
18581H3010j6972n6986m2039j5770N2649L2458O8452L426j4838m0586o619k9344
18569A6841o076j0532p320q819J8936r831M174P221M3003J6862k9060N9901m5931
18556D9369r1493k8081L4122O7075J9863K597j3681K4419j3368k9165K7762J6923
$$ plain form
18642 -254 -14125 -16606 16381 -9322 -3293 -15222 -14718 24106 -8499 -5099 18773 17798 -6786
18629 -6786 -43519 -24458 -9682 28744 26171 -15673 -41099 -30636 -60898 -50048 -38915 34502
18617 34502 106414 77097 71219 82481 74126 87377 60529 -3300 -10138 41439 67615 96635
18605 96635 80343 32108 29335 19909 56091 27580 -22116 -71974 -31414 -53259 -77568 -58728
18593 -58728 -68647 6806 100467 57453 87946 113642 85148 94372 69072 82930 81663 83010
18581 83010 66038 9052 -32987 -48757 3892 36350 104802 108228 93390 52804 46185 16841
18569 16841 10765 233 -7087 -15906 3030 -6801 -2627 4594 47597 64459 35399 95300 49369
18556 49369 -42124 -70205 -36083 30992 50855 53452 39771 64190 50822 21657 49419 66342
18544F6342j7506K267J0023j974p808M020j7993m8397L762J4291J1843O6407o670
18531G8607l0705J7193k2394p3208J1016M3466q980k4518L1542J5961K9769j1853
18519E5896m9107p803L5642L8132K7010l6348j7421N3161L2145J0461l5668Q6845
18507A92945R1036M5968O3468M203L9488K1169n9966k8939l631m6471j13788j02876
18495A02606j1175L1977k6601m0865k6172P168k7007J0309N2986l0614k651K7745
18483F7706J5765Q372m5506m7040M5867M1621k5595m765M76J4943J0856k8080
18471E4620R97N1078k1435P2859o58n2697K065p844N1542L9346J3825R860K7828
18458B41386Q4557N9993J11515P8620P2445P6713M8005n6171K7458k0284j15936
$$ plain form
18544 66342 48836 51103 61126 59152 51344 55364 37371 -11026 -7264 7027 18870 85277 78607
18531 78607 47902 65095 42701 -30507 -19491 23975 14995 -9523 22019 37980 67749 55896
18519 55896 6789 -1014 34628 72760 99770 63422 46001 99162 131307 141768 106100 192945
18507 192945 283981 329949 393417 397620 437108 458277 398311 369372 365741 319270 205482 102606
18495 102606 91431 123408 96807 55942 29770 36938 9931 20240 73226 42612 39961 67706
18483 67706 83471 91843 46337 -703 45164 86785 61190 56425 56901 71844 82700 54620
18471 54620 55617 106695 85260 158119 157461 104764 106829 98985 150527 189873 203698 213558 241386
18458 241386 325943 385936 497451 576071 648516 725229 773234 717063 744521 724237 608301
18447F08301p7177r0761j49148o0999j0242o3352k7169j4156J9794n8119j6413
18436F0559O3447K3153j6585p985L2603o262o7629m2124j5171l1903m121J6063
18424D045J033M326J8413J1457L8917K1863M1624N3073K803M3928k6627m7535
18412A67320k2154l1609l1730j016O2071M3539N5688O5148L7452k859m4450j7152
18400B80248J055k958k729o6589r8870K8056Q541l8849M7396L3707n0020j6076
18388A22912k4987J0990m639l5826k8627L8549k3594J4209K7723l2945k5457p2365
18376c4057Q88Q8898J9359n238j7220m9818J4323J1551R601K8996J3784J3482
18364I4549l7487n4223J1537J4411L7324k0666l6645L866K3573J2429J9091k8825
$$ plain form
18447 608301 531124 440363 291215 230216 219974 156622 129453 115297 135091 76972 60559
18436 60559 124006 147159 130574 122589 155192 148930 81301 39177 24006 -7897 -12018 4045
18424 4045 5078 9404 27817 39274 78191 100054 141678 194751 197554 241482 214855 167320
18412 167320 145166 113557 81827 80811 142882 186421 242109 307257 344709 341850 297400 280248
18400 280248 281303 278345 275616 209027 110157 138213 146754 107905 155301 189008 138988 122912
18388 122912 97925 108915 104276 68450 39823 78372 54778 68987 96710 63765 38308 -34057
18376 -34057 -33169 55729 75088 69850 52630 2812 17135 28686 38287 67283 81067 94549
18364 94549 57062 2839 14376 28787 66111 45445 8800 12666 36239 48668 67759 38934
18352C8934L0729j4136k2109k8620J4048N820l783K2190K771Q070J0506L2845
18340I7265l9725p956o137p2026M954N0577Q74m6548j0386K2363L4263M8333J9277
18327I5128o2579j2118l480M7338k5658M4393O3876n5118n2723J8203J5856M2453
18315A15571K2161m2936m788K3273J3507j1657q461M787j1674J9278M2101K4958
18303A86120J4407k7874l9742j3336k061p307k2778K90J5932N700j5262J5619
18291A09708M2468j7652o6583J750M6450L9450j1246l6403n0729p4171N1577J6962
18279E1581R852L5795K5315J1763k5603j0556j97L3937J0518l9477J839R615K4291
18266A38673N0571L5621J4284R6421M0301K9116R4717O265l1979N8487l6875n2988
$$ plain form
18352 38934 69663 55527 33418 4798 18846 24666 20883 43073 45844 53914 64420 97265
18340 97265 57540 49584 43447 -28579 -23625 26952 27826 -18722 -29108 -6745 27518 75851 95128
18327 95128 32549 20431 16951 64289 38631 83024 146900 91782 39059 57262 73118 115571
18315 115571 137732 94796 90008 113281 126788 115131 106670 111457 99783 119061 161162 186120
18303 186120 200527 172653 132911 119575 117514 110207 87429 87719 103651 109351 94089 109708
18291 109708 152176 134524 67941 69691 116141 155591 144345 107942 57213 -16958 34619 51581
18279 51581 61433 97228 122543 134306 108703 98147 97950 131887 142405 102928 104767 114382 138673
18266 138673 189244 224865 239149 335570 375871 404987 499704 505969 473990 532477 495602 442614
18254D42614j0877N1299N4285N1281Q7884J08855Q3014L258m2294j591q8288m9342
18242F90098k8589r6600o6445p4115n1712L1486P6551Q9965k5576k9226j3738
18231E02099r551k3804p8797m7517l8061p7093K6548J4502n4642m9171k1665L5525
18219A78373J6681m9352k1389q077l8727k2036O4854P3086K5718K3368K4168k1052
18207B45615K2946R096k4307j2349j809k5112l6594J4424K1349o9339n4784J5617
18195A04753O6912N6396O4064j0312r807J2838j6139n3385l8977L0354k5679n8945
18183A22073m3903L9175j7771j5291Q068M1400L0695J3658k0565K8498P0100L5261
18171B91398J2479j109k5164k0820Q752n038K001K9064J4669J6270Q7448M8823
$$ plain form
18254 442614 431737 483036 537321 588602 676486 785341 868355 871613 829319 827728 739440 690098
18242 690098 661509 564909 498464 424349 372637 404123 480674 570639 545063 515837 502099
18231 502099 492548 468744 389947 342430 304369 227276 253824 268326 213684 164513 142848 178373
18219 178373 195054 145702 124313 116236 77509 55473 120327 193413 219131 242499 266667 245615
18207 245615 268561 277657 253350 241001 239192 214080 177486 191910 213259 143920 89136 104753
18195 104753 171665 228061 292125 281813 272006 284844 268705 215320 176343 206697 181018 122073
18183 122073 78170 117345 99574 84283 92351 133751 164446 178104 157539 186037 256137 291398
18171 291398 303877 302768 277604 256784 265536 260498 262499 291563 306232 322502 409950 458773
18159D58773K4285Q1872k0789l2324j312L1195L8852m0487r1686r9342j9054j2882
18147C17101L0002k3533J1859N9094J8801k5352o301M2102R333M512n1364O231
18135C92485P295L956l872N5569M8144j03501o1313Q093J5433k037J8721L3369
18123D12342j7531m4552k0288l6789K4385L8026N5K9462N8863L4853M8480R9119
18111F26425R282L8674P0290L3186n552J6149J4481j0977O324O810J6321k7933
18099G93480p325k2741K7954K530m7054K0728J3068K5780R664q673k6793j0139
18087G70479n3779k3448Q907m0620m593L1358P4969N6387j0022l7679l1232M9227
18075G89954j9669q3588o5269m9578o1840o2249M0014L2764m802R16L460j0474
$$ plain form
18159 458773 483058 564930 544141 511817 510505 541700 580552 540065 448379 349037 329983 317101
18147 317101 347103 323570 335429 394523 413324 387972 381671 423773 433106 437618 386254 392485
18135 392485 399780 403736 399864 455433 503577 400076 338763 346856 362289 360252 378973 412342
18123 412342 394811 350259 329971 293182 317567 355593 355648 385110 443973 478826 527306 626425
18111 626425 635707 674381 744671 777857 772305 788454 802935 791958 798282 805092 821413 793480
18099 793480 786155 763414 791368 793898 746844 767572 780640 806420 816084 807411 780618 770479
18087 770479 716700 693252 702159 661539 656946 688304 763273 819660 809638 771959 740727 789954
18075 789954 770285 686697 621428 571850 510010 447761 487775 520539 515737 516653 520113 509639
18063E09639m6970O6706Q2890O0341L4973l786j0648J3990l0245N1492L3200j7672
18051G43910k2293k5959p856M7962M3007P3595k1508j3080L8414Q9374J21610
18040A067176J10496J19025J04501J66388J46880J23555J22063M7394M9170Q7100
18030B143748J14048J61364K27983K28497J66432Q3991Q7277M6005O9612Q1553
18020C410510J13099K11542K77044M49199N81694P86193R90048J340026J932344
18011A0091699K794645L965993N745919Q080383J0021194J0189102Q446877N253842
18003F4589654R81936l545157o941566q770615r528768q640102o580111m630033
17995A6935238l244335k274653j613002j168821q52636o08000l78996k02907p3631
$$ plain form
18063 509639 462669 529375 612265 672606 707579 703793 693145 707135 676890 728382 761582 743910
18051 743910 721617 695658 687802 735764 778771 852366 830858 817778 856192 945566 1067176
18040 1067176 1177672 1296697 1401198 1567586 1714466 1838021 1960084 2007478 2056648 2143748
18030 2143748 2257796 2419160 2647143 2875640 3042072 3126063 3213340 3259345 3328957 3410510
18020 3410510 3523609 3735151 4012195 4461394 5043088 5829281 6819329 8159355 10091699
18011 10091699 12886344 16852337 22598256 30678639 40699833 50888935 59335812 64589654
18003 64589654 65571590 62026433 55084867 46314252 36785484 28145382 21565271 16935238
17995 16935238 13690903 11416250 9803248 8634427 7781791 7173791 6794795 6591888 6518257
17986F518257n2174o8039j51227j62087j96148j03927j0671J08254J90141K92398
17976F364777L94828N47600N70983M58141L21785L16979L25307L15761L89506
17967A0005667O47975R98079J471813J948781K682022L874543N552153P967184
17959C5148217J1504247J6312277K1481293K4145399K2203808J6313032P404955
17952A54513228l361136j2836619j9075008k2063769k1904004j8433099j3634486
17945D3205107r555996o660287m848479l590093k704139k077747j611864j245616
17937A0910886r65981p37300o36860n11937m82350l67381l39300k09274j97303
17928F463200m1735M0611J05784K44425L40834L77947L15692K51630J75765J11282
$$ plain form
17986 6518257 6466083 6398044 6246817 6084730 5888582 5784655 5773984 5882238 6072379 6364777
17976 6364777 6759605 7307205 7878188 8336329 8658114 8975093 9300400 9616161 10005667
17967 10005667 10653642 11651721 13123534 15072315 17754337 21628880 27181033 35148217
17959 35148217 46652464 62964741 84446034 108591433 130795241 147108273 154513228
17952 154513228 151152092 138315473 119240465 97176696 75272692 56839593 43205107
17945 43205107 33649111 26988824 22140345 18550252 15846113 13768366 12156502 10910886
17937 10910886 9944905 9207605 8570745 8058808 7576458 7209077 6869777 6660503 6463200
17928 6463200 6421465 6462076 6567860 6812285 7153119 7531066 7846758 8098388 8274153 8385435
17918H385435J03526J16299K98277M50029P00878J242747J839749K680003L880292
17909A9697235N651597Q286553J1629336J4442191J4774098J2373089P975269
17902I4829368J544099n238764j0336743j3151128j4203476j2976976j0036864
17895C0429516p085299m986546l571433k567268j951287j544432j155668q95206
17887F672377p27157n97685m83133l78947l40951k45721k82487k18419j57218
17878C240659j16993o801k101k173R536j0435n9610p2514q3934j11608j06202
17867B677824j61725j87595k05002k65316k13340o4343j4641j08543j21222l2352
17857A303745j6577j01188m6042J4357m2188r830m5551r4459l4127L61k0049k9469
$$ plain form
17918 8385435 8488961 8605260 8903537 9353566 10054444 11297191 13136940 15816943 19697235
17909 19697235 25348832 33635385 45264721 59706912 74481010 86854099 94829368
17902 94829368 96373467 91134703 80797960 67646832 53443356 40466380 30429516
17895 30429516 23344217 18357671 14786238 12218970 10267683 8723251 7567583 6672377
17887 6672377 5945220 5347535 4864402 4485455 4144504 3898783 3616296 3397877 3240659
17878 3240659 3123666 3116865 3114764 3112591 3122127 3111692 3052082 2979568 2895634 2784026 2677824
17867 2677824 2516099 2328504 2123502 1858186 1644846 1580503 1565862 1457319 1336097 1303745
17857 1303745 1287168 1185980 1139938 1154295 1112107 1102277 1056726 962267 928140 928501 908452 878983
17845H78983K9556M0566j9790j4197j0090M544J5879o932k9427j3344l0162j725
17833H43861o8519n6420j8926q3050P401m2618n7462k3206K5925N907O6597P6406
17821F75896R888k8529J368M2824R1984K5794j4135P203J7133k5091K4261N1146
17809H79742L0306l7305l7961N890N4810L2543J1430q788l3882R506N1973R2867
17797A051131N8454O8609J24466Q5030N3416N4962N3467Q4476N2301K1551O7058
17786A774921Q4150J09610N8511P3648J24569J46555J27586J70662K19985J95987
17776C086184K19619K67760M44494M08280M28489N07499N88620O18114P76660
17767G345719R37704J200763J538653K024372K718763L786091N313233P607079
$$ plain form
17845 878983 908539 949105 929315 915118 905028 909572 925451 918519 889092 875748 845586 843861
17833 843861 775342 718922 699996 616946 624347 581729 524267 501061 526986 532893 599490 675896
17821 675896 685784 657255 658623 701447 793431 819225 805090 812293 829426 804335 828596 879742
17809 879742 910048 872743 834782 840672 895482 928025 939455 930667 896785 906291 958264 1051131
17797 1051131 1109585 1178194 1302660 1387690 1441106 1496068 1549535 1634011 1686312 1707863 1774921
17786 1774921 1859071 1968681 2027192 2100840 2225409 2371964 2499550 2670212 2890197 3086184
17776 3086184 3305803 3573563 4018057 4426337 4854826 5362325 5950945 6569059 7345719
17767 7345719 8283423 9484186 11022839 13047211 15765974 19552065 24865298 32472377
17759C2472377J0126246J1641319J1351094R546660N730522N14176l409520n374021
17751G2598853o268340n570791k169049K930388Q814149J5443624K1205316K2813062
17743A29797212J9824284J3784231M290675o825597j5161010j9208684k0656160
17736A05844951j8806926j3079838o397328j22268N559661R520258R680679P028413
17728I9227602L276180k044944q080004j2191270j3670634j3598510j1949577
17721D0968843r006395o353729m511383l275498k452410j876701j450905j209335
17713A0832487j008038q66791p80270p02754n54291n54789m72112l97262l89164
17704E107016l80559l28738k33700k46429j68939j53504j36784j20708j53870
$$ plain form
17759 32472377 42598623 54239942 65591036 75137696 80868218 81382394 77972874 72598853
17751 72598853 66330513 60759722 58590673 61521061 70335210 85778834 106984150 129797212
17743 129797212 149621496 163405727 167696402 160870805 145709795 126501111 105844951
17736 105844951 87038025 73958187 67560859 67438591 72998252 82518510 92199189 99227602
17728 99227602 102503782 100458838 92378834 80187564 66516930 52918420 40968843
17721 40968843 31962448 25608719 21097336 17821838 15369428 13492727 12041822 10832487
17713 10832487 9824449 8957658 8177388 7474634 6920343 6365554 5893442 5496180 5107016
17704 5107016 4726457 4397719 4164019 3917590 3748651 3595147 3458363 3337655 3183785
17695C183785j36953r9674j10087j21063j18016q2241q8040r5445p3905r3716
17685B164645p8992m3218j7363m2245n8899k7117K421l5589m018N1141j9310J2878
17673A904334O0440l429j2236P610M8371O3532K1031Q1390M2016L5912P1555J52751
17661B473277J92576K16605J65552J89236K43640K67964K75120K64479K72130
17652D560579L45573M62036N53257O51193P78120R89244J308806J755801K361686
17643A3766295L320331M758809O870817R628758J1390662R959813O357622M359647
17635G0412754M217935L817310L317212J917723j008034k692979k860714l732627
17627G3388580m465581k264206N41676O76898j46648O0009N41839L12877k96457
$$ plain form
17695 3183785 3046832 2947158 2837071 2716008 2597992 2515751 2427711 2332266 2258361 2164645
17685 2164645 2085653 2042435 2025072 1982827 1923928 1896811 1899232 1863643 1859625 1910766 1891456 1904334
17673 1904334 1964774 1961345 1949109 1956719 2005090 2068622 2089653 2171043 2213059 2248971 2320526 2473277
17661 2473277 2665853 2882458 3048010 3237246 3480886 3748850 4023970 4288449 4560579
17652 4560579 4906152 5368188 5921445 6572638 7350758 8340002 9648808 11404609 13766295
17643 13766295 17086626 21845435 28716252 38345010 49735672 59695485 66053107 70412754
17635 70412754 74630689 78447999 81765211 83682934 82674900 79981921 77121207 73388580
17627 73388580 68922999 66658793 67200469 67877367 67730719 67790728 68332567 68645444 68348987
17618F8348987k026846m227124n189988o073422p984159r049207p628743n396990
17610B0772508l621888k464172j760935j359534r78943p32401o01609l76776j98163
17601H678087j32440j330J41937L13666M77895P34086J073563J538031K286582
17592A5110077L370857N050199P313150Q986357P815379M732360L040467K853029
17584E8271875K165568J150761K84395j205512k114108k067641k323962k347841
17576E1813535l04098J804837J306189j02987j65939P7045n17394j164512k154245
17567E0592431l509685m045542m605566o106821o932543n840846m222782k906697
17559A2421949k037918j542080j175006r30154p65339o42123m99147l15761l33766
$$ plain form
17618 68348987 66322141 62095017 56905029 50831607 42847448 33798241 26169498 20772508
17610 20772508 17150620 14686448 12925513 11565979 10587036 9854635 9253026 8876250 8678087
17601 8678087 8545647 8544317 8686254 8999920 9477815 10211901 11285464 12823495 15110077
17592 15110077 18480934 23531133 30844283 39830640 47646019 52378379 55418846 58271875
17584 58271875 60437443 61588204 61872599 60667087 58552979 56485338 54161376 51813535
17576 51813535 51509437 53314274 54620463 54517476 54351537 54428582 53911188 52746676 50592431
17567 50592431 47082746 43037204 38431638 32324817 25392274 19551428 15328646 12421949
17559 12421949 10384031 8841951 7666945 6736791 5971452 5329329 4830182 4514421 4180655
17550D180655l49382k93599k48878j80953j92466j88615k07767j75205j41645
17541B202145r0668j12237j52327r4099m5781n3632m2842q7490m9590n2887k4336
17530A396256K3453r558l0936n3128l8166P138j085j17646q5440j8088k7533n4058
17518I91209l4388M542o9832n7752O7857K0832n0264q7994r4047k7607K0857q2429
17506F00984p8176O862j2615o6284k9773l3030j3281L9439K2750j6615L626J5765
17494D39652J3015R4952L148J7516M0555j5719j00370j11969m4573p678o7373
17483B61156n2155R929K3870K4697n0023m8500q367K2374j022L739J4006k1093
17471A78611k2544M1777m0353L832K3742j2087j5137l3797P82k3312N313o725
$$ plain form
17550 4180655 3831273 3537674 3288796 3107843 2915377 2726762 2518995 2343790 2202145
17541 2202145 2111477 1999240 1846913 1752814 1707033 1653401 1610559 1523069 1473479 1420592 1396256
17530 1396256 1419709 1410151 1379215 1326087 1287921 1295059 1293974 1176328 1090888 1072800 1045267 991209
17518 991209 956821 961363 891531 833779 901636 922468 872204 784210 690163 662556 683413 600984
17506 600984 522808 529670 517055 450771 420998 387968 374687 414126 436876 420261 423887 439652
17494 439652 452667 547619 550767 568283 608838 593119 492749 380780 336207 328529 261156
17483 261156 209001 218930 242800 267497 217474 168974 160607 182981 181959 185698 199704 178611
17471 178611 156067 197844 157491 161323 185065 172978 157841 124044 124826 101514 106827 100102
17459A00102L0395N9349j2891n5648k9696k2640J3717K9928O7507M1891N3717
17448B75731J8736L9322Q9502J01323J02953O5478R436j6048l7098k0297o4585
17437E64453j69108m7561n5336l5165J8106j9970j1979L0509m666j2218n031k2775
17425B29259k4747q498K2706K8981J4774K575N596n1540O103k5691k1831l6104
17413A41583M7434j1842l5425J3924P167K974O802K5819P5861j6404l9301O822
17401B25414j9874L1560M9598j4389K7225P0142L7640M8694O0727O0204k6667
17390E50274n3116q9847p1338k7369l3257j2264J7603l0275n5107k7232k0424
17379A47648j3462l1918k0698J0346Q929L9041j910o08N8276j8842j4878n0453
$$ plain form
17459 100102 130497 189846 176955 121307 91611 68971 82688 112616 180123 222014 275731
17448 275731 294467 333789 423291 524614 627567 693045 702481 686433 649335 629038 564453
17437 564453 395345 347784 292448 257283 275389 255419 243440 273949 269283 257065 252034 229259
17425 229259 204512 196014 218720 247701 262475 265050 270646 219106 225209 199518 177687 141583
17413 141583 189017 177175 141750 155674 162841 165815 172617 198436 274297 257893 218592 225414
17401 225414 205540 237100 286698 272309 299534 369676 407316 456010 516737 576941 550274
17390 550274 497158 407311 335973 308604 275347 263083 280686 250411 195304 168072 147648
17379 147648 134186 102268 81570 91916 100845 139886 137976 137368 195644 176802 161924 111471
17367A11471l004J1276J0246n466j2630L7348K791k2914l4770L3101N1236k1330
17355A57355J3793J4189k8247p839L340m2007J8031P600m4406l8583j8317N3749
17343H8658m0592j0340K8906J8542j5615L1649l554K2033Q6310M3185j6850j6578
17331B15754o020L000K8006J7859L4530M0655R707m1901k2841J1037P265J1034
17319C08085N8377Q6295O3105l7477J9305R6628L3151P471R886M6491J25988M7391
17307H64696P013N4152J03882J39599K13857L30615L91775M32488M13436L38950
17297C290463K17515J43191L9037n7207j76555k77342k79214k27654j76043n9876
17287B436315R7344K65577L21297J74791O7272j42582k74816l61626l91351m09229
$$ plain form
17367 111471 108467 119743 129989 124523 111893 149241 152032 129118 94348 127449 178685 157355
17355 157355 171148 185337 157090 149251 152591 110584 128615 136215 91809 53226 34909 88658
17343 88658 48066 37726 66632 85174 69559 101208 97654 119687 205997 249182 232332 215754
17331 215754 209734 212734 240740 258599 293129 333784 343491 301590 278749 289786 297051 308085
17319 308085 366462 452757 515862 478385 497690 594318 627469 634940 644826 691317 817305 864696
17307 864696 871709 925861 1029743 1169342 1383199 1713814 2105589 2538077 2951513 3290463
17297 3290463 3507978 3651169 3690206 3632999 3456444 3179102 2899888 2672234 2496191 2436315
17287 2436315 2533659 2799236 3120533 3295324 3362596 3220014 2945198 2583572 2192221 1782992
17277A782992j99883j31434l3042J02925J79596J82098J00156q487o7323j08203
17267A799395j93089k17954j37253r2606k1255O0199J43002J14088Q8912P3802
17257A617241K1956J0522O3104L6560L1341k5654o4257q2069p9441l8581K064
17246A492786m0612j03191r9925k4052L2297m4991j1557n5597r73j1110l2805
17235A100270l4562K2356J5363K4741o3413o3859q8833n1917j4838j03973j4714
17224G26621k3006m3515m1104K7533J06063O4223o7413k8772R003m4932q2185
17213F02516n3805o7857k2486J5841m4596J2871R528j2508N6327K8573o2266p3505
17201C88633K1712K5250o494p821k632L0852l1981j6874L6648J9970j3908p0724
$$ plain form
17277 1782992 1583109 1451675 1418633 1521558 1701154 1883252 1983408 1974921 1907598 1799395
17267 1799395 1606306 1388352 1251099 1158493 1137238 1197437 1340439 1454527 1543439 1617241
17257 1617241 1639197 1649719 1712823 1749383 1780724 1755070 1690813 1608744 1529303 1490722 1492786
17246 1492786 1452174 1348983 1249058 1225006 1257303 1212312 1200755 1145158 1144185 1133075 1100270
17235 1100270 1065708 1088064 1103427 1128168 1064755 1000896 912063 860146 845308 741335 726621
17224 726621 703615 660100 618996 646529 752592 816815 749402 720630 729633 684701 602516
17213 602516 548711 480854 458368 474209 429613 442484 452012 439504 495831 524404 462138 388633
17201 388633 410345 435595 429101 421280 418648 449500 417519 400645 437293 457263 443355 372631
17189C72631m1333K6256M8303L1430m678L8088P541K0938j4134P846K8729k9578
17177D92039J0975J0164k9346k537l293j8715k7671k9134J3786j2001N4986N25
17165D59778K6393J7898J9058J8643L4352O1069L8084L9669j4095K9866M9151
17154G79866K2559j016l435K3490O3183O5230O6501J70443K32265J64551O9608
17143A653245N2245J19440J08436M6980O717K2509l0244k7123Q053k8834m3450
17132A887974j1268j0482K1175n7868l545j5544k334J6560j6098m3782j17709
17121A647079j73255r3463k3788J5053O4026j6122P4269J06790Q5710O3023Q2319
17110A831641Q2112J02501Q7998J09334J76732J61295K10086K76654J73803K06136
$$ plain form
17189 372631 331298 357554 405857 437287 432609 470697 478238 499176 485042 492888 521617 492039
17177 492039 503014 513178 483832 481295 478002 459287 431616 402482 416268 404267 459253 459778
17165 459778 486171 504069 523127 541770 576122 637191 675275 714944 700849 730715 779866
17154 779866 802425 801409 797974 821464 884647 949877 1016378 1186821 1419086 1583637 1653245
17143 1653245 1705490 1824930 1933366 1980346 1987063 2009572 1979328 1952205 1960258 1931424 1887974
17132 1887974 1876706 1866224 1887399 1829531 1825986 1810442 1808108 1824668 1808570 1764788 1647079
17121 1647079 1473824 1380361 1356573 1371626 1435652 1419530 1493799 1600589 1686299 1749322 1831641
17110 1831641 1913753 2016254 2104252 2213586 2390318 2551613 2761699 3038353 3212156 3418292
17100C418292K50593L03180L56778L75934M83837N77094P07805P32180P95100
17091H000793J031723J396266J866482K623205L692623N302127P624959R695704
17083D1233882R354513O411688M063245L502003L102584K309636J559721l76166
17075G1161106k055564k154322k450474l243024j651033J755289L104488J766776
17067F6233242O35645P10321O38951J22713q72393k854013m590851n273746o493807
17058D8256062q486206q642869o720528m721837l220792k289177j614729j172018
17050A1387906q64702o61057m71113l60036k56574j00609M5416J73322K43935
17041I136488L81834O67584J012128J404936K123781L093347M714026O942491
$$ plain form
17100 3418292 3668885 3972065 4328843 4704777 5188614 5765708 6473513 7205693 8000793
17091 8000793 9032516 10428782 12295264 14918469 18611092 23913219 31538178 41233882
17083 41233882 50588395 57000083 61063328 64565331 67667915 69977551 71537272 71161106
17075 71161106 69105542 66951220 64500746 61257722 59606689 61361978 64466466 66233242
17067 66233242 66868887 67579208 68218159 68340872 67468479 64614466 60023615 54749869 48256062
17058 48256062 39769856 31126987 24406459 19684622 16463830 14174653 12559924 11387906
17050 11387906 10523204 9862147 9391034 9030998 8774424 8673815 8719231 8892553 9136488
17041 9136488 9518322 10185906 11198034 12602970 14726751 17820098 22534124 29476615
17033B9476615R022365Q696882N694052L366379K869445K347262J171167L82083
17025F3026250q97176j980859k060667k287769k616213q89524K492279L727983
17017E8514304J835695M11433M72928J95940p30631j543180k964316m189583m691368
17008D7311222n746719p527430p736180o066211m298347l051729k175504j600662
17000I108440j225051r21464p65204o35436n10963l97651l71554l17462k77897
16991C685758k73938k29899k35249k75139k03335j50542j32921j56431j46824
16982A881480j51039p8912p4177j12556l6472j23157j23553q4498o9259m5430
16972I82427o035l8925m4965n9689l2641n9340p0215n8207J419J9867m7053n5893
$$ plain form
17033 29476615 38498980 47195862 52889914 56256293 59125738 61473000 62644167 63026250
17025 63026250 62129074 60148215 58087548 55799779 53183566 52294042 54786321 58514304
17017 58514304 60349999 60761432 61234360 61430300 60699669 59156489 56192173 52002590 47311222
17008 47311222 41564503 34037073 26300893 20234682 15936335 12884606 10709102 9108440
17000 9108440 7883389 6961925 6196721 5561285 5050322 4652671 4281117 3963655 3685758
16991 3685758 3411820 3181921 2946672 2671533 2468198 2317656 2184735 2028304 1881480
16982 1881480 1730441 1651529 1577352 1464796 1428324 1305167 1181614 1097116 1027857 982427
16972 982427 976392 937467 892502 832813 800172 740832 670617 612410 613829 633696 586643 530750
16960E30750R339j0330j3953m4590k9914j8975m9251Q760Q693p0408m3664p4323
16948B02134j1951l005j1654k0160J7943L530J4302Q029j3293m8328l1535l5886
16936G0126k3013m8424n0191M4436J1922k3002M885O4709M2388k1906o5714P135
16924A3351K5133l4146k6608o937J7206L4064j8617k0152L3228L3294J1893N277
16912F6986K5230J1163p948j0086j4346j6966m1142m8503m0223k3989Q9989N7084
16900D7249L7385n025m7624l7709k7904L2137p200m9832m0292L7322N1312L555
16888f626k714j1416L0025l2543o6810J2936p205L2048K9640J1863j7154p076
16876c5032m9901J6438J05613K5638j8911j9041j591k7597j6741J4546j8061M8820
$$ plain form
16960 530750 540089 529759 515806 471216 441302 422327 373076 381836 390529 320121 276457 202134
16948 202134 190183 187178 175524 155364 173307 176837 191139 199168 185875 137547 106012 70126
16936 70126 47113 -1311 -51502 -7066 4856 -18146 -13261 51448 93836 71930 6216 13351
16924 13351 38484 4338 -22270 -29207 -12001 22063 3446 -16706 16522 49816 61709 66986
16912 66986 92216 103379 95431 85345 70999 54033 12891 -35612 -75835 -99824 -9835 47249
16900 47249 84634 79609 31985 -5724 -33628 -1491 -8691 -58523 -98815 -61493 -10181 -6626
16888 -6626 -9340 -20756 9269 -23274 -90084 -77148 -84353 -52305 -22665 -10802 -27956 -35032
16876 -35032 -84933 -68495 37118 62756 43845 24804 23213 -4384 -21125 -6579 -24640 24180
16864B4180K1961m228n0165L0176M2982K503O857j8588r820m466K9073l7989o1941
16851b9465j0791J0822O344J1813K4396K1049n179j6777J2355J9134m884K9377
16839F8194P582K1840n3693o7358j0419j1535N9639O1689k9925k989K6127J0024
16827G9176O165k2653L3463N0797p262m8491n907J9308n1660l2926J3298L8927
16815G2235j4179m355N1314k3862m627J9969L1482n0269m9084p013l0678j8246
16803b7313K9084k7156l1640L9860L9428k7643n4420R005j6125k1641P3043Q8486
16791G2968M8073j6954j07640p2352M6240K4261J340J06J3137m2920J5375L6898
16779A8532m24J0572K1547n9068k0231K6664L2396n465P363N4150j0248n1982
$$ plain form
16864 24180 46141 41913 -8252 21924 64906 67409 74266 55678 45858 41392 70465 32476 -29465
16851 -29465 -40256 -29434 -23090 -11277 13119 34168 28989 12212 24567 43701 38817 68194
16839 68194 75776 97616 43923 -23435 -33854 -45389 14250 75939 46014 43025 69152 79176
16827 79176 85341 62688 96151 146948 139686 91195 85288 104596 52936 20010 33308 72235
16815 72235 58056 53701 105015 81153 76526 96495 127977 77708 28624 21611 -9067 -27313
16803 -27313 1771 -25385 -57025 -17165 22263 -5380 -59800 -50795 -66920 -88561 -15518 72968
16791 72968 121041 104087 -3553 -75905 -29665 -5404 -4064 -3958 9179 -33741 -18366 18532
16779 18532 18108 28680 50227 -8841 -29072 -2408 29988 24523 31886 86036 75788 23806
16767B3806m1181J1482N781m3750l0082M6688J17486j1191L585k4396k2546M9661
16755H5343L8300r1638p0070N0037K1311k5625K9177K7293M3448r458n6661R436
16743E0893J4303n4103J2912o075J5521K7581L1636L445m3102k7638J6882M3558
16731H5813o466k0276j2779m9637l5803J8913p450L3771N7772j2738q501M653
16719D7272k3328K7425r237K1876K4063m5988j6927J1392n5767q913L6486K3027
16707C1381N9183K5931l7549p0885K75N078l2936K1220L1065P960r262k5067J0010
16694A6404l44K9736q620l1688L0347l811J2773O946l569n8141K4485P4595o678
16681H2435P474l4925k7756m46J3281J4113k299J90l0042m4840J9120L2556o5938
$$ plain form
16767 23806 -17375 -5893 -112 -43862 -73944 -27256 90230 79039 82624 58228 35682 85343
16755 85343 123643 32005 -38065 11972 33283 7658 36835 64128 107576 98118 41457 50893
16743 50893 65196 11093 24005 17930 33451 61032 92668 96113 53011 25373 42255 85813
16731 85813 79347 59071 46292 -3345 -39148 -20235 -27685 6086 63858 51120 42619 47272
16719 47272 23944 51369 42132 64008 88071 42083 25156 36548 -19219 -28132 8354 31381
16707 31381 90564 116495 78946 8061 8336 13414 -19522 1698 32763 40723 31461 6394 16404
16694 16404 16060 45796 37176 5488 35835 32024 44797 51743 48174 -9967 14518 89113 82435
16681 82435 89909 54984 27228 26782 40063 54176 51877 52067 22025 -22815 -3695 28861 -37077
16668c7077l3725K143N3743M6206q629k62O0739M6432j3967n5982j01046l9337
16656h0762Q8226Q4486K5313k2850j6971m7216J1532j8378K3484k7227j6913M058
16644F782p0510k4688J5928N0810M5557p981k0168J0814L3434J9577l3953m6539
16632b0937p503N0667l4154o0450l7988l4735L889R4946L0958N3820J9153j6293
16620D1373m8026j5782m512j6888k1536N7528M2016N859j5145j6584K3334j1526
16608B0111m423j381n2294k3392m788J0450K8743J2746k5374N1739L8477l3431
16596A7183n099J2965M002j0419L8820l0555m6909K2639o287k2416M8252N0315
16584G2491k2151j8634P9204P7825L2734K4056J7495q486R40J2087j6611r740
$$ plain form
16668 -37077 -70802 -68659 -14916 31290 22661 22399 83138 129570 115603 59621 -41425 -80762
16656 -80762 7464 91950 117263 94413 77442 30226 41758 23380 46864 19637 2724 6782
16644 6782 -63728 -88416 -72488 -21678 23879 15898 -4270 6544 39978 59555 25602 -20937
16632 -20937 -28440 22227 -11927 -72377 -110365 -145100 -141211 -46265 -15307 38513 57666 41373
16620 41373 -6653 -22435 -26947 -43835 -65371 -7843 34173 40032 24887 8303 31637 20111
16608 20111 15688 14307 -37987 -61379 -66167 -55717 -26974 -14228 -39602 12137 50614 17183
16596 17183 12084 25049 29051 18632 57452 26897 -20012 2627 -3660 -26076 22176 72491
16584 72491 50340 31706 110910 188735 221469 245525 263020 254534 255474 267561 250950 241210
16572B41210L0523P4017J5427l760m189j9136k4276o8652q518J8123J6574N721
16560B73064K7164M2306j8693k546j0548q905q8005o8505K0380l1584j5165K675
16548A21638n9321L07K9910Q322k7986k0015J0254n128j9338Q364J8593m5326
16536B0274k2163j098P3959L3164R908j1274r729N1892Q2667K017N9455Q6590
16524C75662j8236J8688j6039p6133n4499J9331J2893j2310l9682J1335l906L6595
16512B53699k0926k869J3385J0504K0867k9660K427K3839k4388j5932n3291j14019
16500F3636q249M913k6784l9727J2567R880J2404l5854o683M0855O3782K8868
16488A19608J803j7829M0016l2800m4597j28J8852j0486k0729j2159J4248p1891
$$ plain form
16572 241210 271733 345750 361177 357417 353228 334092 309816 241164 232646 250769 267343 273064
16560 273064 300228 342534 323841 321295 310747 301842 213837 145332 165712 134128 118963 121638
16548 121638 62317 62624 92534 100856 72870 52855 63109 57981 38643 47007 65600 20274
16536 20274 -1889 -2987 70972 104136 114044 102770 93041 144933 227600 229617 289072 375662
16524 375662 357426 376114 360075 283942 229443 248774 261667 249357 209675 221010 217104 253699
16512 253699 232773 229904 243289 253793 274660 245000 247427 271266 246878 230946 177655 63636
16500 63636 55387 60300 33516 -6211 6356 16236 28640 -7214 -13897 26958 90740 119608
16488 119608 121411 103582 143598 110798 66201 66073 84925 74439 53710 41551 55799 -16092
16476a6092m1673N3014R100j7062Q66j6541l2949J2384L9759M383L2847j0486
16464A7550l2595j4075L6415l2896N3152L5484K1163j56l0207l6771j0482P025
16452A3607o633J059J9885J8714K0842l6644l2046l8106j2715J4857j3069j3199
16440f3448J2565J1931P363K0511M3144R0681L3339l3787l5525l8859M8255J6750
16428A12920p3359m1753J5177N1325L7709k5985q8895l1773R91j3136j4870K6861
16416d4788P1078L3309k2661k419q819P699k1707K5689J4900K788m6868j0859
16404b658q91L1277l3717j5058j7187R93j6779o5306k1202P798P1439O1443J03558
16391A03710m5365j6451k3860j4358p153p1587j296J9046L965O3434L8181N944
$$ plain form
16476 -16092 -57765 -4751 4349 -12713 -11847 -28388 -61337 -48953 -9194 -4811 28036 17550
16464 17550 -15045 -29120 7295 -25601 27551 63035 84198 84042 53835 17064 6582 13607
16452 13607 6974 8033 27918 46632 67474 30830 -1216 -39322 -52037 -37180 -50249 -63448
16440 -63448 -50883 -38952 -31589 -11078 32066 122747 156086 122299 86774 47915 96170 112920
16428 112920 39561 -2192 12985 64310 102019 76034 -12861 -44634 -43643 -56779 -71649 -44788
16416 -44788 26290 59599 36938 34519 25700 33399 11692 37381 52281 55069 8201 -2658
16404 -2658 -3549 27728 -5989 -21047 -38234 -37241 -54020 -119326 -140528 -132730 -61291 152 103710
16391 103710 58345 41894 18034 3676 -3477 -75064 -76360 -57314 -53349 10085 48266 54210
16379E4210j8445J7651O1924m2014m0993j1305J1148m8610j9169M5041l7129l1136
16367e8827M625K8234N0818r562n0811J5358K4602l3166j1851N0106j2428n1006
16355e3908m0052N6828M8136o7551Q193O7416p66q903j8026J196J1231k3497n5739
16342g5442j3683J816K365J4847J2434P11K0860k2606K352M7806Q256j2443n4655
16329f7382l496L8788P175m0799J4631k8793k5407N2733J3997M1032L6725l4037
16317E167k3626k0263m8778m1992o741O2376J9589o946j2489M608k878m4768K321
16304a14420O0471M8579K2219K5664P513L8260j1082n5350k7313Q937J9505j2070
16292A0913P357M1730k519j2720L9076m9909o3398Q765r113L9604j4498m9810
$$ plain form
16379 54210 35765 53416 115340 73326 32333 21028 32176 -16434 -35603 9438 -27691 -58827
16367 -58827 -54202 -25968 24850 15288 -35523 -20165 4437 -28729 -40580 9526 -2902 -53908
16355 -53908 -93960 -37132 11004 -56547 -48354 19062 18296 9393 -8633 -7437 3794 -19703 -75442
16342 -75442 -89125 -87309 -84944 -70097 -57663 -56952 -36092 -58698 -56346 -8540 -284 -12727 -67382
16329 -67382 -70878 -32090 -24915 -65714 -51083 -79876 -105283 -52550 -38553 2479 39204 5167
16317 5167 -18459 -38722 -87500 -129492 -136233 -73857 -54268 -61214 -73703 -69095 -71973 -116741 -114420
16304 -114420 -53949 -5370 16849 42513 50026 88286 77204 21854 -5459 3478 22983 10913
16292 10913 18270 60000 57481 44761 83837 33928 -29470 -20705 -29818 9786 -4712 -54522
16280e4522k9714l1802N8213N8821K9515n845L6620M7614j120j8171p2466n2972
16268c5829n1317r088m2886N569P1136M6465N4452l8648k3379K2391M3736p72
16256D1830l272K6581j9759j1011n413m9986J4808M148p652k7448j8233K8995
16244b6412L8131Q435O994k1865r862P704K2538L3100L3466o0131m5315L192L9028
16231B9003L4909k8853n200k2887K4406l764k3208j7360J2240K6713O8542k6607
16219F7934j2606K6548p0020n2420N532J0484M9037N3303L2820n2794m3326M806
16207A9298n9942k2740J5050O568O963K3371J9201j443P063N344m8144l5375J0434
16194e4352N8276N9044j4980p3332k8809k6740N1352O6351j4762j7779K4965L0716
$$ plain form
16280 -54522 -84236 -116038 -57825 996 30511 24666 61286 108900 107780 89609 17143 -35829
16268 -35829 -87146 -96234 -139120 -133551 -62415 -15950 38502 -146 -23525 -1134 42602 41830
16256 41830 38558 65139 45380 34369 28956 -21030 -6222 -2074 -9726 -37174 -55407 -26412
16244 -26412 11719 20154 27148 5283 -4579 3125 25663 58763 92229 32098 -13217 -10025 29003
16231 29003 63912 35059 29859 6972 31378 27614 4406 -12954 -714 25999 94541 67934
16219 67934 55328 81876 11856 -40564 -35032 -24548 24489 77792 110612 57818 14492 19298
16207 19298 -40644 -63384 -48334 -41766 -34803 -11432 7769 6326 13389 18733 -29411 -64786 -54352
16194 -54352 3924 62968 47988 -25344 -54153 -80893 -29541 36810 22048 4269 29234 59950
16182E9950J7425k6836o1161m3303l3755k8905J3534O1893M1033K3221M3348J3534
16170G9978k5887k8736j5559k1287L2741L6707m0636p0573M6101N1685J1507k1519
16158C4522K3238m4497m4068l2358M0025l143o3581K0407O5532j253l3690M156
16146c4710J440l3170M9221Q9359J1226r2020r9498k558Q9916O5173P75j6843
16134B8311j0319q231m3523J4195K5141P9992J2473j5347k8116q9023K3850L3740
16122B3143M569o517j3719p181l1373k4600L1308O3320J8705l7297j5303K9143
16110C4198k3190j1023K5687k0603k5614l3533L2558N7895n083l3527p59K281
16098g13K4058K9857R031J8321n942j6041J6195k8232k2969k4473k4796j5826
$$ plain form
16182 59950 77375 50539 -10622 -53925 -87680 -116585 -103051 -41158 -125 23096 66444 79978
16170 79978 54091 25355 9796 -11491 21250 57957 17321 -53252 -7151 44534 56041 34522
16158 34522 57760 13263 -30805 -63163 -23138 -26281 -89862 -69455 -3923 -5176 -38866 -34710
16146 -34710 -33270 -66440 -17219 72140 83366 -8654 -108152 -110710 -20794 44379 45154 28311
16134 28311 17992 9761 -33762 -19567 5574 85566 98039 82692 54576 -34447 -10597 23143
16122 23143 27712 21195 7476 295 -31078 -55678 -24370 38950 57655 20358 5055 34198
16110 34198 11008 -15 25672 5069 -20545 -54078 -21520 36375 31292 -2235 -2994 -713
16098 -713 23345 53202 62233 80554 74612 58571 74766 46534 23565 -908 -25704 -41530
16086d1530K0457J4126k9746m4462k9300l3835k1308M8808O1026M1118j3526P9650
16074E1478N7185n7j5388o8403J5395M7159p647J5176q731J5605j2541l4963k8385
16061B5883K324N5849k3861K1887k0955k2358k7646J8265L8343K3121j1354q0378
16049h80k2894M715L4499J1395l7407M7432N8076n0055n0484K0241L8054Q704
16037F1396j1265j6440k7172K8355N1753k8677j981K4748k9508k6059J6960p1835
16025b9725l4096J5968J7130K4347j9166k4886L3835k5365K594m574M766L1438
16013g734k0709m5592l16q74R2481J12711K3877m9242L6824J5345m3486p3246
16001D0039q248L602k3283J5945O356j4504O1986L2060l9202n1214J3978O0745
$$ plain form
16086 -41530 -21073 -6947 -36693 -81155 -110455 -144290 -165598 -116790 -55764 -14646 -28172 51478
16074 51478 108663 108606 93218 24815 40210 87369 79722 94898 86167 101772 89231 54268 25883
16061 25883 28207 84056 60195 82082 61127 38769 11123 29388 67731 90852 79498 -880
16049 -880 -23774 -19059 15440 26835 -10572 36860 94936 44881 -5603 14638 52692 61396
16037 61396 50131 33691 6519 34874 86627 57950 55969 80717 51209 25150 42110 -29725
16025 -29725 -63821 -47853 -30723 -6376 -25542 -50428 -16593 -41958 -39364 -43938 -39172 -7734
16013 -7734 -28443 -74035 -74351 -75225 17256 129967 153844 104602 141426 156771 113285 40039
16001 40039 31791 35393 12110 28055 34411 19907 81893 113953 74751 23537 37515 98260
15989I8260M9q4876M8502L1751j9698K8151j7096J4921K2167J3116n4424n9443
15977B1380M4976N8402J8096k1016l2818L940K8971o0668k5239K888n970K6869
15965E9811K3740L7342L4798K7914J1499l1888q7858j8318J2229m0743l9639O3347
15953E2234M6578p940N961k928j4241k8796M1618L0894K1267j9245m4815k5766
15941E4821M1402j8501j1307R205J0650l6696J676l4398J5735j3208K7117K2411
15929F8907j4852J5520L0036l4387p614K4779j2170l1066l3075o4911L6099K3511
15917G77j1659K6093M692N5140N508j8751l191J6855L7799K9901l1849J3359J3905
15904A38579j9892j9332l0290L5529N9513j2080q7213m2269O3720K0109k7188
$$ plain form
15989 98260 98309 13433 61935 93686 73988 102139 85043 99964 122131 135247 80823 21380
15977 21380 66356 124758 142854 121838 89020 92960 121931 61263 36024 38912 32942 59811
15965 59811 83551 120893 155691 183605 195104 163216 75358 57040 69269 28526 -11113 52234
15953 52234 98812 90872 96833 93905 79664 50868 92486 123380 144647 125402 80587 54821
15941 54821 96223 77722 66415 75620 86270 49574 51250 16852 32587 19379 46496 68907
15929 68907 54055 69575 99611 65224 57610 82389 70219 39153 6078 -58833 -22734 777
15917 777 -10882 15211 19903 75043 80551 61800 58609 75464 113263 143164 111315 124674 138579
15904 138579 118687 99355 69065 104594 164107 152027 64814 22545 86265 106374 79186
15893G9186j0596K8601N5318j7740l5501k6642j5042K4771K3018K5797j6724j4708
15881I9738j5979l3928m1456J1363J5554q615k6351K5766M9922k7220k7005k3451
15869a662J7572J3369l1479K0157K8146M2389K68p779L6309P2607P152p6195l0129
15856I0725L0181L2596l8958m1639m6290J757M213m0865L1090L3810P099J3242
15844G6961k845n226M1145J4525n4311K6159J7336M4J8813J1074k1948p3463k0742
15831B7522L0798J3142P887k0756M2459O906L834k158J4012J1041P929l7558Q332
15818A13390k900m334Q528K4906J1834R849k7442l4024k6348J2628K6920J6326
15806A29333J3977o045J5634M912m522J3223l392l7433K8655m7160l277L9112
$$ plain form
15893 79186 68590 97191 152509 134769 99268 72626 57584 82355 105373 131170 114446 99738
15881 99738 83759 49831 8375 19738 35292 26677 326 26092 76014 48794 21789 -1662
15869 -1662 15910 29279 -2200 17957 46103 88492 88760 80981 117290 189897 197049 120854 90725
15856 90725 120906 153502 114544 72905 26615 28372 32585 -8280 22810 56620 63719 76961
15844 76961 74116 68890 110035 124560 70249 96408 113744 113788 132601 143675 121727 48264 27522
15831 27522 58320 71462 79349 58593 101052 107958 111792 109634 123646 134687 142616 105058 113390
15818 113390 110490 106156 114684 139590 151424 161273 133831 99807 73459 86087 113007 129333
15806 129333 143310 137265 152899 157811 153289 166512 163120 125687 154342 107182 103905 143017
15794A43017J5086M1155O1434O7733l9153n6765M353R049J8306l5003J2056j3101
15782B28167J6411k6378l9965K4015J9305L509L7579J8512L3156k8723m2196L395
15770B46787l1823q983Q8194L8491n5370n4185M6158K687m9734L6939N9935N1760
15758C70856O9698O3143J59128L10186M11655O73930Q67139M76496n6891j17398
15748C227942j22552n35506q35213n85474l64863j35183n4703k9550n7996m4670
15738D62232k7492q5155p6655J4660k5586k5772j5640K2453J3261K3081K3031
15727C02418L4898l0651l8368k8959l2790k0338k3158J3605J8815M2227O7583
15716C05282n3051p0592Q353M7053Q0567N8026j6421q5865k0317K325j6127r227
$$ plain form
15794 143017 158103 199258 260692 328425 289272 232507 236860 245909 264215 229212 241268 228167
15782 228167 244578 218200 178235 202250 221555 225064 262643 281155 314311 285588 243392 246787
15770 246787 214964 205981 294175 332666 277296 223111 269269 271956 222222 259161 319096 370856
15758 370856 440554 503697 662825 973011 1384666 2058596 2925735 3402231 3345340 3227942
15748 3227942 3105390 2569884 1734671 1149197 784334 649151 594448 564898 506902 462232
15738 462232 434740 349585 272930 287590 262004 236232 220592 243045 256306 279387 302418
15727 302418 337316 306665 268297 239338 206548 186210 163052 176657 195472 237699 305282
15716 305282 252231 181639 189992 237045 317612 375638 359217 273352 253035 255360 239233 230006
15704B30006K0388m5918k9321K9568P5226p853L3423K8866l856P51j2430k5877
15692B92973L2266K7379m3510l6099n0959n090K9329k224L716M6076M302N705
15680C03864j8963j6457j0024k8024k7064m7591L062O4099K7752m4860k2470L8289
15668B21613l3993k5016L2017K1719J8382m1418k2581L0921M6862K7712q447K1644
15656B89415M550m987K3014m0632j8924K2898J0542k7774O8192O1774j7997q0435
15644B89636J4995K5584n1057J5773L7899P109j3606o1599M2244M2889n978M066
15632C47955N1986K8031l9301m6890Q463L9180J8255n642N5936K9891p4672n5348
15620C57844L042J0394l1825k9673M4279O3959N0895Q465J165p8359j7182P579
$$ plain form
15704 230006 250394 204476 175155 204723 279949 272096 305519 334385 330529 331280 318850 292973
15692 292973 325239 352618 309108 273009 222050 216960 246289 244065 247781 293857 298159 303864
15680 303864 284901 268444 258420 230396 203332 155741 158803 222902 250654 205794 183324 221613
15668 221613 187620 162604 194621 216340 234722 193304 170723 201644 248506 276218 267771 289415
15656 289415 293965 288978 311992 271360 252436 275334 285876 258102 326294 388068 370071 289636
15644 289636 304631 330215 279158 294931 332830 339939 326333 264734 306978 349867 343889 347955
15632 347955 399941 427972 388671 341781 350244 389424 407679 402037 457973 487864 413192 357844
15620 357844 360886 371280 339455 309782 354061 418020 468915 477380 478545 400186 383004 390583
$$ [...]
##END NTUPLES=NMR SPECTRUM
##END=
