##TITLE=Analysis number 318360
Compound Code cc 38446
Book Reference 438/106
Project Code adrs
Chemist Name antons
##JCAMPDX= 6.0         $$ Bruker NMR JCAMP-DX V2.0
##DATA TYPE= NMR SPECTRUM
##DATA CLASS= NTUPLES
##ORIGIN= Bruker BioSpin GmbH
##OWNER= nmr
$$ XWIN-NMR		Version 3.5
$$ Fri Mar 24 12:32:55 2006 GMT Standard Time (UT+0h)  MAYBRIDGE\nmr@NMR_250MHZ
##.OBSERVE FREQUENCY= 250.131544655141
##.OBSERVE NUCLEUS= ^1H
##.ACQUISITION MODE= SIMULTANEOUS (DQD)
##.ACQUISITION SCHEME= undefined
##.AVERAGES= 16
##.DIGITISER RES= 18
##SPECTROMETER/DATA SYSTEM= dpx250
##.PULSE SEQUENCE= zg30
##.SOLVENT NAME= CDCl3
##.SHIFT REFERENCE= (INTERNAL, CDCl3, 0, 16.522)
##AUDIT TRAIL= $$ (NUMBER, WHEN, WHO, WHERE, WHAT)
$$ ##TITLE= Audit trail, XWIN-NMR		Version 3.5
$$ ##JCAMPDX= 5.01
$$ ##ORIGIN= Bruker BioSpin GmbH
$$ ##OWNER= nmr
$$ C:\u/data/dgb/nmr/ADRS/1470/pdata/1/auditp.txt
$$ ##AUDIT TRAIL=  $$ (NUMBER, WHEN, WHO, WHERE, WHAT)
(   1,<2006-03-24 12:32:31.13 +000>,<MAYBRIDGE\nmr>,<NMR_250MHZ>,
      <created by zg, POWCHK disabled, PULCHK disabled
       configuration hash MD5:
       84 BC 41 DB A1 6E 1D 46 DA 25 12 A5 C1 ED C5 3A
       data hash MD5: 64K
       DA 1E 1D 46 D4 8A FA CD 96 86 3E EF 23 39 F1 B3>)
(   2,<2006-03-24 12:32:45.80 +000>,<MAYBRIDGE\nmr>,<NMR_250MHZ>,
      <Start of raw data processing
       ef LB = 0.3 FT_mod = 6 PKNL = 1 SI = 32K 
       data hash MD5: 32K
       5E 11 95 DA 43 A7 28 9D B8 CD A7 7C BE BF 73 0F>)
(   3,<2006-03-24 12:32:47.39 +000>,<MAYBRIDGE\nmr>,<NMR_250MHZ>,
      <apk 
       data hash MD5: 32K
       F5 C7 3B FF F4 61 7A 0C 68 C8 3D 5B C6 C6 13 14>)
(   4,<2006-03-24 12:32:48.14 +000>,<MAYBRIDGE\nmr>,<NMR_250MHZ>,
      <abs ABSG = 5 
       data hash MD5: 32K
       30 AF D5 F3 A2 50 7B 63 20 D7 E9 B9 90 56 A1 8D>)
$$ ##END=
$$ 
$$ hash MD5
$$ 8E F8 B7 72 0E 6A 07 D0 0B 42 A0 99 C9 1C 29 A5
##$RELAX= 
##$RELAX= 
##$RELAX= 
##$RELAX= 
##$RELAX= 
##$RELAX= 
##$RELAX= 
$$ Bruker specific parameters
$$ --------------------------
##$DU= <C:\u>
##$EXPNO= 1470
##$NAME= <ADRS>
##$PROCNO= 1
##$TYPE= <nmr>
##$USER= <dgb>
##$AMP= (0..31)
100 100 100 100 100 100 100 100 100 100 100 100 100 100 100 100 100 100 
100 100 100 100 100 100 100 100 100 100 100 100 100 100 
##$AQSEQ= 0
##$AQ_mod= 3
##$AUNM= <au_zg>
##$AUTOPOS= <22 >
##$BF1= 250.13
##$BF2= 250.13
##$BF3= 250.13
##$BF4= 250.13
##$BF5= 500.13
##$BF6= 500.13
##$BF7= 500.13
##$BF8= 500.13
##$BYTORDA= 1
##$CFDGTYP= 0
##$CFRGTYP= 5
##$CHEMSTR= <none>
##$CNST= (0..31)
1 1 145 1 1 1 1 1 1 1 1 1 1 1 1 1 1 1 1 1 1 1 1 1 1 1 1 1 1 1 1 1 
##$CPDPRG= <>
##$CPDPRG1= <>
##$CPDPRG2= <>
##$CPDPRG3= <>
##$CPDPRG4= <mlev>
##$CPDPRG5= <mlev>
##$CPDPRG6= <mlev>
##$CPDPRG7= <mlev>
##$CPDPRG8= <mlev>
##$CPDPRGB= <>
##$CPDPRGT= <>
##$D= (0..31)
0 1 0 0 0 0 0 0 0 0.06 0 0 0 0 0 0 0.0002 0 0 0 0 0 0 0 0 0 0 0 0 0 0 
0 
##$DATE= 1143203550
##$DBL= (0..7)
120 120 120 120 120 120 120 120 
##$DBP= (0..7)
150 150 150 150 150 150 150 150 
##$DBP07= 0
##$DBPNAM0= <>
##$DBPNAM1= <>
$$ [...]
##$SUBNAM7= <"">
##$SUBNAM8= <"">
##$SUBNAM9= <"">
##$SW= 20.6930455092707
##$SWIBOX= (0..15)
0 0 3 0 0 0 0 0 0 0 0 0 0 0 0 0 
##$SW_h= 5175.983436853
##$TD= 65536
##$TD0= 1
##$TE= 294.16
##$TE2= 300
##$TE3= 300
##$TEG= 300
##$TL= (0..7)
0 120 120 120 120 120 120 120 
##$TP= (0..7)
150 150 150 150 150 150 150 150 
##$TP07= 0
##$TPNAME0= <>
##$TPNAME1= <>
##$TPNAME2= <>
##$TPNAME3= <>
##$TPNAME4= <>
##$TPNAME5= <>
##$TPNAME6= <>
##$TPNAME7= <>
##$TPOAL= (0..7)
0.5 0.5 0.5 0.5 0.5 0.5 0.5 0.5 
##$TPOFFS= (0..7)
0 0 0 0 0 0 0 0 
##$TUNHIN= 0
##$TUNHOUT= 0
##$TUNXOUT= 0
##$USERA1= <user>
##$USERA2= <user>
##$USERA3= <user>
##$USERA4= <user>
##$USERA5= <user>
##$V9= 5
##$VALIST= <valist>
##$VCLIST= <CCCCCCCCCCCCCCC>
##$VD= 0
##$VDLIST= <DDDDDDDDDDDDDDD>
##$VPLIST= <PPPPPPPPPPPPPPP>
##$VTLIST= <TTTTTTTTTTTTTTT>
##$WBST= 1024
##$WBSW= 4
##$XGAIN= (0..3)
0 0 0 0 
##$XL= 0
##$YL= 0
##$YMAX_a= 353751
##$YMIN_a= -559805
##$ZGOPTNS= <>
##$ZL1= 120
##$ZL2= 120
##$ZL3= 120
##$ZL4= 120
##$ABSF1= 16.522
##$ABSF2= -4.171173
##$ABSG= 5
##$ABSL= 3
##$ALPHA= 0
##$AQORDER= 0
##$ASSFAC= 0
##$ASSFACI= 0
##$ASSFACX= 0
##$ASSWID= 0
##$AUNMP= <proc_1d>
##$AZFE= 0.1
##$AZFW= 0.1
##$BCFW= 0
##$BC_mod= 0
##$BYTORDP= 0
##$COROFFS= 0
##$CY= 12.5
##$DATMOD= 1
##$DC= 0
##$DFILT= <>
##$DTYPP= 0
##$F1P= 14.0000005364418
##$F2P= -0.99999901652339
##$FCOR= 0.5
##$FTSIZE= 32768
##$FT_mod= 6
##$GAMMA= 0
##$GB= 0
##$INTBC= 1
##$INTSCL= 1
##$ISEN= 128
##$LB= 0.3
##$LEV0= 0
##$LPBIN= 0
##$MAXI= 10000
##$MC2= 0
##$MEAN= 0
##$ME_mod= 0
##$MI= 0
##$NCOEF= 0
##$NC_proc= -2
##$NLEV= 6
##$NOISF1= 0
##$NOISF2= 0
##$NSP= 0
##$NTH_PI= 0
##$NZP= 0
##$OFFSET= 16.522
##$PC= 1
##$PHC0= 171.2835
##$PHC1= 3.224988
##$PH_mod= 1
##$PKNL= yes
##$PPARMOD= 0
##$PSCAL= 4
##$PSIGN= 0
##$REVERSE= no
##$SF= 250.13
##$SI= 32768
##$SIGF1= 0
##$SIGF2= 0
##$SINO= 400
##$SIOLD= 32768
##$SREGLST= <1H.CDCl3>
##$SSB= 0
##$STSI= 32768
##$STSR= 0
##$SW_p= 5175.98343685301
##$SYMM= 0
##$S_DEV= 0
##$TDeff= 65536
##$TDoff= 0
##$TI= <Analysis number 999999
Compound Code 99
Book Reference 9
Project Code 9>
##$TILT= no
##$TM1= 0
##$TM2= 0
##$TOPLEV= 0
##$USERP1= <user>
##$USERP2= <user>
##$USERP3= <user>
##$USERP4= <user>
##$USERP5= <user>
##$WDW= 1
##$XDIM= 32768
##$YMAX_p= 269911767
##$YMIN_p= -42186
$$ End of Bruker specific parameters
$$ ---------------------------------
##NTUPLES= NMR SPECTRUM
##VAR_NAME=  FREQUENCY,     SPECTRUM/REAL,   SPECTRUM/IMAG
##SYMBOL=    X,             R,               I
##VAR_TYPE=  INDEPENDENT,   DEPENDENT,       DEPENDENT
##VAR_FORM=  AFFN,          ASDF,            ASDF
##VAR_DIM=   32768,         32768,           32768
##UNITS=     HZ,            ARBITRARY UNITS, ARBITRARY UNITS
##FACTOR=    0.157963299565203, 1,           1
##FIRST=     4132.6476996994, 0,             0
##LAST=      -1043.33573715361, 0,           0
##MIN=       -1043.33573715361, -42186,      0
##MAX=       4132.6476996994, 269911767,     0
$$ Real data points
##PAGE= N=1
##DATA TABLE= (X++(R..R)), XYDATA
$$ [...]
21350 -4286 -3370 -34 -5840 -15520 -21485 -17437 -20888 -24504 -19993 -12959 -17105 -23934 -16183 -13909 -13025
21335 -13025 -11826 -6016 -5934 -5921 2547 1461 -5192 -9246 -7216 -4071 -214 -5101 -11392 -12466 -12579 -6793
21319 -6793 -828 -1857 -5558 -12859 -20865 -7710 3626 -3922 -10827 -15588 -22653 -16737 -6987 -6603
21305 -6603 -4103 -1996 165 1560 4713 6191 5792 4283 -1074 -10668 -9927 -454 -2602 -14847 -24254
21290 -24254 -24117 -27182 -20776 -12917 -7885 -3760 7734 5843 -3417 -15597 -19000 -20273 -17463 -12503
21276 -12503 -12629 -11604 -12147 -15313 -12454 -17816 -18341 -21501 -24459 -30687 -40031 -33051 -23937 -18099 -17400
21261 -17400 -10175 -9787 -4700 -9221 -11007 -11422 -6320 -1435 7073 -486 -4053 1993 -12094 -16677 -8836
21246 -8836 -5228 1287 375 -4279 5236 3202 -4326 -7783 -15603 -12767 -3257 -11315 -22176 -18527 -26177
21231 -26177 -28830 -18406 -5378 -8692 -16478 -16374 -17840 -13710 -8199 -15596 -16442 -9862 -12612 -5261
21217 -5261 -5258 -5361 182 3119 -3356 -10960 1553 718 -3566 -6937 -8816 -1251 -345 6596 10176 5589
21201 5589 -1431 -15141 -18406 -15381 -13692 -10527 -25030 -26456 -17230 -23881 -26331 -23386 -20767 -9775
21187 -9775 -3332 -1208 -9648 -7367 -12599 -16864 -19224 -8346 -1751 847 9062 6239 -655 -8741
21173 -8741 -15189 -14956 -6123 -5329 -5167 4097 -2791 -8314 -9265 -18189 -19877 -21923 -23040 -19016 -7235
21158 -7235 -3874 -9155 -7355 -13017 -14679 -3992 -2078 -8542 -12803 -8507 -10059 -16022 -30455 -32324
21144 -32324 -28919 -31859 -26502 -11801 -10142 -12752 -6157 -5250 -1468 6505 -892 -16206 -19003 -15311
21130 -15311 -14736 -14575 -20340 -16989 -15529 -11656 -5672 -4712 -9663 -16244 -20485 -19338 -16894 -4651 -1948
21115 -1948 -7838 -8823 -9763 -7010 -4139 -6778 -4819 5253 16144 11384 718 -11125 -16883 -3780
21101 -3780 2716 868 -3394 -5640 -11316 -9179 -17398 -16496 -24438 -33899 -28139 -20439 -15456 -22895 -29887
21086 -29887 -24595 -18049 -14765 -14683 -10319 -10660 -3943 1698 -1344 -18964 -27596 -21945 -22395 -19147 -15130
21071 -15130 -8474 -11824 -7190 -12463 -23298 -27016 -32443 -26137 -24100 -23199 -16614 -8851 -3940 -6476
21057 -6476 -10955 -8543 -16304 -32896 -28594 -23141 -20641 -16442 -15585 -19404 -16218 -12724 -10039 -6001 6196
21042 6196 9555 1872 100 -7879 -21233 -16307 -10149 -14979 -19883 -16241 -16449 -18117 -5235 1249
21028 1249 -10395 -18340 -13690 -16899 -13986 -7552 -4077 -12343 -20666 -29067 -25299 -24212 -17186 -13050
21014 -13050 -14482 -24281 -30732 -21596 -6205 -14146 -21057 -32745 -41839 -42186 -26547 -14838 -17433 -28597
21000 -28597 -25577 -16797 -8942 -9617 -14617 -18380 -17140 -26273 -27194 -25704 -30053 -19418 -19038 -12030 -15246
20985 -15246 -9168 -3175 -9952 -6709 2633 -216 -10804 -14561 -21800 -22477 -11974 -11198 -17165 -17203 -8204
20970 -8204 -5794 -9826 -15342 -20083 -19650 -12209 -13104 -23231 -18566 -5997 -13915 -21874 -23314 -25202 -19182
20955 -19182 -9600 -6158 -3681 -6923 -13449 -10570 -8055 -18792 -19196 -20576 -15936 -7279 -3407 977
20941 977 2116 -5910 -18520 -16945 -10784 -19337 -23407 -20483 -9906 -5814 -9294 -14125 -17914 -10640
20927 -10640 -11341 -8221 -2786 -12916 -8659 -5157 -5852 -10184 -6949 -7483 -11952 -7438 -9854 -13497 -10231
20912 -10231 -8287 -14507 -12115 210 4781 2849 -3022 -1224 -4095 -9371 -18532 -15100 -8373 3355
20898 3355 3400 5262 6484 -1798 -15447 -19107 -16992 -19849 -14522 -5685 -6036 -2514 -3092 -3936 3170 -458
20882 -458 -14614 -25150 -22715 -23835 -20274 -13752 -20201 -18348 -11214 -6499 -929 3610 6161 5547 -8780
20867 -8780 -14068 -5592 -2093 -9299 -10675 -144 639 -6383 -4097 -4788 -153 -5463 -5697 -9826 -7342
20852 -7342 2259 3370 892 -3948 -14687 -14856 -15900 -12487 -1005 8835 6386 16738 20183 18224
20838 18224 31383 43396 39685 49310 62807 83564 112508 158054 214161 278922 326428 348725
20826 348725 335864 303757 245752 199187 153827 121250 91101 63619 46576 46237 37421 36523
20814 36523 37505 25526 14343 9886 11457 9506 13127 11998 13096 9611 13450 18244 6541 -1231
20800 -1231 5528 3972 -9454 -15270 -20955 -23611 -12584 -1323 12 -250 -7493 -10181 -8395 -16016
20786 -16016 -15278 -11117 843 5765 10210 4522 -7489 -13836 -10508 -13417 -19839 -16704 -9096 -8877
20772 -8877 -10904 -16097 1783 15273 9337 9149 13358 10160 3430 -9076 -6762 -9300 -8721 -14293
20758 -14293 -9503 -14607 -10416 3125 -3864 -14801 -14956 -14951 -15525 -11619 -7875 -2498 -247 1875 -5484
20743 -5484 -12180 -23718 -20126 -10865 -14038 -9308 4810 6963 3376 9069 1669 -1603 -3852 3033
20729 3033 2790 -4099 -8780 -4580 2117 -2198 -7005 -1152 -12517 -30388 -38218 -31287 -29436 -30468
20715 -30468 -31067 -26243 -21643 -15858 -10945 -7556 -2817 -6578 -10416 -7605 -10810 -8446 -11653 -18082 -8256
20700 -8256 -6312 -1730 -5885 -2448 1864 -4200 -2191 -5564 -10580 -8437 -13756 -12839 -16949 -19363 -16879
20685 -16879 -21633 -25105 -19497 -11380 -14692 -13595 -16369 -5784 4694 3545 -2417 -5871 -4468 -1604
20671 -1604 1150 7106 2838 -4337 -11182 -9158 -6587 -9975 -14164 -15823 -24393 -16076 -3087 -6667
20657 -6667 -1853 8313 -2118 2747 -2242 363 967 -4359 -4131 1321 3274 16077 20642 9548
20643 9548 5129 7466 -1709 -10102 -5655 -3248 -4566 -1586 -581 -8821 -15751 -24177 -19526 -10444 -9370
20628 -9370 -14561 -12643 -10401 -6229 -5966 -14186 -29883 -29057 -26722 -27402 -30772 -28031 -19159 -12016 -13507
20613 -13507 -12690 -17807 -23981 -27579 -17679 -15300 -21462 -20886 -22396 -27681 -23671 -20312 -15702 -13617 -17545
20598 -17545 -14103 -12487 -9040 -9965 -7228 -9840 -11353 -13366 -8001 -5735 -11917 -24765 -29608 -32891
20584 -32891 -34543 -21542 -20410 -20554 -10004 -9316 -18408 -13413 -10239 -6441 -1888 -2376 -13242 -15715
20570 -15715 -15180 -17949 -15433 -25914 -27438 -19226 -15346 -17964 -18513 -20896 -17368 -14572 -10285 -8406 -12637
20555 -12637 -12124 -11416 -3317 3302 10150 9112 253 -1577 -1194 2313 -7202 -14436 -12876 -18742 -19606
20540 -19606 -15832 -12912 -16935 -22899 -18706 -11080 -8629 -6722 -5194 518 170 6188 1074 2769 3011
20525 3011 11751 11909 3112 -2260 274 -292 -7563 -5327 -4530 2249 -2377 -109 757 4840 -5521
20510 -5521 434 4960 -4025 -5945 102 6859 1645 -9512 -6039 -1863 -5754 -6907 -7760 -11798 -13985
20495 -13985 -7843 -6163 -12051 -10827 -15355 -13440 -19058 -21412 -16392 -15893 -18079 -9880 -8880 -10179 -7176
20480 -7176 -9385 -6792 -8340 -14455 -17061 -13896 -22483 -7408 -6356 -11451 -12580 -5034 -5322 -5739 -2865
20465 -2865 -3263 -2795 -5172 -9281 4856 7176 5039 436 -5596 1009 -2100 -16958 -24602 -21761 -19058
20450 -19058 -11157 -10052 -13182 -13796 -13985 -12616 -12178 -18278 -26473 -19412 -3469 5435 5793 10904 690
20435 690 -15169 -8052 -6019 3239 1743 -5605 -12836 -13785 -12384 -6916 -5839 4173 10412 10587 22849
20420 22849 33719 42637 46735 42137 50286 40123 28344 26897 20005 18446 12520 1589 3304
20407 3304 -1302 -7731 441 -1330 -5495 -18538 -28690 -25159 -15888 -9736 3193 8183 6197 -421
20393 -421 -2996 -7995 -2371 3898 9933 11992 9979 3047 3915 6756 9308 11056 14159 16877 13927
20378 13927 18425 9562 -540 -4676 -2932 1778 4757 7060 4716 -8586 -17863 -24710 -16864 -13531
20364 -13531 -24548 -20530 -9933 957 -15526 -22267 -7538 -13721 -6459 850 -3718 5859 -186
20351 -186 -7942 -1054 7965 8652 7886 7502 3640 827 10005 10331 9372 6593 8725 12305 18031 11530
20335 11530 3058 -5743 -9174 -11822 -6517 -5379 -6470 -12105 -16797 -21479 -23784 -25817 -22546 -21023
20321 -21023 -15253 -766 -8065 -12162 -13729 410 10535 11259 20641 26579 24032 24862 24191 22327
20307 22327 23560 24664 12031 9290 10679 5927 2444 10035 14271 15841 12742 8092 10742 9047
20293 9047 -403 -10548 -2574 1734 7618 15660 23662 38149 51490 61968 80434 81819 72562
20280 72562 62015 49573 50496 46255 46393 47018 39796 44940 45567 39689 38902 43578 51358 48069 53318
20265 53318 66459 69633 73842 81503 84692 79118 78302 78481 69531 68379 61857 60734 65338 56185 48711
20250 48711 49996 63781 59673 52445 44625 53245 62040 67904 67852 67648 75902 86967 95212 100549 100197
20235 100197 94396 97205 101834 105621 96953 108010 121340 130223 133286 131957 129144 142365 167036
20222 167036 177197 176586 171103 178474 201671 220132 225201 223779 222725 222582 223577 244472 264315 289332
20208 289332 322460 359679 413834 487902 582825 673458 775943 854592 877569 868569 829882
20197 829882 782579 750033 738507 745709 783951 854658 918093 968816 1008490 1042355 1086841 1161108
20185 1161108 1263394 1378092 1518785 1688228 1876715 2105879 2386178 2725542 3132459
20176 3132459 3629301 4249100 5065675 6136616 7564579 9504128 12204452 16100154 21823334
20167 21823334 30207972 41680061 54812671 65819011 70995937 68461120 59588250 48090456
20159 48090456 37200727 28454707 21973597 17292270 13911213 11427046 9568667 8144856
20151 8144856 7010135 6085642 5322372 4687788 4160704 3721285 3357592 3044763 2776677
20142 2776677 2557713 2372809 2225277 2087397 1975548 1884407 1802014 1736945 1656283 1551247
20132 1551247 1447386 1352137 1271615 1221219 1209688 1224298 1257638 1276855 1236243 1146956 1028620
20121 1028620 910845 812398 730945 654086 613450 582160 538282 498085 473859 442689 408371
20110 408371 379043 357669 343749 329456 314661 297424 283760 273368 266340 256261 247906 240076
20098 240076 235827 225850 218961 216827 217434 212086 208403 206494 194435 185035 184073 188777 191179 194358
20084 194358 193897 181138 188643 191390 204801 225856 238210 238897 238376 234497 228134 228545 240116 263753
20070 263753 314098 371849 415742 450392 461502 444405 398965 340127 299996 263513 228057
20059 228057 198030 179797 166361 156258 146823 135150 128098 120237 108473 102413 91505 84088
20047 84088 86354 90240 85647 77070 73776 76558 76932 85025 89182 88589 85115 87878 91319 100704 88423
20032 88423 74678 74966 76767 72617 70207 76940 83354 74853 68322 56173 51383 53278 51928 64695
20018 64695 80450 82602 80338 71378 72719 62484 56792 51959 50115 59530 61599 62305 66287 68211
20004 68211 59596 49926 47192 58807 64765 68223 67564 55705 55221 54658 54865 50066 53447 55225 54129
19989 54129 60287 58531 54847 50108 50906 53925 47598 44180 44652 47478 39893 36587 28790 22348 26483
19974 26483 39029 37513 31700 20539 17511 15467 23094 27295 26316 18615 21769 19187 18190 19597
19960 19597 31746 29273 22627 16094 18399 26607 25045 29083 31847 30034 25329 29952 24678 27621
19946 27621 24433 9531 1608 5758 8841 9985 6531 -4758 -8337 -14839 -7049 -9950 -1984 6564
19932 6564 11453 10617 5794 5564 14834 14289 13263 10321 17564 31317 28332 17068 23498 32077 37452
19917 37452 31150 20132 18478 32150 33703 19466 8394 8204 22861 17001 4034 6603 18634
19904 18634 20175 12614 12670 8796 11848 9921 5437 4378 16642 28647 23536 16276 14493 17800
19890 17800 10579 14138 9605 11969 16482 13634 16172 23375 34589 34895 21169 14355 12871 20465
19876 20465 20425 13136 6354 1765 2377 7377 11933 21647 23429 24342 22468 20890 26291 24788 16038
19861 16038 22439 25693 28566 16134 5749 232 2182 7887 2565 1385 4333 6412 -3394 -4002
19847 -4002 89 2567 856 1201 5160 16258 18025 9907 21310 30234 18983 12266 13511 8964
19833 8964 11675 9616 11160 7722 17549 14301 9996 16746 19005 22356 27367 25810 33423 28267 15950
19818 15950 4089 1692 5822 7913 6680 14509 21421 22415 20268 13347 3657 9185 15067 14530 9183
19803 9183 4391 3205 14512 20303 21418 22217 17106 10306 14080 21202 24139 24228 24031 23037 21521 20862
19787 20862 13476 13096 16577 15737 16180 6048 6708 9039 14068 10821 1861 -4052 -3201 -3763 2929 8309
19771 8309 16952 14353 11610 13644 19576 22434 16107 4434 5305 9270 8849 3105 -367 -4083 3833
19756 3833 8476 6314 -3699 -6130 -7160 -7347 -5433 2085 5810 6086 8840 -1617 -12975 -16940
19742 -16940 -8903 7897 10917 8681 12138 5372 3441 5140 8960 2734 -4690 -6585 -6041 -4801
19728 -4801 1343 -1776 5421 22 951 7131 14931 12279 8029 13769 8973 9160 12099 21096 26836
19713 26836 26036 17533 7680 3133 3579 9989 11694 2129 -1315 -1716 629 -6620 -7305 10093 15522
19698 15522 14152 12117 7957 -1119 -5424 -5136 1105 -6857 -8744 -5745 10097 10016 10380 5997 2102
19683 2102 -1772 -7189 -13726 -15753 -13963 -13701 -13635 -7854 -7618 3339 6563 11791 22170 19077 24013
19668 24013 36844 35105 33762 28044 28491 34837 35500 32972 21031 20095 14616 10402 12062 9153 7307
19653 7307 436 -6463 -7334 -5164 6179 14003 15723 15819 9165 528 837 88 1996 -368 5213 13039
19637 13039 7775 -2364 643 8825 21829 19760 -1714 -5432 -6208 -3795 11591 15782 11305 8900
19623 8900 10285 6373 1267 -4669 -3989 -2908 -5113 -6938 -6139 -1730 -2008 3111 8385 8522 -271 -1021
19607 -1021 3069 2663 2786 853 -5932 -6442 -6987 987 6852 1504 -1656 3012 9125 17130 11425 2259
19591 2259 -3814 -2236 421 1418 5532 -2687 -5330 -4710 -7660 -11398 -17813 -8637 8631 16957 17399
19576 17399 8526 5446 5767 3031 6628 1065 93 19405 37072 33268 35996 34702 38491 36823
19562 36823 36073 38212 36550 32998 31787 34265 35463 41928 40370 34852 33230 34759 43631 45840 29017
19547 29017 15952 19587 11094 9821 1452 -7355 131 7088 19182 29956 35406 23374 21817
19534 21817 31662 42314 41714 50123 54146 52799 56727 45083 35660 41898 46551 46222 39867 42854
19520 42854 42745 42996 50493 52929 50364 49295 47610 47237 48841 55385 61148 72848 80933 79418 71364
19505 71364 79620 86493 86785 79533 82995 90507 100497 119514 143037 176108 200873 241580 302220
19492 302220 382045 441283 451917 433923 388043 328759 286246 248736 217470 197948 179571
19481 179571 176350 172411 171515 176779 178808 181462 181423 182411 189669 213961 218375 214769 226377 239873
19467 239873 247442 258865 270991 285643 311599 342269 377409 406433 420959 425953 422052 410190
19455 410190 418219 442282 480250 534796 574437 607971 619210 616900 619581 628819 643129 671359
19443 671359 719352 769271 831564 908073 1004573 1117440 1244720 1376414 1518770 1650063
19433 1650063 1762835 1881235 2014086 2153174 2331376 2559899 2841936 3200308 3652566
19424 3652566 4230572 4978083 5941957 7220079 8937445 11279633 14586368 19345261 26177337
19415 26177337 35591243 47068144 58112717 65259259 66076145 60469948 50946029 40624576
19407 40624576 31585429 24524091 19260257 15392041 12543413 10404457 8775616 7522529
19399 7522529 6521838 5708766 5055098 4538865 4121615 3757153 3457329 3207675 2995704
19390 2995704 2818383 2679699 2549380 2415655 2267662 2108976 1946253 1790965 1638592
19381 1638592 1490594 1361290 1252362 1153586 1070108 1009559 958700 920115 888745 864640 827844
19370 827844 787563 742737 689798 639331 606023 585957 572885 570526 563663 549550 525697 496608
19358 496608 451659 404127 372762 354917 345228 333404 316799 300185 277792 263870 253793 253477
19346 253477 244310 232296 225086 226018 227446 229793 226191 221771 213275 201978 188792 185732 180615 174494
19332 174494 162631 159301 164770 156479 143144 143384 143292 143935 151318 150028 142293 130563 126312 138818
19318 138818 130152 119876 121935 119407 106804 116290 124393 122801 117435 109134 106108 97688 91869 103429
19304 103429 108711 103620 94961 88332 88458 87262 89285 91519 80100 74022 76956 73250 68159 69025
19290 69025 75538 77250 80816 77749 72675 70576 75336 86269 84876 73797 65339 69704 79870 83209
19276 83209 75057 69747 67145 56258 60066 73071 71792 66829 57842 42576 44504 52418 69634
19263 69634 68803 72467 80721 93007 101587 111499 119120 128987 142362 158523 167410 165530 169659 180602
19249 180602 190199 195118 197393 201327 209619 207301 208452 216659 217996 209843 198440 181189 173346 170774
19235 170774 161106 153942 150846 147748 145268 130402 110989 93643 84218 74086 63303 44558 36910
19222 36910 35042 33189 20046 28446 40047 42966 48170 45496 40330 48397 53246 53460 54838 49711
19208 49711 53317 50182 38639 31056 28684 25664 22599 17371 21806 20764 17466 11185 12560 7857
19194 7857 4661 8709 22988 28736 21561 20590 27857 25863 27733 18141 12932 13018 10632 13456 20619
19179 20619 21397 19498 19531 20044 14486 9717 16323 21186 27468 23109 25476 30512 24539 24660 26814 35482
19163 35482 40865 44682 35688 31782 26046 24915 27990 31298 28167 24535 19435 20790 14533 8185
19149 8185 9904 12191 16983 11345 13349 15405 19479 11346 8742 16014 19477 18081 21658 29648 37103
19134 37103 30191 27025 24500 19496 8637 12317 16345 20336 22977 19240 20655 23749 31312 40198
19120 40198 43246 36816 38145 52845 69784 75108 82568 78284 79076 75023 79868 86102 89600 90023
19106 90023 90439 79440 78612 82981 86232 89511 97066 103654 101173 98422 97387 98485 92720 84089 69011
19091 69011 74054 71797 51909 28359 24773 23909 18910 14852 30509 30601 15053 11016 12068 22619
19077 22619 28908 27757 29005 29313 27866 41214 45951 43951 42236 48822 53275 60431 57489 69591
19063 69591 74336 74522 70013 78604 88830 96193 94011 87660 90018 95218 93818 93643 92878 89839 93159
19048 93159 87553 80245 74109 71621 81218 88603 83340 74658 70866 60249 50820 44793 37128 35793
19034 35793 39985 29591 33422 29174 26443 30445 31807 27412 34318 38966 25833 24411 25344 20728
19020 20728 19523 24466 27257 12430 4232 13048 21804 22900 24137 23048 22658 21611 16213 11865
19006 11865 16059 29814 35924 26341 29501 25874 20889 16741 9712 9309 13629 22421 15475 14565 24075
18991 24075 31808 39480 40633 34951 33109 28056 22774 17551 20992 21068 18718 24412 24896 23194 22499
18976 22499 22262 30952 22264 12171 6073 9403 10110 3504 -2617 2282 15877 28222 37855 36730
18962 36730 35172 36599 39519 62075 82868 106821 117662 109412 93747 76250 65977 47685
18950 47685 44015 36109 28554 32374 29892 29763 23287 9865 2548 10467 18603 20904 22916 20851
18936 20851 21209 22179 13873 8239 7916 10617 16141 17897 11816 10625 27379 33311 23489 20742 25982
18921 25982 27554 25422 24351 18743 20712 18542 29760 46003 66639 86803 102473 127208 154470
18908 154470 175426 185477 182326 174430 155852 132281 99221 77982 72293 54022 36490 35532
18896 35532 25509 15610 10961 3728 7598 20024 14654 13091 16159 16469 9298 12331 27067 26933
18882 26933 23140 35591 43685 35156 20462 22238 30770 37456 34928 36435 49861 49737 39147 28616
18868 28616 33299 35373 26637 33099 40216 48816 72038 100856 109685 128509 145942 153150 156419
18855 156419 142311 125678 98615 76074 71357 62566 61418 50387 38701 32912 27245 30251 31280
18842 31280 42045 48888 42744 34313 30238 21695 14031 22880 25902 33222 45386 41637 42092 48871
18828 48871 39903 32198 35912 44024 45583 50024 62611 57534 52072 54248 58547 67053 80117 78186
18814 78186 81562 91554 91536 95025 108312 114145 125962 135657 142285 134832 127031 125300 127987 123931
18800 123931 131659 134932 132947 142127 151431 156621 162570 173927 171262 169876 174246 165683 159973 155122
18786 155122 164832 167815 171152 182551 194459 205161 218058 242065 269876 290096 313499 358488
18774 358488 409663 475743 539471 611577 693074 748211 812088 892806 1000443 1125960 1291578
18763 1291578 1478778 1717318 2052778 2552451 3323663 4447066 5791182 7159794 8791360
18754 8791360 10964426 13093158 14338589 15163653 16303342 17379800 17785664 17858020 18156754
18745 18156754 19135146 20988079 23062963 24388491 25633869 27843742 29888983 29889268 28623289
18736 28623289 27801167 27293300 26003567 24212051 22613422 21747276 21767623 22140097 21732076
18727 21732076 20796981 20228216 19683771 18116971 15773629 13439061 11419603 9499479
18719 9499479 7688754 6147669 4965182 4112217 3497151 3032595 2660665 2361355 2135293
18710 2135293 1940264 1761584 1604526 1467924 1343017 1227298 1126766 1034529 938738 864300
18700 864300 804686 742727 677414 616038 564088 525444 489779 457423 431406 405114 378197
18689 378197 341565 310405 295113 281259 263283 259559 259453 252895 241757 230654 228116 215938
18677 215938 211480 200550 196534 196431 188531 175505 173120 179548 183779 188111 178930 170195 168086 164612
18663 164612 163983 161547 159292 159840 163408 161358 164588 167856 165186 167675 164250 156772 157670 164729 172945
18648 172945 161346 156018 155450 148435 146290 143297 146770 150460 150044 144662 147028 150660 167024 171933
18634 171933 171084 175872 189933 205826 219170 233748 252120 275847 286115 295625 318340 344056
18622 344056 376580 417948 453715 485432 530337 590816 651948 723298 822269 970387 1190964
18611 1190964 1517787 2052714 2890528 4068833 5387244 6771860 8044267 8612737 8567977
18602 8567977 8275416 7991351 8061015 8536644 9316205 10354837 11050064 11169564 11055326
18593 11055326 10725586 10367679 10111677 9624406 8896137 8134959 7483238 7174717 7229780
18584 7229780 7547229 8088779 8331694 7927565 7132990 6084322 4949038 3939246 3155636
18575 3155636 2606984 2238143 1974530 1798781 1685431 1605476 1572302 1567555 1580629 1632876
18565 1632876 1722587 1872704 2103034 2456924 3012936 3922016 5383520 7403452 9583907
18556 9583907 11887652 14063099 15029736 14918729 14393058 13887969 13904477 14496288 15624723
18547 15624723 17267848 18464651 18851608 18980180 18795227 18542374 18500142 17936348 16743036
18538 16743036 15379833 14109273 13357617 13243704 13615438 14461132 14955196 14328387 12918589
18529 12918589 10986646 8844676 6880872 5317867 4193640 3401140 2851464 2440699
18521 2440699 2112035 1862340 1667698 1514854 1402428 1304740 1198731 1099261 1015474 940382
18511 940382 871319 814608 765897 726976 679400 618623 570067 537797 509301 485964 458405
18500 458405 432330 406750 390401 379230 360673 344209 318034 312734 308787 290553 268820 265454
18488 265454 266707 261437 245921 238991 235713 238788 250684 258216 259754 273051 289485 309869 336941
18475 336941 352244 377116 412719 442421 463856 477077 492567 499124 504803 510915 507919 508661 510834
18462 510834 520601 535281 569663 619844 678963 763762 886678 1064133 1300627 1626867 2107497
18451 2107497 2868504 4105225 6148457 9185654 12848712 16045714 18041274 19005381
18443 19005381 18993191 17497820 14643236 11247762 8233851 6002340 4504099 3519486
18435 3519486 2856453 2385425 2030845 1767516 1577281 1440954 1355867 1289332 1248212 1220304
18425 1220304 1210070 1196187 1193689 1206134 1223685 1254851 1278554 1271390 1254396 1226212 1205091 1202708
18413 1202708 1223077 1267941 1335248 1457501 1611021 1832125 2125656 2541650 3152828 4054921
18403 4054921 5465645 7801187 11608909 17084977 23560756 29435175 33728790 36126722
18395 36126722 36142618 33415709 28729109 23097403 17645691 13094260 9691689 7316349
18387 7316349 5693598 4576870 3788666 3204359 2755844 2411911 2148101 1942827 1773605
18378 1773605 1646338 1547489 1485879 1459041 1438985 1437778 1430695 1413084 1394176 1367221 1329974
18367 1329974 1271720 1207267 1174016 1132377 1099583 1087143 1090971 1098210 1154595 1259330 1425650
18356 1425650 1652395 1987570 2490121 3295238 4646239 6899915 10225123 14077333 17186059
18347 17186059 18960980 19655483 19259079 17300907 14164561 10705418 7775702 5652369
18339 5652369 4228854 3269364 2621508 2169464 1833961 1578852 1382339 1218557 1100584
18330 1100584 998623 906109 836480 790900 764753 748031 732692 717164 713192 711222 691857
18319 691857 678638 662085 625814 598234 569405 530172 478430 440172 412970 397875 376784
18308 376784 355701 341169 319488 309257 320348 332133 330562 326238 342798 356272 363319 382683
18296 382683 403579 428660 441416 468541 505952 544278 589723 637102 672188 705974 761265
18285 761265 825363 886049 948398 1031329 1128028 1255932 1403303 1606906 1920864 2384275
18275 2384275 3091971 4211182 5771033 7353850 8660110 10160492 12209187 13852447
18267 13852447 14343864 14587316 15573884 17152919 18486067 19569402 20964581 22760788
18259 22760788 23930674 23927805 22753196 21391336 20261586 19189599 17633635 16110080
18251 16110080 15479786 15473068 14673097 13066990 11470189 10178722 8803545 7264939 5821725
18242 5821725 4695448 3916156 3389673 3017142 2743779 2542231 2389056 2263845 2166637
18233 2166637 2091487 2050908 2048377 2088123 2179648 2372294 2730224 3348598 4192787 4996946
18223 4996946 5669274 6517920 7654099 8425392 8570987 8679077 9209464 9999115 10658132
18214 10658132 11223438 12000709 12948298 13567063 13431688 12675037 11874083 11242667 10537225
18205 10537225 9574837 8779236 8522249 8405707 7784890 6890176 6094916 5379749 4534543
18196 4534543 3661916 2904703 2327249 1916838 1640372 1444766 1298047 1186087 1088540 997221
18186 997221 925290 872467 823795 766954 729195 695628 639720 595840 558317 532069 504820
18175 504820 467267 425946 393343 377316 360882 338698 327515 318000 311244 293514 281045 269397
18163 269397 270673 292294 316487 342770 365263 365665 357700 333561 307206 267603 236328 228566
18151 228566 213551 201410 194722 198612 185670 179441 192905 191820 187773 186320 185123 173161 169898
18138 169898 178706 178946 174223 174232 179296 181115 180217 177437 176635 184167 197987 219426 232971 236206 235936
18123 235936 248596 262754 281312 301285 331970 365548 403029 448895 516854 624833 782696
18112 782696 981486 1273628 1747810 2555421 4083003 7231536 13478520 19392300 18491792
18103 18491792 14115137 9213338 5911434 4013647 2877572 2161612 1697073 1379746
18095 1379746 1158649 1004460 872590 767671 687696 609793 549911 495587 465367 434986
18085 434986 409967 388003 373153 377225 392990 386713 381583 367966 348909 330513 320397 304132
18073 304132 294798 295396 282559 262653 249721 244820 234164 227539 225285 212393 205826 203003 208571
18060 208571 216353 205082 200205 192488 192050 186101 176409 163121 152428 145587 137371 126151 125012
18047 125012 124339 111800 107371 109105 117308 123755 115911 114075 108787 103701 97238 101252 108875 116010
18033 116010 113324 111477 109236 119046 127750 130846 129868 128330 128991 132447 137388 136119 136613 130176 129565
18018 129565 132464 135258 139295 139081 144310 144549 140556 132875 122924 114798 118197 108992 113071 115179 109466
18003 109466 94402 83285 78914 65540 62832 75084 74223 72684 70987 58688 52535 52704 58285
17990 58285 67213 66262 64031 59549 61694 66227 66961 63499 62946 59505 62794 53693 45616 43392 49107
17975 49107 61656 68503 61698 57546 55485 58963 56976 49692 46014 45557 53113 58732 58752 50299 51022
17960 51022 53128 65105 62992 50243 56004 58199 57105 51822 42789 39617 40931 48313 62939 54044
17946 54044 46420 53073 48865 45605 52794 57672 59814 66119 63464 65677 74310 80746 82351 95213
17932 95213 122994 134258 149044 153576 159141 175129 183967 174250 144431 122064 110567 96075
17920 96075 87722 73415 66593 79806 79174 73805 68452 52958 44749 47466 53106 50996 48408 55029
17906 55029 62276 68697 68148 63963 58106 57421 56274 58859 59482 50769 50598 43683 40929 48414 63080
17891 63080 63421 68257 81685 92896 104318 112759 126027 142708 161290 172710 196068 231277
17879 231277 264581 287205 295802 289516 275052 255116 217160 180723 148141 117548 84442 58294
17867 58294 54965 59257 57608 62156 63420 76992 72154 58306 61646 65252 66584 73120 65421 64752
17853 64752 65930 55581 53538 59865 62792 62541 61926 63303 58995 51320 46622 46423 44355 48712 65928
17838 65928 78396 98265 100961 109742 130845 154927 176102 207756 222942 234841 261953 284807
17826 284807 287847 262652 229952 187481 168383 144688 120884 101435 87049 63906 51672 55887
17814 55887 53979 48891 45181 44161 38268 32271 27217 29437 36655 38021 39682 43387 41770 39792
17800 39792 31731 26604 23221 24987 31017 36679 38974 42602 45204 59102 67597 60723 55349 55634
17786 55634 70623 77993 90614 99173 101347 116558 129022 131813 132747 120339 112353 95597 79595
17773 79595 77366 82391 80601 72805 70472 82178 89232 87998 91454 103797 111533 114830 103304 106730
17759 106730 119348 130798 133441 134252 143459 142428 141447 140775 134397 133301 124462 123461 124236 127496 125694
17744 125694 129451 124459 112014 98314 84063 64300 51433 51948 49167 51855 66476 56399 42969
17731 42969 42819 40091 43685 45184 44745 44943 44302 45799 50550 48249 51791 56128 56358 61655 67682 62175
17715 62175 68001 86587 96925 95083 87915 87517 88603 99963 109869 114740 108801 103632 102662 103962
17701 103962 97960 96859 84751 80998 69837 65214 67627 56644 50495 47887 49529 42832 40361
17688 40361 42417 39125 41440 42482 23296 15554 28510 38198 33718 32793 26074 26721 24731 25880
17674 25880 23767 25641 30180 32638 30818 32423 25729 26810 30358 37075 29247 32957 35234 28919
17660 28919 29250 21091 16529 16903 16547 13009 24235 32611 19241 20071 29052 26833 22645 15618 10932
17645 10932 10240 7233 6687 14449 20226 16729 21830 22292 25440 23356 25967 26548 20790 18201 20879
17630 20879 29343 29940 23003 14127 19714 18148 16340 27947 38668 43535 48898 49987 38263 25899
17616 25899 19720 21439 16126 8075 10732 24101 27981 36359 41837 42942 41996 38140 36321 39431
17602 39431 34116 25814 28870 27714 35193 34869 25473 26732 18362 12322 18276 12396 10140 8362 12508
17587 12508 16307 19985 21435 19195 23909 25062 23986 32044 25975 13477 8815 4161 7226 21982
17573 21982 30178 30839 24565 12583 21331 38783 35331 23422 17130 19771 25999 28116 28232 24204
17559 24204 25149 33684 44014 52646 45430 35609 19808 23509 40359 43757 40134 28647 23357 23766
17545 23766 17325 8163 10401 20636 19200 14028 9586 5926 7001 10012 11036 13674 25688 31850
17531 31850 27969 18362 14872 15501 17515 17946 11368 927 -8816 -11425 -9115 3433 8874 15011
17517 15011 11871 4413 6159 5681 -815 7649 12736 12291 21004 21464 22385 19120 15882 15407 14506 3056
17501 3056 8244 13101 17803 22031 10774 13438 17388 21176 24769 21991 13680 6572 10121 15266
17487 15266 30818 25668 15922 15646 13208 2919 4978 17019 13814 8362 2918 3337 -1085 1106
17473 1106 4140 -495 -3709 -4080 5939 11263 10510 16523 18940 18310 20669 19511 14198 18672 17544
17458 17544 19465 24102 18885 12796 6046 5499 9846 7958 6925 8137 14303 18887 26415 32538 22966
17443 22966 18334 29201 34255 52353 87120 113728 103512 76269 49593 38272 29438 17086
17431 17086 4179 884 12776 15325 7927 -1570 -483 6876 15054 20319 12396 11115 20090 17082
17417 17082 2959 -7511 -2843 4271 12013 16024 7804 8049 21112 28472 24314 15593 12048 17858
17403 17858 23507 22639 22422 18210 16600 11699 13049 12081 10402 20027 18732 18180 16346 21217 26571
17388 26571 29126 38125 35858 27446 23423 24135 28420 33426 22827 8412 4582 14125 16245 13265
17374 13265 20323 28743 30967 22780 11920 12587 15443 12226 14976 22350 33520 25808 12362 14418
17360 14418 18752 16242 17686 24523 12036 9372 16899 32049 42325 36970 29969 14847 10686
17347 10686 12891 12819 14507 16583 14291 5117 8871 17043 20647 20707 19408 13943 8701 6891 6395 12409
17331 12409 22898 26768 10850 3099 16662 26430 19590 9259 13417 16315 11115 529 3514
17318 3514 12320 13757 12699 5877 4437 2750 6138 7523 4652 7866 5951 3793 17771 25449
17304 25449 15005 16542 27932 30654 25871 18415 19020 20009 22163 17617 11601 9101 -691 -3309
17290 -3309 2916 7376 16818 21536 25325 33105 27222 24979 27000 14844 12840 20646 17168 22679
17276 22679 24713 26761 18467 9048 3208 7009 11140 8141 -7252 393 9192 13684 13371 17657
17262 17657 29414 29285 28890 25616 13846 6660 2110 -2262 8366 22404 30444 26590 21721 19681
17248 19681 18187 17224 19114 22291 22399 15411 12635 18201 8924 9494 19274 26167 25385 33603 33198 23187
17232 23187 37490 46584 39820 29213 20501 20640 17052 15785 15191 12667 14171 23090 23696 20769 16899
17217 16899 14760 20287 22466 21976 17194 16665 28913 37967 43859 43966 41624 48608 63592 72350 77926
17202 77926 75622 73048 86374 92255 99907 105060 102030 98776 99099 94612 82258 89444 82836 67003
17188 67003 59705 50071 48625 48857 36887 21599 20312 32412 26435 19499 28193 21934 21336 20597
17174 20597 14881 19342 32494 28449 24170 26047 25211 27401 18174 20317 31079 31233 40314 45552
17160 45552 45560 47787 57386 69434 83254 98579 119687 140691 161734 178748 185377 198021 217524
17147 217524 215030 196525 185756 180917 172247 166611 167263 163209 157534 164253 163133 151434 148969 167826
17133 167826 169075 155187 145396 137037 134186 126786 121296 113594 105482 101408 102648 89721 70102
17120 70102 60676 52597 47471 45064 28478 12482 20673 24921 28637 18847 20461 18414 14252 11543
17106 11543 7734 12198 16014 23497 29682 23337 23244 25982 24481 23720 28722 34801 35542 30603 16441
17091 16441 18338 25536 27129 19111 21618 38065 42076 44612 32954 20591 23143 28894 36643 35736
17077 35736 29913 33427 36085 29643 28490 29508 28213 24762 20562 18288 24713 21808 11613 13969
17063 13969 8624 7212 7231 2166 1502 -2044 4745 -3263 1300 -1727 -1802 7252 14084 8350 -4225
17048 -4225 -1779 9447 13114 11676 14541 7571 -4366 -9314 -5141 -2375 4239 8844 26314 46499
17034 46499 54203 57716 66676 77939 75834 73599 89702 92061 91136 102271 93840 84373 81317 64709
17020 64709 61895 66804 71379 73967 74341 68192 66731 68413 71327 80293 87665 88242 87854 74834 69397
17005 69397 61145 50168 35654 42515 50239 53869 52918 42426 30461 25796 30874 30549 22653 24448
16991 24448 24588 21134 28629 39373 29548 27114 37608 57571 69544 75610 69595 63504 63336 64356
16977 64356 74703 70689 75614 70312 64460 68463 78175 80793 68040 62143 55385 52414 52926 48341
16963 48341 51008 53401 59792 60018 52080 38318 32140 31223 20698 11988 9012 14544 21726 27500
16949 27500 30115 21570 14760 11544 13740 9475 7494 19395 19702 14209 17757 17564 17554 10092 5835
16934 5835 10480 2669 8682 15332 13615 14837 18749 11246 10441 17028 20469 8725 8265 27103 32751
16919 32751 28963 28837 20633 17492 26407 26032 11879 12109 21470 26639 29237 25162 19249 17363 5675
16904 5675 12266 17038 15825 22482 22123 13721 19726 23573 19924 9898 8415 1207 3697 9250 2152
16889 2152 5192 8094 10295 6209 -7257 -1654 11234 17812 16334 16169 21326 24423 26059 22737
16875 22737 27526 26528 26030 22560 17449 22789 25970 25857 37784 37943 30570 18075 12845 11979 18526
16860 18526 24023 30883 29049 19671 8832 2596 13784 18603 13847 14442 22124 14166 7356 9504
16846 9504 8377 -571 -4429 -3638 -556 10680 15537 5423 8115 -2083 -14503 -9212 -10651 -19729
16832 -19729 -15469 -10918 -9342 1531 2262 3436 -764 3698 4403 3730 2683 -169 -2995 -3822 -11368
16817 -11368 -9177 4471 14023 12667 15002 17225 15435 13284 2884 3862 356 2130 4086 19897
16803 19897 24434 17265 14218 13985 4364 -4849 -951 -1100 5836 16161 15879 1847 -2422 1823 7600
16788 7600 3882 13253 7511 8115 20541 29965 17491 12207 15896 7995 6141 6784 6603 3315 3680
16773 3680 3069 1763 12704 12512 9799 1317 -7159 -4559 -1869 -3197 -1514 45 6830 2507 599
16758 599 -5432 -6954 -2606 11786 2989 -11341 -889 7567 503 -4702 -10265 -140 18058 23987
16744 23987 17825 11953 6068 5027 3439 5617 7178 1465 -881 -2527 -5565 -4415 -1475 -4395
16730 -4395 -6406 -7215 -11278 -20960 -20113 -21123 -11675 -3776 -3718 -4523 -6875 -3029 -2829 -4066 2986 -1928
16714 -1928 -2888 9684 6507 2957 7951 13782 19132 14703 6305 1801 5644 3026 -386 -2129 3137
16699 3137 9901 24122 24192 11751 2741 1449 2768 11413 18288 17448 9986 6228 11756 14862 11221
16684 11221 1019 -8716 -9532 -9976 -8460 487 4780 -3103 -8783 2325 10621 -53 -2631 -4107
16670 -4107 -12187 -5398 -7223 -6958 -17817 -20007 -20956 -17087 -10559 3824 10038 6234 6412 -6820 -6729
16655 -6729 -6346 1505 13619 6367 -1995 -1756 -2328 -5552 -2418 -1633 -2206 -6507 -7342 -476 433 5854
16639 5854 8753 15128 13122 -17093 -19422 -3991 -3374 -8525 -11943 -10884 -8488 -4264 -3094 -4686
16625 -4686 -952 -2889 3737 5728 1368 4771 10846 10253 12271 10739 11228 11996 3565 -2097 1491
16610 1491 7832 -680 -4827 -12619 -18891 -14361 -15214 -9199 -936 -2570 -1396 12438 14863 12861 10982
16595 10982 581 2124 4304 4417 1631 -15234 -18237 -13602 -12947 -758 6202 2857 8709 354
16581 354 4757 4660 -9151 -15973 1691 9550 6999 -3893 -7673 -326 -5644 -9545 -8859 -7267 -11786
16566 -11786 -11835 -12306 -13688 -12458 -11727 -15171 -8373 -1125 -3549 2850 -3942 -3151 -779 1230 -3640 -7472
16550 -7472 -6932 -3783 -10080 -229 6946 16352 14575 2874 1085 1456 6887 10398 8252 7153 5513
16535 5513 1283 420 3322 -2490 -3066 -10357 -15226 -12899 1040 2670 38 -3370 393 809 2509
16520 2509 -2025 2547 7147 12331 9405 4285 -430 3404 2800 2653 5565 4449 5804 5296 10233
16505 10233 6826 525 3566 -4089 472 10292 8744 561 -4865 -1429 -8059 -11590 -2963 -3339 1689
16490 1689 -3618 -3428 -395 -1099 -10761 -12728 -9683 -2013 -1078 -4426 -9444 -12691 -11376 -5002 -1317
16475 -1317 5811 5001 137 -723 -2100 -788 4149 2690 3598 11698 16590 17790 19279 14786 10265
16460 10265 15609 7797 -4360 -8642 3801 17471 13999 2559 5394 13200 6226 -370 -1246 1570
16446 1570 1258 -2851 -3590 1216 -3754 -2696 -3506 4368 7929 2085 3122 -369 -10124 -7585 -1793
16431 -1793 6872 9758 1152 7232 6421 3256 -1730 -2715 -9287 -15549 -16693 -18455 -10077 -4313 2532
16416 2532 8773 6524 6880 8184 11350 -728 -1358 3028 4470 10513 12907 13775 6582 2578 10172
16401 10172 8670 649 -10569 -13981 -1869 7937 4052 -4299 -5151 -11432 -4437 675 5117 208
16387 208 -4495 670 7470 2097 5610 12993 9216 8880 5130 1523 -8472 -6735 -7678 -2353 5764
16372 5764 2689 726 799 6248 9618 16987 5135 3455 4255 3219 3057 -4587 -10300 -12225 -9813
16357 -9813 -8624 -8146 -10781 -11552 -10148 -5997 -3163 -2047 -1151 -664 -10777 -10997 -2070 3968 3505 3114
16341 3114 -711 -6952 -2948 7028 -635 -4233 -7527 -5950 -8089 -12460 -9106 -5132 -300 -7573 -8687
16326 -8687 -9670 -7079 -9418 -19957 -20103 -19409 -24933 -16381 -4696 4754 4189 4761 -572 -9846 -7778
16311 -7778 -4906 5633 677 -7795 -11086 -14920 -5948 5726 1209 3356 -351 -1571 -3322 6204
16297 6204 13241 6449 -5028 -7889 1456 -457 -4765 -4527 -599 -2524 -730 3694 -268 -3008 172
16282 172 4143 10327 6583 6803 -1122 -6315 -6958 -574 -1723 -5181 -838 -5688 -11693 -14740 -16322
16267 -16322 -15802 -9540 -7012 -1724 4219 7674 -5004 -6762 -2434 -5629 -17638 -16454 -9853 -431
16253 -431 1638 1645 7795 13017 18254 20587 21591 18114 2736 -2321 5670 -1651 -5703 -5391 -8644 -9877
16237 -9877 -14324 -15227 -19476 -27826 -31130 -22643 -7058 693 8134 7668 7495 434 -4170 -3022 -7432
16222 -7432 -17423 -17673 -15279 -15798 -7692 -4264 -5633 -5423 -1020 -3969 -5368 -4588 -5192 -10978 -12022 -6962
16206 -6962 -2904 -3738 -7850 -5541 -1249 1978 12510 6966 3504 -6250 -11011 -13172 -16782 -9574 -8560
16191 -8560 3177 9242 482 -4909 1 2723 -1842 -1783 -5749 -2589 -9663 -9958 -8187 -8173 -1430 2933
16175 2933 -5854 -15782 -12440 -1734 1018 7696 16309 11178 3402 -84 -3887 10 14693 9359
16161 9359 4642 168 -5375 -12822 -3118 3381 -1676 -7797 -8029 -2102 5706 3639 -933 -2866 -6086
16146 -6086 -9667 -7334 -5488 458 10888 5305 5389 -651 1932 9334 8719 8875 -841 -16090 -14289
16131 -14289 -3687 -3035 -8294 4393 5819 10476 22061 14674 8436 848 -4390 -6303 -11785 -13231
16117 -13231 -8183 -481 -3728 -4598 -8448 2013 8069 4040 9736 15251 14240 9880 -570 -887
16103 -887 9910 9074 6690 11871 361 -10722 -11444 -15300 -12227 -5888 -5424 -11970 -13297 -13127 -11948
16088 -11948 -12206 -12767 -13318 -6638 -11329 -14364 -10163 -5223 -3754 -8609 -17164 -17701 -21378 -9853 -10589
16073 -10589 -17452 -19617 -14843 -12906 -17713 -19615 -18816 -14986 -18230 -15798 -12846 -2962 -3505 -107 1137
16058 1137 -3962 -6073 -7990 -7035 -10852 -877 9334 11407 11767 7260 7406 11959 12113 7716 964
16043 964 -620 6760 3705 -993 192 -3520 -8850 -5193 -6062 -2701 3957 6167 3992 3827 6113
16028 6113 -1607 -5052 4036 13253 14091 8410 4672 4661 5164 -2672 -4599 -15866 -21389 -17335 -16712 -8624
16012 -8624 2322 -3437 -12017 -6869 -6272 -14387 -7991 2616 5756 433 -1265 -1242 -11733 -18995 -14857
15997 -14857 -9157 -14611 -13548 -1951 -699 503 14362 9876 7649 8025 9252 9568 3996 3391 10109
15982 10109 3814 -1559 -29 1704 3176 4840 9722 8813 5266 1298 -7426 -570 4875 293 481
15967 481 6280 194 -11729 -9286 -3336 -8333 -8813 -6419 -4579 -7215 -15551 -12804 -4555 7736 6539
15952 6539 8404 4037 -1397 4672 6490 2148 -5328 1562 616 -247 2879 -5447 -11083 -2113 11315
15937 11315 15131 10880 3261 1869 417 6680 7722 8804 1207 -6427 -10880 -7909 -2950 -10243
15923 -10243 -17181 -7887 -8943 -8400 -9582 -11060 -10278 -24410 -34241 -20341 -17644 -18653 -15734 -16070 -3849
15908 -3849 -1489 1060 1244 -8539 -7599 -271 2083 18152 21209 14101 11624 18583 20012 9736 -46
15893 -46 -5520 -12342 -17238 -13900 -12405 -8985 -9583 -10292 -11350 -7329 2803 7350 9547 7231 6526 -2221
15877 -2221 -9235 -13571 -15217 -8325 -8488 -6788 -849 393 -4915 -19571 -13459 -7512 -9894 -589 7509
15862 7509 1674 -6853 -14440 -8367 -12962 -11914 -8024 -6046 -9563 -9386 -6661 52 3220 6341 2169
15847 2169 6381 5288 -3207 2964 3131 8917 14916 13929 12681 10132 9670 6790 3281 -1108 -12396
15832 -12396 -15433 -16599 -14578 -1540 1914 7881 7177 746 -13326 -18228 -14607 -10595 -7329 -14092
15818 -14092 -13508 -1766 5669 11152 6460 -8824 -14160 -14204 -8727 -8898 -10773 -14337 -11012 -14028 -13411
15803 -13411 -8084 -3788 -2620 2146 -1766 -9878 -15921 -17516 -24162 -17220 -5270 7618 10199 2678
15789 2678 -2662 -9342 -9022 -12813 -3604 -3778 -3719 -10222 -10583 -6136 -5614 -7024 -2264 -5513 -8997 -6399
15773 -6399 -2063 -924 11745 7527 -3182 -4002 359 -8589 -8958 -643 6768 7543 613 -305 -4721
15758 -4721 -7801 7103 5228 -11404 -17348 -12376 -7533 -11007 -9698 -12682 -18669 -9737 1630 10694
15744 10694 556 -4944 6127 7505 -3544 -5828 -11442 -4547 1608 6185 3903 2265 1542 8431
15730 8431 13362 10815 4145 -2714 2875 3981 3625 7424 12857 12480 5580 10098 7685 1194 -1569
15715 -1569 -60 3055 -3164 -12821 -19124 -11086 -2796 -2841 2697 8936 3751 -538 -13227 -22984 -15877
15700 -15877 -12243 -7606 210 -3251 -2101 5660 10855 13175 16534 18426 20202 16223 1707 686
15686 686 1692 3213 5265 6097 5095 7485 10691 3272 -5065 -6488 -4815 -9018 1241 8906 7325
15671 7325 11757 13687 9187 6280 16056 16486 6820 -5555 -11411 -13204 -6487 3276 4349 -646 -1380
15656 -1380 1787 -1489 -151 5401 2155 4966 -2718 -9249 -17124 -14675 -12174 -7946 -10850 -3773 3621
15641 3621 4809 4214 -1695 -2149 -2308 -5843 -12654 -16698 -7055 637 5008 -735 -3945 -2354 -7115
15626 -7115 -6178 -1749 1203 3050 1347 88 1177 -4579 -2000 -8784 155 1342 -2300 622 3313
15611 3313 2251 -6528 -5812 -5492 -4258 -5591 -12839 -14182 -8705 -2382 11592 13043 4075 1778 7251
15596 7251 8683 2126 -6899 -7309 1203 2242 167 -13260 -21743 -23902 -19364 -17776 -16368 -9719 -6901
15581 -6901 -5356 -672 3431 3110 4030 3711 -2135 -238 2809 -3681 2321 1803 -15316 -19193 -22791
15566 -22791 -27622 -23525 -17203 -8471 -6652 -18393 -24067 -17471 -13667 -13691 3224 13539 15147 13121
15552 13121 14489 13782 11271 4565 -8970 -11814 -7260 -10077 -13570 -10168 -10223 -12681 -20925 -25400 -17605
15537 -17605 -5001 4903 -8462 -19231 -14118 3283 3633 -4879 -3904 -1944 4418 5446 6075 -5810
15523 -5810 -8650 -2497 2992 -2755 -8408 -12341 -7285 -3558 -6028 -2406 -2863 -417 -6882 -14251 -15247
15508 -15247 -8099 -1376 -8915 -18253 -8237 3100 3984 2427 5840 7919 9632 -7149 -7683 -245
15494 -245 -2159 -3990 3361 -4164 -14769 -9755 -14424 -2927 -3877 -11264 -21406 -10766 -2072 959
15480 959 1321 -1865 -1168 963 4895 4941 13688 14690 1473 -15530 -8861 6126 2500 3786 6033
15465 6033 -21 125 -3100 245 -2537 -10622 -12060 -15243 -19099 -17423 -19647 -21356 -16766 -5988 -1849
15450 -1849 -5473 1709 8637 6308 7650 2681 -12558 -13881 -6543 -1356 -8854 -4840 -4607 -3281 -6304
15435 -6304 -13752 -18530 -12541 -22132 -20549 -11218 -8784 -5875 969 5334 1223 -3329 12312 14884
15421 14884 2651 -10448 -10074 -7113 -4971 -9182 -8700 369 1616 -1989 -10674 -7331 -4357 -1157
15407 -1157 -1249 -2208 -3565 -10363 -13647 -6096 -2735 -1916 -10448 -7707 3957 6976 3675 2181 -2373
15392 -2373 -3395 -4270 -6601 165 1464 -4008 -8676 -6417 1236 1343 -955 -708 -5798 -10721 -4216
15377 -4216 -13360 -13054 -8349 1522 -1152 -7836 -11654 -1318 -3338 -10541 -13842 -10252 710 10106
15363 10106 3867 4467 7152 -2075 -13159 -19534 -7903 -4187 -6149 -8182 -13158 -16522 -14557 -12385
15349 -12385 -12252 -3550 -4012 2145 6896 -4653 -7722 -5383 98 998 -2194 3114 10034 12476 1392
15334 1392 -6730 -11071 -11357 -12512 -15209 -15615 -5497 -1786 -1441 -2227 7415 9964 7037 7835 3564 -4214
15318 -4214 -568 5627 3848 -6399 -5752 -15791 -17156 -2753 7252 6129 9086 12023 13054 3433
15304 3433 385 4805 4113 -8343 -22749 -26987 -12672 -7697 -9110 -6297 -10039 -8128 -1334 -743
15290 -743 -12011 -4144 3776 784 72 -1848 772 -6760 -6683 -5357 -11504 -12102 -1763 -2300 -9488 -18021
15274 -18021 -21869 -6831 2238 -5930 -11324 -17303 -13797 -9769 -6349 -1840 -2623 -3565 -1556 3690 6455
15259 6455 -3152 -5875 3824 1084 -6935 -7727 5073 4815 4416 7061 4807 3520 -451 -2464 184
15244 184 -2689 -6466 -11042 -14165 -4876 -1118 -4796 -5147 -13364 -14122 -5265 -3707 -268 -4902 3447
15229 3447 6953 1383 -5416 -3625 -1393 -883 -3626 -9398 -132 -1420 -1091 441 4816 -2929 867
15214 867 352 75 -5143 -6253 3620 10259 12509 8867 6427 -945 3278 20 -8336 -14789 -18255
15199 -18255 -12886 -2032 -5717 -14718 -11901 -8808 -16173 -18829 -27311 -13845 -8437 -11341 -12662 -9253
15185 -9253 -4912 4868 10858 13261 -2434 -3738 -2452 -6021 253 -251 -3433 -310 -8493 -13791 -11804
15170 -11804 -15638 -22690 -17157 -14140 -3025 -753 -3902 -7094 -12092 -9531 -14349 -17965 -18691 -23333
15156 -23333 -26662 -23814 -22178 -16012 -11059 -10274 -9074 -10924 -14173 -7074 -2110 -10149 -8553 -13286 -15197
15141 -15197 -18283 -22872 -14096 -7264 -8822 -4963 6396 6531 6328 8751 3356 5851 13457 23003 26298
15126 26298 24102 17718 10709 -6102 -2861 -2324 429 -2543 -8701 -9565 -5164 -4200 -8831 -7435 -5383
15111 -5383 3018 10743 11696 17745 17455 8376 -601 7847 11542 6457 1118 -4845 -10029 -9162 -14633
15096 -14633 -13614 -19197 -10655 -4745 -8559 -10455 -17772 -12070 -2653 -6456 -16952 -10012 -12055 -19868
15082 -19868 -15235 -12667 -5531 -6262 -9988 -11037 -8633 -9910 -12240 -18888 -21525 -13700 -10478 -8822 -8047
15067 -8047 -5115 -4077 -7659 -12565 -14312 -14304 -14020 -14811 -14914 -20049 -20838 -28391 -27939 -19100 -17123 -15204 -15653
15050 -15653 -11948 -18476 -14539 -5303 2845 4649 4170 1303 -654 -2395 5733 8626 -4542 -7506
15036 -7506 -3878 -3470 4684 12754 3758 -3941 -1884 4341 10271 6941 6704 5494 2131 1753 -8149
15021 -8149 -13133 -14772 -20262 -20335 -11412 -10242 -10740 -2670 -5798 -2598 -1430 2358 1292 1918 -7897 -16286
15005 -16286 -16036 -8961 -3981 -7758 -7795 -8352 -18256 -25095 -17670 -7834 3768 5246 5763 8868 9158 13233
14989 13233 13630 12392 6500 1957 -5306 -12181 -11408 -8943 -13131 -17130 -10340 -983 4352 -584 -16
14974 -16 -3759 -4185 -1661 8156 5551 2712 -4184 -10795 -8127 -3461 -11767 -22397 -23871 -20745 -20377
14959 -20377 -8308 -3199 -2032 -2183 2916 -2661 -9933 1851 2179 145 -2424 -15802 -25533 -33972
14945 -33972 -29304 -15108 -14616 -15702 -14496 -16756 -10171 -10204 -9743 -11860 -10344 -3695 -1510 -4961 -7459
14930 -7459 -12105 -10900 -204 5263 5182 4406 9436 18613 21929 11274 2213 2310 -4243 -1661 -1232 241
14914 241 -2210 -12318 -18554 -17022 -11004 -473 9290 5520 5428 966 812 -2228 -41 2325 -1198
14899 -1198 -4250 -9233 -16377 -9330 -5988 -7911 -12006 -9431 -4859 -4342 -11450 -11225 -2960 -5737 -20016
14884 -20016 -21182 -17536 -13419 -3824 -5756 -6696 -13330 -12983 -18271 -26311 -19821 -21962 -22101 -23611 -20327
14869 -20327 -10862 -8759 -6615 -1695 -5247 -8787 -3103 13353 12875 -4833 -6183 -7269 -9644 -16226
14855 -16226 -14923 -5984 -2193 -1063 -2429 -3142 1606 4558 -1788 -6672 -17285 -19530 -12754 -10391
14841 -10391 -13702 -12220 -9487 -8875 -3408 -5364 -4645 -6306 -10813 -9201 -7434 -7877 -6725 -4252 -8449
14826 -8449 -8215 -12022 -8159 -1065 8814 1583 -7100 -2645 -5558 -8478 -2871 7536 11901 5471 2319
14811 2319 -31 -2225 -7062 -3865 -6637 -10926 -11371 -2746 -207 -4555 -16605 -9323 -4192 5647 10408
14796 10408 3265 1473 -5236 -500 17607 28861 21904 6172 -3081 -2352 2405 -305 -7420 -7693
14782 -7693 -6095 5457 1614 -1820 -4140 -6923 -22461 -22373 -23931 -18565 -13633 -16559 -12263 -5369 3439
14767 3439 17414 22604 16531 13155 19729 10330 1965 2078 -2530 -2744 2776 11344 12471 10870 4564
14752 4564 1134 -3502 -9666 -11465 -8823 -5201 -3893 -1086 -5366 -3596 865 1020 -259 6555 4612
14737 4612 3691 -6283 -10143 -10509 -8276 -12803 -8319 -944 -3244 -16094 -16091 -8721 -10230 -10919 -12198 -2395
14721 -2395 -7845 -9819 -1437 -352 793 -2803 -9418 -12119 -17106 -4495 22 -6299 -10218 -11003 -11803
14706 -11803 -11877 -5138 110 7906 10762 7161 1050 -7794 -12919 -3806 -5049 -8292 -18135 -16741 -10521
14691 -10521 -5639 -9812 -5155 -3769 3607 14546 12754 12458 3231 6588 18275 16253 13473 13144
14677 13144 15980 17938 10401 1838 -11446 -13583 -4562 5303 6793 -547 -3957 2762 5386 6737
14663 6737 8714 13877 9304 4396 -835 -1905 -5505 3961 5453 1835 -1469 -2396 -4153 -5046 -1745
14648 -1745 -5098 8390 8207 4278 -2495 -6818 -14026 -10098 -9151 -7058 -9887 -10232 -11709 -10629 -1602
14633 -1602 -2773 3914 982 -500 3104 2770 -7985 -8935 -9820 -8540 -5116 -10917 -14921 -6194 -1238
14618 -1238 5679 9437 -1888 -11501 -10880 -2950 182 -2664 -2119 3853 3655 6007 1440 925 1793 2897
14602 2897 -2367 -1696 -424 1158 -406 -1589 -14245 -15390 -3701 -3908 -12472 -20039 -19945 -9976 -4676
14587 -4676 2727 5113 7244 5715 6319 5778 3009 -2397 -2242 -6455 -3537 -7957 -4765 -1537 875
14572 875 -252 -3573 -11812 -13798 -15078 -15903 -14759 -8463 -11362 -13642 -9975 2885 11420 13333 17107
14557 17107 15124 8844 17130 22823 13722 11469 16339 11351 9731 3506 589 3514 6181 6851 3739
14542 3739 3028 4092 7760 2574 1672 5290 -5429 -15103 -9830 -10998 -1658 3989 13821 10929 14520
14527 14520 11694 6381 4520 3557 11637 8129 3849 3980 -1727 -4756 377 -11135 -15625 -10243 -10818
14512 -10818 -11621 -13471 -16325 -13651 -11739 -14717 -21382 -24819 -15024 -13387 -15941 -17176 -11031 -2873 804
14497 804 -1119 -3866 -3060 -7971 -12823 -17889 -23750 -14868 -9495 -7889 -1194 -4564 -6047 -6286 -3127
14482 -3127 3046 8980 8932 1690 -1258 1775 -3799 -9274 -9281 -9736 -12473 -9221 -6191 2360 -467 -17202
14466 -17202 -20052 -6485 -6723 -17511 -22008 -24501 -19089 -16643 -8498 4309 5605 -364 -1836 -8695
14452 -8695 -12218 -12213 -8973 -4216 4803 10938 1709 -9660 -14742 -9542 6896 7810 4819 2968 1212
14437 1212 -637 -3737 -5111 1164 6108 6192 1525 -3640 -11642 -18042 -8893 71 5521 5874 2318
14422 2318 -589 4523 -129 -10255 -9880 -1036 -2751 -4617 -4706 -8010 -12627 -12447 -11152 -10197 -1463 4078
14406 4078 -1366 -5066 -8990 -9084 -4011 -1209 659 -7605 -16935 -19693 -15380 -16128 -7411 2951 -498
14391 -498 9728 13555 4831 -9568 -14528 -11449 -7497 -8616 -9746 -14861 -10436 -10967 -4272 -6071 -930
14376 -930 -7296 -6088 -2 -6984 -17289 -10970 -2963 119 1786 5906 7396 6826 -739 -9327 -6230
14361 -6230 -5901 -9022 469 -4970 -5144 -10812 -14301 -9803 -16922 -20853 -16871 -15620 -9232 -6886 -7091
14346 -7091 3607 9008 -2612 -8565 -19881 -24862 -18689 -15021 -14963 -17713 -16986 -19506 -13033 -15766 -21409
14331 -21409 -13864 -14113 -12503 -13354 -20826 -21902 -17506 -5233 4245 3686 -1255 -4906 -9437 -20945 -12973
14316 -12973 958 -1720 1424 5793 3974 3559 -5342 -7795 5916 5321 -1450 -8709 -744 7304
14302 7304 4808 -1485 -14431 -18929 -9770 -4068 -5019 -10954 -9302 -2671 -8255 -17212 -20089 -7210
14288 -7210 12746 21170 14485 13173 5238 718 -2978 -2057 5685 8667 6917 7057 6728 4139 5673
14273 5673 5408 2214 -11918 -13869 -18194 -17962 -11250 -784 256 -632 -1887 -2662 -4515 -3049 -12651
14258 -12651 -16653 -17559 -8419 -8090 -9264 -14892 -18198 -8525 -14544 -11093 -6036 -6153 -10114 -22049 -11123
14243 -11123 -3170 -10885 -8693 -3639 -3211 -2874 4893 7603 3596 -6561 -6879 -1958 3695 4237 3028
14228 3028 2370 110 6215 8522 4525 -13812 -15907 -9367 -2250 -3692 -3815 -4794 -7311 -10299 -10388 -18146
14212 -18146 -13313 -6543 -2884 -4826 -6102 -8610 -11945 -6105 3829 5048 6198 5950 13979 7955 13760
14197 13760 22563 13851 4783 -7197 -13453 -13914 -6752 -5325 -10638 -4010 12567 14138 10965 1487
14183 1487 2872 3235 -221 -2318 -7962 -5139 -5580 -3701 -8546 111 8752 17226 15874 3571 -670
14168 -670 -4431 -2914 -8032 3281 3363 9254 3951 6442 21388 23976 15587 17690 24483 26047 23598
14153 23598 25346 26340 44355 65160 84499 104505 129933 159586 183506 192150 204580 211113 205131
14140 205131 187560 155188 124063 116241 102262 77418 58326 39254 24920 19799 18829 26291
14128 26291 30970 27230 13744 11455 21428 23451 11809 -3922 -10354 -10107 -4766 -4645 4051 4039 9893
14113 9893 4500 -3659 2396 544 4331 2585 -1157 -5214 -8979 -8602 -3532 -880 7877 8058 10784
14098 10784 19757 13028 3496 -6793 -10057 -5911 -4576 -3073 8717 3816 0 -4611 -4400 2017
14084 2017 -6370 -14449 -11390 -12646 -15967 -20410 -16990 -16277 -18708 -13987 -9177 -13836 -13859 -9876 -18283
14069 -18283 -20356 -10286 -6238 -7012 -14319 -11859 -3919 -11273 -17542 -16244 -14929 -6453 -7153 -9647 -9362
14054 -9362 -9248 -2478 -522 -9636 -11373 -8226 -9172 -10235 -13621 -11126 -745 2660 -959 -5425 -12347
14039 -12347 -15238 -20171 -31802 -24497 -14419 -12725 -11749 -3590 323 -622 -441 2238 2121 1830 10302
14024 10302 6262 4108 7923 -1300 -7306 -10475 -4320 4275 7866 -1621 496 6486 -5939 -14679
14010 -14679 -16929 -15306 -1617 11691 10589 -4041 -8266 -2135 3811 7148 902 -87 2072 903
13996 903 -4897 -6578 -3204 -6715 -3610 5969 1891 149 4758 417 -7450 -12156 -8723 -1103 -7193
13981 -7193 -13923 -12722 -13904 -6549 461 7153 3627 -5253 -8705 2498 4033 8816 7070 -978
13967 -978 -4147 -12249 -14524 -5046 -11526 -18908 -11001 -11985 -12572 -3839 230 4261 5373 5187 1500 -2852
13951 -2852 -2379 3285 5969 2648 1379 1898 993 -4312 -8641 -7910 -4888 -17657 -24351 -18884 -8379
13936 -8379 -2287 -3978 -7900 -13755 -10586 -8587 -16592 -13780 -12010 -3597 1602 -5164 -7752 -7342 6047
13921 6047 5919 2964 -2791 -10101 -8125 -6131 -12526 -14816 -18628 -17100 -25917 -21827 -18556 -11192 1037
13906 1037 6695 8726 6363 7313 5884 -561 -6482 -418 -2550 -5017 -10923 -15539 -9371 -10566 -17766
13891 -17766 -21852 -20836 -12735 1677 -1400 -3789 -1600 4933 4670 -720 -2837 5061 8801 6846
13877 6846 2783 -119 5089 4023 -350 -1271 456 1086 6773 16646 8143 2530 607 1400 78
13862 78 -4716 -4807 -4348 -1289 4492 -2948 -776 3083 3172 14766 20164 12895 5890 3047 -5500 -9485
13846 -9485 -12792 -15322 -8510 -4732 -3695 -1975 3982 10913 14456 18647 21949 14451 6135 8075 16903
13831 16903 20141 13316 5034 7280 11194 17441 23507 12386 6568 10926 15853 16183 16973 12702 13691
13816 13691 15481 21862 21954 29817 30954 26626 18744 13076 4145 912 13628 4450 -1621 -4604 508
13801 508 6771 14300 8723 1569 -728 2338 -4308 -10693 -2207 -1906 1764 -4363 -10919 -13683 -12148
13786 -12148 -11153 -7673 -6055 4346 4085 -681 1215 15641 17838 11955 6381 5850 9866 4495 -4369
13771 -4369 -7793 -11805 -12927 -12060 -6514 -5282 -10647 2254 12900 13833 14747 7312 1449 -1753 -8941
13756 -8941 -6893 1965 -3814 -12473 -15689 -7192 3671 8717 6250 5594 6657 427 -7807 -2216 2249
13741 2249 2905 5778 1272 -7845 -26709 -25364 -13723 -4314 -5659 -9180 -9914 -4479 4834 9509 1181
13726 1181 2387 15827 15245 3107 -8164 -11880 -7468 -10673 -6886 44 4221 7224 14230 11107
13712 11107 6 -9167 -5801 -7472 -5327 9583 18554 24486 20922 4205 3971 10960 3318 -7529
13698 -7529 -18155 -19453 -16317 -6463 -4222 -12361 -2645 9592 3748 -186 10352 9383 237 5006
13684 5006 12287 10551 -175 -14246 -20585 -18598 -8651 -6615 -708 -45 -2926 -6779 -7507 -6297 446
13669 446 2617 6167 12704 14237 7691 2805 4396 1295 754 -186 -5356 -2631 -9074 -8342 -4163 -8070
13653 -8070 870 400 -3711 -6305 -8759 -3863 345 1129 -3391 -4213 -1685 -1550 -4285 -4164 624 -4481
13637 -4481 -16495 -18457 -11951 -7425 -4276 -4691 -4126 -5065 734 3789 291 11610 16712 1901 -7571
13622 -7571 -4728 -1686 4701 15783 19322 22691 15500 6497 6616 8015 4671 8889 9787 7229 8240
13607 8240 -1490 -16871 -18426 -17279 -7553 -3207 -3581 1247 -1663 -5998 -2053 -1519 -3091 -1777 3460
13592 3460 2107 7056 4459 -2043 -8171 -16544 -21272 -18382 -4954 3499 6394 1759 -5099 -16518
13578 -16518 -15552 -16909 -14195 -1850 4948 4559 7574 -7291 -15439 -21966 -16350 -12752 -19799 -20913
13564 -20913 -15286 -18933 -24256 -15870 -11518 -5086 -1175 3292 -2875 -1889 1506 31 -8245 -11162 -2113
13549 -2113 -4059 -2320 688 -9178 -10828 -8654 -5241 -1292 -10926 -16596 -7666 -992 -1850 -11234 -12816
13534 -12816 -21459 -25651 -22603 -16130 -12236 -15274 -25013 -25852 -21883 -19298 -17706 -16843 -16672 -7876 -12939
13519 -12939 -18297 -15077 -6942 -13769 -17218 -10816 -13067 -14371 -6406 -2263 -5190 2054 -4589 -16086
13505 -16086 -17402 -3897 3419 -477 -4089 -7409 -1656 4607 -1522 -7990 -6028 -8197 -5257 -2511
13491 -2511 327 -947 -1845 -5155 -6859 439 -126 -6424 -8449 -3130 -6702 -11133 -13216 -12718 -7532
13476 -7532 -14637 -16124 -6785 -3490 -4561 -2832 -5990 -15037 -12658 -4345 4357 2504 839 -7810 -8253
13461 -8253 -9121 -783 -4463 -6487 6516 7601 -695 -5188 -2594 -4153 4940 9596 10155 2754 5658
13446 5658 147 -7126 -10010 -4079 -5337 -20448 -16129 -13733 -10747 -11448 630 12965 17555 16129
13432 16129 7126 -231 -6262 -14317 -15008 -16335 -8953 -4162 -7540 -9967 -777 2884 14021 15026
13418 15026 8251 1799 2274 5917 4575 3859 -4824 -178 1988 3794 504 -5030 -6435 4134 -1236
13403 -1236 -11159 -8330 -10674 -19027 -27904 -7872 2751 85 1665 -6236 -12118 -15738 -20622 -11138
13389 -11138 -8411 2548 10641 1595 -12278 -19497 -20096 -18409 -23694 -20019 -12540 -8774 -10702 -13937
13375 -13937 -8930 -9540 -11279 -6920 -8327 -8008 -9299 -13605 -21053 -16318 -8623 -13789 -7647 -16627 -15060
13360 -15060 -3395 -2352 11913 18761 15696 14331 17944 14952 8187 -2801 -8709 -13853 -16939 -8715
13346 -8715 -8780 -15282 -12841 -8106 1096 8042 1378 -6597 -3167 5017 5244 1812 6209 15732 5899
13331 5899 6836 2290 4212 9641 5019 3659 2103 -657 -5483 -7283 2362 4876 626 -1652 -4808
13316 -4808 -10369 -18803 -14773 -6492 -5864 -3730 -303 1099 11361 8880 97 -3863 -8714 -10513 -1425
13301 -1425 5822 -1690 -4312 -7954 6421 13104 11501 8954 15885 14934 7501 9406 1578 -4719 -5884
13286 -5884 -10373 -17258 -12268 -7382 898 -1386 3233 5567 -947 3852 3051 -748 -132 9556 11088
13271 11088 1794 -920 -2357 -8125 -7701 -8119 -5788 4019 9655 4623 576 -1353 -1223 -1600 -12505
13256 -12505 -20538 -23568 -18163 -12257 -6685 954 -2144 5544 1042 1109 2920 755 -1670 -7235 -6976
13241 -6976 -4091 -3341 -6342 1166 2802 -939 1851 8061 12227 -103 -5598 -5151 -8212 -3718 2336
13226 2336 8975 3530 -825 -7331 -2975 -4404 -14978 -15184 -4556 -2361 3522 8956 3770 -12381
13212 -12381 -12345 -13275 -15684 -19117 -21697 -21801 -13499 -11455 -8909 -5655 -3128 618 -4876 -2888 -2241 -7678
13196 -7678 -7196 -5662 -12212 -18705 -14207 -13110 -12593 -10831 -8303 -1915 -2927 7193 11248 5635 1332
13181 1332 -3295 -7683 1813 9749 20316 23372 26892 29147 28903 34824 54680 85103 117678 146336
13167 146336 145650 127442 101655 68452 53231 41789 29505 16887 3326 -3981 524 11877
13155 11877 22501 14829 21527 20737 11212 15096 12484 8198 5440 4526 8223 5012 9968 9885 1159
13140 1159 2821 14524 16616 12631 12818 13339 16404 13974 16421 19092 17039 27173 45632 71568
13126 71568 113940 184703 273033 362740 410742 383061 300976 215375 158743 114014 75540 62282
13114 62282 61286 54570 45034 38056 33052 26718 29852 25038 25915 21618 17466 29691 42310 43163 44392
13099 44392 47367 48519 53223 47229 50825 60343 54747 51976 71846 87369 105702 131496 166969
13086 166969 208886 253013 298141 375592 466965 573304 696536 819531 932602 972115 937154
13075 937154 830616 690884 557395 438440 340454 274338 232781 195217 158342 129698 119196
13064 119196 106686 91920 77422 71961 81178 87034 74886 62489 47232 41215 34744 44100 41557
13051 41557 26921 16102 20291 26577 23420 20290 20959 17843 13677 9792 12993 31121 32786 25667
13037 25667 30549 59657 83909 112200 141186 151940 158000 143346 112126 87303 70772 51878
13025 51878 38437 25521 21800 25444 30644 30674 27546 26011 28807 27644 23173 18972 5352 -1317
13011 -1317 8962 16494 20553 23432 29478 20937 19722 20266 27047 23699 22713 16972 19900 17515 14114
12996 14114 9862 12710 11082 14493 14798 9140 11172 17574 22078 21388 17958 11623 10874 11039 10665 13832
12980 13832 9287 9699 4580 4706 12612 8069 12954 17091 15685 19530 15534 3786 4764 503 6721
12965 6721 13941 16411 20592 24975 23579 13666 10770 10460 6351 3346 -1961 -11541 -3805 12563 9365
12950 9365 3463 106 3334 6259 5716 -372 4087 11284 12125 1876 2247 5218 11211 10932 15326
12935 15326 23461 20164 14312 3096 11735 9683 10017 12493 803 3103 12358 20175 28481 28872
12921 28872 40158 46753 45693 44630 53555 62936 74090 82587 90309 95639 92293 89565 91671 84395
12907 84395 78320 76780 71663 59805 54461 46518 46456 40894 22108 16710 21485 20321 17745 26794
12893 26794 32376 32142 32806 39351 39506 38651 39858 38674 38855 49322 65846 64666 69596 71752 75445
12878 75445 70197 76034 83296 82504 65903 52287 49876 52366 56988 53972 50638 41674 36532 26557
12864 26557 25949 31703 31389 29518 28322 28861 20524 18707 13549 12119 8987 13003 20141 26339 33573
12849 33573 40527 56414 56009 51472 50219 52466 34959 40785 47527 38219 38200 35093 24416 22708
12835 22708 24033 24811 24836 20111 16754 22805 17512 17957 26776 33119 29880 24864 11937 4886 5789
12820 5789 12016 6861 5571 12986 16593 17229 20866 42145 50806 51743 69000 80904 77409 85180
12806 85180 89420 92409 81584 74915 79422 71818 67465 72449 80823 77971 71014 65636 63249 61460
12792 61460 58262 58991 60408 61340 62490 66880 70553 69681 71609 77437 84727 84681 91021 108108 100531
12777 100531 95933 103584 107325 111325 107138 102714 92276 96906 97170 96017 96917 92883 89115 89112 81878
12762 81878 83138 91205 99560 105421 112513 113866 130585 139862 145046 139753 137399 147744 148149 145534
12748 145534 137584 135598 148032 153277 151826 149705 154203 148149 153909 152253 166475 170254 166009 177381
12734 177381 191210 204854 213678 215374 225742 239688 246204 256624 268023 278029 292472 298220
12722 298220 304067 315747 325943 338665 342139 352301 358271 359211 376401 395741 410263 418719 421329
12709 421329 437067 450427 466567 482735 493215 506152 526954 549990 572486 599327 631870
12698 631870 663511 708395 745974 786020 839554 899626 964041 1019088 1080123 1136377 1211114
12687 1211114 1295724 1400175 1522995 1665421 1822520 2018095 2273015 2581044 2948157 3397169
12677 3397169 3935200 4555888 5255365 6035449 6886009 7832545 8920564 10253192 11974022
12668 11974022 14326187 17697469 22618576 29550104 38544271 49193410 60997453 73415572
12660 73415572 85435348 95562259 102557671 105912973 105364617 100745017 92523334 81960371
12652 81960371 70389109 58742876 47743240 38097026 30294274 24394846 20099174 16995066
12644 16995066 14693270 12910019 11457273 10230634 9155716 8181143 7300095 6509250
12636 6509250 5807761 5194329 4669345 4210289 3818374 3486031 3202970 2952578 2726551
12627 2726551 2528846 2347884 2170085 1997444 1846804 1711046 1579360 1461934 1351593
12618 1351593 1259414 1174707 1101697 1036088 970595 917489 867162 821651 772044 726628 684992
12607 684992 634015 601312 563114 536607 516228 494997 484355 469751 450646 429352 408079
12596 408079 400134 392048 393133 376331 357679 347463 335726 318656 304365 300196 294413 290769 287877
12583 287877 287769 284891 278129 268170 259381 252405 247068 246413 260430 259314 250150 255981 258219 254349
12569 254349 246961 245110 244594 248388 241968 241711 241765 227037 215836 221714 215640 205479 203352 201220
12555 201220 195856 193895 190423 193086 186352 180185 178484 169440 156981 152060 150132 143937 138617 141663
12541 141663 141130 122568 115050 116640 118665 126150 130606 136621 137723 149044 159903 170211 178510
12528 178510 190038 190441 182060 181863 174772 171456 171535 175911 179152 187249 202612 215889 218035 211197
12514 211197 211371 207198 201811 193648 184563 165710 152380 151600 147230 141531 143351 143365 132397 140765
12500 140765 162820 170500 165736 180214 190813 185213 182041 180704 178735 176041 171859 158466 149198
12487 149198 146774 143907 137285 134254 132479 133431 126806 118683 103561 96624 89593 95291 104637 111740
12473 111740 112902 115694 125531 131397 119726 126718 123188 123227 132205 140152 149253 150109 146708 140861 135391
12458 135391 133338 131484 124361 116259 109362 112300 115109 115674 103628 99498 100642 94813 86638 77790
12444 77790 71646 71412 62622 61864 66359 60786 54254 54348 65861 74914 70853 63659 58452 62543 56974
12429 56974 56014 70160 74593 83151 82745 84075 90895 93024 83611 84492 86695 90564 102474 103676 103921
12414 103921 107699 114753 122724 138753 157821 179591 177285 169809 169820 173501 168145 156913 150392 152385
12400 152385 147613 129708 118217 111895 103478 100012 107255 112551 108258 108690 111018 109243 107565 109624
12386 109624 114628 127945 138875 153724 164261 180347 206216 243147 273651 309437 348217 392656
12374 392656 435272 473787 496450 500564 507009 489522 449538 409000 364832 329920 291217 254419
12362 254419 227955 206994 180900 152579 143213 145620 146722 144024 145103 144646 133293 124565 129624
12349 129624 138714 137270 127247 107871 93997 84082 84396 90304 91110 83463 67785 56519 49961
12336 49961 48429 53203 50488 39984 38663 42182 49723 50067 46592 37652 40318 51879 43186 35859
12322 35859 42986 43741 43498 38817 33030 23514 15345 21869 29294 28311 28416 38985 42955 42077 37877
12307 37877 41526 37512 31092 39659 50142 51216 46116 39220 31735 25888 19675 12833 20654 28316
12293 28316 38342 38884 33495 31449 28074 37151 32421 30543 50371 49249 40128 35985 42712 54477
12279 54477 57905 45502 36902 32341 36361 41286 46363 46951 46094 49530 50072 50230 49464 43122 21128
12264 21128 5946 12726 33166 36182 25717 20603 29451 29444 25627 20741 22318 26558 34040 43984
12250 43984 48335 52144 58198 63605 63639 78067 86112 100486 99533 101198 131621 160784 190005 224103
12236 224103 272202 328306 401688 475009 538646 586718 610845 618474 593654 554611 495926 433336
12224 433336 371714 314595 263953 235605 212197 187911 158165 136995 122241 109988 103936 89245
12212 89245 78191 68979 69550 71954 70739 64464 59559 66532 57498 45100 45397 48774 47898 41611 43554
12197 43554 44110 38992 39216 33896 35577 30912 31309 21400 20054 27432 40391 33608 27841 34138 40957
12182 40957 41776 44836 43563 43847 45275 41142 30896 26915 24758 24573 14423 15064 23128 19509 7583
12167 7583 274 720 1680 5480 9572 13004 13948 21236 20833 12787 9118 4582 5605 18165 25481
12152 25481 16489 19517 20822 26666 30265 22531 18064 21776 12965 1188 5259 10005 14807 9294
12138 9294 617 123 2104 -1564 -3628 -7897 -15542 -736 12788 13025 -697 -3232 4880 13574
12124 13574 12906 15632 20233 21922 11228 9981 8311 17512 25478 27527 29450 29480 26324 15450 17697
12109 17697 21798 20646 18408 30689 34715 25660 18018 12856 11953 20648 19878 19302 20805 10231 5792
12094 5792 42 -2201 -4982 -4353 3717 10374 17235 20162 10092 3350 5463 9435 17726 21814 21831
12079 21831 16616 9567 9148 11764 7457 6697 10312 2507 -2907 2132 1033 -2997 8829 15107 11643
12064 11643 18584 17639 23781 21051 11855 2454 -8211 73 -2333 -6430 -2270 8728 13201 16990
12050 16990 28664 28900 25967 17912 12823 13461 10666 14365 13129 3093 8759 11940 15254 13370
12036 13370 4481 1806 9896 14824 13282 9644 2487 5214 12423 12371 8270 643 4639 6977 9652
12021 9652 198 -1709 6567 10680 7328 2832 -3214 2072 7367 7805 6028 -10266 -4126 9962
12007 9962 13899 25362 22718 13334 17483 11774 6249 12997 13866 8917 -653 -5092 2081 10929 16904
11992 16904 25123 21972 3200 -3553 388 4748 3642 2884 6328 4442 7264 16765 18698 19625 14992
11977 14992 11174 16244 8647 834 -8987 -10537 -8580 -4816 3840 4694 7040 17696 21124 21708 8106
11962 8106 1523 8296 17761 20893 16252 21145 25395 25652 20642 12155 -4896 -6264 -1591 -4454 -7981
11947 -7981 -5431 -271 -3793 -6877 -6039 -8793 -10028 260 8802 10225 3044 3221 8539 8298 277
11932 277 -5682 -895 2901 -6018 -3685 16 7669 14764 18757 24466 26529 19089 9004 11333 9008
11917 9008 15360 12316 3736 7955 7625 4749 -953 240 -5554 -5502 -1908 2316 -1688 -10549 -12993
11902 -12993 -11413 -3496 -251 -654 -2480 249 -36 -6297 -12062 -6171 -896 -2861 1365 7296 13030
11887 13030 12324 14391 7680 -2725 -8727 -2245 3036 -7555 -8384 -2839 -521 8088 4200 4224 12113
11872 12113 3528 3483 6326 3788 -2148 4142 -1864 -3568 -743 8919 3876 -4068 2511 2326 1648
11857 1648 3190 4589 9133 8063 3694 3204 5204 314 -3334 -8254 -7089 -1968 4641 7687 12047
11842 12047 16367 23246 24305 25874 33071 49543 74689 86868 84722 88799 94035 85832 65168
11829 65168 43092 29355 26156 18397 14236 13528 2984 14 4057 -462 -5830 -17746 -16639 -7959
11815 -7959 7240 9668 5759 -64 2395 11860 11659 9020 11077 8701 7358 4794 4771 2130 435
11800 435 5487 9026 14057 5575 -12000 -15647 -6297 1892 -7415 -11426 -4214 -1047 -2899 -5837 -5722
11785 -5722 -6953 -11100 -3490 7597 6995 -3143 -16900 -15537 -19206 -21123 -20372 -13350 -15935 -5335
11771 -5335 5523 6419 4807 635 4110 7431 7726 -487 609 -4438 -6835 -1496 3859 5299 6354
11756 6354 1800 -3284 -6518 1991 7156 5962 -5435 -9033 1683 8921 9481 13945 13076 16936 8089
11741 8089 4431 1106 -401 1966 3994 2617 4007 6204 -2919 -10723 -15541 -15844 -10618 1361 10253
11726 10253 10806 7372 5270 -2226 -1042 3528 5185 -2138 509 1144 3330 1026 6887 12517 8953
11711 8953 10227 11870 8456 -3783 -12744 -17110 -22352 -14565 -204 -339 3403 5234 7796 7911 1666
11696 1666 -1566 -1423 7984 7926 6428 -1141 -566 -3111 -4301 -995 4640 3872 7083 6990 8573 -2585
11680 -2585 -7872 -9941 -8610 -1590 -5343 -5884 -9459 -8769 -7830 4018 9638 9287 1907 -1345 -8581
11665 -8581 -4306 1945 -1311 -2692 5369 7922 15748 11536 4760 10400 9673 9007 12681 12063 14259
11650 14259 18006 22052 16705 1325 -5380 -8539 -6934 -5640 743 2143 6021 12906 11654 4976
11636 4976 6108 7320 9291 10665 9372 10730 11512 5798 2916 -3353 -13747 -9885 -6659 -10179 -11228
11621 -11228 106 10675 12052 10692 13649 19961 18687 10156 5243 -907 -3655 1206 1789 1450
11607 1450 1180 -2784 2209 3880 3241 5780 10984 11960 6299 6199 6264 7620 663 1412 -507 -460 11757
11590 11757 8872 -252 -8248 -13449 -20246 -17923 -9543 955 1030 -2856 1873 3664 -578 -2288 8093
11575 8093 14399 9673 4895 3863 123 1753 5129 5330 2060 -12556 -7217 135 5296 3976 5238
11560 5238 12281 13037 2207 3218 -1568 -7748 -3553 -7764 -9427 -1099 4363 1991 2517 10557 10329
11545 10329 -3035 -7137 -2813 -3845 -3928 -9357 -14727 -13744 -16646 -6034 1365 -3847 -5952 -10202 -10517
11530 -10517 -7661 -5390 -8430 -4705 4168 7754 13041 22822 11665 702 -3189 -2313 -7638 -21548
11516 -21548 -19972 -6134 7497 6286 12597 13636 20020 13330 9419 612 -8697 -3582 -5918 -7073
11502 -7073 -1772 5112 13448 23888 23452 24169 33061 45900 52410 47640 48211 51531 45923 28987 22616
11487 22616 25642 19990 4790 11629 15888 4165 -161 2122 9022 9703 6119 1345 2892 549
11473 549 -8039 -5959 1036 -631 -8317 -11772 -9051 4071 3952 -1566 -2304 -6063 -10799 -13706 -7677
11458 -7677 4104 6325 6825 -4724 -6019 1294 4607 3524 7153 9104 2578 301 -1861 -5982
11444 -5982 -11324 -10602 -8150 -10981 -15578 -13677 -5137 -8029 -10523 -12233 -6661 302 855 452 -4423
11429 -4423 -11024 -10693 1173 4798 5160 2652 5302 -1815 -747 7925 14454 17903 24371 28511 30578
11414 30578 29464 26255 20635 8853 4280 1916 5248 -2734 -8041 -4546 -12106 -11074 -4409 465
11400 465 7973 12619 6007 5300 3974 17803 23022 23968 19633 15354 18764 19523 24902 32281 34731
11385 34731 35634 31506 28712 15718 8367 4885 4519 11155 15980 8893 -6512 -14428 -3856 1423
11371 1423 -3526 -11323 -2782 8540 10606 8315 3659 -6406 -6548 8873 11961 4159 3770 14947
11357 14947 22088 33836 48297 44304 25868 16645 20159 19547 5554 5082 16725 19120 9268 70
11343 70 -9356 1133 16654 20665 25070 20732 16385 8067 5297 8128 6581 2664 5299 10050 19531
11328 19531 17064 13690 11110 13494 15988 26809 15572 7510 -6625 -2132 6983 7423 4643 59
11314 59 -4790 -7106 2617 8767 8628 13967 16462 7306 11238 12514 6720 9704 14904 19420 15803
11299 15803 13150 8092 14238 18872 10883 5864 527 -6134 -16143 -12740 -1412 11817 3545 -7214
11285 -7214 -4029 2716 5953 -345 -6495 -11348 -12999 -16593 -13015 -2807 43 -10644 -20300 -13810
11271 -13810 -8860 -11779 -12289 -13727 -12169 -10006 -8205 -4766 4140 10247 17461 22996 21568 23239 21880
11256 21880 25476 28049 21682 22097 19535 24235 21239 15913 17510 17237 24113 40620 38818 24059
11242 24059 16512 11735 2776 21672 22402 12636 13628 20674 22733 19721 20466 11523 9382 14753 16710
11227 16710 17501 12329 7320 4998 2884 11700 12895 11026 5503 4113 9131 10306 5713 12161 4866
11212 4866 -3436 -9948 -1859 9773 18044 21067 16619 18317 22780 19683 16614 17848 17335 19544 23998
11197 23998 40307 51815 60853 56459 51076 43563 41252 38286 32830 40548 44653 46164 51646 41040
11183 41040 35108 33257 29813 17956 12715 17044 18623 19681 25527 22905 9243 4127 13098 14723
11169 14723 6009 1322 858 4300 -1052 -7806 -9697 -8497 -7213 900 6605 11803 16527 11363 4187
11154 4187 -2902 -8352 1665 6312 4705 -481 -6143 -999 -4165 -166 15181 20983 16587 6333
11140 6333 6955 13285 11462 9694 4515 -5057 -3809 10705 22565 20357 5556 3447 -160 963
11126 963 -167 -3710 -4152 -9131 -10492 -7346 2687 15683 16055 10054 2468 -1602 690 7955 3117
11111 3117 1916 4688 6309 3030 302 -7084 2920 13831 9654 1325 3094 8416 756 407
11097 407 -5019 -7156 -11173 -4365 -9056 -10969 -10412 670 845 -88 -2459 922 -5748 -7399 5403
11082 5403 16645 19843 21211 14981 19014 17077 19654 32127 46751 68083 86473 103586 138566
11069 138566 192989 235158 249257 240461 211786 170163 124698 90835 67999 44041 41318 38791
11057 38791 42526 47825 37422 20399 16894 23610 25377 24070 17980 27035 27021 21475 12725 10176
11043 10176 -549 -1101 5797 14196 17425 14163 15739 26619 17175 16408 15695 22949 25115 29805 27505
11028 27505 25658 29585 31182 15795 10517 16277 16795 12172 5342 998 -2259 -11490 -6376 7217
11014 7217 13814 11874 14663 14154 7663 9540 15437 25848 25333 28271 22258 15673 16352 18847 9472
10999 9472 -2529 -3453 -74 7439 7217 13799 25169 24740 24986 28198 23290 27169 23016 15904 18937
10984 18937 12948 14256 19480 17913 15215 17784 25867 35011 25694 13348 548 -5568 -11113 -5264
10970 -5264 1232 10069 8468 5937 10820 13990 2090 -4952 -3867 3780 9296 20327 20568 20675 19601
10955 19601 14596 12601 11913 16070 25394 29636 22291 20521 27496 39923 45448 43219 42498 41735 42194
10940 42194 46514 64610 79006 80040 98728 125326 150634 196502 268155 380355 546405 798456
10928 798456 1127057 1375370 1398231 1235560 979930 726661 546752 413707 313669 252534
10918 252534 204526 172190 145364 121776 118385 115360 108169 88258 80215 78254 68290 64754 59646
10905 59646 54738 53042 39800 41072 43872 43573 43800 46289 25833 28361 41747 36629 24660 26331
10891 26331 25035 22839 25774 17969 8394 8942 23637 35558 41154 37282 27884 25327 35350 36550
10877 36550 42727 40855 33103 38811 38628 35291 25572 25847 34586 35767 34057 29395 33797 31442 21992
10862 21992 18286 17376 14205 8635 11729 10875 15751 20349 23573 28026 34757 39320 43742 38057 33965
10847 33965 30902 23093 23246 24441 21117 15129 20463 27702 27408 22827 25944 21638 17192 31729 35699
10832 35699 25437 26000 32389 41561 40530 31230 30538 29269 24172 12847 15447 18715 20472 17261
10818 17261 12927 4625 7505 17585 21847 20087 10264 11577 27953 31499 33374 35218 31436 30805
10804 30805 19762 15939 7146 4690 3179 9939 16776 10556 11841 12686 18248 29186 33564 22293
10790 22293 22227 18934 22329 36223 37340 36066 21926 11160 8578 19724 29945 33427 34012 41632
10776 41632 38241 40900 47413 42933 36444 39355 43582 50570 58507 90238 123374 150700 163414
10763 163414 164017 162258 158520 148389 133994 127312 104824 85008 62951 50813 51464 59742 61672
10750 61672 68699 62960 46133 38101 39943 43103 42363 44248 50972 47527 40211 35974 40910 49090
10736 49090 53718 63606 72512 72495 69102 66976 66343 72821 72931 68362 74706 81522 87158 82864 80229
10721 80229 70000 59716 50523 49117 47025 48798 59366 56165 39070 31219 30227 17480 9265
10708 9265 2701 10237 26871 30913 38198 47564 58647 68307 67742 68994 82778 92193 86715 96680
10694 96680 95164 93019 102316 99063 93948 86561 79587 75752 72308 68456 63210 65748 58680 54201
10680 54201 52263 55520 49179 40415 31410 25818 27593 27374 25170 33083 36050 34034 27281 14696
10666 14696 20090 37300 57277 90432 117600 130179 131930 130166 131016 128919 135832 144778 138849
10653 138849 138689 130491 122739 108060 103821 105600 101484 108904 105303 109686 117566 102502 91167 78709
10639 78709 62374 49428 39349 42379 75099 110897 124849 134910 142382 154426 171321 190197
10627 190197 197609 194378 183597 169479 165928 171100 177517 171078 160446 146415 136318 131697 123191
10614 123191 124192 139660 154102 156899 159042 169707 174980 186047 196553 214607 222764 232211 245690
10601 245690 245683 238903 231130 223649 221413 213777 201744 192883 192250 197928 212354 225378 230979 235512
10587 235512 238445 250393 261034 292777 320063 335375 343221 348263 358980 373243 390260 406846
10575 406846 429579 456540 477956 472591 474680 468563 458933 474981 513218 541294 565786 595156
10563 595156 623319 657172 682770 691642 708545 726039 739186 735978 743982 752755 750123 767444
10551 767444 810713 872876 935873 1001108 1066187 1128247 1187587 1239921 1281902 1332466 1402333
10540 1402333 1501527 1613716 1738423 1871183 2004761 2130476 2259246 2413159 2645910 2978375
10530 2978375 3392766 3880752 4474144 5185629 5962321 6676892 7241628 7739850 8355539
10521 8355539 9219236 10431145 12093324 14359380 17406759 21512443 27208489 35468103
10513 35468103 47941120 67520847 99040982 148138271 211692077 262731230 269911767
10506 269911767 235302064 182549819 133298408 96449441 71053354 53745168 41813958
10499 41813958 33447368 27452477 23026390 19646095 16992646 14901305 13257129 12007135
10491 12007135 11087067 10328155 9523284 8617908 7709754 6925286 6310430 5822948 5399272
10482 5399272 5007753 4636207 4292106 3984288 3732624 3500429 3287426 3108929 2939678
10473 2939678 2779219 2625225 2494812 2368616 2212389 2031579 1854520 1713452 1599676
10464 1599676 1501937 1428076 1376793 1321851 1275124 1252120 1241161 1259875 1315209 1414406 1544177
10453 1544177 1660694 1694137 1629799 1481611 1298660 1152489 1031891 921500 806664 717638
10443 717638 647925 596052 553222 523721 510079 493208 477364 464350 454153 438590 426521
10432 426521 429012 431464 435649 439488 433177 428328 415897 404246 391056 382380 376663 364982 347887
10419 347887 334303 315984 285082 260407 238159 217003 204550 213592 214419 209303 197228 202957
10407 202957 207833 208041 217496 221706 215274 214986 221434 227757 230894 232989 222506 202300 181043 165891
10393 165891 160744 158349 142969 116945 102719 93996 93354 109875 133841 153272 156912 156789 180444
10380 180444 211625 227522 236289 221171 196763 175745 161988 141366 125135 122256 121011 116915
10368 116915 111621 115648 125759 131294 131544 127986 121839 107826 103266 96477 91372 80597 72202 62955
10354 62955 56060 55981 72950 97729 118552 144319 156610 145165 138438 128902 127096 123055 116926
10341 116926 120082 139636 143588 124051 117656 102387 100505 106731 97392 87899 87510 87908 86238 93100
10327 93100 90929 83315 82406 77041 60443 46056 45536 56833 77840 84655 90817 89408 95569 103073
10313 103073 98309 87311 82009 82992 93916 98119 102875 109000 117936 109337 84111 73036 68488
10300 68488 62857 57787 59565 59985 55204 49197 45096 41168 42399 43707 32907 17980 18152 25577
10286 25577 30941 28298 24189 16579 25018 29607 29298 29312 30904 34233 45507 50084 42844 37672 32984
10271 32984 37060 54452 61929 50306 46721 50040 59128 61693 62535 59480 60141 54010 52866 58269
10257 58269 52678 47860 56765 63690 67909 52241 42696 44932 42867 40993 42279 44526 36797 29588
10243 29588 24336 27648 29100 28876 29169 32113 39712 39800 43815 47023 47754 54081 48576 43088 44286 33699
10227 33699 35862 42899 45841 53481 63262 73028 70893 62182 61455 66456 68824 57749 50609 52347
10213 52347 44242 39714 41556 40071 32318 29684 24347 32892 38790 35399 37756 36370 38985 39846 45977
10198 45977 47799 57035 70749 84357 94901 100615 119978 153997 179064 179339 169691 151110 134151
10185 134151 118986 100681 85469 71741 66993 73088 76671 81721 91678 112207 135357 150428
10173 150428 143500 120050 105440 101431 89859 69050 49815 33061 32055 39471 39350 35216 34465
10160 34465 27535 27547 26071 24868 32286 41530 41614 31546 23452 17645 21823 34437 31857 18122 18227
10145 18227 23075 41942 55674 50574 39387 33346 32814 27909 16244 21389 19422 9565 10690 18280
10131 18280 27260 29349 25401 23405 35608 48454 61331 64860 53139 45335 47024 47992 55288 62372
10117 62372 70452 74557 74744 79966 84846 76820 65287 53230 40949 36160 37628 45401 59441 69708
10103 69708 60696 49166 47694 49808 60380 66183 76188 84305 81101 85539 98115 113904 141344
10090 141344 183109 230946 292084 387037 527068 745628 1044513 1345422 1476989 1371658
10080 1371658 1113380 827879 597960 447812 355165 284859 228589 192391 157220 120879
10070 120879 110739 108993 101315 99195 90640 79123 84632 73470 62106 58933 57054 54988 50426
10057 50426 47663 50954 49724 45528 37188 34178 34991 42970 38533 40593 50449 55295 55999 55891 56259
10042 56259 48782 37379 25550 14289 6177 7622 8766 12167 29668 43944 47943 51902 45365
10029 45365 33147 21523 8168 -1921 -3592 -718 11174 8409 10602 12334 21773 24616 33349
10016 33349 55116 79392 73950 50334 25348 14835 12635 13986 11558 3542 5430 14239 15091
10003 15091 16611 23156 22038 15697 18262 8942 11188 21493 22919 10471 2503 8656 16612 18721
9989 18721 25992 20041 6967 4495 9579 13024 17919 16519 16700 18996 24110 22622 25737 29067 19950
9974 19950 15883 15066 13243 14518 11100 16578 13108 15236 15816 19256 17125 8337 9995 18340 22758
9959 22758 24224 15839 12874 10788 8769 13519 20506 28085 27770 21440 24105 13182 13945 11542 16887
9944 16887 20816 17842 19719 17050 18619 18817 14135 6410 -3228 -5954 -1883 4393 5486 4284 1368
9929 1368 -17065 -25742 -28686 -27780 -9773 484 1075 4224 15200 14683 5231 12580 10416 3644 13271
9914 13271 4306 -2085 -4699 -3222 -6584 -7110 7436 13752 9544 5752 -1136 -17732 -9647 -435
9900 -435 466 -4619 -7007 3847 5557 -400 -793 -1353 11597 18411 10997 12720 15318 8302 -3315
9885 -3315 -9642 -4120 2042 -1409 -7342 -8864 -9013 -1719 8081 8980 11211 13351 12760 14174 7933 862
9869 862 -2716 5346 11629 18323 17410 9971 1226 -3868 -2036 6117 9376 9987 14440 25684 23641
9854 23641 21999 33339 34256 23009 14316 18498 17052 17599 23159 26570 28049 29293 31338 38477 34330
9839 34330 34454 30046 24738 19749 15592 16334 20389 22709 17681 14018 25352 39716 54451 60208
9825 60208 67671 70156 94789 127983 179137 260758 417615 697009 1159668 1691091 1975780
9814 1975780 1823933 1385301 935487 608749 406937 278383 203245 166360 136162 117181
9804 117181 96948 83885 74994 65270 61272 62746 61676 49232 34678 35983 41233 48554 51375
9791 51375 55622 67509 76688 79211 92592 115521 134880 144836 150727 139481 122863 108383 97797
9778 97797 81941 68015 60417 36004 23248 23350 22416 11480 5494 3304 -775 5324 15861 20828
9764 20828 11614 4941 5898 7209 3486 14320 17767 17398 11466 15764 20547 13580 14248 19888 8991
9749 8991 5956 11278 11635 20401 16786 17661 19300 20896 24819 24232 16207 2048 3765 20124 32989
9734 32989 27996 16616 9822 760 1543 -8 7627 5975 -5989 -5901 -2085 1774 773 5457 17982
9719 17982 17554 22419 23927 22828 25910 21545 17633 13866 19261 22451 18216 17313 27415 22391 20689
9704 20689 14028 13019 17548 18809 18259 28312 22795 11427 1891 2824 10213 11730 10912 6176 915
9689 915 -4732 599 10243 12682 7692 -2396 3514 2320 15902 23757 11113 2947 -1179 -12296
9675 -12296 -25729 -20329 -5793 7428 12002 17709 13294 11673 18229 17729 19781 17358 13504 9883
9661 9883 4324 7862 14171 24844 15846 5711 1223 4707 1592 7945 15443 14009 -4684 -12401
9647 -12401 -10342 1149 12771 14355 7330 617 8924 10711 4094 14833 23336 20887 16395 14665
9633 14665 3652 -11594 -11959 -8210 -7393 2713 9252 15114 16736 14098 16997 19562 9460 13563
9619 13563 20087 17076 6369 -1620 4277 1883 -4253 2631 9870 14782 15694 11160 10371 16702 18564
9604 18564 17385 18683 28076 27344 23265 12808 18908 28078 22717 18393 7691 404 -5803 -5208 -7215
9589 -7215 217 6842 11290 16030 12368 69 -217 2017 11218 24619 29942 26626 23912 20842 16583
9574 16583 15486 12504 511 12226 22015 15602 17155 19219 16719 14634 16337 14072 12327 14844
9560 14844 16670 18931 19305 12277 18759 16552 16379 7379 10705 10153 8059 8864 11221 10956 14636 18711
9544 18711 22958 17593 9186 6162 7276 -1563 2766 7011 14036 20471 15063 7964 14669 12721 3915
9529 3915 788 -7304 -6474 -2724 4721 14153 18539 10877 9488 15283 11020 5373 6617 6119 7794
9514 7794 12959 9073 13059 14794 16059 18218 13559 16077 13895 8538 4136 3345 11094 12719 26087
9499 26087 20011 6493 4239 9422 8324 16388 26619 19696 8737 5882 -329 -4398 -904 6474
9485 6474 10094 -2458 381 13538 10834 8538 5919 3334 4591 5207 11690 10480 9049 12046 15563
9470 15563 16081 6891 3482 15017 19433 18364 11305 1443 8075 13896 14364 18383 25372 30795 27488
9455 27488 30939 31269 26743 16974 16485 18208 9286 10228 17384 15979 17032 23153 28848 24697 27295
9440 27295 24043 21270 23405 21676 29670 20681 5090 6407 3646 8565 13016 16314 26229 31847
9426 31847 29071 17245 6879 10187 18844 23287 14647 10276 19648 22274 25772 25526 16496 8799
9412 8799 7025 7049 4464 11112 22649 27226 26860 30833 41026 38883 30952 23286 20951 24915 25848
9397 25848 21614 14809 15875 24796 17159 5408 -1268 9608 16330 22428 24968 18484 20483 24732
9383 24732 25741 25121 15278 9028 14051 18970 17963 18594 11952 8487 13745 9891 11758 27397 31533
9368 31533 18877 14124 17533 19312 17077 9904 14904 17877 19325 24804 23368 26654 17326 9728
9354 9728 10489 10386 15947 18523 21378 21925 15525 20249 25292 24726 20338 22919 22863 28286 36100 41055
9338 41055 45068 39935 31104 25124 26337 15417 14270 12720 13228 11719 6932 11734 21901 21647 21200
9323 21200 22047 31947 32921 23848 19997 15368 18004 21671 20905 28412 17835 6893 9843 15444 16501
9308 16501 18275 29142 27747 30013 25518 19009 26675 29556 28576 30543 25957 24362 21698 7879
9294 7879 2654 13238 19261 22984 34357 33927 25778 24846 28212 35808 37675 30201 32462 37673 34513
9279 34513 30204 26719 26305 33333 35030 34240 25896 15024 23657 40134 45582 41675 38855 40045 42815
9264 42815 45968 48785 54841 43381 36544 45064 45573 46472 44146 44238 46391 39079 37312 43906 55646
9249 55646 49861 38844 36245 28159 27648 37517 46654 43099 31553 30224 34508 42462 44683 45607 36996
9234 36996 39576 47415 51371 50304 45758 41905 40531 34537 25305 32089 41414 44383 39825 30439 35027
9219 35027 41269 52873 58142 56115 43702 30675 20669 21844 28085 38350 38367 46621 53307 57383
9205 57383 64864 63861 64461 57323 50034 46283 40639 39507 46400 46654 52419 51288 51902 48650 51504
9190 51504 52061 59543 65078 67096 61960 66032 56701 58703 69278 68373 55735 48029 48153 53018 59785
9175 59785 50854 45537 49355 67289 68782 55250 51340 54475 58854 55009 46373 49622 49364 55747
9161 55747 66684 74019 68683 75185 68322 57444 59957 68361 81764 81778 86635 82339 76395 85158
9147 85158 94917 101243 99029 86445 90983 93688 93624 94744 99606 98553 94237 94754 102642 105950 100777
9132 100777 92603 93270 92643 91309 93234 94491 99891 98597 90970 95215 95073 91515 80147 78788 89638
9117 89638 94357 85990 87430 103499 101764 94616 99435 111577 100581 97555 99024 96302 104358 110798
9103 110798 99338 93810 92814 98792 104865 97142 89780 90588 93271 100847 108952 105231 97070 106462 120351
9088 120351 125377 125095 133626 134027 122376 117050 114600 116194 121660 130882 132073 123164 121550 119647 110384
9073 110384 119195 131893 124427 113818 118781 121862 123382 119152 113779 117489 127296 131512 130394 142753
9059 142753 138024 128959 123168 122051 121701 120540 120087 125106 135967 135432 135916 126778 129256 133338 137170
9044 137170 139330 141513 139709 133800 143774 148118 148596 156763 160149 158694 145636 143891 144157 146230 154046
9029 154046 165075 179770 178419 181766 176227 170599 172708 173816 180716 185645 190788 188029 191384 194076
9015 194076 198971 203565 200622 203971 204329 186717 186816 197080 199462 206347 208264 204540 215790 228990
9001 228990 235939 240364 247069 244662 246137 251692 254929 263067 272857 273601 275736 273216 267717 269842 272175
8986 272175 276251 282705 287601 294097 296198 295905 307637 315239 313366 319899 324006 335017 339429 335067
8972 335067 349305 352350 347975 355407 362589 378814 386261 383208 388827 392527 388842 396391 405497 409315
8958 409315 419979 441661 452901 463148 468824 485043 494519 495952 504753 512877 530195 541424 550036
8945 550036 567502 569697 577066 585705 586697 595777 608855 617470 622956 637367 653728 670319 688276
8932 688276 691183 704706 723767 735544 749366 775708 814032 846532 867648 876885 883698 913866
8920 913866 945161 968630 993761 1019051 1041489 1063307 1098565 1129604 1167685 1208610 1232252 1264383
8908 1264383 1315918 1358278 1386240 1423243 1467400 1520959 1566975 1614603 1676674 1728880 1789533
8897 1789533 1855815 1921688 1993780 2075741 2144264 2215689 2287348 2376997 2471473 2575254 2687913
8886 2687913 2807860 2914629 3028277 3169634 3308877 3460702 3634572 3817769 4008505 4203070
8876 4203070 4408320 4631361 4872159 5139575 5419666 5722462 6039132 6378158 6744343 7131582
8866 7131582 7546136 7991209 8457683 8951249 9481686 10035624 10603058 11193119 11804970 12433476
8856 12433476 13070906 13700793 14320031 14918517 15469746 15970202 16392818 16741500 16998510
8847 16998510 17149797 17206389 17146982 16985503 16728347 16387420 15968748 15490185 14950478 14370257
8837 14370257 13780623 13175653 12562007 11943322 11350513 10784257 10226485 9681645 9171422
8828 9171422 8685857 8217366 7780906 7373015 7000123 6640121 6289939 5965105 5670293 5386049
8818 5386049 5119783 4862291 4632614 4416293 4212810 4009463 3825104 3659841 3497851 3353504
8808 3353504 3209433 3078195 2937473 2812097 2698731 2597709 2495668 2391259 2294038 2200906
8798 2200906 2115573 2041591 1960739 1886963 1825029 1769914 1706318 1650553 1594125 1539832 1480941
8787 1480941 1430762 1388619 1339988 1291484 1262795 1236756 1210641 1179729 1141976 1105438 1075003
8776 1075003 1048880 1021242 988028 961085 940070 921195 886589 861185 842234 832186 816136
8765 816136 794520 770363 748052 730326 718848 706166 690677 676384 662680 653577 638510 619375
8753 619375 600054 587784 579908 564630 553522 540977 531764 528343 517126 498082 485538 470845
8741 470845 460750 459254 447468 441382 434728 425886 421694 420560 414354 408376 405320 399268 390722 381887
8727 381887 379171 372519 357760 353752 344504 335957 344533 355641 354345 350043 336395 322818 313380
8714 313380 317684 317524 302965 296525 292270 284180 270771 267553 277291 279991 279463 273853 271055 268409
8700 268409 256910 239650 230421 232602 225413 223021 232702 239757 245766 243576 231368 222670 220608 224011
8686 224011 227776 220671 219804 217833 214955 209088 199333 198382 201160 196602 194940 186495 191750 187569 193489
8671 193489 178409 163310 158365 163399 172549 168486 165066 160873 154087 150055 151601 148166 158282 170103
8657 170103 169916 166719 156816 154152 156140 155564 146666 149074 161899 158326 144705 135131 129820 129872 128601
8642 128601 116534 118195 122654 130943 132394 125538 130434 127848 135552 140093 135426 139125 139324 143600
8628 143600 151431 152637 152219 147380 144374 151494 155003 164525 176972 191036 213265 243553 310346
8615 310346 439858 604931 641053 553566 438737 340099 271068 230197 198854 176489 156933
8604 156933 148131 147747 145082 147627 146357 150412 143546 137397 134542 129772 128493 136354 137979 139695 133012
8589 133012 127557 126220 143828 151667 148338 136331 136212 143507 151603 160461 171658 181752 199499
8576 199499 217432 231483 253779 297735 367912 495556 738298 1090933 1229326 1092521 856238
8565 856238 656089 527826 453721 398695 359991 325611 307456 288378 266021 242015 217968
8554 217968 198492 190796 180902 169216 156438 150694 148803 143614 140668 127610 116482 115795 109606
8541 109606 116105 124136 125088 130257 124969 122694 128404 132084 121763 113195 112483 120865 130429 147274
8527 147274 177659 222962 324254 484127 581496 547701 433253 304483 217456 172229 147972
8516 147972 122591 110271 104761 99329 81608 74959 82449 90196 82763 82523 87177 77649 73181 73011
8502 73011 71012 68339 69873 61180 54703 50225 48542 49919 51211 54815 53525 58668 65262 54407
8488 54407 44905 52185 58852 52818 51022 45866 34720 34568 40721 50237 55575 58949 56577 39708
8474 39708 35002 39346 47367 47654 48114 42383 43644 45920 46830 46502 48139 45584 39385 28955 30766
8459 30766 44192 49158 45091 43026 48309 50246 58456 57707 56237 54634 59590 65409 64198 57618 59867
8444 59867 66142 65416 58534 57480 56988 51946 51133 43705 37879 39896 40122 38768 32298 26056 27963 25405
8428 25405 23488 27824 16324 12657 30208 39036 43887 40271 38659 38006 28703 34055 37032 28914
8414 28914 28879 30087 25189 17582 12103 20515 24332 23690 30476 26008 32329 38440 26968 23332 34320
8399 34320 32065 30408 26792 22412 21356 24071 14743 18587 26058 22826 31039 35865 38076 39054 31819
8384 31819 29108 22825 20310 26859 28471 30172 29358 34503 35973 24572 32956 37844 31523 33454 32482
8369 32482 24375 19939 26512 27613 24489 31765 40329 39019 35482 35395 38183 43477 37076 33491 32671
8354 32671 27512 27385 21671 13288 8718 151 13267 25000 24027 30167 30948 15327 9000 7661 15346
8339 15346 23453 32294 39798 33487 29513 22629 11979 3480 11006 30296 34244 34727 37761 28834
8325 28834 21821 18686 27639 19549 18407 25150 32205 39656 40245 42236 33773 20850 15591 17589 12253
8310 12253 7472 17018 19513 16109 25750 17935 10166 12803 18613 21936 30141 31954 36353 27772 22573
8295 22573 20317 16992 19306 16658 15921 18507 25682 27975 26483 27877 26736 24770 23873 9416 7141
8280 7141 13554 14075 9939 16753 34211 32540 21301 12537 19587 23777 24654 15217 9557 10654 15133
8265 15133 9993 1844 2221 4616 7570 8877 14166 13823 11364 12316 11388 18791 17245 11898 6637 2258
8249 2258 8020 13610 20004 28110 20436 19031 19620 19707 20334 20073 17226 15416 20964 26218 37412 35276
8233 35276 22790 22366 25112 28289 30126 14565 1974 -805 13185 27906 12469 11931 14444 13477
8219 13477 9171 9106 8488 14802 22733 18406 8623 4032 6088 4947 4472 13791 18572 18887 11186 10585
8203 10585 12476 14449 8648 7474 4847 4309 5523 8183 8136 12687 17647 17857 18491 26834 30167 17322
8187 17322 11110 11520 9397 10476 1906 -1743 -561 -1142 15161 21057 20022 18096 16969 12980 -111
8172 -111 1711 4830 6517 7857 22615 25030 18507 17962 24592 26801 22235 17873 16532 25042 26548
8157 26548 23656 15027 10236 8512 1202 7935 10820 8930 8746 11662 23350 18225 8713 983 5861
8142 5861 13725 21654 21153 6134 -708 -3766 -7262 10345 18501 21157 19813 16671 17395 20291 26899
8127 26899 23072 21589 22843 22227 22347 23457 25968 32943 33219 22779 22082 19256 13814 7407 3560
8112 3560 6001 8455 3468 547 4959 5400 12576 15062 7604 9252 6205 -685 15794 26436 23223
8097 23223 14739 5729 7611 -933 2886 2799 1977 -1431 505 7237 5847 2926 10455 13672 11314
8082 11314 3930 2585 7461 13181 1459 -6983 -11266 -4179 6699 2356 -3212 -1811 199 4173
8068 4173 2159 -221 960 5256 5918 19764 20636 14347 21244 24022 15894 12811 17130 21404 19440
8053 19440 18052 12710 11619 15992 19801 12914 4578 7869 5916 3000 5059 10873 5925 9398 11396
8038 11396 -660 -5285 3897 2999 -6315 -7292 -8141 -3037 6102 12032 8764 7502 9267 15234 22724
8023 22724 30439 22704 20204 12398 8509 13980 24364 21387 14922 7123 9006 16752 14751 14739 16257
8008 16257 21744 25211 22827 12341 16994 14814 14500 18740 15736 13346 15009 21532 19707 18957 13755
7993 13755 16539 24740 33816 34178 30594 32473 36280 35968 26130 22404 22951 26342 27203 31528 36025 37999
7977 37999 34341 30038 40639 47651 54725 52371 40629 31475 36538 37665 38273 41247 42642 33162
7963 33162 20441 21760 17070 6225 -98 8155 12624 12228 16440 14580 4111 -4162 999 5543
7949 5543 16581 25555 27432 33037 22660 21887 32019 44390 38407 33249 37850 27960 25606 23983
7935 23983 24676 25584 14544 13690 19331 21411 26944 43599 52198 46792 47747 52471 45586 34177 33565
7920 33565 35729 33470 31092 29460 21819 14179 10056 10140 11592 19283 28261 28405 24879 33590 35734
7905 35734 29390 19660 23688 14421 9965 19910 22266 18252 20285 30422 24789 35106 41052 37389
7891 37389 37938 36279 31077 20873 11804 7740 4614 19674 26929 29041 31917 38991 39241 26884
7877 26884 14919 13424 13806 9281 8767 14038 10683 11362 22928 15374 10067 9168 14793 19905 9891
7862 9891 12579 22527 20430 3699 2584 9237 7157 174 1469 3612 6831 9409 4402 -3288 -2580
7847 -2580 -9234 -3004 -2409 -6393 -9516 -10931 -7985 -10581 -11530 -4970 7408 11512 8891 5346 -342
7832 -342 3025 19988 21572 20108 14163 10049 5837 -2518 -764 3502 11975 18976 12874 9116 4352
7817 4352 4602 3137 -1534 3774 4871 2821 2871 6550 10540 11794 727 -10858 -5800 -4807 288
7802 288 2009 -5821 -3722 1853 -1241 -730 -191 7690 4437 -2187 -5932 4412 11543 13673 3685
7787 3685 -835 869 -5257 1108 -6122 2633 11761 9291 5973 -1589 1460 -148 4049 5150 4236
7772 4236 5308 3463 3073 10332 16636 12043 1451 -867 -1627 -6410 -3030 11083 13812 7574 1479
7757 1479 -4435 -10856 -14126 -8180 -8966 -7923 -1562 287 -9423 -8471 -3575 -7814 -11399 -6440 -1155
7742 -1155 -6833 -14324 -10003 -7559 -3872 -8934 -5247 662 1590 3385 13038 20693 18253 10965 1922
7727 1922 8585 14888 6460 -144 1550 4499 -4647 -9734 -3901 6396 7838 -828 -10169 -18349 -13049
7712 -13049 -2900 -2334 -5193 -11921 -12048 -4963 -3513 -75 9 -2921 -5331 -5129 -1737 10767 5373
7697 5373 441 -5581 -10440 -9974 -8531 -15556 -12613 -6549 -752 -1646 -10386 -13336 -8385 -6497 -6656 -10765
7681 -10765 -7851 -4345 -3755 -4815 2863 2145 6574 5017 3256 -3443 -3508 -8417 -7828 -3264 -6579 -20831
7665 -20831 -14965 -6556 -1190 -2321 3997 5576 5111 -170 5608 1236 6694 3913 1857 3262 2430
7650 2430 1292 1936 -2451 -5313 -7270 -1121 4555 -513 -2794 2786 3018 2619 -1480 7268 10055 3112
7634 3112 -9573 -9647 -6982 -1188 5455 4403 6930 9972 3468 -6522 -2740 4416 8530 -1022 -8842
7619 -8842 -3437 440 3527 7035 11113 6542 3772 25 -5564 -711 7698 6583 265 -2614 -4260
7604 -4260 -10166 -12953 -11382 -11225 -8806 -14392 -18981 -16249 -14574 -16179 -19455 -20707 -9360 385 -670
7589 -670 -8317 -7913 -11229 -14377 -14764 -18388 -22888 -21084 -15590 -16568 -13387 -15714 -7368 -5029 -9862 -8507
7573 -8507 -8723 -24204 -26210 -6446 7647 9583 2929 -7606 -14034 -18147 -13240 -7386 -966 3426
7559 3426 10015 2807 -7453 -4099 -4855 -10948 -5553 -6306 -11215 -8571 -12969 -2907 350 8416 -223
7544 -223 -5922 -11683 -18559 -11067 -938 1623 -8315 -8682 -129 1161 -6083 -4770 -4086 3771 8283
7529 8283 11701 9937 11559 8633 -3318 -6170 -4268 -4278 -7132 -1305 -1709 -2826 1850 6666 1717
7514 1717 -9651 -19579 -7583 7130 5508 -6975 -10716 -9734 -21696 -27643 -18390 -11015 -14487 -22222
7500 -22222 -36107 -39359 -29203 -26244 -21660 -20509 -12578 -7707 -14681 -14437 -10380 -6179 -5425 -7709 -9577
7485 -9577 -8240 -2478 -696 2916 5347 5181 5488 5665 3025 -4330 -6268 -1986 -5696 -5822 -6028 -11823
7469 -11823 -4268 -907 -3508 -3183 5355 1303 -9572 -9698 -11530 -13429 -7416 -2874 -7721 -8481 -1780
7454 -1780 4375 6563 9890 10917 3909 4813 14159 22448 19510 16317 8607 -438 -3178 1890 2150
7439 2150 1017 7769 8728 -1998 -17187 -15303 -15361 -5898 -7757 -4219 -5724 -4753 -4981 5413 6584
7424 6584 -6487 -11377 840 3321 -6545 -6259 -2714 -12867 -7479 -4677 4298 12434 8962 2192
7410 2192 -3168 -4719 -5310 -10839 -2854 4673 9517 430 -2044 9894 10858 3993 4037 -5897 -5871 -1962
7394 -1962 -267 -1650 2208 8762 -4228 -4526 -10392 -7999 -3308 6801 11182 5006 4578 -2553 -2221
7379 -2221 5883 3113 -329 -2931 -1256 1248 -562 2453 13509 2202 -11310 -10744 -6065 -10213
7365 -10213 -4908 1004 -10585 -12663 -17013 -9823 -9428 -8617 -6060 -5277 -2648 167 540 3569 -1470
7350 -1470 -4665 -4981 -4606 -5635 -9817 -27020 -23760 -11819 -8442 -5912 -13707 -12076 -9189 -13456 -18752
7335 -18752 -12009 -14388 -14631 -12976 -3296 -3277 -4652 -10926 -12752 -17808 -18266 -10742 -17456 -24591 -11959
7320 -11959 -7691 -1088 -10729 -11433 -12238 -13222 -13464 -18570 -20650 -23917 -21370 -19991 -20768 -21727 -28984 -30313
7304 -30313 -27166 -18225 -9205 -12712 -13627 -18405 -18368 -16149 -5533 -11753 -20975 -20800 -21513 -22269 -15598 -10079
7288 -10079 -14682 -21944 -15667 -7432 4558 3565 -236 -10503 -2870 6075 5510 -1114 -5435 -823 1565
7273 1565 509 7280 8715 4451 37 -17122 -28105 -21623 -9390 -9587 -7241 -1128 -5310 -15833
7259 -15833 -13878 -1431 7558 17225 18200 5175 -10635 -18226 -16674 -10870 -7915 -9267 -21204 -22790
7245 -22790 -10827 -7749 -9220 -3550 -2558 -1788 -4561 -10397 764 -5481 -9069 -8642 -4430 -6709 8319
7230 8319 12697 -6081 -7323 -7141 -7494 -5467 -17764 -18720 -15381 -7147 -653 -4811 -2237 2018 4167
7215 4167 -520 -5832 -7732 -3229 -4278 -6484 -6729 -14489 -18336 -21240 -24405 -17078 -14156 -17113 -15566
7200 -15566 -6964 335 236 -10122 -13747 -11763 -7750 -4091 4667 3238 -3729 -5700 -5101 1614 -1189
7185 -1189 -9445 -21994 -22266 -17376 -17114 -12579 -10220 -20767 -17153 -8651 -16165 -17152 -4783 8969 5055
7170 5055 -1987 -476 851 -1217 -4264 -697 2897 2757 5306 11635 5493 5293 -945 -12755 -2373
7155 -2373 4224 9080 11467 3869 -1135 -7543 -407 1346 -2883 -8691 -8978 -1155 -3269 -5993 -1744
7140 -1744 -1358 -8816 -9470 -10854 -14399 -16167 -15183 -6162 -1064 -1394 -9156 -17567 -16348 -4280 1186 -1590
7124 -1590 983 6182 8584 8028 6675 7455 9624 11116 12030 -914 -6745 -4809 -9455 -11241 -5900
7109 -5900 -998 1429 3970 1292 -6960 -14449 -12771 -3928 2350 2889 -7415 -8169 2697 10487 13401
7094 13401 7955 -5640 -9654 -8410 -13474 -9759 -2004 -4063 -820 779 -4609 -5544 -3209 -7521 -9197
7079 -9197 -15624 -8116 2241 198 -2932 -464 -4000 -13008 3907 13993 10424 1372 -12434 -15019
7065 -15019 -12445 -11241 -18659 -11602 -10238 -5556 -2041 -271 -5234 -14274 -15830 -9817 -14380 -15362 -17057
7050 -17057 -11938 -7428 -11347 -6630 -2721 -8552 -8711 -18304 -16238 -17361 -10052 -11422 -7623 -7 2135
7035 2135 6374 4749 8934 7843 3883 -12611 -6083 6803 2032 -9873 -19003 -18542 -12060 -19410
7021 -19410 -26157 -17945 -14990 -22107 -23418 -19428 -19674 -18022 -22847 -14231 -3077 -273 4103 3584 1794
7006 1794 308 -7143 -7647 -4826 -9480 -10143 -18986 -20432 -22962 -12883 97 -216 9232 9172 12723 9791
6990 9791 17171 14976 -2770 -5157 -3872 -15224 -13605 -11076 -20079 -8218 -6270 -13995 -2546 12429
6976 12429 13821 2707 -7917 -11053 -8259 -13651 -18259 -13099 -8057 -13160 -15461 -14932 -21407 -23431
6962 -23431 -12856 1558 1301 -8938 -17776 -21709 -14656 -2281 1305 -6578 -10585 1650 9542 8058
6948 8058 -8230 -12440 -12010 -11028 -9806 -4613 -10340 -8904 -6307 -3642 -960 6058 10641 6585 2225
6933 2225 5422 -6587 -16162 -23088 -29947 -32679 -28259 -13699 -3987 -6474 -9192 -9510 -11256 -9197 7519
6918 7519 5999 1507 9552 1 -4495 -4192 5397 6722 8603 3218 -5132 -11454 -6113 -6946 -3319
6903 -3319 2393 7654 9598 3662 12777 16905 2286 -10256 537 3756 -4473 -6523 -2109 -4032
6889 -4032 -10691 -9299 -3685 -5489 -6750 -8279 -3141 -7162 -12688 -17210 -20641 -17086 -1908 -4104 -4457
6874 -4457 -3453 -10713 -13541 -11499 -12443 -13671 -21103 -9129 -549 4403 3118 592 -10521 -14080 -8917
6859 -8917 -10412 -2124 -4468 -6486 -10151 -7562 364 -1376 -13895 -6554 -5445 -14251 -13327 -7852 -2176
6844 -2176 -1145 530 1380 -9511 -6124 6069 -37 -3525 -10804 -10578 33 -1059 -4309 -3615 -11694
6829 -11694 -11010 1323 2388 11697 18046 4754 -1966 -4134 -10047 -2797 1092 2662 -2907 -4466
6815 -4466 6482 21605 29860 24837 18461 16682 18479 12343 9588 5831 4327 4807 4774 17292 17957
6800 17957 6017 -2374 3121 1879 3702 12664 1337 -13770 -11528 -10949 -17321 -21733 -16342 -7967
6786 -7967 -5208 6091 11555 2144 2174 6207 6797 4596 7688 2364 7676 5145 9151 2792 6060
6771 6060 6262 -4979 -7548 -8088 -5764 -7090 -10108 -2154 -5885 -14995 -15614 -11078 -21254 -26763 -23024
6756 -23024 -21670 -19866 -21175 -12392 -11534 -12350 -16063 -8052 -2465 -1710 4220 5114 6967 1217 -8741 -18000
6740 -18000 -10154 -5830 -7527 -10300 -7678 64 18677 10073 -626 -9339 -2802 2967 -409 -615
6726 -615 -7899 -12808 -11408 -7897 1436 540 3457 1292 -5160 -9231 -1347 169 -4053 3806 3656 -4056
6710 -4056 1923 -3278 -4512 -4267 4299 11270 3455 265 -5675 -8158 -4320 -1719 6817 20329 29234
6695 29234 35828 31835 33039 30730 23061 16170 12381 18896 11093 10245 2483 3121 5550 5610 5582 8398
6679 8398 6540 -243 2403 -3447 -10874 -14952 -7894 -7849 -18512 -18062 -8660 -9213 -13472 -9539 -1527 5948
6663 5948 6059 -979 -14345 -20105 -7521 2688 68 -4170 -4966 75 -998 -2998 -970 -3570 -8645
6648 -8645 -3281 -5696 -14034 -8855 5099 12747 14421 14456 14445 12058 5263 3009 466 -1096 2280 1028
6632 1028 4046 9172 6776 71 -10581 -8289 -13494 -14610 -14114 -13230 -15342 -14559 -6999 -6199 -9418 -11316
6616 -11316 -10205 -7814 -4575 -4647 4690 10017 -898 -7677 -12004 2052 -5049 -12799 -3279 -1441 -1490
6601 -1490 -3656 645 -5039 -3436 -5892 -15953 -15784 -8942 -739 -7171 -20866 -26934 -23227 -23569 -20448
6586 -20448 -30363 -33638 -22182 -5539 9090 10316 1872 6023 10426 12524 13504 4159 4219 3629 6999
6571 6999 9252 11336 4841 -2323 -3198 -3254 -3952 -7290 -20485 -18372 -10645 -6236 -10196 -19194 -14448 -17539
6555 -17539 -10384 -12650 -15603 -8394 -3063 -9676 -8571 -2495 1225 -6199 -16274 -17999 -15951 -10249
6541 -10249 -2971 -6837 -2331 -494 -1475 -10666 -13896 -6177 -14964 -16878 -10687 -11888 -15589 -17817 -24464
6526 -24464 -34716 -24804 -7017 -4071 -2756 -5726 -8906 -5503 -14164 -24484 -29141 -23738 -22731 -24151
6512 -24151 -24816 -16384 -1208 7785 6572 8635 8199 3076 -582 4814 -687 -2814 -12000 -10729 -2313
6497 -2313 8573 9142 3873 -10771 -6558 -8156 -12676 -621 2339 2707 11374 7928 5641 3369 2414
6482 2414 805 -7464 -2915 84 -7840 -9975 -12363 -8807 -3156 1102 3701 1407 -10608 -16090 -2297
6467 -2297 10571 17256 17903 11029 -1184 -2553 -1336 -3744 -2997 -5005 -8452 -7255 -9339 -5788 -3686
6452 -3686 1108 4378 2542 -2968 -5100 -4383 4009 7843 6059 10674 7276 11157 10712 7495 -4568
6437 -4568 -10824 -1021 -2033 2485 1771 -3422 -8415 -2838 3085 4747 6356 480 3243 3589 2901 683
6421 683 -402 -90 -2815 2544 2710 1346 3905 14244 2230 -4705 -2545 3033 6468 -6801 -11022
6406 -11022 -1190 -5078 -9860 -7111 -9889 -9960 -8427 -9894 -16240 -25500 -24387 -17987 -7256 -651 10010
6391 10010 18257 9115 3688 1359 -3483 -9010 -13941 -16222 -17692 -10517 -3915 -1353 -2867 -485 7046
6376 7046 4725 -1835 -7059 -7648 886 -2681 -10750 -12509 -9665 -10392 -12018 -13313 -11540 -4770 -7089
6361 -7089 -15031 -15943 -5559 -2125 1635 9106 1250 -8104 -17116 -8645 3958 -4410 -3366 -191 3776
6346 3776 4318 6122 2594 699 6845 13443 8076 7315 1910 367 5032 -895 -7604 -5863 -6174 -10838
6330 -10838 -5323 -3301 -4329 -5234 -907 -6551 -8580 -3744 -4748 -2974 -3224 -7782 -3926 12054 7655
6315 7655 -4756 -14236 -13582 -7472 -1305 -6769 -7653 -2531 -6329 -5131 -7648 -7437 -8816 -15348 -10755
6300 -10755 -13363 -18860 -18277 -18291 -18433 -13746 -12508 -15247 -14540 -4565 -4144 -1367 13480 17328 14101 10920
6284 10920 5592 5144 -311 -4580 -2789 5754 2874 -764 -609 -1174 -3118 -8404 -9602 -2673 5693
6269 5693 8139 9157 4752 2218 4065 9561 9226 -6455 -11278 -15391 -7218 -161 -1652 4327 8124
6254 8124 2475 -4616 -10351 -15575 -13502 -2801 1720 -8210 -8970 -2326 -2923 -534 192 7794 11385
6239 11385 6776 -2072 -18137 -23573 -10047 -1472 -2598 -2392 2456 -3083 -5475 -19585 -26752 -16952
6225 -16952 -5296 4660 9028 3634 -3023 204 2564 -1096 5967 3765 9255 10597 1026 -8932
6211 -8932 -18239 -16875 -12756 -17906 -16525 -10573 -8647 -12499 -14622 -14987 -15142 -10579 -11143 -11870 -1094 1814
6195 1814 -1219 242 -2805 -7137 -8498 -7845 -4099 -6417 -1315 -4637 -4177 7661 8320 8430 782 4893
6179 4893 3471 -956 -5819 -7212 -4336 -10222 -13653 -8623 -7669 -8319 -7550 -10640 -18397 -20699 -16089 -10969
6163 -10969 -2819 -8170 -11925 -4381 9571 12092 10335 3736 4069 -2079 -4719 -3741 -6820 -4066 373
6148 373 7337 660 -6933 -7626 -4253 -9352 -6943 -5216 -9676 -16118 -23663 -16692 -4600 -757 -3389
6133 -3389 2721 5557 2225 -6519 -9790 -14048 -6997 -7189 -4083 -790 -3884 -8761 -12806 -14556 -26908
6118 -26908 -30051 -30046 -18278 -9090 -8603 -7362 -14008 -12580 -11864 -8631 -3938 -456 -1985 -6916 -5258 -9241
6102 -9241 -11244 -14323 -19327 -20513 -19275 -13345 -14523 -3835 1641 2040 -5945 -16218 -19246 -22108 -15691
6087 -15691 -3295 -6354 -1578 1844 3374 1690 -6286 -14499 -20883 -16821 -13029 -15221 -25281 -12909
6073 -12909 -3616 -6173 -2946 -7418 -6369 -6231 -3304 -7563 -9696 -11751 -18248 -18707 -5557 2933 -2261
6058 -2261 -15728 -12176 -46 13449 -686 -14181 -16793 -8465 -4723 -9277 -14667 -13606 -9535 -5329
6044 -5329 -9331 -12824 -24710 -20123 445 49 -10207 -13653 -1954 338 1623 8092 5126 5107 -6087
6029 -6087 -14801 -7004 -3881 -5125 678 2416 -5553 -5933 -7576 -8892 -3521 760 -2408 -664 4771
6014 4771 4252 2474 -1511 -6392 -14484 -12487 -8548 -13350 -15985 -24675 -13683 -4405 244 991 4574
5999 4574 5511 -729 6681 9790 2374 -6119 -7537 -9677 -11985 1883 8849 7590 3329 788 -7236
5984 -7236 -12545 -12970 -16056 -9916 -11442 -17040 -18873 -14553 2538 8376 3762 3401 -78 -6382 -2
5969 -2 3076 3041 4158 2604 1072 1522 -1145 985 13238 13537 6460 -6308 -6907 -20425 -25661 -24234
5953 -24234 -12064 -7496 -10524 -7447 -4248 4027 1057 7024 2866 -9292 -8918 -10460 2180 1089
5939 1089 -1126 -7586 -9618 -14908 -21246 -20873 -19574 -12577 -9744 -9808 -8920 -8424 -3931 -6672 -3692 -9792
5923 -9792 -11201 -934 -1666 -7688 -8997 -1665 -10389 -12808 -9022 -9109 -22782 -24967 -18879 -3518 4543
5908 4543 29 -5109 -11459 -5474 -7960 -9673 -2767 -9903 -12577 -9186 -3998 -8556 -6728 6110 5920
5893 5920 -5766 -12206 -12916 -8346 -4164 -4819 -8268 -14095 -5571 1400 -535 -9748 -14619 -13198 6649
5878 6649 7721 2702 1052 -4812 -4894 -5153 -9523 -4563 8132 11162 1083 2862 -488 -11820 -10573
5863 -10573 -13413 -16738 -10446 -2346 -10253 -5856 -2147 -1595 -4306 -3948 -3865 -5178 -13181 -19401 -6137
5848 -6137 4914 -178 -5933 736 6964 5938 -2232 -4320 -1795 -2078 -5663 -12226 -19658 -18846 -10973
5833 -10973 -5404 -842 275 3352 10404 10588 10454 2413 -5092 -6529 7602 3353 -7059 -1029 -135
5818 -135 -5500 -11342 -10364 -12278 -17935 -26235 -19712 -23191 -11915 6297 9820 73 -6145 -5715 -7337
5803 -7337 -1861 -6226 -2268 5634 4091 2333 1200 -6870 -4701 -5495 -11386 -15130 -20782 -24308 -33168
5788 -33168 -28533 -21542 -11605 -283 -732 -5424 -5431 -14775 -10739 -5119 2685 7112 7080 228 -9337 -16810
5772 -16810 -11183 1635 3224 -3107 3283 16088 9232 -3241 -8521 -8401 -6289 -9803 -5065 -1461
5758 -1461 -11543 -23099 -13761 -3501 -379 -2098 3221 6147 3151 -482 -8986 -7082 -6749 -4720
5744 -4720 -11305 -8162 -13303 -14160 -11678 -5099 -5296 -9805 -5571 2513 7735 4953 893 -2588 -1499
5729 -1499 -3334 -2301 -1914 3883 -2414 -13437 -14556 -6081 -4629 -11462 -4954 -2530 -5927 -7213 1246
5714 1246 2408 483 1375 7128 2472 802 -1655 -10289 -9557 -9008 -9936 -15284 -15711 -12431 -7599 -1934
5698 -1934 3684 5 -2599 183 -3689 -1871 -5335 9172 14135 10733 6175 3355 454 5151 5571
5683 5571 -6014 -16782 -17074 -13784 -5876 1398 2719 8631 2267 -4952 -3957 -1273 -1905 2375 9628
5668 9628 15082 4535 -1301 -5674 -4791 -5664 -11580 -11794 -10580 -12602 -1400 2045 -5780 -16077 -7630
5653 -7630 -2895 1569 3658 2043 1294 1658 930 3940 8658 9569 12430 12139 11793 5773 4492 3090
5637 3090 4030 -357 -759 -3440 6750 10582 13933 8024 2647 -1664 -2628 -9733 -4851 7104 5436
5622 5436 18346 11479 -3732 -11524 -2178 911 -8507 -21106 -27731 -32114 -32580 -22128 -20847 -22943
5608 -22943 -26836 -24202 -14621 -120 9168 3842 3901 922 5253 5548 929 -8356 -1895 -8206 -15818
5593 -15818 -5466 8259 9286 5298 6790 6731 11803 3604 387 -1388 -3382 -650 -2156 -18730
5579 -18730 -28829 -16127 -8528 -8128 -9592 -14311 -10285 -9311 -6711 -9437 -16351 -11274 -2430 -10833 -17669
5564 -17669 -10165 -10757 -12679 -6355 -6828 -13318 -13164 -2496 650 5922 4505 4232 -7659 -7202 5292
5549 5292 4495 3837 186 -8084 -6369 1160 -701 -5824 -3761 -7803 2651 2044 -11034 -12156 -329
5534 -329 5727 5931 4370 -8018 -12387 -14339 -15140 -5280 5971 11797 17146 18552 7208 1411 6902
5519 6902 9218 -3599 -12559 -12771 -11876 -20740 -21798 -13753 -10108 -5209 -7460 -12859 -14553 -11621 688
5504 688 4413 10775 5567 -4963 -13566 -12731 -11398 -8212 -5064 -344 -5039 -7221 -6422 -4869 2957
5489 2957 11987 8079 -3316 -1452 -2076 -240 6649 13748 11014 -4722 -9033 -5574 -6822 -1357 2694
5474 2694 -247 -7392 -43 3305 -386 -8770 -6738 -3088 -5900 -4240 1822 3721 2540 -9680 -21432
5459 -21432 -25411 -15986 -11750 -4114 12087 7072 -1018 -2684 945 -7391 -8574 -8307 -7596 -8493 -1957
5444 -1957 4095 1003 -2137 -1396 -6490 945 14173 24158 21711 9523 -4491 -11586 -9002 -1900
5430 -1900 -4257 -12183 -3312 -684 918 -1985 -942 88 1397 950 4147 -195 -5392 5319 5532
5415 5532 -3611 -7309 -9446 -21591 -18488 -13130 -10946 -11486 -2456 1776 959 -9056 -15482 -9227 -3317
5400 -3317 -846 -3292 4008 -4124 -14434 -7571 2954 5780 2635 -6335 -10248 -3463 -1650 -2445 1035
5385 1035 4420 13335 13720 17770 11921 3364 1617 3662 1050 -8370 -8034 2335 6551 4181 -268
5370 -268 -3763 -8491 -13884 -12466 -11121 -7872 -13183 -2646 2304 -2471 -2833 -3380 -5513 -3206 -7019
5355 -7019 -12702 -9118 -11481 -15046 -17993 -10286 -5798 -2696 3537 -504 -7514 870 3490 4509 11645
5340 11645 15343 11620 13420 4037 4630 6699 7224 6242 8070 12771 3209 -7493 -8918 -8920 -9253 -3615
5324 -3615 10858 6858 -8468 -9371 -6927 -4374 -267 2425 4210 6571 11097 15101 15122 12029 10848
5309 10848 8006 7647 5265 -1971 -22202 -23315 -15394 -16577 -12804 -17214 -11120 -8684 -1448 203 -5638
5294 -5638 299 -613 2363 2312 -5391 -4839 -5999 -1814 -1633 1701 4343 6730 6040 1805 915 -252 -3162
5277 -3162 -8745 -13430 -11619 -7473 -13859 -19652 -16086 -12555 -13630 -15195 -12235 -9421 -8148 -14973 -18979
5262 -18979 -16115 -5064 1155 1226 -12056 -15066 -13609 -10856 -4405 -5961 -17871 -22641 -18782 -11464
5248 -11464 16 11182 9372 1857 -5567 -11499 -15586 -7762 -1733 343 -325 3121 7571 -1187
5234 -1187 -12392 -13436 -10994 -9625 -14083 -13775 -10320 -17549 -19511 -10646 -1889 2447 9234 12853 11912
5219 11912 7929 -7469 -2823 -5179 -7427 -17585 -19037 -25766 -25231 -15234 -1269 3454 -3038 -6192
5205 -6192 -333 1368 4589 12117 8723 -1926 -14732 -2097 15936 8929 3050 -1053 -6743 -3890
5191 -3890 -1830 -13171 -18690 -29838 -28264 -23348 -16737 -17393 -15317 -8836 -4893 -11320 -8601 -7235 -9369
5176 -9369 -2052 56 -7959 -1020 2265 6397 339 -3876 -8060 -9554 -13687 -15469 -15146 -10904 -15176
5161 -15176 -18508 -11204 -9907 -8086 -9743 -12624 -18665 -12978 -9539 -16555 -21071 -30199 -30765 -27802 -25935
5146 -25935 -21762 -20852 -15934 -13911 -12627 -6846 3176 -359 -3664 -5938 914 121 -9086 -16676 -11209
5131 -11209 -7616 -3624 -2784 1799 5902 6232 -1449 3160 9825 -1198 924 2902 1043 3142 6961
5116 6961 6745 9774 5684 565 -6874 4480 1462 -3294 -14192 -13927 -10531 -8388 -7490 -13153 -5000
5101 -5000 3350 -1369 -288 -2387 -1817 6373 5404 4951 1479 3161 16508 15051 -416 -5744 -10364
5086 -10364 632 4895 1308 -5784 -5045 -3106 -5023 2339 3094 3829 769 127 -1065 -2174 -2686 -6994
5070 -6994 -8137 -5008 6902 5209 5976 3618 4014 2975 191 2368 6049 11890 17112 18398 16497
5055 16497 17762 8708 -1882 420 8591 -52 -10136 -16802 -27265 -31661 -24775 -20958 -13136 -17000
5041 -17000 -16599 -14479 -20821 -16388 -8023 -4522 3598 10311 10005 4250 -3605 -4372 6575 -4307 -13399
5026 -13399 -3925 -5780 2305 14096 5297 -1078 -1537 3003 -3695 -7065 1049 -4341 -5041 -5739 -2826
5011 -2826 -2372 -8120 -10184 -7937 -11179 -5647 -7024 -7476 -5562 -5949 -11777 -21262 -15649 -8700 -9535 -9272
4995 -9272 -6548 -5534 -10437 -11530 -3136 12006 16615 17393 8336 12565 8819 2560 1367 1913 -6930
4980 -6930 -8941 -14990 -14046 2846 12375 1807 -1776 -3222 -4702 -7748 -7261 -7517 -7797 -9443 -11798
4965 -11798 -14798 -6939 -2735 -3239 -6227 -10358 -5712 4770 -1016 -15827 -9826 -1777 3394 8762
4951 8762 5032 6647 4651 6018 3329 -1096 -2099 1809 905 3717 1835 3565 -425 -3613 -12911
4936 -12911 -21711 -20819 -10891 -13351 -8546 -2161 -3057 -1820 -4952 -535 -1224 -7271 -7028 -2820 920 3036
4920 3036 5807 5444 1074 -1719 -1310 5130 11228 5741 166 -5940 -4817 1337 5695 2002 7020
4905 7020 11535 5240 8140 4579 10436 12083 8599 12110 16386 17675 20104 23847 30144 24416 12401
4890 12401 5609 4321 3846 -7839 -16736 -8246 9071 18244 8276 2660 -1677 -3551 -1671 4488
4876 4488 7108 4932 -699 -2420 -529 3184 8714 8257 -7614 -13434 -14186 -24607 -24483 -15263 -16091
4861 -16091 -15809 -7798 -3907 -4386 -1799 -1544 -2398 -3657 -2051 3262 -13955 -17549 -19651 -14933 -5677
4846 -5677 7661 11405 10296 4822 -11781 -10203 -10444 -6286 -1563 -2054 448 7767 5313 8675 -4139
4831 -4139 -21843 -19301 -13521 -4348 -2103 -1044 618 -5010 -3057 6864 10257 5280 -3100 -5982 -12027
4816 -12027 -9142 -5331 -2482 2940 -716 3947 5232 3559 -1080 -7087 -5289 -12001 -9655 -10689 -4105
4801 -4105 -7433 -15820 -10620 2166 5474 -8805 -10697 -6829 -10776 -13229 -15509 -22707 -19843 -9611
4787 -9611 -1948 -636 -974 -8553 -10265 -1704 -49 -7061 161 7192 12163 2042 -1760 3786 403
4772 403 -6534 -7800 -12019 -8316 -191 -3953 -14790 -11377 -820 4169 -73 -2891 -6397 -7005 -9867
4757 -9867 -7561 -4904 -5032 6087 10590 14465 2344 -6186 -5486 -7288 -7883 -8093 -594 -1771 -3586
4742 -3586 1540 4305 4570 1409 3812 4553 4700 7116 8799 11862 13883 5759 -2009 7223 5728 6505
4726 6505 7303 10679 7022 6544 5218 936 3369 10497 -1697 -8682 1047 -2491 -2082 -3059 -3251 -5059
4710 -5059 -10160 -9502 -13148 -12080 -10620 -8043 -2365 -5723 -286 2805 9760 9739 2378 8 -1791 641
4694 641 8345 7911 1404 2017 2451 827 -6945 -6096 -150 7291 10665 7245 -4421 87 4970 7018
4678 7018 744 -3817 -2275 3871 7751 7537 3257 -352 -6501 1193 9364 5793 5247 -1605 -3976
4663 -3976 -891 2454 -3361 589 9003 3001 3300 3399 -8777 -9338 -12101 -12762 -10086 -7051 -641 3950
4647 3950 1714 -2183 -16432 -15356 -9783 -18709 -22804 -11275 -1962 -1728 -7762 -5007 -6907 -11940 -9664
4632 -9664 392 -1081 -6522 -7942 -3562 1633 5812 9427 8836 7252 3628 -1984 -2412 -291 7451
4617 7451 4493 7546 11198 5713 1535 3687 -6624 -7230 -8683 -12826 -18217 -19554 -12974 -8371 -6182
4602 -6182 -4921 -3226 2804 6093 2903 7135 3387 -5471 -12164 -18014 -13322 -2008 -705 -5369 -15457
4587 -15457 -8806 -11026 -13483 -16060 -9202 -4478 -9651 2616 2319 -8845 -13498 883 1748 -6107
4573 -6107 -12901 -13624 -6262 -7258 -21490 -28762 -29702 -19400 -10038 -3829 -11699 -23017 -18115 -6998 -4224
4558 -4224 -6543 -13488 -18087 -9660 1897 10139 9452 10153 2288 -10840 -3353 -183 -2961 -7212 -15714
4543 -15714 -11606 -9482 -11797 -13749 -11440 -8334 -5294 -1931 5695 949 -4770 525 11400 7576
4529 7576 -2765 -6337 -7625 5499 18715 10853 7182 8805 4618 428 3755 8394 2045 2983
4515 2983 6379 3145 1934 3779 1109 5240 9675 4188 1488 -5031 -4882 -2448 1313 2583 8953
4500 8953 6361 -6950 -8718 -5576 -4824 -4493 -4390 870 13082 -394 -8337 -6047 -14960 -6601 8049
4485 8049 5138 -1287 -2197 -749 4836 12949 16017 13866 13289 17529 9708 2860 8680 10084 9610 10877
4469 10877 11484 16753 19801 22896 11132 3432 3887 -1960 2180 -10221 -9280 945 9168 3923 -6840
4454 -6840 -2957 -2646 -9953 -9552 -11570 -9456 -84 508 -5464 -2462 694 3873 -181 -2216 6185 10274
4438 10274 5302 5647 11392 11013 15818 17625 10766 7486 468 -4700 -5206 1889 1117 220 -7001 -3566
4422 -3566 1190 4421 8212 7693 654 -12494 -12330 -9898 -13755 -13511 -8850 -1180 6291 4273 572
4407 572 -5311 -6287 -5692 36 -6687 -7810 -13053 -14195 -10042 -10602 1565 8986 4279 -4079 -6100 -6145
4391 -6145 194 -1160 4042 -2742 -7613 497 -3500 -1809 6835 11256 11409 5956 2597 -2381 -3716
4376 -3716 -10154 -8493 1445 4356 4081 -6095 -13121 -13760 -20666 -26867 -21444 -11580 -7795 -12025 -14205
4361 -14205 -12682 -5452 425 -5462 -3932 -7865 -17595 -14558 -10388 -7433 -1187 2611 -3335 -7134 -15414
4346 -15414 -1105 13112 206 -8939 -3692 -4940 -1493 -3988 8150 20820 19796 5512 5867
4333 5867 -4656 -8386 -9906 -4775 -2727 -5735 -5321 -3312 -2867 -122 10922 7118 2535 6449 8144
4318 8144 7627 6865 643 -1498 -3990 -4938 -1956 947 3534 5053 9517 14956 6281 1295 -1956 1346
4302 1346 11965 9047 3584 4556 7801 7578 15182 12573 8660 7142 634 -7950 -13739 -9739 118
4287 118 9436 13882 3686 -9255 -18021 -11799 -7115 -3977 -5 -2402 919 3105 12393 14749 10988
4272 10988 3267 3202 8521 4279 5752 4715 1342 3685 13312 11412 913 -1039 -3650 -4171 -4443
4257 -4443 2079 213 -3574 -7042 3477 10959 10271 9615 8831 -4297 -10445 -7674 -2622 -5231 -5396
4242 -5396 -12452 -22401 -24376 -20032 -12887 -4413 -1103 -7455 -2711 7085 12503 -1259 -7168 -10157 -5172
4227 -5172 -2136 5284 10019 5034 -4103 -13845 -13834 -5909 -3216 6239 -1179 -4842 -2732 -4927 -2594
4212 -2594 -9673 -15635 -11481 -2695 10044 17812 12636 7968 10092 9809 2811 -4898 -4817 251 2242
4197 2242 9867 4909 4283 15491 22574 13252 8938 7831 3110 4648 2914 5152 3068 -5702 -7818
4182 -7818 -10730 -3668 991 -4675 522 1386 6781 8601 7975 6314 9704 9630 8319 3160 5585 2835
4166 2835 646 3158 -2471 -1181 3626 8817 4540 1339 218 3936 13595 16074 11394 -6751 -7988
4151 -7988 5563 3383 1358 -6299 -15303 -9578 -2537 3010 1544 -5251 -7302 -549 10543 11960
4137 11960 7691 2288 -3549 3248 3392 -6807 -10022 -405 9447 7598 12711 13285 9835 2525 -3352
4122 -3352 -3534 6650 6914 1266 1782 936 2180 -2795 1660 940 8168 10003 -564 -3131 1606 -3026
4106 -3026 -6876 -5732 -7110 -8659 -9404 -4081 26 5919 11533 14670 21237 22805 14287 3346 -7466
4091 -7466 -10419 -9381 -2086 6542 4209 -408 -2825 -6659 -12786 -11893 -8691 -1477 5920 2402 946
4076 946 5093 5893 16526 11408 2424 7395 10287 9309 1679 -9118 -7099 -9564 -14260 -14010 -15349
4061 -15349 -18040 -8204 3803 12717 8544 2940 -8420 -7514 -6632 -5369 -5895 -5181 -3266 9672 18511
4046 18511 12678 1383 -4093 -2084 4242 10524 9239 7503 14819 8420 2384 173 2979 3956 4686
4031 4686 5261 6208 -2592 -11167 -5156 7679 16725 22737 12377 -1820 -9255 -4240 7201 9549
4017 9549 8738 4309 1286 -572 463 -2757 -1457 -1422 820 2788 -3700 2405 3915 -10875 -10535 -4097
4001 -4097 1162 -5122 -12601 -15546 -12176 -8359 -19002 -13831 -5997 -3162 1191 12146 9223 3439
3987 3439 3505 13530 9485 -5417 -10891 -9205 -5763 -9508 -15660 -13368 2821 15982 18492 10789
3973 10789 732 -3310 1011 -1611 -8076 -3625 1276 10586 5072 0 -7779 -8038 -9141 -13085 -12095
3958 -12095 -8097 -659 -1840 4248 12855 5494 1586 1576 6838 7985 9146 3959 7539 14079 14533
3943 14533 2268 1881 7071 12151 11894 9851 9378 5099 10082 8637 7417 6331 7577 10944 199
3928 199 -8268 -5035 -1974 -3177 -6840 -9060 -4966 -2959 -5187 -3091 -1527 1238 -5670 -11636 -16199
3913 -16199 -19062 -14509 -15730 -17515 -15468 -10550 -10707 -4240 -7505 -12071 -18118 -16542 -10794 -12386 -10158
3898 -10158 -10070 -7322 -523 1888 3931 -6108 -350 488 -3351 -5598 -7709 -10908 -22969 -13112 -3677
3883 -3677 -1834 -13375 -13518 -15238 -13356 -12736 -8827 -8205 -10287 -10917 -11266 -16410 -17729 -12345 -8095 -3521
3867 -3521 -1275 1053 2366 1186 -362 -3459 -6799 -6742 -18785 -26531 -17413 -2663 -2264 -8675 -16944
3852 -16944 -12844 -8426 -6199 3534 -447 -5115 3946 3177 -7669 -12300 -9617 -11108 -7091 -1366 -3596
3837 -3596 -3270 -9102 -15089 -15529 -17208 -7215 8323 23156 23421 22607 4804 -11281 -6813 -1574 -2947
3822 -2947 -3252 -3589 -10606 -5568 4283 16948 11806 11569 11789 7193 7533 -1977 -5856 -5905 -3655 -7689
3806 -7689 -14006 -16757 -2646 7780 10141 11165 12542 12255 15213 696 -12684 -5900 -2637 -14282
3792 -14282 -9979 -8673 -5057 544 4826 -8575 -11492 -3250 2364 -972 -7675 616 1911 -7175
3778 -7175 -13716 -7504 1256 3966 3898 -2636 -3668 11602 8430 3672 4203 10172 6745 3603 -5743
3763 -5743 -8392 -2839 -8549 -11596 -848 9803 9108 16229 14907 7714 3934 -1565 340 -6305 -4537
3748 -4537 6134 9143 15823 20581 15821 13408 17761 19211 6120 7411 16455 7499 -819 3453
3734 3453 6007 -1524 -9658 -12278 -8087 -4528 383 545 -6859 -3089 2985 2951 -786 -28 -9857 -6794
3718 -6794 -5046 -6847 -19834 -19705 -16394 -14406 -12679 -8584 -6298 -4577 -6258 -1398 3743 6539 12851
3703 12851 15474 4367 7427 11583 11033 2970 -2044 -9133 -18662 -20590 -10826 -3232 514 -1617 6110
3688 6110 9948 10890 12812 7997 1638 5800 9042 4975 3632 -4767 -4048 -9857 -8430 2305 7752
3673 7752 3227 -10123 -8483 -1418 -1561 -6056 -4376 1325 2957 801 1149 -1228 -741 303 -2589
3658 -2589 -4401 4204 7980 5996 -1213 -6541 -12579 -22115 -16282 -9632 -6393 -2444 -2205 -2569 -218
3643 -218 -3818 -3893 7052 9373 1184 3564 13792 16467 15224 11104 11976 9184 -548 -6328 2109
3628 2109 3869 6272 1622 -2741 -1203 -9402 -9512 -868 3243 -1967 -17457 -16846 -14842 -12802 -13309
3613 -13309 -5806 9378 23137 20600 15211 6214 3889 7209 6816 7865 11032 15644 16887 7796
3599 7796 12802 15979 16290 16608 9474 2993 835 -12 -5050 2340 13446 7533 6055 -3552 -10625
3584 -10625 -6822 -6841 -14053 -7225 1351 3501 7955 10418 19121 15219 18569 20672 10499 -2419 -4927
3569 -4927 -7293 -8828 -2577 -917 -6982 -12027 -8750 -5845 -13264 -13812 -9766 -11972 -8162 -16379 -13317
3554 -13317 -15007 -6134 4279 -1456 -11926 -11929 -7704 -4407 1183 8916 8981 5486 -2266 -1867 2392 8238
3538 8238 15081 10008 12468 10968 8564 9037 15025 8811 6507 13265 12224 3158 4490 6864 -1201
3523 -1201 -4191 -34 1216 3234 6549 15100 18783 12350 2295 -2395 -1609 -3227 5738 11099 12405
3508 12405 7339 -760 -8056 -8196 -7779 -1341 -377 5452 10817 15648 12923 12623 9998 4543 -2667 -1033
3492 -1033 3557 1936 3151 10442 15130 -2920 -10056 -4963 -11274 -16504 -9763 -2048 4445 -1 2600
3477 2600 10419 6453 -5442 -11486 -5957 766 5015 17355 13581 15222 7523 -1804 -8415 -11723
3463 -11723 -11465 -11686 -7526 -12203 -11159 -6158 2771 -5445 -16877 -14799 -10590 -5946 700 4189 -1561
3448 -1561 723 1977 4897 -4304 -11630 -2957 6864 13435 3962 -10265 -16791 -14221 -9505 -5836 5790
3433 5790 9599 11188 6334 2723 1959 5781 7533 7987 8706 16579 22325 13711 6974 9621 5902 2143
3417 2143 6676 4456 3437 6497 1587 -5504 -10091 -3673 -8331 -12457 -3825 4485 -200 -2625 6887
3402 6887 -1049 -3675 -4292 -6633 -10552 -11114 -7086 -11098 -13284 -10491 -11322 -8361 5722 10113 10952 20836
3386 20836 11295 2846 -1371 -2630 -636 -760 -3038 -5734 -10063 -6423 -573 -665 7538 3929 4586 13592
3370 13592 17180 12380 7911 3588 4788 10444 15063 10986 6278 6405 2453 10633 11562 9720 9204
3355 9204 4040 1277 3963 6388 11747 4119 -616 -7123 -3499 -5615 -18112 -10585 -9586 -6268 -3210
3340 -3210 -6112 -9260 -4070 8710 8770 905 1579 7845 14783 8181 2444 -11241 -9838 2553 -6791
3325 -6791 -5058 -7216 -11624 -14646 -8500 -2176 -8465 -17378 -11873 -2439 -2197 -10067 -11770 -8139 -2748
3310 -2748 -15347 -8925 -2761 -1157 -4552 -4852 -2770 -8389 -14497 -6636 2467 -4088 -5298 -414 10063
3295 10063 5084 517 -2424 -6342 -11202 -12177 -13692 -5535 7840 8537 9252 16092 11434 10452 11491
3280 11491 14019 15483 16952 7648 9414 7035 10493 6306 -8611 -15501 -3074 6851 10317 9205
3266 9205 -682 -5549 -7230 -4624 -6913 -8851 -3762 -265 2575 11151 9273 11052 522 851 9304
3251 9304 13387 20746 18295 4300 -6780 -10008 -18951 -16627 -14705 -5973 2506 -921 -6061 -5972 -6052
3236 -6052 3322 4156 78 7424 14069 6584 6721 7009 1933 -4041 1053 775 -2006 -3760 78 1947
3220 1947 4181 9014 10093 11629 9172 9249 8629 2580 -2800 -4928 -4727 -3666 -277 5765 7795 7723
3204 7723 2488 879 -577 -2824 -2837 -4292 -2186 -1705 -10271 -19863 -4554 3389 2391 2813 -1436 -2548
3188 -2548 1181 7192 5870 -4206 -10470 -8384 -8385 -7358 -2790 3554 12306 2403 -7193 -5502 -111
3173 -111 -6709 -13583 -5926 2810 6038 4959 2395 4627 12708 10448 4695 428 -8138 -17063 -10457
3158 -10457 623 1370 2570 4634 3864 6936 5241 -7926 -6882 -1810 -2432 -903 6758 10791 1413
3143 1413 -6154 -9409 -2221 683 1266 7460 10176 13027 6891 11853 15787 22975 26881 31410 21123
3128 21123 17592 21681 16179 11172 10792 6872 6537 11183 6578 1794 2458 11408 8232 4648 2821
3113 2821 7427 9694 5016 -4300 -13463 -3430 2135 1458 -378 -6141 -69 3988 4237 1089 -3985
3098 -3985 -2668 -2238 -4061 -1975 2901 7447 5705 13270 16684 10761 1978 -264 -6831 -19504 -16670
3083 -16670 -9085 -10908 -5023 5957 8782 7391 1480 -7728 -3391 -2870 -2481 1001 9472 12829 12962
3068 12962 5926 11068 14654 16572 -3126 -4124 -10988 -14502 -12642 -3503 7248 6461 2975 3121 9720
3053 9720 8822 8940 2086 1555 3998 2915 -143 -3931 5551 9424 5523 4248 589 6664 9759 5326
3037 5326 -5425 800 5326 9561 916 -2274 -3723 -4433 -12772 -12247 -2935 6390 -2238 -5307 -1439
3022 -1439 2132 6861 8285 5372 8013 4291 2168 -13067 -15229 -8979 -15532 -21125 -14011 -8191 -9409
3007 -9409 -10993 -14053 -16981 -18807 -5091 6181 -2898 -5091 -9480 -6572 -11518 -10135 1593 10494
2993 10494 -1357 -14438 -8912 1502 -5069 -11553 -10297 -10495 -16296 -14921 -1719 2985 -2063 1723
2979 1723 9120 11522 8106 17732 22585 22930 12718 3815 -3615 -4346 -3911 5572 4170 -2336 -5123
2964 -5123 -4076 -7319 -8238 -14572 -8019 3615 8728 2632 7004 2698 7 -776 3783 4084 2033
2949 2033 -5142 -1972 3847 6798 5778 8143 11127 10226 2384 -3756 -7085 -7735 -7268 -6423 4603 7914
2933 7914 12259 8879 8812 9810 10667 13585 10066 10699 10188 6256 13761 10796 3964 9873 12327 10570
2917 10570 9290 5303 1479 361 -4117 659 7090 11919 11932 5441 -3014 3686 8195 10660 5345
2902 5345 -6643 -7073 -5096 -1669 2019 1145 2892 4434 5206 4234 4104 5679 6132 -4355 -3739 -8221
2886 -8221 -11871 -19583 -16846 -8997 -10861 -19670 -27860 -23415 -8615 -4738 -5770 -5412 -11636 -8626 -5205
2871 -5205 -2430 2938 4152 -2814 -14013 -8597 -9833 -11109 4973 20445 19383 14821 10581 9631
2857 9631 4737 -1784 -3675 3863 5158 163 4804 6038 6320 4229 1066 -1442 6186 10723 16155
2842 16155 11313 -4784 -10202 -8595 7950 4950 5355 -5252 -6444 -7266 -7626 -3286 856 -2305 4377
2827 4377 1321 4404 6855 2949 -5718 -9766 4626 12533 11244 9967 5394 777 -3046 -2199 3513
2812 3513 -566 -1352 -3976 -10918 -12854 -4665 4563 8245 8263 1602 -6486 -12428 -8371 -4132 1487 12603
2796 12603 18564 26193 24132 21865 11913 -2804 3260 15886 12779 1039 -3768 -6902 -13419 -7815
2782 -7815 -4524 700 7416 15134 22381 15678 8058 5449 11652 12800 8469 -602 -5767 7960 7976
2767 7976 5909 4736 2657 -729 431 4316 2954 1303 -3518 -4174 -11274 -10438 -4049 -1108 199
2752 199 -2005 -6104 -15715 -13058 -4581 933 11702 13338 14782 15900 17603 10613 6056 12784 14719
2737 14719 13369 9877 10434 6931 -4385 -15820 3012 13030 13900 13449 7890 -9190 -9960 -273
2723 -273 17698 24476 20968 18474 10399 2646 1990 5114 3051 624 -3593 -4606 -3541 7584 10487
2708 10487 14319 10992 15466 14379 7812 6357 12412 20390 11608 7680 8704 -1285 -3922 3165 10025
2693 10025 12160 7466 558 2357 8208 4246 4273 6405 10038 11642 8958 -3468 5483 12392 13154
2678 13154 716 -2534 -6385 -11238 -12884 -2101 9306 13555 8067 5514 10277 11797 6914 2299
2664 2299 -7909 696 6717 9008 -160 -469 7629 19277 8704 -2840 -6875 -10048 -13425 -10742
2650 -10742 -4207 -2458 -2494 -4987 -8014 -9730 -1210 4485 -4058 -9691 42 1166 4441 11767 8018
2635 8018 7958 -2220 -3091 -3072 1168 3246 -4720 -2225 6537 12436 15425 14604 16897 5469 2890 3934
2619 3934 766 -7924 -6226 4299 5622 4437 2102 946 -3485 -9420 -1704 9679 8714 1136 -908
2604 -908 6587 14909 12641 -879 -12033 -17302 -9948 -120 8016 -1298 -9552 -6250 315 -486 -13717
2589 -13717 -3609 10318 11484 12562 14028 11771 9179 17833 8619 7144 6567 -402 -6927 -4574
2575 -4574 -378 6180 6245 3055 10128 -1635 -7965 -7210 -5068 3513 984 3138 13475 9732 1316
2560 1316 -5123 -1619 13462 15559 14041 14104 15554 7164 -852 -5411 -9410 -11918 -7565 -9854 -11263
2545 -11263 -15424 -21292 -17148 -12556 -6439 -5986 -5351 -3828 -1307 -8986 -8060 -892 10890 9486 5145
2530 5145 5708 15142 15692 11464 6954 5175 8864 7969 10881 3641 -5294 -8691 -11573 -4939 3322 8774
2514 8774 4034 9360 5461 1079 -1212 -8682 -20127 -22376 -8647 -5377 -11172 -7036 -418 5060
2500 5060 4269 9142 6104 11354 14579 10042 11151 -2281 -11246 -9299 98 6856 7366 3446 988
2485 988 -753 92 -1237 3783 -3502 -11168 -13198 -23443 -24132 -20914 -16118 -11477 -7908 -833 3258
2470 3258 12135 8959 3068 1112 -2053 -4857 -7393 -2521 9622 17062 21176 15051 9425 6195 1979
2455 1979 -2024 1819 1906 1030 6563 -3234 -13442 -9248 -1306 -3304 172 2782 4545 4220 13230 12723
2439 12723 6223 -728 2273 4198 12439 13401 5921 -2339 -4953 -2186 -2556 -12075 -12161 -776 8176
2424 8176 7767 7796 7024 16334 22619 22877 17626 9091 8130 1145 -1228 -1380 -1224 1350 -3869 -6341 -6637
2407 -6637 -1289 4903 -921 -2229 -683 -3103 -340 354 -547 -3027 -3155 -4852 -4631 -764 8466 14540
2391 14540 20383 17479 24275 24013 20387 7850 10541 11227 6332 1129 -2997 -5577 2293 5 -8633
2376 -8633 -16001 -18451 -16810 -12163 -8641 -1257 341 -3126 -367 -2031 8231 6747 3527 4044 11149
2361 11149 6894 3432 -1915 7138 10302 2402 3741 5352 294 -6171 -16878 -14154 -7754 1963
2347 1963 3525 5377 3069 -1102 -2544 6031 9934 11582 2983 -3831 -10072 -2729 -1976 -7598 -16042
2332 -16042 -8418 3983 2741 -4927 -7273 -4141 5806 7104 465 -4821 -6538 -6288 -10538 -14698 -362
2317 -362 4577 2962 4471 5137 -7034 -6614 -5709 -4228 -5773 -2106 -3879 -13708 -10073 1903 610
2302 610 3600 9015 2360 -5950 209 10931 11281 10851 9339 -613 -15762 -17471 -8553 4768 13007
2287 13007 10551 7055 1141 -4949 -1115 -2369 -12663 -5799 3895 1876 1251 -2310 -3061 -3450 1120
2272 1120 11093 2001 -11672 -20661 -12464 -8180 239 3986 9517 9219 4654 5782 4588 1251 -207
2257 -207 940 1809 -1922 3109 289 59 578 -18755 -26301 -10771 4722 6774 4358 6949 5123
2242 5123 10635 5435 4425 11684 10194 8737 6566 10852 5273 -8961 -4194 -3919 -7365 -5883 -7692
2227 -7692 -8480 -10662 -6360 -1751 -9809 -1331 -961 -3962 -12960 -11328 -14364 -16394 -18727 -15288 -12147
2212 -12147 -15655 -7348 -3658 -12276 -10447 -2391 3969 6544 -11486 -19815 -20172 -20263 -5951 -2648 -4260
2197 -4260 -3362 -2688 -4687 -9349 -15566 -10660 -3352 -2665 1118 2529 1079 1968 6867 1082 -1325 3708
2181 3708 7482 3539 2914 11791 20546 19873 22259 14502 7747 10286 4755 2231 1579 4561 10185 10778
2165 10778 7215 12452 5879 -218 1316 -649 -3741 -1866 -330 -2867 8408 17301 10431 -763
2151 -763 -9064 -6677 -6489 -1763 896 -9089 -8839 1405 7442 957 2626 3301 5822 16182 15140
2136 15140 2675 -7303 -9572 -9446 -8367 -6719 10263 23515 27398 20039 14772 11615 2370 -234
2122 -234 -5615 -14582 -10669 -5054 3855 11157 8241 6538 397 -843 -2328 -3837 -10311 -3407 -6098
2107 -6098 -14542 -14608 -1809 1247 7160 14919 13410 16049 10873 -3251 -6551 -2513 -5491 -351 267
2092 267 8729 11681 11092 8778 12844 4504 2702 9691 12459 6376 8648 17233 23560 20622 20909 20093
2076 20093 13467 17840 15240 6992 -387 1182 5596 6333 3091 791 -8343 -14265 -16074 -9002 299
2061 299 15 -2572 95 -3215 -9289 1009 3527 -2184 6365 4498 2040 1256 -156 3122 116
2046 116 2735 2479 -958 12987 16939 12641 7473 5515 -258 -2908 531 4310 5204 2210 -802
2031 -802 7130 18281 12722 12735 13691 14738 15791 13879 8483 -4275 -1055 3500 -1025 -5242 -10198
2016 -10198 -11833 -7049 -10968 -5857 -5795 -1080 -3234 -3534 -6578 -3074 -4950 -2581 -4463 1133 12057
2001 12057 11539 3058 -979 -7372 -7791 -1801 -10089 -14800 -14767 -1747 10431 13543 1049 -9524 -2179
1986 -2179 1770 5451 12710 17827 17607 8761 -7312 -20050 -18951 -10512 1776 13184 12396 -1643
1972 -1643 -2429 -224 -6090 -5667 3940 8447 -1188 -11985 -12677 -194 10891 13345 13781 4509 7126
1957 7126 15216 21869 25385 18888 20305 22066 23727 14081 4885 -2658 6061 4823 -4432 -10661 -12858
1942 -12858 -7707 -55 11181 17489 11123 10008 10081 6252 1638 -1479 3156 15645 15478 5471 -1238
1927 -1238 6355 12294 4616 -310 4097 -4094 -5842 -7431 -10479 -6907 1241 13502 9329 -3305
1913 -3305 -3229 -3349 -3024 -3532 -5646 -7825 -2486 9916 12953 1385 -2371 458 6820 4264 1827 -5151
1897 -5151 -991 409 -4161 -5731 3257 8876 3377 3151 959 3559 9420 8000 -5278 -1932 5568
1882 5568 13588 17317 15226 8486 24824 26295 2830 -3008 5039 11425 14521 9930 14979 19085
1868 19085 11133 707 -4113 -3529 -1662 -2328 -8745 -16428 -7939 -7684 -14537 -12681 -5149 3344 3474
1853 3474 -3389 -4136 -18558 -17706 3422 8220 3873 8143 8255 1385 4078 5840 -3176 -4528 -3481
1838 -3481 4009 4568 4343 4598 -891 -8275 -1532 -2134 -170 -2855 -7463 -4500 -10612 -17273 -19829 -8523
1822 -8523 376 -3268 -244 -5540 -12028 -7466 -4767 -13933 -21453 -14062 6976 6967 2403 5310 631
1807 631 -7207 -4017 1748 1668 -3064 -8159 -8413 -9332 -13973 -13516 -7204 -2990 2977 -6197 -8185 2522
1791 2522 -506 576 -4039 -10886 -11969 -13922 -6085 134 7378 3652 3394 1534 9558 10038 9513 2863
1775 2863 -2002 -1886 -404 -1968 740 4266 1822 10925 18055 19867 21931 9883 -2899 -8157 485
1760 485 11984 13758 20638 25714 7755 5458 1518 -4435 1644 3067 1184 4463 2715 1736 7316
1745 7316 9395 6129 5166 11063 8817 6247 8140 5539 8221 6558 5115 4483 9195 -265 59 5370
1729 5370 2841 1129 -1327 -2733 5743 11913 16650 14721 1953 -8746 -14367 -1429 1981 -647
1715 -647 8775 8850 -3181 -9749 -21346 -20347 -22823 -16044 -13235 -21998 -25589 -14666 -8783 -10507 -10277
1700 -10277 -3674 -5565 -12194 -17214 -4179 3214 -1966 -12402 -7644 -2629 -7514 -6146 -8913 -11286
1686 -11286 1229 11031 6083 9111 9348 7375 9063 -2266 -6759 -4542 -5872 -3047 -7862 -9564
1672 -9564 -7224 -8722 -11601 -2725 5178 748 -3467 109 -313 4007 -2584 -2014 338 2115 9904
1657 9904 9968 -2081 -7470 -4032 -2727 8504 9204 5572 3372 7130 10394 11654 11101 11070 9845 10229
1641 10229 -1991 -2532 -613 -3108 344 267 -4491 114 -1258 7745 12656 5546 4230 -12633 -20711
1626 -20711 -7258 -9437 -22830 -19495 -18083 -8410 -4690 -288 3352 1366 157 3378 6087 -27
1612 -27 498 -3454 -438 2836 -2121 -2676 -1404 9692 21620 29936 24223 14019 5452 -4633 -11906
1597 -11906 -11826 938 8713 -2022 -10530 -11081 -3808 -4687 -12101 -17202 -11771 -4407 1600 -5233 -15888
1582 -15888 -9348 -3016 -3497 2276 9193 9003 4682 3556 7843 5815 6428 2174 -4252 -8281 -10095
1567 -10095 -16419 -13860 59 -1824 -4220 -12315 -10242 -10635 -5010 1098 5848 1782 5000 11670 15640
1552 15640 12342 6842 -1764 -869 -4865 -7038 -2435 4472 4191 -2638 -2250 2197 4188 8436 12153
1537 12153 -2272 -11288 -7324 -103 2358 9036 10844 5992 7182 7257 9072 1146 3256 9015 11870
1522 11870 11327 5158 6029 8120 5397 162 1305 965 -16544 -12305 -8457 -706 -1459 1107 -3052
1507 -3052 -6411 -1103 -9681 -17556 -27504 -24165 -18745 -8774 2353 8828 11821 6929 5837 15062 11012
1492 11012 5273 8252 14408 19713 17388 18055 12885 1015 -6181 4185 12831 9983 -13 2058
1478 2058 1265 -5424 8988 17579 3847 -1436 1997 14901 9685 1402 3561 623 -1069 -630 2646
1463 2646 1227 -5466 -2912 2187 -3299 -1583 -1105 8971 9969 5962 7375 10273 3548 -907 -2757
1448 -2757 5867 8918 14149 13601 6211 9157 12181 15615 17052 14407 13767 8844 1555 -1226 -7104
1433 -7104 -14041 -12868 -9336 -6194 -4220 5799 14504 13630 7550 2120 -6279 -7455 -11957 -19835 -23696
1418 -23696 -15945 -7966 -369 3329 77 -105 2373 6880 11863 10255 11730 16039 9129 -5797 -3237
1403 -3237 9324 13518 6521 -5293 -3960 -247 4664 10996 2823 -5699 1333 3824 33 -7029
1389 -7029 3649 11886 16662 21220 7681 -1047 3554 13265 10923 7028 2732 -2659 -3454 -4313 -5394
1374 -5394 -3845 3012 3375 6879 4510 5955 16684 9116 -4375 -5696 -8137 -9054 -3028 560 1058
1359 1058 -801 -10192 -2739 7424 14294 7225 4894 9695 8688 4773 1597 -6414 -3861 1941 2966
1344 2966 1861 -4830 -3576 -6530 -6639 4847 3049 1047 2020 6133 765 -1071 4011 4901 10210
1329 10210 8431 -3614 -4297 -2653 -10834 -19384 -20389 -11453 4138 4968 11009 15429 10242 5612 9143
1314 9143 1787 -349 3400 -2751 2925 1014 2253 3583 -1772 -2073 -4000 -1863 -1957 -1343 2713 678
1298 678 1916 1056 5812 4765 6577 4155 -1850 -4132 -997 -2535 -2589 6416 9107 6792 6534 7205
1282 7205 7862 7494 -192 -2308 -110 5743 5908 1773 -5738 -1633 -7789 -10072 -5941 -2719 -2347 5079
1266 5079 1568 946 5660 10308 9029 9060 3892 455 -1030 -3351 -607 3698 7672 6142 3020 10416
1250 10416 13089 21671 12713 14247 15010 23220 18856 18428 16938 11318 2281 3967 7076 6651 7852
1235 7852 5058 7486 6579 2929 463 -2793 -7407 -7865 -7941 -11127 -1169 -4385 -13746 -20158 -23101 -20658
1219 -20658 -17774 -11279 1127 4751 3733 5369 -6282 -17112 -12490 -5026 298 -6492 -10426 -4717
1205 -4717 5489 13631 10902 11637 7995 1733 6873 10926 6890 -2587 -2584 -1476 659 -6132 -11814 -8621
1189 -8621 -2678 1770 11558 13552 16523 13365 5929 -835 6450 17620 17547 13556 9053 -6462 -15996
1174 -15996 -18129 -20520 -13610 3932 9297 2527 -7214 -8640 -9614 -7944 -2654 -12965 -14600 -13171
1160 -13171 -6476 4522 7058 1719 1398 4681 18912 22896 17888 8240 6835 -3792 -12407 -11057
1146 -11057 -12150 -12816 -12882 -9345 -4377 2802 -145 -6052 -11267 -10049 325 -5785 -9675 -11578 -4259
1131 -4259 7146 12289 7397 -1848 2541 5410 922 -389 -1712 -2667 -5720 -5408 -3540 -3260 1392
1116 1392 -4032 -1529 -4143 -4596 1362 8068 6971 14459 12114 14805 9159 5209 -2299 -6971 -7849
1101 -7849 -17074 -16398 -15987 -5237 6188 14969 7720 1092 1552 10398 16004 19447 10315 3764 11989
1086 11989 21068 11704 3227 -7935 -8196 5825 11842 9733 3231 10947 4395 -2675 -9138 -3458
1072 -3458 5892 7483 -2949 -13314 -4166 -20 4497 7493 10758 691 -8704 -12449 -15345 -7913
1058 -7913 7523 9470 3194 -136 511 -280 -2401 4634 -4704 -8625 -10250 -5955 -12977 -5595 -1470
1043 -1470 -8278 -5624 -3605 -1235 -4093 -4146 8056 7006 -714 -430 4946 10170 10693 15439 9561 7861
1027 7861 9111 16993 10449 9792 8165 7942 18055 25641 14538 7575 13037 10312 -4879 -9397 -2223
1012 -2223 2488 -3033 -10208 -2007 8887 13080 7987 12319 3003 -10521 -13266 -10447 2412 10370
998 10370 9778 5395 3580 8007 6676 958 -3715 -1337 -3392 -2325 -10398 -13345 -13783 -9628 -14358
983 -14358 -22521 -24085 -9470 -3039 1713 784 -134 8655 7311 11103 13588 14068 9840 4762 6088
968 6088 7690 4720 7103 2103 -715 1173 5971 7506 9184 2698 -3053 4535 -2421 -7844 -8605
953 -8605 -1178 5274 5033 11365 11802 8138 -3525 -17345 -13497 1139 7327 5033 -3540 -13406 -12476
938 -12476 -1933 -919 -4997 830 2626 7605 11075 14327 11574 5515 3671 4119 -999 13 5109
923 5109 4964 453 -8626 -8827 3680 5891 6929 8001 17153 10480 8290 13775 13423 22379 28336 24727
907 24727 26984 20555 19599 15167 8631 -418 3299 7465 4732 -452 4797 8728 8624 11229 11517 4169
891 4169 -4813 -10705 -7960 -3080 201 6772 10615 114 -2288 -8177 -10789 -8247 -10344 -18494 -17472
876 -17472 -8454 -3493 -1514 860 -3052 -10926 -17263 -17219 -8419 -12092 -6554 -2422 -3075 3379 2427 605
860 605 -534 1855 1339 1662 3383 6230 11207 20489 25820 30061 25860 8435 1329 5878 -250 -10533
844 -10533 -8347 -2117 -594 -3375 -3027 3536 9823 10297 -10893 -7604 1916 462 709 7758 12342
829 12342 15894 17551 -29 -7708 -2066 -5520 -11258 -10833 -6716 -610 4414 -1669 -8352 -15003 -8858
814 -8858 -12847 -16386 -14503 -10791 -8640 -13869 -22479 -28000 -22758 -19013 -18786 -12932 -3522 -2130 -3751
799 -3751 1916 1934 14092 20472 5066 -6716 -4495 -5306 -6263 -83 1861 -3760 -15811 -13622 -7220
784 -7220 -955 -535 -3909 788 -4030 1224 3573 6982 1998 -2375 64 -2194 -9153 -17535 -14075
769 -14075 -976 -5375 247 3833 -3049 7187 12855 8999 4907 3251 -8756 -7619 -11654 -10540
755 -10540 -10015 -397 -1772 -358 4371 5308 4480 1013 -8462 -16978 -11735 -2375 -7616 -12343 -10772 -15865
739 -15865 -11367 -3609 -3924 -4255 -1898 1273 3093 1597 3707 10292 2588 -2482 -12877 -21162 -30006
724 -30006 -25178 -25767 -24162 -20486 -20550 -22819 -22450 -15589 -11829 -4916 -10233 -11374 -18196 -21932 -23107 -20867
708 -20867 -13660 -11120 -9404 -9607 -5432 -7479 -6369 -579 7013 6203 4681 5767 7684 4 -9427
693 -9427 -11225 -11025 -15293 -12615 -20530 -25877 -13779 641 612 -14057 -7283 -1614 -6636 -10353 -7509
678 -7509 -8241 -8922 -5546 -3089 -7613 -6076 -3534 1840 -4743 -4321 689 -4824 -3642 3257 3232 -2139
662 -2139 -4664 -4241 3169 10779 13606 1679 -8988 -11660 -10936 -6799 -10724 -9573 -3057 482 -2173
647 -2173 -9155 -13436 -17553 -13501 -17144 -17477 -13326 -7446 -10915 -13361 -7114 -3873 614 10357 8674
632 8674 5117 -2670 -5198 -6434 -9112 -11329 -8999 -7917 -10357 -10172 -10018 -15705 -10383 -3010 -3774 -11407
616 -11407 -11696 -7765 -10272 -15751 -10279 -8278 -4268 -3373 -5786 -3980 -10645 -14415 -15569 -16635 -16083 -4370
600 -4370 1136 3127 14360 21184 10804 996 1745 -161 -1563 39 -3451 2562 1456 -2344 6057
585 6057 7445 9008 5564 1571 7418 5733 3603 165 -6569 -7951 -2074 -5300 -8674 -8297 -3993
570 -3993 4136 1857 -570 8630 3330 4717 6334 -1242 -7292 -5810 -7064 -7832 -1140 -1304 -9318 -5602
554 -5602 -8895 -14659 -13667 -11149 -12041 -9925 -16119 -9176 -7357 -1115 9923 6145 -5698 -11295 -11321 -12471
538 -12471 -10220 -21021 -15715 -11718 -17461 -14461 -6954 -1669 -3945 -12147 -15897 -9850 -4146 -1287 -1504
523 -1504 2985 -594 -2528 -675 -1516 -4940 -16644 -18913 -9226 1839 6242 3417 12147 5433 -6212
508 -6212 -5969 -11524 -9667 -12680 -21171 -17166 -11269 -13262 -7372 -7556 -13263 -12583 -1327 7203 -1438 -15312
492 -15312 -24611 -31083 -21570 -11992 -12676 -13495 -13592 -5671 -536 1263 -1030 1719 11892 211 -1343
477 -1343 3984 -4740 -9876 -7455 -7225 -17202 -26444 -26549 -23582 -21368 -13018 -12018 -8983 -3789 -11183 -19521
461 -19521 -20386 -17636 -7121 2992 -1260 -11543 -9194 -15775 -10924 445 2286 6466 9139 2591
447 2591 1550 -66 -5604 -6232 -7628 -2870 -8266 -8869 -7942 -147 -2703 -11662 -15687 -17219 -17025 -9351
431 -9351 -2915 -6361 -11847 -9067 -2309 -6064 -3988 528 -5234 283 5075 -2444 -4257 -3383 -1881
416 -1881 -5659 -4321 128 1804 4309 139 3033 622 -2081 -4090 -5146 -776 -8700 -10886 -17644
401 -17644 -16360 -10961 -13255 -12670 -16707 -24668 -14360 -5654 -10386 -20084 -12718 -2907 7887 12325 5254
386 5254 -1450 -5790 -12209 -15748 -2502 4681 -5639 -16829 -11676 -3447 -12267 -17718 -17747 -10008 -3335
371 -3335 5499 13397 11440 -6753 -12320 -15507 -11764 -12574 -14467 -16896 -16788 -9607 -6060 -8356 -8858 -5112
355 -5112 -3178 -10654 -18520 -21388 -8512 -9695 -12691 -14759 -16547 -12188 -2471 435 1402 -4370 410
340 410 3492 -715 -2970 -3653 1509 4770 -2570 -7989 -6106 -7313 -11640 -10522 -10293 -15298 -22291 -20078
324 -20078 -14843 -10767 -10673 -5500 -4098 -5153 -4829 4442 9458 10569 5951 6636 8963 1083 -7551 -13839
308 -13839 -10463 -11473 -13960 -5564 -7603 -9180 -9742 -12693 -17724 -13310 -12920 -12397 -2906 4111 -903 -2865
292 -2865 937 5043 1864 6473 4729 8353 6192 6781 3458 -346 414 -3457 -10695 -4581 -1394 -1594
276 -1594 -14419 -25531 -25483 -19546 -13889 -5673 -7516 -13033 -14493 -12043 -6850 -9969 -10279 -3265 -1829
261 -1829 -2165 3845 3679 5211 2858 -1902 -5598 -5292 -1735 -4008 -4542 441 -4499 -9284 -5281 10324
245 10324 12044 5631 -8463 -11556 -10723 -5638 -3322 -8147 -11094 -10639 -10182 -7019 -2131 -421 -1453
230 -1453 -4199 -5623 -5866 -1323 -5363 -4856 -5453 -5277 -12283 -8019 -6523 -10258 -4375 5235 2122 -548
214 -548 -2199 971 6229 9320 7863 4376 5801 -2593 -8179 -8196 -6291 1950 6559 5371 2601 -953
198 -953 638 -1736 -5062 907 6855 1163 -2780 -984 1326 -6019 -6714 -3898 2282 1706 2785 1166
182 1166 -5322 -11209 -17096 -13142 -6749 -6264 -4817 -12486 -19775 -21304 -11670 -5905 -5693 -8321 -4699 -6182
166 -6182 -11844 -9276 -9082 -3466 -2315 -2251 -6771 -9139 -9532 -8939 -6504 -6461 -3564 -6306 -829 1683 -2026
149 -2026 -3111 -5285 -6196 -5790 -11069 -11365 -3702 898 -5970 -9275 -15546 -16309 -19498 -14819 -14669 -11299
133 -11299 -8147 -10617 -5870 -403 3698 1769 -5310 -8327 -12564 -3314 -6413 -9971 -8723 -5477 -2950
118 -2950 -1984 -3929 -7631 -10496 -6617 -3275 -8945 -11574 -13188 -15955 -8519 -10201 -11902 -14148 -16210
103 -16210 -6798 -1606 -4213 -13341 -11871 -17542 -17353 -17807 -20208 -16007 -12854 -14897 -12970 -9543 -12022
88 -12022 -9637 -5281 -8613 -9935 -9569 -11348 -2621 1915 3402 2704 -2960 -10254 -16150 -17549 -10757 -1916
72 -1916 1256 -9403 -10715 5236 12433 9655 2826 -12569 -13141 -4802 -6405 -11758 -17567 -15192 -12048
57 -12048 -14782 -12274 -8131 -6468 -7786 -10465 -9934 371 2368 -2461 -1357 -7641 -8400 -5485 -2920
42 -2920 2534 1206 -586 -2754 -8698 -8330 -1786 -1804 -3100 -4328 -6290 -5674 -10415 -16470 -12604 -11624 -9345
25 -9345 -2847 -191 1629 -57 2553 3144 247 -1422 -3391 -6533 -1563 3751 484 -1786 -3342 -2225
9 -2225 1866 -6402 -7395 -4736 -5397 -7362 -6631 -8036 -5509
0 -5509
$$ Imaginary data points
##PAGE= N=2
##DATA TABLE= (X++(I..I)), XYDATA
32767 46655 49777 52316 55236 56565 59908 58481 58611 55202 54403 58569 62128 67893 71282 70141 64279
32752 64279 57307 57628 61079 63931 60742 60915 65235 69206 65617 63485 63068 69857 79454 77292 72424
32737 72424 70872 68338 65436 65143 66778 66841 66829 65579 65657 62708 64749 70485 74981 81132 79658 78385
32721 78385 82408 91177 88426 84539 82526 88017 83396 78390 77076 77792 79934 88808 96689 99672 101161
32706 101161 88424 83556 81748 90129 99119 99952 91848 87623 87452 84924 86493 91187 89345 89093 89842
32691 89842 92793 99765 93250 84986 84438 79677 77579 83089 89178 95521 97003 104807 111046 106663 106057
32676 106057 105851 104450 100029 98440 93342 82404 83454 91419 96654 94917 97835 105518 109032 107316
32662 107316 104643 101870 98450 97417 107216 107731 110985 116867 117139 111054 113127 120549 125115 125146 122225
32647 122225 120213 114127 111753 107860 103939 98854 97856 100870 100617 104197 109818 100080 101594 114322
32633 114322 120868 130049 130819 131631 123468 118834 111721 110515 109557 113365 116227 114089 122933 125821 125140
32618 125140 128255 119308 117815 122891 125302 129858 124822 129852 139006 140181 135687 137415 128298 124003
32604 124003 127434 128997 123291 128177 125312 124887 124779 119850 125554 126510 128279 130519 132585 135920 135158
32589 135158 139253 133302 134737 139401 136438 132021 136670 140192 144049 149167 146477 140555 139939 143467
32575 143467 143937 140855 139063 150154 155553 159088 160999 160974 156218 149796 151318 147633 148104 143752 144987
32560 144987 152779 150629 149392 155112 163014 162628 160270 158778 157347 155507 159763 153574 145818 150840
32546 150840 151877 150217 156915 158689 154731 157684 151838 144736 138267 135398 139600 146976 144071 146005
32532 146005 151099 153504 148634 149611 152861 157152 156390 154526 152186 144248 145720 148480 151052 149131 153344
32517 153344 164932 171547 171203 168708 160900 165462 168702 159234 161135 167331 168148 170735 177054 173612
32503 173612 164842 153699 153535 160610 169530 167124 169779 176001 181171 174177 178600 180393 176452 169154
32489 169154 169887 171347 176035 167265 169908 174862 173246 166167 166210 173133 179940 179575 185780 185104 181573
32474 181573 177715 174012 165251 166261 168457 173205 183099 180834 179061 182702 181428 181192 188263 186804
32460 186804 183421 179296 179866 170336 178913 185003 186738 188124 188402 181916 179389 175967 184637 190582 192258
32445 192258 191100 197217 196727 201854 197922 187724 186044 183698 179745 183397 185760 181453 181980 175298
32431 175298 179868 187842 184749 182548 187267 191453 184918 193588 197945 197202 198835 192897 177497 177210
32417 177210 189837 197230 198439 202808 203925 202600 197547 188222 189375 196362 193504 196012 204977 206526
32403 206526 205587 201176 199940 194489 195062 194113 191325 193371 195796 198398 193137 195763 196849 196669 203143
32388 203143 207269 205293 199290 198200 196555 203215 202982 208104 204075 205795 203182 193110 190931 193595
32374 193595 195867 202549 208621 209104 207328 211361 219455 216174 212463 208761 211986 208311 206163 200030
32360 200030 197865 199232 206616 209412 208715 213496 216943 213951 211655 208149 198722 205419 204375 205691
32346 205691 216114 219163 207122 199900 204692 205888 199276 199116 188910 190943 209268 212648 216531
32333 216531 219359 221298 220005 216441 216353 217262 213623 207748 204863 208413 211129 205365 200196 199276 193044
32318 193044 187023 184488 192547 198918 212703 223721 226037 222805 223794 220457 211032 212820 216069 206975
32304 206975 195102 203375 206489 213993 223374 222452 211138 208734 216837 216661 210739 208075 206348 205668
32290 205668 212294 215488 213190 221652 229702 222651 224121 221530 215139 211466 212656 208704 194414 184540
32276 184540 197559 212536 209397 201688 206349 207849 207564 203027 200995 207789 214459 212440 213170 210226
32262 210226 215719 212474 212469 214437 219715 223007 222180 215307 215458 217396 224226 224051 213891 208836 219186
32247 219186 216366 212205 213293 209888 208222 209284 214802 217190 223086 228575 237607 225890 212928 217068
32233 217068 226362 233739 219302 206352 203933 208643 223291 224337 223650 219775 226045 229733 225583 232822
32219 232822 226448 225280 230744 227909 227290 219488 215594 219857 221010 219313 221916 219339 218554 212268 217749
32204 217749 221169 219037 234639 238120 227933 226933 225856 223756 212743 210869 210709 203255 203580 204102
32190 204102 203994 208174 205765 200011 193926 195364 199605 213397 220512 225972 220687 213226 208598 209086
32176 209086 218157 219478 224676 225386 225329 223580 228806 230501 232273 226205 213678 205576 208348 213390 214993
32161 214993 223002 227183 226961 217545 214330 216657 212703 207947 216309 210181 208755 205993 210585 211652
32147 211652 217897 218952 213156 227151 229556 231516 230628 219185 214875 215806 208951 205061 211702 215662
32133 215662 215386 226169 227138 224242 229482 233782 237721 230516 220657 221814 217259 205564 208665 219345
32119 219345 211614 203668 202482 210433 214748 223294 222437 217445 211207 215008 220091 209499 202361 196641
32105 196641 200131 213053 222313 222435 228454 221915 215651 222522 222881 217488 210617 215505 220966 215686
32091 215686 205521 194491 205089 219298 213964 214102 215586 215943 225698 237991 234243 237190 236575 232707
32077 232707 233663 225760 225555 220007 225321 235197 226198 221436 217718 210875 215271 215146 213504 207300 216006
32062 216006 222095 221154 228401 238754 240512 231157 221888 209504 222598 219732 214218 217756 211470 206846
32048 206846 202601 204954 204661 209217 218781 221344 218311 213798 221330 222492 221466 226428 219880 217575
32034 217575 225439 228087 220655 224790 228407 219531 219137 227668 231466 231212 236058 239934 227298 212106
32020 212106 208380 221703 222995 220646 227740 222423 219624 225333 229552 221408 212176 218135 218455 212227
32006 212227 220236 220894 205028 194031 203349 210389 222396 232460 226268 223601 237802 246417 242341
31993 242341 230893 223624 226913 222356 229697 227137 223299 216906 229275 236358 231250 228944 233588 230826
31979 230826 222884 222110 214208 207228 203692 202055 205077 201796 193475 204899 213770 226246 229456 233551
31965 233551 232418 232382 235785 236034 233794 231110 226581 225158 221483 222249 217473 215082 211697 216460 218094
31950 218094 224490 228423 222525 222854 226798 223472 211878 220241 227381 224687 226569 231411 229049 224894
31936 224894 222420 216923 220477 228958 243344 231231 221200 216661 229905 237142 231113 232774 231870
31923 231870 227497 222459 218888 216856 226934 235562 236700 229134 223648 221384 222852 220722 225691 229263
31909 229263 228193 215781 214959 221342 228287 223524 223402 226274 229556 234411 234086 225172 224690 223803 221414
31894 221414 220689 219714 223343 233480 231004 220657 220437 216237 218103 220734 216838 220541 225525 234581
31880 234581 231157 231565 231751 219153 215881 203859 203684 220310 223616 223154 221274 219286 226531 227297 230982
31865 230982 241570 243053 239642 237632 240220 239622 235406 231560 237971 235104 232389 213263 211438 228202
31851 228202 238371 234173 230983 222128 224191 233387 239640 231546 223028 208056 210233 212623 221781 221643
31837 221643 218543 231278 230834 229153 231365 229459 229755 223614 223113 222246 220841 226678 236559 226336 215387
31822 215387 220219 234213 241473 235742 228471 222560 225695 220822 219159 222355 226390 223958 219411 230273
$$ [...]
##END NTUPLES=NMR SPECTRUM
##END=
