##TITLE=Analysis number 315961
Compound Code cc 38510
Book Reference 449/44
Project Code qc-cat
Chemist Name davee
##JCAMPDX= 6.0         $$ Bruker NMR JCAMP-DX V2.0
##DATA TYPE= NMR SPECTRUM
##DATA CLASS= NTUPLES
##ORIGIN= Bruker BioSpin GmbH
##OWNER= NMR
$$ XWIN-NMR		Version 3.5
$$ Fri Dec  9 13:12:45 2005 GMT Standard Time (UT+0h)  MAYBRIDGE\NMR@NMR_250MHZ
##.OBSERVE FREQUENCY= 250.131544655141
##.OBSERVE NUCLEUS= ^1H
##.ACQUISITION MODE= SIMULTANEOUS (DQD)
##.ACQUISITION SCHEME= undefined
##.AVERAGES= 16
##.DIGITISER RES= 18
##SPECTROMETER/DATA SYSTEM= dpx250
##.PULSE SEQUENCE= zg30
##.SOLVENT NAME= CDCl3
##.SHIFT REFERENCE= (INTERNAL, CDCl3, 0, 16.3931)
##AUDIT TRAIL= $$ (NUMBER, WHEN, WHO, WHERE, WHAT)
$$ ##TITLE= Audit trail, XWIN-NMR		Version 3.5
$$ ##JCAMPDX= 5.01
$$ ##ORIGIN= Bruker BioSpin GmbH
$$ ##OWNER= NMR
$$ C:\u/data/dgb/nmr/ADRS/13720/pdata/1/auditp.txt
$$ ##AUDIT TRAIL=  $$ (NUMBER, WHEN, WHO, WHERE, WHAT)
(   1,<2005-12-09 13:12:23.17 +000>,<MAYBRIDGE\NMR>,<NMR_250MHZ>,
      <created by zg, POWCHK disabled, PULCHK disabled
       configuration hash MD5:
       62 19 C7 07 E1 42 D1 B7 37 6C 3D D0 77 39 F9 E6
       data hash MD5: 64K
       14 AD 6D 8C 51 AE BD D4 BB 0E 53 BB 7B 8D 27 F8>)
(   2,<2005-12-09 13:12:36.24 +000>,<MAYBRIDGE\NMR>,<NMR_250MHZ>,
      <Start of raw data processing
       ef LB = 0.3 FT_mod = 6 PKNL = 1 SI = 32K 
       data hash MD5: 32K
       25 B2 A0 EF 17 87 BB 24 50 40 CB 6D 06 19 F2 FB>)
(   3,<2005-12-09 13:12:38.06 +000>,<MAYBRIDGE\NMR>,<NMR_250MHZ>,
      <apk 
       data hash MD5: 32K
       D1 91 14 88 9E B8 BB 9A 8C 81 01 49 2B 5C F3 7B>)
(   4,<2005-12-09 13:12:38.81 +000>,<MAYBRIDGE\NMR>,<NMR_250MHZ>,
      <abs ABSG = 5 
       data hash MD5: 32K
       F9 91 E3 A2 A1 69 51 7F 11 55 CA 1C 13 92 1A 6A>)
$$ ##END=
$$ 
$$ hash MD5
$$ C8 8C B8 AE 18 E2 8A D5 CA 09 24 9F 65 83 0F 98
##$RELAX= 
##$RELAX= 
##$RELAX= 
##$RELAX= 
##$RELAX= 
##$RELAX= 
##$RELAX= 
$$ Bruker specific parameters
$$ --------------------------
##$DU= <C:\u>
##$EXPNO= 13720
##$NAME= <ADRS>
##$PROCNO= 1
##$TYPE= <nmr>
##$USER= <dgb>
##$AMP= (0..31)
100 100 100 100 100 100 100 100 100 100 100 100 100 100 100 100 100 100 
100 100 100 100 100 100 100 100 100 100 100 100 100 100 
##$AQSEQ= 0
##$AQ_mod= 3
##$AUNM= <au_zg>
##$AUTOPOS= <21 >
##$BF1= 250.13
##$BF2= 250.13
##$BF3= 250.13
##$BF4= 250.13
##$BF5= 500.13
##$BF6= 500.13
##$BF7= 500.13
##$BF8= 500.13
##$BYTORDA= 1
##$CFDGTYP= 0
##$CFRGTYP= 5
##$CHEMSTR= <none>
##$CNST= (0..31)
1 1 145 1 1 1 1 1 1 1 1 1 1 1 1 1 1 1 1 1 1 1 1 1 1 1 1 1 1 1 1 1 
##$CPDPRG= <>
##$CPDPRG1= <>
##$CPDPRG2= <>
##$CPDPRG3= <>
##$CPDPRG4= <mlev>
##$CPDPRG5= <mlev>
##$CPDPRG6= <mlev>
##$CPDPRG7= <mlev>
##$CPDPRG8= <mlev>
##$CPDPRGB= <>
##$CPDPRGT= <>
##$D= (0..31)
0 1 0 0 0 0 0 0 0 0.06 0 0 0 0 0 0 0.0002 0 0 0 0 0 0 0 0 0 0 0 0 0 0 
0 
##$DATE= 1134133941
##$DBL= (0..7)
120 120 120 120 120 120 120 120 
##$DBP= (0..7)
150 150 150 150 150 150 150 150 
##$DBP07= 0
##$DBPNAM0= <>
##$DBPNAM1= <>
$$ [...]
##$SUBNAM7= <"">
##$SUBNAM8= <"">
##$SUBNAM9= <"">
##$SW= 20.6930455092707
##$SWIBOX= (0..15)
0 0 3 0 0 0 0 0 0 0 0 0 0 0 0 0 
##$SW_h= 5175.983436853
##$TD= 65536
##$TD0= 1
##$TE= 294.16
##$TE2= 300
##$TE3= 300
##$TEG= 300
##$TL= (0..7)
0 120 120 120 120 120 120 120 
##$TP= (0..7)
150 150 150 150 150 150 150 150 
##$TP07= 0
##$TPNAME0= <>
##$TPNAME1= <>
##$TPNAME2= <>
##$TPNAME3= <>
##$TPNAME4= <>
##$TPNAME5= <>
##$TPNAME6= <>
##$TPNAME7= <>
##$TPOAL= (0..7)
0.5 0.5 0.5 0.5 0.5 0.5 0.5 0.5 
##$TPOFFS= (0..7)
0 0 0 0 0 0 0 0 
##$TUNHIN= 0
##$TUNHOUT= 0
##$TUNXOUT= 0
##$USERA1= <user>
##$USERA2= <user>
##$USERA3= <user>
##$USERA4= <user>
##$USERA5= <user>
##$V9= 5
##$VALIST= <valist>
##$VCLIST= <CCCCCCCCCCCCCCC>
##$VD= 0
##$VDLIST= <DDDDDDDDDDDDDDD>
##$VPLIST= <PPPPPPPPPPPPPPP>
##$VTLIST= <TTTTTTTTTTTTTTT>
##$WBST= 1024
##$WBSW= 4
##$XGAIN= (0..3)
0 0 0 0 
##$XL= 0
##$YL= 0
##$YMAX_a= 446745
##$YMIN_a= -551215
##$ZGOPTNS= <>
##$ZL1= 120
##$ZL2= 120
##$ZL3= 120
##$ZL4= 120
##$ABSF1= 16.39306
##$ABSF2= -4.30011
##$ABSG= 5
##$ABSL= 3
##$ALPHA= 0
##$AQORDER= 0
##$ASSFAC= 0
##$ASSFACI= 0
##$ASSFACX= 0
##$ASSWID= 0
##$AUNMP= <proc_1d>
##$AZFE= 0.1
##$AZFW= 0.1
##$BCFW= 0
##$BC_mod= 0
##$BYTORDP= 0
##$COROFFS= 0
##$CY= 12.5
##$DATMOD= 1
##$DC= 0
##$DFILT= <>
##$DTYPP= 0
##$F1P= 14.0000005364418
##$F2P= -0.99999901652339
##$FCOR= 0.5
##$FTSIZE= 32768
##$FT_mod= 6
##$GAMMA= 0
##$GB= 0
##$INTBC= 1
##$INTSCL= 1
##$ISEN= 128
##$LB= 0.3
##$LEV0= 0
##$LPBIN= 0
##$MAXI= 10000
##$MC2= 0
##$MEAN= 0
##$ME_mod= 0
##$MI= 0
##$NCOEF= 0
##$NC_proc= -4
##$NLEV= 6
##$NOISF1= 0
##$NOISF2= 0
##$NSP= 0
##$NTH_PI= 0
##$NZP= 0
##$OFFSET= 16.39306
##$PC= 1
##$PHC0= -70.67786
##$PHC1= 4.364613
##$PH_mod= 1
##$PKNL= yes
##$PPARMOD= 0
##$PSCAL= 4
##$PSIGN= 0
##$REVERSE= no
##$SF= 250.130032249177
##$SI= 32768
##$SIGF1= 0
##$SIGF2= 0
##$SINO= 400
##$SIOLD= 32768
##$SREGLST= <1H.CDCl3>
##$SSB= 0
##$STSI= 32768
##$STSR= 0
##$SW_p= 5175.98343685301
##$SYMM= 0
##$S_DEV= 0
##$TDeff= 65536
##$TDoff= 0
##$TI= <Analysis number 999999
Compound Code 99
Book Reference 9
Project Code 9>
##$TILT= no
##$TM1= 0
##$TM2= 0
##$TOPLEV= 0
##$USERP1= <user>
##$USERP2= <user>
##$USERP3= <user>
##$USERP4= <user>
##$USERP5= <user>
##$WDW= 1
##$XDIM= 32768
##$YMAX_p= 393696863
##$YMIN_p= -49444
$$ End of Bruker specific parameters
$$ ---------------------------------
##NTUPLES= NMR SPECTRUM
##VAR_NAME=  FREQUENCY,     SPECTRUM/REAL,   SPECTRUM/IMAG
##SYMBOL=    X,             R,               I
##VAR_TYPE=  INDEPENDENT,   DEPENDENT,       DEPENDENT
##VAR_FORM=  AFFN,          ASDF,            ASDF
##VAR_DIM=   32768,         32768,           32768
##UNITS=     HZ,            ARBITRARY UNITS, ARBITRARY UNITS
##FACTOR=    0.157963299565203, 1,           1
##FIRST=     4100.39679760269, 0,            0
##LAST=      -1075.58663925032, 0,           0
##MIN=       -1075.58663925032, -49444,      0
##MAX=       4100.39679760269, 393696863,    0
$$ Real data points
##PAGE= N=1
##DATA TABLE= (X++(R..R)), XYDATA
$$ [...]
20135 4841 2512 5533 7742 10305 -866 -4536 5047 12939 6907 -806 -13633 -8778 -7248 -16772
20121 -16772 -21553 -21388 -19850 -16876 -8235 -3003 -10108 -2447 7211 16074 14199 -5232 -22620 -17785
20107 -17785 -8992 -7357 -14685 -12260 -10451 -14916 -15174 -15917 -10750 -10070 -15432 -18568 -16851 -5475 -1910
20092 -1910 -4139 -1975 -2826 -3729 -4999 -2010 5764 12074 7530 476 -3609 6889 10343 -406 -2033
20077 -2033 -3290 -8175 -10262 -6747 -12739 -22632 -25336 -19421 -10990 -6707 -6313 -4987 5173 14935 13321
20062 13321 8883 -1024 -7776 -7149 3387 5328 16709 15332 -3825 -8667 -15150 -19741 -24463 -16936
20048 -16936 -4352 1612 -4929 -4893 -405 -58 454 -1523 1172 6756 3478 3990 4075 -2667 -17158 -23934
20032 -23934 -27298 -19563 -13306 -15667 -17916 -5407 5060 8048 -2557 1816 -1093 -1088 -9043 -19964
20018 -19964 -23063 -19958 -17956 -831 -7964 -13148 -4191 3784 12063 15177 14760 12347 8527 497
20004 497 -12918 -13240 -7217 3591 2021 -8167 -16854 -16642 -14219 -5734 -5320 -3807 108 -9175 -13857
19989 -13857 -15031 -19460 -13232 -15311 -11221 -7220 -7060 -2481 -13424 -15838 -21810 -19775 -9546 -5347
19975 -5347 -14491 -13365 -8219 -254 10172 10990 1801 -7786 -6383 -11031 -316 1669 4467 8186
19961 8186 1686 4327 910 -14303 -10946 -8514 -7081 -9033 -17891 -6114 6685 7609 9230 6803
19947 6803 -4992 -8225 -5318 6784 8693 -3700 -14390 -19988 -10617 -7429 -11113 -14840 -12757 -3439
19933 -3439 1745 -1568 -10404 -12680 -10546 -6473 1768 -5564 -27545 -25622 -14505 -7924 -6246 -4865
19919 -4865 7568 17944 24023 25395 15225 1222 724 647 -8131 -8283 -266 5532 -484 4087 2812
19904 2812 -3882 -4533 4958 3178 -4542 -9878 -13282 -7546 -442 6429 7392 17556 7860 -7409 -19997
19889 -19997 -13362 -7155 -4298 -9003 -5948 2226 6507 -3043 -2139 -8359 -14832 -11339 -7084 1917 2791
19874 2791 -1222 -14578 -21370 -20207 -14301 -9631 3089 16429 18080 15673 19922 17513 8565 2549
19860 2549 -7811 -9364 -8556 -5922 -9874 -15233 -14718 -11956 -8337 -11605 -15382 -9821 -5778 -6274 3152
19845 3152 10623 1598 -851 12126 11051 1253 -9461 -13595 -14387 -6890 -3911 4168 19665 18904
19831 18904 9606 -7690 -22145 -31411 -38743 -29032 -24523 -17688 -700 1492 -7326 -18847 -32166
19818 -32166 -27205 -10770 -3860 970 6392 10861 5222 2509 -9138 -1200 4762 -6042 -17303
19805 -17303 -18964 -16934 -16126 -14688 -25433 -28270 -26933 -27697 -23492 -7294 -2098 -4381 3165 10614
19791 10614 19814 22783 28356 25169 10677 627 -5965 -14530 -17326 -13378 -26133 -18580 -15490 -24171
19777 -24171 -17485 -9283 -7638 -6434 -710 1129 -8627 -8041 188 -2697 -7440 -15137 -9731 -386 3989
19762 3989 6434 -7097 -584 16416 28454 2611 -12450 -17369 -15103 -16663 -4344 8761 12684
19749 12684 723 535 -6278 -8912 -383 5345 16137 11197 9005 13989 17533 14295 18946 12562
19735 12562 3874 -6961 -17463 -26357 -14449 -19823 -29396 -10130 825 -7769 -16892 -14588 -15963
19722 -15963 -19870 -21447 -15817 -17078 -15672 -15163 -7145 -1518 -161 -8436 -14087 -18322 -13090 -5668 -8561
19707 -8561 -10468 -8908 -4788 -5331 -6101 -5579 -7778 -7781 8023 12294 9818 6808 1159 -5574 -9040 -15938
19691 -15938 -11402 -1292 -1451 6396 990 -2207 -12901 -10139 -10089 -1745 10471 14440 10377 -6871
19677 -6871 -17377 -15166 -6986 3312 5428 4322 2076 643 -4166 -3765 3851 5671 10199 6450
19663 6450 -4479 -9633 -267 -1030 -5603 -10481 -11976 -13482 -15032 -16281 -23755 -23723 -24072 -24117 -11970 -15382
19647 -15382 -20578 -14983 -3930 -2497 -9386 -8764 -7800 -4285 1432 4541 7876 10513 4632 -5802
19633 -5802 -11708 -4279 2608 -7301 -13890 -4675 13387 15104 15556 6951 -968 -2533 -1366 -2069 -5918
19618 -5918 -12479 -4680 -9914 -16217 -7907 -4173 -275 -4151 -10778 -14057 -10682 -10783 -8768 -3321 -7952
19603 -7952 -14557 -15461 -14027 -10503 -5076 -5021 267 3266 11034 6031 7359 -1492 -5677 -6788 -4125
19588 -4125 -3780 -8383 3343 12092 16096 8753 163 -7329 -8813 -4324 -6676 -14654 -11798 -9919 -15521
19573 -15521 -12516 -3165 -11330 -16632 -6564 -961 -4046 -566 2392 3656 7381 5619 2722 -7345
19559 -7345 -11418 -8895 -4688 -6660 -2057 -3512 -11360 -15010 -6300 -2509 -2111 468 10695 4569 8369
19544 8369 13250 10359 4925 -795 -2720 -3738 -4510 -5423 -9575 -7633 1353 -5323 -12036 -5431 1057
19529 1057 1622 -10391 -9548 -16487 -16552 -3009 -8292 -12083 -9691 -8763 -10526 -16026 -22505 -18996 -6189
19514 -6189 2109 324 -1747 -6079 -12211 -19328 -13841 -2982 5097 8081 1947 -4185 5889 11026
19500 11026 6807 -4592 -2918 -904 -4279 -9129 -9495 -7714 -8660 -3461 7351 7478 4521 3861 -8605
19485 -8605 -7470 -2392 -4796 -3176 -6093 -11656 -18290 -18954 -14493 -6785 -4110 -4349 -4688 -9200 -9494 -10458
19469 -10458 -13944 -9585 -3915 -5846 -4494 -7359 -13406 -10008 -6800 -5950 2845 595 -5949 -17366
19455 -17366 -19319 -22504 -20035 -17613 -20371 -19517 -14155 -2956 11578 14984 15330 4805 -10367 -7495
19441 -7495 -7529 -2182 -3843 -12309 -16135 -17809 -12843 -11600 -13360 -4218 -912 -5986 -9950 -10122 -16468
19426 -16468 -21411 -15298 -4292 5219 1110 -2789 -7892 -9264 -11576 -6338 -1383 -2584 -4265 -2296
19412 -2296 -5391 -3421 -1168 2425 -6463 -4474 -853 -2146 -7715 -24335 -25686 -16753 -7722 -398
19398 -398 -2258 -1660 2710 -4067 -11435 -19944 -26326 -20765 -17456 -12697 3390 4084 2439 7377 12445
19383 12445 17160 14794 9701 19659 16834 12129 7786 7969 3725 504 -3019 -2404 -12205 -13420 -6014
19368 -6014 -1565 2766 -10563 -16248 -17008 -14810 -14650 -16794 -11440 -9855 -19923 -17678 -15061 -15803 -6524
19353 -6524 4482 7610 5267 1542 8014 4506 -3624 -2738 852 4105 240 2878 6233 8876 12484
19338 12484 6892 7348 10583 3468 -1524 -8773 -10791 -15603 -20931 -15146 -10396 -9927 -10947 -9632 -12126
19323 -12126 -11581 -9717 -13330 -7502 440 2587 -258 5400 -535 -10021 -14280 -11424 -8947 -11009 -9294
19308 -9294 -12432 -746 11020 7891 5311 1167 5177 16943 25594 32626 25695 9251 -2212
19295 -2212 -4738 5823 19789 17813 16330 11430 10298 2587 2273 6617 3557 10990 10506 10118 4580
19280 4580 -3774 -3747 -11691 -12648 -12875 -18027 -25453 -29468 -16756 -15153 -6841 -4151 2290 6068 -2166
19265 -2166 -12501 -11828 -2077 -33 3371 -3713 -14265 -24182 -26018 -26384 -21812 -11042 -3044 3827
19251 3827 -1973 -3731 -1639 -1760 -12002 -24332 -22926 -13267 -14196 -13734 -7594 -12320 -7868 13368 24756
19236 24756 19793 5688 -8992 -15841 -9466 -17417 -12586 -3877 -2344 -2707 -272 -4152 -1871 3822
19222 3822 4105 5582 3700 -2616 -2872 -8728 -4062 -10975 -4132 12668 18852 9054 5668 6753 7167
19207 7167 4216 13624 20033 13099 4923 1415 -4024 -1465 8674 19310 26783 39607 43837 33877
19193 33877 31244 24452 14313 6021 -6359 -22260 -30330 -16775 -10708 421 10186 10579 9193
19180 9193 17463 20329 -3202 -12007 -7322 -15646 -9919 -2288 2555 8866 13095 19642 22132 19959
19166 19959 19141 17137 13978 11233 8331 11493 8363 2318 -8032 -5280 -13110 -12678 -9529 -4493 3216
19151 3216 8830 6077 -1829 -12409 -15703 -19837 -35223 -23849 -6078 1714 -2311 -7748 193 8618
19137 8618 8019 6517 -2982 -15891 -10887 -5586 -1336 -7435 -18887 -12624 -8536 -18394 -5453 1202
19123 1202 -3074 -1726 -9381 -8306 -8760 -219 12724 10823 3888 -2524 -12916 -15172 -5982 -8569
19109 -8569 -18884 -7587 9931 11985 7907 1693 3175 -433 -24 -2617 -6701 -10904 -18748 -7722
19095 -7722 -739 10234 7732 2590 -5708 -6258 830 5924 13807 12030 10296 12812 8596 -2306
19081 -2306 963 7722 6423 -74 -6566 -3409 4867 3579 1818 963 655 11914 7535 6029 13186
19066 13186 11786 6897 -12729 -23656 -21868 -8054 2967 4039 4481 -57 -6688 -13191 -14020 -9346
19052 -9346 -8257 490 9101 5358 -1884 -6406 -6821 -3121 -328 -3109 -8353 -5518 2718 5205 5242
19037 5242 -3289 -3445 -2517 -4807 -3393 -5293 1933 1544 6655 13410 10157 10233 -2894 -1959 -1560 -2521
19021 -2521 -5358 -11248 -9687 -7919 -5450 3188 13222 16300 10531 7006 7972 7900 10563 12407 3495
19006 3495 2841 5373 -2663 -7272 489 4345 -4636 -5027 -8886 -7200 -6853 -4548 7630 9765 15526
18991 15526 19842 9220 9198 16351 14369 13068 12846 -3629 -8268 -8840 -16515 -18920 -4589 8110
18977 8110 12698 10257 9290 13609 13200 16122 14442 12645 2181 475 -3967 272 710 171 3757
18962 3757 1233 3968 9431 4343 -5812 -5639 -7974 -684 4304 6407 12294 17932 10174 15859 16554
18947 16554 6857 -206 -5107 -11828 -5462 652 3983 -628 -3330 -377 -1231 258 6283 11706 11183
18932 11183 7314 -156 -2455 1936 -4670 -2550 1141 3677 6566 4199 9141 12599 16870 14115
18918 14115 3850 -8700 -4766 5699 6042 3240 3380 -133 7275 4178 -9771 -15780 -9081 1623
18904 1623 9571 15564 19352 18646 10502 8358 -531 -2987 1280 3949 4184 6841 5566 9659 10140
18889 10140 3871 4143 8859 11359 11176 20449 12197 6380 2027 12606 13712 23216 29102 14937
18875 14937 9471 10825 4236 3893 4890 11995 21148 17989 8794 11627 20653 29221 31796 32179 31189
18860 31189 23139 20835 16670 14544 13347 7732 3283 2193 9429 19514 21394 15353 9255 8669
18846 8669 12054 12035 2760 -5646 -7034 -11509 -11316 -7310 -4969 6265 13293 18102 11179 12685 9695
18831 9695 6554 5860 -1157 -4889 -3589 -1305 -758 3823 7979 2854 -3164 -2264 -2721 5462 11412 7885
18815 7885 7967 7602 14345 10815 4158 8115 9371 7565 10211 10338 9009 6959 11234 5381 240 7124
18799 7124 5594 1090 -6989 -13669 -12899 -9322 -7373 -12054 -7043 -5138 4909 10184 15599 13943 8088
18784 8088 13908 14450 13784 17761 10636 -4447 -13266 -2948 2679 8906 6105 10991 6851 -4750
18770 -4750 -12640 -8577 76 9362 21422 49010 87045 98590 82508 66516 57454 33099 6455
18757 6455 -10231 -10603 -10087 -13200 157 5460 15202 25376 15777 2799 -9873 -11509 1515 5265
18743 5265 2312 -2935 -2960 -5886 -3974 -7011 -7703 -2728 6355 8454 15586 13646 10099 7028 13515
18728 13515 15086 1299 -6699 1111 -1326 -12635 -8079 -11710 -10788 -1031 6832 11010 8721 2436
18714 2436 -2857 -5982 -6246 5657 5697 -5391 -7494 -8892 -8083 -11277 -12564 -15780 -4857 -151 -1265
18699 -1265 -14118 -21866 -19099 -16196 -17210 -19735 -17853 -12652 -9381 -1105 4425 7808 4173 -946
18685 -946 -5383 -12499 -18621 -1860 6810 8136 4307 -7466 778 12485 15814 8830 6282 2264
18671 2264 2232 -874 -3935 -9555 -10058 -6477 -10752 -9124 -2789 -8582 -2581 -4444 -691 7083 3631
18656 3631 -3100 -3423 -3386 -2170 8847 12499 8629 -3992 -5686 -4890 1146 1616 9371 14561 14100 14924
18640 14924 17283 21767 17237 15570 7283 6131 2612 5749 4995 -8267 -8632 -5048 7575 17338
18626 17338 19573 10233 7706 9170 9664 11169 9855 19615 18524 10730 9654 3968 2291 4544 10766
18611 10766 8977 11591 8847 947 4246 7785 14242 17886 11864 -23 -1886 11351 21878 22381
18597 22381 9494 5531 16504 21160 17692 15899 19598 13644 -1301 1866 -794 -5404 -7930 -9998
18583 -9998 -11989 -11968 -11217 -6265 -5108 5914 5718 3606 8251 17774 11729 5818 7052 11428 9863
18568 9863 6225 6047 5928 -4254 -5401 -65 3602 5106 268 962 1577 513 1771 -7397 -12095
18553 -12095 -2722 5065 7520 8013 18504 15730 20431 20471 19453 20757 27831 29867 26073 14274 13642
18538 13642 2591 -2273 5141 3621 -3880 -8226 -12694 -12002 2989 15700 19833 21265 17993 21976
18524 21976 23747 22204 10853 2497 -4328 3400 -2064 -5570 960 -47 -314 3386 11594 13775
18510 13775 9361 2550 4554 3233 5870 12813 9180 8291 1934 -1627 11423 27582 33854 29379
18496 29379 20455 13723 12413 9199 2719 6614 11010 17144 18500 17919 12949 13239 20603 14315 11041
18481 11041 6056 10721 13174 16145 17838 24653 27222 29640 30536 35284 23121 12896 5190 6323
18467 6323 5967 10361 8562 6399 5443 4343 9925 7757 3285 15798 24825 20249 15353 12432 9166
18452 9166 4023 -2327 -655 7469 12764 11942 10251 14862 19301 24841 18202 10565 6679 12520 22255
18437 22255 23899 16308 12757 11867 10655 11869 13214 15784 23994 21488 21559 24862 26052 18759 20280
18422 20280 24763 28564 26373 17765 11432 3493 11977 14278 17373 22053 21969 23386 24702 29274 34370
18407 34370 26639 29302 23448 12716 4790 9647 16888 18213 25896 30871 36934 39072 39537 30400
18393 30400 18745 11008 6025 7566 6363 5720 20452 17963 5335 11259 12824 12021 19157 37068
18379 37068 42831 35842 36852 36546 48087 60172 60873 68018 82016 91281 131123 202214 298438
18366 298438 388205 438951 451594 414719 347049 275214 199461 146081 116209 90751 80311
18355 80311 67177 51962 45538 37437 47656 50925 51820 49176 44856 45317 47266 51596 43429 34963
18341 34963 23913 32602 36677 42064 42740 45751 48666 43758 39199 30392 22271 26500 46109 59741
18327 59741 67763 76363 81581 85466 90069 96811 115358 167874 250888 356363 501045 625300
18315 625300 728570 802703 814222 773020 685572 563883 443945 332489 240455 192447 176061
18304 176061 165286 176889 198620 186142 159625 146990 130168 109997 88020 93827 88078 81532
18292 81532 83798 82681 81330 75550 71781 65587 57744 61766 57383 51201 52524 57784 62258 65955
18278 65955 75443 79036 70198 58059 58664 66571 75842 84322 92449 107684 136638 181891 257815
18265 257815 351884 452437 529560 546973 501125 421153 339404 249629 175845 134116 113411
18254 113411 104932 94937 93361 91957 98472 106950 125561 147214 150739 135017 121528 108546 87652
18241 87652 67910 50385 42883 36990 34233 30216 31980 22763 18139 21809 28013 43845 56806
18228 56806 61185 58772 55150 52686 54207 49293 51937 55683 52116 52095 59017 54673 54182 65203 64246
18213 64246 54559 41450 30543 20167 27152 40123 53145 46170 36122 24606 28373 39018
18201 39018 50075 54370 57933 56073 55674 52036 53435 53981 43952 45305 40053 39762 39715 41021 46718
18186 46718 53987 55654 54603 58551 60399 53915 45834 35883 24770 12466 12128 18354 23121 21157
18172 21157 21388 20871 21281 20474 27805 39120 44613 49762 43862 45444 49212 50199 46562 51213 55099
18157 55099 54134 45558 40982 43083 53052 62971 71396 81505 78792 83201 81322 80177 86939 93392
18143 93392 93301 92683 87039 84834 77619 86271 104541 118193 121342 120683 112870 110496 117522 119504 131134
18128 131134 140482 156326 174933 179228 185262 199195 218372 251799 295505 340768 377280 428137
18116 428137 495886 587686 697310 832415 1003338 1262567 1679633 2386491 3715721 6416049
18106 6416049 11252693 14853544 14382281 12709561 10673648 7805040 4997043 3216738
18098 3216738 2242387 1675136 1327840 1094572 921376 796991 704846 635927 579976 530005
18088 530005 483776 440553 398584 362946 342638 312929 279179 251432 238030 232934 224382 214052
18076 214052 202647 204989 197911 197225 194511 197366 200498 207096 222044 237649 237139 223499 204706
18063 204706 186317 172460 160866 139516 128019 127769 131727 142459 157911 159220 150490 135187
18051 135187 115405 109289 109979 111224 111774 109565 110335 107663 105607 98646 92516 80366 75332 82716
18037 82716 76584 77355 79633 80855 76715 80494 82807 80048 75460 69505 61990 52741 54168 65398
18023 65398 63403 61940 63880 82061 93972 94413 87470 74360 75960 80097 73485 61063 52760 58474
18009 58474 63492 75795 100123 125525 143375 152557 139601 126969 121844 110682 88238 69486
17997 69486 71525 65226 62714 72742 83442 82341 105788 145639 167748 162323 149932 152778 157605
17984 157605 156502 154870 153000 144966 137195 136654 145879 157256 149056 139604 142361 134367 134344 135198 135183
17969 135183 140029 149117 142078 125450 120872 143334 166048 166633 179598 187873 167679 145899 132838
17956 132838 125122 135789 158974 167035 167146 169370 150063 121624 100893 88722 75693 71125 74009
17943 74009 85090 126480 189559 243361 281154 311292 332814 326654 323659 320852 322493 320839 323352
17930 323352 318460 328250 333617 330852 344154 369771 396404 415268 430484 436377 447457 461393
17918 461393 464386 468377 474420 493832 551008 621645 674477 718540 757686 792022 846307 913012
17906 913012 969492 991883 976703 953591 910452 858348 822630 838009 912121 1014592 1074364
17895 1074364 1075794 1059089 1036657 1002580 985545 998011 1066789 1170809 1248328 1302977 1365350
17884 1365350 1436400 1530535 1679505 1862577 2092664 2393514 2754079 3222270 3837345 4642465
17874 4642465 5686245 7088431 9056634 12007057 16802394 25192937 39378217 57082610
17866 57082610 70780492 75837438 71223845 61137062 48737256 36151768 25753075
17859 25753075 18747011 14470251 11812616 10050413 8833640 7968776 7293535 6676276
17851 6676276 6105071 5597592 5171934 4848218 4602673 4409413 4244593 4106746 3952044
17842 3952044 3784115 3637582 3560412 3568143 3627047 3709729 3786977 3853017 3923559 4022798 4180060
17831 4180060 4434669 4838950 5407298 6179461 7168253 8359456 9826206 11755242 14441500
17822 14441500 18356847 24414537 34509216 51678146 76545206 102108502 123772271
17815 123772271 139381541 146799061 143692747 128709763 106674140 84229338 63839690
17808 63839690 46745857 34248473 26087537 20784898 17148645 14509060 12492796 10918968
17800 10918968 9677653 8675479 7867261 7220882 6718726 6329153 5971737 5613030 5253173
17791 5253173 4925570 4684538 4536168 4472494 4454374 4460976 4453686 4400723 4301455 4184165 4112517
17780 4112517 4151935 4335681 4642999 5034591 5524165 6143564 6900042 7832505 9049695
17771 9049695 10767031 13362735 17410887 24100132 35853961 55508326 79359252 97269091
17763 97269091 102980835 95759267 81504884 64282517 46991640 32848923 23312222
17756 23312222 17332230 13477303 10859003 8992039 7629083 6622514 5882498 5321548
17748 5321548 4883279 4524068 4206179 3900140 3589653 3284590 3003306 2756140 2560324
17739 2560324 2432727 2385986 2429319 2535720 2642569 2692978 2666230 2557466 2403168 2223646
17729 2223646 2056534 1931113 1858221 1850436 1862591 1837621 1758382 1658828 1571934 1495449 1406365
17718 1406365 1308997 1202085 1083306 959995 833081 722091 627873 560218 512426 466674
17708 466674 435517 397333 362031 339703 320295 297962 291593 287555 275387 255581 245013 237392
17696 237392 228006 213671 194888 191237 196597 211491 228791 255438 291576 328693 335900 334841
17684 334841 339817 330631 318765 312128 292580 278628 273387 265956 268047 265483 259137 251157 251529 251006
17670 251006 236145 219784 200132 179084 166060 155135 154357 158494 155778 147323 143469 139229 141372
17657 141372 142235 138360 147789 145716 135637 124255 116286 102341 93594 87879 83469 75979 79851 79635
17643 79635 72420 79057 87618 100075 110488 120329 134766 151957 170956 181163 178745 190879 183388
17630 183388 162049 160033 149457 139496 122504 110269 102249 106754 120022 132406 142197 170578
17618 170578 191663 202714 204247 213624 221596 224525 211321 195419 185446 167480 162651 161169 163065
17605 163065 162243 164271 172496 169040 164396 155961 140805 132679 126072 112312 113859 117361 115118 119826
17591 119826 122271 118224 117064 100086 97677 93012 98134 94125 88941 81112 78406 73988 82646 89802
17577 89802 82031 75192 61760 57568 63574 73911 92984 124603 143895 160158 184209 197362
17565 197362 211065 229619 237876 234367 228378 228031 230369 237727 243769 235367 223042 218156 206742
17552 206742 205111 196947 179694 165187 152799 140458 139766 141382 156187 158381 153311 152071 156719
17539 156719 154453 138774 123568 120743 122512 131550 146471 143958 135152 127951 124372 118146 116158
17526 116158 103597 93658 87253 82350 79919 89970 97493 105909 110030 118184 118296 119590 119089 125923
17512 125923 135308 148429 161753 169778 174066 173710 165545 146515 147834 162396 179907 193043 195443
17499 195443 197740 215682 240225 259981 260053 258005 256353 261670 266594 278748 291593 314505 335185
17486 335185 355158 368405 374291 370371 361875 360722 357190 363761 367785 367390 366764 379611 386717 380964
17472 380964 365648 352274 355883 346463 336460 331811 324754 310306 293650 289955 294237 302345 308192
17459 308192 311918 315630 311582 322948 335049 326161 318637 318710 321740 327583 335070 340235 347280 346988
17445 346988 347126 351389 365480 386063 398629 434452 478517 518508 539255 543529 533115 511064
17433 511064 500082 490474 490049 481755 490095 508993 541417 572489 595725 614673 639613 675035
17421 675035 714344 738989 748835 760349 783497 814782 859188 898012 938010 990805 1054458 1107175
17409 1107175 1156951 1227216 1312818 1416246 1539255 1690326 1878070 2106811 2351190 2560202
17399 2560202 2713666 2831947 2925461 3009218 3120726 3287103 3529697 3882073 4378176 5018122
17389 5018122 5810686 6767444 7975203 9630488 12090136 15930577 21874962 30128358
17381 30128358 39485323 47575040 52799272 55678740 57909809 60725961 63853594 65826348
17373 65826348 65820231 64808411 64580444 66170942 68997797 71148695 71439091 70604892 70158274
17364 70158274 70748421 71293057 69589214 64431759 56453991 46990150 37336782 28752257
17356 28752257 22089743 17446535 14379343 12353915 10975620 10008233 9270632 8709523
17348 8709523 8296961 8026144 7871791 7799995 7781263 7809901 7871796 7989584 8225930 8678038
17338 8678038 9428399 10509729 12001530 14308027 18064864 23702644 30805413 37694245
17330 37694245 42553242 45092744 46424192 47852903 49777705 51503157 52118401 51862274
17322 51862274 52049516 53831341 57091114 60204614 61446153 60836259 59732315 59282636
17314 59282636 59351854 58457515 55090271 49163833 41617671 33541600 25965056 19730946
17306 19730946 15195277 12124936 10082390 8708769 7737885 7008090 6459507 6051595 5717610
17297 5717610 5425980 5162941 4873628 4505480 4115260 3756212 3417113 3136088 2907856
17288 2907856 2712129 2540929 2378364 2223009 2085929 1968750 1863823 1772417 1699267 1647475
17278 1647475 1610232 1580251 1570548 1582761 1582734 1562050 1542874 1521793 1493237 1475512 1463348 1452259
17266 1452259 1458154 1486022 1520837 1562710 1613827 1676150 1744478 1810686 1881810 1966618 2084591
17255 2084591 2232877 2416596 2650862 2941656 3291565 3704606 4149334 4595163 5047544
17246 5047544 5508217 5981806 6541734 7261623 8263563 9674720 11744026 14851917 19628725
17237 19628725 26885656 37279896 50523096 64911137 77431000 85193134 86585429
17230 86585429 82137001 73884000 64528349 56652415 52401608 53243178 59795099 71658987
17222 71658987 87366505 104569749 120768254 133381324 140107816 139454145 131313300 117351308
17214 117351308 100398336 83522324 69302835 59616426 55559043 57284535 63708135
17207 63708135 72442191 80084468 83678381 81704751 74583812 64026042 52226557 41040245
17199 41040245 31643156 24441657 19245237 15616079 13087494 11306598 10040745 9122319
17191 9122319 8444991 7911081 7404899 6892212 6348579 5774465 5205124 4681743 4231314
17182 4231314 3843455 3530764 3271782 3053421 2864227 2676907 2504532 2352128 2205857
17173 2205857 2062765 1941523 1826878 1727047 1638947 1564989 1497103 1428656 1350635 1284954 1232819
17162 1232819 1180713 1139501 1087749 1033520 990084 955803 922887 898244 880413 860391 824102
17151 824102 775918 735542 697389 656393 627470 595319 571082 542543 522159 515740 507389 487437
17139 487437 463588 440308 419511 405830 392067 379729 357837 338483 320930 304947 287047
17128 287047 276411 261285 242856 229283 221576 217586 220413 217033 210728 194814 189460 184120 180148
17115 180148 182895 177422 164728 157279 150173 146358 145468 155584 172916 193634 198680 217918 230754
17102 230754 227270 223332 228970 234033 226732 219656 223495 241850 255275 287429 325802 347747 364502
17089 364502 387872 403169 403401 384917 382747 377284 353345 337777 328432 317439 323125 335418 347903
17076 347903 355232 357332 360266 362626 361329 362881 352784 329547 307092 288301 270752 255229 238033
17063 238033 229842 220748 213932 214441 217472 218850 214307 201594 192021 168649 147453 135766 121450
17050 121450 100552 87516 90526 83786 80739 80808 84723 86073 83445 85508 81751 90132 85106 91724
17036 91724 101167 94263 89369 82657 74510 63980 60589 56103 67370 100269 132068 158711 184127
17023 184127 215888 241419 261292 267417 264733 262473 263192 252724 245672 244190 245113 262624 288995
17010 288995 306132 321591 344414 360301 374081 373834 365437 359113 342657 332311 326819 326788 322768
16997 322768 324403 333689 327796 323238 316397 306524 301707 298669 290790 288434 299848 306893 316002 331844
16983 331844 333492 331386 322037 316229 308791 304144 287042 279728 292093 311415 335300 362299 381673
16970 381673 412790 438443 456404 464036 451289 430228 421070 424079 428332 426156 436651 464312
16958 464312 492496 517969 540915 566725 593173 614616 624218 626344 633365 643876 651811 650737
16946 650737 668904 681147 691486 707149 728536 760649 794354 818728 844544 868288 896914
16935 896914 937239 991141 1038227 1087428 1145247 1234857 1346328 1439360 1526749 1618425 1702596
16924 1702596 1795525 1904033 2039790 2200153 2391195 2616713 2867745 3137838 3445966 3809810
16914 3809810 4252291 4805118 5508312 6443234 7754961 9706857 12700617 17322604 24108380
16905 24108380 32917794 42376814 50458879 55820915 58793437 60655555 62355890 63649379
16897 63649379 63376584 60732613 55922536 49957068 44291302 40504846 39885496 42718404
16889 42718404 47859794 53191913 56833906 58483667 59059724 59479405 59691439 58743726 55606241
16880 55606241 50171319 43111091 35410752 28069350 21876540 17182689 13892316 11692091
16872 11692091 10237655 9239048 8544584 8036468 7629748 7323029 7090068 6910460 6786430
16863 6786430 6715986 6738587 6865835 7169230 7706788 8534780 9800918 11750630 14792484
16854 14792484 19462456 26087359 34185830 42262159 48484826 52156365 53990966 55261644
16846 55261644 56551549 57349951 56527848 53568211 48908569 43623252 39075531 36636843
16838 36636843 37238677 40716603 45633168 49932491 52351845 53096850 53196941 53304034 53107838
16829 53107838 51568004 47987135 42489426 35798274 28843736 22488224 17306073 13479736
16821 13479736 10814915 8983898 7710572 6774140 6028197 5416226 4911335 4486308 4134836
16812 4134836 3833882 3559111 3299564 3069492 2854311 2659866 2484911 2325822 2177896
16803 2177896 2025810 1874776 1745179 1624115 1524367 1448374 1396958 1359656 1332086 1284648
16793 1284648 1244941 1213433 1172906 1125017 1084969 1058067 1032527 989211 966675 956174 942850
16782 942850 908421 864465 832786 792741 751445 708996 660676 611146 565015 525819 486822
16771 486822 451732 437974 429759 413450 395696 386749 366613 347773 324493 298740 290380 287536
16759 287536 280107 272740 269722 263327 267653 261236 256101 244843 228530 210214 205118 192170 178673
16746 178673 169376 161984 162688 165237 154394 143100 137592 136868 119817 112538 125153 130158 122558 122561
16732 122561 106902 94294 81197 79446 91668 109091 127209 133166 130576 132498 144285 168528
16720 168528 201183 242353 293100 364629 438993 513503 561692 574221 570181 537278 493916 458144
16708 458144 444722 469075 527604 602577 686458 776372 852390 900521 919970 899920 846313
16697 846313 755431 668177 577256 501106 453317 429599 437754 462631 520832 575650 610569 603399
16685 603399 566066 501276 425470 358486 304571 268212 246839 225162 199341 176885 168477 167242
16673 167242 162273 155677 151129 140651 130474 126922 114805 98672 97596 92453 76180 64871 60099
16660 60099 52980 56705 56632 61455 62828 59393 63131 72141 76990 88373 102488 116951 124149 115877
16646 115877 100972 92186 94190 93534 84473 82678 83876 77792 83954 91474 104108 106952 118933 131246
16632 131246 134443 133755 132477 118545 99746 98201 107949 111987 98531 101706 98769 85477 76304
16619 76304 70828 74383 61277 64311 65317 68264 62911 59597 49588 37064 37693 57082 60296 50394
16605 50394 53186 52386 58496 65826 69826 73088 67067 49897 48522 57923 61335 54115 44137 50716
16591 50716 63386 64219 49528 52050 57782 49016 40264 38707 46316 46566 45829 44595 41275 39861 35828
16576 35828 38131 31766 25368 30670 34553 34171 46303 41496 39998 44838 45381 50084 43619 42891 40449
16561 40449 38873 42800 43284 44830 38432 39950 48619 45782 36820 36711 39199 32260 34786 38096 50064
16546 50064 56177 54946 41570 38564 32490 28122 37662 48777 53877 55251 47877 38405 27481 19678
16532 19678 17254 13186 17062 29170 29267 25620 27307 30345 31433 30946 25222 20530 17965 19950 30000
16517 30000 34199 31774 30283 25563 19367 15934 15383 19789 32937 33011 37904 36677 19577 12371 15726
16502 15726 12542 11013 21527 24851 36055 32725 23772 16775 15364 14474 9016 -1522 3254 20953
16488 20953 27341 23030 17650 11836 17831 16316 18223 28885 30965 27019 18878 21446 19675 15318
16474 15318 23183 27708 33541 33586 32439 23914 9016 14458 18179 20160 26917 25683 19228 13661 13883
16459 13883 19379 22337 20555 26737 22262 18629 22061 29829 28389 22897 20525 16269 12528 12104 19541
16444 19541 21280 22072 26032 25790 20379 18502 11867 8473 6569 -1986 -6183 -2616 -4370 -1002 -1430
16429 -1430 -3856 -7569 -15549 -6248 4925 -2434 3285 7631 6931 11435 19720 19540 19170 21501 30870
16414 30870 30518 29648 29408 28126 32244 44426 53970 59747 63652 60987 60171 76247 98804 136653
16400 136653 162066 194712 230674 264090 287322 312293 325230 325134 328727 320372 307554 279038
16388 279038 253686 233474 229072 234660 256622 281581 293651 301269 304927 317955 329942 317724
16376 317724 304771 280321 238924 195966 149260 118087 101576 81717 72130 56687 53041 44873
16364 44873 48465 51905 47191 44585 41188 39832 43419 41881 39359 43544 55428 56674 54801 70175
16350 70175 86757 104317 134384 182996 227334 257110 275569 287035 301748 314618 327208 318933
16338 318933 301571 279199 261498 239737 207252 202472 210243 236739 263989 278386 289950 295435
16326 295435 295178 282109 265462 260881 241314 219896 185900 144053 111562 84664 58346 46824
16314 46824 41142 43820 40164 37154 37986 35722 33928 28449 23602 20594 24847 33635 31214 31173 28148
16299 28148 22261 20063 19880 17586 9946 9608 -312 -3685 776 9122 11720 19434 15990 13699 12845
16284 12845 6426 -6591 -3570 -4785 -13399 -12287 -13008 -9678 -3199 -645 -9665 -10553 -3170 -4407 -5495
16269 -5495 -3865 -6486 -7281 -6313 -12103 -19039 -25088 -22368 -18397 -17705 -6433 -2129 -5357 -2877 4512
16254 4512 -5660 -8333 3011 6824 13617 16364 6247 2010 -1958 -625 -4175 -10013 -4766 4311
16240 4311 1495 3486 -3169 -473 -4014 918 1881 9418 7664 3431 1539 1981 6307 13644 12783
16225 12783 3666 5235 11141 10560 2480 -2323 1173 3054 18436 25489 27083 19412 534 -9460
16211 -9460 -17847 -11691 -3863 6799 14816 20547 12627 2425 -376 -1576 4026 3290 5279 11311
16197 11311 13348 5733 1637 411 4769 12557 10594 14236 8131 -14448 -25398 -11399 -4755 -3833
16183 -3833 -8465 -14031 -6422 -3788 -4874 -9113 992 13710 3929 -15058 -12017 3520 24352
16170 24352 30020 28310 21074 7924 8016 10708 7683 4873 4590 7039 6929 7886 -6380 -8789 7437
16155 7437 10240 2667 -883 -2348 591 -8604 -15853 -15823 -13756 -16204 -19477 -12699 -4938 261 6126
16140 6126 9797 12645 9213 6796 15866 14976 13250 15403 8359 5718 2103 -3208 -1213 2356 8990
16125 8990 15226 14801 8764 -1817 1972 -103 -7694 -6726 -6222 -6379 2733 7786 6723 5901 35 -7114
16109 -7114 -9269 -7177 -3523 639 2915 -2366 -3723 -4932 2179 -5310 -6327 -2499 -16668 -17629 -7792
16094 -7792 -10342 -6318 4763 5941 4351 -1123 2322 6421 8549 -1006 -4812 -2898 -7118 -8169
16080 -8169 -12175 -9273 -9179 -21327 -15527 -11350 -2226 -2005 -6536 -6379 -13778 -19139 -14466 -5780 9718
16065 9718 23501 23194 12712 7028 4506 11712 14013 15668 12142 5116 4091 10669 -1720 -6152
16051 -6152 -1480 -6537 -1257 7224 9866 4450 12442 13665 -2752 -13943 -16095 -18310 -15562 -8142
16037 -8142 -8876 -4113 -3901 -15583 -18423 1923 -1171 -1011 -3097 -8485 -14747 -5158 -450 328 -6126
16022 -6126 -9147 1934 3089 -1626 -13696 -15904 -2900 1581 3334 -6254 -5868 -2252 -4466 -2002
16008 -2002 -3529 -7862 -6558 -9797 -16926 -15216 -13801 -2889 8005 19935 9795 -7208 -2561
15995 -2561 611 -853 -3456 -9718 -7886 36 -3121 -6829 -886 -1568 -10806 -17457 -17208 -22861 -23040
15980 -23040 -14006 -17007 -25302 -15954 -3916 -4487 -13151 -13142 -7013 -2766 -1323 -1953 1385 8484 4040
15965 4040 5085 -7048 -9245 -17337 -15835 -14237 -8249 -3469 5432 12770 6249 -699 -2950 5064
15951 5064 1046 -461 -8717 -18163 -21017 -19669 -15596 -19292 -29918 -21519 -16872 -11921 -2437 -11351
15937 -11351 -16993 -7380 6733 12203 23116 18765 8577 9410 6159 2452 -40 -17201 -25108 -16652
15923 -16652 -2529 8175 11197 3943 1440 3093 7796 7392 1924 -4474 -11899 -15055 -17581 -4593
15909 -4593 -6989 -19505 -21746 -17567 -14204 -9050 -3521 -9980 -20998 -22133 -26295 -27924 -28426 -31323
15895 -31323 -35722 -25964 -9419 2218 3677 9283 19096 2671 226 -937 -2433 -13386 -21253
15882 -21253 -20209 -14236 -5949 12829 21415 14588 7312 -3901 -5830 4320 -2312 -8726 -8535 5573
15868 5573 7387 11779 15650 16231 8793 1686 3440 2944 -8876 -6263 -213 -4720 -1662 -4802 -7443
15853 -7443 -6188 -14334 -12814 -7460 -16606 -8969 -1048 -8452 9264 17075 6243 4348 14629 21206
15839 21206 24751 9652 2751 6113 489 -7693 -9807 -8028 -10151 -23638 -22919 -17517 -19941 -23255
15825 -23255 -15285 -23105 -26419 -12718 -13111 -14990 -5406 -5483 87 5495 5086 4523 2468 8353 12183
15810 12183 -951 -7277 -8542 -3654 -3914 -3080 -12913 -12551 -4652 -9427 -11571 -6852 -8385 1372 3592
15795 3592 -1266 -6106 -2305 8224 8203 6803 7173 5795 9587 11926 13005 16769 15084 2762 -6235
15780 -6235 -22320 -30684 -26180 -19602 -4633 1562 -17923 -37029 -32218 -20240 -18737 -18651 -14457 -14264
15766 -14264 -9782 -4885 -1112 3229 -2671 -2114 -4045 -7541 -7041 -7651 -1545 -8965 -7762 -10153 -13096
15751 -13096 -15757 -23817 -23588 -18576 -19917 -6860 -3431 -7678 -9759 -15239 -18543 -14998 -19478 -18227
15737 -18227 -16039 -20286 -19780 -19903 -29028 -41974 -46143 -36407 -26669 -24516 -20055 -9391 -8477 -11670 -18954
15722 -18954 -24042 -14941 -9934 -12295 -17465 -21970 -17576 -11540 -9945 -1445 4041 12318 5411 -2205
15708 -2205 -19968 -19658 -13282 -19466 -18656 -13044 -18055 -20151 -16951 -17389 -16773 -8284 -17449 -29205 -26956
15693 -26956 -24414 -18569 -26163 -33485 -22711 -16369 -16883 -8469 -10965 -10018 -6202 -12644 -23741 -15144
15679 -15144 -12043 -7030 -1725 1998 391 2345 2349 -7605 -7022 -4557 -8840 -10176 -1323 -437 5358 5902
15663 5902 1342 -4079 -181 -7903 -10517 -11221 -16440 -13892 -7373 -3295 -6227 -16092 -18563 -18011 -12750
15648 -12750 -10142 -8537 -8952 -1790 4712 1444 447 -5583 1671 5869 9448 9572 12039 6102 962
15633 962 -3788 -12908 -16430 -17094 -6860 -2360 -1169 5825 6399 5454 -1519 -4375 -9314 -9065 -6992 -4130
15617 -4130 -9311 -13746 -5692 1929 -6621 -6015 -5065 -2513 1153 2227 8474 4396 3450 -8665 -12685
15602 -12685 2968 -1063 -8794 -4810 90 -9244 -18920 -17352 -10863 -3480 -5246 -6795 1159 -8924
15588 -8924 -13098 -2660 -1722 -8635 -10615 -7407 -10937 -6824 3416 5395 3444 2922 -2502 -11848 -10933
15573 -10933 -5961 2121 -1460 -11445 -14227 -14542 -30995 -33936 -18863 -9304 -3568 1496 9037 7752
15559 7752 6785 7481 3536 -2068 -8744 -7244 853 -269 8632 11135 5859 -8045 -7482 -843 2300
15544 2300 -3463 -3260 4977 -1898 -4616 -7695 -9063 -13852 -8643 -2692 3630 7512 3744 116 9241
15529 9241 8763 4507 -12582 -5611 -865 -204 -61 -4864 -6957 -4888 3011 -1401 -7921 -11351 -9581
15514 -9581 -11327 -12915 -12584 -6904 7670 7933 -411 -546 6422 2299 -8668 -15499 -15888 -8755 -7198
15499 -7198 -9168 -11296 -4059 2654 1291 11891 13612 9849 320 433 -9835 -7556 1953 -4871
15485 -4871 -15334 -21379 -24670 -13277 -11477 -6530 -1940 -9942 -12254 -8465 -10972 -6524 -7895 -3545
15471 -3545 -329 -5788 -10941 -10944 -16741 -12553 -20972 -22193 -27715 -15395 -10569 -12186 -18033 -17858 -17355 -19362
15455 -19362 -15890 -20442 -26093 -17600 -7993 -218 -4787 -6700 -9559 -826 11357 11326 10757 7704 268
15440 268 -6337 -1789 5176 3327 -3413 -3832 1274 780 -137 -7051 6242 21984 19381 12156 8291
15425 8291 1546 -8453 -6352 -7061 -14853 -18657 -13615 -10469 -8614 -8904 -16835 -19095 -18723 -16052 -11778
15410 -11778 -8228 -16382 -18661 -15564 -2393 11068 5330 4517 -375 -391 489 82 -3068 2945 5200
15395 5200 6310 1171 12916 16519 6937 12113 10522 5020 5671 15609 26620 11350 -1622 -10789
15381 -10789 -22143 -21834 -20689 -10731 -6679 -1284 2289 -3749 -4010 888 -1583 12660 14687 2495
15367 2495 2069 1602 -4067 -7894 -12013 -6230 4435 10876 4053 825 -8363 -10513 1093 12047
15353 12047 14329 9706 6737 -2323 5441 14380 17638 6518 -1862 -9164 -18790 -16743 -13523 -6197
15339 -6197 -7889 -9088 -7337 -4051 1832 11159 1648 -100 -8843 -6567 -5831 -4210 3764 9965 7518
15324 7518 1597 -11663 -19377 -22877 -24781 -16727 -12838 -21075 -17349 -17578 -28485 -30655 -30501 -17448
15310 -17448 -11741 -20471 -28218 -33770 -37714 -36344 -29184 -18832 -9207 -8551 -7764 641 6281 7375 -653
15295 -653 -15413 -17374 -16132 -15868 -17447 -16208 -13407 -8688 -2664 13670 23437 15902 5642 -7005
15281 -7005 -6956 -4517 -7029 -13408 -13548 -12654 -6532 -6982 -5315 -5893 -584 1923 3703 9333 14040 7650
15265 7650 2509 -4303 -8348 -1915 -2778 -3490 -5597 -2039 -695 -2279 5400 11940 11508 7994 2871
15250 2871 -13352 -18901 -21156 -7226 9374 17229 16211 18246 22618 27715 21200 8463 224 7080
15236 7080 4282 742 -2723 11138 10574 16103 20446 21700 18277 12499 13135 8694 261 -2867 -10563
15221 -10563 -13592 -7311 -10257 -8806 -6778 -1227 -4542 -10708 -10847 -7643 -6881 -16200 -14758 -12780 -10017
15206 -10017 -11504 -18845 -22147 -23671 -16696 -4992 -436 -4331 -11947 -9519 -11716 -16759 -17307 -12420
15192 -12420 -18115 -21030 -22664 -21628 -22100 -12090 -4462 -709 -6711 -12986 -13708 -12166 -12913 -11772 -2844
15177 -2844 1814 3502 -5508 -2794 -1189 -5259 -11824 -14316 -13265 -6594 826 -3950 2853 1693 -701
15162 -701 -1945 -1268 -1499 -5637 -19724 -22410 -19422 -9631 -1949 4555 9401 6787 5607 174 5310
15147 5310 8537 5157 4267 5969 -2632 -17745 -13348 -9493 -10149 -10038 -6626 -8332 -3246 5876 6995
15132 6995 -916 936 -1338 -5189 -8258 589 -5537 -5030 -4876 -10733 -10280 -4873 -5134 -728 -2256 -11047
15116 -11047 -14171 -16918 -11685 -3375 1393 5465 2813 -15519 -7085 -9583 -18047 -26334 -28304 -33241
15102 -33241 -39094 -42025 -30461 -14638 -23425 -33031 -28796 -19094 -6285 -4595 -7192 -13101 -16936 -13976
15088 -13976 -18086 -22084 -13422 -11136 -9475 -4868 -8087 -16615 -15578 -2986 -2023 -7189 -17606 -16061
15074 -16061 -5134 -3986 -7163 -13658 -8109 -15047 -14525 -8717 -11059 -13192 -23189 -21776 -17951 -18350 -12957
15059 -12957 -12703 -10182 -5504 -3329 -20467 -25127 -17504 -13967 -13975 -9530 -7887 -7254 -3266 -4868 3885
15044 3885 10369 2926 -8502 -7592 -8292 -4277 -4446 -6630 902 -5195 -14662 -8881 -3389 9364 8217
15029 8217 6218 1775 -5272 63 2392 -5449 -8193 366 -436 -9131 -9298 -1397 -637 -2412 -1012
15014 -1012 -2843 -4013 -9737 -3897 -9465 -11936 -20071 -24127 -16401 -7338 -5187 -5684 -505 1896 -1121
14999 -1121 -1823 5043 7376 5668 3108 737 -428 -11182 -6788 -5155 -11621 2220 11072 4473
14985 4473 10276 5930 7683 6105 -5660 -8517 -12720 -17018 -16356 -11746 -11456 -3449 3541 -2481 -2777
14970 -2777 -1664 -10601 -16578 -20601 -10474 -511 -3954 -10998 -2814 4427 4691 -3066 -13732 -24134
14956 -24134 -10883 -6339 -11037 -17093 -10797 4363 4121 2187 2541 5131 -2643 -5899 -5736 -7608 -9710
14941 -9710 -17425 -20210 -16978 -13865 -3197 4393 -8298 -13427 -9028 -3548 7491 15725 5342 -8907
14927 -8907 -2403 -3456 -6720 -469 13809 17654 6745 3229 -4906 -2671 -11141 -4116 7093 2895
14913 2895 -4551 -9021 -6853 692 14149 11186 -16542 -16759 -5414 -9263 -14896 -10868 -3461 -4094
14899 -4094 -10798 -11192 -13366 -5823 1989 -1707 10621 13066 8058 9184 -3665 -12801 -12408 -13706 -18180
14884 -18180 -16602 -8995 -9996 -5881 -4783 -1067 -800 -4988 -4621 2910 12753 14557 12206 13354 18038
14869 18038 11834 11118 3533 -1024 -5672 -1087 -315 -555 5198 8150 2067 -1869 -961 8044 14253
14854 14253 8723 2691 -87 4494 -737 -11719 -10455 -10738 -7635 -10855 -14114 -12421 -16634 -23519
14840 -23519 -18756 -17633 -12415 5139 20147 9211 2782 9410 7274 3056 4007 -358 -3153 -1637
14826 -1637 3266 -2385 -6632 -3928 -8474 -7732 -5707 -2857 6616 10443 6535 -3061 -13823 -10780 158
14811 158 170 -7360 -11098 -25420 -31264 -24298 -19292 -17270 -14954 -18012 -19762 -26602 -25774 -13649 -1869
14796 -1869 7194 2240 -7079 -11919 -12129 -13411 -17153 -6739 -4124 -5031 1090 -1148 -4184 -13555 -18890
14781 -18890 -14526 8830 12135 2586 8061 12025 7837 -6191 -16596 -11611 -5601 -10020 -2139 9329
14767 9329 9760 6836 3466 5809 12279 8110 336 -2506 -11724 -16976 -10335 -138 5885 -1942 -6425
14752 -6425 -7660 -9581 -9153 -8954 -9050 -6939 -3091 -4255 -1075 799 -1179 -10701 -17476 -3379 10793
14737 10793 11201 7767 2679 -5825 -12372 -15393 -16447 -21345 -5251 -6498 -4586 -2188 -1328 -6877 -7527
14722 -7527 -8670 -7630 -4276 -5659 -6957 -13185 -15103 -10757 -11557 -7532 -8124 -9504 -2593 -11113 -19823
14707 -19823 -12732 -13702 -18834 -20643 -9418 -3704 -4160 -15258 -15678 -10862 -4651 -2594 -8642 -12072 -5508
14692 -5508 3418 -5451 -10954 -9360 -5652 -2718 3388 9003 6534 1198 -4303 -9246 -12956 -10553 -11030
14677 -11030 -12352 -10230 -11653 -30622 -25108 -10969 -4512 -9411 -10412 -6182 -11886 -10228 -13643 -15265
14663 -15265 -10742 -14799 -14117 -4818 2097 -958 312 3782 -1068 -8230 -11219 -8228 -3652 -6448 -7636
14648 -7636 -13674 -8964 -5660 -8917 -11255 -3193 -3030 -10015 -2596 1010 -3580 710 -9347 -8391 -2610
14633 -2610 2977 8464 3242 3755 4135 1386 -1106 -8669 -13602 -6035 -4627 -5781 -15335 -20362 -20616
14618 -20616 -19513 -19443 -30232 -24581 -13104 -12285 -12383 -10112 -11522 -15524 -11779 -12088 -9596 -12743 -7248
14603 -7248 -83 -12418 -10507 -882 926 -4030 -5125 -5951 -7355 -2818 1295 13584 7598 3525
14589 3525 2494 -4032 -3672 3069 -5404 -11649 -5872 -8681 -22334 -34018 -32833 -15546 -1568 4925
14575 4925 -3765 -8428 -11083 -14552 -21415 -30234 -23896 -5364 7013 1593 -2417 -6337 -14937 -12706
14561 -12706 -8618 -8242 -15535 -16158 -9728 -16673 -14429 -9686 -4759 -6526 -9962 -7681 -10576 -5685 5248
14546 5248 6582 193 -2484 -19233 -29490 -21593 -3693 3412 8780 4369 -3492 -10752 -12472 -5854
14532 -5854 -2674 -6442 -8906 -3829 -2272 -13343 -13377 -7429 -133 7040 9790 10492 4117 -8898 -9679
14517 -9679 -8464 -2164 -2514 -583 -2273 -15759 -14330 -6024 2682 3628 9837 10002 7057 6083 -4980
14502 -4980 -8461 -5878 -3755 -5370 -7004 -3194 -6927 -3776 -6409 -1140 -1108 351 4262 17288 15630
14487 15630 9023 11833 8440 5984 1250 2580 6565 -1742 -10015 -2688 -539 5726 3935 -1036
14473 -1036 5070 8989 768 3112 6824 9175 9027 12932 12637 8138 1130 5786 6515 1341 6014
14458 6014 3093 -702 -2892 -1200 6389 4924 6141 880 -4206 -5363 -7596 -6433 2996 2571 -7313
14443 -7313 -974 10733 11176 1109 -3980 -555 -5654 -11482 -14224 -16482 -7209 4271 -2682 -6237
14429 -6237 -6782 -4386 -9501 -14721 -8022 -2938 -6075 -6350 -5590 -3582 -6189 -7205 -6246 -4744 2909 6597
14413 6597 2521 517 -6531 -2415 -1806 -9631 -4364 -6452 -11963 -22656 -33413 -31108 -25690 -17314
14399 -17314 -14948 -6910 6782 717 -8648 -18953 -22028 -21739 -18731 -5966 -6386 -6296 9636 12755
14385 12755 8120 4297 5303 9162 6858 -2064 -4281 -10524 -6866 -6873 -3671 -718 9690 9272 3235
14370 3235 -564 -2165 6681 -833 -446 5163 -2904 -12551 -4076 5308 3746 2663 8451 11111 11780
14355 11780 12933 8616 4695 -5986 -11964 -4982 -356 2135 -7378 -15651 -5955 1096 -1644 -11297
14341 -11297 -13884 -12464 -8603 -6349 -20142 -19298 -15946 -7774 1869 -4293 -15369 -15668 -9765 -6091
14327 -6091 -3700 3071 2580 1917 16 1505 4844 -4388 -15321 -20738 -15626 -4572 -7105 -21950
14313 -21950 -24605 -20187 -13550 -9153 -10841 -11564 -4594 -10122 -13491 -17510 -20921 -11813 -7549 -7487 -7526 -12002
14297 -12002 -5454 12276 16062 20433 16019 4093 7989 9792 1724 -12367 -10310 1050 -1884
14284 -1884 -7046 -22502 -25790 -20173 -19038 -16792 -11443 -18015 -20589 -18467 -6087 -10400 -18448 -21523
14270 -21523 -22841 -16369 -8443 -11053 -9379 -7738 -10888 -5853 -12353 -15304 -12323 -3389 -12279 -18997
14256 -18997 -13239 -17075 -14188 -7885 -8397 -12995 -13625 -15169 -18653 -18997 -7445 -3130 -14958 -19168 -8439
14241 -8439 -4442 -10 3423 -2089 -1626 -5706 -5593 -7625 -15007 -10296 -6615 -6988 -4634 -3136 -11083
14226 -11083 -7394 -4174 -13248 -13650 -7644 -1944 -1851 41 2741 2504 -5660 -11465 -10331 -6970 1696
14211 1696 7732 593 -2808 -3765 -8834 -9616 33 -4160 -6651 -6479 -5660 -3432 -8374 -13436 -24800
14196 -24800 -15592 -9863 -5463 -3580 -5071 -8171 -13353 -12866 -5727 -5182 -6824 -12012 -13100 -7950 -1465
14181 -1465 723 -1690 7835 10486 1709 283 5458 10996 10321 5587 781 3481 6642 5581 2513
14166 2513 -4231 -12256 -4315 1962 6853 8542 5169 8280 7986 -3106 -8945 -3468 704 1498 -629
14151 -629 -4830 -16252 -13627 -19937 -18866 -10762 -11691 -14824 -8272 -2883 6505 4605 -1117 -6209 2768
14136 2768 7592 8397 9633 6254 696 -340 -12805 -9565 -3084 -10508 -16405 -18014 -23884 -24847 -19200
14121 -19200 -6194 456 1483 -4609 -509 2621 1587 8339 2916 -5671 -16938 -22762 -12722 -2046
14107 -2046 3249 3957 1137 -2708 830 8141 5797 -3740 -5847 -2798 -5319 -7064 -2067 9775 7034
14092 7034 8458 6420 704 -1958 -208 2495 1594 958 -1477 -8990 -11809 -8216 -13278 -7097 -2077
14077 -2077 -7930 -14343 -18813 -437 15901 14102 6548 1857 -2210 -4731 11240 13091 4427 4051
14063 4051 4289 10496 13257 6676 1415 5429 454 -8659 -18943 -16771 -9191 -9623 -5648 -984 -3283
14048 -3283 -4925 -8471 -15935 -12671 -6592 -1629 -5940 -5562 -3666 -7695 -5025 -3261 483 -6561 -9728
14033 -9728 -6370 1382 9150 2915 -4466 7880 17364 14059 13056 313 -348 -7072 -6613 -3750 -863
14018 -863 2774 475 5169 5569 8655 8842 3926 -2815 -4268 1099 1803 -9373 -18165 -13327 -9484
14003 -9484 -8662 -9268 -6169 -5784 -2415 2287 -8020 -8263 -12857 -1835 -1645 -10191 -10213 -13208 -15307 -12186
13987 -12186 -11270 -5940 3521 6472 -1033 -6469 -6656 -6358 1978 -4095 -8354 4957 4255 -8803 -4808
13972 -4808 -211 9324 3800 1558 6525 2762 8168 5974 -4371 -8958 -5779 -11426 -11375 -13603 -7109
13957 -7109 -9347 -11513 -13944 -5567 -1355 1196 3956 4840 2913 2015 309 -2718 -5898 -18968 -25215
13942 -25215 -23032 -14790 -9410 -11137 -16443 -18088 -12655 -471 -3144 -6878 -2872 -6096 -14753 -12463
13928 -12463 -5954 4760 3302 14224 15983 17670 19146 19194 6610 2266 1140 -802 -5863 -8450
13914 -8450 -8625 -5084 -2239 -4659 -12052 -15193 -13399 -9145 -13050 -17038 -23390 -22070 -15512 -18549 -1852
13899 -1852 9297 126 -3090 8631 7856 5100 9614 19352 24766 10304 8193 13868 10217 10040
13885 10040 9793 3526 4063 9304 10805 9010 13248 12909 12059 14887 926 -2551 -2123 -1301 856 4803
13869 4803 9243 9243 -896 -8753 -7349 -4213 -5708 -2942 2396 11636 6844 2819 -4382 -2448 -7329
13854 -7329 -3093 2383 -3275 -592 -7077 -13138 -17004 -20734 -16457 -7596 -5294 -5907 -5146 -15559 -12241
13839 -12241 -9913 -10203 -14691 -18610 -17687 -8798 -1283 11783 13483 16430 19759 5476 -1863 -11
13825 -11 722 3803 6270 7971 12358 12103 6345 6411 11021 11943 5470 6244 -5108 -6227 -9229 -6393
13809 -6393 -12739 -14842 -15743 -26618 -31837 -15215 6707 14739 28753 41017 34881 33872 28614 17444
13795 17444 8458 10757 14175 9406 8024 7264 -2581 6179 3394 10277 16278 11283 -378 84 -5506
13780 -5506 -10449 -7859 -5469 -3268 -4578 -6429 -11377 -13926 -15995 -6675 11254 8136 5727 15129
13766 15129 8525 -9023 -12428 -2085 10717 19670 37897 42527 53976 53165 56984 58281 62733
13753 62733 61821 49016 24164 6885 -8076 -7451 -13288 3977 18729 22672 16658 8157 13738
13740 13738 6782 -4652 -7083 -13974 -12452 -5940 -1954 -2600 1329 7858 15353 18367 15407 8332
13726 8332 -841 1372 -1747 6062 11684 6949 4933 -648 10666 16995 20916 20033 16845 17171 17991
13711 17991 10127 -1098 -11967 -20631 -23404 -29080 -13939 -3992 -1815 -8219 -15109 -14263 -14008 -10212
13697 -10212 4158 -3386 -15942 -16594 -15791 -3668 -2268 -1949 1029 7456 9805 2613 -2630 54
13683 54 -195 6994 9350 4433 4476 5887 20931 11655 -364 4373 14166 14510 10601 4780 5243 -5720
13667 -5720 -6519 -916 4334 16278 19269 15692 4583 -3151 -9540 -5073 12898 27797 32753 31269
13653 31269 18947 17203 20559 7296 1632 1172 10904 12420 8290 1339 -8171 -4188 13290 12892
13639 12892 11648 18505 15382 14412 16280 9698 3559 6622 8249 8280 -1987 -7580 -3442 5378 12882
13624 12882 21431 8114 6125 17658 17959 17145 18252 21044 19606 17709 20651 15122 12536 10755
13610 10755 11022 10135 12823 10126 18026 17029 12305 11548 13461 6930 8030 8106 -3616 -6223 -6309 -690
13594 -690 5667 4362 -4695 -10375 -8394 3635 11155 17596 9034 13739 12487 13757 15625 18247 10244
13579 10244 3869 7774 8070 9847 8580 8299 1962 4750 2838 2975 9601 20801 17838 6345 7229
13564 7229 5577 -1200 943 7434 5608 259 50 2096 2160 4194 11174 2220 -10629 -8471 -4435
13549 -4435 -7297 -4542 1478 145 9208 9690 10739 13358 -3902 -9698 -4613 -7439 -7798 -8829 -2321
13534 -2321 15437 15484 14858 20217 18299 20518 23029 19304 19081 10422 1778 3756 13265 15428 17920
13519 17920 15683 11016 16684 19206 14451 8402 -248 -1083 2621 6154 11400 12070 10730 3417 -3463
13504 -3463 -4692 -6531 6312 11383 10304 10636 14672 12727 7395 1329 -3248 -2895 12083 16836 12480
13489 12480 8238 5638 16831 14282 10766 6772 3593 13428 8893 10857 2821 344 5466 16254
13475 16254 19711 19830 20079 21804 21322 19780 25146 22459 29586 29289 23369 6928 860 10286 8240
13460 8240 9009 4654 -1322 2625 -334 -2472 -1255 4180 -2664 -6291 -417 430 1161 4126 3682 6716
13444 6716 6096 -345 709 6144 10062 16499 18992 21295 21540 8355 -1687 -4114 -825 380 4511
13429 4511 -745 -618 6929 8877 3122 5602 5389 -1752 245 -2338 -4864 -10024 -6612 337 405 -7510
13413 -7510 -14277 -16033 -4527 6023 10683 13372 466 -404 -204 2288 10644 21600 16533 16411
13399 16411 19600 26839 26282 16964 17049 16970 10529 1714 2966 641 6307 13949 4845 4754 7747 -3703
13383 -3703 -9889 -4303 -7645 -3949 2824 12950 8386 -1810 -4520 5943 15149 16491 6871 5759
13369 5759 13469 11650 14153 15042 11008 2790 4401 9179 17446 31589 26357 23343 11619 4300
13355 4300 10873 13626 11757 5920 7054 19010 22277 13620 4535 4919 12895 19930 24853 14760
13341 14760 10006 11916 29814 41663 38164 35866 31055 22184 16811 11452 16209 33355 31387 22038
13327 22038 19441 24428 32015 31134 27120 20182 21255 30128 34865 34758 21499 20360 17484 12418 15342
13312 15342 18801 15080 6367 1437 -874 279 9712 10662 339 -3154 -1797 -2891 -3366 -11383 -16817
13297 -16817 -13421 -13338 -263 13983 10192 19562 26036 22592 24495 28672 24770 16549 9430 8450 -1902
13282 -1902 -13084 -14026 -9033 -4184 11193 17265 12820 13088 14201 17174 20568 13304 4029 -4918 -12538
13267 -12538 -14114 -19035 -16735 -3487 -1948 53 6293 12048 18359 14633 18654 18015 7325 5417
13253 5417 15975 15048 10016 12825 10407 13523 16196 18760 17234 13372 9285 3096 -728 46 -1584
13238 -1584 1328 13865 22101 21302 19795 17576 21857 18866 22200 27624 17534 16674 18976 22380 14591
13223 14591 3392 -2718 -481 11173 17507 16218 7380 13204 21712 16323 11676 18552 23255 30221
13209 30221 32534 28663 18980 18927 16179 15085 12217 6950 12778 18037 22633 23869 25368 23727 16312
13194 16312 16134 8961 4372 13882 16645 16147 20086 18589 18425 19452 18912 16306 20542 29351 35723
13179 35723 34918 34600 26227 23349 23394 16716 24141 30232 30888 19563 19507 23049 33414 44115 51700
13164 51700 49198 44552 40091 28216 23722 26844 24652 30565 38019 36142 27800 20024 24719 36278
13150 36278 38184 33916 38529 27504 34419 42816 32369 24672 28731 33182 39576 50159 49269 49658
13136 49658 48111 44946 36577 35290 36635 24832 33649 43233 34539 27329 21561 19740 20188 24666
13122 24666 20988 23456 25563 28468 36542 35272 35282 36955 29225 33606 41799 48217 39986 38486 33695
13107 33695 33901 42569 43536 34569 28551 32656 30403 26219 23930 13642 5287 10488 10323 16940 22593
13092 22593 30507 33511 23396 20840 29855 28272 30684 33910 32580 27588 21982 18525 17696 13937
13078 13937 14279 7976 8861 24674 35778 35814 13805 7831 15749 24885 27064 18771 7657 2027
13064 2027 5304 311 18520 36362 36758 35139 15978 14171 16318 17745 8090 3976 12402 17952
13050 17952 19934 19846 19336 13323 10683 14768 23494 22245 25107 30367 30659 30480 29706 30074 26337 19934
13034 19934 22650 29985 32259 27825 25778 16357 15728 14950 16264 23208 16487 4724 7919 8294 19303
13019 19303 22248 26469 16346 10769 23120 21151 8967 -4416 4083 10281 -1817 5756 12330
13006 12330 20582 31774 30844 31036 27009 24283 22762 22235 22923 18792 21049 21268 20792 25174 24215 22493
12990 22493 11179 5969 7809 10848 12070 17162 19799 21016 18252 19743 23727 16963 10421 -1788
12976 -1788 -534 11143 5439 9224 19597 28531 31881 24556 22277 23681 20024 5729 3623 5336
12962 5336 12619 16258 7023 -1891 2542 13090 11788 8459 19159 22999 20678 23659 25516 30558
12948 30558 26613 26328 15415 13869 17543 17936 32220 37443 28181 26493 33419 35438 32957 33261 32101
12933 32101 20176 25955 35312 32812 31783 26755 23020 27420 25844 23616 27269 24865 24912 28767 22062
12918 22062 16076 13615 17344 22885 23412 25343 30783 29591 37949 36194 31030 34573 29378 25511 22530
12903 22530 27941 33041 29580 26068 24090 13837 4145 11485 27778 37804 41672 43428 48244 48585
12889 48585 41646 39761 46447 39277 28637 24800 23606 29687 40366 35211 19530 19247 30884 31122
12875 31122 37045 43746 50545 43308 34798 33464 31081 27860 29674 35612 35817 33564 36995 36105 30818
12860 30818 24233 24488 17079 16518 28583 38017 33066 34341 38834 35159 27830 27380 30229 25932 34427
12845 34427 35339 26386 22322 27519 36443 39483 47762 38581 35384 36305 38689 43462 39879 33280 28353
12830 28353 19218 13882 25165 25638 25227 14141 10918 23662 27657 40798 53044 44276 38441 43378
12816 43378 35547 34648 34451 30832 22369 19440 19699 32494 48328 54089 46925 43622 45912 49589 45030
12801 45030 39920 39324 37500 39441 44809 46260 27520 22029 29475 34657 24495 23555 35025 43309
12787 43309 40505 43169 44924 34051 31853 29959 25419 31958 40962 41529 46150 37137 22386 17013
12773 17013 24160 30044 28802 37725 51674 53284 44433 43999 38721 37827 42143 49119 52840 58563 58809
12758 58809 56280 59441 57283 53652 57899 56557 56754 51506 53707 67183 67179 54150 48279 50876 43450
12743 43450 48968 58857 53962 47793 55883 51726 47531 49163 55094 47715 39778 37577 37121 38256 37309
12728 37309 34128 42784 41929 46254 49831 46906 39889 34275 37074 41953 37586 36246 39492 39907 41455
12713 41455 45807 48089 48877 46132 50309 55009 54856 44319 48346 54274 59384 62027 66395 53592
12699 53592 52843 57103 55396 54020 48784 42562 40517 43580 39432 34544 33483 35801 38351 40576 38413
12684 38413 37486 35243 27075 25270 29201 34541 43737 54011 50064 48532 54507 45203 33720 30376
12670 30376 23921 27792 35127 31698 28721 31551 36334 37057 48690 55252 61813 65241 69639 62264
12656 62264 55467 39046 31412 37853 41811 43015 43219 45858 46713 48544 44530 51154 61332 75803
12642 75803 67521 58539 51658 47947 33165 32806 33915 46449 51818 48764 55101 58292 55913 49715
12628 49715 42647 34557 39772 47135 54757 60182 68620 69833 69709 72048 66758 63065 47328 36256
12614 36256 38171 48823 46455 40376 34985 43710 56038 62183 58177 44757 40337 56973 60320
12601 60320 57301 54221 44984 46799 59883 58781 49079 49187 56016 61086 57890 55746 53635 57543
12587 57543 62685 67198 65338 69867 67036 61419 57450 49635 70164 83849 89059 86457 75781 56534
12573 56534 43117 52120 57238 66585 65637 54733 61763 62648 60778 54387 53138 52464 50145 49750 52101
12558 52101 49307 49259 56360 61261 71080 74884 74038 72880 65306 60382 57903 56299 52833 54133 57429
12543 57429 65845 74716 86645 95779 83939 65713 60142 65361 66408 62425 62520 57054 65907 65751
12529 65751 68858 70149 61478 57556 49216 56695 69064 69969 63517 61524 61518 61171 56086 62063 67180
12514 67180 70539 68347 70500 71688 74834 79963 76513 68659 65269 65811 60775 71768 75716 77862
12500 77862 81486 81570 76167 70222 70198 62418 63854 70852 72666 74613 73038 72881 65464 58755 66008 71745
12484 71745 64977 60765 63462 68423 66660 75044 76532 68760 57100 55240 54811 51366 54587 69223
12470 69223 67883 62847 64649 68536 68698 64540 69078 65375 64898 72488 80388 88506 89227 94218 98539
12455 98539 96917 86948 83190 81759 77350 71267 79478 67838 69464 68762 68908 58457 62148 78105
12441 78105 92304 106132 106196 103155 97777 86496 95232 90609 88131 87427 60815 59571 69159 79965
12427 79965 84307 83695 86606 91750 90623 83668 88575 89469 81411 69409 69613 76285 75863 82485 87262
12412 87262 85205 82945 96791 85181 77603 81199 82967 79894 80634 81034 82264 87374 86263 84933
12398 84933 89004 106688 108530 104602 109738 109850 100738 92417 88015 98037 101563 94185 89528 92383
12384 92383 94004 81701 77977 85077 94675 101220 88725 87197 84051 78120 81684 93463 101262 96340
12370 96340 81456 74006 73832 72532 78165 80756 86068 83021 84021 90311 86057 96230 93500 85469
12356 85469 80829 85885 89276 90145 85942 83137 81605 80282 78022 77510 84635 89427 84171 85777 97313
12341 97313 93387 96115 101150 104534 108718 101274 95099 89516 90333 94552 104738 111299 112828 120872
12327 120872 114237 112271 119758 123323 115507 108142 98511 93415 97367 101496 106521 110527 110500 115031 119814
12312 119814 114499 121808 122478 114255 118120 126416 130611 136485 130004 115981 109524 109892 119279 126436
12298 126436 133141 135627 143391 142577 137697 143891 145750 149256 153038 152767 159327 147522 146729 148137 150965
12283 150965 152716 157155 166252 166676 165137 178557 190717 204182 221362 228132 234641 244453 255611
12270 255611 267560 283483 303400 339955 381768 445416 541406 641598 729199 804985 844882
12259 844882 848776 820143 771885 710083 663506 646784 638945 641658 659362 686034 689153 683674
12247 683674 656866 626780 596937 568650 555931 559301 566847 576036 577631 582344 574951 565181 555727
12234 555727 542961 544324 554852 574117 585511 597621 626944 658731 703789 783239 909092
12223 909092 1074153 1299474 1555294 1800438 1999238 2115614 2114775 1997851 1794751 1565574
12213 1565574 1351677 1166657 1035183 965523 927557 917860 954165 1008694 1026179 999959 959346
12202 959346 913823 861290 819232 785039 742454 702375 663806 626942 593843 568052 555176
12191 555176 553073 552982 556636 562901 580049 590780 597382 607202 635326 686466 758416 818240 884721
12178 884721 951122 1003048 1018014 986547 924414 841037 747526 660918 578127 515345 474825
12167 474825 443443 426254 430350 453758 483024 533274 566254 567937 535189 488567 432184 389477
12155 389477 353041 340260 341225 338996 338177 351304 364932 380600 403072 404659 381624 365183 352219
12142 352219 334967 327240 320883 303233 282356 266178 261377 256593 256547 257674 253756 251031 237447
12129 237447 238655 241672 236687 242085 263451 288372 323350 355141 364920 360339 350452 348817 357218
12116 357218 347914 341829 333842 318691 297691 280823 279529 276218 267535 267755 272548 267891 266517 265595
12102 265595 262775 253266 247323 249194 265328 260794 256290 249525 243368 245049 239902 238410 226924 224824
12088 224824 219632 214533 212747 218736 229448 236005 244507 269531 284983 304120 307162 321009 332278
12075 332278 336140 337847 340293 324795 312971 300505 289842 284135 277774 274408 282833 292136 301686
12062 301686 316062 311436 313759 316635 323260 318193 327567 332945 331133 333548 338784 333530 323564 323349
12048 323349 328311 336767 339424 328970 317797 310300 313084 328499 356244 396511 420260 436610
12036 436610 450000 461969 465050 465537 473759 473108 451528 421757 402891 388549 376932 364704 343805
12023 343805 339159 347553 355310 360589 366107 371572 373299 377213 395360 407266 419501 430017 438725
12010 438725 430434 420089 426643 411528 388696 377958 372727 377198 369745 369916 367485 366954 386470
11997 386470 398050 402776 408195 405942 404421 398996 396842 401262 402667 396319 382902 366837 351584
11984 351584 341369 325562 310855 308524 304618 315579 339552 361365 378761 407649 437658 471198
11972 471198 520732 579273 620885 648666 651684 636788 607235 579444 553712 537829 528294 515565
11960 515565 507717 499682 496551 490929 469422 450276 449472 452955 460888 472657 500422 542315 582658
11947 582658 618213 647968 665021 676483 671947 667795 663317 668717 694226 729696 756662 783403
11935 783403 812675 840786 868013 874752 885226 894806 909868 913465 916220 928536 954115 975047
11923 975047 1011383 1053782 1081800 1110965 1145655 1170386 1207804 1229834 1228117 1205472 1185570 1170315
11911 1170315 1176151 1181477 1221161 1299777 1400132 1527513 1678850 1843748 2020987 2210181
11901 2210181 2414443 2647664 2880167 3104828 3303465 3450589 3537847 3587300 3586706 3538585
11891 3538585 3460280 3396727 3354188 3304567 3253308 3222193 3204627 3230357 3313061 3446953 3612981
11880 3612981 3782119 3929647 4034822 4093819 4094688 4030780 3928132 3808705 3680358 3569016
11870 3569016 3477486 3428512 3430529 3470278 3543168 3660027 3818820 4027732 4281313 4608481
11860 4608481 5025481 5534206 6101155 6696227 7282850 7830225 8309777 8732830 9127614
11851 9127614 9547306 10039805 10663592 11427425 12355694 13395859 14457662 15446004 16284006
11842 16284006 16917238 17353611 17650520 17899346 18197801 18663166 19389402 20426777 21806249
11833 21806249 23600841 25963935 29225382 33917605 40783647 50683907 64374907 82016408
11825 82016408 102319233 122019797 136700234 142915861 139907397 129615502 115428825
11818 115428825 100754541 88116430 78821232 72949492 69896787 68993125 69810283 72127597
11810 72127597 75702182 80018822 84304292 87763726 89987354 91061640 91453138 91741094
11802 91741094 92477722 94158856 97103460 101257038 105997222 110308605 113245005 114321605
11794 114321605 113656327 111986854 110349856 109740995 110902207 114302912 120520610 130740159
11786 130740159 147120136 172628199 209618224 256651283 306136502 346184576 366494373
11779 366494373 363141911 339172259 301776125 259257517 218827956 185150144 159844330
11772 159844330 142299582 131074134 124821518 122426486 122762481 124439403 125846807 125631274
11764 125631274 123199438 118835301 113375984 107806963 102966130 99381159 97250809 96345468
11756 96345468 96069516 95588792 94174165 91526402 87864254 83745530 79854984 76772379
11748 76772379 74796363 74009489 74477102 76603035 81323916 89978642 103467640 120836157
11740 120836157 138660632 152109879 157271450 152781953 139929740 121622657 101287436
11733 101287436 81984745 65701192 53155933 44100994 37788472 33439824 30404234
11726 30404234 28212757 26587862 25356601 24426717 23718793 23155515 22640299 22077097 21383700
11717 21383700 20516913 19470398 18282878 17025794 15768985 14591823 13540909 12637795
11709 12637795 11860239 11169529 10522894 9862514 9157266 8410017 7649048 6904331 6216181
11700 6216181 5615740 5122056 4725782 4411632 4167253 3996551 3861612 3750021 3672379 3632157
11690 3632157 3626587 3645118 3707530 3781451 3868481 3943372 3988968 4003122 3966985 3863570 3723333
11679 3723333 3562625 3393537 3255636 3155580 3098965 3069562 3058050 3078299 3142787 3222263
11669 3222263 3328696 3444429 3528232 3556950 3520186 3413463 3235423 3005636 2731174 2430888
11659 2430888 2116153 1850748 1649630 1504612 1413731 1383749 1388900 1411829 1431232 1448788 1457933
11648 1457933 1448095 1421094 1380419 1339057 1281400 1205928 1143161 1084615 1019249 960231 910223
11637 910223 861653 811387 758519 715677 689688 670786 659683 661519 670949 679280 692026 686088
11625 686088 659382 636874 609559 597023 571820 542874 531980 520166 500124 478356 467829
11614 467829 467558 472324 470496 483683 490793 495687 494367 483709 477398 459259 442545 431422 426088
11601 426088 417567 411329 397627 382793 372987 359185 327636 295304 265770 243774 230329 215649
11589 215649 215460 242100 260814 288377 326885 355511 365191 383903 408257 426623 424351 415889
11577 415889 405457 402769 392801 370680 362160 356398 363605 364960 360573 347817 346734 334365 322879
11564 322879 318727 314219 317336 331013 339436 335171 335392 347601 356111 356967 357705 353716 330813 320142
11550 320142 306927 286302 266552 252812 251433 263112 272649 276367 282600 294170 285575 294581 292798
11537 292798 290478 302482 295263 284412 279370 280172 281144 274302 267698 259995 245517 238498 230628 224204
11523 224204 223547 231934 233159 229865 227346 232925 228245 224201 221235 221215 217650 201097 195736 187249 180264
11508 180264 175287 170781 173471 159986 160038 168041 171387 161449 150372 156275 165738 162079 156993 149907
11494 149907 151699 164084 153435 133260 132411 123797 127782 124716 123200 125520 126793 135156 139236 135465
11480 135465 137106 151443 163720 164826 172440 176565 180449 173792 157558 145965 135350 131244 127374
11467 127374 130162 134568 122277 111708 118367 121508 127076 130608 127224 126419 113989 115821 115994 108815
11453 108815 104558 107674 105567 101117 103644 101447 112927 112281 108530 116528 121061 112647 107845 101777
11439 101777 97805 104560 117656 121413 130100 134957 125125 120946 122807 114055 101044 83205 76678
11426 76678 85687 93346 90327 83285 93416 104818 105848 103155 101161 103045 102222 106626 113932 116505
11412 116505 108137 103408 104643 101892 104565 107949 110265 111049 119640 124463 123987 116578 111519 120146 130682
11397 130682 132136 138590 144222 152687 165069 177512 188602 201586 205410 207927 210416 216484 236223
11384 236223 266359 309595 361226 434951 532306 616841 691719 745013 759973 739528 686913
11373 686913 618784 560885 506391 466687 444736 436137 434361 430139 428984 432174 433600 428720 421529
11360 421529 432072 449036 469236 501532 531259 570908 611267 633187 653396 668493 676128 674062
11348 674062 674333 667740 668295 671681 671603 684361 727434 804894 940487 1111023 1329584 1565354
11336 1565354 1794523 1952866 2018258 1971818 1837943 1628707 1391703 1164287 965969 809830
11326 809830 710065 631572 576366 546730 515377 494870 486854 467910 468315 482471 498158 491824
11314 491824 487650 484676 470476 463507 463156 467358 474608 487780 498788 508005 512071 514700 520874 519165
11300 519165 520085 532436 574094 634248 693965 753734 802192 838574 838549 794532 721153 626320
11288 626320 529787 439377 360919 296262 258530 234002 218409 212276 197190 184101 174823 164432
11276 164432 142576 124679 119355 112819 113702 97709 81803 80410 67832 66395 67551 63701 56550
11263 56550 57087 55661 55653 75789 79533 67030 75665 74999 72805 73906 75016 81893 85740 85481 89098
11248 89098 82248 72866 66134 74757 71525 59031 43567 37717 29472 40617 39050 42981 48877 52477
11234 52477 44748 43123 47297 46077 40829 41774 40174 44225 37787 36352 37187 40986 43938 41656 50195
11219 50195 49988 42114 39679 38245 45827 44566 40973 36369 32332 30135 21763 13366 6816 4628 13702
11204 13702 27197 26672 32833 36091 36674 29904 27038 26026 28778 34366 26634 14824 8420 17628
11190 17628 19311 24138 29177 29753 36079 29275 27845 32270 38009 27062 15666 14169 19463 21456
11176 21456 26333 23807 23578 36483 39514 31639 26342 27542 24910 26058 25304 21877 15460 10887 2064
11161 2064 2990 88 5245 8396 2058 1835 2494 11546 8661 8023 3838 5072 10719 12509 12257 9862
11145 9862 7272 7437 12590 18367 16727 18913 20670 29767 36710 33844 27653 24830 13503 11613 10792
11130 10792 1142 -11423 -13136 -209 3 -4765 2134 3695 1072 1769 13432 23291 24209 30089
11116 30089 20699 18447 15263 10611 9398 16078 12732 6655 39 3608 9404 10303 15571 22337 24095
11101 24095 12915 6699 14737 16380 19284 27385 29416 22036 15333 13923 7913 6264 7641 8557
11087 8557 6339 4385 3971 7785 15272 24308 30247 31954 30193 18785 17068 29466 34818 38088
11073 38088 29831 29483 36463 35645 26153 21485 17916 24246 24067 23002 22101 24323 31157 35262 30009
11058 30009 30226 41563 44224 39464 41710 37606 29103 18809 18634 24695 27207 8111 7161 18575
11044 18575 24920 16218 5620 -928 -7708 -1934 -2535 -4499 -2669 3363 19294 19107 12195 9034
11030 9034 2948 -4307 -1365 -5229 4593 12665 12673 15680 11258 4143 1940 3499 9425 18483 20374
11015 20374 9845 1604 9061 11122 2959 5655 5577 2649 3412 3271 -2511 -1663 10496 13024 15947
11000 15947 15447 18019 8420 5680 8461 8876 14364 17338 16166 16003 17131 20156 28402 26146 21963
10985 21963 18692 14415 13681 15250 22303 24772 27327 18165 8113 8403 9053 4298 9506 17869 7502
10970 7502 13919 25717 15438 15164 17936 21302 20201 21695 16816 17889 18770 19737 6948 3457 7753
10955 7753 8220 8608 7422 13230 15513 18728 21042 18210 25998 26468 29200 27969 17621 23587 35813
10940 35813 41874 41398 33897 20650 22700 32042 28562 30067 35805 33419 35965 42139 34572 32120
10926 32120 32786 28465 17393 21676 19724 17725 21765 31371 33019 31837 33541 25043 11433 -4281
10912 -4281 -5176 -1583 816 5722 8275 10745 7491 11789 16690 23269 27725 27834 26387 24029 27352
10897 27352 26241 22221 19690 23500 23363 6739 5017 -515 -2746 7050 17419 15505 13823 16487
10883 16487 11911 4142 2779 17443 27259 28471 21881 21872 21479 22403 19498 16237 14439 28459 33542
10868 33542 36415 36980 37540 44497 42959 41272 33390 30723 26616 20343 19480 15599 14637 17875 10724
10853 10724 13217 22960 20365 18446 22837 30807 31211 32620 27891 23691 25047 29750 22594 16740 22236
10838 22236 10783 12009 7885 2351 4841 7984 15205 9039 7978 16026 15042 22225 26378 20513
10824 20513 8911 14347 20348 23888 23246 28699 31303 31923 34191 25611 14826 15964 23014 27029
10810 27029 30614 21026 17451 19750 12508 2029 -1889 9602 20489 26611 22623 24038 20381 17534
10796 17534 10727 8949 22069 27623 26196 25887 25443 22632 27612 21550 21505 25479 17556 5453 5959
10781 5959 1745 8264 10277 9801 13174 20654 13938 7618 17328 22482 32024 45262 39891 27017
10767 27017 18230 16946 9321 390 16084 23724 21554 16262 17087 14036 28602 37663 35911 33953
10753 33953 40420 44185 37880 36016 20247 9102 15505 24592 30109 29553 26702 23336 22849 24205
10739 24205 30377 29953 22899 20834 22016 28590 23740 12705 17892 18524 15482 15508 6581 535 8178
10724 8178 14946 28050 34398 39116 41565 29857 23372 24464 16712 17067 22394 27817 23873 17186
10710 17186 7542 10607 29520 32723 21145 21024 17052 8565 20276 30360 21538 13294 14054 15544
10696 15544 17016 10061 7474 10912 7080 3339 5713 16924 18582 15167 7169 6550 16178 25511
10682 25511 16984 8364 628 6856 5439 5666 15377 25366 31320 38266 30498 36588 45429 44697 40453
10667 40453 34287 24829 23490 30397 25544 16113 20673 22648 24040 20056 19666 23434 24070 27720 32121
10652 32121 29073 23123 30993 29370 27924 33883 31695 38598 41637 40778 35520 32063 33053 32533 34056
10637 34056 38985 36089 38466 41584 43734 36549 31640 36211 45143 43707 36548 44878 47567 37104
10623 37104 33001 29733 31113 36070 38825 47189 40264 41206 54070 61468 47909 39129 26536 26146
10609 26146 25428 32948 33259 29161 29720 26177 27443 38178 42888 47022 34424 22957 22513 24250 27703
10594 27703 25025 28430 34874 38775 41076 40681 38785 42972 49033 47986 49794 50694 50678 47655 49855
10579 49855 43108 41361 41453 37255 31969 30772 41225 46943 46463 45599 35256 27335 32201 41119 51472
10564 51472 49161 53507 61350 60144 51637 46434 45277 42793 40875 44402 43208 44083 49385 55564 45626
10549 45626 36244 34162 36921 41664 46596 57566 59561 61245 58423 60560 59476 58119 48880 40965
10535 40965 41033 40477 46275 43917 47093 38642 35978 44969 56046 53840 50843 57582 62939 66901 63715
10520 63715 56571 63379 64636 63477 50989 50059 60255 63157 58642 51654 59448 71622 73664 61224
10506 61224 57643 55830 44170 42154 50467 44314 51959 59432 59233 57391 59374 56306 55287 59541
10492 59541 62312 62310 62659 63438 74319 71934 73555 61454 45012 49774 52476 55012 60206 70245 68968
10477 68968 64605 62920 64031 66604 69291 76874 81037 80003 67586 61364 58408 55088 54987 66268
10463 66268 78511 78617 77311 74123 69641 75136 72004 68299 66310 68584 65481 66872 61829 78430
10449 78430 94328 94238 84477 78236 71824 61968 64332 70441 71778 74826 76751 76529 75394 79756 76746
10434 76746 64639 53715 43776 39433 48354 61246 66513 71758 67500 60576 59761 54838 60925 70476
10420 70476 71320 77933 86171 80351 79662 73892 69962 56709 55790 59215 64882 62634 71019 62550 60097
10405 60097 69532 70866 81827 79502 79453 81589 80720 78759 77422 69846 68608 71218 70777 63007 69579
10390 69579 69190 59288 56584 66209 70441 63480 56726 64847 81594 78003 74936 78568 80485 79682 73768
10375 73768 76461 70754 58847 54647 57141 61083 62197 62791 70149 62268 69298 83104 87179 86608
10361 86608 82617 79753 84074 73409 74076 78582 81880 91603 86552 81189 82548 89609 77377 72047
10347 72047 66424 71815 75679 78271 78003 77579 84557 87755 88790 98035 93401 89174 84133 80054 82209
10332 82209 87670 88612 74611 72027 78302 86814 98982 107910 103114 112900 114438 113364 114825 109131
10318 109131 112397 120666 128746 148580 163722 184372 217226 260867 310574 350918 384672 408409
10306 408409 406563 390771 365266 325238 294014 274783 243605 218094 187881 173113 172995 165185
10294 165185 179613 184219 184511 175110 168547 169478 170422 171249 178779 187676 190283 196041 205240 211650 211447
10279 211447 225805 241226 243851 256480 274890 302441 336251 380381 442868 530449 618144 722689
10267 722689 833512 940776 1032565 1111448 1177845 1229596 1217961 1143957 1016180 866009 712188
10256 712188 588678 498619 426074 382822 338585 310589 302351 281732 273571 271196 266528 259909
10244 259909 249746 248643 254487 254177 253732 254964 265235 268114 276422 282904 294365 315986 344584
10231 344584 390190 438447 504678 596676 719260 861259 1004240 1162006 1332695 1514069
10221 1514069 1673331 1781070 1847145 1847595 1754507 1581861 1365567 1135924 927325 750920
10211 750920 629896 540160 454603 403667 381175 361301 356007 338352 313543 295253 294712 302684
10199 302684 315788 321718 320387 311192 305940 296265 284306 279139 284449 293113 308213 326712 347350
10186 347350 385554 432786 497259 577637 674435 800323 959892 1153868 1356197 1507413
10176 1507413 1560342 1535970 1423062 1238157 1034959 842124 683537 568473 485869 419992
10166 419992 376211 339901 309050 301127 292367 285566 272528 271312 279325 282324 274420 249932 230948
10153 230948 223067 214998 203558 195610 195286 204845 216946 218279 218056 226263 229364 248869 270387 289941
10139 289941 320347 346128 393293 472093 539614 582504 593034 570228 532737 471741 409732
10128 409732 359423 321483 295174 282975 263405 244390 225398 217448 219088 211524 202730 196266
10116 196266 188918 189072 195541 194758 179723 159013 151245 151837 163728 195071 215430 230445 250893
10103 250893 270652 273890 287107 289824 285636 276014 286245 289588 277647 263573 256433 254301 255762
10090 255762 253292 239728 241073 249029 264134 276580 283508 299116 323868 327100 323685 336857 341266
10077 341266 333554 321893 317966 322094 320928 317414 321723 307800 290294 289835 297979 305111 322209
10064 322209 339853 362945 393390 417248 433549 453370 452999 451968 456208 453080 429785 398891
10052 398891 362562 326640 311994 303997 293190 287915 275758 279645 296213 313415 330740 362567
10040 362567 378845 384888 416843 459091 467640 463689 448621 421356 401391 386564 375918 362771
10028 362771 344142 330265 331073 323311 319268 323838 330300 349028 372094 383419 402554 407565 427522
10015 427522 435487 427913 421201 417315 401414 391095 376846 357803 330713 319990 318479 317669 317205
10002 317205 314108 334324 358964 383237 413424 455667 505961 550935 583493 589500 574429 538200
9990 538200 516975 504826 493936 482268 485060 492430 495874 490071 478198 474278 461927 440793 427993
9977 427993 429586 437574 463550 493065 543656 594866 649901 696824 715599 702570 688500 678155
9965 678155 654392 628300 611832 607185 616116 627536 641271 661908 681176 696876 725467 752099
9953 752099 778455 821817 855682 879574 898868 915121 935492 960784 985858 1013308 1052440 1081567
9941 1081567 1096129 1089752 1077122 1030294 987681 957914 953414 991585 1073013 1186742 1333461
9930 1333461 1520137 1711896 1881442 2032426 2185144 2355253 2584897 2853671 3069337 3204409
9920 3204409 3315485 3454374 3653927 3887327 4134671 4419904 4760098 5115861 5389455 5502940
9910 5502940 5497602 5422497 5301865 5139145 4952958 4769569 4605440 4477349 4361583 4272776
9900 4272776 4245158 4287277 4393242 4548616 4754396 5025336 5393255 5971688 6850003 8127941
9890 8127941 9739847 11277457 12317449 12874408 13203684 13417778 13437585 13181717 12665733
9881 12665733 11943081 11067470 10156431 9371606 8784662 8376145 8091189 7876786 7715606
9872 7715606 7626208 7626114 7737087 7980436 8358102 8841867 9391168 9995378 10676510 11441161
9862 11441161 12313062 13336709 14562957 16032320 17819091 20060226 22973518 26838645
9854 26838645 32103630 39420197 49546505 63315502 81614394 104704766 130328079
9847 130328079 151352188 159938440 155872272 142865892 124027936 103212913 84524578
9840 84524578 70140594 60291738 54404791 51800242 52016265 54899979 60655882 69476353
9832 69476353 80651865 92818687 105260885 117426098 127853654 135177467 139299713
9825 139299713 140538412 139394459 136554931 132592339 128052606 123305519 118433763 113524713
9817 113524713 108889962 104638657 101016674 98801761 99062375 103077700 112739703 130844106
9809 130844106 160564924 204086853 261020571 323418066 373331766 393696863 383248950
9802 383248950 349555590 300515265 246183855 196664411 157718612 130357257 113122095
9795 113122095 103791929 100321724 100776865 103131725 105993316 109281229 113472577 118416665
9787 118416665 123726024 129290303 134628432 138870463 141863715 143307512 141843895 136726135
9779 136726135 127901708 115598040 101330987 87225599 74711786 64569184 57168282
9772 57168282 52454332 50140537 50105977 52536366 57926098 67172780 81344750 100674341
9764 100674341 122860984 141602693 150008725 146745706 134610486 116563068 95925900
9757 95925900 76375247 60192337 47795204 38688246 32107465 27342590 23851079 21241407
9749 21241407 19209156 17541251 16114879 14882089 13793871 12832087 11964291 11132588 10337990
9740 10337990 9609294 8963934 8436106 8049156 7821934 7718392 7648311 7588457 7584281 7684974
9730 7684974 7936692 8371636 9024417 9845462 10616212 11118275 11441668 11765944 11977672 11751907
9720 11751907 10997124 9916792 8683915 7421676 6305518 5439615 4834084 4393938 4051941
9711 4051941 3761877 3507926 3294144 3144092 3055916 3030315 3049444 3112498 3233857 3405260
9701 3405260 3593351 3760167 3905971 4039072 4108590 4071417 3962319 3799862 3603938 3376445
9691 3376445 3100746 2835646 2630406 2483324 2365741 2226496 2046178 1848778 1634743 1444247
9681 1444247 1293410 1188216 1116761 1089834 1089598 1091043 1072249 1022325 976505 934261 893219 863301
9669 863301 830246 789427 749254 712070 675795 633170 595095 565640 546423 524038 484337 454372
9657 454372 440154 435443 437885 432506 436933 435237 426263 425826 408289 400205 403037 407009 416095 414593
9643 414593 401919 388827 372600 341667 314714 300402 300674 312043 325680 344591 365268 377179
9631 377179 365703 354321 352221 348695 332311 325280 319911 316418 311346 294904 276963 257793 230066
9618 230066 203619 160605 117463 92897 83112 77984 92225 131328 172680 210263 240160 264469
9606 264469 288735 304790 310262 315288 318085 311942 300154 290618 277560 271046 260298 252885 245379
9593 245379 232274 227127 220829 213012 220701 226421 224409 219579 228717 225929 224957 221984 212994 209808
9579 209808 212648 212040 194425 176757 155954 138809 119682 109007 113170 124097 142120 153913
9567 153913 172130 178449 179730 190066 207113 215459 207524 209506 212143 214725 215427 210166 193887 183621
9553 183621 175053 171475 169035 153607 153376 159504 152189 139102 140668 145422 143931 144521 143633 138614 126853
9538 126853 107279 105422 107576 99619 98152 98549 95298 88463 101309 105972 91074 93827 88846 88577
9524 88577 103958 113170 123190 119449 121502 133473 135879 131278 131347 116943 102283 88924 88712 87476
9510 87476 85193 85521 87276 88799 90950 99983 107733 124559 135794 147694 158836 165144 163606 156480
9496 156480 143649 119562 112825 103347 101880 95130 97767 100094 104253 102456 103296 107229 105716 103383
9482 103383 108241 116817 130178 139538 157420 171249 191139 215746 252889 295505 336265 374494
9470 374494 422910 457712 484314 489388 474999 433411 383171 339135 294798 254101 225854 205977
9458 205977 191301 176827 177766 175677 148818 129918 119633 115258 117773 130866 142417 142741 152192
9445 152192 161418 171903 173506 175604 180579 186693 190815 195340 200002 223600 252687 284582 329944
9432 329944 409878 522796 678535 893969 1146966 1381238 1507625 1536147 1485308 1374103
9422 1374103 1222288 1053285 882800 723138 593591 493596 417685 369447 339262 319062
9412 319062 290370 266101 251896 245070 241746 244101 247621 243718 242309 239018 232450 223442 224670 220565
9398 220565 222565 230860 247238 263161 285157 306231 346032 382402 449691 563002 717721 931654
9386 931654 1185304 1448889 1676358 1826396 1872849 1824254 1720826 1580733 1422012 1237530
9376 1237530 1045952 867617 704198 581889 488375 412899 363609 328548 292491 269705 261959
9365 261959 249496 241645 240880 240304 238263 234478 225177 230646 232901 234632 223324 211187 204267 204243 224225
9350 224225 239081 254637 276577 302013 362128 454284 579630 737556 902400 1031670 1100063
9339 1100063 1132835 1122914 1095458 1064402 1015687 939334 836129 712304 593725 489266 405899
9328 405899 341733 307340 274444 248366 250807 246769 234847 236578 248783 270547 291683 320267
9316 320267 341128 342182 317711 293610 266915 235641 217432 204412 194085 188995 182764 187266
9304 187266 205655 216237 227541 242848 267078 305596 337907 357633 361029 364104 372533 373800
9292 373800 359551 326657 284851 247665 203685 167026 136145 124876 119552 111959 109499 105621
9280 105621 102902 91841 96243 109492 109960 101271 98609 93946 93947 97695 104975 87667 80299 79939 69178
9265 69178 72955 73887 68922 60055 67521 79100 72936 56879 42949 34389 26984 30097 32082 28551
9251 28551 30595 32531 34927 35134 29764 29649 34453 34412 21758 17286 31766 38763 34897 28069 19656
9236 19656 19507 26084 21699 11452 16782 13465 5870 0 5334 13260 15596 16098 18777 22155 22560
9221 22560 22429 23115 27212 16618 13370 11338 17423 25984 28359 29314 20579 19509 23346 26311 23968
9206 23968 25734 13329 8733 -5951 -8386 -1266 11320 18254 10887 12731 18787 17459 16691 21201
9192 21201 16516 19306 22262 22840 15080 16722 23773 25539 25287 21772 22072 26084 19960 17963 22893
9177 22893 28626 39496 44171 31461 23773 18061 13444 6871 7435 8356 1979 3241 9640 17416 19394
9162 19394 19802 28391 41774 50816 43443 46808 41447 54494 56402 42938 28796 29112 37267 44141
9148 44141 48760 38989 31113 35552 44514 53420 55251 49128 50235 51927 45260 42509 60195 74146
9134 74146 78513 72656 81293 84902 86585 86944 84462 82939 92218 99027 99530 97992 101750 101455 107049
9119 107049 112365 115998 125818 128296 131448 147955 155657 164543 175951 183035 193582 197896 195512 201921
9105 201921 213514 227692 239256 246932 262105 267686 275270 293152 309328 326769 346218 373948
9093 373948 397678 406645 431038 452006 464395 481389 498353 507008 517836 535175 562177 581251
9081 581251 603993 623942 634699 640173 636161 638033 648615 657436 661014 651921 647545 636192 627644
9068 627644 618056 611534 597518 587080 574563 555958 545807 533743 519136 498829 470888 457709
9056 457709 428201 406598 389068 377604 366440 352547 335028 316060 303534 283367 271532 258534
9044 258534 257123 248560 238136 228502 230880 221204 207317 193945 185388 182007 173630 163013 156930
9031 156930 141088 137287 135150 124409 118192 121984 117231 115339 117765 120296 114652 104372 95557 91698
9017 91698 83208 71612 64006 62296 70841 74919 67229 62339 62979 68583 70846 62268 53997 53491 45986
9002 45986 40563 29904 37574 45735 49085 61273 53573 41902 32557 37115 40309 35954 41240 38943
8988 38943 46016 45241 34078 17098 7935 7364 6499 -2266 4835 11359 17592 14287 9712 14585 16914
8973 16914 11780 15157 20701 21862 10898 16863 25248 32365 18079 8429 5759 13604 15507 11384
8959 11384 1516 -1573 5798 20062 19801 12516 4485 4527 8361 19706 21097 13579 3479 -2435 -2685
8944 -2685 -3823 2116 8724 6839 11748 11308 1593 -91 6556 8417 7787 -1965 -15213 -14910 -4636
8929 -4636 8585 10567 9958 8040 10564 5768 9601 12268 11980 9171 9120 14491 12800 16284 9274 1438
8913 1438 -2575 -6244 -6817 -8054 -13479 -14528 -12744 -19854 -24389 -23028 -13927 -12630 -24425 -28905 -6627
8898 -6627 -2052 -10021 -19228 -15829 -16515 -14249 -4734 -2421 -9128 -17187 -18527 -22190 -18228 -10804 -9881
8883 -9881 -18287 -20842 -12777 -2564 5131 6652 387 -4806 -10098 -10364 3006 8765 1244 -7359 -5706
8868 -5706 3272 1866 2628 -11676 -14858 -16266 -12566 -17204 -23399 -22587 -19553 -13177 -5555 -11792 -5449
8853 -5449 -6609 -9607 -19858 -24813 -17692 -20977 -25284 -28473 -28308 -16659 -14372 -12709 -15840 -9065 -6217
8838 -6217 -4292 -2149 -29 3210 -2437 -4196 -12541 -13516 -18024 -20575 -11387 -2987 -13293 -20501 -16848
8823 -16848 -805 2515 -496 9199 3197 4626 428 1523 -5644 -16074 -12444 -13443 -11548 -15785
8809 -15785 -23255 -21364 -21373 -30182 -33857 -30159 -25869 -30305 -20361 -6448 -422 4039 5663 -13268 -27429
8794 -27429 -16347 -8275 -13064 -16729 -12840 -11887 -8738 -8346 -5304 -8032 -7558 -3858 -6614 -12251 -12004
8779 -12004 -8714 -3677 -16292 -20708 -13946 -21651 -23439 -14367 -15161 -10557 1692 6093 1136 -7212
8765 -7212 -16384 -17739 -18878 -10184 -8960 -10607 -4866 -3082 -6088 -5767 -2392 -6661 -8092 -1644 -4523
8750 -4523 6116 3634 -11107 -15143 -11754 -7970 1666 -7653 -17439 -9546 -6301 -4383 -10722 -19005
8736 -19005 -14196 -2176 -190 -3313 -15386 -14656 -15212 -15915 -16462 -15883 -4687 -8555 -11167 -11019 -12024
8721 -12024 -13914 -19933 -23423 -33143 -28837 -15024 -7480 -2140 -884 7180 8247 -5545 -12301 -7477
8707 -7477 -3736 -6335 -4322 -6898 -6448 656 8328 7543 5012 -453 -10519 -5597 -852 -870 88 -5628
8691 -5628 -6577 -5274 -6116 -844 1273 -6136 -13399 -18195 -5194 3568 1645 12044 17093 17293 20978
8676 20978 31167 33340 37521 41258 43022 45734 58244 59192 67218 80753 82208 73195 70392 72470
8662 72470 69513 60834 47325 35351 40787 31077 31751 29731 30330 21221 18249 20763 36590 57264
8648 57264 79535 110331 157963 205200 222821 211828 183040 143645 108106 83511 60061 43292
8636 43292 40156 30486 20422 14217 13463 10436 6982 19291 25264 27737 27648 22541 15698 14974 18413
8621 18413 25546 29460 46733 58361 66464 69698 61435 63615 58623 51302 37836 30785 23753 28143
8607 28143 49694 62377 82999 119878 181936 274234 393082 443965 439603 396763 327918 232738
8595 232738 154109 106014 74030 52310 41992 37649 28439 16786 20554 25156 14611 8450 22842
8582 22842 26954 22981 12387 17250 13888 4201 9126 9806 8887 18759 30133 40643 41387 35277 27096
8567 27096 8143 8644 26024 23562 24318 34815 52610 73998 91038 117373 160120 207026 218666
8554 218666 197815 163649 134085 99013 64273 43298 26020 16555 3551 8096 11203 15114
8542 15114 16819 18256 17192 9665 9345 7404 14256 12702 3107 794 -2492 -7885 -4581 -5001 -4347
8527 -4347 5681 2319 -8513 1923 3190 -6458 -5549 708 -4500 -5327 -4680 -14394 -10212 -11762 -7758
8512 -7758 2236 2146 6286 1707 2397 14790 22489 20551 11006 5836 802 1719 8335 1000 -9537
8497 -9537 -10384 -10777 -18686 -29590 -22588 -11638 -9994 -11815 -13120 -12116 -9187 -11329 -21009 -26862 -29347
8482 -29347 -22298 -7341 416 4666 2869 -13475 -17997 -10345 -3750 -6742 -9128 -8897 -497 -5212
8468 -5212 -967 1360 2592 -106 9265 5225 5834 2171 -2152 -1497 1918 5692 -7948 -13895 -6697
8453 -6697 1766 10891 24592 30334 45820 83387 102948 106501 101990 88221 72377 56379 38341
8440 38341 20772 11765 6272 -2410 -11968 -14004 -11586 -7638 -9348 -13519 -18633 -23918 -25041 -26208
8426 -26208 -25511 -20699 -6050 -2240 -14107 -15689 -11341 -10383 526 1340 -5905 -8186 -15251 -6086 -296
8411 -296 5333 15569 19668 26154 44547 68791 92414 101898 97000 76094 62995 51144 32444
8398 32444 13454 8156 79 -9242 -4965 10204 11502 7891 2958 -5091 -7298 -14273 -21103 -16884
8384 -16884 -14208 -20045 -23239 -21923 -16731 -13102 -1695 1802 3506 -3051 -5396 -7202 -11280 -13296
8370 -13296 -9654 -10732 -22207 -22255 -11858 -7777 -14145 -19273 -18496 -15449 -10154 -10499 -3522 -10206 -10074
8355 -10074 -10769 -14397 -17127 -24458 -24134 -16294 -18749 -20694 -23312 -27814 -31984 -29696 -26038 -19188 -23884
8340 -23884 -26184 -13245 -7230 -19922 -25650 -20112 -19750 -21100 -25271 -30202 -34936 -36246 -34834 -30057
8326 -30057 -33459 -36364 -33518 -18049 -12642 -20630 -32897 -37272 -34152 -33909 -24806 -12630 -5295 -7657
8312 -7657 -3693 -4884 -10966 -3476 3937 -813 -4940 -3763 -1900 230 -8523 -7876 -628 -1530 -1868 -10417
8296 -10417 -15887 -11441 -11756 -13784 -13441 -8906 -10239 -8327 -7634 -12287 -13789 -5920 -13123 -20987 -16192
8281 -16192 -5873 -5590 -10029 -14593 -16127 -25380 -27418 -16982 -7166 -17997 -23026 -17799 -13489 -11425
8267 -11425 -22393 -28253 -28120 -16096 -12711 -12168 -11429 -7752 -10538 -17248 -14689 -20014 -20234 -17136 -16719
8252 -16719 -14971 -22480 -26103 -26672 -22517 -15974 -12353 -18013 -18261 -18354 -24615 -25415 -26896 -37082 -38117 -24515
8236 -24515 -15634 -11099 -9781 -19296 -28010 -34486 -37922 -35446 -34956 -27169 -18962 -14360 -4203 1556 -5865
8221 -5865 -12086 -16725 -20363 -20666 -10959 -11034 -9554 -4853 -860 6037 7001 -1731 -10023 -11891 -14607 -13814
8205 -13814 -11654 -10725 -14332 -3942 -5279 -474 2985 -3384 -2554 1076 3244 -7387 -10350 -20271 -23238
8190 -23238 -20962 -17702 -12158 -10359 -3206 -7365 -17249 -8481 -1786 -7896 -11736 -12027 -11934 -8796 -7871 -9538
8174 -9538 -18340 -23733 -24672 -20567 -14724 -9947 -4366 184 -2300 -2474 14 -7800 -5852 -12640 -13075 -20468
8158 -20468 -23391 -17993 -7716 -9867 -16177 -8839 -6588 -11914 -10498 -4240 4212 5966 4805 8491
8144 8491 10333 2133 -168 9919 15144 9344 1787 -2968 1857 7830 9893 4819 -106 3091 969
8129 969 1589 7240 -1991 -13682 -9566 3445 14222 7711 -7006 -8139 -4673 13369 17086 15273
8115 15273 13769 7050 9810 20385 23060 14613 6522 5877 7676 22682 15592 8209 10960 6745
8101 6745 3283 -2329 660 12131 9785 -2316 -2201 -6266 -13747 -18614 -11919 -9441 -9855 -619 1487
8086 1487 -1767 -576 -3788 -231 2906 14324 28288 34462 33645 37676 43170 43713 37857 30571 16319
8071 16319 45 -3257 1362 3153 308 -1829 -8330 -2381 6045 2958 5458 3410 -3529 -17
8057 -17 6189 6716 9612 10528 15194 11836 2040 -4162 -9063 -15519 -8766 2664 9471 13326 9252 5088
8041 5088 5325 -3581 -7189 4252 11064 2002 -749 -4974 -5897 -5201 -3114 3035 -235 -6926 -5657
8026 -5657 -19865 -27205 -14612 -4958 -77 4281 11396 15017 6394 3955 -7642 -21943 -28690 -24733
8012 -24733 -19068 -21349 -22317 -13828 -13171 -12567 -10364 -8023 -6812 -5173 -9328 -16146 -10042 -10981 -4578 5260
7996 5260 16868 14418 11179 2468 -5646 -4007 -4712 -16032 -15425 -12071 -2133 -2399 -2473 5528 -5566
7981 -5566 4583 10165 4298 -3487 -1284 -7690 -13335 -15740 -15230 -16078 -21763 -20805 -15556 -14385 676
7966 676 -1203 -5133 -12179 -10930 -4948 -4727 -4073 -3690 -7209 -7186 -1164 -11204 -11188 -16032 -15004 -6242 -7114
7949 -7114 -11150 -5033 3031 6806 10058 6475 9400 7869 2687 -14173 -13968 -9193 -7033 -6779 -13448
7934 -13448 -15578 -15375 -14739 -10769 -2647 -3827 -8775 -13125 -17801 -12980 -17059 -17914 -16378 -25257 -24447 -16693
7918 -16693 -11688 -17524 -18366 -8669 -3975 1556 8506 4740 -9904 -19815 -15299 -10522 -4564 -11459 -12648
7903 -12648 -9734 -24317 -24824 -18149 -19107 -14574 -8865 -11766 -16337 -23409 -28168 -33038 -25621 -16923 -16879
7888 -16879 -14019 -10432 -18466 -15908 -23287 -23529 -21922 -29536 -38704 -33646 -34028 -32497 -27231 -25552 -17661
7873 -17661 3287 12199 21519 24549 20024 19467 12607 5934 -8963 -15307 -11968 -8959 -9002 -18168 -13202
7858 -13202 -13471 -20027 -16591 -6026 -3206 -5608 -8858 -6387 -537 8614 14383 10346 10882 673 -17863
7843 -17863 -20266 -21071 -22954 -32061 -29975 -31387 -37772 -39039 -32453 -14588 -772 12696 24826 45809
7829 45809 53931 50929 53334 48310 41322 16225 -9143 -29005 -37659 -48020 -39651 -31450 -25549 -18272
7815 -18272 -11962 -22757 -27908 -19412 -12546 -5268 6884 13531 11397 -2073 -14377 -21437 -16397 -10365
7801 -10365 -9569 -23204 -35050 -46633 -36414 -26729 -18116 -14550 -18099 -12532 -1323 4167 3725 1977
7787 1977 7015 7983 -1826 3218 -775 -10033 -24615 -31174 -33001 -35939 -31712 -27518 -18232 -24379 -28659
7772 -28659 -29378 -28893 -23726 -17245 -21629 -33497 -27474 -13330 -8732 -3909 -2544 -12843 -17259 -29075
7758 -29075 -39848 -49444 -43976 -27825 -16153 -18045 -13087 -8177 -2729 -5588 -14733 -13229 -15678 -10276
7744 -10276 -4173 -655 -9647 -11455 -15915 -23742 -25683 -14017 -18886 -28973 -28271 -28071 -30894 -27041 -21076
7729 -21076 -22995 -22284 -17038 -18946 -20921 -22222 -25949 -24679 -19057 -16565 -10984 -1332 1865 -2155 -6796
7714 -6796 -10404 -9660 -4415 -10860 -10109 -8814 -1599 -6170 -12815 -21264 -27132 -31945 -28733 -16037 -2510
7699 -2510 -10517 -11119 -8011 -9464 -16067 -16856 -18648 -17979 -13857 -8870 -7171 -13600 -9125 -18778 -26499 -22493
7683 -22493 -23518 -18967 -23004 -26144 -30233 -32463 -31019 -23030 -12463 -9152 -16195 -19323 -9291 840
7669 840 -9001 -10333 -12645 -21369 -16065 -16889 -13921 -15649 -18508 -14509 -12117 -11000 -4664 -5446 -6969 -11773
7653 -11773 -19692 -31404 -32848 -23582 -23585 -21298 -13414 -1916 -7432 -16013 -22109 -15186 -22610 -31376 -23333
7638 -23333 -12309 -1486 1160 -11663 -31428 -27485 -15011 -6947 -8056 -9165 -9897 -18601 -20458 -11405
7624 -11405 -1812 -1161 4371 1670 2768 56 -1718 -6080 -17321 -15918 -7607 -1684 -9213 -21519
7610 -21519 -24191 -22851 -18765 -10711 -17620 -32861 -26565 -25016 -22288 -18102 -16599 -19674 -14919 -14764 -18013
7595 -18013 -20522 -24840 -19510 -10587 -5740 -17851 -20397 -21339 -8847 -1987 -2617 -6223 -2861 -1857 -311
7580 -311 -2478 -8678 -18542 -15488 -12766 -15117 -24172 -21553 -24321 -20629 -16813 -16673 -20948 -16552 -13514
7565 -13514 -21278 -16714 -11208 -6396 -5138 -14131 -20016 -16427 -21306 -22006 -20968 -31200 -39274 -35509 -19313
7550 -19313 -12922 -6092 -5580 -7439 -8918 -20055 -24222 -15171 -13716 -23754 -22088 -7786 -4932 -14273
7536 -14273 -9242 -3248 -8722 -13394 -15019 -18193 -21318 -17683 -11954 -12843 -13503 -15465 -15016 -3932 -2592
7521 -2592 -12239 -17388 -10684 -4831 -15042 -11213 -4096 6047 4933 -5141 -14003 -9894 -6409 -9875
7507 -9875 -21427 -25560 -22274 -18344 -21782 -20555 -17934 -17134 -13060 -16642 -12715 -6891 -7027 -4762 -7559
7492 -7559 -7923 -7073 -4039 -6087 -3548 -6877 -8863 -15105 -21235 -20551 -21648 -18404 -24873 -31382 -18936
7477 -18936 -10638 -5244 -11317 -7652 -8531 -13286 -14922 -10580 -1048 2463 -5525 -15441 -27362 -21483 -12926
7462 -12926 -7658 -8754 -10599 -11286 -17682 -13238 -1895 2506 8661 -1386 -14048 -12778 -5801 -8753
7448 -8753 -4871 -6550 -1833 -7820 -16819 -21745 -13312 -6186 -11487 -14834 -17503 -15780 -10988 -10282 -6627
7433 -6627 -1421 -1734 -10200 -12592 -28504 -32978 -21451 -2698 502 -2526 -12610 -10666 -4410 722
7419 722 -3528 -15989 -12015 -4839 -861 1326 -5716 -387 7406 9598 6819 11203 3147 -4238 -2024
7404 -2024 1415 1866 5461 -4762 -11038 -15225 -10348 -9563 -5770 -7787 -5530 -5370 -11982 -17277 -10513
7389 -10513 -5708 -9843 -12447 -9935 -11010 -22226 -33054 -32532 -18964 -16340 -20307 -16482 -15977 -13617
7375 -13617 -8546 -7761 -8303 -14131 -10584 -18 6472 1296 -6641 -6304 -9068 -7156 -7310 -16661 -24697
7360 -24697 -21498 -18548 -15154 -23247 -10852 365 7306 -5408 -17821 -7670 -10537 -21541 -26267
7347 -26267 -11320 -2615 -15289 -5803 -5677 -22477 -25183 -30202 -30269 -31593 -26299 -15890 -13985 -15133
7333 -15133 -9494 -10214 -23098 -23105 -21395 -30857 -25464 -19801 -18417 -19645 -20797 -23627 -21409 -10230 -6047
7318 -6047 -8352 -16072 -18984 -12918 -10357 -10428 -16870 -7364 -2832 -3925 -19003 -23963 -20006 -18744 -15064
7303 -15064 -4135 -884 -804 -3738 -14075 -16835 -23967 -25426 -20790 -11863 -17494 -24969 -26056 -32544 -21914
7288 -21914 -17371 -20062 -18222 -21504 -19558 -11346 -7426 -5314 -3232 -1269 2972 4423 -3022 -7599 -7804
7273 -7804 -11118 -18054 -15381 860 5746 -5303 -12308 -13223 -15856 -19081 -15528 -5822 -3811 -6091 -8236
7258 -8236 -10829 -10995 -8524 -9874 -6170 -11240 -17968 -13467 -8204 -11678 -19283 -19778 -18862 -15259 -11446 -4912
7242 -4912 -2953 -3411 -7425 -13945 -5721 -3867 -3319 -4894 -7970 -8877 -13261 -17048 -1447 -2234 -9918 -11554
7226 -11554 -15983 -19388 -18349 -8488 4136 6841 8079 1742 -1016 7200 1966 -7598 -1693 -4390
7212 -4390 -3246 -4629 -4409 -9516 295 -7099 -12465 -9493 -8387 -6419 6150 4317 -3275 -8040 -15945
7197 -15945 -15940 -15588 -17055 -11331 -10375 -12897 -9797 -1577 651 6916 -2205 -9189 -6378 709 4870 7563
7181 7563 8112 19102 27426 29896 20020 5672 -2873 -9849 8746 11882 899 -3083 -88 1248
7167 1248 2706 -6857 -8441 2143 -2096 -2067 464 -6839 -16956 -11474 -9672 -7385 -4528 -10009 -10234
7152 -10234 -13783 -8134 6549 14448 11242 -5544 -8166 -749 7729 16462 13429 -2978 -8964 884
7138 884 -1676 -2093 3302 7444 4031 -11730 -16271 -9061 -6282 -2615 -2599 -5730 -9547 -11108 -13836 -16032
7122 -16032 -21959 -21968 -17094 -12310 -19277 -14825 -7934 -7004 -6329 -6057 -9092 -4835 -9597 -10421 -2285 -4043
7106 -4043 -13813 -19382 -19345 -18553 -6991 -6066 -12957 -11785 -11790 -12871 -5913 -2368 -2990 -582 3500 -4683 -10844
7089 -10844 -6032 -2607 -6774 -1581 18669 8707 -2137 -9763 -16406 -19845 -16396 -9814 -332 -3616
7075 -3616 -9777 -13810 -6789 -5399 -13795 -15710 -15476 -15326 -15950 -13831 -23710 -31214 -19822 -19254 -22597 -25780
7059 -25780 -34958 -29028 -21768 -28423 -35914 -35263 -39815 -42628 -27278 -6944 1622 12651 6697 -1762
7045 -1762 6235 10491 3310 -1010 1023 -5863 -5684 -7583 -8639 -12019 -18760 -15188 -13560 -7314 -11210
7030 -11210 -13990 -16913 -8728 -6382 -5970 -2267 -3679 -6932 -9964 -9278 75 4566 -9863 -17562 -18060
7015 -18060 -13932 -12412 -4884 681 -6774 -8915 -6685 -10484 -9484 720 7436 7613 -749 -3406 -9602
7000 -9602 -19146 -11931 -9419 -7275 -340 -3556 -11060 -10104 -3232 -1178 -4912 -5383 -7527 -12627 -21025
6985 -21025 -18139 -3977 -4124 -12431 -7750 583 7471 9872 13119 12753 19292 14094 2467 2926 6357
6970 6357 139 343 -3066 -2480 -4905 -3227 -3967 -7542 -1574 9468 9347 -852 -7353 -8800 -2763
6955 -2763 -214 2102 19123 16629 3671 -4672 -12559 -19095 -15443 -9329 -5524 1702 -3985 -9432
6941 -9432 -15057 -20706 -19950 -10103 -3353 4414 9615 2825 -4238 -11242 -1004 8441 12580 12543 9888
6926 9888 -7217 -16774 -15519 -13789 -16610 -22345 -13126 -10693 -6019 -5652 2265 3979 -1957 -8952 -6428
6911 -6428 -2774 -264 6863 7459 1936 -4690 -8890 -14179 -16464 -5786 -2905 -7170 -11374 -3935 -4436
6896 -4436 -1946 5264 -4070 -8022 -18844 -26947 -28274 -19728 -11666 -7991 -7840 -7749 -8791 -8784 -32 4014
6880 4014 -651 -3846 2778 -8290 -9086 -10073 -518 -5503 -4749 3456 9814 7502 -3140 -1669 -2179
6865 -2179 -9029 -16250 -7256 -9903 -20973 -9639 -2510 -1181 -503 -4106 1201 9109 9598 9754 12125
6850 12125 14006 13801 12185 14731 12522 16766 12619 14369 10540 15893 25327 30947 44702 48255 65229
6835 65229 93666 119694 138159 146087 136524 128748 120467 114686 110039 112272 109720 108123 113369 129557
6821 129557 146459 170320 219331 279595 344452 436082 575424 792190 1135827 1690009 2465472
6810 2465472 3101311 3175114 2889072 2465809 1921651 1361252 928429 656554 491387 392690
6800 392690 317465 258877 215178 190794 165730 143463 138687 128404 127248 121320 114512 111483 114972
6787 114972 117324 122309 124736 115239 93081 70970 53479 41463 40954 32302 23671 19901 23526 25246
6773 25246 8285 -3352 3773 15064 19419 18999 18576 22543 25803 33486 30247 25287 22233 27230
6759 27230 18903 4994 -1344 8426 3537 428 368 1980 4511 2663 1305 2456 11188 10235 5341
6744 5341 4797 2137 -2772 -8720 -2664 2897 -4595 1792 14369 5693 -5273 -3973 9704 4974
6730 4974 -672 8407 18835 16330 12339 12330 6870 -8230 -7061 -2488 3277 2825 1485 -8536 -4105
6715 -4105 3699 -1257 -816 -2784 1731 10762 13722 12592 3819 1696 -2741 -10455 -12872 -8838 -1473
6700 -1473 -9652 -5294 -10032 -22920 -27171 -23227 -11288 -5824 -11523 -19650 -20664 -10857 -8142 -6223
6686 -6223 -13816 -12631 -7451 -5778 -2903 67 -7925 -19239 -17028 -8512 -6246 -8058 754 -261 6007
6671 6007 11384 8482 4807 -4299 -4202 -4819 -8055 -11662 -13784 -11549 -6104 1525 8235 5554 -5035
6656 -5035 -12867 -6238 874 6327 13241 12811 -133 -2989 -5901 -107 -9345 -21228 -15566 -9053 2554
6641 2554 4319 -5397 -10069 -8308 -10978 -11597 -5431 6438 2554 -5300 -1811 2874 2874 -2664 -1565 -11412
6625 -11412 -12433 -3327 -12638 -17940 -21742 -18133 -17372 -10858 -4950 1994 -6319 -14895 -6878 -4263 -4671
6610 -4671 -8995 -11665 -15935 -13704 -16857 -18042 -15794 -6811 -5845 -7786 -11341 -5009 9458 -1395 -9715
6595 -9715 -10915 -11994 -17877 -16076 -13348 -17064 -12227 -18000 -23368 -17429 -12723 -12747 -16423 -19201 -5579
6580 -5579 1093 -4043 -10674 -16513 -18075 -7783 654 -3920 -6371 -12185 -17025 -14433 -12172 -1641
6566 -1641 3875 -5190 -16751 -25576 -21585 -16401 -7736 -3321 -6184 -14669 -16280 -28037 -23035 -21942
6552 -21942 -11357 -4453 -5400 -14480 -12675 -9886 -12125 -11163 -14957 -18755 -17337 -11205 -13645 -20161 -15564
6537 -15564 -11361 -4394 -567 -5708 -8660 -17247 -16736 -4876 3736 11572 199 -8973 -19718 -13405
6523 -13405 -8639 -4115 8861 11424 8331 7092 3568 2475 2847 -6641 -17550 -12427 -4599 -4223 -8134
6508 -8134 -13351 -13548 -16332 -12687 -9613 -14149 -20077 -22289 -21947 -20454 -21974 -17830 -16956 -22771 -13960 -15621
6492 -15621 -9914 -188 -11031 -18444 -25148 -23915 -9843 -8768 -17778 -15344 -7348 -7703 1037 17004
6478 17004 14609 6271 137 4718 7042 -14 -3787 -513 5399 10977 5140 -712 -1125 -2309 7915
6463 7915 16756 8511 130 -2916 -9618 -13435 -5495 -17490 -20339 -20989 -19320 -14250 -8299 -2956 5098
6448 5098 7392 13646 12189 18766 9618 -2582 -7439 -14763 -9108 -4731 8388 14752 19800 18060
6434 18060 8930 17617 22225 14825 12947 3435 -11873 -12921 -11665 -5069 6006 5774 6706 2508 2514
6419 2514 1405 -11036 -11481 -4217 29 -5076 1105 6882 197 -8847 -6970 -1835 -5342 -10790 -13286
6404 -13286 -15059 -18653 -14682 -6201 -2052 -6948 -19937 -19237 -9710 -8217 -18707 -12800 -10884 -6359
6390 -6359 -444 3228 -3623 -15922 -15008 -9351 -14299 -12109 -17548 -20377 -846 1127 -10598 -12558
6376 -12558 -13345 -15062 -10907 -3667 -4646 -6353 -6882 -17363 -20768 -17513 -20103 -22484 -17326 -15848 -6498
6361 -6498 -7132 -5245 -2290 -3224 -12861 -15674 -15721 -8932 -6769 -6868 -6153 -18844 -25562 -27419 -26012 -16650
6345 -16650 -13215 -10493 -11909 -8592 -5629 -1818 -15303 -16257 -16878 -17101 -5050 593 -2233 -870 1928
6330 1928 -4752 -4871 2773 13552 10175 9373 4820 -5792 -9050 -7318 -10672 -20011 -13175 -1843 12668
6315 12668 4547 -6275 1618 4676 5729 4487 -4913 -9624 -12139 -16976 -11112 -6134 618 4217
6301 4217 9709 8825 5843 -1515 -9962 -8233 -2753 -402 -6188 -8811 -5382 -5407 -5718 -1787 678 10007
6285 10007 17128 11725 3968 9993 12898 11389 4767 9943 2188 -3910 -5139 -7306 -9811 -3795 1936
6270 1936 9564 15719 9910 255 -6827 -1858 -3624 -3204 6562 11396 -141 -18499 -24294 -13050
6256 -13050 -5980 -9384 -3972 13771 13466 -563 -7168 -1378 2056 -9376 -8764 3748 2886 -2154
6242 -2154 -351 4648 11571 7496 -4529 -2710 3015 -4800 -3861 1121 6049 442 -5667 -7532 -9953
6227 -9953 -6520 -4072 1559 2652 1519 4001 9744 7522 -544 -5058 -7829 -1837 -650 -9148 -1109
6212 -1109 8209 12597 13126 5181 -5523 -7975 2996 11827 3546 -2678 -3047 -9155 -2092 -1565 -6808
6197 -6808 -20161 -18868 -3567 6626 6867 -2669 -8878 -10721 -19586 -13291 -9324 -1520 5846 9242
6183 9242 13628 16089 9845 -1088 -13469 -11604 -470 137 -5051 242 1254 -2286 1840 4274
6169 4274 4531 -4300 -10691 -10430 -10108 -11256 -14441 -9147 -5464 -2279 3663 10495 8226 9688 18535 20489
6153 20489 16054 -3119 -6531 -2332 -2237 -6478 -5877 -8019 -13681 -12828 1235 17426 11058 6957 -2682
6138 -2682 -8733 -8456 -3596 -12822 -12561 -10163 -12835 1997 10904 1636 -1383 -7430 288 3161 -10303
6123 -10303 -16959 -23144 -17676 -9246 -5781 874 106 -227 234 -1119 -535 -1863 -7758 -20979 -28050
6108 -28050 -13157 -8497 -9304 -3527 -3390 -7076 -9211 -7386 -7737 119 -175 -3332 -2647 6283 7917 5899
6092 5899 -904 4819 13940 8516 6401 3093 2971 10609 12199 5397 2187 -7449 -11021 -8852 -8565
6077 -8565 -5155 -5920 -12305 -19002 -8104 -2511 -12581 -13186 -4675 2738 5062 2626 -1004 -11876 -17138
6062 -17138 -14070 932 1542 770 6694 11150 8342 5035 -4224 -5520 2682 96 -2451 4025 6724
6047 6724 4370 1547 3737 -3358 -9512 -7446 -13874 -11957 -7923 -7403 -5118 -8971 -17956 -19180 -23114
6032 -23114 -13872 -8310 -11288 -13957 -13704 -17302 -8167 3652 18208 15497 -2677 -16167 -10748 -7788
6018 -7788 -6138 -8643 -6359 -1667 -6162 -5767 -11145 -21112 -20059 -6615 2503 -3580 -4965 77 5382
6003 5382 9210 9122 7828 2741 -6852 -1219 8533 12668 13109 8733 11822 16607 15348 14278 8160 2153
5987 2153 -2470 -6710 -2883 2096 2924 3850 -3185 -1018 3434 6953 12379 8233 10223 8200 -1561
5972 -1561 -7102 -12589 -17755 -13931 -2504 2118 -2019 -8529 -15387 -14127 -8281 1823 17406 14584
5958 14584 16387 9412 8408 10152 8410 -175 -5135 -10494 -13743 -5560 -999 -6706 -9044 759 5557
5943 5557 469 10626 16243 16506 9701 6448 2985 2675 -1400 202 8426 14139 9164 5174 3162
5928 3162 -6083 -13654 -14575 -20715 -10893 -2390 -6070 -2480 27 -7516 -14949 -9602 -5421 -4850 -6116
5913 -6116 -11485 -12206 -7412 -4745 1852 4487 -3598 -12099 -9091 -1084 6401 9728 11136 4133 -5270
5898 -5270 -9638 -24398 -21183 -15858 -12043 -9944 -8281 -12044 -16861 -20944 -15688 -10110 -1290 -1126 -3209
5883 -3209 1051 -5472 -10659 -7814 2699 4088 6045 -6373 -10063 6798 8738 4198 2184 -2162
5869 -2162 -3441 -684 -1634 633 -4098 -11643 -15091 -7486 6936 17711 13442 -298 -7970 -19427
5855 -19427 -18238 -11617 -9807 -23834 -37789 -37852 -20676 -9520 -3955 801 1484 6703 2853 -2625
5841 -2625 6357 2602 -4485 -29 3537 3884 1687 -12405 -20565 -19093 -10683 -9265 -7653 -5147 8868
5826 8868 13011 15458 8967 6329 6510 15071 16596 13864 11662 -5044 -12414 -14739 -15951 -14751 -5753
5811 -5753 -8085 -7844 -10166 -6609 -7236 -5421 2942 3702 -4195 -9664 -9839 8486 19938 30370 34983
5796 34983 33288 26679 16323 14210 7799 -10417 -17728 -8585 9958 17696 17978 16552 16465 9244 15875
5781 15875 16490 11206 -1349 -5505 -507 -192 1474 3553 8510 1899 -13519 -7180 -4105 -4315 1698
5766 1698 -7402 -10453 -11142 -8822 -12434 -16905 -18218 -16439 -13281 -7525 -7119 -11029 -976 3366 5099
5751 5099 -812 -525 6449 22354 23078 24943 17030 6231 5248 5180 9643 -706 -6024 2979 5626
5736 5626 601 -7561 -11998 -9028 1732 7245 9244 5580 7202 -7479 -16434 -12143 876 -2224
5722 -2224 -6117 -3251 -9957 -14379 3625 8177 3791 -1553 -805 1886 -884 -3058 -3369 -8166 -8123 -2377
5706 -2377 1745 4274 2891 -9777 -13030 -10829 -7055 -6426 -324 9611 -20 -1811 693 2808 10404
5691 10404 -4248 -2514 3317 5335 1255 -996 -2211 1531 13679 12266 4866 1015 2787 9290
5677 9290 -7319 -7967 -7665 -3705 2559 1808 4178 1686 -5319 520 3460 1940 -188 -3339 -2324
5662 -2324 -13801 -21012 -13353 -19717 -9687 438 -7507 -20466 -20386 -10623 -15499 -21661 -23144 -15450
5648 -15450 -9709 -4564 5343 13566 10433 5298 10931 12439 5595 6 -6435 -7414 2457 9018 4423
5633 4423 3175 10088 13893 9916 -2080 -10154 -10896 -10211 1381 7126 3283 -36 -492 10154 21096
5618 21096 19691 13254 10149 12336 7907 11362 6567 1261 7345 9675 12301 18639 20232 12990 -1324
5603 -1324 -2429 -2021 -6325 -4593 -141 4023 -3569 -8813 -10555 -997 12694 14709 3164 -9980
5589 -9980 -13745 -8951 -7208 -4592 -5175 3891 9969 8074 6988 -5051 -12796 -12097 -14272 -6938 -6499
5574 -6499 -7422 -7864 281 -2625 -6502 -1224 -2418 7340 13046 9362 3627 5467 -1863 1206 1635 10364
5558 10364 -185 -7980 -616 15016 19440 14349 5432 -3076 -996 2907 -47 -5228 -2420 412
5544 412 -11326 -12902 -10961 -12706 -9939 -11785 -11606 -13783 -11569 -7356 6282 7651 -5722 -14527 -18806
5529 -18806 -14493 -19324 -5652 6649 9818 988 -769 -1594 -8255 -1866 10208 6105 -1847 -2988
5515 -2988 -17198 -12277 8490 -2445 -5749 -4489 -2802 -11751 -19985 -19661 5414 21287 22039 19678
5501 19678 11573 3316 -2985 -6278 -2395 -6843 -10784 -7882 -10259 -14486 -13787 -2628 2805 8516 560
5486 560 1339 -2205 4045 7314 2784 1140 4907 9871 8068 -592 -3140 1865 3585 298 26 -4373
5470 -4373 -2546 -6146 -2623 -1546 -3948 -814 -1447 100 241 1624 3902 3850 6108 4857 2252 902
5454 902 1606 2960 -1567 5548 -2136 -5243 852 -1506 -2528 -2984 -2392 -201 1431 3009 9960 15038
5438 15038 6500 4336 2458 -3303 -7304 -1764 -5028 -10462 -13169 -17375 -25427 -20208 -15267 -13501 -2870
5423 -2870 -9 1742 2075 1407 13159 11455 4273 6675 896 -7249 -4572 437 -3632 -6902 -7271
5408 -7271 -1989 1680 954 -2113 -11725 -13988 -6330 -12446 -12166 -6919 14 6494 7928 1259 2603
5393 2603 4626 277 -9102 -5078 -7794 -7256 -7424 -12687 -11357 -8506 -7998 -6264 -8863 -4156 9600
5378 9600 -3849 -11416 -3322 8752 9767 4319 7292 5530 13217 25377 15621 -919 -9985 -4046
5364 -4046 -3543 -4581 -3390 -4725 -7715 623 -2790 2122 -4661 -19799 -22182 -11196 -4197 -8091 -11430
5349 -11430 -13834 -9467 15 393 -9097 -5093 -7914 -15264 -9354 -1366 2511 3765 7927 10882 8986
5334 8986 3899 -2679 -7708 -5353 -8567 -3320 -5337 -5586 -2295 -8880 -6945 5019 9277 10937 9463
5319 9463 9346 5585 2556 -3401 -18813 -18385 -16306 -6351 -11134 -9287 7709 5292 713 7134 -1141
5304 -1141 -2682 -2219 2666 -1219 41 8431 3948 4457 -1800 -2018 2810 2885 755 -6444 -6345 -10558 -6761
5287 -6761 -4454 81 -6719 -9164 -3874 -7452 -14995 -16681 -21788 -28277 -27925 -19940 -11923 -13097 -7818
5272 -7818 6003 2379 895 6520 13707 16095 25021 11386 4549 -2075 1232 3062 15527 21751
5258 21751 18376 14105 9918 14740 9778 4253 7878 6162 5280 5951 -1548 2884 7753 -451 -10416
5243 -10416 -1263 -2227 -3443 -9474 -8874 145 11446 9064 6728 9566 4388 2092 -1291 -4155 -7379
5228 -7379 -3552 -20 7490 2223 -3012 -3786 7481 7658 -1921 -10869 -8532 -14834 -10892 -12717 -14268
5213 -14268 -14550 -21555 -12290 -8637 -5431 -5253 -9397 -6027 4343 13465 7780 -291 135 -2537 486
5198 486 605 12695 13102 14269 5072 4015 -2232 -9445 -8656 -11560 -16737 -17267 -13778 -10304 -6054 -2943
5182 -2943 -3284 5031 9438 11672 15692 6802 4345 8995 3514 -943 156 62 1388 -7956 -9514 -10073
5166 -10073 -204 13414 9354 11452 11534 -1014 -9425 178 11070 13319 12226 13346 12486 10488 2447
5151 2447 -11677 -6642 1347 -5161 -3286 1813 -1237 1956 8322 5366 1026 -6437 -14985 -13653 -15258
5136 -15258 -22039 -15616 -2789 701 358 -4364 579 10830 7242 -4529 -16541 -11782 -2243 -3814
5122 -3814 958 2544 12568 20203 15524 14186 8936 10325 6279 -620 -6173 -5824 -5889 -14606 -18365
5107 -18365 -18138 -9659 -9385 -16032 -8116 5615 474 -8834 -6341 -3788 -8412 -3713 -3165 -8340 -4276
5092 -4276 6988 10535 7240 4623 -3836 -2403 5085 4635 6958 3198 -7149 -3274 -6641 -4954 -6851
5077 -6851 1614 9188 8706 2285 -4690 -2311 3175 -6781 -13714 -11261 -4512 -1714 -2226 -2425 -13084
5062 -13084 -20142 -7660 -3025 4985 17063 13183 4102 460 5378 12319 6891 -4109 1108 8497
5048 8497 4412 -8496 -9347 -9023 375 2457 6715 6261 6307 4584 10567 10284 3575 -5244 144 2566
5032 2566 4351 10055 21003 20301 18120 20347 17733 1414 -741 357 -5176 -2111 -8160 -12729 -7808
5017 -7808 -8441 -3572 6391 3854 -1018 3856 1586 387 1533 12783 11682 10049 8231 8001 5179
5002 5179 -10527 -7984 144 1431 4002 10243 13351 7783 4179 1936 9859 5614 7259 8166 12963
4987 12963 12379 9571 6375 8534 5362 3062 10041 6912 1777 2778 493 -3048 -1701 504 5679
4972 5679 1295 -8524 -21871 -18277 -16608 -11393 4946 5217 6662 1170 -2873 4249 3829 8023 -609
4957 -609 -9351 -7745 -5754 -6766 -11809 -5153 -2854 -6293 -3790 1284 968 2682 12005 10665 8006
4942 8006 3101 8588 15939 17124 9182 11833 1370 -6095 -8166 -1489 5163 8513 4239 7707 8447
4927 8447 927 -9473 -11291 -2890 -1056 -10611 -8953 -5739 -4344 -1690 6392 7125 -550 -8473 -10774
4912 -10774 -5751 -613 5329 9453 1540 -8333 -5678 -3073 -2334 1493 -2775 -1937 2346 5957 123
4897 123 -3849 -4132 -10116 -7999 1734 10455 9337 7413 6039 -3828 -10899 -11188 -7321 10953 13949
4882 13949 19941 24538 11567 136 -2836 -2603 4138 -695 -10674 -7269 4234 9791 2830 -2351
4868 -2351 -6825 808 3637 6340 7725 1502 -4086 -8582 -17425 -18065 -19341 -15085 -14176 -7419 -1908
4853 -1908 -40 -2986 -849 7099 12680 11191 13089 10415 11139 7746 -3028 -2252 3310 4096 721
4838 721 1929 11329 12418 8220 3073 1372 610 1307 5096 9072 7291 2415 -2239 -11347 -20912 -18906
4822 -18906 -10591 583 3637 -2056 -5203 -4051 6275 6142 3501 12615 20773 18973 4456 3459
4808 3459 1088 -67 -1813 -13937 -10922 -3260 3021 5294 4232 1701 3126 2921 -4529 -6916 -3408
4793 -3408 -5936 -11990 2981 16254 17831 16026 11767 15985 22571 17587 3866 6347 6580 2535
4779 2535 3236 8186 13538 19532 24119 22213 10791 7482 13799 11863 7035 1503 -4694 5929 4089
4764 4089 4465 -3607 -7439 -1717 1824 2518 -208 4955 12127 16941 17650 14832 12253 -5527 -16035
4749 -16035 -16143 -13931 -16231 -3876 9607 8907 -3347 -5645 3209 20192 25319 24592 26984 13153
4735 13153 5500 8924 20450 20419 18168 16502 17878 14515 11529 1099 857 -172 -7914 -1986 -282
4720 -282 842 -3080 -1541 -5598 -5325 3301 3694 -4759 -5240 -3896 1249 -2988 -4508 8543 10305 3485
4704 3485 556 -3587 4973 13063 17910 21247 22103 14390 13642 22318 27909 28565 21847 16179 11883 -1450
4688 -1450 -11431 -4364 1464 5654 3915 -2104 6093 6012 -5209 1071 -2795 -8616 -7832 127 3538
4673 3538 -1619 -3758 -12378 -11998 -5217 -8561 -3133 3144 8791 12622 6066 -1534 2622 4259 11177
4658 11177 16603 17876 3186 -2933 -842 -10795 -20546 -17030 -8706 -19320 -12903 -14705 -18203 -8839
4644 -8839 444 -4274 -3724 -2009 6506 6390 -3133 4321 -3004 -11078 -12003 1631 12049 16379 16850
4629 16850 15735 15908 10070 1051 -2912 4333 11375 10155 10591 7603 9002 17333 23055 8039 -3665
4614 -3665 -1320 -2359 -5652 -10203 -6136 -9681 -13493 -12202 -5961 -1812 1052 -2904 -8780 -9074 -6612
4599 -6612 -7354 -8657 -7658 -9453 -5219 3603 12334 7038 18 -5570 -16764 -8365 -6290 1395 -854
4584 -854 965 8849 4570 5373 7461 2012 -1935 -6059 -2644 1266 2098 3404 7518 11403 7609 9429
4568 9429 11025 14240 14469 5147 2333 8899 11434 -6418 -6961 -2015 -3502 -9737 -8356 -1707 1797
4553 1797 -1715 3268 7939 1532 -532 -2552 3845 6392 -3634 -1783 -4584 298 4406 5193 5038
4538 5038 9264 -815 -56 1493 1891 4401 3067 162 6718 2090 -6711 -1718 2457 5621 4946
4523 4946 -4684 -1443 2661 2436 -257 -9949 -114 16509 7645 337 3203 8057 10815 2409 -1376
4508 -1376 -2243 -17437 -24649 -16443 -4172 -9994 -5865 -5299 -5170 -8545 -19424 -26380 -19484 -14955 -10417
4493 -10417 -10599 -13446 -7755 -6807 -5507 -8081 -4338 7931 12043 15165 8726 853 3671 -5330 1418
4478 1418 6514 3449 10613 12018 4850 897 -5469 -1747 -707 -2263 472 -2863 -3493 -2396 10818
4463 10818 16446 16585 26094 31421 29456 21247 20974 16832 14265 12565 5449 4922 8170 594 -94 3514
4447 3514 6337 7173 8929 4302 -1645 -7691 -13221 -21354 -29929 -31410 -26706 -25438 -25072 -15722 -14278
4432 -14278 -7917 -8537 -6114 5680 11115 7571 3143 343 -47 -2341 2540 -5173 -14152 -14131 -20705
4417 -20705 -27308 -28152 -16909 -14074 -12189 -6330 3566 14295 14219 9661 11913 11864 12249 11973 6808 7269
4401 7269 8590 12076 8170 2479 5122 5763 10357 14288 6240 3806 -982 -12011 -13253 -16275 -12047
4386 -12047 -13487 -10492 2804 8909 4593 -1049 9383 18585 15275 6848 7605 7818 -1029 -16757
4372 -16757 -15760 -1834 9175 21003 25414 30941 28575 19414 16945 19799 8430 -7249 -11126 -9888
4358 -9888 -9611 -8678 6903 13815 15408 13261 11462 12820 2611 4373 3371 828 -5295 -10208 -3695
4343 -3695 55 -8086 -6566 -11010 -6858 -2986 -4348 3603 2037 -12123 -16827 -8958 -8564 -801 2373
4328 2373 433 -10683 -9880 -6780 -2279 -5972 -1579 4739 10049 9788 237 -4420 -3901 -10111 2108
4313 2108 -5874 -10361 -3841 -11694 -9122 -143 494 -6327 -20865 -23296 -24701 -21271 -20929 -22366 -20313
4298 -20313 -18579 -14959 -10451 -19114 -14896 -3689 -2165 -5145 -7413 -6791 -7626 -13750 -13918 -3012 -978
4283 -978 1162 -7358 -7749 -3430 1039 9656 6923 2798 11559 14944 -961 -9738 -9718 -6359 -6725 -7704
4267 -7704 -5547 -2761 -2011 -5902 -5874 -233 1522 -1678 -1440 -2528 575 2459 2083 2805 8332 3147
4251 3147 -2480 1662 1130 -3255 -3392 -1280 -12768 -15017 -10969 -5220 -6411 -1965 -6572 -8825 -11101
4236 -11101 1224 12336 13686 9300 16230 10811 10960 5798 12732 6283 1821 -3307 3031 12166
4222 12166 13718 26191 25105 17385 3013 1275 3076 12346 8359 3926 7807 10941 12870 10653
4208 10653 18873 15317 6139 9794 8629 2925 -5649 -14749 -15636 -11175 -6791 -2928 -99 6758 -6293
4193 -6293 -6045 -902 -4019 -658 10047 10016 7625 3497 -1663 -5004 6299 10943 13256 12090 9423
4178 9423 5718 3624 4815 16691 23773 10383 -5896 3496 -3193 -7067 -8710 -4890 -2220 1792
4164 1792 1061 8102 7800 2716 1737 3539 11764 7314 5103 15080 13732 9872 -5241 -8858 -7208
4149 -7208 -6489 253 8981 -145 -9119 -15667 -18711 -16379 -17150 -11868 -3179 -1534 -3086 -5777 -4142
4134 -4142 7619 2582 -5859 -3894 -1125 1789 4110 15410 7450 4504 7833 1796 -3155 -410
4120 -410 7765 8064 5358 5035 6866 1410 -7272 218 6530 5075 2574 12872 16278 13271 11226
4105 11226 15998 20927 23834 22883 8203 6821 16934 15479 4241 -3988 -7249 -2755 5420 7374
4091 7374 603 -3603 -1415 9378 16401 17501 11657 14039 16655 16507 14338 2128 -956 -5745 -13195
4076 -13195 -12911 -9804 -524 8446 8799 2876 541 -6290 877 6417 14558 16073 7235 3185 4193
4061 4193 7969 5951 7539 5715 2623 7541 10526 5857 11159 13864 7846 1818 -2046 -8559 -6435
4046 -6435 -186 3623 8729 822 -8523 -9787 -9062 -1347 1456 -6602 -8498 -9214 1452 2464 2730
4031 2730 9229 -262 -3187 -3037 4566 6237 -5858 -9337 -8523 3568 -3990 -99 1351 1970 -11797
4016 -11797 -15067 -1555 6230 2351 4372 8970 13006 9273 554 4855 -3739 -1 1684 8078
4002 8078 9177 1506 3647 10053 10608 11097 12071 6458 -1120 -8207 -5114 1209 2575 11811 20739 16529
3986 16529 13413 16581 9641 5239 -6223 -3270 -5472 -11090 -11050 -4092 -21 -1559 -1695 -4652 -3253
3971 -3253 -1950 -6783 -3088 7837 10236 1560 86 -2560 -4102 -6818 5934 15112 15691 19759 21169
3956 21169 14899 17469 15448 20971 22814 14812 2750 -4055 7633 17267 11469 9643 7869 17454
3942 17454 12986 8653 16952 20502 22375 17350 18547 14309 -932 -17016 -11842 -9691 -11277 -1102
3928 -1102 3758 4764 -2301 -5347 8233 7474 7660 13567 7875 11958 26252 33863 35599 31713 17456
3913 17456 11573 3954 707 2407 -5905 -6335 -4035 3321 12578 19175 16220 6010 1978 2941 17623
3898 17623 19440 16392 16664 10520 6515 3313 6875 10774 12857 13046 6717 -15341 -24432 -10947 -4079
3883 -4079 -5603 -9829 -13751 -14260 -20633 -11488 -4186 9578 2083 1389 -7839 -4151 -6886 -10447 -22736
3868 -22736 -22227 -20146 -8240 -8803 -8062 4777 8868 4627 -5911 -14842 -15389 -2770 -1684 527 5013
3853 5013 1195 -6954 -12293 -7207 4154 2849 3901 4466 6191 7472 6542 1657 -4073 5478 3642
3838 3642 2711 2670 14623 24572 22809 10871 143 1765 -809 -13912 -15216 -3067 17577 18424
3824 18424 9915 4759 405 2932 3245 7397 15126 8564 5400 8369 5379 9277 11845 3914 4531
3809 4531 7495 10066 9516 13683 10337 6407 8149 12234 11216 -2157 -3555 -1644 535 -163 -3557
3794 -3557 12040 18946 14735 12755 5364 -10918 -20224 -15870 -19132 -20989 -8578 -4946 446 4789
3780 4789 14948 8422 -1808 -4172 3902 5020 4670 10892 19326 17443 9699 9941 17630 11721 1159
3765 1159 -15527 -29244 -32088 -27515 -10844 4011 7336 1385 -14487 -14201 -8264 -4719 1701 1806
3751 1806 -6915 -2647 9794 14096 19325 18937 13349 4157 -4798 -17198 -14615 -10243 1729 6624
3737 6624 5542 -2694 -5506 -11966 -13696 -9484 4063 11081 3193 -4589 -1897 -2456 3969 7859 3753
3722 3753 3285 8751 22862 25596 31763 36843 27467 11733 -280 -8234 -16768 -1140 17738 12686
3708 12686 3760 -1086 9246 7541 2975 4645 13902 18156 7102 7554 5441 8532 20486 30481
3694 30481 20346 11849 3194 1813 12768 17875 11440 8926 5007 10178 16435 22358 14200 12467
3680 12467 1723 1618 12383 11416 18607 15620 2764 -12089 -19793 -15513 -16145 -9109 3524 4910
3666 4910 -4745 -937 8579 4013 3088 -5464 1504 10818 3820 5639 6292 1239 2505 17669 29134
3651 29134 24123 25678 19003 10344 14203 16661 18974 18549 11740 4448 1742 -12729 -9337 -1982 761
3636 761 6010 3041 1326 6176 1674 -6424 1121 13397 15281 9559 1979 -7 1257 4276 7553
3621 7553 5297 6003 13512 8117 506 -586 -11444 -6229 -1443 3951 -2599 7898 14851 15305 18022
3606 18022 10583 5814 -570 -5127 3217 8714 6910 1168 -2276 -7232 -1370 -3986 -5364 4266 11424
3591 11424 17398 14298 5998 10299 17393 16036 9186 7713 7338 -783 5788 4597 9352 13953 16499
3576 16499 2338 -2153 -6990 -3375 9133 9236 3023 -2633 3347 2862 2620 5798 8952 3361 -4970
3561 -4970 -8620 -319 9365 10845 7852 -421 -12450 -13947 -6888 -131 18 3424 7955 7319 -1744
3546 -1744 -2758 -3626 -9117 -9625 1595 10986 10671 22020 19603 16910 16535 7512 3606 6637 11528
3531 11528 9600 565 2315 7730 10440 6036 4689 3283 -319 14340 23187 17375 11300 5568
3517 5568 4934 9077 14545 11908 9931 15600 2679 6332 186 9611 13975 3373 -10051 -9326 -3889
3502 -3889 -2992 2295 2496 9637 14725 5121 786 739 2238 6281 10606 7543 10117 3929 -7294 -8988
3486 -8988 -9641 2561 5576 -440 -5369 -1639 7861 9734 5341 6888 10844 4564 -4781 -10240 -18950
3471 -18950 -19403 -22147 -15539 -6310 -3272 -4760 -7634 -5618 -5419 656 15274 7614 796 -2049 -1518
3456 -1518 -5647 -6377 4351 1803 -2409 7972 10750 11124 11181 13495 17103 16123 16409 3738 -15539
3441 -15539 -12810 -6308 -8978 -12177 -7606 -2641 6346 4461 1069 4739 8248 8710 9689 465 1397
3426 1397 7098 12988 6539 5906 2401 -1230 1236 6349 2105 -4704 -13648 -2957 7509 2854 -8010
3411 -8010 -7014 5600 17335 19792 6523 2592 -1158 -4164 -772 9305 15176 22308 19124 17519
3397 17519 17060 20499 14944 8844 8466 10538 10221 5403 4468 7043 4594 4861 5021 8380 7209 3547
3381 3547 2590 -163 5722 5745 -1831 -6956 3654 -3517 -11125 1146 9555 9607 11065 10021 2129 3169
3365 3169 -1886 1767 5632 7847 8641 3225 10245 2332 3558 7163 4350 -3818 -8104 -7841 -2151
3350 -2151 2858 2093 -3386 -3273 -3784 5733 11876 4654 8482 6606 7055 5509 5175 9005 6927 -4700
3334 -4700 -10436 -4940 4869 492 2443 -789 -4404 -5960 -5968 -10307 -14054 -6030 -5093 -70 11968 18253
3318 18253 9663 9245 10818 10340 19362 16379 15212 11889 18965 21108 11490 9002 -2628 -4225 3040
3303 3040 11198 17477 19777 22662 15585 2780 -4231 3804 16086 21628 12499 551 -5107 -1498
3289 -1498 1678 2301 3604 348 -6195 -6127 -4970 -1358 8334 18390 17357 12833 16090 13970 8854
3274 8854 3458 6514 1890 -973 -1021 357 7247 12701 3220 3940 430 8885 11188 5204 1836 6461
3258 6461 5296 7838 10847 16141 10869 15804 12962 3577 -9240 -11766 -6431 -3320 -11090 -8963 -6453
3243 -6453 -15025 -16221 -12832 -11246 4006 15875 16129 3964 1292 3763 15416 15831 11806 16246
3229 16246 16284 10121 3712 6501 -4440 -16313 -19555 -22037 -11927 4428 14680 14554 13982 15871
3215 15871 18650 15090 13251 18209 10523 10158 4279 2865 -105 -7109 -13893 -18969 -10619 -5903 -1984
3200 -1984 2239 1847 2069 4811 -468 -3342 -3273 5768 8613 -855 -4822 1098 5778 4975 -522 -6399
3184 -6399 -5125 2023 4042 -5763 -4829 -2784 -8168 -5418 776 -4686 3018 9791 -3771 -11092 -15722
3169 -15722 -22304 -17607 -4792 -1005 9658 19909 20500 17715 7363 12725 22023 13399 16152 26041
3155 26041 21967 21704 24633 19026 15224 11017 7402 10067 7207 5504 2773 1412 3734 1319 -2337
3140 -2337 -8109 3716 4907 -7875 -6429 4361 8208 6352 2980 -638 3262 9261 12970 18877
3126 18877 15212 13221 10005 8216 7965 6934 9109 11969 9732 6560 2573 4450 7040 -167 -4612
3111 -4612 -7031 -4195 -10302 -16215 -7098 441 -1210 -10737 -13540 -6854 -4969 -9326 -15682 -11456 -6675
3096 -6675 -19261 -18313 -10116 -6213 -5738 -7898 3611 5237 -4236 -16107 -10000 -3522 4830 8433 7412
3081 7412 -588 -3107 -3812 -228 1514 3088 4988 2402 -5164 -14289 -4148 -332 -4191 -2964 -1800
3066 -1800 -8261 -14773 -4212 -9169 -9379 -1996 -988 1397 -6669 -3274 380 9684 6469 658 -1211
3051 -1211 3763 15115 14876 8161 10139 5298 5430 4185 11020 7583 11336 15720 11925 15391 12883
3036 12883 7392 2741 3638 4993 8745 3774 -4381 -5285 -4806 3695 11318 5143 9093 8511 6210 10502
3020 10502 10286 12131 11386 13194 1624 -4465 1687 2307 -1735 6597 8278 4906 4093 7774 10240
3005 10240 7081 -3387 -9668 -2960 3693 128 3212 -332 3324 2207 8352 2504 -5781 -12683
2991 -12683 -12408 -6205 -10290 -8185 -1848 -6993 -4372 -7593 -6346 -4627 -5671 -6576 751 -477 -1925
2976 -1925 -6194 289 1357 -712 6670 11888 15659 19325 10013 3175 9126 -3281 -7672 -1559 12655
2961 12655 13307 6530 -517 -3826 -2635 -3622 -3876 -2657 -3217 2580 7973 3134 5005 6646 9691 10452
2945 10452 8695 10632 13651 13987 2261 -4382 -3194 -5776 -10655 -7160 -2830 -2617 2589 7412 11361
2930 11361 6311 7072 15792 13817 14239 11282 7495 10234 3010 -6913 -2876 -6005 51 162 -244 -2708
2914 -2708 -1115 -8122 -5375 7766 19710 10615 5874 4266 4623 5752 2252 -1308 1317 3063 14548
2899 14548 14973 16402 13507 -289 4572 7276 3556 997 -1514 -3688 79 835 2859 -2621 327
2884 327 10515 12081 7567 16377 16561 16110 15934 15049 18871 23790 31070 29998 24233 11722 8287 7434
2868 7434 11012 5798 2758 4011 3068 697 -1334 -4205 -9036 -8139 -809 3669 15082 14685 1870
2853 1870 5647 20830 20532 11672 -532 -7213 -2550 5353 2842 4600 17704 12429 20585 15244
2839 15244 661 -8604 574 5027 2980 15982 10484 -6432 -11163 -14299 -10498 -2085 4639 3541
2825 3541 2577 11518 15966 18375 21130 23180 18547 12552 2762 1359 -10665 -11624 -1349 9747 19754
2810 19754 25044 20445 19214 31494 33771 21956 11598 2913 -5234 -6483 -3012 2382 14486 27451
2796 27451 19021 14138 15191 13519 11865 5617 3938 8598 7245 6513 8421 -1750 -10769 -560
2782 -560 7171 1057 5002 -3951 -9388 -12642 -8244 -4688 1740 10455 12229 12126 5704 3661 1742
2767 1742 -1263 -9903 404 12456 18834 22072 16387 14035 3514 891 10300 14770 10676 7410
2753 7410 727 -2355 14567 19312 18784 23463 20643 12225 5811 1513 9829 8890 658 -2791 -2023
2738 -2023 -4272 -3272 1039 382 2625 -420 -4664 4601 16859 25675 12659 2013 -2207 -528
2724 -528 -3594 -5800 -12196 -21160 -14196 -11702 -17759 -6965 -4425 -9568 -9464 -13153 -15477 -14571 -4795
2709 -4795 -773 1962 -481 -7373 -10021 -10710 -9339 -2066 3993 2050 -6254 -2878 8817 15189 11396
2694 11396 13127 10612 5373 1156 9771 16203 9656 2052 -5079 -5892 -3524 -457 -320 992 -1309
2679 -1309 -850 -3527 -10485 -10840 -6615 -90 2962 -7272 -5970 2836 10897 4721 -2279 5357 4791
2664 4791 706 3331 6672 20833 19684 6854 333 10328 13250 7185 1668 4907 -546 -1654
2650 -1654 -11568 -9267 12564 15108 13984 15327 18485 19689 18053 13837 5690 4476 13345 16801 17773
2635 17773 15859 7705 10573 10903 4084 16988 22721 17018 14502 8844 2811 6184 10179 21845
2621 21845 15918 13673 7504 14637 8532 -4314 -4737 7 7193 25683 20729 11431 19593 15054
2607 15054 1998 -1264 -3942 -6116 7287 -247 -6346 -7670 -2129 -5018 11565 13915 8290 5116
2593 5116 -1876 -3133 -3171 6762 6484 17187 26045 17430 14741 15665 9933 8471 3183 -1702 3163 6299
2577 6299 2300 10460 5977 1495 3138 -433 14073 19325 13166 11877 9559 4140 -892 4875 4766
2562 4766 4769 14564 5162 5219 7499 5501 1451 -1534 -11293 -12923 -5853 -1514 -2245 -4620 -9374 -4227
2546 -4227 4360 -93 -13453 -17887 -11816 -12153 -11949 -2848 -236 587 -2653 -2932 -212 6675 14386 11979
2530 11979 13958 14824 7943 11761 17737 23807 29766 18346 4710 3466 5201 777 238 -292 -1286
2515 -1286 -811 -2607 -5865 -7326 -6151 -7754 -6468 6209 5848 -2621 -3510 -7344 -688 -2062 -4137
2500 -4137 -8387 -13065 -5472 -1799 2744 3653 -612 5426 4112 -1207 -39 4666 11673 15919 13558
2485 13558 8773 16932 15463 13843 13009 16367 16268 3771 -1135 159 -4896 -6121 -2122 1067 -345
2470 -345 597 12334 13567 3375 -9795 -8909 -7585 -1749 -7071 -11158 -6585 -723 -534 4135 -647
2455 -647 -1542 -2175 -6174 -3210 -678 -4268 -939 5487 137 -8548 -6064 -2384 -896 7811 12033 9444
2439 9444 5452 7583 4799 -1317 8442 64 797 6605 4092 7569 7501 12577 11565 1249 -9608
2424 -9608 -844 7014 8885 3862 -2948 -12243 -17340 -13995 -1770 5963 5844 13853 27678 22121 17969
2409 17969 17783 16303 17009 14708 13997 11888 15103 30799 19175 5631 -625 1520 693 7882 12439
2394 12439 18042 25236 20371 10193 15884 20200 16675 14821 11487 6715 1191 1258 6107 10403 10408 12254
2378 12254 10027 6473 11280 7848 9834 2651 356 3628 6773 5037 -918 3113 2142 2076 -1357
2363 -1357 3668 6430 -3244 -894 -4669 -7563 -3814 7495 5398 1841 -4927 -6638 -9903 -6991 -6779
2348 -6779 -9170 -5331 -1933 453 -14120 -32095 -32358 -18020 -4780 -5259 -3839 3042 2041 -5300
2334 -5300 -5739 -8318 -8313 -3950 1433 11654 20381 15918 794 -3048 3031 1572 -2449 -2376 -2261 -1309
2318 -1309 3608 -2047 1004 3493 8965 16499 18462 23808 19423 16493 15763 8129 3249 2154 12619
2303 12619 16255 7326 5142 10099 12509 4645 -3337 -5163 441 4336 -1856 706 6802 -3593
2289 -3593 -5315 -6849 -9084 -14106 -12353 -8553 -15748 -17001 -2438 2061 -6879 -6452 -3667 -4550 785
2274 785 2355 9946 13281 8106 17283 14277 7433 6953 8747 4173 13160 28840 28617 24018 19929
2259 19929 16469 14114 15331 19900 27797 22967 12897 8049 2745 -2150 -4787 -1808 -40 -3709
2245 -3709 -5958 -605 8876 6342 -401 -208 -8959 -17006 -13614 -6640 -1597 -6215 -11831 -17488 -14099
2230 -14099 -13225 -12119 -8909 -12000 -15876 -11734 -10890 -3221 -3217 -2350 813 -1934 -809 5219 7949 10368
2214 10368 10389 10866 9232 8830 9076 13911 14994 11293 6993 4158 -2143 2731 11227 15144 5352 -3914
2198 -3914 -6933 -5617 2601 10335 15145 13160 39 -6738 -8738 -8579 -4113 -5828 -5698 -2023 -5711
2183 -5711 -5612 -7804 -10915 -5136 -1723 2590 1927 -219 -2476 -268 -7896 -10112 -7186 -9507 -8668 -1879
2167 -1879 -10210 -4218 5643 8358 7925 2451 4653 13295 9776 7627 8652 6236 7036 5131 -2931
2152 -2931 -10888 -13979 -15271 -9217 -2674 2465 9389 -3551 -12048 -4369 -4065 -3915 2176 4928 9921
2137 9921 9317 1181 -3019 -6957 -7426 -5433 -4720 -2811 3364 1663 5353 5985 -3405 -9641 -13893 -6990
2121 -6990 8111 12098 4851 1914 13298 14672 10781 11292 9783 11827 8851 6217 4615 -5268 -6353
2106 -6353 -10896 -3543 -1688 13354 19158 14819 -218 -15933 -15156 -3922 -4794 -4603 5275 15540
2092 15540 6288 -4192 -5070 -240 -19902 -17425 -8978 -2494 -2432 3204 8293 5295 -7765 -12075 -4705
2077 -4705 4657 -6512 -19360 -20667 -4391 1525 -838 -10284 -13265 -11171 -13113 -9453 4433 10905
2063 10905 10810 3120 3598 8964 14102 8552 2270 8799 17066 17574 10500 8907 10209 8591 10746 6074
2047 6074 -716 -1404 -5140 -3704 4259 3986 3541 4982 860 2418 3195 5698 -1791 -10005 -12486 255
2031 255 4432 -6749 -4182 2887 5497 3896 12824 14114 7222 -1418 1464 8658 11868 18802 14261
2016 14261 12199 1394 -7318 -6224 -13180 -13232 -4159 -1334 -1993 -2299 -4465 4599 2239 2409 -7453 -10863
2000 -10863 -2177 4012 5898 10178 9075 11456 11061 -176 -3152 -9794 -8926 378 5038 11262 7242
1985 7242 1833 686 5227 7673 6479 10029 12204 8797 4942 10605 5750 2682 -4746 -642 10305
1970 10305 6757 11042 22609 10330 116 3179 -304 -1639 -2759 4197 6561 3396 6661 6396
1956 6396 12305 9535 4631 3529 -3524 -12568 -10268 -2979 3684 4127 16061 13483 4643 1755 -3268
1941 -3268 815 972 -1636 2771 4852 4540 4015 -6612 -12823 -10012 2639 8479 9591 712 -6510
1926 -6510 -7987 -9246 -3214 1404 -4717 -8916 -6627 -8312 -4932 2761 2005 248 2406 621 -7878
1911 -7878 -17332 -19471 -6907 -4988 -4776 -3813 2812 4422 -4354 -7583 -589 -5873 -12678 -13447 -8788
1896 -8788 -10247 -13862 -8223 -10535 -10303 -5468 362 6437 5144 3637 8165 6264 5713 6973 72
1881 72 -4062 -8827 -7747 -8689 -4974 516 -9162 -12016 -3334 6438 17 -4626 1708 5943 10632 2233
1865 2233 -4773 382 2424 -7283 -10637 -12286 -22269 -20054 -14402 -15177 -9623 -10213 -16920 -18679 -10137
1850 -10137 217 10958 21939 20480 22675 18226 13424 11390 4670 -8336 -16237 -9707 303
1837 303 1048 5522 3320 4270 8104 -1800 -4942 -9302 -8228 -306 -4138 -1526 2989 7597 5629 11347
1821 11347 10931 6740 8650 12708 19220 23344 12772 10542 13438 10543 11741 7674 -3330 -9412
1807 -9412 -19262 -8687 6017 5534 12121 8781 -946 -3237 -6068 -2342 11706 19822 24511 23503
1793 23503 24215 26288 6539 -7333 -15269 -11450 -2676 -3702 -8718 5153 12400 -2854 -5722 -7169
1779 -7169 -11551 -14068 -2891 -1862 -842 6491 6436 11288 15454 14577 13508 16157 8137 6119 2319
1764 2319 6164 15691 10540 -2155 -15328 -20235 -18588 -15617 -15886 -7437 6258 13788 7829 4359
1750 4359 -159 -1696 1756 15041 11314 9528 16488 4324 10036 6110 -764 -18059 -23820 -20982
1736 -20982 -14154 -15332 -8217 2778 14376 19390 23753 25947 13157 1455 -4748 -8114 -1197 -788
1722 -788 7139 7930 5008 6218 14019 11687 5983 7409 -1028 1697 765 -5558 -1258 -4608 -5125 -573
1706 -573 -4607 -15547 -7086 -998 250 547 4274 11466 6852 6207 7551 2470 262 5859 9923
1691 9923 15026 19650 19867 8934 6640 -4550 -12365 -10411 -11381 -5054 -11096 -17261 -16917 -21279 -19482
1676 -19482 -16573 -14380 -5535 -8364 -12419 -9643 -10769 -3172 7203 -10891 -17070 -9616 1327 9357
1662 9357 8694 -508 -8383 -3205 4504 -2485 -9009 2036 4187 1510 1370 9593 13874 -1139 -7633
1647 -7633 -10063 -10040 -272 11809 13891 14909 14807 7875 8633 12671 17679 22847 10034 1328 -2768
1632 -2768 -10512 -12380 -9665 -6564 -12362 -4733 773 3208 -4825 -7646 -2110 -2742 5433 2571 2053
1617 2053 -5043 -1382 2893 -420 -3630 384 5012 8359 6547 -2141 5559 7018 -4164 -9254 -7247
1602 -7247 -8045 -14333 -14662 -12597 -12450 637 6032 7694 3769 -1718 3632 20003 11371 5367 5880
1587 5880 -2882 -12977 -8069 -1619 640 -15599 -23252 -24379 -20106 -12375 -4860 -4885 -8441 -4456 2955
1572 2955 5469 -2177 7584 15789 20587 19559 11803 24221 17746 11875 3101 -4249 -938 2277 4033
1557 4033 9060 15373 15604 9806 8621 -695 -503 -1814 -7655 -13899 -21413 -16462 -15659 -9805 -2243 -2396
1541 -2396 -5467 -8203 -10689 -7511 -9353 -11958 -12267 -2539 3002 -482 9981 12225 4176 -8543 -14133
1526 -14133 -17507 -8711 -389 3125 11175 10537 4746 -882 255 6518 7101 1764 -391 -2762 -4347
1511 -4347 2116 1693 -2312 3402 8559 9127 7055 7339 8913 13085 17321 14016 8126 8783 1326 3095
1495 3095 4573 6202 3908 -8146 -11547 -17478 -21622 -11570 -6081 -4318 -3652 -8294 -1022 7734 8939
1480 8939 14115 12805 -2867 -6910 -11694 -1061 -3729 -4634 395 -4384 -15778 -23124 -12836 -4382
1466 -4382 -3558 -6659 -14146 -8472 1872 -2535 -6654 -8457 -6978 -5509 -3207 1710 9404 1747 -9778
1451 -9778 -11517 -5456 3692 13787 17649 13856 15211 11240 64 12016 13937 -2751 -2645 -636
1437 -636 264 -9967 -11676 -14804 -17710 -6821 -822 3917 -634 6496 16105 20947 10334 174
1423 174 5171 9583 17489 16139 15791 10294 11727 16818 12185 687 -2816 -1802 4333 -3305 -2605
1408 -2605 -8753 -1736 5691 8045 7059 11120 14240 5113 3540 400 2069 795 1918 829 -1645
1393 -1645 -11873 -15009 -12676 -9331 -904 692 223 2795 -2705 -4400 -7307 -12869 -8789 -5634 -686
1378 -686 -13858 -8592 -2838 -1402 5336 10013 8656 9027 12575 14874 9783 12087 3915 -2595 1093
1363 1093 8483 6823 1810 3756 -2502 -2738 -11968 -19012 -18617 -20859 -2345 8001 3263 -2548 -3951
1348 -3951 -10389 -7575 -5692 -2475 2463 6138 6782 5668 179 -3908 -12935 -13316 -7186 -8085 -12641 -9009
1332 -9009 -4851 -3196 -6083 -2239 5099 1437 -2301 -3773 496 46 -2040 4416 5837 594 -7407
1317 -7407 -7446 -6172 -1348 240 -322 -1812 5921 5182 -7165 -11090 -3599 -6168 663 2834 -1910 -19039
1301 -19039 -24051 -25420 -14916 868 -5376 -8685 7121 8161 -7710 -18807 -17212 -4444 -5223
1288 -5223 -14013 -7643 -1306 4649 -69 1098 14639 16328 -1828 -15035 -14382 -4710 -2182 5522
1274 5522 9653 12133 10498 5681 50 -8563 -16740 -8263 371 -3094 548 275 2174 -6105 -6817
1259 -6817 -41 5142 5837 4573 7575 -350 2154 6152 3147 4413 -936 -3437 -11080 -16958 -13460
1244 -13460 -14979 -15270 -12554 -8608 -11880 -8323 -7126 -9690 -2698 -1532 1495 251 -1635 -1117 -592
1229 -592 -3618 -6231 3391 3895 2683 -2185 -2105 7412 1791 6360 -3319 -2277 13706 9394 4859 6804
1213 6804 -473 -10516 -12559 -21898 -19355 -4866 -861 -9094 -23180 -17610 -4289 7500 481 -4729
1199 -4729 -4284 -8176 -11899 -10193 -7112 942 -1079 -5414 -11373 -8489 -10736 -12371 -9402 -9527 -10980
1184 -10980 -6276 -3291 372 -1576 -4964 -3489 -1344 -5882 -9927 -11827 -15432 -11442 -4254 1455 4412
1169 4412 11052 2540 1529 -1211 -5161 -9554 -5672 -6793 -5884 -11075 -10149 -13219 -11548 -16002 -27725
1154 -27725 -18103 -5249 -96 -4345 185 3451 6124 -677 -11974 -13869 -4884 -3134 889 5881
1140 5881 17162 15303 3965 -4386 -1641 -4235 -8286 -10501 -3376 348 8616 4056 -4830 -10095
1126 -10095 -3739 8289 6430 -8440 -11499 -5436 -11309 -11510 -3569 2743 7424 4069 1664 -5628
1112 -5628 -7074 -2825 -3051 -2636 -4911 1324 6517 11130 8532 3152 -4198 995 -1537 -10178 -6738
1097 -6738 -6071 -11447 -7687 -3330 -6327 -11239 -10720 -4981 -6672 2868 6321 8047 6630 4799 11368
1082 11368 5050 -948 1735 -1392 -1661 -3182 -14835 -13362 -7889 -18488 -22656 -21028 -16828 -13666
1068 -13666 -13695 -14654 -7378 -19046 -18367 -16914 -16612 -19603 -18213 -14777 -17102 -15914 -11806 -21425 -28404 -23624
1052 -23624 -19342 -13424 -3974 6298 7182 2074 2209 1065 -6144 -7723 -3654 11598 15545 13901 9568
1037 9568 9195 6277 10236 8718 7449 12410 6959 10552 -2012 -6045 -7110 -7543 -10488 -11070 -8469
1022 -8469 1890 5957 -66 -3930 3506 7646 -1847 -7653 -5438 1625 323 -8751 -7363 -13920 -12224
1007 -12224 -9133 -5629 3268 14518 21542 15452 7585 8614 2604 -6026 -9029 -7034 -14052 -16397
993 -16397 -25549 -25489 -17845 -12382 -7402 -8490 -8752 -16981 -8714 -2127 -14393 -20194 -14736 -8969 -11624
978 -11624 -11388 -14759 -2099 1463 -8313 -21120 -23570 -17454 -6276 -976 -8261 -24813 -16960 -4883
964 -4883 -7012 -3289 -316 -2417 -5706 2054 -4729 -778 73 -1612 -6352 -9882 -13073 -10569 -3573
949 -3573 -7495 1438 5456 745 4884 2575 1291 -6399 -11580 -9938 -16921 -20121 -5905 6619 5119
934 5119 -7622 -15374 -14135 4504 5303 -2823 -5835 -15717 -13163 -1605 8173 -2186 -8932 -10416
920 -10416 -5544 3664 6177 -241 -908 -7828 -14525 -15165 -7295 -6303 -2424 -7032 -15450 -10986 -2860 3156
904 3156 7559 8807 -1015 -8725 -8624 -3581 -1063 -4196 133 2673 -450 -7526 -8961 -10320 -4494
889 -4494 -5583 -12904 -17168 -12163 -9130 -10159 -4759 -8534 -14248 -9447 -6958 -23729 -19824 -8581 4176
874 4176 1094 -3089 1444 -317 -11155 -12802 -8298 -12085 -12629 -12221 -10205 -8358 812 2533 -3396
859 -3396 -7926 -1095 6076 4025 9117 9045 12173 4612 -749 -3218 -7425 -13354 -8937 -2254 -4823 3544
843 3544 5347 9857 -629 -9902 -4555 -11854 -11146 -3707 -8337 -10890 -7355 -5030 -1066 -8166 -7473
828 -7473 -3442 602 4486 -11858 -17440 -14069 -17811 -28925 -29365 -13089 -3785 -5441 -15048 -18376 -18646
813 -18646 -21302 -16853 -15639 -11390 1367 8964 -1401 -5443 -2599 11525 16301 4837 821 -6475
799 -6475 -6985 -10343 -7851 4425 2107 -4277 -2433 1929 8532 4326 2540 -8371 -13414 -11243 -4318
784 -4318 3814 2429 1309 11844 18558 10545 -6070 -4588 7029 12672 8570 4622 -4759 -8042
770 -8042 -3973 -2219 8521 6219 -1394 -3400 7122 3596 2279 -4005 -5916 -5838 -7157 -7639 -3879
755 -3879 -1816 -6589 -4880 -4768 -6039 321 5965 -3255 -10373 -9326 -5744 -2068 -3724 732 2282
740 2282 468 -13508 -20655 -8087 103 -3344 -10213 -13061 -1598 7570 3124 8914 9498 13086 2732
725 2732 -6775 -7143 -15830 -15384 -8922 -16552 -22154 -21803 -15110 -15527 -12559 -6210 -9283 -10618 -10084 -14432
709 -14432 -7753 -7214 -5907 -1871 -3041 -2359 -4999 -13027 -19270 -10744 7592 14576 10952 7333 16883
694 16883 16232 11655 -3654 -15751 -16007 -9992 -6802 -4089 -9961 -10679 -6916 -9014 -22063 -31768 -27901
679 -27901 -16108 -9155 -10123 -9207 -3734 880 -3243 -792 -7688 -13349 -9139 -6666 3618 12855 5754
664 5754 452 -704 702 -5615 -7994 -746 2285 2002 -1274 -3488 -4167 1146 9695 16528 17454 8568
648 8568 4525 -3908 -5629 3549 9146 -707 -8025 -8186 -10301 -10889 -10858 -3855 746 2177 3179 -4247
632 -4247 -6886 1626 383 -2467 -9361 -9001 -10071 -12402 -7959 430 -1445 1578 -5928 -7001 -2866
617 -2866 -1846 -1233 4926 2028 -6433 -10545 3058 9442 10368 955 -5911 -7195 -1953 13423 17266
602 17266 8085 1647 -18041 -26191 -17074 -932 4597 9381 6629 12139 10241 6834 7560 -829 -8975
587 -8975 -11857 -4862 -3632 -4127 -7569 -7913 -8883 -8226 -8985 -11376 -16974 -12899 -11147 -11883 -3437 -6309 -19415
570 -19415 -22726 -24663 -28090 -35818 -24873 -13955 -11253 -3201 -8945 -13688 -7703 3678 4888 2534
556 2534 -2207 -590 -149 -1723 -5591 -7242 -14837 -16727 -18992 -26760 -14783 69 -3307 -4097 -13406
541 -13406 -12117 -857 -8111 -15474 -13495 -10246 -4829 -3487 -6344 -3690 2313 -2780 -3879 -4958 -6208
526 -6208 -6246 -9030 -8847 -4864 -16008 -16425 -4040 -6138 -9768 -14233 -15873 -7064 338 5299 -4412 -3276
510 -3276 -2249 -4333 -6299 -7037 -12797 -10381 -1012 -1131 -5096 -10846 -2119 1679 6739 2290 -2933 -2658
494 -2658 -338 3746 -7671 -9689 -9440 -16177 -21010 -16094 -12328 -13451 -12609 -10708 -18195 -9833 -10563 -12718
478 -12718 -12164 -15244 -13196 -13908 -8251 -863 4873 1871 7382 8051 4923 1551 5107 14029 17852 2928
462 2928 -6891 -18938 -17675 -9257 -10010 -15794 -16450 -14925 -2192 460 1978 2325 2460 3361 -9837 -13741
446 -13741 -3477 1681 -2529 -2740 3360 -2004 -6108 2956 1847 3314 12379 17574 7216 -3054
432 -3054 -3143 601 2192 -861 -5350 -4393 -24 -2269 -6440 -16099 -19006 -13163 -2665 2502 -130 -5093
416 -5093 -10687 -13778 -7873 -8199 -7516 1979 9618 14871 7441 6150 4776 1593 3854 9711 5345 -9093
400 -9093 -16708 -16350 -11611 -15039 -14659 -7450 -2100 -2247 -1647 -3209 2189 -3584 -5398 -2037 4453 11373
384 11373 -3870 -15860 -12442 -3211 3114 -4284 -17530 -10335 -7332 -9004 -9515 -19487 -24165 -25939
370 -25939 -22435 -18481 -15163 -11064 -6075 -7923 -7712 -15511 -20430 -18177 -11870 -3097 -3757 -16135 -14205
355 -14205 -7330 -2929 -1324 -4980 -7640 -1824 -1649 -8652 -7371 -6164 -10342 -5406 1568 -3791 -10194
340 -10194 184 -457 -4586 -3912 -3682 5516 5053 -4666 -11882 -10438 -12613 -19279 -16340 -5437 -1745
325 -1745 4353 5185 3123 -1097 -8467 -5203 543 -415 -6886 -6001 -7433 -10005 -9615 -11910 -11533 -7273
309 -7273 -4134 -26 -5897 -14513 -13618 -5244 -3917 -13503 -11623 -16509 -20913 -17940 -25153 -25542 -15350
294 -15350 -15353 -11818 -7256 -1910 -892 -3220 -8645 -10709 -5899 -4410 -4166 -6086 -5875 -3550 -6714 -18913
278 -18913 -22673 -17802 -7385 182 -562 -6565 -12212 -18088 -13076 -5700 -13628 -9562 -8073 -4911 -13157
263 -13157 -12651 -11784 -9053 -15211 -19395 -12078 -7795 -6389 -995 6384 5437 -6337 -14743 -18253 -19440
248 -19440 -10222 -7421 -15720 -19116 -16788 -16347 -14492 -8435 -2371 -4677 -6093 -5463 -2856 1250 -1659
233 -1659 38 -3262 -14419 -17782 -12947 -10774 -7916 -7462 -6294 -1920 -2460 -3326 -8390 -2937 5896 422
217 422 -7839 -14588 -16408 -11145 -9423 -10937 -4970 5491 1823 4794 -2054 -8190 -8532 -12681 -10918
202 -10918 -7113 638 1649 2573 3903 5770 -3547 -3255 594 -2610 1606 9232 4201 -4005 -4110 -5869
186 -5869 -1176 3066 2831 9557 6223 359 3331 8037 2924 -401 307 6385 7886 3219 1048 3472
170 3472 2310 -6054 -11082 -10050 -10348 -5430 -7129 -5975 -11928 -18523 -10340 -12377 -20790 -16955 -11445
155 -11445 -5332 -5552 -12700 -15443 -13247 -4948 -1951 -2334 -3145 -7780 -15275 -13156 -8821 -11605 -12872 -9038
139 -9038 -11986 -17530 -20091 -11301 -3439 -11141 -13467 -13742 -8499 -14330 -14855 -13994 -8216 -8791 -13557 -18884
123 -18884 -12437 -10288 -21484 -23756 -16903 -11725 -15029 -15178 -15252 -17492 -19607 -22340 -21462 -18260 -20273 -18425
107 -18425 -17559 -19063 -22014 -23473 -15092 -11729 -10818 -5282 -10706 -16435 -12761 -8232 -7775 -6429 -5677 -5763
91 -5763 -4710 -5253 2648 1783 -9999 -19426 -25716 -22077 -19162 -15954 -12995 -11523 -11645 -9906 -10049 -10743
75 -10743 -14903 -8309 -14 -2720 -9601 -6902 -2973 -8024 -12303 -8963 -6171 -4146 -5422 -8630 -19072
60 -19072 -15871 -9486 -4236 -2944 640 -2608 -6420 -1941 -2217 764 4488 3328 -4449 -2527 6522
45 6522 3415 -2570 -10040 -7812 -5061 -9781 -9244 -5331 -6893 -11560 -10169 -4897 1834 8953 8830 2691
29 2691 -2975 -9760 -3079 -106 -9343 -4411 -2788 -12993 -10271 -2773 2742 -847 -9808 -10148 -14188
14 -14188 -16267 -18865 -16317 -17945 -21666 -22646 -17218 -17718 -20186 -16425 -12216 -7335 -8029 -13754
0 -13754
$$ Imaginary data points
##PAGE= N=2
##DATA TABLE= (X++(I..I)), XYDATA
32767 168892 170340 166915 167170 170433 168719 169892 174270 167586 166236 172903 181003 178146 181747 185837
32753 185837 185589 189301 189002 186766 186952 189151 190797 192154 189260 184823 186994 193310 197472 197340 194700
32738 194700 200768 198458 200102 208829 214034 216410 218632 218536 220207 221979 223452 223532 224456 223717 225802 230116
32722 230116 232227 234276 236607 244637 254156 259116 253797 245295 246912 255499 258124 259006 253339 254179 261336
32707 261336 266986 264558 255766 262370 272292 271091 274396 276974 282448 281426 276684 280515 285560 282963
32693 282963 282248 283687 288252 287168 285885 287892 286499 291730 296475 294599 299345 301688 304646 300386
32679 300386 307759 317008 313731 314049 314336 318695 319674 319945 323628 329271 334315 328279 335383 338113 334197
32664 334197 336451 340795 345429 344551 345164 346440 343487 342560 349002 350281 345482 342099 349211 356373 356616
32649 356616 362678 367713 364438 371032 375287 371315 375787 387170 391425 393324 387017 379516 378902 380866
32635 380866 380601 381992 383381 375776 381470 389653 390730 393154 404758 416403 418087 414596 412317 404543
32621 404543 401892 399773 395670 402696 419635 421438 412606 415737 412860 408980 410558 419062 414527 416469
32607 416469 418679 417494 417295 420553 424348 427351 430942 437785 441432 440678 438309 441613 445030 442538 446467
32592 446467 449808 446225 454232 453404 463406 460425 452014 456139 465272 469937 472384 465774 464338 468321
32578 468321 465240 467992 476856 477172 470418 469681 470550 473912 480812 484002 481044 485728 485132 487492 493163
32563 493163 498285 497072 494865 489569 486009 492711 493988 495634 496970 502525 513244 508623 503416 503403
32549 503403 505773 510195 511167 516192 518969 517184 516088 520911 528044 534019 535671 538370 533263 525212
32535 525212 521756 523111 525642 518004 518361 526000 526949 526977 530211 538912 542861 554666 554651 545226 544903 544440
32519 544440 539288 533855 541633 551475 548416 550936 547817 551712 550930 553922 556760 557610 554025 552727 553392
32504 553392 563074 561887 560131 560184 565764 563281 552412 554293 562741 568211 569290 561262 560043 565703
32490 565703 578419 582490 584138 585041 578411 580172 590996 591830 584856 579540 582783 587483 592229 593491
32476 593491 594359 590290 588096 592250 595465 588853 594530 591529 595130 597312 592294 584109 584647 594329 597828
32461 597828 594938 594273 596858 597153 596054 604116 614313 622288 615195 607304 612439 614885 609241 606916
32447 606916 601825 599531 600621 603391 610553 616153 614458 615507 627999 638193 646438 641916 646445 643474
32433 643474 630576 624794 625286 625189 622423 618152 613182 612116 625315 638477 640547 637469 634595 644300
32419 644300 642983 636271 639764 634801 625453 628085 631368 632406 632842 635053 625227 624579 629625 642605
32405 642605 648099 644806 647745 653194 654694 643678 642539 651061 652280 649708 647864 640127 646302 660514
32391 660514 667370 668763 656815 653959 651978 649131 653304 660473 673260 675909 673806 678330 681325 680411
32377 680411 684712 680719 678021 668774 668740 666551 664709 668493 668443 666428 666690 668325 666996 670032 674891
32362 674891 673767 679122 682968 689050 691223 681822 671937 672112 670145 674179 684752 687317 694303 698573
32348 698573 687105 683793 688550 694179 701245 691372 678987 674220 677246 685057 682349 678052 679263 674933
32334 674933 673001 677224 685936 696338 694490 682628 675738 687271 690459 694465 691333 684117 689083
32321 689083 690149 693777 691238 689732 687847 692207 691956 682771 688153 690161 690420 684467 688181 690613 700315
32306 700315 701551 702072 704057 708463 696675 700998 696866 697533 711279 714936 711568 711216 706777 713742
32292 713742 721098 720520 721497 723500 725297 724909 727897 733133 711849 701261 709645 711835 719203 727758
32278 727758 726964 711644 709744 715939 715468 706729 704372 704785 704920 709453 712051 709495 702923 699823 705017
32263 705017 707003 707741 717785 718369 728830 728532 720870 724720 722509 726728 726916 728184 734967 728630 717776
32248 717776 713697 711673 710654 715987 719337 715308 712040 720401 716334 714053 709022 711890 716515 724306
32234 724306 729001 730873 722950 725424 724193 728273 728956 724722 723450 719764 724603 714367 714875 722819
32220 722819 726058 722856 715550 705859 714485 719393 725457 729799 730396 732913 728707 716842 715410 717351
32206 717351 717042 713098 713629 719037 723800 719991 725867 739991 745231 744238 733507 738047 738016 728676 733677
32191 733677 733672 732790 740848 739316 740122 735499 741710 737868 732544 733598 735884 735246 731747 728382 732538 727840
32175 727840 727124 738553 732605 728216 721620 711110 706124 716986 729504 734214 730734 730061 722896 721676
32161 721676 725800 718606 723572 735849 738567 724645 728591 728307 721762 728680 730049 722709 725371 722034
32147 722034 722229 720719 720617 732490 739317 742773 736866 727492 728227 734239 732136 724040 723712 735854 743394
32132 743394 750108 754599 754621 761823 757847 746742 740611 737118 735256 736139 737816 746107 739716 724074
32118 724074 726223 728424 732581 726926 727045 731532 735311 730074 730658 742804 747164 746243 743449 755736
32104 755736 751967 743375 741396 733311 726988 721951 715468 717820 723766 742509 744691 737018 737922 733569
32090 733569 728778 727603 735211 734430 733990 743149 740504 735599 738235 738936 747619 743377 737727 738362 742640
32075 742640 738105 726520 724508 728075 732196 732961 731046 733559 735214 738237 738065 742369 747722 739740
32061 739740 734640 739791 739803 736922 742801 755962 761015 760303 759099 755487 754777 745957 738169 739706 732186
32046 732186 734664 735993 736402 746335 748363 753418 762439 767807 771102 760274 751393 751615 750151 741763
32032 741763 733882 743980 745165 744641 749205 755319 769948 762925 754688 749514 750858 744526 737146 740453
32018 740453 742386 741258 744897 747149 747458 749347 763940 773618 778355 760328 749851 749050 751367 752587
32004 752587 753608 755777 752413 749814 752497 747596 750474 743186 734421 738436 741758 742938 746581 746110
31990 746110 749608 758971 751543 746687 742060 737983 737876 741775 743660 749234 744649 747882 755237 758145
31976 758145 757111 748712 735899 733366 730720 735834 750284 751800 749243 747178 741492 741954 738790 737906
31962 737906 738891 752473 753922 737216 738591 745866 742552 741708 743297 746745 755015 759680 753113 743754
31948 743754 746042 753150 745923 742724 745184 740851 729437 718964 728967 748365 754585 750931 745612
31935 745612 745192 748424 744951 744886 739889 736577 735497 734412 738374 740984 752916 752506 746210 748116 747951
31920 747951 749743 749363 747410 741964 738620 739610 729542 729296 733978 738619 750455 756882 760563 753867
31906 753867 752120 758175 750034 738053 740479 745732 745755 744937 752077 754766 753514 760644 765084 763166 752914
31891 752914 754652 752014 750444 752586 752685 747284 738237 738056 737728 730981 728884 738082 744266 741654 740919
31876 740919 739508 736900 739061 744013 749936 750231 746186 748400 749550 753779 759868 766228 764806 760800
31862 760800 759447 764890 774931 762818 754039 752813 760002 762426 763995 767646 763518 761174 758444 752693
31848 752693 750736 748259 743116 755508 759571 757807 759883 761038 754240 744822 736794 746439 751441 748414
31834 748414 745482 739550 737901 743402 755257 751805 746673 740325 740247 744738 743892 730034 724639 730198
31820 730198 736651 747934 745779 747208 745467 747349 761124 767123 760020 750798 749900 749229 755851 754491
31806 754491 752521 763755 767854 761117 753786 753416 746446 741254 750123 752948 750026 754727 754537 747870
31792 747870 747173 747981 755170 760204 756895 758761 756213 752496 755650 755529 763165 762649 763645 753659 746230
31777 746230 737318 734927 739425 747131 759716 762547 753729 754051 753258 748633 741751 741667 748589 743261 742681
31762 742681 746640 756455 768214 769017 771352 775819 766002 770050 764158 760996 765904 765786 766789 762734
31748 762734 775276 786548 780947 775098 774454 778563 762492 760618 756736 753853 748771 747836 752658 760867
31734 760867 752549 750023 755346 765929 764867 758998 760102 757515 750112 754545 759152 763700 766631 766466
31720 766466 767122 766914 762750 756695 761172 762573 761665 756303 750119 750406 748023 748851 747436 745423 750037
31705 750037 759960 759999 752741 742546 749630 751965 762165 758804 755781 758348 772087 770235 772660 775735
31691 775735 766413 762192 769133 761337 760411 758673 758943 760025 741243 743617 741168 745363 764750 775871
31677 775871 772279 766832 766381 766069 763937 755211 750578 751490 745195 741401 749547 761938 763015 768336 774262
31662 774262 776859 778073 776480 764798 759260 761464 753438 750574 757674 753688 760668 764068 759854 753882
31648 753882 749221 744299 745421 749609 746505 738747 743020 736404 735014 749902 752582 763227 763233 765131
31634 765131 764349 774631 764246 750747 748954 754828 765641 762642 756631 759606 759116 755596 750363 750176
31620 750176 749761 749782 755431 774807 780150 775296 766943 767605 773399 768565 751189 745895 754338 768482
31606 768482 758840 758534 764433 758239 749729 753297 754793 757359 759049 754586 756793 756403 760316 770593
31592 770593 762255 762890 770603 772482 769201 765170 772304 775355 767594 757717 762023 757137 751249 753827
31578 753827 760040 764258 761524 759673 761507 758002 757708 766992 764473 760602 756728 755689 771521 781396
31564 781396 773874 770202 770153 775346 777216 775745 773440 780119 772358 763716 758735 755534 758123 764320 767486
31549 767486 768716 769330 763725 770750 772895 771498 774992 778099 777821 771892 774331 770937 759593 750063
31535 750063 748700 756506 762625 768178 778016 780257 772419 770316 770205 770829 762192 760280 764904 773315 773970
31520 773970 771041 772412 767629 780489 775536 770701 764023 762574 764768 767249 768685 775983 784508 786425
31506 786425 784958 770017 762910 753077 762923 777604 771321 769788 775749 773833 770719 777255 773932 768779
31492 768779 764106 760895 762182 766214 769271 769838 775600 774910 776393 772967 771702 776210 776477 775792 782740
31477 782740 784674 787486 785893 777497 778870 778013 768765 765857 763082 756447 760820 762362 768549 771068
31463 771068 768740 775640 785802 787656 786238 777016 779828 779420 776321 773996 776340 772411 777109 773924
31449 773924 770970 767101 765582 766456 761989 767429 775869 779210 771527 771229 776507 771491 760334 759717 764062
31434 764062 765456 761649 761186 772426 778662 776412 765912 762507 761777 761025 765252 762812 762077 764420 766124
31419 766124 774314 771763 766124 764228 767316 766702 753560 745934 751033 754796 754578 760340 765362 771285
31405 771285 773845 774893 781995 790921 790745 792880 782860 770848 770707 772274 768558 760449 764525 769505
31391 769505 771141 774743 780275 779254 780065 777347 771041 768475 765332 772626 770733 763065 770933 767957
31377 767957 769278 769013 761014 753478 757042 751968 762670 770411 767096 761285 761468 765048 762018 759604
31363 759604 753619 758506 760182 762997 760016 769267 780527 776337 777916 780503 783331 779783 780857 778706
31349 778706 779551 782178 771126 770767 772354 775823 782311 778572 770436 768983 770496 776238 773846 773718 773387
31334 773387 775198 776219 773488 767598 765292 775048 786277 783342 780460 779802 777576 783271 779219 778585
31320 778585 769760 774975 771228 766397 759318 753034 768882 782902 782981 780085 782113 775619 771380 774566
31306 774566 777987 769939 769220 776650 776101 770158 764082 770064 782901 796864 796801 786847 786112 777480 775633
31291 775633 776432 773691 773884 783983 788691 787648 784651 781878 781373 777094 773787 770176 775069 775272 781640
31276 781640 784991 791663 788677 774727 774275 782665 796441 789801 782949 778836 775377 778472 782518 782170
31262 782170 787709 790136 785601 788338 782041 780853 782055 780029 781197 785460 788618 792781 791176 784118
$$ [...]
##END NTUPLES=NMR SPECTRUM
##END=
