##TITLE=Analysis number 317446
Compound Code cc 38539
Book Reference 449/72
Project Code qc-cat
Chemist Name davee
##JCAMPDX= 6.0         $$ Bruker NMR JCAMP-DX V2.0
##DATA TYPE= NMR SPECTRUM
##DATA CLASS= NTUPLES
##ORIGIN= Bruker BioSpin GmbH
##OWNER= nmr
$$ XWIN-NMR		Version 3.5
$$ Mon Feb 20 17:02:13 2006 GMT Standard Time (UT+0h)  MAYBRIDGE\nmr@NMR_250MHZ
##.OBSERVE FREQUENCY= 250.131544655141
##.OBSERVE NUCLEUS= ^1H
##.ACQUISITION MODE= SIMULTANEOUS (DQD)
##.ACQUISITION SCHEME= undefined
##.AVERAGES= 16
##.DIGITISER RES= 18
##SPECTROMETER/DATA SYSTEM= dpx250
##.PULSE SEQUENCE= zg30
##.SOLVENT NAME= CDCl3
##.SHIFT REFERENCE= (INTERNAL, CDCl3, 0, 16.4375)
##AUDIT TRAIL= $$ (NUMBER, WHEN, WHO, WHERE, WHAT)
$$ ##TITLE= Audit trail, XWIN-NMR		Version 3.5
$$ ##JCAMPDX= 5.01
$$ ##ORIGIN= Bruker BioSpin GmbH
$$ ##OWNER= nmr
$$ C:\u/data/dgb/nmr/ADRS/16410/pdata/1/auditp.txt
$$ ##AUDIT TRAIL=  $$ (NUMBER, WHEN, WHO, WHERE, WHAT)
(   1,<2006-02-20 17:01:39.78 +000>,<MAYBRIDGE\nmr>,<NMR_250MHZ>,
      <created by zg, POWCHK disabled, PULCHK disabled
       configuration hash MD5:
       84 BC 41 DB A1 6E 1D 46 DA 25 12 A5 C1 ED C5 3A
       data hash MD5: 64K
       DE 97 01 F5 54 95 D0 2C 7D 0E 0D 06 FD 8B F8 DB>)
(   2,<2006-02-20 17:01:56.61 +000>,<MAYBRIDGE\nmr>,<NMR_250MHZ>,
      <Start of raw data processing
       ef LB = 0.3 FT_mod = 6 PKNL = 1 SI = 32K 
       data hash MD5: 32K
       34 BC 86 55 1E 64 6D 30 23 9E E7 5D 71 3D DC 82>)
(   3,<2006-02-20 17:02:01.07 +000>,<MAYBRIDGE\nmr>,<NMR_250MHZ>,
      <apk 
       data hash MD5: 32K
       69 DB D2 4B A0 3E 56 AE 56 34 B4 35 37 7B B3 1D>)
(   4,<2006-02-20 17:02:02.32 +000>,<MAYBRIDGE\nmr>,<NMR_250MHZ>,
      <abs ABSG = 5 
       data hash MD5: 32K
       25 A8 7A EF B2 C2 C5 85 72 1A A3 8E C9 FE FE 00>)
$$ ##END=
$$ 
$$ hash MD5
$$ 51 2E 39 26 8C 8E 29 CA 0E 69 38 06 4E 46 16 E0
##$RELAX= 
##$RELAX= 
##$RELAX= 
##$RELAX= 
##$RELAX= 
##$RELAX= 
##$RELAX= 
$$ Bruker specific parameters
$$ --------------------------
##$DU= <C:\u>
##$EXPNO= 16410
##$NAME= <ADRS>
##$PROCNO= 1
##$TYPE= <nmr>
##$USER= <dgb>
##$AMP= (0..31)
100 100 100 100 100 100 100 100 100 100 100 100 100 100 100 100 100 100 
100 100 100 100 100 100 100 100 100 100 100 100 100 100 
##$AQSEQ= 0
##$AQ_mod= 3
##$AUNM= <au_zg>
##$AUTOPOS= <55 >
##$BF1= 250.13
##$BF2= 250.13
##$BF3= 250.13
##$BF4= 250.13
##$BF5= 500.13
##$BF6= 500.13
##$BF7= 500.13
##$BF8= 500.13
##$BYTORDA= 1
##$CFDGTYP= 0
##$CFRGTYP= 5
##$CHEMSTR= <none>
##$CNST= (0..31)
1 1 145 1 1 1 1 1 1 1 1 1 1 1 1 1 1 1 1 1 1 1 1 1 1 1 1 1 1 1 1 1 
##$CPDPRG= <>
##$CPDPRG1= <>
##$CPDPRG2= <>
##$CPDPRG3= <>
##$CPDPRG4= <mlev>
##$CPDPRG5= <mlev>
##$CPDPRG6= <mlev>
##$CPDPRG7= <mlev>
##$CPDPRG8= <mlev>
##$CPDPRGB= <>
##$CPDPRGT= <>
##$D= (0..31)
0 1 0 0 0 0 0 0 0 0.06 0 0 0 0 0 0 0.0002 0 0 0 0 0 0 0 0 0 0 0 0 0 0 
0 
##$DATE= 1140454898
##$DBL= (0..7)
120 120 120 120 120 120 120 120 
##$DBP= (0..7)
150 150 150 150 150 150 150 150 
##$DBP07= 0
##$DBPNAM0= <>
##$DBPNAM1= <>
$$ [...]
##$SUBNAM7= <"">
##$SUBNAM8= <"">
##$SUBNAM9= <"">
##$SW= 20.6930455092707
##$SWIBOX= (0..15)
0 0 3 0 0 0 0 0 0 0 0 0 0 0 0 0 
##$SW_h= 5175.983436853
##$TD= 65536
##$TD0= 1
##$TE= 294.16
##$TE2= 300
##$TE3= 300
##$TEG= 300
##$TL= (0..7)
0 120 120 120 120 120 120 120 
##$TP= (0..7)
150 150 150 150 150 150 150 150 
##$TP07= 0
##$TPNAME0= <>
##$TPNAME1= <>
##$TPNAME2= <>
##$TPNAME3= <>
##$TPNAME4= <>
##$TPNAME5= <>
##$TPNAME6= <>
##$TPNAME7= <>
##$TPOAL= (0..7)
0.5 0.5 0.5 0.5 0.5 0.5 0.5 0.5 
##$TPOFFS= (0..7)
0 0 0 0 0 0 0 0 
##$TUNHIN= 0
##$TUNHOUT= 0
##$TUNXOUT= 0
##$USERA1= <user>
##$USERA2= <user>
##$USERA3= <user>
##$USERA4= <user>
##$USERA5= <user>
##$V9= 5
##$VALIST= <valist>
##$VCLIST= <CCCCCCCCCCCCCCC>
##$VD= 0
##$VDLIST= <DDDDDDDDDDDDDDD>
##$VPLIST= <PPPPPPPPPPPPPPP>
##$VTLIST= <TTTTTTTTTTTTTTT>
##$WBST= 1024
##$WBSW= 4
##$XGAIN= (0..3)
0 0 0 0 
##$XL= 0
##$YL= 0
##$YMAX_a= 448722
##$YMIN_a= -473398
##$ZGOPTNS= <>
##$ZL1= 120
##$ZL2= 120
##$ZL3= 120
##$ZL4= 120
##$ABSF1= 16.43753
##$ABSF2= -4.255642
##$ABSG= 5
##$ABSL= 3
##$ALPHA= 0
##$AQORDER= 0
##$ASSFAC= 0
##$ASSFACI= 0
##$ASSFACX= 0
##$ASSWID= 0
##$AUNMP= <proc_1d>
##$AZFE= 0.1
##$AZFW= 0.1
##$BCFW= 0
##$BC_mod= 0
##$BYTORDP= 0
##$COROFFS= 0
##$CY= 12.5
##$DATMOD= 1
##$DC= 0
##$DFILT= <>
##$DTYPP= 0
##$F1P= 14.0000005364418
##$F2P= -0.99999901652339
##$FCOR= 0.5
##$FTSIZE= 32768
##$FT_mod= 6
##$GAMMA= 0
##$GB= 0
##$INTBC= 1
##$INTSCL= 1
##$ISEN= 128
##$LB= 0.3
##$LEV0= 0
##$LPBIN= 0
##$MAXI= 10000
##$MC2= 0
##$MEAN= 0
##$ME_mod= 0
##$MI= 0
##$NCOEF= 0
##$NC_proc= -2
##$NLEV= 6
##$NOISF1= 0
##$NOISF2= 0
##$NSP= 0
##$NTH_PI= 0
##$NZP= 0
##$OFFSET= 16.43753
##$PC= 1
##$PHC0= 242.2748
##$PHC1= 5.953787
##$PH_mod= 1
##$PKNL= yes
##$PPARMOD= 0
##$PSCAL= 4
##$PSIGN= 0
##$REVERSE= no
##$SF= 250.130021125753
##$SI= 32768
##$SIGF1= 0
##$SIGF2= 0
##$SINO= 400
##$SIOLD= 32768
##$SREGLST= <1H.CDCl3>
##$SSB= 0
##$STSI= 32768
##$STSR= 0
##$SW_p= 5175.98343685301
##$SYMM= 0
##$S_DEV= 0
##$TDeff= 65536
##$TDoff= 0
##$TI= <Analysis number 999999
Compound Code 99
Book Reference 9
Project Code 9>
##$TILT= no
##$TM1= 0
##$TM2= 0
##$TOPLEV= 0
##$USERP1= <user>
##$USERP2= <user>
##$USERP3= <user>
##$USERP4= <user>
##$USERP5= <user>
##$WDW= 1
##$XDIM= 32768
##$YMAX_p= 408389932
##$YMIN_p= -37120
$$ End of Bruker specific parameters
$$ ---------------------------------
##NTUPLES= NMR SPECTRUM
##VAR_NAME=  FREQUENCY,     SPECTRUM/REAL,   SPECTRUM/IMAG
##SYMBOL=    X,             R,               I
##VAR_TYPE=  INDEPENDENT,   DEPENDENT,       DEPENDENT
##VAR_FORM=  AFFN,          ASDF,            ASDF
##VAR_DIM=   32768,         32768,           32768
##UNITS=     HZ,            ARBITRARY UNITS, ARBITRARY UNITS
##FACTOR=    0.157963299565203, 1,           1
##FIRST=     4111.51985561703, 0,            0
##LAST=      -1064.46358123598, 0,           0
##MIN=       -1064.46358123598, -37120,      0
##MAX=       4111.51985561703, 408389932,    0
$$ Real data points
##PAGE= N=1
##DATA TABLE= (X++(R..R)), XYDATA
$$ [...]
15222A554r799l390k345L483J437q07r06J003J271Q036L045m862n70J601j871
15207c120n666j560k990j297n964M393Q841j821M913K995l879j834K477j271M788
15192i95q48m572m24K497K972j657m997m313J176K234P67M665m653l41P732k476
15176c233k325j99N704J514J474k801l986J99K560N164o509r427J586K649Q211
15161E81K967k898m399k290O05J177k096K772N72j215p14r004m600O476O099J691
15145d276m508P281j244n935K783m36o099n14K730p53L80J093J591P527j823j171
15129c374M527M01n268j740j08J294k083l058J309K737N565J550l24l817L661
15114A272Q7M62k116o737l67M814l437l166j036N073J548J469J272J2r187m973
$$ plain form
15222 1554 -8245 -11635 -13980 -10497 -9060 -9867 -10773 -9770 -8499 -463 2582 -2280 -2850 -1249 -3120
15207 -3120 -8786 -10346 -13336 -14633 -20597 -16204 -7363 -9184 -4271 -1276 -5155 -6989 -4512 -5783 -995
15192 -995 -1843 -6415 -6839 -4342 -1370 -3027 -8024 -12337 -11161 -8927 -8160 -3495 -8148 -8489 -757 -3233
15176 -3233 -5558 -5757 -53 1461 2935 134 -3852 -3653 -1093 4071 -2438 -11865 -10279 -7630 581
15161 581 3548 650 -3749 -6039 -5434 -4257 -6353 -3581 -3009 -4224 -4938 -13942 -18542 -12066 -5967 -4276
15145 -4276 -8784 -1503 -2747 -8682 -5899 -6335 -12434 -12948 -10218 -10971 -10591 -9498 -7907 -380 -2203 -3374
15129 -3374 1153 1554 -3714 -5454 -5562 -4268 -6351 -9409 -8100 -5363 202 1752 1428 -2389 1272
15114 1272 1359 1821 -295 -7032 -7399 -2585 -6022 -9188 -10224 -5151 -3603 -2134 -862 -850 -10037 -15010
15098a5010J703Q472L84l913M369J0719M155q63m6l145p161n333O48L070O062
15083D111l435K069K52o450O05L503k07l497K506m99l858k737O288J2066q30j474
15067H413q89o829L188M614l466j734K287k239j444K310J78N12o835o368N49n360
15051a3113o53P098Q429j128j1235o296k568P177Q440O367J05q16m892q40L576
15036c49N300L874k853j3070o061j933J595K758L895R775R225q930p710o858j3
15021a1355J055p01L615O998J074o096J827N564j383M734O39j997n791l239k985
15006h041m660R8J3811R133l082p077k43m132n845k970J292K514k258K684j016
14991i792k124k42Q024R0q34l618j1529J53L659L907K911J883O89L107L086M760
$$ plain form
15098 -15010 -13307 -4835 -4451 -8364 -3995 6724 10879 10016 9970 6825 -336 -5669 -5021 -1951 4111
15083 4111 676 2745 2997 -3453 -2848 655 448 -3049 -543 -1042 -4900 -7637 -1349 10717 9887 8413
15067 8413 7524 695 3883 8497 5031 3297 5584 3345 1901 4211 4389 4901 -1934 -8302 -7753 -13113
15051 -13113 -13766 -6668 1761 633 -10602 -16898 -19466 -12289 -3849 2518 2623 1807 -3085 -3925 -349
15036 -349 4951 8825 5972 -7098 -13159 -15092 -13497 -10739 -6844 2931 12156 3226 -4484 -11342 -11355
15021 -11355 -10300 -11001 -7386 -388 686 -5410 -3583 1981 598 5332 5971 3974 -1817 -5056 -8041
15006 -8041 -12701 -12603 1208 10341 7259 182 -61 -4193 -10038 -13008 -11716 -9202 -11460 -8776 -9792
14991 -9792 -11916 -12158 -4134 -4044 -4878 -8496 -20025 -19872 -16213 -12306 -9395 -7512 -6823 -3716 -630 4130
14975D130N826q05l640m006p092k032R828N021o196o678P26k589k484J642m750
14960a3099p190Q717O611P676N00l926l218K194j19m419O170L515o76k053k624
14945a941L617m623k426R26j021J581M091k591p579k325Q936O116l014k476k705
14930e434L289J953j0901j691L434k049K625N458r008k954L006K090K159O648
14916a375j048r32l535m430j362M550P797Q96J365j037n204l346q27O93R41J639
14900e215M709N96l392J199L351J552o052j976j133p471K105Q463J193O119P819
14885A1867j286j0576k340O950R03q720K738P707K563k605q8P269K315j855n009
14870I833m728o069Q39k538L554k237J029j96O761L808k857j1405k117l8n344
$$ plain form
14975 4130 9956 9151 5511 1505 -5587 -7619 2209 7230 1034 -5644 -4918 -7507 -9991 -8349 -13099
14960 -13099 -20289 -11572 -4961 2715 3215 -711 -3929 -1735 -1854 -6273 -103 3412 2736 683 -1941
14945 -1941 1676 -2947 -5373 -4447 -5468 -3887 204 -2387 -9966 -12291 -3355 2761 -253 -2729 -5434
14930 -5434 -2145 -192 -11093 -12784 -9350 -11399 -8774 -3316 -12324 -15278 -12272 -10182 -8023 -1375
14916 -1375 -2423 -3355 -6890 -11320 -12682 -8132 -335 561 1926 889 -4315 -7661 -8488 -7795 -6854 -5215
14900 -5215 -506 90 -3302 -2103 1248 2800 -3252 -5228 -6361 -13832 -11727 -3264 -2071 4048 11867
14885 11867 10581 5 -2335 4615 5518 -3202 -464 7243 9806 7201 7113 14382 16697 14842 9833
14870 9833 5105 -964 -125 -2663 891 -1346 -317 -513 6248 10056 7199 -4206 -6323 -6361 -11705
14855a1705M25N225n492l434K066Q078P618N447j068l293J673J02n281K834N03
14840C698j133P184j533j0169o16J603J060j575M346N957P48K189k989j3813l443
14825h486M577L978J796K636j142r627K786R99p64n512r215q78L581J435K781
14810a1055q455j494P401R67j382N365j30O910O523r285m801N934J465m978o644
14795a3659K324j178K119J0465J842j78j55k334M439P4n302p156L138J711j499
14780e349K082m627J010J424M27J574j347n88Q37o310q284O247L726k481q84O26
14764a1917O172o30O83n959J147M506J286k96J479k87j012j878K592J319j428
14749d223l40r85k686j036l031R054P865l371p832O033p53k299m86r390n026L036
$$ plain form
14855 -11705 -11280 -6055 -11547 -14981 -12915 -4837 2781 8228 7160 3867 5540 5642 361 3195 3698
14840 3698 2565 9749 8216 -1953 -2569 -966 94 -1481 2865 8822 9570 11759 8770 -5043 -8486
14825 -8486 -3909 69 1865 4501 3359 -6268 -3482 -2483 -3247 -8759 -17974 -18852 -15271 -13836 -11055
14810 -11055 -19510 -21004 -13603 -12636 -14018 -8653 -8783 -1873 4650 -4635 -9436 -3502 -2037 -7015 -13659
14795 -13659 -11335 -12513 -10394 71 1913 1735 1580 -754 3685 3759 -1543 -8699 -5561 -3850 -5349
14780 -5349 -3267 -7894 -6884 -5460 -5033 -3459 -4806 -5394 -4557 -10867 -19151 -12904 -9178 -11659 -12543 -11917
14764 -11917 -5745 -6375 -5692 -11651 -10504 -5998 -4712 -5008 -3529 -3816 -4828 -6706 -4114 -2795 -4223
14749 -4223 -4563 -5548 -8234 -9270 -12301 -3247 4618 1247 -6585 -552 -1305 -3604 -4090 -13480 -18506 -15470
14733a5470P075l83j183K779N373l798n318K129M420j858k513q34K407M963k40
14718b451k477m77o56K535K581k636J972J291j806N764L679n18j722O392j114
14703A0357L413k098j1539p221R754J627J317L279m479m777l960m799J714j679
14689i091L905k95K483L26o554J358j281O336O526j665r480n582K72k144K606
14674a2280M337J861O272j441J906k90J803o24J337m350n016O576K011L790p009
14659a117j139J166j37n517o54N696J029L516j167n12j796m64J626K384M027j769
14643E172o693J226j017j459J322P47J065j400p600m868n1N955K485n332P250
14628c198Q802k213o699K19l011n235j731m85K183m277l172L680L663K859k100
$$ plain form
14733 -15470 -8395 -8778 -9961 -7182 -1809 -5607 -10925 -8796 -4376 -6234 -8747 -9581 -7174 -2211 -2451
14718 -2451 -4928 -5405 -6061 -3526 -945 -3581 -1609 -318 -2124 3640 7319 6801 5079 11471 10357
14703 10357 13770 11672 133 -7088 2666 4293 5610 8889 4410 -367 -4327 -9126 -7412 -9091
14689 -9091 -5186 -5481 -2998 -2672 -9226 -7868 -9149 -2813 3713 2048 -7432 -13014 -12742 -14886 -12280
14674 -12280 -7943 -6082 190 -1251 655 365 2168 1544 2881 -1469 -6485 91 2102 5892 -1117
14659 -1117 -2256 -1090 -1227 -6744 -7398 -1702 -673 2843 1676 1164 -632 -1096 530 2914 6941 5172
14643 5172 -1521 -295 -1312 -2771 -1449 -702 363 -1037 -8637 -13505 -13556 -7601 -5116 -10448 -3198
14628 -3198 5604 3391 -3308 -3089 -6100 -11335 -13066 -13551 -11368 -15645 -18817 -15137 -11474 -8615 -10715
14613a0715j317J926l955K810Q30o52M478j016k336J438J253J952l99j273M0M620
14597b316O865N05o104l527q08M853j899l707k441j703J512L626q99j408L495
14582c956L981J916r09m396n307K616r09l3Q118K886m75m006n981l497o816L142
14566a3626M546n1P466O447k358J601J804l51j499l545N50K11P385k93r625L19
14550a019K169o346N192O36l034l137N193l853j557m645J855O005K514m017m170
14535h214L728O460O605j680J907k216n482M09L596o329l27j573o611j078L525
14520g280P225N774o69o151R9J931k50L712n840M452p25k788J1332j75k514k907
14504E226k247j80P935j53J214L912K488J137p627j731M231J786L23R527Q632
$$ plain form
14613 -10715 -12032 -10106 -14061 -11251 -10421 -11073 -6595 -7611 -9947 -8509 -7256 -5304 -5703 -6976 -6936 -2316
14597 -2316 4549 5054 -1050 -4577 -5385 -532 -2431 -6138 -8579 -10282 -8770 -5144 -6043 -7451 -3956
14582 -3956 25 1941 1032 -3364 -8671 -6055 -6964 -6997 1121 4007 3532 -474 -6455 -9952 -16768 -13626
14566 -13626 -9080 -9131 -1665 4782 2424 4025 5829 5478 3979 434 984 1195 8580 8287 -1338 -1019
14550 -1019 1150 -5196 -4 632 -2402 -5539 -346 -4199 -5756 -10401 -8546 -2541 -27 -4044 -8214
14535 -8214 -4486 1974 8579 6899 8806 6590 1108 1517 5113 -1216 -1543 -3116 -9727 -10805 -7280
14520 -7280 -55 5719 5050 -1101 -1002 929 679 4391 -1449 3003 2278 -510 10822 10647 8133 5226
14504 5226 2979 2799 10734 10581 11795 15707 18195 19332 11705 9974 14205 15991 16314 25841 34473
14489C4473n454j264J4928J2162m748N323J4225M903L832L650j231j842L473m072
14475G8358n346r25o409k989q05j0099n531n731j467j381j878l972q02J545p722
14460B4846j0619m142K337k714N558M223n322j666l907J689j77p656l588M327
14446C189P424J283l209p664L871N300l369O60l060L952O494j577l592m206l478
14431B018L361%k816oo641J296J1270q99o384n118K54K962j266l879K073j198
14415d973o635l499J0901P170j827K460j52P79J55n307P239L646n214N03J726
14400F972p307k078L079J071n312p08J061k169j623M058j8n804n054l311M294
14385a2849J538L210o21J612K170l035o815l507N541J1345P515n678j0257l376
$$ plain form
14489 34473 29019 27755 42683 54845 50097 55420 69645 74548 78380 82030 80799 78957 82430 78358
14475 78358 73012 72087 65678 62689 61884 51785 46254 40523 39056 37675 35797 31825 31023 32568 24846
14460 24846 14227 10085 12422 9708 15266 19489 14167 12501 8594 10283 10106 2450 -1138 3189
14446 3189 10613 11896 8687 1023 4894 10194 6825 7485 4425 8377 14871 13294 9702 5496 2018
14431 2018 5379 5379 2563 2557 -4084 -2788 8482 7583 1199 -3919 -3665 -703 -1969 -5848 -3775 -4973
14415 -4973 -11608 -15107 -4206 2964 1137 3597 3445 4224 4379 -928 6311 9957 4743 5246 6972
14400 6972 -335 -2413 666 1737 -3575 -4283 -3222 -5391 -7014 -2956 -2974 -8778 -13832 -17143 -12849
14385 -12849 -11311 -8101 -8722 -7110 -4940 -7975 -14790 -18297 -12756 -1411 6104 426 -9831 -13207
14371a3207L522J1139K283r010q875k923P026J919k680R00O975q49r71M791k581
14356b541k920j034k310j56M256N299j481j276m527R1n180o252m740l074O688
14341a9157N887q59j577O819P41j742j233m46n754Q449N149J445N735R42j89o56
14325C554l539Q8k553M135o01j416L174n5o053j247p03L919k959N733j873q112
14309h508Q284L89n995n11K444L728K863m96o341k978Q80N608L437P029Q194k601
14293A5426j2509j240M781p81J993m479o387l647L236L449L496K016l167J984
14279D171O94j021k453n408o548P0k495K729k918l917L098N596K446P134k622
14264a444j735K445P64k216k07J739L32k268k20O381j270K122p552m566o568l247
$$ plain form
14371 -13207 -9685 1454 3737 -5273 -14148 -17071 -10045 -8126 -10806 -9906 -2931 -3780 -4751 40 -2541
14356 -2541 -5461 -6495 -8805 -8961 -4705 594 -887 -2163 -6690 -6599 -11779 -18031 -22771 -25845 -19157
14341 -19157 -13270 -14129 -15706 -8887 -8146 -9888 -11121 -11567 -17321 -8872 -3723 -2278 3457 4399 4210 3554
14325 3554 15 103 -2450 1685 1084 -332 2842 2787 -3266 -4513 -5216 -1297 -4256 1477 -396 -8508
14309 -8508 -224 165 -5830 -6341 -3897 -169 2694 2198 -4143 -7121 -6241 -633 2804 9833 18027 15426
14293 15426 2917 1677 6458 5677 7670 3191 -3196 -6843 -3607 -158 3338 5354 2187 4171
14279 4171 4865 3844 1391 -4017 -10565 -10495 -12990 -10261 -13179 -17096 -13998 -8402 -5956 1178 -1444
14264 -1444 -3179 -734 30 -2186 -2393 -654 -322 -2590 -2810 3571 2301 4423 -3129 -7695 -14263 -17510
14248a7510L227Q253K434J784L982L525m660l319l897j26j062j0591j845J664
14234a8141n36N275N130j092K225J875M565M381L025k715M500J4849j040q762
14220A3539l714o450l895j171L13J527j928n99n920L474J037K801K497M690j605
14205D596j0740n344K339L889M839k248n829q25n26N910J396Q1J057j0054p420
14190a8879J820R633N862K748j135m41k52l054L659r21O744L068k691j597k034
14175B530N47J447o268m578J740R35K214l666n042J0355K389M84K096n23o542
14160a882o8J930R40L191n172l096L605n44k72m416P549M819O31k030p621m772
14144g208p81K469K159J186J489J253K914L904k520k208J491l741m125j93K057
$$ plain form
14248 -17510 -14283 -6030 -3596 -1812 2170 5695 1035 -2284 -6181 -6307 -7369 -17960 -19805 -18141
14234 -18141 -18677 -13402 -8272 -9364 -7139 -5264 -699 3682 6707 3992 8492 23341 22301 13539
14220 13539 9825 3375 -520 -1691 -1378 149 -1779 -2378 -8298 -4824 -3787 -986 1511 6201 4596
14205 4596 -6144 -11488 -9149 -5260 -421 -2669 -8498 -9323 -9849 -3939 -2543 -2462 -1405 -11459 -18879
14190 -18879 -17059 -7426 -1564 1184 49 -392 -644 -3698 -39 -960 5784 8852 6161 4564 2530
14175 2530 3077 4524 -1744 -6322 -4582 -3647 -1433 -5099 -10141 214 2603 3087 5183 4660 -1882
14160 -1882 -1950 -20 920 4111 -1061 -4157 -552 -1096 -1368 -5784 1765 6584 7215 5185 -2436 -7208
14144 -7208 -7989 -5520 -3361 -2175 -686 567 3481 7385 4865 2657 4148 407 -3718 -3911 -1854
14129a854k318O74N296J555l183k841k744M965R353K367j328n454n378P514K8
14114F652j979m320l823m330k186L235O417M11j0081k959J48K460J0862O01j864
14099g56j929O64o337l127k396k094N482O659j084K802j131j598N004M509j335
14084C333q659J607o540R79L993Q518P676j997p148m050m292m592P564L080J402
14069H74n855k89O312J802q553p777j503O060J0877p29p541o15M502o08O296L71
14053C624m353l143k088M3j640j298L982Q139l04J30L542l425N40J031o793j3305
14037a5318L372P552O32l536l852L105Q61L239M243m554P392j714l619P284l683
14022A404o689L527k363k014k280N634Q69m133j071L494L559J677n989j0422j896
$$ plain form
14129 -1854 -4172 -3498 1798 3353 170 -2671 -5415 -450 8903 11270 9942 4488 -890 6624 6652
14114 6652 4673 353 -3470 -7800 -9986 -6751 -334 77 -10004 -12963 -12815 -10355 507 1108 -756
14099 -756 -2685 -2021 -8358 -11485 -13881 -15975 -10493 -3834 -4918 -2116 -3247 -4845 159 4668 3333
14084 3333 -5326 -3719 -10259 -9280 -5287 3231 10907 8910 1762 -2288 -6580 -11172 -3608 -528 874
14069 874 -4981 -5270 1042 2844 -5709 -13486 -14989 -8929 1948 1219 -6322 -6937 -2435 -3043 3253 3624
14053 3624 -729 -3872 -5960 -5917 -7557 -8855 -4873 3266 2962 3092 6634 3209 3749 4780 -2013 -15318
14037 -15318 -11946 -4394 -3762 -7298 -11150 -8045 -7184 -3945 298 -4256 3136 1422 -2197 5087 1404
14022 1404 -5285 -1758 -4121 -6135 -8415 -2781 -1912 -6045 -7116 -3622 -63 1614 -4375 -14797 -16693
14007a6693k742R69L474M106j598r30K313J011k358J33Q124K225J155n248k887
13992h946O956N206n327k431p73o492m288R562M437k631K746J8l523m001l416
13977a2903J166N015Q860o38n91k404m338J813J506j300k456o269j188o60m744
13962a9131M483l485J09R093Q520K200j094j980r139k009J255M281N120m448j768
13947g993M718O042O514l658o139O15k277M111K437l469j674J255j136K305J613
13932C264k084J890K958n644n961J486j051Q58O1P88p474K684q13p166J42J105
13916a4957Q725L207K637N856r8k981p019p157m741j551N868J0228O882K6J0K505
13900G440M90o44j55n914p030K294m351n044J642J911l712J719O97n842M67J24
$$ plain form
14007 -16693 -19435 -18466 -14992 -10886 -12484 -13414 -11101 -10090 -12448 -12315 -4191 -1966 -811 -6059 -8946
13992 -8946 -1990 3216 -2111 -4542 -5315 -11807 -16095 -6533 -2096 -4727 -1981 -1963 -5486 -9487 -12903
13977 -12903 -11737 -6722 2138 1500 909 -1495 -5833 -4020 -2514 -3814 -6270 -12539 -13727 -14387 -19131
13962 -19131 -14648 -18133 -18024 -8931 -411 1789 695 -1285 -10424 -12433 -11178 -6897 -1777 -6225 -7993
13947 -7993 -3275 2767 9281 5623 -516 99 -2178 1933 4370 901 -773 482 -654 1651 3264
13932 3264 1180 3070 6028 384 -5577 -4091 -5142 -4284 -4223 -3435 -10909 -8225 -9038 -16204 -16062 -14957
13916 -14957 -6232 -3025 -388 5468 5370 2389 -4630 -11787 -16528 -18079 -12211 -1983 4899 4925 4935 7440
13900 7440 7930 7286 7131 1217 -5813 -3519 -7870 -12914 -11272 -9361 -13073 -11354 -10657 -16499 -16032 -15908
13884a5908J705l053l855K575O635M091p7L124O048L121L122l761l391L487q82
13869B981K12k225L761L46n079n339Q75k4O62k105M837P914J867p912r222p914
13853a6365J446N458K094J151N068M833r27q96J108p187o890k273J991J0140P502
13838F253J032j162q481m464M540k291j1130O544J3063l00l429j274m562K326
13824c335R26L319J261j120o928j630O36n524P618j614o800l75J0180j55J960
13809a581L358K914m366p532N223J953n768j063J984L689J440l612m39k616J731
13794d685M43m601p133l448O518R013J460L442Q825Q587J072j0033r571q011k457
13779a0579L669M920L639n266K834K850J82O625J868o000L939j358m165n65k639
$$ plain form
13884 -15908 -14203 -17256 -21111 -18536 -11901 -7810 -7887 -4763 1285 4406 7528 3767 376 3863 2981
13869 2981 3193 968 4729 5075 -4 -5343 -4468 -4492 -3830 -5935 -1098 6816 8683 771 -8451 -16365
13853 -16365 -14919 -9461 -7367 -6216 -1148 3685 2758 1862 2970 -4217 -11107 -13380 -11389 -1249 6253
13838 6253 7285 6123 -2358 -6822 -2282 -4573 -15703 -9159 3904 3604 175 -1099 -5661 -3335
13824 -3335 -2409 910 2171 1051 -5877 -7507 -6871 -12395 -4777 -6391 -13191 -13566 -3386 -3541 -1581
13809 -1581 1777 4691 325 -7207 -1984 -31 -5799 -6862 -4878 -1189 251 -3361 -3800 -6416 -4685
13794 -4685 -4242 -8843 -15976 -19424 -12906 -3893 -2433 1009 9834 18421 19493 9460 -111 -8122 -10579
13779 -10579 -6910 -1990 1649 -3617 -783 2067 2249 8874 10742 4742 8681 7323 3158 2593 -46
13764d6J162N208L012K775j158l511n062k811j131m7l489j623n733m700N930P809
13748c415M194K239pL971j054q634Q0O83n414k820J463M120q80J274k62n171r0
13731i723M77n648q52l472N474k365M77L907N38r72k048J801l910J83N793j131
13715a1471P108N117K078o16r27p417o384N256M348N156K962M700Q11j868j0922
13700b069q427q81K039L408l942J577l293q83N009J0013J797k054o572K45J648
13685b385k864j835L69K020M210l005M226rL622m161n814R097P82p099j177J382
13669b641k35j215n520p88M522o148q61q43Q117p51K503N454O51j992j516p52
13653b015J192K853k18K512q23J930N041m961j817L133L573l416M828J068l685
$$ plain form
13764 -46 1116 6324 9336 12111 10953 7442 2380 -431 -1562 -1609 -5098 -6721 -12454 -17154 -11224 -3415
13748 -3415 779 3018 3011 6982 5928 -2706 -2626 -1943 -7357 -10177 -8714 -4594 -5474 -4200 -4462 -9633 -9723
13731 -9723 -9246 -14894 -15746 -19218 -13744 -16109 -15632 -11725 -11187 -12159 -14207 -12406 -16316 -16133 -10340 -11471
13715 -11471 -4363 754 2832 2216 1289 -6128 -12512 -7256 -2908 2248 5210 9910 10721 8853 -2069
13700 -2069 -10496 -11377 -9338 -5930 -9872 -8295 -11588 -12471 -7462 2551 4348 2294 -4278 -4033 -2385
13685 -2385 -5249 -7084 -6715 -4695 -485 -3490 736 727 4349 188 -5626 3471 4253 -2846 -4023 -2641
13669 -2641 -2876 -4091 -9611 -10399 -5877 -12025 -12886 -13729 -5612 -6363 -3860 1594 2245 253 -1263 -2015
13653 -2015 -823 2030 1812 4324 3501 5431 10472 5511 3694 6827 10400 6984 11812 12880 9195
13638I195K483l021M13l336j836K852P838P880M949l912p781j0562l546L469M774
13623I859J669o087m982L135M765k725J884L736n134k841l596J914M938R44j005
13608F474k608K513K775o872l339L379M91L13o13k979o409M43J883M15J378J447
13592a309O12p081M247P380l44q465O277L335o901j153J880l940M080L085J473
13577C176M083n288n999O022L123m993o635L130J384n011j574J2589Q972J294
13563A4273m910n288p66J05K99K71J657q872k626N901l91J951K936M095k228k464
13547C943m521L943k86j487n820n054l371M135J673P202L587j286J205m934l845
13532d916n79k63P61N547j559n892r43l53M637l699j483K955L576J19k162M85
$$ plain form
13638 9195 11678 8657 9070 5734 3898 6750 14588 22468 27417 23505 15724 5162 1616 5085 9859
13623 9859 11528 5441 459 3594 8359 5634 7518 11254 6120 3279 -317 1597 6535 7479 6474
13608 6474 3866 6379 9154 2282 -1057 2322 2813 3126 2513 -466 -6875 -6432 -4549 -4134 -2756 -1309
13592 -1309 -697 -7778 -3531 3849 3505 -4960 1317 4652 -2249 -3402 -1522 -5462 -1382 1703 3176
13577 3176 7259 1971 -4028 1994 5117 124 -6511 -3381 -1997 -7008 -8582 4007 12979 14273
13563 14273 9363 4075 3309 3414 3713 3984 5641 -3231 -5857 44 -347 1604 4540 8635 6407 3943
13547 3943 -578 3365 3079 1592 -4228 -9282 -12653 -8518 -6845 357 3944 2658 3863 -1071 -4916
13532 -4916 -5495 -5758 -4997 550 -1009 -6901 -7844 -8197 -3560 -7259 -8742 -5787 -2211 -2092 -4254 -3769
13516c769n527J120M735R310m625l654l112K580r85M089L348K18J868j649n126
13501a179j328j35k276k778L298R222j191l677k674j810j007N469P385K267l706
13486E880o793o819j438N049L98n14M765O21j1696M52N312J335k552K900J675
13471a425n876J89N814j955o600j111N247N794R77l550l819M966k966M113j49
13456c51j146m160l738J434j783L625L869j284l314l329m015L669N141M13k514
13441g483L881O72o58j030k427k967M772K346K544K605J433Q65j1788n157K618
13426i774l512K47p26j47J021o575J392L699J191N335K196j739J907O764P74j607
13410D46l863k400L811j76O25L939o118k884j194K813o49k609l021R33N89M331
$$ plain form
13516 -3769 -9296 -8176 -3441 5869 1244 -2410 -5522 -2942 -3927 162 3510 3728 5596 3947 -1179
13501 -1179 -2507 -2642 -4918 -7696 -4398 4824 3633 -44 -2718 -4528 -5535 -66 7319 9586 5880
13486 5880 -913 -7732 -9170 -4121 -3723 -4237 528 1149 -10547 -10095 -4783 -3448 -6000 -3100 -1425
13471 -1425 -7301 -7112 -1298 -3253 -9853 -10964 -5717 77 1054 -2496 -6315 -1349 -4315 -202 -351
13456 -351 -1497 -5657 -9395 -7961 -9744 -6119 -2250 -3534 -6848 -10177 -14192 -10523 -5382 -4969 -7483
13441 -7483 -3602 -2930 -3588 -4618 -7045 -10012 -5240 -2894 -350 2255 3688 4553 -7235 -12392 -9774
13426 -9774 -13286 -13039 -13765 -13912 -12891 -19466 -18074 -14375 -13184 -7849 -5653 -7392 -5485 1279 2053 446
13410 446 -3417 -5817 -2006 -2182 -1557 2382 -3736 -6620 -7814 -5001 -5650 -8259 -11280 -10347 -9758 -5427
13394e427m045L519M648l811p839j244J373K223j612J3971N624k793m224l964
13380c601m637K932j500m054L881K498O062m487o63m476O83M749K439n205m681
13365a0060J208K911J365m760J971P190k136k686M137j136N8R44q29J021m008
13350d810L60J144k969k081q309j832M650P614J482k258o405j233l805k335k800
13335b3587L843N545M736P54K240l101p929n864J0838N314J610K368M413K796
13321C976k93P112k931n058M9M88o170p065P70J346N591K452p465l416K288K3
13305h303j441J692M561m014q855K721J297R02l126j804N658l350j721J392Q453
13290e938L963N383J897j504l249K288K677K658m331L061o897l951k301k528O620
$$ plain form
13394 -5427 -9472 -5953 -1305 -5116 -12955 -14199 -12826 -10603 -12215 1756 7380 4587 363 -3601
13380 -3601 -8238 -5306 -6806 -10860 -6979 -4481 1581 -2906 -3569 -8045 -7362 -2613 -174 -5379 -10060
13365 -10060 -8852 -5941 -4576 -9336 -7365 -175 -2311 -4997 -860 -1996 -1938 -994 -1823 -802 -4810
13350 -4810 -4450 -3306 -6275 -8356 -16665 -18497 -13847 -6233 -4751 -7009 -13414 -14647 -18452 -20787 -23587
13335 -23587 -19744 -14199 -9463 -8709 -6469 -9570 -17499 -23363 -12525 -7211 -5601 -3233 1180 3976
13321 3976 3683 10795 7864 2806 2855 3343 -2827 -9892 -9122 -7776 -2185 267 -7198 -10614 -8326 -8303
13305 -8303 -9744 -8052 -3491 -7505 -16360 -13639 -12342 -11440 -14566 -16370 -10712 -14062 -15783 -14391 -5938
13290 -5938 -1975 3408 5305 3801 552 2840 5517 8175 3844 6905 8 -3943 -6244 -8772 -2152
13275b152J2849L778o046L292k794j0113o878L296m258j624K240M104n487P280
13261b513k70j3252k733R31R411K458m942l85O479N102j336o894K53J511P758
13246A578k036r035m809J045J9O161K927L527M42J363j321o742n186k974N32R933
13230d576L935r265K300Q795j166M896L668K274L018J5624R947m56J4793M501
13216E8288j1829j1283O82J2899L7775N9044K6942j6109j9717l9283l7211q572
13204E1626K1803L9141J3681j8914k6611k6442k0708j5857j0229k170o66O08J18
13191E380l709K744k734l59M060J959n730M563O950M189L287Q245J0176R196J5616
13176F3833K1421K4556K8813K0177k584k4712l0844k5449k3162k1223q591q483
$$ plain form
13275 -2152 10697 14475 8429 11721 8927 -1186 -8064 -4768 -9026 -10650 -8410 -4306 -9793 -2513
13261 -2513 -2783 -16035 -18768 -17837 -8426 -5968 -10910 -11295 -4816 286 -1050 -7944 -7691 -6180 1578
13246 1578 -458 -9493 -14302 -13257 -13238 -7077 -4150 -623 -181 1182 -139 -6881 -12067 -15041 -14509 -4576
13230 -4576 -641 -9906 -7606 1189 23 4919 8587 10861 13879 29503 39450 38994 53787 58288
13216 58288 46459 35176 35858 48757 86532 145576 172518 156409 136692 97409 60198 51626
13204 51626 73429 112570 126251 107337 80726 54284 33576 17719 7490 5320 4654 5262 5380
13191 5380 1671 4415 1681 1322 5382 7341 1611 6174 13124 17313 20600 28845 39021 48217 63833
13176 63833 85254 109810 138623 158800 156216 131504 100660 75211 52049 30826 22235 13752
13164A3752l669o177j931L434O725L456l70j707l240P696N359M3r771j2573K352
13149C379L724L482q93p051L464K557n515p63o83k511k29K155J1488Q549j079
13134B0074K51Q168N564K0940L1928M0541K8441Q500k7468l9342l4449k6338j8121
13121A8689j1052o556o40L365L596L193j378J351q243q331j756P493L203k265
13107F69l484j892J176l545m185k018Q10L676N516p6n28k850k922l192l138L115
13091a2868l62j052J0515Q883L369nJ2953J4373O403N176j744j2961j1998r038
13077A1644m125n992p63n589k879n740l89M15J776L866J527L382J684k589j767
13062e539k690j234K875L01j54n373O281K820l721j754M468K743r26o081m818
$$ plain form
13164 13752 10083 3906 1975 5409 12134 15590 15220 13513 10273 17969 23328 23371 13600 1027 3379
13149 3379 7103 10585 9692 2641 6105 8662 3147 2384 1701 -810 -1039 1116 12604 21153 20074
13134 20074 20325 28493 34057 54997 86925 127466 155907 164407 136939 97597 63148 36810 18689
13121 18689 7637 1081 441 3806 7402 10595 9217 10568 2325 -6006 -7762 -269 2934 669
13107 669 -2815 -4707 -3531 -7076 -11261 -13279 -12469 -8793 -3277 -3353 -3881 -6731 -9653 -12845 -15983 -12868
13091 -12868 -13230 -14282 -3767 5116 8485 8480 21433 35806 42209 47385 45641 32680 20682 11644
13077 11644 7519 1527 764 -4825 -7704 -13444 -13833 -13418 -11642 -7776 -6249 -2867 -1183 -3772 -5539
13062 -5539 -8229 -9463 -6588 -6287 -6441 -11814 -5533 -2713 -6434 -8188 -3720 -977 -1903 -7984 -12802
13047a2802K264L973N06L166k833O088R02l376J765l142j735N060M978o289j1262
13032a2737r406Q89L334L509o57J860N064j369J776k242o72o738L299P108K350
13017d632L296k28n853n849o840J819L605R77N742j05j04j795j638K83J778j448
13001a0992L93J243j085J9k456k607Q474O427L997m682l383L912O367o318n690
12986f381L989J376k639J342L075k153K120l641k587O581J500N92n336n305j184
12971h651N054M888m635K410J508l803K491l083l00L72k945M97o60o426j67M573
12955h877Q628K233m714n234K320Q420J700l687r017p218N061R023N244j216L173
12940E839K106o733k731l7r8O127K513k105n157n681p971o241M597K766M188J348
$$ plain form
13047 -12802 -10538 -6565 -6059 -2893 -5726 362 1264 -2112 -347 -3489 -5224 -164 4814 -1475 -12737
13032 -12737 -22143 -21254 -17920 -14411 -15068 -13208 -8144 -9513 -7737 -9979 -10651 -17389 -14090 -6982 -4632
13017 -4632 -1336 -1564 -7417 -13266 -20106 -18287 -14682 -13705 -7963 -8068 -8172 -9967 -11605 -11322 -9544 -10992
13001 -10992 -10599 -9356 -10441 -10422 -12878 -15485 -7011 -584 3413 -1269 -4652 -740 5627 -691 -6381
12986 -6381 -2392 -1016 -3655 -2313 762 -1391 729 -2912 -5499 1082 2582 3174 -2162 -7467 -8651
12971 -8651 -3597 1291 -3344 -934 574 -3229 -738 -3821 -4121 -3749 -6694 -6197 -6857 -13283 -13450 -8877
12955 -8877 -249 1984 -2730 -7964 -5644 2776 4476 789 -8228 -15446 -10385 -1362 3882 2666 5839
12940 5839 7945 1212 -1519 -1556 -1654 4473 6986 4881 -276 -5957 -13928 -20169 -15572 -12806 -8618 -7270
12924g270m654O7K547p028k373k745N37L36J859J1306R977J609J100O145K678
12909A4091k663q663p43m39M699K980k194L518j039m887j739k788o693K20L561
12894b779K185M861j899j056J390q845k411L473O43j419L568k072O956K852q104
12879b657m968o079J658N735L293m113n752j943P843J1548o669j0429k255N719
12865i069K749l241J568P857j064k239l326o3n13n2m461J761N387N263K706m507
12849a244o627n371L67L885N056O85o616l892m286K439J698J241N882N29j059
12834g313K135l45j399j55O550P97k694j06P54n665N1J902Q79R124J571j416p91
12817C879p241j663J195J171J085N207K282n983p071n775L764M674O914N653k859
$$ plain form
12924 -7270 -11924 -11857 -9310 -16338 -18711 -21456 -20919 -20583 -18724 -7418 2559 4168 5268 11413 14091
12909 14091 11428 2765 2022 1583 6282 9262 7068 10586 9547 4660 2921 133 -6560 -6340 -2779
12894 -2779 -594 4267 2368 1312 2702 -6143 -8554 -5081 -4438 -5857 -2289 -4361 2595 5447 -2657
12879 -2657 -7625 -13704 -12046 -6311 -3018 -7131 -12883 -14826 -6983 4565 -2104 -12533 -14788 -9069
12865 -9069 -6320 -9561 -7993 -136 -1200 -3439 -6765 -6828 -7341 -7393 -11854 -10093 -4706 557 3263 -1244
12849 -1244 -7871 -13242 -12875 -8990 -3934 -3249 -9865 -13757 -18043 -15604 -13906 -12665 -6783 -6254 -7313
12834 -7313 -5178 -5523 -6922 -7077 -527 270 -2424 -2530 -1776 -7441 -7390 -5488 -4609 4515 6086 4670 3879
12817 3879 -3362 -5025 -3830 -2659 -1574 3633 5915 -68 -7139 -12914 -9150 -4476 2438 8091 5232
12802E232j0415m110l661J299K222j41q225p163R04Q051M904K37J725K429R13
12787e799m853k206q29J616L306K874M377o262j242l382o240M20Q749N324L007
12772a140O12k008l947o387N233N827M562k650m584N98J810K496m229M092m062
12757c777L707p07p229k287k649M718O809K691O31l958k365J914Q92M08o079k323
12741i604L321N226M945N24K575m339p120j676L317l13L218l907m333P809O503
12726F146n128J779L201j0772j0537m513m794p86J2102Q135O177n401M047N480
12712E136n996q13K265n546j1772n301l887M262Q530J961M574L517M712L874J631
12697G147L048k320j0842n647K184r67J760l67j312j106m85L922J405j161N70
$$ plain form
12802 5232 -5183 -9293 -12954 -11655 -9433 -9574 -17799 -24962 -24058 -16007 -11103 -10866 -9141 -6712 -5799
12787 -5799 -10652 -12858 -13687 -12071 -8765 -5891 -1514 -7776 -9018 -12400 -18640 -18220 -9471 -4147 -1140
12772 -1140 -528 -2536 -6483 -12870 -7637 -1810 2752 102 -4482 -3884 -2074 422 -3807 285 -3777
12757 -3777 -70 -777 -8006 -10293 -12942 -8224 -1415 1276 1907 -2051 -4416 -2502 -1610 -1202 -7281 -9604
12741 -9604 -6283 -1057 3888 4412 6987 2648 -4472 -6148 -2831 -3144 74 -3833 -8166 -357 6146
12726 6146 1018 2797 5998 -4774 -15311 -19824 -24618 -25404 -13302 -5167 1010 -4391 -344 5136
12712 5136 -860 -1673 592 -4954 -16726 -22027 -25914 -21652 -13122 -11161 -6587 -3070 1642 5516 7147
12697 7147 10195 7875 -2967 -8614 -6430 -7397 -5637 -6004 -7316 -8422 -8907 -4985 -3580 -4741 -4171
12682d171N861k044j872J175K99L993k899n288L007l66k902L15L628O007K704
12667G447K350o381k534r258P40K664n736J595K714Q95k644k387P993P957l979
12652A436m606n252m964J23K347O744P753j207N051Q182m432o666k55o682J027
12637a401N230q4k719M696J081n198j537O476n917p302l985R378K903O02k019
12622B04l215l285j960L526K807J050n213k035P241j198l236o090N932Q602J758
12607D888R397M650O855N716L860l506P280j68J027J257l500J320P093J6744O267
12592F9180q044j3362j5804j2439q93k310k718l334M71J650O109K399n536j1247
12578D122o274O925O906K035Q224J095j0932p207K304q92l28J888J784k835P794
$$ plain form
12682 -4171 1690 -354 -2226 -1051 -752 3241 342 -4946 -1939 -2305 -5207 -4892 -1264 4743 7447
12667 7447 9797 3416 882 -8376 -7636 -4972 -10708 -9113 -6399 -5504 -8148 -10535 -2542 5415 1436
12652 1436 -3170 -8422 -13386 -13263 -10916 -4172 3581 2374 7425 15607 11175 4509 4254 -2428 -1401
12637 -1401 3829 3745 1026 5722 6803 1605 68 6544 627 -6675 -10660 -1282 1621 2223 204
12622 204 -3011 -6296 -8256 -4730 -1923 -873 -6086 -8121 -880 -2078 -5314 -11404 -5472 3130 4888
12607 4888 14285 18935 25790 31506 35366 31860 39140 38972 39999 41256 37756 39076 46169 62913 69180
12592 69180 61136 47774 31970 19531 18638 16328 13610 10276 10747 12397 18506 20905 15369 4122
12578 4122 -2152 4773 11679 13714 21938 23033 12101 4894 7198 6306 5978 7866 9650 6815 14609
12563A4609K870k149K232k940o841n397J426N036P949J940o127q840M268L667
12549A1703k000j571j926l932J718O018J569q800m663j021J584L766M137j647
12535D935n918M651K882P84J570j478m784J520q858j721K044k776P703K93K239
12520C086J002L651R222L137k611p223J569p285m327M263M955j271j837R28J01
12505G360j077Q96j123K478K646K622L909K328n370r086O38O33J217j943j601
12490D527l009J1858J1149l375p781o437j45m472k840O318Q238P188o027q366
12476F826K759n042j434K266L884N190J291j1279r103Q51M202O162m082r94N836
12461G333J703k312L261j133o971l385K763L054l524J798J289o042J75P002M061
$$ plain form
12563 14609 17479 15330 17562 14622 7781 2384 3810 8846 16795 18735 12608 3768 8036 11703
12549 11703 9703 8132 6206 2274 3992 10010 11579 2779 -1884 -2905 -1321 2445 6582 4935
12535 4935 -983 3668 6550 7334 8904 7426 2642 4162 -4696 -6417 -4373 -7149 554 847 3086
12520 3086 4088 7739 16961 20098 17487 10264 11833 4548 221 4484 9439 8168 6331 7259 7360
12505 7360 6283 7179 6056 8534 11180 13802 17711 20039 14669 5583 6221 6854 8071 6128 4527
12490 4527 1518 13376 24525 21150 13369 6932 6787 2315 -525 5793 14031 21219 15192 6826
12476 6826 9585 4543 3109 5375 9259 14449 15740 4461 -4642 -3791 411 6573 2491 1497 7333
12461 7333 9036 6724 9985 8852 1881 -1504 1259 4313 789 2587 3876 -2166 -1991 5011 9072
12446I072j210o856L18L35K920M31K333M597J876l667k516J51o029M301J2100
12431A8156P32q208k038K383m718N008J891k116j722j592n487k97l092O12O817
12416F329K089J098J819M498j27R16Q12q780j077M447m05p592l416j314P128J162
12400G587k031J295K860N732J3431j890j0569j0402l431P030l433j010K758K820
12386A0747P99L758K807n368J089r37l461m547Q007N923L800l791K46k936o828
12371I308K52o480l073Q172m669J135O694J51l970j253K144O27K829n147N330
12356A2050N066O252R142O109N910M398N778L404M148Q183J0672Q094J290j1220
12342G9276m056K447m90q257l310j181M005L876M118q656o793q096m189J536j390
$$ plain form
12446 9072 7862 1006 1324 1659 4579 5010 7343 11940 13816 10149 7633 7784 1755 6056 18156
12431 18156 18888 10680 8642 11025 6307 11315 13206 11090 9368 7776 2289 1992 -1100 -488 6329
12416 6329 8418 9516 11335 15833 15706 16622 17434 8654 7577 12024 11619 4027 611 -703 6425 7587
12400 7587 5556 6851 9711 15443 28874 26984 16415 6013 2582 9612 6179 5169 7927 10747
12386 10747 11546 15304 18111 12743 13832 12895 9434 4887 12894 18817 22617 18826 19072 16136 9308
12371 9308 9560 3080 7 8179 3510 4645 11339 11490 7520 6267 8411 9038 11867 6720 12050
12356 12050 17116 23368 32510 38619 44529 48927 54705 58109 62257 70440 81112 89206 90496 79276
12342 79276 75220 77667 77177 68920 65610 64429 68434 72310 76428 67772 60979 52883 48694 50230 48840
12327D8840q38m066M303J0781N517m687j3872k62N268m344J015L930N618J969
12313E9172j141Q538O974J1293J7315K1516K8743K7651K3683J1444P983r237j6663
12300A97271j6825j8949k2891j5335j1706o209r849l635J042n621j0657k002L774
12287G8408N311M736M134K743p813l084k432q359m532n99P51L933L383o887o511
12272F3182J776k002p78N986L222K83K873P391N606M870Q692k871n040j1889n108
12257G6193l512l837k834j489n536k126j140k514r887r09Q396l980n167j361L9
12242D0336o306o099j275K888j406j0794m782N613K086j927j459m426k880k44
12228I325r48L567N411M676m572k741M698j704K881n5m256L854O097M188l068
$$ plain form
12327 48840 48002 43936 48239 59020 64537 59850 45978 45716 50984 46640 47655 51585 57203 59172
12313 59172 58031 66569 73543 84836 102151 123667 152410 180061 203744 215188 223171 213934 197271
12300 197271 180446 161497 138606 123271 111565 105356 95507 91872 92914 87293 76636 74634 78408
12287 78408 83719 88455 92589 95332 87519 84435 82003 73644 69112 68513 69264 73197 76580 69693 63182
12272 63182 64958 62956 62178 68164 71386 71669 74542 81933 87539 92409 101101 98230 93190 81301 76193
12257 76193 72681 68844 66010 64521 58985 56859 55719 53205 43318 42409 50805 46825 41658 40297 40336
12242 40336 34030 27931 26656 29544 28138 17344 12562 18175 20261 18334 16875 12449 9569 9325
12228 9325 8377 11944 17355 22031 17459 14718 19416 17712 20593 20538 16282 20136 26233 30421 27353
12213B7353K928R12P422L983O146j790k535N244N172J209P602J2487Q879J200
12199H6212m955n761o500n134n051j0956j1430m667J274m570N951P840K368L598
12185D8219l990o209P440M128J896j120l172l08N216J864P81P375Q330M008N890
12170H0348K0812J7084J8052K7643L4414L7828M5350O6034Q5671J09333J43874
12159F86443J67021J81974J87409J24636L452j00023j60238j69850j57662j25947
12149F37215r1812n8255m8489m2299l2017k4716j4793j5996j1360l004K021K215
12137B98710p60N551J3068J3804J0603L1812L2320M0753M3432O3121R3004J19486
12125G64904J35118J33989J07990M6867k0805q9665j29321j34093j16338r6945
$$ plain form
12213 27353 30281 31193 38615 42598 48744 46954 44419 49663 54835 56044 63646 76133 85012 86212
12199 86212 81257 75496 68996 63862 58811 47855 36425 31758 33032 28462 34413 42253 44621 48219
12185 48219 44229 38020 45460 49588 51484 50364 47192 46884 52100 53964 54745 62120 70450 74458 80348
12170 80348 101160 118244 136296 163939 198353 236181 281531 347565 433236 542569 686443
12159 686443 853464 1035438 1222847 1347483 1350935 1250912 1090674 920824 763162 637215
12149 637215 545403 487148 438659 396360 364343 339627 324834 308838 297478 294474 296495 298710
12137 298710 297950 303501 316569 330373 340976 372788 405108 445861 489293 552414 645418 764904
12125 764904 900022 1034011 1142001 1188868 1168063 1078398 949077 814984 698646 601701
12115F01701p4817m1098p126J1403j1285m5041o3392p0259o1064m0750k3263j7283
12103A57726j1772j2274m26J457m124n044L102J694P13j200p430n335m218m108
12089A08761R229O238L825k04q383o619j308K227r742n949P114J8j149k847J676
12074A02887j114K958O701P649O230Q001K0361J3098j820q608j4181j4576j5537
12061A12049j4553j852l322m152m219l879k230K766J115K61K510J687P417n146
12047H8452m864r61n018M811n800k213l955J444j384o542l852L208n237j738O24
12032E6975O499M552L588J588O233J2497J0670N931M678M037J386M497M521l085
12018A24567p899m799r100l182O200M60m162m740K807K238m742L656P953J650
$$ plain form
12115 601701 526884 485786 478660 490063 478778 433737 370345 300086 239022 198272 175009 157726
12103 157726 145954 133680 133254 134711 130587 125543 128645 130339 131052 129852 122422 117087 112869 108761
12089 108761 117990 124228 128053 127849 119466 112847 111539 113766 104024 98075 105189 105207 104058 101211 102887
12074 102887 101773 104731 111432 119081 125311 133312 153673 166771 164951 156343 142162 127586 112049
12061 112049 97496 95644 92322 88170 83951 80072 77842 80608 81723 81984 84494 86181 93598 88452
12047 88452 83588 82627 77609 82420 76620 74407 70452 71896 70512 63970 60118 63326 58089 56351 56975
12032 56975 63474 68026 71614 73202 79435 91932 102602 108533 113211 117248 118634 123131 127652 124567
12018 124567 116668 111869 102769 99587 105787 106247 102085 97345 100152 102390 97648 101304 109257 110907
12004A10907N371O698Q227K672j563K586n335K935J2549L040j438o284J991R836
11990A52192J8091J1793K2122L4809K8057K7663K5716K2131K7142J1560O701j1245
11978C76732j5375j6508m566J010M990K775J0819R282R924J2946J7566K8663L9724
11965D77982K8268K2617K1206J2918Q361q41J630J381J3158L8588N1430O5352
11953G42050Q4128R3232O7058L4911J5547r588j4071r693J3361K4269L4669N0924
11941A126797N3840N3296N3302N5996P5185Q3102R5531R2628J06218J11377J02014
11930B009286R4061R1098Q3924P5484P2586Q3940R9409J09939J41742J68023J98962
11919C228454K26066K89469M11782N92465Q49379J222395J647340K048880K290045
$$ plain form
12004 110907 116278 122976 131203 133875 132312 134898 129563 132498 145047 148087 146649 140365 142356 152192
11990 152192 170283 182076 204198 239007 267064 294727 320443 342574 369716 381276 387977 376732
11978 376732 361357 344849 340283 341293 346283 349058 359877 369159 379083 392029 409595 438258 477982
11965 477982 506250 528867 550073 562991 571352 570511 572141 573522 586680 625268 676698 742050
11953 742050 826178 919410 986468 1021379 1036926 1027338 1013267 1003574 1016935 1041204 1075873 1126797
11941 1126797 1180637 1233933 1287235 1343231 1418416 1501518 1597049 1689677 1795895 1907272 2009286
11930 2009286 2103347 2194445 2278369 2353853 2426439 2510379 2609788 2719727 2861469 3029492 3228454
11919 3228454 3454520 3743989 4155771 4748236 5597615 6820010 8467350 10516230 12806275
11910A2806275K158729J540688N39912n30024j354201j732775j669311j343845
11902A0415448r49719n93220l14219j08271N5298K10150L47056M12888M05102
11893I880513L44210K23958J12359O8092R2630J57779K51444L59695M47647M77675
11883A2416002M17729K76451Q5006p3711j40430j09188K9109K36640N22067Q88707
11873A4548382J405311K165233L209905M414440N368643N427759M140314J658196
11865D2338183j260354l635579m836214m842523m038613k974556k010010j314715
11857A7425619q90929o22829m23897k63127j60112j50622k52867m05415n20803
11848A3735018n59065n14304l96026k57854j35617n5517m4179j02744k20685l51140
$$ plain form
11910 12806275 14965004 16505692 17045604 16515580 15161379 13428604 11759293 10415448
11902 10415448 9465729 8872509 8558290 8450019 8505317 8715467 9062523 9475411 9880513
11893 9880513 10224723 10448681 10561040 10629132 10721762 10879541 11130985 11490680 11938327 12416002
11883 12416002 12833731 13110182 13195188 13121477 12981047 12871859 12900968 13137608 13659675 14548382
11873 14548382 15953693 18118926 21328831 25743271 31111914 36539673 40679987 42338183
11865 42338183 41077829 37442250 32606036 27763513 23724900 20750344 18740334 17425619
11857 17425619 16534690 15911861 15487964 15224837 15064725 14914103 14661236 14255821 13735018
11848 13735018 13175953 12661649 12265623 12007769 11872152 11816635 11772456 11669712 11449027 11097887
11838A1097887m19278m16641l34894j80150l2252J21858K69721M33836O79760
11829A1219847J034258J432698J711618J639161J083635J38561q80182j631375
11821A5748221j940039j785710j315515p36357k93837j34456k68122n63652q15069
11812G895464r27399q69098p14535n28012l71794k61055j77073j13301o5841l7507
11802C829849l5338o3270j08899j57679j97276k04485j92243j52064j08756q0419
11792B529420o3836o8049q0382j12003j28108j35596j28315j12115p9968m6285
11782A574763k1018J496K0938O4090J26015K14725K91850K99773K24711N9259
11772B856602j25575k73561l36140l25633k74803k10483j49725j00893p1783m5349
$$ plain form
11838 11097887 10678609 10261968 9927074 9746924 9714672 9836530 10106251 10540087 11219847
11829 11219847 12254105 13686803 15398421 17037582 18121217 18259778 17379596 15748221
11821 15748221 13808182 12022472 10706957 9970600 9676763 9542307 9274185 8710533 7895464
11812 7895464 6968065 6098967 5384432 4856420 4484626 4223571 4046498 3933197 3867356 3829849
11802 3829849 3794511 3731241 3622342 3464663 3267387 3062902 2870659 2718595 2609839 2529420
11792 2529420 2465584 2397535 2317153 2205150 2077042 1941446 1813131 1701016 1621048 1574763
11782 1574763 1553745 1555241 1576179 1640269 1766284 1981009 2272859 2572632 2797343 2856602
11772 2856602 2731027 2457466 2121326 1795693 1520890 1310407 1160682 1059789 988006 942657
11762I42657j6540K069K6153L6457M3233K9959J1907p637l0297n3365n0883n8972
11750H74741n4209m8196n6068n0357m6124m2485l3887k6874j7007k1576k7373
11739D50585k1476j8917j4591p749q164j9426m997j0841q856j1544n642j0963
11727C07419p601j2735j1355m715n389M770K944P680P614J0187J0667J884M344
11714C15714o338k1915k7871l2214l2002j6828m742p785r260N918P174K612o319
11701A66144o84J902j255l429r502k926r053n082l076m991k469J092l285N10r38
11686A22958q61RL132Q987M504Q616M919l074m462n420p428j1772q88o095k517
11671A10608l559o364n879k497o243l827L918P939O064q91k714l105K18r808j3229
$$ plain form
11762 942657 926117 928186 954339 990796 1034029 1063988 1075895 1068258 1037961 984596 933713 874741
11750 874741 820532 772336 716268 665911 619787 577302 543415 516541 499534 477958 450585
11739 450585 429109 410192 395601 387852 379688 360262 355265 344424 335568 324024 318382 307419
11727 307419 299818 287083 275728 271013 265624 270394 273338 281018 288632 298819 309486 311370 315714
11714 315714 309376 287461 259590 227376 195374 178546 173804 166019 156759 162677 169851 172463 166144
11701 166144 165460 167362 166107 162678 153176 150250 141197 136115 133039 128048 125579 126671 123386 123896 122958
11686 122958 122097 122106 125238 134225 138729 147345 152264 149190 144728 139308 131880 120108 119220 113125 110608
11671 110608 107049 100685 94806 92309 86066 82239 86157 94096 100160 99269 96555 93450 93668 83860 70631
11656G0631M483R648N418o185p905N477L454P287J155J288N886M784P063L896
11642A16380r54M398M236J0507P793M304N696K339O53j532o831n096k793r323
11628A29777j0828m634p73m067o857P14P83R9m054n714m224n266Q31N178P4k059
11612H8980J174k218p178o541l135J432M580l725m178M73O13L444J692K776Q308
11597H6497L957m038k728j513k410O611M564L159k69k978r395q462o95m906q999
11582E8395j608M339k132n497r347m8n20l49j48K008J151K155k983o65j324o617
11566C6810q35N25J734O188l092k122Q803k961j0758K928L486m018l339J178j814
11551C2713l212M038N674J926l58l56K794l445n124K844O868j504k075j0115M56
$$ plain form
11656 70631 75114 84762 90180 83995 76090 81567 85021 92308 93463 94751 100637 105421 112484 116380
11642 116380 115426 119824 124060 134567 142360 146664 152360 154699 155352 153820 146989 141893 139100 129777
11628 129777 118949 114315 113542 109475 102618 103332 104115 104214 100160 94446 90222 84956 85787 90965 91039 88980
11612 88980 90154 87936 80758 74217 71082 72514 77094 73369 69191 69664 70277 73721 75413 78189 86497
11597 86497 90454 86416 83688 82175 79765 86376 90940 94099 93830 90852 81457 72995 72300 67394 58395
11582 58395 56787 61126 58994 53497 44150 44102 43582 43233 43085 45093 46244 48399 45416 44751 43427 36810
11566 36810 35975 36500 38234 44422 41330 39208 48011 45050 34292 37220 40706 36688 33349 34527 32713
11551 32713 29501 33539 39213 41139 40781 40425 43219 39774 34650 37494 44362 42858 40783 30668 31124
11536C1124n248q77L033L413K002l53m785p558J334R057J728k90o800p887L270
11521B1163P338j655O739L754o63K706K855r79j3642m179J231K260L581l831k55
11506B6423k696J165K178q662q8N197Q299J293P88l941P57j844p781j744j48Q26
11490B0022J601L643N01l086L606q081k938R742L333K147M870m136N67L787L334
11475C8912N637O437J240J948n215k422L642J0097P277J7029J6284N338N91k487
11461A04308q276q032j1226p218m671J023K619p337N83J625n371o46O91K268J0759
11446G1099Q101k480p502p497O18P946J3950J623J268L693M704j016m394o850
11432H3263k600J1533R544J0613P517J2407J8215J5719J9563J9114N172N227j1222
$$ plain form
11536 31124 25876 24999 28032 31445 33447 33094 28309 20751 22085 31142 32870 32580 25780 17893 21163
11521 21163 28501 26846 33585 37339 36676 39382 42237 41258 27616 23437 24668 26928 30509 26678 26423
11506 26423 23727 24892 27070 18408 18320 23517 31816 33109 33897 29956 30713 28869 21088 19344 19196 20022
11490 20022 21623 25266 25767 22681 26287 18206 15268 25010 28343 30490 35360 31224 31791 35578 38912
11475 38912 44549 50986 52226 54174 48959 46537 50179 60276 67553 84582 100866 106204 106795 104308
11461 104308 96032 88000 76774 69556 64885 65908 68527 61190 61773 63398 58027 57381 58072 60340 71099
11446 71099 79200 76720 69218 61721 62339 70285 84235 85858 87126 90819 95523 94507 90113 83263
11432 83263 80663 92196 101740 112353 119870 132277 150492 166211 185774 204888 210060 215287 204065
11419B04065j4963j7086k0695j4924m893q995j9702j4427J45k046j366j0462n871
11406F8780k369n978J110k039J214R7j416j630O353O890R06J386L88K691n65j785
11390G4033k523J064R51J061j174n537L103J1525R778M173N09K503m239n327l416
11375H6484r552l756k884n0N103p020l911o964r708q282m895p953n825J328K613
11360B4728K031j895N645J14j71L559l168r460r403n433M381O027L283n411j893
11345A2934P373j519k077m545m193L203M562N390K298l538O102k595n47j286m700
11330A6862r99o846o118L356J1545J0598k228j0764j746l617n682J635J792J684
11316I472J335J092n22N779P13M280J0254R082J0312P217K724O499J2253J4595
$$ plain form
11419 204065 189102 172016 151321 136397 131504 122509 102807 88380 88525 86479 85113 74651 68780
11406 68780 66411 60433 61543 59504 60718 60815 59399 57769 64122 71012 71918 73304 73692 76383 75818 74033
11390 74033 71510 72574 73525 74586 73412 67875 70978 82503 92281 96454 96963 99466 95227 89900 86484
11375 86484 76932 73176 70292 70242 75345 68325 64414 57450 47742 39460 34565 26612 20787 22115 24728
11360 24728 26759 24864 30509 30623 30452 34011 30843 21383 11980 6547 10928 16955 20238 14827 12934
11345 12934 20307 18788 16711 12166 7973 11176 15738 21128 23426 19888 25990 23395 22848 21562 16862
11330 16862 15863 9017 2899 6255 17800 28398 26170 15406 13660 10043 4361 5996 7788 9472
11316 9472 10807 11899 11377 17156 17869 22149 32403 41485 51797 59014 61738 68237 80490 95085
11302I5085J2657L3644O2187J02097J63435K26784K01504J31460P2463k7177j46020
11291I28119j92385k07555j75221j07996o8121l5352j4264p582o40M773R869O862
11279A40507P88n476j3971k4858k1365j6613p851o341j2435K778p83K609o221
11266C0768n493l043J647J950m071l317J463L338k015j643L210j983K600R094
11252C2505r268k814k58j270O503M548l16K130O039L968M635J754J4772J5254
11238G8182J8590L1442L8133M9835M5495L0259Q1k6810m9316n1261m0977k3389
11226A00264j2861n695m303q772n637p968p614n560m640m42p01n440O44L167n333
11211B9109l72j545O190Q653K51o265m420j739M229M432M162M727J8836J9601
$$ plain form
11302 95085 107742 141386 203573 305670 469105 695889 897393 1028853 1101316 1074139 928119
11291 928119 735734 528179 352958 244962 176841 141489 127225 119643 119003 123776 133645 140507
11279 140507 141295 135819 121848 96990 75625 59012 51161 44820 32385 35163 34380 36989 30768
11266 30768 25275 22232 23879 25829 21758 18441 19904 23242 21227 19584 22794 20811 23411 32505
11252 32505 23237 20423 20165 18895 25398 29946 29630 31760 37799 41767 46402 48156 62928 78182
11238 78182 96772 128214 166347 216182 261677 291936 292017 265207 215891 164630 123653 100264
11226 100264 87403 81708 77405 68633 62996 55028 47414 41854 37214 36772 36071 30631 31275 34442 29109
11211 29109 28737 27192 33382 42035 42286 36021 31601 29862 34091 38523 42685 47412 66248 85849
11197H5849K3202K5567K1827M1885Q7046J40123K13253K40967J79372J02467P2882
11186A234440K1544o5542j66697k28797k26119j69220j11010p0325m4817l4110
11176A39347k3190j1558j2443j3767J804p967j2245j140j704p969q178j0201l532
11163B7257l834k433j247o428J1083O158p181l712m058O146O097n523m911O467
11149B3881p67R483O742P175J4854J7266K0014J7703O199j320m366j2100j7056
11136H7708j2446k0113p332r291n481l545o109p051l539l126J174M216n041k076
11122G948mM275l283q113l943j568M622n367o452L588R583M74K087L919j201o348
11106B17m344j960M116m30r02m924M149R406J194j691K9K1q47o583j146J516K251
$$ plain form
11197 85849 109051 134618 156445 198330 285376 425499 638752 879719 1059091 1161558 1234440
11186 1234440 1255984 1190442 1023745 794948 568829 399609 288599 218274 173457 139347
11176 139347 116157 104599 92156 78389 80193 72226 59981 58841 57137 49168 40990 30789 27257
11163 27257 23423 20990 19743 13315 24398 30556 23375 19663 15605 21751 27848 22325 17414 23881
11149 23881 23114 32597 39339 46514 61368 78634 98648 116351 122550 121230 116864 104764 87708
11136 87708 75262 55149 47817 38526 33045 29500 23391 16340 12801 9675 10849 15065 10024 7948
11122 7948 7944 12219 8936 823 -3120 -4688 -66 -5433 -11885 -8297 1286 1760 3847 7766 6565 217
11106 217 -4127 -6087 -1971 -2401 -3303 -8227 -4078 5328 6522 4831 4860 4881 4034 -2549 -3695 -2179 72
11089G2M14M839j074O59k67m151j10J634p031M084R386l927m398p92J765K507
11073C610P838k375l009J808n716J282k547L108M70N426q970p677J318L169m119
11058f384K145O894k448k319L290k490k971J789K105L181O59k603M823M603O374
11043A6648q006j354n512m300j858j2790J394Q631q48m6L99P459J997p574k405
11028h165P084N133J903j332l428m413j152M187J928k175K397l122O557K644J465
11013I511k986q665k788R10n217r13P738J542K053K373j822J325J348l522J94
10998A081P342m62n769m409p27K08n17l285Q61N613j641m904p781m679O554K794
10982i721j469M569M138P43m624J040J137l75L563O2o791M935M585k752O95n646
$$ plain form
11089 72 486 5325 4251 4910 4643 492 382 2016 -5015 -931 8455 4528 130 -662 1103 3610
11073 3610 11448 9073 6064 7872 2156 3438 891 3999 4469 9895 925 -6752 -5434 -2265 -6384
11058 -6384 -4239 2655 207 -2112 1178 -1312 -4283 -2494 -389 2792 3451 848 5671 10274 16648
11043 16648 8642 7288 1776 -2524 -4382 -17172 -15778 -7147 -7995 -8041 -7642 -183 1814 -5760 -8165
11028 -8165 -1081 4052 5955 4623 1195 -3218 -4370 -183 1745 -430 1967 -1155 5402 8046 9511
11013 9511 6525 -2140 -4928 -4018 -9235 -10148 -2410 -868 1185 3558 1736 3061 4409 887 1081
10998 1081 8423 7961 2192 -2217 -2944 -2736 -3253 -6538 -5677 -64 -1705 -6609 -14390 -19069 -12515 -9721
10982 -9721 -11190 -6621 -2483 -1740 -6364 -5324 -4187 -4562 -999 -937 -7728 -2793 1792 -960 -265 -5911
10966e911q69M784p574k231N178J2068K388m743J301k205p19m885l397K890k324
10951f249k865K866k480j961K0N560O646L103J308R29j854Q72K939m606J75o111
10935a708o821k176J178L491Q69n55j440k849O54J375j553N789l271J397J175
10920d445l156m545M098K864J525m745p72L834Q95L88J568Q456M921n263p988
10905b365k898n698l289P893J83K062j540L40M124K540M579L768r532n073N063
10890A57R949L01p363p536K329j012p681k143k951L472O151J359K319K564k18
10875c03q712j295L087J593M221n100n465O013P938o632J497J0023k342k868L921
10860E576l988m941n300O793K005L971N614j877k074J042k528q951m202m435r468
$$ plain form
10966 -5911 -6780 -1996 -9570 -11801 -6623 5445 7833 3090 4391 2186 1467 -3418 -6815 -3925 -6249
10951 -6249 -9114 -6248 -8728 -10689 -10669 -5109 1537 4640 5948 6877 5023 5895 8834 4228 4403 -1708
10935 -1708 -8529 -10705 -9527 -6036 -5167 -5722 -7162 -10011 -9357 -7982 -9535 -3746 -7017 -5620 -4445
10920 -4445 -7601 -12146 -8048 -5184 -3659 -8404 -9176 -5342 -4447 -4059 -2491 5965 10886 5623 -2365
10905 -2365 -5263 -10961 -14250 -6357 -6174 -4112 -5652 -5312 -1188 1352 5931 9699 167 -4906 157
10890 157 10106 10407 3044 -4492 -2163 -3175 -10856 -12999 -15950 -12478 -6327 -4968 -2649 -85 -303
10875 -303 -9015 -10310 -7223 -5630 -1409 -6509 -11974 -5961 1977 -4655 -3158 6865 4523 1655 5576
10860 5576 1588 -3353 -8653 -1860 145 4116 9730 7853 5779 6821 4293 -4658 -8860 -13295 -22763
10845b2763M996J0702n15M396K238l062m327j831K950k610j634M387p2l861k875
10830a3881N139Q233J970k669l119O04L631m479j883k199j692K319O326K621P175
10815H096L474J101j1095r545j0715m173J1205J4913K554m095K583j521m123j189
10801b530l914L514O52j857O03L919n539r23N78n871p03K052P502K019k295k023
10785d816K766L851k800l100L76M479K149l467p614j838K76K742m51m855M710
10770g592N219o416l409K692J8l528Q137P374M921jJ865m350Q06J148M721M185
10754A5790L077P42k615r56L853j1418l32l56N9J000J620N041n9p059o331L056
10738E112R438m156n660o110J425m577o051l875O404K561p743m965P012N674O89
$$ plain form
10845 -22763 -17767 -7065 -7580 -3184 -946 -4008 -8335 -10166 -7216 -9826 -11460 -7073 -7145 -11006 -13881
10830 -13881 -8742 -509 1461 -1208 -4327 -3723 -92 -4571 -6454 -8653 -10345 -8026 -1700 921 8096
10815 8096 11570 12671 1576 -7969 -18684 -22857 -11652 3261 5815 1720 4303 2782 -1341 -2530
10801 -2530 -6444 -2930 -2278 -4135 -3532 387 -5152 -6075 -5497 -11368 -12071 -10019 -2517 -498 -2793 -4816
10785 -4816 -2050 1801 -999 -4099 -3723 756 2905 -562 -8176 -10014 -9738 -6996 -7447 -12302 -7592
10770 -7592 -2373 -8789 -12198 -9506 -9488 -13016 -4879 2495 7416 7415 9280 4930 5736 6884 11605 15790
10754 15790 18867 19609 16994 16038 19891 8473 8141 7785 7844 8844 10464 15505 15446 8387 2056 5112
10738 5112 14550 10394 4734 -1376 49 -4528 -10579 -14454 -8050 -5489 -13232 -18197 -11185 -5511 -4822
10723d822J317J46M621l550r17k815k176n90O919J224P566l23n429q35j49J531
10707A718j552m847M283k40j277j768K294r40j734q030k727l490q69J135n17J779
10691a6782P638J800J904J240L252P546M75l576j0980n1J0032J040K464j229j091
10676C682N681n451l319l533N92J816j195J820k58Q77N854l921L273J530k454
10661D994q99j245L013J937k5L316n123J95k672o372m582K920k602K273J362O935
10645C425N632N637O829m122j848l283o662p971m687K953L962j14j0855r32M3
10630a1993o068J764j790O518O766m74j997P46N882j0317p319R116K432n078J457
10615a0355M48J323N077M179o72L788n473p133N58L511j085m34r43J627K718J811
$$ plain form
10723 -4822 -3505 -3359 1262 -2288 -3205 -6020 -8196 -8786 -1867 -643 6923 6600 1171 336 187 1718
10707 1718 166 -4681 -398 -638 -1915 -3683 -1389 -2329 -4063 -12093 -14820 -18310 -19179 -18044 -18561 -16782
10691 -16782 -9144 -7344 -5440 -4200 -948 6598 7073 3497 -7483 -7534 2498 3538 6002 4773 3682
10676 3682 9363 3912 593 -2940 -2348 -532 -1727 93 -165 712 6566 2645 5918 7448 4994
10661 4994 4095 2850 5863 7800 7775 11091 5968 6163 3491 -2881 -7463 -4543 -7145 -4872 -3510 3425
10645 3425 9057 14694 21523 17401 15553 12270 5608 -2363 -7050 -4097 -135 -249 -11104 -12036 -11993
10630 -11993 -18061 -16297 -18087 -11569 -4803 -5277 -7274 -6528 -646 -10963 -18282 -9166 -6734 -11812 -10355
10615 -10355 -9907 -8584 -3507 672 0 3788 -1685 -8818 -8260 -4749 -5834 -6268 -7211 -5584 -2866 -1055
10599a055M12l230N73k770R48k808j046J528J055k935l08M752J434K14k295M595
10583i36R201J093j3319j739L249m424P94q53N448N950N052n325m532p027j982
10568i350l080m820J241Q015m57k577O824J1042m775N296Rm277l217L481o65n135
10552b445k170R104k896j2562M768R016M198J847j967j059k765l021K321Q499
10538A0868Q06j1386P835J6646k923q439K819l805k515k071k862l148p225j899
10524g299K793m251k385N3R605P093j741k000J16R337j826n911j1902n959Q10
10509a3467M098p72O409J651o072p60p73J676L343J340K548J92J354p19L048p14
10493B382J246L923N527p44r348r883p10j30k21J269R295M024j574m463l418J605
$$ plain form
10599 -1055 -643 -3873 -3300 -6070 -5122 -7930 -8976 -7448 -6393 -9328 -9636 -4884 -3450 -3236 -5531 -936
10583 -936 8265 9358 -3961 -5700 -2451 -6875 -6081 -6934 -1486 4464 9516 4191 -341 -7368 -9350
10568 -9350 -12430 -17250 -16009 -7994 -8451 -11028 -4204 6838 2063 7359 7368 3091 -126 3355 2690 -2445
10552 -2445 -4615 4489 1593 -10969 -6201 2815 7013 8860 6893 5834 3069 48 2369 10868
10538 10868 11674 288 8123 24769 21846 13407 16226 12421 9906 7835 4973 1825 -5400 -7299
10524 -7299 -4506 -8757 -11142 -11089 -1484 5609 3868 1868 1984 11321 9495 3584 -8318 -14277 -13467
10509 -13467 -9369 -10141 -3732 -2081 -8153 -8913 -9686 -8010 -4667 -3327 -779 -587 767 48 3096 2382
10493 2382 3628 7551 13078 12334 2986 -6897 -7607 -7737 -7958 -6689 2606 6630 5056 593 -2825 -1220
10477a220Q10k138m846r371o138N427N203M683M973J58K804O990m331J231M318
10462H553l095M892q408q726P4k427L677Q450l681q564J892L775l515p44K079
10447e768L669L429l805o735K522K428k972k500K545l936l136j342M981Q267j282
10432c635m525J685M38Q074M064K015k884l426k300J599J951K131J657o806k347
10417b309N014M015j693n491P1J093n244l706J0M238J1769M329k084o302n093
10402a383J088N054R694q633n505K967k916k095M62J733J27j244j217J594J351
10387A077m389L299k576K684N172r92L450J79j625L28k916j225P01j977J118n038
10371b730r69Q700L635J776P334n332l645K521l43j33J464N877R164L240J447
$$ plain form
10477 -1220 -410 -2548 -7394 -16765 -22903 -17476 -12273 -7590 -2617 -2459 345 7335 3004 4235 8553
10462 8553 5458 10350 1942 -6784 -6710 -9137 -5460 2990 -691 -9255 -7363 -3588 -7103 -7847 -5768
10447 -5768 -2099 1330 -2475 -9210 -6688 -4260 -7232 -9732 -7187 -11123 -14259 -15601 -10620 -2353 -3635
10432 -3635 -8160 -6475 -6037 2037 6101 8116 5232 1806 -494 1105 3056 5187 6844 38 -2309
10417 -2309 2705 6720 5027 -464 -393 700 -4544 -8250 -8240 -4002 7767 12096 10012 3710 -1383
10402 -1383 -295 4759 14453 5820 315 3282 366 -1729 -1267 466 593 -651 -1868 -274 1077
10387 1077 -3312 -13 -2589 95 5267 4275 7725 7904 6279 6607 3691 2466 3167 1190 2308 -2730
10371 -2730 -3699 5001 8636 10412 17746 12414 8769 11290 10947 10814 12278 18155 27319 30559 32006
10356C2006L33Q42L410M575k851o656r992k238o327J325j440j363n929j685k642
10341A368k27L954O43J371K85K557r171n228l485M145J045O072n102L652m741
10326b862k191k289P531Q427o32k315m388k90L896M042l014m413m049M432J1460
10311A3345M271L90q222m554M631q56k201j953k028O342J06o872J728J458J271
10296F856J455j282r383k534J2701Q265k840K303n53j161j829m29Q68J450m874
10281I013j3589n037m29K408M198J4147Q923P45J905J187R734O16j092p00o24
10266C1405M352L340o54K161m614j0709l978J530Q182n466J44J840o208r889o683
10251D753L326j300P023O754K630J408K990K626K433M647o028J9l555J813r35
$$ plain form
10356 32006 32339 33181 36591 41166 38315 31659 21667 19429 13102 14427 12987 11624 5695 4010 1368
10341 1368 1141 5095 5738 7109 7394 9951 780 -4448 -7933 -3788 -2743 3329 -1773 1879 -2862
10326 -2862 -5053 -7342 189 8616 7984 5669 1281 991 4887 8929 5915 1502 -2547 1885 13345
10311 13345 17616 18006 9784 5230 9861 9005 6804 4851 2823 9165 9271 2399 4127 5585 6856
10296 6856 8311 7029 -2354 -4888 7813 16078 13238 15541 14988 13827 11998 11569 12437 13887 9013
10281 9013 -4576 -9613 -10042 -7634 -3436 10711 19634 20379 22284 23471 33205 33821 32729 32029 31405
10266 31405 35757 39097 38443 40604 35990 25281 21303 22833 31015 25549 25693 27533 21325 11436 4753
10251 4753 8079 6779 13802 20556 23186 24594 27584 30210 32643 37290 31262 31281 27726 29539 28604
10236B8604j772o554K921J1191L638j451J1669J2042Q145N068J3286J0080N692
10223A02559J5832J4726Q619k906j8122k6013k1123k0929j7038l304O889J11n082
10210C4219l768k837q131R82O086Q402K145N863l768o52N093m442j093J360l116
10195C6343j228K518N582n821Q78R796Q418R715J3182J1539R580J5132K0618J2669
10181A48921J5826J5985R453P353k001j0016j7834k3319k4302k0392j9941j3821
10169F5912l981j598l644n209p274k995k491k687n303n99O471M712L422N109r9
10154D9746j95K03J486l733K608o713o262p054k383J481L445J1061J9934K2376
10140H6000J6900K1551J5737P802J2349J2922m534j3847j9695k2939k4238j3541
$$ plain form
10236 28604 26832 20278 23199 34390 38028 36577 48246 60288 68433 73501 86787 96867 102559
10223 102559 118391 133117 141736 138830 120708 94695 73572 52643 35605 32301 39190 39301 34219
10210 34219 30451 27614 19483 20465 26551 34953 37098 42961 39193 38541 43634 39192 38099 39459 36343
10195 36343 35115 37633 43215 37394 38272 48068 56486 66201 79383 90922 100502 115634 136252 148921
10181 148921 164747 180732 190185 197538 195537 185521 167687 144368 120066 99674 79733 65912
10169 65912 61931 60333 56689 51480 44206 41211 38720 36033 30730 30131 36602 41314 44736 49845 49746
10154 49746 49551 49754 51240 47507 50115 43402 37140 30086 27703 29184 32629 43690 63624 86000
10140 86000 102900 124451 140188 147990 160339 173261 168727 154880 135185 112246 88008 74467
10128G4467j0083m337l995j6363j3897M461J0461n71o08m995m665j597K612l89
10114C0501N08j19l382j029L287Q704j625j1460n783J450M692K434J814r16Q43
10099B9919J1501P270N681J1733M366K00j62m281j527p446p020n114l717J450
10085D2853m459j1533k420J746N584q31j512L69J426j34j764o508l080J020J918
10070B2675M161m160k685L72J945N189N110J1204J8583J0696J726j0084j7116
10057D7616j2468O242l420p018K38q370r912J828N95o76j006m10K80M556N889
10042B3964K104p49O7N068m38q576O8M618q5j439j190k802j630K519j008J063
10026B1554K075k282o84M323O903M352L321n216k632l45N414j749Q54K314l246
$$ plain form
10128 74467 64384 60047 56052 39689 25792 30253 40714 40143 39535 34540 29875 28278 30890 30501
10114 30501 31009 30890 27508 26479 29766 38470 36845 25385 19602 21052 25744 28178 29992 29076 29919
10099 29919 41420 48690 54371 66104 70470 70670 70508 66227 64700 57254 50234 45120 41403 42853
10085 42853 38394 26861 24441 26187 31771 30940 29428 29797 31223 31089 29325 22817 19737 20757 22675
10070 22675 26836 22676 19991 20363 22308 27497 32607 43811 62394 73090 74816 64732 47616
10057 47616 35148 41390 37970 30952 31190 22820 12908 14736 15331 14655 13649 13239 13519 18075 23964
10042 23964 26068 25319 25386 30454 30016 21440 21508 26126 26041 24602 23412 20610 18980 21499 20491 21554
10026 21554 23629 21347 20663 24986 31889 36241 39562 34346 31714 31369 36783 35034 35888 38202 34956
10011C4956j4561q721j029l477p85M623J873k632j37l505K036N445J929M168J746
9996B1929k233j64n273j1560m923P465P523k236n635O835L451O022N946j653J305
9981B6799m150k349N441P112L746j1295k338L122K591o610K396k319j0628l367
9967H151P163Q644L968M391L633m739n844n087P102O565N352k179K20K528o3n586
9951C4219L438K595K140J991K372J940k679P08J0629Q867j744n234J254o1P099
9936F7534J302k760j3343n115o223k657M887M123M249J104Q853J1551J3024J6147
9922A02676J4369J1386P023K85j4602r031j0383j2448l204j240J797L860m802
9909H5686k331N039P810J8R484O652Q936J0412P856M417P333M857L743J4282N395
$$ plain form
10011 34956 20395 11674 10645 7168 6383 11006 12879 10247 10110 6605 8641 14086 16015 20183 21929
9996 21929 19696 19532 14259 2699 -2224 5241 12764 10528 4893 11728 15179 21201 27147 25494 26799
9981 26799 22649 20300 25741 32853 36599 25304 22966 26088 28679 22069 24465 22146 11518 8151
9967 8151 15314 23958 27926 32317 35950 31211 25367 20280 27382 33947 39299 37120 37340 39868 39805 34219
9951 34219 37657 40252 42392 44383 46755 48695 46016 46724 57353 66220 64476 59242 60496 60435 67534
9936 67534 68836 66076 52733 47618 41395 38738 43625 47748 51997 53101 61954 73505 86529 102676
9922 102676 117045 128431 135454 135739 121137 112106 101723 89275 86071 84831 86628 90488 85686
9909 85686 83355 88394 96204 96222 105706 112358 121294 131706 139562 143979 151312 156169 159912 174194 179589
9894A79589N313K050J5541J0639J2151R616J3100N818J2953J7231K2362K8628
9882C34991K9395K0338K2286K5536K6673L2534L2090K5739L7445M1860M8402N4619
9870G31908O9158J03931J73253K26197J68098K8819j05525j75050j83237j43509
9860H94043q7091m5307p633K3156M5719P6361J04201J36181J86216K25326K41585
9849A792757J93692J06594K4872m4451p8647r2142r5762r8137r5673q7215o3475
9838A462413m1870j1934J8632M5481O8348R7200J20460J61203K08175K72327L54645
9827B755080M41359M96063M10918J73047o7978k42165k99314k37508j19463N433
9817C315472J43582K87335M68545O99893J010641J401652J875250K388696K809910
$$ plain form
9894 179589 184902 186952 202493 213132 225283 234899 247999 253817 266770 284001 306363 334991
9882 334991 364386 384724 407010 432546 459219 491753 523843 549582 587027 628887 677289 731908
9870 731908 801066 904997 1078250 1304447 1472545 1501364 1395839 1220789 1037552 894043
9860 894043 806952 761645 754012 777168 822887 899248 1003449 1139630 1325846 1551172 1792757
9849 1792757 1986449 2093043 2117915 2073464 1994817 1902675 1806913 1708776 1613103 1525888 1462413
9838 1462413 1420543 1408609 1427241 1472722 1541070 1638270 1758730 1919933 2128108 2400435 2755080
9827 2755080 3196439 3692502 4103420 4276467 4208489 3966324 3667010 3429502 3310039 3315472
9817 3315472 3459054 3746389 4214934 4914827 5925468 7327120 9202370 11591066 14400976
9808A4400976K908950K322378R92272n59593j765482k382484k366792j976213
9800A1574012j483625j012286o12110k85337J2941L02303N84585Q78370J129165
9791A1088018J301804J414672J454493J366554J244002J135836J032843Q35758
9783B0873980L85630l25474r86635j392618j515635j381297j125012q43381n55671
9774A3133887k12815K08952P50708J473450K442054L696674N130093O405615O746913
9765C9775531N207777J851981j985745m947110o347894o155367n051424l742066
9757A8605683k576308j672357r86584m67540q9631J32443K24031K63730L30790
9748A3764257M47246N72593O63226O93618O55058N37511L01353j32039p21341
$$ plain form
9808 14400976 17309926 19632304 20624576 20064983 18299501 15917017 13550225 11574012
9800 11574012 10090387 9078101 8465991 8180654 8193595 8495898 9080483 9958853 11088018
9791 11088018 12389822 13804494 15258987 16625541 17869543 19005379 20038222 20873980
9783 20873980 21259610 20934136 19947501 18554883 17039248 15657951 14532939 13689558 13133887
9774 13133887 12921072 13130024 13880732 15354182 17796236 21492910 26623003 33028618 39775531
9765 39775531 44983308 46835289 44849544 39902434 33554540 27399173 22347749 18605683
9757 18605683 16029375 14357018 13370434 12902894 12813263 12945706 13169737 13433467 13764257
9748 13764257 14211503 14784096 15447322 16140940 16795998 17333509 17634862 17502823 16781482
9739A6781482j297606j703746j836378j692657j409880j051446p15108m30694
9731F643967j56231J02705L86682P23684J121985J587186J990223K072866J538262
9722A6011329M18021q53074j784614k215687k185351j869630j473110j114994
9714D932890q18088n87594m28956l22263k60102k13640j82921j53345j36604j02348
9704A727029q4100q3772q6932p6997o9749o7649o4488o2994n0720l0305k1843
9693A027480j072R514J4604K7932M9516O5460O9959O4619N6103L2176J9734m928
9681A431097m3825q6918j22485j40188j18599r7572p9358n5442l9335m6487l6966
9670E63922l1625k3351j9051J699M912Q302R311J7783K2311K5615L2330K2476
$$ plain form
9739 16781482 15483876 13780130 11943752 10251095 8841215 7789769 7074661 6643967
9731 6643967 6487736 6590441 6977123 7700807 8822792 10409978 12400201 14473067 16011329
9722 16011329 16429350 15576276 13791662 11575975 9390624 7520994 6047884 4932890
9714 4932890 4114802 3527208 3098252 2775989 2515887 2302247 2119326 1965981 1829377 1727029
9704 1727029 1642929 1559157 1472225 1395228 1325479 1257830 1193342 1130348 1079628 1049323 1027480
9693 1027480 1026408 1035922 1050526 1078458 1127974 1193434 1263393 1328012 1384115 1416291 1436025 1431097
9681 1431097 1387272 1300354 1177869 1037681 919082 821510 742152 686710 647375 600888 563922
9670 563922 532297 508946 489895 491594 496506 504808 514119 531902 554213 579828 612158 634634
9658F34634R541p861k5590l8304l9843l7375k7103l5384k1992k4740k1132l402
9646C61449r753j4449k3786l0391k2499j8587j8548j0635o966m561j4096j2654
9634A74524j3372r641j3432q493k075O544k110k13m660j58n619m208l045o587
9620A07455o99j151L590K259k293n017r377j0078j0245j3744j4841o960q366L451
9606C3984J0088P742J2029L870M422jK685r72n7J123O01p76q74n446l487l28m725
9589E9878n03q470p489O10J582J109M860N481O353o476k236L017J898l814q531
9574D7269m673N526L014j539j256R33k345l418K656Q907K30k632Q57j138J792
9559E4183J011J521K8N091P732j87n130j3961J026N608m476J843k737j214O205
$$ plain form
9658 634634 644175 636314 610724 572420 532577 495202 468099 432715 410723 385983 364851 361449
9646 361449 351696 337247 313461 283070 260571 241984 223436 212801 205835 201274 187178 174524
9634 174524 161152 151511 138079 129586 127511 134055 131945 131732 127072 126914 121295 117087 114042 107455
9620 107455 106756 105605 109195 111454 109161 104144 94767 84689 74444 60700 45859 38899 30533 33984
9606 33984 44072 51814 63843 67713 72135 72134 74819 73847 73790 74913 75514 74738 73864 68418 64931 64603 59878
9589 59878 59375 50905 43416 44026 45608 46717 51577 57058 63411 56935 54699 57716 59614 55800 47269
9574 47269 42596 48122 51136 49597 48341 49274 46929 43511 46167 55074 55304 52672 53529 52391 54183
9559 54183 55194 56715 56743 61834 69566 69379 64249 50288 51314 56922 52446 54289 51552 50338 56543
9544E6543R277P835N543J272o074l851m205o593k669r748l707J0071M95n011J931
9529E1109J937J822J020n360m826P95Q317N398p927r790l275k94L591M726M136
9514E1379o696n211N652q36l474p615M480L764J699J409M938j328q24k101p021
9499C8215L102N304O46k974j1490p80L078m714m032N174L888K14K192L299q722
9484C2400n253O92q70j407M076J962M182k999q198p0J016N257K522p078o395L91
9468B0228O154J970J548J424M778Q590M67r552l631o840o909j627R894R425k37
9453C5682K726p690r532l405L272M677l771j662P514J174Q535N842p53p431p896
9438B7282j789M772O742M801J3683Q199j614o548k437K123L841J327r182j0860
$$ plain form
9544 56543 65820 73655 79198 80470 74396 70545 66340 59747 57078 47330 43623 53694 54189 49178 51109
9529 51109 53046 54868 55888 50528 45702 46497 54814 60212 52285 42495 39220 38926 42517 47243 51379
9514 51379 44683 39472 45124 44288 40814 33199 37679 41443 43142 44551 49489 48161 47337 45236 38215
9499 38215 41317 46621 47267 44293 32803 32023 35101 30387 26355 31529 35417 35631 37823 41122 32400
9484 32400 27147 27839 26969 25562 29638 31600 35782 32783 24585 24515 25531 30788 33310 26232 19837 20228
9468 20228 26382 28352 29900 31324 36102 44692 45159 35607 31976 25136 18227 16600 26494 35919 35682
9453 35682 38408 30718 21186 17781 21053 25730 21959 20297 27811 28985 37520 43362 42609 35178 27282
9438 27282 25493 30265 37007 41808 55491 63690 62076 55528 53091 55214 59055 60382 51200 40340
9424D0340m682k508M07L749O167K220k205q636J530l728J842K216P295N082Q21
9409D9910o816L235O157M52Q12N844O3l206m563K960r27N871N860o13m764N825
9393F6100L847J0657K0454K6384L4933K5625Q093K419j2850j4880j2123j9563
9381A39096j9440j3663m824n643p217j2136p233o640J506Q76j0394J24N834J34
9367F0380M167J0177P051j54M215R381M785k145m877r526o799J987Q570Q375q86
9352I4701L085J8692J8642J6578K6712J9113K0010J7723N357o98o734j3203j0039
9339B09939j5594j3276j7642k1168q852l022n279m788J088K429K350j929n605
9326A18651j690k929K744j763K816P525n855j0369k8L387J728j474K706P545L399
$$ plain form
9424 40340 35658 33150 33557 37306 43473 45693 43488 34852 36382 32654 34496 36712 44007 49089 49910
9409 49910 43094 46329 52486 52938 53750 59594 59657 56451 51888 54848 53921 59792 65652 65039 60275 66100
9393 66100 69947 80604 101058 127442 162375 188000 196093 198512 185662 170782 158659 139096
9381 139096 119656 105993 101169 95526 88309 76173 68940 62300 63806 64682 54288 54412 60246 60380
9367 60380 64547 74724 81775 81621 85836 95217 100002 97857 92980 83454 76655 78642 87212 95587 94701
9352 94701 97786 116478 135120 151698 178410 197523 217533 235256 240613 239915 233181 219978 209939
9339 209939 194345 181069 163427 142259 133407 130385 125106 120318 121406 123835 126185 124256 118651
9326 118651 116961 114032 116776 115013 117829 125354 119499 109130 109102 112489 114217 112743 115449 122994 126393
9311A26393J355N731J5578J5031J1059Q390j959M397O899J1208N359l153n669
9298B00619n998q189J258l099q595p117L734M207J204R063M785k664p354j5541
9284A66313j6321j3007j2055j3431o565k618l203j021n792k495l066K162K554
9271I1455N407J0016q048l17P090O545l456m635K027l449L263j917k192k021M947
9256A04715Q449N779O974n438l487k352R17r18L136m731j2770o804j6555j0946
9242F5969p103O043N388q264k143J153j025O35J720o451R18k96j569j534q954
9227D4487m134l873J645J0172M427o500K764K749o090J579K249J710L493N2l761
9212E0969n325L034K118m435o924O063l576j673O301Q335M707P563Q75K19o93
$$ plain form
9311 126393 127748 133479 149057 164088 175147 183537 181578 185975 192874 204082 209441 206288 200619
9298 200619 194621 186432 187690 184591 175996 168879 172613 176820 178024 187087 191872 189208 181854 166313
9284 166313 149992 136985 124930 111499 104934 102316 99113 98092 92300 89805 86739 88901 91455
9271 91455 96862 106878 98830 98513 105603 112148 108692 104057 106084 102635 105898 103981 101789 99768 104715
9256 104715 113164 118943 125917 120479 116992 114640 115557 114639 117775 113044 100274 93470 76915 65969
9242 65969 58866 64909 70297 62033 59890 61043 60018 60653 62373 55922 56840 56544 54975 53441 44487
9227 44487 40353 36480 38125 48297 52724 46224 48988 51737 45647 47226 49475 51185 54678 54730 50969
9212 50969 45644 48678 50796 46361 39437 45500 41924 40251 46552 54887 59594 67157 68032 68251 67558
9197F7558k812n381K672O455L730O532M463j984j261O666J0913O736N191M216
9183A13694R263J7381J5665J5938J5114J5646K2684K7662L2297L3990N5827P9198
9171D54359J07558J34894J81354K57028L32087L64568K94674J25376q9741k50287
9161A911870l16753k97490k46462j86373j35140r4499o2439m4335k7702j9365
9151D81312o683N959J6327K3860M5324P2857J05119J29054J46956J64443J65256
9140A349784J40943R7339L8424l9772j01417j44139j71490j66654j58328j37396
9130G07294j09906r5147p4670m7780l9827l8705k1346j7579k1124j1550k1014
9119B08646j6664p398r356j4268j4978q283m253n955l024r860k622q814r897k003
$$ plain form
9197 67558 64746 59365 62037 68492 72222 78754 83217 81233 79972 86638 97551 104287 109478 113694
9183 113694 122957 140338 156003 171941 187055 202701 225385 253047 285344 319334 375161 454359
9171 454359 561917 696811 878165 1135193 1467280 1831848 2126522 2251898 2162157 1911870
9161 1911870 1595117 1297627 1051165 864792 729652 635153 572714 528379 500677 481312
9151 481312 474629 480588 496915 520775 566099 638956 744075 873129 1020085 1184528 1349784
9140 1349784 1490727 1588066 1626490 1586718 1485301 1341162 1169672 1003018 844690 707294
9130 707294 597388 502241 427571 379791 339964 301259 279913 262334 241210 229660 208646
9119 208646 191982 184584 175228 160960 145982 137699 133446 127491 124467 114607 111985 103171 93274 91271
9105I1271Q459K542o361o355o929J375L180R29p484o975O161N811P220J501m146
9090I0199n008j0180j0127O015M381j0414k041N276L352N947R069P246n441j436
9076H6838K592J0140K804M70O158j894n214q78J1771J223r17N039j569J90J531
9061A18284N285P436L215R94Q799J8338J9903N615o403j8428k6162k8351k4179
9048H4346j4435o949j0424p042n752r128p139L92J053P816J3980J4167O276J939
9034F9100r42m181n516k311m65j166j745N614L60N54k971l313M662J288j1969
9019D6999m195K435k533j1530P35R962Q286K320N330m607j423N749j669N238J1142
9004G2239J1088K689L972J8987K2891K6869L0104K8817L8088K5884k519k3057
$$ plain form
9105 91271 99730 102272 95911 89556 82627 84002 87182 88111 80627 73652 79813 85624 92844 94345 90199
9090 90199 85191 75011 64884 70899 75280 64866 62825 68101 71453 77400 86469 93715 88274 86838
9076 86838 89430 99570 102374 102844 109002 107108 101894 101016 112787 114010 113093 118132 116563 116753 118284
9061 118284 123569 131005 134220 135214 144013 162351 182254 187869 181466 163038 136876 108525 84346
9048 84346 69911 62962 52538 45496 39744 30616 23477 23869 24922 32738 46718 60885 67161 69100
9034 69100 68158 63977 58461 56150 55685 54519 52774 58388 58748 59302 56331 53018 57680 58968 46999
9019 46999 42804 45239 42706 31176 31911 41873 50159 52479 57809 53202 51779 57528 55859 61097 72239
9004 72239 83327 86016 89988 108975 131866 158735 188839 217656 255744 281628 279109 256052
8992B56052l1252k7774j3033j0742q970k1331k4849j4461k0656j0084j0698j1861
8980E0341m489J944R227O836l13q618L506Q625L152n76p462j3731m429p433k084
8965C4496n014R616M796K988P575J3496P170P241Q827K273o426q518j0442k726
8951F5352m289q785l347M838K334o81j4777r811q746o554p954m754L53J1082J8523
8936C2784R704M586M351P663J1706L2422K0123k581o230q999m083K403J4613J1138
8922A29600L51k062j553R587L760K85O804K151N185P379l300j1245l005j0430
8908A33507O32J1012K2034K5800K4062K9510M6328O1923Q3234J13735J11847P6042
8896G39666M947l9974p8518r3750q7843o8048m3359l9588k6140j0256J150J1566
$$ plain form
8992 256052 224800 197026 183993 173251 164281 142950 118101 103640 82984 72900 62202 50341
8980 50341 45852 47796 57023 63859 63546 54928 58434 67059 70211 69635 62173 48442 44013 36580 34496
8965 34496 29482 39098 43894 46882 54457 67953 75123 82364 91191 93464 87038 78520 68078 65352
8951 65352 61063 52278 48931 53769 56103 55422 40645 30834 22088 15534 7580 2826 3179 14261 32784
8936 32784 42488 47074 51425 59088 70794 103216 123339 120758 114528 105529 101446 103849 118462 129600
8922 129600 129951 127889 126336 135923 139683 139968 146772 148923 154108 161487 158187 146942 143937 133507
8908 133507 134139 145151 167185 192985 217047 246557 292885 354808 438042 551777 663624 739666
8896 739666 744613 704639 626121 532371 444528 376480 333121 293533 267393 257137 258287 269853
8884B69853J6656Q799k015q744j7424j1209j0762j8701n683m245L894J1662P535
8871B39616P871j2866l3661m5112k7479P65J2351K1872R200N015L764n303l375
8858A72658R609J1980Q738R709J5086K2192J4742L403k017k362M032J6345J8342
8845C02457J0368R057N505K066J847P957R059Q502J3453K4572K6814J4343J0908
8832D46908M827L287M575L304n436o6l305r289r298m360o611M153L676J5045K5239
8817D72649L3372J4927K6047K9982M1248M4630M1439K9455J5586l012l81N190
8805G51132l586o762L992J6296K5751L0531L8454M8020M6687N9084O2919P1277
8793A143795O3037O6512P0663P6392Q2133P5257P1980P8317P1189P2676Q2875
$$ plain form
8884 269853 286509 295308 293293 284549 267125 255916 245154 226453 220770 216525 220419 232081 239616
8871 239616 247487 234621 200960 155848 128369 129134 141485 163357 172557 177572 181336 176033 172658
8858 172658 182267 194247 202985 212694 227780 249972 264714 268117 266100 263738 267770 284115 302457
8845 302457 312825 321882 327387 329453 331300 339257 348316 356818 370271 394843 421657 436000 446908
8832 446908 451735 455022 459597 462901 457465 457399 454094 444805 435507 431147 424536 428689 432365 447410 472649
8817 472649 506021 520948 546995 576977 618225 662855 704294 733749 749335 746323 745942 751132
8805 751132 747546 740784 744776 761072 786823 817354 855808 903828 950515 1009599 1072518 1143795
8793 1143795 1206832 1273344 1344007 1420399 1502532 1577789 1649769 1728086 1799275 1871951 1954826
8782A954826R8884J05488J21253J28813J40303J52400J86439K16547K52966K80976
8772C638895L05716L35035L96168M36795M90404N69336O52822P88028R79137J253162
8762I845498J676997K374167L524061M909163N147760L165464J282616M61292
8754C2387018M90561J547587K872515M158141N829361Q303463J1951487J7480141
8746H5020274K5954281L8958424N7608503P7101151P9033021M4714278o716012
8739D01673920m6179579o9226193p0669304n5704800l8927240k6588894j8391484
8732G5986426j3002150r489549p256537n798671m706177l933783l453844l071414
8724B5274301k728816k409469k064675j740077j485024j284027j118421r88589
$$ plain form
8782 1954826 2053710 2159198 2280451 2409264 2549567 2701967 2888406 3104953 3357919 3638895
8772 3638895 3944611 4279646 4675814 5112609 5603013 6172349 6825171 7613199 8592336 9845498
8762 9845498 11522495 13896662 17420723 22329886 27477646 30643110 31925726 32387018
8754 32387018 32877579 34425166 37297681 41455822 47285183 55588646 67540133 85020274
8746 85020274 110974555 149932979 207541482 284642633 363675654 408389932 401673920
8739 401673920 355494341 286268148 215598844 159894044 120966804 94377910 75986426
8732 75986426 62984276 53494727 46238190 40439519 35733342 31799559 28345715 25274301
8724 25274301 22545485 20136016 18071341 16331264 14846240 13562213 12443792 11455203
8716A1455203q96175q20493p35807o62931o13564n86459n38006m80680m34075
8707E687013l83838l44092l22911k94844k73537k48823k26282k16926j96156j70018
8697C009586j58851j53347j45956j20641r6217p6766p8348p3130o2093n9412m4929
8686A939896l4796l3936l8612l5861l7141m4005m3528m0368o4083p3900p1948
8675A421718o8707p0559o5565m9791l3322q214R063J4069K1140K2371L0849K2847
8663A245899k0166m7091n0413n4422o2131n4724m4372n1330l9293l0877l5492
8652G55588k2614j5921k0217k6161j5457r241R61M524P5k011l740j0309j0138
8639F25339l247l222Q193K553J4330K1116J9836J3496J7995K1173J0299n868n150
$$ plain form
8716 11455203 10559028 9738535 9002728 8339797 7726233 7139774 6601768 6121088 5687013
8707 5687013 5303175 4959083 4636172 4341328 4067791 3818968 3592686 3375760 3179604 3009586
8697 3009586 2850735 2697388 2551432 2430791 2334574 2257808 2179460 2106330 2044237 1984825 1939896
8686 1939896 1905100 1871164 1832552 1796691 1759550 1715545 1672017 1631649 1567566 1493666 1421718
8675 1421718 1353011 1282452 1216887 1167096 1133774 1125560 1134623 1148692 1169832 1192203 1223052 1245899
8663 1245899 1225733 1178642 1128229 1073807 1011676 956952 912580 861250 821957 791080 755588
8652 755588 732974 717053 696836 670675 655218 645977 646938 651462 651537 649526 645786 635477 625339
8639 625339 622092 618870 627063 629616 643946 665062 684898 698394 716389 737562 747861 741993 736843
8626G36843k835L922O135J8297M1140P7295J13217Q6003l278n0240r0905p2057
8614H63537j9360J282j2708k8355k2123j3773j3634n143l123K1630L3235L4924
8602H36389L6767L2738K0245Q615m838j2878k3722k8899k8896k9896k8041l0412
8590G47172k7824j5589r449J4101Q2804J63015R7779m5666r9191j33070j14501
8579F59581o0948k2856Q56J8441M2898L1662l330m0623o3331n9701l6788k0791
8567D45070j2231j0803j7817k4206j6598o539o663o809p321o398n681m947m842
8554C14215O820J2844K6816N5211Q8423J26137J28238R7834M2714N836K0645N2978
8542I78711N2356j3385q7406j46310j53412j15274p4452n6427l9473j9409j8128
$$ plain form
8626 736843 734008 737930 744065 762362 803502 880797 994014 1080017 1076739 1026499 935594 863537
8614 863537 844177 845459 832751 804396 782273 768500 754866 749723 746600 768230 801465 836389
8602 836389 873156 905894 926139 934754 929916 917038 893316 864417 835521 805625 777584 747172
8590 747172 719348 703759 694310 708411 791215 954230 1052009 1006343 907152 774082 659581
8579 659581 598633 575777 576633 595074 637972 669634 666304 625681 562350 502649 465861 445070
8567 445070 432839 422036 404219 380013 363415 356876 350213 343404 336083 329685 324004 319057 314215
8554 314215 321035 333879 360695 415906 504329 630466 758704 856538 899252 905088 925733 978711
8542 978711 1031067 1017682 930276 783966 630554 515280 440828 384401 344928 325519 307391
8531C07391j8154j4146j3002j2667j1240j464l333J789l374m607n083j302L272
8518B24080Q457J0061R664M513l929j593K46l666J059L836K1694L2958N3135Q3452
8504D43967J22973J81914K08764J46790K8550o4673j14033j37438j41033j25260
8494E50521j06899q0256n3865k4935j6972q817o136p656j4601j4026j4339r079
8482A92940j889n57K174O55j432L707N83l895o623J054l489r169j0758j10m63
8467A62728J964L163O812J0340p570M648J5060J1788K4671N0153O8550Q2458N9876
8454D94641J9467l7615o2711p4571o7278m5916l0498k7333j5614j0358r574m009
8442A28631P315J1126J0854j405q322j4456p000j345o558o563k0089k8679m2685
$$ plain form
8531 307391 289237 275091 262089 249422 238182 236718 233385 235174 231800 227193 222110 220808 224080
8518 224080 232537 242598 252262 256775 252846 251253 251499 247833 248892 252728 274422 307380 360515 443967
8504 443967 566940 748854 957618 1104408 1132958 1068285 954252 816814 675781 550521
8494 550521 443622 363366 309501 284566 267594 258777 252641 244985 230384 216358 202019 192940
8482 192940 191051 190494 192668 193323 191891 195598 196181 192286 185663 186717 183228 174059 163301 163191 162728
8467 162728 164692 167855 174667 185007 177437 182085 197145 208933 233604 283757 352307 434765 494641
8454 494641 514108 476493 413782 339211 271933 226017 195519 168186 152572 142214 132640 128631
8442 128631 135946 147072 157926 156521 148199 133743 126743 125398 118840 112277 92188 63509 20824
8429B0824l5598j6100o246J5741K3098J0164J4752J2211O470j622l300l349L262
8416D0307P388r60J483p944l285N928k55M735J2199P102k62o064J849k777j488
8401E7956J3131J3009L874L241n131n880Q5M735K769K253m276n049P09L25N058
8386H6809Q026K130K942j049j818n098p600N585L619l749L126O890m259m274n312
8371H5968J572Q709J067O866O612m128k06J767L429N43O848J4176J2348J0117
8357A55688J6363J6270J1267J5120J7821J3282J4870J8737K4153L7719N7960P6512
8345D75762R5668J16355J40610J68304J77434J60570J37792Q3662J8135m2107
8335A532185j09676j58437j71397j63974j47851j30183j12513q5900n9199m0362
$$ plain form
8429 20824 -14774 -30874 -37120 -21379 1719 11883 26635 38846 45316 43694 40394 37045 40307
8416 40307 47695 46735 48218 40274 36989 42917 42662 47397 59596 66698 66436 60372 62221 59444 57956
8401 57956 71087 84096 87970 91211 86080 80200 80285 85020 87789 90042 85766 80717 81426 81751 86809
8386 86809 94835 96965 99907 98858 97040 91942 84342 89927 93546 89797 92923 99813 95554 91280 85968
8371 85968 87540 96249 97316 104182 110794 106666 106460 108227 111656 112199 119047 133223 145571 155688
8357 155688 172051 188321 199588 214708 232529 245811 260681 279418 303571 341290 399250 475762
8345 475762 571430 687785 828395 996699 1174133 1334703 1472495 1556157 1574292 1532185
8335 1532185 1422509 1264072 1092675 928701 780850 650667 538154 452254 393055 352693
8325C52693l1130l3640l1074k0143j5575j5136j0690k3092j4287j7497j9969n338
8313A15122K535n384l366k822N276J1824j45n744r921o503N86o179k839n242k962
8298H4236k074L393N18p212r376l55O43N128Q483M134j024o302m016l015j686
8283G1475j899m601l308O341P807M417O552J2895K726j1133m022L286N43k994
8269H8085k15O814R866L730J2207O494N041K005r338o823k118j457n903j0236
8255I8152K544P278M615m796r340k269j857O78m819j339j210n56P181J759l646
8240I2375m46M38N53Q531Q462J0342R035J9087J8279J7807J1729J6396J2160P949
8226B32697M33j298j6153j2191r488o006j3826k0321j0313o244j4072q163K109
$$ plain form
8325 352693 321563 287923 256849 236706 221131 205995 195305 172213 157926 140429 120460 115122
8313 115122 117657 112273 108907 106085 111361 123185 123040 117296 107375 100872 101458 95279 92440 87198 84236
8298 84236 82162 85555 86073 78861 69485 69130 69773 74901 83384 87518 86494 80192 76176 73161 71475
8283 71475 69576 64975 61667 68008 75815 80232 86784 99679 102405 91272 87250 90536 91079 88085
8269 88085 87870 94684 104550 108280 120487 126981 132022 134027 124689 117866 115748 114291 108388 98152
8255 98152 100696 107974 112589 107793 98453 96184 94327 95005 90186 88847 87637 87081 94262 96021 92375
8240 92375 91929 92367 92920 101451 109913 120255 129290 148377 166656 184463 196192 212588 224748 232697
8226 232697 233130 231832 215679 203488 194000 187994 174168 153847 143534 137290 123218 115055 117164
8213A17164n388k391J380M15L591L20n775J452N951j037Q549Q684J775M102R177
8198A47969J0501R238J0027J0277J5497J5537J1161K713o313j0447j0870j2380
8186A92910j1962r426n507j2689j5465q650r850n992j2063k563Q661j527r258
8173I6619q74l751r559l798R186J0157m363l986k556k39J710m04K677Q383L834
8158A03036K283o689J201L550K374j1107m700j366n560q572k687j189K319K566
8144G5459o358n666K720P334q964k538J097j341K091l016l018l638j79J218m601
8129E0600m478l319Q12j1526l30J796k597k229K039J53k757j476K268j102K912
8114C0766N852r73p90R19N311O031L617k659n526L424K029j715K224J510l650
$$ plain form
8213 117164 111776 109385 110765 111180 114771 115091 109316 110768 116719 115682 124231 132915 134690 138792 147969
8198 147969 158470 167708 177735 188012 203509 219046 230207 232920 226607 216160 205290 192910
8186 192910 180948 171522 166015 153326 137861 129211 119361 113369 101306 98743 107404 105877 96619
8173 96619 95745 91994 82435 78637 87823 97980 93617 89631 87075 86836 88546 88142 90819 99202 103036
8158 103036 105319 98630 99831 103381 105755 94648 89948 88582 83022 74450 71763 70574 72893 75459
8144 75459 69101 63435 66155 73489 64525 61987 63084 61743 63834 60818 57800 54162 53983 55201 50600
8129 50600 46122 42803 43615 32089 31759 33555 30958 28729 30768 30921 28164 26688 28956 27854 30766
8114 30766 36618 35645 34855 35774 41085 47116 50733 48074 42548 45972 48001 46286 48510 50020 46370
8099D6370j064l665j574L919J0481J2581O118J238l74r496n771m212k102l446
8085D9003n764j842N577L358r58l209q13N089J721r962o223O123P391n779p944
8070C5768j948K580P076N626M31P21O643R274K865j946O47l77L551l744j1160
8055E6007n286l736J063J2643O47M89J2570M485K046J396l516l773j1179o617
8041E7239j462K517M55P97j216p312r373K014M412j035L462N954J494m88k901
8026E4557N330J1490k354l13N534J190J073J0281M241l632J435j707J786Q41o626
8011H3126k141J015j682K573m319j318N438L493m644L054J4765J7766J1540J3820
7997A42486Q610P330N42j1910j8113k0497k744K276R735j308k865j924j78J818
$$ plain form
8099 46370 45306 41641 40067 43986 54467 67048 73166 74404 74030 64534 58763 54551 52449 49003
8085 49003 43239 41397 46974 50332 49374 46165 45352 50441 52162 42200 35977 42100 49491 43712 35768
8070 35768 33820 36400 43476 49102 49533 50254 56897 66171 69036 67090 67737 67360 70911 67167 56007
8055 56007 50721 46985 48048 60691 61338 61827 74397 78882 80928 82324 78808 75035 63856 57239
8041 57239 55777 58294 58749 59546 58330 51018 41645 43659 48071 47036 50498 56452 57946 57458 54557
8026 54557 59887 71377 69023 68710 74244 75434 76507 86788 91029 87397 88832 87125 88911 89752 83126
8011 83126 80985 82000 80318 82891 78572 77254 82692 86185 81541 84595 99360 117126 128666 142486
7997 142486 151096 158426 158968 147058 128945 108448 105704 107980 117715 116407 113542 111618 111440 113258
7983A13258O17K837K230Q163J1317K9794L4997J6976O21j6726j3132j2217j2494
7970A66241j2449j4655p987m524j0768j901O842Q70n532L654P359L851J4502J5016
7956A60519J0906N022m534n420n795p150o665l955o691k414O262P280O366K1423
7942A75154K2046Q246M284O422p082j3827L410R516R569J909j4134j3152j0913
7929A81448j7211j3046p324j2376p338r327r620p566k44N102L453N242J991n658
7915A07526n247K205m980l019k658J808n473k861j435j247j462M504K075M521
7901I4257R317P301O296J4819O693n490j1910j1918j1813l446p803q632n200m490
7887F7981m510K416n97k50l155j849K27q83O10j147k140j0724K784R670Q78m40
$$ plain form
7983 113258 113875 116712 118942 127105 138422 168216 203213 220189 220810 204084 190952 178735 166241
7970 166241 153792 139137 131150 126626 115858 113957 120799 121669 116137 119791 127150 131001 145503 160519
7956 160519 171425 176447 171913 166493 160698 153548 146883 142928 136237 133823 140085 147365 153731 175154
7942 175154 197200 205446 209730 216152 209070 195243 198653 208169 217738 219647 205513 192361 181448
7929 181448 164237 151191 143867 131491 124153 114826 105206 97640 97396 102498 105951 111193 113184 107526
7915 107526 102279 104484 99504 96485 93827 95635 90162 87301 85866 84619 83157 87661 89736 94257
7901 94257 103574 110875 117171 131990 138683 133193 121283 109365 97552 94106 86303 77671 72471 67981
7887 67981 63471 65887 65290 65040 61885 60036 60263 59380 59990 58843 56703 45979 48763 58433 59311 58871
7871E8871J263n496j919l509j441J056j519N940J063r021r95l518l624J49O975
7856D4275r15k228l967K120k633K751m213l963M704P241j716p788j2474j0114
7842A1080J97K328K197j381l448M411J239k42k617l240L785J987K365J162j226
7827A8597K835Q429K638n823k930k611j645l853m988O208R706l822k30O114R57
7812B9582R32k74q619k937K243j481m334oM316K713J276m02m860k561L404M323
7796B3315p137m114Q433l621n953j181m867j423K27M251O171M735M770l901j456
7781A8249p378j091J522p00P884O788P49j554l576m303o073N516n44k919M457
7766A7027r378o85L33K179J341K484L196J999k460k628N705K215n966m161q90
$$ plain form
7871 58871 60134 54638 52719 49210 47769 48825 47306 53246 54309 45288 44293 40775 37151 37300 44275
7856 44275 43360 41132 37165 39285 36652 39403 35190 31227 35931 43172 41456 33668 21194 11080
7842 11080 11277 13605 15802 14421 10973 15384 16623 16381 13764 10524 14309 16296 18661 19823 18597
7827 18597 21432 29861 32499 26676 23746 21135 19490 15637 10649 16857 26563 22741 22511 28625 29582
7812 29582 30514 30240 21621 18684 20927 19446 15112 15106 19422 22135 23411 23009 18149 15588 18992 23315
7796 23315 16178 12064 20497 16876 10923 9742 4875 3452 3679 7930 14101 18836 23606 19705 18249
7781 18249 10871 9780 11302 10602 18486 25274 26023 24469 20893 16590 10517 16033 15489 12570 17027
7766 17027 7649 6964 7297 9476 10817 13301 16497 18496 16036 13408 19113 21328 15362 11201 10311
7751A0311m254P871R95m120R50q914J075R169M483j790j459m703L9l75l313L865
7735I830L220J256o69j695k302K526K901j066L059j562K812n924L859J0175L460
7720B9880m385k767m72P86j99M18q617r435o499L03K997J883j328Q198N080N2
7704A5895q889m932L977M324j381J433O260P173m971l374n498k353L030J431k744
7689I381N001K390m186j019p2O502M224k107n536q260J728J0160k25J010M525
7674B3516L145m430l482m95r17m189J370N369L222m839j390M411l514q035l669
7659F073L399R256J743p961k381K167J386m97J841K267k097j237m051J820Q71
7644A2599K953O351Q135j135m132K712j620K962J357J595q030q636k170m737L274
$$ plain form
7751 10311 6057 13928 14923 10803 11753 2839 3914 13083 17566 15776 14317 9614 9653 9278 5965 9830
7735 9830 13050 14306 13637 11942 9640 12166 15067 14001 17060 15498 18310 12386 16245 26420 29880
7720 29880 25495 22728 22256 23042 22843 23261 14644 5209 -1290 -987 2010 3893 2565 10763 15843 15895
7704 15895 7006 2074 6051 10375 8994 10427 16687 23860 18889 15515 10017 7664 10694 12125 9381
7689 9381 14382 16772 12586 11567 11495 17997 22221 20114 14578 6318 8046 18206 17981 18991 23516
7674 23516 26661 22231 18749 18254 17337 13148 14518 19887 23109 18270 16880 21291 17777 9742 6073
7659 6073 9472 18728 20471 12510 10129 12296 13682 13185 15026 17293 15196 13959 9908 11728 12599
7644 12599 15552 21903 30038 28903 24771 27483 25863 28825 30182 31777 23747 15111 12941 8204 11478
7629A1478j2L358j931n146P84L968M941P438m15r638m864n06N791O851L918n249
7613B0766m615j110m102P560P506J218p790o504O448k286l813P307M548m12M69
7598B5190j427n634L116N682K64j4062n439j310m742Q47M463l55o52j024L948
7583H865M439K015r749M398j112K600N048n253p217K202L351J199Q095j44l32
7568A8405O54J103K953M098k432l02M279j810o346m739P933K640m665k098j621
7553A8052k909j694p681p461R96O685k191m567N059q90J504M510o612l484Q358
7538G675p91l245k84K811j625n460o55m207J74N84m41P462J04j440j80L790j05
7521D167Q654j212M76Q07L34n177l529j991M175J549M89J478K41O99J112Q84m400
$$ plain form
7629 11478 11466 14824 12893 7747 8531 12499 17440 24878 24463 14825 9961 9455 15246 22097 26015 20766
7613 20766 16151 15041 10939 18499 26005 27223 19433 12929 19377 17091 13278 20585 25133 24721 25190
7598 25190 23763 18129 21245 26927 27191 13129 7690 6380 1638 2485 6948 6593 5941 4917 8865
7583 8865 13304 15319 5570 9968 8856 11456 16504 11251 4034 6236 9587 10786 18881 18737 18405
7568 18405 19059 20162 23115 27213 24781 24479 28758 26948 20602 15863 23796 26436 21771 19673 18052
7553 18052 15143 13449 5768 -1693 -697 5988 3797 -770 4289 3399 4903 9413 2801 -683 7675
7538 7675 6884 3639 3355 6166 4541 -919 -1574 -5781 -5607 -5023 -5464 1998 2102 662 482 4272 4167
7521 4167 12821 11609 12085 12892 13226 8049 4520 2529 6704 8253 8742 10220 10461 11160 12272 13156 8756
7504H756N622Q923l322k996k250N124J389n929m582l410k816P967j105m370L579
7489A0580O356k144j646k577n162K539L942j592m87n558J975P86M076J650o107
7474F631L632P406k294m849O087M086q279p159j975J627j245L107J246n27l199
7459D295m47L233J315n305L268P36k108J130P729L157Q84p373m919r96L918o157
7443B360p079L247Q979M406j0762m296N89K112Q489O549Q58r344p779k462L315
7428h18N219M333k980l325M643J29j13n83m116l591k433J362L503J839m112Q16
7412b27o8J908j393J400p71K108K227l6k826m252K486J1329N619l415m46k6n871
7395G746m998L934K190j461n545n90K28L991J596l031l935Q7J132l501P407L62
$$ plain form
7504 8756 14378 23301 19979 16983 14733 19857 21246 15317 10735 7325 4509 12476 11371 7001 10580
7489 10580 16936 14792 13146 10569 5407 7946 11888 10296 9809 4251 6226 7012 11088 12738 6631
7474 6631 10263 17669 15375 10526 16613 20699 12420 5261 3286 4913 3668 6775 8021 7494 4295
7459 4295 3848 7081 8396 3091 6359 7095 4987 6117 13846 17003 17887 10514 5595 4599 8517 2360
7443 2360 -4719 -1472 7507 11913 1151 -3145 -2556 -444 8045 14594 15452 6108 -1671 -4133 -818
7428 -818 4401 8734 5754 2429 7072 7201 7088 6505 2389 -1202 -3635 -2273 1230 3069 -1043 -227
7412 -227 -295 1613 220 1620 849 2957 5184 5148 2322 -1930 556 11885 17504 14089 13643 13617 7746
7395 7746 2748 6682 8872 7411 1866 1276 1504 5495 7091 4060 125 212 1344 -2157 5250 5612
7379E612k355M527O193L913l108j558j117j956K145l39n037N507l51n342L747
7364A0481O581R8j1561m389O811K510L978l678L40m971M032L909k333m08l282
7349H118j0818k021N237j75p154r05K121Q02J585J34Q921J513O729k040k058j535
7333H454K206k25m73r683q306K795J960L358J930L072n809o72K979P354p638J467
7317B769R251j702j1515R06J763n92j650P86o704J744O401Q88j153Q870n16m314
7301E232J092n318q55M558J020p004n28O702O478K433j108m317j857P51k594O60
7285E345L549k269m53M028K322m333r41K307p569r036L151P6J126Q32%k778N864
7268A221O800J0473o07p428j1548j368J0001R5l328K054o062P89M19K802P199
$$ plain form
7379 5612 3257 7784 13977 17890 14782 13224 12107 10151 12296 11957 6920 12427 12076 6734 10481
7364 10481 17062 17160 5599 1210 8021 10531 14509 10831 11171 6200 10232 14141 11808 11400 8118
7349 8118 -2700 -4721 516 341 -6813 -7718 -5597 -4795 -3210 -3076 5845 7358 14087 12047 9989 8454
7333 8454 10660 10435 9962 279 -8027 -5232 -3272 86 2016 5088 -721 -1393 1586 8940 1302 2769
7317 2769 12020 10318 -1197 -291 1472 880 -770 16 -6688 -4944 1457 2345 1192 10062 9546 5232
7301 5232 6324 1006 151 4709 5729 -1275 -1803 4899 11377 13810 12702 8385 6528 7279 4685 5345
7285 5345 8894 6625 6172 10200 12522 8189 7248 9555 1986 -7050 -3899 -3823 -2697 -1865 -1865 -4643 1221
7268 1221 8021 18494 17887 10459 -1089 -2457 7544 7639 4311 6365 303 1092 1511 4313 11512
7253A1512J465q776l720N85K380R516O34q26J067q81m895Qj024l945j646PJ909
7236C370K79J488N95M22J165j788M38M851K827k031l696q741n2J331K269P300
7220A0027K427O42j3171l762M345P409j450m331n594K482Q07K347P77M1J915j087
7204C824k047n260J029L987j405q869j955L372O662L819J411M773k892k588q0
7189C781k35L62O489j019O87K40l883m698K943l707n971l651M756N10L653M165
7173D422k721j000P82J959L782L259J823J625l060L493k538m976l606j676J007
7158B575K162k61K615N679j236n133M518o96J413P7l230p579j995J628k402J962
7142I7L790l21n402M508N873k60k773l320k791m885Q227O001R245K806m174j1841
$$ plain form
7253 11512 12977 4201 481 1066 3446 12962 13596 12770 13837 12956 8061 8069 7045 3100 1454 1461 3370
7236 3370 3649 5137 5732 6154 7319 5531 5969 10820 13647 11616 7920 -821 -873 458 2727 10027
7220 10027 12454 13096 -75 -3837 508 7917 6467 2136 -3458 -976 -169 2178 2955 2996 4911 3824
7204 3824 1777 -3483 -2454 1533 128 -8741 -10696 -7324 -662 3157 4568 9341 6449 3861 3781
7189 3781 3546 3908 10397 9378 10065 10305 6422 1724 4667 960 -5011 -8662 -3906 -3396 257 4422
7173 4422 1701 701 1483 3442 7224 10483 12306 13931 10871 14364 11826 6850 3244 1568 2575
7158 2575 4737 4476 7091 12770 11534 6401 10919 10223 11636 11713 8483 904 -1091 537 -1865 97
7142 97 3887 3566 -1836 2672 8545 8285 5512 2192 -599 -5484 2743 8744 17989 20795 16621 4780
7126D780r39J619R035L236j761m039m709M95J32r30N758J602p965n220O147Q368
7110A5609M083n794j496l905p957L929Q694j504l734J197n825r79K834K063l213
7095D002J042n34k824l481L342J674M726L310K698r188n680q232K325Q226P071
7080H477o25n256m610J950J815L40j488P70k50J305j0190j251O930L90K255Q914
7064I476k453L57L462k193p676j786M872n110m12P868M983l044r298M35M430k278
7048A633k292P54l515J543m379m121j311O282R69o432L899K225K659O96n327J304
7032e413K715Q111M575m647l809N462J6K460P0N019m179n415P31L231M757o069
7016G615n422o72M378M414k146l252K569p69L222j415k723J336o127M437O447
$$ plain form
7126 4780 3841 5460 14495 17731 15970 11931 7222 7717 7849 6919 12677 14279 6314 1094 7241 15609
7110 15609 19692 13898 12402 8497 540 4469 13163 11659 7925 9122 3297 2318 5152 7215 4002
7095 4002 5044 4510 1686 -1795 1547 3221 7947 11257 13955 4767 -913 -9145 -6820 1406 8477
7080 8477 7852 2596 -2014 -64 1751 2091 603 1373 1123 2428 -7762 -9013 -2083 -1693 562 9476
7064 9476 7023 7380 10842 8649 973 -813 4059 -1051 -1463 6405 11388 8344 -954 -519 3911 1633
7048 1633 -659 95 -3420 -1877 -6256 -10377 -11688 -5406 -4437 -10869 -6970 -4745 -2086 -1390 -6717 -5413
7032 -5413 -2698 5413 9988 5341 1532 6994 7010 9470 9540 14559 10380 4965 5696 8927 13684 7615
7016 7615 2193 1521 5899 10313 8167 4915 7484 6715 9937 8522 5799 7135 1008 5445 11892
7001A1892K26m95O047m241j1163p651k518J1012L201j133j841r28P617l093j406
6986E526l243j0984k039n288J1534J0379M668q117m702q88N628K1K907J231l859
6971B774m03R128M280n297o952n693q77N364J909K550L378n773m307N81n225O842
6955B279Q118N110Q1k515K64Q515j922k933p194j229L212K607j120J807l741j937
6939I402J980n387R19j787o295J349K805j114L424l438j770J450N034J270j541
6924F301j352J711M358n788p821n75M529O970K380o35m958n038o861K130l230
6909g879N920N117p434n243O268J0880N295j440n840L837P808K085l70j220n057
6894A2727j420j540j668l370o115k177Q03K058m488j205P202J0908o254k568R16
$$ plain form
7001 11892 12118 11623 17670 13429 2266 -5385 -7903 3109 6310 5177 3336 2408 10025 6932 5526
6986 5526 2283 -8701 -10740 -16028 -4494 5885 10553 2436 -2266 -3154 2474 2495 5402 6633 2774
6971 2774 2371 11499 15779 10482 3530 -2163 -3040 2324 4233 6783 10161 4388 81 662 -4563 2279
6955 2279 10397 15507 15588 13073 13337 21852 19930 16997 9803 8574 11786 14393 13273 15080 11339 9402
6939 9402 11382 5995 6914 5127 -1168 181 2986 1872 5296 1858 88 1538 6572 7842 6301
6924 6301 4949 6660 11018 5230 -2591 -3166 1363 8333 10713 10078 5120 82 -6779 -4649 -7879
6909 -7879 -1959 3158 -4276 -9519 -3251 7629 12924 11484 5644 9481 17289 19374 19004 17784 12727
6894 12727 11307 9767 8099 4729 -1386 -3563 -2760 -702 -5190 -6395 807 11715 5461 2893 3809
6879C809n414L261K848K740o536j3193N52J802P037R486o775o617L13L372o013
6864i328L859J562m405O030L941M284j496K491K932k165k958k032j247L935L689
6849I092M04n437k151K477L97q731P14l832M833K426l333m475o62J847K823l675
6833g283K791N168m427q4K903J182J2572K352m732J78k712l189m68K668r617p797
6817a0495l695N555R822O000j63k611k000l486m329r72N549Q695M687r5o23k424
6801I415m002J896J190p38k78L692K320m887J260J930j83m574J124R496j1j442
6785A6208j120j286K876P741p488k019N422l022J658L787L375J235k428L036R148
6770C7123R298M202Q550J6211K0372J6228J0858j42k301m218j4765p983o607m520
$$ plain form
6879 3809 -1605 1656 4504 7244 708 -12485 -11933 -10131 -3094 6392 -383 -7000 -6687 -3315 -9328
6864 -9328 -5469 -3907 -8312 -2282 1659 5943 4447 6938 9870 7705 4747 2715 1468 5403 9092
6849 9092 9496 4059 1908 4385 4782 -3949 -3235 -7067 -2234 192 -3141 -7616 -8278 -6431 -3608 -7283
6833 -7283 -4492 676 -3751 -3835 -932 250 12822 15174 10442 10620 7908 4719 4251 6919 -2698 -10495
6817 -10495 -14190 -8635 1187 7187 7024 4413 2413 -1073 -5402 -6374 -825 7870 12557 12462 11839 9415
6801 9415 5413 7309 8499 7761 7483 11175 13495 8608 9868 11798 11615 7041 8165 17661 17650 16208
6785 16208 15088 13802 16678 24419 16931 14912 20334 17312 18970 22757 26132 27367 24939 27975 37123
6770 37123 46421 50623 59173 75384 95756 111984 122842 122700 120399 116181 101416 93433 86826 82306
6756H2306K700R352Q392Q818J7311J5621K6307L0717M1488N7599R0594J34847
6744E26052J92791K86485M70138P06708Q07501L82030k28570n60399p19955o19162
6734A243619l96016k38702j47464j01666o4222m9780m1332l9157k1665k0231p189
6723A16195n027q604p305j5O686J1573J3261R544k985j9075j8299k2023j1729
6710F2197r642m136R54q067o866k070P424O258L339l938q070j100n634o416q445
6695A5788p624J653J609o312M28P724L568M071p10k2Rk925m799l805p6p78J708
6678I507N941M216r81J507n908k448j55K296l341l037O55K326p58j239K477L948
6662A5006j398J658k849J29n615k261k688n395o762K585N614l978L159L511O969
$$ plain form
6756 82306 85006 94358 102750 111568 128879 144500 170807 201524 243012 300611 391205 526052
6744 526052 718843 1005328 1475466 2182174 2989675 3371705 3143135 2582736 1862781 1243619
6734 1243619 847603 608901 461437 359771 295549 245769 204437 165280 143615 123384 116195
6723 116195 111168 102564 95259 95244 101930 113503 126764 136308 133323 114248 95949 73926 62197
6710 62197 52555 48419 49373 41306 34440 32370 39794 46052 49391 45453 37383 36283 30649 24233 15788
6695 15788 8164 9817 11426 5114 5542 13266 16834 20905 20195 20173 20182 17257 12458 8653 8577 7799 9507
6678 9507 15448 19664 18683 20190 14282 11834 11679 13975 10634 7597 8252 10578 9820 8581 11058 15006
6662 15006 13608 15266 12417 12546 6931 4670 1982 -3413 -10175 -7590 -1976 -5954 -2795 716 7685
6647G685P936r06j307J683l230n269j714j477k366N090O323L218j53O94m72o589
6631I146p869m834o230Q690Q630m034j75o887j569k004K043L065l065r954L678
6616a1369P905j687K642Q132M877p915O18M101j0075k392Q472J0556M150O02j015
6601A7602L17p149j5154o81Q702J085j262L965J222m587R01P385J060o83l237
6586I486p570J977l406l726m576j752j70N379L452l714j941R975N642k00l577
6571E279p827k02N861p12N002P038p100q913n378n688K540n9k160R669N605n70
6555B385r09j507l004j567J520L004l020J891M930k142p15J074L733l253p278
6540d858j691M971Q36l607o183K6J1548L430m157l87M232k842M873P369K017l648
$$ plain form
6647 7685 15621 14715 13408 15091 11861 6592 4878 3401 1035 6125 12448 15666 15513 16207 15735 9146
6631 9146 1277 -3557 -9787 -1097 7533 3499 3324 -3563 -5132 -7136 -5093 -2028 -5093 -15047 -11369
6616 -11369 -3464 -5151 -2509 5623 10500 2585 3203 7304 -2771 -5163 3309 13865 18015 18617 17602
6601 17602 17919 10770 -4384 -5065 3637 4722 3460 7425 8647 4060 4961 12346 13406 12723 9486
6586 9486 1916 3893 487 -3239 -7815 -9567 -9737 -4358 -906 -4620 -6561 3414 9056 8856 5279
6571 5279 -2548 -2750 3111 2399 7401 14439 7339 -1574 -6952 -12640 -10100 -10159 -12319 -2650 2955 2385
6555 2385 1476 -31 -3035 -4602 -3082 -78 -3098 -1207 3723 1581 866 1940 5673 2420 -4858
6540 -4858 -6549 -1578 -742 -4349 -10532 -10506 1042 4472 315 -72 4160 1318 6191 13560 15577 11929
6524A1929j788j455p805J559N437P45K817m375r029m027P342L66M499O590k027
6509A0778k548L14J90K494k032L632J0q884p177k192R686k288k861M599K795L249
6493I765K794l844o30L424j706n664m017j272Q33l542J047j832l5m290K019Q205
6477A255J265L5p148j221O082L673o962k202j793N077Q811j852k588l659n237
6462f464Q84M932J944p315l094N446O569nM883J83k816j986l792k143j599L54
6446d019k15K115k392J252L074j17m560m60J1021k146o199k022Q70M652j804r746
6430a0696K550O625K406n565j72N705m370Q65M809N45K110n99r01o29K044j012
6414C715j791N881J740j929N016n57k57J065k102n523n533L695J983Q852r01m872
$$ plain form
6524 11929 10141 8686 881 2440 7877 8622 11439 7064 -1965 -5992 1350 1716 6215 12805 10778
6509 10778 8230 8544 8734 11228 9196 12828 12838 3954 -3223 -5415 4271 1983 -878 3721 6516 9765
6493 9765 12559 8715 8085 11509 9803 4139 122 -1150 -317 -3859 -2812 -4644 -4679 -8969 -6950 1255
6477 1255 2520 2555 -4593 -5814 268 3941 -3021 -5223 -7016 -1939 6872 5020 2432 -1227 -6464
6462 -6464 -5580 -648 1296 -6019 -9113 -3667 2902 2897 7780 7963 5147 3161 -631 -2774 -4373 -4019
6446 -4019 -4234 -2119 -4511 -3259 -185 -302 -4862 -5322 5699 3553 -2646 -4668 -3798 854 -950 -10696
6430 -10696 -8146 -1521 885 -4680 -4852 853 -3517 -2652 2157 2702 4812 4213 3312 2683 4727 3715
6414 3715 1924 7805 9545 7616 12632 12075 11818 12883 10781 5258 -275 3420 5403 14255 13354 8482
6398H482p460n125j629N338O687k76k329r70M714J543o406l771l571Q958J0838
6383A5023K746m801l869j026n159l107m73M055L739k638l224k135q313j681L564
6368g299O788L100r827m193n54N299Q792j012L668r74j621l079L711j030l340
6353a571J055L820J657J547J782q43l596J777J13k899J307J474O60L263N888M98
6337A5932m959m055L140n281k954n116j067K708j275Q287P148J696k015j152m303
6322F734L471L499l136p669q75L79p52L187j732J625l695L263P843p139k04K9
6306D828k865J152K278J680J809q65L79J359p259R18l285l964N520P964L574n691
6290G532m932N122P121J594l529m030k373j864k744o046m454n134J913N451P136
$$ plain form
6398 8482 1022 -4103 -5732 -394 6293 6017 3688 2718 7432 8975 2569 -1202 -4773 4185 15023
6383 15023 17769 12968 9099 8073 2914 -193 -666 3389 7128 4490 1266 -869 -9182 -10863 -7299
6368 -7299 -511 2589 -7238 -11431 -11985 -6686 2106 1094 4762 3788 2167 -912 2799 1769 -1571
6353 -1571 -516 3304 4961 6508 8290 7447 3851 5628 5741 2842 4149 5623 6283 9546 15434 15932
6337 15932 10973 6918 10058 4777 1823 -3293 -4360 -1652 -2927 5360 12508 14204 12189 11037 6734
6322 6734 10205 13704 10568 2899 2024 2403 1651 4838 3106 4731 1036 4299 12142 5003 4799 4828
6306 4828 1963 3115 5393 7073 8882 8017 8396 9755 2496 3414 129 -3835 1685 9649 13223 7532
6290 7532 2600 7722 14843 16437 12908 8878 6505 4641 1897 -4149 -8603 -13737 -11824 -6373 763
6275G63L005r361p160L063J0508P204J680n453n251k394M190P742l144k059j139
6260B194O54P46n241J183O171R085P30j1849j2622j823p33k751Q193O745OM37
6244A125R30n142j796J039Q40N01M250P336L97L880o453j1183k913K021O443N164
6228F439k614m50L233m047m553J656m955j76M896J447k327J144q019J947k081
6213h460o440j180k994l015P570O558R150P152p954m490J518p12l085N177L410
6198B205j07m31n149p33n90O273L905Q46l610m098n76k076j429O516P775J610
6182A0331p846o834L761L508K949k954j453J2560K244j313j277j380k358q187
6168A751o506k214O35N068Q988k230l658m184l734k895p29Q153N415j297m832
$$ plain form
6275 763 3768 -5593 -12753 -9690 818 8022 9702 4249 -1002 -3396 794 8536 5392 3333 2194
6260 2194 2848 3594 -1647 -464 5707 14792 15522 3673 -8949 -10772 -11505 -14256 -6063 682 688 1125
6244 1125 2055 -3087 -4883 -3844 -3004 -2503 1747 9083 9480 13360 6907 -4276 -7189 -5168 1275 6439
6228 6439 3825 3375 6608 2561 -1992 -336 -5291 -5467 -571 876 -1451 -307 -8326 -6379 -8460
6213 -8460 -14900 -16080 -19074 -22089 -14519 -7961 1189 8341 387 -4103 -2585 -3297 -6382 -1205 2205
6198 2205 2098 1667 -3482 -4215 -4805 1468 5373 6219 2609 -1489 -2065 -4141 -5570 946 8721 10331
6182 10331 2485 -4349 -588 2920 5869 2915 1462 14022 16266 14953 13676 12296 9938 1751
6168 1751 -4755 -6969 -6334 -1266 7722 5492 1834 -2350 -6084 -8979 -9708 -1555 3860 2563 -2269
6153b269L13P22J0193M283p039p114p83J519L65N745m476j982J977j166J6m289
6137c985p094k401J70K531L295o72j694R6K827k293l34J057P135Q98L876K896
6121F308p91o048m026J025N987J173j0100p07M581R459j484q613q49N005L957
6106D877k348M95k060n192r94J2048O617k603m143m990k941j606L037l359m154
6091g316l509K930P374K306l345R3K689O341n388l775M06l003M28K18n74K006
6075b119N250K281l442q700j366N933J549K255J42RJ221M838l23N982o877j0923
6059d290q079l154O903N914k753K946K056Q704q83k367J940R13k521o352k836
6044c859K02J647L577l53l761j413k322N274j603j426K862M979J226n548l901
$$ plain form
6153 -2269 -1956 -1234 8959 13242 6203 -911 -1694 -175 190 5935 1459 -523 1454 288 304 -3985
6137 -3985 -11079 -13480 -13310 -10779 -7484 -8156 -9850 -9754 -6927 -9220 -9554 -8497 -1362 -464 3412 6308
6121 6308 5517 -531 -4557 -3532 2455 3628 -6472 -7179 -2598 6861 5377 -3236 -4085 920 4877
6106 4877 2529 3024 964 -4228 -5222 6826 13443 10840 6697 1707 -1234 -2840 197 -3162 -7316
6091 -7316 -10825 -7895 -521 1785 -1560 -1467 1222 7563 2175 -1600 -1194 -4197 -3769 -3551 -4125 -2119
6075 -2119 3131 5412 1970 -6730 -8096 -2163 -614 1641 1783 1792 3013 7851 7528 13510 6633 -4290
6059 -4290 -12369 -15523 -8620 -2706 -5459 -2513 -457 8247 7364 4997 6937 7850 5329 -1023 -3859
6044 -3859 -3657 -2010 1567 1214 -2547 -3960 -6282 -1008 -2611 -4037 -1175 3804 5030 -518 -4419
6029d419K562m964N91l215L2N543K173j591j410L985N257J689J734R14k899M51
6013F433k213K098K195k366k094j1429q112P171K923M107P838o440q471K960N309
5998i1j657j352L39m58q124L019M446L034J607L512N336K801k882m747j0845l570
5982i632o210k641K48j565J83Q868L615L40M284Q911Q920p164r268k492J097j126
5966c632m842j13p80M758J502K605N814l718j340j083N581P422j254j0506r483
5951i069o35o99R80k040J488Q540O073j354j211J236k851o387j397J2359K266
5936G299L913K217N9p203l499j463n219O129L443j270o823m343k341j406l075
5921a3582J043K561L430J1571L190q105l357J30K421J605M413O770L409k938k949
$$ plain form
6029 -4419 -1857 -6821 -6230 -9445 -9413 -3870 -1697 -3288 -4698 -713 4544 6233 7967 8881 5982 6433
6013 6433 4220 6318 8513 6147 4053 -7376 -15488 -8317 -5394 -1287 6551 111 -8360 -5400 -91
5998 -91 -1748 -3100 -2761 -3219 -11343 -8324 -3878 -844 763 4275 9611 12412 9530 4783 -6062 -9632
5982 -9632 -15842 -18483 -18235 -19800 -19617 -10749 -7134 -6794 -2510 6401 15321 8157 -1111 -3603 -2506 -3632
5966 -3632 -8474 -8587 -9367 -4609 -3107 -502 5312 1594 254 -829 4752 12174 10920 414 -9069
5951 -9069 -9704 -10403 -9423 -11463 -9975 -1435 4638 3284 2073 3309 458 -5929 -7326 5033 7299
5936 7299 11212 13429 13488 6285 2786 1323 -3896 2233 5676 4406 -2417 -6760 -9101 -10507 -13582
5921 -13582 -12539 -9978 -6548 5023 8213 108 -3249 -3119 -698 907 5320 12090 15499 12561 9612
5906I612n379p170k36J306l076O90N236N268P528o393q401k203L4K158M19K784
5890B177j00L684l535o919K084k116j0609K232J0430o64ol549K325l435K11M235
5874c555j518n657K968j106K052o846q14K506L429m47o47M566L704j91o98K033
5858b21n103o19K137j066j003k554l828M034J426L748l613j183oL03M536J886
5842a126n25j248L442L697P351o391n134j882K607K181O291K069j0150p568l351
5827i737K809N838l094m720K622J197R236O187n212n773m268K689O444L332o259
5812A291n595J71L487m664K154k260l678k428L087m488n694K937Q469J977j734
5797f968N961R38l790M948N517L000j454o341N326N221k49j427k089m970q371
$$ plain form
5906 9612 4233 -2937 -3173 -1867 -4943 -4253 983 6251 13779 7386 -1015 -3218 -3184 -1026 -607 2177
5890 2177 2077 5761 2226 -4693 -2609 -4725 -15334 -13102 -2672 -3336 -3342 -6891 -4566 -8001 -7790 -3555
5874 -3555 -5073 -10730 -7762 -8868 -6816 -13662 -14476 -11970 -8541 -8988 -9635 -5069 -1365 -1556 -2254 -221
5858 -221 -5324 -5943 -3806 -4872 -5875 -8429 -12257 -8223 -6797 -3049 -6662 -7845 -7851 -7548 -3012 -1126
5842 -1126 -1651 -2899 543 4240 11591 5200 66 -1816 791 2972 9263 11332 1182 -6386 -9737
5827 -9737 -6928 -1090 -4184 -8904 -6282 -5085 4151 10338 5126 -647 -4915 -2226 4218 7550 1291
5812 1291 -4304 -4133 -646 -5310 -3156 -5416 -9094 -11522 -8435 -12923 -18617 -15680 -7211 -5234 -6968
5797 -6968 -1007 -69 -3859 1089 6606 9606 8152 1811 7137 12358 12109 10682 8593 3623 -4748
5782d748k452K84L355Q787J839j93L375j274j417k841m068M529J221m477J56l038
5766i62J526J163j331m527J805M435J305l419m425j920m340r43M313J139J437
5751d744O143M247o428k803m578j68L44Q8k53K936j812J961l11j77O415k198p502
5734h840o424Q344J83k327N078N222M343J528p576o009K469k773J667n35j0399
5719a6049L517J0120J303K42J128l364J543J040M229L80j909l921m922m135O74
5704a0124K475K381M467R55o62J691K29L724r019o918L749K624J95J276R304J20
5688F467k624n333J427L039PK463k676m927p194K234M396K990M695L400K567K063
5672A2994j447k661k191l178o396k130m678L09R368O336n907R94Q492K972K625
$$ plain form
5782 -4748 -7200 -6916 -3561 5226 7065 6872 10247 8973 7556 4715 647 5176 6397 1920 2076 -962
5766 -962 564 1727 396 -4131 -2326 2109 3414 -5 -4430 -6350 -10690 -11633 -7320 -6181 -4744
5751 -4744 1399 5646 -782 -3585 -8163 -8331 -7987 -7899 -8152 -5216 -7028 -5067 -5378 -5555 860 -1338 -8840
5734 -8840 -15264 -6920 -6737 -9064 -3986 1236 5579 7107 -469 -6478 -4009 -6782 -5115 -5650 -16049
5719 -16049 -12532 -2412 -1109 -867 261 -3103 -1560 -520 3709 4089 2180 -1741 -6663 -10798 -10124
5704 -10124 -7649 -5268 -801 154 -508 1183 1412 5136 -3883 -10801 -7052 -4428 -4233 -2957 6347 6467
5688 6467 3843 -1490 -63 2976 2983 5446 2770 -2157 -9351 -7117 -2721 269 4964 8364 10931 12994
5672 12994 11547 8886 6695 3517 -2879 -5009 -9687 -9378 -10 6326 419 1413 9905 12877 15502
5657A5502l818q848o558k656o748k296P081J136j497n092M25M170M93j944K523
5642h127K298p79n75K074L25O90p05k621j743J673L409K078P781k636k803J088
5626A427K282K851k589M62m63K170J39n419n419O850J115J276q91n729J642m114
5610d410m744N539p92j464O861O60r85J105k555N0R1k680l63K409O25o50K922
5593A619Q4Q96L355j776o692l006L705L001k445J134K351n49O62l482n82L761
5577B036k989k632J216L238J341M971k543n745o379o849N931m30J833k741J743
5562g999L386N613k916M70q38k818R60J931M551L518M476j309l831n336k165m421
5546f728m591q52l456M394N232L276K630j608o698J233k847j079k730J594N909
$$ plain form
5657 15502 11684 2836 -3722 -6378 -13126 -15422 -8341 -7205 -8702 -13794 -13369 -9199 -8706 -10650 -8127
5642 -8127 -5829 -6608 -7183 -5109 -4784 -4094 -4799 -7420 -9163 -7490 -4081 -2003 5778 3142 339 1427
5626 1427 3709 6560 3971 4433 3970 6140 6279 860 -4559 2291 3406 4682 3791 -1938 -296 -4410
5610 -4410 -9154 -3615 -4407 -5871 990 1650 665 1770 -785 -735 -644 -3324 -3687 -1278 -653 -1303 1619
5593 1619 1703 2599 5954 4178 -2514 -5520 -1815 1186 -1259 -125 2226 1677 2339 -1143 -1725 2036
5577 2036 -953 -3585 -2369 869 2210 7181 4638 -1107 -7486 -14335 -8404 -8834 -7001 -9742 -7999
5562 -7999 -4613 1000 -1916 -1446 -2284 -5102 -4142 -2211 2340 5858 10334 9025 5194 -142 -2307 -6728
5546 -6728 -11319 -12171 -15627 -11233 -6001 -2725 -95 -1703 -8401 -7168 -10015 -11094 -13824 -12230 -6321
5531f321j761Q098O670M565n005n768o40l455J715K293Q217K66l402N90k037k806
5515A219l468l703N738p00k389l148M322J0510Q195k993j1073K571N368m299j488
5500D662m18J114L560L754j48J600o812r945n119m091M932L033L098j341k414
5485d535J597L984Ql968j298p551l198O940K558J491o5R67Q751Q122L943n386
5469A2360j2622k646K419k91K392j844k033m087K140Q867L23l415k68Q56m52q424
5453f725o941P630R079r262m080m954L872K554M411N0k029L28J145J972L038k805
5437b717M483j495p990l624l13L266N279l696k304K166M51Q736J72N75r64n111
5421c086Q388J911k419K458J118p214J048k535O64L028M60r4j379n350q09R480
$$ plain form
5531 -6321 -8082 16 6686 11251 6246 478 -162 -3617 -1902 391 8608 8874 5472 6062 4025 1219
5515 1219 -2249 -5952 -214 -914 -3303 -6451 -2129 8381 16576 13583 2510 5081 10449 6150 4662
5500 4662 4244 5358 8918 12672 12524 14124 7312 -2633 -7752 -11843 -6911 -3878 -780 -2121 -4535
5485 -4535 -2938 1046 1054 -2914 -4212 -11763 -14961 -8021 -5463 -3972 -4037 -3070 5681 13803 17746 12360
5469 12360 -262 -2908 -489 -780 1612 -232 -2265 -6352 -4212 4655 4978 1563 1295 2151 1699 -6725
5453 -6725 -13666 -6036 3043 -6219 -10299 -15253 -11381 -8827 -4416 -4366 -6395 -6067 -4922 -2950 88 -2717
5437 -2717 1766 271 -7719 -11343 -11656 -8390 -3111 -6807 -9111 -6945 -6494 2242 2414 2989 2025 -3086
5421 -3086 5302 7213 4794 7252 8370 1156 2204 -331 333 3361 3821 3727 2348 -3002 -3811 5669
5405E669J206m535o499P709L951o879L109L846k254o670R02K790p052M8J320K363
5389i76L22K743M925j1617l478L988J899p342q60M054r06K540N58K684K758M613
5373E905n572m055R564R01n79l057o085n12M297M371L14p94j751n955k59k847
5357f114k806j81m341L621J1891M407l7k996j593n352j862l092K657L69m01n486
5341a1316n332j073J844J485J437K932j877O46j332N275M226l942j269K685Q816
5326C205M668r090j207k699K111L618j162k991j924k341l270L39j359J540j5K40
5310a0337k61R363M7q489N947M908J204l137j237K229l536j249j078l376j574
5295a0576L582N354L635K991J59N34m910P83j584P40K664m062n403j245q96J148
$$ plain form
5405 5669 6875 2340 -4159 3550 7501 622 3731 7577 5323 -1347 -445 2345 -4707 -4659 -3339 -976
5389 -976 -654 2089 7014 -4603 -8081 -4093 -2194 -9536 -10396 -6342 -7248 -4708 -4150 -1466 1292 5905
5373 5905 333 -3722 5842 6743 6164 3107 -2978 -3490 807 5178 5492 4698 2947 -3008 -3267 -6114
5357 -6114 -8920 -9101 -13442 -9821 2070 6477 6440 3444 1851 -3501 -5363 -8455 -5798 -5429 -5830 -11316
5341 -11316 -16648 -17721 -15877 -14392 -12955 -10023 -11900 -11254 -12586 -7311 -3085 -7027 -8296 -5611 3205
5326 3205 7873 -1217 -2424 -5123 -3012 606 -556 -3547 -5471 -7812 -11082 -10743 -12102 -10562 -10577 -10337
5310 -10337 -10598 -1235 -1188 -9677 -3730 1178 2382 -755 -1992 237 -3299 -4548 -5626 -9002 -10576
5295 -10576 -6994 -1640 1995 4986 5145 5679 769 1552 -32 708 3372 -690 -6093 -7338 -8234 -7086
5279g086N065k710o989k125J026L523L633M180L614M53J723m167J852L164k749
5264B407N25l011j320l480L524N15J517j083o525L37l055l39J0433M56o149K479
5248b769k418o914K737N145M340j851J037l76j046M386l943k898Q83J91k874j220
5232g590O273J0129J11J892K964m537j1990K682O0n002q9M443O815m434r904k203
5216a0380J885K366j788k395k028k162O493J964K218K400l420O318q7p67j708
5201a091m913k508Q488J697q187n698K313L35L321Q61M020p31m237l474J56j552
5185a1200L391J296q680o060M220K535N551L638j513N526Q5l635j006l697O11
5170h938k199N141O114l485l41K465N00l026J001N511Q71p543j396l365q278L074
$$ plain form
5279 -7086 -2021 -4731 -11720 -13845 -12819 -9296 -5663 -1483 2131 2584 4307 140 1992 5156 2407
5264 2407 2932 -79 -1399 -4879 -1355 -840 677 -406 -6931 -6594 -9649 -9988 445 901 -5248 -2769
5248 -2769 -5187 -12101 -9364 -4219 121 -1730 -693 -1069 -2115 2271 -1672 -4570 -3687 -3496 -6370 -7590
5232 -7590 -1317 8812 8923 10815 13779 9242 -2748 -66 -6 -5008 -5097 -654 6161 1727 -8177 -10380
5216 -10380 -8495 -6129 -7917 -10312 -12340 -14502 -8009 -6045 -3827 -1427 -4847 1471 1384 617 -1091
5201 -1091 -6004 -8512 -24 1673 -6514 -12212 -9899 -9564 -6243 -5382 -1362 -2093 -6330 -9804 -9648 -11200
5185 -11200 -7809 -6513 -15193 -21253 -17033 -14498 -8947 -5309 -6822 -1296 -1211 -4846 -5852 -9549 -8938
5170 -8938 -11137 -5996 118 -3367 -3708 -1243 -743 -3769 -2768 2743 3614 -3929 -5325 -8690 -16968 -13894
5154a3894M93L420K618J782j622N350L95q68J863p251l49l04l758r15J372L532
5138h136j276K133o530J314O976J806L546N214l607o156j920K298j99L785q231
5123h983k074N679p82r03O088O86l329j764J250j205O58n32m014j126L1K440L081
5106d799J090j109J062P205Q980J989R84n940r555o3L367J335J0889o789p031
5091A615o409k911M686L42m05l476j837J744P021O954R79O171o03K400q438r346
5075a513K320M300J081r887P033P032n001j152K759p92m909n43J273J2011J387
5060A5399q310L284O12o303o734j118l776m422L645Q410P948K144j0171m898M649
5045C59J0117Q61n807p726j497P57n18j665J591O039l034j498R19k421j093J0777
$$ plain form
5154 -13894 -13401 -9981 -7363 -5581 -7203 -1853 -1458 -2326 -463 -7714 -8063 -8367 -12125 -13040 -11668 -8136
5138 -8136 -9412 -7279 -13809 -12495 -5519 -3713 -167 5047 1440 -4716 -6636 -4338 -4537 -752 -8983
5123 -8983 -11057 -5378 -6160 -7063 -975 -289 -3618 -5382 -4132 -5337 -4679 -5211 -9225 -10351 -10320 -7880 -4799
5106 -4799 -3709 -4818 -3756 3449 12429 14418 15402 9462 -93 -156 3211 4546 15435 8646 1615
5091 1615 -4794 -7705 -3019 -2677 -3082 -6558 -8395 -6651 370 7324 8303 14474 13871 16271 7833 -1513
5075 -1513 807 5107 6188 -3699 3334 10366 5365 4213 6972 6180 1271 728 2001 14012 15399
5060 15399 7089 10373 10985 4682 -2052 -3170 -6946 -11368 -7723 687 8635 10779 608 -4290 359
5045 359 10476 11337 5530 -2196 -3693 -2936 -3454 -5119 -3528 2511 -523 -2021 -1102 -3523 -4616 6161
5029F161N764J306l948m989l145j583m093k492J527L784j743j085Q271l903j300
5014a468k308J513M125n09K823k121l095J355P704L006J129P64j554l422j299
4999F643k432M084k867l272L901j195l695P26k38R014j850k03Q798j2928j4085
4984i599k752K991l04J170M010m02M957j124L02O146K154n035m747l703m16m475
4968a0827j862K244j469M468K562L878J586m849k953n60l551m248L086O431N795
4953b69J562J67k509l603l299J894k21l947L499L324O705K075j0816k032M342
4938c128Kk030l021k094J86Q71M775K699N504p72M378J911k313p652o521k572
4922i777p206P106J1374k778K675l121p109O442m38k751N319M946k95k890O721
$$ plain form
5029 6161 11925 13231 9283 4294 1149 -434 -4527 -7019 -5492 -1708 -3451 -4536 3735 -168 -1468
5014 -1468 -3776 -2263 1862 1353 4176 2055 -1040 315 8019 11025 12154 12918 11364 7942 6643
4999 6643 4211 8295 5428 2156 6057 4862 1167 1893 1655 10669 8819 8616 17414 4486 -9599
4984 -9599 -12351 -9360 -9664 -8494 -4484 -4886 71 -1053 -751 5395 7549 2514 -2233 -5936 -6352 -10827
4968 -10827 -12689 -10445 -11914 -7446 -4884 -1006 580 -4269 -7222 -7782 -11333 -15581 -12495 -6064 -269
4953 -269 1293 1460 -1049 -4652 -7951 -6057 -6278 -10225 -6726 -3402 3303 5378 -5438 -7470 -3128
4938 -3128 -3126 -5156 -8177 -10271 -10085 -9214 -4439 -1740 3764 2992 7370 9281 6968 -684 -7205 -9777
4922 -9777 -16983 -9877 1497 -1281 1394 -1727 -8836 -2394 -2832 -5583 -264 4682 4387 1497 8218
4907H218l18k711M274m36l277L95p617n026m22j556j541k066p81J3884J397M301
4891F718k334j0394l785Q777K17l233p77n556K574J2875k013q058j440j431O906
4876i54P778Oj61j403J903k573p848M54L893N352n531k456N850J044Q3Q96k133
4859D200mk20r14j3870q137L231N196M316L558j718k790l444L962k009J988K055
4843d600N303o69o063L588P82K697j287lR633n111k083k343j139N356m770j561
4827b270K742L889p538N624O27m94L585j554j47J210L952K141p262p146k115L435
4811a321J867K539j751K961j582j6398n233M169k273m284N901P757L516n839N258
4796d713J78m065O576O940k195j0398l875K646m234P08L980P183q73k294k73L12
$$ plain form
4907 8218 7900 5189 9463 9027 5750 6145 -1472 -6498 -6920 -8476 -10017 -12083 -12864 1020 2417 6718
4891 6718 4384 -6010 -9795 -1018 -801 -4034 -4811 -10367 -7793 5082 3069 -4989 -6429 -7860 -954
4876 -954 6824 6830 6669 5266 7169 4596 -3252 -2798 1095 6447 916 -1540 4310 5354 5437 6333 4200
4859 4200 4196 3976 3062 -10808 -18945 -15714 -10518 -6202 -2644 -4362 -7152 -10596 -6634 -8643 -6655 -4600
4843 -4600 703 34 -6029 -2441 -1659 1038 -249 -252 9381 4270 2187 -156 -1295 4061 -709 -2270
4827 -2270 472 4361 -3177 2447 3074 2580 6165 4611 4464 5674 9626 11767 4505 -2641 -4756 -1321
4811 -1321 546 3085 1334 4295 2713 -13685 -18918 -14749 -17022 -21306 -15405 -7648 -4132 -9971 -4713
4796 -4713 -4535 -8600 -2024 4916 2721 -7677 -11552 -8906 -13140 -12432 -8452 -1269 -2142 -4436 -4709 -4397
4780d397l867M900j196o166n561P125P236K881j1144K916K571R93j131L247k355
4765c948r52m877m610P52P308L689j1918p067m157O27J3611J0873P114n46l913
4750A986j073L946K815m840n747K581R76l920j785K612M796O055q700l826j408
4735e532J128l934K036l264J473j928k136M544R39R58k903M114j049L702m29m177
4719f458M244O99m271j113K03l6j300k310r87O971k496n55L325k981p61K667j932
4702g091L377O28J753O145j827k687N759j11o23m757l250j560q545m826j106K130
4686a6591J1046R121O283q679n748M146O71m193Q66l610o06K065l746L228k679
4671h426m533J567O442M378N760j070L82P57o663m432n23n86r52R38J385J985
$$ plain form
4780 -4397 -8264 -3364 -4560 -10726 -16287 -9162 -1926 955 -10189 -7273 -4702 -3709 -4840 -1593 -3948
4765 -3948 -4900 -9777 -14387 -13635 -6327 -2638 -14556 -21623 -25780 -25153 -11542 -669 6445 5899 1986
4750 1986 913 4859 7674 2834 -2913 -332 644 -3276 -5061 -2449 2347 8402 -298 -4124 -5532
4735 -5532 -4404 -8338 -6302 -9566 -8093 -10021 -12157 -7613 -6674 -5716 -8619 -4505 -5554 -1852 -2281 -6458
4719 -6458 -2214 -1515 -5786 -6899 -6696 -6732 -8032 -10342 -11329 -4358 -6854 -7409 -4084 -7065 -7826 -5159 -7091
4702 -7091 -3714 -3086 -1333 4812 2985 298 6057 5946 5323 566 -2684 -4244 -12789 -17615 -18721 -16591
4686 -16591 -5545 3576 9859 1180 -4568 -422 249 -3944 -3078 -6688 -7294 -5229 -8975 -5747 -8426
4671 -8426 -12959 -11392 -4950 -572 5188 4118 4500 5257 -1406 -5838 -6361 -6947 -7899 -6961 -5576 -3591
4655c591M034J706M100K630N81P40l308q95p47j973O422J84j95p834k673M84R336
4638I001K16o733K24O716q6m082l108P273J050p647m828j456K220J2571N50q846
4622C035M536k152k626j270l407J297K434l481l737k181l746N053L535k491p34
4607e935l634K333J809L159O382Q032n649l392K072k035m923j194j885o863l675
4592a5398Q269P357j364k340l196P765Q389J191L686L203n535j5056n815M360
4578d484l085l794L922N974N184K25J604j232o260J377K142N522N127o32r49j2177
4562a536l43p74j484J600n102k52K936K555K029l769p156j813N895P846R60n013
4546c421m214J322k350M83J586j260M800O418M956j643j254j621j34K68j474M337
$$ plain form
4655 -3591 443 2149 6249 8879 9460 10200 6892 5997 5250 3277 9699 9883 9688 1854 -819 -335 9001
4638 9001 9217 2484 2708 9424 9338 5256 2148 9421 10471 2824 -2004 -3460 -1240 11331 11881 3035
4622 3035 7571 5419 2793 1523 -1884 -587 1847 -1634 -5371 -7552 -11298 -6245 -2710 -5201 -5935
4607 -5935 -9569 -7236 -5427 -2268 4114 12146 6497 3105 5177 3142 -1781 -2975 -4860 -11723 -15398
4592 -15398 -7129 228 -1136 -3476 -6672 1093 9482 10673 14359 17562 12027 -3029 -8844 -4484
4578 -4484 -7569 -11363 -7441 -1467 3717 3942 5546 4314 -1946 -569 1573 7095 12222 11590 10641 -1536
4562 -1536 -1879 -2653 -4137 -2537 -7639 -7891 -4955 -2400 -371 -4140 -11296 -13109 -7214 632 1592 -3421
4546 -3421 -7635 -6313 -8663 -8180 -6594 -7854 -3054 3364 8320 6677 5423 3802 3668 3936 2462 6799
4530F799Q26k498k68j781J905L986k422J49j612k826l131J153R05j845N097K370
4514F807j969J876j024J258K809k936l486k843L243K812l875l554o67J802n740
4499e487k762J121K14l740p06n018O453P659L373M623M582K878l974m132n925
4484h41j974N913j208j2101j700K280M886J436L464K784q97l279j272n821p007
4469a5337J047M415N161m908j001J172O159O262M054Q787j108n983o170J325L850
4454G725l643K521L334o064j745o84m849O013J133J479m587p149O47K849N509
4439B489N757K929p059j842O49O735Q479o512j5100k305r52o04k113O556J306
4424a587j506K606P68K494q331r41P501R032k202j4355R90Q616j888K805J129
$$ plain form
4530 6799 7625 5127 4859 3078 4983 8969 6547 6696 5084 2258 -873 280 1185 -660 4437 6807
4514 6807 4838 6714 5690 6948 9757 6821 3335 492 3735 6547 2672 -882 -1549 253 -5487
4499 -5487 -8249 -7128 -6914 -10654 -11360 -16378 -9925 -2266 1107 5730 10312 13190 9216 5084 -841
4484 -841 -2815 3098 1890 -10211 -11911 -9631 -4745 -3309 155 2939 2042 -1237 -2509 -8330 -15337
4469 -15337 -14290 -9875 -4714 -9622 -10623 -9451 -3292 2970 7024 15811 14703 8720 2550 3875 7725
4454 7725 4082 6603 9937 3873 2128 1444 -3405 2608 3741 5220 633 -6516 -5869 -3020 2489
4439 2489 8246 11175 4116 2274 2923 9658 18137 11625 -3475 -5780 -6732 -7336 -9449 -2893 -1587
4424 -1587 -3093 -487 281 2775 -5556 -6497 1004 10036 7834 -6521 -5531 3085 1197 4002 5131
4409E131r088n870P992M46n640j355k014k91N853l64K075N408j521m53n486k949
4393h126K053L998J137O963J318q86o479n883l270R56P333m523J345j862N386
4378e40M55n973k369k75m837J998J0542l718p147N2p76N14O173K413O71J410R089
4361G682L863l057j59j0426j928L706O525p581m139l14J594J533l469M515q98
4346b553k962n239j456J516K32M938O649o04O547M010l216j620k068j88K554m579
4330A961K531l965q515K941P85j076n068O333J0322N490j0614r138m547j523M397
4315i686M228j005L064j887o25o67k955M623K877J619K61l719n528L271J311o565
4299a1383Q37M020R904N94l591P092n24m170k785K135J944m815p585k205M264
$$ plain form
4409 5131 -3957 -9827 -1835 -1389 -7029 -8384 -10398 -10689 -4836 -5200 -3125 2283 762 309 -5177 -8126
4393 -8126 -6073 -2075 -938 6025 7343 6457 -22 -5905 -9175 -8219 -886 -5409 -4064 -5926 -540
4378 -540 -85 -6058 -8427 -8702 -13539 -11541 -999 -4717 -11864 -11812 -12588 -12074 -5901 -3488 -2817 -1407 7682
4361 7682 11545 8488 8329 -2097 -4025 -319 6206 -1375 -5514 -5828 -4234 -2701 -6170 -1655 -2553
4346 -2553 -5515 -10754 -12210 -10694 -10462 -5524 1125 521 7068 11078 7862 6242 4174 3986 6540 1961
4330 1961 4492 527 -7988 -5047 -4262 -5338 -10406 -4073 6249 11739 1125 -8013 -12560 -14083 -9686
4315 -9686 -5458 -6463 -3399 -5286 -5911 -6578 -9533 -4910 -2033 -414 -153 -3872 -9400 -6129 -4818 -11383
4299 -11383 -10546 -6526 3378 3972 381 7473 6949 2779 -6 2129 4073 -742 -8327 -10532 -6268
4284f268m092K250J753L816M37m141n267p086R54P157j129m45K466M319j359l265
4268i900k256Q583M097K117k794o291l431J291J0496N225p751L77L732M243j126
4253F612p402K869j899O905k022r713O91k55j82m663l206k05k159k623m748k745
4237b4745J2864N268J205J781J819J104M8l193J564J169J454M58o398L312l961
4222f251n207J363P729R148N294j2316m427L019K50j50k088m657j809P445m167
4207f824M313P29n248q75j70l40J756L926R0q66o321l26N364K204K961J528m761
4190b860N660L806K094K528L829j157M185o81k777L495j765q861j1758n803J086
4175h979M179K662L184M379n640j3151P251P834M756k005p829l325K639O421J396
$$ plain form
4284 -6268 -10360 -8110 -6357 -2541 -2104 -6245 -11512 -18598 -17644 -10487 -11616 -12061 -9595 -5276 -6635 -9900
4268 -9900 -12156 -3573 524 2641 -153 -6444 -9875 -8584 1912 7137 -614 -237 3495 7738 6612
4253 6612 -790 2079 180 7085 5063 -4650 -3959 -4214 -4396 -9059 -12265 -12470 -14629 -17252 -22000 -24745
4237 -24745 -11881 -6613 -5408 -3627 -1808 -704 -656 -3849 -2285 -1116 338 796 -5602 -2290 -6251
4222 -6251 -11458 -10095 -2366 6782 12076 -240 -4667 -1648 -1398 -1548 -3636 -8293 -10102 -2657 -6824
4207 -6824 -2511 -1782 -7030 -7905 -8075 -8415 -6659 -2733 -2643 -3509 -9830 -10156 -4792 -2588 373 1901 -2860
4190 -2860 2800 6606 8700 11228 15057 13900 18085 17404 14627 18122 16357 7496 -4262 -10065 -8979
4175 -8979 -4800 -2138 1046 5425 -215 -13366 -6115 1719 6475 4470 -3359 -6684 -4045 2376 3772
4160C772n555M376J979o959n523J290M367O15R345M114p46j858o736m983M863
4145B361N785J110q574m190o185N682R625O43k879M872p107j3246n907m875M806
4130a8079J0892r48m807N340M175M75N278j728j239L458K352k036j004K57l28
4115B058K431q371K075q90K696j111k850n901J024O332o366J351L332l508J610
4100f088O412M973P32l285K61p735N401O67n749q40J048M792m115m925N274Q002
4084D825k009o678l411N668j79p062L824k359J623L183O399l632p274J826J788
4069c468j267O44M136N98o117l505N726L486M37R90m091l433K158P578M948j604
4053G216k701l538j626M419l37r256m373K792N092k397J938J385K379J128m12
$$ plain form
4160 3772 -1783 2593 4572 -2387 -7910 -6620 -2253 -1638 7707 11821 11075 9217 2481 -2502 2361
4145 2361 8146 9256 682 -3508 -9693 -4011 5614 6257 3378 8250 1143 -12103 -18010 -22885 -18079
4130 -18079 -7187 -8135 -12942 -7602 -3427 -2952 2326 598 -641 2817 5169 3133 2129 2386 2058
4115 2058 4489 -3882 -1807 -2697 -1 -1112 -3962 -9863 -8839 -2507 -8873 -7522 -4190 -7698 -6088
4100 -6088 324 5297 6029 2744 3005 -4730 671 1338 -4411 -5251 -4203 589 -3526 -8451 -3177 4825
4084 4825 2816 -3862 -7273 -1605 -1784 -8846 -5022 -7381 -5758 -2575 3824 192 -7082 -5256 -3468
4069 -3468 -4735 -4091 45 643 -5474 -8979 -3253 233 670 1660 -2431 -5864 -3706 3872 8820 7216
4053 7216 4515 977 -649 3770 3433 -5823 -10196 -7404 -2312 -4709 -2771 -1386 993 2121 1709
4038A709L767J722m194m920k695k442j391o31M059M501n404r174M006J1122q001
4023g966o876L819L148j798M65K170l153L378N008l279K588J961l028M432k261
4008a392P440K372o909j387n929j172K960k920p896j034M932L29j745K826L803
3993e722M754N910p40n744l373J238M462j101K590J428n39r23p092n447l449M508
3977i240N265K691j0674l983M620P202J0175O846K084m826o276m351L5K326l661
3962a767j903k352k994k796m23L692L353k194J625J614k679o548J02M500l730
3947a2500j742O402J282k679k1k269Q972N61n870Oj518K311o164M49k724J831
3931a3673P053N015l69o311p88L748k750l194K397k438l21p576L422J0357k193
$$ plain form
4038 1709 5476 7198 3004 -1916 -4611 -7053 -8444 -9075 -5016 -515 -5919 -15093 -11087 35 -7966
4023 -7966 -14842 -11023 -7875 -9673 -9208 -7038 -10191 -6813 -1805 -5084 -2496 -535 -3563 869 -1392
4008 -1392 6048 8420 1511 124 -5805 -6977 -4017 -6937 -14833 -15867 -10935 -10606 -12351 -9525 -5722
3993 -5722 -968 4942 4202 -1542 -4915 -3677 785 -316 2274 3702 3163 2240 -4852 -10299 -13748 -9240
3977 -9240 -3975 -1284 -11958 -15941 -11321 -4119 6056 12902 14986 10160 3884 -467 -432 1894 -1767
3962 -1767 -3670 -6022 -9016 -11812 -12235 -8543 -5190 -7384 -5759 -4145 -6824 -13372 -13270 -8770 -12500
3947 -12500 -14242 -7840 -6558 -9237 -9258 -11527 -2555 -1994 -7864 -7858 -9376 -7065 -13229 -12780 -15504 -13673
3931 -13673 -6620 -1605 -1974 -8285 -9073 -5325 -8075 -11269 -8872 -11310 -11631 -19207 -15785 -5428 -7621
3916g621J89J295J782j387l364P813O202j185P83l337l273J502R26O927L03J79
3900G734j036m134p504K277O852O0L35j150n173r63p151R33M670N358K576N713
3884I397L625j424l606n497L086l926m892o930j729J065N928k007l889k979L884
3869i894m67m252Q66M349Q753O353l043o362K291J556M37J214L511k483n483k603
3853e257k331R961o14r970n477O349j834m623R687M057j0500j2P551P446l72m275
3837b14L80o121q661L488M696N742J184l183K313K930n940l519r45j021Q5M510
3821d276J285J945K60k154j130K243l767k921r90r62L844K96J056m65Q262l696
3805a170j728n870j028k570O601o47l326K038m670m662o39R109M928k644o79j146
$$ plain form
3916 -7621 -7432 -6137 -4355 -5742 -9106 -1293 4909 3724 4507 1170 -2103 -601 325 7252 7555 7734
3900 7734 6698 2564 -4940 -2663 4189 4249 4584 3434 -1739 -2702 -9853 -8920 -4250 1108 3684 9397
3884 9397 13022 11598 7992 2495 5581 1655 -3237 -10167 -11896 -10831 -4903 -6910 -10799 -13778 -9894
3869 -9894 -10361 -14613 -13747 -9398 -645 5708 2665 -3697 -1406 150 587 1801 5312 2829 -2654 -5257
3853 -5257 -7588 2373 1759 -8211 -13688 -7339 -9173 -13796 -4109 -52 -10552 -10564 -3013 4433 4061 -214
3837 -214 166 -5955 -14616 -11128 -6432 -690 494 -2689 -376 2554 -3386 -6905 -7850 -8871 -8786 -4276
3821 -4276 -2991 -1046 -786 -2940 -4070 -1827 -5594 -8515 -9505 -10467 -6623 -6327 -5271 -5736 2526 -1170
3805 -1170 -2898 -8768 -9796 -12366 -5765 -6412 -9738 -7700 -12370 -17032 -17671 -8562 -3634 -6278 -6957 -8103
3789h103J00K09M521P697J954N516J404p346j25m303n978r135o66P714M519J447
3773e75Q20J521P69J744j764J951K097l465M806j988j0113l571K639J069J238
3758b822n19M447K149L886M739n35K15n402o830n131k535m51n48j704R574P836
3742F369j507n411o597j094O721O864q46k161k682L235n718n418M995Q023O37
3727E410k793j139J208K894J608K460p6j0046n890n077L460M695Q080q34m23j359
3711B178K791K292k46p683o396p88k563o67P218M330N989m176m249P227L642M649
3695A3548j914k968r35p798o231K573K822p70J724M19j55J759Q1K86K685j991
3679C135k272l514k457p889Q863M609l376M269L734K622q052l063K659M473R38
$$ plain form
3789 -8103 -8003 -7794 -3273 4424 6378 11894 13298 5952 5827 1524 -4454 -13589 -14255 -6541 -2022 -575
3773 -575 245 1766 2535 4279 2515 4466 6563 3098 7904 5916 -4197 -7768 -5129 -4060 -2822
3758 -2822 -3341 1106 3255 7141 11880 11345 11560 6158 -672 -5803 -8338 -8789 -9337 -11041 -1467 6369
3742 6369 4862 -549 -7146 -8240 -1519 5345 4499 2338 -344 2891 -2827 -8245 -3250 4773 5410
3727 5410 2617 1478 2686 5580 7188 9648 9572 -474 -6364 -11441 -7981 -3286 4794 3960 3537 2178
3711 2178 4969 7261 7015 -668 -7064 -7852 -10415 -11082 -3864 466 6455 2279 -1970 5257 8899 13548
3695 13548 11634 8666 7731 -67 -6298 -3725 -903 -1673 51 470 315 2074 2155 2441 5126 3135
3679 3135 863 -2651 -5108 -12997 -4134 475 -2901 1368 5102 7724 -328 -3391 -732 3741 4679
3664D679k169m664L248O711N131l00l042m184p482o999J142J546K513l778p831
3649a5479j129O728M251J242k465M981q51J272K967j103q475l093P014O98r62
3634d404m89k703K236L422M291p94j529J492r30N607j001K750N0k407r271m362
3618h042O263j668k337J3946O818K343m053q001j938J099Q03L937M526p300m045
3603B351J888l9L286O876j854m597m76l558l531r86j083j038r738RR722K079k574
3586c263J925O762n021m637m485n93P627N689J018o467j35r35o388K190L780J493
3570a440m739k536O102n66r13J015M44N973O696p131o241N638L905M00o820j829
3554b042j759p346o247j227K71J0286L73J652L114j658k622n54K356m143L743
$$ plain form
3664 4679 2510 -2154 1094 7805 12936 12636 9594 5410 -2072 -9071 -7929 -6383 -3870 -7648 -15479
3649 -15479 -16608 -9880 -5629 -4387 -6852 -1871 -2722 -1450 1517 414 -8061 -11154 -4140 -3442 -4404
3634 -4404 -4893 -7596 -5360 -1938 2353 1559 30 1522 592 6199 5198 7948 7998 5591 -3680 -8042
3618 -8042 -1779 -3447 -5784 8162 14980 17323 13270 5269 3331 4430 5233 9170 13696 6396 2351
3603 2351 4239 4200 7486 14362 12508 7911 7435 3877 346 -640 -1723 -2761 -12499 -12490 -2768 -689 -3263
3586 -3263 -1338 5424 403 -4234 -8719 -9312 -1685 4004 5022 -1445 -1580 -2515 -8903 -6713 -2933 -1440
3570 -1440 -6179 -8715 -2613 -3179 -4092 -3077 -2633 3340 10036 2905 -3336 2302 6207 6607 -213 -2042
3554 -2042 -3801 -11147 -17394 -18621 -18350 -8064 -7691 -6039 -2925 -4583 -7205 -7759 -5403 -9546 -5803
3539e803J234k904m954j015N849L348L095l397J801N00K217l048l801o191l689
3524a6758J466N773L699J022J499p62L458N627K009n756P30J35m584p74J1177
3509G961M939q609o421j472j152J93m027r50k149k489J947Q488N882K339l58n381
3493a259j348N102M775P49n753O19m532p174K369P276M28p045l394O300M109M273
3477E495k194R57n886j016P49m310k21O137p96R86J71p315K459N069l447j807
3461d969K531l081J874J822P689n115q183n096J088L067K972k748k338M464j914
3446g937L17L56l532J564O823k82k54O146m523o74Q998M449o239m487K311l213
3430a77o063j804J845J444l093J67N108M145m067o61M859K782J589n340PJ90K452
$$ plain form
3539 -5803 -4569 -7473 -12427 -13442 -7593 -4245 -1150 -4547 -2746 -2246 -29 -3077 -6878 -13069 -16758
3524 -16758 -15292 -9519 -5820 -4798 -3299 -4061 -603 5024 7033 1277 2007 2142 -2442 -3216 7961
3509 7961 12900 4291 -2130 -3602 -4754 -4561 -8588 -9538 -11687 -14176 -12229 -3741 2141 4480 4122 -1259
3493 -1259 -2607 2495 7270 8019 2266 2885 -1647 -8821 -6452 824 1252 -5793 -9187 -2887 1222 5495
3477 5495 3301 4258 -1628 -2644 -1895 -6205 -6426 -289 -1085 -99 72 -7243 -4784 285 -3162 -4969
3461 -4969 -2438 -5519 -3645 -1823 5866 751 -7432 -12528 -11440 -8373 -5401 -8149 -10487 -6023 -7937
3446 -7937 -7620 -7264 -10796 -9232 -2409 -2691 -2945 3201 -1322 -1996 7002 11451 5212 725 3036 -177
3430 -177 -6240 -8044 -6199 -4755 -7848 -7681 -2573 1572 -2495 -3156 1703 4485 6074 734 741 931 3383
3413C383n027K308l033M183K711J824r07N306l654o999N442K163l916j219Q75
3398C440L4k586n242m819K715k08n741j223J46L446M872N543n839j486Q411Q9
3382A552q197m965M522M10l957L619L782L153k982m75m944k209N300L640m270
3367f021K68L981j906M108l36l877J725m273J499K396J611M931N59n811p861n709
3351a4716q32O032P473p542k729N698l038k157j657K973k74Q94J353k157j539
3336a2218j154N077O301N328j96l437k355J429j047J6l597K351J428R92K531m128
3320b679j091L91L020M40J147K90q202o185K590Q568J296J389o89J499J611K54
3304C649R65K438k108n688k503n19P3n68l24j356L132J1472q48K455k856q920
$$ plain form
3413 3383 -1644 664 -2369 1814 4525 6349 5442 10748 7094 95 5537 7700 3784 2565 3440
3398 3440 3474 888 -4354 -9173 -6458 -6666 -12407 -13630 -13484 -10038 -5166 377 -5462 -6948 1463 1552
3382 1552 -6645 -11610 -7088 -6678 -10635 -7016 -3234 -81 -3063 -3538 -8482 -10691 -5391 -1751 -6021
3367 -6021 -5753 -1772 -3678 430 94 -3783 -2058 -6331 -4832 -2436 -825 4106 4665 -1146 -9007 -14716
3351 -14716 -15548 -9516 -2043 -9585 -12314 -6616 -9654 -11811 -13468 -10495 -10769 -9875 -8522 -10679 -12218
3336 -12218 -13372 -8295 -1994 3334 3138 -299 -2654 -1225 -2272 -2256 -5853 -3502 -2074 -1082 1449 -2679
3320 -2679 -3770 -3379 -359 81 1228 1518 -6684 -12869 -10279 -1711 -415 974 285 1784 3395 3649
3304 3649 4614 7052 4944 -744 -3247 -3766 -3693 -4261 -4585 -5941 -2809 8663 7815 10270 7414 -1506
3288a506k581M93O939M809j332k397q127q729J924R546j820k211n398L620J0758
3273C988L691j01l977j1790k265J550k489M84j182O261R618O889p181o377l045
3258e926M420k782o444J257O242L356j590M54j683J874N369k251P93J13j13N443
3242H532m643L867n168N18O520N049J261o669m009l293J948j382P195K460n871
3227F315J529Q64k3J730j1179j1492n45N137K604Q226J330m760l556l471k858
3212a0149N658J6O379J882o585n494j555N65O674P025m525J260k009l616K321
3197b153Q282K823j2623p015r304M103M327P298j6J463M283n196l604K451R973
3182E092k619m10j181J310k639M300M249q175l82o875n519L487J744o5Q25N422
$$ plain form
3288 -1506 -4087 -3594 3345 8154 6822 4425 -3702 -12431 -10507 -961 -2781 -4992 -10390 -6770 3988
3273 3988 7679 7578 3601 -8189 -10454 -8904 -11393 -10909 -12091 -5830 3788 10677 3496 -2881 -5926
3258 -5926 -1506 -4288 -10732 -9475 -3233 123 -1467 -1013 -2696 -822 4547 2296 3089 3202 3089 8532
3242 8532 3889 7756 2588 3106 9626 14675 15936 9267 5258 1965 3913 2531 9726 12186 6315
3227 6315 7844 8708 8685 10415 -764 -12256 -12801 -7664 -5060 3166 4496 -264 -3820 -7291 -10149
3212 -10149 -4491 -4475 1904 3786 -2799 -8293 -9848 -9283 -2609 4416 -109 1151 -858 -4474 -2153
3197 -2153 6129 8952 -3671 -10686 -19990 -15887 -11560 -4262 -4278 -2815 1468 -3728 -7332 -4881 5092
3182 5092 2473 2063 882 2192 -447 3853 8102 -73 -455 -7330 -12849 -9362 -7618 -7683 -6858 -1436
3166a436J509L659N939k989o340j3556J22R165J42k008k221J321M097K170j04
3151e30j223j273l51q70J717k03l254o485m97m447J407L912P981P324K251o577
3135a118k777M754l657J824L566J705m504N042L289m497p84n020P350N673j597
3120I249n199k497p42j215j825j852J959L095R447J733R5L077J993k108l653k096
3104I461j827J526l191L74L008J699j699k518m264p32l472K17mj722j891K872
3088b163j428p65N653k215L890K865L691O18n421m981n562R09o663J64K227J158
3072h023O609Q131j442j0220p735K82j383j734K707M434L755k545M82L161q79
3057d400Kq66O781K902l726m837q19L853L885j198o459o124P60N287M054R117
$$ plain form
3166 -1436 73 3732 9671 6682 342 -13214 -13092 -3927 -3785 -5793 -8014 -6693 -2596 -426 -530
3151 -530 -1753 -3026 -3377 -4247 -2530 -2733 -5987 -12472 -12969 -17416 -16009 -12097 -4116 3208 5459 -1118
3135 -1118 -3895 859 -2798 -974 2592 4297 -207 4835 8124 3627 2843 -2177 5173 10846 9249
3120 9249 4050 1553 811 -404 -2229 -4081 -2122 973 10420 12153 12248 15325 17318 15210 11557 9461
3104 9461 7634 9160 5969 6343 9351 11050 9351 6833 2569 1837 -1635 -1418 -1422 -3144 -5035 -2163
3088 -2163 -3591 -4356 1297 -918 2972 5837 9528 10146 4725 -256 -5818 -4909 -11572 -11408 -9181 -8023
3072 -8023 -1414 6717 5275 -4945 -12680 -12398 -13781 -15515 -12808 -8374 -4619 -7164 -6682 -3521 -4400
3057 -4400 -4398 -5264 1517 4419 693 -4144 -4963 -1110 2775 1577 -4882 -11006 -10246 -4959 -905 8212
3041H212O98k992j921m988q379j923R516Q298p212j021l004j835k990l429l365
3026a6335J607M813P132L008o83n546j580K074O864P329l343j254l870k379O96
3011a467J091O70J567J772l79L402K95j279o967n545J980N139J540P32o636k287
2995f372k008j228K437l65r07O430l976L002N49n850J775M8k490L39j365J276
2979h705N618R299J2014K889j905q610o283k311j195o505n468R608j549j366L265
2964a204R65M949L133o444n846l505p74Q31l906k140L348M714M242j300l816K698
2948d055M244M686j692m348m563J661m152m023k784R661R892l465k386O61j965
2933b628k989r242N695J683j376M177m92m624L984N46j919K584J980l886j001
$$ plain form
3041 8212 8910 5918 3997 -991 -9370 -11293 -1777 6521 -691 -1712 -4716 -6551 -9541 -12970 -16335
3026 -16335 -14728 -9915 -2783 225 -458 -6004 -7584 -5510 1354 8683 5340 4086 216 -2163 -1467
3011 -1467 -376 294 1861 3633 3254 6656 6951 5672 -1295 -6840 -4860 279 1819 2551 -4085 -6372
2995 -6372 -8380 -9608 -7171 -7536 -8443 -2013 -5989 -2987 -2438 -8288 -6513 -6465 -8955 -8616 -9981 -8705
2979 -8705 -3087 6212 18226 21115 19210 10600 4317 2006 811 -5694 -11162 -1554 -3103 -4469 -1204
2964 -1204 -239 4710 7843 1399 -4447 -7952 -8726 -7895 -11801 -13941 -10593 -5879 -1637 -2937 -6753 -4055
2948 -4055 189 4875 3183 -1165 -5728 -4067 -8219 -12242 -15026 -5365 4527 1062 -1324 -663 -2628
2933 -2628 -5617 -14859 -9164 -7481 -8857 -4680 -5172 -9796 -5812 -5266 -7185 -4601 -2621 -6507 -7508
2918g508n704k8J489J774N70N930j465m324m40K724L628n358k943K636L119Q72
2902e028n646P79P427P74J027M856N199k348o350j821j757N069o36k435J132N284
2886E526J860N944j759j834l917k166K415m752l830o60l477m671l121r53l94P280
2870h509N204P02r459k487j08L671P267Q0N62k4N455L356L491K208J523k549n951
2853D432l887K288j542k060p467N801J974r370k700K344N1K752K364M885k058
2838b193J60j471n28m609j136L851k484m898K665N706L751p507n832Q561P632
2823A668j785m000k749p163p92j265O051J0660M539J763k168m725k067M410j717
2808F60k636j636k308M422O579o87M606M743P87J230n380J336j130m015j9k162
$$ plain form
2918 -7508 -13212 -13240 -11751 -9977 -9407 -3477 -4942 -9266 -9706 -6982 -3354 -8712 -11655 -9019 -5900 -5028
2902 -5028 -10674 -9895 -2468 -1694 -667 4189 9388 7040 690 -1131 -2888 2181 1545 -890 242 5526
2886 5526 7386 13330 11571 9737 5820 3654 6069 1317 -2513 -3173 -6650 -11321 -14442 -15395 -15789 -8509
2870 -8509 -3305 -2603 -12062 -14549 -14657 -10986 -3719 -3639 -3077 -3101 2354 5710 9201 11409 12932 10383 4432
2853 4432 545 2833 1291 -769 -8236 -2435 -461 -9831 -12531 -10187 -10136 -7384 -5020 -135 -2193
2838 -2193 -2033 -3504 -4032 -8641 -9777 -5926 -8410 -13308 -10643 -4937 -1186 -8693 -14525 -5964 1668
2823 1668 -117 -4117 -6866 -14029 -14821 -16086 -10035 625 5164 6927 4759 34 -2033 2377 660
2808 660 -1976 -3612 -5920 -1498 5081 4394 9000 13743 14530 15760 10380 11716 10586 6571 6552 4390
2792D390m318m978n32M822J7819n309j3002n049m033j024M511N941L734M123k921
2777D174k265l567l697L500K388l90j692p8r049n077K101P199K768L957p156n613
2761a2497K313L866P771J288p68n231q788P9N108J29L799O695R26m606m902N882
2745A064L374j821K044l480m551K303M948J920k554k787m120p860j629K315k764
2730a3598o844K815R388N505J875j953o51l926L288Q649P249M176n14j0631q090
2715c262k271L083N545K446n050r707l75J517O438N166p938J625O226O531N988
2700A5962k322o417k671M323K427r00k263l199n586k752N098L043k068k57N655
2685H073N79j066l080l743j114M227M249q08N84n540p112o39Q240l198M50j61
$$ plain form
2792 4390 72 -4906 -5438 -616 17203 11894 -1108 -6157 -10190 -11214 -6703 -762 2972 7095 4174
2777 4174 1909 -1658 -5355 -1855 533 143 -1549 -1627 -10676 -15753 -13652 -6453 -3685 272 -6884 -12497
2761 -12497 -10184 -6318 1453 2741 1973 -3258 -12046 -11967 -6859 -6730 -2931 3764 4690 84 -4818 1064
2745 1064 4438 2617 4661 1181 -3370 -1067 3881 5801 3247 460 -3660 -11520 -13149 -10834 -13598
2730 -13598 -20442 -17627 -8239 -2734 -859 -2812 -3463 -7389 -4101 4548 11797 15973 15459 4828 -3262
2715 -3262 -5533 -2450 3095 5541 491 -9216 -9591 -8074 -1636 3530 -4408 -2783 3443 9974 15962
2700 15962 13640 7223 4552 8875 11302 10402 8139 4940 -646 -3398 1700 4743 2675 2418 8073
2685 8073 8652 7586 4506 763 -351 3876 8125 7317 7901 2361 -4751 -5390 2850 -348 102 -59
2669e9k909n390L339P127k58J374j141p297q441k044m630O374R406K674l008m530
2653i413N57O27M29M662n816Q1P11K316K282J501l468K889M252o33k210P61l364
2636c836j1398j36J252P705O859K686k525L239M213Q86j79m081o773j282M018
2621F48L853m284J986n367m791l306O18L211L417j235M391L509m400k189l535
2606g474P600M516J883J679l875k173J032l0K388L255p674N55N093K481q13k255
2590F188k204J808Q4m461k841o196k054J31P482K802j556J163K456M213j683J992
2574G324l56m056l940j029p37j701k966l93q81j964O683M889M483L748k385r49
2558E770p761J029P932K981m672n895Q87o74n283k278j096k6R586P519m465K249
$$ plain form
2669 -59 -2968 -8358 -5019 2108 1850 3224 2083 -5214 -13655 -15699 -20329 -13955 -4549 -1875 -4883 -9413
2653 -9413 -8856 -8229 -7800 -3138 -8954 -8873 -8162 -5846 -3564 -2063 -5531 -2642 1610 977 -1233 -472 -3836
2636 -3836 -15234 -15370 -14118 -6413 446 3132 607 3846 8059 8945 8766 4685 -2088 -3370 648
2621 648 4501 217 2203 -3164 -7955 -11261 -10643 -7432 -4015 -5250 -859 2650 -1750 -3939 -7474
2606 -7474 126 4642 6525 8204 4329 2156 3188 3158 5546 8801 1127 1682 6775 9256 8443 6188
2590 6188 3984 5792 5876 1415 -1426 -7622 -9676 -9545 -2063 739 -817 346 2802 7015 5332 7324
2574 7324 6968 2912 -1028 -2057 -2794 -4495 -7461 -7854 -8735 -10699 -4016 873 5356 9104 6719 5770
2558 5770 -1991 -962 6970 9951 5279 -616 271 -403 -5686 -7964 -9060 -9086 500 8019 3554 5803
2542E803k227o994o597O778O415J239k588p685R11K066k85l244K428M194j657
2527a443n10k480O346J377n340O419k016q570P541J36K618K206n87p61j599k975
2511C62p240k291K599N082o038k290M339Q496o14k57J524l539P80J291o025n885
2495i706N78L072l48k691l55J535k068j367L732M46m26k359j015M002Q551J330
2479B911K110q724j708J435K964Q27k040k016N614j045n976K1n031L259O177n20
2463a742M8J177N919Q840m227r246j815Q79j494J349O000K670o90o362p299m161
2447a0154M150n33L90R27M333K756l131j091j324J163l743K674n33M4L238l870
2431d704J779J133K244j002O12J0095p59k010q64Q263N078m776k533r082n81K184
$$ plain form
2542 5803 3576 -3418 -10015 -3237 3178 4417 1829 -5856 -4945 -2879 -3164 -6408 -3980 214 -1443
2527 -1443 -1953 -4433 1913 3290 -2050 4369 2353 -6217 1324 1460 4078 6284 5697 4936 3337 362
2511 362 -6878 -9169 -6570 -1488 -7526 -9816 -5477 3019 2405 2148 3672 133 913 2204 -3821 -9706
2495 -9706 -9128 -6056 -6404 -9095 -9450 -7915 -9983 -11350 -7618 -7172 -7598 -9957 -10972 -6970 1581 2911
2479 2911 5021 -3703 -5411 -3976 -1012 -185 -2225 -4241 1373 328 -5648 -5627 -10658 -7399 -1222 -1742
2463 -1742 -1694 -517 5402 14242 10015 769 -1046 -167 -1661 -312 5688 8358 7668 1306 -5993 -10154
2447 -10154 -6004 -6537 -6147 -5220 -887 1869 -1262 -2353 -3677 -2514 -6257 -3583 -4116 -4072 -834 -4704
2431 -4704 -2925 -1792 452 -550 62 10157 9398 7388 6524 14787 19865 15089 12556 3474 2893 5077
2415E077o241j304Q817P81p440k206j161n483K422M523J568m738k384M523J7m837
2399h066k357K227P34j507P00L497j947O062L562j11k615l56J405K89m986k008
2383e477Q184p2n562L660P025m525j295P12L697J444j222j135l151j238k484K398
2367I59m317J488P88j343J90M844K427L331p91m152j305P994K6q723L4j424K333
2350B359j084m349n643R149N881J280L030k470r690l683m286N560J1628M508m689
2335G501n749j302J152m975o536j228K473M986Q803K947n863L55Q11l70J058J205
2319E268M460K971n932J430m619m947J909l024j987J776N167J359k571p156n35
2304f431P306L713K557m703o2r89n50j463r92n192Q79k934j783O711O470K030
$$ plain form
2415 5077 -1164 -2468 6349 7130 -310 -2516 -3677 -9160 -6738 -2215 -647 -5385 -7769 -3246 -3229 -8066
2399 -8066 -10423 -8196 -7462 -8969 -8269 -4772 -6719 -657 2905 2794 179 -177 1228 1517 -3469 -5477
2383 -5477 2707 2635 -2927 733 7758 3233 1938 2650 6347 7791 6569 5434 2283 1045 -1439 959
2367 959 -3358 -1870 -1082 -2425 -2235 2609 5036 8367 7576 3424 2119 10113 10139 1416 1450 26 2359
2350 2359 1275 -3074 -8717 432 6313 7593 10623 8153 -1537 -5220 -9506 -3946 7682 12190 7501
2335 7501 1752 450 1602 -3373 -9909 -11137 -8664 -3678 5125 8072 2209 2564 3375 3005 4063 5268
2319 5268 9728 12699 6767 8197 3578 -1369 540 -2484 -4471 -2695 2472 3831 1260 -5896 -6431
2304 -6431 875 4588 7145 2442 2380 1391 841 -622 -1614 -6806 -5927 -8861 -10644 -3933 2537 4567
2288D567k353J690j391o934M061N9j393J284k943L575M476J985n34l906j0452
2273h209j168P416P211P564n499m171l032J094n838l19j191p37k276l9M391K378
2257b425J554n855m519q45P83R33J080l460P350O928L4J942K325K08J092k387
2241D738JR06m770K128P674p233m355K342O01K697n156l544n746P264J481m319
2225e291l821m543J972K94J495P63l79N374K387j388L801M866L47K15j1288p021
2209a2217O637N262L733R069l993N96N13j716l703l884M5J612J268K969J624N45
2193H360J374L65m535n992N78K029m058K275N45m674r02n856L753O488L363j194
2177A919K45m51L477o207j111O781k219o16k782K222m392j75m42k921K726N614
$$ plain form
2288 4567 2214 3904 2513 -4421 -360 -301 -1694 -410 -3353 222 4698 6683 6149 2243 -8209
2273 -8209 -9377 -1961 5250 12814 7315 3144 112 1206 -4632 -4951 -6142 -6879 -9155 -9194 -4803 -2425
2257 -2425 -871 -6726 -11245 -12090 -11307 -10374 -9294 -12754 -5404 1524 1558 3500 5825 6033 7125 4738
2241 4738 4739 5645 875 3003 10677 3444 -911 1431 2032 4729 -427 -3971 -9717 -2453 -972 -5291
2225 -5291 -9112 -13655 -11683 -11389 -9894 -9131 -9510 -4136 -1749 -3137 664 5530 5877 6092 -5196 -12217
2209 -12217 -5580 -318 3415 12484 8491 9087 9600 7884 4181 297 342 1954 3222 6191 7815 8360
2193 8360 9734 10099 5564 -428 150 2179 -1879 396 941 -3733 -4635 -10491 -6738 -250 3113 1919
2177 1919 2164 1713 5190 -1017 -2128 4653 2434 1818 -964 1258 -3134 -3309 -3751 -6672 -3946 1668
2161A668l035j678L735l080l342m250N055J0845j498k357m267m490P482L523k915
2146A396k232K467K610J01L570l884q540p294k293j115O024r0j058J835L0k685
2130a1158N190M148q179j438M076M357L237O647m839m880N613m610J63j8N125
2115C434k948n270O709l168q54l2J550L923J125k412m1P450k006p118j943K66
2099a335J680m301P63O495M5k623l83p95K571j193O0J784m717k268M944k807o891
2082h971K252J240L936N342j078n985j813l895j062R136k6k701N673m351r06L534
2066C25J518k133o672p370K818N000R628l121j190M044K825N883J445k171n303
2051E526K29p203k271M30M642m460o259O233K777L408N976n416p212q77K518K702
$$ plain form
2161 1668 -1367 -3045 690 -2390 -5732 -9982 -4927 5918 4420 2063 -2204 -6694 788 4311 1396
2146 1396 -836 1631 4241 4342 7912 4028 -4512 -11806 -14099 -15214 -9190 -9280 -10338 -8503 -8473 -11158
2130 -11158 -5968 -1820 -9999 -11437 -7361 -3004 233 6880 2041 -2839 2774 -1836 -1673 -1691 3434
2115 3434 486 -4784 1925 -1243 -2097 -2129 -579 3344 4469 2057 2016 9466 7460 342 -1601 -1335
2099 -1335 345 -3956 -3193 3302 3347 724 341 -454 2117 924 984 2768 -1949 -4217 727 -2080 -8971
2082 -8971 -6719 -5479 -1543 3799 2721 -3264 -5077 -8972 -10034 -898 -924 -3625 2048 -2303 -3209 325
2066 325 1843 -290 -6962 -14332 -11514 -6514 3114 -7 -1197 2847 5672 11555 13000 10829 5526
2051 5526 5755 -1448 -3719 -3289 1353 -3107 -9366 -3133 -356 3052 9028 3612 -3600 -4477 -1959 743
2035G43k48J730k150j536o095o350O771N280L681K123j254j545k448k618K271
2020a645M632l760J524q894r49K405m018L902N864M259k32J136O105k672n784
2005A873K891r86K263n784m8M016J234M157L016l77o671j0424r948P005J0861
1990C078K099m244n966K445k386l498j769L725j319J689O229Q784j226k318m4
1975E279o694j891K427J462j42l588L061N764M62q775n271o171J132J0991R051
1960G097j983M91m74p183O74L510K923p003l988O856K947M693p101m416J594n011
1944f374L426N817K278k882m418K049l991L118N128r24m557p294L897K264m688
1929g151p451J55J845O154K734l347J443P949R068O26o498k154m484K524L861
$$ plain form
2035 743 495 2225 75 -1461 -7556 -13906 -7135 -1855 1826 3949 2695 1150 -1298 -3916 -1645
2020 -1645 2987 -773 751 -8143 -9092 -6687 -10705 -6803 -939 3320 3088 4224 10329 7657 1873
2005 1873 4764 3778 6041 257 209 4225 5459 9616 12632 12255 5584 -4840 -14788 -7783 3078
1990 3078 5177 933 -5033 -2588 -4974 -8472 -10241 -6516 -7835 -6146 83 8867 7641 5323 5279
1975 5279 -1415 -3306 -879 583 441 -3147 -86 5678 6140 -2635 -7906 -14077 -12945 -1954 7097
1960 7097 5114 5605 5131 -2052 -1378 2132 5055 -1948 -5936 920 3867 8560 1459 -2957 -1363 -6374
1944 -6374 -2948 2869 5147 2265 -2153 -104 -4095 -977 4151 3227 -1330 -8624 -4727 -2463 -7151
1929 -7151 -14602 -14447 -12602 -6448 -3714 -7061 -5618 2331 11399 12025 5527 3373 -1111 1413 5274
1914E274k801j786q643l594k286L489Q051m909J767L886o674n01P765K45k222
1899b939J637J0789n697q356o808K977P115r78k873n86L663L58j653N89O501r212
1883e473Q20K036N553j619l12K965M255K180o183l255j99p014N21P720j857L589
1867C727l028k26n783p22Q575O249o450J812N093q990J125Q749l81q77k506M533
1851A0900k124k700k489m690l182k795J846N755J335M678L922l423k030o343l107
1836d447m02M766M351L421K893m536M753n021n375j928L114L058L29k712j737
1821E27L113R49j881p345J857M208k787n09m690m465O065K628O36O061j210l272
1805a15N32q39k859M629M173m873p619J679L943k689n791K793Q080j275K898L160
$$ plain form
1914 5274 2473 687 -7956 -11550 -13836 -10347 -2296 -7205 -5438 -1552 -8226 -8727 -962 -717 -2939
1899 -2939 -1302 9487 3790 -4566 -11374 -8397 -1282 -2260 -5133 -5719 -2056 -1698 -3351 -2762 3739 -5473
1883 -5473 -4653 -2617 2936 1317 1005 3970 8225 10405 4222 967 768 -6246 -5725 1995 138 3727
1867 3727 699 473 -5310 -6032 2543 8792 2342 4154 9247 257 1382 10131 9750 8873 6367 10900
1851 10900 8776 6076 3587 -1103 -4285 -7080 -5234 521 1856 6534 10456 7033 5003 -1340 -4447
1836 -4447 -4849 -83 4268 7689 10582 6046 10799 5778 403 -1525 1589 4647 4976 2264 527
1821 527 3640 4589 2708 -4637 -2780 1428 -1359 -1868 -6558 -11023 -4958 -2330 -1694 4367 3157 -115
1805 -115 417 -422 -3281 1348 5521 648 -6971 -5292 -1349 -4038 -9829 -7036 1044 -231 2667 5827
1789E827k112j027n248L77K227J46R42N9Q402k281K127O99l575k262j546K738
1773E493n313J208P749K912j414j571l274m052n636K204J922N629L221J860m047
1758F891q827O603M24n520l695L723n68l924k904O848M755m725j826P088L505
1743G848j116l974K319P531p01m139m459n144K258K51K98n437P69n634K63l614
$$ plain form
1789 5827 3715 2688 -2560 -2183 44 190 1132 1191 9593 7312 9439 10138 6563 4301 2755 5493
1773 5493 180 1388 9137 12049 10635 9064 5790 1738 -3898 -1694 228 5857 9078 10938 6891
1758 6891 -1936 4667 5091 -429 -4124 -401 -969 -4893 -7797 -949 3806 -919 -2745 4343 7848
1743 7848 6732 2758 5077 12608 11907 7768 3309 -1835 423 674 972 -4465 -3696 -9330 -9067 -12681
$$ [...]
##END NTUPLES=NMR SPECTRUM
##END=
