##TITLE=Analysis number 316825
Compound Code cc 38546
Book Reference 449/66
Project Code adrs
Chemist Name davee
##JCAMPDX= 6.0         $$ Bruker NMR JCAMP-DX V2.0
##DATA TYPE= NMR SPECTRUM
##DATA CLASS= NTUPLES
##ORIGIN= Bruker BioSpin GmbH
##OWNER= nmr
$$ XWIN-NMR		Version 3.5
$$ Fri Jan 27 10:08:02 2006 GMT Standard Time (UT+0h)  MAYBRIDGE\nmr@NMR_250MHZ
##.OBSERVE FREQUENCY= 250.131544655141
##.OBSERVE NUCLEUS= ^1H
##.ACQUISITION MODE= SIMULTANEOUS (DQD)
##.ACQUISITION SCHEME= undefined
##.AVERAGES= 16
##.DIGITISER RES= 18
##SPECTROMETER/DATA SYSTEM= dpx250
##.PULSE SEQUENCE= zg30
##.SOLVENT NAME= CDCl3
##.SHIFT REFERENCE= (INTERNAL, CDCl3, 0, 16.522)
##AUDIT TRAIL= $$ (NUMBER, WHEN, WHO, WHERE, WHAT)
$$ ##TITLE= Audit trail, XWIN-NMR		Version 3.5
$$ ##JCAMPDX= 5.01
$$ ##ORIGIN= Bruker BioSpin GmbH
$$ ##OWNER= nmr
$$ C:\u/data/dgb/nmr/ADRS/15280/pdata/1/auditp.txt
$$ ##AUDIT TRAIL=  $$ (NUMBER, WHEN, WHO, WHERE, WHAT)
(   1,<2006-01-27 10:07:39.35 +000>,<MAYBRIDGE\nmr>,<NMR_250MHZ>,
      <created by zg, POWCHK disabled, PULCHK disabled
       configuration hash MD5:
       62 19 C7 07 E1 42 D1 B7 37 6C 3D D0 77 39 F9 E6
       data hash MD5: 64K
       6A DF A7 F1 22 75 38 A3 D3 F7 95 AA 4E F1 BA F3>)
(   2,<2006-01-27 10:07:52.76 +000>,<MAYBRIDGE\nmr>,<NMR_250MHZ>,
      <Start of raw data processing
       ef LB = 0.3 FT_mod = 6 PKNL = 1 SI = 32K 
       data hash MD5: 32K
       D6 7A 64 83 38 30 2D 1A 77 70 DB F6 48 FF DC 1D>)
(   3,<2006-01-27 10:07:54.90 +000>,<MAYBRIDGE\nmr>,<NMR_250MHZ>,
      <apk 
       data hash MD5: 32K
       7C 6D 1E 4F DE 6E C9 72 D6 95 9F 50 68 86 64 C3>)
(   4,<2006-01-27 10:07:55.76 +000>,<MAYBRIDGE\nmr>,<NMR_250MHZ>,
      <abs ABSG = 5 
       data hash MD5: 32K
       38 4B 35 BD 23 AD 96 13 C0 41 63 81 FE 69 C2 EB>)
$$ ##END=
$$ 
$$ hash MD5
$$ 5F C2 FD 3A 20 E7 D0 34 A1 97 66 8A 74 79 92 87
##$RELAX= 
##$RELAX= 
##$RELAX= 
##$RELAX= 
##$RELAX= 
##$RELAX= 
##$RELAX= 
$$ Bruker specific parameters
$$ --------------------------
##$DU= <C:\u>
##$EXPNO= 15280
##$NAME= <ADRS>
##$PROCNO= 1
##$TYPE= <nmr>
##$USER= <dgb>
##$AMP= (0..31)
100 100 100 100 100 100 100 100 100 100 100 100 100 100 100 100 100 100 
100 100 100 100 100 100 100 100 100 100 100 100 100 100 
##$AQSEQ= 0
##$AQ_mod= 3
##$AUNM= <au_zg>
##$AUTOPOS= <45 >
##$BF1= 250.13
##$BF2= 250.13
##$BF3= 250.13
##$BF4= 250.13
##$BF5= 500.13
##$BF6= 500.13
##$BF7= 500.13
##$BF8= 500.13
##$BYTORDA= 1
##$CFDGTYP= 0
##$CFRGTYP= 5
##$CHEMSTR= <none>
##$CNST= (0..31)
1 1 145 1 1 1 1 1 1 1 1 1 1 1 1 1 1 1 1 1 1 1 1 1 1 1 1 1 1 1 1 1 
##$CPDPRG= <>
##$CPDPRG1= <>
##$CPDPRG2= <>
##$CPDPRG3= <>
##$CPDPRG4= <mlev>
##$CPDPRG5= <mlev>
##$CPDPRG6= <mlev>
##$CPDPRG7= <mlev>
##$CPDPRG8= <mlev>
##$CPDPRGB= <>
##$CPDPRGT= <>
##$D= (0..31)
0 1 0 0 0 0 0 0 0 0.06 0 0 0 0 0 0 0.0002 0 0 0 0 0 0 0 0 0 0 0 0 0 0 
0 
##$DATE= 1138356458
##$DBL= (0..7)
120 120 120 120 120 120 120 120 
##$DBP= (0..7)
150 150 150 150 150 150 150 150 
##$DBP07= 0
##$DBPNAM0= <>
##$DBPNAM1= <>
$$ [...]
##$SUBNAM6= <"">
##$SUBNAM7= <"">
##$SUBNAM8= <"">
##$SUBNAM9= <"">
##$SW= 20.6930455092707
##$SWIBOX= (0..15)
0 0 3 0 0 0 0 0 0 0 0 0 0 0 0 0 
##$SW_h= 5175.983436853
##$TD= 65536
##$TD0= 1
##$TE= 293.16
##$TE2= 300
##$TE3= 300
##$TEG= 300
##$TL= (0..7)
0 120 120 120 120 120 120 120 
##$TP= (0..7)
150 150 150 150 150 150 150 150 
##$TP07= 0
##$TPNAME0= <>
##$TPNAME1= <>
##$TPNAME2= <>
##$TPNAME3= <>
##$TPNAME4= <>
##$TPNAME5= <>
##$TPNAME6= <>
##$TPNAME7= <>
##$TPOAL= (0..7)
0.5 0.5 0.5 0.5 0.5 0.5 0.5 0.5 
##$TPOFFS= (0..7)
0 0 0 0 0 0 0 0 
##$TUNHIN= 0
##$TUNHOUT= 0
##$TUNXOUT= 0
##$USERA1= <user>
##$USERA2= <user>
##$USERA3= <user>
##$USERA4= <user>
##$USERA5= <user>
##$V9= 5
##$VALIST= <valist>
##$VCLIST= <CCCCCCCCCCCCCCC>
##$VD= 0
##$VDLIST= <DDDDDDDDDDDDDDD>
##$VPLIST= <PPPPPPPPPPPPPPP>
##$VTLIST= <TTTTTTTTTTTTTTT>
##$WBST= 1024
##$WBSW= 4
##$XGAIN= (0..3)
0 0 0 0 
##$XL= 0
##$YL= 0
##$YMAX_a= 552996
##$YMIN_a= -348495
##$ZGOPTNS= <>
##$ZL1= 120
##$ZL2= 120
##$ZL3= 120
##$ZL4= 120
##$ABSF1= 16.522
##$ABSF2= -4.171173
##$ABSG= 5
##$ABSL= 3
##$ALPHA= 0
##$AQORDER= 0
##$ASSFAC= 0
##$ASSFACI= 0
##$ASSFACX= 0
##$ASSWID= 0
##$AUNMP= <proc_1d>
##$AZFE= 0.1
##$AZFW= 0.1
##$BCFW= 0
##$BC_mod= 0
##$BYTORDP= 0
##$COROFFS= 0
##$CY= 12.5
##$DATMOD= 1
##$DC= 0
##$DFILT= <>
##$DTYPP= 0
##$F1P= 14.0000005364418
##$F2P= -0.99999901652339
##$FCOR= 0.5
##$FTSIZE= 32768
##$FT_mod= 6
##$GAMMA= 0
##$GB= 0
##$INTBC= 1
##$INTSCL= 1
##$ISEN= 128
##$LB= 0.3
##$LEV0= 0
##$LPBIN= 0
##$MAXI= 10000
##$MC2= 0
##$MEAN= 0
##$ME_mod= 0
##$MI= 0
##$NCOEF= 0
##$NC_proc= -3
##$NLEV= 6
##$NOISF1= 0
##$NOISF2= 0
##$NSP= 0
##$NTH_PI= 0
##$NZP= 0
##$OFFSET= 16.522
##$PC= 1
##$PHC0= 92.99568
##$PHC1= 4.47086
##$PH_mod= 1
##$PKNL= yes
##$PPARMOD= 0
##$PSCAL= 4
##$PSIGN= 0
##$REVERSE= no
##$SF= 250.13
##$SI= 32768
##$SIGF1= 0
##$SIGF2= 0
##$SINO= 400
##$SIOLD= 32768
##$SREGLST= <1H.CDCl3>
##$SSB= 0
##$STSI= 32768
##$STSR= 0
##$SW_p= 5175.98343685301
##$SYMM= 0
##$S_DEV= 0
##$TDeff= 65536
##$TDoff= 0
##$TI= <Analysis number 999999
Compound Code 99
Book Reference 9
Project Code 9>
##$TILT= no
##$TM1= 0
##$TM2= 0
##$TOPLEV= 0
##$USERP1= <user>
##$USERP2= <user>
##$USERP3= <user>
##$USERP4= <user>
##$USERP5= <user>
##$WDW= 1
##$XDIM= 32768
##$YMAX_p= 289634128
##$YMIN_p= -23300
$$ End of Bruker specific parameters
$$ ---------------------------------
##NTUPLES= NMR SPECTRUM
##VAR_NAME=  FREQUENCY,     SPECTRUM/REAL,   SPECTRUM/IMAG
##SYMBOL=    X,             R,               I
##VAR_TYPE=  INDEPENDENT,   DEPENDENT,       DEPENDENT
##VAR_FORM=  AFFN,          ASDF,            ASDF
##VAR_DIM=   32768,         32768,           32768
##UNITS=     HZ,            ARBITRARY UNITS, ARBITRARY UNITS
##FACTOR=    0.157963299565203, 1,           1
##FIRST=     4132.6476996994, 0,             0
##LAST=      -1043.33573715361, 0,           0
##MIN=       -1043.33573715361, -23300,      0
##MAX=       4132.6476996994, 289634128,     0
$$ Real data points
##PAGE= N=1
##DATA TABLE= (X++(R..R)), XYDATA
$$ [...]
16978B7377197J832360J558090J096582M90344j45907p09014j152561j405816
$$ 27377197 29209557 30767647 31864229 32354573 32208666 31499652 30347091 28941275
16970B8941275j403224j150287p38055l48557j56451k56328n87048j058933j608785
$$ 28941275 27538051 26387764 25649709 25301152 25144701 24888373 24301325 23242392 21633607
16961B1633607k128698k486096k586974k459517k185658j837656j466562j117032
$$ 21633607 19504909 17018813 14431839 11972322 9786664 7949008 6482446 5365414
16953E365414q27910o11823m54506l44886k69674k08699j66058j35589j10328
$$ 5365414 4537504 3925681 3471175 3126289 2856615 2647916 2481858 2346269 2235941
16944B235941r3895q0419p2292p0467o8536o7097o4114n6701n2808m6565m0600
$$ 2235941 2142046 2061627 1989335 1918868 1850332 1783235 1719121 1662420 1609612 1563047 1522447
16933A522447k5922r323M15J3237J2141J1128J4978J8244K9864M9724Q1889J36226
$$ 1522447 1496525 1487202 1487617 1500854 1512995 1524123 1539101 1557345 1587209 1636933 1718822 1855048
16921A855048K05111L08545M75648P33348J130431J646238K217797K680307K804701
$$ 1855048 2060159 2368704 2844352 3577700 4708131 6354369 8572166 11252473 14057174
16912A4057174K458115J717670Q98500L33279J50067J99266J58772k19289q98309
$$ 14057174 16515289 18232959 19131459 19464738 19614805 19814071 19972843 19753554 18855245
16903A8855245j574901j932491j786911j198704l73134M09143Q95069R77565O83601
$$ 18855245 17280344 15347853 13560942 12362238 11989104 12398247 13293316 14270881 14954482
16894A4954482K32144j08888k22143j79702j83725m07610q76361j394937j749429
$$ 14954482 15186626 15077738 14855595 14675893 14492168 14084558 13208197 11813260 10063831
16885A0063831j817218j627747j296973r45856o52115m41557l03136k15686j60800
$$ 10063831 8246613 6618866 5321893 4376037 3723922 3282365 2979229 2763543 2602743
16876B602743j21518q3950n4220k2169N216L5757Q1900J48370K62977M46990P24650
$$ 2602743 2481225 2397275 2343055 2320886 2326102 2361859 2443759 2592129 2855106 3302096 4026746
16865D026746J118540J612064K091983K390112K337991J863297J134987M61984
$$ 4026746 5145286 6757350 8849333 11239445 13577436 15440733 16575720 17037704
16857A7037704Q9543L9522J01568J137m22018r99821j469623j564735j217191
$$ 17037704 17127247 17166769 17268337 17269474 16847456 15847635 14378012 12813277 11596086
16848A1596086n39680K35280Q50612J109968R61699N26107N2952k31996k63030
$$ 11596086 11056406 11291686 12142298 13252266 14213965 14740072 14793024 14561028 14297998
16839A4297998k10619k72707n95801j102415j573878j811735j763297j499882
$$ 14297998 14087379 13814672 13218871 12116456 10542578 8730843 6967546 5467664
16831E467664j143893q14148n66032l91824k87538k25116j76602j49337j26223
$$ 5467664 4323771 3509623 2943591 2551767 2264229 2039113 1862511 1713174 1586951
16822A586951j10786j00686r9097j00378r6257r3727q4508p6789p0205n4789m8093
$$ 1586951 1476165 1375479 1276382 1176004 1079747 986020 901512 824723 754518 699729 651636
16811F51636m7408m2033l4673l1615k7932k2529j9079k1165j8660j8959j6396
$$ 651636 604228 562195 527522 495907 467975 445446 426367 405202 386542 367583 351187
16800C51187j5877j1517p159r260j2963p660q937p785p353j320p641j1418o507
$$ 351187 335310 323793 316634 307374 294411 286751 277814 270029 262676 261356 253715 242297 235790
16787B35790o231p308o070j0755m742l792n820q963m954m249j001P93p787l562
$$ 235790 229559 222251 216181 205426 200684 196892 191072 182109 177155 172906 171905 172698 164911 161349
16773A61349j323m631m245l269o784l492l633n450q470p589m260M20l711J977
$$ 161349 160026 155395 151150 147881 141097 137605 133972 128522 120052 112463 108203 108623 104912 106889
16759A06889L514J462j932L15K289k924q34J652J731k738n041m84m118l071J66
$$ 106889 110403 111865 109933 110248 112537 109613 108779 110431 112162 109424 104383 103899 99781 96710 96876
16744I6876J764l78j659l219k589k288k916K797j261k015m688k149P48l215j170
$$ 96876 98640 98262 96603 93384 90795 88507 85591 88388 87127 85112 80424 78275 79023 75808 74638
16729G4638k034Q82M896L928M219K702K816O607k553l557l132l028m56J492p25
$$ 74638 72604 73486 78382 82310 86529 89231 92047 98654 96101 92544 89412 86384 85928 87420 86695
16714H6695M40n024k545K669o05J814J889L759K937j054m520o048m322m469j150
$$ 86695 87135 82111 79566 82235 81630 83444 85333 89092 92029 90975 86455 80407 76085 71616 70466
16699G0466K229q12J206K009k615j163R55J029k190l133l1k125r97J127l157l793
$$ 70466 72695 71883 73089 75098 72483 71320 72275 73304 71114 67981 67950 65825 64828 65955 62798 59005
16683E9005P2M239k964K751L371j321q16K23J720L58k132L26R13N61J683k265
$$ 59005 59077 63316 60352 63103 66474 65153 64337 64560 66280 66638 64506 64832 65745 66306 67989 65724
16667F5724k570L40L019M9k829n952k570J863k374j851K527N405K106m811l698
$$ 65724 63154 63494 66513 66562 63733 57781 55211 57074 54700 52849 55376 60781 62887 58076 54378
16652E4378l752j311o14k752k242J12M538j568j536J834M55k19O38k152j440L204
$$ 54378 50626 49315 48701 45949 43707 43819 48357 46789 45253 47087 47542 47323 47961 45809 44369 47573
16636D7573K834K326Q9N59j331L320M040O345K249L765M412R817J2445J3593J1877
$$ 47573 50407 52733 52822 53381 52050 55370 59410 65755 68004 71769 76181 85998 98443 112036 123913
16621A23913P086k796K640R220J0027P892N619P705p8l318n010p623r784m963
$$ 123913 130999 128203 130843 140063 150090 157982 163601 171306 171228 167910 162900 155277 145493 140530
16607A40530l111r13o289r662r933q637j3298p891m227p709n648p910o465N0q33
$$ 140530 137419 136506 130217 120555 110622 101985 88687 80796 76569 68860 63212 55302 48837 48887 48054
16592D8054k751k558K040J926L051j817o102J325O500L092j33P92M531P835O405
$$ 48054 45303 42745 44785 46711 49762 47945 41843 43168 49668 52760 52627 53419 57950 65785 72190
16577G2190O830O461J3992P543K410K351M544O832N633O131K766k794j729j109
$$ 72190 79020 85481 99473 107016 109426 111777 116321 123153 128786 134917 137683 134889 133160 132051
16563A32051l137n704k795n114n673r522p216n507p021n219n637p334p097r316
$$ 132051 128914 123210 120415 115301 109628 100106 92890 87383 80362 75143 69506 62172 55075 45759
16549D5759r874O17N655L64j887k886k612m395j041N86L15K954l20j127r5J034
$$ 45759 35885 36502 42157 42521 40634 37748 35136 30741 29700 30286 30601 33555 33235 32108 32013 33047
16533C3047L219l452j486J645L400r05m93p32k368J51l408l878j890P58K228J145
$$ 33047 36266 32814 31328 32973 36373 35468 34975 34243 31875 32026 28618 24740 22850 23608 25836 26981
16517B6981K679M290M267k008M00M98K065Q92K068k755O302N835L420N955R138
$$ 26981 29660 33950 38217 36209 36609 37107 39172 40064 42132 39377 45679 51514 54934 60889 70027
16502G0027J3753J4134J1554J2117J0953J1777M562m211j525j656M827K692N352
$$ 70027 83780 97914 109468 121585 132538 144315 148877 144666 143141 141485 146312 149004 154356
16489A54356L244L557O015P272N407j6J88k60o204o709o865q882r171r126P12
$$ 154356 157600 161157 167172 174444 179851 179835 180023 179763 173559 166850 159985 151103 141932 132806 133518
16474A33518K250J38r33j986n720j1728r346j2591r946p807j0607r068n957n371
$$ 133518 135768 135906 134973 132987 127267 115539 106193 93602 83656 75849 65242 56174 50217 44846
16460D4846K89n274j952k137l195m427k7M426J813J03J851K10m685l04k369j044
$$ 44846 45135 39861 37909 35772 32577 28150 28123 32549 34362 34465 36316 36526 31841 31537 29168 28124
16444B8124K343O52k032k819r39M7j252J596J489J658k449o822K027j251J468
$$ 28124 30467 31119 29087 26268 25329 25376 24124 25720 27209 28867 26418 19596 21623 20372 21840
16429B1840N074P148K052o29l519p868q83j259k962K232M647O370O399P349J0852
$$ 21840 26914 34062 36114 35485 31966 24098 23215 21956 18994 21226 25873 32243 38642 45991 56843
16414E6843J1676R834R625J1899M102j910j712l84N205J423l936o764k021p511
$$ 56843 68519 78353 87978 99877 103979 102069 100357 99973 105178 106601 102665 95901 93880 86369
16400H6369j0502j118Q829Q274L178N898O391J820n121n179j249j624n374r765
$$ 86369 75867 74749 83578 91852 95030 100928 107319 109139 104018 98839 97590 95966 90592 80827
16386H0827r464r449q638m141r39n675p436o345RK22j966L150j800l035k563r52
$$ 80827 71363 61914 53276 49135 48196 42521 35085 28740 28749 28971 27005 30155 28355 25320 22757 21805
16370B1805K91K075K094K960J751O06R435J2436J0389R197O700R404O710j27n
$$ 21805 22096 24171 26265 29225 30976 31582 41017 53453 63842 73039 79739 89143 95853 95726 95721
16355I5721R91j431J023m733m924p742m283M966M133L221M556K136j270L075l837
$$ 95721 96712 95281 96304 91571 86647 78905 74622 79588 83721 86942 91498 93634 92364 95439 91602
16340I1602l961R05l253l742m701q581r277p229q259q655l061o004k902m460k827
$$ 91602 87641 88546 85293 81551 76850 68269 58992 51763 43504 34849 31788 25784 22882 18422 15595
16325A5595l753L691n28O22m886N91j131q71j647J876L826j73m755J800K479O687
$$ 15595 11842 15533 15005 15627 10741 11332 10201 9330 7683 9559 13385 13212 8457 10257 12736 19423
16309A9423M382k303l253m773k744N08J728j078R16o02n748n06J342K165k526
$$ 19423 23805 21502 18249 13476 10732 11240 12968 11890 12806 12204 6456 5950 7292 9457 6931
16294F931K444R77L378J093J844l405n564k639M60K465j436k087K66k274j137
$$ 6931 9375 10352 13730 14823 16667 13262 7698 5059 5519 7984 6548 4461 4727 2453 1316
16279A316J288Q96L105K999K65l26K575k080n68J92J312o27n347k593J98O729
$$ 1316 2604 3500 6605 9604 9869 9543 12118 10038 9470 9662 10974 10347 5000 2407 2605 9334
16263I334k777k139J744k19L905O69L306J367k089N83m831j663K728K700L444
$$ 9334 6557 4418 6162 5943 9848 10517 13823 15190 13101 13684 8853 7190 9918 12618 16062
16248A6062l326l220P86K58l896O6j52j089Q04O20l56J428k42J234P02L022J162
$$ 16062 12736 9516 10302 10560 6664 6730 6578 5489 6293 6913 6557 7985 7743 8977 9679 12701 13863
16231A3863j812l04j336j531k625N436J455p358l412P305M538j652p09k278j048
$$ 13863 12051 11747 10411 8880 6255 11691 13146 5788 2376 9681 14219 12567 11858 9580 8532
16216H532L609L77J988N5l391l670M72L03L66k809M39O07r9j345K784j173m532
$$ 8532 12141 12518 14506 14561 11170 7500 7972 8275 8641 5832 6271 6878 6779 5434 8218 7045 2513
16199B513r27m48j73K70K490l55k254J503M42L430K724j511k717m45m77J728j082
$$ 2513 1586 1138 965 1235 3725 3370 1116 2619 3061 6491 9215 7704 4987 4542 4065 5793 4711
16182D711L99L36j882R84J06k558l689K074K877O385m20M60K518P4m110k427m996
$$ 4711 5110 5446 3564 4548 4654 2096 -1593 481 3358 9743 9323 9783 12301 12375 8265 5838 842
16165H42l144M412M402k342k421j587j397L731K50L61M13N83j538j497j039L510
$$ 842 -2302 2110 6512 4170 1749 162 -1235 2496 2746 3107 3520 4103 2565 1068 29 3539
16149C539N97O24L677Q12K03L191J45M40J103l126l696n319k513J805O125R10
$$ 3539 4136 4760 8437 9249 9452 12643 12788 13228 14331 11205 7509 2190 -323 1482 7607 8517
16133H517J432m958o85J726l354K180N492M93k047o6Q31J161k870l708Q23l201
$$ 8517 9949 4991 4306 6032 2678 4858 10350 10843 8796 8730 9561 10722 7852 4144 4967 1766
16117A766k195L796L462J998O02o39m404k346N94K351K164k9k908m795J221M969
$$ 1766 -429 3367 6829 8827 9429 8790 4386 2040 2634 4985 7149 7120 4212 -583 638 5607
16101E607j260l366n26M14j431j968L779L006J886l170j149L837m133l772j005
$$ 5607 4347 981 455 869 -562 -2530 1249 4255 6141 2971 1822 5659 1526 -2246 -3251
16086c251j087M694L671K846n07m324j152k062j92L950K12l27J296L29r61k686
$$ -3251 -4338 356 4027 6873 6366 2042 890 -1172 -1364 2586 2798 2471 3767 4096 3135 449
16070D49l91J310M86o41J947m28P67K781l745M1J15l032P54J031K03Q92k668J714
$$ 449 58 1368 1854 1213 3160 2732 3499 6280 2535 2576 2691 -341 413 1444 1647 2539 -129 1585
16052A585J623M157j016k673k815o33K220K545j372j072K323K34p484m856J44
$$ 1585 3208 7365 6349 3676 861 228 2448 4993 3621 2549 4872 5106 -2378 -7234 -7090
16037g090J816L674K098k327j412K229L648J966j042j287n69j805r69k879l397
$$ -7090 -5274 -1600 498 -1829 -3241 -1012 2636 4602 3560 2273 1704 -101 -1070 -3949 -7346
16022g346K180N52k99l63M182L700L55r71j246K02j457M04K21q93k281k322L124
$$ -7346 -5166 -4614 -4913 -5276 -1094 2606 2961 1990 744 946 -511 -107 114 -779 -3060 -5382 -2258
16005b258L413j738J819j305r64M52K54n24L38L313R65P67J480n65K75K74m489
$$ -2258 1155 -583 1236 -69 -1033 -581 -327 -851 -513 2800 3765 4532 6012 5447 5722 5996 1507
15988A507l03M50k167l583J504P11k205J653J726J094K196j279k614K103O118
$$ 1507 1204 1654 -513 -4096 -2592 -1881 -4086 -2433 -707 387 2583 1304 -1310 793 6911
15973F911Q17L61k654r36j396k227L98j404n817L31j511L952Q053J167m71J396
$$ 6911 7728 8089 5435 4499 3103 876 1274 -130 -5947 -5616 -7127 -3175 4878 6045 5574 6970
15957F970j562J328l172j544K657K229k748m567k542n80l23L163l359J801N100
$$ 6970 5408 6736 3564 2020 4677 6906 4158 -409 -2951 -3531 -3854 -691 -4050 -2249 2851
15942B851N985L424P62k538l450j888j490j99k421k511j865j6o4K398L750M313
$$ 2851 8836 12260 13022 10484 7034 5146 3656 3457 1036 -1475 -3340 -3356 -3420 -1022 2728 7041
15926G041Q57l643l084r31j750J118M287L0m18K83n482k961n531k867L340L806
$$ 7041 7898 4255 1171 240 -1510 -392 3895 3925 3507 3790 -1692 -4653 -10184 -13051 -9711 -5905
15910e905j601m66M562M374J595r14k513m061l76K601M617N48K868J749j38o22
$$ -5905 -7506 -7972 -3410 964 2559 1645 -868 -4929 -5305 -2704 1913 2461 5329 7078 6940 6318
15894F318j880l194m621j030L085K481L946n18n31j744n767k471K726Q66p30l790
$$ 6318 4438 1244 -3377 -4407 -1322 1159 5105 4587 4056 2312 -3455 -5926 -3200 -2334 -3064 -6854
15878f854o52N456N12j759R54K222k935J189l441L471M525l127p65J363M59k48
$$ -6854 -7506 -2050 -1538 -3297 -2343 -121 -3056 -1867 -5308 -1837 2688 -439 -1204 159 618 370
15862C70J058M82M58K36J43O42J989K477l640l051L516m72k13k967n523j09J350
$$ 370 1428 1910 2368 2604 2747 3389 5378 7855 4215 1164 4680 4208 3995 1028 -4495 -4604 -3254
15845c254J575K816r46J690j628m728k050k39J546J548K413N08j748L07p18j732
$$ -3254 -1679 1137 191 1881 253 -4475 -6525 -6764 -5218 -3670 -1257 -749 -2497 -2190 -2908 -4640
15829d640j117N67K512l43n23l19J573M303J722l929K33m344k506j575L305L800
$$ -4640 -5757 -5190 -2678 -3021 -3544 -3863 -2290 2013 3735 -194 39 -4305 -6811 -8386 -5081 -1281
15813a281o48l156k37K22J339j418L087P33K69J394j640k438J017J107J227p84
$$ -1281 -1929 -5085 -5322 -5100 -3761 -5179 -2092 -1359 -1090 304 -1336 -3774 -2757 -1650 -423 -1207
15797a207K836j578k997K751K888K284K38l601k876J977L042J740j547K87j380
$$ -1207 1629 51 -2946 -195 2693 4977 5215 1614 -1262 715 3757 5497 3950 4237 2857
15782B857k438L57k163L102j534j232L791k330j958N2J183l411m102j298M88L216
$$ 2857 419 776 -1387 1715 181 -1051 2740 410 -1548 -1496 -313 -3724 -7826 -9124 -8636 -5420
15766e420K512K669K900j370j494k141M32M793n64m084l906M624P766j492n21
$$ -5420 -2908 -239 2661 1291 -203 -2344 -1912 2881 2317 -1767 -5673 -1049 6717 5225 4704
15751D704k506j970l166J319O23O40N065J050l640k040r28j239k603k167l48O529
$$ 4704 2198 228 -2938 -1619 -996 -356 4709 5759 2119 79 -849 -2088 -4691 -6858 -7206 -677
15735f77M125K39j010j998j58n22r79m861N42M896L398j260l164o98L145q29K873
$$ -677 3448 3687 2677 679 521 -1 -980 -5841 -5299 -403 2995 1735 -1429 -2127 1018 189 3062
15718C062J878n240J741K425l296m925J8M198Nm440k347J093j701L637R00j516
$$ 3062 4940 -300 1441 3866 570 -4355 -4337 -139 -134 -4574 -6921 -5828 -7529 -3892 -2992 -4508
15702d508J031J356K247n21l267Q16L878P01m224j64J767K96m513p15k838K009
$$ -4508 -3477 -2121 126 -395 -3662 -2846 1032 1733 -2491 -2655 -888 -592 -5105 -5820 -8658 -6649
15686f649j20k317n11J147n96M42K743N046L510J205k112k368J038J23j625k615
$$ -6649 -6769 -9086 -9597 -8450 -9046 -8604 -5861 -815 2695 3900 1788 -580 458 581 -1044 -3659
15670c659J191J926k14j223j545j76k44O43l710m994Q4K825M935J309K648L307
$$ -3659 -2468 -542 -756 -1979 -3524 -3700 -3944 -3301 -7011 -12005 -11921 -9096 -4161 -2852 -204 3103
15654C103k877k333k512q49K655k93J082r29O7k714l485n124l75N664J794L52
$$ 3103 226 -2107 -4619 -5468 -2813 -3106 -2024 -2953 -2886 -5600 -9085 -14209 -14584 -8920 -7126 -6774
15638f774M236j157k152L70K55J701R17K495J623k063k723l29Q01K577K709j531
$$ -6774 -2538 -3695 -5847 -5477 -5222 -3521 -2604 -109 1514 -549 -3272 -3601 -2800 -223 2486 955
15622I55j882m240J188M206N18j111l971L18J304K723K06k531K214o7J078j024
$$ 955 -927 -5167 -3979 227 745 -366 -4337 -4019 -2715 8 214 -2317 -103 -170 908 -116
15606a16K845J24J371P58k33l615R66P07l418k709r98j421J934P54O88R36q81
$$ -116 2729 2853 4224 4982 4749 1134 2100 2807 -611 -3320 -4318 -5739 -3805 -3051 -2363 -1427 -2308
15589b308j992O872L002j771J535o76j531j306J529j732k197J552Q09o28K540
$$ -2308 -4300 2572 5574 3803 5338 4662 3131 1825 3354 1622 -575 977 1786 1158 3698
15574C698m037k680K560K274n75l065k219m247j238J457l016l215k49m34J778
$$ 3698 -339 -3019 -459 1815 1240 -1825 -4044 -8291 -9529 -8072 -11088 -14303 -14552 -14986 -13208
15559a3208J898N559K409k476M215J434j617j125k90q56q86K801L252j883L93
$$ -13208 -11310 -5751 -3342 -5818 -1603 -169 -1786 -2911 -3201 -4057 -4943 -2142 1110 -773 -380
15544c80K289j323l439j778k951K674L043J987k559j258J348n79j938k341L01
$$ -380 1909 586 -2853 -4631 -7582 -4908 -1865 122 -2437 -3695 -2347 -2926 -4864 -7205 -6904
15529f904K437N36J330J568j50O26n269K20K565K252O65l049o990P30M532J335
$$ -6904 -4467 -3931 -2601 -1033 -1183 -557 -5826 -5606 -3041 -789 -124 -3173 -10163 -9433 -4901 -3566
15513c566j722k107k34N320M665N59j693k919j717q2O71k991J33k376j367L81
$$ -3566 -5288 -7395 -7629 -2309 2356 2915 1222 -1697 -3414 -3496 -2825 -5816 -5683 -8059 -9426 -9045
15497i045k55M832J954J079M16N52n236j403J489L231M675k46k687m263j657k401
$$ -9045 -9300 -4468 -2514 -1435 -1019 -467 -5703 -7106 -5617 -2386 2289 2043 -644 -4907 -6564 -8965
15481h965j479J800L024q22K3J746K346J7J49j641j307l272m224N87M19O093M477
$$ -8965 -10444 -8644 -5620 -6442 -6419 -4673 -2327 -2310 -2161 -3802 -5109 -8381 -12605 -12018 -11599 -5506 -1029
15464a029j405n48L4j795m486J498L137L259L431J283m802o60m2J069P38k20q0
$$ -1029 -2434 -2982 -2948 -4743 -9229 -7731 -4594 -1335 2096 3379 -1423 -2083 -2125 -1056 -318 -538 -618
15447f18j26J262J807M75m185j122j365O81R91o684Q56J877J782k39q69j40k568
$$ -618 -744 518 2325 2800 -1385 -2507 -3872 -3191 -2200 -8884 -8028 -6151 -4369 -4608 -5477 -5617 -8185
15430h185j582J001M502K811q71J629J273j512l076R29L989r66m82n1k103k084
$$ -8185 -9767 -8766 -4264 -1453 -2324 -695 578 -934 -4010 -3081 908 -58 -540 -591 -2694 -4778
15414d778j6k46k253l748l001j393M70J009K59N455O646k05l054l638J476K974
$$ -4778 -4794 -5040 -7293 -11041 -14042 -15435 -14965 -13956 -13697 -8242 -1596 -1801 -4855 -8493 -7017 -4043
15398d043J345m214j938L563K993n19m2l625k106N35R46j07p089J862M984L933
$$ -4043 -2698 -6912 -8850 -5287 -2294 -2813 -2855 -6480 -8586 -8051 -7105 -7212 -14301 -12439 -7455 -3522
15382c522K637k575j305L990j994o58n93p09O62j912J701j883j376m128J014K665
$$ -3522 -885 -3460 -4765 -775 -2769 -3427 -4020 -4729 -4067 -5979 -4278 -6161 -7537 -11665 -10651 -7986
15366g986J045p87J2j097q36J673N537Q04p62J405k01J078L269j462l054k384
$$ -7986 -6941 -7728 -7716 -8813 -9649 -7976 -2439 -1635 -2397 -992 -1193 -115 3154 1692 -1362 -3746
15350c746m19K438J879p55J024l925k279m8j178l073l560J22K272j649j026J47
$$ -3746 -4165 -1727 152 -603 421 -3504 -5783 -5831 -7009 -10082 -13642 -13520 -11248 -12897 -13923 -13776
15334a3776r36J851M540P50n45K055k007K346L68M30p48J021r58J566M940K893
$$ -13776 -14712 -12861 -8321 -7571 -8116 -6061 -8068 -5722 -5354 -4924 -5672 -4651 -5609 -4043 897 3790
15318C790l416k878k858J9K223J395R44j965l12P8m193l025j570p7j31N41J742
$$ 3790 374 -2504 -5362 -5343 -3120 -1725 -781 -2746 -3058 -2980 -7173 -10198 -11768 -11845 -11976 -11435 -9693
15301i693J908K048k891K886M709j228j855j342J486Q30J322J437j375m40q18
$$ -9693 -7785 -5737 -8628 -5742 -1033 -2261 -4116 -5458 -3972 -3142 -1820 -383 -1758 -2198 -3016
15286c016r30L98R99k44O5k88j487k2o41P08J587M205O38l962k712L803K574p71
$$ -3016 -3946 -3548 -2549 -2793 -2728 -3016 -4503 -4525 -5166 -4458 -2871 1334 1972 -1990 -4702 -899 1675 904
15268I04m14K638J3J488o20J489Q8j849K032M447j419p11J102R94j836k357j856
$$ 904 490 3128 3141 4629 4009 5498 5586 3737 5769 10216 8797 8086 9188 10182 8346 5989 4133
15251D133o057l203J415l089Q83Q65O68j295K724K28l346J319K310M091K323j781
$$ 4133 -1924 -5127 -3712 -6801 -5918 -5053 -4385 -5680 -2956 -2728 -6074 -4755 -2445 1646 3969 2188
15235B188k073m437l540Q77k703J270M286N892l59l61J630l074n060K568k72k196
$$ 2188 115 -4322 -7862 -6985 -9688 -8418 -4132 1760 1401 1040 2670 -404 -5464 -2896 -3168 -5364
15219e364L020l387j607k597R09m205j795J060L367N83L854J880l80l237k085
$$ -5364 -2344 -5731 -7338 -9935 -9026 -13231 -15026 -13966 -10599 -10016 -6162 -4282 -4662 -7899 -9984
15204i984K319o31M340K973j867q044M326L778k168K850L191k6k895o021m771
$$ -9984 -7665 -8296 -3956 -983 -2850 -10894 -6568 -2790 -4958 -2108 1083 1057 -1838 -7859 -12630
15189a2630N023M550K767q12K285j826k052n933j730j870O91J741J094q24J954
$$ -12630 -7607 -3057 -290 -1102 1183 -643 -2695 -8628 -10358 -12228 -11537 -9796 -8702 -9526 -7572
15174g572J089l873n16L638J227k51k45J628K110q98n216J976L319J419k184k308
$$ -7572 -6483 -10356 -10872 -7234 -6007 -6258 -6503 -4875 -2765 -3663 -8879 -6903 -3584 -2165 -4349 -6657
15158f657K135k023J082k5K600M542O91m731K072q48l762k73J668J171n80k707
$$ -6657 -4522 -6545 -5463 -5488 -2888 1654 2345 -2386 -314 -1162 -4924 -5197 -3529 -2358 -2938 -5645
15142e645j450L416j528o494j470K035K671n19o29J72k422j974P17J631M889O692
$$ -5645 -7095 -3679 -5207 -11701 -13171 -11136 -8465 -8984 -9613 -9441 -11863 -13837 -13120 -11489 -6600 92
15126I2K971j168k568j443m14L121K030m4J069J138m13k063k252K066L642j284
$$ 92 3063 1895 -673 -2116 -2530 591 2621 2577 3646 4784 4371 2308 56 2122 5764 4480
15110D480j476J20m16J325J207k158n912M87K505J138j847l160O31k084J759J700
$$ 4480 3004 3124 2708 4033 5240 3082 -2830 -2343 162 1300 -547 -3707 -3076 -5160 -3401 -1701
15094a701J607j604k160j586J703k490n37L164k9J267k392m260N51J344N670M444
$$ -1701 -94 -1698 -3858 -5444 -3741 -6231 -6768 -3604 -3633 -2366 -4758 -9018 -8467 -7123 -1453 2991
15078B991K23L6M6j720k084k62L062P31j910m336k862k490j532J82j714L205k082
$$ 2991 3214 3250 3296 1576 -508 -770 2292 3023 1113 -3223 -6085 -8575 -10107 -9925 -11639 -8434 -10516
15061a0516o11k880l167j421P829L297L211k203L2m129j537L513L360R28J911
$$ -10516 -11127 -14007 -17174 -18595 -10766 -7469 -4258 -6461 -6429 -10558 -12095 -8582 -5222 -4294 -2383
15046b383J599J730K55j019k661m155J053K037J770K884l513m032M043P87N10
$$ -2383 -784 946 1201 182 -2479 -6634 -5581 -3544 -1774 1110 -2403 -6435 -2392 -1605 -1095
15031a095M37m42j90o56Q79J592K210k633J732J053J616k177K48o4l812J889k714
$$ -1095 -658 -1100 -1290 -1946 -1067 525 2735 102 1834 2887 4503 2326 2574 2510 -1302 587 -2127
15014b127m067P13j082J73j240l326k187L742O602k91k554K144L115J712k536
$$ -2127 -6194 -5481 -6563 -6390 -7630 -10956 -13143 -9401 -2799 -3090 -5644 -3500 -385 1327 -1209
14999a209K10j955k40k561J43k288J173J271m369N86j466O27J203j304J02K521
$$ -1209 -999 -2954 -3194 -5755 -5612 -7900 -6727 -5456 -9825 -9239 -10705 -10078 -8875 -10179 -10077 -7556
14983g556K799Q99k41J473M55k137P25o35j193k04K874k130j932l145j514K735
$$ -7556 -4757 -3858 -4099 -2626 -2171 -4308 -3583 -4218 -5411 -5615 -2741 -4871 -6803 -9948 -11462 -8727
14967h727K921k307K88J924p50m487M33L338j043J409L209o77l896k621r82M148
$$ -8727 -5806 -8113 -7825 -5901 -6651 -11138 -10705 -7367 -8410 -7001 -3792 -4469 -8365 -10986 -11968 -7820
14951g820L260J788N79J712N84K905k377q352l653K093L027o39k365o06J396J197
$$ -7820 -4560 -2772 -2193 -481 103 3008 631 -7721 -11374 -9281 -6254 -6893 -9258 -9864 -8468 -7271
14935g271j600K711l210j811L359k654j071j236J052K254K681O375k62n986l481
$$ -7271 -8871 -6160 -9370 -11181 -7822 -10476 -11547 -12783 -11731 -9477 -6796 -421 -683 -6669 -10150
14920a0150n85L287J403l308l395j079j70Q10r89J590L230M36l579j784K113L20
$$ -10150 -10735 -7448 -6045 -9353 -12748 -13827 -13997 -13187 -14176 -12586 -9356 -8920 -12499 -14283 -12170 -11850
14904a1850k07K743J295k86l70M619j951k629L151P222J870r99J003k921p472
$$ -11850 -12057 -9314 -8019 -8305 -8675 -4056 -6007 -8636 -5485 1737 3607 2608 3611 690 -6782
14889f782l153J454M889J541m133k595j600L854J431J014L35L70K963J517J173
$$ -6782 -9935 -8481 -3592 -2051 -6184 -8779 -10379 -6525 -5094 -4080 -3745 -3375 -412 1105 2278
14874B278k436L239j4l708n269n691m603k191J860J091q34N773N803P306R89m417
$$ 2278 -158 3081 3067 -641 -5910 -11601 -16204 -18395 -16535 -15444 -16278 -10505 -4702 2604 3593 -824
14858h24j058J763j423l278L39o21J064K325l133k284k680j495k935l126K032
$$ -824 -1882 -119 -1542 -4820 -4481 -5102 -4038 -1713 -4846 -7130 -9810 -11305 -14240 -17366 -15334
14843a5334K79p04J509N668j794j929K707J612J826l159J891K162j698J344L552
$$ -15334 -15055 -15759 -14250 -8582 -10376 -12305 -9598 -7986 -6160 -9319 -7428 -5266 -6964 -5620 -2068
14828b068j64k634m086J442N45J162L290K271J766k323l65l961l847k366n04M522
$$ -2068 -2232 -4866 -8952 -7510 -6965 -5803 -2513 -242 1524 -799 -1164 -5125 -8972 -11338 -11842 -7320
14812g320K55l386k805j117O42J800M932M371J595j615L565j649k949m389J189
$$ -7320 -7065 -10451 -13256 -14373 -13731 -11931 -6999 -2628 -1033 -2648 917 -732 -3681 -8070 -6881
14797f881J184J879L769J130j641l776j586N26k701P87k499M22L226r01Q49k60
$$ -6881 -5697 -3818 -49 1081 -560 -4336 -5922 -5396 -8097 -7310 -9809 -9387 -6161 -7062 -6213 -6473
14781f473k573J228p25R33J15L002L525j751k979k497j500J565K31O41K129K045
$$ -6473 -9046 -7818 -8543 -7610 -7495 -4493 -968 -2719 -5698 -8195 -9695 -8130 -7899 -7258 -5129 -3084
14765c084J085n13m39k046n78K041L026j878k79j259q19O58R14k90M881K4l030
$$ -3084 -1999 -2512 -2951 -4997 -5575 -3534 -508 -2386 -2665 -3924 -4743 -4085 -3171 -3461 1420 1444 -1586
14748a586m935n92J404K410l857j228N873J523k30m88j895J972j71J806l4k126
$$ -1586 -6521 -7113 -5709 -3299 -7156 -8384 -2511 -988 -1218 -1706 -3601 -1629 -1800 6 -28 -2154
14732b154m732j069Q61j929q30k043m85R16j624k229Q46k411L882M146K501j053
$$ -2154 -6886 -7955 -7094 -9023 -9853 -11896 -12381 -11465 -13089 -15318 -14472 -16883 -13001 -8855 -6354 -7407
14716g407o5M651M700m711k210k294k493N96J040J085j187O78K678l536q00L171
$$ -7407 -7472 -2821 1879 -2832 -5042 -7336 -9829 -9233 -8193 -7108 -8295 -7617 -4939 -8475 -9275 -6104
14700f104R22n919k830O82K765L000P65n730K777M065j073m688L485K194k970
$$ -6104 -5182 -11101 -13931 -13249 -10484 -7484 -6719 -12449 -9672 -5607 -6680 -11368 -7883 -5689 -8659
14685h659j848L581J513l012N38J085k63k054q61k902M018L513m905j926K538
$$ -8659 -10507 -6926 -5413 -8425 -7887 -6802 -7065 -9119 -9980 -12882 -8864 -5351 -10256 -12182 -9644
14670i644j43O87K711P16l826l278j631q2k16M758L661r21j937j45k626n33O43
$$ -9644 -9787 -9100 -6389 -5673 -9499 -12777 -14408 -14490 -14706 -9948 -6287 -7208 -9145 -9290 -11916 -12449 -11806
14653a1806j888M057L508K874m26l476n64J168J411q5m879j939P44J97K950j081
$$ -11806 -13694 -9637 -6129 -3255 -3681 -7157 -7721 -6553 -5142 -5227 -10106 -12045 -11301 -11104 -8154 -9235
14637i235k029K021j11R59J333J647j914k82k571l137K159L903k087J495O37m326
$$ -9235 -11264 -9243 -9354 -8395 -7062 -5415 -7329 -7611 -10182 -13319 -11160 -7257 -9344 -7849 -7212 -11538
14621a1538N38j473k275O04P38L771J979L562k502N36J489O59k102k1k46L88J987
$$ -11538 -11000 -12473 -14748 -14144 -13406 -9635 -7656 -4094 -6596 -6060 -4571 -3912 -6014 -6035 -6281 -5893 -3906
14604c906J131l201P94J556m035k455j28j675k873m79L13L461K098o34L396K352
$$ -3906 -2775 -5976 -5182 -3626 -7661 -10116 -10244 -11919 -14792 -15271 -14958 -11497 -9399 -10033 -6637 -4285
14588d285n955j7L332K389J90o83l256j928N46J27r28j898K279L957K89N007N254
$$ -4285 -10240 -10257 -6925 -4536 -4346 -5029 -8285 -10213 -9667 -9540 -10468 -12366 -10087 -6130 -5841 -834 4420
14571D420k162m733k886j731K016n17l176L22k102j247N90K676K970J891m106
$$ 4420 2258 -2475 -5361 -7092 -5076 -5593 -8769 -8447 -10549 -11796 -11206 -8530 -5560 -3669 -7775
14556g775l130Q89J907j22o663k07J732j588J642J507N44L337L412j398o3j677
$$ -7775 -10905 -10016 -8109 -8231 -14894 -15101 -13369 -14957 -13315 -11808 -11264 -7927 -4515 -5913 -5976 -7653
14540g653rJ28M253J037j132j410l648j943l46L088k415j70L234J030m36n170
$$ -7653 -7662 -7534 -3281 -2244 -3376 -4786 -8434 -10377 -10723 -7635 -10050 -10220 -6986 -5956 -6392 -11562
14524a1562m78J406O36k393m045J308K653J403J13j741q82R95J984j686k918j88
$$ -11562 -12040 -10634 -9998 -12391 -16436 -15128 -12475 -11072 -10959 -12700 -13582 -12587 -10603 -12289 -15207 -15395
14508a5395n60p345Q36P307M307J108q01J417J282l09k554j350j411L322K750
$$ -15395 -15955 -23300 -22464 -15157 -10850 -9742 -10543 -9126 -7844 -8153 -10707 -12057 -13468 -10146 -7396
14493g396K38L263r14j732j789j384Q5j730n299J441L501K010N52J170M93n69
$$ -7396 -7158 -3895 -4809 -6541 -8330 -9714 -9629 -11359 -16658 -15217 -11716 -9706 -9154 -7984 -7491 -8060
14477h060k802J516J827J690L340k692m121K986J386L189M618P78k970l93j151
$$ -8060 -10862 -9346 -7519 -5829 -2489 -5181 -9302 -6316 -4930 -1741 2877 3655 685 292 -859
14462h59N338Q52m732n21K607K21m286j659o204l092j233L731J169k717j587l876
$$ -859 4479 5331 599 78 2685 2906 -1380 -3039 -9243 -12335 -13568 -9837 -8668 -11385 -12972 -16848
14446a6848K229L059j139J309L302L13j152o42K680j343q34m1j341n852J784K809
$$ -16848 -14619 -11560 -12699 -11390 -8088 -7775 -8927 -9569 -6889 -8232 -9066 -9107 -10448 -16300 -14516 -11707
14430a1707j049Q78K149R83o36k632K576L166m07K512K515k640O50m70l947R43
$$ -11707 -12756 -11878 -9729 -8746 -9382 -12014 -9438 -6272 -6679 -4167 -1652 -4292 -3642 -4112 -8059 -7116
14414g116L418l286l459m09p36l6O62mJ055J906j098p01L593P35L76k751m500
$$ -7116 -3698 -6984 -10443 -10852 -11588 -11624 -10962 -10966 -9911 -8005 -9103 -9804 -6211 -5476 -5100 -7851 -12351
14397a2351K082L275M361J102l152j799M566M29r44L992J799l639k998J710J982
$$ -12351 -10269 -6994 -2633 -1531 -4683 -6482 -1916 -1487 -2431 1561 3360 -279 -3277 -1567 415
14382D15K613l587r77K232J891J817K43n361l089j20k841j035K563K503n87m608
$$ 415 3028 -559 -1536 696 2587 4404 4647 -714 -3803 -3923 -6764 -7799 -5236 -2733 -3320 -7928
14366g928j180M678n8R33J741j076j621j595J530J789O53K43K15J600m94l665
$$ -7928 -9108 -4430 -4488 -3555 -1814 -2890 -4511 -6106 -4576 -2787 -2134 -1891 -1676 -76 -570 -4235
14350d235n659q65l812j816N37L76K250K512J912k451q43K429N491L132o616o551
$$ -4235 -9894 -10759 -14571 -16387 -15850 -15474 -13224 -10712 -8800 -11251 -12094 -9665 -4174 -1042 -7658 -14209
14334a4209r50K457O066K563L320j218j728k052K24k239L273m02r85J176k264
$$ -14209 -15159 -12702 -6636 -4073 -753 -1971 -3699 -5751 -5527 -7766 -4493 -4895 -5880 -4704 -6968
14319f968r89O94o80j747o483j681N484M360O5L234K022K131j415m063j317J474
$$ -6968 -7957 -7263 -7943 -9690 -16173 -17854 -12370 -8010 -7945 -4711 -2689 -558 -1973 -6036 -7353 -5879
14303e879l2k158L373m619J4J988k951k134p80J432M639M91l496k649J422N93
$$ -5879 -5911 -8069 -4696 -9315 -9301 -7313 -10264 -12398 -13178 -11746 -7107 -6616 -10112 -12761 -11339 -10746
14287a0746J048L9l514k69J841N020J431m13r05j328j574L340N51m021k037K291
$$ -10746 -9698 -9659 -13173 -13442 -11601 -6581 -5150 -5563 -6468 -7796 -9370 -6030 -5479 -9500 -11537 -9246
14271i246J165r29j126k096J139K611L745l897J295M68q31k61j243N1j108j651
$$ -9246 -8081 -9010 -10136 -12232 -11093 -8482 -4737 -8634 -7339 -6871 -7702 -7963 -9206 -9155 -10263 -11914
14255a1914R2M966M742j236N87Q23r77j883n807n345M472J983j482K009N198j020
$$ -11914 -11822 -6856 -2114 -3350 -2763 -1940 -2917 -4800 -10607 -15952 -11480 -9497 -10979 -8970 -3772 -4792
14239d792l417J420M327N89k316j501j730j410J574L917K205k767j972K425j793
$$ -4792 -8209 -6789 -2462 -1873 -4189 -5690 -7420 -8830 -7256 -3339 -1134 -3901 -5873 -3448 -5241
14224e241L387Q047N57l260j484L33J408k826k582j087K996P068N566P370O751
$$ -5241 -1854 6193 6750 3490 2006 2339 3747 921 -1661 -2748 248 7316 12882 20252 27003
14209B7003K920N330P062Q849N388M40N548L803K326J942j341l59k478r45j375
$$ 27003 29923 35253 42315 51164 56552 56992 62540 66343 68669 70611 69270 68911 66433 65488 64113
14194F4113j895m843m893n419o048j0396r719k384l12K03J522j508m98M53j545
$$ 64113 62218 57375 52482 47063 41015 30619 20900 18516 18204 18407 19929 18421 17923 18376 16831
14179A6831l444j413k070j017l087j776q45j865k337o721r78M747m90K065k431
$$ 16831 13387 11974 9904 8887 5800 4024 3179 1314 -1023 -7744 -8722 -3975 -4465 -2400 -4831
14164d831j769n85j935k72P040M55J584J08l684o67j316k148j583j170k108L819
$$ -4831 -6600 -7185 -9120 -9392 -2352 -1897 -313 -205 -3889 -4556 -5872 -8020 -9603 -10773 -12881 -9062
14148i062K775M82K25k727J435L077J383j825n714k274k007N02K57M40M63K101
$$ -9062 -6287 -5805 -5580 -8307 -6872 -3795 -2412 -4237 -9951 -12225 -14232 -13730 -13473 -13033 -12570 -10469
14132a0469J794r54k965m01K606L296j134j790K423M97k595K05K293L71k463j294
$$ -10469 -8675 -9629 -12594 -12995 -10389 -7093 -8227 -10017 -7594 -7097 -9692 -9487 -7194 -6823 -9286 -10580
14116a0580J812J450k354l234p34J34K088J934M853j360k577J138Q97K387n77
$$ -10580 -8768 -7318 -9672 -12906 -13640 -13506 -11418 -9484 -4631 -5991 -8568 -7430 -6533 -4146 -4723
14101d723K364J275J857K20p08o94J812j259j050j83k649j318J919j774n543n602
$$ -4723 -2359 -1084 773 993 285 -409 1403 144 -906 -1089 -3738 -5056 -3137 -4911 -10454 -16056
14085a6056Q96J975J549l68m200k257K295O417N969J631k875j988q89j9K6j84
$$ -16056 -15160 -13185 -11636 -12004 -16204 -18461 -16166 -9749 -3780 -2149 -5024 -7012 -7901 -7920 -7894 -8078
14069h078N505J761P49j121J431p0m014k059l430j090J05K23L824J373k144l806
$$ -8078 -2573 -812 -63 -1184 247 177 -3837 -5896 -9326 -10416 -10311 -10088 -6264 -4891 -7035 -10841
14053a0841j764L156L623J044J815J292l139m468L90K095l709R18M644K030k658
$$ -10841 -12605 -9449 -5826 -4782 -2967 -1675 -4814 -9282 -8892 -6797 -10506 -9588 -4944 -2914 -5572
14038e572p05M09k611J553k194l178K571k07m401j230m093l103l45M727M561R60
$$ -5572 -6277 -5868 -8479 -6926 -9120 -12298 -9727 -9934 -14335 -15565 -19658 -22761 -23106 -18379 -13818 -12858
14022a2858j386J0523L630k101j687k17J326j155n311K73N556L305q45l316l67
$$ -12858 -14244 -3721 -91 -2192 -3879 -4096 -2770 -3925 -9236 -8963 -3407 -102 -947 -4263 -4630
14007d630K308j094k568r01M39K910p32j589j774n039k479j106K177P996L657
$$ -4630 -2322 -3416 -5984 -6885 -6446 -3536 -4268 -5857 -7631 -12670 -15149 -16255 -14078 -6082 -2425
13992b425j805j820J947q79j501N12J615K844K751J538m533k358L49P323Q688
$$ -2425 -4230 -6050 -4103 -4982 -6483 -5971 -4356 -1512 1239 2777 -1756 -4114 -3765 3558 12246
13977A2246N081M081P886K233n200m359l506m826o094m72l885n548L604J144J331
$$ 12246 17327 21408 29294 31527 26327 21968 18462 13636 7542 7070 3185 -2363 1241 2385 3716
13962C716j410j02l227p62K572j540n108L048P066N901K793J651J143O383N560
$$ 3716 2306 2204 -1023 -1785 787 -753 -5861 -2813 4253 10154 12947 14598 15741 22124 27684
13947B7684N515J0633J8259J9614K9469N0354O6624P1063P7434Q0294P6866N8515
$$ 27684 33199 43832 62091 81705 111174 161528 228152 299215 376649 456943 533809 592324
13935E92324K4701M29k5547n8801p1486q1473q4485o8071n3838m5458l2706k1870
$$ 592324 617025 617454 591907 533106 461620 380147 295662 227591 173753 128295 95589 73719
13923G3719j2813n497j0219r795k571m249o196k517J267L044r92n415n938o674
$$ 73719 60906 55409 45190 35395 32824 28575 22379 19862 21129 24173 23181 17766 11828 5154
13909E154j520K873M385l739o170l854K380J188l948r45j171j491R82J156nK315
$$ 5154 3634 6507 10892 7153 983 -2871 -491 697 -3251 -4196 -5367 -6858 -5876 -4720 -4725 -2410
13893b410J197J058j671k60n42k737J984K568J693m44j395J121J094M15O032J431
$$ -2410 -1213 -155 -1826 -2086 -2628 -5365 -3381 -813 880 436 -959 162 1256 1671 7703 9134
13877I134j394l621n567m766k767j001n21m0M143L156M029P72j429m334l16j331
$$ 9134 7740 4119 -1448 -6214 -8981 -9982 -10503 -10543 -6400 -3244 785 1557 128 -4206 -4522 -5853
13861e853n31j49m467K072N044Q92m91N115J342o15j12M493L195K467P1M849K826
$$ -5853 -6384 -6533 -11000 -8928 -3884 -2992 -3483 1632 2974 2359 2247 6740 9935 12402 12473 17322 20148
13844B0148q83k882N062K922n12j238L054j884j855l243J143L596k647m198k536
$$ 20148 19265 16383 21445 24367 23855 22617 25671 23787 21932 18689 19832 23428 20781 16583 14047
13829A4047q64j276K193L562J965O720K835J487N511J763j587j918L21n683p15
$$ 14047 13183 11907 14100 17662 19627 26347 29182 30669 36180 37943 36356 34438 34759 29076 28361
13814B8361l023o485n436m337k946K498K453J911K9L824L983L153N095J782K112
$$ 28361 25338 18853 13417 9080 6134 8632 11085 12996 13025 16849 20832 23985 29080 30862 32974
13799C2974M109P87k998k094m316j272j630J975K032K105K512O634k455l829j159
$$ 32974 37083 37870 34872 32778 28462 27190 25560 27535 29567 31672 34184 40818 38363 34534 33375
13784C3375n737n241l935o126j589J487K760L278L491j858l949o711j830L43L29
$$ 33375 27638 22397 18462 12336 10747 12234 14994 18272 21763 19905 15956 9245 7415 7758 8087
13769H087k61k77o00J855K122m987l434j162L116J132K666L93j15J254L448o42
$$ 8087 7826 7549 6949 8804 10926 5939 2505 1343 4459 5591 8257 8650 8535 9789 13237 12595
13753A2595j918j138K139j4k552k081J14J712J592k84P38l44m878l395O381K415
$$ 12595 10677 9539 11678 11664 9112 7031 7145 8857 10449 10165 10903 10559 5681 2286 8667 11082
13737A1082J494q34J665L721L564p39m669o934k178M447J421l531o837j90J116
$$ 11082 12576 11742 13407 17128 20692 19953 15284 8350 6172 10619 12040 8509 1672 1482 2598
13722B598K279n06j651k6q60k181K920N570Q75l90k912J258J939M297M108L333
$$ 2598 4877 4371 2720 2694 1834 -347 2573 8143 9018 8628 5716 6974 8913 13210 17318 20651
13706B0651M960N660L436K083P312K130o21K050j439k275r0o31l873N07n320k521
$$ 20651 25611 31271 34707 36790 44102 46232 45611 47661 46222 43947 43857 43226 39353 39860 34540 32019
13690C2019J39m474m066k383n449p35k231j249j033L429L553Q5J672l221n831
$$ 32019 32158 27684 23618 21235 15786 15051 12820 11571 10538 13967 17520 17605 19277 16056 10225
13675A0225M308J458k025l408J230Q55o29J5j891k570P28oK810M487N761J161
$$ 10225 14533 15991 13966 10558 11788 12643 12014 12029 10138 7568 8296 8290 11100 15587 21348 22509
13659B2509K216J092j3j785M11R78M047M377O538L845J732N60K540N30q52j40
$$ 22509 24725 25817 25804 24019 24430 25408 29455 33832 40370 44215 45947 46507 49047 49577 48725 48585
13643D8585l80K410L478k575j291m144q04j077q56n504o485l010l044l196k861
$$ 48585 48205 50615 54093 51518 50227 46083 45279 44202 43346 37842 31357 28347 25303 22107 19246
13628A9246J833M34m100K614j287m862J086m81L17n566m249j267K190j278J918
$$ 19246 21079 21513 17413 20027 18740 13878 14964 14483 14800 9234 4985 3718 5908 4630 6548
13613F548M602M520j299k323J088K104K284M97P4o59j113j335l86J290K828M501
$$ 6548 11150 15670 14371 12048 13136 15240 17524 18021 18095 17436 16323 14988 14602 15892 18720 23221
13597B3221L323l12J405j367N75K30m89m730J46j44K503O47o752K322K725l64
$$ 23221 26544 26232 27637 26270 26845 27075 26586 21856 22002 21858 24361 25008 18256 20578 23303 22939
13581B2939M84M187L188M681M280p20k294m340l702n439l277j158m845k680J277
$$ 22939 23423 27610 30798 35479 39759 39039 36745 32405 28703 23264 19987 18829 13984 11304 12581
13566A2581R8k073J073J827k895j505n532m793k097M284M158P32K455M093l35
$$ 12581 12679 10606 11679 13506 10611 9106 3574 -1219 -3316 968 5126 5858 8313 12406 12071
13551A2071k143J702M086P036L958r10j618j586J7m587q923k383J15j403k564
$$ 12071 9928 11630 15716 22752 26710 25800 24182 22596 22613 18026 9103 6720 6835 5432 2868
13536B868j336K418m808m727K504M186p25m42N45m09j241k021J432K305K975P86
$$ 2868 1532 3950 -858 -5585 -3081 1105 380 -62 483 74 -1167 -3188 -1756 549 3524 4310
13520D310K17L456L314K854O822N640P99R76k595l860j629q004o631m085j551
$$ 4310 4527 7983 11297 14151 20973 26613 27412 28388 25793 21933 20304 12300 5669 1584 33
13505C3P2K297q64K729J732Q1m51r19m264l646l399j183K129L284L620j159L92
$$ 33 105 2402 1538 4267 5999 6080 5629 4710 446 -3200 -6599 -7782 -5653 -2369 1251 92 484
13488D84l828n14N6R38p32M138k063Q16k23J367J281l441q93J993P52l716O23
$$ 484 -3344 -3858 -3802 -2864 -3596 542 -1521 -705 -928 439 1720 -1721 -2614 -621 131 -3585 -2962
13471b962O448O236O468J147m19L287R54P97J395k392k481j266j545k997m204
$$ -2962 3486 9722 16190 17337 16918 20205 21159 21956 23351 20959 18478 17212 15667 12670 8466
13456H466k620n506J327J146M378k302l006j476n35p74l09J177j44j972L088K089
$$ 8466 5846 340 1667 2813 7191 4889 1883 407 -128 -902 -1211 -34 -178 -2150 938 3027
13440C027J49O34J629m401m204J35j953m705n21L178L654o21K99M12J143K535
$$ 3027 3176 3810 5439 1038 -3166 -3031 -4984 -9689 -10210 -7032 -3378 -3999 -3700 -3288 -2145 390
13424C90l108j000k381l925K322L171J966j555j560L793K042m55l995n240m54
$$ 390 -2718 -3718 -6099 -10024 -7702 -4531 -2565 -4120 -5680 -1887 155 -300 -4295 -9535 -9989
13409i989K713J3q04K310j574J571K679R33M97r66K448k554k718j07p90k058R90
$$ -9989 -7276 -7263 -8067 -5757 -7331 -5760 -3081 -2148 -1651 -2617 -169 -2723 -5441 -5548 -6338 -8396 -7406
13392g406k05m134r0L04J14K191L854N506K683J529k046k236l404k952K832M081
$$ -7406 -7611 -11745 -11835 -11531 -11417 -9226 -5372 134 2817 4346 2300 64 -3340 -6292 -3460 621
13376F21m7j953J015K763J579r51M961N776K958j832n506n380o232l838J143M214
$$ 621 574 -1379 -364 2399 3978 3027 7988 13764 16722 14890 9384 4004 -2228 -6066 -4923 -709
13360g09M081O30L554l92p1K504O69k456J837j624k909n008M18K335k317O9o09
$$ -709 3372 4002 7556 7164 7093 9597 10266 7810 9647 8023 5114 106 524 2859 542 611 2
13343Bj518o83k729K821L639j244k44K945j229k810r22l067L714J476J05L527
$$ 2 -1516 -2199 -4928 -2107 1532 288 44 2989 1760 -1050 -1972 -5039 -1325 151 256 3783
13327C783q36l068k025m989k305K12L641J554K362K875K926J693N92m522m181
$$ 3783 2947 -121 -2146 -7135 -9440 -9228 -5587 -4033 -1671 1204 4130 5823 6415 1893 -2288
13312b288j424J526J355K955j607M542o70r17K543n069l351M35j98j763k952j454
$$ -2288 -3712 -2186 -831 2124 517 5059 4389 3472 6015 946 -2405 -1970 -2168 -3931 -6883 -8337
13296h337M119L558K95n90k236j384J030L098n39K389J310j307N94N98k165M012
$$ -8337 -4218 -660 -365 -955 -3191 -4575 -3545 -447 -986 1403 2713 1406 2000 2598 433 4445
13280D445L746n270m334M495L168J124l168j949J841K684K910M902M919N430L77
$$ 4445 8191 2921 -1413 3082 6250 7374 4206 2257 4098 6782 9692 14594 19513 24943 25320
13265B5320K851M54j489n633n553j615m698k825p336l842l950k067N996N908L276
$$ 25320 28171 28625 27136 21503 15950 14335 9637 6812 -524 -4366 -8316 -10383 -4387 1521 4797
13250D797k740j142j600j241L015m2l294p61K264K606O03j02k510j015K165M911
$$ 4797 2057 915 -685 -1926 1089 1047 -2247 -3008 -744 1862 2465 2363 -147 -1162 1003 5914
13234E914N367J0292J4307K2118L0813K5336N239j9549k8384k4420j7167j0822
$$ 5914 11281 21573 35880 57998 88811 114147 119386 99837 71453 47033 29866 19044
13222A9044m853J09m68O27l259k531k011p09l140k064m63R64l93J3j931j856K192
$$ 19044 14191 14300 13832 14459 11200 8669 6658 5949 2809 745 282 1246 853 866 -1065 -2921 -729
13205g29J998j109P94j736n38Q63K080j972N566K628M390O230K229K237J475P383
$$ -729 1269 160 954 -782 -1320 -457 1623 -349 5217 7845 12235 18465 20694 22931 24406 31789
13189C1789J1747J9012L5640N8089Q9684R1502L9135k9937p6523q8272o3156l5399
$$ 31789 43536 62548 98188 156277 245961 337463 376598 346661 270138 181866 118710 83311
13177H3311k1958j2442q138r955n615q9J055l587K352l17J98J495l207j513L1
$$ 83311 61353 48911 40773 30818 25203 25114 26169 22582 24934 24617 24815 26310 23103 21590 21621
13162B1621m440j532K005j254l73J532K063j885N03j654J21M494J954M561n91
$$ 21621 17181 15649 17654 16400 16027 17559 19622 17737 18240 16586 16707 21201 23155 27716 27125
13147B7125k200L38P680J2795J6900L5643N9990Q9816R3833N3235j6379p7957
$$ 27125 24925 25263 32943 45738 62638 98281 158271 248087 341920 395155 378776 300819
13135C00819r5736p4125m6925k4169j2317n965o611m829n255J633K52n152j226
$$ 300819 205083 130958 84033 59864 47547 41582 34971 30142 24887 26520 26772 21620 20394
13122B0394Qk329k694l050n424J222j653k067j915K810l934J358Q704O129j634
$$ 20394 20402 18073 15379 12329 6905 8127 6474 4407 2492 5302 1368 2726 11430 17559 15925
13107A5925M10K434l820m256l398J663M392n17M653L853J3469J9724K4597L2203
$$ 15925 16335 18769 14949 10693 7295 8958 13350 12833 17486 21339 34808 54532 79129 111332
13093A11332K0099m603j8335k9030k4203j4829o677l508m925l135m686j115j800
$$ 111332 131431 126828 108493 79463 55260 40431 33754 30246 25321 22186 17500 16385 14585
13080A4585k708m090k566K286m582o09L307N45L199O956J810k870l773q69L802
$$ 14585 11877 7787 5221 7507 2925 2316 5623 6168 9367 16323 18133 15263 11490 10621 14423
13065A4423j078l091k215j74q2K539R47j935k377N432K690O82J410K189N36R65
$$ 14423 13345 10254 8039 7865 7783 10322 11269 9334 6957 12389 15079 15761 17171 19360 19896 20861
13049B0861k755q696l634K249j82n47k166J050j477l361q28J021N586n58r54L11
$$ 20861 18106 9410 5776 8025 7843 7296 5130 6180 4703 1342 514 1535 7121 6563 5609 5920
13033E920J203L522n23J903l112m85Kj507Q60Q39O45N739k60m084l415l0j124
$$ 5920 7123 10645 10122 12025 8913 8428 8430 6923 7783 8622 9267 15006 14746 10662 7247 7217 6093
13016F093j665k667q83k234J538q6K486O109J002J933J836K280l15J706l48o475
$$ 6093 4428 1761 878 -1356 182 96 2582 8691 9693 11626 13462 15742 15427 17133 16785 10310
13000A0310k01j160j007j795J83K011Q74M42n52k187l124L387k045r05k002M49
$$ 10310 10109 8949 7942 6147 6330 8341 9215 9657 9105 6918 3794 7181 5136 4231 2229 2678
12984B678K630m98j539j251j10m29P93l32l5O05n515l942J229J71j410k120l567
$$ 2678 5308 4810 3271 2020 1910 1481 2274 1942 1907 2512 -3003 -6945 -5716 -5545 -6955 -9075 -12642
12967a2642n684O64M871m54k382K453P823l9O51K485L247k598q45O86L645J478
$$ -12642 -18326 -17662 -12791 -13245 -15627 -13174 -5351 -5390 -4739 -2254 993 -1605 -2450 -1764 1881 3359
12951C359n69j312M625N527L518J359K922L511K888N554Q107P454N948N241M122
$$ 3359 2790 1478 6103 11630 15148 16507 19429 22940 25828 31382 39489 46943 52891 58132 62254
12936F2254N051Q329Q003J4993J8015K6180L2107M2484N5403O8440Q0385Q6968
$$ 62254 67305 75634 83637 98630 116645 142825 174932 217416 272819 341259 421644 508612
12924E08612P7440N9782L5042Q589k0689m4308o4558p7052p8993p6405o3392m8698
$$ 508612 586052 645834 680876 689465 668776 624468 559910 482858 403865 327460 264068 215370
12912B15370m0009l2557k4824j2023j1076o769m117q117o363n096l224m740o672
$$ 215370 175361 142804 117980 105957 94881 88112 83995 75878 69515 64419 61195 56455 49783
12899D9783m868l364k41J61J046L67j995k674j515k827N62N52j26J995j13K387
$$ 49783 44915 41551 41310 41471 42517 42884 40889 38215 36700 33873 34435 34987 34861 36856 36743 39130
12883C9130l083k124j94L800M98n170j955j274J506K664k669j501K275L163j807
$$ 39130 36047 33923 33729 37529 38027 32857 30902 29628 31134 33798 31129 29628 31903 35066 33259
12868C3259j246k322m949m1M903L753l638r261m165j790J853M150K046J345K283
$$ 33259 32013 29691 24742 24701 29604 33357 29719 20458 16293 14503 16356 20506 22552 23897 26180
12853B6180J704q31L523j972l738M030P148M72L986O90p190n27L816L774j012
$$ 26180 27884 27053 30576 28604 24866 28896 36044 36516 40502 41192 34002 33475 37291 41065 40053
12838D0053J88k073n794l461K226Q861O547O553N222q62l649q131o501m454l662
$$ 40053 40241 38168 32374 28913 31139 40000 46547 53100 58322 57460 53811 45680 39179 34725 31063
12823C1063l265l254j49K764J733J868P67j240j634l535p18l289K676M38j266
$$ 31063 27798 24544 24395 27159 28892 30760 31527 30287 28653 25118 24400 21111 23787 24225 22959
12808B2959Rj156k152K80J720n94l175R35j357P83j257P74L909J235K092k467
$$ 22959 22968 21812 19660 19940 21660 21066 17891 18826 17469 18252 16995 17769 21678 22913 25005 22538
12792B2538J59L794J728J025j238J590K496K666k118p372L549M218L197O056j139
$$ 22538 22697 26491 28219 29244 28006 29596 32092 34758 32640 25268 28817 33035 36232 42288 41149
12777D1149k628J490O43J452J786K369M420K672k76k912R29O272M123N059K855
$$ 41149 38521 40011 40654 42106 43892 46261 50681 53353 53077 50165 51094 57366 61489 66548 69403
12762F9403M502J0277J1243N223L647R029N418N398q86o025n306m126n198k797
$$ 69403 73905 84182 95425 100648 104295 113324 118742 124140 123254 117229 111923 107797 102599 99802
12748I9802n715j0379p663l111k930P06P54m176n394m49N330M186J672O00J044
$$ 99802 94087 83708 76045 72934 70004 70710 71464 67288 61894 61445 66775 70961 72633 73233 74277
12733G4277K273l88k639l286o958n855j369n90l971n628P80K412K783K291m56
$$ 74277 76550 76162 73523 70237 63279 57424 56055 55465 51494 45866 46646 49058 51841 54132 53676
12718E3676p29N636N771M443P218N122M664Q39N066N398M941j88L731K901k727
$$ 53676 52947 58583 64354 68797 76015 81137 85801 86640 91706 97104 102045 101857 105588 108489 105762
12703A05762J18L050j351m709n193k646n794q698r052l587p569m477K312K695
$$ 105762 105880 108930 107579 102870 97677 95031 89237 80539 71487 67900 60331 55854 58166 60861
12689F0861L57M313N649N346J1982J8131J5093J2299J4514J8939J4998J8887K4419
$$ 60861 61218 65531 71180 76526 88508 106639 121732 134031 148545 167484 182482 201369 225788
12676B25788K4731L4912M9611O8564Q7428J27803J68609J97755K15265K21563
$$ 225788 250519 285431 335042 403606 491034 618837 787446 985201 1200466 1422029
12666A422029K00672J58078J03233L0782m8195j14051j61039j85469j94297j90286
$$ 1422029 1622701 1780779 1884012 1914794 1866599 1752548 1591509 1406040 1211743 1021457
12656A021457j65586j32671r9290o2108m1911k8053j5740m618L995J4988K3055
$$ 1021457 855871 723200 623910 561802 519891 491838 476098 471480 475475 490463 513518
12645E13518K5938L8659N6171P8048J04662J58598K33198L07599L71614M14413
$$ 513518 539456 578115 634286 712334 816996 975594 1208792 1516391 1888005 2302418
12635B302418M19007L82109K93985J68019K0764j28730k56428l52968l97620m04450
$$ 2302418 2721425 3103534 3397519 3565538 3586302 3457572 3201144 2848176 2450556 2046106
12625B046106l73316l15377k42984j85484j37462j04114p6010n2321l7493l3890
$$ 2046106 1672790 1357413 1114429 928945 791483 687369 611359 559038 521545 487655
12615D87655l8783l5606k7269j9644k0985j8653j2785j1566j3442l783j175J704
$$ 487655 448872 413266 385997 366353 345368 326715 313930 302364 288922 285139 283964 285668
12603B85668J646k288m845r548j2400p818J92O040L750JJ782j929K210O677J1833
$$ 285668 287314 285026 280181 270633 258233 250415 250607 256647 260397 260398 262180 260251 262461 269138 280971
12588B80971R784L631O38m82M322K450M010O873O193L406M583L06M03Q239J2515
$$ 280971 290755 294386 295024 294542 298864 301314 305324 312197 318390 321796 326379 326685 327088 335327 347842
12573C47842Q461P471J2788J7697K1352J8508J9935K0914K1766K1866J6137J6210
$$ 347842 356303 363774 376562 394259 415611 434119 454054 474968 496734 518600 534737 550947
12561E50947N893K453J478k663m095M303J5430J9844J9183K5894L3118K8555L3529
$$ 550947 556840 559293 560771 558108 554013 558316 573746 593590 612773 638667 671785 700340 733869
12548G33869L2903K9837L2421L7033L2064K9705L1596M3358N2708N3631N9977
$$ 733869 766772 796609 829030 866063 898127 927832 959428 1002786 1055494 1109125 1169102
12537A169102O9604Q2719R6813J11525J22933J39342J52868J73605J90850K13378
$$ 1169102 1238706 1321425 1418238 1529763 1652696 1792038 1944906 2118511 2309361 2522739
12527B522739K46084K99851L73189M59162N64262O82743Q05158R26365J036311
$$ 2522739 2768823 3068674 3441863 3901025 4465287 5148030 5953188 6879553 7915864
12518G915864J135673J248787J400311J646958K055399K737516L818360N471925
$$ 7915864 9051537 10300324 11700635 13347593 15402992 18140508 21958868 27430793
12510B7430793P755942J0462385J3024540J4861376J5512162J4651199J2100050
$$ 27430793 35186735 45649120 58673660 73535036 89047198 103698397 115798447
12503A15798447Q001961K819774k722735p843497j1811395j4216421j5028133
$$ 115798447 123800408 126620182 123897447 116053950 104242555 90026134 74998001
12496G4998001j4408320j2619785j0164044p628932n482531l901866k826348k132766
$$ 74998001 60589681 47969896 37805852 30176920 24694389 20792523 17966175 15833409
12488A5833409j698726j429901j271001j167538j083120r98248r05203q08267
$$ 15833409 14134683 12704782 11433781 10266243 9183123 8184875 7279672 6471405
12480F471405o93240n86779m96180m19526l57280l10155k66422k33413k15057
$$ 6471405 5778165 5191386 4695206 4275680 3918400 3608245 3341823 3108410 2893353
12471B893353k01080j85049j68730j59161j38731j31549j28724j22933j09534
$$ 2893353 2692273 2507224 2338494 2179333 2040602 1909053 1780329 1657396 1547862
12462A547862j05671r4484p9307p2219o3887n5849m5698l7253l5722k8759k3892
$$ 1547862 1442191 1347707 1268400 1196181 1132294 1076445 1030747 993494 957772 929013 905121
12451I05121k0726k5902k5396k8212l0921k9511k8467k8076j9094j9465j8463
$$ 905121 884395 858493 833097 804885 773964 744453 715986 687910 668816 649351 630888
12440F30888j7522j8583j7134j4502j4396j9367j8550j5625j3905j5493j2661
$$ 630888 613366 594783 577649 563147 548751 529384 510834 495209 481304 465811 453150
12429D53150j1405j2207q551p151j056l980j0034o105n81m161m937N06p215j0216
$$ 453150 441745 429538 420987 413836 412780 408800 398766 392661 392080 387919 382982 383488 376273 366057
12415C66057j4516j4586j3720j2168j0016j1160j0997r499r346r187q441o828
$$ 366057 351541 336955 323235 311067 301051 289891 278894 269395 260049 250862 242421 235593
12403B35593n567o332l932l632p03n49n918m143l268k423R40k626q988p612k818
$$ 235593 230026 223694 219762 216130 215427 214878 208960 204817 201549 199126 200066 197440 188452 180840 178022
12388A78022n075j690n570o493j2151j2484j1732j2578j6295j8123j3081o193
$$ 178022 172947 171257 165687 159194 147043 134559 122827 110249 93954 75831 62750 56557
12376E6557J364J630J0765J6655J8024J3640J5328J4156O599N457M570Q78n81
$$ 56557 57921 59551 70316 86971 104995 118635 133963 148119 154718 160175 164745 165623 165042
12363A65042m103k553m578L53k407l528k75n60m392l476j796L110K834K905J921
$$ 165042 160939 158386 153808 154161 151754 148226 147951 147391 142999 139523 137727 140837 143671 146576 148497
12348A48497L861N402M365M731L721P22k504n244m161k944J282K414M619P025
$$ 148497 152358 157760 162125 166856 170577 171299 168795 163551 159390 156446 157728 160142 164761 171786
12334A71786P749J0649J2766J3961J2997J6186Q140K166k587L555O180J4074J8941
$$ 171786 179535 190184 202950 216911 229908 246094 254234 256400 253813 257368 263548 277622 296563
12321B96563K6531K6819J7429R307q253j2838j9624k0574j9666j4317o748k246
$$ 296563 323094 349913 367342 376649 368396 355558 335934 315360 295694 281377 274629 272383
12309B72383P82J929J1271R721J0618Q555J4354R440j586q296j5875j4452k0091
$$ 272383 273165 275094 286365 296086 306704 315259 329613 339053 337467 329171 313296 298844 278753
12296B78753k5273k2931k0121j2721p801k950R09N813P645P690R513J2722J8985
$$ 278753 253480 230549 210428 197707 189906 186956 187865 193678 201323 209013 218526 231248 250233
12283B50233L4142M5812O0895P4599Q4456P7689N1371J5445k9906o9793p9246
$$ 250233 284375 330187 391082 465681 550137 627826 679197 694642 664736 594943 515697
12272E15697p7583o3692m3233k7030k2668j4449q373j624j394m280k234k520Q58
$$ 515697 438114 374422 331189 304159 281491 267042 258669 257045 255651 251371 249137 246617 247475
12259B47475K74o989k941l775r995j0899j0144j0642o061j726K064L321K770L096
$$ 247475 247749 240760 237819 234044 224049 213150 203006 192364 186303 184577 186641 189962 192732 195828
12245A95828J724k972l830L211N572R509K0243K3584K1754K0958J4144m345j7644
$$ 195828 197552 194580 190750 193961 199533 209042 229285 252869 274623 295581 309725 305380 287736
12232B87736k4489k9018k7773k1736j6861j4167j0650o929k682p01m449m187o64
$$ 287736 263247 234229 206456 184720 167859 153692 143042 136113 133431 132730 128281 124094 123430
12219A23430l720L235K396j332m118l019n46K166K509k053o75M70K021J376Q85
$$ 123430 119710 122945 125341 124009 119891 116872 116326 118492 121001 118948 118273 118743 120764 122140 123025
12204A23025j191k416m284O61L178J231L015P190L719O633N044J1256Q989J0828
$$ 123025 121834 119418 115134 115795 118973 120204 123219 130409 134128 140761 145805 157061 166050 176878
12190A76878R984J3882J7429K1712K5849L6108M9885O7622Q4018R8569J21447
$$ 176878 186862 200744 218173 239885 265734 301842 351727 419349 503367 601936 723383
12179G23383J32659J23517J12776Q7627N3378J4787l1810p3626j04628j24165
$$ 723383 856042 979559 1092335 1179962 1233340 1248127 1216317 1142691 1038063 913898
12169I13898j23101j21245j09588r0723p2213n7749m1080l0780k3013k5588j5009
$$ 913898 790797 669552 559964 469241 397028 339279 298199 267419 244406 218818 203809
12158B03809j1609j2086j2339q808n720l404n812k146k472n91j344M92N611L642
$$ 203809 192200 180114 167775 158967 153247 149843 144031 141885 139413 138822 137478 137970 143581 147223
12144A47223M236P025O927q95k137j51k901m240r537p269L21m228q004j1488j1195
$$ 147223 151459 158484 165411 164516 162379 162228 159327 155087 145550 138281 138602 134374 126370 114882 103687
12129A03687q646l096K877K113M25K02j115L837N302L458J020K985M947N346N980
$$ 103687 95041 91945 94822 96935 97360 97562 96447 100284 105586 109044 110064 113049 117996 123342 129322
12114A29322M500M4K539J0125J2076J3531R257N596J1331Q590O079R766O691J1168
$$ 129322 133822 133866 136405 146530 158606 172137 181394 186990 198321 206911 212990 222756 229447 240615
12100B40615J1868J9013K3235K4181K2860J9580J0148L100j754l114q132j3395
$$ 240615 252483 271496 294731 318912 341772 361352 371500 374600 372846 369732 361600 348205
12088C48205j4277l843J0874K1384L6902N2873O3692P5287P8262P0733M6546J9722
$$ 348205 333928 330085 340959 362343 399245 452118 515810 591097 669359 740092 786638 806360
12076H06360n515l2498n4077p2675q0586p7249p5527p1151n2488l4463k6550k0491
$$ 806360 800845 768347 714270 641595 561009 483760 408233 337082 284594 250131 223581 203090
12064B03090j7094p638o782n806l735m422m733j0941q024l599K075j415R33K980
$$ 203090 185996 178358 171576 165770 162035 157613 152880 141939 133915 130316 132391 130976 131909 134889
12050A34889K805Q10L005j290R00J00j518J140J338L020P017O169L451k010r45
$$ 134889 137694 138504 141509 140219 141119 141219 139701 140841 142179 145199 152216 158385 161836 159826 158881
12035A58881l090r140o572r516m537n253j0870n505m408l519K859K577r64N876
$$ 158881 155791 146651 140079 130563 126026 120773 109903 104398 99990 96471 99330 101907 100943 106819
12021A06819L481O362P952M813P05L30j653l50L224J1838J5785J5937J4710P076
$$ 106819 110300 116662 124614 129427 130132 130462 128809 128459 131683 143521 159306 175243 189953 197029
12007A97029K388R05j804l618p713n847Q41M644P467P772Q298J0846Q774R012
$$ 197029 199417 200322 198518 194900 187187 181340 182181 186825 194292 202064 210362 221208 229982 238994
11993B38994K400N557K918J459N029L783N458L637Q496J1312R833P904J1194P852
$$ 238994 241394 246951 249869 251328 256357 260140 265598 269235 277731 289043 298876 306780 317974 325826
11979C25826Q701R178P514J4246J6620R794K274J1768J5031J9777K4624K1691
$$ 325826 334527 343705 351219 365465 382085 391879 394153 405921 420952 440729 465353 487044
11967D87044K1222J9302J4761J1349J6254K6372L4904N2986O4782P6330O9108
$$ 487044 508266 527568 542329 553678 569932 596304 631208 684194 748976 825306 894414
11956H94414N2706K5655O868j7627l0224k8547k1513j5624j2385p351n308l914
$$ 894414 947120 972775 979643 962016 931792 903245 881732 866108 853723 846372 841064 837150
11944H37150K59R591K0624L8376M8412M9160L9982K2610K267j0903j8872l1499
$$ 837150 837409 847000 867624 906000 954412 1003572 1043554 1066164 1068431 1057528 1038656 1007157
11932A007157l1758k8946k2017j3818j157M502J2622J9310L3157M7805O4218Q3459
$$ 1007157 975399 946453 924436 910618 909461 913963 926585 945895 979052 1026857 1091075 1174534
11920A174534J12244J43439J67397J81251J76367J59930J38409J14698R9869J04320
$$ 1174534 1286778 1430217 1597614 1778865 1955232 2115162 2253571 2368269 2468138 2572458
11910B572458J24920J66406K20846K73316L10492L19912K89215K33723J76804
$$ 2572458 2697378 2863784 3084630 3357946 3668438 3988350 4277565 4511288 4688092
11901D688092J27310R4894Q3713R9380J37157K15688L21920M22620N17104O36984
$$ 4688092 4815402 4910296 4994009 5093389 5230546 5446234 5768154 6190774 6707878 7344862
11891G344862Q24134J142703J677346K493818L597538M901385O151043O800626
$$ 7344862 8168996 9311699 10989045 13482863 17080401 21981786 28132829 34933455
11883C4933455O116304L715653J40373l266918n258616n456681m390438k937101
$$ 34933455 41049759 44765412 44905785 41638867 36380251 30923570 26533132 23596031
11875B3596031j714447q89361l64413L1453M27815Q63714J259613J469462J366647
$$ 23596031 21881584 20992223 20627810 20659263 21087078 21950792 23210405 24679867 26046514
11866B6046514R67241M50978P9742p624J44915M34711P87799J166176J487742
$$ 26046514 27013755 27464733 27544475 27536851 27681766 28116477 28904276 30070452 31558194
11857C1558194J572821J264620O10863j02900n76914o62211l72061J58524P94382
$$ 31558194 33131015 34395635 35006498 34903598 34326684 33664473 33292412 33450936 34245318
11848C4245318J524164K500078M009398O396557R846070J3910575J6974883J6579003
$$ 34245318 35769482 38269560 42278958 48675515 58521585 72432160 89407043 105986046
11840A05986046J1150003J827943p901999j4419725j6221613j4312437j0840443
$$ 105986046 117136049 118963992 111061993 96642268 80420655 66108218 55267775
11833E5267775p523355n032259l287688j983536q82354N3947O71542Q00389L60634
$$ 55267775 47744420 42712161 39424473 37440937 36558583 36612530 37284072 38084461 38445095
11824C8445095m82920j335422j819776j821925j493649j065580o61848l20542
$$ 38445095 37962175 36626753 34806977 32985052 31491403 30425823 29763975 29443433
11816B9443433q0882m5873k87730p36913j188375j411588j323434r93384n64619
$$ 29443433 29362551 29316678 29028948 28292035 27103660 25692072 24368638 23375254 22810635
11807B2810635j69568J67818N44251J116856K091078L531890N158480O182781
$$ 22810635 22641067 22808885 23353136 24469992 26561070 30092960 35251440 41434221
11799D1434221N605090L020640q46073m537261o781199p235622o403081n028798
$$ 41434221 47039311 50059951 49213878 44676617 37895418 30659796 24256715 19227917
11791A9227917l652531k547929j753003j215832q71561o50089n06301l96973l05890
$$ 19227917 15575386 13027457 11274454 10058622 9187061 8536972 8030671 7633698 7327808
11782G327808k21869j57652j17312j15534j45550j94986k66447l34683l83432
$$ 7327808 7105939 6948287 6830975 6715441 6569891 6374905 6108458 5773775 5390343
11773E390343m02459l79959l32496k73176k10478j71348j57910j65833j92296
$$ 5390343 4987884 4607925 4275429 4002253 3791775 3620427 3462517 3296684 3104388
11764C104388k20723k34812k39903k26866k04670j70070j41799j11050q5365o5613
$$ 3104388 2883665 2648853 2408950 2182084 1977414 1807344 1665545 1554495 1469130 1403517
11754A403517m9962l7156k1286k490O720J3040K4579K9851L9517L3906K1517P209
$$ 1403517 1353555 1316399 1295113 1292623 1299343 1312383 1336962 1366813 1406330 1440236 1461753 1468962
11742A468962q527l2792n4862o1309o4319n2230l3444j9511q772l132j1368q32
$$ 1468962 1460435 1427643 1372781 1311472 1247153 1194923 1161479 1141968 1133196 1130064 1118696 1117864
11730A117864J8537L7984N1638N3215L2770O393k6789n4347p4250r2657j05565
$$ 1117864 1136401 1174385 1226023 1279238 1312008 1318401 1291612 1237265 1163015 1070358 964793
11719I64793j08809r9186q7698p2908n4140l8371k1681o962M928J4315J3369J3885
$$ 964793 855984 756798 669100 596192 542052 503681 482000 475038 479966 494281 507650 521535
11707E21535P987K570p553j7022j8240j7163j7291j5604j4719j4104j7064j2035
$$ 521535 529522 532092 524539 507517 489277 472114 454823 439219 424500 410396 393332 381297
11695C81297j4305j4245j3239j3233j4776m976m032l36L644j12o195o602j1385
$$ 381297 366992 352747 339508 326275 311499 306523 302491 302155 305799 305687 299492 292890 281505
11682B81505r129p464q660j1738r245j2803j1134j1335r577j1909o421K225J998
$$ 281505 272376 264912 256252 244514 235269 222466 211332 199997 190420 178511 172090 174315 176313
11669A76313L267P648P181M910J459k721j471j217J652J542l319j729N796P288
$$ 176313 179580 187228 194409 199319 200778 198057 196586 195369 197021 198563 195244 193515 199311 206599
11655B06599L428j705j305p61m304l578m882l907r266m024p556j0880j2534m332
$$ 206599 210027 208322 207017 206256 201952 198374 193492 189585 180319 176295 168739 157859 145325 140993
11641A40993j06J007k488m451p01j811n480m3L6N71j946j218J939j634L415L120
$$ 140993 140887 141894 139406 134955 134254 132443 126963 126920 126956 127527 125581 124363 126302 124668 128083 131203
11625A31203J168j917m205L309n334o492O95K609K467k612k181k160k643n501
$$ 131203 132371 130454 126249 129558 124224 117732 118427 121036 123503 120891 118710 116550 113907 108406
11611A08406m272k268l605l441O81j50o35Q51J215J518j584l620m907j15J212
$$ 108406 104134 101866 98261 94820 95501 95351 94716 95567 96782 98300 96716 93096 88189 88074 89286
11596H9286K451J537L767Q49J469L560K433M699M054K833j949l020J391j440m686
$$ 89286 91737 93274 97041 97890 99359 102919 105352 110051 114105 116938 114989 111969 113360 111920 107234
11581A07234j340j369m056j543o586p14K393m689n176n091m651k879m150l824
$$ 107234 105894 104525 100469 98926 92340 91626 94019 89330 84154 79063 74412 71533 67383 63559
11567F3559K195J063K605O809M892J362k548n02m16K499K686P87k932M474R178
$$ 63559 65754 66817 69422 76231 81123 82485 79937 79435 79019 81518 84204 84991 82059 86533 95711
11552I5711j950k663J395M945r88K632K31L43n853j345N8m593m241k134m342O57
$$ 95711 93761 91098 92493 97438 96450 99082 99313 99656 93803 92458 92516 87923 83682 81548 77206 77863
11536G7863L413m6j225l083L476j730o265l805l894J942N14N126K914m94N23K193
$$ 77863 81276 81230 80005 76922 80398 78668 72403 68598 64704 66646 67160 72286 75200 74706 75229 77422
11520G7422R90k520m684O82k467n227l476j922J408j2L24M282L015m39l455r54
$$ 77422 78412 75892 71208 71890 69423 64196 60720 58798 60206 60194 60518 64800 67815 67376 63921 62967
11504F2967J457k654J08j063k481m245k461j592K348Q61j286j450j652q01L739
$$ 62967 64424 61770 61878 60815 58334 54089 51628 50036 52384 53245 51959 50509 48857 48056 51795
11489E1795L778M83N203J531K322L77O674M436M9K690q06k973k154p200j428Q09
$$ 51795 55573 56056 61259 62790 65112 65489 72163 76599 76648 79338 78532 75559 73405 66205 64777 65586
11473F5586m426j654m019k805j444J783K580N8m533N163L170K975L571J538m147
$$ 65586 61160 59506 55487 52682 51238 53021 55601 55659 51126 56289 59459 62434 66005 67543 63396
11458F3396m779L60K043J521N909M905K461N405O348P076O608J1710J0620J2795
$$ 63396 58617 58977 61020 62541 68450 73355 75816 81221 87569 94645 101253 112963 123583 136378
11444A36378J8982J4520J5924K4504K4661J5658J5826R915p273k1150k5107k4918
$$ 136378 155360 169880 185804 210308 234969 250627 266453 276368 269095 247945 222838 197920
11432A97920j8435o455j003m361m137k15J056l612n048j359K439M94M693J0044
$$ 197920 179485 173030 172027 167666 163529 163314 164370 160758 155710 154351 156790 157284 161977 172021
11418A72021Q143J3581J1126M270J052N016M676K569L686M638K128l49L132K202
$$ 172021 180164 193745 204871 209141 210193 215209 219885 222454 226140 230778 232906 232557 235689 237891
11404B37891J1401J3473K1906L5199M8458O0763P6036P9581O1617K5013j5644
$$ 237891 249292 262765 284671 319870 368328 429091 505127 584708 646325 671338 655694
11393F55694n3401p7261q4683p3944n5940l8060k7493j8626j3215r081m205j128
$$ 655694 602293 525032 440349 366405 310465 272405 244912 226286 213071 203990 199785 198657
11381A98657k916M24o77L223P419M981k064o956n018q945j1289l989O82N624N518
$$ 198657 195741 196165 195488 198711 206130 211111 209047 202091 197073 188128 176839 172850 173532 179156 184674
11366A84674Q673R036J648n319o566k841R535O012P098J5802K5069K6724R589
$$ 184674 193347 202383 204031 198712 192146 189305 198840 204852 211950 227752 252821 279545 289134
11353B89134l564j3717k7079k9576k8527k3466j8074j0093q196p85K642j82K465
$$ 289134 285570 271853 244774 215198 186671 163205 145131 135038 126842 126057 128699 128517 130982
11340A30982L629K292L857k615j7375j1866j3213j0508p883l293J94q48l526J96
$$ 130982 134611 136903 140760 138145 120770 108904 95691 85183 77300 74007 74201 73353 69827 70023
11326G0023L048N286n55n900L875J4482J5572J2961N82l948o117l703j693k500
$$ 70023 73071 78357 77802 71902 75777 90259 105831 118792 119374 115426 109309 105606 103913 101413
11312A01413j3643k3939k1964j0876J2323K5034K3489K4735K4554J5303p248l0319
$$ 101413 87770 63831 41867 30991 43314 68348 91837 116572 141126 156429 149181 118862
11300A18862m0843l5210j8632K972J4975Q183m128q28l937n394L158O251J685
$$ 118862 78019 42809 24177 27149 42124 50307 46179 45351 41414 36020 39178 45429 47114
11287D7114o504n299L334M272m93o90l999p542j196K444j886l341j251M987P086
$$ 47114 40610 35311 38645 42917 42424 41734 37735 30193 28997 31441 29555 26214 24963 29950 37036
11272C7036R63k721l228n231o371K31L729K336M274K279K594R94K535M81o958
$$ 37036 37999 35278 32050 26819 20448 20679 24408 26744 31018 33297 35891 36885 39420 39901 32943
11257C2943q647O85K537m80M214L30L994J579K45L918K359p82L207N618J54j702
$$ 32943 24296 24981 27518 27038 31252 31582 35576 37155 37400 41318 43677 42895 46102 51720 51874 50172
11241E0172m076l777l02n5M92Q68M194Q272P726J2558J9360K0347L963l568j2197
$$ 50172 46096 42319 42017 41962 42454 43322 47516 55788 63514 76072 95432 115779 119742 116174 103977
11226A03977j7632j7044p631m106j094m020k890l046p63J593m29l622k961K25
$$ 103977 86345 69301 61670 57564 56470 52450 49560 46514 45751 47344 46915 43293 40332 40557
11212D0557Q19k99J343N418J893M240M284N27M467L216P70o098o298k558j479
$$ 40557 41376 41077 42420 47838 49731 53971 58255 58782 63249 66465 67235 61137 54839 52281 50802
11197E0802n766qJ19q99J236l061N70L591J713k91L72K082L392K025M595L321
$$ 50802 45036 45028 45147 44248 45484 42423 42993 46584 48297 48006 48378 50460 53852 55877 60472 63793
11181F3793k524p400p118K487J735n001m756J85m525k448L885m708k126j266l24
$$ 63793 61269 53869 46751 49238 50973 45972 41216 41401 36876 34428 38313 33605 31479 30213 29889
11166B9889j140L020N078K234J467j205L62j351r89J799k897l538n761J752J621
$$ 29889 28749 31769 36847 39081 40548 39343 39705 38354 37365 39164 36267 32729 26968 28720 30341
11151C0341J488l45r41k540L83N675L449Q428M489k68n950p455r379m552J565
$$ 30341 31829 31484 30543 28003 28386 34061 37510 45938 50427 50159 44209 36754 27375 22823 24388
11136B4388Q47J104K377k317k092k701R58O330O520j27m760m396J08P91N327Q331
$$ 24388 25235 26339 28716 26399 24307 21606 22564 28894 35414 35287 30527 26131 26239 27030 32357 40688
11120D0688L694l980l47k095l463M818P504M483M688J350o18k181j893n778k658
$$ 40688 44382 40402 40055 37960 34497 39315 46819 51302 55990 57340 56722 54541 52648 46870 44212
11105D4212j268j848l34P83l451k21j773p42l579j731J354j338P20J453j878n246
$$ 44212 42944 41096 40762 41545 38094 37873 36100 35358 31779 30048 31402 30064 30784 32237 30359 25113
11089B5113P6O06M042k075r38l75O81O754J0317J0181N987O36j535o256k542L259
$$ 25113 25189 25795 29837 27762 26824 26449 27130 33884 44201 54382 60369 61005 59470 53214 50672 53931
11073E3931L749K471K760M168N524O72p200j2081m856M661K821P08L162O791P973
$$ 53931 57680 60151 62911 67079 72603 73275 66075 53994 49138 53799 56620 57328 60490 67281 75254
11058G5254Q214J3476J5372O285m473j0058j1596j5546j4651q794n639k569O31
$$ 75254 83468 96944 112316 118601 114128 104070 92474 76928 62277 53483 47844 45275 45906
11045D5906j143m21k065k585m871Q47J0134P420j84J573k126o429p365m102n500
$$ 45906 44763 44342 42277 39692 34821 35668 45802 53222 53038 54611 52485 46056 38691 34589 29089
11030B9089j602p45Q39N11p43n025m461j135j164k632j251k020l254O30K785J083
$$ 29089 27487 26742 27581 28092 27349 22324 17863 16728 15564 12932 11681 9661 6407 7037 9822 10905
11014A0905j333K921j290m484p140j0936p847l885K222M388Q773j817J931M777
$$ 10905 9572 12493 11203 6719 -421 -11357 -19204 -23089 -20867 -16479 -7706 -9523 -7592 -2815
11000b815O987P076M938K767L974J25L47K829J861j341K68R56J658O072O750K494
$$ -2815 4172 11248 16186 18953 22927 23052 23399 26228 28089 26748 27016 27972 29630 35702 42452 44946
10984D4946K158k029l76K006R35L388P880N501P964M846O809J1985J4837J4400
$$ 44946 47104 45075 44699 46705 47640 51028 58908 64409 72373 77219 84028 96013 110850 125250
10970A25250J5643K0647K7170L2201N4173Q3329J20501J88797K76356L37105K72981
$$ 125250 140893 161540 188710 220911 275084 358413 478914 667711 944067 1281172 1554153
10959A554153N5628j77850l02879k90104k21280j54620j04114p1104m9016m0371
$$ 1554153 1609781 1431931 1129052 838948 617668 463048 358934 287830 238814 198443
10949A98443k8168k0614j4763j2655n628r756q386m154l138n271n118o223l315
$$ 198443 170275 149661 134898 122243 116615 106859 98473 94319 91181 85910 80792 74569 71254
10936G1254j442n343m530j067n223j962K965K113j009o56L572J797J229l391j528
$$ 71254 69812 64469 59939 58872 53649 51687 54652 56765 55756 55100 58672 60469 61698 58307 56779
10921E6779M8K328k50r01J514K164p14r32j272J721k243n62L117J100K890J385
$$ 56779 56827 59155 58905 58004 59518 61682 60968 60036 58764 60485 58242 57680 60797 61897 64787 66172
10905F6172p083q730o086m797L208K018j652l297j018J556L166K835k470O3Q16
$$ 66172 59089 50359 44273 39476 42684 44702 43050 39753 38735 40291 43457 46292 43822 43885 44701
10890D4701K069O674Q408K921q28l110j910o00P91q22P18M702j247n564o898n649
$$ 44701 46770 53444 61852 64773 63945 60835 58925 58325 59116 58294 59012 63714 62467 56903 50005 44356
10874D4356K011L699M185o33o229k518j389n882K50l74L46J922r5n62K56J549
$$ 44356 46367 50066 54251 53618 47389 44871 43482 37600 37850 37476 37822 39744 39649 39087 39343 40892
10858D0892K288r63m7O04N219K157n515n310p358l005J021K822N253P467P572
$$ 40892 43180 42217 42170 42774 47993 50150 44635 39325 31967 28962 29983 32805 38058 45525 53097
10843E3097k325j285j177m359n512j280K954K114J681O90J017K01n045m204J215
$$ 53097 50772 49487 48310 43951 38439 37159 40113 42227 43908 44598 45615 45816 40771 36567 37782
10828C7782R797L869l800n063J806O392L821n37j845M22K857o32M690P666L425
$$ 37782 47579 51448 47648 42585 44391 50783 54604 54067 52222 52644 55501 54869 59559 67225 70650
10813G0650O631N861Q033O026M232N63J446j958J100M718J974M905R985J1388
$$ 70650 77281 83142 91175 97201 101433 101996 103442 101484 102584 107302 109276 114181 124166 135554
10799A35554J4505J7141J2007O598J2464J1325N572O389n505k3237k5958k3281
$$ 135554 150059 167200 179207 185805 198269 209594 215166 221555 216050 192813 166855 143574
10787A43574j9120j2137r120q083m765m520J870M35J73L940l445j661J449M461
$$ 143574 124454 112317 103197 95114 90349 85829 87699 88134 88307 92247 88802 87141 88590 93051
10773I3051N871R376P172o52p548r257l748o042o088k791j668m836l260P31O126
$$ 93051 98922 108298 115470 114818 107270 98013 94265 88223 82135 79344 77676 72840 69580 70311 76437
10758G6437O742L216M034M364M826O199R719O105M071K787J007L139P491N670
$$ 76437 83179 86395 90429 94793 99619 105818 115537 121642 125713 128500 129507 132646 140137 145807
10744A45807M382M702k384O19j486l525m179j6803k1755k0628k0347j7456j0751
$$ 145807 150189 154891 152507 153126 151640 148115 143936 127133 105378 84750 64403 46947 36196
10731C6196j0292j1917p948q682l541Q43R078K0463J6260Q841J847n369k690l8
$$ 36196 25904 13987 6039 -2643 -6184 -5341 3737 24200 40460 49301 51148 45779 43089 43051
10717D3051R86k148M40N026J459J428M955J1565O333Q034R815M774j412l498l530
$$ 43051 44037 41889 42329 47355 48814 50242 55197 66762 73095 81129 90944 95718 94306 90808 87278
10702H7278L23J126M279R933J6092J9527J2653O832J0110M028P27m293j2393j2349
$$ 87278 87601 88727 93006 102939 119031 138558 151211 158043 168153 172181 172908 168615 156222 143873
10688A43873m785n545K165K834j003L327J0165M768N878P560J0914J5450J1359
$$ 143873 139088 133543 135708 138542 137539 140866 151031 155799 161677 169237 180151 195601 206960
10675B06960J7710K6875L9534N5590O5679P8440O3735L4819J1095l4016n6320
$$ 206960 224670 251545 291079 346669 412348 490788 554523 589342 600437 566421 510101
10664E10101n3375n0200l8181k7927k2032j4334j2154j5778j1199p357p556o193
$$ 510101 456726 406526 368345 340418 318386 304052 291898 276120 264921 257564 250008 243815
10652B43815L135J0536P426R359J1986O666O266N494j42n314q53P065J0050R461
$$ 243815 246950 257486 264912 274271 286257 292923 299189 304683 304541 299227 298374 305439 315489 324950
10638C24950J1765P737O773J1140J3084J4655J7390J4006R790J530j274J356j067
$$ 324950 336715 344452 351225 362365 375449 390104 407494 421500 431290 432820 431546 432902 431835
10625D31835j113m158n471k497m883o26Q855J5372J3437J2738Q306P785Q264P519
$$ 431835 430722 426564 421093 418596 413713 413087 421942 437314 450751 463489 471795 479580 487844 495363
10611D95363J3170J7470J9789K5498K5448K7495K0358Q905J261R172R439N643
$$ 495363 508533 526003 545792 571290 596738 624233 644591 653496 654757 663929 673368 679011
10599F79011P258J7154K1702K2108K3494K7559L5073L6118L4075M1478N3862P0743
$$ 679011 686269 703423 725125 747233 770727 798286 833359 869477 903552 945030 998892 1069635
10587A069635P6957P0706N4098K8612J9936J8318L2779M4335N9176P3471Q8131
$$ 1069635 1146592 1217298 1271396 1300008 1319944 1338262 1371041 1415376 1474552 1548023 1636154
10576A636154J06191J22051J27567J42361J77672K15086K40241K38099K34168
$$ 1636154 1742345 1864396 1991963 2134324 2311996 2527082 2767323 3005422 3239590
10567C239590K53092K95790L60373M28370N14842O38714P99844R69269J036752
$$ 3239590 3492682 3788472 4148845 4577215 5092057 5730771 6530615 7499884 8536636
10558H536636R73691R21034J018309J324420J772038K307180K948003L805748
$$ 8536636 9510327 10431361 11449670 12774090 14546128 16853308 19801311 23607059
10550B3607059N081298P036494J0027896J4649223K1916909L3259528M8760904
$$ 23607059 28688357 35724851 45752747 60401970 82318879 115578407 164339311
10543A64339311O0809777N0680467J3804573k6553198n2018217n4933728m2907009
$$ 164339311 225149088 275829555 289634128 263080930 211062713 156128985 113221976
10536A13221976k9528339j9864284j3637805r704399p173566n468029m216241
$$ 113221976 83693637 63829353 50191548 40487149 33313583 27845554 23629313
10529B3629313l238511k469362j850030j367112j021379q82902r37236j037004
$$ 23629313 20390802 17921440 16071410 14704298 13682919 12800017 11862781 10825777
10521A0825777j052162r69595q50866p44512o44931n52023m69752m05963l52167
$$ 10825777 9773615 8804020 7953154 7208642 6563711 6011688 5541936 5135973 4783806
10512D783806l04057k77465k55395k42854k25453j94846j61555j46328j42575
$$ 4783806 4479749 4202284 3946889 3704035 3478582 3283736 3122181 2975853 2833278
10503B833278j50163j64956j72835j78154j71739j53029j22615q2965l9343k0597
$$ 2833278 2683115 2518159 2345324 2167170 1995431 1842402 1719787 1636822 1597479 1576882
10493A576882k7033n2312p2173p7802o5926n2702l8886k9393l9806n1531n3980
$$ 1576882 1549849 1497537 1425364 1347562 1281636 1228934 1190048 1160655 1120849 1069318 1015338
10482A015338l8817l1754l4390m1250m7275m1602k7856j4749p801n483o535j2215
$$ 1015338 976521 944767 910377 869127 821852 780250 752394 737645 729844 724361 717826 705611
10470G05611j8495j4816j7975j2185k403j100l056j2392k1862k8122l3934l6205
$$ 705611 687116 672300 654325 642140 639737 638637 635581 623189 601327 573205 539271 503066
10458E03066k6357j7274j2739j1519j1556q547j1934j1847j2985j0033l909m432
$$ 503066 476709 459435 446696 435177 423621 415074 403140 391293 378308 368275 364366 359934
10446C59934k865p60K452J026l891l850n748j2391j4580n522k636P38k19r647
$$ 359934 357069 356309 358761 359787 355896 352046 346298 333907 319327 313805 311169 311907 311688 302041
10432C02041p613l001J28m645q866j4247j4590j3617j3585j7056j5707j5241j5219
$$ 302041 294428 291427 291555 286910 278044 263797 249207 235590 222005 204949 189242 174001 158782
10419A58782k2630k8724l5624l4705j4670J4330L2600K9402K8070K1576J7216
$$ 158782 136152 107428 71804 37099 22429 36759 69359 98761 126831 148407 165623
10408A65623P306O035J52k933q22k885N536P631N415o20l371o396j782l372p753
$$ 165623 172929 178964 179116 176183 175361 172476 178012 185643 191058 190438 187067 180671 178889 175517 167764
10393A67764j2103j3246m778J065J957M722Q716J2314J2144J0810J1865J3509
$$ 167764 155661 142415 137637 138702 140659 145381 154097 166411 178555 189365 201230 214739
10381B14739N938L497j264n383o775j2809p048n030k351j237J996M981J020k19
$$ 214739 220677 224174 222910 217527 210752 197943 190895 185865 183514 182277 184273 189254 190274 190055
10367A90055o33l579o55j311n316n698q65L796Q194R244O033O434L348j125q132
$$ 190055 189422 185843 185188 183877 178561 172863 171998 175794 183988 193232 199265 205699 209047 207922 199790
10352A99790j1458j5041j7704j8070k0757k0857j9540j7563j5690p428k579q33
$$ 199790 188332 173291 155587 137517 116760 95903 76363 58800 43110 35682 33103 32270
10340C2270j718L413N885O618K730N035L673P104P580M436M738L945K122L888
$$ 32270 30552 33965 39850 46468 49198 54233 57906 65010 72590 77026 81764 85709 87831 91719
10326I1719M131M690M451L531K786Q74k91n110p325m116k659n848o670r672k354
$$ 91719 95850 100540 104991 108522 111308 112182 111891 106781 99456 95340 92681 86833 80163 70491 68137
10311F8137j442m59p255k52N348Q57k786L820N396K242K628J204M04p89j209J057
$$ 68137 66695 66236 58981 58729 64077 64934 62148 65968 71364 73606 76234 77438 77842 77053 75844 76901
10295G6901k914j014k18p24k54M052N249J3499J6027J1689J1640R424J1538M179
$$ 76901 73987 72973 72755 72031 71777 75829 81078 94577 110604 122293 133933 143357 154895 159074
10281A59074K502j752n485j2487j8631k1864j5908r403p662l659j667L033N835
$$ 159074 161576 159824 154339 141852 123221 101357 85449 76046 68384 64725 63058 66091 71926
10268G1926L462j48K61m413l246L63L59L263j032j076N001N676Q778J3463K026
$$ 71926 75388 75240 75501 71088 67842 68205 68564 71827 70795 69719 74720 80396 89174 102637 104663
10253A04663k085M736K413K536P23N140J1096J6231K0432K9064L6146K6290K5387
$$ 104663 102578 107314 109727 112263 112986 118126 129222 145453 165885 194949 231095 257385 282772
10240B82772K6239K3667K4798K6164K2829M813k0837m0362m7901l5206k1207j4426
$$ 282772 309011 332678 357476 383640 406469 411282 390445 350083 302182 266976 245769 231343
10228B31343j7618j4833j0846k0527k0318j5249q485n116k97r57J8O42j872l978
$$ 231343 213725 198892 188046 167519 147201 131952 123467 118351 118054 117097 117115 117757 115885 111907
10214A11907k517K954M68O692J1128J0078J0903R330J0355K6889M2535O1298Q6548
$$ 111907 109390 112344 112812 119504 130632 140710 151613 160943 171298 198187 240722 302020 388568
10201C88568J06604R6642N0541M576r364L707J4935P940q824k5988m4488o3742
$$ 388568 495172 591814 642355 646931 637567 641274 656209 664149 655325 629337 584849 521107
10189E21107p5711p1740n2863l6347k5226j4138j5186j3875l817j982K435M208
$$ 521107 445396 373656 320793 284446 259220 245082 229896 216021 212204 210222 212657 216865
10177B16865L616P280J0904K0117K8448L7502M9142O4078R1216J26679J61476
$$ 216865 220481 227761 238665 258782 287230 324732 373874 437952 529168 655847 817323
10166H17323J85109J67995J04327J1793p6740j38254j48693j32026r5699n7229
$$ 817323 1002432 1170427 1274754 1286547 1209807 1071553 922860 790834 695135 637906
10156F37906k2416J1534N0223Q9720J12782R9581M9385k3442r1501j27976j32755
$$ 637906 615490 627024 677247 766967 879749 979330 1028715 1005273 913772 785796 653041
10145F53041j11455q5196o7344m6938l7417k4584j0939n958n941k925J382J009
$$ 653041 541586 456390 389046 342108 304691 280107 269168 263210 257269 254344 255726 256735
10133B56735J680k622j917K869l01L993R924J3834K7161M6387O5781R7967J43643
$$ 256735 258415 255793 253876 256745 256444 260437 270361 284195 311356 357743 423524 521491 665134
10120F65134K20939L05307L22635J90776n0546k46388l08341k60051j78141j08164
$$ 665134 886073 1191380 1514015 1704791 1654245 1407857 1099516 839465 661324 553160
10110E53160o2201m0956l2152l2406l8282l6016k9572k5485k7997j9044j3222
$$ 553160 490959 450003 417851 385445 347163 311147 281575 256090 228093 209049 195827
10099A95827j3779p934l260J877Q245J1439K0533K1541K0191J2225q15j9344l1597
$$ 195827 182048 174114 170854 172731 180976 192415 212948 234489 254680 266905 266090 246746 215149
10086B15149k8181k1812j1520K99K913L60J732K582M357P350K316m674k933p904
$$ 215149 186968 165156 153636 153935 156848 157208 158940 161522 165879 173229 175545 170871 167938 160034
10072A60034o442o197j015j724j090n7J106J611K617P098O815J0863K6102N0190
$$ 160034 153592 147395 146380 144656 143566 143509 144615 146226 148843 155941 162756 173619 199721 249911
10058B49911P9348L7983o997l8331l5740j9293j4862j3527r958n064N055J0126
$$ 249911 329259 367242 360245 321914 286174 266881 252019 238492 228534 223470 228525 238651
10046B38651J8330K8701L0921K8378K5366R359j5987l0999l1968k8347k0483j6220
$$ 238651 256981 285682 316603 344981 370347 379706 363719 332720 300752 272405 251922 235702
10034B35702j0722K613M110K637J168o77L992Q160p21j2331k1097k6221j8561
$$ 235702 224980 227593 231703 234340 235508 234831 238823 246983 246262 233931 212834 186613 168052
10021A68052j3582p424j889K94m627r021k003N825R376K523o303r717p243q222
$$ 168052 154470 147046 145157 145451 140824 131803 129800 135625 145001 147524 141221 131504 124261 116039
10007A16039q157j628J366l674l688k06P381K417J702j332n343j841l403J463
$$ 116039 107882 106254 107620 103946 100258 100052 107433 109850 111552 110220 104877 103036 99633 101096
9993A01096P450O838l93P4M759J783j957J553l899o65k08m531k546j030M96Q4
$$ 101096 108546 115384 114991 115065 119824 121607 119650 121203 117304 116639 116431 111900 109354 108324 108820 108904
9977A08904n18L02m567m109n848m924m716m869k918n003l581m211J996L590P012
$$ 108904 108386 108688 104121 100012 94164 89240 84524 79655 76737 71734 68153 63942 65938 69528 76540
9962G6540O728L939N853R546Q004Q650j2l104L014O838N164R430J2713P586R446
$$ 76540 83268 87207 93060 102606 110610 119260 119248 116144 119158 125996 131160 140590 153303 160889 170335
9947A70335Q344J004k640l342k849L358J3284J5057J1756J829o170J919J2518
$$ 170335 178679 179683 177043 173701 170852 174210 187494 202551 214307 216136 209966 211885 224403
9934B24403K6490L8007M5284K0439j2635k8502k4569j1350k135J0534J0121J579
$$ 224403 250893 288900 334184 354623 341988 313486 288917 277567 275432 285966 296087 297666
9922B97666r720j3245p512K803J2596J1838Q179N701j869M54O443K1938K8124
$$ 297666 287946 274701 267189 269992 282588 294426 302605 308306 306437 306891 313334 335272 363396
9909C63396L6750M3945M6774L5524K0089N091J643R792J7091M2988P3404Q6406
$$ 363396 400146 444091 490865 526389 546478 551569 553212 563004 580095 623083 696487 782893
9897G82893P4703M9133L5644M9578P5380Q1736P0625O6260R1937J11614R6547
$$ 782893 857596 906729 942373 991951 1067331 1149067 1219692 1285952 1377889 1489503 1586050
9886A586050L5493k9994n2983n5936n5792n7247n2317l9067j3913J9690Q8556
$$ 1586050 1621543 1591549 1538566 1482630 1426838 1369591 1317274 1278207 1264294 1283984 1372540
9875A372540K20192M41494N69102L97303r676l09193l25239j28471J22830L34412
$$ 1372540 1592732 2034226 2603328 3000631 2990955 2681762 2356523 2228052 2350882 2685294
9865B685294M79679M64846K83088O1321n3650m9333m0889j13476k23945l03728
$$ 2685294 3164973 3629819 3912907 3974228 3920578 3871245 3830356 3716880 3492935 3189207
9855C189207l10715k64116j93509j23610p8163o3869o1455n6391l3441O256N1996
$$ 3189207 2878492 2614376 2420867 2297257 2219094 2155225 2093770 2037379 2003938 2010194 2062190
9844B062190R4791J35517J65695J79631J85646K07829K37485K74035L40672M30578
$$ 2062190 2156981 2292498 2458193 2637824 2823470 3031299 3268784 3542819 3883491 4314069
9834D314069N39365O67579Q28021J016862J254768J628562K260776L202377M443928
$$ 4314069 4853434 5521013 6349034 7365896 8620664 10249226 12510002 15712379 20156307
9825B0156307N932982P506608Q452483P030932K433733l025191o762370p699703
$$ 20156307 26089289 33595897 42048380 49079312 51513045 48487854 41725484 34025781
9817C4025781o612712m928574l354834k088415j108226l23453L78913J108076
$$ 34025781 27413069 22484495 19129661 17041246 15933020 15609567 15988480 17096556
9809A7096556J965617K929966L719514M037033L941696L602973K971765J990128
$$ 17096556 19062173 21992139 25711653 29748686 33690382 37293355 40265120 42255248
9801D2255248Q51899j88601q91042j248758j414013j449113j417747j360152j297443
$$ 42255248 43107147 42918546 42027504 40778746 39364733 37915620 36497873 35137721 33840278
9792C3840278j180404r78504o84006k47612M05226J515408L370294O286529J0400721
$$ 33840278 32659874 31681370 30997364 30749752 31154978 32670386 36040680 42327209 52727930
9783E2727930J5275719J9915444K1669144J6611535M334750r348921j8641948
$$ 52727930 68003649 87919093 109588237 126199772 130534522 121185601 102543653
9776A02543653k1081796j8155043j3405031q913858n529319l172744j488691k28974
$$ 102543653 81461857 63306814 49901783 40987925 35458606 32285862 30797171 30568197
9768C0568197O38292J015416R64927Q83318J099116J493454J799303J886046J691915
$$ 30568197 31206489 32221905 33186832 34070150 35169266 36662720 38462023 40348069 42039984
9759D2039984J232999O82239J5553r74280k221405l528782m522705m780436m277257
$$ 42039984 43272983 43955222 43970775 42996495 40775090 37246308 32723603 27943167 23665910
9750B3665910l294025k250273j401661p69503k54151L03845J044822K054278L397878
$$ 23665910 20371885 18121612 16719951 15950448 15696297 16000142 17044964 19099242 22497120
9741B2497120N087927O788834P502984N659450J120681l792380o853099p471617
$$ 22497120 27585047 34373881 41876865 47536315 48656996 44864616 38011517 30539900
9733C0539900o537073n179522l901094k837678k040113j488185j114187q57202
$$ 30539900 24002827 18823305 14922211 12084533 10044420 8556235 7442048 6584846
9725F584846o66627n29719m40114l73893l28380k79176k42259k18957k10927k19428
$$ 6584846 5918219 5388500 4948386 4574493 4246113 3966937 3724678 3505721 3294794 3075366
9715C075366k09032j73236j26416q0778l5379M096K6986J7310J9848M5916Q8167
$$ 3075366 2866334 2693098 2566682 2485904 2450525 2454621 2481607 2498917 2518765 2564681 2652848
9704B652848J45864K07830K58685K55293J66476O9245L8037J1088j06949k98087
$$ 2652848 2798712 3006542 3265227 3520520 3686996 3756241 3794278 3805366 3698417 3400330
9694C400330m44099m59552l78623k69774j71684r9429o8234p4422p3317n2833
$$ 3400330 2956231 2496679 2118056 1848282 1676598 1577169 1508935 1434513 1361196 1308363
9684A308363k8902k2150k0828j7848p66P644J3465K0246L4593L8310M0309L0674
$$ 1308363 1279461 1257311 1236483 1218635 1217869 1225513 1238978 1259224 1293817 1332127 1372436 1403110
9672A403110J0928k9468o3370o7191n5576n3019o2849p0521o6054m8205l0223
$$ 1403110 1414038 1384570 1321200 1254009 1198433 1145414 1082565 1012044 945990 897785 867562
9661H67562m5245o7216q0599q2806p5354o4789n5188l7975k7058j4792l994N062
$$ 867562 822317 755101 674502 591696 516342 451553 396365 358390 331332 316540 312546 317608
9649C17608L971K088O10P46j111K44m78q627j2507j3417j2345p697n071q989m109
$$ 317608 321579 323667 324277 325023 323912 324156 323678 315051 302544 289127 276782 269085 264014 255025 250916
9634B50916q948r079j0472r826j1535o274j250L924j256p33M121N808M294J328
$$ 250916 241968 232889 222417 212591 201056 194782 193532 197456 196200 195467 199588 205396 209690 211018
9620B11018n071m092k90o602p961q316p303n612m263j442P08M739L818K103m13
$$ 211018 205947 201855 201565 194963 187002 178686 171383 165771 161508 160066 160774 165513 169331 171434 171021
9605A71021Q11J438L982j276K20K288N924M728l6O92J325k693O36j370n245q212
$$ 171021 171832 173270 177252 175976 176196 178484 184408 189136 189100 189792 191117 188424 189060 187690 182445 174233
9589A74233j3607p780o055l894n026q176o763l158p01l98j927Q24R51n603k345
$$ 174233 160626 152846 146791 142897 137871 129695 122932 119774 119073 118675 116748 117572 118523 112920 110575
9574A10575R56K02R26l189j730L656N344K41j486k831J177J01k401N26j434n81
$$ 110575 111531 111733 112659 109470 107740 111396 116740 116981 115495 112664 113841 113942 111541 112067 110633 110052
9558A10052l824j292J257l154j420J131k257j238p01k429p919J427J93k054J563
$$ 110052 106228 104936 106193 103039 101619 102750 100493 99255 98554 96125 88206 89633 89826 87772 89335
9543H9335l004k873p245k037J08m18l213k305l58o39L502N462l649l732j009O972
$$ 89335 86331 83458 76213 74176 74284 73866 70653 68348 67990 67351 70853 76315 72666 68934 67925 74897
9527G4897M529M716N392L751o21Q52L716K089j89j146j498K426k502o20M845O19
$$ 74897 79426 84142 89534 93285 92664 93516 97232 99321 99132 97986 96488 98914 96412 95792 100637 101256
9511A01256j792r10m331p078m363J645N279N727L281k952j836Q612N949O169Q753
$$ 101256 99464 98554 94223 87145 82782 84427 89706 95433 98714 95762 93926 102538 108487 114656 123409
9496A23409R171r1n243m241L243O2k878n900k149P18m083K520M740K628J52j60
$$ 123409 132580 132489 127246 123005 126248 126310 123432 117532 115383 116101 112018 114538 119278 121906 122058 121898
9480A21898N145M046O266O945M940P71k726K801K954M171M975N024o09l440n441
$$ 121898 127043 131089 137355 144300 149240 150011 147285 150086 153040 157211 162186 167210 166601 163161 157720
9465A57720m820o028j103m91LM175N310K826N085P605J4428J7576J8084J5371
$$ 157720 152900 146872 145769 145278 145281 149456 154766 157592 162677 170282 184710 202286 220370 235741
9451B35741Q581K842L59O0j436m375O04N207Q74n283j5774k2003k1819j8766j1294
$$ 235741 244322 247164 247523 247583 246147 241772 242376 247583 248457 243174 227400 205397 183578 164812 153518
9436A53518p609n420O20l637o37M073M745K122N84l160r37q855p272k28k181J343
$$ 153518 145909 140489 141109 137472 136835 140908 145653 147775 148359 145199 144262 135407 128135 127907 125726 127069
9420A27069R10k349k338k073l37L647L115P277J5315J6010J0484J1331K2649L3175
$$ 127069 127979 125630 123292 121219 120882 124529 127644 134921 150236 166246 176730 188061 210710 243885
9406B43885M7114O2643P9646O7404K9372j0859l9365n0481m9883m8820m6019m4953
$$ 243885 290999 353642 433288 500692 530064 519205 479840 429359 379476 330656 284637 239684
9394B39684l6965k3133j7028j2965j1396r520p647n801k884M823K813n159j940
$$ 239684 202719 179586 162558 149593 138197 128677 121030 115229 112345 117168 119981 114822 112882
9381A12882j776o126r54N74m08K914J483J718K823Q110N444N817P696J2088J4173
$$ 112882 111106 104980 104026 104600 104192 107106 108589 110307 113130 121240 126684 132501 140197 152285 166458
9366A66458J8307L6461N7513P0856Q5591P6470N9117L5347J1278k2415m5855n6042
$$ 166458 184765 221226 278739 349595 435186 511656 570773 606120 617398 594983 549128 493086
9354D93086n4011n6859n4179m8153m0819l2261k7217k4135j6185j2193r844m528
$$ 493086 439075 382216 328037 279884 239065 206804 179587 155452 139267 127074 117230 112702
9342A12702l772p95J565M69k927r2K48K349j73j382j648p68j445J577O57M356
$$ 112702 108930 108135 109700 110169 107242 107150 107398 109747 109574 108192 106544 105776 104331 105908 106565 110921
9326A10921K376N540J5029K1114K5047L0200M1485N0444M8893L0583J1741l326
$$ 110921 113297 118837 133866 154980 180027 210227 251712 302156 351049 381632 393373 390047
9314C90047j5255k3136k1931j9164k4556l1661l2876l6676k4494j3477j0067r311
$$ 390047 374792 351656 329725 310561 286005 254344 221468 184792 160298 146821 136754 127443
9302A27443o229n988o688o894l634l781k950m142l960R49j194r19l064L101J516
$$ 127443 121214 115226 108538 101644 98010 94229 91279 87137 83177 84126 82932 82013 78949 82050 83566
9287H3566K44K282L343K448k816O41J648J562N348M530J808J1561J4693J0440
$$ 83566 83810 86092 89435 91883 89067 89708 91356 92918 98266 102796 104604 116165 130858 141298
9273A41298Q932j457k811j128l096m066p683j0737r503o225p978l756L357P17
$$ 141298 150230 148773 145962 144834 141738 137672 129989 119252 109749 103524 95546 91790 95147 95864
9259I5864Q29J350l606l577k562j934L21m166p307m224o339M361J4226J2819Q289
$$ 95864 96693 98043 94437 90860 88298 86364 86685 82519 75212 70988 64649 69010 83236 96055 104344
9244A04344K999j253n932p734j0687j2188o564k394N759R846M713p08m832j463
$$ 104344 107343 106090 100158 92424 81737 69549 62985 60591 66350 76196 80909 80201 75369 73906
9230G3906K557K942Q02n91j87j587j444k844j442M15K321L837J916N476K43l434
$$ 73906 76463 79405 80207 79616 79429 77842 76398 73554 72112 72527 74848 78685 80601 86077 86320 82886
9214H2886l957k665O28K845q80Q33J701J641K143M002l849j826J845j823j504
$$ 82886 78929 76264 76892 79737 78857 79690 81391 83032 85175 89177 85328 83502 85347 83524 82020
9199H2020l07l986k413p314l439r4K214J910J636R30O63L54j213j460K496j727
$$ 82020 81713 77727 75314 68000 64561 64467 66681 68591 70227 71157 71820 72174 70961 69501 71997 70270
9183G0270J454J945j501Mj484k591j109J898o16j447l459j718J229m061n1K178
$$ 70270 71724 73669 72168 72172 70688 68097 66988 68886 68270 66823 63364 61646 62875 58814 58763 60941
9167F0941M835L157k550q10k985p146l676K200j425j802J190K809M815M168M715
$$ 60941 65776 68933 66383 65573 62588 55442 51766 53966 52541 50739 51929 54738 59553 63721 68436
9152F8436J848k766p42m99n768m620r1j656j068J558O088M413L294k355k29l594
$$ 68436 70284 67518 66776 66277 60509 55889 55798 54142 53074 54632 60720 65133 68427 66072 65843 62249
9136F2249Q60j804K481j827k538M158J845k166l945L289L012k169j988M84q86
$$ 62249 63109 61305 63786 61959 59421 63579 65424 63258 59313 62602 65614 63445 61457 61941 61055
9121F1055K318M554L133M46J069m770n673N76j918J059J454J925K158Q20O46J242
$$ 61055 63373 67927 71060 71506 72575 67805 62132 62708 60790 61849 63303 65228 67386 68206 68852 70094
9105G0094j822K679L12k809K452J815K965m323n833L444K596n03K20L988j838
$$ 70094 68272 70951 71263 68454 70906 72721 75686 71363 65530 68974 71570 71067 71287 75275 73437
9090G3437P75j333n711J622L590k197K401M326j018j671r53L06l760l572j328
$$ 73437 74212 72879 67168 68790 72380 70183 72584 76910 75892 74221 73268 73574 69814 66242 64914
9075F4914L333O418M281j030l656n715J14L68L81m788n212j154L145P023L191
$$ 64914 68247 74665 78946 77916 74260 68545 68659 69027 69408 64620 59408 58254 61399 68422 71613
9060G1613j233j40L247L440K593L54k265j809R79K606q24j872m499m664L469M653
$$ 71613 70380 70240 73487 76927 79520 79874 77609 75800 76779 79385 78561 76689 72190 67526 70995 75648
9044G5648R37R48K975L060K865Q11r41k168l160l642J275L297J301L994R43k06
$$ 75648 76585 77533 80508 83568 86433 87244 86303 84135 80975 77333 78608 81905 83206 87200 88143 87937
9028H7937J435j792m95j934k721J646P868R381M526N529O455j966p553j0029m902
$$ 87937 89372 87580 87085 85151 82430 84076 91944 101325 105851 111380 117835 115869 108316 98287 93385
9013I3385n430k439N308J359n38N147n49J747N522O735N525K526m494n71J321
$$ 93385 87955 85516 90824 92183 91645 96792 96243 97990 103512 110247 115772 118298 113804 113233 114554
8998A14554L955M678R89k01J424K5l475m152k619M75R12J98L082J454o02K183
$$ 114554 118509 123187 124176 123975 125399 125424 121949 117797 115178 115653 116565 116763 119845 121299 120697 122880
8982A22880K787k618J153K260r82K85M897J051j008m153m740K891L508r42k771
$$ 122880 125667 123049 124202 126462 125480 125765 130662 131713 130705 126552 121812 124703 128211 127269 124498
8967A24498L200p21J230N124L919j050m14J905j249J941K786N42k300k742K062
$$ 124498 127698 126977 128207 133331 137250 136200 135786 137691 136442 138383 141169 141711 139411 136669 138731
8952A38731K50M72L931r45L946K480l240j205j976L628J151K478R50N7k019J442
$$ 138731 138981 139453 143384 142439 146385 148865 145625 144420 142444 146072 147223 149701 150651 150708 148689 150131
8936A50131K56J691L905M981K795j096J4O87j783M41J100K61J287J941L626J252
$$ 150131 150387 152078 155983 160964 163759 162663 162677 163364 161581 162022 163122 163383 164670 166611 170237 171489
8920A71489J934N822L916K483L592l43k334L648L486L408O687P266l824L97O274
$$ 171489 173423 179245 183161 185644 189236 188893 186559 190207 193693 197101 203788 211054 207230 207627 213901
8905B13901M222N832L40L48J815N881O250L013L426K271P202P246K435L547K579
$$ 213901 218123 223955 224295 224643 226458 232339 238589 241602 245028 247299 254501 261747 264182 267729 270308
8890B70308L840N414N269M163P223M432J995M567O588N421J911M159M435N799
$$ 270308 274148 279562 284831 288994 296217 300649 302644 307211 313799 319220 321131 325290 329725 335524
8876C35524N738N732L911P264N145N528J0419N155L284M348K115L738R223R416
$$ 335524 341262 346994 350905 358169 363314 368842 379261 384416 387700 392048 394163 397901 407124 416540
8862D16540M849N041O189j74M401P129P913P907N530N146O746J0555P671N784
$$ 416540 421389 426430 432619 432445 436846 443975 451888 459795 465325 470471 477217 487772 495443 501227
8848E01227L854O598Q356J3805R120P251R115J2771J1576J2471J3095J5198J4269
$$ 501227 505081 511679 520035 533840 542960 550211 559326 572097 583673 596144 609239 624437 638706
8835F38706J1587J1097J0448J4976J7904J2176J4505J4605J6002J7616K0750J9687
$$ 638706 650293 661390 671838 686814 704718 716894 731399 746004 762006 779622 800372 820059
8823H20059K2485K4348K3227J9054J7119J8978K5370K8642L0841K6680K6605L2307
$$ 820059 842544 866892 890119 909173 926292 945270 970640 999282 1030123 1056803 1083408 1115715
8811A115715L2112L0412L0749L4204L6654L8521L8712M3171M5841M8699N1262
$$ 1115715 1147827 1178239 1208988 1243192 1279846 1318367 1357079 1400250 1446091 1494790 1546052
8800A546052N3613N1787N2438N4285O3003O8378P0255P7135P5268Q2096Q8471
$$ 1546052 1599665 1651452 1703890 1758175 1821178 1889556 1959811 2036946 2112214 2194310 2282781
8789B282781R2620R9566J00704J07126J16478J24659J31913J36260J43597J61691
$$ 2282781 2375401 2474967 2575671 2682797 2799275 2923934 3055847 3192107 3335704 3497395
8779C497395J74691J79555J89634K09402K24141K41632K58210K75366K98066L19324
$$ 3497395 3672086 3851641 4041275 4250677 4474818 4716450 4974660 5250026 5548092 5867416
8769E867416L43416L71828L98031M24859M61754M96532N32675N68828O10607O55205
$$ 5867416 6210832 6582660 6980691 7405550 7867304 8363836 8896511 9465339 10075946 10731151
8759A0731151O90786P23908P60089P97415Q26255Q45689Q48607Q31742Q04336
$$ 10731151 11421937 12145845 12905934 13703349 14529604 15375293 16223900 17055642 17859978
8750A7859978P60160O86412N96939M81899L54084K02284N1149j05136k56684l93863
$$ 17859978 18620138 19306550 19903489 20385388 20739472 20941756 20992905 20887769 20631085 20237222
8740B0237222n16895o17172o98680p57918p90606q13891q20697q07094p83733
$$ 20237222 19720327 19103155 18404475 17646557 16855951 16042060 15221363 14414269 13630536
8731A3630536p60249p28710o91232o61818o20582n78763n41756n14166m76653
$$ 13630536 12870287 12141577 11450345 10788527 10167945 9589182 9047426 8533260 8056607
8722H056607m46188m19440l89355l57597l39215l20661k99942k75580k59837k42746
$$ 8056607 7610419 7190979 6801624 6444027 6104812 5784151 5484209 5208629 4948792 4706046
8712D706046k22624k06027j98534j92502j78457j65228j54025j44489j38736j31830
$$ 4706046 4483422 4277395 4078861 3886359 3707902 3542674 3388649 3244160 3105424 2973594
8702B973594j18355j13959j14273j03201r4391r3582q2038q0227p6561p6064o6514
$$ 2973594 2855239 2741280 2627007 2523806 2429415 2335833 2253795 2173568 2097007 2020943 1954429
8691A954429o3062o4048o3050n7526m9893m7391m7178m5663l6297l7315l6104
$$ 1954429 1891367 1827319 1764269 1706743 1656850 1609459 1562281 1516618 1480321 1443006 1406902
8680A406902k4452p675K9403Q5896J13736K593j03340j61341j33377q4945n4719
$$ 1406902 1382450 1374775 1404178 1490074 1603810 1606403 1503063 1341722 1208345 1123400 1068681
8669A068681m3769l7761l4562k7419k1334k2110k1504k2376j7442j6817j8594
$$ 1068681 1024912 987151 952589 925170 903836 881726 860222 837846 820404 803587 784993
8658G84993j9067k2127j4064j0813j2113j3795j5307j3684j4934j2480p376p306
$$ 784993 765926 743799 729735 718922 706809 693014 677707 664023 649089 636609 629233 621927
8646F21927j0955o821l279m499l302n094k437k348j308J820O160J7440M2706Q9048
$$ 621927 610972 604151 600872 596373 593071 587977 585540 583192 581884 583704 589864 607304 650010 739058
8632G39058J95149L08591J18946j12619k62497k43733j41522q2385m9400k9199
$$ 739058 934207 1242798 1361744 1249125 986628 742895 601373 518988 469588 440389
8622D40389j9468k1163j1058o334p890m606n173m246p615n180q604r525r276p477
$$ 440389 420921 399758 388700 382366 374476 369870 364697 360451 352836 347656 339052 329527 320251 312774
8608C12774q054q699l468J81l065l884n498j164l56n155m451J679N142K684M46
$$ 312774 304720 296021 292553 292734 289669 285785 280287 279123 278767 273612 269161 270840 275982 278666 279112
8593B79112M688j282J957O998K0374M4096Q4833J41432J02739k0074j02319j19152
$$ 279112 283800 282518 284475 291473 311847 355943 440776 582208 684947 664873 562554 443402
8581D43402p0863l6224k7534k7383j8273j4387j2812p600r403l372k628n201k843
$$ 443402 372539 336315 308781 281398 263125 248738 235926 228326 218923 215551 212923 207722 204879
8568B04879j667n436l639R75p20q51n078n122m269m497l179j466J849j612r688
$$ 204879 203212 197776 194137 195112 194392 193541 188463 183341 179072 174575 171396 169930 171779 170167 160479
8553A60479N42P126M132P8j978k062o847r227n939l258k564r270p713j860k310
$$ 160479 161021 168147 172279 172357 170379 168317 161470 152243 146304 143046 140482 131212 123499 121639 119329
8538A19329J660K534l26N35Q58K328M641m43m139m350k998L493L225K716J362
$$ 119329 120989 123523 123197 123732 124590 126918 131559 131116 126977 122627 119629 123122 126347 129063 130425
8523A30425j468J353k85o484n743p652q32L447J952l49k659l747m78K355L056
$$ 130425 128957 130310 130025 123541 117798 110146 109314 112761 114713 114364 111705 107958 107480 109835 112891
8508A12891L471m121m637k257n561o76M956o42m263k993l456K445R95K79n001
$$ 112891 116362 112241 107604 105347 99786 99110 104066 103424 99161 96168 92712 95157 96152 96431 91430
8493I1430n950n005M856L377K30l183k982J579O250P838N533L716L371j250r155
$$ 91430 85480 80475 85331 88708 88938 85755 82773 84352 90602 98440 103973 107689 111060 109810 100655
8478A00655o492o396j791L737L300K918m547q869m029j046M165J963k240l372
$$ 100655 94163 87767 85976 89713 93013 95931 91384 82515 78486 77440 81605 83568 81328 77956
8464G7956l532L210L761J081M63N51r8k857k551N7K136k320j178j73j897j227
$$ 77956 74424 77634 81395 82476 82939 83490 83392 80535 77984 78041 80177 77857 76679 76506 74609 73382
8448G3382J759l33n787j502K202J554K408L958Q88o41l431m706m871k823j756
$$ 73382 75141 74808 69021 67519 69721 71275 73683 77641 78529 77888 74457 69751 64880 62057 60301
8433F0301L793O447N100M385O136J144p27j036l755J1175J5096J6095J5350J296
$$ 60301 64094 70541 75641 80026 86162 87306 86579 85543 81788 92963 108059 124154 139504 140800
8419A40800q959j6238j6457j1855q545m614k704q47J189j777N3L62J268j331m924
$$ 140800 131841 115603 99146 87291 78746 74132 71428 70581 71770 69993 70046 70408 71676 70345 65421
8404F5421L82K606M93o145j530M331M846M240Q784J1751K6736M7332O7008N4293
$$ 65421 65803 68409 68902 62757 61227 65558 70404 74644 83428 95179 121915 169247 236255 290548
8390B90548L067m0982o0229m5484k4015j0079n227p545r398j788M933J5523K5831
$$ 290548 293615 252633 192404 146920 122905 112826 107599 100054 90656 88868 93801 109324 135155
8377A35155L8891L7080J4436j9247l4403l5536k6867j5744o022q910q141o306
$$ 135155 174046 211126 225562 206315 171912 136376 109509 93765 87743 78833 70692 64386
8365F4386l010k130J483o08r71K104M000L719M704J0877J9517L3897N3127O2437
$$ 64386 61376 59246 60729 60121 59150 61254 65254 68973 73677 84554 104071 137968 191095 253532
8351B53532K9257j8548m7961n1780l5779k1773j2070o461n658j571P62k911j031
$$ 253532 282789 264241 216280 164500 128721 106948 94878 88417 82759 81188 81950 79039 78008
8338G8008J225J1537K3608L8070M9193L7632J0052j0505k7655k9609l1400l0674
$$ 78008 79233 90770 114378 152448 201641 239273 249325 238820 211165 181556 150156 119482
8326A19482k4696j6625j1038o089k689k826l351k059l507n328k124o33J762P68
$$ 119482 94786 78161 67123 61034 58345 55519 52168 50109 46602 41274 39150 38517 40279 41047
8312D1047k959L670L052K987j351l593K205M616K044Q08n277l399L016M631k183
$$ 41047 38088 41758 44810 47797 46446 42853 45058 49674 51718 52526 47249 43850 46866 51497 49314
8297D9314j179R215J8030K4649L8863L8926J6909j4041l1345l3081k5518j0894
$$ 49314 48135 57350 75380 100029 138892 177818 194727 180686 149341 116260 90742 79848
8285G9848r201r128l750m770N68k147j610k82p02m302l852l810j27K915k434o10
$$ 79848 70647 61519 57769 52999 53567 51420 49810 49528 48826 44524 40672 36862 36735 39650 37216 36606
8269C6606l567m137l00O193J267J58J424l223m140K241K17q92M34l584l108K744
$$ 36606 33039 28902 28602 34795 36062 36220 37644 34421 30281 32522 32739 31847 32281 28697 25589 28333
8253B8333o07k541j458L96K276J13M277J1j541K304l39l429j477n693k424N558
$$ 28333 27726 25185 23727 24123 26399 26512 30789 30800 29259 31563 31224 27795 26318 20625 18201 23759
8237B3759J371l39J579L776J898p98k97R2J440n41L457q84m361m108l558k975
$$ 23759 25130 24791 26370 30146 32044 31246 30949 31041 32481 31940 35397 34513 30152 26044 22486 19511
8221A9511M110L671M22j344J624K235n359n635k075N316K425K305J948m868o005
$$ 19511 23621 27292 27714 26370 27994 30229 24870 19235 17160 22476 24901 27206 29154 24286 18281
8206A8281K509J691J85l441j760O4J937j406K20K129k591J252q5K675q86K854
$$ 18281 20790 22481 22666 19225 17465 17529 19466 18060 18280 20409 17818 19070 18985 21660 20774 23628
8190B3628M508k71k470J368N87l105K981j473l095j169m412R73K555L076k44J699
$$ 23628 28136 27865 25395 26763 27350 24245 27226 25753 22658 21489 17077 18050 20605 23681 23437 25136
8174B5136L695l319n015k018K870J279O26j517J169K315m385j282L525L291k730
$$ 25136 28831 25512 20497 18479 21349 22628 23254 21737 22906 25221 20836 19554 23079 26370 23640
8159B3640j101P17J197m062l994K552K3K39j704k436R857O125j571m457k056L930
$$ 23640 22539 23256 24453 20391 16397 18949 18972 19211 17507 15071 24928 31053 29482 25025 22969 26899
8143B6899j03k932j732m65K237j045j76L245l196J010p50m989r88RM831J677o29
$$ 26899 26796 23864 22132 21667 23904 22859 22683 25928 22732 23742 22992 18003 17015 17024 21855 23532 22903
8126B2903M973O179J806K511O987R549J3925K2707J5412Q551L733m192n156j7768
$$ 22903 27876 34055 35861 38372 45359 54908 68833 91540 106952 115503 119236 115044 109888 92120
8112I2120j9462j9996n385k507p189o010L222j112k260o80k733j293j589j565
$$ 92120 72658 52662 47277 44770 37581 31571 34793 33681 31421 30741 28008 26715 25126 23561
8098B3561K505K48k458l87L130K345j519k65K245Q41J262k802J261J236L6j973
$$ 23561 26066 26314 23856 23469 26599 28944 27425 27160 29405 30246 31508 28706 29967 31203 31239 29266
8082B9266l409K9N575M459K309L058L712K971N240J0710N917k519j1799j0924
$$ 29266 25857 25886 31461 35920 38229 41287 44999 47970 53210 63920 69837 67318 55519 44595
8068D4595n975l260Q71j212k047k669k559J291J218J436n265n443k644l164j54
$$ 44595 38620 35360 36231 35019 32972 30303 27744 29035 30253 31689 26424 20981 18337 15173 15019
8053A5019O070l0l84N609J208PP80J853N179K51r513l339j539l067o065j10J340
$$ 15019 21089 21059 20675 26284 27492 27499 28279 30132 35311 35562 26049 22710 21171 18104 12039 11929 13269
8036A3269J820j370k98N065N465K89n433k654L457k453k696L061k68J487L378
$$ 13269 15089 13719 13421 18486 23951 24240 18807 16153 19610 17157 14461 17522 17254 18741 22119
8021B2119O415n86m897j926k309J462L48l610J117J797L096j591k205P03m17Q24
$$ 22119 28534 27948 23051 21125 18816 20278 20626 17016 18133 19930 23026 21435 19230 19933 19516 20340
8005B0340n54P29K863K041l38l038k230m808j049J811L962J537k705p099m55n5
$$ 20340 19786 20515 23378 25419 25081 22043 19813 15005 13956 15767 19729 21266 18561 11462 11007 10952
7989A0952j693J189J40j686K80P860p73k342L73J619J587k297l024o41r79L137
$$ 10952 9259 10448 10588 8902 9182 17042 16269 13927 14300 15919 17506 15209 12185 11544 10565 13702
7973A3702L031L130k660j948j209M715J569m65l119l391M255J161P15p28K175
$$ 13702 16733 19863 17203 15255 14046 18761 20330 19865 16746 13355 17610 18771 19486 18758 20933
7958B0933J540l806l485k058L282P54J196j917L316j66k309q164j906K026q49
$$ 20933 22473 18667 15182 13124 16406 17160 18356 16439 19755 19589 17280 9116 7210 9236 8387
7943H387N79l511K215L897k0K306j471j291l801L836J496J935K880j136n02l98
$$ 8387 8966 5455 7670 11567 11547 13853 12382 11091 7290 11126 12622 14557 17437 16301 15799 15401
7927A5401L097N795O51m418o558n394K742K540k441l000J473M711m863l243L356
$$ 15401 18498 24293 24944 20526 13968 8574 11316 13856 11415 8415 9888 14599 9736 6493 9849
7912I849J404K82J343j833k46n240j562K213k383K180K255j806j192J107jJ198
$$ 9849 11253 11535 12878 11045 10799 5559 3997 6210 3827 6007 8262 6456 5264 6371 6370 7568
7896G568o26J059R41k169k245J004o24k758j105L151R05k757j56J844K511J271
$$ 7568 6942 8001 8942 6773 4528 5532 4908 2150 1045 4196 5101 2344 2188 4032 6543 7814
7880G814l698m271J035m47j454k797J51L824K726J12K49k230M63L252k103k46
$$ 7814 4116 -155 880 433 -1021 -3818 -3667 157 2883 2995 3244 1014 1477 4729 2626 2380
7864B380M218r49M18K403L519J873J235L97o258q224n332J626M35K324K280j405
$$ 2380 6598 5649 6067 8470 11989 13862 15097 15494 9236 1012 -4320 -2694 -2259 65 2345 940
7848I40k534r28L161N965R96k276Q24k128J074K683J465l948M5M66p89K666K400
$$ 940 -1594 -2522 639 6604 7600 5324 6148 4020 5094 7777 9242 5294 5339 5805 5016 7682 10082
7831A0082l45l154o080n188m54L641L062L265J413L428M003N618n7j419L744J26
$$ 10082 9737 6583 503 -4685 -5139 -1498 1564 4829 6242 9670 13673 19291 19234 17815 21559 21685
7815B1685o534n603n763o797m220L643M777K981J577m255J808K027j774j476j359
$$ 21685 15151 9548 3785 -3012 -7232 -3589 1188 4169 5746 1491 3299 5326 3552 2076 717
7800G17l355J567L48K577N0m797k582J622M681M120J846Q51N75N00j283l739k419
$$ 717 -2638 -1071 -723 1854 1904 -2893 -5475 -3853 828 4948 6794 7645 8220 8720 7437 3698 1279
7783A279r91Q76m36p5M854m13j185L44P084J299n758J350P69k756J480L086J23
$$ 1279 288 1164 728 653 5507 5094 3909 4253 11337 12636 6878 8228 8997 6241 7721 10807 10930
7766A0930l893j964k627k570k914R68L910o35J842L509L85m208j53P65k633o94
$$ 10930 7037 5073 2446 -124 -3038 -2070 1840 1205 3047 6556 6941 2733 2580 3345 712 18
7750A8L188L106L756L68l812r48j292k463O23l047j902J457L435M154o70k810
$$ 18 3206 6312 10068 10436 6624 5676 4384 1921 2544 -503 -2405 -948 2487 6641 5971 3161
7734C161j193M64K316M582m763l363Q28L50O42J308P58J224l162l972K519N012
$$ 3161 1968 2432 4748 9330 4567 1204 2032 2382 3024 4332 5090 6314 3152 -820 1699 6711
7718F711l86k739l700j096L670M617K134K16j858j468j735j089O12J425J170j091
$$ 6711 6325 3586 -114 -1210 2460 7077 9211 9427 7569 6101 4366 3277 3889 5314 6484 5393
7702E393n968N28J168L366j045k789J441p02o74O91J439K108m65l259m493K117
$$ 5393 -575 -47 1121 4487 3442 653 2094 1392 718 1409 2848 4956 4491 1232 -3261 -1144
7686a144J512K128M389K876n597l766J376O880J95m856j250l36J018j69p80m44
$$ -1144 368 2496 6885 9761 4164 398 1774 8654 8849 3993 2743 2407 3425 3256 2476 2032
7670B032J153l77j856K469m40q51J587M124J102j295k13J582l299l23L102m636
$$ 2032 3185 2808 952 3421 2981 2130 3717 7841 8943 7648 7435 9017 5718 5395 8497 3861
7654C861J269K547L732l721n720j937R98J441J776J066k958j57J664k295j123
$$ 3861 5130 7677 11409 7688 1968 31 1029 2470 4246 5312 2354 2197 3861 1566 443
7639D43k262K223L921J275J735m97j430K229J333J506J163n75l05p364o265j514
$$ 443 -1819 404 4325 5600 7335 6838 5408 7637 8970 10476 11639 11064 10759 3395 -2870 -4384
7623d384j081j014J323M41k6L069k459j2M316M930J75k421j075J027O4m50k091
$$ -4384 -5465 -6479 -5156 -4715 -4741 -1672 -4131 -4143 173 5103 5278 2857 1782 2809 2873 2423 332
7606C32P99r04L9j288M53M087L16J738k052m916r59m78k190J075K656J505o46
$$ 332 1131 227 266 -1022 -569 3518 3834 5572 3520 -1396 -2355 -2833 -5023 -3948 -1292 213 -433
7589d33J352K677n74l006j127J564K651M47j716m97L539K961j258k824n08j910
$$ -433 919 3596 3022 16 -1111 453 3104 3551 1835 1338 4877 7838 6580 3756 3248 1338
7573A338j370J038Q31K277K066K723l86m539n457l016L683L698o26K795j258j725
$$ 1338 -32 1006 1837 4114 6180 8903 8517 3978 -1479 -4495 -812 2886 2260 5055 3797 2072
7557B072p83m15J821l713n97J205L072K084j152j905r04m145k092N161J717K184
$$ 2072 1289 874 2695 -1018 -1615 -410 2662 4746 3594 1689 785 -3360 -5452 -291 1426 3610
7541C610k676m50k704n873q9J742p07L16l67J807M037R36K963J717K53K098M15
$$ 3610 934 484 -2220 -8093 -8182 -6440 -7147 -6831 -7198 -5391 -1354 -418 2545 4262 4515 6613 7028
7524G028K924j337m728k595j851l458K07L731p98J543p60O35N893O51l106K243
$$ 7028 9952 8615 3887 1292 -559 -4017 -3810 -79 -877 666 -94 541 6434 7085 3979 6222
7508F222K214n407k811J78L57q30k932J760K953L57m930k837M496J473l562l381
$$ 6222 8436 3029 218 396 753 -77 -3009 -1249 1704 2061 -2869 -5706 -1210 263 -3299 -6680
7492f680L294L550j606K171K413L078j792m290R92K829m276k953k772L117K329
$$ -6680 -3386 164 -1442 729 3142 6220 4428 138 1130 3959 -317 -3270 -6042 -2925 -596
7477e96L88q25P07K662J388M02j826k516m554L05j126K144J575m82M620m87K05
$$ -596 -208 -1033 -326 2336 3724 4126 2300 -216 -4770 -4465 -5591 -3447 -1872 -2354 2266 1779 1984
7460A984k748K775L500J829l452k964k646K646J375k605j230R11J336q8J808K286
$$ 1984 -764 2011 5511 7340 3888 924 -1722 924 2299 -306 -1536 -625 711 623 2431 4717
7444D717K80K087J136q93m359p7K6k691R14P37K18K028l59n021q18m24k479N26
$$ 4717 4997 7084 8220 7327 2968 2891 2917 226 1140 1877 2095 4123 3764 -1257 -2075 -2499 -4978 -4452
7426d452K424M409L99l147O60J529l335j052Q98p1O74M238K208k9k84o875m21
$$ -4452 -2028 2381 2780 -367 293 1822 -1513 -2565 -1667 -1738 -1064 3174 5382 5353 5069 -1806 -2227
7409b227N240o29k551k069K421M604M258k940l761k842k15M21k26J126l59K486
$$ -2227 3013 2384 -167 -2236 185 4789 9047 6107 2346 -496 -711 -290 -516 610 251 2737
7393B737L594J444n210k291N99n122m15L246K526N725m98n956k926J893M87K22
$$ 2737 6331 7775 2565 274 873 -4249 -4664 -1418 1108 6833 6335 379 -2547 -654 -167 55
7377E5j695M688L41l922n58M16o30N308q9o390l161L50K3J574l82nL447K741L540
$$ 55 -1640 3048 3389 -533 -1091 -675 -1305 4003 3914 -2476 -5637 -5287 -5264 -3690 -4072 -4077 -630 2111 5651
7358E651k199l291l008P30K695n06J914k455K723k258Q37J521L766m176n866Q32
$$ 5651 3452 161 -2847 -2117 578 72 1986 -469 2254 -4 833 2354 6120 1944 -3922 -3090
7342c090P41K999K142j811r36l94Q84j150l345j871l003j356K112K492J47J405
$$ -3090 -2349 650 2792 981 45 -349 535 -615 -3960 -5831 -8834 -10190 -8078 -5586 -5439 -4034
7326d034P35J532r36l079N28L787N876p23k925k356m77J729j796j542K380j390
$$ -4034 -3299 -1767 -2703 -5782 -5254 -1467 4409 3686 761 -1595 -2072 -343 -2139 -3681 -1301 -2691
7310b691k41J076J823K107k24m668k142M352r43L344o9m077j292q64J991q85J289
$$ -2691 -2932 -1856 -33 2074 1850 -2818 -4960 -608 -1551 1793 1724 -2353 -3645 -4509 -2518 -3403 -2114
7293b114q75k47J871k65J31l477j046J161O06n8m805j059N654L354N71M181L990
$$ -2114 -2989 -3236 -1365 -1630 -1499 -4976 -6022 -4861 -4255 -4313 -9118 -10177 -4523 -1169 -598 3583 7573
7276G573k641l873m76K91Q95k64l419m411K2N283N252P72j368l795j203j390J705
$$ 7573 4932 1059 583 874 1769 1505 -1914 -6325 -6303 -1020 4232 5004 3636 -159 -1362 -2752 -1047
7259a047q16K466j701j566J703K404J377j014k703l392k099Q23J247m240K369
$$ -1047 -1863 603 -1098 -2664 -961 1443 2820 1806 -897 -4289 -6388 -5565 -4318 -8558 -6189
7244f189L419M319j53k759J673J005j422l21j261j492j039J102K729J998K944
$$ -6189 -2770 1549 1396 -1363 310 1315 -107 -428 -1689 -3181 -4220 -3118 -389 1609 4553
7229D553K85n102j032M38l7l534R22K240J680r72J311L82j880k471R56J385j4
$$ 4553 4838 -264 -1296 -858 -895 -4429 -3507 -1267 413 -559 752 1134 -746 -3217 -2261 -876 -890
7212h90q80p18l088J812J659j164p02J87J88r41M484K392m960l977M090L970k288
$$ -890 -1770 -2488 -5576 -3764 -2105 -3269 -3971 -3784 -3596 -4537 -53 2339 -2621 -6598 -2508 1462 -826
7195h26K29K507J596r97L30L243m29n984j920O51n70k896L003n56K24L94J805
$$ -826 -597 1910 3506 2509 2839 6082 5653 -331 -2251 -1600 -2170 -5066 -2063 -2619 -2395 -2001 -196
7178a96J489J897J548k755k718K7N89P00K501R4l536L90j940k180j323O7l761
$$ -196 1293 3190 4738 1983 -735 -708 -119 581 3082 3176 -360 30 -1910 -4090 -5413 -5346 -9107
7161i107L691K585l898J110M69j21q57M403M055J743k266l117r49K403K581l578
$$ -9107 -5416 -2831 -6729 -5619 -5150 -5271 -6128 -1725 2330 4073 1807 -1310 -2259 144 2725 -853
7145h53L127k409J250k306l132N10j811k322J202L082K861N14j276N222Q14j573
$$ -853 2274 -135 1115 -1191 -4323 -3813 -5624 -7946 -6744 -3662 -801 -287 -1563 3659 4473 2900
7129B900k34k420k189J060K206m17J608m492K913j64m521p03L794O749k069m137
$$ 2900 2666 246 -1943 -883 1323 906 2514 -1978 935 771 -3750 -4453 -659 6090 4021 -116
7113a16J497l971m434k908M146K088o0P70j901K238P17l076J200P137J028j632
$$ -116 1381 -2590 -7024 -9932 -5786 -3698 -3758 -2988 -4889 -2651 -1934 -5010 -3810 3327 4355 2723
7097B723J518l306M99K357k54n382k329M25L027K262l7J92l177j206p30K102J633
$$ 2723 4241 935 1434 3791 3537 -1845 -4174 -3749 -722 1540 1503 1695 -1482 -2688 -3418 -1316 317
7080C17L772l780k837J960j70Q00J43L31n10j528l85k293o94L546K334N780K95
$$ 317 4089 309 -2528 -568 -738 62 205 536 26 -1502 -1887 -4180 -4874 -1328 1006 6786 7081
7063G081k632M835m486n321K872j294j237k3K58p55N73L834j334p44M97R70k400
$$ 7081 4449 9284 4798 -523 2349 1055 -182 -205 53 -702 -129 3705 2371 1627 2124 3094 694
7046F94M61n91l954M43N00J709M43K501j774j188J544J221j335j472L573P89k497
$$ 694 1155 564 -3390 -2947 -2447 -738 -295 2206 432 -756 788 2009 674 -798 2775 3564 1067
7029A067p37m134l06M527k301n539K81N138O42l051J063O103l059l59n42l720
$$ 1067 330 -3804 -4110 417 -1884 -7423 -7142 -2004 -1362 -4413 -3350 2753 -306 -665 -1207 -4927
7013d927J894K603p70j445K462J023n255k350M74n53p50K897M641n79j575M529
$$ -4927 -3033 -430 -1200 -2645 -183 840 -4415 -6765 -6291 -6844 -7594 -4697 -56 -635 -2210 2319
6997B319q45j187j254L147l02l500m032K687K553l121K875p42j10R68k99k299
$$ 2319 1474 287 -967 2180 1878 -1622 -5654 -2967 -414 -3535 -660 -1402 -1512 -544 -843 -3142
6981c142P27J895K342J337n729k51k092l008k085p71M008L269k863m15L561j530
$$ -3142 -2415 -520 1822 3159 -2570 -2821 -4913 -7921 -10006 -10777 -6769 -3500 -6363 -6778 -3217 -4747
6965d747j54N002M127p55M705J326m650l698J26M659L93J341l6k645n108m206
$$ -4747 -4901 101 4228 3473 8178 9504 4854 1156 1282 5941 6334 7675 7639 4994 -114 -4320
6949d320l15L843K683l70l426J014j258M94J35l87K549l88m877j605M071J533
$$ -4320 -4635 -792 1891 1521 -1905 -891 -2149 -1655 -1520 -1907 642 254 -4623 -6228 -2157 -624
6933f24k873k652L186O660N03l591o3K410q82k634j419J516K47l612j928J092
$$ -624 -3497 -6149 -2963 3697 4200 609 546 2956 2074 -560 -1979 -463 -216 -3828 -5756 -4664
6917d664k561n11O751O213j296l753J141K017k535N07m078k591K415J050k10J89
$$ -4664 -7225 -7736 -985 5228 3932 179 1320 3337 802 1309 -2769 -5360 -2945 -1895 -2105 -1916
6901a916M77K325J186J35Q0n183m055N470M298N78J586K232N01J092l129k939
$$ -1916 -1439 886 2072 2207 2287 -2896 -6951 -1481 2817 3395 4981 7213 7714 8806 5677 2738
6885B738O48J921n045l318P037K540P389M321r396m531k452L04m702j150K8K122
$$ 2738 3386 5307 262 -3056 3981 6521 13910 18231 8835 4304 1852 2156 -2546 -3696 -3668 -1546
6869a546M216o36l058K82j003k043L69J420J20m522P23j249J237M063L560L979
$$ -1546 2670 2034 -1024 -742 -1745 -3788 -3419 -1999 -1879 -6401 -5678 -6927 -5690 -1627 1933 5912
6853E912r23n52k319j771k522j977j592J652k59K148N85J126k56K072R26k279
$$ 5912 4989 4437 2118 347 -2175 -4152 -5744 -4092 -4351 -2203 -1618 -492 -748 1324 2250 -29
6837b9J946K742L715J192j271j099l338k568l286J213k452K468K365K919j146
$$ -29 1917 4659 8374 9566 8295 7196 3858 1290 -1996 -783 -3235 -767 1598 4517 3371
6822C371l895j285K872r24m477K386M473J588J24j814K11k041q38m621K860L124
$$ 3371 -524 -1809 1063 139 -4338 -1952 2521 4109 4233 2419 2630 589 -249 -4870 -2010 1114
6806A114M700j708m941k802J448J568M613J1729M801n88n434k541j299l47J432
$$ 1114 5814 4106 -835 -3637 -2189 -621 3992 15721 20522 19934 14500 11959 10660 10313 11745
6791A1745k70l15L501L220K887m750l426K007M723L148j382J85J491J0157J4851
$$ 11745 11475 11160 14661 17881 20768 16018 12592 14599 19322 22470 21088 21273 22764 32921 47772
6776D7772J6670J4000K487j3794j8399j4212j1791r633l598R1l393j777k877l835
$$ 47772 64442 78442 80929 67135 48736 34524 22733 13100 9502 9593 6200 4423 1546 -2289
6762b289q66j579m94N72J657L054J983M474j100m886J493K528M24m834n318N28
$$ -2289 -3155 -4734 -5228 -4656 -2999 55 2038 6512 5412 526 2019 4547 4971 137 -5181 -4653
6746d653l30j809r16l06N179K416K11l871j824k972j153K043M647J610J373J109
$$ -4653 -4983 -6792 -7708 -8014 -2835 -419 -208 -4079 -5903 -8875 -10028 -7985 -3338 -1728 -355 754
6730G54j021P68K622p38k221k578R50R95j027J254n55n276r56J246K579K729j01
$$ 754 -267 501 3123 2385 164 -2414 -1464 -469 -1496 -242 -797 -6073 -7029 -5783 -3204 -475 -576
6713e76j051K135k298J38J509k333k477J38q67K184L61o84O42M20j879O56q7J517
$$ -576 -1627 508 -1790 -1652 -143 -2476 -4953 -4815 -5682 -3498 -3137 -3821 -3179 -2759 -4638 -3982 -4069 -2552
6695b552o53l98Mo77N067K075l756k658l001j954J331L165J5l151j28M189L996
$$ -2552 -3205 -3603 -3599 -4276 791 2866 -890 -3548 -6549 -8503 -7172 -4007 -3992 -7143 -7271 -3082 914
6678I14K92k971n38n24l67j340l750K148P494K507k272K796k517k699n69j187
$$ 914 1206 -1765 -2303 -2827 -3194 -4534 -8284 -6136 1358 3865 1593 4389 1872 -827 -1396 -2583
6662b583L615M944N72j955m392J54J488j512l330j812L68n41K98K916J926K236
$$ -2583 1032 5976 6548 4593 201 355 1843 331 -2999 -4811 -4443 -4984 -4686 -1770 156 2392
6646B392k361m903r17l362q76K970L682O17L14K173J321p91M61k256k541l290
$$ 2392 31 -4872 -5789 -9151 -10027 -7057 -3375 -2758 -2444 -271 1050 259 720 -1536 -4077 -7367
6630g367R64L282l75k490n475l988J495j673KM740M487J225k475k31j405L095
$$ -7367 -6403 -3121 -3496 -5986 -11461 -15449 -13954 -15627 -15625 -10885 -6398 -5173 -7648 -7879 -9284 -6189
6614f189M192K690j276k513k078M349M29J291K540K611J86o05j610k921n22p21
$$ -6189 -1997 693 -583 -3096 -5174 -825 -396 895 3435 6046 6232 5627 4017 1096 574 -147
6598a47q13K665L81k451r56l179J318L256Q49K80q9m053j985K48J067l42l260
$$ -147 -960 1705 2086 -365 -1321 -4500 -3182 74 923 1203 1114 -2939 -4924 -4676 -3609 -3951 -7211
6581g211Q44L960L600k044J832J233L201L485K46k154k899m855K938j262j361
$$ -7211 -6367 -2407 1193 -851 981 2214 5415 8900 9146 6992 4093 -762 2176 914 -447
6566d47m20l460k210K58Q99l224l32N124k316m590M04L779M718K193m194K000
$$ -447 -867 -4327 -6537 -6279 -5380 -8604 -8936 -3812 -6128 -10718 -10314 -6535 -1817 376 -3818 -1818
6550a818K163k273l553j254j249J681J321j74q91L280K070j101M60n52l237K559
$$ -1818 345 -1928 -5481 -6735 -7984 -6303 -4982 -5156 -6047 -2767 -697 -1798 -1338 -1890 -5127 -2568
6534b568J37j052J438l335j817J999L676N88k277K365o289k586j754k631J07J869
$$ -2568 -2431 -3483 -2045 -5380 -7197 -5198 -1522 -934 -3211 -846 -7135 -9721 -11475 -14106 -13999 -12130
6518a2130L417Q90K273M494J408Q2j371M57J34j16j951j688l17l226K851R48j20
$$ -12130 -8713 -7823 -5550 -1056 352 434 -937 -480 -346 -462 -2413 -4101 -4418 -7644 -4793 -3845 -3965
6501c965N54l416Q7j669J131J082k943m165j434M553L573K537m26J84M98j299
$$ -3965 -3411 -6827 -6740 -8409 -7278 -6196 -9139 -13304 -14738 -10185 -6612 -4075 -4501 -4317 -3819 -5118
6485e118j855k897M53L127K858k590m972k20L121J900N68M088P159O391j936p185
$$ -5118 -6973 -9870 -9417 -6290 -3432 -6022 -10994 -11214 -8093 -6193 -5625 -1537 5622 12013 10077 2892
6469B892k023K337m00l9L09l656l479n83N735l323R99N183j678k833j803k003
$$ 2892 869 3206 2806 2767 3076 -580 -4059 -4642 1093 -2230 -1231 3952 2274 -559 -2362 -4365
6453d365n3Q70K694k334l914n41K429K46J624K573k310K010K183j671n006j254
$$ -4365 -4418 -3548 -854 -3188 -7102 -7643 -5214 -4968 -3344 -771 -3081 -1071 1112 -559 -5565 -6819
6437f819L320M792l259l091N14J17n44j653K164K947j670m031J564J684l64j032
$$ -6819 -3499 1293 -1966 -5057 -4543 -4426 -4970 -6623 -4459 -1512 -3182 -7213 -5649 -3965 -4329 -5361
6421e361l9L42K039K199J037r20k525J730K676J125o442n397p32K53K362J901
$$ -5361 -5400 -5058 -3019 -820 217 -703 -3228 -1498 1178 2303 -4139 -9536 -10268 -10015 -7653 -5752
6405e752R72M028j071l807J788K432P36o52l896J69J18J107L66J596o28K997J389
$$ -5752 -4780 -752 -1823 -5630 -3842 -1410 -674 -1326 -5222 -5053 -4935 -3828 -3462 -1866 -2494 503 1892
6388A892R01nl057m13K803m700j240N19K161J925P15N99M421L420j897l440l944
$$ 1892 2793 2788 -269 -682 2121 -2579 -3819 -3300 -1139 786 1501 2100 6521 9941 8044 4604 660
6371F60q50K600l444k089K160m39l234j040K533M6k408o26j169k980j269N03N040
$$ 660 -190 2410 -1034 -3123 -963 -1402 -4636 -5676 -3143 -3097 -5505 -6131 -7300 -10280 -11549 -11046 -6006
6354f006M393q36K652L397p40m463J1J868J54J542p13m023l192K812J449rl806
$$ -6006 -1613 -2449 203 3600 2860 -1603 -1592 276 430 1972 1259 -2764 -5956 -3144 -1695 -1704 -5510
6337e510N36K598Q38k75j563k347l6j288k030L17K634L144Q71L951K545r80Q31
$$ -5510 -4974 -2376 -1538 -1813 -3376 -5723 -5759 -7047 -9077 -8760 -6126 -2982 -2111 1840 4385 3405 4236
6320D236Q02J753j449K6q09m295k52j974j787k388J387Q79j634l12o37n31j644
$$ 4236 5038 6791 5342 5368 4559 264 12 -1962 -3749 -6137 -4750 -3871 -5505 -5817 -6454 -6985 -8629
6303h629K753l29J71j232l837K03L243M444j991m591J661K419K688R19K546J262
$$ -8629 -5876 -6205 -6034 -7266 -11103 -10900 -7657 -3213 -5204 -9795 -8134 -5715 -3027 -2108 438 1700
6287A700q34l299n032L161K955K119N03M8j639r27n92k371l584L256N532O33J716
$$ 1700 866 -2433 -7465 -4304 -1349 770 1273 1321 -318 -1245 -1837 -4208 -7792 -4536 996 1629 3345
6270C345P98m073k240m280n722K221K525M976K418k84j755l151j662j966K679
$$ 3345 4143 70 -2170 -6450 -12172 -9951 -7426 -2450 -32 -316 -2071 -5222 -6884 -8850 -6171
6255f171L705M570l472n472K342N146l12j005L365Q36j218j632m132j228j211
$$ -6171 -2466 2104 -1368 -6840 -4498 648 336 -669 2696 3532 2314 682 -3450 -4678 -5889
6240e889K239O958K096P50j576P01k722o348j611L634o79K75J346m834l149P83
$$ -5889 -3650 3308 5404 6154 4578 5279 2557 -3791 -5402 -1768 -2447 -2172 -826 -5660 -8809 -8026
6224h026L070M671q98j7j281k557M684j02k786K643m433o97M314J611K909k104
$$ -8026 -4956 -285 -1183 -1200 -2481 -5038 -354 -456 -3242 -599 -5032 -5729 -1415 196 3105 1001
6208A001J227J983j407o27l91J310k180M36K898j734k735j703l362J828K057J839
$$ 1001 2228 4211 2804 2177 1786 3096 916 1352 4250 2516 -219 -1922 -5284 -3456 -1399 440
6192D40J74M28o36j758k279j81M795J989l630l78L32o86k846j132J427J977p7
$$ 440 614 1042 406 -1352 -3631 -3812 983 2972 -658 -1036 -704 -1390 -4236 -5368 -3941 -1964 -2041
6175b041l615K040k572m479J182J338L667K10j896k343k561P80l52Q99N74J46
$$ -2041 -5656 -3616 -6188 -10667 -9485 -8147 -4480 -4270 -6166 -8509 -11070 -10290 -10642 -9743 -9169 -9023
6159i023J273J409O795K81p87J597P38l675M092k37n982K568L188K784p21l705
$$ -9023 -7750 -6341 454 735 -52 1545 2283 -1392 2700 2463 -3519 -951 2237 5021 4300 595
6143E95m60j516k379L145J663O62k02o34J601K902k561j451l624k593q49n06K868
$$ 595 135 -1381 -3760 -615 1048 1710 1508 874 2475 5377 2816 1365 -2259 -4852 -5701 -6207 -3339
6126c339J196k406L211O49k024k946q50K160M81j971l564L296Q63j153r41j105
$$ -3339 -2143 -4549 -1338 -689 -2713 -5659 -6509 -4349 -3868 -5839 -9403 -6107 -5244 -6397 -7338 -8443
6110h443J192L459N276j542k359o144K521k896K657K010j753k643L411Q90J119
$$ -8443 -7251 -3792 1484 -58 -2417 -8561 -6040 -8936 -6279 -4269 -6022 -8665 -5254 -4364 -3245
6095c245j35n10j14O07J159K045J281Q94r48j635L276J365j697J80J239p9K818
$$ -3245 -3380 -3890 -4004 -3397 -2238 -193 1088 1982 1034 -601 2675 4040 2343 2523 3762 3683 6501
6078F501K7j072m339k325l089K610L846M923N48o536o242R93O050m92m77k05k248
$$ 6501 6528 5456 1117 -1208 -4297 -1687 2159 7082 7630 1094 -5148 -4155 1895 1403 926 721 -1527
6061a527L246L302l577k279K30N287k104m721j903J037K817n37K08l55k047L42
$$ -1527 1719 5021 1444 -835 -605 4682 2578 -2143 -4046 -3009 -192 -729 -521 -876 -2923 -2581
6045b581K581M102k636j741n831q72J162J073o4R64J216j706m243l779J356M884
$$ -2581 0 4102 1466 -275 -6106 -6978 -5816 -4743 -4807 -3843 -2627 -4333 -8576 -12355 -10999 -6115
6029f115L194L056J355l186J315J264q30J792j603m728k186p06L252l832m474
$$ -6115 -2921 135 1490 -1696 -381 883 53 1845 242 -4486 -6672 -7378 -4126 -7958 -12432
6014a2432M468J200N403j546k969k201K827L062R69L198M6k438n661l492n00L112
$$ -12432 -7964 -6764 -1361 -2907 -5876 -8077 -5250 -2188 -1219 1979 2025 -413 -6074 -9566 -10066 -6954
5998f954K887L86j803j066l215j970K636Q770j33n27j664M1K055J63J37J032L386
$$ -6954 -4067 -3681 -5484 -6550 -9765 -11735 -9099 -329 -462 -989 -2653 -2612 -557 -394 -257 775 4161
5981D161P78L04O49k075J124N0N23o14j387L890L307k476j964l992l308m836j191
$$ 4161 4939 5243 5892 3817 4941 4991 5514 4900 3513 7403 10710 8234 6270 2278 -1030 -5866 -7057
5964g057o49L093L397N7j720q86K524j012l469r81M752L828k165l06J759k089
$$ -7057 -7706 -4613 -1216 -1159 -2879 -3765 -1241 -2253 -5722 -6703 -1951 1877 -288 -594 1165 -924
5948i24k237n20P28k267k756n165P10L387M411L062N85J018R82J945k112j580
$$ -924 -3161 -3681 -2953 -5220 -7976 -13141 -12431 -9044 -4633 -1571 -986 32 1014 2959 847 -733
5932g33M198J753l656m841M66J363K473L869m52j095j170k665M813K888j300k857
$$ -733 3465 5218 1562 -3279 -2813 -1450 1023 4892 4440 3345 2175 -490 4323 7211 5911 3054
5916C054m283J403J108k432k535m211J106N808o63j485q10l32l026k018J777m360
$$ 3054 -1229 174 1282 -1150 -3685 -7896 -6790 -982 -1645 -3130 -3940 -4272 -7298 -9316 -7539 -11899
5900a1899j529O230M429R13j38L149P70k23p61j548K933j750j415M393j39j602
$$ -11899 -13428 -7198 -2769 -1856 -1994 1155 1925 1702 941 -607 2326 576 -839 3554 3415 1813
5884A813J928m5K068l546j062J633l833J415r26m710K571K995j922k37J682M310
$$ 1813 3741 3696 5764 2218 1156 2789 -1044 371 -555 -5265 -2694 301 -1621 -1858 -176 4134
5868D134K834o51k004k851j377L027P12O01l04j694m490o79K887m0j213l769l099
$$ 4134 6968 6317 4313 1462 85 3112 3824 4425 4121 2427 -2063 -2742 145 105 -1108 -4877 -7976
5851g976J353K13M573L273p73R63j551k656j882J548r86K999K009j095R99J500
$$ -7976 -6623 -6410 -1837 1436 663 1626 75 -2581 -4463 -2915 -3901 -902 1107 12 1011 2511
5835B511J412l274J151j283J797N84l33n32J770j209o844k196l033j391P228M521
$$ 2511 3923 649 1800 517 2314 2898 2565 2033 3803 2594 -4250 -6446 -9479 -10870 -3642 879
5819H79m49L754j617p430l008L279L921K692K669J640k371J504j332l852N40j416
$$ 879 430 4184 2567 -4863 -7871 -4592 -671 2021 4690 6330 3959 5463 4131 279 819 -597
5803e97m200J554O52r97R04K20j688q0l7J408Q23L897k491q57O030K597n236n557
$$ -597 -4797 -3243 -2591 -3588 -2684 -2464 -4152 -4232 -4269 -2861 -2038 1859 -632 -1489 4541 7138 1902 -3655
5785c655n9m1J763k141J108K8m98l662l64K111M569j342m735L416L98j825l886
$$ -3655 -3714 -3755 -1992 -4133 -3025 -2997 -3495 -7157 -7521 -5410 -841 -2183 -6918 -3502 -3104 -4929 -8815
5768h815q99M185L380M49q2j454m380j336J849O59j386J877J573n861j206L97
$$ -8815 -9714 -5529 -2149 -1700 -1782 -3236 -7616 -8952 -7103 -6444 -7830 -5953 -4380 -10241 -11447 -11050
5752a1050J392K340L473K764M33J676j129j132l326J777l68m375q01K056j353
$$ -11050 -9658 -7318 -3845 -1081 -648 1028 -101 -1233 -4559 -2782 -3150 -7525 -8326 -6270 -7623
5737g623j686k212j267K164O492J343J046j387J628Q23j44j786j331l403O21O32
$$ -7623 -9309 -11521 -12788 -10624 -4132 -2789 -1743 -3130 -1502 -679 -823 -2609 -3940 -7343 -6722 -6090
5721f090J340M137K407k86k893k331m80J962K744j945k296m70m2L684m273m661
$$ -6090 -4750 -613 1794 1508 -1385 -3716 -4196 -2234 510 -1435 -3731 -4201 -4243 -559 -4832 -9493
5705i493J388k96K565M094N884j378n663l654j55k155L787N299M743j763m988
$$ -9493 -8105 -8401 -5836 -1742 4142 2764 -2899 -6553 -6708 -8863 -5076 223 4966 3203 -1785
5690a785j010P83K873J905k724l681K319M986n69m358l395q38N14N554M796L320
$$ -1785 -2795 -2012 861 2766 42 -3639 -1320 3666 3097 -1261 -4656 -5494 -4980 574 5370 8690
5674H690k520m432l77N07P48p73j625o23j041N80J978j464Q26J196L915K707K366
$$ 8690 6170 1738 1361 1868 2616 1843 218 -405 -1446 -866 1112 -352 474 1670 5585 8292 10658
5657A0658j395l879l736L46q95n47k32r5l034j876J169k80o91J931K645L152j316
$$ 10658 9263 5384 1648 1994 1099 552 320 225 -2809 -4685 -3516 -3796 -4487 -2556 89 3241 1925
5640A925k74R47r42Q3l788j803k56j204L688J516l400K75J872L991j11j382K39
$$ 1925 1651 2598 1656 1739 -2049 -3852 -4108 -5312 -1624 -108 -3508 -3233 -1361 2630 2519 1137 1376
5623A376Q29l910l053P42k3q99J143L174o9k096m50L30N17k393p26n09M76L934
$$ 1376 2205 -1705 -4758 -4016 -4039 -4938 -3795 -621 -690 -2786 -3236 -2906 -2389 -4782 -5508 -6017 -5541 -1607
5605a607L720j253n540l773L24l973K372M718O459J483k243k012j263K032p77
$$ -1607 2113 860 -4680 -8453 -8129 -12102 -9730 -5012 1447 2930 687 -1325 -2588 -556 -1333
5590a333k270L106J560q86l133o77L485K25n738o952J159O653P141R4m984j156
$$ -1333 -3603 -497 1063 177 -2956 -3633 -148 77 -5661 -12613 -11454 -4801 2340 2434 -2550 -3706
5574c706j263J576L276m807l98J768K374L097m62J714p52k803K70M176Q97PK55
$$ -3706 -4969 -3393 -117 -4924 -5322 -3554 -1180 1917 1455 3169 2417 -386 -116 4060 4957 4964 5219
5557E219o2p32p01l106m364O43Q09j892o41j915K24O517L635J48j312k043J209
$$ 5219 5157 4425 3724 618 -3746 -3103 -2294 -4186 -4827 -6742 -6518 -1 3634 3782 2470 427 1636
5540A636L98N987k544l572r58J052k934R98J520l184j328J134M87J155K001L042
$$ 1636 2034 8021 5477 1905 947 1999 -935 63 1583 -1601 -2929 -1795 -1308 -153 1848 4890
5524D890K096r30l439R11k007l553l39K49j667k74M374N564q16l852n69J160k207
$$ 4890 6986 6056 2617 3528 1521 -2032 -2371 -2122 -3789 -4063 311 5875 5059 1207 638 1798 -409
5507d09l592k114oL258Q23j026k215j159P77J595R68L316L432K737k895k269J846
$$ -409 -4001 -6115 -6121 -2863 -2040 -3066 -5281 -6440 -5663 -4068 -3100 216 3648 6385 3490 1221 3067
5490C067O21l002R79l714j273m40K706K449j442m084k913K420R12q70r0l070L826
$$ 3067 3688 686 1665 -2049 -3322 -3762 -1056 1393 -49 -4133 -7046 -4626 -3714 -4584 -4674 -7744 -3918
5473c918M022j924j30J784L234K898q81l099J422n979k830P35N638l35J23l28
$$ -3918 104 -1820 -1950 -166 3068 5966 5085 1986 3408 -2571 -5401 -4666 972 637 760 432
5457D32M58kl697J729j011m969l608m09P78L809M077j204j246J318j960p48L754
$$ 432 890 888 -2809 -1080 -2091 -7060 -10668 -11077 -10299 -6490 -2413 -3617 -4863 -3545 -5505 -6253 -2499
5440b499M272R35l873j501j043J293L142L507L513M23n64Q97j966m005m990l132
$$ -2499 1773 2708 -1165 -2666 -3709 -2416 726 4233 7746 8169 7605 8502 6536 2531 -2459 -5591
5424e591N60N69J065N99L635O7j307P14O77P81K4j991l470J956K219J99j607n21
$$ -5591 -5031 -4462 -3397 -2798 837 904 -403 311 988 1769 1793 -198 -3668 -1712 507 706 -901 -1422
5406a422j358O74M288K373m768J157L237l17L451L548l176k174m242m713r15J472
$$ -1422 -2780 -2106 2182 4555 -213 944 4181 3864 7315 10863 7687 5513 1271 -3442 -4357 -2885
5390b885K078K896K35j731J185k612l091K645L754r64j949l07J633k06m61L549
$$ -2885 -807 2089 2324 593 1778 -834 -3925 -1280 2474 1510 -439 -746 887 681 220 3769
5374C769K140R78l827j635l442j472k347Q28M09K811N3m528R50K916J851k038
$$ 3769 5909 6887 3060 1425 -2017 -3489 -5836 -5008 -4599 -1788 -1735 -6263 -5313 -2397 -546 -2584
5358b584l234K104L970l796l798K181O497L562o534q62K99l410p09j262K260L626
$$ -2584 -5818 -3714 256 -3540 -7338 -5157 1340 4902 -1632 -2494 -2195 -5605 -6314 -7576 -5316 -1690
5342a690l74M982K201k464j965O11o15l972K362l933l19Q92l721k14p92L842O681
$$ -1690 -2064 2918 5119 2655 690 1301 686 -3286 -924 -4857 -5176 -4284 -8005 -8219 -9011 -5169 1512
5325A512n98l040J719O61r17j246K903M67o281j169J880K622K811J9m941l248
$$ 1512 914 -2126 -407 254 -663 -1909 994 1461 -4820 -5989 -4109 -1487 1324 1343 -3598 -6846
5309f846j569j020K097K518O05J984Q12r28N45P54J070K816k806m055j645K361
$$ -6846 -8415 -9435 -7338 -4820 -4215 -2231 -1419 -2347 -1802 -1048 22 2838 32 -4023 -5668 -3307
5293c307j330k853J727J842K958k804K519N20j599L029L711l016m040j277M281
$$ -3307 -4637 -7490 -5763 -3921 -963 -3767 -1248 -728 -2327 702 4413 1397 -2643 -3920 361
5278C61N318M334q44k107o97o004k767M075k713j590K759K491l045K188K857j893
$$ 361 5679 10013 9169 7062 6365 361 -2406 1669 -1044 -2634 125 2616 -429 1759 4616 2723
5262B723r24k02q01N0k204j282M117K463p98J670J623m15k85m641j960k40Q94
$$ 2723 1799 1597 796 846 -1358 -2640 1477 3940 3142 4812 6435 6020 5735 1094 -866 -1106 -212
5245b12k150k436k348o72M34M05j397K642L824j835J402L568L68l43K828m43k980
$$ -212 -2362 -4798 -7146 -7818 -7384 -6979 -8376 -5734 -1910 -3745 -2343 1225 1593 1250 4078 3635 655
5228F55O4j53O93J61K007N32o63J255J856l521n227k321l621L69J684J307J957
$$ 655 719 566 1259 1420 3427 3959 3296 4551 6407 2886 -2341 -4662 -8283 -7914 -6230 -4923 -2966
5211b966R49L601M698j577l966j254J625jj640j084j799n452l319N076M364L761
$$ -2966 -2017 1584 6282 4705 739 -515 1110 1109 -531 -1615 -3414 -8866 -12185 -7109 -2745 1016
5195A016L791j243m000L70q74j796k586Q48M005N69r96K357K312M074O72k309
$$ 1016 4807 3564 -436 -66 -940 -2736 -5322 -4474 -469 100 -896 1461 3773 7847 8519 6210
5179F210k323l034j109K532r7j390P83L16j286j682k001J176M85J460M665j350
$$ 6210 3887 853 -256 2276 2179 789 1572 1888 602 -1080 -3081 -1905 -1420 40 4705 3355
5163C355m868l304K579L849K051O748J821l818p189p462NL963M246L559L426j117
$$ 3355 -1513 -4817 -2238 1611 3662 10410 12231 8413 1224 -6238 -6233 -2270 1976 5535 8961 7844
5147G844p098n706l59J857L522L275K794K115k085l399m96j849m337k01J334n92
$$ 7844 746 -4960 -5319 -3462 60 3335 6129 8244 6159 2760 2264 415 -3922 -4123 -2789 -3381
5131c381J487j651J070L372j336J073L881R99j421m327k042n400j809J495J415
$$ -3381 -1894 -3545 -2475 897 -439 634 4515 5514 4093 -234 -2276 -7676 -9485 -7990 -6575
5116f575L476K764P04M75M112J685K701k067l444k128k250j312K711K316n43K868
$$ -6575 -3099 -335 369 844 4956 6641 9342 7275 3831 1703 -547 -1859 852 3168 2625 5493
5100E493Q45m653k927qJ510O31k93J629k184K290J534r74L865J799j921j542k071
$$ 5493 6338 1685 -1242 -1250 260 891 598 2227 43 2333 3867 2893 6758 8557 6636 5094 3023
5083C023K178K30j909m675k902p38J252K713n05n8M343j949P02P7k16m515P53
$$ 3023 5201 5431 3522 -1153 -4055 -4793 -3541 -828 -1333 -1391 2952 1003 1705 1782 1566 -2949 -2196
5066b196L275J364l877l293K057j991k378K178L190N000l295o482l842J595K688
$$ -2196 1079 2443 -1434 -4727 -2670 -4661 -7039 -4861 -1671 3329 34 -6448 -10290 -8695 -6007
5051f007P22J870k88l695O50J167O892Q65J438M601J855j642m720k628j424p16
$$ -6007 -5285 -3415 -3703 -7398 -6748 -5581 1311 2176 3614 8215 10070 8428 3708 1080 -344 -1060
5035a060j098k084L035K80K964P70r137m46O553K522M65J739l121k489j316O57
$$ -1060 -2158 -4242 -1207 -927 2037 2807 -6330 -6776 -223 2299 2764 4503 1382 -1107 -2423 -1766
5019a766J137j536J263P25N10L142K04j42j842J281k134l138m085j73L496K113
$$ -1766 -629 -2165 -902 -177 333 3475 3679 3537 1695 2976 842 -2296 -6381 -6554 -3058 -945
5003i45j625j798j340K225m96j904M75O15L046j234N4J120q24P56k08j186L117
$$ -945 -2570 -4368 -5708 -3483 -3979 -5883 -5408 -4793 -1747 -2981 -2927 -1807 -2631 -1875 -2083 -3269 -152
4986a52n037k175P26O579K796J285j206l266k662m93k811M24M556k06J381l112
$$ -152 -5189 -7364 -6638 -59 2737 4022 2816 -450 -3112 -3605 -6416 -5992 -1436 -1642 -261 -3373
4970c373j188L874J856K362p39j483m66K484k952l43k90L25J792k392M148K485
$$ -3373 -4561 -687 1169 3531 2792 1309 843 3327 375 32 -258 67 1859 -533 3615 6100
4954F100k855k357J159k064p010k642n78L945M424J120j108J584j602l933J528
$$ 6100 3245 888 2047 -17 -7027 -9669 -10247 -6302 -1878 -758 -1866 -282 -1884 -5817 -4289
4939d289l71J049j08p57l238l422K311L085J698k253O62K392N883l34N5J36j143
$$ -4289 -4660 -3611 -3719 -4476 -7714 -11136 -8825 -5740 -4042 -6295 -5633 -3241 2642 2308 2363 2499 1356
4922A356K051L970P21m031l418J251M125J93j898n639O33J041J161j37P49k095
$$ 1356 3407 7377 8098 4067 649 1900 6025 6218 4320 -1319 -686 355 1516 1379 2128 33
4906C3K266j399j317j251O79n051L0j926L364L912K21L438n705l745L477M52j811
$$ 33 2299 900 -417 -1668 -989 -6040 -6010 -7936 -4572 -660 -439 2999 -2706 -6451 -2974 -2522 -4333
4889d333j17k448K077L336q81R42J224K077j835J89k141j63J271K291j47k714
$$ -4333 -4450 -6898 -4821 -1485 -2366 -1424 -200 1877 42 231 -1910 -2073 -802 1489 1342 -1372
4873a372Q5q30J733QK46M18J772J489m069o58M00J259q47k660k544K714L135k93
$$ -1372 -1287 -2117 -384 -376 -130 288 2060 3549 -520 -1178 -778 481 -366 -3026 -5570 -2856 279 -14
4855a4N72j142J200o10j900j245k15n16o88P85J362J908K8J382L46o110K43k154
$$ -14 558 -584 616 6 -1894 -3139 -3354 -3870 -4558 -3773 -2411 -503 -475 907 1253 -4857 -4614 -6768
4837f768j12m6K522j640m44J634K379L286J778l195m999j120J205L717K47J195
$$ -6768 -6880 -6926 -4404 -6044 -6488 -4854 -2475 811 2589 -606 -5605 -6725 -5520 -1803 -1556 -361
4821c61M70L88J359r41j515m329K306M134K544k442P32M736O54J985o18l416l009
$$ -361 109 497 1856 915 -600 -4929 -2623 1511 4055 1613 2345 7081 7735 9720 9102 5686 2677
4804B677O16J30m954k943P19K086K711J790o99j567O75p27L25m966J097M439K550
$$ 2677 3293 3423 -1531 -4474 -3755 -1669 1042 2832 2133 566 1241 514 839 -4127 -3030 1409 3959
4787C959j099m174l755J036P97L913j412K85J31j928J165K322O42j685k299P37
$$ 3959 2860 -1314 -5069 -4033 -3236 677 -735 -450 -319 -2247 -1082 1240 1882 197 -2102 -1365
4771a365k3K170j368J65m59K603j043j066n1J774K691j991m06J199K83P12K206
$$ -1365 -1388 782 -586 -421 -880 1723 680 -386 -437 1337 4028 2037 1631 2830 3113 3825 6031
4754F031l147l560p05L409j300J039k769J809J843j371l303J725J282o61K072
$$ 6031 2884 -676 -1381 2028 728 1767 -1002 807 2650 1279 -2024 -299 983 322 2394
4739B394J700j537L1O31Q11k962k089l111K106R51l97M099L560L133m009n287
$$ 2394 4094 2557 2588 3219 4030 1068 -1021 -4132 -2026 -1075 -1472 2627 6187 9320 5311 24
4723B4j360k821Q16K769M16K193l87J076j315o781L409K143j953O42M57M11j855
$$ 24 -1336 -4157 -3341 -572 -156 2037 1650 2726 1411 -5370 -1961 182 -1771 -1129 -672 -261 -2116
4706b116O38k25l637k556M168l57O2j587k25L43J383R76j329M798K510k492M8
$$ -2116 -1478 -1703 -5340 -7896 -3728 -4085 -4023 -5610 -5835 -5492 -4109 -3133 -4462 336 2846 354 402
4689D02P6J588m62m442j541J452p58k901K269Q4m44L786k759o204k57J954n94
$$ 402 478 2066 1604 -2838 -4379 -2927 -3685 -6586 -4317 -4233 -4677 -891 -3650 -9854 -10111 -8157 -8751
4672h751l165m26N310M000J363k888j881L428Q70q24j217Q75k327q80L156j567
$$ -8751 -11916 -12342 -7032 -3032 -1669 -4557 -6438 -3010 -2140 -2964 -4181 -3306 -5633 -6513 -3357 -4924
4656d924o42M018N487M257J065k342l762J808n07k622k821N97j85l760l328L702
$$ -4924 -5566 -1548 3939 8196 9261 6919 3157 4965 4458 1836 -985 -388 -573 -4333 -7661 -3959
4640c959M228L155j145l277j056L714K213k171l748k403J150k313K743j299n26
$$ -3959 269 3424 2279 -998 -2054 1660 3873 1702 -2046 -4449 -3299 -5612 -2869 -4168 -4694
4625d694R02j658j572J832L639J746m41k234M25p92k688O97J48q98L031K010K376
$$ -4694 -3792 -5450 -7022 -5190 -1551 195 -246 -2480 -2055 -2847 -5535 -4838 -4690 -5588 -2557 -547 1829
4608A829K704l233n918j686J89K141K831l12l287j621j018L715J779j103L965
$$ 1829 4533 1300 -4618 -6304 -6115 -3974 -1143 -1455 -4742 -6363 -7381 -3666 -1887 -2990 975
4593I75j144k178l47L51l159L504j239M85r75l101L09N288K465o6L319j97m354
$$ 975 -169 -2347 -2694 -2343 -5502 -1998 -3237 -2752 -3727 -6828 -6519 -1231 1234 1168 4487 4290 -64
4576f4j659K120M282L402M24j897j085k20n83o01J582o68k560j35p40m35k421
$$ -64 -1723 397 4679 8081 8505 6608 5523 5303 4720 4119 5701 5033 2473 2338 1598 1163 -1258
4559a258J050K427m713K092L830l41j974j442k257K03n81K166R62J320J409q35
$$ -1258 -208 2219 -2494 -402 3428 3087 1113 -329 -2586 -2383 -2964 -798 164 1484 2893 2058
4543B058J421l530m595M98M815N046L521k612j384j151O8J05k851j263R02R93
$$ 2058 3479 -51 -4646 -4148 667 5713 9234 6622 5238 4087 4155 4260 1409 146 1048 2041
4527B041M393N46J492q67n003m487J63K72j520J058j889j42J016K140k138K99
$$ 2041 6434 6980 8472 7605 2602 -1885 -1722 -1450 -2970 -1912 -3801 -3943 -2927 -787 -2925 -2626
4511b626L288P4J914J063J177r96K760Q93k036k938l509k564K06L289J738k569
$$ -2626 662 736 2650 3713 4890 3894 6654 7547 5511 2573 -936 -3500 -3294 -5 1733 -836
4495h36r65J270M011K707M77l161k537L976O544j349o041L42L14l704p44k620
$$ -836 -1801 -531 3480 6187 6664 3503 966 4942 11486 10137 4096 4438 4752 1048 304 -2316
4479b316q6J107J939P81J764J409m977j796p79O95Q497j86l967J805J298J190
$$ -2316 -2402 -1295 644 1425 3189 4598 -379 -2175 -2954 -2259 6238 6052 2085 3890 5188 6378
4463F378j032l390M112N62k815J767j503J587q06l322k376K06r0k383K046L766
$$ 6378 5346 1956 6068 6630 3815 5582 4079 5666 4860 1538 -838 -632 -722 -3105 -1059 2707
4447B707l100Q03j663k661N311K806l471k889K73j206J005J927r75j734K293p08
$$ 2707 -393 410 -1253 -3914 1397 4203 732 -2157 -1884 -3090 -2085 -158 -1133 -2867 -574 -1282
4431a282n120K949O051L336r95n040l334J998j457l382J492J29K347J635L884
$$ -1282 -6402 -3453 2598 5934 4939 -101 -3435 -1437 -2894 -6276 -4784 -4655 -2308 -673 3211
4416C211j446R85k388o925L752M953P29p22j67j914K336O76K081p89n042l251
$$ 3211 1765 2750 362 -6563 -2811 2142 2871 2149 1982 68 2404 3080 5161 4372 -670 -3921
4400c921l75k398n312p58M85M240N900N399j93l911k840K853j331q93J424L766
$$ -3921 -4296 -6694 -12006 -12764 -12279 -8039 -2139 3260 3067 -844 -3684 -831 -2162 -3055 -1631 2135
4384B135O008k480R04M68j106k834m123k25m66K213l54j741m637j766L550k962
$$ 2135 8143 5663 6567 7035 5929 3095 -1028 -1253 -1719 494 140 -1601 -6238 -8004 -4454 -7416
4368g416k68L634O0J504M70k236k114J843m39k382N500K216j541O38j377k304
$$ -7416 -7684 -4050 -3990 -2486 -2016 -4252 -6366 -4523 -4962 -7344 -1844 372 -1169 -531 -1908 -4212
4352d212N062j621k073o99K370j751j582j568N544L782r99O28m910l305M234J457
$$ -4212 850 -771 -2844 -3543 -1173 -2924 -4506 -6074 -530 3252 2253 2881 -2029 -5334 -1100 357
4336C57p061L93rJ810n391o17M489K33L629P68N629J559j976k24n6L27j124r51
$$ 357 -6704 -6311 -6320 -4510 -9901 -10518 -6029 -5796 -2167 -1399 4230 5789 3813 3589 3533 3860 2736 1785
4318A785k031k09p13j47l553l168M116L346l542P9M199O1m958n80L014M91J741
$$ 1785 -246 -455 -1168 -1315 -4868 -8036 -3920 -574 -4116 -4037 162 223 -4735 -5315 -2301 -1810 -69
4301f9M084K791j420m662l499R34Q13j203k897K647J651L207m356j958P23r73
$$ -69 4015 6806 5386 724 -2775 -1841 -1028 -2231 -5128 -2481 -830 2377 -1979 -3937 -3214 -4187
4285d187J492n53k96j741L535K340r53J106j887J152o418l837k83K118R84L757
$$ -4187 -2695 -3248 -3544 -5285 -1750 590 -363 743 -1144 8 -6410 -10247 -10530 -8412 -7428 -3671
4269c671J434l8m62k530K170L034K258N14j501L22m39j89j387n65j679l19l262
$$ -3671 -2237 -2275 -2737 -5267 -3097 -63 2195 2709 1208 1530 1091 902 -485 -1050 -2729 -3048 -6310
4252f310J710J324l748m91K231M928O495K692j98l628K72J913k884K415n68l159
$$ -6310 -4600 -3276 -7024 -7515 -5284 -356 6139 8831 8633 5005 5277 7190 4306 6721 6153 2994
4236B994l219l943K268L926L778L696J858k751n580o01j77Q16j583j486L653N16
$$ 2994 -225 -4168 -1900 2026 5804 9500 11358 8607 3027 2426 2249 3065 1482 -4 3649 4165
4220D165K249J909m701n852j391N89j002K552K558j950n39k16j645K319M080j882
$$ 4165 6414 8323 3622 -2230 -3621 -3032 -4034 -1482 1076 -874 -1413 -1629 -3274 -955 3125 1243
4204A243j545L323m91o692l479N631Q442K328k834l732O79J160l909M34N41j517
$$ 1243 -302 3021 2530 -4162 -7641 -2010 6432 8760 5926 2194 2873 4033 124 558 1099 -418
4188d18j616p37k966R67R75k133J249O754k97j948J254J830K763r8l824k221K85
$$ -418 -2034 -2771 -5737 -4770 -3795 -5928 -4679 2075 1778 -170 1084 2914 5677 5579 1755 -466 -181
4171a81k17M302l74o513j170j240j128N66J831J407N33J993N19J508K952n878
$$ -181 -398 3904 3530 -2983 -4153 -5393 -6521 -5955 -4124 -2717 -2184 -191 328 1836 4788 -1090
4155a090j920J914j228J701Q67k746k540j327K849L683p07j676k660k118J109
$$ -1090 -3010 -1096 -2324 -623 244 -2502 -5042 -6369 -3520 163 -544 -2220 -4880 -6998 -5889
4140e889K618M233R69J529n775n401j463j936N14L049j73K73N91J365J687L692
$$ -5889 -3271 962 1931 3460 -2315 -7716 -9179 -11115 -10601 -7552 -7725 -7452 -6861 -5496 -3809 -117
4124a17N003k3n70O85o6K31J819L63L457j094m403j41j202j724J037M358j682
$$ -117 4886 4863 4293 4978 4912 5143 6962 7325 10782 9688 5285 5144 3942 2218 3255 7613 5931
4107E931m646k492K445K579J104j574l114M912J616l507j807L792L948j38m596
$$ 5931 1285 -1207 1238 3817 4921 3347 233 5145 6761 3254 1447 5239 9187 9049 4453
4092D453j396j509K914R90l930r74j407j301j815Q64L505k277l149K792k586m255
$$ 4453 3057 1548 4462 5452 1522 548 -859 -2160 -3975 -3111 394 -1883 -5032 -2240 -4826 -9081
4076i081q48M355L420J071J136k372j708j217K321R23J251L057m05n127m216o51
$$ -9081 -9929 -5574 -2154 -1083 53 -2319 -4027 -5244 -2923 -2000 -749 2308 1903 -3224 -7440 -8091
4060h091O117j386J491J727K32L39k639m271m259K93N601L200l47l703J772R80
$$ -8091 -1974 -3360 -1869 -142 90 429 -2210 -6481 -10740 -10447 -4846 -1646 -1993 -5696 -3924 -2944
4044b944J771j95j792n90L62J069J219J16L139J369k212m191J667k562k66N9J225
$$ -2944 -1173 -1368 -3160 -3750 -3388 -2319 -1100 -984 2155 3524 1312 -2879 -1212 -3774 -4040 -3981 -2756
4027b756J131K805L857j582K213J784k485J949M832n568j742l82j585l844o297
$$ -2756 -1625 1180 5037 3455 5668 7452 4967 6916 11748 6180 4438 4056 2471 -1373 -7670
4012g670L074K593k5P63j364J168K214K092j478J27m45m127j310l082L712j595
$$ -7670 -4596 -2003 -2028 -1265 -2629 -1461 753 2845 1367 1494 1049 -3078 -4388 -7470 -3758 -5353
3996e353J026L646q27n880l864O71J997N186j560n29M548j35j359j43J786J475
$$ -5353 -4327 -681 -1508 -7388 -11252 -10581 -8584 -3398 -4958 -5487 -939 -1074 -2433 -2576 -790 685
3980F85k396J27M992J85j697K437R97j03j46j239j23q29J41J148J431n67m597
$$ 685 -1711 -1584 3408 3593 1896 4333 5330 5227 5081 3842 3719 2890 3031 4179 5610 5043 446
3963D46l024O732L657l746j479P56k378r46M123j518l205K1M345l84j161k254
$$ 446 -2578 4154 7811 4065 2586 3342 964 18 4141 2623 -582 -561 3784 3400 2239 -15
3947a5m218J160K960p85Q96o53L559K991K557K797j708k087K4K522r59k305j554
$$ -15 -4233 -3073 -113 -898 -2 -655 2904 5895 8452 11249 9541 7454 7478 10000 9041 6736 5182
3930E182k692j79j541K696K526k734m391n678O79n92j07k844q69J274J307M100
$$ 5182 2490 2311 770 3466 5992 3258 -1133 -6811 -6132 -6724 -6831 -9675 -10544 -9270 -7963 -3863
3914c863L251K53k689j074M955Q54m422m580L036J477K260m047M1K253l243l372
$$ -3863 -612 -359 -3048 -4122 833 1687 -2735 -7315 -4279 -2802 -542 -4589 -4548 -2295 -5538 -8910
3898h910L725R132K007l768j722J229j815n196j435K214N684K640J144j819J899
$$ -8910 -5185 3947 5954 2186 464 1693 -122 -5318 -6753 -4539 1145 3785 4929 3110 5009
3883E009K676j019l276m442l476j6K205J863k010m123L480J844K241j155L020
$$ 5009 7685 6666 3390 -1052 -4528 -4544 -2339 -476 -2486 -6609 -3129 -1285 956 -199 2821
3868B821K242l240m146k943O150o23j907p59J850O53j107k332j042J360K165l95
$$ 2821 5063 1823 -2323 -5266 884 261 -1646 -2405 -555 98 -1009 -3341 -4383 -3023 -858 -1253
3852a253K367L430j231R42O79n79J929K552K78l511n145j141m569k560P002N013
$$ -1253 1114 4544 3313 4255 4934 4355 6284 8836 9114 5603 458 -683 -5252 -7812 -810 4203
3836D203j07L467j379o328l330m10k759n48J525M95K490O78K306M117M360n2n967
$$ 4203 4096 7563 6184 -144 -3474 -3884 -6643 -7191 -5666 -5171 -2681 -2003 303 4420 8780 8728 2761
3819B761k873k391J15k103J049n17M115M295J405Q51k141R9r77j645L197k445
$$ 2761 -112 -2503 -2388 -4491 -3442 -3959 156 4451 5856 6707 4566 4665 3688 2043 5240 2795
3803B795l3M33K947k32j37j771m703m19K214J958kk53j236Q3l108l071j070N654
$$ 2795 2762 3195 6142 5910 5773 4002 -701 -1120 1094 3052 3050 2797 1561 1644 -1464 -4535 -5605 49
3785D9J038J096J513J144l970m793K417L036N102m117l245m20K144l2m609L554
$$ 49 1087 2183 3696 4840 870 -3923 -1506 1530 6632 2515 -730 -1150 994 962 -3647 -93
3769i3J185j490j04M578P52R03l332p589j588N14L171L421j41k628j232L477K447
$$ -93 1092 -398 -502 4076 4828 5731 2399 -5190 -6778 -6264 -3093 328 187 -2441 -3673 -196 2251
$$ [...]
##END NTUPLES=NMR SPECTRUM
##END=
