##TITLE=Analysis number 316598
Compound Code cc 39110
Book Reference 452/120/3
Project Code adrs
Chemist Name peted
##JCAMPDX= 6.0         $$ Bruker NMR JCAMP-DX V2.0
##DATA TYPE= NMR SPECTRUM
##DATA CLASS= NTUPLES
##ORIGIN= Bruker BioSpin GmbH
##OWNER= nmr
$$ XWIN-NMR		Version 3.5
$$ Fri Jan 20 08:43:22 2006 GMT Standard Time (UT+0h)  MAYBRIDGE\nmr@NMR_250MHZ
##.OBSERVE FREQUENCY= 250.131544655141
##.OBSERVE NUCLEUS= ^1H
##.ACQUISITION MODE= SIMULTANEOUS (DQD)
##.ACQUISITION SCHEME= undefined
##.AVERAGES= 16
##.DIGITISER RES= 18
##SPECTROMETER/DATA SYSTEM= dpx250
##.PULSE SEQUENCE= zg30
##.SOLVENT NAME= CDCl3
##.SHIFT REFERENCE= (INTERNAL, CDCl3, 0, 16.522)
##AUDIT TRAIL= $$ (NUMBER, WHEN, WHO, WHERE, WHAT)
$$ ##TITLE= Audit trail, XWIN-NMR		Version 3.5
$$ ##JCAMPDX= 5.01
$$ ##ORIGIN= Bruker BioSpin GmbH
$$ ##OWNER= nmr
$$ C:\u/data/dgb/nmr/ADRS/15000/pdata/1/auditp.txt
$$ ##AUDIT TRAIL=  $$ (NUMBER, WHEN, WHO, WHERE, WHAT)
(   1,<2006-01-20 08:42:22.30 +000>,<MAYBRIDGE\nmr>,<NMR_250MHZ>,
      <created by zg, POWCHK disabled, PULCHK disabled
       configuration hash MD5:
       62 19 C7 07 E1 42 D1 B7 37 6C 3D D0 77 39 F9 E6
       data hash MD5: 64K
       9C 3E 80 89 56 40 70 BB CB 65 2F 8A D4 89 62 E5>)
(   2,<2006-01-20 08:42:47.72 +000>,<MAYBRIDGE\nmr>,<NMR_250MHZ>,
      <Start of raw data processing
       ef LB = 0.3 FT_mod = 6 PKNL = 1 SI = 32K 
       data hash MD5: 32K
       EC 5F 85 7A 85 01 1C 9F 1C 0D 93 44 AF FA 81 9C>)
(   3,<2006-01-20 08:42:51.70 +000>,<MAYBRIDGE\nmr>,<NMR_250MHZ>,
      <apk 
       data hash MD5: 32K
       FA F7 11 BE 11 AF 78 64 E4 17 0F 8F F4 F0 68 FC>)
(   4,<2006-01-20 08:42:53.02 +000>,<MAYBRIDGE\nmr>,<NMR_250MHZ>,
      <abs ABSG = 5 
       data hash MD5: 32K
       DC 26 30 CD BB ED BF 47 47 92 55 E4 61 1C 17 1D>)
$$ ##END=
$$ 
$$ hash MD5
$$ 01 78 95 8A 4D EE 1C 5A D4 C2 67 79 3C 55 28 F1
##$RELAX= 
##$RELAX= 
##$RELAX= 
##$RELAX= 
##$RELAX= 
##$RELAX= 
##$RELAX= 
$$ Bruker specific parameters
$$ --------------------------
##$DU= <C:\u>
##$EXPNO= 15000
##$NAME= <ADRS>
##$PROCNO= 1
##$TYPE= <nmr>
##$USER= <dgb>
##$AMP= (0..31)
100 100 100 100 100 100 100 100 100 100 100 100 100 100 100 100 100 100 
100 100 100 100 100 100 100 100 100 100 100 100 100 100 
##$AQSEQ= 0
##$AQ_mod= 3
##$AUNM= <au_zg>
##$AUTOPOS= <21 >
##$BF1= 250.13
##$BF2= 250.13
##$BF3= 250.13
##$BF4= 250.13
##$BF5= 500.13
##$BF6= 500.13
##$BF7= 500.13
##$BF8= 500.13
##$BYTORDA= 1
##$CFDGTYP= 0
##$CFRGTYP= 5
##$CHEMSTR= <none>
##$CNST= (0..31)
1 1 145 1 1 1 1 1 1 1 1 1 1 1 1 1 1 1 1 1 1 1 1 1 1 1 1 1 1 1 1 1 
##$CPDPRG= <>
##$CPDPRG1= <>
##$CPDPRG2= <>
##$CPDPRG3= <>
##$CPDPRG4= <mlev>
##$CPDPRG5= <mlev>
##$CPDPRG6= <mlev>
##$CPDPRG7= <mlev>
##$CPDPRG8= <mlev>
##$CPDPRGB= <>
##$CPDPRGT= <>
##$D= (0..31)
0 1 0 0 0 0 0 0 0 0.06 0 0 0 0 0 0 0.0002 0 0 0 0 0 0 0 0 0 0 0 0 0 0 
0 
##$DATE= 1137746535
##$DBL= (0..7)
120 120 120 120 120 120 120 120 
##$DBP= (0..7)
150 150 150 150 150 150 150 150 
##$DBP07= 0
##$DBPNAM0= <>
##$DBPNAM1= <>
$$ [...]
##$SUBNAM7= <"">
##$SUBNAM8= <"">
##$SUBNAM9= <"">
##$SW= 20.6930455092707
##$SWIBOX= (0..15)
0 0 3 0 0 0 0 0 0 0 0 0 0 0 0 0 
##$SW_h= 5175.983436853
##$TD= 65536
##$TD0= 1
##$TE= 294.16
##$TE2= 300
##$TE3= 300
##$TEG= 300
##$TL= (0..7)
0 120 120 120 120 120 120 120 
##$TP= (0..7)
150 150 150 150 150 150 150 150 
##$TP07= 0
##$TPNAME0= <>
##$TPNAME1= <>
##$TPNAME2= <>
##$TPNAME3= <>
##$TPNAME4= <>
##$TPNAME5= <>
##$TPNAME6= <>
##$TPNAME7= <>
##$TPOAL= (0..7)
0.5 0.5 0.5 0.5 0.5 0.5 0.5 0.5 
##$TPOFFS= (0..7)
0 0 0 0 0 0 0 0 
##$TUNHIN= 0
##$TUNHOUT= 0
##$TUNXOUT= 0
##$USERA1= <user>
##$USERA2= <user>
##$USERA3= <user>
##$USERA4= <user>
##$USERA5= <user>
##$V9= 5
##$VALIST= <valist>
##$VCLIST= <CCCCCCCCCCCCCCC>
##$VD= 0
##$VDLIST= <DDDDDDDDDDDDDDD>
##$VPLIST= <PPPPPPPPPPPPPPP>
##$VTLIST= <TTTTTTTTTTTTTTT>
##$WBST= 1024
##$WBSW= 4
##$XGAIN= (0..3)
0 0 0 0 
##$XL= 0
##$YL= 0
##$YMAX_a= 483538
##$YMIN_a= -538481
##$ZGOPTNS= <>
##$ZL1= 120
##$ZL2= 120
##$ZL3= 120
##$ZL4= 120
##$ABSF1= 16.522
##$ABSF2= -4.171173
##$ABSG= 5
##$ABSL= 3
##$ALPHA= 0
##$AQORDER= 0
##$ASSFAC= 0
##$ASSFACI= 0
##$ASSFACX= 0
##$ASSWID= 0
##$AUNMP= <proc_1d>
##$AZFE= 0.1
##$AZFW= 0.1
##$BCFW= 0
##$BC_mod= 0
##$BYTORDP= 0
##$COROFFS= 0
##$CY= 12.5
##$DATMOD= 1
##$DC= 0
##$DFILT= <>
##$DTYPP= 0
##$F1P= 14.0000005364418
##$F2P= -0.99999901652339
##$FCOR= 0.5
##$FTSIZE= 32768
##$FT_mod= 6
##$GAMMA= 0
##$GB= 0
##$INTBC= 1
##$INTSCL= 1
##$ISEN= 128
##$LB= 0.3
##$LEV0= 0
##$LPBIN= 0
##$MAXI= 10000
##$MC2= 0
##$MEAN= 0
##$ME_mod= 0
##$MI= 0
##$NCOEF= 0
##$NC_proc= -2
##$NLEV= 6
##$NOISF1= 0
##$NOISF2= 0
##$NSP= 0
##$NTH_PI= 0
##$NZP= 0
##$OFFSET= 16.522
##$PC= 1
##$PHC0= 241.6358
##$PHC1= 5.245556
##$PH_mod= 1
##$PKNL= yes
##$PPARMOD= 0
##$PSCAL= 4
##$PSIGN= 0
##$REVERSE= no
##$SF= 250.13
##$SI= 32768
##$SIGF1= 0
##$SIGF2= 0
##$SINO= 400
##$SIOLD= 32768
##$SREGLST= <1H.CDCl3>
##$SSB= 0
##$STSI= 32768
##$STSR= 0
##$SW_p= 5175.98343685301
##$SYMM= 0
##$S_DEV= 0
##$TDeff= 65536
##$TDoff= 0
##$TI= <Analysis number 999999
Compound Code 99
Book Reference 9
Project Code 9>
##$TILT= no
##$TM1= 0
##$TM2= 0
##$TOPLEV= 0
##$USERP1= <user>
##$USERP2= <user>
##$USERP3= <user>
##$USERP4= <user>
##$USERP5= <user>
##$WDW= 1
##$XDIM= 32768
##$YMAX_p= 462389874
##$YMIN_p= -212556
$$ End of Bruker specific parameters
$$ ---------------------------------
##NTUPLES= NMR SPECTRUM
##VAR_NAME=  FREQUENCY,     SPECTRUM/REAL,   SPECTRUM/IMAG
##SYMBOL=    X,             R,               I
##VAR_TYPE=  INDEPENDENT,   DEPENDENT,       DEPENDENT
##VAR_FORM=  AFFN,          ASDF,            ASDF
##VAR_DIM=   32768,         32768,           32768
##UNITS=     HZ,            ARBITRARY UNITS, ARBITRARY UNITS
##FACTOR=    0.157963299565203, 1,           1
##FIRST=     4132.6476996994, 0,             0
##LAST=      -1043.33573715361, 0,           0
##MIN=       -1043.33573715361, -212556,     0
##MAX=       4132.6476996994, 462389874,     0
$$ Real data points
##PAGE= N=1
##DATA TABLE= (X++(R..R)), XYDATA
$$ [...]
$$ plain form
17053 -11455 -12129 -6749 9439 15482 5797 -2517 -8915 -9067 -9680 -4280 -1418 -34221 -51081 -40797
17039 -40797 -21715 1319 20598 12611 -11784 -21298 -38620 -22969 -4255 -3343 -27848 -25004 -23742
17026 -23742 -25199 -30409 -26491 -34058 -40805 -49599 -43288 -30585 -14715 -18790 -38218 -35906 -35367 -32989
17012 -32989 -42726 -32199 -39195 -33959 -21242 7712 4469 -15124 -10450 -13522 -43118 -54746 -29857
16999 -29857 -33862 -32679 3492 15708 -11737 -12603 -3412 6794 21389 27556 21169 -3134 -6134
16986 -6134 -7187 10908 27065 20694 10063 -10357 -17107 -7849 -10415 -17491 -14581 -31333 -29526
16973 -29526 -16058 -19375 -22445 -2184 -16631 -27133 -24200 -947 5967 16247 10657 5727 4051
16960 4051 7628 216 -19497 -20509 -29042 -26333 -32690 -30138 -33622 -19017 14663 24087 22967 17234
$$ packed form
17053a1455o74N380J6188O043r685q314o398j52o13N400K862l2803j6860J0284
17039d0797J9082K3034J9279p987k4395r514j7322J5651J8714R12k4505K844J262
17026b3742j457n210L918p567o747q794O311J2703J5870m075j9428K312N39K378
17012c2989r737J0527o996N236J2717K8954l243j9593M674l072k9596j1628K4889
16999b9857m005J183L6171J2216k7445q66R191J0206J4595O167o387k4303l000
16986f134j053J8095J6157o371j0631k0420o750R258k566p076K910j6752J807
16973b9526J3468l317l070K0261j4447j0502K933K3253O914J0280n590m930j676
16960D051L577p412j9713j012q533K709o357K552l484J4605L3680R424j120n733
$$ plain form
16946 17234 -4829 -13645 -8204 -27278 -15634 -2160 20380 23182 13304 28256 20827 20729 2979
16933 2979 -28826 -19504 16104 10954 10776 24166 1252 -6303 -11981 -32538 -25034 -35099 -21440
16920 -21440 -9709 6772 27934 635 1596 18566 12803 -12620 -25829 -23904 -16783 -15984 -19363
16907 -19363 -37923 -49549 -47714 -47925 -17486 -2152 1657 -13941 -20624 -8974 15101 8663 -3364
16894 -3364 15675 29308 12858 -3319 -6671 6015 8468 13443 -10468 -3069 12133 12241 647
16881 647 -9365 -792 8674 -6710 -10825 -312 -4908 -25239 -18742 -13729 5149 24785 27121
16868 27121 5254 -17417 -22029 -9833 -22246 -28157 -28304 2356 -1173 -24556 -41767 -60457 -68758
16855 -68758 -35253 -6368 9084 -13185 -38250 -64940 -52250 -8137 12514 15189 8027 5646
$$ packed form
16946A7234k2063q816N441j9074J1644J3474K2540K802r878J4952p429r8j7750
16933B979l1805R322L5608n150j78J3390k2914p555n678k0557P504j0065J3659
16920b1440J1731J6481K1162k7299R61J6970n763k5423j3209J925P121P99l379
16907a9363j8560j1626J835k11L0439J5334L809j5598o683J1650K4075o438j2027
16894c364J9039J3633j6450j6177l352J2686K453M975k3911P399J5202J08j1594
16881F47j0012Q573R466j5384m115J0513m596k0331O497N013J8878J9636K336
16868B7121k1867k2671m612J2196j2413n911j47L0660l529k3383j7211j8690q301
16855f8758L3505K8885J5452k2269k5065k6690J2690M4113K0651K675p162k381
$$ plain form
16843 5646 -23846 -19655 5470 15745 6402 -13116 -37676 -25731 -26032 -29013 -15609 -13379 -21556
16830 -21556 -4299 5549 -1604 -12851 -8285 -3982 7476 11904 12227 7421 -3538 -4816 24792
16817 24792 37923 7559 -19811 -9046 -1923 27712 -1025 -23143 -18993 -7665 -5760 -373
16805 -373 -4516 -17546 -24569 -21720 -30715 -37034 -32882 -20548 -7152 9105 8821 586 -21607 -23923
16791 -23923 -10983 5779 10029 -6949 5061 -15297 -38241 -38481 -13489 -5232 -82 -11538 -24258
16778 -24258 -6394 2868 -8528 -28540 -28822 -20222 -21443 -17049 -12673 -8679 6108 -8726 -20900
16765 -20900 -16680 -11197 -2499 270 -5689 -20092 -21122 -24236 -36341 -10389 3389 11486 -13764
16752 -13764 -14617 -9930 -7568 -7796 -11090 -24965 -31219 -26903 -34289 -29168 -15484 -6330 -9902 -5512
$$ packed form
16843E646k9492M191K5125J0275r343j9518k4560J1945l01k981J3404K230q177
16830b1556J7257R848p153j1247M566M303J1458M428L23m806j0959j278K9608
16817B4792J3131l0364k7370J0765P123K9635k8737k2118M150J1328J905N387
16805c73m143j3030p023K849q995o319M152J2334J3396J6257k84q235k2193k316
16791b3923J2940J6762M250j6978J2010k0358k2944k40K4992Q257N150j1456j2720
16778b4258J7864R262j1396k0012k82Q600j221M394M376L994J4787j4834j2174
16765b0900M220N483Q698K769n959j4403j030l114j2105K5952J3778Q097k5250
16752a3764q53M687K362k28l294j3875o254M316p386N121J3684R154l572M390
$$ plain form
16738 -5512 8111 17972 22526 16945 95 7976 -3318 -12038 3895 13291 -21565 -15958 -12034
16725 -12034 -8714 -4683 -13364 -26833 -20663 -14232 -7094 -2895 -2124 -2900 -7460 302 -20289 -13249
16711 -13249 -3862 2322 993 15448 3408 1637 5168 -15930 -18583 -3172 5891 5392 562 -15693
16697 -15693 -33079 -20956 -12229 -14675 -18479 -16440 -1874 -139 -1929 -4664 -20773 -26174 -18748
16684 -18748 -10416 -15571 -4299 3848 -4446 -26787 -39001 -36477 -42137 -47852 -28654 -35342 -37202
16671 -37202 -35323 -25414 -12594 -19569 -29088 -22438 -34768 -47195 -50353 -42206 -38591 -8273 9582
16658 9582 3553 -26692 -43833 -46083 -38494 -25363 -13925 -6694 -497 120 -17417 -1493 -11944
16645 -11944 -9607 105 -14522 -11981 -15990 -8115 -21510 -41129 -37057 -22236 -41140 -28062 -28790
$$ packed form
16738e512J3623R861M554n581j6850P881j1294q720J5933R396l4856N607L924
16725a2034L320M031q681j3469O170O431P138M199P71p76m560P762k0591P040
16711a3249R387O184j329J4455j2040j771L531k1098k653J5411R063m99m830j6255
16697a5693j7386J2123Q727k446l804K039J4566J735j790k735j6109n401P426
16684a8748Q332n155J1272Q147q294k2341j2214K524n660n715J9198o688j860
16671c7202J879R909J2820o975r519O650j2330j2427l158Q147L615L0318J7855
16658I582o029l0245j7141k250P589J3131J1438P231O197O17j7537J5924j0451
16645a1944K337R712j4627K541m009P875j3395j9619M072J4821j8904J3078p28
$$ plain form
16632 -28790 -31668 -19762 5701 15738 17595 14386 4174 -4123 -13817 -12340 16977 31104 23906
16619 23906 11619 40 -10902 -16371 2463 -15277 -26083 -25452 -11275 -22620 -15277 -4393
16607 -4393 -5728 262 11465 9398 1973 6370 30644 -2250 -47081 -52571 -39399 -36101 -26970
16594 -26970 -13187 4781 772 -10300 -8491 16704 18310 3939 -9808 -6048 -4392 931 -17108
16581 -17108 -18248 -27809 -27101 -14843 -4431 5758 -9658 -17885 -29306 -34261 -40106 -12387 -7719
16568 -7719 -29186 -37081 -31448 -10651 -10871 -3499 -5104 17568 25409 16445 4689 3726 -16653 -23355
16554 -23355 -21588 -25971 -37516 -42382 -29949 -19472 -5155 -6447 -5341 -10783 13476 11261 23842
16541 23842 21135 25821 27011 12977 19819 10538 15374 14834 -17760 -14868 -10874 1874 10822 6196
$$ packed form
16632b8790k878J1906K5463J0037J857l209j0212q297r694J477K9317J4127p198
16619B3906j2287j1579j0942n469J8834j7740j0806O31J4177j1345P343J0884
16607d393j335N990J1203k067p425M397K4274l2894m4831n490J3172L298R131
16594b6970J3783J7968m009j1072J809K5195J606j4371j3747L760J656N323j8039
16581a7108j140r561P08J2258J0412J0189j5416q227j1421m955n845K7719M668
16568g719k1467p895N633K0797k20P372j605K2672P841q964j1756r63k0379o702
16554b3355J767m383j1545m866J2433J0477J4317j292J106n442K4259k215J2581
16541B3842k707M686J190j4034O842r281M836n40l2594K892L994J2748Q948m626
$$ plain form
16527 6196 9301 -800 -10684 -30431 -41294 -35600 -20815 -28501 -23294 -13013 1439 1055 10725
16514 10725 16537 16938 7336 -4365 -7305 -21576 -25261 -18367 -1666 4580 4209 26222 30801 32433
16500 32433 15087 -7468 -10894 -5601 -5581 10170 16773 19655 3939 -11637 104 10082 18565
16487 18565 20364 27372 35250 39934 22793 -6692 -17932 -26483 -17555 2924 -2008 -12557 -20847
16474 -20847 -27991 -27104 -26466 -27745 -25247 -20644 -17711 -15454 -9615 -16375 -12200 14171 22078 14997 6385
16459 6385 -32563 -38646 -34190 -18523 -12528 -12855 -21113 -9106 -4999 -9670 -10457 -10728 -4922 -2892 15460
16444 15460 32535 27507 4444 -3851 8506 3664 4309 16964 -7340 -21974 -19615 -17121 -3137
16431 -3137 -2131 -3632 -14204 -18230 -14571 -17063 -1571 -10993 -36929 -27330 -1130 3247 -1539 14946
$$ packed form
16527F196L105j0101r884j9747j0863N694J4785p686N207J0281J4452l84R670
16514A0725N812M01r602j1701k940j4271l685O894J6701O246l71K2013M579J632
16500C2433j7346k2555l426N293K0J5751O603K882j5716j5576J1741R978Q483
16487A8565J799P008P878M684j7141k9485j1240q551Q928K0479m932j0549q290
16474b0847p144Q87O38j279K498M603K933K257N839o760M175K6371P907p081q612
16459F385l8948o083M456J5667N995l27q258J2007M107m671p87k71N806K030J8352
16444A5460J7075n028k3063q295J2357m842O45J2655k4304j4634K359K494J3984
16431c137J006j501j0572m026L659k492J5492r422k5936R599K6200M377m786J6485
$$ plain form
16417 14946 9844 6252 22179 23427 27242 17224 8149 12335 -11366 -32067 -7689 -3114 18345
16404 18345 51467 46945 28893 17837 25018 14413 5730 2379 -14068 -16596 -16756 -15999 -1980
16391 -1980 -16353 -29058 -34419 -29867 -22455 -7013 -3127 -9536 -18676 -29187 -30234 -23107 -50436
16378 -50436 -47842 -27776 -17431 -436 847 -3873 -11651 -12378 -15301 -6174 -12690 -30614 -27731 -16359
16364 -16359 4951 13329 -9135 -24792 -8055 9855 148 -12975 8698 27138 34283 27020
16352 27020 12028 -9204 -27220 -18131 -14198 -10286 8730 -10443 -21516 -1315 9238 -3343
16340 -3343 5193 -3449 2729 16546 12303 -20316 -24890 1828 -13586 -31078 -16493 -19323 -20057
16327 -20057 -17043 -11288 -12137 13688 17801 12328 3993 2154 -775 7671 10456 -58 -8006 142
$$ packed form
16417A4946n102l592J5927J248L815j0018r075M186k3701k0701K4378M575K1459
16404A8345L3122m522j8052j1056P181j0605q683l351j6447k528j60P57J4019
16391a980j4373j2705n361M552P412J5442L886o409r140j0511j047P127k7329
16378e0436K594K0066J0345J6995J283m720p778p27k923R127o516j7924K883J1372
16364a6359K1310Q378k2464j5657J6737J7910r707j3123K1673J8440P145p263
16352B7020j4992k1232j8016R089L933L912J9016j9173j1073K0201J0553j2581
16340c343Q536q642O178J3817m243l2619m574K6718j5414j7492J4585k830p34
16327b0057L014N755q49K5825M113n473q335j839k929Q446K785j0514p948Q148
$$ plain form
16313 142 596 -3621 -22115 -29937 6863 24190 5228 -2607 2713 -30126 -33783 -6646 7513
16300 7513 12098 9980 -10488 -3532 -15615 -20332 -17988 -12468 -10456 -10471 -18963 -25146 -29976 -23562 -8165
16285 -8165 -3625 -5333 12890 32635 28527 17285 -343 -3074 -7853 -18264 -19587 -19327 -14292 -7568
16271 -7568 4910 -5977 -28805 -30470 -30456 -3757 3965 10459 25808 11419 18028 24798 14303
16258 14303 22093 30808 28472 39991 59064 64013 35791 3611 9974 6560 -7711 -26042 -34205
16245 -34205 -11434 -13284 -20821 -6982 -18068 -14414 -405 -3160 -4707 3875 23049 49947 48570
16232 48570 17888 -7033 -11489 -4605 7945 34487 32701 24233 17229 -4744 -9658 -7122 -6336
16219 -6336 -4005 12539 28811 28339 20680 18319 19283 9956 3779 -1584 -4641 9164 11705 17265
$$ packed form
16313A42M54m217j8494p822L6800J7327j8962p835N320l2839l657K7137J4159
16300G513M585k118k0468O956j2083m717K344N520K012j5q492o183m830O414J5397
16285h165M540j708J8223J9745m108j1242j7628k731m779j0411j323K60N035O724
16271g568J2478j0887k2828j665J4K6699P722O494J5349j4389O609O770j0495
16258A4303P790Q715k336J1519J9073M949k8222l2180O363l414j4271j8331q163
16245c4205K2771j850p537J3839j1086L654J4009k755j547Q582J9174K6898j377
16232D8570l0682k4921m456O884J2550K6542j786q468p004k1973m914K536P86
16219f336K331J6544J6272m72p659k361R64r327o177n363l057J3805K541N560
$$ plain form
16205 17265 6038 14983 23319 13789 -8665 -7379 4428 -6477 -37518 -17270 6201 -1849 1536
16192 1536 6026 -9001 -28693 -33433 -22127 -33381 -7270 -13490 -17654 -1236 -5202 -5647 -7374
16179 -7374 -9658 -3947 5290 5661 -3144 16118 17804 22470 19561 -1549 -26040 -18939 -6145 8155
16165 8155 17207 -5796 -5809 5648 -6955 -8442 -19440 -26716 -28493 -5270 24107 35508 5323
16152 5323 -608 -579 -3485 15268 10557 -13637 -11605 -20571 -38700 -37572 -13437 34 3870 1397
16138 1397 7562 9462 -827 -11448 -8944 -17744 -4611 26983 45040 46918 41717 15654 8777
16125 8777 5052 10026 -12956 -18547 -14522 -7801 8925 1897 -2001 -15968 -29535 -24026 7171
16112 7171 -550 -35167 -41962 -13492 11327 9826 -19192 -19652 -15208 -26166 -12486 7848 5082
$$ packed form
16205A7265j1227Q945Q336r530k2454J286J1807j0905l1041K0248K3471q050L385
16192A536M490j5027j9692m740J1306j1254K6111o220m164J6418l966m45j727
16179g374k284N711R237L71q805J9262J686M666k909k1110k4491P101J2794J4300
16165H155R052k3003j3J1457j2603j487j0998p276j777K3223K9377J1401l0185
16152E323n931K9k906J8753m711k4194K032q966j8129J128K4135J3471L836k473
16138A397O165J900j0289j0621K504q800J3133L1594J8057J878n201k6063o877
16125H777l725M974k2982n591M025O721J6726p028l898j3967j3567N509L1197
16112G171p721l4617o795K8470K4819j501k9018m60M444j0958J3680K0334k766
$$ plain form
16099 5082 9751 27025 35382 28726 7534 3004 2169 -11190 6473 2506 -9551 -4668 24689
16086 24689 17668 -10841 -28628 -32871 -10833 -6554 8384 -3512 -19434 -14077 -15952 -12125 744
16073 744 12064 15789 33493 40086 21361 18552 -4688 6341 19872 14944 2903 9270 10927
16060 10927 4200 -7841 -12753 4071 -3566 1600 20360 12196 -5593 -16503 -24526 -14299 5529
16047 5529 17736 19246 9797 3192 -3571 -11055 6163 10056 12139 18631 24475 16616 -4929 -8073
16033 -8073 -32146 -42821 -31206 -12376 -1458 -20186 -9241 11543 39425 33399 33252 17222
16021 17222 -7271 -2704 -4948 -3297 -15393 -15606 -19089 -27351 -28081 -29950 -21109 -8660 -14501 -9357
16007 -9357 875 3765 -5357 -25915 -21160 11191 34354 20999 -16478 -36537 -23086 -3248
$$ packed form
16099E082M669J7274Q357o656k1192m530q35j3359J7663l967j2057M883K9357
16086B4689p021k8509j7787m243K2038M279J4938j1896j5922N357j875L827J2869
16073G44J1320L725J7704O593j8725k809k3240J1029J3531m928j2041O367J657
16060A0927o727j2041m912J6824p637N166J8760q164j7789j0910q023J0227J9828
16047E529J2207J510r449o605o763p484J7218L893K083O492N844p859k1545l144
16033h073k4073j0675J1615J8830J0918j8728J0945K0784K7882o026j47j6030
16021A7222k4493M567k244J651j2096k13l483q262p30j869Q841J2449n841N144
16007i357J0232K890r122k0558M755L2351K3163j3355l7477k0059J3451J9838
$$ plain form
15995 -3248 15326 11333 16187 3688 -6588 6672 18358 5946 14399 12332 -3731 -28959 -64741
15982 -64741 -84416 -98418 -94139 -54540 -59197 -60065 -58901 -20120 -12398 -41689 -29617 -30238 -17311
15969 -17311 -19100 -5168 21611 865 -14673 -17600 358 2116 1487 18625 34766 26463 22627
15956 22627 27077 27338 -15844 -58053 -59334 -48149 -17750 9578 20546 -11537 -14083 -14402 768
15943 768 -17677 -7438 -29205 -22378 21998 51830 42056 31010 8675 -8236 -26268 -10933
15931 -10933 8910 7257 -1602 -12100 -14412 -16603 -29775 -44593 -16390 19661 -2502 -30673
15919 -30673 -10729 13375 27372 25313 31659 30829 3655 -30608 -41269 -31353 -34112 -36474 -14205
15906 -14205 3464 -9167 -16107 -20956 4053 4296 -3394 4209 -10651 -4836 -14178 1147 13491
$$ packed form
15995c248J8574l993M854j2499j0276J3260J1686j2412Q453k067j6063k5228l5782
15982f4741j9675j4002M279L9599m657q68J164L8781P722k9291J2072o21J2927
15969a7311j789J3932K6779k0746j5538k927J7958J758o29J7138J6141q303l836
15956B2627M450K61m3182m2209j281J1185L0399K7328J0968l2083k546l19J5170
15943G68j8445J0239k1767O827M4376K9832r774j1046k2335j6911j8032J5335
15931a0933J9843j653q859j0498k312k191j3172j4818K8203L6051k2163k8171
15919c0673J9944K4104J3997k059O346q30k7174l4263j0661R916k759k362K2269
15906a4205J7669j2631o940m849K5009K43p690P603j4860N815r342J5325J2344
$$ plain form
15893 13491 10995 -17052 -20160 3716 24019 20905 10046 17225 28806 22221 -3099 -11404 7955
15880 7955 8287 14892 1583 -15453 -9932 -16211 -4792 -14264 -24059 -38742 -26207 -31932 -33105 -14075
15866 -14075 -12945 -15654 -100 -11899 -17817 -7319 -5592 -17587 -7677 7027 -8090 -8395 -14596
15853 -14596 -25111 -6597 -12252 5523 13481 -7273 -12758 -18591 905 -8091 -475 -3177 -2256
15840 -2256 -5583 -2384 12849 29691 26227 11321 2687 3401 -5060 -8160 -18008 -10168 -4629 -7418
15826 -7418 -19107 -22569 -15434 -8728 -17473 -15540 -9952 -10997 -16858 -14384 -11512 -13968 -31396 -29205
15812 -29205 -27609 -11740 10431 -369 -20465 -48570 -36211 -8495 -1687 -7250 -17630 -8428
15800 -8428 -3786 -15272 -8475 -11027 5223 11942 20500 -1349 -1053 18649 12977 9121 25099 21603
$$ packed form
15893A3491k496k8047l108K3876K0303l114j0859P179J1581o585k5320q305J9359
15880G955L32O605j3309j7036N521o279J1419r472r795j4683J2535n725j173J9030
15866a4075J130k709J5554j1799n918J0498J727j1995R910J4704j5117l05o201
15853a4596j0515J8514n655J7775P958k0754n485n833J9496q996P616k702R21
15840b256l327L199J5233J6842l464j4906q634P14q461l100r848P840N539k789
15826g418j1689l462P135O706q745J933N588j045n861K474K872k456j7428K191
15812b9205J596J5869K2171j0800k0096k8105J2359K7716O808n563j0380R202
15800h428M642j1486O797k552J6250O719Q558k1849K96J9702n672l856J5978l496
$$ plain form
15786 21603 8511 -3184 -4911 5688 14017 6334 -11721 -36190 -25633 -13990 1579 9908
15774 9908 -20488 -11763 -9032 -13375 -6983 -9003 -7087 -16167 -28525 -15815 6887 7772 13973 15799
15760 15799 8040 4095 5158 10614 9911 6014 3049 -3190 -2630 19621 39486 23862 10254 922
15746 922 2274 -7205 -25875 -13396 -19683 -12793 418 -1641 -7845 -23067 -9335 -9698 -8175 -2789
15732 -2789 -2254 956 6476 4564 2515 6505 26968 1199 -9633 -2115 15146 20462 -14805 -30621
15718 -30621 -22063 -27245 -15013 -16705 -35725 -32179 -32010 -19213 -12236 -3484 -11975 -15919 -13973 -27909
15704 -27909 -16863 -24669 -20257 -22652 -15474 -2055 6228 -2171 10503 -667 -12046 7257 4583
15691 4583 3408 -5128 -10653 224 14958 8662 -5789 1474 9197 10966 24399 16293 13691 38830
$$ packed form
15786B1603j3092j1695j727J0599Q329p683j8055k4469J0557J1643J5569Q329
15774I908l0396Q725K731m343O392k020J916r080j2358J2710K2702Q85O201J826
15760A5799p759l945J063N456p03l897k965o239N60K2251J9865j5624j3608r332
15746I22J352r479j8670J2479o287O890J3211k059o204j5222J3732l63J523N386
15732b789N35L210N520j912k049L990K0463k5769j0832P518J7261N316l5267j5816
15718c0621Q558n182J2232j692j9020L546J69J2797O977Q752q491l944J946j3936
15704b7909J1046p806M412k395P178J3419Q283q399J2674j1170j1379J9303k674
15691D583j175q536n525J0877J4734o296j4451P263P723J769J3433q106k602K5139
$$ plain form
15677 38830 34786 28643 19558 13237 -669 -35623 -30340 -10411 6186 12274 10797 969 -22411
15664 -22411 -19333 -17227 -15597 4599 -2318 -6028 -13914 -6530 -18525 -21660 -18725 -31976 -33489 -13665
15650 -13665 7159 22524 11952 15554 19043 19001 21378 5822 5160 -4596 -14925 -19335 -27606 -31412
15636 -31412 -31607 -34300 -29716 -24456 -16262 -8094 -6967 -9577 -11344 -18024 -574 -6357 -9705 -1613
15622 -1613 -17200 -41097 -47394 -34629 -16885 -15805 -18365 -6581 -8924 -11739 -25385 -32381 -20744
15609 -20744 -11010 -13364 -5542 -8046 -10162 -8867 -2352 4446 223 817 -2602 -13435 13 1380
15595 1380 -7046 -13216 -13145 -28145 -24363 -13563 -5008 16476 17978 16772 7265 -17912 -14075 1334
15581 1334 25145 17592 16456 418 -1580 12405 11614 14986 26473 31809 34436 25060 18791 -3931
$$ packed form
15677C8830m044o143r085o321j3906l4954N283J9929J6597O088j477r828k3380
15664b2411L078K106J630K0196o917l710p886P384j1995l135K935j3251j513J9824
15650a3665K0824J5365j0572L602L489m2K377j5556o62r756j0329m410q271l806
15636c1412j95k693M584N260Q194Q168J127k610j767o680J7450n783l348Q092
15622a613j5587k3897o297J2765J7744J080k560J1784k343k815j3646o996J1637
15609b0744R734k354P822k504k116J295O515O798m223N94l419j0833J3448J367
15595A380q426o170P1j5000L782J0800Q555K1484J502j206r507k5177L837J5409
15581A334K3811p553j136j6038j998J3985p91L372J1487N336K627r376o269k2722
$$ plain form
15567 -3931 -17923 -27507 -35735 -29369 -30482 -24693 -14469 9698 17705 4587 -1405 8380 11301 29048
15553 29048 27845 5280 1491 -3041 7768 8376 5920 -14305 -20095 -29760 -29919 -20545 3616 12157
15539 12157 26852 42465 37132 24714 21470 24055 39536 32510 13943 24212 32630 31488 22336
15526 22336 8849 6272 9897 1861 5378 -8925 -27342 -20984 -1758 1756 -32178 -55302 -39202
15513 -39202 -12491 -13704 -20715 -2906 797 2336 -8470 -10528 -8642 12444 13585 -2736 -1207
15500 -1207 -10227 -6216 4941 2525 -12348 -9287 -2452 8997 17854 4983 -18512 -21437 -6704
15487 -6704 1322 -324 20316 29116 22004 8756 5247 4198 -5994 -2397 -1887 258 -21580 -15511
15473 -15511 -6568 -17528 -19391 -28969 -35256 -12226 -30675 -39475 -35935 -23665 -26292 -25668 -15760 10170
$$ packed form
15567c931j3992r584q228O366j113N789J0224K4167Q007j3118n992R785K921J7747
15553B9048j203k2565l789m532J0809O08k456k0225n790r665j59R374K4161Q541
15539A2157J4695J5613n333j2418l244K585J5481p026j8567J0269Q418j142r152
15526B2336j3487k577L625q036L517j4303j8417O358J9226L514l3934k3124J6100
15513c9202K6711j213p011J7809L703J539j0806k058J886K1086J141j6321J529
15500a207r020M011J1157k416j4873L061O835J1449Q857j2871k3495k925J4733
15487f704Q026j646K0640Q800p112j3248l509j049j0192L597N10K145k1838O069
15473a5511Q943j0960j863r578o287K3030j8449q800L540J2270k627O24R908K5930
$$ plain form
15459 10170 19321 12872 -17919 -20052 -24408 -5442 4613 -7645 -6888 -16529 -23012 -31822 -32703 -9581
15445 -9581 -11639 -27651 -37804 -38373 -35492 -28991 -26250 -41066 -49674 -22883 -3829 -11740 2248
15432 2248 6257 -3370 -5188 -8182 -9362 458 9218 9935 13300 14071 23823 9485 -11652 -5378 -6331
15417 -6331 -23897 -36273 -22772 1220 19716 7658 11446 14583 29499 19881 -6604 -9720 56
15404 56 34124 17015 3972 9636 32163 17037 -3743 2383 16537 11094 8374 -1853 753
15391 753 -700 4720 43445 47792 50586 27291 15455 30879 37162 35554 14023 6771 8998 -2659
15377 -2659 -552 8667 19491 12810 6908 10637 39021 44692 32456 32179 26217 21465 33198 13031
15363 13031 16826 24009 19865 17564 22779 14376 8846 403 -16791 -19175 -23803 -18550 -17377 7909
$$ packed form
15459A0170R151o449l0791k133m356J8966J0055j2258P57r641o483q810q81K3122
15445i581k058j6012j0153n69K881O501K741j4816q608K6791J9054p911J3988
15432B248M009r627j818k994j180R820Q760P17L365P71R752j4338k1137O274r53
15417f331j7566j2376J3501K3992J8496j2058L788L137J4916r618k6485l116R776
15404E6L4068j7109j3043N664K2527j5126k0780O126J4154n443k720j0227K606
15391G53j453N420L8725M347K794k3295j1836J5424O283j608k1531p252K227j1657
15377b659K107R219J0824o681n902L729K8384N671j2236k77n962m752J1733k0167
15363A3031L795P183m144k301N215q403n530q443j7194k384m628N253J173K5286
$$ plain form
15349 7909 36371 35687 18529 13301 8473 23914 23743 20690 13588 6595 -13829 -12944 3579 -9425
15335 -9425 -12730 -15253 -32929 -35244 -24576 -6840 9973 23199 23192 21195 7187 -10298 -27856
15322 -27856 -27896 -17531 -2825 -8861 -5331 -4619 24330 30814 21225 -2491 -26556 -37329 -43845 -26414
15308 -26414 -6865 -15356 -20612 -635 14779 5434 7652 6541 -3515 -23588 -11005 15950 5852
15295 5852 2197 -1518 -7590 -6526 -5427 1327 10317 13262 25067 17811 11468 14577 20981 9356
15281 9356 6428 11570 9606 4584 21756 20227 28612 21027 307 4704 -9235 -19778 7564
15268 7564 5444 -5924 -13169 -636 4513 12392 18 4703 12846 3198 -3087 -79 -20428 -16863
15254 -16863 -16061 -29907 -20996 -9274 -16875 -16957 3255 26288 38556 42618 33179 45905 55422 64269
$$ packed form
15349G909K8462o84j7158n228m828J5441j71l053p102o993k0424Q85J6523j3004
15335i425l305k523j7676k315J0668J7736J6813J3226pj997j4008j7485j7558
15322b7856m0J0365J4706o036L530P12K8949O484r589k3716k4065j0773o516J7431
15308b6414J9549q491n256J9977J5414r345K218j111j0056k0073J2583K6955j0098
15295E852l655l715o072J064J099O754Q990K945J1805p256o343L109O404j1625
15281I356k928N142j964n022J7172j529Q385p585k0720M397j3939j0543K7342
15268G564k120j1368p245J2533N149P879j2374M685Q143r648o285L008k0349L565
15254a6863Q02j3846Q911J1722p601q2K0212K3033J2268M062r439J2726R517Q847
$$ plain form
15240 64269 38655 19839 14971 -4574 -5744 1274 -6427 -8290 -4745 -9033 -11342 -19428 -37255
15227 -37255 -39569 -32731 -11602 -13963 -7504 -11185 -21 -3064 -26984 -33494 -15285 -3717 -10580
15214 -10580 -18172 1455 2792 -24936 -20854 -16428 -35053 -43112 -36513 -18934 -8701 30103 21584
15201 21584 -4074 -15908 -17054 -9433 8757 31648 7116 -21288 -47948 -59733 -37321 -15676
15189 -15676 -7598 -17880 -16196 -27053 -19422 -18198 -24109 -23898 -17521 -16937 -27884 -22355 -12237 -16749
15175 -16749 -5081 23952 22999 14002 34899 33952 29723 27665 16309 -2165 -12867 -29111 -25205
15162 -25205 9277 11510 12021 17690 17635 -8839 -9649 -919 1172 20560 33327 29164 13759 8718
15148 8718 6874 23108 18938 29861 39478 35728 19545 22870 13380 10894 9356 -1732 -4535 -16727
$$ packed form
15240F4269k5614j8816m868j9545j170P018p701j863L545m288k309q086j7827
15227c7255k314O838K1129k361O459l681J1164l043k3920o510J8209J1568o863
15214a0580p592J9627J337k7728M082M426j8625q059O599J7579J0233L8804q519
15201B1584k5658j1834j146P621J8190K2891k4532k8404k6660j1785K2412K1645
15189a5676Q078j0282J684j0857P631J224n911K11O377N84j0947N529J0118m512
15175a6749J1668K9033r53q997K0897r47m229k058j1356j8474j0702j6244L906
15162b5205L4482K233N11N669n5k6474q10Q730K091J9388J2767m163j5405n041
15148H718j844J6234m170J0923R617l750j6183L325r490k486j538j1088k803j2192
$$ plain form
15134 -16727 -15371 -18381 -35544 -38581 -40946 -19627 -14995 -3892 -18269 -23583 -9973 -18541 -17172
15121 -17172 -8384 6085 5352 6079 1958 2043 -16433 -35471 -15989 24420 40575 27897 21094 9955
15107 9955 3493 -8393 -1956 4034 -2396 4419 -17755 -37351 -31278 -25198 990 -608 -3418 10922
15093 10922 21171 26909 15258 15178 20931 21943 12193 -2046 -11384 -5073 13958 8715 -1676 7023
15079 7023 -4493 4728 -3680 -27724 -23268 -7578 543 5692 -189 -12943 -18049 -6081 9127
15066 9127 22614 21713 18325 27802 35748 25330 28011 21599 23729 42507 10472 -16398 -8009 -10481
15052 -10481 6450 3583 17939 33508 34350 8518 -11001 1820 20865 22209 17273 -782 -12786
15039 -12786 -11677 -20951 -2501 19527 26587 5641 -15956 -14441 -2428 2541 23596 23515 -2568
$$ packed form
15134a6727J356l010j7163l037k365K1319M632J1103j4377n314J3610q568J369
15121a7172Q788J4469p33P27m121Q5j8476j9038J9482M0409J6155j2678o803j1139
15107I955o462j1886O437N990o430O815k2174j9596O073O080K6188j598k810J4340
15093A0922J0249N738j1651q0N753J012r750j4239r338O311J9031n243j0391Q699
15079G023j1516R221q408k4044M456J5690Q121N149n881j2754n106J1968J5208
15066I127J3487r01l388R477P946j0418K681o412K130J8778l2035k6870Q389k472
15052a0481J6931k867J4356J5569Q42k5832j9519J2821J9045J344m936j8055j2004
15039a2786J109r274J8450K2028P060k0946k1597J515J2013M969K1055q1k6083
$$ plain form
15026 -2568 -7484 -13245 -2722 7402 13374 16344 14825 5066 3726 -5676 10412 18106 -5354 -19069
15012 -19069 -20012 -49424 -36766 -23365 -45042 -29331 -31956 -48049 -32988 -24054 -24588 -30615 -37666
14999 -37666 -22193 6760 17394 30278 54619 72589 69183 52504 34431 16890 -15991 -25410
14987 -25410 -22410 -36303 -40714 -39035 -10288 -7009 -7700 -5085 -16936 -21565 -37442 -52163 -45816
14974 -45816 -45848 -56671 -51242 -29723 -29181 -29428 -30421 -22189 -19393 -7381 -15613 -16189 -17478 -27275 -45753
14959 -45753 -36475 -27358 -47026 -29097 3320 14699 -5133 -11437 -233 -6536 -11540 2627 -12996
14946 -12996 -32708 -27246 -28349 -28508 -20478 -22459 -18040 -17287 5891 -356 -8732 4171 -7348 -3686
14932 -3686 14686 24655 -3726 -18207 -26078 -41058 -39394 -25007 -21446 -21535 -10141 -7566 9531
$$ packed form
15026b568m916n761J0523J0124N972K970j519r759j340r402J6088P694k3460j3715
15012a9069r43k9412J2658J3401k1677J5711k625j6093J5061Q934n34o027p051
14999c7666J5473K8953J0634J2884K4341J7970l406j6679j8073j7541l2881r419
14987b5410L000j3893m411J679K8747L279o91K615j1851m629j5877j4721O347
14974d5816l2j0823N429K1519N42k47r93Q232K796J2012q232n76j289r797j8478
14959d5753R278R117j9668J7929L2417J1379j9832o304J1204o303n004J4167j5623
14946a2996j9712N462j103j59Q030j981M419P53K3178o247q376J2903j1519L662
14932c686J8372R969k8381j4481p871j4980J664J4387L561q9J1394K575J7097
$$ plain form
14919 9531 40082 37913 18289 -10430 -15825 -6103 -4124 -3232 -12262 1298 21009 3303 -4179
14906 -4179 -10991 -11430 -19608 -13231 -10527 967 8929 -3730 -1121 -11645 -29429 -16095 166
14893 166 17915 -3836 -10848 13 -13783 -1504 13171 12378 30719 25862 26024 20509 13101 6128
14879 6128 -2408 -2522 -4235 14041 8431 -4235 -6521 9730 32064 27189 12709 -1855 19895
14866 19895 11969 5516 7604 9505 8209 2005 -686 -10285 11749 14168 -212 -8982 2983 -8446
14852 -8446 6900 16654 13624 13991 -1579 -6925 -19066 -31120 -13565 -10414 -11342 -4080 -2356 3583
14838 3583 4387 16801 15570 1319 -314 16446 21836 16794 6852 18251 35998 27530 11530
14825 11530 30311 34603 -883 -18142 -3802 21792 46783 36264 29836 25506 5209 -5817
$$ packed form
14919I531L0551k169j9624k8719n395R722J979Q92r030J3560J9711j7706p482
14906d179o812m39q178O377K704J1494P962j2659K609j0524j7784J3334J6261
14893A66J7749k1751p012J0861j3796J2279J4675p93J8341m857J62n515p408o973
14879F128q536j14j713J8276n610j2666k286J6251K2334m875j4480j4564K1750
14866A9895p926o453K088J901j296o204k691r599K2034K419j4380q770J1965j1429
14852h446J5346R754l030L67j5570n346j2141j2054J7555L151r28P262J724N939
14838C583Q04J2414j231j4251j633J6760N390n042r942J1399J7747q468j6000
14825A1530J8781M292l5486j7259J4340K5594K4991j0519o428m330k0297j1026
$$ plain form
14813 -5817 -14516 -2258 436 -15556 -17094 -25558 -27716 -30098 -23781 -8430 -16805 3573 16387
14800 16387 15019 14941 1545 -8296 3081 30115 47022 43567 20189 9374 19085 24627 23815 32969
14786 32969 25566 18865 2901 135 16761 13541 7119 31104 36169 23232 7672 16338 21422
14773 21422 18603 -2353 9559 24781 27973 18654 6958 27750 8941 10951 13995 -8546 -18772
14760 -18772 -6351 -7539 -1252 -1295 -12817 -21963 -11505 -10218 -17001 -31208 -18311 -4545 8501
14747 8501 25956 26230 15169 -320 -30688 -47550 -15932 7254 11018 3333 1515 1108 -9859
14734 -9859 18747 21971 -5072 -15021 -2762 853 -6062 -18133 -30215 -28011 -12290 -2056 -10455
14721 -10455 -24720 -15144 -6105 -21555 -55077 -67710 -56549 -39586 -13797 -11988 1540 30640
$$ packed form
14813e817q699J2258K694j5992j538q464k158k382O317J5351q375K0378J2814
14800A6387j368p8j3396r841J1377K7034J6907l455k3378j0815R711N542q12R154
14786C2969p403o701j5964k766J6626l220o422K3985N065j2937j5560Q666N084
14773B1422k819k0956J1912J5222L192r319j1696K0792j8809K010L044k2541j0226
14760a8772J2421j188O287m3j1522r146J0458J287o783j4207J2897J3766J3046
14747H501J7455K74j1061j5489l0368j6862L1618K3186L764p685j818m07j0967
14734i859K8606L224k7043r949J2259L615o915j2071j2082K204J5721J0234q399
14721a0455j4265R576R039j5450l3522j2633J1161J6963K5789J809J3528K9100
$$ plain form
14709 30640 38912 15900 -5796 -8102 -6260 30576 36741 18100 15214 10668 13540 22630 25027
14696 25027 20680 24017 9282 1954 -5953 13947 23924 15130 11424 8171 20347 22937 -5152
14683 -5152 -7663 7817 11421 12468 28669 2891 797 3318 -21767 -28444 -20453 1867 5002
14670 5002 -14247 -9926 -20497 -19024 -8230 20667 24305 12839 1482 4260 1170 -17740 -30101
14657 -30101 -26937 -31074 -31377 -16095 -20742 -18791 -2842 -3591 -5958 -22936 -33454 -24088 -3695 1250
14643 1250 -2489 -1678 -9126 -9793 -5273 1388 -21556 -19947 897 5175 4852 14828 19238 11062 15290
14628 15290 35077 31255 17568 11951 -16283 -17153 -10935 1680 17746 20843 20990 18765 11602 -654
14614 -654 -9003 5938 6651 -814 3156 -16676 -29394 -19731 11594 27653 32047 25638 -6174 -24229
$$ packed form
14709C0640Q272k3012k1696k306J842L6836O165j8641k886m546K872R090K397
14696B5027m347L337j4735p328p907J9900R977q794l706l253J2176K590k8089
14683e152k511J5480L604J047J6201k5778k094K521k5085o677P991K2320L135
14670E002j9249M321j0571J473J0794K8897L638j1466j1357K778l090j8910j2361
14657c0101L164m137l03J5282m647J951J5949p49k367j6978j0518R366K0393M945
14643A250l739Q11p448o67M520O661k2944J609K0844M278l23R976M410q176M228
14628A5290J9787l822j3687n617k8234q70O218J2615J6066L097J47k225p163j2256
14614f54q349J4941P13p465L970j9832j2718R663L1325J6059M394o409l1812j8055
$$ plain form
14600 -24229 -13069 -12057 13030 26404 25030 21461 3792 -2777 -12540 -22081 -7707 8808 13163
14587 13163 -3545 -15355 -14823 -26895 -36500 -21258 -9669 -13225 8253 6788 1488 1242 4721
14574 4721 20021 15031 8994 -10223 -12686 -20435 -26516 -22042 -26126 -8946 15655 30908 27345
14561 27345 68 -15180 -22310 -17660 9022 18471 26426 18707 29901 37211 20754 -7715 4824
14548 4824 31329 13958 -5358 -10742 -11680 -1581 12150 19631 8348 -2857 10960 21674 10271
14535 10271 1297 -9400 -12309 -3347 276 7856 31216 46400 34136 37724 35654 29096 24071
14522 24071 16766 -684 222 -5620 -1 18426 24819 15678 3085 -12394 -5424 12677 34803
14509 34803 19944 10973 673 6980 21722 36266 45090 30946 2411 -14282 -7837 3768
$$ packed form
14600b4229J1160J012K5087J3374j374l569j7669o569r763r541J4374J6515M355
14587A3163j6708j1810N32j2072r605J5242J1589l556K1478j465n300k46L479
14574D721J5300m990o037j9217k463p749o081M474m084J7180K4601J5253l563
14561B7345k7277j5248p130M650K6682R449P955p719J1194P310j6457k8469J2539
14548D824K6505j7371j9316n384r38J0099J3731P481j1283j1205J3817J0714j1403
14535A0271q974j0697k909Q962L623P580K3360J5184j2264L588k070o558n025
14522B4071p305j7450R06n842N619J8427O393r141j2593j5479O970J8101K2126
14509C4803j4859q971j0300O307J4742J4544Q824j4144k8535j6693O445J1605
$$ plain form
14497 3768 5342 -16417 -37797 -26884 -27623 -32033 -32956 -12388 -6660 91 20296 29795 46388 59114
14483 59114 58264 50730 44502 41032 28410 30865 33799 46618 23343 22975 20771 -18065 -29510 -11845
14469 -11845 -25318 -26043 -20696 -8170 6275 9367 -16537 -14342 -14472 -12103 -5389 -3772 -11297 -12522
14455 -12522 -7306 -17517 -9947 -22123 -32048 -30906 -10249 7237 -1816 20537 29946 29285 6003
14442 6003 -11798 -28986 -36663 -27305 -19313 -24092 -18861 -7854 -14469 -14232 -16907 -5266 -840 -4801
14428 -4801 -20602 -24227 -26632 -42609 -31707 -2585 -7519 9097 26104 15927 -16245 -14392 912
14415 912 24787 13337 6410 5757 6230 -10413 -9561 -4302 -37119 -33109 -30006 -22461 -16634 -7449 -9272
14400 -9272 -26404 -9566 -889 -15865 -15155 3361 -150 -13292 -14576 -16133 -19160 -18187 5899 6298
$$ packed form
14497C768J574k1759k1380J0913p39m410r23K0568N728O751K0205R499J6593J2726
14483E9114q50p534o228l470j2622K455K934J2819k3275l68k204l8836j1445J7665
14469a1845j3473p25N347J2526J4445L092k5904K195j30K369O714J617p525j225
14455a2522N216j0211P570j2176r925J142K0657J7486r053K2353R409o61k3282
14442F003j7801j7188p677R358P992m779N231J1007o615K37k675J1641M426l961
14428d801j5801l625k405j5977J0902K9122m934J6616J7007j0177l2172J853J5304
14415I12K3875j1450o927o53M73j6643Q52N259l2817M010L103P545N827R185j823
14400i272j7132J6838Q677j4976P10J8516l511j3142j284j557l027R73K4086L99
$$ plain form
14386 6298 13211 12841 45781 58995 54028 33984 13187 19842 28373 46599 43446 15317 20032
14373 20032 24063 33178 31265 24425 -17945 -38844 -21818 -7720 14158 27678 8534 -12891
14361 -12891 -4531 -5525 -19945 -7056 -2325 -6137 -16530 -4970 7531 6005 -2003 400 10330
14348 10330 18245 25125 37099 24875 18148 7663 6893 7158 -384 -18259 -17380 9659 26707 19187
14334 19187 20577 30149 18785 14110 23181 2224 -33283 -44680 -18858 -5157 -16287 2710
14322 2710 16648 13379 46786 35374 28966 9156 -5412 -12390 -923 -10046 -34118 -39674 -32734
14309 -32734 -28028 -5042 89 -17662 -27991 -8885 -23588 -22517 -16954 -7048 4436 -14536 -14429
14296 -14429 -8426 -13885 -27351 -32990 -20971 -24671 -4650 2563 -10419 -10689 -16194 -17395 -8054 -595
$$ packed form
14386F298O913l70L2940J3214m967k0044k0797O655Q531J8226l153k8129M715
14373B0032M031R115j913o840m2370k0899J7026J4098K1878J3520j9144k1425
14361a2891Q360r94j4420J2889M731l812j0393J1560J2501j526q008K403R930
14348A0330P915O880J1974j2224o727j0485p70K65p542j7875Q79K7039J7048p520
14334A9187J390R572j1364m675R071k0957l5507j1397K5822J3701j1130J8997
14322B710J3938l269L3407j1412o408j9810j4568o978J1467r123k4072n556O940
14309c2734M706K2986N131j7751j0329J9106j4703J071N563R906J1484j8972J07
14296a4429O003n459j3466n639J2019l700K0021P213j2982k70n505j201R341P459
$$ plain form
14282 -595 8936 18369 19257 21478 13569 -10969 -16675 -5238 11572 10929 8905 7790 -8579 -16287
14268 -16287 -10133 2917 12239 10738 1230 -4856 -3408 -2473 -5349 -6772 -11967 -17322 -7204 -27814
14254 -27814 -1866 26256 18420 -7416 7266 45368 42447 -2488 -16092 11243 23741 27445
14242 27445 35037 43854 30186 39080 33967 3447 -7398 885 8588 11476 32376 27883 22558
14229 22558 34276 28328 36733 31930 19048 14533 22926 11530 9723 10155 13595 -3367 -13219 11930
14215 11930 28797 36889 30424 34711 12279 -2656 8544 7733 11900 1802 2496 -1403 -17818
14202 -17818 -14566 12159 19710 21259 -1675 -1778 11424 33478 34048 23083 -6704 -5583 -3752
14189 -3752 4256 16649 14888 2658 2853 -3194 -13469 -16094 -22721 -23333 -25157 -13061 17240 13417
$$ packed form
14282e95R531R433Q88K221p909k4538n706J1437J6810o43k024j115j6369p708
14268a6287O154J3050R322j501r508o086J448R35k876j423n195n355J0118k0610
14254b7814K5948K8122p836k5836J4682L8102k921m4935j3604K7335J2498L704
14242B7445P592Q817j3668Q894n113l0520j0845Q283P703K888K0900m493n325
14229B2558J1718n948Q405m803j2882m515Q393j1396j807M32L440j6962r852K5149
14215A1930J6867Q092o465M287k2432j4935J1200q11M167j0098O94l899j6415
14202a7818L252K6725P551J549k2934j03J3202K2054N70j0965k9787J121J831
14189c752Q008J2393j761j2230J95o047j0275k625o627o12j824J2096L0301l823
$$ plain form
14175 13417 -1626 -9441 -2090 9474 11112 18595 17126 -8231 -3315 21329 18675 18114 4677
14162 4677 7189 15826 6371 6516 11797 25804 41754 24073 13096 3367 2690 -22066 -32121 -48673
14148 -48673 -58397 -36812 -28830 -19892 -7664 16855 9956 -10925 -23743 -9409 -17889 -20029 -12643
14135 -12643 -7160 -5724 16676 27638 44986 58785 61426 55697 54018 25954 1845 -2948 17553
14122 17553 16750 13238 14259 29074 19630 18752 22736 14010 -10103 -6899 5754 208 -22176 -20093
14108 -20093 8979 24338 19847 29996 13133 -4441 -17331 -9237 -19930 -12354 -6112 7727
14096 7727 9546 4106 -531 7392 22119 38741 20434 -8779 -26411 -12159 13972 656 250
14083 250 -11179 -4775 -10935 -12710 -6850 -12513 -20718 -4520 11707 4076 9064 11071 5744 -22244
$$ packed form
14175A3417j5043p815P351J1564J638P483j469k5357M916K4644k654n61j3437
14162D677K512Q637r455J45N281J4007J5950j7681j0977r729o77k4756j0055j6552
14148d8673r724K1585P982Q938J2228K4519o899k0881j2818J4334q480k140P386
14135a2643N483J436K2400J0962J7348J3799K641n729j679k8064k4109m793K0501
14122A7553q03l512J021J4815r444q78L984q726k4113L204J2653n546k2384K083
14108b0093K9072J5359m491J0149j6863j7574j2890Q094j0693P576O242J3839
14096G727J819n440m637P923J4727J6622j8307k9213j7632J4252K6131j3316m06
14083B50j1429O404o160j775N860n663q205J6198J6227p631M988K007n327k7988
$$ plain form
14069 -22244 -15235 -2457 17143 16415 10610 15225 -3697 -5939 -4712 3827 14570 19447 14370 -11759
14055 -11759 5009 17549 13570 14688 12338 -7161 -19058 -24151 -24292 -7251 -3890 -17523 -24148
14042 -24148 -12355 8726 7778 -972 -6163 7901 10629 6209 -2773 -5302 -501 -11550 -7672 -20334
14028 -20334 -32975 -32842 -33128 -33971 -39052 -25163 -22276 -15110 -14706 -17490 -9380 2570 11230 -4503
14014 -4503 4931 12302 -65 2904 12250 26261 28120 9169 -17200 -29515 -15460 -11928 -17343
14001 -17343 -9640 1323 7460 1133 -3667 -2734 -21427 -16575 4412 12659 27011 30503 27870 24064
13987 24064 22990 32657 26253 2497 4060 14636 -826 10610 6853 20396 20089 3200 9486
13974 9486 32816 32016 30001 22788 2380 -5309 18891 18727 8456 279 -9505 -10018 -19844 -14136
$$ packed form
14069b2244P009J2778J9600p28n805M615j8922k242J227Q539J0743M877n077k6129
14055a1759J6768J2540l979J118k350j9499j1897n093j41J7041L361j3633o625
14042b4148J1793K1081r48q750n191J4064K728m420q982k529M801j1049L878j2662
14028b0334j2641J33k86q43n081J3889K887P166M04k784Q110J1950Q660j5733
14014d503R434P371j2367K969R346J4011J859j8951k6369j2315J4055L532n415
14001a7343P703J0963O137o327m800R33j8693M852K0987Q247J4352L492k633l806
13987B4064j074R667o404k3756J563J0576j5462J1436l757J3543l07j6889O286
13974I486K3330q00k015p213k0408p689K4200j64j0271q177r784n13r826N708
$$ plain form
13960 -14136 -11515 -7936 8015 2593 -16242 -15893 562 22370 32267 31370 39870 26005 5586
13947 5586 -4499 1050 67 -7497 -8868 3037 35161 50630 74991 38414 18892 25319 14862
13934 14862 16948 3922 1225 6427 -8933 -13546 -9501 -12877 -17876 -868 7210 -6997 -1068
13921 -1068 7502 73 1544 -8308 -7418 -1943 326 -4158 -6218 -5160 1509 25541 30346 23554 8628
13906 8628 15589 18392 17515 21311 45725 31937 19679 34804 26467 7400 2599 -3646 4817 4113
13892 4113 14247 15751 14960 13060 11858 16514 27719 20090 14128 -3849 -8294 -14998 1586 -1090
13878 -1090 -14349 -8396 -783 -5771 -9334 3105 18026 28113 17016 1503 -16351 1485 22130
13865 22130 23711 15014 12598 17075 32322 30513 31625 7816 -3947 -6350 3181 18309 5905
$$ packed form
13960a4136K621L579J5951n422j8835L49J6455K1808R897q97Q500j3865k0419
13947E586j0085N549r83p564j371J1905L2124J5469K4361l6577j9522O427j0457
13934A4862K086j3026k697N202j5360m613M045l376m999J7008Q078j4207N929
13921a068Q570p429J471r852Q90N475K269m484k060J058O669K4032M805o792j4926
13906H628O961K803q77L796K4414j3788j2258J5125q337j9067m801o245Q463p04
13892D113J0134J504p91j900j202M656J1205p629n962j7977m445o704J6584k676
13878a090j3259N953P613m988l563J2439J4921J0087j1097j5513j7854J7836K0645
13865B2130J581q697k416M477J5247j809J112k3809j1763k403R531J5128j2404
$$ plain form
13852 5905 6224 5596 -5775 -5009 10838 19012 5542 -2462 -23385 -7505 -2895 -16801 -14490 -15595
13838 -15595 -20407 -35417 -57306 -68680 -64113 -44036 -26604 -15950 -6835 5088 16097 31612
13826 31612 50286 28400 10232 7988 15796 24038 32572 22095 4933 5719 1375 6115 2471
13813 2471 3648 4769 -6227 -37171 -11136 -5250 -10448 -15658 -20933 -8718 -8987 -7838 -1413 3239
13799 3239 15419 12853 9651 1871 -5263 7030 29512 30515 22186 5956 12855 22629 17298 15268
13785 15268 3915 -273 3050 7733 12669 19492 -2591 -15978 -14171 -24417 -35676 -1244 3362
13772 3362 -8419 -19018 -16834 3967 10847 -4565 -11688 -23443 -30486 -27463 -11136 -25174 -15582
13759 -15582 -4558 -26951 -38462 -33945 -29199 -25483 -13294 3516 -6137 -8837 -2529 -1459 3494
$$ packed form
13852E905L19o28j1371P66J5847Q174j3470q004k0923J5880M610j3906K311j105
13838a5595m812j5010k1889j1374M567K0077J7432J0654R115J1923J1009J5515
13826C1612J8674k1886j8168k244P808Q242Q534j0477j7162P86m344M740l644
13813B471J177J121j0996l0944K6035N886n198n210n275J2215k69J149O425M652
13799C239J2180k566l202p780p134J2293K2482J003q329j6230O899R774n331k030
13785A5268j1353m188L323M683M936O823k2083j3387J807j0246j1259L4432M606
13772C362j1781j0599K184K0801O880j5412p123j1755p043L023J6327j4038R592
13759a5582J1024k2393j1511M517M746L716J2189J6810r653k700O308J070M953
$$ plain form
13746 3494 24871 20630 16031 11430 2736 -5631 -6416 -1972 -2766 485 5049 -4389 -21133 -15043 -7559
13731 -7559 -2271 18487 -8268 -17918 -3289 -2735 -17501 -9747 3594 17668 28743 23857 12192
13718 12192 10171 913 5531 -19012 -25979 -14647 -4173 -24447 -26362 -5962 10551 17262 20335
13705 20335 28665 16091 14494 27546 8103 -3740 10478 31411 41605 13417 -14116 -34309
13693 -34309 -34404 -13292 -28194 -29356 -12534 -6715 644 6129 11017 4482 1708 10578 30808 21484
13679 21484 -9207 -13061 -407 15353 45051 45906 26183 10638 24945 19013 11672 3387 6794
13666 6794 -9433 -20810 -9327 7072 15516 494 10394 22388 -662 -14968 -25094 -11299
13654 -11299 -7042 3300 31880 45744 21645 9443 30537 34264 22053 33206 28825 39297
$$ packed form
13746C494K1377m241m599m601q694q367p85M444p94L251M564r438j6744O090P484
13731g559N288K0758k6755r650J4629N54j4766P754J3341J4074J1075m886j1665
13718A2192k021r258M618k4543o967J1332J0474k0274j915K0400J6513O711L073
13705B0335Q330j2574j597J3052j9443j1843J4218K0933J0194k8188k7533k0193
13693c4309r5K1112j4902j162J6822N819P359N485M888o535k774Q870K0230r324
13679B1484l0691l854J2654J5760K9698Q55j9723j5545J4307n932p341q285L407
13666F794j6227j1377J1483J6399Q444j5022R900J1994k3050j4306j0126J3795
13654a1299M257J0342K8580J3864k4099j2202K1094L727j2211J1153m381J0472
$$ plain form
13642 39297 36971 21765 1645 -10810 -17108 -13156 -13737 -24365 -21937 -22865 -28547 -16365 -26043 -23695
13628 -23695 -22240 -24044 -19631 -24940 -7634 -1480 14297 30266 16299 -18613 -14381 8250 20779
13615 20779 12739 -2559 -2948 1542 13245 25383 29372 38634 23666 11370 20793 30365 19162
13602 19162 421 -17754 -14261 -7076 -12155 -7890 -378 -14893 -7234 -8121 -16323 -27431 -7423
13589 -7423 16109 -4468 -11961 93 7728 3206 8102 8265 6779 13914 7448 24896 10241 -21534
13575 -21534 -32415 -51004 -58075 -28103 -17897 -6168 2287 -8355 3687 3475 -14991 -24453 -17284
13562 -17284 -2870 -2147 4152 -15317 -31461 -21294 -4479 -18166 -13987 9328 13479 8867 31284
13549 31284 47835 56853 49336 26107 20999 40914 23466 11322 10571 15380 27013 5989 2670
$$ packed form
13642C9297k326j5206k0120j2455o298L952n81j0628K428r28n682J2182r678K348
13628b3695J455j804M413n309J7306O154J5777J5969j3967l4912M232K2631J2529
13615B0779q040j5298l89M490J1703J2138L989R262j4968j2296R423R572j1203
13602A9162j8741j8175L493P185n079M265P512j4515P659q87q202j1108K0008
13589g423K3532k0577p493J2054P635m522M896J63j486P135o466J7448j4655l1775
13575b1534j0881j8589p071K9972J0206J1729Q455j0642J2042k12j8466r462P169
13562a7284J4414P23O299j9469j6144J0167J6815j3687M179K3315M151m612K2417
13549C1284J6551R018p517k3229n108J9915j7448j2144p51M809J1633k1024l319
$$ plain form
13536 2670 -15723 -47777 -37784 -23716 -1552 2894 -6259 5080 6066 -8951 -28545 -5356 4178
13523 4178 14717 25917 2204 15953 29540 22150 -1369 -12801 -2289 9101 7633 1117
13511 1117 -2716 4511 12308 6275 1980 1614 3465 3279 -6025 -10875 -8666 -25452 -23255 -4572 14871
13496 14871 25487 27530 37008 36505 28918 15558 5704 1478 -9531 18382 22712 16198 -10339
13483 -10339 -24239 -22558 -1347 15784 4490 -2386 -1937 -13267 -23211 -19449 -2619 -22789 -26425
13470 -26425 -16444 -18391 -3220 26390 24282 16581 22487 27721 21380 17478 -9203 -2835 7607
13457 7607 8889 12389 8018 -5368 7222 8626 -4159 5720 9115 24433 24202 39612 36426 23459
13443 23459 17383 -393 -23268 -15541 2260 -1821 -17947 -6687 -6207 8623 302 -25687 -34393
$$ packed form
13536B670j8393l2054R993J4068K2164M446r153J1339R86j5017j9594K3189R534
13523D178J0539J1200k3713J3749J3587p390k3519j1432J0512J1390j468o516
13511A117l833P227P797o033m295l66J851j86r304m850K209j6786K197J8683J9443
13496A4871J0616K043R478n03p587j3360r854m226j1009K7913M330o514k6537
13483a0339j3900J681K1211J7131j1294o876M49j1330r944L762J6830k0170l636
13470b6425R981j947J5171K9610k108p701N906N234o341l902k6681O368J0442
13457G607J282L500m371j3386J2590J404j2785R879L395J5318k31J5410l186j2967
13443B3459o076j7776k2875P727J7801m081j6126J1260M80J4830q321k5989q706
$$ plain form
13430 -34393 -37720 -32298 -23808 -12707 1489 6 -571 9394 8246 -1429 1775 4025 16944 12606
13416 12606 -1914 -6269 4887 12437 1769 4274 19040 24054 13506 -15903 -7815 -4775 -2369
13403 -2369 9905 40028 58894 50786 63839 51946 30356 16594 3128 -26 1817 -3072 9610
13390 9610 18785 12969 -5811 9711 10582 989 6129 -672 -1638 185 4808 -12107 -30634 -27075
13376 -27075 -8545 10742 14323 -3961 5248 16789 -978 -15199 -29615 -6439 19622 29142
13364 29142 17776 -4363 -9454 17529 14381 5783 4702 -15575 -22860 -9854 5443 12371 11204
13351 11204 17760 20638 7401 -6149 -23887 -12558 -12585 -5955 11288 4117 -43843 -39688 -7094
13338 -7094 19805 12625 -4547 8646 3313 9207 16148 22974 29143 30861 26968 23762 25889 22998
$$ packed form
13430c4393l327N422Q490J1101J4196j483n77R965j148r675L204K250J2919m338
13416A2606j4520m355J1156P550j0668K505J4766N014j0548k9409Q088L040K406
13403b369J2274L0123J8866q108J3053j1893k1590j3762j3466l154J843m889J2682
13390I610R175n816j8780J5522Q71r593N140o801r66J823M623j6915j8527L559
13376b7075J8530J9287L581j8284R209J1541j7767j4221j4416K3176K6061R520
13364B9142j1366k2139n091K6983l148q598j081k0277p285J3006J5297O928j167
13351A1204O556K878j3237j3550j7738J1329k7O630J7243p171m7960M155L2594
13338g094K6899p180j7172J3193n333N894O941O826O169J718l893l206K127k891
$$ plain form
13324 22998 2318 -1817 -18127 -19251 -3403 11845 5553 -675 -1007 6337 29761 21315 4998
13311 4998 5095 9626 2070 -5208 -13933 2327 24573 7304 -26032 -23295 -7473 3031 -3918 8650
13297 8650 3279 -26027 -40480 -38960 -36182 -13967 -5581 -6857 -13275 -13041 -38577 -49523 -45464 -13473
13283 -13473 19015 33269 29794 38353 38265 33352 20794 16909 185 -17150 -33623 -31645 -15343
13270 -15343 -10929 -7162 9809 7646 -13743 -35619 -31393 -17963 -22648 -33872 -34136 -22075 -6937
13257 -6937 -9438 -21299 -32589 -35204 -34060 -7531 4628 -21922 -33673 -38254 -37850 -30718 -22665
13244 -22665 -11429 -10385 -33439 -36379 -8926 -4051 -2620 -6827 -17165 -44104 -53377 -24527 -7462
13231 -7462 -709 10016 12998 -1861 -7195 5610 -3815 -7304 8167 15069 -10081 -21612 -45144
$$ packed form
13324B2998k0680m135j6310j124J5848J5248o292o228l32P344K3424q446j6317
13311D998R7M531p556p278q725J6260K2246j7269l3336K737J5822J0504o949J2568
13297H650n371k9306j4453J520K778K2215Q386j276o418K34k5536j0946M059L1991
13283a3473L2488J4254l475Q559q8m913j2558l885j6724j7335j6473J978J6302
13270a5343M414L767J6971k163k1389k1876M226J3430m685j1224k64J2061J5138
13257f937k501j1861j1290k615J144K6529J2159k6550j1751m581M04P132Q053
13244b2665J1236J044k3054k940K7453M875J431m207j0338k6939r273K8850J7065
13231g462O753J0725K982j4859n334J2805r425l489J5471O902k5150j1531k3532
$$ plain form
13218 -45144 -51558 -17716 6883 3687 -12225 5946 16553 14286 -3737 -12369 -1857 13804
13206 13804 9712 1349 2757 31517 38046 25081 14719 19425 27440 18177 15438 33718 37393
13193 37393 17371 -9263 -24856 -22299 -15502 -9696 -10488 -6314 -12742 -2382 -68 -15228 -3028
13180 -3028 -1114 -8241 -9853 4609 18616 23876 20548 27111 35084 30282 17203 15312 1070 -21308
13166 -21308 -26516 20059 40043 20488 -1890 -14160 -24963 -21382 16419 35048 31811 15118
13154 15118 20537 39483 42678 22169 10772 11535 -9288 -14737 -21860 -13254 8210 19060 28791
13141 28791 39510 24582 16114 10354 -7968 -5068 5135 2461 -7891 12498 22612 13715 13303
13128 13303 -2745 -10669 12990 17897 11770 22249 20526 25112 27380 25331 6418 -4247 -11756
$$ packed form
13218d5144o414L3842K4599l196j5912J8171J0607k267j8023q632J0512J5661
13206A3804m092q363J408K8760O529j2965j0362M706Q015r263k739J8280L675
13193C7393k0022k6634j5593K557O797N806p92M174o428J0360K314j5160J2200
13180c028J914p127j612J4462J4007N260l328O563P973m802j3079j891j4242k2378
13166b1308n208M6575J9984j9555k2378j2270j0803L581L7801J8629l237j6693
13154A5118N419J8946L195k0509j1397P63k0823n449p123Q606K1464J0850R731
13141B8791J0719j4928q468n760j8322K900J0203k674j0352K0389J0114q897m12
13128A3303j6048p924K3659M907o127J0479j723M586K268k049j8913j0665p509
$$ plain form
13115 -11756 -7162 7643 19888 14435 23115 18102 -22210 -10802 -13905 -25879 -23192 -16949 2745
13102 2745 -3792 13893 11620 -1731 5301 9372 10876 -4192 -5266 20558 46648 56199 32102
13089 32102 6762 10148 10705 6735 -13345 -19741 521 28107 24665 18826 27809 18560 -6782
13076 -6782 -14151 8209 18941 35417 60465 56045 35504 26033 10337 21652 15778 -4786 -10234
13063 -10234 -6486 -9938 -7675 -7628 -25737 -12651 762 5748 5681 8675 -2343 -16054 -16325 -4566
13049 -4566 9716 30507 52081 37036 9914 3150 -12116 -19161 -1143 20381 25880 44597
13037 44597 41401 30094 23025 25467 18038 1804 -2074 -2590 -23126 -24789 -15695 -31577 -47262
13024 -47262 -34863 -24879 -18198 -24575 -25039 -13809 -8865 8995 -1742 -26550 -17597 6610 11562
$$ packed form
13115a1756M594J4805J2245n453Q680n013m0312J1408l103j1974K687O243J9694
13102B745o537J7685k273j3351P032M071J504j5068j074K5824K6090R551k4097
13089C2102k5340L386N57l970k0080o396K0262K7586l442n839Q983r249k5342
13076f782p369K2360J0732J6476K5048m420k0541r471j5696J1315n874k0564n448
13063a0234L748l452K263M7j8109J3086J3413M986o7K994j1018j3711k71J1759
13049d566J4282K0791K1574j5045k7122o764j5266p045J8018K1524N499J8717
13037D4597l196j1307p069K442p429j6234l878n16k0536j663R094j5882j5685
13024d7262J2399R984O681o377m64J1230M944J7860j0737k4808Q953K4207M952
$$ plain form
13011 11562 -2766 -31317 -30887 -22605 -25669 -14811 -21746 -42929 -18660 -15197 -20903 -5626 -1603
12998 -1603 -4288 -10844 -7164 945 -12362 -18784 -22470 -7325 1123 20023 29025 37135 17596 -2952
12984 -2952 -37173 -28741 -21435 -13681 -4501 16707 10697 20919 22914 999 -24394 -29875 -1351
12971 -1351 3753 10968 -323 -11267 2365 24322 28178 12089 -16883 -31595 -24065 -11857 -25426
12958 -25426 -24593 -18149 -8293 -13682 -16083 15617 16316 11425 35640 41093 30175 11710 10936 8072
12944 8072 -7606 -7446 1064 4384 814 2398 15797 3813 -8519 -20684 -2387 4657 -12701
12931 -12701 -10250 -5422 6541 27247 16174 -2917 -15181 -11508 -22146 -34986 -31021 -17590
12919 -17590 -8972 -21238 -20127 -2491 7732 6423 -1473 -2611 147 2424 14328 23532 7086
$$ packed form
13011A1562j4328k8551M30Q282l064J0858o935k1183K4269L463n706J5277M023
12998a603k685o556L680Q109j3307o422l686J5145Q448J8900R002Q110j9539k0548
12984b952l4221Q432P306P754R180K1208o010J0222J995k1915k5393n481K8524
12971a351N104P215j1291j0944J3632K1957L856j6089k8972j4712P530J2208j3569
12958b5426Q33O444R856n389k401L1700O99m891K4215N453j0918j8465p74k864
12944H072j5678J60Q510L320l570J584J3399j1984j2332j2165J8297P044j7358
12931a2701K451M828J1963K0706j1073j9091j2264L673j0638j2840L965J3431
12919a7590Q618j2266J111J7636J0223j309p896j138K758K277J1904R204j6446
$$ plain form
12906 7086 -12715 11156 11630 -5894 505 -4805 6752 45503 36365 26760 12642 -11280 -23771
12893 -23771 -13800 1873 4421 8232 -1510 2839 9946 19542 15973 475 -26231 -26606 -8731 9213
12879 9213 20844 25142 15880 8286 2984 5589 -2270 6508 -11630 -4862 15917 17197 2256 11598
12865 11598 17957 17932 -4331 -10411 12540 9284 -13174 -29766 -15266 25010 24515 27175 27807 21251
12851 21251 11465 4699 6804 10436 29565 19390 -10059 -5530 -6183 2070 9367 -4169 9099
12838 9099 12429 -504 -11135 -4128 -16492 -20185 2789 5860 -1683 4096 -11852 -23368 -33968
12825 -33968 -9417 23041 29365 23897 -699 5776 -1268 -3096 23380 38170 29379 30483 26416
12812 26416 24977 26190 38627 38663 24737 13023 -12647 -15430 -25987 -26808 1649 -4574 -7055 -6938
$$ packed form
12906G086j9801K3871M74j7524O399n310J1557L8751r138r605j4118k3922j2491
12893b3771R971J5673K548L811r742M349P107R596l569j5498k6706l75J7875J7944
12879I213J1631M298r262p594n302K605p859Q778j8138O768K0779J280j4941R342
12865A1598O359k5k2263o080K2951l256k2458j6592J4500M0276m95K660O32o556
12851B1251r786o766K105L632J9129j0175k9449M529o53Q253P297j3536J3268
12838I099L330j2933j0631P007j2364l693K2974L071p543N779j5948j1516j0600
12825c3968K4551L2458O324n468k4596O475p044j828K6476J4790q791J104m067
12812B6416j439J213J2437L6j3926j1714k5670k783j0557q21K8457o223k481J17
$$ plain form
12798 -6938 -6232 -179 4808 8026 21597 26552 17642 15578 -9231 -23144 -12815 -3593 -8697 -7520
12784 -7520 -11334 12051 28781 53583 83289 69147 43136 34447 27325 37634 43032 19009 5981
12771 5981 22006 2571 -18644 -24442 -5865 7821 6365 -10695 -32297 -29119 -20159 -19909 -36609
12758 -36609 -42752 -21455 -5485 -6124 -8887 -6019 519 9461 17351 6100 -11626 -37451 -31815
12745 -31815 -21644 761 10789 -4308 -10962 -4409 4779 -4768 -7721 -15785 -29891 -18609 -493
12732 -493 21807 26737 30149 30928 24583 28994 28775 17008 35445 58533 35551 12345 1712 1928
12718 1928 17664 867 -376 -7478 -20256 -3324 -1945 -18590 -29026 -21419 5542 18360 7051
12705 7051 -14211 -33549 -33534 -9008 6059 3638 23489 15388 -6231 4487 14302 22873 41657
$$ packed form
12798f938P06O053M987L218J3571M955q910k064k4809j3913J0329R222n104J177
12784g520l814K3385J6730K4802K9706j4142k6011q689p122J0309N398k4023j3028
12771E981J6025j9435k1215n798J8577J3686j456j7060k1602L178Q960K50j6700
12758c6609o143K1297J5970o39k763K868O538Q942P890j1251j7726k5825N636
12745c1815J0171K2405J0028j5097o654O553R188r547k953q064j4106J1282J8116
12732d93K2300M930L412P79o345M411k19j1767J8437K3088k2982k3206j0633K16
12718A928J5736j6797j243p102j2778J6932J379j6645j0436P607K6961J2818j1309
12705G051k1262j9338J5K4526J5067k421J9851q101k1619J0718R815Q571J8784
$$ plain form
12692 41657 35475 28072 20290 13720 15068 12940 16010 6428 -3404 15 6322 14965 22138 15499
12678 15499 8450 13373 -10635 -4220 8680 19690 22219 8384 -15763 -13292 11497 40362 41958
12665 41958 16533 682 -3443 21376 10396 1093 -12891 -10757 -24430 -21087 879 3989 -20898
12652 -20898 -22754 19401 28391 14602 -1084 -279 10948 9515 -6629 -11155 -20082 -9736 -16778
12639 -16778 3253 14888 10852 10820 3799 3763 664 204 -254 1229 -2728 -10859 -6372 9192 11788
12624 11788 3450 6836 15488 20590 625 -495 -5504 3239 20550 35247 27784 14372 -3105
12611 -3105 12528 4469 -9295 -22884 -29243 -25814 -15230 -2354 -4028 14397 4419 -149 27816
12598 27816 30570 27076 7696 -9448 7756 17937 35934 24465 15925 18972 8015 -7526
$$ packed form
12692D1657o182p403p782o570J348k128L070r582r832L419O307Q643P173o639
12678A5499p049M923k4008O415J2900J1010K529j3835k4147K471K4789K8865J596
12665D1958k5425j5851m125K4819j0980r303j3984K134j3673L343K1966L110k4887
12652b0898j856M2155Q990j3789j5686Q05J1227j433j6144m526q927J0346p042
12639a6778K0031J1635m036l2p021l6l099m60m58J483l957q131M487J5564K596
12624A1788q338L386Q652N102j9965j120n009Q743J7311J4697p463j3412j7477
12611c105J5633q059j3764j3589o359L429J0584J2876j674J8425r978m568K7965
12598B7816K754l494j9380j7144J7204J0181J7997j1469q540L047j0957j5541
$$ plain form
12586 -7526 -4344 3532 11877 10644 14251 18267 -4687 -5671 -608 -4035 -18284 -5732 15922 13631
12572 13631 13639 17073 7731 8207 -1235 -19475 -31996 -1156 28357 47999 51362 48070 46102 41939
12558 41939 19338 9807 7478 24219 24036 4017 8984 24243 16622 25491 20186 18079 55938
12545 55938 40910 -3903 -28968 -42041 -29224 -35961 -50705 -48684 -48083 -16793 352 7979 12141
12532 12141 -14298 -702 -10803 -26089 -24625 -12315 -9633 -2074 -10067 -8444 22493 33215 26449
12519 26449 6650 4867 8365 -2398 11162 28143 39215 33141 18524 16422 52822 35423
12507 35423 9469 11951 19412 24780 5884 -21634 -19102 -7223 -34029 -23496 -4599 10976
12495 10976 11213 3990 -12325 -8683 9175 18119 11305 24973 40496 40148 33563 25869 42948 35462
$$ packed form
12586g526L182P876Q345j233L607M016k2954r84N063l427j4249J2552K1654k291
12572A3631QL434r342M76r442j8240j2521L0840K9513J9642L363l292j968m163
12558D1939k2601r531k329J6741j83k0019M967J5259p621Q869n305k107L7859
12545E5938j5028m4813k5065j3073J2817o737j4744K021O01L1290J7145P627M162
12532A2141k6439J3596j0101j5286J464J2310K682P559p993J623L0937J0722o766
12519B6449j9799j783L498j0763J3560J6981J1072o074j4617k102L6400j7399
12507C5423k5954K482P461N368j8896k7518K532J1879k6806J0533J8897J5575
12495A0976K37p223j6315L642J7858Q944o814J3668J5523l48o585p694J7079p486
$$ plain form
12481 35462 -378 -24118 -8586 -6184 11465 -1614 -13049 2161 23359 19437 16823 28759
12469 28759 16581 9040 15005 11975 8661 597 3356 -6435 -21141 -13218 3752 15813 24410
12456 24410 20423 22866 19556 13179 17136 17794 1568 7084 5699 8515 18938 10588 9046 14940
12442 14940 33066 29617 8534 -17992 -26712 -34508 -26502 -20642 -18428 7487 14704 -8425 4620
12429 4620 6857 13900 15068 -5256 7318 8365 -23924 -21759 -29577 -41645 -21285 -12932 -3624
12416 -3624 -962 16218 32989 40302 37487 20744 6822 131 -308 6065 9424 8595 4165 20407
12402 20407 2993 7019 6102 128 4821 15918 21321 13440 10480 27876 29463 33046 24129 1617
12388 1617 6067 -3786 -24964 -24569 -4299 -15215 -11021 13683 11591 -11253 -18598 -20142 -13325 -11548
$$ packed form
12481C5462l5840k3740J5532K402J7649j3079j1435J5210K1198l922k614J1936
12469B8759j2178p541N965l030l314q064K759r791j4706P923J6970J2061Q597
12456B4410l987K443l310o377L957O58j6226N516j385K816J0423q350j542N894
12442A4940J8126l449k1083k6526q720p796Q006N860K214K5915P217k3129J3045
12429D620K237P043J168k0324J2574J047l2289K165p818j2068K0360Q353R308
12416c624K662J7180J6771P313k815j6743j3922o691m39O373L359q29m430J6242
12402B0407j7414M026r17n974M693J1097N403p881k960J7396J587L583q917k2512
12388A617M450r853k1178L95K0270j0916M194K4704k092k2844p345j544O817J777
$$ plain form
12374 -11548 -13742 -19555 -6644 -8703 -12367 8541 -711 6558 33338 23871 -9224 -7700 7059
12361 7059 -2829 -16586 -21064 -30167 -24383 -7767 -3643 -1510 553 -15799 -4100 -10286 -18133 5630
12347 5630 18564 27504 30828 7894 2402 3218 -2353 -4526 -34685 -41967 -36436 -21162 -5494 7991
12333 7991 1616 15670 28062 5241 -20710 -28284 -12510 11002 24711 12100 1891 10242
12321 10242 1983 -1979 2196 8052 11893 18049 34648 34568 7968 -16996 -4786 12686 -3052
12308 -3052 -27885 -23314 4153 11542 29188 23519 5896 5156 467 -17740 -21205 -2706 7663
12295 7663 4175 9639 11808 3822 -10559 -17982 -4899 7988 -11141 -13237 -2025 10331 -10314
12282 -10314 -17263 3153 13334 2433 3259 28598 38495 51788 52886 22381 14237 32610 47444
$$ packed form
12374a1548k194n813J2911k059l664K0908r252P269K6780r467l3095J524J4759
12361G059r888j3757m478r103N784J6616M124K133K063j6352J1699o186p847K3763
12347E630J2934Q940L324k2934n492Q16n571k173l0159p282N531J5274J5668J3485
12333G991o375J4054J2392k2821k5951p574J5774K3512J3709j2611j0209Q351
12321A0242q259l962M175N856L841O156J6599q0k6600k4964J2210J7472j5738
12308c052k4833M571K7467P389J7646n669j7623p40m689j8207l465J8499J0369
12295G663l488N464K169p986j4381p423J3083J2887j9129k096J1212J2356k0645
12282a0314o949K0416J0181j0901Q26K5339R897J3293J098l0505q144J8373J4834
$$ plain form
12269 47444 35868 21737 23232 26224 -2354 -20480 -10229 26608 38021 18304 4401 -5166
12257 -5166 -13223 -1637 -2479 -15870 -18316 -30338 -38603 -27134 -15917 -7885 -4666 6383 10437
12244 10437 12192 14072 9764 13776 10394 -3455 -3378 1443 20386 11853 5311 -19099 -15926 7583
12230 7583 28876 25965 20161 17769 3688 30025 40597 20068 11682 9487 -2288 2799 38490
12217 38490 70393 57915 42948 35257 44514 33958 39842 41261 27464 19129 16606 14714 4744
12204 4744 8635 -18332 -25701 -8244 18367 -1269 -5298 17193 6478 2688 155 19694 34442
12191 34442 43011 44010 26533 44681 44041 27180 15689 14020 16790 25960 29215 14252 14733 30886
12177 30886 38248 38844 53089 43204 30358 20480 21837 22182 -2973 18487 20603 5366 17736
$$ packed form
12269D7444j1576j4131J495K992k8578j8126J0251L6837J1413j9717j3903r567
12257e166q057J1586q42j3391k446j2022q265J1469J1217Q032L219J1049M054
12244A0437J755J880m308M012l382j3849P7M821J8943q533o542k4410L173K3509
12230G583K1293k911n804k392j4081K6337J0572k0529q386k195j1775N087L5691
12217C8490L1903j2478j4967p691R257j0556N884J419j3797q335k523j892r970
12204D744L891k6967p369J7457K6611j9636m029K2491j0715l790k533J9539J4748
12191C4442Q569R99j7477J8148o40j6861j1491j669K770R170L255j4963M81J6153
12177C0886P362N96J4245r885j2846r878J357L45k5155K1460K116j5237J2370
$$ plain form
12164 17736 38281 27373 25550 50572 60937 63196 63012 75809 101965 133203 145186 170471
12152 170471 194534 214504 235228 276289 347695 416652 448475 449288 452877 447577 433476 417339
12140 417339 389922 336007 307869 295484 270644 262807 249204 248740 240787 191337 174865 182217
12128 182217 182219 186974 191758 208747 211293 227482 227316 242069 288001 321401 336123 362779 386445
12115 386445 423102 452057 475990 476079 467742 436989 384602 351423 315796 253906 209610 176597
12103 176597 169800 150445 142111 134085 122538 95823 82825 58473 49410 43383 32034 14060
12091 14060 20149 39985 34156 36137 38131 50061 58085 15886 -9128 -592 -14831 -10494 24871
12078 24871 7129 -1206 -8597 -5364 9165 9581 15807 11234 11811 30232 42069 6671 -8746
$$ packed form
12164A7736K0545j0908j823K5022J0365K259j84J2797K6156L1238J1983K5285
12152A70471K4063J9970K0724M1061P1406O8957L1823Q13L589n300j4101j6137
12140D17339k7417n3915k8138j2385k4840p837j3603m64p953m9450j6472P352
12128A82217KM755M784J6989K546J6189j66J4753M5932L3400J4722K6656K3666
12115C86445L6657K8955K3933Q9q337l0753n2387l3179l5627o1890m4296l3013
12103A76597o797j9355q334q026j1547k6715j2998k4352r063o027j1349j7974
12091A4060O089J9836n829J981J994J1930Q024m2199k5014Q536j4239M337L5365
12078B4871j7742q335p391L233J4529M16O226m573N77J8421J1837l5398j5417
$$ plain form
12065 -8746 3226 -856 -2482 8963 18976 2013 5418 -2495 -22140 -34906 -18628 -12311 -7191
12052 -7191 13735 22434 13972 -16092 -11990 -9357 8176 7642 4074 -3429 17877 26832 24382 32195
12038 32195 42134 24065 27771 22286 7260 15873 21896 37390 45579 30437 28041 36306 32548
12025 32548 8287 -31850 -14776 -4339 -9612 -13418 13448 19082 -11300 -32054 -29474 -41721
12013 -41721 -26751 -4319 6527 -9022 -25570 -21709 -7965 3490 -3208 -619 -3980 -2182 11402
12000 11402 11493 20071 18180 13526 -6512 -4910 -10001 -20004 -15047 927 -7667 -16584 -13363 -5905
11986 -5905 -3236 -2741 965 -1139 30790 39840 31176 27054 21615 18605 2311 -8602 -23352 -16640
11972 -16640 1324 4890 -8263 -11177 -1888 -6048 1709 26204 28558 11349 -20673 -33333 -20688
$$ packed form
12065h746J1972m082j626J1445J0013j6963L405p913j9645j2766J6278O317N120
12052g191K0926Q699q462l0064M102K633J7533n34l568p503K1306Q955k450P813
12038C2195R939j8069L706n485j5026Q613O023J5494Q189j5142k396Q265l758
12025C2548k4261m0137J7074J0437n273l806K6866N634l0382k0754K580j2247
12013d1721J4970K2432J0846j5549j6548L861J3744J1455o698K589l361J798J3584
12000A1402R1Q578j891m654k0038J602n091j0003M957J5974q594q917L221P458
11986e905K669M95L706k104L1929R050q664m122n439l010j6294j0913j4750O712
11972a6640J7964L566j3153k914R289m160P757K4495K354j7209l2022j2660J2645
$$ plain form
11959 -20688 -5663 15604 43936 34420 26305 675 -12764 -10913 6755 13608 15489 24428 23963
11946 23963 5910 -15989 -20605 -5246 20603 21222 26563 20616 15486 14054 -14708 -22425 -6802
11933 -6802 -8856 -17438 -5621 7517 16656 23349 15418 10097 20299 29360 44228 44183 16042 3372
11919 3372 12951 19087 20028 7352 10775 -17345 -35122 -38543 -12815 21767 40770 52005 65337
11906 65337 66827 30480 4137 -3972 -791 5173 22673 38292 22040 26770 7700 -17727 -8310
11893 -8310 24743 18507 6181 17500 17070 28122 15691 482 622 13481 24762 12437 3927
11880 3927 -453 8108 -16457 -28284 -16822 -3373 -10790 -11927 -2699 -3360 -13216 -14326 -9037 11271
11866 11271 29837 13120 -4038 -7603 -5569 -698 -9688 -10844 -1095 2962 -106 10197 38273
$$ packed form
11959b0688J5025K1267K8332r516q115k5630j3439J851J7668O853J881Q939m65
11946B3963j8053k1899m616J5359K5849O19N341n947n130j432k8762p717J5623
11933f802k054q582J1817J3138R139O693p931n321J0202R061J4868m5k8141j2670
11919C372R579O136R41j2676L423k8120j7777l421K5728L4582J9003J1235J3332
11906F5337J490l6347k6343q109L181N964J7500J5619j6252M730j9070k5427R417
11893h310L3053o236j2326J1319m30J1052j2431j5209J40J2859J1281j2325q510
11880C927m380Q561k4565j1827J1462J3449p417j137R228o61r856j110N289K0308
11866A1271J8566j6717j7158l565K034M871q990j156R749M057l068J0303K8076
$$ plain form
11853 38273 31932 11682 16608 21123 43783 53347 46895 32035 10670 16280 17866 16917 6770
11840 6770 -7389 -18339 -16299 -2833 4307 -684 19259 27325 25904 18777 16471 23342 12142
11827 12142 11797 9701 11544 17759 29325 31706 36648 31513 23830 12040 -6387 -10052 -20456 -26855
11813 -26855 -25190 -11290 -8867 -20248 -14499 6356 11435 11445 19280 5903 -32286 -40015 -16902
11800 -16902 -7211 -19198 -8908 13814 9781 7407 -7995 4297 8686 3418 7523 7740 6472
11787 6472 14008 8418 3641 -1678 508 9759 11205 40014 39574 -3961 -3546 10664 -7421 -24759
11773 -24759 -30909 -18178 -5450 9645 18491 16370 23120 12540 9315 7499 8652 13895 21189
11760 21189 38767 39214 46447 53472 24390 21301 17768 17028 12580 7466 12943 9208 10311 29660
$$ packed form
11853C8273o341k0250M926M515K2660R564o452j4860k1365N610J586r49j0147
11840F770j4159j0950K040J3466P140m991J9943Q066j421p127k306O871j1200
11827A2142l45k096J843O215J1566K381M942n135p683j1790j8427l665j0404o399
11813b6855J665J3900K423j1381N749K0855N079J0P835j3377l8189p729K3113
11800a6902R691j1987J0290K2722m033k374j5402J2292M389n268M105K17j268
11787F472P536n590m777n319K186R251J446K8809m40m3535M15J4210j8085j7338
11773b4759o150J2731J2728J5095Q846k121O750j0580l225j816J153N243P294
11760B1189J7578M47P233P025k9082l089l533p40m448n114N477l735J103J9349
$$ plain form
11746 29660 20287 25513 22021 19111 18272 33099 19899 15763 14134 6480 -1287 9000 9999 6364
11732 6364 11018 12899 18222 24116 15796 23765 11516 -1607 17484 25566 16440 14699 29980 36003
11718 36003 23851 39148 69430 57972 34754 35889 29633 24299 29326 37126 26969 23835 39405
11705 39405 45011 16172 -14677 -11845 -3591 3838 22257 8508 19879 25431 -10124 -16289 33868
11692 33868 40525 23888 6795 -2390 16457 27393 7446 -1475 -5264 2455 4176 2042 22733
11679 22733 43508 56219 56399 34468 13244 13252 21389 28046 23857 8051 18736 30025 39159 34573
11665 34573 44245 71796 57607 19280 23373 21881 10279 6419 -11169 -24314 -12581 -2395
11653 -2395 -1329 5438 10010 31542 28712 31214 44216 39823 26315 44747 58623 71276 75385
$$ packed form
11746B9660r373N226l492k910q39J4827j3200m136j629p654p767J0287R99l635
11732F364M654J881N323N894q320P969j2249j3123J9091Q082r126j741J5281O023
11718C6003j2152J5297L0282j1458k3218J135o256n334N027P800j0157l134J5570
11705C9405N606k8839l0849K832Q254P429J8419j3749J1371N552l5555o165N0157
11692C3868O657j6637j7093r185J8847J0936j9947q921l789P719J721k134K0691
11679B2733K0775J2711J80k1931k1224QQ137O657m189j5806J0685J1289R134m586
11665C4573R672K7551j4189l8327M093j492j1602l860j7588j3145J1733J0186
11653b395J066O767M572K1532k830K502J3002m393j3508J8432J3876J2653M109
$$ plain form
11640 75385 52426 39224 43986 38741 46889 44466 21731 21980 12991 13440 21729 35428 35860 41306
11626 41306 52263 52324 41683 11214 -5266 -311 10747 35967 29479 751 -4439 6168 8704
11613 8704 17059 29451 19761 13436 25094 38455 37736 34488 16976 19527 20563 7726 28006
11600 28006 34038 20126 14267 30100 -5525 -5158 32323 46327 15684 10365 14039 11129 -309
11587 -309 -957 -4321 9462 6166 15067 16248 19406 11991 6160 19534 34490 49100 47911 40477
11573 40477 25880 27835 36836 24867 28703 13729 32594 53116 18089 -22731 -11097 -6160
11561 -6160 -10557 -7569 -16887 -13323 -7567 -10152 -13194 7765 25577 38535 31181 47749 38273 19413
11547 19413 -19350 -30724 -15925 89 23076 31301 38392 48147 19893 -2217 3645 24856
$$ packed form
11640G5385k2959j3202M762n245Q148k423k2735K49q989M49Q289J3699M32N446
11626D1306J0957O1j0641l0469j6480M955J1058K5220o488k8728n190J0607K536
11613H704Q355J2392r690o325J1658J3361p19l248j7512K551J036j2837K0280
11600B8006O032j3912n859J5833l5625L67L7481J4004l0643n319L674k910j1438
11587c09o48l364J3783l296Q901J181L158p415n831J3374J4956J4610j189p434
11573D0477j4597J955R001j1969L836j4974J8865K0522l5027m0820J1634M937
11561f160m397K988r318L564N756k585l042K0959J7812J2958p354J6568r476j8860
11547A9413l8763j1374J4799J6014K2987Q225P091R755k8254k2110N862K1211
$$ plain form
11535 24856 23331 25964 32821 50900 53478 45765 43658 42656 36248 57954 55885 41914 34710 35467
11521 35467 42755 30462 17907 7297 -20248 -16991 5523 31153 30568 38594 42099 39886 29786
11508 29786 18548 36581 25029 -954 -8616 3162 27774 29189 30528 30293 30660 32095 15768
11495 15768 18677 27541 11888 23031 29476 43972 49086 46111 36743 29058 20426 15436 10395 6270
11481 6270 24904 45243 26795 822 -3312 3899 19102 23091 13656 -2083 -7002 -18802 -9766
11468 -9766 12395 36178 45410 65539 71104 39240 32179 35875 30027 43361 33727 34103 19921
11455 19921 8598 34498 45317 39901 26084 22000 36285 62287 49966 24697 25736 28186
11443 28186 36901 49846 50077 19689 -562 23577 41943 19405 17189 28094 30034 22295 17848
$$ packed form
11535B4856j525K633O857J8079K578p713k107j002o408K1706k069j3971p204P57
11521C5467P288j2293j2555j0610k7545L257K2514K5630n85Q026L505k213j0100
11508B9786j1238J8033j1552k5983p662J1778K4612J415J339k35L67J435j6327
11495A5768K909Q864j5653J1143O445J4496N114k975r368p685q632m990n041m125
11481F270J8634K0339j8448k5973m134P211J5203L989r435j5739m919j1800R036
11468i766K2161K3783R232K0129N565l1864p061L696n848J3334r634L76j4182
11455A9921j1323K5900J0819n416j3817m084J4285K6002j2321k5269J039K450
11443B8186Q715J2945K31l0388k0251K4139J8366k2538k216J0905J940p739m447
$$ plain form
11430 17848 16683 2216 12818 16760 16013 26495 20792 21984 30439 35221 49995 41304 26801
11417 26801 27162 14722 25738 46406 50952 24046 33615 17674 -15612 -36483 -56728 -35033
11405 -35033 -16025 -5857 9316 23413 10302 1293 -1525 -29493 -32976 -4285 19247 25492
11393 25492 18494 16636 -3442 -25094 8121 28655 27004 37706 48650 66340 61948 44988
11381 44988 12935 -9953 -9195 4736 19543 19908 28591 12202 22764 42223 41547 4458 -3014
11368 -3014 136 -6838 6150 4519 -1041 -12532 2745 9812 10016 22796 13588 16550 40770 69802
11354 69802 60752 42058 54220 50163 42785 36146 16604 27330 28849 15150 11542 30286 43772
11341 43772 62492 60560 38708 31382 51054 59261 33639 39598 56200 59602 83554 70005 32801
$$ packed form
11430A7848j165j4467J0602L942p47J0482n703J192Q455M782J4774q691j4503
11417B6801L61j2440J1016K0668M546k6906R569j5941l3286k0871k0245K1695
11405c5033J9008J0168J5173J4097j3111r009k818k7968l483K8691K3532O245
11393B5492o998j858k0078k1652L3215K0534j651J0702J0944J7690m392j6960
11381D4988l2053k2888P58J3931J4807L65Q683j6389J0562J9459o76l7089p472
11368c014L150o974J2988j631n560j1491J5277P067K04J2780r208K962K4220K9032
11354F9802r050j8694J2162m057p378o639j9542J0726J519j3699l608J8744J3486
11341D3772J8720j932k1852p326J9672Q207k5622N959J6602L402K3952j3549l7204
$$ plain form
11328 32801 40310 69138 63347 53139 51289 41126 34454 37368 12687 -112 11705 667 25945
11315 25945 32802 14088 18486 17535 41951 67022 70438 40707 13457 27056 38469 64503 75368
11302 75368 58099 56443 48027 45854 55733 48577 50253 35115 42124 55053 51985 39981 41632
11289 41632 33867 20623 15014 4730 -2756 40234 44866 39651 64782 73493 72898 66645 63661 62516
11275 62516 74406 76639 105704 108205 98826 107655 91853 65523 40044 46038 59863 65083 48693
11262 48693 21331 15957 22779 38650 54777 53219 63740 73207 92386 97684 99923 108453 124359
11249 124359 125779 128566 149747 143173 132503 139321 145914 188992 232778 261156 317102 413409
11237 413409 528921 722126 1030472 1550512 2210758 2480152 2224594 1904992 1580545 1179781
$$ packed form
11328C2801P509K8828n791j0208j850j0163o672K914k4681j2799J1817j1038K5278
11315B5945O857j8714M398r51K4416K5071L416k9731k7250J3599J1413K6034J0865
11302G5368j7269j656q416k173R879p156J676j5138P009J2929l068j2004J651
11289D1632p765j3244n609j0284p486M2990M632n215K5131Q711n95o253k984j145
11275F2516J1890K233K9065K501r379Q829j5802k6330k5479N994J3825N220j6390
11262D8693k7362n374O822J5871J6127j558J0521R467J9179N298K239Q530J5906
11249A24359J420K787K1181o574j0670O818O593M3078M3786K8378N5946R6307
11237D13409J15512J93205L08346N20040O60246K69394k55558l19602l24447m00764
$$ plain form
11227 1179781 826069 564807 408968 318048 258425 221929 181403 147297 146368 129850 110254
11216 110254 98052 105037 97932 91229 91495 79503 69953 77805 82441 63501 64912 74563 78558 71524
11202 71524 72466 45886 51926 80961 98682 116143 112450 98412 101394 97315 102911 90346 88212
11189 88212 97913 101224 89512 101242 94696 105076 92748 99434 104885 87410 58255 60821 54124
11176 54124 47680 50377 73576 103405 124837 126898 113960 127116 128898 102955 88030 72696
11164 72696 69361 47408 47685 64497 62338 58363 65661 56660 23528 29544 22393 43850 48242 50759
11150 50759 57506 50543 59462 72778 84271 99242 85711 73971 50694 52416 63128 102517
11138 102517 122170 115857 71011 50713 45322 60618 76082 72978 67067 66253 99611 127414 154371
$$ packed form
11227A179781l53712k61262j55839r0920n9623l6496m0526l4106r29j6518j9596
11216A10254j2202O985p105o703K66j1992r550P852M636j8940J411R651L995p034
11202G1524R42k6580O040K9035J7721J7461l693j4038K982m079N596j2565k134
11189H8212R701L311j1712J1730o546J0380j2328O686N451j7475k9155K566o697
11176E4124o444K697K3199K9829K1432K061j2938J3156J782k5943j4925j5334
11164G2696l335k1953K77J6812k159l975P298r001l3132O016p151K1457M392K517
11150E0759O747o963Q919J3316J1493J4971j3531j1740k3277J722J0712L9389
11138A02517J9653o313m4846k0298n391J5296J5464l104n911q14L3358K7803K6957
$$ plain form
11125 154371 203077 249519 258704 243380 203395 173250 163464 125967 82682 67229 62290 62979
11113 62979 62850 93360 109501 96104 102575 123016 116790 107941 119852 129335 125044 121501 118625
11100 118625 124832 133177 133284 125620 115423 94208 99276 94850 97370 82738 85258 85285 85750 101608
11086 101608 100134 82261 87667 128747 150099 145765 139610 165498 190352 181360 210928 253793
11074 253793 278247 294960 294836 300692 339556 339657 286509 245353 214090 198670 193950 174655 152419
11061 152419 132693 106132 98779 106537 92036 107322 117671 91139 83908 78409 83262 100533
11049 100533 114090 107099 100199 114322 111953 112835 95703 72009 71678 91556 121222 154970 144026
11036 144026 125941 116932 116801 132877 116842 116815 123476 126150 105536 95494 109631 105389 104142
$$ packed form
11125A54371M8706M6442R185j5324l9985l0145r786l7497m3285j5453m939O89
11113F2979j29L0510J6141j3397O471K0441o226q849J1911R483m291l543k876
11100A18625O207Q345J07p664j0197k1215N068m426K520j4632K520K7M65J5858
11086A01608j474j7873N406M1080K1352m334o155K5888K4854q992K9568M2865
11074B53793K4454J6713j24N856L8864J01n3148m1156l1263j5420m720j9295k2236
11061A52419j9726k6561p353P758j4501J5286J0349k6532p231n499M853J7271
11049A00533J3557o991o900J4123k369Q82j7132k3694l31J9878K9666L3748j0944
11036A44026j8085r009j31J6076j6035k7O661K674k0614j0042J4137m242j247
$$ plain form
11023 104142 115260 135938 168906 174863 142783 122414 115542 128383 130290 138891 117798 61606
11011 61606 257 -20446 -24098 26767 111909 173914 237238 231459 189809 163424 142960 145153
10999 145153 144795 154987 167247 191958 215886 198929 177342 163877 157518 146837 148377 144926
10987 144926 142193 144181 165987 176940 167834 163535 158625 136063 122524 157141 188845 222983
10975 222983 289878 354141 344342 327437 294235 277952 291760 299791 300646 306777 295319 271384
10963 271384 257719 252179 234771 226801 211102 215944 230383 245042 275521 313544 333141 350734
10951 350734 390875 408006 425138 474540 550818 596732 613381 618064 577665 477271 348657
10940 348657 268759 234118 203780 214075 235236 260846 276847 300755 325257 330452 316763 325885
$$ packed form
11023A04142J1118K0678L2968N957l2080k0369o872J2841J907Q601k1093n6192
11011F1606o1349k0703l652N0865Q5142O2005O3324n779m1650k6385k0464K193
10999A45153l58J0192J2260K4711K3928j6957k1587j3465o359j0681J540l451
10987A44926k733J988K1806J0953r106m299m910k2562j3539L4617L1704L4138
10975B22983O6895O4263r799j6905l3202j6283J3808Q031Q55O131j1458k3935
10963B71384j3665n540j7408p970j5699M842J4439J4659L0479L8023J9597J7593
10951C50734M0141J7131J7132M9402P6278M5914J6649M683m0399j00394j28614
10940C48657p9898l4641l0338J0295K1161K5610J6001K3908K4502N195j3689R122
$$ plain form
10928 325885 321584 326397 345193 349052 364742 368426 379563 396874 422412 446923 434026 419098
10916 419098 417788 433279 447157 438107 416023 421705 438391 444455 433445 430885 416900 396723
10904 396723 406537 415917 440285 473944 501682 511153 516181 528803 537811 578200 614312 648102
10892 648102 682882 734403 733519 720914 730148 716666 718321 743419 749079 760277 778748 814546
10880 814546 815216 837501 866928 898964 936747 991656 1045862 1061519 1094997 1142571 1155136 1180806
10868 1180806 1209362 1241971 1268105 1302807 1355476 1437612 1537854 1660404 1765081 1830933 1922730
10857 1922730 2061817 2233759 2411419 2533186 2670438 2837985 2992043 3177740 3435261
10848 3435261 3694539 3975796 4343393 4868649 5622812 6618370 7559799 7930500 8133903
$$ packed form
10928C25885m301M813J8796L859J5690L684J1137J7311K5538K4511j2897j4928
10916D19098j310J5491J3878r050k2084N682J6686O064j1010k560j3985k0177
10904C96723R814R380K4368L3659K7738R471N028J2622R008M0389L6112L3790
10892F48102L4780N1521q84j2605R234j3482J655K5098N660J1198J8471L5798
10880H14546O70K2285K9427L2036L7783N4909N4206J5657L3478M7574J2565K5670
10868A180806K8556L2609K6134L4702N2669Q2136J00242J22550J04677O5852R1797
10857A922730J39087J71942J77660J21767J37252J67547J54058J85697K57521
10848C435261K59278K81257L67597N25256P54163R95558R41429L70701K03403
$$ plain form
10839 8133903 8481885 8841238 9278609 10034064 11159555 12488481 14099887 16147090 18795329
10830 18795329 22089111 26194813 31253512 37623853 46034559 57873713 75587486 104131115
10822 104131115 152462316 236489547 365030698 462389874 434757488 370997871 316271754
10815 316271754 238003410 156960100 101472819 68568144 48657888 35986754 27626107
10808 27626107 21855522 17765743 14777895 12529928 10799004 9484434 8471045 7566897
10800 7566897 6876836 6383176 6031871 5800190 5767611 6070801 6218431 5750618 5133443 4619161
10790 4619161 3992467 3365478 2915708 2565828 2283224 2065747 1894659 1760708 1688984 1630199
10780 1630199 1565501 1474980 1405342 1354541 1311289 1258887 1241903 1209036 1154205 1070961 1002487
$$ packed form
10839H133903L47982L59353M37371P55455J125491J328926J611406K047203K648239
10830A8795329L293782M105702N058699O370341Q410706J1839154J7713773K8543629
10822A04131115M8331201Q4027231J28541151R7359176k7632386o3759617n4726117
10815C16271754p8268344q1043310n5487281l2904675j9910256j2671134q360647
10808B7626107n770585m089779k987848k247967j730924j314570j013389r04148
10800G566897o90061m93660l51305k31681l2579L03190J47630m67813o17175n14282
10790D619161o26694o26989m49770l49880k82604k17477j71088j33951p1724n8785
10780A630199o4698r0521o9638n0801m3252n2402j6984l2867n4831q3244o8474
$$ plain form
10769 1002487 944014 888408 847021 802202 759789 720913 722093 724962 712814 666977 627260 585942
10757 585942 543879 534028 533503 501337 484417 474282 458107 453977 408238 361592 340184 317152
10745 317152 307981 294628 293312 313388 318856 320221 324801 317608 314703 295676 293008 313211 339625
10732 339625 354936 335337 287913 255160 258923 252240 225658 208892 191389 194548 224091 220719
10720 220719 169679 131918 109102 112308 115829 101291 103243 98136 120416 116612 123524 151579 152797
10707 152797 153625 142213 133118 143478 147993 121288 132179 158625 175608 202140 210874 195434
10695 195434 183222 106995 2145 -73812 -42398 -27973 -43029 -50724 -21332 -1939 11849
10684 11849 5679 5428 21247 33579 27715 32148 20461 530 3844 32181 41004 35137 12269
$$ packed form
10769A002487n8473n5606m1387m4819m2413l8876J180K869j2148m5837l9717m1318
10757E85942m2063r851n25l2166j6920j0135j6175m130m5739m6646k1408k3032
10745C17152r171j3353j316K0076N468J365M580p193k905j9027k668K0203K6414
10732C39625J5311j9599m7424l2753L763o683k6582j6766j7503L159K9543l372
10720B20719n1040l7761k2816L206L521j4538J952n107K2280l804O912K8055J218
10707A52797Q28j1412r095J0360M515k6705J0891K6446J6983K6532Q734j5440
10695A95434j2212p6227j04850p5957L1414J4425j5056p695K9392J9393J3788
10684A1849o170k51J5819J2332n864M433j1687j9931L314K8337Q823n867k2868
$$ plain form
10671 12269 4144 -11983 -55896 -75709 -81295 -77707 -88585 -82340 -59593 -25638 24031 67425
10659 67425 89436 100511 73285 67926 53981 51027 45025 58938 60033 57282 39451 57179 63551
10646 63551 52381 36713 13856 2062 -19821 -24847 -42391 -39918 -4470 15276 16998 -4242
10634 -4242 -31114 -56847 -66651 -70015 -19617 71515 151440 196595 184597 120359 68751 50637
10622 50637 38961 28112 28213 25083 12903 9914 2736 4164 -3055 -9192 -12182 682 19505
10609 19505 28311 40399 57736 54139 52648 53012 59081 38379 14399 -1525 -9461 -4757 -14940
10596 -14940 2833 18175 4684 13265 23810 13063 18953 5086 -12894 -11195 -8378 10163
10584 10163 -1383 -30380 -40053 -29313 -47303 -34490 13031 24287 -1709 -16841 -18896 -36202
$$ packed form
10671A2269q125j6127m3913j9813n586L588j0878O245K2747L3955M9669M3394
10659F7425K2011J1075k7226n359j3945k954o002J3913J095k751j7831J7728O372
10646F3551j1170j5668k2857j1794k1883n026j7544K473L5448J9746J722k1240
10634d242k6872k5733r804l364N0398R1132P9925M5155j1998o4238n1608j8114
10622E0637j1676j0849J01l130j2180k989p178J428p219o137k990J2864J8823
10609A9505Q806J2088J7337l597j491L64O069k0702k3980j5924p936M704j0183
10596a4940J7773J5342j3491Q581J0545j0747N890j3867j7980J699K817J8541
10584A0163j1546k8997r673J0740j7990J2813M7521J1256k5996j5132k055j7306
$$ plain form
10572 -36202 -24805 -22608 -30715 -32434 -13557 7329 33717 37296 25508 33132 15967 2834 -16729
10559 -16729 11789 39530 43580 37644 29680 42604 33976 23261 28450 31471 21545 13959 -10462
10546 -10462 -20907 -25302 -13936 -12135 18378 21208 -5529 1936 6690 10983 6327 -12024 -19766
10533 -19766 -12200 5426 9965 5269 4746 -2728 -5909 15495 20945 1772 2889 29088 18999
10520 18999 2109 -16042 -44800 -92482 -138915 -147189 -174403 -212556 -197834 -125907 -61374 18257
10508 18257 51326 71935 74848 45711 29483 15709 16453 8414 358 -8579 -16307 -16497 -7607 -11229
10494 -11229 -13354 -38335 -34601 -27008 -29228 -13036 4473 19394 28805 42392 54743 50062 17332
10481 17332 15076 30383 34966 42173 32468 15259 16707 18287 24469 23800 29124 29205 18623 5436
$$ packed form
10572c6202J1397K197q107j719J8877K0886K6388L579j1788P624j7165j3133j9563
10559a6729K8518K7741M050n936p964J2924q628j0715N189L021r926p586k4421
10546a0462j0445m395J1366J801L0513K830k6737P465M754M293m656j8351p742
10533a9766P566J7626M539m696n23p474l181K1404N450j9173J117K6199j0089
10520A8999j6890j8151k8758m7682m6433q274k7214l8153J4722P1927O4533P9631
10508A8257L3069K0609K913k9137j6228j3774P44q039q056q937p728j90Q890l622
10494a1229k125k4981L734P593k220J6192J7509J4921R411J3587J2351m681l2730
10481A7332k256J5307M583P207r705j7209J448J580O182o69N324Q1j0582j3187
$$ plain form
10467 5436 -863 3466 -8094 -23823 -24750 -8327 637 4028 6058 5547 -1647 -1246 -3225 4871 11207
10452 11207 5355 3521 9771 8366 7498 1556 -8316 -2969 -8185 -699 -3658 74 14626 19392
10438 19392 14948 -1359 10317 15219 13150 40793 52622 22432 8498 27754 31483 45929
10426 45929 53125 18286 2035 37432 53182 31435 5159 -2130 6716 13701 25275 46929
10414 46929 54969 51408 70990 104202 122247 152170 186159 207575 277096 384675 545600 805190
10402 805190 1233173 1858002 2358672 2277866 1968443 1675275 1266773 867442 561532 372042
10392 372042 273586 203040 158772 119743 94195 71614 63624 49374 29629 33397 32266 12455
10380 12455 15005 -3625 -18141 -10028 -1322 -1657 4644 3628 7494 18678 40612 49897 51143 43459
$$ packed form
10467E436o299M329j1560j5729r27J6423Q964L391K030n11p194M01j979Q096O336
10452A1207n852j834O250j405q68n942r872N347n216P486k959L732J4552M766
10438A9392m444j6307J1676M902k069K7643J1829l0190j3934J9256L729J4446
10426D5929P196l4839j6251L5397J5750k1747k6276p289Q846O985J1574K1654
10414D6929Q040l561J9582L3212J8045K9923L3989K1416O9521J07579J60925K59590
10402H05190M27983O24829N00670q0806l09423k93168m08502l99331l05910j89490
10392C72042r8456p0546m4268l9029k5548k2581p990j4250j9745L768j131j9811
10380A2455K550j8630j4516Q113Q706l35O301j016L866J1184K1934R285J246p684
$$ plain form
10366 43459 34554 -6534 -236 24390 25931 37103 45062 42850 15173 -1831 12425 42732 83560
10353 83560 95779 79175 57724 49172 37192 23698 39862 37525 8132 -5155 -20669 -36468
10341 -36468 -18718 -5174 -17681 -16257 4317 10935 -9340 -17601 -31102 -33813 -14793 21712
10329 21712 31868 22518 30151 42628 35783 7617 -6288 -13491 119 11319 284 -14881
10317 -14881 -8443 10866 29998 30028 22514 -7354 -24842 -44400 -39595 -23133 -16360 -3676 -3468
10304 -3468 -5661 4132 20266 9587 -163 -24797 -39108 -16578 -24872 -20317 6172 13463 2096
10291 2096 3743 -4742 -28011 -28126 -5349 35331 48169 22186 -1125 -8312 3457 511 -8664
10278 -8664 -3461 -13059 -1976 14252 10968 2481 14542 22496 36337 53835 75712 54436 49554
$$ packed form
10366D3459q905m1088O298K4626J541J1172P959k212k7677j7004J4256L0307M0828
10353H3560J2219j6604k1451q552j1980j3494J6164k337k9393j3287j5514j5799
10341c6468J7750J3544j2507J424K0574O618k0275q261j3501k711J9020L6505
10329B1712J0156r350P633J2477o845k8166j3905p203J3610J1200j1035j5165
10317a4881O438J9309J9132L0p514k9868j7488j9558M805J6462O773J2684K08
10304c468k193R793J6134j0679r750k4634j4311K2530q294M555K6489P291j1367
10291B096J647q485k3269j15K2777M0680J2838k5983k3311p187J1769k946r175
10278h664N203r598J1083J6228l284q487J2061P954J3841J7498K1877k1276m882
$$ plain form
10265 49554 42592 22557 26293 10943 -8981 3189 31096 30407 27894 -11662 -9513 -2923 -1575
10252 -1575 -20319 -41366 -16754 -2957 -2714 17732 22830 13951 3586 11770 25132 9750 11666
10239 11666 -3526 -5084 -24423 -53129 -34069 -18486 -29530 -29379 -14018 11707 -837 -14859
10227 -14859 -22896 -30261 -13443 -17866 -25435 -53196 -53602 -34794 -9501 -11510 -21382 -23154 -8553
10214 -8553 10878 2053 -17269 -6112 -13458 -25267 -19518 -13243 -213 4997 -5143 -12184 663
10201 663 4241 3017 14933 48007 39544 5971 -12911 -3011 4154 8500 -6207 -17175 -20650
10188 -20650 -5248 -22372 -32457 -29997 -33882 -35214 -34454 -41376 -44171 -30981 -22272 -16716 -29840
10175 -29840 -14200 -5491 -31162 -49623 -38910 -19089 8577 5553 -6926 5396 6111 9849 6919
$$ packed form
10265D9554o962k0035L736j5350j9924J2170K7907o89k513l9556K149O590J348
10252a575j8744k1047K4612J3797K43K0446N098q879j0365Q184J3362j5382J916
10239A1666j5192j558j9339k8706J9060J5583j1044J51J5361K5725j2544j4022
10227a4859q037p365J6818m423p569k7761m06J8808K5293k009r872j772J4601
10214h553J9431q825j9322J1157p346j1809N749O275J3030N210j0140p041J2847
10201F63L578j224J1916L3074q463l3573j8882R900P165M346j4707j0968l475
10188b0650J5402j7124j0085K460l885j332P60o922k795J3190Q709N556j3124
10175b9840J5640Q709k5671j8461J0713J9821K7666l024j2479J2322P15L738k930
$$ plain form
10162 6919 -5115 -9253 -4085 -20860 -18885 -3994 -8050 -21977 -45440 -33610 -7345 706 978
10149 978 -17250 -17622 -16678 -22085 -10351 1692 -5025 -6179 11377 24933 24549 27578 24413 1142
10135 1142 -2317 -2336 1185 -7556 7519 -6325 -5653 -19360 -9397 -16713 -6048 -3363 -8961 -15466
10121 -15466 -10585 -30172 -32773 -15645 -17831 -1735 15663 20219 2518 -13053 -19661 -12676 -34117
10108 -34117 -48953 -47541 -50614 -45200 -33916 -17783 -25998 -29558 -24066 -11437 -5069 -5713 -20200
10095 -20200 -17849 6227 -1014 8277 16894 -1935 -15467 -37066 -30390 -12546 -786 -3381 2810
10082 2810 25857 40685 45536 40381 15396 21056 29841 22862 27297 24798 1323 -17219 -18985
10069 -18985 -1173 14598 16597 -27571 -37446 -14307 -1202 -10928 -1436 3338 -23508 -62456 -52354
$$ packed form
10162F919j2034m138N168j6775J975J4891m056j3927k3463J1830K6265Q051K72
10149I78j8228l72R44n407J1734J2043o717j154J7556J3556l84L029l165k3271
10135A142l459j9L521q741J5075j3844O72j3707R963p316J0665K685n598o505
10121a5466M881j9587k601J7128k186J6096J7398M556j7701j5571o608O985k1441
10108c4117j4836J412l073N414J1284J6133q215l560N492J2629O368o44j4487
10095b0200K351K4076p241R291Q617j8829j3532k1599O676J7844J1760k595O191
10082B810K3047J4828M851n155k4985N660Q785o979M435k499k3475j8542j766
10069a8985J7812J5771J999m4168r875K3139J3105r726R492M774k6846l8948J0102
$$ plain form
10056 -52354 -17398 -8689 -16140 -25713 -21817 -7060 9560 -6758 -14358 -17303 -34074 -39639 -9574
10043 -9574 5278 16595 -12362 -14277 -18772 -32753 -42872 -30655 -17974 -12439 -25660 -31205 -6939
10030 -6939 23506 43442 24264 -3617 -6805 -5664 -13732 -10220 -10521 -15796 -5323 -7443 -10330 -4630
10016 -4630 -19251 -28775 -11615 -10079 -39286 -62124 -66666 -61092 -32940 -4977 6603 -7078 -16632
10003 -16632 -4952 -2339 13451 22089 28604 10606 -35937 -37068 -30223 -16012 1289 13865 7840
9990 7840 -19655 -31299 -24327 -9098 -7489 -18843 -46151 -29703 -31224 -35181 -34941 -25566 1432
9977 1432 -6884 -22645 -23543 -6565 728 2479 15996 26620 13928 -17498 -29988 -22969 -15916
9964 -15916 -3352 7342 6275 -5320 6093 -5532 -7438 13525 14089 -7562 -7618 -8626 -4267 -5520
$$ packed form
10056e2354L4956Q709p451r573L896J4757J6620j6318p600k945j6771n565L0065
10043i574J4852J1317k8957j915m495j3981j0119J2217J2681N535j3221n545K4266
10030f939L0445J9936j9178k7881l188J141q068L512l01n275J0473k120k887N700
10016d630j4621r524J7160J536k9207k2838m542N574K8152K7963J1580j3681r554
10003a6632J1680K613J5790Q638O515j7998m6543j131O845J4211J7301J2576o025
9990G840k7495j1644O972J5229J609j1354k7308J6448j521l957K40R375K6998
9977A432q316j5761q98J6978P293J751J3517J0624j2692l1426j2490P019P053
9964a5916J2564J0694j067j1595J1413j1625j906K0963N64k1651n6j008M359j253
$$ plain form
9950 -5520 -9537 219 6942 11077 19926 17876 10883 -7248 1896 19847 19661 23458 16312 -9177
9936 -9177 -10725 -7013 -13586 -23356 -14731 -33334 -37157 -29351 -21683 -26021 -14634 4057 19492 21995
9922 21995 21981 13286 2324 -12980 1316 -989 -14987 -6171 -306 -7323 -3343 -7543 -15952 -22762
9908 -22762 -36909 -35738 -27666 -32253 -25108 -30033 -62316 -46254 -7193 34774 42743 -2744 -29631
9895 -29631 -28000 -20582 -24777 -23308 -14390 5009 18337 19068 3797 -3804 2098 12667 38872 29424
9881 29424 4123 -22962 -18326 -7976 1239 3648 -11101 -18713 -5691 -15578 -35976 -16290 -5413
9868 -5413 12098 -633 -15798 -13658 9051 -11210 -27741 -14013 2887 -5508 -22283 -25988 -21193
9855 -21193 -21132 -35022 -19838 -1912 14386 10684 11967 11915 11102 8882 3570 -14057 -11843 -17067 -20855
$$ packed form
9950e520m017R756O723M135Q849k050o993j8131R144J7951j86L797p146k5489
9936i177j548L712o573r770Q625j8603l823P806P668m338J1387J8691J5435K503
9922B1995j4q695j0962j5304J4296k305j3998Q816N865p017L980m200q409o810
9908b2762j4147J171Q072m587P145m925l2283J6062L9061M1967P969m5487k6887
9895b9631J631P418m195J469Q918J9399J3328P31j5271p601N902J0569K6205r448
9881B9424k5301k7085M636J0350R215K409j4749p612J3022r887k0398J9686J0877
9868e413J7511j2731j5165K140K2709k0261j6531J3728J6900q395j6775l705M795
9855b1193O1j3890J5184J7926J6298l702J283n2q13k220n312j7627K214n224l788
$$ plain form
9840 -20855 -18106 -16065 -5892 -23045 -11195 -12721 -19667 -15775 -11381 -12924 -11933 2902 10876 1292
9826 1292 -16209 1507 15550 -4170 -25336 -29945 -23765 -9862 -13512 -17262 -21330 20268 40200
9813 40200 19844 -2802 -18357 -23188 2759 11534 -12145 -20869 -12862 -1729 5913 8682 17941
9800 17941 8747 9987 7205 -3271 -12628 -9697 14194 25447 11444 -8992 -8837 -5411 -2706 6162
9786 6162 8562 3364 -10285 -31253 -34003 -29164 -20648 -6957 -1787 -3274 -7107 -4382 -8378 -24159
9772 -24159 -52875 -56916 -36320 -40237 -70502 -56877 -29390 -11962 -1126 -10822 -29503 -43556
9760 -43556 -32532 -27998 -12244 -4460 -20295 -9616 -22069 -13753 -4421 -10112 -7192 470 -1408
9747 -1408 -18082 -10397 -9655 -8470 -7794 -1562 4206 -3222 -15369 -1774 5794 12925 19547 7641
$$ packed form
9840b0855K749K041J0173j7153J1850j526o946L892M394j543R91J4835P974r584
9826A292j7501J7716J4043j9720k1166m609O180J3903l650l750m068M1598J9932
9813D0200k0356k2646j5555m831K5947Q775k3679q724Q007J1133P642K769R259
9800A7941r194J240k782j0476r357K931K3891J1253j4003k0436J55L426K705Q868
9786F162K400n198j3649k0968k750M839Q516J3691N170j487l833K725l996j5781
9772b4159k8716m041K0596l917l0265J3625K7487J7428J0836r696j8681j4053
9760d3556J1024M534J5754P784j5835J0679j2453Q316R332n691K920P662j878
9747a408j6674P685P42J185O76O232N768p428j2147J3595P568P131O622j1906
$$ plain form
9733 7641 7010 13843 12986 23656 24687 17296 10604 -5056 -8374 -23551 -17898 -30954 -33545 -30557
9719 -30557 -28208 -20954 -27055 -24883 -5685 4263 -17657 -37288 -42232 -32008 -40164 -29872 -22717
9706 -22717 -17449 -4031 16434 21874 25130 16321 7541 6744 -1986 -27499 -3447 -5186 -27167 -48148
9692 -48148 -28775 -5937 -11316 -13031 -5047 15282 12358 15235 -4419 -974 -13437 -16716 -27929
9679 -27929 -32664 -36143 -27504 -21234 -21389 -11238 9888 15067 23843 37871 14352 -4604 -21610
9666 -21610 -34385 -43014 -28772 -19515 -16706 -15898 -9384 -20042 2253 20631 35654 28830 17312
9653 17312 30706 30896 18624 14064 44995 48921 32754 32221 21410 22100 32356 21625 7687
9640 7687 5528 3264 13584 27885 35074 28791 19045 14792 6652 11980 7248 -7915 -1369 22373
$$ packed form
9733G641o31O833q57J0670J031p391o692j5660l318j5177N653j3056k591K988
9719c0557K349P254o101K172J9198R948k1920j9631m944J0224q156J0292P155
9706b2717N268J3418K0465N440L256q809q780p97q730k5513K4052j739k1981k0981
9692d8148J9373K2838n379j715P984K0329k924K877j9654L445j2463l279j1213
9679b7929m735l479Q639O270j55J0151K1126N179Q776J4028k3519j8956j7006
9666b1610j2775q629J4242R257K809Q08O514j0658K2295J8378J5023o824j1518
9653A7312J3394J90j2272m560L0931L926j6167n33j0811O90J0256j0731j3938
9640G687k159k264J0320J4301P189o283r746m253q140N328m732j5163O546K3742
$$ plain form
9626 22373 37579 48528 40675 46786 29268 180 7758 21266 2769 -8335 -22449 -16630 -26436
9613 -26436 -13842 -5424 -13845 -9916 -909 6517 -3705 -10011 -5586 -980 14601 17927 13245 8881
9599 8881 3784 -4939 -10740 20124 35582 31877 40862 61295 50203 197 -3728 -8421 -32721
9586 -32721 -50774 -32255 -31951 -30092 -25689 -10797 3221 5045 584 5800 1710 -6504 -18601 -22304
9572 -22304 -22656 -19379 5977 5734 2564 -16985 -25637 1710 15676 9355 -294 1898 -700 -18453
9558 -18453 -30897 -29172 -6140 3664 -20615 -23744 -15556 3526 9867 19509 10324 6093 -4540
9545 -4540 -16990 -22458 -28644 -12266 4974 2347 421 8439 21851 14829 4457 6968 22310
9532 22310 52561 58955 63789 50769 39225 30934 16141 10653 -16994 -31409 -34111 -3302 37935
$$ packed form
9626B2373J5206J0949p853O111j7518k9088P578J3508j8497j1104j4114N819r806
9613b6436J2594Q418q421L929R007P426j0222o306M425M606J5581L326m682m364
9599H881n097q723n801L0864J5458l705Q985K0433j1092n0006l925m693k4300
9586c2721j8053J8519L04J859M403J4892J4018J824m461N216m090q214j2097l703
9572b2304l52L277K5356k43l170j9549q652K7347J3966o321r649K192k598j7753
9558a8453j2444J725K3032R804k4279l129Q188J9082O341R642r185m231j0633
9545d540j2450n468o186J6378J7240k627j926Q018J3412p022j0372K511J5342
9532B2310L0251O394M834j3020j1544q291j4793n488k7647j4415k702L0809M1237
$$ plain form
9519 37935 30104 23618 12629 8675 13259 12100 13684 6640 13377 18487 26583 10839 754 8581
9505 8581 -2005 -5626 -19206 -7972 10138 813 -12763 -9850 -6958 -383 -2024 -9248 -5633 -15605
9491 -15605 -15257 123 6819 -726 -4993 5834 31111 40934 40616 42502 34449 23433 9500 5879
9477 5879 11221 -213 13826 3469 7150 1857 -10463 -21550 -12041 13642 16878 28211 45089
9464 45089 39376 35940 26125 23931 26715 16336 4499 2689 29712 35088 36814 33701 35231 3461
9450 3461 12396 16307 10498 11210 6092 -3904 -18896 -19349 -15565 -13713 -635 1979 -10336 -29966
9436 -29966 -36813 -45322 -38019 -24733 -14608 -16587 -30158 -31410 -21946 -5503 5510 5541 4236 -6651
9422 -6651 -17751 -10006 11050 9120 -7690 -8407 -1119 -23679 -41810 -31077 -28130 -11322 -10017
$$ packed form
9519C7935p831o486j0989l954M584j159J584p044O737N110Q096j5744j0085P827
9505H581j0586l621j3580J1234J8110r325j3576K913K892O575j641p224L615r972
9491a5605L48J5380O696p545m267J0827K5277R823l18J886q053j1016j3933l621
9477E879N342j1434J4039j0357L681n293j2320j1087R509K5683L236J1333J6878
9464D5089n713l436r815k194K784j0379j1837j810K7023N376J726l113J530l1770
9450C461Q935L911n809P12n118r996j4992m53L784J852J3078K614j2315j9630
9436b9966o847q509P303J3286J0125j979j3571j252R464J6443J1013L1j305j0887
9422f651j1100P745K1056j930j6810p17P288k2560j8131J0733K947J6808J305
$$ plain form
9409 -10017 -6238 13618 29204 21705 -14157 -8290 5109 -6547 -32792 -27216 -18075 -22174 -22163 -18181
9395 -18181 -28423 -28663 -6790 -14764 3449 17448 -5729 3313 14006 41951 18165 -615 7931
9382 7931 -10754 -59581 -80267 -56932 -35646 -34461 -51251 -46927 -55033 -44198 -26338 -14421 -15122
9369 -15122 -8343 -2728 -13592 -14296 -1541 5036 18087 39560 30852 16760 6639 13802 10350
9356 10350 4640 8135 9950 8421 -8619 846 8611 -1198 -6809 -156 3769 9671 11074 26900
9342 26900 20436 13806 1366 -19095 -32858 -27344 12309 31517 31094 15653 26762 41058 23737
9329 23737 1223 7879 3352 2746 9933 10351 9833 -3779 -7007 4661 13975 17554 19912 25009 17577
9314 17577 12811 -3045 -16180 -8909 8070 5471 790 -3176 -959 -18198 323 14880 -4416
$$ packed form
9409a0017L779J9856J5586p499l5862N867J3399j1656k6245N576R141m099J1L982
9395a8181j0242k40K1873p974J8213J3999k3177R042J0693K7945k3786j8780Q546
9382G931j8685m8827k0686K3335K1286J185j6790M324q106J0835J7860J1917p01
9369a5122O779N615j0864p04J2755O577J3051K1473q708j4092j0121P163l452
9356A0350n710L495J815j529j7040R465P765r809n611O653L925N902J403J5826
9342B6900o464o630j2440k0461j3763N514L9653J9208m23j5441J1109J4296j7321
9329B3737k2514O656m527o06P187M18n18j3612l228J1668R314L579K358N097p432
9314A7577m766j5856j3135P271J6979k599m681l966K217j7239J8521J4557j9296
$$ plain form
9301 -4416 679 14921 10960 25294 27216 41987 35062 7114 -4118 12007 18454 9218 8918 25600
9287 25600 38276 38350 26945 33419 39420 35481 13081 99 6198 12362 -298 2979 4845 -5010
9273 -5010 4033 2393 -9661 3058 25153 35423 40086 22948 23479 26499 32891 22616 22085 32665
9259 32665 22358 18999 23115 15990 3425 26092 41984 37401 36403 50406 40127 19777 -1196
9246 -1196 9939 14851 16260 6379 26332 40610 36843 4445 6260 18887 40394 47683 50445
9233 50445 44554 61110 59080 48648 54724 39288 36210 31901 37611 32966 38720 55572 82110
9220 82110 90412 78010 76764 67576 52518 48421 56641 56916 66716 92006 80658 61016 62657 69584
9206 69584 84565 101840 115368 109408 96478 84329 101613 131851 146165 147675 158973 160039
$$ packed form
9301d416N095J4242l961J4334J922J4771o925k7948j1232J6125O447r236l00J6682
9287B5600J2676P4j1405O474O001l939k2400j2982O099O164j2660L277J866r855
9273e010R043j640j2054J2719K2095J0270M663j7138N31L020O392j0275n31J0580
9259C2665j0307l359M116p125j2565K2667J5892m583r98J4003j0279k0350k0973
9246a196J1135M912J409r881J9953J4278l767l2398J815J2627K1507P289K762
9233E0445n891J6556k030j0432O076j5436l078m309N710m645N754J6852K6538
9220H2110Q302j2402j246r188j5058m097Q220K75R800K5290j1348j9642J641O927
9206F9584J4981J7275J3528n960j2930j2149J7284L0238J4314J510J1298J066
$$ plain form
9194 160039 178950 172401 165245 188364 198215 208809 224521 251107 286873 312723 341510 381852
9182 381852 412935 451001 493913 535095 584892 647611 717673 817353 935434 1089895 1276174
9171 1276174 1479935 1728099 2053132 2445859 2965185 3702351 4797105 6507169 9351799
9162 9351799 14221798 21725361 28437794 28345007 24635349 20994616 16256001 11123682 7328904
9153 7328904 4992124 3580573 2687323 2075472 1635633 1317833 1085957 920776 807066
9144 807066 713591 622619 541778 487827 461487 425943 395645 356364 306048 265794 233181 211372
9132 211372 198191 201131 200075 181027 153371 143404 124643 105237 84147 97412 109445 89054
9120 89054 60277 65527 73892 66169 72717 90881 83725 68384 49198 41428 35648 45982 62973
$$ packed form
9194A60039J8911o549p156K3119R851J0594J5712K6586L5766K5850K8787M0342
9182C81852L1083L8066M2912M1182M9797O2719P0062R9680J18081J54461J86279
9171A276174K03761K48164L25033L92727N19326P37166J094754J710064K844630
9162I351799M869999P503563O712433r2787l709658l640733m738615n132319l794778
9153G328904k336780j411551q93250o11851m39839l17800k31876j65181j13710
9144H07066r3475r0972q0841n3951k6340l5544l0298l9281n0316m0254l2613k1809
9132B11372j3181K940j056j9048k7656r967j8761j9406k1090J3265J2033k0391
9120H9054k8777N250Q365p723O548J8164p156j5341j9186p770n780J0334J6991
$$ plain form
9107 62973 60234 44776 38969 58226 62135 42141 34501 21223 -1080 16413 29411 26532 48001
9094 48001 64464 50481 28112 18535 35968 28648 10051 19858 21426 3228 10033 7611 6221
9081 6221 23690 41044 25252 17306 22887 31055 32043 14517 17571 10766 -787 10006 48837
9068 48837 45123 33525 10825 3554 25840 26047 12207 17537 35341 33273 15219 -8391 -17338
9055 -17338 4067 34563 39342 42671 29206 8686 14491 18468 19078 19902 28306 23013 22550 13513
9041 13513 1532 1225 2143 3240 16445 18226 859 -16356 -21033 -16846 -19557 -27945 -24476 -810
9027 -810 268 -15588 -31518 -38780 -15574 9884 25452 14648 10541 13881 19558 15148 -3078
9014 -3078 -13777 -19743 -15140 -9423 -22472 -17541 -24238 -22454 -32757 -41294 -45591 -10537 -1972 2688
$$ packed form
9107F2973k739j5458n807J9257L909j9994p640j3278k2303J7493J2998k879K1469
9094D8001J6463j3983k2369r577J7433p320j8597R807J568j8198O805k422j390
9081F221J7469J7354j5792p946N581Q168R88j7526L054o805j1553J0793L8831
9068D8837l714j1598k2700p271K2286K07j3840N330J7804k068j8054k3610q947
9055a7338K1405L0496M779L329j3465k0520N805L977O10Q24Q404n293m63r037
9041A3513j1981l07R18J097J3205J781j7367j7215m677M187k711q388L469K3666
9027h10J078j5856j5930p262K3206K5458J5568j0804m107L340N677m410j8226
9014c078j0699n966M603N717j3049M931o697J784j0303q537m297L5054Q565M660
$$ plain form
9000 2688 8749 -2291 1721 7033 -4874 -16842 1497 10651 7975 319 -7772 -22521 -8575
8987 -8575 -9720 -24587 -25485 -14737 -3680 -8452 -22329 -19019 -7575 -10469 -17972 -9977 730 5306
8973 5306 8301 -6057 -30936 -48900 -25549 -34952 -38476 -21548 3233 17959 19241 -8626 -22849
8960 -22849 -19707 -1437 8175 16059 19242 14790 -9525 1876 6381 20143 35423 4923 21391
8947 21391 27059 8333 -4523 -7320 -15162 -35768 -31974 -23324 -27810 -23427 -24559 -23748 -17387 -12614
8933 -12614 1895 -10102 -36649 -36128 -10753 1250 22562 37041 30407 17911 16159 4217 -17229
8920 -17229 -16758 -13526 -29291 -23285 2687 3172 -7869 -21517 -28377 -24102 -14029 -12244 -4201 16844
8906 16844 34146 22334 8019 -13326 -15743 -15747 -9000 -13104 -7567 -10343 -19583 -12858 -9730 -10217 -9394
$$ packed form
9000B688O061j1040M012N312j1907j1968J8339R154k676p656q091j4749J3946
8987h575j145j4867q98J0748J1057m772j3877L310J1444k894p503P995J0707M576
8973E306K995j4358k4879j7964K3351r403l524J6928K4781J4726J282k7867j4223
8960b2849L142J8270R612P884L183m452k4315J1401M505J3762J5280l0500J6468
8947B1391N668j8726j2856k797p842k0606L794Q650m486M383j132Q11O361M773
8933a2614J4509j1997k6547N21K5375J2003K1312J4479o634j2496j752j1942k1446
8920a7229M71L232j5765O006K5972M85j1041j3648o860M275J0073J785Q043K1045
8906A6844J7302j1812j4315k1345k417mO747m104N537k776r240O725L128m87Q23
$$ plain form
8891 -9394 18541 31161 24448 11058 17064 24504 32700 42981 11330 -976 -4467 -10367 -22239
8878 -22239 -36917 -55809 -42203 -65361 -86318 -68225 -46180 -15404 -3374 -24549 -33457 -29189
8866 -29189 -9346 -3103 -3168 -108 -16591 -32024 -32389 -21605 -15259 -16628 -7344 -11043 -16857 -16317 -20432
8851 -20432 5780 34187 26511 4968 -6306 5792 27588 12392 -3221 -18325 -23890 -26531
8839 -26531 -31165 -19666 -12857 -11134 -3026 -8230 -23250 -21007 -17619 -14047 -17538 -27906 -8022 -8193
8825 -8193 7905 10943 -2184 -33353 -23850 -24145 -3023 27775 14108 -7912 1448 11758 -13562
8812 -13562 1497 20708 25703 19580 -12825 7015 18417 -14850 -33573 -9735 13298 22383
8800 22383 -2698 -26492 -30792 -17302 3545 -13857 -15761 8285 21317 8692 11739 7959 -2856
$$ packed form
8891i394K7935J2620o713j3390O006P440Q196J0281l1651j2306l491n900j1872
8878b2239j4678j8892J3606k3158k0957J8093K2045L0776J2030k1175q908M268
8866b9189J9843O243o5L060j6483j5433l65J0784O346j369R284l699n814N40m115
8851b0432K6212K8407p676k1543j1274J2098K1796j5196j5613j5104n565k641
8839b6531m634J1499O809J723Q108n204j5020K243L388L572l491j0368J9884j71
8825h193J6098L038j3127l1169R503k95K1122L0798j3667k2020R360J0310k5320
8812a3562J5059J9211M995o123l2405J9840J1402l3267j8723K3838K3033R085
8800B2383k5081k3794m300J3490K0847j7402j904K4046J3032j2625L047l780j0815
$$ plain form
8787 -2856 -3446 -4043 -15322 -21727 -19200 -10723 -3306 -27472 -17993 6942 13058 16876 11511 35423
8773 35423 54010 39847 25831 12395 5409 -16724 -19635 -22138 -1535 25176 25300 17279 17175
8760 17175 -3966 -31394 -36579 -29180 -14508 -2782 -2419 9034 589 -6427 39 -6129 -10570 -2093
8746 -2093 -4598 -17009 -17525 -22063 -19508 -5766 -4702 4678 22383 23505 16491 -1031 -4494 271
8732 271 -15741 -36052 -24606 5496 18244 -918 -3771 -8706 -8077 2058 -3689 -30034 -11192
8719 -11192 12588 19608 31466 18132 -11423 -25765 -8087 -14362 -19560 4943 11434 10944 3067
8706 3067 1650 11130 3758 -1898 -489 21346 22409 16341 10554 -10176 -20882 -10138 18490 22888
8692 22888 5463 14769 19539 13020 13726 6075 -15478 26713 44093 19071 10858 1802 3517 4996
$$ packed form
8787b856n90n97j1279o405K527Q477P417k4166R479K4935O116L818n365K3912
8773C5423J8587j4163j4016j3436o986k2133k911k503K0603K6711J24q021j04
8760A7175k1141k7428n185P399J4672J1726L63J1453q445p016O466o168m441Q477
8746b093k505j2411n16m538K555J3742J064R380J7705J122p014j7522l463M765
8732B71j6012k0311J1446L0102J2748j9162k853m935O29J0135n747k6345J8842
8719a1192K3780P020J1858j3334k9555j4342J7678o275n198K4503O491m90p877
8706C067j417R480p372n656J409K1835J063o068n787k0730j0706J0744K8628M398
8692B2888j7425R306M770o519P06p651k1553M2191J7380k5022q213r056J715J479
$$ plain form
8678 4996 -4405 -3342 -11235 -22196 -22738 -15563 -15695 10325 8895 3269 5730 -23891 -9676 13562
8664 13562 15683 6665 4917 -3528 -10980 11242 3987 -13923 -7232 -4374 4531 2075 12179 26576
8650 26576 54070 50662 35041 16804 9785 12576 -872 -11665 -3489 -8971 -15728 -23394 -26371
8637 -26371 -21360 -13025 19443 26629 17525 9816 2952 11537 16542 16929 5421 22575 35276 22571
8623 22571 -3244 -8007 6554 -20045 -31727 -27286 4660 38059 51213 63686 39193 17112
8611 17112 24615 28290 23273 37156 46723 45009 50464 65374 75885 85824 85065 69776 58611 44724
8597 44724 37077 47484 53041 60946 45064 66893 79545 97386 96046 79839 70310 71980 73362
8584 73362 66955 65582 76085 75790 71818 72996 73498 83719 77356 63708 44527 47877 49622 49918
$$ packed form
8678D996r401J063p893j0961n42P175j32K6020j430n626K461k9621J4215K3238
8664A3562K121r018j748q445p452K2222p255j7910O691K858Q905k456J0104J4397
8650B6576K7494l408j5621j8237p019K791j3448j0793Q176n482o757p666k977
8637b6371N011Q335L2468P186r104p709o864Q585N005L87j1508J7154J2701j2705
8623B2571k5815m763J4561k6599j1682M441L1946L3399J3154J2473k4493k2081
8611A7112P503L675n017J3883R567j714N455J4910J0511R939p59j5289j1165j3887
8597D4724p647J0407N557P905j5882K1829J2652J7841j340j6207r529J670J382
8584G3362o407j373J0503k95l972J178N02J0221o363j3648j9181L350J745K96
$$ plain form
8570 49918 62869 57475 32604 23358 31949 5937 -5813 -7391 12314 35209 29737 11846 7472
8557 7472 10475 20042 31183 33387 27398 26297 28117 40497 70174 70802 40655 19524 30005 32195
8543 32195 19433 14393 -3150 2801 2883 1062 -5685 23432 35015 29090 26306 34177 44329 26315
8529 26315 1754 -13497 -26074 -23691 -25913 -17879 -14901 -10422 -15922 -15486 -22746 -28745 -19470 -24794
8515 -24794 -13826 -24495 -27953 -15450 -1643 -10285 -17587 -13630 -8013 -16076 -9699 12096 20415
8502 20415 14007 9361 -9636 3029 7199 -11200 -4421 14593 21318 11573 8181 25704 7357
8489 7357 -6788 11543 19398 18763 3862 19978 27511 14095 12405 17616 -2729 5622 2359 541
8475 541 -5811 -40605 -25023 3746 9286 6410 7230 -3295 -7917 7498 6581 411 -10934 -25611
$$ packed form
8570D9918J2951n394k4871r246Q591k6012j1750j578J9705K2895n472j7891m374
8557G472L003R567J1141K204n989j101J820J2380K9677O28l0147k1131J0481K190
8543C2195j2762n040j7543N951Q2j821o747K9117J1583n925k784P871J0152j8014
8529B6315k4561j5251j2577K383k222Q034K978M479n500M36p260n999R275n324
8515b4794J0968j0669l458J2503J3807q642p302L957N617q063O377K1795Q319
8502B0415o408m646j8997J2665M170j8399O779J9014O725r745l392J7523j8347
8489G357j4145J8331P855o35j4901J6116P533j3416j690N211k0345Q351l263j818
8475E41o352l4794J5582K8769N540k876Q20j0525m622J5415r17o170j1345j4677
$$ plain form
8461 -25611 -15875 4272 2020 -12605 -25508 -24984 -17089 -11681 -29644 -32881 -6753 26516 4428
8448 4428 -1958 -573 -5329 -1684 18360 8346 119 18776 21656 14194 52 9289 23483 32771
8434 32771 35622 24934 -3376 -24693 -44624 -65752 -37436 -27496 -20647 -28428 -40364 -28804 -13932
8421 -13932 -20068 -17401 -6189 13812 15490 11261 -3675 -880 -4073 -16039 -14659 -9306 -1486 7436
8407 7436 -2915 -1912 3504 4092 -9463 -13414 4067 -2215 -13336 6110 15597 41240 42098 26877
8393 26877 14852 -3474 -4340 -7435 -4595 -18340 -43070 -46546 -37864 -42911 -25588 -7253 -5372
8380 -5372 -30124 -48192 -54543 -24218 4714 15953 8954 -5731 3901 2941 7067 37429 34091
8367 34091 -1518 -27267 -4418 17600 17257 25558 21230 21071 12436 -11196 -1691 -7322 -46946 -70506
$$ packed form
8461b5611R736K0147k252j4625j2903N24P895N408j7963l237K6128L3269k2088
8448D428o386J385m756L645K0044j0014q227J8657K880p462j4142R237J4194R288
8434C2771K851j0688k8310k1317j9931k1128K8316R940O849p781j1936J1560J4872
8421a3932o136K667J1212K0001J678m229j4936K795l193j1966J380N353P820Q922
8407G436j0351J003N416N88j3555l951J7481o282j1121J9446R487K5643Q58j5221
8393B6877j2025j8326q66l095K840j3745k4730l476Q682n047J7323J8335J881
8380e372k4752j8068o351L0325K8932J1239o999j4685R632r60M126L0362l338
8367C4091l5609k5749K2849K2018l43Q301m328j59q635k3632R505n631l9624k3560
$$ plain form
8353 -70506 -50198 -9617 20602 13123 3263 18650 8466 -1344 878 12521 -928 -20322 -11799
8340 -11799 -6099 -18959 -14607 -22029 -33863 -16149 -6462 5655 25967 29906 19061 -2794 -20783
8327 -20783 -13829 2937 10980 22121 28549 -1957 -4922 -2626 -9393 2054 -17148 -9346 -3268
8314 -3268 -13613 -21337 -22506 -17422 -19369 -33751 -18564 -614 -24119 -10087 14296 14941 -1573
8301 -1573 -2211 -6212 -28606 -35025 -18470 13204 6533 -9934 -8281 6287 4653 4360 21235 27846
8287 27846 25447 10531 21034 45440 51321 30706 -758 -19245 -11894 -9776 -12391 -11089 -4998
8274 -4998 -19806 -42192 -34411 -13830 -2880 -14370 5283 18249 6914 34795 44624 51838 59342
8261 59342 27796 3814 2435 9902 31221 31664 7124 3989 22699 56768 76168 54082 32732
$$ packed form
8353g0506K0308M0581L0219p479r860J5387j0184r810K222J1643j3449j9394Q523
8340a1799N700j2860M352p422j1834J7714R687J2117K0312L939j0845k1855j7989
8327b0783O954J6766Q043J1141O428l0506k965K296o767J1447j9202P802O078
8314c268j0345p724j169N084j947j4382J5187J7950k3505J4032K4383O45j6514
8301a573o38m001k2394o419J6555L1674o671j6467J653J4568j634k93J6875O611
8287B7846k399j4916J0503K4406N881k0615l1464j8487P351K118k615J302O091
8274d998j4808k2386P781K0581J0950j1490J9653J2966j1335K7881R829P214P504
8261E9342l1546k3982j379P467K1319M43k4540l135J8710L4069J9400k2086k1350
$$ plain form
8248 32732 15939 20576 41461 33213 19304 6803 17082 31291 31628 19918 18747 27306 22170
8235 22170 20972 11953 24428 38826 45952 56135 72585 48499 55120 47495 45516 57626 50626
8222 50626 64345 86350 87814 106752 121685 126810 111233 105693 107425 108197 109531 95354 57814
8209 57814 47855 50893 48453 45055 28749 11022 -18855 -25888 -32820 -19902 -14569 1907 23420
8196 23420 15040 15340 22115 48955 34845 35511 58176 63904 54139 60474 105272 114929 103418 79544
8182 79544 74267 70949 63194 62669 44176 43501 47206 65408 69574 55251 34396 37928 35851 16378
8168 16378 2611 12726 19038 22411 11961 7560 2093 -849 13738 24816 33195 30521 49742
8155 49742 33663 -3604 -5096 28153 56285 52641 39546 35783 31231 38766 30205 -3706 7363
$$ packed form
8248C2732j6793M637K0885q248j3909j2501J0279J4209L37j1710j171Q559n136
8235B2170j198r019J2475J4398P126J0183J6450k4086O621p625j979J2110p000
8222E0626J3719K2005J464J8938J4933N125j5577n540J732P72J334j4177l7540
8209E7814r959L038k440l398j6306j7727k9877p033o932J2918N333J6476K1513
8196B3420q380L00O775K6840j4110O66K2665N728r765O335M4798R657j1511k3874
8182G9544n277l318p755n25j8493o75L705J8202M166j4323k0855L532k077j9473
8168A6378j3767J0115O312L373j0450m401n467k942J4587J1078Q379k674J9221
8155D9742j6079l7267j492L3249K8132l644j3095l763m552P535q561l3911J1069
$$ plain form
8142 7363 22535 36909 34843 34751 29322 12470 -1611 8299 7264 2204 14697 20381 9381 12100
8128 12100 -2781 -7075 18797 41335 38822 13252 -10365 -2075 403 5537 4553 -560 4008 5107
8114 5107 11659 4762 2630 3068 5073 10326 23085 19226 24245 1267 3989 16388 16614 5551
8100 5551 1925 -4873 -4286 15197 14318 -4749 22571 50355 32657 20666 23573 29793 20177 29017
8086 29017 4829 1223 86 2028 -16514 -35343 -30415 -15368 -8793 -5291 -24933 -41249 -30482
8073 -30482 -24673 -4556 -400 6867 3535 3963 1771 -17032 -12406 -845 -12384 -24060 -34303
8060 -34303 -36125 -41227 -23303 -27774 -22698 -21192 -14350 -5172 -892 3811 -13395 -23892 -8689 12807
8046 12807 14085 5192 6201 20099 17094 13971 16531 -7429 -46594 -32686 -20590 -23854 -24591 -7900
$$ packed form
8142G363J5172J4374k066r2n429j6852j4081R910j035n060J2493N684j1000K719
8128A2100j4881m294K5872K2538k513k5570k3617Q290K478N134r84n113M568J099
8114E107O552o897k132M38K005N253J2759l859N019k2978K722J2399K26j1063
8100E551l626o798N87J9483q79j9067K7320K7784j7698j1991K907O220r616Q840
8086B9017k4188l606j137J942j8542j8829M928J5047O575L502j9642j6316J0767
8073c0482N809K0117M156P267l332M28k192j8803M626J1561j1539j1676j0243
8060c4303j822n102J7924m471N076J506O842R178M280M703j7206j0497J5203K1496
8046A2807J278q893J009J3898l005l123K560k3960l9165J3908J2096l264p37J6691
$$ plain form
8032 -7900 13205 21586 2284 1085 -574 -3323 -11291 -28974 -32992 -15346 -4772 -12977 -15142 -10576
8018 -10576 4117 16049 10119 9900 15018 7709 -4424 1862 23291 19369 16732 -5168 -5176 -6467
8004 -6467 -920 -1217 -6767 -4261 -878 7994 -3441 -11988 -16184 -4162 8080 2671 20372 10370
7990 10370 23470 44113 50209 45321 34870 23262 17475 15223 18780 12232 -14637 -34924 -17228
7977 -17228 737 15486 24999 7873 16496 775 -4321 7047 12457 35448 42182 36502 19246
7964 19246 10931 3139 21512 21264 24372 17296 11290 9945 -8715 -4147 6157 33913 45576 27695
7950 27695 3214 -7133 -16433 -12553 -4293 115 -5980 -10030 1372 17838 24658 30992 30222 15174
7936 15174 29410 21160 -933 2063 2366 -11797 -13033 5805 1921 -32392 -19443 -5552 612
$$ packed form
8032g900K1105Q381j9302j199j659k749p968j7683m018J7646J0574q205k165M566
8018a0576J4693J1932n930k19N118p309j2133O286K1429l922k637k1900qj291
8004f467N547k97n550K506L383Q872j1435q547m196J2022J2242n409J7701j0002
7990A0370J3100K0643O096m888j0451j1608n787k252L557o548k6869k0287J7696
7977a7228J7965J4749R513j7126Q623j5721n096J1368N410K2991O734n680j7256
7964A9246q315p792J8373k48L108p076o006j345j8660M568J0304K7756J1663j7881
7950B7695k4481j0347r300L880Q260M408o095m050J1402J6466O820O334p70j5048
7936A5174J4236q250k2093K996L03j4163j236J8838l884l4313J2949J3891O164
$$ plain form
7923 612 11459 9781 1935 11689 18164 9015 295 19009 10264 3534 19877 27716 19612 6408
7909 6408 -14844 -6788 -8300 -21265 -510 9785 46957 51993 30738 16309 1418 -824 -3676
7896 -3676 -13588 -16903 -26765 -34709 -18430 -17706 -10417 -6897 -1778 -3510 6439 6754 -21306 -28708 -11224
7881 -11224 13359 17958 17647 8275 24510 27207 27885 39436 61946 58225 32215 13120 24870
7868 24870 -796 -11767 12461 943 -7149 -16989 -10872 -5363 -4699 -3986 4437 11522 5940 16461
7854 16461 21029 13270 1150 -1894 3887 7681 24706 26647 17883 12095 -6057 -8799 -405 12370
7840 12370 -2963 -12944 -17545 -10267 -17874 -20055 -26166 -16773 -10903 -19367 -39533 -31018 -690 5415
7826 5415 -18689 -20850 -10970 -10139 6866 10439 -4802 9358 22744 -2673 -23222 -9151 9851
$$ packed form
7923F12J0847j678p846R754O475r149q720J8714q745o730J6343P839q104j3204
7909F408k1252Q056j512j2965K0755J0295L7172N036k1255j4429j4891k242k852
7896c676r912l315r862p944J6279P24P289L520N119j732R949L15k8060p402J7484
7881a1224K4583M599l11r372J6235K697O78J1551K2510l721k6010j9095J1750
7868B4870k5666j0971K4228j1518q092r840O117N509O64P13Q423P085n582J0521
7854A6461M568p759j2120l044N781L794J7025J941q764n788j8152k742Q394J2775
7840A2370j5333r981m601P278p607k181o111R393N870q464k0166Q515L0328O105
7826E415k4104k161R880Q31J7005L573j5241J4160J3386k5417k0549J4071J9002
$$ plain form
7813 9851 -7870 5330 23247 33366 27516 11993 -33425 -49080 -48240 -52923 -56132 -43619 -45404
7800 -45404 -33265 -19434 -16621 -7535 -11877 -18391 -15818 -30630 -42263 -43341 -49045 -50557 -41297 -36484
7786 -36484 -29573 -48208 -47427 -32890 -31371 -14915 -11722 -4163 -16348 -7867 14576 33671 24079
7773 24079 -12029 -11947 -29037 -46634 -54181 -29686 -19479 -3637 -15170 -15508 -1973 524 4088
7760 4088 -10759 -12273 -17896 -29738 -11791 -15462 -31021 -19653 -23205 -18944 360 19039 18854
7747 18854 14092 35564 46058 36285 17135 1638 2905 12330 15224 -5063 -8534 5982 23744
7734 23744 32813 41981 35871 34083 34845 18139 -2661 -4170 4717 5346 26233 34955 21730 -28
7720 -28 15855 -199 -11864 -3482 -9722 -8818 -11304 3192 4082 25916 21087 15253 11713 20797 11004
$$ packed form
7813I851j7721J3200J7917J0119n850j5523m5418j5655Q40m683l209J2513j785
7800d5404J2139J3831K813R086m342o514K573j4812j1633j078n704j512R260M813
7786c6484O911j8635P81J4537J519J6456L193P559j2185Q481K2443J9095r592
7773B4079l6108Q2j7090j7597p547K4495J0207J5842j1533l38J3535K497L564
7760D088j4847j514n623j1842J7947l671j5559J1368l552M261J9304J8679j85
7747A8854m762K1472J0494r773j9150j5497J267R425K894k0287l471J4516J7762
7734B3744R069R168o110j788P62j6706k0800j509Q887O29K0887Q722j3225k1758
7720b8J5883j6054j1665Q382o240R04k486J4496Q90K1834m829n834l540R084r793
$$ plain form
7705 11004 -8357 -6589 -2022 508 1445 -5384 -16084 -27603 -8314 6741 7538 1829 -24569 -19474
7691 -19474 -9707 -9218 -6271 846 1805 2286 2993 -16023 -36477 -24714 -12472 -29364 -35433 -19151
7677 -19151 3559 9904 6983 15053 6161 4662 10647 -29452 -39578 -8830 -3640 4541 24778
7664 24778 36315 27703 6986 -13671 -15742 4309 12199 12265 2630 -8740 -26867 -9794 -3447
7651 -3447 -1814 -23726 -37330 -29539 -24962 -24475 -21524 -14719 -28164 -18935 6911 14917 8049 -7717
7637 -7717 6840 -15601 -12690 1342 1842 6576 14831 6876 -5738 -4 3796 -9979 -9533 9500
7623 9500 -129 -6368 5801 4361 20467 31816 29572 30481 27188 39185 30884 12843 9612 14321
7609 14321 17132 -2811 -9932 7830 -88 7763 22115 30476 25360 35218 14457 12512 4551 -12898
$$ packed form
7705A1004j9361J768M567K530R37o829j0700j1519J9289J5055P97n709k6398N095
7691a9474R767M89K947P117R59M81P07j9016k0454J1763J2242j6892o069J6282
7677a9151K2710O345k921Q070q892j499N985m0099j0126L0748N190Q181K0237
7664B4778J1537q612k0717k0657k071K0051P890O6r635j1370j8127J7073O347
7651c447J633k1912j3604P791M577M87K951O805j3445R229K5846Q006o868j5766
7637g717J4557k2441K911J4032N00M734Q255p955j2614N734L800j3775M46J9033
7623I500r629o239J2169j440J6106J1349k244R09l293J1997q301j8041l231M709
7609A4321K811j9943p121J7762p918P851J4352Q361n116R858k0761j945p961j7449
$$ plain form
7595 -12898 -6759 6903 13674 11017 17612 23763 26372 13358 -3284 -4489 7511 4779 56 1936
7581 1936 22058 13152 8330 14824 35311 19611 -5421 -13515 -11823 -21027 -9368 292 -9789
7568 -9789 -8299 -14905 -14588 1681 12401 -1209 -1245 -17511 -39336 -25924 -16421 -23912 -25721 -14388
7554 -14388 7607 26283 25636 35506 18532 -13023 -15690 -6202 2954 15917 14161 26052 30978
7541 30978 29131 9117 -18789 -10029 8693 258 -15531 -13837 -17988 -30342 -27752 -21770 -11498
7528 -11498 13332 22399 19243 18238 14928 17479 15142 9305 8698 -7538 -13245 -28219 -18616 -7537
7514 -7537 -7535 -32111 -40168 -21453 -5244 -11208 -1130 19424 13664 12315 -10101 -26082 -24697 -15807
7500 -15807 -12954 -4927 5689 -6253 -8811 2409 -6152 -1759 -13075 -27450 -7768 -27881 -34435
$$ packed form
7595a2898O139J3662O771k657O595O151K609j3014j6642j205J2000k732m723J880
7581A936K0122q906m822O494K0487j5700k5032q094J692r204J1659R660j0081
7568i789J490o606L17J6269J0720j3610l6j6266k1825J3412R503p491j809J1333
7554a4388K1995J8676o47R870j6974l1555k667R488R156J2963j756J1891M926
7541C0978j847k0014k7906Q760J8722q435j5789J694m151j2354K590N982J0272
7528a1498K4830R067l156j005l310K551k337n837o07j6236n707j4974R603J1079
7514g537Kk4576q057J8715J6209n964J0078K0554n760j349k2416j5981J385Q890
7500a5807K853Q027J0616j1942k558J1220q561M393j1316j4375J9682k0113o554
$$ plain form
7487 -34435 -20100 -11318 -21628 -43830 -41313 -13971 6577 30642 27996 5792 -5243 6845
7475 6845 -196 -32484 -40262 -29841 -22627 -26000 -2738 -8389 -16482 -18968 -24895 -19829 -20752 -23227
7461 -23227 -7953 26638 40211 20777 11042 24376 12240 3700 3291 28944 27805 14396 -10174
7448 -10174 -2811 -16159 -27745 -34697 -30003 -26625 -32368 -28124 -25419 -33493 -46273 -40138 -26259 -10188
7434 -10188 12081 25850 16999 19766 20655 17424 8859 13039 -2450 437 2885 6455 10297 34485
7420 34485 25587 14021 22079 721 -27804 -33852 -30179 -15225 -31747 -36347 -51443 -63508 -69635
7407 -69635 -38865 -22192 -16608 -20867 -30232 -26989 -7404 -4817 -13687 -11078 -6550 14513 21317 9495
7393 9495 -16546 14612 14116 96 2280 -856 -21858 -17004 -15636 2660 6398 -11460 4400
$$ packed form
7487c4435J4335Q782j0310k2202K517K7342K0548K4065k646k2204j1035J2088
7475F845p041l2288p778J0421P214l373K3262n651q093k486n927N066r23k475
7461b3227J5274L4591J3573j9434r735J3334j2136q540m09K5653j139j3409k4570
7448a0174P363j3348j1586o952M694L378n743M244K705q074j2780O135J3879J6071
7434a0188K2269J3769q851K767Q89l231q565M180j5489K887K448L570L842K4188
7420C4485q898j1566Q058k1358k8525o048L673J4954j6522m600j5096j2065o127
7407f9635L0770J6673N584m259r365L243J9585K587q870K609M528K1063O804j1822
7393I495k6041L1158m96j4020K184l136k1002M854J368J8296L738j7858J5860
$$ plain form
7380 4400 21315 19324 18452 17480 4536 1916 -11504 -47845 -32555 -25043 -21408 -14971 -13909 2795
7366 2795 11464 1373 16633 14793 8105 6634 -15401 -21173 -23672 -27485 -29145 -13611 850 9261
7352 9261 -3430 -20963 -9197 -20889 -34886 -26638 -4558 9054 -1069 2220 -1691 -1357 -175
7339 -175 -5820 -6647 742 9747 4180 -15869 -4100 11745 3524 4652 -10478 -47321 -31526 -17637
7325 -17637 -35587 -35710 -25806 -23693 -23943 -10021 3358 -3133 -2212 5297 -8373 -15790 -17144 -17719 -24147
7310 -24147 -48619 -50132 -34172 -6128 30906 43855 18350 3294 7236 -23348 -28901 -19120 -26235
7297 -26235 -33530 -37707 -42038 -41992 -31032 -29992 924 12203 18935 2854 5994 3356 18042 22169
7283 22169 -7655 -38191 -7628 -4521 -15557 -12179 -23163 -25083 -13688 -1640 399 -11599 -11465
$$ packed form
7380D400J6915j991q72r72j2944k620j3420l6341J5290P512L635O437J062J6704
7366B795Q669j0091J5260j840o688j471k2035n772k499l813j660J5534J4461Q411
7352I261j2691j7533J1766j1692j3997Q248K2080J3612j0123L289l911L34J182
7339a75n645q27P389R005n567k0049J1769J5845q221J128j5130l6843J5795J3889
7325a7637j7950j23R904K113k50J3922J3379o491R21P509j3670p417j354n75o428
7310b4147k4472j513J5960K8044L7034J2949k5505j5056L942l0584n553R781p115
7297b6235p295m177m331M6J0960J040L0916J1279O732j6081L140k638J4686M127
7283B2169k9824l0536L0563L107j1036L378j0984j920J1395J2048K039j1998J34
$$ plain form
7270 -11465 -37017 -32987 -22602 -8665 -16429 -25795 -17625 -5263 1569 19123 17257 21090 36461
7257 36461 37233 7910 4955 14365 6843 -20028 -18354 -2539 4094 34858 18137 14338 10564 21512
7243 21512 9806 -5751 -2202 5218 -11351 9753 13752 13110 -10937 -30078 -29063 -10440 4635
7230 4635 -14670 -6270 11200 9328 17431 9158 -4485 2355 12071 18702 -4143 -13635 -16002 -14189
7216 -14189 -5375 -9316 -2471 -2431 11215 2737 -6152 -10464 -13803 -908 -16620 -22110 -11656 13315
7202 13315 11372 -239 -8522 -11334 -4269 -2135 -26228 -28493 -34514 -47968 -52805 -34755 -5235
7189 -5235 23658 25462 27255 17330 3389 15426 20086 11554 14097 -9247 -22490 -3536 7281
7176 7281 13779 20575 24245 25319 13390 685 -4305 -10040 -79 22834 22083 23916 12861 -17666
$$ packed form
7270a1465k5552M030J0385J3937p764r366Q170J2362O832J7554j866L833J5371
7257C6461P72k9323k955R410p522k6871J674J5815O633L0764j6721l799l774J0948
7243B1512j1706j5557L549P420j6569K1104L999o42k4047j9141J015J8623J5075
7230D635j9305Q400J7470j872Q103q273j3643O840R716O631k2845r492k367J813
7216a4189Q814l941O845M0J3646q478q889m312l339J2895j5712n490J0454K4971
7202A3315j943j1611q283k812P065K134k4093k265o021j3454m837J8050K9520
7189e235K8893J804J793r925j3941J2037M660q532K543k3344j3243J8954J0817
7176G281O498O796L670J074j1929j2705m990n735R961K2913p51J833j1055l0527
$$ plain form
7162 -17666 -36913 -23509 -12800 -8243 -4442 11594 3267 -9123 -6111 664 5926 -10363 -19014
7149 -19014 -14520 -6679 -10136 -5219 12901 18349 18521 27389 37607 32891 12052 3902 15292 24639
7135 24639 23895 5046 -14312 -17791 -7780 -22719 -15923 6377 6851 12560 28827 13145 4181
7122 4181 12336 -1637 5578 8152 4752 10581 30182 41215 48698 30937 21276 21366 14325 11175
7108 11175 34139 30722 7930 -10198 -25937 -26945 -14836 -399 -6723 14983 32970 18340
7096 18340 22751 33938 32954 17689 13999 -6552 -8476 746 -9039 -16718 -4404 -137 16403 8623
7082 8623 14389 1442 27062 23852 26886 17953 -2707 -26870 -47052 -48812 -65875 -36616 -11218
7069 -11218 -1604 11261 7577 735 10318 2610 -21812 -12312 -10593 -8951 -9948 -6936 -5662 -15470
$$ packed form
7162a7666j9247J3404J0709M557L801J6036q327j2390L012O775N262j6289q651
7149a9014M494P841l457M917J8120N448J72Q868J0218m716k0839q150J1390R347
7135B4639p44j8849j9358l479J0011j4939O796K2300M74N709J6267j5682q964
7122D181Q155j3973P215K574l400N829J9601J1033P483j7761r661R0p041l150
7108A1175K2964l417k2792j8128j5739j008J2109J4437o324K1706J7987j4630
7096A8340M411J1187r84j5265l690k0551j924R222r785p679J2314M267J6540p780
7082H623N766j2947K5620l210L034q933k0660k4163k0182j760j7063K9259K5398
7069a1218R614J2865l684o842R583p708k4422R500J719J642r97L012J274r808
$$ plain form
7055 -15470 -11395 -4480 -4167 3815 12508 21236 25401 22326 14207 11302 7568 10817 7714 -8219 -14867
7040 -14867 2846 1065 -5617 20615 10820 627 14088 23217 36673 33265 15493 -3361 -13859
7027 -13859 -1498 21670 18716 31961 19228 22825 9105 20556 15836 -7560 -40211 -47369 -34899
7014 -34899 -12361 23279 9049 -19280 -35120 -43224 -24960 -15263 6912 11546 -13091 -10021 -256
7001 -256 -7456 -7796 -25541 -38520 -45022 -29427 -5155 493 -5251 4839 18983 10051 -16214 632
6987 632 6359 10816 -4271 4708 22840 174 -5792 1584 -4102 -7207 8514 38089 41594 -4574
6973 -4574 -29487 -31735 -28557 -9771 -13264 -13225 10005 34651 23616 7916 -6974 -5732 5007
6960 5007 -394 -10074 -26079 -23176 -30986 -28280 -20725 220 12239 1250 -1290 -4364 -4016 -9380
$$ packed form
7055a5470M075O915L13P982Q693Q728M165l075q119k905l734L249l103j5933o648
7040a4867J7713j781o682K6232r795j0193J3461R129J3456l408j7772j8854j0498
7027a3859J2361K3168k954J3245j2733L597j3720J1451m720k3396l2651p158J2470
7014c4899K2538L5640j4230k8329j5840q104J8264R697K2175M634k4637L070R765
7001b56p200l40j7745j2979o502J5595K4272N648n744J0090J4144q932k6265J6846
6987F32N727M457j5087Q979J8132k2666n966P376n686l105J5721K9575L505m6168
6973d574k4913k248L178J8786l493L9K3230K4646j1035j5700j4890J242J0739
6960E007n401r680j6005K903p810K706P555K0945J2019j0989k540l074L48n364
$$ plain form
6946 -9380 -18657 -33704 -15916 18704 8180 248 -1720 501 -15155 -20463 -26365 -35832 -27511 -17969
6932 -17969 -29331 -36501 -27439 -18569 -9265 4260 2227 -8178 988 31165 28470 11828 -3214
6919 -3214 -7037 -13691 -4281 -4665 -7004 -13593 -38371 -35028 -42747 -51314 -56460 -33994 -23584 -10763
6905 -10763 -4165 -8314 -29487 -27986 -5131 3352 -10978 -21215 -11070 -9296 -17705 -25093 -2724
6892 -2724 3959 15819 27264 29397 19827 4709 1859 10831 20926 -2287 -25650 -23702 -16964
6879 -16964 -28613 -31487 -13061 7446 8580 -5712 -11501 -10815 -2380 -12948 -21109 -27880 -41437
6866 -41437 -36195 -31135 -23385 -15881 -10126 -2892 6243 2263 -6164 -17039 -25957 -24235 -16634 -28448
6852 -28448 -45910 -49279 -45099 -35421 -12794 -10410 -3041 -9805 -11346 -9568 -14352 560 13039 -1549
$$ packed form
6946i380r277j5047J7788L4620j0524p932j968K221j5656n308n902r467Q321R542
6932a7969j1362p170R062Q870R304J3525k033j0405R166L0177k695j6642j5042
6919c214l823o654R410l84k339o589k4778L343p719q567n146K2466J0410J2821
6905a0763O598m149k1173J501K2855Q483j4330j0237J0145J774q409p388K2369
6892b724O683J1860J1445K133r570j5118k850Q972J0095k3213k3363J948O738
6879a6964j1649k874J8426K0507J134j4292n789O86Q435j0568q161o771j3557
6866d1437N242N060P750P504N755P234R135l980q427j0875q918J722P601j1814
6852b8448j7462l369M180R678K2627K384P369o764j541J778m784J4912J2479j4588
$$ plain form
6838 -1549 4173 8948 11043 10627 -2503 -4648 -12037 -20416 -21414 -49724 -56977 -45008 -29874 -25770
6824 -25770 335 -10414 1059 9486 15081 37456 23384 13066 4734 -17039 -8324 11364 20751
6811 20751 -7412 -25167 -31150 763 13053 -6848 -14304 -32967 -28621 -21984 -15921 -9845 -5273
6798 -5273 17252 18832 9675 14395 15477 21326 15537 7710 5664 10868 10962 -13992 -18010 -12405 -1093
6783 -1093 20470 15209 19388 39643 29684 3111 -5764 -9776 -9180 -5091 -10317 -16032 -10106 -12287
6769 -12287 -14006 -1746 16699 9787 8425 16724 2761 -5926 -7447 9436 19745 7737 73
6756 73 45 4641 -11839 -18907 -12072 -11226 -36007 -24609 10687 -2098 -15219 -21085 -19464 -25661 -36518
6741 -36518 -47043 -22875 -5273 -2172 1994 4684 22098 40932 23181 19907 12240 1991 20615
$$ packed form
6838a549N722M775K095m16j3130k145p389q379r98k8310p253J1969J5134M104
6824b5770K6105j0749J1473Q427N595K2375j4072j0318q332k1773Q715J9688R387
6811B0751k8163j7755n983L1913J2290j9901p456j8663M346O637O063O076M572
6798e273K2525J580r157M720J082N849n789p827k046N204R4k4954m018N605J1312
6783a093K1563n261M179K0255r959k6573q875m012N96M089n226n715N926k181
6769a2287j719J2260J8445o912j362Q299j3963q687j521J6883J0309j2008p664
6756G3k8M596j6480p068O835Q46k4781J1398L5296j2785j3121n866J621o197j0857
6741c6518j0525K4168J7602L101M166K690J7414J8834j7751l274p667j0249J8624
$$ plain form
6728 20615 39426 24761 4190 -4666 -10879 1917 -5629 -15898 -25434 -14833 -985 765 -5482
6715 -5482 -11638 -9402 27 9277 -108 -454 -12045 -10394 8339 6750 5053 1715 21180 2568
6701 2568 -6288 -8506 -2516 5068 -667 -6997 -9932 -10080 11755 18754 27861 26869 16525 3132 7380
6686 7380 18645 12170 5010 -4040 -6065 -2980 8366 -5178 -34069 -45504 -35423 -30850 -32255
6673 -32255 -28222 -36193 -39286 -15040 148 -5827 4361 7096 16489 21740 3337 2324 -11270
6660 -11270 -16804 -20311 -27805 -22880 2036 12030 1724 -1196 -23456 -14696 -2064 5293 9081 248
6646 248 -7804 7731 18212 10880 -17447 -18656 -40436 -51484 -53501 -65454 -59417 -37837 -32434
6633 -32434 -38784 -3763 12289 23338 29644 31582 34766 21671 2780 -15000 -3693 -2285 2267
$$ packed form
6728B0615J8811j4665k0571q856o213J2796p546j0269r536J0601J3848J750o247
6715e482o156K236R429R250r385l46j1591J651J8733j589j697l338J9465j8612
6701B568q856k218N990P584n735o330k935j48K1835O999R107r92j0344j3393M248
6686G380J1265o475p160r050k025L085J1346j3544k8891j1435J0081M573j405
6673c2255M033p971l093K4246J5188n975J0188K735R393N251j8403j013j3594
6660a1270n534l507p494M925K4916R994j0306k920k2260Q760J2632P357L788q833
6646B48q052J5535J0481p332k8327j209k1780j1048k017j1953O037K1580N403
6633c2434o350L5021J6052J1049O306J938L184j3095j8891j7780J1307J408M552
$$ plain form
6620 2267 -2683 9033 537 3142 17128 29089 20805 1644 14543 40839 48101 46892 15969
6607 15969 -16207 -23936 -11393 -5074 6285 17770 2771 -2833 2052 4963 18777 21042 13798
6594 13798 210 -12951 -4672 3008 6680 -13630 -8034 -6626 -7786 -22824 -5745 9374 20489
6581 20489 37143 49683 39531 20578 16129 -11946 -28292 -17013 -17273 -25324 -24828 -15829 4592
6568 4592 -2340 -2543 -11994 -1210 21554 -1426 -14182 -4677 -4715 -18582 -34235 -16412 -2407 -17951
6554 -17951 -19940 -17171 -19033 -14236 3337 -23303 -25389 -12717 -21197 -18881 -7124 899 5357 12489
6540 12489 12059 8017 8476 10790 9723 -11364 -11192 8155 1487 -11253 18207 26037 19514 22996
6526 22996 22861 2031 -6645 -13054 -22929 -1901 6367 15229 28689 51891 58736 49458 23621 8402
$$ packed form
6620B267m950J1716q496K605J3986J1961q284j9161J2899K6296P262j209l0923
6607A5969l2176p729J2543O319J1359J1485j4999n604M885K911J3814K265p244
6594A3798j3588j3161Q279P680L672k0310N596J408j160j5038J7079J5119J1115
6581B0489J6654J2540j0152j8953m449k8075j6346J1279k60q051M96Q999K0421
6568D592o932k03r451J0784K2764k2980j2756R505l8j3867j5653J7823J4005j5544
6554a7951j989K769j862M797J7573k6640k086J2672q480K316J1757Q023M458P132
6540A2489m30m042M59K314j067k1087J72J9347o668j2740K9460P830o523L482
6526B2996j35k0830q676o409r875K1028Q268Q862J3460K3202O845r278k5837j5219
$$ plain form
6512 8402 2946 2080 7978 -3404 10093 16093 12508 4209 -14774 -12530 -3859 -4460 3971 -21516
6498 -21516 -27067 -25245 -29594 -24582 -32378 -20582 -4677 -28065 -25334 4184 15540 13296 24827
6485 24827 10578 13272 21138 17020 466 -16292 -20420 -17687 -17486 -19979 -949 2605 2461 12144
6471 12144 8702 17536 36935 22930 17488 10484 893 19678 24735 18930 6742 -7221 -11201
6458 -11201 -1281 -1515 6672 35952 30990 15638 -1969 -16336 -10572 -3693 787 6639 10740 -3774
6444 -3774 -26346 -21191 -13827 447 9568 -3919 -3501 -1311 15036 12292 8400 -6659 -18351 -11319
6430 -11319 -19598 -26683 -33357 -31792 -27439 -26727 -28708 -17909 985 3682 9494 17057 34606 40717
6416 40717 24015 26196 24647 18514 25330 11806 16724 12589 2237 20072 -2454 -23940 -18971
$$ packed form
6512H402n456q66N898j1382J3497O000l585q299j8983K244Q671o01Q431k5487
6498b1516n551J822m349N012p796J1796J5905k3388K731K9518J1356k244J1531
6485B4827j4249K694P866m118j6554j6758m128K733K01k493J9030L554j44R683
6471A2144l442Q834J9399j4005n442p004r591J8785N057n805j2188j3963l980
6458a1201R920k34Q187K9280m962j5352j7607j4367N764O879M480N852M101j4514
6444c774k2572N155P364J4274R121j3487M18K190J6347k744l892j5059j1692P032
6430a1319q279p085o674J565M353P12j981J0799J8894K697N812P563J7549O111
6416D0717j6702K181j549o133O816j3524M918m135j0352J7835k2526k1486M969
$$ plain form
6403 -18971 -7236 -14729 -18468 -15796 -23644 -27403 -16856 -7423 -6697 -43693 -54474 -30885 -16505
6390 -16505 -12630 -8633 -11347 3984 13526 -251 18479 21329 14944 9389 18011 6950 9678 -4717
6376 -4717 -6609 -1483 6863 -9056 -22237 3150 7840 -20963 -38788 -41623 -34534 -16448 -28212
6363 -28212 -27965 337 -3687 -17708 -19742 -5323 5502 -12914 3802 7500 6252 15149 -1132
6350 -1132 -611 10199 8716 6858 -6404 -23517 -66 11826 154 835 12636 5986 1090 -13226
6336 -13226 -19561 -17286 -13048 -10313 -13103 -20737 -6788 14390 15072 -4882 -8697 920 -9706 -3033
6322 -3033 -12720 -14275 -5142 2805 -13498 -17283 -21124 2503 7983 15702 2817 -4410 -6283 -8314
6308 -8314 21330 27609 22321 21205 3544 1125 5913 -6944 -23537 -22677 -18610 -17620 -19819 -27499
$$ packed form
6403a8971J1735p493l739K672p848l759J0547R433P26l6996j0781K3589J4380
6390a6505L875L997k714J5331R542j3777J8730K850o385n555Q622j1061K728j4395
6376d717j892N126Q346j5919j3181K5387M690k8803j7825k835P089J8086j1764
6363b8212K47K8302m024j4021k034J4419J0825j8416J6716L698j248Q897j6281
6350a132N21J0810j483j858j3262j7113K3451J1892j1672O81J1801o650m896j4316
6336a3226o335K275M238K735k790p634J3949K1178O82j9954l815R617j0626O673
6322c033r687j555R133P947j6303l785l841K3627N480P719j2885p227j873k031
6308h314K9644O279n288j116j7661k419M788j2857j6593Q60M067R90k199p680
$$ plain form
6294 -27499 -41424 -34337 -27147 -26746 -19596 -22587 -11508 -505 5701 12022 22054 29949 30823 29782
6280 29782 23877 466 -13879 -12133 -12804 -18129 -16664 -13713 -4129 623 10638 28579 29377 26085
6266 26085 10088 4262 1096 4452 14170 6957 7860 -13794 -26453 -7444 -10649 -23330 -8104
6253 -8104 2895 2202 1810 12225 27549 35733 5007 -27873 -27258 -29087 -44296 -25834 -22894 -19494
6239 -19494 -19108 -13628 3690 -3887 -25538 -28864 -42167 -53041 -35089 -40403 -35182 -24344 -31406
6226 -31406 615 14128 6111 -15774 -9703 3582 -18986 -29337 -29408 -13411 -8118 2220 -1224
6213 -1224 13490 12291 -4844 5331 16008 1370 3652 12023 2809 -14513 -12516 -12579 -25819 -7761
6199 -7761 -1705 -3802 -7431 7353 6379 -11770 -41782 -49388 -51731 -43439 -19721 -17481 -20159 -18956
$$ packed form
6294b7499j3925P087P190M01P150k991J1079J1003O206O321J0032P895Q74j041
6280B9782n905k3411j4345J746o71n325J465K951R584M752J0015J7941P98l292
6266B6085j5997n826l166L356R718p213R03k1654j2659J9009l205j2681J5226
6253h104J0999o93l92J0415J5324Q184l0726l2880O15j829j5209J8462K940L400
6239a9494L86N480J7318p577k1651l326j3303j0874J7952n314N221J0838p062
6226c1406L2021J3513q017k1885O071J3285k2568j0351p1J5997N293J0338l444
6213a224J4714j199j7135J0175J0677j4638K282Q371r214j7322J997o3j3240J8058
6199g761O056k097l629J4784r74j8149l0012p606k343Q292K3718K240k678J203
$$ plain form
6185 -18956 -14024 -15874 13191 19909 2241 -14120 -30103 -20336 -5113 12170 23584 13741 -13612
6172 -13612 -1799 3825 16833 30875 36454 33369 44778 37968 3958 -8142 -8266 -7884 6606
6159 6606 2206 6297 7741 -9575 -24292 -14383 2686 13835 4748 21935 21506 -3276 -14117
6146 -14117 -11172 2802 21805 25359 22936 14738 415 -16582 6791 11326 5687 -462 -11947
6133 -11947 -26328 -14919 -9046 -10859 208 3775 8543 3668 19802 31881 12935 8899 31313
6120 31313 23439 -1602 -13334 -25597 -64316 -66252 -44436 -19072 -25044 -17877 -1654 -10922 -7838
6107 -7838 -12185 -24910 -8980 -25956 -15456 12367 28027 30841 18407 12561 -1333 900 2870
6094 2870 6794 8704 -17551 -4000 18440 1246 -7780 2952 11053 2883 5199 3167 -685 -5728
$$ packed form
6185a8956M932j850K9065O718j7668j6361j5983R767J5223J7283J1414r843k7353
6172a3612J1813N624J3008J4042N579l085J1409o810l4010j2100j24L82J4490
6159F606m400M091J444j7316j4717R909J7069J1149r087J7187m29k4782j0841
6146a4117K945J3974J9003L554k423q198j4323j6997K3373M535n639o149j1485
6133a1947j4381J1409N873j813J1067L567M768m875J6134J2079j8946m036K2414
6120C1313p874k5041j1732j2263l8719j936K1816K5364n972P167J6223r268L084
6107g838m347j2725J5930j6976J0500K7823J5660K814j2434n846j3894K233J970
6094B870L924J910k6255J3551K2440j7194r026J0732Q101q170K316k032l852n043
$$ plain form
6080 -5728 3293 11561 -6607 5672 17640 16632 14007 19743 19376 5944 -21363 -29513 -16160 1066
6066 1066 369 18538 10550 13805 4942 -90 -6338 -20628 -1505 19815 24037 -4431 -17457 -20862
6052 -20862 -7356 -19504 -31712 -36050 -33566 -25588 -11245 6234 -326 -13186 -18483 -14207 -19103
6039 -19103 -21283 -37813 -15150 -4170 -20923 -37180 -32652 -46786 -32663 -14224 -7657 12378
6027 12378 8091 -25835 -37816 -21083 -10860 -10623 -9734 4251 18571 16211 -6731 -14545 4274
6014 4274 -2730 -2930 11612 -29901 -34166 -25246 -14674 15118 24578 41548 52209 29080 1614
6001 1614 8158 -1157 10470 -9587 -20876 -4228 6517 -13864 -14771 -44853 -62089 -59191 -50730
5988 -50730 -45136 -21185 13859 36740 31049 2818 6368 15999 27191 30125 36407 22427 26252
$$ packed form
6080e728R021Q268j8168J2279J1968j008k625N736l67j3432k7307q150J3353J7226
6066A066o97J8169p988L255q863n032o248j4290J9123K1320M222k8468j3026l405
6052b0862J3506j2148j2208m338K484P978J4343J7479o560j2860n297M276m896
6039a9103k180j6530K2663J0980j6753j6257M528j4134J4123J8439O567K0035
6027A2378m287l3926j1981J6733J0223K37Q89J3985J4320k360k2942p814J8819
6014D274p004k00J4542m1513m265Q920J0572K9792R460J6970J0661k3129k7466
6001A614O544r315J1627k0057j1289J6648J0745k0381r07l0082j7236K898Q461
5988e0730N594K3951L5044K2881n691k8231L550R631J1192K934O282j3980L825
$$ plain form
5975 26252 13413 2548 -12566 -29164 -23482 4383 14003 13706 23911 20109 16392 14775 34094
5962 34094 32572 14047 30658 19038 28739 42913 26442 13376 10499 6062 -23141 -23333 -906
5949 -906 11349 26528 21343 41233 49683 22646 2238 2891 562 1395 3933 14057 1233 -8655
5935 -8655 12467 8980 -1346 -7999 -14289 -20673 -8073 -10376 -21425 -17587 -3595 -881 -7179 -2343
5921 -2343 -10791 -1931 528 -3534 -5207 -21710 -43334 -37286 -21922 -13879 1456 11176 6704 2917
5907 2917 -12013 -24004 -8216 -15550 -21908 -20594 -24732 -26872 -14098 8857 10845 1083 -3327 -7581
5893 -7581 -12588 -18764 -11422 -32884 -47779 -54371 -48741 -19070 -808 5512 24333 16143 16199 8497
5879 8497 11187 30069 15317 2844 -6149 -22777 -22054 -17173 -20401 -2707 -3584 4740 4996 -3583
$$ packed form
5975B6252j2839j0865j5114j6598N682K7865R620k97J0205l802l717j617J9319
5962C4094j522j8525J6611j1620R701J4174j6471j3066k877m437k9203j92K2427
5949i06J2255J5179n185J9890Q450k7037k0408O53k329Q33K538J0124j2824r888
5935h655K1122l487j0326o653o290o384J2600k303j1049L838J3992K714o298M836
5921b343q448Q860K459m062j673j6503k1624O048J5364Q043J5335R720m472l787
5907B917j4930j1991J5788p334o358J314m138k140J2774K2955J988r762m410m254
5893g581n007o176P342k1462j4895o592N630K9671J8262O320J8821q190N6p702
5879H497K690J8882j4752j2473q993j6628P23M881l228J7694q77Q324K56q579
$$ plain form
5865 -3583 -41385 -32078 20337 27063 19061 -9052 -14736 -9699 10394 31394 45393 16817 3141
5852 3141 -6980 -20613 -11020 -3032 -41570 -39389 -11093 182 -22044 -27914 -12618 25 5051
5839 5051 -20732 -38240 -48174 -44013 -41279 -33037 -41140 -22954 9015 27582 25764 10275 -437
5826 -437 -16341 -23464 7334 12168 10871 -3382 -13435 -22235 -32208 -29520 -28445 -35360 -48450 -53037
5812 -53037 -40969 -27455 -33680 -37183 -60685 -56426 -31288 -9783 -3796 -5726 3527 -17507 -17909
5799 -17909 -12593 7433 33022 41925 24046 5193 2881 6777 17727 24800 14151 -3258 -14517
5786 -14517 -14650 -18985 -25398 -20004 -22592 2918 22266 -4246 -42773 -52571 -49517 -35665 -28282 -44626
5772 -44626 -40285 -49200 -29548 -32114 -28205 -21755 -8078 1531 -6110 1033 -1046 -27539 -35455 -12620
$$ packed form
5865c583l7802R307N2415O726q002k8113n684N037K0093K1000J3999k8576j3676
5852C141j0121j3633R593P988l8538K181K8296J1275k2226n870J5296J2643N026
5839E051k5783j7508r934M161K734Q242q103J8186L1969J8567j818j5489j0712
5826d37j5904p123L0798M834j297j4253j0053q800r973K688J075o915j3090m587
5812e3037J2068J3514o225l503k3502M259K5138K1505N987j930R253k1034m02
5799a7909N316K0026K5589Q903j7879j8853k312L896J0950P073j0649j7409j1259
5786a4517j33m335o413N394k588K5510J9348k6512l8527r798L054J3852P383j6344
5772d4626M341q915J9652k566L909O450J3677R609p641P143k079k6493p916K2835
$$ plain form
5758 -12620 -9277 1844 3409 10824 -8346 -18335 -28153 -34128 -26719 -20183 -7940 20008 22995 34270
5744 34270 31628 25572 19981 9311 -4379 -3395 7755 -3718 -9523 -7281 12329 35618 29040
5731 29040 21314 10714 -13181 -12508 6728 19816 13028 25876 19975 20424 20411 25823 16831 4122
5717 4122 16404 19734 -4475 -18312 -25507 -45662 -22098 -9669 -1600 3745 5152 -3555 -3059 -19863
5703 -19863 -21490 -15048 -7251 3635 -19277 -28077 -19266 -19673 -7237 7808 19821 19697 24419 20108
5689 20108 18670 14693 2649 5091 15617 -3034 -19194 -14085 17644 20906 25587 9310 21435
5676 21435 18252 10255 22335 33304 5989 -18900 -7295 14605 15851 1649 -19521 -50685
5664 -50685 -58624 -40959 -24756 -26517 -14561 -4201 -26380 -20429 5094 -6707 -19432 -28273 -52723
$$ packed form
5758a2620L343J1121J565P415j9170r989r818n975P409O536J2243K7948K987J1275
5744C4270k642o056n591j0670j3690R84J1150j1473n805K242J9610K3289o578
5731B9040p726j0600k3895O73J9236J3088o788J2848n901M49j3N412q992j2709
5717D122J2282L330k4209j3837p195k0155K3564J2429Q069N345J407q707M96j6804
5703a9863j627O442P797J0886k2912q800Q811m07J2436J5045J2013j24M722m311
5689B0108j438l977j2044K442J0526j8651j6160N109L1729L262M681j6277J2125
5676B1435l183p997J2080J0969k7315k4889J1605K1900J246j4202k1170l1164
5664e0685p939J7665J6203j761J1956J0360k2179N951K5523j1801j2725q841k4450
$$ plain form
5651 -52723 -37316 -25120 -9988 2503 -5857 -30407 -33155 -15730 -3866 -11302 -39065 -44947 -27129
5638 -27129 -25901 -11594 -4789 -10606 -7323 -2443 -370 13299 23976 29121 6465 -7427 -23420
5625 -23420 -7993 -12276 -5012 14104 21412 23242 39120 39588 33333 29059 44945 46445 24164 9408
5611 9408 7807 8861 15405 16953 -6270 -7904 -9335 -5424 -10200 -24076 -23183 -27627 -20697 -19081 -4826
5596 -4826 -4887 -22074 1053 24053 47285 58252 34686 17918 7594 4208 -314 -6408 -3670
5583 -3670 -10516 8122 3134 -6470 -24213 -23201 -35301 -18127 -16614 -15108 -16610 -8389 -9597 -23351
5569 -23351 -31278 -24071 3006 11876 5566 -1943 12970 17671 10696 -5621 -436 3156 7647 -4395
5555 -4395 -1688 15232 20711 -9861 -7844 5039 2057 -17562 -23501 -9352 2868 12374 19517
$$ packed form
5651e2723J5407J2196J5132J2491q360k4550k748J7425J1864p436k7763n882J7818
5638b7129J228J4307O805n817L283M880K073J3669J0677N145k2656j3892j5993
5625b3420J5427m283P264J9116P308J830J5878M68o255m274J5886J500k2281j4756
5611I408j601J054O544J548k3223j634j431L911m776j3876Q93m444O930J616J4255
5596d826o1j7187K3127K3000K3232J0967k3566j6768j0324l386m522o094K738
5583c670o846J8638m988r604j7743J012j2100J7174J513J506j502Q221j208j3754
5569b3351p927P207K7077Q870o310p509J4913M701o975j6317N185L592M491j2042
5555d395K707J6920N479l0572K017J2883k982j9619n939J4149J2220R506P143
$$ plain form
5542 19517 30385 21685 17662 34186 48322 52526 58754 34150 -1088 -22363 -20120 11527 23842
5529 23842 2715 -5463 9227 21908 3680 11040 5569 -3935 14357 26154 13933 12477 10109
5516 10109 2672 1808 -10241 -14951 793 14201 19845 15995 24077 26266 13873 8223 6442 840
5502 840 7484 4686 8626 28292 19023 2018 25886 46894 43644 27314 12000 2104 3825 -5314
5488 -5314 -9069 -6466 -10598 -11055 2446 16006 20989 20781 22008 24624 17158 427 -1985 16916
5474 16916 -5898 -4878 -8802 -3759 -4875 -7582 -5951 -13266 -17338 -4366 5534 11291 12757 30865
5460 30865 43692 23991 1205 -22427 -11306 -10694 -21877 -36462 -58445 -49686 -37973 -30896 -30798
5447 -30798 -22154 -14626 2603 2776 4794 11810 -12750 -15228 -531 -6268 -439 18895 11352 -7660
$$ packed form
5542A9517J0868q700m023J6524J4136M204O228k4604l5238k1275K243L1647J2315
5529B3842k1127q178J4690J2681j8228P360n471r504J8292J1797j2221j456k368
5516A0109p437q64j2049m710J5744J3408N644l850Q082K189j2393n650j781n602
5502H40O644k798L940J9666r269j7005K3868K1008l250j6330j5314r896J721r139
5488e314l755K603m132m57J3501J3560M983k08J227K616p466j6731k412J8901
5474A6916k2814J020l924N043j116k707J631p315m072J2972R900N757J466J8108
5460C0865J2827j9701k2786k3632J1121O12j1183j4585k1983Q759J1713P077R8
5447c0798Q644P528J7229J73K018P016k4560k478J4697n737N829J9334p543j9012
$$ plain form
5433 -7660 -1514 20661 28938 9541 -8949 -15587 1428 17282 6037 6340 1490 12946 17154
5420 17154 8609 3128 -5549 -8149 -560 -16 -6929 13341 34325 30944 15992 -11193 -18995 -18418
5406 -18418 -7867 -7193 -3386 2109 -2394 -2193 4581 -813 -9881 6873 26389 36393 22590 5385
5392 5385 4400 4078 5056 21217 20907 -1311 1669 5649 -38645 -20753 -14173 -15743 -7835 -2693 5434
5377 5434 6883 -2350 -22297 -21612 -6969 -23909 -24996 -38605 -34803 -42900 -27999 -6595 12377
5364 12377 19650 3811 -11503 -332 5863 276 -2138 7337 16381 8249 3802 38964 58655
5351 58655 37232 29558 22160 7880 9488 10417 -4513 -21466 -14056 -12790 4095 -9756 -18064
5338 -18064 -7249 -17268 -2810 5555 -3341 -8862 -31189 -26008 -12587 -11537 6177 -2832 -3708
$$ packed form
5433g660O146K2175Q277j9397j8490o638J7015J5854j1245L03m850J1456M208
5420A7154q545n481q677k600P589N44o913K0270K0984l381j4952k7185p802N77
5406a8418J0551O74L807N495m503K01O774n394r068J6754J9516J0004j3803j7205
5392E385r85l22R78J6161l10k2218K980L980m4294J7892O580j570P908N142Q127
5377E434J449r233j9947O85J4643j6940j087j3609L802q097J4901K1404J8972
5364A2377P273j5839j5314J1171O195n587k414R475R044q132m447L5162J9691
5351E8655k1423p674p398j4280J608R29j4930j6953P410J266J6885j3851q308
5338a8064J0815j0019J4458Q365q896n521k2327N181J3421J050J7714r009q76
$$ plain form
5325 -3708 -3780 6616 9148 5406 11879 10779 4154 -11093 -11188 -17896 -17217 -14155 -1525 -8660 -26967
5310 -26967 -12851 -2420 -4735 -1823 938 -607 6029 7478 -17335 -6466 -225 -3101 12561
5297 12561 19919 -365 -9310 -2975 -66 5761 1280 16809 7915 6432 2784 -2532 -16024 -18340
5283 -18340 -39500 -16821 8628 7850 785 -8726 -21296 -16494 -3993 9602 23723 11857 -9047
5270 -9047 -9645 7421 41310 31936 27765 26593 35516 31874 30568 29664 9980 2667 9512 4373 9671
5255 9671 5758 6010 17960 9711 -5436 -9546 -24398 -630 11398 2414 2797 -4481 -7330 4661
5241 4661 3395 20557 26533 963 1759 22290 35096 12137 -3106 -3940 -7202 8578 22588
5228 22588 17256 6935 11540 15374 -297 -9928 -3415 -15284 -34943 -11442 1867 5514 7990
$$ packed form
5325c708p2J0396K532l742O473j100o625j5247r5o708O79L062J2630p135j8307
5310b6967J4116J0431k315K912K761j545O636J449k4813J0869O241k876J5662
5297A2561P358k0284q945O335K909N827m481J5529q894j483l648n316j3492k316
5283a8340k1160K2679K5449p78p065r511j2570M802J2501J3595J4121j1866k0904
5270i047n98J7066L3889r374m171j172Q923l642j306r04j9684p313O845n139N298
5255I671l913K52J1950q249j5147m110j4852K3768J2028q984L83p278k849J1991
5241D661j266J7162N976k5570P96K0531J2806k2959j5243q34l262J5780J4010
5228B2588n332j0321M605L834j5671r631O513j1869j9659K3501J3309L647K476
$$ plain form
5215 7990 11584 15078 -3069 -23878 -23281 -16807 7940 12273 18511 27258 30641 37683 34088 13406
5201 13406 1387 -14831 -41601 -47473 -36806 -12573 -3213 -6064 -23678 -18734 -21068 -22478 -5969
5188 -5969 -4072 2423 -6198 -23692 -40518 -45796 -48969 -2469 4255 -10965 -15040 27399 44034
5175 44034 45951 31424 21254 8909 17310 5280 -8672 -30622 -24700 2765 12342 17838 7257
5162 7257 7536 7346 17728 18012 25390 1854 -22805 -28928 -27422 -18219 -17966 -21430 -14084 -1331 11525
5147 11525 22489 25964 24515 -182 -6356 -4 13652 12031 144 -8203 -20125 -7502 6641
5134 6641 10853 3755 -14047 -20131 -12630 -12406 -14886 4278 12681 13064 22189 26625 6388 -10935
5120 -10935 -30358 -27455 -13861 -537 -7085 -7100 -1223 -1449 -9502 -10531 -4023 3908 -5982 9918
$$ packed form
5215G990L594L494j8147k0809N97O474K4747M333O238Q747L383P042l595k0682
5201A3406j2019j6218k6770n872J0667K4233R360k851j7614M944k334j410J6509
5188e969J897O495q621j7494j6826n278l173M6500O724j5220m075M2439J6635
5175D4034J917j4527j0170j2345Q401j2030j3952k1950N922K7465R577N496j0581
5162G257K79j90J0382K84P378k3536k4659o123J506R203K53l464P346J2753J2856
5147A1525J0964L475j449k4697o174O352J3656j621j1887q347j1922J2623J4143
5134F641M212p098j7802o084P501K24k480J9164Q403L83R125M436k0237j7323
5120a0935j9423K903J3594J3324o548j5N877k26q053j029O508P931r890J5900
$$ plain form
5106 9918 25804 5599 3621 -1162 -2030 6552 -8504 -19657 7670 18781 14460 -7057 -21272
5093 -21272 -10654 -17380 -14804 -24341 -35527 -16314 -11531 -30688 -22293 -8867 -2608 -1832 -20904
5080 -20904 -22868 -18618 -19185 -24679 -33209 -24030 -25684 -33996 -36342 -29772 -20454 4770 35820 47373
5066 47373 32856 36731 20920 -1401 12809 14888 5832 11414 596 -5824 -839 15227 31447
5053 31447 31213 8072 8237 10508 5976 10907 7580 2230 -8408 -5890 -9858 -19440 -32389 -13896
5039 -13896 -19234 -23089 -40789 -30266 -29392 -39146 -32868 -4188 5212 1213 3706 15344 36531 32013
5025 32013 894 -9893 8867 -3238 -890 97 12777 11885 -13037 -902 7230 8111 13809 9233
5011 9233 5393 19947 10252 -24460 -37086 -19953 -18454 -15029 -33624 -43638 -17338 26068 30529
$$ packed form
5106I918J5886k0205j978m783q68Q582j5056j1153K7327J1111m321k1517j4215
5093b1272J0618o726K576r537j1186J9213M783j9157Q395J3426O259P76j9072
5080b0904j964M250n67n494q530R179j654q312k346O570R318K5224L1050J1553
5066D7373j4517L875j5811k2321J4210K079r056N582j0818o420M985J6066J6220
5053C1447k34k3141J65K271m532M931l327n350j0638K518l968r582j2949J8493
5039a3896n338l855j7700J0523Q74r754O278K8680R400l999K493J1638K1187m518
5025C2013l1119j0787J8760j2105K348R87J2680q92k4922J2135Q132Q81N698m576
5011I233l840J4554r695l4712j2626J7133J499L425j8595j0014K6300M3406M461
$$ plain form
4998 30529 17100 265 4783 12295 -382 -16402 -781 -3887 -1868 -25531 -29818 -11420 -18709
4985 -18709 -34992 -42698 -44288 -36027 -18823 7767 2942 3130 9572 -10456 -15828 864 4095 5957
4971 5957 13503 12077 209 -12042 -7377 -6617 -13581 -14602 -21644 -20075 2459 11803 -1737 -30600
4957 -30600 -25314 9587 30508 21060 21698 40190 46313 39203 18078 19442 15693 18304 14784 17724
4943 17724 6466 -5169 -13514 2292 -7431 1926 16230 12447 4027 -6026 -4415 -6504 -10948
4930 -10948 -18244 -21987 -14552 -5787 1022 10667 5250 3620 2268 942 -15780 -30210 -15603 8559
4916 8559 -17011 -38450 -32514 -18523 -7460 -979 -3510 -9033 -12235 -17272 -21067 -34878 -23746
4903 -23746 -19045 -25260 -37583 -58288 -56335 -73327 -67340 -53795 -69212 -70309 -63206 -27267 -7865
$$ packed form
4998C0529j3429j6835M518P512j2677j6020J5621l106K019k3663m287J8398p289
4985a8709j6283p706j590Q261J7204K6590m825J88O442k0028n372J6692L231J862
4971E957P546j426j1868j2251M665P60o964j021p042J569K2534R344j3540k8863
4957c0600N286L4901K0921r448O38J8492O123p110k1125J364l749K611l520K940
4943A7724j1258j1635q345J5806r723R357J4304l783q420j0053J611k089m444
4930a0948p296l743P435Q765O809R645n417j630j352j326j6722j4430J4607K4162
4916H559k5570k1439N936J3991J1063O481k531n523l202n037l795j3811J1132
4903b3746M701o215j2323k0705J953j6992N987J3545j5417j097P103L5939J9402
$$ plain form
4890 -7865 -24335 -41337 -20839 17462 26991 14973 -6104 -22686 -25195 -17814 -6467 -14711 -33726
4877 -33726 -13000 5760 -10632 -828 -6313 -5193 -591 -1155 -15596 -42406 -34607 -30768 -46908
4864 -46908 -41087 -35681 -16848 -4011 -5000 -9680 -9976 -6959 -4754 4758 20326 31734 32256 19984
4850 19984 17868 7154 -5998 -9490 -8706 5723 -409 -16938 -23404 -32781 -38147 -49638 -32702
4837 -32702 -11920 -28505 -26962 -35924 -28620 -22624 -37843 -25093 -8987 3126 -12766 -8583 3375
4824 3375 4441 20408 2015 -7440 13142 16176 21765 22561 27291 28939 32143 20207 3879 6462
4810 6462 19705 23775 25439 22037 11723 8928 15999 35707 14151 5992 -8590 25145 37236
4797 37236 44425 25992 7853 13280 16546 24773 21435 14492 2482 22940 44730 29245 39139
$$ packed form
4890g865j6470j7002K0498L8301R529j2018k1077j6582k509P381J1347q244j9015
4877c3726K0726J8760j6392R804n485J120M602n64j4441k6810P799L839j6140
4864d6908N821N406J8833J2837r89m680k96L017K205R512J5568J1408N22j2272
4850A9984k116j0714j3152l492P84J4429o132j6529o466r377n366j1491J6936
4837c2702K0782j6585J543q962P304N996j5219J2750J6106J2113j5892M183J1958
4824C375J066J5967j8393r455K0582L034N589P96M730J648L204j1936j6328K583
4810F462J3243M070J664l402j0314k795P071J9708k1556q159j4582L3735J2091
4797C7236P189j8433j8139N427L266Q227l338o943j2010K0458K1790j5485R894
$$ plain form
4784 39139 40509 42130 34251 15679 8632 7199 14014 11412 6116 9921 4673 -11405 -18211 -24063
4770 -24063 -6367 -4755 -9992 6588 11505 395 2672 4246 -10614 -21207 -28784 -12919 25006
4757 25006 43941 20731 -15294 -18631 -17908 -9633 7137 13124 13788 10164 9938 6860 368 -11865
4743 -11865 -2249 -1687 -3598 12260 12134 19713 11969 -40 2478 -3113 7742 9656 11821 16171
4729 16171 4612 364 14022 9055 -18262 -27379 -22282 -30620 -32846 -36554 -27957 -28179 -20895 -3300
4715 -3300 -16556 -10306 -7455 8839 22699 10875 4860 13978 17199 5803 -5082 -12558 -13409 -16056
4701 -16056 -3549 -5185 -3447 7242 17556 25140 34424 42403 23712 -10228 -10214 2056 5648 -13992
4687 -13992 -14365 -15396 -35133 -14251 -3701 950 -25379 -21872 -20014 -22507 -52571 -64959 -46105
$$ packed form
4784C9139J370J621p879j8572p047j433O815k602n296L805n248j6078o806n852
4770b4063J7696J612n237J6580M917j1110K277J574j4860j0593p577J5865L7925
4757B5006J8935k3210l6025l337P23Q275J6770N987O64l624k26l078o492j2233
4743a1865R616N62j911J5858j26P579p744j2009K518n591J0855J914K165M350
4729A6171j1559m248J3658m967k7317r117N097q338k226l708Q597k22P284J7595
4715c300j3256O250K851J6294J3860j1824o015R118L221j1396j0885p476q51k647
4701a6056J2507j636J738J0689J0314P584R284P979j8691l3940J4J2270L592j9640
4687a3992l73j031j9737K0882J0550M651k6329L507J858k493l0064j2388J8854
$$ plain form
4674 -46105 -38662 -31168 -50546 -39239 -20890 4408 14897 5448 6188 9758 4958 2672 23025
4661 23025 40319 15153 -628 17484 9686 -3056 -8994 -9197 -5261 -19404 -16805 -8936 -17877
4648 -17877 -11069 -435 -9164 -26923 -47797 -66039 -46155 -20510 -12809 -21491 -37068 -41887 -32840
4635 -32840 -24868 -21104 -23975 -23121 -20151 -12395 7563 25973 15711 -4222 -15604 -22718 -32271 -32470
4621 -32470 -9628 -9388 -5914 -8225 8667 34947 41639 21491 8565 12164 10086 18884 21614 24509
4607 24509 20533 19283 12254 -12761 -10469 19141 18986 17818 18373 8692 8380 5449 16954 -2995
4593 -2995 -212 13227 15961 24611 30037 31161 12921 17392 13526 -1858 21702 27585 27281 33107
4579 33107 52556 41933 41204 6138 -1484 -2511 24205 39371 40644 23701 26544 28779 20275
$$ packed form
4674d6105P443P494j9378J1307J8349K5298J0489r449P40L570m800k286K0353
4661B3025J7294k5166j5781J8112p798j2742n938k03L936j4143K599P869q941
4648a7877O808J0634q729j7759k0874j8242J9884K5645P701q682j5577m819R047
4635c2840P972L764k871Q54K970P756J9958J8410j0262j9933j1382p114r553j99
4621c2470K2842K40L474k311J6892K6280O692k0148j2926L599k078Q798K730K895
4607B4509l976j250p029k5015K292K9610j55j168N55r681l12k931J1505j9949
4593b995K783J3439K734Q650N426J124j8240M471l866j5384K3560N883l04N826
4579C3107J9449j0623p29l5066p622j027K6716J5166J273j6943K843K235q504
$$ plain form
4566 20275 5503 15617 6523 -3348 6028 2612 9150 -18257 -35987 -25723 -35738 -39361 -10951
4553 -10951 16754 5660 3407 19434 20769 25287 10698 -9979 -11382 -22444 -22921 -18066 -21849
4540 -21849 -8422 -7415 -19033 -5649 18542 19643 24258 43187 40339 5592 -3497 4416 28512
4527 28512 33429 34505 43605 42753 15794 -3292 -6099 12561 34583 21272 17803 13870 12714 12051
4513 12051 8878 2141 12904 11213 6934 19115 16201 -10317 -25736 -16858 -20179 -33646 -16543
4500 -16543 4214 7401 -4710 -978 -11511 -7092 -6707 -1834 9060 5146 -8791 -43017 -26834
4487 -26834 1530 27431 25033 28982 21142 720 -5637 -383 18756 20506 -7404 -14612 -15884
4474 -15884 -6134 -667 -5056 -20804 -11551 -23478 -33606 -34741 -28884 -14926 -21291 -32100 -35554
$$ packed form
4566B0275j4772J0114r094r871R376l416O538k7407j7730J0264j0015l623K8410
4553a0951K7705j1094k253J6027J335M518j4589k0677j403j1062m77M855l783
4540b1849J3427J007j1618J3384K4191J101M615J8929k848l4747r089P913K4096
4527B8512M917J076R100q52k6959j9086k807J8660K2022j3311l469l933j156o63
4513A2051l173o737J0763j691m279J2181k914k6518j5419Q878l321j3467J7103
4500a6543K0757L187j2111L732j0533M419L85M873J0894l914j3937l4226J6183
4487b6834K8364K5901k398L949p840k0422o357N254J9139J750k7910p208j272
4474a5884R750N467m389j5748R253j1927j0128j135N857J3958o365j0809l454
$$ [...]
##END NTUPLES=NMR SPECTRUM
##END=
