##TITLE=Analysis number 315142
Compound Code cc 40106
Book Reference 464/2
Project Code adrs
Chemist Name chrisr
##JCAMPDX= 6.0         $$ Bruker NMR JCAMP-DX V2.0
##DATA TYPE= NMR SPECTRUM
##DATA CLASS= NTUPLES
##ORIGIN= Bruker BioSpin GmbH
##OWNER= NMR
$$ XWIN-NMR		Version 3.5
$$ Wed Nov  9 09:55:00 2005 GMT Standard Time (UT+0h)  MAYBRIDGE\NMR@NMR_250MHZ
##.OBSERVE FREQUENCY= 250.131544655141
##.OBSERVE NUCLEUS= ^1H
##.ACQUISITION MODE= SIMULTANEOUS (DQD)
##.ACQUISITION SCHEME= undefined
##.AVERAGES= 16
##.DIGITISER RES= 18
##SPECTROMETER/DATA SYSTEM= dpx250
##.PULSE SEQUENCE= zg30
##.SOLVENT NAME= CDCl3
##.SHIFT REFERENCE= (INTERNAL, CDCl3, 0, 16.522)
##AUDIT TRAIL= $$ (NUMBER, WHEN, WHO, WHERE, WHAT)
$$ ##TITLE= Audit trail, XWIN-NMR		Version 3.5
$$ ##JCAMPDX= 5.01
$$ ##ORIGIN= Bruker BioSpin GmbH
$$ ##OWNER= NMR
$$ C:\u/data/dgb/nmr/ADRS/12050/pdata/1/auditp.txt
$$ ##AUDIT TRAIL=  $$ (NUMBER, WHEN, WHO, WHERE, WHAT)
(   1,<2005-11-09 09:54:32.49 +000>,<MAYBRIDGE\NMR>,<NMR_250MHZ>,
      <created by zg, POWCHK disabled, PULCHK disabled
       configuration hash MD5:
       62 19 C7 07 E1 42 D1 B7 37 6C 3D D0 77 39 F9 E6
       data hash MD5: 64K
       54 BC 3B 21 A7 38 F3 19 96 D7 8C A7 82 C9 94 29>)
(   2,<2005-11-09 09:54:48.80 +000>,<MAYBRIDGE\NMR>,<NMR_250MHZ>,
      <Start of raw data processing
       ef LB = 0.3 FT_mod = 6 PKNL = 1 SI = 32K 
       data hash MD5: 32K
       42 AE BB 97 61 CA E6 81 26 D5 01 67 78 35 C7 CE>)
(   3,<2005-11-09 09:54:50.66 +000>,<MAYBRIDGE\NMR>,<NMR_250MHZ>,
      <apk 
       data hash MD5: 32K
       E5 88 3C 08 DF 1D DA 5C 9A 07 96 76 DA 5D 48 7E>)
(   4,<2005-11-09 09:54:51.57 +000>,<MAYBRIDGE\NMR>,<NMR_250MHZ>,
      <abs ABSG = 5 
       data hash MD5: 32K
       94 06 BA F8 7C FC DE 31 AA 54 F7 1B 41 1B C0 6C>)
$$ ##END=
$$ 
$$ hash MD5
$$ 05 F0 49 53 69 26 2D 5A E1 04 A7 F4 C3 3D C4 8D
##$RELAX= 
##$RELAX= 
##$RELAX= 
##$RELAX= 
##$RELAX= 
##$RELAX= 
##$RELAX= 
$$ Bruker specific parameters
$$ --------------------------
##$DU= <C:\u>
##$EXPNO= 12050
##$NAME= <ADRS>
##$PROCNO= 1
##$TYPE= <nmr>
##$USER= <dgb>
##$AMP= (0..31)
100 100 100 100 100 100 100 100 100 100 100 100 100 100 100 100 100 100 
100 100 100 100 100 100 100 100 100 100 100 100 100 100 
##$AQSEQ= 0
##$AQ_mod= 3
##$AUNM= <au_zg>
##$AUTOPOS= <11 >
##$BF1= 250.13
##$BF2= 250.13
##$BF3= 250.13
##$BF4= 250.13
##$BF5= 500.13
##$BF6= 500.13
##$BF7= 500.13
##$BF8= 500.13
##$BYTORDA= 1
##$CFDGTYP= 0
##$CFRGTYP= 5
##$CHEMSTR= <none>
##$CNST= (0..31)
1 1 145 1 1 1 1 1 1 1 1 1 1 1 1 1 1 1 1 1 1 1 1 1 1 1 1 1 1 1 1 1 
##$CPDPRG= <>
##$CPDPRG1= <>
##$CPDPRG2= <>
##$CPDPRG3= <>
##$CPDPRG4= <mlev>
##$CPDPRG5= <mlev>
##$CPDPRG6= <mlev>
##$CPDPRG7= <mlev>
##$CPDPRG8= <mlev>
##$CPDPRGB= <>
##$CPDPRGT= <>
##$D= (0..31)
0 1 0 0 0 0 0 0 0 0.06 0 0 0 0 0 0 0.0002 0 0 0 0 0 0 0 0 0 0 0 0 0 0 
0 
##$DATE= 1131530071
##$DBL= (0..7)
120 120 120 120 120 120 120 120 
##$DBP= (0..7)
150 150 150 150 150 150 150 150 
##$DBP07= 0
##$DBPNAM0= <>
##$DBPNAM1= <>
$$ [...]
##$SUBNAM7= <"">
##$SUBNAM8= <"">
##$SUBNAM9= <"">
##$SW= 20.6930455092707
##$SWIBOX= (0..15)
0 0 3 0 0 0 0 0 0 0 0 0 0 0 0 0 
##$SW_h= 5175.983436853
##$TD= 65536
##$TD0= 1
##$TE= 294.16
##$TE2= 300
##$TE3= 300
##$TEG= 300
##$TL= (0..7)
0 120 120 120 120 120 120 120 
##$TP= (0..7)
150 150 150 150 150 150 150 150 
##$TP07= 0
##$TPNAME0= <>
##$TPNAME1= <>
##$TPNAME2= <>
##$TPNAME3= <>
##$TPNAME4= <>
##$TPNAME5= <>
##$TPNAME6= <>
##$TPNAME7= <>
##$TPOAL= (0..7)
0.5 0.5 0.5 0.5 0.5 0.5 0.5 0.5 
##$TPOFFS= (0..7)
0 0 0 0 0 0 0 0 
##$TUNHIN= 0
##$TUNHOUT= 0
##$TUNXOUT= 0
##$USERA1= <user>
##$USERA2= <user>
##$USERA3= <user>
##$USERA4= <user>
##$USERA5= <user>
##$V9= 5
##$VALIST= <valist>
##$VCLIST= <CCCCCCCCCCCCCCC>
##$VD= 0
##$VDLIST= <DDDDDDDDDDDDDDD>
##$VPLIST= <PPPPPPPPPPPPPPP>
##$VTLIST= <TTTTTTTTTTTTTTT>
##$WBST= 1024
##$WBSW= 4
##$XGAIN= (0..3)
0 0 0 0 
##$XL= 0
##$YL= 0
##$YMAX_a= 607800
##$YMIN_a= -396906
##$ZGOPTNS= <>
##$ZL1= 120
##$ZL2= 120
##$ZL3= 120
##$ZL4= 120
##$ABSF1= 16.522
##$ABSF2= -4.171173
##$ABSG= 5
##$ABSL= 3
##$ALPHA= 0
##$AQORDER= 0
##$ASSFAC= 0
##$ASSFACI= 0
##$ASSFACX= 0
##$ASSWID= 0
##$AUNMP= <proc_1d>
##$AZFE= 0.1
##$AZFW= 0.1
##$BCFW= 0
##$BC_mod= 0
##$BYTORDP= 0
##$COROFFS= 0
##$CY= 12.5
##$DATMOD= 1
##$DC= 0
##$DFILT= <>
##$DTYPP= 0
##$F1P= 14.0000005364418
##$F2P= -0.99999901652339
##$FCOR= 0.5
##$FTSIZE= 32768
##$FT_mod= 6
##$GAMMA= 0
##$GB= 0
##$INTBC= 1
##$INTSCL= 1
##$ISEN= 128
##$LB= 0.3
##$LEV0= 0
##$LPBIN= 0
##$MAXI= 10000
##$MC2= 0
##$MEAN= 0
##$ME_mod= 0
##$MI= 0
##$NCOEF= 0
##$NC_proc= -4
##$NLEV= 6
##$NOISF1= 0
##$NOISF2= 0
##$NSP= 0
##$NTH_PI= 0
##$NZP= 0
##$OFFSET= 16.522
##$PC= 1
##$PHC0= 79.59341
##$PHC1= 4.190141
##$PH_mod= 1
##$PKNL= yes
##$PPARMOD= 0
##$PSCAL= 4
##$PSIGN= 0
##$REVERSE= no
##$SF= 250.13
##$SI= 32768
##$SIGF1= 0
##$SIGF2= 0
##$SINO= 400
##$SIOLD= 32768
##$SREGLST= <1H.CDCl3>
##$SSB= 0
##$STSI= 32768
##$STSR= 0
##$SW_p= 5175.98343685301
##$SYMM= 0
##$S_DEV= 0
##$TDeff= 65536
##$TDoff= 0
##$TI= <Analysis number 999999
Compound Code 99
Book Reference 9
Project Code 9>
##$TILT= no
##$TM1= 0
##$TM2= 0
##$TOPLEV= 0
##$USERP1= <user>
##$USERP2= <user>
##$USERP3= <user>
##$USERP4= <user>
##$USERP5= <user>
##$WDW= 1
##$XDIM= 32768
##$YMAX_p= 303930386
##$YMIN_p= -147903
$$ End of Bruker specific parameters
$$ ---------------------------------
##NTUPLES= NMR SPECTRUM
##VAR_NAME=  FREQUENCY,     SPECTRUM/REAL,   SPECTRUM/IMAG
##SYMBOL=    X,             R,               I
##VAR_TYPE=  INDEPENDENT,   DEPENDENT,       DEPENDENT
##VAR_FORM=  AFFN,          ASDF,            ASDF
##VAR_DIM=   32768,         32768,           32768
##UNITS=     HZ,            ARBITRARY UNITS, ARBITRARY UNITS
##FACTOR=    0.157963299565203, 1,           1
##FIRST=     4132.6476996994, 0,             0
##LAST=      -1043.33573715361, 0,           0
##MIN=       -1043.33573715361, -147903,     0
##MAX=       4132.6476996994, 303930386,     0
$$ Real data points
##PAGE= N=1
##DATA TABLE= (X++(R..R)), XYDATA
$$ [...]
17807A487976p5391j01082p7010q1264m5336k9065l7886j2317k8018l1324o2690
17796I06593o6257J2929l850n5903j6161K2152l795M266l7805L988l9140n6357
17784F70660o1876k3744O815J0391R595k0553K188J922P988m210j0948K0344k3465
17771E85107j9950Q886J677k0071o585J0072K2143j2665K0322J3529m165r95J5676
17758F12981L169q593j4621j5143L6881P891K8445J8182L5262J6057Q860M6792
17746G76163K4421O0707M3958J9705N0124J00023N8774O6665P5240R4755Q6312
17735A456847J22812J06303N5937O9773J16262J70666J18661J01005J82599K13899
17725B714764J38633J59089J83255J79635J92221K11395K46832K13638K24158
$$ y = [1487976, 1412585, 1311503, 1234493, 1153229, 1107893, 1078828, 1040942, 1028625, 1000607, 969283, 906593, 840336, 853265, 849415, 793512, 777351, 799503, 795708, 799974, 762169, 766157, 727017, 670660, 608784, 585040, 591855, 602246, 611841, 591288, 593476, 595398, 603386, 599176, 588228, 608572, 585107, 565157, 574043, 575720, 555649, 549064, 559136, 581279, 568614, 588936, 602465, 598300, 597305, 612981, 616150, 607557, 592936, 577793, 614674, 622565, 651010, 669192, 704454, 720511, 729371, 776163, 800584, 861291, 905249, 924954, 975078, 1075101, 1133875, 1200540, 1275780, 1370535, 1456847, 1579659, 1685962, 1741899, 1811672, 1927934, 2098600, 2217261, 2318266, 2500865, 2714764, 2853397, 3012486, 3195741, 3375376, 3567597, 3778992, 4025824, 4239462, 4463620]
17716D463620K76836K79787K74919K98234L21173L24417L47723L60289L79679
17707G326677M10325M18313M08239M15355M88706N41780O38145P85208R54043
17698A2386791J268299J649742K150549K823905L419554L913976M251391M305464
17690C6169671L768229K839750J915180P37423m30009n21325O5365O83068J087981
17681D6315333J126021Q76092P5029q80047j243196j377426j450352j348616j505947
17672D0586891j969416j822713j270860r08525q61851j166728j695850k653177
17664B8237771l700164l912956l534019k930300k136866j321234o75830l62370
17656I664032k05378j5740R3204K19242L11810M45623O26606Q77704J146290J507835
$$ y = [4463620, 4740456, 5020243, 5295162, 5593396, 5914569, 6238986, 6586709, 6946998, 7326677, 7737002, 8155315, 8563554, 8978909, 9467615, 10009395, 10647540, 11432748, 12386791, 13655090, 15304832, 17455381, 20279286, 23698840, 27612816, 31864207, 36169671, 39937900, 42777650, 44692830, 45430253, 45000244, 44478919, 44544284, 45227352, 46315333, 47441354, 48317446, 48392475, 47512428, 46269232, 44891806, 43441454, 42092838, 40586891, 38617475, 36794762, 35523902, 34615377, 33753526, 32586798, 30890948, 28237771, 24537607, 20624651, 17090632, 14160332, 12023466, 10702232, 10026402, 9664032, 9458654, 9442914, 9536118, 9755360, 10067170, 10512793, 11139399, 12017103, 13163393, 14671228]
17646A4671228J977558K509710K924776L230666L290810K908113K202819J470547
17638C5186227N89321l93513n41003m6365M91538Q50785Q98668Q02430L24347
17629C8162435n75121r91070j134743j308832j342028j474054j794224j622377
17621B7919986j196496q10066p48029j001008j304133k087526l104161l445534
17613A4223033l150037k722626k142806j535322r77258o58108m48826l36023k70553
17604A981474j72023j49678j76090j64486j27432j18939r1446r3014o4941m2517
17594G80908k1591m4289p0035l1047o3114k9836k3128l8482j1274l6J572J1035
17582D60683l6153k2361j1761M129M4180J2435j0700J8686L2703K4130N3170p597
$$ y = [14671228, 16648786, 19158496, 22083272, 25313938, 28604748, 31512861, 33715680, 35186227, 35775548, 35382035, 34841032, 34794667, 35286205, 36136990, 37035658, 37838088, 38162435, 37587314, 36596244, 35461501, 34152669, 32810641, 31336587, 29542363, 27919986, 26723490, 25913424, 25165395, 24164387, 22860254, 20772728, 17668567, 14223033, 11072996, 8350370, 6207564, 4672242, 3694984, 3036876, 2588050, 2252027, 1981474, 1809451, 1659773, 1483683, 1319197, 1191765, 1072826, 981380, 888366, 823425, 780908, 759317, 715028, 644993, 613946, 550832, 520996, 497868, 459386, 448112, 448076, 449648, 460683, 424530, 402169, 390408, 394537, 438717, 451152, 440452, 459138, 491841, 515971, 569141, 561544]
17570E61544l3144k6971k1498M013n0286o4825l754J9246R94j0092l5049n5863
17558B84315k2550o938k451k360N371J8126l1901j1026J7740l4462J2108L2851
17546B58823O191l3307q849O539n952j0589j3050k5652q131k902L540j6348k4179
17533A26134J0046N521M937r160k7140n906M9530K2154N381K0228J617J6329J3245
17520B32916L0006o076k2212l3231k5993J2100p1764m2697N3626J6412l9789k1776
17508H1522Q611L6898K825K2577r136j2394k339O274j4502P797j1609j5607k2692
17495G8225K1439J6956o345J0105K7933L5918o9523n380J320l9486L928j8382
17483E6708l5115L2423N557j4087n6050r753M2297K2945j4407P441j8318o085
$$ y = [561544, 528400, 501429, 479931, 483944, 433658, 368833, 365079, 384325, 385319, 375227, 340178, 284315, 261765, 254827, 252376, 250016, 255387, 273513, 241612, 230586, 248326, 213864, 225972, 258823, 265014, 231707, 222858, 229397, 223445, 212856, 199806, 174154, 166023, 163121, 166661, 150313, 126134, 136180, 141701, 146638, 137478, 110338, 104432, 153962, 176116, 181497, 201725, 203342, 219671, 232916, 262922, 256846, 234634, 201403, 175410, 187510, 115746, 73049, 126675, 143087, 103298, 81522, 90133, 127031, 129856, 152433, 143297, 130903, 128564, 134838, 120336, 128133, 116524, 100917, 78225, 99664, 116620, 110275, 120380, 148313, 184231, 114708, 109328, 110648, 71162, 75090, 56708, 21593, 54016, 59573, 45486, -10564, -20317, 21980, 44925, 30518, 37959, 19641, 13556]
17471A3556J5167M9754O920l086k0623j2226K927L7019n326m2072L673L1554J7805
17458I5042L1999q885Q743N168j7655k3017q573J8838l872L7141K2082L314L4303
17445A94628N2051J0395p81K4042L2283N6319O1442M9267L5506L5805K7855j4390
17433E64422m9759r0651o4405k8516j1556k9049n189k216k4881m9037l2012l3236
17421A43915k2178l7593J1566j4686O164L1904M0636m140m3042l9207j2508R296
17409G0127j97m0120J8967j2144j2893J6344J7154J3409J8081K3030J045O060
17397A18863K6446J0088J0125m0985M1306K4444K5475K4984m40R491j3285L5657
17385B72169j5954l7173K7662L1289l640k8991k6272J3236J7983L690n6962m7644
$$ y = [13556, 28723, 78477, 85397, 82311, 61688, 49462, 52389, 89408, 84082, 42010, 45683, 77237, 95042, 127041, 118156, 126899, 132067, 114412, 91395, 82822, 101660, 97788, 134929, 157011, 160325, 194628, 246679, 257074, 256293, 280335, 312618, 368937, 430379, 479646, 515152, 550957, 578812, 564422, 514663, 424012, 359607, 331091, 319535, 290486, 285297, 283081, 258200, 209163, 177151, 143915, 121737, 84144, 95710, 81024, 87188, 119092, 159728, 155588, 112546, 73339, 60831, 70127, 69930, 29810, 48777, 36633, 23740, 40084, 57238, 70647, 88728, 111758, 112803, 118863, 145309, 155397, 165522, 124537, 165843, 190287, 215762, 240746, 240306, 249797, 236512, 272169, 256215, 219042, 246704, 277993, 274353, 245362, 219090, 232326, 250309, 253999, 197037, 149393]
17373A49393n1192k6079m9989k2032K537J0821K8695k415j6239K5090M7588P55
17361I6933j371k2894k917j0492l336J9896K5585L4358O8655K2677K4100M0450
17349B91644J0150K0707J9771J943o32J4616N301L460J6233l937J6873J5433R045
17336D20607m767j5962n4885l9452k9355k1238l783K9810R557k3643r383n983
17324B51523l6462q947K8774k6082l2084n4586l0317j1620P989R043l5279m5086
17312A6866k7534l877n674K4483J4828k0135J261K1099j2835m4421j6818l4361
17300h7118L3210L6018L2020K5969k1765j9441J0454J8392q507k9278k821l2759
17288d5626l9790K7682K497k5285O715N0586O2923L189n4817l7174j1779o361
$$ y = [149393, 98201, 72122, 22133, 101, 2638, 13459, 42154, 39739, 23500, 48590, 96178, 96933, 95562, 72668, 69751, 59259, 55923, 75819, 101404, 135762, 204417, 227094, 251194, 291644, 301794, 322501, 342272, 344215, 343583, 358199, 363500, 366960, 383193, 379256, 396129, 411562, 420607, 415840, 399878, 344993, 305541, 276186, 254948, 251165, 280975, 290532, 266889, 257506, 251523, 215061, 206114, 234888, 208806, 176722, 122136, 91819, 80199, 88188, 97231, 61952, 16866, -10668, -14545, -20219, 4264, 19092, -1043, 218, 21317, 8482, -35939, -52757, -87118, -53908, -17890, 14130, 40099, 18334, -1107, 9347, 27739, 19232, -10046, -12867, -45626, -85416, -57734, -55237, -80522, -73807, -23221, 39702, 42891, -11926, -49100, -60879, -67240]
17276f7240j2861M5345J6026K9377K2773k5570p825K0649K6647k8087n2499m9781
17264h3046k4578L6991M8803M851K198M267o843m563l549j205J3905M666N422
17251b681J786O0789J1114J1929j3684K1213j9717j5860o1459j8771n96k0619
17239d6556J265L4147M261q800L095K1009k428J1161j7030l0624L3621L0753R655
17226D3529j0243l0772J1670n4919k0928L569l7655M835L4745L3907k7828L8501
17214a1589L0582J402m7309m3828L386K1918l3407r749K4430M4075M999k799R2
17201a7797P937M449M1347Q73l977J9669k7028l3958L647K9596L0395L8809K324
17188I6286o4339n1797p994M6298J6993J0460J2865k793j232L6174K7777L5222
$$ y = [-67240, -80101, -34756, -18730, 10647, 33420, 7850, 25, 20674, 47321, 19234, -33265, -83046, -107624, -70633, -21830, -16979, -14781, -10514, -17357, -21920, -25469, -26674, -12769, -8103, -2681, -895, 59894, 71008, 82937, 69253, 90466, 70749, 54889, -6570, -25341, -25937, -46556, -45291, -11144, -6883, -15683, -12588, 8421, 5993, 17154, 124, -30500, 3121, 33874, 43529, 33286, 2514, 14184, -40735, -61663, -58094, -95749, -90914, -56169, -22262, -50090, -11589, 18993, 20395, -26914, -70742, -67356, -45438, -78845, -88594, -64164, -20089, -15090, -17889, -17797, -9860, -5411, 35936, 36809, 32832, 52501, 25473, -8485, -4838, 24758, 55153, 93962, 96286, 31947, -19850, -27844, 18454, 35447, 45907, 58772, 55979, 54747, 90921, 118698, 153920]
17176A53920n216n3012k5507N3398K2228l0568K4324O298O788L7588J650J5730
17164B07621j1701k1183J4135J9657K1047o72j962M22j5625k4788k3576J2080
17152A75455J3548o3408l4914r44l3342l0170k7902n393K0302M2443r883j8241
17140B7551j3383J0115o397L2772J0464l4305J3556L07m8084J2198J2177K0612
17128C7583K2763K3398K2067J8618L9123p39J1645M2340N881k1233j4125K342
17116A89663k2568J0100K112j1576K1232M5078O646K1262J0501R773l1541k9777
17104B20905k6951l3779L482j3261j9211J1776j3851j5592M182j3325l1448P732
17092H0659J6837K8540K9197K1630o233k5516k7350P555K1954J6882l2951J0357
$$ y = [153920, 148704, 95692, 70185, 123583, 145811, 115243, 139567, 145865, 152653, 190241, 191891, 207621, 195920, 174737, 188872, 208529, 229576, 228904, 226942, 227364, 211739, 186951, 163375, 175455, 189003, 125595, 90681, 89737, 56395, 26225, -1677, -7070, 13232, 55675, 45792, 27551, 14168, 24283, 17886, 50658, 61122, 26817, 40373, 40680, -7404, 4794, 16971, 37583, 60346, 83744, 105811, 124429, 163552, 162813, 174458, 216798, 222679, 201446, 187321, 189663, 167095, 177195, 179307, 167731, 188963, 234041, 240687, 261949, 272450, 282223, 250682, 220905, 193954, 160175, 163657, 150396, 131185, 142961, 129110, 113518, 117700, 104375, 72927, 80659, 97496, 126036, 155233, 176863, 170630, 145114, 117764, 125319, 147273, 164155, 131204, 141561]
17080A41561K1205R514J7109K2398M3546L4532o33K3133N666Q881J2453M185M3422
17067C86972K7110K5665o894N1516L6015O713N526K310J0069K5317L5224M175
17055F09718l6961m8834l7067k2400m2498p2875o0871O877j7849k8816k7690j7670
17043B03064j4489n565n1522n609J2260l0120k1870J4473l1488k1497R444N322
17031F2403K9611J3682l4393l2991l0623k3039k4482k6743P346K2535K4349J8965
17019F620j2372J5552J7156r076j5397o489p958j984K6924L1706k801q514J8088
17006E1455J5125j7993o2031k9332J3834N779R668K975j1118j4000R574K4624
16994a440k1528n3906j2408L8432J5763M0407M0452k1671k8114N488k0581j4875
$$ y = [141561, 162766, 172280, 189389, 211787, 255333, 289865, 289232, 312365, 318031, 326912, 339365, 343550, 386972, 414082, 439747, 432853, 484369, 520384, 527097, 532623, 534933, 545002, 570319, 605543, 609718, 572757, 523923, 486856, 464456, 421958, 349083, 288212, 295089, 277240, 248424, 220734, 203064, 188575, 183010, 131488, 125879, 138139, 108019, 86149, 100622, 69134, 47637, 57081, 62403, 92014, 105696, 71303, 38312, 7689, -15350, -39832, -66575, -59229, -36694, -12345, 6620, -5752, 9800, 26956, 17880, 2483, -4006, -11964, -13948, 12976, 44682, 41881, 33367, 51455, 66580, 48587, -13444, -42776, -28942, -23163, -13495, -10520, -21638, -35638, -26064, -1440, -22968, -76874, -89282, -50850, -35087, 5320, 45772, 24101, -4013, 1475, -19106, -33981]
16982c3981l289K93J9776J200N216j4662k1088J8910k4534l6435l168J966n358
16969i5154J1582L3537K0047j493L5458N4501K356r883k3525j0373k5533K5938
16957A7458K0450k1110o237k7831J712K4334L4310k5592n5312j5013K0164J0939
16945b1728N030N2932J010l6571j4271r201k8687j2084K9851l058j6277J0310
16933d2744M5229k7341P503l5438m2880J1169M102J3976J707K879K6613M7715
16921A2490k2171p936K2158j0148J7492R622k1339L6480l2738l6071K203K2547
16909g411N292J5182O081P06k0698k3879j4001r747j5926k478J2484K9363K6356
16896A324j3615k470J3967M913n621r861k4476J7617L4316R704k2340k9713l1075
$$ y = [-33981, -37270, -36977, -17201, -16001, -10785, -25447, -46535, -27625, -52159, -88594, -91762, -89796, -95154, -83572, -50035, -29988, -31481, 3977, 58478, 60834, 50951, 27426, 17053, -8480, 17458, 37908, 16798, 10561, -17270, -15558, 8776, 43086, 17494, -37818, -52831, -32667, -21728, -16698, 36234, 37244, 673, -13598, -22799, -51486, -63570, -33719, -36777, -53054, -42744, 2485, -24856, -17353, -52791, -95671, -84502, -80400, -66424, -64717, -61838, -35225, 12490, -9681, -17617, 4541, -5607, 11885, 21507, 168, 36648, 3910, -32161, -29958, -7411, -2119, 13063, 19144, 19850, -848, -24727, -38728, -48475, -64401, -66879, -54395, -25032, 1324, -12291, -14761, -794, 4119, -1502, -11363, -35839, -18222, 16094, 25798, 3458, -26255, -57330]
16883e7330J168q484L013j8108L1174J5969j4304P05p086J6150K0055m2346l3868
16870i3292N769M7043K0091l1938k2888r099O210K3346n633M4360N1391j8261
16858A7099m3807j7799l5648R672R555j7740o109J0669P477J604R888J6408K7957
16845a0774K1821j5108m1211K0460J2520k0779n149k495J7962K5786m217M415
16833C231J7277r869J5327j9033m279N930k1345k520p108k3407j7560K5675K6597
16820a1084L395J0952j2419L356R998j3485J4114j4404L588P698k6110J777m5
16807b2669l2675J2718L4503J1280l5196k1043K8829J5859J4591J3458m7870k1443
16795d9658J0647l2103n488P163l035K9420K2684K8498K5229k9172k8909n452
$$ y = [-57330, -56162, -64646, -61633, -79741, -48567, -32598, -46902, -46197, -53283, -37133, -17078, -59424, -93292, -87523, -40480, -20389, -52327, -75215, -84314, -78104, -54758, -60391, -16031, 35360, 17099, -26708, -44507, -80155, -70483, -60928, -78668, -84777, -74108, -66631, -65027, -55139, -38731, -10774, 11047, -4061, -45272, -24812, -12292, -33071, -38220, -40715, -22753, 3033, -1184, 3231, 20508, 10639, 25966, 6933, 2654, 8584, -12761, -15281, -22389, -45796, -63356, -37681, -11084, -7689, 3263, -9156, -5800, 4198, -9287, 4827, -9577, -5989, 1709, -24401, -22624, -22669, -55344, -42626, -8123, 3157, -32039, -53082, -24253, -8394, 6197, 19655, -28215, -49658, -39011, -71114, -76602, -69439, -72474, -43054, -20370, 8128, 33357, 4185, -24724, -30176]
16783c0176o159m147m8306J0565K8027L0770R264m1332m1781L625M2553P973K7270
16770a1854J2386k8138j7969j9558J4368q006K5464N7143M7654k7701n8228j3143
16758b7582J4991o880j3152m770J6339O676k8603j9912J2916L1555j513j5001
16746c4936R15j703Q427L5298M971R150l5156o653k8690j1943L9177J3945O120
16733a078L7440J1296k5124k108N455k8655l5397j9782J8126J558j5754q379L4588
16720b7814L0310Q651J7943K297p454L4090L1585j1923m388m6309n8599l219m2537
16707g7367M5306m158n097k158K3952j8250j4740j028l7549l7195M622M2931K2426
16694e8305J8086j9014R391r017J6001K6299q438j0832J3094O373r158m566q596
$$ y = [-30176, -36335, -40482, -88788, -78223, -50196, -19426, -10162, -51494, -93275, -89650, -47097, -39124, -11854, 532, -27606, -45575, -65133, -50765, -58771, -33307, 23836, 71490, 43789, -14439, -27582, -12591, -19471, -32623, -37393, -21054, -14378, -42981, -62893, -49977, -18422, -19935, -34936, -34021, -35724, -27297, 8001, 12972, 22122, -13034, -19687, -48377, -60320, -21143, -7198, -1078, 36362, 47658, 22534, 20426, 25881, -2774, -38171, -57953, -39827, -38269, -54023, -62402, -27814, 2496, 11147, 29090, 31387, 23933, 58023, 89608, 77685, 73297, 26988, -31611, -34830, -77367, -32061, -36219, -41316, -43474, -19522, -37772, -52512, -53540, -91089, -128284, -123662, -80731, -58305, -40219, -59233, -49842, -58859, -42858, -16559, -24997, -35829, -22735, -16362, -25520, -30086, -38682]
16681c8682K7233k7804J4510m045K628L2333Q584q649m7741M557j457p783j3953
16668f0269M903L4069J4797j4714M2548J1580k5118k2460n1j2312m716J4763j1024
16655b8004j2232K2836l688q698j9889n73j92J5086j7471j6100K0134K7791j1761
16642c2761O877m6432l2897P116K535K9239L7150K6844j4788l6183N812L7910
16630i578K487j3530p952o421k1472k0830l31M0961L9082k9978l9866L6072M1424
16617A0068L1233P914P803k8584m4338k2386K3746P039k7641r676N3280R848l7692
16604a9386l865L1719J3965k692K315k5823l0620j475L124k419Q881j7502k7097
16591g0875j4344K6963K6716m2982l4319N6501M1947J707p888p051q353P967J3657
$$ y = [-38682, -11449, -39253, -24743, -28788, -26160, 6173, 14757, 6108, -41633, -37076, -38533, -46316, -60269, -55366, -21297, -6500, -21214, 21334, 32914, 7796, -14664, -14715, -27027, -31743, -16980, -28004, -40236, -17400, -21088, -29786, -49675, -50248, -50440, -35354, -52825, -68925, -48791, -21000, -32761, -25884, -72316, -105213, -98097, -95562, -66323, -29173, -2329, -17117, -53300, -47488, -9578, -7091, -20621, -28573, -34994, -56466, -77296, -77627, -36666, 2416, -27562, -67428, -31356, 10068, 41301, 49215, 57018, 28434, -15904, -38290, -14544, -7505, -35146, -44822, 8458, 18306, -19386, -23251, 8468, 22433, 19741, 22056, -3767, -34387, -35862, -32738, -35157, -26276, -43778, -70875, -85219, -58256, -31540, -74522, -108841, -52340, -10393, -8686, -16574, -23625, -31978, -24011, -10354]
16578a0354m7968k7907K4369k325Q910Q30l700j0519j708k280K2289J5137L0393
16565d833k1224j4824K123O273j4392J8015K4775m6484m1416L1088M9279j3310
16553b4930L0846j170j0294k1517m2931m0515K6199K7238J397l2157p976K8028
16541f7782R786K2698L4871j553r531n372J4072m1284l6038J1878K7734J707K2344
16528a6470j3942J1990K1984J8938k470l3982n0849j2797K3113K4332q386k5544
16516f4083j5631R890K0452O156k7508J4843L4505L0084N656o5089k7217K9992
16504d7950J0058L4622J3829m6460l9043j8299J8948K9142j5954J1041J6499J2157
16492b1410j9815k3469J0158L5298j036Q754N753j9553p475M410o103k0064j2346
$$ y = [-10354, -58322, -86229, -61860, -64185, -55275, -54445, -58145, -68664, -70372, -72652, -50363, -35226, -4833, -26057, -40881, -38758, -32485, -46877, -28862, -4087, -50571, -91987, -60899, -11620, -24930, 5916, 4746, -5548, -27065, -69996, -110511, -84312, -57074, -55677, -87834, -95810, -67782, -57996, -35298, -427, -1980, -11511, -16883, -2811, -44095, -80133, -68255, -40521, -38814, -16470, -30412, -18422, 3562, 22500, 20030, -13952, -64801, -77598, -54485, -30153, -38539, -64083, -79714, -69824, -49372, -43216, -70724, -55881, -21376, 8708, 14364, -50725, -77942, -47950, -37892, -3270, 10559, -35901, -74944, -93243, -74295, -45153, -61107, -50066, -33567, -21410, -41225, -64694, -54536, -19238, -20274, -11520, -5767, -25320, -32795, -28385, -34488, -54552, -66898]
16479f6898j4719j2854o261Q548M4095K6492l3544j4381J1215N099L7694q604
16467b4118l9241K0006j4071J4630P8808L6365j1630n2107m564M836k7844k3150
16455d2080l6646m4471K8567M1663K2638k9012k3404O223O560K2216k12l810M7145
16442d623J1550r07M087K2800k7658j5061m5395K5431R442j4488k6428j9427L5304
16429d5373J1833j5797o7099p32M5361N518K0096L5202k1798R904m737j1589Q234
16416c0977j2820k515J4285J8120N983j3932m866K2529j2019J1250J3059k7986
16404a9889n331k195K6192K9849L6162j5839r875l4301k7221m9637m5881L9017
16392g8949J7864k5212m668L0082J702N5556L4528m6828n4111J9704L5759J8954
$$ y = [-66898, -81617, -94471, -100732, -92184, -48089, -21597, -55141, -69522, -58307, -53208, -15514, -24118, -63359, -43353, -57424, -42794, 36014, 72379, 60749, 8642, 4078, 8914, -18930, -42080, -78726, -123197, -94630, -52967, -30329, -59341, -82745, -76522, -69962, -47746, -47958, -51768, -4623, 6927, 6020, 10107, 32907, 5249, -9812, -55207, -29776, -20334, -34822, -61250, -80677, -45373, -33540, -49337, -116436, -117168, -71807, -66289, -46193, -10991, -32789, -22885, -27622, -39211, -30977, -43797, -46312, -32027, -13907, -7924, -21856, -26722, -4193, -16212, -4962, 8097, -19889, -25220, -27415, -1223, 28626, 64788, 48949, 39074, 4773, -22448, -72085, -117966, -78949, -61085, -86297, -90965, -60883, -59181, -3625, 30903, -15925, -70036, -50332, -14573, 4381]
16380D381l4122J429J6030m0273P530K5030R636O708L128K4210J0443J689k0186
16367A5633j5108M9l02J9805P313q620R370J132n5717K8511j300l4842j7663j8648
16353g0387L3032K3780J5237j6314J192K704J3061O390j793K3036k5602r434K0435
16340A5337m5178k9264J5703o934l1066J7465K3760R108k8566k9400M24K9074
16328e9537L1704K5124k9410j8122O970J762o252p497L9203K5324k7507J5207
16316c031K6555m253m3128N761K3001l2061j1445n788j8539L1605K8680j8352
16304b0995l6096K4147r372J208n328J1375n981l7961k5037N3354K8290j8653
16292d1049q166K3661J4249k5596l8163k0513N296K661L7254L4208O780Q850J9120
$$ y = [4381, -29741, -28312, -12282, -52555, -45025, -19995, -10359, -3651, -523, 23687, 34130, 35819, 15633, 525, 574, 272, 20077, 27390, 18770, 28140, 29272, -26445, 2066, 766, -34076, -51739, -70387, -37355, -13575, 1662, -14652, -13460, -10756, 2305, 8695, 6902, 29938, 4336, -5098, 15337, -29841, -59105, -43402, -50336, -81402, -63937, -40177, -31069, -59635, -89035, -88611, -59537, -27833, -2709, -32119, -50241, -43271, -41509, -47761, -55258, -16055, 9269, -18238, -3031, 23524, 19271, -23857, -18096, 4905, -27156, -38601, -44389, -62928, -31323, -2643, -20995, -57091, -32944, -42316, -41108, -46436, -35061, -41042, -79003, -104040, -50686, -22396, -41049, -49215, -25554, -11305, -36901, -75064, -95577, -90281, -87620, -50366, -16158, -9378, -528, 18592]
16279A8592k0665j7754j0k2750l026n816Q873J8830J3268J3125n797J3637N144
16266A5651K0367l6579k4915l5340m1386j7705M1070L8338R754L876l379J4255
16254a5993L5945k8548J6055m721m152n136j3757K9437J7992j9316o965k4738
16242b3897k4237L7555K8640l898P9J0687k1568N722K3191K5137j8147n074m0190
16229f000k0400K435m0178r689j6904M3278K4647j0092p575j986M0876j166l482
16216f236J5419k5M896j6034n82K353l2547j7796K1104L8599J1386k130l119l7265
16202b1977k6007j6195O788L0821k3320n715Q115k0801N303K4442j1229J2375
16190c7400K1947j9999l7591K541K9653r306M388N356L891J3256j0954j7551P055
$$ y = [18592, -2073, -19827, -19837, -42587, -45613, -51429, -42556, -23726, -10458, 2667, -3130, 10507, 15651, 36018, -561, -25476, -60816, -102202, -119907, -78837, -40499, -30745, -26869, -30248, -15993, 19952, -8596, 7459, 2738, -1414, -6550, -20307, 9130, 27122, 7806, 841, -23897, -48134, -10579, 18061, 14163, 14242, 24929, 3361, 9083, 32274, 57411, 39264, 34190, -6000, -26400, -23965, -64143, -73832, -90736, -47458, -22811, -32903, -40478, -42464, -1588, -2754, -6236, 9183, 9158, 14054, -1980, -2562, -209, -32756, -50552, -29448, 9151, 20537, 18407, 15288, -21977, -47984, -64179, -57391, -26570, -49890, -55605, -47490, -68291, -62988, -38546, -49775, -37400, -15453, -35452, -73043, -70502, -40849, -50155, -45767, -40411, -36520, -23264, -34218, -51769, -44714]
16177d4714j02K8417N400k5472J2754K8036M5499j1220k8331j7000n7238j8052
16165h2023K3025O1786L6400M88l1952k7924N524j0931j1396j148p85l134j014
16152d3084K0290K5172L1101K7408k4769n2895j128L2089j4214j9958j4385l0653
16140f5026o716L431j1063j4378J8642K8200J880M70o850j0639K8902L0428J807
16127i12j8187l59j5429K7519j1535k1526J6899K1923R373k9103P445K082O877
16114d933J127l1853L3239L2774j9876j7332k9827k7735j4199n747R892J8581
16102e5889N7328p949j8432L8381j6098p617M2461J0988l209k7125m444q263o537
16089f405R300K3816k2332j3380j8164l683K191L3921k0855l9262l4373Q330O654
$$ y = [-44714, -44816, -16399, -10999, -36471, -23717, 4319, 49818, 38598, 10267, -6733, -63971, -82023, -58998, 2788, 39188, 39676, 7724, -20200, -14676, -25607, -37003, -38151, -38936, -42070, -43084, -22794, 2378, 33479, 60887, 36118, -16777, -17905, 14184, -30, -19988, -34373, -65026, -71742, -68311, -79374, -93752, -75110, -46910, -45030, -44560, -51410, -62049, -33147, -2719, -912, -19099, -19458, -34887, -7368, -18903, -40429, -23530, -1607, 7766, -21337, -13892, -11810, -4933, -3806, -35659, -2420, 30354, 10478, -6854, -36681, -64416, -78615, -84362, -74470, -55889, 1439, -6510, -24942, 13439, -2659, -10276, 32185, 43173, 39964, 12839, 8395, 132, -6405, 2895, 26711, 4379, -9001, -27165, -30848, -28657, 5264, -15591, -54853, -89226, -80896, -74242]
16076g4242J7149N13J4894k6910k1667J1290K7863N3470k4824l8866K3799L5774
16064a757O991q157m0962K7754N6137R811Q678j9269l4553l5132l2656j3642K4446
16051e2311J7524M4549l2873m1855l0873L5597J2532m523k6460J7813m069m448
16039f9397R959K7286Q140K8713K3899J2454j5591j930k0597k9602J8026L4979
16027B6339J7845K9792p824n3144l4804r4L4792N144k1073n457O849j4903K8064
16014A1526r15k2234n895q358j725L192M834p055K2612J6384n523k5487K1908
16001C264P118L134k8792J9244K640l9333J8220L969J2737N162j4157j0535N732
15988a1597l3540p381P326K6573J7361j1792j3576k5307n281K8286J4130J119
$$ y = [-74242, -57093, -56580, -41686, -68596, -90263, -78973, -51110, 2360, -22464, -61330, -37531, -1757, 5234, -2923, -43885, -16131, 40006, 49817, 58495, 39226, 4673, -30459, -63115, -76757, -52311, -34787, 9762, -23111, -64966, -95839, -60242, -47710, -52233, -78693, -60880, -64949, -69397, -59438, -32152, -24012, 4701, 28600, 41054, 25463, 23533, 2936, -26666, -8640, 26339, 44184, 73976, 66152, 13008, -21796, -21890, 12902, 18046, -3027, -8484, -1635, -16538, 11526, 10611, -11623, -17518, -25876, -27601, -24409, -19575, -26630, -4018, 12366, 6843, -18644, 3264, 10382, 13516, -15276, 3968, 6608, -32725, -14505, -10536, 2201, 7363, -6794, -17329, -11597, -45137, -52518, -45192, -18619, -1258, -13050, -26626, -51933, -57214, -28928, -14798, -13679]
15976a3679j4346o677J4952j9476j7203L0618K8198L713P817K5780K814j1741
15964C0770O425j2572j6798k5445N858J6773P221p327j3325j6147j578J6510L5436
15951B5801j210j5762r620j6147m98L929K4424m6940J5128j3291L692J6654P105
15938f735K5735J6227L9360J3826j3330m4154k2978J2029k1876k7848j9499j2228
15926f1471K6146N2080j6307j8778J107K369P578L4494j6518j2234j9801j351
15914b2686L62n651k5447L1422K3239J4252j8083l599j0573J4756j0639n0529
15902f3176N445K9255j4150L5597L3183J2326O193k3314m422k9052J2449o150
15890e816j0983l8642k4631K8486K3728J586J892J508Q620J1013j0440k3155q04
$$ y = [-13679, -28025, -34702, -19750, -39226, -56429, -25811, 2387, 6100, 13917, 39697, 42511, 30770, 37195, 24623, 7825, -17620, -11762, 5011, 12232, 4905, -8420, -24567, -26145, -9635, 25801, 24591, 8829, -791, -16938, -17436, -13507, 10917, -36023, -20895, -34186, -30494, -13840, -6735, 19000, 35227, 74587, 88413, 75083, 30929, 7951, 19980, -1896, -29744, -49243, -61471, -35325, 16755, 448, -18330, -17223, -14854, -7276, 27218, 10700, -1534, -21335, -22686, -22324, -27975, -53422, -22000, 1239, 15491, -2592, -6191, -16764, -2008, -12647, -63176, -57731, -28476, -42626, -7029, 26154, 38480, 44673, 21359, 16937, -12115, 334, -5816, -16799, -55441, -80072, -51586, -27858, -26272, -24380, -22872, -14252, -3239, -13679, -36834, -37638]
15877c7638J72J7265L3736l3803l1691j4043J6341N177O0839L1817j827o481m3867
15864d003m2097k852J0765L6453q594m0123L5823K7797j3064l0076j1467L7293
15852d145o521J502O762L760L993l2969Q885j0539j249r637k6898J134J1741k211
15838e6392m29m677K2774O471K2021K7975m5996l3008N1880P38l7704J189r363
15825e4521k6680N202M5035n825J0953n762N0846M9704j9489m4243O983j2632
15813d29j4745p251J2131j0192O848J756j3319J8823J7034J8373J798p178K1595
15800D5244k5490j8069r314L1483j1288l3345L146m111P284J6926L1458p418N44
15787B7050p822l1267k5092j1585j2339L7703K3838J6226j8050j8068K7071J4717
$$ y = [-37638, -37466, -20201, 13535, -20268, -51959, -66002, -49661, -44484, 16355, 48172, 46345, 39864, -4003, -46100, -48952, -38187, -1734, -10328, -50451, -14628, 13169, 105, -29971, -41438, -4145, -10666, -9164, -2402, 1358, 5351, -27618, -18733, -29272, -30521, -40158, -67056, -65922, -54181, -56392, -56821, -61498, -38724, -32253, -10232, 17743, -28253, -61261, -9381, -8643, -46347, -45158, -54521, -81201, -75999, -30964, -36789, -25836, -31598, 19248, 68952, 49463, 5220, 12203, -429, -15174, -22425, -10294, -20486, -13638, -11882, -25201, -6378, 10656, 29029, 30827, 23649, 45244, 19754, 1685, -7629, 23854, 12566, -20779, -17633, -21744, -14460, 2466, 33924, 26506, 27050, 19228, -12039, -37131, -48716, -61055, -23352, 486, 16712, -1338, -19406, 7665, 22382]
15775B2382m6235k6819J82J0491K9279O594k1433K2778K3326k0455n167j4516
15763a9593Q566J0616n5476R229L4312j7524j0025N0237j187k4008k638K3156
15751E665l990L4885J5803l2379j9534O007m3559l3335J668K0408N553M903J6687
15738b1218J5966m16n0383J872O313Q116k1914J4370K4579K6248k7975L0157K8697
15725C4412j8751n3567k7118P570J7627r496k6794J4158K5397N4734j1990j0488
15713d306k381k0889k5208M8831j602K6524j9587J5189R008l5353J3466J2454
15701A6146k0698P563J2327j390l6468k6366L8046L3363m358p630Q047j7226j7667
15688a6311o631J3578j2600k8841q715K727J9752j909J253N329o315K2576R497
$$ y = [22382, -23853, -50672, -50490, -39999, -10720, -4126, -25559, -2781, 20545, 90, -5077, -19593, -11027, -411, -55887, -46658, -12346, -29870, -39895, 10342, 9155, -14853, -17491, 5665, 1675, 36560, 52363, 19984, 450, 6457, -37102, -70437, -68769, -48361, -42808, -37905, -21218, -5252, -5668, -56051, -54179, -47866, -39750, -61664, -47294, -22715, 3533, -24442, 5715, 34412, 15661, -37906, -65024, -57454, -39827, -49323, -76117, -61959, -36562, 18172, 6182, -4306, -6687, -27576, -52784, -3953, -5555, 20969, 1382, 16571, 25579, -9774, 3692, 16146, -4552, 3011, 15338, 13948, -22520, -48886, -10840, 22523, 18165, 10535, 18582, 1356, -16311, -22942, -9364, -21964, -50805, -59520, -56793, -37041, -38950, -37697, -32368, -38683, -16107, -6610]
15675f610k0154O870j4712J3122N1820r319l7444j1648k7936l770m40M3393K2625
15662E797m1549O235j808J6812J2013l9591l5917R434o03j070k4892J1354N0521
15649c3264R627j8189J2230J5027n083l263n238N625J8700l600q767j4116Q033
15636b2278L1244M3692k3947l8632k1850j1760L8142L488j7936r871j4535J9984
15624b4259J9206j8285l1660K7277L2142m190M2439J337m7433o4537K8578M8166
15612H781P505k7770j7884L724N4105k2488n5310n257L3405J1898K9347N080m0989
15599a5853n7372k7897N3048J2432J7574K9994j3855l7724p171J4024j397J902
15587c2295N2008J9656j8888J2737n022l4360l4866K7265K0625r610k6182r654
$$ y = [-6610, -26764, -19894, -34606, -21484, 30336, 21017, -16427, -28075, -56011, -59781, -60221, -16828, 5797, -35752, -29517, -31325, -14513, -2500, -42091, -78008, -68574, -69177, -70247, -95139, -83785, -33264, -23637, -41826, -29596, -14569, -19652, -22915, -28153, -22528, -3828, -7428, -16195, -30311, -22278, 8966, 52658, 28711, -9921, -31771, -43531, -5389, -1901, -19837, -29708, -44243, -24259, -5053, -23338, -54998, -27721, 4421, 231, 42670, 44007, -3426, -67963, -39385, 8781, 16286, -11484, -29368, -25644, 28461, 5973, -49337, -54594, -21189, -9291, 20056, 25136, -15853, -73225, -101122, -48074, -35642, -18068, 11926, -1929, -39653, -46824, -32800, -34197, -32295, 19713, 39369, 20481, 33218, 28196, -6164, -41030, -13765, 6860, -2750, -28932, -38586]
15575c8586j6242j5058o381L4508K7365m986j7051l0275M881J6515L2952L3668
15563B1310p004o294Q02j4155j9910K3788L1184J3486j5680j4586J1454K7436
15551E1831K408k1082k9710K4437L4133K8556j4217n4249j9244P750k9138K7709
15539I184L8636l0626j6639N534n5860m2651K6744J6925J6866J1527l291J7058
15527f593N680l0927L7041L2026n0991k3984j4858M608K0482L108J2603l365q666
15514b3836k0476J695L5906r211j4157P886j1171L6213M240n5570j2732K9455
15502c1758j6845k1147k1021K2741L7517R567J0549K2174p202J217J0734l7772
15490b1246j1592J542P191j9337K9545K9867j8330L444l528k5304J5433L5185
$$ y = [-38586, -54828, -69886, -76267, -41759, -14394, -19380, -36431, -66706, -61825, -45310, -12358, 21310, 14306, 8012, 8814, -5341, -25251, -1463, 29721, 43207, 27527, 12941, 24395, 51831, 54239, 33157, 3447, 27884, 62017, 90573, 76356, 22107, 2863, 10613, -18525, 9184, 47820, 17194, 555, 6089, -49771, -92422, -65678, -48753, -31887, -20360, -23651, -6593, -913, -31840, 5201, 37227, -13764, -37748, -52606, -47998, -27516, -24408, -11805, -15170, -23836, -44312, -42617, -6711, -15922, -30079, -22193, -33364, 2849, 7089, -48481, -61213, -31758, -48603, -69750, -90771, -68030, -30513, -20946, -10397, 11777, 4575, 5792, 16526, -21246, -32838, -31296, -24105, -43442, -13897, 15970, -2360, 1084, -2444, -27748, -12315, 22870]
15478B2870J0877j9910J1228J6729l800J1895l5546k3540J464K2974N950J1917
15466C3108P85k1771k53P01j633K7092j5279l2619j4783N610J2078J2672K424
15453H132J7546j0218L476o436J875J7877J6381P088o3926p5L971j2911j0664
15440b7884K3117J6600K7934l8344j4289o499l4792j1885j2291j9396K7464L2487
15428c7778p269r108J6098L679L5902j07p667l784L552J9938J0600l0985q053
15415a4982r270j0132j5873O949L850M1419K8639j2998J7105j6086j4618j2601
15403h598J1608o754m1400K9169K0385o266j8498p971m714M612o113n321p968
15390d7829J0291K8064L8707j1503K0103l4091n5435Q927K6757R259j7693r987
$$ y = [22870, 33747, 13837, 25065, 41794, 37994, 49889, 14343, -9197, -7733, 15241, 21191, 33108, 33893, 12122, 11869, 12570, 10937, 38029, 22750, -9869, -24652, -19042, -6964, 5708, 8132, 25678, 15460, 18936, 12500, 14375, 32252, 48633, 55721, -8205, -8280, -4309, -17220, -27884, -4767, 11833, 39767, 1423, -12866, -19365, -54157, -66042, -78333, -97729, -70265, -37778, -45047, -54155, -38057, -34378, 1524, 1417, -6250, -10034, -6482, 13456, 24056, -6929, -14982, -24252, -34384, -50257, -43308, -39458, 1961, 30600, 17602, 34707, 18621, 4003, -8598, 3010, -3744, -45144, -15975, 4410, -1856, -20354, -28325, -33039, -28427, -34540, -39861, -47829, -37538, -9474, 29233, 17730, 37833, 3742, -51693, -42766, -16009, -6750, -24443, -34430]
15378c4430k0206J0413j1017R831K9972K4568M8399J4928m3312l2757K7977P244
15366C1610P048o201P054j1024l1751m2415j256O2667r251k6049n301N5879J1968
15353D2978O198j1059j1356k903j9548L3039N240n4912m2305J5055K6925N6925
15341D4277j1359k0540J2488O483N815n801k3992k3020j0768k9340j1874K2690
15329d4941N0382p288k6628K111J9906j7536K072K3280L5995J9230N2484l0464
15317G8603m3446n6373m908K5516l724k0929j156K2162j3892j6379J1524L2099
15305I097j8147j825P723j1535j8795J4261Q878n870M733J5098j0921k3116O669
15292b3750m733j2013j4748K6437M912j6616M7730K454K182K1721o551j7238o3731
$$ y = [-34430, -54636, -44223, -55240, -45409, -15437, 9131, 57530, 72458, 29146, -3611, 24366, 31610, 38658, 32457, 39511, 28487, -3264, -45679, -46935, 15732, 6481, -19568, -24869, 31010, 42978, 49176, 38117, 26761, 23858, 4310, 37349, 42589, -12323, -54628, -39573, -12648, 44277, 32918, 12378, 24866, 31349, 37164, 31363, 7371, -15649, -26417, -55757, -67631, -44941, 5441, -1847, -28475, -26364, -6458, -23994, -21922, 1358, 37353, 56583, 109067, 78603, 35157, -21216, -26124, -608, -4332, -25261, -26417, -4255, -18147, -34526, -23002, 9097, -9050, -10875, -3152, -14687, -33482, -19221, -10343, -16213, -11480, 3618, -7303, -30419, -23750, -28483, -40496, -55244, -28807, -23895, -40511, 7219, 9673, 11855, 33576, 27025, 9787, -53944]
15279e3944o2493Q796q674k1722K825M7315M1947Q111N927J7436J6643N733j7099
15266i199O160J0530J891L1981Q210m9319k2121N695Q309K1755o564m1962J3174
15253b1460j2666l2058J7951K9137R31K1475j3451k362K2485p809j4020k3247
15241c5094m3004K5914M0920j836j8111k5999j6066M4405Q858Q263p521k0868
15229d0139R15N7334j2457l3138j2618k5839r414L6245K2999k595l4245J8476
15217c4476L7747N0573M173j0062l737j6531n106j3923j2417j7315j0494J5428
15205a6140j9726j2322L3804P048l7241K9942O355L3482l2816m2689K5252J3851
15193a1200m590Q520Q729j1529J6730L3765L4937k4816k1190J4470J6880j5093
$$ y = [-53944, -116437, -107641, -116315, -138037, -135212, -87897, -45950, -37839, -31912, -14476, 2167, 7900, -9199, -3039, 7491, 9382, 41363, 49573, 254, -21867, -16172, -7863, 13892, 7328, -34634, -21460, -34126, -66184, -48233, -19096, -18165, 3310, -10141, -12503, 9982, 2173, -11847, -35094, -78098, -52184, -11264, -13100, -31211, -57210, -73276, -28871, -20013, -11750, -19271, -40139, -39224, 18110, 5653, -27485, -40103, -65942, -75356, -39111, -16112, -18707, -52952, -34476, 3271, 53844, 58017, 47955, 44218, 27687, 22581, 8658, -3759, -21074, -31568, -16140, -35866, -48188, -14384, -7336, -44577, -14635, -8280, 25202, -7614, -50303, -25051, -11200, -15790, -7270, 1459, -10070, 6660, 40425, 75362, 50546, 29356, 43826, 60706, 45613]
15181D5613k2192j5764j0653K4056N285q392m0679l1668J9396j3101l019J360
15169d9758R397j082J9140J6790j0017k8141k6588L4882O6292r338k1240j8286
15157a7949j2359M0303j393j6571p210K9377N832r487o057m6063J715K6265j882
15144a5479q781j2025J1206L0756J442M090M809j7491m014m374j1734m544j5225
15131d1364l3295K0495N66N600Q51K6989L4561J6371M814J1402j4034j9309q51
15118A2796j7147n402L975K4789L0412P790O80M257k3790Q306L84m4795n0714
15105d8459O678p993K090K1933L3491k3102j1246k2444j756K8853k0925P126L1120
15092d634N480J6204L1911q072O608j6001k3156K535k5357j8227p329k7705o622
$$ y = [45613, 23421, 7657, -2996, 21060, 26345, 17953, -22726, -54394, -34998, -48099, -51118, -49758, -40361, -41443, -22303, -5513, -15530, -43671, -70259, -35377, 30915, 21577, 337, -17949, -30308, 9995, 8602, -7969, -15179, 14198, 20030, 10543, 4486, -41577, -39862, -13597, -15479, -24260, -36285, -25079, 5677, 7119, 11209, 16018, -1473, -5487, -9861, -21595, -26139, -41364, -74659, -54164, -53598, -47998, -47147, -20158, 14403, 30774, 35588, 46990, 32956, 13647, 12796, -4351, -9753, -5778, 19011, 49423, 57213, 57893, 62150, 38360, 46666, 47050, 2255, -48459, -41781, -49774, -47684, -25751, 7740, -15362, -26608, -49052, -50808, -21955, -42880, -35754, -4634, 846, 17050, 48961, 40889, 47497, 31496, 8340, 10875, -14482, -32709, -40038, -67743, -74365]
15079g4365k568M9339m641j0627k1032J8540L8664L095j5502L804J6202m381l916
15066g388n480m8529l8133L828K9930L381L9868K7070j9825l2832M080k0950j1308
15053g6288L4354K3445j2160j3406p124K8489J0279L497M564N8203N1279m0989
15041F4143k6772k6789m5233l7027K3971J8901o656l8959j6403L8687K384n209
15029e4962o663J7404M6271M9555j2176l386j5048j1663k4235j0723O4744J9760
15017E8878J2122P091j1955j4376m5038k6788K6982n012j886J262j5216r557K1147
15004b346J2036j3095l282L038k0793J5069L3530m923K1834K0108m7765j0372
14992C039K4236j2864L288K3696m841K952j1331j9175L8601k78j0129m4155m1184
$$ y = [-74365, -76933, -27594, -32235, -42862, -63894, -45354, -6690, -3595, -19097, -15293, 909, -3472, -7388, -12868, -61397, -99530, -95702, -65772, -62391, -22523, 4547, -15278, -48110, -44030, -64980, -76288, -41934, -18489, -30649, -44055, -51179, -22690, -12411, -8914, -4350, 53853, 105132, 64143, 37371, 10582, -34651, -71678, -47707, -28806, -35462, -74421, -90824, -52137, -49753, -54962, -61625, -44221, 2050, 51605, 39429, 36043, 20995, 9332, -14903, -25626, 39118, 58878, 71000, 78091, 66136, 51760, 6722, -20066, 6916, 1904, 18, 1280, -13936, -23493, -2346, 9690, -3405, -6687, -3649, -24442, -9373, 24157, 19234, 41068, 61176, 13411, 3039, 27275, 14411, 17699, 41395, 36554, 39506, 28175, 9000, 47601, 47323, 37194, -6961, -48145]
14979d8145O711R618K4434J275k6630l2472L3102L6284L2753p836n0976k2498
14967d4380L1262J5170M171k092j407l599j1659J9351j3823j459m249j382L2219
14954A8123N1379k0102o0138o7040J1618l689J1180K1265M5510j0887k3395k0215
14942d6391n1373n0139N1596L4585K8730Q843K5055K0826q024k439q768K4595
14930B7096n067l2066n0809j7535J9725K437J2567J0642j5733J9554J5721J8085
14918D617o618k0432R083m371K901P407J9761j4577l547O424l7915N784K7361
14905d122K8103J4030j1236N474J6514p813l373J1689k7458j1281M007N421K5178
14892D5133M537l2315k7997r533q738l0417M7876L2475o830l3688K8080K8440
$$ y = [-48145, -41434, -31816, -7382, -6107, -32737, -65209, -32107, 4177, 36930, 29094, -21882, -44380, -13118, 2052, 6223, 4131, 2724, -875, -12534, 6817, -7006, -8465, -12714, -14096, 18123, 69502, 49400, -10738, -77778, -66160, -69849, -58669, -37404, 8106, -2781, -26176, -46391, -97764, -147903, -96307, -61722, -32992, -24149, 906, 21732, 13708, 11269, 2501, 27096, 22029, -10037, -60846, -78381, -58656, -56219, -43652, -33010, -48743, -29189, -13468, 4617, -2001, -22433, -13350, -17721, -14820, -7413, 12348, -2229, -5776, 648, -37267, -31483, -4122, 23981, 38011, 26775, 32249, 48763, 40950, 37577, 49266, 21808, 10527, 14534, 19955, 45133, 49670, 17355, -10642, -20175, -28913, -59330, -11454, 21021, 14191, -19497, 8583, 37023]
14880C7023P424k7812o0475k2868J634K1878j492j083j9734j9976N4462L2572
14868A553j8751l985r84L3605M87k5599k1638O572P430n436M1047l602j3983R482
14854F198k1667j8629R889k5343K2501M1859N559k6145P316j5859K1162P032J475
14841A5348R685q168k1171l1427j5397M1108K3457P855K2865j2799K0330J9412
14829G1098M047j5884k9613j8849l8466n724J8470p666J4740R237k6240k347R659
14816a7538l0974K2011L7035Q528J9092M4753j2067k6480Q80j8792j9701l4545
14804b7798j6714k9206J8284P1975J7733m1744K4251J7000J2277m269l9806q179
14792f196Q179m409J6792M7177N427l7717r913J0770l1111K541J9057J8580n7934
$$ y = [37023, 44447, 16635, -43840, -66708, -65074, -43196, -44688, -45771, -65505, -85481, -31019, 1553, -17198, -21183, -22167, 11438, 11925, -13674, -35312, -28740, -21310, -26746, 14301, 10699, -3284, 6198, -15469, -34098, -24209, -49552, -27051, 14808, 20367, -5778, 1538, -14321, 6841, 13873, 15348, 25033, 16865, -4306, -35733, -51130, -10022, 13435, 21290, 44155, 31356, 51686, 71098, 75145, 59261, 29648, 10799, -27667, -33391, -14921, -22587, -7847, 1390, -24850, -27197, -17538, -48512, -26501, 10534, 19062, 38154, 82907, 70840, 44360, 45240, 26448, 6747, -27798, -44512, -73718, -55434, 16541, 34274, -7470, 16781, 33781, 46058, 41789, 1983, -6196, 1983, -2426, 14366, 61543, 66970, 29253, 19340, 30110, -1001, 1540, 20597, 39177, -18757]
14779a8757k4482L9094J8843k6775j7651J8207M3936N2747L7710J1696l4718P604
14767A07454Q571k0991j2656j981o813m824m6524m2220J3506J0031J1728J4455
14755B9736M921J0373L699k7124l8647n5492M0570L9555o651q497l7356J1800
14743c3113J3212L7288L2821K165l6607J3903Q343m90K3173R045r839n5723Q271
14730A2449J242k392K5831K769k1436j5719K4296o834n735J1977K0737J1053q915
14717D9323k9365O667J4111k0511K3815J8147l8108k9909k1844l782p763m022
14705d3241j3778M3986O0355K3331m5985k8357J6763M4491p341o907L691j0948
14693C6060L629L5460l5418l9381k6845q64n090j0073J5434l0721k8623K6799
$$ y = [-18757, -43239, -4145, 14698, -12077, -29728, -11521, 32415, 85162, 122872, 134568, 99850, 107454, 116025, 95034, 82378, 80397, 73584, 68760, 22236, -19984, -6478, 3553, 15281, 29736, 34657, 45030, 48729, 21605, -17042, -72534, -31964, 7591, 940, -7557, -44913, -33113, -19901, 17387, 50208, 52373, 15766, 29669, 38012, 37522, 60695, 69740, 59901, 4178, 12449, 13691, 11299, 37130, 39899, 18463, 2744, 27040, 20206, 14471, 26448, 47185, 58238, 49323, 19958, 26625, 40736, 20225, 44040, 62187, 24079, -5830, -27674, -31456, -39219, -43241, -57019, -13033, 47322, 70653, 24668, -3689, 13074, 57565, 50224, 43317, 47008, 36060, 39689, 75149, 39731, 350, -26495, -27359, -32449, -42522, -27088, -57809, -86432, -59633]
14681e9633J4367L0464J3564p852l177k233J541k7627K601K6277j2861k1491m2883
14668h8943L9869M9535l0774J8627L7775j9708R66J3573n5404j7107K6476L4745
14656I630j1501N570p966K39n179j1928n3712N4397P969k2100N688J1730K041
14643a5122j6276k3186O9469L8973k2257k8490m6668j6708J1386p812J5263O040
14631c5388J3087K4099M9878j3869j8943l0890n486m855M714L0036K141p790O374
14618A3108L4052L8265j1824o6221k4008M356j2154K595N3376r402Q96J8378l952
14605C7465J6035q944K0509N31j8269j4196J2710k8492J4807j969k9676j2325
14593a1814J8157j3235l581K1398j7790O367K4015K2251k6816R089k3843j0076
$$ y = [-59633, -45266, -14802, -1238, -9090, -12267, -14500, -12959, -40586, -37985, -11708, -24569, -46060, -88943, -49074, 461, -30313, -11686, 26089, 6381, 7347, 20920, -34484, -51591, -25115, 9630, -1871, 3699, -4267, -4028, -9207, -21135, -74847, -20450, -12481, -34581, -28893, -17163, -15122, -31398, -54584, 14885, 53858, 31601, 3111, -43557, -60265, -48879, -56691, -41428, -35388, -22301, 1798, 51676, 37807, 18864, -12026, -17512, -22367, -17653, 12383, 14524, 6734, 13108, 47160, 85425, 73601, 7380, -16628, -12272, -24426, -21831, 31545, 22143, 23039, 41417, 37465, 53500, 44556, 65065, 65596, 47327, 33131, 45841, 17349, 32156, 30187, 511, -11814, 6343, -6892, -10473, 10925, -6865, -498, 23517, 45768, 18952, 28041, 4198, -5878]
14581e878J7244P444K862k5137k1563J9529J8453k199K5598J5325k424m751n358
14568C9145L60J6554J1032l1838j3367N85K0953K5416K4724P403r077k6184k2066
14555D3640j689k3534q21j625j7104k992k3205J2532L4074O66L689M0353j3840
14542E0144n3248n82K8790M153j0312m9394N602k5174M626L6340j005J4982j3559
14529h637R272J6373p084m412j2345n9612l5834o554J8166L5594N1576N215N448
14516G166j1308J0754K3095j2726j1235N849p29J1524m43Q164j1536k2834J6011
14503A1752K1686j9963Q196L8429k6256j8970l2778k4468k7039L6534L6278J3074
14491A6475k870m586l9334O065K7053M6822j0575n7218r274M0500R838k0246j2761
$$ y = [-5878, 11366, 18810, 21672, -3465, -25028, -5499, 12954, 10755, 36353, 51678, 49254, 44503, 39145, 39505, 56059, 67091, 35253, 21886, 22471, 43424, 68840, 93564, 100967, 91890, 65706, 43640, 41951, 18417, 17596, 15971, -1133, -4125, -27330, -14798, 19276, 19942, 23631, 63984, 50144, -3104, -3686, 25104, 29257, 18945, -30449, -24847, -50021, -45395, -9055, -10060, 4922, -8637, 635, 17008, 9924, 5512, -6833, -66445, -102279, -108833, -90667, -55073, -3497, 1718, 7166, -4142, 6612, 29707, 16981, 5746, 11595, 10866, 22390, 21947, 30111, 18575, -4259, 11752, 33438, 13475, 21671, 60100, 33844, 14874, -17904, -42372, -69411, -32877, 3401, 16475, 13605, 9019, -30315, -24250, 2803, 49625, 39050, -18168, -27442, 13058, 22896, 2650, -10111]
14478a0111n456l0369k9532J8147J3080P627J9405Q214m068J1948J9528K3066
14466D1479J0719k0895K7666K4413k4279J4355L2478M1598k5030m2669n5400k097
14454B2338R037k94J2621r922j5416p468L5K4008K2221r227j4528l967k2420M141
14440A1159L3224K7721l1586j5626K612l619j7056k9744J5502N8965o29q2101
14428c1178R625K0338K997J7859J8754j5134l5709J4669j7745M052M7602j0001
14416B6129m417M823l20K8929O031k298l1387k3987m063R281K7294q899J0939
14403C8055K8527m4689k2019l08J9225n3804q529j0503K6624N3330L3178m05j4946
14390D3736j5569n749R62J9376O756j1678n0516k3303M468M837K1263M2235K3179
$$ y = [-10111, -15567, -45936, -75468, -57321, -44241, -36614, -17209, -8995, -13063, -1115, 18413, 41479, 52198, 31303, 58969, 83382, 59103, 73458, 105936, 147534, 122504, 79835, 24435, 22338, 31375, 31081, 43702, 33780, 18364, 10896, 10931, 34939, 57160, 47933, 33405, 29438, 7018, 11159, 44383, 72104, 40518, 24892, 27504, 23885, 6829, -22915, -7413, 51552, 50923, -31178, -21553, -1215, 1782, 19641, 38395, 23261, -12448, 2221, -15524, -11472, 36130, 26129, 21712, 26535, 26215, 55144, 61175, 58877, 27490, 3503, -560, 8721, 36015, 27116, 38055, 66582, 21893, -126, -434, 18791, -35013, -43542, -54045, -27421, 25909, 59087, 58682, 43736, 28167, 22418, 23380, 42756, 49512, 37834, -12682, -35985, -31517, -26680, -5417, 36818, 59997]
14377E9997l381l3453j4581j2752j449O0037J2488q441q831l2841J7081M0605
14365G4479l10j6984J308l2363k1303k4301p318J1066L8304n004j6630P980q043
14352H81K154L170j7697l0178J7619M7414L2440j7129k3671l0175l211J294J7388
14339B99J4422j8404l6696R892J8627J4079K5211K8932J256j1769J0548J560J2758
14326G0715J1261q950n965k9681l9620j4879n241K6451N1390k6960j6395m924
14314G202j9679K8183N5089o597m1332l695N1960J3479j385J3192K1505k6856
14302I1066K644n7963n3660j2040J0900J1113j4739J8171M4054r0q493m939J0945
14289C6969K3950m363r898J3616j4684j6146K249j549r116M749l684k3315J428
$$ y = [59997, 56616, 23163, 8582, -4170, -5619, 54418, 66906, 58465, 49634, 16793, 33874, 74479, 74169, 57185, 58493, 26130, 4827, -19474, -26792, -15726, 22578, 17574, 944, 8924, 881, 3035, 6205, -11492, -41670, -24051, 23363, 55803, 38674, 15003, -15172, -18383, -17089, 299, 14721, -3683, -40379, -30487, -11860, 2219, 27430, 56362, 57618, 45849, 56397, 57957, 70715, 81976, 73026, 67061, 37380, -2240, -17119, -22360, 4091, 55481, 28521, 12126, 7202, -12477, 15706, 70795, 64198, 22866, 19171, 71131, 84610, 83225, 96417, 117922, 91066, 93710, 35747, -17913, -29953, -19053, -7940, -22679, -4508, 39546, 39456, 30963, 26024, 36969, 60919, 56556, 46658, 60274, 45590, 29444, 31693, 30144, 21028, 25777, 22093, -1222, 206]
14276B06j0474j0950k1383L4872K1335L563M935J509J1254J1670k2545n12M430
14263B7910k3342R903J8136Q769P067J1677R868J6593J8277K4257o5109m3014
14251B0992k5374p582Q032K7396k3833o196K8N823p179K702L685Q507L4563R153
14237E0717j2736J4371m8178M668M1647m3860l6652o214k8660n325j6566J33K822
14224h3833L6425O7808K1970j3374m7658q940L4764M1434l716J5641m5705k189
14212A2627M6148L7255K261n3447m4674l9848K9770O7255N971k0084m830l0744
14200G660N455p373j3234p606n343j3390K2788k1538j3276J6555o829J3879M304
14187a7948j9174L8410K5523J0596k2786k7642K0359M4683K287k1567Q638j370
$$ y = [206, -10268, -21218, -42601, -7729, 13606, 17169, 22104, 23613, 34867, 46537, 23992, 23480, 27910, 4568, 14471, 32607, 41376, 48443, 60120, 69988, 86581, 104858, 129115, 64006, 20992, -4382, -11964, -3932, 23464, -369, -6565, -6537, -714, -7893, -5191, -1506, 7001, 41564, 50717, 37981, 52352, 4174, 8842, 50489, 6629, -30023, -36237, -64897, -70222, -86788, -86655, -83833, -47408, 20400, 42370, 28996, -18662, -27602, 7162, 48596, 44880, 60521, 14816, 12627, 58775, 96030, 98291, 44844, 170, -39678, -9908, 57347, 63318, 43234, 38404, 7660, 13115, 5742, -7492, -15098, -20441, -33831, -11043, -32581, -45857, -29302, -36131, -22252, -17948, -37122, 1288, 26811, 37407, 14621, -13021, 7338, 52021, 54308, 32741, 41379, 40009]
14175D0009l0329j8786k145K8556L4135R66j9407o2104K1524L6417J9244O534
14163E4614Q386l0646j2350j3050l5765k6274M8950k14K8967J9091m892j3757
14151B3060j6631k5343k1435n88J5526N8476K9675j9645k1140J3083K9065k1501
14139D2602m8201J5758J939J486K7788J3601j0711m501P018J8447N394j4879k0823
14126C4918j712J8075k1266k4288k2163K5126L4711l2526k1553J7668L4422o645
14114C4767L5997M5410l4266p6327m3193M5641P8420K2519K281m916J018l6687
14102G0664j0006N612J4868j5416o1843l8728P889L5619n368K0142J1749j651
14090C3531o980k593k068L2946K3600j9221R338M0003k4468o1745j985M723m3619
$$ y = [40009, 9680, -9106, -11251, 17305, 51440, 52406, 32999, -29105, -7581, 28836, 48080, 54614, 63000, 32354, 20004, 6954, -28811, -55085, -6135, -6349, 22618, 41709, 36817, 23060, 6429, -18914, -40349, -40937, -25411, 33065, 62740, 43095, 21955, 35038, 64103, 42602, -5599, 10159, 12098, 13584, 41372, 54973, 44262, 39761, 46779, 65226, 70620, 55741, 34918, 33206, 51281, 30015, 5727, -16436, 8690, 43401, 10875, -10678, 6990, 41412, 34767, 70764, 116174, 81908, 5581, -37612, 8029, 86449, 108968, 111249, 106333, 107351, 70664, 60658, 66270, 81138, 65722, 3879, -34849, -26960, 8659, 3291, 23433, 35182, 33531, 26551, 23958, 21890, 54836, 78436, 59215, 68553, 108556, 84088, 22343, 20358, 25081, -18538]
14077a8538L909R654j972l560k7793q440L8653M1219r263j8760j8123K4673L6128
14064D7787p402o7253n0355K440P5091M3064O265k1582j4368J3362l9520j4598
14052b7069M0801K3123j3810K8259j5772l4005M508K3440l244r060k612j1292
14040C267m003M072O886M441J1589j4324K0584L1998q367l8765j0241r702J6493
14027A3928q173L8570j4828j6615K2273m321k0979J5408M6880K5264l2379n1454
14015A3574J2069J1336j3027J6341P778J0197k836m9971k083p59R462l637K7696
14002C6140K7027K4838N212m6482k0765K0675Q487L850j0616j0374m402Q676K3220
13989F5486K4949k1871m4433N241M324M2913m698N49l988J7615L172l0597L019
$$ y = [-18538, -14629, -4975, -6947, -10507, -38300, -46740, -8087, 33132, 23869, 5109, -13014, 11659, 47787, 40385, -26868, -77223, -74783, 308, 43372, 49637, 28055, 13687, 27049, -12471, -27069, 13732, 36855, 23045, 51304, 35532, 1527, 6035, 29475, 26231, 17171, 14559, 3267, -736, 3336, 10222, 14663, 26252, 11928, 32512, 64510, 56143, 17378, 7137, -2565, 13928, 5755, 44325, 29497, 12882, 35155, 30834, 9855, 25263, 72143, 97407, 65028, 13574, 25643, 36979, 23952, 40293, 48071, 58268, 55432, 5461, 3378, 2619, 12081, 8444, 36140, 63167, 88005, 93217, 46735, 25970, 46645, 55132, 58982, 48366, 37992, 33590, 42266, 65486, 90435, 68564, 24131, 29372, 33696, 76609, 71911, 72460, 68472, 86087, 89259, 58662, 61681]
13976F1681K5578o347J6322j3309m4406o0502j1350O335j4428J0930K7501j780
13964c775L3097M7883N108l4935j6752k302j429j0280L4156K8353l3907j9285
13952B5932j5709Q903r523k4875K2024N667J075j7647J2871l458K7203N3252J072
13939H6787l6451l1404n703K0956l661l7275r397K6597K2298R60K6610K7257j8027
13926F9547j6234r487J8408j1498L29M0J1826n341k3848M333M8298j6997l19M893
13912G3950K4683K0638k2209m0128M207K2760P58O742k1844l0635j5203O02J6083
13899D0404Q069J6632M517k1577k7098j7175j4489k6351N087J7301J7922j2684
13887i442Q174K6364o282j504J6544K9931n1536l2124Q52n060l0199N1071R949
$$ y = [61681, 87259, 80912, 97234, 83925, 39519, -20983, -32333, -25998, -40426, -29496, -1995, -3775, 29322, 77205, 82313, 47378, 30626, 28324, 26895, 16615, 50771, 79124, 45217, 25932, 10223, 19126, 9603, -15272, 6752, 12419, 13494, -4153, 8718, 5260, 32463, 85715, 86787, 50336, 18932, 13229, 34185, 30524, -6751, -16148, 10449, 32747, 33707, 60317, 87574, 69547, 53313, 43826, 62234, 50736, 51065, 51105, 62931, 57590, 33742, 38075, 86373, 69376, 69057, 73950, 98633, 119271, 97062, 56934, 61141, 83901, 84659, 91401, 69557, 38922, 23719, 24321, 40404, 48473, 65105, 69622, 48045, 20947, 3772, -10717, -37068, -31981, -14680, 3242, -9442, -1268, 25096, 18814, 17310, 33854, 63785, 12249, -19875, -19023, -24083, -54282, -3211, 6738]
13874F738M066j2855p973m388N2793M0513k4320k8834m4081Q591q827J4829K1501
13861A7753k1139M8897o015J1365P652N709q123q08k3630n062k3660J4602J6265
13848C3806N7261P398l3670j5608L1486j2878l8750j9k4847j0050R473o388Q739
13835E953n095K7454M0918j6456m783Q890Q617j6085n345N0649J8281j3314q250
13822I1434l8868Q313N2351o706l6635j0026k5322K6385L3313j7780R956j0548
13810G5867j3525k0608L0108K6254J8006M220J6423k5979J336m857R553k7830
13798H8968l0409K2950l89R8L5478J0385r629j3089k4875l5437j0056K7221j426
13785E9790k3428J032k8947o964J4760j0539l0167p135n311Q013K564K1728L1388
$$ y = [6738, 10804, -2051, -10024, -14412, 38381, 78894, 54574, 25740, -18341, -9750, -18577, -3748, 17753, -3386, 45511, 39496, 50861, 58513, 64222, 56099, 55291, 31661, 26599, 2939, 17541, 33806, 91067, 98465, 64795, 49187, 80673, 67795, 29045, 29026, 4179, -5871, 3602, -2786, 5953, 858, 28312, 69230, 52774, 47991, 56881, 65498, 49413, 44068, 94717, 112998, 99684, 91434, 52566, 60879, 113230, 106524, 69889, 59863, 34541, 60926, 94239, 76459, 86415, 75867, 62342, 41734, 71842, 98096, 116102, 120322, 136745, 110766, 112102, 107245, 116798, 88968, 58559, 81509, 81120, 81218, 116696, 127081, 117452, 104363, 79488, 44051, 33995, 61216, 59790, 36362, 37394, 8447, 1483, 16243, 5704, -24463, -31598, -36909, -28896, -26332, -4604, 26784]
13772B6784L2789K0968K7j5291j4302k0969J064L0488j5816K312L0700j7081J7096
13759G8769K2778Q402j3489l4261j4277j1491l6133J0596J4097k195J7443J5955
13747E6194L60r709M255j4636K5178J0302J2151K6949J929j1945k4294K2677j5928
13734H3483j5807K9240p012m66j3868k2120L776n982k3985j3867j5627m441K9848
13721B3172k1026J9378L554k0884K1786L2263k8677J3544J5645K5739L97n210
13709G9681m6957l0977J0503l435J3106K0012j1987p223n152k7174r510J8008
13697a105J3749R213M5360K0587K6770J6827l3145o5865k6451r503k1941K0991
13685d513j1323L833q933L3916n470j9502L2696J5314k3046L9204Q998J9355j0882
$$ y = [26784, 59573, 80541, 80568, 65277, 50975, 30006, 31070, 61558, 45742, 48054, 78754, 61673, 78769, 101547, 109949, 96460, 62199, 47922, 36431, 298, 10894, 24991, 22796, 40239, 56194, 56554, 46845, 51100, 36464, 61642, 71944, 84095, 111044, 112973, 101028, 76734, 99411, 83483, 67676, 96916, 89904, 89438, 75570, 53450, 57226, 51244, 27259, 13392, -2235, -6676, 23172, 2146, 21524, 25078, 4194, 25980, 58243, 29566, 43110, 58755, 84494, 84891, 79681, 32724, 1747, 12250, 8815, 21921, 41933, 29946, 22723, 17571, -9603, -19113, -1105, 12644, 21857, 67217, 87804, 114574, 131401, 98256, 32391, 5940, -3563, -25504, -4513, -15836, -12003, -20936, 12980, 7510, -11992, 20704, 36018, 12972, 52176, 61174, 80529, 69647]
13672F9647j1074m3249j3552l664j1287Q982J6598N0982K4034l5801j3787M1218
13660G9047k074P712r831R2k3074J2991j1267J865l5214j5595K2650M0709M234
13647G2245j8884R368k6844O903J3318k7253k3534O837O46k515j8648O461K7238
13634B5338K0225L1551M4027l4764n8896J000K4933M494J1396M443n353K0338
13622H8732l5030k2041L7860L0803j5117n386l1028l9533K0646J1022j423J6715
13610E6220J2905J7518j9183j5533j1407o571k559J0651j9591J6385J8786R568
13598F7189j4452m897K3511J4827K9902J6450j5092j4683k7147K6316k0608o303
13586G5013J3170K8529j4145l8577J8487r505n837j725O702L6648k6714l7453
$$ y = [69647, 58573, 15324, 1772, -1892, -13179, -4197, 12401, 63383, 87417, 51616, 37829, 79047, 76973, 84685, 74854, 74946, 51872, 64863, 53596, 55461, 20247, 4652, 27302, 68011, 72245, 53361, 62729, 35885, 42788, 56106, 28853, 5319, 12156, 12802, 10287, -8361, -1900, 25338, 45563, 77114, 121141, 86377, 27481, 28481, 53414, 57908, 69304, 73747, 68394, 88732, 53702, 31661, 69521, 100324, 85207, 79821, 48793, 9260, 29906, 40928, 39505, 56220, 69125, 86643, 67460, 51927, 40520, 33949, 31390, 42041, 22450, 38835, 57621, 67189, 52737, 47840, 71351, 86178, 116080, 132530, 117438, 102755, 75608, 101924, 81316, 75013, 88183, 116712, 102567, 63990, 82477, 72972, 67135, 65410, 72112, 108760, 82046, 44593]
13574D4593m2946k0997O78K6968M409P146K4J4386j9959k3278j3804Q25P853N741
13560h361L6905K5662P615n548K178q612K829J9196L7689R950j5066J5633J4771
13547A34841l0924l1735j342K8186n942l4847J5850J9780K484j6186l7650m3128
13535f13K7362P96O379R006K0891M0820l2598l7163l8384L4064N0840R016J0891
13522A01307k1881L245K3997L4915l4329l6684q047J2823J5295L5853j202q846
13510A16446J9133k158m4421J0408K7100q649j2839j719l7876K7688L5130l2503
13498I5740o437q802k3504j1364k164K6520M4102n887k749L144k76l587j1902
13485I2834o736J5898m816k6973j8371m862L797k0141k1024o720J3005L2394K5697
$$ y = [44593, 1647, -19350, -18672, 8296, 12705, 19851, 19875, 34261, 14302, -8976, -22780, -21955, -14102, -8361, 28544, 54206, 61821, 56273, 58451, 49839, 52668, 71864, 109553, 119503, 104437, 120070, 134841, 103917, 72182, 70840, 99026, 93084, 58237, 74087, 93867, 96351, 80165, 42515, -613, 26749, 27545, 33924, 42930, 63821, 104641, 72043, 34880, -3504, 30560, 81400, 90416, 101307, 79426, 82671, 106668, 141583, 107254, 70570, 62523, 75346, 90641, 126494, 125292, 116446, 135579, 133421, 89000, 99408, 126508, 117859, 105020, 103301, 65425, 93113, 128243, 95740, 89303, 80501, 56997, 45633, 43469, 69989, 114091, 108204, 105455, 108599, 108323, 104736, 92834, 86098, 101996, 97180, 70207, 51836, 46974, 50771, 30630, 9606, 2886, 15891, 48285, 73982]
13472G3982j1194k6440J8633K9459P565k9953n218j304J15k8024L1326K2787J2439
13459I4173K8509N45m321k7835j6670N7753K1319m0017l1426j8458k8546j5893
13447A9133N2211K5556k6749k0858r33L9865K9086J9413k3748k5334p686J4425
13435I4381l879p184j1794K2884M5501k239l7358k5906N929L893j3214k1669K1973
13422G1318L1572j6609l8356J3739J7902l976m923j0383J557J3646j2633K290
13410F5144q982N745J7254k6205P313l964j3705j8860J432O261m359P900k749
13397C2225k683R066L9646K6151m050j9626n520j2911l0755j3227J1824N477n525
13384C0092L429p963R115R014j8967K964M1638j3904l598N9133J8741j2424l600
$$ y = [73982, 62788, 36348, 54981, 84440, 92005, 62052, 56834, 55530, 55645, 27621, 58947, 81734, 94173, 122682, 123227, 118906, 91071, 74401, 132154, 153473, 113456, 82030, 63572, 35026, 19133, 71344, 96900, 70151, 49293, 48360, 88225, 117311, 136724, 112976, 87642, 79956, 94381, 90502, 83318, 71524, 94408, 139909, 137670, 100312, 74406, 80335, 84228, 71014, 49345, 71318, 102890, 86281, 47925, 61664, 79566, 75590, 70667, 60284, 61841, 75487, 62854, 65144, 56162, 61907, 79161, 52956, 60269, 56305, 42600, 23740, 25172, 31433, 27074, 34974, 32225, 29542, 38608, 78254, 104405, 100355, 80729, 75209, 62298, 31543, 18316, 30140, 35617, 30092, 33521, 25558, 34673, 43687, 24720, 27684, 69322, 55418, 51820, 110953, 129694, 117270, 113670]
13371A13670q303P638J4316K5044j202M915l428k4221Q777O440j4932j5587N604
13358A18731K677m4338k5151l3180Q799K5128M4009J0471l4660j1330J8065J8969
13346I8190j5925Q702L0260l9874l7738m785K4780n385M4510M2869J2571r461
13334A48714k4460j3590K8135K6199j0675n1092j4087l0712j376K8802K4039n008
13322A04889R287j8497m1377p577k0555l8493J4792J2500J8024J8004J8817M2799
13310A12613M700k7149m3134K6558M7266L5535l8371r917p202L220m212P983j8741
13297H9149J4138J2322O14k0043J0699J1183m035k3629m1026r236J1833L1931
13285H3900l5742j0342N3686j6462n6335r656K9399J9972m749K3621K8754k7223
$$ y = [113670, 105367, 113005, 127321, 152365, 151163, 156078, 152650, 128429, 137206, 143646, 128714, 113127, 118731, 121408, 77070, 51919, 18739, 27538, 52666, 96675, 107146, 72486, 61156, 79221, 98190, 82265, 90967, 121227, 81353, 43615, 38830, 63610, 58225, 102735, 145604, 158175, 148714, 124254, 110664, 138799, 164998, 154323, 103231, 89144, 58432, 57056, 85858, 109897, 104889, 114176, 95679, 54302, 46725, 26170, -12323, 2469, 14969, 32993, 50997, 69814, 112613, 117313, 90164, 47030, 73588, 120854, 156389, 118018, 108101, 100899, 104119, 99907, 107890, 89149, 103287, 115609, 116223, 96180, 106879, 118062, 114027, 90398, 49372, 40136, 51969, 83900, 48158, 37816, 91502, 75040, 18705, 9049, 38448, 58420, 53671, 77292, 106046, 78823]
13273G8823n197R71J1293K0877k570j7648j6748j3873K9909M9933N951l4828k0157
13260H6736j0P628k2433R622L8510j253k5686j6512K4086P993j7134J3204j5303
13247H9448j7161J2098J9284j941k3183k5191l877L8287N000p463L2580n928p4253
13234C7700l661M9804J2802j8778n230j0098J0883k5905o462K0625K9503j7929
13222G3254L587j6853r203M1950L9902l5907n4585J875K9717J4908j8740K078
13210G1983J2915P282l809r731J7191J5270k680L2436L6934j3677k2234k3929
13198A17951j820J0587l6399j0599j318K1291L289K61p914j3090j2793J1647K5626
13185A06719l230k0271N652P679K3090K4668R309p249k6486j5701q418L2469M2569
$$ y = [78823, 73626, 74597, 85890, 106767, 104197, 86549, 69801, 55928, 85837, 135770, 141721, 106893, 86736, 86726, 94354, 71921, 81543, 120053, 118800, 93114, 76602, 100688, 108681, 91547, 104751, 89448, 72287, 84385, 103669, 101728, 78545, 53354, 49477, 87764, 92764, 85301, 117881, 111953, 37700, 34039, 83843, 96645, 77867, 72637, 62539, 73422, 47517, 41055, 61680, 91183, 73254, 76841, 59988, 50785, 92735, 132637, 96730, 42145, 44020, 73737, 88645, 69905, 71983, 84898, 92180, 88371, 78640, 95831, 111101, 108421, 140857, 177791, 164114, 141880, 117951, 116131, 126718, 90319, 79720, 78402, 99693, 102982, 103243, 95329, 82239, 69446, 81093, 106719, 103489, 83218, 88870, 96549, 119639, 144307, 153616, 146367, 119881, 104180, 95762, 128231, 170800]
13172A70800K5110l3384l6347l317J4088j2191j0810m2775J0885L9912N3249j3574
13160A61646m182P089L387p797k4368k6910k472J4483N2502K1191o421m8037l8808
13147A01303M2203K465R260k4093J6101M278L06L8138j10m3304j4195l993j7334
13134A11025l8803K2563R362J3043P913n421q419n2612Q288k3K956P579L2690
13121A10141J2903J1780j1820J0717N269J2785J4110k0506K7091k6409L465n218
13109A44308J7118J8776l6396j2382l788J322K2541k2k2000k6316J485k9467k6640
13096D8539M010N1034O3286j721k8834m441O985K5015L761m4976k443J3182q453
13083A24944J5724l1967J0130K2133J7737M0805K8534n099J2309k9377j5230k1464
$$ y = [170800, 195910, 162526, 126179, 122862, 136950, 124759, 113949, 71174, 82059, 121971, 175220, 161646, 157464, 164553, 167940, 160143, 135775, 108865, 106393, 120876, 173378, 194569, 188148, 140111, 101303, 143506, 145971, 155231, 131138, 147239, 151517, 151823, 189961, 189851, 146547, 132352, 128359, 111025, 72222, 94785, 104147, 117190, 125103, 119682, 111263, 58651, 66939, 66916, 69872, 77451, 110141, 123044, 134824, 123004, 133721, 138990, 151775, 165885, 145379, 172470, 146061, 149526, 144308, 161426, 180202, 143806, 131424, 127636, 128958, 151499, 151477, 129477, 103161, 104646, 75179, 48539, 52549, 103583, 166869, 165148, 136314, 131873, 138858, 163873, 167634, 122658, 120215, 133397, 124944, 140668, 108701, 118831, 140964, 158701, 199506, 228040, 222941, 235250, 205873, 190643, 169179]
13071A69179K901j8598m2524j466K570L0141J4043K051o686j0928j8389j8165
13059A04129N179N1599K0489J7595k161r761j1022l2322K746K6196J5011p71k990
13046A83917K1022m973j2639l9297j125O360m0975n242N5839K8056m5632k3693
13034A21618N446M3840L2315q873j728j6153J2666J2667O540J9077k7467k1111
13022A78837O56n880L005K2320K5231l157r369k1262r186L4390J3164m3259j3143
13009A72347L8401j0923l650K4485L018p183j4399k3860m296M1914J8802K0149
12997B54805l373M392l716n860J926L110P77j2108K0097Q248m190J4538L6063
12984C14709R708k8190L9375L5868l3026n519J7345L8177L0478M4568L3964J8876
$$ y = [169179, 172080, 153482, 110958, 109492, 112062, 142203, 156246, 158297, 151611, 140683, 122294, 104129, 109308, 160907, 181396, 198991, 196830, 187069, 176047, 143725, 146471, 172667, 187678, 186907, 183917, 204939, 199966, 187327, 148030, 146905, 153265, 112290, 107048, 162887, 190943, 145311, 121618, 127064, 170904, 203219, 194346, 192618, 176465, 189131, 201798, 208338, 227415, 199948, 178837, 179493, 173613, 176618, 198938, 224169, 221012, 211643, 190381, 181195, 215585, 228749, 185490, 172347, 210748, 199825, 196175, 220660, 223678, 216495, 202096, 178236, 173940, 215854, 234656, 254805, 251432, 255824, 252108, 246248, 248174, 251284, 252061, 239953, 260050, 268298, 264108, 278646, 314709, 324417, 296227, 335602, 371470, 338444, 332925, 350270, 388447, 418925, 463493, 497457, 516333]
12972E16333K3889L5885O4966P0957M5011J01996J11037P0361O3403L2776k5681
12961A110933n0016p9343r2943p4709o5111l4630r4329k7029K5175O3595J7905
12950F99498J9512K6361L4233O5463J7711p232O3719M4546J8831L2443R600k9889
12938I94796M7499N4787O0105K5914L97R777j2394m0187m9550l6532n3227o8325
12926I33060k0609p2442j4554l8002k0549j7348l951j4806n2146m1676k1325j994
12914F13658j8491J1243L1539P779P1640Q7674L8254O636L1906M1974M6336L5208
12902A005356m9284p5941j30766r6958j12707r1105m2409k1861l1390J631m5166
12891C09400k9930L811K5300M1032r513l0655k9529m1436P747J2154K27n418k294
$$ y = [516333, 540222, 576107, 641073, 712030, 757041, 859037, 970074, 1040435, 1103838, 1136614, 1110933, 1060917, 981574, 888631, 813922, 748811, 714181, 619852, 592823, 617998, 681593, 699498, 719010, 745371, 779604, 845067, 862778, 855546, 919265, 963811, 982642, 1015085, 1024685, 994796, 1042295, 1097082, 1157187, 1183101, 1183498, 1193275, 1180881, 1140694, 1091144, 1054612, 1001385, 933060, 912451, 840009, 825455, 787453, 766904, 749556, 745605, 730799, 678653, 636977, 615652, 613658, 595167, 606410, 637949, 645728, 717368, 805042, 843296, 849932, 881838, 923812, 970148, 1005356, 956072, 880131, 749365, 652407, 539700, 448595, 406186, 384325, 352935, 354566, 309400, 279470, 283281, 308581, 349613, 340100, 309445, 279916, 238480, 246227, 258381, 258608, 253190, 250896]
12878B50896j9972L5464J8553o934k5117l1114L870K0707l4917k6697o162N600
12866A84177J7279K092L5839j387k5678k4692l807J7451k9235l661L4798N932
12854B09108J4242j5441k1970k5242J7949j5768J8889r810j3483L1407L3349O271
12842B29501L153r602o703n960l174j5224J9026J5388K5279L0863J4729R806J3255
12829C20337J101j8419M2671l528l3996j9585j0210k6485j6738m4674j0508K1554
12817B01520R705Q465N2449r686j0036M7029p65l0024J4714O414k3859O488K8533
12804C00947J5520M58l8667l2887k7169J7423N6738J3180P972J8097J6782j4974
12792C33420K301J6839M972l545r140k8599J5491k1122j4444K111K011j2280j7181
$$ y = [250896, 230924, 266388, 284941, 278007, 252890, 221776, 225646, 246353, 211436, 184739, 178577, 184177, 201456, 203548, 239387, 238000, 212322, 187630, 183823, 201274, 172039, 168378, 203176, 209108, 223350, 207909, 185939, 160697, 178646, 162878, 181767, 171957, 158474, 189881, 223230, 229501, 232654, 223052, 216349, 210389, 207215, 191991, 211017, 226405, 251684, 282547, 297276, 307082, 320337, 321438, 303019, 345690, 342162, 308166, 288581, 278371, 251886, 235148, 190474, 179966, 201520, 211225, 219690, 272139, 262453, 252417, 299446, 298681, 268657, 283371, 289785, 265926, 272414, 300947, 316467, 316925, 278258, 245371, 218202, 235625, 292363, 305543, 313515, 331612, 348394, 333420, 335721, 352560, 357532, 353987, 344847, 316248, 331739, 310617, 296173, 298284, 300295, 288015, 270834]
12779B70834M1280O7382N180J2520K9332J1719j6242k0488N4955N1836N804J187
12767E15299k0364L139K0085M009P592m0804m0173k9289l6466M379M2711J4287
12755D44405J2964Q159j0319K5626M297k5047j1974R892J8451j3573K2344J9579
12743E04804J9464Q161j5069J9733O7713J5612l0695o891k4014k275L300j8664
12731E41179k0786M5156j583k5957J0887J6036K0718j4656m6216K1881m780o2187
12719D79692n554N5716L1039L837J085K3106l166K3374K5083l4602m3954n539
12707E50117J0024J6818J6996j8859k6193j2825l4581p573n747K9846j4516n1209
12695D52298k8949K5567L3023J5487L9289l5977l8383R747J2701j0895J6441J6913
$$ y = [270834, 312114, 379496, 384676, 397196, 426528, 438247, 422005, 401517, 456472, 508308, 514112, 515299, 494935, 498074, 518159, 522168, 529760, 488956, 448783, 419494, 383028, 387407, 430118, 444405, 457369, 465528, 455209, 480835, 485132, 460085, 448111, 458003, 476454, 462881, 485225, 504804, 524268, 532429, 517360, 537093, 604806, 620418, 589723, 582832, 558818, 556543, 559843, 541179, 520393, 565549, 563966, 538009, 548896, 564932, 585650, 570994, 524778, 546659, 541879, 479692, 474138, 529854, 560893, 564730, 565815, 588921, 585755, 609129, 634212, 599610, 555656, 550117, 560141, 576959, 593955, 575096, 548903, 536078, 501497, 493924, 488177, 518023, 503507, 452298, 423349, 448916, 481939, 497426, 536715, 500738, 462355, 472102, 484803, 473908, 490349, 507262]
12683E07262J9967M136K8498o1378m096R966l1001O326J1055K617L7987J6694
12671E48033J1568Q300o54j2756j1965K6942K73Q467l6703m0931K490l2L8800
12658E41832N6318j1462j0132l008K1608J9989K0828K8762P774J9629r402m2894
12646F39842n1701j2369j5702o925R993l2707k4176m769N066J6310O3113J7724
12634F03699J9707M1668O7621R0930L9702l380L7156O1543K3268r599l9201L268
12622I36382L2462j4052n7223l958M002j1357n784J9106k5279m6697K8681O0892
12610I17175j2686j7152M9418J6686l649L9288N4645K6858P190J7731P2355O2771
12598A230630N6621O7325P3638P9567N3224Q5840M3927l945N0220M9697L1663
$$ y = [507262, 527229, 531365, 559863, 498485, 494389, 504355, 473354, 479680, 490735, 493352, 531339, 548033, 559601, 567901, 567247, 554491, 542526, 569468, 569741, 578208, 541505, 500574, 503064, 503032, 541832, 598150, 586688, 576556, 573548, 595156, 615145, 635973, 664735, 672509, 692138, 682736, 639842, 588141, 575772, 560070, 553145, 563138, 530431, 506255, 501486, 506552, 522862, 585975, 603699, 623406, 665074, 732695, 823625, 863327, 859947, 897103, 958646, 981914, 972315, 933114, 936382, 968844, 954792, 897569, 893611, 897613, 886256, 880472, 899578, 874299, 827602, 856283, 917175, 904489, 887337, 936755, 953441, 949792, 989080, 1043725, 1070583, 1077773, 1095504, 1167859, 1230630, 1287251, 1354576, 1428214, 1507781, 1561005, 1646845, 1690772, 1686827, 1737047, 1786744, 1818407]
12587A818407P0895P5620P1091N2735K3888N1165L8524O8329Q7496J11976J52625
12576B622751J59552J71520J82378J93027J77260J66311J44482K25525K42246
12567D285052K53446K92694K85111K96781L41817L42849L29605L52938M08755
12558G189048M29336M28096M19458M57450M95983N39224N36883N21150N41752
12549A1558380O08290O25188P13292P03686P69672Q55517Q25465R09080J032695
12540A8601265J118792J170367J251726J320139J414873J559236J699624J826837
12532B9962859J946145K045190K179437K353081K611367L017375L473146M080342
12524E1668942M973376O279770P978945J0061136J2530755J5003665J7080022
$$ y = [1818407, 1889302, 1964922, 2036013, 2088748, 2112636, 2163801, 2202325, 2270654, 2358150, 2470126, 2622751, 2782303, 2953823, 3136201, 3329228, 3506488, 3672799, 3817281, 4042806, 4285052, 4538498, 4831192, 5116303, 5413084, 5754901, 6097750, 6427355, 6780293, 7189048, 7618384, 8046480, 8465938, 8923388, 9419371, 9958595, 10495478, 11016628, 11558380, 12166670, 12791858, 13505150, 14208836, 14978508, 15834025, 16659490, 17568570, 18601265, 19720057, 20890424, 22142150, 23462289, 24877162, 26436398, 28136022, 29962859, 31909004, 33954194, 36133631, 38486712, 41098079, 44115454, 47588600, 51668942, 56642318, 62922088, 70901033, 80962169, 93492924, 108496589, 125576611]
12517A25576611J8075732J7357049J4499395R577192K476428o068662j3922729
12510A67571016j8381949j8545747j5696485j1613622p660926m337302j648547
12503H9686438M41764K073629L520664M693819N685421O527459P110814P523838
12495A27263846P813513P971896Q002895Q012907P950022P724734P173914O336871
12487A88250598N049836L380113J398744p60251k967184m960118o556925p827160
12479A75007653q518418q863535q821241q547972q233328p849061p444533p064185
12471A09665380o622456o100118n484717m681626l585441k295129q05244R67597
12463H1058246L039932N436194Q096375J0718311J2962317J4213602J3949177
$$ y = [125576611, 143652343, 161009392, 175508787, 185085979, 187562407, 181493745, 167571016, 149189067, 130643320, 114946835, 103333213, 95672287, 91334985, 89686438, 90128202, 92201831, 95722495, 100416314, 106101735, 112629194, 119740008, 127263846, 135077359, 143049255, 151052150, 159065057, 167015079, 174739813, 181913727, 188250598, 193300434, 196680547, 198079291, 197319040, 194351856, 189391738, 182834813, 175007653, 166489235, 157625700, 148804459, 140256487, 132023159, 124174098, 116729565, 109665380, 103042924, 96942806, 91458089, 86776463, 83191022, 80895893, 80090649, 81058246, 84098178, 89534372, 97630747, 108349058, 121311375, 135524977, 149474154]
12456A49474154J1600612P133635O87222p133406j5055034k0790758k2633960
12449A03282465k0843515j7230750j3358081j0065051p491730n604608m279085
12442B4409645l360291k643992k146104j805268j548918j363265j155341j042094
12434I344372r34058p68253o69736n59341n00163m28399l79364l87997l33007
12425D384054k61707k02471k14783k14097j92931j57209j86977j84123j41418
12416B628338p9706q6969j13685r0540q1637p9770o2261o7487m9915m5827m7143
12405A823398p0209q5853o7970k4407j9915l0216n5248p822k2284n346R999o43
12393A443484Q281J1114J5357M6361K9122M937k3940n5870m1015n8456r1383q9623
$$ y = [149474154, 161074766, 168208401, 168895623, 161762217, 146707183, 125916425, 103282465, 82438950, 65208200, 51850119, 41785068, 34293338, 28688730, 24409645, 21049354, 18405362, 16259258, 14453990, 12905072, 11541807, 10386466, 9344372, 8410314, 7642061, 6972325, 6412984, 5912821, 5484422, 5105058, 4717061, 4384054, 4122347, 3919876, 3705093, 3490996, 3298065, 3140856, 2953879, 2769756, 2628338, 2548632, 2461663, 2347978, 2257438, 2175801, 2096031, 2033770, 1966283, 1916368, 1870541, 1823398, 1753189, 1667336, 1599366, 1574959, 1555044, 1524828, 1469580, 1461758, 1439474, 1434128, 1444127, 1443484, 1451765, 1462879, 1478236, 1524597, 1553719, 1558656, 1534716, 1478846, 1437831, 1379375, 1287992, 1198369]
12381A198369o0239l2813j0497m6601J4034K7824L5928m286j7374q238k0588l0571
12369A044948k1394Q453L8465L4474J8622J1380J8186K5376J058J357J8939q966
12357A190898N96K0224L6750K89k980M451k9051r5485k9129M9075r200l0789K293
12344A107942J6215Q718M0983L816j4262K5635k1538m3801O891M6306L6631l1986
12332A181550j3992J9878n21N3631k105m6674j03320r0020p9567r4895p0380p2288
12320F81297n1441L364q199m5797l0017k1355L944Q500p467k3933p3J7572M112
12307E30507k3274l5634o247J2547l978l0182k5171j8453J8098L8406K4977J9291
12295E00887j7595o366j7165k817l1198k6858j1108J1927k4262j1819j5429M472
$$ y = [1198369, 1138130, 1105317, 1094820, 1048219, 1062253, 1090077, 1126005, 1121719, 1104345, 1096107, 1075519, 1044948, 1023554, 1032007, 1070472, 1104946, 1123568, 1134948, 1153134, 1178510, 1179568, 1180925, 1199864, 1190898, 1191494, 1211718, 1248468, 1248757, 1245777, 1250228, 1221177, 1125692, 1096563, 1145638, 1136438, 1105649, 1107942, 1124157, 1132875, 1173858, 1177674, 1163412, 1189047, 1167509, 1123708, 1130599, 1176905, 1213536, 1181550, 1167558, 1187436, 1186915, 1240546, 1238441, 1191767, 1088447, 998427, 918860, 823965, 753585, 681297, 629856, 633220, 625021, 579224, 549207, 527852, 531796, 540296, 532829, 508896, 508823, 526395, 530507, 507233, 471599, 465352, 477899, 473921, 443739, 418568, 400115, 418213, 456619, 481596, 500887, 483292, 476926, 459761, 456944, 425746, 398888, 387780, 399707, 375445, 363626, 348197, 352669]
12283C52669K9856J2393n155R063Q89q063l6288l2001j2837m587j6914O559l4017
12270B61567J9092M1880l007l9434k5643J8579m6038m2885n287K9961k403n713
12258B00669K8725L6187k1925p371K221K7290K3507J4960M682l3608K5495J77
12246C01009n653m718M8162N24j7065O447j1400k9385J969O168P138J8602R695
12233C31493l1080m6722j5133J851q033K4630M25P941J8480j7287j6276r379m622
12220B36288K0823j6965k7355J1409l902k2135k2249m7193p8493m1041J2825j9850
12208B162p7362j3215l9627j3526R249O7385R6855N7324P7824J18550J12347M3046
12196D41012N5908L3334j8197M2480O8195N5932M5516n453j7499J8762k0072K480
$$ y = [352669, 382525, 394918, 389763, 398826, 399715, 391652, 355364, 323363, 310526, 305939, 289025, 295584, 261567, 280659, 322539, 319532, 280098, 254455, 273034, 226996, 184111, 178824, 208785, 206382, 200669, 229394, 265581, 243656, 236285, 238506, 265796, 289303, 304263, 308945, 275337, 300832, 301009, 295356, 290638, 338800, 339324, 322259, 328706, 317306, 287921, 289890, 296058, 303196, 321798, 331493, 300413, 253691, 238558, 240409, 232376, 257006, 257431, 265372, 283852, 266565, 250289, 240910, 236288, 257111, 240146, 212791, 224200, 220298, 198163, 175914, 128721, 50228, 9187, 22012, 2162, -75200, -88415, -128042, -141568, -132319, -64934, 31921, 89245, 167069, 285619, 397966, 441012, 496920, 530254, 512057, 554537, 622732, 678664, 724180, 718727, 701228, 719990, 699918, 702398]
12184G02398N6923J9937L7029L6079l7253K6705L1692M5447M6369M5091J7150
12173A027567j2279L7302N5086M4663K5329J4871K5446K0160M3632L2608N1637
12162A366022M3184L6425L0043Q1955P1700O7895M0719N6651N0747R7590J23070
12151B066001J04377R9749J11122P1414J38771J17048J53002J31654J41212J85543
12141C319893K51246K04378K32774K73194K87804L47926L79205L89296M18338
12132F104054M82997N35240N46617O30232P22111P99912Q46483Q59345Q61618
12123A2388609Q60382Q30274Q44882P91277O85350O49182O16251N66235O07560
12114A8840002O57638P43485Q52855R03406J010407J156739J288206J406791J520325
$$ y = [702398, 759321, 779258, 816287, 852366, 815113, 841818, 873510, 918957, 965326, 1010417, 1027567, 1015288, 1052590, 1107676, 1152339, 1177668, 1192539, 1217985, 1238145, 1281777, 1314385, 1366022, 1409206, 1445631, 1475674, 1557629, 1629329, 1697224, 1737943, 1794594, 1845341, 1942931, 2066001, 2170378, 2270127, 2381249, 2452663, 2591434, 2708482, 2861484, 2993138, 3134350, 3319893, 3571139, 3775517, 4008291, 4281485, 4569289, 4917215, 5296420, 5685716, 6104054, 6587051, 7122291, 7668908, 8299140, 9021251, 9821163, 10667646, 11526991, 12388609, 13248991, 14079265, 14924147, 15715424, 16400774, 17049956, 17666207, 18232442, 18840002, 19497640, 20241125, 21093980, 21997386, 23007793, 24164532, 25452738, 26859529, 28379854]
12105B8379854J700896J908038K126106K344574K540016K784141L002207L164537
12097D7950369L296861L475663L800585M344286N236838O665780Q771670J1689379
12089I5231431J5341334J9541261K3822040K7555200K9826496K9513801K6242308
12082B67073871K0704188J3135198L017129q394466j8469999k6105701l1782302
12075B19177918l5157307l4788138l1196793k6402821k1557013j6368281j1406399
12068D2301166p551201n079919l600639k843479k414855k170653j975463j885190
12060A4779767j758212j577121j379134j200950j077445r54189p61324o39987
12052E431405n29442m12474l32079k99409k73520k41735k29582j80728r9239q7749
$$ y = [28379854, 30080750, 31988788, 34114894, 36459468, 38999484, 41783625, 44785832, 47950369, 51247230, 54722893, 58523478, 62867764, 68104602, 74770382, 83542052, 95231431, 110572765, 130114026, 153936066, 181491266, 211317762, 240831563, 267073871, 287778059, 300913257, 303930386, 295535920, 277065921, 250960220, 219177918, 184020611, 149232473, 118035680, 91632859, 70075846, 53707565, 42301166, 34749965, 29670046, 26069407, 23225928, 20811073, 18640420, 16664957, 14779767, 13021555, 11444434, 10065300, 8864350, 7786905, 6832716, 6071392, 5431405, 4901963, 4489489, 4157410, 3858001, 3584481, 3342746, 3113164, 2932436, 2833197, 2745448]
12042B745448j29374r7295r6557p9843l3810k3946j3693l445m966j8219l7031
12031B207269k8957J0349j2757q5467p3766p6605p8431n4285n3733q1428m9920
12020A622269p8901p8027n6771n2502m3815r1613j01232p1135j3510k8988m6605
12009I59170n1304k3667N2524K5316K8785O4780M2245O895N5166Q9046O795k2667
11997A233084j2163n0707j28737j38371r3466p0219p5939p3873q1592o6768l4532
11986D06717O329l8441n9376k2942k7760j7799J5836J8l6672k2818k0392K71j1872
11973A71099j7643J0836J0357j2536k7322k3014m709J9938J4112K9938P0015Q1246
11961C22317J5615M7086J08277J37891J13147Q5686K5362J8395k0280K8691n584
$$ y = [2745448, 2616074, 2518779, 2422222, 2342379, 2308569, 2284623, 2270930, 2267485, 2262519, 2244300, 2207269, 2178312, 2188661, 2175904, 2090437, 2016671, 1940066, 1861635, 1807350, 1753617, 1672189, 1622269, 1543368, 1465341, 1408570, 1356068, 1312253, 1220640, 1119408, 1048273, 1034763, 1005775, 959170, 907866, 884199, 936723, 962039, 990824, 1055604, 1097849, 1104744, 1159910, 1248956, 1255751, 1233084, 1220921, 1170214, 1041477, 903106, 809640, 739421, 663482, 589609, 508017, 441249, 406717, 413046, 374605, 315229, 292287, 264527, 246728, 262564, 262582, 225910, 203092, 182700, 182971, 171099, 153456, 164292, 174649, 162113, 134791, 111777, 107068, 127006, 141118, 171056, 241071, 322317, 337932, 385018, 493295, 631186, 744333, 830019, 855381, 873776, 853496, 882187, 876603]
11950H76603n4932r7710q1714r0285q5551k8444l1917n5919n8350k91M518q113
11938B87895k7334j7131L0580J6460k0769m028j6788J155l1172l4197m4010k6945
11926A13716j9621n1650K4858L3025m786J2556n075N97J6271p840J70l5033k5928
11913E1260J2450J8634J8856j3168J3939l2686P445M5470J6915l482p693J7514
11901A45454K0696K292M051J4759o195L692j369j3437J1484j1505l3444o308K922
11888A33092j8242n1415n3173k353k8528J8596j6466l8953K1146M0990L7935M2303
11876H4932l2551p0079J6590M9403L3083Q439m4573k1735l521r672J3550j0963
11864A2903j4512p814k0674j7736J6022K7673J9952O129j442k1630n7747j7092
$$ y = [876603, 821671, 723961, 642247, 551962, 466411, 437967, 406050, 350131, 291781, 291490, 296008, 287895, 260561, 243430, 274010, 290470, 269701, 265673, 248885, 250040, 218868, 184671, 140661, 113716, 94095, 42445, 67303, 100328, 95542, 108098, 103023, 103620, 119891, 112051, 112221, 77188, 51260, 63710, 82344, 101200, 88032, 101971, 69285, 76730, 122200, 139115, 135633, 127940, 145454, 166150, 168442, 172493, 187252, 181057, 184749, 183380, 169943, 181427, 169922, 136478, 130170, 133092, 114850, 63435, 10262, 7909, -20619, -2023, -18489, -57442, -36296, 4694, 42629, 84932, 52381, -17698, -1108, 48295, 81378, 89817, 45244, 23509, 19988, 10316, 23866, 12903, -1609, -9423, -30097, -47833, -31811, -4138, 15814, 21943, 20501, -1129, -58876, -75968]
11852g5968J6485K9194M687J5317J5363p083m9500l5744L4270M0521J2158j403
11840a703J0692j6994m5095M380K7082L9574j7903m7930j1273J9341J5581q289
11828c2537k4952k5013k742L3529M0535P970J7573K2528P138j3888j496n243p72
11815B2630K151n526k7415K8935J8577k3243l6688k4010r398L5480l350j0826
11803c2683J8151P030k0415M347O2224L7065r342J8751j8014k5584l9848N197
11791F879p857K8653o8323l6090L4146L7965L0690k2144l0357M015K104M567j0254
11778b6006j60K1225j2586J9440K5845j8304O199l9455k2001n6446r950M0507
11766g1692M5952o690o159r417P106L9289J233k24L9750j1488k2727J0645j317
$$ y = [-75968, -59483, -30289, -25602, -10285, 5078, -2005, -51505, -87249, -52979, -12458, -300, -1703, 8989, -8005, -53100, -48720, -21638, 17936, 33, -47897, -59170, -39829, -24248, -32537, -57489, -82502, -85244, -51715, -11180, -3210, 14363, 36891, 44029, 30141, 28645, 23402, 22630, 24781, 19255, -8160, 20775, 39352, 16109, -20579, -44589, -53987, -18507, -21857, -32683, -14532, -7502, -27917, -23570, 38654, 75719, 66377, 85128, 67114, 41530, 1682, 6879, -978, 27675, -40648, -76738, -42592, -4627, 26063, 3919, -26438, -22423, -20319, -15752, -26006, -26166, -4941, -17527, 1913, 27758, 9454, 15653, -23802, -45803, -102249, -112199, -71692, -25740, -32430, -38589, -48006, -40900, -1611, -378, -602, 39148, 27660, 4933, 15578, 14261]
11753A4261j4868L414j026J9974J2902Q687k8042l9472m677J7829q443K9613L6549
11740D6701k4912k5278K1490n616k4282j2488L0866L191J1106j0620L998k6659
11728a2503o377R788j8593j1957J1438j052m0471K4301k825L7521K4761K399l8855
11715b2425j3929J1961K6401K9694J9093M5544J2806j1530J3060N499k6779l0613
11703E8782j5840K0201M76N978J2512k0056K65j0257l797n548J4974K7846J1819
11690I7355K1778j141l1538k5771Q294J0964L3732O4519O8684K6466P636j6492
11678B64486K6529J0093l4877m074N1606N3676L2190K3751k694j5999J1712N7473
11666D73872N3540J15624R5228J06078J53469J50508J56354J18007P9252Q056
$$ y = [14261, -607, 2807, 1781, 21755, 34657, 43344, 15302, -24170, -28847, -11018, -19461, 10152, 46701, 21789, -3489, 18001, 12385, -11897, -24385, 6481, 9672, 20778, 10158, 14156, -12503, -18880, -9092, -27685, -39642, -28204, -29256, -69727, -45426, -48251, -10730, 14031, 16430, -22425, -36354, -24393, 2008, 31702, 50795, 96339, 109145, 97615, 110675, 116174, 89395, 58782, 42942, 63143, 63619, 69597, 82109, 62053, 62318, 52061, 48264, 42716, 57690, 85536, 97355, 119133, 117992, 86454, 60683, 68977, 79941, 113673, 178192, 246876, 273342, 280978, 264486, 291015, 301108, 266231, 262157, 313763, 367439, 399629, 423380, 420686, 404687, 416399, 473872, 527412, 643036, 738264, 844342, 997811, 1148319, 1304673, 1422680, 1501932, 1509988]
11656A509988k1358O90r4500j85709j93462j17422j49687j79751j29689j21236
11646C17864p9865m0430k9809k2385J4718r169j6556k7136j2134q759n923l914
11634G6502K252k5878p71P781M974j7567j7850L3817j022k9290q459K371j3274
11621A3586Q753j138j8676j0101J7544k8462j5449J5091L5179J4951k2090q453
11609G35L1618r173m2048K1024L6155R45p382l6773o993R973J5872J953j9132
11596c226J1015N947K4720k8272M121J2979k3169m241R4j1793j3417j9658O419
11583c8481j3024k732j7874j3497n635K9794L6360J3981K0957j8937n2865j8124
11571h0077J3227J3401l113j1905K243j2285K7879j3534k8032Q595J1250K1679
$$ y = [1509988, 1488630, 1489320, 1394820, 1209111, 1015649, 898227, 748540, 568789, 439100, 317864, 237999, 197569, 167760, 145375, 160093, 150924, 134368, 107232, 95098, 86339, 80416, 76502, 78754, 52876, 52105, 59886, 64860, 47293, 29443, 63260, 62238, 32948, 24489, 26860, 13586, 22339, 21201, 2525, -7576, 9968, -18494, -33943, -18852, 16327, 31278, 9188, 735, 32353, 23180, -18868, 2156, 38311, 39256, 31874, -4899, -11892, -1919, 13953, 15906, -3226, 7789, 13736, 38456, 10184, 14305, 27284, 4115, -126, -32, -11825, -25242, -44900, -38481, -51505, -54237, -72111, -85608, -91243, -61449, -25089, -11108, 9849, -9088, -61953, -80077, -66850, -53449, -56562, -68467, -66224, -78509, -50630, -64164, -92196, -83601, -72351, -50672]
11559e0672L3992R126K2819p915L95m4055l7909J1234K4346J8065J8909K7725
11547B6060m364j9949J1033K528r956L1038j9121p954J0325n5809j5112R371L9616
11534b294K2858j6085L057J2082j0886K760L0243M6489J8947l5008o2294L546
11522A3415K9675l5009o1081L9486L0566l3676o313K654K9761q942l9441p479
11510d6384R164J134J2342K3495n248j2624o760P593J455L0875K8897j8970j8442
11497F527l5875j9796J0662O541l756R978K3925J0566l0545Q848l906J5393K9216
11484B7778j4015k3558R059J6244L8762J8986j4482l9277j1351J7050l2691l282
11472a0777J438J8825K0227k7861k4571j8454K9526k5981k2290M1541K5474l8272
$$ y = [-50672, -16680, -7554, 15265, 7350, 7745, -36310, -74219, -62985, -38639, -20574, -1665, 26060, 21696, 1747, 12780, 15308, 5352, 36390, 17269, 9315, 19640, -36169, -51281, -41910, -2294, 20564, 4479, 7536, 19618, 8732, 11492, 41735, 88224, 107171, 72163, 9869, 13415, 43090, 8081, -53000, -13514, 17052, -16624, -22937, -20283, 9478, 536, -38905, -46384, -37220, -36086, -23744, -249, -5497, -18121, -24881, -17288, -15833, 15042, 43939, 24969, 6527, -29348, -49144, -38482, -31941, -35697, -25719, -1794, 8772, -21773, -12925, -16831, -1438, 27778, 13763, -9795, -736, 15508, 54270, 73256, 58774, 19497, 8146, 25196, -7495, -10777, -9339, 9486, 29713, 1852, -22719, -41173, -11647, -37628, -59918, -18377, 7097, -31175]
11460c1175j5586P606J5530J2115L0650O797j1843J9102J3178m628K439Q342k5440
11447B7087J3515L6639j8747l013K7704M333o8391n221l0209o157J920L8011J0679
11434B8150j9934k4333N211R653j9465P431j312J3548L8125j7350l604J6146K933
11421C5199J8818l0468l8688k5903J6860K045k3607l907M3620M4470J4212k3384
11409B9267K5552K8421k943o2260k9357J4545L4135k2178j5472J2904J2044q478
11397A6180m5337k9946K012J4747K3296j1656p193j0615R392l0018J423J6008
11385e1707k1983R968n108M6976M3964l3113k1229K4410L3738m4777k814O0188
11373C8513J4004m323j0053L313J5253m533j2298j7083J1873j482k344j822Q405
$$ y = [-31175, -46761, -39155, -23625, -11510, 19140, 25937, 14094, 33196, 46374, 41746, 44185, 52527, 27087, 40602, 77241, 58494, 55481, 83185, 87518, 19127, 13906, -16303, -22460, -20540, 17471, 28150, 8216, -16117, -10906, -1253, -20718, -13287, -14599, -1051, 37074, 19724, 16120, 32266, 35199, 54017, 23549, -15139, -41042, -24182, -22137, -45744, -49651, -6031, 38439, 52651, 29267, 54819, 83240, 80297, 18037, -11320, 3225, 37360, 15182, -290, 12614, 24658, 16180, -29157, -59103, -57091, -42344, -19048, -30704, -37897, -48512, -39120, -69138, -67715, -51707, -73690, -63722, -68830, -21854, 22110, -11003, -32232, -7822, 25916, -18861, -21675, 38513, 52517, 48194, 38141, 41454, 56707, 52174, 39876, 22793, 34666, 33184, 30840, 29018, 37423]
11360C7423j8400q125J616L9475K0431k9898j8565k1588K2444K1865M884n261
11348D6301L9404k8848n2187k4958n221J5836o502M5813N267J9160o040K42J138
11335D9405J09j150L2420K0448o201m1582m8948j2173K3358L0887L0764j027l4793
11322D1517r065k4644j9056j6662j189L9311K036j2281j8388Q967N3856K1580
11310F5982J4532J7875N866K833r783j63l6252m1202R679K7333j0652l5008k3495
11297a2455L362N347K6212r195k3161R859M4929K1894k8176l112N170p515J1746
11284D4905j9730l4414K7823M9161j5305O713k168k3207j8439L765p882j0957
11272B65k4351J2973j2496M6560K3326j1737k78K3016J553P340k6891m897M441
$$ y = [37423, 19023, 10898, 12514, 51989, 72420, 42522, 23957, 2369, 24813, 46678, 51562, 46301, 85705, 56857, 4670, -20288, -25509, -9673, -16175, 29638, 34905, 54065, 48025, 48267, 49405, 49514, 48364, 80784, 101232, 95031, 53449, 4501, -7672, 15686, 46573, 77337, 76310, 41517, 32452, 7808, -11248, -27910, -29099, 10212, 12248, -33, -18421, -9454, 44402, 65982, 80514, 98389, 104255, 107088, 97305, 97142, 60890, 19688, 29367, 56700, 46048, 11040, -12455, -9093, -3746, 22466, 13271, -9890, -31, 44898, 66792, 38616, 35504, 40674, 33159, 44905, 25175, -9239, 18584, 67745, 52440, 59153, 56985, 33778, 15339, 19104, 11222, 265, -24086, -11113, -23609, 22951, 46277, 34540, 34262, 57278, 58831, 66171, 39280, 34383, 38824]
11259C8824n26K199k5455j805O917J0167J0163L28j8951O167J6646N404l5371
11246A4707j0009J3538M3172Q231j2778n025j0785O394j0602O98K8090J0329l33
11233G5627j9171J3334P781j5885J082k3114L343J0784K0084j02j9311j8351K9288
11220F5389j587m7903j3667L5408l248n078N345l6001P572N2837M7988k2800l2615
11207E1640j6610l0730L7589K5664n0537M2528N0733j5977n821k5560j1976Q624
11195E9567k3737k8383L1461J2540J2969J7985J1366p777K956k3923p166l2935
11183B4923m825J8251n938K1617j2676N438k7632J436J6861k042k7533L186K1255
11170C2321L3371r310o518k1411k2542K1164k4967K2331N0264L8805k2066l1226
$$ y = [38824, 38298, 40497, 15042, 13237, 20154, 30321, 40484, 40812, 21861, 28028, 44674, 50078, 14707, 4698, 18236, 61408, 69639, 56861, 51836, 41051, 47445, 36843, 37541, 65631, 75960, 75627, 56456, 69790, 77571, 61686, 62768, 39654, 42997, 53781, 73865, 73763, 54452, 36101, 65389, 63802, 15899, 2232, 37640, 34392, 29314, 34659, -1342, 6230, 59067, 107055, 84255, 51640, 35030, 4300, 41889, 67553, 17016, 59544, 110277, 94300, 88479, 62919, 50943, 59567, 35830, 7447, 38908, 51448, 64417, 82402, 93768, 85991, 88947, 65024, 57858, 24923, 20098, 38349, 32411, 54028, 41352, 46790, 19158, 20594, 37455, 35413, 7880, 11066, 32321, 65692, 56382, 49864, 28453, 5911, 27075, 2108, 24439, 74703, 113508, 91442, 60216]
11158F0216J4346j7K4934q578k83j2776r089j3938j534m421K0608K1483m1886
11145D9065j0756J1012K5251J0041N040L0596k698q245J5410J3776r850j7281
11133A11361j9237n1627l8749J1758O2773K1292l6868n2757j3298O3578K1653
11122G9879p31l5008o859L3379M3348l0968J9004K3281j0810k4534p530L7118
11110A19569k7466r840r71l6029J9772O168m190J1295Q326p565M571k0857k1599
11097D1184j2649m3648n580N8681K8749j7981K6576K7298Q018l0764m7651j2502
11085A9731K6622M2101M5060K1399l9332Q102J410l4742m019P025j732R343J0685
11072A11653J3448m1704M5K8397k9200r519K2759J5709j4525j6099j4987J0409
$$ y = [60216, 74562, 74545, 99479, 90901, 90618, 77842, 68753, 54815, 53281, 48860, 69468, 90951, 49065, 38309, 49321, 74572, 84613, 89653, 120249, 117551, 109306, 124716, 138492, 128642, 111361, 92124, 40497, 1748, 13506, 76279, 97571, 60703, 7946, -5352, 58226, 79879, 79148, 44140, 37281, 70660, 114008, 83040, 102044, 125325, 114515, 89981, 82451, 119569, 92103, 82263, 81292, 45263, 65035, 71203, 67013, 78308, 86634, 79069, 83640, 62783, 41184, 28535, -15113, -20693, 37988, 66737, 48756, 75332, 102630, 110648, 79884, 32233, 19731, 46353, 88454, 133514, 154913, 115581, 123683, 125093, 90351, 86332, 93357, 91625, 100968, 111653, 125101, 83397, 83442, 111839, 82639, 73120, 95879, 111588, 97063, 80964, 65977, 76386]
11060G6386K3495J7093q13p514k8344J2462m4432k7375J411J0641K1509L1759
11048H6278K2478l6793k2078K1341K4111M2799J3290j9352J3665J1245j802k2784
11036A32398k0602l2053l892L7826j5001o326M745J1993Q318k6402q499J0939
11024I3444K0478j2484p739J812J2714p455k4327r741J1259L8154o208j2562m697
11011I2648j2583k0635l9921J0691J7554K4125J6411J3533M4385P92J083n193
10999A42890o85j3684k8330L3668M7780k476K4056O6493Q202m7140q949j7532
10987B04293l9685N385P51k0719m605p827k1570m1886P921L5341L7043K6051R76
10974A81469j0394K1659j5356J9309K7647k89J8338m315k3546m0589K810k2018
$$ y = [76386, 99881, 116974, 116161, 108647, 80303, 92765, 48333, 20958, 22369, 33010, 54519, 86278, 108756, 71963, 49885, 71226, 95337, 138136, 151426, 132074, 145739, 156984, 155182, 132398, 111796, 79743, 75851, 113677, 98676, 92350, 97095, 109088, 117406, 91004, 82505, 93444, 113922, 101438, 93699, 95511, 108225, 100770, 76443, 66702, 77961, 116115, 109907, 97345, 92648, 80065, 59430, 19509, 30200, 47754, 71879, 88290, 101823, 146208, 147000, 148083, 142890, 142205, 128521, 100191, 133859, 181639, 179163, 203219, 269712, 277914, 230774, 221825, 204293, 164608, 169993, 170744, 150025, 145420, 137593, 116023, 74137, 82058, 117399, 154442, 180493, 181469, 171075, 192734, 177378, 196687, 224334, 224045, 242383, 238068, 214522, 173933, 176743, 154725]
10962A54725q538O35k118J7178M3954J3942L7384K0743K506Q689M3013O545K3278
10949C61936K6732L5186L3208L3827k0970M135l6726m9297q3353o0253j2633r892
10937B21900N7781p909k0392k8354K1484J5511M4858r867L0220L4662j0241j1233
10925C38420J9911J5478l2653K9620J7150Q91J300L3095L6898j86N477J7245k302
10912D80344L2317L6519N9290Q1351M0528N8601O7882L1051K2481j3450J5508
10901I12422j7912k6399m5509o1165k4792l476J7439o200L3897q865O004J3547
10889G88991J5826N692K2899K6062K6673k3775j8742J908O1999P4495j0880o058
10877I65090J5719N9087M4381l0029n2891p359k6233m9664l4410k0891j8338l4157
$$ y = [154725, 146187, 146822, 144704, 161882, 205836, 219778, 257162, 277905, 280411, 289100, 332113, 338658, 361936, 388668, 423854, 457062, 490889, 469919, 474054, 437328, 388031, 304678, 244425, 231792, 221900, 279681, 271772, 251380, 223026, 244510, 260021, 304879, 295012, 325232, 359894, 349653, 338420, 358331, 373809, 341156, 370776, 387926, 388817, 390117, 423212, 460110, 459924, 465401, 482646, 480344, 512661, 549180, 608470, 689821, 730349, 788950, 856832, 887883, 910364, 896914, 912422, 894510, 868111, 822602, 761437, 736645, 733169, 750608, 744408, 778305, 769440, 775444, 788991, 804817, 810509, 833408, 859470, 886143, 862368, 843626, 845534, 907533, 982028, 971148, 965090, 980809, 1039896, 1084277, 1054248, 1001357, 993998, 967765, 918101, 883691, 862800, 844462, 810305]
10865H10305K3830j6387k1422K1704J591k3903k2152l539m6777k6948j2758l616
10853F79928L1304J0826o255p044J8639L1584L6869O588N7437j3469p7987o9893
10841F98527J1925m2020q0934o5650l1901j51l4412l4134k8617m993k2613j2656
10829C52371j524L371l7262m0028k5053J9300O0383m5500l5584r656j305M146
10817B43659K817K1829J4252k1081n2348l616J9677L4513P700k7440J0317n427
10805B44852K5282k5017l9927N3389K335J7296M3089N2272o891l8576l5126l2794
10793B60184r435Q967k5539J575K2786k4868m6247L0992M5146L3981j8069j6989
10781B62484O025n459l937j0760L3781J6440K5932J0355L855k5155J9599r421
$$ y = [810305, 834135, 817748, 796326, 818030, 819621, 795718, 773566, 770027, 723250, 696302, 683544, 679928, 711232, 722058, 715803, 708759, 727398, 758982, 795851, 802439, 859876, 846407, 768420, 698527, 710452, 668432, 587498, 521848, 489947, 489796, 455384, 421250, 392633, 387640, 365027, 352371, 350847, 354218, 316956, 276928, 251875, 271175, 331558, 286058, 250474, 240818, 239513, 243659, 246476, 268305, 282557, 261476, 209128, 205512, 225189, 259702, 267402, 239962, 250279, 244852, 270134, 245117, 205190, 258579, 260914, 278210, 321299, 373571, 366680, 328104, 292978, 260184, 250749, 259716, 234177, 235752, 258538, 233670, 187423, 218415, 263561, 297542, 279473, 262484, 268509, 263050, 259113, 248353, 282134, 298574, 324506, 334861, 338716, 313561, 333160, 323739]
10769C23739k7783K0028M3785J1908Q305j7466j9097K694J4167j44J5007K0701
10757C95844m4330l9413K7998M2528L274j3214J7764K8318j2073J2922N0222J5424
10745D85264j8594m1223J1915M2113J2907J6192j901L2309j3733n7306j2814k9383
10733D25746j5594J0170M2149Q788J8945J0625q454l9021l1316l950j171L0572
10721D47489L1134N6616O5193j094j8036J3945L9303n786j314O267n1114L65J8836
10708F01804L6926k079p364j0967K1592J1645p1041k9726m019L2777N671j3139
10696E72080j347K944n603K9146O798l3805k565K0541O093J3497M128N305K660
10683F19872m221M2221k5575m1044J5829M7379L671J1083K4284n999m4131m2333
$$ y = [323739, 295956, 315984, 359769, 371677, 379982, 362516, 343419, 346113, 360280, 360136, 375143, 395844, 351514, 312101, 340099, 382627, 385901, 372687, 390451, 418769, 406696, 419618, 469840, 485264, 466670, 425447, 437362, 479475, 492382, 508574, 506673, 538982, 525249, 467943, 455129, 425746, 410152, 420322, 462471, 471259, 490204, 500829, 492375, 453354, 422038, 418088, 416917, 447489, 478623, 535239, 600432, 599338, 581302, 595247, 634550, 628764, 627450, 633717, 582603, 582968, 601804, 638730, 636651, 629287, 618320, 639912, 651557, 580516, 550790, 546771, 579548, 585219, 572080, 570733, 573677, 568074, 597220, 604018, 570213, 567648, 588189, 594282, 607779, 611907, 617212, 619872, 615651, 657872, 632297, 591253, 607082, 654461, 658132, 669215, 693499, 687500, 643369, 601036]
10671F01036j3467K920q547l6889K299L474L3919K1684j8056J4896j6784m632
10659E81853m548J553L9136M6090L5613j6235j1322p96J3848k762J2283K8387
10647G23100K8195k362k4248L7760j174K200M425n924L2310n80K2780j510K4082
10634H39054k6134P389k1521k7586m82N4532O410j216J6237K3561m490Q290L2679
10621I06723j5539L5741L408k6316K00K2043J017k495M137p449K4269l1227L8165
10608I52677J15003Q6792M4202M7278M1822M0603M0629M0089Q006n511M9609M3139
10596A504338R394J6485l2425n2409l1346M5580L0862n432N4601K4180k584p266
10584A553978j7052Q678O154K6987p390L4459N0034O4837O9764N9083P7904K4113
$$ y = [601036, 587569, 590489, 581942, 545053, 547352, 550826, 584745, 606429, 588373, 603269, 586485, 581853, 577305, 578858, 617994, 664084, 699697, 683462, 672140, 671344, 685192, 682430, 694713, 723100, 751295, 748933, 724685, 762445, 761271, 763471, 767896, 761972, 794282, 793702, 816482, 814972, 839054, 812920, 820309, 798788, 771202, 770720, 825252, 831662, 830446, 846683, 870244, 865754, 874044, 906723, 891184, 926925, 930333, 904017, 904217, 926260, 927277, 924782, 928919, 921470, 945739, 914512, 952677, 1067680, 1154472, 1198674, 1245952, 1287774, 1328377, 1369006, 1409095, 1417101, 1411590, 1461199, 1504338, 1513732, 1530217, 1497792, 1445383, 1414037, 1459617, 1490479, 1485047, 1539648, 1563828, 1561244, 1553978, 1536926, 1545604, 1551758, 1578745, 1571355, 1605814, 1655848, 1720685, 1790449, 1849532, 1927436, 1951549]
10572A951549L8649J07956Q3058M4538J06309O6553M9823J01834Q5356R8820P1306
10561B805751Q0614N5993O2799N8820Q2833N5929J13647J22016J10137P3964J56160
10550C778663K05918K00810J52486J83662J65009K03041K20161K40068K54622
10541E604440K55742K83669L27935L12774L77087L52177L29936L57318M20986
10532H622064M79740M97855M61743N69271N48222N49361O15481O27344O18049
10523A3589130O31436P25833P89305Q09492Q58040R00323R02857J043856J128126
10514B1378398J185239J254643J266507J367606J448987J527256J626497J794922
10506C2850055J877764K017369K201374K384933K625062K905440L259667L649344
$$ y = [1951549, 1990198, 2098154, 2181212, 2225750, 2332059, 2398612, 2448435, 2550269, 2635625, 2734445, 2805751, 2886365, 2942358, 3005157, 3063977, 3146810, 3202739, 3316386, 3438402, 3548539, 3622503, 3778663, 3984581, 4185391, 4337877, 4521539, 4686548, 4889589, 5109750, 5349818, 5604440, 5860182, 6143851, 6471786, 6784560, 7161647, 7513824, 7843760, 8201078, 8622064, 9101804, 9599659, 10061402, 10630673, 11178895, 11728256, 12343737, 12971081, 13589130, 14220566, 14946399, 15735704, 16545196, 17403236, 18303559, 19206416, 20250272, 21378398, 22563637, 23818280, 25084787, 26452393, 27901380, 29428636, 31055133, 32850055, 34727819, 36745188, 38946562, 41331495, 43956557, 46861997, 50121664, 53771008]
10498E3771008M177675M857920N696910O628297P706777Q928882J0004659J0885709
10490A12657837J1320031J1087181R834753P609637M524530P34825l140217o371706
10482A48256871q426764r154443q606843p221520n375871l345638j428443L72113
10474A05069462J891811L170663M095962M659003M722450M381663L799162K994903
10466A34785079K276513J943867K168537K863860L944174M945593N609451N660362
10458A64197436M848054L170606Q90830j736367m328980o412473p500012p738025
10450A45391069p182527o027850m717652l701552l087272k923646l282122l877159
10442A10591289m514088m786256m636531m000540l021917j718117k23898J276600
$$ y = [53771008, 57948683, 62806603, 68503513, 75131810, 82838587, 91767469, 101772128, 112657837, 123977868, 135065049, 144899802, 152509439, 157033969, 157768794, 154628577, 148256871, 139830107, 130675664, 122068821, 114847301, 109471430, 106125792, 104697349, 105069462, 106961273, 110131936, 114227898, 118886901, 123609351, 127991014, 131790176, 134785079, 137061592, 139005459, 141173996, 144037856, 147982030, 152927623, 158537074, 164197436, 169045490, 172216096, 173106926, 171370559, 167041579, 160629106, 153129094, 145391069, 138208542, 132180692, 127463040, 123761488, 120674216, 117750570, 114468448, 110591289, 106077201, 101290945, 96654414, 92653874, 89631957, 87913840, 87689942, 88966542]
10434H8966542K736694L997925M989735N635655N600297M855664L362556J181393
10426A21326461j564030m555093p353122r482293j0702436j0905835j0245587
10419F6518065r176671p946400o674702n599192m618388l862425l225269k686736
10411B2728282k314281j978397j716930j490294j278045j097462r82170q83749
10403A0986954p88315o77155o41000o16604n62416n00006l68871l25220l24708
10394F182659l51064l02123k73733k46070k44972k29134j74995j71475j82352
10385D006741j78282j52439j65290j40976r7686j00398j32844j01477j28027p1876
10375B737446n7517l4614m9354k3120o0926r3303p8459n0783j3266o8521k6225
$$ y = [88966542, 91703236, 95701161, 100690896, 106326551, 111926848, 116782512, 120145068, 121326461, 119762431, 115207338, 107854216, 98371923, 87669487, 76763652, 66518065, 57341394, 49394994, 42720292, 37121100, 32502712, 28640287, 25415018, 22728282, 20414001, 18435604, 16718674, 15228380, 13950335, 12852873, 11870703, 10986954, 10198639, 9521484, 8880484, 8263880, 7701464, 7201458, 6832587, 6507367, 6182659, 5831595, 5529472, 5255739, 5009669, 4764697, 4535563, 4360568, 4189093, 4006741, 3828459, 3676020, 3510730, 3369754, 3272068, 3171670, 3038826, 2937349, 2809322, 2737446, 2679929, 2645315, 2595961, 2572841, 2511915, 2418612, 2340153, 2289370, 2276104, 2207583, 2181358]
10364B181358J8779r15p3186j3989m2873P2n1867r7817p0425k9567p7171o8034
10352A674365p8124n695Q390p652o4643k4262j1689k6881j3498J0411J4104J4460
10340A489286j1260n432k3726r614l0336l581K2601m298l0389m2938k1742J2075
10328A340646p217l4523l5240l4171J1106J0360j6081l3564L7826j8108j4769
10317A206265K3932J6507j4999l3698m7336j7228p81O5879l8908k8480m6828j9332
10305A064993J1005j3263m7997k1569J4637j4236m9260j8266o412l9368k6195
10294H54069o0119n5698j3495j6453n7020l7736j5984j8239j8455J4225O070k0389
10282E60776k9272k8661l0615J0260p392j5281j5216l7628k6810l612M4512J5451
$$ y = [2181358, 2200137, 2199222, 2126036, 2112047, 2069174, 2069246, 2017379, 1919562, 1849137, 1819570, 1742399, 1674365, 1596241, 1590546, 1598936, 1591284, 1526641, 1502379, 1490690, 1463809, 1450311, 1460722, 1474826, 1489286, 1478026, 1472594, 1448868, 1439254, 1408918, 1405337, 1427938, 1423640, 1393251, 1350313, 1328571, 1340646, 1333429, 1298906, 1263666, 1229495, 1240601, 1250961, 1234880, 1201316, 1239142, 1221034, 1206265, 1230197, 1246704, 1231705, 1198007, 1150671, 1133443, 1132662, 1198541, 1159633, 1131153, 1084325, 1064993, 1075998, 1062735, 1014738, 993169, 1007806, 993570, 944310, 926044, 919632, 880264, 854069, 793950, 738252, 724757, 708304, 651284, 613548, 597564, 579325, 560870, 575095, 581165, 560776, 531504, 502843, 472228, 482488, 475096, 459815, 444599, 406971, 380161, 376549, 421061, 436512]
10270D36512M693m3856o9437n6672M859K7324k0867P074k1922P229N5170J2926
10258C43033m9691j4341j2163m8474K6069R860P527P226k0691J6007M970J1358
10246B80690j425o780j3088J0632J7981l7845j2380o70J1668j1449o248j6922
10234B14164m8359o8042K722J9058J8475J8661K7100j4454J0690P516m6963m0952
10222I9616l6494O597J7810k6895L2597j1233l0099J5171P679J5724J8483k0237
10210H8719L0066L0282O076k7582j4132j19l2039l2699J1799J2439M6828P362
10198A27000j1523k1799j3670k3168j3330m8398o282K3685J5470J6683K461m367
10186D2762J4191O3048M2148O550k5959j409O906k4420j9762r341N668J9908k7745
$$ y = [436512, 441205, 397349, 327912, 271240, 276099, 303423, 282556, 289630, 267708, 274937, 330107, 343033, 293342, 279001, 266838, 218364, 244433, 254293, 261820, 269046, 248355, 264362, 269332, 280690, 279265, 272485, 259397, 270029, 288010, 250165, 237785, 237115, 248783, 237334, 231086, 214164, 165805, 97763, 100485, 119543, 138018, 156679, 183779, 169325, 180015, 187531, 140568, 99616, 63122, 69719, 87529, 60634, 93231, 81998, 51899, 67070, 74749, 90473, 108956, 88719, 118785, 149067, 155143, 127561, 113429, 113310, 81271, 48572, 60371, 72810, 119638, 127000, 115477, 93678, 80008, 56840, 43510, -4888, -11170, 12515, 27985, 44668, 47129, 42762, 56953, 120001, 162149, 168699, 142740, 141331, 148237, 123817, 104055, 94714, 100382, 120290, 92545]
10173I2545j6822J5300K3264m382j9331l4346l003P996m6746l061N3767L4723
10161I9904K132n1830m281o597k2164j9836j0055J3576J313P228N884O1866j8222
10148E8918l1639L4578L4471r40j7507m5516j5902Q192K6368K5848j1778K186
10136F7279k4586O914q069m6548k1207J932J0536J8047M2067K9920J5157o852
10124H4590k9129Q648J6678Q079L1612j7051k1438J8321J4202Q725m0413k7886
10112E4938R482K1623j1309k9836j8990j8722J8325L4775J6380K1905j9718n3112
10100B5741K5388L2973l221k3649J6330K6437o759j2360R885L6827J7167j5041
10088A29718K6796Q327K205Q714R926K5058N9080K5493k6841K3345k6852l17M2407
$$ y = [92545, 75723, 91023, 114287, 109905, 90574, 56228, 53225, 61221, 14475, 11414, 65181, 99904, 102036, 50206, 45925, 39328, 17164, -2672, -12727, 849, 2162, 9390, 15274, 77140, 58918, 27279, 61857, 96328, 95388, 77881, 32365, 16463, 24655, 51023, 76871, 65093, 67279, 42693, 49607, 41538, -5010, -26217, -24285, -13749, 4298, 46365, 76285, 91442, 84590, 55461, 64109, 80787, 88866, 120478, 103427, 81989, 100310, 114512, 123237, 82824, 54938, 64420, 86043, 74734, 44898, 25908, 7186, 25511, 60286, 76666, 98571, 78853, 25741, 51129, 84102, 80881, 57232, 73562, 99999, 93240, 80880, 90765, 127592, 144759, 129718, 156514, 164841, 167046, 175760, 185686, 210744, 269824, 295317, 268476, 291821, 264969, 264652, 307059]
10075C07059M0403K9995N2929M0328j6695K8012J13200M5125j2992K8109Q0383
10064G35856R1792L7297J3460l3191l1116R340k0833l2761k6058l8981n0935K0411
10052F74281q346j9737J8690K6215M6616J2044k959J5475j8039l505k9773m04
10040G10558L6295K1947J0321N4661O7991M5694l3007j3462J2002J163J6337k1132
10028I09368k7085m7036n8606m6731j7158l3889l4164l5970o179k2817m244l2131
10016E43358k6618p311j9352j443k741M0920J0776K3594J8756R312j4163K8183
10004F03271j0848j5290k377P806m0250j2741o2064n8132k4858l6924l256j4102
9992C30235r2474p5224j1434N988l3340m6096o0172k8208K6588k2115j0055O453
$$ y = [307059, 347462, 377457, 430386, 470714, 454019, 482031, 595231, 640356, 627364, 655473, 735856, 827648, 864945, 878405, 845214, 814098, 823438, 802605, 769844, 743786, 704805, 653870, 674281, 665935, 646198, 664888, 691103, 737719, 749763, 746804, 762279, 744240, 740735, 710962, 710558, 746853, 768800, 779121, 833782, 901773, 947467, 914460, 900998, 913000, 914163, 930500, 909368, 882283, 835247, 776641, 729910, 712752, 678863, 644699, 608729, 602550, 579733, 575489, 543358, 516740, 509429, 490077, 488634, 485893, 526813, 537589, 561183, 579939, 589251, 575088, 603271, 592423, 577133, 574756, 582562, 542312, 529571, 467507, 409375, 384517, 347593, 344337, 330235, 237761, 162537, 151103, 157091, 123751, 77655, 17483, -10725, 15863, -6252, -16307, -9854]
9980i854j1358j8463j0811j4764Q579j1468J3686P925K0600k1738l6599J2497
9968g1768N7955K0368P098l3255l4617j1460L8352J4608j04k9121j0945R915j9442
9955f2416n4481L0202M5265O8566M4970k0310l771J7223O116m0303m7607j267
9943a7813j5551j7938N899j5851L4422j1543k6032j3336P054J8451L4855L3764
9931A6381J5598N223m9439k228N205Q333L209k4690r370j3503P929J7892n297
9918b4757j4322N656M2109o565L169j736k0881j6576J221j3416m384K3978K7595
9905A091n039M114L125o553J7302j4824K0769k2698k0805k4578P663l5348p142
9892h2923J3900L5877n171m585J8804R073j8175k7473j6865K2219J6135J2946
$$ y = [-9854, -21212, -39675, -50486, -65250, -56671, -68139, -54453, -46528, -25928, -47666, -84265, -71768, -13813, 6555, 13653, -19602, -54219, -65679, -27327, -12719, -12823, -41944, -52889, -42974, -62416, -116897, -86695, -41430, 27136, 72106, 51796, 48025, 65248, 71364, 31061, -16546, -17813, -33364, -51302, -45403, -61254, -26832, -38375, -64407, -77743, -70689, -52238, -17383, 16381, 31979, 37202, -12237, -14465, -9260, -927, 2282, -22408, -31778, -45281, -37352, -19460, -24757, -39079, -33423, 8686, 2121, 5290, 3554, -17327, -33903, -32682, -46098, -50482, -26504, 1091, -3948, 166, 3291, -3262, 14040, -784, 19985, -2713, -23518, -48096, -40433, -75781, -82923, -69023, -33146, -38317, -42902, -24098, -15025, -33200, -60673, -77538, -55319, -39184, -26238]
9880b6238k7922m0053n849P73J8594M7180K4487k9773l9789L1959M452N3538J3178
9867B4537n1362k146k7004L147L6069J7782r9k5794k6753o2714p859M1075R128
9854g1993K3676L7483k951j387J9428j1164k8781j5052N8080L2810l35k6206j0292
9841C316m0005l5252J6781O1253k0092Q780q111k1385j6805M23O711J6068k0469
9828d8787k2324J2971J0130L351J0194k6157K8646J8700j2050k4429m593J7161
9816c7187J1642j1905n012j7011j3744L6183K3003N350K197k8405l7171m3525
9804a15585L2201K8270L151j6150J006N633J0308J3628l5668l1193o986M6292
9792f5093N0127M33l4340r937j9935J9266J1772J640k4439j5413L2972K3325j9403
$$ y = [-26238, -54160, -94213, -100062, -99289, -80695, -33515, -9028, -38801, -78590, -46631, -42179, 11359, 24537, -26825, -28971, -55975, -52828, -16759, 1023, 924, -24870, -51623, -114337, -122196, -81121, -71993, -48317, -10834, -13785, -15172, 4256, -6908, -35689, -50741, 7339, 40149, 39814, 13608, 3316, -36689, -71941, -55160, 6093, -13999, -5219, -13330, -34715, -51520, -51097, -44386, -28318, -48787, -71111, -58140, -48010, -44659, -34465, -60622, -31976, -13276, -25326, -49755, -54348, -37187, -25545, -37450, -42462, -59473, -73217, -37034, -14031, -8681, -6484, -34889, -72060, -115585, -83384, -55114, -51963, -68113, -67107, -61474, -51166, -37538, -73206, -104399, -111385, -65093, -14966, -14533, -48873, -58810, -78745, -59479, -47707, -46067, -70506, -85919, -52947, -29622, -49025]
9779d9025k2116k7229k064N777K5907J381k9232M6910K0558p43o967M973L3906
9766B036J6081l6926q880k1373o906l0281l0734L7844N0746K5806p591k4453n885
9753d0516L5767J8901l9489n3370n850M2594L0589m707J8026j0060j2106m6161
9741f6382k6639R542J0286J166j8002q495Q482J5290j8549J8024L5357k0016k2567
9728h2503n569Q578p025N179K0939L6371J9315j9475j2557k200N7037O3194j4136
9715F7148k9510m5042n2032l750q690L5180K8584j6670l5269j3928J4422J0855
9703d8702Q950J2191K8551l569k2015l1764k2337j2597K5365j8376K1556M3721
9691a9026R059J6437k6944j5624j6151o0780j4461l14L7497L0527O570Q444r249
$$ y = [-49025, -71141, -98370, -100434, -94657, -68750, -67369, -96601, -49691, -29133, -29876, -36843, -31870, 2036, 18117, -18809, -27689, -49062, -55968, -86249, -116983, -79139, -28393, -2587, -10178, -34631, -40516, -4749, 14152, -25337, -78707, -84557, -41963, -11374, -16081, 1945, -8115, -20221, -66382, -93021, -83479, -73193, -72027, -90029, -98524, -90042, -74752, -93301, -75277, -39920, -59936, -82503, -88072, -79494, -86519, -81340, -60401, -24030, -4715, -24190, -36747, -38947, 18090, 81284, 67148, 37638, -7404, -59436, -63186, -71876, -36696, -8112, -24782, -60051, -73979, -59557, -48702, -39752, -27561, 990, -2579, -24594, -56358, -78695, -91292, -65927, -84303, -62747, -19026, -9967, 6470, -20474, -36098, -52249, -113029, -127490, -127804, -90307, -59780, -53210, -44766, -54015]
9678e4015Q275J4135J189K1655j9058J6726q860K4357K78N254J8588J038J6978
9665D6540m3384j7736k0547k9226l5485K5312M4309J8965k0017l3867J5412O422
9653d3302L3034j1882k6074j7617K1466J0603j4932K7705K2279j8538J4430j1095
9641a3923j283l4344M762R148P287L327N765K3518j1116J8575j1528q927J8421
9628I682L5167K014j1418o674k5120Q48p738l8059j3295O08Q428O754j7611j165
9614e7579M845K3164L6680l2812K99K4425J6932N48m200N686q080k3596L774j6286
9600b6200M645K680K2819k982j7208J3022j8184L6165K7710j1892r135L0484J3199
9587F5123m4562o5522l153L0938K438k1731J2961j7390M484K5723K5129L1780
$$ y = [-54015, -45740, -31605, -30416, -8761, -27819, -11093, -19953, 4404, 4682, 9936, 28524, 29562, 46540, 3156, -14580, -35127, -64353, -99838, -74526, -30217, -11252, -31269, -65136, -49724, -43302, -10268, -22150, -48224, -65841, -44375, -33772, -48704, -20999, 1280, -17258, -2828, -13923, -15206, -49550, -44788, -35640, -28353, -25026, -19261, 4257, -6859, 11716, 188, -8739, 9682, 44849, 46863, 35445, 28771, 3651, 4499, -3239, -41298, -54593, -53985, -45557, -38803, -56414, -57579, -52734, -29570, 7110, -25702, -25403, -978, 15954, 16502, 12302, 17988, 9908, -13688, -9914, -26200, -21555, -18875, 3944, 962, -16246, -3224, -21408, 14757, 42467, 30575, 21440, 51924, 65123, 20561, -44961, -48114, -17176, -14738, -36469, -23508, -40898, -36414, -10691, 14438, 46218]
9575D6218j2712j057K4564r090M311J0338R933l3588m3327L320L8979o537J773
9562C3125J5549P841M585l9748l7774k316Q147q068r097k7363K8837L3361J6344
9549B3423N997K5667K6939j3455k9620k9240k7702m004M1948L5939o437l4700
9537A4755j2997k51m845L7507L393k2304K5507J0928m4648j8987l1680M887O6972
9524B8237K4278N541J040k9817q51J6301N762J1356m570n0705m1744J4663J8677
9511a832J7653K1790J3281M5215j8057l6393k1542l1382o63J0917J2178Q382L4874
9498E4421K3867k2874l3551L307m885r042L0416J2099J6779K2041k4469k2765
9486D5344j2899n102Q749J8990l362K9927N326o2138p945M6932O6990K2570J7989
$$ y = [46218, 33506, 32449, 57013, 47923, 52234, 62572, 72505, 38917, -4410, -1090, 37889, 31352, 33125, 48674, 56515, 61100, 21352, -16422, -18738, -10591, -18659, -27756, -55119, -26282, 7079, 23423, 29420, 55087, 82026, 68571, 38951, 9711, -17991, -21995, 19953, 55892, 49455, 14755, 1758, 1507, -3338, 34169, 37562, 15258, 40765, 51693, 7045, -11942, -43622, -38735, 28237, 52515, 58056, 59096, 29279, 28428, 44729, 50491, 61847, 57277, 6572, -35172, -20509, -1832, 15821, 37611, 50892, 96107, 78050, 41657, 20115, -11267, -11930, -1013, 11165, 19547, 54421, 78288, 55414, 21863, 25170, 20285, 11243, 41659, 53758, 70537, 92578, 68109, 45344, 32445, 27343, 36092, 55082, 51720, 81647, 86973, 24835, 16890, 63822, 130812, 153382, 171371]
9473A71371l9265k8386m843J9237R857j9777j9081j6958j2951l119K8941J9427
9461A04453k3268K3251K8986j7125M696O2668q737j4987O951l5219n1156K2460
9449A02973J6791P256J2899J9333O537J2901K3984j533k2420P030k82k5961Q718
9436A68226N0669J9992k8233K5360q37j3803O567k185k2172m081J8635K0576j6017
9423B22697J8250N8830j0689k7536j1392k821N5347L2760k2867J0458j1566n305
9411C06166j2543N491M6145L2101J2504K052L5471J7259M234J1597K3418j9989
9399D63906j7348P946K739L6346M3201J4265j8868J7414M0921L0458J3946k437
9387F32489K1805L5720J5195L0722K4107P629J4901J8051M9555j86L8651K6204
$$ y = [171371, 132106, 103720, 98877, 118114, 127971, 108194, 89113, 72155, 59204, 56085, 85026, 104453, 81185, 104436, 133422, 116297, 120993, 183661, 174924, 159937, 166888, 131669, 80513, 102973, 119764, 127020, 139919, 159252, 165789, 178690, 202674, 201141, 178721, 185751, 185469, 159508, 168226, 218895, 238887, 210654, 236014, 235177, 221374, 227941, 225756, 203584, 199503, 218138, 238714, 222697, 240947, 299777, 289088, 261552, 250160, 247339, 302686, 335446, 312579, 323037, 311471, 306166, 293623, 299114, 345259, 377360, 389864, 391916, 427387, 444646, 448880, 460477, 483895, 463906, 446558, 454504, 457243, 493589, 536790, 551055, 532187, 549601, 590522, 620980, 634926, 632489, 654294, 690014, 705209, 735931, 760038, 767667, 782568, 800619, 850174, 849988, 888639, 914843]
9375I14843Q139J0023l093K0097L1575J0245M223M8294Q097M0664K2042K9779
9363A144928K3737N3738P8709K2469J0515J3337K8205k945r54K850K5934N1733
9351A452256l3145n1763K0358k85K259L122m434L1989M2192k2742n3995O598K6534
9338A418944K3466j5392j994m4284l9563j8442N070q329k6196l302j3422o6524
9326A210032k6249l2605k644m2279p6030m8759l8068k5982k3021K8540k997j9352
9314I00586k0453m0522n7398l1192J0332r597k18m6230j7976J124m571l6135m9314
9301E98436l1287L3832K7799l5903n1872l1164K0111l1579j7366k7038n614J0930
9289D59285l3928k5481R752K9520l0670m1875l0130j0994k9891k1005K0476J9115
$$ y = [914843, 922982, 933005, 929912, 950009, 981584, 991829, 996052, 1044346, 1052443, 1093107, 1115149, 1144928, 1168665, 1222403, 1301112, 1323581, 1334096, 1347433, 1375638, 1372693, 1371739, 1374589, 1400523, 1452256, 1419111, 1367348, 1387706, 1387421, 1389680, 1392802, 1388368, 1420357, 1462549, 1439807, 1385812, 1392410, 1418944, 1442410, 1427018, 1425024, 1380740, 1341177, 1322735, 1327805, 1319476, 1293280, 1289978, 1276556, 1210032, 1183783, 1151178, 1148534, 1106255, 1030225, 981466, 943398, 917416, 894395, 922935, 919938, 900586, 880133, 839611, 782213, 751021, 761353, 751756, 751538, 705308, 687332, 688456, 683885, 647750, 598436, 567149, 600981, 628780, 592877, 541005, 509841, 529952, 498373, 481007, 453969, 448355, 459285, 425357, 399876, 409628, 439148, 408478, 366603, 336473, 325479, 295588, 274583, 295059, 314174]
9277C14174J95l3759L707J4336j4275P583l3861J3183L2350J6193k8677m2992
9265B48157o4468m7078J7830M5728j2922n764K2761L037j7551L7708j6336j5296
9253A95806Q559J4178k9344K00L5687j1609m7222k4728l129l7116o390o634j9278
9240F8980k753j0066J9413N0997j1917l0802J705J0945k8125j7119K9229N780
9228H6267P312l0700J935J491M9099m846l8448j5205J8354o974l2773j0599J1465
9215C6378j6540M1054J3314k3677J0393j4127k9364J2285j2046OR474j3787l3430
9202b0067K170J6515M4088M9097P949p5814j9900K4774N1891p104j4496k1002
9190C8101k6868L396L2477j8949m0912k6298M5761M0335O869q36K7496J473k1998
$$ y = [314174, 314369, 280610, 284317, 298653, 284378, 291961, 258100, 271283, 303633, 319826, 291149, 248157, 183689, 136611, 154441, 200169, 187247, 181483, 204244, 207281, 189730, 227438, 211102, 195806, 204365, 218543, 189199, 189399, 225086, 213477, 166255, 141527, 138398, 101282, 94892, 88258, 68980, 66227, 56161, 75574, 126571, 114654, 83852, 85557, 96502, 68377, 51258, 80487, 86267, 93579, 62879, 64814, 66305, 115404, 110558, 72110, 56905, 75259, 68285, 35512, 24913, 36378, 19838, 60892, 74206, 50529, 60922, 46795, 17431, 29716, 17670, 17676, 27150, 13363, -20067, -17897, -1382, 42706, 91803, 99752, 23938, 4038, 28812, 80703, 73599, 59103, 38101, 11233, 14629, 47106, 28157, -12755, -39053, 6708, 47043, 53912, 53076, 80572, 82045, 60047]
9177F0047J4335J6595J2971j2148j4645J2182j3709k6752p244Q819J1647p75O854
9164F8177o162J6580K0334l9651j5276l517J4783J3298K2975j8679k2329k2693
9152B7840m527J0486J6531J4809P701J6j8304J3144r727J4784k5971j1634j2202
9139B2946j7036K0925K2886j6275J4108p565k8930N44k8074L2441M483k1197j2314
9126a3058K0305J3251k059j625q681J240R900K4952m8258n1978P638j563Q327
9113d1609k041j1365K5524R887M758r525k0282K5617M8593L2665j2208n7868m684
9100a2538K5394J8074K479j4092R622Q504K2398l2772j2910l251K789N2601J3925
9087H0223m8440j3254K0747J2555K4686k1789n8263n5065J7439M6050k4625O197
$$ y = [60047, 74382, 90977, 103948, 91800, 77155, 89337, 75628, 48876, 41632, 50451, 62098, 61323, 68177, 62015, 78595, 98929, 59278, 44002, 40485, 55268, 68566, 91541, 72862, 50533, 27840, 23313, 33799, 50330, 65139, 72840, 72856, 54552, 67696, 57969, 72753, 46782, 35148, 22946, 5910, 26835, 49721, 33446, 47554, 39989, 11059, 11603, -16471, 15970, 20453, -744, -13058, 7247, 20498, 18439, 16814, 8133, 9373, 19273, 44225, -4033, -56011, -48373, -49936, -41609, -43650, -55015, -29491, -19604, -14846, -24371, -44653, -19036, 29557, 62222, 50014, -7854, -12538, 12856, 30930, 33409, 19317, 28939, 37443, 59841, 27069, 14159, 10908, 13697, 66298, 80223, 31783, 18529, 39276, 51831, 76517, 54728, -3535, -58600, -41161, 4889, -19736, -13539]
9075a3539L3035m07k5805j0966l3680n423K4271L4780N0683N816l9126K296j4852
9062G083k0349j0583q832j5442K1557J203J1977k48m108l1234Qo525J4569J0249
9048c0675P736l4768K309K453L1148M5920J7781J9817p333m7393j5157O602k0688
9035b2248p571R600M7354k1049j0381N2412L908L791k1628r546j6510K701K973
9022A3806J2418j7963q19L2313K4824K2488n723n5407k3437L17n008L3688R416
9009D0913j9898J1527J1602j4998m7565J8318Q2313J1398m9275k8671l2891J1078
8997f149J9739M5236l5705j9217k629J106N81j9180q530O278j2336Q85n527j9913
8983e5361M2000L9889j2121l1980r728l1999K1478L5130k486J0781P689o408j2441
$$ y = [-13539, 19496, 19089, -6716, -17682, -51362, -56785, -32514, 2266, 52949, 58765, 19639, 21935, 7083, -13266, -23849, -32681, -48123, -26566, -25363, -13386, -13634, -17742, -48976, -48968, -55493, -40924, -30675, -22939, -57707, -55398, -52945, -21797, 24123, 41904, 61721, 54388, 6995, -8162, -1560, -22248, -29819, -20219, 27135, 6086, -4295, 48117, 52025, 55816, 34188, 24642, 8132, 10833, 13806, 26224, 8261, 7442, 39755, 64579, 87067, 81344, 25937, 2500, 2817, -2191, 31497, 40913, 21015, 32542, 44144, 29146, -18419, -101, 82212, 93610, 44335, 15664, -17227, -6149, 13590, 58826, 23121, 3904, 1275, 2381, 2962, -16218, -24748, -18470, -30806, -29921, -35448, -55361, -13361, 26528, 14407, -17573, -27301, -59300, -37822, -2692, -5178, 5603, 13292, 6884, -5557]
8970e557m729l3608K7438J8495k20j4207L264j2637j6793l1679L4227M0925M0261
8957D5180L151q589J5323L2109j4936l4074n3774K8203N3652k3632m2288J0047
8945A0372m58J3645k5170n3083L1859j832j3726M6454J6970L2763O891M447j7520
8932E1612m6393n571k6239q871N4922L5932j2659q36k817n095K261J5709P881
8919E9836K2801k7840l4037k669j0104k5371j7781J6823J4969j4424M50L948J7315
8906C916K030n0136m85J5367L1015n648q203j3207p536l4604O295J1573K3462
8893b6161L3369k9897j2618p477J3816K3325n634L2598J7882K3889l37j5878j3354
8880C3523l6965j6038J4135J9996n0512o598J7129k0519q265k187K7158N0746
$$ y = [-5557, -10286, -43894, -16456, 2039, 1819, -12388, -9124, -21761, -38554, -70233, -36006, 4919, 45180, 48331, 39742, 55065, 87174, 72238, 38164, -15610, 12593, 66245, 42613, 325, 10372, 9914, 23559, -1611, -54694, -22835, -24667, -38393, 8061, 25031, 57794, 64685, 69132, 51612, 5219, -352, -26591, -35462, 19460, 55392, 42733, 41897, 39080, 33985, 36246, 51955, 59836, 82637, 54797, 20760, 18091, 7987, -17384, -35165, -18342, -3373, -17797, -17347, -13399, 3916, 5946, -44190, -44675, -29308, 1707, -3941, -12144, -25351, -32887, -67491, -61196, -49623, -26161, 7208, -22689, -35307, -42784, -28968, -5643, -11277, 21321, 39203, 63092, 62755, 46877, 33523, -3442, -19480, -5345, 14651, -35861, -42459, -25330, -45849, -54114, -56301, -29143, 21603]
8868B1603K7755L911l9186l9533k6560K837K5102J9558J0186k497K7298J2373
8856D2847q13O313j2237K0897J4858K6750k3335l0939j8995l452o604k0032k8286
8843c3028L7058J6188k9600m0565N145J1303m350j0053R361P41J3898N4634L0507
8830F1239j1278m2079k6986p3982k028M1606M8439m773K4982K187n567R928j2272
8817I416r631k765L6872K5751K2453j6452o428j7817n690j2761R215Q471q193
8804C2441j7839l091k6353k2092m973L0370J3154j6450n086j4536J6799K4590
8792F934K7098l390l7014m0335j1508K6842R812J5843k7454q042Q705j0112K3717
8779a8904q582p298Q712K8882K2262P558k805k7948j9758k6314K9654K2919k312
$$ y = [21603, 49358, 53269, 14083, -25450, -52010, -49173, -24071, -4513, 5673, 3176, 30474, 42847, 42034, 48347, 36110, 57007, 71865, 98615, 75280, 44341, 25346, 21894, 15290, -4742, -33028, 4030, 20218, -9382, -49947, -44802, -33499, -37849, -47902, -38541, -37800, -23902, 30732, 61239, 49961, 7882, -19104, -93086, -95114, -53508, -5069, -9842, 15140, 17327, 11760, 21688, 9416, -215, -2980, 33892, 59643, 82096, 65644, 59216, 41399, 35709, 22948, 32163, 40634, 32441, 14602, 11511, -14842, -36934, -41907, -11537, 1617, -14833, -19919, -34455, -17656, 6934, 34032, 30642, -6372, -46707, -58215, -31373, -21561, -5718, -33172, -41214, -32509, -42621, -18904, -27486, -34784, -26072, 2810, 25072, 32630, 29825, 1877, -17881, -44195, -14541, 8378, 6066]
8766F066l8672j6508K5595J3531r816r005J4441j6672K0077Q364k8119P499L9174
8753A5955o993l3634k5018j4804j9090M3762N9160r171M103J2384m6968l0960
8741e1274J4642L3732K4654k0863k79q099o343K910K7732n1113q082m484P258
8728c9609M9634q328l7512O380K2376n169L7405K031j4828j7969M105J9064J9762
8715C7342l2671k1969J0139k548K0117J5870j7018j5938j8483J9744N474L480
8703C539N815r948J5066k4634k7343k854J7264J9082K0610K5483K0249K0923l5003
8690D8249j8466j6702l1389k4471j2479L2893P439m1407K8889M0638K1862L2556
8678F7612M5113P84k3021p3535N310N1785j5854J8590L1780m940r038l4203o5418
$$ y = [6066, -32606, -49114, -23519, -9988, -19804, -28809, -14368, -31040, -10963, -2599, -30718, -23219, 15955, 8962, -24672, -49690, -64494, -83584, -39822, 19338, 10167, 14270, 26654, -20314, -51274, -36632, -2900, 21754, 891, 612, -7487, -13830, -10920, 16812, -34301, -42383, -46867, -39609, 10025, 1697, -35815, -29435, -7059, -12228, 25177, 27208, 12380, -5589, -1484, 17580, 37342, 4671, -17298, -7159, -9707, 10410, 26280, 9262, -6676, -25159, -5415, 59, 3539, 9354, -594, 14472, -10162, -37505, -40359, -23095, -4013, 16597, 42080, 62329, 83252, 48249, 29783, 13081, -18308, -42779, -55258, -22365, -14926, -56333, -27444, 13194, 35056, 67612, 112725, 113509, 90488, 16953, 22263, 74048, 58194, 76784, 108564, 103624, 94586, 60383, -5035]
8665e035J0111k9341L537K4518m0236k3737J3833N5827p879l819J0122K182k3278
8652a3195J8374j1708n7205L4089J2521K6696J7619K7649P022J1793L6479L708
8640A13842j9870l1999j5440j8853K0706L7591j5864j909l726m125l5055K9439
8628E4737N0722q223o855k3719k1859j6840q173N3558P924J3202N0326r971J0221
8615A45050L562K9029l0131K3163Q908j7787l1657J2585J3906K9986K6835q912
8603B04537K9911p29J9566j5729J8353K7385K777k8892o874q167K2686l415L8567
8590B99976K5082k6981j2415j7447m564J5839j1258n2943j3283k9168m8380l3461
8578I0997k0175K6875Q356n317L0739L2487j9244J0892K0849p464j7618r424J5371
$$ y = [-5035, 5076, -24265, -20728, 3790, -36446, -60183, -46350, 9477, 1598, -2221, 7901, 10083, -13195, 5179, -6529, -63734, -29645, -17124, 9572, 27191, 54840, 61862, 73655, 110134, 113842, 93972, 61973, 46533, 27680, 48386, 85977, 70113, 68204, 64478, 60353, 25298, 54737, 105459, 97236, 90381, 66662, 44803, 27963, 19790, 73348, 81272, 94474, 144800, 134829, 145050, 148612, 177641, 147510, 170673, 179581, 161794, 130137, 142722, 156628, 186614, 213449, 204537, 234448, 233719, 253285, 237556, 255909, 283294, 286071, 257179, 250305, 242138, 264824, 261409, 299976, 325058, 298077, 285662, 268215, 263651, 279490, 268232, 215289, 202006, 172838, 124458, 90997, 70822, 97697, 106053, 100736, 131475, 163962, 144718, 155610, 176459, 168995, 151377, 141953, 157324]
8565A57324L7254M9819L3931j504L463k8824m3911k7314P297K4294j3814m6730
8553A51285J0943k1505l560k1944o1105j1152J5149L5298O2728n432Q1N795o604
8540A49977j8275m3778k4474L417J4227O106j4586P018K7680J9801J3215k2093
8528A18235n4588j9141L2890L9649j2135P444K554J6719P652k269J7361J441j2641
8515A43171l1537m1714j4786J9042J7938l2515J4617K325k348p227M3315K2369
8503A32650j1934m2071l7569j4712J791P214j1135l3378j1664J6857J3794J5668
8491B5511o460l4642k986M0819K4929l318K7582N572j4764n694n301j2138k2898
8478A6212J7616J1449K8450k3318m1453J3634k635j0962J879J9181Q261j3822
$$ y = [157324, 194578, 244397, 278328, 276824, 280287, 251463, 207552, 180238, 187535, 211829, 198015, 151285, 162228, 140723, 137163, 115219, 54114, 42962, 58111, 93409, 156137, 150705, 150786, 156581, 149977, 131702, 87924, 63450, 66867, 81094, 87200, 72614, 79632, 107312, 127113, 140328, 118235, 63647, 44506, 77396, 117045, 104910, 112354, 114908, 131627, 139279, 137010, 154371, 155812, 143171, 111634, 69920, 55134, 74176, 92114, 59599, 74216, 76541, 74193, 66966, 110281, 132650, 120716, 78645, 41076, 26364, 28155, 35369, 24234, -9144, -20808, -3951, 9843, 25511, 19051, -15591, -18577, 22242, 47171, 43853, 71435, 77007, 62243, 56549, 51248, 39110, 16212, 33828, 45277, 73727, 50409, 8956, 22590, 19955, 8993, 10872, 30053, 38314, 24492]
8466B4492l6026l3762o705J8525J0741M6765K3319j6051R707L5143J4808j2631
8454G8325j3863O300k1666l3626r111K6943j1836m5551j77J3114Q378p682k161
8441a2613n465m14L2364j9550j5540J6384j8564r865R561M332J8059P229q809
8428b891k2911J0868J5217O759j5686J1559K2958k2711j5893j1307K3123Q0j18
8415i53O472J5358j6204m3402j9731q508L9717M0962k3948J228J7633o356l2480
8402c0212k0752R93K2598J4813R382J6376J5864J8937M645j8421Q496R431l9109
8389A3041l4942J8264J9460Q368M544j0326l4173j3919J2469K4785K3968l2192
8377f53l1584M331K0887N0558K9183m2753J317L9215p931l0419k5874l7175R070
$$ y = [24492, -11534, -45296, -52001, -33476, -22735, 24030, 47349, 31298, 41005, 76148, 90956, 78325, 64462, 70762, 49096, 15470, 6359, 33302, 21466, -24085, -24262, -11148, -2770, -10452, -12613, -18078, -18492, 13872, -5678, -21218, -4834, -23398, -33263, -23702, -19370, -1311, 5918, -2891, -25802, -14934, 283, 7042, -8644, 2915, 25873, 3162, -12731, -24038, -915, -835, -953, 5519, 20877, 4673, -38729, -58460, -66968, -27251, 13711, -10237, -9009, 8624, 2268, -30212, -50964, -49971, -27373, -12560, -3178, 13198, 29062, 47999, 52644, 34223, 42719, 52150, 13041, -21901, -3637, 15823, 24191, 28735, 18409, -15764, -29683, -17214, 7571, 31539, -653, -32237, -27906, -7019, 43539, 72722, 29969, 31286, 70501, 62570, 32151, 6277, -30898, -21828]
8364b1828R370N071K5424N6965k5620j2050j4303j7632N189j1353j4288n8438
8352g3493J2681L4295k147J2016L01j4549K412J1876J1141m2421o37K0040k9532
8339e8017r66L711K8242o152j8619L7702J8821l5257k039K4088L6509K4364q050
8326D4337o4820q084J3957q012M84K8777L2474k6736k1055k7100o907j1859j4685
8313f9229L242K0795N598j214m804o61r240J5461K5076J7084m804k6184n74L024
8299b6430j8199j1965k9252N512L2128L4393l021J5716K6807j4143j2747l1278
8287c2479L586j7949k1425k7273J2892J8955L4004l164r151M4540Q830n562j2125
8274f321k4445R771L7301P102k6915n1475L1693M3036K2979o291J2044p6193o1944
$$ y = [-21828, -12458, -7387, 18037, 75002, 49382, 37332, 23029, 5397, 10586, -767, -15055, -73493, -60812, -26517, -28664, -16648, -16347, -30896, -28484, -16608, -5467, -47888, -48525, -28485, -58017, -58983, -55272, -27030, -33182, -51801, -14099, 4722, -30535, -32574, -8486, 28023, 52387, 44337, -20483, -28567, -14610, -22622, -22138, 6639, 39113, 12377, -8678, -35778, -42685, -54544, -69229, -65987, -45192, -39594, -40808, -45612, -46273, -55513, -40052, -14976, 2108, -2696, -28880, -29454, -26430, -44629, -56594, -85846, -80334, -48206, -13813, -16834, -1118, 25689, 11546, -1201, -32479, -28893, -46842, -68267, -95540, -82648, -63693, -29689, -32853, -42004, 2536, 11366, 5804, -6321, -30766, -20995, 16306, 23408, -3507, -54982, -23289, 19747, 42726, 36435, 48479, -27714, -89658]
8261h9658P769J6548j3023n24J3239K6159j6263j1884N6098P016k747l409L6287
8248B5608K0423q580k318R937j2883K9444J4540j4892j5798l9447m9928K2764
8236b1130K5173M4735l606m2375k8917j7649J5508L0360l480M973P620l2554m3002
8223f4344K4744L3571L9806M2622n165j0875K4962j6482o529j8872m1723p164
8211e449N0385r383r067k3258j1201r249M90M7162K4988j1920k4457m236j746
8198A3059p571J1697R108J0687k3196o752J1264j5177l368J1886j9863k0795k5070
8185e4091K4503M924R872J6680K2529k476j7328j5133m0870k3364Q304L923K5823
8172c6704L1174P553R452r816M323J6197J6236j2577k1794n0520k0002M0986R980
$$ y = [-89658, -81889, -65341, -78364, -78888, -65649, -39490, -55753, -67637, -11539, -4523, -7270, -10679, 25608, 46031, 37451, 35133, 45070, 32187, 61631, 76171, 61279, 45481, 6034, -43894, -21130, 4043, 48778, 45172, 2797, -26120, -43769, -28261, 2099, -1381, 3592, 11212, -21342, -64344, -39600, -6029, 33777, 76399, 71234, 60359, 85321, 68839, 62310, 43438, 1715, -5449, 44936, 35553, 26486, 3228, -7973, -17222, -16732, 30430, 55418, 43498, 19041, 14805, 13059, 5488, 17185, 26293, 36980, 13784, 7032, 18296, 3119, -249, 11637, -8226, -29021, -54091, -29588, -24664, -14792, 1888, 24417, 21941, 4613, -10520, -51390, -74754, -66450, -62527, -36704, -5530, 2023, 11475, 1659, 5982, 22179, 38415, 25838, 4044, -46476, -66478, -25492, -15512]
8159a5512j0438l2402k2013L3038K4532K2146N0799r783n9171j6507K6834j138
8147i615n3844m3756M469k2807K1540N0391r80J0496o70K3547K2007m8669m260
8134e2151k321k2973M4910K4999k0386k6700k983K838K1335j3049J1618K3010
8122a1853O847j0909K9340L5971n541j4814r732l5903J7591J7239j6331m289k2440
8109b4824P489K5618J8058P880r551l1643k810j8506l1174J3571J2315O041O1769
8096C4233J397k0502K4128O991o7478l9703K0981L8987O146J5041M5273J3995
8084G9489m8731j616N96j24k1321j8155K348K2031J0032j5038K4945J4867l4732
8071A4591l8551m70K5340J8671o366l285L6210J0213k5430k1280J9503M155l8789
$$ y = [-15512, -25950, -58352, -80365, -47327, -22795, -649, 50150, 40367, -18804, -35311, -8477, -9615, -63459, -107215, -102746, -125553, -104013, -53622, -54602, -44106, -44776, -21229, 778, -47891, -52151, -54472, -77445, -32535, -7536, -27922, -54622, -57605, -54767, -33432, -46481, -34863, -11853, -5006, -15915, 13425, 49396, 43855, 29041, 19309, -16594, 997, 18236, 1905, -2384, -24824, -17335, 8283, 26341, 34221, 24670, -6973, -9783, -28289, -59463, -45892, -33577, -27536, 34233, 35630, 15128, 39256, 46247, -21231, -60934, -39953, -966, 5180, 20221, 65494, 79489, 30758, 29142, 29738, 29614, 8293, -9862, -7514, 14517, 24549, 9511, 34456, 49323, 14591, -23960, -24430, 910, 19581, 13215, 9930, 46140, 56353, 30923, 9643, 29146, 33301, -5488]
8058e488j0336K4980r757J4405j7307k5143J0961J9435n312R107O826P082K7716
8045D7169J6514k6814m0992J2755M896j3229J8761L3199K238K4442j2758K7860
8033I4041j1507m4024k0049o119k2561l427N7251r428J8433l3007j3467K2835
8021B8971K3151K6196J6423j2394l621k4540K1081k17j6036j3440R491K4941J1880
8008I1886k754k0608k5538K1892J5275m6045j3304N0519L6880l6361j0014L4142
7996I5970l3654l905L9064K51k3404j9432n33J608K5799k225L4723m90k8207P256
7982I2821j2708k082m7843K2414J6343L7823J3022j8290j8930r615J1969k5498
7970E9426p331K8906J3558J4366k084k5105k3107k6986L0972r246L772Q651J5887
$$ y = [-5488, -15824, 9156, -601, 13804, -3503, -28646, -17685, 1750, -3562, 5545, 12371, 19453, 47169, 63683, 36869, -4123, 8632, 13528, 299, 19060, 52259, 54497, 78939, 66181, 94041, 82534, 38510, 18461, 12342, -10219, -13646, 43605, 34177, 52610, 19603, 6136, 28971, 52122, 78318, 94741, 82347, 78726, 54186, 75267, 75050, 59014, 45574, 55065, 80006, 91886, 89132, 68524, 42986, 64878, 80153, 34108, 20804, 71323, 108203, 71842, 61828, 95970, 62316, 58411, 97475, 97726, 74322, 54890, 54357, 55965, 81764, 79539, 114262, 113772, 85565, 92821, 80113, 78031, 30188, 52602, 68945, 106768, 119790, 101500, 82570, 72955, 84924, 59426, 52095, 81001, 94559, 108925, 106841, 81736, 58629, 31643, 62615, 53369, 57141, 65792, 81679]
7957H1679N3278L5418J3248k917k2829R235m3174o0124k6129l4462K2194J0268
7945C5685L2001K3095k0245l4328j589j4319J055l612K9598L4144N463k0454K1006
7932H7500L940n1426o6331K014k1375M1384P4062n435k302O757k237n2283L3650
7919D7918L9957P0047j1654k5833l12k5834K4519K5110j6747k6974j8968R854
7907I1083J9356J1266l5691k1834K2157k3989j1571K2923K0372k9062n4458p404
7895C148K5403J1906J6990J3000j971l0677l017j4705l6522Q07M4598p97J2695
7882D0858q970k1608k1400K8414J2480j5567K3850J0776p741j0953k7432j2386
7870i679J4463p876r722Q708L0371l32l128j1585l8564m2014j0584k054L7130
$$ y = [81679, 134957, 170375, 183623, 180706, 157877, 167112, 123938, 63814, 37685, 3223, 25417, 35685, 67686, 90781, 70536, 36208, 34619, 20300, 21355, 17743, 47341, 81485, 86948, 66494, 87500, 91440, 40014, -26317, -24303, -45678, -4294, 69768, 64333, 62031, 68788, 66551, 14268, 47918, 87875, 157922, 146268, 120435, 120123, 94289, 118808, 143918, 127171, 100197, 81229, 91083, 110439, 121705, 86014, 64180, 86337, 62348, 50777, 73700, 94072, 65010, 10552, 3148, 28551, 40457, 57447, 70447, 68476, 37799, 34782, 20077, -16445, -15638, 28960, 28163, 40858, 31888, 10280, -11120, 17294, 29774, 14207, 38057, 48833, 41092, 30139, 2707, -9679, 4784, -3092, -12814, -4106, 26265, 25933, 22805, 11220, -27344, -69358, -79942, -81996, -44866]
7857d4866K1316O431j0184j5138K41K3402k112j5321L3974J9076J1950K5358l2800
7844B1327j9596J770K8990J1160k5988l0578K269k485k0376Q845K9003K9707k1533
7831A2515j4558k3006j9851K7958K2819m4157j6323K6966j1531l3050k3023L926
7819i1315J7750M507J6088J5107M1793p969L724K7811l3983J0305m830k786k9408
7806c3206k6398O755K071K385K6476J8429o718L622k5117k1904J1765K0398K9388
7793G946J9701q493m4624J8638l8662l1179L5272J8651L4722M947L146r453k5473
7780a4861r520J7043J9185j5613j0071q695O702L9502K0575l6479j7512J3536
7768C792L2462J30j5892Q346k4637q642m1939K6593L3321j2244n510r490j9729
$$ y = [-44866, -23550, -17119, -27303, -42441, -42200, -18798, -20910, -36231, -2257, 16819, 28769, 54127, 21327, 1731, 3501, 32491, 43651, 17663, -12915, -10646, -13131, -33507, -24662, 4341, 34048, 12515, -2043, -25049, -44900, -16942, 5877, -38280, -54603, -27637, -39168, -72218, -95241, -91315, -73565, -69058, -52970, -37863, 3930, -4039, -315, 27496, -6487, 3818, -1012, -3798, -33206, -59604, -52849, -50778, -48393, -21917, -3488, -10206, -6584, -31701, -53605, -41840, -21442, 7946, 27647, 19154, -25470, -6832, -45494, -76673, -41401, -22750, 11972, 16919, 20065, 10612, -14861, -24381, -7338, 11847, -3766, -13837, -22532, -15830, 23672, 44247, 7768, -9744, 3792, 36254, 36384, 20492, 28838, 4201, -4441, -46380, -19787, 13534, 1290, -4220, -13710, -33439]
7755c3439r878O147J0663O029j8924K1352Q452j1345k182m389N267n554m0615
7742f8416L174r162L2161K9624m7645k2699M4099L6800j7410l7039k3669J4129
7730f6053J6407k8497k790K9375L0612M4936J9385k6434l4222o955j1194k3583
7718e9013j7659K8820J0717j5240Q507j8283M4059J7360k4583R31Q552L1744L1345
7705D7257J9545L859k030j448k4409k3901l0592j5532K7451r984R156K3205J3119
7692C5696k6915j5206j8111k1821J6095J0186m265L8598q636m7261k3245J609
7680f3276k619L2963J7845j8408j4285k5104m8113M2181K4128p020P081J9978
7668c4649J255j8468m415j3947K6691J8063J00K4438J8430K8882K282K0084P205
$$ y = [-33439, -43317, -37170, -26507, -20478, -39402, -18050, -9598, -20943, -23125, -27514, -22247, -27801, -68416, -65242, -74404, -42243, -12619, -60264, -82963, -38864, -2064, -19474, -56513, -80182, -66053, -49646, -78143, -80933, -51558, -20946, 23990, 43375, 16941, -17281, -24236, -35430, -59013, -76672, -47852, -37135, -52375, -43868, -62151, -18092, -732, -25315, -24384, -15832, 15912, 47257, 66802, 70661, 68631, 67183, 42774, 18873, -11719, -27251, 200, -9784, -628, 22577, 35696, 8781, -6425, -24536, -46357, -30262, -20076, -24341, 14257, 5621, -41640, -64885, -63276, -65895, -32932, -15087, -33495, -47780, -72884, -120997, -78816, -54688, -61708, -54627, -34649, -33394, -51862, -56277, -70224, -43533, -25470, -25370, -932, 17498, 46380, 48662, 68746, 75951]
7655G5951l6835m3827j2503J5471p11O736p341n052j1717j3106J9574K3143K2535
7642C2318l1560k0591r732N593m9863k9453J0295K8820J9571J9893r531q141o64
7629d3045j49n830j1103j75Q2263J3294p201l177j1500n0667j4246K3501r168
7616c7203P559J688P891K9713l2705j9743n309Q185K3449J3762J0330L441o074
7603D984k2167o9623m4673M3752M3965l9427J1816L3015L5640K7832j6296l3185
7591b4367Q879Q478J033L639j4763q083K6892m482J1795J0696M235l2779l3992
7578d2819k6303k5375N0488K7146o170m7999m390J0895Q564J0356n789k3823J3857
7565f1362M2263j7171l2151J2197M6102O387k5944K0467K0068J2131q006m0915
$$ y = [75951, 39116, -4711, -17214, -1743, -2454, 4282, -3059, -8111, -19828, -32934, -13360, 9783, 32318, 758, -19833, -29565, -23972, -73835, -103288, -92993, -64173, -44602, -24709, -34240, -42381, -43045, -43194, -49024, -60127, -60302, 21961, 35255, 28054, 24877, 13377, -37290, -51536, -28035, -37203, -29644, -27956, -20065, 9648, -23057, -42800, -48109, -39924, -16475, -2713, 7617, 11058, 4984, -17183, -86806, -131479, -87727, -43762, -83189, -71373, -38358, -2718, 25114, 8818, -24367, -15488, -7010, -5977, -2338, -17101, -25184, 1708, -2774, 9021, 19717, 23952, -8827, -42819, -69122, -94497, -44009, -16863, -23033, -71032, -75422, -64527, -55963, -45607, -51396, -75219, -61362, -19099, -36270, -68421, -56224, -10122, -3735, -29679, -9212, 10856, 22987, 14981, -25934]
7553b5934k2630R102J1340o968j6749J8497j4347j6074m5627M9999K6611k838
7541c5618Q947j0691j4128K3766r697L523k473L383N0530O0857J7944m2535l3973
7528A9835m1743j7145j6656J454M8266j9445j0454M668Q913J8763M902K0549k754
7515A9153k5092m2511L4215J218p951K4470k242j0556N445j4687J5868R809M318
7502A1457J2134k8716j0633K624M9478J2142j567o383r689J3119J5248m5521k5883
7489a2190J8914j2491k1584J0329L7633K5288j6889l2551N68J5321O30j1829P114
7476H263J5120o1132n4190j7186K0385L9727J5884o281M00N049m7204l5975M0351
7463g6789J9512O294J0701l3472M2193M0937n0079k4011M259M0787L1475J047
$$ y = [-25934, -48564, -39462, -28122, -35090, -51839, -33342, -47689, -63763, -109390, -59391, -32780, -35618, -26671, -37362, -51490, -27724, -37421, -33898, -36371, -32988, 17542, 78399, 96343, 53808, 19835, -21908, -39053, -55709, -54255, -5989, -25434, -35888, -31220, -22307, -3544, 1358, 21907, 19153, -5939, -48450, -14235, -13017, -20968, 3502, 1260, -9296, -3851, -18538, -2670, 7139, 11457, 23591, -5125, -15758, -13134, 36344, 48486, 46919, 40536, 30847, 43966, 59214, 13693, -12190, 6724, -5767, -27351, -17022, 20611, 45899, 29010, -3541, -2973, 12348, 12978, 1149, 8263, 23383, -37749, -91939, -109125, -88740, -49013, -33129, -39410, -39010, -33961, -81165, -117140, -76789, -57277, -50983, -40282, -73754, -31561, 9376, -40703, -64714, -60455, -19668, 11807, 12854]
7451A2854m951k4737j2825R942k6506j9830m0K9538K8653L1537L0514J3390m9178
7438A8361o6159K6636N6748O711j9452J9433J103P435m03k8508m7797L638L6975
7425A4721J0899l6886K2165K4321J126J7956l2897k4829l6124N099J5717k860
7413b1592m3718k6433J852L2489J1092j323L3547n765n436L319J6235m641J2422
7400B048J1074l3137k3411n272J0041J4555q182m1756L5908L6937Q962m3188K1467
7387a3954m695l3745p136j4871J456L4694J3109r63K2257K3397j2880O308R083
7374B2060J2298J7592j3620n570j7529j1354K263m330k8405K0620k8178Q122O423
7361a9608k8551L5345M881j8301l5705j3076J7952N6114k2291j1538K203P070
$$ y = [12854, 7903, -16834, -29659, -19717, -46223, -66053, -66093, -36555, -7902, 23635, 54149, 67539, 18361, -47798, -21162, 35586, 42297, 22845, 42278, 43381, 50816, 50413, 21905, -25892, -22254, 14721, 25620, -11266, 10899, 35220, 36346, 54302, 21405, -3424, -39548, -34449, -18732, -21592, -65310, -91743, -89891, -57402, -46310, -47633, -14086, -19851, -25287, -21968, -5733, -10374, 2048, 13122, -20015, -43426, -48698, -38657, -24102, -32284, -74040, -38132, -1195, 7767, -35421, -13954, -18649, -52394, -59530, -74401, -72945, -38251, -25142, -26105, -3848, 19549, 6669, 12977, 22060, 34358, 51950, 38330, 32760, 15231, 3877, 6140, 1810, -26595, -5975, -34153, -26031, -19608, -48159, -12814, -7933, -26234, -61939, -75015, -57063, -949, -23240, -34778, -32575, -25505]
7349b5505j5245J8269j3299n224K5403O226K8893j5081j7100Q765J4716K5127
7337C5945o753o2317k9370L1594J5099j9779k4257j0690J1639K386N60J7465M4081
7324E603p961j3083O3805j6385n1468j6862L7656j210k035M040m609J2960P626
7311A8077j3461m2217n148L8235o786J0088K1094P943k4086j9426j448Q417j3186
7298b1904q223Q166k6826n859N984J2779K3097N825j6502K6786J9158J1438m4597
7285a0678o0358J5072L5330k3740j9366j0117K9544J7451O719p863j4099L537
7273c8568L5848M2675n445J5601m0923k1925j110l4351l267J8679j6987J4073
7261c5700L9958J3474k3085l7176k1866Q616N130L143L262q574l2001K3580O8803
$$ y = [-25505, -40750, -22481, -35780, -41004, -15601, -9375, 19518, 4437, -12663, -3898, 10818, 35945, 29192, -33125, -62495, -30901, -15802, -35581, -59838, -70528, -58889, -56503, -55943, -38478, 5603, -2358, -15441, 48364, 31979, -19489, -36351, 1305, 95, -1940, 2100, -2509, 10451, 18077, 4616, -37601, -42749, -4514, -11300, -1212, 19882, 27825, 3739, -15687, -17135, -8718, -21904, -30127, -21961, -48787, -54646, -48662, -35883, -12786, -6961, -23463, 3323, 22481, 33919, -10678, -71036, -55964, -20634, -44374, -63740, -73857, -44313, -26862, -20143, -28006, -42105, -38568, -2720, 39955, 34510, 50111, 9188, -12737, -13847, -48198, -51465, -32786, -49773, -35700, 4258, 17732, -5353, -42529, -64395, -55779, -50649, -47506, -44244, -52818, -84819, -61239, 7564]
7248G564M3068j7886k6776M246J6259j3134k5807K3539k3211j1645R833K3292
7236I342j1805l1073M0209J043k0049m0272L100K1585M4623J3511m110j9861k2436
7223a6193M272j9414r08L647J449Q554K8969R941k5678o2476j3506M5488O823
7210b9032l604l8948K303L8308J1638k9911Q122O312j7008R0J3090O754l0577
7197f2463k1721o838K438J7985L3939N5345n3538q4017J1825L6160K1499L4679
7185a4707J2424j2525j8990K0850N8778J3560l5976l9100j0652M5981K0855P369
7173D7867J8961k9393l9633l4448K1751J8931j3947j4639j0342l4542l5903k4851
7161a30188L7981L6983J0288J852K4148J7488o957k2558k9455k033N4295M2407
$$ y = [7564, 50632, 32746, 5970, 10216, 26475, 13341, -12466, 11073, -12138, -23783, -13950, 9342, -2463, -33536, 6673, 7716, -12333, -52605, -49505, -27920, 16703, 30214, 26104, 6243, -16193, -11921, -31335, -32243, -28596, -27147, -18593, 10376, 20317, -5361, -67837, -81343, -35855, -29032, -32636, -71584, -69281, -30973, -19335, -49246, -41124, -34812, -51820, -51730, -38640, -31886, -62463, -84184, -91022, -88584, -70599, -36660, 18685, -34853, -118870, -107045, -70885, -49386, -14707, -2283, -14808, -33798, -12948, 45830, 59390, 23414, -15686, -26338, 19643, 40498, 47867, 66828, 37435, -2198, -36646, -14895, 4036, -9911, -24550, -34892, -69434, -105337, -130188, -92207, -55224, -44936, -43084, -18936, -1448, -8405, -30963, -60418, -62451, -8156, 34251]
7149C4251l3113o2945k2189K9570L4376k3743o568J2282j1179P606k792P894L736
7136c2814J7934k8654j8456K0559k9750L4826K3475r483J9001P52Q27J8818l0548
7123a3513m0949J5791O0894M814r994p344j9623l0062j1482K6809L128l919j2272
7110c7722K5323J5412j9576l1630q250k40N3705J9452m1175n994O593K1115L2282
7097B9295J6989k1139j1683j5176l1572J6950L2725k0559k4916N2996J8445l3960
7085H395n1836j5396J9027N256j6779J4750J5186K9010j0532j2689J226Q030j278
7072g630k534k721p730N861J8238J5411k6939k1337Q552P237K9238j0927k5834
7059b1115n1792J2138L5468L336k0828N2278J3740n4951j5794R05M2520r462k4942
$$ y = [34251, 1138, -61807, -83996, -54426, -20050, -43793, -50361, -38079, -49258, -41652, -44444, -36550, -32814, -14880, -43534, -61990, -41431, -71181, -36355, -12880, -22363, -3362, -2610, -1783, 17035, -13513, -54462, -38671, 22223, 27037, 17043, 9699, -9924, -39986, -51468, -24659, -21531, -25450, -37722, -12399, 3013, -16563, -48193, -56443, -56683, -2978, 16474, -24701, -30695, -24102, -2987, 29295, 46284, 25145, 13462, -1714, -33286, -16336, 16389, -4170, -29086, 23910, 42355, 8395, -43441, -58837, -39810, -34554, -51333, -36583, -21397, 7613, -2919, -15608, -14382, -6352, -7630, -10164, -12885, -20615, -14754, 3484, 18895, -8044, -29381, -20829, -13592, 15646, 4719, -21115, -72907, -60769, -25301, -21965, -42793, 9485, 23225, -31726, -47520, -46615, -4095, -13557, -38499]
7046c8499K6707m036k6478k1762k928N3628j1219j8617m6142k895K0675P479R08
7033f3179k2262M8558k886K0381J41k4617p184j6525m0512j7615L1738J6475j4843
7020i2330L1170K1154J0101K8318J553j7333J0999P055j772k6077j7754j019J2640
7007c3295P6K0285p362J0515K956N384l6442K1738M0585K4002k2926n3503n0102
6994g8089J9331K1445l019p917l893K1772J8937L219j3032j4946L4154K043J8841
6981A8846j1976m8762Q583J5916k484l0949l3589J7468L0438M6449j8513n5981
6969f4554k0149L1384j1045J6541k664K1947K7703j0819l3617J6825m652l1544
6957f4644k7627p193L674l258J45P53K9133j3366L4192L6102J2968Q677o058l9513
$$ y = [-38499, -11792, -15828, -42306, -64068, -66996, -13368, -24587, -43204, -89346, -92241, -71566, -64087, -63179, -85441, -36883, -39769, -19388, -19247, -43864, -51048, -67573, -108085, -125700, -93962, -77487, -92330, -61160, -40006, -29905, -1587, -34, -17367, -6368, 687, -1085, -27162, -44916, -45935, -33295, -33219, -12934, -20296, -9781, -6825, -1441, -37883, -16145, 24440, 48442, 25516, -27987, -78089, -58758, -37313, -40332, -48249, -52142, -30370, -11433, -8214, -21246, -36192, -2038, 5, 18846, 6870, -41892, -33309, -17393, -19877, -50826, -84415, -66947, -36509, 9940, -8573, -64554, -84703, -53319, -64364, -47823, -50487, -28540, -837, -11656, -45273, -28448, -33100, -64644, -92271, -99464, -95790, -99048, -98903, -98150, -69017, -82383, -48191, -12089, 879, 9556, 3498, -36015]
6943c6015k3296J989r176m858L738J8304K8051j5564m973L9264j841k5241J1406
6930a8212L1505K1914O156J694k2845p199K7892L0744l8994j7114Q395n877k0868
6917b809k4367l8033K396J7307l731J2647j623j2251N9979L9096l1013m8069l9992
6904g0463k0135L8425L0583K8584J2680j453k7407o4017M093J5798P58R382p782
6891e0954J325L2207M9828k3105l5051j3979M9132L2616j0633m2769k7887J4053
6879b5217M157N0662n710K739M63J0269j5747K689K3327l4222Q07R980R245K4858
6865E8300K8699o289n1725l6062q3j2309J1209J9425o610J8100k7568l3317M338
6852c3892J423m1905K3290L8427o937N3555J1551k3927q5587j7393M6816L5063
$$ y = [-36015, -59311, -57322, -66498, -71356, -67618, -49314, -21263, -36827, -41800, -2536, -4377, -29618, -18212, 13293, 35207, 41363, 43057, 20212, 13013, 40905, 71649, 32655, 15541, 23936, 18059, -2809, -27176, -65209, -62813, -45506, -49237, -36590, -38213, -50464, 9515, 48611, 17598, -30471, -70463, -90598, -52173, -21590, 6994, 19674, 18221, -9186, -73203, -69110, -53312, -52554, -43172, -50954, -49629, -17422, 32406, 9301, -25750, -39729, 9403, 42019, 31386, -11383, -39270, -25217, -21060, 29602, 23892, 26631, 27094, 37363, 21616, 24305, 47632, 13410, 14217, 24197, 33442, 58300, 86999, 80710, 28985, -7077, -7160, -19469, -8260, 11165, 4555, 22655, -4913, -38230, -33892, -32469, -74374, -51084, -12657, -19594, 33961, 45512, 21585, -64002, -81395, -34579, 484]
6840D84k5097l3178K4655O1443N589l6051n3394j3275M5426J5970m1505m982J4138
6827c9777K8140k961K986J9015L1616l045p910m734J3957l6898l8521j492k295
6814d1919r7M388J9345M5052K7260k6813k2838j8004K3866J3061k763R66l9199
6801a7695l0936L4156J8175j015J2269O239J8297L1272J3665l4718n9078L554
6789e815L2380j4157j9648k9369o178J059m9143j465N7822J1605j6862k4034j4775
6776g8580L7850K9790l679K869l4887l383j9710q670R768Q097O2921K0971K315
6763B5672k2362M233L3165K6098r589n7117j9418L6267p19k9086j2230K4098J6778
6750A5790k8016j9176K0239J6183J740J5271J3026m322j6621j0428R043K4052
$$ y = [484, -24613, -57791, -33136, 28307, 33896, -2155, -55549, -68824, -23398, -7428, -48933, -53915, -39777, -11637, -14598, -11612, 7403, 39019, 35974, 28064, 23330, 37287, 389, -38132, -39624, -41919, -42016, -37628, -18283, 26769, 54029, 27216, 4378, -13626, 10240, 23301, 20538, 21504, -17695, -48631, -14475, 3700, 2685, 14954, 21193, 39490, 70762, 84427, 49709, -9369, -5815, 26565, 12408, -7240, -36609, -42787, -41728, -90871, -92336, -34514, -22909, -39771, -63805, -78580, -40730, -10940, -14619, -11750, -46637, -50020, -69730, -78400, -68632, -60535, 2386, 23357, 25672, 3310, 7543, 40708, 66806, 57217, 100, -19318, 16949, 16230, -12856, -25086, -988, 15790, -12226, -31402, -11163, 5020, 6760, 22031, 35057, 30735, 14114, 3686, 12729, 36781]
6738C6781J7105l6944o652m673J6534N0449k2150m633j9207l5237J0615K3789
6726B5777L506j5369k6109j4712M5511J7205k8003l0289l2098L781q70q779K9870
6713c0579j3717j0877K2293J8920j4981J6742R479L8988K5168q759o8787l0908
6701d7018J4903N5437M1706k7717m9106J523L7634R453J5528j0529l3662L6041
6689D4193J4434n2056k5440q561j1074p07L897n3963j0835L1750M2420N200M3456
6676B2714K7719j7177Q919J0590k5129l4654l280j5307j8277j3246L2003J3498
6664a1627j8618J9557J5190p113k0801j0403k578L6261n076k1098j6338j5801
6652e8445N0561L5185J7401j5478L417J9059m68m5036k194J62k6384q39k542J8005
$$ y = [36781, 53886, 16942, 10290, 5617, 22151, 72600, 50450, 45817, 26610, -8627, 1988, 25777, 29283, 13914, -12195, -26907, 18604, 35809, 7806, -22483, -54581, -50800, -51670, -60449, -30579, -44296, -55173, -32880, -13960, -28941, -12199, -2720, 36268, 61436, 52677, -16110, -47018, -32115, 23322, 65028, 37311, -11795, -10272, 27362, 36815, 52343, 41814, 8152, 44193, 58627, 6571, -18869, -27430, -38504, -39211, -35314, -89277, -100112, -68362, -25942, -20742, 22714, 50433, 33256, 42175, 52765, 27636, -7018, -10298, -25605, -43882, -57128, -25125, -11627, -30245, -10688, 4502, -2611, -23412, -33815, -36393, -132, -5208, -26306, -42644, -58445, -7884, 27301, 44702, 29224, 32641, 51700, 51232, 6196, 4002, 4164, -22220, -23059, -25601, -7596]
6638g596l2610M190L2689J9238r48l094L9472j2108l3445K7664n967j0512L139
6625B0112L1468J2835q8375J1933N8759k6702m367J1949K9634J10j9225P518P119
6612E2768K405K2871l0752p260q441N282N479j8671l3790l1412j5997k31J9366
6599c8383J3647J9743j7081k7086J1195J7661o722R953L5890j0113l5145j7793
6587d4234L8287J5973J0533L0966j1315j5161k2862k7229R348j131m0927M3455
6575a4297M2550o574j3111O125J6864L3216l6480o1519n174l432K7666j5544k518
6562c2228J8228J7492k7224k2231L9582J2860J0722L1345k2884l3547J7979k9920
6550a9826k979J0207J1050j3247R148M3739l0353k0182j1493j9954j8278O789
$$ y = [-7596, -40206, -36016, -3327, 15911, 14963, 11869, 51341, 39233, 5788, 33452, 27485, 16973, 20112, 51580, 64415, -23960, -12027, 46732, 20030, 15663, 27612, 57246, 57356, 38131, 45649, 52768, 55173, 78044, 47292, 40032, 31591, 36873, 42352, 23681, -10109, -41521, -57518, -57749, -38383, -24736, -4993, -22074, -49160, -37965, -20304, -27026, -17073, 18817, 8704, -26441, -44234, -5947, 10026, 20559, 51525, 40210, 25049, 2187, -25042, -15694, -16825, -57752, -14297, 28253, 21679, 8568, 14693, 31557, 64773, 28293, -33226, -38400, -41832, -14166, -29710, -32228, -14000, 3492, -23732, -45963, -6381, 6479, 17201, 48546, 25662, -7885, 10094, -19826, -22805, -12598, -1548, -14795, -5647, 38092, 7739, -12443, -23936, -43890, -62168, -55379]
6538e5379J1544r891k7115P410J3577K793K0346J2652L3564j8499j650K2665J098
6525A3115o990k3264j4516M7262N276n1157l8169j3456K0193J4271L0032o551
6513b3954J1259q377j4221q045k889J3026j074M1609J4945J0726N353L79p014
6500C1723j6139L912J6992J0266l32k8056J4500K7024l440n5436l6817J0402O7612
6487D2211J112o072N871j986K5447l574m7217l2696j0641J9050L0086l5063O276
6474g196L6068L9439l935j700K3213j3133l9346o4166j3056L7660O953J0240R350
6461B0391r612m0562k0513J2978L6604L1662j0317J2686J0318l680o0577L490
6449a7132r905j2372J2588L4737m480k6118M840j1506O416K3059k1251m6053J3875
$$ y = [-55379, -43835, -53726, -80841, -73431, -59854, -57061, -36715, -24063, 9501, -8998, -10648, 12017, 13115, 6125, -17139, -31655, 15607, 20883, -30274, -68443, -81899, -61706, -47435, -17403, -23954, -12695, -21072, -35293, -43338, -46227, -33201, -34275, 7334, 22279, 33005, 38358, 38737, 31723, 15584, 19496, 36488, 46754, 46422, 18366, 32866, 59890, 56450, 1014, -35803, -25401, 42211, 43323, 37251, 43122, 41136, 66583, 63009, 15792, -16904, -27545, -8495, 21591, -13472, -7196, 28872, 68311, 64376, 62676, 85889, 72756, 33410, -30756, -43812, -6152, 801, 11041, 20391, 10779, -29783, -50296, -37318, -714, 30948, 20631, 33317, 43635, 39955, -20622, -17132, -27037, -39409, -26821, 7916, 3436, -22682, -17842, -29348, -22932, 127, -21124, -67177, -53302]
6436e3302P281J2689K3506Q375K0766P318L219k394k9045j3289L3519M3810J7412
6423G9865r963n4918l214J6067l4382r193j2885j2479M0120M3499P426p729p268
6410C4946L866m892m8023P838O686m8916J2327K7241J7809O258m3455j8144q911
6397e5370q923M5111O4894L3812K2340n53l8438j8314J3145j6442m2100K2037
6385B1199J0112k7388P41r931j7526N187K2477k379Q101j4314J5576K2403j6393
6372A7865m137q183k4899p740O604R941j283k2502k9045K3695K6187r590K3771
6359F84j3911N2O570m58J0250J3997q009j0980L377l8902k1188o369j3799l0869
6345a09555L2773O8572J3160N675k0034o760K5507J4973K2334r939n2443k1344
$$ y = [-53302, -46021, -33332, -9826, -1451, 19315, 26633, 29852, 27458, -1587, -14876, 18643, 62453, 79865, 69902, 14984, 11770, 27837, -6545, -15738, -28623, -41102, -982, 42517, 49943, 42214, 34946, 38812, 33920, -14103, -6265, 421, -48495, -36168, -8927, 8882, 15140, -28315, -46459, -55370, -64293, -19182, 45712, 79524, 101864, 101311, 62873, 44559, 57704, 41262, -838, 21199, 31311, 3923, 4664, -5267, -22793, -17606, 4871, 2492, 10593, -3721, 11855, 34258, 17865, 13728, 5545, -19354, -27094, -20490, -10549, -11832, -34334, -63379, -39684, -13497, -23087, 684, -13227, -13175, -6605, -7063, 3187, 17184, 9175, -1805, 1572, -37330, -58518, -64887, -78686, -109555, -76782, -8210, 4950, 10625, -9409, -16169, 9338, 24311, 46645, 36706, -15737, -37081]
6333c7081J3880j0789k5384P012J9286N491k9200j8097K4597M8508k8086j2422
6321d2285j1422J8353J3488J6931K3920r688m6436J1335M0314J9933M110j4175
6309B4378l8869j3048P133J2215K3781P153J2942J6599l9889j8704L655L2169
6297B9515J4441J5170q992n478j9792l8033R986J643L940k5405j2323j2438K1966
6284b5800K321k1440k128j8489k5929M1694J9867O9584M123N030M2976p171n2912
6271C1726k8499j0888R048K964j985j249m389j4492l2134L1832J0427j4027J3228
6258h438J2495M5556k4265k6347j7486J1306p109j3386r561q468M9209L902j5912
$$ y = [-37081, -23201, -33990, -59374, -52362, -33076, -27585, -56785, -74882, -50285, -1777, -29863, -42285, -53707, -35354, -21866, -4935, 18985, 9297, -37139, -25804, 14510, 34443, 38553, 24378, -14491, -27539, -20406, -8191, 15590, 22743, 35685, 52284, 12395, -6309, -2654, 29515, 43956, 59126, 50134, 44656, 24864, -13169, -3183, -1540, 2400, -23005, -35328, -47766, -25800, -23479, -44919, -47047, -65536, -91465, -49771, -29904, 39680, 43803, 48833, 91809, 84638, 31726, 3227, -7661, 1387, 4351, 2366, 1117, -3272, -17764, -49898, -18066, -7639, -21666, -8438, 4057, 49613, 25348, -999, -18485, -7179, -14288, -27674, -37235, -45703, 3506, 7408, -8504]
$$ [...]
##END NTUPLES=NMR SPECTRUM
##END=
