##TITLE=Analysis number 313628
Compound Code cc 40113
Book Reference 350/180/1
Project Code adrs
Chemist Name chrisr
##JCAMPDX= 6.0         $$ Bruker NMR JCAMP-DX V2.0
##DATA TYPE= NMR SPECTRUM
##DATA CLASS= NTUPLES
##ORIGIN= Bruker BioSpin GmbH
##OWNER= NMR
$$ XWIN-NMR		Version 3.5
$$ Thu Sep 15 09:27:42 2005 GMT Daylight Time (UT+1h)  MAYBRIDGE\NMR@NMR_250MHZ
##.OBSERVE FREQUENCY= 250.131544655141
##.OBSERVE NUCLEUS= ^1H
##.ACQUISITION MODE= SIMULTANEOUS (DQD)
##.ACQUISITION SCHEME= undefined
##.AVERAGES= 16
##.DIGITISER RES= 18
##SPECTROMETER/DATA SYSTEM= dpx250
##.PULSE SEQUENCE= zg30
##.SOLVENT NAME= CDCl3
##.SHIFT REFERENCE= (INTERNAL, CDCl3, 0, 16.522)
##AUDIT TRAIL= $$ (NUMBER, WHEN, WHO, WHERE, WHAT)
$$ ##TITLE= Audit trail, XWIN-NMR		Version 3.5
$$ ##JCAMPDX= 5.01
$$ ##ORIGIN= Bruker BioSpin GmbH
$$ ##OWNER= NMR
$$ C:\u/data/dgb/nmr/ADRS/9480/pdata/1/auditp.txt
$$ ##AUDIT TRAIL=  $$ (NUMBER, WHEN, WHO, WHERE, WHAT)
(   1,<2005-09-15 09:27:23.47 +100>,<MAYBRIDGE\NMR>,<NMR_250MHZ>,
      <created by zg, POWCHK disabled, PULCHK disabled
       configuration hash MD5:
       62 19 C7 07 E1 42 D1 B7 37 6C 3D D0 77 39 F9 E6
       data hash MD5: 64K
       6B 30 C2 C1 88 29 FF 88 5E 36 43 C5 80 95 80 77>)
(   2,<2005-09-15 09:27:34.08 +100>,<MAYBRIDGE\NMR>,<NMR_250MHZ>,
      <Start of raw data processing
       ef LB = 0.3 FT_mod = 6 PKNL = 1 SI = 32K 
       data hash MD5: 32K
       97 AC E2 65 57 56 1F CA DF C6 8A C1 2E 4A 9B C9>)
(   3,<2005-09-15 09:27:35.94 +100>,<MAYBRIDGE\NMR>,<NMR_250MHZ>,
      <apk 
       data hash MD5: 32K
       2B 74 B9 A8 9E B7 8F BB B0 52 80 88 09 C1 C1 49>)
(   4,<2005-09-15 09:27:36.85 +100>,<MAYBRIDGE\NMR>,<NMR_250MHZ>,
      <abs ABSG = 5 
       data hash MD5: 32K
       D4 F6 37 B5 12 24 5D B5 54 9D 95 E8 51 3C 4E 72>)
$$ ##END=
$$ 
$$ hash MD5
$$ 26 A6 FC B4 A6 BA 4F D5 F5 9C 28 4D BF 6D 55 7E
##$RELAX= 
##$RELAX= 
##$RELAX= 
##$RELAX= 
##$RELAX= 
##$RELAX= 
##$RELAX= 
$$ Bruker specific parameters
$$ --------------------------
##$DU= <C:\u>
##$EXPNO= 9480
##$NAME= <ADRS>
##$PROCNO= 1
##$TYPE= <nmr>
##$USER= <dgb>
##$AMP= (0..31)
100 100 100 100 100 100 100 100 100 100 100 100 100 100 100 100 100 100 
100 100 100 100 100 100 100 100 100 100 100 100 100 100 
##$AQSEQ= 0
##$AQ_mod= 3
##$AUNM= <au_zg>
##$AUTOPOS= <3 >
##$BF1= 250.13
##$BF2= 250.13
##$BF3= 250.13
##$BF4= 250.13
##$BF5= 500.13
##$BF6= 500.13
##$BF7= 500.13
##$BF8= 500.13
##$BYTORDA= 1
##$CFDGTYP= 0
##$CFRGTYP= 5
##$CHEMSTR= <none>
##$CNST= (0..31)
1 1 145 1 1 1 1 1 1 1 1 1 1 1 1 1 1 1 1 1 1 1 1 1 1 1 1 1 1 1 1 1 
##$CPDPRG= <>
##$CPDPRG1= <>
##$CPDPRG2= <>
##$CPDPRG3= <>
##$CPDPRG4= <mlev>
##$CPDPRG5= <mlev>
##$CPDPRG6= <mlev>
##$CPDPRG7= <mlev>
##$CPDPRG8= <mlev>
##$CPDPRGB= <>
##$CPDPRGT= <>
##$D= (0..31)
0 1 0 0 0 0 0 0 0 0.06 0 0 0 0 0 0 0.0002 0 0 0 0 0 0 0 0 0 0 0 0 0 0 
0 
##$DATE= 1126772842
##$DBL= (0..7)
120 120 120 120 120 120 120 120 
##$DBP= (0..7)
150 150 150 150 150 150 150 150 
##$DBP07= 0
##$DBPNAM0= <>
##$DBPNAM1= <>
$$ [...]
##$SUBNAM7= <"">
##$SUBNAM8= <"">
##$SUBNAM9= <"">
##$SW= 20.6930455092707
##$SWIBOX= (0..15)
0 0 3 0 0 0 0 0 0 0 0 0 0 0 0 0 
##$SW_h= 5175.983436853
##$TD= 65536
##$TD0= 1
##$TE= 295.16
##$TE2= 300
##$TE3= 300
##$TEG= 300
##$TL= (0..7)
0 120 120 120 120 120 120 120 
##$TP= (0..7)
150 150 150 150 150 150 150 150 
##$TP07= 0
##$TPNAME0= <>
##$TPNAME1= <>
##$TPNAME2= <>
##$TPNAME3= <>
##$TPNAME4= <>
##$TPNAME5= <>
##$TPNAME6= <>
##$TPNAME7= <>
##$TPOAL= (0..7)
0.5 0.5 0.5 0.5 0.5 0.5 0.5 0.5 
##$TPOFFS= (0..7)
0 0 0 0 0 0 0 0 
##$TUNHIN= 0
##$TUNHOUT= 0
##$TUNXOUT= 0
##$USERA1= <user>
##$USERA2= <user>
##$USERA3= <user>
##$USERA4= <user>
##$USERA5= <user>
##$V9= 5
##$VALIST= <valist>
##$VCLIST= <CCCCCCCCCCCCCCC>
##$VD= 0
##$VDLIST= <DDDDDDDDDDDDDDD>
##$VPLIST= <PPPPPPPPPPPPPPP>
##$VTLIST= <TTTTTTTTTTTTTTT>
##$WBST= 1024
##$WBSW= 4
##$XGAIN= (0..3)
0 0 0 0 
##$XL= 0
##$YL= 0
##$YMAX_a= 346080
##$YMIN_a= -610318
##$ZGOPTNS= <>
##$ZL1= 120
##$ZL2= 120
##$ZL3= 120
##$ZL4= 120
##$ABSF1= 16.522
##$ABSF2= -4.171173
##$ABSG= 5
##$ABSL= 3
##$ALPHA= 0
##$AQORDER= 0
##$ASSFAC= 0
##$ASSFACI= 0
##$ASSFACX= 0
##$ASSWID= 0
##$AUNMP= <proc_1d>
##$AZFE= 0.1
##$AZFW= 0.1
##$BCFW= 0
##$BC_mod= 0
##$BYTORDP= 0
##$COROFFS= 0
##$CY= 12.5
##$DATMOD= 1
##$DC= 0
##$DFILT= <>
##$DTYPP= 0
##$F1P= 14.0000005364418
##$F2P= -0.99999901652339
##$FCOR= 0.5
##$FTSIZE= 32768
##$FT_mod= 6
##$GAMMA= 0
##$GB= 0
##$INTBC= 1
##$INTSCL= 1
##$ISEN= 128
##$LB= 0.3
##$LEV0= 0
##$LPBIN= 0
##$MAXI= 10000
##$MC2= 0
##$MEAN= 0
##$ME_mod= 0
##$MI= 0
##$NCOEF= 0
##$NC_proc= -4
##$NLEV= 6
##$NOISF1= 0
##$NOISF2= 0
##$NSP= 0
##$NTH_PI= 0
##$NZP= 0
##$OFFSET= 16.522
##$PC= 1
##$PHC0= -80.60529
##$PHC1= 3.553488
##$PH_mod= 1
##$PKNL= yes
##$PPARMOD= 0
##$PSCAL= 4
##$PSIGN= 0
##$REVERSE= no
##$SF= 250.13
##$SI= 32768
##$SIGF1= 0
##$SIGF2= 0
##$SINO= 400
##$SIOLD= 32768
##$SREGLST= <1H.CDCl3>
##$SSB= 0
##$STSI= 32768
##$STSR= 0
##$SW_p= 5175.98343685301
##$SYMM= 0
##$S_DEV= 0
##$TDeff= 65536
##$TDoff= 0
##$TI= <Analysis number 999999
Compound Code 99
Book Reference 9
Project Code 9>
##$TILT= no
##$TM1= 0
##$TM2= 0
##$TOPLEV= 0
##$USERP1= <user>
##$USERP2= <user>
##$USERP3= <user>
##$USERP4= <user>
##$USERP5= <user>
##$WDW= 1
##$XDIM= 32768
##$YMAX_p= 278340989
##$YMIN_p= -114785
$$ End of Bruker specific parameters
$$ ---------------------------------
##NTUPLES= NMR SPECTRUM
##VAR_NAME=  FREQUENCY,     SPECTRUM/REAL,   SPECTRUM/IMAG
##SYMBOL=    X,             R,               I
##VAR_TYPE=  INDEPENDENT,   DEPENDENT,       DEPENDENT
##VAR_FORM=  AFFN,          ASDF,            ASDF
##VAR_DIM=   32768,         32768,           32768
##UNITS=     HZ,            ARBITRARY UNITS, ARBITRARY UNITS
##FACTOR=    0.157963299565203, 1,           1
##FIRST=     4132.6476996994, 0,             0
##LAST=      -1043.33573715361, 0,           0
##MIN=       -1043.33573715361, -114785,     0
##MAX=       4132.6476996994, 278340989,     0
$$ Real data points
##PAGE= N=1
##DATA TABLE= (X++(R..R)), XYDATA
$$ [...]
18479D28971j2049l2710l0772l0672o593k2003l4415Q959j6431k6030k6449m9296
$$ 428971 416922 384212 353440 322768 316175 294172 259757 268716 252285 226255 199806 150510
18467A50510o6493P055J27k5352j7179K649j3544J6273O449K776J1250j2720k3271
$$ 150510 84017 91072 91199 65847 48668 51317 37773 54046 60495 63271 74521 61801 38530
18454C8530O054J2794j7968O619P710J3879K0394p07j2355m328l6638K466P508
$$ 38530 44584 57378 39410 46029 53739 67618 88012 87305 74950 70622 33984 36450 43958
18441D3958K7251N464L773k2858J522p302j3259p00q782k5896q422k551j13L1942
$$ 43958 71209 76673 80446 57588 59110 51808 38549 37849 29067 3171 -5251 -7802 -7915 24027
18427B4027K901k8829j0743J3542P627k84n626J717j4211J8053J9885J6031Q889
$$ 24027 26928 -1901 -12644 898 8525 8241 2615 4332 -9879 8174 28059 44090 52979
18414E2979N226l5425P549N604Q694K214o482J255J8544J1945K3688j0176K3711
$$ 52979 58205 22780 30329 35933 44627 46841 40359 41614 60158 72103 95791 85615 109326
18401A09326J8899L0011M6514N9150M1231J7666L6600o054m6366n5289m0801k0599
$$ 109326 128225 158236 204750 263900 305131 322797 359397 353343 306977 251688 210887 190288
18389A90288Q368L9347J2558K9099L7056J5417l7343l1476j3841M698P200M7920
$$ 190288 198656 238003 250561 279660 316716 332133 294790 263314 249473 254171 261371 309291
18377C09291k3042j6126K4703k90n592J3658J6985k696j5126k4071k9659O2446
$$ 309291 286249 270123 294826 294536 288944 302602 319587 316891 301765 277694 248035 310481
18365C10481Q8654R4411N7372J9964P923o0234o9036q4774l0014l1014r54R433
$$ 310481 399135 493546 550918 570882 578805 518571 449535 364761 334747 303733 302779 312212
18353C12212J8912L4922N473M8548N2984L1305M4941J5190P626J7050o931l117
$$ 312212 331124 366046 371519 420067 473051 504356 549297 564487 572113 589163 582232 579115
18341E79115J2535M2745P0165N7334O2015L7587P672l0213o7337j05957p1169
$$ 579115 591650 634395 704560 761894 823909 861496 869168 838955 771618 665661 594492
18330E94492l7268l7560K325O802K1737K1651n749O706L4708Q3171J05885N3735
$$ 594492 557224 519664 521989 528791 550528 572179 566430 573136 607844 691015 796900 850635
18318H50635K0862J8390l1960n7249o2531q6902q1711j03615o1223l6423l8303
$$ 850635 871497 889887 857927 800678 738147 651245 569534 465919 404696 368273 329970
18307C29970j5910J5273j5207l2525P260K1461J862K1924N0928p980l152K0801
$$ 329970 314060 329333 314126 281601 288861 310322 312184 334108 385036 377056 373904 394705
18295C94705K0115Q104k0807n041j2804J30P97j3388j3481J2093K9031l0846j9423
$$ 394705 414820 422924 402117 397076 384272 384402 385199 371811 358330 370423 399454 368608 349185
18282C49185O835Q900K6588P0006R3776J08750J31212J22616J09791J06915O8377
$$ 349185 356020 364920 391508 461514 555290 664040 795252 917868 1027659 1134574 1202951
18271A202951O3903L2068l1561n4445n9789m2119l722k5534m8393r0894j06854
$$ 1202951 1266854 1298922 1267361 1212916 1153127 1111008 1107286 1081752 1033359 942465 835611
18260H35611q3435j27162n7723n9995p0564l2244k6165r043J425P736P041L8287
$$ 835611 752176 625014 567291 507296 436732 404488 378323 369280 370705 378441 385482 423769
18248D23769M3865P3200J03424P9008J24616J31029J59866J30362J12138Q7269
$$ 423769 467634 540834 644258 723266 847882 978911 1138777 1269139 1381277 1468546
18238A468546J5049n7309j02785j06217j23971j18796q0740o9063l8155k8740
$$ 1468546 1483595 1426286 1323501 1217284 1093313 974517 893777 824714 786559 757819
18228G57819r018l886N1160Q9879N3245N8908P0947P8053O4565P1907J04753J01286
$$ 757819 748801 744915 796075 885954 939199 998107 1069054 1147107 1211672 1283579 1388332 1489618
18216A489618O3143K4791K317R061l2204L2272P8923J08809J60626J86862K33120
$$ 1489618 1552761 1577552 1579869 1588930 1556726 1588998 1667921 1776730 1937356 2124218 2357338
18205B357338K83607K63135L42870M84098O71729R78808J542702K161398K629127
$$ 2357338 2640945 2904080 3246950 3731048 4402777 5381585 6924287 9085685 11714812
18196A1714812K684698K326998J616357Q16597k9652r56604j899663k478906k574909
$$ 11714812 14399510 16726508 18342865 19159462 19129810 18173206 16273543 13794637 11219728
18187A1219728k250545j759658j224766q20230n28064k90632j77511q9782k5560
$$ 11219728 8969183 7209525 5984759 5164529 4636465 4345833 4168322 4078540 4052980
18178D052980L8732Q4085P6796R1199N4835K4352L398J8951O6648Q7591J62635
$$ 4052980 4091712 4175797 4252593 4343792 4398627 4422979 4426377 4445328 4511976 4599567 4762202
18167D762202K37768L65324O15431R12150J360090K069568K934952L641423L656699
$$ 4762202 4999970 5365294 5980725 6892875 8252965 10322533 13257485 16898908 20555607
18158B0555607K763130J597299J016481J154663J099434J97880j288551k477839
$$ 20555607 23318737 24916036 25932517 27087180 28186614 28384494 27095943 24618104
18150B4618104k685168k194698j373790m46890N44906J619282K766238M003190
$$ 24618104 21932936 19738238 18364448 17917558 18462464 20081746 22847984 26851174
18142B6851174N225683O022598O095389N562627M513561L091247J283644o25355
$$ 26851174 32076857 38099455 44194844 49757471 54271032 57362279 58645923 58020568
18134E8020568j813868k083074j760526j262139l09487J038063J944858K149956
$$ 58020568 56206700 54123626 52363100 51100961 50791474 51829537 53774395 55924351
18126E5924351K418680L078865L498640L554045L657885L630035K936729J901685
$$ 55924351 58343031 61421896 64920536 68474581 72132466 75762501 78699230 80600915
18118H0600915J296400R14574q6054j291018j337028m64985Q50940L194589Q041163
$$ 80600915 81897315 82811889 82725835 81434817 80097789 79632804 80483744 83678333 91719496
18109I1719496J3748529J4107940N896261o776970q082998m555171J311890N567354
$$ 91719496 105468025 119575965 125472226 118695256 110612258 106057087 107368977 112936331
18101A12936331L359939n934551j4024075j5085887j2614922j0167474r403750
$$ 112936331 116296270 110361719 96337644 81251757 68636835 58469361 49065611
18094D9065611q875789p585030o002452m427600l173168k233809j491027r82202
$$ 49065611 40189822 32604792 26602340 22174740 19001572 16767763 15276736 14294534
18086A4294534p16969o59870o97310o52882n51238m89683n33779n88426n96693
$$ 14294534 13577565 12917695 12220385 11567503 11016265 10526582 9992803 9404377 8807684
18077H807684n69110m77956m16137l98329l74091k98386k49862j71606r0164k8478
$$ 8807684 8238574 7760618 7344481 6946152 6572061 6273675 6023813 5852207 5762043 5733565
18067E733565j9047R094N7974Q9403Q7418J02295J67001J95041K10119K80229
$$ 5733565 5714518 5723612 5781586 5870989 5958407 6060702 6227703 6422744 6632863 6913092
18057F913092L52567N03620O41681P84980R48767J128884J356275J714719K209326
$$ 6913092 7265659 7769279 8410960 9195940 10144707 11273591 12629866 14344585 16553911
18048A6553911K928472L925739N202853O708100Q347336R829194J0776777J1063119
$$ 16553911 19482383 23408122 28610975 35319075 43666411 53495605 64272382 75335501
18040G5335501J0892526R957894P929574N874226M143282K381132R74702q6021
$$ 75335501 86228027 96185921 104115495 109989721 114133003 116514135 117488837 117402816
18032A17402816m26324o79342j587821k891781m828535o678349p496963p043425
$$ 117402816 116976492 116297150 114709329 111817548 106989013 100310664 92813701 85770276
18024H5770276o312564o010977n502470m917395n001823n657611o516271o984180
$$ 85770276 79457712 73446735 67944265 63026870 58025047 52367436 45851165 38866985
18016C8866985o466138n317232m067438k986156k153447j531748j052891o30962
$$ 38866985 32400847 27083615 23016177 20030021 17876574 16344826 15291935 14660973
18008A4660973k43872K40417P81133J356219J898686K468808L018658L210767
$$ 14660973 14417101 14657518 15438651 16794870 18693556 21162364 24181022 27391789
18000B7391789K941648K705323K533036J840507P79279K80571J77122j17494k48110
$$ 27391789 30333437 33038760 35571796 37412303 38191582 38472153 38649275 38531781 38283671
17991C8283671K57954R31646J475576K012891K571346K367441J091152k99342
$$ 38283671 38541625 39473271 40948847 42961738 45533084 47900525 48991677 48692335
17983D8692335j138383k042897l104391l384801k949316k323083j669049j106597
$$ 48692335 47553952 45511055 42406664 39021863 36072547 33749464 32080415 30973818
17975C0973818o19982l52187m22323r83889j812598k351921k785058l020314k886120
$$ 30973818 30353836 30001649 29579326 28595437 26782839 24430918 21645860 18625546 15739426
17966A5739426k572615k165073j703044j273329r53618p23130n72647m46222l86373
$$ 15739426 13166811 11001738 9298694 8025365 7071747 6348617 5775970 5329748 4943375
17957D943375l24126k53633k18591k27154k21132j86987j81894j73565j34128
$$ 4943375 4619249 4365616 4147025 3919871 3698739 3511752 3329858 3156293 3022165
17948C022165j05670j21851j39017j13606r1243q8175p7999r8865j05854r6918
$$ 3022165 2916495 2794644 2655627 2542021 2450778 2362603 2284604 2185739 2079885 1982967
17938A982967q0731n8468m6352o2378o3838n0626n4614n7008o7252l9835m7856
$$ 1982967 1902236 1843768 1797416 1735038 1671200 1620574 1565960 1508952 1441700 1401865 1354009
17927A354009n4632k1280m2155K106K1714M2987K7893K3813n354j9167k4206k6523
$$ 1354009 1299377 1278097 1235942 1238048 1259762 1302749 1330642 1354455 1349101 1329934 1305728 1279205
17915A279205k6386k9715j3745L5112L2095O30J3219K1820K8575L232J6045p105
$$ 1279205 1252819 1223104 1209359 1244471 1276566 1277196 1290415 1312235 1340810 1344042 1360087 1352982
17903A352982L538J5945J0998j5673l1248l9123n4165J6604O246R667K0369J786
$$ 1352982 1356520 1372465 1383463 1367790 1336542 1297419 1243254 1259858 1266104 1275771 1296140 1297926
17891A297926j7143L87n645j4456k1931k0618l1123l009k991J807j2762k6177
$$ 1297926 1280783 1281170 1275525 1261069 1239138 1218520 1187397 1184388 1181397 1183204 1170442 1144265
17879A144265M96J6209J0030L3677K3937K052o182l9173l7621n293m337j8357
$$ 1144265 1144761 1160970 1171000 1204677 1228614 1230666 1224484 1185311 1147690 1142397 1138060 1119703
17867A119703n5551n6185l4874j5720j1511k9875m8983r999j5634l5783l0796
$$ 1119703 1064152 1007967 973093 957373 945862 915987 867004 857005 841371 805588 774792
17856G74792j2119k1922m3312n8172n0246n4575k8129j5529n4103j0749J2448
$$ 774792 762673 740751 697439 639267 589021 534446 506317 490788 436685 425936 438384
17845D38384n241r104P861l1964l7011l2283j1981Q09j1635N188k3842J0931J4253
$$ 438384 433143 424039 431900 399936 362925 330642 318661 319470 307835 313023 289181 300112 314365
17832C14365J2378M2439J4057K1875L0772J8849J4295L5506J8674J1146j3088
$$ 314365 326743 369182 383239 405114 435886 454735 469030 504536 523210 534356 521268
17821E21268r330R554Q739K1160m934j9773l6838j9047K1020k411r422P44k7854
$$ 521268 511938 521492 530231 551391 546457 526684 489846 470799 491819 489408 479986 480730 452876
17808D52876j3225k4858n3974j4003P826j1355j0611k6189j3718j4028r687k2135
$$ 452876 439651 414793 360819 346816 354642 343287 332676 306487 292769 278741 269054 246919
17796B46919m994N166N834K4907k8277k1497J2815P009j1913K096J4690Q758r8
$$ 246919 241925 247091 252925 277832 249555 228058 240873 247882 235969 238065 252755 261513 261415
17783B61415k0486K2353M3630k0793k4081j7238n523k302J1988J0888m187r178
$$ 261415 240929 263282 306912 286119 262038 244800 239277 236975 248963 259851 255664 246486
17771B46486M303L4047j6625j7388l319J6859K8492O858j2817j8664P416J879
$$ 246486 250789 284836 268211 250823 247504 264363 292855 299713 286896 268232 275648 277527
17759B77527O214k870k396J3867R677Q554j4055m328O2J8839j0538o804q731p605
$$ 277527 283741 280871 278475 292342 302019 310573 296518 292190 292252 311091 300553 293749 285018 277413
17745B77413j7880J540o133m131j1022l6384j6471P252J8664J7689k0714o755
$$ 277413 259533 261073 254940 250809 239787 203403 186932 194184 212848 230537 209823 203068
17733B03068J5352K0081j7666j1185L220l0167k4603J5773K813j3136l20M28m598
$$ 203068 218420 238501 220835 209650 212870 182703 158100 173873 176686 163550 163230 163658 159060
17720A59060j199J6679l984j9456r868J8457K8106N214j0541K3086j0084q785
$$ 159060 157861 174540 170556 151100 141232 159689 187795 193009 182468 205554 195470 186685
17708A86685r430Q046J3456m940j8219r476k234J4274j1411j0822J4598m99j4244
$$ 186685 177255 185301 198757 193817 175598 166122 163888 178162 166751 155929 170527 170028 155784
17695A55784l124N225J2202k0194O432K8062P647q697J4110J7153p363L504K3026
$$ 155784 152660 157885 170087 149893 156325 184387 192034 183337 197447 214600 207237 210741 233767
17682B33767K6231K4680N2833K5884K3953M352p584m1858l6736j1059r601j681
$$ 233767 259998 284678 337511 363395 387348 391700 384116 342258 305522 294463 284862 283181
17670B83181k037j758j8534l6301m0552j4986K018J6662R691k3481r797K8557
$$ 283181 281144 279386 260852 224551 183999 169013 171031 187693 197384 173903 164106 192663
17658A92663J1275j8176k0400N4604K1342j6548j2860O853J2703K087O677J9800
$$ 192663 203938 185762 165362 219966 241308 224760 211900 218753 231456 233543 240220 260020
17646B60020N686K2532k603J85K8273L2917J5664M7916M1992L0644K0175K9656
$$ 260020 265706 288238 285635 285820 314093 347010 362674 410590 452582 483226 503401 533057
17634E33057L7199M3171K0053Q5840L8718J2882r277j3947l5926Q307k5059k6274
$$ 533057 570256 613427 633480 719320 758038 770920 761643 747696 711770 720077 695018 668744
17622F68744j3180k6332l1512l9817n5040n6691m4655n948j27r262l4349n319
$$ 668744 655564 629232 597720 557903 502863 446172 401517 395569 395442 386180 351831 346512
17610C46512j1505j071n375l0224l7243P080j5240k0585k8523k4907j1731K0827
$$ 346512 335007 333936 328561 298337 261094 268174 252934 232349 203826 178919 167188 188015
17598A88015J8024J9027k0188k5564l3025l1816J0809K6543Q290j1876J5275j713
$$ 188015 206039 225066 204878 179314 146289 114473 125282 151825 160115 148239 163514 161801
17586A61801M120J7379K4017L3084L2848Q715j1379j0625k1398l3785k7915j6971
$$ 161801 165921 183300 207317 240401 273249 281964 270585 259960 238562 204777 176862 159891
17574A59891k8680l3240m1325M434J4800O984J2090R445J274j5496k9582j1075
$$ 159891 131211 97971 56646 61080 75880 82864 94954 104399 105673 90177 60595 49520
17562D9520O752J821J1055J4969M8333K5546k3874P906N786m330K1953J7843j0025
$$ 49520 56272 58093 69148 84117 132450 157996 134122 142028 147814 143484 165437 183280 173255
17549A73255k19K8498L8612K4066M4004M7993K0519J3463L6370J3651j8329n406
$$ 173255 173036 201534 240146 264212 308216 356209 376728 390191 426561 440212 421883 416477
17537D16477J1623Q588J8602L0679L1726J2495p294j6718k9937k5989j5321n3265
$$ 416477 428100 436688 455290 485969 517695 530190 522896 506178 476241 450252 434931 381666
17525C81666l5904p214j9692l4607q298J1279j3205k5042k0803m9524l5549k1248
$$ 381666 345762 338548 318856 284249 275951 287230 274025 248983 228180 178656 143107 121859
17513A21859J2362J2902n300O722N255r34J4074q902p285J3313M567K0138N167
$$ 121859 134221 147123 141823 148545 153800 152866 166940 158038 150753 164066 168633 188771 193938
17500A93938J9428J8148L9762K4714J0263L2482J1665J395o590k4569l762J3766
$$ 193938 213366 231514 271276 295990 306253 338735 350400 351795 345205 320636 316874 330640
17488C30640L7819L6525N0738j9786l3451n234m0218l6819J1379j121j8543k2029
$$ 330640 368459 404984 455722 435936 402485 397251 357033 320214 331593 330472 311929 289900
17476B89900k7231p412j5761l3416k5643l7494m1096o833n980L504K136j7092
$$ 289900 262669 255257 239496 206080 180437 142943 101847 95014 89034 92538 94674 77582
17464G7582j7954j1364J7719K3840J5047L767j7973l0359q536m571K642M6243
$$ 77582 59628 48264 65983 89823 104870 108637 90664 60305 51769 47198 49840 96083
17452I6083j952o085j3871j2795O065q478j8632M003O9032J12450O7049K3251
$$ 96083 94131 88046 74175 61380 67445 58967 40335 44338 113370 225820 292869 316120
17440C16120K154n8703n2563m7040j0978k0236j3423o241L969l2612P685N554
$$ 316120 318274 259571 207008 159968 148990 128754 115331 109090 113059 80447 88132 93686
17428I3686j2297j2424j7928M934m2135M084K2559R017K130j2756M8224j0236
$$ 93686 81389 68965 51037 55971 13836 17920 40479 49496 51626 38870 87094 76858
17416G6858l527o50o557j4591R49K742p984K9162J3238K3362P116j5509m7671
$$ 76858 73331 72681 66124 51533 52482 55224 47240 76402 89640 113002 120118 104609 56938
17403E6938q003M277J1405K6374J374k4597j8390p506M518K1548R713p279k5130
$$ 56938 48935 53212 64617 90991 92365 67768 49378 41872 46390 67938 77651 70372 45242
17390D5242M412j2584q06q807l0787N990m286R549J9881L1790k4350j4496K3048
$$ 45242 49654 37070 36264 27457 -3330 2660 -1626 7923 27804 59594 35244 20748 43796
17377D3796j3509n857p475L488M722r080J6391J6651j5446k4350o73o086r119
$$ 43796 30287 24430 16955 20443 25165 16085 32476 49127 33681 9331 8658 2572 -6547
17364f547k05Q972K6364r944k3212q742K6026K0400k3305m337J4011M2j4607M592
$$ -6547 -6752 2220 28584 18640 -4572 -13314 12712 33112 9807 5470 19481 19523 4916 9508
17350I508L3248K6739K6230K670p039j6299l0627j7788j9098j1153j8342K6010
$$ 9508 42756 69495 95725 98395 91356 75057 44430 26642 7544 -3609 -21951 4059
17338D059N320K7602K3752O780n042J8461j5532j8011j690J720j5912M816j0839
$$ 4059 9379 36981 60733 67513 62471 80932 65400 47389 45699 47419 31507 36323 25484
17325B5484n276J9904K6845j1034J546r040j8426j9492l720L2010L1106q474j3915
$$ 25484 20208 40112 66957 55923 57469 48429 30003 10511 6791 38801 69907 61433 47518
17312D7518j7601K689j4059j9379R581R944M062L5006j9091l4588Q007n182J1950
$$ 47518 29917 32606 18547 -832 8749 18693 22755 57761 38670 4082 12089 6907 18857
17299A8857J5322J6871J5686o361l7774P363L601j4526l560n201o291J9982J4736
$$ 18857 34179 51050 66736 60375 22601 29964 33565 19039 15479 10278 3987 23969 38705
17286C8705k5977o89m93j4713n81Q184r257N962J4616o42J0029J8602K7821j1985
$$ 38705 12728 12039 11546 -3167 -3748 4436 -4821 1141 15757 15115 25144 43746 71567 59582
17272E9582j3232j3601l44J0420Q203N432k9438j8180o724J8306P149O810l64
$$ 59582 46350 32749 32405 42825 51028 56460 27022 8842 2118 20424 27573 34383 34019
17259C4019k036K8836o833m0026j9781L386J8475J5715L0352j8991l1766k3944
$$ 34019 31983 60819 53986 13960 -5821 -2435 16040 31755 62107 43116 11350 -12594
17247a2594p678J8819k677j1093N423j2175N987N772m152r551L1641m418j9702
$$ -12594 -20272 -1453 -4130 -15223 -9800 -21975 -15988 -10216 -14368 -23919 7722 3304 -16398
17234a6398j188J7767J7815o151K57K551j0064K2572k604J3155K3566r976M234
$$ -16398 -17586 181 17996 11845 12102 14653 4589 27161 24557 37712 61278 51302 55536
17221E5536K823N669l519J2155K2332k9289k4819j8012o079j4290j6332J2401
$$ 55536 58359 64028 60509 72664 94996 65707 40888 22876 16797 2507 -13825 -1424
17209a424R937l677k3702R989J2665J1425j5277q870r457K5332J0205j5696m2554
$$ -1424 8513 4836 -18866 -8877 3788 15213 -64 -8934 -18391 6941 17146 1450 -41104
17196d1104p21j781k4960Q180J5734Q937R768K0146J4042j2773j6303O678Q691
$$ -41104 -41825 -43606 -68566 -60386 -44652 -35715 -25947 -5801 8241 -4532 -20835 -14157 -5466
17183e466K109j8494M133J3939J396K4020K8656j1089k0883j7873M048j4304P8
$$ -5466 -3357 -21851 -17718 -3779 -2383 21637 50293 39204 18321 448 4496 -9808 -9730
17170i730J9049j6987Q3J9379K150Q077J2090J1392Q229j4349j858j563l520k2949
$$ -9730 9319 -7668 -7585 11794 13944 22021 34111 45503 53732 39383 37525 35962 32442 9493
17156I493K405n53J2678J0839Q427p051n937N542q579l613j1697j0893J1266Q269
$$ 9493 11898 11345 24023 34862 43289 36238 30301 35843 27264 23651 11954 1061 12327 20596
17142B0596n623j4228O06R052J397k2201j0720L224L1533L1180m20j4664k0022
$$ 20596 14973 745 1351 10403 11800 -10401 -21121 -17897 13636 44816 44396 29732 9710
17129I710l1079J9953Q689Q731q409j0247p882J2633K0820J838j3663k396j8693
$$ 9710 -21369 -1416 7273 16004 7595 -2652 -10534 2099 22919 24757 11094 8698 -9995
17116i995q150Q680k3896O981J8757m699q679J1472M2787J6998k846k1345j782
$$ -9995 -18145 -9465 -33361 -26380 -7623 -12322 -21001 -9529 33258 50256 47410 26065 24283
17103B4283l925n351m0237M780R898K901M026p015O873O862K3024j4034j4398
$$ 24283 20358 15007 -25230 -20450 -10552 -7651 -3625 -10640 -3767 3095 26119 12085 -2313
17090b313k0162J1585L912m600J1888K0886M675n114N887j0437L039J9295j9323
$$ -2313 -22475 -10890 -6978 -11578 310 21196 25871 20757 26644 16207 19246 38541 19218
17077A9218l5390j6098P899j2248q116L8036j2200j960k988p117j9790l663N1272
$$ 19218 -16172 -32270 -24371 -36619 -44735 -6699 -18899 -20859 -23847 -30964 -50754 -54417 -3145
17064c145Q66P46q6j0668L572J9876L997k2270j0436P825o161L2436L1055M405
$$ -3145 -2279 -1533 -1619 -12287 -8715 11161 15158 -7112 -17548 -9723 -15884 16552 47607 52012
17050E2012j7225k6374Q912Q86j60o468j2720l0113P312K0151J3941l056j2580
$$ 52012 34787 8413 17325 18211 18051 11583 -1137 -31250 -23938 -3787 10154 7098 -5482
17037e482J9473J1017j346k0879L70J8672j184p16k5465R192N891r765l5668J4948
$$ -5482 13991 25008 23662 2783 3153 21825 20641 19925 -5540 3652 9543 -222 -35890 -20942
17023b0942J3489L085J3859j174k5861o956J3307K2696o618p058K0342K1393j929
$$ -20942 -7453 -4368 9491 8317 -17544 -24500 -11193 11503 4885 -2173 18169 39562 37633
17010C7633l2393l4315J497J7135K0909K0454O536k9489k4539K6747K5082n515
$$ 37633 5240 -29075 -27578 -10443 10466 30920 37456 7967 -16572 10175 35257 29742
16998B9742j3367P869r313r389k7619k2609K329K3520N427j583j8256O634L3393
$$ 29742 16375 24244 14931 5542 -22077 -44686 -42357 -18837 -13410 -14993 -33249 -26615 6778
16985F778J2549J4916j3826j7474j4132k2762j6552K719J4045N684P438K1993
$$ 6778 19327 34243 20417 2943 -11189 -33951 -50503 -47784 -33739 -28055 -20617 1376
16973A376J9655q850m989k0643l166J3613k937J2804J1986j8059j497l812o466
$$ 1376 21031 12181 7192 -13451 -16617 -3004 -5941 6863 18849 790 -707 -4519 -10985
16960a0985L596M004N539J68q733r393K776J3802R05j9306L803l548J1480K1148
$$ -10985 -7389 -3385 2154 2322 -6411 -15804 -13028 774 1679 -17627 -13824 -17372 -5892 15256
16946A5256J9765j4506r084O893j4323k192l6516q394n546K2393K9920K2615k8166
$$ 15256 35021 20515 11431 18324 4001 1809 -34707 -43101 -48647 -26254 3666 26281 -1885
16933a885P439K0823J4294j3969j0670J0430m635j1474j668j6115l4971J7461
$$ -1885 5554 26377 40671 26702 16032 26462 21827 10353 8685 -7430 -42401 -24940
16921b4940K2887n917j2276k0099q287m676l45J0119L210K3344K262O9O621J5122
$$ -24940 -2053 -7970 -20246 -40345 -48632 -53308 -53653 -43534 -40324 -16980 -14718 -14649 -8028 7094
16907G094J3177j7776j0207J6800P701M571J496p576o931M669p906L061j0500
$$ 7094 20271 2495 -7712 9088 16789 21360 22856 15280 8349 13018 5112 8173 -2327
16894b327o800j7923p112j1782K0084K0760k1560K157R608j3175O39J4732l451
$$ -2327 -9127 -27050 -34162 -45944 -25860 -5100 -26660 -24503 -14895 -28070 -27431 -12699 -16150
16881a6150J144k0219N898J2761j0401O146k0905j7143J5675J0916K2531J0104
$$ -16150 -15006 -35225 -29327 -16566 -26967 -20821 -41726 -58869 -43194 -32278 -9747 357
16869C57K2763J5216j6157r607k516j5706j420J6858q53J7841k3236r475k0745
$$ 357 23120 38336 22179 12572 10056 -5650 -7070 9788 8935 26776 3540 -5935 -26680
16856b6680K175R275j6724J3322p593J5116J2927Q801q486k2716j4396L1594K9831
$$ -26680 -24505 -15230 -31954 -18632 -26225 -11109 1818 10619 2133 -20583 -34979 -3385 26446
16843B6446N235j1610j1199k3118n639J0902L0022j1899j9816j2688q004n929
$$ 26446 31681 20071 8872 -14246 -19885 -8983 21039 9140 -10676 -23364 -31368 -37297
16831c7297p637L5852L6053n665n183J2493j136k8022o878p041J0321j6714J0061
$$ -37297 -44934 -9082 26971 21306 16123 28616 27480 -542 -7420 -14461 -4140 -20854 -10793
16818a0793L4907p339j9484K387L557J793j1075O857R939N295J2359p556j0637
$$ -10793 24114 16775 -2709 -322 3235 5028 -6047 810 10749 16044 28403 20847 10210
16805A0210O842o558k6014j1731o165J0739Q801k0665j3497J9147R512k25N405
$$ 10210 17052 10494 -15520 -27251 -33416 -22677 -13876 -34541 -48038 -28891 -19379 -19604 -14199
16792a4199p290k373J2916J3457n991n724J4532J5999J1293j182k6045J8186j6938
$$ -14199 -21489 -23862 -10946 2511 -3480 -9204 5328 21327 32620 31438 5393 23579 6641
16779F641m818j6533j9292M252K4591O366L426j1725P455j0500j520n578l467
$$ 6641 1823 -14710 -34002 -29750 -5159 1207 4633 -7092 363 -10137 -11657 -17235 -20702
16766b0702J2321J7434R086J7867k7319J0156N775j2143k6154k8502n949M117
$$ -20702 -8381 9053 18139 36006 8687 18843 24618 12475 -13679 -42181 -48130 -44013
16754d4013M7005O1364o580l3798R881J9762j9743j3689J6899r241j9153P066
$$ -44013 2992 64356 57776 23978 33859 53621 33878 20189 37088 27847 8694 15760
16742A5760J1468m965m850l5973O159L3710O410J007k971j3121q641P029j011
$$ 15760 27228 22263 17413 -18560 -12401 21309 27719 28726 25755 12634 3993 11022 10011
16729A0011n687P129R220j958J174O371k3013k8461m822K4548K9908n06l6770
$$ 10011 4324 11453 20673 18715 19889 26260 3247 -25214 -30036 -5488 24420 23914 -12856
16716a2856M872K5505k6227k0698l769r947L404J2830K1995J8742J1866J0922
$$ -12856 -7984 17521 -8706 -29404 -33173 -43120 -39716 -26886 -4891 13851 25717 36639
16704C6639k5476j8117K552j7715j022O162j4602J1104J5646j0016p066O928N299
$$ 36639 11163 -6954 -4402 -22117 -23139 -16977 -31579 -20475 -4829 -14845 -21911 -14983 -9684
16691i684J5162j8639j145j5797r944K0431q82m622n806L263M952P316J483O612
$$ -9684 5478 -13161 -14306 -30103 -40047 -19616 -20498 -25120 -30926 -27663 -22711 -15395 -13912 -7300
16677g300J4636J7534l187J6022O663j5850p843K667q716K3723J1823j535j7664
$$ -7300 7336 24870 21683 37705 44368 28518 20675 23342 14626 38349 50172 48637 30973
16664C0973k1112j1077j471j3915j869J9278p23j7154J8994j2884O507J2592K492
$$ 30973 9861 -1216 -2687 -16602 -18471 807 84 -17070 1924 -10960 -4453 8139 10631
16651A0631r831J2039J354j5377k5149n217J3878K4115j170j4259j5178j9629
$$ 10631 800 12839 14193 -1184 -26333 -31550 -17672 6443 5273 -8986 -24164 -43793
16639d3793K0915q099L326J3835J0818O787r090q40Q604J2867J4018q543M469
$$ -43793 -22878 -30977 -27651 -13816 -2998 3789 -5301 -6141 2463 15330 29348 20805 25274
16626B5274R101l7938P90m89p125o742P94L1805J4758J3917K8941l209j8637j0381
$$ 25274 34375 -3563 -2773 -3262 -10387 -17129 -16335 15470 30228 44145 73086 69877 51240 40859
16612D0859k7200L551R279P182l1988j2880J5411l34k0074j6882J0965K0860n462
$$ 40859 13659 17210 26489 33671 1683 -11197 4214 3880 -16194 -33076 -22111 -1251 -6713
16599f713rk3541M83L2598J9793m452j7361k2314L51K7079k709J8151k0282m8746
$$ -6713 -6722 -30263 -29780 2818 22611 18159 798 -21516 -21165 5914 3205 21356 1074 -47672
16585d7672j0855L9099J8285J7664K935l302j9180J4449p686O171k1511j8745
$$ -47672 -58527 -19428 -1143 16521 19456 16154 -3026 11423 3737 9908 -11603 -30348
16573c0348P734j4397j2791Q56L936M425n185P323J0708J6956K869R341j3373
$$ -30348 -22614 -37011 -49802 -48946 -45010 -40585 -45770 -38447 -27739 -10783 -7914 1427 -11946
16560a1946R10J727j5156L860J8955l08j6928n174K5600m666p965m945K0386L46
$$ -11946 -11036 -9309 -24465 -20605 -1650 -1958 -18886 -24060 1540 -3126 -11091 -16036 4350 4696
16546D696Q157K5797O561q056l1171j6170m177o918k0826k2916M076J8645M035
$$ 4696 12853 38650 45211 37155 5984 -10186 -14363 -21281 -42107 -65023 -60947 -42302 -38267
16533c8267K0654m815J213L485o229J1796J1107j8608k8885j6580K026l957Q194
$$ -38267 -17613 -22428 -21215 -17730 -23959 -12163 -1056 -19664 -48549 -65129 -63103 -67060 -58866
16520e8866K9783K7014J1058K0487K261j6773m6388J0137O61k0871k961P703o555
$$ -58866 -29083 -2069 8989 29476 31737 14964 -31424 -21287 -20626 -41497 -44458 -36755 -43310
16507d3310j765Q006O830p811J2755J8769l549k1307l2780J5632K4345P18K0388
$$ -43310 -45075 -37069 -30239 -38050 -25295 -6526 -10075 -31382 -64162 -48530 -24185 -23467 -3079
16494c079R791M795j5714m082K9823J634l2153n098j3458J2928K5087r072J5863
$$ -3079 6712 11507 -4207 -8289 21534 23168 -8985 -14083 -27541 -14613 10474 1402 17265
16481A7265k726n8874K319J7075J5967R480J8973k0795j1653j9963j3620J3073
$$ 17265 14539 -44335 -42016 -24941 -8974 506 19479 -1316 -12969 -32932 -46552 -33479
16469c3479L890J6652J8146j9708n699K899k960p019k85J9071L103P005J0776
$$ -33479 -29589 -12937 5209 -14499 -20198 -17299 -20259 -27278 -27563 -8492 -5389 1616 12392
16456A2392j3814J4656m120j9679j1195L011P670k8405Q560p458L624P433R142
$$ 12392 -1422 13234 9114 -10565 -21760 -18749 -11079 -39484 -30924 -38382 -34758 -27325 -18183
16443a8183K161k6541q188J7159M520R252j8455j2659J2444M861n143Q666m301
$$ -18183 -16022 -42563 -50751 -33592 -29072 -19820 -38275 -50934 -38490 -33629 -38772 -30106 -34407
16430c4407n896J1094J7968r419j4178J4874J0111m505J1099p377j3851k1335
$$ -34407 -40303 -29209 -11241 -20660 -34838 -19964 -9853 -14358 -3259 -10636 -24487 -45822
16418d5822q363J0733q183J4717Q122n080l489N661j5619j6192M5913M1361J1976
$$ -45822 -54185 -43452 -51635 -36918 -28796 -33876 -37365 -31704 -47323 -63515 -17602 23759 35735
16405C5735l5088l2479o571J9040r998k4903J2690J4728j3772L408Q898J2166
$$ 35735 647 -31832 -38403 -19363 -29361 -54264 -41574 -26846 -40618 -37210 -28312 -16146
16393a6146J1440J254M27O241o101o174j7984k143K2109j1011j6488Q140j4099
$$ -16146 -4706 -3452 -3025 3216 -2885 -9059 -27043 -29186 -7077 -18088 -34576 -26436 -40535
16380d0535o575J9239J5375L5416j456k8518k975J2802q080J5028j9609l4376
$$ -40535 -47110 -27871 -12496 22920 21464 -7054 -10029 2773 -5307 9721 -9888 -44264
16368d4264O191K0331J5296l646j10J4877o182L349k154P775k242j7435l4154
$$ -44264 -38073 -17742 -2446 -6092 -6202 8675 2493 5842 3688 11463 9221 -8214 -42368
16355d2368k6751K3041L7653J9058L725R613K8816l5699k0577m199j0126j7418
$$ -42368 -69119 -46078 -8425 10633 14358 23971 52787 17088 -3489 -7688 -17814 -35232
16343c5232J1796J0739J4634P634q613j6338R291K1998k687j1564J9641l289j7493
$$ -35232 -23436 -12697 1937 9571 958 -15380 -6089 15909 13222 1658 21299 18010 517
16330E17Q645L448j1302M141J424J3862l5928j9347m378O690j9718l588J2001
$$ 517 9162 12610 1308 5449 6873 20735 -15193 -34540 -38918 -32228 -51946 -55534 -43533
16317d3533J2802R700J3823k699J4681q871j2173P548j4450o043K211O811k410
$$ -43533 -30731 -21031 -7208 -9907 4774 -4097 -16270 -8722 -23172 -29215 -27004 -20193 -22603
16304b2603J7087J2051l3578M206J6175j2821r459J1887K58q708k3603r260J5671
$$ -22603 -5516 6535 -27043 -22837 -6662 -19483 -28942 -17055 -16797 -25505 -49108 -58368 -42697
16291d2697R311P160K5858k1591J1700j774K0395q303j0268n173o401k3549j931
$$ -42697 -33386 -26226 -368 -21959 -10259 -12033 8362 59 -10209 -15382 -21783 -45332 -47263
16278d7263O354J2072N426J4793m618R62J3915l855k2529J61L1353j7628k1002
$$ -47263 -40909 -28837 -23411 -8618 -13236 -12274 1641 -2214 -24743 -24582 6771 -10857 -31859
16265c1859M9774M943k0921j2219l183J7684J4766j0487l0193J023N728K1483
$$ -31859 17915 22858 1937 -10282 -13465 4219 18985 8498 -21695 -20672 -14944 6539
16253F539J4912j0318j8703k0099j0234k3243j6701J1936J3253J376K9925N428
$$ 6539 21451 11133 -7570 -27669 -37903 -61146 -77847 -65911 -52658 -51282 -21357 -15929
16241a5929m362k399j7496J7368K6881J2768l548R1j8538j0904m192R17J7991
$$ -15929 -20291 -22690 -40186 -22818 4063 16831 13283 13374 -5164 -16068 -20260 -19343 -1352
16228a352R286J0782L5639L683j236j1489j8160n710q392j3436l948J9396P063
$$ -1352 7934 18716 54355 58038 56802 45313 27153 21443 13051 -385 -4333 15063 22126
16215B2126m19q117k8434J2097K5628J1241N072j5134k3438k0019J9090K4425
$$ 22126 21707 13590 -14844 -2747 22881 34122 39194 24060 622 -19397 -307 24118
16203B4118j269q234J0585k0567m680M882J309p125O883o534l193k5483j9179
$$ 24118 22849 14615 25200 4633 -47 4835 6144 -981 5902 -632 -3825 -29308 -48487
16190d8487K6710L7466J0937n344j2538j2572j5538L199M399m331j3423l3717
$$ -48487 -21777 15689 26626 21282 8744 -3828 -19366 -16167 -11768 -16099 -29522 -63239
16178f3239J7358N3266K1457j9139l9576J4995j4808k8945K1591j054K3872L1261
$$ -63239 -45881 7385 28842 9703 -29873 -14878 -29686 -58631 -37040 -38094 -14222 17039
16166A7039K795J1243k1188j8722l570j142J6645J9815p074k0211L686j2786N711
$$ 17039 19834 31077 9889 -8833 -12403 -13545 3100 22915 15841 -4370 -684 -13470 -7759
16153g759K0550j4832l1535k626L1925R269K2110p79j5627R100j6230L995j5063
$$ -7759 12791 -2041 -33576 -36202 -4277 4992 27102 26323 10696 19796 3566 7561 -7502
16140g502q256J6655J8736j4522o132J1039N384j9552j0757j557M97J8181M939
$$ -7502 -15758 897 19633 5111 -1021 10018 15402 -4150 -14907 -16464 -15967 2214 7153
16127G153J9984j7582j6050j8207k3410j0633j1511R277J8655J6854M828K4043
$$ 7153 27137 9555 -6495 -24702 -48112 -58745 -70256 -60979 -42324 -25470 -20642 3401
16115C401j3080L781K0900J191k6136j1597j9562M672Q970J2759P439J8278k694
$$ 3401 -9679 -5898 15002 16193 -9943 -21540 -41102 -36430 -27460 -14701 -7262 11016 8322
16102H322R759j3206q431J3097Q331J5072K284j8741k7733k1915Q577L5886J5507
$$ 8322 18081 4875 -3556 9541 17872 32944 35228 16487 -11246 -33161 -24584 11302 26809
16089B6809p961j8380r010L419J4070J0696R078K883N848k67n498J1979R508O859
$$ 26809 18848 468 -8542 -5123 8947 19643 28721 31604 37452 37185 31687 43666 53174 60033
16075F0033j782l8656j5803l716K6049J1659J0375m290m3508J1694k1730n254
$$ 60033 58251 19595 3792 76 26125 37784 48159 43869 361 12055 -9675 -14929
16063a4929K1112k257p848J3900m0197k9063m745J1255L9781L5055K8025j6808
$$ -14929 6183 3926 -3922 9978 -30219 -59282 -64027 -52772 -12991 22064 50089 33281
16051C3281k5019l7764n6409k8874J2299J7054L1293Q882l207K2837K3696N26
$$ 33281 8262 -29502 -85911 -114785 -102486 -85432 -54139 -45257 -48464 -25627 -1931 -1405
16039a405P187N067k4038J0516r294p106j3547M394L0679j186j7541R329J4992
$$ -1405 5782 10849 -13189 -2673 -11967 -19073 -32620 -28226 2453 1267 -16274 -6945 8047
16026H047R645k727k2404p230J404J7699L432O085j3689M081k3072P374J8243
$$ 8047 17692 14965 -7439 -14669 -13265 4434 7866 13951 262 4343 -18729 -11355 6888
16013F888N348l000j5135k3955K9112j16j7247j4115j6124J3012J8745J5948J6549
$$ 6888 12236 9236 -5899 -29854 -742 -858 -18105 -32220 -48344 -35332 -16587 -639 15910
16000A5910k743j3438k146k080m046j502Q337J2461j6582k3978K3201j016L3515
$$ 15910 13167 -271 -2417 -4497 -8543 -10045 -1708 10753 -5829 -29807 -6606 -7622 25893
15987B5893J2360j0187k7476j9727K4357j0939K0154J5497R491K9017j4804r706
$$ 25893 38253 28066 590 -19137 5220 -5719 14435 29932 39423 68440 53636 43930
15975D3930o438n1342j6484L7503J4508r912J7818L762J0534p096j0171k0186
$$ 43930 37492 -13850 -30334 7169 21677 11765 29583 33345 43879 36783 26612 6426
15963F426N995j1575j3493k242J9504j3537j7970J5253O787J7549J1665k2721
$$ 6426 12421 846 -12647 -14889 4615 -8922 -26892 -11639 -4852 12697 24362 1641
15951A641k8348P790r806j267K7421K9505J5026o306j7549k9526j6737J6523O334
$$ 1641 -26707 -18917 -28723 -29990 -2569 26936 41962 35656 18107 -11419 -28156 -11633 -5299
15938e299m498k9482m968K9995K3390k1698K8286m273j6632j2784j8473M027J4413
$$ -5299 -9797 -39279 -44247 -14252 9138 -12560 15726 11453 -5179 -17963 -36436 -32409 -17996
15925a7996N910j0766k584l612k201K424q592L0451J7882J7761J1004j241q66
$$ -17996 -12086 -22852 -25436 -29048 -31249 -28825 -37417 -6966 10916 28677 39681 38440 37574
15912C7574n772j4723P778N675J2321m998j8033N620J1589R821k108m2683j5786
$$ 37574 31802 17079 24857 30532 42853 37855 19822 25442 37031 46852 44744 2061 -13725
15899a3725L812Q430K5479L264J3347j703k8321J1466k2860k0624J7255K1451
$$ -13725 -9913 -1483 23996 27260 40607 38904 10583 22049 -811 -21435 -4180 17271
15887A7271J9593J8617l0731k8381o688j8610j5218K022j26R788K7629J9961R049
$$ 17271 36864 55481 24750 -3631 -10319 -28929 -44147 -42125 -42251 -32463 -4834 15127 24176
15874B4176N958k5623k5933L459Q947J4874K0798k663L272j0049j0153K470j122
$$ 24176 30134 4511 -21422 -17963 -9016 5858 26656 23993 27265 17216 7063 9533 8411
15861H411j4539J8026J0554k6641m491K0589m116J0868l251k1756J158J5038k0013
$$ 8411 -6128 11898 22452 -4189 -8680 11909 7793 18661 15410 -6346 -5188 9850 -10163
15848a0163k2821J8988M026K77K354j932r048P822J6368l39K407L815P593k7672
$$ -10163 -32984 -13996 -9970 -9693 -7339 -9271 -18319 -10497 5871 5532 7939 11754 19347 -8325
15834h325j1777N664K9l49J0864j3086o663J0818o738J419j0226O362n403J909
$$ -8325 -20102 -14438 -14409 -14758 -3894 -16980 -23643 -12825 -19563 -18144 -28370 -22008 -27411 -25502
15820b5502K4205q647k7305K4827m660j1192J4212P540J9009j5433R960j771n169
$$ -25502 -1297 -9944 -37249 -12422 -17082 -28274 -14062 -6522 12487 -2946 7014 5243 74
15807G4r401j0320M979J2333J7042J7885k2699l607j1211J3240m901J438k9208
$$ 74 -9327 -19647 -14668 -2335 14707 32592 9893 6286 -4925 8315 3414 4852 -24356
15794b4356J0050J7310j0049j2470l234m89J4852j5288J3865o426j2386q307J585
$$ -24356 -14306 3004 -7045 -19515 -22749 -23238 -8386 -23674 -9809 -16235 -28621 -36928 -35343
15781c5343K1059J4096j4418J6834J5654k1091P371j7078K134R92k4725L730L1861
$$ -35343 -14284 -188 -14606 2228 17882 -3209 4162 -12916 -10782 -9790 -34515 -30785 1076
15768A076J7857J9298k6801l3238o695K4492J5697j050j7154k1752M224K0767
$$ 1076 18933 38231 11430 -21808 -28503 -4011 11686 10636 -6518 -28270 -24046 -3279
15756c279L3508J3442J334k9423r222l237k2441Q69L432k0280j3477j6822j2892
$$ -3279 30229 43671 45005 15582 6360 3123 -19318 -18449 -15017 -35297 -48774 -65596 -78488
15743g8488K4997M5610j6917M022J3357J7868J6259r139o052K1180j848j2795
$$ -78488 -53491 -7881 -24798 -20776 -7419 10449 26708 17569 11517 32697 30849 18054
15731A8054l4005j1331K4944J4599q05o659l1972n289Q236k3076l028K0625L929
$$ 18054 -15951 -27282 -2338 12261 11456 4797 -27175 -32464 -24228 -47304 -50332 -29707 -25778
15718b5778j899j1050k575k2162J2394J3671J4734r171J3840N778l078P868j0424
$$ -25778 -27677 -38727 -41302 -63464 -51070 -37399 -22665 -31836 -17996 -12218 -15296 -7428 -17852
15705a7852J42J4963O823j1717n792Q588p343l615l3425M478K4377K5738K4228
$$ -17852 -17710 -2747 4076 -7641 -13433 -4845 -12188 -15803 -49228 -44750 -20373 5365 29593
15692B9593k8776p835l62J8125N696r408j5140j3037J3761J7591J9260j1009r766
$$ 29593 817 -7018 -7380 10745 16441 7033 -8107 -21144 -7383 10208 29468 18459 8693
15679H693l2639o671J7634j0163J2265L6150J3258j4660j0939j190j3756k0519
$$ 8693 -23946 -30617 -12983 -23146 -10881 25269 38527 23867 12928 11738 -2018 -22537
15667b2537q454J7459J3718M6122R251j7828l1613q55L542k3591k2458J8194J7560
$$ -22537 -30991 -13532 186 46308 55559 37731 6118 5263 8805 -14786 -37244 -19050 -1490
15654a490J5375K2072j9841k1406O48P282j2573K001K6388k7156j9403N801k833
$$ -1490 13885 35957 16116 -5290 -4642 2640 -9933 -7932 18456 -8700 -28103 -22302 -25135
15641b5135J0749l634m014k6208K3969N4243k0614k6732j4034M762J4729n158
$$ -25135 -14386 -18020 -22034 -48242 -24273 29970 9356 -17376 -31410 -26648 -11919 -17077
15629a7077Q811k598K3807K8428J1374M24k8548k3977o142j9997M325j5425M201
$$ -17077 -8266 -10864 12943 41371 52745 53169 24621 644 -5498 -25495 -21170 -36595 -32394
15616c2394p542q363J0411K3312J7421j4886j4701K5261J8738j7295K431L1563
$$ -32394 -39936 -48299 -37888 -14576 2845 -12041 -26742 -1481 17257 -38 2393 33956
15604C3956j3721l0725J973N87n436o421J0792J4265K4147j5812j0428J0106K076
$$ 33956 20235 -10490 -8517 -7930 -13366 -19787 -8995 5270 29417 13605 3177 13283 15359
15591A5359k9002J9096k014N173J4732J5724j7577k2790j5676j2646j4493o607
$$ 15359 -13643 5453 3439 8612 23344 39068 21491 -1299 -16975 -29621 -44114 -50721
15579e0721K5369K9223k6159m883m784L855j1752J531J7864M970Q187N013J3953
$$ -50721 -25352 3871 -22288 -27171 -31955 -28100 -39852 -38321 -20457 -15487 -7300 -2287 11666
15566A1666j137j7486k0041k292J0122O892j454p173l486N836M926N680J5049
$$ 11666 10529 -6957 -26998 -29290 -19168 -12276 -13730 -20903 -24389 -18553 -13627 -7947 7102
15553G102k2782j8314J6208k0216l2843k755J2920p067j4768J9886K0021J6806
$$ 7102 -15680 -33994 -17786 -38002 -70845 -73600 -60680 -67747 -82515 -62629 -42608 -25802
15541b5802R075N729O353O104P96k0250j0220J3333J9662k569J6327q629n759
$$ -25802 -16727 -10998 -4645 1459 2255 -17995 -28215 -14882 4780 2211 18538 9909 4150
15528D150k1210M757K4671j2786J6468j2073k3055K917J2666L848j5150j7652
$$ 4150 -17060 -12303 12368 -418 16050 3977 -19078 -16161 -3495 353 -14797 -32449
15516c2449k4643P752K2294J1435q808j7696p051o978Q344r08P457K1321j7644
$$ -32449 -57092 -49340 -27046 -15611 -24419 -42115 -49166 -56144 -47800 -48708 -41251 -19930 -37574
15503c7574p574K7278l461N539j4578j1678k0595J7573J8287P838n838K6316l122
$$ -37574 -45148 -17870 -21331 -15792 -30370 -42048 -62643 -45070 -26783 -18945 -24783 1533 -1589
15490a589k787O774j6809R86j5526k5226l531K190P776o34M2085K0113o940k1190
$$ -1589 -4376 2398 -14411 -13425 -28951 -54177 -57708 -55518 -47742 -48376 -6291 13822 6882 -14308
15476a4308J576P830K506k2638j9200p009J0016L6930K4690k0278j5120l249q480
$$ -14308 -12732 -4902 -2396 -25034 -44234 -51243 -41227 -4297 20393 115 -15005 -18254 -26734
15463b6734J0220J8274K2051P954k0807o486J0421O664J3749l8135l3369Q842
$$ -26734 -16514 1760 23811 31765 10958 4472 14893 21557 35306 -2829 -36198 -27356
15451b7356J143j5835j0375j7015Q211K6012K1824K0160J1462n585p503K5373
$$ -27356 -26213 -42048 -52423 -69438 -61227 -35215 -13391 6769 18231 12646 5143 30516
15439C0516j9570j9213J7884L3633r222q820k8183k4251j1830Q952J2492K1530
$$ 30516 10946 -8267 9617 43250 34028 25208 -2975 -27226 -39056 -30104 -17612 3918
15427C918j3290l7687p110L6074L4038k112j0052j7854k0058K4826J8574J566
$$ 3918 -9372 -47059 -54169 -18095 15943 13831 3779 -14075 -34133 -9307 9267 10833
15415A0833o475R478J1586k9416p72Q552k6735L863j4149J5388L0822K7137k222
$$ 10833 4358 13836 25422 -3994 -4766 3786 -22949 -19086 -33235 -17847 12975 40112 37890
15402C7890k3277j8364l2722Q480J4495L9j4762O453J6785k0177l471l787R67
$$ 37890 14613 -3751 -36473 -27993 -13498 -13459 -28221 -21768 -4983 -25160 -28631 -32418 -31451
15389c1451l882J7863L3658k3387j439l62Q991j3572k048j739l037o750p764P396
$$ -31451 -35333 -17470 16188 -7199 -8638 -9000 -9 -13581 -15629 -17368 -20405 -27155 -34919 -27523
15375b7523m793j0585R601M097P915r859N737L124l952j8238L123L1395J5157
$$ -27523 -32316 -42901 -33300 -29203 -21288 -31147 -25410 -22286 -26238 -44476 -41353 -9958 5199
15362E199l1498k1288K7934J9908J3808m311L965K486J0755K206R177j6397j5561
$$ 5199 -26299 -47587 -19653 255 14063 9752 13717 16203 26958 29164 38341 21944 6383
15349F383J0751l0101j7416J1111L702Q902M164j5737j6127O585L170M594K4496
$$ 6383 17134 -12967 -30383 -19272 -15570 -6668 -2504 -18241 -34368 -27783 -24613 -20019 4477
15336D477J990J328R709j5m425Q601j9408k0582j1001J4184J0769l94N18k0480
$$ 4477 6467 7795 17504 17489 13064 21665 2257 -18325 -29326 -15142 -4373 -4767 -4249 -24729
15322b4729r506J1582M486j2454K3027J3038l5638k5955J6876M212R8l129l181
$$ -24729 -34235 -22653 -18167 -30621 -7594 5444 -30194 -56149 -39273 -35061 -34963 -38092 -41273
15309d1273l4217J008P830J8849L2064M2955m359l4112Q19q767r668K0409K7382
$$ -41273 -75490 -74482 -66652 -47803 -15739 27216 22857 -11255 -10436 -19203 -28871 -8462 18920
15296A8920L4862O081m265n753n919j9378k2623l3767j0950L3055L2319k3645
$$ 18920 53782 59863 55598 49845 43926 24548 1925 -31842 -42792 -9737 22582 -1063
15284a063N340j4340q587R317J6754K3216J6346m760k1725l2748j3586O457J6991
$$ -1063 4277 -10063 -18650 -9333 7421 30637 46983 42223 20498 -12250 -25836 -19379 -2388
15271b388Q220o57J1687L3267k067k5590j0338P200l691j5250j6019k5339m129
$$ -2388 5832 5175 16862 50129 48062 22472 12134 19334 15643 393 -15626 -40965 -45094
15258d5094J8471o532k2267J0936K1125J0664J3396L560R975P704j3220l1880
$$ -45094 -26623 -33155 -55422 -44486 -23361 -12697 699 4259 14234 21938 8718 -23162
15246b3162P785J354j2667J6974J8920j888k2167j2661j7775J0491J6641Q759
$$ -23162 -15377 -14023 -26690 -9716 9204 7316 -14851 -27512 -45287 -34796 -18155 -9396
15234i396j6341j9202K1525K672l948J7885j6012m69o841k4216k524J6018j4501
$$ -9396 -25737 -44939 -23414 -20742 -24690 -6805 -22817 -23286 -30127 -54343 -56867 -40849 -55350
15221e5350L4729J4611k7719j9400j4427o186J0965J7076J5956L3795K8241l789
$$ -55350 -20621 -6010 -33729 -53129 -67556 -73742 -62777 -45701 -29745 4050 32291 28502
15209B8502l9072j7470M305J3789P267J3517J133J5100m386L5400r50k3413L647
$$ 28502 -10570 -28040 -23735 -9946 -2679 10838 11971 27071 22685 58085 57135 33722 37369
15196C7369k2424j3429J6949r358p501J0327j6745R45j298k2369k2859R141P757
$$ 37369 14945 1516 18465 9107 1606 11933 -4812 -3867 -5165 -27534 -50393 -41252 -33495
15183c3495L296p098L24J2775q788j0957J6735K8344N145J0223k6202j936L455
$$ -33495 -30199 -37297 -36973 -24198 -32986 -43943 -27208 1136 6281 16504 -9698 -11634 -8179
15170h179J7087J5392M793j2457O925J9909j2471m4741j4587p708J5475J6767
$$ -8179 8908 24300 29093 16636 23561 43470 30999 -13742 -28329 -36037 -20562 -3795
15158c795J83P265k6085R521k7530J6401j547j2126K7397k320k414K0657k635
$$ -3795 -3612 3653 -22432 -12911 -40441 -24040 -25587 -37713 -10316 -12636 -15050 5607 2972
15145B972k274N62l390j712j6415k0966J3440L1799R457J3664k4957j5080j4588
$$ 2972 698 1260 -2130 -3842 -20257 -41223 -27783 4016 13473 27137 2180 -12900 -27488
15132b7488l2820J3306J0059k8231k4927J4970J8557k7799J2501N2646L7757k2433
$$ -27488 -60308 -47002 -36943 -65174 -90101 -75131 -56574 -84373 -71872 -19226 18531 -3902
15120c902k8017m140K6825J0076L500j4358K348J582r357L4244J4573j76L987
$$ -3902 -31919 -36059 -9234 842 4342 -10016 -7668 -6086 -15443 18801 33374 33198 37185
15107C7185k0240l1650r73j1671j7635K1571J9457L647p092j8739k1576J8749
$$ 37185 16945 -14705 -15678 -27349 -44984 -23413 -3956 -309 -7401 -26140 -47716 -28967
15095b8967J8933J0363L578J4878J4717q018k0307j7721k410N240J2876j3619
$$ -28967 -10034 329 3907 18785 33502 25484 5177 -12544 -14954 -9714 3162 -10457
15083a0457k5312O77j1904j2168J4815L8543K4047k0901l5231L485K8660o3p874
$$ -10457 -35769 -35092 -46996 -59164 -44349 -5806 18241 -2660 -37891 -34406 -5746 -5809 -13683
15070a3683l504N187j9302l2214M155q061r156M0817L9118k395P699J0370K077
$$ -13683 -17187 -12000 -31302 -63516 -59361 -67422 -76578 -35761 3357 962 8661 19031 21108
15057B1108o253r617l807K4530J4509l8027o848Q501O991r328P763l0974j9039
$$ 21108 14855 5238 1431 25961 40470 2443 -4405 4096 11087 1759 9522 -21452 -40491
15044d0491J6133K895Q988P415J4688R056j5257l4693J3018K2165J6761k095k1719
$$ -40491 -24358 -21463 -12475 -5060 9628 18684 3427 -31266 -18248 3917 20678 18583 -3136
15031c136J8307j3236K590K2662J1913j5034l5124k3213j3403N833K0116Q070
$$ -3136 15171 1935 4525 27187 39100 24066 -11058 -34271 -47674 -41841 -21725 -13655
15019a3655L716n277j6629O185r249q087J0788J608j6305J2094J2884J0685j1684
$$ -13655 -9939 -15216 -31845 -25660 -34909 -42996 -32208 -30600 -46905 -34811 -21927 -11242 -22926
15006b2926l088k088K1605K007j748R522J0729j1727l4408j5487k8301J2918P457
$$ -22926 -26014 -28102 -6497 -4490 -6238 3284 14013 2286 -32122 -47609 -75910 -62992 -55535
14993e5535J3408K4896j1911K2008J9670L756k8982r052l492p328J3991J0155
$$ -55535 -42127 -17231 -29142 -7134 12536 16292 -12690 -21742 -25234 -32562 -18571 -8416
14981h416K15q707N758J6445k624l2337J3904N991L24J6315k2131k1220j0841
$$ -8416 -8201 -16908 -11150 5295 2671 -29666 -15762 -9771 -9447 6868 -15263 -36483 -47324
14968d7324O951L0153J9941r600m406R443k887j1912r995j4824l347J4182J0582
$$ -47324 -40373 -10220 9721 121 -4285 5158 2271 -9641 -19636 -34460 -37807 -23625 -13043
14955a3043j9303J5506p594l2645o578K0756K2526L9044J9368p885k1790k5850
$$ -13043 -32346 -16840 -24434 -57079 -63657 -42901 -20375 18669 38037 30152 8362 -17488
14943a7488J0J6104l394k8284j4414J0891Q963k1461J5962J200M137J3514J0734
$$ -17488 -17478 -1374 -4768 -33052 -47466 -36575 -27612 -49073 -33111 -31911 -27774 -14260 -3526
14930c526J537j4229M38r7j0948K810J2067J014l4102M760K3446J1405p719k572
$$ -3526 -1989 -16218 -15780 -15877 -26825 -24015 -11948 -10934 -45036 -40276 -16830 -5425 -13144 -15716
14916a5716k0629j835m496R044K4693k832K3955P081k7456k073j7288j4983J2087
$$ -15716 -36345 -38180 -42676 -33632 -8939 -11771 12184 19265 -8191 -10264 -27552 -42535 -30448
14903c0448J2429K4631j3747l2542J9202K1391m440r998O297j191m272Q092n2
$$ -30448 -18019 6612 -7135 -39677 -20475 916 -3524 -13522 -7225 -8416 -12688 -4596 -4648
14890d648O2R198l662j2591N049L457k267K3006j6443k8253J7995j4611k9137
$$ -4648 -4586 4612 950 -11641 -6592 -3135 -5402 17604 1161 -27092 -9097 -23708 -52845
14877e2845J7356P999o034m680n714J7793K6965j0887q852j0391Q838M623j3730
$$ -52845 -35489 -27490 -33524 -38204 -43918 -26125 840 -10047 -18899 -29290 -20452 -15829 -29559
14864b9559k6418j1544L316K5812j106J2767J4117J378M991m64L65P049k3287
$$ -29559 -55977 -67521 -64205 -38393 -39499 -26732 -12615 -11237 -6246 -6710 -6345 704 -22583
14851b2583j2797p301j987R491j515J5371J4688l836j4142O731J4746k8440k777
$$ -22583 -35380 -42681 -44668 -35177 -36692 -21321 -6633 -10469 -24611 -17880 -3134 -31574 -34351
14838c4351j4009j0563p176J7196J5639L00J0595K149l664m762J8097L998k6143
$$ -34351 -48360 -58923 -66099 -48903 -33264 -32964 -22369 -20220 -23884 -28646 -10549 -6551 -32694
14825c2694J2902J5517j5897j8235R96O047j1581j0865J4977J7159K809P848p423
$$ -32694 -19792 -4275 -20172 -38407 -37411 -31364 -42945 -53810 -38833 -21674 -18865 -11017 -18440
14812a8440k6169j8454P989J3994J1802l890q916p334K3388j0102J3028J0250
$$ -18440 -44609 -63063 -55074 -41080 -29278 -33168 -42084 -49418 -26030 -36132 -23104 -12854
14800a2854l042J2427J802l152j4428j2067j6251q881J5774P618J1136K3508K627
$$ -12854 -15896 -3469 -1667 -4819 -19247 -31314 -47565 -56446 -40672 -33054 -21918 1590 4217
14787D217k3572m102K5061J1561j2746j8229k6704l9767L0265J0969J1455Q21
$$ 4217 -19355 -23457 1604 13165 419 -17810 -44514 -84281 -54016 -43047 -31592 -30771
14775c0771P210o698j3445J7722R680J8654J9052l0620k7478J9407P347k2750
$$ -30771 -23561 -30259 -43704 -25982 -16302 2352 21404 -9216 -36694 -17287 -9940 -32690
14763c2690l4009K4643J2241j0210k2021O640J5864L7529K8237j9143l2140j0383
$$ -32690 -66699 -42056 -29815 -40025 -62046 -55406 -39542 -2013 26224 7081 -25059 -35442
14751c5442J76R031q733R4K9997J931O483P014j4945J0283j4697r987J4193m174
$$ -35442 -35266 -26235 -34968 -34874 -4877 -2946 3537 10551 -4394 5889 -8808 -18795 -4602 -8776
14737h776Q257L808K9722K436k2387l6497K510j3231K3213M5425k512J0458n077
$$ -8776 -519 3289 33011 35447 13060 -23437 -20927 -34158 -10945 34480 31968 42426 37349
14724C7349j2425M93j070m345k4409j1313O586n314j284l4331o212M6236k5761
$$ 37349 24924 25417 24347 20002 -4407 -15720 -9134 -14448 -15732 -50063 -56275 -10039 -35800
14711c5800l8653J2598N6312J7808j9545K558k630L0348n439k7332J7570J8261
$$ -35800 -74453 -61855 -5543 12265 -7280 -4722 -7352 22996 17557 -9775 7795 26056
14699B6056n286j7921J064r148O74j3544o867j3659J0723K4422l1028k6654N772
$$ 26056 20770 2849 3913 -5235 -4561 -18105 -24972 -38631 -27908 -3486 -34514 -61168 -55396
14686e5396L5881K6777o292J4023J6512k671j8924k2695K610j0715P294k1219
$$ -55396 -19515 7262 970 14993 31505 28834 9910 -12785 -10175 -20890 -13596 -34815
14674c4815k0302J7353J5535k546j6107q81J8036K5186j790j8330j022j211O979
$$ -34815 -55117 -37764 -22229 -24775 -40882 -41763 -23727 1459 -331 -18661 -19683 -20894 -13915
14661a3915J8839l79L5356J4222P843k2012m021J3074o692r953r277j7700j9841
$$ -13915 4924 4545 39901 54123 61966 39954 35933 49007 42315 32362 23085 5385 -14456
14648a4456p931j1780K4127J4689P35K472N153P342K4850q71j6259j7324O025
$$ -14456 -22387 -34167 -10040 4649 5384 7856 13009 20351 45201 44330 28071 10747 16772
14635A6772q100j2311J0096q30J3232P143j7364l8148m272J1168K0769o982p827
$$ 16772 8672 -3639 6457 5627 18859 26002 8638 -29510 -33782 -22614 -1845 -8827 -16654
14622a6654J0209k637j5153K236o225o199p29L273J6525R649M683K465j6227q471
$$ -16654 -6445 -9082 -24235 -21999 -28224 -34423 -35152 -31879 -15354 -5705 -1022 1443 -14784 -23255
14608b3255J4062L756q060L855l541R022k158J712J7714j969k9580k3780L216
$$ -23255 -9193 -5437 -13497 -9642 -13183 -4161 -6319 -4607 13107 11138 -18442 -42222 -39006
14595c9006j4644J0832J9477K0046k8017j932M8125L8813l8796r308L5294J1038
$$ -39006 -53650 -42818 -23341 -3295 -31312 -33244 14881 53694 14898 5590 40884 51922
14583E1922j5686m645O111J019l7031k1824r000R856J7665P855K6370J0284l5529
$$ 51922 36236 31591 37702 38721 1690 -20134 -29134 -19278 -1613 6242 32612 42896 7367
14570G367p700r896j3799J8301J3067O394n265k3403l2284l841R802O423K620
$$ 7367 -333 -10229 -24028 -5727 7340 13734 8469 -14934 -47218 -51059 -41257 -34834 -32214
14557c2214J7737K920k9484l516L5958J7121j07L011m576n485l413k6338r592
$$ -32214 -14477 -11557 -41041 -44557 -8599 8522 8415 11426 6850 1365 -2048 -28386 -37978
14544c7978O068j343J2739J3278O770k808J5298k0709k5240k380M44K5618l445
$$ -37978 -31910 -33253 -20514 -7236 -466 -3274 12024 -8685 -33925 -36305 -35861 -10243 -13688
14531a3688k0151n991J9410J0615j1226M680j6684k8945p629K4267M0020Q727
$$ -13688 -33839 -39830 -20420 -9805 -21031 -16351 -33035 -61980 -69609 -45342 -5322 3405
14519C405j2052k1797l366J1006j5365R449R145j5184Q400j9219j2118K4822J4698
$$ 3405 -8647 -30444 -33810 -22804 -38169 -28720 -19575 -34759 -26359 -45578 -57696 -32874 -18176
14506a8176J3843j5718k1742L83K4344K2532j8354j2089K5729J0429j2761J5405
$$ -18176 -4333 -20051 -41793 -41410 -17066 5466 -12888 -24977 752 11181 -1580 13825
14494A3825n563q165J9820q892k4635J447J6943J6981L977j018R32L3084k0902
$$ 13825 8262 97 19917 11025 -13610 -12163 4780 21761 25738 24720 25652 58736 37834
14481C7834r023o477j5009O255P986j780L466k3310j6596j2589M783J9732M807
$$ 37834 28811 22334 7325 13580 21566 19786 23252 -58 -16654 -29243 -24460 -4728 79
14468G9J3380K5310K9129J0095J842j2655k1596k5892j7970j7648N902L154j1189
$$ 79 13459 38769 67898 77993 79835 67180 45584 19692 1722 -15926 -10024 -6870 -18059
14455a8059j0720p222j1456K0410j2979O996J0550m276q75M1831K0931j3413p026
$$ -18059 -28779 -36001 -47457 -27047 -40026 -33030 -22480 -26756 -27631 14200 35131 21718 14692
14442A4692N629k799m903K865O912Q600j5609j8975j9233k7035k570k190L1121
$$ 14692 20321 17522 12619 15484 22396 30996 15387 -3588 -22821 -49856 -52426 -54616 -23495
14429b3495L7633L6867j1724r700j6888l6798m613M366N391K3410m882k2763O326
$$ -23495 14138 51005 39281 29581 12693 -24105 -28718 -24352 -18961 4449 -433 -23196 -16870
14416a6870J4112L1738K286j8949N796J558k0204J912O827j8012j5216j2987k773
$$ -16870 -2758 28980 31266 12317 18113 19671 -533 1379 8206 -9806 -25022 -38009 -40782
14403d0782m098p3O813O303m73J411J874K0082K2892J6818L2911m738q776m291
$$ -40782 -44880 -44953 -38140 -31837 -32310 -30899 -29025 -8943 13949 30767 63678 58940 50164 45873
14389D5873j7827o845O182K5519j0925j6006j1344j0045q625J7744p516l0687
$$ 45873 28046 21201 27383 52902 41977 25971 14627 4582 -4043 13701 6185 -24502
14377b4502l1581p058L0836K0353o245P909O878J1076Q544m067j31l8439j1390
$$ -24502 -56083 -63141 -32305 -11952 -18197 -10288 -3410 7666 16210 12143 12012 -26427 -37817
14364c7817K7219J1603k573j812J771n314k3979j4986K1384J1455r16r494J1289
$$ -37817 -10598 1005 -1568 -3380 -1609 -6923 -30902 -45888 -24504 -13049 -13965 -23459 -12170
14351a2170J4609L193O649l3340k0910L917O117j4663k1640o141j9593K186M3566
$$ -12170 2439 5632 12281 -21059 -41969 -38052 -31935 -46598 -68238 -74379 -93972 -91786 -48220
14338d8220Q718k8883o486L3756N679K3508J4120J80j4281J501r52j3587k1226
$$ -48220 -39502 -68385 -74871 -41115 -35436 -11928 2192 2372 -11909 -10408 -11360 -24947 -46173
14325d6173J1910M5537o426m1317l253K6926Q707M307N341q589r619k0515j4325
$$ -46173 -34263 11274 4848 -36469 -39722 -12796 -4089 218 5559 -3030 -12649 -33164 -47489
14312d7489K8299J7943n764J8443J2736l720j154q994k1439K4460J1829o168L228
$$ -47489 -19190 -1247 -7011 11432 24168 20448 19294 10300 -11139 13321 25150 18982 22210
14299B2210K5348R160o2k7811k4676j8665k2664j7342J4964K1707K2175P881r25
$$ 22210 47558 56718 56656 28845 4169 -14496 -37160 -54502 -39538 -17831 4344 12225 11300
14286A1300j4329J2300o208l0474o117J0829J6480J670Q403j087n555r699K5280
$$ 11300 -3029 9271 3063 -27411 -33528 -22699 -6219 -4549 3854 2767 -2788 -12487 12793
14273A2793l385J349J37J4283j99j9609J2795l012J9844R976J5251J245J2592
$$ 12793 9408 10757 10894 25177 24978 5369 18164 15152 34996 44972 60223 61468 74060
14260G4060k2905j8050Q308K3153L369m850r45k2774j7983R752j9178j221L794
$$ 74060 51155 33105 41413 64566 67935 63085 62140 39366 21383 31135 11957 10736 14530
14247A4530L7870P1670M3484O558j5480J3280J6778L2272O9450M0889P5738Q2652
$$ 14530 52400 124070 167554 174112 158632 171912 188690 220962 290412 331301 407039 489691
14235D89691J23522J66285J25381J78350J68058J64023J57152J45927J07195P5392
$$ 489691 613213 779498 904879 1083229 1251287 1415310 1572462 1718389 1825584 1900976
14225A900976M2135L2072K110J5769K3094j8723p2383q2973p1178j35258j70220
$$ 1900976 1943111 1975183 1977293 1993062 2016156 1997433 1925050 1842077 1770899 1635641 1465421
14214A465421j92017j95685j68553j42341j44928j20158r7170m8386j2317j2113
$$ 1465421 1273404 1077719 909166 766825 621897 501739 404569 356183 343866 331753
14204C31753m3115p7931l2819k1017k6216L090Q898k2141K367K0526j6935k2831
$$ 331753 288638 210707 177888 156871 130655 133745 142643 120502 122869 143395 126460 103629
14192A03629O36K8363j5306k2776n321j7613k7871j4151r804J5671L320K1135
$$ 103629 104265 132628 117322 94546 89225 71612 43741 29590 19786 35457 38777 59912
14180E9912L5226q311k1217j0025j0897J7647J4935j4413O473j3337k7717j9560
$$ 59912 95138 86827 65610 55585 44688 62335 77270 62857 69330 55993 28276 8716
14168H716M849k7131m786J2220K8243o638l954J5987j1290M853R765j5634j6653
$$ 8716 13565 -13566 -18352 -6132 22111 15473 11519 27506 16216 21069 30834 15200 -1453
14155a453J5290o669J1273Q574m980J3268K291j1725k5468j5913J1998J1976k4081
$$ -1453 13837 7168 18441 27015 22035 35303 37594 25869 401 -15512 -3514 8462 -15619
14142a5619J3064J2267K830P627k4316Q429n971J9024P305n971l6903k2772P322
$$ -15619 -2555 9712 12542 20169 -4147 4282 -1689 17335 24640 18669 -18234 -41006 -33684
14129c3684O731j2103R602M4743K6092j40R474k4128M366J749j3604K560j0916
$$ -33684 -26953 -39056 -29454 15289 41381 41241 50715 26587 30953 32702 19098 21658 10742
14116A0742K040N153q43M75j3230J3051m404k5410j2616j3877j1330K3438J6564
$$ 10742 12782 17935 17092 17567 4337 17388 12984 -12426 -25042 -38919 -50249 -26811 -10247
14103a0247n969k2244O918L1615J5977P125o10k7130m947K5349J4205O87n752
$$ -10247 -16216 -38460 -31542 73 16050 23175 22565 -4565 -9512 15837 30042 30729 24977
14090B4977n270M905J3038p929j7119J1518k785j0772N267j1578j0748J0130p408
$$ 24977 19707 24612 37650 29721 12602 24120 21335 10563 15830 4252 -6496 3634 -3774
14077c774Q746L5001j0022j3720k054J4379K6340J2860j3997l23j5346m4390l0989
$$ -3774 4972 39973 29951 16231 14177 28556 54896 67756 53759 53436 38090 -6300 -37289
14064c7289J9459N8792N0273j6172l0691k2724k1413M803K3375K5615N458j045
$$ -37289 -17830 40962 91235 75063 44372 21648 235 5038 28413 54028 59486 58441
14052E8441r389m7143L994Q312j1486N315N540J9324J9411m124j2865K068m849
$$ 58441 49052 1909 5903 14215 2729 8044 13584 32908 52319 48195 35330 37398 32549
14039C2549N895J6218j0954P913j2917j6984K7721k4250j7101J9906K1759m288
$$ 32549 38444 54662 43708 51621 38704 21720 49441 25191 8090 27996 49755 45467
14027D5467J8839J3596J2567L727m929J3131K3625L0806P609J8275M9795K9074
$$ 45467 64306 77902 90469 94196 89267 102398 126023 156829 164438 182713 232508 261582
14015B61582P4077J07484J15560J00790J01852J55947J82890J99304J82399J30493
$$ 261582 335659 443143 558703 659493 761345 917292 1100182 1299486 1481885 1612378
14005A612378Q1900N5549r213j08565k01289k43606k56697k27469j66091j00173
$$ 1612378 1694278 1749827 1740614 1632049 1430760 1187154 930457 702988 536897 436724
13995D36724p4126o2160k4278j0622o0979l6433k6151l1740j9097n321K055R212
$$ 436724 362598 300438 276160 265538 204559 168126 141975 110235 91138 85817 87872 97084
13983I7084p499k9794l509r692j1914m475p069j0242k560J2925L1965j363l69
$$ 97084 89585 59791 56282 46590 34676 30201 23132 12890 10330 23255 55220 53857 53488
13970E3488j56k0267l069K1499J2476k8816J533O643j6424K4071L07J8287N26
$$ 53488 53332 33065 29996 51495 63971 35155 36688 43331 26907 50978 51285 69572 70098
13957G0098k7966l2839K05q932l944J3391O743M495p397q8m33j0208j972j8199
$$ 70098 42132 9293 9498 566 -3378 10013 16756 21251 13854 13766 13333 3125 1153 -17046
13943a7046P857P129P378J9858L753k1978n643O21j4267Q837J9681L230q139j4786
$$ -17046 -9189 -2060 5318 25176 28929 6951 1308 1929 -12338 -3501 16180 19410 11271 -3515
13929c515j1290Q532l270J6500J0480o316j2332k1476m176J9258J5581J1625J4827
$$ -3515 -14805 -6273 -9543 6957 17437 11121 -1211 -22687 -26863 -7605 7976 19601 34428
13916C4428J451p039K521j4065r637O881J396Q391k5793q130J5627Q569l575O287
$$ 34428 35879 28840 31361 17296 7659 14540 15936 24327 -1466 -9596 6031 14600 11025 17312
13902A7312j3957K947r921l240K8269J2480J1035O980K967j1361j9497L65K4816
$$ 17312 3355 6302 -3619 -6859 21410 33890 44925 51905 54872 43511 24014 24379 49195
13889D9195p860K059k9081j4327n369J0895J38j8657k4656q127J3894L1974K2087
$$ 49195 41335 43394 14313 -14 -5383 5512 5650 -13007 -37663 -45790 -31896 78 22165
13876B2165J1971J4882K3849j916m1476l0084O52N229L777n034n032j1339J6150
$$ 22165 34136 49018 72867 70951 29475 -609 43 5272 9049 4015 -1017 -12356 3794
13863C794p381j2623k5680p279K4401m433O268q91L81J827J6538M984j0362N624
$$ 3794 -3587 -16210 -41890 -49169 -24768 -29201 -22933 -23824 -23443 -21616 -5078 -94 -10456 -4832
13849d832M3757K0062j0219k9631j4105J3375L0513K4948N18l2330R160n212k3661
$$ -4832 38925 58987 48768 19137 5032 18407 48920 73868 74386 42056 51216 46004 22343
13836B2343J780Q883Q939l1041K514M583K248j7039K1405J882j7984r881K1970
$$ 22343 24123 33006 41945 10904 13418 18001 20249 3210 24615 26497 8513 -1368 20602
13823B0602J0463j660l303j045n593M648J513L857J3352q872j4219l979K30l090
$$ 20602 31065 29405 26102 25057 19464 24112 25625 29482 42834 33962 19743 15764 15994 12904
13809A2904k5193L068K4742L1881J290p563k61K4027K0988K9947l0909l9765m874
$$ 12904 -12289 -9221 15521 47402 48692 41129 40868 64895 85883 115830 84921 45156 40282
13796D0282L9470j49j1192K923K7191L5262j909k4413k4629q359j1602k4969j8640
$$ 40282 79752 79603 68411 71334 98525 133787 131878 107465 82836 74477 62875 37906 19266
13783A9266j808j0542N902M772J5624j1259l984J1399L56n830N155j3275p834
$$ 19266 17458 6916 12818 17590 33214 21955 17971 29370 29726 23896 29051 15776 7942
13770G942M1741j1048j1522J5306K9028l8162j0728J0599J8218J2909O21J065
$$ 7942 49683 38635 27113 42419 71447 33285 22557 33156 51374 64283 64904 65969
13758F5969J0780j05q21J8291j7345j5612p559R826J0676n635k7921k2440l8972
$$ 65969 76749 76644 75823 94114 76769 61157 53598 63424 74100 68465 40544 18104 -20868
13745b0868M926K0185J3655N749O54j1918j1282K2513L7117q813r621o322L25
$$ -20868 -15942 4243 17898 23647 24301 12383 1101 23614 60731 51918 42297 35975 36300
13732C6300K0586J1168l0219K774J2250R957l5560m206P179J3821J9202q808Q977
$$ 36300 56886 68054 37835 40609 52859 62816 27256 23050 30229 44050 63252 54444 63421
13719F3421M082p56l0093p320j2456K6486O178k7829j3654j3513L608L3694l863
$$ 63421 67503 66747 36654 29334 16878 43364 49542 21713 8059 -5454 -1846 31848 27985
13706B7985r485J6119J9660K726K716j0697j4089p897j4533J4612L052q085J1837
$$ 27985 18500 34619 54279 57005 59721 49024 34935 27038 12505 27117 30169 22084 33921
13693C3921J6635K5310n388j2088r001J909k824j2987o128J2264K1465r15m924
$$ 33921 50556 75866 70478 58390 49389 51298 48474 35487 29359 41623 63088 62173 57249
13680E7249M2554L3974m918O704j9270q139O703J4268q14N243p57K849K0037r843
$$ 57249 99803 133777 128859 135563 116293 108154 114857 129125 128311 133554 132797 135646 155683 145840
13666A45840l5803P36M6393J0651P077Q423J2631K0013j679P410J6713K6412J4
$$ 145840 110037 110773 157166 167817 174894 183317 195948 215961 214282 221692 238405 264817 264831
13653B64831N024J5401L1543K0329J77K7144O5297O0634N8871O7560P1414O3463
$$ 264831 269855 285256 316799 337128 337305 364449 429746 490380 549251 616811 688225 751688
13641G51688Q8090J41001J58977J97092K01891J96660K48809K80726L11419L21774
$$ 751688 839778 980779 1139756 1336848 1538739 1735399 1984208 2264934 2576353 2898127
13631B898127L33793L50554L85679L78034L52307L41530L69980L31060L16111
$$ 2898127 3231920 3582474 3968153 4346187 4698494 5040024 5410004 5741064 6057175
13622F057175K67350K25068J91936J61749J57333P6407M2987j4451p4423j52003
$$ 6057175 6324525 6549593 6741529 6903278 7060611 7137018 7180005 7165554 7091131 6939128
13612F939128j82233k52779l01409l09577l21892l32770l54142l55203l84390
$$ 6939128 6756895 6504116 6202707 5893130 5571238 5238468 4884326 4529123 4144733
13603D144733l59508l24331l11699l22775k87421k35568k44378k00195j91280
$$ 4144733 3785225 3460894 3149195 2826420 2538999 2303431 2059053 1858858 1667578
13594A667578j75257j71545j49375j21982j25551j02217p4758n6721q9255p1697
$$ 1667578 1492321 1320776 1171401 1049419 923868 821651 746893 690172 600917 529220
13584E29220o9794m9275n2019l4014j1368m8552n1257q728Q051j5501j4429k3261
$$ 529220 459426 410151 358132 324118 312750 264198 212941 204213 212264 196763 182334 159073
13572A59073j6387j9008k066Q52K3195O649N197n844J5683j0110l6631l0020j5063
$$ 159073 142686 123678 121612 122464 145659 152308 157505 151661 167344 157234 120603 90583 75520
13559G5520l6411l0698n53M2766J2740K973p502K7634J3829j9156m680l3949j0095
$$ 75520 39109 8411 7858 50624 63364 66337 58835 86469 100298 81142 76462 42513 32418
13546C2418j5438k2831Q995J2623J6302L4154N240j0289J2199M177j5759k6009
$$ 32418 16980 -5851 3144 15767 32069 66223 71463 61174 73373 77550 61791 35782
13534C5782k1871o843J8154J1909o278O458n172K5325j520l165p83p205j59l60
$$ 35782 13911 7068 25222 37131 30853 37311 32139 57464 55944 52779 51996 44791 44632 44272
13520D4272J3967j3781L855J9973J0095k085n101K5419N104k818k7572J0187r142
$$ 44272 58239 44458 48313 68286 78381 76296 71195 96614 101718 98900 71328 81515 72373
13507G2373j6458J4720q099j6026j5546j5102J1509J9227J8544j9650K010K2099
$$ 72373 55915 70635 62536 46510 30964 15862 27371 46598 65142 45492 47502 69601
13495F9601J742o721k243q777k859K812J6427M756j6812j6205J0946j3454k7012
$$ 69601 71343 64622 62379 53602 50743 53555 69982 74738 57926 41721 52667 39213 12201
13482A2201P153L7663J4827R078m83j0146j3689K382K2824k6761j5447j1950L558
$$ 12201 19354 57017 71844 80922 80439 70293 56604 58986 81810 55049 39602 27652 31210
13469C1210P743J2391k1640L284K9929O491J6985k5505k458l082k6794r998M4270
$$ 31210 38953 51344 29704 32988 62917 69408 86393 60888 58430 55348 28554 18556 62826
13456F2826M122o386L733j4485J9335J1429j4186O673N957k4053L968Q756J1907
$$ 62826 66948 60562 64295 49810 69145 80574 66388 73061 79018 54965 58933 67689 79596
13443G9596r842M4851P780k8606j7191P54M848J9096J9865j2104l0416j3287k5993
$$ 79596 69754 114605 122385 93779 76588 77342 82190 101286 121151 109047 78631 65344 39351
13430C9351l5596O557K0680k0534k1507n380K7890M9926L0834j2023k121L247
$$ 39351 3755 10312 30992 10458 -11049 -16429 11461 61387 92221 80198 78077 81324
13418H1324m243j3937j1947J9524N822l20l52k0942k5618q489o527K0472l80l8483
$$ 81324 77081 63144 51197 70721 76543 76223 75871 54929 29311 20822 14295 34767 34387 -4096
13404d096R049R700J9501L9770K1583k0961j5851P64j0261k8269K838n610J6986
$$ -4096 4953 14653 34154 73924 95507 74546 58695 59459 49198 20929 23767 18157 35143
13391C5143j7232L1308M0095K5768J4198r673l4124l5617j6942o237J3401J3900
$$ 35143 17911 49219 89314 115082 129280 119607 85483 49866 32924 26687 40088 53988
13379E3988K8245L54k9148k6230Q451L5263K4084P855m690P122J9619n597j5140
$$ 53988 82233 82587 53439 27209 35660 70923 95007 102862 98172 105294 124913 119316 104176
13366A04176m1411k0925L1483L280l1872k2950O188j5032p286K673K470M740k6047
$$ 104176 62765 41840 73323 76603 44731 21781 27969 12937 5651 8324 10794 15534 -10513
13353a0513K0996j0235K568K5953J1410P757k8211k1840Q328N71K406J1031j0362
$$ -10513 10483 248 2816 28769 40179 47936 19725 -2115 6213 6784 9190 20221 9859
13340I859Q784R175O049M587N513J8246q848r184j5324j7394K783Q002j0645q882
$$ 9859 18643 27818 33867 38454 43967 62213 53365 44181 28857 11463 14246 22248 11603 2721
13326B721K7771l959k2348L987K9263J5362J7685K6433R703j7630j4778k33R485
$$ 2721 30492 26533 4185 8172 37435 52797 70482 96915 106618 88988 74210 73977 83462
13313H3462N785o544J127j5888q857j6177k9020j5783K3848m17R56L4599J1787
$$ 83462 89247 82703 83830 67942 59085 42908 13888 -1895 21953 21536 22492 57091 68878
13300F8878M922j7833O499J6629O35j1880R97R985k578J5946J6099j2264k2085
$$ 68878 73800 55967 62466 79095 79730 67850 68847 78832 76254 92200 108299 96035 73950
13287G3950j4460N144J0084L7858K1042N273J6987J2295J1077M5595K8617l212
$$ 73950 59490 64634 74718 112576 133618 138891 155878 168173 179250 224845 253462 250250
13275B50250R001R2729R9206Q5460J02107J12992J41066J80018J75623J35403
$$ 250250 259251 351980 451186 536646 638753 751745 892811 1072829 1248452 1383855
13265A383855Q6231K9160n4125j43367j86267j77168j77851j44010r3026q9280
$$ 1383855 1470086 1499246 1445121 1301754 1115487 938319 760468 616458 523432 434152
13255D34152p6421m7854k1006j2822l2976m6394k8592k0165m47J7342j0660j7398
$$ 434152 357731 309877 288871 276049 243073 196679 168087 147922 147475 164817 154157 136759
13243A36759O586k5111r608N363j5M270j0032k3576j7384q822l062K2676L1662
$$ 136759 143345 118234 108626 113989 113974 118244 108212 84636 67252 58430 55368 78044 109706
13230A09706j0597J8856O887J6069j0051j1509o030j0033j8986j1721k1966J719
$$ 109706 99109 117965 124852 140921 130870 119361 113331 103298 84312 72591 50625 52344
13218E2344J1052J1172J0827J2792L5632j3377j8515M828M51j0348k3471K3975
$$ 52344 63396 74568 85395 98187 133819 120442 101927 106755 107206 96858 73387 97362
13206I7362K2762L0790K4746l969k5346k4001q322l308Q341M024p193J0174P719
$$ 97362 120124 150914 175660 171691 146345 122344 114022 110714 119055 123079 115886 126060 133779
13193A33779j603N135J5405L8030l808l9795m0107J1695K377l1107J1749j0751
$$ 133779 132176 137311 152716 190746 186938 147143 107036 118731 121108 90001 101750 90999
13181I0999L941k0542J3424J8637j0414n170j1355J3025N21j6912J0830K7696
$$ 90999 94940 74398 87822 106459 96045 90875 79520 92545 93066 76154 86984 114680
13169A14680K2330M020k8568O756R764K5725J3089Q207J4306r876J6177j923K5339
$$ 114680 137010 141030 112462 119218 128982 154707 167796 176003 190309 180433 196610 194687 220026
13156B20026M7637O3043Q3918J26500J32152J54243J91697K30811K26607J37281
$$ 220026 267663 330706 414624 541124 673276 827519 1019216 1250027 1476634 1613915
13146A613915R5239M3581n1048j65009j84990j91896k05630j72074j57725j17889
$$ 1613915 1709154 1752735 1701687 1536678 1351688 1159792 954162 782088 624363 506474
13136E06474q6915p2748o6239m4547q696j8139q744j0063j0377k194k5933j4628
$$ 506474 419559 346811 280572 236025 227329 209190 200446 190383 180006 177812 151879 137251
13124A37251R601J5156P362M916m534j986k940k3911j1881j3699o752q314j5528
$$ 137251 146852 162008 169370 174286 169752 167766 164826 140915 129034 115335 108583 100269 84741
13111H4741J7035J4540r881l7005l0915K6658L8529N1619L0048L5934K6165L2807
$$ 84741 101776 116316 106435 69430 38515 65173 103702 155321 185369 221303 247468 280275
13099B80275J7302N927j5027k8930m9465l2729l1452l0379k2426P550m324K9713
$$ 280275 297577 303504 288477 259547 210082 177353 145901 115522 93096 100646 96322 126035
13087A26035r345j7947P69K3407J4734k2873l2440j4032J8982L172J2304L348
$$ 126035 116690 98743 99512 122919 137653 114780 82340 68308 87290 90462 102766 106114
13075A06114K5487J1192j7307j4729k5190j1146q1K7864K2037l209J1241L961
$$ 106114 131601 142793 125486 110757 85567 74421 74340 102204 124241 121032 132273 136234
13063A36234k1369M539O067j1427O717L153P138L518N920J5260M269j9356j6838
$$ 136234 114865 119404 125471 114044 120761 123914 131052 134570 140490 155750 160019 140663 123825
13050A23825k1878L342m557j9099k540J2242q858q682J2557N7556J4743p273K5836
$$ 123825 101947 105289 100732 81633 79093 91335 82477 73795 86352 143908 158651 151378 177214
13037A77214K7524k922k0660l5654n559l9568m1758j0591L562J3066J0013Q79
$$ 177214 204738 201816 181156 145502 139943 100375 58617 48026 51588 64654 74667 75546
13025G5546K5499J5926m821J80j741J0400K4675O07J7411R225j4741j8998L3034
$$ 75546 101045 116971 112150 112330 110589 120989 145664 146271 163682 172907 158166 139168 172202
13012A72202M0438q91L7243R1397Q9217J02969J01098N8776M0928k327p6551j04439
$$ 172202 212640 211749 248992 340389 429606 532575 633673 692449 733377 731050 654499 550060
13000E50060o8472p3700p6737m6706q663K993K7352K25K5033K4022L4342M7648
$$ 550060 481588 407888 331151 284445 275782 278775 306127 306352 331385 355407 389749 437397
12988D37397L8874L9293N4798Q3799J36743J60691J97487J94992J31522N2156
$$ 437397 476271 515564 570362 654161 790904 951595 1149082 1344074 1475596 1527752
12978A527752l8302j19293j58632j43527j33934j23164j03104r0043p7121o0635
$$ 1527752 1489450 1370157 1211525 1067998 934064 810900 707796 617753 540632 479997
12968D79997k3596l9819m1575j3506k0184j6664P264j927J7586N4023O9246Q1208
$$ 479997 456401 416582 375007 361501 341317 324653 331917 329990 347576 401599 470845 552053
12956E52053R5229P3796Q0421Q3631K9732N610l1584r4741j04147l1593o4506
$$ 552053 647282 721078 801499 885130 914862 920472 888888 794147 690000 658407 593901
12945E93901r0983n2858k5981j4156l4888l8176l8101j1011j0973k9335K2173
$$ 593901 502918 450060 424079 409923 375035 336859 298758 287747 276774 247439 269612
12934B69612K6283N4697J01544N7284Q2043R3182R0868P6741M6236Q2125Q2691
$$ 269612 295895 350592 452136 509420 591463 684645 775513 852254 898490 980615 1063306
12923A063306J9308J8854M1145M6516K8518o510m2250o2678m5438r5475o6385
$$ 1063306 1082614 1101468 1142613 1189129 1217647 1211137 1168887 1106209 1060771 965296 898911
12912H98911m0813p6694q3483n7798j1075r437m0071o481O06j5279O005O367K56
$$ 898911 858098 781404 697921 640123 629048 619611 579540 573059 573665 558386 564391 570758 571014
12899E71014K848M5407M2723N3685R3968P2703K1406L245k8931m7731r3358q9370
$$ 571014 573862 619269 661992 715677 809645 882348 903754 906999 878068 830337 736979 647609
12887F47609j10613p2128p3205m0659p871q087R873Q287l2188Q000J4851k8996
$$ 647609 536996 464868 391663 351004 343133 335046 344919 353206 321018 329018 343869 314873
12875C14873m9008o4517k2755M3575K3668k0784q300J0288J2728j0460j830K4475
$$ 314873 265865 201348 178593 222168 245836 225052 216752 227040 239768 229308 227478 251953
12863B51953J0199l2899p043J145n4619l2284k0156o6956m8511l2193m5752o390
$$ 251953 262152 229253 222210 223355 168736 136452 116296 49340 829 -31364 -77116 -83506
12851h3506k6132n121O2662K9398J2186O6744N6880P6560Q0635O7896L0511J0161
$$ -83506 -109638 -114759 -52097 -22699 -10513 56231 113111 189671 270306 338202 368713 378874
12839C78874k071Q262J4471n013j2110J70Q439r211j4133j3K4329m701J6587q819
$$ 378874 376803 385065 399536 394523 382413 382583 391022 381811 367678 367665 391994 387293 403880 395061
12825C95061j0936K3127O300k8254p001P315J6324Q586j6080J9031K2583P008
$$ 395061 384125 407252 413552 385298 378297 385612 401936 410522 394442 413473 436056 443064
12813D43064K339j9556J0099k874L002j1227j8315J5191K6476K3739L0801J9725
$$ 443064 445403 425847 435946 433072 436074 424847 406532 421723 448199 471938 502739 522464
12801E22464o44j103J0047J7080p251Q010K2245L8643M7575K8765J3544N1044
$$ 522464 521820 520717 530764 547844 540593 548603 570848 609491 657066 685831 699375 750419
12789G50419O4207M2179J4577j2716R743n771k2021J772J8402K5572K6880J5977
$$ 750419 814626 856805 871382 858666 868409 862638 840617 842389 860791 886363 913243 929220
12777I29220L329K7513M9084N4494O2501L9999M7481O8390L9628L2982M6722O6538
$$ 929220 932549 960062 1009146 1063640 1126141 1166140 1213621 1282011 1321639 1354621 1401343 1467881
12765A467881N0369Q0921O2663P7556Q2019J12813J51449J54351J41196J58989
$$ 1467881 1518250 1599171 1661834 1739390 1821409 1934222 2085671 2240022 2381218 2540207
12755B540207J59276J59924J68583J62910K12628K79168L90089M37265M92966
$$ 2540207 2699483 2859407 3027990 3190900 3403528 3682696 4072785 4510050 5003016
12746E003016O49330P90920R44431J191549J490865J789117K137763K514815K868489
$$ 5003016 5652346 6443266 7387697 8579246 10070111 11859228 13996991 16511806 19380295
12737A9380295L123167L347580L655238M158074N106273O936470J0302564J5733777
$$ 19380295 22503462 25851042 29506280 33664354 38770627 45707097 56009661 71743438
12729G1743438K3124757L1185604L7740989L9919362L5678155K4689455J1104211
$$ 71743438 94868195 126053799 163794788 203714150 239392305 264081760 275185971
12722B75185971J064478o416920j5801365k5271846l0658336l1623764l0713881
$$ 275185971 276250449 269833529 254032164 228760318 198101982 166478218 135764337
12715A35764337k8604770k4542717j9130346j4013200r974846p095000n227084
$$ 135764337 107159567 82616850 63486504 49473304 39498458 32403458 27176374
12708B7176374l974997l190317k658875k275872j961291j715670j484071j265969
$$ 27176374 23201377 20011060 17352185 15076313 13115022 11399352 9915281 8649312
12700H649312j049173q75231p14439o09361n19298m57548l96386l30268k85771
$$ 8649312 7600139 6724908 6010469 5401108 4881810 4424262 4027876 3697608 3411837
12691C411837k78861k59567k06073j60943j88032j48456j12466p0650n3512q3662
$$ 3411837 3132976 2873409 2667336 2506393 2318361 2169905 2057439 1986789 1933277 1849615
12681A849615q0411o9027l2267l9317j6302k6456l42k0638J6977L8562P3506L9706
$$ 1849615 1769204 1700177 1667910 1628593 1612291 1585835 1585493 1564855 1581832 1620394 1693900 1733606
12669A733606L1914J6536M0968k5812n2609o2228o7257j08667j33678j08377q4235
$$ 1733606 1765520 1782056 1823024 1797212 1744603 1682375 1615118 1506451 1372773 1264396 1180161
12658A180161p5904q3585n8241n3112k4658k1399l4460l0942m218j3415K401J303
$$ 1180161 1104257 1020672 962431 909319 884661 863262 828802 797860 793642 780227 782628 783931
12646G83931K8980J9018P868Q735L327J8713M2228P282j5668k9284m4403l8909
$$ 783931 812911 831929 839797 848532 851859 870572 912800 920082 904414 875130 830727 791818
12634G91818l5862m169K1658j8364j3968L2143P7479Q9086J16252J21793R6234
$$ 791818 755956 751787 773445 755081 741113 773256 850735 939821 1056073 1177866 1274100
12623A274100M4566P371j5597j3608k8014m5426o9035q0209q8238o4600n9997
$$ 1274100 1318666 1326037 1310440 1296832 1268818 1223392 1154357 1074148 985910 921310 861313
12612H61313k5259l5886m3435o363q036n0518l3642l2545k7057K9173O1466P8507
$$ 861313 836054 800168 756733 750370 742334 691816 658174 625629 598572 627745 689211 767718
12600G67718Q1961Q1769J02383J05720P3271L1877L4912J7575j4635k2047m375
$$ 767718 849679 931448 1033831 1139551 1212822 1244699 1279611 1297186 1282551 1260504 1256129
12589A256129k8311m3753m4770j5651l4561l6467m953k0442j6105r375L656J9279
$$ 1256129 1227818 1184065 1139295 1123644 1089083 1052616 1047663 1027221 1011116 1001741 1005397 1024676
12577A024676m87r30j47j8826M164q946j1535p106K1077N8351P3477O1405Q9715
$$ 1024676 1024189 1023259 1023112 1004286 1008450 999504 987969 980863 1001940 1060291 1133768 1195173 1284888
12564A284888R5944M8543M1704P8706K9774L6982M7272N1903O4648R6632J27625
$$ 1284888 1380832 1429375 1471079 1549785 1579559 1616541 1663813 1715716 1780364 1876996 2004621
12553B004621J45756J66157K06015K03005K30159K44474J60740J24055O5324l2470
$$ 2004621 2150377 2316534 2522549 2725554 2955713 3200187 3360927 3484982 3550306 3517836
12543C517836p5463o2178m6066j5682K2097K4371K9431M0753R6298J25565J41607
$$ 3517836 3442373 3380195 3334129 3318447 3340544 3364915 3394346 3435099 3531397 3656962 3798569
12532C798569J35694J61230K35035L06482L23031M04589M49445N48370O20484
$$ 3798569 3934263 4095493 4330528 4637010 4960041 5364630 5814075 6362445 6982929
12523F982929O92702Q18008J000165J193145J372775J570111J796976K125098
$$ 6982929 7675631 8493639 9493804 10686949 12059724 13629835 15426811 17551909
12515A7551909K467855K880751L517272M416534N698995P561352J0172053J3631652
$$ 17551909 20019764 22900515 26417787 30834321 36533316 44094668 54266721 67898373
12507F7898373J7535448K0880255K1439175J7045529P770732l263648j1859749
$$ 67898373 85433821 106314076 127753251 144798780 152569512 149305864 137446115
12500A37446115j6048913j6277162j4119786j1015773p888146n149279k842811
$$ 137446115 121397202 105120040 91000254 79984481 72096335 66947056 64104245
12493F4104245j008315M30645J547789K411399L141430L834172M508823N188335
$$ 64104245 63095930 63526575 65074364 67485763 70627193 74461365 78970188 84158523
12485H4158523N789905O322075O832566P363102P844336Q140822Q226904P971965
$$ 84158523 89948428 96270503 103103069 110466171 118310507 126451329 134678233 142650198
12477A42650198P260574O075740M449272K545988M36710j629368l411429m819627
$$ 142650198 149910772 155986512 160435784 162981772 163418482 161789114 158377685 153558058
12469A53558058n854183o546839o867043o914836o832079o681836o549712o388300
$$ 153558058 147703875 141157036 134289993 127375157 120543078 113861242 107311530 100923230
12461A00923230o172893n912167n518252n006012m282224l428086k457468j308733
$$ 100923230 94750337 88838170 83319918 78313906 74031682 70603596 68146128 66837395
12453F6837395K1310J605311L671164O303438R587166J3270561J6568220J8001373
$$ 66837395 66858705 68464016 72135180 78438618 88025784 101296345 117864565 135865938
12445A35865938J5692205Q742599j461043j1310899j7498548j9369383j8119386
$$ 135865938 151558143 160300742 158839699 147528800 130030252 110660869 92541483
12438I2541483j5365371j2283386r465653p193099n427497m194542l360863k962525
$$ 92541483 77176112 64892726 55427073 48233974 42806477 38611935 35251072 32288547
12430C2288547k815875k736038k654797k520322k296902k104940j893079j613646
$$ 32288547 29472672 26736634 24081837 21561515 19264613 17159673 15266594 13652948
12422A3652948j406647j196540r87231q09205o88289o04726n18793m37451m12903
$$ 13652948 12246301 11049761 10062530 9253325 8565036 7960310 7441517 7004066 6591163
12413F591163l55055k93020k75187j84561j64707j37593j37627r8199m8970o1766
$$ 6591163 6236108 5943088 5667901 5483340 5318633 5181040 5043413 4945214 4896244 4834478
12403D834478n1427l3909m5983j13537n9461p2854r9034l2570l3458k4921m7632
$$ 4834478 4783051 4749142 4703159 4589622 4530161 4457307 4358273 4325703 4292245 4267324 4219692
12392D219692l064m449O176J4531p091j03892j74855j98337j97801k01435j67268
$$ 4219692 4216628 4212179 4218355 4232886 4225795 4121903 3947048 3748711 3550910 3349475 3182207
12381C182207j30420j19049r0647o5030m2469L324K597L967L181J5060L0159N3561
$$ 3182207 3051787 2932738 2842091 2777061 2734592 2737916 2740513 2744480 2747661 2762721 2792880 2846441
12369B846441N1191P766l1494n5946n8651j43176j82463j73289j44837j38970
$$ 2846441 2897632 2905398 2873904 2817958 2759307 2616131 2433668 2260379 2115542 1976572
12359A976572j14784r0249n6868o3133m4174l2707J0725P45m371k6359p6085p0931
$$ 1976572 1861788 1771539 1714671 1651538 1607364 1574657 1585382 1586127 1581756 1555397 1479312 1408381
12347A408381m7525l8409n9805l5694j4818j0579k7648q131J9277J0536J6847
$$ 1408381 1360856 1322447 1262642 1226948 1212130 1201551 1173903 1165772 1185049 1195585 1212432
12336A212432L7872L5423K6442L1726Q927J0708J7876K9429K9543K9687J6435
$$ 1212432 1250304 1285727 1312169 1343895 1352822 1363530 1381406 1410835 1440378 1470065 1486500
12325A486500L986m0444p1981p1129m1503k6389k4552l5753O135K4747K0599l1311
$$ 1486500 1490486 1450042 1378061 1306932 1265429 1239040 1214488 1178735 1184870 1209617 1230216 1198905
12313A198905m7197o0951o8499l3335m7433n0478m4210n990L0548L5680K4364
$$ 1198905 1151708 1090757 1022258 988923 941490 891012 846802 840812 871360 907040 931404
12302I31404L1744L1745N2084J05734J53497J79111K32848K22298J17603Q007
$$ 931404 963148 994893 1046977 1152711 1306208 1485319 1718167 1940465 2058068 2066075
12292B066075p403k1581p9243j38317j66528j49593j63196j46596j10204q7026
$$ 2066075 2058672 2037091 1957848 1819531 1653003 1503410 1340214 1193618 1083414 996388
12282I96388q8988j09052p4053m6977k3845j6665l4587j5826O847O42j4553l45
$$ 996388 907400 798348 724295 677318 653473 636808 602221 586395 593242 593884 579331 578986
12270E78986k096q771k3411O46j9245k5656p376k5548m8486n1057m4792m0941
$$ 578986 576890 568119 544708 545354 526109 500453 493077 467529 419043 367986 323194 282253
12258B82253m0396k25m010K0391K3650N5603P7217L0069K7890L6979J0220j9707
$$ 282253 241857 241632 237622 258013 281663 337266 414483 444552 472442 509421 519641 499934
12246D99934p615N131K4933O228n942j776M0459n386m658N5642J3923K5853L8628
$$ 499934 492319 497450 522383 528611 522669 520893 561352 555966 551308 606950 620873 646726 685354
12233F85354N7578P501k1146k003K6278J3307K785N217r434k8705n0372k9201
$$ 685354 742932 750433 729287 727284 753562 766869 769654 774871 765437 736732 686360 657159
12221F57159O271k5594O958PL649j6543J2584L7677J5407N402P063P088J777K1057
$$ 657159 663430 637836 644794 644801 648450 631907 644491 682168 697575 702977 710040 717128 718905 739962
12207G39962L0887j424J0323O422M9884L8973K2387N8446P1114N0472K5543O0089
$$ 739962 770849 769425 779748 786170 836054 875027 897414 955860 1026974 1077446 1102989 1163078
12195A163078P827K4164J5472M5671O6002L9545O0121Q4079O9628J05090J28825
$$ 1163078 1170905 1195069 1210541 1256212 1322214 1361759 1421880 1505959 1575587 1680677 1809502
12184A809502J37679K24986K73106K64490L39451L98306L88380L19569K07695
$$ 1809502 1947181 2172167 2445273 2709763 3049214 3447520 3835900 4155469 4363164
12175D363164J27788K3304j18312j99575k04337j92081j68682r4848o3445n611
$$ 4363164 4490952 4514256 4395944 4196369 3992032 3799951 3631269 3536421 3472976 3467365
12165C467365M9142J01310J09959J58636J92274K01233K60614L21209L90902M80094
$$ 3467365 3516507 3617817 3727776 3886412 4078686 4279919 4540533 4861742 5252644 5732738
12155E732738N77094O85875Q53483J127715J415123J762508K080594K430816K744541
$$ 5732738 6309832 6995707 7849190 8976905 10392028 12154536 14235130 16665946 19410487
12146A9410487L003162L158668L376800L611422M032503M849930O381865Q925880
$$ 19410487 22413649 25572317 28949117 32560539 36593042 41442972 47824837 56750717
12138E6750717J3058710J8982612K6253605L3297534L7753174L6979455K9958901
$$ 56750717 69809427 88792039 115045644 148343178 186096352 223075807 253034708
12131B53034708J8536674O769607l295486j2958789k1802395k7684201k9899858
$$ 253034708 271571382 278340989 275045503 262086714 240284319 212600118 182700260
12124A82700260k9537812k7256368k3466530j8763038j4298002j0766366q287611
$$ 182700260 153162448 125906080 102439550 83676512 69378510 58612144 50324533
12117E0324533o583208n459220m653887m085654l642108l293355k914982k583557
$$ 50324533 43741325 38282105 33628218 29542564 25900456 22607101 19692119 17108562
12109A7108562k252278j957202j652762j359809j154029r62054q11819p08846
$$ 17108562 14856284 12899082 11246320 9886511 8732482 7770428 6958609 6249763
12101F249763n91153n13789m58657l99761l31106l11244k83670j84239j79063
$$ 6249763 5658610 5144821 4686164 4286403 3955297 3644053 3360383 3176144 2997081
12092B997081j85930j57579j12908q8978p2800q6091q0028r7175p6821q6177p5808
$$ 2997081 2811151 2653572 2540664 2451686 2378886 2292795 2212767 2115592 2038771 1952594 1876786
12081A876786n9859m7210o1778n2849m6065k8983m9953n1839k4294m9138o9355
$$ 1876786 1816927 1769717 1707939 1655090 1609025 1580042 1530089 1478250 1453956 1404818 1335463
12070A335463o5276l8718p6068k9207l7262l0624j7105k1827j0715j5691m5509
$$ 1335463 1270187 1231469 1155401 1126194 1088932 1058308 1041203 1019376 1008661 992970 947461
12059I47461j6693K8033L1731J3974L2369O6969O4773L9736P5140R4846P9040
$$ 947461 930768 958801 990532 1004506 1036875 1103844 1168617 1208353 1283493 1378339 1457379
12048A457379M7962M4121j5652n5571n5415m3215k5139j8856j928K3481M2948
$$ 1457379 1505341 1549462 1533810 1478239 1422824 1379609 1354470 1335614 1333686 1357167 1400115
12037A400115P4402Q6264J34754J52646J54181J98024K32402K38335K37194K01372
$$ 1400115 1474517 1560781 1695535 1848181 2002362 2200386 2432788 2671123 2908317 3109689
12027C109689J08189P2127J4160o6149j11596j72713j85596j89941k13237j66736
$$ 3109689 3217878 3290005 3304165 3238016 3126420 2953707 2768111 2578170 2364933 2198197
12017B198197j68370j38527r9741r0107r1477j00784r8379o7562k3051K9976L8227
$$ 2198197 2029827 1891300 1791559 1701452 1609975 1509191 1410812 1343250 1320199 1350175 1388402
12006A388402Q2399O8909O6958O6815Q0972O7491K8921k0664o0728m4052m0469
$$ 1388402 1470801 1539710 1606668 1673483 1754455 1821946 1850867 1830203 1769475 1725423 1684954
11995A684954q8118o9812o9260r502N5426P4572N0678J9325O016K877p5075r4867
$$ 1684954 1596836 1527024 1457764 1448262 1503688 1578260 1628938 1648263 1654279 1657156 1582081 1487214
11983A487214p8274q5127o8277o2636p8182j21499j18629l3950n0606q1547o3830
$$ 1487214 1408940 1323813 1255536 1192900 1114718 993219 874590 840640 790034 708487 644657
11972F44657p9269p6195l1892l7046R381k1477n1740k9766j1639Q13o00k2895
$$ 644657 565388 489193 457301 420255 429636 408159 356419 326653 315014 315827 315227 292332
11960B92332k4660O056j0476k9867l7278l2272j968N84r40J2734k4958l2479o101
$$ 292332 267672 273728 263252 233385 196107 163835 161867 162451 161511 174245 149287 116808 110707
11947A10707J6353K8597J1501J8459j2431l0344m4r576k4219n1377k8227j8357
$$ 110707 127060 155657 167158 185617 173186 142842 142798 133222 109003 57626 29399 11042
11935A1042l8707j5146m148K2208M1632K1027J7931K9971K2993L5157K2317K4006
$$ 11042 -27665 -42811 -46959 -24751 16881 37908 55839 85810 108803 143960 166277 190283
11923A90283K6549M5026M1868Q031K5312N0583L7233M3946J6916k8905k2583l0495
$$ 190283 216832 261858 303726 311757 337069 387652 424885 468831 485747 456842 434259 403764
11911D03764l3161m014k3115k2542k0009l2389l2949o5307k8590N864q538j2613
$$ 403764 370603 366589 343474 320932 300923 268534 235585 170278 141688 147552 139014 126401
11899A26401q351J2067p019N843J4533n197J869J8559j2078K506L8024r567j0423
$$ 126401 118050 130117 123098 128941 143474 138277 140146 158705 146627 149133 187157 177590 167167
11886A67167k3162Q828J8071J6359o963j2115k2809k3854l779K251l2769j5547
$$ 167167 144005 152833 170904 187263 180300 168185 145376 121522 117743 119994 87225 71678
11874G1678K9731j9J453K0680q048J1477P465j4434j3818m1883j038j1868l5596
$$ 71678 101409 101390 102843 123523 115475 126952 134417 119983 106165 64282 63244 51376 15780
11861A5780J7535J8644K383J9346M0500O990K7906N115J0604K2415K5681K09n131
$$ 15780 33315 51959 54342 73688 114188 121178 149084 154199 164803 187218 212899 213108 207977
11848B07977J0818k5684k0638p227k246o984o413N994K336r963N327m905l0440
$$ 207977 218795 193111 172473 165246 163000 156016 149603 155597 157933 147970 153297 148392 117952
11835A17952j5463L283o072k4646k0610j0554O16L6854M939j5258j2419K1144
$$ 117952 102489 105772 99700 75054 54444 43890 44506 81360 86299 71041 58622 79766
11823G9766J1668k0080n809k300J2850n188k5681k780j8520l2573J588K7938L576
$$ 79766 91434 71354 65545 63245 76095 70907 45226 42446 23926 -8647 -7059 20879 24455
11810B4455k3582j0909M1724k84m437O41K7889L7955L007l5090j7717j9565m13
$$ 24455 873 -10036 31688 31404 26967 27608 55497 93452 96459 61369 43652 24087 23674
11797B3674L2316J4864j0156k1504l359j1992J0904J8611K0848K216K4999K521
$$ 23674 55990 70854 60698 39194 35835 23843 34747 53358 74206 76422 101421 103942
11785A03942k790j0725p824R931p407J5718L65k0789r698J5796m520P276p313
$$ 103942 101152 90427 82603 92534 85127 100845 101210 80421 70723 86519 81999 89275 81962
11772H1962j1957k7196J2086L0173k6285k3972J2699J0786K1061n385J5247L8207
$$ 81962 70005 42809 54895 85068 58783 34811 47510 58296 79357 73972 89219 127426
11760A27426J0860r950j0438p949j2287O450K0526L485j187K6067o191M44J65
$$ 127426 138286 128336 117898 109949 97662 104112 124638 128123 126936 153003 146812 147256 147421
11747A47421j6315K0519N2954K6408j6375l7108j2784K785J5284j0381o0748n0965
$$ 147421 131106 151625 204579 230987 214612 177504 164720 167505 182789 172408 111660 60695
11735F0695N552M4387J8379k753K1002M6425p67j6788j6865N842Q134L25P149
$$ 60695 66247 110634 129013 126260 147262 193687 192920 176132 159267 165109 173243 173568 180717
11722A80717N4652N1053J6741M138K5727N7588O4479R7606J48035J37486J62680
$$ 180717 235369 286422 303163 307301 333028 390616 455095 552701 700736 838222 1000902
11711A000902J64907J61859J05292O0659J3678n3379q0948j19572j37852j72586
$$ 1000902 1165809 1327668 1432960 1493619 1507297 1453918 1372970 1253398 1115546 942960
11701I42960j43267j27634j03954q6242p2642m8303m8579m5364k1139o274l1868
$$ 942960 799693 672059 568105 481863 409221 360918 312339 266975 245836 239562 207694
11690B07694l4763k0424k1115L651J0302J0270o494r663q192j8573p155J7210
$$ 207694 172931 152507 131392 135043 145345 155615 149121 139458 131266 112693 105538 122748
11678A22748k655k4990J6290R519J943R027O63j2588k2634j8686k5744k6141J1094
$$ 122748 120093 95103 111393 120912 122855 131882 132545 119957 97323 78637 52893 26752 37846
11665C7846k8325M04K1537j0374J3326m80l766n589M682K2930J19N669K2598J1854
$$ 37846 9521 9925 31462 21088 34414 33934 30168 24579 29261 52191 52310 57979 80577 92431
11651I2431J6152l889k9069l5169o783M192O17L0033m402K3112j771k1040k0174
$$ 92431 108583 104694 75625 40456 33673 37865 38482 68515 64113 87225 85454 64414 44240
11638D4240K9929L5379J5049j7216k3810J707j0313j1434k1359l67L681M298J8650
$$ 44240 74169 109548 124597 107381 83571 85278 74965 63531 42172 41805 45486 49784 68434
11625F8434j0576j014q732p672k0201k1645J7111R308J6776Q624j8841J8823K6058
$$ 68434 57858 56844 48112 40440 20239 -1406 15705 25013 41789 50413 31572 50395 76453
11612G6453L170k6207n825J495j1295P914Q988J802j2792j3792R00j9333o696
$$ 76453 79623 53416 47591 49086 37791 45705 54693 56495 43703 29911 30811 11478 4782
11599D782q279L644O658j8695o094Q039L2356j9958r335L463n594j1098K5886
$$ 4782 -3497 147 6805 -11890 -17984 -9945 22411 2453 -6882 -3419 -9013 -20111 5775
11586E775j3264k385j2369J2105l352r126J6735J8120K729J1849L253K743o848
$$ 5775 -7489 -9874 -22243 -10138 -13490 -22616 -5881 12239 14968 26817 30070 32813 25965
11573B5965j2080p065L7677J2540J8879k5364k0016l18M083j196R151K5386j8714
$$ 25965 13885 6820 44497 57037 75916 50552 30536 30218 34301 33105 42256 67642 48928
11560D8928o480K456j7887j6539j5633q034j3066Q055k503R75J2684J3270k277
$$ 48928 42448 44904 27017 10478 -5155 -13189 -26255 -18200 -20703 -19728 -7044 6226 3949
11547C949j4563J2352K2374j1441j6677j863K5029J1999L746J4139j5408n848
$$ 3949 -10614 1738 24112 12671 -4006 -5869 19160 31159 34905 49044 33636 27788
11535B7788L5487J1564j7224n432q718k0748M415J18q291k4298n74J7008j615
$$ 27788 63275 74839 57615 52183 43465 22717 27132 27250 18959 -5339 -5913 11095 9480
11522I480M60Q090p802N703L5811P426j4767k1088l197m323J420k071n428p934
$$ 9480 9940 18030 10228 15931 51742 59168 44401 23313 20116 15793 17213 15142 9714 1780
11508A780L2886m399l7287j3514K5956L6968K9594L3319j3166m5558j2190J4600
$$ 1780 34666 30267 -7020 -20534 5422 42390 71984 105303 92137 46579 34389 48989
11496D8989J1018p676k1031m46J9312J0960n278k3017m70O068m874m558J1994
$$ 48989 60007 52331 31300 30854 50166 61126 55848 32831 32361 38429 33555 28997 40991
11483D0991j759j2358K1500j7693k4736J897N514J5569j4448j4611M045K1138
$$ 40991 39232 26874 48374 30681 5945 7842 13356 28925 14477 -134 3911 25049
11471B5049J8745M795q215l78L891O531k1035l274j8632o092m351p409Q822J6425
$$ 25049 43794 48589 40374 39996 43887 50418 29383 26109 7477 1385 -2966 -10375 -1553 14872
11457A4872K1319l820Q523K70j5156j3329k345m945J3502R756J4553l5428k4364
$$ 14872 36191 32371 40894 41164 26008 12679 10334 5389 18891 28647 43200 7772 -16592
11444a6592K8714K1688k592l0835n588M692M478J7742J0318m994L813K9749l5661
$$ -16592 12122 33810 31218 383 -5205 -513 3965 21707 32025 27031 30844 60593 24932
11431B4932k0730J8993J7702m329k5050J1326j524Q676J389k3908p091k234o802
$$ 24932 4202 23195 40897 36568 11518 22844 21320 29996 31385 7477 386 -1848 -8650
11418h650L8627K1388j600j2124k7349j7463J2329j632l1329q159J4256O545M525
$$ -8650 29977 51365 49765 37641 10292 -7171 5158 3526 -27803 -35962 -21706 -15161 -10636
11405a0636K71N98J1240M660m337o584J7736J4313m120j7692k6960P579K5635
$$ -10636 -10365 -9767 1473 6133 1796 -4788 12948 27261 23141 5449 -21511 -13932 11703
11392A1703O839J9997j3819j0841j2774J3795K9878o78l1610j0039J4367K2197
$$ 11703 18542 38539 24720 13879 1105 14900 44778 44100 12490 2451 16818 39015
11380C9015J2787J1991k4312k1543L321R620M103K427q115l062o957K6287J2520
$$ 39015 51802 63793 39481 17938 21259 30879 34982 37409 29294 26232 19275 45562 58082
11367E8082l3745o558K425k8248M278L8429K210P709K636j4575q740k2624q368
$$ 58082 24337 17779 20204 -8044 -3766 34663 36873 44582 47218 32643 23903 1279 -7089
11354g089J8834j2205J1758Q300K8312j0346M707J8055j1506q704k0176L047Q307
$$ -7089 11745 -460 11298 19598 47910 37564 42271 60326 48820 40116 19940 22987 31294
11341C1294k1586O254P690J0626j112j8588K298M329j5125K1800N202l055J1527
$$ 31294 9708 15962 23652 34278 33166 14578 16876 21205 6080 27880 33082 30027 41554
11328D1554J8163K525j4209j7057M924k790O306K867j5788j5440N841J9098j1353
$$ 41554 59717 62242 48033 30976 35900 33110 39416 42283 26495 11055 16896 35994 24641
11315B4641k2557K039o519J3573L1298L0389k8749L373J3020J742M648k3466m960
$$ 24641 2084 4123 -2396 11177 42475 72864 44115 47488 60508 62250 66898 43432 38472
11302C8472M305k2241r906K138k0997J0742Q692J1095K9252K301k2003J37O76
$$ 38472 42777 20536 10630 12768 -8229 2513 11205 22300 51552 53853 31850 31987 32663
11289C2663l448O761J0886k3958j1168K395J6848M4706Q369p322l2447k6467l183
$$ 32663 29215 35976 46862 22904 11736 14131 30979 75685 84054 76732 44285 17818 14635
11276A4635J236Q240J1961p398j0412K1400N221P6J4035j5275k402J2148n52J6703
$$ 14635 15871 24111 36072 28674 18262 39662 44883 44959 58994 43719 41317 53465 52913 69616
11262F9616J1530j0955k5833j0719k7784J2361L4236k1267k9000j9111R860O988
$$ 69616 81146 70191 44358 33639 5855 18216 52452 31185 2185 -16926 -7066 -78
11250g8J3101l442K599J560K737K2293K0082M274j7236k0953p013R050k822l062
$$ -78 13023 9581 12180 13740 16477 38770 58852 63126 45890 24937 17924 26974 24152 21090
11236B1090J3020K3626Q688l0788p793K1416J8411N887l243q689j1317o501J3684
$$ 21090 34110 57736 66424 35636 27843 49259 67670 73557 70314 61625 50308 43807 57491
11223E7491k0558Q781K32J0194K9679j2941o744j6369k492L8506j0407J2770K4662
$$ 57491 36933 45714 45946 56140 85819 72878 66134 49765 47273 85779 75372 88142 112804
11210A12804l7901k2647n201j924k5540j1214K9956r596j3118K512P403K6775
$$ 112804 74903 52256 47055 45131 19591 8377 38333 28737 15619 18131 25534 52309
11198E2309J0287J4577P702M493j1480q646j0406j313l148j1406n24J7381J9527
$$ 52309 62596 77173 84875 89368 77888 69242 58836 57523 54375 42969 42445 59826 79353
11185G9353r634j9761M646L8531L324j9589p873j8219J5063P481o568j0283n194
$$ 79353 69719 49958 54604 93135 96459 76870 68997 50778 65841 73322 66754 56471 51277
11172E1277j0409j7282j2671N3339N1418k9233l7276j5264j1627K0960J4050l625
$$ 51277 40868 23586 10915 64254 115672 86439 49163 33899 22272 43232 57282 53657
11160E3657J3029R779k755L6059j4607l4083J3475J6815r361n106L4363L606k6688
$$ 53657 66686 76465 73710 109769 95162 61079 74554 91369 82008 76902 111265 114871 88183
11147H8183k0250l6922k3671N2375M7359J4772j5023q324k7726J1344L3717J9767
$$ 88183 67933 31011 7340 59715 107074 121846 106823 98499 70773 82117 115834 135601
11135A35601q201m0907k2402J8937J0894J0201k476k2502K311r204N029Q870J0446
$$ 135601 127400 86493 64091 83028 93922 104123 101647 79145 81456 72252 77281 86151 96597
11122I6597k968l602j96k2307j4356K5514O706k1610J1615J3263J7746N382j0444
$$ 96597 93629 90027 89831 67524 53168 78682 85388 63778 75393 88656 106402 111784 101340
11109A01340K1663j0670k4812k4263Q521L8725k7699l8690j8514Q722K1890K844
$$ 101340 123003 112333 87521 63258 71779 110504 82805 44115 25601 34323 56213 59057
11097E9057K2284L9173J158m2105j5604N827M593J6470J6102J4537L75q793q1
$$ 59057 81341 120514 121672 79567 63963 69790 74383 90853 106955 121492 121867 113074 112993
11084A12993J7158j4697k4331k9840J9556J7989j8434j1039k7210j6453J1517
$$ 112993 130151 115454 91123 61283 80839 98828 80394 69355 42145 25692 37209
11073C7209M49K4514O271N981q538j5597Q308J3254R010k728o987m387j1767K673
$$ 37209 37658 62172 68443 74424 65886 50289 58597 71851 80861 78133 71146 66759 54992 57665
11059E7665k35L2342R10j6313K939M4039L588k8670k5443j2686n544p094J191
$$ 57665 57430 89772 90682 74369 77308 121347 124935 96265 70822 58136 52592 45498 46689
11046D6689K447J2369K793K1584K1496p785j786O058j3154j6847J2562j190j3734
$$ 46689 49136 61505 64298 85882 107378 99593 97807 103865 90711 73864 86426 85236 71502
11033G1502R746J3798l03j565J2928J0743p55j8642j1123O528J9241q402j8513
$$ 71502 81248 95046 94743 93178 106106 116849 116094 97452 86329 92857 112098 103696 85183
11020H5183j0141o005J6542M0635J7639J323l1805n494J7933K5312J2370j9967
$$ 85183 75042 69037 85579 126214 143853 145176 113371 107877 125810 151122 163492 143525
11008A43525r372n990m483L9786K985m0497j4957K7066l923l360L689J6999j5262
$$ 143525 134153 128163 123680 163466 166451 125954 110997 138063 134140 130780 134469 151468 136206
10995A36206j1579K0297o918j337L297J010n758J1571J6456k3111l0844j0865
$$ 136206 124627 144924 138006 136669 139966 140976 135218 146789 163245 140134 109290 98425
10983I8425j925j4790M572P123J2807j6185K3760M638l783R972k760K4642n272
$$ 98425 96500 81710 86282 93405 106212 90027 113787 118425 114642 124614 121854 146496 141224
10970A41224j1872l627J1924q757k9880q986K4480J0042Q505J1721j0127J8884
$$ 141224 129352 125725 137649 128892 99012 90026 114506 124548 133053 144774 134647 153531
10958A53531o427j9264j7160j3848K0837L6264o161o582j3120k1600K599L4160
$$ 153531 147104 127840 110680 96832 117669 153933 147772 141190 128070 106470 109069 143229
10946A43229j7356k0710O41K3952M4511K5630Q998j9408r263p535J6326o852J1626
$$ 143229 125873 105163 105804 129756 174267 199897 208895 189487 180224 172689 189015 182163 193789
10933A93789J6388l875J9816L2045m518p773J0680K2463M5611M0246M9927L8384
$$ 193789 210177 206302 226118 258163 253645 245872 256552 279015 324626 364872 414799 453183
10921D53183K8690L4213M8908L7668K3982J6914M8192M2199Q507l3341l3556l8996
$$ 453183 481873 516086 564994 602662 626644 643558 691750 733949 742456 709115 675559 636563
10909F36563l8419k7512l2807m3989n042L8716J4464K451J1183K6778k272J2079
$$ 636563 598144 570632 537825 493836 488794 527510 541974 544425 555608 582386 580114 592193
10897E92193L0035M7894K2789j0329J0889K9042K3121j4521K5636M6038N5946
$$ 592193 622228 670122 692911 682582 693471 722513 745634 731113 756749 802787 858733
10886H58733J5312J6795l165N550l6313n2609l9799p963j8640l7260j6608J1200
$$ 858733 874045 890840 887675 893225 856912 804303 764504 756541 737901 700641 684033 695233
10874F95233j479l9830j7904l3031m9528m639P746n994o795Q167N4779L0993j3692
$$ 695233 693754 653924 636020 602989 553461 548822 556568 550574 543779 551946 606725 637718 624026
10861F24026J1744L3944p006K438K2351J3801j342k7736p6916l8789M088q630
$$ 624026 635770 669714 662708 665146 687497 701298 699956 672220 595304 556515 560603 551973
10849E51973m1583l4610l7156k5352j4863k1524j948n1711k2317P347J9824j0516
$$ 551973 510390 475780 438624 413272 398409 376885 374937 323226 300909 308256 328080 317564
10837C17564k4140k6865J2232J5071m2591m7287O957J595j8121J2651L357k04
$$ 317564 293424 266559 278791 293862 251271 203984 210941 212536 194415 207066 210423 210219
10825B10219P036K298k3022m383J0747R842l88K0386J1010O284k987j4358L979
$$ 210219 217255 219553 196531 192148 202895 212737 212349 232735 243745 250029 247042 232684 236663
10812B36663J2833k0885j96L018j8662l1880J0239N419L6002J7121O82n3104m2188
$$ 236663 249496 228611 228415 231433 212771 180891 191130 196549 232551 249672 250354 197250 155062
10799A55062j7410J4765K0750l631J0671R017K6338j4221k6938M975j4454k73
$$ 155062 137652 152417 173167 169536 180207 189224 215562 201341 174403 179378 164924 164651
10787A64651k4350j5538L5364K0334K6379J4743n626j4648j6123k368l173j1900
$$ 164651 140301 124763 160127 180461 206840 221583 215957 201309 185186 182818 179645 167745
10775A67745K4100N014J0128j0406N544J8279n494j0741j5378O8N598J3492J1781
$$ 167745 191845 196859 206987 196581 202125 220404 214910 204169 188791 188859 194457 207949 219730
10762B19730J113O095M983J2302Q043J7636J1693L2078j884N721k0510O150j1685
$$ 219730 220843 226938 231921 244223 252266 269902 281595 313673 311789 317510 297000 303150 291465
10749B91465j8757M466L1254l1277k3601K3975k493J8409K4470k3439l327O340
$$ 291465 272708 277174 308428 277151 253550 277525 275032 293441 317911 294472 291145 297485
10737B97485J6809K9462K1642k1168r65J1549j9228P82J633N607J5036J0454O240
$$ 297485 314294 343756 365398 344230 343265 354814 335586 336368 338001 343608 358644 369098 375338
10724C75338P543Q039o872J0512J5698k6197o786l3334l2527q841l983m67J5293
$$ 375338 382881 390920 384048 394560 410258 384061 377275 343941 311414 302573 298590 298123 313416
10711C13416J0426j3318L00K073L6062O0379J8454k8307J051J4608k0751j057
$$ 313416 323842 310524 310824 312897 348959 409338 427792 399485 400536 415144 394393 393336
10699C93336J6131O453n760m194K9494J6866J0883j6899k517m736j9361k4114
$$ 393336 409467 415920 410160 405966 435460 452326 463209 446310 443793 439057 419696 395582
10687C95582k6122j3129j1532J2271M723k2631j3483j2719J7250p750J2391L8973
$$ 395582 369460 356331 344799 357070 361793 339162 325679 312960 330210 322460 334851 373824
10675C73824L5037J337o331J2276k0213K0983J8760P651M5671K3764K6998O188
$$ 373824 408861 410198 403867 416143 395930 416913 435673 443324 488995 512759 539757 545945
10663E45945J0541k3905k4520M043k3415j8791J8029l631j8762j2012J0382P505
$$ 545945 556486 532581 508061 512104 488689 469898 487927 484296 465534 453522 463904 471409
10651D71409J685K1467L6359K4388P74K399K2498K9982K7694J4280j2309J0212
$$ 471409 473094 494561 530920 555308 556082 558481 580979 610961 638655 652935 640626 650838
10639F50838K1726J7962j6258J1535J4680j4902r495j4628j7278K832R521j2097
$$ 650838 672564 690526 674268 685803 700483 685581 676086 661458 644180 647012 656533 644436
10627F44436k9555R312M3804K1639P533K2217N1440N7361O9024N1838L8177M0710
$$ 644436 614881 624193 667997 689636 697169 719386 770826 828187 897211 949049 987226 1027936
10615A027936J8286J3136K9058R473Q874J2889k586m7123j4793j125k1589j7622
$$ 1027936 1046222 1059358 1088416 1097889 1106763 1119652 1117066 1069943 1055150 1054025 1032436 1014814
10603A014814k2933K5919M986k5930j0404K3429J7771j92J9209kk509K5186K9623
$$ 1014814 991881 1017800 1022786 996856 986452 1009881 1027652 1027460 1046669 1046667 1044158 1069344 1098967
10590A098967L8822J3953L8879L1764j0719J8975O4154M0052J5677K7093J4883
$$ 1098967 1137789 1151742 1190621 1222385 1211666 1230641 1294795 1334847 1350524 1377617 1392500
10579A392500N835K7966L6932L0406L3983K6881K7873J2649m103L1483N1473K4188
$$ 1392500 1398335 1426301 1463233 1493639 1527622 1554503 1582376 1595025 1590922 1622405 1673878 1698066
10567A698066J0687M6666O1818P4311Q7577M5095L3880N8818L3751P8470P9405
$$ 1698066 1708753 1755419 1817237 1891548 1979125 2024220 2058100 2116918 2150669 2229139 2308544
10556B308544R9103Q6634N8681O0167P4372Q1103Q1664Q2024O9230J32296J19590
$$ 2308544 2407647 2494281 2552962 2613129 2687501 2768604 2850268 2932292 3001522 3133818 3253408
10545C253408J03717Q4567J18455J33211J45152J47241J37570J63959J85555K24182
$$ 3253408 3357125 3441692 3560147 3693358 3838510 3985751 4123321 4287280 4472835 4697017
10535D697017K29314K15135K31130K40321K81472K68245L19029L48898L80090
$$ 4697017 4926331 5141466 5372596 5612917 5894389 6162634 6481663 6830561 7210651
10526G210651M23545M89189N57635O28180P19599Q05535Q70058R74462J128200
$$ 7210651 7634196 8123385 8681020 9309200 10028799 10834334 11704392 12678854 13807054
10517A3807054J287524J442131J672221J923993K219793K524836K900143L394128
$$ 13807054 15094578 16536709 18208930 20132923 22352716 24877552 27777695 31171823
10509C1171823L944434M656644N524566O556077P783880R123996J0360492J1190163
$$ 31171823 35116257 39772901 45297467 51853544 59637424 68761420 79121912 90312075
10501I0312075J1156108R867176P190154L531416m02724l823485o173111p298133
$$ 90312075 101468183 111335359 118525513 122056929 121654205 117830720 111657609 104359476
10493A04359476p406911o797137n747317m414924k893306j417106J14947J585172
$$ 104359476 96952565 90155428 84408111 79993187 77099881 75682775 75797722 77382894
10485G7382894K881735L924511M516989M540220M019817L104756K140185J496714
$$ 77382894 80264629 84189140 88706129 93246349 97266166 100370922 102511107 104007821
10477A04007821J417660J992122L109994M437458N654540O394484O412061N436281
$$ 104007821 105425481 107417603 110527597 114965055 120619595 127014079 133426140 138862421
10469A38862421L486686Q64278j908706m226751n764988o362598o055158n157430
$$ 138862421 142349107 143213385 141304679 137077928 131312940 124950342 118895184 113737754
10461A13737754l965338k829884k125965k029305k416954l100029l825530m305206
$$ 113737754 109772416 106942532 104816567 102787262 100370308 97270279 93444749 89139543
10453H9139543m354859m027929l315639k379345j263102l7384J273143K586467
$$ 89139543 84784684 80756755 77441116 75061771 73798669 73761285 75034428 77620895
10445G7620895L883679N038120N825721O114559N597580M096319J695221j290049
$$ 77620895 81504574 86542694 92368415 98482974 104080554 108176873 109872094 108582045
10437A08582045m211979o597162q125276q812154q793529q278236p541895o673619
$$ 108582045 104370066 97772904 89647628 80835474 72041945 63763709 56221814 49548195
10429D9548195n808203n023856m310623l684255l169517k717366k379355k070686
$$ 49548195 43739992 38716136 34405513 30721258 27551741 24834375 22455020 20384334
10421B0384334j772181j597672j400116j194262j061160r84065q30347p23397
$$ 20384334 18612153 17014481 15614365 14420103 13358943 12374878 11544531 10821134
10413A0821134o44986n86016n47240m75366m13775l95476l49751l72799l69230
$$ 10821134 10176148 9590132 9042892 8567526 8153751 7758275 7408524 7035725 6666495
10404F666495l38674k95192k79365k45590k63740k61972j99296j68560j53811
$$ 6666495 6327821 6032629 5753264 5507674 5243934 4981962 4782666 4614106 4460295
10395D460295j48643j55473j50416j21911j08469j22265j13696j02382r6981r1037
$$ 4460295 4311652 4156179 4005763 3883852 3775383 3653118 3539422 3437040 3340059 3249022
10385C249022q7480n6951n9162m6631m1999m6677j4633J1391K2352j1595J2199
$$ 3249022 3161542 3104591 3045429 2998798 2956799 2910122 2895489 2906880 2929232 2917637 2929836
10374B929836O3662O4645L2053N7858J5994k3864l7987m2738o2473o4715p8352
$$ 2929836 2993498 3058143 3090196 3148054 3164048 3140184 3102197 3059459 2996986 2932271 2853919
10363B853919r6044r8402o5890o8423p9119k3282J3253l3059r566K9864K6653
$$ 2853919 2757875 2659473 2593583 2525160 2446041 2422759 2436012 2402953 2393387 2423251 2449904
10352B449904P888q058L7173J1606j474N792L1922K0260K3258P2506M3683L7883
$$ 2449904 2457792 2449734 2486907 2498513 2497039 2502831 2534753 2555013 2578271 2650777 2694460 2732343
10340B732343J9340R850K9379J9252j1183n2504l5016m002K7581L154N4623Q0226
$$ 2732343 2751683 2761533 2790912 2810164 2798981 2746477 2711461 2707459 2735040 2738194 2792817 2873043
10328B873043P0050M4906J7834j6k8455l9650m1196m2111p5641o4659o5842o4919
$$ 2873043 2943093 2987999 3005833 3005817 2977362 2937712 2896516 2854405 2778764 2714105 2648263 2583344
10316B583344p892L409M606j592q46j8480p917j7899n9251r7411j61324j36536
$$ 2583344 2575452 2578861 2583467 2581875 2581029 2562549 2554632 2536733 2477482 2380071 2218747 2082211
10304B082211j04422r9349r9215o2984n5562n2066m7365m3657m2361k5968j7432
$$ 2082211 1977789 1878440 1779225 1716241 1660679 1608613 1561248 1517591 1475230 1449262 1431830
10293A431830k2762k2685j4840K1079k3300l7875J1665j151P364J0782l9811o6850
$$ 1431830 1409068 1386383 1371543 1392622 1369322 1331447 1343112 1341961 1349325 1360107 1320296 1253446
10281A253446o2699k1664l9764m4750m3771j5650q343k2185k6860k4514j4858
$$ 1253446 1190747 1169083 1129319 1084569 1040798 1025148 1016805 994620 967760 943246 928388
10270I28388j7967l3912j3870p284q147q477J70K401K344q492P626J5067K5052
$$ 928388 910421 876509 862639 855355 847208 838731 838901 841302 843646 835154 842780 857847 882899
10257H82899L0752L1243J4187n702j0265l6221o7850l5617m1166l5125n9532n0128
$$ 882899 913651 944894 959081 953379 943114 906893 839043 803426 762260 727135 667603 617475
10245F17475l0645m0312k8481m706q478k3281k2242j0725R792l306Q722J3589
$$ 617475 586830 546518 518037 513331 504853 481572 459330 448605 458397 455091 463813 477402
10233D77402r873j2416P740R019J5801m426L6Q017l098p472J3754J4106N602j5512
$$ 477402 467529 455113 462853 471872 487673 483247 483283 491300 488202 480730 494484 508590 514192 498680
10219D98680K775k9066l4546j5993m646k5097l1088J1660N67l0520Q382l0559
$$ 498680 501455 472389 437843 421850 417204 392107 361019 372679 373246 342726 351108 320549
10207C20549j3424K4991J5647J1611K8316M6219K6722Q646n0777j8105p238J4071
$$ 320549 307125 332116 347763 359374 387690 433909 460631 469277 418500 400395 393157 407228
10195D07228J8692L5006J4810k514j9971k5105K996k1574j5136M97K4427k0379
$$ 407228 425920 460926 475736 473222 453251 428146 431142 409568 394432 394929 419356 398977
10183C98977j5245Q196o027l7061l3039j573O153q721j5333j5940P28J3110r790
$$ 398977 383732 391928 385901 348840 315801 314228 320381 311660 296327 280387 281115 294225 284435
10170B84435R522N959J9880k604r738R93K8827K3064P098k280l933n821j4629
$$ 284435 293957 299916 319796 317192 307454 308447 337274 360338 367436 365156 361223 355402 340773
10157C40773j1554l165k3125k2277k784J71m048j4516j5593p270J7512K2890K5864
$$ 340773 329219 326054 302929 280652 277868 278039 273991 259475 243882 236612 254124 277014 302878
10144C02878n318j8595P280Q772k4912o802k0120k2322M772K1787J1783M000K5160
$$ 302878 297560 278965 286245 295017 270105 263303 243183 220861 225633 247420 259203 263203 288363
10131B88363n38J648k0426m2116k5719k2150P848l640J559J9926n517k1973k859
$$ 288363 287825 289473 269047 226931 201212 179062 186910 183270 184829 204755 199238 177265 174406
10118A74406J5920J3445q503l3987Q169K2467N414j4824r047K6812j0018K545
$$ 174406 190326 203771 195268 161281 169450 191917 197331 182507 173460 200272 190254 192799
10106A92799J2799L4607O558l1933L172k331k2151O466J7549J1631j1846N023
$$ 192799 205598 240205 246763 214830 218002 215671 193520 199986 217535 229166 217320 222343
10094B22343K2655J3071M904J7487J8455K4006M642L7019J5065P105L6679N5328
$$ 222343 244998 258069 262973 280460 298915 322921 327563 364582 379647 386752 423431 478759
10082D78759M8021L4281M4890N3564N2138N4939O5666O0746L6750K4120k8603
$$ 478759 526780 561061 605951 659515 711653 766592 832258 893004 929754 953874 925271
10071I25271m0119l3238m6098m3151l8865m6208m1098p359q119R409K0511K3692
$$ 925271 885152 851914 805816 762665 723800 677592 636494 629135 621016 630425 650936 674628
10059F74628M8332J3993J5160J8898J7801K0085m59M062L5176L9317M1079P5261
$$ 674628 722960 736953 752113 771011 788812 808897 808438 812500 847676 886993 928072 1003333
10047A003333N7085K8769P744J3593R688k04L4044R1676K05671M14043O13682
$$ 1003333 1060418 1089187 1096931 1110524 1120212 1120008 1154052 1245728 1451399 1865442 2479124
10036B479124N38327J28771n17630n51567m44881l05960k28066j22942p8610q1965
$$ 2479124 3017451 3146222 2628592 2077025 1632144 1326184 1098118 975176 896566 814601
10026H14601o0137m1422k8156j7914K0446K5742j559J5444K7858K1030R140k190
$$ 814601 754464 713042 684886 666972 687418 713160 711601 727045 754903 775933 785073 782883
10014G82883r657j1483m7021o0148o0233l8948j5562j9037n0566p4510m3845l0796
$$ 782883 773226 761743 714722 654574 594341 555393 539831 520794 470228 395718 351873 321077
10002C21077j2804r361l3460q269K2751k866j4174l0380m2681j0915k2700k82
$$ 321077 308273 298912 265452 257183 279934 277068 262894 232514 189833 178918 156218 155936
9990A55936L1486L179j5980O926K88R404O088J6054M007k4666j0978J1512J9861
$$ 155936 187422 190601 174621 181547 181835 191239 197327 213381 217388 192722 181744 193256 213117
9977B13117N766j4174l0531l34J1862o347j8319j8432m358J3358J4314q182k396
$$ 213117 218883 204709 174178 173844 185706 179359 161040 142608 138250 151608 165922 157740 155344
9964A55344J1161k1207J9973L4924K4081L0997O070NJ6003l211J3741J5884K6630
$$ 155344 166505 145298 165271 200195 224276 255273 261343 261348 277351 274140 287881 303765 330395
9951C30395K5474J6610J5161J3078J7668L4316M5455K021M2789O7919M9668O8825
$$ 330395 355869 372479 387640 400718 418386 452702 498157 500178 542967 610886 660554 729379
9939G29379Q2869J03379J01536J22065J49494J82205J75888J97743K20586L36126
$$ 729379 812248 915627 1017163 1139228 1288722 1470927 1646815 1844558 2065144 2401270
9929B401270M91472O18444Q31841J065919J217872J191492R15665M64298J45866
$$ 2401270 2892742 3511186 4343027 5408946 6626818 7818310 8733975 9198273 9344139
9920I344139J43677L99119R31264J504564J765027J406769L65060q08495j468410
$$ 9344139 9487816 9886935 10818199 12322763 14087790 15494559 15859619 15051124 13582714
9911A3582714j539266j208043p06193k86049j17890l10216p03058j060444j221522
$$ 13582714 12043448 10835405 10129212 9843163 9725273 9415057 8711999 7651555 6430033
9902F430033j147832r83708p90065o20359m79678l42057k82163k32227j96504
$$ 6430033 5282201 4298493 3508428 2888069 2408391 2066334 1784171 1551944 1355440
9893A355440j52022j49086j14732o7109p5007o3460m9844n5954m1460p067k3066
$$ 1355440 1203418 1054332 939600 872491 797484 734024 684180 628226 586766 579699 556633
9882E56633m6682m9531j0608n366R212n735l2256m4368l0765p264j5858k9613
$$ 556633 509951 460420 449812 444446 453658 447923 415667 371299 340534 333270 317412 287799
9870B87799n842J5924J8237k3347k5917k8845k8589k5566J5290K1871J1072j5500
$$ 287799 281957 297881 316118 292771 266854 238009 209420 183854 199144 221015 232087 216587
9858B16587k5368j0911r472L2413N940q956l376M755J7665Q738R429J4925L189
$$ 216587 191219 180308 170836 203249 209189 200233 196857 201612 219277 228015 237444 252369 255558
9845B55558n649L679R215J3338O5599M3776O4961J84069J95528J57451K3613j09165
$$ 255558 249909 253588 262803 276141 341740 385516 450477 634546 830074 987525 1011138 901973
9833I01973j55991j67224j38324o6501o7723n4372j1500O06M087J2489j3347j5868
$$ 901973 745982 578758 440434 373933 306210 251838 240338 240944 245031 257520 244173 228305
9821B28305j6950J0821L3937N3932R6979J17082J33839K14737K11802J73595M3023
$$ 228305 211355 222176 256113 310045 407024 524106 657945 872682 1084484 1258079 1301102
9810A301102n6970j50941j92929j78960j66675j50552p9225j9371l4547n2806
$$ 1301102 1244132 1093191 900262 721302 554627 404075 324850 305479 270932 218126
9800B18126k1217J7764J0474j0370q230k4440J3746L6172K3141j2466K5821J4865
$$ 218126 196909 214673 225147 214777 206547 182107 195853 232025 255166 242700 268521 283386
9788B83386J5743k0981k29p659j0580l9157l9393L984j0544p507K9821K5974J206
$$ 283386 299129 278148 277919 270260 259680 220523 181130 185114 174570 167063 196884 222858 224064
9775B24064l8793N055K66j1515P988q720M853M65J980N820J080l7845j1146M806
$$ 224064 185271 190326 190592 179077 187065 178345 183198 183663 185643 191463 192543 154698 143552 148358
9761A48358O536m3087p074O0053J4146m431p821K6655L7522R507K4309K3775K833
$$ 148358 154894 111807 104733 164786 178932 174501 166680 193335 230857 240364 264673 288448 291281
9748B91281j6680l881r872j4655o75r020k2301O308K885P065k7672k3983O246
$$ 291281 274601 270720 260848 246193 245518 236498 214197 220505 223390 230455 202783 178800 185046
9735A85046J9707l139p787j1265k4989J0906K6600J9775N809N590m113j2426p09
$$ 185046 204753 201614 193827 182562 157573 168479 195079 214854 220663 226253 222140 209714 209005
9722B09005M646j2756J5404K5754K557o315J1430K8443N442J1184K5453J7716
$$ 209005 213651 200895 216299 242053 244610 238295 249725 278168 283610 294794 320247 337963
9710C37963q768J5218K1817P392K7567M1955M1466R634O0687N3080L3502L8604
$$ 337963 329195 344413 366230 373622 401189 443144 484610 494244 554931 608011 641513 680117
9698F80117O1804Q6189J02141R3361J06528J55192J67716J67253J94470K56432
$$ 680117 741921 828110 930251 1023612 1130140 1285332 1453048 1620301 1814771 2071203
9688B071203L22144L84144M59423N71227P80533J064929J365844J703798J967230
$$ 2071203 2393347 2777491 3236914 3808141 4588674 5653603 7019447 8723245 10690475
9679A0690475K000581J945432J965748J912363J456450M40495p12620j390469
$$ 10690475 12691056 14636488 16602236 18514599 19971049 20411544 19698924 18308455
9671A8308455j683107j864400k070734k161068k000768j705210j379307j082335
$$ 18308455 16625348 14760948 12690214 10529146 8528378 6823168 5443861 4361526
9663D361526p87326n88334m76163l90655k88104k39387j92060j56992j49064j19733
$$ 4361526 3574200 2985866 2509703 2119048 1830944 1591557 1399497 1242505 1093441 973708
9653I73708j09976q2153m1778n2842n7337n0724m8785j3499n1868n7412j9880
$$ 973708 863732 781579 739801 686959 629622 578898 530113 516614 464746 407334 387454
9642C87454j5628m8434k9015J3842Q338j2217n780k2970k1961J2249O348p251
$$ 387454 371826 323392 294377 308219 316557 304340 298560 275590 253629 265878 272226 264975
9630B64975l7486N834J8598n781k0451k5333l24j0527j2562k0280j1744m738K880
$$ 264975 227489 233323 251921 246140 225689 200356 200032 189505 176943 156663 144919 140181 143061
9617A43061o057j7940j543K0524J4915N92k5463j300l515j2445K2929k4675l943
$$ 143061 137004 119064 117521 138045 152960 153552 128089 126789 123274 110829 133758 109083 105140
9604A05140Q030P605O364r29J3776j6558R260J2132k083n418j366n46l806L006
$$ 105140 113170 120775 127139 126210 139986 123428 132688 144820 142737 137319 135953 135407 131601 134607
9590A34607J0065k1214L908p947j526Q703O127J0679p19K577R267J1308j7154
$$ 134607 144672 123458 127366 119419 117893 126596 132723 143402 142683 145260 154527 165835 148681
9577A48681J896m376j7805j5428m604j346r779k6871P504J1847k57K7110J4177
$$ 148681 150577 146201 128396 112968 108364 107018 97239 70368 77872 89719 89462 116572 130749
9564A30749n61j4632j8402j0343J5486N907j7897J2283J0888j2490j253j6788
$$ 130749 130188 115556 97154 86811 102297 108204 90307 102590 113478 100988 99735 82947
9552H2947l630j053J6471K5019k559J0084L213O408J5262j451k1179l321j9478
$$ 82947 79317 78264 94735 119754 117195 127279 130492 136900 152162 150711 129532 126211 106733
9539A06733K956o70P488J693l704j4510j974P665j2443J9151k138N593J2183N859
$$ 106733 109689 109019 116507 118200 114496 99986 98012 105677 93234 112385 110247 115840 128023 133882
9525A33882o933L769Q654m435M360j2421j979J7864J0815p90M410L6276J2445
$$ 133882 126949 130718 139372 134937 139297 126876 124897 142761 153576 152786 157196 193472 205917
9512B05917p54J6568Q062K2411M297l5598j8608j5426R402Q66l933q195k9494
$$ 205917 205163 221731 229793 252204 256501 220903 202295 186869 196271 197137 193204 185009 155515
9499A55515N959K3819j9523k4133j0151k0800j3606K6924J4739j7718k2032P541
$$ 155515 161474 185293 165770 141637 131486 110686 97080 124004 138743 121025 98993 106534
9487A06534J1079j0400k7639p186K1299K0061j4016p281J802O795P267O566K829
$$ 106534 117613 107213 79574 72388 93687 113748 99732 92451 94253 101048 108315 114881 117710
9474A17710j4270K4453R289p604o555q056Q292M0728J8468k6204k2366J9912j0460
$$ 117710 103440 127893 137182 129578 123023 114967 123259 163987 182455 156251 133885 153797 143337
9461A43337j5563J9055j768k1015k2451J7895n871l642P838O033o856J0863N168
$$ 143337 127774 146829 145061 124046 101595 119490 113619 109977 117815 123848 116992 127855 133023
9448A33023O626Q123O579j8686k2008Q198k95J0236j6240j784J8359R177j6929
$$ 133023 139649 147772 154351 135665 113657 121855 121560 131796 115556 113772 132131 141308 124379
9435A24379j1244J654Q257p487r636l2317K3330K5284O740J978l8309k0336L4704
$$ 124379 113135 114789 123046 115559 105923 73606 96936 122220 128960 130938 92629 72293 106997
9422A06997J5116M619K5930l813l2012k7738J0450N472Q619l863m901k2556Q782
$$ 106997 122113 126732 152662 148849 116837 89099 99549 105021 113640 109777 104876 82320 91102
9409I1102J0717J6393M720j1591j6840K5503L0454r472k7554j4371k142m801n570
$$ 91102 101819 118212 122932 111341 94501 120004 150458 140986 113432 99061 96919 92118 86548
9396H6548J878K3377l8P461l660J6666L6423p770o905p608j6812O432J0427J2314
$$ 86548 88426 111803 111765 119226 115566 132232 168655 160885 153980 146372 129560 135992 146419 158733
9382A58733M752J23K292K1017Q908l743K848N324J0054R649j2613j6323j2360
$$ 158733 163485 163608 165900 186917 195825 192082 194930 200254 210308 219957 207344 191021 178661
9369A78661J0935O224L303j4850m188J9470O633R401J3174m427J3389N980j8865
$$ 178661 189596 195820 199123 184273 180085 199555 206188 215589 228763 224336 237725 243705 224840
9356B24840j1547N572n312K619k5657j8420L494N135J1390J893k9349p848j2000
$$ 224840 213293 218865 213553 216172 190515 172095 175589 180724 192114 194007 164658 156810 144810
9343A44810j9391K2724k322j352j132J87J6420M0961R117j4301M983k6724j8108
$$ 144810 125419 148143 145821 144469 143337 143524 159944 200905 210022 195721 200704 173980 155872
9330A55872K0408L2635Q144j176K1131q258j5588j3275R236J5217l882K1912N606
$$ 155872 176280 208915 217059 215883 237014 228756 213168 199893 209129 224346 220464 242376 247982
9317B47982m204j9490K947j765O214J1970p36N795j959P678j1782j6693J6411
$$ 247982 243778 224288 227235 225470 231684 243654 242918 248713 246754 254432 242650 225957 242368
9304B42368N503O625k4292K2231P265L501J2190K1609J1571J9096J2374o761J3538
$$ 242368 247871 254496 230204 252435 259700 263201 275391 297000 308571 327667 340041 333280 346818
9291C46818K0131p301k9288q412j4125J9258L7243L2943L0496J1787K9710J8974
$$ 346818 366949 359648 330360 321948 307823 327081 364324 397267 427763 439550 469260 488234
9279D88234j0932m446k3621j3889N408k041R27J3034K5729K4861J6582J680L1582
$$ 488234 477302 472856 449235 435346 440754 438713 439640 452674 478403 503264 519846 521526 553108
9266E53108K5477J487J1841j672l9950n3858J997J0070k490q700N583K5212K3874
$$ 553108 578585 580072 591913 590241 550291 496433 498430 508500 506010 497310 502893 528105 551979
9253E51979P848N540q707j52m96M5926O4759O8883R5740J03404L8353k3587m5707
$$ 551979 559827 565367 556660 556508 556012 601938 666697 735580 831320 934724 973077 949490 903783
9240I03783q3033j13694n9691r542j6114q973o836J2377k6669k542L595K2412
$$ 903783 820750 707056 647365 637823 621709 612736 605900 618277 591608 589066 592661 615073
9228F15073K8139n313j6515J2801K530q594l4862p595l1699k1425m949j7106K737
$$ 615073 643212 637899 621384 634185 636715 628121 593259 585664 553965 532540 527591 510485 513222
9215E13222J4364m170k8264j330Q298J6317L1916K2544J229k1498p69j9633m1827
$$ 513222 527586 523416 495152 493822 502120 518437 550353 572897 574126 552628 551859 532226 490399
9202D90399k7671J2946n585J2244K7165k08M269N178J7931J5105M7087K8051j1149
$$ 490399 462728 475674 470089 482333 509498 509290 513559 518737 536668 551773 598860 626911 615762
9189F15762O75k275J4007K133O935J8024J913j3262j2561L276M55J0377r77O348
$$ 615762 616437 614162 628169 630302 637237 655261 657174 643912 631351 634627 635082 645459 644482 650830
9175F50830K2767P175N2652R445j5876j1369j829R571o938n95J9072K0284K1297
$$ 650830 673597 680772 733424 742869 726993 715624 713795 723366 716428 715833 734905 755189 776486
9162G76486K3244J584j3865j0573J3976J3654n465J5373r364M191K4662L123k0048
$$ 776486 799730 801314 787449 776876 790852 804506 799041 814414 805050 809241 833903 837026 816978
9149H16978N642l349r191K3844K9325K3480J9234k0619J5989M4036J6j5662N661
$$ 816978 822620 819271 810080 833924 863249 886729 905963 885344 901333 945369 945385 929723 935384
9136I35384O415J4345j1068L2647M4092k459J3365J5660K0718O07j477q60O11
$$ 935384 941799 956144 945076 977723 1021815 1019356 1032721 1048381 1069099 1069706 1068229 1067369 1067980
9123A067980Q970J9954J7297K9926L0162M908P714q871n378K9152M2603J5989
$$ 1067980 1076950 1096904 1114201 1144127 1174289 1179197 1186911 1178040 1172662 1201814 1244417 1260406
9111A260406P437P766J7269M2831M8791L1954K5627M6256O0703N2339M0671L8368
$$ 1260406 1267843 1275609 1292878 1335709 1384500 1416454 1442081 1488337 1549040 1601379 1642050 1680418
9099A680418J6102N1077O7237J9428L5611M2412K0739K1318L0144N2479O1312
$$ 1680418 1696520 1747597 1814834 1834262 1869873 1912285 1933024 1954342 1984486 2036965 2098277
9088B098277L7799M8368M9125M3952L9613L0116O4518M5872P4492O6065M6433
$$ 2098277 2136076 2184444 2233569 2277521 2317134 2347250 2411768 2457640 2532132 2598197 2644630
9077B644630M7259L9385M7448O1705N2711R9559J21204J09226J33763J15619J14240
$$ 2644630 2691889 2731274 2778722 2840427 2893138 2992697 3113901 3223127 3356890 3472509 3586749
9066C586749J41901J50634J77967K17374K30031K56579L11142L66799M01929N03549
$$ 3586749 3728650 3879284 4057251 4274625 4504656 4761235 5072377 5439176 5841105 6344654
9056F344654N98290O19746N51859L30199O9707j58283k86672l29613k99960k18387
$$ 6344654 6942944 7562690 8114549 8444748 8514455 8356172 8069500 7739887 7439927 7221540
9046G221540j56605p1833j9100K1017P3111J09015J07140J66749K08715K19781
$$ 7221540 7064935 6993102 6974002 6995019 7068130 7177145 7284285 7451034 7659749 7879530
9036G879530K40788K62588K94639K94970K69314L19707L85890M26585M30138M74266
$$ 7879530 8120318 8382906 8677545 8972515 9241829 9561536 9947426 10374011 10804149 11278415
9026A1278415N36267N34228N80365O63383O74635P18312P70044Q38576R06456
$$ 11278415 11814682 12348910 12929275 13592658 14267293 14985605 15755649 16594225 17500681
9017A7500681R89733J068611J169209J261701J356282J496631J588899J737127
$$ 17500681 18490414 19559025 20728234 21989935 23346217 24842848 26431747 28168874
9009B8168874J903978K078062K263742K445260K664180K910246L148800L409265
$$ 28168874 30072852 32150914 34414656 36859916 39524096 42434342 45583142 48992407
9001D8992407L648918L925689M216683M477522M743795N005012N116450N192715
$$ 48992407 52641325 56567014 60783697 65261219 70005014 75010026 80126476 85319191
8993H5319191N166055M936637M505541L935146L138896K183808J077064j04791
$$ 85319191 90485246 95421883 99927424 103862570 107001466 109185274 110262338 110157547
8985A10157547j287259k373725l290400m054736m629599n047194n261606n316460
$$ 110157547 108870288 106496563 103206163 99151427 94521828 89474634 84213028 78896568
8977G8896568n251033n075231m834497m546291m237174l963026l685565l403173
$$ 78896568 73645535 68570304 63735807 59189516 54952342 50989316 47303751 43900578
8969D3900578l105685k835248k621902k418177k201494k015153j830744j691705
$$ 43900578 40794893 37959645 35337743 32919566 30718072 28702919 26872175 25180470
8961B5180470j569460j469959j308661j203722j109891j023771r26526q74195
$$ 25180470 23611010 22141051 20832390 19628668 18518777 17495006 16568480 15694285
8953A5694285q20303p46441o78883o55495o05562n59530n42158m89788m46827
$$ 15694285 14873982 14127541 13448658 12793163 12187601 11628071 11085913 10596125 10149298
8944A0149298m44616m02130l82523l53056l46468l49471k98719k87516k82353
$$ 10149298 9704682 9302552 8920029 8566973 8220505 7871034 7572315 7284799 7002446
8935G002446k49952k57807k19534j83640j88081k09035j91618j95249j83275j40478
$$ 7002446 6752494 6494687 6275153 6091513 5903432 5694397 5502779 5307530 5124255 4983777
8925D983777j27036j40117j52741j61895j29116j27561j17999j22384r1768r2996
$$ 4983777 4856741 4716624 4563883 4401988 4272872 4145311 4027312 3904928 3813160 3720164
8915C720164j22610j17110q9862q1847r0311m6433o5631j00516o3276j06371n8944
$$ 3720164 3597554 3480444 3390582 3308735 3218424 3171991 3106360 3005844 2942568 2836197 2777253
8904B777253l3537n8620n6809o5833m3674p1668p3748n8233k8901k6479m2958
$$ 2777253 2743716 2685096 2628287 2562454 2518780 2447112 2373364 2315131 2286230 2259751 2216793
8893B216793p8438o7752j8910k9371n3440n1583m3683l2623j3507k6520m3663
$$ 2216793 2138355 2070603 2051693 2022322 1968882 1917299 1873616 1840993 1827486 1800966 1757303
8882A757303m14p785l1494r459j3908k473l6818l2820J4150K662J1388k1531L0065
$$ 1757303 1756889 1749104 1717610 1708151 1694243 1691770 1654952 1622132 1636282 1638944 1650332 1628801 1658866
8869A658866Q3801J26471J37545J51949J13862o220j24907j52669j31079j02708
$$ 1658866 1742667 1869138 2006683 2158632 2272494 2266274 2141367 1988698 1857619 1754911
8859A754911n3354l3361n2711n7516n2328j652N729n4972o5687j5911p921j0221
$$ 1754911 1701557 1668196 1615485 1557969 1505641 1503989 1509718 1454746 1389059 1373148 1365227 1355006
8847A355006n120k1390q543n6539n9554m7264p0980k8695m409m2064n3123j2941
$$ 1355006 1349886 1328496 1319953 1263414 1203860 1156596 1085616 1056921 1052512 1010448 957325 944384
8835I44384J5586l477j3460m4947k1965l6071k2690P848j8858J2629m661m2542
$$ 944384 959970 956493 943033 898086 876121 840050 817360 825208 806350 818979 814318 771776
8823G71776k6780k6915l657L204q017l8755j9144J3964J7420k1292P022j125K633
$$ 771776 744996 718081 714424 717628 709611 670856 651712 665676 683096 661804 668826 667701 670334
8810F70334r366j3929l1648k5753L184j1436L566l4453j0900k676N661J0489j1618
$$ 670334 660968 647039 615391 589638 592822 581386 584952 550499 539599 536923 542584 553073 541455
8797E41455m4501k2144J4496M33p078K171r035o36j7031R380R214Q553K2115K7722
$$ 541455 496954 474810 489306 489739 482661 484832 475797 475161 458130 467510 476724 485277 507392 535114
8783E35114o378j3782L641p967L644j2095K0112L7910j6217K519K920J2167j5834
$$ 535114 528736 514954 518595 510628 514272 502177 522289 560199 543982 546501 549421 561588 545754
8770E45754j2608j1621k3823K7947J795k1006q482k3945k6171j2321J7937J1228
$$ 545754 533146 521525 497702 525649 527444 506438 497956 474011 447840 435519 453456 464684
8758D64684q486J306j6066l8330n1305j0905Q600o092m085R983K4863Q484j5993
$$ 464684 456198 457504 441438 403108 351803 340898 349498 343406 339321 349304 374167 382651 366658
8745C66658p752J7424k975r476k8428j3914J1366n553k6820j1192J9672J3487
$$ 366658 358906 376330 373355 363879 335451 321537 332903 327350 300530 289338 309010 322497
8733C22497q663N756j3024j2141m541K5650M930k8555j1200K1120K8756r774l6647
$$ 322497 313834 319590 306566 294425 289884 315534 320464 291909 280709 301829 330585 320811 284164
8720B84164j4985J8118K5924M688J9022j1536L0620L6048Q559l3410q67M592K0446
$$ 284164 269179 287297 313221 317909 336931 325395 356015 392063 400622 367212 366345 370937 391383
8707C91383K1565p83m7869l275k2324J423J7580J0299P435k0508J0809n725j5192
$$ 391383 412948 412165 364296 361021 338697 340120 357700 367999 375434 354926 365735 360010 344818
8694C44818J342P365q237j2470k1589p614M1821J1745q227L920j5093q38J0788
$$ 344818 346160 353525 345288 332818 311229 303615 345436 357181 348954 352874 337781 336943 347731
8681C47731J6077J1855P262j0219j7878j1011J8136L1810L0306N295p802m351
$$ 347731 363808 375663 382925 372706 354828 343817 361953 393763 424069 429364 421562 417211
8669D17211K840k1716j0583P343M54M202k9777p884j575n809m129M471J7808K780
$$ 417211 420051 398335 387752 395095 395549 399751 369974 362090 360515 354706 350577 355048 372856 375636
8655C75636J812K7549J3714J3092R342k4934o309L1977J8765N005k0371n666m099
$$ 375636 377448 404997 418711 431803 441145 416211 409902 441879 460644 465649 445278 439612 435513
8642D35513N3205Q0752P4088M5400K6306J0679j8098n0336o5993l4348l3855m5705
$$ 435513 488718 569470 643558 688958 715264 725943 707845 657509 591516 557168 523313 477608
8630D77608j8045l9155j8480K6664J9532K586r141j9182L3638M1858k296q055
$$ 477608 459563 420408 401928 428592 448124 450710 441569 422387 456025 497883 495587 487532
8618D87532K2827J7885k786K1228J2785N727k104K4518K4844J7085K6272L2520
$$ 487532 510359 528244 525458 546686 559471 565198 563094 587612 612456 629541 655813 688333
8606F88333K1708M5179L7339K0733O1774P0362O4938O8209P7227R1054J32699
$$ 688333 710041 755220 792559 813292 875066 945428 1010366 1078575 1155802 1246856 1379555
8595A379555J46636J56741K58235K91570K69334J97457J17696J22794Q8928L4239
$$ 1379555 1526191 1682932 1941167 2232737 2502071 2699528 2817224 2940018 3028946 3063185
8585C063185p1693j68976k44444k87560l24853k52786k58376k31604j56234j05280
$$ 3063185 2991492 2822516 2578072 2290512 1965659 1712873 1454497 1222893 1066659 961379
8575I61379j12915j19940p7162n6608n9482n6932l3178l1225o682N569j3927l6929
$$ 961379 848464 728524 651362 594754 535272 478340 445162 413937 407255 412824 398897 361968
8563C61968m1275j9242J6149l341o895j9284l3005k1580j890j0747J6281O170
$$ 361968 320693 301451 317600 314259 307364 288080 255075 233495 231605 220858 237139 243309
8551B43309K4623J9078J8626L7473R1635L9342j1391l4109n6578m3871j5437j9094
$$ 243309 267932 287010 305636 343109 434744 474086 462695 428586 372008 328137 312700 293606
8539B93606l5829M007j9227m026m530k5492j0333k7226J195k258j74J9877j2685
$$ 293606 257777 261784 242557 238531 234001 208509 198176 170950 172145 169887 169713 189590 176905
8526A76905l3209k2255J3891p316j7233K3241N4544J3064j8725j4392O833J4210
$$ 176905 143696 121441 135332 128016 110783 134024 188568 201632 182907 168515 175348 189558
8514A89558N098j4455p214k0851j6248j4351m213O468J1754M808K3904J7173O361
$$ 189558 194656 180201 172987 152136 135888 121537 117324 123792 135546 140354 164258 181431 187792
8501A87792k949j1349k2057j2251l044O470j6451p387k244q868j5288Q217k831
$$ 187792 184843 173494 151437 139186 136142 142612 126161 118774 116530 107662 92374 100591 97760
8488I7760K5118J3943r292j0436R301J7174L458l380J4628J1015q675k3230l507
$$ 97760 122878 136821 127529 117093 126394 143568 147026 143646 158274 169289 160614 137384 133877
8475A33877J1797j0356k156J2492K0426j6213m6727j6733R529K890j4500N715
$$ 133877 145674 135318 133162 145654 166080 149867 103140 86407 95936 98826 84326 90041
8463I0041Q933j772l534j5211j2758K8474J4179n083o914j0689J8544M1638N375
$$ 90041 98974 97202 93668 78457 65699 94173 108352 103269 96355 85666 104210 145848 151223
8450A51223k5995n695L690K2539M365J8108k8784K519j1815k1088J1841N265O936
$$ 151223 125228 119533 123223 145762 150127 168235 139451 141970 130155 109067 120908 126173 133109
8437A33109m2828n249R836J1391O926j8106N852Q426k0441p950M283j0080k6298
$$ 133109 90281 85032 94868 106259 113185 95079 100931 109357 88916 80966 85249 75169 48871
8424D8871N5L5695m825j2666q457j9367j5361N1201K5798L0542J116o945j4898
$$ 48871 48926 84621 79796 67130 58673 39306 23945 75146 100944 131486 132602 125657 110759
8411A10759K545J1970j7378k7799n575L032J3741l62j5842J950p646K1962M1769
$$ 110759 113304 125274 107896 80097 74522 77554 91295 90933 75091 77041 69395 91357 133126
8398A33126j8706j1707R568j5327n90q743k9766j775J3806J3876k3869K576k102
$$ 133126 114420 102713 112281 96954 96364 87621 57855 56080 69886 83762 59893 62469 60367
8385F0367j517R559M465k174r252Q645n445J2115J0702q322P97j2724R048J2895
$$ 60367 58850 68409 72874 70700 61448 70093 64648 76763 87465 79143 79940 67216 76264 89159
8371H9159J0442j5288k6204n1796K2615O488l650j4343J3769K9805J0193l9406
$$ 89159 99601 84313 58109 6313 28928 35416 31766 17423 31192 60997 71190 31784
8359C1784J7264K0186J1317M320J20j2472j3449j2611R064J1426J7691K0558p987
$$ 31784 49048 69234 80551 84871 84991 72519 59070 46459 55523 66949 84640 105198 97211
8346I7211j8848J5366J9688L067l7473l8599j6944L0914J6144K0955J3024N821
$$ 97211 78363 93729 113417 116484 79011 40412 23468 54382 70526 91481 104505 110326
8334A10326q267j826j6416j9815k1123l790k429k667J6373K714K0093J0824j3884
$$ 110326 102059 100233 83817 64002 42879 39089 36660 33993 50366 53080 73173 83997 70113
8321G0113j060j8182j7202o645K7492M099J2322J778O776O716K011m956J5645
$$ 70113 69053 50871 33669 27024 54516 58615 70937 72715 79491 86207 88218 83262 98907
8308I8907J2585P498l3766l2803k3092M235J9335J8242M5612j2140k0245o13l7801
$$ 98907 111492 118990 85224 52421 29329 33564 52899 71141 116753 104613 84368 83755 45954
8295D5954j5320P89k834J4315j3083M480J4104L2977Q169l3979k1399M606J5065
$$ 45954 30634 31423 28589 42904 29821 34301 48405 81382 89551 55572 34173 38779 53844
8282E3844j4628j1665J5474n417J0830K2813l252l663j263l840R489j8826l392
$$ 53844 39216 27551 43025 37608 48438 71251 67999 64336 63073 59233 68722 49896 46504
8269D6504K5743J1690N862m475k688l2727M364J91J8340j8062L809n396N290L7146
$$ 46504 72247 83937 89799 85324 82636 49909 54273 54464 72804 54742 58551 53155 58445 95591
8255I5591J6816l142p71K218o854p688j2913k8981k3336L0559M4269l0492k0321
$$ 95591 112407 109265 108494 110712 103858 96170 83257 54276 30940 61499 105768 75276 54955
8242E4955p694r148r87P278L1729L6595Q548k2484k7252j700J9725m413k095k4752
$$ 54955 47261 38113 37126 44404 76133 112728 121276 98792 71540 69840 89565 85152 83057 58305
8228E8305J4697K4851o520o514p115R11J8150l1070q165J9705j006N737l159j4719
$$ 58305 73002 97853 91333 84819 77704 78615 96765 65695 57530 77235 76229 81966 78807 64088
8214F4088j6476p704L4523L7619r402m1588j348j231j0381K8472K3458o142j363
$$ 64088 47612 39908 74431 112050 102648 61060 59712 58481 48100 76572 100030 93888 92525
8201I2525j2621n210j8384k4954q791J3060K8837L392m516N114j0514m329K2769
$$ 92525 79904 74694 56310 31356 22565 35625 64462 67854 63338 68452 57938 53609 76378
8188G6378Q465k605K372m620p897J219l5740k953J540m61o29p346j2815j7144
$$ 76378 84843 82238 84610 79990 72093 73312 37572 34619 36159 35698 35069 27723 14908 -2236
8174b236J8397L5515j782k750L2272J3787k6746k8028j0693M855J9774L710o213
$$ -2236 16161 51676 49894 47144 79416 93203 66457 38429 27736 32591 52365 56075 49862
8161D9862J8993K4671Q056N631j2161m727k6879j9666K659n242q052q28J7669
$$ 49862 68855 93526 101582 107213 95052 90325 63446 43780 46439 41197 33145 32317 49986
8148D9986R63J0132M003k108M041N623J4912m876j9971o321q795O721O268j7024
$$ 49986 50949 61081 65084 62976 67017 72640 87552 82676 62705 56384 47589 54310 60578 43554
8134D3554O390J054J0710k1857p863Q548j277j1454L5980K0099k6035J905l215
$$ 43554 49944 50998 61708 39851 31988 40536 39259 27805 63785 83884 57849 59754 56539
8121E6539O138j2740n738J3357j3303j4551N452J154q115l453J9552L381o830
$$ 56539 62677 49937 44199 57556 44253 29702 35154 36308 28193 24740 44292 47673 40843
8108D0843P084J2759J4590n422k3810j5604J0369Q745N15J2537j2555Q770k4270
$$ 40843 47927 60686 75276 69854 46044 30440 40809 49554 50069 62606 50051 58821 34551
8095C4551J2054J9642q604P905o147K4403l865o0Q730J1328j937j6732k5284M955
$$ 34551 46605 66247 57643 65548 59401 83804 79939 79879 88609 99937 98000 81268 55984 60939
8081F0939L1490J6192j2352n541R799k5070K4025r639J0971l334j7673j160k2523
$$ 60939 92429 108621 96269 90728 100527 75457 99482 89843 100814 97480 79807 78647 56124
8068E6124m706K7855K3488j5223j7794j426j2957j5588O870N902l232J6472m49
$$ 56124 51418 79273 102761 87538 69744 68318 55361 39773 46643 52545 49313 65785 65336
8055F5336L760L392L811p313n342N241J1824n203J8471J6274J9726M731J0915
$$ 65336 69096 72488 76299 68986 63644 68885 80709 75506 93977 110251 129977 134708 145623
8042A45623J199K904J3372j4441j124j5204L4900L6714O235J8438K3062J3700
$$ 145623 146822 149726 163098 148657 147533 132329 167229 203943 210178 228616 251678 265378
8030B65378m494k2908m2974j6942k3103J230J2816L421q509l069J890m376j2537
$$ 265378 260884 237976 195002 178060 154957 156187 169003 172424 163915 160846 162736 158360 145823
8017A45823K4738K5637R797o456o008Q92m528k8236J2142N118n273Q876N7501
$$ 145823 170561 196198 205995 199539 193531 194423 189895 161659 173801 178919 173646 182522 240023
8004B40023J2896n468j3409K3333j7016l919J4196O289J9175N1930N3706K3685
$$ 240023 252919 247451 234042 257375 240359 236440 250636 256925 276100 328030 381736 405421
7992D05421L5132K4465J7392k5063j8138k0834l3098n4505k0980L513j830k7218
$$ 405421 440553 465018 482410 457347 439209 418375 385277 330772 309792 313305 311475 284257
7980B84257l2765j1954k706j3301k3474l871J7689R95r343m203R324p423j2077
$$ 284257 251492 239538 236832 223531 200057 196186 213875 214870 205527 201324 210648 203225 191148
7967A91148L607l143L1556K3829K1004J0258k85L2944K0495N879J4960j3953J0427
$$ 191148 194755 191612 223168 246997 268001 278259 277974 310918 331413 337292 352252 338299 348726
7954C48726M3696L5076k3183k6121O142M3561M2652M84j2509j0638k9128J6K848
$$ 348726 392422 427498 404315 378194 384336 427897 470549 471033 458524 447886 418758 418774 421622
7941D21622l054j3024o15j4618m2058k4147j9510k0057K0681J2380p736N410J5869
$$ 421622 418568 405544 404929 390311 348253 324106 304596 284539 305220 317600 309864 315274 331143
7928C31143o326j3679J3065J4243k8410k1165L3421K7531L7149k584M513J7969
$$ 331143 324817 311138 324203 338446 310036 288871 322292 349823 386972 384388 388901 406870
7916D06870L4947L25J050L1355j2330o037j843J260p653k8433j0175p656k4562
$$ 406870 441817 442142 443192 474547 462217 456180 454337 455597 447944 419511 409336 401680 377118
7903C77118J8458L066j5272M32r282l389j5455o49J6356l8545m3122K575O608
$$ 377118 395576 398642 383370 383802 374520 371131 355676 355027 371383 332838 289716 292291 298899
7890B98899M5569m105j5521j2177r049n557k8027k6461R101j0032n978P365P151
$$ 298899 344468 340363 324842 312665 303616 298059 270032 243571 252672 242640 236662 244027 251178
7877B51178J0765P87P687O453p027l7772j867k1104K749J6265N94j0111M568j3570
$$ 251178 261943 262730 270417 276870 269843 232071 230204 209100 211849 228114 228708 218597 223165 209595
7863B09595j2895j5808k3542q348j8273j0809P622j5592j2458K533P628J9496
$$ 209595 196700 180892 157350 149002 130729 119920 127542 111950 99492 102025 109653 129149
7851A29149J9428O250j8869m21J0498R37n40p195N079J9671R438k1992k4788k6862
$$ 129149 148577 154827 135958 135537 146035 146972 146432 139237 144316 163987 173425 151433 126645 99783
7837I9783m428p459k2827M828o670j1710j397q226J0196N458J8019j2440k407
$$ 99783 95355 87896 65069 69897 63227 51517 50120 41894 52090 57548 75567 63127 60720
7824F0720k0996K434l20j4714J0196K6081K9191q192l5626p830o62M326N385k4066
$$ 60720 39724 42158 41838 27124 37320 63401 92592 84400 48774 40944 40282 44608 49993 25927
7810B5927p950k1781J2540J1140J1420K5759p86N777J0949K4633p098k2096j1787
$$ 25927 17977 -3804 8736 19876 31296 57055 56269 62046 72995 97628 90530 68434 56647
7797E6647j905r220j1629K505M450l0196k2752J614N285J5310K1213j2454j5949
$$ 56647 54742 45522 33893 36398 40848 10652 -12100 -10486 -5201 10109 31322 18868 2919
7784B919L460j5986J6164N031k0681O279K5905J8892j6428k7999k8223n515J8756
$$ 2919 6379 -9607 6557 11588 -9093 -2814 23091 41983 25555 -2444 -30667 -36182 -17426
7771a7426K0253J8400K0360K2927k2849m7714J9755R823j9396k451N311q940j4703
$$ -17426 2827 21227 41587 64514 41665 -6049 13706 23529 4133 1682 6993 -1947 -16650
7758a6650j5845q232J2444K6116o809J35O991J0296L0601j3771j3177K113Q806
$$ -16650 -32495 -40727 -28283 -2167 -8976 -8841 -1850 8446 39047 25276 12099 14212 23018
7745B3018k2905k0028J2138O254l455n529J5763o960j075m95L405P42n804M332
$$ 23018 113 -19915 -7777 -1523 -4978 -10507 5256 -1704 -2779 -3274 131 873 -4931 -599
7731e99J4512l1321j492J5723K666o077j2194J2194R984K0491O566j4663j7512
$$ -599 13913 -17408 -18900 -3177 -511 -6588 -18782 -6588 3396 23887 30453 15790 -1722
7718a722q953l151O190L2539K8611m190k3075k9498k4167k505K2506p507N480
$$ -1722 -10675 -13826 -7636 24903 53514 49324 26249 -3249 -27416 -29921 -7415 -14922 -9442
7705i442J0353j4157j5344J8269r677M379K0629K6192m511j2550k9943n973n15
$$ -9442 911 -13246 -28590 -10321 -19998 -15619 5010 31202 26691 14141 -15802 -21775 -22290
7692b2290Q373j774Q236R412j7244R016l316k5773O256J132n720k6424L125R212
$$ -22290 -13917 -15691 -7455 1957 -15287 -6271 -9587 -35360 -29104 -27972 -33692 -60116 -56991 -47779
7678d7779o286J1703J1009L7057L7357L0568j6131k4895n949M36j1381j9806p206
$$ -47779 -54065 -42362 -31353 5704 43061 73629 57498 32603 26654 27090 15709 -4097 -11303
7665a1303k52k0668o788K0160J2041O539l3820k2570L1200N4306K0504O234l3145
$$ -11303 -11555 -32223 -39011 -18851 -6810 -271 -34091 -56661 -25461 28845 49349 55583 22438
7652B2438j2908O646K276q627j5034j3054K3557K2629n348n142k3125j4199k968
$$ 22438 9530 16176 18452 9825 -5209 -18263 5294 27923 22575 17433 -5692 -19891 -22859
7639b2859J7739j5607k2762K5833K1359N538j0114M09Q310p713Q150K192l60j1563
$$ -22859 -5120 -20727 -43489 -17656 3703 9241 -873 -464 7846 133 8283 10475 10115 -1448
7625a448k3576k8096J819j338O972L2296o011J180K0692m141j1784l3Q534k1808
$$ -1448 -25024 -53120 -51301 -52639 -45667 -13371 -19382 -18202 2490 -1651 -13435 -13468 -4934 -26742
7611b6742m615N021J2866K1818k3620o347J9388M4625J417j3443l5630l451j4668
$$ -26742 -31357 -26336 -13470 8348 -15272 -21619 -2231 42394 43811 30368 -5262 -8713 -23381
7598b3381j417L6603J4916j6332l0212j5929M5416k147q210L0764J2020j2808
$$ -23381 -24798 11805 26721 10389 -19823 -35752 9664 7517 -693 30071 42091 29283
7586B9283j3537j351K106O741m519j2722l7168J6351N5867k7032k5055q633L631
$$ 29283 15746 14395 16501 23242 18723 6001 -31167 -14816 41051 14019 -11036 -19669 -16038
7573a6038M297J871p418M139j1293K213j367j3189p572K3615J0242j583p899p427
$$ -16038 -11741 -9870 -17288 -13149 -24442 -22229 -23596 -36785 -44357 -20742 -10500 -12083 -19982 -27409
7559b7409J5690n968j095J1417L8604L653q076j5461j9941m163L7353M243l1863
$$ -27409 -11719 -17687 -18782 -7365 31239 34892 26816 11355 -8586 -12749 24604 28847 -3016
7546c016k8278J3841j7096Q550Q539k4689k651K4378K2605j0713p173k3957j8852
$$ -3016 -31294 -17453 -34549 -25999 -17460 -42149 -44800 -20422 2183 -8530 -15703 -39660 -58512
7533e8512O942J1290K766M446M12K7551J5264J5877n452J0494K767M791j0128
$$ -58512 -51570 -40280 -37514 -33068 -32656 -5105 10159 26036 20584 31078 33845 38636 28508
7520B8508k4287k1493L013J6370l9902l4652K0417L6249J1674j8951J339j369
$$ 28508 4221 -17272 -14259 2111 -37791 -72443 -52026 -15777 -4103 -23054 -21715 -23084
7508b3084K0935N319j5777j3293k24j0147r672j5269K580J2466p211J6814L9201
$$ -23084 -2149 3170 -12607 -25900 -26124 -36271 -45943 -61212 -58632 -46166 -53377 -36563 2638
7495B638R2j5578n322j8417m2475L155L7931K2661q414R364J7664J356k0924j033
$$ 2638 2730 -12848 -18170 -36587 -79062 -75907 -37976 -15315 -23729 -14365 3299 4655 -16269 -17302
7481a7302k065p107n283J3516K1194J3694K5192j1175l0464l1007J6557J7318
$$ -17302 -19367 -26474 -31757 -18241 2953 16647 41839 30664 200 -30807 -14250 3068
7469C068R415r380R349j4508O767K549j4194j0488k3392Q677K3945J9360j1023
$$ 3068 12483 3103 12452 -2056 4711 7260 -6934 -17422 -40814 -32137 -8192 11168 145
7456A45j2818q176J2691J9486P111o267l344k3612n224k2531J3517J2742j76j9516
$$ 145 -12673 -20849 -8158 11328 18439 12172 8828 -14784 -20008 -42539 -29022 -16280 -16456 -35972
7442c5972L4456K4798j1968l009k2455O550K1632r832k2221Q932J1267Q346Q738
$$ -35972 -1516 23282 11314 8305 -14150 -7600 14032 4200 -18021 -9089 2178 10524 19262
7429A9262R199k2609k3523M194j1645J9002l592q156r593R972J8772k1155R090
$$ 19262 28461 5852 -17671 -13477 -25122 -6120 -9712 -17868 -27461 -17489 1283 -19872 -10782
7416a0782q893r404J4418N21l5840k723K6197K5906M7462o343l1946j3400r215
$$ -10782 -19675 -29079 -14661 -14140 -49980 -52703 -26506 -600 46862 40519 8573 -4827 -14042
7403a4042k8211j9754J8263Q684K022Q090J594P531J2669J1468j6670l919l640
$$ -14042 -42253 -62007 -43744 -35060 -33038 -24948 -23354 -15823 -3154 8314 -8356 -12275 -15915
7390a5915J5273L0770Q562J084j4056k5364n502J5834o30j945j7288k2895M760
$$ -15915 -642 30128 38690 39774 25718 354 -5148 10686 10056 8111 -9177 -32072 -27312
7377b7312K4753R198j8934J898K031k2914J1720L570j6390k551O751O381L872
$$ -27312 -2559 6639 -12295 -10397 -8366 -31280 -19560 -15990 -32380 -34931 -28180 -21799 -17927
7364a7927q774J0243Q830Q552P295J1034N579k987k0326l6217p16J747r700j4484
$$ -17927 -26701 -16458 -7628 924 8219 19253 24832 21845 1519 -34698 -35414 -33667 -43367 -57851
7350e7851j167M6937K5739k6025k4869J0637L126p28L393k1066k7037J2648K3859
$$ -57851 -59018 -12081 13658 -12367 -37236 -26599 -23473 -24201 -20808 -41874 -68911 -56263 -32404
7337c2404o772j8662K8826J7462K1406o873Q424k625P257Q217J1187j7204l4137
$$ -32404 -39176 -57838 -29012 -11550 9856 2983 11407 8782 16039 24256 35443 18239 -15898
7324a5898K0370L040r40j338O114j0964k1634n921k046j3320j8972J8594L4544
$$ -15898 4472 7512 6572 5234 11348 384 -21250 -27171 -29217 -42537 -61509 -42915 -8371
7311h371M732L0369j1146j8065J4815k200n873M436j1054o662k8224K1983j019
$$ -8371 -3639 26730 15584 -2481 12334 10134 4261 8697 -2357 -9019 -37243 -15260 -16279
7298a6279P687P132q392j5290j0614k7863j9687J093L2958o56n28J5491K1158
$$ -16279 -8592 -1460 -9852 -25142 -35756 -63619 -83306 -82213 -49255 -49911 -50439 -34948 -13790
7285a3790J2494J7425r94j6134m8120l752K2454L3100K0985L203k0521j5357M273
$$ -13790 -1296 16129 15135 -999 -49119 -52871 -30417 2683 23668 26871 6350 -9007 -4734
7272d734Q566q125j3433j7152l63J6568N575J0107m173J4051M819k7072k4424
$$ -4734 3832 -4293 -17726 -34878 -35241 -18673 -13098 -2991 -7164 6887 11706 -15366 -39790
7259c9790j7642J2271K799r383l046J7274j4920N517K0412M519r280j3136L1351
$$ -39790 -57432 -45161 -42362 -51745 -54791 -37517 -52437 -46920 -26508 -21989 -31269 -44405 -13054
7246a3054J9462j3329J2616k2453J320j2201L222R102k949l797j1624l3643O289
$$ -13054 6408 -6921 5695 -16758 -15438 -27639 -24417 -15315 -18264 -22061 -33685 -67328 -61039
7233f1039L0209J2415p662l0688O688J4660K6807K227L507k1922j2907L048K185
$$ -61039 -30830 -18415 -26077 -56765 -50077 -35417 -8610 -6383 -2876 -24798 -37705 -34657 -32472
7220c2472j2717K884O709R575L3991K170J1314O734k4424k9491J476R024N039
$$ -32472 -45189 -42305 -35596 -26021 7970 10140 21454 28188 3764 -25727 -24251 -15227 -10188
7207a0188q869N605K4590K0486l9613l1637M661L59K870p741K356L527J7511K753
$$ -10188 -19057 -13452 11138 31624 -7989 -39626 -34965 -34606 -31736 -39477 -37121 -33594 -16083 -13330
7193a3330j900N167J5963J6281M583l1934l2704k6309N388L3053q895K7442r887
$$ -13330 -15230 -10063 5900 22181 26764 -5170 -37874 -64183 -58795 -25742 -34637 -7195 -17082
7180a7082M555J5061r819j987M918J635j8986O412L0082N877m306L399k2936J564
$$ -17082 -12527 2534 -7285 -9272 -4354 -2719 -21705 -15293 14789 20666 16360 19759 -3177 -1613
7166a613K295Q430M482j8636l1209O489L1399K3028N115l3563l1769J585p57K5035
$$ -1613 682 9112 13594 -5042 -36251 -29762 1637 24665 29780 -3783 -35552 -33967 -34724 -9689
7152i689Q06J0211K8235m0971m9655J8068M5504J2676o713j1816K660r450k4376
$$ -9689 -8883 1328 29563 -11408 -61063 -42995 2509 15185 8472 -3344 -684 -10134 -34510
$$ [...]
##END NTUPLES=NMR SPECTRUM
##END=
