##TITLE=Analysis number 313498
Compound Code cc 40116
Book Reference 350/172/1
Project Code adrs
Chemist Name chrisr
##JCAMPDX= 6.0         $$ Bruker NMR JCAMP-DX V2.0
##DATA TYPE= NMR SPECTRUM
##DATA CLASS= NTUPLES
##ORIGIN= Bruker BioSpin GmbH
##OWNER= NMR
$$ XWIN-NMR		Version 3.5
$$ Mon Sep 12 14:11:07 2005 GMT Daylight Time (UT+1h)  MAYBRIDGE\NMR@NMR_250MHZ
##.OBSERVE FREQUENCY= 250.131544655141
##.OBSERVE NUCLEUS= ^1H
##.ACQUISITION MODE= SIMULTANEOUS (DQD)
##.ACQUISITION SCHEME= undefined
##.AVERAGES= 16
##.DIGITISER RES= 18
##SPECTROMETER/DATA SYSTEM= dpx250
##.PULSE SEQUENCE= zg30
##.SOLVENT NAME= CDCl3
##.SHIFT REFERENCE= (INTERNAL, CDCl3, 0, 16.4605)
##AUDIT TRAIL= $$ (NUMBER, WHEN, WHO, WHERE, WHAT)
$$ ##TITLE= Audit trail, XWIN-NMR		Version 3.5
$$ ##JCAMPDX= 5.01
$$ ##ORIGIN= Bruker BioSpin GmbH
$$ ##OWNER= NMR
$$ C:\u/data/dgb/nmr/ADRS/9190/pdata/1/auditp.txt
$$ ##AUDIT TRAIL=  $$ (NUMBER, WHEN, WHO, WHERE, WHAT)
(   1,<2005-09-12 14:10:41.39 +100>,<MAYBRIDGE\NMR>,<NMR_250MHZ>,
      <created by zg, POWCHK disabled, PULCHK disabled
       configuration hash MD5:
       62 19 C7 07 E1 42 D1 B7 37 6C 3D D0 77 39 F9 E6
       data hash MD5: 64K
       51 37 F0 17 3B 95 9A FA 91 BB 83 DA AD 9C 74 5D>)
(   2,<2005-09-12 14:10:55.21 +100>,<MAYBRIDGE\NMR>,<NMR_250MHZ>,
      <Start of raw data processing
       ef LB = 0.3 FT_mod = 6 PKNL = 1 SI = 32K 
       data hash MD5: 32K
       8D 21 CC 58 18 5A 63 71 CB 33 67 B6 40 FC 78 3F>)
(   3,<2005-09-12 14:10:57.31 +100>,<MAYBRIDGE\NMR>,<NMR_250MHZ>,
      <apk 
       data hash MD5: 32K
       76 7B 99 37 51 54 BD C2 F6 63 1A AD 04 89 9C 0E>)
(   4,<2005-09-12 14:10:58.03 +100>,<MAYBRIDGE\NMR>,<NMR_250MHZ>,
      <abs ABSG = 5 
       data hash MD5: 32K
       F7 A2 BC 48 25 17 B1 1B CF E0 25 45 1F 41 E2 7E>)
$$ ##END=
$$ 
$$ hash MD5
$$ 0A A7 7B 47 8A 30 A4 D3 BD 61 3C FF A0 EE D8 14
##$RELAX= 
##$RELAX= 
##$RELAX= 
##$RELAX= 
##$RELAX= 
##$RELAX= 
##$RELAX= 
$$ Bruker specific parameters
$$ --------------------------
##$DU= <C:\u>
##$EXPNO= 9190
##$NAME= <ADRS>
##$PROCNO= 1
##$TYPE= <nmr>
##$USER= <dgb>
##$AMP= (0..31)
100 100 100 100 100 100 100 100 100 100 100 100 100 100 100 100 100 100 
100 100 100 100 100 100 100 100 100 100 100 100 100 100 
##$AQSEQ= 0
##$AQ_mod= 3
##$AUNM= <au_zg>
##$AUTOPOS= <31 >
##$BF1= 250.13
##$BF2= 250.13
##$BF3= 250.13
##$BF4= 250.13
##$BF5= 500.13
##$BF6= 500.13
##$BF7= 500.13
##$BF8= 500.13
##$BYTORDA= 1
##$CFDGTYP= 0
##$CFRGTYP= 5
##$CHEMSTR= <none>
##$CNST= (0..31)
1 1 145 1 1 1 1 1 1 1 1 1 1 1 1 1 1 1 1 1 1 1 1 1 1 1 1 1 1 1 1 1 
##$CPDPRG= <>
##$CPDPRG1= <>
##$CPDPRG2= <>
##$CPDPRG3= <>
##$CPDPRG4= <mlev>
##$CPDPRG5= <mlev>
##$CPDPRG6= <mlev>
##$CPDPRG7= <mlev>
##$CPDPRG8= <mlev>
##$CPDPRGB= <>
##$CPDPRGT= <>
##$D= (0..31)
0 1 0 0 0 0 0 0 0 0.06 0 0 0 0 0 0 0.0002 0 0 0 0 0 0 0 0 0 0 0 0 0 0 
0 
##$DATE= 1126530640
##$DBL= (0..7)
120 120 120 120 120 120 120 120 
##$DBP= (0..7)
150 150 150 150 150 150 150 150 
##$DBP07= 0
##$DBPNAM0= <>
##$DBPNAM1= <>
$$ [...]
##$SUBNAM7= <"">
##$SUBNAM8= <"">
##$SUBNAM9= <"">
##$SW= 20.6930455092707
##$SWIBOX= (0..15)
0 0 3 0 0 0 0 0 0 0 0 0 0 0 0 0 
##$SW_h= 5175.983436853
##$TD= 65536
##$TD0= 1
##$TE= 296.16
##$TE2= 300
##$TE3= 300
##$TEG= 300
##$TL= (0..7)
0 120 120 120 120 120 120 120 
##$TP= (0..7)
150 150 150 150 150 150 150 150 
##$TP07= 0
##$TPNAME0= <>
##$TPNAME1= <>
##$TPNAME2= <>
##$TPNAME3= <>
##$TPNAME4= <>
##$TPNAME5= <>
##$TPNAME6= <>
##$TPNAME7= <>
##$TPOAL= (0..7)
0.5 0.5 0.5 0.5 0.5 0.5 0.5 0.5 
##$TPOFFS= (0..7)
0 0 0 0 0 0 0 0 
##$TUNHIN= 0
##$TUNHOUT= 0
##$TUNXOUT= 0
##$USERA1= <user>
##$USERA2= <user>
##$USERA3= <user>
##$USERA4= <user>
##$USERA5= <user>
##$V9= 5
##$VALIST= <valist>
##$VCLIST= <CCCCCCCCCCCCCCC>
##$VD= 0
##$VDLIST= <DDDDDDDDDDDDDDD>
##$VPLIST= <PPPPPPPPPPPPPPP>
##$VTLIST= <TTTTTTTTTTTTTTT>
##$WBST= 1024
##$WBSW= 4
##$XGAIN= (0..3)
0 0 0 0 
##$XL= 0
##$YL= 0
##$YMAX_a= 632467
##$YMIN_a= -698090
##$ZGOPTNS= <>
##$ZL1= 120
##$ZL2= 120
##$ZL3= 120
##$ZL4= 120
##$ABSF1= 16.46054
##$ABSF2= -4.232632
##$ABSG= 5
##$ABSL= 3
##$ALPHA= 0
##$AQORDER= 0
##$ASSFAC= 0
##$ASSFACI= 0
##$ASSFACX= 0
##$ASSWID= 0
##$AUNMP= <proc_1d>
##$AZFE= 0.1
##$AZFW= 0.1
##$BCFW= 0
##$BC_mod= 0
##$BYTORDP= 0
##$COROFFS= 0
##$CY= 12.5
##$DATMOD= 1
##$DC= 0
##$DFILT= <>
##$DTYPP= 0
##$F1P= 14.0000005364418
##$F2P= -0.99999901652339
##$FCOR= 0.5
##$FTSIZE= 32768
##$FT_mod= 6
##$GAMMA= 0
##$GB= 0
##$INTBC= 1
##$INTSCL= 1
##$ISEN= 128
##$LB= 0.3
##$LEV0= 0
##$LPBIN= 0
##$MAXI= 10000
##$MC2= 0
##$MEAN= 0
##$ME_mod= 0
##$MI= 0
##$NCOEF= 0
##$NC_proc= -4
##$NLEV= 6
##$NOISF1= 0
##$NOISF2= 0
##$NSP= 0
##$NTH_PI= 0
##$NZP= 0
##$OFFSET= 16.46054
##$PC= 1
##$PHC0= -81.77169
##$PHC1= 4.848239
##$PH_mod= 1
##$PKNL= yes
##$PPARMOD= 0
##$PSCAL= 4
##$PSIGN= 0
##$REVERSE= no
##$SF= 250.130015371375
##$SI= 32768
##$SIGF1= 0
##$SIGF2= 0
##$SINO= 400
##$SIOLD= 32768
##$SREGLST= <1H.CDCl3>
##$SSB= 0
##$STSI= 32768
##$STSR= 0
##$SW_p= 5175.98343685301
##$SYMM= 0
##$S_DEV= 0
##$TDeff= 65536
##$TDoff= 0
##$TI= <Analysis number 999999
Compound Code 99
Book Reference 9
Project Code 9>
##$TILT= no
##$TM1= 0
##$TM2= 0
##$TOPLEV= 0
##$USERP1= <user>
##$USERP2= <user>
##$USERP3= <user>
##$USERP4= <user>
##$USERP5= <user>
##$WDW= 1
##$XDIM= 32768
##$YMAX_p= 417924212
##$YMIN_p= -111681
$$ End of Bruker specific parameters
$$ ---------------------------------
##NTUPLES= NMR SPECTRUM
##VAR_NAME=  FREQUENCY,     SPECTRUM/REAL,   SPECTRUM/IMAG
##SYMBOL=    X,             R,               I
##VAR_TYPE=  INDEPENDENT,   DEPENDENT,       DEPENDENT
##VAR_FORM=  AFFN,          ASDF,            ASDF
##VAR_DIM=   32768,         32768,           32768
##UNITS=     HZ,            ARBITRARY UNITS, ARBITRARY UNITS
##FACTOR=    0.157963299565203, 1,           1
##FIRST=     4117.27531619253, 0,            0
##LAST=      -1058.70812066048, 0,           0
##MIN=       -1058.70812066048, -111681,     0
##MAX=       4117.27531619253, 417924212,    0
$$ Real data points
##PAGE= N=1
##DATA TABLE= (X++(R..R)), XYDATA
$$ [...]
22218 13115 -6806 -41013 -31380 -30474 -12858 -31149 -34248 -42881 -46824 -58527 -60722 -35185 9372
22205 9372 10111 -18350 -40129 -24809 -10896 -34728 -51125 -48131 -24406 -4532 1289 14189 26540
22192 26540 8189 -25170 -7334 17762 13612 3172 5042 28697 41056 32627 13409 5529
22180 5529 28200 24441 947 -16948 -26427 -27000 -22411 -32544 -38168 -53096 -36481 -1430 20140
22167 20140 13169 12428 -2055 -22240 -17444 -25755 -36362 -22797 -2151 -27175 -26438 12058 -7890
22154 -7890 -20756 -20046 -24105 -19537 -26513 -25028 -6145 4995 13230 26208 35095 5332 -22319
22141 -22319 -22572 -11705 3909 6792 -4947 -4273 10260 30074 30156 6375 -28851 -41947 -26462
22128 -26462 -12294 -19524 -15466 -1881 -18670 -23951 57 -8151 9626 3234 1128 13955 6421
22115 6421 -2894 9125 11807 9885 -13207 -26694 -5401 -16118 -15933 -586 -21752 -33429 -20840
22102 -20840 -29218 -48709 -36186 1864 22253 18426 28682 27942 9109 7791 -19080 -63777 -64332
22089 -64332 -30543 -16026 -16145 -39381 -44653 -21006 2746 30799 51443 29001 6519 19264
22077 19264 33561 12431 -12075 -10135 5563 5497 -6822 -8861 18264 36981 13603 10304 8241
22064 8241 24067 27578 8875 -4312 12814 8992 -6367 2264 -27605 -8432 7618 15307 8660
22051 8660 -18173 -5424 13061 24965 11064 -16533 -5386 9326 11368 3244 29261 59883
22039 59883 60249 43651 38753 21766 19813 45693 45149 41354 30782 34206 34284 -718 -14460 6076
22025 6076 21468 34228 47904 47750 60985 78521 43446 18760 14748 37272 4971 -12097
22013 -12097 -4296 13614 37397 22455 607 5238 -24557 -51316 -47772 -42935 -39192 -40252 -31495
22000 -31495 -14804 432 2711 4147 35642 24398 16062 16252 8487 -11118 6120 7289 -10341
21987 -10341 -42257 -34181 -18918 2904 11464 7862 -6937 -30447 -52685 -51602 -37840 -35018 -47313
21974 -47313 -39800 -35595 -52528 -52491 -36280 -41509 -28830 -51167 -24543 -2899 3988 -1269 45
21961 45 -5078 7177 -15339 -17707 -461 -82 -10703 2392 20654 15152 4179 1033 9196 40155
21947 40155 39245 22370 34286 44658 30845 11933 19392 33875 38153 25911 21803 18437 -2571
21934 -2571 -7489 1264 -1054 10889 14288 859 -11865 -8622 -23815 -18159 -34639 -40978 -49692
21921 -49692 -31791 -41082 -48171 -29646 -19580 -6366 8326 10061 -4280 1876 12061 22642
21909 22642 23970 -2397 8569 -14422 -17827 6759 7577 22108 12451 11212 -3931 -12205 -20588
21896 -20588 -17221 7276 -780 -13128 -32855 -63790 -50246 -24985 -18468 -4746 234 -575 15284
21883 15284 34790 25268 -860 16020 25612 4378 -35799 -38002 -22262 -11708 5678 4591
21871 4591 10239 -11097 -28063 -11649 10204 8304 19637 26071 29167 10106 -2616 8786 18176
21858 18176 59915 68390 55276 19986 13214 18926 7753 -16697 -14766 -18260 -17212 -3970 4887
21845 4887 10217 -3230 -28219 -34461 -24350 -33468 -20137 -23746 -28355 -16174 -8618 2 -3086
21832 -3086 12259 30304 35695 48757 51518 44332 31594 12949 -14591 -39008 -23307 7191
21820 7191 31463 49135 33162 19563 14032 -4339 22707 31581 14917 -12852 -3441 7237
21808 7237 9842 -2544 -9903 -19760 -32969 -31021 -10284 -8887 8675 13696 -5994 -18398 -9891
21795 -9891 -11735 -6146 -40196 -34315 -28363 -23220 1187 282 -858 -14635 -10990 -36525 -7374 20163
21781 20163 20476 6263 -1634 23402 14353 4551 7942 10878 3304 5403 10496 12279 21217 7240
21767 7240 -19495 -31300 -32729 -38966 -35983 -28543 -26415 -23681 -18231 14342 14517 -16282 -11142 9439
21753 9439 3627 4765 -25234 -50994 -46235 -35767 8582 29492 29855 54543 43318 18816 6755
21740 6755 -1561 2359 -18586 -19844 9288 21260 23576 -2914 -6031 13236 16499 4424 -6332
21727 -6332 -11366 -11061 -16967 -27987 -22562 -14218 -2160 3778 -9733 -26154 -36897 522 18387
21714 18387 -6594 -6351 -10575 -4996 -8793 -4816 9905 8712 336 -9191 -13100 -21658 -19986 -26362
21700 -26362 -22289 -21464 -38081 -54770 -61301 -53615 -30612 -10583 8494 9464 -1281 10910 5102
21687 5102 -3733 -10089 -13695 9374 10064 5605 16983 450 -6642 -28687 -32995 -24337 -24624 -32878
21673 -32878 -36831 -47104 -48569 -45355 -33023 -31849 -25389 -7358 -7779 -16425 -21122 -29847 -28430 -3721
21659 -3721 32007 18460 -18924 -24741 -8004 18533 32609 18348 -12018 -51490 -46676 -23096
21647 -23096 -30771 -52459 -37516 -349 14825 6058 -10485 24089 21382 1203 1315 -4910 18339
21634 18339 19752 8226 25643 19326 490 4757 19141 23939 10220 26611 20777 3387 -10886
21621 -10886 -13119 -2646 -17548 -14552 -4508 -26307 -37913 -16612 -30981 -60362 -77502 -64275
21609 -64275 -49714 -38961 -27915 -43945 -24258 -25818 -29078 -29371 -36903 -22864 -21813 -21940 -21361 -33925
21595 -33925 -35759 -28307 -21864 -31547 -34111 -34562 -18642 -5366 11552 11326 7546 27447 17719 -4776
21581 -4776 15932 36733 23657 39522 24033 6826 5371 -5954 -10749 -27693 -34908 -13509
21569 -13509 19747 27117 -8337 3874 2010 17517 34868 -3412 -11128 -2835 9080 7346 32326
21556 32326 45981 37695 13254 -31447 -53431 -64288 -54721 -30775 -23965 -8880 14396 4982
21544 4982 -26465 -16847 -6015 -10801 -3834 26055 10322 -13248 -12068 -9201 12753 43354 84393
21531 84393 98918 93937 88934 58402 30587 21953 9760 39342 47994 30950 20094 -3248
21519 -3248 -587 13095 21810 5112 -12967 -24435 -37597 -24514 -27118 -25904 -8804 955 -2039
21506 -2039 -11467 -8590 -20522 -46988 -44804 -17036 -28830 -14830 4431 -15375 -8259 6865 -778
21493 -778 -11243 -2943 14068 28991 16719 6883 12510 25271 8263 1546 7915 11113 3095
21480 3095 -7092 -15722 -9902 -20321 -30099 -22372 -13057 1933 -6318 -9583 -12081 -41997 -50625 -60295
21466 -60295 -51731 -46849 -33230 -21310 -17755 -30989 -16405 2046 2874 -28687 -37237 -27683 -25416
21453 -25416 -45874 -34268 -18007 -27126 -18511 -17 -18524 -19355 -7132 -8624 14886 30222 38323
21440 38323 34918 10237 2696 32371 10364 3385 -21638 -37169 -29162 -25277 -34709 -22584 -16600
21427 -16600 1824 659 -13077 7295 32283 22401 15367 14165 30965 18364 -3297 644 -2918
21414 -2918 -19226 -8716 5347 12342 -1971 -28332 -30240 -37748 -39915 -20766 18528 29260 16088
21401 16088 20577 17917 664 -7607 -14951 -13383 -9657 10086 44230 22121 16321 9792 -13997
21388 -13997 -19842 -28267 -33890 -15944 16245 29185 20255 43009 33916 9931 864 21256 22740
21375 22740 6787 2635 16470 19099 14243 -2995 -5458 27699 52184 65480 56912 26814 30408
21362 30408 33520 41212 55253 43580 32744 45320 50721 27252 21985 24246 14757 21698 11421
21349 11421 7281 -16470 -30611 -28786 -14232 -8821 12426 11766 -12896 -18533 -11454 5726 24889
21336 24889 5275 -26429 -5098 8524 17678 6105 -28234 -20955 2063 2713 -28075 -20039 -27403
21323 -27403 -25983 4019 1425 1633 16817 695 -24517 -35072 -43592 -26687 3178 -4264 6647
21310 6647 17390 20963 10780 -18457 -23151 -16177 -12424 -6453 -26027 -36563 -36901 -26436 -13708
21297 -13708 -18515 -17324 -16249 11221 18080 9152 24554 1840 -2861 30327 34046 32454 5286
21284 5286 -26763 -44742 -34958 -18781 -735 11553 -16129 -22655 -13499 -15125 -5082 13645 6072
21271 6072 -12050 -1445 20979 37833 44741 42628 11427 3168 -17886 -3308 20428 3061
21259 3061 -13993 -25223 -11926 -17187 -26514 -20901 -1240 -10299 -35368 -50321 -45660 -24710 -13439
21246 -13439 -2553 8681 -25060 -5865 14237 -4233 -15749 6934 32664 4947 -12709 -13138
21234 -13138 -2365 3457 -19204 -8556 18910 24236 -15837 -15459 -18204 -56230 -65606 -55743 -65007
21221 -65007 -60239 -33548 -3112 -8225 -21956 -12214 -38714 -35611 9342 27498 37323 35059 5645
21208 5645 -20450 -27416 -34854 -46828 -66910 -55237 -32006 -28304 -33864 -44867 -53238 -70352 -60401
21195 -60401 -48540 -54853 -31857 -24867 -33820 -47309 -24942 -10431 4957 15784 31171 27488
21183 27488 25290 4798 -20263 -59671 -48032 -25275 -30425 -46699 -22921 1875 -3594 -15379
21171 -15379 -7026 -211 25430 6522 -10788 3186 9273 -16251 -11959 1598 -1881 -26381 -38231
21158 -38231 -39737 -30782 -21783 -23918 -34359 -24230 -21439 -24895 -10924 8932 6320 12908 -11294
21145 -11294 -31787 -57140 -44074 -12771 22445 12956 -17362 -26684 -10147 13928 14374 -3392
21133 -3392 -1361 14357 13010 -16167 -9521 13309 7138 -137 -1327 -5230 -24130 -9573 -13409
21120 -13409 -22529 -1793 -5174 -9749 -12967 -17442 -21095 -28704 -35317 -36846 -31637 -17171 -8694 -25660
21106 -25660 -18541 -18057 -6681 -15232 -23406 -26784 -45484 -54729 -42757 -14587 7511 10457 -6578
21093 -6578 -18746 -32203 -40709 -38728 -40058 -26714 -16798 -4256 -9655 5541 -22731 -24189 -23984
21080 -23984 -15423 -44782 -73393 -73991 -49996 -2945 28645 28142 25230 29801 5232 -8338 -41891
21067 -41891 -56452 -62179 -44361 -49287 -54169 -34331 -15069 3071 -2373 -13254 -22587 -4371 10734
21054 10734 -23955 -41806 -47174 -36801 -4809 10610 11897 9588 -19493 -28127 -34597 -55019 -67696
21041 -67696 -77722 -43566 -5408 -12024 -6364 -15128 -40139 -50899 -24671 -28023 -55044 -45618 -11523
21028 -11523 8667 -32154 -51493 -50529 -43117 -17283 779 1054 5693 -11892 -20315 -7704 -14018
21015 -14018 -5898 -2288 -22797 -14514 1928 -1245 16903 21480 -2667 321 -17459 -2032 9876
21002 9876 24662 52263 47464 21429 17140 -21326 -51967 -14757 -15369 -18014 -16556 -2861 -5861
20989 -5861 -39898 -48690 -48799 -19934 1776 -8428 8354 4545 14513 34312 14694 -13886 -40155
20976 -40155 -40805 -20295 -6368 -2733 -4340 -10700 -28712 -39446 -25376 -6689 -11810 -21784 -34358
20963 -34358 -33344 -40181 -36273 -38605 -41042 -37604 -18086 -9862 -49487 -65028 -47984 -20767 -28993
20950 -28993 -7631 21794 20471 12747 18867 24305 34087 35122 5914 -42992 -50938 -40977 -14796
20937 -14796 -23487 -3981 -16952 -36275 -34389 -21365 10653 16041 28263 20998 26754 20845 18466
20924 18466 21134 1226 -16155 -40760 -40525 -36992 -37443 -26840 -14554 -37110 -53396 -45825 -23235
20911 -23235 -15292 -3803 9338 18188 -4605 -7423 1576 -4238 -12046 -7464 -6689 -3412 -12480 -25300
20897 -25300 -14712 -28177 -18538 -10785 -2397 53683 52333 25721 21779 16450 30346 30821 -2001
20884 -2001 -714 -6191 -15779 -33842 -36634 -23237 -32078 -18521 11449 27014 24121 -5810 -36252
20871 -36252 -39589 -34126 -27948 -33513 -33984 -40404 -6198 27920 38157 4115 -18777 -23220 -27470
20858 -27470 -8017 2528 14001 22109 39607 44464 9776 -17582 3900 -5267 -9442 -15972 20258
20845 20258 29898 11756 9488 -18033 -30170 -30636 -32414 10305 35405 1492 -15817 -16473 728
20832 728 1153 -6430 -12937 -12594 -23750 -24522 -38021 -35588 -19460 -9249 3985 4806 -3004 -15628
20818 -15628 20467 18425 10287 -17552 -45997 -46886 -21805 -27047 -33121 -27047 -39418 -38263 -32406
20805 -32406 -19377 24631 40321 1496 10506 16765 26465 25638 -5453 -23074 17301 43892 41943
20792 41943 28107 34726 31163 31844 42606 15136 -3667 9164 -5578 -11320 15993 2486 -14343
20779 -14343 -22717 -6799 28739 -7620 -11447 -1493 496 -9445 -33415 -31842 -17226 -12389 -22678
20766 -22678 -14866 -43276 -63754 -43053 -5825 -3153 -7590 -7072 -21336 -52350 -55119 -19471 9422
20753 9422 252 6397 -5260 -10437 -2040 -10562 -15939 -19836 -4665 -6904 -9346 -6356 15538 42230
20739 42230 34745 1123 -19837 -28275 -37039 -22211 -5228 -1629 -4962 -7241 -758 -2053 -4033
20726 -4033 -8021 5478 31461 29246 -1081 4114 7458 -1113 -839 -5023 14418 -20640 -46580
20713 -46580 -24033 -2506 -16952 -46796 -32678 -24215 -15338 -11539 13700 -6595 -9119 3428
20701 3428 10908 25960 27238 25309 -3189 -15457 -8228 4156 9480 34603 32070 14910 10593
20688 10593 -1812 -19607 -7876 -2242 10065 5757 19161 46112 32594 23447 2499 -21263
20676 -21263 -3465 -2137 -6501 5069 -17210 -35570 -15963 6173 23923 38065 36106 -12268
20664 -12268 -43037 -27123 -12529 -24026 -29305 -10181 5418 -1211 -5594 7566 8069 542 -21456
20651 -21456 -33066 -22298 -14123 -32068 -46449 -39196 -33376 -19374 -32118 -44271 -15759 -12874
20639 -12874 -5469 2178 25147 19538 -23186 -35980 -23292 -2194 -148 -23360 -27265 -27032 -5402
20626 -5402 14818 12862 2802 8393 31229 16398 731 12022 5392 -142 -1472 12784 41373
20613 41373 33180 -3063 -12194 -6156 -8635 23839 54250 48889 28984 18191 16937 13274 -7604
20600 -7604 -19964 -37813 -15168 -18316 -15842 21724 26668 21518 25464 9011 -9895 -15847 16068
20587 16068 12974 500 -4644 -9421 14360 -324 -16628 -25852 -5796 18970 43369 25805
20575 25805 29674 37970 9686 -11666 -24371 -39577 -18569 16533 39864 34937 5114 -18047
20563 -18047 -12078 -13810 -22206 -3760 15174 2989 -10034 -4580 -2483 -26112 -26613 6757 7228
20550 7228 -17534 -4358 -7959 -8861 -4838 -38676 -22530 15820 37885 41690 10721 -15174 582
20537 582 3625 -11402 -10603 -43483 -62806 -45173 -34703 -55184 -44216 -6958 3685 7897 4030
20524 4030 -10377 -1999 12424 13240 26861 10162 -17234 -39320 -15681 31114 36402 7785 25270
20511 25270 39491 42686 -1504 -22136 -21678 -29711 -24843 -10877 -10421 -20516 -13701 -11341 -21899
20498 -21899 -30283 -44657 -48902 -34295 -12983 4730 -13582 -41935 -44506 -42868 -28084 -9302
20486 -9302 -985 3853 13248 12346 -819 -15704 3277 45301 54358 44988 18994 -22060 -38781
20473 -38781 -20513 12516 21660 2526 -18076 -9156 4215 4411 17416 -13436 -30664 1117
20461 1117 4989 -12442 -6761 5234 17926 22548 18521 6715 20156 17594 -6919 -10932 10845
20448 10845 7524 -5821 -16229 -17751 -21133 1426 34827 12253 -26105 -50636 -31344 -20821
20436 -20821 -22949 7144 14459 -6453 -3985 22077 33695 24395 41644 49499 62153 50721 42558
20423 42558 45051 22462 1227 -5702 -22376 -51215 -44777 -8982 8184 -21004 -20514 -10757 -11642
20410 -11642 -11141 -14812 -11701 -22313 -18332 -3086 2316 -10127 21997 44644 34662 29364 30852
20397 30852 22331 -5758 -4648 -1934 -5863 -38257 -34627 -34029 -46347 -39724 -13708 -4478 8742
20384 8742 -2996 -36763 -23204 -29038 -16567 -26855 -40748 -26078 -25498 -15818 -19747 -3427 -13906
20371 -13906 -23186 -19192 -12785 -25447 -27289 -12604 -14286 -10424 -11292 -19256 -20495 7214 38525 39982
20357 39982 27154 1217 31665 36616 20118 18075 3775 -10296 -23423 -17837 -32209 -39631
20345 -39631 -45447 -40705 -44869 -38358 -36713 -38146 -61884 -70699 -56571 -27670 -23556 -7113 -21088
20332 -21088 -3895 3128 -24175 -15920 -18421 -15772 5150 -6880 -7804 3325 25192 37608 21085
20319 21085 -3023 9416 8166 1450 3590 -626 -19447 -21524 -8946 15605 15556 3160 9991
20306 9991 6581 -9172 6645 9840 8996 -2328 -19230 -45167 -57115 -40072 -23551 -15005 3705
20293 3705 17828 4433 13575 6025 -13129 7031 15253 19097 18982 10493 25114 22875 -11085
20280 -11085 -36386 -34244 -41155 -35092 -26764 -36293 -17906 2683 2980 16794 5929 -5935 -8828
20267 -8828 -20767 -19335 -35782 -32630 -50118 -43675 -27911 -31671 -33023 -23361 -23187 -21533 -24616 -19456
20253 -19456 -11533 -29650 -15973 -13112 -23987 -13579 -2310 -1070 23498 19276 9229 -21924
20241 -21924 -32834 -27964 -19648 -18674 -31160 -13325 2176 23693 28621 26675 5325 -15640 -9431
20228 -9431 -17843 -15208 1974 -7578 -33534 -27987 -13000 -10005 -17482 -14164 736 11439 -1605
20215 -1605 2009 5809 18054 7017 3615 9617 8689 -9873 -17306 -21218 7414 1554 -3409 -7005
20201 -7005 6584 19854 5294 -16188 -27126 -26687 3572 18894 29362 22699 -25396 -32690 -23293
20188 -23293 -25993 -1300 7708 17217 -10501 -43064 -39025 -33487 -38407 -13152 -5555 4864 5276
20175 5276 13198 6657 12861 7749 6028 -118 7091 24417 36369 7132 10239 11123 -22761 -17187
20161 -17187 -9976 -2473 2974 20618 -1703 -11944 -3764 12615 19904 14876 8405 -4560 -6657
20148 -6657 18496 20609 13571 -21923 -31653 -15492 -11550 -31769 -17900 -23056 -23032 4686 9949 -687
20134 -687 7090 3370 21604 34071 45476 22617 21617 8119 -14060 824 15467 12559 6365
20121 6365 -6343 -19098 -6603 -7161 -3090 1355 55659 49285 12084 26599 39980 14427 -10234
20108 -10234 2667 -6849 15061 37831 46280 48707 13545 4927 14895 13728 478 3734 32219
20095 32219 13049 7005 16954 10726 -6119 15305 18670 25947 16970 18321 14239 5576 -5715
20082 -5715 4457 -263 -8487 -31695 -35265 -36722 -8936 15094 21595 16765 11515 15557 41255
20069 41255 50369 37392 24542 2783 2911 21498 10092 11279 -15993 -16322 -12077 11810 51006
20056 51006 42251 23454 25193 3289 15281 18349 37683 29765 6274 12815 16406 19781 15371
20043 15371 -670 -1203 7335 32570 4987 -16602 -12196 -21744 -9879 -2573 23894 39963 28916
20030 28916 21036 29636 36541 32513 31399 50635 58861 36792 29366 40078 38019 33857 44952
20017 44952 32259 7802 8305 30554 34926 40874 16283 23403 23125 12634 -7223 1981 4441
20004 4441 15840 44969 43545 42251 45801 86234 89755 57949 30936 -305 6384 24522 2487
19991 2487 -11530 -6722 10723 29654 37569 29710 23186 1505 -7149 -3367 8494 14828 24828
19978 24828 9054 -25445 -48568 -39018 -16607 -18579 -46484 -65092 -36355 -33233 -25697 -358
19966 -358 13711 26412 17070 392 -2021 -5837 12186 17840 20705 6766 -7603 -1561 120
19953 120 -5212 -15351 6457 29988 32840 30519 18170 19756 46188 29433 37372 53244 54502
19940 54502 28659 12814 19969 21436 -684 18928 39362 31216 19333 20393 24660 28016 12002
19927 12002 9673 10541 19029 21988 20970 14623 17442 -29 -19397 1719 41285 29431 21399
19914 21399 40595 45394 24073 -10664 4289 37775 43449 55872 68899 27295 32031 49815
19902 49815 48038 56195 50980 36220 20178 -6802 -2739 -708 20998 22501 29383 25734 2506
19889 2506 -18536 -9301 25821 53639 40090 8638 4659 -14913 -14992 -8380 -11688 -24621 -28097
19876 -28097 -11429 3856 8196 11197 -5486 -3583 34504 49705 40336 27376 33309 71588 61359
19863 61359 35156 34989 39257 60646 38129 2864 -11477 -2273 -3085 17483 21141 15434 40383
19850 40383 31432 -4664 -10888 -12332 -26798 -2856 15012 30185 25646 17994 -3163 -2710 14233
19837 14233 46426 54799 50956 41637 32529 37089 50598 53024 28421 9779 33607 51226 60407
19824 60407 71665 53063 35627 42755 68428 58904 58243 46400 27811 39728 52021 49977 57181
19811 57181 57415 25250 8006 19668 22812 8074 -6744 -9039 23114 15644 22807 49664 46495
19798 46495 16946 21597 36191 38761 41670 37271 46858 24977 -2724 -2124 -32727 -18641 33824
19785 33824 51073 37822 39109 41139 52195 45792 28361 6335 17451 25554 31156 43514 12647
19772 12647 16010 -2910 -13663 -16832 -2150 14002 28739 -9484 -20269 10431 15802 19859
19760 19859 29993 15049 20204 50894 63119 63834 51979 38982 36888 44547 61518 56736 58729
19747 58729 18952 15813 -3962 -7775 -12367 -6384 19891 6229 -4811 -8327 9372 4212 -27486
19734 -27486 -52993 -50581 -14022 11113 29899 46232 36600 27064 41926 41646 28381 15846 27661
19721 27661 16341 22513 17787 17159 33907 35839 35447 40855 30842 8309 13481 30874 27327 15493
19707 15493 37526 41689 14661 8402 26935 18278 14866 28482 36726 37161 33703 11559 17903
19694 17903 35480 63108 62357 39244 22351 16270 4851 17010 49584 59577 79657 87109 72700
19681 72700 38021 23882 9903 20498 10236 4942 6787 -3159 2441 30738 54697 58786 57704
19668 57704 36109 11182 29321 46834 21537 13675 21253 13257 -631 9667 26557 27677
19656 27677 24310 42193 39265 34672 17864 -13337 831 35688 36147 50771 46731 47130 34234
19643 34234 15185 35585 51567 58974 73565 86674 51351 27252 27574 43265 28278 6917
19631 6917 6488 35170 45936 46391 16166 3477 17476 24113 23386 13517 5733 -20646 -83 18176
19617 18176 18810 21353 30474 37583 29922 11527 8350 16074 22683 11677 17294 10878 15784 33914
19603 33914 35410 47146 75134 54066 30968 42188 48829 38384 45000 56541 33581 49023
19591 49023 46137 45294 30368 27023 23986 11412 25879 9924 21891 52020 57130 37683 24619
19578 24619 3437 8100 22136 18812 34931 39681 41561 49441 58003 75376 90277 54991 34983
19565 34983 42592 59931 49271 63232 88918 85959 87633 62966 26109 74918 104867 114394
19553 114394 141905 174947 208901 226359 245147 252588 240630 250149 283976 273163 265468 309589
19541 309589 366185 401061 430360 450024 479150 468698 416823 383659 358969 344738 319757
19530 319757 315450 326908 327596 313533 282456 279651 267856 236583 184207 141834 135865 138651 111471
19517 111471 75472 54702 83419 103959 110827 87053 59151 64305 72387 68566 92700 100495
19505 100495 108543 81969 42455 59056 86956 118520 141969 135473 142077 173451 195491 210994
19493 210994 206776 189707 150643 169297 232053 294455 309265 314046 301109 272319 253507 210840
19481 210840 180766 158344 161636 146990 125434 117681 113130 102448 80936 54024 38869 35520
19469 35520 39645 30664 53955 56951 55021 50864 49154 44480 41076 49221 52679 23141 19940 17714
19455 17714 37805 61697 57443 50727 77512 117834 169980 226557 280616 295485 265439 249836
19443 249836 225353 229645 244114 297783 356846 385002 404939 365899 319069 267158 225509 201204
19431 201204 186708 203663 234442 255518 221777 177602 152150 135773 132369 119865 102865 111233
19419 111233 113169 109233 108316 112219 97880 79143 92465 97319 99097 117755 114044 132855 130685
19406 130685 118146 135927 144507 106281 59098 33039 41446 48188 29508 61852 92667 65985
19394 65985 61157 63857 28990 34279 54255 78893 63620 62999 55977 51923 38106 18665 40112
19381 40112 56737 29957 42917 82172 71931 44529 79194 88592 52039 58390 84953 90493
19369 90493 74080 49921 77099 94219 92921 78956 96649 124900 125806 121956 103663 113751
19357 113751 89764 85882 95725 97506 114865 134110 130862 112590 81241 78039 46163 38819 39620
19344 39620 43422 48223 49999 72498 61959 75767 82628 79671 83619 80737 70379 50805 40765
19331 40765 39888 21872 24724 42661 36056 33255 45631 48894 51483 67849 95952 114500 92969
19318 92969 83974 72967 66523 100338 107571 76524 75145 92571 90337 96721 109004 97188 98523
19305 98523 97282 75829 51824 34435 57956 55877 47492 62025 55653 63558 61212 53326 66374
19292 66374 68728 77414 105197 114978 127442 91501 64870 70040 64296 65861 69656 62531 83670
19279 83670 71031 37759 46276 48024 49582 61270 93886 101046 113117 104431 97515 92043 94056
19266 94056 136594 184333 201707 224130 272578 322841 349464 364330 390244 433832 476800 486984
19254 486984 511722 558199 589333 642626 676172 702971 726484 730090 743870 754189 727504 705979
19242 705979 668327 639072 631195 623437 608651 561701 540437 495039 447554 412008 402645 392737
19230 392737 333332 272160 230116 179307 170895 183755 193378 165319 132022 127780 151703 153050
19218 153050 127185 125461 107175 109380 132934 131661 133057 145615 153108 160650 164717 143307 129650
19205 129650 169334 222993 257811 307886 327784 329390 323713 308377 319090 307091 265924 210826
19193 210826 201483 236477 254541 262768 270777 285166 304076 301273 289720 278019 249035 215428
19181 215428 176549 141697 101183 100884 103531 119827 114682 120078 137606 139253 144765 120158 96736
19168 96736 106268 121600 162071 206111 225096 226783 223218 216274 208309 214715 231930 278074 299859
19155 299859 324134 359891 357103 329057 308805 289401 269790 250693 249672 271733 270289 248310
19143 248310 210474 161668 133174 136286 143403 125299 141043 138739 152446 166588 143778 149497
19131 149497 170603 199834 216372 243026 254959 260753 276780 318557 356385 386903 409800 404230
19119 404230 430726 489265 537750 591588 649535 715033 758831 730006 689426 686255 724308 775274
19107 775274 822126 831906 848757 865005 805965 740324 702871 680178 675637 668292 656240 649083
19095 649083 657663 680476 660436 631723 639614 618645 592252 574666 560789 524261 496575 461566
19083 461566 485265 489928 484596 490038 480708 446995 439186 459667 503569 535236 543304 545507 544432
19070 544432 551732 574715 569601 580296 601306 613173 651166 704989 733063 709290 686248 660060
19058 660060 632688 651554 663816 683508 719865 734574 716912 712335 698692 661096 625980 606125
19046 606125 587256 581927 599403 617861 619934 622419 618720 594314 547741 529916 514108 517433
19034 517433 510954 483023 456811 423141 392633 366733 349760 345298 296382 233241 181416 156988
19022 156988 175653 173443 167073 166113 162051 161528 175807 184785 179470 159131 165629 169017 168767 186976
19008 186976 200268 214514 205321 188817 192919 178152 220171 241455 240385 236153 256368 276062
18996 276062 264425 279149 249660 240923 221876 234175 258101 269077 245912 241146 231276 236101
18984 236101 249728 257400 247973 260671 247279 251894 254417 256556 242776 203332 201135 217596 209305
18971 209305 200824 208988 208941 201650 198357 227390 256845 256920 232200 242356 246266 267254 288591 261296
18957 261296 246625 239571 245627 266821 262548 286132 292300 304096 289132 277271 267977 278748
18945 278748 283639 272425 273622 303648 317072 323381 316049 323069 323630 317384 323502 336654 319008
18932 319008 318903 336829 351835 354033 343636 342628 335226 329922 331208 316589 328122 344429 381851
18919 381851 401587 410370 431853 459160 470971 462995 462526 410279 368207 359014 348116 301916
18907 301916 285731 301484 327552 348429 353019 358309 342803 337613 340223 356664 375408 371705
18895 371705 365407 374734 380806 406167 426221 430002 442931 450276 475855 516316 509172 489993 484454
18882 484454 484899 488470 489975 496368 531177 557729 581576 613345 671458 713608 744493 772609
18870 772609 857893 979166 1083550 1190757 1216979 1203043 1161716 1117790 1022101 902682 822908
18859 822908 753395 677944 588518 517426 480574 439484 392091 381077 392645 385912 394644 416171
18847 416171 411508 404506 381340 378211 379305 407843 445740 454187 487399 549949 621800 690985
18835 690985 702202 693715 711700 731350 708974 704762 667963 632962 646094 691456 703814 745144
18823 745144 784896 810214 873440 969918 1068420 1135992 1166217 1185728 1189115 1187648 1195297 1183201
18811 1183201 1153970 1109760 1104132 1095085 1058423 1031258 1016268 1011226 1006137 981348 973502 963137
18799 963137 911936 898352 911908 912001 945372 962897 1014800 1100918 1189793 1288394 1396809 1485886
18787 1485886 1561609 1608601 1664939 1686112 1705967 1728020 1754686 1806540 1829946 1868074 1908729
18776 1908729 1945133 1988813 2043033 2125231 2235475 2365194 2539898 2703257 2913669 3193321
18766 3193321 3461665 3690953 3926035 4166104 4447174 4777308 5135919 5555690 6080142
18757 6080142 6727769 7510372 8448091 9607052 11107244 13091584 15790007 19406729 23858157
18748 23858157 28719888 34012270 40389688 47807650 54457385 59246816 63775864 69312045
18740 69312045 75119081 80241746 85202640 90358208 96615607 105195159 114771976 120974523
18732 120974523 123088540 124854548 127061382 126464563 121713894 115372472 109118712 103998399
18724 103998399 100525697 97700306 93185230 87658692 83363395 79588379 73739792 65709379
18716 65709379 57309053 49428773 42038882 35054778 28821245 23570467 19352477 16122460
18708 16122460 13668030 11786112 10293362 9102307 8122327 7358513 6711495 6109199 5584240
18699 5584240 5149725 4739133 4391722 4091376 3818587 3549439 3292527 3078723 2893382
18690 2893382 2723709 2571965 2428144 2326190 2186008 2080045 1997507 1914891 1853850 1818873
18680 1818873 1799252 1732294 1699338 1704721 1678822 1660217 1631945 1612991 1568497 1571891 1577591 1590238
18668 1590238 1603271 1628725 1641441 1639184 1646180 1668688 1676307 1656934 1648323 1651263 1648520 1650668 1667680
18655 1667680 1695644 1743909 1790813 1832416 1891998 1923164 1956082 1991504 2038708 2136845 2246174
18644 2246174 2339338 2415127 2494172 2625943 2753024 2882922 3056583 3257757 3472069 3718047
18634 3718047 3997994 4286920 4655974 5147383 5731534 6498862 7553474 8999542 11037420
18625 11037420 13797152 17102546 20373095 23553578 27160462 31116377 34142568 35785945
18617 35785945 37428919 39903982 42859213 45532779 48256722 51565544 55143681 57513734
18609 57513734 58082261 57138866 54930163 52261879 49556861 46813140 43802946 41145154
18601 41145154 39715938 39189499 37915427 35328931 32443416 29782643 27078452 24169179
18593 24169179 21431649 19194987 17614445 16791659 16688337 17290216 18750888 21276360
18585 21276360 24950478 29504330 34476123 39684456 44251988 47211599 49443768 52025361
18577 52025361 55686589 61105754 68101597 76524065 86373615 95494582 100952036 102811670
18569 102811670 102917237 102821620 102903370 103640643 106346796 111185806 116482336 119335167 118309845
18560 118309845 113894542 107388896 99750566 92088127 84975436 78489942 73799029 71626799
18552 71626799 70311193 66948605 61790861 56429817 51085700 45338608 39396079 33918081
18544 33918081 29410251 26148202 24081315 23102721 23165940 24362731 26898885 31144482
18536 31144482 37494995 45621296 54478416 63554472 71483219 75402019 75660644 74222669
18528 74222669 72088025 71098696 72821146 77359855 83900269 90780199 95753084 96506910
18520 96506910 92256314 84786789 75626264 66439672 58852954 53279501 49613041 47316516
18512 47316516 44674908 40826880 36372776 31415360 26256574 21576257 17653407 14574405
18504 14574405 12210529 10460184 9155927 8164679 7361403 6688938 6134301 5617671 5149793
18495 5149793 4742834 4390639 4114460 3863620 3625958 3423496 3220541 3031325 2873882
18486 2873882 2698438 2549347 2417072 2285724 2181291 2080618 2006252 1945857 1881876 1822286
18476 1822286 1783391 1742952 1691125 1641594 1580411 1523295 1442974 1359112 1314601 1293989 1253117
18465 1253117 1233712 1208200 1191063 1183781 1193607 1210735 1220604 1225126 1239888 1274077 1320606 1388446
18453 1388446 1445121 1507360 1551480 1583166 1607932 1593877 1564346 1524042 1484804 1456644 1432132
18442 1432132 1391918 1373505 1389677 1397170 1407770 1414164 1447286 1482696 1497125 1493693 1533622 1557053
18430 1557053 1609524 1658438 1698794 1749456 1859301 2003982 2145829 2291749 2410621 2530941
18420 2530941 2677348 2863282 3061517 3209345 3344031 3456711 3557928 3686053 3834358
18411 3834358 4003168 4210476 4493335 4894892 5412553 6086386 6961286 8097985 9640007
18402 9640007 11728837 14553612 18492303 24067340 32026538 43162861 57309375 72496799
18394 72496799 85358151 93667724 98102383 99042240 95235254 85822751 72775936 58871587
18386 58871587 46370732 36248254 28500154 22781310 18668799 15717196 13425787 11512748
18378 11512748 9946634 8733630 7841939 7194879 6746205 6481016 6338036 6233245 6157364
18369 6157364 6119040 6114730 6114892 6118295 6139578 6205680 6302376 6423227 6571728 6809579 7168110
18358 7168110 7717859 8554000 9695942 11296852 13492038 16484237 20704778 26704212
18350 26704212 35256541 47136250 62293237 79333420 95289557 107676150 115259574
18343 115259574 117888405 115065623 106393832 92675050 76343802 60332748 46542396
18336 46542396 35634578 27471033 21530659 17228746 14064516 11691076 9900216 8534658
18328 8534658 7483291 6674817 6044481 5586539 5274085 5059249 4918167 4846873 4801053 4737383
18318 4737383 4670660 4627341 4541766 4398973 4289156 4185952 4140857 4173631 4263178 4462403
18308 4462403 4784267 5229081 5843663 6681918 7813034 9405327 11674670 14989410 19640811
18299 19640811 25539858 31858580 37092954 40420541 42081359 42133308 40018555 35564921
18291 35564921 29741726 23670561 18306045 14027027 10770363 8385537 6674966 5447256
18283 5447256 4520017 3841633 3335812 2919390 2561867 2321789 2152075 2036691 1974034 1937250
18273 1937250 1906405 1853630 1858729 1863206 1829224 1768752 1703548 1619798 1543338 1432033 1330878
18262 1330878 1241872 1109317 1006584 939338 877469 806483 782414 773098 741404 709201 695427
18251 695427 696148 728075 726823 705052 684199 698956 687742 666958 652987 622481 593572 563831
18239 563831 548046 548310 529608 517022 512837 488273 456900 417885 384131 405250 436146 465514
18227 465514 505594 539204 555131 607815 668053 732662 792898 825621 867751 889266 929931
18216 929931 965878 970823 952426 964403 993216 1018373 1039368 1038841 1040553 1014381 968801 954013
18204 954013 903591 860154 810814 747325 687144 663044 627110 567146 529291 487197 436291
18193 436291 356376 287832 202284 170662 152047 132603 109055 100031 83488 107382 140209 148703
18181 148703 154238 185110 212474 211751 203978 177165 175767 208241 230949 222593 228705 226381 243450
18168 243450 258690 243371 230027 257918 280593 281351 267579 301420 302738 302122 312394 320120 318701
18155 318701 315612 285852 242917 233331 218390 194603 203437 215690 194565 199301 212618 242282
18143 242282 240700 216970 202533 207914 184078 211077 259691 305332 301492 307952 327573 364284
18131 364284 412662 464116 486207 549724 665640 772551 896816 996814 1121854 1264479
18121 1264479 1391647 1575027 1812575 2067952 2382373 2870585 3516882 4460643 5810005
18112 5810005 7812547 11011967 16353884 25138853 36839938 43187840 38841308 31028956
18104 31028956 23233640 16815819 12292522 9106531 6860094 5361221 4283247 3536026
18096 3536026 2999440 2604785 2284515 2017386 1780460 1585902 1468190 1360583 1262293 1174758
18086 1174758 1095199 1032346 987051 924697 845583 754295 694153 621019 539511 513091 475828
18075 475828 427488 356128 318329 267225 253218 272169 277107 271089 260913 250178 234253 233142
18063 233142 242659 244622 247605 233006 223238 232020 257776 309713 374255 395148 434032 471994
18051 471994 501165 524749 536302 600234 622760 664592 691522 712150 705497 706348 728557 735414
18039 735414 731327 750175 738193 688583 636671 608474 577083 539337 482075 473888 466627 432061
18027 432061 377317 357006 314465 250506 205394 169326 131562 128218 134145 117252 87424 76579
18015 76579 78678 96775 99625 74532 49500 53793 45505 38536 60488 88669 113620 137367 145718
18002 145718 168299 204815 231951 222841 243962 255872 263034 265087 271945 299648 310862 312252
17990 312252 327529 351874 345979 315184 306287 275974 283545 268963 259782 272742 266916 246662
17978 246662 198797 165600 153775 118642 87675 59602 79876 79283 66235 43237 38867 38894 32760
17965 32760 32456 -19071 -53189 -63785 -68781 -89808 -81551 -27743 2738 6054 25192 1660 1076
17952 1076 -4197 -18604 -19926 -36057 -60153 -67564 -71138 -90261 -49988 -11159 -5710 9686 35279
17939 35279 44950 47431 89034 49733 -14358 3586 21131 11719 17321 15011 33401 52241 33191
17926 33191 36614 51853 59227 28502 31123 44970 58131 62476 56985 55646 27401 21400 7327
17913 7327 1656 10892 29700 25388 -14746 -28621 -14139 -21110 -45182 -26100 -12186 12511 26731
17900 26731 45263 25215 -22419 -52770 -3380 47917 37202 27874 47232 73212 70135 73860
17888 73860 56325 61132 78910 102811 106594 123987 169266 217282 249761 309455 334062 361047
17876 361047 361285 352594 358275 318125 248792 193873 138404 110669 88352 75999 51741 49487
17864 49487 63136 42984 7104 807 -1878 9209 33588 34428 22754 10968 30864 41923
17852 41923 50076 78795 84282 59998 60066 74907 88431 75160 59319 44324 47439 54690 48948
17839 48948 70366 118679 143476 172372 209159 244068 286521 386062 489147 569087 641927
17828 641927 693027 684834 652701 600836 487567 367704 292954 221529 162113 145880 109755
17817 109755 57129 47183 41772 40360 31804 -710 -15597 -15374 -4168 -3488 -4584 11761 50639
17804 50639 30547 6718 -5107 3674 -1055 -29366 -13229 -16126 -37958 -37823 -1264 -2510 -34885
17791 -34885 -19954 174 18247 15429 -10184 -6316 36491 86960 120583 169170 233747 266067
17779 266067 306702 312490 272315 239918 191300 150221 137369 108543 71177 49207 62477 58619
17767 58619 41744 49712 42019 33805 27975 -798 -16996 -17947 -28342 -20394 2292 26699 23204
17754 23204 3618 10761 -16837 -25339 -10233 -9836 -8056 -2982 -17085 -31784 -27785 -31651 -47083
17741 -47083 -27827 8917 6997 -26538 -25084 695 -2319 -11879 12355 12909 20196 21463 17860
17728 17860 36503 45951 34560 6064 -25621 -2563 -2007 -24409 -30214 -39357 -54241 -37307 -10794
17715 -10794 -215 14250 12659 1442 -12280 -57664 -39464 -35831 -22942 -21358 -31992 -22686
17703 -22686 -33002 -23841 -18003 -36344 -49523 -43499 -43723 -35735 -15448 -1223 -6146 -29836 -22480
17690 -22480 -16904 -38185 -54959 -45711 -10395 -4581 819 -12702 -28648 -70946 -71816 -62493 -50229
17677 -50229 -31267 -18854 -24295 -13752 2625 -14804 -11384 5698 11010 -7943 -18356 3271
17665 3271 -2902 -27150 -44475 -54880 -47846 -33179 8060 58105 48819 -4418 -40095 -29358
17653 -29358 -12686 11264 14118 -4235 -16041 -34368 -12508 -19596 -14911 747 -8537 -21494
17641 -21494 -58570 -80798 -80878 -63438 -42801 -33976 -37546 -26929 -20591 -31165 -34852 -30756 -49093
17628 -49093 -47293 -33924 -26945 -31179 -34800 -39594 -38762 4579 26895 26960 11339 1845 -36100 -48575
17614 -48575 -39041 -6466 2031 -13653 -25325 -34797 -38287 -21623 -10072 -15508 -16832 -23572 -30354
17601 -30354 -27395 -26662 -44896 -51635 -49669 -32361 -9244 -56 -3394 -29810 -49755 -49273 -34956
17588 -34956 -35318 -25950 -25792 -31313 -24292 -23021 -8627 3063 -11570 -702 -2201 -29194 -42035
17575 -42035 -48874 -32977 -8222 -17621 -42893 -49553 -48143 -47398 -28929 -20744 5711 1792 18847
17562 18847 25534 21651 15596 -38649 -70265 -37201 -22938 -5598 -7494 12202 8598 -35684 -44032
17549 -44032 -23789 -16980 -12502 20896 23776 -7647 -32356 -43086 -21842 -18047 -21960 -23482 -45703
17536 -45703 -57106 -59066 -37626 -21701 -8835 -8792 338 -20792 -24836 4607 25624 -6214 -39868
17523 -39868 -52831 -48965 -47568 -21217 2694 9814 18710 -17566 -48012 -49188 -24391 -1098 18511
17510 18511 10194 13270 10744 -20750 -30823 -25249 3851 18475 -77 1659 -1323 1841 7850
17497 7850 10667 10772 11882 7524 -4978 -8379 -6179 -33564 -24980 -23294 -38465 -55066 -39988 -37256
17483 -37256 -49653 -80058 -87459 -79128 -61768 -47099 -53473 -50178 -42840 -45125 -51647 -40077 -25717
17470 -25717 -33587 -47966 -44091 -54901 -54339 -55970 -44953 -14661 -16961 -18282 -11917 16699 -9
17457 -9 -24900 -18485 -480 3757 -18822 -29216 -38111 -57394 -53414 -15025 -15058 -27356 -12894 9318
17443 9318 31515 87291 148652 176111 162421 119888 93538 82315 49422 34705 33922 10608
17431 10608 245 4607 1736 -27458 -18985 18973 28665 34892 32281 12792 -3332 -11282 -13614
17418 -13614 -26779 -28261 -26832 -24655 -10571 -1806 -16104 -466 7250 16904 37971 23565 -5539
17405 -5539 19632 21473 -4180 -12977 -18410 -10727 -27124 -31975 -37403 -41666 -16880 -32766 -25379
17392 -25379 -21164 1308 -13777 -36609 -56529 -58331 -31874 -21124 -16805 4289 6306 798 251
17379 251 994 -10152 -4594 18690 19190 -456 -7934 -12821 -22851 -2822 24619 9783 -19049
17366 -19049 -23207 -11675 -13540 -32374 -25781 -18227 -25392 -25443 -4895 -4291 -4255 -5404 -15563 -36844
17352 -36844 -28469 -10714 -4181 -9789 -28643 -18074 3535 1552 -21572 -22084 -33700 -32341 -33698
17339 -33698 -63407 -52829 -39655 -30888 -14497 -14091 6645 10382 6029 -21334 -19627 -7449 -26130
17326 -26130 -27795 -50764 -40987 -17787 -15629 -26906 -16695 9241 33966 34456 31032 13584 -5102
17313 -5102 3 4855 -14874 -31067 -32341 -37466 -46058 -61826 -63781 -50027 -39192 -47504 -83589
17300 -83589 -83554 -51520 -35150 -23207 -17736 -32451 -28709 -10365 -10339 -32755 -19182 -10663 -19437 -41654
17286 -41654 -31920 -29125 -38995 -50436 -72517 -52403 -34543 -31389 -7986 -14979 -35380 -38241 -16398
17273 -16398 33187 12579 -717 7612 -1177 -20193 -21529 -9005 10138 -19171 -33262 -14606
17261 -14606 -25296 -33153 -25822 -11114 -27635 -64523 -58985 -30971 -31006 -49445 -55235 -57864 -50652
17248 -50652 -62156 -72565 -77920 -67587 -44796 -56806 -45848 -69664 -61800 -58042 -21477 -19036
17236 -19036 -45568 -65495 -82509 -60121 -21455 -25825 -40306 -27510 -23311 -14333 11508 1813
17224 1813 -28348 -34576 -29462 -9546 -12051 -12647 -18519 -25566 24425 20789 -29002 -31204 -3319 24431
17210 24431 27214 26284 11996 -16477 -52603 -67005 -36930 -22253 -16623 -14023 -36608 -23655 1436
17197 1436 -9854 -29076 -34739 -42612 -37969 -33013 -43082 -26737 -28405 -21084 11918 5344 -4486
17184 -4486 -9356 -22106 -15715 -1343 -4117 -4503 -23188 -29185 -12293 -8824 -3421 -7371 -36311 -53398
17170 -53398 -39681 -7623 22307 -23027 -49473 -47537 -46603 -37685 -5621 -15033 -37522 -40794 -30715
17157 -30715 3980 23409 817 -26334 -34561 -5344 -25179 -70776 -78108 -54128 -34843 -12047
17145 -12047 -14447 -33443 -49687 -43976 -43944 -59855 -60800 -45602 -37243 -13807 -23737 -29618 -67835 -66826
17131 -66826 -47601 -20373 5348 3020 -2309 -3192 7000 -11490 -30971 -27614 -19618 7050 -5040
17118 -5040 -6056 -10856 -21093 -29507 -34847 -26696 -2602 -14690 -19311 -26402 -31563 -45634 -43158 -34541
17104 -34541 -48596 -52458 -74221 -60394 -29916 -9303 18183 -9075 -9522 -2066 -24 -3869 -1926
17091 -1926 -6415 -113 -12301 -27375 -14712 -17796 -24861 -32867 -29434 -21230 -11388 -8012 -39366 -40540
17077 -40540 -56993 -61607 -49799 -39689 -34346 -19409 -19519 -25893 -43412 -41299 -34602 -3131 23182
17064 23182 26144 -301 -10708 -19166 5365 13473 -9573 -40369 -36769 -20518 -13663 -14285 -30968
17051 -30968 -46165 -30979 -1467 22676 43187 44012 19300 -6807 -37456 -16038 14579 2588
17039 2588 -9880 -17773 -20494 -15211 -22558 -19498 -13671 -10016 -19159 -14492 -7245 -31281 -37876 -49776
17025 -49776 -54754 -57333 -55423 -47465 -31157 -10121 -4361 -7168 -6706 350 -44379 -17209 -7836 -2727
17011 -2727 -5717 -6321 -11894 -13646 -28151 -24075 -17675 -23062 -13684 -1687 -29369 -56257 -39004 -30701
16997 -30701 -32674 -39924 -44694 -37519 -27338 -9188 20266 5856 -25366 -21028 -21899 -2127 -5202
16984 -5202 -611 -16577 -13155 13298 14561 -1674 -41808 -48818 -58780 -58698 -40533 -31131 -53980 -51122
16970 -51122 -63307 -56647 -51591 -56568 -31220 7199 31376 32975 29080 -2443 -23753 -34975 -54812
16957 -54812 -54333 -39489 -36337 -35696 -27969 -23914 -5570 -13131 -8617 -14442 -39974 -30012 -30479 -44084
16943 -44084 -55291 -37352 -14168 1428 -8636 -16975 355 35777 27995 36957 41392 42240 24996
16930 24996 5173 -18775 -32983 -22505 -39428 -35118 -33185 -26415 -2378 -3645 -9850 -31758 -66244
16917 -66244 -54958 -10946 20979 12949 -6429 -18445 -18340 -16390 -24558 -33700 -35277 -37344 -31737
16904 -31737 -26047 -3586 13671 18074 11356 514 -14484 -21791 -32242 -41403 -55680 -50637 -26642
16891 -26642 -15873 -41190 -32528 -42190 -48671 -44886 -58273 -86502 -79261 -49118 -41558 -32607 -8349
16878 -8349 -21507 -10511 -35395 -29619 -14452 -35989 -29329 -18100 -48912 -67076 -28503 -11267
16866 -11267 -23753 -24471 -18630 -20078 6938 23307 -24778 -71894 -28476 -760 -8101 520 17749
16853 17749 26899 21603 -8069 -35005 -56216 -57719 -44490 -6918 -3707 -15854 -19962 -36237 -41733
16840 -41733 -24348 -23186 -26446 -25779 -35691 -46085 -52242 -53166 -37395 -46255 -26794 -13088 -24922
16827 -24922 -34263 -18510 -27404 -34865 -25716 -9937 -27275 -40065 -45235 -32139 -21456 -16440 -18894
16814 -18894 -34741 -17308 -7347 3709 -30171 -31398 -10159 -3297 3739 4348 7583 3650 -3445
16801 -3445 -3638 -20086 -10018 -3955 -13364 -11994 -7362 9040 -8006 -17195 -16373 -31691 -11881 -8657
16787 -8657 -52821 -60619 -44256 -38341 -14237 -10823 -12495 -7293 -11574 -33763 -45654 -41074 -44031
16774 -44031 -31128 -44070 -42917 -40392 -32003 -19033 -18393 -36796 -34045 -13340 2392 -6771 -22224
16761 -22224 -46963 -34565 -30777 -32170 -50430 -40614 -39738 -8390 -22305 -29258 -36817 -66840 -101561
16748 -101561 -111681 -79723 -56476 -57510 -59422 -31702 9473 18275 -26824 -37358 -29239 -40256
16736 -40256 -70859 -47282 -34362 -8223 -9055 -26306 -44700 -64815 -72502 -67649 -63569 -90123 -92524
16723 -92524 -89749 -84840 -52638 -26308 -10604 -9881 -19338 2472 23360 4683 -11161 -3568 25613
16710 25613 31972 23301 12580 5385 8769 -7180 -13896 -21514 -38606 -37642 -35100 -32638 -22086 -39203
16696 -39203 -49204 -62815 -60509 -56790 -49597 -61330 -58649 -84847 -67017 -42320 -1288 18274
16684 18274 626 -9630 -21022 -1195 -4783 -25842 -34679 -20048 -40084 -13147 -855 -3199
16672 -3199 -16507 -18944 -6172 -19003 -500 2747 -7677 -26100 -42658 -29163 -23936 -16017 -34757
16659 -34757 -57972 -61636 -59357 -28862 -26277 -24644 12032 21236 6647 -11991 -36009 -59035 -60255
16646 -60255 -36808 -27271 -30202 -25147 5910 2159 -14070 -22050 -22070 -22179 -15903 -35403 -48583 -64545
16632 -64545 -61812 -54684 -47683 -27794 -21326 -50724 -55902 -59650 -43365 -37118 -21392 -11742 -39524
16619 -39524 -44601 -4134 11039 -4739 -26014 -23309 -12179 -29641 -39570 -53570 -44970 -6029
16607 -6029 11695 31697 19971 -8144 -24339 -31330 -31021 -18451 -5326 -20034 -39656 -35915 -34862
16594 -34862 -32229 -33311 -45433 -44672 -41185 -18120 -6513 -27212 -40991 -27090 -14220 -7822 -17839
16581 -17839 -12384 -8731 -4117 8074 -11556 -46498 -52781 -59271 -33990 -16769 -6233 8243 4808
16568 4808 13766 17367 -21833 -39090 -26298 -23212 9359 8910 9377 462 -5192 24013 28423 16198
16554 16198 1231 -16732 4919 14879 11215 -524 -11580 -8014 -5539 -28144 -41677 -37636 -46652
16541 -46652 -61880 -47625 -49264 -49125 -44460 -46447 -43159 -39408 -49342 -69853 -71751 -86154 -72644
16528 -72644 -63321 -66439 -70058 -33572 -9737 -10974 -36362 -48931 -50749 -59198 -50324 -58237 -39989
16515 -39989 -15048 -19118 -37318 -50887 -41664 -24628 -22322 -24635 -36973 -15503 -19876 -32171 -27427
16502 -27427 -16094 -24760 -13960 -19126 2278 -9987 -52514 -67078 -80639 -71176 -58824 -31093
16490 -31093 -35847 -13461 18518 27994 268 -14896 2413 -3783 -40786 -42137 -22747 -2961
16478 -2961 15844 -611 -37229 -27488 -16364 -17510 -69478 -52949 -8391 -9279 -35032 -11080 -5513
16465 -5513 -25074 -53715 -66687 -77525 -57309 -47253 -20131 6950 30039 -4273 -45720 -50234
16453 -50234 -43214 -33542 -26995 -9833 -3761 5996 -2166 -4428 -9765 -34384 -67901 -81617 -73747
16440 -73747 -37825 -9373 -16903 -65468 -64148 -28517 -31907 -61492 -59603 -60371 -66863 -49948 -38376
16427 -38376 -49227 -42712 -29482 -49834 -40116 -52220 -47430 -65962 -80382 -68954 -35782 -36617 -27201
16414 -27201 -7012 10506 -11550 -26411 -32237 -46530 -49153 -34635 -12768 -32432 -42850 -47766
16402 -47766 -59890 -60696 -44887 -9701 -17494 -33283 -44369 -45730 -37741 -33974 -40843 -57593 -62458
16389 -62458 -60468 -31734 -52984 -56673 -38175 -27754 2099 30854 -3474 -24237 -18789 -14204
16377 -14204 -9797 -17087 -15575 1293 19965 2122 3357 -3648 -19572 -37524 -30256 -41578 -25349
16364 -25349 -2317 -17353 -17399 -35911 -28104 -10678 -41478 -75612 -72041 -80851 -90812 -84792 -66909
16351 -66909 -66479 -48519 -35534 -26463 -37300 -46210 -70170 -69472 -78217 -56933 -27983 -51498 -57220
16338 -57220 -53433 -61092 -42143 -12477 -37923 -69024 -87560 -80368 -82420 -55641 -38062 -34284 -21653
16325 -21653 -1829 -22244 -25255 -13378 1016 9157 -5734 -1149 -618 -6960 -20329 -20659 -24649
16312 -24649 -42405 -42847 -55001 -33516 -48746 -57304 -62542 -56967 -35867 -34473 -31541 -36317 -28405
16299 -28405 -13862 -32579 -54339 -75536 -44394 -13247 -5993 -17551 -27653 -26244 -57253 -48912
16287 -48912 -46429 -65086 -42330 -35852 -41754 -44026 -18566 -12487 -28450 -30224 -21257 3712 -4219
16274 -4219 -42879 -35095 -22201 -8442 3112 14134 28861 33077 25800 19367 24420 10472 14882
16261 14882 3377 -24283 -23552 -16597 -7823 -48899 -68664 -54003 -35719 -24759 -35262 -23927
16249 -23927 -2040 -11298 -20001 -22111 -27784 -11943 -34015 -42553 -10552 -3884 -9861 -17713 -32936
16236 -32936 -27088 -15635 -1132 -22746 -45930 -60261 -50250 -36751 -18985 -44520 -48396 -29592
16224 -29592 -10189 -18856 -21774 -20095 -24956 -26912 -30904 -39952 -54885 -31812 -30919 -42885 -35970 -10412
16210 -10412 23480 25411 8274 -3045 5085 -1690 -27005 -54741 -62679 -33358 -44936 -56528
16198 -56528 -59234 -46155 -51390 -39588 -20762 -13523 7946 16855 10555 -775 -32848 -21358 -25278
16185 -25278 -30317 -34203 -51332 -46160 -49536 -53334 -42201 -26761 -7438 -190 6058 19540 8099
16172 8099 4037 -27265 -41453 -52123 -31854 -12375 -11272 2561 11251 28436 29818 11729 -26121
16159 -26121 -22321 -3567 -23297 -32457 -13608 -12723 -15134 -3618 2550 -20268 -1175 2350 -8170
16146 -8170 -33975 -27497 -22837 -32366 -52026 -53766 -53803 -49446 -65266 -69057 -46664 -49568 -43149 -29214
16132 -29214 -3415 8475 6618 -27383 -26362 -47305 -37640 -27162 -18361 -24348 -31050 -17470 -904
16119 -904 5189 -29296 -59698 -65316 -58111 -50360 -32913 -32441 -39970 -44846 -53529 -78814 -75815 -81128
16105 -81128 -71225 -48167 -49266 -38982 -27390 -58407 -74761 -39281 -27204 -22434 -44064 -39418
16093 -39418 -30369 -17341 -22184 -31377 -20445 -7374 -17157 -2279 7557 -8922 -14751 7801 -14899
16080 -14899 -47173 -73023 -66509 -15393 35793 44010 37425 42453 25014 -34336 -56387 -37871
16068 -37871 -14309 -3031 6498 -9872 -18052 4688 7649 -1685 8506 30290 16422 12070 2273
16055 2273 -21643 -50417 -56437 -52418 -43460 -32461 -26831 -42874 -23935 7086 31310 9360 -26395
16042 -26395 -35574 -57162 -54996 -26730 13472 6334 -477 -4203 -9643 -10385 -1831 -14308 -41343
16029 -41343 -54101 -34528 -16969 -39362 -42955 -19763 2565 -20598 -21529 -13993 -22986 -36436 -40040
16016 -40040 -7209 992 -2684 -34039 -53527 -54152 -45945 -39413 -34343 -31540 -26307 -14486 -36415
16003 -36415 -11994 -17725 -59704 -69770 -60924 -52287 -49036 -36101 -15742 -8986 -14056 -20822 -18270
15990 -18270 -21842 -35230 -30094 -20444 -30516 -40018 -39697 -42955 -30455 -32807 -49568 -43888 -35941 -15978
15976 -15978 -17391 -27804 -38907 -31909 -37290 -23917 -10820 -1699 -9162 -43298 -60684 -70297 -61583
15963 -61583 -36731 -15403 31902 19378 2123 522 2070 -250 -718 -17113 -8414 3212 40390
15950 40390 71268 82744 47820 35300 42083 32129 19828 19852 14618 -11073 -36793 -36259 -22951
15937 -22951 -13616 2530 -8839 -3060 -20301 -21483 -36718 -17235 -6655 17448 6416 1649
15925 1649 1846 -21569 -26535 627 -15164 -4513 37983 26500 19870 17868 -13233 -40661 -47367
15912 -47367 -52409 -41462 -11777 -4854 12997 -9904 -24847 -22363 -4980 5580 7153 10708 -2180
15899 -2180 -4198 -7201 1504 2649 10772 3589 -18865 -9370 -14175 -21394 -27049 -34047 -23462 -22180
15885 -22180 -7306 -23327 -8479 9017 -6397 786 688 -6151 -20637 -26657 -25989 -23714 -16469 -24088
15871 -24088 -33977 -8308 -11978 -6446 -14427 -23273 -36527 -18174 -7221 -29713 -52938 -42319 -23922
15858 -23922 -3965 -13841 -42962 -45031 -28116 -34747 -43104 -25100 -13023 -10957 -16613 -32932 -46060
15845 -46060 -50871 -28205 5492 8154 9666 30167 12245 -37472 -48273 -48384 -25708 -10317 -13596
15832 -13596 -40879 -38504 -14800 -32401 -26418 -8911 -5555 -3266 -33583 -51342 -36744 -28653 -31191
15819 -31191 -52099 -49486 -36625 -35832 -7544 -13063 -28652 -15665 5238 -4070 -23437 -39673 -51110
15806 -51110 -48659 -37895 -46355 -52542 -54467 -32236 -19704 -20277 7649 27902 8791 -6247 -8275
15793 -8275 -5234 -6786 -12351 -15422 668 15836 15019 17284 36176 40490 27284 11163 18492 -2933
15779 -2933 -4252 -1821 -26586 -40811 -18127 -22098 -49280 -65588 -62686 -64421 -60644 -70524 -84603
15766 -84603 -80595 -59974 -51018 -61762 -69790 -76506 -61381 -58041 -53791 -40985 -37677 -52039 -57164
15753 -57164 -62455 -25150 -32866 -48718 -63491 -63100 -69622 -25092 -10510 -23503 -6422 -9859 -11907
15740 -11907 -13637 -14008 -30099 -41314 -23903 5556 15234 9925 -2519 9575 8709 -13929 -32321
15727 -32321 -13820 -23829 -13568 -14139 -14955 318 -9756 3072 -4321 -30683 -40657 -25738 -59894
15714 -59894 -69062 -55392 -53891 -54414 -43378 -38917 -56559 -40692 -20560 -32360 -65371 -83033 -46009
15701 -46009 -26131 -40468 -45688 -29691 -25132 -31748 -37835 -45977 -57142 -62362 -39259 -25237 -16673
15688 -16673 -23444 -36041 -26609 -41708 -48394 -61192 -49500 -57745 -63785 -36720 -34315 -35549 -29470
15675 -29470 -27623 -39017 -43424 -57265 -39034 -9074 2147 -9683 -3795 -5569 -12919 -4399 -3415
15662 -3415 -19224 -34737 -40602 -39952 -40493 -45695 -49346 -56378 -55318 -37629 -34399 -25644 -20406 -6315
15648 -6315 -17006 -37452 -23809 -5871 -34977 -29533 -19592 -18378 -18842 -23071 -28658 -33083 -52179
15635 -52179 -29348 -16513 4254 -12970 -13063 -15363 -15287 7530 8192 -10653 -19569 -32754 8771 8473
15621 8473 -6596 -24710 -36255 -20570 6250 -957 -31886 -27722 -20465 -7237 2609 -12771 13825
15608 13825 29618 34682 33971 18119 21622 10644 1130 -1187 7768 -3148 -23152 -5915 -17744
15595 -17744 -8821 4014 32043 35194 13626 7269 24456 17948 12710 13522 29828 27209 19704
15582 19704 9323 4694 32891 48385 30469 7685 -17268 -31494 -29007 -53636 -75932 -49586
15570 -49586 -42464 -32395 -18208 4434 12680 14 109 17900 56690 62426 50307 29810 44435
15557 44435 65938 93720 85067 72527 41777 8874 -7730 -28896 -27250 -16155 -12716 -15352
15545 -15352 -8998 1132 6369 3042 -2328 -14696 -35465 -24722 -11821 -10851 29001 35288 19865
15532 19865 -12527 -28096 -29424 -26724 -4166 -16276 -58493 -77477 -66205 -64321 -66222 -53281
15520 -53281 -14193 3502 -18999 -32580 -15165 -24599 -41090 -48059 -34099 -8080 6004 11216
15508 11216 11096 3511 -11851 -19468 -11847 5498 -9433 -37847 -48681 -29385 -10623 -12801 -14998
15495 -14998 -34857 -46182 -37921 -31941 -49028 -65870 -55740 -28451 -9075 5915 2450 -25842
15483 -25842 -46549 -30619 -31177 -39058 -52723 -44897 -49317 -60989 -51973 -50249 -27594 12957 19794
15470 19794 22923 27401 30491 23602 16968 24003 41759 56019 32620 11063 11330 9073 6670 16602
15456 16602 6416 -759 -12765 -29900 -31246 -7686 19889 22767 4882 -14136 -19692 -38065
15444 -38065 -44249 -52706 -31757 -32590 -40257 -52345 -52718 -2722 -7334 -39922 -52158 -49793 -61182
15431 -61182 -42660 -36066 -27594 -26969 5324 31643 5355 6351 28614 25996 23670 11290 17465
15418 17465 26705 12473 -15289 -27674 -21896 -23200 -30794 -33320 -10640 -1256 20468 21949 5660
15405 5660 -16848 -34165 -52387 -38792 -16010 -19740 -26933 -53083 -43583 1185 7405 -11697 -28619
15392 -28619 -25691 -12849 -15037 -24162 -39957 -54958 -54637 -16240 11716 -2579 -2113 11298 -7392
15379 -7392 -15257 -25104 -30752 -33269 -23750 -33652 -14941 8717 1656 -10034 -16709 -11890 -19547 580
15365 580 11249 17221 24417 -4037 -58961 -61027 -32591 -37365 -65548 -68366 -53372 -64654 -29490
15352 -29490 -6558 3706 -9248 -23877 -6833 -15 6129 19136 -2188 1580 5490 6025 457
15339 457 -22082 -49431 -52449 -50956 -57415 -60551 -51691 -34993 -15207 -19818 -12474 -7771 -12440 -30635
15325 -30635 -32907 -50003 -60115 -52264 -55072 -60909 -56135 -42701 -32741 -48403 -69474 -71874 -40652
15312 -40652 -9111 -596 2183 14666 3536 -1905 7351 14935 -12193 -22183 -13615 -17817 -61403
15299 -61403 -54114 -26862 -12595 2981 7141 -7724 -9666 -45800 -36295 -33094 -42971 -46773 -28990
15286 -28990 16035 50292 21684 -26628 -40571 -25480 -15199 -17900 -29470 -32527 -7140 6423
15274 6423 -6211 -16606 -43099 -22632 -30462 -24159 -22054 -36264 -49075 -54048 -52338 -31813 -14085
15261 -14085 -8938 -19791 -28097 -25893 -17038 -8504 -28774 -43085 -38388 -22462 -30076 -30925 -47092
15248 -47092 -59849 -33538 -7967 13293 5355 -20351 11125 -8797 -6852 3530 -26806 -28480
15236 -28480 -7688 -4024 -16111 -27294 -25260 -3294 13860 9342 5121 3423 -12647 -5350 -14806
15223 -14806 -18629 -6081 -34389 -27821 -21125 -22453 -7314 9255 -8797 -12564 1703 1387 -7089
15210 -7089 -1244 -8510 -3865 14119 13341 23705 6164 -7977 -1459 11763 31461 30491 6399
15197 6399 -2000 -19176 -26352 -14405 10626 9257 1979 -10624 -24456 -41656 -24692 -8256 -11935
15184 -11935 -20787 -16834 -14712 -24090 -11773 -5190 -4858 -4748 -808 -350 -19288 -29885 -17594 -8495
15170 -8495 -11620 -13984 12981 39687 49482 39577 8930 -5153 -15629 -15829 -20231 -33326 -16900
15157 -16900 6158 15492 18712 28577 9009 -29895 -16179 -37203 -46310 -25448 -26419 8621 -2389
15144 -2389 -6596 -12474 -11473 -3199 -16694 -25642 -31882 -31101 -24129 -49419 -49569 -67168 -91363 -58475
15130 -58475 -41042 -37157 -28660 -27450 -29972 -29271 -40794 -49871 -56456 -71421 -60809 -66271 -59401 -57780
15116 -57780 -68014 -82771 -95294 -61186 -37870 -32631 -23736 -1627 22107 15054 -5967 -19827
15104 -19827 -50434 -49938 -44837 -35160 -23538 -6809 -7345 4161 10951 -7193 -3594 -561 -26629
15091 -26629 -10155 -1226 -3213 5804 2628 -21938 -13382 -43801 -49157 -22168 -2605 -152 -5900
15078 -5900 -28695 -11311 -6202 -17328 -13866 -40760 -61058 -23215 -1820 -10672 -19890 1663 15620
15065 15620 14150 7251 -15750 -22789 -34313 -39994 -57661 -44083 -29583 -18141 -43392 -52086 -21562
15052 -21562 15725 17385 17881 3790 -7768 -25112 -6659 -241 -19205 -27886 -24202 -18182 10645
15039 10645 -8347 -19719 -3916 -3020 -12890 -25818 -28921 -37126 -48860 -26835 -3240 1363 12058
15026 12058 11344 21328 32195 52249 43321 10882 -11459 10830 31256 19014 -23532 -10988
15014 -10988 3355 -5808 -6612 11594 -1074 -11275 -7133 -1404 -4087 25654 23910 19802 14192
15001 14192 7490 -11897 -3420 -28575 -27834 11531 20191 40101 35992 38331 38554 23196 27888 35196
14987 35196 27515 19019 27994 12824 4014 16884 18153 3379 -4486 -2428 15800 3356 -16740
14974 -16740 -11418 -13193 -1064 -12416 -14609 -9096 -3156 7852 -500 12174 21899 22269 23508 41806
14960 41806 42819 40442 44063 30558 3493 -11426 -10051 -12674 -5213 -156 3950 5600 19507
14947 19507 36549 37053 45303 24252 7232 10133 -3424 -4771 2958 -7485 2484 18791 37471
14934 37471 30513 3491 -22130 -30551 -52233 -32261 20278 13848 -13336 -12899 -8245 -8933 -5152
14921 -5152 -10894 -34672 -21627 9937 22191 14326 10943 -18743 -32873 -41376 -33621 -29700 -42141
14908 -42141 -66890 -63693 -42771 -18725 -33929 -50657 -53355 -38235 -27845 -43249 -40548 -21350
14896 -21350 -37227 -49549 -63530 -54957 -15875 -31174 -24900 13451 12267 -5782 16109 34900
14884 34900 18165 16212 30168 12332 -18491 -25721 -11292 971 -7973 22395 28589 13480
14872 13480 7303 -16136 -24772 -19752 -27683 -25143 -36922 -37544 -21383 -35767 -46166 -27300 1682
14859 1682 43797 43772 26308 43713 24247 -13649 -29030 -24618 -1049 -1971 -3315 -17514 -38186
14846 -38186 -16807 8000 77 -4623 6201 7056 -39681 -64560 -63004 -58695 -64807 -49324 -50679
14833 -50679 -32764 -31522 -42402 -6749 -21794 -26573 4716 20638 9821 2905 5637 10702 16717
14820 16717 33948 25625 19188 7946 8631 200 1432 12466 17810 37311 36732 49852 20587
14807 20587 -14676 -54747 -43685 -42481 -54701 -49212 -39590 -36074 -33087 -38241 -22198 -49536 -41014
14794 -41014 1072 38361 36293 13028 -30413 -33252 -15332 -10607 -17378 -23640 -41276 -42836 -28452
14781 -28452 9918 24893 5221 16974 21003 27156 33498 32447 21152 20920 -9820 -32319 -10862
14768 -10862 25754 8143 -2205 19914 12077 -11937 -13310 -14675 -26586 -5742 8394 -20741
14756 -20741 -21610 11781 29599 38025 36306 30125 21213 15400 -6857 -9718 -14680 -24232 -32520 -38841
14742 -38841 -54795 -74859 -65169 -54535 -34386 -20044 356 4983 17362 607 -4762 -14145
14730 -14145 -17796 -36895 -27091 -20258 -29256 -16433 -18103 -36651 -42675 -43416 -16866 -9617 -12342 -21435
14716 -21435 -36775 -16990 -8713 -8817 11381 23975 30001 8806 -4259 -11595 -7073 -235 -2221
14703 -2221 -15585 -39722 -47403 -38298 -25207 -48760 -62522 -60656 -45728 -34570 -52408 -50636 -41358
14690 -41358 -31402 -31395 -17461 24422 33191 16803 22163 19083 42533 72164 84479 89070 91179 52389
14676 52389 23385 18062 29982 6779 5649 29299 37660 34223 35937 25889 5529 -3467 3309
14663 3309 -19770 -7234 -5384 -4436 -17282 -13852 1002 -10383 -30526 -26126 -8266 10667 7994
14650 7994 1343 -17098 1177 -4454 -12582 5209 13688 11955 1331 -9867 -8656 -6425 -8317
14637 -8317 -12542 -4139 -40769 -40491 -43190 -45658 -36757 -44171 -25418 -26546 -19665 -9000 -6886 2386
14623 2386 -23355 -32410 -17872 -6451 11803 9384 26829 1094 -10606 -7248 -34375 -34379 -32049
14610 -32049 -36483 -16942 -1728 4415 17928 13850 -1160 -29835 -39055 -53768 -37667 -35195 -41606
14597 -41606 -28697 -55837 -41574 -7845 -14304 -12416 415 236 -17283 -38578 -39956 -6729 46468
14584 46468 26913 -8803 -21084 -30815 -39899 -32800 -31293 -36461 -42376 -21790 -32943 -54200 -54031
14571 -54031 -22966 -7449 -10408 -32553 -33344 -18752 -1795 7914 -1996 -14624 -16932 -9972 -2684
14558 -2684 -1639 -35 17620 797 -17134 -5475 14646 3965 25276 24298 36511 12113 -11967
14545 -11967 -16164 -26031 -8412 -3916 -15199 2995 -18563 -27540 -27398 -4270 46652 50232 28007
14532 28007 -4672 -1376 9884 9463 -6370 -30626 -49543 -9658 -1474 -13261 -1810 11526
14520 11526 22856 16190 -2397 15681 27187 13450 -23225 -26650 -30428 -33068 -16679 -4023
14508 -4023 -6786 4409 13481 -10437 -4238 35554 47080 20841 25488 43917 28924 25167 47540
14495 47540 33464 14718 16098 15405 2061 9390 28919 23094 23498 10036 -6533 3076 11351
14482 11351 21170 15610 4239 15841 45438 37204 31312 23943 35014 48054 25577 8887 6535
14469 6535 -13552 -7415 25033 35711 28442 34992 28421 14204 14008 31978 30565 22018 1413
14456 1413 -18014 -25777 -3361 -17453 -24367 -24147 -17280 -11175 -11122 -5982 -4295 -23166 -16695 10360
14442 10360 28796 45676 38251 17494 13896 22126 19493 31347 42142 58377 57065 61602 45998
14429 45998 32075 8092 4088 2161 11314 -8153 -16443 -47849 -40716 -26047 -13915 -24329 -24745
14416 -24745 -34838 -36956 -47897 -5199 18240 32132 24235 57744 69426 67069 33804 20297
14404 20297 23230 46075 32458 2591 4973 -2047 913 41578 67032 46114 13500 -18221
14392 -18221 -51658 -63849 -60790 -39078 -12978 9608 3400 5786 16343 16249 5003 -17249 -3814
14379 -3814 9284 9037 1659 18333 40520 50276 41514 17328 21767 27702 -5674 -20556 -22919
14366 -22919 -25233 -8456 18816 21138 38083 41988 10242 -9284 -777 9990 15026 13450 7591
14353 7591 -1959 -5172 14107 21994 16403 13650 24884 38305 45262 19904 12718 13263 12784 2348
14339 2348 -4866 -16250 -10588 -4451 -12849 -14909 -6373 16021 -1357 -5887 -15172 -8204 -4745 15286
14325 15286 5207 -11182 32949 74937 45680 27649 35332 49758 58095 27664 27939 16508
14313 16508 -12195 -21276 3400 3418 -4887 16805 25843 39225 42693 54788 72635 38420 5931
14300 5931 -14439 -15466 13799 16415 16552 21570 33135 39995 28762 27883 40022 45400 69770 58306
14286 58306 36300 16113 5662 35350 53556 36379 199 -15441 12687 41780 23471 11704
14274 11704 40219 35571 7987 -10607 -12776 -19283 -25411 -44955 -47383 -21205 -31742 -27914 4013
14261 4013 22330 36960 60110 50612 10113 -31540 -37822 -21085 13594 31184 44543 48658
14249 48658 52716 49634 21916 6593 12233 12906 26507 41980 42695 26328 1595 -11935 -724
14236 -724 -1535 -2828 5564 5866 -889 -10078 -11242 3766 -18727 -18980 -2925 31260 54246 59927
14222 59927 24761 7060 32145 62315 79762 67107 24060 9494 166 -10878 -7147 10833
14210 10833 38096 65224 90364 99366 55693 31734 45247 36208 -8560 16514 11237 -878
14198 -878 -7341 10191 19091 40106 38775 25983 14526 14037 25688 42736 30965 33684 57167
14185 57167 60472 60183 59546 82881 90515 112288 91822 75202 40947 32525 30594 24983 53308
14172 53308 43711 38164 18214 22243 50217 57930 54017 36775 23288 6342 -7891 13917 16133
14159 16133 30937 75031 80313 93760 100714 78136 67662 51691 50293 48357 26702 1805
14147 1805 16954 -1408 10345 19508 16885 -25484 -24017 -2105 10870 19133 25176 -1738 -33631
14134 -33631 -16452 -3308 -19426 1317 27922 39869 38805 37919 67961 64713 36229 30128 21209
14121 21209 38196 35096 17536 4261 14243 -1604 -6102 26444 21849 26957 36458 33192 30318
14108 30318 34113 39591 58580 64455 32800 21697 61377 66105 73964 62715 81568 86532 66006
14095 66006 48528 47944 55654 51098 36849 17074 32443 58939 69375 61882 34470 23952 24595
14082 24595 20693 17388 37593 39938 30099 33431 29750 37268 31504 28978 41174 29247 29005 32691
14068 32691 39220 60289 31786 11625 9895 16182 15182 -7824 -12494 -17167 5028 26245 30278
14055 30278 43252 46335 20785 -9320 5801 4198 23149 55396 56661 41232 24738 49478
14043 49478 44505 28753 9652 4312 17443 45205 55968 52062 69938 83693 115214 165538
14031 165538 201109 214864 237914 281500 313807 316217 279904 229264 168467 145747 127779 101676
14019 101676 69838 84365 63056 45622 26544 -784 21975 17801 17224 10086 7508 7511 13573
14006 13573 -1189 9525 43465 24133 19549 31404 4453 -6649 -22006 -21107 -32042 -16840
13994 -16840 -18156 -44163 -17572 18306 12973 9418 22834 23426 17783 18997 39996 41511 26248
13981 26248 6261 7214 10963 20820 18313 18030 20282 48024 29432 22918 21638 24544 32157 9158
13967 9158 42588 50143 38864 17511 -4295 6410 1718 3729 33598 29870 21424 19114 16378
13954 16378 38319 58785 66279 79617 99390 91582 73898 53541 37533 75780 97298 86997
13942 86997 37245 36260 41115 34268 29059 24428 10957 2118 16002 42199 60015 40539 33274
13929 33274 25067 18030 37670 73099 70166 37904 17951 -6268 -869 37439 49725 53590 31872
13916 31872 23870 37166 13454 2658 28881 24012 11977 4521 25953 31217 38122 44685 57406
13903 57406 40800 34877 51189 64719 23883 26138 56608 59115 43180 27686 43294 80879
13891 80879 72813 71534 58814 79709 85530 88496 91868 92385 90852 79708 76786 79096 81081 99200
13877 99200 126362 152400 163807 209870 233181 248424 287784 371557 446064 527004 644555
13866 644555 742311 799423 788254 800046 780513 689858 565100 448911 369660 305610 240695
13855 240695 205695 162775 136976 114545 97794 85421 72608 54684 33000 42671 46835 52123
13843 52123 53983 46049 60051 69500 88782 109099 117564 118890 104101 81605 73928 51678 15381
13830 15381 26801 28317 33543 64140 51543 31903 38258 50283 46091 57120 69399 61736 66522
13817 66522 76255 79806 67695 67524 58432 57506 83466 69559 39638 35179 62529 70263 63590 65523
13803 65523 65709 50232 37406 18991 35338 65234 53895 29287 24334 64449 59585 70376
13791 70376 47813 76514 90202 81696 56918 18941 -7284 -1521 21037 19795 43778 62293
13779 62293 60168 62912 63373 92240 91936 75125 65390 59069 63678 74420 58236 49539 32892 33765
13765 33765 34719 54591 75643 66531 53068 43088 42293 47810 31508 38672 29926 19994 39504 57582
13751 57582 69181 51616 28023 34852 36869 20193 15040 13428 23985 50260 78219 88489
13739 88489 64820 24278 22890 40094 39734 42984 24762 35301 75499 76901 63778 52234 50271
13726 50271 46750 69116 40325 5602 9211 15992 2839 24063 56037 44340 39515 23924
13714 23924 23208 17156 5673 28481 34752 36692 18570 36837 61522 45706 43863 59792 49267
13701 49267 30082 36599 41606 41700 59189 68336 60210 38234 33419 29692 17884 28989 43221
13688 43221 15566 26186 55402 88921 85676 55917 66053 51880 39344 49014 56994 48925
13676 48925 55277 59252 42098 35536 25196 29322 50611 84381 91769 93705 99175 57405 36918
13663 36918 26565 26082 15024 2582 1520 5645 7067 -22852 -30820 -21425 15518 36860 15224
13650 15224 26800 26689 38329 43662 58839 79925 77397 37639 34478 43131 84359 90982 46558
13637 46558 29677 50111 88659 83836 78463 75033 60082 35977 37878 62274 54382 59992 75618
13624 75618 79230 80707 80369 71907 72083 61604 64007 80879 79756 103031 115926 101410 86517
13611 86517 79745 89278 70939 62768 89285 87074 59814 29403 42694 56561 64027 82121 105232
13598 105232 113674 82915 91206 124993 119124 102135 93368 84944 88654 97199 93415 90355 89588 72568
13584 72568 63153 38904 34035 43069 59913 56781 63006 67376 38066 40464 48103 33359 25545
13571 25545 20925 24845 17602 -10559 18629 68989 77818 67044 18611 18149 27050 55130 88681
13558 88681 99586 78806 81824 82981 86051 78413 84489 94052 110003 110799 70479 60517 84190
13545 84190 99897 95701 85777 48471 61331 98995 115201 102607 74762 46401 37554 35566
13533 35566 15260 11984 15975 21578 54282 73132 87639 64435 63791 71417 48458 30712 17150
13520 17150 20495 20001 14404 18644 32389 62727 65606 62211 73158 65116 59145 43434 32382
13507 32382 52117 61887 60408 66494 41792 27914 16988 6966 25266 24871 40034 76378 108650
13494 108650 119019 118364 101979 100859 87271 86073 96672 93382 57946 55732 64981 56445 57167
13481 57167 63129 68378 82139 86367 69939 80380 96987 103058 81833 54787 55957 71206 67732
13468 67732 57732 45213 50625 86696 93610 89389 90468 71768 84716 95876 75245 33388
13456 33388 61620 81841 72828 43896 27854 28687 26987 25635 7480 19115 33682 19966 54500
13443 54500 78882 99098 77301 75323 55379 55884 53161 72533 63278 75436 72125 58583 56611
13430 56611 56564 71048 92676 113710 111921 105675 94515 83717 93850 114111 102915 92761 86143
13417 86143 99505 97214 72455 82174 99011 97373 52171 27359 42847 56212 68869 74756
13405 74756 76095 64903 68743 55146 67915 81551 93201 88199 94558 101693 87204 99016 101819
13392 101819 109259 103369 105723 98933 103366 127491 97451 75023 69052 90944 84574 63710 43956
13379 43956 26081 63526 84304 89172 74591 56958 35143 57738 61804 73246 97936 95497
13367 95497 72225 81293 88669 82068 89752 88697 86718 95852 88087 86313 88557 109380 92129 62490
13353 62490 102154 117005 136494 114728 78253 93401 86801 59449 55278 45968 55251 88216
13341 88216 138118 130993 121685 99390 105431 131975 123553 117946 111878 87671 97656 100887 96004
13328 96004 67072 46190 80694 105849 143837 150122 147795 132967 120156 108374 98631 99625 97879
13315 97879 102803 94260 81598 58992 79004 121338 124492 144759 152750 143223 135058 85055 45944
13302 45944 28508 14106 42414 40322 38141 63110 63222 70759 73157 79438 69077 74845 63313
13289 63313 48412 59888 60237 51230 60373 92885 95955 95409 93176 87972 104137 78831 78139 85597
13275 85597 87505 88890 86910 70782 71271 74874 76458 78729 94210 83887 93222 122908 132860 139948
13261 139948 142164 149048 181523 181677 147624 108811 113049 134277 149609 140003 135387 121111 130410
13248 130410 133876 138167 132240 133326 130308 137745 134564 108426 104348 107491 88266 88724 90422 113149
13234 113149 126402 141889 143953 116445 101585 122637 110737 103140 111115 126103 126875 142706
13222 142706 162198 177579 188202 181109 166835 162385 177849 155697 152610 164474 150568 153208
13210 153208 136841 116688 120971 122287 143312 173758 180573 194120 196987 152854 138983 166578
13198 166578 157391 153560 144921 161918 163209 165151 172721 178932 187771 210124 229143 240716 257491
13185 257491 247636 227285 193859 166282 152521 134399 120880 142113 172537 180924 166230 191141
13173 191141 198228 167009 169665 162452 174316 184699 201645 209548 207367 193111 190202 182058 175638
13160 175638 185699 192251 185154 197270 232969 233645 213596 184254 157278 139024 159604 165535
13148 165535 145866 146840 146393 166683 166919 175153 176275 173063 165385 155443 161372 147082 149096 140169
13134 140169 139721 160180 171176 155380 165367 165854 186687 177233 166010 179055 177469 175866 173124
13121 173124 187564 184305 156850 156730 156155 133658 129785 140171 146145 139924 160808 152936 147692
13108 147692 131833 133394 108756 130165 157229 192067 189863 187994 182321 187647 180164 176729 166375
13095 166375 164838 160653 167890 174865 160917 177989 197340 185891 159001 159986 174107 151932 144936
13082 144936 149472 159541 142307 150738 149846 150513 141536 156738 176304 161382 144526 164073 173311
13069 173311 181260 195517 215443 234504 237817 225000 234229 242798 221546 203680 189426 182410
13057 182410 194014 162898 130923 160556 161122 144611 146909 157818 143885 160125 194954 201567
13045 201567 174802 146260 157777 176438 175870 149834 143098 177541 186606 191063 207094 189185
13033 189185 173458 188092 233259 230713 235147 228105 231169 233014 229964 210515 193471 180682 154688
13020 154688 145279 162950 200595 203200 209155 184685 203397 227337 228949 220605 225001 225135 223928
13007 223928 240877 258568 262423 253347 245011 228532 219995 203168 213430 238758 236636 209499
12995 209499 205896 239726 266798 239138 209641 191674 195440 228213 270537 283385 293017 297791
12983 297791 301517 306117 311982 318880 310335 301623 310920 305641 285658 269842 299911 319825 300405
12970 300405 296092 317317 338065 351736 338555 336619 367670 393096 410160 427342 450807 487239
12958 487239 538928 630662 742912 892948 1033256 1169740 1309251 1422137 1480238 1438119
12948 1438119 1331960 1177620 1051931 975187 919474 850894 797737 746137 741492 778111 825861
12937 825861 845700 877833 892620 931749 973355 1009050 1058596 1125170 1201866 1260333 1325930
12926 1325930 1390335 1439130 1470131 1519975 1560228 1567900 1559353 1541928 1489975 1461679 1394186 1331841
12914 1331841 1277150 1232529 1179926 1139690 1100250 1062444 1002243 940886 895282 860495 841283
12903 841283 821568 806177 789278 796835 838706 886438 924715 1009586 1136669 1274335 1372026
12892 1372026 1457382 1486462 1438410 1345955 1245252 1151035 1035906 915981 807887 727867
12882 727867 682958 633589 568485 504879 482604 482756 431741 421244 392144 382166 383645 375552
12870 375552 365136 341901 314682 279553 287237 348079 343951 318418 317867 309446 284065 252564
12858 252564 260197 295654 295073 321076 317441 299876 305273 302565 306866 298711 300585 300056 310215 326280
12844 326280 343826 376014 375419 367796 355380 334455 324078 349268 338731 330486 331945 317299
12832 317299 276506 258716 278254 282959 293360 298286 326910 366289 363579 365742 356600 337045
12820 337045 338395 343129 349862 346171 352401 361795 354553 363009 362767 353466 342389 354284 377747 377166
12806 377166 377419 380429 368115 375166 390405 392428 385521 369344 338789 334967 349590 360989 362730
12793 362730 333291 321783 318301 352547 397166 408420 387464 386949 405402 409029 415484 410690 400893
12780 400893 397660 413559 411435 412007 418017 393824 374215 381887 379036 387044 408985 436251 476780
12767 476780 477376 462094 480950 515937 504680 495000 483710 505670 533129 531291 535157 562125
12755 562125 571058 545060 515218 497202 506144 522600 514577 520233 534714 548611 528894 502161
12743 502161 504965 529451 546828 563580 566876 591037 615100 641650 665093 685197 701536 701171
12731 701171 699409 701575 707516 718026 728830 738736 768424 758253 743438 718692 719513 729259 707651
12718 707651 691363 700685 696887 692667 716797 705484 694901 693686 691300 732229 754894 765426
12706 765426 776017 785501 805925 833228 878781 910218 917672 968396 1003169 1005050 978260 955822
12694 955822 934954 895896 821243 752713 704059 694309 706319 707838 725705 740758 753938 749869
12682 749869 790862 822054 845158 842642 856690 881476 946240 957455 960846 961472 955927 965096 957603
12669 957603 957525 933470 908774 911109 912777 900071 912080 930691 935771 973670 987243 1000895 980569
12656 980569 967043 959029 940569 941226 932683 936115 956527 984497 1028095 1057598 1049909 1039230 1083979
12643 1083979 1110042 1182306 1220832 1220479 1227302 1242032 1271358 1300278 1314502 1310374 1306877 1280093
12631 1280093 1253465 1259473 1253880 1226745 1161398 1117241 1118718 1149210 1168569 1206784 1255470 1299168
12619 1299168 1363021 1430868 1490230 1512218 1533206 1564951 1622603 1620337 1608440 1584607 1582745 1591182
12607 1591182 1596243 1592236 1572952 1564995 1582685 1628235 1684314 1686828 1691379 1677209 1638021 1623406
12595 1623406 1618626 1653761 1657471 1683520 1721694 1768792 1833122 1892217 1987325 2151401 2341093
12584 2341093 2568602 2813390 3055336 3301113 3541459 3716533 3801459 3842971 3825357 3722204
12574 3722204 3586078 3419492 3245540 3022514 2799038 2585309 2404266 2305063 2257152 2247262
12564 2247262 2243711 2263058 2310701 2358301 2417618 2515616 2615268 2663397 2729190 2801617 2859171
12553 2859171 2908351 2968505 3058314 3165443 3263228 3351093 3449689 3560230 3708615 3864453
12543 3864453 4006667 4143524 4325430 4525939 4727625 4899075 5091073 5307941 5543268
12534 5543268 5806709 6119297 6453715 6783266 7156056 7611218 8098716 8627355 9247138
12525 9247138 9961465 10769677 11664797 12701271 13892689 15281509 16849720 18603216 20596686
12516 20596686 22881877 25548278 28726586 32640981 37521078 43678336 51566502 61745621
12508 61745621 74890438 91918968 113708196 140704527 171956226 203877605 229796575
12501 229796575 242793246 240280384 224938199 202115658 177073214 153670553 133956766
12494 133956766 118622695 107598873 100402642 96591223 95763785 97606193 101852719 108222205
12486 108222205 116368882 125793775 136016151 146614550 157286500 167965110 178818193
12479 178818193 190061843 201668607 213525873 225251861 236214354 245550719 252381921
12472 252381921 255981625 255955521 252357003 245703352 236762830 226463002 215595545 204750708
12464 204750708 194295034 184402670 174968555 165750081 156576210 147271277 137907640 128749514
12456 128749514 120124702 112539327 106501668 102355599 100480671 101232509 105045504 112508067
12448 112508067 124211254 140733733 162255585 187823793 214509731 236967971 248897401
12441 248897401 246247744 229949627 204629041 175645808 147240681 121915860 100579747
12434 100579747 83202845 69312090 58257560 49475997 42472940 36896411 32365760
12427 32365760 28644399 25541176 22868383 20571567 18604334 16894479 15460231 14212834
12419 14212834 13129694 12221927 11433087 10739945 10099932 9490067 8928495 8421896 7958208
12410 7958208 7539792 7137961 6756059 6416634 6104939 5829317 5586439 5338292 5119144
12401 5119144 4932844 4784658 4651270 4489642 4339450 4206116 4057716 3902020 3778570
12392 3778570 3679241 3583559 3483061 3392425 3320228 3254986 3215380 3192869 3129990 3055438 3027809
12381 3027809 3011952 2989062 2954890 2945851 2902778 2851771 2781686 2723742 2675116 2604936 2515389
12370 2515389 2445737 2403739 2397479 2398198 2381552 2363952 2365277 2372166 2354273 2318539 2292609 2260896
12358 2260896 2218087 2172303 2101255 2042447 1990846 1889810 1790861 1718209 1645361 1582716 1480892
12347 1480892 1425833 1402695 1408497 1428976 1439884 1430012 1444278 1537910 1568569 1577722 1584040 1582040
12335 1582040 1611547 1665379 1684452 1681601 1715677 1719263 1748813 1758818 1738893 1753016 1746951 1733400
12323 1733400 1723459 1721686 1756257 1786217 1780136 1809561 1833067 1842057 1837478 1785625 1718613 1627305
12311 1627305 1527188 1415567 1306444 1223197 1171028 1111432 1052964 1008096 971988 930996 941510
12300 941510 957559 989533 1032461 1078786 1137997 1176053 1189599 1180344 1153452 1114580 1020547 931204
12288 931204 858591 765091 682788 573105 492477 432856 412006 400453 411323 426921 447958
12277 447958 472594 491995 517145 525398 533192 548359 575333 595590 625363 618932 646254 686139
12265 686139 682549 668959 657218 659918 697982 776886 805637 844236 847852 887042 919629 945322
12253 945322 932335 935009 941261 933059 917312 866648 821451 812986 810641 829419 844240 849784 868385
12240 868385 882746 909411 951973 986926 1003952 1025537 1064476 1119214 1155465 1164226 1217973 1274138
12228 1274138 1310795 1366929 1439050 1481546 1526072 1589178 1639895 1704370 1771283 1837364 1926812
12217 1926812 1993244 2054885 2117172 2174882 2249898 2358685 2454299 2563650 2662601 2720416 2810669
12206 2810669 2933064 3062563 3194699 3349090 3531058 3693696 3872640 4069724 4280915
12197 4280915 4523623 4807680 5125219 5438227 5791386 6174272 6586372 7082405 7650628
12188 7650628 8268730 8970777 9811046 10829047 12064294 13588916 15463392 17678655 20211353
12179 20211353 23086037 26388454 30088496 34154192 38684559 43890010 50114634 57901217
12171 57901217 68172395 82303622 102037847 128842754 162390476 201018240 243829715
12164 243829715 289404354 334133110 372306875 399793701 415345337 417924212 406306595
12157 406306595 380739116 344874498 303464331 259819179 216482357 176145171 141497103
12150 141497103 113650807 92270076 76262525 64282306 55184210 48011956 42104699
12143 42104699 37049003 32618876 28684362 25172479 22040400 19283182 16907137 14948219
12135 14948219 13353001 12017231 10907360 9972515 9164424 8463978 7838508 7278890 6734142
12126 6734142 6248301 5834179 5477351 5163385 4840025 4539731 4294948 4098520 3917827
12117 3917827 3768172 3591612 3393110 3205719 3057066 2948032 2804598 2650175 2526671
12108 2526671 2441805 2364184 2288900 2221222 2160770 2088819 2022384 1978414 1947969 1898993 1853734
12097 1853734 1805902 1750325 1713570 1645981 1581978 1527827 1487623 1438170 1425187 1405263 1386956
12086 1386956 1368223 1344465 1294945 1270842 1240717 1213911 1177633 1137210 1082535 1031416 1017022
12075 1017022 991889 958120 944694 950914 932890 908062 889765 899643 903236 871847 856227 857438
12063 857438 830053 811228 845610 874657 907439 915071 916534 940152 948635 967189 1014269 1081232
12051 1081232 1132536 1194231 1296645 1444564 1596533 1735957 1846845 1906071 1915559 1886822
12041 1886822 1819484 1733041 1674878 1626608 1584387 1527765 1499987 1498756 1473682 1474123 1485940 1464718
12029 1464718 1455975 1467055 1458119 1452865 1446360 1467941 1497817 1549760 1601750 1636429 1659891 1667341
12017 1667341 1653047 1666536 1670877 1640912 1627810 1582427 1480200 1362020 1275810 1197666 1083543
12006 1083543 956157 858350 813966 771864 701446 639104 603143 585344 617856 616707 640575
11995 640575 665782 725470 799953 843836 920251 999019 1099671 1257956 1436585 1573251 1609270
11984 1609270 1570104 1480551 1345098 1215749 1112520 997618 902409 817668 786053 748729
11974 748729 726502 699950 646058 598399 545904 491877 415641 338387 254546 168088 119840
11963 119840 89884 49486 22989 -15060 -58233 -69800 -66136 -80408 -81606 -61696 -36607 -663
11951 -663 28521 68452 92280 102184 96549 79012 82204 90888 81328 86088 82230 59343 46350
11938 46350 13806 7879 -2744 8160 18237 20229 20451 44885 62762 36756 1673 -3268 22316
11925 22316 46779 46923 69961 63116 54249 67284 78816 88279 85589 87820 89087 100171 103729
11912 103729 99775 127167 161285 157848 129312 91650 75652 123875 136860 102892 89492 90878
11900 90878 74607 49074 56517 48357 38892 45311 33137 50508 68967 79409 82340 76365 75888
11887 75888 76580 92530 102670 104901 98362 104234 108547 81039 64384 54313 41727 64682 85572
11874 85572 95424 98312 112828 97996 100457 99248 109199 86851 52369 40581 68240 75942 89126
11861 89126 96998 103479 96263 71763 59716 68664 81023 66129 77606 97796 106290 110822 85615
11848 85615 62011 29424 41451 53634 80496 81808 41265 32147 27926 30202 22273 28496 22154
11835 22154 23734 15736 20965 22465 34807 29861 32387 29662 56266 52863 37077 29313 19195
11822 19195 13953 20944 35442 44867 45221 59261 75946 68333 66852 53278 50878 26652 9013
11809 9013 8584 15408 46460 66681 66688 37240 6180 -9121 -23632 -20039 23408 50218 41426 69173
11795 69173 65117 70894 58298 22396 22925 5350 27822 39611 39881 28430 35495 55001 34669
11782 34669 20936 29154 21209 2631 -8072 2620 24495 20074 33487 27481 42748 27261
11770 27261 21285 32393 23385 18491 36640 38766 34176 36323 48380 77620 85569 84428 95035
11757 95035 106570 129338 138113 167410 203240 208058 226256 279422 320431 340248 372527 463506
11745 463506 577479 690051 824604 991893 1203566 1440453 1672126 1885840 2049198 2128343
11735 2128343 2145495 2117026 2041240 1883062 1698529 1484300 1261981 1042179 840273 688918
11725 688918 572580 488399 388350 324458 265295 235026 228132 194600 180934 158144 108102
11714 108102 107886 130052 125840 96093 53010 63100 88218 100904 87343 60389 47411 68710
11702 68710 74360 69725 75461 57799 8429 -3738 17195 31024 16250 2082 23568 26236
11690 26236 23860 18059 22065 41668 55252 50235 26497 34062 55192 69259 71056 52057 18604
11677 18604 16746 5219 4735 -2406 -3758 -12344 -4673 5020 14422 23804 45265 61671 61190 79501
11663 79501 85158 46496 32735 46401 42375 12641 -15439 -6096 13950 1113 2899 13902
11651 13902 8109 11638 24553 38165 8708 -23171 -24371 -28324 -31845 -14978 -4489 11188 32165
11638 32165 43601 17583 15044 43332 55520 60768 74709 61057 36657 18766 10289 23063
11626 23063 30371 34791 8051 -20815 11453 40737 28870 31039 19124 19054 24438 43706 80273
11613 80273 78773 64350 64572 62525 78808 93529 65704 50921 53538 44714 14346 38302 42602
11600 42602 52178 65178 49949 50199 23807 20021 49918 69459 40589 12561 -10692 -10545 -4418
11587 -4418 915 11790 42167 39383 20995 34689 36496 38626 27301 16255 20587 14029 2535
11574 2535 15283 29199 20526 12273 11425 20336 -8102 -32995 -43867 -19351 15259 8752 -19587
11561 -19587 -53215 -30675 -19920 -11653 3182 -3923 -7626 6486 24792 14922 21538 15340 781
11548 781 13851 1331 25354 44782 33792 19030 24345 15042 -2892 5884 21053 353 -12485
11535 -12485 -5447 15665 24832 17522 14382 28752 43222 17940 18286 22463 19784 -7477 4685
11522 4685 29198 12971 -6830 -4308 9984 279 -23001 -8470 31502 37958 31788 35911 19815
11509 19815 19865 -14892 -13803 7417 16210 6211 -1409 7651 9875 36100 43698 25273 31542 48038
11495 48038 58842 56310 45662 4659 230 11959 1137 -1500 38153 37794 -2339 -5580 17246
11482 17246 12108 -609 13613 25797 26655 41642 17747 -1221 8547 5029 1723 19340 31870
11469 31870 17946 13784 2741 18006 39239 56005 44683 22340 -5815 -16886 8768 15247
11457 15247 -3725 -7426 1894 30500 17811 -4193 -13519 412 25149 29040 12323 -17672
11445 -17672 -16040 -5843 8532 -1469 -18756 -7685 -4934 -13467 -12330 1630 13997 -7520
11433 -7520 -12118 -2022 1789 16990 19887 11602 7628 -12003 -10910 8663 49175 65529 60754
11420 60754 46558 19567 24864 17601 9036 14412 14191 33901 40635 31184 21064 13791 30525
11407 30525 35228 13329 11549 30283 32616 16482 24467 28082 34709 31143 31167 61502 77968 82440
11393 82440 29112 9079 577 -12779 17260 6935 -11603 18315 26112 27910 4249 17680
11381 17680 38950 3424 -10350 -9081 -3827 -1143 34648 45585 37279 16819 3083 -1971 -8025
11368 -8025 4746 26497 22729 33348 53164 64628 73935 69690 36500 22438 9153 10265 -9531
11355 -9531 -9895 -9690 -25007 -21939 -4296 17910 33095 56015 53732 76059 60884 65055 59751
11342 59751 38039 55208 38270 30120 48167 64417 59806 58117 45013 5367 -18817 -20676
11330 -20676 9457 20114 15183 7422 26507 22849 20637 25279 16768 10891 45685 45782 27834 12284
11316 12284 32369 40334 32530 7052 4270 -7164 8213 32749 32929 27607 50357 37206 28986
11303 28986 25360 21076 41460 25146 1078 1182 20786 40434 49570 54905 39362 -14133 -1484
11290 -1484 47877 65392 59419 41993 39975 48245 46366 30746 24214 2360 40766 42643 33256
11277 33256 55311 83994 71706 54914 76622 68582 75303 64944 20884 27606 56143 47350
11265 47350 46297 49555 16911 34519 74772 64373 31604 24573 27405 45863 62558 33248
11253 33248 37691 19901 6769 15436 17948 37242 66661 93059 88923 77595 66251 68945 70836
11240 70836 43286 27626 32731 31836 32246 42877 38742 57260 53210 39601 42922 51454 62355
11227 62355 40429 52159 75289 74315 54172 50689 40297 33972 32821 27942 41613 61466 67880
11214 67880 49893 16088 14273 18631 31174 44323 58335 46937 10579 14739 30270 5227
11202 5227 7939 37927 36122 34856 56343 74572 77384 83891 69419 69036 70104 63977 43040 34026
11188 34026 45151 49816 47585 53028 58392 80360 91285 89711 70672 63928 68930 77149 95802
11175 95802 96544 121700 134591 107501 89572 62961 63278 58329 46276 56642 81324 85312 84361
11162 84361 69352 59484 69241 66143 86880 103077 84207 82419 114970 104146 80836 73402 97850
11149 97850 94270 92133 106890 96051 99032 82857 61501 62700 71152 63199 69667 59543 64043
11136 64043 53579 33855 37139 63064 74666 50282 48028 54584 74756 79862 86603 87143 79611
11123 79611 76451 83365 84178 104306 104970 86318 64881 62669 68288 76247 82964 96693 112752 96157
11109 96157 51580 44825 46998 43922 49835 68341 51889 52788 42480 52672 48075 66253 99039
11096 99039 98104 97419 97440 96963 68549 80468 105758 113476 95262 96389 70362 67132 88445 112299
11082 112299 122789 123694 132039 132612 124630 102961 117216 115986 126296 137807 104639 113655 124336
11069 124336 111388 116591 87575 85391 108347 106319 83213 100728 121018 110760 106911 112395
11057 112395 135320 147462 143990 150415 134892 140470 138067 123700 102843 113754 113580 81808 75131
11044 75131 86208 115659 95809 73754 54414 86810 135181 155469 150649 128477 131792 153338
11032 153338 132523 120593 113288 99162 119079 131847 158409 181219 170452 156457 114185 97939
11020 97939 87447 102815 123320 143883 139898 116264 114308 135258 143375 115058 91031 120976
11008 120976 146562 106507 84957 108240 108005 137727 155966 155212 131157 130414 163713 180975 182160
10995 182160 159974 149593 142853 143771 160457 153917 138454 163211 196849 186509 145922 118802
10983 118802 121068 142751 155882 141382 129154 128266 111950 122385 147325 164427 171045 162468
10971 162468 144866 147949 151003 139942 141064 146649 127822 127401 143607 171116 176947 180894 205976
10958 205976 220687 204520 192815 214820 218192 208753 198117 220750 230921 223488 240514 229784
10946 229784 251666 248850 219719 211025 226601 221192 211525 211268 209812 220122 216679 212986 230725
10933 230725 235225 236774 237451 236237 246280 273361 294762 279419 252860 239315 256259 260219 240079
10920 240079 249815 250068 280496 310043 332475 316208 319823 342322 377730 437450 487282 533726
10908 533726 562333 576614 618340 704115 770346 902026 1017967 1097518 1166472 1193815 1229267
10897 1229267 1281799 1279882 1203436 1123275 1062918 1003682 940932 877590 836951 826667 821967 838179
10885 838179 871409 894365 941910 979463 1003928 1044093 1054314 1055310 1088653 1121119 1173484 1238166
10873 1238166 1300337 1346370 1416447 1473701 1503440 1491562 1467084 1446083 1398756 1340740 1254520
10862 1254520 1198766 1159482 1147758 1150835 1147688 1131622 1097688 1049885 1015009 957864 921436 911832
10850 911832 899584 923691 937015 931116 948630 996918 1043653 1068937 1100607 1136952 1185868 1217627
10838 1217627 1194755 1147168 1127965 1089497 978778 893230 785464 713380 662502 606733 543442
10827 543442 536035 521197 514184 512449 499961 471522 448812 446754 450546 455165 453546 415247 369204
10814 369204 381118 385055 365852 344903 334918 342558 330491 314392 309690 300157 310443 324259
10802 324259 331538 319010 325706 293584 311688 341289 337950 318727 309416 295608 322259 324556
10790 324556 309619 307215 301444 303018 329967 345826 353461 342849 320466 311150 324807 336911
10778 336911 337361 362000 367474 345443 330422 341258 326841 319725 303554 319251 343601 357065
10766 357065 369559 402154 438634 442219 430406 392814 361944 365659 358615 366033 371996 368391 376941
10753 376941 375337 363520 375920 373763 389314 401672 388309 388469 424046 445127 447877 478858
10741 478858 487724 500674 511317 507285 505308 492452 518796 559770 590838 612941 570602 528465
10729 528465 485035 459531 479076 509199 533525 535367 538645 568419 543059 545589 552399 556675
10717 556675 586743 629471 630947 625029 611210 632235 679920 707962 714096 722317 718349 759101
10705 759101 790390 777150 741777 740627 729915 724035 700036 679537 667859 678162 675345 687343
10693 687343 688683 702633 689663 698453 721551 738468 766431 808383 826122 833684 848493 855297
10681 855297 857447 875849 877589 876841 894390 890043 870725 879012 863688 829357 806583 772750 747021
10668 747021 734089 718586 717231 743208 763923 769229 783724 810037 797369 776179 812006 857097
10656 857097 880507 880085 884386 896283 913911 959200 967832 954335 924580 923078 945480 950788 961064
10643 961064 974175 984251 978348 959940 958174 966448 980342 971837 985159 995569 995538 1014010 1022042
10630 1022042 1036415 1022573 1011649 1011680 1037154 1082353 1128020 1161104 1186810 1216906 1232534 1255605
10618 1255605 1276314 1299259 1337137 1361533 1363905 1372978 1422767 1422259 1388393 1379207 1342715 1332698
10606 1332698 1311759 1295215 1311265 1349269 1414414 1459220 1538811 1631409 1699613 1773062 1810518
10595 1810518 1833464 1867958 1915682 1911115 1899010 1863306 1827372 1822650 1800690 1799391 1783876 1737577
10583 1737577 1722121 1731435 1747158 1767529 1769425 1757772 1763938 1753881 1718408 1709662 1688908 1680165
10571 1680165 1689186 1700197 1747758 1770859 1777483 1770581 1795708 1829596 1856802 1875153 1888199 1956007
10559 1956007 2032486 2093668 2119855 2139870 2182707 2245868 2277808 2321642 2373286 2417893 2439477
10548 2439477 2458651 2500951 2545277 2589588 2635547 2710501 2811864 2903497 2992381 3084398 3198875
10537 3198875 3315215 3439281 3559963 3679093 3821121 3958414 4084793 4225802 4347522
10528 4347522 4482075 4627651 4784524 4959231 5133836 5335944 5550306 5778487 6041411
10519 6041411 6273482 6555290 6843462 7156344 7492173 7840444 8220630 8656461 9115275
10510 9115275 9629343 10181023 10815016 11488826 12231582 13104705 14107223 15194332 16447956
10501 16447956 17830101 19406491 21234140 23300918 25611802 28281771 31407730 35073725
10493 35073725 39433973 44649660 50943703 58611299 67945371 79316083 93103172 109674989
10485 109674989 129015233 150522311 172490020 192074084 206055534 212029211 209592727
10478 209592727 200121440 186091169 170214230 154654815 140866437 129705894 121490930
10471 121490930 116311417 114155298 114832821 118175776 123844085 131220750 139434365 147448813
10463 147448813 154241598 159199505 162365358 164523903 166920220 170737095 176830797 185592673
10455 185592673 196824309 209600519 222360791 233039805 239660340 240871963 236470356
10448 236470356 227499245 215752878 203187694 191479688 181790621 174618139 169683989
10441 169683989 166153699 162860103 158684180 153015158 145886133 137776605 129512514 121938283
10433 121938283 115805246 111626843 109753563 110381261 113635093 119558508 128123124 139092679
10425 139092679 151894515 165353641 177689911 186582115 189926638 186611438 176983787
10418 176983787 162626028 145731277 128269809 111626352 96555007 83416191 72200713
10411 72200713 62740742 54800053 48167629 42601546 37892090 33873730 30378850 27377380
10403 27377380 24828924 22582873 20621947 18929538 17451370 16139899 14978911 13973543
10395 13973543 13099852 12301188 11544078 10862228 10260168 9707882 9204761 8735153 8321733
10386 8321733 7937967 7594213 7265703 6931757 6606525 6333808 6079431 5869788 5684244
10377 5684244 5487877 5342386 5147476 4959172 4769356 4608974 4460024 4321790 4201349
10368 4201349 4089164 3996644 3856860 3755103 3687953 3578280 3525208 3495039 3427229 3361725
10358 3361725 3294936 3252983 3219200 3124274 3056471 2985601 2895021 2803593 2756714 2680348 2599977
10347 2599977 2529529 2452796 2391258 2362936 2335834 2298049 2254302 2183802 2157461 2129229 2105483
10336 2105483 2063592 1999244 1953082 1913021 1908587 1883358 1821704 1798554 1781755 1743864 1702771
10325 1702771 1670599 1649596 1649517 1634705 1609062 1582754 1576814 1564180 1570334 1600782 1598433 1592799 1621401
10312 1621401 1624517 1615134 1601869 1588163 1610179 1597172 1563925 1545356 1514875 1474541 1421775 1385296
10300 1385296 1353771 1312109 1261962 1240349 1212173 1162698 1121346 1061513 1021970 992411 943145
10289 943145 926003 842773 747560 698172 653236 612508 606323 588709 573076 583418 576061 550264
10277 550264 551320 540333 531456 564709 576193 557520 510360 478246 421800 392484 378992 390132
10265 390132 400275 392100 415770 420526 400402 377684 392054 415487 414677 401183 379871 355499
10253 355499 331189 316999 317294 302044 292474 315327 320317 311676 274930 261988 275458 295435
10241 295435 298997 299250 301013 320306 308322 313934 330102 338210 317726 284912 256432 244772 243493
10228 243493 243281 245353 265101 263270 232586 197955 176476 171438 147453 117065 146889 195468
10216 195468 193171 177528 177026 168139 183022 199579 211222 216665 195945 193189 199718 210869 224248
10203 224248 235331 222189 180060 165787 180152 192649 179341 176237 194834 188695 167435 163783
10191 163783 158374 154176 161229 169193 168676 184989 202450 185083 181728 191403 218713 199019 190450
10178 190450 201183 219893 234855 227239 221302 201888 190318 192010 198664 198139 185058 207030 213242
10165 213242 191515 175909 183878 190077 175294 141525 150576 170076 179538 129884 101575 103056
10153 103056 114112 97738 100949 109715 132444 182358 207523 243307 274738 289724 297114 305519
10141 305519 291577 288896 298975 269694 248095 222696 160239 138518 143046 116470 85390 116298
10129 116298 125085 126959 85584 90052 89975 79218 85895 112654 124047 114968 116934 129543 155628
10116 155628 137691 108816 111005 106204 94152 88213 115023 128817 131377 128583 140367 130725 86983
10103 86983 81498 95210 115244 116816 123518 103095 81452 91704 123045 124820 107951 92218
10091 92218 56799 48770 53281 52447 54896 91110 100295 91676 121604 135101 130184 136932 155182
10078 155182 146044 147431 159142 160696 201922 197628 169530 185148 222109 258446 280394 306706
10066 306706 354832 397222 443694 517597 608923 700675 812376 905118 999960 1051604 1096530
10055 1096530 1110317 1100570 1037842 935670 835175 760998 732331 699155 656942 648709 660790
10044 660790 686466 703882 757324 820914 865710 893420 910158 916929 940000 938953 946761 991565
10032 991565 1040769 1116541 1161835 1210531 1297756 1331205 1323053 1289201 1265487 1219540 1151618 1063732
10020 1063732 978432 949956 942365 930860 926079 895876 869771 825162 758655 715386 688330 675851
10008 675851 656163 637821 660857 689214 693779 728395 800169 855077 909858 959989 1050335 1072432
9996 1072432 999585 929025 858568 788619 705288 621384 553952 473242 406657 355313 306893
9985 306893 261210 221633 207193 210400 197021 129149 106981 114864 101115 90854 105329 87509
9973 87509 53264 40334 27507 42247 52741 11619 37584 61974 79461 87279 124532 148536
9961 148536 122642 62581 35523 26443 37777 33128 34302 37919 22089 21299 9083 -15540 -35395
9948 -35395 -32823 -22265 -4317 37159 11173 5864 26432 23551 17877 10726 -905 -29931 -37673
9935 -37673 -10732 46098 50019 35248 6921 -4110 -8111 -41560 -40669 -30469 -39904 -36354 -37181
9922 -37181 -36337 -19320 -8005 -24642 -17397 -8258 -5294 -26573 -16378 1358 8083 18617 22960
9909 22960 39090 25853 -2236 -40827 -60408 -72391 -74977 -65712 -54564 -33473 -1085 23116
9897 23116 18343 20960 -2534 1025 -9471 -29092 -4319 7835 16969 16944 16780 12499 -13135 -40729
9883 -40729 -76573 -63383 -32834 -15812 -10497 -11506 6203 14081 29832 12967 23021 29874 45329
9870 45329 35928 4453 -4996 -17604 -8081 -177 6585 15844 1931 -12831 -34277 -18654 -9849
9857 -9849 -3501 -11612 3412 7187 -11533 -6872 -8919 -8981 1265 5861 31503 77745 75807 60521
9843 60521 42128 31045 21823 12573 -8865 -4161 -18353 -23975 -12061 -11692 -2599 3925 16136
9830 16136 31485 5713 -16910 -31369 -32147 -25315 -18783 12364 3078 18767 53119 48385 30336
9817 30336 21183 9971 7518 -8321 -11847 -22335 -17140 20627 -5323 -37373 -43537 -49163 -51306
9804 -51306 -25619 -3642 -20838 -40858 -42123 -49937 -63465 -34900 15862 48469 58381 25916
9792 25916 5208 24765 28345 17773 10676 5107 -4196 -9367 4587 23271 -5550 -25190 -32484
9779 -32484 -26266 -30435 -740 24014 24936 34898 7836 -5231 11372 18887 19072 6908 -13124
9766 -13124 -18324 -7530 -17219 933 -6017 -29979 -36825 -39894 -49435 -33341 -26773 -15586 8792
9753 8792 19839 24323 4200 14816 23181 4210 21272 46319 57496 36611 38882 15978 18097
9740 18097 -66 19534 30668 16870 6086 4453 -1945 -14825 -36889 -37993 -31103 -44343 -30701
9727 -30701 -20553 -7331 -2765 17533 57153 44107 20708 11284 -10971 -28002 -30030 -8445
9715 -8445 -17075 -33256 -41266 -45973 -44323 -24033 -7171 8733 4995 11472 11302 5409 -10578 683
9701 683 23483 42508 63268 72020 39711 7471 -5953 -18690 -26455 -40646 -50552 -19787 8371
9688 8371 -11367 -29414 -15154 28027 45653 30319 32443 33871 16202 -19663 -11182 -10963 4017
9675 4017 2858 38363 61239 77043 87143 66879 43216 58013 61477 62730 58655 30940 13470
9662 13470 19186 24297 28325 21462 16105 12690 24583 43916 62367 80768 40673 10536 850
9649 850 1867 13400 16976 4102 345 22457 24306 17938 23019 14295 1113 13484 18978 11633
9635 11633 40874 57937 44844 42697 26624 23784 24366 56145 59223 59915 57854 71629 99197
9622 99197 91376 79270 113947 131392 116456 106344 97331 85357 91727 66503 69782 90804 105625
9609 105625 98350 88483 104890 114286 106788 102721 109856 106795 106342 113331 106959 126418 123189 101980
9595 101980 76044 78903 103327 128317 127150 103302 107678 135115 152058 138471 137715 143793 145158
9582 145158 136335 116496 106517 96133 104966 129771 145777 160730 161093 184894 203514 211085 226671
9569 226671 210109 202140 206274 226024 235955 236979 226469 204915 223594 250272 259260 264049 245191
9556 245191 227506 245438 254012 281921 285923 295389 291512 306363 321227 325607 345163 355344 366579
9543 366579 388853 388426 376480 385128 409221 444644 463301 493593 524256 513031 496069 495384 509713
9530 509713 538787 561742 570226 591156 617766 628188 616371 656950 686026 705629 723508 744196
9518 744196 764593 793887 807334 842729 892445 904696 886397 904860 932813 976674 1024575 1066543
9506 1066543 1107399 1135409 1138906 1173812 1220275 1268500 1320544 1347566 1358349 1390617 1418380 1437864
9494 1437864 1469470 1505482 1533091 1545864 1569159 1607471 1637977 1619519 1611248 1633081 1643754 1657828
9482 1657828 1650506 1611213 1608625 1635016 1637686 1623474 1581044 1531563 1511779 1494264 1478933 1460725
9470 1460725 1418354 1381836 1364228 1337214 1308224 1288400 1231084 1179408 1149297 1137421 1089462
9459 1089462 1078549 1067261 1020164 985972 964476 938341 891309 871668 823760 790163 761409
9448 761409 701927 687459 682519 720586 703378 664528 622239 590191 577538 577721 579145 543853
9436 543853 510303 468778 468313 469155 463844 453475 417470 395539 395980 383950 377598 380894 381537 365765
9422 365765 326130 318514 319596 308754 316026 291532 282713 263962 267331 266818 259135 266237 239024
9409 239024 216180 206263 201758 218680 214655 201562 212964 227260 218092 186234 154207 161558 176949
9396 176949 188022 193940 200305 194592 205105 171409 164847 167411 163672 134853 129913 110630 111223
9383 111223 113844 100224 111067 134959 138895 133604 139679 118973 117500 117653 116761 106511 103929 119325
9369 119325 113107 112133 108379 111600 116270 114921 106069 59552 60828 74051 83190 111095 125091 111138
9355 111138 112115 95147 65759 61542 82591 55427 52144 58083 71930 79817 79696 83509 64500
9342 64500 43793 32980 25832 16821 25439 23272 22452 50021 49468 28193 30260 30480 23167 24651
9328 24651 33155 28723 60822 75558 48512 20632 18284 25718 6317 11174 1503 9824 38559
9315 38559 42237 40823 33354 20488 7982 20061 39588 51153 57024 57828 35309 -16648 -8370
9302 -8370 19355 33119 29094 24874 16915 276 20533 7348 -1514 2166 -8884 -20796 63
9289 63 44990 54093 54539 21581 16255 -10822 -15785 -8 -3295 -3341 -17252 -2187 7793 -8601
9275 -8601 -16597 -27877 3692 6369 12365 2153 -5576 4193 4283 -5495 -16090 5509 17480 16640
9261 16640 8577 5150 17300 14224 -1172 -10575 11065 5891 23879 46811 77036 84062 70197
9248 70197 60284 61057 56967 48077 52184 70710 72373 26080 16 1769 25300 38330 32604 26347
9234 26347 22042 7323 3203 12965 -6143 -8286 10313 20283 -3030 12672 21655 6511 -11992
9221 -11992 13927 36474 14443 -8316 5455 44050 70214 52812 16789 21300 40048 32796
9209 32796 33289 21090 30771 66640 59241 15341 -14787 -8835 10853 32070 42760 37589 41716
9196 41716 47347 36116 17829 5286 -12835 -17002 -22428 14220 30272 18513 32593 28400 67560
9183 67560 101431 74618 32272 21950 33389 41167 54947 34604 35481 47464 34379 53482
9171 53482 49250 36619 38875 44250 60970 61109 68248 69501 38385 45867 58237 74234 63099
9158 63099 36931 38254 12965 12415 19683 40761 57703 71659 67204 70616 50675 16701 38622
9145 38622 71851 61630 40058 43552 24625 6033 8106 23178 40215 56664 32103 32899 29687
9132 29687 2511 18021 34495 30374 31121 28556 43096 44165 57255 61909 90499 118975 120901
9119 120901 112900 88206 85430 93468 92499 77115 68594 77913 76412 49195 81305 78106 72551 76967
9105 76967 58826 52065 57144 39484 39381 42870 49471 45927 57703 56192 76669 68050 64338 67495
9091 67495 57705 57313 54428 68036 83862 57903 17206 26575 55073 60590 43204 43333 33332
9078 33332 42614 68314 37991 20049 60651 74823 46109 45694 40097 59574 73591 57014 51577
9065 51577 23697 41157 30648 16098 27750 37851 36701 38457 33229 19074 9052 5291 17166
9052 17166 13211 -14126 17278 39865 24644 2787 -173 28127 32846 24015 32027 43655 41260
9039 41260 31229 15113 10482 9977 19186 2934 2190 32728 6256 -5718 10518 37807 21984
9026 21984 -11831 -6121 27708 53282 59322 31375 36705 19311 31873 65433 57456 37606 34300
9013 34300 35904 20146 -12444 -38036 -29048 4683 14583 11568 -6071 -24446 -9208 3776 -11324
9000 -11324 -35110 -24049 2855 24336 41069 33472 7450 11177 7665 -2366 8323 20566
8988 20566 18727 2289 -16767 -13267 807 15465 18740 -1024 -19078 -6013 14587 13483 -14146
8975 -14146 -21198 -18649 -40406 -54919 -43374 -42120 -59064 -49583 -47234 -56725 -65374 -83135 -41046
8962 -41046 -12044 -8458 -41476 -46473 -24439 29056 41055 15895 -60725 -78905 -57076 -30067
8950 -30067 -8390 -15238 -12593 -651 6142 -18803 -9984 -28359 -28120 -24763 -42538 -17003 12245
8937 12245 14424 18903 6127 -20019 -14505 -12893 -19292 -47327 -56154 -47309 -25049 -24142 -18284 6938
8923 6938 9925 -31569 -54032 -53718 -40676 -43494 -59102 -40396 -48764 -35480 -5415 -7246 -30501
8910 -30501 -35319 -19361 10614 32469 21749 2860 -7141 -7264 8464 -18794 -64173 -60561 -38800
8897 -38800 -20672 -17250 -16470 -7378 -21539 -39759 -59897 -71812 -54759 -39688 -29020 -28725 -26625
8884 -26625 -21706 -15737 9454 12162 -10207 -7192 -8267 -46937 -32078 -4132 -27196 -8733 -9543
8871 -9543 -15415 -19961 -13772 -14491 1165 3843 11588 1686 -5140 -16859 -40950 -36472 -11900 -4327
8857 -4327 -6313 14339 26795 46387 58149 33472 1836 4283 10812 5825 -11224 -3344 8546
8844 8546 4076 4902 18828 62569 60247 36020 25060 9630 3244 1276 16470 4573 -1549
8831 -1549 -32363 -46849 -19190 11320 27667 49557 50959 16922 -4827 14182 26057 11891
8819 11891 -6932 -11718 6904 24031 29218 16113 -5770 -6790 -5641 -5223 -18246 -17099 -37586
8806 -37586 -45505 -59459 -57380 -36508 -42366 -34004 -31295 -10207 -3892 -39992 -24301 -13296 -19518
8793 -19518 -28384 -8995 30928 26189 -4634 -6781 -20571 -24893 -29156 -2488 8287 -15231 -47643
8780 -47643 -39113 -9710 2207 -7312 -33218 -36407 -11507 -7048 -24566 -25339 1056 2007 -12989
8767 -12989 19092 53425 64693 48812 62116 70509 51329 48121 61990 72652 71807 47250 42118
8754 42118 54798 38303 45654 48290 35594 31747 22805 12557 16870 -20871 -40607 -8964 -16424
8741 -16424 -42938 -44136 -20457 22534 45079 51350 14069 7314 -2785 -2041 11699 9704 11176
8728 11176 32863 29959 40742 35754 27229 29528 17095 12621 10721 -5832 -19545 -7559 13408
8715 13408 33635 44704 62712 67468 69959 34761 13885 35739 55893 54413 66439 79927
8703 79927 89503 89588 79044 74807 87497 129994 157692 130401 107470 65317 51818 82082 104215
8690 104215 92059 73454 55706 47349 33241 42072 47708 55505 64901 86427 98283 102301 101334
8677 101334 117575 108668 96238 110828 114260 117813 95853 94232 98452 111319 112851 95548 88411
8664 88411 86950 103820 102019 106511 103581 113199 113145 113338 78183 91058 102077 103230 97586 129668
8650 129668 125643 125978 157392 141763 141372 179920 196347 194715 167966 139950 115478 122537 154100
8637 154100 164071 177765 177696 191894 172924 178533 177345 166346 183244 186142 213099 250606 263027
8624 263027 318384 385688 426379 431822 412448 369012 362771 366223 339190 296189 306591 313309
8612 313309 297933 292495 291173 274096 252264 271052 301405 333739 326913 309499 317690 326541 364426
8599 364426 399387 374317 363445 382383 397571 403749 396781 408660 445383 480008 541336 579424
8587 579424 594121 616257 655095 724237 799980 881467 962740 1067587 1198203 1331379 1453500
8576 1453500 1580305 1717350 1885675 2029332 2118580 2226882 2280011 2212109 2088226 1942164
8566 1942164 1762061 1535917 1335066 1156762 998673 861195 743029 621743 550213 510321
8556 510321 451975 387785 336599 331313 294735 268089 244775 212875 190431 157900 136084 120954
8544 120954 124933 124713 139039 151710 155413 149340 159995 133721 117528 109828 97975 97459 93200
8531 93200 86490 98433 82540 72721 66612 79996 96919 83445 95102 89247 68439 58069 44085
8518 44085 62076 98971 112590 73878 27252 24614 44631 42179 31038 40560 56804 31272
8506 31272 18363 -354 26746 36433 25412 32680 30659 33649 13045 7335 17285 29985 33842
8493 33842 51480 33661 21080 41747 42962 59452 48457 38429 34529 73325 61068 14686
8481 14686 26441 35201 13720 5158 5662 10928 17102 30883 44670 28434 5800 -10141 -19236
8468 -19236 -26149 -25579 9402 17131 20853 14652 -6408 -3780 2408 -4325 12122 24904 31067 5583
8454 5583 -19256 -40233 -31260 -15636 19118 17367 7570 13072 42148 53095 27783 8254 13395
8441 13395 12621 -2504 7356 -2436 -19352 -3589 20604 43405 9731 -4935 -2361 -18717 -12074
8428 -12074 590 4542 -2346 37060 54571 41052 20816 22287 30940 22312 -4660 -22185 -21993
8415 -21993 -6413 -18198 1744 8506 9886 14191 24766 35636 42173 52783 56430 47310 15037
8402 15037 -7052 -13149 -2566 -19437 -12621 41773 42364 27376 29814 18289 11696 12000 10614 14621
8388 14621 48461 44315 866 -26287 -12896 3831 5737 4108 4893 16411 19269 39468 49421
8375 49421 23622 24756 32357 26990 18188 -12546 -13742 11598 19525 29174 43136 50920 41652 31680
8361 31680 30861 27474 28860 18991 26441 20843 37105 22780 -26768 -13124 5034 -7719 6804
8348 6804 7939 11779 -3467 -16622 1584 -5151 19544 11650 -17336 -680 10409 -922 -8116
8335 -8116 7893 10117 16716 36805 33832 18979 13790 12319 28700 30638 35558 12900 7687 7564
8321 7564 35983 49053 41396 39331 19581 4826 24764 33540 2842 -5902 5557 1171 -6771
8308 -6771 -11535 -40665 -31479 -7750 9996 16066 3578 -7914 7698 26779 23669 4242 6332
8295 6332 -6965 -20233 -26903 -15850 -11471 763 20013 12456 11037 12543 20368 54104 41831
8282 41831 11152 7854 -31286 1162 28622 18897 35078 33724 26841 -5083 -23187 -16591 -14092
8269 -14092 -6286 6428 12049 -14917 -38537 -13257 15153 14070 -11542 -19354 -37552 -19660 27827
8256 27827 39545 28465 29474 41493 35208 30639 43764 11502 1872 5848 15121 5116 21266
8243 21266 20688 16499 20474 32546 11467 17874 49473 64269 55252 27025 10949 13736 27155
8230 27155 43667 49633 77918 71309 56565 44599 52107 47652 35995 27340 30170 35766 33163
8217 33163 24548 31037 52133 51268 56996 43897 10400 22346 53330 81472 47450 22562 32481
8204 32481 40179 68307 94379 103801 108483 123876 81106 66981 44608 38769 16860 33306 83987
8191 83987 96091 57467 52455 56615 48206 52703 60306 63601 71790 75009 88180 63698 31148
8178 31148 25743 29136 16592 11927 33086 49071 10039 3135 -303 3505 11319 18485 1899
8165 1899 -2123 24477 53923 29204 23721 36809 28884 24408 34247 54227 86500 74127 59749
8152 59749 65918 58846 39120 14545 17816 36095 21495 28384 35653 30008 23806 24329 47122 57978
8138 57978 47521 57776 44986 30687 3471 3607 7872 14661 21501 12938 17085 24835 39595
8125 39595 17718 -9355 4483 23467 30399 28889 3138 -14119 3847 4185 -15095 -6096 18023
8112 18023 15320 13215 14815 11271 18695 36524 62643 60632 68277 54421 30599 14753 5520
8099 5520 -17949 -41814 -17948 -13609 1549 19512 58117 44911 36410 48980 51706 49790 30872
8086 30872 -5134 -8354 27621 20295 19656 33356 28920 20526 31365 14954 15848 14911 6779 5415
8072 5415 38087 38578 17850 2788 26516 47235 57526 55005 35796 38647 55597 43880 18188
8059 18188 -12788 -17078 12062 6298 29086 31446 35274 48266 43652 45360 49336 31339 42791
8046 42791 58298 30333 36559 72635 67531 30300 39366 72876 77101 68527 78699 81403 86705
8033 86705 79511 52639 48834 70465 59369 72202 84766 79858 71895 69358 100767 139220 136311
8020 136311 136908 131084 129810 134984 132926 107457 122218 142801 137632 109289 94938 121351 138924
8007 138924 128646 128843 141781 124400 89282 86737 86288 87453 100270 129995 175435 214304 191177
7994 191177 199366 180686 141763 121361 109774 148821 161507 153979 162724 152579 146158 171650
7982 171650 208025 197617 219425 265008 294025 321622 337746 353384 340457 320398 274503 255084
7970 255084 248542 238815 228866 243528 223278 176758 144210 159981 168324 165352 170954 149886 137475
7957 137475 159265 186567 202565 165511 144277 135809 156140 154054 171904 214367 243908 264781
7945 264781 302552 321336 360118 385798 384116 371328 352481 368653 385056 405246 437269 459368
7933 459368 479131 470932 483384 465765 444646 419571 382364 392390 414979 418948 434924 425852
7921 425852 414628 376668 346052 363968 359200 313544 311625 336343 371076 382559 389603 403986
7909 403986 400904 404116 404633 411560 424177 419696 405418 425690 446689 467986 477122 471662 466318
7896 466318 476106 475495 468328 470195 465973 479512 467917 434728 439251 432352 432963 444749 438048 444162
7882 444162 467994 483243 496063 514586 499011 491234 466378 449043 434526 435021 428070 384780
7870 384780 351995 338252 338434 320259 298668 336512 324192 301954 306864 308777 313986 323782 326677
7857 326677 324046 311521 286264 267511 271570 271979 249445 218600 206106 187591 170282 161560 184118
7844 184118 210448 234265 239497 237139 250873 244630 230205 240355 247354 220894 192798 188975 187678
7831 187678 174392 170129 130107 108473 102407 87108 84350 105860 110090 106112 89281 73285 70979
7818 70979 55125 38103 30642 8820 -17949 12331 20477 31378 1468 -11307 -25479 -30874
7806 -30874 -25921 -26138 -26548 -22907 -16094 -24413 -5445 32164 25044 14974 8300 224 -21940 -16666
7792 -16666 11891 24317 520 -18599 -10862 14695 37906 44717 -12328 -28053 -18194 -7506
7780 -7506 -6395 -3157 11452 -668 26293 17498 1994 -3943 -3139 14279 12109 -10830 -14285 -15503
7766 -15503 7462 1412 -3347 12866 23715 48611 45084 14878 2641 26022 41452 44706 34094
7753 34094 4511 15455 17716 2216 -8281 -34335 -44184 -51173 -32387 -31471 -44200 -49814 -43626
7740 -43626 -25357 -28890 -32635 -36457 -17874 -12099 -21289 -38621 -35418 -31546 -24314 -10969 4809
7727 4809 6721 30555 8940 -11719 -28792 -25951 8646 36118 42265 16797 28378 26600 -6024
7714 -6024 -18883 -13387 -51193 -78985 -62298 -50377 -43132 -31034 -25107 -17004 -2576 28802 11427
7701 11427 -9792 -7036 -28272 -41129 -39251 -20383 703 7082 22670 22745 197 -13334 3915
7688 3915 -8157 -39198 -21945 -15993 -14818 3672 20895 11709 3451 -4475 -18016 -37965 -37291
7675 -37291 -59185 -52726 -12348 -18541 -24541 -28199 -17730 -10911 2974 -3290 7733 -26133 -55531
7662 -55531 -64336 -72472 -83363 -83980 -80562 -83608 -67508 -42209 -53255 -49633 -21783 -42489 -65004
7649 -65004 -51294 -34339 -30665 -51728 -79987 -76636 -58789 -22330 -37420 -60874 -38209 -4016
7637 -4016 -5243 -32943 -40480 -35405 -34887 -19671 -1449 -8119 -32244 -46221 -25254 -18128 -6353
7624 -6353 -1912 -18291 -21806 -49973 -64029 -43930 -64536 -63219 -51247 -42808 -41523 -59497 -66154
7611 -66154 -48419 -45337 -43068 -69011 -81251 -59631 -69784 -69921 -53823 -26182 10884 18475 -30696
7598 -30696 -36197 -17640 -18156 1028 -2353 -22249 -52693 -41838 -40019 -31028 -30072 -43380 -63302
7585 -63302 -70035 -63999 -46482 -25673 -9465 -2900 19512 13461 27013 13737 -13857 -24768 -27358
7572 -27358 -11283 -16457 -23205 -31819 -41837 -32486 -43527 -42267 -36795 -23043 -12137 -25799 -24318
7559 -24318 4051 -10378 -25566 -28292 -31553 -56037 -68542 -58631 -45898 -12470 -3518 -11526 15283
7546 15283 12178 25200 28385 1510 -3279 -34301 -36411 -33673 -4985 -8350 -28549 -13693 -7887
7533 -7887 2184 -12009 -24695 -24035 -10353 -24596 -41474 -36564 -31151 -33778 -49497 -48001 -51816
7520 -51816 -39829 -26063 -28733 -27545 3780 -148 -12185 -35990 -45659 -32828 -21455 6001 -1910
7507 -1910 -22592 -25662 -27705 -37450 -26634 1282 -17898 -55196 -79582 -42619 -16200 -16006 -31303
7494 -31303 -41670 -65935 -76604 -69370 -29004 -25016 -37537 -68557 -71414 -54773 -36909 -39262 -38677
7481 -38677 -19927 2586 -3680 4019 15306 26511 11905 -12142 4410 11462 -476 7087 16444
7468 16444 27394 -8925 -32116 -10841 -2948 2698 7018 22454 9051 -19485 -41424 -50054 -79072
7455 -79072 -83929 -91820 -83306 -59800 -43719 -21646 -12963 -12366 -7217 -24483 -45967 -44864 -22264
7442 -22264 -14749 -11463 -23097 -24602 -17599 -31543 -32199 -16723 21709 25572 14701 4630 9785
7429 9785 -1850 -30276 -17713 -19935 -18107 -35988 -49304 -48404 -29592 -27326 -42175 -29260 -30887
7416 -30887 -37957 -38354 -34291 -45526 -5109 27267 20636 -28209 -28410 -20893 -18270 -29979 -44354 -29115
7402 -29115 -30407 -52334 -32619 -7876 -22971 -25722 15395 -2079 -29266 -17814 -28273 -24959
7390 -24959 -24702 -5240 16262 4124 -35891 -50483 -44180 -29003 -36950 -24096 -15231 -30496 -26140
7377 -26140 -35164 -67543 -48743 -14464 -4850 -12605 -33858 -48560 -68637 -85601 -65796 -38173
7365 -38173 -31229 -28036 -29084 -37826 -37204 -30148 -40697 -33738 -27672 -33851 -32282 -48478 -55846 -65405
7351 -65405 -73522 -72408 -33650 6471 27221 -3766 -27005 -32847 -6075 -7487 11112 -2778 -34083
7338 -34083 -30756 -26795 -3535 -11118 -61691 -55537 -45276 -37218 -22659 -29360 -57865 -84658 -86369
7325 -86369 -85659 -73477 -47898 -42416 -54086 -36565 -34883 -37963 -12162 -8227 8476 -22529 -32533
7312 -32533 -29316 -21130 -5474 -9480 -15864 -38530 -36316 -23531 -17311 -24552 -25030 -39186 -52619 -46010
7298 -46010 -25449 -36888 -50685 -72990 -84509 -68835 -42225 -5692 -13642 -21425 -29279 966
7286 966 36800 54857 42242 -2224 8454 8852 15983 21843 5123 -22459 -10913 -19156 -48619
7273 -48619 -36728 -21398 -29888 -48819 -35060 -17621 -9469 -29529 -30679 -35076 -27443 -12199 -40174
7260 -40174 -57414 -21818 18853 48638 37857 10967 18743 2878 -12700 -19978 -31009 -31197 -7605
7247 -7605 6647 -13396 -5240 16135 8680 5107 -20607 -36415 -53991 -51063 -5757 24622 30093
7234 30093 41974 24329 19798 -790 -38278 -40038 -58467 -61205 -72850 -50320 -21170 -4580
7222 -4580 -21111 -37581 -36097 -31468 -19224 -7693 -3351 1681 -762 -16791 -10462 7931 7846 -9834
7208 -9834 -30527 -40777 -53506 -58880 -33185 -6703 -4611 -8463 -5905 -12316 -23570 -26267 -522
7195 -522 -2723 -14473 -9828 -7765 -1244 26107 43482 36994 6116 11415 -3266 -7915 -8357 -24648
7181 -24648 -45883 -66095 -60507 -46105 -14203 -7217 -23275 -23577 -29584 -24047 -19705 -14856 -42721
7168 -42721 -30873 -14524 -30885 -52309 -58934 -30310 -20179 -31494 -31098 -27003 -30173 -21235 -20757
7155 -20757 -14573 -11900 -14711 -21353 -46170 -49326 -39671 -33703 -37350 -40062 -24166 -64715 -86159 -94439
7141 -94439 -95200 -71669 -53961 -12389 -1849 -9137 -27377 -50789 -38802 -21133 -6701 -17760
7129 -17760 -37484 -56919 -51107 -25172 -10533 -907 23332 9534 -47123 -65873 -61106 -28896
7117 -28896 -9796 8757 -4049 18294 8248 -15707 -50365 -43788 -19620 -13121 -21926 -32124
7105 -32124 -34312 -50948 -47915 1343 23364 -20367 -42503 -41575 -39677 -24215 -18311 -23571 -821
7092 -821 2748 -11615 -17462 -27215 -19074 -15155 -12375 -26823 -47677 -33349 -7499 -6799 1921 3853
7078 3853 -5975 -20190 -40006 -34646 874 -10469 -28009 -46509 -53037 -59014 -35426 -50802 -58891
7065 -58891 -22588 -293 -12064 -6609 -15375 -18925 -5055 -1641 16069 19667 -9269 -13322 -16515
7052 -16515 -17302 -23097 -33713 -37783 -64078 -57305 -22375 17778 2028 -8536 14890 -2168 -36040
7039 -36040 -53258 -48638 -23683 -7134 1441 22670 8886 -25621 -41031 -26092 -38976 -50719
7027 -50719 -31769 -29609 -4609 -9350 -26999 -10335 -4014 -7176 -3836 24200 23561 -10788 -26548
7014 -26548 -13872 -24854 -50048 -45908 -24685 -24022 -32023 -36305 -13983 -29448 -22839 -15739 -3331
7001 -3331 -20095 -19898 -41883 -59874 -65286 -56173 -23057 -9576 -19668 -14791 -27403 -25096 -16325
6988 -16325 -40848 -52665 -55899 -47905 -47001 -30611 -155 10862 -517 -12878 -58577 -78512 -78196
6975 -78196 -78451 -63166 -57017 -45115 -24139 -36307 -47581 -25489 -26196 -27090 -25917 -52960 -87574
6962 -87574 -99511 -69834 -47602 -27594 -11091 -6433 -17516 -39355 -30911 -13804 -14793 -52733 -30126
6949 -30126 -14756 -25649 -19939 12914 9795 5761 -14957 -14695 -25373 -45369 -47903 -31272 1469
6936 1469 4986 -3109 -28277 -44590 -31575 -38147 -54629 -17855 -16929 -22513 -21473 -32316 -43589
6923 -43589 -36420 -28062 -36461 -43625 -24982 -19060 -18753 -47015 -63171 -52757 -15088 -17116 -43588
6910 -43588 -42073 -14573 -13117 11443 4737 -9525 -8847 5024 13567 8881 6653 -4382 -39209
6897 -39209 -34136 -14516 -27344 -30424 -48172 -75504 -72935 -57229 -65092 -70094 -62652 -55383 -39217
6884 -39217 -17100 -22262 -22036 -14124 -20761 -35428 -18873 -20639 -12152 -8366 -30827 -25700 -5593 -17992
6870 -17992 -17519 -17445 -37401 -40483 -25297 -20076 -30163 -42286 -26233 10193 40082 36729 36737 35069
6856 35069 27070 15838 23364 3044 6391 6457 8570 7097 12581 -22716 -19560 2149 -10704 -34181
6842 -34181 -17920 -26725 -33374 -60211 -63096 -60341 -47857 -46000 -38104 -68160 -55445 -35260 -23812
6829 -23812 -23509 -20641 -19814 -6081 7160 -3307 18024 33235 22016 25843 20756 -13254 -20523
6816 -20523 -32174 -28404 -14669 -2888 -22837 -15292 -27360 -21214 -1534 10019 -22998 -33984
6804 -33984 -20817 -32589 -49801 -62686 -36003 -18520 -28909 -39233 -14649 -7032 -7628 7779
6792 7779 6331 -5454 -7365 -21547 -34939 -46572 -38719 3760 -1217 -20389 -16320 -34274 -59187
6779 -59187 -58446 -60481 -40588 -5088 5923 14231 6374 -1768 -12568 -23574 -29594 -32833 -17144
6766 -17144 15422 2922 -23464 -29687 -32506 -32046 -24746 -36735 -35924 -32158 -34782 -21174 -13718 -14678
6752 -14678 -28717 -58045 -41599 -29039 -24228 -15119 -3931 1652 18774 25122 13308 -29239 -43926
6739 -43926 -22000 19448 52382 42863 12157 -15753 10101 34548 28832 30035 46986 79731
6727 79731 94396 92903 87064 71090 69105 80030 69656 60775 35299 36890 75856 108144 120479
6714 120479 123826 158932 204012 243055 292844 371564 492002 677188 909932 1297005 1780655
6703 1780655 2126544 2142253 1869539 1474365 1096659 820007 628941 461340 336817 290045
6693 290045 233929 182047 155443 121737 100451 104959 107825 95244 86983 50949 52825 86352
6681 86352 87652 80566 63746 53713 43763 46678 62489 64951 74389 67611 67079 29269 24686 30191
6667 30191 21713 7781 29421 53314 54784 18561 -4039 20045 9743 14874 28304 33589 31678
6654 31678 46219 7920 -20465 211 16598 15059 -3874 -14999 -19997 -15451 -30006 -16748
6642 -16748 -11063 -15213 -3382 -27699 -8918 16203 25884 15355 -20375 -51278 -56180 -41329 -30958
6629 -30958 -26541 -17955 -31778 -11733 -1855 -32095 -51903 -27301 -3610 -5410 519 -16942 -29517
6616 -29517 -17141 12536 22023 -7465 -8714 -38555 -60195 -42860 -18056 -13218 -23956 -33657 -19281
6603 -19281 -12022 -33361 -58373 -45019 -2402 16498 -23248 -46402 -27121 -29019 -20187 -6273
6591 -6273 -8883 -15513 -10207 -19453 -46896 -60790 -67632 -76134 -64755 -30669 -26704 -16062 11581
6578 11581 27913 17838 -6004 -15541 -24067 -37685 -36018 -24162 -16906 -27696 -24724 -6317 -934
6565 -934 -1802 -7833 -14435 -25198 -2860 -18377 -26744 -26529 -48485 -57213 -65857 -53866 -46411 -50288
6551 -50288 -49053 -35764 -23183 -16504 -21198 -31877 -40450 -9684 -16064 -35973 -25899 10027 17475
6538 17475 5480 -9498 -12225 -12757 -30895 -38436 -42161 -59809 -51823 -39034 -16111 -32227 -32647
6525 -32647 -28648 -40927 -37051 -36565 -34525 -47094 -41228 -44229 -35929 -26539 -3376 12355 10368 13397
6511 13397 -335 -21023 -17480 -7596 -20242 -27605 -39450 -26215 -56365 -52993 -54666 -43004 -35170
6498 -35170 -42143 -43154 -26785 -2092 4802 10385 -2190 -9819 -21718 -27236 -31572 -28995 -27798 -29244
6484 -29244 -25691 -26316 -34423 -35300 -15650 -16323 -29299 -39875 -50630 -44782 -45457 -40047 -52170 -52338 -26506
6469 -26506 -9009 -5296 -27416 -31118 -34304 -52921 -52114 -28825 -7561 -16719 7208 -8607 -11142
6456 -11142 534 3586 -8918 -15744 -41262 -51791 -35144 -43914 -43551 -31424 -20328 -32515 -24529
6443 -24529 -12052 4312 -10965 -21019 -10444 4227 13339 18540 17282 -5137 -17114 -45221
6431 -45221 -57974 -10158 32818 30624 9398 -44543 -80148 -54881 -46351 -29670 -32013 -21339
6419 -21339 -2802 11108 16828 18379 -5306 -25858 -10972 4263 17446 2408 -1185 -2862 -14574
6406 -14574 -6329 -10895 4503 -23100 -14096 17629 10465 -26260 -59289 -38630 -18234 -12803 -26116
6393 -26116 -24613 -31316 -6114 -19004 -42777 -46626 -62257 -38985 -42745 -58756 -66150 -48741 -17631
6380 -17631 3272 1847 -14090 -19515 -17716 3523 12507 6685 1943 4927 15384 12051 325
6367 325 -24060 -40311 -11541 6239 -21849 -55017 -35431 -49352 -43788 -21022 -25715 -30249 -48460
6354 -48460 -68668 -31131 -6100 6387 -12902 -18639 -22640 -11813 24648 11534 -44606 -55387
6342 -55387 -44914 -11360 10646 20463 12537 22204 10009 -7942 -27765 -28960 -25060 -8540 6554
6329 6554 -8047 -36038 -47282 -25732 5739 4399 -29623 -44597 -15758 -10164 -22019 -40307
6317 -40307 -53755 -47095 -15668 -9715 -16538 -7459 -20164 -26864 -39844 -30013 -13919 -18960 2670
6304 2670 -6058 -29569 -37127 -21294 -24935 -46082 -70953 -60488 -51740 -57515 -51494 -51683 -31386 -25983
6290 -25983 -18180 -32777 -45956 -49374 -24820 -11513 -10971 7813 20797 33259 25864 2756 13420
6277 13420 21587 26163 3346 -12642 -31882 -20249 -43784 -40541 -27940 -32035 -33421 -41114 -62061
6264 -62061 -52747 -52323 -27075 1979 -4354 4181 18929 6128 -1474 11100 9013 -6836 -40865
6251 -40865 -49223 -21256 -28129 -26924 -6612 4709 -8798 -13573 -9335 15390 15993 -9179 -33484
6238 -33484 -14269 5257 6564 38290 20719 539 -3309 -25999 -53450 -58312 -41548 -32992 -46645
6225 -46645 -68704 -46294 -28484 -19511 -6600 7485 -15491 -46625 -52565 -29821 -25830 -29512 -15032
6212 -15032 -5105 6367 7133 -9760 445 3320 -12435 -30247 -49820 -63643 -72955 -65253 -57393
6199 -57393 -14783 -13521 -23638 405 37226 39882 20820 26732 36414 6601 -272 16932 1332
6186 1332 -17836 -17233 887 -8764 5185 21391 25780 -3497 -33116 -12913 3910 9530 -12601
6173 -12601 -4779 -5978 -36768 -56499 -62818 -66521 -66067 -46015 -22382 -10657 1995 8098 2972
6160 2972 -7905 -11407 -223 -10817 -5833 11795 24381 14377 -1092 -9981 3761 2915 -46101
6147 -46101 -56829 -21158 -14218 -16943 -42258 -79054 -49360 -28162 -24537 -24853 -44471 -45604 -57656
6134 -57656 -57911 -25019 14043 24067 3313 8382 2198 -34771 -56669 -41807 -38187 -22918 -26357
6121 -26357 -43370 -31886 -5131 12504 3622 -10942 9721 46159 10329 -13489 6757 34019
6109 34019 15101 -10914 -34787 -18687 -24458 2900 -8017 -15101 -25998 -5264 20738 8010
6097 8010 -13266 -11928 4243 -7231 -16588 -23450 -32021 -31951 -34306 -62560 -64852 -35693 -23648 -20950
6083 -20950 -40349 -54361 -44872 -29000 -37253 -28047 -37283 -54273 -56184 -44921 -40790 -28234 -2656
6070 -2656 22081 32996 25352 12771 -8031 -5605 -26427 -25465 -47793 -57806 -61624 -53788 -37558
6057 -37558 -20088 -45084 -41690 -37617 -31375 -16241 6654 -6448 -3553 -5849 -31501 -27786 -12910
6044 -12910 -15079 -15626 -21574 -11930 19708 31574 38287 15145 -34865 -51845 -44945 -36182 -25221
6031 -25221 -20214 -26487 -17440 3364 -23975 -33870 -27593 -44880 -55531 -38704 -11861 -597 7807
6018 7807 14877 -15892 -13341 -35542 -67513 -84851 -88233 -91340 -67350 -54792 -54469 -60981 -48027
6005 -48027 -35928 -35575 -35104 -45756 -65490 -57281 -39996 -30133 1090 14805 9191 -1247 -30834
5992 -30834 -35605 -28762 -48394 -54438 -37918 -54259 -42819 -3828 12039 9391 3190 16405 49940
5979 49940 51377 41163 17901 -2486 9351 16311 -8019 -6206 20779 53369 44021 29785 7107
5966 7107 -7778 -9148 -30756 -42826 -16293 4365 -28660 -48680 -35415 -13132 1211 -20208
5954 -20208 -20479 -17994 -15336 -23494 -54452 -50010 -24416 -32619 -42277 -35722 -24258 -40428 -53471 -59998
5940 -59998 -64856 -68405 -52675 -30503 -36993 -46915 -7006 23841 34520 21133 9589 5062 11901
5927 11901 12927 -10920 -19017 -13900 -25364 -53603 -72909 -84032 -82303 -58210 -43874 -46022 -22623
5914 -22623 18835 47388 29354 19329 9507 8957 26394 14610 5788 12481 13024 10932 -10555
5901 -10555 -10583 372 -7486 11099 4875 -8771 7432 15599 18122 16605 14025 12275 15378 24678
5887 24678 12180 2849 2663 -25 -26223 -41051 -59806 -46536 -30075 -12922 -12701 -26221 -17109
5874 -17109 -1022 32689 31434 32769 29719 13741 22604 14953 6930 -6353 -22337 1391 26739
5861 26739 30372 38853 27305 2813 16378 19406 6061 -9870 9939 4862 -3320 -25756 -19680
5848 -19680 -31032 -45365 -23802 -30017 -34764 -24384 4438 17461 18518 25027 16893 10517 519
5835 519 -36859 -41369 -36596 -50091 -38423 -46044 -64238 -58426 -53426 -25507 -7652 -16953 -28084
5822 -28084 -29960 -30420 -17685 12359 4262 -20450 -41816 -66569 -67031 -68985 -27615 1637 -4063
5809 -4063 15145 -14455 -47816 -32851 -1717 1714 -21221 -58985 -56662 -6614 23932 13049
5797 13049 6575 12669 8253 -15888 -14344 -13810 -30437 -44386 -26896 -27307 -49709 -44270 -56295 -48357
5783 -48357 -10876 3455 -40403 -71500 -80995 -77263 -89478 -71798 -33916 -15472 3765 18364
5771 18364 13955 -3223 -22830 -2808 4206 9744 -27719 -57463 -67831 -52363 -21867 313
5759 313 -10253 -22680 -37596 -32340 9155 26739 11669 8452 41892 43504 27979 -20127 -29809
5746 -29809 -17988 -11292 -5383 -7974 4086 3030 -2498 -21852 -36520 -28303 -49623 -60129 -13411
5733 -13411 17651 9568 -6399 -32049 -30747 -14504 7175 -17083 1720 10233 -1011 -28387
5721 -28387 -14466 -34991 -55674 -38872 -25028 -26291 -40760 -29030 1395 28796 31162 19140
5709 19140 25680 14804 -9672 -9724 -20893 -22796 -16618 -11555 -6390 -11321 -25417 -26179 -30460 -15174
5695 -15174 -17571 -27957 -16799 -9164 -21697 -33485 -38416 -58936 -62688 -71131 -59286 -29912 -27925
5682 -27925 -26616 -2359 23883 -1725 -7207 -30371 -11540 19543 9283 756 -5574 -6574 -16445
5669 -16445 -18011 3171 9889 10184 -1896 -19371 -32172 -39455 -42170 -14929 11742 3031 -24610
5656 -24610 -25756 -11846 -14922 2701 39412 12919 -32675 -33893 13756 20798 -20075 -22647 -34128
5643 -34128 -19566 16079 40263 35585 38062 13679 -17447 1666 21555 16036 18971 4220 -19012
5630 -19012 -36762 -58294 -27023 -24800 -23515 -38070 -47451 -51196 -18436 589 -6609 153 -17301
5617 -17301 -11860 -7258 -12832 -4560 -1189 -221 -16809 -60264 -70832 -59966 -39020 -19268 -11562
5604 -11562 -5812 1176 12886 27430 37818 24109 20903 16285 6893 -11531 -45210 -58089 -51430
5591 -51430 -35984 -15542 -2776 26977 27216 7820 -7268 -20330 -24038 -15031 -14915 -36512 -47891
5578 -47891 -19065 2934 2241 844 -17160 -20252 -7914 2843 3136 -22008 -59884 -36423 -20751
5565 -20751 -41490 -12627 -18091 -33300 -33017 -44250 -39675 -26599 -7517 -8111 -49831 -42702 -37959
5552 -37959 -43868 -11184 2549 -10737 -7417 14149 -6203 -24935 -23883 -15475 -14111 -3181 -7678
5539 -7678 -3785 -1120 -10203 7674 15584 7420 -9323 -27939 -28127 -37191 -40663 -16889 -3290 -3941
5525 -3941 3052 -9914 -30773 -14455 -12267 11101 3173 -23313 -2822 -3306 -7145 -14766 -50335
5512 -50335 -46010 -19861 -9637 -7383 -13286 -25771 -21577 -28170 -5682 6550 -15558 -8262 -16763
5499 -16763 -39801 -34203 -6423 10550 -11814 -11858 -14826 -23714 -30057 -32845 -10605 -2183 1834 -14068
5485 -14068 -40909 -35317 -4476 16241 12480 -41917 -83219 -66288 -60401 -42981 -48624 -61675 -52878
5472 -52878 -41513 -42990 -7284 -13328 7878 29688 39483 42929 20883 -32404 -49856 -44190 -7894
5459 -7894 16624 12811 29631 22141 13425 -24979 -57070 -31297 -14451 -24181 -16706 -19798 -10221
5446 -10221 2191 -641 297 13092 25723 16912 19692 12965 24870 27787 -3469 -31587 -42564
5433 -42564 -47949 -34880 -37616 -22076 -10468 43 -23721 -30495 -14470 4172 6618 11621 -8451
5420 -8451 -13128 -5069 -2883 -6651 -16642 -10053 -14949 -28160 -29195 -23365 -18207 -29416 -13821 3989
5406 3989 -10698 -8090 -2015 6195 -67 -10765 -39958 -43714 -41093 -48177 -57890 -33241 -17110 -20396
5392 -20396 3539 12296 13656 6841 -4347 9371 14699 6577 4684 3584 8365 11279 -12667 -16069
5378 -16069 -14548 -11659 -7695 -24476 -29415 -40222 -11254 -6718 -1275 22264 2958 -4108 -15249
5365 -15249 -8960 10919 42637 48699 31999 23693 -7429 -5260 -13889 -22814 -2693 -1240 -5099
5352 -5099 1686 -168 -10095 -19674 -9497 -4532 2509 1675 -6958 -27754 -21452 -12472 -37445 -33089
5338 -33089 -10193 -15717 -26516 -12055 -3797 9791 9075 34977 43666 26383 4909 -4113 8268
5325 8268 13710 -8582 -16381 -15045 -22547 -10346 1625 -7145 -11761 -13683 -11763 -13907 4445 21033
5311 21033 10735 7056 -15488 -32885 -6753 -4298 1428 8484 16579 -10624 -15516 -15130 -12848 -17857
5297 -17857 -24164 -44566 -62109 -49750 -34544 -38658 -29013 -28597 -30141 -42659 -31550 -20092 -826
5284 -826 5543 21719 34156 25695 10248 -19246 -10260 -7991 10174 15234 3066 776 -6273 8552
5270 8552 36261 35044 13188 -12216 -12300 9981 9334 -17558 -20607 -464 32247 70052 53931
5257 53931 28343 1685 -5662 -10608 -1722 -12013 -32221 -25900 -20489 -1903 8445 -11536 -11753
5244 -11753 -9103 -17480 -18748 -18525 6371 30858 15656 21411 41644 46799 34408 23256 -16944
5231 -16944 -8045 10262 11204 -3876 4275 42291 40927 6456 -6330 -21114 -66782 -40109 -959
5218 -959 -6838 -2617 -11665 -28012 -18816 -1810 21713 18997 9666 13072 -15558 -41802 -39219 -52012
5204 -52012 -40571 -17923 -8924 -14493 -17179 -32627 -37106 -7776 5871 -13802 -49059 -47229 -34529
5191 -34529 2393 19960 16320 -612 -28199 -8193 12549 13128 10462 -14313 -11655 -12955 -22014
5178 -22014 -22895 1373 13169 10165 -3427 -15350 -1940 -6384 6695 8726 5501 5244 23494
5165 23494 -8890 -52304 -45973 -15052 20867 25362 5435 4353 -9840 -12376 -9606 -8618 4323
5152 4323 34026 33863 32262 23300 13605 -1617 9229 8861 14627 41467 39395 26515 18422 9186
5138 9186 14544 39030 36693 30322 25785 24093 -9756 -28884 -21434 759 -9241 -16330 -23211 -19000
5124 -19000 -4385 3425 -21518 -50757 -50439 -16306 -66 1029 34734 38979 8495 1119 5860
5111 5860 18656 22095 -7374 -3501 19094 11911 -9431 -13777 -13921 -15024 8715 18599 21526 11284
5097 11284 -3667 -2378 -1230 -10878 -7678 -36867 -58068 -47231 -46406 -16434 22172 30984 6505
5084 6505 -22220 2230 18035 9162 13493 -7948 -17778 -11825 -8360 -46667 -51075 -67519 -62269
5071 -62269 -52303 -10874 27858 22249 11170 35189 14392 -9890 -38388 -17816 -4648 294
5059 294 -12436 15676 39261 35578 8392 -37471 -41273 -50920 -45673 -14125 -14144 -18263 -22620 -11159
5045 -11159 13070 -12462 -21274 -4382 -5255 12600 40402 8394 -28775 -43070 -31739 -20753
5033 -20753 -3458 10497 18381 11987 2797 3804 8783 3790 -22515 -35520 -22524 -10964 -59
5020 -59 5929 -8591 -24263 -23574 -37026 -28960 -27967 -27427 -27133 -23114 -39972 -54494 -56177 -50888 -31513
5005 -31513 -18850 -4785 9561 -1263 -21384 -21416 -14764 -10545 -5377 -25426 -8837 2701 -21654
4992 -21654 -1751 16594 29816 25324 -6463 -30048 -23652 -8659 16176 25140 -7394 -21562
4980 -21562 -8539 -3525 6595 7266 16126 7614 7113 3307 -570 -5187 -10610 -17268 -11596 -1565
4966 -1565 -10953 2366 33320 46308 42981 35515 17004 16567 35518 35632 16406 -14339 -42739
4953 -42739 -30072 -24804 -21527 -33828 -28573 13700 15067 42775 52673 24056 -29327 -54279 -40062
4940 -40062 -41475 -40895 -34380 -11638 1795 16453 -5455 -19603 -32674 -34798 -30482 -44164 -55747
4927 -55747 -68003 -36021 -26343 -17624 3491 4110 -28312 -44912 -34540 -20986 2113 -8443 -6761
4914 -6761 29694 42537 3445 -1597 -26385 -48548 -30150 7577 22641 19649 -2391 -16857
4902 -16857 -24897 -9046 6321 6394 -16881 -32636 -28212 -4557 12850 -14599 -24488 -10305 -8040
4889 -8040 -4350 -26621 -24383 -32258 -58293 -37815 -21369 -25189 -27983 -65284 -35650 -7673 -12094
4876 -12094 -39396 -49055 -31550 -8756 12523 -9871 -46598 -46739 -39257 -5601 -10403 -15830 -24033
4863 -24033 -21730 -4287 25300 11976 9242 -22928 -38301 -45050 -38986 -24071 -8144 -1231 -21102
4850 -21102 -30781 -44 25599 13565 4429 7862 12757 23934 30468 5153 -6410 -6984 14136
4837 14136 -4006 5754 26716 25564 9030 -24074 -23120 -28920 -20197 -28108 -15847 11751 23587
4824 23587 1005 -20157 -28511 -30868 -39976 -44327 -54266 -51412 -50669 -20159 -1198 337 1526 372
4810 372 10447 18962 48034 47730 42043 34199 38234 50857 26355 28502 36512 30029 15324 -16585
4796 -16585 5590 22229 31683 16641 2910 18085 24728 24751 4659 -869 -332 -7105 -20343 -17805
4782 -17805 -29735 -28089 -22678 -24106 1343 -4358 -33299 -46898 -32864 -7588 16680 20940 18503
4769 18503 -19907 -36879 -28021 -27343 -50791 -36348 -11624 11385 34707 25064 3030 4606 -4975
4756 -4975 -918 -7796 -19456 -40159 -22204 -10018 -22700 -12517 22220 26793 1590 -4290 -25030
4743 -25030 -47168 -62030 -68874 -57050 -31552 -24286 -20313 -22011 -19142 -1848 5097 28059 51569
4730 51569 43644 41906 -11038 -52932 -60499 -31185 -9120 31996 73193 63618 60651 58309 67339
4717 67339 52105 13646 -10750 -11306 -24014 3525 42535 42989 20872 5625 -20077 -4516 17935
4704 17935 15027 18309 9772 -4064 -8024 -17018 -19728 -26533 -23771 -35543 -41823 -29158 -1215 -773
4690 -773 -14631 -24528 -5399 25545 26505 -1475 -22948 -28310 -10829 -10254 -8768 -6456 978 5349
4676 5349 -20011 -27602 -39393 -46452 -37250 -26808 -16064 -12917 -15704 -18095 -26673 -19108 579 37506
4662 37506 39940 21929 36113 41171 20901 -6897 -9779 -17628 -8730 -3475 12858 29064 29985
4649 29985 2445 2556 3999 12932 20581 11981 -1396 -11457 4971 -19718 -23915 -16494 9699
4636 9699 32009 29683 18645 6430 4253 28571 35625 27956 16688 8769 -15332 -32583 -30927
4623 -30927 -37842 -24651 -4265 -1878 17084 9333 6127 9888 -953 -3415 -97 3196 8183 -2763
4609 -2763 -8818 3216 4119 -2355 -8509 -590 -18112 -40228 -27516 -37841 -33443 -16060 9328
4596 9328 8376 -5120 -6899 -11693 15382 -12963 -40209 -15754 8905 1232 -15453 -32128 -20980
4583 -20980 -5030 10719 58481 38199 18543 26017 49836 42969 44392 14291 3339 8267 28390
4570 28390 47122 37050 12866 -7178 10122 46828 69528 71397 65531 42243 33201 -2957
4558 -2957 -46887 -36402 -8437 -4484 -32055 -19493 -3102 -22317 -24776 -23423 -3597 15790 11838
4545 11838 -3658 -11650 -14587 -7881 -36576 -49435 -32854 -32715 -27006 -13609 -9316 6073 12333
4532 12333 -14968 -6159 -1352 -6 -8431 -35115 -41418 -13378 -2781 25456 20813 -9489 -20881
4519 -20881 -49603 -55254 -46842 -27665 -9125 -6558 -11854 -15263 -26678 -64886 -75985 -63589 -49839
4506 -49839 -5935 679 -8668 -2369 12357 18628 -2077 -7032 26340 20126 14010 9123 24050
4493 24050 20922 17349 36717 58182 47795 25422 -22333 -34630 1362 6954 6091 4083 -9503
4480 -9503 -22721 -6584 -11021 -21936 -25622 -17340 -5188 -12871 -1224 8399 -15173 -34101 -41640
4467 -41640 -24101 -15660 -1593 -3147 -10033 -7914 -12527 -4527 2803 1409 89 15905 29244 23474
4453 23474 13332 15599 21938 32856 16438 -18174 -12936 -6145 -11111 -15622 -41444 -57208 -46895
4440 -46895 -31024 -32759 -22980 -30354 -25421 -6110 -31042 -42981 -36583 -24503 10279 16451 10184
4427 10184 9823 4001 2184 22482 40685 16356 8700 -22110 -50008 -61523 -43472 -29312 -6034
4414 -6034 2841 8779 19381 -663 -2681 4395 16012 26491 34052 21958 7796 8979 21290
4401 21290 13196 24562 9579 5659 34864 33888 10240 -2731 -20515 -15250 -16069 -1829 -11671
4388 -11671 -9832 19848 29858 4202 686 -6089 7409 18977 -13026 13717 24579 23434 18232
4375 18232 29211 18614 25864 52323 43753 35292 49442 28497 11500 34845 67060 62194 31707
4362 31707 16146 16447 15481 23489 -3814 -28763 -7128 -18115 -41150 -4508 5937 6257 -2447
4349 -2447 -6877 13020 -4598 -15877 6324 36460 46867 58580 54839 5153 -6 10175 12716
4336 12716 -10207 -34117 -15507 -6059 -19279 -32594 -38655 -32634 -23108 -23985 -3590 7981 4745
4323 4745 30275 14702 -6778 -26628 -29245 -22868 -2869 7603 20916 13881 14007 23217 36509
4310 36509 39926 3024 -26078 -44651 -43676 -35216 -51391 -24242 -1080 -15696 -16764 -8318 -24120
4297 -24120 -26392 -19690 -15489 -7677 -14521 -15233 -27925 -48933 -33725 -13745 -8118 -10867 -13939 4762
4283 4762 4901 7332 2173 4729 30989 15900 -717 7400 5733 -17116 -37479 -13787 -23368 -23503
4269 -23503 -12591 -21665 -12584 9049 28236 27701 34265 47993 55753 63782 56376 32209 25214 38445
4255 38445 39355 49638 44419 20518 10504 6510 10440 20027 -2943 -30174 -34005 -16055 2959
4242 2959 -3730 -1096 3362 12517 29547 35048 16386 9861 6883 1353 -665 17060 16059 1894
4228 1894 -22112 -14094 5504 22127 36103 4781 -16628 4311 19180 11462 -3429 -26167
4216 -26167 -27662 -26471 -8794 -32675 -28240 -7842 -1282 -13986 -346 2637 -9679 -5021 5282
4203 5282 8085 -661 -16002 -3843 5537 -24098 -28487 -8052 13332 11887 -8174 -22647 -23300
4190 -23300 -10898 16479 20139 16994 3657 7966 -1006 -12720 -9260 -13223 -40790 -59444 -77237
4177 -77237 -44763 -34782 -43935 -26997 -7490 21015 14378 2769 -343 23968 35334 33221 40342
4164 40342 57372 35356 -7406 -27756 -55684 -42943 5099 21185 7696 5354 75 9887
4152 9887 21452 31820 58807 40398 42680 38496 -5060 -28141 -13178 6504 -15363 -49605
4140 -49605 -36215 -33684 -60996 -70986 -70382 -62638 -36614 -1353 11286 17031 -6511 -9383 2815
4127 2815 -5775 -349 10726 18714 17730 20471 20427 -4748 4864 7226 -6830 -11008 7678 -6654
4113 -6654 -22992 -22948 -10578 -31141 -45057 -776 -2692 -4967 3524 -9667 -3379 25213 7997
4100 7997 -14437 -6298 9259 36750 36400 21071 493 -2596 8256 7883 10979 8172 9404 6152
4086 6152 -9205 2543 4088 -9190 -35683 -35796 2598 15524 11905 837 6028 1734 2469 16952
4072 16952 20596 25544 29117 26036 444 -18428 -33001 -37863 -28059 -28012 -23569 -13970 -13856 -2591
4058 -2591 -8385 15073 47248 44296 19076 27892 21434 18458 29870 33979 7683 -805 26981
4045 26981 10151 -6467 -12110 13095 3359 -26836 -30619 -20261 -9496 2648 -8655 -12026 -22127
4032 -22127 -10584 2529 1285 -60 -8782 -904 -3190 -30934 -43772 -29853 4871 5850 -26973
4019 -26973 -38797 -22937 -13465 -4799 10383 22679 5110 38489 46026 18322 -12448 -54342
4007 -54342 -52962 -20603 -12702 -15883 -15066 -9061 -10476 -10588 -19062 -19963 -25077 -11173 -19038 -7137 22742
3992 22742 40352 30716 6977 -9659 7714 14601 -1181 -26706 -22348 2637 8297 22715 17619
3979 17619 -15743 -7266 2647 -19386 3566 13748 11829 9004 7586 -4738 420 20462 41233
3966 41233 49883 36104 10283 17870 34888 25527 25172 8536 19364 54746 61531 40916 35743
3953 35743 11255 2895 10792 33322 29069 3608 -10121 -525 10870 6355 -3550 -1229 -21720
3940 -21720 -7005 6944 10616 10156 -8620 -38855 -38630 -29871 -8510 -2956 -4555 -7057 27309 63290
3926 63290 61049 64561 53567 20331 -12207 -26629 -28664 -19350 -7856 7093 12247 -3600 -17716
3913 -17716 -5761 10305 -8731 -30882 -33803 -14529 -2555 -11095 -10129 -10175 -2927 22055 13295 24245
3899 24245 11849 10999 13962 27903 31396 20654 14659 25911 22685 26468 24911 47552 59543
3886 59543 35287 11672 28469 47065 60893 62409 26697 11884 15582 -2363 -5539 2484 -9310
3873 -9310 -8397 -20986 -15065 -993 7957 12739 -10226 -23269 -17783 -31711 -51405 -50857 -20222 -14652
3859 -14652 -15428 -31603 -28017 -17699 -1003 -6299 -11120 2868 -114 -31250 -33856 -4315 34528
3846 34528 17636 -15770 -34158 -28209 -6457 21745 2018 -8240 1457 15904 14107 -10273
3834 -10273 -18057 -41115 -79481 -80774 -50396 -444 12063 3631 5864 4130 -14238 -11428 -21853
3821 -21853 -16297 -31100 -7534 5464 -5200 -9307 -32177 -41899 -10254 5125 38189 39049 17390
3808 17390 17670 27888 25236 25493 20142 -6817 -37865 -45647 -15516 15477 26288 9811 -8909
3795 -8909 13464 14638 -5196 -27459 -26762 4805 34793 52118 41770 17226 8927 25146 29987
3782 29987 36392 20124 37253 36591 767 -19308 -7002 12685 15388 7184 7739 2138 -10602
3769 -10602 10885 22010 22508 16489 5441 -4871 -20313 -32917 -25878 -48361 -53123 -37426 -37192
3756 -37192 -12781 8844 3424 -2551 -18925 -14484 -39759 -42600 -16274 -6505 -26273 -43012 -45611
3743 -45611 -33663 -14101 -41764 -66897 -50255 -26412 -9316 -21719 -28389 -23623 -30823 -40944
3731 -40944 -41490 -53495 -48619 -43727 -28397 -29761 -32710 -32735 -6742 13758 -18410 -35831 -14473 -22827
3717 -22827 -37022 -41520 -20614 -3945 5630 -2243 -15308 -21974 -10515 5586 25290 28112 9883
3704 9883 -1671 -5352 -9208 -15289 -24381 5500 11137 -5892 1763 19269 5206 -10070 10459
3691 10459 -6229 -18503 -42480 -32102 -45449 -40188 -39669 -35987 -40380 -41903 -25325 -6170 13947
3678 13947 242 -695 -6738 -934 12750 8307 -30337 -14163 4546 -4160 -46152 -38654 -33728
3665 -33728 -34380 -19949 -18067 -19845 -22241 -31426 -30663 -24570 -27516 -5163 4580 -16385 -14187 7405
3651 7405 6854 8874 20524 41582 48817 53827 22533 16087 19331 22434 15429 10672 30670 45577
3637 45577 41458 42834 30582 8111 4124 -12217 -4504 898 10084 -1885 5625 10068 1400 19105
3623 19105 14555 -3603 -2338 -11952 -4389 13170 -1595 -3470 -7611 16593 13125 22627 12160
3610 12160 15279 32762 19066 3015 -1724 2661 21115 14960 -1136 -6426 -2464 -10798 -24162
3597 -24162 -8715 1105 -12668 -25341 -3940 13200 30123 24216 -4451 -18344 5029 34989
3585 34989 18365 7663 3312 20977 6956 -8296 7401 5731 35309 44415 37351 17354 -14306
3572 -14306 -13339 1830 -7433 -24858 3959 18653 3481 -17697 -47369 -50838 -40191 -2679 -6317
3559 -6317 -15222 -9786 2480 15784 5853 12562 24423 15282 2659 16650 35318 32028 41000
3546 41000 49188 48166 34270 25329 11383 16330 13891 -1603 14201 9079 5833 29755 39502
3533 39502 18602 10427 11386 29793 41280 47263 6644 -17739 -2462 -4586 9249 29464 27911
3520 27911 17393 -139 -49028 -48792 -21091 8279 18369 7319 -31943 -24137 -27624 -4025 -2919
3507 -2919 -15645 -56942 -55443 -32394 -11942 -2447 15804 1006 16034 11946 -21198 -7617 4109
3494 4109 8203 22445 31394 30204 49927 45011 52515 53132 32151 13296 -5776 6288 19888
3481 19888 9232 3358 13810 2354 2472 5386 2001 5227 14483 31509 42303 26206 25842 37364
3467 37364 36017 20422 5021 -18587 -4466 -366 6291 9749 15304 -7909 -14180 6270 9351
3454 9351 25707 30713 9392 -12618 1247 16062 23937 18937 17878 19778 26561 15461 -6797
3441 -6797 3240 -2238 17548 26939 24620 25347 28694 14033 12745 18287 4582 -14768 26303 26435
3427 26435 10695 17916 32219 14826 20236 12912 -12209 -30346 -19262 -2512 -4125 -20829 -14814
3414 -14814 -1080 7534 -7689 -28257 -15895 -1499 -17702 -41855 -37589 21482 38013 16995
3402 16995 23667 35661 25557 17623 -4861 -405 -11494 10076 40645 15619 8896 15277 34043
3389 34043 23879 3279 5322 16826 -12487 -19762 -1566 6158 -6791 -23552 -28230 -11468 -7893
3376 -7893 2472 13054 -11201 -1362 1668 3375 15164 13678 -10682 -2641 -6692 7229 18473
3363 18473 16312 8369 -2399 14679 8709 13315 48420 56333 41235 9802 -15120 -22667 -13553
3350 -13553 26015 40342 51157 31511 -9528 -28191 -23885 -2885 5908 6982 25386 25813 -7296
3337 -7296 -43378 -64810 -65571 -42621 -42460 -32914 -36225 -33308 -10275 35538 62536 63943 41229 31365
3323 31365 27159 41398 39790 22395 19544 27924 40935 41778 72147 90125 74473 58538 52348
3310 52348 50454 59820 25948 5132 7620 -6901 -22153 -13943 -651 24291 28568 15771 18896
3297 18896 6597 12405 17025 11165 15042 26685 20864 10292 -3312 8478 33132 33946 25394
3284 25394 -5822 24060 27855 17711 18367 20769 13567 -2910 -1824 14905 33260 41893 6037
3271 6037 -23391 -6856 19165 32619 18343 19443 18565 2917 -2848 -13154 13492 13495 2239 325
3257 325 13477 13928 12394 -21090 -31383 -38281 -18090 21784 54555 54475 39741 21236 7957 16067
3243 16067 7676 -12985 -10253 27082 25531 19483 -6066 240 -906 -17788 -24905 -17408 -10223 15381
3229 15381 17160 16015 25510 37595 22481 21764 15516 14670 22310 25716 29953 44216 38415 28811
3215 28811 45586 54335 61410 37333 38237 73501 52445 33329 42817 51753 41562 49644 17424
3202 17424 -37381 -38821 -27804 -21762 -13282 -13994 -46852 -65438 -43049 -8241 12012 -5699 -6415
3189 -6415 21563 -998 209 -29281 -46508 -39385 -30966 -20283 -5904 -5016 -18487 -39478 2112
3176 2112 -11566 -7760 4564 20640 35419 39743 44115 50072 39613 6152 17041 10440 -22503
3163 -22503 -41101 -28699 -26635 -26615 -9396 17036 24435 10436 20120 38355 16504 -3040 -22679
3150 -22679 -10131 17773 18852 1232 3984 -6313 13164 38860 40508 19981 10624 -64 -5498
3137 -5498 3087 -1909 -7048 -19213 -27068 -31751 -30033 -19192 -10296 -48865 -37184 -16672 -7289 -3465
3123 -3465 11660 -1970 -4488 -2744 -18437 -5877 -8645 -24147 -18571 -13943 588 -17613 -14263
3110 -14263 -5960 -23359 -14630 -4800 13637 -13015 -13869 1269 -3846 -8772 -12802 -21416 -1446 -10180
3096 -10180 -4051 -6851 -4243 -6131 -1185 -19345 929 -5665 -1145 5248 15293 11120 11268 20240
3082 20240 35191 51500 69761 39936 21499 16343 10026 -26635 -34959 -23832 -35746 -31301 -17684
3069 -17684 -12565 -10037 -1253 -4770 -19771 -48197 -62234 -34384 -4333 -33858 -57070 -47621 -43264
3056 -43264 -30508 -15429 -8372 -11261 -9782 -2718 6784 4833 -6496 -8147 -8291 -23216 -12409 19723
3042 19723 20109 23445 21226 11619 -4080 16894 51554 46334 23458 51384 54674 21481 15339
3029 15339 26847 21075 8348 -14495 21465 38390 8411 1092 8684 29617 22859 7039 -22205
3016 -22205 -35982 -48720 -64375 -57880 -67968 -50730 -32807 -25491 -33778 -34926 -17070 10204 5419
3003 5419 -4574 -12486 -12161 16875 12753 -12307 -31473 -50643 -26044 -14476 752 19846 17049
2990 17049 24701 54691 64561 53951 37834 31199 24728 11889 -16818 -21890 10450 13790 -4726
2977 -4726 -22164 -31199 -25089 -4720 6928 15384 23288 22318 31365 35558 7098 -2945 2151 21458
2963 21458 29175 19784 32543 25693 30339 13556 -10478 -2373 1421 -2921 -4171 11966 20431 613
2949 613 -8009 -13343 -19649 -17373 -26684 -18031 -27888 -25192 -27974 -12983 -8732 2147 -13813 -26147
2935 -26147 -5409 4549 -8621 -8748 7552 -2445 -11512 2489 13301 45428 53778 40274 32933
2922 32933 37225 12477 4611 6541 -6677 -8781 -2088 -4159 -17947 -20383 -12547 56 -13550
2909 -13550 -13230 2292 -8300 -3605 1418 -1629 -170 25426 41346 32167 38359 54556 40692
2896 40692 32291 41152 30573 -12850 -12394 -12718 23438 32258 28079 25383 19545 23391 32599 17558
2882 17558 -5396 20626 28583 10443 -686 -1977 8443 7606 3389 -20532 -31205 -27554 -15231
2869 -15231 -24775 -20414 15518 16249 14553 2696 10191 6906 14010 11979 4918 -24798 -17774 -19067
2855 -19067 -15033 -20176 -58447 -72952 -63956 -45156 -17510 -27331 -25790 -3650 21310 8127 -26628
2842 -26628 -50509 -30539 -13191 -22735 -25835 -10487 -7149 -7451 -7564 3944 27006 29341 -591
2829 -591 -23454 -2594 14327 18663 10020 11304 -14464 -36220 -42358 -47226 -42041 -24750 -12920
2816 -12920 14043 27603 37818 32135 8868 -23154 -52661 -39609 -39618 -36288 -12280 -12732 -14917 -2154
2802 -2154 13988 11746 20795 39355 22549 26343 28955 13534 31633 17692 724 5594 -4811
2789 -4811 -3443 3423 28280 22621 2480 -5097 11964 41556 38799 14492 13673 19089 36143 42405
2775 42405 28430 29776 -6899 -9180 -16982 -3364 -1922 19321 28659 14629 917 11984 25746
2762 25746 -17352 -33074 -28213 -31728 -8333 21756 20977 28395 28650 2275 -9380 -19093 -36727
2749 -36727 -28133 -16811 6275 -204 -10939 -27762 -26332 10135 23039 21054 26107 20915 8192
2736 8192 5433 44366 52369 40082 29300 17025 -10648 4951 25331 209 -18357 -38614
2724 -38614 -45486 -30601 5084 -17055 -42437 -34387 -22025 -35103 -45741 -45524 -21924 -20518 4066
2711 4066 21724 16225 13505 23078 1072 -13800 -28918 -31134 -29000 -20866 -6106 -314 23453
2698 23453 27991 9310 10537 25862 22990 23553 27824 35259 16923 22524 42219 52759 46296 11089
2684 11089 -21926 -30397 -16799 -5269 -7918 -24748 -27426 -10765 -16914 -37729 -38162 -36381 -18371
2671 -18371 8057 2909 648 15306 9865 11146 29207 13612 30412 30007 36064 34224 24206
2658 24206 41499 35789 28954 2428 -24545 -25799 -48360 -54682 -32048 1222 10400 2265 -7642
2645 -7642 -12536 -16988 -7109 17255 6686 6806 464 1354 -5276 2029 -11124 17470 44732 27750
2631 27750 18038 27787 19228 -2326 19598 52520 37368 3829 190 3872 879 -12257 -17021
2618 -17021 -3933 22826 9117 -17731 -33981 -20924 -13712 -34372 -48807 -42799 -21209 -26594
2606 -26594 -19996 -11093 4204 21004 45767 40790 16947 8426 21114 30739 35292 27487 28238 15193
2592 15193 17606 4572 8035 -7923 -16583 -27627 -15359 -22094 -16103 -3782 10310 38226 54999
2579 54999 62803 59778 48361 26976 8541 28609 36065 45585 51387 42401 24781 15063 27126
2566 27126 8344 -28441 -27074 1223 8971 1911 513 -3927 3868 34919 29537 7687 2240
2553 2240 14051 15042 3612 7534 8046 15848 29579 32511 45382 52955 29422 16231 17278 4341
2539 4341 8855 21006 43468 34931 25121 20026 23563 16610 10184 -32796 -22323 -6527 -11149 -30566
2525 -30566 -4423 10416 38409 49888 39667 20461 15127 23506 27044 13549 8612 -11597 -36169
2512 -36169 -33439 -20494 -14766 13944 44020 68494 61001 12512 -10934 -14913 -20446 -16337 -8168
2499 -8168 -5632 -6698 4477 12229 14654 33904 36748 36504 40396 35567 28021 -1498 -18436 -19455
2485 -19455 10230 15371 27642 24128 -312 4956 8520 22144 12134 1129 11504 3167 -133
2472 -133 11736 23213 22781 33691 20146 5541 5685 -2417 3351 33078 27072 -8447 2927 8642
2458 8642 -17022 -9250 245 -4556 -868 14092 -8589 -11738 -11924 -16528 -7809 -8513 -8570 -22464 -32747
2443 -32747 -34310 -5350 10758 44152 40150 30444 19908 11142 5339 8123 28228 30842 35521
2430 35521 14957 14199 19911 11535 -18813 -18538 -16305 -12349 -11999 -5812 24703 44655 34942 19873
2416 19873 713 394 -15137 -15248 -1942 15228 -12225 -2610 3550 -13872 -22678 -6279 19973
2403 19973 26855 35433 32370 29597 6126 -7012 -4604 4434 17490 31146 46948 29821 8362
2390 8362 11571 21935 16354 871 -9653 -4889 207 -13497 -4365 6843 -17556 -22132 -11804
2377 -11804 -10205 -12020 -15751 -7770 3518 -3736 -11619 -26015 -22092 14997 19786 -4588 -617 16646
2363 16646 23893 -1873 -12702 17967 20224 4733 7939 10194 24300 28100 34495 32365 181
2350 181 -6547 10617 8899 14084 45269 48899 30227 41765 11672 -4457 3686 -11804 -24539
2337 -24539 -3249 -1833 -1863 -24137 -10437 9728 1736 -10616 16905 36310 21807 14313 8789
2324 8789 11954 5363 -10347 -6435 10250 -12276 -32865 -8633 -7449 -19948 -35450 -44665 -39506
2311 -39506 -30976 -23182 -8063 -11294 -12019 -34770 -32176 -20066 -8801 10665 16558 -1383 -2861
2298 -2861 -14968 -12940 -27038 -63252 -51398 -37322 -961 13330 -1078 -3072 -6467 -9218 -3409
2285 -3409 2914 5611 1800 -3062 -8226 -23978 -29634 -37731 -32468 -15043 19312 27586 15997 6893
2271 6893 5086 5781 13427 9020 17612 19568 6024 -12617 -11997 11126 10564 4961 12778 5111 4963
2256 4963 11611 -5576 -5998 -19198 -12067 256 22757 45066 19326 8470 30426 26669 20383
2243 20383 26510 49248 56984 32569 -11308 -1231 22454 37493 29752 1952 -5258 11680 26522
2230 26522 40575 17902 27623 13201 -22113 -28605 -7623 3911 -16695 -31483 -21479 -25194
2218 -25194 -27065 -14348 -13871 1439 3081 2340 21180 16027 19959 5691 4277 10487 513 17276
2204 17276 15362 23026 -1354 -26107 -18704 -2029 -18167 -30184 -17659 -5300 17110 45662
2192 45662 30124 5260 11965 7184 6433 17880 31506 10735 -33519 -39176 -15509 -12588 6303
2179 6303 35066 25772 4070 14208 1501 -216 -24852 -39743 -21855 -3716 3579 -5370 8967
2166 8967 38519 50732 50098 29029 1323 20215 40810 32593 27219 40100 37366 35973 31948
2153 31948 30882 34536 23435 -391 -18810 -18370 -14870 -1136 14694 17371 52283 65124 53973
2140 53973 31191 30302 80617 66476 38016 28545 8617 15043 24115 24146 37757 33843 22961 27349
2126 27349 32711 39526 43144 23734 15136 24471 14679 -6454 -18785 -16924 -21590 -12137 -12078 -8134
2112 -8134 9865 36203 25407 26983 28014 -4934 -1380 18810 19687 8303 -15667 -5090 14019
2099 14019 3294 -20553 -10323 13931 15242 10636 -28150 -50967 -26173 -11412 -37528 -18988
2087 -18988 -2143 -16684 -12549 -18073 -24578 -38293 -13436 45014 64519 40228 15531 5411
2075 5411 -22543 -22055 -1396 -4840 -7567 16389 40661 28452 -804 10594 31202 19903 2644
2062 2644 -16723 -28671 -31462 -32289 4794 36464 36176 11911 -10039 3683 14069 5307 -4760
2049 -4760 3111 25750 34055 30584 8808 13787 14963 -621 12058 26904 33713 23157 11074
2036 11074 14080 10513 11872 30481 20180 227 -300 -57 -24263 -21799 -20828 -24937 -48421 -52369
2022 -52369 -22790 -15650 -31168 -19565 -11404 -10845 -18343 -9640 9770 13123 19584 14824 9056 -1692
2008 -1692 -15951 -11648 -6840 3805 10562 29815 37157 17600 1255 9112 8435 10113 1525 17256
1994 17256 19701 -2113 -16028 -28603 -1361 33585 53465 37261 14169 10480 7381 -20522
1982 -20522 -47492 -26277 29139 8681 -23987 -16470 7203 38202 40342 46636 41961 39415 21432
1969 21432 6036 -6819 -5777 6825 827 4604 2 12929 27292 30000 4929 7816 44923
1956 44923 63617 42490 47790 29684 17535 14224 6266 14766 -10702 -7585 10499 26976 44493
1943 44493 46818 34355 29298 17807 23180 55520 32242 8008 -1776 -8452 -23060 16754 26156
1930 26156 23016 24601 47534 22567 442 -6866 -18364 -10193 3441 -17561 -8494 4510 -3154
1917 -3154 2865 -5351 -6952 7567 9737 14843 36725 44216 12778 25887 30171 23421 37503 29742
1903 29742 -10677 -3727 20102 36277 25065 -12438 -16764 1115 -12453 5971 6413 9958 1827
1890 1827 8938 1788 10722 6433 13524 12604 2549 -553 -23268 -19766 -9942 -7987 1844 16817
1876 16817 44220 46600 6005 -9631 -40257 -43328 -47036 -23929 -14726 -10977 -22288 -42414 -42375
1863 -42375 -31099 -16056 -10744 -189 7630 5556 22508 32487 29953 15715 16441 29273 10324
1850 10324 14184 22741 7036 -10773 -1565 -24569 -32752 -18956 -14588 -7138 -9018 -24420 -14963
1837 -14963 14226 12787 -23235 -17513 -17198 -16659 -9198 -27830 -38603 -22552 12031 24506 18788
1824 18788 -4338 -15733 -22850 -42343 -46449 -38651 -46630 -15166 -292 -5842 -11425 13150 46194
1811 46194 33639 27596 29361 40174 19694 -2743 8460 13492 20865 22904 32063 15316 -25186
1798 -25186 -44240 -28492 -18257 -15407 -6498 -268 -806 -9458 -27783 -17261 -4283 4422 14235
1785 14235 -11923 -4555 15944 21560 6923 -23106 -27050 -22157 -17734 -9130 -26004 -38606 -39301
1772 -39301 -24373 -12388 -32024 -40715 -17853 -26587 -44100 -43762 -33978 -26789 -28136 -25080 8073
1759 8073 -2697 -15978 -14284 -19023 -11249 -600 -8405 -29969 -9647 -1630 -15540 -13479 2344
1746 2344 21245 3876 -4293 -6094 18164 944 -7047 13161 16611 27898 13197 -6186 8845
$$ [...]
##END NTUPLES=NMR SPECTRUM
##END=
