##TITLE=Analysis number 313568
Compound Code cc 40146
Book Reference 350/178/1
Project Code adrs
Chemist Name chrisr
##JCAMPDX= 6.0         $$ Bruker NMR JCAMP-DX V2.0
##DATA TYPE= NMR SPECTRUM
##DATA CLASS= NTUPLES
##ORIGIN= Bruker BioSpin GmbH
##OWNER= NMR
$$ XWIN-NMR		Version 3.5
$$ Tue Sep 13 09:20:37 2005 GMT Daylight Time (UT+1h)  MAYBRIDGE\NMR@NMR_250MHZ
##.OBSERVE FREQUENCY= 250.131544655141
##.OBSERVE NUCLEUS= ^1H
##.ACQUISITION MODE= SIMULTANEOUS (DQD)
##.ACQUISITION SCHEME= undefined
##.AVERAGES= 16
##.DIGITISER RES= 18
##SPECTROMETER/DATA SYSTEM= dpx250
##.PULSE SEQUENCE= zg30
##.SOLVENT NAME= CDCl3
##.SHIFT REFERENCE= (INTERNAL, CDCl3, 0, 16.522)
##AUDIT TRAIL= $$ (NUMBER, WHEN, WHO, WHERE, WHAT)
$$ ##TITLE= Audit trail, XWIN-NMR		Version 3.5
$$ ##JCAMPDX= 5.01
$$ ##ORIGIN= Bruker BioSpin GmbH
$$ ##OWNER= NMR
$$ C:\u/data/dgb/nmr/ADRS/9400/pdata/1/auditp.txt
$$ ##AUDIT TRAIL=  $$ (NUMBER, WHEN, WHO, WHERE, WHAT)
(   1,<2005-09-13 09:20:06.41 +100>,<MAYBRIDGE\NMR>,<NMR_250MHZ>,
      <created by zg, POWCHK disabled, PULCHK disabled
       configuration hash MD5:
       62 19 C7 07 E1 42 D1 B7 37 6C 3D D0 77 39 F9 E6
       data hash MD5: 64K
       A4 73 6A 5A 81 71 2F D4 9A 45 10 83 E6 AC 66 73>)
(   2,<2005-09-13 09:20:17.00 +100>,<MAYBRIDGE\NMR>,<NMR_250MHZ>,
      <Start of raw data processing
       ef LB = 0.3 FT_mod = 6 PKNL = 1 SI = 32K 
       data hash MD5: 32K
       B0 3F 11 98 BF 27 7C 3D 03 D9 39 23 94 98 79 88>)
(   3,<2005-09-13 09:20:18.80 +100>,<MAYBRIDGE\NMR>,<NMR_250MHZ>,
      <apk 
       data hash MD5: 32K
       61 17 4B 7A 68 5E FD BE E3 B4 4E 7F 68 AB 63 8E>)
(   4,<2005-09-13 09:20:19.52 +100>,<MAYBRIDGE\NMR>,<NMR_250MHZ>,
      <abs ABSG = 5 
       data hash MD5: 32K
       3B 1E 2B CB 37 A5 4C 3C FA 68 B4 C3 D3 E5 15 15>)
$$ ##END=
$$ 
$$ hash MD5
$$ 78 5A 97 26 42 3A F8 20 2D 32 05 81 E0 F7 40 32
##$RELAX= 
##$RELAX= 
##$RELAX= 
##$RELAX= 
##$RELAX= 
##$RELAX= 
##$RELAX= 
$$ Bruker specific parameters
$$ --------------------------
##$DU= <C:\u>
##$EXPNO= 9400
##$NAME= <ADRS>
##$PROCNO= 1
##$TYPE= <nmr>
##$USER= <dgb>
##$AMP= (0..31)
100 100 100 100 100 100 100 100 100 100 100 100 100 100 100 100 100 100 
100 100 100 100 100 100 100 100 100 100 100 100 100 100 
##$AQSEQ= 0
##$AQ_mod= 3
##$AUNM= <au_zg>
##$AUTOPOS= <3 >
##$BF1= 250.13
##$BF2= 250.13
##$BF3= 250.13
##$BF4= 250.13
##$BF5= 500.13
##$BF6= 500.13
##$BF7= 500.13
##$BF8= 500.13
##$BYTORDA= 1
##$CFDGTYP= 0
##$CFRGTYP= 5
##$CHEMSTR= <none>
##$CNST= (0..31)
1 1 145 1 1 1 1 1 1 1 1 1 1 1 1 1 1 1 1 1 1 1 1 1 1 1 1 1 1 1 1 1 
##$CPDPRG= <>
##$CPDPRG1= <>
##$CPDPRG2= <>
##$CPDPRG3= <>
##$CPDPRG4= <mlev>
##$CPDPRG5= <mlev>
##$CPDPRG6= <mlev>
##$CPDPRG7= <mlev>
##$CPDPRG8= <mlev>
##$CPDPRGB= <>
##$CPDPRGT= <>
##$D= (0..31)
0 1 0 0 0 0 0 0 0 0.06 0 0 0 0 0 0 0.0002 0 0 0 0 0 0 0 0 0 0 0 0 0 0 
0 
##$DATE= 1126599605
##$DBL= (0..7)
120 120 120 120 120 120 120 120 
##$DBP= (0..7)
150 150 150 150 150 150 150 150 
##$DBP07= 0
##$DBPNAM0= <>
##$DBPNAM1= <>
$$ [...]
##$SUBNAM7= <"">
##$SUBNAM8= <"">
##$SUBNAM9= <"">
##$SW= 20.6930455092707
##$SWIBOX= (0..15)
0 0 3 0 0 0 0 0 0 0 0 0 0 0 0 0 
##$SW_h= 5175.983436853
##$TD= 65536
##$TD0= 1
##$TE= 295.16
##$TE2= 300
##$TE3= 300
##$TEG= 300
##$TL= (0..7)
0 120 120 120 120 120 120 120 
##$TP= (0..7)
150 150 150 150 150 150 150 150 
##$TP07= 0
##$TPNAME0= <>
##$TPNAME1= <>
##$TPNAME2= <>
##$TPNAME3= <>
##$TPNAME4= <>
##$TPNAME5= <>
##$TPNAME6= <>
##$TPNAME7= <>
##$TPOAL= (0..7)
0.5 0.5 0.5 0.5 0.5 0.5 0.5 0.5 
##$TPOFFS= (0..7)
0 0 0 0 0 0 0 0 
##$TUNHIN= 0
##$TUNHOUT= 0
##$TUNXOUT= 0
##$USERA1= <user>
##$USERA2= <user>
##$USERA3= <user>
##$USERA4= <user>
##$USERA5= <user>
##$V9= 5
##$VALIST= <valist>
##$VCLIST= <CCCCCCCCCCCCCCC>
##$VD= 0
##$VDLIST= <DDDDDDDDDDDDDDD>
##$VPLIST= <PPPPPPPPPPPPPPP>
##$VTLIST= <TTTTTTTTTTTTTTT>
##$WBST= 1024
##$WBSW= 4
##$XGAIN= (0..3)
0 0 0 0 
##$XL= 0
##$YL= 0
##$YMAX_a= 382756
##$YMIN_a= -561024
##$ZGOPTNS= <>
##$ZL1= 120
##$ZL2= 120
##$ZL3= 120
##$ZL4= 120
##$ABSF1= 16.522
##$ABSF2= -4.171173
##$ABSG= 5
##$ABSL= 3
##$ALPHA= 0
##$AQORDER= 0
##$ASSFAC= 0
##$ASSFACI= 0
##$ASSFACX= 0
##$ASSWID= 0
##$AUNMP= <proc_1d>
##$AZFE= 0.1
##$AZFW= 0.1
##$BCFW= 0
##$BC_mod= 0
##$BYTORDP= 0
##$COROFFS= 0
##$CY= 12.5
##$DATMOD= 1
##$DC= 0
##$DFILT= <>
##$DTYPP= 0
##$F1P= 14.0000005364418
##$F2P= -0.99999901652339
##$FCOR= 0.5
##$FTSIZE= 32768
##$FT_mod= 6
##$GAMMA= 0
##$GB= 0
##$INTBC= 1
##$INTSCL= 1
##$ISEN= 128
##$LB= 0.3
##$LEV0= 0
##$LPBIN= 0
##$MAXI= 10000
##$MC2= 0
##$MEAN= 0
##$ME_mod= 0
##$MI= 0
##$NCOEF= 0
##$NC_proc= -4
##$NLEV= 6
##$NOISF1= 0
##$NOISF2= 0
##$NSP= 0
##$NTH_PI= 0
##$NZP= 0
##$OFFSET= 16.522
##$PC= 1
##$PHC0= -78.40286
##$PHC1= 2.986778
##$PH_mod= 1
##$PKNL= yes
##$PPARMOD= 0
##$PSCAL= 4
##$PSIGN= 0
##$REVERSE= no
##$SF= 250.13
##$SI= 32768
##$SIGF1= 0
##$SIGF2= 0
##$SINO= 400
##$SIOLD= 32768
##$SREGLST= <1H.CDCl3>
##$SSB= 0
##$STSI= 32768
##$STSR= 0
##$SW_p= 5175.98343685301
##$SYMM= 0
##$S_DEV= 0
##$TDeff= 65536
##$TDoff= 0
##$TI= <Analysis number 999999
Compound Code 99
Book Reference 9
Project Code 9>
##$TILT= no
##$TM1= 0
##$TM2= 0
##$TOPLEV= 0
##$USERP1= <user>
##$USERP2= <user>
##$USERP3= <user>
##$USERP4= <user>
##$USERP5= <user>
##$WDW= 1
##$XDIM= 32768
##$YMAX_p= 372608377
##$YMIN_p= -98981
$$ End of Bruker specific parameters
$$ ---------------------------------
##NTUPLES= NMR SPECTRUM
##VAR_NAME=  FREQUENCY,     SPECTRUM/REAL,   SPECTRUM/IMAG
##SYMBOL=    X,             R,               I
##VAR_TYPE=  INDEPENDENT,   DEPENDENT,       DEPENDENT
##VAR_FORM=  AFFN,          ASDF,            ASDF
##VAR_DIM=   32768,         32768,           32768
##UNITS=     HZ,            ARBITRARY UNITS, ARBITRARY UNITS
##FACTOR=    0.157963299565203, 1,           1
##FIRST=     4132.6476996994, 0,             0
##LAST=      -1043.33573715361, 0,           0
##MIN=       -1043.33573715361, -98981,      0
##MAX=       4132.6476996994, 372608377,     0
$$ Real data points
##PAGE= N=1
##DATA TABLE= (X++(R..R)), XYDATA
$$ [...]
16182H91j732j1597k1306K0163K7747J185m975k0493M3703J6731r457j9789j847
16169A9224K8990J415l0706q66j3272J3772r88j2057k3200j5669l478L4098K3247
16156B0510j3382j3384j7156k0144K2458j767K2096L3914j4616k7421M233L673
16144i86q9N557m374m668o426J6659N544P824J8681n100j5504K521N44O404k3822
16129B765k2550n358J6150N608J1191J2478R42l523l3787l907r900k2749K6489
16116b6151L8658L8162l700j6734j5094j0983j8015j2695K09Q484J7300J2773
16104A2214l276m440k345J2908J445o567J7085K451j0341l0392o723K9565n941
16091E643j3971n208K0573L8823j8870k9936r532L1652K2650p483j1997j2769
$$ y = [891, -841, -12438, -33744, -13581, 14166, 15351, 10376, -10117, 33586, 50317, 40860, 21071, 19224, 48214, 49629, 18923, 18057, 4785, 18557, 17569, 5512, -17688, -33357, -36835, -2737, 20510, 7128, -6256, -23412, -43556, -21098, -22865, -769, 33145, 18529, -8892, -4659, -986, -1075, 4482, 108, -4560, -10986, 5673, 11217, 19041, 37722, 32622, 17118, 19639, 20183, 26587, 2765, -19785, -25143, -8993, -3385, 7806, 20284, 21226, 17703, -16084, -19991, -29891, -52640, -26151, 12507, 50669, 46969, 30235, 15141, 4158, -13857, -26552, -26343, -17859, -559, 12214, 8938, 4498, 2153, 15061, 16506, 9939, 27024, 29475, 19134, -11258, -17981, 11584, 5643, -8328, -13536, 7037, 45860, 26990, -2946, -12478, 19174, 41824, 34341, 22344, 9575]
16079I575k299o341J6056J0046j0569k4680J3627K1520R517J7869j3473j9469
16067B1379J9566q359l1765K577k3072O77L6145L1765J0226j7501k7825j5964
16055b151j6441n03K9916r287O588L1349j849k9411j9948K9816N679k8361k1554
16042b6157L4747R637j4337l1073j2930K0221J2708J697p70k3048q225J3221k686
16029b6995p744j1268J8934J0542r538O693K3420P074q118k4896j8818J0367J7554
16016a2793N998J4406O706l985j7592P462L704O304J2741p461q861M261J0111
16003B1001j8144j1398J646j421j5398J6017J2364J3866L968L208N621N891j2709
15990B4512k5262k2090m136j2176l987L5176L8600K3348m108j5024j7738M833
$$ y = [9575, 7276, 935, 16991, 27037, 16468, -8212, 5415, 26935, 36452, 54321, 40848, 21379, 40945, 32586, 821, 3398, -19674, -18997, 17148, 48913, 59139, 41638, 13813, -2151, -18592, -19095, 10821, 1534, 8122, 39471, 37622, 8211, -11737, 18079, 23758, -4603, -26157, 8590, 18227, 3890, -27183, -40113, -19892, -7184, -5487, -6257, -29305, -37530, -24309, -26995, -34739, -46007, -27073, -16531, -26069, -19376, 4044, 11118, 3000, -21896, -40714, -30347, -12793, -6795, 7611, 14317, 10332, -7260, 202, 3906, 10210, 22951, 15490, 6629, 10890, 21001, 2857, -8541, -6895, -8316, -23714, -7697, 4667, 18533, 22501, 25709, 31330, 37221, 24512, -750, -22840, -26976, -39152, -43139, -7963, 30637, 53985, 49877, 34853, 17115, 21948]
15978B1948J4608j5183l0130k5641q6J3632p90p038r975O929K5238R887j2976
15965i577k0036Q329O894j2697L523M053J2459R082K086k9675k8060n138K903
15952e5854M627M5325L0452q697N245J1974O709j2363l065J7444k2482n749j4403
15939h37k3061k9422N624K9025J7793j3332M02k3060r040J5305K3747R801O303
15926I248P728n432P703M971j1142j1708n4624J4614N8687j0337l5508l853K862
15913b6791J1788K096Q743Q30o565J5391K8261q106o631j3088j3152l455N654
15900e025L484J0882k2937j0397k3383J7813L5614k3165j7409n939K5284O062
15888i116j860M756j1379J1422J0776P139k948k355j4676r406M941J4021J5822
$$ y = [21948, 36556, 21373, -8757, -34398, -34484, -20852, -21642, -28680, -38655, -31726, -6488, 3399, -9577, -29613, -21284, -14390, -27087, -23564, -19511, -7052, 2030, 4116, -25559, -53619, -58757, -55854, -51227, -5902, 24550, 15853, 21098, 33072, 39781, 27418, 24353, 41797, 19315, 13566, -837, -23898, -53320, -47696, -18671, -878, -14210, -13808, -36868, -45908, -30603, -6856, 2945, 9248, 16976, 11544, 19247, 24218, 13076, 1368, -53256, -38642, 20045, 9708, -25800, -29653, -26791, -15003, -12907, -4164, -3334, -9899, 5492, 33753, 25647, 19016, 5928, -7224, -10679, -5025, -1541, 9341, -13596, -23993, -47376, -29563, 6051, -17114, -34523, -40462, -15178, -9116, -10976, -6220, -17599, -6177, 4599, 11738, 8790, 6435, -8241, -17647, -12706, 1315, 17137]
15875A7137O7k2166k7515k3237k517K9549J4673K1845M587n279r526J297M2251
15862D1166j1749l3494p277j5657P833J049J761j3309M698J6593M411K2786K4847
15849D3658j3140L512j1005j4754m860N663M216n698j8810j5475K228R260L3011
15836A7806r270j4492J4358K1683l974n0743n913N111o334J8504M680j6057j130
15823b5771J6389L8184j549l1375k3493K1546q843K3350J5601j0424j1711j1185
15811i281k2609j4142K5557M381M451K200M308j4721j0316R184j1888j7784J6299
15798c4361L9218j2382k5891o9l4745j9745J6340J3949Q514M684n467L495J0017
15785c6443O613J6482M130q961J2722K0808r546k1077j4323o404L0111J8985j514
$$ y = [17137, 17204, -4962, -32477, -55714, -58231, -28682, -14009, 7836, 12423, 7144, -2382, -1085, 41166, 29417, -4077, -11354, -27011, -19178, -18129, -16368, -29677, -24979, -8386, -3975, 18811, 43658, 30518, 34030, 23025, 8271, 3411, 9074, 13290, 7592, -11218, -26693, -24465, -15205, 17806, 8536, -5956, 8402, 30085, 26111, -24632, -30545, -25434, -31768, -13264, -8584, -24641, -25771, -9382, 28802, 27253, -4122, -27615, -6069, -14912, 8438, 24039, 13615, 1904, -9281, -31890, -46032, -20475, -16094, -11643, -9443, -5135, -19856, -30172, -20988, -32876, -50660, -34361, 4857, -7525, -33416, -33485, -68230, -87975, -71635, -57686, -49172, -44488, -49955, -46460, -36443, -29830, -13348, -9218, -18179, -5457, 15351, 5805, -15272, -29595, -35999, -5888, 13097, 11583]
15772A1583P545k1921m70j3592r477J7756J7703k4775k8154j6726J4407K1651
15760b4470Q903J0038k743j4882j6281l286J3620K1642j1357K071q886j2347k9380
15747f7358j637L6424K206K403J8018R672K4622j1180k5127j1455r146K2305K4766
15734A4513q200k2565r195J5387j549n622J528K8571J2665J9885J7289m8870j5316
15721a479j8034k30k140j9845j5549J0665K6762J0297j5292L0322K0190k4452
15709A215J7068M064k6778j4632P458k008j4580J7828M843J094K3743P417k3734
15696B998m2507n125j1654O481K3888J1695j2432j978J3118R490j1235p893r698
15683c4852j0714J1533J1834r8J4666K3213k4975k2032R801J3118k8088N183K3599
$$ y = [11583, 19128, -2793, -3263, -16855, -26332, -8576, 9127, -15648, -43802, -60528, -46121, -24470, -15567, -5529, -8272, -23154, -39435, -42721, -29101, -7459, -18816, -16745, -25631, -37978, -67358, -68995, -32571, -30365, -27962, -9944, -272, 24350, 13170, -11957, -23412, -32558, -10253, 14513, 6313, -16252, -25447, -10060, -11609, -17231, -15703, 12868, 25533, 45418, 62707, 13837, -1479, -19513, -19743, -21883, -41728, -57277, -46612, -19850, -9553, -24845, 5477, 25667, 1215, 18283, 22347, -4431, -19063, -11605, -13613, -28193, -10365, -5522, -4428, 19315, 26732, 2998, -39509, -44634, -56288, -49807, -25919, -14224, -26656, -28634, -15516, -6026, -17261, -25154, -34852, -45566, -34033, -22199, -22297, -7631, 15582, -9393, -31425, -21624, -8506, -36594, -31411, -7812]
15670g812M7413J8614k5509k1101k9348j2672j2874K418j2569K043J2907k2033
15658f0523n330J4549M115j1740J1786J0147l6373j3220Q363L5855o343K8049
15646b0665J3982j1488Q48J704j0644m629o102O10K1200K7968j560j943k3171
15633a3890r679K4064j7961J2555N030J986k9156m8892K9146M8213M616K1537
15621B7569M452p808k2975m3873L482J7388k711o30n209k405K1441M43k274j7366
15607c0476N06j2558p967L3268q993J3967j2561k6561m825K9039O555J1384O599
15594b623K1362k62K391j5664k1097J0122K5862J0193k6103m2403j3025L3185
15582a8062K1659l5289j0215N0314K2139j8966p502J4815M331k3356j804Q480
$$ y = [-7812, 39601, 58215, 32706, 11605, -17743, -30415, -43289, -40871, -53440, -51397, -38490, -60523, -65853, -51304, -47189, -58929, -47143, -36996, -73369, -86589, -78226, -42371, -48714, -20665, -6683, -18171, -17323, -15619, -26263, -30892, -36994, -36384, -15184, 12784, 11224, 9281, -13890, -23569, 495, -17466, -4911, 119, 2105, -27051, -75943, -46797, 1416, 6032, 27569, 32021, 24213, 1238, -42635, -39153, -21765, -24476, -25106, -30315, -32720, -11279, -10836, -13110, -30476, -29970, -42528, -50495, -17227, -26220, -12253, -24814, -51375, -56200, -27161, -20606, -9222, -2623, 18739, 18477, 20868, 5204, -15893, -5771, 20091, 30284, 4181, -38222, -51247, -18062, 3597, -31692, -41907, 8407, 30546, 11580, 4078, 18893, 23224, -132, -1936, 6544]
15570F544K1915J1940j8379L081j2058j0409k974P354L702k5759j645Q598J509
15557f581p038L340K9025J1672j7827J3278j1751l0218K2399J2903k0774M566
15545B994K738O712j0724m4996J1875k842L485K5467j441j7425M780r734j1867
15532d0978J4178N3077J4706k2678q081j2706J6017k1351m599N880O656k4394
15520b4273l687J8316J955K39J222m870K471j6090J2389P562J1929j4515J9517
15507A2165N031Q278r745n2236j3310K5019L665K2701N855j781k7253m970R966
15494a6615k354m251J8406n700K924n024l3896J2636L5033K078j2097R067N936
15481F143r4P286J0851j1772m936R995n528k0302M161j6591J318J0803K6075m637
$$ y = [6544, 28459, 40399, 22020, 25101, 13043, 2634, -340, 7014, 10716, -15043, -16688, -8090, -6581, -13619, -10279, 18746, 30418, 12591, 25869, 14118, -16100, 6299, 19202, -1572, 2994, 5732, 12444, 1720, -43276, -31401, -34243, -30758, -5291, -6732, -24157, -19377, -29111, -40978, -26800, 26277, 40983, 18305, 10224, -2482, 13535, -7816, -12415, -6535, 121, -24273, -27960, -9644, -7689, -7450, -6228, -11098, -8627, -24717, -12328, -4766, 7163, -7352, 12165, 17196, 25474, 15729, -36507, -49817, -24798, -21133, 1568, 7423, 5642, -21611, -26581, -16615, -18969, -23220, -4814, -10514, -7590, -12614, -46510, -33874, 1159, 3237, -8860, 207, 6143, 6049, 13335, 24186, 12414, 7478, 17473, 11945, -8357, -4196, -20787, -19469, -8666, 17409, 12772]
15467A2772j5500l242Q733k7301j2889l460K345J457j4123Q322O635O299K4050
15454e902N755q958m347R010L554k4560j5797j823N4722J9402k2724k1266j8970
15441c1904j9299M1807J2757J437j1230n428l535N726j2197k0632Q50J7885K02
15428b3561k0330J1073K5611K863J3388j2577o433K8664l805M760p34R3j4207
15415D805j1121J937j2838L635j96j504L802r128k0051K1775L4119j2796j5593
15402a3154J9647O598o719k240J80l7630M505M587j7566K5355J2428J1108N50
15389G649m1849j4862J8860K2934L51r55k361o417n393o916q468p472k0361L5282
15375b9978J3711o052m978j2464k1998k2345K3139P43n128k1885J736J0884M5156
$$ y = [12772, -2728, -5970, 2763, -24538, -37427, -40887, -38542, -37085, -51208, -42886, -36251, -29952, -5902, -147, -9105, -13452, -4442, -888, -25448, -41245, -43068, 11654, 31056, 8332, -12934, -31904, -51203, -9396, 3361, 4798, -6432, -11860, -15395, -9669, -21866, -42498, -41648, -23763, -23561, -43891, -32818, -7207, -4344, 9044, -3533, -9966, 18698, 14893, 19653, 18919, 19012, 4805, -6316, -4379, -17217, -13582, -13778, -15282, -11480, -20608, -40659, -18884, 15235, 2439, -13154, 6493, 13091, 6372, 4132, 4312, -33318, -28813, -24226, -41792, -16437, -4009, 7099, 7649, -34200, -49062, -30202, -7268, -6917, -7872, -10233, -16650, -22043, -28959, -37427, -44899, -65260, -29978, -16267, -22319, -27297, -39761, -61759, -84104, -60965, -60222, -65350, -87235, -85499, -74615, -29459]
15362b9459M747k4586J5477j137n739m727P081L2323k7832k9655J5823R841o578
15349d4421K1365K7109M230m0372M131K6481P608j192m928K520p84O002K3788
15336C1537J1838k8673k1778J2966M2690p392j8816k4938m04J5444l3194k1172
15324d1892J0738J060P082J4713M962O16j1753K133J5712o724J299l4514k0065
15311e6633J9231Q94l225j8924M9378J6267m392L821K696p198k471q764j4522
15298b3842j1489K5840K0738Q302o35K4591k2326P870j120m764k4847p600k287
15285a1569n755M250M87K1033J5052l3898k2431J3299J7877q276J1138P156K0932
15272B9295J2325L541k0251j1331J6393M85n413m842P479k5835j7824J892J7708
$$ y = [-29459, -24712, -49298, -33821, -34958, -40697, -45424, -38343, -6020, -33852, -63507, -47684, -37843, -44421, -23056, 4053, 8283, -32089, -27958, -1477, 6131, 4939, 11, 2531, 1747, 7749, 31537, 43375, 14702, -7076, 5890, 48580, 41188, 22372, -2566, -2970, 12474, -20720, -41892, -31154, -30094, -23012, -8299, -3337, -2721, -14474, -12341, 3371, -3353, -2054, -36568, -56633, -37402, -36508, -39733, -58657, -9279, 6988, 2596, 6417, 9113, 1915, -556, -9320, -23842, -35331, -9491, 11247, 19549, 18914, 43505, 21179, 29049, 27929, 23165, -1682, -9282, -11569, -17324, -13074, -12587, 8446, 23498, -10400, -32831, -19532, -1655, -9931, 1207, 8363, 29295, 41620, 45161, 24910, 13579, 29972, 30457, 25044, 20202, 27681, 1846, -15978, -14086, 3622]
15259C622J5370k4414k3839l903n194k179J2318J4206K6387j358j957j0005j735
15246b681J2370q368j1165k3187k8477j90J4310K8023M284k975j7000j7875K7371
15233b5560j1220p162J9675j3325j4073j9472J2904J4844K4020p23j906n858l329
15220c1185j2608O059l9298j4696L3508L8916j1375J1078J7439J6302j3562O626
15208G204j0875k1062j2236J8630k91j6302O988L492R936R353k1770l606n53J2765
15194a8327J4970J4088J9377j4720m304k3894j2404k2667k306K5525M033J1035
15182i594N972j0482J2740J5450K4627q420l907k162j3601R628Q00j0587J6017
15169B6481r522k3262j1096K901J5195j3732k9416O732J5717K8890N177n599m11
$$ y = [3622, 18992, -5422, -29261, -33164, -38358, -40537, -28219, -14013, 12374, 11016, 9059, -946, -2681, 9689, 1321, -9844, -33031, -61508, -61698, -47388, -19365, -15081, -18056, -35056, -52931, -25560, -36780, -43942, -24267, -37592, -51665, -71137, -58233, -43389, -19369, -20092, -21998, -27856, -31185, -43793, -37734, -77032, -91728, -58220, -19304, -30679, -19601, -2162, 14140, 578, 7204, -3671, -24733, -36969, -18339, -18630, -34932, -27944, -24452, -14516, -5163, -26933, -30539, -31092, -18327, -3357, 10731, 30108, 15388, 11084, -12810, -25214, -47881, -50187, -24662, -20629, -9594, -3622, -14104, -1364, 14086, 38713, 30293, 26386, 24224, 10623, 20251, 21051, 10464, 26481, 16959, -6303, -17399, -14498, 697, -13035, -42451, -35719, -20002, 8888, 14065, 8466, 8055]
15156H055K2536J8163j3151N509n756k4724q100M756Q361o267j5286J4360Q787
15143A7243j268j7341k0317J1668J8756j0094k0067j9553K61O96K7385R702R30
15130a999o853J7651l213p784R49k776J4330k0317m535J2285k2429k3838Q991
15117c9538j30j2666j875P308O519K9533j1599q008K1599J3370o83r316n807M747
15103f546N562M575l947k841j1304J0509P199j7619k0799N306j7658k1168M1131
15090b7600K6916J6087l39k4921k5444L259K2024L3697r968j2545K4537J0205
15078C5908J096j2301j9494L695K8021L951l6174m6771j3133J7818J5797N2889
15066C1302J6584l6467n620J734j1644M449L2111l097K52j5393o447O044J6985
$$ y = [8055, 30591, 48754, 35603, 41112, 35356, 10632, 2532, 7288, 15649, 9382, -5904, 8456, 17243, 15975, -1366, -21683, -10015, 8741, -1353, -21420, -40973, -40712, -40016, -12631, -2929, -1999, -8852, 8799, 5586, -2198, -1249, -4025, 10305, -10012, -14547, -2262, -24691, -48529, -39538, -39668, -52334, -54209, -46901, -40382, -10849, -22448, -30456, -8857, 4513, 3830, -5486, -11293, -6546, -984, 3591, -356, -3197, -14501, -3992, 3207, -14412, -35211, -29905, -47563, -68731, -27600, -684, 15403, 15064, -9857, -35301, -32042, -10018, 23679, 13711, 1166, 25703, 35908, 37004, 24703, 5209, 8904, 36925, 40876, 4702, -42069, -55202, -37384, -21587, 31302, 47886, 11419, 5799, 7533, -4111, 338, 32449, 29352, 29604, 14211, 7764, 13808, 30793]
15053C0793Q455j6197k1324m148m059j0305j997q773J206j4761Q67J2851J7093
15040a0299K5045r725p782j9946J8001L4646Q27k2921j0576K2443M869j0606J5604
15027B9580q913O71j2217m188J1457k5120l182J4611K2404k2093l1867k645J6767
15014a4735J7921j3832J000N8594J9967k237J2110K5082q535k2772j2553J362
15002F1372m027l2332j2673J2252K0523L6171L0576M3252M2250N9941Q1653J21154
14990D60112K42496L93584N43200L38202r9241l92757m09314l40471k16883j49875
14980C69053r5565o6207n8520m9842p479q181l4709k0794P611k8470o06O968j0720
14967B539j9705j075O219J0319j2254M994p753q642k767K6957N3186M1286l1509
$$ y = [30793, 39248, 23051, 1727, -2421, -6480, -16785, -18782, -27555, -26349, -41110, -40243, -27392, -10299, 14746, 5021, -2761, -22707, -4706, 29940, 30767, 7846, -2730, 19713, 24582, 13976, 29580, 20667, 21338, 9121, 4933, 16390, -8730, -11912, 2699, 25103, 3010, -28857, -31502, -14735, 3186, -10646, -9646, 48948, 68915, 66678, 78788, 103870, 95335, 72563, 60010, 61372, 57345, 25013, 12340, 24592, 45115, 81286, 111862, 155114, 197364, 257305, 338958, 460112, 702608, 1096192, 1639392, 1977594, 1878353, 1485596, 1076282, 735811, 518928, 369053, 273488, 207281, 148761, 98919, 91440, 83259, 48550, 27756, 35367, 6897, 6291, 13259, 2539, -17166, -18241, -12022, -1703, -13957, -8963, -16716, -25358, -28125, -1168, 52018, 93304, 61795]
14954F1795l8397l115J2278K8193k8027m1813J743M1789J4457l2804m6522l037
14942c3460o501j3860J5446k700p397j7409j3613L0852J70j1233K7253J6040K0300
14929C888K2363j1132k7702K174N425m692r842l069N207j2033q862l590J1288
14916c0577J120j3672J4159j0865O579J6112P424R208r41J1927K0762O358p477
14903C0117q362k9627j2947K6890N77O280J5181O260p36l4977l2976J1218J4965
14890h137J8365l992R005K0617l4380j9490K6003m943R810L1102k556j2551j8111
14877A0742l7535j0506L5981K7196j4982L748P271j1158J1233O626k537k895k576
14864B0608j759j0645J01J7081k2396j404K890j1534O136K7825k5702M247J0418
$$ y = [61795, 23398, 20283, 32561, 60754, 32727, -9086, -7343, 34446, 48903, 16099, -30423, -33460, -39961, -53821, -38375, -41075, -48472, -65881, -79494, -48642, -48472, -59705, -32452, -16412, 3888, 26251, 15119, -12583, -10409, -4984, -9676, -19518, -22587, -17380, -29413, -38275, -41865, -30577, -29457, -43129, -28970, -39835, -33256, -17144, -9720, -512, -1453, 10474, 31236, 37594, 30117, 21755, -7872, -20819, 6071, 6648, 12928, 28109, 34369, 33633, -1344, -34320, -23102, -8137, 10228, 6236, 15241, 35858, 1478, -18012, 7991, 3048, 12858, 43960, 41404, 28853, 10742, -26793, -37299, -1318, 25878, 10896, 14644, 21915, 10757, 21990, 28616, 26079, 23184, 20608, 18849, 8204, 8305, 25386, 2990, 1586, 4476, -7058, -922, 26903, 1201, 5448, 15866]
14851A5866j5894j4461R128r408q077k2838M523N506M398J2060K7862j1123o24
14838c082j0208j0009O331l766r754q555K838J0088l316K3463J9783M421j1782
14825F452j3103l2568J8985L328p265L0045K7834m2852k8659K7606M440n150o90
14812a1597R803k3955r510K451J4986K267q760Q302p778R33N419l135j7952l911
14798d2437J4305r274J9381L8420R873P223K468k923q104j2663q338K1980l965
14785B5946k4371R194K0949O340p506l945j7539k6597k8777k3514K4499K0428
14773b4893l398K7106J6505J611j4276l752k57k0262n754J9787k0226l0635o42
14760e9086K842k2121N400L0576L1534J5826p591j0580N012K882J037P620J5727
$$ y = [15866, -28, -14489, -5361, -14769, -22846, -45684, -41161, -35655, -31257, -19197, 8665, -2458, -3082, -13290, -23299, -16968, -20734, -30488, -39043, -36205, -26117, -29433, -5970, 13813, 18234, 6452, -6651, -39219, -20234, -16906, -24171, 5874, 33708, -9144, -37803, -10197, -5757, -10907, -11597, -1794, -25749, -35259, -32808, -17822, -15555, -24315, -16013, -23791, -22858, -17439, -20574, -38526, -42437, -28132, -37406, -18025, 20395, 30268, 37491, 39959, 37036, 28932, 16269, 7931, 29911, 25946, 1575, 10769, 31718, 38058, 30552, 26607, 9068, -17529, -46306, -69820, -45321, -24893, -28291, -1185, 15320, 16931, 2655, -1097, -1354, -21616, -27370, -7583, -27809, -58444, -59086, -56244, -78365, -72965, -42389, -10855, 4971, -2620, -13200, -8188, -5306, -4269, 3351, 19078]
14747A9078l113k0157N814O438K697q949K4196J6636j9134k8793K563j1559j1323
14734b5606j291O665o340K8145M561J618J0893J9322j1324M674J0551l4697k2133
14721a4962J9175L750j2310r674j7098O208J2847K1100K6346J2451m529k4201
14709A9103M045N923J637p910k7107J1500N478j2470j9543L0627N5011n811l1848
14696B8635q56J886N72N703K716j1267j6369k2631J1429j8271P541K9487K2013
14683D0588K6212k806n1993l5106L698Q762J5704r016k673j8207O500K1154k1887
14670a9070q811P516q58k248J078r132J0951j0432L0645P239p739n676l045J175
14656h407L2384j977j6305p5J0721j915j6357R302O833J1416l225j4384J3279
$$ y = [19078, 15965, -4192, 1622, 8060, 10757, 1808, 26004, 42640, 23506, -5287, -2724, -14283, -25606, -26897, -20232, -26572, 1573, 6134, 7752, 18645, 37967, 26643, 31317, 41868, 7171, -14962, 4213, 7963, -4347, -14021, -31119, -24911, -12064, 9036, 35382, 47833, 43304, 19103, 23148, 29071, 30708, 22798, -4309, 7191, 12669, 199, -19344, 11283, 66294, 60483, 28635, 27779, 29665, 30237, 35940, 38656, 27389, 11020, -11611, -182, -18453, -10912, 18575, 40588, 66800, 63994, 12001, -23105, -19407, -10645, 5059, -3957, -6630, -24837, -18337, 2817, -19070, -27881, -20365, -21223, -23471, -22393, -31525, -20574, -31006, -361, 6878, -861, -6537, -9582, -8407, 23977, 22000, 5695, 5620, 16341, 14426, -1931, 7371, 14204, 25620, 22395, 8011, 21290]
14643B1290O182N828l127N501J6312k9203m2091K852j3477J5833J9834k2335j4560
14630c1161m535n672k904k8849J693J8571M5559k923J6558J1985J4662j502l1252
14617B30k5779J5846J1710j4030j2422n650k4098k4104J1683J7445K2614M160
14605b2395r524K2786J8456J119j8270j5857K0645j0901M156J2921j6814m056
14593a7734O623o732j5287L0165J8979Q46o066o643K6822p122O632J5313j386
14580D4410j909J37r618O955r141j4120j174j7551l360K687j4800k6765Q476K7840
14566g933J5122o980N571j8224m865r869j3099L1667K2247R287J1973O848l366
14553C8379q945l0694o014k7074P544J7551j9893k0786J9721K7336r104j289J5972
$$ y = [21290, 27472, 33300, 30173, 35674, 51986, 22783, -19308, -16456, -29933, -14100, 5734, -16601, -31161, -35696, -41368, -44272, -73121, -71428, -52857, -7298, -10221, 6337, 18322, 32984, 31482, 230, -25549, -9703, 2007, -12023, -24445, -30095, -54193, -78297, -66614, -49169, -26555, -22395, -31919, -9133, 9323, 10442, -7828, -23685, -3040, -13941, -9785, 3136, -13678, -17734, -11111, -17843, -33130, -2965, 16014, 16860, 10794, 4151, 30973, 23851, 30483, 45796, 44410, 42501, 42638, 33020, 39975, 30834, 16714, 15540, -2011, -5371, -2684, -17484, -44249, -35773, -7933, 7189, 209, 5780, -12444, -17309, -27178, -40277, -8610, 13637, 22924, 34897, 41745, 38379, 29434, -1260, -7274, -34348, -26804, -9253, -29146, -49932, -30211, -2875, -11979, -13268, 2704]
14540B704k2932k711K3132L4952J5350j9514j3538J614Q852L5534j025j0474l4342
14527A7602k6910L429j2720K2151J3035M419n82m750q636R385l345N534j6574
14514B038j033p72J6858J1393j6314K0690J6933k4102k57j1915j8050M186l351
14501c696p985K9742L383j905N38J3114j6313o921N633j8292N18P237K8735o678
14487B7110r874O895J8174n899P894l303n152J5075j3131J6945q363o787j7447
14474B2137K7312N524m1057j0150R471j6192p728o158R893J7899P583J5066k5574
14461H026k7798j0117L1294n007j1929r769k485J5571P284k7637P607J7647K7558
14448B0245l280L73m350j4029k2636L827K6858j1286k2864J9138j1435j2697J698
$$ y = [2704, -20228, -22939, 193, 35145, 50495, 30981, 17443, 19057, 27909, 63443, 62418, 51944, 17602, -9308, -5879, -18599, 3552, 16587, 21006, 20424, 15674, 7038, 16423, 13078, 18612, 2038, 1005, 233, 17091, 28484, 12170, 32860, 49793, 25691, 25434, 13519, -4531, -345, -3696, -11681, 18061, 21444, 19539, 20077, 33191, 16878, 9957, 15590, -2702, -2184, 5053, 33788, 27110, 17236, 24131, 42305, 36406, 44300, 40997, 35845, 50920, 37789, 54734, 46371, 39584, 22137, 49449, 54973, 13916, 3766, 13237, -2955, -10683, -16841, -6948, 10951, 18534, 33600, 8026, -19772, -29889, 1405, -3602, -15531, -25300, -27785, -12214, -4930, -32567, -24960, -7313, 20245, 16965, 17338, 12988, -1041, -23677, -19850, 7008, -4278, -27142, -8004, -19439, -32136, -30438]
14435c0438j115J4028O841K6536J5649k7599o734K3618j0271J790k8717k7138
14423d3550M141N9977J9450Q014j0634j2911j4464Q90j1687j0236K073j125M0757
14410C0695L0932J752j5977m0409j0385l671j4768K249J9463j1997K283J5179
14398E346k8429J0434n138k3413n481K2362K8830r85p067k602j505L6756j4154
14385A4954m606r922j6118J789l324k0338J1781J8495R648m836J3550k955j97
14372G921L29o717j0728o653N231j4447M3162K3232j8448j9034R923P728l3575
14359a2076p403J0040P009k428Q997J303P75K7770j0365J2751J2479j1804k0792
14346A6256p987L6728L2168O124j5303j9488q240k1360o131j0206J6212K0228
$$ y = [-30438, -31553, -17525, -10684, 15852, 31501, 3902, -2832, 20786, 10515, 12305, -16412, -43550, -39409, 20568, 40018, 48032, 37398, 24487, 10023, 10913, -774, -11010, -8937, -10062, 30695, 61627, 63379, 47402, 6993, -3392, -7063, -21831, -19582, -119, -12116, -9833, 5346, -23083, -12649, -17787, -41200, -46681, -24319, 4511, 3526, -3541, -6143, -7648, 29108, 14954, 10348, 426, -15692, -13903, -17227, -37565, -25784, -7289, 2359, -2477, 11073, 8118, 7921, 8250, 1533, -9195, -15848, -10617, -25064, 18098, 41330, 22882, 3848, 13771, 21499, -12076, -19479, -9439, -2430, -4858, 4139, 5442, 6217, 33987, 23622, 36373, 48852, 37048, 16256, 8269, 44997, 77165, 83289, 67986, 48498, 40258, 18898, 12767, 2561, 18773, 39001]
14334C9001J8864j7173k006j2429l0104K1098N239J2101J34k2596j3056k4305
14322b5232O857K2110O558q873r185j2843j03j3800n870J3663K4008r747N297
14309g160K6382K6909k2776k3171j0986L0643L3736M712m837l106k2104j5363
14297A2879j5122N95r352j6184j026J7270J5940L292M516k1188m694J7712J3228
14284A7866J2116n40q077j2439J0577M85o0583J4852K4800r974k8129k071J0956
14271c0161J8256R758n208L4238J8354m279q170j7828o771j3743o746J7304k0183
14258a5179M448R298R136o408r610J3423q660l604J0171N894q170n609J3283J8058
14244B6471K1632L301j0287J446o717j7939j8169L679J256K783j5026J3425N158
$$ y = [39001, 57865, 40692, 38686, 26257, -3847, 17251, 22490, 34591, 34725, 12129, -927, -25232, -18375, 3735, 10293, 1420, -7765, -20608, -20711, -34511, -40381, -26718, -2710, -12457, -7160, 19222, 46131, 23355, 184, -10802, 19841, 53577, 58289, 53452, 50346, 28242, 12879, -2243, -1648, -11000, -27184, -28210, -10940, 5000, 8292, 12808, -8380, -13074, 4638, 17866, 29982, 29442, 21365, 8926, 19503, 19988, -40595, -25743, -943, -10917, -39046, -41117, -30161, -11905, -2147, -7355, 26883, 45237, 40958, 32788, 14960, 8189, -5554, -12300, 5004, -15179, -10731, -1433, 7703, 1295, -8315, 5108, -3552, -7156, 3015, 8909, 739, -4870, 8413, 26471, 48103, 51404, 41117, 42563, 35846, 17907, -262, 3417, 4673, 7456, -7570, 5855, 11013]
14231A1013m364j0043J9117n116J6423l315k6420k6722j7800J0840J1221J6171
14219h995L1442J8857K626l3429j4962J1418n315J2391L6976K2618o402j7807
14207D9418m7436k7424J649n83J2311J5580J2206R916j8799k0716R830j3091O160
14194a0979J3705J547J7675n245k110j2220K8183R611j9449j8524J8673J0078
14182C0945r402j0271k4660K2176K7230o162k1482j6016J1441O65J050l2411O592
14169b0305J3165J4185Q660J9058k853J0815M643P977k7824K8582K0966k1129
14157E5940j0032j5711K2304N723k3436k4343K4445P60l1220j9375n50J2508k3170
14144b6157J5139J3413j2679J5417k133j7578j8485o886J0463J6744K6143r730
$$ y = [11013, 6649, -3394, 15723, 10607, 27030, 23715, -2705, -29427, -47227, -36387, -25166, -8995, 22447, 41304, 43930, 10501, -4461, 6957, 1642, 14033, 51009, 73627, 67225, 49418, 1982, -25442, -23793, -24376, -12065, 3515, 15721, 25637, 6838, -13878, -4048, -17139, -10979, 2726, 4273, 21948, 16703, 14593, 2373, 30556, 40167, 20718, 2194, 20867, 30945, 21543, 11272, -13388, 8788, 36018, 29856, 8374, -7642, 3799, 4464, 5514, -26897, -20305, -7140, 7045, 15705, 34763, 31910, 42725, 47368, 55345, 27521, 56103, 77069, 55940, 45908, 30197, 52501, 58224, 34788, 10445, 34890, 35650, 4430, -14945, -15495, -2987, -26157, -11018, 2395, -10284, 5133, 3000, -14578, -33063, -39949, -29486, -12742, 13401, 3671]
14132C671l8417O340N4387K5938J8226k358J6600j5514p746j2525j2736j974o719
14119B7173j2156J58j4433k0933O886j3786j561K737K0053J0973k0348L246J8242
14106F251J9310J1837q221Q50J8076K6738R71k049j2117j3700p878J1319j0886
14093D0501J303j3609j024j958k623J0703L168j8489m785L816K4521J3435j5021
14080C9938L15R200r203j1065Q555Q69M356K1963q473m917L565k2432J680K6552
14066F0903n482J653j4704q647J877R170K5715k4182l9257N490j0209k0105o499
14053b4277K8271J3790r750Q770k721j0357J1794J880n34m434K1073K5525l961
14040E5069j7127j7688j753P836K6385L6658K2695L3702J2662j8080j7730L214
$$ y = [3671, -34746, -28406, 25981, 51919, 70145, 67787, 84387, 68873, 61127, 48602, 35866, 33892, 27173, 15017, 15175, 742, -20191, -13305, -27091, -28652, -25915, -5862, 5111, -15237, -11991, 6251, 25561, 37398, 29177, 30027, 48103, 74841, 75812, 73763, 61646, 47946, 40068, 51387, 40501, 41804, 28195, 27171, 25213, 22590, 33293, 36461, 17972, 13187, 17003, 41524, 54959, 39938, 40253, 49453, 40250, 29185, 37740, 38609, 42965, 64928, 56455, 51538, 55103, 32671, 34351, 60903, 55421, 57074, 42370, 33723, 35600, 44770, 70485, 46303, 7046, 12536, 2327, -17778, -24277, 3994, 17784, 8034, 16804, 14083, 3726, 15520, 17400, 16866, 12432, 33505, 59030, 55069, 37942, 20254, 18501, 26337, 52722, 89380, 112075, 145777, 158439, 140359, 122629, 125843]
14028A25843R32O606K0144L0540Q265P763M6641J3131N858O2325K5595L689N0433
14015D07765O9899L9044K9512M8832R0559J33426J83193K57414L22741M20192
14005B002577M91345N00196M67521L85183K48888Q0893q7438k73554m09721m50091
13995B955799m26793m24159m29513l91281k83474j86468j56155j31522o9767o0168
13985C96499p4746q0614n215r660m4323k0407j3058L243k333r208n8021l2103
13973E0054L181K0559l297n983q634J667L831o686K4312J4893n957k1684k7308
13960C8948R842R067Q776p123j1149j814K5344J1716j6065O742L797J2690J096
13947I1867N73J7066J53j1934j2248J7878J1495P073L2503m624J1350l37J3021
$$ y = [125843, 126775, 133381, 153525, 184065, 192330, 200093, 246734, 259865, 265723, 328048, 353643, 357332, 407765, 477664, 516708, 546220, 595052, 685611, 819037, 1002230, 1259644, 1582385, 2002577, 2493922, 2994118, 3461639, 3846822, 4095710, 4176603, 4089165, 3815611, 3405890, 2955799, 2529006, 2104847, 1675334, 1284053, 1000579, 814111, 657956, 526434, 456667, 396499, 321753, 241139, 235924, 226264, 181941, 161534, 148476, 151719, 149386, 140178, 82157, 50054, 53235, 73794, 70497, 64514, 55880, 57547, 61378, 54692, 79004, 93897, 87940, 66256, 38948, 48790, 57857, 66633, 59510, 48361, 46547, 71891, 83607, 67542, 74284, 78081, 90771, 91867, 92440, 109506, 109659, 97725, 85477, 103355, 114850, 121923, 154426, 149802, 161152, 160815, 173836]
13934A73836L9745K6254M720J7034R1709J30126J84880K66199K77074J57857o2318
13923A307116k25724k74899k31014j60526r6037k9584m2720n0966k7593n1326
13913A16727k1323q557k4448k4883p44K322j2183k0402K7341L8320j0092K899
13901F4977J9985j9812O558K0170M795k8011j5823L018o770j5787L4909K1872
13889I0081J6778l120m804K201q620Q661J939k5660N14o212O295J9K9116K5138
13875A32326k9472k3767o163j4213K398L263k330j465K3981J0393j3505J7957
13863I9403J1479l40K2651K7558M575J9075L5603J715K5148k5660k1081K8777
13851B28903N8498M1836M2288J6502K6028J4997J4881l057N1660L7862k1932j4103
$$ y = [173836, 213581, 239835, 244555, 261589, 353298, 483424, 668304, 934503, 1211577, 1369434, 1307116, 1081392, 806493, 575479, 414953, 318916, 289332, 246612, 195646, 168053, 116727, 95404, 86847, 62399, 37516, 36772, 39094, 26911, 6509, 33850, 72170, 62078, 64977, 84962, 65150, 71708, 91878, 96673, 68662, 52839, 55857, 49087, 33300, 68209, 90081, 106859, 103739, 98935, 101136, 92516, 101177, 103116, 77456, 77970, 71758, 78053, 78072, 107188, 132326, 102854, 79087, 72924, 58711, 61109, 64372, 62042, 60577, 84558, 94951, 81446, 99403, 110882, 110542, 133193, 160751, 165326, 184401, 220004, 221719, 246867, 221207, 200126, 228903, 287401, 329237, 371525, 388027, 414055, 429052, 443933, 440876, 492536, 530398, 508466, 494363]
13839D94363k7612k0984k7563l9404l8507k0883j253k0595l6479j8942l8168k5140
13827A78833j4855R138k6211m1780k97J9533j0768j0180l7832j9453O920J9872
13815G2920M216J555J1893J615l8811n150J2903J4162J3428j480M150M624j4967
13802H1058l841J8230k6549l3914P527K1255n188k421r272n806k130L836k570
13789D0215k751K6199J1359k0408J3011J0699j0988j207J4208L405p502J1567
13777H7807j9337J0836J355L734L2255R106m2270k6264k116L1765K8164p034L595
13764A11596j7853o369J1845L4771P500j1891j0297J0624K682n920P484J6788
13752A50960N77j2229j5804j155J4977j331J773K53k6156J6271K9055l463N7j4720
$$ y = [494363, 466751, 445767, 418204, 378800, 340293, 319410, 318157, 297562, 261083, 242141, 203973, 178833, 163978, 173116, 146905, 105125, 104828, 124361, 113593, 103413, 65581, 46128, 53048, 72920, 77136, 78691, 90584, 92199, 53388, 48238, 61141, 75303, 88731, 87251, 91401, 96025, 81058, 77217, 95447, 68898, 34984, 42511, 63766, 58578, 56157, 46885, 41079, 38949, 42785, 40215, 37464, 63663, 75022, 54614, 67625, 78324, 67336, 66129, 80337, 83742, 76240, 87807, 68470, 79306, 80661, 84395, 116650, 125756, 83486, 57222, 55106, 86871, 115035, 108001, 111596, 93743, 87374, 99219, 133990, 141490, 129599, 119302, 129926, 132608, 126688, 134172, 150960, 151537, 139308, 123504, 122349, 137326, 135995, 137768, 138021, 111865, 128136, 157191, 153728, 153785, 139065]
13738A39065L846L0267J7977k7405k7478k1368K3919N0614N2231K9616J6998j1946
13726B76336N528L8346L2133K4751J9823j983J1840L2353K6815L3047L6271N4774
13714E90034N5354O5683O4855M0487K7006j1055l0345m4396k2806k2994o3791
13703F48032l3577n5854p1211o8665k6117k5284l3603k5513j3596j2171n0847
13692B31594j7657J5863R993N840m217j1597k2716O994j1330j3932M58j6654j8699
13679A53940j9187O197K3878K6245q106l8969k1665l815k1364j1744J4336J5666
13667A15412J9218J8256j8737j0416k4038k4066Q516K696K3366K7299N706k0416
13655A22796j9132k5352r005j0757k340J1057K056j1577m167O678O415j8067j89
$$ y = [139065, 142911, 173178, 191155, 163750, 136272, 114904, 138823, 189437, 241668, 271284, 288282, 276336, 281864, 320210, 352343, 377094, 396917, 394934, 406774, 439127, 465942, 498989, 535260, 590034, 645388, 711071, 775926, 816413, 843419, 832364, 802019, 757623, 734817, 711823, 648032, 614455, 558601, 487390, 418725, 392608, 367324, 333721, 308208, 294612, 282441, 231594, 213937, 229800, 239793, 245633, 241416, 229819, 207103, 214097, 202767, 188835, 189293, 172639, 153940, 134753, 140950, 164828, 191073, 182967, 143998, 122333, 118518, 97154, 85410, 99746, 115412, 134630, 152886, 134149, 123733, 99695, 75629, 84145, 86841, 110207, 137506, 143212, 122796, 103664, 78312, 69307, 58550, 56210, 67267, 69323, 57746, 53579, 60257, 66672, 48605, 48416]
13642D8416j086J0523R273m6361l5405k633J7024L2435n54m167Q115r567j3148
13629A2865K3395R237N085K6401J0723j383l6502k4913K5551L5688L452K821k0146
13616G2274P773O296R021K4402o260k867j4315l849p478Q434J5627n377l014K5005
13602A25672N416r280l0418j7489L893j6102M587K1239J6079J1721j7398L920
13590A01840J6482k5954j2098J2631R981O52N945k050N919o938J246k533k5299
13577G9824j330k099O323q886m488r245j0938J7719q988J0498J2116m410P6m716
13563G1456J1729j3534J952n062l588L650p551p611O598J2209K687J5481L890
13550I2306M688r440o92J4920K3818n317k954p344J4217L7353N566k6519l0929
$$ y = [48416, 47330, 57853, 67126, 20765, -14640, -17273, -249, 32186, 31632, 27465, 35580, 26013, 12865, 36260, 45497, 50582, 76983, 87706, 86323, 49821, 24908, 50459, 86147, 89599, 92420, 72274, 80047, 86343, 95364, 119766, 113506, 110639, 96324, 92475, 84997, 93431, 109058, 103681, 100667, 125672, 131088, 121808, 91390, 73901, 77794, 61692, 66279, 87518, 103597, 115318, 97920, 101840, 118322, 92368, 80270, 92901, 102882, 103534, 109479, 107429, 113348, 106410, 107656, 105123, 79824, 78494, 76395, 82718, 73832, 69344, 60099, 49161, 66880, 57892, 68390, 80506, 76096, 76172, 71456, 83185, 69651, 71603, 66541, 62953, 66603, 59052, 51441, 58039, 70248, 72935, 88416, 92306, 96994, 87554, 86862, 101782, 125600, 120283, 117329, 109985, 124202, 161555, 167121, 140602, 109673]
13537A09673k99j3660O09L6410j920j2406J089Q079K2677k162K995j184r1p934
13523A41876L613J821l5760o409m109M482k1371m445M118J9490k757Q679q800
13510A00428j0704J5065k2576o94L6902J6868k580m745l1643k5585o975K018M55
13497F6234J6344L0564m120j7805n533K2562J4536j2714k1070K793j1816j6947
13485F3028j547o419J7027m377m456p090N309J5588M635j248j0431k2720O677
13472E3976K8892p301J8289j3254j5015r07J807L973Q432J1022k071k410L152
13459H8585K0773r7k5793j1384N929K278J0137N798n574k721P168L4937J4076
13446A44112k6560j7134k5261K544L412n105k114O603L526K0917K0865O196k6568
$$ y = [109673, 109374, 95714, 96323, 132733, 130813, 118407, 119496, 127575, 150252, 148090, 151085, 149901, 149810, 141876, 145489, 147310, 111550, 105141, 101032, 105514, 84143, 79698, 83816, 103306, 100549, 109228, 100428, 89724, 104789, 82213, 81519, 118421, 135289, 132709, 127964, 96321, 70736, 63761, 65779, 66234, 82578, 113142, 109022, 91217, 85684, 108246, 122782, 110068, 88998, 91791, 79975, 63028, 61481, 55062, 72089, 67712, 63256, 56166, 61475, 77063, 81698, 80450, 70019, 47299, 53976, 82868, 75567, 93856, 80602, 65587, 64680, 66487, 70460, 78892, 89914, 87843, 85433, 88585, 109358, 109261, 83468, 72084, 78013, 80291, 90428, 96226, 90652, 87931, 95099, 130036, 144112, 117552, 100418, 75157, 77701, 81113, 76008, 73894, 80497, 84023, 104940, 125805, 132001, 105433]
13433A05433j3697J4292K4846l494j8626m2509j6334J0133M877m013O335J710
13421F8953j3027K0079L4921P731j2410r675j2339J3985N948j1405j4259N653
13409H4155l222J1534J3772L5067J3700r550J2917L576r2J5995J1911J1214J4352
13396B15329M5992N7229O0895M3257O0199M0502M3667M2108K6386K8498j6140
13385F47922n2848j4970l3560k9573n1243k9576j1679m836q010J7110M2265M6678
13373E17680L4614O3122N6089L2031j406k6282k4487n7672o1288q0815q2968m7181
13361C21437m9433k6635j1474k0696k5084p400J8652k647k1140j2387K4477J1262
13349A98932k4556k8015j0472k837j6973j3003K9779Q755l0413j6234j2936j5532
$$ y = [105433, 91736, 106028, 130874, 127380, 108754, 66245, 49911, 60044, 64921, 60908, 67243, 68953, 55926, 76005, 110926, 118657, 106247, 96572, 84233, 98218, 104166, 92761, 78502, 84155, 80933, 92467, 106239, 141306, 155006, 145456, 158373, 161949, 161857, 177852, 189763, 200977, 215329, 261321, 318550, 379445, 422702, 482901, 523403, 567070, 609178, 635564, 664062, 647922, 595074, 580104, 546544, 516971, 465728, 436152, 424473, 419637, 411627, 428737, 471002, 517680, 552294, 615416, 671505, 703536, 702130, 675848, 651361, 593689, 532401, 451586, 368618, 321437, 272004, 245369, 233895, 213199, 188115, 180715, 199367, 196720, 175580, 163193, 187670, 198932, 174376, 146361, 135889, 133052, 116079, 103076, 132855, 141610, 111197, 94963, 82027, 66495]
13337F6495J788L0454r063l1714O370p467J5357K1838r60j0596m069K0590L0963
13324A29986o742j3454j9486j2419M4336N5070Pj1618O133J0784K2494J0619P487
13311B23197K4447M1015O4307L1117M9977Q4059Q9359M4704K8727L7618N273m552
13299G19248l1768l2918L848j2135o5538m7245k9629l187q040j5397J6135M8596
13287E41970O3189L4505K6373M6320K7233p35j1311m7014n0668m9407o0858o4692
13275D54905n6677n6914n8668n1159l4925l1479j200j4114j9501l1550J231o113
13263I3836R722j129j4973M366N844j4837O687J0794j0804O73O57l402J3995O995
13249A08424j4412j1224L342m965J3158j5308k1394J6837O50J9117J9859N799
$$ y = [66495, 68283, 98737, 89674, 57960, 64330, 56863, 72220, 94058, 93098, 82502, 78433, 99023, 129986, 123244, 109790, 90304, 77885, 122221, 177291, 177298, 165680, 171813, 182597, 205091, 215710, 223197, 247644, 288659, 352966, 384083, 434060, 518119, 607478, 652182, 680909, 718527, 723800, 719248, 687480, 654562, 658410, 646275, 580737, 533492, 503863, 500676, 492636, 477239, 493374, 541970, 605159, 639664, 666037, 712357, 739590, 738855, 727544, 680530, 629862, 580455, 519597, 454905, 398228, 341314, 282646, 231487, 196562, 165083, 163883, 149769, 130268, 98718, 99949, 93836, 103558, 102429, 87456, 91822, 97666, 82829, 89516, 100310, 89506, 90179, 90836, 87434, 101429, 108424, 94012, 82788, 86130, 81165, 94323, 79015, 57621, 74458, 75108, 94225, 114084, 119883]
13237A19883j1314o5j5250l002J5930L2409J5513j2835m7396o291m117m981J0619
13224H9103j2880p815N870K0277p855k6256K683K5535M25l3714L124r851m860
13211D3786P898r306J4653J2340Q381J6041j223q472K1953n27l0157j8981J2880
13198F9266K7188p049k0388j5294o287N237j0423J3493K0280M430o717J1616o231
13185G9121j343k1434o976J0978J6598p286J1251L814M722L617p654M559k8J7278
13171A07217q077j3848k3741j7097J8532l939J5456k427Q164p356R638K7677r15
13158A09284n5588j8327K1275K9604K6139N888j2974m2180j0052M9192K671O805
13146A11737J7218j4714l3272p579k9839Q175L1572J1317l0104n739J9136j3273
$$ y = [119883, 108569, 108504, 93254, 90252, 106182, 138591, 154104, 141269, 93873, 87582, 83465, 78484, 89103, 76223, 68408, 74278, 94555, 86700, 60444, 63127, 88662, 89087, 55373, 58497, 48646, 43786, 51684, 42378, 57031, 69371, 77752, 93793, 92570, 84098, 106051, 105524, 75367, 56386, 69266, 96454, 89405, 69017, 53723, 47436, 52673, 42250, 55743, 76023, 80453, 73736, 85352, 79121, 77778, 56344, 49368, 60346, 76944, 69658, 80909, 84723, 89445, 93062, 85408, 89967, 89939, 107217, 99140, 85292, 61551, 44454, 62986, 59047, 74503, 72076, 80240, 72884, 82522, 110199, 109284, 53696, 35369, 56644, 86248, 112387, 118275, 105301, 63121, 53069, 102261, 104932, 111737, 128955, 114241, 80969, 73390, 43551, 51726, 83298, 94615, 64511, 58772, 77908, 64635]
13134F4635P010n875J9905K6955J4675k9616k521J7245j3151N16K12J1268L247
13121A14505Q04q113L564O688j5972j9720j0712K0691J0315L603J4930k7772j6418
13108G6393K9386J3980l984R718K7797K1342r133k3979J618L084L736J2135L720
13095A65813j1539m928m2199k4439j3062J4438J4656j7597K5719L1336j4934p288
13083A15976q879l0869q017J7214K0260k6681k4984L2857L4799K874K023Q126
13071A34699P362J830k5549k0066j8807P286N366J3163R535R334J4980J5810m805
13058A50138p121L8428K9592J358L56j9903p026j0535m8344k8667k42J9789M968
13045A22791K577J7774j4457k483J6310R577j3449N727J8966j2453k002m643j3336
$$ y = [64635, 71645, 65770, 85675, 112630, 127305, 97689, 95168, 112413, 99262, 99778, 99990, 111258, 114505, 115309, 107196, 110760, 117448, 101476, 81756, 71044, 91735, 102050, 105653, 120583, 92811, 76393, 105779, 119759, 115775, 125493, 153290, 174632, 165499, 141520, 143138, 146222, 149958, 162093, 165813, 154274, 149346, 107147, 82708, 69646, 84084, 98740, 81143, 106862, 138198, 123264, 115976, 107097, 76228, 68211, 85425, 105685, 79004, 54020, 86877, 121676, 124550, 126573, 134699, 142061, 143891, 118342, 98276, 79469, 86755, 92121, 105284, 114819, 124153, 139133, 154943, 150138, 143017, 181445, 211037, 212395, 212751, 192848, 185822, 175287, 126943, 98276, 98034, 117823, 122791, 125368, 143142, 128685, 126202, 142512, 152089, 138640, 144367, 163333, 150880, 148878, 144235, 130899]
13032A30899j1998q280K2870L2877P777J2291k2792k1397k0388m7563R199L5791
13020A19286K7911Q868k2442j6716J8309J0096J1047q265J4096J1449k58J2073
13008A85454l092n955J83R191J9343j5610o565Q843J865k1075l0175O547Q518
12995A57472L7905K4144k1547j7731j5241J3744L0891M678j380M512l628O128
12983B19947J6510K099J824r251J0765L9291n967q662J8460K3338J4407L2137
12971C54898K1461l987J9794p989J3994K5221K1644K6102M0403O1890M2940O4114
12959F80485P7281R8565Q9959J05640P9774R7137N1064J1843L728N871J2482K78
12947A314107k3077m4459p5649j07555j08857q0698p4939q8074m2169l1317n6158
$$ y = [130899, 118901, 110621, 133491, 166368, 174145, 186436, 163644, 142247, 121859, 74296, 83495, 119286, 147197, 156065, 133623, 116907, 135216, 145312, 156359, 148094, 162190, 173639, 173381, 185454, 182362, 176407, 176590, 185781, 205124, 189514, 182949, 191792, 193657, 172582, 142407, 148954, 157472, 195377, 219521, 197974, 180243, 165002, 178746, 209637, 214315, 212935, 217447, 213819, 219947, 236457, 238556, 240380, 231129, 241894, 281185, 275218, 266556, 285016, 308354, 322761, 354898, 376359, 372372, 392166, 384177, 398171, 423392, 445036, 471138, 511541, 573431, 616371, 680485, 757766, 856331, 946290, 1051930, 1131704, 1228841, 1279905, 1291748, 1295476, 1301347, 1313829, 1314107, 1291030, 1246571, 1170922, 1063367, 954510, 873812, 798873, 710799, 668630, 637313, 581155]
12936E81155l4347J2311K6260Q738K4656K5973J189K4028Q078J9549J7748J720
12924G17058L948L0558L8322L2482J8801j578N779K0498N593n400k0228m333q429
12911H33071j8097k5066m4391N352o821n6029j9856m2793l2162j8926j7857K616
12899E59041M613N242N0J2829n947L3446L114p47L8409L5974O4730O0251L1683
12886H42688K2997j5283m1942m1511o8200o0586r4417p1169m3323k3987n146k9236
12874C70885l9202J2507m789k1575j8963K081j1410k0307r262K7031K2820j1402
12862B98414L148j893p501J7541J5741n141j1897l856O16p00J6653n186m032R770
12848C21677J486p745J039r692k9240m22O19J5201J0494K3741k17j6928P47J5679
$$ y = [581155, 546808, 559119, 585379, 594117, 618773, 644746, 645935, 669963, 678041, 697590, 715338, 717058, 721006, 751564, 789886, 822368, 841169, 839591, 845370, 865868, 871461, 866061, 845833, 841500, 833071, 814974, 789908, 745517, 750869, 744048, 688019, 668163, 625370, 593208, 574282, 556425, 559041, 563654, 568896, 568946, 581775, 575828, 609274, 612388, 611641, 650050, 686024, 750754, 811005, 842688, 865685, 850402, 808460, 766949, 698749, 638163, 543746, 472577, 429254, 405267, 400121, 370885, 331683, 344190, 339401, 317826, 298863, 300944, 289534, 269227, 259965, 286996, 309816, 298414, 301562, 299669, 292168, 309709, 325450, 320309, 308412, 304556, 305172, 304472, 321125, 315939, 311907, 321677, 323163, 315418, 316457, 306765, 277525, 277103, 277722, 292923, 303417, 327158, 326941, 310013, 310760, 326439]
12834C26439k298J1196j310J8894k1626J5968P506p593J6371j2455J7914K0380
12822C89386p903k3810P699K0057j4093j9612M12j4365j3578j1686J2432M5751
12810C70690J3850N377n946L364l953q88j291J7481M0889J4643l893j0062j72
12797D40089J0546K1726k5300k5144J8565J8830K2217J2314K9410K6787j6176
12786E33864N210l521k5784L4077L1486J1306j0868l0065m4081k6998Q641J1120
12774D94387J1847j4870J4720J5957J0750J0046J7668j3651k9924r3K0437L6403
12762E73677j1302k5885j016M1231K7824k912k428J4633K0437L6999J4544k0032
12750F65770j8717j4274r297J662Q338k2987L6188K8503q849R6J0494K3453j979
$$ y = [326439, 324141, 335337, 334027, 352921, 331295, 347263, 354769, 347176, 363547, 351092, 369006, 389386, 381483, 357673, 365372, 385429, 371336, 351724, 352136, 337771, 324193, 312507, 324939, 370690, 384540, 389917, 383971, 387335, 383382, 382494, 381203, 398684, 439573, 454216, 450323, 440261, 440089, 450635, 472361, 447061, 421917, 440482, 459312, 481529, 493843, 523253, 550040, 533864, 539074, 535553, 509769, 543846, 575332, 586638, 575770, 545705, 501624, 474626, 483267, 494387, 506234, 491364, 506084, 522041, 532791, 542837, 560505, 546854, 516930, 516837, 537274, 573677, 562375, 536490, 535474, 576705, 604529, 601617, 599189, 613822, 634259, 671258, 685802, 665770, 647053, 632779, 623482, 625144, 633482, 610495, 646683, 675186, 666337, 666433, 676927, 700380, 698401]
12737F98401k4306q215q88P751J2924P181j3167O719L2108q790Q64K7593L4508
12724G72683L3576K878m1189J938M340J7908K423J788j1027m128m995L0013p475
12711G98733j2937o265L0330J5962o893l1022r597o449N591J1541j3141n026J270
12698G72097K7669o173L349R243O490P723L742M381m902K725J3383O51r468k531
12684H28379K7560N539k6763K0163J1444L6328R544j347o455k8819J3508m646
12672H84435q005J958R374L0667K9024K2496K2822K3814R233M1201O4828O1216
12660A193063L8411K2368J143m1614p872M214K5768M328l6293j6634q94Q295r744
12647A184539p828q202j2443R506K9737L9521K0591K8394J4632J1897J3485P755
$$ y = [698401, 674095, 665880, 664992, 672743, 685667, 692848, 679681, 686400, 718508, 709718, 710582, 738175, 772683, 806259, 809137, 767948, 769886, 774226, 792134, 794557, 796345, 785318, 781190, 776195, 806208, 798733, 785796, 779531, 809861, 825823, 818930, 787908, 778311, 771862, 777453, 788994, 775853, 770827, 772097, 799766, 793593, 796942, 806185, 812675, 820398, 824140, 828521, 823619, 826344, 839727, 840378, 830910, 828379, 855939, 861478, 834715, 854878, 866322, 902650, 912194, 910847, 904392, 875573, 889081, 884435, 876430, 878388, 887762, 918429, 947453, 969949, 992771, 1016585, 1025818, 1067019, 1131847, 1193063, 1231474, 1253842, 1254985, 1213371, 1205499, 1209713, 1235481, 1239809, 1203516, 1186882, 1185988, 1194283, 1184539, 1176711, 1168509, 1156066, 1165572, 1195309, 1234830, 1255421, 1283815, 1298447, 1310344, 1323829, 1331584]
12635A331584L2908L4363n493M447m421K7929O7788N2846L3163M4489M3351N3085
12623A716039M7373K6159Q663P339N482K9853J3993J8947K6771L4049L1900L4456
12611B001024J5026J4022K3317L5482N5976N6780M1089N8720M5556L8257M1641
12600B426890P2055L5335J9705L6908K8341O0072O0862O5610R6518Q4166P8580
12589C065042R1110N3557O8988R4071Q2390R8076Q3817R0699J11571J16406J47112
12578D102839J61364J51556J69092J64553J67726K23535K52535K54840L15142
12569E963182L30898L57315L74040M21116M73323N46104N82691O11235O89826
12560A0349730P53176Q34247R72927J102880J231436J381335J526355J769114
$$ y = [1331584, 1364492, 1398855, 1393362, 1397809, 1393388, 1421317, 1489105, 1541951, 1575114, 1619603, 1662954, 1716039, 1763412, 1789571, 1798234, 1805573, 1811055, 1840908, 1854901, 1873848, 1900619, 1934668, 1966568, 2001024, 2016050, 2030072, 2053389, 2088871, 2144847, 2201627, 2242716, 2301436, 2346992, 2385249, 2426890, 2498945, 2534280, 2553985, 2590893, 2619234, 2679306, 2740168, 2805778, 2902296, 2986462, 3065042, 3156152, 3209709, 3278697, 3372768, 3455158, 3553234, 3637051, 3727750, 3839321, 3955727, 4102839, 4264203, 4415759, 4584851, 4749404, 4917130, 5140665, 5393200, 5648040, 5963182, 6294080, 6651395, 7025435, 7446551, 7919874, 8465978, 9048669, 9659904, 10349730, 11102906, 11937153, 12910080, 14012960, 15244396, 16625731, 18152086, 19921200]
12552A9921200J982310K185133K362708K617970K918840L258462L772826M458926
12544D3478375N357670O682942Q336032J0303151J2455483J4481224J5922704
12537A17017581J6293863J5318516J2855581Q917996L865928j631634o838850
12530A65798981j1142917j4141918j5691342j5939497j5107813j3531249j1564843
12523F8679402r480087p560302n930818m587756l535655k730761k051465j524000
12515C1278558j090093p30755l97238l9011L39953P52272J304398J955866K713149
12506C6087099L560134M658450O053636P867663J0106892J2427238J4023250J3616084
12498A08400446J0177930M119622k649747p946204j0675723j1053272r986549
$$ y = [19921200, 21903510, 24088643, 26451351, 29069321, 31988161, 35246623, 39019449, 43478375, 48836045, 55518987, 63855019, 74158170, 86613653, 101094877, 117017581, 133311444, 148629960, 161485541, 170403537, 174269465, 172637831, 165798981, 154656064, 140514146, 124822804, 108883307, 93775494, 80244245, 68679402, 59199315, 51639013, 45708195, 41120439, 37584784, 34854023, 32802558, 31278558, 30188465, 29457710, 29060472, 29021461, 29361414, 30113686, 31418084, 33373950, 36087099, 39647233, 44305683, 50359319, 58226982, 68333874, 80761112, 94784362, 108400446, 118578376, 122697998, 120048251, 112102047, 101426324, 90373052, 80386503]
12491H0386503q262751o448234m710649l106489j698389m22538P56446J810044
12483E8303943K775081L590854M249572M761641N181710N481543N724890N908124
12475I5977358O062586O042528N943964N560992M875174L963612K796156J366199
12467A32588569o2609j447297k781102l942450m831007n452766n808112n899741
12459A02363485n884223n738263n474645n193263m912830m551175m141687l613564
12451F2853835k926262k151450j207146k16125R15777K214706L668270N473537
12443F8625142P601411R770154J1423991J1596357R343070M351371k171563q228126
12435A12311807j2146994j3530316j3057064j1598999r855848q175288o730052
$$ y = [80386503, 72123752, 65675518, 60964869, 57858380, 56159991, 55737453, 56493899, 58303943, 61079024, 64669878, 68919450, 73681091, 78862801, 84344344, 90069234, 95977358, 102039944, 108082472, 114026436, 119587428, 124462602, 128426214, 131222370, 132588569, 132525960, 131078663, 128297561, 124355111, 119524104, 114071338, 108263226, 102363485, 96479262, 90740999, 85266354, 80073091, 75160261, 70609086, 66467399, 62853835, 59927573, 57776123, 56568977, 56352852, 57268629, 59483335, 63151605, 68625142, 76226553, 85996707, 97420698, 109017055, 118360125, 122711496, 120539933, 112311807, 100164813, 86634497, 73577433, 61978434, 52122586, 43947298, 37217246]
12428C7217246n471959m432252l570130k879296k348256j915882j595568j387739
12420A3616164j208857j009554q67949p90227o96563o14306n34929m42047l60188
12411G091544k66694j63201j25296q1694J26K854n2309j29009k52967l36191m20013
12400E267150m07147l67352l29543k93418k99204k43672j51663j52850j50778
12391B871523j27183r8572q5022o7574l8324m1194m1363o7735m3958l8247m7272
12380B175079m4956k9162m5685n9068m8951r2155q6992q1232q6942r5231r1944
12369A412761p0239l2463k5749j4501q966m8556k2086K753j4214l8443m1645j619
12357A097033o049k1142k5887k9051p738M242l761J9275J5201j8032l3126o422
$$ y = [37217246, 31745287, 27313035, 23742905, 20863609, 18515353, 16599471, 15003903, 13616164, 12407307, 11397753, 10529804, 9739577, 9043014, 8428708, 7893779, 7451732, 7091544, 6824850, 6661649, 6536353, 6454659, 6454785, 6457639, 6405330, 6276321, 6023354, 5687163, 5267150, 4860003, 4492651, 4163108, 3869690, 3570486, 3326814, 3175151, 3022301, 2871523, 2744340, 2645768, 2560746, 2493172, 2454848, 2413654, 2372291, 2304556, 2260598, 2222351, 2175079, 2130123, 2100961, 2055276, 1996208, 1947257, 1855102, 1768110, 1686878, 1599936, 1504705, 1412761, 1342522, 1310059, 1284310, 1269809, 1260843, 1212287, 1190201, 1192954, 1178740, 1140297, 1098652, 1097033, 1090984, 1069842, 1043955, 1014904, 1007166, 1011408, 1007647, 1026922, 1042123, 1024091, 990965, 984543]
12345I84543J1264K2544j2126J796j4151J6592J0506K2693J8468J8503P3596N9140
12333A213368L6797L0804P9150O6734Q2992J07550J00144J44595J94957K10371
12323B267462K54880K85835L44314L87197L79541L54931L07083K17588O8140m7223
12313D819748j87541k75823l76003m07340l84347l91145l46606k68962k36944
12304A945037k12906j38206q6836r5299q8155p5049p6247m7994p0777n4593k7818
12293I71157k7858k0014l1197l6041o5865j7336J3011k237p099l8669k9440p567
12281G00845Q485L7547K3862j6315j7669L330j6096L1935K8952K7647Kq637P721
12268H11609L1836K2028r561K572K6614Q338K044k6790j5387L848R608K532J7080
$$ y = [984543, 995807, 1018351, 1006225, 1008021, 993870, 1010462, 1020968, 1043661, 1062129, 1080632, 1154228, 1213368, 1250165, 1280969, 1360119, 1426853, 1509845, 1617395, 1717539, 1862134, 2057091, 2267462, 2522342, 2808177, 3152491, 3539688, 3919229, 4274160, 4581243, 4798831, 4866971, 4819748, 4632207, 4356384, 3980381, 3573041, 3188694, 2797549, 2450943, 2181981, 1945037, 1732131, 1593925, 1507089, 1411790, 1323635, 1248586, 1172339, 1124345, 1053568, 998975, 971157, 943299, 923285, 892088, 856047, 790182, 772846, 785857, 783620, 776521, 737852, 708412, 700845, 709330, 746877, 770739, 754424, 736755, 740085, 723989, 755924, 784876, 812523, 812525, 803888, 811609, 843445, 865473, 855912, 858484, 885098, 893436, 895480, 868690, 853303, 857151, 866759, 869291, 886371]
12255H86371M1675M1951J9291K9203J8619p258Q594J3167k2590l1741l1879k4478
12243I40925j0010O776k5185j2831j5244j9653J7528K4009r187j0619n572p217
12231H73720j3267M0625K2883o061l305P851J6591M2150J1888J5749K626J520
12219A012970M0249L2491L6771L8462M1311K3404R6436J39025J35057J40148J13533
12208A849857O8171j1165p9214r3141q2733n3700p6779n9426m461K2348k215J0690
12196A488232N856L5138L462j221P1986M0783J6614K6054L8529O2002O5351Q7416
12184A940202J25327R5430P8783N4816O6347P7847M2284M3449O5643M2691N4432
12173B687251N5428Q6026P3963Q2928J29333J50352J37991J51073J67447J83331
$$ y = [886371, 928046, 969997, 989288, 1018491, 1037110, 1029852, 1038446, 1051613, 1029023, 997282, 965403, 940925, 930915, 937691, 912506, 899675, 884431, 864778, 882306, 906315, 897128, 886509, 880937, 873720, 860453, 901078, 923961, 917900, 914595, 922446, 939037, 981187, 993075, 1008824, 1011450, 1012970, 1053219, 1085710, 1122481, 1160943, 1202254, 1225658, 1322094, 1461119, 1596176, 1736324, 1849857, 1918028, 1906863, 1827649, 1734508, 1651775, 1598075, 1521296, 1461870, 1457409, 1479757, 1477542, 1488232, 1494088, 1529226, 1532688, 1531467, 1603453, 1644236, 1660850, 1686904, 1725433, 1787435, 1852786, 1940202, 2065529, 2160959, 2239742, 2294558, 2360905, 2438752, 2481036, 2524485, 2590128, 2632819, 2687251, 2742679, 2828705, 2902668, 2985596, 3114929, 3265281, 3403272, 3554345, 3721792, 3905123]
12163C905123K17874K26250K63550L42986L46955L91395M38255M74627N50077
12154G157092O33589P36082Q33739R69739J201879J506043J771639K037028K263214
12145A9110044K425367K450814K410011K324907K183158K074947K119483K405957
12137C7504688K933576L868551N404542P612980J0799450J4815801J9072665K2548776
12129A24561029K4388164K4092930K1019526J4923622O529907k825240j1646852
12122B01043086j8477253k2403222k3633041k2910801k0776276j7582601j3891405
12115F1368487j0476716p710583n708782m391251l577402l124916k832264k614782
12107B0931791k414609k243134k066966j817631j585512j392021j159049r10831
$$ y = [3905123, 4122997, 4349247, 4612797, 4955783, 5302738, 5694133, 6132388, 6607015, 7157092, 7790681, 8526763, 9360502, 10330241, 11532120, 13038163, 14809802, 16846830, 19110044, 21535411, 23986225, 26396236, 28721143, 30904301, 32979248, 35098731, 37504688, 40438264, 44306815, 49711357, 57324337, 68123787, 82939588, 102012253, 124561029, 148949193, 173042123, 194061649, 208985271, 215515178, 212689938, 201043086, 182565833, 160162611, 136529570, 113618769, 92842493, 75259892, 61368487, 50891771, 43181188, 37472406, 33081155, 29503753, 26378837, 23546573, 20931791, 18517182, 16274048, 14207082, 12389451, 10803939, 9411918, 8252869, 7342038]
12099G342038p58776o06587n40583m56857l84026l17951k95644k82724k61645
12090C437245k24065j80160j76385j91450j46052j10085j12176j31233r0341p5726
12080A999572p1375r1778m7804n7667m5878n6158m9083J6728J8530j4515m1121
12069A559451o6979o8027l7370l6161j3101J2722O307L8398M0641K3285L0654
12058A489820K015m8184j12262j08056o7745q8620p7561m3983l0636J1678J9412
12047I45878J6578J7732K2745M4363M2203K5920K9771p305m7522n6147k1020j5792
12035I97404j4804k6390o80j7088M352K7778K6316K4462J3253K9448M1394M3831
12023A149276L3240K5197O9077L5436J5987M2815O5817Q2528Q7011J25484J78931
$$ y = [7342038, 6583262, 5976675, 5436092, 4979235, 4595209, 4277258, 3981614, 3698890, 3437245, 3213180, 3033020, 2856635, 2665185, 2519133, 2409048, 2296872, 2165639, 2075298, 1999572, 1928197, 1836419, 1788615, 1730948, 1685070, 1628912, 1579829, 1596557, 1615087, 1600572, 1559451, 1492472, 1424445, 1387075, 1350914, 1337813, 1350535, 1356842, 1395240, 1435881, 1459166, 1489820, 1491835, 1443651, 1331389, 1223333, 1155588, 1066968, 989407, 945424, 914788, 926466, 945878, 962456, 980188, 1002933, 1047296, 1089499, 1115419, 1145190, 1137885, 1090363, 1034216, 1013196, 997404, 982600, 956210, 955530, 938442, 942794, 970572, 996888, 1021350, 1034603, 1064051, 1105445, 1149276, 1182516, 1207713, 1276790, 1312226, 1328213, 1371028, 1436845, 1519373, 1606384, 1731868, 1910799]
12012A910799J89688K05479K94496L34220L13137K76511K35256J47459J5294j06822
12002C815517k09939k99189l28098l59040l18068k68319k37478k02883j20389
11993A472114r2800o0233q5969q8951l7601k0486J1558KL453l890K2280L0996
11981A150473k9731n4981o0159o5417o6081p8474r6849q1776o4260m4064o062
11970E02619o752j7571p384j0268N479N596j9767p586n130p857j1778P094m2137
11957C84558k1853l777p954J526K2619K7543K4655k2519r936j9197l1448m2016
11945C02201k5954m127J031k6402j8002l1497k3574n528J0833j792R732l0826
11933A56095k7485J2577J8330N1918j1760p556J9450K644j8374l588o013l8051
$$ y = [1910799, 2100487, 2305966, 2600462, 2934682, 3247819, 3524330, 3759586, 3907045, 3922339, 3815517, 3605578, 3306389, 2978291, 2619251, 2301183, 2032864, 1795386, 1592503, 1472114, 1379314, 1319081, 1233112, 1144161, 1106560, 1086074, 1097632, 1097634, 1101087, 1097197, 1119477, 1150473, 1120742, 1065761, 1005602, 940185, 874104, 795630, 698781, 617005, 552745, 508681, 502619, 495867, 478296, 470912, 460644, 466123, 471719, 451952, 444366, 439236, 431379, 419601, 426695, 384558, 362705, 358928, 350974, 352500, 375119, 402662, 427317, 404798, 394862, 375665, 344217, 302201, 276247, 272120, 273151, 246749, 228747, 197250, 173676, 168148, 178981, 177189, 186921, 156095, 128610, 141187, 159517, 211435, 199675, 192119, 211569, 214213, 195839, 192251, 186238, 148187]
11921A48187k1519k6658j476L9018J6229m917m059j719j0988P551l275n860K5171
11908A55685K758j8204j0026j6773k7429J0166J4424J4440M308j5706J2039J9711
11896A45393o985n164k0931k0241K513R297O70r881j4975K166R072k1288r470
11883F0176L5390j627j5186j2240K0816J2378q346K1167O754J0489j7782j7158
11871I4831J4022P062j3709N278j0853j5790l96Q00M994L1020k579j4478j1877
11858H8325N739K4759L1222K0799O747k3434r07j8399j9603K4907K5835J6818
11846A82808K6767r582k8003j1597J192J4578J2703n479k0903Q590M1990J4720
11834B27784J425k2503j2502P872k2649n415J7792k2582J2648m207k0843J0391
$$ y = [148187, 126668, 100010, 98534, 137552, 153781, 148864, 144805, 143086, 132098, 139649, 136374, 130514, 155685, 158443, 140239, 130213, 113440, 86011, 96177, 110601, 125041, 129349, 113643, 125682, 145393, 138408, 133244, 112313, 92072, 94585, 103882, 104552, 94671, 79696, 81862, 90934, 69646, 60176, 95566, 93939, 78753, 66513, 87329, 99707, 91361, 112528, 119282, 129771, 111989, 94831, 108853, 115915, 102206, 107484, 96631, 80841, 80445, 81245, 86239, 117259, 114680, 100202, 88325, 94064, 118823, 150045, 170844, 177591, 154157, 153250, 134851, 115248, 140155, 165990, 182808, 209575, 199993, 171990, 160393, 161585, 176163, 188866, 183387, 162484, 171074, 213064, 227784, 229209, 206706, 194204, 202076, 179427, 174012, 191804, 169222, 181870, 177663, 156820, 167211]
11822A67211L4826J2972J8280l186k279M253J9501R816K7117J6626N061p233j8087
11809B84878j0797r410l2623j1281R746M044J4979J2485k6315k1785k4873J595
11797A90643k4972l2339n590k220K6712N277J9816K0372q807n1641k7419N759
11785A15591K8956m799K0496K2416j3445o432J0630P223k7014r122M45j8894o568
11772A19483r582p593j9577j3669N949O379k1374K0754J469k2813J352j8997l094
11759C8687m775K3066K8915l43k2025j9210J886J8712Q403K434j3327k1056J6221
11746E7588Q702j89q229k0776O152K3904J8065K9071p319r303J3525N28j3858
11733I7861O220L5262K584k4012K419L2838M84j9609l079r247N521K4364L4957
$$ y = [167211, 202037, 215009, 233289, 230103, 227824, 232077, 251578, 261394, 288511, 305137, 310198, 302965, 284878, 274081, 264671, 232048, 220767, 230513, 234557, 249536, 262021, 235706, 213921, 189048, 190643, 165671, 133332, 127742, 125522, 152234, 157511, 177327, 197699, 188892, 137251, 109832, 115591, 144547, 139748, 160244, 182660, 169215, 162783, 173413, 180636, 153622, 144500, 144945, 126051, 119483, 109901, 102308, 82731, 69062, 75011, 81390, 60016, 80770, 82239, 59426, 60778, 41781, 38687, 33912, 56978, 85893, 85550, 63525, 44315, 46201, 64913, 73316, 75750, 62423, 41367, 57588, 66290, 66101, 57872, 37096, 43248, 67152, 85217, 114288, 106969, 97666, 111191, 111719, 97861, 104081, 139343, 141927, 117915, 120334, 153172, 153656, 134047, 130968, 121721, 127242, 151606, 186563]
11720A86563l217L932J9346K0453K7114J2020J6143K3931L4911O9572P3422M9944
11708E34134R0169J06454J22461J09321N8011L4938K4868l0539r9891q7334r1441
11697G71151j29111j15322r5691m9293n8492m8373j5468n4090l8965j0210m034
11686A52102j4170k3034k5919J2171M2389j3950k3550J707j9130j0872O750j7256
11674F7238k6168j420J4643P638m437k782k0578k2070R383J2086L972K561j1787
11661B8279o465p046p518j6165k3992O983K1899K8789K1492J0823O765k4700k4035
11648A5109j5124K1182K0788j3684k1747j2460j0466J4616J3879K617k2600J1373
11636C483P165J2523N416J7729M847j1517p14k3695m811K9042K1743L611k0875
$$ y = [186563, 183346, 187278, 206624, 227077, 254191, 266211, 282354, 306285, 341196, 410768, 484190, 534134, 624303, 730757, 853218, 962539, 1020550, 1055488, 1080356, 1049817, 949926, 862592, 771151, 642040, 526718, 431027, 381734, 323242, 274869, 259401, 205311, 166346, 156136, 152102, 137932, 114898, 88979, 101150, 143539, 129589, 106039, 107746, 88616, 77744, 84494, 67238, 41070, 39650, 54293, 61931, 57494, 54712, 34134, 12064, 21447, 33533, 37505, 40066, 28279, 21814, 14768, 7250, -8915, -32907, -25924, -4025, 24764, 46256, 57079, 63844, 39144, 15109, -15, 21167, 41955, 28271, 6524, -5936, -16402, -1786, 12093, 14710, -7890, 3483, 10648, 23171, 28587, 46316, 51163, 39646, 38932, 15237, 10426, 39468, 61211, 64822, 43947]
11623D3947n779M204j663Q958j8596r071o359j4294j137K1646J2274J0953J0681
11610E5764l1791j1550J8004O741K271J5944J1546q348j0353l468L11j1023k2161
11597A1887r631k474O944l250K8192J1762K697k080k21j923J9812q139k775K4682
11583G5483N149J1940q847j7283j6272k0350R433j298n852P71n614J3215K3992
11570F4467j8509p923j1328R866K1467Q594k7801l8338Q040j8079K6618K4850
11558D1924L7604k288r666r071l0642k1360M7982K4704k7251k7680J5105p770
11546C1591J1501Q483J4183m420l1877L906N525L57k3440j2519K8222L6198j5420
11533E2290O626j1015k5444J7900Q544j0518l296J5896P303l6364j8206K907L3617
$$ y = [43947, 38168, 42372, 40709, 49667, 31071, 22000, 15641, 1347, 210, 21856, 34130, 45083, 55764, 23973, 12423, 30427, 37168, 39439, 55383, 66929, 58581, 48228, 44760, 45071, 34048, 11887, 2256, -218, 6726, 3476, 31668, 43430, 46127, 44047, 43826, 41903, 61715, 53576, 50801, 75483, 80632, 92572, 83725, 66442, 50170, 29820, 39253, 37955, 32103, 32874, 27260, 40475, 64467, 45958, 38035, 26707, 36573, 58040, 66634, 38833, 495, 8535, -9544, 17074, 41924, 79528, 77240, 67574, 58503, 27861, 6501, 54483, 79187, 51936, 24256, 39361, 31591, 43092, 51575, 65758, 61338, 29461, 33367, 38892, 39249, 15809, 3290, 31512, 67710, 52290, 58916, 47901, 22457, 40357, 48901, 38383, 35087, 50983, 58286, 21922, 3716, 6623, 40240]
11520D0240j5548k3396J1097L8042J2950j7766j9307j4268Q400j4760O510K4754
11508C6948J7762P102M979j6605r429j3508k6666P315K7540R925N465O610j0139
11495D7299J58n845M011K0787N658j5817M855j2480J479M757J1701m0711j8229
11482G623p687J4753q315o870m165K4657L5860J5859R011L0848n664j9313k1183
11469F5414j1274j9654k8805o374k290l716K2346J4382j0926J991J2316J0859
11457D4269L241J8308J7621K730j5366n983j1305j8869l6130P088k972L9381M796
11444D6809n167j654j3780J6617K4153j135m660J07K1107j6035j1786K3092M389
11431H2057J0938l4760k8784K4116K1432J4167k090j8022j0907J1062J6992K3940
$$ y = [40240, 24692, 1296, 12393, 50435, 63385, 45619, 26312, 12044, 20444, 5684, 12194, 36948, 54710, 61812, 66791, 50186, 40757, 27249, 583, 7898, 35438, 45363, 50828, 57438, 47299, 47457, 41612, 45623, 66410, 72068, 56251, 61106, 48626, 50105, 54862, 66563, 25852, 7623, -64, 14689, 6374, -496, -4661, 19996, 55856, 71715, 80726, 111574, 105910, 86597, 65414, 54140, 34486, 5681, -693, -2983, -6699, 15647, 30029, 19103, 21094, 33410, 44269, 47510, 65818, 83439, 86169, 70803, 64820, 53515, 34646, -1484, 5604, 2632, 42013, 46809, 41642, 39988, 26208, 42825, 66978, 65843, 61183, 61290, 82397, 66362, 54576, 77668, 82057, 92995, 58235, 29451, 53567, 74999, 89166, 87076, 69054, 58147, 69209, 86201, 110141]
11419A10141r359R126K6467l0890k5151o409J6741J980j5086k1269k3541J0335
11407D3085J4254K8821L2572P83l474J3255Q325o684k755j8402P929L1546K9699
11394A78954J8712j7943J4446K180Q629M495K9586M5278K2162K9232M1948K4690
11382D02369O2530O7360M2989M2281M3572N8264Q0088J22695J48261K21101K86729
11371A578239L31667L20266K60094J65271k7784k08163k86109l12958k90523k55912
11361A274088k29139j97394j44466j10377o8180p5935l0616j7268l2268l1886
11351C36559k5857k3547l7524k9623k8021j4492j3394k4920K585N635N884O948
11339A60233k5006j1339Q979j8324J1102N498L64j2454N656j9713j3999K3642
$$ y = [110141, 100782, 109908, 136375, 105485, 80334, 73925, 90666, 92646, 77560, 56291, 32750, 43085, 57339, 86160, 118732, 119515, 116041, 129296, 137621, 130937, 128182, 109780, 117709, 149255, 178954, 197666, 179723, 194169, 196349, 204978, 209473, 239059, 284337, 306499, 335731, 377679, 402369, 464899, 532259, 575248, 617529, 661101, 719365, 799453, 922148, 1070409, 1291510, 1578239, 1909906, 2230172, 2490266, 2655537, 2627753, 2419590, 2133481, 1820523, 1530000, 1274088, 1044949, 847555, 703089, 592712, 524532, 448597, 417981, 400713, 368445, 336559, 310702, 287155, 249631, 220008, 191987, 177495, 164101, 139181, 141766, 147401, 153285, 160233, 135227, 123888, 132867, 114543, 125645, 131143, 131507, 119053, 124709, 104996, 90997, 114639]
11327A14639N083J435k3863j7182P195J865n817K225K2351k950j5523k9886j9627
11314C9945K1767L4234M2800L227r818l9454j3103J8045J5618L0946j9546m6242
11302G8419m4210k4441K1410M5109N996p430K8972L6183j1052r810k283m763j9466
11289I2634j1719K26P800K2043p496j9452k902K250M455L2063Q57K0441K5678
11276A66878O28q458j871L337j5009l2554L040R199p219j7195M291J3293j7355
11263A01005K0284k2885m3077M922K1934j139j1844J0385K3922k2757k768J0364
11251H8346k0429k12j6095K993J0028L9707J629k6554L0586P967j6045k2519L641
11238H3043J2569K4639J5739o769q184n160J2789q774k9025L603j2643j4385J3638
$$ y = [114639, 119722, 121157, 97294, 80112, 87307, 89172, 83355, 85580, 107931, 104981, 89458, 59572, 39945, 61712, 95946, 138746, 141973, 132155, 92701, 79598, 97643, 113261, 144207, 124661, 78419, 34209, 9768, 31178, 76287, 82283, 74853, 103825, 140008, 128956, 119146, 116863, 112100, 92634, 80915, 81141, 88941, 110984, 103488, 84036, 81134, 83384, 87839, 119902, 120759, 141200, 166878, 167506, 159048, 157177, 160514, 145505, 112951, 115991, 125190, 117971, 100776, 105067, 118360, 101005, 121289, 98404, 55327, 60249, 82183, 81044, 69200, 79585, 103507, 80750, 77982, 88346, 67917, 67705, 51610, 54603, 64631, 104338, 105967, 79413, 109999, 117966, 101921, 79402, 83043, 95612, 120251, 135990, 129221, 121037, 115877, 128666, 119892, 90867, 94470, 81827, 67442, 81080]
11225H1080k039K476n391J1748J7272J2499j511O709M0256K819j0426L153p816
11212A50829r541l2626j406L0583l489o69J1455n62Q037P31j410O708j2950k929
11198A42761p933L196K6774R187L3183J7540k076K745L2835K5732L783K8191L8368
11185C54286P373k4085j4154Q004O176j2121k8665l0023k8632r627o821m310j2082
11172B05319J9062n502j4025k5471J5829K1482K1661J3518l828J5044P873R314
11160B80276J3047Q522K349K2355L0574K1733j3515K6779j2210k3372P560k0864
11148C43234l3784l0476J854J1155Q516K390O394j1809k8500o343l397m0088j0680
11135B08466L4537J0371q28j5615j7820K7197K9675M4758O7376M7527k109m115
$$ y = [81080, 79041, 81517, 76126, 87874, 105146, 117645, 116134, 122843, 163099, 165918, 155492, 158645, 150829, 141288, 108662, 107256, 137839, 134350, 133681, 145136, 144574, 152611, 153342, 151932, 158640, 145690, 142761, 134828, 138024, 164798, 173985, 207168, 224708, 222632, 225377, 258212, 283944, 287727, 315918, 354286, 361659, 337574, 323420, 331424, 337600, 325479, 296814, 266791, 238159, 228532, 221711, 217401, 205319, 224381, 218879, 204854, 179383, 195212, 216694, 238355, 251873, 248045, 263089, 270962, 280276, 293323, 301845, 304194, 326549, 357123, 378856, 365341, 392120, 379910, 356538, 364098, 343234, 309450, 278974, 280828, 291983, 300499, 302889, 309283, 297474, 268974, 262631, 259234, 219146, 208466, 243003, 253374, 252546, 236931, 219111, 246308, 275983, 320741, 388117, 435644, 433535, 429420]
11123D29420R938m2882m0857m2717l0786m193j5075o330l550J5726j5491j5435
11111B37768j5241P681m136J4629K06j0770j8816O145j7560K546J2564N733l8033
11098A82716k3932K0419L0803n085j7792L6446L3113j6088N7L504j0811p952m937
11085B20461J4840Q523j3457l3376M976J8895M599k4031M88j3369K4507L664l3109
11072A83611p465j1878k045J0818j4754j6630K4506K3010J0232K426L2510j0753
11060B23588k0226K4628j4178k4262J964p842K1231j8251k1442n127J4899L2927
11048B07909J0274k8018J4235J1838m0431j5901o946Q766J6601k402J767K677
11036A80369m2121n790j2090m628k5795K4176J8900j2762L0429J2170J7566K2771
$$ y = [429420, 439358, 396476, 355619, 312902, 282116, 277923, 262848, 256518, 252968, 268694, 253203, 237768, 222527, 230208, 226072, 240701, 240907, 230137, 211321, 217466, 199906, 202452, 215016, 220749, 182716, 158784, 179203, 210006, 204921, 187129, 223575, 256688, 240600, 240657, 244161, 233350, 225398, 220461, 235301, 243824, 230367, 196991, 201967, 220862, 225461, 201430, 201918, 188549, 213056, 216720, 183611, 176146, 164268, 162223, 173041, 158287, 141657, 166163, 189173, 199405, 201831, 234341, 223588, 203362, 227990, 213812, 189550, 191514, 183672, 204903, 186652, 165210, 160083, 174982, 207909, 218183, 190165, 204400, 216238, 175807, 159906, 152960, 161726, 178327, 175925, 177692, 180369, 138248, 132458, 120368, 115740, 89945, 114121, 133021, 120259, 150688, 162858, 180424, 203195]
11024B03195Q388J953K180M519k8528k5406K072p41n649J7941K1338J7578J6241
11011B35081K8332J4940k181O310rP481l633j7799J0236O0J5155j4940q383j2404
10997B58246j7576q203m987P748l057M702o277j1117p291L219P0532Q449l8560
10984B55828k4226O481J4558J405l008K535J7390K572k3787j7550k7391j7051
10972A87756J5412K5706n357l598J2486M284r419n358R143J4993R189j1214O226
10959B50249r410Q008J2045j0211J4748L757j8262J1213K201O750J1959L6046
10947C19093O389R641k3576m985k607L3371L4401J7107m935K7311L865K5932J1645
10934D52652J6404J8792K3587L0251N4202L5945J5506M4407R1762J15585J59035
$$ y = [203195, 211583, 213536, 215716, 220235, 191707, 166301, 168373, 167632, 161983, 179924, 201262, 218840, 235081, 263413, 278353, 276172, 282482, 282473, 289954, 286321, 268522, 278758, 278818, 293973, 279033, 270650, 258246, 240670, 232467, 227480, 235228, 232171, 236873, 230596, 219479, 212188, 215407, 285939, 294388, 255828, 231602, 238083, 252641, 254046, 251038, 253573, 270963, 273535, 249748, 232198, 204807, 187756, 203168, 228874, 223517, 219919, 232405, 236689, 227270, 221912, 231055, 246048, 255237, 244023, 250249, 240839, 248847, 260892, 250681, 265429, 269186, 250924, 262137, 264338, 271088, 283047, 319093, 325482, 335123, 311547, 306562, 303955, 337326, 371727, 388834, 383899, 411210, 415075, 441007, 452652, 469056, 487848, 511435, 541686, 595888, 631833, 647339, 691746, 783508, 899093, 1058128]
10923A058128J57790K22172K54823K14140J48695N8781o0469j36368j67236j82203
10913A568253j54278q7515q585o5578j06903p5786n3500k7016m0509o2004m3533
10902H43046m5129l9491l9720l9792l9222O048K7013K3647P173m784m795n512
10890F88482J7931L1932J9148J4047L0625O722r276j6930K7837K5595K6454l645
10878H58922r782k955n236Q680K0536m530l4387l6672J3449K0376j6095l0195
10866G82111k4423l6689l2448j386q487j8692K6541r607l2283k5382J2217K0610
10854F52082J0958J5304O8K8605L6624J6485O229m3905q8j7637l8553m4870l7724
10841E83578k3605k0366l185j6863k5421l3806k5426j879n279l7482k6548k7177
$$ y = [1058128, 1215918, 1438090, 1692913, 1907053, 2055748, 2114529, 2054060, 1917692, 1750456, 1568253, 1413975, 1326460, 1317875, 1252297, 1145394, 1069608, 1016108, 989092, 948583, 886579, 843046, 797917, 758426, 718706, 678914, 639692, 645740, 672753, 696400, 703573, 698789, 693994, 688482, 706413, 738345, 757493, 771540, 802165, 808887, 799611, 782681, 810518, 836113, 862567, 858922, 849140, 846185, 840949, 849629, 870165, 865635, 831248, 794576, 808025, 828401, 812306, 782111, 757688, 720999, 688551, 687165, 678678, 659986, 686527, 676920, 644637, 619255, 631472, 652082, 663040, 678344, 678412, 707017, 743641, 760126, 766355, 722450, 722362, 704725, 666172, 621302, 583578, 559973, 539607, 536422, 519559, 494138, 460332, 434906, 433027, 427748, 390266, 363718, 336541]
10829C36541M196M2205P67j6996O36n226k2425N382K0340P984l77j4533M662J3183
10815C76339K5115o235m2033J1209Q862n195j4759Q34J709m671o22l07J8349l323
10801C65272m536j3884j5865K1375J9398j791q417J6258J6174l865j3846r093
10789C67180Q926J290J0715M791l614k2747l137J9821j1713j6811l7237j3013
10777C04451j312K7662J7839J6025J4467m266O844J7614K8079J4113J0596j6342
10765D35770M193j8618K431J8597L139L4320L9690K1425J6128L8292K1648P795
10753F24810L1589L5062j4288j7997l890M73q651k956j1863n401l1192n280K2945
10740F13361J8581O315p386l4365N175J6191l020j1581k5279P308k077q894r489
$$ y = [336541, 340737, 382942, 383709, 366713, 367349, 362123, 339698, 345080, 365420, 373404, 373027, 358494, 363156, 376339, 401454, 395219, 353186, 364395, 373257, 368062, 353303, 354137, 355846, 351175, 350553, 350246, 368595, 365272, 360736, 346852, 330987, 352362, 371760, 369969, 361552, 377810, 393984, 390119, 376273, 367180, 376106, 377396, 388111, 392902, 389288, 366541, 363404, 383225, 371512, 354701, 317464, 304451, 303139, 330801, 348640, 364665, 379132, 374866, 381710, 399324, 427403, 441516, 452112, 435770, 439963, 421345, 423776, 442373, 445512, 479832, 519522, 540947, 557075, 595367, 617015, 624810, 656399, 691461, 677173, 659176, 655286, 655759, 647108, 644152, 632289, 626888, 595696, 590416, 613361, 631942, 638257, 630871, 596506, 601681, 617872, 614852, 603271, 577992, 585300, 583223, 574329, 564840]
10727E64840K228Q8r372J3365L0266Q096l074P54K044O587J4410j6235J1070J9522
10713F44589j430q599j725q093L294K1783K9479O16k6275n30Q735l593l2024J337
10699F27564J0177K2139L650R12j3253j1286J8713L5428N06K6703j1721q182O020
10686G07370l457l7915J0951K9933L6349J0226K3796K3308P566Q561J540J257
10674H19485j0331o029n88K847j2043q264M9146J2043q585q1L668L2191L6677
10661I10136r83J557L4051L779K480L1304K3063J8192K7708M9978J5354j1810
10649A104809J1974M9631M810j3570Q062K9284J8887J6003L3676K7553J7777K5592
10637A334488j9505j5557K1334P5573K7201M4243M0555P8848J36890J48866J09238
$$ y = [564840, 567068, 567156, 557784, 571149, 601415, 609511, 606437, 607191, 609235, 615822, 630232, 613997, 625067, 644589, 643159, 634560, 632835, 624742, 628036, 649819, 679298, 679914, 653639, 653109, 661844, 658251, 626227, 627564, 637741, 659880, 663530, 664442, 651189, 639903, 658616, 694044, 694550, 721253, 709532, 701350, 707370, 703913, 665998, 676949, 706882, 743231, 753457, 777253, 800561, 808127, 816688, 818228, 819485, 809154, 803125, 802537, 805384, 793341, 785077, 834223, 846266, 837681, 837600, 841268, 873459, 910136, 909153, 910710, 944761, 948540, 951020, 982324, 1005387, 1023579, 1051287, 1101265, 1116619, 1104809, 1116783, 1166414, 1171224, 1157654, 1165716, 1195000, 1213887, 1229890, 1263566, 1291119, 1308896, 1334488, 1314983, 1299426, 1320760, 1396333, 1423534, 1467777, 1508332, 1587180, 1724070, 1872936, 1982174]
10626A982174Q2406O3263K734k5962O455J0542k9271j0048L7840L5993K5179M7304
10614B228609j366P828N1326J3493P075L1817K1090L6081J9778J9666P716n005
10602B438108r554J5960J7849J8414R393L4348R897K1076M0640K611M1067L1076
10590B670885K3358O5365M2982M2681M6842K5221N5905O5034N1179L3574L6384
10579C159410N9154P7237N9468N3724O6046M7785J10200J04027N6325M2862P1819
10568C908057O9385P1541P2902Q3307R2478J03193J14670J09286J32483J23760
10558D881062J09963J10413J45656J69920J41262J49590J65728J55967J71222
10549F200783J91419J95408K15985K52602K28163K65441L16879L08726L03405
$$ y = [1982174, 2064580, 2127843, 2130577, 2104615, 2111070, 2121612, 2092341, 2082293, 2120133, 2156126, 2181305, 2228609, 2227243, 2235071, 2286397, 2299890, 2306965, 2338782, 2359872, 2395953, 2415731, 2435397, 2443113, 2438108, 2428554, 2444514, 2462363, 2480777, 2490170, 2524518, 2534415, 2555491, 2596131, 2598742, 2639809, 2670885, 2694243, 2759608, 2802590, 2845271, 2892113, 2917334, 2973239, 3038273, 3089452, 3123026, 3159410, 3218564, 3295801, 3355269, 3408993, 3475039, 3522824, 3633024, 3737051, 3793376, 3836238, 3908057, 3977442, 4048983, 4121885, 4205192, 4297670, 4400863, 4515533, 4624819, 4757302, 4881062, 4991025, 5101438, 5247094, 5417014, 5558276, 5707866, 5873594, 6029561, 6200783, 6392202, 6587610, 6803595, 7056197, 7284360, 7549801, 7866680, 8175406, 8478811]
10540H478811L60812M01568M22816M45608M82034N52330N47586O06113O66609
10531A2964287P84332Q66500R44657J057664J181923J308498J449453J627668
10523B2184982J843143K029250K253390K533688K834036L100933L301733L494690
10515D3575845L722294M068478M658164N434832O490111P956498R817492J2308672
10507I8032386J5687136K0208419K6194755L3618542M1474363M7068333M5617477
10500C27901411L3301828J1405138j2042364k8492190l4783848l3169639k7770494
10493B36349842k1995102j7601919j4921216j3638538j3026429j2511077j1802054
10486A30853507j0759172r432463q004323o482187n011772l639366k300858j000829
$$ y = [8478811, 8839623, 9241191, 9664007, 10109615, 10591649, 11143979, 11691565, 12297678, 12964287, 13748619, 14615119, 15559776, 16617440, 17799363, 19107861, 20557314, 22184982, 24028125, 26057375, 28310765, 30844453, 33678489, 36779422, 40081155, 43575845, 47298139, 51366617, 56024781, 61459613, 67949724, 75906222, 85723714, 98032386, 113719522, 133927941, 160122696, 193741238, 235215601, 282283934, 327901411, 361203239, 372608377, 360566013, 332073823, 297289975, 264120336, 236349842, 214354740, 196752821, 181831605, 168193067, 155166638, 142655561, 130853507, 120094335, 110661872, 102657549, 96175362, 91163590, 87524224, 85223366, 84222537]
10478H4222537J38483J120260J832129K204453K178963J811552J316208R16049
10470I5740634P59902R95682J561727K375224L204850L787884L934053L478714
10462A15838670K453047R07445q34376k476579l667890m265791m213244l785985
10454I9955297l092511k310510j684444j458392j597250j995965k553665l066762
10446H2195798l349839l392466l087873k537959j798594r01302O9303J012336
10438F8209404J958392K789431L461771L747417L523167K706650J310935n43407
10430H7163760k505783m286808n594090o294927o520806o321366n879354n303832
10422D4456794m716996m104408l496443k918837k455824k020873j647483j302247
$$ y = [84222537, 84361020, 85481280, 87313409, 89517862, 91696825, 93508377, 94824585, 95740634, 96500536, 97496218, 99057945, 101433169, 104638019, 108425903, 112359956, 115838670, 118291717, 119199162, 118364786, 115888207, 112220317, 107954526, 103741282, 99955297, 96862786, 94552276, 92867832, 91409440, 89812190, 87816225, 85262560, 82195798, 78845959, 75453493, 72365620, 69827661, 68029067, 67127765, 67197068, 68209404, 70167796, 72957227, 76418998, 80166415, 83689582, 86396232, 87707167, 87163760, 84657977, 80371169, 74777079, 68482152, 61961346, 55639980, 49760626, 44456794, 39739798, 35635390, 32138947, 29220110, 26764286, 24743413, 23095930, 21793683]
10414B1793683j032215q63411p92850q65728r59557j068023j144727j166363j146912
10405A2753897j081296r57525q25640p33009o56004n39428m86102m25574l79164
10396F670155l59326l49853k98633k48563k78241k58164j92718k07708k04663
10387D272286k01054j80518j45282j49322j58034j50465j14132r5812j15345p0762
10377B891560j04848j78611j54875j42908o9744o1534k1766l6863j8841j9884
10367B081686m1548l6341l5530m9982m2248k1314k5488m2559m8257l5016m9099
10356A654304n2576k7260j3652m4271m5486m9569j2277n3356n8994m4087k3683
10345A229093Q30k0389l4348j9705j6963n3785n982P768l8753j2534j8097r734
$$ y = [21793683, 20761468, 19898057, 19105207, 18239479, 17279922, 16211899, 15067172, 13900809, 12753897, 11672601, 10715076, 9889436, 9156427, 8500423, 7960995, 7474893, 7049319, 6670155, 6310829, 5960976, 5662343, 5413780, 5135539, 4877375, 4684657, 4476949, 4272286, 4071232, 3890714, 3745432, 3596110, 3438076, 3287611, 3173479, 3077667, 2962322, 2891560, 2786712, 2608101, 2453226, 2310318, 2240574, 2179040, 2157274, 2120411, 2101570, 2081686, 2040138, 2003797, 1968267, 1918285, 1876037, 1854723, 1829235, 1786676, 1738419, 1703403, 1654304, 1601728, 1574468, 1560816, 1516545, 1471059, 1421490, 1409213, 1355857, 1296863, 1252776, 1229093, 1229923, 1209534, 1175186, 1155481, 1138518, 1084733, 1078751, 1086519, 1047766, 1035232, 1017135, 1007401]
10333A007401j9097j425l088j5603j1625K7705o341l308k487j2663M005l1k0599
10320I42844R626K7364K4822K1766J0118k709j5116l6920m6423l1860l9345m5448
10308H18719n7122j0747l758l158J2585j7542m4267K142m614l364R358j6052n3927
10295F28253k4443Q13J6334J6752r20j1798j2826j1373o249k8598k6842k6717
10283E12386m420J2480j4499j2053l664J0489l6015P3P287j7946M152J0085K5595
10270D93950M7864J6060L836j2789l713j3012j9471O876k0925j7000o173k201
10258D73302j7838j8746j8067m549Q37m427j717j8176j0327J2465K6510K4916
10246D44183k3569K436K1122J0390J745j1404K811j6386k5907J255O58L383o390
$$ y = [1007401, 988304, 986879, 983791, 968188, 956563, 984268, 977927, 974619, 972132, 959469, 963474, 963443, 942844, 952470, 979834, 1004656, 1026422, 1036540, 1033831, 1018715, 981795, 935372, 903512, 864167, 818719, 761597, 750850, 747092, 743934, 756519, 738977, 694710, 696852, 692238, 688874, 698232, 682180, 628253, 603810, 604623, 620957, 637709, 636789, 624991, 612165, 600792, 594543, 565945, 539103, 512386, 507966, 520446, 505947, 493894, 490230, 500719, 464704, 464777, 472064, 454118, 458270, 468355, 493950, 541814, 557874, 561710, 548921, 545208, 532196, 512725, 519601, 498676, 481676, 475503, 473302, 455464, 436718, 418651, 414102, 414939, 410512, 408795, 390619, 380292, 392757, 419267, 444183, 420614, 423050, 444172, 454562, 456307, 444903, 447714, 431328, 405421, 406676, 407334, 410717, 404327]
10233D04327l7617r511K0690K815k3691j4833J5461K926P703K6158J1698j8032
10221C88094o749l0418k7023n133j2288k017l257J2141m696j0438l580q913L682
10208B89405M791R795K1050L394j1205k4118k8639J5330p407p992j0450j6741
10196B37213Q897L2981J9358k5572J2247L3168L0420M911o803K1931K2565k031
10184C89285P146K0818N517m0505j4000M0513J0765k0860j6173Q773M0811N3447
10172D85537J0897M277J0051J8501L7903M4170N1268N5379N1433M8710O2786N2367
10160I33279J09033J00678P7669O5419R6814J07599O5298J30075J82070K39388
10150B107322L30683M65899O85016J035311J475785K013942K362641K098312R68973
$$ y = [404327, 366710, 357199, 377889, 380704, 357013, 342180, 357641, 360567, 368270, 394428, 406126, 388094, 381345, 350927, 323904, 318771, 306483, 304466, 301209, 313350, 308654, 298216, 294636, 285723, 289405, 294196, 303991, 325041, 328435, 317230, 293112, 264473, 279803, 272396, 264404, 253954, 237213, 246110, 279091, 298449, 272877, 285124, 318292, 348712, 353623, 346820, 368751, 391316, 389285, 396431, 417249, 422766, 382261, 368261, 408774, 419539, 398679, 382506, 391279, 432090, 485537, 496434, 500711, 510762, 529263, 567166, 611336, 662604, 717983, 769416, 818126, 880912, 933279, 1042312, 1142990, 1220659, 1286078, 1382892, 1490491, 1555789, 1685864, 1867934, 2107322, 2438005, 2903904, 3588920, 4624231, 6100016, 8113958, 10476599, 12574911, 13543884]
10141A3543884n79389j722498k127236j940894j480437j070436p19323m76229
10133C427442l15769j88834o3090l201P4436K05008L38173M85755O77728R05792
10123E543440J083214J110834Q15163L22399k32982p77512j082923j115604r81553
10114D684476q66774p03829n27152l97286l44078k43587j81654j62188j28903
10105A129025r7779p5249p1917p1999p4680k3699k489l1774j9038n691J3867P969
10093F76546o3K7900L2380K3491l513J3802K3063j3312J059L9011L1761N4444
10081I06569J05216J19750J56049K13967K24847K33965K13952P4867l4078j03582
10071B111522j55329j60088j73774j45307j00593j11144j17640r1055o2869l3266
$$ y = [13543884, 12964495, 11241997, 9114761, 7173867, 5693430, 4622994, 3903671, 3427442, 3111673, 2922839, 2859749, 2856548, 2930984, 3135992, 3474165, 3959920, 4637648, 5543440, 6626654, 7737488, 8552651, 8875050, 8642068, 7864556, 6781633, 5666029, 4684476, 3817702, 3113873, 2586721, 2189435, 1845357, 1601770, 1420116, 1257928, 1129025, 1031246, 955997, 884080, 812081, 737401, 713702, 711213, 679439, 660401, 654710, 668577, 676546, 676483, 704383, 736763, 760254, 756741, 770543, 793606, 780294, 781353, 820364, 852125, 906569, 1011785, 1131535, 1287584, 1501551, 1726398, 1960363, 2174315, 2249182, 2215104, 2111522, 1956193, 1796105, 1622331, 1477024, 1376431, 1265287, 1147647, 1056592, 993723, 960457]
10061I60457o7956o224n69J0855K6950K2905R541m7264n6058l8885k1897k2007
10049G69848m405r019k4347j3369L635J0620o97k5604j7646r776K448J8286K833
10036G02807q97j1690L565j78k8710j9581l4407j0266j7585l1201l2266l586j6003
10023E00002k3405K1303L1193k7319l52q419n246J460j7353P882M438M2066L8379
10010E64629L3170P0018N1938L8244J8463L6096j1497k7152o6782q6939n0983
9999E69205o7611o7094l9973m7889n5641m3863k8204l6359j2869O683j6165k314
9987A57906l127l946J1379j1913k089K039M788j2483k0727o864L086j9229Q70
9974I9690J3537L562k6986J6488M6061o708m9709L81L8450J2884l5318j3851O376
$$ y = [960457, 892501, 886277, 885708, 896563, 923513, 946418, 955959, 908695, 852637, 813752, 791855, 769848, 765443, 756424, 732077, 718708, 722343, 732963, 732266, 706662, 689016, 679240, 681688, 699974, 702807, 701910, 690220, 693785, 693607, 664897, 645316, 610909, 600643, 583058, 551857, 519591, 516005, 500002, 476597, 497900, 529093, 501774, 501422, 493003, 487757, 489217, 471864, 479746, 484184, 526250, 564629, 597799, 667817, 719755, 757999, 776462, 812558, 801061, 773909, 707127, 620188, 569205, 501594, 434500, 394527, 346638, 290997, 247134, 218930, 182571, 169702, 176385, 160220, 157906, 154779, 150833, 162212, 150299, 148210, 150249, 155037, 142554, 121827, 114963, 118049, 98820, 99690, 113227, 116789, 89803, 106291, 152352, 145644, 95935, 96316, 134766, 147650, 112332, 98481, 104857]
9961A04857j2224l2415R726J0633M992j0492l019m265j5326o239J2779n320O276
9948E9963j2422K8770N03N900K926k255Q837O474Q17k9317j65K1927k127j6571
9934G3260r000O571P593j134Q899J128J0485j5717m2181r767N114l661J1620R293
9920E2503K2677J9990N360n709k7804R889L7398J5509Q810L060q914K7016O789
9907A66574K2921j7918m1856p008K8523l1765n6964n991J1666J5754q765j754
9895G3417N761P690J2149o466K7682J4409k8449k3465J9893k992k546r63R629
9882A05749j01k3523k3289K355q126L4765K1006O514k4098j382J1959M470j7260
9869H9039J2435P0j6502K493L3799M1959M467J8054J574k2854k6594l2462l427
$$ y = [104857, 92633, 60218, 69944, 80577, 85569, 75077, 72058, 67793, 52467, 46228, 59007, 53687, 59963, 47541, 76311, 76814, 82714, 85640, 83385, 92222, 98696, 99513, 70196, 70031, 91958, 89831, 73260, 64260, 70831, 78424, 77290, 86189, 87317, 97802, 82085, 39904, 30137, 35251, 31590, 43210, 52503, 75180, 95170, 100530, 94821, 67017, 76906, 114304, 129813, 138623, 141683, 132769, 159785, 166574, 189495, 171577, 129721, 122713, 151236, 119471, 62507, 56516, 68182, 83936, 75171, 73417, 79178, 86868, 99017, 92551, 120233, 134642, 106193, 82728, 102621, 99629, 97083, 96120, 105749, 105648, 82125, 58836, 61191, 53065, 87830, 108836, 115350, 91252, 89870, 101829, 106299, 89039, 101474, 101544, 85042, 87535, 121334, 163293, 167760, 185814, 187388, 164534, 137940, 105478, 102051]
9856A02051N180K5262K141o398J611j4631M494J9319o105m3938k57K9458K9621
9843A47808K0774L931m3579m9212J2775N044k3111n465L8023J9765p822K0280
9831A39211j0079k5171L9107J6568k6727L085L4587j891k2359k7144k0136R097
9819A08148K1770j450k3454j5957J3269J3009J0886k20K1989j3061j9910r880
9807A05139k595J2630J5863n589j5199J3051q607n265j6949N58K2968l2907k3281
9794E9817J9351J2214J1536J3061r81n36R74L234j047J624N033K4229j1616n2618
9780H4275L621J1904j2694l0266K989m892J9514K8224K719k5420l862p817J0643
9767G8938J2508N109P034Q401j3700l123o641r16J3684j4803l522K0471N810j5277
$$ y = [102051, 107231, 132493, 134634, 128236, 129847, 115216, 119710, 139029, 132924, 88986, 88729, 118187, 147808, 168582, 172513, 128934, 79722, 92497, 97541, 74430, 68965, 106988, 126753, 118931, 139211, 129132, 103961, 143068, 159636, 132909, 135994, 170581, 168690, 146331, 119187, 99051, 108148, 129918, 128468, 105014, 89057, 102326, 115335, 126221, 126001, 147990, 134929, 115019, 105139, 102544, 115174, 131037, 125448, 110249, 123300, 114693, 109428, 92479, 93037, 116005, 83098, 59817, 79168, 91382, 102918, 115979, 114998, 114462, 115436, 118670, 117623, 119247, 124280, 148509, 136893, 84275, 87896, 99800, 87106, 56840, 59829, 54937, 74451, 102675, 105394, 79974, 76112, 68295, 78938, 91446, 96555, 103589, 111990, 98290, 95167, 88526, 87610, 101294, 86491, 82969, 103440, 109250, 93973]
9753I3973r607K667j0860j3872K239J4619L6193M8428l206j7339l1606R867q722
9740A12774j7468L456j0066J1406J1745O222J1184L53r157m586R617L2407O776
9727A64663j0634J253J4032J2457J0206j0877J1596n633L436j714P357j0772o138
9714A79232j5551n751j7439j6459m583K8117L231j7608l2833j3384N5453M6146
9702A88571M633k1300k6857l729l563k0674L023l546K3925l189p56j4552j2631
9689A09355Q881j3023j957p061K8646K3464j5113k8346q634K4091k8734j3773
9677G7796J5672K2571K2104R153j8396k2160J798J59L437K3447J0308R990j0776
9664A45103n137q555L843j5493J0003L8850q836p072k0294j7338O386M0147P946
$$ y = [93973, 84366, 87033, 76173, 62301, 64540, 79159, 115352, 163780, 160574, 143235, 111629, 121496, 112774, 95306, 98762, 88696, 100102, 111847, 118069, 129253, 129606, 120449, 115863, 125480, 157887, 164663, 154029, 155282, 169314, 181771, 191977, 181100, 192696, 187063, 190499, 188785, 196142, 185370, 179232, 163681, 157930, 140491, 124032, 119449, 147566, 150797, 133189, 100356, 86972, 142425, 188571, 193204, 171904, 145047, 141318, 137755, 117081, 120104, 116558, 140483, 137294, 136538, 121986, 109355, 118236, 105213, 103256, 96195, 124841, 148305, 133192, 104846, 96212, 120303, 91569, 77796, 93468, 116039, 138143, 147296, 128900, 106740, 108538, 108697, 112134, 135581, 145889, 155879, 145103, 139966, 131411, 135254, 119761, 129764, 168614, 159778, 152706, 132412, 115074, 121460, 161607, 169553]
9651A69553l5178j3841k3344J081K6866O813j2326K2124Q053o898J4420q210O199
9638A55312j2617j2648N145N114M771l5669j2038K3531M633l898M3497L0626o12
9625A95147j3678k2501j3922j4603j5701O007J6288J6415j528m277k8985k7975
9613I0687J6187L9281M3982J2960j5673m54k2926j2239L411K5864k0239j7174
9601A43667K0190q048m134k5509k2704L4878J3907L6450J8222r677j0713k1810
9589A64719J2611j1295j5387q77j860O509l812j9331O253J882P000k11J2698k1852
9575A37047j1724J9961Q701n402J190J7016o125m344O386K5038r052k795m218
9562A71679k733L195M81l496o108K253J176n993R607j6149j8843Q260K3493L0417
$$ y = [169553, 134375, 120534, 97190, 98271, 125137, 131950, 119624, 141748, 149801, 142903, 157323, 149113, 155312, 142695, 130047, 135192, 140306, 145077, 109408, 97370, 120901, 125534, 121636, 165133, 195759, 195147, 181469, 158968, 145046, 130443, 114742, 120749, 137037, 153452, 151924, 147647, 118662, 90687, 106874, 146155, 190137, 203097, 187424, 186970, 164044, 151805, 155216, 181080, 160841, 143667, 163857, 155809, 151675, 126166, 103462, 138340, 152247, 188697, 206919, 197242, 186529, 164719, 177330, 166035, 150648, 149771, 147911, 154420, 150608, 131277, 137530, 139412, 146412, 146201, 158899, 137047, 125323, 145284, 153985, 148583, 149773, 166789, 160664, 156320, 162706, 187744, 178692, 175897, 171679, 168946, 172141, 172622, 169126, 163018, 165271, 166447, 160454, 170061, 153912, 135069, 143329, 166822, 197239]
9548A97239J9865j7039j0357J512q765p354K9j2095j2230Q724N431J1283l081
9535A73162r19K0364P473l821O508J6069j0569m327J0743j7713j0736j240J3439
9522A98433k429o290j4150J7998K3767p429p806j075J3287J901l534k2220m616
9509A85837K2833K9257l429j0419O406j5210J595j4264Q986P353N404L8432O343
9496B69124J1189J16k2907k7733K511J5683o913l3243K103K0521j9012O401o690
9483B11150K645K7583j0946p958p027Q201m931k879L5633L5722j6597r911l540
9470B57145n00O824O199J9842o219j5692j744j152n802K4719Q465n817J1978m046
9456B94200k6232n065K7307j302o705j5293O969K2685Q447K138j7142j2976J556
$$ y = [197239, 217104, 200065, 189708, 191220, 182455, 175101, 175130, 163035, 150805, 159529, 164960, 176243, 173162, 172243, 192607, 200080, 196259, 202767, 218836, 208267, 203940, 214683, 196970, 186234, 184994, 198433, 196004, 189714, 175564, 193562, 217329, 209900, 202094, 201019, 214306, 216207, 212673, 190453, 185837, 208670, 237927, 234498, 224079, 230485, 215275, 216870, 202606, 211592, 218945, 224349, 262781, 269124, 280313, 280429, 257522, 229789, 232300, 247983, 241070, 207827, 209930, 230451, 211439, 217840, 211150, 213795, 241378, 230432, 222474, 215447, 223648, 218717, 215838, 251471, 287193, 270596, 260685, 257145, 256645, 263469, 269668, 289510, 283291, 267599, 265855, 264703, 258901, 283620, 292085, 286268, 298246, 294200, 267968, 262903, 290210, 288908, 282203, 266910, 273879, 296564, 305011, 307149, 290007, 277031, 278587]
9443B78587k0015K973J0232K1106K3979L8774j8227n1199o372j6110q52K617J0214
9430B75707L1966k25M233J5360L0047m828O503K6210o871j6699m179l997k4251
9417C28976j1860k801K1379J4088O082J3647L436j3727K0699Q786O427Q758r835
9404C94055J84J9151l189j5748j615q894N831J9533J4039J2116O557j2551j3709
9391D15760K606O88K6055L3157k426L690J6096o885p238k5817j0872P956K96O37
9377D53703K6759J0079p952J3243K9707P888J8456L5774k3038j3747J4299R173
9365E74344j732K0933L870o182K5985j156M50j1286J5262K4921L1236L1738K9777
9352G38160j1068j7983p076q360J2082L5063J4951K3626R460N815K4298J4042
$$ y = [278587, 258572, 261545, 271777, 292883, 316862, 355636, 337409, 286210, 279838, 263728, 262876, 265493, 275707, 307673, 307448, 311681, 327041, 357088, 352260, 358763, 384973, 378102, 361403, 357224, 353227, 328976, 317116, 314315, 335694, 349782, 355864, 369511, 372947, 359220, 379919, 388705, 395132, 403890, 394055, 394239, 413390, 410201, 394453, 392838, 383944, 389775, 409308, 423347, 435463, 442020, 429469, 415760, 418366, 419054, 445109, 478266, 475840, 479530, 495626, 488741, 481503, 455686, 444814, 452770, 453066, 453703, 480462, 490541, 482589, 495832, 525539, 533427, 551883, 587657, 564619, 550872, 565171, 574344, 572612, 593545, 597415, 591233, 617218, 616062, 616512, 605226, 620488, 645409, 676645, 708383, 738160, 727092, 709109, 702033, 693673, 705755, 740818, 755769, 779395, 788855, 794670, 818968, 833010]
9340H33010J6143k0416J2951K6661J3534J5596j6636l1859K0493K3680K4538R148
9328I26843J8844J2696J0979Q227L4054L863L598L3273K9371K2144K1027J9800
9316A144719J6660K0200J176N979K7504L725M6603K7621K628K3779K7036K7134
9304A374764L1545J5772K5981J9181K1936J5103O4364L5669l459M485N1116K7753
9292A684210J5402J5877N4687N6130L4603J6819L5614P9293M8976N8912N4232
9281B154755L5883L0735K3378M9318N2478M3929M8377P9058O6444N7066Q7603
9270B729024Q3077Q2696Q1983Q8825O5909R4798J06517R2344J36817J00764J24145
9259C786899J19331J41160J13991J08405J22644J59434J78480J77985J94373J63565
$$ y = [833010, 849153, 828737, 841688, 868349, 881883, 897479, 880843, 848984, 869477, 893157, 917695, 926843, 945687, 958383, 969362, 977589, 1011643, 1015506, 1019104, 1052377, 1081748, 1103892, 1124919, 1144719, 1161379, 1181579, 1182755, 1188734, 1216238, 1219963, 1266566, 1294187, 1296815, 1320594, 1347630, 1374764, 1406309, 1422081, 1448062, 1467243, 1489179, 1504282, 1568646, 1604315, 1600856, 1605341, 1656457, 1684210, 1699612, 1715489, 1770176, 1826306, 1860909, 1877728, 1913342, 1992635, 2041611, 2100523, 2154755, 2190638, 2221373, 2244751, 2294069, 2346547, 2390476, 2438853, 2517911, 2584355, 2641421, 2729024, 2812101, 2894797, 2976780, 3065605, 3131514, 3226312, 3332829, 3425173, 3561990, 3662754, 3786899, 3906230, 4047390, 4161381, 4269786, 4392430, 4551864, 4730344, 4908329, 5102702, 5266267]
9249E266267J78869J98603K45960K47644K35210K65085K61969K76182K68467L26486
9239G770742L57119L74408L68737M15190M39435M57980M95573N25391N42255N71209
9229A2318039O32575O41560O67507P42402P90140Q10848Q35187Q87062R53588
9220A9278908R94378J019039J083838J123022J116306J165198J205708J211191
9212B8197588J180484J170323J104994J033111R30752P62561O52966N01880L02215
9203C5836874J14954r0984k49605m31159o49305p98815r25551j005301j109080
9194C0692028j187249j227717j262558j285356j250469j223058j151501j117198
9186B0986922j095056j031142r78098r79643q90783q18011p90113p37751o83047
$$ y = [5266267, 5445136, 5643739, 5889699, 6137343, 6372553, 6637638, 6899607, 7175789, 7444256, 7770742, 8127861, 8502269, 8871006, 9286196, 9725631, 10183611, 10679184, 11204575, 11746830, 12318039, 12950614, 13592174, 14259681, 15002083, 15792223, 16603071, 17438258, 18325320, 19278908, 20273286, 21292325, 22376163, 23499185, 24615491, 25780689, 26986397, 28197588, 29378072, 30548395, 31653389, 32686500, 33617252, 34379813, 35032779, 35534659, 35836874, 35951828, 35860844, 35611239, 35180080, 34530775, 33731960, 32806409, 31801108, 30692028, 29504779, 28277062, 27014504, 25729148, 24478679, 23255621, 22104120, 20986922, 19891866, 18860724, 17882626, 16902983, 16012200, 15194189, 14404076, 13666325, 12983278]
9177A2983278o54654o04537o17097n45059m92338m63550m47490l89627l99941
9168H368985l77828l37491l20287l22307l00859k73696l04247k56299k01808k11751
9158E462412k31466k03868j65380j69927j67892j66075j66988j47232j54717j01134
9148C787733j00936j21092j10071j14577j03979j02532r1002r9131r5077p8168
9138B771168o0032m8910p3879r2032o8833n5733q1894n6261n9526m5479m4652
9127B083937m0727n9527m0145m8555l7706l1405n9240l7936n0891m1557m2271
9116A593977m0448j8364l5465m6922o5535k8610l97j8876k531m2175n5097k3012
9104A216545j1677k0759m4573l9151Q398j3261n080j6566k3565j6876j5619m16
$$ y = [12983278, 12328624, 11724087, 11106990, 10561931, 10069593, 9606043, 9158553, 8768926, 8368985, 7991157, 7653666, 7333379, 7011072, 6710213, 6436517, 6132270, 5875971, 5674163, 5462412, 5230946, 5027078, 4861698, 4691771, 4523879, 4357804, 4190816, 4043584, 3888867, 3787733, 3686797, 3565705, 3455634, 3341057, 3237078, 3134546, 3043544, 2944413, 2849336, 2771168, 2711136, 2662226, 2588347, 2496315, 2427482, 2371749, 2289855, 2233594, 2174068, 2128589, 2083937, 2043210, 1983683, 1943538, 1894983, 1857277, 1825872, 1766632, 1728696, 1677805, 1636248, 1593977, 1553529, 1535165, 1499700, 1452778, 1387243, 1358633, 1358236, 1339360, 1336829, 1294654, 1239557, 1216545, 1204868, 1184109, 1139536, 1100385, 1108783, 1095522, 1090442, 1073876, 1050311, 1033435, 1017816, 1017400]
9092A017400l5240l2109j3416M394l6670m0881l1946j5378m2761M515L0604J5669
9080H24181m1075k5901k6928k4764k740K3407K4326k9306l3778j8928l8775j3907
9068F15812O390J0445P234k1890P420q420m1488l0501K0456M2021O329j426k5668
9055E86714m0223j9127r788M779j7726m8531p790L0826j8143N388K2455k238k95
9042D86301K4348k582j9917k8010l4640Q63L0535j688o525n660l446M658k8506
9029D15731J963m057n480P031Q11j0760k3689O296J6139K7921l181K1854J7524
9016D68103j0202l4429k2455r479q146j1240J526J0821K088j9357p604J4288j886
9003C72028r096O653r83J8197L066j9181M374k7533k2607J0219K491J2057j0747
$$ y = [1017400, 982160, 950051, 936635, 941029, 904359, 863478, 831532, 816154, 773393, 777908, 808512, 824181, 783106, 757205, 730277, 705513, 702773, 726180, 750506, 721200, 687422, 668494, 629719, 615812, 622202, 632647, 639881, 617991, 625411, 616991, 575503, 545002, 565458, 607479, 613808, 612382, 586714, 546491, 527364, 517576, 522355, 504629, 456098, 448308, 479134, 460991, 466379, 488834, 486596, 486301, 510649, 508067, 488150, 460140, 425500, 426363, 456898, 455210, 448685, 443025, 439579, 444237, 415731, 417694, 413637, 408157, 415188, 415999, 405239, 381550, 387846, 403985, 431906, 428725, 450579, 468103, 457901, 423472, 401017, 391538, 383392, 372152, 373678, 384499, 386587, 367230, 359626, 373914, 372028, 362932, 369585, 368602, 386799, 389865, 370684, 375058, 347525, 324918, 335137, 337628, 349685, 338938]
8990C38938r339j6306l5943Q661K0372p569j2517J7112J2827k9387m448J7831
8978C00232L327O379j4806k5633j9315M775L919j4324q400L8042O383k5770j4326
8965B40483o005J1690J972k960M941J4280k573j7390k3123N630K5657j1135J3792
8952B55259K7298k1659l3675P499K7462k4153J2396K546j1081j9262k000K983
8940B23613p838k2315m146J4352k690K3400R330l3234j6445L7230K5420m600R24
8927B43001j8852J027k2567k0578q326J351L028O208k336L12J0462O302r85p586
8913A90461j8661J5285J1564l3370l6144K6490L1173K5716J935q50J0180n658
8901B18121k0377j9407r198P676j1716k907J6891J6223L3569M6600M2581j48k1573
$$ y = [338938, 329599, 313293, 277350, 286011, 306383, 298814, 286297, 303409, 316236, 286849, 282401, 300232, 303559, 309938, 295132, 269499, 250184, 254959, 258878, 244554, 236154, 274196, 280579, 254809, 240483, 234478, 246168, 248140, 245180, 250121, 264401, 261828, 244438, 221315, 226945, 252602, 241467, 255259, 282557, 260898, 227223, 234722, 262184, 238031, 250427, 252973, 241892, 222630, 220630, 223613, 215775, 193460, 189314, 203666, 200976, 224376, 233706, 200472, 184027, 221257, 246677, 242077, 243001, 224149, 225176, 202609, 182031, 173705, 175056, 178084, 184292, 181956, 182268, 192730, 199032, 198047, 190461, 171800, 187085, 198649, 165279, 129135, 155625, 186798, 212514, 214449, 213599, 223779, 218121, 197744, 178337, 169139, 176815, 165099, 162192, 179083, 195306, 228875, 275475, 318056, 317908, 296335]
8888B96335m9400l7534j1978k1216j9961j4479J6978J884M932J1637m67R246P744
8875A93721j2620q840K1426K6694j755k0895m0350k7451l744J4604J1106k5899
8863A25997k6786M133q720R638O767Q206p911L0856j298k0974J6895N931K4286
8850A67020P767p271J7234r393k5552l4736M107j47O834q104J1219J4533k2008
8837A21503k4127Q931r897J1762J4088O486l02N687L9146K8616k3698l120N457
8824A80532j892j7228q024r27N916R616j0370k2933K524n486J0799m115j3360
8811A25052p787J1746l769J0932k3740k7833R481Q92J5408K4494k1669L157k1015
8798I5349k2001j4925M098j4258J217J0983K0956J5273J8969Q46j4730q131R477
$$ y = [296335, 246935, 209401, 197423, 176207, 156246, 141767, 158745, 160629, 165561, 177198, 176731, 185977, 193721, 181101, 172261, 193687, 220381, 218626, 197731, 157381, 129930, 126186, 140790, 151896, 125997, 99211, 103344, 94624, 104262, 111029, 119235, 111324, 142180, 140882, 119908, 136803, 142734, 167020, 174787, 167516, 184750, 175357, 149805, 115069, 119176, 119029, 125863, 117759, 128978, 143511, 121503, 97376, 106307, 96410, 108172, 122260, 128746, 128444, 134131, 173277, 201893, 178195, 175075, 180532, 178640, 161412, 153388, 152461, 158377, 167993, 157623, 134690, 137214, 131728, 142527, 138412, 125052, 117265, 129011, 125242, 136174, 112434, 84601, 94082, 94974, 110382, 134876, 113207, 116364, 95349, 73348, 58423, 62521, 48263, 49480, 60463, 81419, 96692, 115661, 116507, 101777, 93646, 103123]
8785A03123j7751J457j5483l5319J6668K9740l143j2226n560R397J2606M705K424
8772I0638q981l1445J0010K8718M996L878K541j2503R122n79l099R254J3937J2451
8758A28938j7967k5168j8761p524K0430j1868R120J7658n407K3165J5695K6360
8746A54671J5101m1188n1359r914k015N15o231K4988k483j8978m436P425L1130
8733I7226L435q381K0943Q804l3148l5665j9879q941N310J0526K1257K6872L9634
8720A27993k5618l3735J6422J9786J1294o676l0426l2846j0621J5365m650Q292
8708E4580J6476J3583o057j3386J5618L350M888j6722k3249Q35K6465L9251Q950
8695A24582k5825j7280Q408L514J037l9083l2134n953j0094L4448L0176m036j3868
$$ y = [103123, 85372, 86829, 71346, 36027, 52695, 82435, 79292, 67066, 61506, 70903, 83509, 88214, 90638, 81657, 50212, 60222, 88940, 93936, 97814, 100355, 87852, 96974, 96395, 93296, 102550, 116487, 128938, 110971, 85803, 67042, 59518, 79948, 68080, 77200, 94858, 89451, 112616, 128311, 154671, 169772, 128584, 77225, 67311, 65296, 65811, 59580, 84568, 82085, 63107, 58671, 66096, 97226, 100661, 92280, 113223, 122027, 88879, 53214, 33335, 24394, 29704, 40230, 61487, 88359, 127993, 102375, 68640, 85062, 104848, 116142, 109466, 79040, 46194, 35573, 50938, 46288, 54580, 71056, 84639, 78582, 65196, 80814, 84164, 89052, 72330, 49081, 49916, 76381, 115632, 124582, 98757, 81477, 89885, 93399, 94436, 55353, 23219, 17266, 7172, 41620, 71796, 67760, 53892]
8682E3892j9450M158L2J3688K8699M4242L142j5577P300Q601k5125l4136J740
8669G1206J4717K3110J6995K2308K168R026m259k0920l2484j8756M1696J5923
8657A40730l581l8164l6932j2729J117J0504J6440P035n977l3067j4478j9239
8645A1659K9886N5035K5339k6050l2080j190j126J1234O706lK3131J0323m296
8632A08568j0174L487P384J1157L110M971K8253N741k0209j9496Q643K87P015
8619A38737n263j2034J4730J5210l1345j7627k6576R722J6543J6522Q274j5861
8607A11032O771K0916Q083K2943N888n808J1544M7m500M613J6518J7994L2960
8594B49001J8106Q032o106p049J7469k3909J2462M6872M6342K4395J4733K542
$$ y = [53892, 34442, 38600, 38632, 52320, 81019, 125261, 128403, 112826, 120126, 128727, 103602, 69466, 71206, 85923, 109033, 126028, 148336, 150504, 159530, 155271, 134351, 101867, 83111, 124807, 140730, 137149, 98985, 62053, 49324, 50441, 60945, 77385, 84420, 78443, 45376, 30898, 11659, 41545, 96580, 121919, 95869, 63789, 62599, 61473, 72707, 79413, 79410, 102541, 112864, 108568, 98394, 101881, 109265, 120422, 123532, 128503, 156756, 162497, 142288, 122792, 131435, 131722, 138737, 133474, 121440, 136170, 151380, 120035, 102408, 75832, 85554, 102097, 118619, 126893, 111032, 117803, 138719, 146802, 169745, 175633, 169825, 181369, 181416, 176916, 181529, 198047, 216041, 249001, 267107, 275139, 269033, 261984, 279453, 255544, 268006, 314878, 361220, 385615, 400348, 402890]
8582D02890m118j5039l5115J1550K363n1912n7824k8104k7477l840l0354j7203
8570A45817J7700J0026k0634l2104o537o439r208O120j946O550p27j0518j2725
8557H5375R993K807j9381l9862o115Q902J7307k879M990j2407p310j7489J0675
8544C4606J9681p649K0501J3403j8033k6388J2231l277M850K0231L475j1679J6267
8531G8219K7525m363o867j2525k2432L9182K5092l7255k6777M268q957K063k67
8518E6906j3052J4879M8148o223l1317q457m0103j7397J0234N558J8934R311j0434
8505C6987j1406J2352J7217K916j1539L283l790J1282K1123J5243k1169j7757
8493E4742J1811q32J1114q042n188m754n139o105J0796J9191k069p445O650J4941
$$ y = [402890, 398772, 383733, 348618, 360168, 362531, 310619, 252795, 224691, 197214, 193374, 163020, 145817, 163517, 173543, 152909, 120805, 114268, 107829, 98621, 104741, 102795, 109345, 108618, 98100, 85375, 95368, 98175, 78794, 38932, 32817, 41719, 59026, 56147, 61137, 48730, 41420, 23931, 34606, 54287, 46638, 67139, 80542, 62509, 36121, 48352, 45075, 49925, 70156, 73631, 61952, 78219, 105744, 101381, 94514, 81989, 59557, 98739, 123831, 86576, 59799, 64067, 55110, 57173, 56906, 43854, 58733, 106881, 100658, 69341, 60884, 20781, 3384, 13618, 19176, 38110, 47421, 36987, 25581, 37933, 55150, 58066, 46527, 49810, 46020, 57302, 78425, 93668, 72499, 54742, 66553, 65721, 76835, 68793, 63605, 58851, 53712, 47607, 58403, 77594, 75525, 68080, 74730, 89671]
8479H9671k3466o010k8473K965k553m463R080L3534J9395J7907k0942q684m696
8466G3265j726J714J8748l1541j7194O48N668O814J7583j0003k1167q678M763
8453C8894K697O31J2201k0861k6940J2625l934J0597n374k3523K8535l209j0660
8440A1679R876L687m0784j7042L3186K0373K2844P10K3444L3485O136j2031k0652
8427G4911J0451J182k6685j1428R222o682k5770P89J7146R940j5968k5050J0391
8414B2449R232J5389r523j7800Q769L129J3761k286j2208j2992Q379L506N154
8401C4959P938N996k4224p6O519k0610j0371K131J4823L253j42J49l937K8212
8387D4620J4205j753K661p771j4195l77q673l323p536J3288j0626j7448L7576
$$ y = [89671, 66205, 60195, 31722, 34687, 32134, 27671, 36751, 70285, 89680, 107587, 86645, 77961, 73265, 71539, 73253, 92001, 60460, 43266, 43914, 49582, 56396, 73979, 63976, 42809, 34131, 38894, 41591, 42222, 54423, 33562, 6622, 19247, 15313, 25910, 20536, -2987, 25548, 22339, 11679, 21555, 25242, -15542, -32584, 602, 20975, 43819, 44529, 67973, 101458, 107594, 95563, 74911, 85362, 86544, 59859, 48431, 57653, 50971, 25201, 25990, 43136, 53076, 37108, 12058, 22449, 31681, 47070, 37547, 19747, 28516, 31645, 45406, 43120, 30912, 17920, 26299, 29805, 34959, 42897, 48893, 24669, 24593, 31112, 10502, 131, 2262, 17085, 20338, 20196, 20345, 16408, 44620, 58825, 57072, 59733, 51962, 37767, 37390, 28717, 25394, 17858, 31146, 20520, 3072, 40648]
8374D0648l459k5474O49p356K76K3527K4486o383K153J2685j3820m360P197j1454
8360C9315j5205Q608j3834k912k767j9327j3411j0959M1685K9532j965j0829p926
8347B0005N496p685O525q377k843k2750p225j0274L1126K7508M953K1211M984
8334F2654j0150l6050o870L3290J9461j914k1179j0160l8050K2056N5919L7708
8322A06715J6932J1786j2101P542K0085K3602J6819M6336P8270L8925K1887j7156
8310C59642o8509r0074l9039l0502j9885k2643m649l448k9805k6203l903J2668
8298C3650j3189K251K8976J0194J186j170J6804o286K310j497K1685j3355k1620
8285E9939j1506J2220j7632p200J574j4240P238J6015K4782O0312N0891N4952
$$ y = [40648, 37189, 11715, 12364, 5008, 5284, 28811, 53297, 46914, 49067, 61752, 47932, 43572, 50769, 39315, 24110, 32718, 18884, 15972, 13205, -6122, -19533, -30492, 11193, 40725, 38760, 27931, 20005, 25501, 17816, 24341, 15964, 13121, -9629, -16854, -27128, 3998, 31506, 36459, 57670, 62654, 52504, 16454, 9584, 42874, 62335, 60421, 39242, 29082, -8968, 13088, 69007, 106715, 123647, 135433, 123332, 130874, 150959, 174561, 191380, 237716, 315986, 354911, 376798, 359642, 291133, 201059, 162020, 131518, 111633, 88990, 84341, 80893, 51088, 24885, 20982, 33650, 20461, 22712, 51688, 61882, 63068, 61898, 78702, 72416, 74726, 73229, 94914, 81559, 59939, 48433, 60653, 43021, 35821, 37395, 23155, 30393, 46408, 71190, 131502, 182393, 237345]
8273B37345Q4267O0060J0133l7075n3443l1260o6552q3386l5719r760q558j6002
8261E0050k2790r842K2908J4370k7998j1106j627j7687Q479j789N576J1052J3249
8248C2845l179L767o022k0853l461k2623r739J0481l3627L421K4681K9835J0495
8235A6021j688p779K0967J4724K198q854j1057M053m4222k6471K1618P235J5004
8222A749J5477K0295L0854l1558k648j5509k114J8447R061K829o224N363L798
8209D9820R760O947k269q190m2190j9937J0705L722j9265K911J3476J6110k0116
8196A484J0278O17j4838J2772K3937l2836r801k716j5621O598J2108K923K710
8183b385J653n141k423K2283r014K353q879l457j1758P675M940j2822J9952K00
$$ y = [237345, 321612, 381672, 391805, 354730, 301287, 270027, 203475, 120089, 84370, 74610, 66052, 50050, 27260, 17418, 40326, 54696, 26698, 15592, 13965, -3722, 4757, 2968, 8544, 19596, 32845, 29666, 33433, 27411, 6558, 3097, -19526, -29265, -18784, -52411, -48990, -24309, 5526, 16021, 14333, 6554, 27521, 42245, 44443, 35589, 24532, 28585, -15637, -42108, -20490, -13255, 1749, 17226, 37521, 68375, 36817, 34169, 18660, 16546, 34993, 44054, 46883, 40659, 46022, 49820, 59580, 66527, 64258, 56068, 13878, -6059, 4646, 8368, -10897, -7986, 5490, 21600, 1484, 11762, 12379, -2459, 10313, 34250, 1414, -8387, -11103, -26724, -20126, -8018, -5095, -2385, -732, -5873, -8296, 13987, 4973, 7326, -1553, -5010, -16768, -9093, -4153, -16975, 2977, 3177]
8169C177k2614r586J7736K2217P799J2344j2163j8331J0131j1634l634j7331j490
8156b3379J1572J1174Q436J2503j2747J300K2302K116j5356o853j341K1920k3810
8143G837J3038J7006j7213n394N9526K7988m3821l0240K0763K346J4376n131J4933
8130G6014m7002j4961j526j9320o989M309k2443m127K3388K7053M358j1392l286
8117D076l2301P575J0424l475q131J0901M218J4195J5293L4246J6826N779k0954
8104E8672j3294L795K977l7349P017J7905l839l1109k4240J6961J8819k862l8513
8091b5060k2420J6648J4289J7489L5696K2343l2424l0895J8583J550j6752k224
8079c177j2403M094J8121J2171K0475j6950j4502j5562j0444J5371L135J1534
$$ y = [3177, -19437, -29023, -11287, 10930, 18729, 31073, 18910, 579, 10710, -924, -4558, -21889, -23379, -11807, -633, 7803, 20306, 7559, 8859, 31161, 33277, 17921, 11068, 9727, 31647, 7837, 20875, 37881, 20668, 15274, 74800, 102788, 58967, 28727, 49490, 51836, 66212, 61081, 76014, 29012, 14051, 12525, -6795, -13784, -9475, -31918, -36045, -12657, 14396, 18754, 7362, 4076, -28225, -20650, -10226, -13701, -21832, -10931, -6713, 7482, 22775, 57021, 73847, 79626, 58672, 45378, 49173, 52150, 14801, 21818, 39723, 35884, 4775, -19465, -2504, 16315, 13453, -25060, -47480, -30832, -16543, 946, 36642, 58985, 26561, -4334, 14249, 15799, -953, -3177, -15580, -11486, 6635, 18806, 39281, 22331, 7829, -7733, -18177, -2806, 329, 11863]
8067A1863M461q235m407O734L028J054l1834k5117j1005j4255K5391L6895R318
8054C891j1975k534P270R721J3899p075L0126L845j7929J2852N746J9203K9532
8041I6572k297j2061j6510r536l795J2509q852k6030k1456j6340P563R133J848
8028A0748m048j1399J856j3284J1468n34J8292j005j3446J0640J8807N017K385
8015C5497P379J8101o648l4307k7574P939p65q708k16J2547J5759J2089O808o451
8001C1450k8625j5635K0708L8733J4092J874k1275j6366l1316j9905K1644J0545
7989E924q836k0717q902M2707K4387k947j0649J5791L384k8196o234j9018j8435
7976c1741K9986L2741j0960o448l518Q199K5124R961P483p825j6978K3465n770
$$ y = [11863, 16324, 8089, 3682, 10416, 13444, 14498, -17336, -42453, -53458, -67713, -42322, -5427, 3891, -8084, -10618, -3348, 6373, 20272, 13197, 43323, 47168, 29239, 42091, 47837, 67040, 96572, 94275, 82214, 65704, 56168, 52373, 64882, 56030, 30000, 8544, -7796, -233, 8900, 10748, 6700, -4699, -2843, -16127, -4659, -5193, 13099, 12094, -1352, 9288, 28095, 33112, 35497, 42876, 60977, 54329, 20022, -7552, 387, -378, -9086, -9302, 3245, 19004, 31093, 37901, 31450, 2825, -12810, 7898, 46631, 60723, 62597, 41322, 24956, -6360, -26265, -4621, 5924, -2912, -23629, -32531, 10176, 34563, 31616, 20967, 36758, 40142, 11946, 5712, -13306, -31741, -1755, 30986, 20026, 13578, 10060, 18259, 43383, 53344, 60827, 53002, 36024, 59489, 53719]
7963E3719j0310k3136j5067K6260J2693m720j3352K967o343j9593m338j8604n683
7950b5507K8383N1566j9345K3527J9540m6160j3973j4009k2707m344J2753J3342
7938C066J5690K5546j5409k3505O092l978k5602l4369K5994K3503P439O666K1991
7925C3124k0046j7448P400q200P054K3648j4919k6210j2623K1052Q386J3047J116
7912A5381j6692j3851j4440J8522K0672m041j32j6589n364J66M219J9335j1760
7899d574J7878J3839j2530l4838j0702M3187K3353q588j8850j3284L0772L5020
7887F0683P875n3357R59p750k16J9952q933j1076k6127l1030N99R095O066j4361
7873d7621J7497N1751q04m577q295q231m496j9090j5999o878R620j1036N277J0367
$$ y = [53719, 43409, 20273, 5206, 31466, 44159, 39439, 26087, 29054, 22711, 3118, -1220, -19824, -25507, 2876, 54442, 35097, 58624, 78164, 32004, 18031, 4022, -18685, -23029, -10276, 3066, 18756, 44302, 28893, 5388, 11480, 7502, -18100, -52469, -26475, -2972, 4467, 11133, 33124, 13078, -4370, 3030, -5170, 1884, 25532, 10613, -15597, -28220, -7168, 1218, 14265, 15381, -1311, -15162, -29602, -11080, 9592, 5551, 5419, -11170, -16534, -16368, -12149, 7186, -4574, 13304, 27143, 14613, -20225, -30927, 12260, 35613, 27025, 8175, -5109, 25663, 60683, 68558, 15201, 16160, 8410, 8194, 28146, 19213, 8137, -17990, -49020, -48421, -39326, -33260, -47621, -30124, 21627, 20823, 16246, 7951, -280, -4776, -23866, -39865, -46743, -37123, -48159, -42882, -32515]
7859c2515J3916O693l0705m096m227J659N907M864o719Q007k911N346j4377K0085
7845b9073K5047j9105q445j84K7834R769K703k6457L944n982j8968J2564j5426
7832d1779J2067L2922k887k4749l1157n066L4063J0356J048n032J676K888r904
7819b5554m777j8068N281K109J0826J2554J2567o481k4972k1453J0600K3673n269
7806b8964J2718J6602k3947j104K28n055J4074K9041o680k1928P313p450n293
7793b0445R61j1191K604M893L261K7714Q595p168k6779j2582q634K1619J5096
7780b056K2676p50r852n84J1690J3676p947k6565k6159j0340J734l02r874J2417
7766c2236J2074J3618r214L2949K0210l6395J842K80j297m6161l3780K6607M290
$$ y = [-32515, -18599, -11906, -42611, -46707, -50934, -49275, -43368, -38504, -45223, -37216, -40127, -34781, -49158, -29073, -4026, -23131, -31576, -31760, -3926, 5843, 8546, -17911, -13967, -19949, -38917, -26353, -41779, -29712, 3210, 323, -24426, -55583, -60649, -26586, -16230, -15182, -20214, -18538, -15650, -25554, -30331, -48399, -43118, -41009, -30183, -17629, -5062, -11543, -36515, -57968, -47368, -23695, -28964, -16246, 356, -23591, -24695, -24467, -29522, -15448, 13593, 6913, -15015, -7702, -15152, -20445, -19484, -30675, -28071, -23178, -19917, 7797, 16392, 9224, -17555, -30137, -38771, -17152, -2056, 20620, 19870, 10018, 9434, 21124, 34800, 26853, 288, -25871, -36211, -34477, -34779, -44653, -32236, -20162, -6544, -15758, 17191, 37401, 1006, 2848, 3128, 1831, -44330, -78110, -51503, -47213]
7753d7213k5245J9142K6421O622L75j2518k0356q79k027K2792q39l8110P70L9153
7739c1912J2024j745j4917j2238j8989J3388L2178J6684k4837m559P907J3233
7727a3783K3278j5168j5136L040j9819l487r19L2093J4056O676J9460r501j6446
7714D344l9679j7994J4831K2010J4247j6748j8032n014K0146J396j7421j4753
7702e2667K9817R666K629K4674M762j7139l2831j5083L299L649J9235l285M726
7689a8548k4170o746N45J65j7691J6350L0317K879J4723l865j2733N09O334o783
7675a8714r458q189J4734r304j9221p736J441K170j0999j2531L678Q777K4401
7662d0951P473k1876l0162J8664N722J5181N860j5498o955j0158j2593J5312Q187
$$ y = [-47213, -72458, -53316, -26895, -20273, -19898, -32416, -52772, -53651, -55678, -32886, -33725, -71835, -71065, -31912, -19888, -21633, -36550, -48788, -67777, -54389, -22211, -5527, -30364, -34923, -27016, -13783, 9495, -5673, -20809, -17769, -37588, -41075, -41994, -9901, 4155, 10831, 30291, 20790, 4344, -35335, -53329, -38498, -16488, -2241, -18989, -37021, -42035, -21889, -20493, -37914, -52667, -22850, -13184, -10555, 14119, 18881, 1742, -31089, -46172, -42873, -39224, -19989, -23274, -18548, -42718, -49464, -48919, -48754, -66445, -50095, -19778, -16899, -2176, -6041, -18774, -18265, -11931, -18714, -28172, -36361, -21627, -30931, -50152, -57888, -56447, -54277, -65276, -77807, -74129, -65352, -40951, -33478, -55354, -85516, -66852, -61130, -45949, -40089, -55587, -62542, -72700, -85293, -69981, -61794]
7649f1794J9556j1180j0486P497J3161q643p853m680P144R980l175J4405q788
7636d4856R272K1072K2197k3911j7096M926K0388K575j184N182j6136j9028n96
7623c7195J7516j8647j8295J7782J0670k2957J3735J1626k1847L7340j041l7715
7611d9028l525M686K9821L439j1675Q553r896j7431m55j0545L0619J1667j2016
7598b5786k6119J6130J6988p468J2869Q189n863R494K282k9595p158n836Q091
7585c3782J3767K8134j0641j2221l8565k6182K8630Q73L4219K2397J1902J9873
7573C8404l509o805j8892k0778j8135o400q338J9602Q289q833j3398o151K5949
7560a8995J2980j6430m606j3090M198J9257K9548K1563r658J2197J6333K032o530
$$ y = [-61794, -42238, -53418, -63904, -56407, -43246, -51889, -59742, -64422, -57278, -47298, -50473, -36068, -44856, -35584, -14512, 7685, -16226, -33322, -28396, -8008, -5433, -6617, -1435, -17571, -36599, -37195, -19679, -38326, -56621, -38839, -28169, -51126, -37391, -25765, -47612, -10272, -11313, -49028, -52553, -47867, -18046, -14607, -26282, -17729, -27625, -45056, -45511, -56056, -25437, -13770, -25786, -51905, -35775, -18787, -26255, -13386, -5197, -11060, -1566, 716, -28879, -36037, -41873, -33782, -20015, 8119, -2522, -14743, -53308, -79490, -50860, -49987, -15768, 6629, 18531, 38404, 34895, 28090, 9198, -11580, -29715, -36115, -44453, -24851, -16562, -25395, -38793, -44944, -18995, -6015, -22445, -27051, -40141, -35943, -16686, 12862, 34425, 24767, 36964, 53297, 55329, 48799]
7547D8799k655k3432l8389j5711K2464m88k337K0491k134l9078l824L6422K638
7534B766o245j3087k3721k7416o986J7885J7000m265J8841J7159k764J5924j9003
7521a3912k4223r432J7690J6743j194o761M048O518j1311o951R690q845j0867
7508c8807j1116J7990J1132p58J7220M0572K5624k8849j2214l651j8961J150J0344
7495I676k062j2335o213j4756j6618L573j762j1169k583O895J193Q842j26j5618
7481e3063K1969k852J3256p976M585j1182n823r126J7886J8119l0183k2197l720
7468g0307J0831K2186O919L1368J2063j3121O72j1827k6033R272l575l059r514
7455d4125J4602p562o614r39P231J1336L9232M203m5431j6831L0241j2233r462
$$ y = [48799, 46144, 22712, -15677, -31388, -8924, -9412, -11749, 8742, 6608, -32470, -36294, 128, 2766, -3479, -16566, -40287, -67703, -74689, -56804, -39804, -44069, -25228, -8069, -10833, 5091, -13912, -38135, -47567, -29877, -13134, -14328, -21089, -17041, -10523, -21834, -28785, -19095, -27940, -38807, -49923, -31933, -20801, -21559, -4339, 36233, 61857, 33008, 20794, 17143, -1818, -668, 9676, 7614, -4721, -10934, -25690, -42308, -38735, -40497, -51666, -54249, -47354, -46161, -37319, -37445, -53063, -31094, -33946, -20690, -28666, -24081, -35263, -41086, -50212, -32326, -14207, -44390, -66587, -70307, -59476, -37290, -30371, 997, 13060, -61, 611, -11216, -37249, -27977, -31552, -34611, -44125, -29523, -37085, -43699, -44638, -37407, -26071, 13161, 17364, -28067, -44898, -14657, -26890, -36352]
7442c6352l313J961k705o184J5163K1685P823K1831K3237j6527l7929j9437j0987
7429d1734m57j712J2210Q95J5384P048o450N236o141q23r628K648K3394J5309
7415A5179P856k6139k0903N535J2852J7135K161k5631k2450J9848M0407r198l4932
7402a8280m393K8370Q123q601j6177N943K6685j5839j0110l932j0836r752J2902
7389a5897l364Q133Q766k4377p220R783q879J5408q779l5221k0713K1626L3962
7376b6772K0763k510j0889J3517M367L839l609j9819P673o495L3724O051k6424
7363f584j6333k0243j9977k130P691M054K757J0525J8725o32J1399m0033m39N451
7349d5769k4974R893J9644J932J942R891j2303J2373J5648J621R009l8973p199
$$ y = [-36352, -39665, -37704, -40409, -46593, -31430, -9745, -1922, 19909, 43146, 26619, -11310, -30747, -41734, -42191, -43903, -31693, -30798, -15414, -8366, -14816, -9580, -15721, -16544, -26172, -23524, -130, 15179, 23035, -3104, -24007, -18472, -5620, 11515, 13676, -11955, -34405, -14557, 25850, 16652, -18280, -22673, 5697, 13820, 5219, -10958, -5015, 21670, 5831, -4279, -8211, -19047, -28799, -15897, -19261, -11128, -2362, -26739, -33959, -24176, -33055, -17647, -26426, -61647, -82360, -60734, -26772, -6009, -8519, -19408, -5891, -1524, 2315, -1294, -21113, -13440, -19935, 13789, 19840, -6584, -22917, -43160, -63137, -65267, -57576, -53522, -50765, -40240, -21515, -22147, -10748, -50781, -51220, -45769, -70743, -60850, -41206, -39274, -37332, -27441, -39744, -27371, -11723, -10102, -1093, -40066, -47265]
7336d7265K9703J4583K3985j2260j8595p452j1894l817j0897L440q500l750M866
7323d7853J4437J5519m660j3571K18J213K5785k279J2997L535k3113k6050L5249
7310h573L1868l5282j9351J618j9707K1922L1766k5705l7872Q049J7091j1574
7298d5750k429K1874q647n040K5125L792J1928k903p896j4766n187n648j2672
7285d8219L5186K6999l008L22L49j7289n055n80j0588J5547q636j6425J6664j6349
7271c1082o677J3232K878j2380J5936O15p733K527m589M905p162k7131J2035J6761
7257b7865K803K4010L798l1056L075K4423j01L614l389l499k883K7995J7310l301
7243C4934J894j5534j2880l041q495N133q520J6461J0697j7021j0245k4272k092
$$ y = [-47265, -17562, -2979, 21006, 8746, -9849, -17301, -29195, -33012, -43909, -40469, -48969, -52719, -47853, -33416, -17897, -22557, -36128, -35910, -34697, -8912, -11191, 1806, 5341, -17772, -43822, -8573, 23295, -11987, -31338, -29720, -49427, -27505, 4261, -21444, -59316, -51267, -34176, -45750, -48179, -26305, -34952, -39992, -14867, -11075, 853, -2050, -9946, -24712, -29899, -35547, -48219, -13033, 13966, 10958, 11280, 11629, -5660, -10715, -11295, -21883, -6336, -14972, -31397, -14733, -31082, -37759, -24527, -21649, -34029, -18093, -17478, -25211, -22684, -27273, -22368, -29530, -56661, -44626, -27865, -25062, -1052, 2746, -28310, -25235, -812, -913, 2701, -688, -4187, -7070, 20925, 38235, 34934, 36828, 21294, 8414, 5373, -3122, 2011, -6509, 9952, 20649, 3628, -6617, -30889, -32981]
7230c2981M8367m743j423J1018R554J4446J6518p091j9618j8464l4392k3804k6968
7217f9581K4018P054Q278j891O150J1149p322j9522o556J3862O765m950K6871
7204e675L3091j0080k5397o258o012O102J3104n561J634L3978J0385k3016j2463
7191C832j2531j3212j3665j2605J2979J2994R642K423R107J5156K1933M431l2499
7178G985l8315k2451j9773K7435m062l025J8884R293p887J1289k857L489r67P221
7164a3741o430j1092j134P383k0048K4098N0306K4620j1069k2937o487k0622j939
7151i092j1510k7336K612q973j3769J5501K1321l794k4437N824J5642P219q233
7138c9025n144J7238J3004J9446J177k4605j4222o794P867p662j5759J5047K6054
$$ y = [-32981, 15386, 10643, 9220, 20238, 29792, 44238, 60756, 53665, 34047, 15583, -18809, -42613, -69581, -45563, -38509, -30231, -32122, -25972, -14823, -22145, -41667, -48223, -34361, -27596, -32546, -5675, 27416, 17336, -8061, -14319, -20331, -14229, -1125, -6686, -5052, 28926, 39311, 16295, 3832, -8699, -21911, -35576, -48181, -35202, -22208, -12566, -10143, -1036, 14120, 36053, 40484, 7985, -30330, -52781, -72554, -45119, -49181, -52206, -33322, -24029, -31916, -20627, -23484, -19995, -20962, -13741, -20171, -31263, -32397, -25014, -45062, -20964, 29342, 53962, 42893, 19956, 13469, -7153, -9092, -20602, -47938, -45326, -54299, -68068, -52567, -31246, -35040, -59477, -53653, -38011, -30792, -39025, -44169, -26931, -13927, 5519, 6696, -17909, -32131, -38925, -31058, -38720, -54479, -39432, -13378]
7125a3378J0006N536P566j0829k6051L737j7643k5739j1128j2428K7155L1786
7113c1410K2665p07K087l1222k4918J7227Q665K3857l81j2623q650J0753o53J2172
7099a3138K213l191L578K043P141p063k7557k845J8332J8343n015k3238J3626
7086a6771J2780m622N964j4652J254J6113j3767P813J3060L1684n258k5236l2676
7073b4314m1279J2187K2299J1163Q990j2450r351l592L5510j4834p769j1859J547
7060c3752J441K0158K0236p579j0743q512J4439J4196l3474O998J6575l3023l848
7047c6888J7477J773j9338l51K3732j0923l0913j4220J5792O987J3947K3246q076
7034a7755o947L0241m366r248j0243j4702q159K7829j2123R938J0028j7868r181
$$ y = [-13378, -3372, 2164, 9730, -1099, -27150, -23413, -41056, -66795, -77923, -90351, -63196, -31410, -8745, -9452, -7365, -38587, -63505, -46278, -37613, -13756, -14137, -26760, -35410, -24657, -25310, -13138, -10925, -14116, -10538, -8495, -1354, -8417, -35974, -38819, -20487, -2144, -7159, -30397, -16771, -3991, -8613, -2649, -17301, -16047, 66, -13701, -5888, 7172, 38856, 33598, 8362, -24314, -65593, -53406, -31107, -19944, -10954, -23404, -32755, -36347, -837, -15671, -23440, -35299, -33752, -32311, -12153, 8083, 504, -10239, -18751, -4312, 9884, -23590, -16592, -17, -33040, -36888, -19411, -17638, -36976, -37327, -13595, -24518, -55431, -69651, -53859, -46872, -32925, -9679, -17755, -24702, 5539, 1173, -8075, -18318, -33020, -41179, -13350, -25473, -15535, -5507, -23375, -32556]
7021c2556r401j1241R417L885k4177K3967K2975k2608k4075j5081K2152M0723
7009a6020Q548k0765J9247J6215j5909j7268L113J5123k0834M34r066J4783O082
6996a6317J632O645M041q515j8047j2234J8164J9909k4019j7588K5651M836j5184
6983c1026Q356m356P19n580n362J5592O212p064r864N664L8166n833l6238N14
6969c0100J599k2447K2618M9374R804k5531j1925j3381j6914j1448K905j1757
6957e7203J5087J2770K697n086J3596p144k9769J8560J627p291j7124L5927l0477
6944e3830j6552J5599k0262p106J3883L5565J3648K384j1313J311O139K134j3024
6931c1424R012l549n174k1152n274J4387m893L3758L8283l3575l7750k9699N361
$$ y = [-32556, -41957, -53198, -43781, -39896, -64073, -40106, -17131, -39739, -63814, -78895, -56743, -16020, -7472, -28237, -8990, 7225, -8684, -25952, -22839, -7716, -28550, -28116, -37182, -22399, -16317, -14685, -8040, -3999, -12514, -30561, -42795, -24631, -4722, -28741, -46329, -20678, -15842, -31026, -22670, -27026, -26307, -31887, -37249, -21657, -15445, -22509, -32373, -26709, 11457, 5624, -30614, -30100, -28501, -50948, -28330, 21044, 30848, 5317, -6608, -19989, -36903, -48351, -45446, -57203, -42116, -29346, -26649, -31735, -18139, -25283, -55052, -36492, -34865, -42156, -59280, -23353, -53830, -70382, -54783, -75045, -82151, -68268, -32703, -19055, -16671, -27984, -26673, -20534, -18400, -31424, -22412, -25961, -31135, -52287, -57561, -43174, -48067, -14309, 23974, -9601, -47351, -77050, -71689]
6918g1689K8894N4563j3649k4234L49j0182n146l441J7439J2338o990q218N39
6905b9427J2607Q971P462K500l860k0084j8648l013J8296j157k0246k4652K0142
6892e1109K0246L5229K8638J5934j8304j5994j7872L474l0315O208J0030n851
6880a9686P258m690R208p906l487o715p694R01R881k671K96R309m017k9270l1418
6865h0701K5999P184J6226j022k0590J8159j2296J055N498k1124K0796K0590R89
6852a9237j0060K246J0487j3777o891L903k483j0554K5134L4261j6219j6110J6514
6839b786j937l422r741J2079J7900k9780l4628J2730J9158J4344q156l081J8052
6826G32K1544j4904k4413l492n956R901j7647k5245j503o608l225J2616K0255
$$ y = [-71689, -42795, 11768, -1881, -26115, -25766, -35948, -41094, -44535, -27096, -14758, -21748, -29966, -29427, -16820, -7849, -387, 2113, -1747, -21831, -40479, -43492, -25196, -26353, -46599, -71251, -51109, -30863, 4366, 33004, 48938, 30634, 14640, -3232, 242, -30073, -23865, -13835, -19686, -12428, -17118, -7910, -15816, -19303, -26018, -33712, -32811, -22930, -25601, -25305, -15996, -20013, -49283, -80701, -54702, -47518, -31292, -32314, -52904, -34745, -47041, -45986, -40488, -61612, -40816, -20226, -19237, -29297, -27051, -16564, -30341, -37232, -33329, -35812, -46366, -21232, 13029, -3190, -19300, -2786, -4723, -8145, -17886, -5807, 12093, -17687, -52315, -39585, -20427, -6083, -14239, -17320, 732, 22276, 7372, -17041, -20533, -26489, -16588, -34235, -59480, -60983, -67591, -70816, -58200, -37945]
6813c7945J1934j0782j1381J5081q877N202J3418o212l456K500J8546N441O649
6800A18K1793K5455j7539k4140j6267r253j4290K3138L0730j4746k1383j241j1840
6787b9465m169L4264J7753J7287M685j5386j7080m2674j3815J0938K115k1073
6775e6620J019K5789J2907J6654N03j0261Q05L310K250q597j6096L507J1508k786
6761a6108j2887q996J0124K0338j460J092K0518K3874K77O593j1364l21m20j9133
6747A2127n422j2799j5319m183Q870j3804j1289m62N063R447J4705j0141n988
6734b9195M2358P926P476j209j6047j8924l1583r25K5998m749K29p953n968J3610
6720a8956M939L791K8392K6850J5348J4802K8463L5618M6650p207k7498k6707
$$ y = [-37945, -26011, -36793, -48174, -33093, -41970, -36768, -23350, -29562, -33018, -30518, -11972, -6531, 118, 21911, 47366, 29827, 5687, -10580, -19833, -34123, -10985, 19745, 4999, -16384, -17625, -29465, -33634, 630, 18383, 35670, 40355, 24969, 7889, -34785, -48600, -37662, -35547, -56620, -55601, -29812, -16905, -251, 252, -10009, -9204, -5894, -3644, -12241, -28337, -24830, -13322, -16108, -28995, -37991, -27867, -7529, -8989, -7897, 12621, 36495, 36772, 43365, 32001, 31680, 31260, 12127, 6705, -6094, -21413, -25596, -16726, -30530, -41819, -42281, -37218, -27771, -13066, -23207, -29195, 13163, 21089, 28565, 27356, 11309, -7615, -39198, -40123, -14125, -18874, -18645, -26598, -32566, -18956, -14017, -10226, 18166, 45016, 60364, 75166, 103629, 139247, 185897, 178690, 151192, 124485]
6708A24485m3860l9559m1329j4163J5458O161p561M420p006l6877K1989J8795
6696I53K278o381j3078q776P038k455j4838j7593L25K8247K7784m752J8258K1724
6682C8734j0870l6490k0676R365J5936p08M821k2513j3346O53n499L982J3618
6669b2993R0K628N074J6925n307k3935r43k261J242J6466K5001k2154l865r155
6655b3187j0646o629Q944m964k219j9708k8479J1770J5037J1483K5564O525j8004
6642c4513o960p750r942J1025r194J6986J0570m510L511k8578q653L3744J7847
6629a6417L228R047j2184m872J2057J230j2503L986J593o94k4751O80M814j748
6615c6534N2J6511L999j8113o680J823K5742K4871j2411j6688j3842J961J978
$$ y = [124485, 80625, 41066, -263, -14426, 1032, 7193, -368, 4052, -2954, -39831, -17842, 953, 3231, -3150, -16228, -25004, -17966, -20421, -35259, -52852, -52527, -24280, 3504, -1248, 17010, 38734, 27864, -8626, -29302, -19937, -4001, -4709, 112, -22401, -35747, -35094, -40593, -36611, -22993, -22903, -20275, -15201, 1724, -3583, -27518, -28461, -30722, -29480, -13014, 11987, -10167, -14032, -23187, -33833, -40462, -31518, -36482, -38701, -58409, -86888, -75118, -60081, -48598, -23034, -16509, -34513, -41473, -49223, -59165, -48140, -57334, -40348, -29778, -34288, -30777, -59355, -68008, -34264, -16417, -13189, -4142, -16326, -21198, -9141, -7911, -20414, -16428, -14835, -15529, -40280, -39600, -34786, -36534, -36482, -19971, -15972, -34085, -40765, -38942, -13200, 11671, -740, -17428, -31270, -29309, -27331]
6602b7331J6307J7044k5639j4771k5557k2431Q396J2111K6767Q306n357R818K4877
6589B540l4544j1625N28R560j9401K222M3016J5217k1693k9900Q214j2155J1247
6576c6774J9206P366j3748j6302l1269L4644M7826J1524l147r930r334O659j3794
6563g073j2322l0803J7357J7821l594N307K0198j2425k3215j0119J2549L1318
6551D999J1175j4214P17l9926l2084m38L5989L1671O186j5608q450m610k8139
6538e2732k0038K4680J5977j4292R095Q548J6781K796N052R883J7262k4491m5071
6525d6550j3409O629L0677J2378J0488J4697j1983j8000m210K1304N530q304J1713
6512A0960j9138J1580K0113m613k8713L327o248M446j8278k7074k1563n091J8115
$$ y = [-27331, -11024, 6020, -19619, -34390, -59947, -82378, -73982, -61871, -35104, -26798, -32155, -22337, 2540, -32004, -43629, -43101, -33541, -52942, -50720, -7704, 7513, -14180, -44080, -35866, -48021, -36774, -17568, -10202, -23950, -40252, -71521, -36877, 10949, 22473, 19326, 9396, 62, 6721, -7073, -19395, -50198, -32841, -15020, -18614, -13307, 6891, -5534, -28749, -38868, -26319, 4999, 16174, 1960, 2677, -37249, -69333, -69771, -33782, -2111, 4075, -11533, -19983, -24593, -52732, -72770, -48090, -32113, -46405, -37310, -28762, -11981, -9185, -4133, 5750, 23012, -1479, -46550, -59959, -53330, -22653, -10275, 213, 14910, 2927, -15073, -19283, 2021, 7551, -753, 10960, -8178, 3402, 23515, 18902, -9811, -6484, -12732, -8286, -26564, -53638, -75201, -80292, -62177]
6499f2177J8970N90K2837K6252J1251o998k8384n654k5870m774K2578J5590q572
6486b4361L255q051J5822J2451l526j3953L1155J5321j8975o79l468o112M358
6473C237J2175J7682j3917j0385j1879L543k4279l2970o166J498K6544K9863J7381
6460A2327K338l6212j0382R815J9593o052j4464P431L380M79j3948j6690P449
6447c4936L1214R042k1800L114J0209l766o462n686j6913k2217J1479J9228J4878
6434a2616j0531o835k9814M83L4333j547J757j946K0282J3961l915j2186j9000
6421b7574R423J6331J6018N667l69j1632K728m373K3086j7233k9954l8598J9210
6408c7270R615j0798l0966j2850L1242L5337J9396k2387J7681j9881j941K0988
$$ y = [-62177, -43207, -42617, -19780, 6472, 17723, 10725, -17659, -23313, -49183, -53957, -31379, -15789, -24361, -21106, -29157, -13335, -884, -4410, -18363, 12792, 28113, 9138, 8459, 4991, -1121, 3237, 15412, 33094, 19177, 8792, -3087, 456, -23823, -56793, -62959, -61461, -34917, -5054, 12327, 14665, -21547, -31929, -22114, -2521, -8573, -23037, -15606, -12226, -11747, -25695, -42385, -34936, -3722, 5320, -16480, -13366, -3157, -6923, -13385, -19071, -35984, -58201, -46722, -27494, -12616, -23147, -29982, -59796, -59313, -24980, -26527, -24770, -26716, -6434, 7527, 3612, -8574, -27574, -18151, -1820, 14198, 19865, 19496, 7864, 10592, 6219, 29305, 12072, -17882, -56480, -37270, -27655, -38453, -69419, -82269, -51027, -15690, 3706, -18681, -1000, -20881, -22822, -1834]
6396a834k062J2404J9896N177j2154l0921J7972N504J819j4251m7850k1674L0749
6383c7225L7727J5402j3317J632q513L367J5625M187l2556j9933P802j3714O845
6370c2671J2432q525k4756n928J0080j8849L2835K0008j9813j8820N361K4217
6358b4429L9587N154J8146k5482l8623j2252J7192K4123j1921j9162J403J1007
6346a5257K1087K044n127k7347k4148K3930K9293J786j0446j2256p314l472j0013
6333c7240J8791K1058K0938r32K825L2194j271j4310k2794m738j0536J1510j7319
6320a824K100j242j3417k694Q752J642L089K3864p14j8250k099J0239l3765J0120
6306a4199M767J1447j1689n323M170N615N035J3389j2481j2608M826k1162K8895
$$ y = [-1834, -3896, 8508, 28404, 33581, 21427, -9494, 8478, 13982, 15801, 1550, -46300, -67974, -37225, 502, 15904, 2587, 4219, -4294, -927, 14698, 18885, -13671, -33604, -25802, -39516, -32671, -20239, -28764, -53520, -59448, -49368, -68217, -35382, -15374, -35187, -54007, -48646, -24429, 15158, 20312, 38458, 12976, -25647, -37899, -20707, 3416, -8505, -27667, -26264, -15257, 5830, 7874, 2747, -24600, -48748, -24818, 4475, 6261, -4185, -16441, -23755, -27227, -37240, -18449, 2609, 23547, 22615, 25440, 57634, 56363, 42053, 19259, 14521, 3985, 15495, -1824, 276, -966, -14383, -17077, -8325, -6683, -3594, 20270, 19556, 1306, -793, 9446, -24319, -14199, -9432, 2015, -9674, -14997, -10827, -5212, -177, 13212, 731, -11877, -7051, -28213, 682]
6293F82J0614j2729l2536k6402K0148M9240l2j6127j5573l652J5421j6229j913
6280b9088L697j1666J3367K1025J2203j192L118j1479P383n414j7908J0315K569
6267c070K3987n306j6614k1134J3745K6132k228j0317j1183j883l3321M706k3091
6254e9577k673L826j4904K6064J8678r040K847l1897j537K1548J3584J0755L057
6241a9269Q370J6361K0995l7714l5226j0828r543m826J3735P928P023K3098R018
6228a0878j1586N41m489l529o241J2695k886j9388M235l709p635p922K2847O0964
6214B3019J8387j7153m672J2849m11j8934l9545k7612J141K8426J5082J0056J187
6201A820k9568k2335q819M297M359K368l7317j625L2210K5832J7733J234K2639
$$ y = [682, 11296, -1433, -33969, -60371, -40223, 9017, 8985, -7142, -22715, -26367, -10946, -27175, -29088, -25391, -37057, -23690, -2665, 9538, 8346, 11464, -15, 7368, 1954, -15954, -5639, -3070, 20917, 15611, -1003, -22137, -8392, 17740, 15512, 5195, -5988, -7871, -41192, -36486, -59577, -62250, -58424, -73328, -47264, -28586, -37626, -34779, -66676, -68213, -46665, -33081, -22326, -19269, -10899, 5462, 26457, -11257, -46483, -57311, -66854, -71680, -57945, -50017, -42994, -19896, -10878, -22464, -21923, -26412, -29941, -36182, -23487, -26373, -45761, -41526, -45235, -52870, -60792, -37945, 23019, 41406, 24253, 19581, 32430, 32019, 13085, -26460, -54072, -52931, -24505, -9423, 633, 1820, -27748, -50083, -58902, -54605, -50246, -47878, -85195, -86820, -54610, -28778, -11045, -9811, 12828]
6188A2828N058J140R466j2822k3009O805L115n775K2538p888J3148J1768o842
6175B9530j2757k6738n4341l3160J6418M6538J1505j8578l0105j8881K7413J3247
6163d9909j4486J5048K0243j1354k2069K4182J9140J93j1133k727j4430l876J9701
6150c1477J9355J0328k0944o916J8558J2682J1942J4402J97k6481N615j60j5574
6137h473q054o090J0081q607N90J5370r196P370J0615L1856j2849n933j5672l220
6123b212J3576M17k4966m927j369j3324R844K7277R500K4095l7478j1446j1593
6110b2606j6705N830l5055o989O509J9983K3299K8949o476k8612j96K2198O011
6097c860J1717j1925r053L2320J4223j199r982O783j094p935k4396J026j4655
$$ y = [12828, 17886, 19026, 28492, 15670, -7339, -534, 2581, -3194, 19344, 11456, 24604, 36372, 29530, 16773, -9965, -64306, -97466, -81048, -34510, -23005, -41583, -71688, -90569, -63156, -49909, -64395, -49347, -29104, -40458, -62527, -38345, -19205, -19012, -30145, -32872, -47302, -51178, -31477, -12122, -1794, -22738, -29654, -11096, 1586, 13528, 27930, 28127, 1646, 7261, 7101, -8473, -16527, -22617, -12536, -21143, -20553, -5183, -14379, -7009, 3606, 35462, 22613, 16680, 1008, -2212, 11364, 11781, -13185, -18112, -19481, -32805, -22961, 4316, 13816, 37911, 433, -11013, -22606, -39311, -33481, -68536, -75525, -69016, -49033, -25734, 3215, -3261, -31873, -32069, -9871, -3860, 7857, -4068, -13121, 19199, 33422, 32223, 22241, 29024, 27930, 19995, -4401, -3375, -18030]
6084a8030j9270o021l684R653J3016L7483O275l677k736k3318l0323Q320J1551
6071b0761M014J753K8062J2372J3656o793k6480l7177J0440J6956J2521P702q858
6058G407o3893j3010J1445Q387P128J2394K2822l563j0290q455n568J2548R852
6045a2796j0583j152q473p43L2250j3358j6039q620N3k723R383L1484O698J2957
6031A8338j7707j8930r439N241K1511K1540k7980j3389o218j3523n79K3144N774
6018a2217k284N6j1148L312J1821L48k3954J4311K8684K3299M746j0994J5544
6005D1524l8035k9057J2840j238n07n294k245K1094L7932k435k2703k6014j3503
5992b7641k4783J3871K1939N880j6783m556r91K3310l46J8044K7766k65j8305
$$ y = [-18030, -37300, -43321, -47005, -37352, -24336, 13147, 19422, 15745, 13009, -10309, -40632, -32312, -20761, -16747, -14994, 13068, 25440, 39096, 32303, 5823, -31354, -20914, -3958, 8563, 16265, 7407, -56486, -69496, -58051, -49664, -42536, -30142, -7320, -10883, -21173, -29628, -35196, -22648, -12796, -23379, -24531, -33004, -33747, -1497, -14855, -30894, -39514, -39461, -42184, -32801, -1317, 5381, 18338, 631, -18299, -27738, -22497, -986, 20554, -7426, -20815, -27033, -40556, -41135, -17991, -12217, -14501, -14445, -25593, -22281, -10460, -10112, -34066, -19755, 8929, 32228, 36974, 25980, 41524, 3489, -25568, -12728, -13966, -14473, -19767, -22012, -918, 37014, 34579, 11876, -14138, -27641, -52424, -38553, -16614, -10734, -27517, -32073, -33064, -9754, -10100, 7944, 35710, 35445, 17140]
5979A7140J5415K137k6197j9741j043J6931k3530j6589j2907K207j0478L192K1755
5966c1708J3138K931K7073K3781l483J0952j9331l5808n345J8758n54k1399M297
5953a6698K2853K6780k9650k3602n249J6868K3575J063P50N3168k207j9353J482
5940D9780l7898k3676j5811M568k6428k2827L23J0669P54K1692K3254Q893J7708
5927A1001j3396l0257J2965P870O922k3754j0059J8956J1747j2607q024L2599
5915C963K1548P191J3760k2222m5906k0031l799L729M2364J0327k2805r6O579
5902e398l2621j2116J0780L308j2550j0879J9796L768k398J5044R213K8080j5217
5889a190l8399k294J4295M874j3189K7443J8419j4347j5741j8945k645k302J7382
$$ y = [17140, 32555, 34692, 8495, -11246, -12289, 4642, -18888, -35477, -48384, -46177, -56655, -53463, -31708, -18570, -15639, 11434, 35215, 31732, 42684, 23353, -12455, -17800, 958, 404, -20995, -16698, 6155, 32935, 3285, -20317, -25566, -8698, 14877, 15940, 16690, 69858, 67651, 48298, 49780, 11882, -11794, -27605, -23037, -49465, -72292, -71969, -61300, -60546, -38854, -15600, -6707, 11001, -2395, -32652, -19687, -11817, -4895, -28649, -38708, -19752, -8005, -20612, -28636, 3963, 25511, 32702, 46462, 24240, -21666, -41697, -45496, -41767, 597, 10924, -11881, -11977, -5398, -38019, -50135, -39355, -36047, -48597, -59476, -39680, -35912, -38310, -23266, -14053, 14027, -1190, -39589, -41883, -27588, -22714, -35903, -8460, 9959, -4388, -20129, -39074, -41719, -44021, -26639]
5876b6639O56j350K1495k846q615J413j1591j2940J3719J6524O816j753l316j2726
5862b1153p132L655K7503L359L343j541j2299k2694k4362L0488O596O616K581
5849e040J4995J009R922L8685K675l9759j2964L017j4874q823M168J4560m767
5836B804j9674k4725n717k2223K8902L0615J5624N9m166j3188k8870m216j0611
5823e5386K2348M0599K748k1936m563j5657j8663k590J3895L6995o602j0379l346
5810b2537K2732m578k533K2065K975j6890l5007k4106O846J8127J3285J3740J0917
5797E036j0200M484J269j047K3699R842q78j1684k0390j1188k408j7118p728L381
5783c4930J2713K7590J6266j889l919j0284p297j5844J0580K448r316Q939r003
$$ y = [-26639, -25983, -27333, -5838, -8684, -17299, -15886, -27477, -40417, -26698, -10174, -3358, -5111, -8427, -21153, -28285, -24630, 2873, 6232, 9575, 8034, -4265, -26959, -51321, -20833, -14237, -7621, -5040, 9955, 10964, 20886, 59571, 62246, 22487, 9523, 12540, -2334, -11157, -6989, 7571, 2804, -16870, -41595, -47312, -69535, -40633, -10018, 5606, 5665, 1499, -11689, -40559, -44775, -55386, -33038, 7561, 10309, -11627, -16190, -31847, -50510, -53100, -39205, -2210, -8812, -19191, -22537, 195, -4383, -6916, 15149, 18124, 1234, -33773, -57879, -51033, -32906, -19621, -5881, 5036, -5164, -680, 589, -458, 23241, 33083, 32205, 20521, 131, -11057, -13465, -30583, -38311, -34930, -22217, 5373, 21639, 19750, 15831, 5547, -1750, -17594, -7014, -4566, -13882, -4943, -13946]
5770a3946L3658Q577k0588j526K411P220M535n781J7257K246J143l8459j6675
5757a9928M873R117J7309K0549Q925j3987l2959j8771R882k1826j4092O240K0812
5744b3856J393J250j1892J9162J7578k9983q344j6509p088L5773Q020L3665R605
5731B8774k0474r437M111k9084j6333j3503J4925J3919J0203J8881j8612l7688
5719e4318k5078L666K9412J2056J1924K3456l608r348J8815j343J2232j586K3449
5706C9729J832j2847J828N994M878R397j6794R437l2550l4255r010L604K7q069
5692c6799j7960J890J8881L2824K7855m0262k1710J0410R111J0466N692j5000
5680a4602j5857k2409O857Q472J6747M1987k1569q936k0267l7985K0354Q436j0036
$$ y = [-13946, 19712, 28289, 7701, 6175, 8586, 15806, 20341, 14560, 31817, 34063, 35206, -3253, -19928, -15055, -5938, 11371, 31920, 40845, 26858, -6101, -24872, -14990, -36816, -50908, -44668, -23856, -22463, -21213, -33105, -13943, 3635, -26348, -34692, -51201, -58289, -22516, -14496, 19169, 28774, 8300, -1137, 2974, -26110, -42443, -55946, -41021, -27102, -16899, 1982, -16630, -54318, -79396, -75730, -46318, -34262, -22338, 1118, -2490, -11838, 6977, 5634, 17866, 16280, 39729, 41561, 28714, 30542, 36536, 41414, 50811, 34017, 43454, 10904, -23351, -32361, -28757, -28730, -36799, -54759, -52869, -33988, -1164, 26691, -13571, -35281, -24871, -15760, -5294, 398, -14602, -30459, -52868, -46011, -37539, -20792, 21195, -374, -9310, -29577, -67562, -47208, -38772, -48808]
5667d8808J3556n132J7102J725j7897M562K677J1436J049j1920j6089K3640J380
5654b2719l041k8329J0203J6242O184p003j780J6547L060j5017Q990j4496j0088
5641d1247J7293J2240o156k723q190R108n44J1805k0800k1385K2497L3917R788
5628A5603j3862q433M30J6380J4399j6233M906L4052K4617j0350j0348l6189j0967
5615D005j212j6039j7011J2495R233j1235k5246j6992M1895Q90j1374J4591L3580
5602A7580n30J5841j2799j1033j2709j8100N358L064P707O826P687l122N441K325
5588A3536l4298j4990j672J7113K1833m199l332J8076j53j1167N985j1717J0125
5575E140J0238N935R268K5854j632k1276j1605k6137j3341O825L818j0309q288
$$ y = [-48808, -35252, -40384, -23282, -21557, -39454, -34892, -32215, -20779, -19730, -31650, -47739, -24099, -22719, -25760, -54089, -43886, -27644, -21460, -28463, -30243, -13696, -10636, -25653, -16663, -31159, -41247, -23954, -11714, -17870, -20593, -28783, -19675, -20219, -8414, -29214, -50599, -28102, 5815, 15603, 1741, -6692, -6262, 10118, 24517, 8284, 13190, 47242, 71859, 61509, 51161, 14972, 4005, 2793, -13246, -30257, -17762, -8529, -19764, -45010, -62002, -20107, -19217, -30591, -16000, 17580, 17050, 32891, 20092, 9059, -3650, -21750, -16392, -13328, -5621, 1205, 8892, 5770, 11211, 13536, -20762, -35752, -37424, -20311, 1522, -2677, -6009, 12067, 11914, 747, 6732, -4985, 5140, 15378, 21313, 30581, 56435, 54803, 33527, 21922, -4215, -17556, -10731, -6913, -17222, -25510]
5562b5510j1825K4420K503j0218j91K4130J6495r732R272o854n982k0095j8147
5549c1734J8581J1538m666N134J850L475L685M933j0469k9816R053Q248j3596
5536b3784J0069J95Q825P349j8206J9452j96j9874j363k571k304J0840k0248L135
5522b8681K4581j3325j4680K6923J3714k412m840N97L04j9652M375k5253j0941
5509d9290L0088K3156r37j6739n733k745L888K4894K8990l213k4335o659J5982
5496A7347m096j0597k0697K045M4899J9541k9022j0329r748M489q191j692J2160
5483F109K8328k364l0074r821j5590O807k5749J5821J5952M318j0842J7178j2549
5470a2476k2259J7313J433j4030m73O983j6224M410K5869m044j3818P932j0223
$$ y = [-25510, -37335, -12915, -10412, -20630, -20821, 3309, 19804, 10072, 19344, 12490, 6508, -13587, -31734, -13153, -1615, -6281, -1147, 703, 4178, 7863, 12796, 2327, -27489, -18436, -10188, -23784, -13715, -13520, -4695, 2654, -15552, 3900, 3704, -16170, -17533, -20104, -22408, -11568, -31816, -28681, -4100, -17425, -32105, -5182, 8532, 6120, 1280, 1877, 2181, -17471, -13096, -38349, -49290, -19202, 3954, 3017, -13722, -19455, -22200, -18312, 6582, 35572, 32359, 8024, 1365, 17347, 13251, 2654, -18043, -15998, 28901, 48442, 19420, 9091, -657, 3832, -4359, -6051, 6109, 34437, 32073, 1999, -7822, -23412, -16605, -42354, -26533, -10581, -6263, -17105, 73, -12476, -34735, -17422, -15989, -30019, -30492, -23509, -39733, -35323, -9454, -13498, -27316, -19384, -29607]
5457b9607J1041Q332L646K6055J5863j4029r218n268M000q375m802K0843Q234
5444B6715j1043r595J0481r672K867o761j1989K1849K654k4256j1021J3016j0556
5431a7311q251p809J9123R628J0981P147k2945r135K2030K3639j0658J9307J7064
5418E2810k5344k0038k033j1167j8544k321K2187J4064M56m403p760L518K083
5405C508j1193J2699J8674j2070k3329j2798Q219J6187J7050j8737O963j0528
5393e355j4691r492N480J48K0603L2650R1j6758k75J0083J608m2265M934K2908
5379I669J0900L034r13J4099j7344j4618j2417k073J494j170P711l598j6417J328
5365b0315Q431n994l820R136k57K9276r308L053N23J0313k6295r543J1779L3180
$$ y = [-29607, -18566, -10234, -6588, 19467, 35330, 21301, 12083, 6815, 10815, 2440, -2362, 18481, 26715, 15672, 6077, 16558, 6886, 9753, 2992, -8997, 12852, 15506, -8750, -19771, -6755, -17311, -25562, -33371, -14248, -4620, 6361, 13508, -9437, -18572, 3458, 27097, 16439, 35746, 52810, 27466, 7428, 5395, -5772, -24316, -26637, -4450, 9614, 10070, 5667, -2093, 1425, 3508, -7685, 5014, 23688, 11618, -11711, -24509, -16290, -103, 16947, -1790, 5173, -5355, -20046, -29538, -24058, -23910, -3307, 29343, 29434, 12676, 12401, 22484, 24092, -18173, -13239, 9669, 20569, 23603, 22690, 36789, 19445, 4827, -7590, -9663, -8169, -9339, -1628, -5226, -21643, -20315, -11884, -17878, -21698, -12562, -12819, 16457, 7149, 10202, 10725, 21038, -5257, -14800, -3021, 30159]
5351C0159n066J5618l2223j9795N249J0526p872r627J5882J3848r24p167q559
5338D9j5982j9869k2727K2878J7159R275K9863R062m770n06j0568P344o114o682
5324H412J24K3003L834J5719J24k8140o446P675o037j5439j5030J1495J3486j7525
5310d745k8379J6966K0005J9018P416j2718J3143K4485J7977j1037l5898l5992
5298i759r759o227j2595K6065K0055r014p778J8763J3456k642q624K616J8793
5285C3350j2824j76j7429j7945k1391m741K2426o641K242l815K1277J2781j839
5272E275M628m3295j4596J9391J7197J537K7305j7101k6356N503K9488K2077l3432
5259b379j6901J616L769j0695k846r119L4210K3199L669k7239m18R440j2912Q731
$$ y = [30159, 25093, 40711, 8488, -11307, -6058, 4468, -3404, -13031, 2851, 16699, 15775, 8608, 49, -15933, -35802, -58529, -35651, -18492, -9217, 20646, 29708, 24938, 24432, 13864, 21208, 15094, 8412, 8536, 31539, 35373, 51092, 51216, 23076, 16630, 24305, 18268, 2829, -12201, -706, 12780, -4745, -33124, -16158, 3847, 22865, 30281, 17563, 30706, 55191, 73168, 62131, 26233, -9759, -19518, -25745, -38340, -12275, 7780, -1234, -9012, 9751, 23207, 20565, 11941, 14557, 33350, 20526, 20350, 2921, -15024, -36415, -41156, -18730, -25371, -23129, -26944, -5667, 7114, 5275, 9903, -33392, -47988, -28597, -11400, -9863, 17442, 341, -26015, -20512, 8976, 31053, -2379, -19280, -17664, -13895, -24590, -27436, -36555, -2345, 20854, 24523, -2716, -3134, 6306, -6606, 2125]
5245B125R746n248k7968J0471P708j1139K3103o574M452J359L2714N016l9624
5232F141k448J1209J1802k2751m974p961P002j1725p89l808k8066k5901K2683
5219d9586J7418J1467P812J2905o459O014j821N922m399j2110q454P664J8519
5206D892k397j6945j6916J7375L3754L118j9571m6270j774K8189J4290P220J3984
5193A8949Q979j1718K33J060J744j8837M92r341p575L95J8034n17r599o353k0079
5178c4133K0715J8068N016M260J283j0258l343j3348J7462j834o783N064L714
5165E883q926k2255n16J8945O174j6179R350O386J3902O734j0177j4311j0313
5152a5303j6182J3536K4192R162p071k3819R281J3214N340o159j2799J8221l270
$$ y = [2125, 11871, 6623, -21345, -10874, -3166, -14305, 8798, 2224, 6676, 8035, 40749, 45765, 6141, 3693, 14902, 26704, 3953, -1021, -8982, -1980, -13705, -14494, -18302, -46368, -72269, -49586, -32168, -20701, -12889, 16, -6443, -429, -2250, 3672, -727, -12837, -21291, -13627, 4892, 2495, -14450, -31366, -13991, 19763, 22881, 3310, -42960, -44734, -16545, -2255, 4965, 18949, 27928, 16210, 16443, 17503, 19247, 410, 902, -8439, -16014, -15619, 2415, 1898, -7701, -14054, -34133, -13418, 4650, 9666, 13926, 15209, 4951, 1608, -11740, 5722, 3888, -2895, 2169, 5883, -3043, -25298, -25814, -6869, -695, -16874, -7524, -1138, 12764, 19498, 9321, -4990, -15303, -31485, -17949, 6243, 15405, 8334, -15485, -6204, 7010, 12350, 6191, -6608, 11613, 8343]
5139H343n766l449J1596N0l1146l0167J5058J8793K2044j4395k2787K4284M1478
5126C3936j1512m2052O904j8613j802J0103m847m830M159K4151l189j5085k251
5113b4928j0491p633J8197m726j065K6901Q726J2590J1882k7814m4671j9193L7398
5100b4827L622j3894M660J0274q26n016j9764r37j2097O301K2219J082q619j3512
5086e1334j0016O608J4035K1188K0805j0613n780J0975j1384j4369M78r669r845
5073d8921P152L7678J4626l087p561l4354j2485J7041m369j407K579m100M6961
5060I753K8636O78J811k5573j3930k4350L481J3813J6138L22Q105O740j6470K3083
5046C2237j0175j780r025k341J2102J1809r666j707j5367M522K5863K7648j8882
$$ y = [8343, 2577, -872, 10724, 10774, -20372, -50539, -35481, -16688, 5356, -9039, -31826, -7542, 33936, 22424, -19628, -12724, -31337, -33139, -23036, -27883, -32713, -28554, -4403, -7592, -22677, -24928, -35419, -43052, -24855, -29581, -30646, -3745, 4981, 17571, 29453, 1639, -43032, -62225, -24827, -21205, -35099, -30439, -20165, -20991, -26007, -45771, -46708, -58805, -52504, -30285, -29203, -37822, -51334, -61350, -54742, -40707, -19519, 1286, -9327, -15107, -4132, -15516, -29885, -29407, -39076, -48921, -41769, -4091, 10535, 7448, -113, -34467, -46952, -29911, -34280, -35687, -33108, -37208, 9753, 38389, 39067, 40878, 15305, 1375, -22975, -19494, -5681, 10457, 10779, 18884, 25624, 9154, 32237, 22062, 20282, 11257, 8916, 21018, 32827, 23161, 21454, 6087, 10609, 36472, 64120, 45238]
5033D5238l5176j3596J6211K8632j6337k8093J0532M637J3271J3127j0809j6484
5021A1153m120k636k991P836l2152o507J6964L1477K8342j2286r493m2088k2655
5008c9156J8951J0163j0918n726o535j7458K2371J1125K6875m199m431l559P892
4995E395K0592J535J434o422K278l236j7711m224q190M858J731m950m953k4647
4981c6510J1032L2296J39l770L558l3839J142L0531l155r664J2938J3622j2251
4968F069j0495K1427J3803j8487j3554j298l8417j412K0813J3836K0594J3383
4956B6262j9482J1470m079r316K465J8955R734K4947j0168j7362k2206o355R44
4943E809L1K9147O787K603J1690j4292j2741l7275l1611K222P34J6629K3490J2333
$$ y = [45238, 10062, -3534, 12677, 41309, 24972, -3121, 7411, 12048, 25319, 38446, 27637, 11153, 7033, 4397, 1406, 9242, -22910, -29417, -12453, 19024, 47366, 35080, 25587, -16501, -39156, -20205, -10042, -20960, -26686, -33221, -50679, -28308, -17183, 9692, 5493, 1062, -2497, 5395, 25987, 27522, 28956, 22534, 24812, 21576, 3865, -359, -8549, -3691, -1960, -6910, -11863, -36510, -25478, 6818, 6957, 3187, 6745, -27094, -25952, 4579, 1424, -8240, 4698, 18320, 6069, -4426, 17001, 30804, 12317, -1237, -2535, -40952, -42364, -21551, -7715, 12879, 26262, 6780, 18250, 14171, 4855, 7320, 26275, 36009, 60956, 50788, 33426, 11220, 4865, 5809, 5840, 34987, 41774, 44377, 56067, 41775, 29034, -8241, -39852, -37630, -36896, -20267, 3223, 15556]
4929A5556k1583K1660J961l2375J5222J209Q642L696k6781m671J1245l1639N531
4916c2327K5734J3047N448k978P166L6532k160p170r014o665k9079j9161K3548
4903B921K9019k1539J703K225m601j1120K2769m460J039J9251j1236Q612O084
4890D0667J528j7721j0216l827j7977J1204J4267O260j5183K6501O860l6516j138
4877D709r384n168j807n68m831k472K0840J2233j3375l3070J992K7880J5917J6832
4863B9728k4589m0292o15r083M980J7577K8165M888l014j458M628J3920j335l3187
4849i687k0793J7558k1345q749N204J0527n267N224K9147n138l987M66m14J9660
4835A2406K6498N626M222Q138l2628j4091k661j9804j0707J4615P655J3227J4085
$$ y = [15556, -6027, 15633, 17594, -14781, 441, 1650, 10292, 13988, -12793, -17464, -6219, -37858, -32327, -6593, 6454, 11902, 8924, 16090, 52622, 50462, 43292, 34278, 27613, -1466, -20627, 2921, 31940, 10401, 12104, 14329, 9728, -1392, 21377, 16917, 17956, 37207, 25971, 34583, 40667, 42195, 24474, 14258, 10431, -7546, 3658, 17925, 24185, 9002, 35503, 42363, 5847, 4709, -4675, -9843, -11650, -12218, -17049, -19521, 1319, 13552, 177, -32893, -30901, -3021, 12896, 29728, 5139, -35153, -35768, -44851, -39871, -22294, 5871, 10759, 7745, 6287, 10915, 24835, 23500, -9687, -30480, -12922, -34267, -43016, -37812, -27285, -32552, -27328, 1819, -3319, -7306, -6840, -7254, 12406, 38904, 44530, 48752, 56890, 24262, 10171, 7510, -12294, -23001, -8386, -731, 12496, 26581]
4822B6581j1501k8432p466n247J3909l00j546P606j24k5837k6622m431r207J6789
4808e5828K0135P123K4553J4103J2494J9034J899k2198m6345q282J6536J4408
4796b368K0213J3574O82M723j4865k7222j82J1752r153O001o989P154k9168j7909
4782d3757m492K6142L8127Q923l4094k2959K0310J6296P398N398l2342j4034K3321
4769e763J0780j7845j8221J1804K873L6580M392k1211n152L453L2171j442p893
4756B4526j5709q396J349j8700J5576L1548l554k235j9317Q419n845m1160j2193
4743d5691j4950M487J6143q184j293j4110L264L9876L32j0711J4832j6387j8483
4730e0875Q756K4354J3367l193j245k5966R043K0963n995o877O553K0070q173
$$ y = [26581, 15080, -13352, -20818, -26065, -12156, -12456, -14002, -6396, -6520, -32357, -58979, -63410, -72617, -55828, -35693, -28570, -4017, 10086, 22580, 41614, 43513, 21315, -25030, -33312, -16776, -2368, 17845, 31419, 32101, 36824, 21959, -5263, -5445, 6307, -2846, 3155, -3834, 3320, -25848, -43757, -48249, -22107, 16020, 24943, -9151, -32110, -11800, 4496, 11894, 17292, -15050, -29084, -5763, 5017, -12828, -31049, -19245, -16372, 20208, 24600, 3389, -1763, 1690, 33861, 32419, 24526, 8817, 421, 1770, -16930, -1354, 30194, 26640, 24405, 5088, 13507, 7662, -33498, -45691, -60641, -56154, -40011, -48195, -49488, -63598, -60334, -20458, -20126, -30837, -16005, -32392, -50875, -42119, -17765, -4398, -7591, -8836, -34802, -25759, -4796, -10791, -17668, -11115, 8955, 782]
4717G82J120R99L970q644O506J6867j1646j6940j7154L5353j5305M547K0330j0495
4703A0290j1328K4431K1559k6963Q354q420k3751M505l505n742n729L057j3580
4690b6822l985J7159m367j7123K2216J8870k5873j958J6692q718n747K1822K0013
4677B2179j8050O276K6415j1564k8393l174P429N695j2727r478o924k2188Q673
4664c5831J4005k559L4631P43j7781M473Q177m602J7393j1429l1636O339J2913
4651e164k809J5118J5098J0273l7896j5377o559K7266K8659n326j5458R73M720
4638A3518M410j5884j6496j2371N852L0444J5662L72l0345k5094P490J3357K4265
4625A5180O34k6203k0796J2479j0257o528k29j196P973k552k5780M281J26P062
$$ y = [782, 1902, 2901, 6871, -1773, 4733, 21600, 9954, -6986, -24140, 11213, -4092, 455, 20785, 10290, -1038, 23393, 44952, 17989, 26343, 17923, -5828, -1323, -4828, -10570, -16299, -13242, -26822, -30807, -13648, -18015, -35138, -12922, 5948, -19925, -21883, -5191, -13909, -19656, 2166, 22179, 4129, 10405, 36820, 25256, -3137, -6311, 1118, 6813, -5914, -15392, -22316, -44504, -35831, -21826, -24385, 10246, 10989, -6792, -2319, 5858, 1256, 18649, 7220, -24416, -18077, -5164, -7973, 7145, 22243, 32516, -5380, -20757, -27316, -50, 28609, 23283, 7825, 8798, 13518, 17928, 2044, -14452, -26823, -20971, 9473, 25135, 25507, -4838, -29932, -22442, -9085, 15180, 15814, -10389, -31185, -18706, -28963, -35491, -35720, -36916, -28943, -31495, -57275, -52994, -52868, -45806]
4611d5806o076K5785M1952j1403k5912o93J402N645j8012L177J2686Q634J7122
4598H501n553k7225M1446J4005r103j6912o046L742j88j2101M514n084J834J0887
4584B717k415N619r115L1443m827j6036J4422L089j6438k344o959j6715J8519
4571I60J7882P139k5607p722J7707L129J4575r55l851P763P541j7548j4672J055
$$ y = [-45806, -51882, -26097, 15855, 4452, -21460, -22153, -20751, -15106, -33118, -29941, -17255, -8621, 8501, 2948, -24277, 17169, 31174, 22071, 5159, -887, 2855, 2667, -9434, -4920, -10004, -8170, 2717, 302, 5921, -3194, 28249, 23422, 7386, 21808, 24897, 8459, 6115, -844, -17559, 960, 18842, 25981, 374, -7348, 10359, 13488, 28063, 27108, 23257, 31020, 38561, 21013, 6341, 7396]
$$ [...]
##END NTUPLES=NMR SPECTRUM
##END=
