##TITLE=Analysis number 314094
Compound Code cc 40302
Book Reference 382/124/1
Project Code adrs
Chemist Name simons
+insolubles
##JCAMPDX= 6.0         $$ Bruker NMR JCAMP-DX V2.0
##DATA TYPE= NMR SPECTRUM
##DATA CLASS= NTUPLES
##ORIGIN= Bruker BioSpin GmbH
##OWNER= NMR
$$ XWIN-NMR		Version 3.5
$$ Wed Oct  5 13:14:54 2005 GMT Daylight Time (UT+1h)  MAYBRIDGE\NMR@NMR_250MHZ
##.OBSERVE FREQUENCY= 250.131544655141
##.OBSERVE NUCLEUS= ^1H
##.ACQUISITION MODE= SIMULTANEOUS (DQD)
##.ACQUISITION SCHEME= undefined
##.AVERAGES= 16
##.DIGITISER RES= 18
##SPECTROMETER/DATA SYSTEM= dpx250
##.PULSE SEQUENCE= zg30
##.SOLVENT NAME= CDCl3
##.SHIFT REFERENCE= (INTERNAL, CDCl3, 0, 16.522)
##AUDIT TRAIL= $$ (NUMBER, WHEN, WHO, WHERE, WHAT)
$$ ##TITLE= Audit trail, XWIN-NMR		Version 3.5
$$ ##JCAMPDX= 5.01
$$ ##ORIGIN= Bruker BioSpin GmbH
$$ ##OWNER= NMR
$$ C:\u/data/dgb/nmr/ADRS/10460/pdata/1/auditp.txt
$$ ##AUDIT TRAIL=  $$ (NUMBER, WHEN, WHO, WHERE, WHAT)
(   1,<2005-10-05 13:14:36.93 +100>,<MAYBRIDGE\NMR>,<NMR_250MHZ>,
      <created by zg, POWCHK disabled, PULCHK disabled
       configuration hash MD5:
       62 19 C7 07 E1 42 D1 B7 37 6C 3D D0 77 39 F9 E6
       data hash MD5: 64K
       B4 11 3E 47 F0 50 89 D3 55 9C 92 31 66 E5 60 F5>)
(   2,<2005-10-05 13:14:47.73 +100>,<MAYBRIDGE\NMR>,<NMR_250MHZ>,
      <Start of raw data processing
       ef LB = 0.3 FT_mod = 6 PKNL = 1 SI = 32K 
       data hash MD5: 32K
       7B 1E FD 9A 90 1F 7B 9A D6 30 06 19 BA A1 8D AC>)
(   3,<2005-10-05 13:14:49.55 +100>,<MAYBRIDGE\NMR>,<NMR_250MHZ>,
      <apk 
       data hash MD5: 32K
       67 55 57 6D 0A D7 EA 0B 4F 42 5E 40 88 B3 0D F4>)
(   4,<2005-10-05 13:14:50.23 +100>,<MAYBRIDGE\NMR>,<NMR_250MHZ>,
      <abs ABSG = 5 
       data hash MD5: 32K
       01 E7 97 01 72 E4 39 14 4E 95 8D 46 4B EB 32 7C>)
$$ ##END=
$$ 
$$ hash MD5
$$ 10 C7 EE 0E B6 70 C2 45 67 2F F8 51 BA FB 35 FD
##$RELAX= 
##$RELAX= 
##$RELAX= 
##$RELAX= 
##$RELAX= 
##$RELAX= 
##$RELAX= 
$$ Bruker specific parameters
$$ --------------------------
##$DU= <C:\u>
##$EXPNO= 10460
##$NAME= <ADRS>
##$PROCNO= 1
##$TYPE= <nmr>
##$USER= <dgb>
##$AMP= (0..31)
100 100 100 100 100 100 100 100 100 100 100 100 100 100 100 100 100 100 
100 100 100 100 100 100 100 100 100 100 100 100 100 100 
##$AQSEQ= 0
##$AQ_mod= 3
##$AUNM= <au_zg>
##$AUTOPOS= <30 >
##$BF1= 250.13
##$BF2= 250.13
##$BF3= 250.13
##$BF4= 250.13
##$BF5= 500.13
##$BF6= 500.13
##$BF7= 500.13
##$BF8= 500.13
##$BYTORDA= 1
##$CFDGTYP= 0
##$CFRGTYP= 5
##$CHEMSTR= <none>
##$CNST= (0..31)
1 1 145 1 1 1 1 1 1 1 1 1 1 1 1 1 1 1 1 1 1 1 1 1 1 1 1 1 1 1 1 1 
##$CPDPRG= <>
##$CPDPRG1= <>
##$CPDPRG2= <>
##$CPDPRG3= <>
##$CPDPRG4= <mlev>
##$CPDPRG5= <mlev>
##$CPDPRG6= <mlev>
##$CPDPRG7= <mlev>
##$CPDPRG8= <mlev>
##$CPDPRGB= <>
##$CPDPRGT= <>
##$D= (0..31)
0 1 0 0 0 0 0 0 0 0.06 0 0 0 0 0 0 0.0002 0 0 0 0 0 0 0 0 0 0 0 0 0 0 
0 
##$DATE= 1128514475
##$DBL= (0..7)
120 120 120 120 120 120 120 120 
##$DBP= (0..7)
150 150 150 150 150 150 150 150 
##$DBP07= 0
##$DBPNAM0= <>
$$ [...]
##$SUBNAM7= <"">
##$SUBNAM8= <"">
##$SUBNAM9= <"">
##$SW= 20.6930455092707
##$SWIBOX= (0..15)
0 0 3 0 0 0 0 0 0 0 0 0 0 0 0 0 
##$SW_h= 5175.983436853
##$TD= 65536
##$TD0= 1
##$TE= 295.16
##$TE2= 300
##$TE3= 300
##$TEG= 300
##$TL= (0..7)
0 120 120 120 120 120 120 120 
##$TP= (0..7)
150 150 150 150 150 150 150 150 
##$TP07= 0
##$TPNAME0= <>
##$TPNAME1= <>
##$TPNAME2= <>
##$TPNAME3= <>
##$TPNAME4= <>
##$TPNAME5= <>
##$TPNAME6= <>
##$TPNAME7= <>
##$TPOAL= (0..7)
0.5 0.5 0.5 0.5 0.5 0.5 0.5 0.5 
##$TPOFFS= (0..7)
0 0 0 0 0 0 0 0 
##$TUNHIN= 0
##$TUNHOUT= 0
##$TUNXOUT= 0
##$USERA1= <user>
##$USERA2= <user>
##$USERA3= <user>
##$USERA4= <user>
##$USERA5= <user>
##$V9= 5
##$VALIST= <valist>
##$VCLIST= <CCCCCCCCCCCCCCC>
##$VD= 0
##$VDLIST= <DDDDDDDDDDDDDDD>
##$VPLIST= <PPPPPPPPPPPPPPP>
##$VTLIST= <TTTTTTTTTTTTTTT>
##$WBST= 1024
##$WBSW= 4
##$XGAIN= (0..3)
0 0 0 0 
##$XL= 0
##$YL= 0
##$YMAX_a= 352132
##$YMIN_a= -272622
##$ZGOPTNS= <>
##$ZL1= 120
##$ZL2= 120
##$ZL3= 120
##$ZL4= 120
##$ABSF1= 16.522
##$ABSF2= -4.171173
##$ABSG= 5
##$ABSL= 3
##$ALPHA= 0
##$AQORDER= 0
##$ASSFAC= 0
##$ASSFACI= 0
##$ASSFACX= 0
##$ASSWID= 0
##$AUNMP= <proc_1d>
##$AZFE= 0.1
##$AZFW= 0.1
##$BCFW= 0
##$BC_mod= 0
##$BYTORDP= 0
##$COROFFS= 0
##$CY= 12.5
##$DATMOD= 1
##$DC= 0
##$DFILT= <>
##$DTYPP= 0
##$F1P= 14.0000005364418
##$F2P= -0.99999901652339
##$FCOR= 0.5
##$FTSIZE= 32768
##$FT_mod= 6
##$GAMMA= 0
##$GB= 0
##$INTBC= 1
##$INTSCL= 1
##$ISEN= 128
##$LB= 0.3
##$LEV0= 0
##$LPBIN= 0
##$MAXI= 10000
##$MC2= 0
##$MEAN= 0
##$ME_mod= 0
##$MI= 0
##$NCOEF= 0
##$NC_proc= -3
##$NLEV= 6
##$NOISF1= 0
##$NOISF2= 0
##$NSP= 0
##$NTH_PI= 0
##$NZP= 0
##$OFFSET= 16.522
##$PC= 1
##$PHC0= -53.26066
##$PHC1= 9.659883
##$PH_mod= 1
##$PKNL= yes
##$PPARMOD= 0
##$PSCAL= 4
##$PSIGN= 0
##$REVERSE= no
##$SF= 250.13
##$SI= 32768
##$SIGF1= 0
##$SIGF2= 0
##$SINO= 400
##$SIOLD= 32768
##$SREGLST= <1H.CDCl3>
##$SSB= 0
##$STSI= 32768
##$STSR= 0
##$SW_p= 5175.98343685301
##$SYMM= 0
##$S_DEV= 0
##$TDeff= 65536
##$TDoff= 0
##$TI= <Analysis number 999999
Compound Code 99
Book Reference 9
Project Code 9>
##$TILT= no
##$TM1= 0
##$TM2= 0
##$TOPLEV= 0
##$USERP1= <user>
##$USERP2= <user>
##$USERP3= <user>
##$USERP4= <user>
##$USERP5= <user>
##$WDW= 1
##$XDIM= 32768
##$YMAX_p= 482570665
##$YMIN_p= -169858
$$ End of Bruker specific parameters
$$ ---------------------------------
##NTUPLES= NMR SPECTRUM
##VAR_NAME=  FREQUENCY,     SPECTRUM/REAL,   SPECTRUM/IMAG
##SYMBOL=    X,             R,               I
##VAR_TYPE=  INDEPENDENT,   DEPENDENT,       DEPENDENT
##VAR_FORM=  AFFN,          ASDF,            ASDF
##VAR_DIM=   32768,         32768,           32768
##UNITS=     HZ,            ARBITRARY UNITS, ARBITRARY UNITS
##FACTOR=    0.157963299565203, 1,           1
##FIRST=     4132.6476996994, 0,             0
##LAST=      -1043.33573715361, 0,           0
##MIN=       -1043.33573715361, -169858,     0
##MAX=       4132.6476996994, 482570665,     0
$$ Real data points
##PAGE= N=1
##DATA TABLE= (X++(R..R)), XYDATA
$$ [...]
17018B3815R498p028l6774j1071N455j7826l1942Q047J6876J5716K916o669j7129
17005d6116k3774J6507L9318K5363k4344n1630p723K1181K9162L757N690l7512
16993e0121K1273L0914m1505K9354m107l1733M491j3814j1986J6599M5094J8620
16981A3079l656j7949J722m9415N789L16k4281j1722j725J6909K3753K5719L2874
16968A1413P760l4748r210K5030J0133n1502m4774O481N7518L0572P4K4397L5820
16955F8964m6584k8066L1268m083k1502j5031j6140r556k1274K9851k8571j3117
16943g3841N5435J3604l5589p003Q941J8706L5275k9714j6228j88k8729q618M2971
16930b4978l923k9278L9743j175j1583j7598j5629R881N007j4587K5405N8532
$$ y = [23815, 33313, 26285, -10489, -21560, -16105, -33931, -65873, -57826, -40950, -25234, -22318, -28987, -46116, -69890, -53383, -14065, 11298, -13046, -64676, -72399, -51218, -22056, -18299, -12609, -50121, -28848, 2066, -39439, -10085, -14192, -45925, -41434, -55248, -67234, -50635, -5541, 13079, 9423, -8526, -6804, -56219, -50430, -50114, -74395, -86117, -87842, -70933, -47180, -21461, 11413, 19173, -15575, -24785, 245, 10378, -41124, -85898, -79417, -21899, 8673, 8747, 33144, 68964, 22380, -5686, 25582, 21499, -3, -15034, -31174, -40730, -62004, -32153, -60724, -73841, -18406, -4802, -40391, -47394, -38453, -19747, 15528, -14186, -30414, -30602, -59331, -67949, -24978, -28901, -58179, -18436, -19611, -31194, -48792, -64421, -54540, -49533, -64120, -38715, 19817]
16918A9817K7605J301k2594k1702j0571L764j6444n915J2192L6339m5495l4662
16906e6365J539J9883K4151L4953n540P641J355k7769O1229J8678j7593j6975
16894D5187k1058n5353j986n742M698J2810n358j9819K5732Q387M841q866N0036
16881C3509j7953k7095N399l5968j3433O637L598m058K1431K5953j0567r165J1801
16868i911K2784Q371k9518j5125q396m0429n7318J1843M3476M4466K3578L444
16856b735n6304P848N675K185l6363N298M0960J3204j4012l3096k545J8870M3249
16843g766K0647J8238J2818O449j9479M984j8555J6902M829j2805l5681L727L1974
16830B6282q230k1060k9513l649L3148J7847O7294k114l3370j886l4365r128M0670
$$ y = [19817, 47422, 48723, 26129, 4427, -6144, -2380, -18824, -24739, -12547, 23792, -21703, -56365, -54826, -34943, -10792, 24161, 18621, 26262, 27617, -152, 61077, 79755, 62162, 45187, 24129, -31224, -33210, -38952, -34254, -21444, -26802, -46621, -20889, -12502, -7661, -16527, 33509, 15556, -11539, -6140, -42108, -55541, -48904, -45306, -49364, -27933, -1980, -12547, -21712, -9911, 12873, 21244, -8274, -23399, -31795, -72224, -129542, -117699, -74223, -29757, -6179, -2735, -59039, -51191, -45516, -43331, -79694, -74396, -33436, -20232, -34244, -67340, -69885, -51015, -7766, 12881, 31119, 43937, 50386, 30907, 35891, 17336, 34238, 39067, 26262, -9419, -5692, 26282, 18052, -3008, -32521, -36170, -3022, 14825, 82119, 80005, 46635, 44749, 10384, 1256, 41926]
16817D1926q317r926j3076J8494J9397j2206j3887n270l860o704j5233l884q911
16804b1457K5344L1355k4788j9178Q235J3640j2672j012O718k0066J9403p000
16792a478j2115k2372k1085J5694L9494L4090j1134K2813j1268k0680n8139k0352
16780f6532K5312R434k0943j275k8232m505k621N5879M4408j9896L9561j4298
16768A6292l163p22K5466k487m4233k9310m832J9745K6572j822l1215k6862J3661
16755d2910K0937M448j2889K9365M780j2809K0686j6866N703K901L2012J6132
16743E1490L06k3395k3578k6516k063k2184O819J2751K0636o096J6417n998j1383
16730a2794L2018J9039l0602l7994L9696N716l5304J784K618O442j3573L0860
$$ y = [41926, 33609, 23683, 10607, 29101, 48498, 36292, 22405, 17135, 13275, 6571, -8662, -12546, -21457, 3887, 35242, 10454, -8724, -489, 13151, 479, -533, 6185, -13881, 5522, -1478, -13593, -35965, -57050, -41356, -1862, 32228, 21094, 43907, 32639, 11959, -46180, -66532, -41220, -31786, -52729, -54004, -82236, -86741, -89362, -33483, 10925, -8971, 30590, 16292, 13129, 12407, 37873, 35386, -8847, -38157, -42989, -23244, 3328, 1506, -29709, -56571, -42910, -21973, -17525, -30414, -1049, 3731, -9078, 11608, -5258, 445, 3346, 35358, 51490, 51796, 28401, 4823, -21693, -23756, -45940, -39121, -26370, -5734, -11830, 4587, -1411, -12794, 19224, 38263, 7661, -30333, 9363, 15079, -20225, -18441, -15823, -9381, -22954, 7906]
16718G906k2933K3877k6695j4799m5705K8833M7063k2283q415j8713q064N405
16706e4523L9542J8412l4359k9366l9941M0864P3010P465J1509n621J8117N607
16694E0716l6664j7639j1314L2035k1348m77J8530K8095j6786l5426j3048j3913
16682c7239j5888K3237K9387j8164N847r424k5921K8599K646q688K2225N265m5862
16669d3980l5065l9211j438J0161j1249J9088k6146M3623N3674J3891j7573k1167
16657e5392J5090Q609J6556K8409K187k6651j5205J3149K6318R944r394K7910
16645D1530n0907o1335J7566M671K5471K535J4369m51j7421n738k6760j5659l6233
16632a08362k9452J3248K3322M1825O940l5413J5673M9990O4060J2123l0600Q275
$$ y = [7906, -15027, 8850, -17845, -32644, -78349, -49516, -2453, -24736, -33151, -51864, -59928, -54523, -14981, 3431, -30928, -60294, -100235, -59371, 13639, 21104, 32613, 26992, 45109, 50716, 14052, -3587, -14901, 17134, -4214, -4691, 13839, 41934, 25148, -10278, -23326, -37239, -53127, -29890, -503, -18667, -12820, -22244, -48165, -19566, -16920, -25608, -3383, 1882, -43980, -79045, -118256, -119694, -109533, -120782, -101694, -127840, -84217, -30543, -16652, -34225, -55392, -40302, -31693, -15137, 13272, 15459, -11192, -26397, -13248, 13070, 23014, 13620, 41530, -9377, -70712, -53146, -48475, -23004, -20469, -6100, -6551, -23972, -29710, -56470, -72129, -108362, -137814, -124566, -101244, -59419, -52479, -87892, -72219, -22229, 41831, 53954, 23354, 31629]
16620C1629K6103l4400m5490j3086r264K3620P44K1361K0299l383l8007J2100
16608g774O5560q696j7383P178k4715M1152l8261n0626l7677O421L5969N8816
16596B9964j4586j2012j239N447k6696k4011l0672L0920R898j0910R066L8403
16584C572O1242K240o123j0696l1507k6419K4170j0241J1920k405m0742k0220
16572d5209K7015J6906l1386q564M4583N855m93k374P26o178L8602R703j7638
16559C1548O553r846k3657j5391J8554J1245k3185L0163L671P00k1724k6109l6673
16546e4151j5309J4371j1779K9164N1817o713l1438J0958K0622O345m411m551
16534D925k496j1135l7937l1792k7175n928j3541M6282L7024J093L5010j0153
$$ y = [31629, 57732, 23332, -22158, -35244, -44508, -20888, -20144, 1217, 21516, 18133, -19874, -7774, 57786, 49090, 31707, 38885, 14170, 55322, 17061, -33565, -71242, -64821, -28852, 29964, 15378, 3366, 2127, 7574, -19122, -43133, -73805, -42885, -32987, -43897, -34831, 3572, 64814, 67054, 60931, 50235, 18728, -7691, 16479, 6238, 18158, 15753, -24989, -45209, -18194, -1288, -32674, -41238, 3345, 9200, 8707, 6333, 7059, 881, 39483, 49186, 31548, 38101, 28255, 4598, -10793, 7761, 19006, -4179, 25984, 29655, 30355, 8631, -17478, -54151, -69460, -55089, -66868, -37704, 14113, 7400, -24038, -13080, 7542, 13887, 9476, 4925, 2429, -8706, -46643, -78435, -105610, -111538, -125079, -78797, -41773, -40680, -5670, -15823]
16522a5823m7205j356N568L471M1189N090J5707K288N0470J4082k5668n4501k4253
16509c0941k8846l940j5168J7842N7716k7488K9178L6373l0427l6191m1903l5278
16497a09073L9008O2458o076j3788K8677j5146l4923j5726O294J3128j3509K5970
16485c2706M4239J6749l6369j181j0678M4445L688M806j2249l8587L992L1601
16473A7750o994N753J277j5641K4293J7730K8035n1795n9332k6577K8636L6289
16461e76K2193M3821n01k7069k2996m3030j2709K5292J6584J4417O30l5060J7011
16448a993L4797q43n1448j0592r346m2517J0311P1520k0886J5173K2182k188J0939
16435B5109n444M723j3089l694J2734J0061k6579j5167l613K6914N8231l6293
$$ y = [-15823, -63028, -64384, -58816, -55345, -14156, -9066, 6641, 8929, 59399, 73481, 47813, -6688, -30941, -59787, -63727, -78895, -61053, -3337, -30825, -1647, 34726, 4299, -31892, -73795, -109073, -70065, -7607, -13683, -27471, 1206, -13940, -48863, -64589, -58295, -45167, -58676, -32706, 11533, 28282, -8087, -9268, -19946, 24499, 28187, 32993, 20744, -17843, -13851, 17750, 10756, 16509, 17786, 2145, 26438, 44168, 72203, 20408, -38924, -65501, -36865, -576, 21617, 65438, 64937, 37868, 14872, -28158, -40867, -15575, 1009, 15426, 16056, -19004, -1993, 32804, 31961, -19487, -30079, -39425, -81942, -71631, -111, -20997, -5824, 16358, 14170, 25109, 19665, 24388, 11299, 7605, 20339, 30400, 3821, -11346, -14959, 11955, 70186, 33893]
16423C3893m948m9409j9364N8739K536p369l3054L9378M3314k343k5337j1628
16411B4408O331m8987q148j3852K8527L0551k5598j7399J3431J8839L1782k9039
16399A0846m6160L4725j1490l879M8567J5241J1637l1404j6741q931Q633K083
16387A3127m5599l669J126j5582j4L5551R400k7496p224K6949J9603j6141p608
16374a7577K0197M8384k836k4092l4473J5431N4107J789m3798n670J5512J9637
16362D6611P091j4152j6427k2260qK671n2302J3805j2514N413K4471L0238j8397
16349e760l8337L0559K2518M9488J0716k492M276r758l4008m0157k3919k207K0362
16336a8719J6766J177k908j2650k2678J5191j7500k8303J4945J115J2950p722
$$ y = [33893, 28945, -20464, -39828, 18911, 21447, 14078, -18976, 20402, 63716, 61373, 36036, 24408, 30739, -18248, -26396, -40248, -11721, 18830, -6768, -24167, -10736, 8103, 39885, 10846, -35314, -589, -12079, -15958, 32609, 47850, 59487, 28083, 11342, 2411, 11044, 13127, -32472, -36141, -35015, -50597, -50611, -15060, -5660, -33156, -40380, -13431, 6172, -9969, -17577, 2620, 51004, 48168, 24076, -10397, 5034, 59141, 60930, 17132, 11462, 26974, 46611, 53702, 39550, 23123, 863, 855, 3526, -48776, -34971, -47485, -42072, -17601, 12637, -5760, -44097, -13538, 8980, 58468, 69184, 66692, 70968, 61210, 27202, -12955, -36874, -39081, -18719, -1953, -776, -3684, -16334, -39012, -23821, -41321, -69624, -54679, -53564, -40614, -48336]
16324d8336j7327k3298K5412O7441K5281N480j4789l843k0199k2247J9174K66
16312f985Q089J9162j6016J8611k3943l7281n958J1475R777k6813k853R308J4337
16299b9090n125J0975K4192q799l2416L5357K0311j061k4577l4514l4124L1434
16287d7437N1257K1235j3529J6947K461l6517j5587k1758l4127k0091J7229L7928
16275d1989O129L0188r794j7404K1338j77J5417K1404J9607j0579k7686M552K9254
16262D0260J3309J8999K3116R566k7018o2951j0861J9169l3868n9812M442k4120
16250h9769J2716L3747J3292k3466K2503O530L9817k8317l4053j0245k1346q361
16238h6952J1916J3530j3624K6876L5463K7555K9412l2716l3165P550Q394J6702
$$ y = [-48336, -65663, -88961, -63549, 3892, 29173, 34653, 19864, 16021, -4178, -26425, -7251, -6985, 1104, 20266, 4250, 22861, -1082, -38363, -44321, -32846, -23069, -49882, -52735, -43427, -29090, -34215, -23240, 952, -7847, -40263, -4906, 15405, 14344, -10233, -44747, -78871, -47437, 3820, 25055, 11526, 28473, 30934, -5583, -21170, -42928, -77055, -97146, -79917, -41989, -35860, -5672, -15466, -32870, -11532, -11709, 3708, 25112, 44719, 34140, 6454, 11006, 40260, 53569, 72568, 95684, 105250, 78232, 15281, 4420, 23589, -10279, -70091, -65649, -89769, -77053, -43306, -30014, -53480, -30977, -24447, 15370, -12947, -47000, -57245, -78591, -86952, -75036, -61506, -75130, -48254, -12791, 14764, 44176, 11460, -21705, -14155, -5761, 10941]
16226A0941N167j1588j7664R081R975K7561k0318o708J1037N1625J6839p589k2761
16213E5598k0895k8302k0379P325N664O55m1357p3192j4860J5011K6431J6063
16201g2238O2551N7085j7887o0718k3608K6061k798k8908k9092k4788J2050M0513
16189f1777L6584J7530L0817K1786l5102m2367K5807j9168j7114M5255O068l513
16177D806l4592N514M9479L0481m4776p7066K414M5251N5974j9895j0534J4318
16165B1374J3870P377j1508J2233k5022k0219m505r6m102L996j538J8038L7418
16152D7316o726j5218k7763k1052n0481L5464J2490R19j8374M8263K1954k6608
16140A84n4812l4266M3202O20j2940J8103j2066O838k1821r173K6737N9153m232
$$ y = [10941, 16108, 4520, -13144, -4063, 5912, 33473, 13155, 6447, 17484, 69109, 85948, 78359, 55598, 34703, 6401, -13978, -6653, -989, -334, -41691, -114883, -129743, -114732, -88301, -72238, -9687, 47398, 29511, -31207, -54815, -28754, -31552, -60460, -89552, -114340, -102290, -61777, -25193, -7663, 23154, 44940, 9838, -32529, -6722, -25890, -43004, 2251, 8319, 4806, -29786, -24272, 25207, 55688, 10912, -66154, -63740, -18489, 37485, 17590, 7056, 21374, 35244, 42621, 31113, 43346, 18324, -1895, -6400, -6496, -10598, -6602, -8140, 9898, 47316, 40590, 25372, -2391, -23443, -73924, -38460, -25970, -25051, -43425, 4838, 26792, 184, -54628, -88894, -45692, -45072, -58012, -39909, -51975, -45137, -66958, -76131, -49394, 9759, 5527]
16127E527o625O5702k526k4601m1816j7874K9402N8462l108n6405k5059l278K1909
16114b90k7540j3406m774L4212J5640l1671n6821M2430M160l4239J0750R394n75
16101e2730L3388l2914k2311M661J3679N7698L1125K0362l516N808O468r717l0352
16088B1649j0881l357k4022l6360m875j3946J5330L3976O254J3374M0330p537
16076B9935j8530O732j5628K056Q050m0058j1844M4734K2226M618K6730J6215
16064G5236j1305j7725j3261J7489J1828n543k8174q7162p421J7490J2957N1743
16052A6152p584l0829j5284J6975L6567K5244n0092l7979L20N9717L088J5227
16040C1522K7620p38o0626o440J1784K5829j2064L638j649J01m1870j1689K515
$$ y = [5527, -1098, 64604, 62078, 37477, -4339, -22213, 7189, 65651, 62543, 6138, -18921, -22199, -290, -27830, -41236, -46010, -11798, 3842, -27829, -84650, -42220, -38060, -72299, -61549, -52155, -52730, -19342, -52256, -74567, -69906, -56227, 1471, 32596, 52958, 49442, 55250, 61718, 52001, 21649, 10768, 7411, -16611, -52971, -57846, -71792, -56462, -22486, -16232, -2858, 37472, 29935, 11405, 18137, 2509, 4565, 12615, -27443, -39287, 5447, 27673, 32291, 59021, 75236, 63931, 46206, 32945, 50434, 62262, 56719, 28545, -58617, -66038, -48548, -35591, 16152, 8568, -22261, -37545, -20570, 15997, 41241, -8851, -46830, -46510, 13207, 16295, 31522, 59142, 58404, -2222, -8662, 3122, 28951, 16887, 20525, 18876, 18977, -22893, -34582, -32067]
16027c2067Q365l1321j794K4326J2029J322r328j8112j2724o859L6221M7056p3594
16014e6480j7186L0014L653K7393M3427l678m1334j9992p375M8534J9845m046
16002B2775l0940j3896n2796k1750J7813Q775M4502N526j9278J1087J1860r381
15990b5703k7339M3671N0759k2034o3963k4469M7587O5686k2411k5832J4568j7989
15978g469j7225Q192J5549k8158r747K6977j2284M6975K1128j535k9761m1414
15966b8772N4569K0051m3103J1531J4476J6429L184M2993k472l741k5134K0344
15954H0355q658k9916q287l0287m8126l207K4058J9668K384J521L6722j7532k0522
15941a827K5106l3029k1056K8988M9069j654j4971m7034j5950P9434J996K566
$$ y = [-32067, -23702, -55023, -56817, -32491, -20462, -19140, -28468, -46580, -59304, -66163, -29942, 17114, -56480, -73666, -43652, -39999, -12606, 30821, 27143, -14191, -34183, -41558, 6976, 26821, 22775, -8165, -22061, -74857, -96607, -78794, -70019, -25517, -19991, -39269, -28182, -16322, -25703, -53042, -9371, 41388, 19354, -44609, -69078, -21491, 44195, 21784, -4048, 10520, -7469, -24694, -16502, -953, -29111, -38858, -11881, -24165, 22810, 43938, 42403, 12642, -28772, 25797, 45848, 2745, 14276, 28752, 45181, 48365, 91358, 88886, 85145, 60011, 80355, 71697, 41781, 33494, 3207, -44919, -48126, -24068, -4400, -2016, -495, 36227, 18695, -1827, 23279, -9750, -30806, -1818, 47251, 45597, 30626, -16408, -32358, 47076, 49072, 51638]
15929E1638K468K5744k275l0334k6027M073k022N6q234q965o3068k3507L8186
15916d2267K7791Q279J4095J2730j0060k0145J8054K7792l6924m2992L1114L465
15904i068k3895K5217L2193K700j3310Q92L4566j796l9633J39R47M3241M7091
15891I9284o850l6977r568m9362j0683j3112m062L3393J3166j7319j4004J1967
15879d127O4833J9252j1322J1142J4728n8303n9445n471O895L2837n546k6696
15867b1223J0011L8600L6110m5993j7631J788j8107J0930K7741q344j6244J2105
15855I743j5372K2042K516j8766j279k1244Q297K2571L4182J6873O459n616m7686
15842A2720p873K34l339M0356M1782k277P457l7714j4359J7384J7457L0795l101
$$ y = [51638, 54106, 79850, 77575, 47241, 21214, 25287, 23265, 23321, 15087, 6122, -56946, -80453, -42267, -14476, -6197, 7898, 20628, 10568, -9577, 8477, 36269, -655, -43647, -12533, -9068, -32963, -7746, 24447, 27147, 13837, 14729, 49295, 47499, 7866, 8005, 8952, 52193, 99284, 92434, 55457, 45889, -3473, -14156, -27268, -31330, 2063, 15229, -2090, -16094, -4127, 60706, 79958, 68636, 79778, 94506, 36203, -23242, -28713, -21818, 11019, 5473, -21223, -11212, 27388, 63498, 17505, -126, 1662, -16445, -5515, 22226, 13882, -2362, 9743, -5629, 16413, 18929, 163, -1116, -22360, -14063, 8508, 42690, 59563, 66022, 60406, 12720, 4847, 5081, 1742, 42098, 83880, 81603, 89060, 51346, 36987, 54371, 71828, 102623, 99522]
15829I9522m2474m1636k826k0766J5752L8542J9526k1402l912l061k8514q952
15817b01J8339j0981k3634o62j7825m9448l9358M5435P4813K4951J2561k8327
15805E663l0272L257K910J7357L4484o418Q290q637m8136k7961j643L3112O9117
15792E1123r281j8481o281p965J4621r608K0696n355n0791l3626L4439J9525K5252
15779B4268K2098j408j0462p541J0273L0703p614j94Q136P152l4618J9902J853
15766F2548q2494j1819p648J0016N2716n15j4189k5089m1050j4054o694L0068
15754d8204O1186O805p577L0157L4388L119K4328j263m9314m4220j3918J4378
15742I865K271K6666j0278n2895j0519J425K4960o655j2699P076K4735J403R451
$$ y = [99522, 57048, 15412, 12586, -8180, 7572, 46114, 65640, 44238, 40326, 37265, 8751, -201, 18138, 7157, -16477, -17139, -34964, -84412, -123770, -78335, -3522, 21429, 33990, 5663, -24609, -21352, -18442, -1085, 33399, 26981, 35271, 26634, -21502, -49463, -51106, -17994, 51123, 41842, 23361, 17080, 9115, 23736, 14128, 34824, 29469, -21322, -54948, -20509, -984, 24268, 46366, 44958, 34496, 26955, 37228, 67931, 60317, 60123, 68259, 75411, 40793, 60695, 62548, -19946, -31765, -39413, -29397, 23319, 22804, 8615, -16474, -57524, -71578, -78272, -48204, 12982, 19787, 12210, 42367, 76755, 79874, 104202, 102939, 53625, 9405, -4513, 9865, 12136, 38802, 28524, -24371, -34890, -33465, -8505, -15160, -27859, -20783, 3952, 5355, 14806]
15729A4806K4170k0556m1381k3325r66j5166j9224k785N9491N6160j1030k8566
15717h372j9800J9038O0793k4551l5605j2890K3784K9234k0628J1771L7670j5855
15705D4589j9258j9155k6032K88J5591J3622K6292K1953j9724J4820l4902J0033
15693B8117K1737m7958m271q650q819K2293K4328j9009J8120R551R71j8999j2444
15680D967L797j394k4455k7775L3399J1974J4228M1156L9588M607k4572o1846
15668A3674m2602J1878L2596N398j8282L283J0032K3872L0155j0930K5261N4814
15656A39149m6209k4815L907J4016P128L861l1146n4185k2258l392J8928J2522
15644A7506k6003j9647j8915K7873M4001L908r166m5229j5184r697K023L0328
$$ y = [14806, 38976, 18420, -22961, -46286, -47252, -62418, -81642, -84427, -24936, 31224, 20194, -8372, -28172, -9134, 51659, 27108, -8497, -21387, 2397, 31631, 11003, 22774, 60444, 44589, 25331, 6176, -19856, -19568, -3977, 9645, 35937, 57890, 38166, 52986, 18084, 28117, 49854, 1896, -2375, -11025, -19844, 2449, 26777, 7768, 25888, 35439, 36410, 17411, 4967, 8764, 7370, -17085, -44860, -11461, 513, 14741, 55897, 95485, 100092, 75520, 13674, -28928, -17050, 15546, 20944, 2662, 5945, 15977, 39849, 70004, 59074, 84335, 139149, 92940, 68125, 72032, 86048, 93176, 97037, 65891, 11706, -10552, -13944, 4984, 17506, -8497, -28144, -47059, -19186, 24815, 28723, 19557, -25672, -40856, -50553, -48530, -18202]
15632a8202k191P681j4866m332m772O673m012L6636J0229j2939k6042q6991L5523
15619g7605M6554J8353L0684L6717P794k7233j6947l0466L8232j2989r962R553
15607A2685J2661K9269J4009m7922k8347l9937J2181O415J0632M5374n862k6166
15595e008k7965L74o296P998j1989O835K2907j6154l8298l401J4198J4097J8055
15582b4647K1052J9965q83P462m7951k6613M323J0863J9873M5542M09q120K8129
15569D9404L2249m062k3585j00m0004k8718j375q186J6021J2473p280l0219K2668
15556a0714j5045j1943p914K8702L933j6798J5700K9018r206K3320O014q413k366
15543B4288j156O0523l6279o3548J5174L222J8025q263K1253j1424o971k5222
$$ y = [-18202, -20393, -12712, -27578, -31910, -36682, -30009, -34021, 2615, 12844, -95, -26137, -113128, -77605, -31051, -12698, 17986, 54703, 62497, 35264, 18317, -12149, 26083, 13094, 3132, 12685, 25346, 54615, 68624, 20702, -7645, -47582, -35401, -28986, -18354, 27020, 21158, -5008, -32973, -32599, -38895, -30897, -42886, -36051, -13144, -29298, -67596, -70997, -56799, -42702, -24647, -3595, 16370, 15487, 22949, -25002, -51615, -47292, -36429, -16556, 28986, 29395, 21275, 49404, 81653, 77591, 54006, 53906, 13902, -14816, -16191, -24377, -8356, 4117, -3163, -33382, -10714, -25759, -37702, -45616, -16914, -12981, -29779, -14079, 14939, 5733, 29053, 35067, 26654, 24288, 23132, 83655, 47376, -16172, -998, 2224, 20249, 11986, 33239, 21815, 14844, -10378]
15531a0378p295J0441P992M319J9730j9807L7231j5492j6818J2065J1618K7931
15519F1537l3986k6628K7328m0946K408M1531R255J9879k5143j3525l269l4852
15507a6411l2317J5044J3561M563o746p644M1345r7j8481L7888J2538j7922k9092
15494c771N317J3887n4J2453J1061j6093P545R881o240L44K4536J5238k9154j2661
15480C2289l1971j1771k176j2310q50M5164M2984k1512J3215j0890j6529m0733
15468a5090k5848K8103M8592K9940l021J8080j7858J7598j6068k1153L453J8477
15456F5205j8141N359k429k563L0878J637l4328j3030K7564j6164J2371j2257
15444D4102K0481n1300k8932j9341K3572K383K2637J9014k858K2689j369n690
$$ y = [-10378, -17673, -7232, 760, 5079, 24809, 5002, 42233, 26741, 9923, 21988, 33606, 61537, 27551, 923, 28251, -12695, -10287, 31244, 40499, 60378, 35235, 21710, 18441, -16411, -48728, -33684, -20123, -15560, -22306, -29950, 11395, 11298, -7183, 30705, 43243, 25321, -3771, 1546, 15433, 15379, 27832, 38893, 22800, 30345, 40226, 33986, 34330, 58866, 74104, 44950, 32289, 318, -11453, -13629, -25939, -26789, 18375, 61359, 39847, 53062, 42172, 25643, -15090, -40938, -12835, 35757, 65697, 62676, 80756, 62898, 80496, 64428, 43275, 46728, 65205, 47064, 52423, 49994, 47431, 78309, 79946, 45618, 32588, 60152, 43988, 56359, 44102, 64583, 13283, -15649, -34990, -11418, -9035, 13602, 32616, 29758, 52447, 51078, 45388]
15432D5388L1758k6811p1667k3360M3425L5294p957k3045M207L6321j1181J5832
15420D8204N7326j869l5899l5484k1826m3993J4985L0519L3754J2648K6389k2792
15408F1962l3302J5877k072R193M460m2196l6190K0346O9980M533L2722J614p420
15395I9507o7335R937K0901k426J5886L653j7477j8099p937j4220j415J3853J9320
15382E4148p735l1041k8533Q731K6115L664k4505k8052m1265J214J5172J3337
15370c8750K5414j9412j37J3682J065P625k1232m0367K1895J9431J4128j6784
15358c3442P157J6546k0496M4370m378J5211J1939K9284O1588L4043n4273m6416
15346F1133l9119n0669K9753J2159J8913L1021n527j0352m8876k3925K7572L7808
$$ y = [45388, 77146, 50335, -21332, -44692, -1267, 34027, 26070, 3025, 7232, 43553, 32372, 48204, 105530, 103661, 67762, 32278, 10452, -33541, -18556, 11963, 45717, 58365, 84754, 61962, 28660, 44537, 42465, 51658, 56118, 13922, -22268, -1922, 68058, 72591, 105313, 106927, 99507, 32172, 42109, 63010, 60584, 76470, 80123, 62646, 44547, 36610, 22390, 20975, 34828, 54148, 46413, 15372, -13161, -4430, 21685, 25349, 844, -27208, -68473, -67259, -52087, -38750, -13336, -32748, -32885, -19203, -18138, -10513, -31745, -72112, -50217, -30786, -16658, -33442, -26285, -9739, -30235, 14135, 9757, 24968, 36907, 66191, 127779, 161822, 107549, 61133, 22014, -28655, 1098, 13257, 32170, 63191, 57664, 47312, -1564, -25489, 2083, 39891]
15334C9891p755J2321J3710j3028J838j4349K5862K570m3817N1484J8133j6811
15322G0049l5359J0351P585j4158j9038j1087L8237j5054n134K1473k5634j9192
15310C039p659K2278p414O069p462j8626k4544k2124Q722N2771k7667J217k289
15297b3689M5503J9930j262J3358j6745q763O732j9111k5545J0959J7319J7175
15285C5861j9667J1049k205L0219l2904j2261k2926M099J9488J3304j7070J3910
15273B0897j5104j021k6961m993K3772K6476l163K9756n00N705K6299K2891n7153
15260D6901m1601k5584N831Q589M3430K1079k8801J5132j6400o9999K210j025
15248d0238j9937O3319J9135K007l8925J9402M0027O220j6502m6200Q105O911
$$ y = [39891, 32136, 44457, 58167, 45139, 46977, 32628, 58490, 61060, 17243, 68727, 86860, 70049, 34690, 45041, 52626, 38468, 19430, 8343, 46580, 31526, 26392, 47865, 22231, 3039, -4620, 17658, 10244, 16313, 8851, -9775, -34319, -56443, -47721, 5050, -22617, -21400, -23689, 21814, 41744, 40482, 53840, 37095, 28332, 35064, 15953, -9592, 1367, 18686, 35861, 16194, 27243, 25038, 55257, 22353, 10092, -12834, -8735, 10753, 24057, 6987, 20897, 5793, 4772, -22189, -27182, -3410, 23066, 19903, 49659, 49159, 54864, 81163, 104054, 46901, 5300, -20284, -14453, -5864, 37566, 58645, 29844, 44976, 28576, -41423, -39213, -40238, -60175, 3144, 22279, 24286, -14639, 4763, 44790, 51010, 34508, -11692, -3587, 3324]
15236C324J8685J6714k26j7440P603k207M370J4317l6440l764k5122K3523p418
15223d081L0320j1302j9285L3513K0980j1443O87O446J1592q420j5287J6905M4147
15210I4772j7697m7813J604R788o072k5076p0564n2540j4261K8387M3577o509
15198f2404J5723J8802J3006R780o186J5670L226m4483j9948L6572L3410P273
15186B0441K8550P116O401l9626l7918K4336K6936O987o7538O3439M9232m2899
15174D5457r126l190j4735L7437O1319J324k0752p118k4301n023L4216r353l1694
15161E4461k2916j0746L1581Q099l1768R38k0538m7440K4563L3118j7715K828
15149D465L6867Q55l1854k9799j7969M1258K8992J498k5156K9179J2616m632j4862
$$ y = [3324, 22009, 38723, 38497, 21057, 28660, 26453, 30823, 45140, 8700, 4936, -20186, 3337, -4081, 26239, 14937, -4348, 29165, 50145, 38702, 39389, 45835, 57427, 49007, 33720, 50625, 94772, 77075, 29262, 30866, 40654, 34582, 9506, -61058, -113598, -127859, -99472, -55895, -62404, -46681, -27879, -14873, -5093, -11279, 4391, 7617, -36866, -56814, -20242, 13168, 20441, 48991, 56107, 62508, 22882, -15036, 9300, 36236, 43223, -24315, 39124, 88356, 45457, 36331, 33141, 18406, 55843, 117162, 118486, 97734, 90616, 66315, 61292, 95508, 86155, 54461, 31545, 20799, 52380, 60479, 28711, 29649, 9111, -38329, -13766, 19352, 1637, 4465, 41332, 42187, 10333, -19466, -37435, 3823, 32815, 34313, 9157, 38336, 50952, 46320, 31458]
15136C1458J6228m6844m0920m368J8245l690J5879k1998K5684M9398J0403k0230
15124B9245q330r850j7693J8916Q653K9830j9390k1815j6497J5288L408J1910
15112B3675K7940J0906k385r699m3104j8645N1672M2812K3255m4544r381k978
15100D9524j8354P113M0135J6962n5297j0021J6190k7285Q200j0613l2459j6614
15088c2519L6492K3580J7509J8477l5180j8870k4209J6694M6668m752l111L2005
15076G2784l2094j267r049k4546n968K5653Q199J6288l792j5079J5979L352n5547
15063e087K4563K9998l874j8266k1083j5242K674J8524K6121l2118l797L1998
15051C4411q954m077L995L861N87K5187j1622k255p640m131J4016J240m730j6401
$$ y = [31458, 47686, 842, -40078, -44446, -26201, -29891, -14012, -36010, -10326, 39072, 49475, 29245, 20915, 11065, -6628, 12288, 20941, 50771, 31381, 9566, -6931, 8357, 11765, 23675, 51615, 62521, 60136, 50437, 7333, -11312, 40360, 83172, 106427, 61883, 52502, 49524, 31170, 38283, 78418, 95380, 40083, 30062, 46252, 18967, 27167, 16554, -15905, -32519, 3973, 27553, 45062, 63539, 28359, 9489, -14720, 1974, 48642, 43890, 40779, 72784, 40690, 39423, 30374, 5828, -140, 25513, 33712, 50000, 46208, 31129, 47108, 50460, -5087, 19476, 49474, 45600, 27334, 6251, -8991, -6317, 12207, 38328, 6210, 2413, 34411, 25457, 21380, 25375, 29236, 29823, 55010, 43388, 41133, 33493, 29362, 43378, 44618, 39888, 23487]
15037B3487K5162J6189P376n0229j03K3192L5414n597j6734q781m76j1726l1649
15024E525L6753O0051j0296m0006l5258m122M2756k6765P472L2781J3866N709
15012H8466k8309k1016o351N098O665K0003N3046N3025M4705R6814J37224L09078
15000G58448N29355O65521K43835l98250l51325j97397l09898k90898k31985j21818
14990B95588q3555p8564n640J3786J3134J3112j0518m1963n537q675l9838o6423
14978e093k3225M8205M591o354l3301j5682K602m0657L40O6717L7496J2028M083
14965E1750Q116n9164n742J9211J4291J2616k0979k5433r445n415j6648j842O828
14952c1856J1142j8600o167R701N165J2027k0875J2676K5931J9922R899j3943
$$ y = [23487, 48649, 64838, 72214, 21985, 21882, 45074, 80488, 74891, 58157, 49376, 48900, 37174, 5525, 42278, 102329, 92033, 52027, 16769, 12647, 55403, 28638, 36110, 68891, 82757, 88466, 60157, 39141, 32790, 37888, 44553, 64556, 117602, 170627, 215332, 312146, 449370, 758448, 1287803, 1953324, 2197159, 1798909, 1447584, 1250187, 940289, 649391, 417406, 295588, 212033, 133469, 127829, 141615, 154749, 167861, 157343, 115380, 109843, 101168, 61330, -5093, -28318, 19887, 24478, 18124, -15177, -30859, -28257, -68914, -68574, -1857, 35639, 47667, 51750, 59866, 702, -5040, 14171, 28462, 41078, 20099, -5334, -14779, -20194, -36842, -38684, -31856, -20714, -39314, -45481, -35780, -30615, -18588, -39463, -26787, -856, 19066, 28965, 15022]
14940A5022k6258K6267M3958p814k9305j0112M3100L7933j8153j2282m159n918
14928E2279m3626L67r152k8113o178m775J5964J2822M2567J4975k2498J3898O4219
14915A02749N760l4930k3088J2888r382k4055J9450Q011q689r9J4470Q434j0349
14902F1170j5108k7277N478J3426J5070J371k2163j9187J4554O3382P020q516
14890H9220J023n5133J3051M2111j1698k6354k7510k80m1654j0313L3279L8222
14878D3964K7741K8791k1718q205j732K6279j7150m7219j81J6872J2627j3790
14866D6279k2383L471q822K2831K265l6912j7788O832K9893J0552J5712K6727
14854G8657n0356j7325P938J0152j400K2442L486l6903l1020L2004R5l4784k1682
$$ y = [15022, -11236, 15031, 58989, 51175, 21870, 11758, 54858, 92791, 74638, 62356, 58197, 52279, 8653, 9020, -132, -28245, -34423, -39198, -23234, -10412, 32155, 47130, 24632, 38530, 102749, 108509, 73579, 50491, 63379, 53997, 29942, 49392, 57403, 48714, 48615, 63085, 71519, 61170, 46062, 18785, 24263, 37689, 52759, 54130, 31967, 12780, 27334, 90716, 97736, 89220, 90243, 35110, 48161, 90272, 78574, 52220, 24710, 24430, -17224, -27537, 5742, 43964, 71705, 100496, 78778, 70573, 68841, 95120, 77970, 30751, 30570, 47442, 60069, 46279, 23896, 27367, 18545, 41376, 43641, 6729, -11059, -4227, 25666, 36218, 51930, 78657, 28301, 10976, 18914, 29066, 27666, 50108, 53594, 16691, -14329, 17675, 17770, -17014, -38696]
14841c8696N358J4900j6425L2646L0009p163N399P216K4671j039k7273J7288K0994
14828F7885K99Q684m5158j9672R210K3878N857k2994j6209M492K9647K4481j0800
14815E9600j6219L3235L9950J063p363j4094n6094k3846J9818M4359J5126l2888
14803F2647k6925n476m492l4272J2424M6172L0726j5323j6952R090n0946J8726
14791B5399K6173J329n863n611Q972j2149P472k4305N733R903m491l3091j682
14778b211N2005J4496k845q028L728l3675R399M9647L570J0802j1079l6727R53
14765E0035q423K7706J6372l0995J2028O85o594K098K1210k9471j6026k5950J3586
14752B6261L7281K7139j1019k1585o0164j7445K4608l020j0945J0576K7825K2887
$$ y = [-38696, -33338, -18438, -34863, -2217, 27792, 20629, 26028, 33244, 57915, 56876, 29603, 46891, 67885, 68184, 76868, 31710, 12038, 21248, 45126, 50983, 27989, 11780, 16272, 45919, 70400, 59600, 43381, 76616, 116566, 117629, 110266, 96172, 40078, 16232, 36050, 80409, 95535, 62647, 35722, 30246, 25754, -8518, 3906, 50078, 80804, 65481, 48529, 57619, 6673, 25399, 51572, 52901, 47038, 41427, 50399, 38250, 45722, 21417, 27150, 37053, 32562, -529, -2211, 49794, 64290, 61445, 53417, 57145, 23470, 32869, 82516, 86086, 96888, 85809, 49082, 50035, 41612, 69318, 85690, 54695, 66723, 67408, 60814, 62912, 84122, 54651, 38625, 12675, 26261, 63542, 90681, 79662, 58077, -2087, -19532, 5076, 2056, -8889, 1687, 29512, 52399]
14740E2399k0061k2412m2922o41M1465m202L4680K9922k0984j8126n4643l7762
14728f3287j0550M6791N9681L346j0894k8770k4217M1145M840K2184K2791j1506
14716E1554K525k1384m29R538k1540k6898L8882J4713k18j7308J235J4542K2779
14703F7991N2000n5747p3226J5351L4328J6128k1457r906k4310R01q832L964k9053
14690c1868R288L8588L406o159L2211K8197l3032k4736Q023M603K532K1309J1645
14677F4007q313l5560n215J721J1378q63K6896j3502k4553R309r76l7690J9178
14664E817R070l4589K0933o179k464M2681K7099L6481k0593k9171l7834q124J76
14651C303J7639Q216R72M917K2062k0109P254r729j6346J6595L6302J4730k2222
$$ y = [52399, 32338, 9926, -32996, -33637, 7828, 3626, 38306, 68228, 47244, 29118, -25525, -63287, -73837, -27046, 32635, 35981, 25087, -3683, -27900, 13245, 18085, 40269, 63060, 51554, 54079, 32695, 32266, 41804, 20264, -6634, 32248, 46961, 46743, 29435, 30670, 45212, 67991, 119991, 64244, -8982, 6369, 40697, 56825, 35368, 25462, 1152, 2053, -6779, -2815, -31868, -22580, 16008, 19414, 13255, 45466, 73663, 40631, 15895, 23918, 28521, 31053, 52362, 64007, 55694, 20134, 14919, 16640, 28018, 27155, 54051, 40549, 15996, 25305, 24329, -13361, 5817, 14887, -19702, 1231, -4948, -7412, 35269, 62368, 98849, 78256, 49085, 11251, 3127, 3303, 20942, 29158, 30130, 35047, 57109, 37000, 44254, 34525, 18179, 34774, 71076, 85806, 63584]
14638F3584n0267m7480J210M0314J7021J1410N9663j4850l1883k7668r341P857
14626A9570j3610r875l545L9145o1695l4797P6192K8863k3831k5352m8272K2312
14614c4895K7970K9364M6355o1416m3151J6704L5690K9255j4827j3609P508R081
14602C4029j5314l3106j7288K9389K7258j3317O654N3990j6922J1828q188l7414
14590B1599Q980P818j0900l4024j8308R345j2465M1201J9292k9905l8320L2392
14578c295l1215J7007M2524M9256K6938j7270k0475k8814l9757j904K4164o898
14566A0261J6394k0860j2919N8812j2555m856K9657k5939j6113k4619m4708k6499
14554g3944J9460L8109J5535K5062K4954m7262k6907j2066L1828p086L6128K7079
$$ y = [63584, 13317, -34163, -32953, 7361, 24382, 35792, 95455, 80605, 48722, 21054, 11713, 19570, 5960, -3915, -7460, 31685, -30010, -64807, 11385, 40248, 16417, -8935, -57207, -34895, -6925, 22439, 68794, 7378, -35773, -19069, 16621, 45876, 31049, 17440, 24948, 34029, 18715, -14391, -31679, -2290, 24968, 11651, 18305, 72295, 55373, 67201, 59013, 21599, 30579, 38397, 27497, -6527, -24835, -15490, -27955, 13246, 32538, 2633, -35687, -3295, -34510, -17503, 25021, 74277, 101215, 83945, 63470, 34656, -5101, -7005, 17159, 10261, 26655, 5795, -7124, 51688, 39133, 34277, 63934, 37995, 21882, -2737, -47445, -73944, -54484, -16375, -840, 24222, 49176, 1914, -24993, -37059, -5231, -12317, 23811, 50890]
14542E0890o118J7129j9345l484k2119l4621J4484o272j7554K2878Q236L2920
14530C7024m614R595r304j5889J7709m81j9002r569k5473j5250K9426j051j0555
14517a7434K1031N6530K8386k6183K4698P990l9572m7891J4597J9005m375J1319
14505D8101L869m903l1812l9476J6497J0171j2404J5803M9260m149l8976L293
14493A5274K1239j5456j0062L6519K819k4756O518r319o337Q563Q440k4251j0901
14480a710J5003J054m979m8175k0361K8010J9684m424m691M091M2339J1158L1370
14467F8369J5432o7980l2066M3829k9L2081J0237k0548J7322k0362j9015l995
14455B3275K0017O0655k936o9326l5406k829J3166k5052j7732P985Q867L5850
$$ y = [50890, 44772, 61901, 42556, 39072, 16953, -17668, -3184, -9456, -27010, -4132, 4104, 37024, 32410, 42005, 32701, 16812, 34521, 34040, 15038, 5469, -20004, -35254, -5828, -6879, -17434, 3597, 60127, 88513, 62330, 87028, 95018, 55446, 7555, 22152, 41157, 36782, 48101, 51970, 47067, 15255, -24221, -7724, 2447, -9957, 5846, 55106, 50957, 11981, 15274, 36513, 21057, 10995, 47514, 50333, 25577, 32095, 22776, 16439, 25002, 33442, 9191, -1710, 13293, 14347, 9368, -38807, -59168, -31158, -11474, -15898, -20589, -16498, 25841, 36999, 68369, 83801, 15821, -16245, 27584, 27555, 59636, 69873, 49325, 66647, 46285, 27270, 23275, 43292, 103947, 101011, 31685, -3721, -6550, 6616, -18436, -36168, -28183, -19316, 16534]
14443A6534J8522k4299j4191k6200M6232O004J1421J1343J4783J913j3701K2066
14431G0427J7123J261l902j1136o694j0695j3469j695j2154k4812j3040P025J6768
14418A5007m7184n5290J6538L7426r486K1958K7912k8802l1595r933L4011L3814
14406D376k8899J389N0312O906k3849n241J665j3989m827k3103J3861J2655K6899
14393A8155K7984j5750j0912q273N539J7948J0414p268p3916J150L8191K0762
14381B4024j704j4038L144k0050J5717j1978R742o79l520J5716K2793O1222J7874
14368A18263l588k8816J4358j190m3623l1994L1712L7540j5738l0688J7753N291
14356F9280n5999j5272L3386l806j0728J6802o757j4687K488r167l581K2319P24
$$ y = [16534, 35056, 10757, -3434, -29634, 16598, 22602, 34023, 45366, 60149, 62062, 48361, 70427, 87550, 88811, 84909, 73773, 67079, 56384, 42915, 41220, 29066, 4254, -8786, -1761, 15007, -32177, -87467, -70929, -33503, -42989, -21031, 6881, -21921, -53516, -63449, -29438, 4376, -24523, -23134, 27178, 34084, 10235, 4994, 6659, -7330, -12157, -35260, -21399, -8744, 18155, 46139, 30389, 19477, 11204, 16743, 34691, 45105, 37837, -36079, -34929, 3262, 24024, 22320, 8282, 11426, -8624, 7093, -4885, 4857, 4178, 658, 16374, 39167, 100389, 118263, 114675, 85859, 100217, 99027, 55404, 23410, 55122, 92662, 76924, 46236, 63989, 69280, 13281, -1991, 31395, 27589, 16861, 33663, 26906, 12219, 14707, 5540, 1959, 24278, 25002]
14343B5002o012O156K2115J2843J2781k003J4923k2092l7853M161J4411J9645
14331F4077L3675J3021J3660j9169O410P104k2299l1561j6945l882R882j0288
14319D3685j469K2708R11J103k8626R175M607J3312j9104r335j8459j2196k0662
14306a4350l359K6199j944j4896n575R36l4103J9707Q6040J2695l0524p865r489
14293B3472O083j8141M5958K8536j0361R860L14J10n594k0207k661L964q702J250
14279E3881k0780J9794L832k1700J5903Q926J7535o634l3233K055J1995l7402
14267A4172M123K7421O7564J4505k6517j5968l1937j3285m119j367k0156J0952
14255B5388N2851o396k7079M302k751J9911L695k4325j4482L52O323K3688J1864
$$ y = [25002, 18990, 25146, 47261, 60104, 72885, 70882, 85805, 63713, 25860, 30021, 44432, 64077, 97752, 110773, 124433, 105264, 111674, 118778, 96479, 64918, 47973, 44091, 53973, 43685, 42216, 64924, 65835, 66938, 38312, 47487, 52094, 65406, 46302, 36967, 18508, 6312, -14350, -17709, 8490, 6546, -8350, -13925, -12989, -47092, -27385, 58655, 71350, 40826, 32961, 23472, 29555, 11414, 57372, 85908, 75547, 85407, 85721, 85831, 80237, 60030, 57369, 61333, 52631, 53881, 33101, 52895, 56727, 35027, 50930, 59856, 77391, 70757, 37524, 39579, 51574, 14172, 18295, 45716, 113280, 127785, 101268, 85300, 53363, 40078, 35959, 34592, 14436, 25388, 78239, 71843, 44764, 49066, 46315, 66226, 69921, 45596, 31114, 31466, 37789, 61477, 73341]
14242G3341K8035k4288n1149K2720k451n3202J6076p714p743j824L1194l203q475
14229A1317J8388o485m4813Q888N817K5731M9866o877p826M2045J1677k6243k6520
14216E4965R519R347j8872K6597J2596m3657o0812l0643J1179J1991L6130L2603
14204E0943J9927L7164j6060k3795n111O518j7106o0034l4284J6698O2638k4161
14192A3337q982o795J4633n977j8319K6007J5022j5311k0042j7409K1596K7648
14180B5408k3677n861K3548m435j3471N097O2845J299r589L603l1542l5264j876
14167c915O113J1241K8555j5358k145J91J1619M6969j8038m8614Q328j423K9427
14154E2950k878M4971J0694k5002k9552L0206K388j3872K678k7653r973j2533
$$ y = [73341, 101376, 77088, 25939, 48659, 46208, -6994, 9082, 1368, -6375, -8199, 22995, 19792, 11317, 29705, 23220, -21593, -12705, -6888, 18843, 68709, 61832, 54006, 96051, 107728, 81485, 54965, 64484, 73831, 54959, 81556, 94152, 50495, -10317, -40960, -29781, -17790, 18340, 50943, 70870, 108034, 91974, 68179, 63068, 69586, 52480, -7554, -41838, -25140, 37498, 13337, 4355, -2440, 12193, 6216, -12103, 13904, 28926, 13615, -6427, -23836, -2240, 25408, 1731, -4130, 19418, 14983, 1512, 6609, 69454, 70753, 61164, 64767, 33225, -2039, -3915, 2198, 13439, 41994, 26636, 24491, 24682, 36301, 83270, 65232, 16618, 24946, 23523, 52950, 50072, 95043, 105737, 80735, 51183, 81389, 83777, 69905, 72583, 44930, 34957, 22424]
14142B2424k7616n823N532K6130k5547J393J300j1641J1747O957K6720j0678K341
14129B3239L7839l1740o2515k8605L9856M8742j3864r587J3032l987k2016m104
14117a3710L2765N2093q131J1328P706k2123K0013k4562n519n188l3780k067N885
14104A4710k0151J8771j5311J4755j5462L7033N2444j0488M925k09R656L834o162
14091H8345J9493j9838k5983n194k9658l7606j1136j4787J4604K0047L1617p841
14079B2063j6227J081K6310n564j8761L2298r877j1767j0869P547J7210J2684
14067D6128k1649q744j8661k7548J6095K8150K8338j4730m4181J2769M6320j4437
14055B7850n4435K1598J6464j3798m748l4785k2721K8607N4650j5708j6529K8697
$$ y = [22424, -5192, -11015, -5483, 20647, -4900, -3507, -2207, -13848, -2101, 4856, 31576, 20898, 23239, 61078, 29338, -33177, -61782, -21926, 26816, 12952, 3365, 16397, 12410, -9606, -13710, 19055, 71148, 63017, 74345, 82051, 59928, 79941, 55379, 49860, 44672, 10892, 8825, 14710, -5441, 13330, -1981, 12774, -2688, 34345, 86789, 76301, 81226, 81017, 90673, 94507, 88345, 107838, 88000, 62017, 56823, 27165, -10441, -21577, -36364, -21760, -1713, 29904, 22063, 5836, 6917, 33227, 27663, 8902, 41200, 31323, 19556, 8687, 16234, 33444, 46128, 24479, 15735, -2926, -30474, -14379, 13771, 42109, 27379, -16802, -4033, 42287, 27850, -26585, -4987, 11477, -2321, -7069, -41854, -64575, -35968, 18682, 2974, -13555, 15142]
14043A5142q283k9539K8467M8673N260N42K8350L9272L19k8214q266J4862k9311
14030G7274m3299P30J7896n230J6356k2139j311q727J7092L529L488J4531K5968
14017I6158L2465l0641o469k5261l1252K8069K4782P415o532l7597J919J9954
14005G3010o764j3136n4517q1821K4626K3498L2645N053J5821j4861K2312K2238
13993D8104j313K6212k0351k0601K6272k624l2592k205j2774l158M0235J0539
13981E5744m3933r189n003J9142R906J2491M4868Q884j4324p3421k9827J1306
13969a3356N524K8001l266K2495j1218k0685Q062J1499J3268l0571j2426K4801
13957B2128K9073K1097J9682M3066J182l5951j1852R454O17l1446k638l9904N823
$$ y = [15142, 6859, -22680, 5787, 54460, 59720, 60262, 88612, 127884, 128203, 99989, 91723, 106585, 77274, 33975, 34705, 52601, 47371, 63727, 41588, 40277, 31550, 48642, 52171, 55659, 70190, 96158, 128623, 97982, 91513, 66252, 35000, 63069, 87851, 95266, 88734, 51137, 53056, 73010, 66246, 53110, -1407, -83228, -58602, -35104, -2459, 2594, 18415, 3554, 25866, 48104, 46791, 73003, 52652, 32051, 58323, 55699, 23107, 20902, 8128, 4970, 45205, 55744, 11811, 2622, -2381, 16761, 26667, 39158, 84026, 92910, 78586, 5165, -24662, -13356, -7832, 20169, 16903, 39398, 28180, 7495, 15557, 27056, 40324, 9753, -2673, 22128, 51201, 72298, 91980, 135046, 136228, 100277, 88425, 97879, 98496, 67050, 64412, 24508, 30331]
13944C0331k0357M160M060j29N0422J3876m1835N031M4161L90n7358k7350j6836
13931a1434R441L6467J8487j741j43J428j1417j0642j1207k0929J3388K3059P049
13918D1806L8247p998J6793J186k9630j8055J0148N08j7589M045j2235J52l9512
13905a2134K696k848j4800k1411L2268K0941N9895j0390k6263N604k2048n9268
13893d7758j4498Q634o841q957J6890M2080J2899q790k4546K755k2398k4772L3761
13880d1541K6228N780K3390J5176p053l34R998N507O680r591J8052m0281k0731
13867h720K647j6678j6797K5688L8001J0074n245J0306L8125o883j5792Q874j9810
13854D3790l8200l6477j859L7117R418j7915J9919k4173j9010J6384p311L7448
$$ y = [30331, 9974, 14134, 18194, 18065, 68487, 82363, 40528, 45559, 89720, 90110, 32752, 5402, -11434, -1993, 34474, 52961, 51220, 51077, 52505, 41088, 30446, 19239, -1690, 11698, 34757, 41806, 80053, 72055, 88848, 90034, 60404, 42349, 52497, 53005, 35416, 39461, 27226, 27378, -12134, -9438, -12286, -27086, -48497, -16229, 4712, 64607, 54217, 27954, 33558, 11510, -47758, -62256, -53622, -60463, -69420, -52530, -10450, 2449, -6341, -30887, -28132, -50530, -75302, -41541, -15313, -9533, 13857, 29033, 21980, 21646, 31644, 37151, 43831, 34240, 52292, 12011, -8720, -6073, -22751, -39548, -13860, 24141, 34215, 28970, 39276, 77401, 70518, 54726, 63600, 43790, 5590, -30887, -32746, 4371, 13789, -4126, 15793, -8380, -27390, -11006, -18317, 19131]
13842A9131K7207j6223l76J5308k9501l7470L4156L6647L0949o1411l2334J9996
13830F079Q739J4582l7192k7326K4593O600r038m2172K916L2288P953k397j4587
13817b8962k4845K3196M9348K7315l6304j1206K9589J7520l3088O880K5035P475
13805E1953m6646k716p762J1526R988j7801k9802J608K8148K3370l1042l180N4033
13792D1677K5608j2039K449J1357n184k3283k8287L660m5242p800L328K1925K3920
13779A2089J8696j6866j2886j101K1929k1293m2169M871L1776J33K3840Q398L8777
13766F6194K940j7504k840J5172K0152K5529l4811l4774R44J9589j9303k640o0069
13753b1421P477M4041k686J4990M3321o285n4132l0949N5821J2236j979Q64j7813
$$ y = [19131, 46338, 30115, 29739, 45047, 15546, -21924, 12232, 48879, 79828, 18417, -13917, 6079, 14818, 29400, -7792, -35118, -10525, -3925, -12963, -55135, -52219, -19931, -11978, -14375, -28962, -53807, -30611, 18737, 46052, 9748, -1458, 28131, 45651, 12563, 19443, 44478, 51953, 5307, 2591, -5171, 6355, 16343, -1458, -31260, -29652, -1504, 21866, -9176, -12356, 41677, 67285, 55246, 57695, 69052, 63868, 40585, 12298, 15958, -29284, -37084, -33756, -11831, 12089, 30785, 13919, 1033, -68, 21861, 568, -41601, -36730, -4954, -4821, 19019, 27417, 66194, 69134, 51630, 48790, 63962, 84114, 109643, 74832, 40058, 41002, 60591, 41288, 38648, -21421, -13944, 30097, 27411, 42401, 85722, 79437, 25305, -5644, 50177, 62413, 60434, 61298, 43485]
13740D3485j8469k5321j4718J098J098Q273K2793l1703j377m907P601K492k6084
13727c5739N981k712k474l0746j0439J8610J1072N3426K7924N266l7900m847Q987
13714F409M215j9546J3778m0526P2298L0075j5824q345l7264j6575K951L1302
13702B2948M716n0741j9688K4630l4090J8152K2912j2766K6203L1861K534k528
13690C4143n42r669j2766R202n258L7414K5570j5830M320l5776L622L0872j2995
13677E2307l1480l6625P547J2030M5877J0308k1895o5465k0918j2400l619K2974
13665d1359p399j2632K6909K9317k065K1443N0834Q286l9449k8384l0152k197
13653b6848o20K4878L7128l2472j9094k6990j7290N1537K9589J3507r481n1304
$$ y = [43485, 25016, -305, -15023, -13925, -12827, -4554, 18239, -13464, -14841, -19748, -12147, -9655, -35739, -29758, -32470, -34944, -65690, -76129, -57519, -46447, 6979, 34903, 40169, 2269, -2578, 6409, 10624, -8922, 4856, -35670, 36628, 66703, 50879, 42534, 5270, -11305, -8354, 22948, 27664, -23077, -42765, -18135, -52225, -34073, -11161, -23927, 2276, 34137, 36671, 34143, 33601, 23932, 11166, 20368, 15110, 52524, 78094, 62264, 66584, 30808, 34430, 65302, 52307, 20827, -15798, -8251, 3779, 49656, 59964, 38069, -27396, -48314, -60714, -64333, -41359, -48758, -61390, -34481, -5164, -7229, 14214, 65048, 73334, 33885, 5501, -24651, -26848, -27468, -2590, 34538, 2066, -17028, -44018, -61308, -9771, 19818, 33325, 23844, -27460]
13641b7460P714K454j7232K1089j4734l5530k5355O777J9609M106m873L7991J5083
13628a0361K1331J529n6421j0042L9497O4002p896k0666k6545K9312M5149K6937
13616I5826l8413r121j6528k8173k3629K2237K708j3138K6028L9910l589p6014
13604b1896j7472K9884K1503K2885L9969j0547n2390J9400k6332P127p713l4539
13592c0121n9210J3446J3526J2819j4609n063j2065J8681J4737k4995P954K8365
13580c6535J3035L6869K4747k296k0023K4786j3742j2452l178N306m5430J8302
13568a0611j0038P818J3136k2423K4241j7789k109K8522j3952N544M053J3305
13556A9697l1730K284P942j7389J1338K1333N703l578r558m662k0081k3144J6014
$$ y = [-27460, -19746, -17292, -34524, -13435, -28169, -63699, -89054, -82277, -62668, -58562, -63435, -25444, -10361, 10970, 12499, -43922, -53964, -14467, 49535, 41639, 20973, -5572, 23740, 68889, 95826, 57413, 48292, 31764, 3591, -20038, 2199, 4907, -8231, 17797, 57707, 54118, -21896, -39368, -9484, 12019, 34904, 74873, 64326, 11936, 31336, 5004, 12131, 4418, -30121, -89331, -75885, -62359, -49540, -64149, -69212, -81277, -62596, -47859, -72854, -64900, -36535, -23500, 13369, 38116, 35820, 15797, 40583, 26841, 14389, 11211, 16517, -28913, -10611, -20649, -12831, 305, -22118, 2123, -15666, -17775, 10747, -3205, 2339, 6392, 19697, -12033, -9749, -1807, -19196, -7858, 13475, 19178, 15600, 6042, 1380, -18701, -41845, -25831]
13543b5831K0470m5283l9069j493p975P050J8788N750N8122k816m4600k9196L3590
13530e2493K8243J1713K2157L042m9993k8265L4436K1078k3666j4497r67K7300
13518b1912L3428q68j5343K4197M8113J1317j0358P982m04q340L5535K2330o7079
13505E8598n6140P803n503j968O061K2248k1336k383k942o375P006n682J0938
13492A0325P282m500l5626k8404j8756K6945O367k1332j7257K5973K4149N2247
13480B7413J9168K0639k9154l755l8728l5614L7219J1737m4836O959l4579J2271
13468e1260L6287o883j0663q108o02l948J2614J3598k1832K5222K7703O45n842
13455F931J0900O498N0J1481l7231l6789K3321l322m555r39j096j0668J565l7951
$$ y = [-25831, -5361, -50644, -89713, -91206, -99181, -92131, -73343, -67593, -9471, -12287, -56887, -86083, -52493, -24250, -12537, 9620, 12662, -37331, -65596, -31160, -10082, -33748, -48245, -49212, -21912, 11516, 10648, -4695, 19502, 67615, 78932, 68574, 76556, 76152, 67812, 103347, 125677, 58598, 2458, 10261, 4758, 2790, 8851, 31099, 9763, 7380, 4438, -1937, 5069, -613, 10325, 17607, 13107, -22519, -50923, -69679, -42734, -36367, -57699, -74956, -48983, -24834, 27413, 46581, 67220, 38066, 34311, -4417, -40031, -2812, 8925, -35911, -28952, -63531, -51260, -14973, -21856, -32519, -40627, -41229, -45177, -32563, -18965, -40797, -15575, 12128, 12773, 6931, 17831, 24329, 24379, 35860, -1371, -38160, -14839, -18161, -22716, -23655, -24751, -35419, -33854, -71805]
13441g1805M758M6043J6783M592J0178j0554R270K4752o577M0650k626m0715k3769
13428I80Q508l425K218L924Q014P022J2675J545k8746k0077J2200L59j372L2045
13414C5870j547J5694k047l5251K1453J4362m384J727p205R846q087m6411j0740
13401a6720r326K4821K7820J2797L844j7181m8156n779j2840M0001M1354J399
13389D2034R877L0246k3149j5223Q920k6270m495j0879j7225K3228J2313m2407
13377a3030n94K200k5118J2184K3130L3112K3179K6985J6287j1556k1256j0068
13365E5455j9556r965l5484J2030J4082L890l806l1504L1145M9168J7628k5474
13353E7609j0752J958l329l1952o193j1970n7484J297q222r057j5834k120O0949
$$ y = [-71805, -67047, -21004, -4221, 371, 10549, -5, 9265, 34017, 27440, 68090, 65464, 24749, 980, 9488, 6063, 8281, 12205, 20219, 27241, 39916, 41461, 12715, -7362, 4838, 5197, 3825, 35870, 34323, 50017, 47970, 12719, 34172, 48534, 44150, 45877, 38672, 48518, 40431, -5980, -16720, -26046, -1225, 26595, 39392, 43236, 26055, -22101, -27880, -40720, -719, 40635, 42034, 51911, 82157, 59008, 43785, 52705, 26435, 21940, 11061, -6164, 17064, 29377, -13030, -13624, -11424, -36542, -24358, -1228, 31884, 55063, 82048, 98335, 86779, 65523, 55455, 35899, 25934, -9550, 2480, 16562, 20452, 16646, -14858, 16287, 65455, 83083, 57609, 46857, 48815, 45486, 13534, 7341, -4629, -62113, -60816, -69038, -78095, -93929, -96049, -35100]
13340c5100O9084O4788o838l0282J0365j7013o588O709k6269k6603r18K4809L018
13327B9162l8227j0871K6377J6636K202o07j1972k1502R524o886O3K1032j9979
13314e048m9943L2202M8077K9964N857J1565m8705l4200L4731K8056J6830k0546
13302D8840n0119k2712j0966J1139K9045P322j0918p815M4456K9600j0527l9231
13290A8114k3251k4282R182o878j5179k7983P1007M434n3857j3685o981k094O0569
13277a0884O4317K3173J8676j8784m9852o018O572J548L3684J0298J8563m1323
13265D9970k1527R937l6704n1845j9280k419P0136M8787o003j4268K22j0066J4480
13252C1420J5076J128R234R801q5092j7787L1632J4907O780M49Q359P492j2545
$$ y = [-35100, 33984, 98772, 91934, 61652, 72017, 55004, 48416, 55125, 28856, 2253, 1335, 26144, 29162, -9065, -19936, 6441, 23077, 25279, 24672, 12700, -8802, 722, -6164, -6101, 14931, -5048, -54991, -22789, 25288, 55252, 61109, 72674, 23969, -10231, 24500, 52556, 69386, 48840, -1279, -23991, -34957, -23818, 5227, 12549, 1631, -6184, 38272, 67872, 57345, 18114, -5137, -29419, -20237, -27115, -42294, -70277, 730, 5164, -48693, -62378, -69359, -71453, -10884, 53433, 76606, 95282, 76498, 26646, 20628, 27200, 28748, 62432, 72730, 91293, 49970, 28443, 38380, 1676, -50169, -69449, -71868, -1732, 47055, 41052, 26784, 27006, 16940, 31420, 46496, 47624, 56858, 66659, -18433, -36220, -4588, 10319, 17099, 17548, 25907, 33399, 20854]
13239B0854l3523l9983J9966L294L5359m700o415J2826j2777L1033K1986J1670
13227E9590j762j9048k2239k2183k3782l0598l4519J3122j358Q257K2215L2656
13215a9649L4509j8324l2759j8423j2492K2382J5524R851P44K988P299J3751J0091
13202A5492J9965k131r366j745j9945m6010l2044P4737j93K9468j46j0615o905
13189A0562N861m2156l668M1595O2085l8538j1320k5972j6783l5609K6928l389
13177c0404Q46J4338N767k3023j9735m2157j0775N5917K8180j5380k6137Q250
13165e4313Q264j4905J1230K2607M7933k4488k0024K9959K0452j1983n9460J7557
13153b7171L0365J6184J5233q545N798j1336q989q005j269K6718o424o4858k1131
$$ y = [20854, -12669, -52652, -32686, -29392, 5967, 1267, -5148, 7678, -5099, 25934, 47920, 59590, 57828, 38780, 16541, -5642, -29424, -60022, -94541, -81419, -82777, -74520, -52305, -19649, 14860, -3464, -36223, -54646, -67138, -44756, -29232, -19381, -18637, -15649, -8350, 5401, 15492, 35457, 33326, 23960, 22215, 2270, -43740, -75784, -1047, -1240, 28228, 28082, 17467, 10562, 16423, -25733, -29401, 12194, 74279, 35741, 24421, -1551, -18334, -53943, -27015, -30404, -29558, -15220, -9453, -32476, -52211, -94368, -105143, -49226, -21046, -36426, -62563, -54313, -46049, -60954, -49724, -27117, 20816, -3672, -23696, 6263, 26715, 14732, -44728, -27171, 3194, 19378, 34611, 26066, 31864, 20528, 11539, 3534, 2265, 28983, 22559, -42299, -63430]
13140f3430J6728k6793Q871L1549K3412K9155j7829L1882P869q098M370m708l7485
13127d507j9510j2963Q454J1971M487J4082j6297J7069p506j8226M6557J0155
13115C3766k0068n512J5730n7612r615J0406K2075j0963j313m3307M070K0238
13103d2105K1342k2288k0469Q846N3917J2471m1324j4040J653m055K3825K9965
13091G738N934L7221K4881m7537o4465J1238P8528J9495l1250k0082J7200L415
13079D2316j2749j8315n742K1119j4373j2230j5727j790j2286L5968n96j9201
13067a3606K5452J3066K3038K9041Q088k2959n8502l2060k969J7581M3692K5581
13055E5443p873K686m2228j3370L0288K5537m181k8679r016l3587J1038J4335
$$ y = [-63430, -46702, -73495, -64624, -33075, -9663, 19492, 1663, 33545, 41414, 33316, 37686, 32978, -4507, -24017, -36980, -28526, -16555, -12068, 2014, -14283, 2786, -4720, -22946, 23611, 33766, 13698, 8186, 23916, -33696, -43311, -32905, -10830, -21793, -23106, -66413, -62343, -42105, -20763, -43051, -63520, -54674, -757, 11714, -29610, -43650, -41997, -46052, -22227, 7738, 13672, 50893, 75774, 28237, -36228, -24990, 53538, 73033, 41783, 21701, 38901, 42316, 29567, 11252, 5510, 26629, 12256, 26, -15701, -17491, -29777, 6191, 5595, -13606, 11846, 24912, 47950, 76991, 85079, 62120, 3618, -28442, -31411, -13830, 29862, 55443, 47570, 50256, 8028, -5342, 24946, 50483, 46302, 17623, 8607, -24980, -13942, 393]
13043C93j3738l962j382q195l6821o623K6645J8412J8472Q91P784O734m3933j6105
13029e1428j7945k6289K012N3074L8234j3294m3816R57k6414J7633K2703K2346
13017b2227j1606k6408K0747J3568Q067K8701L7615K0867k1446n5768p3877R033
13005g2734o331K2407n148J7930r751n908k437P447Q771M41O7235Q26l6585K0477
12991F640j7131k6896j882M306O3751L0878m7598j8913l5268k592K8870K3585
12979G750K5706j0448L5057L1029P273m165j9416K3747J774o236n2666k2523J6984
12966C3866l3474k0497L3054j347o555K5254O18m8801l6065J5274l8242j0576
12954h7491J8643L9394L6207j2536k9647j6443K2632K1182K2769l3364j7555P36
$$ y = [393, -13345, -17307, -18689, -26884, -63705, -70328, -43683, -25271, -6799, -5908, 1876, 8610, -35323, -51428, -69373, -95662, -93650, -40576, -2342, -15636, -59452, -58495, -84909, -67276, -44573, -22227, -33833, -60241, -39494, -25926, -17859, 10842, 48457, 69324, 47878, -7890, -81767, -72734, -79065, -56658, -61806, -43876, -53627, -59535, -61972, -54525, -45754, -45313, 21922, 22748, -13837, 6640, -10491, -37387, -39269, -34963, 28788, 59666, 12068, -6845, -42113, -44705, -15835, 7750, 33456, 23008, 58065, 89094, 96367, 92202, 72786, 96533, 98307, 92071, 39405, 16882, 33866, 392, -20105, 12949, 11602, 5047, 30301, 30919, -17882, -53947, -38673, -76915, -87491, -68848, -29454, 6753, -5783, -35430, -51873, -29241, -8059, 14710, -18654, -36209, -35473]
12942c5473k3846N2845M5167M180J0313j8753m182J7721l6567J1467L9046l827
12930E8091k4193J508j4166k4009L25N290P193o594Q723J2067l412L9883M263
12917F4969M316j8849k1305o881l0718j0852n088J120l580K1192M0949K6758O124
12904F8155q753j3620O54j3335k0177L3946q638p216k1054P746Q728l118L3727
12891E7045j8676j9173P380k3109k549K7867L2131j7603l3254j3549l0427K3908
12879a0009L4431j7927l1950j5016N13L2029l6282l1734J537J507L6797j187l0174
12866f7465J6936J3009k8450k3181K6411L5366K2166N116J0144k6660k7213p910
12854e1731N1219N549j994n699k6155r331O533j7331L217L1926r36m5417k7147
$$ y = [-35473, -59319, -6474, 38693, 42873, 53186, 34433, 30251, 47972, 11405, 22872, 61918, 58091, 33898, 35406, 21240, -2769, -2444, 2846, 10039, 3445, 12168, 24235, 20823, 60706, 64969, 69285, 50436, 29131, 22250, -8468, -19320, -24408, -23288, -26868, -5676, 35273, 62031, 68155, 59402, 45782, 46436, 33101, 12924, 46870, 38232, 31016, 9962, 17708, 26436, 23318, 57045, 38369, 19196, 26576, 3467, 918, 28785, 60916, 43313, 10059, -3490, -33917, -10009, 24422, 6495, -25455, -40471, -39958, -7929, -44211, -75945, -74408, -72901, -36104, -37291, -67465, -50529, -37520, -65970, -89151, -62740, -27374, -5208, -92, 10052, -16608, -43821, -51731, -512, 5037, 3043, -2656, -28811, -38142, -31609, -48940, -45723, -13797, -14733, -60150, -87297]
12841h7297R056M9941L3948R76J417m006j8229Q381j1041m372K5255N818l3806
12828b3959j6744l3839J8136L7602j659O369N502K1585k2716K5693L7683L1840
12816H5493K030o4159J266k3456k7855J2021q196l0697K2561J3903j9165L1475
12804d779N3870J5970j8526l5409l975n533l5797j7794K3785P385j879K1137Q791
12791G246m9677p883O3211n78J5622J3910J8504j7551l7058m0735j4893J3768
12779c6114J615M1219j0366k4715j9593k3615m676O0438L8488J0580L1537k0459
12767D4339n329m2467O548j3568j6860J0965k829k2549P723K4774M8567K7749
12755F7063m5995p3159K1318k6995k8983J7053j738O4687J5901K1338l3137k9007
$$ y = [-87297, -78241, -28300, 5648, 6624, 8041, 4035, -14194, -5813, -16854, -21226, 4029, 9847, -23959, -40703, -74542, -56406, -18804, -20463, -14094, -8592, 12993, -9723, 15970, 53653, 85493, 87523, 23364, 24630, 1174, -26681, -14660, -22856, -53553, -30992, -17089, -36254, -4779, 49091, 65061, 46535, 11126, 7151, 1618, -34179, -51973, -28188, -20803, -22682, -1545, 7246, -42431, -50314, 12897, 12319, 27941, 41851, 60355, 42804, 5746, -34989, -49882, -36114, -34499, 6720, -3646, -28361, -47954, -71569, -76245, -15807, 22681, 33261, 64798, 44339, 39010, -3457, 3091, -10477, -27337, -16372, -19201, -41750, -34027, -9253, 39314, 67063, 21068, -52091, -30773, -57768, -86751, -69698, -71436, -6749, 9152, 30490, -2647, -31654]
12743c1654l9554J9711o38l1102k195K7563K8449Q350K2991K2071j760j9506l3683
12730c0957j4892N4397K1652j6882j7751J9106k1255m070J3145l1843k5723M639
12718e0434K0995J4371j1959J8517L8806K7746r005k2150r040l590p174n3056
12706d5973r388J8671M3562l158l3280N5154K2056K6968J1271k7567n7190n888
12694d762J2903j0822m0207k1984K3966k7268M6372L9239k6624K5575K0275J039
12682C7702j0847k8922p289K5471j6013o611l8952n469R004k0708J7030j1776
12670e7380M170n595M8618J6136q250l00J1885J4704r478l2779p8370J6084O9561
12657a0994o38l7913j6678M7143K9279k1086L1L0093j5317j4635o851k3430J8726
$$ y = [-31654, -71208, -51497, -52135, -83237, -85432, -57869, -29420, -21070, 1921, 23992, 22232, 2726, -30957, -45849, 8548, 30200, 13318, -4433, 14673, -6582, -10652, 2493, -29350, -55073, -50434, -29439, -15068, -27027, -8510, 30296, 58042, 49037, 26887, 17847, 14257, 7083, -45973, -55361, -36690, 6872, 3714, -29566, 25588, 47644, 74612, 85883, 58316, 1126, -4762, 8141, -2681, -42888, -64872, -40906, -68174, -21802, 17437, -9187, 16388, 36663, 37702, 26855, -2067, -9356, 16115, 102, -6509, -45461, -50930, -41926, -62634, -45604, -57380, -53210, -58805, -10187, 5949, -2301, -2601, 9284, 23988, 14510, -18269, -96639, -80555, -10994, -11632, -49545, -66223, -19080, 10199, -10887, -10856, 19237, 3920, -10715, -17566, -40996, -22270]
12644b2270J4917r80Q609J456J1188j1902K1027m355N810j5890K4614l004k2309
12631F911M581j7791K9811j7149L577L8871J1899k1450j8647K506K9683M5416
12619I8218J1842k1865j0302l1993j3386J0101J8088k086L000j1518p515j9118
12607B3466O239R635o2066o4665k6557M649N5600N8615J1264k8214p994K1162
12595A134l8205k9055L7062Q800j5317J6256M1856j0028j6575l2023J2668K0318
12583c109o283l0346J6282N6493L4809J6711N376J0136l9211l2043J3636j7826
12571B4625j8510j9176p635J6687k82J0843J6390j68r102J371J2377L3969R54
12558F2343q667o8772m0300J7794L4138j5381n5866J3420N4912K7653j8792k5505
$$ y = [-22270, -7353, -8333, 276, 1732, 12920, 1018, 22045, 17690, 23500, 7610, 32224, 29220, 6911, 11492, -6299, 23512, 6363, 9940, 48811, 60710, 39260, 20613, 23119, 52802, 98218, 110060, 88195, 77893, 45900, 32514, 42615, 60703, 58617, 61617, 50099, 42584, 23466, 29705, 39340, -22726, -87391, -113948, -109299, -53699, 4916, 16180, -12034, -20028, 1134, -37071, -66126, -29064, -20264, -35581, -19325, 22531, 12503, -4072, -36095, -23427, -3109, -9392, -39738, -23456, 33037, 67846, 84557, 89933, 100069, 60858, 28815, 42451, 24625, 6115, -13061, -20696, -4009, -4291, 6552, 22942, 22774, 13672, 15043, 27420, 61389, 62343, 53676, -15096, -55396, -37602, -3464, -18845, -74711, -61291, -6379, 21274, 2482, -23023]
12546b3023N367J0829L0707J6557p550J2351M453o4143j8141q705J9678L122K1936
12533C438L1167o7705N459P804j4955L2847J8764j6982k390K1763Q606J5577n346
12520C8047k6616l9120j6445R532n052k3683L3013K2698k1506K2146l3363j5855
12508e6204L8743K2521r037J9734l6936m7556m321M103m150J5465O0954n424k5200
12495b7308j3376K0260N2494M7964L1291k8026n3883n1034R867M004j5853k6834
12483e0434J3991K1283O5126Q918o6078K0757M0205l587n3688M463L0276l6876
12471e644l1383J8006k3090n1142o34M4207N900L6247j7407k2633l6189k804J072
12458h5494L5123k3121K0963N4158l937l6704O962O256j4095j9159j0575N9008
$$ y = [-23023, -17656, -6827, 23880, 40437, 32887, 45238, 49691, -14452, -32593, -41298, -21620, -18498, 3438, 34605, -33100, -27641, -19837, -34792, -1945, 16819, -163, -2553, 19210, 27816, 43393, 38047, 11431, -27689, -44134, -34602, -39654, -63337, -30324, -7626, -29132, -6986, -40349, -56204, -17461, 5060, -3977, 15757, -21179, -68735, -73056, -68953, -73103, -57638, 3316, -2108, -27308, -40684, -20424, 32070, 80034, 111325, 83299, 29416, -21618, -11751, -7747, -23600, -50434, -36443, -15160, 49966, 58884, -7194, 13563, 53768, 50181, -3507, 956, 31232, -5644, -37027, -19021, -42111, -93253, -93887, -49680, -43780, -7533, -24940, -47573, -83762, -86566, -85494, -50371, -73492, -52529, 1629, -2308, -39012, -32050, -25794, -39889, -59048, -69623, -10615]
12446a0615Q605k8824L4219j3543o4139L5703J0060j2325j3609K765N869K4259
12434b1575k6024L300M1710k2187l0026J2889N3415M9566l1511n9319j0656J0190
12422c0228m256k7375M5102J0517J7358j8561j1166R375O505j7399Q474r601k9068
12409e0323j7398M586M0328M0493J7333M4670m3494n3191l8301J8779J6544M686
12397a5288p216m771M312K3359J2448j9100J8593l3309m0744p292J489r306k2077
12384i8902q26J0433R06K9794N0688j2457M687N5703k0063J259p30r925j975L7983
12370D6575K9482j5478k3085J3846l2969l0406m5621j3541j9846L0173k6690J2996
12358g4564K8983N71r746M5175K7831M5637J533o7117l8263j5721Q623j4690K74
$$ y = [-10615, -2010, -30834, 3385, -10158, -74297, -38594, -28534, -40859, -54468, -51703, -45834, -21575, -47599, -44299, -2589, -24776, -54802, -41913, 11502, 61068, 29557, -29762, -40418, -30228, -34484, -61859, -16757, -6240, 11118, -7443, -18609, -9234, -2729, -20128, -11654, -21255, -50323, -67721, -63135, -22807, 17686, 35019, 79689, 36195, -16996, -55297, -36518, -19974, -15288, -22504, -27275, -22963, 396, 12844, -6256, 12337, -20972, -61716, -69008, -67519, -76825, -98902, -99728, -89295, -88389, -58595, -7907, -20364, -15677, 40026, 19963, 21222, 20492, 10567, 8592, 46575, 76057, 60579, 37494, 51340, 18371, -12035, -57656, -71197, -91043, -60870, -87560, -74564, -45581, -45010, -54756, -9581, 18250, 63887, 65420, -1697, -39960, -55681, -47058, -61748, -61474]
12345f1474J7078M7075J2862K7568k3311j3948J6889k0074j0869O1520J7081m4328
12333B6069m5795l6978l1225q160M8836k5417o197K4056M0437L0532j0483m3734
12321c8059k1084J7752K590k0365j1069L195L5084O64N51K3471j3646l5947L8021
12308a8842K2665Q103k0360l6360j0013j0800j8086J3543M3469J6120j3879n473
12296b9913K6571l2758l9817O417J8539J513K8951r917K9034J8647j5187N398
12284G478M098L0734k2341m4276j5845j5213N5359M0945Q468l141K501j9030l5524
12271e787N918l2923j0127o657K4706L0333R459l3639k0964r774K6525P769o534
12258b1695J354L1612j766o192l4078j7592q035k4237L0423M0054J6088k2576
$$ y = [-61474, -44396, 2679, 15541, 43109, 19798, 5850, 22739, 2665, -8204, 53316, 70397, 26069, -19726, -56704, -87929, -96089, -47253, -72670, -78867, -54811, -14374, 16158, 5675, -38059, -59143, -41391, -38801, -59166, -70235, -67040, -31956, -31292, -30741, -7270, -20916, -56863, -18842, 3823, 11926, -8434, -44794, -54807, -65607, -83693, -70150, -26681, -10561, -24440, -29913, -3342, -36100, -75917, -69500, -50961, -49448, -20497, -30414, -1380, 17267, 2080, 7478, 11576, 42310, 19969, -24307, -40152, -55365, -6, 40939, 49407, 46266, 48767, 29737, -5787, 131, -32792, -42919, -49576, -24870, 5463, 14922, -18717, -39681, -49455, -22930, -15161, -21695, -20341, 11271, 9505, 3313, -30765, -48357, -56392, -80629, -50206, -10152, 5936, -16640]
12246a6640N568R200o951m0582k0166Q176L1585L9129n010k4810J6591J2082K3543
12233C1715J3564l2873k0111r648K9876j9693k6120N432M5207K8587o079j6656
12221B3201j109Q401r974r750k5667n3924k8150n698k9317J3020l601P313J5878
12208i9377M6060L5284k6296J5860R713J835K0095K2530l0982M43j6071l8373
12196e9279m3393J1482L37J216l7263p084N1377M7350j1027j4191k761l346N306
12183f1276M571L1169j7243J798J9641J6316L4646L3298O589q282m2760m8399
12171b9932k2342O826J8006K7240K2355q635k0297k6621J7200L0894L471K5335
12159D3500p64k1858k2052j7912r14J5652K657j969J4188L5176L3128M824o228
$$ y = [-16640, -11072, -1872, -8823, -49405, -69571, -61395, -29810, 9319, 4309, -20501, -3910, 8172, 31715, 45279, 12406, -7705, -17353, 12523, -7170, -33290, -27858, 17349, 45936, 39857, 23201, 22092, 30493, 20519, 10769, -14898, -68822, -96972, -102670, -131987, -118967, -122568, -115255, -99377, -53317, -18033, -44329, -28469, -18756, -16921, 3174, 25704, -5278, -4835, -20906, -59279, -102672, -91190, -90853, -89637, -126900, -133984, -82607, -35257, -46284, -60475, -63236, -66582, -61276, -56705, -25536, -42779, -40981, -21340, -5024, 29622, 62920, 69509, 61227, 18467, -29932, -52274, -45448, -27442, -202, 22153, 13518, -6779, -33400, -16200, 14694, 18165, 43500, 42736, 20878, -1174, -19086, -20000, -4348, -1691, -3660, 10528, 45704, 78832, 83656, 77428]
12146G7428k4471l9419j3809q501Q80r072n938K8391K369O330J2714j9761J606
12133H747Q008L7959q674k4633l6623j3701M5657R73j9485K1428j3669q4051m1786
12120a19850N327N0742M4214r31M4677J8796k8456n403Q443K375l0298q256M2734
12107B4114k8661k4742K3464N683M238n5541J772j3953k5771k5832L2237L5721
12095d7271J9421L2007Q383O027j8739m3696N65K2306m405p546j600M0028K0149
12082B5629l3205p950J3454j9371q121O485n1075j0200J5811K1469N6287Q626
12070A7839l5710o55K615k261L3114K4795m406j6628J3195k1181j753J910j0792
12057H2k0985k2177K9530N1700M530m7855j4643J5877K3358J6957Q124O954J902
$$ y = [77428, 52957, 13538, -271, -8772, -7892, -16964, -22902, 5489, 7858, 14188, 26902, 7141, 8747, 16755, 54714, 46040, 21407, -15216, -28917, 16740, 17713, -1772, 19656, 5987, -78064, -119850, -114523, -63781, -19567, -20498, 24179, 42975, 14519, 9116, 17559, 19934, -10364, -18620, 24114, -4547, -29289, -5825, -142, 4096, -51445, -49673, -63626, -89397, -115229, -82992, -47271, -27850, 4157, 12540, 18567, -172, -43868, -43303, -20997, -25402, -32948, -34548, 5480, 25629, -7576, -15526, -2072, -21443, -29564, -23079, -74154, -84354, -68543, -47074, 9213, 17839, -17871, -18526, -15911, -18172, 14942, 39737, 35331, 18703, 31898, 10717, 8964, 10874, 82, -20903, -43080, -13550, 38150, 42680, -5175, -19818, -3941, 19417, 36374, 44498, 51452, 53354]
12044E3354j5232j7572J1446p925j1348k8276n1224R481K1994P3852O866k9438
12032A5978J0883n4534q90k1420R04k0477r542L2293P478k086P014O09j6615k2107
12018g2512K0909J4793M2230K6687j7798J2158j2658J1526l0861j6348R548J6373
12006D047j0398R26J4757K4241l0082k2466J8029n883K9816L5578l9144Q788M4817
11993G3026J2370j8381j6746n3475l9032k3051K6579N7437j7665k7397P115K6469
11981G249K8225N649n4322k6483J8956P077p434J0300o3559m5785J0152M2765
11969f7210K961K3424J7529k889M994m343K4603L0294m884k8057m1614p884K9147
11956b3929J5740k9181J8427L7953J1072l8147j1312J1724O420k1483p846m3388
$$ y = [53354, 38122, 20550, 31996, 24071, 12723, -15553, -66777, -57296, -35302, 38550, 45416, 15978, 26861, -27673, -28563, -49983, -49079, -69556, -79098, -46805, -39327, -41413, -34399, -33790, -50405, -72512, -51603, -36810, 5420, 32107, 14309, 26467, 13809, 25335, -5526, -21874, -12326, 4047, -6351, -5425, 9332, 33573, 3491, -18975, -946, -6829, 22987, 58565, 19421, 28209, 73026, 85396, 67015, 50269, -3206, -42238, -65289, -38710, 18727, 1062, -26335, -19220, 7249, 35474, 41123, -13199, -39682, -20726, -13649, -21083, -10783, -74342, -120127, -109975, -67210, -64249, -40825, -23296, -26185, -21191, -25534, -931, 29363, 24479, -3578, -45192, -53076, -23929, -8189, -37370, -18943, 19010, 30082, -8065, -19377, -7653, -1233, -22716, -30562, -73950]
11944g3950J2199M6268R195J3081J6254l2183j3562K0915K3275l5890q258J8142
11932d514K614k3985O297q635L6048K1133j1426m6818k1146J0054P659J7879J7590
11919B750L5573J6840j2536N244P341P353n2987Q671m85O00P159r037n8223k9008
11905g0745O391k8458L4324N1489L6934q57l6216K8197k0124q52K729Q316j4005
11892b877j8608M845o7j5741P404L9374J7833j7373j0446O1539L1420j6330m4452
11879C6521j0556j1176k57K7994J2824m2273m4629J2603j3612J386m231L0104
11867e302K4134K6037L1488k2258m5374k6157K6078K8051j5072j8064P982j5182
11855c639l6386r88K7825N302n6333j966K3337m810k426M0908j086j5976N51o192
$$ y = [-73950, -61751, -15483, -6288, 6793, 23047, -9136, -22698, -1783, 21492, -14398, -22656, -4514, -1900, -25885, -19588, -28223, 7825, 28958, 17532, -29286, -50432, -40378, -32719, -14840, 2750, 38323, 55163, 42627, 47871, 55212, 62565, 9578, 18249, 17764, 18364, 25523, 16486, -41737, -70745, -64354, -92812, -58488, -6999, 29935, 29078, -7138, 21059, 935, 83, 2812, 11128, -2877, -21485, -16640, -16707, -32448, -25044, 14330, 32163, 14790, 4344, 65883, 97303, 80973, 36521, 25965, 14789, 14532, 42526, 55350, 13077, -31552, -18949, -32561, -31175, -35406, -5302, 18832, 44869, 76357, 54099, 8725, -17432, 8646, 36697, 21625, 3561, 11543, -3639, -40025, -41013, -13188, -7886, -64219, -66185, -42848, -47658, -50084, -9176, -10262, -26238, -25687, -31879]
11841c1879K17N014L6949K2828J0190M4146l9035J9698k036m0311l4110l1593
11829c9922j6684J8793k3418l3860K8160P0405K3106j9915j1543J269k5116o136
11817c4861J0300J311O142M146j0107J6831Q030J7596n79K8571L8350m4936l8497
11804B297k8974l986J0901k3904j9265M7305K3159l249k7533j0406P714N674k7438
11791d7705J5871k2744k1642N555P813L9562l7886k6450K6064K1586J591J8847
11779a9538P759n1846J093K9053R450M9847j1978j2581j4536k115K9984k8201
11767a3609N230j1044l794K9445j1602j6681J9273p785L2760o708m5186K1798
11755g903m286l9475k7604N6929M8765j5069m1616k8367K5812M3354k8797K5851
$$ y = [-31879, -31662, -26648, 10301, 33129, 43319, 87465, 48430, 68128, 66092, 25781, -8329, -39922, -56606, -37813, -61231, -95091, -66931, 3474, 26580, 6665, -4878, -3609, -28725, -34861, -24561, -23250, -17108, -12962, -23069, -6238, 1792, 19388, 18809, 47380, 85730, 40794, 2297, -26677, -30663, -19762, -43666, -62931, -15626, 7533, 4284, -23249, -33655, -25941, -20267, -47705, -31834, -54578, -76220, -70665, -62852, -23290, -61176, -87626, -61562, -39976, -38385, -19538, -11779, -63625, -62532, -33479, -24029, 25818, 13840, 1259, -13277, -15392, 14592, -13609, -8379, -19423, -23217, 6228, -5374, -22055, -2782, -10567, 22193, 15485, -29701, -7903, -12189, -51664, -79268, -22339, 26426, 11357, -30259, -58626, -32814, 10540, -18257, 7594]
11743G594l0315k6532l7141O1906L2480k1275m0423o240l3467J0570Q92N420K7614
11730d8917L2217J5877r725K7841j5604k0687l846R264K0339l764p6169m5809
11718a18983N7745O7325O2582L4664l5688l7850j5241m2993l6686k609J9420R984
11706c8330o524l802j4371K7466m928m4137j7325k3152N2659j7363j4188r323
11694a13318j3601N8389J9733k2922J2436P024K7434K7113k7075j4436l655q94
11682d3772L202K6164M056m7202k4457R833j117N3626N8718J5912k8574J1207
11670C7596M339k8764j7328M0238n299k151l6812j571J3420l5941m11o225j7425
11657e6334K8676M298j1220K3349l1158l1216M7060J7430k4320M394m1071N3776
$$ y = [7594, -22721, -49253, -86394, -24488, 7992, -13283, -53706, -59946, -93413, -82843, -81951, -76531, -48917, -16700, -823, -10548, 17293, 1689, -18998, -22844, -13580, 6759, 2995, -73174, -118983, -61238, 6087, 68669, 103333, 67645, 29795, 14554, -28439, -65125, -67734, -48314, -38330, -44854, -48656, -63027, -35561, -40489, -84626, -101951, -125103, -72444, -89807, -103995, -113318, -126919, -68530, -48797, -71719, -59283, -52259, -24825, 2288, -24787, -39223, -42878, -43772, -40570, -14406, -10350, -57552, -82009, -72176, -73293, -19667, 39051, 54963, 26389, 37596, 41935, 13171, -4157, 36081, 30782, 28631, -8181, -9752, 3668, -32273, -32684, -38909, -56334, -27658, -23360, -34580, -11231, -42389, -73605, -26545, -9115, -33435, -29041, -70112, -16336]
11645a6336L6441k9927k2521k6137J41R101k2817k2650K7716L9978k3808r865
11633f0684M470K6561L732l1181M765L6640J2052l572k586j2225l967l9841L6506
11620b9330Q753l9898J9130M7656L5151j4845q2694l9375Q667l4950K9937J07387
11608A5589L3891m4138J8551J9344K992L827L17k9431m438k5814k2073k3534L4893
11595b0024K126j9982r842L0410M1463o6586M498K6627j3782l0925J3121J6177
11583b6719k0965N6537L2609N795l6120l1925j2702J8415P067J3192J4385K940
11571B2509K7760l8417o7487l2325K3606M1619J1445p530R360L1445k8239m704
11559a0958K2432Q075l0649l2868j2489L2754K9772j0483l1472N3862J6379k5917
$$ y = [-16336, 20105, -9822, -32343, -58480, -58339, -49238, -72055, -94705, -66989, -27011, -50819, -60684, -56214, -29653, -25921, -57102, -52337, -15697, -3645, -7217, -9803, -22028, -25995, -65836, -29330, -20577, -60475, -41345, 6311, 41462, 26617, -56077, -95452, -86785, -121735, -91798, 15589, 49480, 5342, 23893, 43237, 46229, 50056, 50373, 20942, 16504, -9310, -31383, -54917, -20024, -17898, -37880, -47722, -17312, 24151, -42435, -37937, -11310, -25092, -56017, -42896, -26719, -47684, 8853, 41462, 47257, 11137, -20788, -33490, -15075, -8008, 5184, 19569, 22509, 50269, 11852, -55635, -87960, -64354, -22735, -11290, -18820, -9460, 21985, -6254, -10958, 11474, 19549, -11100, -43968, -56457, -23703, 6069, -4414, -35886, 17976, 34355, 8438]
11547H438k5995l4599N388O298O1729J0304l7093k844r249J9918k496k7102j3399
11534d0702R675p597J4929O1753J7712l4629l1294j4319J2123L930j7283l2083
11522e7785K792O5862J9966L76k344m6520p318K9882k9386k1582N138q931j1143
11509f0993J003k0473L4360O064m28J790k3251J8317m88K6268l156J8039O9447
11496F6499K9285M23L0767L1842j0888O568R812P6392N8029J06220J99136K81858
11484H85943M96835O70007M65936p9833l73166k82888k97442l45978l02338k16121
11474F20955j82237j17135p0172m9218l7913j8650l1874k6942k2570m4906j5838
11463C500J8112j8280j6984J4958L0474M3024l2078l7968K6312J9880k4782o3089
$$ y = [8438, -17557, -52156, -46768, -40470, 21259, 31563, -5530, -8374, -17623, 2295, -201, -27303, -40702, -31027, -38624, -23695, 38058, 55770, 21141, -10153, -24472, -12349, -8419, -25702, -57785, -54993, 10869, 30835, 31211, 28867, -17653, -24971, 4911, -24475, -46057, -40919, -49850, -60993, -59990, -80463, -46103, -40039, -40467, -38677, -61928, -43611, -44099, -17831, -20987, -2948, 66499, 95784, 96207, 126974, 158816, 147928, 154496, 164308, 240700, 298729, 404949, 604085, 885943, 1382778, 2052785, 2518721, 2438888, 2065722, 1782834, 1485392, 1139414, 837076, 620955, 438718, 321583, 251411, 202193, 164280, 145630, 113756, 86814, 64244, 19338, 3500, 21612, 3332, -13652, 1306, 31780, 74804, 42726, 4758, 31070, 50950, 26168, -36921]
11451c6921m7833j273M3617J9374l338o81K1027r601Q005o148q2098J9923J00779
11438B4832K0399l4849k3903M12J730J7508J692J2685L0259k8586n0499k0744
11426d9064L6151m836n7062p1921k1753O5033N9032J2771k3296m756K5424K0318
11414a3959K967n537j8480K703k6436P135K1676n936m1851m4149L9337M7800r129
11401d3859J4651P8793K7589j3377l1912k4269j8961l1477j431j6053j9340K5079
11389e4567Q421m803J073k9100r426N9090J8100l4480L6567N9391O583J7355Q332
11376H2536J183m1245l1171j3616K132k0761l8211J2953n282p905k1200j6801
11364i7388K6172K6125J379k1943r994L1825N5021N2086L1046n0878l4794J3092
$$ y = [-36921, -84754, -86027, -42410, -23036, -26374, -27055, -6028, -15629, -7624, -13772, -95870, -75947, 24832, 45231, 10382, -13521, -13109, -11379, 6129, 7821, 20506, 50765, 22179, -28320, -49064, -12913, -17749, -74811, -146732, -168485, -103452, -44420, -31649, -54945, -59701, -34277, -13959, -10992, -16529, -35009, -32306, -58742, -51607, -29931, -35867, -77718, -121867, -82530, -34730, -43859, -29208, 49585, 77174, 63797, 31885, 7616, -11345, -42822, -44253, -60306, -79646, -54567, -46146, -50949, -49876, -78976, -88402, -29312, -11212, -45692, -9125, 50266, 56849, 74204, 82536, 83719, 42474, 11303, -2313, -181, -20942, -59153, -46200, -51482, -59387, -80587, -97388, -71216, -45091, -43712, -65655, -75649, -43824, 11197, 63283, 94329, 43451, 8657, 21749]
11352B1749m7175m1878L0562N0189N2928R366R838J2175k8463O137K8459j3514
11340I0373k2793l5976o783P126j0008M431L1532L5402q251j1716K5012K5436
11328A23785J5903l1384l66N4944M7148K774L8083K6308j2154p3246o1212n3983
11316G6600J6581l2989J2242J986m7441K4399k155n4581k1118k0287k0770R936
11304e7597K7737j5021m3148J1808L1461J8989K7412j4488r295M5306J0360J3383
11292D6907j4831K6763J589K698m1443j3453k5084j8380M0800K2419j618M3788
11280G0155O999J4913K2520Q472J5595Q622J953k1013J2125M4065L4904L2941
11268B52251K8116K3149l1844J6763n0098n7450n4746p4546o0431k6056l8836
$$ y = [21749, -25426, -67304, -36742, 13447, 66375, 75741, 85579, 97754, 69291, 75428, 103887, 90373, 67580, 31604, 24821, 31947, 21939, 26370, 57902, 93304, 85053, 73337, 98349, 123785, 139688, 108304, 107938, 162882, 210030, 212804, 250887, 277195, 265041, 191795, 130583, 76600, 93181, 60192, 72434, 74420, 26979, 51378, 49223, -5358, -26476, -46763, -67533, -57597, -29860, -44881, -88029, -76221, -44760, -25771, 1641, -12847, -22142, 23164, 33524, 46907, 32076, 58839, 60428, 63126, 21683, 8230, -16854, -35234, 5566, 27985, 26367, 70155, 77154, 92067, 114587, 123059, 138654, 147276, 149229, 128216, 140341, 184406, 219310, 252251, 280367, 303516, 271672, 288435, 238337, 180887, 126141, 51595, -8836, -34892, -73728]
11257g3728K6116M8541L7388N5636J4472L0813p375n9887l4555j2611l8948o1041
11245g5179M115Q3414L1311l2478P0l2167R143P805J3732L0443J2958j4187l0513
11232H467J4318M6672Q3805O0077l755k5071j0632M8022p551k5739p1013n7020
11220F0580N5674O9614j4792j9221m8492k6438k1142p875l9068j9257M8467l204
11208C4846P557q19J9781l653p906M549p676n4923p1875n3130L1274J17738L1633
11195D7396m213N803m282J7944J9930M9774L1160J8231J7080P1442l762l3653
11183B32850K0369K4554J4737p9791j4360k0474J2153j8810k6537k4774K3094
11172A43011J3842K938M307J6387j4784J6755j6580n5776k2085K1758L8416J2051
$$ y = [-73728, -47612, 929, 38317, 93953, 108425, 139238, 131863, 71976, 37421, 24810, -14138, -75179, -71064, 12350, 43661, 11183, 11253, -20914, -11771, -3966, 9766, 40209, 53167, 38980, 8467, 22785, 69457, 153262, 213339, 209584, 184513, 173881, 221903, 214352, 188613, 117600, 60580, 116254, 185868, 171076, 151855, 103363, 76925, 55783, 47908, 8840, -10417, 38050, 34846, 42403, 41584, 61365, 57712, 49806, 54355, 46679, -8244, -80119, -133249, -101975, 15763, 47396, 43183, 48986, 44704, 62648, 82578, 132352, 163512, 181743, 198823, 270265, 266503, 232850, 253219, 277773, 292510, 212719, 198359, 177885, 190038, 171228, 144691, 119917, 143011, 156853, 159791, 164098, 180485, 165701, 182456, 165876, 110100, 88015, 109773, 148189, 160240]
11160A60240L0283L2509L9268K9964M7555k8114l130K9403K882J4601N9752L7155
11148D52368L4474O2031P8796J39689K66688K24380R1136r6346r9144p0359j10141
11137I73572j55237j48465j06732n1702L3754M9975J6322J9764J3049K1899O782
11126F72981J680o946K797K1169O4076M0776K3969k612k3754r449M4181O1348
11114H90216N8783P3784M6774O6129Q0079O5016P8904R7264J88843J98896K58083
11103B102771K70854K97727K43864L22238M54210O88512R03121J107368Q97397
11094G288062L13094R923O4056J46959K13331M10565P68762J214691J767882K310946
11084A4508271K872940L611400M566888N910594P820952J0990600J6254051K5672968
$$ y = [160240, 190523, 223032, 262300, 292264, 339819, 311705, 308575, 337978, 340860, 355461, 415213, 452368, 486842, 548873, 627669, 767358, 1034046, 1258426, 1349562, 1253216, 1154072, 1083713, 973572, 818335, 669870, 563138, 511436, 545190, 595165, 611487, 631251, 644300, 666199, 672981, 674661, 667715, 670512, 691681, 755757, 796533, 820502, 817890, 794136, 784687, 828868, 890216, 948999, 1022783, 1069557, 1135686, 1215765, 1280781, 1359685, 1456949, 1645792, 1844688, 2102771, 2373625, 2671352, 2915216, 3237454, 3691664, 4380176, 5283297, 6390665, 7288062, 7601156, 7611079, 7675135, 7822094, 8035425, 8445990, 9214752, 10429443, 12197325, 14508271, 17381211, 20992611, 25559499, 31470093, 39291045, 50281645, 66535696, 92208664]
11076I2208664M2857862P4587686J19028899J22966246L0921308o5414865o5440909
11069C51714891n1736815o3880092o6169640n0873899l2752385k0704130j4194425
11062E1403505j0271460p638768n758044m379133l367651k629695k073378j689842
11054A3595534j423880j298423j145061p96546k80159n2424m35461q17373p12955
11045F633252o23031o47467o42922m91092k94390k45465k31053j82296j85845
11036C089691j48102r6721j24221j16537j76267j31963j23452o1536q2827j15842
11026A912223q6462o7483q9171q9997o6016m6286o9940j25442j03951j6268n6213
11015A094994j9458r57J653j1040O964j7360k0699p3859q7892l809m3983L909
$$ y = [92208664, 135066526, 209654212, 328683111, 451649357, 482570665, 417155800, 351714891, 299978076, 236097984, 169928344, 119054445, 86302060, 65597930, 51403505, 41132045, 33493277, 27735233, 23356100, 19988449, 17358754, 15285376, 13595534, 12171654, 10873231, 9728170, 8931624, 8651465, 8599041, 8163580, 7346207, 6633252, 6010221, 5362754, 4719832, 4228740, 3934350, 3688885, 3457832, 3275536, 3089691, 2941589, 2844868, 2720647, 2604110, 2427843, 2295880, 2172428, 2110892, 2028065, 1912223, 1825761, 1758278, 1669107, 1579110, 1513094, 1466808, 1396868, 1271426, 1167475, 1151207, 1094994, 1075536, 1074579, 1076232, 1065192, 1072156, 1054796, 1034097, 960238, 872346, 868537, 824554, 828463]
11003H28463n2196o0539n147L5484L1270Q717j20862p7875k2515n712J9255N3606
10991F31949j7909n2022j5194o210j3492l699j0472m8196m1408j9946P1413M3079
10979E17893n2J367m2921n2256l1443l8197J9541J161l6757J7063J1074j2583
10967C53890K4333j155k4720J787m5400m2574K4722j5161m2587n036k6584l8272
10955A63243K4898N994p822L0870O4395q872N23M5169J1547P3390J16378R0708
10943F10421J9241l9992k9762o7322m8748n3748P745L8231L6738o3784K2046l539
10931D27527m5494l4134k9018l1252k2811j3899j488k5742p3859n3686k1293J6925
10919I1776J1870n2104j5706M1357M1006N264J6772L5238N1963l1689J6823N2317
$$ y = [828463, 776267, 715728, 710581, 746065, 777335, 786052, 665190, 587315, 564800, 559088, 578343, 631949, 614040, 562018, 546824, 540614, 527122, 523423, 512951, 464755, 423347, 403401, 474814, 517893, 517841, 519208, 476287, 424031, 392588, 354391, 373932, 375093, 338336, 355399, 366473, 353890, 378223, 377068, 352348, 354135, 308735, 266161, 290883, 275722, 233135, 228099, 201515, 163243, 188141, 194135, 186313, 217183, 281578, 272706, 273229, 318398, 329945, 403335, 519713, 610421, 629662, 589670, 559908, 492586, 443838, 390090, 397835, 436066, 472804, 409020, 431066, 427527, 382033, 347899, 318881, 287629, 264818, 250919, 249431, 223689, 149830, 96144, 74851, 91776, 103646, 51542, 35836, 77193, 118199, 123463, 140235, 175473, 227436, 195747, 212570, 264887]
10907B64887J3268M5099L0211m074K464j3532N611n3793o1807k8448j6951L461
10895A86396k197j3568l0336n4310J4936K602J1653R1442Q8783M4370k33j2118
10883C27420n0203k7548p4588j0857M2l6466J2922J680j5016M7509N890j5122
10871A65663j7933L2806K4304n8249j0014k3108j2101K4546K8222k1585l7765
10860I4786k0339J2479J2482N910j9383J0532K8767L3427K3332M338R447l1180
10848A64598J0556K7973J8896m7151j5374R71J823P043J8291l5886r343L2964
10836A75361J3239P153l262Q126n68n9532n6488k618J7251j1602j8250q55j3371
10823E4584j3182J579K0021P6925M3613k9042n3672l1516j7264J6331q675n7358
$$ y = [264887, 278155, 323254, 353465, 349391, 351855, 338323, 343934, 290141, 228334, 199886, 182935, 186396, 184199, 170631, 140295, 85985, 100921, 103523, 115176, 206618, 295401, 339771, 339538, 327420, 277217, 249669, 175081, 164224, 164266, 127800, 140722, 142402, 127386, 174895, 180785, 165663, 147730, 180536, 204840, 146591, 136577, 113469, 101368, 125914, 154136, 132551, 94786, 74447, 86926, 99408, 105318, 85935, 96467, 125234, 158661, 181993, 186331, 195778, 164598, 175154, 203127, 222023, 174872, 159498, 160469, 162292, 169335, 187626, 151740, 142397, 175361, 188600, 195753, 192491, 200617, 200049, 140517, 84029, 81411, 98662, 87060, 68810, 67955, 54584, 41402, 42981, 63002, 139927, 183540, 154498, 100826, 69310, 52046, 68377, 59702, 2344]
10811B344l3435M3113M0819J2319k9520l3439j152L8454P692m2095k8352j8363
10799d1615L2976M0458j0170n776j1439J8593K5832M2798K7172k4955j1491j5319
10787F7064K3194Q784J2850J7216M4631p039j1854J9265j7564j2520k4368k6909
10775I2750J1964K3501q814L979l4236m3071K3460j8222O765k9597J7530L610
10763D9619M864J2398J6925k5654L096J6399O100k2655j0259l090k1505J335L7849
10750F5422k6607P100J1366j7167J4854O184j087l035J1689J2839k6256K821O753
10737F4876j6647K3565K1688n457J0875J8850K6447m6771o5666j1315O6309N4393
10725A41147l3203j3306J7602k2028n860K7360L0682l2483k1420L2152Q138l3894
$$ y = [2344, -31091, 12022, 52841, 65160, 35640, 2201, 1049, 39503, 47195, 5100, -23252, -41615, -8639, 31819, 21649, 15873, 4434, 23027, 48859, 91657, 118829, 93874, 82383, 67064, 90258, 99042, 111892, 129108, 173739, 166700, 154846, 174111, 156547, 144027, 119659, 92750, 104714, 128215, 119401, 123380, 89144, 46073, 69533, 51311, 58076, 28479, 46009, 49619, 54483, 66881, 83806, 58152, 61248, 77647, 83747, 61092, 50833, 47743, 26238, 27573, 65422, 38815, 45915, 57281, 40114, 54968, 61152, 60065, 57030, 68719, 81558, 55302, 58123, 64876, 48229, 71794, 93482, 88025, 98900, 117750, 144197, 97426, 31760, 20445, 86754, 141147, 107944, 94638, 112240, 90212, 84352, 111712, 142394, 109911, 88491, 120643, 128781, 94887]
10713I4887k2476Q809K0795J9331n212j678j7606k7604k7874P86l7501j1488M996
10700a835L330J5737L4024K2873O959l5126n886J6799N126R635N3480J1940j3475
10687A23581k6271m2059k7408n606M7218j0041o6202j701K6709J4477k8845k1316
10675a7464J8722L4949L0194n510J958K7386K9225L1036L1544N3123L7117N6830
10663C29110J06125J46997K34481L33258N88993O41725K03514l09790l62583l21427
10653A590403l08245l26158k38646j75426j36987j03930p6783o9158l8202P784
10643A24652K7012j7975Q7k3278k8958k0113M8572L0763j4343j0376K993l1014
10631H8022k7453J6834j255k3020p201m8934L1864J1572j2535l0791j4682K0397
$$ y = [94887, 72411, 81220, 102015, 121346, 116134, 114456, 96850, 69246, 41372, 42158, 4657, -6831, -1835, 1495, 17232, 51256, 74129, 81088, 45962, 40076, 56875, 62001, 71636, 125116, 137056, 123581, 97310, 55251, 27843, 22237, 69455, 59414, -6788, -8489, 18220, 32697, 3852, -17464, 1258, 36207, 66401, 60891, 62849, 90235, 119460, 150496, 182040, 235163, 272280, 329110, 435235, 582232, 816713, 1149971, 1738964, 2380689, 2584203, 2274413, 1911830, 1590403, 1282158, 956000, 717354, 541928, 404941, 301011, 224228, 155070, 116868, 124652, 151664, 133689, 133776, 110498, 81540, 61427, 109999, 140762, 126419, 116043, 119036, 88022, 60569, 77403, 76148, 53128, 45927, -3007, 28857, 40429, 27894, -2897, -17579, 2818]
10619B818L3421j5316J2878j016J4280l1384J4323J4775J4310K309j8539J7336
10607F0195K8075K227k1535k1070M0690j9719l3950k4298l3970R803K1878L4487
10595D2813P522J2186L63l6450J8541j2209K091L4392L7131m7405m7406L4681
10583D6250K93o877j3375j3353J7333l2412n6079r404J8648J4048k2281K0146
10571c7063K0601m1809K1436M2280M1724k229K2960k408k6703k4426J0853k4442
10559G74k3424J7043K9049K407K7869m5098l0038K1076k86K2448J7799N8168J1320
10546A09107k6496l9372l1242k2256J4625J2939J305K7852L1117j7295k8246l2872
10534h34K3735N2999N962k2456q533j6794J3052L1681J5894m662o532J0261J2687
$$ y = [2818, 36239, 20923, 33801, 32785, 47065, 15681, 30004, 44779, 59089, 61398, 42859, 60195, 88270, 90497, 68962, 47892, 88582, 68863, 34913, 10615, -23355, -13552, 8326, 42813, 50335, 62521, 62884, 26434, 44975, 32766, 34857, 69249, 106380, 58975, 11569, 46250, 46543, 39666, 26291, 12938, 30271, -2141, -58220, -67624, -48976, -34928, -57209, -37063, -16462, -58271, -36835, 5445, 47169, 44940, 67900, 65492, 38789, 14363, 25216, 774, -22650, -5607, 23442, 25849, 53718, 8620, -21418, -342, -628, 21820, 39619, 97787, 109107, 82611, 43239, 11997, -10259, 4366, 17305, 18610, 46462, 77579, 60284, 32038, -834, 22901, 75900, 81862, 59406, 50873, 34079, 47131, 78812, 94706, 90044, 83512, 93773, 106460]
10521A06460l2388l6000j0537k3841k9850k8795K0695o383k4750j5742J9190M9732
10509a2209L0346j2638k7076J9508j7680P791J2963l182k9439k3122J5417r209
10497d8530m1849R467M4957O6580N3653k7070m6959J6261J8283k6595P760k9423
10485c465p946J8603N154J1917L7444j4173m1291m1221k2515P63K7255k1041k9264
10472g9780J6011L2257M9115K4351P115k9251p269j0376K4563j9356q232J3848
10460A2996J6312j2932N647l0949O52j2990M8659K1901l817n9874j9992k761M5631
10447H483K2166J0828q580k996L2155J4719j453l7930j8919L5812J4102j6776
10435E1611k0165k3266j2246Q299L5621J322l4158k6346J9776K264J2156L0751
$$ y = [106460, 74072, 38072, 27535, 3694, -26156, -54951, -34256, -40639, -65389, -81131, -61941, -12209, 18137, 5499, -21577, -2069, -19749, -11958, 1005, -2177, -31616, -54738, -39321, -48530, -90379, -80912, -35955, 30625, 84278, 57208, 10249, 26510, 44793, 18198, 25958, -3465, -11411, 7192, 12346, 24263, 61707, 47534, 6243, -34978, -57493, -56730, -29475, -50516, -79780, -63769, -31512, 17603, 41954, 49069, 19818, 12549, 2173, 26736, 7380, -852, 12996, 29308, 16376, 22023, -8926, -8274, -21264, 27395, 49296, 45479, -14395, -34387, -37148, 8483, 30649, 41477, 32897, 29901, 62056, 76775, 75322, 37392, 18473, 54285, 68387, 51611, 31446, 8180, -4066, 4233, 39854, 41176, 7018, -19328, 448, 2712, 14868, 45619]
10423D5619j1915l1357m0873j592J4514L740L115J7770J543l702q662l4361J2014
10410c4147j9038K3374M4532K2787k6598j2784L6474K5212J5043j9095j6332m9287
10398i859k0219Q331n1712K0568Q1029J5907P754J0110l5768l5010M0604k1568
10386A0167O449l7280j4087M9338L4319J4479k1088j4526o603k9726j1465M3461
10374B3438p431l7305j8011J4879J4743p540o747N3173R797n0799l4269J2540
10362c3532l130L4276Q197q456J2374M9979k1916J5451j3759l277L0230K481J7153
10349H6071K4719L8575J06197N0192J8977L9398J13611J93483K88376L60744L97390
10338A717733L90382L75538K70556K17316K00021M3080q9685k16486l03871l57631
$$ y = [45619, 33704, 2347, -38526, -40118, -25604, -21864, -18749, -979, 564, -3138, -11800, -46161, -34147, -53185, -29811, 14721, 37508, 10910, -1874, 34600, 59812, 74855, 55760, 39428, -9859, -30078, -21747, -73459, -52891, 28138, 44045, 51799, 61909, 26141, -8869, 31735, 10167, 16616, -20664, -34751, 14587, 48906, 63385, 42297, 27771, 21168, -8558, -20023, 23438, 16007, -21298, -39309, -24430, -9687, -17227, -23974, 29199, 38996, -11803, -46072, -33532, -36662, -2386, 5811, -2645, 9729, 59708, 37792, 53243, 39484, 36207, 66437, 68918, 86071, 110790, 149365, 255562, 305754, 324731, 364129, 477740, 671223, 959599, 1320343, 1717733, 2108115, 2483653, 2754209, 2971525, 3171546, 3214626, 3124941, 2908455, 2604584, 2246953]
10328B246953l58375l59186l17197k79414k24577j46870j16012q7594o5626p8340
10318B13762o0353Q847M461k1583k7532j4928j7532m4049K5860p355K600L9167
10306A01365j4086j8558l0076m5340r385o522k8863p494N5504J0100Q342K4964
10294C9951O277j6365m274L4690L4588J3603l8943l7679r977j2280k1642J914
10282a0137J4632J403J7125M1173j2739l0191n645J3001k4053j7251J6316J224
10270D858J321k0703j3349J436R302k729l9659O655J227p333M4182N0424k8567
10257G065p5685K2908l3589K4573M7854J6630L149J810n585l997Q373J0255J3324
10244C7085J1632l9724O022O87J6087o358l352K9000J4505p200k2705k5998k0442
$$ y = [2246953, 1888578, 1529392, 1212195, 932781, 708204, 561334, 445322, 357728, 292102, 213762, 153409, 162256, 166717, 145134, 117602, 102674, 85142, 41093, 66953, 59598, 62198, 101365, 87279, 68721, 38645, -6695, -16080, -22602, -51465, -58959, -3455, 6645, 14987, 39951, 46228, 29863, 25589, 60279, 94867, 108470, 69527, 31848, 21871, 9591, -12051, -10137, 4495, 5898, 23023, 64196, 51457, 21266, 15621, 28622, 4569, -12682, 3634, 4858, 6179, -14524, -27873, -26437, -17135, -19864, -59523, -52868, -51641, -58974, -14792, 35632, 7065, -68620, -45712, -79301, -54728, -6874, 9756, 12905, 14715, 9130, 5133, 13506, 23761, 37085, 48717, 8993, 15015, 15702, 31789, 25431, 22079, 51079, 65584, 58384, 35679, 9681, -10761]
10231a0761J1574j4444M595L8114k1026j2067l76o658j729k4818O154N0993L047
10218B2598N882p911l5772l61Q880M613o802j2534J536j4923J562L3582J4337
10205A4687J9281L097m046R283j3800j6292K9002L6585j2818l5118n3155r974
10193c3268j0165R496K7477P257k7164r055k2461N555K2636J8154k0245k2241
10181e4024l4132L5151K3193K2752L2139L9492k1599k9320q192R885J401j9735
10169b989m321J8000j6447j483k0760k5626k1962l2142L0369Q1340M7130k2373
10157B8736J869j3826l447k9072K2271R841J3049o314l1554l9350j3964j3599
10145g5360o401n534M7986o58J3304M7416P3245m673n8585m3757k8318l6516j7439
$$ y = [-10761, 813, -13631, -9036, 29078, 8052, -4015, -4391, -11049, -12778, -37596, -31442, 19551, 22598, 28480, 20569, -15203, -15564, -6684, -2071, -8873, -21407, -19871, -34794, -33232, 350, 14687, 33968, 37065, 33019, 42302, 28502, 12210, 41212, 77797, 64979, 29861, -23294, -33268, -43433, -33937, -6460, 797, -26367, -35422, -57883, -52328, -29692, -11538, -31783, -54024, -88156, -53005, -29812, -7060, 25079, 64571, 42972, 13652, 5460, 15345, 16746, -2989, -7310, 10690, -5757, -7240, -28000, -53626, -75588, -107730, -77361, 3979, 51109, 28736, 30605, 16779, 13332, -15740, 6531, 16372, 29421, 23107, -8447, -47797, -61761, -75360, -81761, -87295, -39309, -39967, -26663, 20753, 93998, 89325, 30740, -13017, -41335, -77851, -95290]
10132i5290o294l849L5895K2592R538L0678K5062m2756j2143l6761L1700L8042
10120c586l6513L5945l6228r099K5950J5171k1455J6177O4396K8939p488k2950
10108D9259j1142R163j9401k6074k0790K8115K9852O435p621J7859J7750k7278
10096D6127k6379k5252K959K8599J6934J9629p805k7789R538k8245l0600k891
10084b5175k4768m9445o520L199K4330j4730o570K1843M1122J9841j547o846l0769
10071e6035r115L5948J4694j7534j9104J0809K5471j5281N0509J1584j2535k9472
10059a0061L386q328N222K5372K0266J5082N618l2581j572k6384J6663k9589j3076
10046b9982k3601j4926M1640M3118M3391P435k9366k8573j8776L4736L4282L2781
$$ y = [-95290, -101584, -105433, -69538, -46946, -37408, -6730, 18332, -24424, -36567, -73328, -41628, -3586, -40099, -4154, -40382, -49481, -23531, -8360, -29815, -13638, 50758, 79697, 72209, 49259, 38117, 47280, 27879, 1805, -18985, 9130, 38982, 45417, 37796, 55655, 73405, 46127, 19748, -5504, -2545, 26054, 42988, 62617, 54812, 27023, 36561, 8316, -22284, -25175, -49943, -99388, -105908, -102709, -78379, -93109, -99679, -77836, -36714, -16873, -18420, -25266, -56035, -65150, -29202, -14508, -32042, -51146, -40337, -14866, -30147, 20362, 31946, 19411, -10061, -6675, -15003, -9781, 15591, 35857, 50939, 56557, 23976, 22404, -3980, 12683, -16906, -29982, -53583, -68509, -26869, 16249, 59640, 67075, 37709, 9136, -9640, 25096, 59378, 92159]
10034I2159m0826m5846m384r092m0549l8833L9968N0598J1735M2691J7211L4189
10022A09021j2802k7606k8309l9889J2625j0225l2076q724M7128L5336N6788o416
10010I4851n0752P114l8027j8469K994K042K931M2919n229k2774O548r323n01
9997A4324J2345l5548l5434j3118j0754L457L8228J8562K6015k6977j3364M805
9985a7459N707O838j9339j8555j7651J3517J5968K2793r853l9760l8474K2551
9973g3717N207N054M2352L8091j766n878J2831j7503L4163J7590j6339j9934m0488
9960b0337l27k5084m8J1506J0966K4362M7548l0741n3004k335p208L5813L3205
9947B4316o952K336q892m1532J5116J1727q992l864n83j4808j7091Q89k4348J98
$$ y = [92159, 51333, 5487, 1103, -7989, -48538, -87371, -47403, 3195, 14930, 57621, 74832, 109021, 96219, 68613, 40304, 415, 13040, 2815, -29261, -37985, 9143, 44479, 101267, 94851, 44099, 51213, 13186, -5283, -2289, -247, 2684, 45603, 40374, 17600, 24148, 14825, 14324, 26669, -8879, -44313, -57431, -68185, -64728, -26500, -7938, 18077, -8900, -22264, -17459, -11752, -4914, -24253, -42808, -60459, -46942, -30974, -8181, -18034, -57794, -96268, -73717, -68510, -63456, -21104, 16987, 15221, 9343, 22174, 4671, 38834, 56424, 40085, 20151, -20337, -20664, -45748, -45796, -34290, -23324, 1038, 48586, 17845, -35159, -37494, -44702, -8889, 24316, 17364, 19700, 10808, -30724, -15608, -3881, -12873, -16737, -17320, -32128, -49219, -48330, -72678, -72480]
9933g2480J7768O2415O8604K7491J4494O476o1798l8985N926q132K1749K1713
9921F5241j1013j9354J1500k1940j7162l2083k252K9893n417m7917P565L487L1108
9908h344J0307L663L0369j3508N572K0947n363o2816n2626Q121J4694J3039j947
9895c7892L3905n963J7597O3607J8969M574k7576J455k4819j270l4335n023K046
9882E275n4018m780n432n09P549L5149P230l4205N684K1613k2400k0620K1304
9869c8160L5024Q228l9220N847J2527L2030j3238j2179o336M72r800L8613J620
9856A5428r738Q779j220N561j2416K4356O126k0725K2413K991l6720m107M1756
9843D2484n397j7583L6241J8147k9185n1559O352L4141k2752l631L8676j1385
$$ y = [-72480, -54712, 7703, 76307, 103798, 118292, 124768, 62970, 23985, 29911, 21779, 43528, 65241, 54228, 34874, 46374, 24434, 7272, -24811, -27063, 2830, -2587, -50504, -42939, -39452, -8344, 1963, 5626, 35995, 22487, 28059, 49006, 43643, -19173, -71799, -63678, -48984, -35945, -37892, -3987, -9950, 7647, 71254, 90223, 94797, 67221, 68676, 43857, 42587, 8252, 3229, 5275, -48743, -53523, -58955, -59464, -51915, -16766, -9536, -43741, -38057, -16444, -38844, -59464, -38160, -3136, 5092, -34128, -28281, -15754, 16276, 3038, -9141, -15477, -15005, -24805, 13808, 15428, 5690, 14469, 13249, 18810, 6394, 30750, 36876, 16151, 38564, 41555, 4835, 728, 42484, 37087, 19504, 55745, 73892, 44707, -6852, -500, 33641, 10889, 7258, 45934, 34549]
9831C4549k3737j6945n123l1318l1573N5589P3819J8937n712m9832m6665j0487
9819c8498o353J3666P0886K8286o8645j8435p214J5514L3610k2605j8476j1483
9807b9747j1726M647M4695P537J3354k5053o4175J3301K7136M6320K5749l6692
9795A5346k2504j511r391n089M6291L1340l0569m360N807n1473m3430J9096k1071
9782g1518J5624N2970l1105k0974N1787Q049k697L1805K1766l5143o3527j6122
9770e9085Q582J6468J9413p237m0J3933K5527J3869k9512p4042M791O3589J0039
9757F295j2664J222Q799P69J9016j3566l2171j3746J9350j52l5839k4920J6787
9744f0820K0806J1677l0342J8965m568O227j3741p191J041J3066J9512k570M155
$$ y = [34549, 10812, -6133, -11256, -42574, -74147, -18558, 55261, 74198, 68486, 18654, -28011, -38498, -44851, -31185, 39701, 67987, -658, -19093, -26307, -10793, 22817, 212, -18264, -29747, -41473, -36826, 7869, 15406, 28760, 3707, -60468, -47167, -20031, 26289, 52038, 15346, -7158, -8669, -18060, -23149, 23142, 54482, 23913, 19553, 25360, -26113, -69543, -50447, -71518, -55894, -2924, -34029, -55003, -3216, 4833, 2136, 33941, 55707, 20564, -42963, -59085, -50503, -34035, -14622, -21859, -21899, -7966, 17561, 31430, 1918, -72124, -67333, -3744, 6295, -6369, -5147, 3652, 4421, 23437, 9871, -22300, -36046, -16696, -16848, -52687, -77607, -60820, -40014, -28337, -58679, -39714, -44282, -38055, -51796, -58987, -57946, -44880, -25368, -27938, -23783]
9731b3783J155l6293J9086M6353k2460j1824j4924M9335L7602m633J0268l6297
9719A3585j5911l80o111K3213q364j2992n631j1658K4654J5911j4130j3558q800
9706b0172o700j0393l986Nl2652j12L4296j8355L9339L4741o956k3638j7711l7809
9692g0103K825p189K6570k858K446K1940L2411j5750r840j0292j831k5568L0028
9679b7211L6358K2460J3698k569J3573J6523n828l0996l6896J9456j814Q22P369
9666B4945m0717k0426J008k8907J1028k215m2653J8023L2859K2733l071j4373
9654d1766j7306L9332l5449j7558j2916M5363M0143Q224J675J5811k3271j5427
9642a3145J5300n941m6425j8224J4787J9322L5823J7546k2053k5673L0114L680
$$ y = [-23783, -22628, -58921, -39835, 6518, -15942, -27766, -42690, 6645, 44247, 39614, 49882, 13585, -2326, -2706, -8817, 14396, 6032, -6960, -12591, -24249, 405, 16316, 2186, -11372, -20172, -26872, -37265, -41251, -41246, -73898, -74010, -39714, -58069, -18730, 16011, 9055, -14583, -32294, -70103, -67278, -74467, -47897, -50755, -48309, -26369, 6042, -9708, -19548, -29840, -31671, -57239, -27211, 9147, 31607, 45305, 42736, 56309, 72832, 67004, 36008, -888, 18568, 16754, 17576, 24945, -15772, -36198, -35190, -64097, -53069, -55284, -97937, -79914, -47055, -24322, -27393, -41766, -59072, -19740, -55189, -72747, -85663, -40300, -157, 8067, 9742, 25553, 2282, -13145, 2155, -3786, -50211, -68435, -53648, -34326, 1497, 19043, -3010, -28683, 1431, 5111]
9630E111J0271K0489j5067n0761r746K4019M9963M1509j374n8210k9777Q461K2373
9617A7261J3473N3119n751l9214P104J2614l0146l1217K709O4502J934m0078l6573
9604a0263j4008l3280J727N2336J7064q202Q295J1935R088l3028R53j2823k5375
9591c5581L3603M3210r911j5798r668M321k7761n1217k8984Q423K4123M4497l968
9578b4711J5980R57o193o826l229j9048J6996N223j9188p097J3787L2416O965
9565F032p646P827L593n41K9316j4015N856o893J8394j0620q2396k4609J7046
9552e8656j1994Q795J9321J2808L6582j4678l907K9023K575o863k5773J8032M2
9539E307l4642P210M2116L465j2068K1256j7427l2906J8380k7697k613j0341J4559
$$ y = [5111, 15382, 35871, 20804, -29957, -39703, -15684, 34279, 75788, 74414, 16204, -13573, -5112, 17261, 30734, 83853, 78102, 38888, 45992, 58606, 28460, -2757, -48, 64454, 66388, 26310, -10263, -24271, -57551, -55824, -3488, 13576, 5374, 13669, 25604, 34692, 1664, 2617, -10206, -35581, -1978, 41232, 31321, 15523, 5855, 10176, -17585, -68802, -97786, -89363, -65240, -20743, -24711, -8731, -7774, -13967, -20793, -24022, -43070, -26074, -20851, -40039, -47136, -33349, -933, 6032, -1614, 6213, 9806, 9265, 38581, 24566, 30422, 23529, 41923, 31303, -51093, -75702, -58656, -70650, -61855, -42534, -29726, 6856, -7822, -11729, 17294, 19869, 13006, -12767, 5265, 5307, -29335, -22125, 19991, 23456, 11388, 32644, 15217, -17689, 691, -27006, -29619, -39960, -25401]
9526b5401M1882K701o306K7035K4821M368n2654l3141k720M5672J0017j5897J8536
9513C8913p592n3180j3034M0368n233k9826N983P1402J6399n2754n9887j1724
9501f0165L1016M7796L961k0344L26j0580r75j5500j3232n28J1305j633k0600
9488d9153L2072L847J6404K682j8836K3278L4603P076l9748j365j3329r804J341
9475a0932J2452L2704L818J707J5108k4409j4693K8152L3414J9436k8481m6136
9463B2140n3187J991P545K0436J1537K6445j9485m4718M823K2646Q513N367q84
9450A3169l6474L8637j4648j8356j9160J2705N631l7766l1588K3392K4053k2734
9438f3139J6293P595J7616l5925L5299M1335K561M4909L1962q708o5780o4566
$$ y = [-25401, 16481, 19182, 12876, 39911, 64732, 69100, 16446, -16695, -19415, 26257, 36274, 20377, 38913, 31321, -21859, -34893, 5475, 242, -29584, -23601, 47801, 64200, 11446, -48441, -60165, -29149, 18647, 22608, 2264, 2590, -7990, -8965, -24465, -37697, -38225, -26920, -28553, -49153, -17081, -13234, 3170, 5852, -12984, 10294, 44897, 51973, 12225, 10860, -2469, -12273, -10932, 1520, 34224, 38042, 39749, 54857, 30448, 15755, 43907, 77321, 96757, 68276, 22140, -31047, -29056, -21511, -1075, 10462, 36907, 17422, -27296, -22473, 173, 8686, 14053, 13169, -23305, 15332, 684, -17672, -36832, -24127, -18496, -56262, -87850, -64458, -40405, -63139, -46846, -39251, -21635, -57560, -22261, 19074, 21635, 66544, 98506, 89798, 24018, -40548]
9426d0548j9934j3223k9874L0518N1003L0818j9163j8385k3770K5991L9656M055
9414A7144j6100r622m4983j5957m0842J3469R3676K5619n7497m0967N216K7553
9402d3291K6233l1803l140k0855j9549L2711O4652n304m8923k805J5000J4392
9390b2682j2180J980k3660J0529Q932p090o7317r880K4277M1234L6809K4731J563
9377G246l1138K015r097m908M5346j418j6011j9250J947j0080J5777N1129j16
9364C1442m6878k2482j2904J7801K4162K943J6815j0465j0328k785O151k3442
9352b9970K8306k393K7031K9093j6054J2332l6213k5161j0623K5810J7523N198
9340B4879m517K8680J8600m638k7411J0780J1334l2079j7099l0459J1551L2326
$$ y = [-40548, -60482, -73705, -103579, -73061, -22058, 8760, -10403, -28788, -52558, -26567, 13089, 17144, 1044, -8578, -53561, -69518, -110360, -96891, -3215, 22404, -35093, -76060, -70844, -43291, -17058, -48861, -52001, -72856, -92405, -59694, 4958, -346, -49269, -52074, -37074, -22682, -34862, -32882, -56542, -46013, -37081, -44171, -111488, -121368, -97091, -55857, -19048, 5683, 7246, -23892, -21877, -30974, -35882, 9464, 8046, -7965, -27215, -25268, -35348, -19571, 31558, 31442, -15436, -37918, -50822, -33021, -8859, -5916, 10899, 434, -9894, -12679, -6528, -29970, -1664, -4057, 22974, 52067, 36013, 48345, 12132, -13029, -23652, 2158, 19681, 24879, 20362, 49042, 67642, 63004, 35593, 46373, 57707, 25628, 8529, -21930, -10379, 21947]
9328B1947L1317J1187j0522n581n3423p106k9000n3379K7656M8670N142q405J2069
9315i428P105j7116m6723L6417J7822j0485K9702K0825N155L911M83J4974m3015
9302I627k1535k757L1770L6830o288j8588K8369j4412m3666l9146k4425M3818
9290b0403j2708j6342j0014L22J8374J0963P775K59j7616j5706K4968k61J0438
9277a9951j659J3232N3400J0671m5390J396J1928P205l2082n7815j7730K1746
9265e5049k0189K3213M0092j3496j0879J5920K9502l4870j1881J4512K7740j4924
9253a0309l4269Q908L1577K2339K3933m9461m5044k1089L7168L5226J4666M129
9241A7774J3753l826j2966n6565m3655q63K2602K4417l12M4823M5205k2751L284
$$ y = [21947, 53264, 64451, 53929, 48348, -5075, -12181, -41181, -94560, -66904, -18234, -13092, -21497, -9428, -2323, -19439, -66162, -29745, -11923, -22408, 7294, 28119, 33274, 37185, 37668, 52642, 9627, -11908, -14665, 17105, 53935, 47647, 29059, 57428, 43016, -650, -39796, -64221, -20403, -33111, -49453, -59467, -59145, -40771, -29808, -22033, -21774, -39390, -55096, -30128, -30389, -19951, -21610, -8378, 45022, 55693, 10303, 11699, 23627, 30832, -1250, -59065, -76795, -55049, -75238, -52025, -11933, -25429, -36308, -20388, 9114, -25756, -37637, -23125, 4615, -10309, -44578, -35670, -4093, 18246, 42179, -7282, -52326, -73415, -36247, -1021, 13645, 17774, 31527, 27701, 14735, -41830, -85485, -86348, -63746, -39329, -39641, 5182, 50387, 27636, 30920]
9228C0920o059k7212m0545n801J7259J0047J8994L1123j5935J2066K4644j8038
9216C1463J1711j2777j0415J1172r846o761j163k438j6664j8127J4051k659K3150
9203A0697O1462k1029m1808k909K1609j6393m244L868o510j4974j904L4997k2960
9190i8j4201L533K9911J1200n824p808o303m3110o976n777K9J8467O5341j4773
9176B3611k3622j0383L1744J305n7433k903k1799J6526l0543L566L2879K035R559
9163b5458N614m155r99K7684j436k8198K5546N205Q963j6879k5581q740l059r504
9149e0997j3067J3133O1600L9250j0931l9594k9329J8305K6135k7399M582K4150
9137A5838o597r28J0492P656k5484O594j5718j1757J8665L3138J3370k1695N936
$$ y = [30920, 24861, -2351, -42896, -48697, -31438, -21391, -2397, 28726, 12791, 24857, 49501, 31463, 43174, 30397, 19982, 31154, 21308, 14547, 13384, 10946, -5718, -23845, -9794, -12453, 10697, 72159, 51130, 9322, 6413, 28022, 11629, 7385, 11253, 4743, -10231, -12135, 22862, -98, -14299, -10766, 19145, 30345, 24521, 16713, 10410, -32700, -39676, -45453, -45424, -26957, 38384, 23611, -11, -10394, 21350, 22655, -34778, -37681, -59480, -42954, -73497, -69931, -37052, -35017, -25458, -19844, -23999, -24998, 2686, 1250, -26948, -1402, 3803, 12766, -4113, -29694, -38434, -41493, -50997, -64064, -50931, 10669, 49919, 38988, -606, -29935, -11630, 14505, -12894, -8312, 15838, 9241, 8313, 18805, 26461, 977, 7571, -8147, -19904, -1239, 31899, 45269, 23574, 29510]
9124B9510k0176l709j7655o174R360L424j0797L6271K984K7458m3002k3519K5982
9111I957j0816k5601J4855O523M3033Q40j9590l6726k2333R006L4849J4375j1067
9098G305j9376M772Q000n009k4724m1425O753L5340O454j714o771R744l0084n631
9084e6366M0681J3097j4052l7856J024K7881m910m923L1220M7524k3820m6122
9072b6622L1340J1033K5325M130k6157M702o718R715K2173M862n2153j9895Q068
9059a0197j8329j8951P026k2595J626J0080N3270K6798j2242k9356k0124J8705
9047a4289j7256n692L7453J1968l7947l8021m955P116J2080M2680L0659K6799
9035E0595K1107j3473k5541k2244l9617m36P746P415J8147M6291L6507o359o371
$$ y = [29510, 9334, 5625, -12030, -18204, -8844, -5420, -16217, 20054, 23038, 50496, 7494, -16025, 9957, -859, -26460, -11605, -5082, 37951, 38791, 19201, -17525, -39858, -30852, 3997, 18372, 7305, -12071, -7299, 701, -4308, -29032, -70457, -63704, -28364, -21910, -23624, -30395, -20651, -50735, -56366, -15685, -2588, -16640, -54496, -53472, -25591, -30501, -35424, -4204, 43320, 19500, -26622, 4718, 15751, 41076, 45206, 19049, 23751, 17033, 26748, 48921, 53783, 1630, -18265, -10197, -28526, -47477, -40451, -63046, -61420, -51340, 1930, 28728, 16486, -12870, -32994, -14289, -31545, -37237, 216, 12184, -25763, -63784, -68739, -61623, -49543, -6863, 23796, 50595, 71702, 58229, 32688, 10444, -29173, -29609, -21863, -14448, 3699, 49990, 86497, 80138, 73767]
9022G3767j9382R034l6209l7995J6787o991k4266m2109r964L6296J7727L4467
9010A1162j2702O527J4248o4845k5490j3467N2661N2398M3445o21l3272l5250
8998e206L704J5322k583k1304k1122M629K7350J7078K3847q05l8782K6598K1569
8985E0295r167k7561k0915k7071q278l001M4729j3704m3360o298L4928L6520j833
8972E284j4071K1568L9150j9224o336j9165M9779j418m180J1947J0079m5003n1518
8959b3108L739M2876J912J2992M3578K2411k1872l0412l579K3356l4709j1902
8947B5282M014O515k7497k6136K0878O064K4516J2061k9021n6787r201K5094l2464
8934e6682j6221N3889P906M103M0359R581l4659j1458p492l5857Q648J1669N2325
$$ y = [73767, 54385, 63419, 27210, -10785, 6002, -989, -25255, -67364, -77328, -41032, -23305, 11162, -1540, 4987, 19235, -45610, -71100, -84567, -31906, 20492, 63937, 63316, 30044, -5206, -1502, 13820, 11237, -10067, -31189, -26560, 790, 17868, 41715, 40910, 2128, 28726, 50295, 41128, 13567, -7348, -34419, -42697, -45698, -969, -14673, -58033, -64331, -29403, 7117, 5284, -8787, 12781, 51931, 32707, 26371, 7206, 56985, 55567, 51387, 63334, 73413, 28410, -23108, -19369, 23507, 25419, 38411, 81989, 104400, 82528, 52116, 48537, 71893, 37184, 25282, 29296, 35811, 8314, -17822, 3056, 9120, 33636, 45697, 16676, -40111, -49312, -24218, -56682, -72903, -19014, -11108, -7005, 33354, 42935, 8276, -3182, -10674, -46531, -37883, -26214, 26111]
8921B6111M7824j2560l8025N335n656j4446k1559J2652M4561n353k3829j5104
8909d9j9165o683J488k5049k9263L987M3858k9043Q469m179K0742k3530l899K0665
8895d1651m4991j4702K931J0199j3999m7N4525O0082R459k4174J4339k0491J1537
8882C017P800m9247J512L6077J6483K8283j3009l0324K8392l2765j9559M7541
8870B4201j8269l0104l836k1877L6646L7460K2368N8252R7778N1411j2293r052
8858B32685l7906m5755j2837k7710n5741m8020L0300N6114K0313j8274l5571l9187
8846A8411m0839j771q716l217O088K3901M2270K4291l4059m0274P37J6006k466
8833C62j5803P317L3648M017L335k8203J3916l1239K1433J4088j2841k0011k9018
$$ y = [26111, 73935, 61375, 23350, 28685, 23029, 8583, -12976, -324, 44237, 38884, 15055, -49, -19214, -25897, -24409, -49458, -78721, -74734, -30876, -59919, -51450, -55629, -34887, -58417, -62316, -41651, -86642, -101344, -98413, -88214, -102213, -102260, -47735, 12347, 21806, -2368, 11971, -8520, 3017, 10817, -38430, -36918, -841, 15642, 43925, 30916, 592, 28984, -3781, -23340, 24201, 5932, -24172, -28008, -49885, -13239, 24221, 46589, 104841, 202619, 254030, 241737, 232685, 194779, 149024, 136187, 108477, 52736, 4716, 35016, 91130, 111443, 93169, 57598, 18411, -22428, -24199, -32915, -36132, -30044, -6143, 36127, 60418, 26359, -13915, -13178, 2828, 362, -15441, -8124, 25524, 29541, 32876, 4673, 18589, -12650, 8783, 22871, 10030, -9981, -38999]
8820c8999j1829l704j4598J2040K1830j4206k4972L810k3511j2475K9391O1609
8808a5614L1281k8106q548n229K6755k0474L7278K4057n0326k1150M709K7104
8796A737M839k4667o052L0651p951K8056K4391l1518j2379k1054k1077k786k2892
8783f0702k3311K9337L599j5297N1977K1773j7577K1839K4200Q710r136k5049
8771A0363j3680L0186k2314l2667L2189J4348k1146k8616M685R635K016k7377
8759d2378k3843M2759J7482m431o078K267L5005K861J1305M743l2606n967Q394
8746I513j8337l5326J931K3862k328J0043k0667J9777O823j2108O8Q554l979K204
8732i970J8507J4283j4932l7030J3374k5525Q236n601J9324P741L8396P33n5412
$$ y = [-38999, -50828, -54532, -69130, -57090, -35260, -49466, -74438, -70628, -94139, -106614, -77223, -15614, 15667, -12439, -20987, -26216, 539, -19935, 17343, 41400, -8926, -30076, -25367, 1737, 6576, -18091, -24143, 6508, -1443, 26613, 51004, 19486, 7107, -13947, -35024, -37810, -60702, -84013, -54676, -51077, -66374, -14397, 7376, -10201, 11638, 35838, 44548, 35412, 10363, -3317, 26869, 4555, -28112, 4077, 18425, -2721, -31337, -26652, -17017, -15001, -42378, -66221, -23462, -5980, -10411, -16489, -14222, 20783, 23644, 34949, 39692, 7086, 1119, 9513, -8824, -44150, -42219, -18357, -20685, -10642, -31309, -11532, -4709, -16817, -16749, -8195, -12174, -9970, 8537, 22820, 7888, -29142, -15768, -41293, -33057, -38658, -19334, -11593, 26803, 27536, -27876]
8719b7876J5097K919L3325j3214m5385J9374N0125j344O665k6934J4883K9748
8707E7383n578k7437k37k15n642L5531m977n2088j5801r513k7998j6129K5550
8694d7151M9282J3466o075J8590l9399n6L8696M6674j5243k0394o2516j1826P3565
8681C7613M5698k5798J8545N120J2779j5197k6109o389j0245O175K4500j2375
8669E4317J5752J9830l7182n7650L9145M1556K6114l9073n8243l1398p097L783
8657c0146K8515K2602K9474p353Q745K0430p094m887K0564q581k209k939J8756
8644H5877K0484n819p157J0553K3401L788J1402k32l7634m7170J1208J9374M785
8631I2860p081L9439M3793o467q56Q520J2916m1499O005K4255r603m852K9091
$$ y = [-27876, -12779, -9860, 23465, 10251, -35134, -15760, 34365, 33021, 39686, 12752, 27635, 57383, 51805, 24368, 24131, 23916, 18274, 53805, 48828, -3260, -19061, -28574, -56572, -72701, -47151, 2131, 15597, 9522, 28112, -11287, -11343, 27353, 74027, 58784, 38390, -24126, -35952, 37613, 83311, 57513, 76058, 81178, 93957, 78760, 52651, 46262, 36017, 42192, 66692, 54317, 70069, 89899, 52717, -4933, 34212, 75768, 101882, 62809, 4566, -26832, -33929, -30146, -1631, 20971, 50445, 43092, 51837, 72267, 65173, 60286, 80850, 72269, 70060, 67121, 85877, 106361, 100542, 93385, 103938, 127339, 131127, 142529, 142297, 104663, 57493, 68701, 88075, 92860, 85779, 125218, 169011, 162544, 161688, 170208, 183124, 141625, 147630, 171885, 162282, 157430, 186521]
8618A86521M0336J139j8956K6134L5229j5851M2195J0548L189M0333q468k8047
8606C14302o7982l5246J9337K6480J7256K6309k4167P253K487L189M199n996O9889
8593C57310O1817N877l1924L4027R4084P5422J5196N412J0401r522k5938k1893
8581E70269m3533p9515r5234l5492Q328M6901k4609p9945j9890j6961N213r611
8569B25921n8486k9876j5768l7055q427K1390n8852j7600K6615Q490J9558q343
8557F7567j0667j4717k3589q140J8093K9506j3170j9375Q827j3702L9J7206k4040
8544A3838j711N93l0746o302J62J969P471J7914M8977p555O884q432j5618l7428
8530i984n813j7412l843K5722M2333J6339o585o515l4903k425K669j1160j6923
$$ y = [186521, 226857, 227996, 209040, 235174, 270403, 254552, 296747, 307295, 310484, 350817, 342349, 314302, 246320, 211074, 230411, 256891, 274147, 300456, 276289, 283542, 286029, 289218, 293417, 287421, 357310, 419127, 425004, 393080, 427107, 521191, 596613, 611809, 617221, 627622, 618100, 592162, 570269, 526736, 447221, 351987, 316495, 324823, 371724, 347115, 267170, 247280, 230319, 235532, 225921, 167435, 137559, 121791, 84736, 76309, 97699, 38847, 21247, 47862, 56352, 75910, 67567, 56900, 42183, 18594, 10454, 28547, 58053, 44883, 25508, 34335, 20633, 20672, 37878, 13838, 12127, 12720, -18026, -24328, -24166, -22197, -14726, 3188, 52165, 44610, 51494, 43062, 27444, -9984, -15797, -33209, -37052, -11330, 31003, 47342, 40757, 34242, -661, -3086, -417, -11577, -28500]
8517b8500J2043L9181q42j0670j8298j1110L8808K7590K1759j2824j6191o223
8505C4723r417j7358l2052j7680n302K6256Q560m567l1168P619j0079j5594J8572
8492d7487K2576L3393Q91j2288M7465J161J2251p132k7986J2199k3662k7837N894
8479a0562L1414K2904K9976l1173k7383R616o741n0915k540K2473j3778j6335
8467d3044L9842K1392n0273l0302j7890M2789J00809Q335j6923j1620k1043j1107
8455A0965L294L2609K9857M726N220p979m147n448j675j7400k5142l880j319M7634
8441F7315L8446m7145n5240R747O871J0524m6015k319J8145M4569L9143k1420
8429F2621j7877l0373J9745L0479l9796l7631j9384j2422K5580K8573j375J4280
$$ y = [-28500, -16457, 22724, 21882, 11212, -7086, -18196, 20612, 48202, 69961, 57137, 40946, 34723, 25306, 7948, -24104, -41784, -47086, -20830, -12270, -16837, -48005, -40386, -50465, -66059, -47487, -24911, 8482, 9373, -2915, 44550, 45711, 57962, 50830, 22844, 35043, 11381, -16456, -10562, 20852, 43756, 73732, 42559, 15176, 24792, 18051, -32864, -35404, -12931, -26709, -43044, -3202, 18190, -32083, -62385, -80275, -37486, 63323, 71658, 54735, 43115, 22072, 10965, 14259, 46868, 76725, 81451, 86671, 78692, 74545, 69097, 67422, 50022, 24880, 21000, 19681, 67315, 105761, 58616, 3376, 13123, 19994, 30518, -15497, -17816, 329, 44898, 84041, 62621, 44744, 14371, 34116, 64595, 24799, -12832, -32216, -44638, -19058, 9515, 8140, 22420]
8417B2420J6658j6570k6124J738n2009j7321j6549q774j6552M9390M3454J1355
8405h884q210j3835k5982n952o032K1325L3647M0704K7112N872N350l9526j5665
8392I924K4297L3966Q234m9756k8483k6699m6066M2228k5429K2502L6101k2133
8380b1314K5155J1134L0065k3844m499J9054l184p291K1940j2815J2412J9479
8368F6292l2257J2469q091k1132l0788j8364m2744K6048J0589K9809J9460J9620
8356C0911K7728Q790k6149k171o0052n3648K2613M8719K2030j0557k9467M0000
8344A8747M2873L893l8393k8926J3790K1278K745p831J0589l5365k0635M109L5450
8331B2324J388q131l0355j2322q943N6047N27k7225k8614p32j5186J2879K3600
$$ y = [22420, 39078, 22508, -3616, -1878, -53887, -71208, -87757, -96531, -113083, -63693, -20239, -8884, -17094, -30929, -56911, -62863, -68895, -47570, -13923, 26781, 53893, 59765, 65115, 25589, 9924, 34221, 68187, 76421, 26665, -1818, -28517, -74583, -32355, -57784, -35282, 819, -21314, 3841, 14975, 45040, 21196, 16697, 35751, 32567, 25276, 47216, 34401, 46813, 66292, 34035, 46504, 38413, 17281, -13507, -31871, -74615, -48567, -37978, -8169, 11291, 30911, 58639, 67429, 41280, 39109, -20943, -74591, -51978, -3259, 18771, 8214, -21253, 18747, 61620, 65513, 27120, -1806, 11984, 33262, 36007, 28176, 38765, 3400, -17235, -13126, 22324, 23712, 15581, -14774, -27096, -36039, 20008, 20535, -6690, -35304, -36036, -51222, -38343, -14743]
8318a4743k5364l5113j4708Q596N22K5607J1278j8441k9120l7037l354M7480M7160
8305c7237J752J0972j5210l8631n303N600Q36M0499M2186K3432K5666p664n9047
8292a2149j3502K5930K546k4716L4733K3572J272q0748l6008K0446L0061K6905
8280a658j9081m0608j2016M8703J7139m7719K6717K754j0823J7361K2328j9364
8268a6267q703m9520k8011M3558Q1857K3233L358K788k6697L0249l01q4356n2024
8255h0836M8198J6303k6111j5855L6086N4990K4149l5290j8226l4316l1899k4524
8243h7331J4887L7604j1269N0504M9880l6048o0854j1065M271L0859L5883K7668
8231D4989j64r844P767l7391k2520j9076k6274J2281J356K8540P180j2885J9576
$$ y = [-14743, -40107, -75220, -89928, -81332, -80810, -55203, -43925, -62366, -91486, -128523, -131877, -84397, -37237, -35485, -24513, -39723, -78354, -83657, -78057, -77221, -36722, 5464, 28896, 54562, 46898, -12149, -25651, 279, 2825, -21891, 12842, 36414, 37686, -43062, -79070, -58624, -28563, -1658, -20739, -61347, -73363, -24660, -7521, -55240, -28523, -25769, -36592, -19231, 3097, -16267, -24970, -74490, -102501, -58943, 22914, 46147, 49505, 52293, 25596, 55845, 55544, -28812, -80836, -32638, -16335, -42446, -58301, -22215, 32775, 56924, 21634, 3408, -30908, -62807, -87331, -72444, -34840, -46109, 4395, 54275, 18227, -42627, -53692, -49421, -18562, 17321, 44989, 44825, 34981, 42748, 5357, -17163, -36239, -62513, -50232, -48876, -20336, -13156, -26041, -6465]
8218f465J9714l229N2943L4088l7879m8902j4232K2741K9124j7572n7500L2871
8206E702K5766j0439K11l2372l6303k0723J3723K8936J5876N1329J5527k0688
8194C6545m825K2041K1030j5646l8853m6249J0741m679K4904J2580L7856O506
8182F1951j6263k6416j4433l5838l8815K6378K8042k0819k669L3908P8766J5716
8170H9508k3884R266J2691m6317m7090k7837j6430l5571k608J5988M5201K9219
8158B136k7722P12N2055j2873j3942N3805L9672K116n9277l4883J1565J6599J6827
8145D6790m872l1670J8364j9127J573k0916J602N073k9946P094K5608K6238l0604
8132d793k1617R640j9471j1405J6523j8751K1011L7208L436j5812l1467j5316
$$ y = [-6465, 13249, 10020, 62963, 97051, 59172, 10270, -3962, 18779, 47903, 30331, -27169, 5702, 31468, 21029, 21240, -11132, -47435, -68158, -54435, -25499, -9623, 41706, 57233, 36545, 31720, 53761, 74791, 59145, 20292, -25957, -15216, -19895, 5009, 17589, 55445, 61951, 45688, 19272, 4839, -30999, -69814, -43436, -15394, -36213, -38882, -4974, 73792, 89508, 65624, 74890, 87581, 41264, -5826, -33663, -50093, -85664, -88272, -72284, -27083, 2136, -25586, -24874, 27181, 14308, 366, 54171, 93843, 95959, 36682, 1799, 13364, 29963, 46790, 41918, 10248, 28612, 9485, 11058, -9858, -8256, -3183, -33129, -26035, -427, 25811, -4793, -26410, -16770, -36241, -47646, -31123, -49874, -28863, 8345, 11781, -4031, -35498, -50814]
8120e0814p204j6414k8894o869L3474O4793N2044n132l695k50k709J5264Q078
8107E1672l9761j392K3567K030k8934k4570N586k2210J8065j1371m429M283j4004
8094d1468N1067L8937l070j3353k1840m9539j5337k2346O414M2322r801M0625
8082B611J4702K3552k8075K6791N5151L9776J7855k4220k6979m2263n6633j4031
8070a1763K7818j1456J880K0324n562M819l09n5496j6867J9074k397M2330k675
8057I720l0221M384J849J8728M6917L5406O782m8453J9025K6854J7950J0967J0168
8044A30076p476j7567j9371K2783J7035k0645K4491K4622m7130k7917N5871R067
8032A43839j6456k6227q246l0555q506j3440j7925k0234O62K0623J4930K4202
$$ y = [-50814, -58018, -74432, -103326, -110195, -76721, -11928, 40116, 34984, 31289, 31039, 28330, 43594, 51672, 11911, 10519, 34086, 36116, 7182, -17388, -11802, -34012, -15947, -27318, -31747, -27464, -41468, 9599, 48536, 45466, 32113, 10273, -39266, -54603, -76949, -70535, -28213, -38014, 2611, 17313, 40865, 12790, 39581, 94732, 134508, 152363, 128143, 101164, 58901, 2268, -11763, 16055, 4599, 6479, 26803, 21241, 26060, 25751, -29745, -46612, -27538, -29935, 12395, 9720, -20501, -16117, -14268, 4460, 51377, 86783, 93565, 45112, 64137, 90991, 108941, 119908, 130076, 122600, 105033, 85662, 108445, 125480, 104835, 129326, 153948, 106818, 78901, 134772, 143839, 127383, 101156, 92910, 62355, 53849, 40409, 22484, 2250, 2912, 23535, 38465, 62667]
8020F2667N060m973l202j0311N67M53J424N1118J2379N244l241L2180L8148K7925
8006B15438Q629K9873P4275N5648J826m578l0820o9485n0069R154o468k5680k1306
7993A86437j4768k173M336L0428P01k3765j2968M099O013j8222m8547J7631J0059
7980A39261n3912o6063l7852j6258L544p349J1103J9322J6087N4342L7319k6812
7968G2732k6171r064m350J4267K2793K0013MJ0792K1213K785K8975L9347L1820
7955B25156o4091k8693k1965M4983M3750k7636K0514R941M6614K4856j6283l7390
7943B19756l3699o2708l4946k6812K438M5492M2062m7897o3101j3792K7176J8439
7931G2408k417J0641n0120j6991k4421N12K4193J9240k9447J1774Q2150j0298
$$ y = [62667, 67727, 62754, 59552, 49241, 49808, 50261, 51685, 102803, 115182, 120426, 117185, 149365, 187513, 215438, 224067, 253940, 328215, 383863, 385689, 381111, 350291, 280806, 230737, 239891, 233423, 207743, 186437, 171669, 169496, 173832, 204260, 204961, 181196, 168228, 172327, 178340, 160118, 111571, 129202, 139261, 85349, 19286, -18566, -34824, -31280, -38629, -27526, -8204, 7883, 62225, 99544, 72732, 46561, 37497, 33147, 47414, 70207, 90220, 90224, 101016, 122229, 125014, 153989, 193336, 225156, 161065, 132372, 110407, 155390, 199140, 171504, 192018, 201959, 248573, 273429, 257146, 219756, 186057, 123349, 88403, 61591, 64029, 109521, 151583, 103686, 40585, 26793, 53969, 72408, 69991, 80632, 30512, 13521, -10900, -10388, 13805, 33045, 3598, 15372, 97522, 87224]
7919H7224j1923K784L170j2253J4570j7453J9129q308r622j359p2090j6569O7141
7906D4441l31j1814P931l209R310Q243K2044j2129l5922m4556m472J8510n6072
7893e8026L1696O3863K903K8958N403l6549j7746K337j7890J0628j2594r360n544
7880a1921o033o467M207J0434K5794J7277j1299l6315l2115J0630K3706N9255
7868D7153J6459k0010m9558l3334M1240R857k2970k4860K2310K0152M4645j9750
7856C1334k3131P737O11k626l6513O485m944J555M8798J4239j6854K645k447p789
7842A9100l5628k9194J838N842k019k7605J8288K1309J8977m195M564K9102J894
7829B2273l1852k9928q869j6741K4002J0172Q568J2560P363L7944P466j8439k0869
$$ y = [87224, 75301, 78085, 81255, 69002, 83572, 66119, 85248, 76940, 67318, 65959, -6131, -22700, 44441, 44110, 32296, 40227, 37018, 46328, 54571, 76615, 64486, 28564, -15992, -20464, -1954, -58026, -26330, 37533, 40436, 69394, 74797, 38248, 20502, 22839, 4949, 15577, 2983, -6377, -11921, -17954, -24421, -20214, -9780, 16014, 33291, 21992, -14323, -46438, -35808, -12102, 47153, 63612, 43602, -5956, -39290, 1950, 11807, -11163, -36023, -13713, 6439, 51084, 31334, 8203, 15940, 16551, 13925, -22588, -16103, -21047, -19492, 29306, 43545, 26691, 29336, 26889, 19100, -16528, -45722, -43884, -38042, -40061, -67666, -49378, -28069, -9092, -13287, -8723, 20379, 22273, -9579, -39507, -48376, -65117, -41115, -30943, -22375, -9815, -2452, 35492, 42958, 24519, 3650]
7816C650j9924L2052K0651l8656k1556L1674l88m7786K742J1006J9607m966m8834
7803f0728j7789J8875J4482j264L7943L7677j0334L238M800p4588N09O3532l139
7790A3214j7789j1690j1134k9336K1343k0001J0312L395j686L4279N7647K3931
7778G2485n852n778M677n909l0148k3193j7387j4817N6216Q887q497j0658j1479
7765H547l5748K9700j9815j4999K2432j3029L652p154j2131P564j5549L7164J702
7752g664j2098L413l4530m6096k0009N1054M2242M598j0727m2825K3087K2448
7740b7107J898k2882o854K7922o134L3046k7360k974K2724L2369L5358K4771m5690
7727C9087n8398p4999N636J2986L2384K2112O357p180J498L7921J566N126K5340
$$ y = [3650, -16274, 15778, 36429, -2227, -23783, 7891, 7503, -40283, -37541, -26535, -6928, -11894, -60728, -78517, -59642, -45160, -46424, -8481, 29196, 18862, 22100, 26900, -47688, -47179, 16353, 13214, -4575, -16265, -27399, -56735, -35392, -55393, -45081, -41686, -43372, -9093, 48554, 72485, 66633, 60855, 65532, 59623, 29475, 6282, -11105, -25922, 30294, 39181, 30684, 20026, 8547, -27201, 2499, -17316, -32315, -9883, -22912, -19260, -26414, -38545, -30981, -46530, -9366, -7664, -19762, -16349, -50879, -96975, -116984, -65930, -23688, -19090, -29817, -72642, -49555, -27107, -25209, -48091, -54945, -27023, -33157, -111, -27471, -30445, -7721, 24648, 60006, 84777, 39087, -19311, -94310, -88674, -75688, -43304, -21192, -14835, -22015, -20517, 17404, 18970, 24096, 49436]
7714D9436j3051L44J1044n127j9032j4098J266k6229l1348j457k0276Q775N3078
7701f675L6855o189Q214j3552q518l834j4811j5774J6965J4619m5161n747J4378
7688b9230m872l2290L8293J4510j8041N845M265P0696N2962K413m8616n974Q203
7675E8164j7495l9675k8119M4489L2584k9297n2298M5108J1071p354K930k2011
7663a903k4292J4632J7352k0418P910R239q31k2466l7353j2606J2452J7364J8068
7650b2852J486K7519M082K1011r566k8683n6962m766m7607N3307O0228k6264j9875
7637d8942P395N0773l132j2024j85j0428N36J9694k2652J347J7371J164J4632
7624A5549m290j2743j2894l4542J7139L2547j6412j8162L3282J1345n729m6328
$$ y = [49436, 36385, 36729, 47773, 42646, 23614, 9516, 10782, -15447, -46795, -48252, -68528, -59753, -6675, 30180, 23991, 32205, 18653, 10135, 6301, -8510, -24284, -7319, 7300, -37861, -43608, -29230, -34102, -66392, -28099, -13589, -31630, -25785, -21520, 49176, 102138, 104551, 55935, 49961, 58164, 40669, 994, -27125, 17364, 49948, 20651, -31647, 13461, 24532, 17178, 20108, -1903, -26195, -11563, 5789, -14629, -6719, 2520, 1689, -20777, -58130, -70736, -58284, -40920, -22852, -21366, 6153, 10235, 31246, 21680, -7003, -63965, -68731, -116338, -63031, -2803, -29067, -48942, -41547, 9226, 6094, -5930, -6115, -16543, -16007, 3687, -18965, -17618, -247, 917, 15549, 11259, -1484, -14378, -48920, -31781, 766, -15646, -33808, -526, 10819, 5090, -41238]
7612d1238Q353J1952R640K5779n5662R40L5195J2903J7429o673K6511J5795J7432
7599G8356M332r928j02301l9388m082P801K1345K4399J502k3934J2172N7622k987
7586B4909l6106j9726o007k802L0831P865P412K2368m0351j5369L0808k483r855
7573h506N544m3894j4921J8253N9305Q146R457m6720j998J382j201K4845P627
7560A7319K3928j2448n503j1615m3865j4363l2303K0768K484M038J9703L0172
7548a685l027k2191J1140k2240j0988K0379m887J0768L9609p79q165J85M0576
7535D8695n839m2536J2031l927L383k9370j1324N2431L1360n141K7992k0494k8724
7522B8537m3858k3705r759J9282J191l2977m166K5871J2280N835N4551L2789l4118
$$ y = [-41238, -32885, -20933, -11293, 14486, -41176, -40236, -5041, 7862, 25291, 18618, 45129, 60924, 78356, 82688, 72760, -29541, -68929, -73011, -65210, -43865, -19466, -17964, -41898, -29726, 27896, 24909, -11197, -30923, -36930, -39732, -8901, -1036, 6376, 28744, -11607, -26976, 3832, 1349, -8506, -2962, -46856, -61777, -43524, 15781, 23927, 33384, -13336, -15334, -13952, -15153, 9692, 17319, 41247, 28799, 23296, 11681, -32184, -46547, -78850, -58082, -55598, -51560, -31857, -1685, -4712, -26903, -15763, -38003, -48991, -28612, -33499, -22731, 16878, 16099, 7934, 8119, 48695, 42856, 320, 12351, 8424, 11807, -17563, -28887, 23544, 54904, 49763, 77755, 57261, 28537, -15321, -39026, -48785, -29503, -28312, -61289, -65455, -39584, -27304, -21469, 33082, 65871, 31753]
7509C1753o2420J9349L1611j6726r439r918J3376L0191K8788m6481k4945j0275
7497b5136p273P0469r970J28l2133j3541J765J2524j2967l053J8476J3929k6350
7484a3132k8979P889P861R656K788k5032J7963L2243Q304q154K6596Q765l8463
7471H305k2153J9744o030q418k6150N673J874J7503J1397j0674k5041K5318m2563
7458e1215K990J7824K7739P335K0931J0997n4187m3223K2436k991N106J0494J8735
7445g029J7572k0447l60j5454k102p054J040l0378j1499K1174l1771k816L9396
7432d9728N8415m613l1228n0215L6p745J0215M3846K9992K968o2536k844J9199
7419d4238j4400P8K6148N9989q099m152O322n457J1600n579k5138P967K1290l8936
$$ y = [31753, -30667, -11318, 20293, 3567, -5872, -15790, -2414, 27777, 56565, 10084, -14861, -25136, -32409, 38060, 28090, 28218, -3915, -17456, -15691, -3167, -16134, -19187, -711, 13218, -13132, -42111, -34222, -26361, -16705, -13917, -38949, -20986, 11257, 19561, 11407, 38003, 46768, 8305, -13848, 5896, -134, -8552, -34702, -29029, -27155, -9652, 1745, -8929, -33970, -8652, -51215, -48225, -30401, -2662, 4673, 25604, 36601, -17586, -60809, -38373, -41364, -36258, -25764, -7029, 10543, -9904, -10264, -25718, -27820, -34874, -33834, -64212, -75711, -54537, -86308, -89124, -49728, 8687, 4074, -27154, -77369, -77333, -85078, -74863, -31017, -1025, 1943, -60593, -63437, -44238, -58638, -58560, -32412, 27577, 19478, 15326, 21648, 16191, 27791, 22212, -2926, 5041, 26331, -12605]
7405a2605J9970l433k618k3973k9525J4170K7684l2731k5953J864R173Q810N880
7392d3287N1073J5458L967j5963k4648k9772k2548J4479J4731j1604r714L7910
7380a9918J9414l7949L709K3246K9237J9717j8451m0163l3668j9021J3307J0379
7368e0161J0347J1433J4644L3868Q058r059K7327L3628j860o6137q0126N433L5588
7355b7017L0390K670J127L2j6199j6767J4499j4480p708J0146J3238J7860O690
7342A4481N283k4130l9933K296J7862q364q877L2110O1047k8048j2411L2042j5907
7329B7451J0638j663k7398l459p365r055m2139J1319K772k5966r593L5343M6448
7316G333K5612O914k5015J3849J909L0853j7223n5736j3065J1030M881J7228P856
$$ y = [-12605, 7365, 3932, 1314, -22659, -52184, -38014, -10330, -43061, -69014, -67150, -57977, -49167, -43287, 7786, 23244, 27211, 11248, -13400, -43172, -65720, -51241, -36510, -48114, -57828, -19918, -504, -38453, -34744, -11498, 17739, 37456, 19005, -21158, -54826, -73847, -60540, -50161, -39814, -28381, -13737, 20131, 28189, 19130, 46457, 80085, 78225, 12088, -68038, -62605, -27017, 3373, 6043, 7170, 7202, -8997, -25764, -11265, -25745, -33453, -23307, -10069, 7791, 14481, 19764, -4366, -44299, -42003, -24141, -32505, -41382, -9272, 51775, 23727, 11316, 43358, 27451, 38089, 36426, 9028, 5569, -1796, -10851, -52990, -41671, -38899, -64865, -74458, -39115, 7333, 32945, 39859, 14844, 28693, 30602, 61455, 44232, -11504, -24569, -13539, -8658, 8570, 16426]
7303A6426j2681l1046l4836K3971r792j0346K6842j7336m0067j8611Q4358N2988
7291B9870j7674j9836P011J9214J7787J0522L673Q020l906K904l2018l8649l24
7278a3406J237j4999O954o667K5531K6555J2232n2267k4466k1124N491P519O765
7265d0645R964J1528k8488n2395N3993J6535m3208K3646J8079j2437K3693J1174
7253h561l1864k2198M493L8398N1949j6203k9689j5184o96M737R116J688r682
7240b3696q084j4382Q170K8046L5222j90l0737j9806N4301o996k1663L8010J3242
7227E1437o414J4599j9079k7986k4386j0629k926j150K9479L1179r937j3566j8651
7214h030n1930j1527M1120M5514K3373l0046k1063j4839j1584K5936j2753K6710
$$ y = [16426, 3745, -27301, -62137, -38166, -47958, -58304, -31462, -48798, -88865, -107476, -23118, 29870, 12196, -7640, -629, 18585, 36372, 46894, 50567, 58587, 54681, 57585, 25567, -13082, -13406, -12169, -27168, -20214, -26881, -1350, 25205, 37437, -14830, -39296, -60420, -54929, -47410, -40645, -30681, -19153, -47641, -100036, -46043, -29508, -72716, -49070, -30991, -43428, -19735, -8561, -40425, -62623, -58130, -19732, 32217, 16014, -13675, -28859, -29555, -24818, -15702, -14014, -23696, -31780, -46162, -37992, -9946, 25276, 25086, -5651, -25457, 28844, 21848, 185, 38195, 51437, 45023, 59622, 40543, 12557, -11829, -22458, -25384, -26534, 2945, 34124, 24187, 10621, -8030, -59960, -71487, -30367, 15147, 38520, 8474, -12589, -27428, -39012, -13076, -25829, 881]
7202H81P581j7914o580l4172j6330J2457M7514r761l939l190n760K8332K9078
7189B8197K0432M9556N357n4694J1232J5718n2335l9278k8784N0307M0015j9097
7177B6626m7203m1095M8371K9455J8818N5697r951l9197Q249l1891k4617k4553
7165c1291k7865K8825N679N5989J8571k6068J7111J3581J393K333L0592j0292
7153G8558p202k2171O688J4302o257j1857j3902n2471J0443N4752k3455j07840
7141h0412l4588M3624M6181K2044K462q442k7462q754k3227J8092O814K1977K1876
7128A85M1033J0433N12l0158l9962n2185j819P459M1107P697j4011j8345J2705
7115c5349M1578j0140l002k6656k049L0718M667j7227K3977P0738J8705j2143
$$ y = [881, 8462, -9452, -16032, -50204, -66534, -54077, -6563, -16324, -20263, -23453, -29213, -881, 28197, 48629, 98185, 103542, 48848, 60080, 75798, 23463, -15815, -44599, 5708, 45723, 26626, -20577, -61672, -13301, 16154, 34972, 90669, 80718, 41521, 49770, 17879, -6738, -31291, -59156, -30331, -24652, 31337, 49908, 23840, 40951, 54532, 55925, 58258, 88850, 78558, 71356, 49185, 55873, 70175, 63918, 52061, 38159, -14312, -3869, 50883, 27428, -80412, -115000, -71376, -25195, -3151, -689, -9131, -36593, -45347, -68574, -50482, -43668, -21691, 185, 41218, 51651, 52163, 22005, -17957, -70142, -71961, -64502, -23395, -15698, -29709, -48054, -35349, 6229, -3911, -6913, -33569, -35618, -4900, -233, -17460, 6517, 77255, 95960, 83817]
7103H3817k0216n5829l291l201j2335j21O154J8171N592L5285J0835n2851n1804
7090c9794n2485j5628J0294k4991j1160N5052K8732j6674j495j9330l686O80o720
7077i7205J7833M3641o937m061K093K9122j4260J0564k381Q717k2632J2045J2699
7064a0762p026K1933K2831l1731O810j9295q025k161K6754P264L8438J0596J4904
7051G0530k5006j6602j6170k0423J0021K5194l934j570j8179J374k2802l6745
7039e4312K374l368q46J5032K5704J2130k0386j4654j5610j3041K2808l5843P815
7026g2197M6487L5356J8701j3966K3416J8171m2772k4017k2995k3858J6604N732
7014c5338l005k4792L4239n73K1016K956J6177J8562J6906J3833m225k3319l0572
$$ y = [83817, 63601, 7772, 4481, 1280, -11055, -11176, -5022, 13149, 18741, 54026, 64861, 12010, -39794, -92279, -107907, -97613, -122604, -133764, -78712, -49980, -66654, -68149, -87479, -91165, -90485, -97205, -79372, -35731, -42668, -46729, -44636, -15514, -29774, -19210, -21591, -12874, -35506, -23461, -10762, -17788, 4145, 26976, -4755, 2055, -17240, -25265, -27426, -672, 6592, 45030, 55626, 70530, 45524, 28922, 12752, -7671, 2350, 27544, 23610, 22040, 3861, 5235, -17567, -54312, -51938, -55306, -56152, -41120, -15416, -3286, -23672, -38326, -53936, -66977, -44169, -80012, -72197, -25710, 9646, 28347, 14381, 37797, 55968, 13196, -10821, -33816, -57674, -41070, -35338, -38343, -63135, -28896, -29469, -8453, -5497, 10680, 29242, 46148, 59981, 55756, 32437, 1865]
7001A865n695l332L0228L5818j8584j8251j644j9212j875J421J210k4143k5871
6988d8065j6525j0553j2655K1882J3377K5199K4349L154o296l2065j5509K7566
6976b6141k9024l379J8169J7780K6466j7546k7578N432M2112l0269j2378L839
6964c2517j2333K3958Q656l3534M218N1684K3290k118N407l9838k4612J3831k7812
6951d1720J130L8972m104k066p337m9765L6272J4049K435j5344j2737O993M6357
6938A3135K4733n731l8926j2346l7201J1436M3333K1976J9722K8161J2721l8300
6926D2713k2822m784o679j4897k0010K3647j0709o490J0144L3636L1290N5677
6914A10716M1202l5662n9061k1759M9J8232m1378k6538K701j075J1689l923l434
$$ y = [1865, -3830, -7162, 23066, 58884, 40300, 22049, 20405, 1193, -682, 739, 1949, -22194, -48065, -64590, -75143, -87798, -65916, -52539, -27340, -2991, 163, -6133, -38198, -53707, -26141, -55165, -58544, -40375, -22595, 3871, -13675, -41253, -35821, 6291, -23978, -36356, -32517, -44850, -20892, -12236, -45770, -41552, 10132, 33422, 31304, 36711, -3127, -27739, -13908, -41720, -40590, -1618, -5722, -7788, -15125, -64890, -28618, -14569, -12134, -27478, -40215, -33222, 13135, 37868, 32137, -6789, -19135, -56336, -44900, -1567, 20409, 40131, 68292, 81013, 42713, 19891, 15107, 8428, -6469, -26479, -2832, -13541, -20031, -9887, 23749, 55039, 110716, 151918, 116256, 57195, 35436, 35485, 53717, 12339, -14199, -11498, -12573, -884, -4807, -8241]
6901h241k3529P861m2315l094J572M8783N0720r994l888j2298k5451m8L6213J4704
6887C0995p7006k6555l2865N83M1483M6046k6568o0428M3911L8612J9915K914
6875A037m3894J106M2865k5092l3407k9920k0863L8980O0091L6365N312k3568
6863I012m861L421R082k0988m3339k69K0607o032O503J9010k7814k4995M7595
6850a3068J4250j5990k2691l7709L78K7103k3675K3089J2995L4555L0394K5137
6838E4768M0598j2457m3039J9917k0444l6232j2712K2649K4316L36m4170k6324
6826c2794K8336N906l5147L652O518q819l139K3047j2066K1386K2225q7617k0715
6813h9227L3596M1955L1670n6788Q02J1128j9043J9110l202r725L288K345j0527
$$ y = [-8241, -31770, -23909, -66224, -69318, -67746, -18963, 31757, 21763, 17875, 5577, -19874, -19922, 16291, 30995, -46011, -72566, -105431, -104848, -63365, -17319, -43887, -104315, -60404, -21792, -1877, 1037, -42857, -41751, 1114, -23978, -57385, -87305, -108168, -69188, -9097, 27268, 32580, 9012, 4151, 7572, 16654, -4334, -47673, -47942, -27335, -33367, -26864, -7854, -35668, -60663, -13068, 1182, -14808, -37499, -75208, -74830, -47727, -71402, -48313, -35318, -763, 29631, 54768, 95366, 82909, 39870, 59787, 39343, 3111, -9601, 13048, 37364, 37700, -6470, -32794, -4458, 1448, -33699, -30047, -23529, -32348, -35487, -12440, -24506, -3120, 19105, -68512, -89227, -55631, -13676, 17994, -38794, -37992, -26864, -45907, -26797, -29999, -39724, -36436, -34091, -44618]
6800d4618j5142o034k382J9952K9750k5541j8607j6447k5872J1357M0405M8529
6788d650K4623k4586l424j590l6014k371k3172J9814m682J8342L2979k0035J6232
6775h534O4944L3089J6101J1964k5411o4017q7345m37Q307L1988L377O5p29J0200
6761f438M6970M683q900O827l7565k7591R360m3185J1081J7434j0715K2421O702
6748h916J2292M205K2606k1055k8807r346K3415K6648J6745l747j8691l007J5544
6735B7886N225o466M923K1755L2704j6501J8436j7281j1296j7572K4326j8971
6723D7168j0572Q314J8913K559L7151O5274O2780k3784l0275k164m8810m3361
6711H3193n4848j3599j7204O436p728k9193J1590K8637K0135K2820j3617k5015
$$ y = [-44618, -59760, -65794, -68176, -48224, -18474, -44015, -62622, -79069, -104941, -93584, -53179, -4650, 19973, -4613, -8037, -9627, -45641, -48012, -71184, -51370, -56052, -37710, -4731, -24766, -8534, 56410, 89499, 105600, 117564, 92153, 28136, -59209, -59646, -51339, -19351, -15974, -15909, -16638, -6438, 40532, 45215, 36315, 43142, 5577, -22014, -12654, -55839, -44758, -27324, -38039, -15618, -8916, 3376, 7581, 30187, 9132, -19675, -29021, -5606, 21042, 37787, 34040, 15349, 12342, 27886, 33111, 26645, 31568, 53323, 86027, 69526, 87962, 70681, 59385, 41813, 66139, 47168, 36596, 44910, 63823, 66382, 103533, 168807, 231587, 207803, 177528, 175364, 126554, 83193, 28345, 14746, -2458, 3978, -3750, -32943, -21353, 7284, 27419, 50239, 36622, 11607]
6699A1607m4241R826M2043M0075K0307l0314K585K2588J881n8860o5769J0420
6687c7852M3472Q130R024K1815K3137m3207q624k065j525k8826J6540k6227k1439
6674d7647L270K0768O174M7060L2676k5654J4044q287j9453k7444l9470j7458
6662f1421M6713M4295J1391J8539K5501j9065m415N12J1933l5044m2096J0557
6650G400K1446k2233l4831k6730J4839k2927P517P9952M4280L406k7773k0575
6638B3771L108r622j8655n3830K512J1660j669m309m65J5490K0902k7346M105
6625c4348K513K4099K0174K8432k3642l3742K0096j6185k3479j360j6577k5485
6613g9504K2640J4016L1648M0925M5355K5163O762J8371j4078k8152m8020l171
$$ y = [11607, -32634, -22808, 19235, 59310, 79617, 49303, 51888, 74476, 76357, 17497, -48272, -37852, 5620, 13750, 22774, 44589, 67726, 24519, 15895, 13830, 12305, -16521, 19, -26208, -47647, -44377, -23609, -17435, 29625, 62301, 36647, 50691, 42404, 22951, -4493, -43963, -61421, -14708, 29587, 40978, 59517, 85018, 65953, 61538, 62050, 73983, 38939, -3157, 7400, 28846, 6613, -28218, -54948, -40109, -63036, -55519, 24433, 68713, 72119, 44346, 23771, 26879, 17257, -1398, -55228, -52716, -41056, -42725, -47034, -47499, -32009, -11107, -38453, -34348, -31835, -7736, 12438, 40870, 17228, -16514, 3582, -12603, -36082, -37442, -54019, -79504, -56864, -42848, -11200, 29725, 75080, 100243, 107005, 125376, 111298, 83146, 35126, 31955]
6601C1955m5304J262L5345M518q230Q605l5109J267K9448J382m514o254m5956
6588c1585l169K4458L0078M5126K7575m630n9506n4393Q165O702K6401j6611m1948
6575d3337r782r012m246J7410N045K2918J0686k4410M4473q02m0241K9560L9093
6562C7355j1890l9469J5288P354m2647n4665J4193J7440M6394k7908l1324K9586
6550d0293L9333j2292n9929L285L9277l285j8168l653K2314K3037M486k4619M420
6537b6087N0842N3804n1609l1359J0410m0505P987l475j3399p952J6986N216L8852
6524I711k888k8172K643J0899j8404r25J2484M0213j6010q261l2977N119l6667
6511f3235l0063J6891L4535J4453r094j4953R642K1006J2274k3905M433o734Q220
$$ y = [31955, -13349, -12087, 23258, 27776, 19546, 28151, -6958, -5691, 23757, 25139, 20625, 14371, -31585, -34754, -10296, 19782, 64908, 92483, 87853, 28347, -26046, -17881, -11179, 15222, -1389, -43337, -53119, -62131, -66377, -48967, -43922, -21004, -10318, -34728, 9745, 8943, -31298, -1738, 37355, 25465, -14004, 1284, 8638, -34009, -88674, -74481, -57041, -10647, -38555, -69879, -40293, -960, -13252, -73181, -69896, -30619, -33904, -52072, -55725, -33411, -10374, -5888, -30507, -26087, 24755, 78559, 26950, -4409, 6001, -34504, -26517, -29992, -43391, -51343, -34357, -29141, 9711, 6823, -21349, -18706, -7807, -26211, -27136, -14652, 25561, 9551, 1290, -31687, -26568, -63235, -93298, -76407, -41872, -27419, -36513, -51466, -41824, -20818, -8544, -32449, -28016, -34750, -26530]
6498b6530M8056j695J8903K8194j8607k9713k3754r894Q210m8454L4051J2560
6486h673o278L26l5716r14R874j1594J9365K3279j5994l1401O878O0834K1313
6473C1299k598K7838m702j6105Q839J1495j9105l0433K5660J950J0567m382j4128
6460B6195l3503l3426o303L3457K964j5016m86k9690j9352J9540m72k3730M620
6447g5202j459K8258L2296p56K5347l811K9175k0371K839l504m0783r848j5404
6434e3223R254P4769N832k8793l9878l2024J5114P2544p624l8354J6504J7721
6422A1842m2566J7567K9784o16o3704k3708Q504L705J1140n8068l3284M4997J1378
6409h3029O2735K4912J7531k9096j361K4147l0650j8498J7874J8392N079j4713
$$ y = [-26530, 21526, 19831, 38734, 66928, 48321, 18608, -5146, -15040, -6830, -55284, -21233, -8673, -14951, -14625, -50341, -51255, -41381, -52975, -33610, -10331, -26325, -57726, -50848, 9986, 31299, 28701, 56539, 51837, 35732, 44571, 56066, 36961, 6528, 32188, 34138, 44705, 40323, 26195, -7308, -40734, -47037, -13580, -10616, -25632, -26118, -55808, -75160, -55620, -56092, -79822, -75202, -76661, -48403, -16107, -16863, 8484, 4673, 33848, 13477, 16316, 12812, -27971, -37819, -53223, -43969, 30800, 36632, 7839, -32039, -64063, -48949, 23595, 15971, -22383, -5879, 11842, -30724, -13157, 16627, 16011, -47693, -71401, -62897, -59192, -48052, -106120, -139404, -94407, -83029, -20294, 4618, 22149, -6947, -8308, 15839, -14811, -33309, -15435, 2957, 8036, -6677]
6397f677l1026l8133k551K4786L1612O736j2027J1682J061j7063N4610k3096J5816
6384A5730J0321o8878l2353K888M9980N1796M457j0171j1452j1937J2957l2760
6372a9422J7326r190l3131q004L6479J3593K1080R777M8243m49j1238m370l8162
6359B2532l9600K9333L6793j9044j2654J3626J8945l1414k3830j3669J5660L388
6347F6l2784m1933K6625l1789J2623j8516Q818N1931J5201P503J5030J672j8668
6334d221r900q062j9334l7621Q635P128K6263j8961j8292k7598M5098O6948L0867
6321D0950J3863m62j4856o065o106k9587M550O506J3144K5134J4993k2037L968
6308D3995K1563J3473L6133m8426n5917r400o793n757R833L266o22L4151L7250
$$ y = [-6677, -37703, -75836, -78387, -53601, -21989, -15253, -27280, -15598, -14537, -31600, 23010, -86, 15730, 26051, -42827, -75180, -72292, -22312, 29484, 33941, 23770, 12318, 381, 13338, -19422, -2096, -11286, -44417, -52421, -15942, -2349, 18731, 28508, 76751, 76302, 65064, 60694, 22532, -17068, 12265, 49058, 30014, 17360, 30986, 49931, 18517, -5313, -18982, -3322, 66, -32718, -74651, -48026, -79815, -67192, -85708, -76890, -24959, -9758, -2255, 12775, 14447, -4221, -14121, -22183, -41517, -79138, -70503, -63375, -37112, -56073, -74365, -101963, -56865, 10083, 40950, 54813, 54351, 39495, 33430, 27324, -2263, 2287, 8793, 21937, 47071, 62064, 40027, 43995, 65558, 79031, 115164, 66738, 10821, 1421, -5372, -11129, -1296, 1970, 1348, 35499, 72749]
6295G2749j3166q679K8046k912j043J510j065j6730J1295j5253o2919K634L0878
6282B5345K8223J722j329J3009k742o0273m21J0895K3686L266k2682j0601m291
6269C807L557m3118j3142l1179J9057K2577k9637j9162K2636R091L3722N7071
6257C5280L1548j2218r857j8547R932l0766J3478O410n21J3537k3594k7214k833
6244a5365J2542j6026l2099j8232K7930N536J9856L2559o172J0264L636j0300
6232A4129J3942K884l3779J4420p0187o2198j7732J7282M9421J6175m1061J5141
6220h1563M1748p402j3180n90Q4j1113j9405K220j03N654K5522j7240J2234N6905
6206f229L9507L6220l9506k4066R282J3583n9487J1882N794N260j7680L7611l8943
$$ y = [72749, 59583, 50904, 78950, 76038, 74995, 76505, 75440, 58710, 70005, 54752, -8167, -5533, 25345, 53568, 55290, 53961, 66970, 64228, 3955, 3534, 14429, 38115, 41381, 18699, 8098, 3807, 7364, -35754, -48896, -80075, -61018, -38441, -68078, -87240, -64604, -55513, -21791, 35280, 66828, 54610, 44753, 26206, 36138, 5372, 18850, 25260, 24739, 38276, 14682, -12532, -15365, -2823, -18849, -50948, -69180, -41250, -35714, -15858, 16701, 10529, 20793, 24429, 14129, 28071, 30955, -2824, 11596, -58591, -120789, -138521, -121239, -71818, -55643, -96704, -81563, -39815, -47217, -60397, -60987, -60903, -72016, -91421, -89201, -89304, -83650, -58128, -75368, -63134, -6229, 33278, 69498, 29992, 5926, 15208, 28791, -30696, -18814, -13020, -7760, -25440, 12171, -26772]
6193b6772M0282q951p5115M948O1576l389k8J4829L2243K6579o3226l9426O173
6180c0277N0617J5147j497o28l9724K3062O24J282k3273J3674k7370r855J8248
6167i970q988j2482J0582P883j8693N23k4800k7851L6831J8517Q168P947j3650
6154b5983o556J5067K1956L8618k4751j2225j5827k2554p442J0888r957K6090
6142a2676K0034o021K4669k3416q562N127n33j449J8374P839J9036l0908k9390
6129a7876k0840k487L4163l0097J7954K9558K2914n806l631j5279m761J6186J5391
6116C5389r001j9096K2463J6541J864k3686l8312J3180q570l6357R298L1276K6634
6103B1623n840l992P857k0381k689n445L0859k2469J2811m736l6269J6879l294
$$ y = [-26772, 13510, 4559, -70556, -65608, -4032, -7421, -7449, 7380, 39623, 66202, 2976, -36450, -30277, 20340, 35487, 33990, 33362, -6362, 16700, 17324, 18606, -4667, 9007, -18363, -28218, -9970, -18958, -31440, -20858, -12975, -31668, -31145, -55945, -83796, -46965, -28448, -20280, -12333, -25983, -32539, -17472, 4484, 43102, 18351, 6126, -9701, -32255, -39697, -28809, -38766, -12676, 7358, 1337, 26006, 2590, -5972, -845, -1378, -2827, 15547, 23386, 42422, 11514, -17876, -38716, -41203, -7040, -37137, -19183, 10375, 33289, 27483, 23852, 8573, 3812, 19998, 35389, 26388, 7292, 29755, 46296, 48160, 24474, -13838, -658, -9228, -45585, -36287, -5011, 21623, 15783, 11791, 19648, -733, -3422, -8867, 21992, -477, 12334, 7598, -28671, -11792, -15086]
6090a5086j4022P383L2800P207J1783L4102j8945l9486l8876o1227nL9188L7438
6077a7746K5084j0432j957J9118M253j1427o958N3938k4116l5073j7930L7512
6065A4266j0952k1933M1922p008o3572q865K169K0228M76j5052j4031J3406M8871
6052g5N6053l9896l3929m2563j9048K439M0748K7956j5155K1429J4005P553J4911
6039C4428j302l2770l8797L5683L1069j8519J7078j4412k6201k1156M791L9861
6027I753O99K0159n909m2686j4208l363J3729N656J7809Q798J633K6978n1033
6014a1985q620j4309l8664j1738J3108M8312j1336q224M5388K4129l4068J2681
6002D674K6905P508j2819K080j776j2570k0741l1982J9901M7247q105j4684j9345
$$ y = [-15086, -29108, -21725, 11075, 18282, 30065, 64167, 45222, 5736, -33140, -94367, -94372, -55184, -17746, 7338, -3094, -5051, 14067, 18320, 6893, -65, 53873, 29757, -5316, -23246, 14266, 3314, -18619, 23303, 16295, -47277, -56142, -53973, -33745, -33269, -48321, -62352, -48946, -75, 55978, 16082, -17847, -60410, -79458, -77019, -36271, -8315, -23470, -2041, 11964, 19517, 34428, 33126, 356, -38441, -2758, 28311, 9792, 26870, 12458, -13743, -34899, -30108, 9753, 10452, 30611, 24702, -17984, -32192, -35555, -21826, -16170, 1639, 10437, 12070, 39048, -11985, -20605, -34914, -73578, -85316, -72208, -23896, -35232, -43456, 1932, 26061, -8007, 4674, 31579, 39087, 26268, 28348, 26572, 14002, -6739, -38721, -18820, 28427, 20322, 5638, -13707]
5989a3707n9820K0177j4173L5105j74l4837M5163J7025j1596L322M3304o191J7451
5976D1049k9807O804J6280l9942m6486L607L0768J83L4761Q522m1515N6P438K0430
5962A2148m145l8747M4377L1260k9672j6573M773M396M4267o859n5963m4937j4909
5949g0584K9049J4267J6384m402k8294k7817k215R488K4058J6063J4463K1445
5937A1905O069k8933L689J317K3799K1380l8699o741M4685k867K824m765q338
5924B5325J4844o696j5717m614l6872r219N37O838l3038L3213O1414r046k8302
5911a333l8052L1571J9291k3997l1173l5163M5891j3572k7976J0272K2212N2252
5899A0223M3948J2804l1841m0809k4006j9422O487K0554J5107j7301l716r457
$$ y = [-13707, -73527, -53350, -67523, -32418, -32592, -67429, -22266, -5241, -16837, -13515, 29789, 23598, 41049, 11242, 18046, 34326, -5616, -52102, -48495, -17727, -17544, 17217, 25739, -15776, -15720, -8282, 12148, 8003, -30744, 13633, 44893, 15221, -1352, 3421, 7817, 52084, 45225, -10738, -55675, -70584, -41535, -27268, -10884, -15286, -43580, -71397, -73612, -64124, -40066, -24003, -9540, 11905, 17974, -10959, -7270, -5953, 17846, 39226, 527, -6214, 38471, 35604, 38428, 33663, 25325, 40169, 33473, 17756, 13142, -23730, -32949, -32412, -25574, -58612, -25399, 36015, 26969, -1333, -39385, -7814, 11477, -12520, -43693, -78856, -32965, -46537, -74513, -64241, -42029, 10223, 54171, 66975, 35134, -5675, -29681, -49103, -42616, -22062, -6955, -24256, -27972, -37429]
5887c7429j5246J1912J5826n724O823L1860J7995Q008J0240k1535n497j5028n5565
5874e3360Q777K1296m705q89K4356j163k8293j5449o415j6013K6135K4720J5690
5861e313j7800R39R346Q055n69J0155l187l5218l7929L8716N0579N810j8410q587
5847c413k2667k4429J4747J9203K7609J9825j5065j4824k859k8233K3034K1826
5835A4754l6083k8812K066K7962R775m6945m1179L843L4198L2131K4887k5670
5823b9073k2764M2568L0877j5826m554l3212j1690J5339N3171L3540J2096j9412
5811E1060l0304m159k6032M208k193j8487n0599R085N3180N4832J6769k9953l5840
5798h433l8961q275R54l1783j928j9306L1770M7747j583K2281J1126P472K1268
$$ y = [-37429, -52675, -40763, -24937, -30661, -23838, 8022, 26017, 34025, 44265, 22730, 17233, 2205, -53360, -44583, -23287, -27992, -28881, -4525, -5688, -33981, -49430, -55845, -71858, -45723, -21003, -5313, -23113, -22174, -12828, -4773, -5342, 4813, 1626, -33592, -71521, -32805, 17774, 23584, 5174, -3413, -26080, -50509, -35762, -16559, 11050, 30875, 15810, 986, -1873, -30106, -7072, 14754, -21329, -50141, -48075, -20113, -10338, -57283, -98462, -94619, -60421, -28290, -3403, -29073, -51837, -9269, 21608, 5782, 1228, -31984, -43674, -28335, 24836, 58376, 70472, 51060, 20756, 16597, -9435, -5227, -7420, -25907, -76506, -67421, -14241, 40591, 57360, 27407, -8433, -47394, -55669, -54715, -86498, -88426, -107732, -75962, -28215, -29798, -7517, 3609, 11081, 32349]
5785C2349m688k0049k0730j2644J7955k1854l5112m467O3238J9276l6010L5923
5773A3187J4893m9542L907J2938k4862n183M0274J5194L02j1347k906N35J1767
5760A9157J5151J4553o083k3219j1877n8626j7251M2234M4391n938p961J911j485
5747D957L675k1057k641L320l8127l3493M0618K7675L21N675l3972m723K0650
5734b7122K243N016L7294R160L2011n845Q515l0424L1199J1131k4585k6713Q779
5721C0659R62O385j5050m9958O102L5046N5843k1406k4256O878K0967l6624l4356
5708a8808J1366N626J044l900J8296L2611n714m4577j0821L1434L4718K0422j1242
5695F0455J1807j1403k8596k4126K0457J0764n0065r914L1605P995J6847k4927
$$ y = [32349, 27661, 7612, -13118, -25762, -7807, -29661, -64773, -69240, -6002, 13274, -22736, 13187, 28080, -21462, -17555, -4617, -29479, -34662, 5612, 20806, 21108, 9761, 6855, 7390, 19157, 34308, 48861, 42778, 19559, 7682, -50944, -68195, -25961, 18430, 12492, 4531, 6442, 4957, 8632, -12425, -15066, -11746, -49873, -83366, -42748, -15073, -14752, -9077, -43049, -47772, -27122, -24879, -19863, 17431, 26591, 58602, 52757, 61272, 30848, 62047, 73178, 48593, 21880, 30659, 31621, 38006, 22956, -27002, -20900, 14146, 69989, 48583, 24327, 31205, 52172, 15548, -18808, -7442, -1816, -772, -4672, 13624, 46235, 40521, -4056, -14877, 16557, 51275, 71697, 60455, 72262, 60859, 32263, 8137, 28594, 39358, -10707, -20621, 10984, 18979, 35826, 10899]
5683A0899j1113m2294k1301L9624M0331j3798l5387R671L1368j4578o293k2496
5671c5367L2550N7722J6595N54j3525j2025Q442k6761K1032k0095j2780N9580
5659G5922N465n3305l8724o6110J7131K8627J0414k2270O378J4908j0998j228
5647c3790J7773j9777m822m3309O141K7997L3490M2981l5624n6728l1922K2366
5635g5224M0428K6955L5928K4202k281l213j5349j9194k0922j4992R423J4140
5623i9m5202L4796j2952m3241j0252L1083P9829j3095j6279P8j1265j2526l6027
5610e5152L213L4488k3648j3884j159R719J4763K6796j7915J274J7420J1701L9965
5597D7581n0453l7944L0478K9810m02p00p470n747j5417j4696L0988O666k2548
$$ y = [10899, -214, -42508, -63809, -24185, 16146, 2348, -33039, -23368, 8000, -6578, -12871, -35367, -2817, 54905, 71500, 72054, 58529, 46504, 54946, 28185, 49217, 29122, 16342, 75922, 81387, 28082, -10642, -76752, -59621, -30994, -20580, -42850, -36472, -21564, -32562, -33790, -16017, -35794, -40616, -83925, -77784, -49787, -16297, 26684, -8940, -65668, -97590, -75224, -34796, -7841, 28087, 52289, 50008, 46795, 31446, 12252, -8670, -23662, -14239, -99, -45301, -10505, -23457, -66698, -76950, -45867, 33962, 20867, 4588, 4666, -6599, -19125, -55152, -51939, -17451, -41099, -54983, -56142, -46423, -31660, -4864, -22779, -21505, -4085, 7616, 47581, -2872, -40816, -10338, 19472, 19070, 18370, 10900, 5153, -10264, -24960, 6028, 12694, -9854]
5584i854J241L547R728k1848J5576J0689L062l9455J3276p761j7288m712L5857
5571g942K9010j243K834n619J1601M0913J5763j4185k1989k3152n5697p397M4492
5558G389K0169r58l2318K520j4047o945j923J8211j190J2177J4353K2785N327
5545D5550k1442j1979M6737J8552m5369m0914o6783J282K4781J4336j255p328
5533d3832M9192L6561j6006M60Q142N08j5676k4764k2684K956J1757n4701J9203
5520d8884M9492M0972k7744o0454P51J582M2618K7748J0822j4670L193j420j6401
5507G605N78k17N486L0857J0999o8649j053J6635J8349j1316R056j2745J5121
5494B0706K662r882J3135m7358k6496M9719j4730L929L3548N446N029J5844r109
$$ y = [-9854, -8613, -5066, 4662, -17186, -1610, 9079, 12141, -27314, -14038, -21799, -39087, -43799, -7942, 21068, 19825, 22659, 17040, 28641, 69554, 85317, 71132, 49143, 25991, -29706, -37103, 7389, 27558, 26600, -5718, -3198, -17245, -24190, -26113, -7902, -9092, 3085, 17438, 40223, 45550, 24108, 12129, 58866, 77418, 32049, -8865, -75648, -74366, -49585, -35249, -36504, -43832, 5360, 41921, 25915, 26375, 34517, 35025, 19349, -5415, -28099, -25143, -13386, -68087, -48884, 608, 41580, 13836, -46618, -45867, -44285, -1667, 26081, 36903, 22233, 25426, 24006, 7605, 8183, 7966, 13452, 44309, 55308, -13341, -14394, 2241, 20590, 9274, 18330, 5585, 20706, 23368, 13486, 26621, -20737, -47233, 2486, -12244, -8315, 25233, 30679, 35708, 51552, 42443]
5481D2443L1345p981L411k3778n7601l0744O3329N0293j6932k733r832j0404k7061
5468C755K2894M4398j8963k4521n5304J5109R100j5872L6827N0642K0876J1344
5456A00285l7461l3357j1939k4748k2079l3964q672j3592N515n542O822N3509
5444b5223J6492M087J4161K1772q429j7855L4940j8716k3745m1466k0241l292
5432f7515N0986J2547K418K327L7654p822r629J734k4358P677l3211l2239K2980
5419c6451J1543K2870N4596K7361j4843m6155L0721J1854l0785l1984j3222O159
5407h336L003K5415k3232J3429J7192O258k5897k0539Q498K0729l4556K61K7412
5394I637j3682J7987K5578m032n7o2835p2105L644N8676L9176J721j0985j6674
$$ y = [42443, 73788, 65807, 69218, 45440, -12161, -42905, 20424, 70717, 53785, 51052, 41220, 30816, 3755, 26649, 71047, 52084, 27563, -27741, -12632, -3532, -19404, 17423, 68065, 88941, 100285, 62824, 29467, 17528, -7220, -29299, -63263, -71935, -85527, -80012, -85554, -78732, -25223, -8731, -4644, 9517, 31289, 22860, 5005, 39945, 21229, -2516, -43982, -64223, -67515, -16529, -3982, -1564, 763, 38417, 30595, 20966, 22700, -1658, 6019, -27192, -59431, -36451, -24908, -2038, 52558, 79919, 65076, 18921, 49642, 61496, 30711, -1273, -14495, -8336, -5333, 20082, -3150, 10279, 27471, 33729, 7832, -12707, -4209, 16520, -18036, -17775, 9637, -4045, 13942, 39520, 35488, 35431, -27404, -99509, -95865, -37189, 1987, 3708, -7277, -23951]
5381b3951l2230j3588J8714O2756l64o1605M300M1005M9987L1024o474M217K0993
5368I4784j4858k4182j9006l7058n0403L449L9716J5394J9758J7329o52o0714
5356a6443o1448O121K2795l765k0445j1945O014J2381O103Q793k466K8692j8023
5343d3636Q52q602J0879j4590j0185m028K834K2652K9528k6469J0587N7790j0910
5330A6702k7836j7112M6300o083N17J7116O232q91r496J673l4760k9402M994J6533
5316a5513L8195j7023l5174M772J7126J6448p370j4916q563J1110m482L2366r689
5303G287l469o466K9926K7225j5665j6868n004K4169m4717n3669j3983J7376K5431
5290b8427K3674m0183L196q53J9223O64q131k8033K2399J7202j9320L662K3307
$$ y = [-23951, -56181, -69769, -51055, 11701, 11337, -50268, -45968, -4963, 45024, 76048, 69574, 73791, 94784, 79926, 55744, 36738, -320, -50723, -47274, -7558, 7836, 27594, 44923, 44271, -16443, -77891, -71770, -48975, -52740, -73185, -85130, -79116, -66735, -60632, -51839, -54305, -25613, -43636, -42784, -51386, -40507, -55097, -65282, -69310, -66476, -43824, -14296, -40765, -30178, 27612, 16702, -11134, -28246, 18054, 11971, 12488, 29604, 35836, 34945, 25449, 27122, -7638, -37040, -32046, -15513, 22682, 5659, -29515, -24743, -7617, 8831, 1461, -13455, -22018, -10908, -15390, 16976, 7287, 3818, -2648, 27278, 54503, 38838, 21970, 16966, 41135, -3582, -57251, -71234, -53858, -28427, -4753, -44936, -41740, -42593, -23370, -22706, -30837, -58870, -36471, -19269, -38589, -34927, -11620]
5277a1620O3830L6574l5863k2699L67J2961r4j0960l4763j9387k5295L8443J8236
5264I730l4653k5900j7417K8720R274J5787K942M8267M175m347n3680j5242K5066
5251g278j5926k7686K814M6860j235k2163k5162L0258L035J1157M9295N6145J6137
5238A16251q461O81l4297o3504k1929j8169K2268L7624J2356j1257N3318J1480
5226I6361q8411l9872r712K1431K8993J7526k1859k8940j0930J514J035J2857
5214b0007j9183j0988L244J6886p012Q80m649L3717L7474j5647o0957K91L0265
5201a5686M3196p635l9903L8535J1240M428K432p181R198L416J9873J5955l9622
5188C8246l0545L03p536l7878M132k1312k4717L4568O0825j024k282o245K0212
$$ y = [-11620, 52210, 88784, 52921, 30222, 30589, 43550, 43456, 32496, -2267, -21654, -46949, -8506, 9730, -24923, -50823, -68240, -39520, -30246, -14459, -11517, 36750, 40925, 36578, -17102, -32344, -7278, -23204, -50890, -48076, -1216, -2451, -24614, -49776, -19518, -16483, -5326, 43969, 100114, 116251, 107790, 108471, 74174, 10670, -11259, -29428, -7160, 30464, 42820, 31563, 84881, 96361, 7950, -31922, -41634, -20203, 8790, 26316, 4457, -24483, -35413, -33899, -32864, -20007, -39190, -50178, -46934, -30048, -37060, -36180, -40829, -7112, 30362, 14715, -46242, -45951, -15686, 27510, 19875, -20028, 18507, 29747, 34175, 36607, 29426, 38624, 42040, 61913, 77868, 38246, 7701, 8004, 468, -37410, -33278, -54590, -79307, -44739, 16086, 15062, 12780, 6535, 26747]
5175B6747j9142J0981K8393J7604k8247l2690j6843R132K3558J3247k0454p490
5163D796J4396m0562j0971K0806j2885q795L0100k7702J3766N0026Q277j9168
5151B2084j1285J0780J5952J7486l2461k139l1578l0607M1555J2132j136J684
5139A2467J0386J1259J0385L0444L1912J0051m5098n1143J1293K226K660l2454
5127D388m3640j8970M3008L0811j023K2509m460m2374j9259J3518J4259N583k6443
5114b2093l312L2811j5004J8002O027m4520j1141K1729J3091M37K3248N624l9498
5101a4599j9990K5219M8430J6159o862n700O546J0381k3032J2300L624K802o002
5088D9276L2385n779m3477j8418k0693j7486k9539J2100N1661J5050L0596K685
$$ y = [26747, 7605, 18586, 46979, 64583, 36336, 3646, -13197, -4065, 19493, 32740, 12286, 4796, 19192, -21370, -32341, -11535, -24420, -33215, -3115, -30817, -17051, 32975, 41252, 22084, 10799, 21579, 37531, 55017, 22556, 20417, -11161, -41768, -213, 11919, 10783, 12467, 22853, 34112, 44497, 74941, 106853, 116904, 71806, 20663, 31956, 34182, 36842, 4388, -39252, -58222, -15214, 15597, 14574, 37083, 32623, -9751, -29010, -15492, -1233, 4350, -22093, -25405, 7406, -7598, 10404, 16431, -28089, -39230, -17501, -4410, -3973, 19275, 24899, -14599, -34589, -9370, 39060, 55219, 48357, 42657, 49203, 59584, 36552, 48852, 52476, 55278, 49276, 81661, 75882, 32405, 13987, -6706, -24192, -53731, -41631, 10030, 25080, 55676, 58361]
5076E8361l7021l1309j1290J1793M6237J2842l6406l4223n855J3109L9035n8872
5064c3599J074N0808K8527n009k4040M620R187l2983k279j4138l0353J5021p042
5051d0206m05L8186q452J1074J8125L5343n755m3614o4136K1628M6202j0442J3513
$$ y = [58361, 21340, -9969, -21259, -9466, 36771, 49613, 13207, -21016, -26871, -13762, 25273, -33599, -32525, 18283, 46810, 41801, 17761, 22381, 31568, -1415, -3694, -17832, -48185, -33164, -40206, -40611, -2425, -10877, 197, 18322, 53665, 47910, 4296, -59840, -38212, 7990, -2452, 11061]
$$ [...]
##END NTUPLES=NMR SPECTRUM
##END=
