##TITLE=Analysis number 313608
Compound Code cc 40339
Book Reference 443/52/8
Project Code adrs
Chemist Name emmab
##JCAMPDX= 6.0         $$ Bruker NMR JCAMP-DX V2.0
##DATA TYPE= NMR SPECTRUM
##DATA CLASS= NTUPLES
##ORIGIN= Bruker BioSpin GmbH
##OWNER= NMR
$$ XWIN-NMR		Version 3.5
$$ Wed Sep 14 11:41:15 2005 GMT Daylight Time (UT+1h)  MAYBRIDGE\NMR@NMR_250MHZ
##.OBSERVE FREQUENCY= 250.131544655141
##.OBSERVE NUCLEUS= ^1H
##.ACQUISITION MODE= SIMULTANEOUS (DQD)
##.ACQUISITION SCHEME= undefined
##.AVERAGES= 16
##.DIGITISER RES= 18
##SPECTROMETER/DATA SYSTEM= dpx250
##.PULSE SEQUENCE= zg30
##.SOLVENT NAME= CDCl3
##.SHIFT REFERENCE= (INTERNAL, CDCl3, 0, 16.4456)
##AUDIT TRAIL= $$ (NUMBER, WHEN, WHO, WHERE, WHAT)
$$ ##TITLE= Audit trail, XWIN-NMR		Version 3.5
$$ ##JCAMPDX= 5.01
$$ ##ORIGIN= Bruker BioSpin GmbH
$$ ##OWNER= NMR
$$ C:\u/data/dgb/nmr/ADRS/9450/pdata/1/auditp.txt
$$ ##AUDIT TRAIL=  $$ (NUMBER, WHEN, WHO, WHERE, WHAT)
(   1,<2005-09-14 11:40:58.17 +100>,<MAYBRIDGE\NMR>,<NMR_250MHZ>,
      <created by zg, POWCHK disabled, PULCHK disabled
       configuration hash MD5:
       62 19 C7 07 E1 42 D1 B7 37 6C 3D D0 77 39 F9 E6
       data hash MD5: 64K
       33 9F 35 40 F6 CC 57 1B D1 FB B9 84 AE 43 A6 33>)
(   2,<2005-09-14 11:41:08.47 +100>,<MAYBRIDGE\NMR>,<NMR_250MHZ>,
      <Start of raw data processing
       ef LB = 0.3 FT_mod = 6 PKNL = 1 SI = 32K 
       data hash MD5: 32K
       08 B4 3F BF F3 51 CA 59 00 92 FA EC EF 1B 68 B4>)
(   3,<2005-09-14 11:41:10.19 +100>,<MAYBRIDGE\NMR>,<NMR_250MHZ>,
      <apk 
       data hash MD5: 32K
       E0 77 35 95 93 25 26 59 23 4F BF 9D 36 F2 BD 6D>)
(   4,<2005-09-14 11:41:10.86 +100>,<MAYBRIDGE\NMR>,<NMR_250MHZ>,
      <abs ABSG = 5 
       data hash MD5: 32K
       0A 3A A1 AF 62 4B 9D E0 F8 4C 11 B6 00 97 4B F5>)
$$ ##END=
$$ 
$$ hash MD5
$$ AA A1 75 35 CB B2 1E B2 C0 79 E1 CE 9A C1 54 8F
##$RELAX= 
##$RELAX= 
##$RELAX= 
##$RELAX= 
##$RELAX= 
##$RELAX= 
##$RELAX= 
$$ Bruker specific parameters
$$ --------------------------
##$DU= <C:\u>
##$EXPNO= 9450
##$NAME= <ADRS>
##$PROCNO= 1
##$TYPE= <nmr>
##$USER= <dgb>
##$AMP= (0..31)
100 100 100 100 100 100 100 100 100 100 100 100 100 100 100 100 100 100 
100 100 100 100 100 100 100 100 100 100 100 100 100 100 
##$AQSEQ= 0
##$AQ_mod= 3
##$AUNM= <au_zg>
##$AUTOPOS= <21 >
##$BF1= 250.13
##$BF2= 250.13
##$BF3= 250.13
##$BF4= 250.13
##$BF5= 500.13
##$BF6= 500.13
##$BF7= 500.13
##$BF8= 500.13
##$BYTORDA= 1
##$CFDGTYP= 0
##$CFRGTYP= 5
##$CHEMSTR= <none>
##$CNST= (0..31)
1 1 145 1 1 1 1 1 1 1 1 1 1 1 1 1 1 1 1 1 1 1 1 1 1 1 1 1 1 1 1 1 
##$CPDPRG= <>
##$CPDPRG1= <>
##$CPDPRG2= <>
##$CPDPRG3= <>
##$CPDPRG4= <mlev>
##$CPDPRG5= <mlev>
##$CPDPRG6= <mlev>
##$CPDPRG7= <mlev>
##$CPDPRG8= <mlev>
##$CPDPRGB= <>
##$CPDPRGT= <>
##$D= (0..31)
0 1 0 0 0 0 0 0 0 0.06 0 0 0 0 0 0 0.0002 0 0 0 0 0 0 0 0 0 0 0 0 0 0 
0 
##$DATE= 1126694457
##$DBL= (0..7)
120 120 120 120 120 120 120 120 
##$DBP= (0..7)
150 150 150 150 150 150 150 150 
##$DBP07= 0
##$DBPNAM0= <>
##$DBPNAM1= <>
$$ [...]
##$SUBNAM7= <"">
##$SUBNAM8= <"">
##$SUBNAM9= <"">
##$SW= 20.6930455092707
##$SWIBOX= (0..15)
0 0 3 0 0 0 0 0 0 0 0 0 0 0 0 0 
##$SW_h= 5175.983436853
##$TD= 65536
##$TD0= 1
##$TE= 295.16
##$TE2= 300
##$TE3= 300
##$TEG= 300
##$TL= (0..7)
0 120 120 120 120 120 120 120 
##$TP= (0..7)
150 150 150 150 150 150 150 150 
##$TP07= 0
##$TPNAME0= <>
##$TPNAME1= <>
##$TPNAME2= <>
##$TPNAME3= <>
##$TPNAME4= <>
##$TPNAME5= <>
##$TPNAME6= <>
##$TPNAME7= <>
##$TPOAL= (0..7)
0.5 0.5 0.5 0.5 0.5 0.5 0.5 0.5 
##$TPOFFS= (0..7)
0 0 0 0 0 0 0 0 
##$TUNHIN= 0
##$TUNHOUT= 0
##$TUNXOUT= 0
##$USERA1= <user>
##$USERA2= <user>
##$USERA3= <user>
##$USERA4= <user>
##$USERA5= <user>
##$V9= 5
##$VALIST= <valist>
##$VCLIST= <CCCCCCCCCCCCCCC>
##$VD= 0
##$VDLIST= <DDDDDDDDDDDDDDD>
##$VPLIST= <PPPPPPPPPPPPPPP>
##$VTLIST= <TTTTTTTTTTTTTTT>
##$WBST= 1024
##$WBSW= 4
##$XGAIN= (0..3)
0 0 0 0 
##$XL= 0
##$YL= 0
##$YMAX_a= 391304
##$YMIN_a= -423749
##$ZGOPTNS= <>
##$ZL1= 120
##$ZL2= 120
##$ZL3= 120
##$ZL4= 120
##$ABSF1= 16.4456
##$ABSF2= -4.247572
##$ABSG= 5
##$ABSL= 3
##$ALPHA= 0
##$AQORDER= 0
##$ASSFAC= 0
##$ASSFACI= 0
##$ASSFACX= 0
##$ASSWID= 0
##$AUNMP= <proc_1d>
##$AZFE= 0.1
##$AZFW= 0.1
##$BCFW= 0
##$BC_mod= 0
##$BYTORDP= 0
##$COROFFS= 0
##$CY= 12.5
##$DATMOD= 1
##$DC= 0
##$DFILT= <>
##$DTYPP= 0
##$F1P= 14.0000005364418
##$F2P= -0.99999901652339
##$FCOR= 0.5
##$FTSIZE= 32768
##$FT_mod= 6
##$GAMMA= 0
##$GB= 0
##$INTBC= 1
##$INTSCL= 1
##$ISEN= 128
##$LB= 0.3
##$LEV0= 0
##$LPBIN= 0
##$MAXI= 10000
##$MC2= 0
##$MEAN= 0
##$ME_mod= 0
##$MI= 0
##$NCOEF= 0
##$NC_proc= -2
##$NLEV= 6
##$NOISF1= 0
##$NOISF2= 0
##$NSP= 0
##$NTH_PI= 0
##$NZP= 0
##$OFFSET= 16.4456
##$PC= 1
##$PHC0= -80.48935
##$PHC1= 5.4006
##$PH_mod= 1
##$PKNL= yes
##$PPARMOD= 0
##$PSCAL= 4
##$PSIGN= 0
##$REVERSE= no
##$SF= 250.130019108697
##$SI= 32768
##$SIGF1= 0
##$SIGF2= 0
##$SINO= 400
##$SIOLD= 32768
##$SREGLST= <1H.CDCl3>
##$SSB= 0
##$STSI= 32768
##$STSR= 0
##$SW_p= 5175.98343685301
##$SYMM= 0
##$S_DEV= 0
##$TDeff= 65536
##$TDoff= 0
##$TI= <Analysis number 999999
Compound Code 99
Book Reference 9
Project Code 9>
##$TILT= no
##$TM1= 0
##$TM2= 0
##$TOPLEV= 0
##$USERP1= <user>
##$USERP2= <user>
##$USERP3= <user>
##$USERP4= <user>
##$USERP5= <user>
##$WDW= 1
##$XDIM= 32768
##$YMAX_p= 391259623
##$YMIN_p= -654414
$$ End of Bruker specific parameters
$$ ---------------------------------
##NTUPLES= NMR SPECTRUM
##VAR_NAME=  FREQUENCY,     SPECTRUM/REAL,   SPECTRUM/IMAG
##SYMBOL=    X,             R,               I
##VAR_TYPE=  INDEPENDENT,   DEPENDENT,       DEPENDENT
##VAR_FORM=  AFFN,          ASDF,            ASDF
##VAR_DIM=   32768,         32768,           32768
##UNITS=     HZ,            ARBITRARY UNITS, ARBITRARY UNITS
##FACTOR=    0.157963299565203, 1,           1
##FIRST=     4113.53836973114, 0,            0
##LAST=      -1062.44506712187, 0,           0
##MIN=       -1062.44506712187, -654414,     0
##MAX=       4113.53836973114, 391259623,    0
$$ Real data points
##PAGE= N=1
##DATA TABLE= (X++(R..R)), XYDATA
$$ [...]
20133 -11411 1262 2160 -60 -242 6124 3314 4300 -774 -7356 1013 3885 -5343 -4908 -488 1710
20118 1710 -1303 -6278 -4007 438 -1866 811 3950 -1532 1589 1346 5050 3285 -5317 -15988 -17262
20103 -17262 -13028 -4301 3611 3265 -3738 -11857 -3746 -1623 -4618 -8717 -7854 -3784 -5596 -15164 -18030
20088 -18030 -14815 -15004 -15144 -13019 -8598 -7054 2086 3617 16 1249 5105 10156 11311 10653 1282
20073 1282 -3490 -3447 -1485 3025 10035 7467 10393 14441 9434 7180 636 -4102 -480 99 -762 1469
20057 1469 3206 4198 2105 3635 5059 3287 9092 11913 4923 5539 4673 2778 -1514 -3993 -7328
20042 -7328 -7718 -7723 -2257 -1138 -4710 -8692 -7232 -3530 3162 1883 -2799 1266 11152 15344 11822 6033
20026 6033 1669 252 -1253 -2499 -4199 -1058 13146 11425 11420 12507 1561 -5352 -2516 -2614 -4121
20011 -4121 -4955 -7929 -6458 1471 8743 10403 4620 234 7512 7452 377 -7294 -12234 -9695 -1512
19996 -1512 -2932 -10333 -12677 -11704 -9491 -6539 -8083 -7826 -13432 -7560 -2587 1667 2992 -174 -5127
19981 -5127 -1389 -551 -7538 -10906 -5101 -3743 4106 -3056 -8410 -9823 -4033 -1407 10429 16189 17927
19966 17927 16612 8381 677 766 1121 7656 12354 14559 10596 7853 7850 718 -4799 -3201 1337 2613
19950 2613 3323 -806 -10423 -12725 -4141 5795 6881 3323 3970 3163 9341 10666 5364 602 -2241
19935 -2241 -1913 6427 7010 7602 5724 -43 -240 -474 3153 5379 5918 10015 14598 11902 6113 5407
19919 5407 1476 356 1940 -3951 -6507 3561 10587 7942 1622 287 626 1021 856 1105 8308
19904 8308 9145 3285 5256 7166 9525 4986 -583 -6870 -935 10254 13735 9548 8338 9574 13418
19889 13418 15573 951 -9264 -793 836 -409 3119 6167 10615 5668 3955 -285 2443 -709
19875 -709 -8015 -6721 -5771 1039 4878 3870 3460 1915 -718 -2510 -860 1145 2642 5708 10509
19860 10509 10517 6341 -1753 -1857 9659 8441 3827 1031 -4639 -6505 -8164 -1787 2873 2707 1191
19845 1191 3199 184 -2518 -3799 -6381 512 7354 4348 14096 15024 9064 3074 -4682 -7481 -10007
19830 -10007 -12331 -6968 -943 1156 -2014 4920 10316 8905 5120 6937 10728 16159 5403 -3968
19816 -3968 -3144 -2890 1362 479 -1959 1816 2157 2277 2705 2694 6388 9512 9737 3100 1060 -456 2741
19799 2741 6022 11642 9928 7058 5041 4498 734 5884 9610 8614 12852 14325 11743 6091 6180 10324
19783 10324 9424 8490 5795 6330 6237 1306 5560 6995 2899 2958 -2365 -3628 -3605 -2327 6283 3936 102
19766 102 7263 5466 -1279 -704 930 12538 14450 10036 12748 9779 572 1648 1727 3811 1329
19751 1329 1302 1783 -2190 -3797 -50 -6313 -6565 -3009 536 3105 357 -2064 1214 4726 2426 7189
19735 7189 4393 -674 1188 2150 -3208 -5422 -5624 -1402 -2314 -2857 -665 -3069 -5566 -6454 -3424 1966
19719 1966 1525 -1424 -905 -4709 3457 8529 9894 2623 -3651 -4230 -1976 -59 4153 5773 1731
19704 1731 601 1094 7534 8567 5039 7382 3894 4927 5540 5519 3814 2373 1323 7254 10292 11373
19688 11373 12724 9687 8165 2897 2762 11669 11972 3617 -5922 80 -480 -2216 -1442 1425 390
19673 390 3961 4501 -4018 -3344 -1105 -1491 -3503 -123 6620 1329 2806 3583 6215 8227 10079 17323
19657 17323 11161 4023 5037 5661 3084 -2906 -1855 4623 4020 6348 6388 9973 10950 9623 4235 8013
19641 8013 16286 22796 20600 26530 31617 40921 45103 50626 67829 80351 86198 75992 62598 52313
19627 52313 50358 50426 50430 56229 63674 73598 80006 83336 74021 69453 66767 69196 67358 64540 57093 46136
19611 46136 40873 35308 36022 39286 34718 34252 32459 22611 21574 22843 23466 21791 22212 25813 24444
19596 24444 22685 23997 27241 23921 18538 19754 28214 30963 42032 51683 58942 64559 71119 90873
19582 90873 116878 142243 159931 177101 182985 177569 170040 176425 178031 177388 178126 166204 161125 152348
19568 152348 143837 126780 101855 83394 66802 48356 43315 35064 31144 31965 28954 27654 31021
19555 31021 33243 35921 32772 24294 22336 24750 27321 25227 32008 36380 30880 27934 30369 29417 27568
19540 27568 34680 41177 51423 62216 59672 60548 59766 55541 50550 50315 53900 58312 61656 78948
19526 78948 90131 94450 101992 99483 104798 107879 108568 109772 108209 95419 77396 62357 48696
19513 48696 40429 42480 40813 36337 30700 27319 23832 22233 14044 7080 3640 2901 10543 11540 6182
19498 6182 5357 8052 9508 6019 4108 2788 9869 11202 9201 -765 -7770 -6075 17 12016 10084
19483 10084 1245 -6808 -4920 -1078 -1419 1085 -154 -3716 -5837 1623 3496 7928 5233 2388 -744
19468 -744 3929 5948 3411 -1999 -8958 -9185 -3174 1340 2160 1936 6956 11699 20577 23564 21809 20984
19452 20984 16456 7137 2055 7161 7732 3596 -159 -2997 -6197 -7511 -5665 3696 5990 1231 -778
19437 -778 3379 8710 12261 11718 17832 20933 14703 6049 5468 1367 -548 -941 4198 2064 3018 7857
19421 7857 2063 -2505 -9195 -8027 -1858 -6117 -9033 -4726 922 6295 1627 -2898 -6329 -3010 9499
19406 9499 15662 11404 8243 3070 2444 -269 7814 13196 16420 16601 14965 15504 15589 15348 11268 2676
19390 2676 1249 7703 17270 17121 10448 9365 8829 14599 18522 19968 18864 12821 15872 17422 14734
19375 14734 16619 16445 9024 11071 13448 11749 4434 5650 11709 19324 22811 27183 26631 29413 23292
19360 23292 23671 24382 22224 17486 17184 20015 19654 17828 13206 9888 13027 13576 14150 17206 18333 17275
19344 17275 19554 19632 26936 27432 15626 22605 28514 35672 41738 42774 39587 28079 19976 19473 15683
19329 15683 7477 3899 11724 15990 15720 12702 11128 14760 19871 24999 30163 35233 37915 45874 57528
19314 57528 57593 50237 40663 31511 27127 27422 24182 16539 11095 4794 2389 1270 4883 14740 16663
19299 16663 10235 4034 -2460 487 3506 2489 -3325 -14383 -14594 -11708 -13894 -17476 -15829 -9713
19285 -9713 -8513 -9167 -9280 -14912 -22473 -25329 -32615 -43646 -52196 -62271 -73020 -83767 -89136 -85606
19271 -85606 -61791 -33061 -4881 17276 32969 46773 49360 45923 44437 46815 41348 34321 25513
19258 25513 8834 -4309 -10299 -2594 3898 10011 23779 44739 66858 95179 129584 160054
19246 160054 174505 189245 187060 180991 170436 163689 155397 138470 127007 121978 120517 119951 120818
19233 120818 129590 137053 140912 140271 139885 135864 133372 127878 128827 123751 117311 111488 110360 116709 110882
19218 110882 98022 100441 105317 98296 96299 105388 117203 130822 143734 149387 154204 152483 152096
19205 152096 150422 142663 139865 139790 137001 134650 145783 158314 169102 184785 205188 227649 252487
19192 252487 270000 280896 283963 277569 253101 230425 211966 198083 188897 179146 178695 186807 201834
19179 201834 214150 221271 229031 237988 233538 222511 210796 204496 203335 203173 209742 211668 221409 233574
19165 233574 240216 253600 268071 283709 299560 312256 334325 363736 398129 440456 487078 529047
19153 529047 560319 591756 633571 681154 736626 801170 874018 953425 1051027 1192611 1399434
19142 1399434 1700254 2096232 2548653 3055940 3748086 4790818 6065064 6983176 6993373
19133 6993373 6277538 5532783 5210457 5243145 5309277 5144391 4681430 4083780 3613280 3407962
19123 3407962 3486352 3746584 3885906 3667575 3182352 2674446 2282039 2027185 1870331 1773024
19113 1773024 1721335 1700484 1715709 1768227 1831437 1904120 1983704 2102285 2296151 2554865 2881633
19102 2881633 3317339 3878921 4591785 5496539 6545999 7465364 7897971 7845760 7612197
19093 7612197 7470716 7544647 7891094 8590519 9779724 11724257 14857318 19665675 26363954
19084 26363954 34504127 42883600 49149412 51483278 50138464 45777309 39343119 32180226
19076 32180226 25606801 20445614 16875446 14660374 13475752 13106802 13495641 14777807
19068 14777807 17280630 21332551 26937470 33459810 39790693 44704579 47207013 46542475
19060 46542475 42627103 36544529 29667199 23185963 17885013 13943769 11129493 9168290
19052 9168290 7829155 6976396 6537325 6456368 6613240 6720889 6465587 5790522 4926686
19043 4926686 4123710 3471976 2968645 2597058 2320099 2115379 1962813 1843089 1756227 1704254
19033 1704254 1667028 1636069 1620184 1626065 1659674 1737226 1875079 2104074 2452290 2912081 3388008
19022 3388008 3673613 3682522 3545582 3458291 3544912 3877797 4368235 4791007 4990689 4987718
19012 4987718 4986553 5258007 5898813 6589732 6768298 6226265 5266591 4319320 3566396 2951292
19002 2951292 2410294 1942300 1572935 1301520 1103073 951624 827890 737249 665183 619301
18992 619301 582043 548007 526325 501303 469942 443183 407588 377972 349232 328113 317376
18981 317376 300467 280416 258140 235458 224418 210968 200741 194899 191818 186259 181633 174344
18969 174344 162912 150927 147437 151894 150842 142849 143753 144093 138654 139503 141686 144547 137698 129041
18955 129041 116004 100291 89772 83841 87343 93789 95997 111530 118542 122210 126547 117279 105479
18942 105479 102367 96899 95340 85974 75573 71015 61101 53381 47729 48475 50535 59793 63832 69041
18928 69041 64271 61068 59990 50610 37199 27847 27485 27528 22639 13307 10619 8232 8522 16000 20023
18913 20023 22441 22737 23666 24815 21702 19001 14168 16000 19420 16794 11353 6704 475 -4975 -3133
18898 -3133 4220 3098 6734 13039 23781 48883 73457 101148 115051 132148 133930 126592 119373
18885 119373 123437 117986 107979 102392 103087 127505 166105 225391 271218 279525 254790 230130 214243
18872 214243 203098 204076 201302 191175 177679 162497 148958 137339 123265 116278 109867 100448 96378
18859 96378 80844 73685 68295 66509 74745 78474 76078 67891 58947 56437 54330 58814 63507 60988
18845 60988 54766 51037 47999 46976 54488 58886 58393 58691 65053 68396 67605 70114 62818 59127 66807
18830 66807 74949 84536 95876 120433 139868 156574 156253 141093 124217 112646 103665 96173 98877
18817 98877 100575 100101 92768 82094 71414 65518 65246 61992 56865 58918 54685 51423 53226 52047
18803 52047 47066 38766 25662 27109 29413 39161 44572 43932 38538 39180 43385 46951 43906 41355 47532
18788 47532 54939 59574 66746 68297 62088 53117 45835 43325 44804 50858 45729 38389 42189 60982
18774 60982 83737 96060 100414 111203 116306 112297 102861 111861 128391 132853 114564 92618 78997
18761 78997 74602 70491 75571 84512 99311 93333 80833 82226 75081 61412 49160 42191 47658
18748 47658 50417 48462 46657 43913 44481 49827 57874 59458 55374 49926 39373 35176 33337 30186
18734 30186 33889 39903 43451 49350 56075 58439 50938 49595 41746 37472 28543 22013 21677 25135 25878
18719 25878 25923 30754 35692 39554 44675 48198 48930 37978 31150 27895 35265 41513 40673 43089 41810
18704 41810 44817 53304 62899 66125 56397 52120 48186 48558 44673 42932 47923 49594 51175 44546 42729
18689 42729 49223 49945 58508 53354 49997 47750 45407 52076 59016 56529 51095 43326 40281 36311 33708
18674 33708 34199 32816 24799 26031 21120 14073 11434 17281 16941 14685 17692 17069 16038 14560 16227
18659 16227 19854 18822 18189 14664 16343 22701 24199 16964 10157 22190 26517 20776 15561 19502
18645 19502 23991 24221 20354 17326 16631 18796 16654 17541 22391 24288 26756 23055 21105 20518 20519 21958
18629 21958 26915 38053 42401 42230 54610 66689 86198 101324 107373 107814 97169 86450 76928
18616 76928 83426 91768 97313 99977 112283 112514 110532 104770 96920 92251 87022 85383 79992 70529
18602 70529 63340 50636 37436 28216 21507 28690 29506 27661 27258 29608 31041 18536 14410 15282
18588 15282 19243 27240 30762 28753 24553 25971 33618 36725 41181 46102 45853 53016 64390 67520
18574 67520 66887 72003 82403 94327 106141 122354 144834 162454 166603 167663 172489 179212 177253
18561 177253 177533 187653 194103 191195 181580 159190 133243 114429 100296 81931 68306 61819 51155
18548 51155 47298 45590 46705 54203 60690 59786 55032 46852 46265 39124 36401 30882 31493 35351 41134
18533 41134 45337 41454 41731 42264 41054 37453 39259 42286 43981 48965 50702 59745 71057 81300
18519 81300 86345 81149 75773 74539 70189 69301 75206 81266 74780 64730 60566 66622 85748 97818
18505 97818 93746 81949 67851 57583 48469 37317 25339 11357 3886 3691 8908 18005 23403
18492 23403 18670 9626 8298 8635 3731 -351 -13288 -40275 -63729 -75336 -53953 -18154 5322
18479 5322 21115 34790 42752 44770 39723 39129 47088 51929 55945 53973 57141 55737 48198 48433 46730
18464 46730 46376 46571 50738 48496 49315 51426 57752 57050 55962 56020 51800 42698 35332 32799 36775 34240
18448 34240 39031 33054 26379 22794 26994 27218 29276 35873 43842 43816 40932 40585 41761 40165 32870
18433 32870 31732 32248 31697 40857 42960 49374 58139 62400 67912 69978 68729 68267 74812 97145 120241
18418 120241 128288 112534 88701 81156 77858 78430 89264 93614 92473 91780 92109 86192 86064 90284
18404 90284 100164 110702 119328 115290 106261 95064 82895 75482 80057 98467 124911 134307 123694
18391 123694 113356 104327 95859 89058 88127 80858 75588 79727 83239 88315 90626 94199 94403 97992
18377 97992 94965 85684 76383 74839 79060 77622 83567 83559 79339 83452 92932 98866 111251 122455 128878
18362 128878 133755 136783 138469 139950 140310 143001 151818 171660 200301 232165 252120 271202 297539
18349 297539 329556 336553 306002 267535 229898 206651 192775 189143 197895 205465 217234 227554
18337 227554 224539 222226 209079 198411 194854 189188 189983 193733 211044 230032 236557 250389 276421
18324 276421 299295 321194 345660 379066 415505 460720 520546 590096 679741 802980 954186
18313 954186 1097650 1205412 1294283 1383819 1497011 1659469 1862116 2055942 2208914 2336664
18303 2336664 2495115 2698035 2968853 3342544 3901236 4770168 6133852 8321350 12152184
18294 12152184 19156940 30486814 42878006 47292499 40382480 29238941 19957718 13670549
18286 13670549 9575196 6902187 5121417 3905190 3047699 2418922 1965974 1637379 1399145
18277 1399145 1228237 1120075 1065718 1029335 965968 867572 789893 763616 758144 720860 639803
18266 639803 546531 474474 429201 400183 385439 390051 403283 417632 409810 369187 322655 282651
18254 282651 257415 249556 251121 259880 270030 273494 272354 274056 287828 292109 283092 269206 264035
18241 264035 268012 264539 247442 223931 202687 180728 170775 165402 162925 157911 150091 144441 137718
18228 137718 131299 121973 110263 98395 87362 75793 71123 73355 72955 72696 71379 75194 75079 72144
18214 72144 67641 64589 70125 88857 101099 104385 90079 79927 75365 75434 76920 83447 89952 91733
18200 91733 100373 113136 133695 154651 177984 195816 196572 177526 160944 147230 133473 124844
18188 124844 121874 114594 114154 119113 126292 139780 175964 243891 359390 516614 620671 593268
18176 593268 472277 340843 240452 177149 140161 130974 130439 131147 132862 119382 86684 43660
18164 43660 21050 23925 35320 46086 52574 64272 74751 75240 76626 76263 72539 70724 71271 70988
18150 70988 77525 85694 82065 74405 63160 60809 60455 67330 78656 81893 79568 87687 90467 94411
18136 94411 99926 100712 102735 111137 125687 141549 155292 176194 200745 230420 263453 295998 341316
18123 341316 382078 417147 454129 496403 536224 580391 643686 732936 852898 1021349 1296920
18112 1296920 1764449 2619051 4263425 7227156 11045474 12873963 10992292 7721626
18104 7721626 5100923 3399832 2330701 1686093 1287519 1006420 796517 637879 518253
18095 518253 428505 354961 301146 261106 222974 197697 177405 151939 135984 127388 119094 111628
18083 111628 105798 97563 94592 89709 79398 75516 75796 75979 75327 70758 62576 56552 52484 41417
18069 41417 30106 32286 37079 28745 28656 31881 25330 20134 21067 25781 29097 34753 33611 31871 31013
18054 31013 34623 39356 37271 34959 33628 32681 29207 27177 30140 29465 30938 31871 23974 22896 26843
18039 26843 22504 22761 21557 20762 29067 25415 19717 19409 20088 20023 21425 18004 14564 12002 17567 17201
18023 17201 16916 12677 20431 25756 19494 11121 11875 11204 11550 9708 7751 13966 11774 4704 7175
18008 7175 11333 11405 12448 15733 16937 15747 19280 21324 17415 12230 8452 13560 19805 14841 15152
17993 15152 19518 19245 17586 14139 17695 19023 19880 22726 19779 22180 21230 15840 4900 -2264 4268
17978 4268 3209 6440 12384 13417 12233 7009 6845 4694 2193 1457 1532 2297 2338 7572 9600 7317
17962 7317 7749 6563 9992 10630 7326 9699 16037 18242 6163 631 5136 3897 6009 7826 -2418
17947 -2418 -3069 -1091 7508 5644 6311 5153 -3836 -4645 1452 -3483 -1015 1013 1620 -987 2696 5566
17931 5566 1838 7084 8477 645 -3981 -5536 -4320 -3461 -3999 -4630 -3540 -5643 -3748 -738 9687
17916 9687 25146 33865 28930 30382 31497 37132 43688 44654 36180 21076 10359 12183 12860 15274
17902 15274 14675 11068 10258 17278 19519 14649 14232 17015 5958 -1062 2744 7775 5329 8196 11108
17887 11108 12491 6137 -3188 -6182 -3999 -3730 -5512 2418 7210 12667 14730 13112 9880 6803 7411
17872 7411 8621 7147 5990 3952 1123 -4160 -1391 1728 2862 8517 8792 5239 4667 12724 13838
17857 13838 8492 -2334 -6539 -7995 -541 8083 8484 4697 5110 6886 4457 6255 7837 3588 4277
17842 4277 10884 6771 4384 3069 1882 6244 9535 5535 5848 9552 8649 4067 -120 -2524 -2823
17827 -2823 501 748 5470 6922 -105 1241 4409 6624 8344 4012 3381 9926 8575 8129 10368
17812 10368 3922 -2417 -1723 2660 9136 16463 17980 5408 3804 9042 6976 10075 10829 4258 2716
17797 2716 5686 -1354 4823 5662 6720 5474 1021 -3811 -7504 -662 -302 -8064 -12607 -14282 -10077
17782 -10077 1744 -2164 -5546 2517 7146 10219 18493 20704 16947 10242 12360 7294 -196 5703
17768 5703 7918 7358 5847 1338 64 -1287 -1186 186 6262 5232 2193 6230 12093 13044 5953
17753 5953 8223 4978 1497 1073 3657 2368 -622 -1782 -1319 1521 884 4691 5260 -3668 -6370 -614
17737 -614 6418 299 -3317 -2618 1057 1472 -4036 -2205 -906 2861 8200 9823 -1690 -6832 5329
17722 5329 6376 5319 5159 6415 3604 5289 6325 7918 12969 14681 17469 20272 17091 21745 16052
17707 16052 15827 26703 38293 48227 64052 87265 115137 159979 209274 228393 206500 161756
17695 161756 112427 76170 53620 47819 43703 35930 23193 15823 13107 11843 11851 15517 18190 16944
17681 16944 12914 7687 3892 1669 5177 5123 3137 4222 2199 3936 6851 7967 5162 -206 -9881
17666 -9881 -10540 -5624 -5280 -6874 -5495 1937 -686 -4650 -7856 -6612 -5733 -13185 -11975 -3459 -1239
17651 -1239 -4841 -7637 -5660 -6397 2271 2861 190 -3669 -10702 -9646 -2781 -1013 -3536 -5868 -2707
17636 -2707 -2530 -6496 -3354 -3859 -3656 1120 1650 926 2582 4392 3525 8278 6392 7276 5770 2413
17620 2413 -5780 -5394 -8498 -4226 2201 5508 5314 2437 -693 -178 -2800 -8937 -5445 -2932 -832
17605 -832 -468 -1366 -1973 -2909 -6579 -4715 -3275 -3137 -4818 -7334 -8401 -6631 -5590 -3325 563 -916
17589 -916 6064 7304 957 -3112 -5786 -10485 -12186 -16729 -9858 -4027 1412 2000 -3947 -14684 -11525
17574 -11525 -5111 -2651 -3412 -2225 1330 3158 -367 1588 5200 4760 1049 -1113 3486 4838 516
17559 516 -1090 5296 8257 10740 11846 15622 13845 3989 -4022 -4001 974 -6741 -12979 -11237 -10918 -10120
17543 -10120 -8783 -3359 -3119 -3759 -3059 -2132 -1613 349 7063 8739 12894 5069 -3738 -8972 -7895 -6590
17527 -6590 -7225 -6619 -2855 -1799 -833 1713 2545 622 -4220 -2159 1456 1992 1705 5255 9310 7885
17511 7885 2909 -875 -7310 -2701 8478 7383 -1793 -8072 -7567 -3888 193 5432 913 397 2350
17496 2350 10906 16763 17137 23693 24923 19493 15591 17003 17309 16328 12648 13970 9755 6871 9539
17481 9539 6535 5812 6945 4562 7847 7823 23 -4421 -4375 -7264 -9098 -12103 -11317 -3709 4138 9211
17465 9211 5857 1563 3938 5419 932 1377 1352 5171 12103 9377 10126 8162 5554 5297 7751 7507
17449 7507 5094 9289 13748 23300 25470 32006 47578 62584 78151 83703 63786 43143 34953
17436 34953 34092 32353 31481 41542 34183 28939 23638 16906 10279 1209 -9706 -12771 -13603 -7751 -5112
17421 -5112 -2589 6751 3849 829 8308 8960 4558 4852 4160 -2456 -2586 -1753 1863 1584 -4124 -5258
17405 -5258 -8234 -6803 -5585 -5225 2410 8883 11540 11851 11074 6682 9177 9327 2096 202 -675 -2743
17389 -2743 1053 8914 8821 8348 8424 12155 13982 14848 12924 14214 17660 12672 4744 -3648 -4902 -6924
17373 -6924 -8066 -9356 -11418 -7231 -10931 -10601 -6522 2280 4865 12962 13355 5849 2200 1089 2457
17358 2457 7810 11360 10094 2486 -3756 -8203 -7753 -844 1838 1140 1522 5288 7359 7355 2165 1131
17342 1131 3559 -9 -1904 -4930 -9614 -11967 -5287 -4743 -5281 -3603 5235 3913 -4147 -6511 -5945
17327 -5945 -4171 -6807 -5083 -3940 -1144 7345 4108 5915 3002 2200 5687 5353 4009 3618 287
17312 287 -9552 -8618 367 42 -255 -979 -3721 -3182 -1043 6421 9003 3849 -1053 -4543 -4574 -8761 -4925
17295 -4925 254 3467 5299 -126 -4642 -1271 881 1178 5130 11057 11537 8359 4462 -5618 -8375
17280 -8375 -9884 -10280 -1344 -1616 -4457 -2247 -10314 -16637 -15415 -6319 -1617 -1055 -4668 -6285 -5044
17265 -5044 -10412 -6304 -3051 4461 7161 2636 2741 4397 -1903 -4742 1854 2531 -5481 -12590 -11168
17250 -11168 -6732 2473 -1355 -4020 -3813 -3849 -1030 -1733 -2567 -2014 -5955 -4901 -569 8770 6479 9490
17234 9490 4300 3953 2441 -1657 -1012 -5173 -3080 -2517 2522 3934 717 -7045 -6047 -1593 2254 3079
17218 3079 2120 1709 8641 5499 -5564 -6419 3401 11443 12950 12936 8467 8755 9248 825 -2824 -3857
17202 -3857 -4935 -6746 -4504 773 -776 -7440 -15295 -13394 -12028 -6940 -1283 915 -1227 -172 1610
17187 1610 -1285 6462 13386 15743 11284 5537 3767 6875 14247 16254 14067 12330 10029 10315 7267
17172 7267 3932 -753 1933 2402 1002 -90 -1287 -944 -3169 -7905 -7104 -1574 460 5632 1623
17157 1623 1334 5255 -1604 -10191 -8447 -10027 -3740 4512 3322 -5285 -6677 -10315 -10409 -4253 -3882 3956
17141 3956 10742 8500 -80 -4272 -5484 -6588 -124 419 -5260 -9871 -10258 -3960 -4925 -5377 1432 5704
17125 5704 4939 4088 11841 11218 10903 15546 10193 7314 -1088 -9113 -7829 3388 5210 -1713 -2475 1212
17109 1212 3792 -2010 1047 7075 3527 7249 5842 2792 -3010 -3018 -5694 -5542 -1532 -1385 341 3285
17093 3285 50 737 6321 6105 1800 5830 3219 2643 5020 3444 6618 7040 6058 1841 -3345 -2920
17077 -2920 -2179 1559 -2667 -6371 -1259 1284 -5451 -8001 -5999 -5121 -10762 -6839 -4621 -5420 -389
17062 -389 -522 438 251 1116 -426 -578 -15 -7612 -15511 -12477 -4091 -2941 1071 1332 -4930 -5726 -3921
17045 -3921 -5860 -8798 -10443 -9915 -2063 -6126 -7792 3941 8407 -1677 -6237 -4083 7686 4525
17031 4525 -1952 215 4189 3935 -4015 -6395 -1133 4107 5403 -2338 -1359 -6639 -3603 115 -1224
17016 -1224 -2387 -6278 -4276 -3807 -1876 8834 11619 9222 11417 5574 4984 5070 3225 3433 3673 -1161
17000 -1161 -6885 -8430 -2254 6579 9182 5360 8490 5439 120 2836 1387 1360 851 -2686 533
16985 533 -2201 -4857 -5300 513 5100 6202 10009 6500 6654 409 -6798 -2052 787 7203 7279 2259
16969 2259 4728 910 -8246 -11887 -6023 957 -970 -230 1439 -4285 -6701 -7453 -6678 -7532 -7024 2562
16953 2562 7844 7141 39 1645 2217 -1917 -489 4058 8823 6836 2 -1042 -864 467 -1569
16938 -1569 -4185 -3216 1485 1010 1063 -2856 4199 1579 -2343 535 -104 1474 6648 2657 1286 3148
16922 3148 635 1821 5349 6868 542 -179 -4379 -2957 1488 2239 -1334 -8225 -5720 -709 -7412
16907 -7412 -11298 -7348 974 3026 -4095 -9670 -14243 -10968 -4710 -5783 -1602 -564 -1020 -173 4967
16892 4967 8247 8091 9038 5688 -3187 -5634 1017 6635 5406 3198 6415 6648 -6679 -11784 -13011
16877 -13011 -11932 -9592 -7176 -5144 -10306 -15328 -15942 -11992 -4669 -1216 -3886 -3454 1313 1537 -6024
16862 -6024 -4710 4000 7166 1465 1944 4147 8143 9792 8270 1738 6302 10256 6572 7551 -1363
16847 -1363 -8953 -7463 -2076 -5981 -5453 -2847 -2703 -1236 1016 960 4719 4408 2221 9329 8885 7428
16831 7428 3876 593 -1767 -3567 -5210 -4983 -760 -3984 -4837 8684 11822 -362 -1563 -5174 -2566
16816 -2566 1361 -3082 -8339 -8672 -10104 -941 3285 5561 9163 7847 -4695 -7805 -2507 -1040 -3895
16801 -3895 -5928 -2983 -1377 -8979 -7099 -3294 8045 9364 1492 324 -357 3242 -195 -7725 -4407
16786 -4407 -4581 603 7399 4019 -1131 1885 3539 6540 6025 -994 -2078 -2573 -3364 1810 -5179 -11543
16770 -11543 -6588 -4659 -7366 -5745 -6266 -2899 -4855 -8930 -5480 976 -7067 -10801 -13077 -10180 -9409
16755 -9409 -11991 -12952 -4018 -2264 -403 -1327 -150 412 1621 1946 1169 -4669 -12913 -15262 -10874 -7149
16739 -7149 -8834 -5645 -4960 621 2898 2796 7045 4891 -5041 -7475 -316 2956 3799 1687 4168
16724 4168 3272 582 -5004 -1668 1732 -4553 -6739 -2988 -2570 -5996 -5528 -4754 -8675 -6880 -5204 -5264
16708 -5264 -5568 -6757 -3357 -727 3673 -3275 -7253 -12437 -19250 -15611 -15153 -7550 -4683 -8617 -9866
16693 -9866 -2775 -6290 -11335 -3251 2565 -2279 1304 3946 -912 -4420 -3388 -3673 -4278 -8090 -11156
16678 -11156 -9294 -1119 3520 -3593 -13945 -9982 -7389 -9814 -7652 -7104 -6449 -2837 2535 8615 559
16663 559 -290 -2805 -3645 -162 6394 1906 -2658 1345 -613 261 6579 6888 5745 11364 9220 8036
16647 8036 8139 9948 3452 494 3287 2316 -2585 1697 2277 7259 10274 5305 -2674 -6172 -6001 -6737
16631 -6737 -8502 -8995 -5205 -3244 -1759 -3576 -5319 -6156 -4771 -1451 1589 5693 3598 -3146 -3166 -2821
16615 -2821 -1402 459 -3393 -9418 -15346 -14379 -6780 704 4142 6611 131 -3472 -3270 -3934 -5340
16600 -5340 -5112 -2218 -3100 -1950 -2605 -8077 -7091 -915 -1979 -1205 -8585 -13308 -16028 -10084 -8288 -6226
16584 -6226 -10427 -13536 -16334 -12395 -2649 1828 -2642 -8100 -5045 -8142 -5005 1386 5459 3830 293
16569 293 -4405 -5145 -10495 -10404 -4869 -5098 9 -128 -4525 -5518 -2791 -3124 -4164 -1058 -2071 -1885 2603
16552 2603 4091 3448 1917 -1789 -1624 -829 -162 -1060 2445 -2135 -3015 -7897 -12762 -12940 -13082 -8989 -5615
16535 -5615 -2794 -3543 -1824 2332 6838 10112 9549 7185 6110 7267 1112 -3366 -4171 300 4783
16520 4783 6867 2391 -1131 -8788 -18274 -17786 -18718 -13133 -11008 -11669 -9033 -5769 -7315 -3320 -1116
16505 -1116 -5111 -313 -1102 -6720 -9435 -7550 -9259 -10012 -4008 2463 5884 5748 -1033 -6403 1797
16490 1797 3697 2084 790 -5583 -7571 -6678 -823 -514 1703 455 -1989 -3840 -3314 -1284 -975 -9338
16474 -9338 -5864 -8251 -12957 -6133 -3973 -7488 -8134 -9724 -9281 -3306 -135 -4480 -712 2703 491
16459 491 1881 2205 -5455 -9292 -4264 -1897 5706 13934 5346 -2667 -403 1495 -1638 -6226 -4780
16444 -4780 -5466 -3807 -4079 -7636 -9238 -9266 -7492 -6702 -9985 -7607 -12410 -12962 -16549 -18009 -13295 -12323
16428 -12323 -5184 534 -3990 -9953 -10866 -11246 -10384 -9385 -5753 -3181 -1955 -3099 -1982 1222 5544
16413 5544 10648 8608 6842 4753 -3133 -4250 -7105 -4949 916 9392 9591 9028 5367 -1601 -4149
16398 -4149 406 7048 1987 -3073 -7756 -8343 -4945 -4389 -3506 -8646 -13040 -6792 -4289 917 -1181
16383 -1181 -2075 -4186 -5 -338 3854 4952 4192 7368 -21 -1021 1912 327 2187 4797 10531
16368 10531 13048 10662 -607 894 6945 -2072 -7028 -165 -2949 -883 2408 2241 5464 2139
16354 2139 43 -1563 -3495 -7151 -7827 -6614 -4322 -163 -7185 -12832 -6362 458 22 -2257 -7586
16339 -7586 -10471 -7389 -1306 4463 4350 686 -3729 -9936 -8716 -6316 -7797 -8046 -11240 -9586 -8743
16324 -8743 -7666 -12818 -19291 -12804 -3313 -1160 32 -1499 -2670 -5874 -3488 -10536 -8681 -1348 -666
16309 -666 2646 3957 5821 5197 -469 2518 12902 14121 9721 6465 10062 12380 14156 9335 8112
16294 8112 12956 12930 7704 8287 14220 9408 5259 3234 -1344 -1789 -1983 6226 2775 796 4369 9519
16278 9519 14164 14063 5864 2629 2760 1135 1160 -1569 -3060 -13859 -17068 -14964 -11147 -7941 -8636 -5881
16262 -5881 -5594 -6223 1724 7513 10476 7245 4034 7032 4598 -4775 -6702 -5840 -3178 -4427 -6450
16247 -6450 -11260 -11895 -7239 -2529 -8227 -10650 -11357 -9752 -6704 696 1902 -4435 -5499 -7859 -8955
16232 -8955 -6748 -6025 -2871 -7421 -7467 -9072 -8502 -1489 -5623 -13461 -10952 -7380 -4426 -3960 -279 -8442
16216 -8442 -9650 -6016 -5469 -4537 -4091 -5328 1613 -1751 -10176 -6761 -1462 -832 572 8410 10640 11958
16200 11958 14310 10745 11750 8067 7413 4190 -194 4000 3859 6537 6505 6722 3710 55 -8225 -14252
16184 -14252 -4475 -2042 -9596 -7875 -3909 -5000 -2434 2511 555 1940 3499 3757 -201 -658 -5661
16169 -5661 -1400 5877 8576 8030 6237 4448 2744 7232 10450 11484 7925 2139 -448 4688 5067
16154 5067 8404 9185 12392 13486 10051 11647 13261 9505 1275 -2714 -4159 2071 10141 9965 8449
16139 8449 4203 6555 3856 -220 -4514 -5878 -4172 5824 9014 3292 5359 1457 -995 479 -2590
16124 -2590 -3705 -3737 -13338 -19871 -18458 -10390 -2227 3785 7562 7121 9727 12962 8039 -3675 -8209
16109 -8209 -3760 -135 5823 4244 223 -3238 3448 10288 11221 7813 76 -6477 -7965 -4776 3886
16094 3886 6582 9629 6686 934 -537 -5446 -6278 -6974 -7647 -7216 -10217 -10835 -10320 -9 6724 8459
16078 8459 7179 4037 159 1634 5909 -2469 305 8341 9789 16276 22564 10112 2622 -925
16064 -925 -4139 -617 1094 2676 3559 679 -4241 -8834 -8536 -1303 7858 12510 8791 -2588 -11288
16049 -11288 -1743 2969 -335 142 -3154 -7691 -10349 -2930 3209 2433 1484 2926 1818 235 -1557
16034 -1557 -2306 -3058 -6747 -5404 1855 1687 853 4360 9110 5910 842 959 -536 2055 5246 3928
16018 3928 -2557 -5866 -8426 -5074 -3199 1348 5271 2193 -2508 -8335 -6173 22 1994 2005 -217
16003 -217 42 -1342 -3244 -5060 -4310 -5557 -4285 805 5049 5549 -3975 -7587 -4215 3260 8761 8549
15987 8549 2429 1792 4641 8851 3738 -2767 -524 -1647 172 -94 7359 7469 755 511 3274 4029
15971 4029 679 -2302 -1741 347 2206 4800 1050 9379 9526 1900 -591 -4154 -5023 -2964 562
15956 562 -1506 -6128 -1892 3703 -438 -7435 -10749 -6283 -2656 3202 10666 9177 9373 11018 11906
15941 11906 10669 4241 -3499 -5421 -1830 -2454 -4633 -5847 -3041 441 -1080 -6400 -7202 -7254 -5979
15926 -5979 -7036 -4951 -5494 -1556 6226 2452 -7534 -13793 -9342 -3836 -3417 -2844 -4067 -697 469
15911 469 4929 5851 5349 4767 1276 2800 3594 5340 4810 4770 8901 9913 8508 3326 4900 2013 -7245
15894 -7245 -13818 -13383 -12294 -8772 -11249 -7727 -4503 -4991 -12436 -13629 -14819 -11107 -5433 -3702 -4214
15879 -4214 -4915 1348 -1658 -5178 -6252 -3354 1254 -1689 -5326 -3252 573 3436 1251 -3591 -1769
15864 -1769 -2382 479 2838 7425 6674 2898 6250 3567 -374 -9146 -9940 -9387 -10097 -7850 -11811 -18394
15848 -18394 -21440 -15089 -8863 -8242 -13983 -5948 -3611 -2013 6493 14116 18005 7644 -2161 -4776
15834 -4776 -5925 -12611 -15398 -2306 3379 -1469 -1957 -1015 -5996 -882 2490 3325 5128 6001 6408 7078
15818 7078 4534 -2916 -2439 596 -4150 1992 4111 5604 -907 -6427 -9655 -10816 -6779 -2577 642
15803 642 -1193 1776 7293 665 -1925 -3461 -9133 -6104 -7803 -7017 -3290 5616 8476 7040 6542
15788 6542 6303 2596 -5636 -10865 -9623 -8773 -8284 -8527 -3966 5480 5270 -151 -10941 -10716 -3425 -2261
15772 -2261 -68 -1510 -5197 -2837 -759 -6992 -10109 -9631 -9898 -7442 -6552 -7147 -10771 -8510 -7581 -17324
15756 -17324 -22081 -17379 301 5500 3916 -1964 -3935 -4140 -9226 -13943 -15290 -12101 -2095 4121
15742 4121 27 -382 -3367 660 -3597 -4465 -2537 -7844 -10565 -6817 -7342 -1146 2310 -5212 -10975
15727 -10975 -7363 -4544 -6058 -8472 -6518 -7576 -3770 -1204 -2623 -3291 242 8582 16776 4797
15713 4797 -2429 -4859 -6773 -17402 -16618 -8992 -3168 -1948 3982 5670 3848 2244 375 1464 3675
15698 3675 6577 2997 -3698 -10390 -7739 -454 -3577 -10527 -7646 -347 2169 -1964 -4944 -11367 -12845
15683 -12845 -15533 -8593 2554 3089 2302 497 -3911 -6298 -342 1758 -3192 -3383 -4187 -10086 -6867
15668 -6867 -10965 -14865 -11989 -4750 -7445 -2300 3397 3142 5302 -1133 1955 1693 -6918 -10814 -15651
15653 -15651 -15186 -8767 -3473 -7145 -3619 -3118 -3400 -5605 -8222 -1693 3175 5490 2398 948 -4228
15638 -4228 -6397 -5488 -5462 2099 1547 -831 -3787 -5025 -8139 -14562 -10225 -6606 -8220 -5549 -382 3535
15622 3535 5172 3142 -4060 -6851 -4250 -500 3472 3176 2222 5104 3032 -3391 -7930 -1146 3507
15607 3507 10849 21302 25454 14489 8547 3714 4835 2858 -5839 -8484 -7451 -4483 -2542 927
15593 927 2160 965 6174 12271 9830 9750 1378 -1830 -1164 -2778 -2943 -7183 -15847 -11245 -1655 18
15577 18 -800 -4158 -1474 -2985 -1221 -3738 -7029 -2157 5440 6526 9765 8352 7112 9049 12840
15562 12840 10094 8227 8997 4124 -6289 -3841 -6114 -7600 273 -1494 -9879 -11952 -9595 -7284
15548 -7284 -3925 -1045 -1750 -4855 -1955 -8007 -3158 3757 11826 6485 -5328 -3447 -4734 -7975 -5792
15533 -5792 -270 -6208 -8083 -6903 -5103 -5685 -6984 -8587 -8117 -6794 -4091 -2554 -2439 -690 4764
15518 4764 6330 2531 75 -3393 -6138 -6388 -6485 -8053 -8199 -1152 -3451 743 582 466 -4018 -11676
15502 -11676 -12530 -1169 5239 5564 908 -1850 -3894 -760 506 -7582 -7960 1194 2731 2365 -438
15487 -438 305 1798 4661 2672 -7939 -9200 -5785 -8624 -8657 -1544 4385 -953 -6468 -3864 -4813 -4604
15471 -4604 4621 13280 9608 4509 8721 6349 4748 -232 -3696 -7856 -8019 -4059 -1153 -209 -1884
15456 -1884 -4298 -9980 -9803 -9435 -4747 3168 8136 1693 -4397 -2107 2445 -5445 -7083 -1101 -3099
15441 -3099 2807 4413 834 546 -1907 -6466 -2263 469 271 1301 3208 -1902 -4292 -4776 -11083
15426 -11083 -17691 -11765 -13467 -12306 -3284 -2253 -9800 -12952 -5003 2127 9113 10173 4755 -422
15412 -422 -4360 -8668 -6357 -8846 -7646 -6958 -5731 211 3690 5127 5051 1502 -4661 -3843 2305 -1525
15396 -1525 5063 -415 -533 2223 3679 608 -9819 -13678 -19344 -12664 -6688 -5631 -588 -3089 -9559
15381 -9559 -9239 -4512 1751 6387 4886 8897 4617 -215 -6123 -8253 -673 -195 333 -749 -101 6622
15365 6622 5736 7119 5067 2692 4118 3878 1224 1999 3596 5469 2684 1784 2412 8193 4768 2429
15349 2429 -1521 -1142 -4160 -4440 -347 1697 6681 5259 6135 2543 1143 1924 -1404 -1175 -4421 -6061
15333 -6061 -3533 -7449 -7780 -907 -1517 -2568 7451 7443 4814 -580 -2489 -72 -2676 -8517 -10230 -6333
15317 -6333 -7351 -2480 -4914 -14077 -14890 -5712 -5398 -13211 -11763 -12633 -10408 -4634 -3827 -5844 -6013 -3025
15301 -3025 3009 3185 -430 -12139 -15045 -8453 -4872 431 -4618 -4085 -3597 -4496 -5541 -3451 -2125
15286 -2125 -2764 -8713 -6241 -906 -2955 1257 2156 1941 481 940 -861 -7563 -9920 -650 -2279 -7496
15270 -7496 -2245 -3568 -8783 -11575 -9608 653 746 -731 1246 6391 8173 5047 2997 1798 -1997
15255 -1997 -5721 -2640 3631 2966 -3385 -4143 -8259 -11988 -4428 4474 4827 4637 6291 2664 -15 5700
15239 5700 7098 10630 8648 -1750 -3804 -2723 1404 97 -2710 734 1153 -3338 -11798 -14318 -12618
15224 -12618 -6697 -4532 -6109 -4216 -7949 -6169 -2744 2389 5857 5438 4010 -1109 -4405 2885 120
15209 120 -5064 -4225 -3061 -6608 -3068 1032 800 5020 4787 10182 8009 -523 -7225 -6875 -4449 2954
15193 2954 -245 -1683 585 -1576 -2383 -7308 -11873 -4749 848 879 -6676 -3232 3680 5736 -913
15178 -913 -7405 -871 3271 10499 7662 1284 -2087 4151 5232 2040 -1734 -6997 -7467 -8657 -3313
15163 -3313 -444 4011 3953 -591 -1268 -1893 -2997 -1152 -1478 4107 7758 8925 8667 2355 1728 2046 1399
15146 1399 7368 7683 6963 7481 3058 -199 -4435 -11767 -10066 368 -665 -8326 -9724 -648 -1405
15131 -1405 -1477 -893 -3421 -4581 -1613 1615 -6515 -7002 -2118 -7621 -12723 -8106 -3425 -6250 -13113 -14836
15115 -14836 -3291 2810 3451 242 561 1520 5514 8568 4790 -1743 1345 7831 10589 10691 13971
15100 13971 17534 10320 3454 -2385 -3384 907 5493 3496 4684 11609 7741 1775 4080 5369 9289
15085 9289 9666 4362 5390 1830 -2933 -1163 -1294 -1029 4483 10144 9137 10581 6524 13866 13008 8155
15069 8155 4996 3852 6304 8677 9926 12710 12493 6759 -6664 -2925 2287 3686 640 -1394 -333
15054 -333 -2908 2222 6292 5856 7312 6332 3962 1484 -91 -1457 59 -2110 -1907 -897 -3496 -4926
15038 -4926 -2786 -1235 -1471 -2520 -756 2369 2410 4791 6033 -1016 -6975 -5170 -2223 -4761 -603
15023 -603 -1109 -1720 -372 608 4845 8978 11214 11830 8780 1898 -1810 4559 6068 -1224 -2616 -10119
15007 -10119 -10219 -1574 8034 10505 11498 11689 10879 9386 4990 8065 6400 -4835 -14093 -10318 -5852
14992 -5852 -7223 -7788 -8051 -8417 -9379 -6308 -1186 -2218 1615 -429 5463 6394 3887 9986 14850 8476
14976 8476 2270 -223 -6093 -4326 -1140 541 -461 1508 -4199 -4007 -212 -1052 2845 4847 7776
14961 7776 10646 181 -5429 -7021 -14570 -9192 -2117 1296 -2052 -8898 -7774 -3038 -3009 -3968 -2977
14946 -2977 -6426 -9184 -5016 106 -4219 -4898 -9863 -11315 -10817 -4999 -3520 -377 -1047 1189 -722
14931 -722 -1614 -4387 -2080 2358 3831 5674 -305 -11698 -6129 5123 2310 -2855 -2430 -7162 -7598
14916 -7598 -10152 -8903 -1180 4673 1719 -3936 -1629 5738 8643 9832 2616 -5433 -5900 -7189 -8619
14901 -8619 -7634 -8723 -18579 -14232 -6838 -6631 -5690 -4143 -1902 -1355 -3366 -1837 -1633 933 -472 2150
14885 2150 857 -9 7114 6428 5184 4255 6333 7725 7145 3975 -4422 -7560 -8316 -7134 -5177 -5213
14869 -5213 -11041 -7518 -3661 -740 3746 3178 1002 -1552 -2749 1644 -2091 -1884 -3089 882 4111
14854 4111 -1259 -2954 -779 1828 2195 -356 -1864 1758 -193 -3159 -4539 -5 4426 4246 2594
14839 2594 96 -4585 -5058 3392 1614 -5056 -8615 -3125 -259 -2604 -52 2855 -4542 -9938 -12919
14824 -12919 -8385 -6935 -11536 -10567 -9569 -9854 -1418 -1886 -8283 -9145 -2667 2491 5860 4698 2304 4539
14808 4539 2747 -2067 -4917 -1775 10136 10212 143 -5958 -10346 -10874 -13504 -15433 -14699 -5970 -3079
14793 -3079 -3378 3105 1275 3188 4732 -1066 -4224 -646 1582 99 -185 2085 5226 3059 -3888
14778 -3888 -3969 -3115 -1376 -3274 -1479 -737 4223 8048 8618 4807 -453 -607 9225 17586 18643 12828
14762 12828 11522 8328 3175 3177 5873 5735 2406 -2284 -6847 -1092 2880 3014 -319 6497 13928 8050
14746 8050 608 -2649 -1379 -5432 -13040 -10103 -14472 -12677 -14041 -11030 -11005 -9287 -13244 -17458 -11448
14731 -11448 -5803 -2339 738 2982 -2716 -987 -2115 -3000 -407 -2641 -6604 -9285 -4734 -119 2584
14716 2584 5400 6827 5684 -355 -3760 -3066 725 2249 -2395 -1179 -7148 -14618 -16679 -19095 -19392
14701 -19392 -11755 -6123 -3924 -1675 -3245 -5320 -3679 -6873 -7935 -4641 -1979 3093 3341 6400 2842
14686 2842 -3745 -8219 -5484 -2160 -5242 -330 -315 -1916 -3061 419 1453 1246 454 869 399 5782
14670 5782 7473 8874 6223 4662 -265 -3524 -1899 -1657 -2753 -2309 -3578 -5006 -3283 3794 3321
14655 3321 685 4524 3866 2926 1749 -5344 -833 4281 1456 -6063 -11718 -10205 -4167 -4325 -292
14640 -292 945 3202 7260 6206 -840 -2918 -6470 -3943 -823 3746 12221 15090 14967 17152 4538
14625 4538 1097 1215 417 1857 3031 5811 608 -3773 -6624 -5683 -5421 -3223 -4867 -10792 -5894 2030
14609 2030 5613 1234 -4427 -5720 -7157 -1939 -186 -1567 -6894 -726 5970 7363 -2966 -9756
14595 -9756 -11093 -8861 -6270 -7877 -8821 -11143 -14377 -10850 -5134 -5939 -7174 -982 -1372 -5874 -6814 -8802
14579 -8802 -4761 1266 6011 6417 1395 -6613 -11013 -12384 -12540 -4236 4721 240 -1397 2638 3366
14564 3366 1637 3631 2919 4846 1444 -2191 3987 3137 -4033 -8275 -10628 -7803 -5288 621 -3090
14549 -3090 -4310 -3270 -1253 -2930 -3358 31 2435 6215 5357 2243 -1775 34 1963 3758 3762 1862
14533 1862 1170 3459 13177 13174 3736 2006 5242 6413 6959 6485 -3855 -6400 -5337 -5044 -584 5000
14517 5000 6870 6692 148 -3430 -258 2307 -1239 602 -406 128 5433 4033 -849 1244 5667
14502 5667 -109 -6311 -13292 -12391 -8008 -12738 -10650 -7077 -4125 -4229 -5109 -4522 -7444 -6114 -7508 -11566
14486 -11566 -11232 -7347 -5389 -1091 2007 3839 5134 5012 1450 -7761 -3814 3823 581 809 585
14471 585 3198 3610 6062 9645 3778 1095 2013 1842 -1785 -5587 -6546 -3846 3107 11712 4854 2551
14455 2551 580 -4227 -5078 -2377 -568 5960 5879 2549 -107 -2478 -1613 2810 3338 207 -37 -729
14439 -729 2936 3257 -648 -2369 1824 9041 4243 6820 4609 3480 1078 7598 7996 -295 -2942
14424 -2942 -1428 -683 -6422 -8704 -6298 -3900 -4707 -7297 -7954 -8088 -7676 -5469 -3596 416 7751 3113
14408 3113 -2875 -8240 -6869 -1809 1858 1967 847 -1957 -5970 -725 372 -4601 2066 4385 1024
14393 1024 -4866 -4460 7748 12104 12874 7076 4746 1132 251 6793 253 -865 2086 -185 -4556
14378 -4556 1894 7528 5215 1190 -5007 -11665 -14462 -4331 -708 -1914 -3699 -196 4628 5120 -1468
14363 -1468 -261 1195 -1067 -737 -4784 -9115 -12158 -10761 -8333 902 1059 -105 2744 6728 7009
14348 7009 10391 5162 -1072 -2317 -5848 -4628 -1790 -2229 -5673 -7112 -10331 -13281 -11474 -6394 -8674
14333 -8674 -4485 -4112 -3341 1480 3213 561 -7262 -4076 -2817 -8973 -12486 -5803 2378 2133 -2891
14318 -2891 -1424 6890 9538 3876 7145 5166 1309 -4677 -5357 -9375 -7324 -4920 -8126 -9934 -8819
14303 -8819 -3612 1943 798 -4021 -5972 -4517 -8087 -12158 -10056 -6951 -9077 -1062 2127 -6742 -10821
14288 -10821 -12086 -16386 -11708 429 4063 -1265 -7022 -8127 -3690 -6924 -14743 -20533 -22406 -15478
14274 -15478 -6498 -6683 -2686 2696 432 -6814 -5766 1032 4783 11566 13036 8021 -1345 -11856
14260 -11856 -7684 -5915 -4874 253 2126 2716 -686 -4468 -1895 -4088 -12029 -17355 -11949 -12050 -9114
14245 -9114 -198 2014 -3814 -7223 -1193 -597 -4689 -8735 -5082 -906 -4879 -3505 1444 8733 12531
14230 12531 7939 -2861 -10665 -10644 -5512 -5685 -6460 790 562 -4124 -4371 -6153 -4448 -10277 -13136 -9158
14214 -9158 -8493 -6310 -4175 4169 -890 -4725 -10094 -16501 -17455 -11083 -238 5541 6539 -431 -8720
14199 -8720 -2899 2518 6655 6656 2171 -596 -2934 -527 344 -2700 -202 -3120 -3128 2629 1649 -2510 -8482
14182 -8482 -10274 -8544 -7926 -7753 -1825 2576 -2922 -8280 -10574 -4007 7343 6226 2545 -893 -450
14167 -450 2336 4256 3719 645 -2012 -6589 -6258 -5242 4396 8498 -1240 -5694 -10278 -8213 -4286
14152 -4286 -413 1320 71 3949 2777 -665 -5943 -6722 -4437 -4913 -122 -2299 -2518 3803 4010 1953
14136 1953 -627 4630 -1913 -6729 -5055 -8942 -13685 -13517 -9885 -2318 1205 7159 4787 2289 2329
14121 2329 -2448 -4285 -2488 2679 885 2433 -798 -8232 -8201 -2221 -3945 -4140 1400 -1613 -687 2231
14105 2231 3135 -2998 -5759 -9342 -4669 -2127 -4243 -8615 -1581 3475 3409 2849 2852 2306 -2818 -188 -1358
14088 -1358 -5412 -7167 -9613 -12924 -15772 -11878 -9465 -5972 -2718 -3713 -13882 -15090 -14274 -7760 -14055
14073 -14055 -19804 -20099 -13609 -10806 -4586 -2785 -3182 -1410 321 -8310 -14778 -9218 -12024 -10070 -6279
14058 -6279 -9055 -5954 -5715 -11156 -11536 -6836 -1020 1789 3824 -74 408 851 -2125 -6662 -11442 -2308
14042 -2308 2810 2819 -1285 473 -2541 -3092 -8873 -7562 -2442 -5301 -3309 -5016 -4141 -3143 -5957 -5083
14026 -5083 -1317 8722 14050 13379 12816 11743 5748 9441 6024 3961 9922 7393 5580 4040 4247
14011 4247 454 -98 -1876 -1482 2027 4170 -487 6872 9985 13136 8605 446 1380 5420 -430
13996 -430 -35 -2057 -3232 -5271 -8742 -4653 -3293 -4348 -8877 -12157 -9897 -9610 -9091 -10494 -980 273
13980 273 2222 7337 7327 6542 2250 2061 -4255 -4590 3113 2657 -1806 -6868 -9399 -7746 -6653 -5738 -6905
13963 -6905 -4411 -363 1185 1566 -1631 -1516 -7172 -16793 -21367 -19056 -7998 -4356 -2433 5667 -4240
13948 -4240 -6367 -5270 -2887 -6827 -4691 -1319 2151 930 -2202 -6206 -2931 6519 10053 5790 -417
13933 -417 -6101 -6104 -1317 -3288 -4392 -3561 4221 -1818 -4598 -8827 -9967 -8931 -9599 -2982 -3287 -3088 1626
13916 1626 3057 2858 -3204 -1261 -1749 -3844 424 2944 2961 2087 1156 -2788 -7868 -16927 -17771 -8528
13900 -8528 -11277 -13682 -12532 -10515 -12296 -5410 -5598 -3179 -7398 -12274 -1229 5007 2819 1601 1243
13885 1243 -1463 -1862 -732 1687 396 -2653 -5104 -5926 -5491 -8715 -13238 -18387 -13870 -1940 609
13870 609 1086 -3090 1652 3246 1402 -4114 -13526 -11913 -2829 7361 7755 3478 2859 -2632 -1358
13855 -1358 1012 -365 -1119 -4652 -4703 175 -791 28 -3758 -7314 -8605 -7540 -7424 -5088 774 3408
13839 3408 5782 5715 -6545 -6772 -1648 -6277 -6451 -2768 1768 -369 -3791 -6988 -9476 -7519 -4581
13824 -4581 -1617 -2813 -11129 -14073 -14100 -11025 -1859 -5025 -12356 -10327 -7336 610 5613 5347 2587
13809 2587 5216 3017 -1961 -7053 -8705 -6228 -6431 -4576 -3053 -49 -1874 -3198 -944 -5594 -7054
13794 -7054 -3444 -4700 -9178 -17305 -19720 -14498 -7011 104 -1869 -9741 -8110 -6441 3273 3512 3123
13779 3123 1591 -2255 -8563 -7678 -678 9957 11441 -1981 -439 -4332 -6511 -3037 -3807 -2295 -398
13764 -398 1908 3608 -4092 -4559 -5778 -782 -3274 -7411 -9945 -3553 -3638 -602 2064 4853 -2950 -5899
13748 -5899 -5801 -2415 -5459 -8116 -7079 3451 5674 3511 -1924 4078 12651 14481 6575 2415 243
13733 243 407 4334 1028 832 1124 428 3777 3457 3309 6079 7253 6773 -1310 -7171 -13380 -10681 -10391
13716 -10391 -9526 -4838 -4352 -8844 -12626 -7356 -11176 -12633 -9950 -5239 -1626 2548 2612 762 -4204
13701 -4204 -10170 -10061 -6805 -9312 -1246 5933 6437 8548 11150 13351 15471 12429 13629 17625 13394
13686 13394 8508 4833 -1239 -5261 -7810 -7403 -7555 -5524 -5389 -4663 570 -152 2784 2879 2516 4543
13670 4543 5738 1852 2288 2386 998 -71 564 1321 5702 3443 2523 600 -2965 -4797 -728 3666
13654 3666 3955 4073 1834 -740 -525 1911 -6486 -4533 -6214 -9719 -1811 -5755 -6796 2334 2167 2665
13638 2665 -2771 -11219 -12037 -9791 -10289 -9985 -9186 -9974 -9095 -2289 5928 8375 4040 1025 -2482 -7555
13622 -7555 -10048 -7680 -1743 4281 4971 1900 6837 6481 3760 9216 8355 5125 4090 -1990 4644
13607 4644 4906 3871 3859 7387 7887 -6402 -13850 -10959 -1869 4399 3511 -3152 -4482 -950 -1368 -5694
13591 -5694 -5531 -3646 3263 11080 11105 12257 9708 3289 -592 2493 -2820 -7983 -10598 -13467 -8962
13576 -8962 -201 -4513 -3176 -2119 -5136 -34 1399 5692 1997 4352 3922 -2524 -787 11256 11825
13561 11825 11278 4277 4298 7908 3689 -5508 -7878 -1325 7396 9349 14960 18126 16330 14898 11462
13546 11462 8406 10031 9795 3511 -732 -6889 -7280 -64 3024 3801 3662 3047 2256 6350 12957 10882
13530 10882 8684 12661 13937 15265 15639 14087 11555 10496 4703 4854 8109 7285 4903 10868 10251
13515 10251 -2123 -2087 -285 6667 9038 7355 6284 4935 11925 11656 10014 5240 770 2760 4903
13500 4903 9797 10007 6931 6409 2284 2793 4146 -6800 -4493 1015 -3422 -5254 -8865 -7759 594
13485 594 3203 3062 23 6049 3176 -1471 616 4347 3019 1020 -5548 -2682 3159 6534 3021
13470 3021 -1763 -1735 -1428 1852 1250 -2531 -6477 -1564 2777 4777 9719 13734 17599 15451 12763 8929
13454 8929 5165 -4984 -9312 -6766 -7924 -3025 -4028 -4928 -4700 -4788 -6869 -6731 -3410 -5964 -5703 -4400
13438 -4400 -7357 -8357 -6096 -5409 -6549 -7586 -14375 -13938 -13204 -11843 -8763 -7936 -3933 -971 3049 9549
13422 9549 2230 1642 -8046 -12099 -7763 -1364 2535 -1995 -7702 -7057 -7625 -8326 -10957 -6094 -608 693
13406 693 4478 3671 -2748 -7990 -8427 -3420 -3623 -4306 -5107 -2649 -3199 -2504 7025 6337 2515 -3261 -6449
13389 -6449 1315 3902 7239 5876 3651 -253 -4105 -3640 -8335 -15364 -15068 -15170 -10056 -157 1002
13374 1002 -329 1066 3195 4425 3288 6407 5351 5395 -718 -1337 -1106 2034 -944 -6018 -6776 -7356
13358 -7356 -5889 -7450 -5833 1254 7360 279 -3517 -4131 -7602 -5321 -5094 -2104 146 995 -391
13343 -391 -797 1738 -3500 -8766 -8016 -6732 -10948 -11188 -7830 -3306 -100 -5592 -2966 -3150 -1453 1728
13327 1728 4303 3997 2284 3305 -2279 506 -821 -4854 -743 11599 16524 16816 14913 10456 6309
13312 6309 6380 3324 11450 13009 5475 -6004 -5911 -3573 -1925 6227 7397 1225 3695 5326 1057
13297 1057 -6360 -4280 -1220 664 -1573 -4512 -124 -3560 -5013 938 7354 11878 9321 8067 12434
13282 12434 10323 8882 7961 3199 1351 3343 2513 493 315 3146 6425 4843 178 4534 11746
13267 11746 14861 16877 15624 9033 5242 4665 4888 -549 -3546 613 1616 -1020 -11198 -13313 -3118
13252 -3118 1090 1870 2926 2313 -10869 -17138 -12688 79 3446 -5736 -10898 -11128 -1206 2644 3942
13237 3942 801 -3823 2743 1623 166 301 3667 7731 11865 3915 5464 3641 8933 10794 8460
13222 8460 2190 95 4745 4103 5767 -2765 -5548 -7489 -184 3180 2565 1079 -1857 -3954 -516
13207 -516 6982 8293 10530 18219 19699 16041 19414 15719 6933 8051 10219 15938 19945 17764 13980
13192 13980 9567 7678 11521 6241 8630 15366 24279 19223 11250 8428 9966 12076 11842 5114 -229
13177 -229 1404 3661 8465 7316 7011 1983 5273 4687 1854 2180 2318 534 3088 891 1366 3710
13161 3710 2902 5084 18064 24440 28090 31251 37864 32658 19994 16413 9329 5155 1353 5527
13147 5527 5091 6389 9653 5832 -2992 -8252 -3267 6198 2355 -5560 -1781 7943 4914 6433 3581
13132 3581 -2764 -5194 -4394 -2877 -567 6996 897 -834 244 3154 7576 4499 4365 2599 1059
13117 1059 1189 6027 9298 15893 24162 35517 44943 42898 21951 17307 15333 8201 2475 12201
13103 12201 16093 12008 11979 1910 -2745 -5029 -6917 -9437 -4268 -3409 -2456 -3403 -736 -1129 1767 -7781
13087 -7781 -12088 -5082 301 8211 9254 9340 4806 -4250 -9478 -9347 -2868 1879 2149 -6746 -8937 -9186
13071 -9186 -1166 11173 11088 3357 5489 10133 15844 9349 -1327 -7070 -3248 2393 1638 7730 2415
13056 2415 -4675 -3992 38 -497 3279 3068 10698 12620 6508 1643 4113 2911 8760 13078 10287
13041 10287 2956 -2886 -7137 -507 2866 -1593 -4885 1519 2944 -220 3155 3035 2043 5271 7148
13026 7148 6786 2499 -1427 -4197 -6033 -517 2851 3017 3833 -788 -5307 -2792 -1495 1518 4459
13011 4459 7945 9511 12215 14117 16113 29304 43280 44147 37540 34934 28522 25176 20729 14128
12997 14128 8813 7449 794 11167 19721 22949 26239 21096 19445 16764 7622 5408 3434 2781
12983 2781 5638 9474 14891 12301 11934 14812 16643 7715 7135 9608 5973 -2472 -5592 -6586 -7894
12968 -7894 -8295 -8265 -1989 2927 5282 2416 7193 11524 4601 -1129 -4631 -2839 -1799 -5140 1997
12953 1997 5409 2410 233 -5532 -4432 2540 -1610 -596 1748 -1550 413 9361 9496 6501 2846
12938 2846 3663 -746 -2109 -75 -430 -5021 -5595 -4690 -8627 -9927 -3062 2821 2178 1749 2067 -1736
12922 -1736 -3849 -11524 -9988 -9784 -7452 -6613 -3012 -7791 -7374 -862 4870 8014 264 -9379 -13991
12907 -13991 -20636 -19976 -17022 -10625 -6764 -1789 -557 -1829 1766 -19 1275 1236 59 1125 -591
12892 -591 1883 -3195 -2719 3448 -951 -1068 1647 816 3788 -2060 -11315 -10606 -5660 -1904 -2354 -3381
12876 -3381 4982 11566 7991 5878 980 -1940 -5252 -7325 -12074 -12614 -1550 4115 -187 -2776 -489
12861 -489 700 987 -1925 -4584 -4496 -4129 3237 4736 1577 3221 667 -1492 -4230 -6641 -2623 9023
12845 9023 6872 -996 5991 7182 -2435 345 -2056 -6472 -7503 -3514 -790 -5367 -4660 -6791 -6441
12830 -6441 -7181 -7667 1672 10824 15351 16045 14092 13860 11342 6947 -1993 -3488 1254 1900 887 -1719
12814 -1719 -5974 -3740 -5433 -7343 -8664 -2856 -5892 -9856 -10193 -7428 -3238 -1365 1540 -288 3822
12799 3822 5379 -2252 -3581 1169 3683 4122 5917 929 -1693 -5671 -9890 -8275 1056 7161 4918
12784 4918 1236 -100 4746 859 -4244 -4520 -3539 -1613 -5048 -6872 -2546 1441 4166 -1001 -3311
12769 -3311 -3729 -1454 3893 3939 -319 -5097 -3625 -714 804 533 -250 -293 -3123 1493 5664 5466 9441
12752 9441 8046 -538 -3970 -9496 -10354 -5381 -3881 -4506 -1017 -875 -2569 1006 2632 -3325 -1727
12737 -1727 1459 4888 5429 4797 7636 10653 8926 2523 183 -5180 -6535 -7098 -3417 -694 -1288 -6440
12721 -6440 -11558 -2001 3183 -336 1124 3213 6930 6829 4346 2788 2824 2089 1345 748 -1203 -3186
12705 -3186 296 5010 8291 5594 9742 3942 -2047 -2115 -46 387 -3250 -8764 -3525 -5946 -1181
12690 -1181 2484 -2256 -4460 -1603 -5467 -7700 -4903 -5896 -3133 -4563 -1713 3417 9094 10976 15377
12675 15377 10590 8463 6979 -757 2532 -3405 -13228 -15380 -3375 -368 -1565 374 -3510 -909
12661 -909 590 -3274 -8807 -15378 -4452 4031 10603 15578 13282 9386 12853 3137 -4771 -7743 -1756
12646 -1756 -1281 3103 4878 -4979 -13148 -7735 -425 2896 -1140 1827 4899 3198 -558 -2497 -849
12631 -849 1095 3978 10455 12880 9694 5507 1459 3762 4807 1314 2959 -449 -3598 -4236 -1771
12616 -1771 -2247 2759 7462 13544 16737 17801 10552 9868 12460 12714 11462 2098 -3257 -3721 -188 1627
12600 1627 5056 4186 1919 -1082 1696 3806 -671 -4283 2348 5206 6665 7531 5972 6543 6757 5956
12584 5956 5698 -240 -2888 -5741 47 -42 -4598 -7744 -11472 -14562 -9958 -2371 2903 1596 -5305
12569 -5305 -4777 -3904 1386 9086 6326 8325 8710 10603 7638 4256 7514 2918 -3286 -2709 -503 -66
12553 -66 2480 10527 10150 5821 4933 1408 4882 5463 -3593 -2760 -100 -61 -41 -1937 385 630 1854
12536 1854 4506 581 1821 3212 2109 2644 3781 3063 2509 971 -2017 -7567 -11859 -7074 -5635
12521 -5635 -4767 -2124 -2231 381 6061 4822 6509 11775 15403 8378 3851 6083 7820 7719 -1440
12506 -1440 24 435 -1564 2013 5187 2212 4042 10611 3296 -6344 -6932 96 2089 7936 14125
12491 14125 8737 218 -12415 -11992 -5816 43 5036 12678 9946 5760 -1794 -4277 -4100 -4022 -2297
12476 -2297 4349 17294 19951 20481 18023 11434 8991 5440 12624 19127 8663 4187 4157 10278 10946
12461 10946 16442 12177 5945 -732 -3589 -2339 254 929 900 -3735 1174 -2121 -3497 -1329 -1774
12446 -1774 -11129 -16494 -18169 -9406 -673 6466 3484 -5366 -9191 -12021 -10338 2767 9407 9424 9435
12431 9435 3972 2869 2591 2332 1219 3274 2128 9990 8668 7127 4443 6498 8831 7982 8021 7712
12415 7712 5279 2266 -2578 141 510 -227 1149 6933 5669 2617 4509 9667 9810 3539 -74
12400 -74 677 4750 5034 4391 4168 4704 -2398 -6733 -7725 -10665 -7554 4940 10167 6910 9780 8535
12384 8535 3503 4179 174 -2886 -2214 -3131 105 1153 -8133 -16103 -11329 -1923 993 -2196 -4576
12369 -4576 -6587 -4661 -2870 -5108 -8268 -5851 -776 6012 10775 4358 9649 8206 7455 10131 8946
12354 8946 5497 -117 1325 5616 2830 -4511 -10356 -4928 2490 903 2260 7541 4273 -3632 -3551
12339 -3551 -5535 -8454 -12176 -15960 -16128 -18849 -19940 -14337 -12840 -5464 -1045 -3043 -5799 -2418 112
12324 112 284 53 -4718 -9599 -2520 4506 10049 9314 5766 6051 10007 10897 14634 13529 12889 1403
12308 1403 -4699 -1060 -467 -4401 -5837 -9098 -7942 1883 10984 10050 11049 10961 11999 12942 10009 5752
12292 5752 7628 3279 -1873 2990 405 4483 2701 1075 647 4019 5216 5094 5196 1488 759 7540
12276 7540 13810 15020 15156 16528 12023 3755 -5606 -13340 -8573 2102 4978 4695 4510 2909 790
12261 790 -941 -5703 -10129 -5982 -4563 -2180 3775 8360 5718 -1298 -4068 -5205 -4782 -5949 -3160
12246 -3160 -1617 -8180 -2934 3166 -989 -1758 -4508 -9735 -799 3017 878 -3797 -6913 -9413 -11516
12231 -11516 -7391 -5534 -1458 1746 -3373 -8564 -8455 -1768 -674 -1915 -4489 -4130 -3108 -9261 -8096
12216 -8096 -5260 -9365 -10387 -11243 -14402 -5973 -5674 -5281 -746 1589 2717 2393 -4314 -5064 1111 933
12200 933 3821 3139 1519 -4066 -5104 920 4538 -2476 1123 3364 2489 4540 4421 1135 1223 1731
12184 1731 -2138 -3517 -2723 -3512 -7158 -621 1213 960 1290 352 -587 -3077 890 6207 6981 9431
12168 9431 6822 1278 -3444 -8741 -6756 -4631 -1053 2113 4361 3717 3139 5390 10077 9579 5342
12153 5342 -598 -2499 -3898 -3127 -5577 -1465 -2450 -5837 -4515 5004 3095 -3091 4397 5973 -760
12138 -760 -1577 6293 6647 5741 7561 2209 -507 2279 11162 14834 11889 4890 -2024 -5136 -12118 -6078
12122 -6078 -1514 1869 -1220 -4970 -2281 4609 3212 -579 -5179 -3613 -2614 -13116 -15593 -7606 -4610
12107 -4610 -6316 451 1792 -3266 -1161 7272 9647 4042 -2300 -2714 4734 14264 13093 9367 745
12092 745 2008 5536 5766 7113 8518 3872 3733 4887 -4765 -6442 -4799 5156 9446 2250 -1635
12077 -1635 679 756 -4720 -3513 -2533 -2655 -2375 -6061 -6678 -2351 2799 -100 -3806 -5850 -7036 320
12061 320 674 -1646 5280 11503 11001 6899 -9 -1553 -737 -3761 -2117 3537 4191 -2215 -5458 -6277
12045 -6277 -4004 997 -3704 -3880 -978 31 -14 5686 10609 11681 5870 12461 14257 9207 6555
12030 6555 10652 7086 6052 10189 13870 3750 -3380 -2072 -3623 -8206 -5777 -802 50 4062 2047
12015 2047 45 4802 8821 -1842 -8005 -2431 12416 14380 4074 -1282 -3356 -3600 -10056 -11626
12001 -11626 -11391 -5537 -7153 -4582 -4895 -6037 -13282 -16853 -11979 -3050 270 3497 5125 7171 5458
11986 5458 -152 -7321 -11439 -10685 -13073 -11675 -17713 -21107 -12253 -3951 -3169 -5736 -6424 -1643 1448
11971 1448 -2445 -4269 618 1474 179 -3987 -6034 -7338 -3711 -1825 -6914 -7997 -6575 -3405 2089
11956 2089 2205 2329 -395 -1455 -3105 -9849 -15342 -9739 -3671 1998 -1455 -2300 -2835 -4064 864 -107
11940 -107 2134 -3105 -2616 -283 -4369 -11348 -11836 -10049 -10870 -10242 -6785 -3804 -5771 -5076 2478 8003
11924 8003 9558 434 -7546 -4826 -5730 -3623 2420 -324 -1902 -5240 3352 5998 -395 -4243 6320
11909 6320 10667 4532 -4275 -1392 11895 7125 4724 878 -1704 -2515 -1085 -3216 -9086 -15811 -15822
11894 -15822 -10573 -7538 -5398 -6874 -7216 -3666 -1725 -3512 -4006 5034 87 -1676 -251 -3632 1558
11879 1558 -3751 -9065 428 7004 -1657 -6548 882 3913 7889 6480 2043 1338 1654 -1879 -1295
11864 -1295 -2450 -2676 219 -1738 -2896 -10636 -11912 -5642 141 4456 9636 9668 8768 4048 9299 7426
11848 7426 2530 2099 203 -2440 -5434 -5545 -3214 -5794 -10584 -3846 2179 5677 4831 2876 5975
11833 5975 1965 3939 5109 2670 3114 6289 10608 4450 -317 4470 4200 -428 -4950 -10019 -11125
11818 -11125 -9191 -2458 -961 -5650 -5480 -8732 -12624 -14678 -12336 -15025 -13436 -11922 -15870 -9388 -1856
11803 -1856 3571 2212 -2096 -4719 -2777 1933 -1853 -4844 -6959 -11263 -2854 -341 -9684 -11425 -8096
11788 -8096 -9553 -8199 -7431 -10323 -7045 -3800 -3050 -3549 1600 7447 7519 8764 9958 13117 6983 1524
11772 1524 -2946 -3790 240 413 399 1192 9 -7356 -11171 -9484 -6676 -2421 2603 -1520 -2780 3877
11756 3877 5158 4357 720 4949 5183 55 -31 -1752 -2078 -1855 -1504 5371 9808 9650 4298 1291 2527
11739 2527 -3091 1390 4637 -2825 -11537 -1599 10270 9401 1932 1838 8875 7850 -4723 -4425 925
11724 925 1311 -5132 -7466 -11920 -6288 -541 -3815 2181 7510 10842 8780 1283 -4049 -2279 1613
11709 1613 -5957 -16053 -15579 -15357 -7372 -2715 1793 -4762 -6848 -4771 -4278 1489 273 -5612 -2558
11694 -2558 3663 3264 2199 690 -880 -3107 -124 2847 2572 2684 -4037 -2759 401 -4941 -6525
11679 -6525 -1737 6361 2631 -6487 -9600 -2003 1227 3398 3393 4750 9595 6892 5505 7968 8709 3789
11663 3789 -5408 -6284 -2483 -7087 -9624 -3457 -1662 -3602 -5464 -5556 -6863 -9527 -1964 -4272 441
11648 441 2212 6867 -3115 -11461 -6353 4145 5137 338 -3124 10 -1206 297 2270 2707 -5587
11633 -5587 -4058 -1914 -491 1877 -1560 -4378 -7392 -11138 -6372 7840 4985 -7417 -8360 -6447
11619 -6447 -6148 3015 3285 101 641 5258 5218 7210 4851 4789 3711 -1694 -3495 -3873 781 3130 1441
11602 1441 -5983 -11537 -8248 -6576 -9509 -5356 2799 3123 758 1269 6108 554 -2272 -1644 -1820 -1414
11586 -1414 3121 688 -4090 -8106 -5445 -669 -6613 -7149 2698 8065 7243 7245 5066 7149 6859 2534
11570 2534 -4881 -11732 -9482 -3666 4762 5073 1861 -123 -4470 -5385 5446 6084 1166 10082 11785
11555 11785 8356 5904 8600 6082 1870 -1690 1310 3024 1203 3129 4017 11465 12810 9535 15482
11540 15482 20219 17943 7009 5567 15253 16795 13613 16799 10546 1232 4806 2052 6215 2165
11526 2165 -5803 -3904 184 -704 -1685 6511 10692 11236 8714 8433 4004 7945 10978 7683 9173 13756
11510 13756 14971 7763 2373 1275 1940 4575 4053 6584 3674 4360 4203 10148 17243 8435 5547
11495 5547 139 -6172 -5939 -5439 -1613 9567 15755 11067 10126 8415 8389 5357 5518 5638 3240 -658
11479 -658 3637 2352 -5484 -6147 -158 6740 6705 9804 13962 14428 10750 6871 8259 12297 14485 13044
11463 13044 15103 17807 14972 10915 13026 18402 18295 16595 18694 14709 9009 10275 5051 1333 2845
11448 2845 11039 7335 2677 11598 15716 15385 16970 18552 16881 13903 13959 19225 20508 20104 23267 24890
11432 24890 23952 29860 41205 54035 54388 50429 51961 56826 60495 58894 68238 84429 104275 142410
11418 142410 214484 327703 486787 654425 715305 617241 461252 332981 241336 171671
11408 171671 125664 104452 81995 63293 46199 36874 32524 24837 20586 11445 8471 12077 11615
11395 11615 13262 15631 14413 5686 9032 18235 18649 21853 19668 14280 11539 7217 -986 996 5838
11380 5838 11267 9897 7724 8002 1035 -2207 -825 1627 6144 9471 1560 1212 5585 6064 5520 3224
11364 3224 1092 3793 6203 3492 4275 4957 5625 6717 12117 14822 14621 12549 10200 6430 3255 833
11348 833 3340 5035 7894 13059 14224 7764 3500 8516 14860 11289 12840 12260 1692 2621 2847
11333 2847 -3611 -7665 -7381 -674 7952 14073 13630 10421 6244 2883 -4300 -6649 1211 5021 5928
11318 5928 8601 18994 17499 8684 -1482 -3156 -3778 1112 5651 3979 651 5127 12005 9089
11304 9089 2716 -4975 -4856 -6830 -4154 4433 13357 17985 18241 11814 925 4566 10816 11126 12022
11289 12022 13363 18729 18045 14881 13804 18493 20022 18829 14985 16535 10932 5273 3659 -591 -891
11274 -891 38 1117 -2414 4120 5822 5806 13673 24203 33729 37256 34395 45283 57820 70807 86368
11259 86368 100642 87897 56733 33642 23482 23365 28645 21547 16466 18635 25225 24610 12900
11246 12900 8060 14904 17971 18228 21540 21996 16266 14528 15936 9007 -154 -2294 2622 4249 1874
11231 1874 -579 1662 858 -4111 -7131 -4298 -5006 -5876 -5652 -2186 1825 6328 6657 5399 1658 -2615
11215 -2615 -6787 -4126 -3455 -3206 -8488 -17027 -30896 -43231 -51222 -58319 -74034 -86445 -102282 -128996
11201 -128996 -155532 -194368 -233183 -249881 -214368 -129014 -54957 -4587 39039 74565 99424
11190 99424 101324 92756 93610 100856 104227 104455 103463 101052 100290 97961 97940 103808 109184 106277 103035 98825
11174 98825 99511 102260 105316 103768 97960 92450 90774 88356 92274 92443 86985 77716 64178 58529 49177
11159 49177 39389 44711 55182 61035 69460 71563 76722 82750 80901 77244 74102 69019 69696 74718
11145 74718 73248 65255 68948 84204 87731 85102 83888 84008 98625 129850 178043 238688 259510
11132 259510 227437 162208 119611 110569 114233 120974 115683 119485 127731 125731 117539 109049 103599
11119 103599 108364 107461 102117 103142 98709 95545 91586 87947 83639 85614 100395 103718 96749 91771
11105 91771 93779 99969 106968 100605 95646 102284 108070 112511 113934 107115 107648 117014 124574 126828 129917
11090 129917 134572 141665 142751 146696 145636 151859 151211 154298 158653 162622 172759 176670 183335 184129
11076 184129 188605 194124 192919 195769 197879 201339 210983 219004 230642 243541 240554 236517 230475 226184
11062 226184 236774 253509 279991 311351 329273 348571 354227 350659 353214 365572 383480 411486
11050 411486 439532 466214 496292 527174 569256 625205 683983 736250 794749 877717 982189
11039 982189 1124989 1312761 1505403 1625960 1673433 1729588 1858770 2097576 2440182 2863119
11029 2863119 3244297 3483065 3623812 3767497 3986069 4290753 4674422 5123848 5627501
11020 5627501 6178451 6789461 7470841 8270551 9285315 10648527 12514161 15173337 19254993
11011 19254993 25942573 37313130 56701466 86669926 119943987 134339511 118957116
11004 118957116 89927208 63615101 44507510 31501168 22915553 17220042 13333694
10997 13333694 10542674 8440448 6850223 5662324 4762201 4049021 3466809 2998274 2617355
10988 2617355 2315822 2081220 1911952 1835704 1851861 1921525 1936471 1801365 1578314 1372189
10978 1372189 1205755 1071358 962492 872109 801371 744980 701069 659224 620053 588181 560936
10967 560936 539170 522560 507533 497282 504907 507047 489950 461413 428066 391175 352333 322261
10955 322261 304089 289038 280513 274727 272169 255485 243790 241605 232954 221845 212856 200769 188519
10942 188519 178383 169238 158860 151933 146962 136232 130417 126803 122300 127136 133142 138692 142324
10929 142324 141887 133750 113673 98454 89904 87580 79210 76643 74397 74881 72851 76452 75917 77526
10915 77526 74557 73011 68127 68948 71204 72456 69826 77515 85486 77113 77485 78270 83456 80533 72771
10900 72771 68159 65637 55765 54854 52322 52441 54304 51798 48012 43306 41501 43009 45603 42457 48794
10885 48794 60483 74113 88731 88306 50161 -18269 -64636 -58613 -29294 -5004 12894 19850
10873 19850 18010 17453 12081 15670 22363 29164 23531 12996 13363 13670 8141 6165 12429 15022 12791
10858 12791 10801 11823 11842 18072 23765 29756 20291 4834 -13119 -22664 -26176 -27581 -27355 -26820 -33016
10843 -33016 -32023 -33682 -32210 -30596 -33293 -32210 -35802 -37297 -41855 -43407 -40477 -40240 -34414 -31426 -32142
10828 -32142 -35003 -33315 -40429 -53040 -59674 -45816 -45152 -36771 -24883 -12025 20033 77619 160939
10815 160939 242668 269479 253094 227118 199933 170630 145665 124948 115233 100575 84535 78578
10803 78578 70490 63038 60527 58439 60251 61295 58522 56213 49762 40603 43715 41205 42140 54262
10789 54262 55450 50355 48242 44042 37292 32864 26525 25160 25803 24641 24481 25197 29828 35342 30801
10774 30801 30019 31688 36956 37667 35273 28517 15389 13974 20379 29118 30049 26014 22272 22100 25994
10759 25994 27570 31625 31883 30132 25671 14171 11466 11406 17121 28818 30029 24527 17143 19533 23184
10744 23184 19529 19974 18002 23341 18610 18536 19993 21213 25210 24868 28995 33710 28304 23513 17114
10729 17114 15484 18450 19625 18705 12986 8462 -455 1323 10156 22142 24341 14957 9938 15384
10715 15384 16763 14874 12032 16340 28035 29385 25928 22199 19669 15675 14145 8885 14955 24369
10701 24369 23360 19491 8062 4592 4375 9636 12866 9664 6539 1443 -5106 -8006 -1941 3744
10687 3744 70 -1782 6484 10214 7466 3487 6659 12158 8719 9693 8142 8884 9947 5051 9625
10672 9625 10960 4055 4882 7733 9859 -2143 -9689 -1081 -158 3479 2155 -3568 -223 4835 805
10657 805 721 11061 13491 10872 9338 12269 17781 10348 2159 428 -709 5605 7417 11466 10724
10642 10724 8158 4249 5000 7177 7695 11173 4152 -115 2690 7056 10570 14192 13039 8448 15165
10627 15165 14295 17469 24476 20903 15433 11628 13699 14004 15106 19154 24962 29894 25928 27072 31388
10612 31388 34610 38985 38024 36208 38822 38530 37735 41115 46820 53290 59293 69524 82647 96962
10598 96962 119959 166313 237057 354606 527360 683869 718424 611062 457138 327566
10588 327566 236431 176783 130584 103390 80733 59593 50501 45360 38070 30518 26613 28287 30023
10575 30023 31214 25187 23630 21839 18305 11443 14210 19856 17212 12839 10648 8115 4233 11341
10561 11341 18297 8041 -931 1393 4494 4980 5701 12051 7591 1599 -3344 -5604 -7592 -7836 -1411
10546 -1411 244 -543 -2095 -612 5923 6892 7123 8898 1782 -8809 -7028 16 -38 10044 16685
10531 16685 9369 1201 -1092 -1090 -3219 -1457 635 6929 2641 2793 -3206 -7348 -10575 -7120 -5937
10516 -5937 -5771 -6784 -3223 -5338 -2570 -175 4690 4539 6304 10189 3088 1668 -304 6 4512
10501 4512 5140 -2644 -10094 -8926 -4834 -875 -1411 1652 7023 -460 1182 9059 11082 16069 16313
10486 16313 8816 -3801 -145 1665 1752 2915 5451 4515 5584 7756 7545 2563 -841 -607 4112
10471 4112 1419 7371 8921 9546 7253 5350 1030 -6348 1301 8562 6660 8138 11450 10553 9831
10456 9831 15043 18195 12472 8988 4888 2021 -3469 -4249 -2994 -7271 -3946 -2 -458 931 1207
10441 1207 2038 -1187 -3337 -4501 -124 2408 10649 15384 10166 9613 7379 5689 6215 8254 10345
10426 10345 8267 7347 8949 411 -4981 -4860 1196 2570 -451 -2109 845 994 4741 6965 4522
10411 4522 3662 8456 9890 5933 -1305 1363 4113 -1314 846 7052 4367 2358 1770 6378 10337
10396 10337 7894 3392 -5210 -6824 -7004 -7574 -6930 -4695 -5928 1292 2973 -1520 3323 17526 20585
10381 20585 17954 17630 14516 13585 15721 21952 19709 17254 8127 7237 -241 421 3595 2519 817
10366 817 1982 2772 -873 -1536 727 2478 6471 10830 12648 11817 6738 3219 6537 11061 13554 12522
10350 12522 8408 4504 3016 -1343 -345 -334 2901 7632 9045 11765 13507 9891 2797 955 4612
10335 4612 919 504 1270 -1440 7576 4953 4243 5371 373 -3301 3203 7846 8490 8847 2430 -1449
10319 -1449 -2614 -2253 -84 -1277 4392 6413 5615 8930 12248 19349 19237 10441 10241 9929 6996 1917
10303 1917 2767 8025 8173 11916 8266 6428 5164 6186 4415 1928 1309 5930 3919 6330 2256
10288 2256 -665 10196 16253 16715 8461 4427 2523 2237 4600 11341 13978 12607 7191 10242 10952
10273 10952 -914 -1884 -301 -3602 138 1861 2398 3197 -100 -830 -2449 -1795 -1092 -536 751 1237
10257 1237 1968 3231 11755 10818 11504 13068 11374 9906 5942 5500 7431 8746 7289 6679 10261 8520
10241 8520 2081 2504 8174 13284 11011 9915 11021 6338 9461 10885 9962 2783 -345 -355 -1848 4485
10225 4485 7185 13787 11172 9971 11252 8957 7692 6446 6090 8464 8527 10587 6047 5003 5267 6058
10209 6058 8543 3362 3232 -185 4376 4622 3213 3365 2163 2905 -492 -886 2363 -1647 155 1187
10193 1187 4862 4733 181 -338 -2050 3262 7190 429 -3993 -244 3721 2680 259 -1889 -4129
10178 -4129 -3453 -2227 -2007 11 -5915 -2459 111 840 8811 3946 1499 2119 2547 3302 3843 665
10162 665 -58 1637 -641 -1633 1558 2727 2877 4011 3838 -300 -1177 -1473 -709 386 2774 3868 -8248
10145 -8248 -10022 -2013 -1025 4281 5615 12739 9284 7922 3386 -459 2943 1167 5026 10554 11607
10130 11607 4832 5931 1523 -2715 6243 10347 12858 10426 8961 5051 7714 6999 8892 6623 5486
10115 5486 3276 -1893 226 5113 7845 1591 -635 -6213 -1411 4466 7953 7874 4052 -427 -2595
10100 -2595 3203 7341 7907 6991 7181 5939 1819 4186 6703 7110 814 -3461 -1446 -1597 5794 9305
10084 9305 3466 -4641 -1150 -2765 3602 12529 13394 3117 -3100 -2614 4147 3939 -330 2216 7413
10069 7413 5017 1097 -4293 -531 2507 3099 8541 3052 -375 521 -922 1558 -72 -2042 -1078
10054 -1078 2411 5833 12216 14389 14082 13098 6573 1542 3385 4595 7284 11843 7955 -834 -3252
10039 -3252 -1731 3368 4268 -941 4432 2312 -533 -703 -40 -4673 -6016 -5145 -7307 -11387 -14658 -16099
10023 -16099 -11920 -2257 1684 -875 6185 7930 1959 -580 1074 5068 4779 2422 2154 4261 5998
10008 5998 9431 8090 2454 8842 11435 11223 11422 12014 7265 10235 4111 -3849 -5680 1990 9161
9993 9161 12205 9769 2028 -2152 -3451 -3591 -1080 5568 4440 4859 5522 5005 -3783 -4842 1889 7303
9977 7303 8599 9448 6232 3496 3040 7551 6222 -3049 -2454 -5236 -3217 -6769 -4007 -2609 -1383 214
9961 214 7219 7665 9318 17513 17234 12368 11983 8267 4023 2152 -6618 -8255 3191 9054 8494 8156
9945 8156 15410 19620 13052 6151 -4649 -7927 -6214 691 8070 13538 12051 11516 10029 8047 4527
9930 4527 3972 4309 3880 6430 9005 9435 10332 6462 1789 2006 1533 9621 15331 17491 11995 4312 5674
9913 5674 7830 7683 12245 21015 21603 22751 38549 53629 60861 52150 35195 18634 13406 14523
9899 14523 12464 9003 15169 12090 16709 22076 18873 16089 15373 15350 19989 22988 22555 16905 19269 22014
9883 22014 14451 8407 8763 8897 16301 30701 38235 42787 44297 43331 45709 44750 45549 45463 45781 51619
9867 51619 54165 45148 39291 35153 27828 25165 29947 31260 29002 34399 37176 34874 37639 36257 40585
9852 40585 49722 73372 108585 156801 202893 218370 193414 150565 105381 68032 47121 34477
9840 34477 32470 34460 31257 31183 33563 28409 20215 16484 17586 16395 16729 14747 13362 12222 16120
9825 16120 19938 24040 22947 19461 16213 19255 22994 23932 17165 22307 26942 24732 22195 16643 9528
9810 9528 14250 15291 11520 12479 11403 10967 21591 22557 23204 24085 25159 22723 16874 17383 18096 16687
9794 16687 16034 19267 29570 26620 18135 14384 13308 22154 20620 13591 12492 7616 6365 7038 9800
9779 9800 7251 12518 14468 12513 9844 6553 10108 16580 17951 15170 9197 9611 12866 25226 28345
9764 28345 25146 20279 25493 28481 28948 26862 23890 26951 25440 22565 22684 17158 18819 26173 25775
9749 25775 16813 11445 15894 12831 6558 6514 13110 10949 8763 5055 9403 16302 22825 26969 26533
9734 26533 24969 20541 19051 9771 7064 10747 15627 10858 6706 3844 10185 14818 19151 21709 21772
9719 21772 20760 23763 31182 32870 27758 19199 15501 21956 31793 33673 25621 20109 25030 25839 25605
9704 25605 31431 37715 37816 34675 31222 27688 19212 19561 21828 20214 21789 22964 25891 23784 24966
9689 24966 26100 30719 31963 33987 35053 36661 39573 34478 29368 27021 30563 37111 32495 31824 29459
9674 29459 24388 16763 16856 12580 9277 10610 12086 13584 10926 9426 11036 8287 4898 3515 5262
9659 5262 13285 26504 31691 33125 37176 30869 24499 20026 8746 2776 5045 8478 5553 3712
9645 3712 7818 15759 21674 13532 5755 4002 7676 9763 3018 1417 8587 12759 11473 10235 5347
9630 5347 4461 7631 11042 9865 12347 12128 10870 11030 13853 16134 19989 20299 15035 9193 11925 17248
9614 17248 21943 26219 25235 20191 22784 24616 25291 22462 24093 20716 18581 21815 21838 21194 24314 25046
9598 25046 15976 18050 24962 25585 26162 28470 32426 28682 27490 28911 25510 18991 21051 21280 13902
9583 13902 10218 11691 7936 10441 15841 22491 21442 22585 25388 23596 23213 29569 25521 18953 20549
9568 20549 12169 17307 20555 27366 26422 23444 22966 23198 24254 25143 23834 19116 17026 12540 11477 9171
9552 9171 5641 15627 18547 14786 9791 12017 11508 16993 20574 25091 23025 22856 17759 19273 24694
9537 24694 28001 27530 29786 30861 25525 27785 33340 37688 38734 32322 29368 29436 23319 18017 18680 22092
9521 22092 22462 26275 27934 31390 27704 27871 20125 19212 17853 12238 16684 26611 28066 30268 25933
9506 25933 21899 19754 14218 16772 16479 16128 8644 9415 17494 21331 19865 15511 24801 28543 27376
9491 27376 22497 21150 22228 21497 20265 29318 32906 22318 15996 21683 23260 17952 19754 21536 33309
9476 33309 35614 28941 26614 25197 29739 35212 26676 18657 18117 19873 19318 20596 23938 23252 21810
9461 21810 19052 20928 24183 33143 29793 26076 33558 32997 21521 13547 12487 17192 23195 16032 17794
9446 17794 26829 31714 30443 28668 30070 28785 25742 23039 31316 39085 32997 32774 33257 29732 35734
9431 35734 38896 35275 35864 36534 39196 37168 37324 37150 32832 36192 33463 32178 31844 30274 30622 28131
9415 28131 20547 22343 25264 27237 25551 27187 28735 30296 34736 39040 41745 39261 37766 27806 26825
9400 26825 37607 43271 44980 36845 35647 40522 46259 47738 44955 38773 36881 39055 40903 46070
9386 46070 51544 46932 54174 53208 50926 47483 40209 34140 34458 39268 35447 36029 36430 41328 45102 45192
9370 45192 46808 54176 53713 53170 54279 59727 61900 57698 56420 50966 53523 52916 50960 56183 55607 53368
9354 53368 53638 60697 69999 68660 61031 58156 55268 57467 57356 61699 63446 62838 64835 64929 66058 73117
9338 73117 72574 68799 70856 72393 77620 85394 88109 94279 92376 85850 87138 90600 91378 91806 98458
9323 98458 104102 102763 108820 108851 110283 122864 130546 133229 134134 129809 132750 145895 156043 163899 162634
9308 162634 164646 166213 169389 171692 185823 193477 190808 192029 198631 206111 215972 229026 238121 250004
9294 250004 266428 280752 300008 322621 343932 368646 392120 407477 428297 457915 488696 514318
9282 514318 545152 580981 618814 655418 705262 755393 809424 862368 913585 963082 1016615 1071763
9270 1071763 1121204 1168424 1212347 1247357 1274079 1287429 1287750 1273911 1248977 1214862 1172563 1126830
9258 1126830 1075677 1027383 974008 921833 864083 809574 764270 720208 671625 630034 593730
9247 593730 554911 521387 486465 455271 428875 406048 382037 359113 343193 328301 311320 297539
9235 297539 286214 271131 259696 246773 244700 240876 234936 226446 219772 216462 206601 191878 183349
9222 183349 177909 170223 166345 175605 183341 188198 185580 181887 172594 159807 148291 140230 129773 125732
9208 125732 131661 134998 128718 123882 125422 130972 129428 121746 131748 132388 123277 116988 113993 114759 115157
9193 115157 110074 110531 112643 117366 126172 133529 135575 135993 132845 131920 135749 137178 137314 144893 156941
9178 156941 169040 179836 196711 219761 238170 256280 275697 302794 345023 393771 459270 550067
9166 550067 655423 788272 941370 1096087 1250103 1381431 1456709 1472151 1428707 1329213
9156 1329213 1192475 1044498 900565 756212 632383 526697 439211 374799 318325 275348
9146 275348 246281 221697 195560 184952 176925 160336 152311 146234 130311 116278 105079 100094
9134 100094 92145 83808 80567 79470 81586 82495 81167 77416 72545 74078 76123 82059 75113 69653 64106
9119 64106 60667 52925 53243 58988 54565 49266 51264 53851 56881 53343 50628 60124 62413 54684 53548
9104 53548 55830 62115 67462 65448 60204 54794 49832 54608 57049 57506 57385 55631 49502 42108 40888
9089 40888 38334 36287 36874 38896 48756 61029 67161 74862 73649 64219 59635 61231 62706 61608 57044
9074 57044 53170 54424 63867 58931 55864 46869 47449 53990 57180 59850 63218 67329 70811 69073 56122
9059 56122 55628 56261 49814 52502 63878 68029 72978 72892 70142 65285 69147 65550 65629 73988 80881 88859
9043 88859 93260 89025 91087 84784 77538 71041 68384 63700 63855 63285 65250 64837 63434 60737 60047 67391
9027 67391 73409 76268 85166 99073 111136 130981 153805 166306 192166 232642 274593 316719
9015 316719 350414 350232 300936 236992 185646 156440 138100 120649 112533 109482 110347 110882 109670
9002 109670 109569 104990 110527 110394 101016 94713 93576 89602 91561 80107 70241 64440 51580 39222
8988 39222 34327 31811 30393 29614 31597 33541 29018 15695 11738 9798 1394 -9206 -19128 -23720
8974 -23720 -30025 -40204 -54342 -57179 -60653 -67526 -73016 -84189 -93559 -103088 -117375 -137016 -167265
8961 -167265 -204619 -252885 -304660 -358422 -431207 -519957 -603743 -654414 -601441 -442773 -249045
8950 -249045 -72364 77090 195760 278548 328721 361723 386490 402408 410848 416238 415809 411218
8938 411218 410588 412496 411001 418485 429522 420745 402580 385176 375354 379074 370965 375445 376289 367377
8924 367377 367069 374536 375419 371026 361218 347243 316081 292019 277280 275967 275506 280942 287516 295820
8910 295820 314709 332918 340784 350116 358580 364057 368578 366373 375267 379125 378359 388649 402671 418851
8896 418851 433138 452624 469701 500477 572846 691167 830802 917824 896979 778598 648393
8885 648393 583908 569141 566457 568072 566965 563856 563150 556304 553877 545358 541219 546422 548831 548667
8871 548667 545293 545343 545268 560274 585181 590783 583619 572151 561254 546849 536241 538332 550318 559914
8857 559914 565213 577585 594297 609781 628906 642565 652577 674375 694927 723802 749844 768964
8845 768964 790856 804862 809949 812244 815445 831544 843960 855275 874313 904410 927071 947954
8833 947954 978566 1009604 1034550 1056365 1083572 1111313 1139561 1174184 1204575 1233027 1262104 1289234
8821 1289234 1319105 1356318 1404179 1452486 1507357 1566831 1636786 1717066 1800592 1855578 1906529
8810 1906529 1959491 2023572 2104547 2214879 2346595 2480004 2613857 2760872 2931542 3122127
8800 3122127 3340289 3571611 3811889 4062164 4338938 4650397 4998864 5388046 5827386 6320247
8790 6320247 6897221 7570554 8352318 9236186 10228898 11352835 12639164 14105142 15758708
8781 15758708 17612340 19686319 22024400 24669492 27678327 31060319 34790156 38761469
8773 38761469 42916273 47472852 53040494 60568254 71311587 87044947 110564855 146055090
8765 146055090 198428848 268725499 343580022 391259623 385756757 334766998 267118086
8758 267118086 204723387 155254284 118588388 92184222 73264642 59597355 49551950
8751 49551950 41965061 36060718 31381172 27569619 24254789 21240240 18542520 16248082
8743 16248082 14388673 12942706 11745462 10582547 9447883 8444650 7625091 6956315
8735 6956315 6404752 5942770 5525637 5151293 4818156 4513337 4239243 3989139 3755764 3548162
8725 3548162 3356168 3187263 3044961 2921269 2796092 2668866 2550558 2438211 2344152 2259663
8715 2259663 2168023 2060179 1941114 1831148 1744846 1673248 1611221 1563682 1520122 1473108 1425903
8704 1425903 1380757 1329889 1277769 1217933 1167799 1123124 1081672 1050375 1012731 972356 936127
8693 936127 907978 878986 853408 828209 805311 794851 782785 760592 742911 716095 691509 666976
8681 666976 644678 614672 591451 575562 564318 553358 548363 538046 534497 535233 523103 515595 515978
8668 515978 515351 501367 492024 485481 476041 466819 458616 453155 443632 434051 428514 422049 410336 398552
8654 398552 389320 366969 348557 345071 355222 362958 368376 373167 366894 357048 347217 337072 336377 357296
8640 357296 381239 411683 410525 339740 204654 70211 21732 59076 122703 175998 218472
8629 218472 246747 269565 280790 282857 284063 284304 281097 277268 263512 255020 256603 264730 274096 285154
8615 285154 290287 305160 326428 353916 397310 458362 527182 549721 515199 456767 408802 384132
8603 384132 381895 406412 425513 425764 407775 382923 366754 348088 326350 303505 267514 220854
8591 220854 180725 147378 122570 107833 96492 82596 68993 56082 42725 29443 24244 29725
8579 29725 35505 41857 65199 109194 177286 293585 465873 692602 942560 1150712 1257678
8568 1257678 1243322 1119831 967802 838586 730262 651275 595133 551974 507692 467478 432286
8557 432286 414509 406164 394630 376966 359430 340352 326114 314641 297228 282149 267959 261356
8545 261356 255748 252996 253651 244084 232995 221225 216347 213717 220230 222716 219646 210313 200419 193548
8531 193548 194647 197193 184206 174077 160419 142487 138118 136317 133399 133622 133910 133090 137526 140777
8517 140777 139888 135481 137831 135438 138068 132014 124270 119980 124806 128002 142377 151746 147083 139995
8503 139995 130627 121592 127446 130726 126994 126499 124381 125023 121706 110124 110755 115815 124941 124148 124462
8488 124462 132231 133131 132562 139143 139948 132039 116286 95579 87602 91601 92428 96965 101605 96956 93688
8473 93688 93725 87946 85724 91804 98230 98917 101249 93998 86424 73663 71410 71366 67793 67074 74336 82643
8457 82643 94881 99201 92811 86713 90808 93173 85370 76271 67672 56758 53651 48827 44593 43283
8443 43283 45081 50041 60189 77291 94353 112456 117261 116873 108430 96265 84070 80609 78651
8430 78651 80012 80818 77960 83429 79709 73991 62754 61604 64356 60006 57387 59597 64267 60798 64324
8415 64324 71968 75825 75833 73517 70864 76746 83570 88807 89999 86924 86110 84797 84360 88365 92247 92090
8399 92090 91772 110667 131139 146140 155968 166168 152900 136751 125604 116785 113339 117946 120192
8386 120192 115375 123706 137956 146765 141010 135825 141257 151084 162713 177242 192580 204378 220065
8373 220065 230582 248651 271932 306066 347103 399845 467165 556391 673584 811592 971344
8362 971344 1133968 1299731 1435116 1512402 1534537 1495556 1396572 1254093 1106189 952578
8352 952578 790411 643951 526551 443709 381137 335087 292940 258395 227700 205508 184560
8341 184560 167733 149580 130372 119754 114938 104569 94500 92053 84534 70440 68715 67069 61831
8328 61831 67141 64304 59417 57605 51882 44675 44887 44636 44070 44382 54915 52926 48202 42536 35743
8313 35743 31755 36036 28777 23984 23194 22543 17271 15483 18067 20007 28039 36731 35583 34929 33192
8298 33192 30031 23609 20652 21645 20104 15720 19941 26915 26627 28531 32437 32861 27395 27827 39738
8283 39738 40453 39857 35943 30782 24216 16415 14739 15667 14598 18351 29339 31778 25564 15759 17116
8268 17116 18162 15013 11047 15438 17663 17401 13880 14949 19882 22599 26410 28874 25422 24370 24806
8253 24806 24606 25572 27869 31702 31733 31628 33669 31752 31156 34510 34632 27992 27369 30230 29997 25571 18265
8236 18265 19673 28934 28688 26810 23811 22081 12895 12486 12314 12309 12703 9966 9575 12763 12217 15207 22551
8219 22551 24760 25483 24229 17183 13455 17590 17176 15635 13505 12803 18508 18895 19217 22845 25169 28046
8203 28046 26672 26893 20976 24406 26815 26812 24894 21998 23958 26595 26732 25283 23546 24287 26165 26539
8187 26539 25450 21613 15279 15742 18343 16243 16046 17479 27885 30119 20144 16662 21326 24474 26353
8172 26353 25839 27641 28105 24057 16310 20457 22970 20778 22193 22722 22009 20043 23582 26414 25833 24597
8156 24597 15588 12319 17538 22346 24251 29917 35208 34094 29971 32863 34185 33127 30835 31445 27733
8141 27733 23683 21338 22330 19412 17047 18456 24428 21828 21480 20156 22314 26444 34538 35063 30616
8126 30616 31827 29667 22069 26352 34825 29203 28359 33850 36184 36582 37411 28329 28710 26102 24937 29006
8110 29006 36341 32013 34191 38699 39052 27375 17395 17083 21261 31813 40677 50448 51532 52056 43651
8095 43651 35165 31767 30232 29230 23790 26437 23875 23803 22290 16249 20156 22473 32036 33509 34287
8080 34287 33923 40118 50128 48067 39344 42934 56612 60793 62231 70003 74657 82253 98216 121130
8066 121130 163950 227555 301119 356153 359029 304976 232725 181123 145353 120588 109634 97158
8054 97158 82360 77969 75934 74636 76957 83270 80406 77675 79253 83150 78672 80501 80108 83874 96102
8039 96102 95358 103599 109906 111420 112586 118081 120900 128653 142220 157345 174437 194110 208081 225779
8025 225779 259130 310868 396702 532769 718675 929146 1117497 1182577 1062389 825777
8015 825777 598610 434923 325680 253983 210608 182664 177888 174028 173528 174412 171909 165988 154465
8002 154465 139527 129340 126102 120938 107186 98184 92600 90842 85583 79106 71486 66899 66769 55999
7988 55999 48716 52493 55419 68508 77686 75494 71087 72352 78434 72721 63728 63251 62889 64541 65754
7973 65754 62379 60495 56908 62524 69458 69944 68654 71310 77457 86769 92520 87228 85097 84600 84001
7958 84001 93768 95279 81604 74419 69179 70089 72255 66575 58810 53096 49236 45153 39261 43027 45042
7943 45042 43084 44093 38871 39032 39462 36665 28574 28920 33884 33924 25814 28382 27534 28969 33103 38819
7927 38819 42810 42453 45409 45129 42573 42869 41654 42838 44329 44961 44148 40539 35919 33744 39537 41837
7911 41837 38424 39749 38068 30600 26393 24400 23215 22137 15455 13410 21499 17198 14582 17130 14657
7896 14657 20111 25597 27739 24412 20020 15365 17630 24254 25353 19416 21659 19572 19706 21811 26324
7881 26324 28025 24497 23878 26203 23293 23761 24259 18164 16777 16430 13133 11993 16408 18226 17193 9974
7865 9974 10769 10178 10978 12159 11629 14285 17358 10959 7847 8045 9415 7171 3772 4143 9090 14405
7849 14405 10190 5293 5656 10601 9093 4179 6814 5059 3177 3482 11779 16342 14501 15362 17434
7834 17434 17152 8449 5371 8561 9719 10009 10959 10345 15686 14660 6250 8937 10576 10869 13758 13882
7818 13882 12497 12972 9586 4463 4807 3824 -2416 -81 5784 12834 5388 505 5797 12505 7835
7803 7835 4471 1800 -1195 -2781 -3864 -1816 -192 2835 1898 524 3296 10542 7065 5844 10870
7788 10870 4503 2321 2495 142 3243 3113 2846 5094 4380 3201 9756 598 -5013 -6316 -5604 846
7772 846 1756 3319 10442 12154 8857 8473 9976 11736 7328 10864 5312 5073 8258 9347 7846 11404
7756 11404 12846 11386 9019 7949 3094 -516 -196 370 5639 10553 4697 5187 331 2387 6949
7741 6949 6719 9785 11878 11045 11564 15467 12329 250 -3961 3194 7817 9309 9673 13616 8752 2981
7725 2981 -1997 4337 11841 11872 3647 -2863 649 4351 445 5086 8015 3758 -2568 -5155 -1097
7710 -1097 -116 10107 7179 -1354 -3844 -5815 -5527 -2647 -2504 -10377 -13774 -7593 -3820 -1144 5304
7695 5304 7533 14801 17467 13543 12052 15122 12644 8319 5175 4502 5787 6703 5716 7370 16171 15131
7679 15131 17627 13059 5238 -1459 -5034 -383 4055 4534 5230 12058 6290 3874 7082 7409 3742
7664 3742 485 2005 419 1213 2153 4147 10310 7651 6015 8712 16354 16196 10743 9034 5566 -937
7648 -937 -1965 3046 2812 5602 6509 3107 3026 4822 2598 12099 15431 11948 6186 235 -7751 -13030
7632 -13030 -3724 3275 7109 1770 -5120 -1091 3018 8571 10607 10441 10425 4723 2938 6152 8657
7617 8657 1944 3108 3305 -1153 -3006 671 -787 888 4303 4684 2232 6768 9879 7884 8739 2668
7601 2668 -1105 -406 2696 11500 7572 3044 6122 5603 9210 6044 1323 3974 7274 10608 9105
7586 9105 4712 7291 10151 9565 7128 2651 -2991 -5015 -6008 -5920 -7895 -9798 -14545 -11687 -5458 -1918
7570 -1918 1124 5604 1196 -134 4773 -2932 -4294 -2968 -416 6546 8785 6118 -2028 -1623 3490
7555 3490 5193 5285 9459 8223 4499 5180 4729 4138 4470 1748 4843 15292 15817 8763 3534 2605 5308
7538 5308 824 121 7525 3680 5124 7231 1770 1494 1544 3051 -2001 -27 908 -835 -6548 -11109
7522 -11109 -4602 -3789 -5849 -5252 -2781 2361 5984 2831 3391 2180 -2442 -11774 -10614 -3849 -2980 -23
7506 -23 292 -1218 -1314 -4020 -1726 -22 4991 8965 6723 5028 7409 1364 6258 6438 4539 8888
7490 8888 12267 4774 -2446 -11920 -10643 -5656 -673 -2174 -5015 -3767 -525 -521 -468 -4634 -5033 -3657
7474 -3657 -4145 -2056 2055 -1353 -1428 -298 -625 -2027 -6419 -2233 -1737 -2195 -5771 -2597 4157 4862 5314
7457 5314 5741 5260 -116 421 7030 11159 8903 2987 -129 -2596 -3834 -3033 3593 3700 -2758 -1759
7441 -1759 193 8739 9577 9172 3117 -4615 -8907 -1219 7489 7790 11724 10800 10013 7017 -1251 3362
7425 3362 9606 11870 16403 14436 8520 6473 10772 10972 5311 3171 7688 5911 3986 1314 -1475
7410 -1475 -1768 -282 1545 1161 -1281 923 2480 546 3979 5301 1880 -893 2378 1653 -459 -1616
7394 -1616 -861 -1457 -5052 -10160 -12190 -12579 -3469 8112 8076 6935 4193 -4127 -6129 -3611 -2707 -3949
7378 -3949 204 4256 3059 -513 -639 -2391 -3726 -12086 -13822 -16597 -16403 -18523 -16703 -12465 -10684
7363 -10684 -13365 -7985 810 3581 -1696 -9055 -10516 -2301 4395 7148 9465 2196 -692 -734 -3335
7348 -3335 -6861 -8436 -8843 -5709 -4131 -3090 -4061 -6953 -7453 -4646 960 3549 -4788 -6802 -3406 -2286
7332 -2286 -2418 -1716 1348 -292 -1083 2894 4771 -4126 155 4515 -596 -2197 900 4171 3046 4569
7316 4569 227 -4671 -4908 1758 10157 5950 2092 3035 -657 -5724 -4550 3708 7619 4120 -9920
7301 -9920 -17624 -15616 -17715 -13565 -4232 -3319 1649 2866 877 3843 3070 1664 1638 -754 -2294 2091
7285 2091 -774 -4660 -10168 -8942 -4006 -8100 -4336 -9328 -9231 -6054 6420 7223 3643 -4229 -5910
7270 -5910 -4117 -6790 -262 2979 2571 -578 -1624 2983 6677 6128 3975 -2559 -143 2540 3739
7255 3739 1549 5590 2406 2374 1222 4094 2417 2438 -85 -1039 1176 -3651 -6169 -9560 -5435 2733
7239 2733 5624 3652 5359 7391 3233 1026 3265 679 -1382 -1508 -1157 2998 6217 3543 1891
7224 1891 1754 4208 -2233 -6422 -9311 -14195 -14258 -11323 -6052 71 487 3361 7028 8371 11162 11032
7208 11032 5786 7654 6325 -1075 -1705 109 -2838 639 5013 9091 7666 4574 3455 4834 4660
7193 4660 296 -4883 -10151 -13236 -12359 -6441 -4106 -3522 2338 4670 4169 4065 -3959 -3974 -5001 -8085
7177 -8085 -1606 920 -3070 -63 -2042 -3081 708 1432 1076 -3350 -1831 -4730 -1479 -7210 -10262
7162 -10262 -5912 -2382 5031 9090 4477 478 -4682 -2538 -2295 -3206 988 3628 4424 -2614 -2065 532
7146 532 -3663 -5233 -4245 1299 3473 6230 3613 5119 -846 -6286 4721 7220 -1696 -3620 -3152
7131 -3152 -419 1386 4450 -2694 -2029 1550 2952 7888 4355 543 1126 -3431 -1869 -1915 2849 4152
7115 4152 5473 2821 3742 2387 118 4456 -1079 -3494 -5151 -5052 -2077 634 1013 -142 -1262 -2253
7099 -2253 4097 3517 3860 3625 2368 2419 -901 -2797 8594 12535 13632 13586 5618 7089 7122 5987 10209
7082 10209 10627 -2860 -4441 263 -1057 -4666 -9745 -497 2085 -1077 -8757 -10700 -9380 -8753 -6918
7067 -6918 -9482 -13219 -13822 -10456 -11089 -19227 -18133 -15052 -7850 -3828 -1829 -1853 1157 4810 2064 291
7051 291 3635 6751 930 513 1533 5728 7520 7460 7796 7234 4766 -2572 -8025 -7137 -7247 -8300 -4578
7034 -4578 -6377 -6391 -4036 2959 1393 619 -4320 -2354 -6694 -12450 -5703 4857 9867 7802 1020
7019 1020 -1215 -1604 -1550 3793 6872 5818 -3882 -6066 -3897 -5901 -6755 -6644 -13392 -10781 -7453 -6606
7003 -6606 -2517 -2498 -7179 -10046 -6761 -5508 -678 5405 4976 4368 -1525 -3311 -8060 -8715 -14978 -16477
6987 -16477 -7602 -2265 -3439 -3869 177 -3154 -878 -1904 451 5440 -439 -2698 -2682 612 4584
6972 4584 2154 5928 -1470 -6928 -3358 1080 5769 6449 6991 3734 -1169 -6835 -6668 -5120 -1066 -1064
6956 -1064 -4814 -4953 -7960 -12156 -8890 -7747 -1718 10305 11224 14107 12033 11026 12185 5566 2902
6941 2902 2494 2755 -2053 1250 -2981 -6326 -6291 -9629 -6866 -6727 -7187 -4763 -5461 -9895 -11993 -7854 -3161
6924 -3161 -10842 -11540 -12984 -8222 -927 -643 -1576 -2072 -5381 974 4538 5405 8918 5861 -2511 -4718
6908 -4718 -2998 -4646 -10865 -9072 -4531 -4692 -7516 -5366 -6500 -6788 -8035 -4615 -622 -2857 404
6893 404 3189 1048 7268 8849 -3192 -9122 -12541 -15651 -9489 -214 5844 1721 -11491 -12641 -7550
6878 -7550 1234 -584 -1357 -5701 -7228 -14027 -13037 -8497 -6584 -12066 -12893 -6668 -1932 -1316 -3092 -748
6862 -748 -1064 542 1444 4796 9702 16306 19522 13714 10012 5080 5521 7648 4452 2315 1682 4537
6846 4537 3086 8337 7037 4601 6908 4585 6280 5436 9018 13646 13652 5372 1194 1991 864 391
6830 391 2620 2135 -504 1195 -169 1602 1730 9567 7512 4522 -787 1005 4799 11462 11097 6201
6814 6201 1563 4685 11805 12767 11787 9866 1400 -117 -1056 2238 5650 8636 13134 12664 13007 10849
6798 10849 12139 12552 13050 12744 13161 10383 -365 -2701 -3030 4772 15398 21913 15582 4333 -1674
6783 -1674 4237 -482 -5219 5759 9465 12618 15393 19874 17638 13954 13494 9504 9148 11737 15627
6768 15627 15090 17300 21949 20073 25163 28781 32289 34628 38362 38044 33949 37099 47878 57499 68397
6753 68397 82999 92716 107333 121495 120631 114116 105758 96477 86019 86928 87204 99179 110823 119397
6739 119397 129656 139413 157563 183683 218908 256429 316810 412937 558424 779206 1117180
6728 1117180 1570125 2023457 2192020 1933164 1466327 1043188 732910 519239 379668 284975
6718 284975 221637 172344 141449 117034 102406 89935 83082 74743 60663 54111 56372 57304 51783
6705 51783 54762 61920 69661 66086 57123 46968 36841 32650 23765 21886 20867 23252 21106 15623
6691 15623 12824 10316 14071 25612 29577 27417 21951 18632 16663 22174 20391 16010 12334 9849
6677 9849 8172 6652 3512 -541 5372 12161 10795 6055 -211 -1133 -1356 -5093 -6925 339 -1000
6662 -1000 -3446 2945 6210 4195 -2862 -7025 -526 1285 -4364 -5984 -8173 -6250 -5664 -2228 -3078
6647 -3078 -7887 -6558 -6645 -11054 -17805 -16678 -6574 -3262 -943 -1781 -1344 1510 3600 2564 705 -1809
6631 -1809 -3388 -3235 -1171 786 -7028 -8228 312 10281 12548 7247 3177 5428 6608 3370 4906
6616 4906 4012 -1670 -3436 1178 1374 -2350 3536 10917 5861 2494 -7337 -10227 -2645 785 -1651
6601 -1651 -1495 -8110 -6245 -4659 -3614 -159 87 5924 9965 10783 6599 -1871 -1321 -1978 -1259 665
6585 665 -538 -5929 -2909 5522 5698 3635 5167 1331 2590 7544 -2450 -5963 -325 7645 4781
6570 4781 2791 10557 8742 4254 -772 -3229 -4900 -4505 -4726 3237 -2903 -7085 -7468 -8855 -5557 -4304
6554 -4304 -912 -3657 -5063 -2775 -1063 -177 -909 -2875 -9028 -11945 -11051 -7642 -3823 -1299 6498 5906
6538 5906 771 39 8227 13222 11512 11769 12152 9395 6634 4992 1910 -4821 -11251 680 1204 -17176
6522 -17176 -25855 -19096 313 20828 35793 33134 16320 -1519 -16437 -14310 -5841 -6368 -8520
6509 -8520 -2835 -3242 -5384 -4104 4200 -1835 -8100 -5569 -9401 -10442 -7871 -3464 892 2207 521
6494 521 3892 8077 11434 6389 962 -215 -946 -1014 -2351 -11307 -19692 -14047 -7707 -6108 -5694 -2662
6478 -2662 -3348 -4520 -8846 -2363 -4864 -2770 -985 -2904 -4299 -2881 -216 -13954 -12485 -3046 -7125
6463 -7125 -10684 -8793 -7174 -4899 -2594 -4935 -7746 -5743 7569 6046 -1528 -4300 -2020 -4969 -2032
6448 -2032 -2389 -3168 3013 4732 -1876 -5642 -1978 1530 -2661 -8955 -10120 -14606 -9690 -3944 -3450 2554
6432 2554 5934 11496 7705 10230 13750 7637 -2959 -897 4702 2835 -4384 -7379 -6924 -454 -332
6417 -332 3204 2494 -3225 -4968 -529 -606 2855 6679 1405 -859 2580 3369 -5850 -12260 -8030 -8632
6401 -8632 -7797 -5093 -5694 5818 5632 3739 -1239 -7664 -5586 -3373 -5769 -8300 -8374 -10395 -1874 873
6385 873 1771 2790 1959 4921 3499 840 6522 6553 3261 2962 5867 5571 -3628 -6037 -1244 -1178 -1280
6368 -1280 -7210 -10994 -7299 -1100 -6339 -13435 -9872 -10588 -6685 1156 1141 -196 3869 2018 7887 9388
6352 9388 7921 5947 12164 12270 9969 13826 18414 17628 9839 8095 2234 -2656 -4001 -3238 -1572 -2641
6336 -2641 -2321 -4496 -5902 -1393 3782 9435 5605 2945 891 5427 8231 4418 685 -4326 -1722
6321 -1722 -1722 -4081 -5357 -3940 -5877 -10352 -10057 -11115 -6823 -1632 3354 918 240 1873 6198 4337
6305 4337 -5560 -9922 -6473 -2519 -5147 -5922 -8665 -10459 -9972 -8246 -4733 -4423 2127 4748 1014 5235
6289 5235 10116 3435 -3338 -3358 3704 7096 6649 509 -1806 188 -694 2429 1602 1205 1066 -1924 1853
6272 1853 8068 4658 489 6106 2938 -2512 -6106 -5512 -10944 -10460 -6229 -6006 -11054 -6407 2677 2164
6256 2164 3895 3863 7867 5152 3630 5761 5031 2650 -830 301 65 -3175 -9846 -6369 3498 11456
6240 11456 5503 -5367 -3611 -4421 -7583 -4697 -4037 -4997 -3781 -4404 -7927 -6300 -2550 -3773 -9631
6225 -9631 -15481 -17274 -12619 -8137 -6275 -417 1997 3068 -688 -4351 -7944 -9481 -7271 1661 4757
6210 4757 485 -5776 -8911 -8918 -11422 -10281 -12286 -15316 -9378 -7152 1769 3122 -471 -6651 -7086 -8109
6194 -8109 -6148 527 2042 -5688 -7430 -1728 -654 -2660 -8319 -2879 -3671 -202 1466 2578 -399
6179 -399 -681 -4929 -7587 -5462 -4874 -9644 -7208 -3384 -7996 -4372 -1525 -6689 -12635 -11497 -8739 -10230
6163 -10230 -9768 -9306 -4100 -758 -1717 -1043 -354 1866 6477 6729 7210 5267 7131 6774 4105 2996 -488
6146 -488 -730 -843 -382 -745 -2071 5281 8886 7886 3576 2900 1586 439 3999 10614 7592 -1721
6130 -1721 -12406 -3203 134 -5699 -10377 -12593 -4831 4202 1210 7401 8441 6287 12607 4957 -3278
6115 -3278 -1971 -136 -4238 -9756 -7347 -7943 -5795 -945 -3206 -5502 -7382 -10567 -16158 -15603 -14108
6100 -14108 -9121 -11921 -11398 -6736 -1601 -2132 -2980 -6054 -8052 -16879 -22394 -20554 -19785 -17130 -14263 -11847
6084 -11847 -12544 -7547 -2066 -9769 -15028 -4265 -1381 -1385 5322 2507 -7004 -5054 -3856 1332 8269
6069 8269 4104 -309 -3693 -5739 -4093 -1077 -1151 -272 -854 -1155 1790 2162 3800 -1113 -8115 -6223
6053 -6223 -7601 -8592 -5277 -2752 -1573 927 -3727 -8574 -8153 -14237 -16508 -16109 -17342 -14858 -12509 -12910
6037 -12910 -3264 4951 -2596 -9993 -9439 -7464 -4316 1821 619 -2842 -3549 -5191 -9556 -13862 -7678
6022 -7678 2128 8547 6881 -2233 340 6151 9797 3549 -5070 -7539 -9424 -6970 -6162 -8542 -4623
6007 -4623 -3841 -8872 -9379 -5256 377 4421 -4222 -12453 -6499 -2442 -6088 -5992 -2464 2334 440 1942
5991 1942 2284 1099 966 7051 8333 634 -9225 -11254 -10184 -5201 -2458 -5385 -3771 -1009 -2067
5976 -2067 -10256 -16961 -14075 -8558 -6274 -4983 -5464 -2185 -7257 -10544 -9682 1039 -3776 -1164 3345
5961 3345 -275 -127 -1447 -6466 -7074 -9568 -1841 6506 5425 7792 516 -2633 -9660 -6524 -382
5946 -382 4108 4291 602 -3674 -3298 929 -3785 -3361 1350 -1926 -416 -3006 -8812 -9691 -15173 -12142
5930 -12142 -5255 -3104 -6199 -1964 3007 6097 -1054 -6991 -4628 1331 -5385 -13966 -11903 -12632 -15346
5915 -15346 -14255 -7126 -3250 -581 -1357 -1372 1392 5158 -223 -3297 -1237 4827 4629 1522 1685 468
5899 468 -3494 -5823 -5727 -8872 -3227 5338 1637 2469 4929 4273 -2851 -121 2966 8941 3079 -2320
5883 -2320 -5681 -8464 -4858 3162 2942 2617 2231 -4318 -5639 -5138 -2427 -331 3971 5619 1727 -6809
5867 -6809 -9117 -6225 -5578 -6334 -2731 3824 5008 3725 823 425 1367 2854 -86 -2140 -398 855
5851 855 -787 4000 8625 2119 -5374 -4853 928 -5188 -5363 -5178 -5801 -4335 -1863 3237 4956 3713
5835 3713 -2247 1060 3023 5211 623 -3660 -5288 -885 -6249 -1170 8949 13685 6622 3957 3373
5820 3373 876 -56 1297 207 1233 -112 3841 2938 5374 7331 5780 3698 -2655 -1229 -3543
5805 -3543 -9631 -13880 -12587 -9301 -198 807 3632 1465 292 -210 -1529 -1040 235 -1106 -7893
5790 -7893 -11628 -8102 -7778 -8235 -7158 -1353 1820 1669 -1484 -3475 -9970 -6767 6155 7391 3653
5775 3653 4048 2452 2162 2269 397 -1668 -6567 -7946 -12194 -14726 -8872 -6663 -1249 2150 2083 -3157
5759 -3157 -9478 -15617 -19696 -24210 -25495 -25852 -21167 -21549 -16698 -15850 -8903 -3130 -2128 -1944 415 -2709
5743 -2709 -8421 -13707 -9086 -9602 -3676 -2865 -743 3528 8646 10434 8840 14028 10003 6132 -2524
5728 -2524 -6224 -8033 -11996 -3658 1175 7280 11696 5713 -615 2219 4078 -3645 -6915 1525 9349
5713 9349 8775 3780 -1969 -2005 -5579 106 2555 556 -169 -3180 -2786 -4322 -9908 -13376 -13270 -9366
5697 -9366 -8646 -4892 4132 6914 766 -5665 -4095 -5336 -4310 394 385 -823 5085 5140 4559 4450 8761
5680 8761 9984 -788 -5175 -3329 -6764 -3421 618 -763 -791 6488 9953 6553 -1034 -7392 -4102
5665 -4102 -4462 -2395 2027 517 -5373 -7624 -1316 1379 1791 5709 8906 1725 222 1460 1252 1558
5649 1558 3034 5225 3239 4598 2804 2964 6535 9187 11433 7404 -1855 -3537 -690 -9 -2998
5634 -2998 -25 -1414 -226 -334 584 -1568 -2411 -334 989 -2030 -2985 -3665 -5515 -5262 -6413 -2497
5618 -2497 3267 3792 5176 7401 9226 4861 -549 461 -3577 -10595 -11306 -10380 -5897 1972 2813 4038
5602 4038 4615 284 285 1996 6382 4017 1257 -877 -4972 -4729 -446 5595 1012 -2151 -605 -4530
5586 -4530 -7526 -4783 -8894 -7002 -3601 -10608 -13653 -14650 -11161 -3051 942 2281 -1836 -3745 -1032
5571 -1032 -2152 2077 6457 8559 6196 4626 8130 9332 8457 10363 2912 -4004 -6368 -2809 968
5556 968 -646 -888 -3060 -7927 -8284 -494 -1881 -3398 -6318 -6555 -2511 -292 -2070 -1666 -410 -7116
5540 -7116 -9460 -9812 -7212 -6802 -4477 748 8515 14860 4396 -4728 -3313 1677 1576 1373 -2857 -8847
5524 -8847 -10763 -6749 -1705 -1593 -3478 -7410 -3139 -6166 -7150 -7001 -10404 -13694 -10795 -6473 -5446 -2862
5508 -2862 -5506 -5986 -2667 5271 7798 5083 3134 3816 1116 -7424 -8597 1927 5643 1431 -8547
5493 -8547 -10620 -2994 3773 -4672 -9878 -6633 -10720 -9192 -5858 -8486 -9101 -6535 -5610 1588 -110
5478 -110 -5552 -11105 -3062 -7579 -4457 -3824 -5885 -3917 444 1083 -5935 -4611 -1065 -3987 -717 4008
5462 4008 -1524 -3610 -6279 -7310 -4904 -2932 -608 792 2236 -1844 -3582 -587 5354 7488 7187
5447 7187 -3530 -7299 -4856 -1301 1985 5716 6964 6455 10422 7297 3819 5226 2038 -3497 -6977
5432 -6977 -10676 -7101 3812 395 -4091 595 3054 2157 1854 -3804 -3009 4062 12575 16362 11001
5417 11001 9014 6852 5320 5921 1655 -6237 -2681 3604 4910 7367 830 -682 -1713 -1061 3710
5402 3710 6623 10836 16973 11767 -683 -11127 -15180 -5284 1135 332 4323 1427 -1360 -7964 -5300
5387 -5300 1407 2474 -1111 -2502 -7083 -8563 -7902 -6975 -2114 -1482 -9556 -12427 -11958 -10155 -6931 -571
5371 -571 -1562 -5446 -8010 -5270 -9324 -5959 -2456 -7190 -9557 -3730 1618 1388 8250 2697 -4555 -2021
5355 -2021 2919 2432 -2527 -6042 -4621 -2923 -3254 -7948 -4398 -220 -1053 -9390 -12920 -11473 -8184 -2393
5339 -2393 5839 9990 11579 2491 -1163 -569 3485 9992 8815 5945 1597 3663 3280 -2046 -11167
5324 -11167 -11965 -10888 -13817 -13888 -13345 -4675 -2426 -6066 -887 490 119 -5712 -6579 -6404 -8950 -4521
5308 -4521 3488 4247 2975 -955 -1575 1488 4158 689 -1094 5379 6023 2720 -1940 -6480 -8833 -10605
5292 -10605 -11362 -6327 1756 4541 3612 -6191 -9170 -7173 -7036 -6238 -1161 -2824 -5842 1421 3556 6449
5276 6449 1251 -4664 -14575 -10379 1390 5670 8785 9020 5480 -2336 -2038 -3596 -1663 931 346
5261 346 4767 6983 919 -5500 -3715 -2472 -4111 -8286 -10074 -843 232 -3461 -4554 -5253 -5146 -1849
5245 -1849 129 -556 940 -619 -4347 -10015 -17272 -14296 -5381 1109 -2015 -6996 -6358 -8661 -8277 -6242
5229 -6242 -12350 -12792 -7703 -6432 -1575 8762 9049 9385 5546 5711 7799 7957 8380 10204 7147 2012
5213 2012 -2976 -6525 -2715 717 4705 12070 16602 11056 3790 1458 4196 8644 7422 7666 7336
5198 7336 10733 10092 -968 -8566 -7366 -7953 -7836 -9144 -1916 889 3585 9593 3743 -3177 2845
5183 2845 7505 424 -7728 -7649 -3609 -5234 -215 -610 -2058 -1867 469 -397 553 -8306 -8632 -2742 -2913
5166 -2913 -9480 -15891 -14901 -8306 -17040 -17837 -9608 -5681 -6337 -5580 -6394 -13144 -17957 -11096 -5881 -2162
5150 -2162 -508 -1877 -6532 -5350 -3398 -486 1125 3005 3673 -1521 -5051 -246 3793 -1745 -8054
5135 -8054 -5816 -4892 -3499 -2115 1992 -2577 -4538 -6738 -2039 5250 1801 -1384 -983 1309 511 -7766
5119 -7766 -12839 -6698 -3911 -8318 -5082 -93 -2087 -5974 -10369 -7372 -4744 1961 4401 3180 299
5104 299 1623 727 1454 2884 6090 6970 10021 3716 -3523 -739 -7290 -9996 -6617 -8825 -10784 -6218
5088 -6218 -3242 -6097 -9107 -12894 -16183 -8805 -6276 -10117 -8125 -3358 -288 1875 1327 -691 -1994
5073 -1994 -7541 -9741 -12646 -12288 -7413 -10436 -18451 -11473 -7859 -8526 -10074 -10366 -11710 -9213 -6922 -2039
5057 -2039 -1166 -10171 -11219 -6742 -3967 -3031 -4443 2685 1430 -3798 -5645 -6537 -3596 -290 8822 8705
5041 8705 2152 975 4457 1726 -224 1301 5107 4461 6616 14777 13054 3405 4441 3353 -3386
5026 -3386 -4210 -7318 -3343 -7209 -11990 -8653 -2338 -4957 -5596 -7073 -1350 5462 262 -1626 5783
5011 5783 2056 -2718 -3810 -3568 -5126 -10549 -12143 -9852 -1991 3277 3547 5238 2575 7724 10243
4996 10243 377 -5612 -3296 -731 -794 1946 485 -4629 -4054 -8301 -9795 -5372 -3808 -7279 -12928
4981 -12928 -16435 -14896 -11126 -6387 -8858 -7351 -3815 -5598 -2739 -2879 -3636 6742 9819 4193 2770
4966 2770 1183 -1467 1341 -3639 -7007 99 110 3099 1563 -3107 -5312 -6968 -743 3178 8570
4951 8570 5317 1762 -712 -3704 -12254 -11228 -1363 -11212 -13304 -11439 -12424 -11780 -6668 -4906 3796
4936 3796 7513 738 -4260 -3653 -2116 -1688 2034 8102 8942 6876 7259 110 -6884 -8895 -11167 -7611
4920 -7611 -3803 758 -1025 -4380 -3954 -7776 -559 5369 2337 608 2374 5511 7566 12691 16802
4905 16802 14083 12526 13710 14014 9494 1108 -2032 1271 -6339 -8656 -2900 815 3284 8407 6661
4890 6661 551 2177 3443 2010 1530 -2663 -4556 -3491 -3133 -724 9645 10554 4985 -3875 -3688 1615
4874 1615 -1331 230 2862 -2680 -8172 -7160 15 -309 -239 -5197 -7385 -3840 263 7243 9232 4616
4858 4616 3293 -309 -5371 -7151 -4828 -3309 -1361 1345 -1167 -1644 -3913 52 -2596 -6850 -6960
4843 -6960 -1519 -2200 -3591 -2353 3204 -2342 -3378 -2740 -4640 -9157 -7898 -7585 -8652 -7112 -2176 -2282
4827 -2282 -6016 -7770 -7513 -1321 1050 2796 -9080 -7423 -5733 -3700 -2145 2391 873 -9671 -9743
4812 -9743 -8941 -7324 -87 1717 -2090 -3523 -150 -3163 -7951 890 7392 -319 -5439 -5909 -5016 -10260
4796 -10260 -11605 -4885 2027 3906 4631 -5735 -11628 -5928 -1932 2396 2517 2321 -3914 -8073 -10533
4781 -10533 -10106 -6680 -463 -1889 -7622 -4259 679 1549 -392 -3927 -8433 -14922 -7616 -10650 -7981
4766 -7981 -5857 2971 10474 5005 2181 1120 6158 8567 10562 5637 84 -2047 -1041 1741 6071
4751 6071 12186 11530 9216 10284 7382 5680 9630 13684 8358 -3488 -6750 -8406 -18023 -15926 -11984
4736 -11984 -9688 -8616 -10873 -7511 -5563 1926 -5109 -8151 -7172 -10797 -7343 131 -988 5964 9225
4721 9225 5038 3881 482 1198 9570 7096 7972 12267 7351 6724 2489 -3054 -5141 -14770 -10638 -2449
4705 -2449 -6004 -481 -3206 -4532 -6074 -7157 -9064 -12684 -12639 -12473 -8238 -5248 -1779 5540 8925 3573
4689 3573 818 26 -5197 -6332 -3347 -4101 -13 -2688 735 5497 2223 6141 6080 -1454 -8696 -13545
4673 -13545 -14248 -12321 -7359 -2386 -6137 -8904 -5763 -861 4897 1566 -7195 -6046 -3814 -4099 -2162
4658 -2162 -1641 -4423 -7159 -8172 -7629 -3210 -1036 -3146 -5993 -5893 -5528 735 9294 8945 -1454 -4540
4642 -4540 -3701 -456 6860 2391 -3402 -8586 -6410 -5318 -6868 -3651 2912 -3428 -8859 -12677 -15619
4627 -15619 -5183 3034 6613 6849 6715 6970 14088 17063 13997 5796 5113 3856 -3684 -5824 -12077
4612 -12077 -6466 5622 7327 5142 8068 796 -9235 -9987 -8561 -6288 -7430 -6307 -5321 -5132 -2288
4597 -2288 1523 -6441 -14578 -10047 -1236 911 -2416 253 2906 6701 4231 -4631 -9004 -10295 -1977
4582 -1977 -4963 -8570 -4998 -899 -729 -7441 -5183 -1359 3211 4303 4919 7207 1137 805 -1156 -762
4566 -762 978 -2123 -2593 -4014 -7273 -8356 -11486 -17428 -11681 -2884 -2909 921 3023 1627 -5599 -8208
4550 -8208 -7981 -9288 -5132 -4298 637 1384 1729 -79 4182 9341 11249 8511 332 -5852 -2224 1337
4534 1337 489 -2163 -5239 -15700 -22179 -21410 -18072 -8869 2955 3554 -5025 -15983 -20677 -15380 -9794
4519 -9794 -4181 1370 -1544 -5786 -617 272 5738 4350 4024 2712 -3698 -6393 -1414 1781 52
4504 52 -6728 -10440 -10973 -12173 -7123 577 -3423 -9256 -10623 -11635 -6476 -6159 -4109 2463 2597 -7078
4488 -7078 -5453 -5056 -5437 -118 2984 1182 -661 4649 8265 4521 2590 3393 6675 10276 1868 629
4472 629 6733 11894 8426 8025 7597 7654 11982 16619 12207 9881 11487 10426 9997 6718 6359 10643 6950
4455 6950 936 -10504 -6720 -6632 -5502 -4799 -10614 -7036 -7023 -10932 -9491 -6462 -1931 -2683 -4460 -5117
4439 -5117 -4056 -5161 736 5639 1957 -1926 3918 2851 -1887 -8274 -3143 2206 7988 2927 -1722
4424 -1722 -836 -3750 -6890 -11753 -10616 -5716 -2441 -1728 -4265 -2062 365 2446 876 436 3387 2139
4408 2139 7440 10938 6655 8423 3331 -437 -5426 -5483 -4765 -5013 -6084 -8193 -5768 1495 8496 3430
4392 3430 -2288 -96 78 -4235 -4731 -3173 -1324 -8561 -10990 -8985 -5714 1327 3133 4822 3955 2673
4376 2673 -8603 -14777 -12589 -3483 837 -9964 -11092 -7268 -8159 -9806 -2668 -1666 -10074 -15255 -14994
4361 -14994 -13006 -6876 -2595 -646 2669 2441 4960 2037 6603 10672 8181 7496 8993 5164 -2650
4346 -2650 -3622 -2229 -1721 -2192 922 5731 1456 -6794 -6107 -794 2491 2569 452 -3726 -4280 -5171 -4975
4329 -4975 2763 6584 10250 7843 1738 1580 -5145 -1884 1507 2553 4196 382 -1311 -2435 2529
4314 2529 2429 213 1814 -2668 1246 2969 -2720 -7433 -10878 -6669 -4390 -87 -1212 4793 6455
4299 6455 2103 3394 2784 -2314 -305 773 257 735 -3592 -5946 -348 1944 -2463 -5397 -999 1182
4283 1182 -113 -5404 -12125 -5634 6295 5111 1747 -4011 -10744 -7010 -8655 -11458 -5321 3426 8906
4268 8906 7097 -6663 -11567 -9549 -3748 -5154 -10601 -6438 1254 528 849 913 -3847 -1283 6409 7080
4252 7080 1032 -3996 -8832 1505 3505 -3463 -11131 -14807 -12364 -6057 -6982 -7856 -4409 -3226 -2935
4237 -2935 -182 -766 -227 837 -14 868 -1430 -157 515 -1493 3518 4430 2462 25 -2513 -1916 -1165
4220 -1165 -89 6240 6317 -521 795 -528 298 -1375 -3166 -1208 -1167 -1472 -9254 -12719 -12073 -7416 1054
4203 1054 1817 3791 8224 2989 -646 -2422 -1298 -9552 -12788 -10463 -4133 -736 -3040 667 8902
4188 8902 7265 2596 -3528 -3976 -4990 5311 6702 4061 -2518 -5079 -5841 -5148 -1019 527 2041
4173 2041 617 809 3516 9272 11570 7438 6831 431 -4359 -2095 778 -1919 -13893 -11357 1785
4158 1785 5340 6941 5586 5631 4653 4107 7107 5168 -1820 -4795 -948 -2800 -4502 -12830 -14700 -11868
4142 -11868 -7656 -7457 -5844 -4219 -551 -790 -9443 -6255 -2013 -8635 -6688 -627 2449 3191 -3191
4127 -3191 -6056 -7569 -5164 -1825 5121 4664 5179 4528 -4179 -6495 -8121 -7033 -3472 923 -4011 -2475
4111 -2475 -644 7144 8155 7272 7643 1141 -932 -1580 -6298 -1613 4178 8947 8607 4087 -1663 -2959
4095 -2959 -5640 -11732 -12292 -10570 -2526 -2291 -8369 -5044 886 -3391 -1714 758 4009 888 2462
4080 2462 428 -9610 -6607 -4384 -5937 -4082 -6469 -5173 -5262 -9058 -13365 -11330 -5748 -2255 706
4065 706 1041 -4756 -7649 -2899 -3195 -8022 -13517 -14495 -13163 -8590 -7773 -12027 -8328 -4882 -3117 4861
4049 4861 7796 3575 -186 2796 1819 -22 6387 13526 10436 6185 5696 -1583 -1433 -8636 -12325 -5822
4033 -5822 3142 2982 -3739 -11467 -5793 -584 -6244 -6927 -3390 -2452 -2916 -8229 -6501 -6880 -4649 6761
4017 6761 4307 -445 -3109 -1754 -3576 -1633 -641 1012 1844 -184 -2133 -2235 -2756 -643 8353 8129
4001 8129 8113 12290 10150 7747 5918 4262 3318 3568 2549 5419 9568 8071 9768 9885 4743 -2689
3985 -2689 1674 6439 1287 -1331 -1872 127 -102 -9579 -6525 -3823 -5470 -4327 -680 8194 6163
3970 6163 1275 -2727 -1424 -2009 -6735 -10373 -15970 -20025 -14956 -6489 -12555 -9623 -1619 4615 927
3955 927 -3145 1716 7036 8349 4814 112 4331 5343 881 -2491 -8184 -10698 -7845 1078 7609
3940 7609 5474 5497 10538 5123 -1069 4508 947 -9476 -5990 4772 6795 3033 533 -842 -4054
3925 -4054 -2069 297 4416 337 -3946 -7083 -2324 -3889 -8869 -6904 -2229 1261 -1752 -5652 -8439
3910 -8439 1063 1238 2665 -1825 -69 1802 3557 4990 2800 7333 6155 -618 -5744 -5411 -759
3895 -759 340 -6161 -11016 -12139 -5783 -2705 -2800 -1960 62 -3830 5284 8260 -406 -689 -686 -2373 -6469
3878 -6469 -9354 -15968 -16497 -12022 -8310 -6487 -1523 -1581 39 -2097 -6487 -10040 -8323 -6634 -10083 -13904
3862 -13904 -15573 -12247 -9894 -6308 -1629 2052 2885 -1573 -3955 -581 -4453 -6357 -5082 270 -3994
3847 -3994 -9177 -9026 -9982 -8052 -2383 1022 -4618 -4391 -9782 -7206 -6766 -12625 -12569 -7912 -8961 -13463
3831 -13463 -16572 -11642 -7042 -6128 -3558 -1042 -4061 -1894 2399 6800 10571 6185 2863 -3764 -3754
3816 -3754 -6193 -11234 -4498 -701 -3160 -1290 -1563 555 566 -3283 360 1877 2680 4857 32 2153
3800 2153 8244 14564 16906 8504 1887 -625 -2996 1915 -1267 228 -4064 -8368 -3114 547 -741
3785 -741 -411 4536 2993 8693 14372 11183 4299 2864 1899 6464 5482 2049 2778 1 -4018 -8920
3769 -8920 -9472 -8669 -7206 4096 5201 -1222 -7904 -7064 -5776 -1272 1734 -145 -1156 -2358 -3387
3754 -3387 -2658 -5625 -8966 -4698 3992 5141 -649 -5199 -7859 -5676 -9756 -7020 -6175 -7806 -2855
3739 -2855 -3950 -6607 -5553 -918 3700 9372 5626 -154 -1191 -3169 221 1977 -929 -8574 -16662
3724 -16662 -19701 -22505 -20417 -11207 1767 5890 1654 5187 6854 1654 -5302 1144 672 3208 4476
3709 4476 3558 1815 -3910 -8713 -4504 -4571 -2909 682 4206 3832 1651 4846 2187 2793 2522 2613 3059
3692 3059 -3043 -7319 -3922 7685 9439 3552 8071 7143 -1756 -17553 -13089 -8220 -5217 3745 5200
3677 5200 8236 3781 1780 541 -3504 54 3585 2542 -1078 -460 -2374 -4725 -1828 2983 6888
3662 6888 12253 13382 10387 11979 5359 223 -2303 -6446 -1746 -492 3751 6620 4078 7480 7789
3647 7789 3616 342 -2358 1552 5856 9944 8183 6177 4098 1648 -1707 -8887 -4987 1274 3128
3632 3128 -8373 -11080 -10065 -6178 -2966 2270 1773 608 5152 -3513 -4743 2520 4878 4038 -417
3617 -417 -4137 -10041 -6568 -3355 1237 -1326 -2223 -5902 -8833 -6292 2966 2816 -6155 -1170 948 579
3601 579 4452 -1628 1136 4447 8127 7237 2410 310 -3026 -1097 6275 6842 896 -6803 -9051 -4842
3585 -4842 -5788 1990 5040 2268 -2835 743 7652 3303 -1477 2363 -2619 -3508 -3994 -4792 -9184 -17183
3569 -17183 -17625 -7878 -8744 -13393 -13240 -7597 -1723 -4213 -4060 -118 1004 4225 9669 10215 6918 4060
3553 4060 2851 5473 10103 7977 7509 1172 2276 3361 -3281 -2805 1756 8303 8636 1938 7389 8676
3537 8676 4512 3154 464 -5437 -3980 -1252 -3255 3117 6874 5447 211 -7419 -7107 -4781 -2579
3522 -2579 3382 1828 782 2714 -886 7189 1892 -10021 -7203 -1893 -7982 -9649 -5666 -2098 1743
3507 1743 1481 1266 5011 4911 2992 2639 4570 4455 5209 1727 -697 -847 1914 3299 -44 528 2267
3490 2267 6832 3548 1420 -2546 -5613 -5139 -7112 -4904 646 -855 -1978 583 4436 7496 4863
3475 4863 2516 4562 1450 3630 5205 7224 10219 8647 5705 3532 928 -361 -2844 -8924 -11845
3460 -11845 -7895 -5153 8352 4677 -7003 -6007 -11447 -7250 -51 -4228 -7537 -4282 2777 1747
3446 1747 -4316 475 5034 5229 6881 3854 26 -1122 -1475 -3540 -7696 -7770 -6359 -8418 -9187 -5286
3430 -5286 -3432 -4361 -10935 -10219 -8277 -9319 -1752 -493 -1464 -352 -6703 -7560 -3585 -3313 -9332 -19978
3414 -19978 -13776 -11754 -10965 -13043 -7691 -3716 -5394 -4175 3091 7073 8396 7504 6195 3235 -2538
3399 -2538 2876 10785 8795 3847 9520 8722 2453 2603 120 -3752 -7447 -7708 -3353 1371 -1558 -5156
3383 -5156 -663 2674 -755 -4129 -7009 -8910 -10429 -8015 -11249 -16253 -9178 -852 6098 4072 6125
3368 6125 6035 -2173 -3015 -5577 -1381 3600 5847 11889 14987 8947 6557 2324 380 3318 -496 -4220
3352 -4220 -5645 -5391 -8870 -6346 -6921 -7032 -4385 1247 549 -7478 -7771 -5118 -5141 -7328 -5033 -4358 -6809
3335 -6809 -298 8496 9039 7696 10514 7413 9133 5618 5914 4427 816 -3818 1152 2125 2077 7110
3319 7110 8577 3306 2011 -141 -5337 -2150 2707 8290 15073 13883 12157 11836 11644 9231 4524
3304 4524 -742 1944 4976 8904 8768 7364 9057 5912 -5089 -8118 -6458 -497 -1956 -5257 -2279
3289 -2279 -1770 -762 -4327 -8618 -7847 -5022 -3452 -3148 -614 -7718 -8543 -10451 -6306 7414 8416 8810
3273 8810 5936 -631 -2286 -1860 5152 8105 4312 10070 9543 3707 -4019 -968 2407 6158 -2508
3258 -2508 -4133 -1758 -4514 -4969 -4188 -6245 -534 -6824 -3104 2319 7438 2074 -205 2024 6349
3243 6349 4715 3528 3025 1611 -1404 -4811 -6006 -1537 131 3699 5820 3759 3607 8256 8057 11208
3227 11208 7679 3958 2175 1561 5572 1998 -3281 3703 31 6831 11656 8959 7348 11872 9739
3212 9739 9876 14493 10711 -3177 -9566 -12213 -16886 -13513 -11885 -6913 -4511 -4307 -4089 -6946 -8177
3197 -8177 -5135 -1461 -3276 -7086 -9944 -18225 -20830 -17510 -10515 -4959 -3413 3607 2842 6273 8461
3182 8461 1427 -10249 -7311 3776 5115 -3461 -6000 -9023 -11650 -6247 -808 1394 1805 -249 2283
3167 2283 9 -4543 -2971 -2345 -1201 -3996 35 -3057 10 280 -1842 -1916 -3147 -2882 -523 2167
3151 2167 5620 11860 8107 2034 71 -110 2001 8 -714 -5141 -2427 -4135 -1184 1876 3646
3136 3646 4367 6146 -248 -10429 -7951 -7889 -1955 -2072 -1557 5459 6391 2107 6434 11841 7100 1573
3120 1573 -1409 -3966 -3183 4924 4027 3411 1787 5115 6652 7225 2415 4076 7149 2682 -3174 313
3104 313 2084 5527 -1632 -2768 4933 3643 1634 1202 617 -4343 -10800 -10665 -8441 -6332 -7586 -11058
3088 -11058 -15530 -13453 -16032 -12666 -2225 4008 -1752 -2659 2250 427 1845 4155 2794 1427 -1108
3073 -1108 -4101 -2355 546 10211 8545 -566 1254 1392 5001 4561 2041 4055 -5107 -7950 -3743
3058 -3743 -3398 -6276 -3972 -2672 2346 2507 3175 2752 -6136 -15651 -19846 -14915 -14719 -19918 -12287 -3472
3042 -3472 276 5488 7724 8303 6468 8284 4430 -1922 -1330 -8017 -9433 -7132 -4853 -8107 -6889
3027 -6889 -2077 -2174 -1108 -1970 616 3478 163 -9874 -10466 -10717 -11456 -2494 1285 179 5135 3478
3011 3478 254 3608 4614 -4391 -3914 -3048 -77 -4011 -2787 7705 12606 15180 11348 11068 13006
2996 13006 9674 1561 -4534 -3278 -5235 -6575 -11605 -8517 -464 3576 4996 642 1331 1626 4530
2981 4530 7328 5889 5738 3166 1369 3423 3451 -974 1679 2856 2771 2419 7070 3737 5161 7651
2965 7651 5668 3898 1131 2189 -2144 -4639 -4590 -8539 -9050 -4662 -1160 389 3867 9953 4719 972
2949 972 6544 37 1606 1424 6485 9422 4581 -574 -653 7455 6306 8400 4116 -116 2937 5948
2933 5948 7 -5537 -9799 -3370 -4467 -2811 -1650 1278 -587 3734 10206 15584 13738 11013 6994
2918 6994 3387 1816 -1300 668 -1332 -4214 -8759 -10155 -7187 3396 8772 4173 721 3207 6551
2903 6551 9175 10881 7639 10317 8019 516 -3324 -1977 -4861 -7030 2261 5980 7456 13421 11115
2888 11115 693 -3443 -2796 -6360 -9698 -10349 -3864 -237 8202 9299 6423 5355 5686 2188 -4314
2873 -4314 -4167 -3773 -2437 2942 5203 7623 3135 -4852 -1073 1035 -991 -4758 -6933 -4698 -3868 -4862
2857 -4862 -8507 -4146 405 1252 -1694 -681 -471 5248 534 -6974 -7013 -7753 -120 2301 -1216 2596
2841 2596 8727 5643 1270 1627 513 646 -386 -2683 -5412 -2508 -7428 -11169 -10904 -8880 -3435 251
2825 251 -314 -485 3590 6623 5332 -239 1634 -2582 -6015 -1545 347 -1520 -1488 -6617 -8945 -439
2809 -439 -226 -2495 -4216 -2944 -1457 1718 4292 -1811 -4383 -1807 1976 1740 4853 3946 -42 626
2793 626 -3334 -3026 0 -1201 -3188 -4919 -2691 4196 9544 8072 11959 9514 6304 3914 -513
2778 -513 -1255 -6593 -4964 2095 1077 -5099 -5681 -3119 1343 -702 -2853 -1193 -2803 -6896 -8239 -8199
2762 -8199 -754 2212 1487 -1261 278 -1500 638 7720 7731 -4489 -11693 -8447 -5367 -4783 -4512 -1764
2746 -1764 -5605 -7364 -6373 -4539 -1842 -2461 -3551 2243 2806 7716 9064 2854 573 -2927 -9452 -7687
2730 -7687 -11632 -13686 -10963 -11960 -12368 -8941 -7146 -4734 -3370 -7229 -1870 7178 10829 7783 4442
2715 4442 3319 5796 11127 9585 6307 616 405 -776 6845 13136 12175 11866 11021 10533 5122 3695
2699 3695 12314 22503 18820 10874 8070 4862 -1301 -2116 -4293 -6382 -3067 4942 4436 -386 -5888
2684 -5888 -10241 -11237 -7747 -4007 1079 3715 3881 1538 831 -5121 129 3943 6551 2411 -2131 -347
2668 -347 1670 7164 8286 471 -5483 -5745 -6438 -4951 44 -1919 -3598 -3250 -264 -869 1208 2980
2652 2980 1737 7688 14137 17316 19484 13487 12632 9830 -1305 -5879 -4443 61 7287 2889 -7889
2637 -7889 -1401 -610 1394 8852 9044 8000 4199 -38 2530 11196 8673 -157 1680 3472 315
2622 315 -435 -1758 -1101 -2938 461 957 -3042 2085 -4331 -8901 -3972 3055 8003 11625 7399 3843
2606 3843 9895 10371 15075 15053 14958 10019 1626 -2660 -2124 3939 8653 -118 -5992 -6892 -1171 2812 14133
2589 14133 13932 6638 -1369 1602 3441 3827 -751 -6289 -3976 3465 2004 6057 -1229 -5791 -12396
2574 -12396 -14048 -15747 -10860 -7571 -6127 -9284 -12971 -10089 2097 5885 5114 5409 -1544 -4431 -769
2559 -769 -146 253 -4417 -6394 2458 7636 -3967 -9862 -4213 -5549 -7230 -10319 -10422 -952 -1470 -2732
2543 -2732 -1282 5407 8410 7068 7354 -2324 -8486 -5548 -182 5017 10401 9499 9515 7240 3935 -3032
2527 -3032 -10336 -2825 -7283 -8896 -5253 2670 120 5157 3958 3636 4617 3231 -1528 1200 7774
2512 7774 13002 13690 8766 43 -2548 -4093 -1577 -2033 -2183 -1892 -708 6 4076 664 -3478 2486
2496 2486 7787 6213 2637 4543 10267 10464 7558 255 -472 550 -956 -99 -1542 -848 -23 2324
2480 2324 2623 -5976 -7486 -2723 1985 5481 4514 1291 -2989 -6966 -2882 -938 -4130 2125 6620
2465 6620 5770 6481 5471 3343 2062 -1295 -13 4576 3967 4854 5803 6924 2494 473 -2837 -71
2449 -71 -1822 -1140 -801 3516 3353 617 -6163 -5785 -6853 -545 7716 10901 3884 -220 -2219 -4807
2433 -4807 1485 5498 5023 6301 -665 -6098 -4220 4341 8324 1610 2295 5798 10756 10552 51
2418 51 -3392 -163 -470 -3550 -1347 -5189 -704 8259 9268 6329 371 2351 2023 6465 8305 2004
2402 2004 -365 -4940 -10120 -5653 -1288 -1843 -1083 1502 4702 5004 -1225 -6271 1522 14859 11145
2387 11145 4999 2864 142 2550 -490 -4483 -5131 -1981 -3062 -101 4223 3501 3215 -4806 -11105
2372 -11105 -7512 -10493 -8645 -5736 -10205 -7961 -4531 1030 1541 4918 6861 8117 459 -3730 -7482
2357 -7482 -4891 6507 5896 -4607 -8623 -5817 -1098 1266 2059 3879 2362 9140 9118 6617 745
2342 745 618 3172 4422 1654 -1533 -7631 -9372 -1784 -5843 -10596 -10798 -4965 -3117 -6132 -7004 -3790
2326 -3790 -2209 -7642 -17105 -15927 -10948 -6964 3236 -1505 -4505 1138 3424 3685 -708 -5390 -3853
2311 -3853 -2855 -3311 -4147 -1532 -1212 1017 -522 -3320 2749 5781 1381 -7680 -7185 -5867 -6719 -10328
2295 -10328 -7212 -7619 -6070 -7902 -3506 -2322 -10385 -11577 -8026 -3264 -3986 -4903 -11542 -7889 -5543
2280 -5543 -3886 -584 -1908 -2033 -6800 -11838 -7105 -7165 -601 4684 467 2716 7976 8863 4362 -311
2264 -311 -7059 -14415 -13957 -3463 456 3488 9014 11528 4888 -2518 -2350 -3002 -10433 -15048 -13305 -7969
2248 -7969 -2738 1075 4615 3595 -780 2301 5457 -1326 -8586 -4033 3406 3377 4415 4382 5507 8666
2232 8666 3697 -1454 -1179 4023 3096 -1438 -9542 -4807 5082 3296 3460 4145 7261 9263 9111 4759
2216 4759 8599 15617 14457 7494 7360 9838 6826 2769 -4512 -4869 1348 7045 3983 -200 560 4662
2200 4662 4515 674 -5819 -7410 -1627 5035 3568 -3013 -3156 -1526 -1340 -2179 3079 7167 2984 479
2184 479 -4195 -3714 -9019 -13235 -12551 -12360 -8634 -5700 -6450 -3609 -1878 4492 5978 5279 5639 5950 7606
2167 7606 3542 -1813 -5783 -3343 -59 -3110 -1954 2889 3396 3711 -1092 1605 3720 -4849 -7841
2152 -7841 -7524 -6294 -2224 620 259 -2107 -7562 -6839 -603 733 179 -73 -6471 -8599 -3786 786
2136 786 -3269 -7498 -5816 -2615 -2098 -4339 -2805 -634 -5484 -6034 -4323 -7005 -3436 -627 2846 5052
2120 5052 3921 598 -898 806 9913 12019 11780 10341 5278 -4791 930 1106 752 3175 3250 2351
2104 2351 8056 8087 962 -3869 -6431 -5714 3717 8046 10945 11692 4570 1317 -3378 -8135 -3749 5864
2088 5864 6829 8143 13632 13538 2587 -7658 -7895 -9245 -6944 4497 7566 3643 -249 -4278 -996
2073 -996 1004 9264 3038 1742 3783 3420 7516 3841 2433 5964 6170 -629 -1943 5192 7935 12971
2057 12971 17896 17855 12075 4802 7457 9025 4210 8117 5805 3494 2547 5005 4276 6315 9481 4094
2041 4094 -5762 -7229 -611 1724 1629 2234 7104 10575 6922 3561 -2034 -1280 674 2534 194 -2190
2025 -2190 -4874 -2233 -1572 4603 16373 12171 2474 -2060 5577 2061 926 -1927 -4353 -3472 -5781
2010 -5781 2583 9549 12214 12759 7325 -675 -2166 -3252 474 7346 5332 4057 173 1239 2701
1995 2701 4010 -1908 -8280 -4572 3127 13773 7495 2044 438 3584 8552 10051 5955 3023 -1015
1980 -1015 279 6342 7001 -614 -3889 -1277 -5375 -2858 -1305 -4722 2209 4364 275 -1017 669
1965 669 8338 3120 -7084 -6868 -6667 -7491 -5752 -6807 -6410 -2864 3796 1295 -6883 -2968 -2623 3492
1949 3492 16172 13039 4262 7184 7904 1240 4970 7733 8039 14891 15689 6445 -1477 -2515 2809
1934 2809 4326 4373 306 -3418 -965 7150 2699 323 -189 863 -2100 -2277 -297 -413 4393 10276
1918 10276 4970 -2238 -1492 -1363 -2559 -882 -7313 -14877 -10446 -4741 -2096 -2043 2200 7811 10772 11135
1902 11135 10185 4792 1988 1648 -8498 -5938 -1638 -2424 -3689 -3656 1918 918 10602 13815 14531 8887
1886 8887 4161 1350 -4292 949 1364 -2932 -5489 -2313 -8636 138 4897 7154 10142 5236 -634
1871 -634 3194 927 -1135 -1546 1482 4371 5078 -1501 -4061 -4156 -802 3657 -4780 -7320 -463 -3662
1855 -3662 -4303 4446 8654 8715 9375 7437 474 -4691 -6782 413 2328 5213 10198 6689 -770 -4199
1839 -4199 1454 4360 790 -5045 -7353 -2204 1376 -2707 201 2531 2669 2209 190 1383 -798
1824 -798 -5086 -4458 329 6594 3901 -721 -2624 -3395 -3911 -4325 851 7161 8800 3398 896 6010
1808 6010 12750 12361 11102 11372 4431 7311 12530 11745 6301 -860 4487 6762 10145 9190 4855 -3823
1792 -3823 -6698 -7795 -5156 -2180 -1556 -717 4433 1333 -2823 -8236 -7688 -4064 -6745 -6300 -4671 -596
1776 -596 3191 7263 5885 -914 -1720 -6290 -5440 -1877 -2509 -3209 -6556 -1877 3045 -6878 -7882 -7416
1760 -7416 -7290 -8572 -11544 -14839 -9745 122 -1587 -6005 -4747 -5159 -4363 -622 2335 1456 4058 6312
1744 6312 7327 5569 1516 -659 -647 6915 7855 2176 -3547 -4356 -3251 -894 -3850 -6572 -3296 -10153
1728 -10153 -11068 -8321 -6978 -7959 1650 3822 -2654 -10200 -6299 -5253 -3442 -345 4106 7725 3906
1713 3906 -2238 -3696 -297 5296 7120 6926 10259 10823 8960 13045 14808 10060 9231 5002 -431 -1740
1697 -1740 -5634 -10361 -8790 -5693 2871 6427 7002 -1494 -4003 -2693 -184 3657 6972 5455 -3305
1682 -3305 693 509 -540 3777 -2145 -7817 -2831 2024 -2236 -3590 8633 6725 3293 -163 2661
1667 2661 1865 -1445 -8148 -5430 -6885 -9059 -7230 -1229 139 -3217 -7137 -4038 -2201 -1950 -5639
1652 -5639 -7938 -5799 -6599 -7450 -2330 5599 8766 2633 1633 4246 3679 1455 1755 8871 5574 -1732
1636 -1732 672 67 -3365 -3661 -3317 3498 6813 4132 3213 4381 2786 -542 -4701 -4393 -916 -2658
1620 -2658 -3061 3797 6166 6386 2054 -3768 574 1430 4580 2077 1 3480 1827 -4972 -14123 -14073
1604 -14073 -9808 -4167 2306 2990 5870 4265 -1817 -5661 -2678 -4604 -12404 -10674 -9394 -5436 -4114
1589 -4114 -4397 -3971 -3362 -3775 -2311 6938 9744 10031 15937 14194 15077 10357 3947 2322 -2536 -8987
1573 -8987 -15126 -17774 -16221 -9687 -8980 -9096 -8887 -11654 -15228 -9022 -1867 874 158 7597 5884 5748
1557 5748 -646 -2540 -666 -555 -832 -3310 402 4202 4911 1536 1719 4128 5936 1127 2989 13299
1541 13299 12909 10367 13591 14298 3712 3031 7499 3448 87 -2524 -5259 -7101 -8355 -13954 -13750
1526 -13750 -11398 -9533 -6880 -5338 -4834 -4082 -5489 -4761 -6749 -2255 -1984 -8166 -4263 -8117 -9723 -558
1510 -558 -2462 -1490 -657 -7981 -8974 -7217 -1232 336 -2898 -2798 -5656 -10236 -5041 382 2281 39
1494 39 -524 3674 1129 -1224 -625 933 -1743 -387 -1569 5869 10529 8849 3980 -3210 2143 10115
1478 10115 16453 14657 12904 8160 2564 3692 7101 13425 13383 12285 13969 7338 3524 1601 680
1463 680 1514 -1637 -6065 -8103 -11995 -9941 -10385 -15138 -14261 -8076 -2023 -3857 1016 8519 1827 -378
1447 -378 862 3973 5454 9196 6200 1912 -1475 -4847 -2153 6599 9957 6697 4161 1348 1434 1958
1431 1958 1434 -683 1880 5340 4668 171 -4751 -6240 -4821 -5389 -234 7757 8653 7917 6939 3170
1415 3170 -4754 -10304 -13421 -13978 -18146 -11767 -5277 -5060 -4914 -5053 -6436 -810 4969 7844 5821 10323
1399 10323 10182 8804 3513 -5099 -1038 2643 2908 1636 2750 -1053 -4228 -5256 -2472 -2189 5304
1384 5304 4831 -1286 -3670 -7418 -12544 -10384 -2022 -1813 -1286 -8704 -10220 -6747 -4741 -6387 -2980 889
1368 889 872 6529 8155 8598 4402 -2442 -3371 1437 5825 6390 4034 1008 1698 -309 -113 -2366 5104
1351 5104 10438 4585 3633 10832 3751 -3968 671 2228 -41 -2383 -5351 -5688 -4549 -3817 1810 -807
1335 -807 1430 2118 -605 -1779 1050 162 -141 -4277 -5035 2719 122 -4887 -9708 -3923 -4491 -5653
1319 -5653 -1309 1791 -1190 4077 973 -1601 -3191 2042 5754 4356 -1788 955 4389 7508 2085
1304 2085 3445 4888 2754 1285 1040 -2244 -204 4385 2711 1371 -5218 4247 12510 6921 6392
1289 6392 10214 4791 3171 7268 6419 8156 12076 13181 5181 186 -6447 -14231 -8610 -526 5346
1274 5346 6571 4761 8507 5634 6279 4995 1468 -863 -8073 -1882 9872 14806 13921 8506 3478
1259 3478 1800 783 -689 -3316 -5181 -5949 -5986 -3187 -2081 -2050 -3536 279 6685 7606 5216 4480 38
1242 38 -6336 -6834 1290 14060 10162 7795 3709 -151 -6556 -4630 3 -974 -1925 -449 -2223 -4571
1226 -4571 -6811 -4830 -95 2921 982 7607 13902 15487 8354 771 -6447 -8803 -2667 -1543 -1398
1211 -1398 3565 8257 5799 6377 5872 5138 8457 2383 1018 1954 2935 -896 -3929 1882 3865 3421
1195 3421 5153 3378 -1879 997 1633 7849 11719 8722 3102 -3624 -3833 -2140 207 -839 3872
1180 3872 8159 4759 959 -4791 -5917 788 1243 -707 -6383 -2076 2409 4941 5022 7136 8424 617
1164 617 -5111 -2904 -4980 -3031 7531 8473 14035 13067 5503 6473 8977 9409 7537 6030 5964 4178
1148 4178 4839 6090 7994 5885 1915 769 0 -5708 -11562 -12066 -11048 -2971 5268 4505 -1870 -4567
1132 -4567 3876 9245 3583 -199 -5690 -5281 -2866 -3195 -3721 453 116 -2501 37 6100 6576 2667
1116 2667 4317 6302 6671 5767 4543 6688 9145 7967 2194 -459 8388 6817 1352 -3334 -445
1101 -445 -546 -4433 -7732 -8192 -6837 -2571 3324 5916 6585 -3652 -7714 -1922 2931 9361 9225 3535
1085 3535 -1556 5001 3622 -1995 -5118 1058 7570 6770 11251 7795 71 32 10896 11292 13506 13815
1069 13815 9174 4797 14430 12591 1269 4573 4694 624 776 5580 -2864 -7468 -9581 -7168 -1916
1054 -1916 5732 3954 8214 5754 -1013 6877 8467 6081 699 315 -722 -3543 -4080 2214 4947
1039 4947 5709 4293 -1931 -1908 1301 4650 -3074 -8582 -8606 -3046 -5375 -6504 538 -808 -297 48 -1072
1022 -1072 1452 -551 2740 3514 2147 6997 4315 2121 5643 15280 29257 28218 15071 10658 8774
1007 8774 2008 -673 -186 1821 2810 -2734 -1997 -1158 -2895 -665 3079 3077 -4936 -4591 3039 5721 -3492
990 -3492 -4959 -3054 -6332 -6599 768 8508 15742 14384 11320 11710 930 -7268 -8608 -2212 -839
975 -839 -6300 -2571 3270 -612 -422 930 5217 7030 5858 10200 5498 -489 -939 1779 2812 5398
959 5398 -4898 -7219 -3350 1386 -3724 -3771 -773 -78 1510 3694 6459 2633 1647 257 -86 757
943 757 3313 1514 2817 4891 535 701 814 1957 3174 2626 -353 3808 3400 -2910 -9834 -7707
927 -7707 -1670 1995 732 -6661 -7505 -7132 -1445 5211 10091 7978 7929 5240 2892 7165 6310 7049 12331
910 12331 7155 6397 7520 793 -315 4777 9270 8647 6046 5246 5706 2102 388 6835 6804 6783 6127
893 6127 6542 5817 4294 6213 -593 -4393 627 5040 6561 1657 2861 1480 -6658 -10325 -6070 -1118
877 -1118 -1107 -2303 -1642 -8847 -8988 -5423 722 170 -1804 -3737 -1575 -99 3116 2189 639 -2235 -7147
860 -7147 -3533 -4401 -812 -329 2976 5799 2963 5568 9420 2897 782 5855 4594 1416 2271 1911
844 1911 -1790 1418 4898 10898 12186 9896 4428 5519 4276 3997 12695 10307 14669 9452 6024
829 6024 5668 8947 -598 6063 12741 18356 16192 12793 9407 5014 10198 15033 10244 6277 5316 3646
813 3646 2709 8685 803 -1810 -290 -8045 -11362 -10807 -3679 -4604 -10435 -8402 -11257 -5855 -7971 -5418
797 -5418 -3090 -3947 -6427 -5216 3614 9932 7955 1144 2141 -1595 1294 6207 1951 -1093 -5783 -7856
781 -7856 -953 -1707 -3870 -242 2800 3958 818 -2432 1024 2153 3535 947 794 2541 6743 8477
765 8477 2002 -4121 396 2512 -1430 -4788 3140 5625 4925 9780 6813 928 -2417 -271 6102
750 6102 2280 2381 -1700 -2044 -4131 -7797 -2277 1192 -462 2598 2896 1201 -306 -49 -1685 4595
734 4595 9262 9035 2678 -1602 -10177 -10266 -6203 -2013 -7729 -8903 -3205 2115 3804 7072 10953 11276
718 11276 10326 9478 7106 2865 6360 8552 10491 14487 10593 2285 -480 5865 8718 7833 4115 -542
702 -542 -2228 -4777 -8872 -5351 -6407 -5305 -100 4545 5850 8901 2530 5864 2759 1249 3733
687 3733 8913 8626 -2995 -4424 -11186 -8329 289 6018 3127 -1230 -61 4381 6387 7307 3452
672 3452 1008 3191 9308 14401 11825 7622 4614 -186 542 3707 7908 7384 2277 4051 10627 13886
656 13886 8690 6345 140 -5630 -4423 266 3769 3041 4317 349 -5951 -12195 -9386 -8934 -14839
641 -14839 -9361 -83 4146 -443 -247 2794 7011 10156 7330 6364 11945 9980 2270 3741 5681
626 5681 4490 4165 5238 3739 854 -4428 -7334 -6841 -5384 -3419 1918 1983 -3536 -6238 -5652 -1560
610 -1560 -88 704 -7427 -5434 1613 4354 3729 4251 4324 -1010 -254 -3148 5728 7542 6520 -1006 -4931
593 -4931 -355 7191 9914 4961 3812 3612 -113 -4697 -3789 -3180 -4324 -2948 -980 1400 1674 2198
577 2198 4417 720 2424 4150 2284 3575 939 -7333 -6921 -1732 -634 -522 555 -1646 -824 6324
561 6324 7212 12568 17407 22409 18914 -534 -8295 -4543 -4710 -5552 -6081 -2645 -4350 -3154 -1289 -2547
545 -2547 -1516 5101 11582 12033 8123 10842 8663 11009 10971 1828 2761 4443 2462 2646 2918 4825 9261
528 9261 11557 10176 3929 2313 -384 4128 2265 3025 4626 2533 11978 10065 6260 2143 -2421
513 -2421 -1300 -5399 -5220 -612 -4699 -8729 -473 6935 10691 9920 3059 1371 1761 590 -2004 -4305
497 -4305 -7415 -3226 -3893 -4569 2298 601 -1522 4977 815 -8830 -6171 -2298 -2882 -4200 -3124 -1014
481 -1014 -2367 -4971 -3848 2666 -313 -3012 -4817 -3371 -4625 -5614 -12354 -11878 -13701 -9439 -1072 5624
465 5624 1353 3208 10551 8742 798 -343 -1406 -4220 -7912 -14447 -9801 -126 3581 3077 1619
450 1619 8892 6219 4435 7791 2199 546 1295 1389 354 415 2697 1334 4042 -333 -1888 -4970
434 -4970 -674 -656 -514 1808 900 1527 -110 701 551 -752 4027 -4632 -8891 -5063 1147 5137 2800
417 2800 2571 1272 5743 10365 10391 -1419 -5909 -212 1570 -2269 -3356 1173 6997 3171 412 1278
401 1278 3124 3310 4637 2127 936 1630 -3168 1912 8434 7866 458 1178 5414 4098 6486 6422 9599
384 9599 9783 9936 11080 8504 8130 11672 13621 15932 14216 10422 9730 14301 8620 4880 9547 11694
368 11694 8310 4614 8 -4379 713 2030 6527 7063 5208 6258 5622 2824 4174 457 2232
353 2232 -950 3687 2217 -2313 -1452 6205 13363 17391 11485 3266 -1210 629 4381 8309 9949
338 9949 10143 6331 4562 3474 5372 6955 5572 2895 1964 -1639 -166 -1798 7613 3852 319 5524
322 5524 6855 8071 10068 12832 12570 11860 8254 5574 5802 729 -2839 -2979 -3393 -4820 -2771 5602
306 5602 7588 5639 4612 9359 11501 6546 4980 9392 12489 1320 -1311 -170 7194 14408 14805
291 14805 7870 6788 4755 1914 3851 3906 5155 3407 1362 95 -3317 -2802 -1825 -4376 -2228 -1776
275 -1776 -4485 -2850 -4344 -7907 -7706 -3169 4467 10921 13840 12876 6212 1204 -1773 -1626 -8 3337
259 3337 6885 8706 6058 4565 4633 5031 -1344 -4711 -3845 -4540 -2685 3228 3878 5923 4161 4386 1907
242 1907 4177 4717 2285 2189 5410 8189 3092 1032 -1448 71 1338 287 -1769 -517 -8 2461
226 2461 4207 5114 9995 8296 9567 9170 9621 9040 11011 14019 12694 6906 4130 9897 4948 57
210 57 615 2601 5437 8370 6921 222 -835 856 -384 2920 3256 -193 -708 2044 3076 6695
194 6695 9982 4066 -2711 -5023 -2308 -49 -5519 -7101 -3375 1718 3221 1466 -1308 6859 11280
179 11280 11333 7093 2374 268 -618 2837 2902 1546 1134 -4450 -578 4443 5458 6043 3913 9460 10909
162 10909 9911 10762 11356 5839 4719 7732 7889 3461 -67 -2322 729 5222 1709 -934 -3486 833
146 833 1400 647 1087 3884 4027 4552 5035 7615 11021 10600 1687 -4552 -4626 -4541 574 2600 2573 3778 4413
127 4413 2329 2684 6000 4381 -3073 -550 -291 4480 2413 4558 4473 2668 276 298 -1778 -279 -791
110 -791 592 661 192 1866 3178 -565 -4486 -240 4527 -1685 -1332 -136 -3648 -2871 2509 2377 1357
93 1357 5356 9739 9622 4923 3538 3658 9459 17445 15172 7496 2189 2750 4405 5091 4505 10844 16397
76 16397 17383 14081 8146 4798 2609 1979 2072 3260 2018 3091 3699 2975 2281 1173 1864 6621 10025
59 10025 7333 8378 8110 5951 4166 3297 4328 4488 4008 3349 4081 6327 7118 6967 5194 5884 6456 4915
41 4915 6493 9811 9923 3652 304 760 -3484 -5992 -8730 506 6558 3878 1721 2454 267 -658
25 -658 -442 -347 5416 6690 8770 5783 4777 3036 1148 5350 9923 7712 4914 6774 6763 10743 13874
8 13874 7490 3241 4892 2867 2127 3629 6837 6996
0 6996
$$ Imaginary data points
##PAGE= N=2
##DATA TABLE= (X++(I..I)), XYDATA
32767 12313 15940 18814 18022 19339 22929 26852 25247 24782 21222 17767 17701 21760 28429 31095 29155
32752 29155 22468 17918 17943 22612 27924 25058 22905 24845 33472 37530 34055 29835 30807 29632 30793
32737 30793 29136 29138 29520 31783 31860 33978 38915 41710 40182 39859 34170 32269 34303 36491 41863 43222
32721 43222 40100 36833 37426 37520 35072 31235 30401 35063 36452 34962 35318 37634 37921 42428 40985 38171
32705 38171 35215 33274 31380 33750 36803 38485 37512 37348 34865 36159 39100 44566 47348 52292 52070
32690 52070 52440 50897 46479 47703 48116 42999 41635 45810 49795 53160 57502 59356 58123 55240 51080
32675 51080 48535 51685 53173 48417 50976 50225 51109 53334 50651 49144 50625 55817 57823 55666 54018
32660 54018 55936 54236 55981 56627 58514 57546 53689 49144 52052 56557 55717 57216 61263 62735 61772
32645 61772 59646 60769 61686 63210 61348 60120 56141 56219 55848 58996 56772 56404 60036 58354 58726 61379
32629 61379 58384 59875 63974 65148 68716 73369 75402 73036 71381 70489 67933 66045 66021 65770 62108
32614 62108 60467 62003 64671 67084 70059 72776 74289 75626 81289 81072 81757 82151 80521 78415 79608
32599 79608 80583 82693 80306 75479 69640 66910 70838 71975 68150 68330 72180 74913 80789 82848 82966
32584 82966 85694 83403 82283 85084 87660 85912 88329 85823 82083 81163 85353 86304 88565 85283 84023
32569 84023 84761 88565 87713 84374 86968 93047 93750 92079 89573 88803 90707 92105 95267 98569 99289 101131
32553 101131 97118 96949 97528 95770 93323 92022 91337 96534 97915 94706 94053 96645 99052 99696 99735 98703
32537 98703 97843 98725 93600 88448 88031 91052 93489 93865 91968 96949 97292 96928 100138 102347 103848 103577
32521 103577 104088 107954 106536 98063 95417 98499 101590 109247 111322 113241 116869 113007 106164 104655
32507 104655 105963 104586 101565 103190 103465 105821 110638 115143 116010 114460 115812 108940 101224 98908 98416
32492 98416 95970 97369 100693 100049 105744 111273 109712 107386 107969 106077 111153 109918 105442 101042 94788
32477 94788 97029 101293 108312 104731 100799 98971 102581 102497 105759 109776 113462 118201 111454 107708 111530
32462 111530 110935 111689 115008 118561 118131 116431 119985 119488 121210 122921 124050 123558 123464 121683 117176 115712
32446 115712 115616 116636 118849 114790 114138 113390 113142 116334 114788 110866 107196 105479 105870 102885 104633 108043
32430 108043 112978 115023 113983 116360 120094 121217 118297 116622 119844 120110 117776 118752 116752 119375 121907
32415 121907 124030 126617 131020 130943 125330 121889 116496 110869 112521 111247 108202 112991 112861 110234 112718
32400 112718 118868 121705 120200 121137 120567 110071 117226 120518 126603 124911 119387 120371 122776 128158 130793
32385 130793 126089 123908 118827 118802 117606 115562 113854 115012 121630 124203 119997 114806 105015 106694 106433
32370 106433 112153 114761 116480 119018 116779 120462 118356 120574 123623 125965 122840 129332 130312 118273
32356 118273 109979 112890 123172 127407 127953 125862 122614 119179 121632 126353 131698 129256 125157 125102 127533
32341 127533 132508 130196 130943 137745 140397 142004 138773 134682 130052 127955 129236 135011 137888 135531
32327 135531 134873 129343 131987 131206 131061 128501 127192 131099 138869 140518 141551 135379 138597 142327 150572
32312 150572 151113 144263 138627 136706 139353 138844 139791 138558 135998 134804 133352 133987 134206 139535 146727
32297 146727 146724 146745 145853 137399 127952 125269 125483 123874 124681 130905 135144 136179 133262 130539 125297 126726
32281 126726 125970 127395 128670 127698 132374 132524 133908 128520 126825 126439 128711 126649 130138 137517 139726
32266 139726 137246 136162 130185 128201 124988 127918 129925 133141 133524 136770 137831 131505 128107 128594 123987
32251 123987 131548 132210 129780 128228 128721 129057 127804 131425 139205 141469 136638 138167 138028 131337 131411 138380
32235 138380 146687 149369 146119 142979 141216 142038 135885 136454 136591 132532 131789 132928 130757 131717 135960
32220 135960 145130 146408 143957 144824 146299 143613 144834 146548 142123 139334 135517 138081 135764 131139
32206 131139 132625 132052 132818 139088 140289 134633 125252 119667 121771 130566 134465 135736 130806 140519 146209
32191 146209 140070 136565 136878 139958 130268 128898 133245 135532 140354 135043 130119 135466 133875 138949
32177 138949 138739 136375 130763 127781 124280 125221 130721 137031 138019 139135 137001 129229 134155 140166 143625
32162 143625 142569 140581 139110 137906 141050 141337 142035 136563 127505 125404 132295 138755 138738 136837 137629
32147 137629 140607 141909 136183 129635 133982 137547 134568 134774 146578 153883 154861 153891 144813 143104 138713
32132 138713 140975 145414 148213 145228 143397 144210 144248 143358 138788 134614 133065 137116 139522 142941 148380
32117 148380 145913 149572 148069 148208 144811 143130 144993 153983 147605 142772 138130 138773 141763 144313 140509
32102 140509 137062 137699 139993 141824 140839 144186 146987 148704 145168 146343 149339 147189 144381 142127 146092
32087 146092 150329 150717 148051 146823 148147 141469 143778 147349 149786 150294 142915 135775 134982 142677 144828
32072 144828 141843 142781 143469 140267 143570 143672 146483 146153 145939 143657 143793 146869 143141 136128 136593 136240
32056 136240 141296 142438 137732 140717 142150 140196 143220 144843 148277 147345 147263 151240 156768 150767 144988
32041 144988 139014 140957 143522 131646 127198 134015 141167 139083 139884 139232 146004 152355 154852 148187
32027 148187 141507 142984 142363 140864 144935 142557 137464 136952 135980 137858 141592 143424 147007 146430 138967
32012 138967 140869 139742 141963 144347 144632 144878 144750 137808 130625 130761 136211 147784 147173 144098 138013
31997 138013 131264 130289 135776 144226 142315 139239 138385 141714 134057 130714 130670 138192 134873 129373 132850
31982 132850 139444 136841 134832 138350 141868 142470 139369 137193 135476 133031 135876 135736 136589 147516 152557
31967 152557 148612 138059 139230 136302 135901 135690 139494 140967 147529 147281 139114 140521 139082 136785 141795
31952 141795 138713 140313 145842 142978 141573 135844 128515 135456 141993 142102 139607 139602 140013 141741 144683
31937 144683 144134 140861 137653 133157 137201 139421 144985 149954 143454 135050 134644 134442 143367 150728 150574
31922 150574 148138 141645 136555 137094 137615 141805 144015 146839 150045 153194 147949 139934 135354 131869 136371
31907 136371 139233 143766 149828 149699 145769 149634 153674 150114 147544 146827 143524 149481 156945 149631 144479
31892 144479 146397 146370 136534 134545 136214 141360 142070 140953 143143 156021 156029 148817 141480 138389 140778
31877 140778 146246 149987 148637 142219 137016 136341 132475 138790 142524 141933 146213 148372 149149 149677 149187
31862 149187 150402 156146 159922 154303 149324 141599 140423 147083 152492 150947 152881 153181 151531 143253
31848 143253 140397 135718 137902 134671 138251 137047 138981 148438 149637 141935 139125 142268 142147 141342 138256
31833 138256 130435 134612 136017 138970 135807 134164 136201 139437 145264 147498 141551 140307 137879 137780 135081
31818 135081 134661 142716 143329 143816 142691 141455 147802 150182 143993 137476 143472 149393 146961 142429 139859
31803 139859 148859 150566 140327 133390 140433 140448 143847 147011 148343 147870 148771 148667 146582 156317 159101
31788 159101 152814 148076 145226 142395 140940 140749 144799 142884 147085 147632 146823 149216 151983 151714 139233
31773 139233 134114 135793 144452 149297 148053 143211 146874 154834 149627 143433 140093 143796 143716 142612 144803
31758 144803 147864 149677 153428 144190 141960 149289 145920 149709 156376 152725 147905 146806 141101 138970
31744 138970 144343 153409 156926 149084 142946 142569 147694 143942 139588 136667 136420 137870 138256 140663 151213
31729 151213 153573 146380 139937 137107 140994 142735 142210 139842 141924 144173 144172 145655 142865 143813 144204 140827
31713 140827 145267 153734 152982 149417 147568 146717 142458 138421 135080 143602 146808 141361 137655 138275 143067
31698 143067 150512 155393 155009 155150 146284 143688 147976 142987 142888 150994 156288 155929 150640 150445 149275 145106
31682 145106 142861 143324 140779 141388 144571 139373 136190 130478 132830 134073 137679 143332 142829 142043 139273
31667 139273 135161 135582 140515 145302 146412 145039 141840 138409 136717 144755 147513 143496 135925 138199
31653 138199 150378 153080 151072 147263 142311 140811 143265 145238 150268 151759 149392 144985 141430 138630
31639 138630 135414 137854 137660 142587 142776 142148 137264 135155 140128 139099 140538 134728 133007 137702 139873
31624 139873 146163 148117 148520 146307 145331 145506 142921 138717 145227 144111 147503 146568 143533 147048 150076
31609 150076 151868 152807 145615 145607 139112 136636 140764 145797 150687 147345 137818 134695 139915 144492 143097
31594 143097 145153 142304 142172 149579 152348 149272 143558 141066 140799 142165 146453 146642 150591 153192 152757
31579 152757 149459 144868 144055 142925 140939 144965 148912 145024 144211 143713 146196 149460 156344 155125 151130
31564 151130 149706 148527 145613 142361 147796 147783 139516 142113 142785 137451 136394 135197 138144 140814 138725
31549 138725 138620 140503 132731 135559 143101 144911 138852 139569 145494 147367 143955 147118 145603 144067 141349
31534 141349 145130 144818 145931 148571 150976 151332 155904 149804 148421 152331 157303 159881 156090 154718 151039
31519 151039 153219 154571 155284 154922 154541 155354 153236 147136 143712 147115 144399 144096 145218 141960 141889 143424
31503 143424 135507 135856 135145 137120 143807 145617 145717 148410 151156 150617 149620 150212 155872 152955 145389 151451
31487 151451 158857 158518 156938 154168 145376 142004 148278 149025 142324 141210 144073 142069 140431 145117 152443
31472 152443 148274 144647 143893 147922 154176 145726 146697 148012 144483 146519 149710 149887 154128 150675 149601
31457 149601 153310 152923 149599 145898 144786 143220 134736 135040 131583 129345 132988 142294 142592 133681 138517
31442 138517 140997 134978 133726 135320 138451 143442 150866 147445 148398 142098 136330 134456 139880 147340
31428 147340 143961 141855 145988 155286 156760 146532 144341 151341 153433 151801 150391 158284 155109 147876
31414 147876 141251 143807 142666 143966 145000 145416 142492 140602 142088 143069 138358 138517 142901 146388 144333
31399 144333 146790 147182 143990 142765 149671 154626 152869 154678 151296 144940 137236 139708 144444 144863 137905
31384 137905 134753 132969 136427 137695 137841 150341 157436 152348 149420 150045 149312 145676 146033 141132 138063
31369 138063 148940 149801 145866 146127 151031 149857 142812 138371 139108 142224 146116 150123 150923 146615 139086
31354 139086 145945 142626 141828 141018 138511 136770 137967 138382 137510 131609 130386 131676 135342 137323 140683
31339 140683 148348 142082 140621 141836 141907 149385 150630 147360 148484 149141 150862 151624 143610 141503 144188
31324 144188 144903 146697 147974 145868 143078 148048 151920 147116 143300 145582 142720 138709 144441 144240 142351
31309 142351 139229 146657 150589 151497 153831 149504 145704 147561 150861 163381 163466 157504 155026 151002 148767
31294 148767 150198 146845 141660 144115 149340 147491 149942 145293 138788 139472 145065 144544 143053 136194 136078
31279 136078 135818 139994 148809 151294 152245 150782 143239 138791 136339 133665 137757 146998 145471 132286
31265 132286 132052 139115 143443 141034 140500 137731 140496 144614 146970 145494 145177 145055 143953 144301 145085 142510
31249 142510 140926 140332 143756 154412 156612 152034 144107 152353 157267 155477 157319 158023 147525 145372
31235 145372 145804 148676 151139 151970 153648 148177 136041 138957 141597 138459 138827 140259 141043 140544 137824
31220 137824 141879 144938 153599 157547 156655 153023 153107 151176 145267 150455 152541 148708 150070 144945 145420
31205 145420 143646 146432 150656 149434 148556 153853 153397 156676 153436 151284 147837 148625 151185 151952 151202
31190 151202 148672 149814 152904 156305 155262 155064 150932 148245 148091 147806 146667 145870 148573 147780 148572 152443
31174 152443 156596 151456 148905 150175 152698 151738 153179 156386 153532 148944 154148 155109 149188 149368 150185
31159 150185 155446 151923 144501 143582 151946 155447 146793 139458 141496 144770 139634 144305 142536 142492 153559
31144 153559 155108 149813 150817 147491 146037 145684 152303 156318 150225 143900 142960 141972 145334 146070 148065
31129 148065 147653 144997 142464 146724 150474 155756 160547 155702 152555 147531 147557 147201 144672 143880 143665 141993
31113 141993 144401 145285 142450 142108 138667 141615 143125 141292 142187 143964 146873 149408 151436 150513 147612
31098 147612 143680 136875 130218 129285 134889 141794 150638 152542 150565 157279 163592 162429 155375 150363
31084 150363 149223 153872 154298 153874 151759 147430 153284 145885 144774 145612 143539 143865 138558 136146 135753
31069 135753 137748 137482 132817 137867 136164 138085 147093 149802 142947 134049 134088 142004 147378 147743 156225
31054 156225 162132 156736 157701 156013 151759 146707 143686 141790 141765 143900 150524 152051 154821 156698 162898
31039 162898 156912 155080 159456 162879 156737 157604 153436 144099 146019 145751 141930 143201 145793 144417 149237
31024 149237 155201 153618 148870 145606 148009 151680 152144 152817 146643 147281 149298 154588 152511 150251 149782
31009 149782 150480 148778 145322 137811 143983 150251 152293 149151 149077 147827 141625 142402 146828 152488 150386
30994 150386 143864 139479 139687 148137 147750 148500 146380 150652 151080 146342 147231 149659 154412 155540 150327
30979 150327 153375 156930 156830 157428 154496 148668 146599 155416 157140 156071 158816 159189 153607 157645 153168
30964 153168 145833 147895 144917 144739 147010 145276 145191 147052 151600 150297 144295 141632 140893 148247 156188
30949 156188 148784 141577 137071 145948 149477 157006 155959 157944 156657 150528 148325 149921 154006 154113
30935 154113 152180 149398 150478 148647 148587 145188 143228 145301 154923 157408 151004 143741 146178 145592 142286
30920 142286 148943 147992 154772 162353 157511 150535 147853 148601 151236 149947 146539 150314 147636 143241 148977
30905 148977 154363 153174 149324 153530 155376 154824 151285 151777 158220 164101 163389 160366 156882 157046 157181
30890 157181 160622 153165 150705 151630 153771 153587 145623 141559 146369 151562 148531 143883 138499 138738 139618
30875 139618 139031 141058 136738 140689 143590 150276 155679 156902 160043 157482 157475 161735 159624 162851 165467
30860 165467 152534 147700 152710 155356 153548 154372 156232 155784 155009 148402 142441 142437 141038 143813 152667
30845 152667 158510 154106 146427 145060 148493 154261 155367 153792 147894 148497 154530 157930 152689 153406 149633
30830 149633 147292 152636 157369 160861 165969 162666 160891 161668 152775 147260 149441 149855 150075 152104 156423
30815 156423 153978 153679 153503 148365 149486 148329 139631 139853 144727 149884 153816 148065 147295 149385 154436
30800 154436 149597 140143 137472 136917 136141 143829 152365 156824 160623 160869 152628 148347 153201 154484 158582
30785 158582 159974 159290 157550 154674 150730 145805 147891 150972 151827 148984 142151 135290 137731 138960 140263
30770 140263 145006 149434 153441 149701 145869 149987 157650 160828 155814 152588 151502 147730 146399 150403
30756 150403 153964 153126 154457 156061 154227 148952 147772 145661 149876 155553 154251 148963 150736 151363 152374
30741 152374 153734 160390 159158 149460 141469 145347 150684 143325 143510 152022 151981 151250 158035 158916 152882
30726 152882 150987 150671 148944 150252 160665 165342 164324 163756 166205 170411 167516 157584 151217 148622
30712 148622 155287 161201 156239 154257 157602 155488 151496 153669 155682 151567 144009 137725 137764 143464 144681
30697 144681 148384 145848 151718 151045 143788 138210 139826 143918 143706 144676 148897 154343 162926 165914 163531
30682 163531 155044 150335 151572 148776 143734 144580 148147 149997 151804 155742 157724 154408 151428 154071
30668 154071 150331 151916 154459 148792 146213 153448 151427 151322 155747 154661 158113 156208 150240 147835
30654 147835 147986 152037 151590 147351 144201 145596 155701 157195 157167 158497 154307 149657 147287 152807 154117
30639 154117 154260 153142 148318 151290 157815 159855 151729 152353 154845 156257 150483 144851 150747 149963 151709
30624 151709 151456 154474 159748 156096 163379 165399 160137 153455 151139 144638 138101 142601 144380 149181
30610 149181 152436 148104 141782 149012 153321 153019 146542 137460 137738 139741 145467 148119 151068 154647 155773
30595 155773 154267 153443 157221 155091 151064 148476 145608 149124 148614 153227 153184 151298 153552 152151 150677
30580 150677 149528 148168 145779 148344 150441 151588 147919 150110 157176 150016 147511 149202 153778 155913
30566 155913 155058 159369 164481 160452 154977 151611 152700 155273 151983 154973 158157 156285 159798 156099
30552 156099 153231 150468 151815 151354 150206 145691 146375 144279 139816 142577 147952 154275 156334 153186 150134
30537 150134 149582 149231 149832 154485 158983 160108 154210 147858 149223 159472 158402 157173 160054 157912 162390
30522 162390 162989 160481 156614 154909 153715 154989 152108 149242 150187 157244 164919 170616 157436 147117
30508 147117 150396 152699 153156 156191 148617 141929 141991 148455 147512 153765 158920 156220 153372 154252 155503
30493 155503 156634 151016 146072 154490 155631 152228 150589 147183 150443 148734 149258 151625 153065 156712
30479 156712 156102 154330 153111 152535 150977 151691 151586 149484 144517 142589 146110 147235 146305 149247 151117
30464 151117 149189 146941 149916 153653 157899 159036 164815 171212 171633 168895 163430 156805 152153 150324
30450 150324 154209 156104 159421 161886 164495 159706 152944 148551 144417 138909 140225 141446 148488 152276
30436 152276 149126 141231 146591 150661 146626 142805 151215 163061 162310 163557 162218 158595 155644 161338
30422 161338 169152 167714 153039 149101 150388 157640 161370 156314 154367 155532 153529 148326 147473 143591
30408 143591 146098 144112 142179 137399 145066 148718 149261 145450 143765 148834 147010 149644 146836 147742 153678
30393 153678 154060 153573 155049 158924 160765 150470 154927 157654 155170 146930 143149 149106 156006 158031
30379 158031 162032 157732 154216 156957 160389 156818 157687 155638 160958 164171 159633 159200 161507 165116 167490
30364 167490 167277 173178 174336 163558 163378 165455 169090 171297 173178 167920 163854 163816 160222 153558 154311
30349 154311 154619 159814 161192 163439 163125 156238 153405 154907 157816 156068 153530 145418 148340 157320 165632
30334 165632 163925 152506 147658 148650 161490 169227 168947 161386 154594 155212 156277 160280 162101 161079
30320 161079 157075 156977 166071 163679 166773 165808 158075 150531 141491 144771 151600 154064 156188 153004 151326
30305 151326 159532 161932 162803 163127 159955 158635 157368 158693 153461 151239 152799 151334 148168 144241 149452
30290 149452 155446 152504 153170 154610 157407 159509 161451 155085 151357 150194 154089 171996 170920 162507
30276 162507 163644 160450 156859 155850 150781 157257 159325 156557 157940 158647 149642 144403 143076 147051
30262 147051 149975 151647 154805 152258 155292 159022 157403 156814 152148 152884 151282 152226 156979 155718 151828
30247 151828 152554 154132 157938 169722 162432 157168 161692 163673 156366 152850 152421 155979 154272 161821
30233 161821 165461 164394 163821 157749 157662 163845 163825 160369 158814 160014 159259 162161 165385 166893 165219 167869
30217 167869 165631 159576 156382 158852 161879 163890 156258 152081 150172 155314 157628 157447 158030 153517 152896
30202 152896 158348 162147 159236 155303 158940 158361 157635 159418 162763 161561 161595 161074 157390 160692 153914
30187 153914 151015 159573 161872 157712 153631 154371 155073 159340 160453 160023 158108 159599 158829 163013 163311
30172 163311 162495 157194 153165 158404 157217 159275 158380 159824 158575 155153 150142 153747 158216 154709 148648
30157 148648 155312 161081 155967 152474 154188 161953 166223 160249 155813 154068 156160 162374 160924 156378
30143 156378 156729 152371 151941 147463 152350 158404 153235 152856 149087 147059 148672 149018 149808 157750 159892
30128 159892 157542 146783 148066 149434 150930 156507 156816 157542 152435 159176 162632 161269 152679 155665
30114 155665 154713 142773 145409 155183 159863 159528 150091 146407 154491 155454 153678 154726 159028 155333 156577
30099 156577 152226 152466 159000 160058 154852 154430 158647 153739 151780 147058 144878 153859 163855 165623 160208
30084 160208 152337 147734 150905 153060 158277 158640 157331 153734 155665 158489 160578 157392 157545 165097 170060
30069 170060 167953 168031 168779 162724 160173 162044 159285 155407 149551 149647 152800 150202 151304 159857 163225
30054 163225 165887 159921 154546 156640 159889 155989 148038 142431 148771 154248 160083 160822 164639 163571
30040 163571 160660 160825 162192 160211 162196 163066 159259 159478 161581 159255 160762 161624 162111 157575 153365
30025 153365 152060 152349 149866 154447 157372 153690 153332 153545 154616 152894 154979 158538 161538 164890 166726
30010 166726 158742 153714 165478 171820 160958 160238 163238 161657 162910 169281 168745 168549 167365 164733
29996 164733 159366 155712 153592 160005 161452 164675 167390 163193 164585 159733 156491 155101 156868 150417
29982 150417 148463 154533 155147 157051 155399 155590 148007 145332 148863 155658 161625 153453 143786 144707 152198
29967 152198 153497 157080 155439 148536 148066 152699 152959 151705 152762 156729 161833 166594 174589 170930 163904
29952 163904 155619 155358 161353 156393 147573 147354 145913 146244 148674 148191 155327 153546 159868 167704 171610
29937 171610 169747 163327 161915 166164 167721 172326 165678 162700 166989 168897 162486 158926 161007 166823
29923 166823 169315 162956 160780 161970 159765 158348 158345 161964 155882 151569 151350 152840 161080 171290 170448
29908 170448 166051 169877 173036 170388 168293 163390 158910 160509 156433 155198 154953 157202 160165 156281
29894 156281 153296 151741 151603 158525 160244 158242 159974 158920 160010 156290 156667 156736 158530 156891 154932
29879 154932 153950 153384 154296 156564 157405 158921 162883 164771 164522 161504 155612 158154 158696 151010 147729 146911
29863 146911 149762 153855 155399 155753 154423 157802 163898 165603 157801 162268 167977 167669 167445 167839 163030
29848 163030 163882 164377 160077 162516 166157 167283 155654 149244 159117 160516 160861 159495 164707 158744 150726
29833 150726 156778 158177 160501 158885 159069 163754 162717 155852 151968 149263 157493 165541 162498 152697
29819 152697 150624 163020 168581 167512 163863 160772 158428 157344 155277 155357 159389 155432 148534 153968
29805 153968 160056 155248 151560 152570 151818 153876 154928 154761 155848 160965 162223 160250 161419 158740 155795
29790 155795 160331 161754 154814 152233 153788 153614 151610 159037 166553 168597 164980 163224 163896 168775 166908
29775 166908 163175 162745 157635 148878 152320 157510 164006 159759 155655 160575 167792 164997 159524 156169
29761 156169 159131 162393 163596 160632 158169 161014 161433 164547 164375 165649 165776 163757 164957 165061 163546
29746 163546 161516 156464 155595 161327 161011 167530 166156 166279 169806 165354 166615 165439 160701 158412 162157
$$ [...]
##END NTUPLES=NMR SPECTRUM
##END=
