##TITLE=Analysis number 315024
Compound Code cc 40801
Book Reference 397/96/1
Project Code adrs
Chemist Name brucer
##JCAMPDX= 6.0         $$ Bruker NMR JCAMP-DX V2.0
##DATA TYPE= NMR SPECTRUM
##DATA CLASS= NTUPLES
##ORIGIN= Bruker BioSpin GmbH
##OWNER= NMR
$$ XWIN-NMR		Version 3.5
$$ Thu Nov  3 11:46:25 2005 GMT Standard Time (UT+0h)  MAYBRIDGE\NMR@NMR_250MHZ
##.OBSERVE FREQUENCY= 250.131544655141
##.OBSERVE NUCLEUS= ^1H
##.ACQUISITION MODE= SIMULTANEOUS (DQD)
##.ACQUISITION SCHEME= undefined
##.AVERAGES= 16
##.DIGITISER RES= 18
##SPECTROMETER/DATA SYSTEM= dpx250
##.PULSE SEQUENCE= zg30
##.SOLVENT NAME= DMSO
##.SHIFT REFERENCE= (INTERNAL, DMSO, 0, 16.522)
##AUDIT TRAIL= $$ (NUMBER, WHEN, WHO, WHERE, WHAT)
$$ ##TITLE= Audit trail, XWIN-NMR		Version 3.5
$$ ##JCAMPDX= 5.01
$$ ##ORIGIN= Bruker BioSpin GmbH
$$ ##OWNER= NMR
$$ C:\u/data/dgb/nmr/ADRS/11870/pdata/1/auditp.txt
$$ ##AUDIT TRAIL=  $$ (NUMBER, WHEN, WHO, WHERE, WHAT)
(   1,<2005-11-03 11:45:24.53 +000>,<MAYBRIDGE\NMR>,<NMR_250MHZ>,
      <created by zg, POWCHK disabled, PULCHK disabled
       configuration hash MD5:
       62 19 C7 07 E1 42 D1 B7 37 6C 3D D0 77 39 F9 E6
       data hash MD5: 64K
       F3 39 DF 01 5A 79 48 94 E0 10 43 8F 73 10 47 33>)
(   2,<2005-11-03 11:45:51.46 +000>,<MAYBRIDGE\NMR>,<NMR_250MHZ>,
      <Start of raw data processing
       ef LB = 0.3 FT_mod = 6 PKNL = 1 SI = 32K 
       data hash MD5: 32K
       72 84 7B C3 E2 6F 75 64 3D 2C F6 8C AA FF E1 C3>)
(   3,<2005-11-03 11:45:56.61 +000>,<MAYBRIDGE\NMR>,<NMR_250MHZ>,
      <apk 
       data hash MD5: 32K
       33 8E 47 75 55 84 FA E2 90 3C F7 32 99 D7 37 34>)
(   4,<2005-11-03 11:45:58.60 +000>,<MAYBRIDGE\NMR>,<NMR_250MHZ>,
      <abs ABSG = 5 
       data hash MD5: 32K
       78 D2 59 96 5D 7E 73 E4 D2 D5 D0 63 92 FF E6 EC>)
$$ ##END=
$$ 
$$ hash MD5
$$ B3 5D 1A 38 D0 E2 F0 66 D3 CA 51 32 17 61 B7 BA
##$RELAX= 
##$RELAX= 
##$RELAX= 
##$RELAX= 
##$RELAX= 
##$RELAX= 
##$RELAX= 
$$ Bruker specific parameters
$$ --------------------------
##$DU= <C:\u>
##$EXPNO= 11870
##$NAME= <ADRS>
##$PROCNO= 1
##$TYPE= <nmr>
##$USER= <dgb>
##$AMP= (0..31)
100 100 100 100 100 100 100 100 100 100 100 100 100 100 100 100 100 100 
100 100 100 100 100 100 100 100 100 100 100 100 100 100 
##$AQSEQ= 0
##$AQ_mod= 3
##$AUNM= <au_zg>
##$AUTOPOS= <15 >
##$BF1= 250.13
##$BF2= 250.13
##$BF3= 250.13
##$BF4= 250.13
##$BF5= 500.13
##$BF6= 500.13
##$BF7= 500.13
##$BF8= 500.13
##$BYTORDA= 1
##$CFDGTYP= 0
##$CFRGTYP= 5
##$CHEMSTR= <none>
##$CNST= (0..31)
1 1 145 1 1 1 1 1 1 1 1 1 1 1 1 1 1 1 1 1 1 1 1 1 1 1 1 1 1 1 1 1 
##$CPDPRG= <>
##$CPDPRG1= <>
##$CPDPRG2= <>
##$CPDPRG3= <>
##$CPDPRG4= <mlev>
##$CPDPRG5= <mlev>
##$CPDPRG6= <mlev>
##$CPDPRG7= <mlev>
##$CPDPRG8= <mlev>
##$CPDPRGB= <>
##$CPDPRGT= <>
##$D= (0..31)
0 1 0 0 0 0 0 0 0 0.06 0 0 0 0 0 0 0.0002 0 0 0 0 0 0 0 0 0 0 0 0 0 0 
0 
##$DATE= 1131018322
##$DBL= (0..7)
120 120 120 120 120 120 120 120 
##$DBP= (0..7)
150 150 150 150 150 150 150 150 
##$DBP07= 0
##$DBPNAM0= <>
##$DBPNAM1= <>
$$ [...]
##$SUBNAM7= <"">
##$SUBNAM8= <"">
##$SUBNAM9= <"">
##$SW= 20.6930455092707
##$SWIBOX= (0..15)
0 0 3 0 0 0 0 0 0 0 0 0 0 0 0 0 
##$SW_h= 5175.983436853
##$TD= 65536
##$TD0= 1
##$TE= 295.16
##$TE2= 300
##$TE3= 300
##$TEG= 300
##$TL= (0..7)
0 120 120 120 120 120 120 120 
##$TP= (0..7)
150 150 150 150 150 150 150 150 
##$TP07= 0
##$TPNAME0= <>
##$TPNAME1= <>
##$TPNAME2= <>
##$TPNAME3= <>
##$TPNAME4= <>
##$TPNAME5= <>
##$TPNAME6= <>
##$TPNAME7= <>
##$TPOAL= (0..7)
0.5 0.5 0.5 0.5 0.5 0.5 0.5 0.5 
##$TPOFFS= (0..7)
0 0 0 0 0 0 0 0 
##$TUNHIN= 0
##$TUNHOUT= 0
##$TUNXOUT= 0
##$USERA1= <user>
##$USERA2= <user>
##$USERA3= <user>
##$USERA4= <user>
##$USERA5= <user>
##$V9= 5
##$VALIST= <valist>
##$VCLIST= <CCCCCCCCCCCCCCC>
##$VD= 0
##$VDLIST= <DDDDDDDDDDDDDDD>
##$VPLIST= <PPPPPPPPPPPPPPP>
##$VTLIST= <TTTTTTTTTTTTTTT>
##$WBST= 1024
##$WBSW= 4
##$XGAIN= (0..3)
0 0 0 0 
##$XL= 0
##$YL= 0
##$YMAX_a= 524088
##$YMIN_a= -416685
##$ZGOPTNS= <>
##$ZL1= 120
##$ZL2= 120
##$ZL3= 120
##$ZL4= 120
##$ABSF1= 16.522
##$ABSF2= -4.171173
##$ABSG= 5
##$ABSL= 3
##$ALPHA= 0
##$AQORDER= 0
##$ASSFAC= 0
##$ASSFACI= 0
##$ASSFACX= 0
##$ASSWID= 0
##$AUNMP= <proc_1d>
##$AZFE= 0.1
##$AZFW= 0.1
##$BCFW= 0
##$BC_mod= 0
##$BYTORDP= 0
##$COROFFS= 0
##$CY= 12.5
##$DATMOD= 1
##$DC= 0
##$DFILT= <>
##$DTYPP= 0
##$F1P= 14.0000005364418
##$F2P= -0.99999901652339
##$FCOR= 0.5
##$FTSIZE= 32768
##$FT_mod= 6
##$GAMMA= 0
##$GB= 0
##$INTBC= 1
##$INTSCL= 1
##$ISEN= 128
##$LB= 0.3
##$LEV0= 0
##$LPBIN= 0
##$MAXI= 10000
##$MC2= 0
##$MEAN= 0
##$ME_mod= 0
##$MI= 0
##$NCOEF= 0
##$NC_proc= -4
##$NLEV= 6
##$NOISF1= 0
##$NOISF2= 0
##$NSP= 0
##$NTH_PI= 0
##$NZP= 0
##$OFFSET= 16.522
##$PC= 1
##$PHC0= 61.93076
##$PHC1= 11.24902
##$PH_mod= 1
##$PKNL= yes
##$PPARMOD= 0
##$PSCAL= 4
##$PSIGN= 0
##$REVERSE= no
##$SF= 250.13
##$SI= 32768
##$SIGF1= 0
##$SIGF2= 0
##$SINO= 400
##$SIOLD= 32768
##$SREGLST= <1H.DMSO>
##$SSB= 0
##$STSI= 32768
##$STSR= 0
##$SW_p= 5175.98343685301
##$SYMM= 0
##$S_DEV= 0
##$TDeff= 65536
##$TDoff= 0
##$TI= <Analysis number 999999
Compound Code 99
Book Reference 9
Project Code 9>
##$TILT= no
##$TM1= 0
##$TM2= 0
##$TOPLEV= 0
##$USERP1= <user>
##$USERP2= <user>
##$USERP3= <user>
##$USERP4= <user>
##$USERP5= <user>
##$WDW= 1
##$XDIM= 32768
##$YMAX_p= 502752533
##$YMIN_p= -288949
$$ End of Bruker specific parameters
$$ ---------------------------------
##NTUPLES= NMR SPECTRUM
##VAR_NAME=  FREQUENCY,     SPECTRUM/REAL,   SPECTRUM/IMAG
##SYMBOL=    X,             R,               I
##VAR_TYPE=  INDEPENDENT,   DEPENDENT,       DEPENDENT
##VAR_FORM=  AFFN,          ASDF,            ASDF
##VAR_DIM=   32768,         32768,           32768
##UNITS=     HZ,            ARBITRARY UNITS, ARBITRARY UNITS
##FACTOR=    0.157963299565203, 1,           1
##FIRST=     4132.6476996994, 0,             0
##LAST=      -1043.33573715361, 0,           0
##MIN=       -1043.33573715361, -288949,     0
##MAX=       4132.6476996994, 502752533,     0
$$ Real data points
##PAGE= N=1
##DATA TABLE= (X++(R..R)), XYDATA
$$ [...]
22330 -29747 -37657 -7405 42233 53319 -8866 -27498 -15214 -26250 -6884 29311 43237 31866
22318 31866 58094 34331 44189 66716 17155 9973 -40934 -32926 17779 -3935 -49546 -87378
22306 -87378 -41548 19994 55991 9303 -16127 5292 -3159 -60505 -54275 21039 48542 52215
22294 52215 17562 13182 59727 73529 53757 76407 40985 4926 68128 76461 22895 36345
22282 36345 36775 48905 78289 31345 40268 47385 49835 46898 10641 -39895 -93448 -55962 -80318
22269 -80318 -111641 -49372 -4424 42297 22191 -44931 -43817 -24189 7584 56344 10522 7759
22257 7759 -36957 -22654 624 22748 -5147 -11830 57078 30424 -71062 9169 50393 54288
22245 54288 38279 8547 24115 48213 43732 43849 5385 -2679 1009 12283 -4566 -39144 -39810
22232 -39810 -95533 -79599 -22199 41058 19768 -4470 -5043 -46592 -70037 -9893 20551 -5335
22220 -5335 -14263 -29677 18465 -4270 -48817 -50117 -72006 -141208 -100280 -30346 -60496 -28634
22208 -28634 26477 51637 72184 15440 -1414 29788 4808 -14108 -20553 274 58444 98134
22196 98134 60139 36391 91380 73427 5291 -21093 -46320 -52178 -12836 -2842 47036 19906
22184 19906 -2542 15074 -60064 -105544 -76801 -62248 -98369 -49432 54171 82567 57284
22173 57284 -9194 -36493 -57281 -98254 -56865 2633 36397 23470 32347 34612 13221 -4258
22161 -4258 -248 3368 -23133 -953 15530 -19015 -88436 -122323 -95308 -60180 -46109 5903
22149 5903 56206 92238 75613 17573 -8553 7525 -10785 8097 -22818 -4203 37379 5785
22137 5785 19144 60103 23055 29599 21346 539 -4976 -7893 22158 17363 18825 54981 6508
22124 6508 -27139 24137 73796 62744 59004 -9474 -23766 -34453 -64558 -62687 -72419 -53584
22112 -53584 -51115 -64317 -23171 -22637 -7747 22401 32151 -11230 -87413 -39559 -11613 -13964 -22875
22099 -22875 10794 1045 -23979 -52627 -89826 -77655 -28480 18534 17304 3790 -31523 13499
22087 13499 13578 -36934 -44970 -59637 -32767 -1742 31053 4123 -11176 52627 72285 30230
22075 30230 19266 -28426 -21276 -47928 18385 81322 66596 108578 89701 93283 50584 45729
22063 45729 19116 15634 -13154 -1423 19938 23586 28407 -15879 -16104 1156 38822 32114 14807
22050 14807 -19830 -90410 -136280 -144320 -98524 -69287 -81485 -47157 -11825 -20334 -11745 22078
22038 22078 37548 23085 12717 40875 38876 33315 32760 37760 22710 4638 25774 35770 39850
22025 39850 -7308 -42010 13021 72724 64070 45672 97049 82317 -46827 -92540 -75350 -123318
22013 -123318 -67239 -14649 -3302 10376 -4734 -8398 1100 -26075 -14373 -3236 -30963 -75333
22001 -75333 -67141 -70919 -97863 -104803 -83465 -110057 -146771 -96126 -105983 -39418 10932 -10662
21989 -10662 -54292 -81368 -22086 16503 16731 41325 48706 42839 30241 26975 39505 7186 -27414
21976 -27414 -2641 -8592 -55032 -32164 -73425 -92361 -79887 -71574 -90484 -99104 -84606 -75859
21964 -75859 -33276 6107 9010 6617 22095 33145 51273 57164 35488 -13897 -55140 10426
21952 10426 46452 37894 -266 16774 4700 89806 56381 25368 26269 -14800 -1987 -6356
21940 -6356 -90359 -102925 -49198 -44842 -25159 -31211 3364 77571 70162 50563 -29183 -90957
21928 -90957 -56290 -3559 39960 30705 36137 95640 89357 9637 -50219 -30025 -39447 -22776
21916 -22776 2862 7649 -27953 -13868 -30228 -7822 52519 23424 -25427 -33905 -184 37607
21904 37607 44186 29502 27753 83443 55559 -27650 -32482 -28741 -47208 -55520 -75479 -126827 -112064
21891 -112064 -53090 -17126 -27474 -31495 -45971 -41604 -49750 -22822 -21698 -37307 -80028 -57375
21879 -57375 -11254 40734 24240 9645 46884 61206 38283 49407 56083 44599 10753 33440
21867 33440 28634 68943 82319 54186 81259 -10742 2139 17287 20739 14605 7897 23149
21855 23149 61170 29799 -35817 -1645 14302 -4967 -1240 61177 70893 16775 40100 60984
21843 60984 42235 18468 -14042 2829 29595 76746 57415 -23973 -74572 -22724 15323 84076
21831 84076 99602 68385 17051 -36501 -60055 -62501 -27795 11882 -7209 10504 24216 24902
21819 24902 -17488 -50691 -21797 34256 38290 14897 45616 77584 52550 75175 65968 25077
21807 25077 -2202 23225 16589 -57925 -34653 -27950 -33586 -55243 -40064 -28645 -35656 1371
21795 1371 4023 -24104 8670 323 36379 72271 76404 59074 17524 -43681 -68134 -108828
21783 -108828 -35424 -11696 -18348 -18573 45651 69938 -1780 -17802 -4587 -10693 19448 20755
21771 20755 17285 12220 45829 87528 16207 -23596 37836 51997 43584 53558 96530 74279
21759 74279 29791 -17277 -29970 10232 92847 62375 -50399 -83142 -82986 -39873 -16931 -14843
21747 -14843 32819 32395 11450 89261 133578 130542 61656 -16608 -41979 -26778 58723 70611
21735 70611 40824 -7528 -6183 6311 -9634 -20257 -30146 -49092 -66881 -36899 -25491 -52555
21723 -52555 -22062 -2790 -53198 -82404 -128123 -135553 5251 24890 -32612 -11833 4734 35071
21711 35071 69613 53701 44727 35160 57485 88275 101826 92309 45180 13103 -660 -5377
21699 -5377 -6186 -57744 -175949 -144412 -103918 -48600 -26348 -43246 -46081 -66600 -53303 -36225
21687 -36225 -42869 -151938 -118656 -77295 -58056 -68888 -35020 -11169 59238 41336 19693 38474
21675 38474 51209 64931 72854 21688 -70640 -74822 -34104 15872 76801 77045 87883 54737
21663 54737 55476 97130 134422 89956 7708 -29792 -10877 14483 5829 -4329 1608 34456
21651 34456 55200 80872 113047 145640 103928 53453 40403 -11222 -17610 911 60821 53156
21639 53156 39476 13555 -33300 -8275 31075 37650 35035 77524 60382 44510 65530 35204
21627 35204 28228 15873 -31529 -57781 5219 77934 56458 -554 -30464 -37164 29463 86942
21615 86942 108582 185185 144095 146620 138939 79845 69037 -18244 -81073 -114272 -111440 -77163
21603 -77163 -29598 6376 8578 -37026 -59771 -63060 -61436 -58263 -4023 -36483 -81626 -28779
21591 -28779 20969 20439 101479 82814 55527 55025 17043 10576 72720 79149 65620 77101 116805
21578 116805 128750 46908 9409 -21977 -19134 -55336 -49153 -28079 17602 32453 -11623 8505
21566 8505 32824 17911 46144 -8590 -27059 -48743 -50370 -26790 712 35010 99190 85011
21554 85011 26280 49194 120227 142281 92511 6918 8449 21511 -15253 -28983 -10630 -5422
21542 -5422 63350 54083 59993 134643 139451 83164 34307 15499 -10736 -42516 28067 63993
21530 63993 39293 55535 56476 14103 37834 19726 16881 7215 -10981 -43648 -50607 -84302 -54356
21517 -54356 -4666 -54601 -75055 -51500 -59427 -73653 -90884 -139634 -137973 -97740 -78830 -65609
21505 -65609 -61671 -51188 -72527 -25339 32883 -26995 11254 -28902 -68105 -54551 -17154 44805
21493 44805 44568 90813 124381 134451 139937 107840 19372 -58717 -71599 -71969 -17290 40911 72177
21480 72177 100026 85657 50410 15560 70899 153862 119514 53107 26895 33087 61233 33550
21468 33550 37609 36522 -14305 -19529 -25711 15465 23599 37724 10154 -1767 25003 57673 17811
21455 17811 -47692 -37340 -61649 -44492 -42760 -71206 -40567 9418 3500 -30477 -39023 1573
21443 1573 33954 58077 24404 3264 -18031 -6710 -15682 18291 29006 47225 63872 -12626
21431 -12626 -21523 -42305 -52683 -72473 -59994 -33803 -17462 -19005 -72843 -85377 -65401 -34781
21419 -34781 -32759 -3968 16133 4329 -55045 -61757 11373 88865 52018 26141 4591 -8789
21407 -8789 8553 13506 15727 46325 6822 -58397 -67823 -92606 -71538 -85673 -132936 -91316
21395 -91316 -44412 -61139 -47920 16232 64300 80768 109563 96787 48872 37490 -15480 -10032
21383 -10032 33643 -22301 -24886 25816 43304 -9239 -6748 -48902 -45164 -21458 8065 40354
21371 40354 37852 48582 56514 25290 47700 65519 102403 129359 104785 63407 24181 22358
21359 22358 9951 18360 94854 57230 22424 30242 21208 8907 -16549 -23756 43006 63876
21347 63876 14464 -48410 -102880 -99794 -36463 -36635 -35978 -3210 19482 11356 25372 19217 26082
21334 26082 38066 38989 76342 76277 90934 74971 43513 37656 9960 5613 25245 47497 -24329
21321 -24329 -4649 37815 -9769 -22565 -29850 -32731 -39706 -35820 -41613 -80402 -34193 -45483 1822
21308 1822 15965 -30574 7600 66799 86830 103213 96023 109128 104923 38373 5208 -63591
21296 -63591 -90501 -109592 -50212 -52881 -34515 -10214 73790 85691 49403 14213 9481 65511
21284 65511 102670 27693 -12594 -3965 -5908 -38889 -23781 -71442 -10774 8437 -18728 13342
21272 13342 -2223 -6783 4706 11027 19156 11301 -14832 -11058 -63457 -40330 -17481 -46866 -93912
21259 -93912 -80789 -75141 -69714 -79609 -91176 -53119 -15029 -23777 -74293 -74439 -26561 29304 36692
21246 36692 10377 -4237 20412 70197 65227 54993 27397 13226 18035 19128 -6541 -11602
21234 -11602 -2040 -7141 -8933 36095 68893 54983 54365 29168 -32914 -24699 46636 135150 119932
21221 119932 64213 80222 106070 106495 38443 -28743 -36235 -82572 -67149 -47148 -72703 -19947
21209 -19947 13706 -17707 -6971 -33659 -34237 5646 22255 -57572 -67259 -55206 -52542 -64046
21197 -64046 -86225 -94491 1309 51641 29747 -17738 -54564 -77514 -111687 -116650 -74834 -49967
21185 -49967 -12336 44170 101561 105203 86525 47373 81763 109657 102235 60187 49141 32393
21173 32393 27439 54692 -25884 -67546 -58621 -39815 -3481 23374 45236 30587 59129 -5667
21161 -5667 -82829 14011 -17252 -16421 12220 5557 16264 -21540 -7266 -12025 -35087 -70734 -47358
21148 -47358 -163 56922 70550 75438 97192 83351 128333 111992 11222 -31008 1491 58830
21136 58830 82412 81221 64807 11679 -35750 -49064 -45108 2938 19059 -35 -2377 -16672
21124 -16672 -12097 -5519 19154 36695 -3634 43075 34331 50296 40250 24131 65967 84498
21112 84498 84701 21672 23230 74576 69742 58775 41306 46333 18712 -20464 18443 40556 30579
21099 30579 59747 36122 59055 17961 12699 43063 -15856 -71981 -31223 51611 62248 23382
21087 23382 -3259 45835 44864 31753 -28870 14041 26550 35097 22946 -19593 26946 82252
21075 82252 34147 13975 36532 47066 60625 83070 84589 103712 139364 139997 129287 39358
21063 39358 46931 73949 80332 54933 37690 11972 51915 55421 35184 51455 77851 102416
21051 102416 112058 201074 157242 111770 50470 67069 106469 51523 -13738 -51327 22633 25839
21039 25839 9290 -4844 -40930 -33829 -20939 -21790 -29228 -43501 10234 14239 30428 40068 3199
21026 3199 7155 -17943 512 -21722 -96512 -32453 52492 69894 39486 46674 88914 144857
21014 144857 143029 88483 69892 34037 -12924 -31243 -29127 -49522 -58268 -64331 15998 59719
21002 59719 97893 87297 83877 73787 112671 115003 96646 104332 77194 22750 30815 4146
20990 4146 9355 16930 -3302 -1435 -19115 -9388 21484 46008 68890 35040 91098 74220 61476
20977 61476 34691 15050 40012 50278 54423 85251 80225 62840 49340 -19116 -16014 12865
20965 12865 -10830 13624 27308 -1758 -8416 17066 -8212 -47165 -77624 -14567 10858 7221
20953 7221 2972 43434 64057 62809 93847 48482 80653 58284 -3358 34873 12908 -63724
20941 -63724 -54630 -3065 15824 67348 143209 154771 92684 72063 71470 50955 52660 122693
20929 122693 132767 134635 99994 37496 -10333 -18920 -51419 -72910 -25030 37311 20919 3786
20917 3786 -42369 -17162 47208 76392 120070 202128 172845 70761 -23310 5669 13081 1840
20905 1840 40297 82416 77882 61952 61985 99958 58192 -7268 -19030 -1717 60209 100023 47378
20892 47378 28672 -633 8902 22837 32608 15569 53590 55478 55435 62397 -18187 -62557 -19835
20879 -19835 -27081 -54117 -54136 -28962 -47149 -74374 -119425 -88618 -73901 -47317 4535 11355 16904
20866 16904 9571 -10868 -7544 -42965 -65522 -79385 -42202 -1975 -475 -15453 -32818 -31030
20854 -31030 13695 -28355 -36235 27820 40333 47263 43761 76764 73233 95156 61597 77184
20842 77184 82978 -28961 -36047 -6037 53317 77698 41395 33667 22742 -32051 -58396 -35890
20830 -35890 17389 66428 71362 58146 -24258 -47411 -25780 14487 -58911 -79197 -19890 -3608
20818 -3608 -26384 -14455 39433 -1741 -27442 28498 71203 56841 23500 29276 56111 17679
20806 17679 26907 39324 21872 26095 39676 42010 21879 -5097 40989 67349 25838 -30581
20794 -30581 -48005 -13555 71825 119212 83329 59408 -1798 -16797 25772 59301 64303 97037
20782 97037 90978 65997 51353 -6864 -50127 -82701 -110994 -69887 -19719 -5491 14204 79685
20770 79685 71601 58987 1015 -5373 -5939 896 -29896 -38353 -26793 -32910 -29777 1291 92158
20757 92158 120394 57751 30690 18305 4139 -29367 -26962 31866 57815 42717 24845 14375
20745 14375 29903 27691 -35231 13684 72300 54943 95778 100105 65447 55540 72953 53667
20733 53667 4503 14629 -999 -17227 -28162 26022 119462 138486 102958 89063 76441 55631
20721 55631 -223 -5473 40965 62549 72548 81476 81967 120893 110197 64964 75416 44699 22221
20708 22221 968 64451 81912 76993 114910 87760 79371 79127 48770 -8092 -46087 -24556
20696 -24556 49441 88979 39951 -17992 32609 54902 -31327 -33400 -11941 6232 89523 88928
20684 88928 16099 -49433 -21227 551 34044 32346 -13452 -40996 7154 43580 66641 75048
20672 75048 131133 144979 72185 80882 135162 92111 44990 45521 46763 11733 16584 58571 83349
20659 83349 46488 20198 12570 8403 -11760 -24614 -12288 -14573 -6229 22775 56027 79544
20647 79544 98461 66885 42686 9083 12043 -39133 -42544 -84903 -75045 -30072 -12290 36995
20635 36995 16340 5945 18890 51566 29477 -41853 -59881 -74707 -80004 -10326 85331 69942
20623 69942 31823 38301 51072 74068 72441 71506 103307 161006 121306 27757 -24436 -49141
20611 -49141 -68860 -23307 17511 19465 -10069 -58609 -60119 -71086 -69814 -8860 -37165 5586
20599 5586 25144 16017 -17935 -38378 -57891 -126218 -180853 -114298 -26485 21139 43911 25460
20587 25460 -23701 -43153 -64562 -45826 3477 83858 170185 132424 54324 -12527 -50408 -44039
20575 -44039 -7040 52704 63459 62485 26956 6205 9913 11954 -8912 -3757 -3299 -529 20930
20562 20930 72251 96521 118197 78785 84179 69298 83313 64613 22381 35331 -28926 -71253
20550 -71253 -39408 -8146 38030 28568 23305 79057 98020 73397 53001 55715 57376 112080
20538 112080 115042 65539 -18699 -51755 -20316 19555 68409 102953 94119 106620 61752 30514
20526 30514 60267 45353 -10308 -38528 -17851 46248 70197 73257 68808 55515 73558 81876
20514 81876 58503 60511 43960 29905 51796 55558 15235 26214 75701 147700 165501 66885
20502 66885 98422 73107 -19742 51696 49888 20996 44745 86450 114188 46690 -14809 32343
20490 32343 55223 35925 46404 68387 67117 -434 -33672 -27128 -25985 -31456 -9828 64527
20478 64527 126167 101065 96704 79753 43784 -3228 -25569 -55013 -40649 -13436 38436 33734
20466 33734 29898 102493 91475 3750 2696 31192 65784 87574 41658 30756 52382 66222
20454 66222 64280 47453 42180 78830 83458 99819 42885 -25678 -13118 10353 34621 72316
20442 72316 77100 117598 173074 196649 142208 47761 23933 20175 -41614 -34904 -15292 71928
20430 71928 112894 93699 16609 -6200 20049 24139 59963 66172 70717 84368 104146 159409
20418 159409 144695 110801 46889 10160 22437 8741 15589 24770 9072 26690 4248 -84
20406 -84 7120 16840 105640 104814 56415 60415 31983 1460 36275 75551 68767 87767 121401
20393 121401 179561 210793 175891 121294 129728 80263 83860 -22523 -88200 -54764 7395 51769
20381 51769 18336 -5913 29373 59925 83242 119528 77192 58840 131775 142716 122926 45359
20369 45359 4001 82501 145114 151197 156485 192808 263300 328470 509734 693990 794114
20358 794114 743749 592255 491456 321217 186277 156797 106062 22364 30027 86954 112748
20347 112748 108740 46743 57713 82108 70149 77024 128572 104615 60798 45166 71400 45092
20335 45092 -5380 -6120 39471 42913 69919 122107 104315 89756 83432 101842 111832 163602 145079
20322 145079 100627 134588 130340 114930 54883 -24950 -67153 -26524 55456 99355 128164 166310
20310 166310 50114 39189 56042 34984 -2695 -44607 -76592 -57258 12893 69730 56073
20299 56073 70799 62147 76193 61172 93104 161223 185716 187419 205593 190565 160697 146655
20287 146655 115335 113727 154272 115222 64229 56212 27986 -600 -8798 -28912 -37667 -6980
20275 -6980 66959 67875 96030 85342 38511 18683 4144 21955 -8575 -34396 -10865 -28100
20263 -28100 -65948 -79622 -51079 17182 64404 45918 39237 75878 86906 78093 117276 116360
20251 116360 99645 96039 32524 28441 49949 64031 95314 105226 129395 109015 118467 46444
20239 46444 -18590 21920 71251 99900 127601 130612 105915 110757 106046 106712 94774 83434 23288
20226 23288 20793 6531 15584 12798 47511 110356 126602 142368 111690 82316 76520 117391
20214 117391 104750 79264 66327 99094 136069 110423 136914 125009 76485 53543 94519
20203 94519 93745 20024 2819 -46379 -49745 -62563 21519 88809 69133 30755 63923 109209
20191 109209 142093 119610 129018 131248 44256 -21940 -10264 4942 32095 60759 118295 117015
20179 117015 86267 55466 99579 165877 185216 80959 43145 37903 44821 57390 71698 42128
20167 42128 13708 29728 35781 32758 72178 35563 22691 34148 28280 68992 78872 40649
20155 40649 48271 110403 151579 143625 132282 19344 -18024 -23351 37532 71721 110820 115202
20143 115202 150946 167367 143681 113840 31218 14058 10502 25839 13388 5061 50649 98620
20131 98620 164322 89592 31918 13652 16779 19466 10935 19847 21206 -9740 -24377 -2207 50868
20118 50868 131056 100209 112944 73748 34891 107560 135003 91746 98200 87851 94827 86944
20106 86944 60521 3129 7317 32926 65782 24267 37603 100626 75470 72153 17234 -12043
20094 -12043 63847 34157 -18294 -9963 -9301 2697 39921 22450 44950 64335 40705 45366
20082 45366 78209 88853 98316 90700 117632 84358 36827 31753 17618 14447 26127 24344 20161
20069 20161 -28386 -16767 73461 125442 28385 -13221 -2302 -12455 22935 71468 59855 25126
20057 25126 10073 38039 6311 15040 24949 27665 79428 31808 58093 73718 122271 137819
20045 137819 151883 107503 72378 136900 147803 125766 155159 156012 137950 128003 180122 176348
20033 176348 86670 15973 29472 20263 29942 27432 83613 67573 34667 104506 140955 152971
20021 152971 164659 164383 121925 102345 37051 82754 83063 103058 112192 63197 33671 24719 -19703
20008 -19703 2207 72626 66862 21964 26660 -12785 25455 75519 102692 82770 99937 70441
19996 70441 4990 88054 134032 103130 58322 18615 -22611 17057 48433 29492 96572 96770
19984 96770 147228 212874 125006 60846 70709 99922 72903 83617 85156 -43645 -93865 -27532
19972 -27532 42631 83669 22284 -4232 15820 67091 115080 151048 122313 99004 86746 121199
19960 121199 142826 94859 21190 50294 73452 78510 97512 88699 80224 14750 12837 102918
19948 102918 127143 125967 133942 164991 183048 132204 70494 55286 81505 63685 25027 104054
19936 104054 179516 222706 189051 130201 33214 21475 71508 101105 102204 166657 137554 63138
19924 63138 14174 -4238 23568 41987 80870 66738 20399 7699 3960 53702 109887 129532
19912 129532 96204 71136 56382 2797 -9560 -17300 7028 41315 37006 31120 57127 20822
19900 20822 -32145 16453 49846 95594 106320 81311 54082 43822 21495 43535 84112 67526
19888 67526 29019 46919 38612 59677 85046 68676 8966 5049 41720 44881 41278 13372
19876 13372 676 -7809 34203 28093 -16239 -25546 -56822 -62965 31134 62356 70232 85489 112778
19863 112778 89276 91341 156654 166330 139559 129303 91838 14512 28912 85902 85187 53186
19851 53186 119345 99371 103662 93397 79842 31509 15528 16931 57282 115215 102209 82658
19839 82658 47219 29650 93172 118020 151413 130867 143701 64042 2032 25887 70457 74493
19827 74493 49438 19048 2678 58746 101070 107297 34537 9164 32021 72087 78164 47055
19815 47055 75554 179137 192830 203561 177753 155471 126735 114788 162547 141661 114677
19804 114677 148928 140608 134000 94902 -28227 -43217 10766 80289 122275 162973 127091 125937
19792 125937 85607 30758 20622 81915 44742 26826 55919 84340 108711 120780 143160
19781 143160 231318 231270 207296 150736 111191 79604 125526 211498 248127 239704 211183 246285
19769 246285 274160 267104 243805 286001 445640 587321 727000 842389 960299 1042512 1109120
19758 1109120 1134746 1242567 1365315 1373431 1336738 1304393 1214804 1131368 1046185 1002917 837373
19747 837373 653798 532545 445581 366531 323218 261897 264764 244926 216205 164030 203109
19736 203109 216865 177709 189854 259702 203460 152738 111554 126234 136324 131372 192784 193867
19724 193867 240117 265479 283122 220850 189361 184814 172801 165361 190858 192841 186353 154321
19712 154321 128217 86372 146528 200546 170532 127717 129837 183597 185674 189036 174579 164571
19700 164571 178843 168358 181489 147305 129920 153993 180926 154763 103555 97924 158789 145410
19688 145410 107684 71244 73566 67543 67649 72021 82948 40615 69199 87872 88330 104485 148400
19675 148400 105327 80814 51753 82711 32661 100549 146392 98102 79140 69247 43196 95506
19663 95506 125219 176612 143757 119608 105958 76312 74755 139462 185051 165578 106563 62415
19651 62415 86322 144004 155035 104667 97837 128192 104918 68116 169077 186547 148428 156842
19639 156842 121076 57669 4328 31408 72601 103881 134146 159959 135799 113866 115918 126643
19627 126643 110735 158487 160509 147234 185923 216307 158140 73711 38612 37013 70733 72452
19615 72452 37486 61513 54251 47546 108115 176366 154385 124364 117674 165095 174331 165243 128917
19602 128917 116605 185452 208467 187925 182168 128359 36437 63249 131759 199153 186303 177076
19590 177076 127290 134253 62109 32165 33122 49137 83119 139142 148718 89214 61303 85127
19578 85127 110579 102353 71911 7081 817 -20424 14165 36500 14468 58381 79964 132241
19566 132241 121786 84076 97452 77548 60091 173087 257826 224595 208499 192530 175296
19555 175296 164975 153670 127130 108207 132285 116491 126785 154157 187757 208804 212779 125745
19543 125745 47338 26967 77718 143519 98147 60136 32335 32517 79794 103997 132035 161369
19531 161369 157338 151721 101578 35356 55726 116054 185023 167100 210676 232498 216657 129239
19519 129239 95926 124993 184197 141647 126162 143979 140949 160163 190497 173604 141095 114842
19507 114842 72615 114681 156720 201759 202151 195155 128573 104823 77049 124642 192176 184231
19495 184231 172405 94135 67345 99835 112783 88609 72602 125822 135985 196796 206757 227887
19483 227887 243507 271819 244927 238503 273892 245458 176325 201235 224535 233069 255021 298134
19471 298134 210241 164849 149626 140185 125954 113318 95000 99570 149923 128939 133414 199497
19459 199497 211287 165689 202033 226624 179630 142864 143419 156115 151060 125986 155183 181750
19447 181750 183716 214918 224111 207006 210818 214904 128092 80099 143921 196667 188438 180067 140923
19434 140923 110832 116563 109678 152474 114268 102911 162329 210282 252212 278966 259973 251330
19422 251330 223125 211628 213343 176175 160606 168506 151186 223163 282002 281222 253953 222936
19410 222936 208977 188166 198465 215711 268895 325329 360195 351647 286267 248601 228063 257826
19398 257826 236703 199591 201889 270010 250654 173442 168668 176323 284362 321621 276210 282206
19386 282206 290567 288956 372205 345891 301487 249623 234213 252899 221664 187261 165948 194040
19374 194040 180050 208525 251975 317468 422971 442099 388173 283426 218083 279833 331546
19363 331546 365473 411335 412329 315428 233324 237459 243824 237183 263548 293632 244031 172433
19351 172433 162467 151878 151615 180637 207507 237782 227237 220848 238886 198483 194922 203501 143725
19338 143725 112710 135979 177421 253649 294407 283830 240069 263730 313617 318647 264839 213524
19326 213524 221938 220696 225602 253535 280751 320767 358052 333032 246647 272675 282459 355429
19314 355429 395528 411773 439803 472351 515125 465574 360427 326517 371237 332929 317367
19303 317367 271550 268345 305560 258429 250380 233215 264712 211898 188807 194788 219112 191653
19291 191653 184316 243108 272097 258162 308781 309889 303129 335541 315170 255576 230236 212525
19279 212525 242026 282783 248944 270878 315418 316066 417396 502094 578155 654556 678571 737230
19267 737230 796608 811139 777079 729406 735611 694621 671015 673739 613925 573673 524105 597336
19255 597336 635517 685206 692548 693807 685432 687930 647774 682311 689584 673036 643875 577247
19243 577247 532140 590478 645204 720007 714582 684622 658041 646285 631767 625839 556222 502360
19231 502360 476583 498599 493667 458214 451597 460226 477022 465270 509637 514420 567805 631377
19219 631377 540107 496042 518372 521813 601710 631059 602273 661273 625257 671656 708659 762545
19207 762545 857606 970171 1005019 1072167 1198684 1263335 1248580 1275804 1277654 1237642 1246369
19196 1246369 1236592 1247876 1278899 1308308 1323089 1284607 1299024 1316849 1258263 1257198 1230033 1156747
19184 1156747 1089292 1053486 1098870 1134902 1128894 1149818 1226793 1294446 1341410 1310475 1391613
19173 1391613 1461000 1428239 1436843 1482470 1542923 1615651 1662832 1685378 1744364 1827338 1969229
19162 1969229 2093982 2305386 2521646 2739600 3008376 3293319 3601801 3950658 4257533
19153 4257533 4521508 4590270 4700369 4839385 5020576 5222501 5506731 5884456 6270843 6669654
19143 6669654 7142290 7710650 8176005 8614378 9070720 9582536 10201360 10990779 11920765
19134 11920765 13052228 14525214 16505179 19393121 23639412 29786233 38964322 52471902
19126 52471902 70927718 93002469 115452081 134859876 150026487 163717829 181959519
19119 181959519 207634516 236575212 259062597 265771378 254113745 228864598 200950497
19112 200950497 177752496 160458320 145679234 128886305 108262916 85689114 64585921
19105 64585921 47316727 34661486 26048120 20350731 16583957 14061813 12200687 10819334
19097 10819334 9772833 8860109 8048496 7432364 6889658 6392282 5940931 5455692 4948693
19088 4948693 4562582 4282624 4106495 3961460 3846350 3712635 3620262 3481292 3447822 3416697
19078 3416697 3406974 3279147 3026725 2731911 2406837 2156978 2036168 1925710 1755703 1573119
19068 1573119 1461269 1345155 1123688 994431 965703 889899 764414 711219 668506 593427
19058 593427 561655 559627 488926 461365 445271 423715 418079 410446 383997 384247 353091 334979
19046 334979 301924 333862 370299 355584 339648 371193 355152 375223 428724 453233 404945
19035 404945 308785 240611 219023 192531 199589 228250 214927 201025 227475 186185 206671 254153
19023 254153 272887 265612 225750 236159 292817 339436 319997 221075 212143 198826 276048 294373
19011 294373 305662 251899 155761 159509 156331 168356 223815 246299 243114 296790 354933 385287
18999 385287 407072 391073 421320 439963 425362 480344 532524 545203 615077 711885 706655 666799
18987 666799 523114 452759 411521 386948 438419 554015 641792 701736 785858 835192 756892
18976 756892 616434 488292 457789 455166 379282 375751 339830 281068 319262 346028 328445
18965 328445 301031 272842 220933 248573 284533 306720 319083 353030 367062 346405 381073
18954 381073 403250 465439 509371 475361 440703 425208 453922 506158 574504 626093 740059
18943 740059 787540 882084 913617 877661 838891 732947 727207 710089 689387 726703 773611
18932 773611 867621 986321 1007762 975513 916209 901561 792167 689899 636329 606719 584776
18921 584776 509485 526652 539282 577824 659727 722970 713211 651800 532669 490883 515272
18910 515272 496864 440707 437829 386143 347867 334270 256902 223451 242687 247387 310665 393788
18898 393788 389770 370389 383473 376026 315851 300909 338866 430163 419119 375060 314961 326974
18886 326974 410741 426546 372384 301785 266738 284972 254516 265708 316601 301403 263609
18875 263609 287740 293907 335343 337592 323175 308959 318012 369170 359189 340800 366394 340091
18863 340091 288080 311223 319600 286002 311040 371434 333925 290708 246229 313338 355708 431467
18851 431467 462163 441537 395729 428557 466757 457945 459933 461577 466065 563614 592375 575980
18839 575980 583749 623778 559117 461487 413754 368116 343530 395686 465846 546602 573747 587659
18827 587659 602898 635044 607251 607098 662401 750411 770913 682864 626030 575511 559786 550031
18815 550031 541808 534208 497656 477216 446407 429756 501885 548408 562722 594181 591112 565965
18803 565965 623283 693499 664639 622687 664825 664912 609789 611513 622510 675088 795270 874496
18791 874496 966969 1038393 1015900 1016295 1038302 1014547 988282 940611 913797 884444 926648 915956
18779 915956 937098 930773 916883 938082 902301 938566 972735 1022771 1106497 1166967 1198055 1245731
18767 1245731 1274630 1258177 1308348 1363779 1396502 1409426 1361001 1357019 1311538 1236536 1242210 1255663
18755 1255663 1268151 1256014 1219270 1234452 1257143 1296967 1274980 1342130 1488931 1605548 1762110
18744 1762110 1905443 2046522 2072035 2023278 1844407 1663487 1546789 1500665 1457270 1421398
18734 1421398 1414412 1481098 1614676 1698664 1770314 1813731 1864673 1985749 2131153 2336292 2557523
18723 2557523 2828503 3119292 3375442 3629133 3817418 4013430 4282145 4537638 4834534
18714 4834534 5218796 5681576 6111862 6367813 6532479 6617222 6728529 7010370 7481269 8129880
18704 8129880 9074943 10333960 12178071 14952243 18998140 25214180 34692101 47435297
18696 47435297 60519328 70798387 76846588 80997295 84924829 87569771 86661922 82212051
18688 82212051 78143455 77912227 80081403 80803410 76309467 68211032 61358284 60257422
18680 60257422 65155502 70815088 72024007 65300779 53093347 39735010 28698979 21423755
18672 21423755 17196147 14742080 13263876 12259256 11529815 11118484 10967398 10884883 10835479
18663 10835479 10833837 10926530 11065645 11379879 11969803 12792718 13960805 15595167 17691490
18654 17691490 20420337 24209447 30131151 39743939 54893051 75388432 98125217 118027614
18646 118027614 128508748 126119505 112549621 94507121 79275666 72147981 74964175
18639 74964175 84666108 95407259 102398427 105037401 106645069 107823566 106259601 98910960
18631 98910960 86376430 73397372 65524078 66715490 76087029 85488377 89437400 89403247
18623 89403247 89519020 91661689 91525531 88346956 84510342 85461063 95539268 108452709
18615 108452709 116649776 115257028 101313674 80988719 60367423 43166688 31434892
18608 31434892 24118664 19401306 16135618 13731653 11995741 10726007 9837662 9176785
18600 9176785 8642239 8274072 8128462 7992782 7864535 7697849 7594436 7601696 7655249 7838828
18590 7838828 8077823 8348748 8757293 9418305 10386963 11712534 13645252 16565099 21112277
18581 21112277 28222264 39480970 56858072 76311246 86920049 86745055 79137289 71115103
18573 71115103 71836664 85043992 104592504 119671750 130832792 137086641 133559374 124605171
18565 124605171 114769112 107839000 102489252 92837628 77746412 59003513 41640880
18558 41640880 29369008 21589664 16704769 13476830 11331911 9738275 8479436 7489649
18550 7489649 6676164 6115592 5650512 5295957 4995292 4746097 4408818 3968657 3411083
18541 3411083 2897621 2568908 2328635 2151856 1929706 1761860 1608987 1481571 1355841
18532 1355841 1244427 1170750 1138557 1093641 1008466 965190 964917 952805 958725 1005136 1041185 1079207
18520 1079207 1121876 1155247 1176756 1318288 1518906 1855963 2362008 2783720 3008166 2922084
18510 2922084 2583412 2100624 1622109 1336717 1192317 1140938 1085445 1021941 1003188 974195
18500 974195 894602 805294 708307 637471 597945 576594 570536 558517 561670 541705 509835 518274
18488 518274 583383 565904 492612 423240 401022 458927 463171 449300 505657 619039 687625
18477 687625 896304 1131480 1385497 1586367 1796767 1906540 1942623 1940572 1863141 1841082
18467 1841082 1809070 1718096 1548386 1396601 1286215 1187336 1043302 934786 826716 741153
18457 741153 686477 661096 633090 614781 607704 613969 674622 681495 635605 556748 441977 383691
18445 383691 376913 360414 365628 419396 408501 447348 442551 450643 357023 267529 192137 123148
18433 123148 168267 171143 163030 197354 244356 207606 152887 103290 91194 65908 30778 60512
18421 60512 90813 108239 83988 129228 127077 109850 119625 85993 99660 106060 158431 233521
18409 233521 313760 388074 420747 451074 423742 427157 451340 449738 381210 374487 387365 421243
18397 421243 442542 397110 378072 390431 429085 353387 338985 340936 352903 422893 402151 436235
18385 436235 513392 504536 461201 385741 458072 495639 542523 602086 642047 710377 727507 714929
18373 714929 713581 748827 871166 1088845 1231653 1293620 1359810 1354892 1385591 1527060 1581272
18362 1581272 1540840 1418240 1267639 1108426 953524 839406 825597 824608 831802 837523 784011
18351 784011 727451 697968 679455 597773 526348 599929 694500 759870 775984 847699 906655
18340 906655 904898 847425 806766 749705 706217 684111 650848 643094 593856 545242 529247 507829
18328 507829 490148 527622 608358 656780 694202 729474 786080 933852 1155662 1398545 1660233
18317 1660233 1814119 1922754 1851373 1741558 1573745 1438555 1380645 1342638 1323546 1338420
18307 1338420 1327491 1254791 1124449 1101297 1136055 1241958 1261155 1236571 1228804 1228752 1163617 1160635
18295 1160635 1186461 1274922 1353963 1452249 1453197 1472830 1541875 1639905 1744733 1815103 1831637
18284 1831637 1849459 1877913 1889087 1959417 1988910 2062134 2171990 2314831 2445808 2550745
18274 2550745 2740126 2991906 3351617 3738673 4230243 4901831 5871833 7275304 9439609
18265 9439609 12854285 18275638 25683464 33052507 38693066 41211574 39295164 34623294
18257 34623294 29399830 25520157 24956022 28498796 35516333 42926409 48327057 50105488
18249 50105488 46101836 38338432 29370962 21221666 15408887 11907982 9829776 8538446
18241 8538446 7677629 7080004 6597961 6217510 5930209 5830477 5756563 5780114 5896796 5999941
18231 5999941 6172329 6389524 6639032 6983188 7595602 8475060 9565410 10971517 12921327
18222 12921327 15780257 20074146 26676187 37012475 52770220 72719655 91347721
18215 91347721 105505419 110671545 104551173 92119540 77855997 66451777 62175151
18208 62175151 66032408 75687353 85796187 93209153 94476738 88573587 79356959 68869185
18200 68869185 59154421 50991595 42698279 34433094 26793848 20542133 16165515 13291275
18192 13291275 11466497 10320716 9557539 9027727 8602919 8395411 8359885 8477680 8721631
18183 8721631 9076304 9480438 9713068 9914199 10254025 10715670 11480995 12612257 14160627
18174 14160627 16378510 19635228 24426630 31851602 43529675 60651026 80467266 97259379
18166 97259379 107146344 105522712 95096268 82323087 72802120 71652113 81693737 103618009
18158 103618009 131635862 152965453 161943161 157508586 144862463 129474447 114323015
18151 114323015 103282829 100162009 108376355 122819196 128716416 119815829 98712348
18144 98712348 72831143 51308120 37084208 28292600 22733147 19055676 16688637 15205924
18136 15205924 14161508 13261566 12351723 11425191 10555487 9909576 9481317 9312164 9480022
18127 9480022 9856826 10251428 10561527 10726846 10884431 11087602 11443847 12108079 13350318
18118 13350318 15360857 18526411 23340067 30860019 42807846 60964106 83492548 105457430
18110 105457430 119187324 117582911 104324132 86876504 73290140 70361623 80388273
18103 80388273 100527996 116493941 116369228 101090221 76430225 52446952 35783315
18096 35783315 25551345 19188971 15077109 12346250 10388521 9083437 8224126 7685634
18088 7685634 7286613 6935602 6520742 6091982 5744081 5542701 5415793 5335158 5239457 5112973
18078 5112973 4961495 4858648 4870833 5021999 5216015 5470983 5839175 6450058 7521933
18069 7521933 9275689 12213067 17097043 25015837 35238019 42427655 43204993 38692702
18061 38692702 31484762 25911254 24664131 28003297 33684383 36399277 34248355 28125908
18053 28125908 20310287 13673272 9387349 6885174 5339092 4377586 3715016 3269499
18045 3269499 2937111 2703307 2517332 2370888 2226039 2116142 1966522 1824525 1674484
18036 1674484 1577481 1475302 1329693 1253442 1300518 1395346 1385750 1244745 1098252 889301
18026 889301 690925 556656 424977 413704 378231 350563 327972 195918 120896 76532 100481
18015 100481 71810 41562 61587 106918 91997 68676 94176 114564 111118 100137 44735 510
18003 510 -13135 -3985 18049 107636 100702 141279 234109 251290 227213 198273 131065 147462
17991 147462 158603 122240 204960 272213 222978 200729 209373 200666 153137 30296 29875 56341
17979 56341 78922 103994 65253 109541 117469 54746 5238 55184 48388 27452 57160 25812
17967 25812 -33503 -90138 -97718 -106101 -61207 -56098 -96395 -139546 -174641 -186163 -165446 -139452
17955 -139452 -110380 -39668 -15988 -35286 5586 14105 14932 -7631 -73969 -41404 22733 -192
17943 -192 32072 55401 53515 118777 156749 120701 89009 90162 61895 48301 -19420 -54925
17931 -54925 -38451 1658 45330 -31871 -36327 25257 16042 -1176 2720 -7311 -68556 -85231
17919 -85231 -66067 -65918 -53266 -58743 -101661 -127671 -77593 -28613 -36020 -42113 -26276 -41660 -60436
17906 -60436 -26573 48221 79129 -117 -91196 -28338 68191 89268 63974 -12274 -52264 -51097
17894 -51097 -52237 16982 54405 17709 -23244 3492 52339 72687 44355 15433 -47611 4381
17882 4381 4649 -78708 -148645 -109730 -122150 -166191 -202752 -197769 -106014 -57633 -17222 -7129
17870 -7129 -3535 -28185 -95999 -112824 -170152 -154194 -64914 -25885 -25079 -31701 -40289 -98850 -86221
17857 -86221 -31849 22217 39883 24799 23516 25050 -33400 -112306 -105836 -72806 2979 17821
17845 17821 -41535 -67031 -63140 -39519 -36827 -12712 -9673 -3900 -44531 -116537 -151724 -188590
17833 -188590 -195502 -119517 -61843 -56320 -64838 -33130 38045 60365 62195 37421 -22468 -62714
17821 -62714 -53776 -52159 -67382 -44630 43700 52086 66272 49736 17066 -32995 -44774 -19651
17809 -19651 -1218 -79391 -139218 -157456 -156607 -143315 -123841 -122229 -135807 -177942 -182313 -175416 -158576
17796 -158576 -121826 -53893 -54489 -144113 -173969 -161804 -148387 -134784 -101370 -114767 -140619 -141754
17784 -141754 -138028 -117975 -81413 -79659 -109510 -115946 -82804 -66321 -69234 -79041 -110407 -120979
17772 -120979 -134745 -118266 -64102 -29586 -58905 -90761 -91987 -84267 -143453 -145813 -49623 -30648
17760 -30648 -25629 -58588 -26927 -5346 -42871 -30354 -7823 39021 46253 35131 -883 -28477
17748 -28477 -29757 83884 178411 221270 289903 291023 278263 308279 311042 265265 202740 198950
17736 198950 232362 243788 239628 237362 207694 150876 70368 -20671 -22704 1745 32897 6011
17724 6011 -2945 10213 21448 -778 -39506 10851 34899 -49475 -70673 -42622 -28746 18673
17712 18673 44303 -19997 -56657 -8711 49636 62652 -1826 -755 58357 102782 164376 181225
17700 181225 179440 204755 267506 323786 341319 371742 372770 407693 464920 477243 503798 500621
17688 500621 490940 416493 336499 285232 335071 405144 349677 264976 213559 179696 105307 84514
17676 84514 61222 52629 17657 -24544 -46590 -58720 -26755 5049 46317 4656 -12496 -15636
17664 -15636 -4586 76244 131864 103841 79032 153997 259708 288517 341423 418736 457701
17653 457701 506147 520830 503851 514624 582886 687850 738986 739928 771084 864802 851026 822760
17641 822760 826453 859376 879822 806905 757661 739961 689701 626330 542509 404375 338719
17630 338719 301066 252172 217843 157326 138700 108638 120429 85334 46136 71719 192999
17619 192999 238986 217052 261066 367852 375712 365904 397318 348045 300015 384206 561104
17608 561104 710505 665284 644551 697693 702547 659571 639299 586630 550279 533577 511871
17597 511871 509692 468473 393477 340486 277298 291133 350326 455788 524897 513105 481959
17586 481959 514633 582387 596194 512333 430623 389730 349937 288368 256566 155858 88010
17575 88010 154628 251247 328169 367479 431656 480466 514050 538016 541021 559210 516132 546169
17563 546169 585699 571465 566881 559142 611218 621669 556552 388944 279222 286208 354929 367252
17551 367252 313137 254139 195544 229252 219912 176647 138099 156875 127414 44270 -3694 -41135
17539 -41135 -40611 -34854 -14866 56981 63455 7840 -24342 -35976 -59708 -10456 30302 10081
17527 10081 27232 40359 12485 84084 107208 138257 133863 160239 156317 186953 179271 160398
17515 160398 188411 251343 234581 172586 163477 126950 143535 101900 66795 47160 3787 -63395
17503 -63395 -106398 -40059 -39954 -57865 -120686 -125645 -102151 -47768 -32686 16794 39250 -16709
17491 -16709 -27945 5141 -37503 -33102 -52202 -96600 -64667 -52922 -35802 -48250 -64506 -75030
17479 -75030 -53932 -41089 -56260 -98682 -51736 -40718 -13565 24928 27569 4291 -34220 -11748
17467 -11748 13358 2352 15010 6520 20824 -50445 -36749 -16815 -3194 11331 -29498 -17721
17455 -17721 13819 33814 24840 3456 3714 19607 20431 -2779 -67394 -125052 -53238 -47006 -43243
17442 -43243 -35498 -55202 -40716 -39072 -15828 -23878 -66818 -64889 -15042 19251 -18528 -52375
17430 -52375 -81487 -71723 -82201 -125202 -142268 -110271 -79014 -40445 -55699 -37107 -46530 -61793
17418 -61793 -87629 -39882 -29901 -57706 -62437 -45053 -10584 -16661 -10547 6784 -20733 -75199
17406 -75199 -93188 -102187 -64762 -69097 -103936 -65533 26635 -41249 -47905 -71995 -104898 -79621
17394 -79621 -8511 45002 56800 350 -18705 -10538 962 -18129 -49443 -23463 -9127 -18670
17382 -18670 -57134 -2343 -9720 -62779 -107857 -89885 -50340 -7220 61237 63439 16981 31008
17370 31008 61102 48292 -4313 -36297 -16629 11172 18576 -14200 -59935 -52107 -44635 -18237
17358 -18237 -48824 -75343 -87860 -64158 -20163 -40512 -59231 -21776 -9942 -31927 -46289 -43993
17346 -43993 -52717 -67324 -105288 -87973 -71103 938 29121 22135 -5275 4290 -70651 -83646
17334 -83646 -73848 -39350 -23486 -22690 16649 14822 -15765 -20959 -5472 15158 37181 44712 109361
17321 109361 162926 207795 331762 509733 542909 476671 437459 435197 465256 505497 542519
17310 542519 512073 375699 264879 175085 108417 65846 18155 -8563 -27340 -20269 -43998
17299 -43998 -28745 17214 6920 -14848 -22126 -42482 -86818 -59521 -31450 -24493 -61158 -49472
17287 -49472 -56100 -98184 -128673 -176313 -183331 -124781 -59704 -56040 -58600 -32430 -11390 -31177
17275 -31177 -239 -61960 -56644 -10979 -10615 -30139 -65748 -123568 -140868 -102733 -40747 -51365
17263 -51365 -60421 -92948 -107878 -91104 -97168 -126016 -149398 -50575 -2380 -37871 -39671 -11338
17251 -11338 -21825 -51932 -101767 -78830 -83813 -124974 -72196 -35210 21952 29557 -25222 -84029
17239 -84029 -71685 15122 -9055 -98351 -114319 -126172 -78106 -62081 -50026 -69891 -96277 -41323
17227 -41323 4152 -15087 -8447 -12668 -51788 -34228 -23675 36935 54304 60429 49739 13024
17215 13024 -35869 -28427 -13238 -52376 -78965 -92948 -89190 -78877 -99005 -152519 -149145 -131189
17203 -131189 -117933 -107071 -66914 -37026 -1857 -17774 -49693 -50890 -39239 16446 7394 -82687
17191 -82687 -77387 -84765 -36049 -17178 -20824 -22732 -46289 -7316 3357 -34173 -57425 -15597
17179 -15597 9553 -1867 -26665 -38744 -429 -7259 1719 -31175 -72743 -53251 -19155 -5017
17167 -5017 -66143 -113723 -117898 -87262 -7171 43524 -24955 -39899 -41996 -28941 -44785 -110733
17155 -110733 -133368 -80489 -36982 -66333 -76340 -101957 -131143 -116766 -35340 -3704 -40528
17144 -40528 120 -3348 -54995 -59244 -71033 -109165 -84927 -48622 -34578 -40138 -34638 -8003
17132 -8003 7859 -17021 -63885 -46347 -73539 -104281 -66591 -23631 -17163 -27226 -57562 -67517
17120 -67517 -42174 -25943 -56852 -74314 -49853 -37846 -37579 -92412 -86930 -48964 -30297 -627
17108 -627 12091 -60993 -128605 -94317 -73463 -80190 -27516 -22373 -103029 -129476 -125178 -102408 -105215
17095 -105215 -122299 -94329 -41835 -46119 -43247 -4699 6512 -7786 -5244 -78612 -148859 -109785
17083 -109785 -15066 -41646 -44698 -10857 -38749 -77316 -129387 -115816 -115600 -90794 -62250 -4241
17071 -4241 -26116 -848 17207 -39134 -17715 14007 -8233 -42564 -65125 -51433 -31117 2298
17059 2298 -18142 -26087 -14062 -22545 -39021 -94762 -75179 -66280 -23862 14283 -48575 -91519
17047 -91519 -99326 -99249 -93307 -69590 -90584 -29530 9072 5678 -12304 -36639 -35736 6135 -21234
17034 -21234 -50628 -66905 -34336 -34193 -21652 -25030 486 19144 31567 61351 69991 73672 -9163
17021 -9163 -67174 -80753 -77114 -9588 38662 24339 35598 26864 4456 7671 -20556 -22735 25143
17008 25143 42157 -31819 -98854 -100613 -116902 -93584 -102156 -78683 -22908 -40373 -18756 4568
16996 4568 -87489 -133279 -108936 -89170 -104080 -98940 -93267 -86861 -92742 -145394 -102214 -11704 11597
16983 11597 56933 -31145 -74798 -104403 -141584 -101528 -17780 11803 -18164 -70369 -87646 -89535
16971 -89535 -74916 -50699 -56895 -89997 -79673 -57016 -91127 -138879 -149035 -98451 -125271 -132010
16959 -132010 -41443 28024 13334 25335 -15702 -60984 -93135 -55534 19487 -15986 -78151
16948 -78151 -87260 -70026 -32711 -31201 14042 57871 6786 -10152 41720 22392 28403 -12871
16936 -12871 -30822 -9952 -18604 -24567 -5444 -2163 13160 67851 138010 118515 50399 9483
16924 9483 26579 69501 59679 45368 96520 141698 89425 44592 18401 -34248 -33827 -40573 -4443
16911 -4443 -10839 -40266 -76619 -113230 -78846 -90064 -119146 -177689 -151241 -90943 -113404 -105208
16899 -105208 -70433 -123211 -155518 -150342 -142084 -127787 -94659 -66776 -43844 -54903 -90309 -131904
16887 -131904 -108340 -5511 5325 -4106 3844 24611 9638 -12926 -14364 807 -12259 -4964
16875 -4964 -29587 -61937 -38259 -88309 -90176 -54978 -6105 -26638 23640 49307 53388 41253
16863 41253 12426 56243 42562 -21574 -7775 28283 13362 -13808 -42802 -102073 -53500 -5827
16851 -5827 -51098 -92896 -55346 -14395 -19225 -54697 -92758 -88876 -67304 -108848 -156374 -73054
16839 -73054 6170 -38583 -81105 -28048 -2379 -20141 -6144 40393 23501 46486 -467 5454
16827 5454 -3304 -19389 -11165 -9626 6902 -5656 -45149 -14432 9973 56471 37209 6112
16815 6112 -18200 -35073 21916 -18634 -8047 14789 -57373 -93505 -68874 -70684 -47915 16829
16803 16829 29493 65748 44394 11421 10311 32162 50472 135850 110065 87009 106962 152746
16791 152746 187846 183043 193421 178420 247837 350949 450346 519637 532153 533669 486128 504798
16779 504798 527993 514773 523689 615089 656348 656200 601103 582896 493921 373417 288791 252663
16767 252663 258437 224467 171942 69939 -2043 6479 48626 -23070 426 5249 2726 33102
16755 33102 644 16777 18261 45128 40443 16128 -13576 -97091 -146417 -104685 -60182 -39366
16743 -39366 -36532 -48090 -52252 -29049 -21418 -15788 55222 95863 88053 81302 135480 107682 56601
16730 56601 -22367 -69068 -64036 -29434 21045 8542 -29963 -33809 -27133 7133 21244 40865
16718 40865 84855 84083 33629 6231 -325 -36254 -28651 -33821 -24710 -55325 -94185 -95865 -79273
16705 -79273 -40139 -13920 15593 1617 -30325 -88909 -94205 -67529 -85374 -102302 -114964 -97796
16693 -97796 -105818 -171592 -205303 -115907 -49556 -32122 -16683 20768 2505 -300 -30207 -33845
16681 -33845 -26642 -42653 -43481 23834 10597 -41966 -26518 -36977 -7443 25331 42872 22409
16669 22409 -4283 -4710 46393 60686 74101 103202 99282 102366 51630 26377 21466 3008 10144
16656 10144 -53109 -79117 -73238 -73973 -66786 -36196 -6798 7252 17242 18425 -169 44329 88374
16643 88374 82625 9024 -59496 -123148 -115934 -113874 -67728 -44056 -86525 -31134 -14805 -21877
16631 -21877 -14017 -19542 -62309 -81953 -90830 -76742 -92048 -14194 19335 81593 63414 2989
16619 2989 -33309 -21004 9036 37602 42098 90229 93550 9083 -29741 -68466 -5567 -30793
16607 -30793 -80710 -40199 701 26499 -30273 -71180 -43454 42015 48728 -29108 -64724 -82873
16595 -82873 -93750 -77748 -76703 -69142 -24953 28667 31858 -23891 -19212 -16574 38772 17554 29228
16582 29228 56545 71612 19827 14311 26824 -25552 -6238 18984 53514 22186 -35727 -61419
16570 -61419 -79961 -106354 -93824 -17474 -25056 4501 -25472 -68484 -16172 31853 28056 77192
16558 77192 71559 36733 -6493 -47694 -35342 -22113 -29266 -33394 -34049 -11608 -1668 4342 -19735
16545 -19735 -63823 -48176 -44219 -48053 -47864 -21030 59472 41647 9975 -7444 37533 53239
16533 53239 21052 -9726 20484 34618 -3391 6981 6283 -12703 -19888 18760 -9200 -19471
16521 -19471 -17557 -74594 -120750 -106515 -85272 -83026 -19568 -23413 -50905 -50328 -39034 -30549 -36953
16508 -36953 -30432 20347 6833 -13272 10458 -63907 -92734 -5350 -31844 -32163 30359 -21393
16496 -21393 -43595 -71789 -63148 -12307 36367 -13163 -82044 -94344 -78222 -98735 -75083 -58053
16484 -58053 -47173 -29080 -2426 -3508 -90214 -51546 4894 -28713 -58712 -11327 -9561 -24465
16472 -24465 -8728 -46969 -5670 39477 88914 64282 29349 361 -42000 -54775 -59796 -115685
16460 -115685 -86385 -83891 -48161 -30748 -40771 -39785 -126957 -129492 -21855 3830 -9878 -86357
16448 -86357 -96354 -44721 -52660 -40364 -62054 -58997 -51243 -83991 -121377 -145865 -106249 -89893
16436 -89893 -34323 -10689 -25642 -73137 -58712 -34848 -28174 -58423 -70614 5262 44458 -11361
16424 -11361 -56277 -61565 -57802 838 1236 -8936 -48471 -61749 -38961 -10792 -64241 -99145
16412 -99145 -108825 -146100 -123400 -73930 -50728 -17604 -37554 -89472 -137960 -91824 -35576 -30097
16400 -30097 27062 -25034 -116948 -82514 -47182 -30650 -90420 -137386 -142547 -115254 -110513 -98098
16388 -98098 -23398 -24259 -36321 -23729 13859 5848 27996 11674 -40087 -88340 -48257 -22949
16376 -22949 -32230 -90206 -121531 -157265 -157634 -93002 -82870 -84752 -79001 -31877 -30507 -18844 43776
16363 43776 60298 51763 61961 63489 31072 -56334 -119283 -105648 -39466 -30944 -17088 16391
16351 16391 26008 -59463 -33225 4603 -26943 -86158 -62667 24382 54802 -23231 -30272 -70161
16339 -70161 -68181 -55096 -61986 -39588 -14497 -49117 -55444 -77360 -60709 -19657 -76615 -67837
16327 -67837 -20366 -53533 -62623 -59277 -62133 -33445 -34291 -29364 -29385 -53865 5828 45564 -20986
16314 -20986 -7001 -12299 -64765 -68927 -8978 -14951 -11426 -20130 -54461 -57003 18465 43799 -7459
16301 -7459 -4806 -47617 -21349 12463 -24102 -60723 -76723 -72003 -71576 -40795 -20395 23178 25892
16288 25892 67501 53961 52979 8311 -25003 -11285 25904 63680 -21813 -69449 -68935 -89626
16276 -89626 -55474 -12807 32386 59867 20396 4457 -4069 7490 -26513 -56755 -102001 -104320
16264 -104320 -47307 48604 36922 -20663 -44119 -39098 -66227 -36218 -8979 -5193 -40265 -13518
16252 -13518 -56805 -51315 -33143 -56895 -60362 -28273 -26119 -49136 -14766 27200 18602 -4370
16240 -4370 -49171 -26186 -18230 -29250 63996 100927 89445 138642 116413 81060 22204 -67702
16228 -67702 -93553 -51806 -49725 -18999 29702 14211 13730 46127 102674 86026 85627 13043 -21257
16215 -21257 54356 93320 91868 63158 7421 3482 11930 -23989 -54793 -66156 -45685 -42151
16203 -42151 -66228 -15052 -23914 -20822 -44677 -57993 -38444 -34882 -69876 -70189 -67524 5564 -11541
16190 -11541 -37530 -55071 -60886 -91905 -67627 -103751 -68042 -3363 29473 -66014 -74045 -9308
16178 -9308 30678 15290 6163 33922 15506 60810 74294 42886 33669 29467 20144 -11813 -56239
16165 -56239 -31138 -3036 -34667 -100105 -117808 -42367 -12324 -43610 -29823 -17903 -90608 -59831
16153 -59831 16771 36688 5931 20081 -5100 -4070 75572 66153 55744 29709 12450 -24445
16141 -24445 -31667 -51494 -41709 -58549 -57640 -8265 -7718 -5890 30875 -1014 -39046 -23837 -70155
16128 -70155 -10371 19007 8101 -13540 -31340 -28030 -20478 1521 28585 30656 21712 78081
16116 78081 79700 63794 42997 14441 5186 -32267 -71629 -108348 -48316 -17239 -22167 -17105
16104 -17105 2980 6889 37200 30553 5213 46161 86312 31252 -13094 -13907 21670 -6388
16092 -6388 -70293 -44515 -2796 -64120 -133865 -161793 -130585 -120131 -122226 -90475 -43770 30327
16080 30327 -5677 -60471 6657 18651 15342 102492 111742 72157 83635 78603 29742 -21136
16068 -21136 -70583 -58578 -35543 6780 17825 -24066 -84092 -47403 -22653 -58060 -10295 21348
16056 21348 31584 -71498 -97258 -31913 -2852 -7181 -59750 -95364 -65367 10266 5280 22904
16044 22904 3072 30558 13502 -40794 -21554 -10103 -6559 29948 34487 52055 16531 20596
16032 20596 -16242 -74260 -65877 -41464 -16136 13457 7301 9081 3082 4571 -96603 -130164
16020 -130164 -99789 -37698 -7936 -48115 -56150 -21466 -12477 -23622 -80629 -85160 -79911 -83760
16008 -83760 -74645 -72576 9873 19963 14904 29165 66445 92633 33890 -76692 -106288 -86060
15996 -86060 -45581 17205 61882 128585 111519 95175 546 -60198 -27550 -22413 28271 9858
15984 9858 -44610 -48968 -30782 -32413 -38442 -63567 -26372 -51261 -54109 -73395 -111311 -98437 -68015
15971 -68015 -15070 29676 25868 20427 -11431 -77925 -101657 -19527 24260 11657 2509 -63858
15959 -63858 -113324 -69824 -21655 4919 19792 -10675 -79101 -92613 -57447 -37157 -19918 -2997
15947 -2997 35039 84607 65414 26644 40701 54989 36653 12627 -7748 39166 40862 -18408
15935 -18408 -30781 -31925 -22659 4355 -43290 -65163 -75583 -63430 -35196 2565 -33957 -45366
15923 -45366 -30565 -2424 -17146 -14168 -16119 -40675 -29254 5258 16020 -12342 -20320 -17051
15911 -17051 -16477 -24536 -49639 -68526 -70354 -62542 -67177 -73648 -63385 -36659 -7157 -47557 -25289
15898 -25289 61959 14067 10624 45448 46390 54758 39924 50244 -1944 -83927 -51523 -60817 -83549
15885 -83549 -48459 -42579 -49912 -7330 -22338 -10817 67370 82780 67488 32307 -7875 13959
15873 13959 16362 -18781 13856 49024 6134 7033 66584 35886 55700 42624 59096 48358
15861 48358 -43282 -124004 -140049 -127303 -77568 -77760 -66804 -94493 -63540 -34883 -18057 28683
15849 28683 9849 16487 -19701 -90648 -45952 4980 -50874 -51770 -32032 20862 21787 30087 -9991
15836 -9991 -36747 14303 58676 36577 -13686 -61552 -98267 -31517 12251 17901 17280 -8359
15824 -8359 -27588 -44405 -35429 -51965 -95613 -63834 -16816 -27111 -15402 33081 8412 -47952
15812 -47952 -58946 -13818 19886 19602 19571 4711 -48655 -129192 -119246 -53639 9735 19492 48024
15799 48024 29264 31088 33650 55816 49772 11205 12590 7022 -30021 -1621 37014 6693 -6824
15786 -6824 -21092 -11622 7880 62327 93069 48022 41432 37589 8032 18079 -8555 9017
15774 9017 -12948 -54952 -30008 -26427 -71630 -104646 -109093 -73978 -58181 -27157 6390 -9863
15762 -9863 19568 55559 34961 -15094 1179 61875 2054 18249 13445 -42732 -55148 -38951
15750 -38951 -57888 -27689 -64775 -100105 -86166 -89253 -25835 -79766 -164727 -148054 -35524 -12125
15738 -12125 -33094 -25980 -525 58137 66800 35411 -42820 -68414 9578 4220 -19211 21463
15726 21463 -55274 -139266 -162663 -147121 -102631 -93366 -103825 -52618 -22323 23107 49990 35848
15714 35848 185 -54218 -36443 -1996 1718 -22915 8797 109120 144466 96659 17310 -79426
15702 -79426 -131184 -182375 -92172 9834 25157 20325 -74648 -140570 -193107 -186721 -123793 -80723
15690 -80723 -46837 29473 18314 2563 -23241 -29584 -15539 -21527 -16416 54650 110178 94335
15678 94335 62110 -5664 -6719 -17835 -69042 -37507 10242 9748 6873 16711 21771 6943 -13889
15665 -13889 -13755 -60178 -50463 -23185 -41146 -23784 4314 -8232 -31327 -64528 -96216 -79208
15653 -79208 -22240 29754 -1160 9480 -7534 -52760 -84484 -17013 38937 61435 16356 15432
15641 15432 32927 11650 6654 -78112 -44771 37197 20259 -39382 -39138 10423 15526 -35211
15629 -35211 -78810 -56653 7830 11265 -4936 423 35954 -18025 -59278 -117010 -152490 -154841
15617 -154841 -98142 -90529 -50577 -27794 -37239 -20927 -4044 -23366 -41567 -71311 -55503 1109
15605 1109 40213 27451 261 -76073 -105222 -51886 -13519 -43284 -55324 -139144 -133798 -157355
15593 -157355 -137890 -125408 -118510 -143936 -83320 -69266 -64395 16313 23815 34589 -13414 -75211
15581 -75211 -67305 -50274 -57740 17475 48437 47894 39783 4634 -7033 -20795 -44735 -81022 -47665
15568 -47665 -9978 -30239 13646 -66428 -70979 -550 55245 50519 41257 25097 -41341 -39103
15556 -39103 3390 -7745 12998 45349 65798 149852 166350 77434 42624 11151 -52175 -60833
15544 -60833 -83538 -76867 -45629 -5517 -314 8594 -18540 -34291 -47400 -92989 -67532 -19644
15532 -19644 -48341 -42630 -67444 -9396 639 -4501 36108 33452 6981 7823 31325 32920 3297
15519 3297 17211 -29450 -16842 -1944 -31781 -95091 -130541 -100619 -70727 -51702 -60411 -87629
15507 -87629 -90138 -70735 -140226 -93170 -39292 -33615 -25762 -26232 60214 86138 101838 22744 -6252
15494 -6252 -9096 -27060 9490 47915 47178 72345 115013 110614 48842 23667 -21715 -1954 -10576
15481 -10576 -19186 -24919 -4611 26098 9134 -41916 15730 87255 34899 21830 48741 16299
15469 16299 7768 32492 75256 76410 10487 13109 6153 2950 -41563 -29307 37910 5413 -73524
15456 -73524 -69163 -32707 9929 7011 -48085 -3907 17279 -33994 15515 101981 63688 22193
15444 22193 -25209 -74374 -54471 -87778 -60122 -26864 35729 12495 23503 -3480 -9185 -4199
15432 -4199 29157 3649 -10923 66332 70674 8364 -35483 -49198 -23589 7705 23445 31444
15420 31444 25602 27776 29780 67755 72034 28665 4423 -9244 -2081 29801 13460 -11154 -3649
15407 -3649 -40489 -47799 -68041 -59697 -9473 -26873 -4489 -1326 8039 16020 2173 -62597 -109614
15394 -109614 -100142 -17495 -10845 -43689 -46232 -14184 79542 56930 67396 63478 45192 33889
15382 33889 23758 -21760 13157 31325 11407 48910 33894 21572 38909 17735 -43178 -66055
15370 -66055 -6558 48119 98825 127179 84882 -8362 -28752 -6647 24846 36766 44047 33477
15358 33477 6169 12910 49968 3140 -13688 -25527 -47426 -65803 -41581 -27239 10348 -4338
15346 -4338 8792 19911 -15518 -12674 76906 69795 25694 10108 -34302 -21785 47982 27822
15334 27822 18242 -16999 1797 -1856 41170 105172 137409 63074 -9685 2773 24492 53629
15322 53629 17478 -6790 4943 34535 -23858 -44767 -52495 -61440 -70709 -34017 31895 41151
15310 41151 14097 -15919 11397 4243 15491 31323 109372 104884 68556 -12277 -56983 -57745
15298 -57745 -75531 -65912 -14524 28279 75905 44384 2213 25344 69041 47239 -46495 -49483
15286 -49483 24907 23294 -15946 -8081 -4068 -4300 -65640 -50409 -26787 -30300 -65359 -37942 -23775
15273 -23775 -24015 4267 61409 40847 23606 18771 40254 3128 -27963 8955 45448 61823
15261 61823 32357 11163 -24178 -23274 -21925 35089 69731 44791 30371 39033 97261 142219
15249 142219 77828 44958 17578 -6503 14731 5103 -4310 -854 -12230 26508 17810 10075
15237 10075 -6518 26575 78564 52906 8718 33990 -29124 -87646 -73865 -51496 -21855 6040
15225 6040 -37791 -87957 -49266 -52164 -95656 -92244 -34585 -42132 -15767 -52119 -99129 -32980
15213 -32980 26621 34243 28634 -31661 -9923 26191 19776 -12853 -35465 -36952 3982 14055
15201 14055 -24283 -62231 -113344 -83032 -68181 -95317 -66049 -75815 -49447 -45486 -24315 -40370
15189 -40370 -86674 -96345 -81020 -15215 32552 26127 46590 38281 23923 -10551 55808 27220
15177 27220 -67584 -114613 -114758 -55310 -24036 -7248 -47463 -107607 -160883 -139735 -123597 -42446
15165 -42446 -58969 -72014 -108018 -116408 -49675 -18329 -27626 -35401 -25994 -54844 -43571 -68058
15153 -68058 -102295 -81881 -23775 13891 -5240 8709 8524 -7299 -4929 -38657 31784 97397
15141 97397 117651 38344 9586 65884 82707 19522 -26106 -2010 -10081 -5384 -11945 -49566
15129 -49566 -47740 -64551 -90175 -107860 -83695 -34914 7186 51099 24547 60509 55113 -14425
15117 -14425 -38834 23206 66639 53491 -10508 -16743 16441 12460 68495 80117 50860 37207
15105 37207 58556 93941 58965 8702 -8336 -41031 -17012 -129 46692 66378 -10517 -20829
15093 -20829 -17497 -36497 -6108 43968 -6026 -15743 -5026 24005 43467 59635 57144 -15279
15081 -15279 24922 -177 -13405 -54131 -104261 -98162 -38715 164 -14161 1487 -11716 -4762
15069 -4762 -59946 -40610 -21032 -83001 -104194 -84071 -114387 -54507 -58817 -4768 38529 31679
15057 31679 -19639 -25682 20216 62172 61841 57282 -4094 -100348 -116101 -126898 -112763 -112377 -43411
15044 -43411 -6090 24028 28039 22704 16008 30898 13443 -49815 -56930 -94208 -124438 -116426 -101465
15031 -101465 -102908 -57143 -50709 -57861 -47236 -33175 4051 9743 45149 68944 66959 1269
15019 1269 18432 75448 57471 56152 83881 50806 -20088 -61148 -120552 -145129 -54929 -55725
15007 -55725 -55214 -62857 -59874 -27988 5400 -43173 -75648 -73960 -9376 50549 27732 4769 77013
14994 77013 71562 3716 20512 -3017 -40485 -82365 -76814 -106795 -142466 -102071 -89047 -38076
14982 -38076 -25292 -30732 -30469 -71992 -104738 -160797 -179343 -105910 -63693 -4100 42615 24560
14970 24560 35379 56974 88431 100473 76795 110440 72672 63003 36955 -24291 -10057 11828
14958 11828 17326 -16276 -47552 -68146 -62625 -48849 21908 10112 -30914 18904 -15759 -48747
14946 -48747 -79309 -89872 -68826 -31060 -53059 -50608 -43828 -24375 20900 26618 4803 -13776
14934 -13776 -20226 2774 -25068 26178 41255 -8299 -65003 -71619 -38620 2105 39084 -1883
14922 -1883 -69027 -65541 -28277 -32541 -15395 -26450 -488 -24057 -34730 -83947 -79028 -13327
14910 -13327 -32165 -22327 51326 48782 23498 27424 -17311 -62192 -124263 -125961 -72665 -40405
14898 -40405 11511 -1430 -16871 -8377 6008 -24673 -35263 -24739 -27898 -55417 -63113 -51710
14886 -51710 -63627 -63021 -88697 -86856 -65251 -85193 -61944 -62423 -60934 -49398 -20985 -14163 -8492
14873 -8492 -673 -41892 -17513 4091 12807 35903 89210 77887 91346 60172 15455 13319
14861 13319 55963 94668 89069 -3231 -26324 -111572 -148052 -105367 -130350 -113863 -89909 -22914
14849 -22914 -24275 -63293 -121777 -147194 -57528 26994 52010 -37557 -84209 -91691 -55964 -56710
14837 -56710 -36715 25778 54152 -17528 -72175 -53673 -97645 -85276 49836 124831 69075
14826 69075 -25671 -91624 -71160 -98364 -69969 -41931 -13033 38855 62857 60866 -4196 -86348
14814 -86348 -60702 -41058 17734 48930 57835 83499 67444 34839 12587 -31220 -41626 -32793
14802 -32793 12785 1987 48703 102906 55607 -13825 -47426 -34898 17368 8554 4623 23717
14790 23717 -11816 -31886 -14737 24677 74185 -10059 -73039 -5583 15642 10456 20280 -24317
14778 -24317 11934 65169 81569 56982 14018 14772 3036 -36960 -46551 -36417 -54984 -86488
14766 -86488 -93410 -95054 -75499 -28168 46552 62925 26015 50579 50714 108719 129357 152361
14754 152361 128160 18050 -44155 -57506 -17239 -13779 -82452 -55318 -19487 19364 -47509
14743 -47509 -99780 -93960 -80956 -19725 -25943 -80967 -71986 -31742 63309 95357 109407 84606
14731 84606 27564 36138 75209 84848 22642 55621 108176 103540 43612 45894 66585 57864 17144
14718 17144 -56175 -85527 -7976 85053 123321 93807 81098 101009 70251 15680 3143 28312
14706 28312 -13834 -2888 -27612 -35525 -24335 -31215 -72391 -58965 -8139 -22511 -39327 12704
14694 12704 74688 28871 -11532 -36064 -37078 -30558 -17027 18472 -49588 -31221 22140 19564
14682 19564 40032 -7862 -64358 -48766 -13620 26087 3588 -39358 -36863 -19448 -18108 -87803
14670 -87803 -32117 33053 9660 -26837 -35726 -43437 -57942 -78661 -132756 -145023 -107252 -56220
14658 -56220 -72580 -49592 -17372 12734 29682 -39244 -18975 21959 17976 73194 89487 63594
14646 63594 50940 9637 -2638 -10653 -32649 -59609 -68351 -101084 -76579 -641 -3377 21464
14634 21464 56272 55381 22053 24748 -10433 -30008 16135 2200 18220 34697 48302 11031
14622 11031 -27647 14491 36118 31775 -17480 -7050 -26986 -6215 -44655 -51122 -45917 -55149
14610 -55149 -44142 -17713 -12223 -17122 -21729 -41461 -49526 84 18817 -33478 -33019 -4879 7514
14597 7514 17279 53321 70478 92450 39187 53524 46767 27304 -18231 -33992 -44919 -6214
14585 -6214 58764 50526 44632 33577 20308 21364 24463 -6766 -99282 -73045 -6513 60955 34170
14572 34170 17914 -24922 -98184 -109218 -100288 -87945 -62971 -10354 370 -47250 -69621 -107149
14560 -107149 -86019 -22842 3421 -23477 44623 51330 39865 64220 54815 -9707 -39154 -18940
14548 -18940 40046 32252 -14546 -16731 55536 60322 76451 50409 37786 24962 26203 40724
14536 40724 25203 43891 -35009 -75741 -8295 -15570 -5855 -8421 -64746 -75503 -78226 -75305 -36652
14523 -36652 19462 37290 3461 -11362 -17424 -16625 -24235 -37411 -38829 -29518 -97431 -98660 -82416
14510 -82416 -39887 20280 9903 -19913 -26614 -73017 -77629 -6670 36355 36264 52607 9135 13265
14497 13265 43486 -37767 -59578 -79872 -95528 -87804 -32982 -13134 -32493 -40437 4789 49541
14485 49541 27589 20551 -13531 13801 23919 35787 29196 59381 50342 -11268 -67603 -69291
14473 -69291 -30216 25790 18263 9181 -6356 1598 -37876 -35695 15870 66234 23268 -15888
14461 -15888 15580 75539 59299 -5781 15425 -5496 14833 65440 75221 22447 40266 38600
14449 38600 -31498 -25503 -42081 -85495 -93451 -81391 -39336 -17252 -47380 -17088 29320 45438
14437 45438 56100 60436 55243 29183 -4015 64986 87040 97986 98995 79419 62193 32028
14425 32028 68865 93904 94838 64564 105816 136208 60768 53339 70592 84237 104880 133847
14413 133847 108911 48264 52187 94482 156341 141225 68732 53157 45217 84406 50029 55628
14401 55628 16536 -31930 -1101 35549 -18283 -19589 9988 16590 38140 41138 3029 -42619
14389 -42619 -7790 41451 43367 29151 -21788 -86801 -89787 -68139 -63281 -9631 36566 64760
14377 64760 27006 34524 -9985 -93677 -42027 -9088 -29265 33587 4236 -85756 -63328 -3557
14365 -3557 -32686 -41983 -49281 -49684 -22763 -45293 -84632 -92826 -129978 -142598 -123095 -70324 -37265
14352 -37265 -28349 -12752 -38052 -70048 -122132 -163903 -171255 -156148 -172666 -152982 -115231 -100929
14340 -100929 -103223 -84267 -72411 -86999 -69579 24560 62099 86721 15929 -1343 -13146 -76965
14328 -76965 -74017 -3552 -10434 -48981 -71459 -70984 -69237 -50016 41740 49359 12785 -10837 -23387
14315 -23387 -45887 -18573 29990 59188 120489 146430 110000 61616 16327 4639 -57586 -63848
14303 -63848 -1338 45674 60072 61193 52434 81171 128523 96349 57832 24549 15951 48413
14291 48413 13087 -21659 -13298 -19856 43058 68965 28978 -7683 1471 -33266 -16324 -9788
14279 -9788 8385 69756 12111 -17475 22055 101376 114640 24231 -32225 -47446 -42716 -69749
14267 -69749 -116456 -125701 -104022 -132628 -134927 -136958 -125284 -87952 -24297 -20033 -10126 -24765 -66017
14254 -66017 -81483 -36792 -15184 -6672 -11756 -13893 382 46611 61015 18514 -51730 -60482
14242 -60482 -30313 -47170 -25423 1740 -12686 -21318 -46817 -30719 -30615 -20891 -28117 -39429 -61879
14229 -61879 -131223 -141629 -76954 -29774 -63281 -92240 -92751 -81659 -75594 14099 10310 -6230
14217 -6230 -70165 -44466 22699 73553 65200 5636 -56617 -2939 -19144 -23017 -15625 -30676
14205 -30676 -19622 -40874 -42084 -58795 -7432 -23426 -92262 -130195 -122973 -89225 -87841 -56228
14193 -56228 -34597 -42174 -39626 -14575 7488 15065 36893 30833 44838 38313 -8646 -73075 -78678
14180 -78678 -8198 31008 37639 47015 35990 65425 49482 98995 153116 110500 397 -26530
14168 -26530 -29646 12238 122805 157108 153943 71470 25521 36977 21326 -34348 -10686 62610
14156 62610 51832 46847 19248 -6322 -40165 -29334 11099 22075 -2494 26564 -6880 -39525
14144 -39525 -29095 -2517 -55891 -80075 -82874 -27033 -41398 -66242 -68528 -30644 -63565 -26823
14132 -26823 23042 21427 7186 -9483 14869 1685 -63392 -69196 -50283 -27607 27905 -24523
14120 -24523 -17477 -715 -4646 20072 1667 33453 475 -9491 17456 52781 45683 -25938
14108 -25938 8267 17197 42235 60856 53561 19672 -6415 19929 15763 -54518 -28199 23206
14096 23206 28590 63167 64855 34398 -2139 -6441 -30983 -82412 -95632 -116838 -121062 -68690
14084 -68690 -11613 -15474 -19246 38620 92364 131158 65953 17112 -24273 -16564 -8970 -12114 3245
14071 3245 3283 -3609 -83519 -114860 -61828 -78948 -120341 -143286 -83284 -50294 -61030 -62703 -66924
14058 -66924 -32357 -19048 -55957 -61543 -31398 -21337 -44883 -19834 143 -30178 -58602 -59068
14046 -59068 28238 60915 24015 -31072 -9200 18648 -1270 -25428 -26120 -50537 -54661 -61996
14034 -61996 -121361 -161773 -167885 -90416 -46288 -23183 -54490 -174313 -174585 -116215 -11208 13898
14022 13898 -9364 -26268 -22930 38693 49719 40982 98785 51373 26907 30183 -28439 -59845
14010 -59845 -20162 -82106 -123240 -72163 -50168 -33261 -7173 -25398 5773 21554 17588 38263
13998 38263 33969 29621 34260 32557 -7691 -25759 40675 80862 81388 35410 7530 43652 94656
13985 94656 75951 -6190 -83080 -98571 -47089 -4031 38808 38996 5820 -36720 -65999 -12487
13973 -12487 -15555 -34184 -53366 -63163 -71674 -21418 -44079 -64221 -75011 -42688 9898 44535
13961 44535 6801 -69762 -36376 -46041 -96556 -51438 -25282 -7834 6105 -33087 14083 -26516
13949 -26516 -79030 -80046 -61350 -94747 -118765 -87723 -75354 35831 111755 134932 72728 -14756
13937 -14756 -80331 -116349 -51960 -17484 2835 -17843 -65958 -45606 -31246 -11485 -2274 5951
13925 5951 -12619 -45040 -61444 -43657 -11818 -24686 -3712 41646 35065 30947 19704 24041
13913 24041 42803 21567 -45964 -5356 -26527 -56142 -37633 -45870 -30559 -976 15267 34904
13901 34904 57561 3395 9905 -26338 2111 13392 -43943 -86004 -97426 -109227 -73081 -57512
13889 -57512 -76360 -101422 -65051 -26774 -51464 -57213 -76371 -65368 -44658 -56689 -54288 34299
13877 34299 58297 24694 932 -13725 -53782 -30976 19132 41294 46555 34704 -6193 -42896
13865 -42896 -18802 24872 19884 -35558 -41943 -53814 -35184 -44075 -35845 -40964 -56933 -64180 -10696
13852 -10696 26844 60488 38331 19838 25730 -3310 41144 49881 -29232 -21281 14089 27370
13840 27370 37264 6456 -26447 -24193 -10006 -34163 -48039 -921 -9954 3537 2675 9993 28177
13827 28177 -2467 64383 52840 40921 114765 166030 142615 144874 77040 68432 72590 41986
13815 41986 1909 -8492 39101 14719 5828 -13185 12239 80971 124962 57576 24154 1273
13803 1273 30091 102305 146844 101020 61854 84525 51832 69907 68053 68670 69920 72815 36706
13790 36706 -25890 -31415 8991 46839 61983 37482 15955 -12238 -46537 -54036 -24476 -2078
13778 -2078 39609 18296 -14520 38031 25126 -19847 -5144 -12287 -67312 -114988 -70232 -48705
13766 -48705 11511 38635 -13495 -51698 -54862 -37505 -46112 -100895 -79002 -68815 3747 31735
13754 31735 35653 -3810 -87391 -64111 -37169 -3183 -24511 -32895 -20330 -2617 -891 -22608
13742 -22608 -48279 -95914 -70193 -73116 -66738 -115743 -99694 -40598 31448 37230 -28389 -1428
13730 -1428 39181 773 -41266 -68087 -48383 -20287 -57076 -27431 -19097 25983 49150 1906
13718 1906 15184 -15149 -71250 -55670 -34589 -76023 -74328 -65685 -110910 -106913 -74661 -72644 -96719
13705 -96719 -8354 37761 4748 17385 36046 -38414 -44022 -12224 43431 118254 117437 110437
13693 110437 76906 74439 86471 57722 31491 -485 -13191 -26883 -58800 -50714 -19844 9979
13681 9979 48213 47668 6827 -10281 -73512 -101883 -61534 5528 7660 3723 -8608 58269 100248
13668 100248 45600 -37642 -28648 -95 52136 25677 -3249 -41369 -84618 -105208 -71579 -38744
13656 -38744 -23890 5105 11737 71358 113682 123326 107701 81800 32287 -18993 -9367 12864
13644 12864 49503 57521 26270 2487 -37034 -17140 -53511 -23725 62774 76016 29428 -4065
13632 -4065 -48088 -55782 -38209 -17992 -40362 40566 127129 61667 -2665 -11170 37593 71063
13620 71063 34313 56882 21931 -13609 -49559 -16642 35407 62782 52664 15967 -21877 -4624
13608 -4624 -56828 -126723 -139499 -80042 -70436 -58525 -21586 -11141 -11916 6518 35232 66062
13596 66062 39264 11514 -43160 -37707 -47361 -65608 -31350 28639 28550 7105 32142 59867 40326
13583 40326 17707 31739 -9481 2821 -4119 59595 79892 40382 11031 -35371 -20379 -74238
13571 -74238 -68236 -52804 -33937 -31623 -98229 -103910 -43082 -23836 -71196 -71749 -93422 -63466 -87098
13558 -87098 -78183 -78665 -33755 -12059 -12874 45133 399 -64267 -41936 -40305 16939 42698 81390
13545 81390 47012 36541 4122 -19463 -15126 -2660 2086 -16225 6562 21306 -39154 -65769
13533 -65769 -52006 -49617 -11730 44252 40441 48572 5902 -25374 39783 51706 8253 -47080
13521 -47080 -103111 -53811 -2829 -24948 2350 18268 11336 31422 67677 51833 65935 44332
13509 44332 -2694 -25833 4142 102046 61782 35596 38520 54190 42436 12782 24871 -10371
13497 -10371 -823 24605 -17166 20331 9380 -37309 24269 31672 30533 -25800 -24381 -24833 -26655
13484 -26655 -1503 -23365 -57632 -55212 -62856 10802 6981 -37003 6753 -15400 -41524 -60256
13472 -60256 -62406 -49763 15564 80315 93486 108184 120327 105090 73294 -15347 -15910 -8467
13460 -8467 1337 44733 61103 39829 24599 38136 -15245 -13269 -6027 -53629 -104597 148
13448 148 62322 -762 -15387 -80580 -74209 -5550 -7632 -31263 -13378 -26856 -9116 50422
13436 50422 80357 40413 -12824 33171 82013 97502 69510 4052 -42624 -60907 -33094 11483
13424 11483 -13288 23861 14778 -30058 -48675 -11245 -46872 -70994 -55442 19599 22331 -27593
13412 -27593 44353 176719 155859 121477 45367 13307 74921 84956 47477 51037 58877 6345
13400 6345 -45824 -37809 -23686 -35401 -17991 -4046 37209 85446 72745 61553 1991 -6279
13388 -6279 -38134 -39883 -53492 -38000 922 7820 52528 37741 36127 15281 4727 17468
13376 17468 31624 -16090 13582 15404 -4214 -18305 -28413 -67352 -47954 -9083 52815 58900
13364 58900 27241 52135 65458 72774 92971 147218 112899 1461 13098 68694 10469 -65783
13352 -65783 -117670 -77559 13073 93606 57158 275 -43141 -99337 -52863 68468 143557
13341 143557 153069 88643 15959 -30436 -31662 -7558 36804 9507 29196 22154 31411 850
13329 850 394 -45336 -61765 -38369 62197 66823 28827 56698 13279 -68673 -87026 -2591
13317 -2591 31691 55069 41931 18836 27566 12549 10485 4867 7709 44251 56510 46950 67102
13304 67102 46609 -6284 -18328 -34325 -11225 -10073 16335 29775 -5258 -33174 4666 60294
13292 60294 85023 92558 109961 44246 -3099 30068 21045 76350 84509 33565 -5792 53605
13280 53605 41850 41529 14455 -16547 -33956 -83896 -96702 -48425 -26170 -9661 49442 74734
13268 74734 54292 -4452 44875 63881 31900 48003 40654 -1752 -6483 -43421 -51482 -10972
13256 -10972 71993 83179 83866 80114 107819 139377 91437 78224 121940 148514 91674 31063
13244 31063 -19475 20768 35484 57666 44360 23992 66984 66989 47014 10111 -9756 11370
13232 11370 20109 35248 40840 59720 45608 71735 59632 21234 41244 50252 42745 41056 43637
13219 43637 28033 26319 66878 87300 138059 60835 59878 50091 52769 90972 75381 54763 55676
13206 55676 -391 -103762 -73938 -4294 -9683 -22085 -6390 45214 67516 -2084 -88798 -76356
13194 -76356 -66650 -22083 49350 77094 89146 28689 -17679 19394 39699 29218 12348 48673
13182 48673 53549 -27127 -41825 11598 -15817 -20604 72412 165 -31523 21277 101604 84568
13170 84568 46585 12082 -50587 -48217 -20574 23852 28888 29993 53337 21682 44049 26692
13158 26692 1412 4086 60483 64083 108003 55043 56042 58000 24366 -17330 -23757 -19058 -4350
13145 -4350 36703 108293 100440 94802 19704 33544 38209 65144 22459 7845 47753 85411
13133 85411 44048 38209 60421 14963 512 -3312 -51311 -60333 -17675 82348 121940 92105
13121 92105 89908 131208 78817 53233 25507 7678 15889 2240 -6054 19681 79420 69491
13109 69491 29147 -3654 -12412 31775 32407 -11459 -36929 -21918 -4903 -58677 -58766 -13933 31487
13096 31487 86148 53535 -20641 -34231 -37274 -36940 21467 43506 18644 2983 -2461 27479
13084 27479 74862 108140 75523 -23956 -59701 12560 851 16840 12766 -37438 -23360 -21030
13072 -21030 -19515 52485 120459 93714 93774 81738 104462 46284 63658 69431 100855 88785 52510
13059 52510 23883 17761 32305 2514 11974 104342 107691 8654 -39097 -44506 -11058 12854
13047 12854 -14856 -27109 -2290 1447 -14577 41279 46756 -1570 -36785 -57184 -55619 -37330
13035 -37330 16242 60880 8972 -12566 30592 33344 37258 2892 -48758 30916 69125 33343
13023 33343 102904 133284 93343 112263 106952 134471 153341 163840 134357 70481 26931 29753
13011 29753 92862 155261 147917 112362 85048 61348 22132 57061 49898 44771 57784 65034
12999 65034 61770 40443 39349 43815 48459 12066 6005 73642 121244 134735 58504 -22055 -38694
12986 -38694 20734 105008 92939 92449 110710 131834 96516 62307 96931 95026 87035 107538
12974 107538 96806 15664 -18812 -8432 29393 30169 54365 13237 -7803 -651 -1844 -6160
12962 -6160 24123 70203 110830 138839 164598 174404 154823 136774 155841 146766 127939 156886
12950 156886 164995 176252 139186 90534 128529 128174 147577 65472 -28703 40977 118856 126076
12938 126076 97909 116649 180419 154315 98327 52380 65776 43136 20773 5145 -49291
12927 -49291 -42999 -55851 -108904 -84161 -10870 -6031 -27176 -18527 474 20517 32797 37647
12915 37647 54313 46829 82217 135586 110919 115522 157233 147796 166641 200942 202450 175587
12903 175587 188258 227028 209716 250826 266456 299746 357073 432722 584213 724930 878402
12892 878402 1027929 1277462 1594738 1888544 2158639 2240717 2227074 2162771 2237852 2375429
12882 2375429 2389629 2281605 2078076 1805840 1512514 1188058 978203 828440 640448 503204
12872 503204 439374 384018 278746 270173 302245 309184 224142 184300 200504 201760 254809 256637
12860 256637 217326 200436 220104 185297 145709 206918 223980 155178 164806 186890 86214
12849 86214 81360 172960 216251 179677 98750 31802 10698 26940 49063 28181 40432 96188
12837 96188 149602 154847 109131 119442 120405 121785 55575 18941 33005 64752 86390 109616
12825 109616 60432 27048 3668 -1023 -4943 18476 60373 108201 64308 9295 -25097 -31036
12813 -31036 -6371 -19585 -15628 -36495 -20534 -1231 52400 110012 132382 119554 64053 20240
12801 20240 47814 67851 26563 42495 12598 -5591 -1713 -38826 -30283 42248 72304 39217
12789 39217 33340 73651 94735 131004 107376 102136 122346 122962 160454 139343 114802 145987
12777 145987 131885 113346 62788 29585 21993 68603 94717 80962 51768 50752 32172 75377
12765 75377 96870 166511 259829 326337 300924 318913 335536 361093 422193 430524 501207 730748
12753 730748 943102 1143689 1340073 1450523 1417533 1381529 1397364 1358073 1301419 1132871
12743 1132871 933213 753497 617944 568354 422168 291615 242872 281523 369027 494522
12733 494522 515809 420590 380509 414022 404817 423383 457930 466907 429418 431789 387186 270211
12721 270211 209260 178574 192228 172565 275031 269584 207629 185480 171777 170938 192295 165325
12709 165325 218178 190424 118822 126931 146387 137259 131471 121984 98048 111308 79019 56935
12697 56935 112442 137548 179988 219313 189124 178005 154633 185678 164386 103335 77282 118094
12685 118094 136876 140605 97939 21253 46840 118146 131215 107868 70473 26810 34569 -2285
12673 -2285 22746 88332 127920 103787 86519 48234 94806 95641 52001 30093 48635 22878
12661 22878 39426 43617 16654 58996 84078 63479 39411 -11839 23350 58766 117835 108256
12649 108256 54184 16667 17593 -19973 12041 -33606 -75801 -31293 -6711 -33744 21217 205361
12637 205361 352213 494981 548338 556296 606954 667337 829873 1013734 1138454 1221451 1194172
12626 1194172 1087185 1000402 926309 863645 801198 798585 786149 754396 684193 689415 732453
12615 732453 738700 720759 728699 727241 732431 753410 804561 897936 946709 963732 939739 908711
12603 908711 845833 806603 785898 786779 777245 740520 703967 632040 568796 597284 624298 637450
12591 637450 643424 590894 567258 535874 494021 532001 589462 591704 592982 577038 592343 606285
12579 606285 675870 696239 746027 791229 776890 748240 762161 795985 836723 862187 855670 876892
12567 876892 918752 971062 1043885 1074427 1065714 1096319 1128713 1197744 1234596 1265013 1328285 1346229
12555 1346229 1383242 1419675 1490731 1541380 1535557 1567057 1579196 1637043 1711633 1730678 1769296
12544 1769296 1843321 1872233 1911863 1923934 1945521 2098579 2228709 2282574 2272234 2278590 2355939
12533 2355939 2425727 2550359 2698496 2829675 2932173 2967523 3036863 3153689 3299189 3452234
12523 3452234 3623772 3855598 4074216 4282216 4490517 4781290 5115668 5478218 5794031
12514 5794031 6150015 6587403 7182853 7903202 8775513 9826029 11127944 12677213 14417472
12505 14417472 16102758 17707973 19183264 20610575 22240015 24123275 26198674 28413188
12497 28413188 30738131 33357457 36323795 39844265 44184026 49945815 57844055 68840914
12489 68840914 84172598 105659628 136532154 181924113 247876651 335491052 426990934
12482 426990934 488359759 502752533 480382358 450327140 444972196 472001263 502498400
12475 502498400 499146608 450512922 368761630 280213457 207150773 155078198 119542776
12468 119542776 94921891 77441832 64670460 55316514 48464238 43282363 39159467
12461 39159467 35695004 32742472 30249269 28143845 26335376 24565609 22826954 21104306
12453 21104306 19407883 17921914 16694719 15368503 13965850 12510274 11180698 10095037
12445 10095037 9217101 8455489 7851585 7308903 6877370 6524038 6210791 5853317 5529693
12436 5529693 5303915 5062409 4745858 4479908 4309136 4130533 3984440 3825585 3669756
12427 3669756 3489500 3299586 3170383 3092084 2950159 2854293 2678212 2595801 2503255 2379103
12417 2379103 2309634 2300661 2261682 2188944 2119428 2018124 1923720 1864404 1814993 1794460 1717862
12406 1717862 1671169 1706462 1712999 1628809 1486313 1429713 1455335 1501582 1511781 1498998 1407344
12395 1407344 1335834 1328267 1258249 1187741 1155273 1152667 1146152 1115871 1124334 1127507 1100937 1108903
12383 1108903 1133381 1141052 1180533 1174187 1163349 1118146 1057593 1003210 988986 969378 966831 1003257
12371 1003257 988464 956250 921183 945781 931919 931805 925635 890843 847905 839237 855547 838601
12359 838601 782390 715013 786213 886880 924715 834278 642491 548730 535063 523192 588540
12348 588540 596762 500823 403118 343410 327795 344758 328394 329150 332655 302325 232737 208925
12336 208925 195586 171950 155286 99734 -11046 -116762 -240379 -288497 -288949 -141605 27000
12325 27000 143656 222320 258107 277823 287692 370877 580810 795187 897557 940779 927510
12314 927510 845048 787177 776058 729301 686448 712791 722638 695774 656288 680252 671963 682532
12302 682532 704212 706790 644243 620212 616200 660977 673873 640157 641898 553152 477678 519006
12290 519006 531210 502939 529915 500768 520118 499730 504044 581964 623934 594390 517512 455377
12278 455377 417392 414343 472314 443839 447150 451950 433727 440560 450894 421412 349018 321973
12266 321973 312550 323149 399751 413999 363737 362131 387341 408503 412218 358057 329547 352461
12254 352461 392657 348325 380700 411146 465727 438044 385308 327213 305947 331992 324020 351310
12242 351310 355523 390436 388872 367438 394966 425293 415252 419551 416704 398747 445309 545214
12230 545214 527755 494804 518177 530044 490784 485036 509009 448583 452810 492613 455329 456263
12218 456263 551084 517090 413351 353969 349834 317225 303350 317285 323129 346746 348649 383349
12206 383349 438095 463398 460015 454180 462644 519046 519654 475809 459476 469875 424906 416193 447012
12193 447012 454428 454490 426526 376098 342428 339528 372583 394920 417857 390301 361225 368977 413667
12180 413667 377658 345526 388430 406208 432861 440289 403488 382209 411560 468407 537836 512881
12168 512881 471265 397254 440070 474565 444090 398147 370809 408680 433311 365208 327450
12157 327450 370309 425961 410650 345989 291379 294560 312281 326114 301295 314364 351540 392153
12145 392153 414703 480610 478057 458408 442969 463653 484069 470013 485764 470437 489721 502244
12133 502244 473944 424020 443836 514067 556021 524283 502313 448801 437915 459453 465665 447436
12121 447436 434694 440249 492552 585895 610534 638389 662263 693047 673668 612251 548728 573887
12109 573887 578163 658969 653770 613843 596717 569604 600701 620267 642122 668190 721738 679102
12097 679102 595081 573276 593176 554175 572213 627699 690483 757894 778426 827901 876204
12086 876204 944131 1044866 1069030 1035809 1053349 1113114 1128167 1172480 1232354 1399832 1621761
12075 1621761 1802258 2066265 2333449 2619080 2845841 3011408 3090085 3060887 3065955 3129240
12065 3129240 3200971 3227081 3097507 2782120 2443478 2190154 1954666 1726853 1649804 1557972
12055 1557972 1407862 1397295 1466519 1483311 1478816 1443071 1438489 1388619 1384558 1398699 1377724 1472216
12043 1472216 1560173 1614362 1619056 1637208 1637761 1677701 1726367 1788110 1758097 1717194 1719372 1738342
12031 1738342 1727539 1743508 1713123 1666247 1687364 1743133 1834500 1892648 1960424 1944664 2002798
12020 2002798 2047228 2046839 2053445 2116579 2203342 2269778 2336687 2375177 2454766 2583150 2640707 2658081
12008 2658081 2684809 2770284 2889900 2966185 3078885 3180055 3249655 3289848 3383564 3573924
11998 3573924 3748828 3902932 4088376 4281340 4550186 4868635 5074857 5174881 5237479 5222927
11988 5222927 5281145 5472189 5625990 5791293 5981402 6209188 6485773 6735036 7009062 7357279
11978 7357279 7653112 7926672 8233139 8636636 9072022 9493726 9954979 10396407 10852612
11969 10852612 11362587 11950452 12539259 13181952 13890919 14563035 15307094 16129091 16971705
11960 16971705 17791001 18623583 19482789 20394480 21292356 22278178 23335632 24323387 25244100
11951 25244100 26231814 27237392 28166274 28852429 29378875 29742932 29930262 29969681 29968089 29834586
11941 29834586 29533356 29126866 28690024 28135847 27422174 26613423 25736355 24843085 23962175
11932 23962175 23048122 22140490 21212676 20303340 19365735 18490348 17660345 16827659 16012982
11923 16012982 15227235 14507036 13804804 13112668 12471377 11932539 11406773 10885900 10393473
11914 10393473 9956986 9536974 9116266 8746022 8426215 8090705 7717159 7393376 7146695
11905 7146695 6910597 6600765 6254616 5977235 5773300 5592790 5438336 5228257 4984943
11896 4984943 4809724 4681161 4527755 4385695 4236057 4092060 3948748 3825522 3729734 3623762
11886 3623762 3516136 3438590 3342624 3252539 3157521 3061723 2982637 2890735 2750947 2674802 2617345
11875 2617345 2528849 2439814 2340583 2276618 2233456 2195140 2174529 2145735 2077565 2024986 1975728
11864 1975728 1931040 1874678 1819672 1776014 1735868 1680174 1681848 1693757 1689570 1608584 1579715 1554013
11852 1554013 1498168 1454464 1455995 1444601 1406204 1356565 1361314 1305202 1307742 1311743 1238365 1163783
11840 1163783 1174829 1152707 1144893 1137474 1148062 1169851 1146743 1086434 1043200 1063398 1076218 1079785
11828 1079785 1009215 950341 933608 930708 935147 915673 870977 833041 840721 861082 872672 863353
11816 863353 804127 772528 741359 716554 749804 720960 757579 741645 740948 733661 725080 676140
11804 676140 643718 683563 676971 634857 619702 583244 525585 548232 551819 583500 590219 530943
11792 530943 500274 458426 476053 523286 503989 462161 454977 434806 454681 479565 509285 515515
11780 515515 534042 534981 523906 526430 467529 424250 373854 348229 324207 347772 352533 333275
11768 333275 354908 429197 467670 506748 489909 459040 441453 434936 454866 473383 493827 507810
11756 507810 439335 390210 311595 293429 356782 396016 408728 445824 463670 463344 474029 398371
11744 398371 336664 347560 342332 313237 329421 382122 390523 400543 388725 389805 378980 425346
11732 425346 437692 381738 330364 334701 338210 330741 380486 338580 318751 281667 294060 296352
11720 296352 266553 297051 360890 414997 295035 213458 178743 221433 256656 251773 256670 237972
11708 237972 214872 231336 316433 345443 356474 337561 355592 341485 352803 316210 260871
11697 260871 295580 260118 283938 284487 277463 258669 282115 280661 281408 321219 346994 330767 396427
11684 396427 445162 386223 296965 302392 284195 267678 246490 284445 259091 223246 164292 117149
11672 117149 128497 161777 117825 167897 242367 261798 291708 321602 294367 311526 289647
11661 289647 239343 209910 253295 289256 228109 243798 330305 314697 270461 253553 265058
11650 265058 226794 149871 118332 133395 158075 115307 98832 107955 108266 134536 188181 213655
11638 213655 267859 271127 241222 191290 192448 196682 172056 102012 95125 131400 182702 216497
11626 216497 208534 207546 217465 154017 155361 167634 177208 225567 246103 197702 212134 226914 183696
11613 183696 209060 225097 207953 177344 188327 158168 115154 162177 140585 105957 135980
11602 135980 185684 161780 113993 113879 132893 139226 111515 153482 219809 227340 202544 172363
11590 172363 212405 195493 110991 129682 149835 128406 130958 145580 135309 84083 100887 109926
11578 109926 62484 41616 40572 45864 73686 139896 160737 124779 100855 80918 22803 -9342
11566 -9342 -3331 110698 191225 145276 80652 86066 121815 77237 35052 2295 39926 71264
11554 71264 100698 60799 22954 59648 116559 92696 115391 215750 257808 204440 127406
11543 127406 101605 125493 155720 145660 106050 121663 54322 13590 60625 135292 175627
11532 175627 99730 76869 81742 127826 151654 174194 175576 182864 189844 232769 257822 278354
11520 278354 232231 183109 120916 33988 45143 107606 87661 118645 140638 138791 121588 96702
11508 96702 87491 62253 59034 116773 88479 109515 128959 122345 144317 157161 126123 101311
11496 101311 66091 83111 99653 130323 165193 177471 146034 144599 96934 89676 75890 84344
11484 84344 75201 89640 113766 128883 81910 102091 126567 165975 172206 134860 102347 80116
11472 80116 94368 132102 89909 53993 45669 76540 36417 1740 18049 71652 51952 101099
11460 101099 83363 66798 67034 61267 66955 36399 43942 140591 182257 203598 171681 166739 138450
11447 138450 121954 121050 93689 76467 111185 71190 41608 40008 79338 9429 22803 61185
11435 61185 97935 89011 110665 91142 93378 120578 125069 143276 116298 108623 111916 120676 124537
11422 124537 93160 78348 41074 -31601 -74385 -23993 81351 142639 167983 155970 183794
11411 183794 192242 107901 62867 39122 49521 115083 86038 65557 150954 106091 31020 16196
11399 16196 6576 11210 4999 14757 38464 20854 12344 -24909 -172 -46552 -64385 -17798 36987
11386 36987 56884 45838 -2401 -32116 -21292 -53551 -48869 20281 105724 111393 61353 95027
11374 95027 52456 -51075 -39761 -25600 -29753 -20184 -44376 -65798 -63086 -90111 -79394 -49421
11362 -49421 10516 32046 -9597 29604 29988 16133 34461 33387 102239 164412 69517 67962
11350 67962 60122 18723 -10606 -15108 18167 26219 37105 7624 -69988 -121227 -126839 -117157 -41863
11337 -41863 54313 58561 27419 50794 119654 133533 125903 96998 75030 66496 70339 75602 26861
11324 26861 37755 39115 37687 66852 24700 18528 67983 74672 29070 51028 32919 97762
11312 97762 73378 70084 50139 86048 67395 25321 -44026 -20775 8897 11252 28707 97690
11300 97690 171409 164571 124899 133774 166080 172764 138154 125660 94641 91091 110951 139542
11288 139542 139345 158899 173276 169363 103818 87335 111076 86784 20019 38134 61901 49197
11276 49197 27528 -17037 18442 52870 -30209 -47860 27875 66551 54536 34455 51168 75102
11264 75102 135388 117551 115018 114254 92342 109120 138124 97917 14018 41237 59008 40632
11252 40632 743 64563 83108 112209 110008 81582 78554 101856 22373 -32457 -50796 -60380
11240 -60380 -37359 -52121 -93088 -71858 -12273 21460 45477 55124 74800 50918 89286 110266
11228 110266 83316 104212 74578 52170 65911 38471 21727 11849 47871 125527 137369 94307
11216 94307 31557 6276 40338 70027 109064 85753 28028 -7972 2157 55893 35389 30326
11204 30326 249 12508 70462 80888 66059 35215 77558 53754 19563 -6052 -725 25653
11192 25653 55401 42168 2605 -23756 -51075 -34250 -37872 -19647 14738 18330 -4282 6406
11180 6406 54714 69154 50683 36970 22366 31767 72928 93422 40432 33018 38793 73073
11168 73073 87230 111802 116099 117398 107436 58324 44484 57144 48339 33145 12836 37197
11156 37197 44753 2851 32147 147807 134777 115211 64661 34293 15481 31793 24361 -9279
11144 -9279 -28278 -32832 -35340 -29855 -11653 -21558 33917 16696 25640 42289 11687 -2809 23735
11131 23735 -7922 -12237 7596 23646 17198 29992 7691 -6040 -27478 -28791 8233 -10447
11119 -10447 13413 45646 40928 -5079 -62530 -45139 34462 49403 -23240 -47782 5515 61034
11107 61034 36900 42436 112756 123296 54072 12509 -23488 -71637 -27261 7829 45925 17760
11095 17760 25123 13966 -13436 18781 31214 68151 41498 -16301 -9839 32202 23675 61835
11083 61835 59182 24488 52078 147199 95989 79316 123447 128122 100592 -4268 -4970 59591
11071 59591 60564 41043 56310 69870 37930 15239 13615 28626 42386 4985 -4103 17412
11059 17412 42830 61733 40640 -51362 -44055 -605 15710 46292 48158 14562 22675 29502
11047 29502 19897 22337 41341 107101 175840 95375 11976 15287 20311 108949 173132 208686
11035 208686 196070 130206 121851 114601 108063 145392 189684 258251 318351 348801 397429 399081
11023 399081 350280 304575 267169 275939 359346 363008 357883 384872 450709 529890 504939 447929
11011 447929 391197 289168 296120 320610 269295 269069 325622 312219 374223 401531 397423 381302
10999 381302 345117 295793 230172 192266 206654 202524 178454 179537 200412 169210 183326 204964
10987 204964 227020 177286 124261 141203 140232 128139 85043 102990 -3370 -58912 -70876 -96197
10975 -96197 -36506 60315 48161 -27341 -10233 20724 55906 83182 39145 -4320 -6086 45808
10963 45808 86776 30543 -25139 5917 73770 102238 99095 124871 142763 171519 125494 72463
10951 72463 100558 88507 68480 19833 73870 106375 33437 35535 21661 -36867 -53622 -28915
10939 -28915 -12344 -2019 -41514 -35565 -34972 19174 54349 73625 8195 -35379 -15905 10105
10927 10105 29020 20508 22412 4652 50091 72009 63446 32717 40572 64076 34140 16710
10915 16710 1737 24096 492 81030 148756 145900 151810 137269 66125 -2459 -44998 -100139
10903 -100139 -20466 46127 -20991 -31627 38192 88892 28040 -14873 -28510 -30841 -62168 -69294
10891 -69294 6980 56966 69350 59215 42465 80763 116377 59323 2280 23813 61359 39943
10879 39943 -1411 51468 35926 21521 39709 -9635 -95489 -88913 -28742 4389 1598 -79251
10867 -79251 -65819 -64977 -51088 -11898 95167 112323 84125 97563 116281 151063 105500 92160
10855 92160 94153 30350 -9648 -5468 5983 5021 19506 6274 -3962 -54207 -31449 23853
10843 23853 45359 65369 65245 15290 -6343 25276 90703 170103 127536 68112 83635 48856
10831 48856 25730 -17019 -67972 -15186 9216 33180 56732 39979 36742 39333 42228 85773
10819 85773 81637 71919 65281 19888 -3470 3256 -30577 -12866 36064 61514 34132 53888
10807 53888 46010 49223 4468 13201 -57606 -100526 -75506 -86135 -51085 -25583 -20843 -26382 15559
10794 15559 -33095 -15791 12120 3526 -19197 -22172 -18407 -23531 2453 48828 32793 -13976
10782 -13976 -23101 -22666 2041 4598 2082 40612 35684 47058 51227 89097 84374 14973 16191
10769 16191 71244 30266 -33534 -55607 -40467 22654 51783 68335 -11975 -65034 -17913 -32890
10757 -32890 -73282 -57987 -74358 -93250 -81305 -32183 -15595 36266 43474 52733 60026 122355
10745 122355 132965 76090 64514 50988 124102 147799 159080 236334 278740 234861 82135
10734 82135 -22939 34275 48798 71176 128603 179357 138271 79827 78359 46572 65780 79651
10722 79651 128749 126825 142171 122863 44574 48413 76331 143199 158243 150964 169741 109521
10710 109521 97211 156148 197506 224381 174503 183070 197903 213569 214309 146025 33881 -18243
10698 -18243 19226 78006 155260 226099 242209 177826 137521 121228 79127 55337 71456 100231
10686 100231 60111 64571 91168 148160 120645 117495 150001 139176 96971 82624 111511 73459
10674 73459 70808 157057 170994 128880 116314 162714 154831 115323 103946 151456 170857 169830
10662 169830 203287 242011 234038 252857 318858 305966 275383 285495 322527 347750 294987 322231
10650 322231 318531 261883 239010 197601 178639 207281 316238 429504 450993 483330 503012
10639 503012 518421 501040 543153 524392 546473 629486 652821 674415 736183 790785 807365
10628 807365 876701 954792 1051331 1214574 1418096 1653924 1833259 2051201 2317218 2541416
10618 2541416 2805280 3189989 3759439 4458245 5398987 6779624 8609269 11041122 14223978
10609 14223978 18069154 22191072 25705167 27835705 28262127 27506234 26419415 25731460
10601 25731460 26179934 28121476 31923932 37726061 45362759 53494943 59704910 62035416
10593 62035416 60309395 55935218 51033070 47400893 46131986 47608873 52116757 59636310
10585 59636310 69421640 79178035 85384408 85567481 79868480 70655560 60987804 53197785
10577 53197785 48372778 46523504 47451955 50826020 55818225 60558095 62553468 60432008
10569 60432008 54581222 46818471 39195170 33099783 29096088 26959559 26372425 26879698
10561 26879698 28007193 28877712 28565679 26584642 23198395 19190456 15308793 12059775
10553 12059775 9538318 7680436 6272184 5255433 4465603 3846356 3356011 2956351 2650492
10544 2650492 2420153 2177050 1944822 1788177 1712444 1625776 1472811 1321948 1255510 1181533
10534 1181533 1110658 1110776 1038272 972678 925725 913808 944611 903697 891461 797128 759518 702466
10522 702466 675123 634151 587340 611081 618587 594997 614075 579679 490316 462976 463777 431735
10510 431735 421511 437896 448803 437206 466422 444764 468508 469848 479498 514391 526284 627947
10498 627947 715050 821862 991966 1294045 1662315 2175743 2691289 2924005 2874579 2533065
10488 2533065 2143748 1959531 2045090 2362081 2790994 2950806 2759929 2358718 1808334 1338376
10478 1338376 998504 771517 600330 507546 491405 477804 422028 426925 445756 380398 317378
10467 317378 287697 244405 181924 243355 259867 219096 244599 266045 241526 198390 157955
10456 157955 126771 106759 139791 44833 -30094 -84919 -45820 48242 109393 114580 98624 58561
10444 58561 9746 -1211 14851 77891 32572 20582 23862 15745 112148 131470 141035 111982
10432 111982 131396 84756 62107 37817 34399 65629 150620 185437 167405 192333 188303 155176
10420 155176 80829 -5857 -31516 -2285 59580 114944 149732 113418 57949 84074 65904
10409 65904 39948 78158 97555 125788 161576 152691 122142 130830 132356 151874 158655 166479 134852
10396 134852 95922 130148 167693 175713 140292 185427 187859 197814 180382 117460 102039 118035
10384 118035 114559 148070 145860 102798 75160 62049 64657 68484 74701 103136 120762 120220 94047
10371 94047 92166 148604 131807 122776 129545 166717 158883 183014 158937 138108 129877 159538 173789
10358 173789 162973 140361 129731 130337 106601 70725 61112 75197 67658 66580 34749 55133
10346 55133 80514 123884 139270 184327 147796 123028 106128 81771 30037 59452 87867 94620
10334 94620 67772 10170 16486 62731 86766 51787 -5330 -37255 -49976 -8687 45882 125684
10322 125684 191654 182623 179955 149736 128920 156854 187198 200642 146530 88998 35573 -8582
10310 -8582 -11831 -10295 -31481 26882 54013 111339 147634 166574 190495 199496 151099 148342 134323
10297 134323 117052 159686 199641 161019 136234 152972 165122 153776 88106 5810 30839
10286 30839 40053 -11941 -35178 -28479 1001 18080 70512 67583 68846 119066 79181 95909
10274 95909 140004 111189 71451 71200 66923 71825 113135 89814 88392 59910 6324 -42616 14026
10261 14026 105559 128556 110549 131057 187571 191169 201570 213241 182681 87931 72008 119944
10249 119944 74140 -13971 -24557 59139 121114 120283 74836 51983 37441 39420 20711 -732
10237 -732 63468 82141 48003 -33446 -58286 38705 117637 136470 134397 163450 115431 90863
10225 90863 -10218 -35960 -17517 -9791 28314 50562 9053 3185 13795 5457 -70740 -64281
10213 -64281 -45796 -46116 -53768 -16929 38494 49738 42424 49226 98741 115799 110768 129915 123555
10200 123555 129791 149181 146183 65589 8277 38030 76335 71548 70217 92569 115353 108267
10188 108267 106375 107619 99997 33823 1319 24251 59324 91991 67319 74161 72550 61447
10176 61447 120200 129450 135679 178974 210675 174212 145293 93918 109591 189117 180797 190301
10164 190301 234967 220992 240045 233834 302716 379245 410228 366819 356264 344400 276602 314103
10152 314103 356844 376867 398047 471068 536433 589003 569013 525745 485744 415747 419679 383677
10140 383677 292773 235806 243114 340154 371703 329689 299648 307526 289277 235658 219908 209340
10128 209340 196018 170600 170176 304984 280434 244809 240836 211960 196555 155911 123717 150033
10116 150033 104037 82807 131242 116345 126223 70945 57943 96391 124283 136625 120571 99548
10104 99548 102645 131832 72052 41559 54909 71349 100220 16028 -62099 -68065 50094 38426
10092 38426 29617 34325 12572 27614 76074 70860 72901 57361 32488 -12306 6591 53838
10080 53838 51842 54236 68111 83977 74427 38027 36462 2979 -22088 -38222 23624 48595
10068 48595 46950 36110 64414 65932 13225 34585 100062 104343 89350 32869 -8442 35718
10056 35718 48721 70332 118344 136836 64871 10482 47494 95802 122289 172960 168422 96326
10044 96326 82068 106506 73385 44367 1956 55614 58540 34649 71290 27658 28270 32844
10032 32844 111066 121473 122015 79371 101424 103240 71947 74882 9748 68971 37921 9625
10020 9625 35728 29179 55848 33134 -93 37026 78750 89228 58717 39684 25508 2365
10008 2365 5478 39739 54168 28396 70023 13774 -30383 -31005 -63088 -34359 -39177 -43331 -42643
9995 -42643 16899 19591 38843 37709 29863 20098 11187 -11096 -74544 -14715 11451 31115 70378
9982 70378 76001 105337 65201 44179 39142 43019 61206 86493 82148 119200 122205 76863 57460
9969 57460 44963 -14779 9794 16319 26498 25473 -11891 -28022 41051 65450 966 -14188
9957 -14188 -24354 -45077 33995 68604 89973 59756 42629 78966 63058 67556 34755 18724
9945 18724 31818 -2564 -6768 -4774 6732 38722 18494 -34545 -43217 -35422 -25616 49030 58236
9932 58236 99494 53681 69861 51668 -15543 -25863 -59021 -27016 3957 17689 54351 33968
9920 33968 70224 86562 128886 61956 59599 93998 74190 47259 14782 -31823 22061 41727
9908 41727 10636 -1572 2944 -1185 19201 81435 60916 101577 95587 85803 92870 46899 -3297
9895 -3297 -43587 -57991 -79771 -40046 48666 60967 77509 58082 57034 50246 15614 40445
9883 40445 45566 29886 23968 24514 21437 -2302 -33943 -52455 1777 -17830 -71140 -54695 -30702
9870 -30702 -47346 -27251 49688 50533 8795 51861 44336 16450 -46284 -105084 -140741 -182245
9858 -182245 -136589 -13767 29706 57015 98436 145051 102105 80353 76298 63647 44367 24264
9846 24264 -1695 15905 32178 86034 37273 -447 -47957 -64398 -50369 -27995 -66276 -52789
9834 -52789 -379 62153 95546 80302 41202 25331 53182 20994 31 42400 49825 63759
9822 63759 23473 23129 -602 62160 69012 45286 72274 -12414 -56018 -30853 -8446 -13643 1784
9809 1784 -13348 -1745 -56357 -63937 1156 35664 65940 89190 78417 13370 42169 104503
9797 104503 84404 61826 94650 51798 44503 36429 7577 -12835 -2193 12080 27682 34071
9785 34071 39249 23963 20752 1015 80835 146269 138092 96146 77209 36707 37071 35173 20634
9772 20634 -8641 -38042 6014 96688 129815 156726 165925 161388 23888 -42517 -29832 -21859
9760 -21859 -15423 -44152 -51650 41882 114955 91738 52569 79228 107029 65801 39327 42723
9748 42723 64191 84654 48280 70601 143009 90441 70930 70489 75034 87045 82959 35131 -22981
9735 -22981 11759 11226 -35229 -16060 -9672 -28275 11072 63451 -10050 -8013 53158 34126 10279
9722 10279 13655 -8967 -7194 5569 9834 -10612 -3448 -2467 25180 24500 5743 -22818 -44766
9709 -44766 -52978 -22143 25329 28076 -12377 -65935 -128719 -121584 -58400 -68631 -103337 -69573
9697 -69573 -41322 20601 64074 83992 32202 1195 -6250 -36674 3178 11943 55546 81846
9685 81846 90062 26867 4514 14583 53342 56005 75199 38287 28113 26415 48436 43138 -29412
9672 -29412 -107491 -104560 -69483 -36499 26251 58696 94374 111837 105615 98885 32333 -32110
9660 -32110 -43319 -11144 48216 76789 123962 103423 76072 67611 85219 189375 270968 264841
9648 264841 216915 99044 88126 66441 39840 100725 95614 87656 110067 117867 101076 98866
9636 98866 154123 159584 94109 99201 111558 50536 11561 40145 48069 -7223 -55749 -51632 -36124
9623 -36124 -18273 26871 13241 73033 51410 35199 38942 97690 61289 -28337 -22174 56156
9611 56156 92388 72885 50932 1334 22864 16761 -28086 -30047 -12383 15116 27337 2819
9599 2819 2997 23858 48532 32467 52269 68840 61344 47272 14576 -26754 -29814 -1284 16815
9586 16815 42534 27335 15724 6959 -8032 -43152 -21732 -37014 -50287 -25254 -31594 -32010 -59342
9573 -59342 -62171 -50763 -65913 -84668 -15471 54001 23465 20993 -6786 -24579 1112 42139
9561 42139 43020 40032 26336 -32881 -76881 -48276 -14221 79861 46354 -38466 -69673 6062
9549 6062 70677 73039 59653 29250 27679 -17029 -68562 -36695 -39026 -44933 17647 1596 -10278
9536 -10278 32232 29152 8805 27306 23518 24423 28506 64299 117960 132926 99501 76098 68785
9523 68785 36463 -25045 -49702 -52362 -36005 -41387 15694 45340 56150 88994 44456 20221
9511 20221 2807 4305 28898 34587 36145 33600 10823 -21159 -83153 -96963 -93234 -91183 -127126
9498 -127126 -85020 23667 4720 -36863 13390 77959 172648 213217 111886 36317 8747
9487 8747 8379 26123 7919 29702 118490 89219 46951 88251 110928 71014 48231 47260 32749
9474 32749 46224 80737 61697 37626 76819 70913 -49288 -100523 -124543 -127416 -95784 -7083
9462 -7083 10729 -4802 21904 40980 2495 -6738 44572 28554 28546 25517 38993 53321 87391
9449 87391 136685 139746 105866 46969 81077 117991 116866 73663 28674 52430 19670 -47936
9437 -47936 -62012 -37689 -63365 -65678 -64193 -65663 -104365 -49949 -52848 -55694 -21448 -41401 -54761
9424 -54761 -58910 16524 88493 107497 118897 107483 79309 62078 -17653 -43547 1221 27115
9412 27115 14260 38545 51487 15311 -21057 35208 49852 12120 -17959 13839 31162 56918
9400 56918 51257 17254 23388 -8879 -33821 -50644 -68084 930 1349 -58155 -62015 -79179 -90521
9387 -90521 -48141 -610 -8305 -51444 -65622 -54184 -70537 -57174 -38156 -100638 -75831 -30324
9375 -30324 -20761 62831 89758 58176 767 -84234 -81454 -8100 62413 33744 -15140 -50876
9363 -50876 -83027 -87962 -74330 -18161 38353 87813 94629 58033 50061 62840 30519 64616
9351 64616 90004 28052 -29071 28777 -11193 -11418 17442 84535 80865 35121 33801 79401 77629
9338 77629 50426 39419 11692 -10209 -26446 -61873 -94857 -104404 -90817 -37985 21374 30719
9326 30719 40850 32195 60806 85947 47916 50663 36950 -22634 -66875 -39636 36806 87080
9314 87080 76860 66608 108713 134971 91164 -984 10290 17120 -19230 21212 9255 -36068
9302 -36068 -32370 2105 17527 -20291 -26425 -11235 22972 53854 2148 8531 47110 66472
9290 66472 48584 46860 36269 54087 5547 -16562 -53936 -84323 -71532 -31959 -1901 23982
9278 23982 41733 7104 -13047 -20053 8997 -23628 -54164 -69323 -63988 -16480 28550 37267
9266 37267 86042 82449 28399 -6872 -30544 16471 9510 14800 60745 -5732 -38621 -8894
9254 -8894 -21430 -80365 -105216 -52848 -16818 -38384 -20829 -15023 6660 31939 21272 77173
9242 77173 68052 96897 55483 46192 -323 -31116 -80171 -67159 -78074 -28578 76312 109210
9230 109210 105959 78164 26249 8543 4261 -11642 -31674 9061 9250 -29521 -34819 -36073 -43941
9217 -43941 -13959 54001 65456 54764 2715 -38610 -37390 -56616 -76382 -52797 -19609 21593
9205 21593 29679 21498 23192 43665 -50019 -105557 -78311 -71561 -74493 -52473 -25487 -12225 33277
9192 33277 -15410 -54153 -20699 48898 64245 40271 44061 7689 -18543 -54510 -48506 -29068
9180 -29068 24816 -8115 -31995 -8567 71535 71146 39074 41428 46550 -9376 -9865 23861 105418
9167 105418 65740 34493 12556 -61644 -13014 -18470 -36110 -5127 -19139 -2514 -2070 -17651
9155 -17651 40852 34432 -15987 59077 91042 91603 104945 94022 15249 -31699 -18638 32641
9143 32641 43086 45793 65819 118356 59365 -17936 -17306 -10671 35080 26148 10313 -9985 -20495
9130 -20495 8893 22641 68426 81301 17879 8502 -25339 1519 61699 88173 111853 77032
9118 77032 69299 29114 -19898 -37157 -74431 -88220 -41548 -59564 -48330 71346 102450 40732
9106 40732 42686 16648 -14546 1222 40495 38767 15989 29785 -11453 -68337 7356 65399
9094 65399 74062 37710 62853 47809 15683 3984 -19798 -1172 -2633 -27711 -12849 22492
9082 22492 13205 -4891 -21445 -59819 -33597 -45431 -90616 -47064 23124 47139 31263 -1686
9070 -1686 15089 5239 -28382 -27757 11069 37253 60422 102442 62810 -27819 -32820 -46556 -39493
9057 -39493 -23672 -23588 2366 -3515 565 16630 20792 21706 44157 37214 -32243 -47279 -22064 -24143
9043 -24143 -5286 11763 22418 12934 -56326 -39046 10462 -6657 -24692 -26986 8278 -23773
9031 -23773 -45737 -54081 -37509 -76337 -79813 8705 8227 7390 31259 -32753 -34627 -4836 -4644 12900
9017 12900 3470 42810 91445 70822 23014 19317 24960 81714 74420 20310 191 -16730 -31219
9004 -31219 -10038 23019 12745 -12220 -72171 -110808 -101482 -105531 -113129 -105372 -130267 -112492 -96810
8991 -96810 -74250 -30589 -25486 -3133 16898 56162 16958 49201 34184 -6009 -5279 15495
8979 15495 -5594 24224 24863 10995 15631 -31270 -61669 -17371 -14359 7920 49302 38882 46272
8966 46272 109833 113498 91523 87982 80752 55190 51551 113499 118541 101779 30288 9153 -42646
8953 -42646 -59439 -47698 22459 80460 123632 88538 65642 -27675 -33161 -12998 -48007 -55820
8941 -55820 -60243 -21400 48659 66254 -22466 -62741 -56082 -93436 -68891 -11487 31018 21038
8929 21038 58969 23707 11630 62964 48718 16786 81773 73012 92916 102161 2965 -27637
8917 -27637 -41390 -73618 -63246 -50268 -51132 -48545 5728 -14299 16327 26678 3256 -21920
8905 -21920 -39668 -41050 -11832 -56644 -22819 8683 -9716 -23626 -63700 -4447 5454 -40572
8893 -40572 -80832 -54017 -22463 -27956 -70167 -80346 -82809 -79257 -55185 -45522 -52120 -66650 -15160
8880 -15160 17907 4092 3637 -15669 13382 790 -16996 -23524 -48040 -73082 -17118 43513
8868 43513 48006 24895 10279 -35113 -84702 -56510 -46155 -57943 -97030 -90684 -79745 -24480
8856 -24480 -3788 -18129 -55594 -60237 -25556 27342 55063 55935 64259 30547 -31615 -46213 -43341
8843 -43341 -77527 -42253 26468 36693 71665 89219 84811 42762 71864 128371 79656 -16815
8831 -16815 -20465 51955 83558 45188 74800 107178 60837 48759 73452 60480 -20000 -27646
8819 -27646 -24243 -522 -37836 -88920 -8936 56192 55856 34624 52361 50192 96237 88801 38339
8806 38339 39242 25519 12754 6513 -26793 -72661 -78648 -79405 -93351 -65931 -36221 -87933 -139991
8793 -139991 -138443 -79698 -53594 -16430 -14381 -506 -433 -20966 22027 38825 14656 16440 33674
8780 33674 34572 4962 -16204 11041 11222 36426 106214 98636 48379 25660 -1734 -6624 18434
8767 18434 8820 -27552 -34238 -22321 -3940 -3617 -41064 -63560 -64687 -65234 -30640 6816 -156
8754 -156 -59369 -29071 20018 48057 51526 44318 52911 28627 83709 66971 -4489 -15382 -19641
8741 -19641 -12625 -22948 -42368 -65041 -39259 57734 37839 -4064 32297 28279 -49676 -44810
8729 -44810 -58151 -66139 25 31687 -12065 -18135 5784 21980 -22473 -3235 26297 -4922
8717 -4922 -4975 -46258 -30452 22688 48818 -18428 -28933 -60618 -98698 -78058 -66379 -43003 -326
8704 -326 13633 -21582 -71797 -87659 -68041 -33503 24080 72774 81779 76516 115244 60946 26894
8691 26894 49274 41543 -20541 -38570 -28127 -59890 -60428 -53103 -12922 -2462 -44218 -40449 -27441
8678 -27441 -12350 16754 -57312 -77982 -63296 -15195 32021 86592 94945 37965 -6191 953
8666 953 40616 26713 8466 -10512 -85617 -103296 -83925 -79050 -37225 4567 6591 67761 87157
8653 87157 52150 -32 -20657 20398 67397 45997 12626 46678 63294 85513 60182 23800
8641 23800 73151 97556 58476 -4018 -8968 -29627 -64923 -54939 36654 108869 84706 50247
8629 50247 62015 43145 45461 57499 6753 -38482 -13012 -9743 847 14079 95825 122016
8617 122016 65655 -22046 -23834 17818 50608 33776 -780 -46051 -56622 -74239 -46777 -35969
8605 -35969 -6561 -29815 -39195 -37813 -23406 21116 76550 66706 20448 25983 8157 -19661 -14083
8592 -14083 -13436 -55034 -58903 -7819 54408 10285 -59531 -44065 -35193 20097 83888 75230 17425
8579 17425 -39857 -38004 28730 60974 3588 -12126 -35378 -65728 -44947 42399 54094 47909
8567 47909 53825 -13279 -4227 30069 6929 24844 55686 10746 13033 53300 65791 68330 9376
8554 9376 40455 54029 12554 -27048 -23747 -29604 -2761 51004 38117 60879 59546 33088 51041
8541 51041 63230 55307 -27149 -68141 -117388 -132426 -50150 -40262 -2925 34928 32303 13911
8529 13911 14263 16335 24379 46376 83684 104402 103812 108155 111731 99091 13617 71657 117414
8516 117414 89375 78798 92153 144913 168928 137026 97760 30514 33986 44253 62086 35354
8504 35354 56049 109043 97235 80936 706 -2059 -14002 -54609 -11707 -19400 -34531 -33710 -34912
8491 -34912 -24434 -29250 -49950 8198 18876 19015 -9742 -603 24246 26903 39213 36290 77027
8478 77027 109450 73611 90071 83592 32809 -25227 15561 33661 83440 35392 -1666 59607
8466 59607 112024 150850 148533 128926 99993 84004 65438 16955 7582 17271 28507 -15149
8454 -15149 -44507 -8449 14793 -15613 -52108 -51087 16739 70024 70619 112762 140212 121582
8442 121582 107577 95770 5905 -8574 60484 66589 44570 96487 133513 106478 52397 84484
8430 84484 117402 84529 53362 8626 -18860 25724 4322 -33963 6460 26219 25970 30889
8418 30889 53892 104958 61708 42738 52854 29093 29564 73290 58928 42546 89186 76511
8406 76511 92212 111587 147058 106688 66615 53259 69336 99312 127861 97570 77808 124751
8394 124751 196244 288504 377570 541513 683921 627807 478914 390678 288435 176182 124897
8383 124897 121660 76641 63100 77218 32134 54652 58862 9193 53142 119048 176236 137025
8371 137025 62918 32971 34799 46582 16737 62694 76982 76183 63829 50572 25373 -1494
8359 -1494 19176 87554 119392 105223 74456 66219 36532 85405 144894 222072 345610 593915
8347 593915 938852 1224640 1310008 1322951 1108980 763669 507087 353738 269029 138914
8337 138914 70099 -16542 -19268 28777 22663 -14564 11256 33089 -3052 44781 64259 59907
8325 59907 -17579 -37038 -16076 44208 39642 13182 -332 -40378 -9145 -46983 -87909 -88423
8313 -88423 -74959 1110 25353 -36149 -36797 16897 154415 219432 273984 359523 432258 572447
8301 572447 678395 691215 586256 401707 286669 200060 201234 207315 183811 185066 152114
8290 152114 122716 112674 67658 2977 -49071 -25447 -57167 11393 56637 12880 -22370 -31777
8278 -31777 -28215 -15201 -10956 22907 51875 56599 23002 -19882 -1882 3248 -26845 -103074 -152377
8265 -152377 -117572 -9808 -10607 20866 45678 9704 -63318 -87376 -42543 17305 5444 -29206
8253 -29206 -43417 -47072 14220 85826 89056 45613 35153 -3661 -50500 -59312 -64252 -29845 -13208
8240 -13208 -62611 -102238 -105716 -99814 -72520 -34118 -10721 12015 68360 124375 57069 47775
8228 47775 75620 104288 101910 -15024 -61050 11674 -4403 21878 73044 35343 -14624 -47290
8216 -47290 -77671 -86549 -76550 -72222 42987 100639 100508 88299 117614 120467 110401 87940 67880
8203 67880 33388 -21193 -79693 -84095 -55295 -29569 -46988 -12913 51706 30231 -4138 -10282
8191 -10282 -18283 13606 59617 69651 56805 -14393 42415 76231 61904 86097 125658 60660
8179 60660 -32597 -94820 -144496 -127794 -115118 -75662 18014 63284 47906 -17465 -16107 19751
8167 19751 -26134 -39788 22226 82202 118176 58495 -17820 -30945 24928 88358 85415 43262
8155 43262 -58329 -55679 -20602 3420 -57749 -42568 14486 -1352 -9045 32445 3150 -25812
8143 -25812 -109 41318 44335 23111 38525 9146 -18221 35757 27006 2433 19062 30671
8131 30671 1704 -54890 -36601 -15973 -70706 -43229 9778 18738 22274 6812 34877 6547
8119 6547 6002 -21259 -85025 -36075 20602 53187 23694 2512 -44141 -51920 -40504 -16032 -32362
8106 -32362 -25404 -16106 -31598 -88380 -88246 -31913 44862 85409 106611 92847 10007 -68146 -88020
8093 -88020 -132157 -90030 -61289 -39954 -4153 -66056 -25200 11427 -6219 -9657 34052 30991
8081 30991 -10488 -11091 32229 80236 69724 132511 133434 104026 113000 83952 62532 27976 -33544
8068 -33544 -91380 -39707 -22754 -62435 -19644 -30060 -50628 -45181 -44548 28288 65761 43553
8056 43553 32289 44586 57356 68162 50898 46321 61266 41551 21908 -9241 -9188 17310 489
8043 489 -30997 -52847 -41206 -74824 -142168 -110835 -21713 -7315 -2350 10489 -25429 -73650
8031 -73650 -68263 -129535 -173915 -143544 -116523 -79623 -76602 -116587 -71181 22145 65495 52859
8019 52859 84978 49902 23653 9080 21396 7861 39806 77329 86380 91824 15346 29360
8007 29360 40455 47024 13124 -19653 -82904 -113983 -72830 -69795 -97246 -49838 -39434 -53196
7995 -53196 -86605 -20708 31173 8788 -68501 -50451 -21548 -26770 16319 16084 -14555 -36448
7983 -36448 -62934 -52501 -72994 -91489 -85144 -127725 -70368 -10479 28680 416 3145 66171
7971 66171 44765 -1176 22530 31039 14281 16816 41668 36553 38167 35688 44502 8287 -79289
7958 -79289 -18203 101242 124818 77030 114777 117471 168307 175134 150020 84543 57513 2101
7946 2101 -54690 -23653 34000 66806 88927 23679 -58577 -4956 24633 39701 44131 6522
7934 6522 -19214 -47413 -45507 -43652 -47612 -88545 -64266 1829 28411 -23784 -41186 -36690 -9662
7921 -9662 787 62580 39274 -40397 -37058 637 53906 37638 -10951 -34165 -11973 19500
7909 19500 -20394 -26626 781 -5074 -30126 -52730 -49157 -50971 -49505 -88273 -82906 -46545 -25274
7896 -25274 -36882 -75774 -53484 7013 -19801 -3815 75756 74751 53674 34637 18145 -13794
7884 -13794 -22181 -66420 -112755 -127564 -122477 -117396 -89153 -49053 5152 37514 48960 27842
7872 27842 -46954 -76037 -60359 -105302 -64899 -81 25519 58165 72410 56571 48588 134876
7860 134876 124329 76293 27367 -35729 -66179 -65693 -21374 47706 54821 19850 24168 42589
7848 42589 67905 36734 -4912 45090 43101 -31732 -88113 -88177 -9177 -28031 -22820 9990 32450
7835 32450 24816 -8992 -14547 8789 -3262 -34710 -23831 24851 -17082 -41832 -1474 -7184
7823 -7184 -42367 12136 26061 22140 -30245 -74862 -62113 -48866 -48909 -54157 -32661 -28825 -19589
7810 -19589 43682 38409 45617 78308 31322 -52075 -78016 -70344 -60330 -67500 -83142 -59994 -15833
7797 -15833 -6412 -67643 -77462 -82802 -77738 -57792 -44689 -68454 -32726 28782 81275 69737 72529
7784 72529 93818 88482 53999 58738 30220 12100 53993 -12108 -71319 -80328 -76985 -4666 19161
7771 19161 41175 44696 3901 -3362 -32627 -39891 -37843 -231 -12162 -1233 33780 66851 47278
7758 47278 60145 124397 92866 34734 23383 72354 114187 62547 -17577 -41745 -27215 11750
7746 11750 7872 32024 -6167 -46748 50674 109358 69046 -4006 -66691 -64886 -35182 -35517 -26613
7733 -26613 -96180 -137960 -87784 -83383 -170917 -117116 -110829 -84938 -33519 25819 95662 135902
7721 135902 92379 8348 -84119 -143529 -127763 -103233 -100331 -84703 -14415 -52620 -67589 -61652
7709 -61652 -43902 -4627 12409 -32160 -7075 55997 32464 -43814 -11062 4998 -5978 -43685
7697 -43685 3460 85700 106869 53985 -196 38907 30472 11790 38523 -10902 -45529 -19653
7685 -19653 -30152 -45734 -16537 -52745 -132343 -106578 -26745 -14118 1200 -17141 -81587 -109549
7673 -109549 2076 60379 10249 -41154 -16333 -30190 -21865 -36664 -23342 21334 -8383 -21518
7661 -21518 -17342 -71312 -95429 -75440 -21275 -25763 -59812 -18989 -13076 -7629 15766 14216 -15297
7648 -15297 8701 7050 -28449 -113190 -132401 -99864 -115359 -51811 -1745 31482 47745 36610
7636 36610 22607 -42168 -93544 -119986 -78134 -30216 7828 15888 27649 49783 32716 22184
7624 22184 25029 -9737 -43670 -71646 -48376 -26755 -11142 -71120 -65891 -82948 -108824 -43573
7612 -43573 25272 55777 14930 -33039 -13719 4332 -1531 43132 44733 66725 108861 29768
7600 29768 10159 -6296 -12699 -27145 -66847 -71896 -50459 -8251 8473 6137 8730 37166 34677
7587 34677 18389 44835 43726 44007 91042 49670 -9466 -36054 -25850 -10550 -31831 -66576
7575 -66576 -50614 -81149 -102034 -78133 -31349 -32732 -46356 -11332 869 -21183 39842 60170
7563 60170 7563 -26722 -4415 61507 110837 46742 226 -46702 -1548 3591 -66823 -35510
7551 -35510 22842 67000 -4845 -22769 -9049 22257 35696 78577 104353 56269 7928 27626
7539 27626 -4459 -51472 -15952 -11244 -47726 -24246 15260 70717 89277 65120 80421 46986
7527 46986 -14313 30542 -15263 -69999 -55107 -15865 -20316 -70641 -74052 -66454 -65076 -46669 31838
7514 31838 42123 -24919 -49243 -47190 -62520 -61023 -74390 -47417 -86009 -99432 -62744 17024
7502 17024 -34594 -46546 -19974 18204 880 58106 94012 72536 39813 43630 20289 21484
7490 21484 -1793 5228 53183 54450 28547 52301 77248 92041 58177 83405 119244 131448
7478 131448 125874 71430 10216 -26313 4458 50516 57863 -546 -17343 -63789 -113292 -96068
7466 -96068 -61617 -68109 -40884 43257 83827 98697 88537 93692 80816 46531 32272 -12678
7454 -12678 -3989 -34096 -11835 22706 18349 15034 -13782 -86448 -108023 -82446 -60987 -31885
7442 -31885 15571 29232 37709 11076 -3228 -32983 -55193 -19997 -39761 -88953 -69503 -43099
7430 -43099 3213 -26496 -52485 -85202 -33135 60567 29022 -24548 -16005 13604 -47053 -59996
7418 -59996 -26040 -5423 -1459 -54601 -53732 -29315 72282 111343 84940 44043 6436 -35394
7406 -35394 -20950 -64457 -97474 -118212 -133113 -124870 -104529 -104932 -68949 -53209 -15460 -8569 31071
7393 31071 73852 20829 43012 51727 58217 32101 41055 49643 49393 42349 67204 39389 12687
7380 12687 59794 93087 49836 -8484 2564 -18365 -46425 6365 71737 71699 79581 86190 25466
7367 25466 462 -6203 6748 38201 71309 58596 66256 21838 -2800 10485 54836 42807
7355 42807 29142 -4175 -45452 -97689 -51501 -44810 -73234 -63303 -112939 -99431 -51069 -26345
7343 -26345 -58906 -39095 -78716 -85555 -66615 27480 26697 -20105 -68732 -58958 -46397 -97721 -89690
7330 -89690 -75063 -75668 -28245 -7962 -55463 -106958 -93530 -46884 -16438 3548 -52943 -56137
7318 -56137 -32985 -17324 -16963 -18612 -73194 -68268 2294 -35105 -79270 -17299 -45143 -52607 19102
7305 19102 58426 -12929 -30613 24019 15019 -1141 -61452 -66121 -63083 -42895 -7242 -55269
7293 -55269 -86528 -67087 -61178 -66127 -61339 -25736 28423 60188 -2035 -86153 -50842 -14546
7281 -14546 -25026 -11117 -46766 -70811 -79865 -39886 -19253 -33482 -99902 -75798 -45054 -13654
7269 -13654 -9173 13099 -30602 -15257 16339 21051 31445 15400 7515 23042 11976 -20248
7257 -20248 10119 -21063 -33045 -61737 -84496 -108984 -27988 17462 -3231 18676 23712 -39343
7245 -39343 -51070 -54919 -25513 5607 5268 -24204 -57544 1111 43720 -28502 -74162 -36458
7233 -36458 40965 75270 167 16001 24610 57964 56556 -12782 -69000 -84945 -67757 -19706
7221 -19706 -44064 -46281 -4669 -23926 -79879 -107779 -128552 -93087 -95628 -67166 -64525 -88111
7209 -88111 -97188 -85101 -87687 -13065 -7338 -13977 -20697 -41480 -54264 -50287 -46029 -27057 51312
7196 51312 100488 89148 80387 70737 54647 55410 59423 14685 -12555 -9167 -543 -28386 2914
7183 2914 34795 17857 -37369 -43346 -87976 -100514 -99798 -93022 -26670 74092 69484 35328 30437
7170 30437 16736 -37992 -39193 -41481 -69824 -119993 -89075 -34661 38491 30696 22207 26925 -4997
7157 -4997 -20217 -49690 -43802 -172 91964 92360 76514 53699 29080 476 -39807 -96609 -77678
7144 -77678 -111544 -70449 11587 25972 10303 18278 -16219 -20822 -64060 -109953 -87625 -20042
7132 -20042 40162 62828 29725 -837 1540 857 -42873 -75222 -79770 -67115 -18675 38468 19411
7119 19411 2277 -1756 1184 -76985 -59726 -58791 2942 27063 41672 37619 1445 26195 -5220
7106 -5220 -81885 -75033 -52731 -68379 -115592 -65668 -26642 -76930 -73624 33777 72996 85093
7094 85093 71540 33729 45700 59107 115933 106607 59352 38868 -4101 -46622 -70576 16598
7082 16598 28372 21974 -5639 -28408 -9150 -2372 15858 19906 22579 51921 58639 38402 -8917
7069 -8917 25574 78164 89219 100843 79114 99510 75544 51648 56329 38239 -21890 -17789
7057 -17789 -22807 -20440 -92442 -118035 -62018 -37725 -60386 -60764 9929 -34557 -58231 1768 -46158
7044 -46158 -103624 -95302 -38564 -63368 -100197 -79166 -43440 -14335 -2240 -17269 -63648 -70302
7032 -70302 -64563 -27517 -9489 -28876 -58162 -36960 -55630 -62914 -119410 -107776 -46383 31614
7020 31614 50530 10061 -1111 -23360 -14779 21159 34172 42975 -1597 -19386 15911 50980
7008 50980 19937 -15824 -11021 16569 19195 28071 54146 62505 21900 -7880 32559 10091 -28055
6995 -28055 -83857 -71541 -6015 -9733 -20720 -49045 -17037 -18882 12218 57969 78295 49562
6983 49562 47955 14135 -1774 -49350 -57260 -51037 -118578 -61399 27881 47207 47162 38335 -14909
6970 -14909 -49490 -40895 14687 35965 2033 -7473 -99583 -108097 -15196 -48891 -82360 -66026
6958 -66026 -41806 -54138 -39286 -2717 14949 32822 4854 -34363 -45498 3281 -30098 -100148
6946 -100148 -74529 11756 46622 24507 -74531 -70740 8333 17150 34597 30665 -2240 -4015
6934 -4015 43397 87362 132592 95263 3114 -26329 -17954 -16133 -34414 29780 85916 18951
6922 18951 -3571 15206 -10190 -24321 -9547 -18028 -18185 401 -14733 -43820 -67191 -59031 -8973
6909 -8973 -23073 -21570 -42688 -23049 16438 17237 6641 30412 50107 95858 119312 78775 41158
6896 41158 23341 22911 -4482 -46141 -81632 -76487 -56029 -55654 -17818 26851 13905 -56581 -23437
6883 -23437 -9587 29450 14282 -7287 -7891 49033 47992 8337 -40662 -44848 -82218 -91213 -61540
6870 -61540 -12170 -16402 -45469 -97961 -82798 -60221 -58777 -32624 -47688 -55788 -93643 -125021
6858 -125021 -80012 -27748 40016 80312 25583 32042 85182 57690 54695 108363 100853 71220
6846 71220 31773 76974 77036 41555 21416 -11823 -48015 -91350 -100387 -114937 -96709 -83001 -101401
6833 -101401 -56923 -21560 -53286 6806 -32246 -39925 19277 -17095 -33801 -51661 -81573 -65506
6821 -65506 -53994 -46326 -52221 -27404 -31566 -48778 -63223 -32439 -25979 -55066 -52733 63163 73239
6808 73239 41484 33026 43962 85524 30748 6167 36704 24198 7440 7023 -5720 11360
6796 11360 -13654 -20065 3378 52193 41802 44599 82215 106152 113947 115471 68772 30865 88088
6783 88088 94203 24188 -16725 44404 77121 49138 21667 -927 -31839 7300 29138 69760
6771 69760 81917 54108 56120 -11789 -4753 -77502 -78295 -31735 -158 35564 10242 -29808 -103064
6758 -103064 -142550 -69275 -61103 -55054 -75599 -101461 -117277 -64193 -60359 -74132 -66871 -35418
6746 -35418 2105 6029 -388 -22446 -27182 -50273 -62095 -86891 -91537 -79840 -73043 -79693 -106149
6733 -106149 -161046 -138573 -134973 -116265 -79755 -65670 -29131 -7883 -4418 -9395 22458 -41833
6721 -41833 -98620 -97003 -49217 -7828 -7518 -47143 -60689 -17626 -2258 6485 4804 5236 -17605
6708 -17605 -27437 24109 26218 -22715 -80977 -79216 -81992 -124373 -108326 -112479 -94280 -103511 -93176
6695 -93176 -67286 3036 -47929 -137100 -159681 -123717 -123029 -80987 2548 52940 1079 -26635
6683 -26635 -36273 -53440 -79465 -155134 -123687 -55209 -17656 37807 77225 18829 -6103 -29463
6671 -29463 -69293 -77834 -50161 -54934 -32746 -24892 -64313 -68556 -113940 -115621 -29741 -23581 -51328
6658 -51328 -25348 -8144 -24925 -56889 -30308 -34141 -67841 -44367 -7259 -2874 -27286 -10729
6646 -10729 -25104 -4503 22939 -13140 -14372 -55632 -56396 -50041 -27376 -17316 -28866 -107101 -84598
6633 -84598 -77837 -46661 10799 42659 6895 -28 33650 32882 57038 49487 20132 -33488 -59710
6620 -59710 -68002 -38607 7154 28788 29172 31106 19001 -32415 -40079 -88674 -89731 -47395 11624
6607 11624 8276 -35326 -44193 -44137 -32802 -69377 -39959 -14257 -8008 7257 -17796 -23309 69911
6594 69911 79249 37202 34852 60830 52276 76908 47454 -7369 18778 11622 18338 26288 -13960
6581 -13960 -28497 4495 -22053 -8174 18907 24659 -2601 18106 -14227 -69806 -67449 33862
6569 33862 74349 -1678 -74150 -95834 -70904 -16307 -3557 61617 66373 41959 49024 33517
6557 33517 55172 24979 14896 -58872 -83029 -22975 -29336 -46114 -54436 -53246 -49411 -33622 -34123
6544 -34123 21617 43801 486 -36684 -30267 -47427 -47426 -64703 -44384 -62964 -79042 -111598 -82771
6531 -82771 -41587 -61661 -58978 -19175 23428 14732 5641 20342 10389 -54965 -106226 -89705 -15185
6518 -15185 -19791 -16561 -32391 -89624 -83224 -51186 -56499 -32545 -45446 -64598 -51527 19125 55499
6505 55499 41535 40350 -35537 -48080 -88344 -58623 30248 43279 74559 83068 59648 25255
6493 25255 38904 77935 120370 139086 114753 31475 -1322 217 37877 62962 32769 63893
6481 63893 83576 57388 18109 40587 46385 14249 -56525 -36986 22241 27565 -19776 -27979
6469 -27979 -35911 4065 -15256 -51772 -21295 -7605 -12321 16794 -9433 -525 13695 -41059
6457 -41059 -14937 -48554 -54081 -30790 -37225 -60519 -47981 -25123 14009 66399 60660 20805
6445 20805 -39346 -85698 -82423 -51210 -73719 -143598 -101546 -28598 12935 -16364 -43564 -51732
6433 -51732 -91659 -72964 -40757 -13514 -37308 -100104 -158889 -115408 -59247 -63307 -108163 -75890
6421 -75890 -13229 -18911 -23351 -1240 33686 51482 -6035 -13344 5829 52876 70804 86407
6409 86407 25025 -17195 -45846 -51478 -51940 -43913 -29982 -19792 -46691 -50105 -2647 17776 27802
6396 27802 -38035 -39844 31140 59892 51525 45416 22991 22906 35113 23548 -65261 -82870 -7439
6383 -7439 -4784 -48471 -38396 -76052 -120153 -144282 -110491 -106105 -121578 -124257 -115366 -41757 -17091
6370 -17091 -1713 -972 -1149 27153 35182 103794 34810 -22391 36233 89226 82062 91155 57538
6357 57538 2056 22363 12930 26870 31265 -51491 -60205 -47599 -53529 -47325 4485 2971 23076
6344 23076 33488 60349 58640 35292 18372 -18197 -59240 -6853 -59323 -101131 -89933 -12332
6332 -12332 34807 -647 -23470 -40896 -49618 -37501 -26811 12507 -21281 -72071 -66852 -28319
6320 -28319 -29040 49834 85751 33484 70739 47557 5537 6938 -5656 52268 40411 35174 43268
6307 43268 -17077 -13879 23641 24870 31087 4141 -54266 -92386 -95757 -43448 -25255 -27830 -42568
6294 -42568 2761 -7917 -62426 -70080 -76157 -85216 -50372 14178 85265 87673 58553 -14363 -70356
6281 -70356 -65424 -40576 12348 15545 -725 -38589 -26237 -57663 -31331 -65797 -36140 9498
6269 9498 41354 -22056 -33281 -60428 -139170 -140297 -44962 33575 9288 -67764 -74412 -18881
6257 -18881 -16767 6205 -42075 -50232 -33000 -87233 -114319 -74138 -82846 -55505 -29187 -15420
6245 -15420 -23881 -89243 -148648 -121257 -85110 -43212 -61716 -47700 -30923 -18041 -84994 -122032
6233 -122032 -131670 -68056 1061 -3911 -22546 55710 23287 25657 10663 7428 32659 47169
6221 47169 21301 32873 3370 -30686 -39768 -75558 -65779 -74455 -77914 -83567 -71267 -33527 -5935
6208 -5935 -28432 -12205 2378 -821 17959 79522 71354 66267 5388 -77566 -45688 -20225 47144
6195 47144 78303 85683 54744 -25608 -65765 -13426 47779 19985 6677 55130 59014 28254
6183 28254 26223 18255 -32310 -40895 -23752 -31265 -71121 -109307 -120684 -131239 -130190 -97288 -82548
6170 -82548 -4517 41131 55828 19811 -29299 -10592 -30115 -46984 -19638 31722 58330 46628
6158 46628 36416 17163 6260 27140 51701 41769 -6949 -12475 -30391 -76106 -77662 -52071
6146 -52071 -5010 -25503 -50871 -1231 11765 -19733 -50043 -55188 -39844 -13409 44309 78755
6134 78755 41401 43641 70350 44520 18515 -8160 -46520 -32586 -57766 -104832 -60761 -34676
6122 -34676 -2200 -9130 -4897 -43356 -16139 -2369 19848 16639 -2107 10521 19710 9529 3451
6109 3451 6065 58827 59471 12558 21730 25136 19986 1941 21956 -8596 -53730 -36375 -28855
6096 -28855 -17990 -18586 -14814 -1181 18339 44789 22659 30919 52034 32694 19166 8122 35421
6083 35421 6207 -18670 2116 44159 43095 15067 -47064 -17992 29780 49950 40545 32828
6071 32828 63853 71063 54309 21866 19237 9022 29 21624 -40130 -103977 -86822 -64575
6059 -64575 -65621 -34316 -47772 -39920 -25501 7571 8376 46432 92056 82885 16574 -28928 -54412
6046 -54412 -35651 -31901 -38031 -24563 4193 19351 7202 58311 121799 84548 819 -33389
6034 -33389 1833 21910 64867 105174 63337 29761 -9508 3543 49801 -7429 -75380 -88414
6022 -88414 -65405 -20580 13308 -15733 -21734 -45138 -54330 -115319 -132418 -107250 -53325 -28976
6010 -28976 -44757 365 -36642 -45212 -50114 -49361 -84060 -55660 -55576 -5939 80459 72793 -11700
5997 -11700 -63478 -107334 -91511 -106646 -80247 -25723 -25643 -14621 -3727 -24806 -72806 -90309
5985 -90309 153 57811 50630 31588 -41335 -26548 33493 39423 25391 -46579 -44206 -52319 -48145
5972 -48145 -7218 -42433 -78186 -83796 -101376 -101732 -56844 -27617 -7471 -41966 -66786 -57757 -10909
5959 -10909 24781 49991 85112 90571 110832 92202 85038 121254 77698 23246 39977 13400
5947 13400 9839 -11170 -18692 54183 51438 82310 74316 75069 17540 4853 89296 118354 74279
5934 74279 38896 26652 5716 17357 -26634 -71934 -60050 -36921 -30486 -24191 24335 69314
5922 69314 118707 99667 38908 46750 69920 91932 37495 -57885 -97048 -54091 -14558 -13029
5910 -13029 -35762 -105379 -107761 -22804 12429 3819 14972 53623 76486 71313 15895 4539
5898 4539 7917 -11423 -37152 -28517 -953 529 69105 49982 -30539 -65178 -105882 -87799 -56398
5885 -56398 -2271 -2574 -10666 -4206 34548 20195 -32474 -56043 -116870 -118692 -78049 -8011 41158
5872 41158 10373 6042 19689 -32310 -12065 32810 54598 72327 25346 53592 61980 30716
5860 30716 19875 -12333 -28268 10549 -19373 -65613 -65500 -47100 -38398 -20948 11067 22151
5848 22151 5573 38867 57250 35362 47150 70799 70933 66507 79808 56442 66230 41387 -32547
5835 -32547 -19783 11159 -19503 -36048 -96747 -118137 -88234 -68189 -29376 15527 21681 -9032
5823 -9032 14417 10750 42473 94878 51332 -5526 -63085 -68619 -28444 -50180 -55417 -10936 18363
5810 18363 10720 -36929 -8796 37687 44949 -4091 -63364 -79273 -65272 -81546 -130323 -142768
5798 -142768 -121213 -102787 -56679 23190 19884 61493 17927 -3074 -51003 -50345 -5441 32055
5786 32055 60915 57633 35075 11198 -56829 -47888 -24900 -21431 -25489 -36414 -33217 -27774 -25196
5773 -25196 -69597 -112937 -138966 -82669 -42049 -23680 -30304 -60600 -59498 -31132 -5028 16183
5761 16183 20705 -29415 -80766 -90493 -56550 -28500 -4651 31610 83576 22784 -12206 -24893
5749 -24893 -20170 -14350 3009 -14713 -80861 -80685 -41530 -32407 -37956 -1030 -2713 -56606 -121656
5736 -121656 -72392 32625 83539 30013 -14454 7899 12317 -9702 13552 11109 -32255 8707
5724 8707 37333 -54409 -35262 -59877 -10380 18930 43302 57354 23191 -11926 -35243 -34702
5712 -34702 -42502 -19563 -25318 11548 -17483 -191 -7997 -38129 7862 38659 12178 8554 2354
5699 2354 44900 58530 30301 55511 51112 -7923 31299 12954 -4097 -24780 7975 -45759
5687 -45759 -56679 -41488 -58694 -57434 -40379 -40242 -57586 -92670 -65631 -57223 -79186 -85068 -80445
5674 -80445 -93737 -34379 -41056 -79580 -110273 -85539 -79611 -109059 -121505 -102521 -97573 -53454
5662 -53454 -20717 19847 42217 -13025 -24923 28126 44235 29389 47580 30354 57159 21048
5650 21048 -17745 -41626 -61209 -47099 -42714 -93055 -44952 -42266 -39224 -80005 -73602 -31732 24352
5637 24352 29115 9817 -29876 -12660 -13922 -20629 -21376 10993 66870 44238 17895 26015 13845
5624 13845 16324 76766 107464 85767 95415 95539 156115 136577 82368 15097 -30542 -67279 -40851
5611 -40851 -21805 36847 25180 -39927 -34799 -13315 55575 109492 56403 34549 -30071 -61628
5599 -61628 4437 62020 16434 23107 56788 39572 36258 31679 20291 -170 -35663 -9019
5587 -9019 8353 39482 36288 58948 80604 69153 48907 30329 36801 -21520 -11946 11845 -6374
5574 -6374 -10775 -23657 -48631 -48870 1114 -1771 -36712 -92757 -98856 -71328 -65172 -79326 -31403
5561 -31403 -11846 -79712 -148080 -117224 -92533 -59946 -49852 -34066 -70557 -99657 -108186 -109262
5549 -109262 -10332 -22351 -66803 -37524 -11933 -44122 39863 54920 14923 -58835 -28238 -33999
5537 -33999 -53058 -17124 25990 33929 -804 -37670 -35479 16774 62349 35485 49778 57299
5525 57299 40986 22665 32849 33733 -8707 21651 -3223 48623 32079 -36634 -47883 -79577
5513 -79577 -113590 -113622 -74445 -84758 -12995 -15097 -79910 -62080 -33961 25722 3169 -40903 -52059
5500 -52059 -87158 -92149 -70120 -47281 -85039 -65650 -57283 -45610 -35474 33959 -4054 -6148
5488 -6148 25234 67596 26619 21600 34302 3000 1443 -1622 31601 -26214 -63892 -46033 20495
5475 20495 -42235 -39601 -42688 -89385 -85657 -85623 -89827 -75454 -31499 -24678 -13493 -4649 -47133 -20532
5461 -20532 -37502 -54213 9461 55202 64294 14211 50825 23506 -47053 -41533 22060 50584
5449 50584 45821 10140 31102 30336 41330 51764 29757 -15970 -15114 71884 82967 32068 32168
5436 32168 35445 70712 102163 57122 26253 5753 37085 94006 116085 110706 72493 -19175
5424 -19175 -31123 -15636 -9011 -20160 37238 83014 29863 27382 59305 65262 51743 -587
5412 -587 -11503 28050 16252 -14008 -66401 -77589 -115997 -107072 -89746 -82370 -65597 -84428 -60554
5399 -60554 -15329 52656 62284 37506 -33557 -31929 -41493 -55552 -14545 5984 -14635 47770
5387 47770 51761 19873 18012 1253 -16000 -33705 -2767 31282 42144 13933 -22370 -16353
5375 -16353 23431 24536 69804 49854 12549 -80471 -75697 -21887 22770 62559 28090 31835
5363 31835 84799 76602 53046 -37815 -34168 44522 38295 76550 66375 8554 -27098 -62026
5351 -62026 -27842 -31666 -63746 -118027 -157351 -147189 -93707 -18556 -41210 -29535 -16556 -42326
5339 -42326 -49296 -46165 -29000 42148 22537 -11462 -3586 -48290 -36421 -25906 2695 -17528
5327 -17528 -72326 -116118 -92139 -77458 -81675 20250 51682 -17940 -63381 -44288 -29101 -37769
5315 -37769 -57142 -31360 -30466 -34039 -98374 -174343 -156295 -104786 -112185 -91990 -59906 -20854 -7782
5302 -7782 -12999 2581 21529 -4732 -31608 17673 23382 -14168 -5264 10371 -14730 -35490 -35462
5289 -35462 -42213 -104500 -80044 -69176 -108739 -98306 -37738 8931 14157 1229 17845 18926
5277 18926 2352 57850 15174 -22383 -77644 -114670 -62600 -29667 -30342 -17752 61932 113222
5265 113222 114374 116217 40569 -36516 -39034 -53070 -47117 -42712 10631 62661 89596 70639 43050
5252 43050 50307 10723 15132 29981 -28705 -22349 -61274 -70121 -98771 -66058 -80306 -135282 -141811
5239 -141811 -136515 -141501 -66312 -33649 -27667 -71404 -4252 6196 -39822 -25427 -58119 -64970
5227 -64970 -33323 -48700 1478 -14556 -30213 -49698 -95945 -95208 -52431 10892 3795 34617
5215 34617 61621 57561 39274 372 6677 -11826 -66069 -60336 -34124 -14141 -73 -36021
5203 -36021 -46964 -4487 -9691 2290 7300 -29239 -43959 -8627 32261 61409 14706 -57721
5191 -57721 -58660 13178 31744 -42071 -34611 -510 -24624 6484 16628 -22799 60035 37005
5179 37005 -9336 -12944 -23783 -67603 -102403 -93545 -72951 -106860 -169137 -105237 -49026 15330
5167 15330 12320 11984 -2499 -51446 -50107 -90626 -90695 -96591 -59501 -23152 42652 1790 -42312
5154 -42312 4974 14521 36275 3189 11922 86487 74680 28690 -8609 -40004 -53384 -132086
5142 -132086 -160315 -95670 -65737 -93985 -62375 -35614 -22849 9323 25793 26023 -27234 -68567
5130 -68567 -21266 -42869 -22151 -11267 -42420 -47966 -26964 16714 11534 -5737 -56452 11935
5118 11935 51653 79600 82919 31241 20849 -26527 -24944 -12175 31474 41416 55919 55267 -15561
5105 -15561 -83011 -76404 -69961 -92207 -64061 -83416 -29564 -18556 824 -70863 -12742 38860
5093 38860 58828 47447 -12750 20034 59435 38225 -53924 -50253 -4576 -7608 -1393 5275 8606
5080 8606 22214 24252 19592 -1095 9156 13853 49081 52229 41728 71367 48938 19242 -24917
5067 -24917 -66047 -31208 -35158 -21998 6580 21644 4675 -59680 -91370 -116548 -108183 -95304
5055 -95304 -67409 -50868 -70641 -51377 -47403 -14188 27403 -6678 -50315 -30887 -30606 -1739
5043 -1739 57600 38136 1043 -52077 -54681 -61776 -3312 -22127 -21455 26903 62131 31642 -7080
5030 -7080 -29778 -38830 -43302 -22379 -78937 -85101 -70732 -106372 -89591 -42683 -35967 -1342 22347
5017 22347 36765 29140 -25187 -64788 -36282 -29396 -68158 -50942 -26158 -44310 -34941 -10230
5005 -10230 -61998 -90933 -68024 20194 62744 68566 42956 -34594 -19096 3618 5404 -44373
4993 -44373 -59623 -80650 -101571 -140708 -85439 -42150 -21908 -50679 -92322 -15368 -47553 -42791
4981 -42791 3212 -6108 -15792 -49208 -49255 -37518 -35772 -62164 -33024 -3554 -41267 -64243 -34507
4968 -34507 25424 23976 6146 32527 106617 103054 60494 60274 29665 32875 24948 2216 3839
4955 3839 1023 -834 13101 42102 31799 18245 12490 -29637 -20542 9808 -6115 -24916 1955
4942 1955 25701 -5205 -46288 -22054 49033 85601 49514 68938 70470 5335 -24820 -61550
4930 -61550 -72466 -6473 -35547 -45090 -54870 -21909 73152 81153 58106 35156 50298 106296
4918 106296 69134 68400 26812 60112 100913 104674 102906 87871 42038 71469 66445 59817 40821
4905 40821 75446 97143 64881 38297 5815 71170 134195 170323 131781 89262 33351 5770
4893 5770 -15173 49254 72120 72954 22375 -19825 -47388 -26324 -8081 -1810 -47082 -24042 -30523
4880 -30523 -34344 -19298 -57751 -63459 -36098 -19278 58458 72428 31356 4258 9931 21943
4868 21943 48714 57995 107072 108820 67688 29929 31934 12677 28492 33023 66410 82632 36420
4855 36420 -12543 -52712 -67020 -85214 -22245 34741 91073 111519 55550 14696 -17918 -50679
4843 -50679 20289 -34871 -60488 2135 47133 18723 -42921 -134717 -206142 -205678 -168350 -91754
4831 -91754 -65433 -28324 -22876 -33056 -38612 -3056 31358 46573 25657 -8288 471 8086 4785
4818 4785 37374 103145 97225 60373 85460 42171 41421 21604 21072 39127 -17164 -76613 -71321
4805 -71321 -46438 -14973 -17624 -46067 -20094 -16173 -22450 -86290 -86668 -67979 -72552 -69654 -97394
4792 -97394 -113222 -28969 -67181 -67241 -73421 -25099 -28147 -77597 -73317 -49898 -9194 -18266 -589
4779 -589 22017 22936 16672 -42066 -36610 6306 45447 39666 45694 100033 101226 56928 29118 19871
4765 19871 -21483 -72840 -47136 -24034 -10451 -80211 -88593 5592 2335 -33237 -23367 -53611
4753 -53611 6807 73097 59107 59920 446 -49943 -32912 -11598 5742 47118 14032 -42333
4741 -42333 -61648 43332 53241 100979 50613 -26599 -35337 -47744 54317 42759 20456 17668
4729 17668 50775 31706 -23 -5486 -52193 -41535 -56190 -8745 44831 57058 23236 -32412
4717 -32412 -1620 -29378 -12543 8678 -33582 -36675 -62237 -108472 -58601 15019 5497 -86945
4705 -86945 -113781 -120336 -95489 -58667 -81915 -90028 -77508 -91049 -142671 -109991 -50499 -10711
4693 -10711 -2245 -43512 -25151 -28200 -56080 -65607 44633 139775 148486 93260 95545 70169 27278
4680 27278 46640 128627 83037 108084 86934 63477 44752 -28617 -16548 6364 -25151 -20046
4668 -20046 21738 62263 3791 -5954 19069 -44327 -133900 -104798 -38901 36293 49272 65166
4656 65166 25525 -27741 -64742 -40453 4749 -2725 -52832 4346 18059 16545 24386 -16156
4644 -16156 -19048 33292 -3789 -57169 -77790 -37246 -38382 -12319 -72991 -98855 -24134 51648
4632 51648 70156 35276 45792 116333 160006 112359 8506 17086 65773 52617 69282 72978
4620 72978 57638 21384 -21382 -35394 -20013 -41500 -66293 -83066 -8295 26562 11997 -43980
4608 -43980 -76556 -16198 -50102 -58571 13309 41927 -2033 -59186 -48252 -1725 -7596 -24406
4596 -24406 -4515 27086 7983 -31306 -48084 15175 35746 -11335 -34967 -53045 -81017 -88680
4584 -88680 -81176 -61126 -39839 -3090 73219 29305 -23031 -98168 -61801 -5903 15492 -7653
4572 -7653 -58419 -59768 -64254 -53817 -59378 -12581 -28009 -18265 -13944 -15668 -20247 43748 32213
4559 32213 -18830 -65573 -42185 -65285 -118551 -103032 -14050 34420 -10345 -52473 20434 88178
4547 88178 67634 5445 28476 20242 -46481 -22352 13716 -8258 -49067 -61758 -25769 -22083
4535 -22083 -49873 -47216 33572 -18914 13475 61313 -11139 -15333 57121 5675 -37452 -75193
4523 -75193 -95882 -89699 -65506 -19038 -16981 13915 -18051 -42157 40583 73036 19982 -5271
4511 -5271 -19934 -31608 5957 -22430 -53596 -57954 -28661 27494 18050 27541 115644 165905 160688
4498 160688 88134 28769 -26204 896 -28565 -6036 14887 29748 48089 22323 32219 -328
4486 -328 36542 -10334 16292 45801 -29674 -79867 -72077 -92457 -52703 -51985 -1853 20249 7617
4473 7617 12135 34193 2194 -3858 -16709 -8622 7112 38609 69853 32724 54033 47209 25066
4460 25066 8213 -20039 22650 36846 37993 50596 35580 -8975 -83413 -100723 -76758 -106618
4448 -106618 -143057 -99147 -58515 -56389 -22859 -10848 -30073 -35631 -31731 -14597 -14343 40804 11903
4435 11903 -11029 8584 -12149 -23597 -34293 -71090 -75213 -56250 -57249 -50004 -46564 -49273 -17930
4422 -17930 -37742 -6457 29072 -36655 -65342 -30905 40537 42255 27723 43181 34313 46961
4410 46961 29240 -9714 7991 -1668 39718 49975 -26513 -22550 -8791 -21218 -20930 -5740 12924
4397 12924 7092 -12123 -101 -22293 -45362 -103077 -77689 -50882 -54524 -55219 -27288 -22129 12596
4384 12596 -27501 -23886 34497 53021 78977 37805 25754 7622 28482 -2030 57746 117609
4372 117609 77645 35261 -73914 -78898 23425 77939 35973 50440 100056 109929 91536 28416
4360 28416 -62834 -74983 -96025 -69791 -14640 -63683 -90137 -37337 -23231 47061 6001 15
4348 15 32397 2664 -27717 -35949 -102565 -104949 -68843 -63930 31722 73463 50580 58037 60692
4335 60692 54787 64169 73922 39479 12263 4994 23586 31303 20994 49453 42390 20640 19817
4322 19817 -7195 -48855 -49696 -82631 -54733 -8684 -37904 -61968 -17845 15047 -2201 -38314
4310 -38314 -24842 77165 83398 -1517 -28514 -23484 -34318 -99292 -96933 -771 23376 1719
4298 1719 -20625 -3535 24893 18916 -3755 8865 49781 84119 35865 22314 10791 21102
4286 21102 71825 70143 19594 -53747 -52995 -10711 10423 14130 -37594 -18314 -46965 -40383 -21717
4273 -21717 -37344 -79301 -53186 -29958 16528 4718 23551 9851 -9496 1687 -11350 -8506
4261 -8506 -20428 -49422 -55353 -41688 -60029 -84486 -70591 -7947 30056 10719 -10797 -22775
4249 -22775 -38212 958 65421 42388 16450 -12564 -27326 -11216 37353 32265 31762 32872 37846
4236 37846 61543 11339 14999 55388 109588 95087 70306 23881 22542 22232 23012 38816 61740
4223 61740 45291 -27218 2398 -15749 -86203 -161226 -146979 -46813 -33989 15437 77636 110065
4211 110065 59464 -12751 -40397 -30701 -75874 -31170 32044 58879 59628 74088 1865 -32945
4199 -32945 -55127 -57479 -71998 -78946 -22037 36338 31006 -3939 -5147 -21821 -30599 14944 -292
4186 -292 20905 40211 85532 66094 80450 63894 25059 23689 -43189 -116278 -59359 11212
4174 11212 34765 50384 51363 43727 48048 39237 3534 3324 18142 37762 52320 5227 17616
4161 17616 49129 49877 28171 12625 -51296 -33131 -45941 -43819 -81722 -81069 -93778 -104023 -117605
4148 -117605 -57598 -65534 -58656 -31846 -45254 -36577 -5896 1140 32619 108376 139246 75110
4136 75110 -76622 -133449 -129751 -121897 -60505 5358 36645 7265 -18294 -30011 -61784 -77395
4124 -77395 -4514 17698 72432 95435 84751 63646 77481 64043 44101 81823 44899 64195
4112 64195 74466 70909 25020 -53119 -80073 -112313 -142224 -98389 -76904 -100568 -75747 1256
4100 1256 -30281 -32411 -10285 19951 86047 80498 55692 61871 91553 126648 79181 11599 37620
4087 37620 57232 37801 -40028 -103155 -108078 -51855 -32919 -38217 -38927 -8128 28760 50648 44094
4074 44094 59186 2661 -25650 -66305 -76344 -33615 6386 -60933 -129219 -109786 -125779 -122779
4062 -122779 -91182 -135620 -87222 -32432 26063 28442 -5085 -6981 13210 5481 23205 61268
4050 61268 60861 71162 64260 27399 13807 18596 5029 1201 -4235 4952 -7842 -7908 17150 12776
4036 12776 11693 54243 58236 27416 54342 97905 25893 -6371 1292 40301 61972 39588
4024 39588 -4750 9300 20172 67884 38992 -4749 -3879 53236 61204 27588 82855 137896
4012 137896 183969 165505 50460 -44488 -75656 -2300 12584 56938 93989 -1878 -52391
4001 -52391 -23730 21774 -32049 -28996 -66342 -81735 -91503 -57536 -39723 -34850 -7909 -4797 -29125
3988 -29125 11871 69012 53485 52805 49385 3117 -104616 -152285 -85822 -52522 -48488 -62744
3976 -62744 -86958 -102599 -98367 -119183 -38820 -10187 -26263 21614 77399 42176 42657 38913 -2710
3963 -2710 -63230 -29241 34569 50989 62010 53483 32222 88697 60324 64420 21671 -24361
3951 -24361 -10618 43101 39922 25009 14632 3003 14143 16492 57516 81185 103842 100749
3939 100749 60632 -8269 -7750 8239 -12888 -68930 -98835 -143295 -118210 -11043 31577 -12230
3927 -12230 20234 33362 25961 35943 -23637 -37053 -82657 -91993 -98114 -78900 -24520 -15207 21608
3914 21608 23514 -42516 -24785 -13751 -80459 -55400 -72399 -114695 -58872 -19054 -63827 -36415
3902 -36415 5923 -78740 -126808 -117158 -131577 -194998 -148707 -106846 -107059 -85951 -63632 -39558
3890 -39558 -35547 20238 64101 31120 -34648 -6276 -27792 19062 54567 55626 8371 -30193
3878 -30193 -40877 -2773 -14416 -60024 -15166 48654 66351 36672 42407 49044 -11853 -80659
3866 -80659 -11390 77044 69337 -13526 -60721 -59809 -109170 -155419 -145017 -103445 10824 25605
3854 25605 -7350 57001 64295 -2135 -15906 7979 16846 -28640 -34282 -33874 -23136 15531 59258
3841 59258 38779 -17176 -42501 24574 23570 47337 18857 -843 1877 56134 -27529 -67139
3829 -67139 -30192 36403 65250 11930 -19883 -36711 -10861 -11201 59312 54513 18266 -13141
3817 -13141 -94707 -107628 -59686 -90935 -96899 -72866 -42632 -45132 -57625 -8587 -23310 -26198
3805 -26198 -64972 -73585 -55879 7257 -14328 -23672 -28282 -37261 -30951 -63736 -79864 -36368 -65808
3792 -65808 -41239 -43526 -55643 -81326 -40646 -22121 -64766 -129980 -100010 -43711 -38279 -90878
3780 -90878 -59309 -40987 -34229 -44824 -27832 46754 27904 -15882 -45469 -69569 -88573 -82633
3768 -82633 -117518 -154890 -117693 -58064 -6481 5704 588 -16854 -27055 9236 32699 12146
3756 12146 -52620 -59795 -16058 16184 13145 -72493 -85812 -49824 -71674 -90279 -46491 -27810
3744 -27810 3149 73819 57819 54580 39741 10845 -28142 -35422 -35909 -8769 -25673 -9491 -9926
3731 -9926 -43391 -88780 -76791 -33885 -33206 -65915 -91423 -93752 -95757 -82268 -163658 -172604 -134295
3718 -134295 -139068 -182476 -118396 -53011 -77045 -78872 -49607 -61690 -9486 -3426 -88367 -46185
3706 -46185 -16494 -71264 -55404 -77817 -75368 -26552 18387 1271 50686 51940 -14345 18559
3694 18559 38382 -9438 -60196 -103957 -129987 -82815 23419 65372 16449 -81232 -110453 -77997
3682 -77997 -37679 -62567 -76143 -37400 12371 36079 12591 -64923 -81976 -46935 -47030 -89288
3670 -89288 -8162 41810 -44711 -82321 -85594 -31194 -29035 -75997 -77585 -13258 79952 31272
3658 31272 -8815 -41243 -25845 -32543 32037 83571 106518 47098 17771 -15014 -53571 -34095
3646 -34095 -38169 -51583 -33477 -24348 -1860 4928 -3953 -7046 -12237 -13795 -26938 -77623 -70390
3633 -70390 16777 23665 36813 51233 52041 7777 -7227 6852 -48593 -50757 59908 96777
3621 96777 103469 37486 -28468 -6010 -18510 -67031 -68102 -97563 -85334 -62716 8087 -32557
3609 -32557 -84453 -69240 -8126 11906 -6684 62657 53085 -4514 29735 89287 103583 4917
3597 4917 -41607 20733 5798 -30102 -41500 -29268 25771 -21575 -57156 -16954 20741 8022
3585 8022 18001 40779 -3400 -24858 -28085 -51366 13826 44254 25369 15136 51148 47355 35300
3572 35300 29883 -54436 -90477 -55222 -80625 -50534 -45407 -86354 -80834 -33474 14291 21893 4888
3559 4888 -41744 -74216 -24558 22526 25785 31773 36870 -59570 -85044 -26559 -16286 -16156 -40562
3546 -40562 -18111 -12133 -18955 -76946 -108097 -53684 -29995 -22491 -7794 -11796 23914 7447 -32605
3533 -32605 -52744 -63965 -50874 -16522 26744 72716 94955 40355 36187 34164 34767 10304 -7031
3520 -7031 -277 -35963 -10376 31169 6867 21135 17037 -1298 17256 32086 49361 54456 48270
3507 48270 47070 19761 -7200 -49769 -21905 30042 52421 -5759 -47493 -29350 41521 59889
3495 59889 58429 72764 83662 78760 102864 107303 42909 -12058 -35564 -58445 -15809 -6572 -3398
3482 -3398 -7910 12641 2632 29845 42152 -10596 -54776 -33478 -37524 -106876 -73525 13000
3470 13000 35889 -37731 -46112 -41955 -18247 20535 28534 -17316 20355 1763 -54046 -44288 -36958
3457 -36958 2008 38601 40782 46797 30682 6884 30550 -16361 -78287 -34802 33845 108973
3445 108973 103199 62194 -6191 -19630 -24603 -71911 -50091 -61218 -6076 26871 9403 4125
3433 4125 -43468 -26256 -6891 -19245 -12666 69717 131152 163154 141117 55110 9454 5232
3421 5232 9082 -8995 -58590 -72891 -59511 -26231 24276 -9688 -24436 -7010 11396 63849
3409 63849 83859 42745 14358 44255 85354 89436 84337 124037 115553 73578 15153 -31040
3397 -31040 -38604 14943 -4285 -24942 -4534 35923 36570 13417 -31485 -87833 -77227 -66729
3385 -66729 -155 4082 23325 79367 69964 48556 61932 85948 96445 61660 52718 36156
3373 36156 5354 52630 99838 56584 36283 33827 31159 25300 -37657 -29754 -10725 -23013 -2994
3360 -2994 23220 72991 26926 79681 104669 100022 64971 29422 22722 -16861 -60140 -60938 -29979
3347 -29979 -15234 -11499 -50727 -71930 -91181 -75785 -44997 -57320 -79365 -95864 -74268 -79369
3335 -79369 -95646 -74936 -66850 -37585 -27363 -36475 6724 -8935 -35304 10962 91340 106366
3323 106366 121581 107922 84842 -14890 -15492 65905 76276 85364 78698 46408 96043 95955 41088
3310 41088 29295 -43395 -47591 -3224 5819 14992 40215 -20664 -127956 -80338 -12796 14349
3298 14349 91994 76267 42667 -26036 -51805 16373 73237 78956 80714 65296 -18157 -97832
3286 -97832 -82495 -92293 -78402 -4333 -8495 -2832 -21172 -68568 -89709 -35112 43816 86744
3274 86744 51001 -58087 -135557 -155613 -38671 4439 -12680 -53662 -42243 -36321 -3337 79162
3262 79162 48802 27622 -27526 -53966 -64014 -40991 -22821 8635 1681 -813 -1358 -23480 -64496
3249 -64496 14222 91793 75181 21958 42229 54761 93333 49325 55156 -5989 -89529 -62821
3237 -62821 -48719 -18533 985 -35398 -17211 -4187 -43086 -41759 -74235 -97416 -105909 -81132
3225 -81132 -48047 -45934 -27153 -8320 12368 7626 26734 50945 89869 71953 -1513 -30558
3213 -30558 -40033 -42975 -28170 -49724 -73165 -14293 55041 12324 -14659 -35763 -824 68229
3201 68229 49572 14493 19482 36183 48966 30867 47653 66529 26870 38221 94269 66536
3189 66536 54095 877 -28375 -31615 6806 28450 -29639 -25728 41936 84896 37361 42350
3177 42350 38911 32123 -13998 -60675 -51117 38228 46804 26728 33293 53549 15556 19019 -26736
3164 -26736 -129 22700 31519 24298 367 -62580 -75935 -37191 -1884 16144 38496 58777
3152 58777 112555 83783 15135 1133 -25453 -42081 -3027 50770 130921 66873 9683 -54485
3140 -54485 -104076 -106808 -119044 -73861 -51489 -69312 -25374 -25638 1455 36817 19710 -38063
3128 -38063 -53172 -36860 4640 33760 12632 -4538 -1373 37320 31737 -3624 1039 -6576 33256
3115 33256 17354 -37703 -31445 16555 39615 52616 43351 11515 12494 36203 483 -33804 -35783
3102 -35783 -37285 -27661 -23507 -30186 3616 19517 60932 79055 62926 28092 -6680 6281 -20229
3089 -20229 -18788 6286 10882 -46455 -128065 -132027 -14849 19610 55901 83935 68994 52411
3077 52411 36160 38484 55238 35321 4252 -39118 -31225 -50968 -31957 -1422 31738 40163
3065 40163 57966 50438 72997 39020 20160 36324 -28572 -43788 -14115 -31956 -45541 -70183
3053 -70183 -79367 -184947 -183242 -100571 -65102 5232 3338 -3211 16242 23568 8098 -48532 -121695
3040 -121695 -80885 -102593 -81254 -15861 -6998 -9720 -55384 -134469 -141317 -70569 -29120 -57081
3028 -57081 -52226 29585 55562 6585 2543 -13830 -79412 -71570 -54417 -27719 -57152 -52721 -24310
3015 -24310 18665 43916 66809 60952 22620 31687 22575 -22757 -58959 -21230 29723 39877
3003 39877 100686 82708 -5528 1209 27463 40479 117305 123957 28298 70570 105339 63350
2991 63350 -2207 -25256 22640 55365 58701 95128 76046 31649 1089 173 8303 63247 64148
2978 64148 94216 73488 68010 74514 50309 -18650 6139 32197 60475 54556 37102 58590
2966 58590 56106 -275 -11714 71691 43697 -56318 -67644 -33568 -11061 39564 26002 3557
2954 3557 49046 62077 -23440 27333 80472 58968 13873 -1523 -26809 -30685 -1510 -27002
2942 -27002 12820 34041 30932 16645 25302 6214 -57068 -54270 -16882 28061 49175 57446 44190
2929 44190 47253 66057 71315 454 -46195 3669 13379 9900 -67405 -76713 -21252 3953 -34088
2916 -34088 11222 53031 24019 29151 5929 -67454 -145108 -185286 -90762 -18546 -12522 -15489
2904 -15489 -7125 -3418 36389 7363 -48446 15014 6641 38112 80962 72552 35568 -15484 -13692
2891 -13692 -40517 7077 20978 73998 101108 102592 45278 38347 58466 46125 5545 50074
2879 50074 70048 74813 45193 4338 22389 49807 23754 -1855 18737 8353 -47184 -12125
2867 -12125 9636 46553 1762 -87826 -101900 -61429 -23822 26960 80225 102596 49394 16769
2855 16769 5461 32082 22095 29880 34849 43093 -8736 -106644 -65269 21816 -16673 -43377 -6088
2842 -6088 -1326 -57361 -76841 28677 53321 22379 -13863 -30604 -25965 21877 87456 119086
2830 119086 45036 50307 80937 55512 26500 7980 -32799 -12423 69387 90834 62477 58003
2818 58003 35886 -41702 -61758 8476 24555 -3343 10973 35380 40829 36142 9757 -14395
2806 -14395 5169 1819 5450 25065 -8670 -75690 -16884 -21914 -28288 -31240 -1298 31121 28537
2793 28537 32238 43240 -20916 7133 52408 -33440 -57221 -39395 -38105 -31080 -45319 26417
2781 26417 67302 28649 45082 53397 60155 26162 67759 91253 73255 16180 3810 13746
2769 13746 -5211 -20062 -24730 -59759 -39866 -17411 1841 70068 133665 151991 89975 32349
2757 32349 -1543 -5148 -26319 -46960 20743 69668 44618 -21884 -76928 -60526 -49950 -23864
2745 -23864 6619 4393 -5022 -1251 29492 -63003 -135110 -110773 -54763 36010 129810 86860
2733 86860 -29363 -24608 -10368 1703 805 21482 52445 71792 3260 -54537 -67063 -61036
2721 -61036 -86535 -57945 12416 14274 21665 30207 91128 100074 11004 -28728 -35765 -32008 -5077
2708 -5077 -5569 23370 53839 51811 -33477 -5453 4191 62462 83468 122490 85057 49440 54282
2695 54282 93797 40337 2536 -6503 -60558 -44040 3192 65445 46012 30491 71716 68216
2683 68216 18918 -24935 9605 -10253 28375 55277 58237 33146 -3563 -59841 -12263 85106
2671 85106 122108 125568 92278 34644 13657 -22007 -65905 -62514 -74317 -87608 -97293 -67493
2659 -67493 -54798 -3701 -1635 21330 -6253 -28080 33122 87030 70168 15362 -16970 33437
2647 33437 49524 -437 -34598 -36040 -10755 25015 31968 3245 -835 -34775 -55939 9299
2635 9299 -1380 -9340 -17417 -50199 -73522 -44270 13894 38320 32815 22365 -21401 -48872 -29248
2622 -29248 14525 4851 11622 -5052 66702 97381 50686 14258 18998 87262 63581 2385
2610 2385 21443 38374 49828 81906 49136 84802 116060 93118 12855 17208 34355 11884
2598 11884 -66932 -24128 46084 4405 4075 45508 25613 -707 19918 62220 63119 34661 -27586
2585 -27586 -27082 -36505 -76714 -8369 2442 -4326 6899 -29607 -52414 -81410 -109852 -138378 -110564
2572 -110564 -21436 19620 1954 -31351 -64598 -42680 -31433 -11106 18876 61993 58188 10835
2560 10835 -23175 -50127 -45994 -57087 -63772 -47695 -76678 -117500 -140337 -125196 -155828 -124983
2548 -124983 -90508 -46362 -36671 -18183 -8283 -18427 -14288 27088 31712 11526 -5703 -24055
2536 -24055 -6000 19763 -9749 -6739 -24316 -21665 -61469 30512 76088 62884 73585 52096
2524 52096 -19093 -23125 30416 -15703 -24828 1155 63514 -33773 -20902 3762 -28949 -47265
2512 -47265 -76136 -99271 -100217 -90856 -97782 -30215 -33020 -29889 45408 61550 120294 163248 111125
2499 111125 46505 -29987 -75436 -115962 -138375 -95735 -11482 67423 80508 51471 13261 -17841
2487 -17841 50834 29999 27947 34120 -66982 -115307 -88629 -65804 -48327 -36632 22200 -28788
2475 -28788 -80855 -23316 24158 26229 15671 -6835 -1460 26792 28375 -20142 -95483 -97166 -48688
2462 -48688 14860 34315 72384 73946 43651 25377 65530 105708 143694 112694 22343 4805
2450 4805 -17454 -18006 -44938 -42989 -49972 -101160 -171708 -152738 -106809 -69059 -56961 -26844 23691
2437 23691 -36275 -51961 -40321 -28664 -38650 -3105 23948 41578 21420 45536 63074 -18436
2425 -18436 -29425 -25769 25916 15562 -63523 -98560 -79378 -81119 -79304 -126995 -129491 -102723 -70963
2412 -70963 -9972 -16645 -44312 -19656 23861 25481 31434 -15553 -37543 -34356 -2462 35554 -2255
2399 -2255 -43034 -3756 -15645 -23111 -38201 12856 6959 -60020 -72844 -44453 -41937 -8656 -66340
2386 -66340 -108166 -85663 -55925 22871 14530 -3531 10885 -38322 -52525 -23213 36576 17287
2374 17287 -37421 -28052 -15650 -10125 -6219 -1642 -47364 -58488 -20860 -13168 -3161 2411 -14724
2361 -14724 769 -61484 -60559 -20254 1775 -26284 -52550 -45292 -59550 -87399 -80854 -65821 -45572
2348 -45572 24993 31948 32842 23508 32113 41679 28240 -3132 -63586 -35096 14061 -1662 -74276
2335 -74276 -69043 -49626 -28351 -4503 -22311 -4362 7589 6454 38639 893 -73625 -46734
2323 -46734 -30 37808 101046 68044 29420 39410 28864 -47135 -129670 -168464 -116826 -51253
2311 -51253 -34046 -693 24167 -20009 -34333 -61087 -53337 -4475 60537 93858 7895 -69049
2299 -69049 -97328 -80399 -67822 -78722 -94998 -70948 -75066 -71690 -88274 -66476 -74972 -38808
2287 -38808 3613 57614 121325 126838 98920 19652 43553 76143 44823 -22989 -76641 -69932
2275 -69932 -38238 -5034 -19564 -48456 -44478 -41955 -37987 -29595 -11588 -43396 -68149 -38505 -18843
$$ [...]
##END NTUPLES=NMR SPECTRUM
##END=
