##TITLE=Analysis number 316124
Compound Code cc 40802
Book Reference 440/126
Project Code adrs
Chemist Name craigr
##JCAMPDX= 6.0         $$ Bruker NMR JCAMP-DX V2.0
##DATA TYPE= NMR SPECTRUM
##DATA CLASS= NTUPLES
##ORIGIN= Bruker BioSpin GmbH
##OWNER= nmr
$$ XWIN-NMR		Version 3.5
$$ Mon Dec 19 13:22:39 2005 GMT Standard Time (UT+0h)  MAYBRIDGE\nmr@NMR_250MHZ
##.OBSERVE FREQUENCY= 250.131544655141
##.OBSERVE NUCLEUS= ^1H
##.ACQUISITION MODE= SIMULTANEOUS (DQD)
##.ACQUISITION SCHEME= undefined
##.AVERAGES= 16
##.DIGITISER RES= 18
##SPECTROMETER/DATA SYSTEM= dpx250
##.PULSE SEQUENCE= zg30
##.SOLVENT NAME= CDCl3
##.SHIFT REFERENCE= (INTERNAL, CDCl3, 0, 16.522)
##AUDIT TRAIL= $$ (NUMBER, WHEN, WHO, WHERE, WHAT)
$$ ##TITLE= Audit trail, XWIN-NMR		Version 3.5
$$ ##JCAMPDX= 5.01
$$ ##ORIGIN= Bruker BioSpin GmbH
$$ ##OWNER= nmr
$$ C:\u/data/dgb/nmr/ADRS/13960/pdata/1/auditp.txt
$$ ##AUDIT TRAIL=  $$ (NUMBER, WHEN, WHO, WHERE, WHAT)
(   1,<2005-12-19 13:22:18.95 +000>,<MAYBRIDGE\nmr>,<NMR_250MHZ>,
      <created by zg, POWCHK disabled, PULCHK disabled
       configuration hash MD5:
       62 19 C7 07 E1 42 D1 B7 37 6C 3D D0 77 39 F9 E6
       data hash MD5: 64K
       E0 69 44 E5 F3 E3 01 F5 52 ED CF 80 E6 54 A6 9E>)
(   2,<2005-12-19 13:22:30.81 +000>,<MAYBRIDGE\nmr>,<NMR_250MHZ>,
      <Start of raw data processing
       ef LB = 0.3 FT_mod = 6 PKNL = 1 SI = 32K 
       data hash MD5: 32K
       1C 19 F6 9F 36 21 D4 B2 D7 6C 09 0C A6 15 FE 5A>)
(   3,<2005-12-19 13:22:32.62 +000>,<MAYBRIDGE\nmr>,<NMR_250MHZ>,
      <apk 
       data hash MD5: 32K
       35 66 BF 35 F7 42 60 47 5F 01 8B 7E 0B 35 EC F8>)
(   4,<2005-12-19 13:22:33.40 +000>,<MAYBRIDGE\nmr>,<NMR_250MHZ>,
      <abs ABSG = 5 
       data hash MD5: 32K
       01 40 92 97 E2 EF 62 07 0A A8 89 EB 08 09 A8 8A>)
$$ ##END=
$$ 
$$ hash MD5
$$ 43 CE EF 34 27 86 B6 2D 3D 8F 51 3E F9 FF 92 4C
##$RELAX= 
##$RELAX= 
##$RELAX= 
##$RELAX= 
##$RELAX= 
##$RELAX= 
##$RELAX= 
$$ Bruker specific parameters
$$ --------------------------
##$DU= <C:\u>
##$EXPNO= 13960
##$NAME= <ADRS>
##$PROCNO= 1
##$TYPE= <nmr>
##$USER= <dgb>
##$AMP= (0..31)
100 100 100 100 100 100 100 100 100 100 100 100 100 100 100 100 100 100 
100 100 100 100 100 100 100 100 100 100 100 100 100 100 
##$AQSEQ= 0
##$AQ_mod= 3
##$AUNM= <au_zg>
##$AUTOPOS= <11 >
##$BF1= 250.13
##$BF2= 250.13
##$BF3= 250.13
##$BF4= 250.13
##$BF5= 500.13
##$BF6= 500.13
##$BF7= 500.13
##$BF8= 500.13
##$BYTORDA= 1
##$CFDGTYP= 0
##$CFRGTYP= 5
##$CHEMSTR= <none>
##$CNST= (0..31)
1 1 145 1 1 1 1 1 1 1 1 1 1 1 1 1 1 1 1 1 1 1 1 1 1 1 1 1 1 1 1 1 
##$CPDPRG= <>
##$CPDPRG1= <>
##$CPDPRG2= <>
##$CPDPRG3= <>
##$CPDPRG4= <mlev>
##$CPDPRG5= <mlev>
##$CPDPRG6= <mlev>
##$CPDPRG7= <mlev>
##$CPDPRG8= <mlev>
##$CPDPRGB= <>
##$CPDPRGT= <>
##$D= (0..31)
0 1 0 0 0 0 0 0 0 0.06 0 0 0 0 0 0 0.0002 0 0 0 0 0 0 0 0 0 0 0 0 0 0 
0 
##$DATE= 1134998537
##$DBL= (0..7)
120 120 120 120 120 120 120 120 
##$DBP= (0..7)
150 150 150 150 150 150 150 150 
##$DBP07= 0
##$DBPNAM0= <>
##$DBPNAM1= <>
$$ [...]
##$SUBNAM7= <"">
##$SUBNAM8= <"">
##$SUBNAM9= <"">
##$SW= 20.6930455092707
##$SWIBOX= (0..15)
0 0 3 0 0 0 0 0 0 0 0 0 0 0 0 0 
##$SW_h= 5175.983436853
##$TD= 65536
##$TD0= 1
##$TE= 294.16
##$TE2= 300
##$TE3= 300
##$TEG= 300
##$TL= (0..7)
0 120 120 120 120 120 120 120 
##$TP= (0..7)
150 150 150 150 150 150 150 150 
##$TP07= 0
##$TPNAME0= <>
##$TPNAME1= <>
##$TPNAME2= <>
##$TPNAME3= <>
##$TPNAME4= <>
##$TPNAME5= <>
##$TPNAME6= <>
##$TPNAME7= <>
##$TPOAL= (0..7)
0.5 0.5 0.5 0.5 0.5 0.5 0.5 0.5 
##$TPOFFS= (0..7)
0 0 0 0 0 0 0 0 
##$TUNHIN= 0
##$TUNHOUT= 0
##$TUNXOUT= 0
##$USERA1= <user>
##$USERA2= <user>
##$USERA3= <user>
##$USERA4= <user>
##$USERA5= <user>
##$V9= 5
##$VALIST= <valist>
##$VCLIST= <CCCCCCCCCCCCCCC>
##$VD= 0
##$VDLIST= <DDDDDDDDDDDDDDD>
##$VPLIST= <PPPPPPPPPPPPPPP>
##$VTLIST= <TTTTTTTTTTTTTTT>
##$WBST= 1024
##$WBSW= 4
##$XGAIN= (0..3)
0 0 0 0 
##$XL= 0
##$YL= 0
##$YMAX_a= 661012
##$YMIN_a= -716517
##$ZGOPTNS= <>
##$ZL1= 120
##$ZL2= 120
##$ZL3= 120
##$ZL4= 120
##$ABSF1= 16.522
##$ABSF2= -4.171173
##$ABSG= 5
##$ABSL= 3
##$ALPHA= 0
##$AQORDER= 0
##$ASSFAC= 0
##$ASSFACI= 0
##$ASSFACX= 0
##$ASSWID= 0
##$AUNMP= <proc_1d>
##$AZFE= 0.1
##$AZFW= 0.1
##$BCFW= 0
##$BC_mod= 0
##$BYTORDP= 0
##$COROFFS= 0
##$CY= 12.5
##$DATMOD= 1
##$DC= 0
##$DFILT= <>
##$DTYPP= 0
##$F1P= 14.0000005364418
##$F2P= -0.99999901652339
##$FCOR= 0.5
##$FTSIZE= 32768
##$FT_mod= 6
##$GAMMA= 0
##$GB= 0
##$INTBC= 1
##$INTSCL= 1
##$ISEN= 128
##$LB= 0.3
##$LEV0= 0
##$LPBIN= 0
##$MAXI= 10000
##$MC2= 0
##$MEAN= 0
##$ME_mod= 0
##$MI= 0
##$NCOEF= 0
##$NC_proc= -3
##$NLEV= 6
##$NOISF1= 0
##$NOISF2= 0
##$NSP= 0
##$NTH_PI= 0
##$NZP= 0
##$OFFSET= 16.522
##$PC= 1
##$PHC0= 83.10383
##$PHC1= 7.259091
##$PH_mod= 1
##$PKNL= yes
##$PPARMOD= 0
##$PSCAL= 4
##$PSIGN= 0
##$REVERSE= no
##$SF= 250.13
##$SI= 32768
##$SIGF1= 0
##$SIGF2= 0
##$SINO= 400
##$SIOLD= 32768
##$SREGLST= <1H.CDCl3>
##$SSB= 0
##$STSI= 32768
##$STSR= 0
##$SW_p= 5175.98343685301
##$SYMM= 0
##$S_DEV= 0
##$TDeff= 65536
##$TDoff= 0
##$TI= <Analysis number 999999
Compound Code 99
Book Reference 9
Project Code 9>
##$TILT= no
##$TM1= 0
##$TM2= 0
##$TOPLEV= 0
##$USERP1= <user>
##$USERP2= <user>
##$USERP3= <user>
##$USERP4= <user>
##$USERP5= <user>
##$WDW= 1
##$XDIM= 32768
##$YMAX_p= 463401617
##$YMIN_p= -102298
$$ End of Bruker specific parameters
$$ ---------------------------------
##NTUPLES= NMR SPECTRUM
##VAR_NAME=  FREQUENCY,     SPECTRUM/REAL,   SPECTRUM/IMAG
##SYMBOL=    X,             R,               I
##VAR_TYPE=  INDEPENDENT,   DEPENDENT,       DEPENDENT
##VAR_FORM=  AFFN,          ASDF,            ASDF
##VAR_DIM=   32768,         32768,           32768
##UNITS=     HZ,            ARBITRARY UNITS, ARBITRARY UNITS
##FACTOR=    0.157963299565203, 1,           1
##FIRST=     4132.6476996994, 0,             0
##LAST=      -1043.33573715361, 0,           0
##MIN=       -1043.33573715361, -102298,     0
##MAX=       4132.6476996994, 463401617,     0
$$ Real data points
##PAGE= N=1
##DATA TABLE= (X++(R..R)), XYDATA
$$ [...]
19336F0084O40q56o00R421r94N067p099Q632j887n183O835j415O68R295l412r759
19320F9437q292n403p795r458M827R048O750r34J231K762M536q166m930J998l473
19305E2138k1199j6032P358K1772J7420J811k770p59n962P58k123K805L563n380
19291E3400j3052P181J1775o54j2362l333n669P415J2967P094M756m48p515J719
19277F3274j2375p08J2898P715j783j6887k023N194p959R805J8409Q426q920j5564
19263E9502l991J894l974p525R589J3430l97j1189j6256p729o345M565j044n695
19249B4835O580J0909K5222M349N30O108n721p364k065m785j0977P028o45r87
19235E3017k784J0154N166K2656l651p931k467J185K041q15m846m240K177L558
$$ plain form
19336 60084 60724 59868 59268 68689 67695 72762 65663 74295 72408 67225 74060 72645 73313 82608 79196 69437
19320 69437 61145 55742 47947 38489 43316 52364 59114 58180 59411 62173 66709 58543 53613 55611 52138
19305 52138 30939 14907 22265 44037 61457 63268 60498 59739 53777 54535 52412 55217 58780 53400
19291 53400 40348 47529 59304 58650 46288 42955 37286 44701 57668 64762 69518 69070 61555 63274
19277 63274 50899 50191 63089 70804 69021 52134 50111 55305 47346 57151 75560 83986 75066 59502
19263 59502 55511 57405 53431 45906 55495 68925 68528 57339 41083 33354 27009 31574 30530 24835
19249 24835 31415 42324 67546 71895 72425 78533 72812 65448 63383 58598 47621 54649 54004 53017
19235 53017 50233 60387 65553 88209 84558 76627 74160 75345 77386 76571 71725 67485 69662 73220
19221G3220m75r874J7824J6947J0306o215J3721J0936o267P116l804j9816O888
19208A10507J1179J5839L6638M0983M3384L9255M3549N1947K3300k099k2337l0255
19196C61890k3181m5006m8638j9337k1349j39P694n647j514j2382j2934k148j690
19183A75619l0913o738l896j4352q159j2134o981n095p249j2498J131N317J2042
19170H6094R896l18j7253j364P951M864O810K3674K1668J8776J8831J1820k635
19157A88814m011r263n014P713K8144L8682K7843N3477P4389N7629L3447K1079
19145E12929j5524m6038n0024m6584n7853n8773l3419l2978k4433M060J910Q566
19133A61839l848J485r475n117p509k599l769k0028j6268n008J0886P449k125
$$ plain form
19221 73220 72745 62871 80695 97642 107948 101733 115454 126390 120123 127239 123435 103619 110507
19208 110507 121686 137525 174163 215146 258530 297785 341334 393281 416581 414482 392145 361890
19196 361890 338709 293703 245065 225728 204379 204240 211934 206287 204773 192391 179457 177309 175619
19183 175619 144706 137968 134072 119720 111561 99427 92446 87351 80102 67604 68735 74052 86094
19170 86094 95990 95672 78419 77055 85006 89870 96680 120354 142022 160798 179629 191449 188814
19157 188814 184803 175540 170526 178239 206383 245065 272908 326385 400774 458403 491850 512929
19145 512929 497405 451367 401343 354759 296906 238133 204714 171736 147303 151363 153273 161839
19133 161839 157991 159476 150001 144884 137375 134776 131007 110979 94711 89703 100589 108038 105913
19120A05913j0867j992m174N317J2936n501j6661j6108J4733N087Q741N702J6093
19107A19219P890j7289j2841l194L665P109P660N04O707N064L638J452p359J7515
19093A39740K5131O797J9562K8607N4017O8427M1501J8170K8700L6711L7871P28
19081E05962m7617l3531j2883r078K4805Q0336J26985J17033M3363J0989m324
19070H02040k4583k1030l8039l2905k2648Q692M2687K5232L7884R0114J58855
19059A026299J89987J66762J43606P0311J5230o8023j49640j89415j94850j90447
19049H19820j66332j22033r6957n2017j3885K2900O0391M7354j7265k0333o415
19038D55228j2036j6567k624J5492N5855Q5649M9693L3521O1012P5051K5048J819
$$ plain form
19120 105913 95046 93054 88880 94197 107133 101632 84971 68863 83596 88683 97424 103126 119219
19107 119219 127109 109820 96979 93785 97450 104559 112219 112723 119430 124494 128132 129584 122225 139740
19093 139740 164871 171668 191230 219837 273854 342281 383782 401952 430652 467363 505234 505962
19081 505962 458345 424814 411931 402853 427658 507994 634979 752012 795375 806364 802040
19070 802040 777457 756427 718388 685483 662835 671527 714214 739446 777330 867444 1026299
19059 1026299 1216286 1383048 1526654 1596965 1612195 1544172 1394532 1205117 1010267 819820
19049 819820 653488 531455 434498 382481 368596 391496 451887 499241 481976 461643 455228
19038 455228 443192 426625 424001 439493 495348 580997 630690 664211 725223 800274 825322 827141
19026H27141M9730Q7059N4820r388j1664k1680m5080q3391q5908n3617j9959k3620
19014F64443k9513j6619J9083J2114k9201o4088p0368m5916l3567o1809n3713
19003B90846k7618k8849j6495j6487k7721j0120J683j4933j4686j1999k518P402
18991A28505Q594M146P60m715m156N278J0791J5042j1735q872M798J1254R248
18978A68938N17J210j4316k0804K643N933J0113m097r084R824J4415l43R628L568
18964A78145q929J4378q793J0452K794j6175J6049J99k631K958N613j0189j4314
18951A69557R990M973j0997j6222r980J695J337N689m534Q466J3094j2434l939
18938A56695L381o286o605Q408J0809J2043J281J3764O731J9701J37k228L675
$$ plain form
19026 827141 876871 963930 1018750 1009362 997698 976018 930938 847547 761639 708022 688063 664443
19014 664443 634930 618311 637394 649508 620307 556219 485851 439935 406368 344559 290846
19003 290846 263228 234379 217884 201397 173676 163556 165239 150306 135620 123621 121103 128505
18991 128505 137099 141245 142005 137290 133134 138412 149203 164245 152510 143638 148436 159690 168938
18978 168938 169455 170665 156349 135545 138188 144121 154234 150137 141053 150877 165292 164949 174577 178145
18964 178145 169216 183594 174801 185253 188047 171872 187921 188120 185489 188447 194060 183871 169557
18951 169557 179547 184520 173523 157301 147321 149016 150353 156042 151508 159974 173068 160634 156695
18938 156695 160076 153790 147185 155593 166402 178445 179726 193490 200221 219922 220059 217831 221506
18925B21506R423l238k106O414J0776k528J4038J6058M605m118J429N845O222
18912B84326N434J0391K2309J6098J1679J1743J2467J6397K2468J2898k1267n813
18900C99130P709P276n578j2202j9774k7854l2550k7586j3215j6496k5903n401
18888B27556K192r8P457l322J5226l900M50j425L525P548R176J3051K0965J7735
18874C16136P498m849P956O299j5729j010K032Q810J1730O70O315m481J453J1013
18860C53843L014O178J8926J0503K966l675k897J1156M770J4097J3726J8600J1165
18847D62372q53J3423J0564J1505K0280J0394K3055L0933L0173L1234K9800N5221
18835G28101M5259K4592K3964L6416K0314J8558K1737L4630L5452N5826L5844
$$ plain form
18925 221506 230929 227691 225585 231999 242775 240247 254285 270343 274948 270830 272259 278104 284326
18912 284326 289760 300151 322460 338558 350237 361980 374447 390844 413312 426210 404943 399130
18900 399130 406839 414115 408537 396335 376561 348707 316157 288571 275356 258860 232957 227556
18888 227556 229748 229650 237107 233785 249011 245111 245561 244136 247661 255209 264385 277436 298401 316136
18874 316136 323634 318785 326741 333040 317311 316301 318333 327143 338873 339543 345858 341377 342830 353843
18860 353843 356857 363035 381961 392464 395430 391755 388858 400014 404784 418881 432607 451207 462372
18847 462372 461519 474942 485506 497011 517291 527685 550740 581673 611846 643080 672880 728101
18835 728101 773360 797952 821916 858332 878646 897204 918941 953571 989023 1044849 1080693
18824A080693K9771M2675O4040P5430Q9561J10010J29967J27655R2933J18801
18814A961536J72194J97720J82911J70139J36628J30693J57870J76951J46161
18805C432803J10292J37790K08836K88031K96947K36693K16852K55440L14036
18796E497720L74013M12890M41018M99940O54764R05188J261093J823418K713209
18787A4583253M355658P460690J2426134J6389506J6924062J4940013J2609565
18780I9688881J0943385J4260284K0594079K0514202J4896537P189498l77356
18773A87709510o812297o950926p929099j1044953j4356814j5683786j5837420
18766A09094215j5176204j4654347j4459183j3562921j1599039q420904n429169
$$ plain form
18824 1080693 1110464 1153139 1217179 1292609 1382170 1492180 1622147 1749802 1842735 1961536
18814 1961536 2133730 2331450 2514361 2684500 2821128 2951821 3109691 3286642 3432803
18805 3432803 3543095 3680885 3889721 4177752 4474699 4711392 4928244 5183684 5497720
18796 5497720 5871733 6284623 6725641 7225581 7880345 8785533 10046626 11870044 14583253
18787 14583253 18938911 26399601 38825735 55215241 72139303 87079316 99688881
18780 99688881 110632266 124892550 145486629 166000831 180897368 188086866 187709510
18773 187709510 180897213 173946287 166017188 154972235 140615421 124931635 109094215
18766 109094215 93918011 79263664 64804481 51241560 39642521 31221617 25792448
18759B5792448l642909k670338k101966j713028j413435j128385r00625q14643
18751A1407119q12951p67287o94297o43896o05455n24568m69428m39197m12892
18742F037148l96177l52948k78565j89918j46379j45331j82357j94589k20754
18733C930130k12958k10293k13797k17427k32502k10067k04306j99745j99416
18724B029619j86601j68385j57648j11898q2431q7318p7960n8553l4431l8497
18714A025897j4282j0018k5726l0810j2197j6179l2447k8785k4196L1j1998q358
18702H10932J810J5384L4459N4013L5379K5466M5372P5695J03503J3436m5114
18691A170335k3434k721j0235J1288k4611o3520m3456k5626m4311p5926r1766
$$ plain form
18759 25792448 22149539 19479201 17377235 15664207 14250772 13122387 12221762 11407119
18751 11407119 10594168 9826881 9132584 8488688 7883233 7358665 6889237 6450040 6037148
18742 6037148 5640971 5288023 5009458 4819540 4673161 4527830 4345473 4150884 3930130
18733 3930130 3717172 3506879 3293082 3075655 2843153 2633086 2428780 2229035 2029619
18724 2029619 1843018 1674633 1516985 1405087 1322656 1235338 1157378 1098825 1064394 1025897
18714 1025897 1011615 1001597 975871 945061 932864 916685 884238 855453 831257 831288 819290 810932
18702 810932 812742 828126 862585 916598 951977 977443 1022815 1098510 1202013 1215449 1170335
18691 1170335 1146901 1144180 1133945 1145233 1120622 1057102 1013646 988020 943709 867783 776017
18680G76017o1398l1625k7491k7475k0366j388J1607N780J0663J1489n894k2269
18668F17650j2169j5444j4661J2449J9572K6321L9942O3094N2654N5217N0250
18657H94875K4842j2043j3128k775P688M39N858K7447O9661Q1243M6682J5377
18645A146166J9322O3878P5592j3947n4870l8347k5670n6729o5792m2984k0210
18634I86409P20p311j5234j5199o922J5833N3166J13800J34489R9549L7758K1602
18622A418660L2149R463k2193n3883O865R7538J67644J26779N8887J02359J32876
18611B077144M8952m0257o0208o3170p3105j02506r3288o6701l8384p910J3672
18600A594239M9016Q2384J12577J20960J71366J92182J71501J67143K05972K60929
$$ plain form
18680 776017 714619 682994 655503 628028 607662 606274 617881 623661 634324 645813 639919 617650
18668 617650 605481 590037 575376 587825 607397 633718 673660 736754 789408 844625 894875
18657 894875 919717 907674 894546 891771 899459 899898 905756 933203 1002864 1084107 1130789 1146166
18645 1146166 1165488 1229366 1304958 1291011 1236141 1197794 1172124 1115395 1049603 1006619 986409
18634 986409 987129 979818 964584 949385 942463 958296 1011462 1125262 1259751 1359300 1397058 1418660
18622 1418660 1450809 1460272 1438079 1384196 1391061 1488599 1656243 1783022 1841909 1944268 2077144
18611 2077144 2126096 2085839 2025631 1962461 1889356 1786850 1693562 1626861 1588477 1580567 1594239
18600 1594239 1643255 1725639 1838216 1959176 2130542 2322724 2494225 2661368 2867340 3128269
18590C128269K68782K40005K20485K31770K68699K73630K61856K84651L38998
18581E517145M65361N77707P29291J007515J494437K366761L989888O555415O932156
18572B9635676N471538Q475374J6443999K5907957K0680816R161647L922490J374899
18564A21074396L639886M644640M10024j736079k331334m077039l264731o957284
18556A11402479j2077246j3939945j1753852o666002j089884Q37560l41808l111950
18548F3259352n403049n025256n881394p291218p621226o264803l936332k438018
18540A9398056j663876j186810q46442o59771n79190m33602j36928J88095L85015
18531A4464547N68609J022475J744013K766874M634798Q265080J5153432J9213814
$$ plain form
18590 3128269 3397051 3637056 3857541 4089311 4358010 4631640 4893496 5178147 5517145
18581 5517145 5982506 6560213 7289504 8297019 9791456 12158217 16148105 22703520 29635676
18572 29635676 35107214 43582588 60026587 85934544 106615360 115777007 119699497 121074396
18564 121074396 124714282 129358922 129768946 128032867 125701533 121624494 118359763 111402479
18556 111402479 99325233 85385288 73631436 66965434 65875550 66713110 66371302 63259352
18548 63259352 57856303 52831047 46949653 39658435 32037209 25772406 21836074 19398056
18540 19398056 17734180 16547370 15700928 15041157 14461967 14028365 13891437 14079532 14464547
18531 14464547 15033156 16055631 17799644 20566518 25201316 33466396 48619828 67833642
18523F7833642R394227N795921J2126576J6824240J6414414J3861619J2736718
18516A54987357K371303n624668n792222j548568P502545J6950294J1745036P895931
18508A88487008N771976n871461j5766770k1999866k3702082k3237238k3189616
18501H0491951j8727811j2284206q129618o227504n265471m233576l264452k535956
18493A9823357j999732j675619j471515j277550j079535r30813q42082p38778
18485I807733o59190o03268n58910n29061m86278m28002l95141l90953l95208
18476E361722l89767l51491l11615k91105k67029k54168k21312j79673j41824
18467B953738j02845n4825j1715R3856K50678M62834M08511K29157j6106j29161
$$ plain form
18523 67833642 77227869 83023790 95150366 111974606 128389020 142250639 154987357
18516 154987357 157358660 151733992 145941770 144393202 151895747 168846041 180591077 188487008
18508 188487008 194258984 188387523 172620753 150620887 126918805 103681567 80491951
18501 80491951 61764140 49479934 41350316 35122812 29857341 25623765 22359313 19823357
18493 19823357 17823625 16148006 14676491 13398941 12319406 11388593 10546511 9807733
18485 9807733 9148543 8545275 7986365 7457304 6971026 6543024 6147883 5756930 5361722
18476 5361722 4971955 4620464 4308849 4017744 3750715 3496547 3275235 3095562 2953738
18467 2953738 2850893 2796068 2784353 2878209 3128887 3591721 4000232 4229389 4213283 4084122
18457D084122j12560o9829N1226m5375l39196l42911k50350k26839l13475l86674
18447B048139l08197j92295j16447q6723q4143p3931n7655m2406l0016l3602k5767
18436I96957l9679j6862P438J978j982j0385j7486r867j4707l17k78J5396M0992
18423I51198J13590J72495J81093J51003J08077N5320k5911r4811j22120j65470
18413A324464j43833j14420n9596m4710o1252m4287l0221l9417m4217m9690m0781
18402F52040k8660K902m333p926J2137J2917K8079K9555K3187J4720o384Q120
18390G36354m211R400L1597K1865R729l226j4074k8742k8352m0619l3460m4436
18378F11825k3133j2412K9130K2782L701Q449L21k714J073J1542J4475J6882J9278
$$ plain form
18457 4084122 3971562 3901733 3952959 3907584 3568388 3225477 2975127 2748288 2434813 2048139
18447 2048139 1739942 1547647 1431200 1344477 1260334 1186403 1128748 1086342 1056326 1022724 996957
18436 996957 957278 940416 947854 949832 947850 937465 919979 910112 895405 895088 894810 910206 951198
18423 951198 1064788 1237283 1418376 1569379 1677456 1732776 1706865 1612054 1489934 1324464
18413 1324464 1180631 1066211 1006615 961905 900653 856366 826145 786728 742511 692821 652040
18402 652040 623380 626282 621949 614023 626160 639077 667156 696711 719898 734618 728234 736354
18390 736354 732143 741543 773140 795005 804734 801508 787434 758692 730340 689721 656261 611825
18378 611825 588692 576280 605410 628192 631893 640342 640663 637949 639022 650564 665039 681921 701199
18365G01199K5334N4892O7155N5845N0442M4047L5213M0647N0238P6112Q6717
18354A287841J14154R8649J01205J28472J17817R7397N7461K1837l031o27q651
18343B012524M161J4471N9550R1121J20690J85328K45311L43520M98566P85286
18333D360528J305039K310848M198450N960446M887727L927652K418761l84834
18325B8984617j389915j937739j500201R0156K390661K815849K577031K820654
18317C4851113j18873k015486k937232l839971m091292m086226l134428k231182
18309A2396423j774429j337739r66334p61415p06844n82531l92096k28800j04300
18300E541935k9971J8500l09k657N3790J15569K02507K82211M72333P78215J201818
$$ plain form
18365 701199 726533 781425 848580 904425 954867 998914 1034127 1074774 1125012 1201124 1287841
18354 1287841 1401995 1500644 1601849 1730321 1848138 1945535 2002996 2024833 2021802 2021175 2012524
18343 2012524 2016685 2031156 2090706 2181827 2302517 2487845 2733156 3076676 3575242 4360528
18333 4360528 5665567 7976415 12174865 18135311 23023038 26950690 29369451 28984617
18325 28984617 27594702 25656963 24156762 24246918 26637579 29453428 32030459 34851113
18317 34851113 34732240 32716754 29779522 25939551 21848259 17762033 14627605 12396423
18309 12396423 10621994 9284255 8317921 7556506 6849662 6267131 5875035 5646235 5541935
18300 5541935 5511964 5530464 5530155 5527498 5581288 5696857 5899364 6181575 6653908 7432123 8633941
18289H633941J815255K767134M480176P665604J2719602J5278547J1866693J0448766
18281G5675718N550382L13506k157243n887515q476444r036539o773130j931064
18273D7277671L030579N041982M743659L463502L91781j613329l517732n405453
18265E3412660p941254q368569p032172n457121m383580l701505k672248j734671
18257A2121540j170369q11266n98560l80789j99511j51429j75180k07194j90694
18248H236548p3128j5537L1647J86676M40623P52656J143356J771259K882258
18239A5356358M934310Q432227J0700146Q417348P973361N638310N85950q22514
18231F1215496o52220R96167L838881J1731787J8842944Q511537p40996K197541
$$ plain form
18289 8633941 10449196 13216330 17696506 25362110 38081712 53360259 65226952 75675718
18281 75675718 81226100 81539606 79382363 73494848 65018404 55981865 49208735 47277671
18273 47277671 50308250 55350232 60093891 63557393 63949174 62335845 58818113 53412660
18265 53412660 45471406 37102837 30070665 24613544 20229964 16528459 13856211 12121540
18257 12121540 10951171 10139905 9541345 9160556 8961045 8809616 8634436 8427242 8236548
18248 8236548 8163420 8147883 8179530 8366206 8806829 9559485 10702841 12474100 15356358
18239 15356358 20290668 28722895 39423041 47840389 55813750 61452060 62038010 61215496
18231 61215496 60563276 61559443 65398324 77130111 95973055 104484592 103743596 105941137
18223A05941137N570367P86415o045511q715955o648738l02011P591260Q805851
18215A06982815n095873j1986752r413216p627545j0159808j4218001j2677473
18208C5804147q124118m880181l161681k375509j930177j516568j132471q86415
18200A1797027p41120o43454n05395l38278k37428j94575r2009L589n153m5748
18190H997456J3471J86826M23533P87276J327568K229406L793937O841604J2391232
18181C6992309J7173671J5611170P272724j301643k596969k997657m454759m349822
18173F1349024M70013Q926390Q627991k550100o148100n338599n922636r265324
18165E0148659j1961402r521297o050557l928791k841451k266873j842874j506139
$$ plain form
18223 105941137 111511504 112297919 106252408 97536453 90887715 90585704 98176964 106982815
18215 106982815 101886942 89900190 80486974 72859429 62699621 48481620 35804147
18208 35804147 27680029 22799848 19638167 17262658 15332481 13815913 12683442 11797027
18200 11797027 11055907 10412453 9907058 9568780 9331352 9136777 9044768 9048357 9043204 8997456
18190 8997456 9010927 9197753 9621286 10408562 11736130 13965536 17759473 24601077 36992309
18181 36992309 54165980 69777150 77049874 75748231 73151262 70153605 65698846 61349024
18173 61349024 61819037 70745427 79373418 76823318 70675218 65336619 59413983 50148659
18165 50148659 38187257 28665960 22615403 18686612 15845161 13578288 11735414 10229275
18157A0229275j125670q06046n95838m98094m74354l98381l20226k93618k69614
18148E447434k01028j02875k8356L026L3897J77293M36564Q45800J569546K016384
18138A0197685J089728J83835L23667P69260J358573K672198M551178K562669
18130B3708793m82860k96049Q34061K231861K946744J89436l058913k799881k091791
18121B1181401k319857l657847m166466k958204j713951j005841o22250l98098
18113D338887k29063o0423J78078M93400J081180K351802N072430O479989P75579
18104B0481859j772337j202697r94262k070326l939901l446518j914243j054648
18096D086927o58482m66763l73731l27011k52506k02440j69098j37524j12033
$$ plain form
18157 10229275 9103605 8297559 7701721 7203627 6729273 6330892 6010666 5717048 5447434
18148 5447434 5246406 5143531 5115175 5118201 5152098 5329391 5765955 6611755 8181301 10197685
18138 10197685 11287413 11471248 11794915 12564175 13922748 16594946 21146124 23708793
18130 23708793 23225933 22929884 23763945 25995806 28942550 29131986 26073073 23273192 21181401
18121 21181401 18861544 15203697 11037231 8079027 6365076 5359235 4736985 4338887
18113 4338887 4109824 4049401 4227479 4720879 5802059 8153861 13226291 19706280 20481859
18104 20481859 18709522 17506825 16512563 14442237 10502336 7055818 5141575 4086927
18096 4086927 3428445 2961682 2587951 2260940 2008434 1805994 1636896 1499372 1387339
18087A387339j07902r7006p6932q0913p4190o2017n4587n3534o9322n1747l6173
18076F23016l2577k1264q675j6342k065j918m208j5589k2962k0985j6045l585
18064D56801j7533j9633j9412j0402j780J4958J490J2602K2195l54j1239j287
18052D26406L1748M5284O5135P4865P5405N9790R6973J26423O7885L688Q102M6374
18040A128078K5412l1247n4443j4554J0534k4375o7788l9708l5180o2810m6558
18029G87361l8607k8483o9500r6075o8498l9199m4808m7205l1597k8506k1918
18018B72965j0085p186k054J1626J3626J0555J452k959J218k4320l122n480O689
18005B62925L3595N2313O6280Q0391M7163n62k1658k4837p227l004P420j0243
$$ plain form
18087 1387339 1279437 1182431 1105499 1024586 950396 888379 833792 780258 710936 659189 623016
18076 623016 590439 569175 560500 544158 542093 540175 535967 520378 497416 476431 460386 456801
18064 456801 439268 419635 400223 389821 388041 402999 404489 417091 439286 438932 427693 426406
18052 426406 458154 503438 568573 643438 718843 778633 875606 1002029 1069914 1073602 1081704 1128078
18040 1128078 1153490 1122243 1067800 1053246 1063780 1039405 971617 931909 896729 833919 787361
18029 787361 748754 720271 650771 554696 486198 446999 402191 354986 323389 294883 272965
18018 272965 262880 255694 253640 265266 278892 289447 290899 287940 289158 264838 261716 256236 262925
18005 262925 296520 348833 415113 495504 542667 542105 520447 495610 488383 485379 492799 482556
17993D82556j4776J9191M5738O4538O3873K0920K6551L8986k7375n6599m2591
17982F21012m0599k4915o6221p6705l9288k8974n3585n0679m2328j4081j4159
17971A69478j0940L939O320N343m345q749M208r755j2456m134L391K315L918o908
17957A41625K552m041K812J9743O737k3947j7827j4652j5732J254L927J825P455
17944A11731P528j8557j5819q90n589j1748R898O519N18r494j6131O794J6468
17931H1228R589l811j338p657J0783J2596K830k1552j5654n314K362J2947k240
17918G4769j4989j859q164M019k640j1619N47Q516K0911N988r93K934l143L023
17904G7300l64J202j1223k352p41P606j1724o961k193q945J150O927M988o726
$$ plain form
17993 482556 467780 486971 532709 597247 661120 682040 708591 747577 720202 663603 621012
17982 621012 580413 555498 489277 412572 373284 344310 290725 240046 197718 183637 169478
17971 169478 158538 162477 168797 174140 169795 161046 165254 155499 143043 138909 142300 144615 148533 141625
17957 141625 144177 140136 142948 162691 169428 145481 127654 113002 97270 98524 102451 104276 111731
17944 111731 119259 100702 84883 83993 78404 66656 76554 83073 83591 74097 57966 64760 81228
17931 81228 90817 87006 85668 78011 88794 101390 104220 82668 67014 61700 64062 77009 74769
17918 74769 59780 57921 49757 53776 51136 39517 40064 48580 69491 75479 74486 77420 74277 77300
17904 77300 76936 78138 66915 64563 63822 71428 59704 52743 50550 41605 42755 49682 54670 47944
17890D7944j2279L496J0729n304N49J231j187N964L659J14j2442o84J2732J1512
17876F6034J455p150j1972j1723K4166N084r974n650J46O025J1085q787j7750
17863D0989J928R741l899l895N323k250o433k232o460j729N617m741P951O155
17849D6065j2073j405j055l920n096k212N996K578M32P848o989q160q59o868R125
17834B3407L0993J0601j2339N067J2040L93J2292l115L2K880k084M197R358L512
17820I7234m199j3458j1388Q010J511M972L8806N4753M7890L6912L2187J8700
17808C11930l97J593j2280K302N357p404J210j6337k4156k0720l3526k4013k2930
17795A60629j8969j510P778m339q076N37J1799o773J333J0330J2654J6995r464
$$ plain form
17890 47944 35665 39161 49890 44586 45135 46366 45179 51143 54802 54916 42474 41790 54522 66034
17876 66034 67489 60339 48367 36644 60810 65894 55920 50270 50416 56441 67526 58739 40989
17863 40989 42917 52658 48759 44864 50187 47937 41504 39272 32812 31083 36700 31959 39910 46065
17849 46065 33992 32587 31532 27612 22516 20304 26300 28878 29310 37158 30169 22009 21150 14282 23407
17834 23407 54400 65001 52662 57729 69769 70162 82454 79339 79371 82251 80167 84364 93722 97234
17820 97234 93035 79577 68189 76199 77710 82682 121488 176241 224131 261043 293230 311930
17808 311930 311533 313126 300846 303148 308505 301101 302311 285974 261818 241098 207572 183559 160629
17795 160629 141660 140150 147928 143589 135513 136050 147849 141076 142409 152739 165393 182388 172924
17782A72924j9839o959n832k3681o916o15l857k661l517o597K500J7721K4527
17769A37198K0414K8853L4840K5039L0187K4779K0064J5437P745K6436M4073L9809
17757D54874M6285J0059j5913k1904q322q790k0202j8830k0984m1807m3026l8561
17745B72879l8416l8328k2969q807o145j646k731J353j1337j160J26J1176J0480
17732A64475J94K682o860j784l554L840J3804L5235N0879N4664N3353K0610J3508
17719D01046J2904K8874M6109J4363j1923j4850j0891n541j5755n4445n3721k7629
17707C08541q253L7K141k511p535p316j9690k8810l6314k4171k8020k7470k8759
17694I1870j7722k2039k98j32J393R93O328N653K87J2086K855l044J5681J3263
$$ plain form
17782 172924 153085 146126 140294 116613 109697 109082 105225 102564 99047 92450 94950 112671 137198
17769 137198 157612 186465 221305 246344 276531 301310 321374 336811 344556 370992 415065 454874
17757 454874 501159 511218 495305 473401 465079 456289 436087 417257 396273 354466 311440 272879
17745 272879 234463 196135 173166 164359 158214 156568 153837 155190 143853 142693 142819 153995 164475
17732 164475 164669 167351 160491 158707 155153 158993 172797 208032 258911 313575 366928 387538 401046
17719 401046 413950 442824 488933 503296 491373 476523 465632 460091 444336 389891 336170 308541
17707 308541 300288 300325 302466 299955 292420 285104 265414 236604 200290 176119 148099 120629 91870
17694 91870 74148 52109 51811 51679 53072 54065 60393 66046 66333 78419 81274 78230 93911 107174
17680A07174J4044K5116O2842P0943M6029K1830N9140Q3217M5322K1014J4593
17669E71264j548M525K3578r548q8698r2286o3146l8573m7731o0049n3257k3646
17657A20885j4966n933j4691r716m240j1557n871j3904j6263L701J1562Q544l422
17644D4129P413J906k1326n539J6119O840l802j3230j8382N73J3162Q672L6J3075
17630D9646K4591N8450O6243K4307k463m744j3476J9245K4102J4696p679j9577
17618B33341j1255j9218m4166m1243k1744k4954j6728r205j73n438k2451r221
17606G545R377K712k98m214N223Q167j3185j3806R076L003o752j561j752L409
17592F944M792j1436j2052O964K56j576o462j3422j117o559L043R027R022R056
$$ plain form
17680 107174 121218 146334 209176 280119 326148 347978 407118 490335 535657 556671 571264
17669 571264 569716 574241 597819 588271 499573 407287 344141 305568 257837 197788 144531 120885
17657 120885 105919 99986 85295 75579 71339 59782 53911 40007 23744 27445 39007 47551 44129
17644 44129 51542 53448 32122 26583 42702 49542 45740 32510 14128 14701 27863 36535 36571 49646
17630 49646 74237 132687 198930 223237 220774 216030 202554 221799 245901 260597 252918 233341
17618 233341 222086 202868 158702 117459 95715 70761 54033 44828 44655 39217 16766 7545
17606 7545 16922 19634 19336 15122 20345 28512 15327 1521 10597 13600 6848 5287 3535 6944
17592 6944 11736 300 -11752 -4788 -4532 -6108 -12570 -25992 -27109 -33668 -30625 -21598 -12576 -3520
17578c520K956M865R772Q274R41j423j6562k318J974O199j2937k086L750L765
17564C650N36J65Q787P800R666j6818k3913j789L766p085J1659J0819j0673m598
17550h028J402N743R429J568q395j7530O551J2782j0516j3717l807J1778J8665
17537E925J1161o176q438o677j051l231p841o51R131O260j6738L102R311r32J121
17522e724O185J781Q392n799K455p714q216Q7j72M993J4269l161j4097M695l649
17507e675L854J3415j1530j5338m992Q378Q514n723m298p072k968M120L599J1981
17493c735k54M125k449M36l277J252J905K845M239O725r530j5846K288L68J3129
17478B221J3871j6241j785J3211m086m892j1847j186j473j6674j6591M599J7722
$$ plain form
17578 -3520 -564 4301 14073 22347 23288 21865 5303 2985 4959 11158 -1779 -3865 -115 3650
17564 3650 4186 4351 13138 20938 30604 13786 -10127 -11916 -8150 -15235 -3576 7243 -3430 -8028
17550 -8028 -6626 -883 8546 10114 1719 -15811 -9260 3522 -6994 -20711 -24518 -12740 5925
17537 5925 17086 10910 2472 -4205 -5256 -8487 -16328 -16979 -7848 -1588 -18326 -15224 -5913 -6845 -5724
17522 -5724 461 2242 10634 4835 7290 -424 -8640 -8553 -8725 -3732 10537 7376 -6721 -2026 -5675
17507 -5675 -1821 11594 64 -15274 -20266 -11888 -3374 -9097 -13395 -20467 -23435 -19315 -15716 -3735
17493 -3735 -3989 136 -2313 -1877 -5154 -3902 -1997 848 5087 11812 2282 -13564 -11276 -10908 2221
17478 2221 16092 -149 -1934 11277 7191 2299 -9548 -10734 -12207 -28881 -45472 -40873 -23151
17465b3151j022J5895j474p526N614P170R74j453r05Q984l532m083O756P728O437
17450A6412R102m318j6066p686m597m97q08J0599r79R739M5617L1533L990j009
17436I1032n992j7043k7397k0601N521k673l556n968j2217j2173j2877L158L696
17423a7090L503j413j130J2525J0975m829o418N910m716k575J125n875Q712R74
17409c22J385J674n661n423K187P396P667j1067j1962N21N09R49R70Q770M809
17394B402l669j571j5923J0153j012M003O643n936k675l037p028p326l24M934
17380b0366K558O431J5720m863p06R966j848n955q935q118M421j0880R040N943
17366g592L499P769K6882Q707j4229j9352j0372j5134r557O586J3997j424J0141
$$ plain form
17465 -23151 -24173 -8278 -9752 -17278 -11664 -4494 -3520 -4973 -5878 3106 -426 -4509 2247 9975 16412
17450 16412 25514 21196 5130 -2556 -7153 -7650 -8458 2141 1162 10901 56518 88051 92041 91032
17436 91032 85040 67997 40600 19999 25520 22847 19291 13323 1106 -11067 -23944 -20786 -17090
17423 -17090 -13587 -15000 -16130 -3605 7370 2541 -3877 2033 -2683 -5258 -4133 -10008 -1296 -322
17409 -322 1063 2737 -2924 -8347 -6160 1236 8903 -2164 -14126 -13605 -13096 -12147 -11177 -2407 2402
17394 2402 -1267 -2838 -18761 -8608 -9620 -5617 1026 -4910 -7585 -10622 -17650 -24976 -25300 -20366
17380 -20366 -17808 -11377 4343 -520 -1226 8740 6892 937 -7998 -16116 -11695 -22575 -13535 -7592
17366 -7592 -4093 3676 30558 39265 25036 5684 -4688 -19822 -29379 -22793 -8796 -10220 -79
17353g9L606O326p36l664N748K609m954j5455j1293J3606K872k424r12j749R491
17338B992Q807P232p289J450j495q225l76j779r535j5808j3397N992J5968K4607
17324I144J0200k848J618j6305p172J2527P55l997M298p837j8607K053M176o728
17310a8723J608R939j4986m57P47N448L751Q427J6866l309j1943J269j516O564
17296C685N389j6605j0224j481m22J0230J3670K997j4059r539j1232m565J1378
17283b0778O139L684M506m446m1p227j3832J3664k635M070k834J2708J0971J728
17269E677N178P4M467N532o233j0372L613M101k30K822j0758j598k102K509N78
17254C258o445j97J532P502p178j0656l969o24R854l442p734j987p01o943J0844
$$ plain form
17353 -79 3527 9853 9117 5453 11201 13810 8856 -6599 -17892 -4286 -1414 -3838 -4750 -6499 2992
17338 2992 11799 19031 11742 13192 11697 3472 3096 1317 -8218 -24026 -37423 -31431 -15463 9144
17324 9144 19344 16496 18114 1809 -5363 7164 7919 3922 8220 383 -18224 -16171 -11995 -18723
17310 -18723 -17115 -7176 -22162 -22619 -21872 -16424 -12673 -4246 12620 9311 -2632 -1363 -2879 3685
17296 3685 9074 -7531 -17755 -19236 -19658 -9428 4242 7239 -6820 -16359 -27591 -32156 -20778
17283 -20778 -14639 -10955 -6449 -10895 -10936 -18163 -31995 -18331 -20966 -16896 -19730 -7022 3949 5677
17269 5677 10855 10929 15396 20928 14695 4323 7936 12037 11807 14629 3871 2273 171 2680 3258
17254 3258 -3187 -3384 -1852 5650 -1528 -12184 -16153 -16777 -6923 -10365 -18099 -20086 -20787 -27730 -16886
17239a6886J1296q597q841o448O685K017p328N448k721k551J2543j798K063j0308
17225b5426j1573P130O400r41J325o351J4127K2452o379j7298j0325P775O307
17212a2777k580J4683J3203K977O467N345j249n031j045q759m478m542Q52j0884
17198g818j9461n228K107J6079J7259j099r39j1098j3746o46K5709Q641j1348
17185a588p627n849j3253n558J2428J1143Q773L306l014k544N618J541j9629l559
17171a9812J8331R611q346l124K864j1915r950m351J4443J7934M146j0227m825
17158e221j7115K129M679r342p871N874Q87Q752J2303k675K542o070p5N409L601
17143b193k655j2694O847P027J979o779l832j891O640m891K438o86q71K68K14
$$ plain form
17239 -16886 -5590 -14187 -23028 -29476 -22791 -20774 -28102 -22654 -25375 -27926 -15383 -17181 -15118 -25426
17225 -25426 -36999 -29869 -23469 -24410 -23085 -29436 -15309 7143 764 -16534 -26859 -19084 -12777
17212 -12777 -15357 -674 12529 15506 21973 27318 26069 21038 19993 11234 6756 2214 3066 -7818
17198 -7818 -27279 -32507 -30400 -14321 2938 1839 900 -10198 -23944 -24590 1119 9760 -1588
17185 -1588 -9215 -15064 -28317 -33875 -21447 -10304 -1531 1775 -1239 -3783 1835 3376 -16253 -19812
17171 -19812 -1481 8130 -216 -3340 -476 -12391 -22341 -26692 -12249 5685 9831 -396 -5221
17158 -5221 -22336 -20207 -15528 -24870 -32741 -26867 -25980 -17228 -4925 -7600 -5058 -11128 -11203 -5794 -2193
17143 -2193 -4848 -17542 -10695 -3668 -1689 -8468 -12300 -14191 -7551 -12442 -10004 -10690 -11561 -11293 -11079
17128a1079K941l096N8q935o359K599j3961m315J7596R087Q125Q453K877p083
17114c092n646J2057l628o460j385O414J4087j1488K220n495J42R554j4990j2676
17100b0386l410K404L291l963L171K055j193K091K102J4198M095j4403p021j750
17086a8719L255o255m787M697Q022J934r666R376P422l536m206J5117K569l002
17072B221n640k383Q63Q822P212o62k284k37r535j739j171n399k938j7051K503
17057b7418P395r8o155j154L403j726M910O74J7138o064p925m764n621J4780k540
17042a5165P413o588j9509j0404J0138J9154J0985n492n025M77J2057p256j0318
17029a9533o67R691K911m553p564J2080Q448j0153k888L062J0254Q351l029L751
$$ plain form
17128 -11079 -8138 -11234 -11176 -20111 -26470 -23871 -37832 -42147 -24551 -15464 -7339 1114 3991 -3092
17114 -3092 -8738 3319 -309 -6769 -8154 -1740 12347 859 3079 -2416 -2274 7280 -7710 -20386
17100 -20386 -23796 -21392 -18101 -22064 -18893 -16838 -18031 -15940 -13838 360 4455 -9948 -16969 -18719
17086 -18719 -15464 -21719 -26506 -21809 -13787 -11853 -21519 -12143 -4721 -8257 -12463 2654 5223 2221
17072 2221 -3419 -5802 -4939 3883 11095 10433 8149 7912 -1623 -3362 -4533 -9932 -12870 -29921 -27418
17057 -27418 -20023 -20121 -26276 -27430 -24027 -25753 -20843 -20169 -3031 -9095 -17020 -21784 -27405 -12625 -15165
17042 -15165 -7752 -14340 -33849 -44253 -34115 -14961 -3976 -9468 -14493 -14016 -1959 -9215 -19533
17029 -19533 -20200 -10509 -7598 -12151 -19715 -7635 813 -9340 -12228 -9166 1088 9439 6410 10161
17015A0161N97R60q340r167N109P523N066q575K34j803k1137N139J0490j888J751
17000c880N636O074o366r23O149o294L568q549j774j0013l765N755J3589K2960
16986B2167l457K516J906j6095j9816k976k477K0469J2657j2094j883q53K210
16973B274R801n68j2247j4739k637m279p378R976J347N908k398l355J2296J3337
16959G338l620o044P73M774M932m315p519m534K352L209J278j1564o010Q851J470
16944h629L128J295R45J124j4360l483j3847K81J4326J2234Q932J591j184k0026
16930a7673r381o545N341k20J0437J863n34K73p725j024J4639q098n225N671Q788
16915i413J5541m95J063L765J4270k362r581r087j989L534J3990l513k193o020
$$ plain form
17015 10161 10758 11718 3378 -5789 -680 6843 11909 3334 3568 1765 -19372 -14233 -3743 -5631 -3880
17000 -3880 1756 7830 1464 541 6690 396 3964 -4585 -6359 -16372 -20137 -14382 -793 22167
16986 22167 18710 21226 23132 7037 -12779 -15755 -18232 2237 14894 2800 917 64 2274
16973 2274 12075 11507 -740 -15479 -18116 -22395 -29773 -19797 -18450 -12542 -14940 -18295 -5999 7338
16959 7338 3718 -2326 -1553 3221 8153 3838 -3681 -8215 -5863 -2654 -1376 -12940 -18950 -10099 -8629
16944 -8629 -5501 -4206 -3261 -2137 -16497 -19980 -33827 -33546 -19220 -6986 1946 3537 2353 -17673
16930 -17673 -27054 -33599 -28258 -28478 -18041 -16178 -16712 -16439 -24164 -25188 -10549 -18647 -23872 -18201 -9413
16915 -9413 6128 5633 6696 10461 24731 22369 12788 3701 1712 5246 19236 15723 13530 7510
16901G510n047m813J7289K085P60N948j6379j0426q620J271k169k062J556R097
16887d000j215j536P676j0080R231J900j3189l184L9q033j247N701j2936p555
16873c8428J4082J0699p882o459j466N588K074M617J5619O513M293J7875J3472
16860D0597p24L09r390J697r300j4339l555L211j425o940r245k275M386P959L547
16845D513j2927j2916o429N213L956N627P518J555o195M812N46p114M55J01o668
16830a7953J892n702o331l120K1076K019j068p036m314j3842O626L783N831P437
16816a0702r761n408L935J3252L752p430j991l014M861J1770j234P99n358P01
16802e828o850k645M551o039p871O482P998J822K4K727j506o272j79P616j177
$$ plain form
16901 7510 2463 -2350 14939 17024 17784 23732 7353 -3073 -11693 -10422 -12591 -14653 -13097 -4000
16887 -4000 -5215 -6751 925 -9155 76 1976 -11213 -14397 -14358 -22391 -23638 -17937 -30873 -38428
16873 -38428 -24346 -13647 -21529 -27988 -29454 -23866 -21792 -17175 -1556 4957 9250 27125 40597
16860 40597 39873 40182 30792 32489 23189 8850 5295 8506 7081 141 -9104 -11379 -6993 966 4513
16845 4513 -8414 -21330 -27759 -22546 -18590 -12963 -5445 -3890 -10085 -5273 -4727 -11841 -11386 -11285 -17953
16830 -17953 -16061 -21763 -28094 -31214 -10138 -8119 -9187 -16223 -20537 -34379 -27753 -23970 -18139 -10702
16816 -10702 -20463 -25871 -21936 -8684 -4932 -12362 -14353 -17367 -12506 -736 -1970 -1171 -6529 -5828
16802 -5828 -12678 -15323 -10772 -16811 -24682 -18200 -10202 -8380 -8356 -5629 -7135 -13407 -13586 -5970 -7147
16787g147k766j566J768Q269O838l097K022o27j800J879M264L427p901m658j0482
16772a1577o383l493j1479O144K3353j1607R40J0695R997n621q906j4199m632
16759b6768J2989l373k004j1546L193J3526J4655m447j0265j152p167j688O506
16746a7541J202j7097Q211O898P442N950n227O702M898l737k991n72p254R785
16732c331J5735r825M29K4p161P257q695L292k136k730j1062O71j0377j1272J0560
16717b8621K7833N872m513o650j9443m874J6443O39j0033o064q225J718L531j915
16703c4302l626M436J7977j011R698O500r031K759O89k084p164o113p737J1429
16689a7580Q815k129N480O794q313j8967R055K0207M47j447k27j7442r036K2482
$$ plain form
16787 -7147 -9913 -11479 -9711 -1442 5396 2299 4321 3694 1894 3773 8037 11464 3563 -1095 -11577
16772 -11577 -17960 -21453 -32932 -26788 -3435 -15042 -14102 -3407 6590 969 -7937 -22136 -26768
16759 -26768 -13779 -17152 -19156 -30702 -27509 -13983 672 -3775 -14040 -15192 -22359 -24047 -17541
16746 -17541 -16339 -33436 -25225 -18327 -10885 -4935 -10162 -3460 1438 -2299 -5290 -5862 -13116 -3331
16732 -3331 12404 2579 3008 3032 -4129 3128 -5567 -2275 -4411 -7141 -18203 -17532 -27909 -39181 -28621
16717 -28621 -788 5084 571 -6079 -25522 -30396 -13953 -13314 -23347 -29411 -37636 -35918 -32387 -34302
16703 -34302 -37928 -33492 -15515 -16526 -6828 -328 -9359 -6600 -5911 -7995 -15159 -21272 -29009 -17580
16689 -17580 -8765 -10894 -5414 1380 -6933 -25900 -16845 3362 3809 2362 2135 -15307 -24343 -1861
16675a861J3150j0375o935j9307j7721J3325N362o887p798L503K691m838R929
16662b7762J2235J0950o217L573n397N961L144J792r895J998N101j786O121Q999
16648H817p558j0451n024J0780L214j809Q182J7092j1785j9575j3797O622J1919
16635c373Q797j455M94j556l338m707p457J1474M157N8j1582o95L400L002m569
16620g350q182j297K44r79J586M131N295P070M207j0068k264j1423j834J3514
16606g350J7595O919j143J0804K0031J4275K238K6228K3390J0013o768K347R879
16593A28458m201J71P826K1336J6141q289r925q354k267l2243k7366p13p047k764
16579G0763N165j127k1558j0606k457r173o360K142J341j2614m769M602l413l742
$$ plain form
16675 -1861 11289 914 -6021 -25328 -43049 -29724 -24362 -31249 -39047 -35544 -32853 -37691 -27762
16662 -27762 -15527 -4577 -10794 -7221 -12618 -6657 -3513 -1721 -11616 -9618 -4517 -6303 -182 8817
16648 8817 1259 -9192 -14216 -3436 -222 -2031 6151 23243 11458 -8117 -21914 -15292 -3373
16635 -3373 5424 3969 4463 2907 -431 -5138 -12595 -1121 3036 3094 -8488 -9183 -5783 -2781 -7350
16620 -7350 -15532 -16829 -16585 -17564 -15978 -11847 -6552 518 4725 -5343 -7607 -19030 -20864 -7350
16606 -7350 10245 17164 16021 26825 46856 61131 63369 89597 112987 123000 116232 118579 128458
16593 128458 124257 124428 132254 153590 169731 161442 151517 143163 140896 108653 81287 80574 73527 70763
16579 70763 75928 74801 53243 42637 40180 31007 24647 26789 28130 15516 10747 15349 11936 8194
16565H194j4225j1266J6569K376k1541j2572M202O884j782J4437J6344N066j8382
16552e696m302l325j3352j902J1193j124J684m472P8K0648J7196K46j2997q701
16538d826N025J4054P021j1958o929n613k634K798n560J628J1822O387J1246j2799
16524I662r903q659J0589J4887r62k5997M262J4510J1716k098q601j0448L133
16511B091J2137O090j3433j9385L237P343j489o873l95P312o18m307k470J0409
16497c51P754j0668L395n542R811j467N647N110j3967j2880Q23J2101O226P550
16483A3542k887m836j8933j116r811P120k965l29J0539J7941L654j3255j2629
16470a3965n699K660O91n694N801P146j914M170q908q19l694N261J6786J2987
$$ plain form
16565 8194 -6031 -17297 -728 1648 -19893 -32465 -28263 -21379 -23161 -8724 7620 12686 -5696
16552 -5696 -9998 -13323 -26675 -28577 -17384 -18508 -16824 -21296 -21218 -570 16626 16872 3875 -4826
16538 -4826 199 14253 21274 9316 2387 -3226 -5860 -3062 -8622 -6994 4828 11215 22461 9662
16524 9662 -241 -8900 1689 16576 15614 -10383 -6121 8389 20105 18007 9406 -1042 2091
16511 2091 14228 20318 6885 -12500 -9263 -1920 -3409 -10282 -10677 -3365 -3983 -8290 -10760 -351
16497 -351 7403 -3265 130 -5412 4399 2932 8579 13689 -278 -13158 -12335 -234 5992 13542
16483 13542 10655 5819 -13114 -14230 -24041 -16921 -19886 -20215 -9676 8265 11919 -1336 -13965
16470 -13965 -19664 -17004 -16313 -22007 -16206 -9060 -10974 -6804 -15712 -16531 -20225 -14964 1822 14809
16456A4809j1879j5281j1275r617R061J1969m4J0977L905r778j3983N816J2859
16443b461o920R018M842m612J1175K0651N515j2552r598n009M143r94k1126k841
16429a0769J4808O640K333j4349j6905j0405J3170P894J390J292k098k010J2043
16416C034N218J471J058M442r113k189R174l061j5260J429P683j3200L505R802
16402C993o984l185M088N174J82j9913j4161R770J922O535o599R514J7586m468
16388C454M890n750J597n439o455k018j830J604n460j1454o468J48K9004L321
16374h56P130k661j0762j877J5028K748P097Q198j1023j7305r678M470O614Q556
16360E679m806j6983L048K5897j4350j6013J6526K33m546j2421j2572J0209J2969
$$ plain form
16456 14809 2930 -12351 -23626 -33243 -24182 -12213 -12257 -1280 2625 -7153 -21136 -15320 -2461
16443 -2461 -9381 -363 4479 -133 11042 31693 37208 24656 15058 10049 14192 13198 -7928 -10769
16429 -10769 4039 10679 13012 -1337 -18242 -28647 -15477 -7583 -6193 -4901 -6999 -9009 3034
16416 3034 8252 9723 10781 15223 6110 3921 13095 10034 -5226 -3797 3886 -9314 -5809 3993
16402 3993 -2991 -6176 -2088 3086 3268 -16645 -30806 -21036 -19114 -12579 -19178 -9664 7922 3454
16388 3454 8344 2594 4191 -1248 -7703 -9721 -11551 -9947 -15407 -26861 -33329 -33181 -4177 -856
16374 -856 6274 3613 -7149 -9026 6002 8750 15847 24045 13022 -4283 -13961 -9491 -2877 5679
16360 5679 873 -16110 -13062 12835 -1515 -17528 -1002 -769 -5315 -17736 -30308 -20099 -7130
16347g130K451L87l303r609j609Q30q890n887Q808J4165R952j484k092p39j5417
16332a9567m82O413k340J0744k234j2659j2581O401J2970q137N815Q484J93j3484
16318b0464n773J167l014k68k56Q281J035j3305R945J2782J0344l208j4745R74
16304a6505K878O77j1447M798R229P266M59j0595k203J736Q402L493J0121M085
16290A2394j0576j0583p231k448L465K945M288n131P049K254j991J1518o667o154
16276f868J4890J982j4032k027l050l356j128P655J723k097P15N064n144n692
16262a1365R201M760k684q963J301L325r103J381j0028l059o600N092J6265N501
16248d976K335R164m95q984R42Q961J063o228o978o88M910r536n729m018L343
$$ plain form
16347 -7130 -4679 -4292 -7595 -17204 -18813 -17983 -26873 -32760 -23952 -9787 165 -1319 -3411 -4150 -19567
16332 -19567 -20049 -13636 -15976 -5232 -7466 -20125 -32706 -26305 -13335 -21472 -15657 -7173 -6980 -20464
16318 -20464 -26237 -25070 -28084 -28352 -28608 -20327 -19292 -32597 -22652 -9870 474 -2734 -17479 -16505
16304 -16505 -13627 -12950 -24397 -19599 -10370 -3104 -2645 -13240 -15443 -13707 -5305 -1812 8309 12394
16290 12394 1818 -8765 -15996 -18444 -14979 -12034 -7746 -12877 -5828 -3574 -5565 5953 -714 -6868
16276 -6868 8022 10004 -4028 -6055 -9105 -12461 -13589 -5934 -4211 -6308 -5593 -529 -5673 -11365
16262 -11365 -2164 2596 -88 -9051 -7750 -4425 -13528 -12147 -22175 -25234 -31834 -26742 -10477 -4976
16248 -4976 -2641 6523 6028 -2956 -2014 6947 8010 1782 -5196 -5884 -974 -10510 -16239 -20257 -16914
16233a6914J2855l485L443Q154j37m701M55M176o835K003K47O527J495j6844o853
16218a6414j222J2582O122N555n611M86M04k946K707K0P756o866j3548K109N183
16203c683K026n685L788J239l337J2847J9825j3194m784p748o11k704J687j158
16189a492r693o165j0659K885L661J984n945K035J7387k014j907K44k450R504
16175b625R083r937J423J3999j8496p516p41K487j1779n547J5485o057N033J4426
16161g62K514L098m33j0496q788j2824j2873O867R388p71j774J2503K601O268
16147e482n845k852K515r12J2691L205J3888Q271o853o611J863r773O58j7659
16133a2896n170J5363R061P504j6933N605Q90m688j3442J170l827M570L581J3506
$$ plain form
16233 -16914 -4059 -7544 -4101 4053 3916 -785 -330 3846 -2989 -986 -739 5788 7283 -9561 -16414
16218 -16414 -17636 -5054 1068 6623 1012 1498 1902 -1044 1663 1683 9439 2573 -10975 -8866 -3683
16203 -3683 -1657 -7342 -3554 -2315 -5652 7195 27020 13826 9042 1294 683 -2021 -334 -1492
16189 -1492 -11185 -17350 -28009 -25124 -21463 -19479 -25424 -23389 -6002 -8016 -9923 -9679 -12129 -2625
16175 -2625 6458 -3479 -2056 11943 -6553 -14069 -14810 -12323 -24102 -29649 -14164 -20221 -15188 -762
16161 -762 1752 4850 4417 -6079 -14867 -27691 -40564 -33697 -24309 -25080 -26854 -14351 -11750 -5482
16147 -5482 -11327 -14179 -11664 -12576 115 3320 17208 25479 18626 12015 13878 4105 4763 -12896
16133 -12896 -18066 -2703 6358 13862 -3071 2534 3424 -1264 -14706 -13536 -17363 -12793 -9212 4294
16119D294K002j2314q111k219j870o560N099M470l879O340K945K485L865p175
16105a0628j0901j417J2319K844r400P394L093j0513m871J4836L501K363q265
16092i645N717L972M707r38m470j7580j0275J0334L870m609L410Q009k039M566
16078d971Q301j1811k453K052j910J4599J4402K972l737j6782p726J1301j197
16065C040j2297J187J174M352l260r305J9748J992j2027p887o354r309o884R618
16051b6212J0548J0518o485j3328K926K2342K058k701O818n821r485J375O145
16038a302j5445q34P407q142q434J1849N977j137J182m483j0322M618M560m61
16024a4967N534j2364o854L779M840J8625L972p533r492L42r16j1146O808P66
$$ plain form
16119 4294 6296 -6018 -14129 -16348 -18218 -24778 -19679 -15209 -19088 -12748 -9803 -7318 -3453 -10628
16105 -10628 -21529 -22946 -10627 -7783 -17183 -9789 -6696 -17209 -22080 -7244 -3743 -1380 -9645
16092 -9645 -3928 44 4751 3813 -657 -18237 -28512 -18178 -14308 -18917 -15507 -7498 -9537 -4971
16078 -4971 3330 -8481 -10934 -8882 -10792 3807 18209 21181 17444 662 -7064 4237 3040
16065 3040 -9257 -8070 -6896 -2544 -5804 -15109 4639 6631 -5396 -13283 -19637 -28946 -35830 -26212
16051 -26212 -15664 -5146 -11631 -24959 -22033 309 2367 -334 6484 663 -8822 -7447 -1302
16038 -1302 -16747 -17581 -10174 -18316 -26750 -14901 -8924 -10061 -8879 -13362 -23684 -19066 -14506 -14967
16024 -14967 -9433 -21797 -28651 -24872 -20032 -1407 2565 -4968 -14460 -14118 -15034 -26180 -19372 -18606
16010a8606j8779L277J7815j570N397J3779k764j131k066j1256k4709K409J5251
15997b2953J0929k818Q844N47j4606l131J8828N113J559k568o83J939Q612r95
15983H617k523j1890N157J1153M530p275j0885r9o959j1749J3105N861J678O291
15969E012K42r747L838P71N350J1362J2643j5843L448K651P628J0673J0935R932
15955E8895k5888l4743m739M60R042J6725O202R686k909n922n981J4028J2785
15942D7641j3480p629r537p445J7140J4115K0287P814L3560N5374J02606J99870
15930D60316K97897J58800P6992J75851J50133q3243j91871j77003j42435j55338
15920E70099j78570j21876q0827n6158k6975o788k972m019n20J453m201r614j2722
$$ plain form
16010 -18606 -37385 -34108 -16293 -17863 -12466 1313 -1451 -2582 -4648 -15904 -40613 -38204 -22953
15997 -22953 -12024 -14842 -5998 -5451 -20057 -23188 -4360 753 2312 -256 -939 1000 9612 8617
15983 8617 6094 -5796 -639 10514 15044 7769 -3116 -3215 -10174 -21923 -8818 -2957 -1279 5012
15969 5012 5254 -4493 -655 116 5466 16828 29471 13628 17076 19727 27355 38028 48963 58895
15955 58895 33007 -1736 -6475 -6015 3027 19752 25954 35640 32731 26809 20828 34856 47641
15942 47641 34161 26532 16995 9550 26690 40805 61092 68906 102466 157840 260446 460316
15930 460316 758213 917013 994005 1169856 1319989 1236746 1044875 867872 725437 570099
15920 570099 391529 269653 188826 132668 105693 98905 95933 91914 91394 92847 88646 79032 66310
15907F6310j8199O40J159j5085r248m660j011j217j4662n509J2997J5892O576
15894C3983q294l558M518q809j0949j409J803j2140n256J7085K884j2059M6q3
15880b238K458p210L165L955l941j1596j085n965R032Q412j1825l098q983o788
15866c5707P996J8255o244q941P829M470M104J132l603l960O449L474N423k545
15852a868l690J5669p37K107k452R200l791r313L035M86N657j50L185K287K019
15837B1644o986k249q534k1621r664P457L02J9284J5298k070Q822l402p02k884
15823A4695j3481K138M92j860J6891l988j4482K84j453K559Q611L564k1845j071
15809h946Q393n762l657J0505J0822l566n873l218p896j4382j0123J2094J5753
$$ plain form
15907 66310 48111 48751 49910 34825 25577 20917 19906 18689 4027 -1482 11515 27407 33983
15894 33983 25689 22131 26649 17840 6891 5482 7285 -4855 -10111 6974 9858 -2201 -2155 -2238
15880 -2238 220 -6990 -3825 130 -3811 -15407 -16492 -22457 -13425 -5013 -16838 -19936 -28919 -35707
15866 -35707 -27711 -9456 -15700 -24641 -16812 -12342 -8238 -7106 -10709 -14669 -8220 -4746 677 -1868
15852 -1868 -5558 10111 9374 11481 9029 18229 14438 5125 8160 8646 14303 14153 17338 19625 21644
15837 21644 14658 12409 3875 -17746 -27410 -19953 -19651 -367 14931 12861 21683 18281 17579 14695
15823 14695 1214 3352 3844 1984 18875 14887 405 689 -764 1795 10406 13970 -7875 -8946
15809 -8946 -553 -6315 -9972 533 11355 7789 1916 -1302 -9198 -23580 -33703 -21609 -5856
15796e856j771O802L057O467J563o903p953L939J3307K464J663m769m089j9001
15782a1080j2129L392N318J0993m975k526j1877l460L623j118L069J323o475R527
15768a6395N991N138q372K041M64m483m908J8553l364p394m687l206m946R896
15754a5672P696J4445q896j5235L855J5482K987k699j8247L992j4587O459J1207
15741i213K4646Q449j0945p160j5289J33M013J488P38N194l618k328Q928O232
15727A1268j1363J0256j942Q26j0514J1694J237K801J0513o813j4487m366Q583
15714G693K100j3195j0901j2862L443J0483N11L037L513P080J0942L110q02l668
15700A0484j4710k868q001l534Q265J7626j653j3831j2182M042J3563J07M014
$$ plain form
15796 -5856 -7627 -825 2232 8699 10262 3359 -4594 -655 12652 15116 16779 12010 7921 -11080
15782 -11080 -23209 -19817 -14499 -3506 -8481 -11007 -22884 -26344 -22721 -23839 -20770 -19447 -25922 -16395
15768 -16395 -10404 -5266 -13638 -11597 -11133 -15616 -20524 -1971 -5335 -12729 -17416 -20622 -25568 -15672
15754 -15672 -7976 6469 -2427 -17662 -13807 1675 4662 1963 -16284 -12292 -26879 -20420 -9213
15741 -9213 15433 23882 12937 5777 -9512 -9379 -5366 -3878 -3140 2054 -1564 -3892 5036 11268
15727 11268 -95 10161 8219 9045 -1469 10225 11462 14263 24776 17963 3476 -890 7693
15714 7693 9793 -3402 -14303 -27165 -23722 -13239 -12728 -9691 -6178 902 11844 14954 14152 10484
15700 10484 -4226 -7094 -15095 -18629 -10364 7262 5609 -8222 -20404 -16362 -2799 -2692 1322
15687A322J0641M858m421k634j4322o71L02q902k014J4061Q61k435L249r518j4159
15672b3782j0186O834J5442q974j0911O300P128J1291l821m917R733k506l031
15659a1400R392P682J458k628J0785k840l648J4699L215p831p661R407j0376n578
15645D676n09j1017k44m164n74R778J7915j269J086J967J470l854r154k52N162
15630A1017O74J8864L146j8533n426l818q968p364l733q579M249P222K256k858
15616a1851l873n368n110n06Q111M151K176Q036m903m070q59R394p180r009q683
15601b9544o971O432J9269J0712m105J277L73J461O545l082k129P95j654k886
15587c507j0743r408o765J0910m014j0811J0509P509l442J755L334M842J0178
$$ plain form
15687 1322 11963 16821 12400 9766 -4556 -5227 -4925 -13827 -15841 -1780 -919 -3354 -105 -9623 -23782
15672 -23782 -33968 -27134 -11692 -20666 -31577 -25277 -18149 -6858 -10679 -15596 -5863 -8369 -11400
15659 -11400 -2008 5674 7132 4504 15289 12449 8801 23500 26715 18884 11223 20630 10254 4676
15645 4676 4167 -6850 -7094 -11258 -11832 -2054 15861 14592 15678 17645 19115 15261 6107 5855 11017
15630 11017 11691 30555 33701 15168 9742 5924 -3044 -10408 -14141 -22720 -18471 -11249 -8993 -11851
15616 -11851 -15724 -21092 -26202 -26708 -18597 -14446 -12270 -4234 -9137 -13207 -14066 -4672 -11852 -20861 -29544
15601 -29544 -36515 -30083 -10814 -102 -4207 -2930 -2557 -1096 5449 2367 238 1033 -621 -3507
15587 -3507 -14250 -23658 -30423 -19513 -23527 -34338 -23829 -16320 -19762 -18007 -14673 -9831 347
15574C47O850K180J0k410J735m550r571j3611o207J6190K0723L046n106L55j9024
15559i043j7591P547K1692q088o566j0787P24J0208K1016P524j0936j0278j4077
15546a8655j2626P414J3640L131l730k656J0747J6323L708j0649j5010o148o107
15533b0618M322K327J7727J3424l413K273m066p594j6848r347K086J0041N091
15520d595N014O065r252k960k307p808j0862Q708M765K172P713Q276r49N50K015
15505F545j4459n688J6715Q160L532n727m517L723m212O407n057J2821L20j2296
15491F267j0048n582n195N167n87K677M957n041P449O944P133j2718j4923K75
15477a3225J1391R345l140j817p881n674O306q930m322M136L639r730p133K301
$$ plain form
15574 347 7197 9377 9387 6977 8712 4162 -5409 -19020 -25227 -9037 11686 14732 9626 9981 -9043
15559 -9043 -26634 -19087 2605 -5483 -12049 -22836 -22112 -11904 9112 16636 5700 -4578 -18655
15546 -18655 -31281 -23867 -10227 -7096 -10826 -13482 -2735 13588 17296 6647 -8363 -14511 -20618
15533 -20618 -16296 -13969 3758 17182 13769 16042 11976 4382 -12466 -21813 -19727 -9686 -4595
15520 -4595 419 6484 -2768 -5728 -8035 -15843 -26705 -17997 -13232 -11060 -3347 4929 3980 4530 6545
15505 6545 -7914 -13602 3113 11273 14805 9078 4561 8284 4072 10479 5422 18243 18563 6267
15491 6267 -3781 -9363 -14558 -9391 -9978 -7301 -2344 -7385 64 7008 14141 1423 -13500 -13225
15477 -13225 -1834 7511 4371 2554 -5327 -11001 -4695 -13625 -17947 -13811 -10172 -19902 -27035 -24734
15463b4734O242q838M129J8136Q126l814j0634j3670J0761P952M741J1177L879
15450A3453r008N234J0748j3378j0207L905J296o009L564n03n342N885J8654k194
15436A6098R86l579j4496n819K111j160K609q41n116R135q811P209L797j6395
15422a4272o164N032L799j2497n990K089N438J8262K408M677J099r939R706Q021
15408A1669q38j79j261j790j3131o181R049p785J59J6125j1946k2919K369J4203
15394a2456J0864o515O365k810j216j049l353J219j3538k976p187J3973Q050j193
15380a1822J756k660L586K2118l531j9269j3138M604M518J9117L031Q129k187
15367A4252r570q120j526N526L852r476k1213L157M051N352J5862R686N990N312
$$ plain form
15463 -24734 -18492 -27330 -23201 -5065 3061 -753 -11387 -25057 -14296 -6344 -1603 9574 13453
15450 13453 4445 9679 20427 7049 -3158 747 2043 -3966 -402 -905 -6247 -362 18292 16098
15436 16098 17084 13505 -991 -6810 -4699 -5859 -3250 -4091 -9207 -72 -8883 -1674 2123 -14272
15422 -14272 -20436 -15404 -11605 -24102 -30092 -28003 -22565 -4303 -1895 2782 3881 -6058 3648 11669
15408 11669 10831 10652 9391 7601 -5530 -11711 -2662 -10447 -10288 5837 -6109 -29028 -26659 -12456
15394 -12456 -1592 -8107 -1742 -4552 -5768 -6817 -10170 -8951 -22489 -25465 -32652 -18679 -10629 -11822
15380 -11822 -10066 -12726 -9140 12978 9447 -9822 -22960 -18356 -13838 5279 8310 16439 14252
15367 14252 4682 -3438 -4964 562 4414 -5062 -26275 -23118 -19067 -13715 2147 11833 17823 23135
15353B3135R573j1503j3051j7507q719R459J0998P742p218j4025j9176J92J0345
15340a9755R494P453J3797M03m747N589k883o731J489M58l081O591j2633p307
15326a1863k673m46Q658J3839q212j7581M879j304j3938K312k452p269M344J2664
15312a9042R320m905k046J97J6884K932j5144n330j275K957K887J3372J0658j2518
15298a053p079O0j1349O725O925L395O777m516k971n790M175l091J375Q140M617
15283F340j2195J6253J2449j5542q415K569K212j4588r95O369m490M65O234P075
15269C741k658k291Q71Q484J0197q586q029j3163l35L306n070O480j733j7068
15255b5854j0919Q884J1106K587P373K0268L025j3820l572O294j0847O602O067
$$ plain form
15353 23135 32708 21205 8154 -9353 -18072 -8613 2385 10127 2909 -11116 -30292 -30100 -19755
15340 -19755 -10261 -2808 10989 11392 6645 12234 9351 2620 4109 4567 1486 8077 -4556 -11863
15326 -11863 -14536 -14982 -6324 7515 -697 -18278 -13399 -14703 -28641 -26329 -28781 -36050 -31706 -19042
15312 -19042 -9722 -14627 -16673 -16476 408 3340 -11804 -17134 -18409 -15452 -12565 807 11465 -1053
15298 -1053 -8132 -8072 -19421 -12696 -5771 -2376 4401 -115 -3086 -8876 -4701 -7792 -6417 1723 6340
15283 6340 -5855 10398 22847 7305 -1110 1459 3671 -10917 -11912 -5543 -10033 -9568 -3334 3741
15269 3741 1083 -1208 -337 8147 18344 9758 1729 -11434 -11769 -8463 -13533 -7053 -8786 -25854
15255 -25854 -36773 -27889 -16783 -14196 -6823 13445 16470 2650 -922 5372 -5475 1127 7194
15242G194j119J970p474J715Q494r564p048K16l192l59J3896Q938p021o791K678
15227B533k549m56l370l799P103L463n785o571Q667O214P170P803M868J6279O044
15212D7614k153p790J4167j727j1810o013j7495p768m909l032j1285l400J3837
15199a764J6977k862l944J1393Q395p42M444Q772j9794j1743M491K0940j4761
15186A9802j6583j034L049k171j480n558o662J199Q611o552j5808M493O789R655
15172b250J1911K224K050j4068p029k280m62j2203J0484L158m596j211J2183J6568
15158A4479Q207j1276j3129J147q352j2206R822J0280M52M80j3934K650N643O108
15144C71P31o670M039m716M385Q112j6903l504L143P453J1773l941k0571r538
$$ plain form
15242 7194 6075 8045 571 2286 10780 1216 -5832 -5616 -8808 -9167 4729 13667 6646 -145 2533
15227 2533 -16 -472 -3842 -7641 -538 2925 -2860 -9431 -764 5450 12620 20423 25291 41570 47614
15212 47614 45461 37671 51838 50111 38301 32288 14793 7025 2116 -916 -12201 -15601 -1764
15199 -1764 15213 12351 8407 19800 28195 27453 31897 40669 20875 9132 13623 34563 19802
15186 19802 3219 2185 5234 3063 1583 -3975 -10637 -9438 -827 -7379 -23187 -18694 -11905 -2250
15172 -2250 9661 11885 13935 -133 -7162 -9442 -9904 -22107 -11623 -8465 -13061 -14272 -2089 14479
15158 14479 22686 11410 -1719 -572 -8924 -21130 -11308 -1028 -576 -96 -14030 -11380 -5737 371
15144 371 1102 -5568 -1529 -6245 -1860 6252 -10651 -14155 -11012 -3559 8214 4273 -16298 -25836
15130b5836M668J3561K425P295J2166K711j4147J0435j280j6092j2639N820L293
15117g620o508M556Q305J0180J5561P74p723J186K937K311j661o113k3178r848
15103a6841J6004q66O000n326j37n023l985K864M782P861l156j2328q678q395
15089b7224l543r562J6935K1002O745J5047l762j0448j0358M9l742j5357J2314
15076a1904Q442l6Q325J9911j73L069j74j2618q438M730P782M459k265l230o13
15061A7267M657K083q191p386P494j3461j5690R157O899j5338n033M499K817J624
15047h602P134j1263j5472k325J5321K0616O44j0778J1790j2231j2563J0543J1232
15034D046j64N829m698j1087J16J440K795r77j09q323j0844J0954R796p327K22
$$ plain form
15130 -25836 -21168 -7607 -5182 2113 14279 16990 2843 13278 11998 -4094 -16733 -10913 -7620
15117 -7620 -14128 -9572 -1267 8913 24474 25248 17525 18711 21648 23959 22298 16185 -6993 -16841
15103 -16841 -837 -1703 4297 -1029 -1166 -6189 -10174 -7310 -2528 5333 2177 -10151 -18829 -27224
15089 -27224 -30767 -40329 -23394 -2392 4353 19400 15638 5190 -5168 -5119 -8861 -24218 -11904
15076 -11904 -3462 -3498 4827 24738 24565 27634 27460 14842 6404 11134 18916 23375 21110 17880 17267
15061 17267 21924 24007 15816 8430 15924 2463 -13227 -4070 2829 -12509 -17542 -13043 -10226 -8602
15047 -8602 -1468 -12731 -28203 -30528 -15207 5409 6053 -4725 7065 -5166 -17729 -7186 4046
15034 4046 3882 9711 5013 -6074 -5958 -4518 -1723 -2700 -2809 -11132 -21976 -11022 -1226 -8553 -8331
15019h331j0620M22J3913K438O611P74l639j256N358R355K519r673o471J1165
15005A2565r745j4120n78o791Q718Q665j625n158o317K381J0347k579O719R99
14991C481M194j3232o205j1375J876J0092p708O17J9482N986k5239j2511K440
14978b8102Q943J1628M945o799o795n84J5756n198l493m285l909q04J0910J685
14964f102j1328O408J2419k24l629J91j881o870O32n334L964J0226K966j1276
14950i838l28M53j3070r484k602M915O585J4270J0671n421L800L110J999r396
14936d336l322l190l047m834o71m381j0439L03k540Q798J0363j221l703N664N687
14921a0869r043j7704o672J4957O30J289N236L521j758R225K346M258N415p557
$$ plain form
15019 -8331 -18951 -18529 -4616 -2178 4433 5207 1568 312 5670 15025 17544 7871 1400 12565
15005 12565 2820 -11300 -11878 -18669 -9951 -1286 -2911 -8069 -14386 -12005 -1658 -4237 2482 3481
14991 3481 7675 -5557 -11762 -23137 -21261 -11169 -18877 -18260 1222 7208 -18031 -30542 -28102
14978 -28102 -19159 -7531 -2586 -9385 -16180 -16764 -1008 -6206 -9699 -13984 -17893 -18697 -7787 -6102
14964 -6102 -17430 -11022 1397 1173 -2456 -2265 -4146 -11016 -10384 -15718 -11754 -1528 1438 -9838
14950 -9838 -10166 -9713 -22783 -32267 -34869 -29954 -23369 -9099 1572 -3849 -49 3061 5060 -4336
14936 -4336 -7658 -10848 -13895 -18729 -19400 -23781 -34220 -33917 -36457 -27659 -17296 -18517 -22220 -16556 -10869
14921 -10869 -19912 -37616 -44288 -29331 -28701 -27412 -22176 -18655 -20413 -11188 -8842 -4584 831 -6726
14907f726K412N943R925N303p004j196J712j7096j2632L711K1609K805n529k4833
14893b1596P93J135J588J958O452O258R973n79q236M465j813J3874j576k018o006
14878D672j2646l147J1202O058k871p346k305M791M322k16J056j3792o444R12
14864a5754m830n449l111m083J1318M930k772M554j528M479J17J079K368K179
14850f503J4269O518j6114o458p463p866J1797Q688r072m239l777Q892m483N90
14836a5221J500R276p218m372N862J9048O836r309q136j7198k569J2168O580m764
14822g517q358L69j10J206L117o348Q337J3006R159J3617m60n325P742p591o101
14807A4743R200O674q765o161J517P07M00N835m871J4304P557j1497j4218j331
$$ plain form
14907 -6726 -4314 1629 11554 16857 9853 8657 10369 -6727 -19359 -15648 5961 8766 3237 -21596
14893 -21596 -20803 -19668 -18080 -16122 -9670 -3412 6561 5982 -2254 2211 398 14272 12696 10678 4672
14878 4672 -7974 -11121 81 6139 3268 -4078 -6383 -1592 2730 2514 3570 -10222 -16666 -15754
14864 -15754 -20584 -26033 -29144 -33227 -21909 -16979 -19751 -15197 -16725 -12246 -12129 -11050 -8682 -6503
14850 -6503 7766 14284 -1830 -8288 -15751 -23617 -11820 -3132 -12204 -16443 -20220 -11328 -15811 -15221
14836 -15221 -13721 -4445 -11663 -16035 -10173 8875 15711 6402 -1734 -18932 -21501 -9333 -2753 -7517
14822 -7517 -15875 -15506 -15616 -14410 -11293 -17641 -9304 3702 12861 26478 26018 20693 28435 20844 14743
14807 14743 23943 30617 21852 15691 17208 17915 18315 24150 19279 33583 41140 29643 15425 14094
14793A4094K624l692P077N886p924j6447j2732M647J0750J2191k251j3496n141
14780d414O569N828l496j011N792M266q069k075O24j1117m796M56n061j0916L782
14765b3638j237O324j1049m348Q627J7024J4592J0702n907j2476j1469M215P19
14752g921L786j258n112J592j3370j445P317L840J2369J1016M8m078o346q040
14738g602N674o197j3291J3682j163L179p697K489N312k92N163J4726J1911j0559
14724A5335R64J3355N884l012j3010J1505m505j1363Nl282K140j1829N765M695
14710A2647j8520j2678P990J691J139m662q234o52O114O140N133J061K389J0817
14696A0375J1476j0939k547l12L291N138M303j4644m297p46k709M126j0013j6135
$$ plain form
14793 14094 16718 13026 20103 25989 18065 1618 -11114 -6467 4283 16474 14223 727 -4414
14780 -4414 2155 7983 4487 3476 9268 13534 5465 3390 4014 -7103 -11899 -11443 -16504 -27420 -23638
14765 -23638 -24875 -18551 -29600 -33948 -25321 -8297 6295 16997 11090 -1386 -12855 -8640 -7921
14752 -7921 -4135 -5393 -10505 -8913 -22283 -23728 -16411 -12571 -202 10814 10862 6784 438 -7602
14738 -7602 -1928 -8125 -21416 -7734 -8897 -5718 -13415 -10926 -5614 -5906 -743 13983 25894 15335
14724 15335 16299 29654 35538 32526 19516 31021 26516 15153 15158 11876 14016 2187 7952 12647
14710 12647 -5873 -18551 -10561 -8870 -7731 -12393 -20627 -21279 -15165 -9025 -3892 -2831 -442 10375
14696 10375 21851 10912 8365 8053 11344 16482 20785 6141 1844 1098 -1611 2515 -7498 -23633
14682b3633k621J806L640K838j842r827m795J1921Q921K419k95p75Q470J1439
14668G666j2126j6078L4M515J10N359K0676J0739j83K522J509k3843O32J4574
14654A6106Q113R290l337j7879n319N819Q029q116j0298q840k621o387J0357J3667
14640H584J8340L134j3838m740j8471n817J3432J025J53J42J751M665n645R52
14626C667L94j025o822l994n901j3014L897J8451M269r140J000o72p556K9M073
14611a2344R479J3139J1745j802j5536P188j152r759j3483K881O007N871l724
14598a490O308N795M219r014O727K23j1761o97L835j6101o70p76j0596O135J3290
14583d573k029n981m162N190p281J5563O854j7521K16Q118m166L272K000n322
$$ plain form
14682 -23633 -26254 -24448 -20808 -17970 -19812 -29639 -34434 -22513 -13592 -11173 -11468 -12243 -3773 7666
14668 7666 -4460 -20538 -20504 -15989 -15879 -10520 10156 20895 20712 23234 24743 900 1532 16106
14654 16106 24219 33509 30172 12293 6974 12793 20822 12706 2408 -6432 -9053 -15440 -5083 8584
14640 8584 26924 30058 16220 11480 -6991 -12808 624 1649 1802 1944 3695 8360 2715 3667
14626 3667 4061 3036 -3786 -7780 -13681 -26695 -22798 -4347 -78 -9218 -8218 -8890 -16446 -16417 -12344
14611 -12344 -2865 10274 22019 20217 4681 11869 10717 958 -12525 -9644 -3637 2234 -1490
14598 -1490 4818 10613 14832 5818 12545 12768 1007 310 4145 -11956 -12626 -13402 -23998 -17863 -4573
14583 -4573 -6602 -12583 -16745 -11555 -18836 -3273 3581 -13940 -13724 -5606 -9772 -6500 -4500 -9822
14569i822j975j507p979O004M913l613L456P995N551R820J596j4085J634J273
14555C261j30j1889j4521J2647K2533r56j2935M06L483O892n466l012j1305q466
14541a9458J216M309L952J3986m257J0619J81n741l775n217o286Q92R032K411
14527A864j2973L76m587N040j88L072l698J1475J1021J310j5797l922k360Q33
14513h534n744n222J292N494l435l377K2706J7383R611j0245j04m263J581L563
14499B0706R860o277j9707j7207q907P622J1354N990j0208J660P016J3714m922
14486A0694j0856R281N440l469n745k527q74l682p793o229R95J7657P891n480
14472E303j1498j3125J7136J6903K953K050j0824n67m221r164j3955J9132J0077
$$ plain form
14569 -9822 -11797 -13304 -21283 -15279 -10366 -13979 -10523 -2528 3023 12843 14439 354 1988 3261
14555 3261 3131 -8758 -23279 -10632 11901 10945 -1990 -1584 1899 8791 3325 313 -10992 -19458
14541 -19458 -18242 -13933 -9981 4005 -252 10367 10548 4807 1032 -4185 -10471 -9579 -547 1864
14527 1864 -11109 -10733 -15320 -10280 -10468 -7396 -11094 381 11402 12712 -3085 -7007 -9367 -8534
14513 -8534 -14278 -19500 -18208 -12714 -16149 -19526 3180 20563 30174 19929 19825 15562 17143 20706
14499 20706 30566 24289 4582 -12625 -21532 -13910 -2556 3434 -6774 -5114 1902 15616 10694
14486 10694 -162 9119 14559 11090 5345 2818 1944 -1738 -9531 -15760 -14765 2892 10783 5303
14472 5303 -6195 -19320 -2184 14719 17672 19722 8898 8331 4110 -5054 -19009 123 10200
14459A0200j4621p584n473m713j521M122M702n736n481L903J1986j593O783K350
14445b676m66m085j2226j3753K246J9368r48K771O681N460K773q669r652J2259
14431i17J8015m531l318J0262l576n839K440q397p017j4882O453J4624L45O74
14417D336l08L467L84j5544j6503N221J1103R775J167m700p048r078m658K191
14403b0195L637J1408m689J0195J3488Q360q994K628j1645n313L314n345J305
14390a846L544J499j2446k006M101L647J507p139r861R459K246P358J0523L715
14376A4301l342K517m853n001k297m823j85M399J488r985o878m983o91Q818K3106
14361A1591l126N638J070j0964m212j1400K430J2413l804qN25o909j4577n196
$$ plain form
14459 10200 -4421 -12005 -17478 -22191 -23712 -19590 -14888 -20624 -26105 -22202 -10216 -11809 -5026 -2676
14445 -2676 -3142 -7227 -19453 -33206 -30960 -11592 -12540 -9769 -3088 2372 5145 -3524 -13176 -917
14431 -917 17098 12567 9249 19511 15935 10096 12536 4139 -2878 -17760 -11307 3317 3662 4336
14417 4336 4028 7495 7879 -7665 -24168 -18947 -7844 1931 3098 -1602 -8650 -17728 -22386 -20195
14403 -20195 -16558 -5150 -9839 356 13844 22204 13210 15838 4193 -1120 2194 -3151 -1846
14390 -1846 1698 3197 -9249 -11255 -7154 -3507 -2000 -9139 -19000 -9541 -7295 63 10586 14301
14376 14301 10959 13476 8623 3622 1325 -3498 -3683 716 2204 -7781 -14659 -19642 -20333 -11515 11591
14361 11591 8465 14103 15173 4209 -3 -11403 -8973 3440 -364 -372 153 -6756 -21333 -26529
14347b6529M811J9923O110n125N933J622j1852n396N740m728K632o542N183n87
14333h805J937J2822O367k9402k604J3069P156m292p067o831j012N292M148o889
14319a6111l486p841o337J3375J1710M663o86o024K729R046N735J43N662R178
14305B1756n939k848J1822J3325j8912J5L096j0386o837k307M214k695o018M117
14291B403J0797M737l556q288O155J850P039j515j880j0918o221l893N261P75
14277B746o711j5045J0631K800j4946R94J1521J27K094N384o835o104M712J2856
14263D224J00N688p98j315L155m939j0942R896L027q184P434P594M453j4572k5369
14248b0548q5J2169J1637j2033j3245k365J5175J2673Q232j909K713j3350m77
$$ plain form
14347 -26529 -21718 -1795 4315 -810 5123 6745 -5107 -10503 -4763 -9491 -6859 -13401 -8218 -8805
14333 -8805 -6868 5954 12321 -17081 -19685 -6616 540 -3752 -10819 -17650 -18662 -13370 -9222 -16111
14319 -16111 -19597 -27438 -33775 -20400 -8690 -4027 -4713 -10737 -8008 1038 6773 6916 12578 21756
14305 21756 15817 12969 24791 38116 19204 19219 22315 11929 5092 2785 6999 4304 -1714 2403
14291 2403 13200 17937 14381 6093 12248 14098 21137 19622 17742 6824 603 -3290 1971 2746
14277 2746 -3965 -19010 -8379 -5579 -20525 -19531 -8010 -7883 -5789 -405 -7240 -13344 -8632 4224
14263 4224 4324 10012 9214 7899 11054 6115 -4827 5069 8096 -88 7346 14940 19393 4821 -20548
14248 -20548 -20633 -8464 3173 -8860 -22105 -24470 -9295 3378 11610 9701 12414 -936 -1413
14235a413J2390L167j7337P076k147L07k953j1431n772n409n532N954P729N256
14221a0115L21Q081J231P288m220j708k976m679J0758M13j3954Q077J0935j011
14207H441j5889J8764L147j2558j2655n883j770l157K114M11j14n3Q923J0772
14193D93m889j2771m485m000J6777N711q313J162M019O627J7393m77K228Q61j2587
14178G749l844O759L221J3150J951q564N52j0238r705M736O526l768j3087l819
14164h381J1567J4526K7085J2056r201k983J308Q905L227m727j0464j1510n176
14151B6232M145O260J912j797m87j6074k605O982J776j30p921j438J635m774m674
14136I042o211o151m919J410j7382M506N374J1168J3176m599j3527N266P021J3575
$$ plain form
14235 -1413 10977 14144 -3193 3883 1736 2043 -910 -12341 -18113 -23522 -29054 -23100 -15371 -10115
14221 -10115 -9794 -1713 -482 6806 2586 878 -2098 -6777 3981 4394 -9560 -1483 9452 8441
14207 8441 -7448 11316 14463 1905 -10750 -16633 -18403 -21560 -19446 -19035 -19149 -19202 -10279 493
14193 493 -4396 -17167 -21652 -25652 -8875 -3164 -11477 -10315 -6296 331 17724 17247 19475 20336 7749
14178 7749 3905 10664 13885 27035 28986 20422 20974 10736 1031 5767 12293 8525 -4562 -8381
14164 -8381 3186 17712 44797 56853 47652 44669 45977 54882 58109 53382 42918 31408 26232
14151 26232 30377 36637 38549 36752 36265 20191 17586 24568 26344 26214 18293 16855 18490 13716 9042
14136 9042 2831 -3320 -8239 -6829 -24211 -19705 -14331 -3163 10013 5414 -8113 -2847 4174 17749
14122A7749j8358K276J1188k127n814J138k569l621J48K230K877k281r929k372
14108i465l551n42N717q796O221J6604J4580R026o703j8201n749J3389o250j4507
14094h227N797R180n702J321j835M319q851R938J2763q359n387m556j0046O670
14080b975l229q765N468Q746M069q566N857N411j07J0956p718p761l280K555N226
14065E887l115J533L442o09j2704p523k332m431J6093o46k125O86J4971Q186M489
14050B1802q692j2735k717k187N176k597J2069k748j5400Q233P410P01j2813P975
14036C477R294K820J0527L88r801L135p84m388P35L503j2072N195J2384M626p685
14021B1354j839R513M980j8640j7496n892p590q37O232J1540o641R006P914Q265
$$ plain form
14122 17749 -609 1667 12855 10728 4914 6052 3483 -138 10 2240 5117 2836 -7093 -9465
14108 -9465 -13016 -13558 -7841 -16637 -10416 6188 20768 29794 23091 4890 -859 12530 6280 -8227
14094 -8227 -2430 6750 1048 2369 534 4853 -3998 5940 18703 10344 4957 401 -9645 -2975
14080 -2975 -6204 -14969 -9501 -755 3314 -5252 605 6016 5909 16865 9147 1386 -1894 661 5887
14065 5887 2772 4305 7747 7138 -5566 -13089 -15421 -19852 -3759 -4405 -6530 -5844 9127 17313 21802
14050 21802 13110 375 -2342 -4529 647 -1950 10119 7371 -8029 204 7614 8315 -4498 3477
14036 3477 12771 15591 26118 26506 16705 19840 19056 14668 15403 18906 6834 12029 24413 29039 21354
14021 21354 19515 29028 34008 15368 -2128 -8020 -15610 -16447 -10215 1325 -5316 3690 11604 19869
14007A9869M448j2093k3101J383K0140Q563p345j379J00p809r039k932j835J6348
13993E318l638l956p049Q164j004j6429l960J2116K34R117Q616Q624N06o065J088
13978A1682n160k763J3171J5244J784p206r065P031P174PO790l162j2443j4387
13964H697L429M20J647L941P478L02j1079m375L891R833j912j8651o764k969R750
13949C638l15M944p1K121J0983Q610L842J6590m413j5236j8260J3559j0035k216
13935A3741Q359Q57j4229o265j1166j824Q822N802K794N094q018j0848N955J4079
13921A3153O500P03m974N760j6489l817J3003N751K263l061K817O578J7640o478
13907C9349P222J8050M136K891P463k0925j6348K62l501j675l281n566n765j849
$$ plain form
14007 19869 24317 12224 -10877 -9494 10646 19209 11864 10485 10585 2776 -6263 -9195 -11030 5318
13993 5318 1680 -2276 -9325 -1161 -2165 -18594 -22554 -10438 -10204 -1087 7529 16153 16659 10594 11682
13978 11682 6522 3759 16930 32174 33958 26752 17687 24718 31892 31899 38689 35527 23084 8697
13964 8697 12126 12546 14193 18134 25612 25914 14835 10460 14351 24184 22272 3621 -3143 -6112 3638
13949 3638 3323 8267 8196 10317 21300 29910 33752 50342 45929 30693 12433 25992 15957 13741
13935 13741 22100 22957 8728 2463 -8703 -10527 -1705 4097 6891 11985 3967 -6881 -926 13153
13921 13153 19653 20356 15382 21142 4653 836 13839 19590 21853 18792 21609 28187 45827 39349
13907 39349 46571 64621 68757 71648 79111 58186 41838 42100 38599 36924 33643 28077 22312 20463
13893B0463J452J596k544j981O814J390m328o19M511k420j50r574N385J041J611
13878B2647k465Q308M877O165J129k0547k8757l024J2930K6150O093j1072k380
13865B0054j0039m231O659M867j972j2525J0474P167k520J3316Q251n028J4925
13852D9398O634r815L559j2416M003q507K170J5412r433j1653k620Q054o542l117
13838B5127R027m445n228j2101p568r386J303J9136R565j037n720j4847J0295
13825A4121J4593O42k586p08j207n53j415L018J225r577n232m882j3718l631J3630
13810C720J9195J367N333N001j0450o430M901O816K398p492O652J1692P075M666
13796E4444j3573P041P41m644j5264J0403P620o389r180n5J0889J86R751J9970
$$ plain form
13893 20463 21915 23511 20967 18986 25800 27190 22862 22243 26754 24334 24184 14610 19995 21036 22647
13878 22647 20182 28490 33367 39532 40661 20114 -8643 -11667 1263 27413 33506 22434 20054
13865 20054 10015 5784 12443 17310 15338 2813 13287 20454 17934 31250 39501 34473 49398
13852 49398 56032 46217 49776 37360 41363 32856 35026 50438 41005 29352 26732 34786 28244 25127
13838 25127 34154 29709 24481 12380 4812 -4574 -3271 15865 25430 24393 18673 3826 14121
13825 14121 28714 29356 26770 26062 24855 24302 22887 25905 27130 17553 12321 7439 -6279 -9910 3720
13810 3720 22915 24282 29615 34616 24166 17736 22637 29453 31851 24359 31011 42703 49778 54444
13796 54444 40871 47912 48653 44009 28745 39148 46768 40379 31199 31144 42033 42219 51970 71940
13782G1940J6495M72N972n003J183Q119Q119P061N341M615J3810K0084K0329M7378
13768B25915N6728O7804J16710K42160M29694N50474K62438n151Q315Q0594J62174
13757B197855K09990O6071k15377k42739j97327k09602l01564l58068k58841j62724
13747E27674j03659n7227l7673m3197l3361k1505k3006j2866j8486j4930o337
13736A55427r073j6594j3259o180l557J5073N686j5404j1940j230J5672j434j1890
13723A01297k1075j6594q394P097m634k008l59K368r695n725L905R051Q599L160
13709F6993l577P297q013j3755k4224J1572R697j3685Q702r116n102P935j1549
13696B3175j3751J958p342O441K1617J1481j4460k2909j148J8656J7938q290q760
$$ plain form
13782 71940 88435 88907 94879 89876 91059 99178 107297 114358 119699 124314 138124 158208 178537 225915
13768 225915 282643 350447 467157 709317 1139011 1689485 1951923 1946772 1955087 2035681 2197855
13757 2197855 2407845 2473916 2258539 2015800 1818473 1608871 1307307 949239 690398 527674
13747 527674 424015 366788 329115 285918 252557 231052 208046 195180 176694 161764 155427
13736 155427 146354 129760 116501 110321 106764 121837 127523 112119 100179 98949 114621 113187 101297
13723 101297 80222 63628 55234 62331 57697 55689 55330 57698 48003 42278 46183 55234 63833 66993
13709 66993 63416 70713 62700 48945 24721 36293 45990 32305 41007 31891 26789 34724 23175
13696 23175 9424 11382 4040 10481 32098 43579 29119 6210 5062 23718 41656 33366 24606
13683B4606J0771r73N238p305m780M54l967J402L386L821J254m8q362j1442K516
13668A6571j908j1495n366K0856L143n814J014J1114j494N539L540J4465Q817
13655E8982M591l353N46j1143k2250L401L300J0725J1149j5187j8621l619J144
13642A9665O240K2116K1432P739L466j4690M558Q938j4446m826n609k097M753
13629E7239R778L259M571M48k196L657n063N324Q913O3o226j1318M437n275p501
13614F0110k0783j4870m228n510p804q644p215k033P763J2787J9046K5478L9616
13601I3713L9575J0516J9347K9004J7785R0589R8591J9140n7253m1164m9303O172
13589B76712L3316K0576k2442m9939n6507l3147j5556k8232j5159q832J1614l5
$$ plain form
13683 24606 35377 34404 39642 32337 27557 28011 24044 25446 28832 32653 33907 33859 25497 14055 16571
13668 16571 14663 3168 -2198 18658 21801 15987 17001 28115 26621 32160 35700 50165 58982
13655 58982 63573 60220 60766 49623 27373 30774 34074 44799 55948 40761 22140 18521 19665
13642 19665 25905 48021 69453 77192 80658 65968 70526 79464 65018 60192 54583 52486 57239
13629 57239 67017 70276 74847 75295 73099 76756 71693 77017 85930 85993 79767 68449 72886 67611 60110
13614 60110 39327 24457 20229 14719 6915 -1729 -8944 -10977 -3214 9573 28619 54097 93713
13601 93713 133288 143804 163151 192155 209940 300529 399120 418260 361007 319843 270540 276712
13589 276712 310028 330604 308162 258223 201716 168569 153013 124781 109622 100790 112404 112369
13577A12369j2599o372k838k564k89k984j3529k2241j1939m815p248k0472j4198
13564i719n707L533k284r741j1042k0723k6492p070j3053J5200K832J8056M0772
13551b5438J6023q49O009L9596L1730O488j0374N269P511n553K0585L3794J2271
13538A37062r489k7474j5296K2409M0426Q007P554M099n243L388O228q272j8021
13525A45378j0687J0826N517m549q937m348o745j9150r633p358J2409J9759l2
13512A22450Q362p80o508j598j8186j5883P484O069o152l1628j6200J6516L3213
13499I7159L9471N765J0577M938N479L1105N8928L3777M071R859L1023K5717R52
13486C58821k945m996j2459K576l301N586K2046o402j4057n609P963J6086L4215
$$ plain form
13577 112369 99770 93398 90560 87996 87707 84723 71194 48953 37014 32199 24951 4479 -9719
13564 -9719 -15426 -11893 -14177 -23918 -34960 -55683 -82175 -89245 -102298 -87098 -84266 -66210 -25438
13551 -25438 -9415 -10264 -4255 35341 67071 73559 63185 68454 75965 70412 90997 124791 137062
13538 137062 127573 100099 84803 107212 147638 155645 163199 167298 162055 165443 171671 163399 145378
13525 145378 134691 145517 151034 146485 137548 133200 126455 107305 97672 90314 102723 122482 122450
13512 122450 130812 130032 123524 121926 103740 87857 95341 101410 95258 63630 47430 63946 97159
13499 97159 136630 142395 152972 157910 163389 194494 253422 287199 291270 301129 332152 357869 358821
13486 358821 355876 350880 338421 340997 337696 343282 365328 358926 344869 339260 347223 363309 397524
13473C97524M5210N8660M5782L9185K7326k498J5640J1431m9297l8929m0379n7209
13461D52446k2002j832p0767r9711n0840l1828J0342R524o906j9551j1729K1056
13449A78202K9024J4944J8153J4782J1883J0252O873O638P806K3395K5729K1262
13437C68943L593L28j861J6939p689k6917l2137m166K6329J7520J2610K675l053
13424C73114J5251L0364K4290R664J4902J7755J3717J2184j788k4022K719K3204
13412E11354M2378L0794J0670R330J2011M5767M4250K6052M0279M5083M9298N3325
13400I20591M5942M4572L8776K9333M1353N6423O6967O3324M6414K3422K6634
13389A403751K1996L4897M9398O8405P2705Q0821P9561P4196Q4253J24936J42219
$$ plain form
13473 397524 442734 501394 547176 586361 613687 611189 626829 638260 588963 550034 509655 452446
13461 452446 430444 428612 357845 258134 207294 175466 185808 195332 188426 168875 157146 178202
13449 178202 207226 222170 240323 255105 266988 277240 284113 290751 298557 321952 347681 368943
13437 368943 372536 372864 371003 387942 380253 353336 321199 317033 343362 360882 373492 376167 373114
13424 373114 388365 418729 443019 452683 467585 485340 499057 511241 509453 485431 488150 511354
13412 511354 553732 584526 595196 604526 616537 662304 706554 732606 772885 817968 867266 920591
13400 920591 966533 1011105 1049881 1079214 1120567 1176990 1243957 1307281 1353695 1377117 1403751
13389 1403751 1425747 1460644 1510042 1578447 1651152 1731973 1811534 1885730 1969983 2094919 2237138
13378B237138J56155J73571J89095K36151K91783L71677N50556Q31960Q21429
13369E859515L93933L93335O90046J162107J452151J218115R14613O88708N94523
13360A3367046Q49596J182667J224982J330497J384956J400919J963417K636202
13352B5340282L753646N525862Q136372J2567511K1398225L8839003P3838881
13345A89399782J12730648O8127215l873223o641923R649240K6758898M0950203
13338D37100840K6300777l6886224m8560359l3832435k9987201m8135181p0505581
13331A95494636n9211547l5432072k0614691j3023469q974729o672945n621043
13324D5944140m424968l243899k955457k821509k499290k184140j737914j133687
$$ plain form
13378 2237138 2393293 2566864 2755959 2992110 3283893 3655570 4206126 5038086 5859515
13369 5859515 6253448 6646783 7336829 8498936 9951087 11169202 12083815 12772523 13367046
13360 13367046 14216642 15399309 16624291 17954788 19339744 20740663 22704080 25340282
13352 25340282 29093928 34619790 42756162 55323673 76721898 115560901 189399782
13345 189399782 302130430 370257645 366384422 359742499 369391739 396150637 437100840
13338 437100840 463401617 426515393 377955034 344122599 314135398 266000217 195494636
13331 195494636 136283089 100851017 80236326 67212857 58238128 51565183 45944140
13324 45944140 41519172 38275273 35319816 32498307 29999017 27814877 26076963 24943276
13316B4943276j335609j881020j858253j625719j351549j204073j213351j302679
13308A3171023j174515r56460q49332q87412r21847p66643n94882n04786m46601
13299F068545m01192l75114l47883l25438k57367k32639k48371k56019k34904
13290C389618k16969j74147j63428j62172j64089j45160j22198q4713j07729j06732
13280A942281q4020r0513r3567p1366o8490n0061k9266m7222o2935m1867m0969
13269A262005j7248j9474l1197l9531m6711n3896n1111l4662k8390l4063j3105
13258H92617l1652m2617j5267M668j342o129j812J2883M7521J08834K14597K66130
13246A448431N3390r3740q5472o9360r7078j82607j84194r9689n6150m8930m1443
$$ plain form
13316 24943276 23607667 21726647 19868394 18242675 16891126 15687053 14473702 13171023
13308 13171023 11996508 11040048 10190716 9303304 8381457 7614814 7019932 6515146 6068545
13299 6068545 5667353 5292239 4944356 4618918 4361551 4128912 3880541 3624522 3389618
13290 3389618 3172649 2998502 2835074 2672902 2508813 2363653 2241455 2156742 2049013 1942281
13280 1942281 1858261 1767748 1674181 1602815 1534325 1484264 1454998 1407776 1344841 1302974 1262005
13269 1262005 1244757 1225283 1194086 1154555 1107844 1053948 1002837 968175 939785 905722 892617
13258 892617 860965 818348 803081 807749 806407 800278 798466 811349 858870 967704 1182301 1448431
13246 1448431 1501821 1408081 1322609 1253249 1156171 973564 789370 689681 633531 584601 543158
13235E43158k1320p473j751m524Q1q338j7443P187J878q456N565J0012J1047K9529
13221E39152L2612j4676k1382m3404j7148K8685K4967j2706m4646q4753l9792
13210C46909J6146j326l6242m0858m9815j7661L774p674j9530j4034k1128N23
13198A59084J647j2535j1016j3997j0414j8649r017p082j5648m38J3744K5761
13186A01440L3645Q417r32P812K3251L3755J9173L653M559m872n36K205l666j3635
13172B14269J49p101k5129L76K274n81j2397k970R470J6273j2098k3551p848p397
13158A43739j5089j8333p110O872m866o555j2998k6430k2038J5113K6162J2988
13146I1455J6175Q302j0885M126J4246q183k9040j3456R00l486R597n525J2616
$$ plain form
13235 543158 521838 514365 512614 508090 508171 499833 482390 489577 491455 482999 488564 498576 509623 539152
13221 539152 571764 557088 535706 492302 475154 503839 528806 516100 471454 386701 346909
13210 346909 363055 361729 325487 284629 234814 217153 220927 213253 193723 179689 158561 159084
13198 159084 160731 148196 137180 123183 112769 94120 85103 78021 62373 61935 75679 101440
13186 101440 135085 143502 142570 150382 173633 207388 226561 230214 234773 229901 229365 231570 227904 214269
13172 214269 214418 207317 182188 182564 184838 184257 171860 168890 178360 194633 182535 158984 151136 143739
13158 143739 128650 110317 103207 110079 105213 98658 85660 59230 37192 52305 78467 91455
13146 91455 107630 115932 105047 109173 123419 115236 86196 72740 73640 70154 79751 74226 86842
13133H6842L4983K9778M308J5768K0119J7494K0780J4272Q474l024K691R578n497
13120B56566j547r701j1746l782Q387o726j9945k689j9686k4296j0984r633j6620
13107A27598j6595k1279j4830n692L439O608Q38J2528J3345M193J261k133o318
13094A02963p992M552M157q430J1502L087k615O601J41m000J923J9946J8790k809
13080A47816p47j721J741J1898J9313N111j2672k401M327K784j6304k2955j7468
13067A18722o570P812O920j5109k7558n026o480j600m189p300j559o768k851Q661
13053E7105J645J2160K0263K967j3367j6971n658q147J0175N591J4289N223r328
13040G5947M675O901j0963J3553J444j4863j9448L964J8588J0155P972m448j4112
$$ plain form
13133 86842 121825 151603 155911 171679 191798 209292 230072 244344 252818 249794 252485 262063 256566
13120 256566 255019 245318 233572 229790 238177 231451 211506 208817 189131 164835 153851 144218 127598
13107 127598 111003 89724 74894 69202 72641 79249 80087 92615 105960 110153 111414 109281 102963
13094 102963 94971 99523 103680 95250 106752 109839 107224 113825 113966 109966 111889 131835 150625 147816
13080 147816 147069 145348 147089 158987 178300 183411 170739 168338 172665 175449 159145 136190 118722
13067 118722 112152 119964 126884 111775 84217 79191 72711 71111 66922 59622 58063 51295 48444 57105
13053 57105 58750 70910 91173 94140 80773 63802 58144 49997 60172 65763 80052 85275 75947
13040 75947 80622 87523 76560 90113 91557 76694 57246 61210 79798 89953 97925 93477 79365
13027G9365p267k0820j0639J2360m417K596N033J4317K142M115k88j2340O542
13014G0699J6818P948K184n139j6411j303O185J5051p584j7749n452O259n346
13001F6160p710Q247J0995O259m671p538k1440j5787M643P068j535L450J9923
12988F8064Q079m270o066n429J2267p05N43p677r293m449o273J3065K685N796
12974F6337j1343r832O802M791m515J2554N785Q451P794j1742n339q666j1418
12961D9659j4034K39l729P440J3648n410p655J610J6487J4458j3377K392J3810
12948G5538R28K358O806P12j61L079O123J9087M95n844L647q280o435k424J8237
12933A13866J2024J9942J5108J0091M455L1811L4682L4983P2561J32295K15152
$$ plain form
13027 79365 72098 51278 40639 52999 48582 51178 56211 70528 72670 76785 76497 64157 70699
13014 70699 87517 95465 97649 92510 76099 74796 80981 96032 88448 70699 65247 71506 66160
13001 66160 58450 66697 77692 83951 79280 71742 50302 34515 39158 46226 44691 48141 68064
12988 68064 76143 71873 65807 60378 72645 71940 72483 64806 55513 51064 44791 57856 60541 66337
12974 66337 54994 45162 51964 56755 52240 64794 70579 79030 86824 75082 69743 61077 49659
12961 49659 35625 35864 32135 39575 53223 47813 40158 41768 58255 72713 59336 61728 75538
12948 75538 76466 78824 85630 86342 86181 89260 95383 114470 114965 109121 112768 104488 98053 95629 113866
12933 113866 125890 145832 160940 171031 175486 207297 241979 276962 349523 481818 696970
12922F96970M17713N60107K83314J4306J2956P3462J28677K10832P0877j96342
12912B272872k47367j95723j86763k89368l55395k80557j71756j11805p0272n1227
12902C12639k6007k1270j8670p704m982j7804k3391j8395j1629l597j7460j1740
12890A29990n025K05O190n828j9751o384j6176n701o885k802o857o086r884Q67
12876D5873n089l531n647n921J2139K0260J2011L17j132l295R550r894j4151n967
12862D5523O56N4O059n680j2123p178k901n598M500Q09Q321K774m018j1527J6200
12847C5871K1346Q31j9015j6440o917k223k245L164K785k413k18k364j2540N939
12833E561N781K321l638k600p837m630Q591P898J2050R112p379K061j245j5361
$$ plain form
12922 696970 1114683 1674790 1958104 1972410 1985366 2058828 2187505 2398337 2469214 2272872
12912 2272872 2025505 1829782 1643019 1353651 998256 717699 545943 434138 363866 312639
12902 312639 286632 265362 246692 238988 234006 216202 192811 174416 162787 159190 141730 129990
12890 129990 124965 125170 131360 125532 105781 99397 83221 77520 70635 67833 60976 54890 45006 45873
12876 45873 40784 37253 31606 25685 37824 58084 70095 70412 69280 65985 75535 65641 51490 45523
12862 45523 46179 46233 52292 46612 34489 27311 24410 18812 23312 24121 32442 35216 31198 19671 35871
12847 35871 57217 58048 39033 22593 15676 13453 11208 14372 17157 14744 14526 12162 -378 5561
12833 5561 11342 13663 10025 7425 -412 -5042 3549 11447 23497 32609 25230 27291 26046 10685
12819A0685M482J1585K12P285Q561j259j2500L577K908j6855q28l468o395P097
12805A5087Q486m710p710r463j2324m886K2452J7328r75r262O901J2282k956m675
12791B5575P53M564m600j708l806k124J5189k531o912o201O286l816j5846M793
12777I616J9772j1749j3420p316J2099l85l947L117R728L626P220K066J277O771
12763C8475j216q676j8234Q002O04p951J1187m468r750o019j1425j67P509J9926
12749A7797R296j6572j4116Q11M474P025Q851j088J4183Q380O178k987p345j4251
12735B0636o306P94O730J5743l148j0583n156J2273J360r954l585P411R618q678
12721B7155n869l392Q740M864k168k688o231O034k663j0303K923M524j3j1807
$$ plain form
12819 10685 15167 26752 26964 34249 42810 41551 29051 32628 35536 18681 17853 14385 7990 15087
12805 15087 23573 18863 11153 1690 -10634 -15520 6932 24260 23285 14023 20924 33206 30250 25575
12791 25575 26328 30892 26292 24584 20778 18654 33843 31312 24400 18199 24485 20669 4823 9616
12777 9616 29388 17639 4219 -3097 9002 8617 4670 7787 17515 21141 28361 30427 31704 38475
12763 38475 37259 28583 10349 18351 18955 11004 22191 17723 7973 1954 -9471 -9638 -2129 17797
12749 17797 27093 10521 -3595 -2784 1690 8715 17566 16478 30661 39041 45219 42232 34887 20636
12735 20636 14330 15124 21854 37597 34449 23866 18710 30983 32343 22389 18804 26215 35833 27155
12721 27155 21286 17894 26634 31498 29330 26642 20411 26445 23782 13479 16402 20926 20913 9106
12707I106l042l223O95j2265m851N541J8222J0175J9K2330K4341J0187k360N182
12693H0057m918J7451J4613j6342j5164j5597j5321o827r8R10j7292R613Q477
12680C9562N902n477n508n209k610q323Q977o359j0606p101L077m76M081J4160
12666B4090L41r905k92L450K2057j6039k168L675m886m453q503M533O060J5684
12652C3644K65l3856j1849J8312K856L586j2018k344J6331n855K240p43p190O762
12638A0141j915L452N798L823l532j4990j9687J0120K0789M434J3059N342m181
12625C2653n367o146q669n911O473j7053k361L897J550N125n78k868J896L196
12611E837m349m67L384Q627l255j196P174j663L300J6718j0694q331N858P118
$$ plain form
12707 9106 6064 2841 3536 -8729 -13580 -8039 10183 20358 20377 42707 67048 77235 74875 80057
12693 80057 75139 92590 107203 90861 75697 60100 44779 37952 37854 38764 21472 31085 39562
12680 39562 45464 39987 34479 29270 26660 18337 27314 20955 10349 3248 6325 5849 9930 24090
12666 24090 24431 14526 14234 17684 39741 23702 21534 25209 20323 15870 7367 11900 17960 33644
12652 33644 33909 53 -11796 6516 9372 12958 940 -1404 14927 9072 11312 10569 3379 10141
12638 10141 8226 11678 17476 21299 17767 2777 -16910 -6790 13999 18433 31492 36834 32653
12625 32653 27286 21140 12471 6560 13033 -4020 -6381 -2484 -934 4191 3613 745 2641 5837
12611 5837 1488 1021 4405 13032 9777 8581 15755 14092 17392 34110 23416 15085 20943 28061
12597B8061L625q855m325P29P374j1563m217n13q868O422k93J129N009J0572j1345
12582A2942q477J6766J306o989l353P220J29Q010j1456n639j1628k074J0039O727
12568A3523L071K656l224K516p870j0858j9194l355J044K3756J8372j1259j247
12555G931j2794j1222o127j000Q173M534J0729j306R49R956J7854J1261J836j0700
12541C0074k7873n687J2032P095P200R170p959n32O219M66o041l148j0925q141
12527A950M132l617P652j733j191p714q99K4733J4665o383j4004j1601j014l188
12513A788k936R585L560O63L51p479l29J0560q84K210Q252J52L52o14L689K845
12497C1765l60r760P314J9476p132j4342k155j0075J388j2252k020R302J2028
$$ plain form
12597 28061 31686 22831 18506 19235 26609 15046 10829 10316 1448 7870 7577 8706 13715 24287 12942
12582 12942 4465 21231 22537 15548 12195 19415 19544 27554 16098 10459 -1169 -3243 6796 13523
12568 13523 16594 19250 16026 18542 10672 -186 -19380 -22735 -21691 2065 20437 9178 7931
12555 7931 -4863 -16085 -22212 -23212 -15039 -10505 224 -1082 -133 9823 27677 38938 40774 30074
12541 30074 2201 -3486 8546 15641 22841 32011 24052 23520 29739 30205 24164 21016 10091 1950
12527 1950 6082 2465 10117 8384 7193 -521 -1420 23313 37978 31595 17591 5990 4976 1788
12513 1788 -1148 8437 11997 12660 13011 5532 5203 15763 14879 17089 25341 25493 25845 25231 28920 31765
12497 31765 31405 21645 28959 48435 41303 26961 24806 14731 16119 3867 1847 11149 23177
12484B3177O47j0869j2361j5457O711J0645J3028p421j0258R441J5713k595N48
12471B0949J915M93j0529q607J2943P564m684j3051o968k685j108N965J0694j833
12457A1058o02K2714o875p107m616J6663K175j6502q412J41O130m145m471p234
12443a083R98k994N640J079j0507p109L074J3216R356j325r981q167L96J832n08
12428f083J422l859o034P399L117j539L726O897L87M669o722O91N054J752p299
12413C578Q4n81j3610K2J571m136K417J8343O8j3417j3879J236J3880J1865j5779
12398h338M781Q918j1277k650N295Q130L30o68J1142n271j2974J6336J0085o212
12384A7627j693R536n830q565O93o349j1345K131K865M169P848J1542O839o737
$$ plain form
12484 23177 23824 12955 594 -14863 -8152 2493 15521 8100 -2158 7283 22996 20401 20949
12471 20949 22864 23357 12828 4221 17164 24728 20044 6993 25 -2660 -3768 2197 12891 11058
12457 11058 10456 33170 26295 19188 14572 31235 33410 16908 8496 8637 14767 10622 6151 -1083
12443 -1083 -85 -3079 2561 3640 -6867 -13976 -10902 2314 11670 10345 364 -7803 -7407 -5575 -6083
12428 -6083 -4661 -8520 -14554 -7155 -4038 -5577 -1851 5046 5433 10102 3380 4071 9125 10877 3578
12413 3578 3662 3081 -10529 -10507 -8936 -13072 -10655 7688 7756 -5661 -19540 -18304 -4424 7441 -8338
12398 -8338 -3557 5361 -5916 -8566 -3271 4859 5189 4521 15663 10392 -2582 13754 23839 17627
12384 17627 15934 25470 19640 11075 11768 5419 -5926 -3795 -930 3239 11087 22629 29468 22731
12370B2731M386l644n659o706j2155j187l629L457j794r008N339L635r057r933
12356b3224R431l80J8646M937l779p094m133J1384n439m389j1519j0017n020J1449
12342a9147R734n19J5791J31m133L758p949j4971J1306J092m002q424P227M108
12328e998l561Q224j715q940R075M785K71o863L836l210k058J9406j4603q262
12314i613J2536J4610L933m959J915q207j3051l603k914O303j575N378n73J742
12300A922J1618J0212K179M08n593J5939p020k2837n046k709j26j0471K334J2153
12286B963k728j6503O326J5854k680l149j079j085q26j0396O411J1517l650r889
12272h914K60j78J194k492r026O375J5842J0064K172j0425L081l190j3399n585
$$ plain form
12370 22731 27117 23473 17814 11108 -1047 -2234 -5863 -2406 -4200 -13208 -7869 -4234 -13291 -23224
12356 -23224 -13793 -14173 4473 9410 5631 -1463 -5596 5788 349 -4040 -15559 -25576 -30596 -19147
12342 -19147 -9413 -9932 5859 5990 1857 5615 -2334 -17305 -5999 -4907 -8909 -17333 -10106 -5998
12328 -5998 -9559 -1335 -3050 -11990 -2915 1870 2141 -4722 -886 -4096 -6154 13252 -1351 -9613
12314 -9613 2923 17533 21466 16507 18422 10215 -2836 -6439 -9353 -3050 -4625 753 180 1922
12300 1922 13540 23752 25931 26339 20746 36685 29665 6828 1782 -927 -1053 -11524 -9190 2963
12286 2963 235 -16268 -9942 5912 3232 83 -996 -2081 -2907 -13303 -6892 4625 975 -8914
12272 -8914 -8654 -8832 -7638 -10130 -19156 -12781 3061 13125 15297 4872 7953 4763 -8636 -14221
12258a4221J8052Q781p216o931l306J1610J9755K431j0345k0419J241P600j2934
12245e902J395l304j0034m554P708J1503M885o866J298J0353J3239l215o169N342
12231A5679j0315r085l651R228M282N364r940j7166P720N196L004J3785j3053
12218A048o327o392R1M868m635r458O0R263Q01P674M357n550O678J4843O658l529
12202B0450n517n856j2380q944J4373N060J1843K670l33j7736q512R286j660j3066
12188a0322O587Q393n79m453k322J7611O205K103p421l926l883K778q170k736
12174a35n681o420K749J9510o302m142J7526O449p657j5730J8556J163j2843q17
12160F226j703j7911P467O645j741q183Q03j299N300p564j1816J7954M485m476
$$ plain form
12258 -14221 3831 12612 5396 -1535 -4841 6769 26524 28955 18610 -1809 -568 7032 -5902
12245 -5902 -4507 -7811 -17845 -22399 -14691 -3188 1697 -5169 -3871 6482 19721 16506 10337 15679
12231 15679 5364 -3721 -7372 1856 6138 11502 1562 -15604 -7884 -2688 316 14101 1048
12218 1048 -5279 -11671 -11580 -6712 -11347 -20805 -20745 -11482 -10681 -3007 1350 -4200 2478 17321 23979 20450
12202 20450 14933 9077 -3303 -12247 2126 7186 19029 21699 21366 3630 -4882 4404 2744 -10322
12188 -10322 -3735 4658 4079 -374 -2696 14915 21120 23223 15802 11876 7993 10771 2601 -135
12174 -135 -5816 -12236 -9487 10023 3721 -421 17105 23554 15897 167 18723 19886 7043 6226
12160 6226 4523 -13388 -5921 724 -1017 -9200 -8397 -9696 -4396 -11960 -23776 -5822 -1337 -5813
12146e813L164M173p411j560j413P846J6968J2261M444j024n88n389j0671Q532
12132B3519k102j7468j7948N916J6621J903j189j0357o614j421O433J1126R757
12119A8176l561K299r65r129r163p378J0519M258j6m540J842p766M901J1427K56
12104A1160n078K126J766K242K0521k402k3894k564J3369n651j2876j2269O77
12091a2873K3297P240m953o834q941n249j934N223K4744R653J1119P19l58k320
12077C8533m709n849p741l210L246q724k930N739J489p594j7117p012m245P185
12063a2939N138J0214J281r119n037M105P16j594M507K360R700p887j2679Q47
12049a0387J2168K547Q973J5948r272j7694O93r894l370J41j25K222q734Q537
$$ plain form
12146 -5813 -2649 1524 -5887 -7447 -8860 -1014 15954 28215 32659 31635 31047 25658 14987 23519
12132 23519 21417 3949 -13999 -8083 8538 10441 9252 -1105 -7719 -9140 -2707 8419 18176
12119 18176 14615 16914 15949 6820 -2343 -9721 798 5056 5040 500 2342 -5424 -523 10904 11160
12104 11160 6082 8208 9974 12216 32737 30335 6441 3877 17246 11595 -1281 -13550 -12873
12091 -12873 10424 17664 12711 5877 -3064 -8313 -10247 -5024 19720 29373 40492 41211 40853 38533
12077 38533 33824 27975 20234 17024 20270 11546 8616 14355 15844 8250 -8867 -15879 -20124 -12939
12063 -12939 -7801 2413 3694 -5425 -10462 -6357 -5641 -7235 -2728 -368 9332 1445 -11234 -10387
12049 -10387 1781 4328 13301 29249 19977 2283 2976 -6918 -10288 -10147 -10272 -8050 -16784 -8247
12035h247J1459r529j3284N918P463Q910k818q958k663r224r89j144j28J1843
12021a1391J5065J0678N93M76n709j423k928j1348l15J1125N533p51L84n86k980
12006F423l111R1J1833J4323m288j8339p409k089Q276n640p919J546L902K74M683
11991B556k066m17k39M595j3745k0183J2389J1215k91k243l828N524M761M85j5009
11976a6496R44J1681l012k573J3436R019L856m607j633N41l755P156j944n223
11962G390J0194j726q534j5969J555J7582k91q730n927m68p538J191R60n46P271
11947c586K0221j9131L470N888n787j1848n902J0167q965j617R406k645P173K015
11933a141n644L493R912k882n520P708N063m099q566K010o78j3113K006K4925
$$ plain form
12035 -8247 3212 -6317 -19601 -13683 -6220 2690 -128 -9086 -11749 -20973 -21962 -23106 -23234 -11391
12021 -11391 3674 14352 14945 15421 9712 8289 5361 -5987 -6302 4823 10356 9605 9989 9403 6423
12006 6423 3312 3403 15236 29559 25271 6932 -477 -2566 5710 70 -7849 -6303 -2401 -2127 2556
11991 2556 490 73 -166 4429 -9316 -29499 -17110 -5895 -6186 -8429 -12257 -6733 -1972 -1487 -16496
11976 -16496 -15552 -3871 -6883 -9456 3980 12999 16855 12248 10615 11156 7401 14557 12613 7390
11962 7390 17584 15858 7324 -8645 -7090 10492 10201 1471 -4456 -4924 -12462 -11271 -10311 -10857 -3586
11947 -3586 16635 -2496 974 6862 1075 -10773 -16675 -6508 -15473 -17090 -7684 -10329 -3156 -1141
11933 -1141 -6785 -3292 6620 3738 -1782 5926 10989 6890 -1676 334 -344 -13457 -11451 13474
11919A3474m945j1122M640j749O41J1325N075j3484j0263P40n344J846j773O622
11905d317J5430q348j354j2588J473P894n281K138N223o355N131Q397O579m220
11891I802j0640j772N726j444O790L292M881k26q034p067m515O812l529O25K393
11876C094j987o26O581o197N235J3334r273m996k0393m802L947N24M846j041L634
11861h120J8155j549J097K843p331n119r678Q21M627P135J1345k75r200k376r448
11846g073R27j0005J911J7023P665q670j365R042L403J5j3429n867J550n027O454
11831c446p187p157J4092J572n555J1088K10o793N508P45l475q446R29J1109N124
11816H318j0630r562O180l766r254K028M327J3480J3092P183j16n736M470k816
$$ plain form
11919 13474 8529 -2593 2047 298 939 12264 17339 3855 -6408 -5668 -11012 -9166 -10939 -4317
11905 -4317 11113 2765 1411 -11177 -9704 -1810 -7091 -4953 270 -6085 -954 7443 14022 9802
11891 9802 -838 -2610 3116 1672 8462 11754 16635 16409 8375 1308 -3207 3605 76 701 3094
11876 3094 1107 481 7062 865 6100 19434 10161 5165 -15228 -20030 -16083 -15559 -10713 -11754 -8120
11861 -8120 10035 8486 9583 12426 5095 -24 -9702 -8881 -4254 2881 14226 13951 4751 2375 -7073
11846 -7073 -6146 -16151 -14240 2783 10448 1778 413 9455 12858 12873 -556 -6423 -4873 -9900 -3446
11831 -3446 -10633 -17790 -3698 -2126 -7681 3407 3617 -3176 2332 3077 -398 -8844 -7915 3194 8318
11816 8318 -2312 -11874 -5694 -9460 -18714 -16686 -12359 1121 14213 21396 21280 15544 20014 17198
11802A7198J034l1493q915N909J1412m007n466J0394P885r675l982m580j8885
11789c3171J5250J3159j7383P209Q951J2047p66M187J0125l857l695j5003k374
11776e321N841P815O055n969j0009P439l369l249L869Q726N854j242J0065K368
11762B8873p730j9251r826M441L691p160L394J0723m585l489l424r496j6864j4383
11748d5086Q664K7660J125j0167q477K2242O089M459K638Q23M186j639j2601J704
11734A620J3251j4311j621Q525n314j695R55J740K889J0332L873j0555o543P271
11720A0417j2368k0563q621J2222K9294O423j2247N839q849r551p370l391Q666
11707a0099J992k250O622K788j4387j534R458l722j4733Q100M020K870m063P380
$$ plain form
11802 17198 18232 -13261 -22176 -16267 -4855 -8862 -14328 -3934 3951 -5724 -9706 -14286 -33171
11789 -33171 -17921 -4762 -22145 -14936 -5985 6062 5296 9483 19608 15751 12056 -2947 -5321
11776 -5321 520 8335 14390 8421 -1588 5851 2482 -767 3102 11828 17682 16440 26505 28873
11762 28873 21143 1892 -7934 -3493 198 -6962 -3568 7155 2570 -919 -4343 -13839 -30703 -45086
11748 -45086 -36422 -8762 -7637 -17804 -26281 -4039 2050 6509 9147 9970 14156 12517 -84 1620
11734 1620 14871 560 -1061 7464 2150 455 1410 3150 6039 16371 20244 9689 3146 10417
11720 10417 -1951 -22514 -31135 -18913 10381 16804 4557 10396 1547 -8004 -15374 -18765 -10099
11707 -10099 -8107 -10357 -3735 -947 -15334 -16868 -7410 -11132 -25865 -17765 -13745 -10875 -14938 -7558
11693g558Q367J66l744j2528J548J7002P656r206j2639K45o574P288N697N568
11679A288N155J2554n94o646l604L060k599Q260J099j4278j1070p639J803J137
11665a2074j845m329o195k430O571O017Q749k05j5030O294K2448j056j0466j950
11651e501k910p017m219j157N826M454M273J3447o686p060N213L836n293o040
11637h834j168N800j566l276q174N77K750J1487M05j110j0211K967K084K826J3593
11622H150P395K878j057J378p964j1161L88q568L521R497m611r475l197j722o641
11607b1189J1335J3465l349P089N819N468p09P879K3806m080r616r13p561j338
11593B6106J428j4844n267J312N284M344P694J0807n125l834p960K775p617n512
$$ plain form
11693 -7558 809 975 -2769 -15297 -13749 3253 10909 1703 -10936 -10691 -17265 -9977 -4280 1288
11679 1288 6443 18997 18403 11757 8153 11213 8614 16874 17973 3695 -7375 -15014 -13211 -12074
11665 -12074 -13919 -18248 -24443 -26873 -20302 -14285 -5536 -5741 -20771 -14477 7971 6915 -3551 -5501
11651 -5501 -8411 -15428 -19647 -20804 -14978 -10524 -6251 7196 510 -6550 -1337 2499 -2794 -8834
11637 -8834 -10002 -4202 -5768 -9044 -17218 -16641 -13891 -2404 -1999 -3109 -13320 -10353 -8269 -5443 8150
11622 8150 15545 18423 17366 18744 10780 -381 7 -8561 -5040 4457 -154 -9629 -12826 -14548 -21189
11607 -21189 -9854 3611 262 7351 13170 18638 17929 25808 49614 45534 35918 35005 27444 26106
11593 26106 27534 12690 7423 8735 14019 18363 26057 36864 31739 27905 19945 22720 15103 9591
11579I591q254P056L208M106P743J902n770q429j621L461r548n43R059k480M062
11564A3543L377o036m516j042k747j656J3000p295l242r366j9129M214J9880M568
11550C553L826Q006j3124j3705q313J3191J3125R253Q317l583P67J076n664o560
11536A0165J738M028M507O459j3438j3208p346j0126n424p335K500J8956Q270
11523b54j0845j1278N175N542m52P870N833O973K976r99O824m065p921j989Q988
11508A2378r712o927P844p896J405r221Q80J1995M81N291J7379K67l459j2020
11494H685J600O761K992j0354j2646L04Q478j3044l169J814R153L595o247m219
11480f297M19j122P942M425o264j4922r37R98P582k222P697Q238m901o06j904
$$ plain form
11579 9591 1337 8393 11601 15707 23450 25352 19582 11153 9532 12993 3445 2902 11961 9481 13543
11564 13543 16920 10884 6368 5326 2579 923 13923 6628 3386 -5980 -25109 -20895 -1015 3553
11550 3553 7379 15385 2261 -11444 -19757 -6566 6559 15812 24129 20546 21313 22389 16725 10165
11536 10165 11903 15931 20438 26897 13459 251 -7095 -17221 -22645 -29980 -27480 -8524 -254
11523 -254 -11099 -22377 -17202 -11660 -12112 -4242 1591 8564 11540 10541 17365 13300 5379 3390 12378
11508 12378 2666 -4261 3583 -4313 -2908 -12129 -11249 746 1227 6518 23897 24164 20705 8685
11494 8685 10285 17046 20038 9684 -2962 -2658 5820 -7224 -10393 -8579 574 4169 -2078 -6297
11480 -6297 -5878 -7000 942 5367 -897 -15819 -16756 -15758 -8176 -10398 -2701 5537 636 30 -1874
11465a874K841k763j0806R8K3918J3939M41m77K684l362r564j4235R03J3911R435
11450B5089Q119Q982M710p085J830m980j1777j7594m701Q26J5185J3341j1986
11437A9959j3823l551l619M030l514p787k698P964J3205n792K197j4966o489P40
11423a4144M622P595j665m490l463J4587K239p855N459R124J715N355j0148j4668
11409e737N432K860p481j2396r15J0219J5909l279l213P992N141n919k126K851
11395I338R84j346K538L951k4560j7721K457M553j360p19j089J6017R497J3252
11381A5792O554j6359k612P905j077O820P21J328N360j2550p400k198j666m967
11367d349K111o313J085N328J0407M662J4962Q340j5469j4306L045O881j499n710
$$ plain form
11465 -1874 967 -1796 -12602 -12504 11414 25353 25794 25317 28001 24639 15075 840 1743 15654 25089
11450 25089 33208 42190 46900 39815 41645 36665 24888 7294 2593 3419 18604 31945 19959
11437 19959 6136 2585 -1034 2996 -518 -8305 -11003 -3039 10166 4374 6571 -8395 -14884 -14144
11423 -14144 -9522 -1927 -3592 -8082 -11545 3042 5281 -2574 2885 12009 13724 19079 8931 -5737
11409 -5737 -305 2555 -4926 -17322 -18237 -8018 7891 4612 1399 9391 14532 8613 6487 9338
11395 9338 10322 8976 11514 15465 -9095 -26816 -24359 -19806 -21166 -21885 -22974 -6957 2540 15792
11381 15792 22346 5987 3375 11280 10203 17023 17744 19072 24432 11882 4482 2284 618 -4349
11367 -4349 -2238 -8551 -7466 -2138 8269 12931 27893 36233 20764 6458 9503 16384 14885 9175
11353I175j220k221l08Q869K54L228J086J044N116n264k4216q878N341J1294j994
11338A306k622K556p28J103O82M73O549j0605j3625P604J12p602j517M997M681
11323f636K391J2588K403m143p647Q95L683j1237j1696N299O796j405l0J1124
11309B385L525k688k385P44l371o191j79K855r508P277o37Q761K622J992j3091
11294g889P854M460j0851N456J1724L745l988p208k711J4760n036j7797L391J3543
11280I453m184J54q675q728o986k891K165M216Q589J1125M175j3950r403J463
11266a3477M108n700R499R166m889j2272M25J2342J0712k662j644L12o264j072
11252a416N40O080N69j1366l113K855R259k608Q803J0799Q966q172j5074j2013
$$ plain form
11353 9175 7955 5734 5426 14295 14549 17777 18863 19907 25023 19759 -4457 -13335 -7994 3300 1306
11338 1306 -1316 1240 512 1615 2297 2770 9319 -1286 -14911 -7307 -7195 -14797 -16314 -11317 -6636
11323 -6636 -4245 8343 10746 6603 -1044 -149 3534 -7703 -19399 -14100 -7304 -8709 -8739 2385
11309 2385 5910 3222 837 1581 -1790 -7981 -8160 -5305 -14813 -7536 -8173 588 3210 5202 -7889
11294 -7889 -35 4425 -6426 -970 10754 14499 10511 3303 592 15352 10316 -7481 -4090 9453
11280 9453 5269 5423 -3252 -11980 -18966 -21857 -19692 -15476 -6887 4238 8413 -5537 -14940 -13477
11266 -13477 -9369 -15069 -5570 3596 -1293 -13565 -13140 -798 9914 7252 5608 5920 -344 -1416
11252 -1416 -876 5204 5773 -5593 -8706 -5851 3408 800 9603 20402 29368 21196 6122 -5891
11238e891R03M138M105J047p160j86p260J806J2696p544j711P95O002j0145j1705
11223b0110p019r951K3949K5681m308q847n612J0404R297M233l547k5494K062
11210i262R8r086j557P917n253j903L473J0546j474l512l985P599l433P15Q344
11195g73L320N770k89J0613l77k783r45O436j54j567j7130q654L558m62R671m676
11179A558j0809j1629n609L686R905J0259J874l794R88O713j658j2068O93J2577
11165B686N215J534n685r192p77n321P338L546Q62m356o468L897J2282k689J325
11150D197N662j2858P79K300l720L952J1405J0866r619o668j030O059j660k7555
11136a7890p202J0267O607R440O20m2P583l916n203j3033M580J3404k031N512
$$ plain form
11238 -5891 -4988 -850 3255 4302 -2858 -3044 -10304 -8498 4198 -3346 -5057 -4262 1740 -8405 -20110
11223 -20110 -27129 -37080 -13131 12550 8242 -605 -6217 4187 13484 17717 14170 -11324 -9262
11210 -9262 -9164 -18250 -19807 -11890 -17143 -19046 -15573 -5027 -6501 -10013 -13998 -6399 -9832 -9117 -773
11195 -773 2547 8317 8028 18641 18264 15481 14536 20972 20818 19251 2121 -6533 -2975 -3437 6234 1558
11179 1558 -9251 -20880 -26489 -22803 -12898 -2639 -765 -4559 -3571 3142 1484 -10584 -9891 2686
11165 2686 7901 9435 3750 -5442 -6219 -11540 -4202 -656 206 -4150 -10618 -6721 5561 2872 4197
11150 4197 9859 -2999 -2220 80 -3640 312 11717 22583 12964 6296 5266 11325 9665 -17890
11136 -17890 -25092 -14825 -8218 1222 1842 1800 9383 5467 264 -12769 -8189 5215 3184 8696
11122H696J396o939j537L023o088m653j4596j2806K352k812J022L676J0249J7079
11108a938q462j8761R949M174n250j795J4527M05j8201q072Q749N100J0008O142
11094c425L245R133O712p079p771M052q821O929J729l921n487j5415j7183J5395
11080b1907J5725O995R35j5748j040j914J4426M766k729o376K247L7q524Q535
11066d572L372p728q416k061M335J6186O416J6874J6304J8337K2485J1332k2026
11053G0838j1771K990j3633n50q849K927M870p255j1936j0488m293J1852k081
11040B2621j0701M559p411m565p087m125j315J892K288j401k159M596j1855n126
11026a9789K4586P214Q840J1754r578q623j0074j3399j4515j3263Q609J1019J959
$$ plain form
11122 8696 10092 3153 1616 4639 -1449 -6102 -20698 -33504 -31152 -33964 -32942 -29266 -19017 -1938
11108 -1938 -10400 -29161 -19212 -15038 -20288 -22083 -7556 -7151 -25352 -33424 -24675 -19575 -9567 -3425
11094 -3425 -180 8953 15665 8586 815 4867 -3954 2975 4704 783 -4704 -20119 -37302 -21907
11080 -21907 -6182 813 1748 -14000 -15040 -16954 -2528 2238 -491 -6867 -4620 -4583 -13107 -4572
11066 -4572 -1200 -8928 -17344 -19405 -15070 1116 7532 24406 40710 59047 81532 92864 70838
11053 70838 59067 62057 48424 47874 39025 41952 46822 39567 27631 17143 12850 24702 22621
11040 22621 11920 16479 9068 4503 -2584 -6709 -8024 -6132 -3844 -5245 -7404 -2808 -14663 -19789
11026 -19789 4797 12011 20851 32605 23027 14404 4330 -9069 -23584 -36847 -28238 -17219 -15260
11013a5260L791J760J704P580j337L711k980k5402q077J0026O740Q774N508J044
10999b418p963m276l854j0311J1933J9560J3154l066j0180j414p107O351q92j1389
10985a1872N949J3781P649j8134j699J518j1854n548L68J1127J7323l751r229
10972d372r158J2427J7611m642k8298q693Q186K462j7P961J0706J415M932j936
10958H584n293N199l910Q926o661k351J033M471j2488o162P743O230M452r271
10944E02k024j0806n240l558J0205J1493N625j604r98J1587j478J4673K39p877
10930B0739j2156N258o485o889q284l342O529m872L41N298J745L213l782J525
10916a162N774r077K017K007K614k876j5721j346j3986k660L0169R908K601P972
$$ plain form
11013 -15260 -11469 -9709 -8005 -425 -1762 1949 -1031 -26433 -34510 -24484 -17744 -8970 -3462 -2418
10999 -2418 -10381 -14657 -18511 -28822 -16889 2671 15825 12759 2579 1165 -5942 409 -483 -11872
10985 -11872 -5923 7858 15507 -2627 -4326 -2808 -14662 -20210 -19842 -8715 8608 4857 -4372
10972 -4372 -13530 -1103 16508 11866 -16432 -25125 -16939 -14477 -14494 -6533 4173 5588 10520 8584
10958 8584 3291 8490 4580 13506 6845 4494 5527 9998 -2490 -8652 -909 5321 9773 502
10944 502 -1522 -12328 -17568 -21126 -10921 572 6197 4593 3595 15182 13704 28377 28616 20739
10930 20739 8583 13841 7356 467 -7817 -11159 -4630 -9502 -9161 -3863 -2118 1095 -2687 -1162
10916 -1162 4612 -4465 -2448 -441 2173 -703 -16424 -17770 -31756 -34416 -4247 5661 8262 16234
10902A6234k154m480J655j0870r739J8591Q207J135q927j3251J3400n677n082
10889i58q3l011J521p863r230J58N434J385J2386O250O665Q715q032n900j411
10874F026J2488q994J793o033j5243N301R621M656j6122n268K0471O875j8442
10861b871q383M716p107K321K698k333J786l713n976R239R592j442p97o038J2537
10846D229J8868j18l637r210j1598j616k448o062N410L929M227K408k012K473
10832D843J493o828q611J2720L437j5061l862M780K0271J1218j0203j5210o126
10819g139l698L345K325j534n404N681m513L545J3920o621n236J4061l64M385
10805A2753O013q160K026N22p037l658j1443K913P585N984n321r392P757Q783
$$ plain form
10902 16234 14080 9600 11255 385 -9354 9237 17444 18579 9652 -3599 9801 4124 -958
10889 -958 -1041 -4052 -2531 -10394 -19624 -19466 -14032 -12647 -261 5989 12654 21369 13337 7437 6026
10874 6026 18514 9520 11313 5280 -9963 -4662 4959 9615 -6507 -11775 8696 15571 -2871
10861 -2871 -11254 -6538 -13645 -11324 -8626 -10959 -9173 -12886 -18862 -9623 -31 -1473 -2270 -8308 4229
10846 4229 23097 22979 19342 10132 -1466 -3082 -5530 -11592 -6182 -2253 1974 4382 2370 4843
10832 4843 6336 -492 -9103 3617 7054 -8007 -11869 -7089 13182 24400 14197 -1013 -7139
10819 -7139 -10837 -7492 -5167 -6701 -12105 -6424 -10937 -7392 6528 -93 -5329 8732 8368 12753
10805 12753 18766 10606 12632 13154 6117 2459 -8984 -6071 1514 7498 2177 -7215 542 9325
10791I325j7864j690j805J879P379J4302R454P04k2638m180J1997j069k1127P883
10777g450Q116J1626M866p983j9202k236J802m817K44J7917P491P90l65j2130
10763a331k467j894j1656j704m646N797Q971n128K981J6136m061n996J6853q296
10749C559j6825K327L143K77N785L42Q921k84n543o560O260M474m265j0217k632
10734a1238P842J0629o178j3386m756j2206J324o512j966R233J5616n94o85j417
10720a4294L513Q855L653j953q281P9j2194P490K0616N992p781j1309j1180m309
10706b1103J333O589P877p540k530J9781N141k885N438j685J0841M691p581l008
10692A5359j7551L284j4421k848N274N510N461O886m239r106k55j1361N728J1060
$$ plain form
10791 9325 -8539 -10229 -12034 -10155 -2776 11526 20980 21684 -954 -5134 6863 5794 -15333 -7450
10777 -7450 666 12292 17158 9175 -10027 -12263 -10461 -15278 -15034 2883 10374 11164 10799 -1331
10763 -1331 -3798 -5692 -17348 -19052 -23698 -17901 -8930 -14058 -11077 5059 998 -4998 11855 3559
10749 3559 -13266 -10939 -7796 -7519 -1734 -1392 7529 7245 1702 -4858 1402 5876 1611 -8606 -11238
10734 -11238 -3396 7233 1055 -12331 -17087 -29293 -27969 -34481 -36447 -27214 -11598 -12192 -12877 -14294
10720 -14294 -10781 -1926 1727 -226 -8507 -8428 -20622 -13132 7484 13476 5695 -5614 -16794 -21103
10706 -21103 -19770 -13181 -5304 -12844 -15374 4407 9548 6663 12101 10416 21257 25948 18367 15359
10692 15359 -2192 1092 -13329 -16177 -10903 -5393 68 6954 2715 -6391 -6646 -18007 -12279 -1219
10678a219k088m68o546o956L802N977R32K250P130k071k432r38J130L786q198
10663e909o79Q157L350p732J399j8644n328R578J3680J7257M844o579K710j278
10649A4826j0858q694J1618Q451j99p409q345j7332j083J1452K0236k101r244
10636A318j5732j1394O242J6146P633M103o720j2324k069n797J0664J3647l608
10623B109N532M814J89o399K754k805N465J2001l129j1047p110l891l291o688
10609a1496K335j085K237j1574J744K873J4370J3352q054m56K155J1935K764j9701
10595A399j6264j3186k280M790J7367N903J2174j432j56J4005k12J471j7118j1748
10581e287J3900P819q312M860k818R312m817O34p167O145r23l406L87R547J6473
$$ plain form
10678 -1219 -3307 -3775 -10321 -17277 -13475 -7498 -6566 -4316 2814 743 -1689 -2627 -1497 2289 -5909
10663 -5909 -6588 1569 4919 -2813 -1414 -20058 -25386 -15808 -2128 15129 19973 13394 16104 14826
10649 14826 3968 -4726 6892 15343 15144 7735 -610 -17942 -19025 -7573 12663 10562 1318
10636 1318 -14414 -25808 -19566 -3420 4213 8316 1596 -10728 -12797 -18594 -7930 5717 2109
10623 2109 7641 12455 12644 6245 8999 6194 11659 23660 20531 9484 2374 -1517 -4808 -11496
10609 -11496 -9161 -10246 -8009 -19583 -17839 -14966 -596 12756 4702 4246 6401 18336 21100 1399
10595 1399 -14865 -28051 -30331 -25541 -8174 -2271 9903 8471 8315 22320 22108 23579 6461 -5287
10581 -5287 8613 16432 8120 12980 10162 19474 14657 15291 8124 14269 13346 9940 10327 19874 36347
10566C6347n71l268M0q420J988J6935J2787J5239K6001P820j4725P308L2296M1723
10552A71500O8016R7893J28968J42606J65156J39645J20079J14298P0430K7133
10542A245724j6035m8404q4551j12598j32972j51493j42854j31090r8764p1909
10532B55054n6122k0521j8120j2955k2522m140j8100k1766m347j6542m036r426
10520D6457n338L93o024k333l72M766L476K236o04p299j9879n703J878p643P536
10505A1547m072J793j185Q623j892O496m969M212p872r161o216J491J1156M470
10491A4421Q427L210n436k469r556r107J1273O238M27J807J994P084r297q258
10477A0758K245J0102J3805l710l879J6801J4352J4522K2513O0554R0922J46870
$$ plain form
10566 36347 35776 32508 32548 24128 26116 43051 55838 71077 97078 104898 90173 97481 129777 171500
10552 171500 239516 337409 466377 608983 774139 913784 1033863 1148161 1218591 1245724
10542 1245724 1229689 1181285 1096734 984136 851164 699671 556817 425727 326963 255054
10532 255054 198932 178411 160291 147336 124814 120674 102574 80808 76461 59919 55883 46457
10520 46457 41119 41512 35488 33155 32783 37549 41025 43261 42657 35358 15479 9776 11654 4011 11547
10505 11547 7475 9268 8083 16706 14814 21310 16341 20553 12681 3520 -2696 -1205 9951 14421
10491 14421 22848 26058 20622 18153 8597 -510 10763 17001 17428 19235 21229 28313 19016 10758
10477 10758 13003 23105 36910 33200 29321 46122 60474 74996 97509 158063 248985 395855
10465C95855J45491M3024j2341n895j4745j1707n177M4749P7026n048n9240l4899
10453E57093l4728p4135j13775r7082n8903m4229k3758j813j0425j9469m896j5376
10441E8504r183N497m531j0398k312k340l438j1011K712J2223N439p056j0583
10428B3523n657p96P63L027J597L125j7707J6368j74r943j368r389L214J5719
10414B2302K603M610o185j8133p139p057L504P132N304j546m305r842J857J071
10400e824N54M223l187M653L381j1227r089J3198N400L460j1451j750P112q837
10386i384M950K0183O45j875J945l655o331l652K632j167R200j7804l990n838
10372a4141K464N087J1946J389o958q084Q909J3745L82n629j0845j724m996L682
$$ plain form
10465 395855 541346 584370 572029 566134 551389 539682 534505 579254 656280 651232 591992 557093
10453 557093 522365 448230 334455 237373 178470 134241 110483 108670 98245 78776 73880 58504
10441 58504 49321 54818 50287 39889 37577 35237 31799 20788 23500 35723 41162 34106 23523
10428 23523 17866 17070 17833 20860 22457 25582 7875 24243 24069 14126 12758 3369 6583 22302
10414 22302 24905 29515 23330 5197 -1942 -8999 -5495 1637 6941 5395 1090 -8752 -6895 -5824
10400 -5824 -5270 -1047 -4234 419 3800 -7427 -16516 -3318 2082 5542 -5909 -7659 -547 -9384
10386 -9384 -4434 15749 16394 14519 16464 12809 6478 2826 5458 4291 13491 -4313 -8303 -14141
10372 -14141 -11677 -6590 5356 6745 -213 -8297 612 14357 14739 9110 -1735 -3459 -8455 -4773
10358d773M444N452k777R412k132o453j489J1855M184j3198o27J234q150m248
10344g266J2018L17N755L156o408K018R480j351r610p452j1344N546J9238r31
10330A3166K233k0099j0541J353P474L693N80L187P680J3873M79l614j2108j6373
10316i017l046J7834J4465p502j4471k236M030R355M811r500m292M888R331r079
10302E571j1182j2553Q937Q129m904m802J154M021Q117n46m765j836J3261j364
10288G238K535r783O290J3080P970p67j2040n230R255o962k0995j4484N818q368
10274b6443J05J4409J2394K436l688J4897L47L615p334o451K766r505K049k588
10260b991j2825j0906L237J383R737J1486J340j1017j276k66Q50J3617J5875L410
$$ plain form
10358 -4773 -329 5123 2346 11758 9626 3173 1684 13539 17723 4525 3898 5132 -3018 -7266
10344 -7266 4752 5069 10824 13980 7572 9590 19070 17719 8109 657 -10687 -5141 14097 13166
10330 13166 15399 -4700 -15241 -13888 -6414 -2721 -2141 1046 8726 22599 23078 19464 7356 -9017
10316 -9017 -12063 5771 20236 12734 -1737 -3973 57 9412 14223 4723 431 5319 14650 5571
10302 5571 -5611 -18164 -9227 -1098 -6002 -10804 -9650 -5629 2488 1942 -2823 -4659 8602 7238
10288 7238 9773 -10 6280 19360 27330 26563 14523 9293 18548 11586 -9409 -23893 -18075 -26443
10274 -26443 -26338 -11929 465 2901 -787 14110 14457 18072 10738 4287 7053 -2452 -403 -2991
10260 -2991 -15816 -26722 -23485 -22102 -12365 -879 461 -10556 -11832 -12098 -11248 2369 18244 21654
10246B1654k661l403l14n016j4741q015n361N915M210L678l015l98k94K92l743
10231a1212n74M691j662o494K675K362r167J3035J3908n572m412l534j505q853
10217a6314q504J1518J3669j246P124Q930K912j4208q324j4780Q465J1631M077
10204D950j5251j7442j0591P711J233O383J0768R319R23l368j6705j5035J5940
10191b1165N517M708l39j1863p293J2471J3832j4291n857n474j064R983J8157
10178b678M93L200P127K90p09j6024j2834l795R9Q404n047N423L631O645M919
10163h56k933p031N12M648l303R569N3o907L549J3811n720Q62j194p295J3984
10148A1749k93l337k499J152p22p075O173j1413j5524J1310p687j122R49L736
$$ plain form
10246 21654 18993 15590 15276 10260 -4481 -12496 -17857 -11942 -7732 -4054 -7069 -7467 -7761 -7469 -11212
10231 -11212 -11786 -7095 -8757 -15251 -12576 -10214 -19381 -6346 7562 1990 -2422 -5956 -7461 -16314
10217 -16314 -24818 -13300 369 -877 6247 15177 18089 3881 -4443 -19223 -10758 873 4950
10204 4950 -10301 -27743 -38334 -30623 -29390 -23007 -12239 -2920 -1997 -5365 -22070 -37105 -21165
10191 -21165 -15648 -10940 -11279 -23142 -30435 -17964 -4132 -18423 -24280 -29754 -30818 -20835 -2678
10178 -2678 -2185 1015 8142 8432 7723 -8301 -21135 -24930 -24831 -16427 -21474 -16051 -12420 -5775 -856
10163 -856 -3789 -10820 -10308 -5660 -8963 606 659 -6248 -2699 11112 5392 6254 5060 -2235 11749
10148 11749 11456 8119 5620 6772 6050 -1025 5148 -6265 -21789 -10479 -18166 -19288 -18339 -14603
10134a4603L1123q339j2847J171J5503K363j1090L365M92j1915o795N798O141
10121C67Q012M536j3831j128J3847J0703q04k7345j2706Q502n739m838j4813K956
10107c2281J2346P071j1301L225P233J86J4481m469j3385K139K35J7688L099m476
10093A791k0405O063J1590L903P266o660m921N286J809J201k82N90o864P272R138
10078A6777o316p433K021k755J205j1749m510J954O174k781J0676J4624q270k3353
10064a3736J505J1945J796l294J4347Q985k460q63q563m304N418O443J1426p037
10050B1608n020j1393o26K0199j1184q115K479l175R950N329j3514j3812q800
10037a6074L296R887P682J0699L31L35o979J1219n86k1660p094J1182o12j5455
$$ plain form
10134 -14603 16520 8181 -4666 -3495 12008 14371 3281 6646 7138 -4777 -11572 -5774 367
10121 367 8379 12915 -916 -2044 11803 22506 21702 -5643 -18349 -9847 -15586 -20424 -35237 -32281
10107 -32281 -19935 -12864 -24165 -20940 -13707 -13521 960 -3509 -16894 -14755 -14520 3168 6267 1791
10093 1791 -18614 -12551 -961 2942 10208 3548 -1373 3913 5722 6923 6641 7231 367 7639 16777
10078 16777 10461 3028 5049 2294 3499 -8250 -12760 -10806 -4632 -7413 3263 17887 9617 -13736
10064 -13736 -12231 -286 1510 -1784 12563 21548 19088 18225 9662 5358 10776 17219 28645 21608
10050 21608 16588 5195 4569 24768 13584 5469 7948 4773 14723 20052 6538 -7274 -16074
10037 -16074 -12778 -2891 4791 15490 15821 16156 9177 20396 19810 -1850 -8944 2238 1626 -13829
10023a3829j2550J1647M381L167J551N355j400Q911j966J650m292Q9R300j3416
10009a402k483m983m345R499Q349p848L423j2569j9681J5905J2401j297l73j4778
9995b0182m149R546J8925o674O10R890j205p672j4326j198J648J4602O781J1171
9981A7767J550l886n54K406m329P83q746J5431J6830j2014l008j060L085p853
9967A6402m537o251q713o475J0600J3381j0445m685N445O678l407J748o927j4966
9953a2152m10J2177K306l183j2748K643k876j963q67J7092K2861k0869r194J4481
9939G298L485J978o526j0429N538p72r105M833J5275J1817j7716l920J668j0008
9925f584Q397P419K29O445j2490o935J1857o660N923J0793Q197n608j7752l056
$$ plain form
10023 -13829 -26379 -14732 -10351 -7184 -5633 -278 -1678 7233 5267 6917 2625 2714 12014 -1402
10009 -1402 -3885 -8868 -13213 -3714 4635 -3213 210 -12359 -32040 -16135 -3734 -5031 -5404 -20182
9995 -20182 -24331 -14785 4140 -2534 -1924 7966 6761 -911 -15237 -16435 -14787 -185 6596 17767
9981 17767 19317 15431 14877 17283 12954 13737 4991 20422 37252 25238 22230 21170 24255 16402
9967 16402 11865 5614 -3099 -9574 1026 14407 3962 -723 4722 11400 7993 9741 2814 -12152
9953 -12152 -12562 -385 1921 -1262 -14010 -11367 -14243 -16206 -17073 19 22880 2011 -7183 7298
9939 7298 10783 12761 6235 -4194 1344 572 -8533 -3700 11575 23392 5676 1756 3424 -6584
9925 -6584 1813 9232 9461 15906 3416 -3519 8338 1678 7601 18394 26591 20983 3231 175
9911A75j4247n311J5825J6446L043O127j2573k0217K412r221n150j255J30J0744
9897a3072J2002m264J1157R160r686q243m502l023j837J188J998k830J557K857
9883g538P028j1437m880k915M75R008Q192j247m717K519j125M316K3859Q469r113
9868B0894p43L627N830o594J29j0607j0072n997p673J035j098Q878Q943N74M612
9853A1738q1q523J479R484j106j0743j6967j1298o626J3613R699l329N94M484
9839g582j1490p95M383P385M562k222j2190K717N566J1049L454q49j0310P381
9825A059J705j0680l50n043J0924k036p618P273K4841J1265k1603q362M407K792
9811H574j0864m981J619N599N66q791j004j157M453k0143N015J3049O070K009
$$ plain form
9911 175 -14072 -19383 -3558 12888 15931 22058 9485 -10732 -8320 -17541 -22691 -23946 -23816 -13072
9897 -13072 -1070 -5334 5823 14983 5297 -2946 -7448 -10471 -12308 -11120 -9122 -11952 -10395 -7538
9883 -7538 -510 -11947 -16827 -19742 -19267 -10259 -2067 -3314 -8031 -5512 -6637 -2321 21538 30007 20894
9868 20894 20151 23778 29608 23014 23143 12536 2464 -3533 -11206 -10171 -11269 -2391 6552 7126 11738
9853 11738 11657 3134 4613 14097 12991 2248 -14719 -26017 -32643 -19030 -9331 -12660 -12066 -7582
9839 -7582 -19072 -19867 -15484 -8099 -3537 -5759 -17949 -15232 -9666 1383 4837 3988 -6322 1059
9825 1059 2764 -7916 -8266 -13309 -2385 -4421 -12039 -4766 20075 31340 9737 1375 5782 8574
9811 8574 -2290 -7271 -5652 -53 513 -8278 -9282 -10439 -5986 -26129 -21114 -8065 -1995 14
9797A4L293j1064p197P730J042o755l085q8L639J4366N696Q862j1202o674j0407
9782a1830j1692j618k206O204j762L487L371J3632Q218j753j4242j4468L778l350
9768b4231o813M201N425k684P365R934P610J2582j4744j3201J7635L921J4455
9755B1455J7355k336j8382j1898q870j151r642k904O289j7126j772J3213R623
9742f146P478J5786J256m934J716O325J702r070k3372K333N0p251j15q208m434
9727b6884j484J9655J6916J0964j356k467Q157M46m852n803l845k300N704k224
9713A0627R31j6443j246k515L057P661L543q105R069N118j1853m36n82J4865J1763
9698B5454m930j3342J20P63m964r975l891J7477R157O288j2643m887m712j313
$$ plain form
9797 14 3307 -7757 -14954 -7224 -6182 -12937 -16022 -16110 -12471 1895 7591 16453 5251 -1423 -11830
9782 -11830 -23522 -25140 -27346 -21142 -22904 -19417 -16046 -2414 5804 4051 -10191 -24659 -20881 -24231
9768 -24231 -31044 -26843 -21418 -24102 -16737 -6803 807 13389 -1355 -14556 3079 7000 21455
9755 21455 38810 36474 18092 6194 -2676 -3827 -13469 -16373 -10084 -27210 -28982 -15769 -6146
9742 -6146 1332 17118 18374 13440 15156 21481 23183 14113 -9259 -6926 -6876 -14127 -14242 -22450 -26884
9727 -26884 -28368 -8713 8203 19167 17811 15344 23501 23947 19095 13292 9447 7147 12851 10627
9713 10627 11558 -4885 -6131 -8646 -5589 2072 5615 -2490 6579 11697 -156 -592 -1174 13691 25454
9698 25454 20524 7182 7302 8065 3101 -6874 -10765 6712 15869 22157 9514 4627 -85 -1398
9684a398j522j2414j0028J2966J4194l601j1926L236K4330K038j4637m539m747
9671h048j2892m015N67L57r077J423M624l302M341K1135J0859K747L920o457J3947
9656B0129N431k685j810J591n967p514L504j264l032p769j4602N21l78p792M218
9641a7419Q59J3396K841j6246P005L646O732j3534n458P5K043R006M202J753R11
9626a88Q925L931k019l22N650M659q133j0367j6929P565Q253l235P641M84j3666
9611g751l641l49R758n037Q534P883L149j2856j3676L745J0071R432Q454R605
9597B7321o568k2517L129J6300k269m194N88j419r832k712n797k289n347O439
9583i167P718P611j1980n162O631r752O798R184j436j2178R68J4697q15n984j1705
$$ plain form
9684 -1398 -2920 -15334 -25362 -12396 1798 -1803 -13729 -10493 13837 15875 1238 -3301 -8048
9671 -8048 -20940 -24955 -24388 -24031 -33108 -31685 -27061 -30363 -26022 -4887 5972 8719 12639 6182 20129
9656 20129 25560 22875 21065 22656 16689 9175 12679 11415 8383 614 -13988 -13467 -13845 -21637 -17419
9641 -17419 -16560 -3164 -323 -16569 -9564 -5918 814 -12720 -18178 -18103 -16060 -7054 -2852 -1099 -188
9626 -188 8737 12668 10649 10327 15977 20636 12503 2136 -14793 -7228 1025 -2210 5431 5915 -7751
9611 -7751 -11392 -11741 -1983 -7020 1514 9397 12546 -310 -13986 -10241 -170 9262 17716 27321
9597 27321 20753 -1764 1365 17665 15396 11202 11790 10371 539 -2173 -7970 -10259 -15606 -9167
9583 -9167 -1449 6162 -5818 -10980 -4349 -14101 -7303 1881 445 -11733 -10765 3932 3117 -2867 -14572
9568a4572J2086R821J711M597N81r106p171j1825m835K518O847j036l351J2853
9554h82J0242k664l204M366p396p284j5494J3602O627j8455m392j015J184O254
9540a8511J341M144J0298k758r877m251J5002Q483l551M727q928j1730J0289o16
9526e938j3014j3506Q217N539O680L080K577K032J5599R085n724N46j415r630
9512D128q79N58m284j0032j401N533q87l064N719k284k255p539j1642L861k468
9497b6936M903P588J1841K083J806j1649j92k744M560j4615N736J6941J1496J1439
9483B2257O792j5087o061j6627L484n826q813J3268j2q013k24M713L789j1440
9469a7800j493J5325J4547n548M588L180j6881m194q013n434O232r24K0979o064
$$ plain form
9568 -14572 -2486 7335 9046 13643 14224 5118 -2053 -13878 -18713 -16195 -9348 -10384 -13735 -882
9554 -882 9360 6696 3492 7858 462 -6822 -22316 -8714 -2087 -20542 -24934 -25949 -24765 -18511
9540 -18511 -17170 -13026 -2728 -5486 -15363 -19614 -4612 3871 320 5047 -3881 -15611 -5322 -5938
9526 -5938 -18952 -32458 -24241 -18702 -12022 -8942 -6365 -4333 11266 20351 14627 15173 13758 4128
9512 4128 3249 3807 -477 -10509 -11910 -6377 -7264 -10328 -4609 -6893 -9148 -16687 -28329 -24468 -26936
9497 -26936 -22033 -14445 -2604 -521 1285 -10364 -10556 -13300 -8740 -23355 -17619 -678 10818 22257
9483 22257 29049 13962 7901 -8726 -5242 -11068 -19881 -6613 -6625 -14638 -14862 -10149 -6360 -17800
9469 -17800 -19293 -3968 10579 5031 9619 12799 -4082 -8276 -16289 -21723 -15491 -16415 4564 -1500
9455a500p958m655r99J573q6j704M989P563M904R817N062m472j0153L522O141
9440A2044K65j0253M663K1596k26r800o521M947P518j276j5358l082J751K483
9426H751j0275K114J3024p220j5365k779P441P673j1632m492j555J3904J1244
9413A0833O400j4277q624j342J749J5859j31L865k109j1226K134L89K393j0349
9399d436R552J6088m833M894j626K864q962j9517j1563m103L396K759J2305J17
9385c065q676J1355j98m437L517J4694J329M940O157j1281j152j3279j9599l004
9371b2699Q221J5773K855M36r908j1495P570N0l109l812N655K441m318P922J0799
9356F381j4895j6311j715R114o057J1220L614k943k182n701J0401K6652N307k2229
$$ plain form
9455 -1500 -9458 -14113 -15112 -13539 -13625 -15329 -10340 -2777 2127 11944 17006 12534 2381 5903 12044
9440 12044 12309 2056 6719 28315 28089 18289 11768 16715 24233 22957 7599 4517 6268 8751
9426 8751 -1524 590 13614 6394 -8971 -11750 -4309 3364 -8268 -12760 -14315 -411 10833
9413 10833 17233 2956 -5668 -7010 -5261 10598 10467 14332 12223 997 3131 3520 5913 -4436
9399 -4436 5116 21204 16371 21265 19639 22503 13541 -5976 -17539 -21642 -18246 -15487 -3182 -3065
9385 -3065 -11741 -386 -584 -5021 -1504 13190 14519 19459 25616 14335 13183 -96 -19695 -22699
9371 -22699 -14478 1295 4150 4586 -5322 -16817 -9247 -9197 -12306 -16118 -10463 -8022 -12340 -4418 6381
9356 6381 -8514 -24825 -26540 -17426 -23483 -12263 -8649 -11592 -13774 -19475 -9074 17578 22885 656
9342F56q176K146L791J3771M57j338q855n881O758N352r715j2086J884R156O766
9327D686J7265j227j3864j7915J165k028J89Q396o10Q236o328j8129J0466N437
9313d261O447J1487j006j2095j0350j305L244m41N524P611j2236o259j2454O357
9299a9737Q318J5410j1617l212J93k883L998J9938J970j0669j6097j0489o281
9286c1158O095P272l105J0523j239K564M784K628j4163J2811J7862J757n89P27
9272A6769j5263k690J4157l216j8303N637M981q990L661J1853O358j445o102j0095
9258b688K692J153r715R974J0598o50j3915O183k895k2135j607Q885k335m151
9244b0606J4658k520L450r170l947Q176K005K1030J0071m824Q36N828J624l771
$$ plain form
9342 656 -7520 -5374 -1583 12188 12645 11307 2452 -3429 3329 8681 -1034 -13120 -11236 -2080 4686
9327 4686 21951 20724 6860 -11055 -9890 -11918 -11729 -3333 -3943 4293 -2035 -20164 -9698 -4261
9313 -4261 2186 13673 12667 572 -9778 -11083 -7839 -8280 -2756 4855 -7381 -13640 -26094 -19737
9299 -19737 -11419 3991 -7626 -10838 -10645 -13528 -9530 10408 12378 1709 -14388 -24877 -31158
9286 -31158 -25063 -17791 -20896 -10373 -11612 -9048 -4264 -1636 -15799 -2988 14874 16631 16042 16769
9272 16769 1506 -1184 12973 9757 -8546 -2909 2072 -6918 -3257 8596 14954 13509 7407 -2688
9258 -2688 4 1157 -8558 1416 12014 11364 -2551 3632 737 -21398 -23005 -14120 -16455 -20606
9244 -20606 -5948 -8468 -5018 -14188 -18135 -9959 -7954 13076 23147 18323 19159 24987 26611 22840
9230B2840k0727o718K043J8875J379p451p906M790R531M218j941j4661n635N979
9216D616j526L947P401l210k83l932j3117J5369J885N747M510q980j7605j940
9202g118M128N348r59J803k115n958J086J0902j30O77j2740l217r52O461R904
9187G120J454l581q86M849q90j3053M899P833j413o891R459P790J734L764L772
9172B5960r856j3658J609j4262P837O931j0171l421M640P052N326m955j7354j2696
9158b7018M984J0248J3550l004j1100j7898q119J1717J3731J0010J1569R373J0491
9145B8534Q045j1965j0482p202J5722L59J282J5948n715k5510P039N737O937M904
9131C3633R855j921L425M074K780o484n021m285o264p03J2972J7182J0562k892
$$ plain form
9230 22840 2113 -4605 -2562 16313 17692 10241 2335 7125 16656 20874 18933 4272 -1363 4616
9216 4616 3090 7037 14438 11228 10945 7013 -6104 9265 11150 16897 21407 12427 -5178 -7118
9202 -7118 -2990 2358 1399 3202 1087 -4871 -3785 7117 6987 7664 -5076 -8293 -9245 -2784 7120
9187 7120 8574 4993 4107 8956 8066 -4987 -88 7745 6332 -559 8900 16690 18424 22188 25960
9172 25960 16104 2446 4055 -10207 -2370 4561 -5610 -9031 -4391 2661 7987 3032 -14322 -27018
9158 -27018 -22034 -11786 1764 -1240 -12340 -30238 -38357 -26640 -12909 -2899 8670 18043 28534
9145 28534 36579 24614 14132 6930 22652 23011 24293 40241 34526 9016 16055 21792 28729 33633
9131 33633 43488 41567 44992 49066 51846 45362 40341 36056 29792 29089 42061 59243 69805 66913
9117F6913o304O584J877J9578j015q704M868Q910L849n258J8962J6700J345K7957
9103A56262K8734K6536J7986L0155L5716O5237R1433R2138J17465J85539K77079
9092A124280L89101N80929P25144O77155L59693L5336j62516k87162m20495n35540
9082B485925n29050m26836l18966k28002j76671j21336q7339p8931p0098n3182
9072C95514m6460l5726k0647k9662l0480j6972j8095k1918r802j3883j1329J122
9060A41662m354j9189j4585j2387o725K808j1522l145m951j352P435Q148J1892
9047I3735j2457j4569O98M247j2576j1460R145l027j2713j1081n851m161n762
9034A4168j7k447r428K53J3443J0620L653j459n143k941O241O425j3468j1986
$$ plain form
9117 66913 60609 67193 69070 88648 87633 78929 83797 92707 96556 91298 110260 126960 128305 156262
9103 156262 184996 211532 229518 259673 295389 360626 452059 544197 661662 847201 1124280
9092 1124280 1513381 2094310 2819454 3496609 3856302 3891638 3729122 3441960 3021465 2485925
9082 2485925 1956875 1530039 1211073 983071 806400 685064 597725 518794 448696 395514
9072 395514 349054 313328 292681 263019 232539 215567 197472 175554 165752 151869 140540 141662
9060 141662 137308 118119 103534 91147 84422 87230 75708 72563 67612 66260 73695 81843 93735
9047 93735 81278 66709 67407 71654 59078 47618 56763 53736 41023 29942 24091 19930 14168
9034 14168 14151 11704 2276 2529 15972 26592 30245 28786 23643 20702 26943 33368 19900 7914
9020G914n205K994o075N445Q821O991O054j2816O408M658k3803k260O132J1439
9006A6697l469M492L317k3084L039L684L88M428j3464k6143R45J3235R57J4953
8992b5K1620N334j0530j6461l193P297Q385k145l471l438o623O321J0042l925
8978I188o780j2267L146J1375j831M541n791j291k505k29O136Q848O484o982j4034
8963a992j895O902R561L865Q315M321j3086j2074l692k442Kp011L019J0441J4578
8948A8812O001P406p998j4756j7521O823J1884N545K552P705j6809q537M696n658
8934A45n196J4070L711j0102n752P107J1718J0236m797q003j5195p533J1906K330
8920D645j3114q340O137J3091J515R668J0045j3523q555p797k407M743o676M534
$$ plain form
9020 7914 2709 5703 -372 5073 13894 20885 26939 14123 20531 25189 1386 -874 5258 16697
9006 16697 13228 17720 21037 -2047 992 4676 5064 9492 -3972 -30115 -29170 -15935 -14978 -25
8992 -25 21595 26929 16399 -62 -3255 4042 12427 10282 6811 3373 -3250 3071 13113 9188
8978 9188 2408 -9859 -6713 4662 2831 7372 1581 290 -2215 -2444 3692 12540 19024 12042 -1992
8963 -1992 -3887 3015 12576 16441 24756 29077 15991 3917 225 -2217 -2215 -9226 -6207 4234 18812
8948 18812 24813 32219 24221 9465 -8056 -1233 10651 16196 18748 26453 9644 1107 5803 145
8934 145 -5051 9019 12730 2628 -3124 3983 15701 25937 21140 13137 -2058 -9591 2315 4645
8920 4645 -8469 -16809 -10672 2419 3934 13602 23647 10124 1569 -6228 -8635 -3892 -10568 -6034
8906f034L691J3744m75k0414l673J1564o704m581j1537r221n656J1532K2170O454
8892H60O284K663j413N967k514J343J1018Q500k997j555r328o453L056n372l569
8877F490j3451Q994L760l435O80M347k1802Q011R968j285K583J1514R490n587
8863B0277k1000K763K682q889L347R785r475j2082p748J0102J4190M754j048k250
8849E408k343N272o348K688n8j6805l821J0429l375J4072l07l575j1592o428M372
8834a2411l662N184N344P524M101J680j816O057P371J0574r774m802j054m36J1865
8819B5745N14o597k081p53R295J421k3333j3970l864j184P88J3114P413O604j0977
8804B135q947l206J622l221N864k284j6677K923J0703K410N683p559O652l175
$$ plain form
8906 -6034 -2343 11401 10926 -9488 -13161 -1597 -8301 -12882 -24419 -33640 -39296 -27764 -5594 860
8892 860 7144 9807 8394 14361 11847 13190 24208 32708 29711 28156 18828 12375 15431 10059 6490
8877 6490 -6961 2033 5793 2358 3038 7385 -14417 -6406 3562 2277 4860 16374 25864 20277
8863 20277 -723 2040 4722 -4167 -820 8965 -510 -12592 -20340 -10238 3952 8706 7658 5408
8849 5408 3065 8337 1989 4677 4619 -12186 -16007 -5578 -8953 5119 4812 1237 -10355 -16783 -12411
8834 -12411 -16073 -10889 -5545 1979 6080 7760 5944 12001 19372 29946 20172 15370 14316 13880 25745
8819 25745 26259 19662 17581 16828 26123 27544 4211 -9759 -13623 -14807 -14019 -905 6508 13112 2135
8804 2135 -6812 -10018 -8396 -11617 -5753 -8037 -24714 -21791 -11088 -8678 -2995 -10554 -3902 -7077
8790g077N17O949M398q727O335P006K024p439K065K815n769q636K437P584m708
8775b26n60O37q2L986r122J515J571P522N842P026O379j8666q870J1707N667o134
8759H192k450K172p424J681j706r926L70J4363N964M981q180l159M346j6874j0091
8744a7741n093K466J0003o959j2171J736L546l548J36J3789L86j5426M819J5107
8730h950J0229K382M937K92m090o022N915p377n279M187Q227R410n103r578j0747
8715a1567p324N290J0499j4714q94P893J0097N444R225j188l328K314M591M528
8701B0866j982K487l613k848o088n029Q55J3074N982M54Q47O91r530j8931o206
8686h971k280o314J9089J5257k371j7130j349K846J1399M864l692L499L712n437
$$ plain form
8790 -7077 -6560 389 4787 -3940 2395 9401 11425 3986 6051 8866 3097 -5539 -3102 4482 -226
8775 -226 -786 -149 -231 3755 -5367 -3852 -2281 5241 11083 18109 24488 5822 -3048 8659 14326 8192
8759 8192 5742 7914 490 2171 465 -9461 -9091 5272 11236 16217 8037 4878 9224 -7650 -17741
8744 -17741 -22834 -20368 -10365 -17324 -29495 -27759 -24213 -27761 -27625 -13836 -13450 -28876 -24057 -8950
8730 -8950 1279 3661 8598 8890 4800 -1222 4693 -2684 -7963 -3776 4451 13861 8758 -820 -11567
8715 -11567 -18891 -13601 -3102 -17816 -18710 -10817 -720 4724 13949 12761 9433 11747 16338 20866
8701 20866 18884 21371 17758 14910 8822 3793 4648 17722 23704 24158 25005 25696 16166 -2765 -8971
8686 -8971 -11251 -17565 1524 16781 14410 -2720 -4069 -1223 10176 15040 11348 14847 18559 13122
8672A3122p050Q441Q158j0269r085m213q624J213J4600M290L245L251o887m97
8658I695O005J1945l592O866L060k785k0144o652K317J8828P857j419Q371j2444
8644B7908k4931j2863j7616Q605K2821N853j2920j1672K937M617J0796K819O660
8631A3014L045m44j4751j8814p11O422J0215p277O56J4587k664M053Q64k7K782
8616A0950J4170K723q748q026M293q247j1060j0359N63m45J826R663O97J269M794
8601D063o312m958J0579J8399j498j811N78L544j543p409m372L711l449j741P211
8586A4992O90q35l033J8113P267k4052m058J187P011l241l276l085n667P317n711
8571C619q893j0990Q9J0466Q498J939O722m650n059P480R538K587J191n53L418
$$ plain form
8672 13122 6072 14513 22671 12402 3317 -896 -9520 -8307 6293 10583 13828 17079 10192 9695
8658 9695 15700 27645 24053 30919 33979 31194 11050 4398 6715 25543 33400 31981 40352 27908
8644 27908 2977 -9886 -27502 -18897 3924 9777 -3143 -14815 -11878 -7261 3535 6354 13014
8631 13014 16059 15615 864 -17950 -18661 -12239 -2024 -9301 -8645 5942 3278 7331 8195 8168 10950
8616 10950 25120 27843 19095 11069 15362 7115 -3945 -14304 -13741 -14186 -12360 -2697 -2000 -731 4063
8601 4063 -2249 -7207 3372 21771 20273 18462 19040 22584 21041 13632 9260 12971 9522 7781 14992
8586 14992 15682 14847 11814 29927 37194 13142 9084 10271 17282 14041 10765 7680 2013 9330 3619
8571 3619 -5274 -16264 -16175 -5709 2789 4728 11450 6800 1741 9221 18759 21346 22537 21984 25402
8556B5402R701l829j3532j4819l242k877j3625n719O481J1911r6N295k058l512
8542d519Q284Q815l826m722l365L773J1931M718n993N102N753r173k124J09o149
8527H614j1950r264J5872Q611p964k975m955n34n08N336n49j5508p865J2858R355
8512a426L089m253K969J7968J731r742o479N62N133J707O324j337j5581j0306
8498i641j69l200j244N601K165M628j4528J0680P813j0038j2431N574J5104R89
8484A303J4211Q70n084O834k2137q834J3338L712L22j2091o694J4568j1878r641
8470b1201K33Q940K0669K341J208j2382N595l299o82k219k3064k868K1045R484
8456C800m416q515k159M054p30N805P802R45J3433J7688l450L095j8104j0258
$$ plain form
8556 25402 35103 31274 17742 2923 -319 -3196 -16821 -22540 -16059 -4148 -4244 1051 -1007 -4519
8542 -4519 3765 12580 8754 4032 667 4440 16371 21089 15096 20198 25951 16778 14654 14763 8614
8527 8614 -3336 -12600 3272 11883 3919 944 -4011 -4545 -5053 283 -266 -15774 -23639 -10781 -1426
8512 -1426 1663 -2590 379 18347 20078 10336 3857 4419 9552 11259 17583 16246 665 -9641
8498 -9641 -9810 -13010 -14254 -8653 -6488 -1860 -16388 -5708 2105 -7933 -20364 -14790 314 1303
8484 1303 15514 16384 11300 18134 -4003 -12837 501 4213 4535 -7556 -14250 318 -11560 -21201
8470 -21201 -20968 -12028 8641 10982 12190 -192 5403 2104 1422 -797 -23861 -26729 -5684 3800
8456 3800 -616 -9131 -11290 -7236 -7966 -2161 5641 6586 20019 37707 34257 37352 19248 8990
8442H990j4599p817l477k301j199M605k83k216p699k095q74K0188O929J488N30
8427A70j2656K280P779P315k715l419j3896N273J996K663p826j5918L128N928
8413a9898j3J5295J7759j7692j9216j689J6341M898j7376O018j334Q024J3391
8400D508l365m209j1718q878J0923O699N169O180j6788k0228K1155O573r713K98
8386a3394M277K794J181J44j1288P446J815j706Q081J0531j7249l490R289J3602
8372A2033J698o409L937L205J1780r913k813k859Q49M04o05J2240M816o690j2483
8357I190l210l680N067P575j0417j185P528m815l503J2454q466q257k20N448P83
8342D292k479o25K209R897J461n377K02p495j5197n875k279P361K4K124J3231
$$ plain form
8442 8990 -5609 -13426 -16903 -19204 -20403 -15798 -16081 -18297 -25996 -28091 -28965 -8777 -1848 -360 170
8427 170 -12486 -10206 -2427 4888 2173 -1246 -15142 -9869 -7873 -5210 -13036 -28954 -25826 -19898
8413 -19898 -19911 -4616 13143 -4549 -23765 -25454 -9113 -4215 -21591 -15573 -16907 -8883 4508
8400 4508 1143 -3066 -14784 -23662 -12739 -6040 -871 5309 -11479 -31707 -10552 -3979 -13692 -13394
8386 -13394 -9117 -6323 -5142 -4998 -16286 -8840 -7025 -8731 -650 9881 -7368 -10858 -1569 12033
8372 12033 13731 7322 11259 14464 26244 16331 13518 10659 11508 11912 11307 23547 28363 21673 9190
8357 9190 5980 2300 7367 14942 4525 3340 10868 6053 2550 15004 6538 -1719 -1939 3509 4292
8342 4292 1813 1188 3397 13294 14755 9378 9580 2085 -13112 -18987 -21266 -13905 -13881 -11757 1474
8327A474n459P890J5369p907p466M597l31j1462j378Q151M337r158j2151o198
8313a9692K148Q609J5300l614r92n347j2357m643J1428Q327J126p389j2923J612
8299a8407L209p617O67N610J0172r131m707l901O328k545m045K029M576N202L541
8284i019j972J2563J6002q68K477j0374j2631j6130P98L583J11l012J6052j316
8270c736j5774M971K3493l888j1531M44L075P01J4399n008p112J1634m26j388
8256I854r396K243o210m453m132Q859J1783P429j4708n53M693j785p744j0200
8242a4320q4J0047M936J856l398M948n144j6049K050P026J0136l52m433N356l063
8227d88K504o492j0707k461P995J1265R242J488L860j0044J183j120j80n833J04
$$ plain form
8327 1474 -3985 3905 19274 11367 3901 8498 8167 -3295 -4673 3478 7815 -1343 -13494 -19692
8313 -19692 -17544 -8935 6365 2751 1759 -3588 -15945 -20588 -9160 -833 293 -7096 -20019 -18407
8299 -18407 -15198 -22815 -22148 -16538 -6366 -15497 -20204 -24105 -17777 -20322 -24367 -22338 -17762 -12560 -9019
8284 -9019 -10991 1572 17574 16706 19183 8809 -3822 -19952 -19154 -15571 -15460 -18472 -2420 -3736
8270 -3736 -19510 -14539 8954 5066 -6465 -6021 -2946 -2245 12154 7146 34 11668 11242 9854
8256 9854 458 2701 -3509 -7962 -12094 -3235 8548 15977 1269 716 5409 3624 -4120 -14320
8242 -14320 -14404 -4357 579 2435 -963 3985 -1159 -17208 -15158 -8132 2004 1652 -2781 2575 -488
8227 -488 2016 -4476 -15183 -17644 -9649 1616 10858 12346 16206 6162 7345 6225 6045 212 316
8212C16l146L150j745l744O152J0275q360p576r468J1394j614M03L09n074n833
8197a4561k492P04J3850J6348P094q126k906r201o121Q63k67k965J682k880j3223
8182b2201J2393P623M939n124N764N943k626q251J4314R646L43M552j2103k1881
8168f669L398j486M376K7571J5780j9014m125m40j0597j2863Q083R923m700n09
8154H728O684r069j2480j3183n450K3277J6246k631p312Q424J6514K219n26k408
8140B9033k1414j6818j1247O791k456J252J2853R577R158K825j060q012q243L78
8126B617j3651r91L296K187k162J747m568j2072j379J0129J5675R382M367M899
8112A9476l51j8442J449Q572Q400p540p456Q154J0216j2409k7642j8243R639J6632
$$ plain form
8212 316 -2830 320 -1425 -5169 983 11258 2898 -4678 -14146 -2752 -4366 -3963 -3654 -8728 -14561
8197 -14561 -17053 -16349 -2499 13849 20943 12817 9911 710 -5411 -4548 -4815 -7780 -6098 -8978 -22201
8182 -22201 -9808 -2185 2754 -2370 3394 9337 6711 -1540 12774 22420 22763 27315 15212 -6669
8168 -6669 -3271 -4757 -381 27190 42970 23956 19831 19391 8794 -4069 4014 13937 9237 8728
8154 8728 15412 6343 -6137 -19320 -24770 -1493 14753 12122 4810 13234 29748 31967 31441 29033
8140 29033 7619 -9199 -20446 -13655 -16111 -14859 -2006 7571 16729 19554 18494 10482 2239 2617
8126 2617 -11034 -12025 -8729 -6542 -8704 -6957 -11525 -23597 -24976 -14847 828 10210 14577 19476
8112 19476 19125 683 2132 10704 19104 11564 4108 12262 22478 10069 -17573 -35816 -26177 -9545
8098i545J1322R080J945K862o38J189r666j4749q607j1314l3J5013J3497o415
8084f059j0151o40k406J265j407J8794J2533R95p693j0316R07j486J1990J4784
8070B1110j1948j1471k641l264K965p226J851R621J5739N485p42j4710j0945J2934
8056F758J3739O549M525n406n741j0251n745R874j232n306j695r012l992J1440
8042D505M99L360P924j7930k626K79Q664o509r816N025J1112M313q61m845o418
8027c324k889J892J3095k84P586P48L760J300j4128j0820j011N268m795k305J99
8012e708J5613J2092Lj595M499j8643P719R261j032l001k352p919r975j4500o664
7997b2202R037J2965P195o209M788R828P43O8n750P260n358N90O025m82j8611
$$ plain form
8098 -9545 1777 10857 12802 15664 15026 16215 6549 -8200 -16807 -28121 -28154 -13141 356 -6059
8084 -6059 -16210 -16850 -19256 -17991 -19398 -604 11929 12924 5231 -5085 -4178 -5664 6326 21110
8070 21110 9162 -2309 -4950 -8214 -5249 -12475 -10624 -1003 14736 20221 19479 4769 -6176 6758
8056 6758 20497 27046 31571 26165 20424 10173 4428 14302 13070 7764 6069 -2943 -6935 4505
8042 4505 5004 8364 16288 -1642 -4268 -3989 4675 -1834 -11650 -6625 4487 8800 7939 3094 -3324
8027 -3324 -6213 -4321 8774 8490 16076 16824 20584 21884 7756 -3064 -4075 1193 -3602 -5907 -5708
8012 -5708 9905 21997 22000 20405 24904 6261 13980 23241 22209 19208 16856 8937 -1038 -15538 -22202
7997 -22202 -13165 -200 6995 786 5574 15402 16145 16213 10463 17723 12365 12955 18980 18498 -113
7982a13j824k965M251J1354N193j5555n912l523O61p67J5889N033k422J3535J257
7967B4092k314l156j4022j1017L750R825J0163l614l780R037J238k3536p740n983
7953a7057J2627J1950p835l658l161P435q506k800j217K564J6381O639J0845j873
7939B2334M30R054j1889q907j659Q93k300n729j146L111j830J508n185l272m305
7924h892K419j3409j0309P029J5436N559J075M068O849j4613j27K2613K782o448
7910A4032j5426J155J9696Q876m116L384q109j3689L297N395m659j5639m305J7866
7896G758q374m830P19k615o269q027L356J3454O054m177J478k213k526J2655P169
7881A3612j1491j3921l061o578J1992J4807l365k088O249N832K832p239K242Q100
$$ plain form
7982 -113 -1937 -4902 -651 10703 15896 341 -5571 -9094 -8433 -9200 6689 11722 9300 22835 24092
7967 24092 21778 18622 4600 -6417 -2667 7158 17321 13707 9927 18964 20202 -3334 -11074 -17057
7953 -17057 -4430 7520 -315 -3973 -7134 301 -8205 -11005 -12222 -9658 6723 13362 24207 22334
7939 22334 22764 31818 19929 11022 9363 10256 7956 2227 1081 4192 2362 3870 -1315 -4587 -8892
7924 -8892 -6473 -19882 -30191 -23162 -7726 -2167 -1092 2976 9825 -4788 -4915 17698 20480 14032
7910 14032 -1394 -239 19457 28333 24217 27601 19492 5803 9100 14495 9836 -5803 -10108 7758
7896 7758 -616 -5446 -4727 -7342 -13611 -21638 -18282 -4828 1226 -2951 -1473 -3686 -6212 6443 13612
7881 13612 2121 -11800 -14861 -21439 -9447 5360 1995 -93 6156 11988 14820 7581 9823 17923
7867A7923J4324K044j2224j857n287k815m784j1326J3585j541j8038L593P551
7854A148q589J3680q052j3447j14k509K161J159q83K242m692j7914R913K625N768
7839a7504k334J238L424K808N020n374K66l707k927L999K600m009J780M911L893
7824e916J2820O257N837j444j028j6457j2562j172J626J5649J855n059P82N893
7810G081j0292r648n147N116n606kN211o715j700L097K876k278P743M203l431
7795i492j296o294j155k181M632O726J4400M862j0600j2909n895K576Q967L421
7781d238J2153n593p252p100p957J2735J3604k4q020j774K960p114j7N026N768
7766C157l217l153J295m650k4276l009J7749R968J5493M716K359j934r363j410
$$ plain form
7867 17923 32247 34291 22067 20210 14923 12108 7324 -4002 9583 8042 -9996 -6403 1148
7854 1148 -7441 6239 -1813 -15260 -15374 -17883 -15722 -14563 -15446 -13204 -17896 -35810 -25897 -23272 -17504
7839 -17504 -19838 -18600 -15176 -12368 -7348 -12722 -12456 -16163 -19090 -15091 -12491 -16500 -14720 -9809 -5916
7824 -5916 6904 13161 18998 17554 16526 69 -12493 -13665 -12039 3610 5465 406 1188 7081
7810 7081 -3211 -12859 -18006 -12890 -18496 -18498 -13287 -20002 -21702 -18605 -15729 -18007 -10264 -6061 -9492
7795 -9492 -10788 -17082 -18237 -20418 -15786 -9060 5340 10202 -398 -13307 -19202 -16626 -7659 -4238
7781 -4238 7915 2322 -4930 -12030 -19987 -7252 6352 6328 -1692 -3466 -506 -7620 -7637 -2611 3157
7766 3157 -60 -3213 -1918 -6568 -30844 -33853 -16104 -6136 9357 14073 16432 14498 5135 3725
7752C725q927O809j042k130Q69j5981j5253R389M319r858r81M489M773K0707J2678
7737A3586M338r327r626J1800N015q858m557K623k669j6329N420M253j5806q932
7723b9069M874J0613J4502m707k741J6604m982j2239m106R27J4970M131m888k762
7709A127n565k012K908m935K171p46n619J42R565k3378q956J230O014K0916L741
7694c397Q871L432p985n574M931n887j1888Q59N760R706P110j0554L676J3819
7680A2879j954k1042o35M818p873J002Q687j325o12Q214j865J613k87r941o501
7665a4822j7586n935J1247K3976J9666p616l140q460j0821k416q65J2797L455
7652e20j7902o641o528n140J0302L790L172K227P897L736p899K42L647J93J1953
$$ plain form
7752 3725 -5202 1607 565 -1565 -696 -16677 -31930 -22541 -18222 -28080 -29061 -24572 -19799 908 13586
7737 13586 17924 8597 -1029 10771 15786 6928 2371 4994 2325 -14004 -8584 -4331 -20137 -29069
7723 -29069 -24195 -13582 920 -3787 -6528 10076 5094 -7145 -11251 -10324 4646 8777 3889 1127
7709 1127 -4438 -6450 -3542 -8477 -6306 -7052 -12671 -12529 -2964 -26342 -35298 -34068 -28054 -7138 -3397
7694 -3397 5474 8906 921 -4653 278 -5609 -17497 -16638 -10878 -1172 5938 -4616 -940 12879
7680 12879 10925 -10117 -10752 -5934 -13807 -12805 -4118 -5443 -6055 2159 294 1907 1620 -8321 -14822
7665 -14822 -32408 -38343 -27096 -3120 16546 8930 5790 -2670 -13491 -15907 -16772 -3975 -520
7652 -520 -18422 -25063 -31591 -36731 -26429 -22639 -19467 -17240 -9343 -5607 -13506 -13264 -9617 -9424 2529
7637B529j693j3358M398o557p19r57J3354J4426L554M998o997j2502m939p467
7623a1930O961R870J5647n116j7662O998j892j1862Q204l224r990P360p061m654
7609a8351J5843J0358N720q188m099O436K740Q589o732r452N398P094K69m989
7595A0636j5396q968O970J2762O307R734j0474l949l294m552J504L578K773k065
7581E566n075K053l487M17j6575N296K922J730J0436L192k547j4475m647M583
7567a0611m825O430J1075M5j345o633l04o74j3538j711k670M062j2288Q208M138
7552b0641K0444k036n752n671J71J0171n846j766R978N849j6406n440N125M217
7538g603r329j1134M531J6923n900n167n301k433O805m11J4758Q17p693m086K467
$$ plain form
7637 2529 836 -12522 -8124 -14681 -15400 -16357 -3003 11423 14977 19975 12978 476 -4463 -11930
7623 -11930 -4969 4901 20548 15432 -2230 4768 2876 -8986 -782 -4006 -13996 -6636 -13697 -18351
7609 -18351 -2508 7850 13570 5382 1283 7719 10459 19048 12316 2864 8262 15356 15625 10636
7595 10636 -4760 -13728 -6758 6004 12311 22045 11571 7622 4328 -224 1280 4858 7631 5566
7581 5566 491 2544 -943 -526 -17101 -11805 -8883 -7153 3283 6475 3928 -10547 -15194 -10611
7567 -10611 -15436 -9006 2069 2114 769 -5864 -6168 -6842 -20380 -22091 -24761 -20699 -32987 -24779 -20641
7552 -20641 -197 -2233 -7985 -13656 -13485 -3314 -9160 -10926 -948 4901 -11505 -16945 -11820 -7603
7538 -7603 -16932 -28066 -23535 -6612 -12512 -17679 -22980 -25413 -18608 -19019 -4261 -3444 -11137 -15223 -12756
7523a2756j0373N894J2451L302j813l821j6286R761p12j5728J1498J1346R491
7510B254J7004j0275M360Q060j4535r007j430Q470p573n019p025J1180m636j240
7496i412J2904O939k470o733j2217k828J1586k055j2943j1279N403P153J4945
7483a007J1220j255r263j460K671o863o762o405Q164K859M262r304l368R002K215
7468e294j883j938L974J9504j378j1054j1762n104m922q92p569j485J3196m829
7454b1436L345r67j754K343J4054O779L267O572l856j0527l422p746n02K1527
7440G677J5352q842j561K046P654q995k0740M505j097J6612k5k102J2224m576
7426A8132j4432n64m220K212K961L05m107m40J0656k09q989n722j94M210m428
$$ plain form
7523 -12756 -23129 -17235 -4784 -1482 -3295 -7116 -23402 -13641 -14353 -30081 -18583 -7237 2254
7510 2254 19258 8983 13343 21403 6868 -2139 -3569 4901 -2672 -7691 -14716 -3536 -8172 -9412
7496 -9412 3492 10431 7961 1228 -10989 -13817 -2231 -4286 -17229 -28508 -23105 -15952 -1007
7483 -1007 10213 8958 -305 -1765 906 -5957 -12719 -19124 -10960 -8101 -3839 -13143 -16511 -7509 -5294
7468 -5294 -7177 -9115 -5141 14363 12985 1931 -9831 -14935 -19857 -20749 -28318 -29803 -16607 -21436
7454 -21436 -18091 -19058 -20812 -18469 -4415 2364 5631 12203 8347 -2180 -5602 -13348 -13850 7677
7440 7677 23029 14187 12626 14672 22326 13331 -7409 -2904 -4001 12611 12586 10484 22708 18132
7426 18132 3700 3136 -1084 1128 4089 4394 287 -153 10503 10294 1305 -4417 -4611 -401 -4829
7411d829j4616J0575R625m401Q652l295q646p980K619K120N596m868j34O343L089
7396a50O63j1528N174J2000j912j733q2J4628L471K627J580r183o882K417n707
7381E383K423r793j2212p75K273j1876N165J0635n937o594R367J5230N031p194
7367A126k061j2096R336M098j6142k392J6773K990q19o3m358q673M496J2232M338
7352H785o11j351j1222K363n739J44n92p43M456o839q779O237Q717J4584K560
7337A1970p769j3718j5920J117J6176J280n458M115p659l085J2339J6274q06j4490
7323e634k765M581J1789l756L81k448n123l99N467J1216j4822m75j5280j8594
7309c5862J1384K639N421K053M869K486O335N960j4839n850l39J7618M844R064
$$ plain form
7411 -4829 -19445 -8870 755 -3646 5006 1711 -6935 -14915 -12296 -10176 -4580 -9448 -9582 -3239 -150
7396 -150 513 -11015 -5841 6159 4247 2514 2432 17060 20531 23158 24738 15555 8673 11090 5383
7381 5383 7806 -1987 -14199 -14974 -12701 -24577 -19412 -8777 -14714 -21308 -11941 3289 8320 1126
7367 1126 -935 -13031 -3695 403 -15739 -18131 -1358 1632 813 750 -3608 -12281 -7785 4447 8785
7352 8785 8174 6823 -4399 -2036 -7775 -7631 -8223 -8966 -4510 -11349 -20128 -13891 -5174 9410 11970
7337 11970 4201 -9517 -25437 -24320 -8144 -6864 -12322 -8207 -15866 -18951 -6612 9662 8856 -5634
7323 -5634 -8399 -3818 7971 4215 4596 2148 -2975 -3374 2093 13309 -1513 -1988 -17268 -35862
7309 -35862 -24478 -21839 -16418 -14365 -9496 -7010 -675 5285 -9554 -15404 -15743 1875 6719 15783
7295A5783m925p737n639O048Q085K377k117j5745r748J6024l18j0379O925P670
7281F304M308O415j876j410P001j764M749j0086q302N425m298M26Q937j2190N365
7266I004L118j63j1173r15o258n149J6591N587k0660m476N122O562J1282M590
7252A3062r677l850m203P437R779N610j2844n140O123j298o618L551J8736l66
7238B0302j4320l948q873J3312K652n207j899Q825J863j3551r590R091N617l188
7224A086n933K379P543r246j351q964j6460J0481J2875J1295N441M711j0554o141
7210b838j046J335n923l330p153K389j7088L116K3124J6737L626r372K121K231
7196G929K290q514p453k708O574K441j1090L393L342J159k525m088o93K121N570
$$ plain form
7295 15783 10858 3121 -2518 3530 11615 13992 11875 -3870 -13618 2406 2088 -8291 -1366 6304
7281 6304 10612 17027 15151 13741 20742 18978 23727 13641 5339 10764 6466 6892 15829 3639 9004
7266 9004 12122 11959 786 -129 -6387 -11536 5055 10642 -10018 -14494 -9372 -2810 8472 13062
7252 13062 3385 -465 -4668 2769 12548 18158 5314 174 6297 4999 -1619 1932 20668 20302
7238 20302 5982 2034 -6839 6473 9125 3918 2019 10844 12707 -844 -10434 -1343 4274 1086
7224 1086 -4847 -2468 5075 -4171 -5522 -14486 -30946 -20465 -7590 3705 9146 13857 3303 -2838
7210 -2838 -3884 -2549 -8472 -11802 -18955 -16566 -33654 -30538 -7414 9323 12949 3577 5698 7929
7196 7929 10219 1705 -5748 -8456 -1882 559 -10531 -7138 -3796 -2637 -5162 -9250 -9943 -7822 -2252
7181b252N18R298J512o271m524o555p15n702L351J3242N565n609q128N910J5995
7166A5635j0890r016j1438p629J4085J2250J0343M457j6014j8744j308m697R517
7153a3449K0159O676j3097j1791J4981J538n134o94k914J2182Q799M419q926j0561
7139B188r293j414j540J0671J2166K080j4054L063J545o400n301j542J0514n988
7125c305N551J813j4906k632O229R525m954r980m926n25J3257k094q229J6840
7111A664N425N035O455K922l459r968j182L321R481l037j604j8214m42O099k651
7096a55L720r190o795J256J607q15J142J4601K608j3261j1760n898L442K805Q192
7081h501m592q645Q861O632P038P428n777J1965K501q355l507j0918q768o503
$$ plain form
7181 -2252 -1734 7564 9076 2805 -1719 -8274 -8989 -14691 -11340 1902 7467 1858 -6270 -360 15635
7166 15635 4745 -4271 -15709 -23338 -9253 2997 13340 17797 1783 -16961 -18269 -22966 -13449
7153 -13449 6710 13386 289 -11502 3479 5017 -117 -811 -3725 8457 17256 21675 12749 2188
7139 2188 -7105 -8519 -10059 612 12778 14858 804 3867 5412 -988 -6289 -7831 2683 -3305
7125 -3305 2246 4059 -10847 -13479 -7250 2275 -2679 -12659 -17585 -18110 -4853 -6947 -15176 1664
7111 1664 7089 12124 18579 21501 18042 8074 6892 10213 19694 16657 15053 -3161 -3603 2496 -155
7096 -155 3565 -5625 -12420 -11164 -9557 -10372 -9230 5371 7979 -5282 -17042 -22940 -19498 -16693 -8501
7081 -8501 -13093 -21738 -12877 -6245 793 8221 2444 14409 16910 8555 5048 -5870 -14638 -21141
7067b1141M069J669Q72J6315k092J1462J2972M11j8110l013j1402L997k855j0551
7053a7397L924J0674J5259L264j2777j5535l426l937P581K449J7670K906K299
7040A2954J1215j0234p63J730k249r55j1991j5130o749J0166M951K424j108n021
7026a0760J652Q096Q922K166J5007K334j3177j0166m458m291M095K195r346j5772
7012b3503R227K425o34l42J5249l889N852k079r857r78L085J1197J136o320m11
6997A58p988p329J2516O65J602L032j908l25M4P792N626R972j502j5716j0651
6982d012N988J0188m41L783J258l494q51j4707K704q61r197n063K587M99l568
6967a5187K593N793p85M026O533J2055K822k5571J555J3247j4294j3689o208N454
$$ plain form
7067 -21141 -17072 -15403 -14531 1784 -308 11154 24126 24537 6427 3414 -7988 -3991 -6846 -17397
7053 -17397 -13473 -2799 12460 15724 2947 -12588 -16014 -19951 -12370 -9921 7749 10655 12954
7040 12954 24169 13935 13172 14902 12653 11698 -293 -15423 -22172 -12006 -7055 -4631 -5739 -10760
7026 -10760 -9108 -1012 7910 10076 25083 27417 14240 4074 -384 -4675 -580 1615 -7731 -23503
7012 -23503 -14276 -11851 -12485 -12827 2422 -1467 4385 2306 -7551 -8529 -5444 5753 6889 569 158
6997 158 -7830 -15159 -2643 -1978 -376 2656 748 423 467 8259 13885 23857 22355 6639 -4012
6982 -4012 1976 12164 11723 15506 16764 13270 12419 -2288 416 -445 -9642 -14705 -12118 -11619 -15187
6967 -15187 -12594 -6801 -7586 -3560 2973 15028 17850 -7721 -6166 7081 -7213 -20902 -27110 -21656
6953b1656R901J7909R242j5120q645M623P216Q74O946J390M089M934n332n575
6939A0796p808L343O414k3231n529R148j0275n437P746Q207J1326o89j3572L369
6925f192J5919Q812M329k1301n946q845M553R239O665J266j315P62J431k769j0562
6910c954L436q208q256K63R523M601n951j2276j505J071J1154N625n591M74j4368
6895b3962q522Q760J7208k61l350Q768l37l341N278Q206p726R60j0133k594J3303
6880B257L501k4550j8118O784J6321Q549J3010L813m743J321j1364k696P032J0625
6866A1742J2764j0667j3190k821o206j1981J002J1690q82J468OM469J6578L403
6852A7375j0324p577o304r444j3985Q476N246l030j1286m256M443Q725j378J5868
$$ plain form
6953 -21656 -11755 6154 15396 276 -8369 -3746 3470 4344 11290 12680 16769 21703 16371 10796
6939 10796 2988 6331 12745 -10486 -16015 -6867 -17142 -22579 -14833 -6626 4700 4011 -9561 -6192
6925 -6192 9727 18539 22868 1567 -4379 -13224 -8671 568 7233 8499 7184 7946 9377 6608 -3954
6910 -3954 -518 -8726 -16982 -16719 -7196 -2595 -8546 -20822 -22327 -21256 -10102 -4477 -10068 -9594 -23962
6895 -23962 -32484 -23724 -6516 -6777 -10127 -1359 -1696 -5037 241 8447 721 1681 -8452 -11046 2257
6880 2257 5758 -18792 -36910 -30126 -13805 -5256 7754 11567 6824 8145 -3219 -5915 1117 11742
6866 11742 24506 13839 649 -2172 -8378 -20359 -19357 -7667 -8549 -7081 -7075 -2606 13972 17375
6852 17375 7051 -526 -6830 -16274 -30259 -21783 -16537 -19567 -30853 -35109 -30666 -21941 -23319 -7451
6838g451K338L643K901j0696m759J901m547m860Q463J2787k265j507l201J352
6824e901M528q703o622J2731L762P058j4932J773J5662j122L90r43O942m48j0702
6809C473O63j4344k184K2465M912j6712j5407j147R11N321J4907J2122N137j4402
$$ plain form
6838 -7451 -5113 -1470 1431 -9265 -14024 -12123 -16670 -21530 -13067 -280 -2545 -4052 -7253 -5901
6824 -5901 -1373 -10076 -16698 -3967 -205 6853 -8079 -6306 9356 8234 8624 7681 14623 14175 3473
6809 3473 4136 -10208 -12392 10073 14985 -1727 -17134 -18281 -17370 -12049 2858 14980 20117 5715
$$ [...]
##END NTUPLES=NMR SPECTRUM
##END=
