##TITLE=Analysis number 317612
Compound Code cc 40813
Book Reference 440/148
Project Code adrs
Chemist Name craigr
##JCAMPDX= 6.0         $$ Bruker NMR JCAMP-DX V2.0
##DATA TYPE= NMR SPECTRUM
##DATA CLASS= NTUPLES
##ORIGIN= Bruker BioSpin GmbH
##OWNER= nmr
$$ XWIN-NMR		Version 3.5
$$ Mon Feb 27 11:28:29 2006 GMT Standard Time (UT+0h)  MAYBRIDGE\nmr@NMR_250MHZ
##.OBSERVE FREQUENCY= 250.131544655141
##.OBSERVE NUCLEUS= ^1H
##.ACQUISITION MODE= SIMULTANEOUS (DQD)
##.ACQUISITION SCHEME= undefined
##.AVERAGES= 16
##.DIGITISER RES= 18
##SPECTROMETER/DATA SYSTEM= dpx250
##.PULSE SEQUENCE= zg30
##.SOLVENT NAME= CDCl3
##.SHIFT REFERENCE= (INTERNAL, CDCl3, 0, 16.522)
##AUDIT TRAIL= $$ (NUMBER, WHEN, WHO, WHERE, WHAT)
$$ ##TITLE= Audit trail, XWIN-NMR		Version 3.5
$$ ##JCAMPDX= 5.01
$$ ##ORIGIN= Bruker BioSpin GmbH
$$ ##OWNER= nmr
$$ C:\u/data/dgb/nmr/ADRS/16920/pdata/1/auditp.txt
$$ ##AUDIT TRAIL=  $$ (NUMBER, WHEN, WHO, WHERE, WHAT)
(   1,<2006-02-27 11:28:06.21 +000>,<MAYBRIDGE\nmr>,<NMR_250MHZ>,
      <created by zg, POWCHK disabled, PULCHK disabled
       configuration hash MD5:
       84 BC 41 DB A1 6E 1D 46 DA 25 12 A5 C1 ED C5 3A
       data hash MD5: 64K
       E2 C2 A6 31 59 C9 EF 89 4E AD 5C AD 08 7E CC 8C>)
(   2,<2006-02-27 11:28:19.36 +000>,<MAYBRIDGE\nmr>,<NMR_250MHZ>,
      <Start of raw data processing
       ef LB = 0.3 FT_mod = 6 PKNL = 1 SI = 32K 
       data hash MD5: 32K
       44 E9 05 93 D5 E5 FE 98 C4 F9 94 9D 9C 7F 00 3C>)
(   3,<2006-02-27 11:28:21.16 +000>,<MAYBRIDGE\nmr>,<NMR_250MHZ>,
      <apk 
       data hash MD5: 32K
       38 8E 91 F1 88 02 5A 99 C7 5B 97 C6 62 16 7D 6A>)
(   4,<2006-02-27 11:28:22.02 +000>,<MAYBRIDGE\nmr>,<NMR_250MHZ>,
      <abs ABSG = 5 
       data hash MD5: 32K
       1F B1 CA CD 83 14 D4 6D 2E 14 C9 EA DE 2D 89 16>)
$$ ##END=
$$ 
$$ hash MD5
$$ 7A 53 C2 A9 D3 BD BE 2C 9A 2B CD 79 7D F4 67 E5
##$RELAX= 
##$RELAX= 
##$RELAX= 
##$RELAX= 
##$RELAX= 
##$RELAX= 
##$RELAX= 
$$ Bruker specific parameters
$$ --------------------------
##$DU= <C:\u>
##$EXPNO= 16920
##$NAME= <ADRS>
##$PROCNO= 1
##$TYPE= <nmr>
##$USER= <dgb>
##$AMP= (0..31)
100 100 100 100 100 100 100 100 100 100 100 100 100 100 100 100 100 100 
100 100 100 100 100 100 100 100 100 100 100 100 100 100 
##$AQSEQ= 0
##$AQ_mod= 3
##$AUNM= <au_zg>
##$AUTOPOS= <16 >
##$BF1= 250.13
##$BF2= 250.13
##$BF3= 250.13
##$BF4= 250.13
##$BF5= 500.13
##$BF6= 500.13
##$BF7= 500.13
##$BF8= 500.13
##$BYTORDA= 1
##$CFDGTYP= 0
##$CFRGTYP= 5
##$CHEMSTR= <none>
##$CNST= (0..31)
1 1 145 1 1 1 1 1 1 1 1 1 1 1 1 1 1 1 1 1 1 1 1 1 1 1 1 1 1 1 1 1 
##$CPDPRG= <>
##$CPDPRG1= <>
##$CPDPRG2= <>
##$CPDPRG3= <>
##$CPDPRG4= <mlev>
##$CPDPRG5= <mlev>
##$CPDPRG6= <mlev>
##$CPDPRG7= <mlev>
##$CPDPRG8= <mlev>
##$CPDPRGB= <>
##$CPDPRGT= <>
##$D= (0..31)
0 1 0 0 0 0 0 0 0 0.06 0 0 0 0 0 0 0.0002 0 0 0 0 0 0 0 0 0 0 0 0 0 0 
0 
##$DATE= 1141039685
##$DBL= (0..7)
120 120 120 120 120 120 120 120 
##$DBP= (0..7)
150 150 150 150 150 150 150 150 
##$DBP07= 0
##$DBPNAM0= <>
##$DBPNAM1= <>
$$ [...]
##$SUBNAM7= <"">
##$SUBNAM8= <"">
##$SUBNAM9= <"">
##$SW= 20.6930455092707
##$SWIBOX= (0..15)
0 0 3 0 0 0 0 0 0 0 0 0 0 0 0 0 
##$SW_h= 5175.983436853
##$TD= 65536
##$TD0= 1
##$TE= 293.16
##$TE2= 300
##$TE3= 300
##$TEG= 300
##$TL= (0..7)
0 120 120 120 120 120 120 120 
##$TP= (0..7)
150 150 150 150 150 150 150 150 
##$TP07= 0
##$TPNAME0= <>
##$TPNAME1= <>
##$TPNAME2= <>
##$TPNAME3= <>
##$TPNAME4= <>
##$TPNAME5= <>
##$TPNAME6= <>
##$TPNAME7= <>
##$TPOAL= (0..7)
0.5 0.5 0.5 0.5 0.5 0.5 0.5 0.5 
##$TPOFFS= (0..7)
0 0 0 0 0 0 0 0 
##$TUNHIN= 0
##$TUNHOUT= 0
##$TUNXOUT= 0
##$USERA1= <user>
##$USERA2= <user>
##$USERA3= <user>
##$USERA4= <user>
##$USERA5= <user>
##$V9= 5
##$VALIST= <valist>
##$VCLIST= <CCCCCCCCCCCCCCC>
##$VD= 0
##$VDLIST= <DDDDDDDDDDDDDDD>
##$VPLIST= <PPPPPPPPPPPPPPP>
##$VTLIST= <TTTTTTTTTTTTTTT>
##$WBST= 1024
##$WBSW= 4
##$XGAIN= (0..3)
0 0 0 0 
##$XL= 0
##$YL= 0
##$YMAX_a= 534619
##$YMIN_a= -479405
##$ZGOPTNS= <>
##$ZL1= 120
##$ZL2= 120
##$ZL3= 120
##$ZL4= 120
##$ABSF1= 16.522
##$ABSF2= -4.171173
##$ABSG= 5
##$ABSL= 3
##$ALPHA= 0
##$AQORDER= 0
##$ASSFAC= 0
##$ASSFACI= 0
##$ASSFACX= 0
##$ASSWID= 0
##$AUNMP= <proc_1d>
##$AZFE= 0.1
##$AZFW= 0.1
##$BCFW= 0
##$BC_mod= 0
##$BYTORDP= 0
##$COROFFS= 0
##$CY= 12.5
##$DATMOD= 1
##$DC= 0
##$DFILT= <>
##$DTYPP= 0
##$F1P= 14.0000005364418
##$F2P= -0.99999901652339
##$FCOR= 0.5
##$FTSIZE= 32768
##$FT_mod= 6
##$GAMMA= 0
##$GB= 0
##$INTBC= 1
##$INTSCL= 1
##$ISEN= 128
##$LB= 0.3
##$LEV0= 0
##$LPBIN= 0
##$MAXI= 10000
##$MC2= 0
##$MEAN= 0
##$ME_mod= 0
##$MI= 0
##$NCOEF= 0
##$NC_proc= -5
##$NLEV= 6
##$NOISF1= 0
##$NOISF2= 0
##$NSP= 0
##$NTH_PI= 0
##$NZP= 0
##$OFFSET= 16.522
##$PC= 1
##$PHC0= -16.25192
##$PHC1= 3.716058
##$PH_mod= 1
##$PKNL= yes
##$PPARMOD= 0
##$PSCAL= 4
##$PSIGN= 0
##$REVERSE= no
##$SF= 250.13
##$SI= 32768
##$SIGF1= 0
##$SIGF2= 0
##$SINO= 400
##$SIOLD= 32768
##$SREGLST= <1H.CDCl3>
##$SSB= 0
##$STSI= 32768
##$STSR= 0
##$SW_p= 5175.98343685301
##$SYMM= 0
##$S_DEV= 0
##$TDeff= 65536
##$TDoff= 0
##$TI= <Analysis number 999999
Compound Code 99
Book Reference 9
Project Code 9>
##$TILT= no
##$TM1= 0
##$TM2= 0
##$TOPLEV= 0
##$USERP1= <user>
##$USERP2= <user>
##$USERP3= <user>
##$USERP4= <user>
##$USERP5= <user>
##$WDW= 1
##$XDIM= 32768
##$YMAX_p= 402386480
##$YMIN_p= -63681
$$ End of Bruker specific parameters
$$ ---------------------------------
##NTUPLES= NMR SPECTRUM
##VAR_NAME=  FREQUENCY,     SPECTRUM/REAL,   SPECTRUM/IMAG
##SYMBOL=    X,             R,               I
##VAR_TYPE=  INDEPENDENT,   DEPENDENT,       DEPENDENT
##VAR_FORM=  AFFN,          ASDF,            ASDF
##VAR_DIM=   32768,         32768,           32768
##UNITS=     HZ,            ARBITRARY UNITS, ARBITRARY UNITS
##FACTOR=    0.157963299565203, 1,           1
##FIRST=     4132.6476996994, 0,             0
##LAST=      -1043.33573715361, 0,           0
##MIN=       -1043.33573715361, -63681,      0
##MAX=       4132.6476996994, 402386480,     0
$$ Real data points
##PAGE= N=1
##DATA TABLE= (X++(R..R)), XYDATA
$$ [...]
17034c0544P828L68L524O825l070j655O411J6477J197k1771r088J095N101R142
17020h160r01L318J725N993o033N529k109q529q946l911l411O577k092m375L527
17005b1798P903J0385j767p759j2006J035R951L772n283q151j43M933j0039j935
16991c0902P126J2010N961K188j3998j2215O112L934L129L723P530N252p656j622
16977i428N77J813L830l48l50k254M535o84J3008J0428l973j7082k2068n12n627
16962b8135K778P048K052Q13L073J996N04k994l95P268k17q120L090l048l914
16947a8201J367L134k752O24N966l047j449L326L663R4o958K412M311R050O09
16932B149n733j1551o049j4248k516N361L925N767R96N499P948N727j67o482j0581
$$ y = [-30544, -22716, -22348, -18824, -11999, -15069, -16724, -10313, 6164, 7361, -14410, -23498, -22403, -17302, -8160, -9061, -5743, -4018, 1975, -4058, 1471, -638, -9167, -18113, -22024, -25435, -18858, -20950, -25325, -21798, -13895, -3510, -5277, -13036, -25042, -24007, -14056, -10284, -15567, -23718, -23861, -18928, -28967, -30902, -23776, -11766, -5805, -3617, -17615, -29830, -23718, -19784, -16655, -12932, -5402, -150, -7806, -9428, -8851, -7038, -3208, -3556, -3906, -6160, -1625, -2309, 10699, 21127, 17154, 72, -21996, -22508, -28135, -25357, -18309, -16257, -15444, -12371, -10375, -9871, -12865, -13260, -5992, -6209, -14329, -11239, -14287, -18201, -16834, -13700, -16452, -15828, -9862, -12909, -14358, -11032, -7369, -7275, -14233, -11821, -7510, 1540, 2149, -3584, -15135, -21184, -35432, -37948, -32587, -28662, -22895, -21899, -16400, -8452, -2725, -2892, -9374, -19955]
16917a9955l820K611N922J025M94r838m831n29n451J7253O174j591J1657j04j6556
16902a7539o661J3753N087R332R423k556j4401o615j4721j6555j849j521J895
16889d2928J2098Q247J029j291K758j6199M611K0467O857l489p279l261L459J0200
16875d721J848K814o530r022n628j6895m067p98O699J5626J318m265N819R574
16861h228N232M955k818m463j6876l899k458j100M260N578k158r87k690o737L576
16846b8813J4678p182l079O414J215l67j12L112R843n604k069j0733r109r19p734
16831d0459J2084J4188O057Q045K835r264j0387r310k185L821Q728M549K023j455
16817a0730r384j239n686o951K576N920J0598J5003J0865o765j4000j2184p717
$$ y = [-19955, -23775, -21164, -15242, -14217, -13723, -23561, -28392, -28921, -34372, -17119, -10945, -12536, -879, -983, -17539, -24200, -10447, -5360, 3972, 13395, 10839, -3562, -10177, -24898, -41453, -43302, -44823, -42928, -30830, -22583, -21554, -22845, -20087, -36286, -31675, -11208, -4351, -7840, -15119, -18380, -14921, -4721, -2873, -59, -6589, -15611, -21239, -38134, -42201, -42999, -36300, -20674, -19356, -23621, -17802, -8228, -2996, 1959, -859, -5322, -22198, -26097, -28555, -29655, -25395, -19817, -21975, -22962, -25652, -32389, -28813, -14135, -21317, -24396, -17982, -16767, -17134, -17246, -14134, -4291, -9895, -11964, -22697, -31806, -32725, -40459, -28375, -14187, -8130, -85, 2750, -6514, -16901, -26211, -28396, -24575, -15847, -11298, -9275, -10730, -20114, -21353, -27039, -33990, -31414, -25494, -14896, 107, 10972, 4207, -9793, -21977, -29694]
16804b9694O909J1988m27l847Q976O475K087r639p904o864j0009j0791J1153N600
16790b5987Q641M048L513N169L222p997n414J754N138m008j4323o04r813o648
16776d3309R510J3122J2084P129p924N488m463j122j3112j4036l79M740M430M366
16762b3476J2664N199L042J2251J0802j1656j8894r785O604P433J1808O572j1207
16749A357n697j781J093m313m742l627O05M591J865j0906N020N530n872J0267
16735f610K410k209l93L471q937j5190l655K854J1473k412L675n143N146O880
16721h640n870K082K043K333L108L188J328r195k0035o832N452J1524N599K835
16707a1080j15J4139p712j7318r360j420k114L25P023M823Q262P428J428Q89r104
$$ y = [-29694, -22785, -10797, -11224, -15071, -6095, 380, 2467, -7172, -15076, -21940, -31949, -42740, -31587, -25987, -17346, -13298, -9785, -4616, -1394, -9391, -14805, -13051, -7913, -11921, -26244, -26848, -36661, -43309, -33799, -20677, -8593, -1464, -9388, -3900, -8363, -9485, -22597, -36633, -37012, -32272, -27842, -23476, -10812, -5613, -2571, 9680, 20482, 8826, -10068, -19853, -13249, -5816, 5992, 12564, 1357, -4340, -6121, -5028, -9341, -14083, -17710, -17105, -12514, -10649, -21555, -16535, -11005, -16877, -6610, -4200, -6409, -6802, -3331, -12268, -27458, -31113, -28259, -16786, -19198, -15523, -20666, -15520, -8640, -14510, -12428, -10385, -8052, -4944, -1756, -428, -9623, -29658, -36490, -31038, -19514, -13915, -11080, -11195, 2944, -4768, -22086, -31446, -32866, -34980, -34655, -27632, -22809, -14547, -7119, -5691, -4802, -13906]
16692a3906l935J0384K071k517Q737J320p623p829j2560N719k486N026Q988K696
16678e915k32l382q893q941L370R259n910K058P747j510m397j2293o22J0609J1678
16663g374M900j104k747j2756k339k568j757o626R623M799M304j044O85J167K840
16648i997p590l404q531O283M145p992M822O241J1817J3132Lm987L191o45j8319
16633a1831j2901L835J628p369L574J0498J059l328P598J802j4686l560Q73J502
16619b1306L081L186J9717R951j7085k0055k17L9O46q946R293J8971j055n467
16605i247l950l421l942J678N145p093L397O623l281j0111R693Q655k230P697
16591c87K935k014m06Q007l42j72j1280n190M727J497m365o800k028p186m993
$$ y = [-13906, -17841, -7457, -5386, -7903, 834, 2154, -5469, -13298, -25858, -20139, -22625, -17599, -8611, -5915, -6147, -9529, -18422, -27363, -23993, -14734, -20644, -18586, -10839, -12349, -16746, -29039, -29661, -19052, -7374, -2474, -3578, -6325, -19081, -21420, -23988, -25745, -32371, -22748, -17949, -13645, -14689, -14004, -12837, -9997, -17587, -20991, -29522, -23239, -19094, -27086, -22264, -16023, -4206, 8926, 8929, 3942, 7133, 6488, -11831, -24732, -20897, -19269, -26638, -23064, -12566, -11507, -14835, -7237, -5435, -20121, -23681, -22808, -21306, -18225, -15039, 4678, 14629, -2456, -22511, -22728, -22689, -22043, -30989, -21696, -2725, -3780, -9247, -13197, -16618, -20560, -18882, -13737, -20830, -17433, -10810, -14091, -24202, -14509, -5854, -8084, -387, 2548, 534, 128, 8135, 7793, 7621, -3659, -8849, -4122, -2625, -6990, -13790, -15818, -23004, -27997]
16576b7997nJ238J5012J4401k934M377k281o688j5013q241l634l884J1750Q312
16562a5587K958L759R94J14j962j1079m54J0695K327P564M949L654l545j3402
16548i015m787j4122L583K406q236O20R14k964p80P304n766N776N877M759J0028
16533d403J1318m738q706m039q583l042J2837N31r479j483N753L0m932j483Q758
16518a1661M898J3807L817m264j9263p601j275N520K676k337l838K313J518q226
16504b3916L319k019r065m446O543O823r210O430Q830p543m27Q981J877R350J0560
16489F087o759m997k630n102r117m821P37L809O205M612J38m46n504j1605j935
16474c1328J621K740N875N226j2758L479L990P824j533N322q64q211m453O192
$$ y = [-27997, -28002, -26764, -11752, 2649, -285, 4092, 1811, -4877, -19890, -28131, -31765, -35649, -23899, -15587, -12629, -8870, -7876, -7762, -9724, -20803, -21257, -10562, -8235, -671, 4278, 7932, 4387, -9015, -13802, -27924, -24341, -21935, -30171, -29551, -28637, -31601, -32381, -25077, -30843, -25067, -19190, -14431, -4403, 6915, 2177, -6529, -10568, -19151, -22193, -9356, -8825, -18304, -19787, -14034, -14004, -18936, -20419, -11661, -6763, 7044, 10861, 6597, -12666, -20267, -21542, -16022, -13346, -15683, -19521, -17208, -15690, -23916, -20597, -22616, -31681, -36127, -29584, -22761, -31971, -25541, -16711, -24254, -24681, -15700, -13823, -4473, 6087, -672, -5669, -8299, -13401, -22518, -27339, -26602, -22793, -16588, -11976, -11838, -12284, -17788, -29393, -31328, -29707, -26967, -21092, -15866, -28624, -25145, -21155, -13331, -14864, -9542, -10406, -18617, -23070, -16878]
16460a6878J8827o05p333m190j3957o44K216O953O665O602r4o094o616j1063j631
16445b7842j600j1712M403J2137O221j2809J908M420r9J043l749j88Q732K561
16431a6574m492l235O256j392j3220n10O101O114j0731L428N471J602j344L940
16417a8586R529J297k193K235p959j7432k456N783P12M771j287M608P049m804
16403a8733O703m499q974j7127m970R873J900K23n127l635J3784O39N099J3955
16389a0889j599j341RJ206J398m477p651J1961L465l097m934j105m493Q516P153
16374e878l743j0552j1627K58P015Q558P917l650K706o32r051j0334P774O455
16360a4784j03m983n486j101J905o319J666J0331J3179J3735M310j8206R70L532
$$ y = [-16878, 1949, 1344, -5989, -10179, -24136, -24780, -22564, -15611, -8946, -2344, -2438, -8532, -15148, -26211, -27842, -29442, -41154, -36751, -24614, -18393, -31202, -29294, -24874, -24973, -23930, -27679, -27867, -19135, -16574, -21066, -24301, -18045, -19437, -32657, -33167, -27066, -20952, -31683, -28255, -22784, -21182, -22526, -18586, -9057, -7760, -9953, -7718, -15677, -33109, -35565, -29782, -29070, -24299, -25586, -20978, -13929, -18733, -12030, -16529, -25503, -42630, -47600, -37727, -35827, -35604, -40731, -44366, -30582, -29943, -24844, -10889, -12488, -13829, -13820, -12614, -11216, -15693, -23344, -11383, -7918, -11015, -15949, -17054, -21547, -13031, -5878, -9621, -20173, -31800, -31542, -24527, -15969, -8052, -11702, -8996, -9628, -18679, -29013, -21239, -14784, -14887, -19870, -25356, -26457, -24552, -30871, -29205, -18874, -5695, 8040, 12350, -5856, -4886, -1354]
16346a354l675j0513j0106l173M361R154m100q766p632n77J080P214p62j583M489
16331b5943Q897R564N515p180k045L168m271N313j489K38m789p117l773n315N64
16316b8663N446P729p97L058l868n141l01o035p497n055k115J0540P058J3420
16302a2221J611m751O688P197J255k079o075j8967l006K408L770K464M309J179
16288a6218P268J080o208L162p913J896j375J604N669l049K625n006j5547N10
16274c1502O375J289J1013Q72p297N193j468j0321J867k902p932J622q695J093
16260d0793r14l73K545J1711P637o670j7791O252R425n63k219L394K467k14R784
16245a6322k073p311n247j458n264n34J3203R692L006J984J806j758n580n809
$$ y = [-1354, -5029, -15542, -25648, -28821, -24460, -15306, -19406, -28172, -35804, -36381, -35301, -28087, -28849, -30432, -25943, -17046, -7482, -1967, -9147, -11192, -8024, -12295, -6982, -8471, -8233, -13022, -20139, -23912, -29227, -28663, -23217, -15488, -16285, -13227, -17095, -22236, -22537, -28572, -36069, -41124, -43239, -32699, -25641, -12221, -10610, -15361, -8673, -1476, -221, -2300, -8375, -27342, -30348, -27940, -24170, -21706, -17397, -16218, -8950, -7870, -14078, -10916, -18829, -16933, -18308, -16704, -11035, -14084, -11459, -16465, -32012, -31502, -25127, -23838, -12825, -11953, -19250, -14057, -15525, -25846, -23979, -26881, -34813, -33191, -41886, -40793, -41707, -42080, -39535, -27824, -20187, -26857, -44648, -38396, -28971, -29534, -31753, -28359, -25892, -26106, -16322, -18395, -25706, -30953, -32411, -37675, -38209, -25006, -15314, -12308, -10324, -8518, -10276, -15856, -21665]
16231b1665m69l714r49J844K296Q364K974n214l745k965m968r372k937O716J0227
16216b3577P571o230L310J5636m11p529J782m133n880K799j027O97k548k481P773
16201a4248K413n09l97o769j0978J0046J1671l731N3p579j621L507m074J185p642
16186b8673l818J0003M648J876K512o834o036Q625k427q7L135K97j970j5718l520
16171c7987j539M868J1243m934j0202j1990L515O247J768K931P028j447P622q031
16157c0908j366O351k00j4106m181N81Q566P413r143k712L352N952l715J847P292
16142b4977M161M411k571j966p805J863k901l893L115J7452N511r56J350M056
16128c150l029j0989n642L735K019j4930l105L448p86p65J3416N705O411P43m800
$$ y = [-21665, -22134, -25848, -26797, -24953, -22657, -14293, -11319, -16533, -20278, -23243, -28211, -37583, -40520, -33804, -23577, -16006, -22236, -18926, -3290, -3701, -11230, -9448, -13581, -19461, -16662, -17689, -16992, -19540, -22021, -14248, -11835, -12344, -12741, -19510, -30488, -20442, -8771, -12502, -12449, -20028, -21649, -18142, -22216, -21031, -28673, -32491, -22488, -17840, -15964, -13452, -20286, -26322, -17697, -20124, -20211, -17076, -16779, -18749, -34467, -37987, -39526, -34658, -23415, -28349, -38551, -50541, -47026, -40779, -39011, -36080, -29052, -30499, -22877, -30908, -32274, -25923, -26123, -40229, -44410, -43829, -35263, -27850, -36993, -39705, -36353, -30401, -34116, -32269, -24977, -20816, -16405, -18976, -20942, -28747, -26884, -29785, -33678, -30563, -13111, -7600, -8556, -7206, -3150, -6179, -17168, -22810, -19075, -17056, -31986, -35091, -31643, -32429, -33194, -19778, -14073, -7662, -6919, -11719]
16113a1719j6133j8410O168J4220J2579M118Q881L583J702j0380j4286j0408m057
16100c4142L04J2587N474P936L855k626k641m220j562j0572k577M1L774J981l85
16085b2773M900m934j2104K578K922l052J823J882o871j283Q62M736O068L640
16071b1606r24p807P722L572j40O534n9q847j0815M096j437L098O262m72m012
16056b4835L789P614o50L406p240J901K446N54O308Q135k593n310k769K183M2
16041g019K346Q914j2709j1986j0544j698J3509J7378M655j4628j0424L357M385
16028a4464K047j0051q022J065M873j36Q3K503J01J375J0334L935j3877j301J775
16013a9760k753R92r792K011J6384q73l844p294K61P21Q63o968j7597j6032M044
$$ y = [-11719, -27852, -46262, -40094, -25874, -13295, -9177, -296, 3287, 4989, -5391, -19677, -30085, -34142, -33838, -21251, -15777, -7841, -3986, -6612, -9253, -13473, -15035, -25607, -28184, -28143, -24369, -22388, -22773, -17873, -22807, -34911, -32333, -29411, -32463, -30640, -28758, -35629, -36912, -36050, -31314, -25246, -21606, -22530, -30337, -22615, -19043, -19183, -12649, -12708, -21555, -32370, -28274, -29711, -26613, -20351, -20823, -24835, -21046, -13432, -14082, -10676, -17916, -16015, -13569, -13015, -6707, 1428, -1165, -6475, -9244, -7061, -7019, -4673, 4241, -8468, -20454, -30998, -32696, -19187, -1809, 2846, -11782, -22206, -18849, -14464, -12417, -22468, -30490, -29425, -24552, -24688, -24605, -22102, -22001, -20626, -10292, -6357, -20234, -21535, -19760, -22513, -21521, -31313, -29302, -12918, -13791, -17635, -24929, -24668, -23947, -23084, -30052, -47649, -63681, -59637]
15998e9637J4784L853K649O902J8648O073J0928J1152n953j2941n670r079p658
15985b5949J623j2372q035O130j349J54N70j598q298Q513J3873k536j4048q22
15971d4144p76N93O792Q061q48K204N026J621l894m838J4477P187P475O837j2848
15956g075j9910r961m403n148L474O551l413r159J764q1J2947O205k141J0112
15942b0238N147r198k05R456O297l074K232n965n815j898M494L593Q65j2945p025
15927c4279p3K955J108k02n346P465K1025n95p902j1902L017K0873O458k0828
15913a8226n445K45K944J4556q876m017J728L022q758N616O531O606l147r820
15899a7041o499L087K67k60Q559N054j223P55R555j533J541J0187j517r885o186
$$ y = [-59637, -44853, -41000, -38351, -31449, -12801, -6728, 4200, 15352, 9399, -3542, -9212, -18291, -25949, -24326, -36698, -44733, -38603, -39952, -39798, -39228, -40826, -49124, -40611, -26738, -29274, -43322, -44144, -44920, -44327, -37535, -29474, -30322, -28118, -23092, -21471, -25365, -30203, -15726, -8539, -1064, 5773, -7075, -26985, -36946, -41349, -46497, -43023, -36472, -39885, -49044, -47280, -47361, -34414, -28209, -30350, -20238, -15091, -24289, -24494, -15038, -8741, -11815, -9583, -15548, -21363, -23261, -18767, -15174, -14309, -27254, -34279, -34352, -31397, -30289, -30491, -35837, -28372, -7347, -7942, -15844, -27746, -24729, -3856, 2602, -18226, -23671, -23426, -20482, -5926, -14802, -18819, -17091, -14069, -22827, -17211, -10680, -4074, -7221, -17041, -23540, -20453, -20186, -20446, -11887, -6833, -8056, -7301, 2254, 721, 2262, 12449, 10932, 1047, -5139]
15884e139j339o382k478j845r12j4921j0114J3919J1413L625K477K306l562r030
15870b1982m316k779L636n432Q736O745r20K040l029j390J487l434O314q253o98
15855b3275J345k179K121L639l539q157q898k872K545J0605l260j2231Q270J060
15841c4826J40M068J19L56M902L587m481M7N294Q38r664k103J236J622p698j047
15825c7610M230O147P36L109N367j1o188j8484n380M164Q371J2322Q60j068L97
15810b3038P001R973M09j3130p472l576Q685J54N98k866n93p45J790Q867M134
15795i809n024j0852r648M801P806j2522p626J779K2093M703j4807J448k450l756
15781c3864M156m538N837R028k329J20N342N457j751N847O60l418l122J600O263
$$ y = [-5139, -6478, -12860, -15338, -17183, -18095, -33016, -43130, -29211, -17798, -14173, -11696, -9390, -12952, -21982, -26298, -29077, -25441, -30873, -22137, -15392, -16312, -14272, -17301, -18691, -17204, -20638, -14324, -22577, -23275, -21930, -24109, -21988, -18349, -21888, -30045, -38943, -41815, -39270, -28665, -31925, -44156, -35886, -34826, -34686, -30618, -30499, -30143, -25241, -21654, -26135, -26088, -20794, -19956, -29620, -31723, -30487, -28865, -36563, -37610, -33380, -27233, -26497, -23388, -18021, -18032, -24220, -42704, -48084, -43920, -35549, -23227, -22367, -23435, -23038, -16037, -6064, -5655, -18785, -26257, -29833, -21148, -20994, -20396, -23262, -23855, -24600, -22810, -13943, -9809, -14833, -25685, -35333, -30532, -22726, -35248, -42874, -41095, -19002, -14299, -29106, -27658, -30108, -33864, -29708, -34246, -28409, -19381, -21710, -21590, -16248, -10791, -12542, -6695, -6035, -9453, -12575, -10975, -4712]
15766d712o926j4830n10m124k152N643N498J315P11J753R746Q775q69r248q085
15751a8015j750J1092M816L814P389N670j5463q365l870K784l847K173J857P323
15737d392O735K270l275K94R76q316o225q814l487Q598L522j233j873m639P751
15722a2108k134j320Q058p635p971j126L633Q355O500L800j1334k231P569O640
15708a304r341q401n887o830Q05J2112O260N09J346P016j1969j2979k666M439
15694b6890P460K327k428k541P027J1089K066p97o110p92k869J644N089J005r042
15679a3762p225L197p073J064l475k401R459J0242N974j631K973Q683j5189q990
15665a8154p486q39M175M193q268l855j115J363O342J3761q739q733l382J1168
$$ y = [-4712, -11638, -26468, -26978, -31102, -33254, -27611, -22113, -20798, -20087, -18334, -8588, 187, -682, -9930, -18015, -19765, -8673, -3857, -43, 7346, 13016, -2447, -10812, -14682, -11898, -15745, -13572, -11715, -4392, 2343, 4613, 1338, 1632, 2608, -5708, -11933, -20747, -24234, -15636, -12114, -13347, -15220, -19859, -12108, -14242, -15562, -7504, -15139, -23110, -24236, -20603, -12248, -5748, -1948, -13282, -15513, -7944, -1304, -10645, -19046, -24933, -31763, -30958, -18846, -12586, -12077, -10731, -3715, -15684, -28663, -31329, -26890, -19430, -17103, -19531, -22072, -15045, -3956, -1890, -2687, -8797, -9589, -12458, -10814, -5725, -4720, -13762, -20987, -17790, -24863, -23799, -27274, -29675, -20216, -9974, -4000, -5631, -2658, 6025, -9164, -18154, -25640, -26479, -22304, -18111, -26379, -30234, -31349, -29986, -23644, -9883, -18622, -27355, -30737, -19569]
15651a9569O919r761R13M253l542K878L120K314J051J296o638o097k267Q926l71
15636a6575l648k10P064r272L437M778j524r741k775k199K465k502M524j031O601
15621b0608l455n871q58L931J3939J3887l804j6342j416M506o221k068N050L319
15607a6011o515P72M386j526l892J070o26O215Q820o979m169N256P248K239n49
15592d261m392q078k817R332K252m737J0270j882p43J092K234q839J0070m142
15578d641n752j286J013p522o600p076J0891Q520J257m656R736J2047j600n479
15564a148k132J387j0393n642R028P516J199j388L241L796m96j8315p084N562
15550a4869J123K382O419O504N424n23l238K334K614n166k740j1708n148l455
$$ y = [-19569, -12650, -22411, -21498, -17245, -20787, -17909, -14789, -12475, -11424, -10128, -16766, -22863, -25130, -16204, -16575, -20223, -20433, -13369, -22641, -19204, -14426, -15950, -25691, -28466, -30665, -28200, -30702, -26178, -27209, -20608, -24063, -29934, -30792, -26861, -12922, 965, -2839, -19181, -20597, -16091, -22312, -24380, -19330, -16011, -22526, -21754, -17368, -18894, -22786, -21716, -22342, -16127, -7307, -14286, -18455, -13199, -5951, -3712, -4261, -8653, -16731, -19548, -10216, -7964, -12701, -2431, -4313, -5056, -3964, -1730, -10569, -499, -4641, -10393, -11679, -10666, -18188, -24788, -31864, -20973, -12453, -11196, -15852, -6116, 5931, 4331, -1148, -3280, -1893, -12286, -17928, -8900, -1384, -185, -1573, 1668, 5464, 4968, -13347, -20431, -14869, -13746, -11364, -4945, 1559, 6983, 6460, 3222, 5556, 8170, 3004, 264, -11444, -16592, -20047]
15536b0047o053O446N122K750k150r392K934L763j3373l732N620k138J2498J684
15522a6068j31m305j0996q696R545J4444Q790j385l155J80Q679L351J786p064
15508e025j4962m085O525m175l452N723m174K240J961M132N816O587k295o854
15494a2038j063L028p540n726q02j2147r374K741M008o350k886n092K214J1052
15480c9975J3014L659j3337O35L483L57j818l163M745j073j456M202J1243L534
15466a5950n535o259K9j067r299r385L109R751N256k645M094M258k290O205J828
15451a7900r236J444J759k286O808O333J234J673k991J618L679J2891k813j6737
15437a4524r165J307M102m087P82j491j600Q189Q154K974M470q2m899j2628j063
$$ y = [-20047, -26100, -19654, -14532, -11782, -13932, -23324, -20390, -16627, -30000, -33732, -28112, -30250, -17752, -16068, -16199, -20504, -31500, -40196, -30651, -16207, -7417, -8802, -11957, -11777, -3098, 253, 2039, -5025, -19987, -24072, -17547, -21722, -25174, -19451, -23625, -21385, -19424, -15292, -9476, -2889, -5184, -12038, -13101, -10073, -17613, -23339, -24141, -36288, -45662, -42921, -38913, -45263, -48149, -53241, -51027, -39975, -26961, -23302, -36639, -36004, -32521, -32164, -33982, -37145, -32400, -33473, -34929, -30727, -19484, -15950, -21485, -27744, -27715, -28782, -38081, -47466, -44357, -34606, -29350, -31995, -27901, -23643, -25933, -19728, -17900, -27136, -25692, -23933, -26219, -19411, -13078, -11844, -10171, -13162, -11544, -7865, 5026, 2213, -14524, -23689, -22382, -18280, -22367, -21585, -23076, -24676, -16487, -8333, -5359, -889, -971, -5870, -18498, -19561]
15422a9561j311j3006K062L214O017P547j803j13l323r52n018j377M86L821M410
15407a8907n557n660P055L232L116r539m035l972q172n099R706J1023R412q03
15393a8200p643r030N837N752j277N010L309Q0m690j4757j0488J4405J5316K061
15379a4315r713K213j781Q776M158p210m206j2139o959Q325J5347L30m757m52
15365b2383K410n044j55R441P857p555r333k369l419Q019J8986O297k672m692
15351d612m169J657j175n271j2973p276Q475J2572k451L934K181J0542r9j3127
15337a1792n84K017N865j0553j2212j4969m508J1197J1416J1830R227p357l833
15324a4256O78J070l437l838L034K683n073O019O518K408l069K075J233N627n678
$$ y = [-19561, -20872, -33878, -31816, -28602, -22585, -15038, -16841, -16954, -20277, -21229, -26247, -27624, -27138, -23317, -18907, -24464, -30124, -23069, -19837, -16721, -26260, -30295, -34267, -42439, -47538, -37832, -26809, -17397, -18200, -25843, -34873, -29036, -23284, -24561, -19551, -16242, -16162, -20852, -35609, -46097, -31692, -16376, -14315, -24028, -21815, -23596, -14820, -10662, -17872, -22078, -34217, -41176, -32851, -17504, -17174, -21931, -22383, -19973, -25017, -25172, -15731, -7874, -15429, -24762, -27131, -30550, -22531, -3545, 2752, 80, -4612, -8781, -7124, -8299, -13570, -26543, -33819, -25344, -12772, -15223, -11289, -9108, 1434, 1335, -11792, -12376, -10359, -4494, -15047, -27259, -42228, -46736, -35539, -24123, -12293, -3066, -10423, -14256, -13578, -12508, -15945, -19783, -16749, -14066, -19139, -13120, -6602, -4194, -7263, -5188, -3955, 1672, -4006]
15309d006j2343M736L039m912o53j4950j773n422J437K715J705m99j825Q679J4683
15294i389Q872M912l304j0403p621L298k736m074N83N648j1932q511O303N131
15280b3223J4598N634j0275n198K512p282Q93M789k511j0904M92k577m190J2747
15266b4495R150J527l265l080o811M328l058J414M433l752N43j18J5023J591j961
15251h531Q844K212l733r101K70N971r632n764k102j077Q823N758r476l054P087
15236a3505o467o669N036n22Q85n02L34j548J0531P192q988r336o140q402N096
15221c3005J3707R191N402m254L469M704o921j1652O58J1916m772K777j950l219
15207a3949j8848k606j790M413J9855O273P68M846k238j9782r507K452R756N909
$$ y = [-4006, -16349, -11613, -8574, -13486, -14139, -29089, -30862, -36284, -34847, -32132, -30427, -30926, -32751, -24072, -9389, -517, 4395, 1091, -9312, -16933, -13635, -16371, -20445, -19862, -14214, -26146, -34657, -28354, -23223, -8625, -2991, -13266, -18464, -15952, -23234, -22341, -17552, -20063, -30967, -30475, -33052, -37242, -24495, -15345, -13818, -17083, -20163, -26974, -22646, -25704, -24290, -19857, -23609, -23066, -23184, -8161, -6570, -8531, 313, 2525, -1208, -10309, -10039, -4068, -13700, -19464, -21566, -22643, -13820, -8062, -17538, -20592, -13505, -19972, -26641, -21605, -22127, -21242, -21744, -21410, -22958, -12427, -5235, -14223, -23559, -29699, -38101, -33005, -19298, -10107, -4705, -8959, -5490, -786, -7707, -19359, -18701, -6785, -11557, -8780, -10730, -13949, -32797, -35403, -37193, -32780, -12925, -6652, -5884, -1038, -3276, -23058, -32565, -30113, -20357, -14448]
15193a4448M447L812J078q935K220j82l541k985L397J265j130L201K038p838J673
15178a5928M541K814m150j3229O780P412M964l630m873r528J027N350m72K714
15164a6208l148k940j978J001K867l409J768m199l382M142M175m815l865N294
15150b4697Q812r732o947m705q296k679Q979J3421N122P819O97m864M000j095
15136a4165l208M43j085o275K40j443L04J339L265k368o682K781R992K486q109
15121b2485j2106J1319J4527l083P12N042R122J778j1366j2286m709l558L802
15108b3291P343L06j443p74m898j6248Q062P134L128L234J113K488o221j4361
15094c4428R62J164R6j100J775k14k030K409K080P021J4380J0344Q2o452m892
$$ y = [-14448, -10001, -6189, -5111, -14046, -11826, -12008, -15549, -18534, -15137, -13872, -15002, -11801, -9763, -17601, -15928, -11387, -8573, -12723, -25952, -19172, -11760, -6796, -10426, -15299, -24827, -23800, -18450, -18922, -16208, -19356, -22296, -24274, -23273, -20406, -23815, -22047, -26246, -29628, -25486, -21311, -26126, -29991, -24697, -15885, -25617, -32564, -37269, -45565, -48244, -39265, -25844, -20722, -12903, -12206, -17070, -13070, -14165, -17373, -16930, -18015, -24290, -24050, -25493, -25189, -23850, -20585, -22953, -29635, -26854, -16862, -14376, -22485, -34591, -23272, -8745, -11828, -11116, -6074, 3048, 4826, -6540, -18826, -23535, -27093, -23291, -15948, -15642, -17085, -17859, -22757, -39005, -30943, -23809, -20681, -17447, -16334, -13846, -20067, -34428, -33466, -32302, -32206, -33306, -31531, -31745, -33775, -31366, -29286, -22265, -7885, 2459, 2541, -3911, -8803]
15079h803K397L469k56M536k417l773l666p688N043M956p020K001O596o523J47
15064a1001P46J0870k793p172k333o258j871k603n52M842M17l673l197j061K59
15049b5380o38L220O72M164o108j2605N969P404N72L626k935Q980P714O88l488
15034h145j383j1513J430j174N670J767k429J1023m270l277L498m229l015n70
15020a6617L282N227n639O923R111K96J143r782l365q300j3262j636J6754J0436
15006e429l949m981L280J6986j2977j1576j36J756K888J0719L664r88m737j0732
14992a6212P510J092o761n471l580J316J9138P740j6701l603K753O264Q33N46
14978e136j461m23N240p143P46P33M658q216k746k136L341j245p583o64M932k003
$$ y = [-8803, -6406, -2937, -3193, 1343, -1074, -4847, -8513, -16201, -11158, -6202, -13222, -11221, -4625, -11148, -11001, -10255, 615, -2178, -9350, -11683, -17941, -19812, -22415, -22967, -18125, -17708, -21381, -24578, -25639, -25380, -26018, -22798, -22126, -17962, -24070, -36675, -30706, -23302, -22730, -19104, -22039, -13059, -5345, -4657, -8145, -9528, -21041, -19611, -20785, -15115, -13348, -15777, -4754, -9024, -12301, -8803, -13032, -16047, -16617, -13335, -8108, -13747, -6824, 2287, 2583, 3726, -6056, -9421, -17721, -30983, -32619, -15865, -5429, -9378, -14359, -11079, 5907, -7070, -18646, -18782, -17026, -14138, -3419, 245, -743, -5480, -16212, -8702, -7610, -14371, -19842, -23422, -22106, -2968, 4772, -11929, -15532, -12779, -6515, -5682, -5136, -6597, -7020, -1780, -8923, -8177, -7444, -2786, -11002, -13748, -15884, -12543, -13788, -21371, -22035, -17103, -19106]
14962a9106n127J2743M032q340J071k755J663K196K784O472J610p05K862m088
14948d688n17N690q275n199n623o071j667m894Q08N669J6729k74j874K628j690
14933i248r566o979J0696P027l750j1870L939J567J2360K951n551m24l712J913
14919a0647m3j486o86N291M883n838O918q507j0492Q316K356j40Q981m794L424
14904b464J360o148m594k623J1325k048P257n625m213L922n971j1099m071K053
14890b2939J2034J2766R095l934L666k183r873J2130p329J803N521j6177k1829
14877b7249O174J5550Q283J424q069K602M975P432N437o274r284m729k796N001
14863a523L913j337q568m291M075P946k278n431k045J0282J0636P552J3950j178
$$ y = [-19106, -24233, -11490, -7458, -15798, -14727, -17482, -15819, -13623, -10839, -4367, -2757, -3462, -600, -4688, -5205, 485, -7790, -12989, -18612, -24683, -26350, -31244, -30436, -24767, -8038, -8312, -10186, -7558, -9248, -18814, -25793, -15097, -8070, -11820, -23690, -19751, -18184, -5824, -2873, -8424, -8848, -12560, -10647, -10690, -12176, -12862, -7571, -2688, -8526, -1608, -10115, -20607, -12291, -9935, -10075, -1094, -5888, -2464, -1104, -7252, -11846, -14469, -3144, -5192, 2065, -3560, -7773, -3851, -9822, -20921, -24992, -22939, -10905, 1861, 10956, 7022, 10688, 8505, -1368, 10762, 3433, 5236, 10757, -5420, -27249, -21075, -5525, 2758, 4182, -3887, -1285, 3690, 11122, 16559, 10285, 1001, -3728, -6524, -1523, 2390, 1053, -7515, -11806, -7731, 215, -2063, -7494, -9539, 743, 11379, 18931, 32881, 31703]
14849C1703O949M699J2206J2705J0575K7392M7491N5449Q8987J62279K94583N22630
14837A277648N76441J02093k69021l75515m17478l06729j88155j08662p5692n5037
14827A59893l7829j8108j6273j8839j3089n704M204p516j3145j3589o936P63J049
14814A4881j399K028l516M275l984j5870j528m573P439L233m013M917J0555j397
14800A1048m315j0859n766J022j768L99k968R10n860L069Q406o730k218N368J650
14785h612L649J845j578m482P79l832m703R541M204n526N857j166p051K350L634
14770e091K560Q725j47p119K91N92j0538Rp71p01N939R70L00k459L668J1580P463
14753A5271k485q340r737k593M052J595O217o099j2871K023O359M547L902j5766
$$ y = [31703, 38652, 43351, 55557, 68262, 78837, 106229, 153720, 209169, 298156, 460435, 755018, 1277648, 1854089, 1956182, 1687161, 1311646, 894168, 587439, 399284, 290622, 214930, 159893, 122064, 103956, 87683, 68844, 55755, 50051, 54255, 46739, 33594, 20005, 13069, 13832, 14881, 13482, 15510, 11994, 16269, 12285, -3585, -5113, -9686, -2247, 986, -3027, 1890, 12445, 11048, 6733, -4126, -9892, -8870, -10638, -10239, -13207, -12297, -18157, -15088, -6682, -13412, -15630, -10262, -8612, -4963, -3118, -4696, -9178, -8399, -12231, -16934, -7393, -3189, -8715, -2858, -4024, -11075, -8725, -5091, -2531, 6194, 6047, -1072, -781, -189, -10727, -10718, -11489, -12190, -6251, -5281, -4981, -7440, -3772, 7808, 15271, 12786, 4446, -5291, -7884, -3832, -2237, 3980, -2119, -14990, -12967, -6608, -2061, 1841, -13925]
14739a3925p979L78J0712J7985j895q251p499n340n608O605J3041M284j233j709
14725d34j8371q831K285L43K229N870j792o189K531P956j99K100P533o29K47K559
14709b792m245j386k122L717m637K219j945K195L430l402r117k92K717R83J723
14694a2954m981K28Q114J7452K772j1965j2328L510K106P279j650L052l784o149
14680i298J1088K513j3370o528m685Q468K552l094J819m343k036o176M99K102
14666b0489R85J1897l567o95K637n478J0479J2135k86n831N691O31n55o850O02
14651A306p15l525Q31j668o577K713k179o658l413j4733O253J4690M195o953M012
14636a2421P819j554j35J769o548q667j596J0048J697m495O771n062l887k261
$$ y = [-13925, -21904, -21526, -10814, 7171, 5276, -2975, -10474, -15814, -21422, -14817, -1776, 2508, 1275, -434, -18805, -27636, -25351, -25008, -22779, -16909, -18701, -24890, -22359, -14403, -14602, -12502, -4969, -5598, -5351, -2792, -7037, -8423, -10545, -6828, -11465, -9246, -11191, -8996, -5566, -8968, -18085, -18377, -15660, -14677, -12954, -17935, -17707, -9593, 7859, 10631, -1334, -13662, -10152, -8046, -767, -2417, 635, -3149, -9298, 1790, 4303, -9067, -15595, -20280, -11812, -9260, -12354, -10535, -14878, -16914, -23090, -22591, -20489, -19504, -7607, -11174, -11869, -9232, -14710, -4231, 7904, 7618, 1787, 7478, 8109, 7554, 704, 1306, 591, -2934, -2103, -3771, -10348, -7635, -9814, -16472, -19885, -34618, -28365, -13675, -9480, -16433, -12421, -4602, -6156, -6291, -4522, -11070, -19737, -21333, -11285, -9588, -14083, -7312, -12374, -16261, -18522]
14622a8522Q764K177q776j2231N34P667O871m377k791R929M040P861K765o412
14608b501l337m955q756L848P273o469o844J552n00M676M571J759R402o539l890
14593a0710L245O450n50n657M677J0588k634n291j370l511m838k280m418M927
14579a1372m393P369N874M620K143j796k133O52K167k0901j823N337J555q03k102
14564a5606P950p693m637N357M817l900R640o222j831P192O165J434p691L166
14550a859Q058p668m670q98m91K538M653k177k821Q393k223o841K72p606j485
14535a4825O446L016p582m104J792n249k834N318P111P981K343p456p413L70Q061
14520g025L165m561q144O150J0259j40p48j7219l394Q168R117K049M706L432n842
$$ y = [-18522, -9758, -7581, -16357, -28588, -28054, -20387, -13516, -17893, -20684, -10755, -6715, 1146, 3911, -2501, -5838, -10793, -19549, -15701, -8428, -14897, -21741, -20189, -20689, -16013, -11442, -9683, -281, -6820, -10710, -7465, -1015, -1565, -7222, -2545, 8043, 5409, 118, -1252, -4763, -9601, -11881, -16299, -11372, -15765, -8396, -2522, 2098, 4241, 2445, 312, 964, 3131, -17770, -19593, -14256, -12701, -13504, -15606, -7656, -15349, -19986, -14629, -9812, -13712, -4072, -10294, -12125, -4933, 1232, 2666, -5025, -1859, 6199, -1469, -6139, -7037, -7528, -4990, -337, -2514, -5335, 3058, 835, -6006, -5734, -13340, -14825, -8379, -5363, -12945, -17049, -15257, -20506, -23340, -18022, -10911, -2930, -587, -8043, -15456, -15086, -7025, -3860, -8421, -16565, -10415, -156, -296, -1044, -18263, -21657, -13489, -4372, -2323, 2383, 5815, -27]
14505b7j0296j250m203n86L351o032j9m006J039N120k814O30J0593N348Q173l79
14489D642o784j0813o103l617J0845J0734m140p880L35N708J0348J9j0908l575
14475a1189P289J0129n766m702P847k11n819l946R933M929m246M492L265q379
14461C626j7198L230J3229J690q644q972j341O708M095j477L68p172m215N37J698
14446a3838K621Q192K277M204m089m244M6j1855N443J2478J787K730m277p184
14432e709o724L947P596K440j16m603j963o354k118j334m369L647R985N044K888
14417B257m369n903K930R842j726l769M776M696K772m500M203j464p246j2073
14403i574L928j912O789M348o966j1080L410J904K278J134N813l824q41L419K262
$$ y = [-27, -10323, -11573, -15776, -16362, -13011, -19043, -19062, -23068, -22029, -16909, -19723, -19093, -8500, -3152, 5021, 4642, -2142, -12955, -19058, -22675, -11830, -1096, -5236, -13116, -12781, -7073, 3275, 3294, -7614, -11189, -3900, 6229, 463, -4239, 3608, 3397, -2422, -6368, 3565, 8494, 4248, 8740, 12005, 3626, -13572, -10342, 2887, 4577, -4067, -13039, -14380, -7672, -3577, -5054, -4686, -11858, -16073, -15536, -13838, -11217, -3025, -748, 3456, -633, -4877, -4831, -16686, -11243, 1235, 3022, 5752, 1475, -5709, -12433, -8486, -890, 1550, 1434, -3169, -5132, -11486, -13604, -14938, -19307, -15660, -5675, -631, 2257, -2112, -8015, -5085, 4757, 3031, -738, 4038, 8734, 11506, 7006, 11209, 9745, 2499, -9574, -5646, -7558, -769, 3579, -3387, -14467, -11057, -9153, -6875, -5741, 72, -3752, -4593, -1174, 1088]
14388A088K198o468o49k491N961j465j209k586J131j215M539m944n781K979k20
14373i132L217K067l923k359J201J371m10r977N674J4203k828j696k338n8k086
14358g074J0549N41l301k74M1L633P421m101k932o105l621J4096M993K029n933
14343I962r683j0327K194q476m84J4430J4020k164k334L75J50l969o903l948n490
14328a2647P5J2725N032M62o411m529O61l503O759O015j744p664j971M476K162
14313a02L201l669n796k96l505k258R808Q500o28o866j5768J654j36m988O644
14298a4205O113l967P001J2368J425M504L390j2878m176K731l968l820o612n106
14284a7200L650Q892l117q499J75J4010Q925o914o93J288L267K277Q98j588M736
$$ y = [1088, 3286, -3182, -3831, -6322, -361, -1826, -3035, -5621, -4490, -5705, -1166, -6110, -11891, -8912, -9132, -5915, -3848, -7771, -10130, -8929, -7558, -7968, -17945, -12271, 1932, -896, -2592, -4930, -4988, -7074, 3475, 4016, 715, 441, 482, 4115, 11536, 7435, 4503, -1602, -5223, 8873, 13866, 15895, 9962, 279, -10048, -7854, -16330, -16814, -2384, 11636, 9472, 7138, 7513, 7663, 3694, -3209, -7157, -12647, -12572, 153, 5185, 5647, -764, -5293, -4632, -8135, -1376, 4639, 2895, -4769, -6740, -2264, -102, 3099, -570, -6366, -6662, -10167, -12425, -2617, 5883, 5255, -1611, -17379, -15725, -15861, -20849, -14205, -8092, -12059, -5058, 7310, 8735, 13239, 16629, 3751, -425, 2306, -1662, -5482, -12094, -17200, -13550, -4658, -7775, -16274, -16099, -2089, 6836, -78, -771, 517, 3784, 6061, 6959, 5371, 10107]
14269A0107k768J244O72k831P14k759L304l34j105o317j2944k288O799L802l138
14254g842R56J962k126J2153N476r66Q744j3652j1439M605k372m263l37J490k754
14239a0365r317J891L158J11J420L270L305R523o255r823l503O751N537k702j722
14224h721N731j4683n414J1463J1380M878l442k110J037j1240P133M224K311l178
14210f31L171J0453N23n337r447j814r522q963k479K190N492R024J1763q806p916
14195a2299m39O01k559O240L750q58q399M75n332R337R559J096L797r922L054
14180a899j240l650K099K84J103O497K406K144j3108r549L831L634j402N854O670
14165C674J63K98P520l230L164m565j3351p835L492M692Q739N774J0834J081j0116
$$ y = [10107, 7339, 8583, 9255, 6424, 7138, 4379, 7683, 7349, 6244, -73, -13017, -15305, -8506, -4704, -7842, -6886, -4924, -7050, 5103, 10579, 9613, 18357, 4705, -6734, -2129, -4501, -8764, -9101, -7611, -10365, -19682, -17791, -14633, -14522, -13102, -9832, -6527, 2996, -3259, -13082, -16585, -9834, -4297, -6999, -8721, -2990, -17673, -23087, -11624, -244, 4634, 1192, -918, 119, -11121, -3988, 236, 2547, -631, 2540, 12993, 13516, 8179, -1268, -3082, -12604, -21567, -24046, -21856, -16364, -7340, 4423, -4383, -12299, -12738, -12137, -14696, -8456, -4706, -5564, -13963, -13488, -18820, -9483, 76, 1172, 4969, -4953, -1899, -3139, -6789, -4690, -4406, -3303, 3194, 5600, 7744, -5364, -14913, -11082, -7448, -8850, -2996, 3674, 3837, 4135, 11655, 8425, 11589, 7024, -6327, -14162, -10670, -5978, 2761, 8535, 19369, 20450, 10334]
14150A0334j361J1326K188n541o640J16L261N622q989r706Q801J4582j1401j4492
14136a900l10K985n543j943l854K8J1201P791M571k515j3132p588K268R471K0907
14121B2437R916j5374r800l13p635j673m283o35M109N102N549M511o176n109r27
14106c01j616J541Q977l49n114L69r31q870m28j066Q741O410P12J243l985p431
14090b098P79N177j966k900J222L356J0202Q605n830n051n297q631k371k017j760
14075h580L689J869J358M419k691J777O715m64M76O786o272p133j6847L909N941
14060e048p441m155M693M490K939J3390P425j2831j4609n333o214L099O440L584
14046i571J2236J0538M16j1813j2660m256J501J104j217K964m2p179N262K135
$$ y = [10334, 8973, 20299, 22487, 16946, 10306, 10422, 13683, 19305, 10316, 610, 9411, 23993, 12592, -1900, -2210, 775, -4768, -6711, -10565, -10537, 664, 8455, 13026, 10511, -2621, -10209, -7941, 1530, 22437, 32353, 16979, 7179, 6866, -769, -2442, -6725, -7360, -3251, 1851, 7400, 11911, 5735, 626, -301, -1917, -376, 8601, 8252, 3138, 3507, 2576, -6294, -6722, -7788, 953, 7363, 8075, 9318, 5333, -2098, -1319, 3858, 1892, -1008, 214, 3570, 13772, 22377, 16547, 11496, 6199, -2432, -4803, -6820, -8580, -4891, -3022, -1664, 2755, 64, 1841, 8556, 8092, 8568, 15354, 9082, 1949, -14898, -10989, -5048, -12489, -16644, -11951, -7461, -4522, 8868, 16293, 3462, -11147, -16480, -22694, -19595, -13155, -9571, 2665, 13203, 13619, 1806, -10854, -15110, -13609, -12505, -13722, -10758, -10800, -17979, -12717, -10582]
14032a0582O672P289K061P238L089n116j2885q201Q295p521l448R092P265K876
14018F124R62j893o39P911Q337r93l590P231r016j5370j5759M635k098L049j07
14003a1216N432P836J0954o216n871j726Q025P144n226N243R580l246o180r039
13989E494q340N818j640j019J784j95N358L297Q094p35J42p107o615r999O55m092
13973i100n16J195L364Q263P780m386p717K920Q487q853p795R035M129l686j96
13958B924m698M221P177N359L395q205J76N476p488j5228k780N068O014M1P490
13943H942J0861q735n667l972J189j732r852n237m166N590K0396K238K799l691
13929H963j3677n375J0989L496n399m255N252N8J3251L514n641r703l219J951
$$ y = [-10582, -3910, 3379, 5440, 12678, 15767, 10651, -2234, -10435, -2140, -9661, -13109, -4017, 3248, 6124, 7086, 5193, 4554, 12465, 20802, 19809, 16219, 23450, 14434, -936, -16695, -12060, -14158, -11109, -11216, -5784, 2052, 13006, 6790, 919, -807, 7218, 14362, 9136, 14379, 23959, 20713, 14533, 5494, -2846, 2972, 1332, 313, 2097, 1902, 7260, 10557, 18651, 17916, 18058, 10951, 4336, -5663, -5008, -9100, -9616, -8421, -5057, 3206, 10986, 6600, -1117, 1803, 10290, 1437, -6358, 2677, 6806, 3120, 2924, -1774, 2447, 9624, 14983, 18378, 10173, 10349, 15825, 8337, -6891, -9671, -4603, 1411, 1452, 8942, 19803, 11068, 5401, 1429, 2618, 886, -8966, -14203, -18369, -12779, 7617, 9855, 12654, 8963, -4714, -10089, 900, 4396, -1003, -5258, -6, 52, 13303, 16817, 11176, 1473, -1746, 205]
13915B05R332m33l142o118J960P75l817p901Q64l569o886J1143J0667M042J707
13900H829M213k54m841p981l893J461K125j0444m585J0355M447L794O819K829
13886A2874L32m711l778N75J8225J5468j021j1868j4173l414j2127j132J438K503
13872h09K609L976K12m193L615R338P85p030K962o71j214M433l818M485n845j0943
13856b108L646k26M546M790r30o258j875L224O408m03m866J6229N083q236K532
13841B1556L279K197r522j2611O00P501P259R92p613n279p30J20J9N273K642K369
13825A8052L905N982O68O362m412q928l031q82M189n841r156O56Q337l898J428
13810A3431Q70N118o387k739L059K4R04p484N719O110P485m808j0946k243P163
$$ y = [205, 9537, 9104, 5962, -156, 1804, 2579, -1238, -9139, -8275, -11844, -18730, -7587, 3080, 7122, 8829, 13042, 12788, 7947, -34, -3927, -2466, -341, -10785, -15370, -5015, -568, 3226, 10045, 12874, 13206, 8495, 4717, 5292, 23517, 38985, 37964, 26096, 11923, 8509, -3618, -4750, -3312, -809, 1800, 5776, 5988, 1795, 5410, 14748, 15533, 8503, 11465, 10794, 9580, 14013, 10195, 14680, 8835, -2108, 1538, 1312, 5858, 10648, 9718, 3460, 1585, 4809, 11217, 10814, 5948, 22177, 27260, 19024, 21556, 24835, 27032, 17510, 4899, 5499, 13000, 20259, 21251, 13638, 8359, 7629, 7749, 7768, 13041, 15683, 18052, 21957, 27939, 28607, 34969, 30557, 21629, 18598, 17716, 21905, 16064, 6908, 7564, 15901, 12003, 13431, 14301, 19419, 13032, 10293, 13352, 13376, 14280, 6796, 12515, 18625, 26110, 21302, 10356, 8113, 15276]
13795A5276O14k448p706q570M675j66q400O979J3034L86O300J1683L038k045L635
13780C6285O564Q83j1242j1219J3200K765j0626q094q161j92M618j92m181L740
13766A4148J908n833m556m358o370J2187J1393n751m620l71P844P829r519n576
13752H355J113M59J758j804L240J3936J686o017Q345R013k448J225j386k70L945
13737D1150Q435M485K066n504L214j155P058L329m392r050j213j974j170J574
13723D6853r570o223r619p929m05K992Q542K546l561j722O77j4899l214O883Q75
13708A2226m514n563K814R490P856P97j6321j2690N759J646N543M594N833R772
13694B7242L010r741j3290K537Q663P736j871p257L494L879n457K529L794l245
$$ y = [15276, 15890, 13442, 5736, -2834, 1841, 1675, -6725, 254, 13288, 13674, 19974, 31657, 34695, 32650, 36285, 42849, 43732, 32490, 21271, 34471, 37236, 26610, 18516, 10355, 10163, 14781, 14589, 10408, 14148, 16056, 10223, 5667, 1309, -5061, 7126, 18519, 12768, 8148, 7777, 15621, 23450, 13931, 8355, 9468, 9927, 11685, 9881, 13121, 27057, 28743, 22726, 31071, 40084, 37636, 38861, 37475, 37205, 41150, 49585, 54070, 56136, 50632, 53846, 52691, 59749, 63078, 58686, 49636, 48423, 46449, 45279, 46853, 37283, 31060, 21441, 13512, 13107, 16099, 24641, 27187, 23626, 21904, 22581, 7682, 4468, 11351, 12226, 7712, 2149, 4963, 14453, 22309, 23106, 6785, -5905, -146, 1500, 7043, 11637, 17470, 27242, 30252, 20511, 7221, 9758, 18421, 26157, 24286, 17029, 20523, 24402, 18945, 21474, 25268, 22023]
13680B2023o936j1001N19j182k636l874k185l703J572J711P38Q86L576P077N04
13665G089m404j2021n742L842J1013K836O921M820r304l080l751m612L310M286
13651A203j460q102M691O620Q624q705o190J24L866Q659m003m870p94J203o42
13636B24l902L170M714k339M895K702N023P560m318o575K482n563J005L387Q778
13621B1243P18l150l1j007j51n295l630l840o393K471J3030Q150m60m920K857
13606A9592J291o9L220o272p87J198j540o870k974L304R745N842r852l679J592
13591A3741N768K100l463J790J0150j507k610o66m544p566Q148J527q413P590
13577B2045O815k341J687r568k238L326m350k215k429n900J652M761K96N838n110
$$ y = [22023, 15087, 4086, 4605, 3423, 787, -3087, -5272, -8975, -7403, -5692, -4954, -4068, -492, 6585, 7089, 2685, -9336, -15078, -11236, -223, 2613, 9534, 14354, 5050, 1970, -1781, -6393, -3083, 1203, -257, -8359, -3668, 2952, 11576, 2871, -3319, -3195, 671, 9330, 5327, 457, -337, 866, 224, -3678, -508, 4206, 1867, 6762, 9464, 14487, 22047, 17729, 11154, 13636, 8073, 9078, 12465, 21243, 21961, 18811, 18780, 17773, 17622, 12327, 8697, 4857, -1536, 935, 13965, 22115, 21655, 16735, 19592, 20883, 20814, 24034, 17762, 16975, 18173, 16633, 9763, 6789, 10093, 19838, 25680, 15828, 12149, 13741, 19509, 21609, 18146, 19936, 30086, 28579, 25969, 25303, 20759, 13193, 21341, 22868, 14455, 22045, 28860, 26519, 28206, 18638, 16400, 19726, 15376, 13161, 10732, 4832, 6484, 11245, 11541, 17379, 12269]
13562A2269p583M277O812N969Q497k272j4508O063O361O987k769j3123j1128M055
13548I907L936j832O898P74n538m00N32l378Q83J480m134N352K38p452k724K420
13532F962P665r893j409M635p834p729J0638J1011O278q153o075M130P280L396
13518B0902L69p405m253J38l767l95N018k911j856r41R900K966k195j749l411
13503A0410Q717J993j0936q588K858M520o038J792L411P542P158l954o367n532
13489F986n737L998m389o643J1793M178q086p810J2553N332R079L517r317j4744
13475G10J630J2258P092k663k927k320K691o839N512J5557P898j485j2230J027
13461B5911N44o378j8351j0902j166J6398J0465j859q595o233J7653P385J156
$$ y = [12269, 4686, 8963, 15775, 21744, 30241, 27969, 13461, 19524, 25885, 32872, 30103, 16980, 5852, 9907, 13843, 12011, 18909, 19683, 14145, 13745, 14277, 10899, 11782, 13262, 9128, 14480, 14718, 7266, 4542, 6962, 14627, 4734, 3325, 7960, 126, -7603, 3035, 14046, 20324, 12171, 6096, 10226, 17506, 20902, 21271, 13866, 9613, 9751, 5984, 5589, 10607, 7696, 5840, 4899, 14799, 17765, 15570, 13821, 10410, 19127, 21120, 10184, 1596, 4454, 8974, 2936, 4728, 8139, 15681, 22839, 18885, 12518, 6986, 1249, 5247, 858, -5785, 6008, 10186, 2100, -5710, 6843, 12175, 21254, 24771, 15454, 710, 2340, 14598, 21690, 19027, 16100, 13780, 16471, 9632, 15144, 30701, 38599, 37114, 24884, 25911, 26455, 20077, 1726, -9176, -10342, 6056, 16521, 14662, 6067, -166, 17487, 24872, 26028]
13448B6028k28j0116m335k407L626p11n930O017N811M553k268k795p108l499n432
13433A206k94l128J0973L935n700p634M608P263P457P238o110l396K819Q155k553
13418B4839o148m464j1010j516M594O51L899l520p922n880l092Q81Q498J3070
13404A2880K0613j025j6845j972R104q210L895j599N45q94M149L168k963p863
13390A2983N097J5890p864j4834K566J454P855J191m769K137o708J282L33r753
13376F860m00P080K906k820k223Q973l425O975K591r532n322Q920K925O419N614
13361C5541Q119K893l784j4554J12n931N948J5949K897o749j1702o359N992M285
13347C2657o990p177M653J23n088P732P421p948q717j504j706o218N235m122J4959
$$ y = [26028, 25800, 15684, 11349, 8942, 12568, 11857, 5927, 11944, 17755, 22308, 20040, 17245, 10137, 6638, 1206, 912, -2216, 8757, 12692, 6992, -642, 3966, 11229, 18686, 25924, 19814, 16418, 19237, 27392, 24839, 18691, 14227, 3217, 1701, 6295, 6946, 10845, 7325, -597, -6477, -9569, -8688, -190, 12880, 33493, 32468, 15623, 13651, 22755, 14545, 18440, 16841, 17386, 16492, 20641, 23809, 20846, 12983, 18080, 33970, 26106, 11272, 13838, 15292, 23147, 24338, 19569, 21706, 14998, 16280, 16613, 6860, 6460, 13540, 16446, 13626, 11403, 20376, 16951, 23926, 26517, 16985, 11663, 20583, 23508, 29927, 35541, 43660, 46553, 42769, 28215, 28327, 22396, 28344, 44293, 47190, 40441, 28739, 22380, 28372, 32657, 25667, 18490, 23143, 23266, 18178, 25910, 33331, 25383, 16666, 15162, 13456, 7238, 12473, 8351, 23310]
13332B3310O084k299J847j232n246L751k081r962r68O381J79k005N456J0692M428
13317C8335o379J656L049p025k953j066M136N340K858j2493n809l44K523k760
13303A9068M873K0709K641o582k133J800P053r129m687n174p055n16J484Q342
13289C0694R590j0168j856N2J643J585j5699k197J3093p341P3J862J2958N718
13275D0007k470L183j0714j2670o916N076J948J646j2311l669n894M926J0895
13262A3037L995J171l293M67r024J352J5392K50p281p420j2201P022J3811N937
13248B3215N554J0172J1230j0271n915P13J4295l109j2171j2212Q12l731n396
13235A3186N164K910N028n313p511J2194m594o103P81L96L284j861m133L040M330
$$ y = [23310, 29394, 27095, 28942, 27710, 22464, 26215, 24134, 14172, 13204, 19585, 19764, 17759, 23215, 33907, 38335, 31956, 33612, 36661, 29636, 26683, 25617, 29753, 35093, 37951, 25458, 19649, 19305, 21828, 19068, 23941, 44650, 47291, 40709, 38576, 40376, 47429, 38300, 33613, 28439, 21384, 20868, 22352, 30694, 40284, 30116, 28260, 28312, 29955, 31540, 15841, 13644, 26737, 19396, 19469, 21331, 34289, 40007, 37537, 40720, 30006, 17336, 10420, 15496, 17444, 19090, 6779, 3110, -2784, 2142, 13037, 17032, 18203, 14910, 15377, 6353, 7705, 23097, 23347, 16066, 8646, -3555, 3467, 17278, 23215, 28769, 38941, 50171, 39900, 33985, 34698, 48993, 45884, 33713, 21501, 22313, 18582, 13186, 18350, 21260, 26288, 20975, 13464, 25658, 21064, 14961, 15742, 16138, 19422, 17561, 13428, 16468, 20798]
13220B0798r708m829N846M837J5032R694m613j0294l280N280Q381l971n341o0
13206B7772k112M066o496n132L037O437K292m920J0454J3898k44j035l814J199
13192D5402L774p202K202j880j83N518l068L120k874k303j6607l420N252j435
13178B6296k441K067o15O33J758l042p153Q193J057M029J0711M240j640j708j659
13163D0726j1650l191J1681R736J1026O387q041j6943p257O266M418K810m905
13150D1063O100l346j0380n829N459n571M848k326j245j782n298O853J8126M992
13136E1664k702o82N058m910j0212p108K543K982l102R91P383l245j3260K832
13122B8232R89l224o838n895p070J112J5254K927j1768Q506K500N516q690q067
$$ y = [20798, 11090, 6261, 12107, 16944, 31976, 41670, 37057, 26763, 23483, 28763, 37144, 33173, 27832, 27772, 25660, 29726, 23230, 18098, 21135, 27572, 29864, 24944, 35398, 49296, 49052, 48017, 44203, 45402, 49176, 41974, 44176, 42296, 42113, 47631, 44563, 47683, 44809, 42506, 25899, 22479, 27731, 26296, 23855, 25922, 25307, 25940, 27698, 24656, 17503, 25696, 26753, 30782, 41493, 45733, 44093, 42385, 40726, 29076, 25885, 37566, 47302, 58328, 64715, 56674, 39731, 32474, 38740, 43158, 45968, 41063, 47163, 43817, 33437, 27608, 33067, 27496, 32344, 30018, 28773, 26991, 21693, 28546, 46672, 51664, 48962, 48280, 53338, 48428, 38216, 31108, 33651, 36633, 33531, 34522, 41905, 38660, 25400, 28232, 29221, 25997, 19159, 13264, 6194, 7306, 22560, 25487, 13719, 22225, 24725, 30241, 21551, 13484]
13108A3484J1999J1119L529k477j5208j3849N242M967N684J1423O865m603m633
13095C3542M776K31R2R665J0302n703j3243n715l277L356P563l666K940p694J274
13080C4443n908M864P815q218r970M313L403O550j3559k499L461l261j493J1140
13066C1081J3444k191l002N90r327L64M675j1271o19J0274K013j395L601l791
13052C4446R806O702j0336p707P62N037n790M520Q289P574M46n110p667j450l581
13037C5941j299j756O537L722l33l026q029J0387P059K358M092o320q961p277
13023C3095J3505J1053n954j2829j1884J721L152O556J1107P921J695Q93L09o034
13009E4306m259q444o701J88p824Q554k416J0623J2542J637n352J278Q31j4139
$$ y = [13484, 25483, 36602, 40131, 37654, 22446, 8597, 13839, 18806, 24490, 35913, 42778, 38175, 33542, 38318, 38549, 38641, 48306, 58608, 52905, 39662, 33947, 30670, 34026, 41589, 37923, 40863, 33169, 34443, 28535, 33399, 41214, 32996, 23026, 27339, 30742, 37292, 23733, 21234, 24695, 21434, 19941, 31081, 44525, 42334, 39332, 39922, 30595, 30959, 35634, 24363, 23744, 34018, 36031, 34636, 38237, 34446, 44252, 50954, 40618, 32911, 33673, 38710, 32920, 37440, 45729, 53303, 53749, 48639, 40972, 39522, 35941, 34642, 32886, 39423, 43145, 42812, 39786, 31757, 42144, 49203, 51561, 55653, 49333, 40372, 33095, 46600, 57653, 51699, 38870, 26986, 28707, 31859, 38415, 49522, 57443, 59138, 60031, 60340, 54306, 50047, 41603, 34902, 35090, 27266, 35820, 33404, 44027, 56569, 58206, 52854, 54132, 54963, 40824]
12995D0824J821M261l089k505j100j148j198K153L254j068Q014L20p068M964L639
12980E2074j2196k524l444M260R833k876m378P4r13K441N895J2182K922j1460
12966E1890p384j598k773J395j807M871P514Q981j0106L489p763L238J67j1735
12952C8379j330P154J6963n77k494o401j0814K704J5316N580P539j553r239o351
12938E4876P32J1992K150r661k888j903l888J079R263J2871L913m369q083n960
12924F0124m123K528N140r033l417J6132O499M848R10j3587n314p926q338p775
12910C6668l643O013J1352J320q488K271n496o350R384k150J589N086L40k470
12896D5426J942p889j0678N603k244K158L8O778M517N973J0094K084l377J318
$$ y = [40824, 42645, 46906, 43817, 41312, 40212, 39064, 37866, 40019, 43273, 42205, 50219, 50539, 43471, 48435, 52074, 39878, 37354, 33910, 38170, 48003, 45127, 40749, 40823, 39910, 42351, 48246, 60428, 63350, 51890, 44506, 42908, 40135, 41530, 39723, 44594, 52108, 61089, 50983, 54472, 46709, 49947, 50114, 38379, 37049, 44203, 61166, 60589, 58095, 51694, 40880, 43584, 58900, 64480, 72019, 70466, 61227, 54876, 55608, 67600, 69750, 60089, 57201, 55298, 51410, 52489, 61752, 74623, 78536, 74167, 66084, 60124, 56001, 58529, 63669, 54636, 51219, 67351, 73850, 78698, 79608, 66021, 60707, 52781, 44443, 36668, 33025, 39038, 50390, 51710, 43222, 45493, 39997, 33647, 43031, 40881, 42470, 47556, 47896, 45426, 47368, 39479, 28801, 34404, 32160, 34318, 34356, 41134, 45651, 51624, 61718, 63802, 60425, 61743]
12882F1743p681k775l15j266J1116N610q657l707l442k212J167k174J0557N99
12868E8563j3459J357N279N258q585n561J849o60r33j0617J0668O483p220L850
12854D6272N542n733L463P696j1908j0808J918rR25J0955R037N802L255L416J005
12839G0828P710L800K236n310j3044o45N002N161n390l095P715J337p160q12j81
12824F8152j842N101K173K198p740q198l945J996Q537O810P171L880J2555N632
12810A02480q661o66k396j41l006L057R09j118K421J1345K671j312R308k963k259
12795A09669j1473j127R515O603k625P00p595M55j2631K020O416j250P206R172
12781A15055J5960J0541J5891R432m479n909l265o760j0192n454J0338J1733k058
$$ y = [61743, 54062, 51287, 50972, 49706, 60822, 66432, 57775, 54068, 50626, 48414, 49581, 47407, 57964, 58563, 45104, 46461, 51740, 56998, 48413, 42852, 44701, 44041, 43108, 32491, 43159, 49642, 42422, 46272, 51814, 46081, 49544, 57240, 45332, 34524, 36442, 36433, 37358, 48313, 57350, 63152, 66407, 69823, 70828, 78538, 82338, 84574, 79264, 66220, 65575, 70577, 75738, 70348, 67253, 74968, 76305, 69145, 68333, 68152, 66310, 71411, 73584, 75782, 68042, 59844, 55899, 57895, 66432, 73242, 80413, 84293, 96848, 102480, 93819, 93153, 90757, 90616, 87610, 90667, 91576, 90458, 92879, 104224, 106895, 105583, 114891, 111928, 109669, 98196, 97069, 106584, 113187, 110562, 111262, 103667, 104122, 91491, 93511, 99927, 98677, 105883, 115055, 131015, 141556, 157447, 166879, 162400, 156491, 153226, 146466, 136274, 130820, 141158, 152891, 150833]
12768A50833m474o651j4684p064p263j2674K030J3873k735n017l617o829n831
12755H9897l656r280L823J1262j447K412N816K698J907Q5j417m37Q713m797p277
12740I8302J8264J6406Q310P434J3960M2281M3173J1241L320m462k0072r570J73
12727B28760m762J0471J2156Q306j2624k4208k0286j2002j0952o931p825J1932
12715A72035L050j1302j7200j6197l328n862j2149J5180J563j2289q124k073k850
12702A00454M975L421q747k730J29Q720j419N204J3686O803J0210J7741J0272
12689A68719J2743J6993j3305k1984K048O107L775N432O848M921Q094M864o28
12676B04627m462R832Q511J0282K565j6848l3182k1969r046j9382m315j1258r714
$$ y = [150833, 146359, 139708, 125024, 117960, 110697, 98023, 100053, 113926, 111191, 106174, 102557, 95728, 89897, 86241, 76961, 80784, 92046, 90599, 93011, 98827, 101525, 103432, 103517, 102100, 101663, 110376, 105579, 98302, 116566, 132972, 141282, 148716, 162676, 204957, 248130, 259371, 262691, 258229, 238157, 228587, 228760, 223998, 234469, 246625, 254931, 242307, 218099, 197813, 185811, 174859, 167928, 160103, 172035, 175085, 163783, 146583, 130386, 127058, 121196, 109047, 124227, 125790, 113501, 105377, 103304, 100454, 105429, 108850, 100103, 97373, 97502, 106222, 104803, 110007, 123693, 130496, 140706, 158447, 168719, 181462, 198455, 185150, 163166, 165214, 171321, 175096, 180528, 187376, 192297, 200391, 205255, 204627, 200165, 209997, 218508, 228790, 231355, 214507, 181325, 159356, 150310, 130928, 126613, 115355, 105641]
12663A05641q234o954J0106J982o276M503L525j673p168R71L802j384L17o767
12649I2391K090L87n293j12o180Q145J2191J260M167r512J1950k112O479R529
12635A25380M349N138J0885M025O90Q52o738j4586j1535r506O901Q605o829p904
12621A09727L765k541K43j0070m460l993l921j0245k173P970Q857k237l753j065
12607H6104J4048j094j1806M44j403P371Q393r60R239j2j513q417o916n828L299
12592I0949O23k023M443K872L541k199m745n665J278Q228j2341J998J0593N23
12578I8075L036j064N523K144L905j505k990r41J2641q993j0698o4K520k370q083
12563I1136q032j1449m95J9606M167M75j057r18k854QQ505O479k729j1149j0408
$$ y = [105641, 97407, 90453, 100559, 102541, 96265, 100768, 104293, 102620, 95452, 96423, 100225, 98841, 99158, 92391, 94481, 94868, 89575, 89463, 83283, 91428, 103619, 104879, 109046, 99534, 111484, 109372, 115851, 125380, 129729, 134867, 145752, 149777, 150467, 151319, 144581, 129995, 118460, 108954, 115855, 124460, 117631, 109727, 113492, 110951, 111194, 101124, 96664, 92671, 88750, 78505, 76332, 84302, 93159, 90922, 87169, 86104, 100152, 99058, 87252, 87696, 86293, 93664, 102057, 101097, 110336, 110324, 108811, 100394, 93478, 87650, 90949, 91572, 89549, 93992, 96864, 100405, 98206, 93461, 87796, 89074, 97302, 84961, 86959, 97552, 98075, 101111, 100047, 105570, 107714, 111619, 110114, 107124, 106183, 118824, 109831, 99133, 99069, 101589, 99219, 91136, 83104, 71655, 71160, 90766, 94933, 95408, 94351, 93433, 90579, 90587, 99092, 105571, 102842, 91693, 81285]
12548H1285K5R711P391K16L380o7L845Q254L031j0065j0895J681J09l923K975
12533I6953P891J1978K61j5454l008O358J0928k200j3729M778R385m588l461N166
12519A11258J331Q030m053j4339Q13J5758N029K543M808n145m509l420J735k927
12505A16912o037o723J1405J2927m389m466M641P403O156j5101o618J0557R290
12492A35957j099O319J267o032r527j1484J16j043L596M764Q200J0349J4052p275
12478A48160k488N796q118K173m99J15q338j391K059k65N597L283k494p918o311
12463A29361J623J0238J3307l531J210m993o524J547P008n806n375O261J2520
12450A56846m911q195M737k570q268R195N318j396L020L859o51n152o805n206
$$ y = [81285, 81310, 91021, 98412, 98628, 102008, 101941, 105786, 114040, 117071, 107006, 96111, 97792, 97901, 93978, 96953, 104844, 116822, 117083, 101629, 98621, 104979, 115907, 113707, 99978, 104756, 114141, 109553, 106092, 111258, 112589, 120619, 116566, 102227, 103040, 118798, 123827, 126370, 131178, 126033, 121524, 118104, 119839, 116912, 110875, 104152, 115557, 128484, 124095, 119629, 124270, 131673, 137829, 122728, 116110, 126667, 135957, 134858, 141177, 142444, 136412, 126885, 115401, 115517, 114474, 118070, 122834, 131034, 141383, 155435, 148160, 145672, 151468, 143350, 145523, 145024, 145139, 136801, 135410, 137469, 137204, 142801, 146084, 143590, 135672, 129361, 130984, 141222, 154529, 150998, 152208, 147215, 140691, 142238, 149246, 143440, 138065, 144326, 156846, 151935, 143740, 148477, 145907, 137639, 146834, 152152, 150756, 153776, 157635, 156984, 151832, 145027, 139821]
12436A39821l463L573j219j144j596l546J0127J3026R308L209l483N28J330J119
12422A67590l054M717N572J304m724k604O558M494l143L475L87k382j612p62J3276
12407A89092J1053l361j853l421J081Q219K443k778K325j880L407Q453J3975P279
12393B34034J2881P522o06k054R758J5971J4080M400R974J8562J9467J4799J9111
12380C77899K7006K4860K6803L0941M1204M9568N8958P6821P6530P5577J07956
12369I74123J49267J81260K08118K50713L05498L77247M32904M44995L77488K36253
12359C937866M9299j32479l03289l87392l91720l78051l13384k61820k24227j87884
12349A406919j45119j20308p8306o4195o8120o3258n4442m2960m5858k8801k4396
$$ y = [139821, 136358, 139931, 138712, 137568, 135972, 132426, 142553, 155579, 164887, 168096, 164613, 165141, 166471, 167590, 164536, 169253, 174825, 176129, 171405, 168801, 175359, 179853, 176710, 180185, 180572, 178190, 176578, 175816, 189092, 200145, 196784, 194931, 191510, 192591, 200810, 203253, 200475, 202800, 200920, 204327, 212780, 226755, 234034, 246915, 254437, 253831, 251777, 261535, 277506, 291586, 295986, 305960, 324522, 343989, 358788, 377899, 404905, 429765, 456568, 487509, 528713, 578281, 637239, 714060, 790590, 866167, 974123, 1123390, 1304650, 1512768, 1763481, 2068979, 2446226, 2879130, 3324125, 3701613, 3937866, 3987165, 3854686, 3551397, 3164005, 2772285, 2394234, 2080850, 1819030, 1594803, 1406919, 1261800, 1141492, 1063186, 998991, 930871, 867613, 813171, 770211, 724353, 695552, 671156]
12338F71156m5182k6131j2887j5792j8379r118j2116o648j2966j5181j5469j9559
12326D61728k1644j6098j668k966o177j4377l463j8209j4900j9232j8944j8009
12314C06041n015o057j1972m039j0155r80L018L888Q619P889k650j374L576J3712
12300C04501M168n623K154l554j8976j9285p980M676O397j752J076K628P885K2403
12286B98718K0785N69j0358m798j2741j3219Q675L0866P238j8035j6442j9869
12274B71389k0955r959j118r653j8455j4755k561J4879J97m705p104j0194n624
12261A81382J823k025P610M122p906O831N801n557k06m739o122L835P326N144
12247A97319N08J715R232J123j0594j3358o945L429J1927j626n520o584M143K410
$$ y = [671156, 625974, 599843, 586956, 571164, 552785, 543667, 531551, 524903, 511937, 496756, 481287, 461728, 440084, 423986, 422318, 419352, 413175, 398798, 395335, 377126, 362226, 342994, 324050, 306041, 301026, 294969, 282997, 278958, 268803, 267823, 270841, 274729, 283348, 291237, 288587, 287213, 290789, 304501, 308669, 303046, 305200, 301646, 282670, 263385, 255405, 260081, 266478, 264726, 265802, 268430, 276315, 298718, 319503, 320072, 309714, 304916, 292175, 278956, 287631, 318497, 325735, 307700, 291258, 271389, 250434, 240475, 239357, 229704, 211249, 196494, 193933, 208812, 209009, 204304, 197200, 187006, 181382, 183205, 181180, 188790, 192912, 185006, 191837, 197638, 192081, 191875, 187136, 181014, 184849, 192175, 197319, 197827, 199542, 208774, 209897, 199303, 185945, 179000, 182429, 194356, 192730, 187210, 180626, 184769, 187179]
12233A87179m43J449o610r566j0448J5025K2168M042m487r591m125l289Q033J4242
12219B03579P465J037P102J0317J096j097q960l050l056P849M588n127o544r969
12205B05230Q434R463k541n09n161O111j11N276M538J845n721k666j6609o408
12191B01171L609O75P574N92K105p370O069P126n230l07n805j1830n036N680m043
12176A94980Q679J6258O24k659m358P212M046O55J796q056p822N212J867N641
12162B24075P183N732l987j647N476J498M879N849r09J991N1q886l061n136k609
12147B30499J1596k448N286j989l703j2654k487J3788Q039j4771r095N235N356
12134B32652j618q381L530P443m71k534Q9k231j0539N627K048j394k159J5379
$$ y = [187179, 186736, 188185, 181575, 172009, 161561, 176586, 198754, 202796, 198309, 188718, 184593, 181304, 189337, 203579, 211044, 212081, 219183, 229500, 230596, 229499, 220539, 217489, 214433, 222282, 226870, 221743, 215199, 205230, 213664, 223127, 220586, 220077, 214916, 221027, 220916, 226192, 230730, 232575, 226854, 224188, 207579, 201171, 204780, 205455, 213029, 213621, 215726, 208356, 214425, 221551, 216321, 216014, 210209, 198379, 193343, 199023, 194980, 203659, 219917, 220541, 217882, 213524, 220736, 224782, 225437, 227233, 219177, 211355, 216567, 218434, 224075, 231258, 236990, 233003, 231356, 236832, 238330, 243209, 249058, 248149, 250140, 250191, 241305, 238244, 233108, 230499, 242095, 239647, 244933, 242944, 239241, 226587, 224100, 237888, 245927, 231156, 222061, 227296, 232652, 231034, 222653, 226183, 233626, 233155, 230621, 230710, 228479, 217940, 223567, 225615, 224221, 222062, 237441]
12120B37441J2704p334L287O342K598m53r3L857J0702K154M479K802n963j1493
12106B61030j8613p858j0633J104P801L625Q928O505O13K444J3545o349j0580
12093B51562r98O928O163n642p371l468k423L180j0254r302k078J0368O905p084
12079B36486j1780K505O501Q182M519j065j698m458j0724N964N192m794J0035
12066B44865m31j09j7036j1767O65O193J1740J820j1566N047L631o677j617j181
12052B23577N928J0423J1370o092n38l059J59L233O972J236j40l487r59r504n616
12037B33503R009N782r563k714P686P18K265o480M245J4343P138j5125L719j1149
12023B43377j759Q204O715L582L188j010j2918r760J0498R256p288r290m562K068
$$ y = [237441, 250145, 242811, 246098, 252440, 255038, 254585, 254492, 258349, 269051, 271205, 275684, 278486, 272523, 261030, 242417, 234559, 223926, 225030, 232831, 236456, 245384, 251889, 252502, 254946, 268491, 262142, 251562, 250564, 257492, 263655, 258013, 250642, 247174, 244751, 247931, 237677, 228375, 226297, 236665, 243570, 236486, 224706, 227211, 233712, 241894, 246413, 245348, 243650, 239192, 228468, 234432, 239624, 234830, 244865, 244434, 244325, 227289, 215522, 216187, 222380, 234120, 235940, 224374, 229421, 233052, 226375, 224758, 223577, 229505, 239928, 251298, 245206, 244668, 241609, 241768, 245001, 251973, 253209, 253069, 249582, 248623, 239119, 233503, 242512, 248294, 238731, 236017, 243703, 244421, 246686, 240206, 244451, 258794, 265932, 250807, 254526, 243377, 241618, 249822, 256537, 260119, 263307, 262297, 249379, 239619, 250117, 259373, 252085, 242795, 238233, 240301]
12009B40301Q833M451J2927Q578n712j933O236j5452p732N566Q082J2167J0023
11996B86335j702m917r369R42N322Q607o94K580p274p724K562p848k253J668J1604
11981B77839M696K295N323j5059r786K706Q330K518J0904N340o077o790l666K019
11967B80592p529l289L092M204j167J442P469k895O706P614j1665m877K980N265
11953B87942l233o596l866J370J0282K665K084K483R86M184n979j3134n519M479
11939B78148L631N283K785P537n497O427M526R770L362l385p603l808k971M330
11925C02535R705L751r908o899p45m334k973q784N410J6740m208j535R757J2382
11911C20894K352m344j2171N589J45o2J467j1923r842Q151P555P692J465o9m885
$$ y = [240301, 249134, 253585, 266512, 275090, 269378, 267445, 273681, 258229, 250497, 256063, 264145, 276312, 286335, 284633, 279716, 270347, 271289, 276611, 285218, 284524, 287104, 279830, 272106, 274668, 266820, 264567, 266235, 277839, 282535, 284830, 290153, 275094, 265308, 268014, 276344, 278862, 289766, 295106, 289029, 282239, 278573, 280592, 273063, 269774, 272866, 277070, 275903, 277345, 284814, 281919, 288625, 296239, 284574, 279697, 282677, 287942, 284709, 278113, 274247, 275617, 285899, 288564, 290648, 293131, 294117, 298301, 292322, 279188, 273669, 278148, 281779, 287062, 289847, 297384, 291887, 298314, 302840, 312610, 315972, 312587, 304984, 301176, 298205, 302535, 312240, 315991, 306083, 299184, 298439, 294105, 291132, 282348, 287758, 304498, 300290, 298755, 308512, 320894, 323246, 318902, 306731, 312320, 312465, 312403, 313870, 301947, 292105, 300256, 307811, 315503, 316968, 316899, 312014]
11896C12014o251m552o81N665Q914R134l485j5692m237J6425J4308K041j5990
11883C17613o229P361R852l005o974N680L40O480J465R61l02m474j297l431n928
11868C18112l970R045O730J5549J0511j1785j2131r16K505M967r24l904r509o68
11854C23612L937k3Q98O571J2976R381j8285j8160J1462P204L837R94r04K138
11840C45638j118j645j651J597p503l825O750J8833J9322R858O62N432M830k376
11826C94804j228l091l887m258M044L581M938O834M652J8308R499l909J693K048
11812D34028J0765M377L721J0933k442p805L34P401J3163K0373J5055J4736M368
11799E29007Q137K4942K1102J9358L0155K1332L4160L6050L3492N0685N3567N6176
$$ y = [312014, 305763, 301211, 300530, 306195, 315109, 324243, 320758, 305066, 300829, 317254, 331562, 333603, 317613, 311384, 318745, 328597, 325592, 318618, 324298, 324638, 331118, 332583, 333544, 333242, 328768, 327471, 324040, 318112, 314142, 323187, 329917, 345466, 355977, 344192, 332061, 331145, 333650, 338617, 337693, 333789, 324280, 323612, 327549, 327526, 328424, 334995, 347971, 357352, 339067, 320907, 332369, 339573, 343410, 344404, 343500, 345638, 344520, 342875, 341224, 342821, 335318, 331493, 338243, 357076, 376398, 386256, 386918, 392350, 397180, 394804, 393576, 390485, 386598, 382340, 386384, 389965, 394903, 401737, 406389, 424697, 434196, 430287, 431980, 434028, 444793, 449170, 452891, 463824, 461382, 453577, 453911, 461312, 474475, 494848, 509903, 524639, 529007, 537144, 562086, 583188, 602546, 632701, 654033, 688193, 724243, 757735, 808420, 861987, 918163]
11787I18163N8418O6497O3563M0509L8614K2892p386k6653m1400n1869m1329m6388
11775I93631m2502k5938l2660l9557k0853j8555j7399k8062j1592j2956j4989
11764G28568n923p305J6454J9445K8649J7301K4433J9175K2161K2922L1977M6447
11752I64304M0029M0273N2751P8486R5567J05904J02581J14321J19349J29027
11742A842592J26885J01702O3304K1205l2715p6836q4480j03031j19013j23809
11732A615804j23007j14691q7464p9711p3232m5728m1895l8818l0052l3921l2751
11721I14534k5962k3694p384m540j968l657J3626J2226K484P367J9637K3723K5891
11708I52283L1446K1867L1678L4782N3862O1252N8737O5110O3492O8338M6776
$$ y = [918163, 976581, 1043078, 1106641, 1147150, 1185764, 1208656, 1201270, 1174617, 1133217, 1081348, 1040019, 993631, 951129, 925191, 892531, 852974, 832121, 813566, 796167, 768105, 756513, 743557, 728568, 722645, 715340, 731794, 751239, 779888, 797189, 821622, 840797, 862958, 885880, 917857, 964304, 1004333, 1044606, 1097357, 1175843, 1271410, 1377314, 1479895, 1594216, 1713565, 1842592, 1969477, 2071179, 2134483, 2155688, 2122973, 2046137, 1961657, 1858626, 1739613, 1615804, 1492797, 1378106, 1290642, 1210931, 1137699, 1091971, 1050076, 1011258, 981206, 947285, 914534, 888572, 864878, 857494, 852954, 850986, 847329, 860955, 873181, 875665, 883032, 902669, 926392, 952283, 983729, 1005596, 1037274, 1072056, 1125918, 1187170, 1245907, 1311017, 1374509, 1442847, 1489623]
11697A489623J7953p129k0524l7311o2010o0099o7966o9532o4864o1447n6557
11686A000137l6760m0301m8313l0599j5385j6986j6137k0163j4777o096n978j973
11674G46669r073j4426r380n380m823p896n752n948k331l365O493Q787q02o152
11660F86621n64j3846j8450m004r101J692J1579l102p066M345P133j974j895R177
11646F60545P100J094o318N965rl270O841M111l669p845L866M551o165l155o859
11631F56783k450J541J3099J1938J3988M680J2139L688O130K4697Q395J262O199
11618G62089R252L834O894Q987J2231R654J0500N750O493l689o390K04r32L543
11604H28420l701m452n77L374m87j2M744j579p087N014k738j424Q708L264O97
$$ y = [1489623, 1507576, 1500447, 1479923, 1442612, 1380602, 1320503, 1252537, 1183005, 1118141, 1056694, 1000137, 963377, 923076, 874763, 844164, 828779, 811793, 795656, 775493, 760716, 754620, 748642, 746669, 737596, 723170, 713790, 708410, 703587, 695691, 689939, 683991, 681660, 678295, 684788, 693575, 692773, 686621, 686057, 672211, 653761, 649757, 640656, 642348, 653927, 650825, 643759, 648104, 655237, 653263, 651368, 660545, 667645, 668739, 662421, 668386, 668377, 665107, 671948, 676059, 672390, 664545, 668411, 672962, 666797, 663642, 656783, 654333, 655874, 668973, 680911, 694899, 699579, 711718, 715406, 721536, 746233, 754628, 755890, 762089, 771341, 775175, 782069, 791056, 803287, 812941, 823441, 829191, 835684, 831995, 825605, 825809, 824877, 828420, 824719, 820267, 819690, 823064, 822577, 822565, 827309, 825730, 818643, 823657, 820919, 819495, 828203, 831467, 832164]
11589H32164J5260P098m955K76O849K0640K5428J9428Q870J3873K0768K5522J7759
11576A008980J1838K5327K4036J0192J3385J2409O903M157Q232P428j224o868
11564A124795k4620j0025o985j2987k0936j2780j0501j7477j0319n561L412Q89
11552I96905J3761J2822R414L076M612J836L359K911J1527J3846R774J6978J6789
11539A117610J2366J1374J1606K6307K4958J0356N378J1481L695M846R504J5754
11527A265235J6445J4359m433j4414j239M373l398j7020j2940n272J240r018l072
11514A230846J1881N199J1494J7097M296O962J8190J8872J7677L4269K2920J8305
11502A418008J4817J6628L7709L4261K2457K0421K9125K7186K3302J7226K1467
$$ y = [832164, 847424, 854522, 849567, 849843, 856692, 877332, 902760, 922188, 931058, 944931, 965699, 991221, 1008980, 1020818, 1046145, 1070181, 1080373, 1093758, 1106167, 1113070, 1117227, 1125459, 1132887, 1131663, 1124795, 1100175, 1090150, 1083165, 1070178, 1049242, 1036462, 1025961, 1008484, 998165, 992604, 996016, 996905, 1010666, 1023488, 1032902, 1035978, 1040590, 1042426, 1045785, 1048696, 1060223, 1074069, 1083843, 1100821, 1117610, 1129976, 1141350, 1152956, 1179263, 1204221, 1214577, 1219955, 1231436, 1235131, 1239977, 1249481, 1265235, 1281680, 1296039, 1291606, 1277192, 1275953, 1280326, 1276928, 1259908, 1246968, 1241696, 1242936, 1233918, 1230846, 1242727, 1247926, 1259420, 1276517, 1280813, 1287775, 1305965, 1324837, 1342514, 1376783, 1399703, 1418008, 1432825, 1449453, 1487162, 1521423, 1543880, 1564301, 1593426, 1620612, 1643914, 1661140, 1682607]
11491A682607J2728J5008J3885J1546J3425j721R610J6012J2870J8034J2855l727
11479A813132n44L736Q615K0145K1176J9787K5477L5296N3992O4883N2285N3143
11467B171123M9419M3862L7811M1419N3630N6842L8391L0053L5133L8139K3904
11456B619726M3943M6599L4721M5403N6588M2565M2646M0686L8489L5265L2608
11445C079239M8993N6645M5854M1986K7173L8681L3354L7941L7690N3468N8348
11434C559372O3340N5591O4045P1902P9223Q6272Q0858Q4864R9254J13328J11681
11423D469730J03441R8237P6332Q7536J04431J12898J08040J22468J37536J25106
11413E545755J17791J27674J34835J64343J58570J43006J37125J47057J54143
$$ y = [1682607, 1695335, 1710343, 1724228, 1735774, 1749199, 1747478, 1757088, 1773100, 1785970, 1804004, 1816859, 1813132, 1812588, 1816324, 1824939, 1845084, 1866260, 1886047, 1911524, 1946820, 2000812, 2065695, 2117980, 2171123, 2220542, 2264404, 2302215, 2343634, 2397264, 2454106, 2492497, 2522550, 2557683, 2595822, 2619726, 2663669, 2710268, 2744989, 2790392, 2846980, 2889545, 2932191, 2972877, 3011366, 3046631, 3079239, 3128232, 3184877, 3230731, 3272717, 3299890, 3338571, 3371925, 3409866, 3447556, 3501024, 3559372, 3622712, 3678303, 3742348, 3814250, 3893473, 3979745, 4060603, 4145467, 4244721, 4358049, 4469730, 4573171, 4671408, 4747740, 4835276, 4939707, 5052605, 5160645, 5283113, 5420649, 5545755, 5663546, 5791220, 5926055, 6090398, 6248968, 6391974, 6529099, 6676156, 6830299]
11404F830299J58008J72606J83309J91887J92567J85051K01528K29649K48255
11395H593159K82648L24588L51259L62041L83587M24273M64211N03637N42635
11386A2232038N93161O50385P05309P71020Q71720R67956J066929J195950J359342
11377B0413810J557690J773639K011198K313503K659113L047928L474927L943770
11369D1195578M461575N090992N821357O591427P274458P739275P849086P501531
11361I3525279O685828N466488L995165K402729P90256q31176k425070l897680
11353A05711819n108117n931108o319357o283694n895049n293810m597846l881620
11345F2401218l188089k548024j987326j454620r62341n08271m8258M15341Q95706
$$ y = [6830299, 6988307, 7160913, 7344222, 7536109, 7728676, 7913727, 8115255, 8344904, 8593159, 8875807, 9200395, 9551654, 9913695, 10297282, 10721555, 11185766, 11689403, 12232038, 12825199, 13475584, 14180893, 14951913, 15823633, 16791589, 17858518, 19054468, 20413810, 21971500, 23745139, 25756337, 28069840, 30728953, 33776881, 37251808, 41195578, 45657153, 50748145, 56569502, 63160929, 70435387, 78174662, 86023748, 93525279, 100211107, 105677595, 109672760, 112075489, 112865745, 112034569, 109609499, 105711819, 100603702, 94672594, 88353237, 82069543, 76174494, 70880684, 66282838, 62401218, 59213129, 56665105, 54677779, 53223159, 52260818, 51752547, 51704289, 52119630, 53015336]
11336E3015336J386938J935603K522513L168275L871082M646413N530382O540504
11328H2617046P682435Q953676J0400609J1981466J3627571J5210675J6567247
11321A67040725J7460022J7676809J7060576J5587114J3332068J0362005O690562
11314B65209881K314226k645027p799556j2528550j6187266j8403173j9155396
11307A90805139j8659627j7339082j5563942j3653785j1813269j0151612q673978
11300I4949844p344924o206155n213720m330813l546757k847006k184678j554049
11292F1721742r33147l13824K97693R33743J593587K311902L114810M017096N041463
11283G7785065O184697P454691Q824349J0192877J1419329J2280859J2490955
$$ y = [53015336, 54402274, 56337877, 58860390, 62028665, 65899747, 70546160, 76076542, 82617046, 90299481, 99253157, 109653766, 121635232, 135262803, 150473478, 167040725, 184500747, 202177556, 219238132, 234825246, 248157314, 258519319, 265209881, 267524107, 264879080, 257079524, 244550974, 228363708, 209960535, 190805139, 172145512, 154806430, 139242488, 125588703, 113775434, 103623822, 94949844, 87604920, 81398765, 76185045, 71854232, 68307475, 65460469, 63275791, 61721742, 60788595, 60474771, 60772464, 61706207, 63299794, 65611696, 68726506, 72743602, 77785065, 83969762, 91424453, 100248802, 110441679, 121861008, 134141867, 146632822]
11276A46632822J1837266J0222910P704247M514664R23064k752189o178985r057778
11268A63846021j1187899j2416483j2810141j2524807j1758297j0704592r564444
11261H2879358q449263p394652o460841n649960m938147m347397l831775l384977
11253C8422346l014444k678829k397267k155222j936112j749133j570630j425634
11245B1495075j293600j166435j065133r81615q88998q06391p22766o55269o09024
11236A3305844n78647n36416m88056m45992l98511l68424l52999l49607l24877
11227I462315k98899k93681k88567k69183k79654k58371k48106k32064k13185
11218G080605k05396j84102j64884j64406j59108j64414j50312j57210j67942
$$ y = [146632822, 158470088, 168692998, 176397245, 180911909, 181834973, 179082784, 172903799, 163846021, 152658122, 140241639, 127431498, 114906691, 103148394, 92443802, 82879358, 74430095, 67035443, 60574602, 54924642, 49986495, 45639098, 41807323, 38422346, 35407902, 32729073, 30331806, 28176584, 26240472, 24491339, 22920709, 21495075, 20201475, 19035040, 17969907, 16988292, 16099294, 15292903, 14570137, 13914868, 13305844, 12727197, 12190781, 11702725, 11256733, 10858222, 10489798, 10136799, 9787192, 9462315, 9163416, 8869735, 8581168, 8311985, 8032331, 7773960, 7525854, 7293790, 7080605, 6875209, 6691107, 6526223, 6361817, 6202709, 6038295, 5887983, 5730773, 5562831]
11209E562831j70988j69013j56049j48519j34842j22377j04133j09092r1722r1613
11199D264483p7181n1334l6983k4920j9543j7943Q32R89P489j0779j7916l1851
11187C985343m9771m1992l6445m7720m3803j6417Q393J8480K9535O2135P6774
11176C944512P3971Q2124Q4510R0403P1530M2636j4314o3838j12827j44102j50528
11165C904077j57316j52175j52641j28643j12837q7352p5664n6570l7847j1526
11155B931506N330J1501j814J5417J6780M569K3060L3031N0691O3903O0120P1465
11143C285559P3605R3752J01181J06324R8150R4739Q2289O0509L2110J0982j2238
11132D026962k1957m3935o6800j07630j28733j37946j45167j44356j25114j17856
$$ y = [5562831, 5391843, 5222830, 5066781, 4918262, 4783420, 4661043, 4556910, 4447818, 4356096, 4264483, 4187302, 4135968, 4098985, 4074065, 4054522, 4036579, 4037411, 4038400, 4045889, 4035110, 4017194, 3985343, 3935572, 3893580, 3857135, 3809415, 3765612, 3749195, 3757588, 3776068, 3805603, 3867738, 3944512, 4018483, 4100607, 4185117, 4275520, 4347050, 4389686, 4375372, 4311534, 4198707, 4054605, 3904077, 3746761, 3594586, 3441945, 3313302, 3200465, 3113113, 3037449, 2980879, 2943032, 2931506, 2936836, 2948337, 2946523, 2961940, 2978720, 2983289, 3006349, 3039380, 3090071, 3153974, 3214094, 3285559, 3359164, 3452916, 3554097, 3660421, 3758571, 3853310, 3935599, 3996108, 4028218, 4039200, 4026962, 4005005, 3961070, 3894270, 3786640, 3657907, 3519961, 3374794, 3230438, 3105324, 2987468]
11122B987468j09907q1316o3993n7417m1235j7455p197P579Q031J6261J5031k59
11110B655591R704K0303L781j887j1493j459j1645k9479j6521j4119l589J713
11098B600900p304R62J1301J152l95J3966M176N454K9306K0991K0917J1130K1643
11085B734199K0524K0062K6429L0294L2204L8742N3624O5833P4688P8608J01013
11074C276220R8098J02299J11572J37203J70037J95304K20351K26765K30359K23293
11064D991501K18120K08677K22828K37680K36879J90078J01404L5675J2288K0019
11054F475149K1901K6328J0857k3549p2730p5568k9881K7594R2932J54495K01684
11043F809212K36567K82350L41951L69297L84329M06622M48560N06544N93868
$$ y = [2987468, 2877561, 2796245, 2732252, 2674835, 2633600, 2616145, 2608948, 2616527, 2624558, 2640819, 2655850, 2655591, 2665295, 2685598, 2689379, 2687492, 2675999, 2674540, 2662895, 2633416, 2616895, 2602776, 2599187, 2600900, 2593596, 2594558, 2605859, 2607011, 2606616, 2620582, 2624758, 2630212, 2659518, 2680509, 2701426, 2712556, 2734199, 2754723, 2774785, 2801214, 2831508, 2863712, 2902454, 2956078, 3021911, 3096599, 3175207, 3276220, 3374318, 3476617, 3588189, 3725392, 3895429, 4090733, 4311084, 4537849, 4768208, 4991501, 5209621, 5418298, 5641126, 5878806, 6115685, 6305763, 6407167, 6442842, 6455130, 6475149, 6497050, 6523378, 6534235, 6510686, 6437956, 6362388, 6332507, 6360101, 6453033, 6607528, 6809212, 7045779, 7328129, 7670080, 8039377, 8423706, 8830328, 9278888, 9785432, 10379300]
11034A0379300O83862P70061Q59525R67623J120961J331760J542837J732163J871826
11025B1259918J989984K214545K584700L141219L882353M870669O220444Q134892
11017E4298724J0859235J4501736J8678738K1965887K2354198J9638451J6679205
11010A78976174J5534819J4931470J2467830P376446N82367n750440r215650j0429891
11002B04473125j2527804j6613008k0392679k1868211k0834339j7845269j4065322
10995H0326493j0580443p851309n799756m217052l000814k097538j425506r16833
10987D4437242m68889m2468L83011Q04454J184301J599693K150792K938693M055707
10978E7042536N611557P807570J0908046J5290817K1431067K9110303L6285509
$$ y = [10379300, 11063162, 11833223, 12692748, 13660371, 14781332, 16113092, 17655929, 19388092, 21259918, 23249902, 25464447, 28049147, 31190366, 35072719, 39943388, 46163832, 54298724, 65157959, 79659695, 98338433, 120304320, 142658518, 162296969, 178976174, 194510993, 209442463, 221910293, 229286739, 229869106, 224118666, 214903016, 204473125, 191945321, 175332313, 154939634, 133071423, 112237084, 94391815, 80326493, 69746050, 61894741, 56094985, 51877933, 48877119, 46779581, 45354075, 44437242, 43968353, 43925885, 44308896, 45113350, 46297651, 47897344, 50048136, 52986829, 57042536, 62654093, 70461663, 81369709, 96660526, 118091593, 147201896, 183487405]
10971A83487405L8419880L2637069K3016120J5748277J3141798J4538188J5968648
10964C36957385J1462647J06498j2383842k1615279k6898769k8799106k8814958
10957B30014576k8218970k7036645k4891401k1837765j8302122j4812305j1753172
10950H3162196r301313p426747n991468m892288m044375l352659k783765k328530
10942D3041051j967522j680544j393141r99856m78408J36934Q88551J803293K926752
10933D2277110M432385O472599Q996889J1393589J2223959J0430179P442382N987774
10925A09656866P177304R957199J1165353P580859J91100o511119r636970r178387
10917A20402205p315267p052567r119002j1487935j2533227j1970119j0216438
$$ y = [183487405, 221907285, 254544354, 277560474, 293308751, 306450549, 320988737, 336957385, 348420032, 348526530, 336142688, 314527409, 287628640, 258829534, 230014576, 201795606, 174758961, 149867560, 128029795, 109727673, 94915368, 83162196, 73860883, 66434136, 60442668, 55550380, 51506005, 48153346, 45369581, 43041051, 41073529, 39392985, 37999844, 36999988, 36521580, 36658514, 37547065, 39350358, 42277110, 46709495, 53182094, 62178983, 73572572, 85796531, 96226710, 103669092, 109656866, 116834170, 126791369, 137956722, 145537581, 145728681, 139217562, 129580592, 120402205, 113086938, 106034371, 96915369, 85427434, 72894207, 60924088, 50707650]
10910E0707650q060643o174459m764957l774395l034662k467435k025672j703661
10902A8701766j491821j384240j310354j227793j108482r85380q58600p57942
10894I577154o82846o46418n86498n12960m38305l59425k72381k11922j89373
10885E677026j62607j63694j31720j32935j36058j35793j67296j89294k24063
10876D233566k32969k41495k23097k09005j98949j92770j84575j68216j51883
10867B430607j27812j02492q9059o7784m3280n2275m7644m5193l5888l3818k1259
10856A764103k3194j8079k1665k3282j6010j4232j9883j8267j2651j1672j2214
10845A572954j6865k6022m1842n1489n2930n2900m8043n4112n9974p0522o9086
$$ y = [50707650, 42647007, 36472548, 31707591, 27933196, 24898534, 22431099, 20405427, 18701766, 17209945, 15825705, 14515351, 13287558, 12179076, 11193696, 10335096, 9577154, 8894308, 8247890, 7661392, 7148432, 6710127, 6350702, 6078321, 5866399, 5677026, 5514419, 5350725, 5219005, 5086070, 4950012, 4814219, 4646923, 4457629, 4233566, 4000597, 3759102, 3536005, 3327000, 3128051, 2935281, 2750706, 2582490, 2430607, 2302795, 2200303, 2111244, 2043460, 2000180, 1947905, 1900261, 1855068, 1819180, 1785362, 1764103, 1740909, 1722830, 1701165, 1677883, 1661873, 1647641, 1627758, 1609491, 1596840, 1585168, 1572954, 1556089, 1530067, 1488225, 1436736, 1383806, 1330906, 1282863, 1228751, 1168777, 1098255, 1029169]
10834A029169o2349m9492l8981m7026m8195l1509j4227n685J87L076m24O560J6368
10821G57472J8769K851q133m609L975J533J6504J6656J2472k096j8267j2111J0323
10808G95339J0720J3664N064O18j6241j8676j9890k4351k4291k5443l2402k9916
10796F34195k8869l2160l4855l1216k5390k3340k2539k3643k2776n784M849K699
10784C91171K1012K0415R261N912P570L922K1093K5754J0651J4247K2747P868
10772E61623M232k473j2783j1712j2579o339l671P313k86r884k4390j4194r124
10759D65733j1254j2298p131j0457j9618k4495k4221j9436j3901K497l85p182
10747C17852k4092j9071p216k614p67J1665J5960J7564O528P893L014k309J2465
$$ y = [1029169, 966820, 917328, 878347, 831321, 783126, 751617, 737390, 731705, 731892, 734968, 734544, 741104, 757472, 776241, 779092, 770959, 766350, 770325, 771858, 788362, 805018, 817490, 815394, 797127, 785016, 795339, 806059, 819723, 824787, 825405, 809164, 790488, 770598, 746247, 721956, 696513, 664111, 634195, 605326, 573166, 538311, 507095, 481705, 458365, 435826, 412183, 389407, 383623, 388472, 391171, 412183, 432598, 441859, 447771, 455341, 459263, 480356, 506110, 516761, 531008, 553755, 561623, 565855, 563382, 550599, 538887, 526308, 519969, 516298, 523611, 523325, 513441, 489051, 474857, 465733, 454479, 442181, 435050, 424593, 404975, 380480, 356259, 336823, 322922, 325419, 325034, 317852, 293760, 274689, 267473, 264859, 264092, 275757, 291717, 309281, 315809, 323702, 326716, 324407, 336872]
10734C36872J1189K705L184j2767q522l464J973q380j0486J800j953j1569j1718
10721B88864n693j2196q680O123L928L386o46j4340o289j8620k2884j1831m321
10708A96801L674l513o133q88P97r310J915J5557Q381J1669J8960R155O756Q946
10694B62767J3975K0411K2906J7962J9771K1966L764j5631l3790l3188k9343l6921
10682B34649o202n959k299p462j97l851k949j001m940j2388j1348L557m414j0274
10668A64922j2009j2733m662Q547J7225R940J1137J4012k861R269J1946K0151
10656B34884J0129N373o824j8180o152K44L221M197j7833j0806j6476j066L753
10643A84464l320n966N227Q499R248r5K20k882J937n384n894q121j1630l893p139
$$ y = [336872, 348061, 350766, 353950, 341183, 332661, 329197, 331170, 322790, 312304, 314104, 312151, 300582, 288864, 283171, 270975, 262295, 268418, 272346, 275732, 275086, 260746, 254457, 235837, 212953, 201122, 196801, 200475, 196962, 190829, 189941, 190738, 181428, 183343, 198900, 207281, 218950, 237910, 247065, 253821, 262767, 276742, 297153, 320059, 338021, 357792, 379758, 383522, 367891, 334101, 300913, 271570, 234649, 228447, 222488, 220189, 212727, 212530, 208679, 205730, 204729, 199789, 187401, 176053, 179610, 175196, 164922, 152913, 140180, 135518, 144065, 161290, 171230, 182367, 196379, 193518, 202787, 214733, 234884, 245013, 250386, 243562, 225382, 219230, 219474, 222695, 226892, 209059, 198253, 181777, 180711, 184464, 181144, 175178, 180405, 188904, 198152, 198057, 198277, 195395, 197332, 191948, 186054, 177933, 166303, 162410, 155271]
10628A55271N421L202M80o644K831O205J1482L4156K6565J4046J8710J0786J3200
10615B95711K3939M9859M5698M4617O5673R5992J29844J46943J28987Q6838N2487
10604A166588K1767P953O706j812k0889m5783p9658j07553j27167j15971j04947
10593E99234p7799o6101m7741k6675k4158j6763j3549j2073m830j0985j5753j6221
10581B66586k1452j399M079K640J2979K1431K5472L9873L6334M4378O0748Q1907
10569E73576J09120J59944K08937K44490K51337J92458J07091K8745J648J1561
10559A888907M0031J9026m9342j21029j90381k31247k38639k09508j50712j14905
10549F42201q1214o1611o4652n3376m7266k4989r411p825r221k4921k9438k0215
$$ y = [155271, 160692, 163894, 164374, 157730, 160561, 166766, 178248, 212404, 238969, 253015, 271725, 282511, 295711, 319650, 369509, 415207, 459824, 525497, 621489, 751333, 898276, 1027263, 1114101, 1166588, 1188355, 1196308, 1203014, 1201202, 1180313, 1134530, 1054872, 947319, 820152, 704181, 599234, 521435, 455334, 407593, 380918, 356760, 339997, 326448, 314375, 309545, 298560, 282807, 266586, 245134, 243735, 247814, 250454, 263433, 284864, 310336, 350209, 386543, 430921, 491669, 573576, 682696, 842640, 1051577, 1296067, 1547404, 1739862, 1846953, 1875698, 1877346, 1888907, 1928938, 1947964, 1898622, 1777593, 1587212, 1355965, 1117326, 907818, 757106, 642201, 560987, 499376, 434724, 381348, 334082, 309093, 299682, 291857, 282636, 257715, 228277, 208062]
10537B08062j0250k58q06K989J696P7N367L634L3084L4231L4824M8522O4826P6323
10523E02321R9946J06869Q5136M2236N401J478J357j702q950k5918p1415q6609
10511F50150r4839q7622r0595p2800n4155l5729k6914l1820j9096j6579r511o106
10499A04384j7106j1206m351N67Q087P977K21n349j8839j3321k618j0623P831
10486D5654Q133L668N271o776j2916p985K739J2134R25l268o014j0878J006k147
10472B9546k782o60p633m277J22J3080J0111O035j1860j8583j1483m911K093Q193
10458F991K014P000m120k768J0816p954q535R322P447M610j66j3388k935P218
10444A5552L540J766j4j802N645P745k326j0009O399O812N737k225p224m871J349
$$ y = [208062, 197812, 197554, 196748, 199737, 201433, 201510, 206877, 210511, 243595, 277826, 312650, 361172, 425998, 502321, 602267, 709136, 794272, 836508, 841909, 843387, 844744, 843042, 834092, 808174, 736759, 650150, 555311, 467689, 377094, 304294, 250139, 214410, 187496, 155676, 136580, 120001, 110490, 104384, 87278, 76072, 71721, 72288, 80375, 88352, 88573, 83224, 64385, 51064, 48446, 37823, 45654, 53787, 57455, 62726, 55950, 43034, 35049, 37788, 49922, 50847, 47579, 41565, 30687, 31693, 29546, 26764, 26104, 18471, 14194, 14316, 27396, 37507, 43542, 31682, 13099, 1616, -3295, -1202, 6991, 9005, 16005, 11885, 9117, 19933, 11979, 3444, 12766, 20213, 24823, 24657, 11269, 8334, 15552, 19092, 20858, 20844, 19042, 24687, 32432, 30106, 20097, 26496, 33308, 39045, 36820, 29596, 24725, 26074]
10429B6074K10n355k610L511M882l628J44K632j995K998m213n052j1203J1061
10415A7456L353j1031n878K938K447M743l05p326j293Q725O142l750%j717K259
10400A6763m85L136R649O344K590j110l422j3308j4107L190O295m607p056j163
10386B709L845N806J9419m14j3998j3023M935P315M942P702m08l403m95K133k994
10371B4071P405r358p043k883O3k067m940j2839J3907J2713P516Q8q526n641j0923
10356A543L279M719M417K043j217j793l319o081M843K769j5712j2265R78l322
10342a9118l566J042J218J0478K409j249n345L497m144j835Q355O977k57j968
10328c506k336Q355j29o742n371K756J666m585R600P519l583m864j50M557l46
$$ y = [26074, 26284, 20929, 18319, 21830, 26712, 23084, 23228, 25860, 23865, 26863, 22650, 17598, 6395, 17456, 20809, 9778, 3900, 6838, 9285, 14028, 13723, 6397, 5104, 13829, 19971, 16221, 16221, 14504, 16763, 16278, 19414, 29063, 35407, 37997, 36887, 33465, 20157, 6050, 9240, 15535, 10928, 3872, 2709, 6554, 12360, 31779, 31365, 17367, 4344, 9279, 16594, 21536, 29238, 28830, 25427, 24932, 27065, 24071, 31476, 22118, 15075, 12192, 12255, 10188, 5248, -7591, 6316, 19029, 26545, 26633, 18107, 12466, 1543, 4822, 9541, 13958, 16001, 14784, 12991, 9672, 3591, 8434, 11203, -4509, -16774, -15796, -19118, -22684, -21642, -20424, -9946, -7537, -8786, -14131, -10634, -14778, -16613, -8258, -1281, -1538, -3506, -5842, 2513, 2384, -4358, -9729, -6973, -5307, -9892, -292, 7227, 3644, -1220, -1370, 3187, 2841]
10313B841j231l305n373J872K910P39J742M719j413N160J3025o30q015r306n728
10298a993M312l818k960o146n270P920n795k752l907K319L338l441J396J0891
10284e906J299j970J0168J4226Q792k530o494k377K383N862Q2l886j9488j6091
10270a5930P566K774J0965J2781P357k206R821K591p390j0775L71l538M659K642
10256B1688j805j1464M052N234Q69K39L004l024M63j50o32j2268r997m760o971
10241a5522N823R213N798J0642q32o088K867N780j0644j5n937m351l180J2630
10227F184J0420J524L373m781n34K416J561o696q742l687K739P955J1776K148
10213B5656l309N303l177l63L803o76N698q246q683J001O038N933p65l418r471
$$ y = [2841, 1610, -1695, -7068, -5196, -2286, -1547, 195, 4914, 3501, 8661, 21686, 21056, 13041, 3735, -1993, 2319, -1499, -4459, -10605, -15875, -7955, -13750, -16502, -20409, -18090, -14752, -18193, -16797, -5906, -4607, -6577, 3591, 17817, 26609, 24079, 17585, 15208, 17591, 23453, 23535, 19649, 161, -15930, -8364, -5590, 5375, 18156, 25513, 23307, 33128, 35719, 28329, 17554, 17925, 14387, 19046, 21688, 19883, 8419, 12471, 17705, 18574, 18813, 21817, 18793, 19256, 19106, 18474, 6206, -3791, -8551, -15522, -9699, -486, 5312, 15954, 15122, 9034, 11901, 17681, 7037, 7022, 1085, -3266, -6446, 6184, 16604, 18128, 21501, 16720, 16186, 18602, 20163, 13467, 4725, 1038, 3777, 11732, 23508, 25656, 22347, 27650, 24473, 24110, 27913, 27237, 32935, 24689, 16006, 17007, 23045, 28978, 28213, 24795, 15324]
10198A5324l900m186n253j2380k877Q644N649J8798L891L84j5520k802J2318R642
10184B7732N709j3377n537n015p48M097p513P158J91p922L367L926Q01k272J919
10169A2516o288J351J657J1407P134m86n100L286r63M811k479j3487j5761J1687
10155I285K0061K929J5329J637q144m200r444Q407J0266k201P068J598k80j0368
10141D1943r68L718r743p655P297P39r202J683N416n224j411l72r06r919j1630
10126C766P207J2751R287r097q033l328l09N615O789L180J2824J1478k16J3990
10112F5904Q351R922l596L678O794P256L548j8751k8704n091p094j0856n437J101
10098B7025q982o305M992N372Q575J201p110L011m947j3105n840m362n5K0660
$$ y = [15324, 11424, 7238, 1985, -10395, -13272, -4628, 1021, 19819, 23710, 24094, 8574, 5772, 18090, 27732, 33441, 20064, 14527, 9512, 8764, 12861, 5348, 12506, 12697, 4775, 8142, 12068, 12869, 10597, 12516, 6228, 7579, 9236, 20643, 27777, 27291, 22191, 25477, 24514, 29325, 26846, 13359, -2402, 9285, 29346, 32275, 47604, 49241, 41097, 36897, 27453, 35860, 46126, 43925, 50993, 52591, 52311, 41943, 40975, 44693, 34950, 27295, 34592, 35331, 26129, 27812, 33228, 28004, 26593, 26221, 25315, 15396, 3766, 10973, 23724, 33011, 23914, 15881, 12553, 12244, 17859, 24648, 27828, 40652, 52130, 51914, 65904, 74255, 84177, 80581, 84259, 91053, 98309, 101857, 83106, 54402, 49311, 42217, 31361, 25924, 27025, 18043, 11738, 16730, 22102, 30677, 31878, 24768, 27779, 22832, 9727, 3887, -475, -530, 20130]
10084B0130P40k333M879l23k92N146M087p264J810O857q180L186k795L923M456
10069C4027m005k412P810L457j665q431l365N29J628J1650K473J493q07k701n11
10054C9170Q560n532l042j791m684O057k594j8830L156R284m934l530N453L037
10040B9780K558R20p176o303j923N038K143o399o327N186k991K82Q52q014j2174
10025d548l055J6043J4571Q108r3P382R43p025K690P356q972k924J6197L890j6477
10010C4086m174L044K565Q054J448J064k0412j6777R10L902j19j0704M324P750
9996A4961k355N458J4103k16l355K263P71j2815j6084p495l009J1749J1852P688
9982B3516O572j1950j0777k281M397R816J560k720n283L850Q03Q327J5827p181
$$ y = [20130, 20870, 18537, 23416, 23093, 22801, 27947, 32034, 24770, 26580, 33437, 25257, 28443, 25648, 29571, 34027, 30022, 27610, 35420, 38877, 37212, 28781, 25416, 25945, 27573, 39223, 41696, 43189, 42382, 39681, 39170, 47730, 42198, 39156, 37365, 32681, 38738, 36144, 17314, 20470, 29754, 24820, 21290, 26743, 29780, 32338, 33258, 26082, 19779, 17856, 22894, 25037, 18638, 12311, 17497, 14506, 14788, 15640, 7626, -4548, -7603, 8440, 23011, 31119, 31026, 38408, 39351, 32326, 35016, 42372, 33400, 30476, 46673, 50563, 34086, 29912, 32956, 35521, 43575, 45023, 46087, 25675, 8898, 9808, 13710, 13591, 2887, 7211, 14961, 12606, 18064, 32167, 31951, 28596, 30859, 31630, 18815, 2731, -4764, -7773, 3976, 15828, 23516, 30088, 18138, 7361, 5080, 9477, 19293, 20853, 18133, 12850, 16700, 17503, 25830, 41657, 34476]
9968C4476p69M636P692L764p521j484o900R5m942l241p268K248k661O484n225
9953A9384j0207R858K613n394L465J1028n299L58L856j038J2191J1019j1961j4845
9939B5028O667N21l272N034n419q239l68N174J0375J2158J2919O452l703m854
9925E8473j1377j0934j989J3883k790r184l634P077J123M869L048O496R383r073
9911E5371j2286j32l07k315R346m363n374n837L143q152O00L586J1527J6186p389
9896E3604j1002n779r256N509J8560O838p286n797J2529j0480Q37M435j3l10j013
9881E1376J326j2347r360K24Q081o575Q437J0481R439k276L540J0649k789J756
9867G1962K585q654r488N828R335n42j2567O301J3732J5396L499j3501j7399n828
$$ y = [34476, 33707, 38343, 46035, 49799, 42278, 40794, 33894, 33989, 29047, 25806, 18538, 20786, 18125, 24609, 19384, 9177, 19035, 21648, 16254, 19719, 30747, 25448, 25806, 29662, 28624, 40815, 51834, 39873, 25028, 31695, 32216, 28944, 33978, 28559, 20320, 19952, 25126, 35501, 47659, 60578, 67030, 63327, 58473, 47096, 36162, 34173, 48056, 45266, 36082, 32448, 39525, 40648, 45517, 48565, 55061, 64444, 55371, 43085, 42953, 42646, 40331, 49677, 45314, 39940, 34103, 37246, 29094, 29694, 33280, 44807, 60993, 53604, 42602, 36823, 27567, 33076, 51636, 58474, 51188, 45391, 57920, 47440, 48277, 52712, 52699, 52389, 51376, 52702, 40355, 30995, 31219, 39300, 32725, 41162, 51643, 61082, 58806, 62346, 72995, 70206, 71962, 74547, 65893, 56405, 62233, 71568, 71026, 58459, 64760, 78492, 93888, 97387, 83886, 66487, 60659]
9853F0659K156K257j82k321j272L524k54j713j085n804l397M538k008J154M411
9838F0663p914p915L591J7143M953m866o024q369o94N591N581M077j8552k592
9824D4673J2830j415r83J0071J219K005k278l484k126p09J0280j659k43k889n974
9809E9318n16K498J2300R010J310o334n973J0026k484q696O033j152n541J206
9795G1005j137O313J0515k07r408J863L757J782J204K629p638k25Q749P963O985
9780A04150J701J770K186n136P219J3313K1393K502m926J2451J9800R288P318
9767A93029J4585K5049K0603J4272J0010J1250Q524J0072J2565K2542K171q656
9755C36016m302j704j631j1379j6376j0031p668j6759j8533k3695k5146k7217
$$ y = [60659, 62815, 65072, 64890, 62569, 61297, 64821, 64567, 62854, 61769, 55965, 52568, 57106, 55098, 56252, 60663, 52749, 44834, 48425, 65568, 70521, 65655, 59631, 51262, 50568, 56159, 61740, 65817, 47265, 44673, 57503, 56088, 55105, 65176, 66395, 68400, 66122, 62638, 60512, 59803, 70083, 68424, 68181, 65292, 59318, 58802, 61300, 73600, 82610, 83920, 77586, 71613, 81639, 79155, 70459, 76492, 75340, 69799, 71005, 69868, 76181, 86696, 86489, 77081, 78944, 82701, 84483, 85687, 88316, 80678, 80453, 89202, 97165, 104150, 105851, 107621, 109807, 104671, 111890, 125203, 146596, 149098, 144172, 156623, 176423, 185711, 193029, 207614, 232663, 253266, 267538, 277548, 288798, 297322, 307394, 319959, 342501, 344672, 336016, 331714, 330010, 328379, 317000, 300624, 290593, 282925, 266166, 247633, 223938, 198792, 171575]
9743A71575n712K042j7068p45M235j4973j0090k963L83j0620j3508K863l879N991
9729A07531O115p605K071j0803j2932o974K511K902R4L837L981Q722J1912l375
9715A07987n043p528r137q979j999O152J755j003N200j820o956K832J4187P474
9701A03122l078n983L179n566r825n21M238n869j0474P566J6056j1530J312Q094
9687I0721N96J794n598r247q989n958J2047N389n5O621k114k129L315l527J076
9672H3942k256n457L735k543n014K237l14j4418j4123N40J0370J1281J2364K713
9658H3057k088q49N578p026M27P873j842L422N052J0562J751j1680j3980Q119
9644H8376P160N133o185k705J37N749j335o234o210j682N521K601L056K133k530
$$ y = [171575, 165863, 167905, 150837, 150092, 154327, 139354, 129264, 126301, 126684, 116064, 102556, 105419, 101540, 107531, 113646, 106041, 108112, 97309, 84377, 77403, 79914, 82816, 82910, 86747, 90728, 99450, 111362, 107987, 102944, 95416, 86279, 77300, 75301, 81453, 83208, 82205, 87405, 85585, 78629, 81461, 95648, 103122, 100044, 94061, 97240, 91674, 81849, 81328, 85566, 79697, 69223, 76789, 92845, 81315, 82627, 90721, 91317, 93111, 87513, 78266, 69277, 63319, 75366, 80755, 80700, 87321, 85207, 83078, 86393, 82866, 83942, 81686, 76229, 79964, 77421, 72407, 74644, 74330, 59912, 45789, 46329, 56699, 67980, 80344, 83057, 80969, 80120, 85698, 78672, 79099, 86972, 85130, 88552, 93604, 104166, 105917, 94237, 80257, 88376, 95536, 100669, 94484, 91779, 91916, 97665, 96330, 90096, 83886, 82204, 87725, 90326, 93382, 95515, 92985]
9629I2985N152n089n897l099o0K153p276J877o77M307N475J00j504J2006o4j3149
9613H7240l561J0072J3152M38K15M048L854p00o337r445j276M552O562L473o690
9598A05597J509m086j552j834k502P002j638n979L420M221n775k242j2406j762
9584H1973O295Q096Q314n111j579j422k372M804J809j988K456M710k15k180J137
9569A04727m257n776o47L044O720Q38K172K611q662J365Q920K555K105m087O101
9554A17729L78P925O257M431L519L239k78k877K259L549o822j0225p34m229n131
9539A18990j6338K365O267J0685j321L442J1625m346k120j0883j2344O242J3313
9526A25577k210l976q449J308J2117J4248j2330o344n094j492O849L861n193L309
$$ y = [92985, 98137, 93048, 87151, 84052, 83992, 86145, 78869, 80746, 80069, 84376, 89851, 89951, 88447, 100453, 100389, 87240, 83679, 93751, 106903, 107341, 107556, 111604, 115458, 114758, 108421, 98976, 97700, 102252, 108814, 112287, 105597, 107106, 103020, 101468, 99634, 97132, 104134, 102496, 96517, 99937, 104158, 98383, 96141, 83735, 81973, 88268, 96364, 104678, 99567, 97988, 96566, 94194, 98998, 100807, 98819, 101275, 105985, 105770, 103590, 104727, 100470, 94694, 94047, 97091, 103811, 104649, 106821, 109432, 100770, 102135, 111055, 113610, 115715, 111628, 117729, 118107, 126032, 132289, 136720, 140239, 143478, 143200, 140323, 142582, 146131, 139309, 129084, 128350, 124121, 118990, 102652, 105017, 111284, 121969, 120648, 124090, 135715, 131369, 129249, 118366, 106022, 112264, 125577, 123367, 119391, 110942, 112250, 124367, 138615, 126285, 119941, 114847, 113355, 120204, 124065, 118872, 122181]
9512A22181N320R06q815J196o04O646Q713m32O236o50N028r521j4414p042l497
9497A11251O675Q508J9196O445N13l251n82m330q241m716J165K688J2950K505
9483A50776q543M457M28N283J118o699o124o730l596O519J3867j108j1885q249
9469A29514j70O52j497O10k408Q962J5222Q054j5236j3041o801m119Q229J1143
9455A39114J3012O865m548o771J2379J3875l542o558N688M509P20m506o515k425
9441A61297k426Q874N264p218K707m857k45Q056L02J0150J7693J4696J3350J9964
9427B47607K5417L4630M735O578L348j0885j8667k2211j9511k2107k3011j2055
9415A93868l312N194r529r435J0525P977n391j3209J648j2602j752M020N230P324
$$ y = [122181, 127501, 128407, 119592, 120788, 120184, 126830, 135543, 135111, 141347, 140697, 145725, 136204, 121790, 114748, 111251, 117926, 126434, 145630, 152075, 152588, 149337, 148755, 144425, 136184, 131468, 132633, 135321, 148271, 150776, 142233, 146690, 147118, 152401, 153519, 146820, 140696, 133966, 130370, 136889, 150756, 149648, 137763, 129514, 129344, 129996, 128499, 129109, 126701, 135663, 150885, 158939, 143703, 130662, 123861, 119742, 127971, 139114, 152126, 158991, 154443, 147672, 160051, 173926, 170384, 163826, 169514, 174023, 174743, 170237, 163722, 161297, 158871, 167745, 173009, 165791, 168498, 163641, 163396, 171452, 171754, 181904, 199597, 214293, 227643, 247607, 273024, 307654, 312389, 318967, 322315, 311430, 292763, 270552, 251041, 228934, 205923, 193868, 190556, 195750, 186221, 176786, 187311, 195288, 189897, 176688, 178336, 165734, 163982, 168002, 173232, 180556]
9401A80556j155L320R233j2887j1733Q927J6016J1571n26j1287J478R369P054
9388B09936j862o050R807J1781L558J8414L0914L1032L5188J2201j095j1695j9141
9375C22988j7364k0004r557j0733k1639r117j278o98o546J105j255l126k009r715
9361B11052P275m298k540k990m301K090M178J835K065o641L95N282J72J182O273
9346B21029j83n863j1154l541P417o146j9P733j77J855M544n551m587M133J6679
9331B26169N603o102p220n76R829J787M309j876k877r674P204R347m155q998O68
9316B23438N564K696P560j546j1575k821m252j329R984Q692J8216m6o961O222
9302B53842Q093k0L319L80N636J335J1032J7564Q713L068J2115M494P264J2682
$$ y = [180556, 179401, 182721, 191954, 179067, 167334, 176261, 192277, 203848, 203322, 192035, 193513, 202882, 209936, 208074, 202024, 211831, 223612, 227170, 245584, 276498, 307530, 342718, 354919, 353824, 342129, 322988, 305624, 285620, 276063, 265330, 243691, 234574, 233296, 232598, 226052, 227157, 225902, 222776, 220767, 211052, 218327, 214029, 211489, 208499, 204198, 206288, 210466, 212301, 214366, 207725, 208120, 213402, 213574, 214756, 221029, 220846, 214983, 203829, 200288, 207705, 201559, 201540, 209273, 209096, 210951, 215495, 209944, 205357, 209490, 226169, 231772, 225670, 218450, 217874, 227703, 229490, 233799, 231923, 229046, 219372, 226576, 235923, 231768, 222770, 223438, 229002, 231698, 239258, 237712, 226137, 223316, 219064, 217735, 227719, 236411, 254627, 254581, 247620, 253842, 261935, 261915, 265234, 265614, 271250, 272585, 283617, 301181, 309894, 312962, 325077, 329571, 336835, 349517]
9288C49517O715J9898J6838J0275J9063J9613J6084K8482L6948L8042K2244R556
9276E93275J4380J515o031k1319k4822k1424j7581j3337k7871k0879j3811k0980
9264D21115j4127k7438k1016j2997n403J298q218j9017R21J193o007j3281j1444
9251B85579o907l020j639J803Q970J2115O962j3038n815J251j959o894M937N859
9237B88204L780O99J3250J0242J2474J0789p237k780P228j832L012L752o353o305
9223C28923j1868j4415j574J3428K550P994K545q495o24k200O552J499m46n589
9209C18280m818l188j014k505j852N207K682N5O015l3j5406o80J1532L678K284
9194C20237R377N10L14J135q635Q815Q645l365N198L81Q50M150O112N997O549
$$ y = [349517, 356232, 376130, 392968, 403243, 422306, 441919, 458003, 486485, 523433, 561475, 583719, 593275, 607655, 609170, 603139, 581820, 556998, 535574, 517993, 504656, 476785, 455906, 442095, 421115, 406988, 379550, 358534, 345537, 340134, 341432, 333214, 314197, 315118, 316311, 310304, 297023, 285579, 278672, 275652, 274013, 275816, 284786, 296901, 303863, 290825, 285010, 286261, 284302, 277408, 282345, 288204, 291984, 292683, 305933, 316175, 328649, 339438, 332201, 329421, 336649, 334817, 337829, 341581, 335228, 328923, 317055, 302640, 301066, 314494, 317044, 325038, 327583, 319088, 318464, 316264, 322816, 324315, 323869, 318280, 313462, 310274, 309260, 306755, 304903, 310110, 312792, 312847, 318862, 318829, 303423, 302743, 314275, 317953, 320237, 329614, 330124, 330438, 331573, 322938, 331753, 340398, 337033, 342231, 342612, 343462, 347612, 353724, 359721, 366270]
9179C66270J7300j509R270Q539j544q99K550k56j1007j136k646p97p958q75o911
9164C68391J722k615n797r966j557k558L674O686K728J530L688K394J705r467
9150C60558j1118L590J0777l842l537k3j172m298O121J1306j275M327J870R319
9136C82603O971j633o341R128J4526O088J1934J4945M454M623N187m671k216m184
9122D41414N472j1865j0351j733O96k725l033J0724L633p59N680O683p140l556
9108D33140K979Q751Q523m258o501k563N186L963j3023K725R617P763k221j3423
9094D40658m91o566J5628J7457k468r992p635o179J028N752j052k945N03J5552
9080D59250J5114Q498o206q101N682J9345J567M366M874J090m996j0464j0675
$$ y = [366270, 383570, 382061, 391331, 399870, 398326, 397427, 399977, 399721, 388714, 387578, 384932, 384135, 376177, 375302, 368391, 370113, 367498, 361701, 351735, 350178, 347620, 351294, 357980, 360708, 362238, 365926, 368320, 370025, 360558, 349440, 353030, 363807, 359965, 356428, 356405, 355233, 350935, 357056, 368362, 367087, 371414, 373284, 382603, 389574, 387941, 381600, 390728, 405254, 411342, 423276, 438221, 442675, 447298, 452485, 447814, 445598, 441414, 446886, 435021, 424670, 422937, 423633, 420908, 417875, 428599, 432232, 431473, 437153, 443836, 436696, 433140, 436119, 444870, 453393, 449135, 442634, 440071, 445257, 449220, 436197, 438922, 448539, 456302, 454081, 440658, 440167, 433601, 449229, 466686, 464218, 454226, 446591, 440412, 441440, 447192, 446140, 443195, 443698, 459250, 474364, 482862, 476656, 468555, 474237, 493582, 495149, 499515, 504389, 505479, 500483, 490019, 479344]
9067D79344n97Q657j2179n200J1373J6634j557r014J4586J6105k984r6j4376j0393
9053D90303P42L216j292m626q785P522k119o140M030L153L442m990m954o03J6145
9038D95044P61M164m02N202J240M071m804k622l086R731j491Q655Q95j7575m987
9023D94796N256J441J3860P069N695J2271J1732J0165M184j559R64l573p786J00
9009E54615N190M713J1830J0433m176J774L895K625N541K81r100p100m279J5336
8995E91578P891m394j373L539J1302Q805Q62m503O822Q006M461q544N098m70R366
8980F38446N730p644j224L036M612M976M843q454K507P678N741n304M788Q475
8966F68206o83K125J6014J0620l446K609j197k473K0569J3287j1902p857J8344
$$ y = [479344, 478747, 487404, 475225, 470025, 481398, 498032, 496475, 487461, 502047, 518152, 515168, 515072, 500696, 490303, 491045, 494261, 492969, 488343, 479558, 487080, 484961, 478821, 482851, 486004, 489446, 484456, 479502, 478899, 495044, 495805, 499969, 499567, 504769, 506009, 510080, 505276, 502654, 499568, 509299, 507808, 516463, 517358, 499783, 494796, 500052, 501493, 515353, 522422, 528117, 540388, 552120, 562285, 566469, 564910, 565874, 562301, 554515, 554615, 559805, 564518, 576348, 586781, 582605, 584379, 588274, 590899, 596440, 596721, 587621, 580521, 576242, 591578, 599469, 595075, 593702, 597241, 608543, 617348, 618210, 613707, 620529, 628535, 632996, 624452, 629550, 629080, 638446, 644176, 636532, 635308, 638344, 642956, 647932, 652775, 644321, 646828, 654506, 660247, 654943, 659731, 668206, 667523, 669648, 685662, 696282, 692836, 695445, 694248, 691775, 712344, 725631, 713729, 705872, 724216]
8953G24216L976K607N456O150K435k270l85o663J787m42M874R643Q239Q36J045
8938G61504l995J0609N973L396M720J994N507P888R748K009L871j0985P138O891
8924H16268k395J65J0131P376m23k195M961l587N461Q317K874J724Q051R885K02
8909H66815L058N775L954J0125n938p228O113L17Q896P477M744M835j306N17P667
8894I15821R010O373J0974M685P865l678r820J487o047j533J7126J331q932q46
8880I43816J0757l0K23J0522O276R69L001M283Q125L816p05m67J4170N154j820
8865A008090K908N396R850M827Q188L424J588M997J4036J0778K027N74j441R943
8851A085185l955r049R300J6023N975J186m268j632k9R532R898J3154l919N217
$$ y = [724216, 728192, 730799, 736255, 742405, 744840, 742570, 742185, 735522, 737309, 736867, 741741, 751384, 759623, 760459, 761504, 757509, 768118, 774091, 777487, 782207, 784201, 789708, 797596, 807344, 809353, 813224, 802239, 809377, 816268, 813873, 814038, 824169, 831545, 831122, 828927, 833888, 830301, 835762, 844079, 846953, 848677, 856728, 866613, 866815, 869873, 875648, 879602, 889727, 883789, 876561, 882674, 882991, 891887, 899364, 904108, 908943, 907637, 908154, 915821, 924831, 931204, 942178, 946863, 954728, 951050, 941230, 942717, 936670, 935137, 952263, 953594, 944662, 943816, 954573, 954543, 954766, 965288, 971564, 972533, 975534, 979817, 987942, 991758, 991053, 990586, 1004756, 1009910, 1008090, 1010998, 1016394, 1026244, 1031071, 1039259, 1042683, 1044271, 1049268, 1063304, 1074082, 1076109, 1076683, 1075242, 1085185, 1081230, 1072181, 1081481, 1097504, 1103479, 1104665, 1100397, 1098765, 1098736, 1108268, 1118166, 1131320, 1127401, 1132618]
8837A132618R775J1713L284M061J1150J3977P298J0683J572o993l010Q560R852
8824A214540K18L175J0636J1694J4832J1822K2182O249o397M224L165J417l675
8811A294082P194J3314J2602L314J1658J1299J0061L863O466K705P003J1833L819
8798A399213J3243J5260J6262K1441J1968R170J4260J4050J4704J3396J4229P737
8786A564933J1056j081P585J1658J1133Q871R898L0259L0934K8744K2042J9368
8774A755400J2182J845O385O976J5787N595J2427J3873N832J4784J9525P557J2001
8761A890169K5079J7484K1467K6460J1343J6357J0164J9983J4756J8903J6803
8750B088968K3890J8933J6736J6196P741Q116J1529R478K3954K5760K0667K1944
$$ y = [1132618, 1142393, 1154106, 1157390, 1161451, 1172601, 1186578, 1193876, 1204559, 1206131, 1199138, 1196128, 1204688, 1214540, 1214758, 1217933, 1228569, 1240263, 1255095, 1266917, 1289099, 1295348, 1288951, 1293175, 1296340, 1297757, 1294082, 1301276, 1314590, 1327192, 1330506, 1342164, 1353463, 1363524, 1367387, 1373853, 1376558, 1383561, 1395394, 1399213, 1412456, 1427716, 1443978, 1465419, 1477387, 1486557, 1500817, 1514867, 1529571, 1542967, 1557196, 1564933, 1575989, 1574908, 1582493, 1594151, 1605284, 1614155, 1624053, 1654312, 1685246, 1713990, 1736032, 1755400, 1767582, 1769427, 1775812, 1782788, 1798575, 1804170, 1816597, 1830470, 1836302, 1851086, 1870611, 1878168, 1890169, 1915248, 1932732, 1954199, 1980659, 1992002, 2008359, 2018523, 2038506, 2053262, 2072165, 2088968, 2112858, 2131791, 2148527, 2164723, 2172464, 2180580, 2192109, 2201587, 2225541, 2251301, 2271968, 2293912]
8738B293912L227P790K6336K1628J7044J2544P606J2761J5090J8453K2060J9285
8726B477736J3802J8989P133K1536K0392N164J0046K148O418J2519R700J5639
8714B621222R948O714K6790K8679K0720K2343Q694J2534J4751K7686L0264K0469
8702B850814K2223K0457K0074K1995L1587L0056L0055M0999K6769L2642K5245
8691C152916K0113J6387K3104L4400L3968K9116M4242M5028L6575L3636L5218
8680C504703K9120L5412L9140M2227L5525K1972J7199K4717M2912L4685M3636
8669C871248K9206L6643M2604N2454M5966M5451N7094O4058M6869M4014M7071
8658D382678M4340N5779O1159O3596P1661O2282N1278P2803O8800O4320O6779
$$ y = [2293912, 2297139, 2304929, 2331265, 2352893, 2369937, 2382481, 2390087, 2402848, 2417938, 2436391, 2458451, 2477736, 2491538, 2510527, 2517660, 2539196, 2559588, 2564752, 2574798, 2576946, 2583364, 2595883, 2605583, 2621222, 2631170, 2637884, 2664674, 2693353, 2714073, 2736416, 2745110, 2757644, 2772395, 2800081, 2830345, 2850814, 2873037, 2893494, 2913568, 2935563, 2967150, 2997206, 3027261, 3068260, 3095029, 3127671, 3152916, 3173029, 3189416, 3212520, 3246920, 3280888, 3310004, 3354246, 3399274, 3435849, 3469485, 3504703, 3533823, 3569235, 3608375, 3650602, 3686127, 3708099, 3725298, 3750015, 3792927, 3827612, 3871248, 3900454, 3937097, 3979701, 4032155, 4078121, 4123572, 4180666, 4244724, 4291593, 4335607, 4382678, 4427018, 4482797, 4543956, 4607552, 4679213, 4741495, 4792773, 4865576, 4934376, 4998696, 5065475]
8647E065475R4290Q1256P7765O9694P6545P4989P7606P8237Q9879R3353R4834
8636E973923Q6587Q6398Q3551R1121R6462R0145Q5152Q1911Q7061R0004J02821
8625F955136J03599R4868J10770J11024J03498J12456J04490J11197J18400J26190
8615H051628J29699J33419J34666J42447J45368J46314J49471J52631J59804J65963
8605I511410J71633J73862J88217J88987J98665K05312K04860K04046K16183K19252
8595A1482427K16854K22438K27815K09738J96889J61456J53661J59915J65344
8586A3196537J59076J70846J79635J97223K10398K11713K26331K54156K67770
8577A5073685K71078K86974L05604L17373L20738L36412L49228L68916L88157
$$ y = [5065475, 5159765, 5241021, 5318786, 5388480, 5465025, 5540014, 5617620, 5695857, 5785736, 5879089, 5973923, 6060510, 6146908, 6230459, 6321580, 6418042, 6508187, 6593339, 6675250, 6762311, 6852315, 6955136, 7058735, 7153603, 7264373, 7375397, 7478895, 7591351, 7695841, 7807038, 7925438, 8051628, 8181327, 8314746, 8449412, 8591859, 8737227, 8883541, 9033012, 9185643, 9345447, 9511410, 9683043, 9856905, 10045122, 10234109, 10432774, 10638086, 10842946, 11046992, 11263175, 11482427, 11699281, 11921719, 12149534, 12359272, 12556161, 12717617, 12871278, 13031193, 13196537, 13355613, 13526459, 13706094, 13903317, 14113715, 14325428, 14551759, 14805915, 15073685, 15344763, 15631737, 15937341, 16254714, 16575452, 16911864, 17261092, 17630008, 18018165]
8568A8018165L95274M20023M28949M45609M51437M81525M98386N15611N43590
8559B2198569N68179N89373O11169O32971O62521O96269P11792P36086P78933
8550B8185862Q09486Q48515Q82662R20499R58897J008016J053533J105529J144490
8541C6917489J201150J260617J313827J385156J443431J510492J576201J662727
8533D8271090J744934J826767J913136K011656K120071K229025K337877K455868
8525F4910424K581963K698382K840827K981793L131181L294581L454449L615654
8517H9509254L786156L954146M125190M289144M453615M615341M767955M914682
8509A24415483N047630N149947N227889N267971N267867N240817N167080N036591
$$ y = [18018165, 18413439, 18833462, 19262411, 19708020, 20159457, 20640982, 21139368, 21654979, 22198569, 22766748, 23356121, 23967290, 24600261, 25262782, 25959051, 26670843, 27406929, 28185862, 28995348, 29843863, 30726525, 31647024, 32605921, 33613937, 34667470, 35772999, 36917489, 38118639, 39379256, 40693083, 42078239, 43521670, 45032162, 46608363, 48271090, 50016024, 51842791, 53755927, 55767583, 57887654, 60116679, 62454556, 64910424, 67492387, 70190769, 73031596, 76013389, 79144570, 82439151, 85893600, 89509254, 93295410, 97249556, 101374746, 105663890, 110117505, 114732846, 119500801, 124415483, 129463113, 134613060, 139840949, 145108920, 150376787, 155617604, 160784684, 165821275]
8501A65821275M832282M585012M267098L886187L433441K928780K374416J773679
8493A93902170J145162M93640j68037q17471j442583k058356k637876l152933
8485A85263716l617866m011511m358402m639397m853327m998660n097723n163176
8477A48523654n180433n154646n086497n010862m893194m771812m644758m491827
8469A09289625m346309m176229m012299l863896l708893l541571l382415l241631
8461G9016382l104769k960227k819211k683171k557551k448201k330949k227239
8453E7885064k120441k018206j932704j855803j769580j687225j599185j527870
8445D3374050j467124j416340j334457j276984j227415j187441j125457j077538
$$ y = [165821275, 170653557, 175238569, 179505667, 183391854, 186825295, 189754075, 192128491, 193902170, 195047332, 195540972, 195372935, 194555464, 193112881, 191054525, 188416649, 185263716, 181645850, 177634339, 173275937, 168636540, 163783213, 158784553, 153686830, 148523654, 143343221, 138188575, 133102078, 128091216, 123198022, 118426210, 113781452, 109289625, 104943316, 100767087, 96754788, 92890892, 89181999, 85640428, 82258013, 79016382, 75911613, 72951386, 70132175, 67449004, 64891453, 62443252, 60112303, 57885064, 55764623, 53746417, 51813713, 49957910, 48188330, 46501105, 44901920, 43374050, 41906926, 40490586, 39156129, 37879145, 36651730, 35464289, 34338832, 33261294]
8437C3261294j034315r93215r44772r07961q74783q41048q00081p70659p46314
8428B5348146p09491o78977o54323o36591o11036n86870n66385n54135n39978
8419A9810360n16807m76681m62679m41640m33122m28372m10168l96041l71626
8410A5873224l65980l56161l43571l43850l25088l02634l03536k92484k88346
8401A2951574k82505k64387k56937k57162k47398k33468k36215k26778k19933
8392A0726791k21724k22880k03355j92645j81313j79383j72251j71692j68905
8383I012643j67925j63427j63787j65012j51876j39339j38593j35463j46013j34780
8373G506428j25564j23123j27661j22824j20826j21548j24278j13992j02836j08367
$$ y = [33261294, 32226979, 31233764, 30288992, 29381031, 28506248, 27665200, 26865119, 26094460, 25348146, 24638655, 23959678, 23305355, 22668764, 22057728, 21470858, 20904473, 20350338, 19810360, 19293553, 18816872, 18354193, 17912553, 17479431, 17051059, 16640891, 16244850, 15873224, 15507244, 15151083, 14807512, 14463662, 14138574, 13835940, 13532404, 13239920, 12951574, 12669069, 12404682, 12147745, 11890583, 11643185, 11409717, 11173502, 10946724, 10726791, 10505067, 10282187, 10078832, 9886187, 9704874, 9525491, 9353240, 9181548, 9012643, 8844718, 8681291, 8517504, 8352492, 8200616, 8061277, 7922684, 7787221, 7641208, 7506428, 7380864, 7257741, 7130080, 7007256, 6886430, 6764882, 6640604, 6526612, 6423776, 6315409]
8363F315409r3419r6757r6332q4657r2853q5993q2326q5084r0959q5818p9143
8352E342068o1288p1397p5143o9527o7300o6967n7190n0064n0941m8751n2737
8341D670763m6231m4067n7073m8403n5383o7045m8115m2890m8613n5052m5541
8330D112350l6512l7336k5862m0610n3571l9830l9338m6739m8353m6092m9567
8319C648540m1470m1317l8652m0172l6015l9088l8439l6326l1908k4932l0442
8308C249779k6067l4025l5488l2767l3353l0270m2012l5406j8108k2963l8845
8297B900475l7540k3663l2229l4868j9841k8092k7122l2417l4402l9266l0021
8286B561014l0377l6450k6245k3435j7938k6147l0832k9582k0881k2541k1548
$$ y = [6315409, 6221990, 6125233, 6028901, 5944244, 5851391, 5765398, 5683072, 5597988, 5507029, 5421211, 5342068, 5280780, 5209383, 5134240, 5064713, 4997413, 4930446, 4873256, 4823192, 4772251, 4723500, 4670763, 4624532, 4580465, 4523392, 4474989, 4419606, 4352561, 4304446, 4261556, 4212943, 4157891, 4112350, 4075838, 4038502, 4012640, 3972030, 3918459, 3878629, 3839291, 3792552, 3744199, 3698107, 3648540, 3607070, 3565753, 3527101, 3486929, 3450914, 3411826, 3373387, 3337061, 3305153, 3280221, 3249779, 3223712, 3189687, 3154199, 3121432, 3088079, 3057809, 3015797, 2980391, 2962283, 2939320, 2900475, 2862935, 2839272, 2807043, 2772175, 2752334, 2724242, 2697120, 2664703, 2630301, 2591035, 2561014, 2530637, 2494187, 2467942, 2444507, 2426569, 2400422, 2369590, 2340008, 2319127, 2296586, 2275038]
8275B275038j9352k5148j6527k3283l1056j5623j6884k5848j7897r606j9757l2858
8263B021199k3453j5924j8257j8098j8139k1157k2295r981j8605j9463j7962j9567
8251A798298j5012j4020r345j0391j0961j2549j7406j7534j3214q252j5279j5244
8239A639091j264k0982k6376q480p802j5025j9489J23M846j6388j4575q378j2393
8226A492908j9304m228r795j9641q235r756J884j5056j8896o743o087m810q373
8213A363868k1980k0815p080j6115j2241J77n333j4249n009j031j1512j0495J427
8200A239612l228o570j1727j3522o068n656N96j3036r127j5371q868P32k336q268
8186A137163n400q457p271k665j1100j6619m617q940j937L367m199j3849n816
$$ y = [2275038, 2255686, 2230538, 2214011, 2190728, 2159672, 2144049, 2127165, 2101317, 2083420, 2073814, 2054057, 2021199, 1997746, 1981822, 1963565, 1945467, 1927328, 1906171, 1883876, 1873895, 1855290, 1835827, 1817865, 1798298, 1783286, 1769266, 1759921, 1749530, 1738569, 1726020, 1708614, 1691080, 1677866, 1669614, 1654335, 1639091, 1637827, 1616845, 1590469, 1581989, 1574187, 1559162, 1539673, 1539796, 1544642, 1528254, 1513679, 1505301, 1492908, 1473604, 1469376, 1459581, 1439940, 1431705, 1421949, 1423833, 1408777, 1389881, 1383138, 1377051, 1372241, 1363868, 1341888, 1321073, 1313993, 1297878, 1285637, 1285814, 1280481, 1266232, 1261223, 1260192, 1248680, 1238185, 1239612, 1236384, 1229814, 1218087, 1204565, 1198497, 1192841, 1193437, 1180401, 1171274, 1155903, 1147035, 1147767, 1145431, 1137163, 1131763, 1123306, 1116035, 1113370, 1102270, 1085651, 1081034, 1072094, 1070157, 1073524, 1069325, 1055476, 1049660]
8173A049660q716q487M58n883j3574j0245o428j2520o335J405j5293l747K65N689
8159I66249l555j0028j3461j0125p753q656j2379j0390p674j2136q860r611m444
8146H47177m397k290M190j8670j5599m978k78m48r369K965n21p579r907m183l323
8131G72790l494q135m212n157j0765k739P483J1394n730j1891o541m892j944k978
8117G23189q93m635j2523q843q216j0805l411q15K236o917p822m70N629J867j4622
8102F52949j2327L13J032q738l244n818K177Q192j4910j5033L876K107j0874n941
8088E93761p22J3505M70K428o038k035k671R827J3888P939K8055L8864L9650K6982
8074G63903J0658m619j9998l0529k4683l4907k9562k6069k0355j5538r198l785
$$ y = [1049660, 1040944, 1032457, 1032915, 1027032, 1013458, 1003213, 996785, 984265, 977930, 979335, 964042, 960295, 960560, 966249, 962694, 952666, 939205, 929080, 921327, 912671, 900292, 889902, 882228, 870092, 861232, 851621, 847177, 842780, 840490, 844680, 826010, 810411, 805433, 805155, 804707, 795338, 798303, 797782, 790203, 780296, 776113, 772790, 769296, 761161, 756949, 751792, 741027, 738288, 745771, 757165, 751435, 739544, 733003, 728111, 726167, 723189, 722296, 717661, 705138, 696295, 688079, 677274, 673863, 673048, 675284, 668367, 660545, 660075, 665704, 667571, 652949, 640622, 640935, 641967, 633229, 629985, 624167, 626344, 634536, 619626, 604593, 608469, 610576, 599702, 593761, 593039, 606544, 607014, 609442, 603404, 601369, 598698, 608525, 622413, 630352, 658407, 697271, 736921, 763903, 774561, 769942, 749944, 719415, 694732, 659825, 630263, 604194, 583839, 568301, 559103, 555318]
8062E55318r843p237j1215l317j76P218L155k453k940J34M188j3352L987L711
8048E27178n34P073k72N8J0867L929m872O346K82j1056m022J7302J2768K4851
8034E89898L1337M1759N9530P7577Q3015O4320M3189J951l0176p6399q8187o6487
8022G31327o2313m2960k4879L31J657j7306l385j997n034m337q571K019J0187
8009E74739p041M670J4570J3690J6209K0257J8935N705q573j3677k968j849j0220
7996F24447j0605j7338j1018r666n695m645k197J4780J3390M335M717K5217K0876
7983F46598K2332J7460j1072j3491j1347j2387k7355l3223j2223j1832k4966j6637
7971E11857O71J1372J1541O353l633j68R522O148L418p227k614L966P7m762l18
$$ y = [555318, 545475, 538238, 527023, 523706, 523530, 530748, 533903, 531450, 528510, 528644, 532832, 519480, 523467, 527178, 526644, 533717, 533445, 533503, 544370, 548299, 543427, 549773, 550055, 538999, 534977, 552279, 565047, 589898, 621235, 662994, 722524, 800101, 883116, 947436, 990625, 992576, 962400, 886001, 797814, 731327, 669014, 626054, 601175, 601506, 603163, 585857, 582472, 580475, 575441, 571104, 562533, 564552, 574739, 567698, 572368, 586938, 600628, 616837, 637094, 656029, 661734, 653161, 639484, 636516, 634667, 624447, 613842, 596504, 585486, 575820, 570125, 565480, 563283, 578063, 591453, 595788, 600505, 625722, 646598, 668930, 686390, 675318, 661827, 650480, 638093, 610738, 577515, 565292, 553460, 528494, 511857, 512528, 523900, 535441, 541794, 538161, 537993, 547515, 553663, 557081, 549854, 547240, 551206, 551283, 546521, 546203]
7956E46203l756r067l895j3296l292l483j0808q139j5772r659j1730p598n29j9023
7942D26156j3708m027M321J123l107K080n218j2059m087R253j1635l514n208l326
7928C77044q706n229J2991N120l000O18l447j7745j4368j300l078j8909m177p430
7914C08384o362n009k253J1615k632j3315q596l064K904q88q585K583K06M92r896
7899B65584j6845k15l216R835R410r433p731k257o076j46J371M646m461j0673
7885B29793o190M00m882p787J862l704p394k195M960o575r859o775M163O602L475
7870A95894m907n620K759M092o312p925l874L820K692K349P104k022n999K414
7856A84465P3L789m634l162P919O820N221n83M75Nn032k856K737o277j2602K043
$$ y = [546203, 542447, 533380, 529485, 516189, 512897, 509414, 498606, 490467, 474695, 465036, 453306, 445708, 445179, 426156, 412448, 408421, 412742, 413865, 410758, 412838, 407620, 395561, 391474, 400727, 389092, 385578, 380370, 377044, 368338, 363109, 376100, 381220, 378220, 378838, 375391, 357646, 343278, 341978, 338900, 319991, 315814, 308384, 302022, 297013, 294760, 306375, 303743, 290428, 281832, 278768, 281672, 280784, 272199, 274782, 274988, 275480, 265584, 248739, 248524, 245308, 255143, 264553, 255120, 247389, 245132, 239056, 238910, 240281, 244927, 240466, 229793, 223603, 224003, 219121, 211334, 213196, 209492, 202098, 199903, 204863, 198288, 188429, 181654, 185817, 192419, 195894, 190987, 185367, 188126, 192218, 185906, 177981, 174107, 177927, 180619, 182968, 190072, 188050, 182051, 184465, 184538, 188327, 183693, 180531, 188450, 195270, 200491, 199908, 200383, 200388, 195356, 192500, 195237, 188960, 176358, 178401]
7840A78401j0352p863M809l452m782K849l629n146o553k611J6497R688j650m946
7826A61260m860l469J364J428L034m306Q94R982L140k606j0247j4930L874j0667
7812A33891o777l92K935R034M957J0277j4896q904m77l513r758J0900N211j697
7798A30791K601L841J3884q59p542o155n485p678q594K815M869m966N071N526
7784A28119k690K48Q08m537n852O270O086m837l890J995j680P464P271m215m070
7769A26490Q124j0163j4275j2187k047P017J1182R239o781o454N979Q974j6726
7756A08372r693Q783J167l182p913l606M454J0465L978K116K833k924n239j0909
7742I8702j2142K222j311L100j288j912L001Q430O173J237L301j274j2122l472
$$ y = [178401, 168049, 160186, 164995, 161543, 156761, 159610, 155981, 150835, 144282, 141671, 158168, 167856, 166206, 161260, 156400, 152931, 154295, 155723, 158757, 154451, 155345, 165327, 168467, 165861, 155614, 140684, 144558, 133891, 127114, 126722, 129657, 138691, 143648, 153925, 139029, 130125, 129648, 126135, 116377, 127277, 132488, 130791, 133392, 137233, 151117, 150258, 142716, 136561, 131076, 123398, 114804, 117619, 122488, 117522, 122593, 128119, 125429, 125677, 126485, 121948, 116096, 122366, 128452, 123615, 119725, 121720, 120040, 127504, 134775, 130560, 126490, 134614, 124451, 110176, 97989, 95942, 102959, 114141, 123380, 116599, 110145, 116124, 125098, 108372, 98679, 107462, 108629, 105447, 97534, 93928, 98382, 108847, 112825, 114941, 117774, 114850, 109611, 98702, 86560, 88782, 87471, 90571, 89283, 87371, 90372, 98802, 104975, 106212, 109513, 108239, 96117, 92645]
7728I2645k765K873K328J522r576o223K952J3466l463j0374o39J0549N12K070
7714I5877k130n344K003N238K952L375p073q257M7l761m665M233J539N387J732
7699I1153J972p088m373m7j3256m262k831l380Q763J5651K109r503N792l70j2764
7684F7566m038L730P003K96j0961Q858O701M02r686O970J3397P75j9285p837K025
7669F5916n373k929l637J658j862M088K440k527K715J673O074Q624j902R83m970
7654G0971l014M764N175J024l142j0563q751N041Q451p390L783n00r385o941K256
7639E1779Q205k379O794L534K459k764l112P022R398j5840n120l945o424O717
7625E6324j826r938J0976N51Q59K604K935l613L476j405k57J3240j934p782j1614
$$ y = [92645, 89880, 92753, 95081, 96603, 87027, 80804, 83756, 97222, 93759, 83385, 82746, 93295, 93807, 95877, 93747, 88403, 90406, 95644, 98596, 101971, 94898, 86641, 86688, 82927, 78262, 82495, 84034, 89421, 91153, 93125, 86037, 81664, 81617, 68361, 64099, 61268, 57888, 66651, 82302, 84411, 74908, 80700, 80330, 67566, 63528, 67258, 74261, 74557, 63596, 72454, 79155, 79557, 69871, 76841, 90238, 91013, 71728, 63891, 65916, 60543, 57614, 53977, 55635, 53773, 57861, 60301, 57774, 60489, 62162, 68236, 76860, 74958, 75941, 70971, 67957, 72721, 77896, 78920, 75778, 65215, 56464, 61505, 69956, 62566, 66349, 65849, 56464, 49523, 51779, 59984, 57605, 64399, 67933, 70392, 67628, 64516, 71538, 80936, 65096, 59976, 56031, 49607, 56324, 54498, 44560, 55536, 56087, 56946, 59550, 62485, 58872, 62348, 60943, 60686, 73926, 71992, 64210, 52596]
7610E2596j299R95n621o201J630R283m514m929j1724N323J2192P932l578l98J0852
7595F2539M112r87n247j348K962k74j175P621j587k574m933n708M556O252K444
7580F6653o94j0236j3617p33K13Q394j771r326Q02J4363P304j415n011M502k120
7565E7308L699K319L96k68k409n684r321j472k696r64M558K499J705n883P25p217
7549C7295o460M829J061N047J659j774J228P5n229l365M88J946P677J0109M350
7534E8936q282J260O27k18p475j1921l94o066J0246J6093L227l451j2970k290
7520C7322K032M493P370m52o952j3520j1197J0849J136p234J812P465P05K89M065
7505C8183k653j0363j0689k520M942M096J0135J0699o40r463j895J3327M592P677
$$ y = [52596, 51297, 52292, 46671, 40470, 42100, 51383, 46869, 41940, 30216, 35539, 47731, 55663, 52085, 51687, 62539, 66651, 65664, 60417, 59069, 62031, 61757, 60582, 68203, 66616, 64042, 59109, 53401, 57957, 64209, 66653, 65959, 55723, 42106, 41373, 41586, 49980, 48209, 38883, 39685, 54048, 61352, 59937, 54926, 59428, 57308, 61007, 63326, 63722, 63454, 61045, 55361, 46040, 44568, 41872, 40908, 45466, 47965, 49670, 43787, 44512, 37295, 30835, 35664, 36725, 41772, 43431, 41657, 42885, 42960, 37731, 34366, 34854, 36800, 44477, 54586, 58936, 50654, 51914, 52541, 52323, 44848, 32927, 32533, 26467, 36713, 52806, 56033, 52582, 39612, 37322, 39354, 43847, 51217, 50765, 43813, 30293, 19096, 29945, 31081, 23847, 25659, 33124, 33829, 34118, 38183, 35530, 25167, 14478, 11958, 16900, 20996, 31131, 41830, 41190, 31727, 29832, 43159, 47751, 55428]
7491E5428j2249k3430r028J0743J4373J216n223k666L847k771L149K537p312Q322
7477C6936K709j2863l775n978Q85O851L741k646k195n11q754j1147R033J2634
7463B4920K085M003O823Q344L030r281q972j0177k564P276N319K145L739Q899
7449D5589L095l387q783l874N51j869n936K383k335r660J935q168q362N02O730
7434H411J210l82Q318O390K486K500M536M337r791j9085J487K64N957l533o566
7419F539J155Q295L940J1755Q684p999l665j883p010M36p235j798N918M964o183
7404A5913q36L502N37l120l705N592p588k49p383P784J2560p3q758K264K953o491
7388A2902m341O002P039K418L703R908k347q465l38l93l31m588j0109J995J0984
$$ y = [55428, 43179, 19749, 10721, 21464, 35837, 37053, 31830, 29164, 33011, 30240, 33389, 35926, 28614, 36936, 39645, 26782, 23007, 17029, 17914, 24765, 28506, 25860, 23665, 23154, 14400, 3253, 12286, 24920, 27005, 31008, 37831, 46175, 49205, 39924, 30952, 20775, 18211, 25487, 30806, 32951, 36690, 45589, 48684, 45297, 36514, 32640, 33191, 31322, 25386, 27769, 25434, 15774, 17709, 9541, 1179, 1681, 8411, 9621, 9239, 17557, 23947, 26433, 28933, 33469, 37806, 28015, 8930, 10417, 10681, 16638, 13105, 6539, 7694, 15989, 19929, 31684, 40368, 32369, 28704, 26821, 19811, 20247, 13012, 11214, 17132, 22096, 15913, 15077, 18579, 19116, 15996, 12291, 17883, 10295, 10046, 2663, 10447, 23007, 22934, 14176, 16440, 19393, 12902, 8561, 14563, 21602, 24020, 27723, 37631, 35284, 26819, 26481, 26088, 25757, 21169, 11060, 13055, 24039]
7373B4039O361j0091q44K055j0386J028N681n518o253K228J3124R577p412r870
7359A3719O618J514o954K650k372o954l843j1257j2482Q425J6727j159O50R833
7345A5115M92P496o388j6905P172j617L941l861K334N925p10m34J2197N81o209
7330A9129q787n116N183J0779r672M943J0403m395q258J0171k857j0366K172q106
7316E223l593l737o780P051J0214j785p74K269r039q430n156J2302M094k183l145
7301c469L478J1308M75j4836j343M363R242J1329k345l52k991L362j4151k828
7287A242J2288R382q33j1192p781N170q294j410R58k755P620O426l256J233M528
7272A3326j0944L5O01L46K331m097p881P846J4193L216p302o545J388N888K751
$$ y = [24039, 30400, 20309, 19465, 21520, 11134, 12162, 17843, 12325, 6072, 8300, 21424, 31001, 23589, 13719, 20337, 21851, 14897, 17547, 15175, 8221, 4378, -6879, -19361, -10936, 5791, 4632, 5282, 15115, 15607, 23103, 16715, -190, 6982, 5365, 9306, 5445, 7779, 13704, 12994, 12560, 24757, 25338, 19129, 10342, 5226, 10409, 21188, 11516, 16459, 26862, 22467, 14209, 24380, 21523, 11157, 13329, 5223, 1630, -2107, -8887, -1836, 8378, 6593, 5819, 8088, -951, -9381, -14537, -2235, 1859, -324, -3469, 9, 11317, 11792, -3044, -4387, -24, 9218, 20547, 18202, 17850, 14859, 18221, 4070, 1242, 13530, 22912, 22079, 10887, 3106, 8276, -18, -1428, -470, -3225, 4395, 10821, 7565, 8798, 13326, 2382, 2417, 3018, 3364, 5695, 1598, -6283, 1563, 15756, 18972, 11670, 5125, 6513, 12401, 15152]
7257A5152p442l237J761j0604p28L776L754o589o560j271J0741L83o307l273r530
7242a9974Q831J3743j005Q190m233j0828J127n956N56N972m724L379J3357L501
7228A1936j1795j2205J3188J4187J258n466j2484r869J990J4808O998k086j639
7215H821q301m731j529J727m464K809Q944N082l418j8558j0001K90K743P051O066
7200g469J504M143K086N541j4014j1908o860J3108K0427l835j0840O270j736L573
7186a0R634j2760q189K687K148k061N051j600k009q708n843P359P176p899K662
7171a2362o86L555O809m853R14J2027j362n718n7k7R477j228p050k421K414l071
7155c639n284K868R213J1707q984j1710N26k989p726j031Q929N528J7k391j07
$$ y = [15152, 7710, 4473, 6234, -4370, -5098, -1322, 2432, -4157, -10717, -11988, -1247, -864, -7171, -10444, -19974, -11143, 2600, 1595, 9785, 5552, -5276, -4149, -10105, -9549, -3577, -8301, -4922, 8435, 11936, 141, -12064, 1124, 15311, 16569, 11103, -1381, -11250, -9260, 5548, 12546, 10460, 8821, 520, -4211, -5740, -4013, -8477, -5668, 3276, 8358, 4940, -13618, -23619, -23329, -20586, -13535, -7469, -5965, -1822, 264, 5805, -8209, -20117, -26977, -13869, 6558, 2723, -8117, -1847, -3583, -10, 9624, -3136, -11325, -8638, -6490, -8551, -3500, -5100, -7109, -15817, -21660, -14301, -7125, -15024, -12362, -13048, -9493, -2684, -7537, -6623, 5404, 4042, -1676, -1733, -1760, 7717, 6489, -561, -2982, -568, -3639, -8923, -6055, 3158, 14865, 5881, -5829, -5303, -8292, -16018, -17049, -8120, -2592, -2575, -4966, -5073]
7140e073J944J202N74q242l129l318R18O665J750k435o252J0500J423j412J1252
7125F367K318rj2955r943m76J4328J0063p238l634m641k835K116Q277j571r267
7110i100l581O327R048N420j6478K67l948m591k77M885k986m101J986m620j6k133
7094b3898R963O577J00k049j505O84J533j524r32M371m962r742o586J1173K822
7079a3975k534J1145P126k773j4169j210K525R311m983n702O529L393J31L996
7065a190K049j550o073j1275N495R110l678m110M628l100J856k990O78N152Q694
7050C696j069j2676Q572M227j025n672o877K336j2541K01J0116L201J363o452
7036a2600L291O125K283L135l222p613o572m825J8295J3257l994j0131n589k910
$$ y = [-5073, -3129, -1927, -1353, -9595, -12724, -16042, -15124, -8459, -6709, -9144, -15396, -4896, -3473, -4885, 6367, 8685, 8676, -4279, -14222, -14698, -370, 9693, 2455, -1179, -5820, -8655, -6539, 1738, 167, -9100, -12681, -6354, 2694, 8114, -8364, -8097, -12045, -16636, -16913, -12028, -15014, -19115, -17129, -21749, -21765, -23898, -13935, -7358, -7258, -9307, -10812, -10128, -8595, -10119, -11051, -6680, -11642, -21384, -27970, -16797, -13975, -16509, -5364, 1762, -1011, -15180, -16390, -13865, -4554, -9537, -15239, -8710, -5317, -5186, -1190, 859, -691, -6764, -18039, -12544, -3434, -7112, -11222, -6594, -9694, -7838, -10828, -10150, -4998, 3696, 2627, -10049, -1477, 2750, 1725, -3947, -10824, -8488, -21029, -20828, -10712, -7511, -6148, -12600, -9309, -3184, -901, 2234, -988, -8601, -15173, -19998, -1703, 11554, 7560, -2571, -8160, -11070]
7022a1070K805K327k614k221J83j179J391J669m27k432l301Mk242J887P44M913
7006i563L109K076k602L544J694r422m88J2947K959l350k95k337p86J067k155
6991c602r459l823J522L857L472K964L455P234k889j2996j6208j847N572M41o215
6976b8522L703J0142K466R51M024L596Q29j860n423j546Q93L07L267J352o143
6961a1964k046N538j396L221k460j701l333N219l603o024L638o472m229o4p73
6946b6449j3867J20J2318O856r643o47L128k805J129K280O359M576L134K56o256
6931a9511M614P71l395n329J796J5890L050n311L992n723j378L73m02l118l320
6916a7001L304m548J956J1658L56n025L533N003L335m811m305r628j3078r64O346
$$ y = [-11070, -8265, -5938, -8552, -10773, -10590, -11769, -10378, -8709, -9136, -11568, -14869, -14865, -17107, -15220, -14476, -9563, -6454, -4378, -6980, -3436, -1742, -11164, -11652, 1295, 4254, 904, 609, -1728, -2514, -1447, -3602, -13061, -16884, -15362, -11505, -8033, -5069, -1614, 5620, 2731, -10265, -26473, -28320, -22748, -22307, -28522, -24819, -14677, -12211, -11260, -7236, -3640, -2811, -4671, -10094, -11640, -10747, -10440, -7173, -5821, -11964, -14010, -8472, -9868, -6647, -9107, -10808, -14141, -8922, -12525, -18549, -14911, -21383, -25612, -25676, -26449, -40316, -40196, -27878, -21022, -30665, -31312, -28184, -30989, -29860, -27580, -21221, -16645, -13511, -13255, -19511, -14897, -14126, -17521, -22850, -21054, -5164, -2114, -7425, -3433, -9156, -10534, -10161, -10563, -13681, -17001, -13697, -18245, -16289, -4631, -4275, -9300, -5767, -764, 2571, -2240, -6545, -16173, -29251, -30215, -23869]
6901b3869P208j208K809L767J4146L644p975j0747l035R589k570n341j606Q146
6887g042N67m414l99L315p522k977J260J0493R413o563q622j3674N104L895l100
6872b0266l788M416J713J26Q921O981L747P930o807r110R091j324r516j3835m597
6857b6318Q382L691m054j1643Q678J726k723o294J8043J0685N059l522n581j1417
6843a5288J399M29p692PM18J1293K186J246j027Q5p214P704Q405J315N0k012q900
6826g596J0349N826j292m892j3717l07O681j726j177L162L858O584m824o15J101
6811A415J442J6893M273R07K030P487P541l387l333j4717j1120K647J0997J1342
6797C4417k006L830K5282K1841J1753J6207L2032M3902Q3905J34823J31175O1025
$$ y = [-23869, -16661, -17869, -15060, -11293, 2853, 6497, -1478, -12225, -15260, -5671, -8241, -13582, -15188, -7042, -6475, -10889, -11288, -7973, -15495, -18472, -17212, -6719, 2694, -3869, -12491, -26165, -21061, -17166, -20266, -24054, -19638, -17925, -17799, -8878, -1897, 1850, 9780, 2973, -6137, 2954, 1630, -7886, -21721, -26318, -17936, -14245, -18299, -29942, -21264, -19538, -22261, -28555, -10512, 173, 5232, 1710, -3871, -15288, -13889, -13460, -21152, -21145, -20727, -9434, -7248, -6002, -7029, -6944, -14158, -6454, 1951, 3266, 3316, 1304, -7596, 2753, 8579, 7287, 2395, -11322, -11629, -4948, -6674, -7851, -4689, -831, 5753, 929, 314, 1415, 2857, 19750, 24023, 24930, 26960, 34447, 41988, 38601, 35268, 20551, 9431, 12078, 23075, 34417, 32411, 36241, 61523, 83364, 95117, 111324, 143356, 187258, 271163, 405986, 537161, 598186]
6785E98186l0853p2949j03759q2905o1506m7165l1133l8410l2759j4856j0492
6774G1399j3996p609j0166N685n380j4807r193O484J85j1163J507J391j1662m021
6760a346o701m57K041O932J1142j448m216o970Q53l148M070P779J775o599O335
6745A0042L277p590p79q126r643K402P28k346L375J760J488m67r086j9130P69
6730c3326J5003J6513J0021l801k224m757j2581m243k038N469M837p652K077J3480
6716c222J0090k655O92q573K23M513k954m059N5J519m03Q78O17j3866j1573p2
6700b8790J906J222l47r026J1866J6527Q54n394o500r7J088O53K249L134J1592
6685I37o55j727Q33k016l055n479P510R331P022o694p116K252J646k226j3381
$$ y = [598186, 567333, 494384, 390625, 307720, 246214, 199049, 167916, 129506, 96747, 81891, 71399, 57403, 49794, 39628, 45313, 39933, 25126, 15933, 22417, 22602, 11439, 12946, 14337, 2675, -1346, -8047, -8504, -6463, 469, 11611, 10163, 5947, -1023, -170, -3318, 752, 8531, 10306, 3707, 10042, 13319, 5729, 4950, -3176, -12819, -10417, -9689, -12035, -8660, -6900, -5412, -5879, -14965, -34095, -33326, -18323, -1810, 8211, 4410, 2186, -2571, -15152, -19395, -21433, -15964, -11127, -18779, -16702, -3222, 6868, 4213, 4905, -3668, -3445, 1068, -1886, -5945, -5890, -4371, -4774, -3896, -3279, -17145, -28718, -28790, -26884, -25662, -26009, -35035, -23169, -6642, -5788, -11182, -17682, -17779, -16691, -16038, -13789, -10655, 937, 282, -1445, -612, -2628, -5683, -11162, -3652, 5679, 12701, 6007, -1109, 1143, 2789, 563, -12818]
6670a2818k006Ql760J345J973K147M049Q452m560K380j086K346j484p486k927
6655a3427o570J0386J1228l967l595k352o188k603N70o090n879J1952q282r18
6641b5735J1813M922L343p11j3525j3333O992R879n534o639j0317n43Q787L05
6627c0296M803N482Q945M48l196j3399o403J0301O659J614K139R61K017N799j431
6612e557k426j3817l620K836j508M437L2n051l592M899M384Q858M36k120k278
6597a4087m421r16j689n828N122J0178J1101J182n007J630n885J1235J0697j4715
6583a403j8609K622M458l672p636K988K218N621J850m082L023O462N263l738k10
6568d845m105j1901k056m362R86p222K279J4254J2792j855k694J139N337j0204
$$ y = [-12818, -14824, -14816, -18576, -17231, -15258, -13111, -9062, -610, -5170, -2790, -3876, -1530, -3014, -10500, -13427, -19997, -9611, 1617, -2350, -5945, -8297, -14485, -17088, -16518, -22608, -28487, -16535, -24817, -25735, -13922, -9000, -5657, -6368, -19893, -33226, -26234, -16355, -21889, -28528, -38845, -39388, -30601, -30296, -25493, -20011, -11066, -10618, -13814, -27213, -33616, -23315, -16656, -15042, -12903, -11942, -9925, -4126, -5557, -7983, -21800, -25420, -22584, -24092, -19655, -19623, -24674, -28266, -23367, -18983, -10125, -9689, -11809, -14087, -18508, -19424, -21113, -26941, -21819, -11641, -540, 642, -4365, -2735, -8620, 2615, 13312, -1403, -20012, -17390, -12932, -16604, -24240, -21252, -19034, -13413, -11563, -15645, -12622, -6160, -897, -4635, -4845, -8950, -20851, -22907, -27269, -26283, -33505, -31226, -16972, -4180, -6035, -8729, -7590, -2253, -12457]
6554a2457l589P166K577j948r149K503K711J182n774l482m11P123O258r518k769
6539a9577K101l069Q214q41r144l618k078M917J2894N240r57o989L762Q540m26
6524a031m555Q09r123m21J315P668L213o706n319l142J2457Q669k380p770k453
6509h769m966m064j0279m705J0783j621q835K781N161l936R542O822Q53J613o173
6494a5793ol792M691J710j324l341j4492K12P592P6K016Q514q54k256N159M162
6478g726J0870k552n799j365j58o697o457P240O768J211m490p165L23K719M84
6463a2794p537j851P97p183r28K356J0026N553J0470l978K183k890L948Q895q843
6448a776L523P653p246m521L816l72n897n985j2773p330l39M546J370r04L913
$$ y = [-12457, -16046, -8880, -6303, -8251, -17400, -14897, -12186, -11004, -16778, -20260, -20671, -13548, -7290, -16808, -19577, -17476, -20545, -12331, -13172, -22316, -25934, -28012, -23095, -10201, -4961, -5918, -12907, -9145, -605, -1031, -5586, -4777, -13900, -14321, -13006, -5338, -2125, -8831, -14150, -17292, -4835, 3834, 1454, -6316, -8769, -13735, -17799, -28078, -32783, -22000, -23621, -32456, -29675, -24514, -28450, -18908, -12086, -11233, -9620, -15793, -15799, -19591, -14900, -13190, -14514, -17855, -32347, -32135, -24543, -24467, -22451, -13937, -14791, -17047, -11888, -7726, 3144, 592, -5207, -6572, -6730, -13427, -19884, -12644, -5876, -4665, -9155, -16320, -15997, -13278, -12794, -20331, -22182, -21385, -28568, -29496, -27140, -17114, -11561, -1091, -5069, -2886, -5776, -1828, 7067, -1776, 1747, 9400, 2154, -2367, 1449, 1077, -4820, -10805, -23578, -30908, -31247, -26701, -25331, -26235, -22322]
6433b2322L844N631J3203o317n153k734L782l021k263o699K027M155p895j3502
6419c7264O958N849O232R317k731l282p864o263L005N914J848L330Q489n115k455
6404a4032k760P297J562J395K569n350Q587J3192K70J066L020j1075n676k044
6390a979p635r083L040L203l877k499k166l520O528J870K798L84L226o74j0170
6375b0554M776O35r11M84n55J2040R245l757n173j3305p328r674L771J0716L617
6360a5973N962J241Q124k274l437J501N88j798J3683k422j3375n192j699k064
6346a7135n371o901K746N632O810p295r035r074q26P261P262K010l057K749R880
6331a4344Q880o256p499o665P928J3390m957k336m204o607P727Q389P515l473
$$ y = [-22322, -18478, -12847, 356, -5961, -11114, -13848, -10066, -13087, -15350, -22049, -20022, -15867, -23762, -37264, -30306, -24457, -18225, -8908, -11639, -14921, -22785, -29048, -26043, -20129, -18281, -14951, -6462, -11577, -14032, -16792, -9495, -7933, -6538, -3969, -9319, -732, 12460, 12730, 13796, 16816, 5741, 65, -1979, -9614, -18697, -15657, -12454, -16331, -18830, -20996, -24516, -17988, -16118, -13320, -12936, -9710, -10384, -20554, -15778, -15143, -16054, -15570, -16125, -4085, 5160, 1403, -3770, -17075, -24403, -34077, -30306, -19590, -15973, -10011, -8770, -646, -2920, -6357, -4856, -4268, -6066, 7617, 5195, -8180, -13372, -15071, -17135, -22506, -29407, -26661, -21029, -14219, -21514, -30549, -39623, -40449, -33188, -25926, -23916, -26973, -24224, -14344, -5464, -11720, -19219, -25884, -17956, -4566, -9523, -11859, -16063, -22670, -14943, -6554, 961, -2512]
6317b512r286q356k7M942J2393J5969l18o232n352n922l688n274l745J5154n82
6302b836m764K474k32j792q108K060J610q533j6630N719K245L131P566J195l423
6287b0318L04J889n436J652J1042Q722o419n665o41M168J1250p247j3660J513
6273a8846l79j159J50l787R394R201l810r249n430N020R089L377q169r974R051
6258a5521K210q518M432O868j0269l562J83J504L829Q369K437j649o898K058L337
6243a1190P685l602m499j4965m913M49Q14J3312O687p235q81M428m578p143n469
6228c1100R50Q342N365j0333l121Q041Q379m326p377m036m53M070p053o557J4042
6213b5167M038P34R39P261R274n166n163M052o979k551m191p87m5L343N734J610
$$ y = [-2512, -11798, -20154, -20181, -15239, -2846, 13123, 12805, 6573, 1221, -4701, -8389, -13663, -17408, -2254, -2836, -7600, -5126, -5358, -7150, -15258, -13198, -11588, -20121, -36751, -31032, -28787, -25656, -18090, -16895, -20318, -20014, -18125, -23561, -21909, -10867, -2145, -8564, -14229, -14870, -10702, 548, -6699, -20359, -18846, -19225, -20384, -20234, -24021, -14627, -5426, -9236, -18485, -23915, -18895, -9806, -6429, -14598, -24572, -15521, -13311, -21829, -17397, -10529, -20798, -24360, -24177, -22673, -18844, -10475, -8038, -9687, -16585, -14527, -11190, -3505, -7107, -11606, -26571, -31484, -31035, -30221, -16909, -10222, -17457, -18338, -13910, -18488, -25631, -31100, -30150, -21808, -16443, -26776, -29897, -21856, -13477, -17803, -25180, -29216, -29669, -25599, -32652, -39209, -25167, -21129, -20395, -19456, -12195, -2921, -8087, -13250, -9198, -16177, -18728, -22919, -23706, -23751, -20408, -14674, -13064]
6197a3064m636N275m587O981J0574M15j3776p207Q159J3539j2985J1121P174q716
6183a733j0806k037M671m845p427p947p370N444P559N960L676L550K702q417k397
6168a9417M270K517k057O994j139m09K811K512P823k129r364n35L160p138N028
6153g073J184K667m01j117K215L961k171L524L351n267r141q931L22k08R230m165
6137a2020j2438o006N388M349m853J431L381m398L279k922n89p095J0292J411
6123b0790L589M802M845m56l243p281L752O05n74k478m403k155J2753L910J842
6108e282J1898j5917n170L868J442M265p098R884k376j1100j719p590J616M591
6094a8688q41p902j548N498R07n866Q405Q015N647m499m57O87j393j0609n271
$$ y = [-13064, -17700, -12425, -17012, -10031, 543, 958, -12818, -20025, -11866, 1673, -11312, -191, 6983, -1733, -12539, -14576, -9905, -14750, -22177, -30124, -37494, -32050, -24491, -18531, -14855, -11305, -8603, -17020, -19417, -15147, -12630, -14687, -7693, -8832, -9241, -6430, -3918, 3905, 1776, -7588, -8123, -4963, -12101, -7073, -5889, -3222, -3623, -4740, -2525, 1436, -735, 2789, 6140, 873, -8268, -17199, -16877, -17085, -7855, -12020, -24458, -30464, -25076, -20727, -25580, -24149, -20768, -25166, -21887, -24809, -25398, -32493, -22201, -20790, -17201, -12399, -7554, -8010, -11253, -18534, -14782, -14177, -14751, -17229, -21632, -23787, -11034, -7124, -5282, 6616, -9301, -14471, -10603, -9161, -4896, -11994, -2110, -4486, -15586, -17305, -24895, -23279, -18688, -19529, -27431, -28979, -23481, -22574, -28440, -20035, -12020, -6373, -10872, -11329, -10642, -12035, -22644, -27915]
6079b7915M845J8526J4335q186j5559J645M024N716K153K504J995M285j474n525
6065A369j0726j653m086L369q44J963j196O149J559l568p29K109K632J254q867
6050a1265l482p95l98J0553J31l592m946N240l295n303l338j626N799K3884N853
6035A3420j2850j3028J0004O056Q158p631q71j05N926L83p658k714L970j1374
6021h314q347l893J902O877J3608j33o072m910n571k731O421l413j752O450K583
6006g295L858n761p817M536J2442o199j1112k391q680N564K805L984m440p852
5992b8358J377J2756K010m875r807j698j164J062J1243Q176q332j912p480K583
5978b4419J6018N13L271N745j2492L952m324m786m859J767M749J273Q482P771
$$ y = [-27915, -23070, -4544, 9791, 1605, -13954, -12309, -8285, -2569, -416, 2088, 4083, 8368, 6894, 1369, -9357, -11010, -15096, -11727, -12571, -10608, -11804, -5655, -4096, -7664, -8393, -6284, -3652, -2398, -11265, -14747, -15542, -15940, -5387, -5256, -8848, -13794, -8554, -11849, -17152, -20490, -22116, -16317, 7567, 13420, 570, -12458, -2454, 3602, 11760, 4129, 3258, 3153, 9079, 9462, 1804, -910, 3060, -8314, -16661, -20554, -18652, -11775, 1833, 1700, -4372, -9282, -14853, -17584, -11163, -14576, -16328, -9878, -7295, -3437, -9198, -17015, -12479, -37, -6236, -17348, -19739, -28419, -22855, -20050, -16066, -20506, -28358, -26981, -14225, -12215, -17090, -26897, -28595, -29759, -28697, -17454, -9278, -17610, -19522, -27002, -24419, -8401, -7888, -4617, 1128, -11364, -7412, -11736, -16522, -21381, -19614, -14865, -13592, -5110, 2661]
5964B661o491r240k893M351k544j0908J254O931O977K361j1013m865Q610N188
5950i621L795j0392o578L832J452l941j2294k182M044P993J3985J3013j0068K859
5936d103M370j285o352j72M915M69j6311o989N117R322P71m731M323J870r470
5921a8256p011J282J2998J764k014j0761J827P350r525o58m067M439N247l555
5907b0940K566n168l763J767l340j855Q261K14J7021L028K492L716j569k126o395
5892f091r185j7433Q201J5489n408L564Q752m375o317l357j398j616j264k576
5878b3014K039j0143m861R521q151p813J1158L995K007O415N582K115l771l006
5864a7927n629L170J7347Q870k219m577o532j643J1158L870l084L251k610r219
$$ y = [2661, -3830, -13070, -15963, -11612, -14156, -25064, -23810, -16879, -9902, -7541, -18554, -23419, -14809, -9621, -5826, -16218, -22796, -18964, -17512, -21453, -33747, -35929, -31885, -23892, -9907, 3106, -6962, -4103, 267, -1018, -7370, -7542, -2627, -2158, -18469, -25458, -20341, -11019, -10248, -14979, -10656, -8786, -18256, -25267, -23985, -10987, -9223, -11237, -21998, -20171, -12821, -22346, -23004, -27071, -22632, -17385, -20940, -18374, -23542, -27305, -25538, -28878, -30733, -22472, -22258, -5237, -2209, 283, 3999, 2430, 304, -6091, -15276, -32709, -24508, -9019, -14427, -10863, -2111, -6486, -12803, -16160, -17558, -19174, -20438, -23014, -20975, -31118, -35979, -26458, -34609, -42422, -31264, -27269, -25262, -18847, -13265, -11150, -14921, -17927, -23556, -20386, -3039, 5831, 3612, -965, -7497, -9140, 2018, 5888, 2804, 6055, 3445, -5774]
5850e774r558M939J0764Q465K492M657N739r114j5489l491M377N713l365K932
5836C287P703L679l392j357o362n479r656J388O469J74j1921J998Q532M095J43
5821f99k2qq900j970o22J667P540k38l011p64n561J787Oj804R71N749j2066q519
5803b6464j117r67k838J2355O911P851L853l882o172j837o998r810k172k267l048
5788c6602n928O601J1463q55N398R050P352n85O65J254j0155j723r114m942J132
5773b6989j955O470M314R907L075O075j461j048j444r86j4543k079N360Q150L06
5758f848k202k088P0L85O71j3477j804p89J804p40L280J0617l560p616p073J361
5742b8009J380M509R971n060J282K664j0088k623K538J5823O231j954m83Q328
$$ y = [-5774, -15332, -10393, 371, 8836, 11328, 15985, 21724, 12610, -2879, -6370, -1993, 3720, 355, 3287, 10990, 14669, 11277, 9920, 3558, -1921, -11577, -10189, -3720, -3546, -15467, -13469, -4937, -842, -699, -721, -729, -9629, -11599, -12221, -10554, -3014, -3252, -6263, -7027, -12588, -10801, -10795, -12599, -11628, -5879, -17945, -26464, -27581, -28548, -31386, -19031, -12120, -4269, -416, -4298, -10470, -12307, -19305, -29115, -31287, -33554, -36602, -42530, -35929, -24466, -25321, -19923, -10873, -3521, -4106, -3441, -2187, -12342, -14065, -23179, -28121, -26989, -28944, -22474, -18160, -8253, -5178, 897, -564, -1612, -3056, -4042, -18585, -20664, -15304, -7154, -6848, -9050, -11138, -11068, -10683, -10012, -23489, -25293, -26082, -24278, -25018, -21738, -11121, -14681, -22297, -29370, -28009, -26629, -22120, -12149, -17209, -15927, -13263, -23351, -25974, -23436, -7613, -1382, -3336, -3819, 4509]
5728D509L653o088j6396m727J6965O283j0099q059Q550J377q951o197r249N144
5714b3285J1886J0391P924j7755m928L159n151L689O421M350j470r015p433m717
5700b5934P196m55O539K598l07N951J1515n65q685P53k016o38o055j118K714J894
5684f613k421k575K771J1780Mn334m304J915M232q749L51n140m15k101N058J0701
5668h40K103N339j5778l832k314J0430K677j0923n673J1833P492J0967L507K1
5654A5009o388m403o157n553o25N227n597K557Q60J571N999J0524N238m410k191
5639A1661p801n227o580q902K462N451J578q588j306J0032J809N850n103N291
5625F27K34p284j0226J0364J0059m187o343j090l632n582n77J4128O761m154N794
$$ y = [4509, 8162, 2074, -14322, -19049, -2084, 4199, -5900, -13959, -5409, -4032, -12983, -19180, -28429, -23285, -11399, -1008, 6916, -10839, -15767, -12608, -17759, -14070, -7649, -3299, -4769, -13784, -21217, -25934, -18738, -19193, -12654, -10056, -10363, -4412, 7103, 6538, -2147, -1394, -3410, -4048, -10103, -11221, -8507, -6613, -9034, -11609, -8838, 2942, 2946, -2388, -6692, -4777, -545, -9294, -8943, -14083, -14498, -16599, -11541, -840, 1263, 6602, -9176, -13008, -15322, -4892, -2215, -13138, -18811, -6978, 514, 11481, 14988, 15009, 8621, 4218, -1939, -7492, -8117, -2890, -8487, -5930, -5070, -3499, 2500, 13024, 18262, 13852, 11661, 3860, -1367, -7947, -16849, -14387, -8936, -7358, -15946, -17252, -7220, -5411, 439, -4664, 627, 861, -6423, -16649, -6285, 3774, -413, -6756, -7846, -11478, -17060, -17637, -3509, 3252, -902, 4892]
5610D892j003p543k665k99o193l950K591j240m563M656L041M65J0882P73o44o565
5594g365j30J859r402o143R69m423m73k841m229J319J5060J5798J296j3158j4029
5579b5892l600J0427R240J999M200N796K636l564j284L968j484n225o708l848
5565a3339p453j2381Q133J072p06k286k023M480Q239L177m227j683J1182m021
5551a1836N54P666k223q77Q25l639l666j112L255O618P865r000o502k219K949
5536a1342R725j1249m544j904M770J0329N001n387j251o877n332J491O028n787
5522a6329m574J068j887J1924j644q578q702L565j175J212J48J3396l305j2927
5508b7808j844J6466J2925O47j3570n188P368N103N963l453n812K513P736L534
$$ y = [4892, 3889, -3654, -6319, -6618, -12811, -16761, -14170, -15410, -19973, -15317, -12276, -11811, -929, -156, -800, -7365, -7495, -5636, -15038, -21181, -20212, -24635, -25108, -27949, -32178, -30859, -15799, -1, 1295, -11863, -25892, -29492, -19065, -9825, -7826, -3626, 2170, 4806, 1242, -42, 3926, 2442, -2783, -9491, -13339, -20792, -33173, -25040, -23968, -24674, -26960, -28983, -24503, -16264, -13087, -17314, -18997, -7815, -11836, -11282, -3616, -5839, -6716, -5891, -9530, -13196, -14308, -11053, -4435, 3430, -5570, -12072, -14291, -11342, -1617, -12866, -17410, -19314, -14544, -4215, 786, -4601, -5852, -12729, -18061, -16570, -10542, -16329, -20903, -19835, -21722, -9798, -11442, -20020, -28722, -25157, -26332, -25120, -24972, -11576, -14881, -27808, -29652, -13186, -261, 386, -13184, -18372, -11004, -5901, 62, -3391, -9203, -6690, 1046, 4580]
5494D580j907J006j489J444L882L197n136o091j1976j1739J281J968O412M223
5480a0345j988N555O01R63K312J126q72q702k781M909J953l264J549J739j59M350
5464c054J026O20P701j1927k105O103K185l158L74j1099j1348l033K842n32k533
5449b7938J3256K000J0257R095P668m07m531M551M72Q07k527j7069J007Q004j251
5434C394m533j843o147l397K83K193L056l414M093R393m700j0725q318o966L214
5419b4417L102p198M174O164M49L550J1308l709l875J168j990P12L316J237N302
5404g07J419l263m09l729k331L06Q386M632n533k358o770m727o352m843N095M826
5388a6358L158J4814J809o78l751q380M788j217L125R606R852L191o082j5344
$$ y = [4580, 2673, 3679, 2190, 3634, 7516, 10713, 5577, -514, -12490, -24229, -22948, -20980, -14568, -10345, -12333, -6778, -6177, -5214, -2902, -1776, -2648, -11350, -14131, -9222, -7269, -10533, -8984, -7245, -7404, -3054, -2028, -1408, 6293, -5634, -7739, -1636, 549, -2609, -2235, -13334, -24682, -27715, -24873, -25405, -27938, -14682, -12682, -2425, 6670, 14338, 13931, 9400, 13951, 14423, 15230, 12703, -4366, -3359, 4645, 3394, -1139, -2982, -9129, -12526, -12243, -10050, -6994, -10408, -6315, 3078, -1622, -12347, -20665, -27631, -24417, -21315, -28513, -24339, -18175, -17726, -14176, -2868, -6577, -10452, -9284, -11274, -10562, -7246, -6009, -707, 712, -2551, -2960, -6689, -9020, -8714, -328, 4304, -1229, -3587, -10357, -15084, -21436, -26279, -21184, -16358, -13200, 1614, 3423, 2745, -1006, -9386, -4598, -5815, -2690, 6916, 16768, 19959, 13877, -1467]
5374a467M341N177L261r635q80K561K382l24n481M471M654j758j955j0499q128
5359a3280m642N78N006J0169M019J341q57k521O835K31o665J910l810p98n922
5344h406o568j1173J2816J3364m332j0008r555n398J7Q319P677M190r891p0N632
5329a3386l428L098N640N033j538M351J4841o945j393M111r37m700J793M819l995
5314G364q914l018P06L410J028L565K512m3p521N11L490l605j3064m598o438N125
5298a9490N849j2270p806L066N619N476j188j0054Q661R075N390o332j286N325
5284i965J2554l336j97M452m322j0273L077n453k719P003Q430J0027n425q566
5270d713J658p513M390j653Q50J324n519K169L886Q225L521j2384O63R014L206
$$ y = [-1467, 2874, 8051, 11312, 1677, 797, 3358, 5740, 5416, -65, 4406, 9060, 7302, 5347, -5152, -13280, -17922, -17344, -12338, -2169, 1850, 3191, 2334, -187, 6648, 6879, 214, 2124, -1686, -2484, -8406, -14974, -26147, -13331, 33, -4299, -14307, -23862, -29260, -29243, -20924, -13247, -9057, -18948, -19018, -13386, -16814, -13716, -8076, -3043, -4581, -230, 14611, 7666, 6273, 10384, 9447, 4747, 6540, 11359, 7364, -1550, -4568, -3862, -452, 576, 4141, 6653, 6610, -911, -400, 3090, -515, -13579, -18177, -24615, -19490, -13641, -25911, -33717, -30651, -25032, -19556, -20744, -30798, -22137, -13062, -7672, -14004, -15290, -9965, 2589, -747, -944, 3508, -814, -11087, -8010, -13463, -16182, -9179, -749, 9278, 3853, -4713, -3055, -10568, -6178, -7831, -6981, -5657, -11176, -9007, -5121, 3104, 6625, -5759, -5096, 3918, 7124]
5255G124k352N481n321P34j309L842N440k090k746j199j0645l921K833O395L006
5240E272J185J436j880q942k283J868l594K474m17j370P737o803M173k835q05
5225d784N057o464j2359o845o192p38P035j026O506P288j5912J707Q811O455M552
5210f909J190R713K726l501o195n366r031K811N080K326Q02K723j0399o560L832
5195a6758R255P606O039j684n458q027N319J4333Q36j0708l415l559L472j812
5181d561l718n435r152L359J276l16j272P362L385J1031K813j928j905j147k786
5166b994M515k362l833P893L267N379L596p698o744k621r685M147K989L822O215
5151E886j0429n623o346O31R383M256p555M508J785m209l232K256n473K366o508
$$ y = [7124, 4772, 10253, 4932, 5666, 4357, 8199, 13639, 11549, 8803, 7604, -3041, -6962, -4129, 2266, 5272, 6457, 7893, 6013, -2929, -5212, -3344, -6938, -4464, -4881, -6251, 1486, -5317, -1144, -3979, -4784, 273, -6191, -18550, -25395, -31587, -32325, -25290, -26316, -19810, -12522, -28434, -26727, -17916, -11461, -6909, -5719, 3994, 6720, 3219, -2976, -8342, -17373, -14562, -9482, -7156, -6354, -3631, -14030, -20590, -16758, -7503, 103, 6142, 4458, -1000, -9027, -3708, 10625, 11461, 753, -2662, -6221, -2749, -4561, -8279, -13714, -22866, -19507, -18231, -18547, -19819, -12457, -9072, 1959, 4772, 2844, 939, -208, -2994, 1521, -841, -4674, 3219, 6486, 11865, 15461, 7763, 1019, -1602, -11287, -7140, -4151, -329, 5886, -4543, -10166, -16512, -15881, -6498, -2242, -9797, -5289, -3504, -7713, -10945, -8689, -14162, -11796, -18304]
5136a8304l264m259R005J4570J4714J5763p045j7967r271J0039L586m712M192
5123G047n334r123j0417K601R161l38j6765K300N897l072J0522L604q057l169
5109a5143M49J306J344J78N311p94J0840j815j0648o99r51j577J0931l716p179
5094a2163r124k624N41J522P903J641N855l403q559J1869Q207J067j539l359q997
5079a1163j8385M741J3668L053L921j5471o064R381P995P369n484r128J1716J4747
5065A0896n30j522o378j0678q812j002O852J4019K763l527k263m197q953m052
5051a7384P170M079o527m435L176R557l563r20R334Q953q436o032k988P346j125
5036a795o385j2276P702N893R09M179K298m26p66l133J5064M107K38k174m345
$$ y = [-18304, -21568, -25827, -16822, -2252, 12462, 28225, 21180, 3213, -6058, 3981, 7567, 2855, 7047, 1713, -7410, -17827, -15226, -6065, -6403, -23168, -20868, -14971, -18043, -7521, -3917, -11974, -15143, -14694, -13388, -12044, -11866, -6555, -7349, 3491, 1676, -8972, -9671, -10622, -12199, -1268, -4984, -12163, -21287, -23911, -23370, -21848, -13945, -12304, -6449, -9852, -18411, -6542, 1665, 2732, 1193, -2166, -11163, -29548, -24807, -11139, -8086, -4165, -19636, -25700, -16319, -8324, -955, -6439, -15567, -3851, 10896, 10366, 8844, 2466, -8212, -17024, -18026, -11174, 2845, 5608, 2081, -182, -4379, -13332, -17384, -10214, -6135, -12662, -17097, -13921, -4364, -7927, -8847, 487, 9440, 1004, -5028, -8016, -670, -1795, -8180, -20456, -12754, -6861, -5952, -1773, 525, 99, -667, -3800, 11264, 15371, 15609, 13435, 9090]
5021I090k136q023j16q11j0387J775O875m54J235O558m124K207m416l369k958
5006i054R07m85O316P189O0J769j155j554m066J1972m744J912N017k654p631p373
4990c574J878j205l10r06k349M539O700j712M950m749O330n19j518j665q739k903
4974e752J0326M954j0349r5k053L862k487O45J060l445l246l526P728O239M007
4959G868K959j2824j0743M828M529j13j1038Q067L711m468j095L58q0N249L261
4944D69K402j344q191R90M929N324j05P553L448j3644l777k722j185M252K011
4929D10n37R728l367k537P960p565p045K112K226N438o783m321L360n285n996
4914a2202p778K571J561K77R709K951m243l8j009p187r035J4778J1512n172o510
$$ y = [9090, 6954, -1069, -1185, -1996, -12383, -10608, -3733, -4187, -2952, 3606, -518, 1689, -2727, -6096, -9054, -8147, -8632, -2316, 4873, 4933, 6702, 5547, 3993, -73, 11899, 7155, 9067, 14084, 11430, 3799, -3574, -1696, -2901, -3211, -4117, -6466, -1927, 4773, 3061, 8011, 3262, 9592, 9073, 7555, 5890, -2849, -5752, 4574, 9528, -821, -916, -2969, 893, -1594, -949, 111, -3334, -6580, -10106, -2378, 3861, 7868, 10827, -1997, -12740, -7912, -3383, -3496, -14534, -6467, -2756, -7224, -8319, -7961, -8041, -2792, 469, 2871, 1527, -6664, -5674, -745, 4579, 4474, 12027, 15475, 1831, -1946, -4668, -5853, -1601, 410, -127, 9601, 6234, 3697, 11657, 4092, -2953, -841, 1385, 6823, 40, -4281, -921, -6206, -12202, -19980, -17409, -15848, -15571, -5862, -2911, -7154, -7192, -8201, -15388, -24423, -9645, 1867, -3305, -9815]
4899i815L625J2538N706n655j555k720L111o798l006n462o169R317J1490l81r03
4884C323M49J781N5Q5P779M07q872L184m679n642p32O608l1p170m646N098P238
4867D235p00p480l839j959m310J4099J4889n030j0711j0309m53k707k258Q071
4853h462J2403K52j2333K128K877J691M974R419N183m636j1287K354J524m321
$$ y = [-9815, -6190, 6348, 12054, 6399, 4844, 2124, 5235, -1563, -4569, -10031, -16200, -6883, 4607, 4226, 3323, 3772, 5553, 5608, 5693, 13472, 13879, 5007, 8191, 3512, -2130, -2862, 3746, 3715, -3455, -8101, -3003, 4235, 3535, -3945, -7784, -9743, -14053, 46, 14935, 9905, -806, -11115, -11568, -14275, -16533, -8462, 3941, 4193, -8140, -6012, -3135, -1444, 3530, 12949, 18132, 13496, 2209, 4563, 6087, 1766]
$$ [...]
##END NTUPLES=NMR SPECTRUM
##END=
