##TITLE=Analysis number 316994
Compound Code cc 40816
Book Reference 438/76
Project Code adrs
Chemist Name antons
##JCAMPDX= 6.0         $$ Bruker NMR JCAMP-DX V2.0
##DATA TYPE= NMR SPECTRUM
##DATA CLASS= NTUPLES
##ORIGIN= Bruker BioSpin GmbH
##OWNER= nmr
$$ XWIN-NMR		Version 3.5
$$ Thu Feb  2 15:26:27 2006 GMT Standard Time (UT+0h)  MAYBRIDGE\nmr@NMR_250MHZ
##.OBSERVE FREQUENCY= 250.131544655141
##.OBSERVE NUCLEUS= ^1H
##.ACQUISITION MODE= SIMULTANEOUS (DQD)
##.ACQUISITION SCHEME= undefined
##.AVERAGES= 16
##.DIGITISER RES= 18
##SPECTROMETER/DATA SYSTEM= dpx250
##.PULSE SEQUENCE= zg30
##.SOLVENT NAME= CDCl3
##.SHIFT REFERENCE= (INTERNAL, CDCl3, 0, 16.522)
##AUDIT TRAIL= $$ (NUMBER, WHEN, WHO, WHERE, WHAT)
$$ ##TITLE= Audit trail, XWIN-NMR		Version 3.5
$$ ##JCAMPDX= 5.01
$$ ##ORIGIN= Bruker BioSpin GmbH
$$ ##OWNER= nmr
$$ C:\u/data/dgb/nmr/ADRS/15560/pdata/1/auditp.txt
$$ ##AUDIT TRAIL=  $$ (NUMBER, WHEN, WHO, WHERE, WHAT)
(   1,<2006-02-02 15:26:02.38 +000>,<MAYBRIDGE\nmr>,<NMR_250MHZ>,
      <created by zg, POWCHK disabled, PULCHK disabled
       configuration hash MD5:
       84 BC 41 DB A1 6E 1D 46 DA 25 12 A5 C1 ED C5 3A
       data hash MD5: 64K
       84 21 43 83 BF F6 82 06 30 EF A6 97 C3 84 69 DE>)
(   2,<2006-02-02 15:26:16.63 +000>,<MAYBRIDGE\nmr>,<NMR_250MHZ>,
      <Start of raw data processing
       ef LB = 0.3 FT_mod = 6 PKNL = 1 SI = 32K 
       data hash MD5: 32K
       7B 13 E8 18 9F CC 86 60 6E 42 65 B0 D2 CB FA E9>)
(   3,<2006-02-02 15:26:18.56 +000>,<MAYBRIDGE\nmr>,<NMR_250MHZ>,
      <apk 
       data hash MD5: 32K
       47 7B 8C B4 E3 9C 19 05 A1 94 97 67 CF 37 18 99>)
(   4,<2006-02-02 15:26:19.30 +000>,<MAYBRIDGE\nmr>,<NMR_250MHZ>,
      <abs ABSG = 5 
       data hash MD5: 32K
       D7 EF 83 38 F7 22 AC 23 2D FD A7 E0 94 98 7D 6D>)
$$ ##END=
$$ 
$$ hash MD5
$$ 24 53 F1 F5 61 4C 39 57 D8 04 D7 2F 8F 5A F0 42
##$RELAX= 
##$RELAX= 
##$RELAX= 
##$RELAX= 
##$RELAX= 
##$RELAX= 
##$RELAX= 
$$ Bruker specific parameters
$$ --------------------------
##$DU= <C:\u>
##$EXPNO= 15560
##$NAME= <ADRS>
##$PROCNO= 1
##$TYPE= <nmr>
##$USER= <dgb>
##$AMP= (0..31)
100 100 100 100 100 100 100 100 100 100 100 100 100 100 100 100 100 100 
100 100 100 100 100 100 100 100 100 100 100 100 100 100 
##$AQSEQ= 0
##$AQ_mod= 3
##$AUNM= <au_zg>
##$AUTOPOS= <33 >
##$BF1= 250.13
##$BF2= 250.13
##$BF3= 250.13
##$BF4= 250.13
##$BF5= 500.13
##$BF6= 500.13
##$BF7= 500.13
##$BF8= 500.13
##$BYTORDA= 1
##$CFDGTYP= 0
##$CFRGTYP= 5
##$CHEMSTR= <none>
##$CNST= (0..31)
1 1 145 1 1 1 1 1 1 1 1 1 1 1 1 1 1 1 1 1 1 1 1 1 1 1 1 1 1 1 1 1 
##$CPDPRG= <>
##$CPDPRG1= <>
##$CPDPRG2= <>
##$CPDPRG3= <>
##$CPDPRG4= <mlev>
##$CPDPRG5= <mlev>
##$CPDPRG6= <mlev>
##$CPDPRG7= <mlev>
##$CPDPRG8= <mlev>
##$CPDPRGB= <>
##$CPDPRGT= <>
##$D= (0..31)
0 1 0 0 0 0 0 0 0 0.06 0 0 0 0 0 0 0.0002 0 0 0 0 0 0 0 0 0 0 0 0 0 0 
0 
##$DATE= 1138893960
##$DBL= (0..7)
120 120 120 120 120 120 120 120 
##$DBP= (0..7)
150 150 150 150 150 150 150 150 
##$DBP07= 0
##$DBPNAM0= <>
##$DBPNAM1= <>
$$ [...]
##$SUBNAM7= <"">
##$SUBNAM8= <"">
##$SUBNAM9= <"">
##$SW= 20.6930455092707
##$SWIBOX= (0..15)
0 0 3 0 0 0 0 0 0 0 0 0 0 0 0 0 
##$SW_h= 5175.983436853
##$TD= 65536
##$TD0= 1
##$TE= 293.16
##$TE2= 300
##$TE3= 300
##$TEG= 300
##$TL= (0..7)
0 120 120 120 120 120 120 120 
##$TP= (0..7)
150 150 150 150 150 150 150 150 
##$TP07= 0
##$TPNAME0= <>
##$TPNAME1= <>
##$TPNAME2= <>
##$TPNAME3= <>
##$TPNAME4= <>
##$TPNAME5= <>
##$TPNAME6= <>
##$TPNAME7= <>
##$TPOAL= (0..7)
0.5 0.5 0.5 0.5 0.5 0.5 0.5 0.5 
##$TPOFFS= (0..7)
0 0 0 0 0 0 0 0 
##$TUNHIN= 0
##$TUNHOUT= 0
##$TUNXOUT= 0
##$USERA1= <user>
##$USERA2= <user>
##$USERA3= <user>
##$USERA4= <user>
##$USERA5= <user>
##$V9= 5
##$VALIST= <valist>
##$VCLIST= <CCCCCCCCCCCCCCC>
##$VD= 0
##$VDLIST= <DDDDDDDDDDDDDDD>
##$VPLIST= <PPPPPPPPPPPPPPP>
##$VTLIST= <TTTTTTTTTTTTTTT>
##$WBST= 1024
##$WBSW= 4
##$XGAIN= (0..3)
0 0 0 0 
##$XL= 0
##$YL= 0
##$YMAX_a= 402858
##$YMIN_a= -291519
##$ZGOPTNS= <>
##$ZL1= 120
##$ZL2= 120
##$ZL3= 120
##$ZL4= 120
##$ABSF1= 16.522
##$ABSF2= -4.171173
##$ABSG= 5
##$ABSL= 3
##$ALPHA= 0
##$AQORDER= 0
##$ASSFAC= 0
##$ASSFACI= 0
##$ASSFACX= 0
##$ASSWID= 0
##$AUNMP= <proc_1d>
##$AZFE= 0.1
##$AZFW= 0.1
##$BCFW= 0
##$BC_mod= 0
##$BYTORDP= 0
##$COROFFS= 0
##$CY= 12.5
##$DATMOD= 1
##$DC= 0
##$DFILT= <>
##$DTYPP= 0
##$F1P= 14.0000005364418
##$F2P= -0.99999901652339
##$FCOR= 0.5
##$FTSIZE= 32768
##$FT_mod= 6
##$GAMMA= 0
##$GB= 0
##$INTBC= 1
##$INTSCL= 1
##$ISEN= 128
##$LB= 0.3
##$LEV0= 0
##$LPBIN= 0
##$MAXI= 10000
##$MC2= 0
##$MEAN= 0
##$ME_mod= 0
##$MI= 0
##$NCOEF= 0
##$NC_proc= -4
##$NLEV= 6
##$NOISF1= 0
##$NOISF2= 0
##$NSP= 0
##$NTH_PI= 0
##$NZP= 0
##$OFFSET= 16.522
##$PC= 1
##$PHC0= -54.66603
##$PHC1= 6.628435
##$PH_mod= 1
##$PKNL= yes
##$PPARMOD= 0
##$PSCAL= 4
##$PSIGN= 0
##$REVERSE= no
##$SF= 250.13
##$SI= 32768
##$SIGF1= 0
##$SIGF2= 0
##$SINO= 400
##$SIOLD= 32768
##$SREGLST= <1H.CDCl3>
##$SSB= 0
##$STSI= 32768
##$STSR= 0
##$SW_p= 5175.98343685301
##$SYMM= 0
##$S_DEV= 0
##$TDeff= 65536
##$TDoff= 0
##$TI= <Analysis number 999999
Compound Code 99
Book Reference 9
Project Code 9>
##$TILT= no
##$TM1= 0
##$TM2= 0
##$TOPLEV= 0
##$USERP1= <user>
##$USERP2= <user>
##$USERP3= <user>
##$USERP4= <user>
##$USERP5= <user>
##$WDW= 1
##$XDIM= 32768
##$YMAX_p= 476404930
##$YMIN_p= -69402
$$ End of Bruker specific parameters
$$ ---------------------------------
##NTUPLES= NMR SPECTRUM
##VAR_NAME=  FREQUENCY,     SPECTRUM/REAL,   SPECTRUM/IMAG
##SYMBOL=    X,             R,               I
##VAR_TYPE=  INDEPENDENT,   DEPENDENT,       DEPENDENT
##VAR_FORM=  AFFN,          ASDF,            ASDF
##VAR_DIM=   32768,         32768,           32768
##UNITS=     HZ,            ARBITRARY UNITS, ARBITRARY UNITS
##FACTOR=    0.157963299565203, 1,           1
##FIRST=     4132.6476996994, 0,             0
##LAST=      -1043.33573715361, 0,           0
##MIN=       -1043.33573715361, -69402,      0
##MAX=       4132.6476996994, 476404930,     0
$$ Real data points
##PAGE= N=1
##DATA TABLE= (X++(R..R)), XYDATA
$$ [...]
##PAGE= N=2
##DATA TABLE= (X++(I..I)), XYDATA
20023 4593089 4603408 4605075 4596584 4600491 4603196 4606658 4626308 4633468 4623007 4620614 4629112 4628997 4626748
20010 4626748 4625946 4636692 4645248 4642565 4641007 4646584 4650190 4658381 4657359 4658393 4667914 4681933 4691376 4687709
19996 4687709 4689527 4691964 4687601 4684166 4693668 4697113 4691323 4672034 4677715 4697148 4709139 4713701 4704208
19983 4704208 4701188 4715219 4716453 4715526 4717836 4725568 4729404 4733940 4735155 4736350 4735317 4741737 4745396 4745809
19969 4745809 4748924 4753144 4760410 4763377 4770855 4776639 4785836 4784000 4781764 4774616 4769742 4768183 4769774 4778402
19955 4778402 4792401 4800394 4794638 4799963 4817968 4816412 4812372 4812233 4810794 4821495 4842074 4843861 4840986
19942 4840986 4839747 4848236 4857211 4847909 4841435 4837643 4844583 4849015 4851125 4857634 4861709 4866292 4877793 4880348
19928 4880348 4881069 4887744 4885764 4896642 4895310 4899297 4909884 4923433 4929053 4926371 4925071 4923932 4922303
19915 4922303 4916032 4908895 4927948 4945019 4942191 4949135 4955233 4943323 4946037 4963492 4960136 4955526 4960107
19902 4960107 4975776 4982005 4976724 4979668 4980959 4990391 5004575 5007623 5013289 5014590 5014248 5013326 5000384 4993626
19888 4993626 5003397 5003641 5012028 5012432 5017045 5024955 5030215 5035423 5048298 5046811 5047691 5056838 5059032 5054781
19874 5054781 5057003 5065700 5067471 5057998 5057348 5066641 5084919 5094977 5096978 5101929 5096567 5095397 5100898 5103775
19860 5103775 5102922 5104465 5114033 5128974 5140608 5149038 5154406 5149933 5153360 5140966 5141742 5139971 5150722
19847 5150722 5162516 5168994 5173226 5172067 5177367 5180499 5185980 5192960 5199429 5204464 5199733 5204866 5207641 5213811
19833 5213811 5223955 5230138 5231969 5231710 5229060 5226540 5224545 5231118 5230945 5239355 5248878 5253221 5263333 5267639
19819 5267639 5276381 5284520 5280475 5283838 5287453 5284293 5289412 5291990 5290921 5298641 5311326 5318106 5324495 5333028
19805 5333028 5337535 5341998 5350530 5355794 5354455 5349916 5359764 5369470 5372815 5375701 5378112 5367719 5369659 5373940
19791 5373940 5382920 5392760 5392337 5388702 5384562 5392381 5401033 5413225 5426051 5425378 5420428 5421293 5426363 5432092
19777 5432092 5446935 5462672 5471158 5481905 5476417 5478264 5475330 5470547 5479195 5480539 5488582 5494943 5500258
19764 5500258 5505242 5501907 5503495 5500937 5499793 5505968 5513428 5512759 5521022 5525076 5535708 5540111 5541789 5547709
19750 5547709 5556314 5568904 5563980 5568218 5568431 5574501 5579849 5585380 5589926 5595495 5607904 5613295 5611354 5617084
19736 5617084 5608189 5606489 5623496 5635175 5632889 5630406 5634653 5642465 5655190 5676500 5671167 5665158 5672845
19723 5672845 5677394 5679618 5675541 5681111 5680440 5684617 5698499 5710641 5716976 5726893 5729714 5729921 5737420 5750926
19709 5750926 5765710 5775772 5780354 5783592 5791272 5791981 5796593 5803100 5806851 5810425 5818977 5806911 5794347
19696 5794347 5781389 5773061 5785641 5804515 5811672 5819333 5824548 5825141 5829776 5831823 5845506 5860994 5854337
19683 5854337 5855964 5859472 5864570 5879993 5887650 5899033 5901529 5899787 5902911 5911663 5917039 5934303 5933481
19670 5933481 5928488 5928842 5947484 5956811 5962263 5970986 5976948 5983025 5995453 6000103 5999571 6003460 6007628 6009041
19656 6009041 6003858 6011608 6014841 6024639 6025436 6027974 6034399 6045914 6046698 6058755 6069194 6079338 6074492
19643 6074492 6076712 6087449 6088007 6094030 6114686 6139215 6147417 6147594 6150524 6154923 6155207 6166869 6189187
19630 6189187 6196919 6198439 6195863 6195969 6199665 6209306 6215771 6223743 6241854 6249008 6258686 6270863 6277738 6283535
19616 6283535 6283412 6288866 6297136 6303970 6311872 6315590 6317998 6331454 6345226 6357158 6374545 6390379 6398847
19603 6398847 6400182 6408826 6410375 6425386 6443366 6463794 6483494 6510885 6530117 6546759 6569128 6592731
19591 6592731 6620621 6656551 6691071 6713387 6704943 6688571 6657587 6610011 6564577 6524923 6495021
19580 6495021 6467862 6446102 6426834 6403833 6358394 6306749 6255050 6209670 6176247 6160739 6164711
19569 6164711 6185572 6221865 6264964 6292781 6305894 6339482 6362269 6381613 6408691 6427933 6433518
19558 6433518 6445913 6467430 6481362 6489995 6511592 6533321 6544877 6562476 6583266 6605034 6626756
19547 6626756 6651430 6680302 6695240 6712907 6744719 6790475 6832155 6869528 6902023 6917709 6915110
19536 6915110 6882369 6830102 6782633 6742508 6701904 6674034 6645250 6611210 6590038 6568494 6538576
19525 6538576 6490305 6430149 6381111 6349608 6337511 6344797 6372855 6412369 6451655 6481313 6504447
19514 6504447 6523493 6538708 6556127 6572814 6592258 6611391 6628823 6645118 6667591 6693385 6703972
19503 6703972 6716768 6731795 6737883 6743330 6759779 6770275 6772076 6775824 6784592 6793266 6812241 6824227
19491 6824227 6834472 6842344 6858043 6872350 6887471 6894926 6900898 6908757 6915034 6930425 6934283 6934708 6939047
19478 6939047 6948057 6970461 6978632 6992635 7011063 7020788 7033124 7037023 7037195 7050460 7059408 7060447 7068315
19465 7068315 7072736 7078071 7096810 7116637 7123699 7128180 7134008 7146339 7150517 7139609 7142321 7154493 7166902
19452 7166902 7177164 7186359 7195418 7209846 7224621 7236809 7238564 7249198 7259179 7266825 7263075 7265167 7278445
19439 7278445 7301506 7312786 7320756 7339442 7348213 7349809 7360811 7370236 7381044 7391877 7399787 7404984
19427 7404984 7405373 7412995 7434149 7451859 7461842 7480967 7483808 7494692 7509302 7516954 7524614 7530475 7540220
19414 7540220 7556474 7563312 7559963 7561492 7575951 7589623 7587490 7591144 7600476 7603996 7615044 7627140 7639354
19401 7639354 7662802 7691200 7703877 7699264 7707883 7724599 7752105 7767704 7775400 7791601 7795655 7825965
19389 7825965 7855893 7877105 7892293 7898124 7914945 7934410 7944677 7965086 7974612 7993154 8021705 8059046
19377 8059046 8094594 8119626 8155014 8185979 8224019 8277175 8340701 8406486 8466269 8495978 8487058
19366 8487058 8438445 8374812 8310363 8286803 8320872 8356066 8368768 8315226 8162327 7953078 7752489
19355 7752489 7605138 7548028 7558775 7587940 7598201 7563425 7496698 7428671 7389697 7392294 7410315
19344 7410315 7447010 7509609 7565669 7616585 7667065 7706405 7743452 7776218 7810826 7836559 7863015
19333 7863015 7884087 7902940 7929636 7953358 7971615 7989687 8006381 8015914 8026152 8039600 8061923
19322 8061923 8087419 8112075 8125150 8131551 8135058 8146609 8166774 8188665 8215345 8234458 8241067 8261138
19310 8261138 8280529 8292236 8302653 8316111 8331516 8341276 8348034 8366969 8383245 8400843 8401844 8412896
19298 8412896 8429657 8443885 8456617 8470095 8483529 8498117 8504736 8514491 8535940 8548702 8565541 8580082
19286 8580082 8588891 8605498 8620702 8634448 8643279 8654239 8675721 8688958 8705614 8722353 8730147 8741765
19274 8741765 8761859 8776458 8786321 8799151 8816833 8828626 8845370 8867523 8881601 8891584 8898342 8906306
19262 8906306 8916441 8939616 8959288 8968089 8985025 8989471 9004175 9021104 9033706 9032790 9047207 9066902
19250 9066902 9088333 9099713 9108427 9126556 9147801 9155976 9159366 9179478 9195590 9209208 9218630 9232450
19238 9232450 9250421 9269794 9290167 9299851 9303318 9309255 9330685 9350214 9359694 9366913 9389331 9405343
19226 9405343 9415592 9425842 9444837 9469064 9479674 9485917 9504212 9527033 9546763 9554080 9569089 9591938
19214 9591938 9618255 9629287 9640868 9666467 9683557 9697611 9718543 9735675 9733513 9749892 9769720
19203 9769720 9784621 9801281 9814702 9834020 9855736 9882349 9906167 9932601 9953125 9966148 9983045
19192 9983045 10001978 10022531 10038354 10061952 10088565 10111352 10136040 10169464 10189121 10209385 10225440
19181 10225440 10250317 10280988 10301025 10319471 10343213 10368791 10384993 10406193 10428683 10451703 10482153
19170 10482153 10521176 10559093 10604686 10655809 10701999 10728590 10726718 10716058 10688092 10670298 10663399
19159 10663399 10642094 10620888 10605653 10580071 10559056 10537051 10511522 10506015 10518228 10524788 10526712 10512780
19147 10512780 10485546 10461340 10459353 10484599 10521327 10567333 10621858 10668949 10707384 10742526 10775979
19136 10775979 10820949 10856340 10883379 10915384 10945861 10978269 11014138 11052985 11082709 11113223 11162711
19125 11162711 11210174 11251825 11298933 11345903 11392676 11454936 11514831 11566755 11620360 11656151 11656267
19114 11656267 11636411 11608481 11568235 11524885 11491089 11476137 11489989 11516476 11548908 11556223 11538699
19103 11538699 11509844 11448934 11361271 11288839 11236362 11234219 11279035 11345906 11426020 11493301 11541435
19092 11541435 11569742 11578383 11581262 11601742 11648563 11684304 11729971 11798091 11875967 11947694 12009733
19081 12009733 12066883 12094974 12071069 12050743 12040392 12038016 12020153 12001233 12000826 12017767 12075845 12158399
19069 12158399 12240659 12286830 12262238 12155724 12051789 11982989 11955232 11984674 12053080 12128515 12205346
19058 12205346 12283573 12359730 12423018 12472485 12507372 12524334 12533748 12536549 12525759 12535458 12566327 12619604
19046 12619604 12678641 12731925 12792630 12843326 12874068 12886997 12908478 12919392 12934102 12972593 13022187
19035 13022187 13077549 13100897 13088698 13081300 13075103 13101440 13183134 13278888 13364190 13425067 13457239
19024 13457239 13449393 13434614 13413075 13373090 13333728 13312496 13303477 13287021 13260671 13235340 13217971
19013 13217971 13217654 13250285 13321588 13395194 13448476 13509841 13560623 13610171 13658456 13708807 13769897
19002 13769897 13818186 13853161 13893746 13946568 13994549 14037921 14085178 14130970 14180296 14225748 14283648
18991 14283648 14335857 14376401 14419717 14460335 14489047 14523860 14570623 14616086 14653187 14705827 14760461
18980 14760461 14795252 14803789 14802285 14805608 14814340 14853777 14912435 14981662 15041208 15086817 15112555 15136690
18968 15136690 15169861 15202814 15260857 15324750 15371665 15421585 15478437 15528420 15571274 15602329 15642091
18957 15642091 15694448 15740780 15792883 15850946 15912999 15965711 16004421 16053454 16119653 16190901 16254609
18946 16254609 16299257 16343331 16394114 16434749 16478189 16520499 16566790 16626102 16686626 16744198 16799159
18935 16799159 16854387 16891288 16929782 16980986 17027433 17078368 17132068 17173917 17217672 17269474 17324288
18924 17324288 17382857 17445152 17504294 17564264 17624337 17703335 17782976 17848680 17917582 17993195 18081915
18913 18081915 18151081 18205291 18268305 18333982 18401630 18474011 18547900 18622248 18691931 18778129 18868085
18902 18868085 18933857 18999458 19073974 19139708 19207588 19291602 19362841 19425553 19505385 19580881 19653025
18891 19653025 19743390 19839958 19930756 20012633 20084142 20148062 20226125 20306891 20398914 20485478 20564302
18880 20564302 20635654 20685681 20723671 20759840 20843094 20950292 21060725 21181696 21300529 21398111
18870 21398111 21481047 21561514 21643806 21749351 21863919 21987857 22131943 22265567 22386069 22483748
18860 22483748 22567263 22643467 22727158 22822702 22950945 23088470 23209964 23275151 23284156 23270535 23289263
18849 23289263 23375705 23494611 23635376 23771499 23887914 23985669 24069904 24153513 24268745 24419724
18839 24419724 24589507 24765836 24955575 25141129 25330006 25520520 25695636 25859486 26023307
18830 26023307 26169714 26337626 26511926 26672121 26840521 27026620 27212542 27400679 27597067
18821 27597067 27796173 28006087 28200602 28394481 28585426 28789915 29011059 29246783 29481168
18812 29481168 29716057 29926236 30136332 30338229 30532679 30714632 30916528 31147262 31408225
18803 31408225 31659647 31883324 32072603 32246333 32433203 32655683 32922169 33228172 33533388
18794 33533388 33819100 34101481 34378367 34669004 35003614 35370959 35771521 36209830 36649631
18785 36649631 37079222 37502429 37935333 38394058 38859495 39342303 39841540 40359959 40923944
18776 40923944 41520791 42128300 42733688 43387848 44079491 44795955 45517866 46219321 46878469
18767 46878469 47534228 48246689 49052727 49977291 50942214 51908337 52860766 53771515 54676669
18758 54676669 55616767 56622916 57734975 58988948 60372634 61896156 63520911 65211772
18750 65211772 66949363 68756915 70723870 72960054 75575655 78634366 82111157 85996559
18742 85996559 90355034 95331106 101173928 108176352 116566832 126209027 135859030 142582758
18734 142582758 143044242 135867679 122704129 108123897 98016637 96770596 103361853 110009623
18726 110009623 107017193 88019820 54162265 13323020 -23025873 -45488026 -51425451
18719 -51425451 -47350927 -41362303 -41571191 -50496829 -65023006 -79376320 -88478304 -90060749
18711 -90060749 -85607782 -77337136 -68082324 -59732609 -52746258 -46979857 -42077279 -37773637
18703 -37773637 -33878980 -30299514 -27032868 -24100141 -21463047 -19058163 -16802104 -14635956
18695 -14635956 -12537038 -10498860 -8567745 -6757697 -5047167 -3386761 -1737006 -135211
18687 -135211 1372277 2777094 4118449 5438842 6775954 8145652 9533209 10921864
18679 10921864 12263207 13576922 14920417 16329105 17796836 19352659 21041610 22832819
18671 22832819 24670043 26539567 28509739 30630596 33003987 35707493 38732986 42147945
18663 42147945 46063131 50631843 55992274 61918472 66865595 68186308 64609614 58050414
18655 58050414 51186216 45061933 38539784 31168223 24098124 18674222 15558695 12572673
18647 12572673 7837489 1439189 -4337879 -6112948 -3552633 351196 542405 -5260326
18639 -5260326 -14786612 -24269593 -29531018 -29906597 -26162660 -20684906 -15487672 -11070565
18631 -11070565 -7279780 -3841946 -603267 2477107 5406658 8222340 10979884 13737103
18623 13737103 16588702 19592625 22732770 26032504 29500402 33227494 37314203 41928027
18615 41928027 47318280 53771230 61461734 70001905 77256280 79619191 74132144 60091370
18607 60091370 39118726 16967595 206551 -7314003 -5495393 2814017 11418551 14207667
18599 14207667 10057702 2285633 -6145866 -14844991 -25618103 -38118052 -50507194 -59609972
18591 -59609972 -62672215 -59695870 -53007770 -45889178 -39644064 -34320979 -29695214 -25595756
18583 -25595756 -21864608 -18421553 -15200878 -12132874 -9159882 -6215862 -3274393 -324566
18575 -324566 2663353 5717155 8918487 12370526 16190197 20507344 25464179 31188988
18567 31188988 37564933 43094087 44137291 38989268 31269860 25192774 20092899 15489226
18559 15489226 10288165 6035197 4400748 5379050 7248018 3847447 -6894307 -23220406
18551 -23220406 -41958365 -55296155 -61203569 -61274307 -56057653 -49193663 -42887703 -37518822
18543 -37518822 -33043842 -29370504 -26243352 -23373501 -20653174 -17983841 -15341459 -12815474
18535 -12815474 -10465402 -8234850 -6023507 -3752252 -1418912 940079 3292142 5706633
18527 5706633 8285579 11105984 14213345 17606916 21357064 25655525 30674935 36631987
18519 36631987 43744420 51733250 58233577 57790197 47845941 33945371 23334785 18464098
18511 18464098 23407738 33724367 38769173 34148074 23585254 8634102 -12728963
18504 -12728963 -31856308 -43556560 -52558783 -61201102 -71430655 -82840584 -92065570
18497 -92065570 -97319220 -94838761 -87590743 -79956448 -73355972 -67860151 -63268012 -59386134
18489 -59386134 -56028374 -53071537 -50428016 -48024070 -45859035 -43899465 -42135473 -40554499
18481 -40554499 -39091773 -37710391 -36391228 -35144065 -33978499 -32893351 -31871658 -30888141
18473 -30888141 -29921382 -28966499 -28032397 -27115396 -26246803 -25414749 -24629259 -23916886 -23242639
18464 -23242639 -22588843 -21952411 -21321467 -20676535 -20030954 -19400707 -18780439 -18163770 -17541738
18455 -17541738 -16895143 -16255076 -15680972 -15310791 -15247437 -15469852 -15819375 -16092577 -16095095 -15816656
18445 -15816656 -15342379 -14791233 -14264650 -13771534 -13313976 -12861843 -12392312 -11898064 -11444913
18436 -11444913 -11020797 -10618696 -10218425 -9836789 -9478266 -9117691 -8763689 -8427932 -8120390
18427 -8120390 -7824721 -7525299 -7195379 -6859581 -6517351 -6165823 -5807629 -5492139 -5210124
18418 -5210124 -4938324 -4675442 -4382284 -4068898 -3753930 -3428404 -3149547 -2954359 -2840867
18409 -2840867 -2795302 -2753075 -2645584 -2439098 -2152140 -1805076 -1439288 -1077390 -723874 -363401
18399 -363401 -12651 311028 636780 968587 1296082 1624556 1975158 2343805 2716215 3107361
18389 3107361 3486436 3848701 4208477 4589787 5001986 5447055 5906050 6350273 6743627
18380 6743627 7100188 7443193 7792388 8189738 8654261 9176889 9728826 10261510 10732649
18371 10732649 11125829 11493020 11926168 12444271 13025348 13656210 14328617 15032891 15772880
18362 15772880 16571447 17409401 18354637 19470042 20760431 22192548 23803254 25661870
18354 25661870 27828490 30407030 33459325 36817084 39573447 39994879 37089195 31275263
18346 31275263 23538105 16186036 12291085 11875979 14712766 19619905 23699067 24223473
18338 24223473 20297567 12652985 2497298 -6940736 -12381126 -14325747 -12921628 -9479734
18330 -9479734 -5816397 -2561857 229213 2645218 4800080 6803481 8718225 10590097
18322 10590097 12445256 14303493 16150330 17998640 19865825 21802536 23889710 26117289
18314 26117289 28565577 31320678 34392383 37794567 41628477 46015712 51143848 57249754
18306 57249754 64409764 71830062 76608071 74827954 65100324 48727685 28131033 9739083
18298 9739083 -912223 -4218334 -170106 8000071 14184082 14302861 7700062 -4323655
18290 -4323655 -19190952 -31074451 -37741915 -40845184 -40738301 -39729378 -39128988 -37658137
18282 -37658137 -35115555 -31577639 -27254666 -22966443 -19095697 -15655692 -12533757 -9597316
18274 -9597316 -6741931 -3943428 -1204527 1457256 3974808 6331071 8650730 11068716
18266 11068716 13682825 16565013 19753876 23247705 27079003 31286342 35998974 41410180
18258 41410180 47729152 55028090 62773216 68716957 69252107 62539057 49767015 34068620
18250 34068620 21392801 17014309 20661303 31712247 45756163 54477998 49948518 32306327
18242 32306327 9107842 -14645517 -33826461 -43818818 -46476201 -42481914 -34868595 -29172873
18234 -29172873 -34125691 -51649410 -72973440 -90753575 -100690799 -99045659 -90997554 -82276733
18226 -82276733 -74531741 -67854205 -62064615 -57009232 -52563346 -48594516 -45001838 -41668434
18218 -41668434 -38546052 -35617897 -32823010 -30094217 -27431881 -24821420 -22180873 -19512396
18210 -19512396 -16790266 -13989570 -11048280 -7843592 -4253798 -141514 4618255 10173268
18202 10173268 16722542 24308961 32193456 37699692 37259362 28164480 9874082 -13444281
18194 -13444281 -32046830 -42006579 -42209297 -33085373 -22417682 -20132289 -32482889 -54891292
18186 -54891292 -76810589 -93674217 -100320068 -96201680 -88488931 -81143792 -74889691 -69670027
18178 -69670027 -65275299 -61525026 -58267809 -55376998 -52809310 -50506348 -48439180 -46557584
18170 -46557584 -44832337 -43214931 -41679649 -40178820 -38688547 -37211274 -35752601 -34340630
18162 -34340630 -32958790 -31581073 -30121968 -28504302 -26699269 -24630303 -22227247 -19474863
18154 -19474863 -16332276 -12954727 -10473241 -11535952 -17589816 -26071775 -33353175 -38150042
18146 -38150042 -38369889 -34957084 -31651874 -31813669 -36483431 -43142230 -48903367 -52713576
18138 -52713576 -52913747 -50606123 -47922359 -45576731 -43607590 -41936249 -40503738 -39259122
18130 -39259122 -38155954 -37140866 -36163203 -35221142 -34318095 -33510728 -32825329 -32235494 -31676514
18121 -31676514 -31080001 -30420921 -29686972 -28874723 -28035152 -27195557 -26303234 -25299021 -24082941
18112 -24082941 -22580727 -20995567 -20540261 -22845161 -27385721 -31746573 -35183835 -36819670
18104 -36819670 -36039282 -34556831 -33232215 -32145993 -31254134 -30497178 -29832416 -29232225 -28669331
18095 -28669331 -28140330 -27660392 -27227621 -26838279 -26504075 -26237181 -26022838 -25844257 -25661388
18086 -25661388 -25449116 -25227216 -25030327 -24903060 -24841209 -24809264 -24768143 -24655867 -24465975 -24249789
18076 -24249789 -24058982 -23914340 -23815247 -23734745 -23660465 -23572595 -23465593 -23327065 -23164823 -22968671
18066 -22968671 -22758139 -22551390 -22364658 -22189312 -22011572 -21846968 -21702421 -21562809 -21405325
18057 -21405325 -21255860 -21104607 -20952524 -20815402 -20675343 -20530385 -20399983 -20274495 -20140595
18048 -20140595 -20004022 -19878796 -19753231 -19637431 -19512555 -19379718 -19246723 -19099308 -18943267
18039 -18943267 -18775244 -18610494 -18482969 -18424892 -18416084 -18411421 -18384549 -18331484 -18266951 -18209537 -18152849
18028 -18152849 -18102630 -18074768 -18050423 -18027752 -18041375 -18076818 -18101835 -18089538 -18036673 -17946981 -17827426
18017 -17827426 -17708061 -17588458 -17473485 -17373714 -17278851 -17189799 -17109711 -17036637 -16956217 -16878626
18007 -16878626 -16789692 -16706152 -16622659 -16531875 -16452053 -16389092 -16319261 -16241143 -16158804 -16084340 -16007950
17996 -16007950 -15918151 -15816742 -15714531 -15606346 -15518017 -15425099 -15345816 -15271524 -15191069 -15111262
17986 -15111262 -15058558 -15039143 -15039695 -15018487 -14970316 -14904829 -14856091 -14832550 -14832493 -14855668 -14896658 -14915155
17974 -14915155 -14898062 -14881440 -14866692 -14856272 -14831962 -14791086 -14741253 -14657748 -14568018 -14479258 -14405069
17963 -14405069 -14338349 -14273673 -14214719 -14158274 -14112443 -14065596 -14029438 -14006738 -13997940 -14000411 -13977927
17952 -13977927 -13937801 -13897595 -13856164 -13818399 -13793075 -13767401 -13728012 -13676588 -13607015 -13528444 -13453884
17941 -13453884 -13405430 -13358869 -13314726 -13286676 -13255805 -13197688 -13139032 -13087447 -13041342 -13010885 -12984349
17930 -12984349 -12948934 -12909788 -12864761 -12826488 -12802957 -12774802 -12746040 -12710426 -12661320 -12612850 -12560982
17919 -12560982 -12521670 -12506186 -12491246 -12458407 -12422109 -12369814 -12314435 -12278467 -12251229 -12215528 -12169533
17908 -12169533 -12130103 -12088350 -12043089 -12015117 -11994717 -11978199 -11968431 -11948212 -11923017 -11898030 -11863693
17897 -11863693 -11809832 -11763310 -11722038 -11687060 -11637171 -11581116 -11533697 -11483696 -11439981 -11380741 -11310631
17886 -11310631 -11251839 -11184034 -11108175 -11013575 -10913550 -10847524 -10844694 -10941997 -11137524 -11360000 -11535850
17875 -11535850 -11636521 -11638824 -11578061 -11504706 -11438486 -11378382 -11319995 -11253728 -11184400 -11131312 -11097765
17864 -11097765 -11060404 -11026763 -11000480 -10961558 -10921860 -10879345 -10835991 -10790169 -10747699 -10706954 -10673772
17853 -10673772 -10648192 -10628921 -10598773 -10557623 -10514337 -10483586 -10447103 -10407889 -10373415 -10347179 -10305059
17842 -10305059 -10257743 -10221587 -10174425 -10120751 -10069488 -10020703 -9978643 -9915964 -9840626 -9785902 -9743404
17831 -9743404 -9707361 -9695324 -9693176 -9707145 -9720665 -9706758 -9675895 -9652122 -9638424 -9640379 -9683788 -9778714
17819 -9778714 -9869903 -9926105 -9952682 -9931453 -9913014 -9947492 -9998407 -10021826 -10012333 -9971081 -9905658
17808 -9905658 -9830306 -9780319 -9719567 -9653560 -9578759 -9502135 -9445359 -9393142 -9342560 -9295012 -9248816
17797 -9248816 -9210216 -9158080 -9111022 -9064321 -9012089 -8947897 -8886624 -8821427 -8749463 -8671532 -8611031
17786 -8611031 -8558237 -8516665 -8504886 -8508925 -8520233 -8520166 -8494927 -8460935 -8434007 -8435792 -8461146 -8520435
17774 -8520435 -8591531 -8663987 -8703705 -8734088 -8761909 -8807555 -8875429 -8972895 -9033577 -9088620 -9146387
17763 -9146387 -9167091 -9176260 -9177586 -9125971 -9054872 -8992427 -8939971 -8897088 -8848246 -8801800 -8752489 -8705521
17751 -8705521 -8657063 -8606912 -8560736 -8505262 -8444907 -8375686 -8287042 -8188742 -8103714 -8017160 -7928386
17740 -7928386 -7847152 -7800558 -7803496 -7828952 -7842613 -7824725 -7788562 -7755182 -7773182 -7845732 -7947033
17729 -7947033 -8060889 -8163105 -8241236 -8335084 -8458100 -8614724 -8779781 -8922404 -9021117 -9048678
17719 -9048678 -9026898 -9022604 -9038628 -9055013 -9062713 -9044181 -8973566 -8876614 -8789142 -8734585 -8691279 -8672980
17707 -8672980 -8677525 -8663303 -8620061 -8563292 -8490805 -8404823 -8312049 -8218029 -8116315 -8016275 -7928860
17696 -7928860 -7822045 -7700184 -7608086 -7579248 -7622139 -7675386 -7736430 -7812980 -7906920 -8055017 -8250288
17685 -8250288 -8426873 -8538427 -8626798 -8704821 -8762641 -8795141 -8790868 -8727560 -8637779 -8546084 -8458758
17674 -8458758 -8376171 -8295518 -8207711 -8130717 -8050179 -7965125 -7891243 -7828301 -7774323 -7732758 -7722803
17663 -7722803 -7725656 -7740530 -7764572 -7760162 -7744038 -7725650 -7725770 -7754273 -7804305 -7891601 -7970731 -8008855
17651 -8008855 -8012036 -7981862 -7925078 -7876284 -7845521 -7835457 -7830589 -7815042 -7809152 -7819242 -7848653 -7883709
17639 -7883709 -7899781 -7892872 -7907382 -7963430 -8053132 -8171265 -8279685 -8327198 -8323709 -8317527 -8304087
17628 -8304087 -8276217 -8253184 -8191206 -8114872 -8044698 -7988076 -7923880 -7866026 -7821793 -7783939 -7746715
17617 -7746715 -7699703 -7662410 -7640139 -7621082 -7610356 -7615710 -7623610 -7625347 -7628751 -7637672 -7643026 -7661735
17605 -7661735 -7684689 -7703778 -7711106 -7706950 -7701600 -7684213 -7681570 -7680842 -7671754 -7683993 -7679771 -7686252 -7692399
17592 -7692399 -7691117 -7680576 -7665678 -7647812 -7608804 -7565698 -7541936 -7506905 -7459042 -7419066 -7385324
17581 -7385324 -7335711 -7302646 -7274070 -7265586 -7253144 -7255313 -7266328 -7266641 -7248665 -7212483 -7187989 -7182488
17569 -7182488 -7187705 -7190594 -7201086 -7205869 -7184815 -7168116 -7157158 -7145874 -7129544 -7114385 -7104047 -7104016
17557 -7104016 -7106283 -7105401 -7094877 -7084702 -7076607 -7064632 -7063731 -7068602 -7069174 -7061487 -7045214 -7035981 -7038979 -7029905
17543 -7029905 -7012838 -6986964 -6953783 -6918591 -6886901 -6857112 -6817979 -6792427 -6763122 -6714842 -6681427
17532 -6681427 -6673009 -6668975 -6668545 -6661790 -6650662 -6638599 -6627543 -6646468 -6679693 -6710946 -6726203 -6737602
17520 -6737602 -6747380 -6771588 -6782613 -6789030 -6790911 -6781982 -6770215 -6749920 -6734688 -6720876 -6699220 -6677645
17508 -6677645 -6648961 -6629971 -6623844 -6616280 -6590388 -6560099 -6532270 -6525195 -6524870 -6515598 -6499072 -6495174 -6478904
17495 -6478904 -6442416 -6410979 -6386827 -6368911 -6357293 -6337532 -6329521 -6324034 -6319262 -6303056 -6275151 -6243378
17483 -6243378 -6217488 -6217891 -6227226 -6239105 -6247963 -6246267 -6228597 -6197804 -6181956 -6186167 -6196956 -6208595
17471 -6208595 -6224238 -6227596 -6217420 -6205231 -6188592 -6178449 -6163394 -6158610 -6152627 -6139688 -6136179 -6133828
17459 -6133828 -6122505 -6110602 -6100349 -6095750 -6079640 -6063472 -6048735 -6039830 -6028379 -6010981 -6017267 -6040976
17447 -6040976 -6050635 -6047460 -6043064 -6027706 -6000452 -5993685 -6012020 -6038321 -6065645 -6056713 -6046561 -6028635
17435 -6028635 -6004684 -5976725 -5965308 -5945303 -5923374 -5910584 -5884518 -5869201 -5849289 -5825542 -5820231
17424 -5820231 -5801212 -5783031 -5754241 -5737801 -5727364 -5726178 -5735260 -5748513 -5760095 -5782854 -5807670 -5832095
17412 -5832095 -5856065 -5886037 -5914461 -5935430 -5943610 -5942015 -5939487 -5940250 -5944240 -5944128 -5948567 -5956260 -5960984
17399 -5960984 -5952246 -5937311 -5922812 -5906572 -5887096 -5876020 -5870942 -5885415 -5890133 -5876391 -5857971 -5839737
17387 -5839737 -5814917 -5801128 -5796655 -5781124 -5749591 -5728359 -5723474 -5718001 -5712538 -5701086 -5686610 -5674928
17375 -5674928 -5668199 -5660076 -5652453 -5638236 -5623998 -5607150 -5589072 -5578975 -5577556 -5572808 -5565241 -5565913 -5565402
17362 -5565402 -5546686 -5529459 -5514050 -5499561 -5486351 -5479759 -5469213 -5471492 -5484062 -5484869 -5478059 -5463742
17350 -5463742 -5443774 -5429216 -5425904 -5436127 -5436478 -5437122 -5441045 -5435009 -5426619 -5414803 -5407013 -5399751 -5382402
17337 -5382402 -5368315 -5362311 -5364987 -5351628 -5343663 -5340138 -5338648 -5337399 -5326670 -5312971 -5304732 -5297931 -5286522
17324 -5286522 -5283604 -5276412 -5265916 -5260819 -5252932 -5246081 -5229907 -5222335 -5226698 -5206502 -5195705 -5197067 -5186347
17311 -5186347 -5178338 -5176497 -5173710 -5169432 -5161167 -5153978 -5150613 -5151312 -5137784 -5136629 -5135808 -5132243 -5118700 -5104824
17297 -5104824 -5097055 -5086052 -5082825 -5080251 -5082691 -5077532 -5072615 -5062319 -5051700 -5048815 -5049668 -5042111 -5033578
17284 -5033578 -5029167 -5022211 -5019409 -5011922 -5014244 -5011452 -4999491 -4977867 -4957993 -4939153 -4936704 -4941246 -4951387
17271 -4951387 -4946718 -4944293 -4932087 -4927387 -4925108 -4921553 -4922714 -4919995 -4913109 -4905593 -4904899 -4893064 -4885149 -4890847
17257 -4890847 -4880328 -4866050 -4850932 -4830549 -4831160 -4834440 -4842827 -4845425 -4844351 -4830455 -4822772 -4814494 -4803494
17244 -4803494 -4802766 -4801796 -4801079 -4787010 -4781564 -4778961 -4770762 -4756980 -4755439 -4754682 -4739738 -4738871 -4742635 -4733744
17230 -4733744 -4717356 -4706382 -4711385 -4707283 -4707775 -4701588 -4700506 -4687537 -4676767 -4675327 -4673034 -4677092 -4675379
17217 -4675379 -4663633 -4655868 -4647714 -4645534 -4642505 -4632747 -4628657 -4630312 -4625545 -4616633 -4602103 -4597304 -4599616
17204 -4599616 -4592714 -4591709 -4583218 -4570842 -4571021 -4562043 -4556992 -4552559 -4534318 -4520853 -4526311 -4530194 -4531944
17191 -4531944 -4528042 -4527690 -4514698 -4507661 -4506269 -4505001 -4501388 -4501258 -4499731 -4496859 -4493831 -4488650 -4476704 -4465281
17177 -4465281 -4465169 -4463555 -4464220 -4467848 -4466512 -4452862 -4433257 -4430877 -4429251 -4423367 -4406463 -4401348 -4408455 -4414883
17163 -4414883 -4410531 -4416046 -4420697 -4409701 -4402041 -4397347 -4386837 -4383861 -4383399 -4377546 -4371978 -4363956 -4356518 -4346219
17149 -4346219 -4333406 -4323988 -4317834 -4320592 -4322786 -4323315 -4328885 -4315843 -4306764 -4306263 -4297800 -4287833 -4287166 -4276801
17135 -4276801 -4281124 -4280551 -4280628 -4274374 -4261972 -4262876 -4265147 -4257217 -4243725 -4245798 -4243790 -4235764 -4229797 -4225936
17121 -4225936 -4217518 -4207823 -4202638 -4192528 -4182914 -4178746 -4184179 -4188647 -4187944 -4182111 -4182775 -4178388 -4174697 -4163523
17107 -4163523 -4166627 -4168358 -4150645 -4143302 -4136437 -4140060 -4142020 -4135861 -4135115 -4136952 -4131984 -4119240 -4111760 -4117953
17093 -4117953 -4112152 -4099663 -4094942 -4094964 -4092104 -4088725 -4080175 -4083704 -4070581 -4055968 -4054197 -4048385 -4047009 -4041315
17079 -4041315 -4038011 -4040854 -4034667 -4033463 -4027227 -4024645 -4032156 -4036077 -4018653 -4008546 -4007065 -4007826 -4011830 -4010949
17065 -4010949 -4003080 -4001039 -4000663 -3992818 -3988984 -3984652 -3980432 -3967213 -3950882 -3951746 -3949080 -3942222 -3922290 -3909480
17051 -3909480 -3908347 -3916925 -3921077 -3930315 -3943002 -3960338 -3966737 -3955394 -3938905 -3932893 -3925625 -3910697 -3912769
17038 -3912769 -3912729 -3904648 -3899111 -3894701 -3897787 -3899459 -3895127 -3886197 -3879000 -3884470 -3882748 -3873244 -3865060 -3862208
17024 -3862208 -3858982 -3857370 -3852867 -3853925 -3838493 -3824092 -3821698 -3826560 -3820968 -3823622 -3816835 -3811069 -3800929
17011 -3800929 -3795457 -3795424 -3799509 -3795026 -3799656 -3802100 -3797766 -3791344 -3784550 -3773836 -3771431 -3765663 -3763408 -3763715
16997 -3763715 -3757461 -3740542 -3731745 -3719072 -3711368 -3710042 -3715032 -3713496 -3715954 -3728525 -3728536 -3719900 -3710076 -3713826
16983 -3713826 -3716235 -3716380 -3711703 -3695320 -3690644 -3687806 -3682005 -3676254 -3675755 -3675905 -3667440 -3662877 -3671650 -3671862 -3662242
16968 -3662242 -3658767 -3657212 -3662463 -3653268 -3644041 -3638679 -3629892 -3624329 -3619949 -3618023 -3619122 -3610189 -3606302 -3610594
16954 -3610594 -3609640 -3606500 -3609567 -3608492 -3604212 -3606162 -3607811 -3605120 -3598337 -3601620 -3603381 -3604828 -3602952 -3599710
16940 -3599710 -3591018 -3585368 -3578571 -3568112 -3573721 -3578322 -3569215 -3552440 -3551571 -3559263 -3558783 -3568513 -3574875 -3568264
16926 -3568264 -3558413 -3556332 -3547947 -3539676 -3530387 -3523135 -3518629 -3513426 -3512510 -3522275 -3522669 -3526724 -3519893 -3514509
16912 -3514509 -3513253 -3505262 -3495265 -3495153 -3504354 -3508129 -3498828 -3480808 -3463041 -3460346 -3476414 -3477959 -3482259
16899 -3482259 -3483457 -3479923 -3479913 -3482647 -3476666 -3477384 -3470446 -3466840 -3457597 -3451346 -3445056 -3446715 -3443343 -3449466 -3438214
16884 -3438214 -3421857 -3421383 -3425258 -3424857 -3426794 -3422871 -3413641 -3413241 -3406754 -3404965 -3398698 -3389713 -3386410 -3384404
16870 -3384404 -3381167 -3369517 -3368604 -3366911 -3364779 -3369056 -3366123 -3363485 -3365127 -3358272 -3349053 -3349624 -3347037 -3347022 -3341656
16855 -3341656 -3353808 -3348105 -3329187 -3314542 -3323212 -3326221 -3324809 -3313502 -3309712 -3321186 -3326803 -3328667 -3316691
16842 -3316691 -3304604 -3288601 -3287833 -3280558 -3272941 -3279466 -3278649 -3266133 -3261726 -3261198 -3261386 -3270216 -3275439 -3272031
16828 -3272031 -3260178 -3259949 -3252224 -3243247 -3246301 -3252601 -3254051 -3245345 -3234573 -3239736 -3248754 -3248837 -3240023 -3229987
16814 -3229987 -3229232 -3229771 -3228860 -3231036 -3231763 -3230697 -3220801 -3212895 -3199963 -3196688 -3201095 -3199273 -3195992 -3182871
16800 -3182871 -3179273 -3182342 -3191046 -3187641 -3180802 -3176561 -3182631 -3187908 -3187434 -3185558 -3187613 -3180539 -3165736 -3157350
16786 -3157350 -3160699 -3155543 -3149233 -3149050 -3147767 -3150663 -3151214 -3138433 -3130245 -3131520 -3131292 -3133710 -3122072 -3121844
16772 -3121844 -3128065 -3131710 -3121957 -3111019 -3092657 -3098874 -3106256 -3107118 -3102733 -3104619 -3103473 -3097658 -3094855 -3089264
16758 -3089264 -3090214 -3090036 -3090925 -3096058 -3082388 -3063385 -3067968 -3072152 -3065027 -3056485 -3053848 -3049340 -3040195 -3044383
16744 -3044383 -3055837 -3056644 -3045712 -3041715 -3042179 -3041559 -3045231 -3040447 -3031133 -3029043 -3021216 -3019021 -3006661 -3005516
16730 -3005516 -3007452 -3010551 -3011587 -3005646 -3003963 -3003389 -2998426 -2994780 -2993864 -2989812 -2989609 -2994657 -2985916 -2973446
16716 -2973446 -2968118 -2975025 -2977175 -2972243 -2961052 -2954392 -2955344 -2957115 -2953526 -2949227 -2951086 -2949011 -2956090 -2955042
16702 -2955042 -2946279 -2941293 -2940770 -2941336 -2943842 -2952218 -2945150 -2936486 -2940057 -2944721 -2945098 -2933905 -2924625 -2920298
16688 -2920298 -2918870 -2905607 -2889541 -2879887 -2874089 -2871303 -2877088 -2883914 -2882088 -2876722 -2873905 -2877059 -2877106 -2878353
16674 -2878353 -2881863 -2884634 -2881947 -2883666 -2882144 -2883354 -2883105 -2868798 -2869371 -2867235 -2868609 -2866433 -2856606 -2849793
16660 -2849793 -2858662 -2857272 -2849434 -2850443 -2840795 -2825634 -2817350 -2825547 -2826677 -2825117 -2817451 -2813149 -2810433 -2807860
16646 -2807860 -2804817 -2811741 -2813009 -2806514 -2814496 -2815579 -2818456 -2805431 -2802736 -2800682 -2792011 -2787287 -2791006 -2799018
16632 -2799018 -2808376 -2804721 -2790621 -2780215 -2773201 -2778380 -2782666 -2779092 -2770800 -2770149 -2759151 -2752370 -2756447
16619 -2756447 -2756809 -2751405 -2750132 -2753186 -2752407 -2754630 -2751931 -2742308 -2731914 -2737619 -2752343 -2748471 -2739718 -2741167
16605 -2741167 -2742570 -2736669 -2731485 -2721164 -2708036 -2710517 -2725064 -2727247 -2707478 -2703144 -2708771 -2710173 -2695840
16592 -2695840 -2692415 -2687829 -2687880 -2687972 -2693570 -2691305 -2685021 -2679572 -2683713 -2686847 -2681023 -2681651 -2678978 -2678679 -2679635 -2668209
16576 -2668209 -2663912 -2654984 -2646865 -2658788 -2668816 -2670821 -2675773 -2673955 -2668829 -2667412 -2664566 -2656860 -2652071
16563 -2652071 -2647448 -2645950 -2639320 -2637929 -2628272 -2616768 -2622768 -2622805 -2607192 -2606483 -2614700 -2620554 -2627632 -2630101
16549 -2630101 -2626564 -2615919 -2603173 -2596879 -2596369 -2599162 -2602807 -2614779 -2600108 -2587087 -2585862 -2594256 -2596009
16536 -2596009 -2587695 -2584422 -2577799 -2579093 -2580400 -2581560 -2578021 -2561129 -2560316 -2565074 -2571105 -2569121 -2563112 -2560081
16522 -2560081 -2562220 -2565552 -2563563 -2559807 -2557298 -2558799 -2552868 -2549586 -2545394 -2552315 -2540630 -2536901 -2527190 -2517081
16508 -2517081 -2512937 -2510057 -2513438 -2518170 -2520580 -2525750 -2527104 -2520854 -2520229 -2510628 -2495127 -2497849 -2499426 -2501087
16494 -2501087 -2499645 -2498737 -2490213 -2499917 -2503806 -2498772 -2493484 -2494007 -2489258 -2477393 -2475372 -2478357 -2473200 -2472460
16480 -2472460 -2465878 -2458873 -2463459 -2451508 -2446049 -2450355 -2455382 -2458396 -2460167 -2461362 -2458492 -2457815 -2452669 -2441757
16466 -2441757 -2428760 -2422092 -2415387 -2411342 -2417912 -2425817 -2434102 -2428318 -2420744 -2420793 -2423176 -2425493 -2422608 -2414054
16452 -2414054 -2409098 -2407706 -2403585 -2401434 -2405468 -2400603 -2399286 -2393147 -2403786 -2409944 -2396264 -2394364 -2395674
16439 -2395674 -2388117 -2389660 -2391095 -2390103 -2380854 -2382910 -2377589 -2376282 -2375968 -2383114 -2379985 -2372076 -2361364 -2361529
16425 -2361529 -2369162 -2372646 -2380360 -2377866 -2366510 -2359486 -2353300 -2350049 -2348251 -2340882 -2341630 -2354165 -2344870 -2334474
16411 -2334474 -2327853 -2330026 -2331932 -2317674 -2305450 -2316814 -2318428 -2309258 -2313483 -2325180 -2335826 -2345896
16399 -2345896 -2356603 -2347856 -2339200 -2337402 -2328653 -2314756 -2310907 -2301101 -2294691 -2303417 -2317061 -2336015 -2345754
16386 -2345754 -2349131 -2346946 -2333825 -2336013 -2337218 -2336813 -2320773 -2320141 -2320387 -2319906 -2313798 -2312162 -2310297 -2299836
16372 -2299836 -2281497 -2284143 -2301481 -2306085 -2302118 -2301083 -2307317 -2308739 -2295506 -2277354 -2269037 -2267206 -2272126
16359 -2272126 -2275353 -2279991 -2290189 -2283984 -2278487 -2271652 -2264933 -2265444 -2264357 -2264938 -2263566 -2261314 -2255529 -2249509
16345 -2249509 -2238611 -2240376 -2253247 -2259534 -2253168 -2251570 -2247839 -2235192 -2223983 -2235059 -2242387 -2236781 -2244155
16332 -2244155 -2246073 -2227917 -2204847 -2192821 -2191186 -2198430 -2209851 -2218034 -2202318 -2200855 -2213282 -2203390
16320 -2203390 -2189844 -2194384 -2198061 -2196131 -2197055 -2196238 -2195795 -2199867 -2199375 -2192231 -2187818 -2182617 -2180504 -2181999 -2176482
16305 -2176482 -2169065 -2163571 -2163008 -2159570 -2162907 -2160669 -2163861 -2168336 -2167262 -2176043 -2181470 -2170627 -2157011 -2152740
16291 -2152740 -2146620 -2137244 -2140762 -2134183 -2131627 -2135860 -2136062 -2135916 -2135991 -2131948 -2126678 -2133408 -2139927 -2131900 -2128908
16276 -2128908 -2124266 -2114583 -2113720 -2114904 -2123332 -2126712 -2121649 -2118650 -2113348 -2117331 -2119690 -2112559 -2112354 -2121267
16262 -2121267 -2116684 -2117033 -2116551 -2114258 -2107729 -2100832 -2097532 -2094853 -2098494 -2097932 -2091068 -2087517 -2095715 -2092356 -2084197
16247 -2084197 -2073103 -2066119 -2054475 -2056979 -2072400 -2075296 -2069391 -2072297 -2067631 -2056053 -2054096 -2052283 -2052600
16234 -2052600 -2058025 -2060951 -2062087 -2066719 -2061789 -2048812 -2055929 -2059704 -2056060 -2060703 -2058425 -2051316 -2042996 -2033773
16220 -2033773 -2022647 -2021987 -2026836 -2031816 -2027632 -2020911 -2015852 -2013415 -2006139 -2001013 -1996062 -2014358 -2019640 -2012352
16206 -2012352 -2001496 -1992436 -1990570 -1994320 -1988369 -1981815 -1988997 -1990952 -1995748 -1995000 -1992982 -1997286 -2011986 -2004582
16192 -2004582 -1991334 -1992192 -2005214 -2008382 -1997959 -1998905 -1997774 -1988074 -1978644 -1975128 -1972656 -1957812 -1959255
16179 -1959255 -1966829 -1969043 -1966484 -1971997 -1965554 -1959429 -1958375 -1953237 -1959123 -1970528 -1964681 -1941673 -1929897
16166 -1929897 -1928447 -1925457 -1928452 -1925326 -1917080 -1914058 -1916074 -1915612 -1920814 -1919300 -1914461 -1910645 -1907366 -1899730
16152 -1899730 -1895848 -1892626 -1887462 -1884339 -1887582 -1892408 -1887447 -1869719 -1874250 -1892324 -1909323 -1928068 -1936090
16139 -1936090 -1938008 -1922928 -1912834 -1907378 -1898020 -1895641 -1897779 -1901476 -1903554 -1918573 -1932472 -1943759 -1943059
16126 -1943059 -1943941 -1938577 -1939353 -1942135 -1930695 -1930444 -1932158 -1918404 -1910611 -1904134 -1896347 -1890357 -1886233 -1890747
16112 -1890747 -1892261 -1892219 -1899020 -1905523 -1901648 -1903297 -1903539 -1889049 -1888377 -1891326 -1890026 -1891180 -1894058 -1894858 -1895848
16097 -1895848 -1889568 -1876105 -1868387 -1863767 -1860633 -1854086 -1861693 -1851047 -1848239 -1854900 -1857514 -1854725 -1853065
16084 -1853065 -1846424 -1842598 -1845871 -1845222 -1840507 -1841495 -1842255 -1845047 -1838806 -1823576 -1812906 -1820401 -1824433 -1820703
16070 -1820703 -1820122 -1821759 -1824245 -1818311 -1814631 -1807766 -1810990 -1812106 -1813293 -1816834 -1810991 -1817125 -1810788 -1799753
16056 -1799753 -1799841 -1805832 -1814250 -1815424 -1811634 -1806342 -1800239 -1792206 -1788478 -1796753 -1798496 -1794373 -1795284 -1801517 -1794799
16041 -1794799 -1779126 -1772080 -1774704 -1774626 -1772528 -1773720 -1768301 -1769628 -1771701 -1773624 -1775126 -1771232 -1768349 -1773514
16027 -1773514 -1784457 -1787777 -1782149 -1768405 -1762094 -1765918 -1773870 -1775312 -1774444 -1767342 -1753982 -1743352 -1746709
16014 -1746709 -1761131 -1758357 -1746243 -1756485 -1765926 -1757907 -1758315 -1754204 -1753080 -1736860 -1739297 -1743997 -1738606
16001 -1738606 -1729902 -1730843 -1729934 -1729178 -1734057 -1733741 -1730223 -1736307 -1735208 -1729754 -1731515 -1721184 -1709591 -1693140
15987 -1693140 -1687422 -1694953 -1707933 -1706770 -1706587 -1691404 -1686203 -1691935 -1694002 -1695132 -1693663 -1689555 -1696362 -1706768
15973 -1706768 -1698858 -1683965 -1676749 -1672666 -1669919 -1680518 -1684734 -1677934 -1679801 -1666995 -1666658 -1680177 -1683375
15960 -1683375 -1676127 -1668630 -1672977 -1682696 -1680718 -1678490 -1683013 -1676481 -1665645 -1653511 -1656190 -1659392 -1665747
15947 -1665747 -1668437 -1659180 -1647147 -1643319 -1641809 -1644649 -1646579 -1641697 -1643762 -1659356 -1668010 -1668824 -1664328 -1655616
15933 -1655616 -1644391 -1652902 -1651540 -1642510 -1647428 -1653547 -1654435 -1646245 -1628921 -1619900 -1619565 -1628741 -1628822 -1636774
15919 -1636774 -1636106 -1619171 -1606585 -1606566 -1603192 -1605529 -1605158 -1605611 -1605899 -1602368 -1597782 -1597216 -1597591 -1593900 -1591366
15904 -1591366 -1593069 -1592217 -1596141 -1594284 -1588106 -1591451 -1599508 -1602729 -1598312 -1591096 -1586605 -1578645 -1578685 -1584466 -1584403
15889 -1584403 -1582877 -1582167 -1577732 -1575827 -1582982 -1583130 -1578777 -1584035 -1586526 -1578145 -1577264 -1571644 -1576437 -1573494 -1555165
15874 -1555165 -1553813 -1556343 -1560869 -1554457 -1555858 -1560898 -1563977 -1552743 -1551096 -1561054 -1556942 -1556075 -1555111 -1541890
15860 -1541890 -1535047 -1533601 -1528362 -1536941 -1546825 -1548888 -1549351 -1542631 -1548554 -1545224 -1537097 -1540758 -1527612 -1516389
15846 -1516389 -1527853 -1527870 -1529516 -1531328 -1531808 -1519025 -1512292 -1509124 -1521290 -1523637 -1521251 -1516322 -1503267 -1493126
15832 -1493126 -1495006 -1501135 -1505724 -1502906 -1507834 -1509633 -1503219 -1500073 -1502530 -1493984 -1491812 -1486878 -1491788 -1497835
15818 -1497835 -1499410 -1498837 -1488844 -1490381 -1487794 -1493165 -1496251 -1496665 -1500927 -1500510 -1488814 -1476311 -1471309 -1470784
15804 -1470784 -1482011 -1490112 -1482808 -1473574 -1463684 -1457558 -1461288 -1470463 -1478513 -1481173 -1481208 -1480784 -1473915 -1467655
15790 -1467655 -1462314 -1467358 -1468261 -1470024 -1465662 -1459918 -1457800 -1457502 -1448609 -1451802 -1459436 -1456246 -1460245 -1458240
15776 -1458240 -1457330 -1464906 -1457285 -1446227 -1452383 -1454488 -1463539 -1463544 -1451859 -1442295 -1435682 -1433242 -1431036 -1432088
15762 -1432088 -1433569 -1433530 -1433150 -1430649 -1425492 -1420362 -1412636 -1428959 -1431872 -1423138 -1418950 -1416202 -1412670 -1419433
15748 -1419433 -1418155 -1415912 -1412632 -1407985 -1404399 -1405354 -1405308 -1391871 -1389361 -1391034 -1393434 -1399801 -1400632 -1394581 -1395534
15733 -1395534 -1393382 -1393004 -1393640 -1392128 -1390360 -1385883 -1393319 -1388960 -1381769 -1379869 -1387380 -1389008 -1371600 -1362755
15719 -1362755 -1365857 -1362347 -1359308 -1358485 -1364643 -1370389 -1373961 -1373381 -1371741 -1373547 -1372794 -1365555 -1359376 -1356805 -1353846
15704 -1353846 -1353387 -1347852 -1341292 -1342995 -1340715 -1344971 -1347917 -1338940 -1335544 -1333714 -1333352 -1338081 -1329634 -1320100
15690 -1320100 -1334250 -1339980 -1335857 -1335227 -1340023 -1336948 -1326011 -1325724 -1327073 -1329639 -1338914 -1338532 -1328078 -1319001
15676 -1319001 -1319005 -1317782 -1315149 -1302392 -1285594 -1287368 -1293303 -1305921 -1313650 -1326268 -1338789 -1331508 -1316073
15663 -1316073 -1310765 -1313889 -1307844 -1294685 -1276871 -1269380 -1284822 -1281959 -1299376 -1322614 -1344670 -1351773
15651 -1351773 -1354992 -1344622 -1334847 -1329313 -1320703 -1324966 -1325432 -1320841 -1310328 -1300691 -1297579 -1306181 -1313565 -1316294
15637 -1316294 -1320188 -1317013 -1300655 -1301643 -1297425 -1299894 -1301969 -1310643 -1307835 -1305895 -1296056 -1287211 -1287195 -1287335 -1288598
15622 -1288598 -1290563 -1294939 -1294085 -1287206 -1275540 -1276801 -1273087 -1287391 -1297650 -1283804 -1278835 -1289173 -1290887
15609 -1290887 -1293780 -1289974 -1279861 -1271621 -1268055 -1260982 -1264821 -1264207 -1268823 -1270043 -1260431 -1253277 -1265421 -1272775
15595 -1272775 -1277533 -1270093 -1245920 -1242213 -1247168 -1250993 -1258251 -1256743 -1251061 -1248118 -1250472 -1246352 -1243246 -1248555
15581 -1248555 -1242428 -1246435 -1235851 -1229929 -1230439 -1236980 -1245081 -1247459 -1252851 -1244756 -1241470 -1231716 -1221128 -1219913
15567 -1219913 -1220868 -1213805 -1209644 -1208729 -1203073 -1203613 -1210304 -1204091 -1204224 -1203424 -1214989 -1225554 -1219902 -1211381 -1204795
15552 -1204795 -1203750 -1206421 -1208033 -1210309 -1201125 -1193181 -1184955 -1186340 -1185946 -1178480 -1185839 -1186106 -1184072 -1176384
15538 -1176384 -1175559 -1182758 -1189159 -1175024 -1167241 -1167018 -1179044 -1181603 -1172341 -1175161 -1177578 -1178648 -1179681 -1175829
15524 -1175829 -1175764 -1165741 -1152587 -1150386 -1147729 -1141047 -1134871 -1144423 -1161493 -1169187 -1167656 -1155719 -1149858
15511 -1149858 -1152176 -1141470 -1140488 -1145611 -1150779 -1151332 -1150132 -1139785 -1133095 -1132973 -1136507 -1136365 -1130740 -1136780
15497 -1136780 -1137646 -1137553 -1149713 -1152407 -1150420 -1138350 -1135366 -1134218 -1137563 -1136989 -1133595 -1115143 -1111853 -1109487
15483 -1109487 -1113469 -1113106 -1119268 -1113525 -1108530 -1110426 -1121583 -1123359 -1119453 -1116581 -1114624 -1112900 -1124696 -1121209
15469 -1121209 -1113560 -1107339 -1099684 -1105771 -1107687 -1099118 -1099017 -1107961 -1114036 -1105592 -1103091 -1100879 -1105881 -1104997
15455 -1104997 -1098222 -1097536 -1092729 -1087570 -1081503 -1080223 -1077824 -1069782 -1073214 -1076405 -1073642 -1070682 -1067809 -1064671
15441 -1064671 -1065021 -1070984 -1084423 -1090398 -1090017 -1082409 -1081481 -1072817 -1060859 -1065771 -1071590 -1069543 -1064612 -1064784
15427 -1064784 -1059347 -1067309 -1067143 -1068007 -1065236 -1043336 -1028767 -1034057 -1049324 -1051826 -1041362 -1036104 -1040934
15414 -1040934 -1042497 -1036059 -1040976 -1045086 -1039031 -1044202 -1048383 -1052919 -1043064 -1038309 -1028548 -1022547 -1024123 -1029244
15400 -1029244 -1039059 -1037181 -1033321 -1032884 -1039056 -1045767 -1041719 -1032758 -1028619 -1035980 -1029713 -1022227 -1022950 -1017141
15386 -1017141 -1002462 -1010412 -1016817 -1015118 -1011852 -998480 -999136 -1010620 -1002012 -997427 -1004014 -998040 -1004330
15373 -1004330 -1010341 -1002453 -997471 -1000583 -996424 -982994 -975930 -979209 -985495 -987279 -990022 -991678 -995912 -987016
15359 -987016 -984411 -976637 -975823 -974875 -979365 -981762 -989123 -983488 -987631 -983853 -975051 -973477 -968917 -968551 -973970
15344 -973970 -971367 -964891 -964160 -967302 -959536 -964312 -960176 -948829 -956305 -967046 -967511 -962009 -962423 -966777
15330 -966777 -964010 -957967 -956844 -958272 -946668 -936349 -934337 -930338 -917302 -906480 -916660 -931012 -929931
15317 -929931 -928293 -922211 -913764 -900612 -906031 -917272 -929685 -938642 -947301 -949578 -942511 -939698 -931988
15304 -931988 -923931 -918928 -914418 -910953 -906024 -911871 -918632 -915572 -909454 -911999 -914857 -920461 -921780 -918621
15290 -918621 -923830 -933208 -933407 -935160 -932050 -926791 -911980 -910770 -915180 -914740 -911366 -910933 -917686 -920936 -910292
15275 -910292 -910078 -905773 -905031 -899426 -889224 -895023 -902361 -897752 -882062 -879000 -888045 -892218 -889436 -884024
15261 -884024 -869594 -871530 -877983 -878993 -876439 -869523 -868943 -861802 -857671 -857680 -855487 -849305 -837784 -831723 -827880
15246 -827880 -825983 -822840 -822562 -814683 -822690 -845001 -863257 -874737 -890464 -891635 -879372 -865379 -859421
15233 -859421 -848619 -841310 -844002 -848806 -870146 -887485 -900777 -911521 -917523 -921590 -925794 -912987 -901179
15220 -901179 -910942 -902996 -884936 -876148 -873297 -868746 -862740 -853099 -845596 -836847 -842886 -853425 -845379 -845024
15206 -845024 -843180 -834981 -830674 -833786 -834877 -837455 -838999 -832586 -829449 -833619 -834675 -833876 -829084 -832074
15192 -832074 -834093 -841668 -839494 -832562 -826480 -820458 -818768 -814332 -803615 -788869 -788736 -798945 -808717 -811191
15178 -811191 -812065 -811444 -803283 -801952 -804366 -802992 -798892 -793018 -790587 -785459 -777334 -765309 -769144 -770876
15164 -770876 -773364 -776461 -774879 -766886 -767620 -773115 -780073 -781182 -775878 -777820 -779506 -782879 -782619 -776418 -767611
15149 -767611 -772250 -781356 -772851 -769741 -775540 -781020 -781846 -771256 -770880 -764314 -760935 -754661 -754596 -754905 -758393
15134 -758393 -752643 -736270 -727322 -731473 -742603 -743573 -733957 -734526 -739093 -733826 -732132 -736103 -730013 -732383
15120 -732383 -729011 -728740 -735414 -733946 -731224 -723027 -720838 -724474 -726773 -730484 -728068 -720079 -716776 -731056
15106 -731056 -733632 -729589 -734113 -729282 -720897 -714241 -712528 -709435 -706604 -711665 -710175 -709509 -703222 -701323
15092 -701323 -709105 -705471 -699424 -701278 -709184 -708503 -715490 -718998 -710496 -695175 -685367 -687616 -691866 -681646
15078 -681646 -671788 -682274 -694811 -688970 -686884 -675064 -666334 -666809 -663089 -660942 -666731 -669391 -662627 -661119
15064 -661119 -663179 -660423 -652584 -649980 -648382 -655290 -658593 -659659 -658021 -649409 -642630 -648113 -662342 -666835
15050 -666835 -655375 -646941 -644476 -636303 -630786 -631215 -635775 -633493 -636285 -638750 -643298 -648953 -643387 -640489
15036 -640489 -627050 -622219 -618994 -615583 -609288 -602966 -610065 -615230 -601319 -593593 -595188 -595136 -596725 -596555
15022 -596555 -590868 -589228 -589403 -584530 -588418 -585885 -580880 -580812 -581327 -576500 -598666 -618114 -623800 -629778 -630225
15007 -630225 -622109 -615995 -607651 -592042 -585452 -579157 -588715 -589714 -586704 -577948 -572404 -574376 -580587 -584111
14993 -584111 -586738 -585328 -591238 -594962 -593184 -600120 -607052 -608479 -607944 -610100 -600368 -600711 -606848 -598063 -580847
14978 -580847 -575172 -568669 -574874 -575624 -568952 -567614 -566409 -566392 -572490 -569622 -564105 -561963 -561221 -554541 -544562
14963 -544562 -541553 -539566 -540809 -543361 -546506 -551322 -545212 -542775 -542623 -546055 -541148 -536657 -536324 -539159 -531478
14948 -531478 -528727 -529002 -524091 -526018 -514147 -508818 -498076 -494941 -497101 -498467 -500590 -499386 -497678 -503540
14934 -503540 -503229 -497499 -504870 -504733 -500444 -494764 -487661 -486945 -478169 -472092 -465155 -465090 -468019 -472156 -472266 -471796
14918 -471796 -471970 -467906 -467030 -469717 -460193 -447531 -442954 -446909 -443156 -438253 -430826 -434845 -431572 -437636
14904 -437636 -447886 -456815 -447745 -441968 -440202 -428585 -421349 -424253 -429903 -426031 -412030 -407619 -410045
14891 -410045 -414751 -413374 -395993 -386226 -384525 -398033 -397360 -387769 -384173 -381440 -372386 -367177 -363036 -349565
14877 -349565 -345881 -355731 -364354 -368667 -367286 -359554 -350154 -340224 -339038 -335855 -333781 -340932 -323437 -317542
14863 -317542 -313513 -314268 -315174 -302837 -293357 -295579 -289495 -279683 -265774 -268210 -269396 -259342 -240637 -230017
14849 -230017 -222798 -223914 -235226 -227353 -210222 -202991 -189958 -174132 -160580 -153500 -153062 -142651 -123432
14836 -123432 -100170 -81890 -58104 -33492 -11881 2905 14210 1978 -40277 -96793 -130893
14825 -130893 -143795 -149013 -132417 -96915 -49022 -5770 38294 89748 125402 133110 112109 76291
14813 76291 46151 30146 12706 -17959 -73209 -169315 -273797 -344246 -370492 -351098 -293854
14802 -293854 -217021 -129698 -48677 38072 122093 153744 110552 -4773 -189204 -395921 -558500
14791 -558500 -632829 -642000 -608767 -545319 -462332 -386982 -322443 -260326 -198936 -140510 -88102 -46241
14779 -46241 8336 74845 155998 242799 344042 457670 587185 755511 940559 1072712
14769 1072712 1050336 776413 244021 -444230 -1085831 -1521985 -1693662 -1646389 -1490563 -1312935
14759 -1312935 -1147044 -997243 -854957 -717989 -604324 -537796 -564023 -663440 -815618 -971003
14749 -971003 -1125455 -1277821 -1395959 -1471380 -1510654 -1495882 -1428750 -1356633 -1295441 -1241132 -1175080
14738 -1175080 -1132789 -1100397 -1069734 -1038575 -1017827 -1002438 -981344 -957989 -940383 -924429 -900896
14727 -900896 -869273 -847013 -834113 -830608 -833647 -831345 -826081 -810146 -789837 -762071 -749144 -745403
14715 -745403 -744578 -740131 -736960 -732009 -720501 -700838 -689043 -686726 -680035 -670039 -660491 -667330 -653647
14702 -653647 -645891 -643204 -636845 -618152 -606918 -607385 -619424 -617189 -608987 -596092 -592856 -594835 -594539 -595581
14688 -595581 -591976 -586650 -563386 -550798 -547224 -558846 -571423 -560402 -544827 -531639 -527805 -530491
14676 -530491 -531091 -535792 -531685 -524503 -516392 -511980 -524526 -530448 -526591 -510854 -499140 -502045 -501750 -494773
14662 -494773 -489249 -484447 -482178 -479324 -467828 -466837 -466045 -465832 -471386 -472653 -463039 -453366 -454343 -452797 -447690
14647 -447690 -441421 -441097 -446367 -443535 -434664 -431711 -430501 -430775 -425559 -425423 -423383 -424920 -424734 -414409 -406703
14632 -406703 -401564 -387587 -381087 -384615 -374158 -362858 -358137 -356177 -351629 -346497 -340711 -328244 -307813
14619 -307813 -298674 -282107 -258540 -242786 -242296 -258973 -289364 -342785 -420193 -487719 -529876 -548084
14607 -548084 -552215 -548752 -541112 -525853 -509833 -491190 -474669 -467221 -459442 -448400 -454286 -449642 -444179
14594 -444179 -437554 -427571 -423755 -429534 -425708 -412954 -411461 -418623 -415078 -403389 -391145 -386813 -382382
14581 -382382 -391871 -396728 -395552 -384316 -369819 -360203 -364140 -367059 -362877 -362501 -361925 -368398 -370850 -365442
14567 -365442 -360104 -366517 -366137 -354255 -351746 -348843 -347486 -349551 -345312 -342020 -337689 -335771 -324534 -323384
14553 -323384 -324839 -315777 -310734 -307665 -307123 -314709 -317495 -313691 -305020 -302444 -300872 -303065 -310909 -313296
14539 -313296 -313267 -308186 -307485 -305058 -293135 -295333 -286872 -287477 -290560 -286425 -287223 -281950 -273235 -282012 -273664
14524 -273664 -280028 -278757 -277968 -276973 -279327 -284557 -285776 -279346 -276232 -276122 -274613 -268691 -264559 -272356 -271106
14509 -271106 -258223 -261019 -257385 -245164 -242170 -244762 -248656 -241198 -231869 -228205 -235947 -246418 -251219
14496 -251219 -236511 -232233 -233567 -232667 -237168 -237951 -225600 -217687 -216964 -222226 -226359 -225218 -230274 -239543
14482 -239543 -225660 -223578 -224072 -221132 -207436 -199531 -199289 -190596 -192105 -190987 -197587 -201083 -205186 -208439
14468 -208439 -206442 -196339 -185962 -185601 -183298 -192260 -195580 -188384 -189680 -182584 -183236 -183281 -179621 -178290 -168574
14453 -168574 -167426 -168027 -156727 -149203 -152749 -172625 -181599 -177402 -179282 -180464 -177293 -175735 -171670 -168868
14439 -168868 -158311 -157840 -152659 -156275 -150588 -148412 -135760 -133311 -141107 -147435 -147743 -142151 -155835 -151917
14425 -151917 -139935 -136061 -125304 -117274 -114733 -121203 -127249 -121240 -115301 -112248 -108088 -111398 -111143 -108730
14411 -108730 -105723 -104113 -105044 -108761 -106771 -108045 -103033 -95016 -94371 -103196 -100656 -98776 -96423 -93181 -91358
14396 -91358 -87777 -91821 -88196 -89772 -84990 -86953 -78296 -79093 -77235 -73412 -81199 -79858 -83252 -88521 -78646
14381 -78646 -67408 -60015 -65306 -72996 -74580 -72518 -64774 -59596 -63966 -64030 -63464 -53062 -50495 -55649 -59746
14366 -59746 -62462 -58534 -56803 -44637 -54977 -64404 -70370 -62823 -54119 -52546 -56078 -54574 -56503 -48961
14352 -48961 -40739 -29925 -34727 -41243 -42290 -34083 -25645 -29636 -26396 -29891 -35843 -35605 -27858 -20971
14338 -20971 -19262 -27329 -28006 -20449 -15727 -20268 -26079 -23654 -15286 -12855 -9408 -5661 -8530 -14283 -17093
14323 -17093 -15432 -8372 -2478 -4127 3522 9673 5003 485 124 2849 2248 7741 4058 16172 16295
14308 16295 20725 15626 14155 29423 31829 39431 28654 23783 34208 37459 42550 44206 44128 46244
14294 46244 45020 41699 38993 38697 34046 40366 55529 73714 66143 64924 62275 64598 59192 56096
14280 56096 51368 43937 40534 53624 64837 66814 64068 68302 64057 64740 67869 74063 76490 69417
14266 69417 66080 66753 68003 66621 65210 68140 72025 69538 64957 68650 71453 64150 64810 68750 59355
14251 59355 59758 71668 82222 89352 90241 96260 107238 102542 92004 98773 95099 92608 98299 100860
14237 100860 106169 98261 95619 98125 96726 103753 108648 118843 122784 127750 118692 116225 108729 110047
14223 110047 114282 123342 134466 135125 126241 130438 133810 139448 145222 152379 148977 142013 146537 146892
14209 146892 151102 149156 154469 153619 156713 153628 149712 154835 156875 161658 172308 164730 162754 168137
14195 168137 170241 172735 159073 155267 165037 187091 190431 191433 189671 186909 195819 199561 193422 189303
14181 189303 191953 199072 208302 199788 198730 204969 204585 203810 210026 215225 205118 200893 207046 210503
14167 210503 205654 205407 219317 227562 228914 223063 220665 211809 210990 217118 226718 228514 223995 226762
14153 226762 231547 232738 230947 231352 229289 223807 213893 202572 222606 230693 236852 235471 231460 232107
14139 232107 243019 247719 249098 248820 246322 255841 262229 257354 259290 256560 258441 268134 265642 257454
14125 257454 261710 268988 260797 262599 261564 265716 278747 272079 259754 265067 272405 266665 267867 281261
14111 281261 296936 304315 293621 284897 278614 284668 291298 295878 297743 301143 303941 301080 301415 302557
14097 302557 297974 301000 307094 322042 323202 320424 323169 315642 318126 322268 331792 336904 338760 332166
14083 332166 336641 336782 332430 333375 334979 335294 327925 329731 336554 338063 338982 351311 336109 324793
14069 324793 335207 350811 363498 362106 359236 350863 351268 350124 351992 365771 372361 371770 371216 374347
14055 374347 383883 385161 377929 369324 377068 363043 360464 382519 388028 392069 392250 385146 382214 400341
14041 400341 406467 395015 386547 392896 404156 399830 388487 392761 404496 417398 417360 419987 421313
14028 421313 418944 406227 408604 410387 416646 416861 414655 420184 426289 433337 430094 440732 447376 438514
14014 438514 438399 447468 455719 454067 447951 443663 451130 453000 447298 441284 444029 448618 452876 460100
14000 460100 469067 467450 461152 475857 475885 475575 469930 466626 466342 461171 459238 475231 490436 501278
13986 501278 498224 495519 498201 495588 500942 505502 513002 512951 506877 507327 504099 507556 521855 528027 519711
13971 519711 514627 514182 517486 518019 520174 529206 542437 547298 553592 550478 542788 543963 552207 564497
13957 564497 564393 565803 565764 574944 580637 585911 575425 565958 565936 569914 579703 591783 588832 595327 613309
13942 613309 616428 614497 618638 623933 619717 627140 643302 653982 653604 655029 655046 663575 674823 684115
13928 684115 696947 704292 716759 734569 756200 789417 821203 864958 903238 932428 929548 839131
13916 839131 676703 498701 366643 291813 276314 298525 338656 379987 411947 434190 459067
13905 459067 473351 478965 499312 514950 526797 530704 525657 535597 553381 557119 565658 570334 576454
13892 576454 583163 593438 589216 583374 583417 588289 593748 594176 602262 605185 615984 616527 616201 621266 632173
13877 632173 636892 639863 637940 638279 645185 654126 651554 646619 647182 653171 655530 646330 644314 651589 659567
13862 659567 660643 664281 666446 657801 655971 658745 667157 676626 692594 697682 696225 694408 708611 705663
13848 705663 705706 712219 717476 714887 715918 717734 721821 731321 729941 719834 712348 718708 725415 731309
13834 731309 736092 750142 757206 745753 735535 740984 756085 762104 748399 728018 728411 746594 757522
13821 757522 760962 759687 760594 769207 771632 775248 785591 785393 784938 790472 786383 794137 788794 779765 777539
13806 777539 786548 791689 787035 794471 804437 807218 808473 804878 814497 820894 814887 820230 842865 858456
13792 858456 865246 869010 870951 856751 844276 841608 846346 853820 863065 849167 845335 846396 849700
13779 849700 854828 867766 880435 886960 890039 886736 882037 877716 884696 883107 879765 885200 884606 891333
13765 891333 902523 904905 910777 914061 933500 935770 919602 910024 925245 943158 938206 939318 938594
13752 938594 932597 935816 943872 947453 955064 970794 983912 993620 995429 991278 993601 996179 999606 999617
13738 999617 1016580 1023995 1034656 1045039 1054024 1056077 1065324 1076560 1077269 1087459 1107943 1125636 1150761
13725 1150761 1162402 1163414 1165381 1161390 1145123 1121489 1087175 1060157 1027678 980585 951754 921477
13713 921477 890383 897883 913717 921688 936205 943682 949301 966238 981304 989254 989755 994271 1010799
13700 1010799 1026489 1049406 1056175 1064761 1070275 1075021 1089247 1105201 1114333 1114532 1113873 1127101 1150709
13687 1150709 1176069 1188647 1192032 1185007 1162516 1134666 1106391 1071864 1032073 1000567 976716 954929
13675 954929 942697 943771 959341 974108 1003800 1023757 1033722 1052551 1071535 1100819 1122396 1131981
13663 1131981 1129082 1105051 1054608 1007570 973981 963538 972673 981594 998201 1004566 1013409 1032393
13651 1032393 1032777 1041858 1058999 1075160 1094143 1108414 1112514 1120370 1132364 1145581 1156727 1165421
13639 1165421 1167345 1171468 1179611 1182648 1184450 1190397 1178572 1178041 1182461 1194357 1212057 1228857 1251666
13626 1251666 1272877 1300017 1333862 1368609 1391838 1424134 1463868 1492671 1485436 1398906 1245681
13615 1245681 1075891 944744 873708 865282 897969 940420 973628 1003875 1029715 1052466 1071891
13604 1071891 1091896 1114582 1126885 1135008 1142086 1145744 1164620 1177720 1189537 1203313 1210706 1213263
13592 1213263 1233547 1240626 1237949 1227586 1231185 1248956 1264145 1270180 1284623 1293924 1308219 1331419
13580 1331419 1344833 1360912 1385230 1423337 1469988 1508993 1538235 1545317 1469025 1317951 1148448
13569 1148448 1007402 934220 922159 955345 989029 1013492 1042450 1067400 1076975 1091047 1116715
13558 1116715 1125941 1139835 1158344 1168000 1179430 1198190 1212793 1223422 1238085 1244613 1250610 1256399
13546 1256399 1260133 1262340 1272373 1284663 1282786 1290523 1298832 1308754 1320362 1330508 1330826 1346779 1360867
13533 1360867 1387363 1405485 1406988 1416074 1432456 1434325 1415523 1364716 1309562 1261442 1222820 1231343
13521 1231343 1245885 1273176 1296188 1305056 1303054 1305395 1311749 1322250 1327084 1331170 1331783 1332813 1337722
13508 1337722 1346627 1349722 1359996 1375373 1383259 1382854 1390119 1406737 1416205 1429121 1430897 1435856 1439044
13495 1439044 1439907 1433288 1429180 1429931 1438401 1449526 1458442 1458335 1449401 1463565 1475346 1479655 1475654 1480284
13481 1480284 1493078 1501906 1512034 1524519 1525642 1538966 1538356 1526179 1519870 1525175 1536476 1551268
13469 1551268 1553192 1545836 1554411 1564437 1565067 1552320 1550458 1551432 1554588 1565076 1577849 1582385 1578043
13456 1578043 1581122 1597334 1611312 1619291 1611944 1610208 1610320 1611163 1617039 1615047 1611798 1625188 1639316
13443 1639316 1650736 1648871 1648388 1652554 1659362 1662956 1656728 1650572 1651570 1660980 1672180 1670870 1670398 1683212
13429 1683212 1688334 1695062 1703305 1703814 1708865 1718835 1719800 1724093 1717495 1728743 1741900 1745097 1742183 1740255
13415 1740255 1732735 1740424 1745193 1749913 1751361 1757084 1764330 1772519 1768756 1767990 1783182 1792183 1798378 1809200
13401 1809200 1816874 1814484 1813817 1821220 1823294 1833829 1831895 1826238 1824576 1819531 1822136 1831062 1845333 1853620
13387 1853620 1850499 1851598 1856216 1865077 1869428 1874151 1889886 1890743 1890227 1898854 1910022 1913859 1916138 1916275
13373 1916275 1921767 1925354 1944662 1945277 1948387 1956997 1955172 1953801 1956505 1962730 1962875 1966175 1969731 1977411
13359 1977411 1994761 2006815 2014488 2016877 2024385 2032972 2026701 2015710 2011785 2020582 2039288 2046781 2060952
13346 2060952 2059728 2058857 2060273 2081309 2091118 2094097 2077347 2074605 2081613 2072559 2072447 2090958 2091034 2098044
13332 2098044 2109735 2119600 2127180 2128831 2135534 2132472 2131088 2142849 2156790 2168196 2176410 2175274 2181531
13319 2181531 2175726 2174998 2187696 2196038 2196201 2199780 2204279 2207240 2219633 2228188 2234411 2233286 2233514 2227493
13305 2227493 2235781 2250018 2266717 2275666 2274701 2275538 2294536 2309047 2316421 2318670 2313888 2305784 2313249
13292 2313249 2318211 2323348 2332912 2334638 2328196 2330872 2337885 2349813 2361436 2374018 2383850 2381420 2375757
13279 2375757 2381957 2400130 2401073 2402768 2403901 2408995 2423026 2435481 2432472 2435752 2441553 2448296 2455782
13266 2455782 2476113 2499182 2510462 2514822 2515508 2525066 2525844 2540087 2556059 2564143 2579382 2596117 2612142
13253 2612142 2625102 2623860 2625941 2639213 2638760 2646863 2654320 2659096 2667910 2690280 2712250 2727284 2750900
13240 2750900 2772966 2787528 2801333 2833261 2860273 2885660 2915419 2968191 2992379 2947576 2844575
13229 2844575 2711374 2584801 2495058 2451176 2457287 2499676 2531725 2563752 2598909 2634606 2654440
13218 2654440 2661121 2679293 2699610 2726449 2750311 2770352 2800554 2817677 2829485 2851388 2860126 2870555
13206 2870555 2893844 2916161 2934379 2966103 2990608 3003005 3023213 3048730 3081176 3120287 3159350
13195 3159350 3202499 3249134 3312806 3374400 3449283 3547601 3662701 3767019 3811626 3730162 3448405
13184 3448405 3026890 2578471 2218707 2025324 2001935 2070386 2174202 2269123 2342204 2418940
13174 2418940 2486120 2534651 2576952 2618909 2664583 2695836 2740659 2779636 2802587 2829582 2867295
13163 2867295 2894250 2915021 2943057 2976604 3005876 3028652 3065114 3097182 3126792 3160279 3198340
13152 3198340 3241647 3279634 3314333 3378978 3448406 3512713 3571454 3667873 3790038 3917395 3983271
13141 3983271 3922975 3678726 3272820 2816039 2425732 2181320 2099906 2145091 2254802 2369710
13131 2369710 2473120 2543229 2601404 2649978 2681295 2728044 2771088 2808872 2838356 2870998 2898232
13120 2898232 2920312 2951220 2982646 2999872 3016990 3046039 3067946 3096604 3120056 3149220 3176762
13109 3176762 3200461 3226024 3253956 3270830 3297366 3331155 3343990 3365998 3387624 3427124 3478498
13098 3478498 3525882 3545755 3535943 3485573 3379523 3235273 3111549 3033993 3004377 3019656 3062094
13087 3062094 3104380 3139402 3179364 3211686 3238881 3258089 3277824 3308338 3332405 3339217 3350233
13076 3350233 3376386 3398672 3416283 3428947 3447130 3462364 3477508 3489510 3497185 3509794 3524592
13065 3524592 3545411 3557239 3564881 3573412 3587972 3607215 3629784 3646879 3659662 3673133 3676877 3676039
13053 3676039 3682432 3700220 3724188 3740360 3755377 3771437 3785164 3780816 3786463 3804491 3812487 3823413
13041 3823413 3834539 3849359 3864509 3883928 3889998 3888864 3899767 3905331 3924665 3951348 3973964 3995209
13029 3995209 4009270 4011072 4012569 4022465 4038335 4034407 4047690 4062561 4080559 4089905 4096992 4115473
13017 4115473 4138442 4146851 4171203 4195219 4202098 4207771 4223877 4228994 4246578 4263716 4274755 4286666
13005 4286666 4308433 4325672 4346951 4372441 4400327 4425458 4436597 4442451 4454828 4467348 4484822
12994 4484822 4497675 4525718 4566743 4608547 4643649 4662136 4680110 4692023 4705173 4734651 4757445
12983 4757445 4793837 4837168 4871639 4898919 4909947 4927327 4957628 4985228 5003095 5024607 5062738
12972 5062738 5103044 5139343 5165572 5195219 5239824 5291095 5352081 5399823 5457328 5533960 5628302
12961 5628302 5738041 5867309 6017052 6206564 6419826 6600270 6579368 6238797 5675412 5123215
12951 5123215 4710685 4580659 4763992 5033576 5116562 4856660 4325781 3756597 3310899 3088210
12941 3088210 3147465 3332013 3520818 3690079 3825213 3941507 4037106 4115572 4182427 4250400
12931 4250400 4315413 4370088 4412466 4467010 4514058 4562265 4601303 4637582 4678844 4709538 4753916
12920 4753916 4792267 4812238 4827651 4851567 4887841 4936680 4962543 4978274 5012244 5043458 5066867
12909 5066867 5085998 5111772 5143720 5180372 5194985 5204850 5219912 5235100 5252755 5274007 5300349
12898 5300349 5341198 5385194 5399080 5397289 5394442 5416267 5449691 5477052 5502972 5533540 5549455 5575725
12886 5575725 5613659 5656908 5688741 5692475 5693918 5696603 5706905 5737183 5766992 5778829 5805611 5838874
12874 5838874 5866934 5891576 5918029 5940692 5966211 6001251 6026888 6045120 6073001 6109111 6135661
12863 6135661 6163373 6188407 6219212 6243413 6255851 6269990 6288877 6310926 6335590 6363612 6386560
12852 6386560 6411955 6446294 6464936 6480779 6503993 6540976 6570179 6584989 6606405 6630744 6646514
12841 6646514 6663016 6690597 6724430 6743515 6769074 6798386 6829709 6876104 6918537 6948364 6964200
12830 6964200 6985239 7025333 7074096 7127688 7186874 7235238 7258316 7263247 7272364 7294785 7327224 7363605
12818 7363605 7385792 7418673 7443280 7467858 7499349 7526614 7555039 7583902 7612858 7638395 7662221
12807 7662221 7683987 7708473 7740394 7780999 7825638 7865374 7899085 7944699 7983331 8004790 8031776
12796 8031776 8067149 8123524 8174118 8225009 8272713 8315724 8349793 8385426 8426161 8459537 8514031
12785 8514031 8601806 8679198 8748991 8776877 8735550 8682336 8624877 8571253 8660859 8801232 8903469
12774 8903469 8941317 8910158 8827522 8757681 8706697 8778151 8901841 9002460 9068373 9121590 9130484
12763 9130484 9155361 9203416 9253967 9302509 9351247 9399283 9448331 9494599 9536913 9589922 9640674
12752 9640674 9687017 9739960 9808110 9875850 9928859 9989682 10055698 10115779 10168818 10207658 10252084
12741 10252084 10307626 10376099 10448363 10514879 10571643 10617139 10647839 10670826 10702786 10748534 10801790
12730 10801790 10856348 10897191 10932888 10958938 10983856 11020271 11061517 11122731 11210451 11298973 11380314
12719 11380314 11444563 11489391 11532427 11593893 11675063 11775268 11871422 11953301 12035419 12129917 12232484
12708 12232484 12333862 12430243 12519696 12595025 12668394 12745464 12824800 12915270 12991297 13070877 13165180
12697 13165180 13251537 13334708 13426512 13521214 13617968 13704201 13784731 13867481 13958079 14049999 14158644
12686 14158644 14270083 14393241 14511750 14602752 14663973 14696458 14725220 14777712 14868228 14992051
12676 14992051 15123413 15225381 15302481 15356168 15406733 15468217 15545654 15657416 15801286 15950782
12666 15950782 16095885 16252085 16411870 16559687 16695185 16830524 16993127 17168495 17378227
12657 17378227 17639135 17914981 18093099 17992200 17684117 17548070 17653899 17883549 18254097
12648 18254097 18696499 19005631 18990954 18725544 18582192 18667005 18857075 19146817 19483024 19768496
12638 19768496 20012302 20241311 20461764 20676188 20872384 21064309 21265207 21465427 21669544
12629 21669544 21885238 22105655 22330568 22576169 22823970 23059344 23312953 23579762 23834695
12620 23834695 24078800 24307538 24537730 24779598 25050905 25354407 25681593 26013637 26326464
12611 26326464 26629915 26925105 27221680 27534390 27862654 28220819 28590299 28965738 29324736
12602 29324736 29681144 30054339 30435748 30843730 31282377 31738340 32213502 32690770 33149638
12593 33149638 33611969 34098646 34616237 35155002 35720826 36306307 36903748 37495419 38091065
12584 38091065 38700328 39329457 39998672 40713092 41458786 42249786 43076211 43912441 44759032
12575 44759032 45607794 46500487 47439127 48440602 49521593 50662371 51846274 53103126
12567 53103126 54428961 55822340 57287160 58839728 60485625 62226548 63949041 65461593
12559 65461593 66752261 68051775 69608829 71531068 73959007 76764715 79643493 82204114
12551 82204114 84243820 86095277 88330759 91177949 94966571 99663683 104774284 109821688
12543 109821688 114581987 119453099 125134792 132010784 140439682 150376395 161355042 173276451
12535 173276451 186729210 202831196 222808047 247836029 278994694 315884191 350332219
12528 350332219 354621678 297050956 188868144 78917890 -5183976 -44499278 -19321165
12521 -19321165 35080731 67094218 34541042 -60587767 -172190551 -267713933 -330854278
12514 -330854278 -336608161 -308192048 -274834635 -245758623 -222052584 -203028378 -187626358
12507 -187626358 -174690567 -163389275 -153145474 -143636834 -135148607 -128104952 -122506976
12500 -122506976 -117763182 -113324542 -108941843 -104326496 -99641968 -95268392 -91543520 -88752025
12492 -88752025 -86757136 -85074883 -83315783 -81200044 -78675784 -75981105 -73423930 -71269752
12484 -71269752 -69659420 -68430142 -67279917 -66094805 -64737727 -63185834 -61636095 -60183315
12476 -60183315 -58804945 -57516116 -56309599 -55165491 -54080034 -53042980 -52035700 -51040649
12468 -51040649 -50063776 -49119159 -48214262 -47331472 -46473433 -45654018 -44841442 -44049491 -43272680
12459 -43272680 -42525360 -41800542 -41092068 -40425328 -39798784 -39205712 -38632095 -38060883 -37503210
12450 -37503210 -36949562 -36403280 -35880457 -35395671 -34936586 -34484078 -34031745 -33585418 -33137401
12441 -33137401 -32705289 -32281574 -31878830 -31501446 -31138531 -30785520 -30431920 -30074427 -29712068
12432 -29712068 -29357935 -29029759 -28714533 -28417419 -28143180 -27854982 -27544900 -27227380 -26933116
12423 -26933116 -26677462 -26429147 -26175418 -25928696 -25686623 -25431428 -25173107 -24921312 -24689710
12414 -24689710 -24483517 -24275960 -24059544 -23844503 -23641273 -23445012 -23249799 -23070904 -22888894
12405 -22888894 -22713328 -22550071 -22379888 -22183464 -21941786 -21728066 -21611255 -21521090 -21385925
12396 -21385925 -21209764 -21006359 -20800451 -20564735 -20345741 -20230694 -20154612 -20036684 -19868098
12387 -19868098 -19668541 -19495796 -19361537 -19237287 -19102495 -18975780 -18846684 -18726464 -18624841
12378 -18624841 -18531423 -18443378 -18359358 -18270265 -18168381 -18053457 -17899840 -17715831 -17528918 -17354753
12368 -17354753 -17216822 -17121087 -17047752 -16955716 -16836007 -16680210 -16494881 -16322491 -16185534 -16080091
12358 -16080091 -16003104 -15938963 -15882548 -15816177 -15737025 -15654395 -15572752 -15487121 -15387413 -15304377 -15231608
12347 -15231608 -15155297 -15080478 -14997314 -14909130 -14825018 -14753574 -14676349 -14592888 -14514507 -14431837 -14363753
12336 -14363753 -14298470 -14244599 -14196767 -14156964 -14114466 -14073177 -14015879 -13974576 -13943368 -13891299 -13821027
12325 -13821027 -13736858 -13661693 -13584233 -13517067 -13464430 -13414547 -13357589 -13283270 -13190211 -13094079 -12999088
12314 -12999088 -12906374 -12832207 -12757936 -12688674 -12623348 -12552423 -12473510 -12398088 -12333520 -12288840 -12248580
12303 -12248580 -12203370 -12153033 -12112047 -12061977 -12002919 -11953671 -11900201 -11867124 -11829478 -11791462 -11756374
12292 -11756374 -11719311 -11678460 -11626686 -11578545 -11530278 -11488941 -11453119 -11412165 -11351716 -11285217 -11233350
12281 -11233350 -11183251 -11145856 -11108698 -11054462 -10999299 -10946656 -10903211 -10870738 -10833284 -10781049 -10729380
12270 -10729380 -10678042 -10629761 -10609893 -10603462 -10583337 -10544329 -10504493 -10463200 -10417578 -10370592 -10337121
12259 -10337121 -10306547 -10273515 -10247353 -10219582 -10185492 -10158751 -10132081 -10109080 -10080305 -10051520 -10012393
12248 -10012393 -9981715 -9955028 -9917900 -9878276 -9844958 -9798472 -9752212 -9721236 -9701065 -9672862 -9636692
12237 -9636692 -9604265 -9568013 -9531296 -9498995 -9461623 -9429857 -9404955 -9385434 -9341849 -9290697 -9242376
12226 -9242376 -9196266 -9165408 -9130475 -9094706 -9055493 -9014621 -8977621 -8944844 -8923766 -8904285 -8891639
12215 -8891639 -8879963 -8865258 -8844541 -8813938 -8766490 -8721989 -8711377 -8719078 -8728115 -8731961 -8725449 -8696066
12203 -8696066 -8647556 -8611206 -8583583 -8553285 -8521831 -8493824 -8472137 -8452876 -8420229 -8381176 -8352466
12192 -8352466 -8327715 -8302249 -8261957 -8229523 -8199978 -8173807 -8148886 -8115343 -8084450 -8068856 -8040858
12181 -8040858 -8003865 -7977156 -7969891 -7965458 -7948250 -7923292 -7883822 -7849853 -7824045 -7808887 -7792222 -7764390
12169 -7764390 -7736778 -7715699 -7686934 -7658554 -7626276 -7599236 -7579631 -7566344 -7558710 -7551037 -7519042 -7477453
12157 -7477453 -7444698 -7411220 -7392822 -7351347 -7313911 -7298408 -7292246 -7287201 -7255779 -7217398 -7188865 -7153677
12145 -7153677 -7109726 -7073489 -7037877 -7005880 -6959256 -6910119 -6854019 -6804046 -6772314 -6744977 -6721932
12134 -6721932 -6718306 -6731454 -6766610 -6812324 -6884256 -6953674 -7001247 -7035122 -7048655 -7057528 -7043651 -7013468
12122 -7013468 -6970615 -6920174 -6871553 -6822529 -6775425 -6739743 -6705898 -6659449 -6617304 -6572325 -6522124
12111 -6522124 -6473225 -6425393 -6378908 -6342825 -6295296 -6236624 -6167772 -6101044 -6033729 -5950903 -5848822
12100 -5848822 -5736972 -5596194 -5424260 -5219651 -4996925 -4857710 -4984020 -5434296 -6034005
12091 -6034005 -6539446 -6855821 -6861435 -6612582 -6377460 -6403560 -6787056 -7360064 -7906390 -8302302
12081 -8302302 -8415713 -8298380 -8103230 -7911579 -7741898 -7610524 -7501917 -7405171 -7327464 -7255874
12071 -7255874 -7176251 -7116817 -7071772 -7033525 -6989126 -6949926 -6909341 -6861405 -6815214 -6774547 -6743517
12060 -6743517 -6721647 -6712455 -6692990 -6663494 -6632701 -6608699 -6578038 -6561669 -6554099 -6545476 -6536108 -6522211
12048 -6522211 -6503461 -6480183 -6457127 -6437577 -6416792 -6402850 -6386699 -6364581 -6342219 -6310785 -6294618
12037 -6294618 -6278033 -6266800 -6261883 -6252514 -6247906 -6226615 -6207876 -6183328 -6161603 -6141867 -6130032 -6124785
12025 -6124785 -6109275 -6095379 -6075727 -6061046 -6055822 -6043851 -6039815 -6035254 -6012820 -6000529 -5979106 -5969994
12013 -5969994 -5957578 -5942698 -5933517 -5916756 -5893987 -5875850 -5860105 -5848907 -5843904 -5826705 -5815740 -5802998
12001 -5802998 -5788267 -5769958 -5761517 -5757350 -5759965 -5745497 -5729074 -5709564 -5694370 -5683093 -5670190 -5668342
11989 -5668342 -5664687 -5664486 -5665056 -5660601 -5635889 -5604815 -5592456 -5581724 -5573973 -5564381 -5558362 -5550300 -5536568
11976 -5536568 -5527532 -5527419 -5520282 -5507327 -5497284 -5494492 -5479467 -5471885 -5466724 -5454729 -5447021 -5433510 -5420810
11963 -5420810 -5414293 -5401281 -5376716 -5369080 -5369386 -5360717 -5349554 -5339490 -5318822 -5300545 -5291813 -5291104 -5292184
11950 -5292184 -5279864 -5280107 -5279397 -5273616 -5260619 -5243094 -5235967 -5220895 -5228750 -5219414 -5212168 -5201948 -5185413
11937 -5185413 -5175666 -5158861 -5160454 -5162757 -5165035 -5154786 -5148252 -5128959 -5115070 -5102313 -5102675 -5102468 -5101457
11924 -5101457 -5093465 -5083568 -5069204 -5061199 -5053847 -5044191 -5038434 -5026094 -5005068 -4992752 -4990631 -4990840 -4979483
11911 -4979483 -4977441 -4976685 -4966119 -4961338 -4942101 -4925931 -4914728 -4912704 -4908353 -4902827 -4894055 -4875998 -4864957
11898 -4864957 -4852664 -4838032 -4831741 -4828523 -4822555 -4817098 -4812241 -4814927 -4815175 -4804238 -4790488 -4794049 -4789148
11885 -4789148 -4778805 -4771245 -4764990 -4759034 -4748443 -4739181 -4740291 -4741724 -4741649 -4738805 -4738697 -4728149 -4711843 -4706160
11871 -4706160 -4697917 -4678793 -4669323 -4653722 -4661104 -4658163 -4642480 -4631651 -4623060 -4623310 -4625286 -4616554 -4606768
11858 -4606768 -4598867 -4599197 -4594108 -4585749 -4569940 -4566020 -4564370 -4561227 -4556802 -4549971 -4551045 -4546081 -4533482 -4518778
11844 -4518778 -4509792 -4504670 -4505167 -4504813 -4499604 -4495572 -4477026 -4459118 -4451232 -4455233 -4456140 -4453460 -4452272 -4451181
11830 -4451181 -4434860 -4415590 -4420496 -4426800 -4423643 -4423794 -4430176 -4412756 -4388114 -4381281 -4378048 -4373791 -4377576
11817 -4377576 -4369954 -4347794 -4344550 -4331331 -4319419 -4330630 -4322727 -4313700 -4313227 -4310739 -4309479 -4300426 -4295390
11804 -4295390 -4286319 -4285538 -4275883 -4263411 -4265139 -4257877 -4260959 -4265791 -4258680 -4246622 -4233968 -4227489 -4222920
11791 -4222920 -4227231 -4222903 -4215134 -4213211 -4205455 -4198561 -4194577 -4180532 -4174576 -4163422 -4163449 -4170717 -4163254 -4148295
11777 -4148295 -4139787 -4134524 -4137797 -4131841 -4125743 -4120798 -4119675 -4116258 -4119368 -4105677 -4100035 -4099983 -4097912 -4100504
11763 -4100504 -4092874 -4076287 -4064056 -4061212 -4054822 -4052727 -4056844 -4058829 -4050754 -4040641 -4030888 -4025549 -4020268
11750 -4020268 -4018684 -4007779 -4002043 -3991620 -3986581 -3975297 -3976803 -3983835 -3982307 -3975435 -3970371 -3970884 -3956726
11737 -3956726 -3937323 -3924495 -3935676 -3936116 -3941581 -3937832 -3929720 -3925225 -3917472 -3906209 -3895684 -3893076 -3898046
11724 -3898046 -3897348 -3895088 -3878925 -3872371 -3872965 -3874299 -3870312 -3867390 -3864209 -3854227 -3849708 -3853154 -3848293 -3848312 -3857836
11709 -3857836 -3864897 -3861659 -3858882 -3845448 -3832553 -3816987 -3816985 -3819246 -3825955 -3822375 -3812019 -3796776 -3795624
11696 -3795624 -3793936 -3782955 -3776015 -3770573 -3761819 -3755275 -3756991 -3762862 -3763677 -3759227 -3748611 -3743311 -3734769 -3734335
11682 -3734335 -3737525 -3727357 -3716895 -3711645 -3711718 -3715862 -3704579 -3694110 -3687399 -3682275 -3684834 -3677698 -3685532
11669 -3685532 -3697221 -3693356 -3688546 -3677591 -3669117 -3666757 -3655959 -3656356 -3653055 -3648494 -3646687 -3643256 -3634483
11656 -3634483 -3636003 -3630051 -3631972 -3631214 -3626154 -3624890 -3619950 -3611173 -3610902 -3616534 -3609384 -3614722 -3610201 -3602527
11642 -3602527 -3589267 -3571123 -3558918 -3561702 -3553364 -3547764 -3547343 -3552292 -3541810 -3530932 -3533715 -3527281 -3538584
11629 -3538584 -3530282 -3524056 -3523882 -3521202 -3520217 -3521340 -3513879 -3507342 -3499649 -3507729 -3507301 -3506094 -3497242 -3489427 -3491733
11614 -3491733 -3486613 -3476709 -3479904 -3471891 -3454123 -3451673 -3459477 -3468477 -3470843 -3464720 -3458834 -3446544 -3443377
11601 -3443377 -3444037 -3442352 -3437281 -3436579 -3432150 -3436765 -3437507 -3434072 -3423992 -3415989 -3403523 -3385080 -3393609 -3393501
11587 -3393501 -3390450 -3393503 -3389591 -3385120 -3382599 -3372726 -3371072 -3361716 -3345404 -3341755 -3352401 -3361884 -3358917
11574 -3358917 -3355579 -3348948 -3352650 -3347529 -3343402 -3347323 -3342505 -3337631 -3336355 -3329433 -3317418 -3312448 -3302488 -3290145
11560 -3290145 -3298353 -3307403 -3298936 -3297300 -3302629 -3300075 -3291138 -3283418 -3283130 -3292868 -3291530 -3280458 -3280507 -3288563
11546 -3288563 -3291640 -3287124 -3283915 -3283459 -3284092 -3270073 -3258795 -3250885 -3237413 -3234666 -3236079 -3235153 -3233039 -3229456
11532 -3229456 -3233823 -3227745 -3224263 -3223486 -3225502 -3220342 -3204596 -3196649 -3197063 -3199118 -3205881 -3195818 -3184608 -3181588
11518 -3181588 -3173231 -3167375 -3168309 -3166838 -3167648 -3165661 -3165507 -3168041 -3174140 -3174525 -3169510 -3162065 -3162492 -3162491 -3161257 -3154756
11502 -3154756 -3146310 -3137573 -3132156 -3121476 -3115636 -3116939 -3113658 -3115943 -3115939 -3118554 -3116300 -3110478 -3101002 -3103485
11488 -3103485 -3103787 -3105125 -3099752 -3105976 -3112315 -3100169 -3090437 -3086438 -3087946 -3081902 -3075488 -3074235 -3072688 -3075414
11474 -3075414 -3065620 -3060886 -3058131 -3053583 -3055841 -3046763 -3043142 -3045222 -3041208 -3045541 -3039409 -3040674 -3038225 -3037027
11460 -3037027 -3036524 -3032449 -3019827 -3010059 -3007960 -3008685 -3002496 -3003740 -3003348 -3003965 -2995586 -2992403 -2993264 -3002751 -2994826
11445 -2994826 -2986833 -2985444 -2982378 -2971347 -2963625 -2967027 -2968107 -2968098 -2973148 -2977830 -2972821 -2964435 -2957907 -2956724
11431 -2956724 -2957043 -2957609 -2956830 -2959226 -2957265 -2946550 -2945011 -2949103 -2960516 -2955431 -2949294 -2943225 -2938556 -2932635
11417 -2932635 -2931431 -2927340 -2925162 -2927839 -2921243 -2920172 -2907679 -2897353 -2897157 -2899286 -2901892 -2893363 -2901041 -2900835
11403 -2900835 -2894055 -2889202 -2878544 -2868811 -2858687 -2850691 -2854495 -2869874 -2866038 -2863593 -2856763 -2856652 -2863379
11390 -2863379 -2861618 -2853507 -2846260 -2842629 -2842820 -2846135 -2842457 -2832097 -2830234 -2832811 -2826433 -2816336 -2822502 -2825632
11376 -2825632 -2824990 -2815482 -2810706 -2803809 -2799214 -2807397 -2819371 -2812468 -2798501 -2794250 -2791777 -2786411 -2780643 -2766500
11362 -2766500 -2769714 -2786549 -2794122 -2787656 -2788800 -2787189 -2778412 -2769636 -2769763 -2774747 -2774985 -2774355 -2770819 -2769337
11348 -2769337 -2773072 -2772477 -2760666 -2747125 -2750255 -2755881 -2751701 -2749639 -2751447 -2742600 -2734063 -2725083 -2728311 -2726353
11334 -2726353 -2722362 -2722421 -2713689 -2714012 -2716675 -2696140 -2690833 -2692385 -2693307 -2685044 -2688756 -2688688 -2688071 -2693384 -2696716
11319 -2696716 -2689751 -2685934 -2684351 -2677086 -2677703 -2684437 -2681962 -2677348 -2666594 -2666880 -2669092 -2670125 -2669624 -2665781
11305 -2665781 -2659499 -2656322 -2646458 -2635537 -2624721 -2626410 -2626808 -2634654 -2648251 -2649335 -2632904 -2627066 -2629769
11292 -2629769 -2622371 -2617744 -2611166 -2601066 -2607616 -2612074 -2611841 -2597975 -2593982 -2617143 -2625923 -2628373 -2641589
11279 -2641589 -2638819 -2636326 -2628067 -2626050 -2614602 -2606189 -2604651 -2609038 -2603253 -2603717 -2610311 -2610156 -2609315 -2605840
11265 -2605840 -2597416 -2591505 -2587104 -2585870 -2585447 -2577636 -2573220 -2559481 -2556868 -2557219 -2551173 -2549935 -2541048 -2535190
11251 -2535190 -2532623 -2525829 -2518281 -2522059 -2524980 -2510605 -2495368 -2497533 -2499857 -2479604 -2464421 -2467963 -2477170
11238 -2477170 -2487369 -2500125 -2512169 -2518920 -2532978 -2542862 -2555087 -2564747 -2573384 -2592333 -2597809 -2590233
11226 -2590233 -2566647 -2559908 -2555692 -2549782 -2539203 -2534692 -2536487 -2538764 -2540838 -2538258 -2532490 -2525052 -2513020
11213 -2513020 -2506514 -2497132 -2499794 -2503059 -2509102 -2507005 -2500816 -2490514 -2489542 -2485297 -2478163 -2466092 -2462081 -2463578
11199 -2463578 -2471072 -2474810 -2467084 -2458913 -2455721 -2453137 -2441368 -2437792 -2443291 -2451735 -2466163 -2480259 -2499379
11186 -2499379 -2502523 -2504445 -2509884 -2508487 -2498863 -2504384 -2500765 -2486243 -2477210 -2475505 -2475090 -2457359 -2448858 -2449885
11172 -2449885 -2450945 -2446099 -2444071 -2446078 -2446621 -2441622 -2437353 -2429303 -2422254 -2429836 -2430589 -2426912 -2426914 -2431760 -2419737
11157 -2419737 -2415683 -2414805 -2423359 -2413780 -2405626 -2398060 -2393903 -2392929 -2395140 -2395733 -2388183 -2390047 -2396679 -2396187 -2393978
11142 -2393978 -2396397 -2395836 -2388806 -2382920 -2388539 -2382108 -2366508 -2379018 -2377442 -2377937 -2374353 -2375763 -2373634 -2363385
11128 -2363385 -2366267 -2361017 -2354072 -2351975 -2345019 -2334964 -2345428 -2351970 -2350362 -2350630 -2339649 -2329712 -2326568
11115 -2326568 -2333493 -2345619 -2347404 -2347893 -2346943 -2338772 -2337901 -2328205 -2322234 -2325021 -2317967 -2309380 -2302215 -2299394
11101 -2299394 -2296180 -2301569 -2303796 -2300407 -2298455 -2294671 -2296532 -2297870 -2295816 -2294081 -2288729 -2285549 -2301078 -2312488
11087 -2312488 -2302812 -2295516 -2300750 -2299075 -2294846 -2293566 -2292981 -2287727 -2282849 -2270218 -2265489 -2263219 -2272063 -2280217
11073 -2280217 -2279770 -2270210 -2263577 -2264901 -2261809 -2255066 -2250613 -2249997 -2259427 -2265060 -2266885 -2264532 -2259674 -2253959
11059 -2253959 -2250460 -2240490 -2235810 -2233393 -2230149 -2236354 -2235617 -2231981 -2223697 -2225470 -2223250 -2219562 -2211976 -2222228
11045 -2222228 -2223739 -2215513 -2216689 -2216235 -2211578 -2207302 -2213847 -2214756 -2205754 -2197860 -2200034 -2194411 -2198405 -2198391 -2194395
11030 -2194395 -2195588 -2195014 -2186604 -2184460 -2188465 -2184859 -2180873 -2171818 -2156636 -2158584 -2170007 -2180665 -2182148
11017 -2182148 -2181018 -2173604 -2167273 -2166959 -2155674 -2148656 -2156610 -2159462 -2155517 -2154529 -2157633 -2163771 -2159959 -2156553
11003 -2156553 -2142530 -2137826 -2137317 -2137582 -2133842 -2130957 -2128261 -2128629 -2130748 -2118150 -2119076 -2120429 -2110422 -2115445
10989 -2115445 -2116703 -2110026 -2107367 -2109597 -2118111 -2121011 -2118159 -2115704 -2114107 -2111497 -2106351 -2104473 -2098342 -2091218
10975 -2091218 -2095561 -2102126 -2092231 -2083792 -2083603 -2081093 -2079017 -2067346 -2075931 -2078650 -2074542 -2074462 -2076300 -2066340
10961 -2066340 -2058497 -2062052 -2061350 -2056152 -2052850 -2051614 -2055453 -2055699 -2056051 -2054752 -2046285 -2042687 -2037594 -2028751 -2034749
10946 -2034749 -2039653 -2038614 -2029434 -2024449 -2014814 -2010922 -2011113 -2019053 -2021025 -2019918 -2019616 -2018912 -2011163 -2008326 -2006612
10931 -2006612 -2000707 -1996189 -2005494 -2007058 -2000843 -1999208 -2000120 -1998466 -1990785 -1990858 -1990562 -1978705 -1976086 -1984036 -1989218
10916 -1989218 -1981498 -1969803 -1965199 -1960047 -1962579 -1960203 -1955059 -1953440 -1954566 -1956420 -1959500 -1946945 -1948098
10903 -1948098 -1949665 -1953653 -1951335 -1938718 -1939793 -1947057 -1939955 -1931962 -1930582 -1922169 -1916369 -1914998 -1914030 -1916878
10889 -1916878 -1915976 -1910596 -1910701 -1909169 -1906376 -1892280 -1891187 -1894239 -1889952 -1882652 -1872167 -1875197 -1877034 -1870279
10875 -1870279 -1863910 -1872526 -1871003 -1860742 -1855318 -1853737 -1849813 -1839104 -1831749 -1828120 -1832733 -1828729 -1807598
10862 -1807598 -1797281 -1792577 -1795814 -1794695 -1801866 -1801787 -1808663 -1809983 -1806477 -1808869 -1810298 -1807289 -1806348 -1816645
10848 -1816645 -1828180 -1825745 -1816377 -1810554 -1822698 -1827259 -1832139 -1837633 -1839854 -1835318 -1842409 -1842009 -1824772
10835 -1824772 -1814719 -1808361 -1803101 -1799319 -1787546 -1775645 -1769664 -1762053 -1760330 -1760344 -1760093 -1758780 -1755296 -1754873
10821 -1754873 -1739374 -1718237 -1701118 -1691415 -1678254 -1667000 -1644958 -1620562 -1605492 -1608968 -1619557 -1627109
10809 -1627109 -1649259 -1665822 -1671321 -1680382 -1694498 -1691127 -1679529 -1665389 -1660134 -1676359 -1698178 -1728443
10797 -1728443 -1766399 -1795026 -1807477 -1828019 -1845233 -1850856 -1857453 -1861551 -1847801 -1844883 -1835306 -1813729
10785 -1813729 -1796155 -1782700 -1765446 -1737191 -1707804 -1695122 -1696072 -1696612 -1681818 -1668161 -1654977 -1640240
10773 -1640240 -1622589 -1592574 -1568119 -1531332 -1484294 -1425587 -1357174 -1298691 -1233828 -1154664 -1078015
10762 -1078015 -1080159 -1235892 -1544789 -1869596 -2128950 -2270429 -2278223 -2213951 -2157044 -2123966 -2103971
10751 -2103971 -2090635 -2090608 -2109173 -2125001 -2134114 -2141894 -2153750 -2163328 -2170279 -2169216 -2158655 -2159285 -2145562
10738 -2145562 -2114665 -2095315 -2081420 -2054594 -2033025 -2024027 -2010604 -1999887 -1991539 -1988892 -1969636 -1945542
10726 -1945542 -1932767 -1916247 -1906469 -1894500 -1883910 -1875987 -1847500 -1832116 -1830781 -1838624 -1839520 -1839098 -1843424
10713 -1843424 -1849414 -1846484 -1848154 -1842461 -1834858 -1819707 -1808951 -1811649 -1812167 -1812940 -1823833 -1847684 -1864651
10700 -1864651 -1864989 -1861886 -1873496 -1875385 -1871250 -1866973 -1860266 -1858979 -1851382 -1839704 -1824146 -1804684 -1776988
10687 -1776988 -1756278 -1724649 -1685067 -1649463 -1635891 -1631012 -1647086 -1686187 -1733317 -1780573 -1857037
10676 -1857037 -1943266 -2008197 -2075013 -2127543 -2158371 -2175963 -2171155 -2145971 -2123356 -2104945 -2096300 -2069228
10664 -2069228 -2043298 -2024944 -2005405 -1986610 -1975713 -1973104 -1973398 -1971691 -1969625 -1966099 -1954671 -1953982 -1945628
10651 -1945628 -1942408 -1940564 -1937376 -1935891 -1926680 -1908280 -1908208 -1898528 -1899409 -1904099 -1909509 -1904108 -1900481 -1899912 -1904777
10636 -1904777 -1901898 -1885670 -1869578 -1862173 -1872512 -1872088 -1850300 -1845010 -1831743 -1809951 -1799584 -1810854
10624 -1810854 -1818621 -1813637 -1813894 -1817494 -1821723 -1818532 -1807681 -1805750 -1816592 -1823778 -1825585 -1823832 -1825526 -1818614
10610 -1818614 -1815925 -1807910 -1793138 -1789053 -1788856 -1783921 -1774831 -1766042 -1763393 -1770885 -1763897 -1762122 -1761731 -1753801
10596 -1753801 -1751743 -1744391 -1738918 -1740901 -1734221 -1735096 -1739224 -1737194 -1735002 -1717660 -1703995 -1693791 -1695922
10583 -1695922 -1704111 -1705842 -1706775 -1702801 -1706007 -1696031 -1691606 -1691224 -1697497 -1690648 -1685467 -1673798 -1671194 -1675579
10569 -1675579 -1684276 -1685832 -1687762 -1681353 -1676304 -1675492 -1670291 -1668704 -1663599 -1662775 -1652083 -1646131 -1654328 -1655234
10555 -1655234 -1645742 -1645358 -1634463 -1626297 -1621263 -1610672 -1603485 -1608250 -1610320 -1615790 -1620370 -1623357 -1621794 -1616600
10541 -1616600 -1622315 -1621387 -1612580 -1615150 -1612062 -1616027 -1615916 -1619774 -1619000 -1602538 -1587400 -1583685 -1592029 -1595470
10527 -1595470 -1596116 -1592593 -1588850 -1586703 -1578825 -1572383 -1568790 -1576399 -1577938 -1563589 -1554601 -1547608 -1544189 -1547056
10513 -1547056 -1543356 -1538528 -1538485 -1535408 -1534220 -1537344 -1544176 -1546672 -1558578 -1562848 -1564361 -1554997 -1553909 -1555121
10499 -1555121 -1546591 -1543969 -1544767 -1542515 -1537431 -1531155 -1531280 -1531479 -1518286 -1518714 -1520050 -1513220 -1502874 -1489813
10485 -1489813 -1488214 -1486315 -1488931 -1491585 -1486874 -1479863 -1478229 -1472638 -1466354 -1464448 -1464776 -1465600 -1462568 -1458890
10471 -1458890 -1453879 -1443194 -1438352 -1432201 -1429618 -1429720 -1429920 -1424178 -1418315 -1408611 -1407829 -1415293 -1412011 -1418575
10457 -1418575 -1422768 -1425896 -1436661 -1442612 -1445040 -1438370 -1430606 -1427605 -1422962 -1419713 -1415335 -1405193 -1398210
10444 -1398210 -1398431 -1387332 -1378077 -1368324 -1373495 -1377766 -1378740 -1368478 -1364455 -1354016 -1349248 -1343959 -1341031 -1339849
10430 -1339849 -1343205 -1339999 -1329558 -1326517 -1324026 -1322812 -1314395 -1309730 -1304802 -1302679 -1296201 -1287394 -1282713 -1286415
10416 -1286415 -1275923 -1260794 -1252252 -1249636 -1239494 -1231590 -1236423 -1237609 -1234756 -1230304 -1230523 -1231071 -1225481 -1218495
10402 -1218495 -1215383 -1217945 -1209783 -1201016 -1185741 -1178106 -1171679 -1170727 -1162985 -1162881 -1154232 -1143113 -1136373 -1118066
10388 -1118066 -1103548 -1098134 -1090778 -1076890 -1066488 -1056110 -1031654 -1015735 -1002824 -987695 -966134 -944862
10376 -944862 -935862 -905631 -870222 -841472 -817376 -808088 -817332 -825831 -857990 -904339 -977240 -1046979
10364 -1046979 -1116473 -1175018 -1210906 -1226941 -1232251 -1225121 -1206858 -1181444 -1145583 -1110574 -1078989 -1041850
10352 -1041850 -1012692 -1000202 -981001 -954820 -930046 -908381 -875781 -853798 -833109 -797757 -766350
10341 -766350 -741044 -699080 -638438 -577179 -521823 -475209 -443673 -434660 -448895 -502162 -589707 -688519
10329 -688519 -795415 -918096 -1049466 -1176314 -1274921 -1350474 -1396427 -1426789 -1433107 -1410102 -1376770
10318 -1376770 -1342815 -1292226 -1229416 -1172199 -1118358 -1048704 -980819 -925097 -866493 -802631 -755873
10307 -755873 -727487 -714263 -737676 -806807 -905366 -1002991 -1096083 -1153475 -1176468 -1172866 -1135177 -1080748
10295 -1080748 -1025946 -970884 -902470 -845584 -791719 -735833 -684963 -626833 -562609 -483366 -408176
10284 -408176 -327064 -257411 -206606 -181585 -195704 -266615 -374186 -500425 -611981 -690367 -714865
10273 -714865 -692127 -646379 -570159 -489612 -431410 -367479 -294249 -184123 -61879 52941 160278
10262 160278 260176 336166 372758 348050 285955 190770 60410 -65009 -194523 -325278 -450732
10251 -450732 -554637 -643244 -753867 -898106 -1050298 -1223228 -1476066 -1821817 -2198708 -2570883
10241 -2570883 -2954504 -3314781 -3632577 -3849294 -3977792 -3997863 -3937318 -3827032 -3690516 -3518582
10231 -3518582 -3342353 -3177435 -3045251 -2937078 -2835881 -2752087 -2681430 -2623372 -2566390 -2512179
10221 -2512179 -2465323 -2411020 -2356460 -2294395 -2235442 -2205446 -2169365 -2125974 -2086776 -2050323 -2033678
10210 -2033678 -2021350 -2006046 -1987018 -1962899 -1944037 -1923688 -1894574 -1875241 -1850729 -1826403 -1802370
10199 -1802370 -1766334 -1728171 -1683751 -1655590 -1624442 -1598432 -1570194 -1536290 -1511216 -1499474 -1484388
10188 -1484388 -1468120 -1461456 -1460698 -1460371 -1460020 -1457877 -1447020 -1434329 -1417793 -1393886 -1363084 -1336750 -1308148
10175 -1308148 -1266822 -1216526 -1158245 -1091296 -1024196 -957357 -877100 -798419 -716162 -621482 -512020
10164 -512020 -395233 -274165 -149251 -23746 72112 128978 140499 102535 27888 -79027
10154 -79027 -218761 -377275 -534664 -701779 -905412 -1187602 -1545527 -1928132 -2288403 -2564497
10144 -2564497 -2734813 -2835345 -2921128 -2999806 -3097886 -3208460 -3309142 -3401641 -3467895 -3498217
10134 -3498217 -3503037 -3475005 -3432518 -3370759 -3281668 -3193436 -3105933 -3017339 -2937752 -2860277 -2792773
10123 -2792773 -2729088 -2666370 -2606186 -2548392 -2497328 -2456833 -2408815 -2359073 -2329588 -2297454 -2260793
10112 -2260793 -2225607 -2200534 -2206757 -2249425 -2316830 -2385763 -2414949 -2407907 -2381899 -2350261 -2312215 -2285850
10100 -2285850 -2256282 -2220316 -2193667 -2168118 -2148672 -2129009 -2103524 -2093825 -2089486 -2076972 -2065401 -2054579
10088 -2054579 -2035812 -2019530 -1994105 -1964085 -1949941 -1947447 -1934450 -1918631 -1899604 -1882639 -1869326
10077 -1869326 -1842335 -1828186 -1811817 -1786617 -1764885 -1759078 -1746307 -1719304 -1678457 -1641807 -1599249
10066 -1599249 -1564031 -1523617 -1496746 -1487138 -1485933 -1501487 -1543097 -1617475 -1704430 -1796919 -1892351 -1974805
10054 -1974805 -2031701 -2074447 -2104409 -2103765 -2092045 -2094959 -2081400 -2057347 -2042228 -2023330 -1990986 -1966058
10042 -1966058 -1949114 -1921875 -1893391 -1881034 -1862036 -1852952 -1847182 -1833975 -1823790 -1817085 -1808677 -1795770
10030 -1795770 -1802318 -1785027 -1771537 -1759763 -1740651 -1735017 -1724960 -1715950 -1710142 -1706119 -1692502 -1684174
10018 -1684174 -1679306 -1661718 -1658310 -1660420 -1655602 -1640956 -1631846 -1617163 -1608260 -1600773 -1592058 -1589125 -1582435
10005 -1582435 -1590196 -1587787 -1582582 -1576288 -1577716 -1588436 -1607210 -1608496 -1607198 -1604985 -1599440 -1589865 -1597027
9992 -1597027 -1600535 -1605140 -1606586 -1601085 -1599282 -1595480 -1588248 -1582364 -1585473 -1586281 -1573670 -1556936 -1544440 -1545313
9978 -1545313 -1541331 -1541238 -1531905 -1516236 -1509860 -1497738 -1485791 -1484076 -1481609 -1474325 -1461673 -1454196 -1455272 -1455208
9964 -1455208 -1450744 -1442822 -1432781 -1417245 -1410447 -1408128 -1406580 -1400157 -1395573 -1396708 -1387477 -1381022 -1376909 -1371822
9950 -1371822 -1369923 -1366988 -1354774 -1342573 -1336852 -1332862 -1322612 -1313801 -1299936 -1286353 -1279576 -1273514 -1265922
9937 -1265922 -1269369 -1261424 -1255247 -1253468 -1255474 -1254638 -1249375 -1232272 -1211529 -1198221 -1176469 -1169754 -1162628
9924 -1162628 -1152147 -1132795 -1109568 -1083437 -1055636 -1027299 -1002124 -977140 -950688 -932781 -939647 -984037
9912 -984037 -1045593 -1102244 -1151386 -1159041 -1139036 -1109356 -1079027 -1057640 -1022159 -974875 -937144 -905527
9900 -905527 -864449 -816487 -792077 -771023 -738781 -691367 -641315 -608534 -564014 -517673 -468948 -417388
9888 -417388 -348960 -263093 -164356 -52104 79430 232260 403921 616977 886243 1228393
9878 1228393 1666887 2202642 2755884 3044387 2521003 925448 -1328990 -3528500 -5107054
9869 -5107054 -5762870 -5630620 -5153219 -4667063 -4260456 -3948633 -3694253 -3474022 -3283755 -3125991
9859 -3125991 -2997556 -2900213 -2808621 -2729091 -2662109 -2596636 -2535072 -2476296 -2430891 -2398928 -2370840
9848 -2370840 -2356477 -2334532 -2294275 -2255342 -2233247 -2216151 -2200921 -2184446 -2164218 -2150040 -2130982
9837 -2130982 -2104013 -2078336 -2069082 -2056514 -2035660 -2014495 -1997128 -1984558 -1976849 -1963547 -1939463 -1928288
9825 -1928288 -1917769 -1911565 -1908191 -1896184 -1887150 -1880367 -1868139 -1849276 -1840506 -1829315 -1808710 -1793682
9813 -1793682 -1784930 -1770498 -1756203 -1749808 -1753488 -1744868 -1731154 -1726550 -1720113 -1710954 -1704035 -1701862 -1698370
9800 -1698370 -1695835 -1694753 -1695339 -1698427 -1695951 -1688791 -1673338 -1672244 -1676194 -1668399 -1660396 -1665444 -1663321 -1655987
9786 -1655987 -1646566 -1642325 -1639489 -1631074 -1624994 -1612889 -1603632 -1600912 -1597552 -1594441 -1593321 -1592988 -1584228 -1576938
9772 -1576938 -1570300 -1569044 -1569389 -1572346 -1561708 -1563175 -1577947 -1577013 -1573003 -1558044 -1534296 -1530528 -1531925 -1531198
9758 -1531198 -1529440 -1522274 -1509327 -1502394 -1505619 -1496159 -1498214 -1503955 -1507607 -1499679 -1492992 -1495137 -1507593 -1518935
9744 -1518935 -1516489 -1510006 -1511433 -1505485 -1500279 -1504350 -1503384 -1500357 -1490185 -1489782 -1487519 -1484382 -1480478 -1472497
9730 -1472497 -1466130 -1469526 -1467987 -1467922 -1478852 -1487510 -1477730 -1465256 -1451902 -1454075 -1460216 -1461808 -1452267 -1444117
9716 -1444117 -1431143 -1431985 -1430578 -1427376 -1432193 -1427916 -1421867 -1422688 -1428357 -1429514 -1429959 -1423395 -1418582 -1426865 -1422332
9701 -1422332 -1413446 -1412431 -1422779 -1416886 -1411807 -1403660 -1397755 -1392075 -1397476 -1404669 -1396793 -1395068 -1385423 -1378049
9687 -1378049 -1382603 -1391546 -1387976 -1384186 -1385482 -1384134 -1376548 -1361023 -1360274 -1362105 -1358959 -1360060 -1351305 -1341551
9673 -1341551 -1340147 -1343974 -1360130 -1362888 -1357503 -1350834 -1345820 -1341811 -1334089 -1328939 -1330090 -1335179 -1341313 -1332151
9659 -1332151 -1320933 -1318447 -1320139 -1332341 -1336879 -1326102 -1318539 -1317216 -1321072 -1325444 -1310696 -1308109 -1308466
9646 -1308466 -1309380 -1311077 -1310563 -1306622 -1304754 -1292098 -1281447 -1282903 -1286299 -1281205 -1282523 -1284816 -1285415 -1281437
9632 -1281437 -1280282 -1277234 -1275049 -1281631 -1285108 -1269817 -1269871 -1269123 -1268652 -1273547 -1275024 -1273224 -1267058 -1254852 -1255523
9617 -1255523 -1263424 -1258693 -1256263 -1254066 -1256858 -1260545 -1260108 -1257022 -1239504 -1233114 -1240596 -1239340 -1242535 -1241113
9603 -1241113 -1242120 -1241247 -1227651 -1221562 -1221719 -1229836 -1227509 -1219563 -1211897 -1216778 -1222885 -1216032 -1215725 -1228011
9589 -1228011 -1230011 -1218511 -1218996 -1232768 -1227105 -1215428 -1206893 -1201615 -1200092 -1200824 -1209468 -1216984 -1214201 -1213184
9575 -1213184 -1210102 -1207202 -1217829 -1218020 -1214161 -1210968 -1198834 -1202932 -1210704 -1212585 -1190979 -1175370 -1174290
9562 -1174290 -1179989 -1183533 -1179915 -1175717 -1170308 -1168677 -1172870 -1179797 -1171681 -1160843 -1158823 -1156962 -1161696 -1155866
9548 -1155866 -1154348 -1152774 -1143440 -1137561 -1139571 -1141382 -1147786 -1146969 -1144068 -1138874 -1129621 -1128498 -1128643 -1135922 -1146806
9533 -1146806 -1146510 -1130007 -1129018 -1133294 -1128068 -1122823 -1122578 -1117129 -1103369 -1100637 -1099875 -1103461 -1100735 -1098421 -1098785
9518 -1098785 -1103249 -1096985 -1090903 -1087803 -1091839 -1096652 -1091598 -1086516 -1082888 -1081545 -1086144 -1091754 -1085941 -1069386
9504 -1069386 -1063686 -1052306 -1051367 -1053070 -1053107 -1048923 -1051980 -1055461 -1049141 -1045752 -1046051 -1043821 -1036805 -1032124 -1033953
9489 -1033953 -1033336 -1024630 -1015197 -1010847 -1017298 -1016373 -1016621 -1012735 -1013153 -1018078 -1011237 -1000242 -992181 -996338 -1001690
9474 -1001690 -1010850 -1004565 -1002816 -997207 -991156 -983994 -972618 -970719 -966255 -972099 -977821 -973497 -962654 -963872
9460 -963872 -974058 -986490 -993458 -995679 -1000357 -1006095 -997988 -990587 -976156 -982101 -984894 -978446 -969122 -958271
9446 -958271 -948393 -944826 -949119 -948851 -946092 -952181 -951475 -935016 -919582 -913714 -923578 -917030 -912688 -914439
9432 -914439 -906890 -898962 -895868 -896994 -895024 -897064 -898727 -898141 -890129 -880134 -886525 -890257 -888830 -882724 -875455
9417 -875455 -867790 -867479 -867610 -862456 -864215 -869700 -864402 -852405 -858667 -859958 -853052 -859453 -861630 -856841 -855315
9402 -855315 -852160 -854661 -848325 -840797 -832261 -827982 -820104 -810997 -807687 -812877 -811062 -809637 -815297 -814658 -815674
9387 -815674 -807676 -798381 -792009 -790011 -794343 -800184 -791615 -780282 -779395 -779041 -775920 -766043 -766459 -759001 -749389
9372 -749389 -743475 -739110 -742881 -739395 -730722 -729938 -721007 -715059 -712493 -716836 -726420 -725262 -724996 -716465 -717929
9357 -717929 -721448 -726546 -728730 -726608 -716003 -705556 -696240 -699456 -691946 -693121 -681293 -672692 -663601 -657448
9343 -657448 -656373 -655333 -645965 -646989 -646794 -638512 -622923 -613370 -617497 -606368 -600495 -594672 -586010 -580297
9329 -580297 -574791 -569370 -563533 -565182 -574043 -570368 -567612 -573315 -578949 -573972 -580915 -589153 -596232 -606249
9315 -606249 -617637 -646231 -674267 -694337 -720760 -745189 -767452 -793018 -816637 -843756 -868536 -892601
9303 -892601 -932367 -959720 -982648 -1011043 -1035349 -1057547 -1085924 -1120951 -1154552 -1184143 -1207011 -1230395
9291 -1230395 -1258656 -1286458 -1312322 -1318937 -1332303 -1349324 -1366374 -1387789 -1402856 -1414388 -1417649 -1431629
9279 -1431629 -1432910 -1437791 -1438462 -1429093 -1426348 -1434634 -1436800 -1434185 -1440209 -1437942 -1433577 -1427593 -1420844 -1410201
9265 -1410201 -1411541 -1424238 -1428915 -1428937 -1440325 -1441215 -1436436 -1431491 -1419193 -1412706 -1400389 -1392107 -1386231 -1384745
9251 -1384745 -1374915 -1362659 -1362672 -1369211 -1359157 -1355409 -1356945 -1348727 -1344998 -1350245 -1338830 -1334507 -1332234 -1331192
9237 -1331192 -1327129 -1308445 -1298346 -1283759 -1273401 -1264909 -1262729 -1260000 -1255211 -1255217 -1257496 -1260633 -1248249 -1237378
9223 -1237378 -1232850 -1232156 -1224355 -1216463 -1200500 -1190810 -1191443 -1192569 -1188783 -1193574 -1196258 -1197202 -1194630 -1193041 -1197939
9208 -1197939 -1194121 -1183608 -1179832 -1172931 -1170380 -1167916 -1150472 -1152158 -1154700 -1147265 -1146554 -1156513 -1153669 -1144697
9194 -1144697 -1146442 -1150425 -1151176 -1137154 -1123128 -1118835 -1114161 -1107288 -1110469 -1109311 -1103807 -1096787 -1091678 -1083139
9180 -1083139 -1071294 -1071638 -1075993 -1087551 -1094006 -1091134 -1092187 -1078038 -1066301 -1063295 -1062843 -1060182 -1056972 -1062668
9166 -1062668 -1070740 -1072688 -1073582 -1076144 -1071904 -1063970 -1070223 -1057478 -1039464 -1033322 -1036059 -1035870 -1036887 -1038986
9152 -1038986 -1031867 -1028342 -1025531 -1034735 -1034160 -1026432 -1012880 -1002602 -991489 -992474 -981042 -969402 -965891
9139 -965891 -949125 -946940 -944417 -941728 -944197 -953747 -970153 -990972 -1001012 -1011590 -1018496 -1018046 -1012836
9126 -1012836 -991402 -983252 -983119 -972525 -963957 -957058 -947707 -943201 -941484 -937796 -940464 -936475 -938469 -932721
9112 -932721 -932612 -928418 -921731 -912871 -908751 -896136 -886178 -896411 -898262 -896296 -897359 -901901 -896770 -894991
9098 -894991 -895999 -886981 -888344 -883645 -874295 -871118 -858729 -847259 -830256 -833407 -841100 -840760 -850328 -855396
9084 -855396 -875010 -900397 -905547 -907043 -897345 -883681 -874502 -875867 -870974 -856698 -847722 -855804 -863602
9071 -863602 -870720 -863954 -863925 -855951 -860259 -860847 -861449 -856415 -843764 -823807 -811524 -816699 -826023 -828204 -831997
9056 -831997 -812903 -794620 -785478 -775794 -768541 -780358 -773169 -772493 -773004 -776268 -769204 -756042 -751895 -751283
9042 -751283 -750958 -750538 -750384 -761490 -775932 -780111 -786779 -790605 -787630 -786230 -781893 -783044 -765951 -751739
9028 -751739 -754882 -755667 -753325 -752520 -754802 -757628 -759635 -762111 -744424 -730214 -721766 -726947 -726202 -710626
9014 -710626 -694202 -691783 -700078 -694260 -684354 -672637 -660943 -655353 -651484 -661624 -667332 -673933 -674626 -670212
9000 -670212 -667415 -659398 -648260 -637525 -629612 -629905 -622736 -611815 -599694 -597444 -599336 -581831 -579597
8987 -579597 -572449 -558729 -552841 -557785 -545075 -529905 -520638 -522514 -521552 -506378 -501627 -495396 -487173 -478442
8973 -478442 -465999 -456602 -447149 -439058 -424832 -412628 -404712 -389957 -371336 -359479 -343286 -341439 -325658
8960 -325658 -309244 -295664 -272350 -256790 -258779 -254088 -228060 -198635 -174455 -149115 -114441 -95177
8948 -95177 -63893 -35958 -17094 2386 36124 88722 124283 161931 207696 267773 320768 361287
8936 361287 409473 460270 509329 569913 645298 723544 805214 903531 1036501 1196719 1394644
8925 1394644 1648638 1950036 2298008 2651132 2841085 2533927 1487339 -70150 -1638374
8916 -1638374 -2858013 -3452389 -3440072 -3139586 -2784664 -2451696 -2179004 -2018702 -1977795 -2035480
8906 -2035480 -2114939 -2169821 -2150569 -2057416 -1964464 -1858850 -1753351 -1667380 -1577348 -1508104 -1450375
8895 -1450375 -1392376 -1342741 -1310814 -1283614 -1263404 -1261145 -1255150 -1246909 -1229954 -1198941 -1170322 -1134298
8883 -1134298 -1090432 -1053721 -1017787 -980026 -939255 -904739 -871562 -832744 -797009 -765177 -735895
8872 -735895 -691192 -628840 -563987 -494594 -424933 -340142 -229485 -136575 -156842 -377990 -725658
8861 -725658 -1074950 -1346813 -1479400 -1452124 -1360622 -1270394 -1184705 -1109166 -1055030 -993763 -942303
8850 -942303 -894254 -841339 -778789 -714688 -672041 -630908 -584376 -560506 -590230 -680427 -807391
8839 -807391 -932336 -1019922 -1061805 -1057482 -1026081 -980557 -935574 -881123 -839061 -802860 -772129 -740631
8827 -740631 -704320 -661632 -621731 -592820 -552717 -488746 -429153 -389263 -392474 -457992 -617171 -782033
8815 -782033 -913442 -981209 -971440 -928615 -874832 -815308 -779006 -756970 -723475 -687361 -653637 -629771
8803 -629771 -595357 -566726 -548902 -524017 -498555 -494845 -493535 -525636 -566858 -603526 -609835 -593277
8791 -593277 -571306 -540061 -512157 -496048 -477187 -459894 -447238 -434887 -426553 -416881 -408048 -397761
8779 -397761 -384395 -370569 -354729 -346801 -338483 -332899 -331864 -319801 -307495 -297597 -282689 -252904 -235745
8766 -235745 -227395 -219461 -205799 -188922 -166836 -140893 -120706 -105920 -104736 -96359 -79414 -57340
8754 -57340 -39215 -38755 -33294 -39741 -44319 -41663 -26183 -20441 -5593 20699 51801 76277 82727
8741 82727 79041 68542 56252 53577 56669 69384 85924 107148 119914 126018 146455 172046 205148
8728 205148 223339 229889 241268 257936 282326 303688 321402 332783 351172 367108 382711 391520
8716 391520 413108 445367 460898 487238 506523 540484 567461 594461 627021 645147 666921 697140
8704 697140 727494 761309 804176 846368 887052 923007 948221 958711 938697 906581 881820 889700
8692 889700 930797 987827 1060027 1136702 1215459 1293457 1365234 1449022 1525485 1603139 1699038 1802741
8680 1802741 1921356 2058032 2222586 2415652 2629958 2805034 2804485 2494428 1970972 1486364
8670 1486364 1140273 1041993 1182052 1400051 1620554 1815149 1989356 2144599 2298959 2451532
8660 2451532 2579426 2694126 2807253 2906030 2970370 3012526 3020176 2986844 2877724 2663737 2337255
8649 2337255 1880873 1277737 502405 -426956 -1487280 -2552379 -3474605 -4167847 -4587799
8640 -4587799 -4765722 -4755741 -4615219 -4413721 -4187148 -3962952 -3759865 -3552722 -3314484 -3007022
8630 -3007022 -2669492 -2591324 -3091029 -4091080 -5123688 -5939182 -6307120 -6154797 -5805677
8621 -5805677 -5457646 -5152050 -4932927 -4786287 -4676710 -4601938 -4528418 -4438820 -4341398 -4228079
8611 -4228079 -4124349 -4008268 -3882618 -3764889 -3657469 -3547776 -3449383 -3357695 -3275924 -3203387
8601 -3203387 -3146691 -3076771 -3008986 -2943522 -2885064 -2814554 -2741828 -2668703 -2606416 -2584622 -2589642 -2583240
8589 -2583240 -2512378 -2370010 -2221870 -2133931 -2147237 -2306587 -2709553 -3288345 -3829665 -4212189
8579 -4212189 -4436100 -4405135 -4215952 -4009828 -3819114 -3636728 -3480573 -3351946 -3308372 -3318987
8569 -3318987 -3359592 -3429795 -3487262 -3503578 -3473392 -3416004 -3338897 -3239908 -3132294 -3026745 -2926652
8558 -2926652 -2827313 -2755136 -2724925 -2755294 -2830157 -2916139 -2977667 -3016961 -3035958 -3085528 -3155085
8547 -3155085 -3211918 -3231203 -3210388 -3162256 -3089962 -3006208 -2914746 -2834801 -2772036 -2760540 -2797209
8536 -2797209 -2862115 -2930241 -2963840 -2952566 -2924097 -2895530 -2870478 -2838566 -2810179 -2773305 -2717222
8525 -2717222 -2667620 -2633138 -2611491 -2621235 -2654920 -2687254 -2729991 -2761794 -2786543 -2785893 -2764785 -2728202
8513 -2728202 -2692148 -2644443 -2602130 -2576495 -2572653 -2575592 -2578114 -2580123 -2568622 -2559032 -2544487 -2551760 -2582616
8500 -2582616 -2622277 -2640331 -2647621 -2638197 -2615207 -2590707 -2562659 -2530386 -2501505 -2482934 -2462553 -2450372
8488 -2450372 -2434962 -2418640 -2398364 -2373264 -2346555 -2336632 -2342642 -2354447 -2352018 -2356152 -2336494 -2307592
8476 -2307592 -2280257 -2272646 -2288609 -2326517 -2368742 -2395342 -2404415 -2400635 -2404568 -2402369 -2384021 -2360711
8464 -2360711 -2343978 -2327316 -2321941 -2320468 -2304938 -2291944 -2271800 -2270623 -2275928 -2259694 -2242377 -2232709
8452 -2232709 -2223109 -2218069 -2212074 -2194522 -2176927 -2164825 -2147628 -2126636 -2114553 -2107833 -2087297 -2065699
8440 -2065699 -2044043 -2035044 -2057478 -2098503 -2155811 -2226425 -2277950 -2291777 -2280645 -2263943 -2244800 -2229351
8428 -2229351 -2230550 -2227561 -2225075 -2216917 -2205310 -2198651 -2194797 -2186024 -2176722 -2169631 -2158730 -2150029 -2145568 -2138820
8414 -2138820 -2131659 -2125764 -2116326 -2115969 -2108631 -2099946 -2090602 -2090170 -2079869 -2071752 -2070397 -2065826 -2059563 -2053117
8400 -2053117 -2040880 -2035307 -2032457 -2024914 -2015357 -2006659 -2007962 -2005126 -1997912 -1993717 -1998394 -1990158 -1986781 -1989014
8386 -1989014 -1981909 -1987348 -1981283 -1981541 -1979053 -1975134 -1966387 -1962142 -1969541 -1977454 -1966192 -1956822 -1956438 -1943335
8372 -1943335 -1932447 -1928143 -1933973 -1940541 -1934941 -1927024 -1920534 -1927305 -1932488 -1930120 -1920677 -1913173 -1915523 -1920210
8358 -1920210 -1910792 -1910051 -1907693 -1897607 -1891852 -1886539 -1883897 -1884252 -1876415 -1876438 -1877437 -1884536 -1871963 -1878378 -1878747
8343 -1878747 -1872669 -1870595 -1860089 -1849631 -1846075 -1851524 -1852854 -1837090 -1831527 -1820772 -1816804 -1821897 -1825931
8330 -1825931 -1832099 -1825976 -1816996 -1810961 -1792974 -1781457 -1788830 -1792395 -1794736 -1798843 -1789959 -1783420 -1782824 -1782037
8316 -1782037 -1774000 -1775285 -1776694 -1773319 -1768023 -1772029 -1772937 -1766634 -1758252 -1758147 -1756080 -1748795 -1735762 -1731711
8302 -1731711 -1733828 -1732895 -1734613 -1738161 -1736329 -1731178 -1715083 -1702941 -1691433 -1681789 -1683210 -1677915 -1679163 -1674418
8288 -1674418 -1671255 -1670118 -1674445 -1674175 -1669506 -1662646 -1649092 -1641454 -1633924 -1618885 -1598573 -1578847 -1569787
8275 -1569787 -1576434 -1589461 -1617198 -1653497 -1688397 -1706758 -1705894 -1694351 -1690369 -1687559 -1681563 -1676577 -1666660
8262 -1666660 -1654271 -1645545 -1640010 -1626774 -1617699 -1608848 -1599297 -1608124 -1603464 -1583612 -1565802 -1565866 -1568523 -1561417
8248 -1561417 -1553825 -1546908 -1531753 -1520196 -1518672 -1528652 -1531892 -1531723 -1537752 -1529564 -1531977 -1520417 -1506738
8235 -1506738 -1503414 -1485187 -1461513 -1452647 -1454341 -1458546 -1462498 -1458563 -1455914 -1456974 -1444070 -1437958 -1429563
8222 -1429563 -1425237 -1425536 -1425531 -1416001 -1397166 -1382420 -1379925 -1379742 -1383855 -1375520 -1368013 -1354377 -1337861 -1318474
8208 -1318474 -1314166 -1308646 -1309058 -1304960 -1304321 -1308124 -1311519 -1316491 -1304973 -1297368 -1292871 -1286846 -1285836 -1285759 -1281446
8193 -1281446 -1272573 -1256340 -1232695 -1223284 -1216330 -1197914 -1182590 -1167935 -1154546 -1147775 -1142500 -1149706 -1183901
8180 -1183901 -1224422 -1250466 -1274185 -1306098 -1312434 -1298206 -1277103 -1263643 -1263273 -1254007 -1244329 -1239990 -1218482
8167 -1218482 -1210171 -1200662 -1195199 -1190641 -1184007 -1177030 -1168032 -1170400 -1166088 -1159520 -1134217 -1117448 -1118644 -1114029
8153 -1114029 -1116535 -1111609 -1096640 -1081038 -1074522 -1084900 -1086133 -1084900 -1088463 -1077784 -1065892 -1043227 -1015644
8140 -1015644 -996774 -975533 -951412 -923698 -913867 -933935 -996153 -1070822 -1121558 -1155093 -1154647 -1131161
8128 -1131161 -1105884 -1077144 -1043873 -1009968 -974808 -953312 -933581 -922369 -913486 -900957 -888091 -861117
8116 -861117 -833336 -808375 -794169 -784217 -782315 -774175 -751967 -733130 -712393 -690072 -682365 -666434
8104 -666434 -660447 -654982 -648501 -662234 -685031 -698056 -707913 -721603 -732782 -751872 -768279 -780683
8092 -780683 -791208 -800328 -812315 -832530 -861120 -903289 -942166 -949613 -945962 -929338 -905422 -886256
8080 -886256 -876706 -888423 -906475 -924887 -922609 -904975 -876401 -845581 -827262 -790003 -751907 -722233
8068 -722233 -689424 -657455 -633731 -603931 -578170 -548437 -518755 -519119 -528056 -539612 -565670 -617831
8056 -617831 -723552 -897136 -1139677 -1408350 -1675841 -1885980 -2001976 -2037917 -2042610 -2044111 -2051852
8045 -2051852 -2067985 -2099587 -2114963 -2112807 -2076933 -2015802 -1942966 -1877930 -1823089 -1766467 -1706209 -1658872
8033 -1658872 -1663910 -1700561 -1738780 -1773491 -1777325 -1761424 -1747516 -1725218 -1699044 -1684359 -1688918 -1691107
8021 -1691107 -1689106 -1689627 -1698486 -1713293 -1739061 -1785657 -1849357 -1934301 -2037754 -2152094 -2281703 -2411142
8009 -2411142 -2526953 -2619269 -2703982 -2783822 -2847348 -2923998 -3000491 -3063894 -3093977 -3098603 -3076445
7998 -3076445 -3045285 -3003360 -2958752 -2908065 -2851061 -2799694 -2754178 -2718100 -2676934 -2641836 -2612311
7987 -2612311 -2580324 -2571130 -2581093 -2606146 -2631104 -2661598 -2686382 -2703759 -2715282 -2715419 -2715694 -2728727 -2749604
7974 -2749604 -2764014 -2771732 -2793804 -2806323 -2828609 -2857653 -2881390 -2910874 -2945401 -2968728 -2990642 -3014276
7962 -3014276 -3026140 -3020626 -3016745 -3006132 -2989078 -2974326 -2961549 -2934087 -2908318 -2881409 -2861026 -2836997
7950 -2836997 -2816483 -2793750 -2777916 -2763188 -2750767 -2728496 -2722587 -2717428 -2698993 -2684899 -2671735 -2663025
7938 -2663025 -2654963 -2638079 -2621805 -2619077 -2634073 -2633935 -2619632 -2604181 -2597913 -2592197 -2591952 -2596209 -2607241
7925 -2607241 -2609686 -2594201 -2583121 -2580015 -2573832 -2567021 -2557461 -2541454 -2538622 -2543393 -2534806 -2526985 -2505833
7912 -2505833 -2495575 -2488071 -2475936 -2471181 -2478977 -2488512 -2490552 -2468416 -2453719 -2439651 -2429996 -2416965 -2403877
7899 -2403877 -2391787 -2397174 -2406049 -2402499 -2394874 -2388060 -2377846 -2368861 -2365470 -2365931 -2366049 -2365948 -2369709 -2357390
7885 -2357390 -2343508 -2337557 -2343142 -2348924 -2338894 -2323936 -2310372 -2299282 -2295926 -2290800 -2280788 -2271943 -2269387
7872 -2269387 -2266120 -2258343 -2251959 -2245790 -2241671 -2232031 -2235194 -2234159 -2233230 -2228872 -2233114 -2240750 -2252686 -2249301
7858 -2249301 -2231261 -2216525 -2206419 -2201952 -2205285 -2201025 -2197092 -2188811 -2189533 -2183380 -2170661 -2170551 -2174222 -2172316
7844 -2172316 -2173622 -2171911 -2177660 -2180836 -2180965 -2183494 -2177514 -2168918 -2171227 -2177835 -2169817 -2155302 -2149047 -2148514
7830 -2148514 -2141099 -2134600 -2135121 -2130395 -2113339 -2115576 -2119538 -2118514 -2117054 -2115445 -2112969 -2108491 -2107312 -2101515
7816 -2101515 -2097379 -2097139 -2094661 -2087193 -2085317 -2087482 -2092005 -2082216 -2082200 -2087364 -2084500 -2090829 -2095321 -2081102 -2067273
7801 -2067273 -2066377 -2065264 -2056561 -2048283 -2042685 -2040226 -2037334 -2036164 -2037681 -2025492 -2017353 -2019573 -2023025 -2023511
7787 -2023511 -2022350 -2015696 -2013458 -2021574 -2030029 -2039415 -2033583 -2024403 -2022024 -2016764 -2008107 -1993641 -1988556 -1983431
7773 -1983431 -1985361 -1985149 -1977021 -1975463 -1975428 -1978542 -1977056 -1972399 -1981315 -1973625 -1971373 -1972222 -1969850 -1971716 -1971150
7758 -1971150 -1954447 -1948095 -1949710 -1948342 -1947158 -1940195 -1941554 -1941334 -1944103 -1948917 -1955204 -1956044 -1949786 -1942779
7744 -1942779 -1934276 -1920825 -1918334 -1918714 -1921967 -1924895 -1913379 -1911566 -1913534 -1918522 -1923696 -1919163 -1917585 -1913198
7730 -1913198 -1915526 -1920639 -1915670 -1907180 -1899040 -1899905 -1903249 -1887674 -1878042 -1879624 -1889687 -1884100 -1881497 -1872668
7716 -1872668 -1868361 -1866540 -1873615 -1882903 -1884128 -1877786 -1867009 -1862491 -1852704 -1841294 -1845609 -1852248 -1859028 -1863847
7702 -1863847 -1861474 -1859005 -1860837 -1860733 -1855714 -1855354 -1841727 -1839815 -1838559 -1847403 -1850077 -1846919 -1829284 -1825759
7688 -1825759 -1823080 -1825980 -1835536 -1843638 -1847901 -1848108 -1836421 -1817416 -1810164 -1808748 -1815983 -1827817 -1822049 -1811321
7674 -1811321 -1810948 -1813552 -1812895 -1808685 -1810887 -1812874 -1814450 -1816001 -1813325 -1805020 -1794432 -1798750 -1805786 -1800819
7660 -1800819 -1793562 -1795049 -1800946 -1801497 -1796630 -1805818 -1801709 -1786951 -1779293 -1776564 -1776248 -1778406 -1771037 -1765979
7646 -1765979 -1783493 -1787545 -1789082 -1787106 -1784421 -1781498 -1779734 -1775436 -1778384 -1771289 -1761261 -1759874 -1760972 -1775430
7632 -1775430 -1782504 -1780989 -1774197 -1754693 -1756859 -1759031 -1748179 -1744522 -1749643 -1756966 -1757752 -1759421 -1749587 -1738614
7618 -1738614 -1735738 -1735807 -1744992 -1742571 -1742813 -1743508 -1746972 -1755771 -1756906 -1748762 -1748216 -1735198 -1729945 -1732817 -1736833
7603 -1736833 -1735571 -1735747 -1734840 -1741531 -1745465 -1747132 -1743156 -1739568 -1732533 -1719899 -1700417 -1698170 -1699687 -1704098
7589 -1704098 -1714869 -1711375 -1713196 -1705271 -1703744 -1706357 -1705398 -1713125 -1714495 -1704258 -1699517 -1702351 -1715607 -1716304
7575 -1716304 -1716796 -1712054 -1719492 -1720774 -1728853 -1727410 -1721956 -1707051 -1696956 -1694457 -1687336 -1684940 -1683838 -1684622
7561 -1684622 -1679789 -1681533 -1681624 -1677941 -1688746 -1695175 -1686170 -1681567 -1677680 -1680670 -1687500 -1679062 -1679821 -1684540 -1677468
7546 -1677468 -1678583 -1676221 -1678606 -1680862 -1687716 -1692027 -1685522 -1682483 -1678106 -1673669 -1662549 -1661006 -1660023 -1667985
7532 -1667985 -1657129 -1657343 -1652303 -1647618 -1643787 -1650424 -1653162 -1659534 -1658205 -1651266 -1652042 -1649773 -1646505 -1648493
7518 -1648493 -1645991 -1642837 -1642417 -1650911 -1647418 -1641134 -1639919 -1645762 -1642165 -1638806 -1633212 -1627920 -1630645 -1640154
7504 -1640154 -1647876 -1649166 -1641737 -1645336 -1643720 -1642468 -1631497 -1632102 -1638361 -1635242 -1630642 -1620418 -1627007 -1626863
7490 -1626863 -1623211 -1625144 -1619234 -1626001 -1642039 -1643771 -1644678 -1644358 -1633977 -1618589 -1619454 -1630341 -1628574 -1622372
7476 -1622372 -1620412 -1621035 -1622078 -1617011 -1616288 -1616532 -1616170 -1607258 -1600047 -1610398 -1602386 -1604456 -1608571 -1626282 -1623666
7461 -1623666 -1617123 -1613905 -1601195 -1593635 -1588214 -1587934 -1593709 -1597954 -1592490 -1586127 -1578268 -1587644 -1587927 -1590984
7447 -1590984 -1589287 -1580038 -1573656 -1575188 -1576055 -1586196 -1589789 -1600575 -1596163 -1591764 -1597272 -1595881 -1597812 -1596010
7433 -1596010 -1589776 -1587145 -1584622 -1581879 -1575658 -1570966 -1578246 -1576692 -1575911 -1575159 -1578717 -1579663 -1585247 -1580566 -1572590
7418 -1572590 -1571121 -1573005 -1574863 -1570225 -1569844 -1569186 -1568487 -1564592 -1565650 -1567169 -1568671 -1571126 -1571863 -1561127 -1563340
7403 -1563340 -1570680 -1558902 -1557121 -1556313 -1555854 -1560058 -1569250 -1572486 -1567379 -1560373 -1552199 -1551067 -1558991 -1558160 -1557179
7388 -1557179 -1554841 -1549427 -1542288 -1538338 -1545088 -1551381 -1553648 -1546825 -1550784 -1550517 -1549930 -1551942 -1553770 -1546487 -1542097
7373 -1542097 -1548512 -1557927 -1561452 -1560429 -1562195 -1563260 -1559812 -1551775 -1538265 -1539484 -1550601 -1550401 -1545615 -1534070
7359 -1534070 -1528704 -1536553 -1539836 -1550738 -1551167 -1546432 -1533821 -1534657 -1541347 -1542703 -1547679 -1555100 -1551479 -1542597
7345 -1542597 -1538044 -1531158 -1530342 -1522445 -1517346 -1523412 -1516947 -1512831 -1506948 -1503442 -1504090 -1511054 -1512557 -1506903 -1509238
7330 -1509238 -1520142 -1514900 -1511872 -1514669 -1521301 -1526069 -1517245 -1511230 -1511528 -1507878 -1510703 -1514956 -1509648 -1517645
7316 -1517645 -1520487 -1516631 -1508564 -1504271 -1494637 -1491348 -1495943 -1502739 -1497876 -1493449 -1496039 -1500125 -1498021 -1495005
7302 -1495005 -1496591 -1504387 -1501669 -1498323 -1499393 -1498139 -1499716 -1496332 -1497118 -1501121 -1500411 -1503383 -1490875 -1487542
7288 -1487542 -1481192 -1476364 -1482073 -1472546 -1470212 -1479670 -1482743 -1477764 -1471873 -1484626 -1500928 -1497982 -1499974 -1497060
7274 -1497060 -1488542 -1483472 -1480557 -1492130 -1492541 -1480134 -1479535 -1483733 -1481527 -1480236 -1475978 -1469847 -1458842 -1462955
7260 -1462955 -1461621 -1469118 -1474675 -1482250 -1488806 -1489946 -1491288 -1484572 -1470080 -1473793 -1480007 -1480749 -1471877 -1469465
7246 -1469465 -1472076 -1477241 -1482693 -1472640 -1465940 -1466242 -1464898 -1465609 -1467163 -1468345 -1469327 -1474771 -1469719 -1467851 -1465602
7231 -1465602 -1465142 -1462727 -1463964 -1472347 -1475803 -1467089 -1465897 -1467897 -1463088 -1457034 -1449535 -1447405 -1454837 -1454718 -1453584
7216 -1453584 -1458345 -1451885 -1442853 -1435467 -1442105 -1454200 -1451006 -1450952 -1453555 -1452626 -1447238 -1441229 -1435741 -1427693 -1430322
7201 -1430322 -1438410 -1443927 -1442413 -1442785 -1445235 -1446765 -1433914 -1426850 -1435201 -1436284 -1443037 -1448680 -1453174 -1444394
7187 -1444394 -1435336 -1422024 -1423129 -1427352 -1437761 -1445767 -1439919 -1438797 -1441411 -1443965 -1439035 -1433863 -1434750 -1432932
7173 -1432932 -1437152 -1441853 -1447744 -1451747 -1446536 -1441768 -1441571 -1426847 -1420076 -1419721 -1412389 -1403623 -1403065 -1411552 -1419240
7158 -1419240 -1422726 -1420844 -1429599 -1429715 -1431111 -1427393 -1420691 -1424363 -1421076 -1419764 -1427775 -1421415 -1414605 -1420513
7144 -1420513 -1425339 -1423069 -1416044 -1419220 -1411739 -1416615 -1413253 -1406906 -1407345 -1415764 -1422253 -1422710 -1422467 -1419769 -1426042
7129 -1426042 -1427086 -1424410 -1425200 -1431254 -1423854 -1412094 -1406721 -1401425 -1404265 -1399229 -1393502 -1395775 -1401233 -1408020
7115 -1408020 -1410574 -1404123 -1409254 -1415859 -1417995 -1410079 -1408087 -1401988 -1395196 -1399161 -1402705 -1399522 -1398169 -1400555
7101 -1400555 -1412555 -1418007 -1406423 -1401235 -1397540 -1392205 -1394932 -1397285 -1387739 -1389422 -1396985 -1395097 -1395122 -1391477
7087 -1391477 -1392443 -1390271 -1376533 -1376017 -1389685 -1397526 -1398148 -1394857 -1386122 -1389407 -1388075 -1400018 -1420072 -1415473
7073 -1415473 -1398962 -1388319 -1385624 -1387684 -1394970 -1399113 -1401003 -1388512 -1386068 -1381849 -1376232 -1369718 -1369044 -1367185
7059 -1367185 -1353422 -1353651 -1363449 -1368601 -1367109 -1363580 -1362624 -1362340 -1374870 -1380440 -1381973 -1374948 -1368992 -1375475
7045 -1375475 -1371702 -1365342 -1366201 -1364756 -1364624 -1371574 -1383052 -1385197 -1385060 -1385007 -1377095 -1370945 -1367080 -1375337 -1385312
7030 -1385312 -1391005 -1390170 -1388104 -1381337 -1364809 -1358944 -1361933 -1366721 -1355669 -1348366 -1353560 -1352929 -1344429 -1348765
7016 -1348765 -1341621 -1337054 -1339236 -1346015 -1352043 -1345614 -1342813 -1343979 -1352725 -1352897 -1350391 -1355921 -1355273 -1349107 -1346791
7001 -1346791 -1347296 -1352150 -1349934 -1350939 -1354131 -1356499 -1361520 -1360453 -1359677 -1357038 -1355918 -1356164 -1363261 -1356534 -1350211
6986 -1350211 -1352069 -1353676 -1348450 -1344301 -1335808 -1334513 -1349307 -1356475 -1355085 -1353159 -1356239 -1357136 -1356330 -1345715
6972 -1345715 -1340237 -1345835 -1334734 -1323982 -1328807 -1332092 -1337300 -1343401 -1342121 -1331311 -1333563 -1337170 -1319140
6959 -1319140 -1310127 -1311600 -1322063 -1320938 -1329598 -1328251 -1324782 -1334258 -1330154 -1317206 -1313743 -1320218 -1317675 -1316058
6945 -1316058 -1312454 -1320439 -1315459 -1308336 -1300556 -1300332 -1300705 -1298390 -1296062 -1302068 -1313920 -1306741 -1304017 -1299269
6931 -1299269 -1293138 -1283317 -1287018 -1301379 -1315162 -1326262 -1334035 -1348794 -1371400 -1381538 -1377287 -1355315
6919 -1355315 -1343281 -1344795 -1339690 -1339039 -1337691 -1335878 -1331958 -1328095 -1329140 -1327674 -1329163 -1321013 -1311240 -1305431
6905 -1305431 -1292187 -1281923 -1287741 -1297340 -1311769 -1309544 -1308069 -1314274 -1310323 -1290919 -1284656 -1284303 -1288197
6892 -1288197 -1295172 -1302294 -1301498 -1299459 -1304357 -1309898 -1313296 -1315249 -1322414 -1329863 -1325322 -1312243 -1302226 -1301786
6878 -1301786 -1297223 -1297813 -1307154 -1318807 -1306896 -1297908 -1303870 -1293289 -1291192 -1294927 -1295400 -1300768 -1307207 -1300066
6864 -1300066 -1295898 -1290990 -1279761 -1256587 -1235226 -1224572 -1237985 -1258607 -1280865 -1302388 -1313113 -1302826
6852 -1302826 -1284832 -1270132 -1262144 -1267853 -1283169 -1301580 -1311360 -1306619 -1291964 -1272967 -1264165 -1262713 -1260934
6839 -1260934 -1262164 -1254654 -1244977 -1240490 -1240307 -1241089 -1248369 -1271846 -1296274 -1306907 -1310685 -1318176 -1317852 -1326124
6825 -1326124 -1326576 -1314974 -1294682 -1282355 -1268722 -1269033 -1280985 -1288051 -1293122 -1304776 -1319102 -1322679 -1314530
6812 -1314530 -1308838 -1305489 -1318872 -1335690 -1348224 -1364137 -1364063 -1351276 -1353727 -1371116 -1385488 -1394455 -1394377
6799 -1394377 -1382040 -1376722 -1362939 -1340940 -1320154 -1314003 -1327202 -1351281 -1364839 -1373522 -1377939 -1374000
6787 -1374000 -1357845 -1345237 -1325398 -1326731 -1335015 -1336947 -1338719 -1330958 -1323398 -1317808 -1322462 -1329647 -1328777 -1330701
6773 -1330701 -1325016 -1321372 -1324963 -1329239 -1322513 -1327055 -1325198 -1321864 -1313049 -1314651 -1313758 -1314574 -1316259 -1311449 -1309078
6758 -1309078 -1305025 -1304541 -1301616 -1290144 -1290255 -1294354 -1291047 -1298366 -1307781 -1305144 -1299259 -1278692 -1270856 -1265796
6744 -1265796 -1284807 -1303154 -1311335 -1313700 -1324141 -1327064 -1315380 -1310760 -1316004 -1313315 -1303906 -1306215 -1301768
6731 -1301768 -1293288 -1293175 -1296203 -1291320 -1293347 -1305118 -1303252 -1292436 -1293188 -1296676 -1295717 -1294551 -1295386 -1296720 -1295223
6716 -1295223 -1297127 -1292547 -1289736 -1294203 -1291754 -1289989 -1296347 -1289108 -1279995 -1285237 -1302915 -1306378 -1300358 -1301094
6702 -1301094 -1293201 -1284717 -1285654 -1283481 -1284962 -1291322 -1291951 -1290132 -1287107 -1277131 -1275195 -1273196 -1271436 -1277839 -1282422
6687 -1282422 -1277351 -1279801 -1274180 -1265149 -1260349 -1259671 -1267935 -1263499 -1260026 -1264740 -1276047 -1280142 -1283947 -1280134
6673 -1280134 -1274590 -1269808 -1267788 -1270613 -1265421 -1273331 -1276053 -1270566 -1263928 -1267376 -1266584 -1257669 -1257521 -1257970 -1255341
6658 -1255341 -1257840 -1267261 -1265156 -1254794 -1257008 -1254669 -1264045 -1270403 -1267376 -1263243 -1261704 -1258815 -1263977 -1267257
6644 -1267257 -1264355 -1255682 -1264530 -1274089 -1269244 -1259231 -1251655 -1244401 -1254603 -1264607 -1264039 -1267768 -1269522 -1266816
6630 -1266816 -1252956 -1245255 -1235476 -1239839 -1249887 -1251742 -1254517 -1248776 -1244239 -1245757 -1250781 -1245339 -1255830
6617 -1255830 -1258696 -1255250 -1257954 -1254816 -1261503 -1262901 -1264340 -1260018 -1255952 -1232111 -1224022 -1237324 -1249721
6604 -1249721 -1256766 -1250655 -1249224 -1261675 -1256091 -1257108 -1271971 -1279631 -1273207 -1265376 -1258743 -1250591 -1242318 -1243701
6590 -1243701 -1241378 -1243560 -1235154 -1227360 -1234406 -1240451 -1243258 -1241346 -1230824 -1226367 -1231985 -1236961 -1235817 -1228015
6576 -1228015 -1229342 -1227462 -1220245 -1211330 -1197837 -1197397 -1208077 -1211463 -1222622 -1222796 -1225821 -1223299 -1226081 -1234732
6562 -1234732 -1237327 -1246555 -1248457 -1244847 -1245287 -1234204 -1229169 -1227556 -1225498 -1216410 -1213206 -1226278 -1231948 -1222865
6548 -1222865 -1214164 -1209678 -1203575 -1195194 -1209499 -1229667 -1233511 -1232231 -1226122 -1221981 -1226491 -1234786 -1243153 -1245695
6534 -1245695 -1236057 -1214783 -1212469 -1215804 -1229611 -1237743 -1241637 -1243928 -1246091 -1232139 -1221037 -1216712 -1209809
6521 -1209809 -1216761 -1222967 -1232082 -1233957 -1225575 -1219183 -1213896 -1222647 -1223114 -1227855 -1229640 -1224333 -1223123 -1230327
6507 -1230327 -1237720 -1242793 -1241209 -1240239 -1236521 -1237429 -1240507 -1244468 -1234822 -1225020 -1208595 -1198171 -1189989 -1189029
6493 -1189029 -1189153 -1193085 -1203816 -1211253 -1213346 -1223884 -1233620 -1233134 -1226861 -1217969 -1209200 -1207356 -1208597 -1212377
6479 -1212377 -1207640 -1211130 -1228139 -1234621 -1227144 -1217035 -1211687 -1219562 -1229180 -1227273 -1216661 -1210661 -1200852
6466 -1200852 -1199802 -1216382 -1223291 -1219688 -1209088 -1200244 -1202701 -1217833 -1223023 -1207549 -1189193 -1181449 -1180448
6453 -1180448 -1173631 -1175979 -1184686 -1188075 -1200203 -1214047 -1222507 -1222161 -1216428 -1219043 -1209620 -1203626 -1186833 -1176582
6439 -1176582 -1174535 -1180253 -1191968 -1209665 -1225968 -1225966 -1230895 -1219973 -1209976 -1211538 -1216631 -1215193 -1210003 -1200084
6425 -1200084 -1187638 -1186249 -1180444 -1182499 -1190058 -1192137 -1189092 -1185866 -1184963 -1187730 -1187803 -1191065 -1194366 -1187992 -1180968
6410 -1180968 -1178664 -1183289 -1183758 -1179525 -1183028 -1193542 -1201819 -1201181 -1197364 -1188209 -1183512 -1169949 -1165468 -1161226
6396 -1161226 -1167791 -1185887 -1201314 -1203762 -1202581 -1208971 -1204413 -1208626 -1218052 -1211543 -1195014 -1188885 -1193864
6383 -1193864 -1203599 -1208255 -1200754 -1195789 -1190117 -1190296 -1192716 -1193242 -1194609 -1187387 -1188047 -1190476 -1183997 -1187793 -1194795
6368 -1194795 -1196178 -1190876 -1182346 -1180330 -1180871 -1184592 -1181773 -1179872 -1181541 -1189782 -1189598 -1187777 -1177479 -1165245
6354 -1165245 -1166893 -1175246 -1170923 -1173944 -1172491 -1166988 -1167995 -1165602 -1163338 -1166160 -1172050 -1181185 -1185167 -1187762
6340 -1187762 -1179395 -1166549 -1152756 -1148466 -1146127 -1150646 -1156675 -1151741 -1130453 -1115340 -1118321 -1127756 -1152566
6327 -1152566 -1171256 -1167034 -1152987 -1143492 -1125912 -1116367 -1129161 -1178531 -1218724 -1235200 -1227909 -1217369
6315 -1217369 -1205298 -1191217 -1179043 -1177487 -1181601 -1196616 -1202140 -1204204 -1193179 -1196504 -1190828 -1181718 -1174885
6302 -1174885 -1181174 -1184217 -1178175 -1177006 -1186959 -1196380 -1193130 -1187579 -1181617 -1183539 -1197038 -1205540 -1201914 -1193166
6288 -1193166 -1178525 -1172507 -1174968 -1175562 -1180773 -1177553 -1179294 -1171608 -1170780 -1173357 -1177173 -1178699 -1184494 -1184549 -1179150
6273 -1179150 -1168510 -1154656 -1162146 -1170465 -1168113 -1161182 -1160277 -1163498 -1172100 -1169209 -1151375 -1151488 -1148826 -1146634
6259 -1146634 -1154623 -1164201 -1162689 -1156046 -1150752 -1152189 -1145709 -1142767 -1152276 -1158069 -1159610 -1148659 -1151764 -1159186
6245 -1159186 -1159670 -1157600 -1157465 -1157178 -1160457 -1162495 -1154209 -1149285 -1151980 -1147063 -1143018 -1143915 -1150733 -1154334 -1157998
6230 -1157998 -1163369 -1168374 -1162835 -1160156 -1154939 -1156143 -1148036 -1146475 -1149818 -1154186 -1160373 -1156160 -1153520 -1168337
6216 -1168337 -1172013 -1174019 -1156012 -1148227 -1148803 -1149276 -1136495 -1144059 -1147058 -1132051 -1141009 -1145242 -1147981 -1156446
6202 -1156446 -1164761 -1158592 -1163096 -1163322 -1159711 -1161395 -1154277 -1146277 -1139121 -1142818 -1146555 -1139516 -1141925 -1146525
6188 -1146525 -1147499 -1148182 -1148889 -1148455 -1143502 -1140550 -1147359 -1154469 -1153763 -1159349 -1156577 -1147121 -1143414 -1140423 -1141283 -1148149
6172 -1148149 -1147924 -1142346 -1130863 -1131558 -1128085 -1134856 -1142626 -1151316 -1158706 -1162635 -1160930 -1156531 -1145454 -1145656
6158 -1145656 -1147824 -1158035 -1153732 -1147739 -1144449 -1148484 -1141667 -1140858 -1143542 -1151111 -1144012 -1141015 -1144037 -1145458
6144 -1145458 -1145679 -1133014 -1130768 -1138361 -1146169 -1135248 -1132071 -1123274 -1121512 -1124169 -1131076 -1133847 -1139233 -1141029
6130 -1141029 -1146178 -1147341 -1143419 -1129031 -1130450 -1129350 -1124718 -1132443 -1141587 -1133340 -1131719 -1118855 -1112923 -1122240
6116 -1122240 -1134800 -1137206 -1130636 -1136514 -1143525 -1136274 -1130412 -1135043 -1141803 -1140145 -1133415 -1119117 -1114977 -1120892
6102 -1120892 -1128147 -1120048 -1112317 -1112746 -1119197 -1128689 -1127215 -1124551 -1130469 -1129683 -1131795 -1133696 -1131953 -1130103 -1133929
6087 -1133929 -1142305 -1136017 -1130130 -1120531 -1119437 -1116261 -1112865 -1116171 -1122145 -1122160 -1120335 -1124676 -1126427 -1123447 -1122440
6072 -1122440 -1128118 -1133487 -1140622 -1138579 -1136962 -1128117 -1125090 -1125645 -1120288 -1123236 -1116619 -1118779 -1112943 -1118907
6058 -1118907 -1125206 -1129964 -1131302 -1131650 -1126558 -1130480 -1128145 -1125949 -1114739 -1111546 -1114268 -1110149 -1112650 -1126849
6044 -1126849 -1132765 -1133720 -1121980 -1123548 -1130258 -1111379 -1097004 -1097548 -1098467 -1095834 -1100811 -1106678 -1111273 -1115728
6030 -1115728 -1118654 -1113286 -1109405 -1113406 -1107782 -1109405 -1123915 -1127715 -1118727 -1111037 -1099913 -1095876 -1101333 -1105878
6016 -1105878 -1118473 -1124907 -1120686 -1115285 -1110100 -1111056 -1119706 -1118531 -1118752 -1111641 -1113766 -1122835 -1124439 -1121312
6002 -1121312 -1115801 -1121768 -1114929 -1106989 -1089901 -1089166 -1099762 -1108376 -1117015 -1116836 -1117691 -1126210 -1127440 -1117071
5988 -1117071 -1113224 -1112395 -1106775 -1105384 -1108796 -1108455 -1102705 -1104900 -1115248 -1108778 -1106214 -1110810 -1118989 -1121570
5974 -1121570 -1106577 -1106759 -1118089 -1121003 -1124293 -1120757 -1118505 -1111006 -1106279 -1108752 -1107776 -1092130 -1094584 -1094659
5960 -1094659 -1101618 -1109460 -1106336 -1095031 -1099692 -1094029 -1093253 -1097699 -1089562 -1087639 -1094046 -1096628 -1090392 -1101923
5946 -1101923 -1109599 -1106363 -1096219 -1096016 -1094742 -1085113 -1081014 -1084368 -1092141 -1089849 -1093906 -1096964 -1089833 -1084660
5932 -1084660 -1084296 -1087832 -1071370 -1068753 -1079245 -1086772 -1093337 -1093571 -1086995 -1080393 -1081536 -1086561 -1098001 -1103622
5918 -1103622 -1091166 -1087450 -1104381 -1103436 -1093903 -1094882 -1105715 -1110135 -1099760 -1090861 -1085709 -1086773 -1083630 -1079819
5904 -1079819 -1081177 -1085034 -1098981 -1094831 -1098952 -1101267 -1093170 -1094511 -1097037 -1092775 -1085870 -1083199 -1080699 -1082729
5890 -1082729 -1087986 -1080922 -1077238 -1091266 -1103454 -1096849 -1089248 -1099116 -1111330 -1107030 -1097955 -1090714 -1077614
5877 -1077614 -1074117 -1074123 -1082590 -1092224 -1088773 -1086196 -1084541 -1084625 -1081274 -1078613 -1075148 -1080361 -1087411 -1097135 -1097338 -1094623
5861 -1094623 -1085255 -1088801 -1079014 -1067842 -1062263 -1056770 -1066033 -1075564 -1085197 -1086962 -1078568 -1078049 -1088709 -1094784
5847 -1094784 -1087868 -1073322 -1061968 -1064655 -1077956 -1079032 -1084946 -1085995 -1077091 -1074179 -1072490 -1063445 -1058203
5834 -1058203 -1055339 -1053612 -1054837 -1057488 -1057756 -1055391 -1058454 -1061560 -1064921 -1061381 -1075628 -1082076 -1079397 -1085232
5820 -1085232 -1090107 -1091336 -1086539 -1075157 -1063205 -1065812 -1067368 -1064239 -1057888 -1064252 -1076825 -1077049 -1081330 -1091795
5806 -1091795 -1094290 -1095834 -1100594 -1089861 -1083821 -1079608 -1073195 -1065016 -1072212 -1076775 -1088438 -1087005 -1078469 -1071071
5792 -1071071 -1072208 -1070164 -1066256 -1063979 -1069904 -1075576 -1079836 -1070375 -1063894 -1056931 -1064090 -1064959 -1063878 -1065499
5778 -1065499 -1071408 -1061514 -1054984 -1057344 -1060945 -1052267 -1052179 -1055205 -1054725 -1058039 -1057274 -1054730 -1063328 -1072636 -1080431
5763 -1080431 -1073876 -1074496 -1077048 -1079658 -1079644 -1071823 -1062412 -1062251 -1063590 -1057474 -1062213 -1058321 -1065313 -1074956 -1068406
5748 -1068406 -1065184 -1062340 -1060794 -1060928 -1056303 -1057485 -1066161 -1067581 -1069195 -1071825 -1070927 -1069215 -1059571 -1057134 -1064702
5733 -1064702 -1071175 -1075531 -1080705 -1074461 -1068883 -1079035 -1078022 -1076078 -1070065 -1064352 -1064648 -1062282 -1062461 -1057942
5719 -1057942 -1050757 -1056372 -1054932 -1056387 -1055588 -1053312 -1057978 -1061185 -1061807 -1057350 -1059929 -1071503 -1072237 -1062788 -1060882
5704 -1060882 -1066300 -1067801 -1055938 -1052388 -1054690 -1057663 -1058264 -1054953 -1057919 -1063987 -1061548 -1059158 -1054553 -1051027
5690 -1051027 -1054939 -1050760 -1048460 -1056419 -1054702 -1049021 -1053475 -1054854 -1056054 -1054565 -1055605 -1060375 -1062500 -1059301
5676 -1059301 -1060403 -1055839 -1047962 -1047066 -1052676 -1052172 -1048714 -1043755 -1042457 -1051964 -1060432 -1064855 -1061994 -1050253
5662 -1050253 -1049706 -1060599 -1049221 -1046480 -1044109 -1042787 -1052558 -1051347 -1061315 -1062168 -1061716 -1062219 -1060752 -1056378 -1063507
5647 -1063507 -1067778 -1062549 -1052940 -1040290 -1037935 -1044048 -1051677 -1057233 -1061412 -1061053 -1063778 -1061343 -1048321 -1047605
5633 -1047605 -1058590 -1051195 -1047909 -1049595 -1044037 -1038956 -1030807 -1037741 -1044064 -1037973 -1038513 -1049877 -1052001 -1045776
5619 -1045776 -1041104 -1043348 -1042719 -1036703 -1041878 -1050775 -1060145 -1061846 -1055563 -1054357 -1047842 -1034826 -1032943 -1042321
5605 -1042321 -1047242 -1048493 -1050731 -1051871 -1043680 -1043401 -1033538 -1037444 -1041371 -1033015 -1039124 -1047320 -1040940 -1030752
5591 -1030752 -1023959 -1036052 -1044795 -1038571 -1028703 -1025023 -1031021 -1041383 -1052892 -1050624 -1054099 -1046821 -1039633
5578 -1039633 -1047465 -1047264 -1046891 -1042206 -1033201 -1027166 -1035365 -1043131 -1039045 -1040584 -1042697 -1041287 -1034710 -1035608 -1041050
5563 -1041050 -1049800 -1046062 -1042274 -1039342 -1037905 -1042410 -1040886 -1044174 -1052880 -1055463 -1046441 -1035405 -1032751 -1030777
5549 -1030777 -1038703 -1042163 -1048336 -1046982 -1039297 -1036884 -1036840 -1045283 -1046448 -1050811 -1046289 -1050795 -1046320 -1042583 -1037554
5534 -1037554 -1030902 -1029288 -1031819 -1029989 -1025887 -1029778 -1035374 -1038842 -1040025 -1035067 -1036358 -1034919 -1033657 -1027342
5520 -1027342 -1022695 -1028004 -1028941 -1029157 -1030560 -1025016 -1027549 -1031013 -1035056 -1029249 -1020815 -1026043 -1024637 -1020099 -1016420
5505 -1016420 -1023792 -1022675 -1030291 -1036791 -1042125 -1039550 -1038017 -1036295 -1030651 -1027467 -1025637 -1028513 -1039984 -1038387
5491 -1038387 -1037963 -1045660 -1049761 -1040485 -1048044 -1048613 -1041600 -1037109 -1029802 -1037166 -1036865 -1021254 -1006812 -1015164
5477 -1015164 -1026255 -1033811 -1026476 -1019982 -1027061 -1026069 -1026756 -1030365 -1027499 -1026365 -1027182 -1030027 -1035582 -1037119 -1030829
5462 -1030829 -1022739 -1020800 -1026422 -1023737 -1021651 -1023056 -1027603 -1038872 -1033325 -1035801 -1030959 -1018354 -1021150 -1022270
5448 -1022270 -1022443 -1019633 -1024057 -1022503 -1019790 -1009235 -1004893 -1009369 -1015413 -1020427 -1028166 -1027746 -1014860 -1011109
5434 -1011109 -1016557 -1016820 -1012785 -1005740 -994614 -1003505 -1004463 -1011783 -1011343 -999799 -1012957 -1024467 -1023686 -1014775
5420 -1014775 -1004920 -999946 -998198 -1004728 -1008882 -1011886 -1008696 -1013232 -1014436 -1028357 -1031723 -1026675 -1012232 -1008997
5406 -1008997 -1018507 -1020407 -1013332 -1002577 -1020086 -1029308 -1022452 -1016839 -1021237 -1017211 -1007543 -1013408 -1019562 -1024752
5392 -1024752 -1023145 -1019971 -1009736 -1006723 -1010724 -1010012 -1017283 -1023867 -1023527 -1013644 -1013377 -1011792 -1006759 -1013585 -1013457
5377 -1013457 -1010981 -1010984 -992309 -993567 -1005873 -1010154 -1013920 -1013603 -1012804 -1016630 -1021986 -1027065 -1022035 -1019540 -1017148
5362 -1017148 -1012681 -999383 -1000548 -1009828 -1017962 -1020861 -1012000 -1007447 -995132 -991818 -1003270 -1014959 -1014494
5349 -1014494 -1020301 -1012647 -1008637 -1002284 -1000078 -993931 -1008320 -1017664 -1013325 -1013308 -1015975 -1023809 -1013599 -1006799
5335 -1006799 -1007102 -1014200 -1013965 -1017412 -1010888 -1004753 -1004882 -1001723 -1001221 -1011274 -1011751 -1005129 -1010710 -1016152 -1010978
5320 -1010978 -1013641 -1015617 -1009872 -1000990 -996572 -991481 -998381 -1008702 -1011974 -1012318 -1015027 -1012566 -1002345 -999238
5306 -999238 -1006580 -1007163 -1009999 -1012475 -1001267 -1012100 -1018737 -1004388 -991330 -993704 -994565 -998275 -995856 -994888
5292 -994888 -985304 -977809 -980708 -980641 -987028 -1001825 -1005019 -1006662 -1011522 -1007416 -1001557 -1014481 -1017206 -1006721
5278 -1006721 -1002759 -991891 -988000 -998454 -999131 -992110 -997554 -993161 -984930 -985566 -994459 -997466 -1003312 -994827
5264 -994827 -990785 -990037 -998874 -1003690 -1002618 -998884 -995027 -989782 -992990 -996118 -1000424 -1006450 -999125 -989794 -980913
5249 -980913 -970671 -966033 -968010 -980346 -980237 -979168 -974277 -978441 -979220 -989883 -996151 -992905 -993311 -988417
5235 -988417 -993142 -995621 -992524 -995864 -991609 -997752 -996708 -990401 -987373 -988669 -995113 -994918 -993773 -994103 -991549
5220 -991549 -991445 -987123 -991449 -990581 -988446 -987630 -996926 -1001094 -1007062 -1000966 -997687 -988418 -997885 -994873 -995293
5205 -995293 -989062 -982894 -988728 -986621 -985238 -991369 -981879 -970975 -976429 -986522 -986942 -992197 -998487 -1001182
5191 -1001182 -994304 -992772 -992928 -994790 -997258 -989983 -976492 -974486 -983580 -987356 -990802 -989823 -993266 -998000
5177 -998000 -997175 -989603 -988155 -992270 -987908 -987492 -985384 -984111 -985512 -994231 -984980 -977764 -979116 -993393 -1002614
5162 -1002614 -1003996 -1002220 -1000117 -999941 -990583 -985348 -987286 -982675 -989473 -994085 -990389 -978384 -976213 -983757
5148 -983757 -987219 -980769 -974704 -975101 -980561 -983007 -971898 -970148 -988114 -996615 -988123 -977878 -975884 -975308
5134 -975308 -975746 -978893 -982794 -985472 -987175 -989313 -992543 -990206 -989143 -979653 -973348 -976727 -975839 -978815 -979610
5119 -979610 -970102 -970251 -984153 -979979 -977977 -983562 -984825 -981700 -988220 -991574 -989603 -984882 -973154 -968464
5105 -968464 -968253 -976542 -974813 -974915 -982648 -983455 -971241 -969214 -969467 -974877 -985676 -979743 -974155 -973239 -976388
5090 -976388 -980125 -982973 -977420 -974535 -974484 -967731 -968152 -975873 -973997 -965716 -961924 -962851 -968463 -970946 -974438
5075 -974438 -984058 -988822 -984721 -976587 -979817 -979089 -972464 -974183 -977920 -975835 -977565 -977241 -972908 -968069 -977273
5060 -977273 -984032 -981430 -976689 -968236 -970238 -964483 -949690 -951863 -963348 -960984 -953527 -957407 -959283 -969008
5046 -969008 -968226 -971637 -981267 -980859 -973569 -974931 -972497 -970168 -972395 -976103 -974791 -974981 -981084 -975871 -972789
5031 -972789 -969326 -967562 -965399 -957519 -950657 -957440 -967944 -965523 -966639 -965642 -953621 -956728 -952484 -948894
5017 -948894 -952840 -954809 -955057 -949999 -961167 -969674 -963063 -951989 -944207 -943923 -952097 -956752 -953767 -952281
5003 -952281 -954964 -959517 -957560 -964503 -968946 -968138 -955711 -957838 -962531 -967254 -970859 -972321 -965141 -957148
4989 -957148 -960557 -965436 -968871 -968561 -965133 -963504 -972460 -973630 -962131 -950505 -946728 -944351 -946606 -952866
4975 -952866 -960077 -959923 -961724 -972690 -984009 -983574 -975576 -964243 -959901 -958892 -965279 -967263 -962232 -964462
4961 -964462 -965503 -957573 -946195 -949536 -952580 -951244 -950883 -951904 -952645 -946607 -943505 -945831 -948229 -947056 -941311
4946 -941311 -947198 -954578 -960607 -972177 -971191 -958056 -949720 -963740 -969875 -969440 -961357 -954881 -960182 -965488
4932 -965488 -965984 -970307 -963772 -954580 -949920 -950491 -959267 -951335 -952661 -961304 -964263 -965982 -959219 -948335 -947829
4917 -947829 -957083 -964586 -971954 -962408 -956426 -962023 -963935 -965330 -964856 -959087 -959991 -955223 -952562 -953785 -956402
4902 -956402 -957428 -953800 -954453 -946962 -942524 -949012 -946634 -944960 -951624 -953360 -958842 -969025 -956271 -958597
4888 -958597 -956319 -958120 -947316 -940217 -938500 -941496 -952669 -954043 -957557 -952945 -951663 -961590 -965069 -958419
4874 -958419 -954054 -947317 -945872 -946096 -949100 -948349 -949109 -942738 -942274 -949649 -945712 -940862 -945118 -954984 -947477
4859 -947477 -940742 -940311 -940042 -937530 -931670 -935690 -950967 -953784 -956816 -956009 -958869 -959378 -952412 -947773 -943334
4844 -943334 -941071 -945418 -940118 -947618 -948665 -945726 -942470 -933859 -932486 -945132 -942742 -930028 -928051 -930432
4830 -930432 -937175 -944204 -938601 -936305 -941004 -942724 -942621 -950965 -955111 -954474 -951737 -953854 -956590 -953038 -954468
4815 -954468 -956197 -949617 -952851 -949895 -941777 -939029 -941879 -940535 -939928 -938227 -932896 -928891 -928724 -926230 -919903
4800 -919903 -918632 -927489 -934747 -938012 -942257 -945051 -933974 -918673 -909334 -916227 -923814 -925453 -934090 -938347
4786 -938347 -931915 -930691 -927193 -928292 -930199 -932648 -936965 -933897 -943173 -943220 -945486 -948357 -947884 -945394 -938167
4771 -938167 -940879 -938179 -930594 -932432 -928292 -922205 -925107 -927121 -930822 -934958 -929051 -930256 -936256 -931197
4757 -931197 -926492 -931253 -926381 -923494 -932817 -951372 -962250 -958788 -949770 -944590 -942157 -937862 -933043 -927298
4743 -927298 -929762 -934194 -941103 -928799 -913014 -912076 -926455 -942018 -944778 -939981 -928609 -931183 -929183
4730 -929183 -926346 -924645 -923645 -928438 -930424 -927426 -936102 -944793 -940408 -938198 -931714 -930246 -923377 -925040
4716 -925040 -930216 -924474 -922871 -930459 -936046 -937330 -939355 -938329 -936536 -942271 -943450 -941781 -932025 -925550
4702 -925550 -922733 -924706 -929147 -923644 -912251 -906475 -908853 -909887 -911533 -905601 -905219 -909750 -916495 -920565
4688 -920565 -919674 -933523 -945796 -947392 -944732 -935262 -933943 -934204 -924225 -923639 -914430 -906331 -915624 -918610 -906764
4673 -906764 -901121 -910633 -918532 -917163 -920093 -927027 -933891 -942800 -940005 -934224 -930380 -929279 -934537 -931995
4659 -931995 -922641 -908303 -909568 -917525 -917434 -913262 -919109 -914006 -919850 -927989 -932032 -933838 -938672 -923191
4645 -923191 -910692 -907240 -908757 -919210 -924890 -932698 -945788 -935449 -920288 -920516 -914157 -906587 -906196 -911722
4631 -911722 -914643 -928405 -931667 -924945 -926162 -940133 -941782 -927283 -923113 -922650 -928513 -935164 -941745 -933717
4617 -933717 -920260 -917403 -923668 -917180 -908191 -911196 -912942 -916948 -928011 -933767 -927872 -923178 -920271 -924703
4603 -924703 -920082 -908363 -897864 -900284 -908669 -907854 -904023 -909931 -905773 -899164 -895331 -910651 -912184 -915997
4589 -915997 -922357 -920494 -921284 -926025 -921572 -915976 -918626 -924786 -919667 -925181 -923033 -911699 -900507 -892660
4575 -892660 -894769 -910513 -918525 -916701 -904988 -902862 -900174 -902608 -902250 -893281 -887850 -880120 -879850 -886455
4561 -886455 -895420 -903469 -911622 -910212 -897395 -909056 -907364 -905120 -904062 -897074 -896821 -897512 -903599 -914965
4547 -914965 -924701 -922923 -925633 -911450 -899809 -897609 -890432 -892099 -896504 -911915 -913482 -908496 -900960 -900697
4533 -900697 -907432 -917732 -917530 -911021 -902256 -910641 -906142 -893112 -896311 -898655 -905988 -904388 -914433 -921643
4519 -921643 -913051 -905338 -904074 -899466 -901492 -897481 -883669 -888113 -891110 -891327 -893093 -898495 -903522 -894839
4505 -894839 -894537 -892188 -900911 -907437 -911020 -898879 -900114 -908009 -913710 -916743 -912814 -907768 -899061 -893165
4491 -893165 -887655 -878270 -877927 -887024 -900040 -904142 -900156 -897364 -902384 -898307 -888635 -887890 -894636 -901310 -906277
4476 -906277 -910459 -914592 -910041 -911515 -906402 -910257 -911828 -917505 -914478 -915672 -916073 -916013 -912808 -903106 -901272
4461 -901272 -893687 -900194 -900865 -905504 -909747 -907713 -906260 -911084 -908434 -895532 -884948 -879429 -882925 -890069
4447 -890069 -891475 -898381 -896349 -894232 -887129 -876568 -880594 -891822 -888553 -884833 -890751 -892494 -887144 -880791
4433 -880791 -878475 -878780 -889520 -892824 -887648 -881856 -889887 -887561 -881622 -883137 -882472 -882188 -881971 -891156 -900669
4418 -900669 -897096 -888471 -892324 -895449 -898082 -898875 -891280 -897984 -892507 -887545 -882376 -886472 -890967 -886338 -888184
4403 -888184 -885908 -884134 -894268 -892800 -891729 -893915 -895171 -889965 -888456 -896994 -900584 -894039 -889321 -887466
4389 -887466 -883073 -882560 -887945 -892641 -900268 -901290 -902550 -908659 -906373 -910950 -895595 -887299 -889101 -905337
4375 -905337 -911066 -909674 -912199 -904477 -901450 -894041 -889108 -890633 -892298 -899798 -884578 -882686 -881808 -884822
4361 -884822 -888672 -889057 -891151 -884547 -882791 -881344 -885923 -888713 -880468 -879827 -881708 -883295 -885829 -889930 -893944
4346 -893944 -896956 -893563 -889523 -885830 -886338 -891321 -891492 -892849 -887723 -880029 -881087 -891763 -887546 -879731 -876983
4331 -876983 -879354 -884893 -895053 -896048 -895662 -892404 -891767 -894488 -896049 -896276 -891998 -895061 -893473 -887032 -885816
4316 -885816 -879390 -875942 -882734 -890572 -889316 -888851 -892162 -890975 -889093 -889153 -890877 -892649 -883607 -878856 -879025
4301 -879025 -875639 -883464 -885433 -883860 -879316 -875938 -886208 -896050 -890697 -882749 -876236 -872625 -883147 -888956
$$ [...]
##END NTUPLES=NMR SPECTRUM
##END=
