##TITLE=Analysis number 317248
Compound Code cc 40844
Book Reference 440/144
Project Code adrs
Chemist Name craigr
##JCAMPDX= 6.0         $$ Bruker NMR JCAMP-DX V2.0
##DATA TYPE= NMR SPECTRUM
##DATA CLASS= NTUPLES
##ORIGIN= Bruker BioSpin GmbH
##OWNER= nmr
$$ XWIN-NMR		Version 3.5
$$ Tue Feb 14 08:31:26 2006 GMT Standard Time (UT+0h)  MAYBRIDGE\nmr@NMR_250MHZ
##.OBSERVE FREQUENCY= 250.131544655141
##.OBSERVE NUCLEUS= ^1H
##.ACQUISITION MODE= SIMULTANEOUS (DQD)
##.ACQUISITION SCHEME= undefined
##.AVERAGES= 16
##.DIGITISER RES= 18
##SPECTROMETER/DATA SYSTEM= dpx250
##.PULSE SEQUENCE= zg30
##.SOLVENT NAME= CDCl3
##.SHIFT REFERENCE= (INTERNAL, CDCl3, 0, 16.522)
##AUDIT TRAIL= $$ (NUMBER, WHEN, WHO, WHERE, WHAT)
$$ ##TITLE= Audit trail, XWIN-NMR		Version 3.5
$$ ##JCAMPDX= 5.01
$$ ##ORIGIN= Bruker BioSpin GmbH
$$ ##OWNER= nmr
$$ C:\u/data/dgb/nmr/ADRS/15950/pdata/1/auditp.txt
$$ ##AUDIT TRAIL=  $$ (NUMBER, WHEN, WHO, WHERE, WHAT)
(   1,<2006-02-14 08:30:57.30 +000>,<MAYBRIDGE\nmr>,<NMR_250MHZ>,
      <created by zg, POWCHK disabled, PULCHK disabled
       configuration hash MD5:
       84 BC 41 DB A1 6E 1D 46 DA 25 12 A5 C1 ED C5 3A
       data hash MD5: 64K
       FB 57 3D 74 B8 DF 0A 49 D1 A3 C9 10 78 55 40 36>)
(   2,<2006-02-14 08:31:16.71 +000>,<MAYBRIDGE\nmr>,<NMR_250MHZ>,
      <Start of raw data processing
       ef LB = 0.3 FT_mod = 6 PKNL = 1 SI = 32K 
       data hash MD5: 32K
       95 55 1A DA 63 FF 77 7A 41 59 54 57 58 4B DC AB>)
(   3,<2006-02-14 08:31:18.59 +000>,<MAYBRIDGE\nmr>,<NMR_250MHZ>,
      <apk 
       data hash MD5: 32K
       6A 68 E7 F8 C9 2B C7 7B 50 D7 6E C9 08 08 A6 83>)
(   4,<2006-02-14 08:31:19.46 +000>,<MAYBRIDGE\nmr>,<NMR_250MHZ>,
      <abs ABSG = 5 
       data hash MD5: 32K
       FB 18 8B D8 D6 B0 B0 27 57 FB E9 B2 0D 01 BF A6>)
$$ ##END=
$$ 
$$ hash MD5
$$ FE 82 12 69 C9 97 36 98 31 11 B5 76 B1 35 5C 68
##$RELAX= 
##$RELAX= 
##$RELAX= 
##$RELAX= 
##$RELAX= 
##$RELAX= 
##$RELAX= 
$$ Bruker specific parameters
$$ --------------------------
##$DU= <C:\u>
##$EXPNO= 15950
##$NAME= <ADRS>
##$PROCNO= 1
##$TYPE= <nmr>
##$USER= <dgb>
##$AMP= (0..31)
100 100 100 100 100 100 100 100 100 100 100 100 100 100 100 100 100 100 
100 100 100 100 100 100 100 100 100 100 100 100 100 100 
##$AQSEQ= 0
##$AQ_mod= 3
##$AUNM= <au_zg>
##$AUTOPOS= <3 >
##$BF1= 250.13
##$BF2= 250.13
##$BF3= 250.13
##$BF4= 250.13
##$BF5= 500.13
##$BF6= 500.13
##$BF7= 500.13
##$BF8= 500.13
##$BYTORDA= 1
##$CFDGTYP= 0
##$CFRGTYP= 5
##$CHEMSTR= <none>
##$CNST= (0..31)
1 1 145 1 1 1 1 1 1 1 1 1 1 1 1 1 1 1 1 1 1 1 1 1 1 1 1 1 1 1 1 1 
##$CPDPRG= <>
##$CPDPRG1= <>
##$CPDPRG2= <>
##$CPDPRG3= <>
##$CPDPRG4= <mlev>
##$CPDPRG5= <mlev>
##$CPDPRG6= <mlev>
##$CPDPRG7= <mlev>
##$CPDPRG8= <mlev>
##$CPDPRGB= <>
##$CPDPRGT= <>
##$D= (0..31)
0 1 0 0 0 0 0 0 0 0.06 0 0 0 0 0 0 0.0002 0 0 0 0 0 0 0 0 0 0 0 0 0 0 
0 
##$DATE= 1139905854
##$DBL= (0..7)
120 120 120 120 120 120 120 120 
##$DBP= (0..7)
150 150 150 150 150 150 150 150 
##$DBP07= 0
##$DBPNAM0= <>
##$DBPNAM1= <>
$$ [...]
##$SUBNAM7= <"">
##$SUBNAM8= <"">
##$SUBNAM9= <"">
##$SW= 20.6930455092707
##$SWIBOX= (0..15)
0 0 3 0 0 0 0 0 0 0 0 0 0 0 0 0 
##$SW_h= 5175.983436853
##$TD= 65536
##$TD0= 1
##$TE= 294.16
##$TE2= 300
##$TE3= 300
##$TEG= 300
##$TL= (0..7)
0 120 120 120 120 120 120 120 
##$TP= (0..7)
150 150 150 150 150 150 150 150 
##$TP07= 0
##$TPNAME0= <>
##$TPNAME1= <>
##$TPNAME2= <>
##$TPNAME3= <>
##$TPNAME4= <>
##$TPNAME5= <>
##$TPNAME6= <>
##$TPNAME7= <>
##$TPOAL= (0..7)
0.5 0.5 0.5 0.5 0.5 0.5 0.5 0.5 
##$TPOFFS= (0..7)
0 0 0 0 0 0 0 0 
##$TUNHIN= 0
##$TUNHOUT= 0
##$TUNXOUT= 0
##$USERA1= <user>
##$USERA2= <user>
##$USERA3= <user>
##$USERA4= <user>
##$USERA5= <user>
##$V9= 5
##$VALIST= <valist>
##$VCLIST= <CCCCCCCCCCCCCCC>
##$VD= 0
##$VDLIST= <DDDDDDDDDDDDDDD>
##$VPLIST= <PPPPPPPPPPPPPPP>
##$VTLIST= <TTTTTTTTTTTTTTT>
##$WBST= 1024
##$WBSW= 4
##$XGAIN= (0..3)
0 0 0 0 
##$XL= 0
##$YL= 0
##$YMAX_a= 402039
##$YMIN_a= -299705
##$ZGOPTNS= <>
##$ZL1= 120
##$ZL2= 120
##$ZL3= 120
##$ZL4= 120
##$ABSF1= 16.522
##$ABSF2= -4.171173
##$ABSG= 5
##$ABSL= 3
##$ALPHA= 0
##$AQORDER= 0
##$ASSFAC= 0
##$ASSFACI= 0
##$ASSFACX= 0
##$ASSWID= 0
##$AUNMP= <proc_1d>
##$AZFE= 0.1
##$AZFW= 0.1
##$BCFW= 0
##$BC_mod= 0
##$BYTORDP= 0
##$COROFFS= 0
##$CY= 12.5
##$DATMOD= 1
##$DC= 0
##$DFILT= <>
##$DTYPP= 0
##$F1P= 14.0000005364418
##$F2P= -0.99999901652339
##$FCOR= 0.5
##$FTSIZE= 32768
##$FT_mod= 6
##$GAMMA= 0
##$GB= 0
##$INTBC= 1
##$INTSCL= 1
##$ISEN= 128
##$LB= 0.3
##$LEV0= 0
##$LPBIN= 0
##$MAXI= 10000
##$MC2= 0
##$MEAN= 0
##$ME_mod= 0
##$MI= 0
##$NCOEF= 0
##$NC_proc= -4
##$NLEV= 6
##$NOISF1= 0
##$NOISF2= 0
##$NSP= 0
##$NTH_PI= 0
##$NZP= 0
##$OFFSET= 16.522
##$PC= 1
##$PHC0= 97.87852
##$PHC1= 5.613276
##$PH_mod= 1
##$PKNL= yes
##$PPARMOD= 0
##$PSCAL= 4
##$PSIGN= 0
##$REVERSE= no
##$SF= 250.13
##$SI= 32768
##$SIGF1= 0
##$SIGF2= 0
##$SINO= 400
##$SIOLD= 32768
##$SREGLST= <1H.CDCl3>
##$SSB= 0
##$STSI= 32768
##$STSR= 0
##$SW_p= 5175.98343685301
##$SYMM= 0
##$S_DEV= 0
##$TDeff= 65536
##$TDoff= 0
##$TI= <Analysis number 999999
Compound Code 99
Book Reference 9
Project Code 9>
##$TILT= no
##$TM1= 0
##$TM2= 0
##$TOPLEV= 0
##$USERP1= <user>
##$USERP2= <user>
##$USERP3= <user>
##$USERP4= <user>
##$USERP5= <user>
##$WDW= 1
##$XDIM= 32768
##$YMAX_p= 398841492
##$YMIN_p= -613350
$$ End of Bruker specific parameters
$$ ---------------------------------
##NTUPLES= NMR SPECTRUM
##VAR_NAME=  FREQUENCY,     SPECTRUM/REAL,   SPECTRUM/IMAG
##SYMBOL=    X,             R,               I
##VAR_TYPE=  INDEPENDENT,   DEPENDENT,       DEPENDENT
##VAR_FORM=  AFFN,          ASDF,            ASDF
##VAR_DIM=   32768,         32768,           32768
##UNITS=     HZ,            ARBITRARY UNITS, ARBITRARY UNITS
##FACTOR=    0.157963299565203, 1,           1
##FIRST=     4132.6476996994, 0,             0
##LAST=      -1043.33573715361, 0,           0
##MIN=       -1043.33573715361, -613350,     0
##MAX=       4132.6476996994, 398841492,     0
$$ Real data points
##PAGE= N=1
##DATA TABLE= (X++(R..R)), XYDATA
$$ [...]
$$ plain form
16147 -49117 -25361 -11547 -14052 -9195 15624 29797 22516 -17275 -17780 -11451 33722 48294 49306
16134 49306 42301 56307 53954 53877 5207 -6397 -3403 21857 18613 1013 -5685 4070 14132
16121 14132 14938 -28697 -81948 -81099 -58619 -48617 -20749 -23677 -22169 -25346 -9729 -7065 -15052
16108 -15052 12202 -1059 -55328 -86488 -7062 28481 44621 19994 30284 23772 37714 45325
16096 45325 -11205 -29128 -5643 26150 55393 16140 -31119 -47716 18821 33070 33483 32739
16084 32739 37361 19733 35677 34277 29802 8789 -26328 -79939 -97717 -94282 -41119 10692
16072 10692 43717 20561 17360 13423 -8707 -29597 -25471 -14583 -11088 40753 63650 56484 66678
16059 66678 94560 85796 57817 22866 14793 30809 77785 61481 10024 18809 18158 -9606 -18735
$$ packed form
16147d9117K3756J3814k505M857K4819J4173p281l9791n05O329M5173J4572J012
16134D9306p005J4006k353p7m8670j1604K994K5260l244j7600o698R755J0062
16121A4132Q06m3635n3251Q49K2480J0002K7868k928J508l177J5617K664p987
16108a5052K7254j3261n4269l1160P9426L5543J6140k4627J0290o512J3942P611
16096D5325n6530j7923K3485L1793K9243l9253m7259j6597O6537J4249M13p44
16084C2739M622j7628J5944j400m475k1013l5117n3611j7778L435N3163N1811
16072A0692L3025k3156l201l937k2130k0890M126J0888L495N1841K2897p166J0194
16059F6678K7882q764k7979l4951q073J6016M6976j6304n1457Q785o51k7764r129
$$ plain form
16046 -18735 -5642 19726 26603 37280 40441 56265 107069 97236 52958 43044 34581 9942 16090
16033 16090 16465 -15865 -23833 -55962 -93755 -48499 4672 29711 9575 -26320 -61364 -39391
16021 -39391 -25147 -4283 9646 28614 13675 -14034 -25591 -22745 13063 4304 -11185 -29430
16009 -29430 -48072 18859 43082 16315 -27767 -50993 -22790 9432 14160 21739 18265 -1493
15997 -1493 3900 663 -12795 -24719 -48701 -71340 -43042 -1282 20264 7727 -23378 -7707
15985 -7707 8777 20118 -22141 -46146 -39607 15664 55685 30071 -10017 -18679 -38657 -28284
15973 -28284 -12165 4745 15814 27803 37628 54358 -5325 -17401 -639 9821 52478 40051
15961 40051 20048 27181 26935 20876 -24934 -19569 -31375 -15717 15772 -19570 -39920 5330 -11126
$$ packed form
16046a8735J3093K5368O877J0677L161J5824N0804r833m4278r914q463k4639O148
16033A6090L75l2330p968l2129l7793M5256N3171K5039k0136l5895l5044K1973
16021c9391J4244K0864J3929J8968j4939k7709j1557K846L5808q759j5489j8245
16009b9430j8642O6931K4223k6767m4082k3226K8203L2222M728P579l474j9758
15997a493N393l237j3458j1924k3982k2639K8298M1760K1546j2537l1105J5671
15985g707J6484J1341m2259k4005O539N5271M0021k5614m0088q662j9978J0373
15973b8284J6119J6910J1069J1989R825J6730n9683j2076J6762J0460M2657j2427
15961D0051k0003P133k46o059m5810N365j1806J5658L1489l5342k0350M5250j6456
$$ plain form
15948 -11126 -27465 -31786 565 8028 -21453 -8345 -28274 -9162 23958 51263 52529 54179
15936 54179 43559 42223 60964 60918 39293 28207 18450 12313 15725 21268 45617 36803 16523
15923 16523 -342 13969 31645 -18120 -75317 -70141 -55161 -49487 -38476 6237 1887 2894
15911 2894 4805 -835 -415 34585 34758 30907 41401 14407 -36574 -49416 -51303 -43742 5559 22395
15897 22395 17657 10965 8068 34998 56685 44326 17232 -28312 -48610 -53505 -81873 -81770 -46860
15884 -46860 -18308 2289 23705 18972 -2525 -56153 -72300 -45690 -25499 11016 3243 4437
15872 4437 -1285 6766 -1914 280 18329 62366 42360 -330 -26481 -32547 -41239 -22274 -26074
15859 -26074 -64614 -50823 -5763 33786 16013 41202 86398 78447 52274 50047 15752 -8750
$$ packed form
15948a1126j6339m321L2351P463k9481J3108j9929J9112L3120K7305J266J650
15936E4179j0620j336J8741m6k1625j1086r757o137L412N543K4349q814k0280
15923A6523j6865J4311J7676m9765n7197N176J4980N674J1011M4713m350J007
15911B894J911n640M20L5000J73l851J0494k6994n0981j2842j887P561M9301J6836
15897B2395m738o692k897K6930K1687j2359k7094m5544k0298m895k8368J03L4910
15884d6860K8552K0597K1416m733k1497n3628j6147K6610K0191L6515p773J194
15872D437n722Q051q680K194J8049M4037k0006m2690k6151o066q692J8965l800
15859b6074l8540J3791M5060L9549j7773K5189M5196p951k6173k227l4295k4502
$$ plain form
15847 -8750 -12819 16042 10263 -7042 -7094 -23468 -41852 -33295 -16628 18346 -9247 -27381 -5315
15834 -5315 -10534 -28049 -4813 -18284 -2365 28579 11120 15300 20072 18076 19257 34228 -4219
15821 -4219 -28207 -30118 -53028 -89400 -104958 -81869 -70805 -57933 -43156 -69250 -61282 -42518
15809 -42518 -33396 -35850 -22060 -9652 20150 33850 71457 59123 -6379 -31731 -49021 -71767
15797 -71767 -52382 8531 36177 38475 35511 -12676 -58767 -51716 -47708 -19119 -7175 10682
15785 10682 32284 73506 59173 588 -68925 -3430 13292 -21672 -43308 -16511 -6421 -29764
15773 -29764 -24830 -51840 -44782 -46585 -50119 -32411 -23240 -15344 -16702 -7984 -16786 -18000 7849 9291
15759 9291 -9428 -25890 -10466 -34939 -36785 -2613 8071 28562 -5164 -17602 -47310 -74991
$$ packed form
15847h750m069K8861n779j7305n2j6374j8384Q557J6667L4974k7593j8134K2066
15834e315n219j7515K3236j3471J5919L0944j7459M180M772j996J181J4971l8447
15821d219k3988j911k2910l6372j5558K3089J1064J2872J4777k6094P968J8764
15809d2518R122k454J3790J2408K9802J3700L7607j2334o5502k5352j7290k2746
15797g1767J9385O0913K7646K298k964m8187m6091P051M008K8589J1944J7857
15785A0682K1602M1222j4333n8585o9513O5495J6722l4964k1636K6797J0090k3343
15773b9764M934k7010P058j803l534J7708R171P896j358Q718q802j214K5849J442
15759I291j8719j6462J5424k4473j846L4172J0684K0491l3726j2438k9708k7681
$$ plain form
15747 -74991 -51463 -45360 -56270 -40396 -24977 1685 8771 7714 11533 3249 -5572 -28442 -31379
15734 -31379 -18650 -2154 -7686 -25970 13241 26498 29426 10963 22521 32682 52537 29228
15722 29228 -4249 -1298 12415 18544 518 -66408 -84207 -57248 -26798 -19427 -2582 2193
15710 2193 -10714 32673 53823 42068 7207 -23954 -12569 2834 -3924 -293 -8078 -52825
15698 -52825 -80415 -24003 40630 58273 45055 7519 3495 11182 38405 -5615 6865 26583
15686 26583 61891 40719 31507 43306 52789 -7675 -63780 -45597 -6644 -14896 -42712 -29788
15674 -29788 -37681 -82442 -89351 -61498 -27986 -30637 -25827 -31316 -47722 -21352 -297 20193 20756
15661 20756 -11127 -32625 -11034 9761 -14257 -13531 3151 40382 44492 41610 61624 52163 32897
$$ packed form
15747g4991K3528O103j0910J5874J5419K6662P086j057L819q284q821k2870k937
15734c1379J2729J6496n532j8284L9211J3257K928j8463J1558J0161J9855k3309
15722B9228l3477K951J3713O129j8026o6926j7799K6959L0450P371J6845M775
15710B193j2907M3387K1150j1755l4861l1161J1385J5403o758L631p785m4747
15698e2825k7590N6412O4633J7643j3218l7536m024P687K7223m4020J2480J9718
15686B6583L5308k1172r212J1799R483o0464n6105J8183L8953q252k7816J2924
15674b9788p893m4761o909K7853L3512k651M810n489j6406K6370K1055K0490N63
15661B0756l1883k1498K1591K0795k4018P26J6682L7231M110k882K0014r461j9266
$$ plain form
15648 32897 3889 11876 19692 9064 -1730 15743 47058 24346 3040 -6030 15582 -6501
15636 -6501 -40943 -38933 -24849 9441 15582 55838 78084 63395 52844 19796 6500 -17459
15624 -17459 3044 41425 31848 16216 13271 26393 40876 41583 10237 -8772 -15968 -32686 -4273
15611 -4273 42162 46656 47043 55066 15697 17036 18710 953 31746 30423 26303 48919 31245
15598 31245 3392 10386 5505 -20894 -16833 1271 -15808 30089 26261 36767 47806 76090
15586 76090 51441 33406 18422 28753 28334 24561 23315 38956 45540 8635 22420 11687 12314
15573 12314 5952 -14798 -5505 414 -6580 2277 -35325 -31421 -6618 -17612 -8185 6026 10905
15560 10905 -3593 -43668 -16088 37697 22902 -27421 -818 20160 17014 12013 -11479 -15796
$$ packed form
15648C2897k9008P987P816j0628j0794J7473L1315k2712k1306r070K1612k2083
15636f501l4442K010J4084L4290O141M0256K2246j4689j0551l3048j3296k3959
15624a7459K0503L8381r577j5632k945J3122J4483P07l1346j9009p196j6718K8413
15611d273M6435M494L87Q023l9369J339J674j7757L0793j323m120K2616j7674
15598C1245k7853O994m881k6399M061J8104j7079M5897l828J0506J1039K8284
15586G6090k4649j8035j4984J0331m19l773j246J5641O584l6905J3785j0733O27
15573A2314o362k0750R293N919o994Q857l7602L904K4803j0994R427J4211M879
15560A0905j4498m0075K7580N3785j4795n0323K6603K0978l146n001k3492m317
$$ plain form
15548 -15796 24610 47980 38050 40320 37384 16459 9216 6106 4412 928 42220 30592 3742
15535 3742 -4946 23384 31633 -4616 7655 15279 3473 40874 32414 -19138 -45509 -58611 -34595
15522 -34595 -44728 -60487 -63068 -38501 -3539 10190 -7776 -28618 18379 10077 20425 27569
15510 27569 50018 76643 43955 16569 31484 16466 11413 26160 14585 12357 -18441 4285
15498 4285 27655 11795 1567 -27798 -46484 -853 7188 469 -21194 -23811 2997 -13311
15486 -13311 -17327 -28387 -53493 -53382 -45335 -8882 -12014 3140 29239 26395 59442 59994 18821
15473 18821 -22250 -45301 -33987 -12470 11016 28372 41928 -23139 -69390 -58940 -35123 -25682
15461 -25682 -4433 -32101 -32864 -28314 5448 14732 -14202 -17419 -9909 4043 17381 21643 11183
$$ packed form
15548a5796M0406K3370r930K270k936k0925p243l110j694l484M1292j1628k6850
15535C742q688K8330Q249l6249J2271P624j1806L7401q460n1552k6371j3102K4016
15522c4595j0133j5759k581K4567L4962J3729j7966k0842M6997q302J0348P144
15510B7569K2449K6625l2688k7386J4915j5018n053J4747j1575k228l0798K2726
15498D285K3370j5860j0228k9365j8686M5631Q041o719k1663k617K6808j6308
15486a3311m016j1060k5106J11Q047L6453l132J5154K6099k844L3047N52m1173
15473A8821m1071k3051J1314K1517K3486J7356J3556o5067m6251J0450K3817R441
15461b5682K1249k7668p63M550L3762R284k8934l217P510J3952J3338M262j0460
$$ plain form
15448 11183 4917 4822 16746 -4289 2081 -5324 -56658 -78592 -67686 -47192 -48119 -49847 -70562
15435 -70562 -85257 -48046 -20434 -1003 -24163 -39781 -26360 -25226 2414 -14159 -53395 -23481
15423 -23481 -26632 -35309 -53288 -23244 -14718 -19696 -5361 2034 23587 81153 84872 76936 71827
15410 71827 76691 54654 32204 23890 -12964 -43083 -64172 -70267 -53885 4921 -26790 -87501
15398 -87501 -56380 -45350 -42132 -12940 -25815 -36526 -21899 -9233 -26837 -36561 -44855 -64032
15386 -64032 -78033 -72803 -46058 -86195 -73876 -51106 -27766 -77249 -58636 20716 51538 36003
15374 36003 23338 32787 62064 25417 15120 48149 5627 -38027 -16847 20988 55374 28318
15362 28318 -15373 -43834 -8118 9351 -3119 -10951 -34009 -28848 -2916 -5979 -17485 -51576
$$ packed form
15448A1183o266r5J1924k1035O370p405n1334k1934J0906K0494r27j728k0715
15435g0562j4695L7211K7612J9431k3160j5618J3421J134K7640j6573l9236K9914
15423b3481l151q677j7979L0044Q526m978J4335P395K1553N7566L719p936n109
15410G1827M864k2037k2450q314l6854l0119k1089o095J6382N8806l1711o0711
15398h7501L1121J1030L218K9192j2875j0711J4627J2666j7604r724q294j9177
15386f4032j4001N230K6745m0137J2319K2770K3340m9483J8613P9352L0822j5535
15374C6003j2665R449K9277l6647j0297L3029m2522m3654K1180L7835L4386k7056
15362B8318m3691k8461L5716J7469j2470p832k3058N161K5932l063j1506l4091
$$ plain form
15350 -51576 -21405 22355 60019 -9234 -79025 -63579 -45007 570 -12612 -53083 -87463 -42969
15338 -42969 -20098 -20832 -14812 -8333 -916 15008 12043 1955 -14621 -7039 -25229 -26893 23610
15325 23610 42648 -15118 -75118 -55928 -34173 -18344 17017 35023 23876 7781 -2071 -12946
15313 -12946 -32407 -45721 -26454 17438 8402 -30369 -44600 -16072 31076 43709 2204 -24684
15301 -24684 -19036 -17592 5258 -527 1052 44911 14363 30872 39372 65296 77493 54033 27534
15288 27534 39867 6999 28929 34171 13109 32975 -5942 -38998 -58607 -51703 -29326 -19932
15276 -19932 -13658 -12509 22779 12711 4301 17691 -18052 -62888 -44051 -23768 -50866 -29241
15264 -29241 -12008 24978 53449 24182 6173 -7368 21730 22752 3076 -9837 -1254 -1764
$$ packed form
15350e1576L0171M3760L7664o9253o9791J5446J8572M5577j3182m0471l4380M4494
15338d2969K2871p34O020O479P417J5924k965j0088j6576P582j8190j664N0503
15325B3610J9038n7766o0000J9190K1755J5829L5361J8006j1147j6095r852j0875
15313a2946j9461j3314J9267M3892r036l8771j4231K8528M7148J2633m1505k6888
15301b4684N648J444K2850n785J579M3859l0548J6509Q500K5924J2197k3460k6499
15288B7534J2333l2868K1930N242k1062J9866l8917l3056j9609O904K2377R394
15276a9932O274J149L5288j0068q410J3390l5743m4836J8837K0283k7098K1625
15264b9241J7233L6986K8471k9267j8009j3541K9098J022j9676j2913Q583n10
$$ plain form
15252 -1764 -10046 -5539 -1214 -27592 -26126 -26224 -20631 -87821 -94349 -77232 -39047 3565 -37080 -69026
15238 -69026 -72574 -65162 -44332 -43083 -52890 -54242 -51385 -75570 -110515 -92340 -43985 -34770 -3255
15225 -3255 -17212 -11635 -13354 17616 46717 48209 44122 43622 18934 -8519 3650 -21046 -4624
15212 -4624 -28403 -19561 -6563 29285 36076 23716 4120 -7721 -3420 8731 13575 -11718 -39425
15199 -39425 -79770 -68808 -28221 -3291 -26392 -40191 -33249 -7285 13810 15658 24602 -5085
15187 -5085 -14703 -2957 -13430 -34067 -26003 -10449 1089 -7150 11197 30270 8918 22528
15175 22528 6442 -10166 -23720 -24400 -16187 -22645 -30328 -43580 -44766 -54478 -36447 -22898 -19385
15162 -19385 1412 18188 -23995 -54544 -37671 -7379 3959 -3803 11448 11235 17570 8019 -28096
$$ packed form
15252a764q282M507M325k6378J466r8N593o7190o528J7117L8185M2612m0645l1946
15238f9026l548P412K0830J249r807j352K857k4185l4945J8175M8355R215L1515
15225c255j3957N577j719L0970K9101J492m087n00k4688k7453J2169k4696J6422
15212d624k3779Q842J2998L5848O791j2360j9596j1841M301J2151M844k5293k7707
15199c9425m0345J0962M0587K4930k3101j3799O942K5964K1095J848Q944k9687
15187e085r618J1746j0473k0637Q064J5554J1538q239J8347J9073k1352J3610
15175B2528j6086j6608j3554o80Q213o458p683j3252j186r712J8031J3549L513
15162a9385K0797J6776m2183l0549J6873L0292J1338p762J5251k13O335r551l6115
$$ plain form
15149 -28096 -60220 -46569 -38055 -27887 -30928 -18378 -7374 -68392 -83125 -48447 -37980 -68391
15137 -68391 -83221 -85205 -66103 -18814 20105 10380 -14591 -53045 -15729 8386 39837 -2313
15125 -2313 -3940 16865 33957 56775 27248 -12369 -13547 -21588 -47746 -47353 -37234 -31517 -15280
15112 -15280 15589 4032 -17335 -25418 7693 19201 10401 47926 48167 44423 4777 -17948 -37141
15099 -37141 -43669 -27545 -30737 202 51131 64527 69464 65415 65244 46467 21880 34452 -6018
15086 -6018 -51051 -103414 -87494 -21631 3992 19015 17762 -6774 -26563 -12617 -15514 -26834
15074 -26834 -47204 -39495 -34322 -28561 -4679 1544 -10002 11032 8816 22926 30595 31635 25900
15061 25900 22990 58405 42057 36895 29054 66363 64111 24215 18069 20326 13151 15381 45359
$$ packed form
15149b8096l2124J3651Q514J0168l041J2550J1004o1018j4733L4678J0467l0411
15137f8391j4830j984J9102M7289L8919r725k4971l8454L7316K4115L1451m2150
15125b313j627K0805J7092K2818k9527l9617j178q041k6158L93J0119N717J6237
15112a5280L0869j1557k1367q083L3111J1508q800L7525K41l744l9646k2725j9193
15099c7141o528J6124l192L0939N0929J3396M937m049j71j8777k4587J2572m0470
15086f018m5033n2363J5920O5863K5623J5023j253k4536j9789J3946k897j1320
15074b6834k0370P709N173N761K3882O223j1546K1034k216J4110P669J040n735
15061B5900k910L5415j6348n162p841L7309k252l9896o146K257p175K230K9978
$$ plain form
15048 45359 58176 28130 1543 -1352 -9453 -13099 4287 -24191 -24632 -7023 -27244 -23936 -19054
15035 -19054 -22051 8849 26352 20731 23811 41932 50513 -12342 -35951 -21261 -26315 752 -21441
15022 -21441 -7936 47947 48244 16129 5714 27019 48241 16920 35335 11619 -17462 -12581
15010 -12581 -6786 -23470 -44708 -33038 -12492 836 2906 -8352 -29614 -47468 -19526 19703
14998 19703 30814 22919 23653 38081 34876 12973 -13283 -21361 28452 26181 -32760 -15246 19484
14985 19484 33549 41453 33922 16496 -6771 -29046 -58034 -91023 -55715 -26561 8224 24287
14973 24287 34585 33058 2530 9029 16887 -33851 -13915 36349 40048 -1527 -8679 -20517 13578
14960 13578 -15842 -19563 23577 -152 -16964 -11858 -40322 -42956 -35247 -29022 -27117 6305 22363
$$ packed form
15048D5359J2817l0046k6587k895q101l646J7386k8478m41J7609k0221L308M882
15035a9054k997L0900J7503n621L080J8121Q581o2855k3609J4690n054K7067k2193
15022b1441J3505N5883K97l2115j0415K1305K1222l1321J8415k3716k9081M881
15010a2581N795j6684k1238J1670K0546J3328K070j1258k1262j7854K7942L9229
14998A9703J1111p895P34J4428l205k1903k6256q078M9813k271n8941J7514L4730
14985A9484J4065P904p531j7426k3267k2275k8988l2989L5308K9154L4785J6063
14973B4287J0298j527l0528O499P858n0738J9936N0264L699m1575p152j1838L4095
14960A3578k9420l721M3140k3729j6812N106k8464k634P709O225J905L3422J6058
$$ plain form
14947 22363 -4999 25270 29956 -7317 -29223 -59506 -38200 8847 -10917 -16948 -16157 -33126
14935 -33126 -23087 -5955 14682 53797 54908 56588 52016 43806 13549 35617 20582 35652
14923 35652 42174 59596 38173 15220 -6612 -8828 -1571 -26946 -12586 32121 10060 11087
14911 11087 31661 31208 33797 40022 25764 48201 52760 23596 -15126 -3107 -14133 -39765 -45732
14898 -45732 -33945 -17511 -33859 -9504 19099 4509 16877 -11819 -20242 -39096 -39260 -53087
14886 -53087 -67469 -79469 -59422 -3077 34917 23397 -34450 -51088 -51152 -38127 -56389 -54915
14874 -54915 -22381 31202 34705 17190 19271 2920 -33958 -32469 -37867 -40987 21218 67145 89049
14861 89049 111196 142965 83068 28693 34960 63222 58354 42492 3259 -9699 342 36925
$$ packed form
14947B2363k7362L0269M686l7273k1906l0283K1306M7047j9764o031P91j6969
14935c3126J0039J7132K0637L9115J111J680m572q210l0257K2068j5035J5070
14923C5652O522J7422k1423k2953k1832k216P257k5375J4360M4707k2061J027
14911A1087K0574m53K589O225j4258K2437M559k9164l8722J2019j1026k5632n967
14898d5732J1787J6434j6348K4355K8603j4590J2368k8696q423j8854j64j3827
14886e3087j4382j2000K0047N6345L7994j1520n7847j6638o4J3025j8262J474
14874e4915L2534N3583L503j7515K081j6351l6878J489n398l120O2205M5927K1904
14861H9049K2147L1769n9897n4375O267K8262m868j5862l9233j2958J0041L6583
$$ plain form
14849 36925 62830 42397 43231 39309 49075 48524 57168 57958 50096 22182 5113 32440 36159 -9529
14835 -9529 -43226 -42925 -24463 -3551 15549 70760 80771 29067 7799 14328 38282 35106 45142
14822 45142 29366 3331 3698 3147 2765 -21921 -43865 -30603 -34645 -13745 5912 11424 20133
14809 20133 16899 2424 -9734 -16029 -5589 -17566 -19645 13409 35900 6042 -30521 -56183
14797 -56183 -78804 -92624 -88315 -38695 8530 17445 45136 39044 13864 -18633 -49696 -25453
14785 -25453 -10503 16133 37806 60391 45183 5859 -3368 -21343 -48270 -36069 -19074 -26632
14773 -26632 -23538 -8416 -13126 -22779 -27112 -9287 -3100 -4632 15277 9633 48553 61220 49045
14760 49045 64196 70609 47638 25265 34766 78187 88690 84979 60311 28191 14107 -7880
$$ packed form
14849C6925K5905k0433Q34l922R766n51Q644P90p862k7914j7069K7327L719m5688
14835i529l3697L01J8462K0912J9100N5211J0011n1704k1268O529K3954l176J0036
14822D5142j5776k6035L67n51l82k4686k1944J3262m042K0900J9657N512Q709
14809B0133l234j4475j2158o295J0440j1977k079L3054K2491k9858l6563k5662
14797e6183k2621j3820M309M9620M7225Q915K7691o092k5180l2497l1063K4243
14785b5453J4950K6636K1673K2585j5208l9324r227j7975k6927J2201J6995p558
14773b6632L094J5122m710r653m333J7825O187j532J9909n644L8920J2667j2175
14760D9045J5151O413k2971k2373R501M3421J0503l711k4668l2120j4084k1987
$$ plain form
14748 -7880 9192 10758 -4350 -23952 -11349 559 8052 -2035 20713 65140 84861 94474
14736 94474 113468 90301 88735 53930 14479 15907 16858 -8215 -26266 -12374 -14344 -23152 -27843
14723 -27843 5517 20379 45778 39048 -1022 5579 22163 38915 8965 -39764 -49498 -29015
14711 -29015 -49452 -49620 -29827 16663 40858 17284 -9449 36538 75114 30343 2052 39471
14699 39471 37924 12745 -50989 -76068 -26928 11886 33137 29240 30576 -24786 -55248 -29398
14687 -29398 -5551 1519 15051 19714 -8073 -39129 -56911 -1343 21685 15268 -4082 23514
14675 23514 44666 52794 40069 57175 35687 -12583 -17257 -4923 -17113 -33691 -13167 -50354
14663 -50354 -46331 -42377 -9242 -18542 -45488 -60038 -74618 -41960 -3724 48102 99923 70843
$$ packed form
14748g880J7072J566j5108j9602J2603J1908P493j0087K2748M4427J9721R613
14736I4474J8994k3167j566l4805l9451J428R51k5073j8051J3892j970q808m691
14723b7843L3360J4862K5399o730m0070O601J6584J6752k9950m8729r734K0483
14711b9015k0437j68J9793M6490K4195k3574k6733M5987L8576m4771k8291L7419
14699C9471j547k5179o3734k5079M9140L8814K1251l897J336n5362l0462K5850
14687b9398K3847P070J3532M663k7787l1056j7782N5568K3028o417j9350K7596
14675B3514K1152Q128j2725J7106k1488m8270m674J2334j2190j6578K0524l7187
14663e0354M023L954L3135r300k6946j4550j4580L2658L8236N1826N1821k9080
$$ plain form
14651 70843 29915 48476 47139 30541 -20560 -26890 8263 8431 33066 31432 43769 72904 84681
14638 84681 56167 -13078 -31342 -22243 -30218 -1177 5940 -24608 -21681 -49011 -31858 -29648 -47936
14625 -47936 -29178 -12516 -22979 -25232 -8482 16758 15797 -367 -15869 -437 -28083 -36110
14613 -36110 -44240 -28952 -29515 -54038 -33734 10992 21833 -11294 -22134 -34021 -34137 -42935 -36853
14600 -36853 -15202 16395 -43904 -54938 -20913 -15063 -3099 56865 54025 29787 -14595 -28036
14588 -28036 -23846 -30171 -58296 -64814 -30953 -5818 -9618 15300 1821 14002 19507 2578 14350
14575 14350 23654 37746 30214 7543 16969 24738 44641 25988 42235 37413 21783 17532 -13797
14562 -13797 -25630 -24604 -7719 35335 58319 35059 28271 11044 4459 5133 32408 30375 -9379
$$ packed form
14651G0843m0928J8561j337j6598n1101o330L5153J68K4635j634J2337K9135J1777
14638H4681k8514o9245j8264R099p975K9041P117l0548K927k7330J7153K210j8288
14625d7936J8758J6662j0463k253J6750K5240r61j6164j5502J5432k7646q027
14613c6110q130J5288n63k4523K0304M4726J0841l3127j0840j1887j16q798O082
14600c6853K1651L1597o0299j1034L4025N850J1964N9964k840k4238m4382j3441
14588b8036M190o325k8125o518L3861K5135l800K4918j3479J2181N505j6929J1772
14575A4350R304J4092p532k2671R426P769J9903j8653J6247m822j5630m251l1329
14562a3797j1833J026J6885M3054K2984k3260o788j7227o585O74K7275k033l9754
$$ plain form
14549 -9379 -6903 -20338 6284 58615 -2771 -26170 5487 -1313 -15392 -18268 -5569 3415 26513
14536 26513 36592 25721 1950 -9523 480 -20901 -43379 -38239 -31315 -8472 10156 21605
14524 21605 35602 41101 9937 -7938 6393 24106 5113 12861 15354 -1507 -23016 -50706
14512 -50706 -37231 11421 43470 21707 741 12341 17773 315 14908 17912 27094 54330
14500 54330 37636 39161 46161 53608 59854 26025 -7783 -16920 -29375 -47133 -45412 9179 20352
14487 20352 5937 -934 34064 20489 6959 24290 5089 12206 31890 16194 872 29590
14475 29590 29773 9029 -4661 13803 -28304 -44838 -61174 -39313 -27044 -52795 -47875 -34113
14463 -34113 -21293 -5415 -14266 -27297 -73820 -41267 -20508 -41897 -79727 -69505 -61030 -23540
$$ packed form
14549i379K476j3435K6622N2331o1386k3399L1657o800j4079k876J2699Q984K3098
14536B6513J0079j0871k3771j1473J0003k1381k2478N140O924K2843J8628J1449
14524B1605J3997N499l1164j7875J4331J7713j8993P748K493j6861k1509k7690
14512e0706J3475M8652L2049k1763k0966J1600N432j7458J4593L004R182K7236
14500E4330j6694J525P000P447O246l3829l3808r137j2455j7758J721N4591J1173
14487B0352j4415o871L4998j3575j3530J7331j9201P117J9684j5696j5322K8718
14475B9590J83k0744j3690J8464m2107j6534j6336K1861J2269k5751M920J3762
14463c4113J2820J5878q851j3031m6523L2553K0759k1389l7830J0222Q475L7490
$$ plain form
14451 -23540 -14954 -54271 -69318 -52625 -67116 -49188 -20786 -20214 -58583 -59091 -23494 12431 188
14438 188 -42932 -36074 27957 47523 19878 14944 -26601 -76666 -91449 -62149 -12231 1939
14426 1939 -1086 17295 38550 78238 96869 62613 -17327 -46012 -84085 -103690 -102852 -64103
14414 -64103 -53201 -31040 7918 -5733 -51738 -56070 -32035 -22865 19792 40945 12998 -9911
14402 -9911 7532 -16737 -26809 -7006 -28189 -53719 -49402 -40609 -23756 -9239 2793 21029
14390 21029 3138 25709 14890 -27204 8086 12556 3316 13677 7261 20853 -20585 -41392
14378 -41392 -31181 -34448 -62149 -25571 23504 25550 -19548 -55312 -53635 -7283 21324 32068
14366 32068 8517 2807 -873 -31103 -25886 20545 31219 23609 7667 9815 35732 48696 84766
$$ packed form
14451b3540Q586l9317j5047J6693j4491J7928K8402N72l8369n08L5597L5925j2243
14438A88m3120O858O4031J9566k7645m934m1545n0065j4783K9300M9918J4170
14426A939l025J8381K1255L9688J8631l4256p9940k8685l8073j9605Q38L8749
14414f4103J0902K2161L8958j3651m6005m332K4035R170M2657K1153k7947k2909
14402i911J7443k4269j0072J9803k1183k5530M317Q793J6853J4517J2032J8236
14390B1029j7891K2571j0819m2094L5290M470r240J0361o416J3592m1438k0807
14378d1392J0211l267k7701L6578M9075K046m5098l5764J677M6352K8607J0744
14366C2068k3551n710l680l0230N217M6431J0674p610j5942K148K5917J2964L6070
$$ plain form
14353 84766 76205 47524 28595 22935 48053 65273 36647 53677 105216 68669 8953 20707
14341 20707 13838 -24278 -12778 -22683 -18551 -12303 -54314 -67269 -44096 -52816 -27094 -27343 -29868
14328 -29868 -38206 -48795 -62190 -46685 -25506 -36249 -52274 -26253 6692 12984 3096 -3219
14316 -3219 -2884 -8510 -26582 -38355 -24857 -13649 2292 -7283 10579 3248 2430 -9442 -19053
14303 -19053 -7560 -9527 518 -27280 -56424 -41749 -49615 -45451 -53490 -56415 -52114 -31431 -4134
14290 -4134 6507 9393 27285 7056 -18476 -69794 -51045 -43001 -16115 250 -1771 8107 17700
14277 17700 -9728 -29762 -8952 14904 -1109 -14378 13038 10021 -20003 -22216 -22898 1104
14265 1104 1981 26958 30944 24087 5919 2108 -41282 -34390 -18819 -16597 6329 -6186 -10950
$$ packed form
14353H4766q561k8681j8929n660K5118J7220k8626J7030N1539l6547n9716J1754
14341B0707o869l8116J1500r905M132O248m2011j2955K3173q720K5722k49k525
14328b9868q338j0589j3395J5505K1179j0743j6025K6021L2945O292r888o315
14316c219L35n626j8072j1773J3498J1208J5941r575J7862p331q18j1872r611
14303a9053J1493j967J0045k7798k9144J4675p866M164q039k925M301K0683K7297
14290d134J0641K886J7892k0229k5532n1318J8749Q044K6886J6365k021R878R593
14277A7700k7428k0034K0810K3856j6013j3269K7416l017l0024k213o82K4002
14265A104Q77K4977L986o857j8168l811m3390O892J5571K222K2926j2515m764
$$ plain form
14252 -10950 12730 16722 -6852 -14765 3121 8994 20575 -2947 4292 36196 7831 25566
14240 25566 58633 2444 -27552 -30477 -56597 -26137 -6664 9566 15362 23742 18946 7537
14228 7537 5919 -3811 -14893 319 12729 45723 45247 25275 9617 37975 49076 6572 9160
14215 9160 25301 40353 56879 108087 114477 87392 38391 36508 58071 31664 20599 3543
14203 3543 -15743 -9783 -29803 -29342 -35848 -39451 -6763 56636 38436 24316 -13437 -44264 -54174
14190 -54174 -43515 -23156 -13619 -25932 -44054 -13588 -20030 -16796 -5853 1235 1057 16070 4682
14177 4682 978 39138 51212 56488 35813 7461 -19036 -36818 -47772 -29935 -18375 -28495
14165 -28495 -52771 -64852 -51878 -37093 -37910 -15616 -50621 -61785 -76536 -60236 -66001 -66097 -56564
$$ packed form
14252a0950K3680L992k3574p913J7886N873J1581k3522P239L1904k8365J7735
14240B5566L3067n6189k9996k925k6120L0460J9473J6230N796Q380m796j1409
14228G537j618r730j1082J5212J2410L2994m76j9972j5658K8358J1101m2504K588
14215I160J6141J5052J6526N1208O390k7085m9001j883K1563k6407j1065j7056
14203C543j9286N960k0020M61o506l603L2688O3399j8200j4120l7753l0827r910
14190e4174J0659K0359R537j2313j8122L0466o442L234J0943P088j78J5013j1388
14177D682l704L8160J2074N276k0675k8352k6497j7782j0954J7837J1560j0120
14165b8495k4276j2081J2974J4785q17K2294l5005j1164j4751J6300n765r6R533
$$ plain form
14152 -56564 -50368 -32593 18481 10321 -15443 20842 39172 38972 193 -28018 -5686 -15168 -20997
14139 -20997 20319 71594 72524 46994 388 34457 33312 11542 -13750 -9660 1246 2598 9757
14126 9757 5431 13039 15718 -10100 -10326 2603 -27067 -54044 -67926 -54586 -9342 14260 20886
14113 20886 44050 40121 29767 42315 37759 -14099 -28118 -15076 4242 14226 22562 -2399
14101 -2399 -31769 -30584 -11774 10282 5511 -4193 785 -14895 -25871 -16357 -20631 -45415 -62799
14088 -62799 -33575 -20257 -23675 -618 -12722 -54127 -12661 8607 22120 18180 -11766 -19613
14076 -19613 -80285 -88436 -77491 -65872 -21812 -40559 -104326 -49182 1296 -41635 -55825 -45760
14064 -45760 -31784 -184 2007 -12502 2799 -14888 6199 3890 6302 24781 -6029 2516
$$ packed form
14152e6564O196J7775N1074q160k5764L6285J8330k00l8779k8211K2332r482n829
14139b0997M1316N1275R30k5530m6606L4069j145k1770k5292M090J0906J352P159
14126I757m326P608K679k5818k26J2929k9670k6977j3882J3340M5244K3602O626
14113B0886K3164l929j0354J2548m556n1858j4019J3042J9318R984Q336k4961
14101b399k9370J185J8810K2056m771r704M978j5680j0976R514m274k4784j7384
14088f2799K9224J3318l418K3057j2104m1405M1466K1268J3513l940k9946p847
14076a9613o0672q151J0945J1619M4060j8747o3767N5144N0478m2931j4190J0065
14064d5760J3976L1600K191j4509J5301j7687K1087k309K412J8479l0810Q545
$$ plain form
14052 2516 -26628 -33296 22815 14010 -2319 13213 36558 24638 14519 -27035 -40352 -21790
14040 -21790 -13619 6595 -7909 3310 -25426 -74646 -66456 -17098 -27431 -5396 18402 6418
14028 6418 -19863 -1657 -5347 27867 47226 7817 -7188 -6961 644 639 12203 9047 -17504 -20355
14014 -20355 -2802 2355 -4695 3554 47956 49796 17780 17099 4429 -29204 -55060 -38481 -37533
14001 -37533 -1218 -7444 -22728 -34548 -43646 -63939 -56930 -54576 -47886 -9248 30336 -3838 -15278
13988 -15278 -4653 1639 -29409 -68174 -78294 -28502 42371 26299 6625 36167 77642 100637
13976 100637 77287 68718 20882 -30562 -29718 -22689 11126 18183 21495 55881 79220 65157 77498
13963 77498 32087 -17129 -6052 23048 -3243 -16761 -23793 -25756 -30851 -5417 14149 33769
$$ packed form
14052B516k9144o668N6111q805j6329J5532K3345j1920j0119m1554j3317J8562
14040b1790Q171K0214j4504J1219k8736m9220Q190M9358j0333K2035K3798j1984
14028F418k6281J8206l690L3214J9359l9409j5005K27P605nJ1564l156k6551k851
14014b0355J7553N157p050Q249M4402J840l2016o81j2670l3633k5856J6579R48
14001c7533L6315o226j5284j1820r098k0293P009K354O690L8638L9584l4174j1440
13988a5278J0625O292l1048l8765j0120M9792P0873j6072j9674K9542M1475K2995
13976A00637k3350q569m7836n1444Q44P029L3815P057L312L4386K3339j4063J2341
13963G7498m5411m9216J1077K9100k6291j3518p032j963n095K5434J9566J9620
$$ plain form
13951 33769 61623 61197 70875 21745 -10695 19125 12575 -13620 23728 56992 68227 70034 35476
13938 35476 13127 14314 9639 -2378 35609 63337 45869 23176 -11801 18057 823 7822
13926 7822 37301 19831 16928 27111 34585 31055 36129 58672 69974 65580 100285 175526 188200
13913 188200 244100 364987 427859 505089 524496 481548 420831 338221 276840 232619 171001
13902 171001 147320 131148 120084 120458 116859 102985 111379 147622 105943 78042 54471 43842
13890 43842 21484 20765 37863 56632 51150 32567 59735 82674 105986 107281 81956 93931
13878 93931 88828 75358 86693 132916 180657 221012 317936 437513 617313 855789 1024856
13867 1024856 1076325 1011168 831907 676830 517206 371104 301890 282308 231658 221088
$$ packed form
13951C3769K7854m26R678m9130l2440K9820o550k6195L7348L3264J1235J807l4558
13938C5476k2349J187m675j2017L7987K7728j7468k2693l4977K9858j7234O999
13926G822K9479j7470k903J0183P474l530N074K2543J1302m394L4705P5241J2674
13913A88200N5900J20887O2872P7230J9407m2948o0717q2610o1381m4221o1618
13902A71001k3681j6172j1064L74l599j3874Q394L6243m1679k7901k3571j0629
13890D3842k2358p19J7098J8769n482j8583K7168K2939K3312J295k5325J1975
13878I3931n103j3470J1335M6223M7741M0355R6924J19577J79800K38476J69067
13867A024856N1469o5157j79261j55077j59624j46102o9214j9582n0650j0570
$$ plain form
13857 221088 178933 151004 135121 120139 123881 112037 93249 100026 135723 112666 90592 82595
13845 82595 92338 65643 60316 40427 30006 27796 29786 10631 5991 13675 40516 87790 120623
13832 120623 157922 212098 214453 238629 369497 515558 579350 571431 523050 442964 360873
13821 360873 289704 254003 190735 91183 20698 9899 12835 19487 38904 21133 21986 42434
13809 42434 39004 46736 28935 -17252 -53164 -29453 -2790 -25989 -52551 -41485 -1597 49401
13797 49401 45787 17900 17903 5866 3099 -11083 -49729 -41743 9619 25293 43456 49530 40231
13784 40231 46616 51423 92717 73927 47306 67782 54381 50010 43316 40326 2101 2106 31471
13771 31471 48631 30453 10257 -23875 -18539 -5199 -17772 -5780 24309 31385 21506 34128
$$ packed form
13857B21088m2155k7929j5883j4982L742j1844j8788O777L5697k3057k2074p997
13845H2595R743k6695n327j9889j0421k210J990j9155m640P684K6841M7274L2833
13832A20623L7299N4176K355K4176J30868J46061O3792p919m8381q0086q2091
13821C60873p1169l5701o3268r9552p0485j0799K936O652J9417j7771Q53K0448
13809D2434l430P732j7801m6187l5912K3711K6663k3199k6562J1066L9888N0998
13797D9401l614k7887Lj2037k767j4182l8646P986N1362J5674J8163O074r299
13784D0231O385M807M1294j8790k6621K0476j3401m371o694k990l8225NK9365
13771C1471J7160j8178k0196l4132N336J3340j2573J1992L0089P076r879J2622
$$ plain form
13759 34128 66334 66286 47243 26589 48070 52906 51498 49988 41541 37560 22479 -15063 -27521
13746 -27521 -13436 -13029 -16784 -1062 8387 48662 108498 86332 90469 22949 -37780 -22860 9483
13733 9483 16081 25534 22070 29531 32937 21847 18565 3181 26298 53414 36345 22086 28094
13720 28094 34315 32736 57319 76651 57769 23159 8430 4685 54050 83430 35294 25591
13708 25591 28692 19499 81565 74074 75801 66006 38859 25551 54101 79291 74012 121173 165283
13695 165283 147655 118938 76637 58755 73388 96885 111044 87658 88871 105754 106928 88997
13683 88997 99940 105902 81497 68430 72135 100124 117089 106845 105423 81651 72263 75478 88655
13670 88655 76848 40258 42822 84383 96331 94403 47619 1156 11812 52020 70708 107966
$$ packed form
13759C4128L2206m8j9043k0654K1481M836j408j510q447l981j5081l7542j2458
13746b7521J4085M07l755J5722R449M0275N9836k2166M137o7520o0729J4920L2343
13733I483O598R453l464P461L406j1090l282j5384K3117K7116j7069j4259O008
13720B8094O221j579K4583J9332j8882l4610j4729l745M9365K9380m8136r703
13708B5591L101r193O2066p491J727r795k7147j3308K8550K5190n279M7161M4110
13695A65283j7628k8717m2301j7882J4633K3497J4159k3386J213J6883J174j7931
13683H8997J0943N962k4405j3067L705K7989J6965j0244j422k3772r388L215J3177
13670H8655j1807l6590K564M1561J1948j928m6784m6463J0656M0208J8688L7258
$$ plain form
13658 107966 113536 144263 159899 168835 179264 162717 163836 196786 192612 146478 149032 159448
13646 159448 146305 146496 158646 144714 100530 119937 137640 117574 81854 67651 61339 66906
13634 66906 57335 64906 47180 55465 87148 85349 49098 25464 35966 88813 108639 89118
13622 89118 50995 54122 63054 63062 35874 25324 17897 35183 41859 76468 64097 56316 99208
13609 99208 96515 83174 80801 96129 110695 99418 93079 91341 95467 78418 60866 45867 20476
13596 20476 -22592 -29306 -33284 -51342 -102149 -88285 -7124 15525 22176 45564 42526 36124 54073
13583 54073 47176 73088 64454 55177 93156 140137 142617 124068 124066 104084 57672 76137 96219
13570 96219 95873 147133 164640 197395 206350 186853 165207 170062 127924 96601 100426 125150 135003
$$ packed form
13658A07966N570L0727J5636Q936J0429j6547J119L2950m174m6134K554J0416
13646A59448j3143J91J2150j3932m4184J9407J7703k0066l5720j4203o312N567
13634F6906r571P571j7726Q285L1683j799l6251k3634J0502N2847J9826j9521
13622H9118l8123L127Q932Qk7188j0550p427J7286O676L4609j2371p781M2892
13609I9208k693j3341k373J5328J4566j1277o339j738M126j7049j7552j4999k5391
13596B0476m3068o714l978j8058n0807J3864Q1161K2649O651K3388l038o402J7949
13583E4073o897K5912q634r277L7979M6981K480j8549kj9982m6412J8465K0082
13570I6219l46N1260J7507L2755Q955j9497k1646M855m2138l1323L825K4724R853
$$ plain form
13557 135003 120907 94121 84921 21971 -61978 -133075 -241329 -299679 -277278 -233554 -142485
13546 -142485 -79311 -45960 -18363 27092 37362 53527 80183 114559 129953 140354 121276
13535 121276 130765 120525 158468 223389 214037 190463 179336 227457 266540 266130 262905 278582
13523 278582 291627 307122 283999 279346 284134 268678 256069 298260 300779 246036 201795 155519
13511 155519 116090 99561 30835 22526 10274 30756 64612 111244 168634 157459 171042 189510
13499 189510 182488 164062 200368 200712 179482 201513 205455 237400 254834 247044 274145 269220 338124
13486 338124 389991 389054 432662 495169 523036 555333 575203 565162 552906 494816 480501 535654
13474 535654 555648 573574 592663 648667 744416 809634 846414 834743 871752 949948 1009381
$$ packed form
13557A35003j4096k6786r200o2950q3949p1097j08254n8350K2401M3724R1069
13546a42485O3174L3351K7597M5455J0270J6165K6656L4376J5394J0401j9078
13535A21276R489j0240L7943O4921r352k3574j1127M8121L9083m10l225J5677
13523B78582J3045J5495k3123m653M788j5456j2609M2191K519n4743m4241m6276
13511A55519l9429j6529o8726q309j2252K0482L3856M6632N7390j1175J3583J8468
13499A89510p022j8426L6306L44k1230K2031L942L1945J7434p790K7101m925O8904
13486C38124N1867r37M3608O2507K7867L2297J9870j0041j2256n8090j4315N5153
13474E35654J9994J7926J9089N6004R5749O5218L6780j1671L7009P8196N9433
$$ plain form
13463 1009381 1047315 1124246 1207438 1319468 1470473 1636006 1816723 1984259 2201424 2487628
13453 2487628 2856753 3359680 3885748 4458440 5167841 6098727 7299962 8915480 11090548
13444 11090548 14094326 18419303 24908546 35105844 50656519 71263249 90173674
13437 90173674 96833618 89468823 74326246 57296224 42571119 31784059 24356079
13430 24356079 19314935 15859476 13413693 11586849 10229334 9214534 8442381 7791806
13422 7791806 7218212 6767256 6410412 6129796 5936448 5853164 5876658 6013190 6222015 6465192
13412 6465192 6868414 7567947 8496878 9527436 10637264 11886110 13479343 15676888 18740852
13403 18740852 22888063 28604445 36848290 49302417 68918891 99516312 142781109
$$ packed form
13463A009381L7934P6931Q3192J12030J51005J65533J80717J67536K17165K86204
13453B487628L69125N02927N26068N72692P09401R30886J201235J615518K175068
13444A1090548L003778M324977O489243J0197298J5550675K0606730J8910425
13437I0173674O659944p364795j5142577j7030022j4725105j0787060p427980
13430B4356079n041144l455459k445783j826844j357515j014800p72153o50575
13422G791806n73594m50956l56844k80616j93348q3284K3494J36532K08825K43177
13412F465192M03222O99533R28931J030558J109828J248846J593233K197545L063964
13403A8740852M147211N716382Q243845J2454127J9616474L0597421M3264797
$$ plain form
13396 142781109 189318910 213702935 201119392 166713822 126797476 91452533 65924437
13389 65924437 49047180 37976116 30494329 25203826 21295312 18403553 16229476 14532784
13381 14532784 13087749 11793493 10656546 9659265 8785788 8088815 7556207 7194151 6946501
13372 6946501 6747709 6668454 6745121 6929419 7199929 7571894 8021769 8603685 9387633 10469055
13362 10469055 11985580 14135560 17093295 21306172 27627317 37382680 52333470 72990059
13354 72990059 94306070 105447473 101086009 86023511 67273574 50080061 36893179
13347 36893179 27675881 21431020 17146678 14106987 11846085 10146680 8803479 7777622
13339 7777622 6969249 6257609 5554858 4935523 4377974 3917885 3543350 3237887 2980436
$$ packed form
13396A42781109M6537801K4384025j2583543l4405570l9916346l5344943k5528096
13389F5924437j6877257j1071064p481787n290503l908514k891759k174077j696692
13381A4532784j445035j294256j136947r97281q73477o96973n32608l62056k47650
13372F946501j98792p9255P6667J84298K70510L71965M49875N81916P83948J081422
13362A0469055J516525K149980K957735M212877O321145R755363J4950790K0656589
13354G2990059K1316011J1141403m361464j5062498j8749937j7193513j3186882
13347C6893179r217298o244861m284342l039691k260902j699405j343201j025857
13339G777622q08373p11640p02751o19335n57549m60089l74535l05463k57451
$$ plain form
13330 2980436 2753379 2547459 2354067 2206332 2071098 1940494 1850272 1742978 1651392 1546799
13320 1546799 1482114 1455539 1384652 1329650 1281449 1227669 1198363 1172596 1135666 1055213 987695
13309 987695 932643 879272 835735 775544 758726 723774 679397 629072 606054 608074 588365 562638
13297 562638 577574 613852 620136 648465 609850 565492 562217 545875 520941 518166 549239 537376
13285 537376 517785 585949 595548 595710 589956 557181 509356 485038 440357 364305 319410 355718
13273 355718 400629 378546 342710 278472 262014 273720 279429 271725 240755 226845 218446 229234
13261 229234 221910 195450 147426 131945 166247 179772 233059 261411 276399 289620 259342 280019
13249 280019 293271 313845 295967 313802 335751 338140 411640 491373 545534 580685 555848 511006
$$ packed form
13330B980436k27057k05920j93392j47735j35234j30604r0222j07294r1586j04593
13320A546799o4685k6575p0887n5002m8201n3780k9306k5767l6930q0453o7518
13309I87695n5052n3371m3537o0191j6818l4952m4377n0325k3018K020j9709k5727
13297E62638J4936L6278O284K8329l8615m4358l275j6342k4934k775L1073j1863
13285E37376j9591O8164R599J62n754l2775m7825k4318m4681p6052m4895L6308
13273C55718M4911k2083l5836o4238j6458J1706N709p704l0970j3910q399J0788
13261B29234p324k6460m8024j5481L4302J3525N3287K8352J4988J3221l0278K0677
13249B80019J3252K0574j7878J7835K1949K389P3500P9733N4161L5151k4837m4842
$$ plain form
13237 511006 402718 313375 253538 207984 163503 123070 144164 175925 163174 139183 102876
13226 102876 117571 90781 52425 73906 138685 141010 133875 136419 103294 84593 107328 121065
13214 121065 101662 88984 86862 88433 104720 125589 101434 112607 132400 169537 127024 121762
13202 121762 125844 167214 223247 306959 358267 338034 300466 231629 168824 112475 83716 46659
13190 46659 37464 48769 42109 34824 39004 32212 33623 60757 96287 105178 86317 81449 47222
13177 47222 28809 34376 25393 37516 30652 17870 7088 13432 12810 8157 44805 61592 50995
13164 50995 31729 1207 -7361 -15499 -8557 23443 23976 32039 37438 20779 43323 78965 74366
13151 74366 40462 44754 25947 16632 5475 47722 76042 99893 73522 47410 33402 59508
$$ packed form
13237E11006j08288q9343n9837m5554m4481m0433K1094L1761j2751k3991l6307
13226A02876J4695k6790l8356K1481O4779K325p135K544l3125j8701K2735J3737
13214A21065j9403j2678k122J571J6287K0869k4155J1173J9793L7137m2513n262
13202A21762M082M1370N6033Q3712N1308k0233l7568o8837o2805n6349k8759l7057
13190D6659r195J1305o660p285M180o792J411K7134L5530Q891j8861m868l4227
13177D7222j8413N567q983J2123o864j2782j0782O344o22m653L6648J6787j0597
13164E0995j9266l0522q568q138O942L2000N33Q063N399j6659K2544L5642m599
13151G4366l3904M292j8807r315j1157M2247K8320K3851k6371k6112j4008K6106
$$ plain form
13139 59508 13712 -25343 -13041 5354 28821 59482 48829 6977 -5997 -8244 18016 60970
13127 60970 66036 39563 39586 54553 60607 53657 78633 96384 80229 17387 -6538 8858 31933
13114 31933 14426 4818 4159 13296 -236 -10024 32301 46939 24108 -14105 -37246 -27002 -14029
13101 -14029 -8002 15630 22810 6869 14254 -393 -2954 1275 51476 107682 98954 60356 34077
13088 34077 -1454 -19318 -10788 -33735 -42792 -41465 -30360 19577 51662 50532 42543 68314 54383
13075 54383 41335 32274 22384 27002 62502 74378 56630 -18607 -10132 15229 1464 -1256 -9164
13062 -9164 -10765 4750 67948 87994 60348 25440 19684 46954 58223 37362 33076 27789 28396
13049 28396 39751 29340 16053 32798 31892 26226 -5022 -5029 24943 28766 25675 76860 139587
$$ packed form
13139E9508m5796l9055J2302J8395K3467L0661j0653m1852j2974k247K6260M2954
13127F0970N066k6473K3J4967O054o950K4976J7751j6155o2842k3925J5396K3075
13114C1933j7507r608o59R137j3532r788M2325J4638k2831l8213k3141J0244J2973
13101a4029O027K3632P180j5941P385j4647k561M229N0201N6206q728l8598k6279
13088C4077l5531j7864Q530k2947r057J327J1105M9937L2085j130p989K5771j3931
13075E4383j3048r061r890M618L5500J1876j7748p5237Q475K5361j3765k720p908
13062i164j601J5515O3198K0046k7646l4908n756K7270J1269k0861m286n287O07
13049B8396J1355j0411j3287J6745r06n666l1248pK9972L823l091N1185O2727
$$ plain form
13036 139587 150648 82472 17527 21945 5931 -11455 -17971 -20712 16506 10583 -6436 10421
13024 10421 15348 6506 -2109 -4042 8299 40785 38303 18877 282 -22348 -48413 -52728 -37289
13011 -37289 -13703 4521 -1616 -3766 25564 59286 25945 -3584 -19914 -8218 27234 33656
12999 33656 18099 36114 32440 68756 50189 26406 9509 22500 31344 18912 48848 74619
12987 74619 67033 29403 11068 40279 31774 27692 21562 35509 32501 14463 29822 46149 49337
12974 49337 45438 39144 46509 80036 82210 91178 106305 120840 128566 131130 158293 205423 214407
12961 214407 208257 286865 343344 415592 457285 459138 465164 451164 379006 295551 262594 237873
12949 237873 202278 171087 161594 173652 197840 153399 93691 51467 49386 49109 30695 3338
$$ packed form
13036A39587J1061o8176o4945M418j6014j7386o516k741L7218n923j7019J6857
13024A0421M927q842q615j933J2341L2486k482j9426j8595k2630k6065m315J5439
13011c7289K3586J8224o137k150K9330L3722l3341k9529j6330J1696L5452O422
12999C3656j5557J8015l674L6316j8567k3783j6897J2991Q844j2432K9936K5771
12987G4619p586l7630j8335K9211q505m082o130J3947l008j8038J5359J6327L188
12974D9337l899o294P365L3527K174Q968J5127J4535P726K564K7163M7130Q984
12961B14407o150P8608N6479P2248M1693J853O026j4000p2158q3455l2957k4721
12949B37873l5595l1191r493J2058K4188m4441n9708m2224k081k77j8414k7357
$$ plain form
12937 3338 57965 104307 69016 3229 36176 22943 34332 25944 11310 56410 85535 83308
12925 83308 28386 22314 43022 70547 108864 200591 309192 426117 577547 759246 904416
12914 904416 1023128 1012708 870297 713145 565348 434342 330118 261660 237151 223958
12904 223958 213099 156655 78171 81576 108787 122784 77297 49711 52707 35494 55848 75269
12892 75269 56989 77656 106324 151528 112767 49481 57529 85511 101203 72606 92599 70692
12880 70692 83526 111165 140521 174162 220426 257269 368319 449429 475481 477527 434499 344363
12868 344363 250295 206898 180577 145586 125161 126123 132468 110679 101364 72358 60507 45510
12856 45510 17233 -6665 -4875 -2804 -2578 18902 31990 29773 52409 61648 20586 -25754 -28630
$$ packed form
12937C338N4627M6342l5291o5787L2947j3233J1389q388j4634M5100K9125k227
12925H3308n4922o072K0708K7525L8317R1727J08601J16925J51430J81699J45170
12914I04416J18712j0420j42411j57152j47797j31006j04224o8458k4509j3193
12904B23958j0859n6444p8484L405K7211J3997m5487k7586K996j7213K0354J9421
12892G5269j8280K0667K8668M5204l8761o3286Q048K7982J5692k8597J9993k1907
12880G0692J2834K7639K9356L3641M6264L6843J11050Q1110K6052K046m3028r0136
12868C44363r4068m3397k6321l4991k0425R62O345k1789r315k9006j1851j4997
12856D5510k8277k3898J790K071K26K1480J3088k217K2636R239m1062m6340k876
$$ plain form
12843 -28630 -1314 6462 -10444 -61036 -60724 -19760 -2731 15620 19812 20854 13155 29360 -1357
12830 -1357 27983 62564 22503 18456 52968 56080 35713 -4540 -18350 24755 32758 7810
12818 7810 1031 4601 -23428 -4410 8495 55132 66418 57273 46888 22690 7775 12700 -13129
12805 -13129 -11968 -4119 8993 26645 -8712 -34344 -19488 -27188 -9813 -12749 -16149 -10830 -6925
12792 -6925 18816 20826 -12505 -9938 23594 55039 59663 -20171 -45643 -47270 -55929 -45707 -581
12779 -581 3436 38208 23135 37213 21105 -20808 -54662 -34391 30724 26192 -4276 -37027
12767 -37027 -10112 5152 12141 13654 19683 -9432 -8017 -4846 -19709 20958 54188 31561 27821
12754 27821 31217 20458 -9655 -31167 -7044 -1361 -8788 -47657 -42656 -5021 -31284 -28253 17672
$$ packed form
12843b8630K7316P776j6906n0592L12M0964J7029J8351M192J042p699J6205l0717
12830a357K9340L4581m0061m047L4512L112k0367m0253j3810M3105Q003k4948
12818G810o779L570k8029J9018J2905M6637J1286r145j0385k4198j4915M925k5829
12805a3129J161P849J3112J7652l5357k5632J4856p700J7375k936l400N319L905
12792f925K5741K010l3331K567L3532L1445M624p9834k5472j627q659J0222M5126
12779e81M017L4772j5073J4078j6108m1913l3854K0271O5115m532l0468l2751
12767c7027K6915J5264O989J513O029k9115J415L171j4863M0667L3230k2627l740
12754B7821L396j0759l0113k1512K4123N683p427l8869N001L7635k6263L031M5925
$$ plain form
12741 17672 38500 27757 45612 36524 -27675 -35409 -17367 21229 50001 32545 15059 9815
12729 9815 -1595 -7946 -10913 -20013 -34162 -50282 -20852 -7483 -485 12939 52930 49094 20644
12716 20644 11546 25874 26254 47003 41997 -7654 -29686 -14303 -15603 -1144 -39521 -84941 -105705
12703 -105705 -61298 -29432 -14575 23140 30868 17910 -14230 -36944 -22025 11137 -8619 32994
12691 32994 30015 19267 -17032 9056 9050 2992 5335 16591 17491 29334 18293 -8372 -47965
12678 -47965 -55366 -20622 53243 80317 61771 81435 97279 133046 123337 131836 117754 95242
12666 95242 65058 56348 26852 43669 80637 102137 80135 39553 12057 -4286 -28182 4164
12654 4164 37716 32782 21291 39701 40079 31420 -4738 -36264 -91349 -85218 -17872 -10308 -22841
$$ packed form
12741A7672K0828j0743J7855r088o4199p734J8042L8596K8772j7456j7486n244
12729I815j1410o351k967r100j4149j6120K9430J3369O998J3424L9991l836k8450
12716B0644r098J4328L80K0749n006m9651k2032J5383j300J4459l8377m5420k0764
12703a05705M4407L1866J4857L7715P728j2958l2140k2714J4919L3162j9756M1613
12691C2994k979j0748l6299K6088oo058K343J1256R00J1843j1041k6665l9593
12678d7965p401L4744P3865K7074j8546J9664J5844L5767r709Q499j4082k2512
12666I5242l0184q710k9496J6817L6968K1500k2002m0582k7496j6343k3896L2346
12654D164L3552m934j1491J8410L78q659l6158l1526n5085O131O7346P564j2533
$$ plain form
12641 -22841 -48198 -52794 -43225 -37529 -28294 -20994 -21880 12146 32750 11679 23056 42366 75923
12628 75923 44069 50779 136313 152372 147436 129406 139474 156254 102093 46936 26596 -1858
12616 -1858 19347 37412 22135 -34102 -55922 -43678 -36920 -15056 16437 -86 -35243 6843
12604 6843 46199 31788 10559 -31027 -52255 -17617 12784 8648 22339 47230 62422 22927
12592 22927 28866 12679 -25494 8189 61912 69679 45862 34401 21507 47909 135755 161538
12580 161538 170979 191354 179311 104111 75522 75071 37663 37289 3393 10930 8992 12231 16689
12567 16689 -16088 -25206 12361 29152 54917 65345 73448 50265 35579 16328 7147 10655
12555 10655 44131 41346 547 -39516 -18473 -31730 -47172 -76525 -80970 -43669 173 -22124
$$ packed form
12641b2841k5357m596R569N696R235P300q86L4026K0604k1071J1377J9310L3557
12628G5923l1854O710Q5534J6059m936j8030J0068J6780n4161n5157k0340k8454
12616a858K1205J8065j5277n6237k1820J2244O758K1864L1493j6523l5157M2086
12604F843L9356j4411k1229m1586k1228L4638L0401m136J3691K4891J5192l9495
12592B2927N939j6187l8173L3683N3723P767k3817j1461j2894K6402Q7846K5783
12580A61538R441K0375j2043p5200k8589m51l7408l74l3896P537j938L239M458
12567A6689l2777r118L7567J6791K5765J0428Q103k3183j4686j9251r181L508
12555A0655L3476k785m0799m0063K1043j3257j5442k9353m445L7301M3842k2297
$$ plain form
12543 -22124 -31561 -38361 -47800 -51404 -29236 -8591 16360 -7157 -16522 42834 43961 -1160 -22754
12530 -22754 6718 -23052 2029 -11757 23309 54726 41818 31346 -32356 -50001 -27546 -63612
12518 -63612 -57987 -44838 -21785 -36893 -45614 -41781 -20492 23430 84892 66812 40769 44394
12506 44394 43551 47109 11428 -17038 -59576 -40469 4072 13848 2592 -4992 6239 -18079 22987
12493 22987 67094 38239 10246 28410 6441 -4073 13699 -23423 -28801 9125 28799 10281
12481 10281 -12243 -43388 -49984 -65254 -37903 -41864 -40994 2201 24165 23434 7475 -14502 -14499 -34892
12467 -34892 -57051 -53488 25201 49184 42070 25560 78 -13985 -38038 -34623 -14579 25586
12455 25586 34030 20062 -8631 13818 32372 -3720 -18770 15763 32316 27981 12367 -3369
$$ packed form
12543b2124r437o800r439l604K2168K0645K4951k3517r365N9356J127m5121k1594
12530b2754K9472k9770K5081j3786L5066L1417j2908j0472o3702j7645K2455l6066
12518f3612N625J3149K3053j5108q721L833K1289M3922O1462j8080k6043L625
12506D4394q43L558l5681k8466m2538J9107M4541R776j1256p584J1231k4318M1066
12493B2987M4107k8855k7993J8164k1969j0514J7772l7122n378L7926J9674j8518
12481A0281k2524l1145o596j5270K7351l961Q70M3195K1964p31j5959k1977Lk0393
12467c4892k2159L563P8689K3983p114j6510k5482j4063k4053L415K0044M0165
12455B5586Q444j3968k8693K2449J8554l6092j5050L4533J6553m335j5614j5736
$$ plain form
12443 -3369 -16364 -51018 -24645 -22148 -35646 -42560 -40136 -36591 -29556 -38730 -15639 -11024 -36579
12430 -36579 -19517 -234 -23108 -41280 -41284 -13847 -7261 13307 41215 37138 44070 14557 -12678
12417 -12678 -404 12891 32307 49401 19409 -21299 -2938 1637 31284 29146 -1935 1344
12405 1344 -12188 -36676 -54560 6387 38163 49670 51228 42517 6850 -4627 14150 31929
12393 31929 4836 1303 -8403 -6528 -12776 -23424 -58954 -26819 -12476 -12804 -21380 -4633 -7182
12380 -7182 -10628 11582 13487 15610 -2914 -14631 1869 20824 -18804 -38444 -6573 18414
12368 18414 31725 53964 35859 -3975 6193 6956 30235 -14125 -60450 -52959 -11527 48903
12356 48903 67367 49425 31359 20340 11177 46085 26355 -20029 -15764 12785 30612 22529
$$ packed form
12443c369j2995l4654K6373K497j3498o914K424L545P035r174K3091M615k5555
12430c6579J7062J9283k2874j8172mK7437O586K0568K7908m077O932k9513k7235
12417a2678J2274J3295J9416J7094k9992m0708J8361M575K9647k138l1081L279
12405A344j3532k4488j7884O0947L1776J1507J558q711l5667j1477J8777J7779
12393C1929k7093l533r706J875o248j0648l5530L2135J4343l28q576J6747k549
12380g182l446K2210J905K123j8524j1717J6500J8955l9628j9640L1871K4987
12368A8414J3311K2239j8105l9834J0168P63K3279m4360m6325P491M1432O0430
12356D8903J8464j7942j8066j1019r163L4908j9730m6384M265K8549J7827q083
$$ plain form
12344 22529 -5336 30139 45397 54103 59112 19811 622 49103 87961 32823 -8990 -46277
12332 -46277 -43752 -34657 3650 13506 34715 63394 45819 10604 -13774 20898 51250 73184
12320 73184 74819 48774 30606 16154 -4757 -868 7244 -23283 -64104 -75345 -88187 -92189
12308 -92189 -56527 -14171 19425 10221 3002 26069 19975 -9161 -51254 -79420 -63827 -52082
12296 -52082 -59242 -43569 -44835 -6827 35146 -4781 -34627 -51485 -44016 -48898 -25286 -37995
12284 -37995 -22786 -11478 -8179 -7470 -33004 -2552 7611 -14972 -31618 -18206 -18447 -36034 -52539
12271 -52539 -32625 -31250 -30526 12231 9625 44587 60379 65297 38319 22386 -10029 -23522 -19534
12258 -19534 17372 8098 -22059 -27954 -9766 -960 -26811 -31964 -25597 -2211 -522 18840 -6862
$$ packed form
12344B2529k7865L5475J5258Q706N009l9301j9189M8481L8858n5138m1813l7287
12332d6277K525R095L8307R856K1209K8679j7575l5215k4378L4672L0352K1934
12320G3184J635k6045j8168j4452k0911L889Q112l0527m0821j1241j2842m002
12308i2189L5662M2356L3596r204p219K3067o094k9136m2093k8166J5593J1745
12296e2082p160J5673j266L8008M1973l9927k9846j6858P469m882K3612j2709
12284c7995J5209J1308L299P09k5534L0452J0163k2583j6646J3412k41j7587j6505
12271e2539J9914J375P24M2757k606L4962J5792M918k6978j5933l2415j3493L988
12258a9534L6906r274l0157n895J8188Q806k5851n153O367K3386J689J9362k5702
$$ plain form
12245 -6862 1707 45464 24637 8009 30205 51384 25863 18497 36522 29759 4676 -30529
12233 -30529 -43855 -4194 18899 -10881 17988 61708 8469 3090 -4251 -11049 -3809 -23557
12221 -23557 -36949 -6779 35968 25612 -608 2407 26074 54853 73121 78579 93602 106298
12209 106298 98153 57574 22284 -32177 -58019 -8446 25887 10414 -8647 8329 27700 34392
12197 34392 67006 55385 45141 37752 -6458 -9765 -1030 7679 21356 -10592 -60005 -55753 -42625
12184 -42625 -52097 -55168 -54584 -48478 -28815 -35370 -31761 -27141 -7831 -26658 -58733 -28832 -17601
12171 -17601 -21553 -14019 49800 97352 135742 112172 102552 106783 118192 159489 167482 218725 284385
12158 284385 375348 543812 772497 1089588 1638933 2487351 3466125 3995986 3766084 3169478
$$ packed form
12245f862Q569M3757k0827j6628K2196K1179k5521p366J8025o763k5083l5205
12233c0529j3326L9661K3093k9780K8869M3720n3239n379p341o798P240j9748
12221b3557j3392L0170M2747j0356k6220L015K3667K8779J8268N458J5023J2696
12209A06298q145m0579l5290n4461k5842M9573L4333j5473j9061J6976J9371O692
12197C4392L2614j1621j0244p389m4210l307Q735Q709J3677l1948m9413M252J3128
12184d2625r472l071N84O106J9663o555L609M620J9310j8827l2075K9901J1231
12171a7601l952P534O3819M7552L8390k3570r620M231J1409M1297P993N1243O5660
12158B84385R0963J68464K28685L17091N49345Q48418R78774N29861k29902n96606
$$ plain form
12148 3169478 2447012 1791378 1323333 997795 772672 611799 520291 424281 361737 338574
12138 338574 327898 297219 267431 258316 243370 247296 228975 170572 163375 158508 175505 254355
12126 254355 307715 350245 422242 528033 638363 827659 1157044 1655946 2466319 3492876
12116 3492876 4114685 3970678 3317454 2476846 1751014 1233399 878541 688169 537205
12107 537205 388805 291089 252346 240900 238891 186740 152472 160421 145727 109638 40632 8963
12095 8963 9828 23011 32062 64863 45405 56375 45247 60550 53998 51165 74611 70494 45527
12082 45527 21588 -33671 988 58129 64545 27180 -13074 18299 5153 -33402 -20402 -47231
12070 -47231 -48403 -39159 -4944 -8395 -15911 -4995 -15518 -33154 -46812 -12301 27469 59026
$$ packed form
12148C169478p22466o55634m68045l25538k25123j60873r1508r6010o2544k3163
12138C38574j0676l0679k9788r115j4946L926j8321n8403p197m867J6997P8850
12126B54355N3360M2530P1997J05791J10330J89296L29385M98902Q10373J026557
12116C492876O21809j44007o53224q40608p25832n17615l54858j90372j50964
12107E37205j48400r7716l8743j1446k009n2151l4268P949j4694l6089o9006l1669
12095H963Q65J3183R051L2801j9458J0970j1128J5303o552k833K3446m117k4967
12082D5527k3939n5259L4659N7141O416l7365m0254L1373j3146l8555J3000k6829
12070d7231j172R244L4215l451p516J0916j0523j7636j3658L4511L9770L1557
$$ plain form
12058 59026 35915 53103 23889 -16739 -11919 -26756 -31660 -28666 -14284 -6525 -21515 -23813 1308
12045 1308 26309 32358 44789 -15417 -50830 -77750 -54024 -6463 21436 47904 54622 12009
12033 12009 -4911 -31051 -4835 4362 -6081 53400 81160 80689 58423 27535 18573 -2040
12021 -2040 -23720 5575 46072 50403 24011 -17290 -20640 -10841 7899 34631 59119 104919
12009 104919 86603 74507 55756 10529 29507 15074 -40933 -42556 -16991 6805 1715 -18842
11997 -18842 -17142 12493 11626 -21451 2944 19786 29102 -803 5450 -6436 -9912 -19809 7035
11984 7035 14357 -3189 5528 73787 96114 98268 74753 56922 42781 42274 30167 34196 40067
11971 40067 -18829 -27683 -33411 -30320 -17650 8250 -18973 -30484 -10859 3285 16192 9637
$$ packed form
12058E9026k3111J7188k9214m0628M820j4837m904K994J4382P759j4990k298K5121
12045A308K5001O049J2431o0206l5413k6920K3726M7561K7899K6468O718m2613
12033A2009j6920k6140K6216R197j0443N9481K7760m71k2266l0888q962k0613
12021b040k1680K9295M0497M331k6392m1301l350R799J8740K6732K4488M5800
12009A04919j8316j2096j8751m5227J8978j4433n6007j623K5565K3796n090k0557
11997a8842J700K9635q67l3077K4395J6842R316k9905O253j1886l476r897K6844
11984G035P322j7546Q717O8259K2327K154k3515j7831j4141n07j2107M029N871
11971D0067n8896q854n728L091J2670K5900k7223j1511J9625J4144J2907o555
$$ plain form
11959 9637 24415 79664 74042 20922 -7037 -14400 -18745 30213 45290 18878 6114 22671
11947 22671 9095 -13855 7218 44359 21940 -1303 -27765 -15688 3638 32792 52015 45615
11935 45615 26645 29315 69065 72272 25141 22893 24842 46420 66512 28778 39597 80574
11923 80574 65828 60962 51027 35269 23858 -32079 -40141 -37198 -34057 -22481 -30936 4061 10668
11910 10668 -38700 -54827 -62860 -42192 -42926 -37202 -24127 -12527 -16819 -13258 -18964 -17096 -63602
11897 -63602 -48392 -39187 -38848 -31409 17743 66233 21340 29473 42376 44959 86022 62445 31774
11884 31774 17323 10799 65395 106452 68012 67976 99468 126135 107223 131046 124788 69419 77593
11871 77593 137269 201194 265526 304212 346692 340581 323589 338530 318112 314688 345354 336506
$$ packed form
11959I637J4778N5249n622n3120k7959p363m345M8958J5077k6412j2764J6557
11947B2671j3576k2950K1073L7141k2419k3243k6462J2077J9326K9154J9223o400
11935D5615j8970K670L9750L207m7131k248J949K1578K0092l7734J0819M0977
11923H0574j4746m866r935j5758j1411n5937q062K943L141J1576q455L4997O607
11910A0668m9368j6127q033K0668p34N724J3075J1600m292L561n706J868m6506
11897f3602J5210R205L39P439M9152M8490m4893Q133J2903K583M1063k3577l0671
11884C1774j4451o524N4596M1057l8440l6L1492K6667j8912K3823o258n5369Q174
11871G7593N9676O3925O4332L8686M2480o111j6992J4941k0418l424L0666q848
$$ plain form
11859 336506 287187 227476 168565 114805 86559 74502 56565 36926 51406 45115 63583 68961
11847 68961 41279 30740 38143 -2122 -12553 35082 70714 63371 58254 61109 82265 121645
11835 121645 120305 103077 119715 147940 191596 239565 303129 361389 438412 508270 589548 641581
11823 641581 611145 603802 596298 612370 612839 595703 529584 450173 385246 302946 264449 230134
11811 230134 204606 174056 132188 85575 77689 78524 52188 74331 105808 133075 139594 83105
11799 83105 63350 72733 85629 63674 61335 57955 75482 52918 46360 85012 118863 130185
11787 130185 167692 216371 230585 265918 320000 343922 316320 293162 304910 316838 338781
11776 338781 324135 299542 270155 227160 180056 159983 135899 79296 36040 62103 64401 62000
$$ packed form
11859C36506m9319n9711n8911n3760k8246j2057j7937j9639J4480o291J8468N378
11847F8961k7682j0539P403m0265j0431M7635L5632p343n117K855K1156L9380
11835A21645j340j7228J6638K8225M3656M7969O3564N8260P7023O9858Q1278N2033
11823F41581l0436p343p504J6072M69j7136o6119p9411o4927q2300l8497l4315
11811B30134k5528l0550m1868m6613p886Q35k6336K2143L1477K7267O519n6489
11799H3105j9755R383J2896k1955k339l380J7527k2564o558L8652L3851J1322
11787A30185L7507M8679J4214L5333N4082K3922k7602k3158J1748J1928K1943
11776C38781j4646k4593k9387m2995m7104k0073k4084n6603m3256K6063K298k401
$$ plain form
11764 62000 89062 88290 78568 43656 22310 52735 64364 75818 77018 76154 88574 107782 107836
11751 107836 74315 56818 70830 85464 71702 59749 110218 138268 118022 60795 -1964
11740 -1964 10878 32306 89838 140622 116720 95898 54806 59135 73398 71537 50096 37248
11728 37248 30826 40483 59084 66262 68895 120441 131976 122901 114829 87451 74347 46707 -3000
11715 -3000 14751 70249 138738 151035 152605 143374 126037 125947 111076 113566 90706 87924 135643
11702 135643 132756 64775 28760 -2198 -14537 -32018 -60050 -42242 -18555 46196 76630 62997
11690 62997 102605 119199 90582 66658 29818 22675 50409 64716 55218 62896 51913 39820
11678 39820 55375 134822 195269 195251 190480 144890 128578 172913 199565 184514 185822 218324 265798
$$ packed form
11764F2000K7062p72r722l4912k1346L0425J1629J1454J200q64J2420J9208N4
11751A07836l3521j7497J4012J4634j3762j1953N0469K8050k0246n7227o2759
11740a964J2842K1428N7532N0784k3902k0822m1092M329J4263j861k1441j2848
11728C7248o422R657J8601P178K633N1546J1535r075q072k7378j3104k7640m9707
11715c000J7751N5498O8489J2297J570r231j7337r0j4871K490k2860k782M7719
11702A35643k887o7981l6015l0958j2339j7481k8032J7808K3687O4751L0434j3633
11690F2997L9608J6594k8617k3924l6840p143K7734J4307r498P678j0983j2093
11678C9820J5555P9447O0447j8m771m5590j6312M4335K6652j5051J308L2502M7474
$$ plain form
11665 265798 252415 222693 167149 162043 162316 149189 108157 93456 36053 3891 -8913 32639
11653 32639 36005 55724 37176 51524 38501 36895 86186 92022 110614 119044 99181 116599
11641 116599 135340 135807 119276 96596 88896 112956 94300 72603 56813 71415 88428 110397
11629 110397 133054 143819 132453 155405 190894 207486 200551 158980 148363 163674 162474 121159
11617 121159 33156 -9805 -4496 -21661 -45168 -31658 -51064 -32126 -62459 -49101 -13684 -13376
11605 -13376 -35010 -21838 17936 2033 -17746 -27098 -20674 18833 45288 77935 65490 62296
11593 62296 104028 146805 109023 80146 113298 111256 111816 135778 141829 155992 128331 122591 171230
11580 171230 154737 148611 157458 127353 113594 11201 -80314 -139579 -109276 -57857 -65882 -61988
$$ packed form
11665B65798j3383k9722n5544n106K73j3127m1032j4701n7403l2162j2804M1552
11653C2639L366J9719j8548J4348j3023j606M9291N836J8592Q430j9863J7418
11641A16599J8741M67j6531k2680p700K4060j8656k1697j5790J4602J7013K1969
11629A10397K2657J0765j1366K2952L5489J6592o935m1571j0617J5311j200m1315
11617A21159q8003m2961N309j7165k3507J3510j9406J8938l0333J3358L5417L08
11605a3376k1634J3172L9774j5903j9779r352O424L9507K6455L2647j2445l194
11593F2296M1732M2777l7782k8877L3152k042N60K3962O051J4163k7661n740M8639
11580A71230j6493o126Q847l0105j3759j02393r1515n9265L0303N1419q025L894
$$ plain form
11568 -61988 -41958 -64480 -75492 -98843 -58106 14131 47200 41618 28601 50873 61450 107058
11556 107058 159522 182769 163415 127822 117863 161294 222727 274293 282162 243892 239751 257313
11544 257313 227386 193454 175221 158124 188338 194270 202652 200944 202237 191363 190733 178564 130944
11531 130944 98783 110773 88018 51303 73776 99321 108404 120066 117640 140513 167767 196320
11519 196320 191957 175064 174277 201438 201959 233713 244912 261394 309240 322666 331058 355166 332950
11506 332950 337851 377385 393118 401144 427757 430591 426840 421846 441888 492570 565737 587843
11494 587843 647180 707492 724543 769430 823427 875218 943110 988980 1048935 1162123 1342286
11483 1342286 1541913 1759649 2023669 2248002 2404867 2563962 2788793 3132885 3548509
$$ packed form
11568f1988K0030k2522j1012k3351M0737P2237L3069n582j3017K2272J0577M5608
11556A07058N2464K3247j9354l5593r959M3431O1433N1566P869l8270m141J7562
11544B57313k9927l3932j8233j7097L0214N932Q382j708J293j0874o30j2169m7620
11531A30944l2161J1990k2755l6715K2473K5545R083J1662k426K2873K7254K8553
11519A96320m363j6893p87K7161N21L1754J1199J6482M7846J3426Q392K4108k2216
11506C32950M901L9534J5733Q026K6613K834l751m994K0042N0682P3167K2106
11494E87843N9337O0312J7051M4887N3997N1791O7892M5870N9955J13188J80163
11483A342286J99627K17736K64020K24333J56865J59095K24831L44092M15624
$$ plain form
11474 3548509 3938479 4313229 4791150 5325377 6023113 7022534 8384436 10262268 12923691
11465 12923691 16859931 22814478 31523703 42676431 53271521 59087398 59248037 56751203
11457 56751203 55300367 57200703 61319267 63067002 59134580 50719760 40771077 31611765
11449 31611765 24444232 19360545 15836392 13351343 11650421 10511092 9739701 9246460
11441 9246460 8935149 8757099 8715289 8754862 8736920 8754024 8849949 9129824 9526748 10034985
11431 10034985 10585461 11148695 11801202 12818548 14321457 16501274 19673163 24271410
11423 24271410 31213608 42086382 59001390 82321597 105441287 117349895 116642970
11416 116642970 110181423 105907273 109690596 119648861 124487684 116698464 99520610 78981264
$$ packed form
11474C548509L89970L74750M77921N34227O97736R99421J361902J877832K661423
11465A2923691L936240N954547Q709225J1152728J0595090N815877J60639k496834
11457E6751203j450836J900336M118564J747735l932422q414820r948683r159312
11449C1611765p167533n083687l524153k485049j700922j139329p71391m93241
11441I246460l11311j78050m1810L9573j7942J7104R5925K79875L96924N08237
11431A0034985N50476N63234O52507J017346J502909K179817L171889M598247
11423B4271410O942198J0872774J6915008K3320207K3119690J1908608p06925
11416A16642970o461547m274150L783323R958265M838823p789220j7177854k0539346
$$ plain form
11408 78981264 60130908 45541421 35231805 28101302 23142212 19641300 17169098 15444370
11400 15444370 14159026 13131271 12320162 11648136 11060677 10522104 10031603 9673524 9404023
11391 9404023 9214169 9062333 8957852 8884985 8917149 9194971 9737950 10624048 12008498 14052077
11381 14052077 17124020 21843872 28899923 38494626 48759101 55542808 56725931 54421402
11373 54421402 52145352 52571053 55726350 58076068 55700998 48676897 39501208 30539435
11365 30539435 23281676 18005351 14341705 11765611 9892488 8525735 7536681 6844487
11357 6844487 6282097 5740917 5276308 4914617 4569440 4219522 3870013 3532016 3221689
11348 3221689 2957485 2715465 2425164 2217753 2075181 1938174 1792021 1663768 1562088
$$ packed form
11408G8981264j8850356j4589487j0309616p130503m959090l500912k472202j724728
11400A5444370j285344j027755q11109o72026n87459n38573m90501l58079k69501
11391I404023j89854j51836j04481p2867L2164K77822N42979Q86098J384450K043579
11381A4052077L071943M719852P056051R594703J0264475O783707J183123k304529
11373E4421402k276050M25701L155297K349718k375070p024101r175689q961773
11365C0539435p257759n276325l663646k576094j873123j366753r89054o92194
11357F844487n62390n41180m64609l61691l45177l49918l49509l37997l10327
11348C221689k64204k42020k90301k07411j42572j37007j46153j28253j01680
$$ plain form
11339 1562088 1456467 1359385 1324804 1275148 1231075 1206063 1171440 1115535 1064951 1012992 945955
11328 945955 867757 806870 753948 719214 753378 732662 662611 609024 586167 593932 630616 639687
11316 639687 610134 599325 641289 668147 621205 592239 586235 592568 592472 580044 586891 586688 553776
11303 553776 518447 489981 466639 453478 490801 521745 505790 461136 413833 360455 309902
11292 309902 291548 273768 233558 239115 207190 181633 186860 181162 181224 200235 218645 172833 148463
11279 148463 163809 181026 211673 261013 279167 243933 234364 250620 250795 255694 289607 317079
11267 317079 329558 347993 370276 429353 451472 419139 405901 385635 392334 380638 409050 418179
11255 418179 341680 243078 208272 186117 151409 102190 106525 113272 118765 127472 135579 114174
$$ packed form
11339A562088j05621r7082l4581m9656m4073k5012l4623n5905n0584n1959o7037
11328I45955p8198o0887n2922l4734L4164k0716p0051n3587k2857P765L6684R071
11316F39687k9553j0809M1964K6858m6942k8966o004O333r6j2428O847k03l2912
11303E53776l5329k8466k3342j3161L7323L0944j5955m4654m7303n3378n0553
11292C09902j8354j7780m0210N557l1925k5557N227n698O2J9011J8410m5812k4370
11279A48463J5346J7217L0647M9340J8154l5234r569J6256J75M899L3913K7472
11267C17079J2479J8435K2283N9077K2119l2333j3238k0266O699j1696K8412R129
11255D18179p6499r8602l4806k2155l4708m9219M335O747N493Q707Q107k1405
$$ plain form
11243 114174 88704 57376 27026 64437 124012 128789 116475 136835 111702 112370 106954 69638
11231 69638 10008 -17 24592 71842 145326 173628 148772 140836 165491 167314 179526 201772
11219 201772 242264 189286 153953 202376 242039 238211 196927 124823 129426 118019 98362 97530
11207 97530 61746 10101 -12274 26001 48360 44464 59800 24259 10348 -1663 20033 31591
11195 31591 30520 75801 21006 26182 55988 78211 83882 65633 21629 12490 15167 28203 34757
11182 34757 35260 78339 98999 54621 8212 5760 12571 14681 30319 18564 3611 14647 18478
11169 18478 5900 -7713 2281 17156 25282 11910 28124 37851 68531 78553 36118 17591
11157 17591 -18822 -12174 21100 68069 80510 54354 78766 90185 61620 21327 12134 -4474
$$ packed form
11243A14174k5470l1328l0350L7411N9575M777j2314K0360k5133O68n416l7316
11231F9638n9630j0025K4609M7250P3484K8302k4856p936K4655J823J2212K2246
11219B01772M0492n2978l5333M8423L9663l828m1284p2104M603j1407j9657q32
11207I7530l5784n1645k2375L8275K2359l896J5336l5541j3911j2011K1696J1558
11195C1591j071M5281n4795N176K9806K2223N671j8249m4004r139K677J3036O554
11182C4757N03M3079K0660m4378m6409k452O811K110J5638j1755j4953J1036L831
11169A8478j2578j3613R994J4875Q126j3372J6214R727L0680J0022m2435j8527
11157A7591l6413O648L3274M6969J2441k6156K4412J1419k8565m0293r193j6608
$$ plain form
11145 -4474 41391 51011 32046 32236 36512 27157 16645 11814 14146 9678 48247 47099 59877 51306
11131 51306 20432 11262 -14871 -25709 -36222 -37427 -33048 21326 18300 24395 11733 14405 33402
11118 33402 18283 23555 -6963 8728 367 -12815 10547 52015 47717 42597 30345 13836
11106 13836 -12583 34169 83953 50692 26162 32752 30645 29643 1187 19668 29315 40772
11094 40772 8720 -12686 -4461 22466 30237 41424 71485 65393 26959 13049 55289 49465
11082 49465 24934 17143 7174 13121 -31129 -39885 -24483 26632 45211 78071 72709 63040 30747
11069 30747 -4689 21870 17623 10123 23336 84238 95183 91580 91533 78867 59605 46679 38473
11056 38473 92474 164104 221990 216741 193869 195457 225411 257784 298565 325200 331977 346749
$$ packed form
11145d474M5865R620j8965J90M276r355j0512m831K332m468L8569j148J2778q571
11131E1306l0874r170k6133j0838j0513j205M379N4374l026O095j2662K672J8997
11118C3402j5119N272l0518J5691q361j3182K3362M1468m298n120j2252j6509
11106A3836k6419M6752M9784l3261k4530O590k107j002k8456J8481R647J1457
11094D0772l2052k1406Q225K6927P771J1187L0061o092l8434j3910M2240n824
11082D9465k4531p791r969N947m4250q756J5402N1115J8579L2860n362r669l2293
11069C0747l5436K6559m247p500J3213O0902J0945l603m7j2666j9262j2926q206
11056C8473N4001P1630N7886n249k2872J588K9954L2373M0781K6635O777J4772
$$ plain form
11044 346749 308793 254443 246536 273759 275337 253649 237249 224751 224105 176729 128703 96996
11032 96996 69057 67116 48471 39762 36090 82715 133309 125218 111283 103382 98165 68141 58329
11019 58329 67474 98883 120869 122996 132650 116559 164878 190691 186796 182543 199817 312240
11007 312240 443917 531164 625079 626103 574484 549633 543242 574843 599839 578775 523535 393270
10995 393270 300391 240727 184311 145036 105192 128569 165374 146103 80272 94549 89501 72245
10983 72245 61771 26745 21716 44508 40572 44325 52777 84281 75048 71697 67086 73735 73383 94632
10969 94632 102654 97529 104626 158005 198290 247404 281624 311777 305636 309237 294137 299190 270031
10956 270031 229075 196066 178944 153784 164021 159069 96974 62477 49384 52783 28703 22864
$$ packed form
11044C46749l7956n4350p907K7223J578k1688j6400j2498o46m7376m8026l1707
11032I6996k7939j941j8645q709l672M6625N0594q091j3935p901n217l0024r812
11019E8329R145L1409K1986K127R654j6091M8319K5813l895m253J7274J12423
11007C12240J31677Q7247R3915J024n1619k4851o391L1601K4996k1064n5240j30265
10995C93270r2879n9664n6416l9275l9844K3377L6805j9271o5831J4277n048j7256
10983G2245j0474l5026n029K2792l936L753Q452L1504r233l351m611O649l52K1249
10969I4632Q022n125P097N3379M0285M9114L4220L0153o141L601j5100N053k9159
10956B70031m0956l3009j7122k5160J0237m952o2095l4497j3093L399k4080n839
$$ plain form
10944 22864 15099 -1811 38140 53832 72551 19729 10742 20769 10352 62877 24733 -8230
10932 -8230 -25037 -34787 -34776 -45817 -58955 -43180 -24306 -3919 -4317 13673 28372 25951 9156
10919 9156 49900 69696 83972 81509 62014 47710 47892 17678 3158 -22813 3205 48892
10907 48892 65171 63001 32466 40363 42123 35753 36349 15729 17919 46471 56661 32774 54299
10894 54299 50859 41021 62563 55341 11510 17989 46662 81881 88309 80479 66712 29936 -1509
10881 -1509 -3239 -35037 -7221 22874 46563 33174 1373 10262 28110 34371 17889 39808
10869 39808 39159 28459 31334 41959 78657 63826 21018 40586 63378 37417 17454 39682
10857 39682 92974 122408 111877 93837 101495 93608 93040 112521 114711 99528 69681 61995 77491
$$ packed form
10944B2864p765j6910L9951J5692J8719n2822q987J0027j0417N2525l8144l2963
10932h230j6807r750J1j1041j3138J5775J8874K0387l98J7990J4699k421j6795
10919I156M0744J9796J4276k463j9495j4304J82l0214j4520k5971K6018M5687
10907D8892J6279k170l0535P897J760o370N96k0620K190K8552J0190k3887K1525
10894E4299l440r838K1542p222m3831O479K8673L5219O428p830j3767l6776l1445
10881a509j730l1798K7816L0095K3689j3389l1801Q889J7848O261j6482K1919
10869C9808o49j0700K875J0625L6698j4831m2808J9568K2792k5961j9963K2228
10857C9682N3292K9434j0531j8040P658p887n68J9481K190j5183k9847p686J5496
$$ plain form
10844 77491 74385 70700 48934 60772 8820 -355 29716 27605 38286 76338 36623 873
10832 873 -11760 -9039 -22955 -8011 40961 54883 59880 42933 52064 33137 18177 8159 45998
10819 45998 51652 37815 59222 69733 54204 53674 90856 104884 111915 97538 77533 93928
10807 93928 96996 115160 122443 105443 88740 91774 94045 93224 99242 126461 183347 218046 266958
10794 266958 351640 474547 564753 692971 879724 1178914 1443545 1651486 1830342 1985575
10784 1985575 2064701 2063244 2008152 1875495 1655926 1394245 1177085 963235 768773 594498
10774 594498 471956 399451 351136 329514 266198 247040 216709 175140 164397 158095 171577
10763 171577 169353 158976 141331 146043 133644 105086 65805 53617 66016 48172 49341 28941
$$ packed form
10844G7491l106l685k1766J1838n1952r175L0071k111J0681L8052l9715l5750
10832H73j2633K721j3916J4944M8972J3922M997j6947R131j8927j4960j0018L7839
10819D5998N654j3837K1407J0511j5529n30L7182J4028P031j4377k0005J6395
10807I3928L068J8164P283j7000j6703L034K271q21O018K7219N6886L4699M8912
10794B66958Q4682J22907R0206J28218J86753K99190K64631K07941J78856J55233
10784A985575P9126j457n5092j32657k19569k61681k17160k13850j94462j74275
10774E94498j22542p2505m8315k1622o3316j9158l0331m1569j0743o302J3482
10763A71577k224j0377j7645M712j2399k8558l9281j2188J2399j7844J169k0400
$$ plain form
10751 28941 31638 61627 113053 97912 109904 104201 116802 95842 85787 82817 71179 54946
10739 54946 67951 93231 122273 92000 75620 50454 -12545 26762 69836 63979 36229 52592
10727 52592 60166 62580 100981 149854 150939 86713 68900 47195 53751 46816 78829 71377 65175
10714 65175 84674 58012 44228 39744 48072 33015 37709 55705 57072 49895 39801 43734 37918
10701 37918 10261 12627 48803 89358 107684 79255 64039 136568 197880 229798 200772 168452
10689 168452 180342 110820 72106 78322 104722 137009 137693 137769 69754 98009 133183 108515 105775
10676 105775 141354 120899 102201 120013 103733 88805 95553 78233 92935 92569 109938 127982
10664 127982 95148 119100 136774 96271 89742 86413 120318 146955 149077 205005 217127 194736
$$ packed form
10751B8941K697K9989N1426j5141J1992n703J2601k0960j0055k970j1638j6233
10739E4946J3005K5280K9042l0273j6380k5166o2999L9307M3074n857k7750J6363
10727E2592P574K414L8401M8873J085o4226j7813k1705O556o935L2013p452o202
10714F5175J9499k6662j3784m484Q328j5057M694J7996J367p177j0094L933n816
10701C7918k7657K366L6176M0555J8326k8429j5216P2529O1312L1918k9026l2320
10689A68452J1890o9522l8714O216K6400L2287O84P6o8015K8255L5174k4668k740
10676A05775L5579k0455j8698J7812j6280j4928O748j7320J4702l66J7369J8044
10664A27982l2834K3952J7674m0503o529l329L3905K6637K122N5928J2122k2391
$$ plain form
10652 194736 134996 118135 131618 109858 161264 211296 202329 232488 277553 297239 295862 296608
10640 296608 314049 394985 459347 449880 423190 360996 355695 342468 294715 235973 203305 179248
10628 179248 200757 177349 165038 149887 146368 153026 189672 195566 162163 175890 174564 162580
10616 162580 157121 132727 98711 120408 130334 115043 121151 134589 163782 191965 179209 177736
10604 177736 151372 101235 84179 79751 106209 121875 126422 127336 114507 81241 72745 90524
10592 90524 74750 83291 74202 72947 83616 68222 88152 129221 158559 143798 114942 104499
10580 104499 109587 87922 82643 95938 144880 193601 177450 149803 162709 131410 101386 117958
10568 117958 107350 113128 107087 110248 152180 167820 190952 193112 194511 183042 174472 159210 163064
$$ packed form
10652A94736n9740j6861J3483k1760N1406N0032q967L0159M5065J9686j377P46
10640B96608J7441Q0936O4362r467k6690o2194n301j3227m7753n8742l2668k4057
10628A79248K1509k3408j2311j5151l519O658L6646N894l3403J3727j326j1984
10616A62580n459k4394l4016K1697R926j5291O108J3438K9193K8183j2756j473
10604A77736k6364n0137j7056m428K6458J5666M547R14j2829l3266q496J7779
10592I0524j5774Q541r089j255J0669j5394J9930M1069K9338j4761k8856j0443
10580A04499N088k1665n279J3295M8942M8721j6151k7647J2906l1299l0024J6572
10568A17958j0608N778o041L161M1932J5640K3132K160J399j1469q570j5262L854
$$ plain form
10555 163064 194224 220421 193212 147628 97797 104714 140166 139311 115664 43080 -58373 -179225
10543 -179225 -280241 -370380 -431229 -535504 -603816 -613350 -568730 -470056 -417305 -374588 -317719
10532 -317719 -262665 -153389 -46278 12171 66392 95933 131897 169772 180683 210768 222670
10521 222670 227038 229422 241845 261952 292471 318224 334295 345214 361964 384804 381348 384980
10509 384980 397323 391038 355718 294902 266267 245235 232503 255313 261484 230251 229228 237115
10497 237115 235315 241161 252260 267235 255557 193342 188345 229920 226592 205220 178262 211121
10485 211121 243249 198498 166124 143392 188563 240697 222275 224402 242248 256721 295161 302076
10473 302076 303868 343483 373289 414838 440578 452751 445700 425058 432223 437173 450317 467290
$$ packed form
10555A63064L1160K6197k7209m5584m9831O917L5452q55k3647p2584j01453j20852
10543a79225j01016r0139o0849j04275o8312r534M4620R8674N2751M2717N6869
10532c17719N5054J09276J07111N8449N4221K9541L5964L7875J0911L0085J1902
10521B22670M368K384J2423K0107L0519K5753J6071J0919J6750K2840l456L632
10509C84980J2343o285l5320o0816k8635k1032j2732K2810O171l1233j023P887
10497B37115j800N846J1099J4975j1678o2215m997M1575l328k1372k6958L2859
10485B11121L2128m4751l2374k2732M5171N2134j8422K127J7846J4473L8440O915
10473C02076J792L9615K9806M1549K5740J2173p051k0642P165M950J3144J6973
$$ plain form
10461 467290 462443 427002 442033 441824 423501 417076 386958 414032 441067 445707 449881 422730 393583
10448 393583 385480 394968 388382 415293 452393 458868 464471 496904 520828 555888 630044 744063
10436 744063 796211 841213 869401 904546 944245 1087207 1219063 1273082 1326061 1376010 1438802
10425 1438802 1520494 1610910 1699416 1814029 1928058 2072724 2288553 2477947 2723708 3031980
10415 3031980 3295454 3598020 4008083 4500129 5022367 5673124 6452833 7379559 8437671
10406 8437671 9738541 11190558 12711585 14325331 16041179 17880786 19943329 22271182
10398 22271182 25069808 28627131 33452155 40536789 51147614 67404995 92015327 125735975
10390 125735975 166160106 211144419 256713516 301507477 342636412 375852760 396758379
$$ packed form
10461D67290m847l5441J5031k09j8323o425l0118K7074K7035M640M174k7151k9147
10448C93583q103R488o586K6911L7100O475N603L2433K3924L5060P4156J14019
10436G44063N2148M5002K8188L5145L9699J42962J31856N4019N2979M9949O2792
10425A438802Q1692R0416Q8506J14613J14029J44666K15829J89394K45761L08272
10415C031980K63474L02566M10063M92046N22238O50757P79709R26726J058112
10406H437671J300870J452017J521027J613746J715848J839607K062543K327853
10398B2271182K798626L557323M825024P084634J0610825J6257381K4610332L3720648
10390A25735975M0424131M4984313M5569097M4793961M1128935L3216348K0905619
$$ plain form
10383 396758379 398841492 385310345 357570774 321525271 279907940 235194676 190603027
10376 190603027 148777708 114036225 87504565 68482393 55368973 46367012 39977693
10369 39977693 35288912 31709015 28715893 26136853 23798778 21617587 19565871 17643187
10361 17643187 15815321 14111567 12591732 11275631 10137396 9189083 8412018 7785288
10353 7785288 7253708 6776951 6384963 6026839 5748787 5533336 5302525 5095382 4934551
10344 4934551 4779737 4550630 4292342 4043942 3798013 3557407 3323463 3162520 3004206
10335 3004206 2815010 2684170 2565538 2415283 2314741 2225870 2165510 2087172 2037741 1972826
10325 1972826 1899892 1813156 1728577 1639988 1619203 1589994 1516249 1469204 1393504 1360001 1301743
$$ packed form
10383C96758379K083113j3531147k7739571l6045503m1617331m4713264m4591649
10376A90603027m1825319l4741483k6531660j9022172j3113420r001961o389319
10369C9977693m688781l579897k993122k579040k338075k181191k051716j922684
10361A7643187j827866j703754j519835j316101j138235r48313p77065o26730
10353G785288n31580m76757l91988l58124k78052k15451k30811k07143j60831
10344D934551j54814k29107k58288k48400k45929k40606k33944j60943j58314
10335C004206j89196j30840j18632j50255j00542q8871o0360p8338m9431o4915
10325A972826p2934q6736q4579q8589k0785k9209p3745m7045p5700l3503n8258
$$ plain form
10314 1301743 1210886 1134080 1109334 1096889 991547 917010 906400 893215 864246 869363 833498
10303 833498 775829 710065 656853 644330 651043 640421 613177 606596 610878 591134 595481 603595
10291 603595 604903 593101 585834 589225 582604 595208 637726 621510 570134 570875 557243 552426 578451
10278 578451 578057 561829 549746 533660 488603 484511 447327 397309 340529 352027 397007 392910
10266 392910 401104 473758 504292 502615 498578 472700 419115 365690 287620 266297 280573 260995
10254 260995 211980 186806 216324 254059 268927 284241 236657 225409 262535 312241 340629
10243 340629 332838 316936 316864 319767 331549 364059 410185 465101 570809 652638 712196 798527
10231 798527 907699 959404 941244 920968 832013 755057 688161 607471 527010 470058 425240
$$ packed form
10314A301743r0857p6806k4746j2445j05342p4537j0610j3185k8969N117l5865
10303H33498n7669o5764n3212j2523O713j0622k7244o581M282j9744M347Q114
10291F03595J308j1802p267L391o621J2604M2518j6216n1376P41j3632m817K6025
10278E78451l94j6228j2083j6086m5057m092l7184n0018n6780J1498M4980m097
10266C92910Q194P2654L0534j677m037k5878n3585n3425p8070k1323J4276j9578
10254B60995m9015k5174K9518L7735J4868J5314m7584j1248L7126M9706K8388
10243C40629p791j5902p2K903J1782L2510M6126N4916J05708Q1829N9558Q6331
10231G98527J09172N1705j8160k0276q8955p6956o6896q0690q0461n6952m4818
$$ plain form
10220 425240 392463 335267 291626 266119 193787 161183 166892 188158 173942 139807 107238 84562
10208 84562 71855 106949 131237 146175 126521 128355 106457 60751 38214 31044 46691 53554
10196 53554 68082 110178 137442 99295 93265 99979 84935 92965 84617 65968 94310 90745 104084
10183 104084 115411 103957 111115 103632 53717 20585 7334 -13338 -18043 24356 21232 21776 59172
10170 59172 71879 84569 68156 43242 13616 -6817 7745 21250 23737 41524 29932 55167
10158 55167 63894 102984 126601 105090 89020 88374 55518 82493 74027 58623 39147 25787
10146 25787 13706 1147 2849 7903 25983 31825 15464 2976 -19981 -1805 4330 17578
10134 17578 -18364 -15778 20938 29461 36640 42155 30287 6454 35905 37647 -822 -16862 -4203
$$ packed form
10220D25240l2777n7196m3641k5507p2332l2604N709K1266j4216l4135l2569k2676
10208H4562j2707L5094K4288J4938j9654J834k1898m5706k2537p170J5647O863
10196E3554J4528M2096K7264l8147o030O714j5044Q030q348j8649K8342l565J3339
10183A04084J1327j1454P158p483m9915l3132j3251k0672m705M2399l124N44L7396
10170E9172J2707J2690j6413k4914k9626k0433J4562J3505K487J7787j1592K5235
10158E5167Q727L9090K3617k1511j6070o46l2856K6975q466j5404j9476j3360
10146B5787j2081j2559J702N054J8080N842j6361j2488k2957J8176O135J3248
10134A7578l5942K586L6716Q523P179N515j1868k3833K9451J742l8469j6040J2659
$$ plain form
10121 -4203 18471 26259 43050 47655 32840 23909 10889 18388 54192 91896 122319 93084 59558
10108 59558 27231 46340 8173 -4786 7855 38567 60063 78209 63363 56039 47788 59795
10096 59795 75943 48808 -13058 -40894 -22943 -46283 -42280 -56080 -55171 -5337 20833 9741
10084 9741 -30398 -42976 -45732 -20192 -20356 -16416 8317 -41616 -41234 -16327 -4494 -3567 -43151
10071 -43151 -49822 -14197 6806 6142 20196 7448 1658 33161 39583 22317 48391 35080 19226
10058 19226 30064 66802 65793 70695 75654 103228 140771 129464 53966 2780 -18640 -62642
10046 -62642 -42519 45622 100646 130723 131604 122714 98696 53566 45396 32688 43785 89648
10034 89648 126184 67302 53296 49057 49229 73281 60322 79113 95470 102380 84001 63455
$$ packed form
10121d203K2674P788J6791M605j4815q931j3020P499L5804L7704L0423k9235l3526
10108E9558l2327J9109l8167j2959J2641L0712K1496J8146j4846p324q251J2007
10096E9795J6148k7135o1866k7836J7951k3340M003j3800R09M9834K6170j1092
10084I741m0139j2578k756K5540j64L940K4733m9933L82K4907J1833R27l9584
10071d3151o671L5625K1003o64J4054j2748n790L1503O422j7266K6074j3311j5854
10058A9226J0838L6738j009M902M959K7574L7543j1307p5498n1186k1420m4002
10046f2642K0123Q8141N5024L0077Q81q890k4018m5130q170j2708J1097M5863
10034H9648L6536n8882j4006m239J72K4052j2959J8791J6357O910j8379k0546
$$ plain form
10022 63455 60582 28263 19765 16465 14648 10721 17138 13844 -8022 -22494 -7426 32113 47702
10009 47702 51125 57938 55505 43458 32372 19253 6159 14984 57792 95719 83248 69521
9997 69521 91260 70664 69352 100436 132881 184276 216977 236826 240900 320992 449353 614688
9985 614688 794315 985695 1223707 1474174 1732574 1934530 2055751 2143325 2145465 2078321
9975 2078321 1935447 1716784 1477989 1236334 983368 770515 625695 485088 345340 262901
9965 262901 224105 216384 241603 216289 137523 105868 107913 105147 102673 93379 83646 110340 102095
9952 102095 52719 52097 63838 62231 78150 48181 19973 49591 97345 100006 108976 101938 61797
9939 61797 49937 43408 25115 6131 1081 58157 88441 29532 -12779 -52803 -75234 -26353
$$ packed form
10022F3455k873l2319q498l300j817l927O417l294k1866j4472J5068L9539J5589
10009D7702L423O813k433j2047j1086j3119j3094Q825M2808L7927j2471j3727
9997F9521K1739k0596j312L1084L2445N1395L2701J9849M074Q0092J28361J65335
9985F14688J79627J91380K38012K50467K58400K01956J21221Q7574K140o7144
9975B078321j42874k18663k38795k41655k52966k12853j44820j40607j39748q2439
9965B62901l8796p721K5219k5314p8766l1655K045k766k474r294r733K6694q245
9952A02095m9376o22J1741j607J5919k9969k8208K9618M7754K661Q970p038m0141
9939F1797j1860o529j8293j8984n050N7076L0284n8909m2311m0024k2431M8881
$$ plain form
9927 -26353 34481 46573 3859 14497 36383 12631 -14988 31577 25769 -1387 -64344 -62409
9915 -62409 -47859 -30760 9503 15830 14441 36086 82162 35626 28555 47644 35812 21456
9903 21456 17344 5671 6104 -30001 -62429 -80036 -17331 13472 12344 27746 23386 -35724 -20996
9890 -20996 -22128 -50575 -81481 -73861 -16657 -25951 -46130 -25173 3795 -16481 12165 29249
9878 29249 72291 142100 186944 210676 188656 101494 68951 41348 55762 51599 40410 -4918
9866 -4918 -38602 -9 17189 15710 15031 6626 45570 59683 23820 1656 39498 79272 59410
9853 59410 43505 49950 69774 74885 50724 45658 24602 30930 25700 19903 14399 -10736 3848
9840 3848 6025 8540 17017 26555 12208 -5704 8799 9933 -9264 -62749 -114582 -90713 -74098
$$ packed form
9927b6353O0834J2092m2714J0638K1886k3752k7619M6565n808k7156o2957J935
9915f2409J4550J7099M0263O327j389K1645M6076m6536p071J9089j1832j4356
9903B1456m112j1673M33l6105l2428j7607O2705L0803j128J5402m360n9110J4728
9890b0996j132k8447l0906P620N7204r294k0179K0957K8968k0276K8646J7084
9878B9249M3042O9809M4844K3732k2020q7162l2543k7603J4414m163j1189m5328
9866d918l3684L8593J7198j479o79q405L8944J4113l5863k2164L7842L9774j9862
9853E9410j5905O445J9824N111k4161n066k1056O328n230n797n504k5135J4584
9840C848K177K515Q477R538j4347j7912J4503J134j9197n3485n1833K3869J6615
$$ plain form
9827 -74098 -44309 -8175 27483 31857 -8685 630 28023 32975 24202 20565 36705 39195 46334
9814 46334 14055 -18107 12516 65751 118892 109238 69352 73731 42163 18211 29338 42853
9802 42853 43374 -10364 -24241 -27085 14070 23354 26747 32327 2404 -18674 -2114 12 23251
9789 23251 34124 47741 42490 3349 -15689 21286 17955 5460 -25324 -50349 -56851 -77779
9777 -77779 -100071 -85999 -41406 -22602 -20214 -23111 -19147 -15490 2060 20766 24981 -10828 -214
9764 -214 1170 -8819 -34338 -37195 33757 54712 79601 49635 18295 -13110 -20074 -20586 10331
9751 10331 4581 -28487 -33689 4968 50702 60808 80307 86731 65343 60922 54214 58536 51944
9738 51944 86337 98058 62193 52448 36427 58046 35788 1023 4012 -8489 -13203 -14434 -6511
$$ packed form
9827g4098K9789L6134L5658M374m0542R315K7393M952q773l637J6140K490P139
9814D6334l2279l2162L0623N3235N3141r654l9886M379l1568k3952J1127J3515
9802D2853N21n3738j3877k844M1155R284L393N580k9923k1078J6560K126K3239
9789B3251J0873J3617n251l9141j9038L6975l331j2495l0784k5025o502k0928
9777g7779k2292J4072M4593J8804K388k897L964L657J7550J8706M215l5809J0614
9764b14J384r989k5519k857P0952K0955K4889k9966l1340l1405o964n12L0917
9751A0331n750l3068n202L8657M5734J0106J9499O424k1388m421o708M322o592
9738E1944L4393J1721l5865r745j6021K1619k2258l4765K989j2501m714j231P923
$$ plain form
9725 -6511 48358 52682 50308 11741 -40602 9421 40746 44312 28519 26566 8867 -34642 -6913
9712 -6913 -12508 -28858 -47450 -46337 -37038 -76430 -76483 -46435 862 51367 58893 70284 54975
9699 54975 66301 61477 29659 31827 35240 42846 30251 8833 -12960 1205 7423 36122 19352
9686 19352 8495 12002 -16220 9099 16312 -2723 -17542 -41328 -42206 -40506 11685 45942 31962
9673 31962 15682 -28703 -45844 -14184 32925 53097 28340 26213 -5603 -6848 30294 14657
9661 14657 28727 27081 31215 616 -73375 -94664 -50496 -22088 -13963 5731 21383 14824 -8793
9648 -8793 -61327 -54790 -24474 -21464 -11179 -7741 3601 15999 7651 -12450 22357 4550 20092
9635 20092 64308 51628 52108 80163 85125 78880 62146 45959 97555 146583 111083 90583 66850
$$ packed form
9725f511N4869M324k374l8567n2343N0023L1325L566j5793j953j7699m3509K7729
9712f913n595j6350j8592J113R299l9392n3L0048M7297N0505P526J1391j5309
9699E4975J1326m824l1818K168L413P606j2595k1418k1793J4165O218K8699j6770
9686A9352j0857L507k8222K5319P213j9035j4819k3786q78J700N2191L4257j3980
9673C1962j6280m4385j7141L1660M7109K0172k4757k127l1816j245L7142j5637
9661A4657J4070j646M134l0599p3991k1289M4168K8408Q125J9694J5652o559k3617
9648h793n2534O537L0316L010J0285L438J1342J2398q348k0101L4807j7807J5542
9635B0092M4216j2680M80K8055M962o245j6734j6187N1596M9028l5500k0500k3733
$$ plain form
9622 66850 42324 35383 -17827 -9678 20257 20942 42726 70236 91692 91574 47931 24442 -45762
9609 -45762 -55371 -71793 -81549 -48583 15858 36264 12121 10686 -5865 697 22728 39802 68042
9596 68042 63489 30604 -4975 -17080 -33878 -41981 -35301 -24168 -17941 -9413 -4974 14582 5865
9583 5865 15726 42706 93049 75738 25895 13602 7147 1033 25978 61407 28543 -24612 -57000
9570 -57000 -39593 -603 6613 361 -5312 23948 50739 36628 66637 74188 56927 24113 24444
9557 24444 27793 -16413 -40393 -8738 18789 12922 -29023 -22761 -7296 -35833 -32235 -19435 -4880
9544 -4880 15829 21452 29662 6235 -17640 -31122 -29411 -19322 -10364 -36204 -38156 -25336 -16080
9531 -16080 309 -2699 -51480 -39794 -20958 -17421 -27215 -35476 -46590 -40026 -51184 -86032 -83344
$$ packed form
9622F6850k4526o941n3210Q149K9935O85K1784K7510K1456j18m3643k3489p0204
9609d5762r609j6422r756L2966O4441K0406k4143j435j6551O562K2031J7074K8240
9596F8042m553l2885l5579j2105j6798q103O680J1133O227Q528M439J9556q717
9583E865R861K6980N0343j7311m9843j2293o455o114K4945L5429l2864n3155l2388
9570e7000J7407L8990P216o252n673K9260K6791j4111L0009P551j7261l2814L31
9557B4444L349m4206k3980L1655K7527n867m1945O262J5465k8537L598J2800J4555
9544d880K0709N623Q210k3427k3875j3482J711J0089Q958k5840j952J2820R256
9531a6080J6389l008m8781J1686J8836L537r794q261j1114O564j1158l4848K688
$$ plain form
9518 -83344 -27401 12154 -25707 -73207 -45047 -2047 29315 22437 -2979 -36803 -6234 24003
9506 24003 -4767 -35825 -34152 -53134 -56449 -35118 31261 43101 9808 -15278 -27434 -10484
9494 -10484 18272 26130 32648 -10949 -23041 7756 -2080 -40048 -52758 -34485 -33664 -39766 -59464
9481 -59464 -81608 -31997 12288 25281 -270 37970 45971 36568 1868 3049 -8085 -32240
9469 -32240 -11616 15892 -5380 -24253 -3088 51040 9006 14312 41280 66794 60770 30601
9457 30601 38254 40014 23267 -22600 -52525 -28908 -48515 -21250 -16030 5688 22486 37075
9445 37075 47939 38982 32596 64645 45761 15732 20667 19601 46467 17370 -12273 -8856 -28568
9432 -28568 -43915 -15544 -14073 1164 33808 80297 46449 36615 47172 44309 -1643 -15502
$$ packed form
9518h3344N5943L9555l7861m7500K8160M3000L1362o878k5416l3824L0569L0237
9506B4003k8770l1058J673j8982l315K1331O6379J1840l3293k5086j2156J6950
9494a0484K8756P858O518m3597j2092L0797r836l7968j2710J8273Q21o102j9698
9481e9464k2144M9611M4285J2993k5551L8240Q001r403l4700J181j1134k4155
9469c2240K0624K7508k1272j8873K1165N4128m2034N306K6968K5514o024l0169
9457C0601P653J760j6747m5867k9925K3617j9607K7265N220K1718J6798J4589
9445C7075J0864q957o386L2049j8884l0029M935j066K6866k9097k9643L417j9712
9432b8568j5347K8371J471J5237L2644M6489l3848r834J0557k863m5952j3859
$$ plain form
9420 -15502 -35716 2592 50170 25927 34461 28981 62376 102678 84717 7613 -28810 -21392
9408 -21392 7620 22934 -13666 -24262 -45178 -53614 -23428 -8655 -17667 -22012 -44841 -28025
9396 -28025 -12936 -35205 -8235 20084 -8541 10467 28796 29279 14429 2790 14343 55154
9384 55154 61674 26473 -9623 15364 27085 61015 52357 30404 21459 60342 38852 21781
9372 21781 -21965 -33982 -23584 -28057 -26140 -51375 -58011 -81024 -73818 -42922 -20879 -15859 1595
9359 1595 14676 32880 17401 40288 68858 1332 -8931 -18442 -23128 -27912 -33186 -5992 4997
9346 4997 8285 54 -7484 -3476 -5746 -18550 -19508 -28182 -43548 -32731 -48443 -62742 -75789 -20916
9332 -20916 43601 22735 4901 11111 -181 13315 16657 21638 -6982 -55963 -67731 -97818
$$ packed form
9420a5502k0214L8308M7578k4243Q534n480L3395M0302j7961p7104l6423P418
9408b1392K9012J5314l6600j0596k0916q436L0186J4773r012m345k2829J6816
9396b8025J5089k2269K6970K8319k8625J9008J8329M83j4850j1639J1553M0811
9384E5154O520l5201l6096K4987J1721L3930q658k1953q945L8883k1490j7071
9372B1781m3746j2017J0398m473J917k5235o636k3013P206L0896K2043N020J7454
9359A595J3081J8204j5479K2887K8570o7526j0263r511m686m784n274K7194J0989
9346D997L288q231p538M008k270j2804r58q674j5366J0817j5712j4299j3047N4873
9332b0916O4517k0866j7834O210j1292J3496L342M981k8620m8981j1768l0087
$$ plain form
9320 -97818 -68120 5008 53149 65753 43068 10223 47296 50908 -3687 -13616 -14405 -19576 -33540
9307 -33540 -40702 -55313 -40516 -1330 6455 -20144 -23439 -78831 -91602 -60882 -15114 -9687 15410
9294 15410 -9879 -43838 2910 19322 -2259 -1739 -11216 -16554 18569 29160 50615 34269 3360
9281 3360 -39605 -16459 1547 3056 7731 -13562 27907 18945 2782 40185 43465 58650 58239
9268 58239 80529 56796 30232 -2058 -4965 -3362 17364 24820 -27463 -19473 -14536 -10308 5690
9255 5690 9335 43104 7306 21068 31350 13904 55706 56130 42827 7477 -16795 35469 73689
9242 73689 34515 40991 21252 -3962 6205 -9105 -26647 638 12332 17392 21355 27425 12814
9229 12814 -9095 -26164 -26628 -3051 -12081 -71362 -70012 -27447 7983 32122 55287 57664 24311
$$ packed form
9320i7818K9698P3128M8141J2604k2685l2845L7073L612n4595r929p89n171j3964
9307c3540p162j4611J4797L9186P785k6599l295n5392j2771L0720M5768N427K5097
9294A5410k5289l3959M6748J6412k1581N20r477n338L5123J0591K1455j6346l0909
9281C360m2965K3146J8006J509M675k1293M1469q962j6163L7403L280J5185m11
9268E8239K2290k3733k6564l2290k907J603K0726P456n2283P990M937M228J5998
9255E690L645L3769l5798J3762J0282j7446M1802M24j3303l5350k4272N2264L8220
9242G3689l9174O476j9739k5214J0167j5310j7542K7285J1694N060L963O070j4611
9229A2814k1909j7069m64K3577r030n9281J350M2565L5430K4139K3165K377l3353
$$ plain form
9216 24311 -25171 -40703 -25998 -13783 1900 1831 -10771 -6252 -26967 -4687 12849 -28353 -71519
9203 -71519 -38706 15127 36654 -4194 -27972 -29846 -11676 8066 -3233 -2461 -3625 12570 -14085
9190 -14085 -22250 3930 23068 5040 -10846 -52887 -61991 -45995 -33507 -13936 -26356 1050
9178 1050 9525 -19072 -24134 -2039 22609 2378 -20902 -62804 -67558 -56592 -62729 -80681 -60308
9165 -60308 -62177 -59182 -81410 -43966 -1061 17805 -28739 -20562 2394 -10858 -16686 -7324 43463
9152 43463 44800 20251 9749 -5533 -29463 15256 25420 31537 24242 11827 43 28689
9140 28689 80555 127225 66318 51018 62189 96129 117130 114007 111264 119826 154521 133916
9128 133916 111870 128007 158541 172989 181286 207738 237120 290655 293197 346750 430289 510543
$$ packed form
9216B4311m9482j5532J4705J2215J5683o9j2602M519k0715K2280J7536m1202m3166
9203g1519L2813N3833K1527m0848k3778j874J8170J9742j1299P72j164J6195k6655
9190a4085q165K6180J9138j8028j5886m2041r104J5996J2488J9571j2420K7406
9178A050Q475k8597n062K2095K4648k0231k3280m1902m754J0966o137j7952K0373
9165f0308j869K995k2228L7444M2905J8866m6544Q177K2956j3252n828R362N0787
9152D3463J337k4549j0502j5282k3930M4719J0164O117p295j2415j1784K8646
9140B8689N1866M6670o0907j5300J1171L3940K1001l123k743Q562L4695k0605
9128A33916k2046J6137L0534J4448Q297K6452K9382N3535K542N3553Q3539Q0254
$$ plain form
9116 510543 616737 681979 789636 993198 1223965 1606626 2164149 3029495 4555570 7298298
9106 7298298 12003098 17618517 19489536 17075979 13297294 9340616 6270845 4292463
9098 4292463 3110392 2352992 1821081 1491289 1282895 1113555 954334 820696 726510 607862
9088 607862 537880 491746 456564 406569 338170 316192 323218 291201 256616 187213 179069 164712
9076 164712 172774 182979 169048 152677 147340 116623 78252 43890 63496 78536 111265 107272
9064 107272 68065 73731 104826 103002 87184 54251 48634 79516 75310 52851 45899 38565 53481
9051 53481 45637 68119 72673 91184 67114 17449 8102 17234 15729 3617 13433 57643 77761
9038 77761 53254 27104 34289 21937 9237 9243 7020 -18680 640 21639 29469 65941 68335
$$ packed form
9116E10543J06194O5242J07657K03562K30767L82661N57523Q65346J526075K742728
9106G298298M704800N615419J871019k413557l778685l956678l069771j978382
9098D292463j182071p57400n31911l29792k08394j69340j59221j33638r4186j18648
9088F07862o9982m6134l5182m9995o8399k1978P026l2017l4585o9403q144j4357
9076A64712Q062J0205j3931j6371n337l0717l8371l4362J9606J5040L2729l993
9064A07272l9207N666L1095j824j5818l2933n617L0882m206k2459o952p334J4916
9051E3481p844K2482M554J8511k4070m9665r347R132j505j2112R816M4210K0118
9038G7761k4507k6150P185j2352j2700Ok223k5700J9320K0999P830L6472K394
$$ plain form
9025 68335 35828 31189 41592 76225 123272 106625 41282 19783 47443 51721 39815 48306
9013 48306 46231 47293 18956 14597 5711 -40296 -69640 -37741 -32488 -11784 -11009 17503 -9261
9000 -9261 -38275 -38594 -11736 584 -41624 -57991 -50574 -70963 -71179 -46202 -24383 15089 33095
8987 33095 5979 -17976 -27440 -18518 -15924 -26366 -26091 -14589 -282 55560 69841 65546 67814
8974 67814 36805 50662 6433 1578 23274 61276 60293 31747 25555 -521 11286 -6902 -38660
8961 -38660 -32022 -52615 -47734 -35849 -4428 59520 58879 41540 -31674 -70068 -53057 -19946 3111
8948 3111 42421 43527 68189 80870 68709 53461 54752 12614 -10140 -26016 -34569 -33643 -47310
8935 -47310 -13489 5701 -7100 -15438 -60823 -81505 -54045 -5526 821 -37574 -69678 -66830
$$ packed form
9025F8335l2507m639J0403L4633M7047j6647o5343k1499K7660M278j1906Q491
9013D8306k075J062k8337m359q886m6007k9344L1899N253K0704P75K8512k6764
9000i261k9014l19K6858J2320m2208j6367P417k0389k16K4977K1819L9472J8006
8987C3095k7116k3955r464Q922K594j0442K75J1502J4307N5842J4281m295K268
8974F7814l1009J3857m4229m855K1696L8002r83k8546o192k6076J1807j8188l1758
8961c8660O638k0593M881J1885L1421O3948o41j7339p3214l8394J7011L3111K3057
8948C111L9310J106K4662J2681j2161j5248J291m2138k2754j5876q553R26j3667
8935d7310L3821J9190j2801q338m5385k0682K7460M8519O347l8395l2104K848
$$ plain form
8923 -66830 -16659 -36050 -16933 -6609 -19685 -23621 -18002 21892 26845 18932 7209 -28708 -53325
8910 -53325 -81313 -99499 -64460 -51623 -55103 -41177 -66281 -80561 -40356 13834 86193 39380
8898 39380 -10005 -33628 -40036 -52361 -67138 -47247 -6691 10220 10117 -18652 -10400 16394 29994
8885 29994 39294 -16891 -2889 -3653 -17915 -18083 -19240 -6420 14525 -27418 -72563 -75288 -47023
8872 -47023 -7297 -596 -2875 -12675 20222 30609 33047 14124 -40651 -35264 -16977 3143 12959
8859 12959 15316 20090 -20283 -40750 -14009 23212 37869 23501 25039 9828 -15074 5644
8847 5644 -2216 -17759 -31197 -34358 -13324 -9299 -36321 -8832 -9564 49 29077 50712 -8589
8834 -8589 -37612 -34096 -3797 -17857 -30674 -24969 -36524 -54942 -63331 -50712 -34935 -4287 -9981
$$ packed form
8923f6830N0171j9391J9117J0324j3076l936N619L9894M953p913j1723l5917k4617
8910e3325k7988j8186L5039J2837l480J3926k5104j4280M0205N4190P2359m6813
8898C9380m9385k3623o408j2325j4777J9891M0556J6911j03k8769Q252K6794J3600
8885B9994R300n6185J4002p64j4262j68j157J2820K0945m1943m5145k725K8265
8872d7023L9726O701k279r800L2897J0387K438j8923n4775N387J8287K0120R816
8859A2959K357M774m0373k0467K6741L7221J4657j4368J538j5211k4902K0718
8847E644p860j5543j3438l161K1034M025k7022K7489p32R613K9028K1635n9301
8834h589k9023L516L0299j4060j2817N705j1555j8418q389J2619J5777L0648n694
$$ plain form
8821 -9981 -6949 17759 18573 23845 30842 26174 -1455 20466 20402 -2669 -27594 18999 76126 48380
8807 48380 -10230 -45978 -73061 -91448 -78758 -33303 -6381 -4920 -25336 4250 33803 19825
8795 19825 29261 40208 12655 7310 10300 -29740 -36338 -22472 -8880 24765 27810 70434 72052
8782 72052 79500 56431 26487 -5934 -35851 -56934 -39203 10250 -13791 -56373 -38162 -18970
8770 -18970 5764 5021 28173 50039 -4537 -7184 9528 17742 -4672 14993 -4034 -26010 -9171
8757 -9171 14464 -10412 -7251 14651 43247 29186 4975 -20652 -21280 -17143 -22864 -11871 -23818
8744 -23818 -23235 -20730 -41439 -23468 -26512 -27888 -28918 -20389 -37097 -32104 -2195 30111 59265
8731 59265 45737 36643 16601 -1982 4079 8846 3774 -11265 -18659 -21476 3368 19850 27008
$$ packed form
8821i981L032K4708Q14N272O997m668k7629K1921o4k3071k4925M6593N7127k7746
8807D8380n8610l5748k7083j8387J2690M5455K6922J461k0416K9586K9553j3978
8795A9825R436J0947k7553n345K990m0040o598J3866J3592L3645L045M2624J618
8782G2052P448k3069k9944l2421k9917k1083J7731M9453k4041m2582J8211J9192
8770a8970K4734p43K3152K1866n4576k647J6712Q214k2414J9665j9027k1976J6839
8757i171K3635k4876L161K1902K8596j4061k4211k5627o28M137n721J0993j1947
8744b3818N83K505k0709J7971l044j376j030Q529j6708M993K9909L2306K9154
8731E9265j3528r094k0042j8583O061M767n072j5039p394k817K4844J6482P158
$$ plain form
8718 27008 20092 16026 -13436 -40465 -12533 -24288 -13633 6516 29653 30812 7308 -5262
8706 -5262 -846 15587 51284 10378 -11870 -26509 -31075 -23722 -14861 -28606 -39734 -6257 5170
8693 5170 17261 26950 4053 -20482 -40689 -30728 -20602 43950 53515 -13377 -28401 -24091 3276
8680 3276 23906 16731 26627 19257 53242 57198 13368 -4093 1451 19224 10426 -10701 -12291
8667 -12291 -34227 -56485 -68834 -38583 -1296 19122 48515 19288 43761 59270 50345 28907
8655 28907 6527 1721 -12385 -24961 21791 3947 -44391 -26803 -18382 -6475 15017 29188
8643 29188 40752 70098 97488 56142 36232 -6706 -17434 -35788 -16182 17445 43921 31847
8631 31847 -16959 -3551 5760 -22110 -6494 1747 28945 -8787 -52114 -72191 -52586 35594
$$ packed form
8718B7008o916m066k9462k7029K7932j1755J0655K0149K3137J159k3504j2570
8706e262M416J6433L5697m0906k2248j4639m566P353Q861j3745j1128L3477J1427
8693E170J2091R689k2897k4535k0207R961J0126O4552R565o6892j5024M310K7367
8680C276K0630p175R896p370L3985L956m3830j7461N544J7773q798k1127j590
8667a2291k1936k2258j2349L0251L7287K0418K9393k9227K4473J5509q925k1438
8655B8907k2380m806j4106j2576M6752j7844m8338J7588Q421J1907K1492J4171
8643B9188J1564K9346K7390m1346j9910m2938j0728j8354J9606L3627K6476j2074
8631C1847m8806J3408R311k7870J5616Q241K7198l7732m3327k0077J9605Q8180
$$ plain form
8619 35594 65890 41293 16987 -5980 -12784 -18130 -19049 27071 26821 5889 -89 7660 45326
8606 45326 47894 27630 9077 27491 24567 20504 -25736 -65779 -86732 -100460 -84933 -26904
8594 -26904 -23679 -1600 -33297 -6865 -8078 19197 25529 39355 68065 51782 24549 -32004
8582 -32004 -39820 -37011 -32214 -15488 18568 -19719 -31606 -12123 1922 30144 53768 69740
8570 69740 43301 973 -18915 4787 64060 61992 3013 -36122 -34679 -6884 -22222 -22898 -22491
8557 -22491 -11190 9167 51563 36715 -24163 -58531 -54898 -40518 -13341 -15251 -57579 -57224 -30312
8544 -30312 -39792 -67687 -24004 22131 15416 -26201 -44458 -7320 -15582 -27687 490 31020
8532 31020 41386 54443 82317 93564 70196 37430 24262 19953 -11502 -19465 11753 36058
$$ packed form
8619C5594L0296k4597k4306k2967o804n346r19M6120k50k0932n978P749L7666
8606D5326K568k0264j8553J8414k924m063m6240m0043k0953j3728J5527N8029
8594b6904L225K2079l1697K6432j213K7275O332J3826K8710j6283k7233n6553
8582c2004p816K809M797J6726L4056l8287j1887J9483J4045K8222K3624J5972
8570F9740k6439m2328j9888K3702N9273k068n8979l9135J443K7795j5338o76M07
8557b2491J1301K0357M2396j4848o0878l4368L633J4380K7177j910m2328L55K6912
8544c0312r480k7895M3683M6135o715m1617j8257L7138q262j2105K8177L0530
8532C1020J0366J3057K7874J1247k3368l2766j3168m309l1455p963L1218K4305
$$ plain form
8520 36058 14092 -14866 -31738 -14860 -28045 -30889 3301 2813 -3816 -8554 13080 38610 6807
8507 6807 -13176 -20560 -10616 38418 77276 51339 -8905 -20425 -21732 -18927 -28439 -15184 -16121
8494 -16121 -4108 -19486 -20902 17962 71958 83380 55747 26023 41637 83093 73467 51515
8482 51515 50926 52983 23363 -26247 -69601 -56889 -27327 -24070 -59974 -108828 -93882 -42425 -29493
8469 -29493 -25740 -4989 29465 51380 15544 -12853 -43182 -48121 -32009 -28924 -18483 -29640
8457 -29640 -40725 -80848 -77850 -94612 -120513 -80704 -67182 -30911 31529 26762 2515 10829
8445 10829 6088 -5019 24372 9882 -21174 -31273 -56373 -59410 -85007 -61189 -31982 -10296
8433 -10296 2955 6381 -11166 -2626 14611 11104 12090 9374 2546 9068 -47685 -59328 -68864 -59956
$$ packed form
8520C6058k1966k8958j6872J6878j3185k844L4190m88o629m738K1634K5530l1803
8507F807j9983p384R944M9034L8858k5937o0244j1520j307K805r512J3255r37
8494a6121J2013j5378j416L8864N3996J1422k7633k9724J5614M1456r626k1952
8482E1515n89K057k9620m9610m3354J2712K9562L257l5904m8854J4946N1457J2932
8469b9493L753K0751L4454K1915l5836k8397l0329m939J6112L085J0441j1157
8457b9640j1085m0123K998j6762k5901L9809J3522L6271O2440m767k4247Q314
8445A0829m741j1107K9391j4490l1056j0099k5100l037k5597K3818K9207K1686
8433a0296J3251L426j7547Q540J7237l507R86k716o828O522n6753j1643r536Q908
$$ plain form
8419 -59956 -2919 19747 7804 -32324 -40598 -34201 -41319 -21077 -14461 -52109 -54479 -22164 -19292
8406 -19292 -32736 -33952 -13712 -4134 970 -36312 -13377 22568 21157 -14160 -11074 -8546 -10562
8393 -10562 -32712 -27273 17658 34070 30673 -9692 -41444 -52772 -58645 -52009 -23141 -4019 14768
8380 14768 31817 40956 16694 -12941 -4209 -15233 -49661 -50081 -37718 -14583 27398 8940 -7128
8367 -7128 8286 13810 8002 3923 -23648 -36293 -37756 -42502 -19549 -6315 -26635 -5369 4374
8354 4374 1136 -7734 -18404 -10086 3422 -16334 -32056 -17621 -38570 -35161 -29325 23535 35288
8341 35288 29944 44913 32257 63774 70008 51838 46297 341 -12504 -49813 -68134 -68748 -27079
8328 -27079 899 -27047 -563 7898 -10243 -8326 1178 22267 13897 -21184 -26418 -2470 3124
$$ packed form
8419e9956N7037K2666j1943m0128q274O397p118K0242O616l7648k370L2315K872
8406a9292j3444j216K0240R578N104l7282K2935L5945j411l5317L086K528k016
8393a0562k2150N439M4931J6412l397m0365l1752j1328n873O636K8868J9122J8787
8380A4768J7049R139k4262k9635Q732j1024l4428m20J2363K3135M1981j8458j6068
8367g128J5414N524n808m079k7571j2645j463m746K2953J3234k0320K1266R743
8354D374l238q870j0670Q318J3508j9756j5722J4435k0949L409N836N2860J1753
8341C5288n344J4969j2656L1517O234j8170n541m5956j2845l7309j8321o14M1669
8328b7079K7978k7946K6484Q461j8141J917R504K1089q370l5081n234K3948N594
$$ plain form
8315 3124 5394 10909 21291 36769 23863 -12671 -13592 19672 48656 4669 -10382 -2621 -42986
8302 -42986 -36553 -19114 -24595 -36600 -50137 -43123 -30286 -13540 -4648 -6672 -12565 -33919 -26079
8289 -26079 -8740 -27564 -19451 -2727 -20286 -39910 -70443 -67930 -49647 -50468 -26728 -11875 -11936
8276 -11936 -22568 -29920 -27334 -20088 -30451 -13596 -15069 -16049 7392 18685 28783 48571 39107
8263 39107 34215 48413 67105 72549 20734 -12641 -16124 -10885 5334 -15527 1404 12128 -22463
8250 -22463 -38779 -36766 -39206 -24328 -69462 -67701 -18626 -53385 -45183 -17783 -55588 -75503 -60819
8237 -60819 -9758 11476 19978 -6976 -31154 -39248 -41335 -42794 -48133 -25990 4382 -5897 -15488
8224 -15488 4131 -9352 -20388 32018 51301 41639 25968 22215 -21012 -18273 -11443 -4298 -38237
$$ packed form
8315C124K270N515J0382J5478j2906l6534r21L3264K8984m3987j5051P761m0365
8302d2986O433J7439n481j2005j3537P014J2837J6746Q892k024n893k1354P840
8289b6079J7339j8824Q113J6724j7559j9624l0533K513J8283q21K3740J4853o1
8276a1936j0632p352K586P246j0363J6855j473r80K3441J1293J0098J9788r464
8263C9107m892J4198J8692N444n1815l3375l483N239J6219k0861J6931J0724l4591
8250b2463j6316K013k440J4878m5134J761M9075l4759Q202K7400l7805j9915J4684
8237f0819N1061K1234Q502k6954k4178q094k087j459n339K2143L0372j0279r591
8224a5488J9619j3483j1036N2406J9283r662j5671l753m3227K739O830P145l3939
$$ plain form
8211 -38237 -49126 -39703 -35414 -10287 7545 -3612 -9636 -11705 -11673 -18735 -51403 -45195 3061 11264
8197 11264 -508 -4339 -35847 -54094 -54374 -68446 -70364 -71284 -47486 -57040 -49891 -47769 -50323 2756
8183 2756 36125 76109 94925 117543 121742 88502 92489 103053 95851 162500 235651 317093 302892
8170 302892 242528 163264 136203 109137 72090 73779 35059 39748 45386 41997 31346 22411 43305
8157 43305 66769 88772 79230 54256 53474 28669 -1348 -21099 7288 42631 44407 57148 94499
8144 94499 114445 103982 132489 246446 359743 557374 744217 828658 830298 689808 508122
8133 508122 362999 246365 153783 112476 129198 156319 132081 99006 67465 60956 46608
8122 46608 67455 61960 31886 33052 29919 39728 41076 37921 46210 44733 64628 94308 103520 117099
$$ packed form
8211c8237j0889R423M289K5127J7832j1157o024k069L2p062l2668O208M8256Q203
8197A1264j1772l831l1508j8247k80j4072j918r20K3798r554P149K122k554N3079
8183B756L3369L9984J8816K2618M199l3240L987J0564p202O6649P3151Q1442j4201
8170C02892o0364p9264k7061k7066l7047J689l8720M689N638l389j0651q935K0894
8157D3305K3464K2003r542k4974p82k4805l0017j9751K8387L5343J776J2741L7351
8144I4499J9946j0463K8507J13957J13297J97631J86843Q4441J640j40490j81686
8133E08122j45123j16634r2582m1307J6722K7121k4238l3075l1541o509j4348
8122D6608K0847n495l0074J166l133R809J348l155Q289j477J9895K9680R212J3579
$$ plain form
8108 117099 190205 262463 339609 440388 609510 799649 881155 804120 659284 486735 385147
8097 385147 304055 234492 172114 117830 71647 71229 86491 48994 29042 34460 39399 58485
8085 58485 77007 95953 66841 42670 68479 43690 15566 -46291 -71925 -59627 -37101 -18200
8073 -18200 9441 46574 64764 150738 221539 288559 331837 298792 263911 226082 138459 124538
8061 124538 118033 81480 55987 14957 37852 47517 2593 -32449 -5794 -5312 -23317 -19248 -13488
8048 -13488 -33899 -3257 26507 -1307 10539 35493 30697 45476 57480 20935 -16242 1804
8036 1804 9266 -7424 -3498 22121 36844 48949 37326 21760 36168 39770 16624 24895 33042
8023 33042 62730 62388 23259 27337 19815 6613 9428 -2035 -17002 -7337 -27353 -17404 23076
$$ packed form
8108A17099P3106P2258P7146J00779J69122J90139Q1506p7035j44836j72549j01588
8097C85147q1092o9563o2378n4284m6183m18J5262l7497j9952N418M939J9086
8085E8485J8522J8946k9112k4171K5809k4789k8124o1857k5634J2298K2526J8901
8073a8200K7641L7133J8190Q5974P0801O7020M3278l3045l4881l7829q7623j3921
8061A24538o505l6553k5493m1030K2895R665m4924l5042K6655M82j8005M069N760
8048a3488k0411L0642K9764k7814J1846K4954m796J4779J2004l6545l7177J8046
8036A804P462j6690L926K5619J4723J2105j1623j5566J4408L602k3146Q271Q147
8023C3042K9688l42l9129M078p522j3202K815j1463j4967R665k0016R949M0480
$$ plain form
8010 23076 32408 60509 51283 15050 -9886 7154 -1738 15378 13230 41242 67968 81041 57912
7997 57912 26499 2898 43782 56086 37879 50974 31818 11153 6017 14824 23167 6076
7985 6076 54809 101273 74655 51907 33087 29392 15948 7070 -11667 -39974 -57868 -64200 -36387
7972 -36387 -49767 2878 11614 26490 10220 19523 29183 6923 -50184 -60868 -58122 -35424 -2868
7959 -2868 36273 34827 41025 -1268 -17182 45453 42405 -31366 -87669 -73979 -45984 -16814 -2327
7946 -2327 -20624 -64997 -67886 -41158 -6299 12005 10451 -8597 -4397 -18620 -26203 -60889 -22940
7933 -22940 -1935 41503 87820 109469 87772 51334 2943 -33959 -36359 -47052 -60987 -49934
7921 -49934 -40213 -27301 -189 35450 38057 12219 19888 35190 2559 -20711 -3509 -3234 -26213
$$ packed form
8010B3076R332K8101r226l6233k4936J7040q892J7116k148K8012K6726J3073k3129
7997E7912l1413k3601M0884J2304j8207J3095j9156k0665n136Q807Q343j7091
7985F076M8733M6464k6618k2748j8820l695j3444q878j8737k8307j7894o332K7813
7972c6387j3380N2645Q736J4876j6270R303R660k2260n7107j0684K746K2698L2556
7959b868L9141j446O198m2293j5914O2635l048p3771n6303J3690K7995K9170J4487
7946b327j8297m4373k889K6728L4859J8304j554j9048M200j4223p583l4686L7949
7933b2940K1005M3438M6317K1649k1697l6438m8391l6902k400j0693j3935J1053
7921d9934R721J2912K7112L5639K607k5838P669J5302l2631k3270J7202K75k2979
$$ plain form
7908 -26213 -10705 9734 21985 28328 33213 62359 76628 62040 70197 76124 60082 41969 65153
7895 65153 53000 -15198 -32552 882 36700 45737 12050 2525 21249 33208 53096 79209
7883 79209 100396 59461 51815 24196 18215 -14854 5912 44097 39200 35592 30466 13532 1766
7870 1766 -4162 -11642 -45149 -44710 -874 27417 54693 31629 17292 12724 31809 66813 20640
7857 20640 -56827 -19833 -7756 -33726 -24006 -10551 8614 17688 -4933 -10296 18603 20292 -4424
7844 -4424 -19726 -57145 -90666 -87218 -51611 -12792 -11806 -22546 -22011 -60158 -64946 -38250 -37977 -41192
7830 -41192 -33576 -2494 23678 20972 -25719 -46851 -22388 -33051 -61829 -57633 -35129 -24909
7818 -24909 -7669 -9569 -55982 -60361 3021 -11722 -25696 13820 7390 -33173 -36493 -20996 -14196
$$ packed form
7908b6213J5508K0439J2251O343M885K9146J4269j4588Q157N927j6042j8113K3184
7895F5153j2153o8198j7354L3434L5818R037l3687r525J8724J1959J9888K6113
7883G9209K1187m0935p646k7619n981l3069K0766L8185m897l608n126j6934j1766
7870A766n928p480l3507M39M3836K8291K7276k3064j4337m568J9085L5004m6173
7857B0640p7467L6994J2077k5970R720J3455J9165R074k2621n363K8899J689k4716
7844d424j5302l7419l3521L448L5607L8819R86j0740N35l8147m788K6696K73l215
7830d1192P616L1082K6172k706m6691k1132K4463j0663k8778M196K2504J0220
7818b4909J7240j900m6413m379O3382j4743j3974L9516o430m0563l320J5497O800
$$ plain form
7805 -14196 6060 28139 23768 16101 -8355 -68902 -90939 -42477 -7111 -23987 -63637 -44120
7793 -44120 -19554 -25825 -1331 41288 54556 33152 29066 39563 27900 42959 17318 32374
7781 32374 12114 -16123 -8144 -14252 -16826 5790 17588 -7229 7931 19208 13601 -5013 -3907
7768 -3907 -43814 -53796 -26321 -6118 6620 28131 25547 -18753 -48074 -87497 -70035 -42375
7756 -42375 -27752 -4384 -22130 -32161 -12940 -16481 -6136 -8547 -688 -9531 -9143 -3439 -11881
7743 -11881 7186 46519 14349 -25807 -17125 6990 55889 71799 65318 42685 7430 -25705
7731 -25705 4826 26493 39688 7146 -48210 -57595 -51900 -40838 -22754 -32960 -39757 -28336
7719 -28336 13841 15104 -5712 -45830 -5437 33225 27771 21663 -22976 -66385 -27454 -23507 -36859
$$ packed form
7805a4196K0256K2079m371p667k4456o0547k2037M8462L5366j6876l9650J9517
7793d4120K4566o271K4494M2619J3268k1404m086J0497j1663J5059k5641J5056
7781C2374k0260k8237P979o108k574K2616J1798k4817J5160J1277n607j8614J106
7768c907l9907r982K7475K0203J2738K1511k584m4300k9321l9423J7462K7660
7756d2375J4623K3368j7746j0031J9221l541J0345k411P859q843L88N704q442
7743a1881J9067L9333l2170m0156Q682K4115M8899J5910o481k2633l5255l3135
7731b5705L0531K1667J3195l2542n5356r385N695J1062J8084j0206o797J1421
7719b8336M2177J263k0816m0118M0393L8662n454o108m4639m3409L8931L947j3352
$$ plain form
7706 -36859 -38606 8119 38945 75873 83610 66984 57513 46785 29076 9544 -22073 -42160
7694 -42160 -25577 -9133 -28990 -22561 -2960 -18535 -5907 -12492 -31252 -70185 -84444 -63944
7682 -63944 -55001 -69729 -40936 -13587 -237 6090 8005 7000 17538 6872 23393 47483 49804
7669 49804 47646 51634 45436 19698 -13410 5359 16222 -3466 -15647 -36745 -44654 -35296 -51187
7656 -51187 -5761 22724 32037 22287 -30275 -40235 -37579 -45027 -5869 7439 -45080 -72890 -79829
7643 -79829 -108643 -74567 -20180 18243 -3775 -9982 -27598 -27852 -14091 10389 47345 49485 29417
7630 29417 21342 -31840 -32478 2450 41599 15432 31817 41928 49406 27246 1231 898 8705
7617 8705 36132 13658 6698 3597 -29081 -44795 -51726 -49628 29554 48584 24942 24104 35225
$$ packed form
7706c6859j747M6725L0826L6928P737j6626r471j0728j7709j9532l1617k0087
7694d2160J6583J6444j9857O429J9601j5575J2628o585j8760l8933j4259K0500
7682f3944Q943j4728K8793K7349J3350O327J915j005J0538j0666J6521K4090K321
7669D9804k158L988o198k5738l3108J8769J0863j9688j2181k1098p909R358j5891
7656e1187M5426K8485R313r750n2562r960K656p448L9158J3308n2519k7810o939
7643g9829k8814L4076N4387L8423k2018o207j7616k54J3761K4480L6956K140k0068
7630B9417q075n3182o38L4928L9149k6167J6385J0111P478k2160k6015l33P807
7617H705K7427k2474o960l101l2678j5714o931K098P9182J9030k3642q38J1121
$$ plain form
7604 35225 48156 46707 3753 -16646 -33300 -13789 -19302 -20986 -30042 -19903 3387 -5943 -2216
7591 -2216 31601 24909 40856 40462 8144 -41647 -60581 -28507 -12609 -45652 -31252 -9765 2544
7578 2544 46296 40635 15697 -4008 -1052 -39291 -63351 -39922 -35442 -36409 -37503 -50323 -34226
7565 -34226 -12608 -3329 -15672 -14118 9800 22645 12896 -15310 -8852 33437 54894 38372 -5085
7552 -5085 -55799 -19503 -1075 17105 -25016 -48853 -47986 -39501 -22140 -15130 -53547 -46342 -54701
7539 -54701 -93506 -106168 -85598 -70060 -72184 -67425 -37773 -50038 -36220 -2838 30875 14867
7527 14867 -43353 -55545 -58891 -63084 -61396 -86358 -87126 -32495 -1972 1114 13528 -3275 -28730
7514 -28730 -25344 -2009 17058 8197 14536 690 -12694 -49270 -53551 -22093 -22754 12832 25170
$$ packed form
7604C5225J2931j449m2954k0399j6654J9511n513j684r056J0139K3290r330L727
7591b216L3817o692J5947l94l2318m9791j8934L2074J5898l3043J4400K1487J2309
7578B544M3752n661k4938j9705K956l8239k4060K3429M480r67j094j2820J6097
7565c4226K1618R279j2343J554K3918J2845r749k8206O458M2289K1457j6522m3457
7552e085n0714L6296J8428J8180m2121k3837Q67Q485J7361P010l8417P205q359
7539e4701l8805j2662K0570J5538k124M759K9652j2265J3818L3382L3713j6008
7527A4867n8220j2192l346m193J688k4962p68N4631L0523L086J2414j6803k5455
7514b8730L386K3335J9067q861O339j3846j3384l6576m281L1458o61L5586J2338
$$ plain form
7501 25170 13096 5507 12017 43229 13509 -6376 -16028 1890 38481 75696 82312 51755 45056
7488 45056 17020 -25632 -22269 -26535 -4420 14546 29000 29690 39597 58118 20965 940 10584
7475 10584 8037 25267 -1267 10979 -13687 -55390 -63959 -57860 -46004 -12239 -20460 -15829 16207
7462 16207 11144 24773 -6897 -31280 -19946 -18524 -18212 -2539 -2485 -14578 -22689 -14150 -49654 -37356
7448 -37356 9516 14441 43585 63513 21512 -16525 -2120 -7712 -3912 -802 11124 39302 15459
7435 15459 3398 4845 5233 -2833 1101 -28222 -48961 -16173 -14753 -17477 -13767 -18286 -66082 -66736
7421 -66736 -45270 -13363 -3908 4315 15090 3251 -44745 -94594 -80087 -16747 -11898 -47205
7409 -47205 -5033 24094 -1246 -38751 -68140 -57316 -27279 -22037 -42903 -48447 -19650 -28063
$$ packed form
7501B5170j2074p589O510L1212k9720j9885r652J7918L6591L7215O616l0557o699
7488D5056k8036m2652L363m266K2115J8966J4454O90R907J8521l7153k0025R644
7475A0584k547J7230k6534J2246k4666m1703q569O099J1856L3765q221M631L2036
7462A6207n063J3629l1670k4383J1334J422L12J5673N4j2093q111Q539l5504J2298
7448c7356M6872M925K9144J9928m2001l8037J4405n592L800L110J1926K8178k3843
7435A5459j2061J447L88q066L934k9323k0739L2788J420k724L710m519m7796o54
7421f6736K1466L1907R455Q223J0775j1839m7996m9849J4507O3340M849l5307
7409d7205M2172K9127k5340l7505k9389J0824L0037N242k0866n544K8797q413
$$ plain form
7397 -28063 -49697 -16697 -24664 -12570 10605 23908 19051 -16917 -12707 -28104 -40610 -26996
7385 -26996 3142 12577 -11623 -6462 29499 35086 15906 19129 48516 44788 -6275 29113 58089
7372 58089 49617 48500 15525 12551 8994 -31241 -61058 -55097 -21390 -49194 -36666 -39577 -27209
7359 -27209 -19271 -1667 -22518 -42791 -1533 -17421 -76084 -81617 -85153 -84277 -35790 2789 32718
7346 32718 29606 -18908 -44150 12055 11976 5975 -10668 -18296 -17683 -29432 -4213 3502 -4310 -43498
7332 -43498 -24404 -34259 -35874 -16136 46729 60498 57648 32162 -15015 -34949 -9244 -28232
7320 -28232 -37616 -69446 -83300 -42300 -41631 -27594 -24858 -19258 -10509 -5433 43113 70692 44048
7307 44048 37105 33983 -927 -18314 -25662 -28337 -24197 7019 -7918 -617 -14722 -32487 -14649
$$ packed form
7397b8063k1634L3000p967J2094K3175J3303m857l5968M210j5397j2506J3614
7385b6996L0138R435k4200N161L5961N587j9180L223K9387l728n1063L5388K8976
7372E8089q472j117l2975k974l557m0235k9817N961L3707k7804J2528k911J2368
7359b7209P938J7604k0851k0273M1258j5888n8663n533l536Q76M8487L8579K9929
7346C2718l112m8514k5242N6205p9o001j6643p628O13j1749K5219P715p812l9188
7332d3498J9094r855j615J9738O2865J3769k850k5486m7177j9934K5705j8988
7320b8232r384l1830j3854M1000O69J4037K736N600Q749N076M8546K7579k6644
7307D4048o943l122l4910j7387p348k675M140L1216j4937P301j4105j7765J7838
$$ plain form
7294 -14649 -19383 -61558 -82121 -69718 -51616 -60824 -65038 -96827 -77371 -20874 -5860 -31158
7282 -31158 -33514 -32741 -38212 -27521 19741 19148 31333 34646 44091 72668 53284 18447 21040 9688
7268 9688 19952 1795 -10726 9566 -10229 -27199 33111 22636 17597 23670 32875 8196 -28305
7255 -28305 -56451 -13226 -7020 -34057 -44507 -51445 -52017 -44160 -37792 -48355 -68187 -69980 -44337
7242 -44337 -72305 -40917 2880 30520 48394 48779 584 -17574 -2717 42712 75297 15343
7230 15343 -10028 45729 91880 86204 56137 26079 19719 -10212 -44158 -19368 -12075 -28599
7218 -28599 -12208 39694 42670 23416 27543 -1689 -34993 -20310 -11036 22769 37870 22422
7206 22422 20883 11746 -43937 -63236 -27161 -22423 -31282 -19668 -30780 -6201 28622 26211 25093
$$ packed form
7294a4649m734m2175k0563J2403J8102r208m214l1789J9456N6497J5014k5298
7282c1158k356P73n471J0691M7262n93J2185L313R445K8577j9384l4837K593j1352
7268I688J0264j8157j2521K0292j9795j6970O0310j0475n039O073R205k4679l6501
7255b8305k8146M3225O206k7037j0450o938n72P857O368j0563j9832j793K5643
7242d4337k7968L1388M3797K7640J7874L85m8195j8158J4857M5429L2585n9954
7230A5343k5371N5757M6151n676l0067l0058o360k9931l3946K4790P293j6524
7218b8599J6391N1902K976j9254M127k9232l3304J4683R274L3805J5101j5448
7206B2422j539r137n5683j9299L6075M738q859J1614j1112K4579L4823k411j118
$$ plain form
7193 25093 26950 53862 74423 55264 70547 89858 102382 52025 79876 73134 6729 -36149
7181 -36149 -26809 -36407 -61777 -66485 -17771 6855 -9689 -9302 -14854 -6530 30269 38327 25930
7168 25930 -13489 -51377 -92032 -108402 -67711 -21923 -10653 -3121 -36479 -28554 14243 43365
7156 43365 13549 -9740 19029 34939 16458 4060 -12866 -2384 -3303 -9874 -7223 -30677 -30684
7143 -30684 -26254 -15361 18013 6213 -3859 -3255 -1500 5580 -19670 -36835 -1539 32922 14242
7130 14242 8764 28622 31809 8346 87 30923 55792 12197 6988 24826 41929 10469 6233
7117 6233 -21939 -29773 -27304 -34332 -21208 -30556 -69741 -74963 -57995 -59216 -25178 -25338 -60671 -63617
7103 -63617 -810 30297 35266 18926 3672 -17834 -19680 -14271 35390 34564 20497 6314 -31013
$$ packed form
7193B5093J857K6912K0561j9159J5283J9311J2524n0357K7851o742o6405m2878
7181c6149R340r598k5370m708M8714K4626j6544L87n552Q324L6799Q058j2397
7168B5930l9419l7888m0655j6370M0691M5788J1270P532l3358P925M2797K9122
7156D3365k9816k3289K8769J5910j8481j2398j6926J0482r19o571K651k3454p
7143c0684M430J0893L3374j1800j0072O04J755P080k5250j7165L5296L4461j8680
7130A4242n478J9858L187k3463q259L0836K4869m3595n209J7838J7103l1460m236
7117F233k8172p834K469p028J3124r348l9185n222J6968j221L4038j60l5333k946
7103f3617O2807L1107M969j6340j5254k1506j846N409M9661q26j4067j4183l7327
$$ plain form
7090 -31013 8549 31732 34543 7437 -22728 7167 11569 4802 43527 40673 -4688 -45213 -7393
7077 -7393 -15757 -38609 -12833 -8722 -15371 -17031 -34238 -52124 -45553 -49004 -28113 34484 30142
7064 30142 7700 13985 13948 5233 -25015 -21551 6960 -6914 -14713 -13191 -39460 -44952 -39272 -7819
7050 -7819 25450 24019 -31408 -56138 -68403 -36298 -27342 -26844 45679 80410 40637 30300 40338
7037 40338 43069 2845 8422 17692 26496 13532 10252 5166 -16371 -22415 -10940 -16349 -62130
7024 -62130 -53693 -53770 -40799 -50134 -35523 -6824 -6933 -7460 5660 8926 20387 -9792 -21971 -21768
7010 -21768 -15900 8928 -28041 -61496 -48202 -3548 -20822 -65543 -41268 -22642 -3664 11283
6998 11283 49978 47168 43610 21960 -39388 -20241 2530 -1776 -17043 -5258 -5733 10109 43186
$$ packed form
7090c1013L9562K3183K811k7106l0165K9895M402o767L8725k854m5361m0525L7820
7077g393q364k2852K5776M111o649j660j7207j7886O571l451K0891O2597m342
7064C0142k2442O285l7q715l0248L464K8511j3874p799J522k6269n492N680L1453
7050g819L3269j431n5427k4730j2265L2105Q956M98P2523L4731l9773j0337J0038
7037D0338K731m0224N577R270Q804j2964l280n086k1537o044J1475n409m5781
7024f2130Q437p7J2971r335J4611K8699j09n27J3120L266J1461l0179j2179K03
7010b1768N868K4828l6969l3455J3294M4654j7274m4721K4275J8626J8978J4947
6998A1283L8695k810l558k1650o1348J9147K2771m306j5267J1785m75J5842L3077
$$ plain form
6985 43186 35506 -19503 -55460 -56146 -55946 -42780 8014 38596 22658 -15789 -33268 -51974 -67037
6972 -67037 -77836 -76053 -22591 45283 66437 51514 29349 34935 16612 -29390 -49582 -81064
6960 -81064 -53187 -39687 -13451 -30512 -23651 -3961 -3689 -10874 -36510 -11773 20607 15315 16733
6947 16733 7196 19498 43873 34901 -8736 -47707 -50568 -45239 -35348 1781 272 -21755 -5404
6934 -5404 -17857 -27163 4532 22091 15130 25739 17633 -9980 -26721 -15665 4768 -56216 -79340
6921 -79340 -71646 -49199 -68426 -134866 -146034 -107694 -58865 -8883 24534 -4756 7893 1335
6909 1335 -25189 -3697 15028 6413 3360 -10181 -8201 -54383 -35932 -19269 -15785 -8084 -12219
6896 -12219 -52692 -2313 30537 20163 -8344 -645 -18374 -18480 -2955 -2446 48439 71151 50654
$$ packed form
6985D3186p680n5009l5957o86K00J3166N0794L0582j5938l8447j7479j8706j5063
6972f7037j0799J783N3462O7874K1154j4923k2165N586j8323m6002k0192l1482
6960h1064K7877J3500K6236j7061O861J9690K72p185k5636K4737L2380n292J418
6947A6733r537J2302K4375q972m3637l8971k861N329R891L7129j509k2027J6351
6934e404j2453r306L1695J7559o961J0609q106k7613j6741J1056K0433o0984k3124
6921g9340P694K2447j9227o6440j1168L8340M8829M9982L3417k9290J2649o558
6909A335k6524K1492J8725q615l053j3541J980m6182J8451J6663L484P701m135
6896a2219m0473N0379L2850j0374k8507P699j7729j06J5525N09N0885K2712k0497
$$ plain form
6883 50654 8056 -23779 -51145 -58418 -20957 32199 17683 -11710 -14127 -33622 -47760 -29121
6871 -29121 -989 -25334 -2907 39881 30382 4186 -21917 -1504 35701 46411 34649 1657
6859 1657 -40319 -36395 4401 13691 -14377 -3831 19966 36996 25800 18699 -35453 -33646 -6994
6846 -6994 -6863 -41212 -36908 -8874 10269 18546 45822 63331 14219 -10705 -8413 -444 -32036
6833 -32036 -30520 -53059 -60629 -73899 -46880 -52973 -71454 -102974 -102934 -90020 -46428 -27765 -57840
6820 -57840 -115954 -144871 -153259 -95325 -48544 -30213 -14608 6513 959 -42981 -65033 -56170
6808 -56170 -47507 -19442 -15611 -25283 6433 -6102 -31622 -16083 20147 46166 62125 56384 49807
6795 49807 15889 -12703 -17105 -18673 22764 25829 28979 47617 52485 41912 8785 11477 3999
$$ packed form
6883E0654m2598l1835k7366p273L7461N3156j4516k9393k417j9495j4138J8639
6871b9121K8132k4345K2427M2788r499k6196k6103K0413L7205J0710j1762l2992
6859A657m1976L924M0796R290k8068J0546K3797J7030j1196p101n4152J807K6652
6846f994J31l4349M304K8034J9143Q277K7276J7509m9112k4924K292P969l1592
6833c2036J516k2539p570j3270K7019o093j8481l1520M0J2914M3592J8663l0075
6820e7840n8114k8917q388N7934M6781J8331J5605K1121n554m3940k2052Q863
6808e6170Q663K8065L831r672L1716j2535k5520J5539L6230K6019J5959n741o577
6795D9807l3918k8592m402j568M1437L065L150J8638M868j0573l3127K692p478
$$ plain form
6782 3999 -14250 -42000 -66085 -52237 -47940 -40905 -19508 -33129 -47982 -40748 -41477 -38827 -8699
6769 -8699 -28213 -34826 -52902 -23935 6875 -7101 -13302 -16940 -11012 -7412 5727 23207 71409
6756 71409 46030 16650 15809 4340 21865 11490 18455 -9956 11661 9105 449 12215 37556
6743 37556 23575 24936 18206 -11271 -20778 6215 735 -43413 -67480 -48486 -14175 -28834 -22273
6730 -22273 -29656 -55840 -75109 -68837 -33847 -39036 -52215 -11881 17234 13494 -2381 11121 26628
6717 26628 16095 -14387 2869 24409 5263 570 7553 -4942 6854 22658 6453 -40060
6705 -40060 -62047 -46296 5860 20045 18411 -4764 495 19503 3843 -19677 -19103 -9919 -39056
6692 -39056 -55768 -43439 -51506 -50351 -53474 -73018 -75494 -89072 -58597 -12970 5241 17018 12213
$$ packed form
6782C999j8249k7750k4085J3848M297P035K1397j3621j4853P234p29K650L0128
6769h699j9514o613j8076K8967L0810j3976o201l638N928L600J3139J7480M8202
6756G1409k5379k9380q41j1469J7525j0375O965k8411K1617k556q656J1766K5341
6743C7556j3981J361o730k9477r507K6993n480m4148k4067J8994L4311j4659O561
6730b2273p383k6184j9269O272L4990n189j3179M0334K9115l740j5875J3502J5507
6717B6628j0533l0482J7256K1540j9146m693O983j2495J1796J5804j6205m6513
6705d0060k1987J5751N2156J4185j634k3175N259J9008j5660k3520N74R184k9137
6692c9056j6712J2329q067J155l123j9544k476j3578L0475M5627J8211J1777m805
$$ plain form
6679 12213 -580 -1664 4374 -9222 -16440 -15375 27692 45492 66653 27523 -14457 -34580 -17750
6666 -17750 -39855 -38154 -5095 2465 -47067 -68803 -63249 -20715 -17449 -9724 27301 33368 11616
6653 11616 -660 30040 43330 32686 40017 44883 46952 33217 28520 79358 91056 65966 37263
6640 37263 40977 23034 31449 85853 93341 86534 59263 54659 26654 -10210 -13573 -4957 -28697
6627 -28697 -47675 -28674 -12946 -21811 10858 -6997 4934 -9249 -43553 -55268 -50451 -16671
6615 -16671 -18400 8153 -2856 4257 -18011 -29862 -24569 7660 -45391 -61221 -406 13847
6603 13847 9653 3416 348 3770 -1584 20420 32297 30958 42540 68601 29018 -15446 -30542
6590 -30542 -14959 -5329 -29514 -17994 -67568 -99733 -107439 -79995 -37914 -28934 -17806 146
$$ packed form
6679A2213j2793j084O038j3596p218J065M3067J7800K1161l9130m1980k0123J6830
6666a7750k2105J701L3059P560m9532k1736N554M2534L266P725L7025O067k1752
6653A1616j2276L0700J3290j0644P331M866K069j3735m697N0838J1698k5090k8703
6640C7263L714j7943Q415N4404P488o807k7271m604k8005l6864l363Q616k3740
6627b8697j8978J9001J5728q865L2669j7855J1931j4183l4304j1715M817L3780
6615a6671j729K6553j1009P113k2268j1851N293L2229n3051j5830O0815J4253
6603A3847m194o237l068L422n354K2004J1877j339J1582K6061l9583m4464j5096
6590c0542J5583R630k4185J1520m9574l2165p706K7444M2081Q980J1128J7952
$$ plain form
6578 146 7449 14805 -11626 -7500 -19813 -43429 -32794 -24801 -11893 -34596 -66944 -51124 -72188
6565 -72188 -78883 -61640 -56099 -37136 5144 25716 42773 64025 55437 22550 13725 14304 -19116
6552 -19116 -26093 -26051 15331 19538 -10282 -32641 -23640 -38554 -57445 -34792 2323 52291 115059
6539 115059 121061 85350 41195 -11762 -15887 -40777 -48129 -6972 14121 5606 -33305 -7295
6527 -7295 3887 -7736 -18061 -17604 -7694 17289 62790 48599 35924 44687 2982 -16194 -39396
6514 -39396 -59014 4111 25846 -325 -30908 -16779 -21293 -16374 -36011 -13231 9601 7059
6502 7059 5037 10041 -23018 -6670 442 23355 -101 -40552 -55644 -34640 -22055 -44582 -100186
6489 -100186 -49066 -16548 -29028 -45362 -77944 -94596 -61706 -37308 -28705 -25984 -37113 -44908
$$ packed form
6578A46P303P356k6431M126j2313k3616J0635P993J2908k2703l2348J5820k1064
6565g2188o695J7243N541J8963M2280K0572J7057K1252q588l2887q825N79l3420
6552a9116o977M2M1382M207k9820k2359R001j4914j8891K2653L7115M9968O2768
6539A15059O002l5711m4155n2957m125k4890p352M1157K1093q515l8911K6010
6527g295J1182j1623j0325M57R910K4983M5501j4191j2675Q763m1705j9176k3202
6514c9396j9618O3125K1735k6171l0583J4129m514M919j9637K2780K2832k542
6502G059k022N004l3059J6348P112K2913k3456m0451j5092K1004J2585k2527n5604
6489a00186N1120L2518j2480j6334l2582j6652L2890K4398Q603K721j1129p795
$$ plain form
6477 -44908 -55716 -3900 -6715 -31844 -55900 -26365 7892 -34380 -25392 3220 12949 60597
6465 60597 23000 1868 29523 13581 -3280 18588 33627 13246 6537 -7111 4007 169
6453 169 -18599 -37335 -34454 -50305 -84064 -79821 -56099 -43123 -57545 -60218 -54938 -43175 -38231
6440 -38231 11176 17503 -16965 -1647 1219 -17969 -25510 -22523 -43892 -25833 37773 71222 64937
6427 64937 37457 49277 62432 17571 5788 -21127 -81191 -92507 -61755 -21849 -28804 -30753
6415 -30753 -41396 -71155 -94400 -59778 -2761 -8321 -10722 -13195 -34458 -45677 -31274 -29333 20032
6402 20032 38511 28619 10507 7156 42236 46382 76905 61022 48521 65391 65982 71392 67544
6389 67544 64997 82112 38048 -27087 -19600 114 -14362 -26847 -10518 32701 45764 68687
$$ packed form
6477d4908j0808N1816k815k5129k4056K9535L4257m2272Q988K8612R729M7648
6465F0597l7597k1132K7655j5942j6861K1868J5039k0381o709j3648J1118l838
6453A69j8768j8736K881j5851l3759M243K3722J2976j4422k673N280J1763M944
6440c8231M9407O327l4468J5318K866j9188p541K987k1369J8059O3606L3449o285
6427F4937k7480J1820J3155m4861j1783k6915o0064j1316L0752L9906o955j949
6415c0753j0643k9759k3245L4622N7017n560k401k473k1263j1219J4403J941M9365
6402B0032J8479r892j8112l351L5080M146L0523j5883j2501J6870N91N410l848
6389F7544k547J7115m4064o5135P487J9714j4476j2485J6329M3219J3063K2923
$$ plain form
6377 68687 94267 51754 46379 22144 -1894 -21864 29305 48230 22948 30862 48189 37685
6365 37685 -18104 -7550 48550 52927 -1538 -76871 -83458 -96211 -103165 -63881 -30258 -24783 -35460
6352 -35460 -28343 13680 27412 36965 10343 28032 39525 25510 -15803 -19730 2112 24197
6340 24197 27033 26686 -11510 -5702 2216 51003 43109 -7685 -4329 14186 -16625 -26501 -39703
6327 -39703 -27314 3700 -9798 -61869 -62780 -48622 -16927 -23974 -38110 -68579 -105783 -123698
6315 -123698 -84292 -50466 -47482 -22339 -32650 -16296 -551 34709 70672 22193 -15742 -14951
6303 -14951 -17107 -21339 20882 33426 20328 4279 -3391 17199 28572 30363 -37002 -49357 -43231
6290 -43231 -55718 -49433 -29502 10602 -15592 -41739 -37788 -22224 -19868 -11888 -12730 -18304 -66275
$$ packed form
6377F8687K5580m2513n375k4235k4038j9970N1169J8925k5282P914J7327j0504
6365C7685n5789J0554N6100M377n4465p5333o587j2753o954L9284L3623N475j0677
6352c5460P117M2023J3732R553k6622J7689J1493j4015m1313l927K1842K2085
6340B4197K836l47l8196N808P918M8787p894n0794L356J8515l0811r876j3202
6327c9703J2389L1014j3498n2071r11J4158L1695p047j4136l0469l7204j7915
6315a23698L9406L3826K984K5143j0311J6354J5745L5260L5963m8479l7935P91
6303a4951k156m232M2221J2544j3098j6049p670K0590J1373J791o7365j2355O126
6290d3231j2487O285J9931M0104k6194k6147L951J5564K356P980q42n574m7971
$$ plain form
6277 -66275 -81450 -77679 -72923 -66749 -70319 -62213 -42069 -40694 -46781 -40033 -25506 -47084 -79824
6264 -79824 -67630 -87412 -9702 -5947 -25390 -36272 -50972 -63082 -69480 -69675 -22991 -7479 -20496
6251 -20496 -31967 -22166 -27966 -24252 -10828 -32119 -20983 -23455 11037 -13055 -17380 9723 41825
6238 41825 50134 85799 96472 100263 50059 -1602 25887 38083 17096 -14792 -7396 -6013 -1690
6225 -1690 -10585 -20802 -26925 -2623 29316 14379 35516 25053 -3412 -25723 -1891 12359
6213 12359 -10641 -45019 -70125 -69431 -8791 -7633 -42146 -54150 -57514 -56304 -19884 9102 26668
6200 26668 -4175 -14059 -16112 2642 33010 64232 47374 53402 37948 -2004 933 5977 6127
6187 6127 43594 23991 1239 19945 26777 -4005 -15010 -37398 -12760 25224 24456 48619 39457
$$ packed form
6277f6275j5175L771M756O174l570Q106K0144J375o087O748J4527k1578l2740
6264g9824J2194j9782P7710L755j9443j0882j4700j2110o398j95M6684J5512j3017
6251b0496j1471R801n800L714J3424k1291J1136k472L4492k4092m325K7103L2102
6238D1825Q309L5665J0673L791n0204n1661K7489J2196k0987l1888P396J383M323
6225a690q895j0217o123K4302L1939j4937K1137j0463k8465k2311K3832J4250
6213A2359k3000l4378k5106O94O0640J158l4513j2004l364J210L6420K8986J7566
6200B6668l0843r884k053J8754L0368L1222j6858O028j5454l9952K937N044J50
6187F127L7467j9603k2752J8706O832l0782j1005k2388K4638L7984p68K4163r162
$$ plain form
6174 39457 34139 33127 23933 -725 -6112 -48702 -39770 3859 16266 2413 -203 -20195 -28030
6161 -28030 -4899 -39300 -52303 -29162 29805 19227 -8238 18236 23565 36074 18459 989
6149 989 12620 34965 34364 32792 5831 -30906 -50180 -42828 -2191 27781 46852 16640 5927
6136 5927 -36271 -37690 -1368 313 -19211 11791 20168 8509 -23848 -18306 -25539 -14916 -4691
6123 -4691 24668 54484 61436 43690 -37388 -37860 -8 -14099 -34399 -14467 -3861 -14358 -18652
6110 -18652 -23059 -33563 -31633 1173 143 -33243 -22297 -2260 -21189 -9053 2052 -7686 18023
6097 18023 18558 40056 49427 26755 16733 27174 19200 29860 26100 30081 18679 24410 23665 14378
6083 14378 42837 43355 37838 51902 44835 46221 61459 28792 -1036 -21039 57027 94995 97309
$$ packed form
6174C9457n318j012r194k4658n387m2590Q932M3629J2407j3853k616j9992p835
6161b8030K3131l4401j3003K3141N8967j0578k7465K6474N329J2509j7615j7470
6149I89J1631K2345o01j572k6961l6737j9274P352M0637K9972J9071l0212j0713
6136E927m2198j419L6322J681j9524L1002Q377j1659l2357N542p233J0623J0225
6123d691K9359K9816O952j7746q1078m72L7852j4091k0300J9932J0606j0497m294
6110a8652m407j0504J930L2806j030l3386J0946K0037j8929J2136J1105r738K5709
6097A8023N35K1498R371k2672j0022J0441p974J0660l760L981j1402N731p45r287
6083A4378K8459N18n517J4064p067J386J5238l2667k9828k0003P8066L7968K314
$$ plain form
6070 97309 39706 15378 13968 -44912 -81998 -60068 -53314 -22421 -55300 -52411 -30264 12776
6058 12776 39367 69769 72120 80830 88536 70296 27825 7723 -33686 -53461 -18594 34746
6046 34746 31033 21771 10422 37667 31584 33142 33741 11752 29164 39218 13366 -10811 -43394
6033 -43394 -45994 -50479 -44292 304 -194 -14821 -41350 -46960 -30398 -27430 -39621 -739 554
6020 554 39538 42038 -2772 -18637 -35836 -24915 966 34846 42117 19725 21721 -14960 -23967
6007 -23967 -18414 -37670 -41457 -49342 -59662 -70118 -124581 -142014 -162073 -128308 -102137 -71992
5995 -71992 -34657 -40850 -29247 -18235 3354 779 17949 14106 1812 -6577 -47756 -85971 -86383
5982 -86383 -72593 -24859 -12962 -12458 -30273 -52579 -75383 -100410 -90708 -65655 -28051 -2281
$$ packed form
6070I7309n7603k4328j410n8880l7086K1930O754L0893l2879K889K2147M3040
6058A2776K6591L0402K351Q710P706j8240m2471k0102m1409j9775L4867N3340
6046C4746l713r262j1349K7245o083J558N99k1989J7412J0054k5852k4177l2583
6033d3394k600m485O187M4596m98j4627k6529n610J6562K968j2191L8882J293
6020E54L8984K500m4810j5865j7199J0921K5881L3880P271k2392J996l6681r007
6007b3967N553j9256l787p885j0320j0456n4463j7433k0059L3765K6171L0145
5995g1992L7335o193J1603J1012K1589k575J7170l843j2294q389m1179l8215m12
5982h6383J3790M7734J1897N04j7815k2306k2804k5027R702K5053L7604K5770
$$ plain form
5970 -2281 -7594 -46904 -36549 -32018 -52783 -25065 19872 10804 -25056 -35862 -4518 -22911 -45126
5957 -45126 -40013 -17024 7694 -4207 10964 5011 -14222 -9213 36522 39778 28329 12589 5427
5944 5427 20015 6165 7311 -9449 -27418 -9833 15880 50464 40137 5349 27731 40095
5932 40095 -4467 -7417 26708 35494 12426 5221 -4628 15620 28524 53373 65479 29197 -1392
5919 -1392 -24567 -25592 -4943 -28634 -79519 -65232 -56963 -34669 -49969 -93568 -87481 -65654 -24315
5906 -24315 -19348 -35246 -10489 -34067 -48663 -42298 -19619 -27723 -28085 8085 7324 -14581 -30357
5893 -30357 -32064 -23529 -1234 -13100 -57912 -82462 -68204 -61711 -26516 -18024 -37673 -42908 9928
5880 9928 25480 -9051 -12270 -609 -19002 -15025 -46709 -75545 -73114 -44809 -42738 -61619 -83551
$$ packed form
5970b281n313l9310J0355M531k0765K7718M4937r068l5860j0806L1344j8393k2215
5957d5126N113K2989K4718j1901J5171n953j9233N009M5735L256j1449j5740p162
5944E427J4588j3850J146j6760j7969J7585K5713L4584j0327l4788K2382J2364
5932D0095m4562k950L4125Q786k3068p205r849K0248J2904K4849J2106l6282l0589
5919a392k3175j025K0649k3691n0885J4287Q269K2294j5300m3599O087K1827M1339
5906b4315M967j5898K4757k3578j4596O365K2679q104l62L6170p61k1905j5776
5893c0357j707Q535K2295j1866m4812k4550J4258O493L5195Q492j9649n235N2836
5880I928J5552l4531l219J1661j8393L977l1684k8836K431K8305K071j8881k1932
$$ plain form
5867 -83551 -98098 -75156 -46658 -41211 -45902 -75310 -55676 -21232 -25885 -46886 -64702 -66356 -45627
5854 -45627 -25529 -6561 -14001 -13402 -21453 -27543 -36725 -29753 -15578 -9244 -7528 660 -20597 -46822
5840 -46822 -43193 -50482 -34584 28428 21735 -239 -498 12704 -4306 -64653 -90213 -92724 -77830
5827 -77830 -29095 -13861 -54475 -45723 -59166 -58352 -26567 -45374 -75537 -44319 -17664 -39984
5815 -39984 -23707 -38454 -30625 2664 19302 19163 16120 -24910 -25754 -37192 -46218 -30889 -50816
5802 -50816 -84625 -62429 -36679 4833 28361 19293 21702 33367 12893 -28530 -33851 -53899
5790 -53899 -32859 -31173 267 43031 17618 -13576 -16489 -13580 -37997 -54703 -42548 -27206
5778 -27206 17811 23710 -1137 -40021 -48552 -14792 -20382 -57123 -72540 -78290 -47980 17870 50545
$$ packed form
5867h3551j4547K2942K8498N447m691k9408J9634L4444m653k1001j7816j654K0729
5854d5627K0098J8968p440N99q051o090r182O972J4175O334J716Q188k1257k6225
5840d6822L629p289J5898O3012o693k1974k59J3202j7010o0347k5560k511J4894
5827g7830M8735J5234m0614Q752j3443Q14L1785j8807l0163L1218K6655k2320
5815c9984J6277j4747P829L3289J6638j39l043m1030q44j1438r026J5329j9927
5802e0816l3809K2196K5750M1512K3528r068K409J1665k0474m1423n321k0048
5790e3899K1040J686L1440M2764k5413l1194k913K909k4417j6706J2155J5342
5778b7206M5017N899k4847l8884q531L3760n590l6741j5417n750L0310O5850L2675
$$ plain form
5765 50545 15741 -512 -2672 -8496 -1855 8750 -3983 -17943 -7579 -736 -31870 -57299 -57155
5752 -57155 -64070 -46455 -53160 -44592 -18326 4076 7189 -29093 -43414 -5646 17614 -5696 30744
5739 30744 3027 -50455 -46364 -15212 12199 -1741 17010 4735 -2723 5813 -9963 -11927 -10555
5726 -10555 -44649 -72640 -85888 -53004 -48007 1565 56 -17075 17032 22187 -2042 -9761 9696
5713 9696 9815 3078 -8153 16971 21718 17753 -5409 -31549 -50798 -81069 -94118 -74780 -10940
5700 -10940 37002 19040 -5972 -19588 -1320 7085 19028 43717 39346 -1820 3949 11133 16021
5687 16021 8814 -2018 -18209 -12653 -9774 3096 2883 -4194 19464 20073 12054 -5575 15434 -9130
5673 -9130 -16978 3741 -19083 -9820 -27192 -9305 9900 18208 16480 20377 16927 49017 49909 29953
$$ packed form
5765E0545l4804j6253k160n824O641J0605j2733j3960J0364O843l1134k5429J44
5752e7155o915J7615o705Q568K6266K2402L113l6282j4321L7768K3260k3310L6440
5739C0744k7717n3482M091L1152K7411j3940J8751j2275p458Q536j5776j964J372
5726a0555l4094k7991j3248L2884M997M9572j509j7131L4107N155k4229p719J9457
5713I696J19o737j1231K5124M747l965k3162k6140j9249l0271j3049J9338O3840
5700a0940M7942j7962k5012j3616J8268Q405J1943K4689m371m1166N769P184M888
5687A6021p207j0832j6191N556K879J2870k13p077K3658O09q019j7629K1009k4564
5673i130p848K0719k2824R263j7372J7887J9205Q308j728L897l450L2090Q92j9956
$$ plain form
5659 29953 -4008 8482 33862 48539 9214 -2340 -10538 29672 27433 -9629 -10443 -10326 -18842
5646 -18842 8024 27963 15185 -149 15804 15407 9314 55421 71318 30889 21116 -3549 -15337
5633 -15337 -47547 -26435 -5095 -34442 -48541 -10148 34837 50539 27425 -40355 -32849 30219
5621 30219 20726 -346 -19095 -21519 15136 44547 23191 6095 5142 2402 22071 33185 14631
5608 14631 14668 1801 -19982 -9260 1267 9700 14972 -14551 -6203 14027 33977 40398 8322
5595 8322 8117 17001 21554 14326 45532 31236 15719 15574 27517 58090 80330 79774 41136 -10538
5581 -10538 33409 39760 41106 16215 9343 8406 1802 -351 -19460 -35505 -38137 -30143 3463 733
5567 733 8745 4423 -49258 -56297 -24074 -20893 -3253 9332 -5061 -4391 413 15387 22609 24280
$$ packed form
5659B9953l3961J2490K5380J4677l9325j1554q198M0210k239l7062q14J17q516
5646a8842K6866J9939j2778j5334J5953l97o093M6107J5897m0429r773k4665j1788
5633a5337l2210K1112K1340k9347j4099L8393M4985J5702k3114o7780P506O3068
5621C0219r493k1072j8749k424L6655K9411k1356j7096r53k740J9669J1114j8554
5608A4631L7j2867k1783J0722J0527Q433N272k9523Q348K0230J9950O421l2076
5595H322k05Q884M553p228L1206j4296j5517j45J1943L0573K2240n56l8638n1674
5581a0538M3947O351J346k4891o872r37o604k153j9109j6045k632P994L3606k730
5567G33Q012m322n3681p039L2223L181J7640J2585j4393O70M804J4974P222J671
$$ plain form
5553 24280 40438 27222 -9888 -34014 -3820 530 2207 27839 -9713 -31097 -27519 -17753 -3833
5540 -3833 16022 3952 -13918 -21386 -12313 5068 -3099 -42796 -62260 -42301 -13942 -6233 3094
5527 3094 29480 69136 70926 47243 1745 -16459 -7315 -26712 3842 -28954 -53294 -69119
5515 -69119 -69642 -35208 -29551 3383 29726 14995 20842 36780 46357 19479 9355 -10522 -14903
5502 -14903 -6855 -334 9772 21521 8689 -13376 -38496 -26666 27742 23675 -2453 10946
5490 10946 49657 36185 32460 31040 -7270 7322 14451 15845 8012 11548 -9333 -37457 -52047
5477 -52047 -59945 -85394 -81140 -30945 10018 23986 12904 -1042 -13355 -21937 -22665 -5817 838
5464 838 19926 38718 -1279 -14681 -5605 -32647 -46354 -54708 -68908 -69631 -33259 34000 44080
$$ packed form
5553B4280J6158j3216l7110k4126L0194M350J677K5632l7552k1384L578R766J3920
5540c833J9855j2070j7870p468R073J7381q167l9697j9464J9959K8359P709R327
5527C094K6386L9656J790k3683m5498j8204R144j9397L0554l2796k4340j5825
5515f9119n23L4434N657L2934K6343j4731N847J5938R577k6878j0124j9877m381
5502a4903Q048O521J0106J1749j2832k2065k5120J1830N4408m067k6128J3399
5490A0946L8711j3472l725j420l8310J4592P129J394p833L536k0881k8124j4590
5477e2047p898k5449M254N0195M0963J3968j1082j3946j2313q582p28J6848O655
5464H38J9088J8792l9997j3402R076k7042j3707q354j4200p23L6372O7259J0080
$$ plain form
5451 44080 18736 21428 3090 -12643 -31468 2086 17978 30815 9085 22747 10868 -14031
5439 -14031 -37323 -10469 -5954 -18240 -31727 -65596 -66505 -103365 -117510 -71160 -16681 2715
5427 2715 23370 13891 -49738 -16181 -39738 -6842 21779 -26481 -26342 -10471 11314 -38356 -47118
5414 -47118 -41979 -9271 -18750 -51985 -53817 -8785 -147 -15303 -21464 27385 24176 4461 9707
5401 9707 23860 25559 23553 1941 -10030 -4114 -23352 -44748 -39824 -43258 -34455 -50538 -29804
5388 -29804 -27125 -5193 -14755 -13281 -40347 -6906 38484 44181 74020 62100 -2037 -24401 -48879
5375 -48879 -15813 645 -15625 -13481 2060 21583 34997 11929 -1811 28949 35857 3337
5363 3337 -16887 -19348 -23458 -35767 -52210 -44974 -27916 -35688 -65653 -42770 -2444 11677 3045
$$ packed form
5451D4080k5344K692j8338j5733j8825L3554J5892J2837k1730J3662j1879k4899
5439a4031k3292K6854M515j2286j3487l3869r09l6860j4145M6350N4479J9396
5427B715K0655r479o3629L3557k3557L2896K8621m8260J39J5871K1785m9670q762
5414d7118N139L2708r479l3235j832M5032Q638j5156o161M8849l209j9715N246
5401I707J4153J699k006k1612j1971N916j9238k1396M924l434Q803j6083K0734
5388b9804K679K1932r562J474k7066L3441M5390N697K9839j1920o4137k2364k4478
5375d8879L3066J6458j6270K144J5541J9523J3414k3068j3740L0760O908l2520
5363C337k0224k461m110j2309j6443P236J7058p772k9965K2883M0326J4121q632
$$ plain form
5350 3045 23193 19791 16095 -16121 -46445 -45218 -26236 1638 13621 17383 39666 28254 -5901
5337 -5901 17943 10395 -29376 -15085 24324 13794 -3488 -29166 -39405 -7570 6594 -9724
5325 -9724 -67104 -89984 -43976 -23795 1117 19056 16011 6726 -13322 17525 -26006 -77113
5313 -77113 -67400 -25282 -11022 -19274 -13334 9948 2187 -45428 -47754 -41637 -42394 -58533 -67982 -110526
5299 -110526 -120258 -89356 -33049 -64416 -67089 -63170 -21166 -2072 -39518 -75549 -81545 -48614
5287 -48614 -35803 -32058 -5999 -11422 8299 6656 -4378 -46589 -75075 -45036 -35675 -29169 1587
5274 1587 10762 2980 4851 -1083 -6357 8108 4345 -33129 -17410 -11346 -26047 -27414 -38654 -26801
5260 -26801 26435 45221 8981 -14114 8837 31891 24463 -736 -17446 18011 -3159 -23323
$$ packed form
5350C045K0148l402l696l2216l0324J227J8982K7874J1983L762K2283j1412l4155
5337e901K3844p548l9771J4291L9409j0530j7282k5678j0239L1835J4164j6318
5325i724n7380k2880M6008K0181K4912J7939l045r285k0048L0847m3531n1107
5313g7113R713M2118J4260q252N940K3282p761m7615k326O117p57j6139r449m2544
5299a10526r732L0902N6307l1367k673L919M2004J9094l7446l6031n996L2931
5287d8614J2811L745K6059n423J9721j643j1034m2211k8486L0039R361O506L0756
5274A587R175p782J871n934n274J4465l763l7474J5719O064j4701j367j1240J1853
5260b6801N3236J8786l6240k3095K2951K3054p428k5199j6710L5457k1170k0164
$$ plain form
5248 -23323 -25658 -4864 33421 44853 25492 33252 -18340 -38304 -53602 -51343 -42572 -6125 22853
5235 22853 -4105 -15677 -51877 -60534 -9314 17515 -5581 -14616 -24451 -52410 -28813 -41602
5223 -41602 -44206 -11902 14858 14867 -6112 3545 5960 23636 37592 21347 -9990 18230 45871
5210 45871 51496 14447 2063 16420 33684 22383 -475 -7610 3964 51597 24101 3587
5198 3587 3749 -7735 -8860 -7688 -3384 -25862 -30260 12341 51542 16861 -15527 -46661 -52616
5185 -52616 -22296 -13534 -19299 -49593 -46899 -13896 -48014 -67700 -23862 -16442 -24592 -9636 -21914
5172 -21914 -60497 -36955 -24091 -17885 -21524 -41338 -27312 -10600 -32222 -22346 -3987 6738
5160 6738 9104 -7758 -36489 -57098 -84193 -64083 -44053 -58334 -55969 6226 45229 53486 25906
$$ packed form
5248b3323k335K0794L8285J1432j9361P760n1592j9964j5298K259Q771L6447K8978
5235B2853k6958j1572l6200q657N1220K6829k3096r035r835k7959K3597j2789
5223d1602k604L2304K6760Rk0979R657K415J7676J3956j6245l1337K8220K7641
5210D5871N625l7049j2384J4357J7264j1301k2858p135J1574M7633k7496k0514
5198C587J62j1484j125J172M304k2478m398M2601L9201l4681l2388l1134n955
5185e2616L0320Q762n765l0294K694L3003l4118j9686M3838P420q150J4956j2278
5172b1914l8583K3542J2864O206l639j9814J4026J6712k1622R876J8359J0725
5160F738K366j6862k8731k0609k7095K0110K0030j4281K365O2195L9003Q257k7580
$$ plain form
5147 25906 7939 28668 51004 49707 -17269 -47907 -21682 12833 -26621 -58605 -52189 -39917
5135 -39917 -42841 -10531 43990 42669 43093 35102 38627 57754 69905 72268 55472 61546 54173 49310
5121 49310 63626 46540 22710 9439 -9460 -31400 -33075 -18483 -31436 -7414 -29613 -21264
5109 -21264 8903 46082 78720 46394 26160 21554 -22556 -30644 -46882 -34572 -24060 2849
5097 2849 33932 23908 22959 -1391 3170 42000 23085 -3487 2972 -10854 -7024 8448 15865
5084 15865 54664 72640 22421 -502 22595 32573 8789 -6183 -21699 -27840 -35258 -57396
5072 -57396 -41259 -5994 48961 57585 50579 17939 8517 23378 8026 5035 3345 3344 25925 19333
5058 19333 17279 6435 13797 13089 -16872 2192 -50068 -57903 -39968 -29535 3619 3041 -8933
$$ packed form
5147B5906j7967K0729K2336j297o6976l0638K6225L4515l9454l1984O416J2272
5135c9917k924L2310N4521j321M24p991L525J9127J2151K363j6796O074p373m863
5121D9310J4316j7086k3830j3271j8899k1940j675J4592j2953K4022k2199Q349
5109b1264L0167L7179L2638l2326k0234m606m4110q088j6238J2310J0512K6909
5097B849L1083j0024r49k4350M561L8830j8915k6572O459j3826L830J5472P417
5084A5865L8799J7976n0219k2923K3097R978k3784j4972j5516o141p418k2138
5072e7396J6137L5265N4955Q624p006l2640r422J4861j5352k991j690jK2581o592
5058A9333k054j0844P362p08k9961J9064n2260p835J7935J0433L3154n78j1974
$$ plain form
5045 -8933 -14481 -13803 -6723 8464 -7553 -49427 -79232 -88582 -65921 -61824 -46352 -22538 7951
5032 7951 42804 28742 14098 35975 22038 19657 -23468 -54504 -74433 -64949 -19884 -9305
5020 -9305 -15094 -1761 9486 23697 24717 32826 38419 12075 3158 -13588 -16673 -32957 -82426
5007 -82426 -113732 -58344 -27942 -22591 -19153 12105 32792 12775 -9158 -495 12772 37076
4995 37076 33359 -36056 -28507 35983 27209 -7398 -13341 4553 -25966 -68099 -50375 -27559 -30549
4982 -30549 -45934 -17377 -7602 -2211 5730 -2162 -50390 -62424 -59341 -29549 -7960 10269 -3467
4969 -3467 -56739 -69081 -4663 -9512 14297 34446 37128 21012 35567 23910 1750 -24722
4957 -24722 -11550 -2501 -31861 -34706 6551 -25518 -23517 -10021 10117 5783 -18022 -51506 -44756
$$ packed form
5045h933n548O78P080J5187j6017m1874k9805r350K2661M097J5472K3814L0489
5032G951L4853j4062j4644K1877j3937k381m3125l1036j9929R484M5065J0579
5020i305n789J3333J1247J4211J020Q109N593k6344q917j6746l085j6284m9469
5007h2426l1306N5388L0402N351L438L1258K0687k0017k1933Q663J3267K4304
4995C7076l717o9415P549O4490q774l4607n943J7894l0519m2133J7724K2816k990
4982c0549j5385K8557R775N391P941p892m8228j2034L083K9792K1589J8229j3736
4969c467n3272j2342O4418m849K3809K0149K682j6116J4555j1657k2160k6472
4957b4722J3172R049k9360k845M1257l2069K001J3496K0138m334k3805l3484O750
$$ plain form
4944 -44756 -32840 -6986 1007 -29605 -54132 -52872 -42276 -21014 -50698 -46740 -55640 -74958 -75964
4931 -75964 -46808 -7408 4791 30985 29563 27659 37481 -20390 -40101 -8883 6817 872 2322
4918 2322 3123 6319 9146 20689 48939 39334 -34859 -84887 -12944 25749 99 -52178 -52943
4905 -52943 -44410 -42030 -19183 -703 -9247 -43683 -44008 -68518 -60184 -24213 8724 -7368 -3126
4892 -3126 -36596 -46631 -25392 -38906 -46399 -34460 -18751 -11559 3566 10319 10631 15827 4330
4879 4330 -28407 -52577 -44107 -29327 10377 25915 -2219 27640 56982 5486 -19044 -4417
4867 -4417 -245 -11220 12841 30747 20287 9272 20390 56702 79052 54124 19341 9439
4855 9439 11212 -7669 -5046 -18090 -31784 -17701 -26908 -40635 -16708 28875 54172 41491 52346
$$ packed form
4944d4756J1916K5854P993l0612k4527J260J0596K1262k9684L958q900j9318j006
4931g5964K9156L9400J2199K6194j422j904R822n7871j9711L1218J5700n945J450
4918B322Q01L196K827J1543K8250r605p4193n0028P1943L8693k5650n2277p65
4905e2943Q533K380K2847J8480q544l4436l25k4510Q334L5971L2937j6092M242
4892c126l3470j0035K1239j3514p493J1939J5709P192J5125O753L12N196j1497
4879D330l2737k4170Q470J4780L9704J5538k8134K9859K9342n1496k4530J4627
4867d417M172j0975K4061J7906j0460j1015J1118L6312K2350k4928l4783r902
4855I439J773j8881K623j3044j3694J4083r207j3727K3927M5583K5297j2681J0855
$$ plain form
4842 52346 86492 49629 17629 5996 40395 51517 32359 8111 1322 7512 22763 36278
4830 36278 68327 56683 34930 19768 35387 54272 29296 9645 -32580 -32843 21656 7478
4818 7478 -33772 -42274 -20934 -5856 15140 56261 45036 -40336 -30934 -31660 -39052 -41183 -21677
4805 -21677 -31924 -74363 -58415 -10645 9350 23568 7987 -17745 -10648 -20028 -39048 -87919
4793 -87919 -56736 -20586 -47512 -32037 6825 -15953 -20657 -3932 13045 4836 -14413 29608
4781 29608 87710 77637 58311 56055 70228 42121 12771 35600 45851 15332 11938 37296
4769 37296 45034 59389 55141 31759 149 -20191 8775 31911 43783 33498 8007 -4958
4757 -4958 -19676 -27529 -455 49399 29345 1209 -38471 -55533 -62119 -40367 -49482 -80109 -44061
$$ packed form
4842E2346L4146l6863l2000j1633L4399J1122j9158k4248o789O190J5251J3515
4830C6278L2049j1644k1753j5162J5619J8885k4976j9651m2225k63N4499j4178
4818G478m1250q502K1340J5078K0996M1121j1225q5372R402p26p392k131J9506
4805b1677j0247m2439J5948M7770J9995J4218j5581k5732P097r380j9020m8871
4793h7919L1183L6150k6926J5475L8862k2778m704J6725J6977q209j9249M4021
4781B9608N8102j0073j9326k256J4173k8107k9350K2829J0251l0519l394K5358
4769C7296P738J4355m248k3382l1610k0340K8966K3136J1872j0285k5491j2965
4757d958j4718p853K7074M9854k0054k8136l9680j7062o586K1752r115l0627L6048
$$ plain form
4744 -44061 -17514 -38897 -73066 -37719 4551 367 -16393 3023 37533 32314 8250 -25744
4732 -25744 -20461 -13638 -41937 -48921 -63038 -31165 -15175 -6448 -2744 -21675 -38127 -7348 11813
4719 11813 -3941 -28847 -9752 21757 20130 9305 17707 40372 38386 -16918 15672 71285
4707 71285 49730 11131 8302 21350 38241 31593 28446 -9445 -20651 -1923 15608 -21902
4695 -21902 -4797 -4630 -3250 9180 -14842 -40987 -29208 10790 31057 35179 3309 -55130 -40345
4682 -40345 -11579 -9763 20171 7992 -10794 -6805 10989 -12777 -37018 -23836 -31619 -57100
4670 -57100 -44083 -23858 6456 29578 30125 -7622 -10318 -10208 12860 9681 24417 18820 -1894
4657 -1894 27209 18965 26789 21879 37061 35641 33947 4974 -43912 -30742 10652 -16955 -32581
$$ packed form
4744d4061K6547k1383l4169L5347M2270m184j6760J9416L4510n219k4064l3994
4732b5744N283O823k8299o984j4117L1873J5990Q727L704j8931j6452L0779J9161
4719A1813j5754k4906J9095L1509j627j0825Q402K2665j986n5304L2590N5613
4707G1285k1555l8599k829J3048J6891o648l147l7891j1206J8728J7531l7510
4695b1902J7105J67J380J2430k4022k6145J1779L9998K0267M122l1870n8439J4785
4682d0345K8766J816K9934j2179j8786L989J7794k3766k4241J3182p783k5481
4670e7100J3017K0225L0314K3122N47l7747k696J10K3068l179J4736n597k0714
4657a894K9103q244P824m910J5182j420j694k8973m8886J3170M1394k7607j5626
$$ plain form
4644 -32581 4224 -7731 -11914 7269 -12242 -14038 759 17333 22894 40468 31367 16225 40597
4631 40597 42271 26242 -400 3467 16766 40371 80975 57660 48763 41003 44239 49988 28468
4618 28468 50885 35877 -38588 -61461 -62269 -27077 -37128 -35942 -30680 -14789 -24129 -41447 -43386
4605 -43386 -36816 -60199 -51298 -20457 12277 43175 30187 -1831 -25707 -5509 -33295 -39333
4593 -39333 -40719 -21303 9666 47816 33723 -311 -7600 -12297 -57020 -55032 -13613 3819 8570
4580 8570 -2539 2805 25240 52708 39563 27526 4641 -22035 -31306 45351 95986 73364
4568 73364 44871 8631 -14009 -11055 10057 27272 79282 56658 16819 2298 -10646 -41937
4556 -41937 -43488 -54602 -68284 -69979 -49442 -44570 -18765 -23328 -82022 -99342 -75542 -38512 -25730
$$ packed form
4644c2581L6805j1955m183J9183j9511j796J4797J6574N561J7574r101j5142K4372
4631D0597J674j6029k6642L867J3299K3605M0604k3315q897p760L236N749k1520
4618B8468K2417j5008p4465k2873q08L5192j0051J186N262J5891r340j7318j939
4605d3386O570k3383Q901L0841L2734L0898j2988l2018k3876K0198k7786o038
4593c9333j386J9416L0969L8150j4093l4034p289m697m4723J988M1419J7432M751
4580H570j1109N344K2435K7468j3145j2037k2885k6676r271P6657N0635k2622
4568G3364k8493l6240k2640K954K1112J7215N2010k2624l9839j4521j2944l1291
4556d1937j551j1114j3682j695K0537M872K5805m563n8694j7320K3800L7030J2782
$$ plain form
4543 -25730 -7483 -5080 15512 53729 45856 54478 55174 11060 24302 6877 15152 -1004 7329
4530 7329 19683 19270 24115 5951 23674 42379 35247 57038 58107 38174 35622 47389 -11128
4517 -11128 -31437 -24251 -39779 -61783 -27561 -1208 10680 -28136 -88900 -50385 -40201 -63270
4505 -63270 -80160 -56108 -20686 -14902 -31449 -3624 5650 24817 35555 -5228 -31380 3938
4493 3938 -20622 -43398 -52131 -62019 -39326 -14753 -16647 -17550 -28746 -17431 -478 28142 39725
4480 39725 35533 2584 -6653 7070 3472 -20945 -48409 -70136 -39864 25290 29796 18116 16264
4467 16264 45842 41977 9505 -51030 -49493 -23244 -8226 -32811 -14111 24510 11771 -39811
4455 -39811 -91594 -63518 -29852 -17381 -16281 -6966 20411 38717 69426 106480 100751 55144
$$ packed form
4543b5730J8247K403K0592L8217p873Q622O96m4114J3242j7425Q275j6156Q333
4530G329J2354m13M845j8164J7723J8705p132K1791J069j9933k552J1767n8517
4517a1128k0309P186j5528k2004L4222K6353J1888l8816o0764L8515J0184k3069
4505f3270j6890K4052L5422N784j6547K7825R274J9167J0738m0783k6152L5318
4493C938k4560k2776q733r888K2693K4573j894r03j1196J1315J6953K8620J1583
4480C9725m192l2949r237J3723l598k4417k7464k1727L0272O5154M506j1680j852
4467A6264K9578l865l2472o0535J537K6249J5018k4585J8700L8621j2739n1582
4455c9811n1783K8076L3666J2471J100R315K7377J8306L0709L7054n729m5607
$$ plain form
4443 55144 54813 37267 37119 56824 64858 55259 54851 66184 21660 4346 15756 19389 10200 37030
4429 37030 20629 18139 15531 -681 19276 27693 34150 19520 14147 1060 12981 -4677 -57284
4416 -57284 -115714 -80579 -20057 -9614 -13549 -9961 14891 16032 22198 -2807 32488 42452 28372
4403 28372 -2274 -23213 -20538 12632 20717 -26944 -38983 -4312 19261 44890 58884 30066
4391 30066 5008 8244 -5967 21382 55728 18777 12474 -16965 -11931 -17519 -28785 -23875 -22027
4378 -22027 -23437 12106 13231 -24027 16854 35713 49675 77524 74260 59334 51547 66460 10487
4365 10487 -39948 -40675 -45327 -28086 -9803 -14716 -3033 5041 21406 9868 -19838 -8925 30375
4352 30375 33412 30679 25970 40805 59736 18274 -13841 -30506 -24462 -31129 -61433 -90421 -95244
$$ packed form
4443E5144l31j7546j48J9705Q034r599m08J1333m4524j7314J1410L633r189K6830
4429C7030j6401k490k608j6212J9957Q417O457j4630n373j3087J1921j7658n2607
4416e7284n8430L5135O0522J0443l935L588K4852J141O166k5005L5295R964j4080
4403B8372l0646k0939K675L3170Q085m7661j2039L4671K3573K5629J3994k8818
4391C0066k5058L236j4211K7349L4346l6951o303k9439N034n588j1266M910J848
4378b2027j410L5543J125l7258M0881J8859J3962K7849l264j4926p787J4913n5973
4365A0487n0435p27m652J7241J8283m913J1683Q074J6365j1538k9706J0913L9300
4352C0375L037k733m709J4835J8931m1462l2115j6665O044o667l0304k8988m823
$$ plain form
4339 -95244 -56174 -10063 16025 12017 -29944 -42000 -33832 -29367 -7995 -14154 2500 3042 9183
$$ packed form
4339i5244L9070M6111K6088m008m1961j2056Q168M465K1372o159J6654N42O141
$$ [...]
##END NTUPLES=NMR SPECTRUM
##END=
