##TITLE=Analysis number 315622
Compound Code cc 41401
Book Reference 378/186
Project Code adrs
Chemist Name benw
##JCAMPDX= 6.0         $$ Bruker NMR JCAMP-DX V2.0
##DATA TYPE= NMR SPECTRUM
##DATA CLASS= NTUPLES
##ORIGIN= Bruker BioSpin GmbH
##OWNER= NMR
$$ XWIN-NMR		Version 3.5
$$ Thu Nov 24 16:24:30 2005 GMT Standard Time (UT+0h)  MAYBRIDGE\NMR@NMR_250MHZ
##.OBSERVE FREQUENCY= 250.131544655141
##.OBSERVE NUCLEUS= ^1H
##.ACQUISITION MODE= SIMULTANEOUS (DQD)
##.ACQUISITION SCHEME= undefined
##.AVERAGES= 16
##.DIGITISER RES= 18
##SPECTROMETER/DATA SYSTEM= dpx250
##.PULSE SEQUENCE= zg30
##.SOLVENT NAME= DMSO
##.SHIFT REFERENCE= (INTERNAL, DMSO, 0, 16.522)
##AUDIT TRAIL= $$ (NUMBER, WHEN, WHO, WHERE, WHAT)
$$ ##TITLE= Audit trail, XWIN-NMR		Version 3.5
$$ ##JCAMPDX= 5.01
$$ ##ORIGIN= Bruker BioSpin GmbH
$$ ##OWNER= NMR
$$ C:\u/data/dgb/nmr/ADRS/13040/pdata/1/auditp.txt
$$ ##AUDIT TRAIL=  $$ (NUMBER, WHEN, WHO, WHERE, WHAT)
(   1,<2005-11-24 16:24:09.40 +000>,<MAYBRIDGE\NMR>,<NMR_250MHZ>,
      <created by zg, POWCHK disabled, PULCHK disabled
       configuration hash MD5:
       62 19 C7 07 E1 42 D1 B7 37 6C 3D D0 77 39 F9 E6
       data hash MD5: 64K
       5A 53 A5 4C 68 F1 4A 53 88 13 EE 77 36 AA 42 E3>)
(   2,<2005-11-24 16:24:22.27 +000>,<MAYBRIDGE\NMR>,<NMR_250MHZ>,
      <Start of raw data processing
       ef LB = 0.3 FT_mod = 6 PKNL = 1 SI = 32K 
       data hash MD5: 32K
       76 82 44 27 EF B6 3C 94 14 39 20 39 BC E8 B1 75>)
(   3,<2005-11-24 16:24:24.01 +000>,<MAYBRIDGE\NMR>,<NMR_250MHZ>,
      <apk 
       data hash MD5: 32K
       CA 6A 4B 8F 16 74 4C 00 D3 46 83 BC D0 7B 7A FB>)
(   4,<2005-11-24 16:24:24.77 +000>,<MAYBRIDGE\NMR>,<NMR_250MHZ>,
      <abs ABSG = 5 
       data hash MD5: 32K
       48 41 FA 91 C2 8C 21 4E 1C 05 3A 97 0F 26 50 5C>)
$$ ##END=
$$ 
$$ hash MD5
$$ 21 B6 83 F0 9D B7 53 5F BF C0 95 64 24 D7 0E 70
##$RELAX= 
##$RELAX= 
##$RELAX= 
##$RELAX= 
##$RELAX= 
##$RELAX= 
##$RELAX= 
$$ Bruker specific parameters
$$ --------------------------
##$DU= <C:\u>
##$EXPNO= 13040
##$NAME= <ADRS>
##$PROCNO= 1
##$TYPE= <nmr>
##$USER= <dgb>
##$AMP= (0..31)
100 100 100 100 100 100 100 100 100 100 100 100 100 100 100 100 100 100 
100 100 100 100 100 100 100 100 100 100 100 100 100 100 
##$AQSEQ= 0
##$AQ_mod= 3
##$AUNM= <au_zg>
##$AUTOPOS= <50 >
##$BF1= 250.13
##$BF2= 250.13
##$BF3= 250.13
##$BF4= 250.13
##$BF5= 500.13
##$BF6= 500.13
##$BF7= 500.13
##$BF8= 500.13
##$BYTORDA= 1
##$CFDGTYP= 0
##$CFRGTYP= 5
##$CHEMSTR= <none>
##$CNST= (0..31)
1 1 145 1 1 1 1 1 1 1 1 1 1 1 1 1 1 1 1 1 1 1 1 1 1 1 1 1 1 1 1 1 
##$CPDPRG= <>
##$CPDPRG1= <>
##$CPDPRG2= <>
##$CPDPRG3= <>
##$CPDPRG4= <mlev>
##$CPDPRG5= <mlev>
##$CPDPRG6= <mlev>
##$CPDPRG7= <mlev>
##$CPDPRG8= <mlev>
##$CPDPRGB= <>
##$CPDPRGT= <>
##$D= (0..31)
0 1 0 0 0 0 0 0 0 0.06 0 0 0 0 0 0 0.0002 0 0 0 0 0 0 0 0 0 0 0 0 0 0 
0 
##$DATE= 1132849448
##$DBL= (0..7)
120 120 120 120 120 120 120 120 
##$DBP= (0..7)
150 150 150 150 150 150 150 150 
##$DBP07= 0
##$DBPNAM0= <>
##$DBPNAM1= <>
$$ [...]
##$SUBNAM7= <"">
##$SUBNAM8= <"">
##$SUBNAM9= <"">
##$SW= 20.6930455092707
##$SWIBOX= (0..15)
0 0 3 0 0 0 0 0 0 0 0 0 0 0 0 0 
##$SW_h= 5175.983436853
##$TD= 65536
##$TD0= 1
##$TE= 294.16
##$TE2= 300
##$TE3= 300
##$TEG= 300
##$TL= (0..7)
0 120 120 120 120 120 120 120 
##$TP= (0..7)
150 150 150 150 150 150 150 150 
##$TP07= 0
##$TPNAME0= <>
##$TPNAME1= <>
##$TPNAME2= <>
##$TPNAME3= <>
##$TPNAME4= <>
##$TPNAME5= <>
##$TPNAME6= <>
##$TPNAME7= <>
##$TPOAL= (0..7)
0.5 0.5 0.5 0.5 0.5 0.5 0.5 0.5 
##$TPOFFS= (0..7)
0 0 0 0 0 0 0 0 
##$TUNHIN= 0
##$TUNHOUT= 0
##$TUNXOUT= 0
##$USERA1= <user>
##$USERA2= <user>
##$USERA3= <user>
##$USERA4= <user>
##$USERA5= <user>
##$V9= 5
##$VALIST= <valist>
##$VCLIST= <CCCCCCCCCCCCCCC>
##$VD= 0
##$VDLIST= <DDDDDDDDDDDDDDD>
##$VPLIST= <PPPPPPPPPPPPPPP>
##$VTLIST= <TTTTTTTTTTTTTTT>
##$WBST= 1024
##$WBSW= 4
##$XGAIN= (0..3)
0 0 0 0 
##$XL= 0
##$YL= 0
##$YMAX_a= 508667
##$YMIN_a= -348200
##$ZGOPTNS= <>
##$ZL1= 120
##$ZL2= 120
##$ZL3= 120
##$ZL4= 120
##$ABSF1= 16.522
##$ABSF2= -4.171173
##$ABSG= 5
##$ABSL= 3
##$ALPHA= 0
##$AQORDER= 0
##$ASSFAC= 0
##$ASSFACI= 0
##$ASSFACX= 0
##$ASSWID= 0
##$AUNMP= <proc_1d>
##$AZFE= 0.1
##$AZFW= 0.1
##$BCFW= 0
##$BC_mod= 0
##$BYTORDP= 0
##$COROFFS= 0
##$CY= 12.5
##$DATMOD= 1
##$DC= 0
##$DFILT= <>
##$DTYPP= 0
##$F1P= 14.0000005364418
##$F2P= -0.99999901652339
##$FCOR= 0.5
##$FTSIZE= 32768
##$FT_mod= 6
##$GAMMA= 0
##$GB= 0
##$INTBC= 1
##$INTSCL= 1
##$ISEN= 128
##$LB= 0.3
##$LEV0= 0
##$LPBIN= 0
##$MAXI= 10000
##$MC2= 0
##$MEAN= 0
##$ME_mod= 0
##$MI= 0
##$NCOEF= 0
##$NC_proc= -3
##$NLEV= 6
##$NOISF1= 0
##$NOISF2= 0
##$NSP= 0
##$NTH_PI= 0
##$NZP= 0
##$OFFSET= 16.522
##$PC= 1
##$PHC0= 70.37175
##$PHC1= 9.084093
##$PH_mod= 1
##$PKNL= yes
##$PPARMOD= 0
##$PSCAL= 4
##$PSIGN= 0
##$REVERSE= no
##$SF= 250.13
##$SI= 32768
##$SIGF1= 0
##$SIGF2= 0
##$SINO= 400
##$SIOLD= 32768
##$SREGLST= <1H.DMSO>
##$SSB= 0
##$STSI= 32768
##$STSR= 0
##$SW_p= 5175.98343685301
##$SYMM= 0
##$S_DEV= 0
##$TDeff= 65536
##$TDoff= 0
##$TI= <Analysis number 999999
Compound Code 99
Book Reference 9
Project Code 9>
##$TILT= no
##$TM1= 0
##$TM2= 0
##$TOPLEV= 0
##$USERP1= <user>
##$USERP2= <user>
##$USERP3= <user>
##$USERP4= <user>
##$USERP5= <user>
##$WDW= 1
##$XDIM= 32768
##$YMAX_p= 481720525
##$YMIN_p= -140102
$$ End of Bruker specific parameters
$$ ---------------------------------
##NTUPLES= NMR SPECTRUM
##VAR_NAME=  FREQUENCY,     SPECTRUM/REAL,   SPECTRUM/IMAG
##SYMBOL=    X,             R,               I
##VAR_TYPE=  INDEPENDENT,   DEPENDENT,       DEPENDENT
##VAR_FORM=  AFFN,          ASDF,            ASDF
##VAR_DIM=   32768,         32768,           32768
##UNITS=     HZ,            ARBITRARY UNITS, ARBITRARY UNITS
##FACTOR=    0.157963299565203, 1,           1
##FIRST=     4132.6476996994, 0,             0
##LAST=      -1043.33573715361, 0,           0
##MIN=       -1043.33573715361, -140102,     0
##MAX=       4132.6476996994, 481720525,     0
$$ Real data points
##PAGE= N=1
##DATA TABLE= (X++(R..R)), XYDATA
$$ [...]
18500D173992k69657k32905k30640j95242j56477r9370r5301q0859k8451j8250
18490B766840p353q057j0101M7075Q9134Q8887J39280J73710J90229L34136M82286
18479D286066O02471Q14049J134324J585764K274447L310896M613767N766362
18471B4388146N654254M173130L623574M752733N334633L478925j73732k970364
18463D8261299l340125k968306l617062n267024n986463n249216m582257m020334
18455A3230512l055737k118792j444065r97022p22633n13016l88513l08900k87541
18446C394293k70666k14370j98802j63235j32864j24441j10798r7862r7509p6544
18436A907202l9002M7971M2423N2744Q5267J55145J70187J52667J17076J61410
$$ y = [4173992, 3904335, 3671430, 3440790, 3245548, 3089071, 2989701, 2894400, 2813541, 2785090, 2766840, 2759487, 2751430, 2741329, 2788404, 2877538, 2966425, 3105705, 3279415, 3469644, 3803780, 4286066, 4888537, 5702586, 6836910, 8422674, 10697121, 14008017, 18621784, 24388146, 30042400, 34215530, 37839104, 42591837, 47926470, 51405395, 51231663, 48261299, 44921174, 41952868, 38335806, 33068782, 27082319, 21833103, 17250846, 13230512, 10174775, 8055983, 6611918, 5614896, 4892263, 4379247, 3990734, 3681834, 3394293, 3123627, 2909257, 2710455, 2547220, 2414356, 2289915, 2179117, 2081255, 1983746, 1907202, 1868200, 1916171, 1958594, 2011338, 2096605, 2251750, 2421937, 2574604, 2691680, 2853090]
18426B853090J97922K11780J57263J05394P7244R8602J07539J76130J93462K60323
18416D438749L72859N63990P48988J008569J427695J999028K886060M242748O207330
18407B3896016Q939708J2105874J4149853J3177046Q622381J596918n453020j0433511
18399F6601265j2506183j1918701r982696p484552n005879k938740j400933k52586
18391A5110995Q95884K162079L852315O139895R299389J2745507J4441414J2813203
18383G7460681P484897m8367p128999j1703667j3200378j2366226j0258008p839719
18375B2400214n549415l767518k542465j742677j228944r36902p33137n22524
18367E376632m46693l58603k62373k42335k27833k10235k14083k22882j82555
$$ y = [2853090, 3051012, 3262792, 3420055, 3525449, 3602693, 3701295, 3808834, 3984964, 4178426, 4438749, 4811608, 5375598, 6124586, 7133155, 8560850, 10559878, 13445938, 17688686, 23896016, 32835724, 44941598, 59091451, 72268497, 80890878, 82487796, 77034776, 66601265, 54095082, 42176381, 32193685, 24709133, 19703254, 16764514, 15363581, 15110995, 16006879, 18168958, 22021273, 28161168, 37460557, 50206064, 64647478, 77460681, 84945578, 84897211, 77768212, 66064545, 52864167, 40497941, 30239933, 22400214, 16850799, 13083281, 10540816, 8798139, 7569195, 6632293, 5899156, 5376632, 4929939, 4571336, 4308963, 4066628, 3838795, 3628560, 3414477, 3191595, 3009040]
18358C009040j32405j44228j59253k06169k32117j80486j53559j43464r1565n1784
18348A514010p9741o0750l6141o3072j11684q6905r7808n6371l1638l4029K2092
18337H77963K9185L0612K5708j106n0649m9866p5840p4993o0876n4546o1213k0185
18325E14194M45n0010n5555j9938L264m483l4239j2708k8115k5427K5953K8596
18313C41977n767k1945P548J2791j7669k4056M135R959j3642j1453k1025j7292
18301B43561k8195k48K8317q54k503L0601N2984M2587j5922K2751L1352K7665
18289D32096J2086k7285m4139k9578J2159l1046k7760K3740K0610j006J2884J6009
18277C68770J5407l9136n6667l9581m5134j7642p036j851j9246j1796k6804r940
$$ y = [3009040, 2876635, 2732407, 2573154, 2366985, 2134868, 1954382, 1800823, 1657359, 1565794, 1514010, 1434269, 1373519, 1337378, 1274306, 1162622, 1075717, 977909, 921538, 889900, 855871, 877963, 907148, 937760, 963468, 962362, 911713, 861847, 786007, 711014, 650138, 595592, 534379, 514194, 514639, 464629, 409074, 389136, 392400, 387917, 353678, 340970, 312855, 287428, 313381, 341977, 336210, 314265, 321813, 334604, 316935, 292879, 297014, 306973, 293331, 281878, 260853, 243561, 215366, 215118, 243435, 242581, 240078, 270679, 323663, 366250, 350328, 373079, 404431, 432096, 444182, 416897, 372758, 343180, 355339, 324293, 296533, 320273, 340883, 339877, 352761, 368770, 384177, 345041, 288374, 248793, 203659, 186017, 178981, 177130, 157884, 146088, 119284, 109344]
18265A09344r925J5731R924n0070q624M902K5973L1255Q285j7746j4163L5110
18253A39996M3022M6588m2259k8792P941j7490l0539q28O944j1272m2725j9892
18241E0694J2278O1928J3727k081k0331k6016J558o560J44L516K8681N825J0574
18228A33937Q179r974J2414j5547o309l486K1621l8028j4729q759K307J2813l773
18215I0666L6224Q552l2049k3870O159k2511k5405J8151J1899k4623j5385J7910
18203D5718M6703J3841l7770J1313K329m090M521J1679J7388k5889k4339Q812
18191G0216Q831k9984m1941P100L3200L5300j5710k0730L6387L6142m3731l0114
18179D4966J4845r366j4315k658K4840j3661j9678K741K9316L4521K801k1216
$$ y = [109344, 99419, 115150, 125074, 75004, 66380, 71282, 97255, 128510, 136795, 119049, 104886, 139996, 183018, 229606, 187347, 158555, 166496, 149006, 118467, 117639, 124583, 113311, 70586, 50694, 62972, 124900, 138627, 136546, 116215, 90199, 91757, 85197, 85341, 88857, 117538, 123363, 133937, 142116, 132142, 144556, 129009, 122700, 119214, 140835, 102807, 88078, 79319, 81626, 94439, 90666, 126890, 135442, 103393, 79523, 85682, 63171, 37766, 55917, 67816, 43193, 27808, 45718, 92421, 106262, 68492, 79805, 82134, 78044, 82565, 94244, 111632, 85743, 61404, 70216, 79047, 49063, 7122, 14222, 47422, 82722, 67012, 46282, 82669, 118811, 75080, 44966, 59811, 50445, 36130, 33472, 58312, 44651, 24973, 27714, 57030, 91551, 94352, 73136]
18167G3136L368k2699m401J0554o021r936q63p769R455N39l725p668p833l5017
18153h880j001K5823J3332L6646M4786K4983j6988n021l0405l2261k9624j9146
18141B244j7921p514J5961O121K1389K8774J3330j1027l6921L416K4919J7775
18129F0546K2357l3487N329K3802j7544K3412N771L999k0837o5787k4139r090
18117b5668m1164J6608M0029q198P122J1102J5913L8088M6773K62J9961J6052
18105A36880p85j5494m4322l2523l2047j226P077J9890J6234j002j8168k4499
18093A0015N324m807j5898R245L9382o773k5185k5532L3114M4650k6980j4726
18081B1829L0511J726l5403J5441q000k8491l8516j4889K4764K0733j6250J2347
$$ y = [73136, 76504, 53805, 49404, 59958, 53937, 44001, 43138, 35369, 44824, 45363, 41638, 33970, 26137, -8880, -9881, 15942, 29274, 65920, 110706, 135689, 118701, 113680, 83275, 51014, 21390, 2244, -15677, -23191, -7230, -1109, 20280, 49054, 62384, 51357, 14436, 17852, 42771, 60546, 82903, 49416, 54745, 78547, 61003, 84415, 90186, 94185, 73348, 7561, -16578, -25668, -66832, -50224, -10195, -18393, -11271, -169, 15744, 53832, 100605, 100867, 120828, 136880, 136095, 120601, 76279, 43756, 11709, 10483, 17560, 37450, 53684, 52682, 34514, 10015, 15339, 10532, -5366, 3879, 43261, 36488, 11303, -14229, 18885, 63535, 36555, 21829, 52340, 54066, 18663, 34104, 26104, -2387, -40903, -55792, -31028, -10295, -26545, -14198]
18069a4198K3270m933l680p143j6241k6486K1623J4475l7023j727J469j0553M610
18056e6537L0766K102p841J9732J5380J94J0659R34J9789j8159k8802j748J8988
18043E457k4997p720K7737J9161o380m960l0717O044o93P022L92J561j3250L0996
18029I653M7351j1194k973K0424o893k1440L0543L128j5523J3748o114Q507K4429
18016I3646M6273M2887K7089L9766Q7631O7570N5914Q0058N0460L1006O5233R5908
18004G83441O0109J3277m1557n0122j1908R976p204k8717j9985n0727n5588n1503
17992E49492q9108q6384o4999l5820m0596k7434j5024k6398j835j1438k9035m76
17980A20945j6643j6688O08j235o888l472J3778j202q691l4258j7926P996J1219
$$ y = [-14198, 9072, 4139, 459, -6684, -22925, -49411, -27788, -13313, -50336, -52063, -50594, -61147, -56537, -25771, -23669, -31510, -11778, 3602, 3796, 14455, 15389, 35178, 17019, -11783, -13531, 5457, -19540, -27260, 477, 19638, 13258, 8298, -22419, -16375, -17068, -10046, -9654, -8093, -21343, 9653, 57004, 45810, 42837, 63261, 56368, 34928, 65471, 68599, 53076, 66824, 60710, 69217, 93646, 139919, 182806, 209895, 249661, 337292, 404862, 460776, 540834, 591294, 622300, 687533, 783441, 843550, 856827, 815270, 765148, 753240, 763216, 756012, 727295, 707310, 656583, 600995, 549492, 460384, 374000, 309001, 273181, 232585, 205151, 190127, 163729, 161894, 150456, 121421, 120945, 104302, 87614, 88222, 86987, 80099, 76627, 90405, 89203, 80512, 46254, 28328, 36324, 47543]
17967D7543j7658J2120K7980n062j0119p155M0080j2531L5026K4598J5751L7239
17955A87812J4269J4191J2780K0684j5160j9955J3737J9353j5493n7658m1145
17944A33415j7298K8222k9776l1618K007K4543P606l3299j2817J4432k8405l3588
17932B3424j2530L9028M7259k4274o5664J4910M7520J3521o863j5667p217j1080
17920D2367k1417m1183j649N2972R374k0387j5939J6731J4232l3451K3036j2288
17908A2398j0261j9447J8595L0771k962k8187J7053m0341j6900m192Q571M3122
17896H220L2423L977L336j7921Q391L1360K5533o97j0578k1399m7129j0712k155
17883B649k0332p650N3924M2938n225o068j2259J2483P436L476q489P03J5441
$$ y = [47543, 29885, 42005, 69985, 64923, 54804, 47649, 87729, 75198, 110224, 134822, 150573, 187812, 202081, 216272, 229052, 249736, 234576, 214621, 228358, 247711, 232218, 174560, 133415, 116117, 144339, 114563, 82945, 84952, 109495, 117101, 83802, 70985, 85417, 57012, 23424, 10894, 49922, 97181, 72907, 7243, 22153, 69673, 83194, 76331, 60664, 53447, 42367, 20950, -20233, -21882, 31090, 40464, 20077, 4138, 20869, 35101, 1650, 24686, 12398, 2137, -17310, 1285, 32056, 29094, 907, 17960, -22381, -39281, -43473, -34902, 8220, 40643, 44620, 47956, 30035, 38426, 69786, 95319, 94622, 84044, 62645, 15516, 4804, 2649, -17683, -25333, 28591, 71529, 66304, 60236, 47977, 60460, 67896, 71372, 62883, 63586, 79027]
17870G9027R07M24L541K76L5637l89o222J4079J5074j6034j2650N0212K9827J6617
17856B10326L8861M7375M144k899j0640L0235L3747M4170N4232O5705P697L307
17844E26260P370L3259l8446q5858k6143K597j4829n1593p0848k0842k2871p343
17832B30713M720j9669q148n9243k0843j841J5117N8251L8094N062L877J1550
17820B57640J3445J7228M7452L4206m451j9936K6254p453n4905p8322m3543j0027
17808A77588m117p325j9691M575L3278q48L517K0165N0562L9849M0681L9897k9528
17795C48603l8548j8813l207j2236m446k2910J0210p7035p6666m4123j1825J8298
17783F7302k3574r6L2849j2946n4493o049L3968q122k74p819j964r158P065r935
$$ y = [79027, 79934, 80358, 83899, 84175, 119812, 119423, 113201, 127280, 142354, 126320, 113670, 163882, 193709, 210326, 249187, 296562, 300706, 297807, 287167, 317402, 351149, 395319, 449551, 515256, 522953, 526260, 533630, 566889, 528443, 442585, 416442, 419039, 404210, 352617, 281769, 260927, 238056, 230713, 235433, 215764, 207616, 148373, 127530, 125689, 140806, 199057, 237151, 242213, 246090, 257640, 271085, 288313, 335765, 369971, 365520, 345584, 371838, 364385, 309480, 231158, 187615, 177588, 173471, 166146, 146455, 151030, 184308, 183460, 186977, 207142, 257704, 297553, 338234, 378131, 348603, 310055, 291242, 288035, 275799, 271353, 248443, 258653, 181618, 104952, 60829, 49004, 67302, 43728, 43632, 76481, 63535, 9042, 2993, 36961, 28839, 28565, 20746, 18782, 9624, 16689, 6754]
17769F754m0589N571L736j0192J03j3033K0494K4811M234J0662J0218J8954r79
17756D0744l5188m3679k1512L8149N0370N541j9181k351O724j6616m698j1055
17744a2752p500l05K2780j5685N786M1401J965r278k2647r235l25p920j3138j0849
17730c7702n82O573k66N5946J5480m2226k0067L3687P993k2718P168K3741K472
17717B9499J5860J1726k9526k4486K4058J7900l8033j1029K0275J8892M2174r391
17705F7919k7138l3530o749r217m278k7427K0517j1040q086J0491L9151J4222
17693B4835j5304M169J6666K8989l4138j4555k2072o160k259P069L1304J166j9457
17680B53n013O3652K8737k2174l5165l5019J359J3814k0192k4068J3018J6764
$$ y = [6754, -33835, -28264, -24528, -34720, -34617, -47650, -27156, -2345, 1889, 12551, 22769, 41723, 40744, 5556, -38123, -59635, -21486, 28884, 34425, 15244, 12893, 19617, 3001, -1697, -12752, -20252, -20557, 2223, -13462, -7676, 33725, 35690, 26412, 3765, -5470, -5795, -13715, -26853, -37702, -38284, -31711, -31977, 23969, 39449, -2777, -22844, 10843, 18836, -3882, 3286, 27027, 29499, 45359, 57085, 27559, 3073, 27131, 45031, 6998, -4031, 16244, 35136, 77310, 67919, 40781, 7251, 502, -8715, -12993, -40420, -19903, -30943, -39029, -28538, 10613, 24835, 9531, 13700, 30366, 59355, 25217, 10662, -11410, -17570, -19829, -12760, 18544, 19710, 253, -4760, 58892, 87629, 65455, 30290, -4729, -3370, 10444, -9748, -33816, -20798, -4034]
17668d034l891l838J6362j5324q800k037J0206M0197Q353l1549L2773M0241J0825
17655H9484n4001j5315K2183M4260J1190m5232r206k3158l5982p919r916J6397
17643a7215q289K7210k063J9099K3266K264p969k4995L5495m69j3562M467l1718
17630E521k8452M6511r375k3756k945k1024r342p215R971j9950l2624K6165N6569
17617i946O3946L035j6068K0532l728k9211j3323J4774J7127j3394j8953l79r989
17604D423J3059J6334K9008k753j7900J9756P5898N7675M8281L5437L6145L4855
17592C50218R151r725m1560p6831m5751k0629l4868l631J2381J9208l05j9131
17580A38527R094K1875j081N1178N4290L0335K2712J520j4567j7678m9343N355
$$ y = [-4034, -7925, -11763, 4599, -10725, -19525, -21562, -11356, 28841, 37194, 5645, 38418, 78659, 89484, 35483, 20168, 42351, 86611, 97801, 52569, 43363, 20205, -15777, -23696, -33612, -17215, -25504, 1706, -357, 18742, 42008, 44272, 36303, 11308, 46803, 46334, 32772, 37239, 5521, -22931, 23580, 14205, -9551, -12496, -33520, -42862, -50077, -40106, -60056, -92680, -66515, -9946, 54000, 57035, 40967, 61499, 57771, 28560, 15237, 30011, 47138, 33744, 14791, 14412, 4423, 17482, 33816, 62824, 60071, 42171, 61927, 137825, 195500, 243781, 279218, 315363, 350218, 359369, 349644, 308084, 231253, 185502, 164873, 130005, 126374, 138755, 157963, 157658, 138527, 147621, 169496, 168415, 219593, 273883, 304218, 326930, 328450, 313883, 296205, 246862, 252217]
17568B52217k3396p0392o3452k1168J0334K1141q013j3308n555m6096l5099j1989
17556a4776K293k65J1425K985K4583J0397J6209J2234m0752j3418O896L0025l727
17543D4109j5171J8360j6543q444J9828n556l2704J9516m1l8068J8955K2575j323
17530B5493j4403L506k740k11o864m845J9970M671K3291K9365n5973n7398j7804
17517e3942J3077K0450L5768K4723K4730N55N72j6042o9383m7180l4175J7837
17505h3010K7761L1812M3714M7933k08m8632j8321J1907K3420M276j0003o396
17493B4253k1156k1j3367j9192K6145L4090M535Q718J6682p826k5789m3716l8677
17480e5321l7979J1305J8628N546J9786K5011L7709j7744k5479M726j7978m9982
$$ y = [252217, 228821, 158429, 94977, 73809, 84143, 105284, 97271, 83963, 78408, 32312, -2787, -14776, -12483, -12748, -1323, 1662, 26245, 36642, 52851, 65085, 24333, 10915, 17811, 47836, 44109, 28938, 47298, 30755, 22311, 42139, 36583, 3879, 23395, 23354, -14714, 4241, 26816, 25493, 11090, 14596, 11856, 11645, 4781, -64, 19906, 24577, 47868, 77233, 21260, -36138, -53942, -40865, -20415, 15353, 40076, 64806, 65361, 65933, 49891, -19492, -66672, -100847, -83010, -55249, -23437, 20277, 68210, 68002, 19370, 1049, 12956, 36376, 40652, 30649, 24253, 3097, 3076, -10291, -29483, -3338, 30752, 35287, 44005, 60687, 52861, 27072, -16644, -55321, -93300, -81995, -63367, -57821, -38035, -13024, 24685, 6941, -18538, -13812, -31790, -81772]
17468h1772K2896k489J747J153l5158p888K5264K9632K9137R612L261l8328j8762
17455f1695J7747M7879j1372j3590O440K769P132k3601l0858j0786j5162L0912
17443e4185K7077j6594K093M288K0430J8427M898l544l8387n299L8095j7250n039
17430b4990m356j94k0482k08L3007k422j4759k925k02K2217L3681k5401m533k8082
17416c9649J991J1123o017K3143J2399K745o336J1017L3577K5626k4183j2954
17404C2482l4936m564R101J5113k7134p478j2405k4872K6986J4593j2008j2075
17392c7197J1757k504j4749K009K8485J2826n16K6262L719j3659J4247o613j6213
17379G854K522k5051p754J6410K8834l293l1500j3085J3728J0023N433Q341j2492
$$ y = [-81772, -58876, -61365, -59618, -58465, -93623, -101511, -76247, -46615, -17478, -7866, -4605, -42933, -61695, -43948, 3931, -7441, -21031, -14591, -11822, -4690, -28291, -59149, -69935, -85097, -54185, -27108, -43702, -41609, -37321, -16891, 1536, 6434, 2890, -35497, -40796, -2701, -19951, -24990, -29346, -29540, -50022, -50230, -17223, -19645, -34404, -37329, -37531, -15314, 18367, -7034, -11567, -39649, -37658, -26535, -32552, -9409, 2990, 5735, -601, 10416, 43993, 69619, 45436, 32482, -2454, -7018, 2083, 17196, -9938, -17416, -29821, -54693, -27707, -13114, -25122, -37197, -25440, -27944, -42693, -40684, -12199, 627, 111, 26373, 30092, 16433, 30680, 24067, 7854, 10376, -14675, -22429, -6019, 22815, 19522, -11978, -25063, -11335, -1312, 4121, 12462, -30]
17366c0K7156O696O695k177J897j1453K4024L6055j4165j5395J2706J202k0828
17353E2383j0624p288l6597R281R898K5783j1873j1837j2518m2172m06K7362m86
17340i094j3328K387K7044j1412r177k9131J5883L7328L1546K4592l898j6884
17328D5856n3928j7178K9225l6259r474k529m806L4076J9281o068Q498k815k1287
17315a7408J6114J6056M732k3271r460J2260K4733L4852o645n642N83m4793R085
17302A1196Q272r950k5628M368K0635r439J3481K2486q080l0169Q016r543j6271
17289b0626J0632J5708K6734K148k1012J0320O776n850r368K5226M0527j4339
17277F6876k0803N0649j7791j6130l781k5351j1057m429J8928J3424K0479k3932
$$ y = [-30, 27126, 33822, 40517, 38340, 40237, 28784, 52808, 88863, 74698, 59303, 72009, 73211, 52383, 41759, 34471, -2126, 7155, 17053, 42836, 30963, 19126, 6608, -35564, -35970, -8608, -9094, -22422, -20035, 7009, -4403, -13580, -42711, -26828, 10500, 42046, 66638, 62740, 45856, -8072, -25250, 3975, -32284, -41758, -44287, -49093, -15017, 4264, -1804, 6694, 3879, -17408, -1294, 14762, 19494, -3777, -13237, -977, 23756, 58608, 51963, 46321, 46904, 2111, 11196, 19468, 9518, -16110, -11742, 8893, -546, 12935, 35421, 27341, -2828, 5188, -4355, -20626, -9994, 5714, 32448, 34596, 13584, 23904, 30680, 24830, 15462, 40688, 81215, 66876, 46073, 96722, 78931, 62801, 59020, 33669, 22612, 18183, 37111, 50535, 71014, 47082]
17265D7082k7060q156n287J5184J8118O082j0692q11j1061J814m190j0710l8121
17252b7808n528K4067J8248j5207L2898L4007K7114j3991j7918N324K4309N398
17240I0913j0135o272q380j4875J9008m640m5272k641n484l319M664n305k4854
17227a6592M329R765K8856J4679k0801O056o25k5382q57L2508L1758j6450o6562
17214a9318m667K7051P927j2053K9096J9625l3328l5086j1678J5810K2322n7025
17202e1324O703K1230j1933L993J7118L1810k2992l0449j4891M463K1547K6912
17190B187m2748l3852L289j8698J9667M6417k393P481o039m2019L545k854O822
17177e9195J7036K027R270L295K2550J6009R877k861J4796J7071l6423k5775P923
$$ y = [47082, 20022, 11866, 6579, 21763, 39881, 45963, 35271, 34460, 23399, 25213, 21023, 10313, -27808, -33336, -9269, 8979, -6228, 26670, 60677, 87791, 73800, 55882, 61206, 85515, 90913, 80778, 74506, 66126, 51251, 70259, 65619, 20347, 17706, 12222, 8903, 13567, 8262, -16592, -12263, -2498, 26358, 41037, 20236, 26292, 25667, 285, -572, 31936, 63694, 47244, -19318, -23985, 3066, 10993, -1060, 28036, 47661, 14333, -20753, -32431, -16621, 5701, -51324, -44621, -23391, -35324, -31331, -14213, 17597, -5395, -35844, -50735, -46272, -24725, 2187, -40561, -74413, -71124, -89822, -70155, -23738, -26131, -18650, -24689, -66708, -63163, -66017, -59195, -42159, -40132, -30862, -27567, -5017, 10992, 20869, 18008, 32804, 49875, 13452, -12323, -4400]
17164d400L4490K0643J2460k408l1235O850K4407M750o840n269R214j1626J6214
17151F7250m3613j3639L8362M2296L6082K4091J0624j7235m7355l1196R870J7231
17139I2768Q228J0112k6904k9671N262L2618K6168J4491l0093j7437R495K5343
17127A20380j8354k1654q11L5491N4217Q895l8630L080j8045k0655Q43J184L4509
17114A40450M3040l7510l8618j5707j1922N412K1078P7796K7575l4778k9494q408
17102A38914J5149J2743q426J7497K9827J0259J371L4661Q493M458K130J8393
17090B85469K1818L4096J6655l2525N767K7803O8499O2932L2446R685l032K8515
17078E58128P6507Q1572O0588M1861O9974P6527J13460O2810J30551J26433J31484
$$ y = [-4400, 30090, 50733, 63193, 60785, 29550, 36400, 60807, 65557, 58717, 53448, 62662, 51036, 67250, 23637, 9998, 48360, 90656, 126738, 150829, 161453, 144218, 96863, 65667, 75537, 92768, 100996, 111108, 84204, 54533, 59795, 92413, 118581, 133072, 102979, 85542, 95037, 120380, 102026, 80372, 79561, 115052, 169269, 178164, 139534, 142614, 124569, 103914, 104757, 105941, 140450, 183490, 145980, 107362, 91655, 79733, 85145, 106223, 184019, 211594, 176816, 147322, 138914, 154063, 166806, 158380, 175877, 205704, 215963, 217334, 251995, 260488, 264946, 267076, 285469, 307287, 341383, 358038, 325513, 331280, 359083, 427582, 490514, 522960, 532645, 529613, 558128, 634635, 716207, 776795, 818656, 888630, 965157, 1078617, 1141427, 1271978, 1398411, 1529895]
17067A529895J20537J63783J78471J72598J66182K24601K44560K98844K88315
17058C387786L77371M71593N91085Q08974J098052J568776K289923L470853N297530
17049A9361943Q033479J1492532J2767880P788979J547700N00167J990500K878562
17041F6361742N18596n745211r380257q974494q490576p632965n434796k963103
17033A8258936r84127O53751K334055M438616P433959J0814659J1509509O370930
17025F0830288M93410j10690J555000K215316m93244o694588r960039r332665
17017C8502788q817909p928912n858779l792320k408537j571262j085383q34021
17009F205665o61406m88166m38157m12042l98525l47808l26615l08536k57946
$$ y = [1529895, 1650432, 1814215, 1992686, 2165284, 2331466, 2556067, 2800627, 3099471, 3387786, 3765157, 4236750, 4827835, 5636809, 6734861, 8303637, 10593560, 14064413, 19361943, 27395422, 38887954, 51655834, 59444813, 60992513, 61492680, 63483180, 66361742, 66880338, 61135127, 51754870, 42780376, 34289800, 26656835, 21222039, 18258936, 17274809, 17928560, 20262615, 24701231, 32135190, 42949849, 54459358, 60830288, 61323698, 61213008, 62768008, 64983324, 64490080, 57795492, 47835453, 38502788, 29684879, 21755967, 15897188, 12104868, 9696331, 8125069, 7039686, 6205665, 5544259, 5056093, 4617936, 4205894, 3807369, 3459561, 3132946, 2824410, 2566464]
17000B566464k59434k34103k09228j37790r7208o3531j10605j15832p6011j02935
16990A159787j03134n5415j5827o5419n4710n7255n9393n1328o1862n9765n9909
16979E15770m0991J6538k2454o829k8784j9370m7375l0249k7668J6544n433m3813
16967B75886j4796j3038k4379K715M7024K2732j4446k3970j9728l5199k5577K190
16955A79414j4139r770k0981K757j4854j622L2490K0282J1944J981j2555k378
16943A72569l0617l4170k0749q859m5060R458J5856J476K899J7407L4379O84o09
16930A14664k7899l3955j0324j651K7628P475k3981j224J5126j4888j0701J4241
16918E4511K1502O20K3697J0765k6878l3589J2368O277k7545j2370K7884K0290
$$ y = [2566464, 2307030, 2072927, 1863699, 1725909, 1628701, 1565170, 1454565, 1338733, 1262722, 1159787, 1056653, 1001238, 985411, 919992, 865282, 808027, 748634, 697306, 635444, 575679, 515770, 474779, 491317, 468863, 462034, 433250, 413880, 366505, 336256, 308588, 325132, 319699, 275886, 261090, 248052, 223673, 226388, 273412, 296144, 281698, 257728, 238000, 202801, 177224, 179414, 165275, 155505, 134524, 137281, 122427, 120805, 153295, 173577, 185521, 187502, 174947, 172569, 141952, 107782, 87033, 78174, 33114, 42572, 58428, 59904, 62803, 80210, 114589, 115273, 114664, 86765, 52810, 42486, 40835, 68463, 75938, 51957, 50733, 65859, 50971, 40270, 54511, 76013, 76633, 100330, 111095, 84217, 50628, 62996, 69273, 41728, 29358, 57242, 77532]
16906G7532K5482K575j4751J2077J7877O65l1760j1739r431J4555J3486J0136
16894A06704J4898p143n38J910j8364j1238M790J8093J0017r214m5020Q032j6731
16881E6196j8560k6630l1506K7439M3803M6275J4796L060N677J2546M5006m9954
16869A28148l6805P302M2778m820m6999j6094K4926l249K151k2477o1097K0547
16857C4311M8214l6217n2282J6012k043j1090K1109M2934j2187k1326O221K707
16845C6363m2541k8573K5413j4956n85K609J1821J5734J8800L3094J1031o299
16833F1911j6963M770j6347k5250k1488K4728J0123j9894K594j1071J2414L3655
16821C9182J7678k7940q338j4662j8814L0121K0068N711L2342k1016J871j0790
$$ y = [77532, 103014, 105589, 90838, 102915, 120792, 121457, 89697, 77958, 68527, 83082, 96568, 106704, 121602, 114459, 113921, 115831, 97467, 86229, 91019, 109112, 119129, 109915, 64895, 72927, 56196, 37636, 11006, -20500, 6939, 50742, 97017, 111813, 114873, 120550, 133096, 178102, 128148, 91343, 98645, 141423, 136603, 89604, 73510, 98436, 95187, 97338, 74861, 13764, 34311, 82525, 46308, -5974, 10038, 7995, -3095, 18014, 60948, 48761, 27435, 33656, 36363, -6178, -34751, -9338, -24294, -24879, -22270, -10449, 5285, 24085, 57179, 68210, 61911, 44948, 49718, 33371, 8121, -13367, 11361, 21484, 1590, 4184, -6887, 5527, 39182, 56860, 28920, 20582, 5920, -12894, 17227, 37295, 43006, 75348, 54332, 56203, 45413]
16809D5413j0905j8393P067J5888k1817j2954p277k7633L7671L7915P988j539
16797E1424Q124m885l0106n274j3195m481L4470r350k2418j1058l6904k1360o552
16784g1565j0771R576K3609K2265J1677L4918L2509j1792j1976K6652P770J8977
16772H1849q367k2676j271j5995j6045l785l3991J7464J6974O55P057K8723j3062
16759C7530l4993m5017J0768K5848J4982K6698J4513J0744J7190l0417j0990J6149
16747E3005j600q701O396k8236m7058j3764K7194J4298j3000j2733j5027j628
16735d0854J522K8414k206o931P64j8963j425K627k6507R886J4423r006J8611
16722b9645J7406J0005j8878l0193N693Q169l447J9080K7890o041p724K3565o136
$$ y = [45413, 34508, 16115, 23182, 39070, 17253, 4299, -2978, -30611, 7060, 44975, 52963, 51424, 59548, 54663, 24557, 19283, 6088, 1607, 36077, 26727, 4309, -6749, -43653, -65013, -71565, -82336, -72760, -49151, -26886, -15209, 19709, 52218, 40426, 28450, 55102, 62872, 81849, 73482, 50806, 49535, 33540, 17495, 13710, -20281, -2817, 14157, 14812, 21869, 50592, 37530, 2537, -42480, -31712, -5864, 9118, 35816, 50329, 61073, 78263, 47846, 36856, 53005, 51405, 42704, 49100, 20864, -26194, -39958, -12764, 1534, -11466, -24199, -39226, -40854, -39332, -10918, -13124, -20055, -19291, -38254, -39679, -37052, -63559, -53673, -39250, -48256, -29645, -12239, -2234, -21112, -51305, -45612, -37443, -40890, -21810, 6080, 39, -7685, 15880, 9744]
16709I744k3411p36j810R846k4815j1292J0436J6956O690R09J609k3692m4839
16696g4405j2541J9176J0864M2182N1181j7962j4606k3954j0155Q709l216j3343
16684c8070q069o234j9951L7313M6541Q08M690k483J3878Q149m0778k5244Q78
16671b8572k3425j8259J1285K6569M094N940k2465J2532J1928J098j3984j3330
16659d6589J785J9886L2175j9683k6634j3834q690N1392N722j5077j4175M19J7519
16646a5784n945j2179L8316K9372K0681j533m6453L382K683K3067Q924l0290r687
16633D554j1780j1203n5127m4M0987L1261O538q974K0012j2115j9879J1556P377
16620C163K6186l313l8000J3154K046q76j012K3091K3265K4232k5309k6910o238
$$ y = [9744, -13667, -14403, -16213, -6367, -31182, -42474, -32038, -15082, -8392, -7483, -5874, -29566, -74405, -86946, -67770, -56906, -14724, 36457, 18495, 3889, -20065, -30220, -21511, -24727, -38070, -46139, -52373, -72324, -35011, 11530, 12338, 17028, 14545, 28423, 36572, -4206, -29450, -28572, -51997, -70256, -58971, -32402, -28308, -22368, -44833, -32301, -20373, -19275, -33259, -46589, -44804, -24918, 7257, -12426, -39060, -52894, -61584, -10192, -4470, -19547, -33722, -33303, -15784, -21729, -33908, 4408, 33780, 54461, 52928, 6475, 9857, 12540, 35607, 44531, 14241, 4554, -7226, -18429, -73556, -73600, -32613, -1352, 5186, -3788, 16224, 4109, -15770, -4214, 3163, 29349, 26036, -11964, 1190, 3236, 2360, 1348, 24439, 47704, 71936, 46627, 19717, 13479]
16607A3479j457p747k3810K0420J2419j9924j3803J564k0218l294q505J7677P25
16594c2474K9900Q85J4788k388p118J9948l7840K775L370J15K9037o04l112O807
16580B4089J1851K675k405Q799J7290j7250l9386J6795K546p360n522l1996q129
16567b8003n56J4616n984j6976j1397k9021l472M3948q018j1388Q270M7970j0062
16554a0073l237L1259K5737k2883r814j6153r6M9071k1982J6376r504n0199l684
16541b5182M6155R944l9098j6983K7826k0545j2996M5186J7019j735k4192j2248
16529f849L496m4642L839J3691l265o229m632r271K1495M1825O54k4801j0566
16516b5255j8650K1032L6015J1525p538q107N527q180K8401P598l3514o7861R100
$$ y = [13479, 12022, 4275, -19535, 885, 13304, -6620, -20423, -18859, -39077, -42371, -50876, -33199, -32474, -2574, -1689, 13099, 10711, 3593, 23541, -14299, -11524, -8154, -8039, 20998, 20394, 17282, 24089, 35940, 38615, 36210, 45009, 62299, 45049, 5663, 22458, 25004, 17644, 12122, -19874, -28003, -28559, -13943, -19927, -36903, -48300, -77321, -80793, -36845, -44863, -56251, -47981, -11, -10073, -13310, 17949, 43686, 20803, 10989, -5164, -5260, 43811, 21829, 38205, 28701, -21498, -25182, 20973, 30917, -8181, -25164, 2662, -17883, -30879, 14307, 31326, 29591, 5399, -6849, -3353, -47995, -44156, -30465, -33730, -39959, -44591, -53862, -32367, 9458, 10112, -14689, -25255, -43905, -22873, 13142, 24667, 17129, 9022, 14549, 6369, 34770, 42368, 8854, -59007, -49907]
16503d9907N0121Q904N1012j3251k4654L567O152M981J2194K3574N2849N4796
16491A80338N4464O9005J9582j3252l5595l657j7390J1967k722j6774j6690l8906
16479A90370k4266j3558j1621q165k7723J2666M1820N8160N6122M9606K3402j0682
16467C36131j1403L0482j8764n5565l3540l6218j8821k8864m7794l8947j3274
16456F3423q692k1449j8660J6477j1956r906L0143j823k1061j9626j5504J8245
16444c89J0402P211M367j5080k0018J7005J3173R137k1198j4676R382j0171j6185
16431b7040j6989k438Q287M6595M4110M213k3797m8903K1089L3082l41m791j1154
16418B1923m0401n007l5706R231M5467J0578k1254K233J0482Q046r321M687J7482
$$ y = [-49907, 214, 9118, 60130, 46879, 22225, 25792, 31944, 36925, 49119, 72693, 125542, 180338, 234802, 303807, 323389, 310137, 274542, 270885, 253495, 265462, 262740, 245966, 229276, 190370, 166104, 152546, 140925, 132760, 105037, 117703, 159523, 217683, 273805, 323411, 346813, 336131, 324728, 355210, 336446, 280881, 247341, 211123, 192302, 163438, 115644, 76697, 63423, 54731, 33282, 14622, 31099, 19143, 9237, 39380, 37557, 16496, -3130, -18634, -389, 10013, 17224, 21591, 6511, -13507, 3498, 16671, 25808, 4610, -10066, -684, -10855, -27040, -44029, -46467, -38180, 8415, 52525, 56738, 32941, -15962, 5127, 38209, 37868, 33077, 21923, -18478, -23485, -59191, -49960, -4493, 6085, -15169, -12936, -2454, 5592, -3729, 958, 18440]
16405A8440J8056J4277M887j043n4116j2761l290j6792O159K3228J6625m719k4209
16392a5258o119o007q267j2173q319P48o699J9707J9155J0927K409M5M834l4219
16378c9236k5803K3469O7960R791m0626l0035p913J3236L2012R889J0000q699
16366A4045j3258J7695O929n74l1224l1147p254J8919j0715J645L2742p648j5983
16353b5828r885k5244O511K1600L1385k19R716j0478o764J6063J7702k1237j3424
16340a0102L322j4644j4963k7423O284L8352J4513k774K3472L3055l1165m7458
16328b9531k560J2771Q205o115J8780j4354l0713j0185L9578L2181l119j6308
16316a370n6022j5903O035M8568J4141q458L81J5436Q922j2087l2024j5434J8227
$$ y = [18440, 36496, 50773, 55660, 54617, 501, -12260, -15550, -32342, -26183, -2955, 13670, 8951, -15258, -21377, -27384, -35651, -47824, -56143, -55395, -62094, -42387, -23232, -12305, -9896, -9851, -5017, -39236, -65039, -41570, 26390, 36181, -4445, -34480, -42393, -29157, 2855, 12744, 22744, 14045, 787, 18482, 25411, 24837, -6387, -37534, -44788, -25869, -36584, -34939, -2197, -9845, -25828, -35713, -60957, -54446, -32846, -1461, -1680, 8036, -2442, -9206, 6857, 24559, 3322, -10102, -6780, -21424, -36387, -63810, -57526, -19174, -4661, -7435, 16037, 49092, 17927, -29531, -32091, -19320, -11115, -17230, 1550, -12804, -43517, -53702, -14124, 18057, 14938, -1370, -57392, -73295, -67260, -18692, -4551, -13009, -12628, 2808, 11730, -357, -32381, -47815, -29588]
16303b9588J9448K7646l114r525l4239N958J3104K162K254p249Q09m693K210M273
16289a0544J649M5414J4538m986n10j0717J7660j1704k3232j5794q002j5688r686
16276c1602j6188q488k0470J0518L4598M8894K9495J3230P57j0136l3946r425
16264G237J2416j7942l673K744R23k7137O068M3855j6790j9994Q475j7369k8468
16251d9655J3656J6101L9241R264k6695n9546k5008K117M4176k472o002J4231
16239c0592K5188L7518q898o0628l6220K5369K2793L6540R428R714P801m7766
16227i753k99j8478j0253K9495N427j3275j4767j3392j400K2295K1659K860j3185
16214a3066L1829k0k3892j0755J6452J2405l7442K2472n240j0315j854o239k8363
$$ y = [-29588, -10140, 17506, 14392, 4867, -29372, -23414, -10310, -8148, -5894, -13143, -12334, -17027, -14817, -10544, -8895, 36519, 51057, 46071, 45561, 34844, 52504, 40800, 17568, 1774, -6228, -21916, -31602, -47790, -56278, -76748, -66230, -31632, 17262, 46757, 59987, 60744, 50608, 16662, 7237, 19653, 1711, -1962, 782, 1705, -25432, -19364, 24491, 7701, -12293, -3818, -21187, -49655, -35999, -19898, 19343, 28607, 1912, -57634, -82642, -80525, -36349, -38821, -44823, -30592, -5404, 32114, 23216, -37412, -73632, -48263, -25470, 11070, 20498, 30212, 38013, -9753, -10052, -28530, -38783, -9288, -3861, -17136, -31903, -45295, -46695, -24400, -2741, 119, -13066, 18763, 18743, -5149, -15904, 548, 12953, -24489, -2017, -7257, -17572, -19426, -25665, -54028]
16201e4028J1769J4124l5338n954J4126J7838J8457j2970J834j4252j1019l0858
16189h6271J0768o182j0822K0509J4671K197J4586k71j3262Q016j37r585K1358
16176c4425N1891K8119q519m12n5655m0092K4905k0355k1169K1040L7275p92R835
16163h354j908j6631J9651P08N389O389j0299l1489K4061K8547J2875j9012l1310
16150b1383M649J3985k5036l5427k4161o24j1875L2687N2426K0923j647n908O574
16137E183j1682j1962L101k438Q626L4067K4013n671j0199j4950l0372k3300k1781
16124e7365K5390k6006K2500K2216j4222k046J385J2591J8821k4464j1443J036
16112c1607J6527R275l293N89P521p759k1640R909K0901P366J9994K463q330k1742
$$ y = [-54028, -42259, -28135, -63473, -69427, -55301, -37463, -19006, -31976, -30142, -44394, -55413, -86271, -75503, -81685, -92507, -71998, -57327, -55130, -40544, -40815, -54077, -46061, -46198, -55783, -34425, 17466, 45585, 37066, 36654, -19001, -59093, -34188, -54543, -75712, -54672, -17397, -18189, -8354, -10262, -26893, -7242, -6534, -1145, 5244, -5055, -36544, -12483, 16064, 28939, 9927, -21383, -16734, -2749, -27785, -63212, -87373, -87997, -99872, -67185, -14759, 6164, 4517, -1391, 5183, -6499, -18461, -15360, -17798, -9172, 24895, 48908, 43237, 33038, 18088, -12284, -35584, -57365, -31975, -57981, -35481, -13265, -27487, -29533, -28148, -15557, 3264, -21200, -32643, -31607, -15080, -5805, -9098, -8509, -988, -8747, -30387, -20478, 423, 7789, 27783, 30246, 21916, 174]
16098A74O22k4k9565l631J0502J3187j2420J3844K7147N799n091J3642j456j6052
16084A6678m0835j9159M836J8134L4522M438J5996K4373l2633l9659j3696M0090
16072A3085K1640L4999k0l2525k4488k238k6392j7835K1286K628o293J6536J1829
16059A2212J6697N862k4672k9598J9265K826j3125R629L6388m988n2394k168L9851
16046A5785K4097k9136m893j1321j7672J1611J0462Q321q613k6421m2312J9249
16034e0843q87J3885L366k724p114J3437K4296n584j328K7537J3593J6416k3261
16021B0789j1183j120n304J0738K9538j3346m0856j2945J5481J3304L036J930
16009A0062n902m234M830j3822j2303J9622K734j961q629J212m098l590l2289
$$ y = [174, 796, 772, -28793, -32424, -21922, -8735, -21155, -7311, 19836, 25635, 20544, 34186, 32730, 16678, -24157, -43316, -38480, -20346, 14176, 18614, 34610, 58983, 26350, -13309, -27005, 13085, 34725, 69724, 69704, 37179, 12691, 10453, -15939, -33774, -12488, -9860, -16153, 383, 12212, 28909, 34771, 10099, -19499, -234, 2592, -10533, -904, 35484, 30496, -21898, -24066, 15785, 39882, 10746, 5853, -5468, -23140, -11529, -1067, 7254, -1359, -27780, -70092, -50843, -51730, -37845, -34479, -37203, -44317, -30880, -6584, -12168, -13496, 14041, 27634, 44050, 20789, 9606, 8486, 3182, 13920, 43458, 30112, -10744, -23689, -8208, 5096, 8132, 10062, 4160, -74, 4756, -9066, -21369, -1747, 987, -974, -9603, -8391, -12489, -16079, -48368]
15996d8368m160K5222j83j3811O131k671o525N903R235N7596K2232l3492k0003
15983b894K3950k7230l0783k3256j4254P882k863M322L6947K7517J9188l5212
15971a6686j743L371J2627N095J2400K224J5436j2622J03J2476K029l095k5047
15958F568l263n280J350L6059K0123l8606k0844j3556m3001L0258K6788j3225
15946a6629q306P860J364k201J0073L8188J2602j0820j5275L3195Q160k8537l7323
15933g649R1p563k3562o945J4378J453p129j0190M19j5039J5554j172J5079J7505
15919a4770J2403j906k5476r215R742K3686k3351k0345J0152k948Q064K0609L9582
15906B6227K5741k0324j0677K4579j8050l6693k7201N125k8578j7585J3334M8769
$$ y = [-48368, -52528, -27306, -27489, -41300, -35169, -37840, -44365, -38462, -29227, 28369, 50601, 17109, -2894, 21056, -6174, -36957, -60213, -74467, -66585, -69448, -65126, -28179, -662, 18526, -16686, -18429, -15058, -2431, 2664, 15064, 17288, 32724, 20102, 20205, 32681, 34710, 31615, 6568, 3305, -1975, -625, 35434, 55557, 16951, -3893, -17449, -60450, -30192, -3404, -16629, -24935, -17075, -15711, -17912, -7839, 30349, 42951, 32131, 16856, 50051, 58211, 29674, -7649, -7558, -15121, -38683, -45628, -31250, -29797, -36926, -47116, -46697, -61736, -46182, -47354, -32275, -14770, -2367, -4273, -29749, -38964, -29222, -5536, -28887, -49232, -39080, -42028, -33964, -13355, 26227, 51968, 31644, 20967, 45546, 27496, -9197, -36398, -31273, -59851, -77436, -64102, -15333]
15894a5333K3070q557j0433k8139k7761p647N4336k591J5701O455k4460j6233
15882d1592L5711L54p099J3334K3738o022j6622j5489j2879l8952J3104J8720
15870c3694J6025J5926n178N99n594O851K2597L5478m822k1148P591j531r813
15857B3287j1346J7999j7654J6315M953m314k6135k5442J1257J8766N22J1687
15845A9895j292j1888m012j9050m4882q099N1239K11j7978j5194j1813Q503N069
15832d9291J2472Q25k8311n719L0159J616q057J039J8264J2879k7012j2643J9211
15819c4568J3798Q362M3024J1775k9876j733J6084L91m6494k2133j2810J749J1709
15806d0722K0152j2169J9705m005j861J4752o298P804k1344k2098j9914J4544
$$ y = [-15333, 7737, -820, -11253, -39392, -67153, -74800, -20464, -23055, -7354, -899, -25359, -41592, -5881, -5527, -12626, 708, 24446, 18424, 1802, -13687, -26566, -65518, -52414, -33694, -17669, -1743, -6921, -6322, -11916, -5065, 17532, 53010, 48188, 27040, 34631, 33100, 23287, 11941, 29940, 12286, 28601, 33554, 29240, 3105, -22337, -11080, 7686, 8208, 19895, 18603, 6715, 2703, -16347, -61229, -69328, -18089, -17878, -35856, -51050, -62863, -54360, -49291, -36819, -35994, -64305, -70024, -39865, -38249, -46306, -45267, -27003, -14124, -41136, -53779, -34568, -20770, -12408, 30616, 42391, 12515, 10782, 26866, 27257, -19237, -41370, -54180, -52431, -40722, -20570, -32739, -13034, -17039, -18900, -4148, -10446, -2642, -23986, -46084, -65998, -51454]
15794e1454J4632P862J1320M0052j3432l7261L588r897j3725m1322K3933L8292
15782b7412M6441L611k5948j8412j1413Q993L4911m866m5022m6039K1655L9052
15770b4449J7273L4633P671k8986N154k094k7189M245p11R701J0474j2039j7785
15757b4102L5048J3165q871k6352j5292j7045R041K9027J3468j930k2227k4831
15745d0901J5499J36j7310J5370l0173k501K5517J0734J2068q815n857J0276j8978
15732c4935J3305j4910P239L6454Q100q298q36j9520O744O10p929R829R450p7
15718E226j9983l5706q741J7272K9157j8544j2173Q874J3086kK2295k6139q410
15705c3788r236r417L2918O6039J0689l5457l5423j969k4079R191K0612O994M617
$$ y = [-51454, -36822, -28960, -17640, 22412, 8980, -28281, -24693, -34590, -48315, -89637, -65704, -27412, 19029, 22640, -3308, -21720, -33133, -24140, 10771, 5905, -39117, -85156, -63501, -24449, -7176, 27457, 35128, 6142, 11296, 9202, -17987, -13742, -14453, -4752, 5722, -6317, -24102, 10946, 24111, 15240, -11112, -26404, -43449, -34408, -5381, 8087, 6157, -16070, -40901, -25402, -25266, -42576, -27206, -57379, -59880, -34363, -23629, -11561, -20376, -26233, -15957, -34935, -21630, -36540, -29301, 7153, 15253, 6955, 6119, -13401, -6657, -6047, -13976, -4147, 5303, 5226, -14757, -50463, -59204, -41932, -12775, -31319, -43492, -34618, -21532, -21534, 761, -25378, -33788, -43024, -52441, -19523, 46516, 57205, 21748, -13675, -15644, -39723, -30532, -9920, -2926, 1691]
15692A691K06n959l050J0853o168O834l5689l2549K7773r245P517N3495K9149
15679D4858j4490l7803J896k3705k7030K8241J9265l282J3064K381j3992J1963
15667A366j4534J3219P962j4349j6753j3369m340K3928k3984J6785N580j1460
15655b9949k7003j2331L61K0399j9890N995K8675M2526k1258k5264J2471N6095
15643C0827K2215m5807l9529K9969j4808k4551K783j0803M7887K0378Q007k3039
15631C529K516k9839P760p355K268K7554L799j8325K3276O944n4424m703O787
15618c0213m895L2760k8099m3457j9880K4795J9457J8278L4752L3444J3087O807
15606E6836j6053j0816k9037m0587l593L2634k4443m1018L1265J7879J195R695
$$ y = [1691, 1897, -4062, -7112, 3741, -2427, 4407, -31282, -63831, -36058, -45303, -37786, 15709, 44858, 30368, -7435, -5539, -29244, -56274, -28033, -8768, -12050, 1014, 3395, -10597, 1366, -13168, 51, 8013, -6336, -23089, -36458, -40798, -16870, -40854, -24069, -18489, -29949, -56952, -69283, -68922, -48523, -68413, -62418, -33743, 8783, -12475, -37739, -25268, 30827, 53042, 7235, -32294, -2325, -17133, -41684, -38901, -49704, -1817, 18561, 26568, 3529, 6045, -23794, -16034, -23389, -21121, 6433, 10232, -8093, 15183, 22127, -32297, -37000, -30213, -35108, -2348, -30447, -73904, -93784, -68989, -49532, -31254, 3498, 36942, 50029, 56836, 40783, 29967, 930, -39657, -43250, -10616, -35059, -76077, -44812, -26933, -25738, -16043]
15594a6043j498q400J9099M418P034N432j1850j1826Q188r337k5127n375K8440
15581a6845J9456R809j0657J0679K3188l9889k9259j4878j2998l471L322L6757
15569b4786R000n396O464n894k1437Q918J2330K49j0557K9742j3025k4671J6022
15556b3041r688L3135p347J0630J0441m0553k5333J2839j6594K41k198O725J6782
15543c3961Q746J6687N308l583p449j7454M2184k4293j0324P200o275j1204J3353
15530b1065K298J6053J718k6073m317q43L9251J4827l2314k3722N815K1861Q378
15517A867K2756R361K3209l3454l3169k5535K3343K2203k5091P416l358K31M142
15504f079P368j501j5295p803j496J7493L075n025k3556n008j6667j0224K4001
$$ y = [-16043, -17541, -25941, -6842, -2424, 4610, 10042, -1808, -13634, -5446, -14783, -39910, -45285, -16845, 2611, 12420, 1763, 12442, 35630, -4259, -33518, -48396, -61394, -64865, -61543, -24786, -15786, -21182, -14718, -20612, -42049, -33131, -20801, -20552, -31109, -1367, -14392, -39063, -23041, -32729, 406, -6941, 3689, 14130, -26423, -51756, -38917, -55511, -55270, -57468, -50743, -33961, -25215, -8528, -3220, -6803, -14252, -31706, 10478, -13815, -24139, -16939, -23214, -34418, -21065, -18767, -2714, -996, -27069, -31386, -32229, 7022, 21849, -10465, -34187, -28372, -6511, 1867, 24623, 33984, 57193, 23739, -9430, -34965, -11622, 10581, -14510, -7094, -10452, -10221, -6079, 1289, -212, -15507, -23310, -24806, -7313, -4238, -9263, -32819, -37827, -54494, -64718, -40717]
15491d0717M9990r51m5292m2499P197J5351K5506q894Q252N844j2454K494K5435
15478a0738K3164j4509k3740p4128J5993J8227j1654J1988K1847J6724r383K8555
15466g654K5130n4451k16K1999Q37J8613l790j9647k2389O407K7757K687k6336
15453c1053k217J770K235L554r679j6323j3939l2054J6034M9402J9071O612m850
15440a1437L101M990k130l1643J5337N4508N879m4542l1497m0305m786K8219j1951
15427f6257J45j976j2873L045P734L5731K8044K293p340Q038O905p780m646j3361
15413b2298j9433l050M148j1229K3701L490N106k7632k1921J8222M5326l362n111
15400a4043j3911j4320N3Q292L2306j7799j667K8536k9774J0152k99Q326K5088
$$ y = [-40717, 9273, 8322, -36970, -79469, -72272, -56921, -31415, -40309, -32057, -26213, -38667, -36173, -10738, 12426, -2083, -25823, -99951, -83958, -65731, -77385, -65397, -43550, -26826, -36209, -7654, 17476, -36975, -37191, -15192, -14355, 4258, 468, -19179, -41568, -35161, -7404, -4717, -31053, -33270, -31500, -29265, -25711, -35390, -51713, -65652, -97706, -81672, -32270, -13199, -6587, -11437, -8336, -3346, -5476, -37119, -21782, 32726, 38605, -5937, -37434, -77739, -82525, -54306, -66257, -66112, -68088, -80961, -77916, -70182, -34451, -6407, -4114, -11454, -3416, 3489, -4291, -8937, -22298, -41731, -44781, -40633, -51862, -28161, -24671, -19565, -47197, -69118, -50896, -5570, -8932, -14043, -27954, -42274, -42221, -33929, -1623, -19422, -21089, 7447, -22327, -12175, -12474, -4148, 20940]
15387B0940k018j6535n442J8092J2772j6734p969j587L5900M1169j3715m3436
15375B1437m7469j7658J5760N433K8419J5045J339j9078k5090j8553j9483n086
15363f4984K288o5L2585L949l305q807J1444j5186K2966L3131l4179j1862N5K9925
15349b045j2j6199m427j4187K7552J4243j6249M414K7284j6891j4462o7425j6232
15336i4636N3318O5845M1659k4463l524K4232l6570l4553J2987m515j25J9120
15324A8775O168K965J0282L0723j2537k3439k7042l2052j9483J7241K2835M1832
15312C6268j115k1900l447l990j0843N396K0061k3209j5864R340m435R856r375
15299a3257j5608Q482J0746J225P027N707r128m643j1557l167j2740m0300o351
$$ y = [20940, 18922, 2387, -3055, 15037, 27809, 11075, 3106, 1519, 37419, 78588, 64873, 21437, -26032, -43690, -27930, -22497, 5922, 20967, 22306, 3228, -21862, -40415, -59898, -64984, -62696, -62761, -30176, -26227, -29532, -38339, -26895, -42081, -19115, 14016, -20163, -32025, -31970, -2045, -2057, -18256, -22683, -36870, -9318, 4925, -11324, -6910, 20374, 3483, -10979, -78404, -94636, -41318, 24527, 66186, 41723, 38199, 62431, 25861, -8692, 4295, -220, -345, 18775, 24943, 27908, 38190, 68913, 56376, 32937, 5895, -26157, -45640, -28399, -5564, 36268, 35153, 13253, 9806, 5816, -5027, 369, 20430, -2779, -18643, -9303, -13738, -3882, -13257, -28865, -20383, -9637, -8412, -1385, 4322, -4806, -9449, -21006, -24173, -36913, -77213, -83564]
15286h3564J3113K1502K3562j9057p071J4646J248L436J8378l588l2304M483J9168
15273b6048J6627o445J2759k944N297m052j3529k92J8468p897K9152j4853n1922
15260d5679j2707J5572L477r398K0459k6417L7142J3127J0337J6201J4751k0753
15248A6112j8406K0400j5193J333p047j3050r899l0964L4384L3389k2439P820
15236c560K6531K7330q88k7892l8498K367J7492J8745n703J6189j9824j7922o118
15223a1751J7427Q450o711j7734k0985K493J0488l894K0024K412r796K1733K133
15210A4289l4291l4101o448K8452K1037K051k0553j4904O384J7327J161n4650
15198g4246P566J3302n778J3187K1345J9886j534j2944o810L3477K5296l898k1512
$$ y = [-83564, -70451, -48949, -25387, -44444, -51515, -36869, -35621, -32185, -13807, -17395, -49699, -45216, -26048, -9421, -15866, -3107, -6051, -754, -4806, -18335, -18627, -159, -8056, 21096, 6243, -45679, -58386, -42814, -39337, -48735, -28276, -54693, -17551, -4424, 5913, 22114, 36865, 16112, -2294, 18106, 2913, 4246, -2801, -15851, -25750, -56714, -22330, 11059, -11380, -3560, 22971, 50301, 49413, 21521, -16977, -14610, 2882, 21627, 15924, 32113, 12289, -5633, -11751, 5676, 14126, 7415, -10319, -31304, -28811, -18323, -22217, -2193, 219, -9577, 12156, 14289, -20002, -54103, -60551, -32099, -11062, -9011, -29564, -44468, -38084, -20757, -19596, -74246, -66680, -53378, -59156, -45969, -24624, -4738, -6272, -19216, -26026, 7451, 32747, 28849, 7337]
15185G337Q412J818p562j9030K2965J3018J1081Q90j6400J0787L3147n4719l7930
15172b6186j6471J3448k775J8928q70k4364o3475k2201K9382j109K5085j3555
15160h4163p739j0699M880L3308L223n792J4586r14J9640o570J6950K5145j6261
15147a4406k7627k5676M395J9418o070P47K0653L0183j1638J6284j6772J105K2175
15134A2771k1762k2583J540J1467L6467P378l1193M550J2004n6853l387L790K880
15121d2931R246J4334q239Q323K861j2954K399K9409k022n773N459P805p031j8001
15107a7115m5596O751J1550j2298P58J8281J8207Q822J4084j1964j6525J1761
15095a3284K3488j692O359R06j8117r221J4826R942J7456q620m687l386j4460
$$ y = [7337, 15749, 17567, 10005, -9025, 13940, 26958, 38039, 38929, 22529, 33316, 66463, 11744, -26186, -42657, -29209, -31984, -13056, -13926, -38290, -101765, -123966, -94584, -95693, -70608, -84163, -91902, -102601, -97721, -64413, -61190, -66982, -52396, -53310, -33670, -40240, -23290, 1855, -14406, -42033, -67709, -63314, -43896, -49966, -49219, -28566, 1617, -10021, 6263, -10509, -9404, 12771, -8991, -31574, -30034, -18567, 17900, 25278, -5915, -1365, 10639, -46214, -49601, -45811, -42931, -33685, -19351, -27590, -19267, -16406, -29360, -26961, 2448, 426, -5347, 112, 7917, 886, -17115, -62711, -55960, -44410, -56708, -55950, -37669, -19462, -10640, 3444, -8520, -25045, -13284, 10204, 8512, 14871, 15777, -2340, -11561, 3265, 13207, 30663, 22043, 17356, 13970, -490]
15082d90j7822L4817L6544L994l2989k980J0214l6070J0288K847k8540p791L3441
15069E463J4673j6257p914P353l993K4229N432k8900K4682m796k3411k4746K8893
15056G08O923j9687J8196K4102k1495k9616K0188j2689j2367l0717N795J3517
15044c7142J5626Q626J7462k5889J8072K1949j9481k332K2629O678J956k2906
15032E248K7548j4033k9897L442L547q821k9823j1673Q170M9465M4980R448R673
15019F7274l9162j5657J3814k1922j8775J7748J1208j1696M95J1629j5608m6167
15007d6819q780J8585K0885l551o791K8108R531k8536k784r775k1870jM5153m2758
14993d9403m5722o246J9879K0495m702k0965m684K6891j2184r831Q502K1877O410
$$ y = [-490, -18312, 16505, 53049, 57043, 24054, 21074, 31288, -4782, 5506, 8353, -20187, -27978, 5463, 20136, 3879, -4035, 3318, -675, 23554, 28986, 86, 24768, 19972, -3439, -28185, 708, 7631, -12056, 6140, 30242, 8747, -20869, -681, -13370, -25737, -56454, -50659, -37142, -21516, -12890, 4572, -21317, -3245, 18704, -777, -3109, 19520, 26198, 28154, 5248, 32796, 18763, -11134, -7692, -4145, -12966, -42789, -54462, -46292, 3173, 48153, 57601, 67274, 28112, 12455, 26269, 4347, -14428, 3320, 14528, 2832, 3327, 14956, -652, -46819, -55599, -37014, -16129, -19680, -26471, 1637, 11168, -17368, -20152, -29927, -51797, -51798, -6645, -49403, -95125, -101371, -81492, -60997, -65699, -86664, -91348, -64457, -76641, -86472, -77970, -56093, -49683]
14980d9683p85N8187L6641k0843n8226j3224K0220K7817k997J863M071J498R515
14967A4054j190M557Q632j0288j3541q138J865j8380p93K1015p252J844k1307
14954b8922p14N7750p357k1641k926k615n448j4864k8376q54N86j156l9616P136
14940h9017K2710L9388K7030m2765j3411K8353K3345K678k1550J0267K9369J4091
14928C0488n4J1741j7390k8640K8637j2037n5044j6066Q221J5727J0217j2575
14916c6775j4168l51K4525M4143K229k117j4924R127r114l504o856N2J1562k9056
14902b5227L87J5939M6988K9313n821j9393l6271l3079k058n234K995J5935j5422
14889c0948k4933k0888L7191L3128j354r124J1853m273R25k958J474J3457Q31
$$ y = [-49683, -50468, 7719, 44360, 23517, -34709, -47933, -27713, 104, -2893, -1030, 3041, 4539, 14054, 12864, 17421, 26053, 15765, 2224, -5914, -4049, -22429, -23222, -2207, -9459, -7615, -28922, -29636, 28114, 20757, -884, -3810, -6425, -11873, -26737, -55113, -55967, -55381, -56537, -96153, -89017, -66307, -26919, 111, -42654, -56065, -27712, -4367, -1689, -23239, -12972, 16397, 30488, 30434, 42175, 24785, -3855, 24782, 12745, -42299, -58365, -50144, -34417, -24200, -36775, -50943, -51294, -26769, 17374, 19603, 17486, 2562, 11689, 2575, -929, -7785, -7733, 3829, -25227, -24840, -8901, 38087, 67400, 61579, 42186, 5915, -27164, -29222, -34456, -31461, -15526, -30948, -55881, -76769, -39578, -6450, -7804, -16928, -5075, -9348, -8423, -11381, -9907, 3550, 4381]
14876D381R535j9326j1448m790j0321r251R451R934J8921K7395J0655k0042r909
14863E185J2507m42k4554j2057J5426M8326r832j7528j2789m552j3397L967K4787
14850A5047L1901K1945l9518o0063K497K2717m970m9366R862M0509N8548P769
14838E6878l8275N575o239k3100l9302K5779M2086m673l3661n2335j5870M1949
14826d1188M3696M0386j9591l4726O408j0663j7059K4670K8516L9418l033k2976
14814C3858k6406m4267M568J0142K9063K7303K8398l3583j3129l3813j1067n112
14802c4045p699j5132j1630K5788J4296J4890n578k2678O227J3052K971M5667
14790B6129o931m2980k8696k331j156j8686J9259M0291K3639J657R138M4931K406
$$ y = [4381, 13916, -5410, -16858, -21648, -31969, -41220, -31769, -21835, -2914, 24481, 35136, 15094, 5185, 17692, 17250, -7304, -19361, -3935, 44391, 34559, 17031, 4242, -310, -13707, -9740, 15047, 46948, 68893, 29375, -30688, -28191, -5474, -10444, -59810, -49948, -9439, 49109, 56878, 18603, 24178, 17939, -5161, -44463, -18684, 23402, 18729, -14932, -67267, -83137, -41188, 2508, 42894, 23303, -11423, -5015, -15678, -32737, -8067, 20449, 59867, 56834, 33858, 7452, -36815, -32247, -22105, 6958, 34261, 62659, 29076, 15947, -17866, -28933, -34045, -41744, -56876, -68506, -42718, -28422, -13532, -19110, -41788, -35561, -22509, -19538, 26129, 19198, -23782, -52478, -54809, -55965, -74651, -55392, -15101, 8538, 10195, 19333, 64264, 66670]
14777F6670k0255k0850m8312J9329M4781J5317k4070l7061j5651L3431J6623j0915
14765A9037J8497K9780j6877k6541K095l2692k1843Q22P663l8083K208R091Q328
14752c8515j2095O032J312j80n496j0339K2183J9583J9569J259K0488R945j0431
14739B3315q364q02j3368j7605K6177R308k3639l8823k0806J1422k0688J049K0424
14726e2400M0568N3759P19l1022j6682l4994k3707l929K9525L6346j6766n950
14714b4533k0828m928K2582L1892o417j3863m1083k9097j1160K0540J1823J7712
14702d7360R427j369K233q440j844K8443j0443L298M739J2283K9398j2613m5212
14689c7460j5464K1694m203j5861L1185M2527j0652j1725K7281l444l2634J416
$$ y = [66670, 46415, 25565, -22747, -3418, 41363, 56680, 32610, -4451, -20102, 13329, 29952, 19037, 37534, 67314, 50437, 23896, 25991, -6701, -28544, -27722, -20059, -58142, -55934, -46843, -38515, -50610, -44578, -43266, -43446, -48942, -59281, -37098, -17515, 2054, 3313, 23801, 33746, 23315, 14951, 14149, 781, -16824, 9353, 18661, -4978, -43801, -64607, -53185, -73873, -72824, -52400, -11832, 41927, 42646, 11624, -5058, -40052, -63759, -67688, -38163, -1817, -18583, -24533, -45361, -50289, -27707, 4185, -2232, -16095, -57178, -86275, -97435, -76895, -65072, -47360, -37933, -39302, -37069, -45509, -47353, -18910, -29353, -26055, -21316, -9033, 20365, 7752, -37460, -52924, -31230, -35433, -51294, -20109, 22418, 11766, 41, 27322, 23878, -8756, -7340]
14677g340k2340j8684o190J6898J3364m141l1476Q749L0966L3918K4177j2190
14665B5711r948k3049O617K1034J627l100p381M384M110R888L0343j4207o281
14652C9748m9232j2060R385L2051N031n506J6004J7689K23k7120l0104k4678j0289
14639c8858R516M7488J0116l6517n199k777L138K009J0035J6926m616l1914q218
14626b8871K6948j9679j6508K2742L6598R137j5739N472J8220m1174l7419j8835
14614e9108m4125L266O2763O0623J8549m243j9332k7527l3106k2334K528j826
14602f3872o903p599K5848K5078j4703Q830K7200k5078n0849K7623M0903O1233
14590D7711K0174k4233l9758l3367J3236k836n6032m2822L9382M2367K6711L1325
$$ y = [-7340, -29680, -48364, -54554, -37656, -24292, -28433, -59909, -51160, -20194, 13724, 37901, 25711, 15763, -7286, -669, 20365, 21992, 18892, 11511, 15895, 20005, 29893, 60236, 46029, 39748, -9484, -21544, -12159, 19892, 24923, 19417, 35421, 53110, 53333, 26213, -3891, -28569, -38858, -29342, 18146, 28262, -8255, -13454, -16231, -13093, -11084, -1049, 15877, 11261, -20653, -28871, -1923, -21602, -38110, -15368, 21230, 30367, 14628, 20100, 38320, -2854, -40273, -59108, -103233, -99967, -37204, 23419, 41968, 37725, 18393, -9134, -42240, -64574, -62046, -63872, -70775, -78374, -52526, -27448, -42151, -33321, -6121, -31199, -82048, -54425, -13522, 47711, 67885, 43652, 3894, -29473, -16237, -19073, -75105, -117927, -78545, -36178, -9467, 21858]
14578B1858K2206m0144j6333M3952L0564m349j9138l9752J1452L3016K8097l8538
14566C2891k043K1371K0989j2191l5316N133l7544k0886j0295J8967P004m887
14554a6807l4785Q001L5854j9175j1802K0444Q739M3874N744k4746j6698L2458
14542C1101N387k3812k2829j311j7218k3426J4400J1078n638J1520K1113R491
14530I856j4650O153l999m804J4575K6301L2101J362m4451k3738k6503K28j5011
14517d2580K0769p822j4164R189N726M040n877P555P760q082o708j7663q53J7081
14503c1629K9659K1826r98l1284k5445K984k1678j3250L7245J0086k2665j0907
14491e6056N507P789K9215L2439M688q653J6182l0629m0089j5065K0590N0636
$$ y = [21858, 44064, 3920, -12413, 31539, 62103, 57754, 38616, -1136, 10316, 43332, 71429, 32891, 30848, 52219, 73208, 61017, 25701, 30834, -6710, -27596, -37891, -18924, -11920, -16807, -51592, -43591, -7737, -26912, -38714, -18270, -9531, 34343, 40087, 15341, -1357, 31101, 36488, 12676, -10153, -11464, -28682, -52108, -37708, -26630, -32268, -20748, 365, 9856, -4794, 1359, -2640, -7444, 7131, 33432, 65533, 66895, 22444, -1294, -27797, -27569, -42580, -21811, -29633, -43797, -34608, -28882, -24842, -30719, -23164, -15404, -23486, -30194, -47857, -48710, -31629, -1970, 19856, 18858, -12426, -37871, -34887, -56565, -69815, -32570, -22484, -45149, -56056, -50549, -42760, -13545, 18894, 23582, 14929, 31111, 482, -39607, -54672, -34082, 16554]
14479A6554j11j2799J374M5353j1631n2098K5674J5888m3079l5556J710Q019J3408
14466b7294J4669m014k2876m884k0262P255L2221K2723j895j6936j9154O293K1522
14453a2632M2667K4757N9832J8175n6401m4901K5946K7417j4768m4536J2224L4300
14441G2080J1143l6848l4041j0087l5830j2463J6698M8116K5305j4400k3942l0656
14429b4925N478L4240k77j861R075j769J1548N559K8983M800l4323r034j1332
14416A6162l933K18j0048k8515L600J7321K7447R143j8638n0528n041K6778O271
14403i763K1702P133l6735J7215L6955j509R042r640l6641k1340J2834r282k4966
14390d4995j2165N337P32K0284O993l3539k7964K3664Q560J2017n771J3930K6929
$$ y = [16554, 16443, 3644, 5018, 50371, 38740, -13358, 12316, 28204, -14875, -50431, -48721, -40702, -27294, -12625, -16639, -39515, -44399, -64661, -57406, -25185, -2462, -4357, -21293, -40447, -34154, -12632, 30035, 54792, 114624, 132799, 76398, 31497, 57443, 84860, 70092, 25556, 37780, 72080, 83223, 46375, 12334, 2247, -33583, -46046, -29348, 18768, 44073, 29673, 5731, -24925, -19447, 14793, 14516, 12655, 21730, 19961, 31509, 37068, 66051, 70851, 36528, 27494, 16162, 12229, 12447, 2399, -26116, -22516, -5195, 22252, 31395, 12757, -37771, -42812, -16034, -9763, 11939, 19072, -17663, -448, 36507, 34998, 44040, 34400, -2241, -23581, -10747, -20029, -44995, -57160, -51823, -51091, -30807, -23814, -57353, -85317, -61653, -53093, -41076, -46847, -32917, -5988]
14377e988k1803J2575J8116K0473k1649j1884J1662j9352p122j9138O014K7234
14365a0862K373J9230J6017j3500R856M586J2763m072o8896k2332K4873K2878
14353g086k3250O511J9807K6780K8606k4489o878j5088L879K7597r218l3947m4601
14340e1377L935K324k2322L0392L5811R225l2261l9302J2092L4131M1412M089
14328B8149k8483k9756j9692n063r358m73J2819K9417J0091K890J804Q769J6663
14315A7777m041k7679Q059J6696l508l0900r405L2790m01k0487l2545P548K0202
14302b5894l4192J188K5813O872K3928k965q722r052k0168k3001P104J4882P019
14289c7188J9917J4599J0803j1078k7133L640k71P226J2640J8428O597n422Q538
$$ y = [-5988, -27791, -15216, 2900, 23373, 1724, -10160, 1502, -17850, -24972, -44110, -38096, -10862, -8489, 10741, 26758, 13258, 23114, 27700, 40463, 36391, -32505, -54837, -29964, -7086, -30336, -23825, -4018, 22762, 51368, 26879, 20001, 4913, 8792, 36389, 27171, -6776, -51377, -47442, -45118, -67440, -37048, -1237, 7988, -24273, -63575, -51483, -17352, 24060, 28149, -334, -30090, -49782, -54845, -64203, -64676, -51857, -22440, -12349, -9459, -7655, 1114, 17777, 13736, -13943, -5884, 10812, 7304, -23596, -33001, -211, -612, -21099, -53644, -46096, -25894, -60086, -58898, -33085, -26213, -2285, -5250, -13972, -23024, -43192, -66193, -59089, -44207, -37188, -17271, -2672, 8131, -2947, -30080, -26440, -26711, -19485, -6845, 11583, 18180, 12758, 21296]
14276B1296j2224k7253j4343R607j2519J090K1613J4560J452L430l1981J0938
14264a4334K5846K4879j5575Q313l0106k7862K1365j692m920K3067J0534j2285
14252G230k5782O004M860j4105j0842R857N343j1613j8996L788L994J7452K3409
14239E99L5697M1370l8913k8605L5254l004j3024l2904P672J0072r080q496k4933
14226b8295J9861L6067M3832j303m1960P209l8825k3037K5635N617o818J7105
14214A5088Q415r773j9542P187J3330P164Q933J3002m7841k2387J0934k4330N466
14201c4354J4286K2819M9092J523l8395k3750r129l064o187J2688J5025n648R104
14188D010M050K151L85k4341N571j9037j0286J5473R051K8153K9580L816O494
$$ y = [21296, 9072, -18181, -32524, -22917, -35436, -34346, -12733, 1827, 3279, 6709, -25272, -14334, 11512, 36391, 20816, 29129, -977, -28839, -7474, -9166, -14086, 8981, 19515, 7230, -18552, -12548, -7688, -21793, -32635, -22778, -17435, -29048, -48044, -44256, -40262, -22810, 599, 36296, 77666, 38753, 10148, 45402, 42398, 29374, -3530, 4142, 14214, 5134, -3362, -28295, -8434, 27633, 71465, 70162, 28202, 35411, -3414, -26451, -816, 4801, -2017, 15088, 23503, 13730, -5812, 1375, 14705, 21869, 30802, 43804, -4037, -26424, -15490, -39820, -34354, -20068, 2751, 51843, 53366, 14971, -8779, -17908, -20972, -27159, -14471, 554, -5094, 4010, 8060, 10211, 10596, -13745, -8174, -27211, -37497, -22024, -12973, 15180, 44760, 48576, 55070]
14175E5070j834j1811j3182k6418K1650M0644n501m2738n0713k3405M912L2559
14163b0767O923N965m081n756L7789M412k165j4641l1610n025M4151R783M693
14150B9671K6549m744l0922k4406O97j2043k6412l7066j8017L219K4556L9684
14138b9234M2365J1281j2835Q378J5978k9606P369K2251P14J8557r748j2713J4815
14125D7572l2925l1466k4643m171l038L3510l0483m3734J9611L1761j9133j7199
14113g4338j2385P234L4635N871L002J0154P499K1393L106n799m2401K622r103
14100d8510k2058J4420K6308K0433J8067n4673n5789j8510J3329N3576J4158j2984
14088e2233l701P904r688j2731K7031L360n491k35K9891K4579j7893l3733j2098
$$ y = [55070, 53236, 41425, 28243, 1825, 23475, 64119, 58618, 15880, -34833, -58238, -53326, -20767, -13844, -7879, -11960, -17716, 20073, 24485, 22320, 7679, -23931, -28956, 15195, 24978, 29671, 56220, 51476, 20554, -3852, -3155, -15198, -41610, -78676, -96693, -93474, -68918, -29234, 13131, 24412, 11577, 19955, 35933, 6327, 13696, 35947, 36661, 55218, 45470, 32757, 47572, 14647, -16819, -41462, -45633, -48671, -15161, -45644, -89378, -69767, -38006, -57139, -74338, -86723, -79489, -44854, -38983, -35981, -25827, -18328, 3065, 6171, 372, -42029, -39407, -48510, -70568, -56148, -29840, -9407, 8660, -46013, -101802, -120312, -106983, -53407, -39249, -52233, -55934, -48030, -57718, -70449, -43418, -40058, -45549, -45784, -15893, 8686, -9207, -42940, -55038]
14075e5038L141K8557J5666J6139J0645j864J4638q822J0316L172j5803j6850
14063C897j0239J4193L41L380p2j7631J997M1818L8993K5626k1394m0056k1986
14050A8867p139O163j5022k7600J4959k6415L8865j3887q820K4378M1898j3491
14038C2756j1709j6234K3846k6018j1704M124L4228J8471j5571n137J6203k2885
14026B0370p420J7521L7009M279j8719K4229P77k8167k6024J439J7460J8330j7926
14013D3158l2580k0711j0096J3608J0412N031k6187Q888j752k68L467O500p952
14000h482l5989k1593K8821L7862l2811k1209l217J0957L1199J0283k4776j2011
13988d0966K8747j113l2953M3608M5302M563K6646n992l8645m068J010J867l8501
$$ y = [-55038, -51897, -23340, -7674, 8465, 19110, 17246, 31884, 23062, 33378, 36550, 20747, 3897, -6342, 7851, 8192, 11572, 11500, -6131, -4134, 37684, 76677, 102303, 80909, 40853, 18867, 11728, 17891, 2869, -24731, -9772, -36187, 2678, -11209, -20029, 4349, 46247, 32756, 21047, 4813, 28659, 2641, -9063, -4939, 29289, 47760, 32189, 27052, 43255, 20370, 12950, 30471, 67480, 71759, 53040, 77269, 78046, 49879, 23855, 25294, 42754, 61084, 43158, 10578, -10133, -20229, -6621, 3791, 8822, -17365, -8477, -10229, -10497, -7030, -530, -8482, -44471, -66064, -37243, 619, -32192, -53401, -56618, -45661, -14462, -4179, -28955, -40966, -12219, -13332, -46285, -2677, 42625, 47188, 73834, 67842, 29197, 25129, 26139, 28006, -10495]
13975a0495j2814J2492M777L030J4952m4811l6435q334j918L4462P784k2051Q744
13962e0617K0870l101j814J5793M31J2698m116m951K207j0330N90J1324J0067
13949i49p730j9791P905Q260J2029L5795J5136k7420K5212J0162J342K7874q500
13936G9325l8338j9648J3279Q524j1197k0096k7170j8963J247k0550J7155J1782
13924b4650J6609K029P755j257J2894J3251l4847l3070j7675m984J3801K9380
13912b0764K0718K7911r26k0577j8760N049K4512j3932j7908Q366K1288m572k9140
13899a8735k3575J6740L3020K4289k1052o454l1553J8799r133P460j2333O483
13887a6044J5484O707l3718p262J361J6731K5513J0910o176J5088L309k8734k68
$$ y = [-10495, -23309, -10817, -6040, -3010, 11942, -32869, -69304, -77638, -79556, -45094, -37310, -59361, -50617, -29747, -32848, -34662, -18869, -18438, -5740, -9856, -14807, -12600, -22930, -22340, -11016, -949, -8679, -28470, -20565, -12305, -276, 35519, 50655, 23235, 48447, 58609, 59951, 87825, 79325, 40987, 21339, 34618, 43142, 31945, 11849, -15321, -34284, -33037, -53587, -36432, -24650, -8041, -6012, 1743, 486, 13380, 26631, -8216, -41286, -58961, -63945, -50144, -20764, -46, 27865, 26939, 6362, -12398, -7349, 17163, 3231, -14677, -6311, 14977, 10405, -18735, -42310, -25570, 7450, 31739, 10687, 4233, -27320, -8521, -17654, -10194, -22527, -16044, -560, 6147, -27571, -34833, -33472, -16741, 8772, 19682, 13506, 28594, 31903, 3169, 2901]
13874B901M0570j7810l6276j0005J3191J8616o185k0728j662O902k6683k4635
13862f1804L5256K2203L850N683J3849J2180l164j8326J415k5511l6351J2646
13850c8074L3684j2269k6257R854k0082K782R024k7305N944K4515L9699k034p620
13837h139j468m340L9631P577p895R112O641j1667l1898q84M0067j7748j0997
13824G992K949k1019j7419m989J3003K1868K74J1725K8705q6293r834M5543L0749
13811B3254k5929q277J1432m099l1676K925K7233M9390l974k0708l1142j5545
13799b7116L5824K070j1834O65L6841K6858K048j575j8684k6214Q194n166J79
13786B2090k9644r429j3909j1670L4065R784J4671j9177m6891l7483J6278K6831
$$ y = [2901, 43471, 25661, -10615, -20620, -7429, 11187, 5002, -15726, -17388, -10486, -37169, -61804, -26548, -4345, -495, 5188, 19037, 31217, 28053, 9727, 11142, -14369, -50720, -38074, -4390, -16659, -42916, -33062, -53144, -50362, -41338, -68643, -62699, -38184, 1515, -519, -8139, -9607, -13947, 25684, 33261, 25366, 34478, 41119, 29452, -2446, -3330, 36737, 18989, 7992, 10941, -10078, -27497, -32486, -19483, 2385, 2659, 14384, 43089, -43204, -53038, -7495, 23254, -2675, -10952, 480, -3619, -35295, -32370, -5137, 44253, 40279, 19571, -11571, -27116, 8708, 10778, -1056, -391, 36450, 63308, 65356, 63781, 45097, 18883, 27077, 21911, 22090, -7554, -16983, -30892, -42562, -8497, 1287, 15958, -3219, -50110, -87593, -71315, -44484]
13774d4484j9827J5766J2332j0630N3827K9572j5432k7768j58P520k1536j1323
13762c2141K4418K7262k3187N003J6859J851q805J1256l3003j1059L703k1063
13750c8906j2835Q369J9353j1927M079j4193Q524M0289J0652r232k7906l4369
13738e8102j210M8441j352K5416M8270M023J3551k0349n0008l5877J7745N364
13726d088P819M0156J5167j8235m244j8125J913k3022p136N953J355J5396m217
13713H692j1173l801l514p373l0228K111M2937K0900M026o949k7983r353J0661
13700a1047j3247L6291r947o70m724J3191J1928k0816N284J0960n346l4425M201
13687a8367o362J9123L4935J7423L299k2554m3337k8370q95j7926j0083N1840
$$ y = [-44484, -64311, -48545, -36213, -46843, 6984, 36556, 21124, -6644, -6802, 718, -20818, -32141, -7723, 19539, -3648, 1355, 18214, 20065, 11260, 22516, -10487, -21546, -17843, -38906, -51741, -43372, -24019, -35946, -31867, -46060, -37536, 2753, 13405, 4173, -23733, -58102, -59312, -10871, -12223, 13193, 61463, 65486, 79037, 58688, 8680, -27197, -9452, -4088, 3731, 43887, 59054, 40819, 36575, 18450, 20363, -2659, -9795, -3842, -2487, 12909, 8692, -2481, -6282, -9796, -17169, -47397, -45286, -2349, 18551, 22577, 15628, -12355, -21708, -11047, -24294, 11997, 2050, 1380, -3344, 9847, 21775, 959, 6243, 17203, 11857, -22568, -18367, -24729, -5606, 29329, 46752, 50051, 27497, -15840, -44210, -45105, -63031, -73114, -21274]
13675b1274O2741l6491l745J5497k6051q444J451n538n250P990k2074q332n509
13662e5029J297K5471J3402q49n460K8395O809n045j3251j560l7339J49L246n462
13648d5226J1422J6525K8414K5673l2339k2495k8640j1382J2324J2219J0530J4020
13636h955J8481r23O289p985J3459l3462j4016N5972K774r659O88o375J4135k2557
13622G866j3712K8813j278j7451k2572o234J0569K1344R424k2737m2871j1863
13610f0702M4177K7540P897j8795J85L0592M42k5863p988K1075j6910J1581J4977
13597B8208j2235j1265k2028K702L0315l942j1508K425K3852L9955l3317k6678
13585F484q369J6679L0011k7321l0852N0969K0127n1753M89K3530N062O372n982
$$ y = [-21274, 41467, 4976, 1231, 16728, -9323, -17767, -16316, -21854, -27104, -19114, -41188, -49520, -55029, -53732, -28261, -14859, -15708, -21168, 7227, 14036, 8991, -4260, -5820, -43159, -43010, -39764, -45226, -33804, -17279, 11135, 36808, 4469, -18026, -46666, -58048, -45724, -33505, -22975, -8955, 9526, 8603, 14892, 6907, 20366, -13096, -27112, 28860, 31634, 21975, 22663, 16288, 30423, 7866, -5846, 22967, 21689, 4238, -18334, -24568, -13999, 7345, 16769, -5968, -48839, -60702, -16525, 11015, 18912, 117, 302, 30894, 31336, 5473, -2515, 18560, 1650, 13231, 28208, 15973, 4708, -17320, -14618, 15697, 11755, 247, 2672, 26524, 66479, 33162, 6484, -1885, 14794, 44805, 17484, -13368, 37601, 57728, 5975, 6464, 29994, 35056, 41428, 35446]
13572C5446J9661j9918k1995k3172K2955L5213J5919N130k6170k7675j515l9414
13560b5535k5461j9885R754L8365J5115J0456J0399j0049j4341L875q77L1758
13548B3574J6225K1102k0508j9654O121K5965k8413k0541M790k9162m923O0972
13536C5548J1991j0249k1094j0510J988J0070N712J9735k8013q892j2956j4055
13524b0725J159K4492L5862Q459j2415k5455O476J6277j2300j459L888l0267j8616
13511b4624o470K5831R408l7512q854L6906r907o735j5253p307N59R837J1354
13498b2767K6802J6339q047j9996j7407j8428M1912J4982j994r279P712K4228
13486C4057L1593l3666m9437j0174J3814K31k2843r535L1286K1294l4323m1107
$$ y = [35446, 55107, 35189, 13194, -9978, 12977, 48190, 64109, 69239, 43069, 15394, 13879, -25535, -50996, -70881, -61127, -22762, -7647, 2809, 13208, 3159, -11182, -7307, -8184, 23574, 39799, 60901, 40393, 20739, 26860, 52825, 24412, 3871, 8661, -20501, -25424, 35548, 47539, 37290, 16196, 5686, 7674, 17744, 23456, 43191, 15178, 6286, -6670, -20725, -19566, 4926, 40788, 49247, 36832, 11377, 17853, 34130, 21830, 20371, 24259, -6008, -24624, -31094, -5263, 4145, -33367, -42221, -5315, -15222, -21957, -37210, -44517, -43958, -34121, -22767, 4035, 20374, 12327, -7669, -25076, -43504, -1592, 13390, 11396, 2117, 9829, 34057, 65650, 31984, -17453, -27627, -13813, -13582, -36425, -45960, -14674, 6620, -27703, -68810]
13474f8810J1813L707J8588K0774j856Q748L3047J4193J6120j5113m5498j6628
13462b0915O88J1456j2830N533J1792K9928K1650J5426q612l1359K274N899j8315
13449A2615K5817q135l0133K0906m572j1542j7161N30j4895J2187Q802J0573M714
13436I706j1530k3137k1791J8706J9029J1901K7218l0730q255O593J244J0442
13424I396K5851J7485j7463K5812J9516r067k6018l7268l5974J5662k4399m2581
13412g9048J6465K9102K0488K3324j76K6854j014l007K5590j0534k3303M599p361
13399B1979k8852L764J1009M187J2529J4805p220l6085k315M5198q468k9516O244
13386G259m324j3887r487M0950K4279j00k7021p362L3775n724N634K0679l171
$$ y = [-68810, -56997, -53290, -34702, -13928, -15784, -7036, 26011, 40204, 56324, 41211, -4287, -20915, -20227, -8771, -21601, -16068, -4276, 25652, 47302, 62728, 54116, 22757, 25031, 30930, 12615, 38432, 30297, 164, 21070, 16498, 4956, -12205, -11675, -26570, -14383, -5581, 4992, 9706, -1824, -24961, -46752, -28046, -9017, 2884, 30102, -628, -8883, -2290, -1046, 9396, 35247, 52732, 35269, 61081, 80597, 71530, 45512, 8244, -27730, -12068, -36467, -79048, -62583, -33481, -12993, 10331, 10155, 37009, 35995, 32988, 58578, 48044, 24741, 29340, 21979, -6873, -3109, 7900, 12087, 24616, 39421, 32201, -3884, -6199, 38999, 30531, 1015, 7259, 2935, -10952, -20439, 20511, 44790, 44690, 17669, 10307, 44082, 38358, 43992, 64671, 61500]
13373F1500k1645J9537J2489j2098j3644J1161j5676j994J0733L623K310J8158
13361G4454R875l2741l9142K3086j4713k2660J5553j5635L081k2178l6665L5847
13349b1838M7438j1567j0787N124J43l958l794J232Q94O29K1374J0586k6277n486
13335C713K2985j2980m98j0902j5836m346K1941N829k8737N981M3351J7087o262
13322D1326o347J5605k1051j7101J2802k877P488j9054M340R376J8805R42q136
13309C6118k531K120m153J7246j6348P128Q476n0421j6480K2437q167J5437L6273
13296D7135K0162j1152K001j1252m0469m9094j892K1310M2924O744m681L163r758
13283A5141J323J967j6970j3395k6764L0140J7365M3909K6482l8181O227K0409
$$ y = [61500, 39855, 59392, 71881, 59783, 46139, 57300, 41624, 39630, 50363, 53986, 56296, 74454, 84329, 51588, 12446, 35532, 20819, -1841, 13712, -1923, 1158, -21020, -57685, -21838, 25600, 14033, 3246, 8370, 8513, 4555, 761, 1993, 2887, 3516, 24890, 35476, 9199, 3713, 26698, 13718, 13220, 2318, -13518, -17864, 4077, 9906, -18831, -12850, 30501, 47588, 41326, 34979, 50584, 29533, 12432, 25234, 22357, 29845, 10791, 15131, 24507, 43312, 44254, 36118, 33587, 35707, 31554, 48800, 32452, 39580, 48056, -2365, -18845, 3592, -4575, 10862, 47135, 67297, 56145, 58146, 46894, 6425, -42669, -44561, -23251, 19673, 26417, 21736, 24899, 15141, 16464, 18431, 1461, -11934, -38698, -8558, 8807, 52716, 79198, 41017, 47244, 67653]
13271F7653k2339P950K190k824o75j7881j9794o604J2064L4926k797J8541l59
13258G0051k7809k7734K9550K6531k1263j9771J1579O450J0677l1480n818J1049
13246C2012k8266k5440K1190L3239L8331Q582j0135k6927m1840j7558k4094K9192
13234a1714M347O495k7478K4101O272J8439L3561N0614J7537r202m922k5059k5446
13221E7545l6516j6630p227k172J8263L7531K494j0095o913p146j0255K1870p906
13208C2843r209m446J793j3540m912j0409J4228J2423K321J0517j2585l390N474
13195B1108Q80k2215j6637K844J6256M3399p879l3219K5302O0032J4105j7557
13183H6419k1072P401Q335m3647K113L3293j1116n0680r508J5242J2408O916j0791
$$ y = [67653, 45314, 53264, 55454, 52630, 51955, 34074, 14280, 7676, 19740, 54666, 51869, 70410, 70051, 42242, 14508, 44058, 70589, 49326, 29555, 41134, 47584, 58261, 26781, 20963, 32012, 3746, -21694, -504, 32735, 71066, 79648, 69513, 42586, 746, -16812, -40906, -11714, -7367, -872, -28350, -4249, 2023, 20462, 54023, 104637, 122174, 112972, 108050, 82991, 57545, 21029, 4399, -2828, -5000, 13263, 50794, 53288, 43193, 36280, 29134, 18879, 40749, 32843, 23634, 19188, 20981, 7441, 2529, -7880, 6348, 18771, 21092, 31609, 19024, 15634, 21108, 21988, -227, -16864, -14020, 2236, 45635, 37756, 4537, 29839, 89871, 103976, 86419, 65347, 72748, 81083, 37436, 39549, 72842, 61726, 11046, 1538, 16780, 29188, 36104, 25313]
13170B5313j6187n467j3681K4181J9818K7370j1110j8738j4284n690K2872j862
13158C2535k053J6917J4144k4955k5711j4504K101K2622K5980J1781K6918k7340
13146E8435k9941L6436K6797n241k3931l0982J3070L6550n13k7072p344M2520
13134H8784J8352j693k4881m125J2144O017J1956R34J434J7573L5863M4312K6786
13121B33456L2686J8391N8714Q2042P5601J73937K19992K73548L68404M10790
13111A947561L06229J40862j05651k77887l25203l66592l08253k12268j55969
13102F42829j10673r1366j08347p9648m4708N233O445k7549l0489k2341l8415
13091A00971r809K625J2664L896K8770l5498q0497j0481Q759N707j1575K4987
$$ y = [25313, 9126, 3659, -10022, 14159, 33977, 61347, 50237, 31499, 17215, 11525, 34397, 32535, 30482, 47399, 61543, 36588, 10877, -3627, -1526, 21096, 47076, 58857, 85775, 58435, 28494, 64930, 91727, 86486, 62555, 31573, 44643, 81193, 80680, 53608, 46264, 88784, 107136, 105443, 80562, 76437, 88581, 94598, 106554, 107488, 108922, 126495, 162358, 206670, 233456, 266142, 284533, 343247, 425289, 500890, 674827, 894819, 1168367, 1536771, 1947561, 2253790, 2394652, 2289001, 2011114, 1685911, 1319319, 1011066, 798798, 642829, 532156, 440790, 332443, 252795, 208087, 213320, 219765, 192216, 161727, 139386, 100971, 91162, 93787, 106451, 110347, 139117, 103619, 23122, 12641, 21400, 27107, 15532, 40519]
13079D0519L561K748j6966K0821O464j7527N184j8895k2728M260K7884L1885N962
13066G3172J7711J2981R779N1762J9568k3158j3255j3474L903J867r927q847J0263
13053A32345J0204j7540J4974O0097L9531o4601n0096L920l5660l3850p711P043
13041E8656L50M2133k056m4987j965J6613J2546m772J1660R339l932p125k1301
13028F5159K394L0467L0351J8167K0799K5986P485N3012P1058Q2247M0361j5047
13016D32439K0632l9928q2196q8323l4285k8661o623O496J4879l0249J0783N1537
13004B26501J126k156P6997O2731M4730Q2853R4897P1689M8359R9017J35025K60289
12992A202058L85310N19638P02000Q85188Q07530K66688l53260n82945o36489
$$ y = [40519, 44080, 46828, 29862, 50683, 57147, 39620, 44804, 25909, 3181, 7441, 35325, 67210, 73172, 90883, 103864, 113643, 165405, 184973, 161815, 148560, 135086, 138989, 140856, 130929, 122082, 132345, 142549, 125009, 139983, 200080, 239611, 175010, 124914, 128834, 93174, 59324, 51613, 58656, 59006, 101139, 99083, 54096, 52131, 68744, 81290, 76518, 88178, 97517, 93585, 86460, 65159, 67553, 98020, 128371, 146538, 167337, 193323, 200808, 253820, 324878, 407125, 447486, 432439, 453071, 413143, 330947, 242624, 208339, 179678, 173055, 179551, 194430, 164181, 174964, 226501, 227627, 225471, 302468, 365199, 409929, 492782, 587679, 659368, 707727, 806744, 941769, 1202058, 1587368, 2107006, 2809006, 3694194, 4501724, 4768412, 4415152, 3832207, 3195718]
12983C195718o90228n86611m28614k90581k24178j66653j12937r4542q6279M556
12973E19651K5091p210k721o3661r9717q8998p8451n7281L3251R677k6289R942
12961A73284J7654K649l6717j1584n5621k8956N637M5263R794j1661k1537j8432
12949F9773K234K8785J4980j3300l7192j3345J2857K2255k2133k0616O419J8396
12937F9113q320k0128J0439k5286L8614R7142O0080K6123N7370Q2872L9860j1790
12925D16089j3391p7004o0999j8271n8891l5928n863P219k3406k4124l0167j2438
12913F2826L3449p362l3036k0615l354q521K4817k224K0524J552L09L0163m3664
12900E4864J5643N4965J6382l9215k0722K0392M5161R057J6299m826m9079k3874
$$ y = [3195718, 2505490, 1918879, 1490265, 1199684, 975506, 808853, 695916, 601374, 515095, 519651, 544742, 537532, 534811, 471150, 371433, 282435, 203984, 146703, 179954, 189631, 163342, 173284, 190938, 193587, 156870, 145286, 89665, 60709, 66346, 111609, 121403, 109742, 88205, 69773, 72007, 100792, 115772, 102472, 65280, 51935, 64792, 87047, 64914, 44298, 50717, 69113, 60793, 40665, 51104, 25818, 64432, 161574, 221654, 247777, 305147, 388019, 427879, 416089, 402698, 325694, 264695, 246424, 187533, 151605, 145742, 152961, 129555, 105431, 75264, 62826, 96275, 88913, 55877, 35262, 31908, 23387, 48204, 45980, 66504, 68056, 68365, 98528, 54864, 70507, 125472, 141854, 102639, 81917, 102309, 147470, 156527, 172826, 168000, 118921, 95047]
12888I5047K2173j5159j8479j1346K7904M4173L2686M119l1196q398j1512r872
12876A20140o901J6483N8375L1245j4251j3038j6710R606J2231j4796n6387j1603
12864A14394j5604n614J771k9237l1897N076N087k0364j3502J7675k100k1933
12852C752O22j3081J4462j0531J2858K4848j321J5634L4872J068J7600k1736k2144
12839E6903K1838J9196j59J5270J153j1242k102N748j8154n1957r3391o4430p892
12826a29219K5282N6053L4581K0435K1778n189r859n844L1616J5910K5001k5551
12814E4994n927K8687k5864m0925L497j0579K3125M4892K465Q608L3538O6324
12802A82835J00594Q9266P0715P8753N4499m9358n018J8580m7719j8002j1435
$$ y = [95047, 117220, 102061, 83582, 72236, 100140, 144313, 176999, 181118, 149922, 141524, 130012, 120140, 113239, 129722, 188097, 219342, 205091, 192053, 175343, 184949, 197180, 182384, 125997, 114394, 98790, 93176, 94947, 65710, 33813, 38889, 43976, 23612, 10110, 27785, 25685, 3752, 4374, -8707, 5755, -4776, 8082, 32930, 31609, 47243, 82115, 83183, 100783, 79047, 56903, 78741, 97937, 97778, 113048, 114201, 102959, 100857, 106605, 88451, 36494, -56897, -121327, -129219, -103937, -47884, -13303, 7132, 28910, 23721, 13862, 8018, 39634, 55544, 80545, 54994, 49067, 77754, 51890, 10965, 14462, 3883, 27008, 71900, 74365, 82973, 116511, 182835, 283429, 372695, 443410, 522163, 576662, 527304, 522286, 540866, 493147, 475145, 463710]
12791D63710o5870p488k1139n1745q480p546J2080M8932K8072O357l087k0309
12779C73487l0536n528j5210K5650K5533j9775j2468r181K1302k6471k8950L1047
12767C28900K7247J0968n921K17R687K6258M235K0740L2398l7994k9234j6990
12755C70511K4964O3344J7710J2140l493L0761K9672J8330K5040q634J3238J695
12743E95278J4309N8608P3586O8910M3383L683n319N5329M8016L8861P0008N6190
12731A120842N4332K6943J5746L7082M568O869L7686O2307R8550Q4780P9719J19688
12719A749112J39586J02019Q4946P2680Q9058P2963J15315J32399J35935J49302
12709B843315J77921K24251K31415K53387K55200K73800K79431L49090L43594
$$ y = [463710, 397840, 390352, 369213, 317468, 308988, 301442, 313522, 362454, 390526, 396883, 393796, 373487, 342951, 337423, 322213, 347863, 373396, 353621, 341153, 331972, 353274, 326803, 297853, 328900, 356147, 367115, 361194, 361411, 371098, 397356, 401591, 422331, 454729, 416735, 387501, 370511, 395475, 458819, 476529, 488669, 485176, 515937, 545609, 563939, 588979, 580345, 593583, 595278, 609587, 668195, 741781, 810691, 854074, 857757, 852438, 907767, 955783, 994644, 1064652, 1120842, 1175174, 1202117, 1217863, 1254945, 1259513, 1266382, 1304068, 1366375, 1464925, 1549705, 1629424, 1749112, 1888698, 1990717, 2075663, 2148343, 2237401, 2310364, 2425679, 2558078, 2694013, 2843315, 3021236, 3245487, 3476902, 3730289, 3985489, 4259289, 4538720, 4887810, 5231404]
12700E231404L62793M07431N00716O34832P19000Q36932R92916J079307J234301
12691A1999632J482460J774931K187569K767955L558799M490354N630271P009986
12683D0901957Q799484J1429153J5453334K1778663L1529892M5855338O5298696
12676B41046517Q6027005R1138837N9333289M174877m3995454o6769758p2481669
12669B98473644p0128902n8545373m2226481k8502613j9349910j3759634j0299848
12662E5660883q089679o596482n465473m576354l795541l141736k631348k254334
12654A9109936j925982j659442j424418j191560j027759r08981q70729p71322
12646I329743p14834o53237n98536n23115m25538l90865l32615k93456k72097
$$ y = [5231404, 5594197, 6001628, 6502344, 7137176, 7856176, 8693108, 9686024, 10765331, 11999632, 13482092, 15257023, 17444592, 20212547, 23771346, 28261700, 33891971, 40901957, 49701441, 61130594, 76583928, 98362591, 129892483, 175747821, 241046517, 327073522, 418212359, 477545648, 481720525, 437725071, 370955313, 298473644, 228344742, 169799369, 127572888, 99070275, 79720365, 65960731, 55660883, 47571204, 40974722, 35509249, 30932895, 27137354, 23995618, 21364270, 19109936, 17183954, 15524512, 14100094, 12908534, 11880775, 10971794, 10101065, 9329743, 8614909, 7961672, 7363136, 6840021, 6414483, 6023618, 5691003, 5397547, 5125450]
12637E125450k46055k37082k36661k48700k56076k22910j99009j73122j58007
12628C147828j33616j23948j12438p8949p3138n7895q6494j08336j08853j10403
12618B153758j11817o6329k9155n7985p0571p7883o0136o0322P807P666R992j2023
12606A633002l0481m7719m3670j3875o8064n7529n0162l6874o1371j5383J930
12595A209804j0062k2861m7441m1913j5740J0801K623m3380n27J8911J5262k8741
12583A046736l3661j207J312J9090l7141j4130O445m0652j112J2469N51L6267
12571I94967L6442O3644P0575J12430J28407J85206K76193M02482N61785O04008
12561C436139M80381J56565k14926m04869m81326n32168m47340l00577k39677
$$ y = [5125450, 4879395, 4642313, 4405652, 4156952, 3900876, 3677966, 3478957, 3305835, 3147828, 3014212, 2890264, 2777826, 2698877, 2625739, 2567844, 2481350, 2373014, 2264161, 2153758, 2041941, 1975612, 1946457, 1888472, 1817901, 1740018, 1679882, 1619560, 1627367, 1635033, 1645025, 1633002, 1602521, 1554802, 1511132, 1497257, 1429193, 1371664, 1321502, 1284628, 1223257, 1207874, 1209804, 1199742, 1176881, 1129440, 1087527, 1071787, 1082588, 1085211, 1041831, 1041304, 1060215, 1075477, 1046736, 1013075, 1011868, 1013180, 1032270, 995129, 980999, 987444, 946792, 945680, 958149, 958700, 994967, 1031409, 1095053, 1165628, 1278058, 1406465, 1591671, 1867864, 2270346, 2832131, 3436139, 3916520, 4073085, 3858159, 3453290, 2971964, 2439796, 1992456, 1691879, 1452202]
12552A452202j55549p6683l3687r010m5413q6077j1177m9980l2944q446m931m4008
12540H94297n6810l8665n2077l0486k9037k3843J1150j5590j4943l7942j5577
12529E90477K0623J1575l1742l0375M0854K8196L1642P0106L7542M628l5556n7387
12517F80583p6026r4121n2761j5520o470k3251j7287P2796K4736k8171k8836Q738
12505D44410M0344Q107m0606J0479K5715N908j0659j6533J234n94j3404p856K8438
12492D74983K7325l8055j7809r262N236L565M730M056L376r907o3534o6719p7004
12479B40981j9796J5690K8916J7584J360K469j7135J6169K3307j0697o415M0124
12467C32557P132k8192l5091l338l356r260K786N613K0193K946l4508k7880k079
$$ y = [1452202, 1296653, 1219970, 1186283, 1177273, 1131860, 1045783, 1034606, 984626, 951682, 943236, 938305, 894297, 837487, 798822, 746745, 716259, 687222, 663379, 674529, 658939, 643996, 606054, 590477, 611100, 622675, 590933, 560558, 601412, 629608, 661250, 731356, 768898, 773526, 737970, 680583, 604557, 510436, 457675, 442155, 435685, 412434, 395147, 467943, 492679, 464508, 435672, 444410, 484754, 492861, 452255, 462734, 488449, 494357, 483698, 467165, 468399, 467805, 454401, 446545, 474983, 502308, 464253, 446444, 437182, 442418, 445983, 450713, 454769, 458145, 448238, 384704, 317985, 240981, 221185, 236875, 265791, 283375, 284735, 287204, 270069, 286238, 309545, 298848, 292433, 332557, 339689, 311497, 276406, 273068, 269712, 260452, 263238, 268851, 289044, 291990, 257482, 229602, 227523]
12454B27523L3807Q362m964R441j15K8651K2814k8205J0184L0415k3703P325K2359
12441C43894J0074J8423l824k665k3864l1554j7467J239J1864N3220J2757j7983
12429C54114P640J4060J1731j7398j7327p606m698J3422q650M1573o518j8675
12417C61668J3146m4m748l9317k7986j2378J1574L3349J2812P546R479j0489p537
12404C47075n0413j0142k5617Q608k018N8260K6706J7354J9546J8691m8630l4726
12392C24694j6571k3638n344k1776m685J2727J2147J0380M1474L0665M719o265
12380C58527M500K1952j0275j4642k1810j998J6274K3739m4541n828N0876m0944
12368C35830r4436m4328n1766m0340J4753J2369k348J2116l269j814k0267k3567
$$ y = [227523, 261330, 269692, 264728, 274169, 274054, 302705, 325519, 297314, 307498, 337913, 314210, 321535, 343894, 353968, 372391, 368567, 365902, 342038, 310484, 293017, 294256, 306120, 359340, 372097, 354114, 361754, 375814, 387545, 370147, 352820, 345214, 340516, 353938, 345288, 386861, 380343, 361668, 374814, 374770, 370022, 330705, 302719, 290341, 301915, 335264, 348076, 355622, 365101, 354612, 347075, 296662, 286520, 260903, 269511, 267493, 325753, 352459, 369813, 389359, 408050, 359420, 324694, 308123, 284485, 279141, 257365, 252680, 265407, 277554, 287934, 329408, 360073, 364792, 358527, 363027, 384979, 374704, 360062, 338252, 336254, 352528, 376267, 331726, 325898, 376774, 335830, 241394, 197066, 145300, 104960, 119713, 132082, 129734, 141850, 138581, 136767, 116500, 92933]
12356I2933Q845O8120R082J5420K2126J8503J3076j3787J1457J3725J5529L070
12344B78099j6379r352j4117k5141J9764Q761P87n473q244J9408K5847L0571O657
12331C11188K0024k7676n485K2058l841q446j8632p95M1543j2213m7203J3648
12319B84170L8587K0752M0666M403l6189k7565P55R938j6803m812R009k599J0651
12306C30963k8376L169M7870K579l682j6736R101p890o499o065K6557j6897k859
12293C31235l660K3137q353L2009J1764P115j0846l1616k8805j979K22j3643o543
12280C00037J2634L525K1435J5678J2265L205j519k187m69J810J4973R093J6009
12267D06489k5228j3068L5506j3449j620K0999j259k1176k1379J8349o454K5599
$$ y = [92933, 101778, 169898, 178980, 194400, 216526, 235029, 248105, 234318, 245775, 259500, 275029, 278099, 261720, 252368, 238251, 213110, 232874, 241635, 242422, 236949, 228705, 248113, 273960, 304531, 311188, 331212, 303536, 298051, 320109, 316268, 307822, 289190, 288395, 329938, 317725, 270522, 284170, 322757, 343509, 384175, 388578, 352389, 324824, 325579, 335517, 318714, 313902, 322911, 320312, 330963, 302587, 305756, 353626, 356205, 352523, 335787, 344888, 336998, 330499, 324434, 350991, 334094, 331235, 327575, 350712, 342359, 374368, 386132, 393247, 382401, 350785, 321980, 320001, 320223, 306580, 300037, 312671, 316196, 337631, 353309, 365574, 368779, 367260, 365073, 364604, 366414, 381387, 390480, 406489, 381261, 368193, 403699, 390250, 388630, 409629, 408370, 387194, 365815, 384164, 377710, 403309]
12255D03309K4927o406q893M865P859j6678j5958K5590K9174j2484R205K7703
12243D72213M7319K8594J9912O4799J24085J09627R3431J15572J66622K28221
12233A470395L54931M05553L52570J67367m0415k30554l05565l27674k81660k72336
12223A292612j79095j24217q9509p9447p1980l8111m6989l1501k7096k2018k1651
12212E60998j1519O207j8848O899m649j2568L3578K4425m0034j3284J5516N832
12200E52553k0802m7343J2784K9879M45M03j0253k5569j306K6952N698K7260k0973
12187E29728O86R106O641L9783K4308j0339j245j6402K537K8982j3694k3019Q026
12174E85098J7046N287j8516k2121j151o661J0159J2939K4547K4633P80q39P305
$$ y = [403309, 428236, 421830, 412937, 417802, 425661, 408983, 393025, 418615, 447789, 435305, 444510, 472213, 519532, 548126, 568038, 632837, 756922, 866549, 959980, 1075552, 1242174, 1470395, 1825326, 2230879, 2583449, 2750816, 2710401, 2479847, 2174282, 1846608, 1564948, 1292612, 1113517, 989300, 899791, 820344, 748364, 710253, 663264, 631763, 604667, 582649, 560998, 549479, 555686, 536838, 543737, 539088, 526520, 560098, 584523, 544489, 531205, 546721, 552553, 531751, 484408, 497192, 527071, 527516, 527919, 517666, 492097, 490791, 517743, 523441, 550701, 529728, 530414, 539520, 546161, 585944, 610252, 599913, 598668, 582266, 584803, 613785, 600091, 577072, 585098, 602144, 607431, 588915, 566794, 565643, 558982, 569141, 582080, 606627, 631260, 632040, 631201, 638506]
12161F38506k2081n332R61J8132J5332L319j8946O970P898J5052J977P11L6651
12148F99150Q675o28r883P448K5924L4101j4277O72l2708L657R667L3785m876
12135G60707j657j2422o893R58L2685J6368J8667K3882m693q72j262Q403J9956
12122H53827j3068l2412K9380K9018l2833p073J1028R710Q110r477l917j1634
12110H30659k047K7867J7303K1980J0115Q17L8345K7386j3747l8557J6587K1504
12098I58212N5461J7434N565k2202K5763J3741l4339O72J8342L642l316L2489
12086A071464O5479j6898k7038N092K4938K7279O897q620L495j0088K2495M4093
12074A208588L3476m533J3850K0478k0660L630M6817j519n284j1766J8118P685
$$ y = [638506, 616425, 611093, 612054, 630186, 645518, 648837, 629891, 636861, 644759, 659811, 661788, 662499, 699150, 707825, 707197, 697314, 704762, 730686, 764787, 750510, 751182, 718474, 722131, 731798, 765583, 760707, 759050, 746628, 739735, 740693, 773378, 789746, 808413, 832295, 827602, 826730, 825468, 833871, 853827, 840759, 808347, 837727, 866745, 833912, 826839, 837867, 847577, 855687, 846210, 842293, 830659, 828612, 856479, 873782, 895762, 905877, 906694, 945039, 972425, 958678, 920121, 936708, 958212, 1013673, 1031107, 1036672, 1014470, 1040233, 1053974, 1019635, 1020307, 1038649, 1042291, 1038975, 1071464, 1136943, 1120045, 1093007, 1098099, 1123037, 1150316, 1157213, 1148593, 1152088, 1142000, 1164495, 1208588, 1242064, 1237531, 1251381, 1271859, 1251199, 1254829, 1301646, 1300127, 1294843, 1283077, 1301195, 1308880]
12062A308880K8758Q678m69J5386J8947K4023N4982L8433O379k2485k1211N533
12050A465834L6994L6090M0331J9050N519N825K2334J8876J7433N530N8813K9161
12038A761790J51J4321L654j6282l221j1815L1272M1605K6435J5636K6851N2119
12026A942516J757K6221P4108M2354l2857j9467K6705K0126k48J8473J7793N9909
12014B177390K3737j8515M665O946L8726N4112L2213Q958M207K280K6194J5213
12002B376126O045L3676N0867K6732L1741p245J8872L5773N104Q333K0606J6123
11990B622753K0871O304K349J2621K4168L0720K8679K4022J320p16L7045L10J2607
11977B823053K3001o376L8165N5111M0765J2357L986K3476M2016M0375j4175k1765
$$ y = [1308880, 1337638, 1346316, 1345847, 1361233, 1380180, 1404203, 1459185, 1497618, 1503997, 1481512, 1460301, 1465834, 1502828, 1538918, 1579249, 1598299, 1603818, 1609643, 1631977, 1650853, 1668286, 1673816, 1732629, 1761790, 1761941, 1776262, 1779916, 1763634, 1760413, 1748598, 1779870, 1821475, 1847910, 1863546, 1890397, 1942516, 1944273, 1970494, 2044602, 2086956, 2054099, 2034632, 2061337, 2081463, 2081215, 2099688, 2117481, 2177390, 2201127, 2182612, 2187277, 2194223, 2232949, 2287061, 2319274, 2328232, 2332439, 2334719, 2360913, 2376126, 2382171, 2415847, 2466714, 2493446, 2525187, 2517942, 2536814, 2572587, 2577691, 2586024, 2606630, 2622753, 2643624, 2649928, 2652277, 2664898, 2689066, 2719786, 2748465, 2772487, 2773807, 2773091, 2810136, 2810446, 2823053, 2846054, 2839678, 2877843, 2932954, 2973719, 2986076, 2990062, 3013538, 3055554, 3095929, 3081754, 3059989]
11965C059989j2908J9371N1290M1986o131o267K4349L1656L4450k3741j3531K8791
11953C229304M003K8009J6737j6830l0173m4733J1941L1792K2800J7651k248o05
11941C267648J429K0517m28l0257j1196r178J4698K7864J7054K3119j3257l1009
11929C277004k9286P867M0294M1485k9198k0347k857j0553p2151j3105K6673M1559
11917C257385j9736m5283n2128j261M903K877L612l8311j3900j3236k5740n0987
11905C008195r501k8669l4779l1348L754K0674n971n1821o0035J754J3379N349
11893B830981j1535j4206J0431j3725l3732m8651l0104l5533j7119L6789k271
11882B671325n2414m1739l1315J2868k2770o0351m0764k7061O037l2709l957q531
$$ y = [3059989, 3047081, 3066452, 3117742, 3159728, 3153597, 3147330, 3171679, 3203335, 3237785, 3214044, 3200513, 3229304, 3233307, 3261316, 3278053, 3261223, 3231050, 3186317, 3198258, 3230050, 3252850, 3270501, 3268253, 3267648, 3269077, 3289594, 3289166, 3258909, 3247713, 3238535, 3253233, 3281097, 3298151, 3321270, 3308013, 3277004, 3247718, 3255585, 3295879, 3337364, 3308166, 3287819, 3284962, 3274409, 3202258, 3189153, 3215826, 3257385, 3237649, 3192366, 3140238, 3138977, 3143880, 3146757, 3150369, 3112058, 3098158, 3084922, 3059182, 3008195, 2998694, 2970025, 2935246, 2903898, 2907652, 2928326, 2922355, 2870534, 2810499, 2812253, 2825632, 2830981, 2819446, 2805240, 2815671, 2801946, 2768214, 2719563, 2689459, 2653926, 2636807, 2673596, 2671325, 2618911, 2577172, 2545857, 2558725, 2535955, 2475604, 2434840, 2407779, 2413816, 2381107, 2377150, 2368619]
11870B368619j4704O614j0116j2353m8349k0149P909m5357l6771j1730n25m3394
11858B139694k2867l1848J4993N275k5150J2328l6662m0991m3069k8937J118r780
11846A934104Q737k2221l7474k7942m8746R518J8738j1851k3891n2413n5727l7770
11834A653062r469J0801k6756j3564M203J2668m596j1084p9688k6608M3084l0957
11822A521096o7541j3135j351m1735J5335J4348J741k3643n222k1786k0467L7
11810A357677J7003p403k5529Q877k2113l4888m2143k4084P392k5883j4018P193
11798A202081j5181L8854j1922o3603j9883m23k0091o430q82m5950n607j1530
11786A039433J4143j341l3149k0886o322L2568P729j1340k2200r187j5784l555
$$ y = [2368619, 2353915, 2360529, 2350413, 2338060, 2289711, 2269562, 2277471, 2232114, 2195343, 2183613, 2183088, 2139694, 2116827, 2084979, 2099972, 2105247, 2080097, 2092425, 2055763, 2014772, 1971703, 1942766, 1943884, 1934104, 1942841, 1920620, 1883146, 1855204, 1806458, 1815976, 1834714, 1822863, 1798972, 1746559, 1690832, 1653062, 1643593, 1654394, 1627638, 1614074, 1618277, 1630945, 1626349, 1615265, 1535577, 1508969, 1552053, 1521096, 1453555, 1440420, 1439069, 1397334, 1412669, 1427017, 1428758, 1405115, 1399893, 1378107, 1357640, 1357677, 1374680, 1367277, 1341748, 1350625, 1328512, 1293624, 1251481, 1227397, 1234789, 1208906, 1194888, 1202081, 1186900, 1225754, 1213832, 1150229, 1130346, 1129923, 1109832, 1103402, 1102520, 1056570, 1050963, 1039433, 1053576, 1052235, 1019086, 998200, 991878, 1024446, 1032175, 1020835, 998635, 989448, 973664, 970109]
11774I70109j1656j8353k4474J0584L906K5376K5413l7258j6223L888m0080j2805
11762H78427K488m4309Q534K4519j4056k9715r431K177k1866j4699q198M3770
11750H17641K3366k2405k4344j3311l0526Q25J7081O090l102j1319k1544j8817
11738G19635k0385k4447m9094j4258R042J5721K5479J0062J1183n673j5671n631
11726F55963J1044J1507k0720J8508J4971j9592m7120J70R19k7536j2398k360
11714E83356k2428P492L2791k956k2009l0677p072J6441O95r62R064k618j1665
11701E49452j073j1577j3782O677K2112k2939q344P502L8840j1718K0950j8129
11689E57971k0711R180l0554J9624K7505m2641m0737Q367N1441k4677m3817J220
$$ y = [970109, 958453, 940100, 915626, 926210, 930116, 955492, 980905, 943647, 927424, 931312, 891232, 878427, 880915, 836606, 845140, 869659, 855603, 825888, 816457, 818634, 796768, 782069, 773871, 817641, 841007, 818602, 794258, 780947, 750421, 751246, 768327, 774417, 771315, 759996, 738452, 719635, 699250, 674803, 625709, 611451, 620493, 636214, 661693, 671755, 682938, 677265, 661594, 655963, 667007, 678514, 657794, 676302, 691273, 671681, 624561, 624731, 625650, 598114, 585716, 583356, 560928, 568420, 601211, 598255, 576246, 545569, 538497, 554938, 555633, 554671, 563735, 561117, 549452, 548379, 536802, 523020, 529697, 551809, 528870, 520526, 528028, 566868, 555150, 576100, 557971, 537260, 546440, 515886, 535510, 563015, 520374, 479637, 488004, 539445, 514768, 470951, 472171]
11677D72171L914n4729K130N7251J0638J3064k7975q258K944k4417M447k9550
11665D21630l3600k3331j0820L5198n164k3842K4440J8823j7021J6954k6139l1210
11653C45918K8367m8314n0338K7570L6675J4754J1894m455o402K2242L6563J6986
11641D31460j1252j3969l734M576M467j5106k9096k0348j464L4658J1234m5487
11629C45939j9760p308j1222K275j0433J6319M59n657K0631K6932K0024j5708
11617C62491j4087j275j0042J1430L4727p48l9257k8579j4992J9766l0626J1404
11605C00212m126J7143m614l0466j3510q588k4797J5161L1830J1225L555k1203
11593B71822k2019n624L3737p210l228K6683K4265l649j8365J4812j3869k8618
$$ y = [472171, 476085, 421356, 423486, 480737, 491375, 504439, 476464, 468206, 471150, 446733, 451180, 421630, 388030, 364699, 353879, 389077, 383913, 360071, 384511, 403334, 386313, 403267, 377128, 345918, 374285, 325971, 275633, 303203, 339878, 354632, 366526, 362071, 355669, 377911, 414474, 431460, 420208, 406239, 402505, 407081, 411548, 396442, 367346, 346998, 345534, 380192, 391426, 345939, 326179, 318871, 307649, 309924, 299491, 315810, 316269, 310612, 331243, 358175, 378199, 362491, 348404, 347129, 337087, 348517, 383244, 382496, 343239, 314660, 299668, 319434, 288808, 300212, 296086, 313229, 308615, 278149, 264639, 256051, 231254, 246415, 278245, 289470, 293025, 271822, 249803, 244179, 277916, 270706, 267478, 294161, 318426, 314777, 296412, 311224, 297355, 268737]
11581B68737Q780K5016j5058L3899R474k8593l5056l803o354j8176l7621j3739
11569A87506o549J9334L0935R407m027J5865k203K4886R914o1605m1507m2836
11557A39120R050K6453K5342K1958p987l851j1833K1840O204k6206p067K3532
11545B16555j463K5837q005r591J0641l5715J1208L2524p244k5917r447l6309
11533A63074M3317L9507m005R490j8597l8j4108l293j3711o496j9466J7781K3507
11520B16962k0431j7322j7989j433n930K1158j7578j659L4420J4566K3136R91
11508B28891k5034J486J9675k8039k036m713j2927q30K32j0580k442L814j3147
11495A54350M04k904m504L1130j0672j9881J3340r846J412q318J7831J4874j856
$$ y = [268737, 277517, 302533, 287475, 321374, 330848, 302255, 267199, 263396, 257042, 238866, 201245, 187506, 180957, 200291, 231226, 240633, 236606, 252471, 250268, 275154, 285068, 223463, 181956, 139120, 148170, 174623, 199965, 221923, 213936, 210085, 198252, 220092, 226296, 200090, 193023, 216555, 215092, 240929, 232924, 223333, 233974, 198259, 209467, 241991, 234747, 208830, 199383, 163074, 206391, 245898, 241893, 251383, 232786, 232748, 218640, 215347, 201636, 195140, 175674, 193455, 216962, 196531, 179209, 161220, 159787, 153857, 175015, 157437, 155778, 190198, 204764, 227900, 228891, 203857, 205343, 225018, 196979, 194943, 190230, 177303, 176473, 176705, 166125, 163683, 167497, 154350, 154754, 151850, 147346, 178476, 167804, 147923, 161263, 151417, 152829, 144511, 162342, 177216, 175360]
11482A75360j5428m0803l1564P067O924J8232k538L6566M460P583r85k8304j24
11469A36446N943J5367P625m4882q845K1300k74J6273j7386l7548j3110O04M2360
11456A23873L8378K6370K880k6001m855l1379l1325J0905p587J4288p247j40L7659
11443A45819j006m0p615j6033p317j775j6691j6952Q757j4446J1973K833J1716
11430I9223J1237L4856m900m1184r095j2192M00P086N764K2034J5017k7860k2222
11417G8164R18J4618K6118k6201j0303l0221L178J4416K6323J6200m983J2451
11405A20678k230o769k2094j57J6259q248K1109j0933k786K1402J5126J1050j5039
11392A37368j6486Q774M257L95J728n827l5645K291L2982R362p717k1544L625
$$ y = [175360, 159932, 119129, 87565, 94632, 101556, 119788, 117250, 153816, 158276, 165859, 164874, 136570, 136446, 142389, 157756, 165381, 120499, 111654, 132954, 132680, 148953, 131567, 94019, 80909, 81513, 123873, 162251, 188621, 191501, 165500, 160645, 129266, 97941, 108846, 101259, 115547, 108300, 108160, 145819, 144813, 144773, 137158, 121125, 113808, 112033, 95342, 78390, 87147, 72701, 84674, 87507, 99223, 110460, 145316, 140416, 99232, 90137, 77945, 78345, 85431, 91195, 113229, 128246, 100386, 78164, 79082, 93700, 119818, 93617, 83314, 53093, 56271, 70687, 97010, 113210, 108227, 120678, 118448, 111679, 89585, 89428, 105687, 97439, 118548, 107615, 104829, 126231, 141357, 152407, 137368, 120882, 129656, 133913, 134308, 136036, 130209, 94564, 96855, 129837, 139199, 131482, 109938, 113563]
11379A13563K6563j914K3829q873j0732P586n250p213m0011n575j4307R347J4249
11366A01262k8763j7809j381J2353L742M8961J6259j5154R593l129j9521j6679
11354H9734j353j1845J1518l930J0212L7157q28o520l5573K190P994L4122p941
11341A24937l0230j929R132m5026k1431j5994L6679L7255P932N055m400k5312
11329G6668l7229n50J3291K1746J6885r298L343L164M442N587J0194l7501k4747
11316D5995J426J3715K0869j6684J229O2o566Q254o237j5111L534O97Q878n734
11302E4327j3129j4050j5302R974K5240J3777J9303J1999k3542o677j8341R718
11290E3297M4550N766j3274J8268J2418p95j1721r955j3265l2071j886j550L2076
$$ y = [113563, 140126, 138212, 162041, 153168, 142436, 150022, 144772, 137559, 97548, 91973, 77666, 87013, 101262, 72499, 54690, 53309, 65662, 69404, 118365, 134624, 119470, 129063, 125934, 106413, 89734, 88381, 76536, 88054, 84124, 94336, 131493, 130665, 124145, 88572, 90762, 98756, 132878, 124937, 94707, 92778, 101910, 56884, 35453, 19459, 56138, 93393, 101325, 106380, 101980, 76668, 39439, 38889, 52180, 73926, 90811, 81513, 84856, 88020, 92462, 98049, 108243, 70742, 45995, 47421, 61136, 82005, 65321, 66550, 66612, 60046, 68300, 62063, 46952, 50486, 51183, 60061, 54327, 41198, 27148, 11846, 21820, 47060, 60837, 80140, 92139, 68597, 61920, 43579, 53297, 97847, 103613, 90339, 108607, 121025, 120230, 108509, 98554, 85289, 53218, 51332, 49782, 81858]
11277H1858L010k8379J6159j0317l3600j6508J4948J0928J6848K690L1947k224
11265H7360m2417J0137K1188K7991J7789k2170o0156j0730K5273P661j4628j1474
11253C5824J9633k921j0697L219J0226k01J2408J5576K4305J0336l584m8449j6047
11240D9628k4594J8434m4610K0046L5562L4834Q379l908k2848j0146N791j0330
11228E6238J8361N867J3882n653j8164k3669j9679k6310K196J4921j8596M8684
11216D8078O7314K0831n806l8376J145J3459Q50j7916l1991k0423P024J2684N247
11203F2120l107p994k0546M915J9736k197K5618J7483k0458j748L08K0215J6598
11190A10943r878o444j8886k2585J5768k1658j7653o756J8147J1121j0862n743
$$ y = [81858, 84868, 56489, 72648, 62331, 28731, 12223, 27171, 38099, 54947, 57637, 89584, 87360, 44943, 55080, 76268, 104259, 122048, 99878, 39722, 28992, 54265, 61926, 47298, 35824, 55457, 52536, 41839, 45058, 55284, 55083, 67491, 83067, 107372, 117708, 114124, 65675, 49628, 25034, 43468, -1142, 18904, 54466, 89300, 97679, 93771, 70923, 60777, 66568, 56238, 74599, 80466, 94348, 88695, 70531, 46862, 27183, 873, 3069, 17990, -606, 48078, 115392, 136223, 130417, 92041, 93186, 106645, 107495, 89579, 57588, 37165, 44189, 56873, 62120, 59013, 51019, 30473, 35388, 55124, 52927, 78545, 96028, 75570, 73822, 74130, 94345, 110943, 101065, 94621, 75735, 53150, 68918, 47260, 29607, 22851, 40998, 52119, 41257, 35514]
11178C5514k7363l7780M9695J9935q009K295K4502j8497j0996J4663J2753K2309
11166G9021J5478j9617j0676k83K7545L3505k2805j7272j1794j8911l7180k0986
11154c975J3485j134R260M5080K5003l2244j0280K423k1027n75M3754K5809k826
11141I2753j9327k2626J3476J0210Q52Q867l8418l1945Q325j2473M182K7156k614
11128C8418l0005j721J4474J8321J862j9301J2377K1138k878k9493J3166O287
11116D2645r993j7659l494L820K0217O341p71K8247j131N191o787j6294l9862
11103A0470q092L6701K5456O399k3953m7628j9678n736K4157K1233L2324j8701
11091C2952j0551k5143k2318J7864M9491P780R653q395j2616l3649k4475l120
$$ y = [35514, 8151, -29629, 20066, 40001, 31992, 34287, 58789, 40292, 29296, 43959, 56712, 79021, 94499, 74882, 64206, 63923, 91468, 124973, 102168, 84896, 73102, 54191, 17011, -3975, 9510, 8376, 17636, 62716, 87719, 55475, 45195, 47618, 26591, 26016, 69770, 95579, 92753, 73426, 50800, 64276, 74486, 75338, 84205, 45787, 13842, 22167, 9694, 13876, 41032, 38418, 8413, 6692, 21166, 39487, 41349, 22048, 34425, 55563, 52685, 23192, 36358, 42645, 32652, 14993, 11499, 15319, 35536, 41877, 41106, 69353, 68222, 73413, 66626, 50332, 10470, 2378, 39079, 64535, 70934, 46981, -647, -20325, -26061, -1904, 19329, 51653, 32952, 22401, -2742, -25060, -7196, 42295, 50075, 59728, 51333, 38717, 5068, -19407, -22527]
11079b2527O778J6266j0811j40p04J4853o099P616J4541k3942J3903J3515j077
11066B2172j1497k1246J2511J9578j23r423J3113J6327J5973m097J819k1897K4363
11053E7573p028J5244j2154k136k78l6235J960J0509k8639R541P648K5010L7436
11040G8451K2264j7743k1090J3633J9790q903J1452J3920J3950L0527M714j6664
11028A44301j9938J9009Q1792M3972k8365n1585n0998j2235L5084L5386P896O84
11016B05003r503J8696M8457Q554J057j5785k3571k6735k1764l6193N539K1172
11004A74927K5461N641K3542j4739k9785k8590j5211l8609j7292k1487P072j521
10992F9409L7455j0779j7631L5887o979l64M626j2113p433J4162j5848l9507k0259
$$ y = [-22527, -15749, 517, -10294, -10434, -11138, 3715, -2384, 5232, 19773, -4169, 9734, 23249, 22172, 10675, -10571, 1940, 21518, 21395, 11972, 25085, 41412, 57385, 53288, 55107, 33210, 57573, 50545, 65789, 53635, 51499, 51221, 14986, 16946, 27455, -1184, 8357, 16005, 41015, 78451, 100715, 82972, 61882, 75515, 95305, 86402, 97854, 111774, 125724, 156251, 160965, 144301, 124363, 143372, 225164, 269136, 240771, 189186, 138188, 125953, 161037, 196423, 204319, 205003, 195500, 214196, 262653, 271207, 272264, 256479, 232908, 206173, 184409, 148216, 153755, 174927, 200388, 206029, 229571, 214832, 185047, 156457, 141246, 102637, 85345, 63858, 70930, 69409, 106864, 96085, 78454, 114341, 107362, 106998, 111624, 99511, 92078, 106240, 90392, 50885, 30626]
10979C0626J4884P949L205K5128K8245j2153l0156j4236K0122L29l474k1191K6470
10966G5748J1601J8644k3289j7987R720L45j7283j6278J7082K151j6462K8892
10954G2884J4767j8167m1262N275J3257r727Q119j240O730o676j9825j9565K038
10941F608J771J2889P167K1559O301J057j1092l9825p101K2254L714K9847P311
10928F2460r504j8059m4762m491M8724J2213k5625l0463o755k4422L9701K9490
10916B8507K0227j678k2231k652K910K464J7899L6230j2907m8620J176M675j8116
10903G884L7150K6228k6572q182j0098k3367K4738K5675j5108n433o695J7560
10891D3780P970k4500j7457N06q864M372K6522M9N713K055j9436l4867K7118K9015
$$ y = [30626, 45510, 53459, 56664, 81792, 110037, 97884, 67728, 53492, 73614, 73943, 70469, 49278, 75748, 87349, 105993, 82704, 64717, 74437, 74782, 57499, 41221, 58303, 60454, 43992, 72884, 87651, 69484, 28222, 33497, 46754, 37027, 45146, 43906, 50636, 43960, 24135, 4570, 6608, 8379, 21268, 28435, 49994, 56295, 57352, 46260, 6435, -666, 21588, 25302, 55149, 62460, 52956, 34897, -9865, -14356, 34368, 46581, 20956, -9507, -16262, -40684, -983, 28507, 48734, 47056, 24825, 22173, 25083, 27547, 45446, 81676, 68769, 20149, 21325, 26000, 7884, 45034, 71262, 44690, 36508, 26410, 3043, 27781, 53456, 38348, 32915, 26220, 43780, 51750, 27250, 9793, 10299, 1435, 5807, 32329, 32378, 38091, 40146, 20710, -14157, 12961, 41976]
10877D1976K304j0011l4197j131L5154J080m289o774j4123j1889j3409L7771p791
10864A4671n8033l527N0703L4252j6560j1729K9095J6560l2197j528l686j1677
10852F344k183M4759L1245k1135j2803j2413k4352j8155o942L3535P582m490j247
10839A9745J2774N714l3946Q571k0744K9619k21N77J3540K328J9362L133j384
10826E9068M1508m210m0087k1109p903K1397L9209L2277L834l3662j7991k2211
10814E0120l5779J8316J3067j5730j3717k444J1354J1479J1953l2579M154m27
10802A9767m174K830J4526J7008j3220l7055L0084K7996L821k847K9810J217N116
10789I4879N579K1464q559m8787P344L872j1761m504J5043L9777l4580j3715j4390
$$ y = [41976, 44280, 34269, 72, -1059, 34095, 35175, 30886, 24112, 9989, -1900, -15309, 22462, 14671, -43362, -46889, 3814, 38066, 21506, 9777, 38872, 55432, 23235, 21707, 18021, 6344, 4161, 48920, 80165, 59030, 46227, 33814, 9462, -8693, -15635, 17900, 25482, 20992, 19745, 32519, 38233, 4287, 12858, -7886, 21733, 21512, 22089, 35629, 37957, 57319, 60452, 59068, 100576, 96366, 56279, 35170, 27267, 48664, 87873, 120150, 123984, 90322, 72331, 50120, 14341, 32657, 45724, 29994, 16277, 13833, 25187, 36666, 48619, 16040, 20194, 19767, 15593, 18423, 32949, 49957, 36737, -318, 29766, 57762, 61583, 58736, 88546, 89763, 94879, 100458, 121922, 113363, 64576, 71920, 75792, 64031, 59527, 74570, 114347, 79767, 66052, 51662]
10776E1662l6011j8788o845L2123J6279j4292J9439r784p803J358r180J74q444
10763I888j5062r579O243l51j854k8876L271Q09J1510k0835k3159k6136J9958
10750g4173J7841K4729N5177M296m0456j2468j9973K0977Q018j0660K2652N7995
10738E3955r93j2810K4670R145j755j6124k6699k0013k848K7533p369j3608j550
10725A1534M295K2230j4570k5905K406K5237L469j0620k5927k5313j841J4973
10713b0032L1069K4098p36P240o259L4375o708j7617O707O236l1127k7223L842
10700C865J8961L9538N4881J5l7599l9892n688L5669L3814R888j1726k707p116
10687I1903O845l4804m0134j6703L523K6746K9184K3818j3094k7244j5324l0292
$$ y = [51662, 15651, -3137, -9982, 22141, 38420, 24128, 43567, 33783, 25980, 27338, 18158, 18332, 9888, -5174, -14753, -8510, -8861, -10715, -39591, -36320, -35511, -24001, -44836, -67995, -94131, -74173, -56332, -31603, 23574, 27870, -12586, -25054, -45027, -24050, -16032, -26692, -4040, 53955, 52962, 40152, 64822, 73967, 72212, 56088, 29389, 9376, 6528, 34061, 26692, 13084, 11534, 15829, 38059, 23489, -2416, -10, 25227, 28696, 18076, -7851, -33164, -35005, -20032, 11037, 35135, 34399, 41639, 35380, 69755, 63047, 45430, 52137, 58373, 27246, 23, 3865, 22826, 62364, 117245, 117260, 79661, 39769, 34081, 69750, 103564, 113452, 101726, 99019, 91903, 98748, 63944, 23810, 7107, 10630, 37376, 66560, 90378, 77284, 50040, 34716, 4424]
10675D424k5534P003J4952L2605Q493J8210Q174Q493l952l4867l3667R83N760
10662A1077L2356M4223m631m564j4635p035K4328O058j0010O282j391k3045j3704
10649D5309J5584K3825O043M7033L822j1779J4733K1708j3050L845J2439L6670
10637B06182L0233K3368m0989j1550M3177L9216M540K9748M3596L3306P4719Q8481
10625E64027O2278Q5983O1506R5654J04239J37766J44638J51184J88452K82597
10615A878324L74751M81196O86728R04759J228729J579163J973031K172503J865436
10606A3144620J166119L93797r8019k62186k03949J80026Q35556J709578K765316
10597A9630858L807441M244981L439945J460447m55227j522888j932022j733244
$$ y = [4424, -21110, -14107, 845, 33450, 41943, 60153, 68327, 76820, 72868, 38001, 4334, 5317, 11077, 43433, 87656, 83025, 78461, 63826, 56791, 81119, 87177, 77167, 83449, 82058, 59013, 45309, 60893, 84718, 90761, 137794, 141616, 129837, 144570, 166278, 153228, 157073, 169512, 206182, 236415, 259783, 218794, 207244, 250421, 289637, 294177, 323925, 367521, 400827, 475546, 564027, 626305, 712288, 773794, 869448, 973687, 1111453, 1256091, 1407275, 1595727, 1878324, 2253075, 2734271, 3420999, 4325758, 5554487, 7133650, 9106681, 11279184, 13144620, 14310739, 14704536, 14606517, 14344331, 14140382, 14320408, 15155964, 16865542, 19630858, 23438299, 27683280, 31123225, 32583672, 32128445, 30605557, 28673535, 26940291]
10589B6940291q93113L90053J850676L439713M757953N123666L599495M34790
10581D5643524k361157l770493m227676l958470k951163j555837p4407J269583
10573B8013904K260555K464052J274339q99548k649394l388975l575077l267845
10565B0232011k516220j600679p16672j3416M14431M27893j10266r35601j622878
10556A3558603j919193j975890j806123j513266j201296r40887o71395m71569
10548C058984l78654l02663k19226k22947j78221j60026j32953j43268j19254
10539A201772j10539q9268p2444o1990o8519o9268m1164l5893n0155m5609k3511
10528E33412k8820J7830K3042k0760l5080m2169m8146m627j0351L999k1256k6411
$$ y = [26940291, 26047178, 26437231, 28287907, 31727620, 36485573, 41609239, 45208734, 45643524, 43282367, 39511874, 35284198, 31325728, 28374565, 26818728, 26744321, 28013904, 30274459, 32738511, 34012850, 33113302, 30463908, 27074933, 23499856, 20232011, 17715791, 16115112, 15398440, 15385024, 15799455, 16227348, 16117082, 15181481, 13558603, 11639410, 9663520, 7857397, 6344131, 5142835, 4201948, 3530553, 3058984, 2680330, 2377667, 2158441, 1935494, 1757273, 1597247, 1464294, 1321026, 1201772, 1091233, 1001965, 929521, 867531, 799012, 729744, 688580, 652687, 602532, 556923, 533412, 504592, 522422, 545464, 524704, 489624, 447455, 399309, 394682, 384331, 388330, 367074, 340663]
10516C40663j9022k4582k7777M065L7471j7683l114j7027l4454j0219M0009M386
10504B72716j3779N11J9595l5478k9364j8013k647L5986L3137J6165j1485k0360
10492B46984j5491j1262l4467k4882j2125J8743j408k262n939m478j7607j4640
10480A21166M392L3816M0757m9898k9083R253L5019k4952J8535L584m351j434
10468A56804Q939m6293l3545K3246J8283N179K73l0265k0606J7303L6739p105
10456A28952M295j3754J6106L979j5976J312L9372J953j591k8957m973P627o600
10443A31745O068n678J0527P03l5949j730J5587j7399k4358K315R449P910L1835
10430A31025L4387j4084l9943O446J5291k1269l7165j2054L0210J0627L0949l063
$$ y = [340663, 321641, 297059, 269282, 273347, 310818, 293135, 290021, 272994, 238540, 228321, 268330, 272716, 258937, 259448, 279043, 243565, 214201, 196188, 193541, 229527, 262664, 278829, 267344, 246984, 231493, 220231, 185764, 160882, 148757, 167500, 166092, 163830, 157891, 153413, 135806, 121166, 125558, 159374, 200131, 150233, 121150, 130403, 165422, 140470, 159005, 162589, 158238, 156804, 165743, 119450, 85905, 109151, 127434, 132613, 132886, 102621, 82015, 99318, 136057, 128952, 133247, 119493, 135599, 139578, 123602, 124914, 164286, 166239, 164648, 135691, 130718, 138345, 131745, 137813, 132135, 142662, 143365, 107416, 105686, 121273, 103874, 79516, 81831, 91280, 99190, 131025, 165412, 151328, 111385, 117831, 133122, 111853, 74688, 62634, 92844, 103471, 134420, 131357]
10418A31357k1962k607J7191l87O680j6250l759q226K0582l297j2703L5312O3
10405A41994o3013r045o834j872j1427K129j2638R687M2622J8276o278k2367r386
10392G1848K3941K489J2313N944k3538l4751k4101M0207J5720k0581l3458J2300
10380D8333L5946J0358j6318j0289p404m960l5924j609K8506L1531J669L0802
10368A10641K8707O189j3395k7257Q307N768j94l8820k8913L0141K7619q638o595
10355I3560q084l2128K576j1515P250M337K509l0458p102P938N532n932j5694
10342A2789J7950L9620J1536L7808j0274l1722N57M872J261O446j8043O536j3537
10329F5799J1122k6827l7164j5437K0756J9402j6330K9139K7206J2112K7958q557
$$ y = [131357, 109395, 106788, 123979, 123592, 130272, 114022, 110263, 102037, 122619, 119322, 106619, 141931, 141994, 78981, 69936, 63102, 61230, 49803, 51932, 39294, 48981, 91603, 109879, 103601, 81234, 71848, 95789, 98278, 110591, 116535, 92997, 58246, 34145, 74352, 90072, 69491, 36033, 48333, 84279, 94637, 78319, 68030, 60626, 55666, 19742, 18133, 46639, 78170, 79839, 110641, 139348, 145537, 132142, 104885, 113192, 118960, 118766, 79946, 51033, 81174, 108793, 100155, 93560, 85476, 53348, 55924, 44409, 51659, 55996, 58505, 28047, 20945, 28883, 34415, 28483, 12789, 30739, 70359, 81895, 119703, 109429, 77707, 78264, 83136, 84397, 90843, 72800, 79336, 65799, 76921, 50094, 12930, -2507, 18249, 37651, 21321, 50460, 77666, 89778, 117736, 109179]
10317A09179l0621m7142j4057l8545k2697L4339P419o459j8860O287K3382j2422
10305a0197K3751k11J3859K0171J1646p091M070l9342R389K9175J0515J2007J0354
10292H8096K1361j6493k7141j5001j7319j5453Q94J0200j158r189L004j1556K403
10279A2648J5858N865j4346k3637P787Q512K708K0892J8725k0833l7307k3262
10267b6390j0538K1269O7729K2579j719J9953p143l8880l8402L7926J7461l7122
10255B6723K011m064P325k949Q981M704j4260k029J0768L3590L1413K2284J0332
10242A34829R197J2887K9787N412N3499J0050O9398R4270J09259J51802K52464
10231I32854L17736L54871L50586J80306j2591q2817l2537R0112J35375P2572
$$ y = [109179, 78558, 31416, 17359, -21186, -43883, -9544, -2125, -8584, -27444, -21157, 2225, -10197, 13554, 13343, 27202, 47373, 59019, 51928, 55998, 16656, 26045, 55220, 65735, 77742, 88096, 109457, 92964, 65823, 50822, 33503, 18050, 18944, 29144, 27986, 18797, 21801, 10245, 12648, 28506, 34371, 20025, -3612, 4175, 12687, 15395, 36287, 55012, 34179, -3128, -26390, -36928, -15659, 52070, 74649, 72930, 92883, 85740, 46860, 8458, 46384, 63845, 26723, 28734, 24670, 31995, 29046, 38027, 42731, 28471, 26442, 37210, 70800, 102213, 124497, 134829, 144026, 156913, 186700, 192112, 245611, 255661, 325059, 419329, 528588, 680390, 932854, 1250590, 1605461, 1956047, 2136353, 2123762, 2040945, 2008408, 2098520, 2233895, 2306467]
10221B306467p1856k08916k69605k87699k94470k72279k28018j46433r0016p5499
10211C61676m3939k2654J0964O15k3981k5958k5503l3795m9348k7486J1431k3708
10199A08314J1074k1252l447M155n536q672k4158m167K7421O498k8620j9683r44
10186D0983L7527K361J6716J0538p053o5622m625K5774N0485L6829o859Q094l6678
10173A08470l8446J4604K5031K614N717n909K0970J0149J3784j6L5250M2828p072
10160B27974l2292J3230K6532l4360o981j236K713n356K1053j0675L5457K5799
10148B61858Q682K904J8745m254k2563k5162l3649L311p175j2056J1381j4425
10136A87597R746M1208N562m08j3110k1153l2536k4540Q787n689k4118k173m813
$$ y = [2306467, 2234611, 2025695, 1756090, 1468391, 1173921, 901642, 673624, 527191, 437175, 361676, 317737, 295083, 306047, 306662, 282681, 256723, 231220, 197425, 148077, 120591, 132022, 108314, 119388, 98136, 94689, 98844, 93308, 84636, 60478, 56311, 83732, 90230, 61610, 41927, 40983, 78510, 80871, 97587, 108125, 101072, 35450, 30825, 56599, 107084, 143913, 137054, 145148, 108470, 70024, 84628, 109659, 112273, 117990, 112081, 133051, 143200, 156984, 156968, 192218, 235046, 227974, 195682, 208912, 235444, 201084, 194103, 192867, 195580, 190224, 211277, 200602, 236059, 261858, 270540, 273444, 292189, 287935, 265372, 240210, 206561, 209872, 202697, 190641, 202022, 187597, 197343, 238551, 244113, 243705, 230595, 209442, 176906, 152366, 161153, 155464, 131346, 129173, 124360]
10123A24360K7803J8790m4973m3725k5521J9026J3460k7654k9897L482J0252J6553
10111F1956l0663k9680J3037J3156r845R313L177k1897j6959j4720J9513M300
10099F88K0047r702o095J355J0517k3655q199j0176M5667J9840K512J6997j3287
10086D6509k9385l692m212N77m10p045N2505q984j3859N273k3071J3780P500j2578
10072B2908k2423J4888L1910P109O50K2462q609J8778j2018o3518J0812J6901
10060C9850p493O92r60o815k1229j0863J0673J7345J5774K2215J5317o951R504
10047G7059j2202L919J3015j9376j904M173m6739l1979K011r43M368N460J7528
10034A4390K8675j9752j9308J0856J0661J8705K3916k2244k9905j7670m278k9485
$$ y = [124360, 152163, 170953, 125980, 82255, 56734, 75760, 89220, 61566, 31669, 35151, 45403, 61956, 31293, 1613, 14650, 27806, 17961, 27274, 30451, 8554, -8405, -23125, -3612, 688, 20735, 11033, 4938, 6293, 16810, -6845, -15044, -25220, 20447, 40287, 42799, 59796, 46509, 17124, 13432, 9220, 9797, 9387, 2342, 54847, 45863, 32004, 37277, 14206, 27986, 35486, 22908, 485, 15373, 47283, 54392, 55042, 77504, 68895, 87673, 75655, 12137, 22949, 39850, 32357, 33049, 32089, 25274, 4045, -6818, 3855, 21200, 36974, 59189, 74506, 67555, 77059, 64857, 68776, 81791, 62415, 60511, 64684, 17945, -14034, -12023, -12966, -8598, -3138, 14390, 43065, 23313, 4005, 14861, 25522, 44227, 68143, 45899, 15994, -1676, -5954, -35439]
10022c5439K8475J7921r600R127j812m476j913Q848k4489K737L905j0520k0693
10009c7929J2982P2061j1538j9820j0721q167k79R691J2607J2012j691j9568K3159
9996C2799J0161j2882l264m2337Q764K7471j6092J6737J9124l6746r916Q920J5616
9983A8355n619j8261l5281k313N1041K9509k0210k3074K500J967L2274J964k143
9970C0709j0058k6995J9048K0304L355L935m0337k6123J6280O2300K9357m015
9958G7760j7412k1499l2583m432K2581L0177J2770k0854k1339j3144L092O845
9946B1962L1743k7122l2917l5323J5494M0372J180M0323K3342K3251k9133n1364
9934B1808k9639K0606Q585K8155q83J0635l5645j0795j2094j9546L9600M0212
$$ y = [-35439, -6964, 10957, 1357, 10484, 8672, 4196, 2283, 11131, -13358, -10621, -6716, -17236, -37929, -24947, 47114, 35576, 15756, 5035, -3132, -3411, 6280, 18887, 30899, 29208, 9640, 32799, 42960, 30078, 26814, -15523, -6759, 20712, 4620, 21357, 40481, 3735, -6181, 2739, 18355, 12736, -5525, -40806, -43119, 7922, 37431, 17221, -5853, -3353, -1386, 30888, 32852, 30709, 20651, -6344, 12704, 33008, 36363, 40298, -39, -26162, -9882, 52418, 81775, 77760, 60348, 38849, 6266, 1834, 24415, 54592, 67362, 46508, 25169, 12025, 15117, 21962, 53705, 26583, -6334, -41657, -26163, 14209, 15389, 55712, 79054, 102305, 73172, 21808, -7831, 12775, 21360, 49515, 48632, 59267, 23622, 12827, 733, -18813, 20787, 60999]
9922F0999k4348l8593J9476K2255j4176j6470O834j5054j7815nN255Q573k574
9909e643J8147J6300n346k827K0441J3216J987k3599m0034j391J4686k3779O336
9896a1506J4315M418q542m816J0617L391L5732J0996k2526j858j0282l7710N677
9883a2094J0475K6854K304j8028M895m838j1391n321J6428j3213p230R211L733
9870A785j8753j0561J6392J1202l820J2910k2072k5639j588o685k2176J2409K9505
9857b7091K6508J6516k2453j6919j074M303O276J7618J9184m4557q477M3373J4893
9844B8100R104n436k4378j990L1421n922J701L916j1658j6805O724k622Q667k059
9830A8763j2968M6J7851J83J4880J2765j7611K8768J3983p167k3486j9298p449
$$ y = [60999, 36651, -1942, 17534, 39789, 25613, 9143, 15977, 923, -16892, -16897, -11642, -3069, -5643, 12504, 28804, 23458, 20631, 41072, 54288, 56275, 32676, -7358, -8749, 5937, -17842, -11506, 2809, 7227, -1315, -6131, 4486, 7877, 43609, 54605, 32079, 30221, 19939, -17771, -12094, -1619, 25235, 27539, 9511, 14406, 9568, -1823, -7144, 9284, -3929, -11159, -1948, 1785, -16968, -27529, -11137, 65, -3755, 9155, -12917, -38556, -40144, -46829, -69005, -56596, -27091, -583, 15933, -6520, -23439, -24513, -20210, -13934, 3684, 22868, -21689, -30166, 13207, 28100, 37204, 31768, 7390, 5400, 36821, 30899, 32600, 36516, 24858, 8053, 14777, 12155, 20822, 18763, 5795, 5841, 23692, 23875, 38755, 51520, 33909, 62677, 76660, 69493, 46007, 26709, 19260]
9817A9260k8869j3330J5714J4131J31K0071L1362j2148k9951J4915J4366q898
9805C6754R604K528j3337l9158m945j3063J6526N716k3351P838l2561m002K8045
9792b3406L6801N650J3453K2395k8373j0415k3669j5423L3407J1070K9620K5475
9780G6585L1326j2032m524L734j1229K222P9274O6016J02496J64847L24557L72762
9768A196034K23323m3175j85198k35396k52272k39647j66178o5076l8633j6174
9758A77608n1838M133J4746j9635m9114j8387m9817j4397K0565o90j3308j9403
9746a9537N30L2750k2685L341k270N774K6017J8717l140j7842k6613P087J0855
9733A2984k7512k9573J9882K3055J3890j2873M741O104K874j5055R852J8042J0079
$$ y = [19260, -9609, -22939, -7225, 6906, 7037, 27108, 58470, 46322, 16371, 31286, 45652, 36754, 46358, 48886, 35549, -3609, -8554, -21617, -5091, 625, -22726, -14888, -47449, -51451, -23406, 13395, 19045, 32498, 54893, 26520, 16105, -7564, -22987, 10420, 21490, 51110, 76585, 107911, 95879, 91355, 95089, 83860, 86082, 165356, 231372, 333868, 498715, 823272, 1196034, 1419357, 1376182, 1190984, 955588, 703316, 463669, 297491, 232415, 193782, 177608, 125770, 129903, 144649, 125014, 75900, 57513, 7696, -6701, 13864, 13174, -134, -19537, -19007, 13743, -8942, -5601, -7871, -2097, 23920, 42637, 39497, 21655, -4958, 2129, 12984, -14528, -44101, -24219, -1164, 12726, -147, 4594, 10698, 13572, -1483, 8369, 26411, 36490]
9720C6490j684L60l9177k0587K5235J9831j1034K6215J1402J6830N41j7385k3073
9707B3964L8245J4031r658j5064j0793K798M287l4855n20k0917Q66R806o806k5726
9693c0342N760K0285L100k527J1769L0657l3517j2266o333n413K8181K5684Q152
9680D3190J0377J2271P991j1131m5103l268q135l2467J8326L6591k535O596j7076
9667A5627j3034J0577o013m9175r330K6111Q317p788l407R26K7934N671j9500
9654a3084j0224M721J6206J5220O0320R8193M3714k4890o1004m6078o6356J6686
9642C3424O253k4254J4435L891J1809n937j7687J286J3908L8535p005m7115k6008
9629d465N021P49J5289m590l9000J0234N1440K9986k5784q937p97K1301m068j1666
$$ y = [36490, 34806, 35166, -4011, -24598, 637, 20468, 9434, 35649, 47051, 63881, 64422, 47037, 23964, 62209, 76240, 66582, 51518, 40725, 43523, 47810, 12955, 12435, -8482, -7616, 2190, -4616, -30342, -24582, -4297, -1197, -3724, 8045, 38702, 5185, -7081, -13414, -18827, 9354, 35038, 43190, 53567, 65838, 73829, 62698, 17595, 14327, 6192, -26275, -7949, 28642, 26107, 32703, 15627, 2593, 13170, 7157, -42018, -51348, -25237, -16920, -24708, -28115, -27189, 745, 6416, -13084, -23308, -18587, -2381, 12839, 73159, 171352, 215066, 190176, 129172, 83094, 16738, 33424, 39677, 15423, 29858, 33749, 45558, 39621, 21934, 23220, 37128, 75663, 68658, 21543, -4465, 556, 1305, 16594, 12004, -26996, -16762, 34678, 64664, 38880, 29943, 29146, 50447, 46379, 34713]
9615C4713j6329L595L55j1994k9899L1415L1953N66k2592k3248j4285L996o924
9602a8678J3592j6303j1221o674J1600M2720p34l453J5121N009J0482J5696m1702
9589A5455r388j2917j8520J4918L1362N258l8575k8827K2853N2126L9384K156
9577G5285l8621n6159k5059q939L7735L3356l98l8527J6471j3222N662L9759p612
9564A9731n1408k9621K8644J6885k8520L3655K8034J1632j3082l920J2916J803
9552B6749L425n742j7423k9645K0545J9413j8929l3109j1180J4446J4822l689
9540b0317O52K5517K7031Q15l4852k6073J8829P975J5652k5032j1643r2J9499
9527b039J8802j3595J1159J2368L3877J7392k4864j5259q325j3804j983k3927
$$ y = [34713, 18384, 21979, 22334, 10340, -19559, 11856, 43809, 44375, 21783, -1465, -15750, -11754, -18678, -5086, -21389, -32610, -39284, -27684, 15036, 14302, 10849, 25970, 30979, 41461, 57157, 15455, 6067, -6850, -25370, -10452, 20910, 26168, -12407, -41234, -18381, 33745, 73129, 75285, 36664, -19495, -44554, -53493, -15758, 17598, 17200, -21327, -4856, -18078, -12416, 27343, 19731, -31677, -61298, -32654, -15769, -44289, -10634, 17400, 29032, 15950, 12030, 24946, 26749, 30174, 24432, 7009, -22636, -2091, 17322, -1607, -34716, -45896, -31450, -16628, -20317, -19665, 5852, 32883, 33698, -1154, -27227, -8398, -423, 15229, -9803, -21446, -21538, -2039, 16763, 3168, 14327, 26695, 60572, 77964, 53100, 37841, 29516, 15712, 13729, -10198]
9515a0198r318k71j7131k5605J4217J3012j4841K4444J8812J0314P04m536j2903
9502a3300k341J4268j815j6207j8328l2117L740K2843L6114K8277l116k4224p231
9489a3437J5355q685K2756M818k3612l5257k7728J71O9099K754J8915J5840k0334
9476B0655j6354j3110R300K1163k1783J2200j8856L9556J5078k8584j0432k5191
9464a6358K376J3796j4811r375J3399J0318k8767j7387O0649O805m7250j0717
9452c7322k269K6500r199k0379K6674k803J2026J802k276R971k4735j4582J6068
9439b0524M101J8099L6498J0761q660k3766J479k0933j3957J4314Q086J2491J2300
9426C0289l6162p521N263p257q70m421j0882K004L4444K5894j9572J9673j8670
$$ y = [-10198, -19516, -19787, -36918, -62523, -48306, -35294, -50135, -25691, -6879, 3435, 4139, -397, -13300, -15641, -1373, -3188, -19395, -37723, -69840, -66100, -43257, -7143, 21134, 18018, -6206, -13437, 1918, -6767, 15989, 20807, -2805, -38062, -65790, -65619, 3480, 6234, 25149, 40989, 20655, 4301, -8809, 491, 21654, -129, 12071, -6785, 32771, 47849, 19265, 8833, -16358, -13982, -186, -14997, -24372, -10973, -655, -29422, -46809, 13840, 20645, -26605, -37322, -39591, -13091, -22290, -42669, -15995, -18798, -6772, -4970, -7246, 2725, -22010, -36592, -20524, -16423, 1676, 38174, 48935, 40275, 16509, 17988, -2945, -16902, -2588, 5498, 17989, 30289, -5873, -13394, -8131, -15388, -16258, -20679, -31561, -29557, 4887, 30781, 11209, 30882, 12212]
9413A2212j8138j15Q777j1386k0129J6454J9554J4095j838L1356J9735n9144j1616
9400a83K9775j7126j4511M130L2847o282p83L319l00j0849J3759J548q376O542
9386C3510O358k9495k5478j0927r103k29R621J9757R74K4243j3858l8230o616
9373c9473J4811P177K3769k1763n4717J2416K4500K4464R186j5797m1214J5051
9361d1590M3281N370J3840N896J318N080J1065l41J825l7031l0092K892K081k1957
9347c8363K3188j7510k4630L1161L9798R312l0411j7065P820O151r720J530N757
9334a2982p234j894J3900J9722K775J8123j4684n107L084K7405k2778m2844K9690
9321G176K6077j0496k0744J0558n795R229M923M960N960L605r435J4452K1520
$$ y = [12212, -5926, -6041, 2736, -8650, -28779, -12325, 7229, 21324, 19486, 50842, 70577, 11433, -183, 29592, 12466, -2045, 2085, 34932, 28650, 27867, 31186, 30886, 20037, 33796, 35344, 26968, 33510, 39868, 10373, -15105, -26032, -35135, -35364, -25743, -5986, -5012, 19231, 5373, -32857, -39473, -24662, -17485, 6284, -15479, -70196, -57780, -33280, -8816, 370, -15427, -56641, -41590, 1691, 7061, 20901, 26797, 28115, 33195, 44260, 43919, 45744, 8713, -21379, -18487, -16406, -38363, -15175, -32685, -57315, -26154, 13644, 22956, -7455, -24520, -16700, -10549, -20269, -18739, -12982, -20216, -22110, -8210, 11512, 14287, 32410, 17726, 12619, 15703, 43108, 20330, -22514, 7176, 33253, 22757, 2013, 12571, 6776, 16005, 20928, 25888, 31848, 35453, 26018, 40470, 61990]
9308F1990m589J4486L7551m1244l5783q986m746o0525L437J002K8231J9038J5532
9295B5394M6391M036l4231j6881q169k6749r105M5369J9254M541M755j6876r933
9282B7796k1441j7629j1725N226L509o08p631R344j9540q62L3516P353n451n044
9268c187j1148M0501J8214q50l8399o694J3093j6993k7516K719r95O83j0134K8962
9254a1744L2618j3086j2493Q195o402Q798k584q877j1166J8293r27l3734j0771
9241d3880J9762K6670J6517J3334L315j3650m470j3492R894P709Q336J1395J3502
9228E4942l2796j6636j0847L6625m1796k8704j3063j095K0852J6234j7937j4748
9216d8969l489J5315Q733P406M8141L3811l04n80j1882J7993J6738j3459j1151
$$ y = [61990, 57401, 71887, 109438, 68194, 32411, 23425, 18679, -41846, -38409, -37407, -9176, 9862, 25394, 71785, 75821, 41590, 24709, 16540, -10209, -19314, 26055, 45309, 49850, 54605, 37729, 27796, 6355, -11274, -22999, -17773, -14264, -14872, -22503, -13159, -32699, -33561, -45, 7308, 1857, -3187, -14335, 26166, 44380, 43530, 5131, -1563, 11530, -5463, -32979, -30260, -31255, -30572, -40706, -11744, 20874, 7788, -4705, 3490, -2912, 5886, 3302, -5575, -16741, 1552, 625, -33109, -43880, -24118, 2552, 19069, 32403, 35718, 22068, 17598, 4106, 14000, 21709, 30045, 41440, 54942, 22146, 5510, -5337, 31288, -10508, -39212, -52275, -53370, -32518, -16284, -34221, -48969, -52458, -37143, -28410, -21004, 27137, 60948, 60644, 60064, 48182, 66175, 82913, 69454, 58303]
9203E8303o974k6092l415m438N21Q370l4223j9401J0732K038r892J6977j8191
9190b5685l946r750k2787L618K6109j5180J0580K109L550O844K8474K3183N639
9177C2758l2269l1538m584K1339J5841j6344k1226R317J5688L2089K5017q673
9165C7415j4556m0169j5761P688j4981j2783K1107M966N488J3092J651k1952j601
9152c0396J9777J4259j9359j5507J017J4368L037j5590J3762p52K2838k938J4119
9139A8635k587J8420J0037j0999l0555J8966l048k2533j7778j0138N693K5995
9127A08K3864P287k0665J585J8109o62l0237O313J7430J3715J8602k8612q319
9114A8518j5158p553K9868J3139n646J691P50j755o1j4050N812j2210k5819L508
$$ y = [58303, 51329, 25237, 21822, 17384, 17905, 26275, -7948, -27349, -16617, -14579, -24471, -7494, -25685, -29631, -39381, -62168, -58550, -32441, -47621, -37041, -34932, -31382, -24538, 3936, 27119, 32758, 489, -31049, -35633, -14294, 1547, -14797, -36023, -26706, -11018, 21071, 46088, 37415, 22859, -17310, -33071, -25383, -40364, -53147, -32040, -27074, -21586, -8494, -6843, -28795, -30396, -10619, 3640, -15719, -31226, -30209, -15841, -12804, -28394, -14632, -15384, 7454, 4516, 18635, 16048, 34468, 44505, 33506, 2951, 21917, 18869, -3664, -21442, -31580, -25887, 108, 23972, 31259, 10594, 12179, 30288, 29626, -611, 5702, 23132, 36847, 55449, 26837, 18518, 3360, -4193, 25675, 38814, 33168, 34859, 35609, 33854, 33793, 19743, 25555, 13345, -12474, -8966]
9100h966J4067j1061l8645K2716J0990k389Q193p282L3669J1695Q02J377m554
9087C0612Q99k3137j1829J9878m081m000o564K0764O012M868J0740L669k7910
9074A9921j765J8087J8212K134l9077j3682q61l4502q223Q360J0534J1649J7417
9061H204l580j7540L512M879M8K7847J0896p818J080k9163N023k3120k903N922
9047a6713M120j3530L8847j1257j8962j1065L921J4605q464M209j0383N151L140
9034a6381K9422j8047q817P44j4123j5903K8171j1348k639J9652l571n911p557
9021b6308m054K0592J030K6688K2839k040j6832M083l8113k3101k228L4404n185
9008h225l3065M008O286m148M4289J3256j6855k744J9954l768l8343q504L5831
$$ y = [-8966, 5101, -5960, -44605, -21889, -10899, -13288, -5095, -12377, 21292, 32987, 33789, 35166, 30612, 31511, 8374, -3455, 16423, 12342, 8342, 1778, 22542, 28554, 33422, 44162, 47831, 19921, 18156, 36243, 54455, 56589, 17512, 3830, 2969, -31533, -39756, -31396, -20862, -9213, 8204, 4624, -12916, -9404, -4525, -4477, 23370, 34266, 26448, 27528, -1635, 3388, -19732, -22635, -16713, -12593, -26123, 12724, 1467, -17495, -28560, -24639, -10034, -18498, -14289, -24672, -19521, -16381, 13041, -5006, -13823, -13079, -27202, -43105, -14934, -26282, -28921, -9269, -12840, -18751, -26308, -30362, -9770, -8740, 17948, 40787, 38747, 21915, 25998, -12115, -35216, -37444, -3040, -8225, -41290, -37282, -30996, -35144, 9145, 22401, 5546, 2802, 22756, 18988, -19355, -27859, 7972]
8995G972J3200J990j5206k3583M309l449J2132L2301j8396l2427K8875M433M331
8982A6482k5623J8665l292k9620k855j5441K1924K3618j7777j8902N784K4667
8970b370L3336K5357j7435n364M500J3173L927m210j7263k7992o604N202K9631
8957C3888J7340J037j1055l7890n514J2660k5260L334K403J9731L9239J2509m4375
8944A8047j9960N228Q058J602Q998K7222j6555k2755k0912j0111M6303K9130l568
8931E0727q558j1243k5396j2847M244P708J3753j0727l8047K255k570K8540J5171
8918A3010j5045l2778k3591M259K7039l773j0398K8234J4473R726K886J3145j0039
8905A7148n244J4684J7186n4421j512M8994J3556J4320j5212j8258L3003K397
$$ y = [7972, 21172, 23162, 7956, -15627, -11318, -14767, -2635, 29666, 11270, -21157, 7718, 12151, 16482, -9141, 9524, 6232, -23388, -26243, -41684, -19760, 3858, -13919, -32821, -27037, -2370, 30966, 56323, 38888, 33524, 38024, 51197, 55124, 50914, 33651, 5659, -945, 4257, 33888, 51228, 52265, 41210, 3320, -2194, 10466, -14794, -11460, -9057, 10674, 49913, 62422, 18047, -1913, 3315, 11373, 12975, 21973, 49195, 32640, 9885, -11027, -21138, 25165, 54295, 50727, 42169, 30926, 5530, -7317, -3073, 4635, 18388, 7661, -30386, -28131, -30701, -2161, 13010, -2035, -34813, -58404, -54145, -27106, -30879, -41277, -13043, 1430, 11156, 14042, 27187, 17148, 11904, 26588, 43774, -10647, -12159, 36835, 50391, 64711, 49499, 31241, 64244, 66641]
8893F6641j6389O193N69r453j2455m1518k1629j2553l184K6371O367k3670j6097
8880e0807K0789N3885K931l000O894o901M179k6775j0941N269o075k5578M184
8867c1946o358K5748K5312L1437J4192n9067l8396p789K9255K3514p392k631J0887
8854F766J5449p928n5551J1215M6570J0113O80K0812l814j1659Q396j7436q849
8841A4764J8670k8405k2262J1845J778J4052J2047j136k5720l3847j2799M2757
8829h256J429n116R51M053j9124J3786N480N21q75j1165J5028j0847k14q497K1083
8814a763P667J5435J3264N564p675n110J2737j8742O101J9995K8226o317l3114
8801C6268n795j9742J8763J5726m798p987k4295r809k0441n89K4364k074r409
$$ y = [66641, 50252, 56445, 57014, 47561, 35106, -6412, -28041, -40594, -43778, -17407, -11040, -34710, -50807, -30018, 23867, 26798, 23798, 30692, 23791, 27970, 1195, -9746, -4477, -10552, -36130, -31946, -38304, -12556, 12756, 44193, 58385, -682, -39078, -46867, -17612, 5902, -1490, -4121, 6766, 22215, 14287, -41264, -30049, 16521, 26634, 27314, 48126, 44312, 32653, 41049, 23613, 14764, 33434, 5029, -17233, -5388, -3610, 10442, 22489, 21353, -4367, -38214, -51013, -8256, -6827, -11943, -10992, -6939, -26063, -12277, -6797, -6276, -7151, -18316, -3288, -14135, -14349, -22846, -1763, 5904, 21339, 34603, 40167, 32492, 27382, 40119, 21377, 27478, 47473, 75699, 69382, 36268, 30473, 10731, 29494, 45220, 40422, 32435, 8140, -1669, -22110, -22699, 1665, -409, -9818]
8788i818K9788L609j992j7223p388o488L5718K1189M0051l7287j0219n02j0475
8775B8963k8642K3872R444J8407k249j3904j001j879Q094j5653k0957J2074R548
8762B6117O141q246k0654J4094J2643P71q825k7092j7155J8757K6682L1173Q85
8749E5291j1252k6898N194j5606l0541P430l677J6121K8177k195k6551N367j1813
8736a0953K873L8943K693l0922l6735j9209K2336k997K4092L163o122J5181M573
8723F916j0516j8785L3203M9577P921j1382r135j6149j0477k051k0606j0898K7619
8710A5237K1811n5897l6974J4786J9841p140K7848J1683J5079m908J3679k970
8698C2075J0905J5137k4944P941J87K071l347k5781J8599Q692L3597M468m8034
$$ y = [-9818, 19970, 23579, 21587, 4364, -3024, -9512, 26206, 47395, 87446, 50159, 39940, 39438, 28963, 321, 24193, 33637, 52044, 49795, 35891, 34890, 33011, 41105, 25452, 4495, 16569, 26117, 32258, 24012, 3358, 17452, 30095, 30866, 22041, -5051, -22206, -3449, 23233, 54406, 55291, 44039, 17141, 22335, 6729, -23812, -16382, -20059, -3938, 24239, 22044, -4507, 860, -10953, -8080, 30863, 33556, 2634, -34101, -53310, -30974, -33971, -9879, -6716, -12838, 2343, 6916, -3600, -22385, 10818, 60395, 68316, 56934, 47799, 31650, 21173, 19122, -1484, -12382, 15237, 37048, -18849, -55823, -41037, -21196, -28336, -488, 11195, 26274, 21366, 35045, 32075, 42980, 58117, 33173, 41114, 41301, 43372, 40025, 14244, 32843, 41535, 75132, 79600, 31566]
8685C1566K9718j6373k9979j5847l686k307K7868L1869l2910k7458n116J733L1655
8672B0733o240m1735L0540K1086O722l547j3801J5806l413j0293o646j3766q960
8659a3514k2817N7110L5007j9518j5616k0777k8464P6542N0094j4477n3032m7509
8647a6971j5063k583J0066M1919K3493J9852L069R369j8756o502j9398K1388J0438
8634F0321j9213J2555j8365k265k0414k9054k0901K6291L5228j0667k0813l151
8622a0448j6594M8169j4103l7339j2891k8654J0501M5181M2899K826m3575N041
8610h987L1504P280m1927q56l228O881q826p562l432K677J1897N641L6529O017
8596C3608k9112j4987j936L8711L0505j2138m3462j7182M7041L4304O355Q112
$$ y = [31566, 61284, 44911, 14932, -915, -4601, -6908, 20960, 52829, 19919, -7539, -12655, -10922, 20733, 14493, -27242, 3298, 24384, 31106, 27559, 13758, 29564, 26151, 15858, 9212, -4554, -13514, -36331, 20779, 55786, 36268, 20652, -125, -28589, 47953, 98047, 83570, 30538, -16971, -32034, -34617, -24551, 17368, 40861, 60713, 63782, 73151, 54395, 47893, 28495, 49883, 60321, 41108, 53663, 35298, 33033, 12619, -16435, -37336, -11045, 24183, 13516, -7297, -10448, -27042, 21127, 7024, -30315, -43206, -71860, -61359, -16178, 26721, 29547, -14028, -8987, 22517, 29797, -12130, -12986, -16214, -9333, -18159, -25721, -29153, -26476, -14579, -8938, 27591, 33608, 4496, -10491, -12427, 26284, 56789, 44651, 1189, -15993, 31048, 65352, 71707, 79819]
8584G9819j8071p500k5111m932J7553q027k3826l3978n481L65K3309J0995P798
8571A2913q19k9166m2336K8724K7662M797K2143N897j2383j202J3344K6941O035
8558F2550J5720j7437p791P687l4213j7561L4995K2448K339l1050j4799R0j284
8545B1694k4910r418K0145k0058M355J9127l206j1505J4630J7106m957l3893l2106
8532d2996K5947k4589J6304J3120k656m090J9229m960J2141N8653N3806P7845
8520A97754R0293N5922l3326o0688j9574l0028o3822o3791k3513o130k26l7491
8508E380k7883J3693J4425K5117M7538J2384n2368K592m285j7095L852L237K3235
8495D9822k1713l3359k1011N5L1795j1486L849K6145K2440k596j7702J1400L967
$$ y = [79819, 61748, 54248, 29137, 24205, 41758, 33731, 9905, -24073, -29554, -29189, -5880, 5115, 12913, 12094, -17072, -59408, -30684, -3022, 1775, 23918, 29815, 17432, 16230, 29574, 56515, 62550, 78270, 60833, 53042, 60729, 26516, 8955, 43950, 66398, 68737, 37687, 22888, 22978, 21694, -3216, -12634, 7511, -12547, -8192, 10935, 7729, -3776, 10854, 27960, 23003, -10890, -42996, -17049, -41638, -25334, -12214, -14870, -18960, 269, -4691, 7450, 66103, 119909, 197754, 288047, 343969, 310643, 249955, 230381, 200353, 136531, 72740, 49227, 43097, 42871, 5380, -22503, -8810, 5615, 30732, 78270, 90654, 38286, 40878, 36593, 19498, 23350, 26587, 49822, 28109, -5250, -26261, -26206, 5589, -5897, -2048, 24097, 46537, 43941, 26239, 37639, 41606]
8482D1606M6792L080K2595M8743O7201M6187J13431K21674J79021n7699q5859
8471F46772n9752j27815j57262j12227m5020n8565l3170M439K0434j7604j3109
8460D7121m767j6234k8808j1985J7908K3849m819k8172k2809m410J7473L1368
8448A5715j7213m3249k7148N026N2727K9563K0388L2741J0215j3937m80J5985
8436H0333R963j4565J260j6145O8536P0354R8167O0375k4276p0098m4575o8318
8424A51011n4919l7688j7968J6459K450l0805J353J5855j7785r998k9581j5889
8412b7505N075Q022K0805J5239k4192j147l0804N834J4701l0818r525K1243J3035
8399b0037J2635N934O72j7070j6648J8869K5749l980J8367k139j2275N961m731
$$ y = [41606, 88398, 91478, 114073, 162816, 230017, 276204, 389635, 611309, 790330, 732631, 646772, 587020, 459205, 301943, 189716, 144696, 86131, 52961, 57400, 77834, 60230, 47121, 42354, 26120, -2688, -14673, 3235, 27084, 22265, -5907, -28716, -33126, -15653, 15715, -1498, -44747, -71895, -66869, -14142, 15421, 35809, 68550, 78765, 64828, 64348, 80333, 90296, 75731, 76991, 60846, 129382, 199736, 297903, 358278, 334002, 263904, 219329, 151011, 96092, 58404, 40436, 56895, 59345, 28540, 29893, 45748, 27963, 17965, -11616, -27505, -22430, -14408, 6397, 21636, -2556, -3703, -34507, -28673, -13972, -44790, -54315, -33072, -20037, -7402, -1468, -796, -17866, -34514, -15645, 10104, 6124, 24491, 22352, 10077, 16038, 11307]
8386A1307j4950J0100r574K927j0496k2797L93l0019l799K8667N1127J6485J2975
8373D2346L0737l5888l0435J0457J574l130j7814K2691j945J2320J1632k637k7293
8360A2615n3053k2040L4147M0975q781j1367m935M33K472k5470p237J9789K8942
8347F490J3297j1187j2577J8099q612k0466N128J799r610K2606k5166J1477N105
8334c617r310J3529n36k4815L4669N423O206m800k6809L8941n2l5971j1460J3124
8320e478p883J617J6336J4685J2792M717j1835j6942j4867j2910j70n672J7144
8307h466J5378J071r766R140j4723j4089r262m699r06n964J7028p314J4771J5497
8293b304n343J067J7375Q052L0563N372J7341j1857m8653J0495l939k2623r010
$$ y = [11307, -3643, 6457, -3117, -190, -10686, -33483, -33090, -63109, -66908, -38241, 12886, 29371, 42346, 73083, 37195, 6760, 17217, 18791, 15661, -2153, 20538, 18593, 30913, 42545, 39908, 12615, -40438, -62478, -28331, 12644, 3863, -7504, -12439, -12006, -9534, -35004, -42241, -22452, 6490, 19787, 8600, -3977, 14122, 5510, -14956, -9828, -8029, -17639, 4967, -20199, -8722, -3617, -12927, 602, 66, -24749, 9920, 15343, 21549, 16749, -10060, 28881, 28829, -7142, -18602, -5478, -13361, -11744, 4592, 19277, 32069, 36786, 24951, 8009, -6858, -19768, -19938, -25610, -8466, 6912, 7983, -1783, 7357, -7366, -21455, -30717, -35416, -36322, -42286, -25258, -32572, -17801, -2304, -7647, -6580, 10795, 18847, 49410, 54782, 72123, 60266, 11613, 22108, 18169, -4454, -13464]
8280a3464j0690J611J3408K5109R466o648J1056l1944m5633O635L2302K036J4889
8267H133M46q328K8723j2914j5034J3542K8455j0580l032q378m5466k2370J568
8254d5235j4454M841J3551J9709j7656J9820J9254j2958j4662N935K0277J1884
8242A0306p710M499L958P265j3906M338l7886J0948L0397Q388j9007K6890j3844
8229A4636j629J8881j7681j506J853l4640m217K5099J1966m014k2386R973J7728
8216A4063j0339k533L2384j482q311l8612J4741o777j860K374j4835j9373j4541
8203e5101k762M458j0845M134L9825M3636n160m094P467j8074l7935N613J9704
8190i134o241L884R06K4704K895j0443n026o108O257K2631q941k6449m66R427
$$ y = [-13464, -24154, -22543, -9135, 15974, 25440, 18792, 29848, -2096, -47729, -41094, -8792, -6756, 8133, 8579, 251, 28974, 16060, 1026, 14568, 43023, 32443, 29411, 21033, -24433, -46803, -45235, -59689, -54848, -41297, -21588, -39244, -19424, -170, -13128, -27790, -21855, -1578, 10306, 2596, 7095, 11053, 18318, 4412, 8750, -29136, -18188, 12209, 20597, 1590, 28480, 14636, 13007, 31888, 14207, 12701, 14554, -20086, -24303, 796, 12762, 8748, -13638, -3665, 14063, 3724, 1191, 33575, 32093, 23782, -14830, -89, -6866, -8726, -6352, -21187, -40560, -55101, -57863, -53405, -64250, -60116, -20291, 23345, 18185, 14091, 21558, 3484, -34451, -28838, -9134, -15375, -11491, -10585, 14119, 17014, 6571, 1545, -4563, 1694, 24325, 15384, -11065, -11531, -2104]
8176b104j3360j462K3958k2159l284J5797M923J2761O554r001k6191j9468J7900
8163a5136L4485J3748k6415o381R198j7221k2534k7371K1642N4281o406J9281
8151C1171J2365M859l162k7851j9669J4082j0071j2706L682M745m23m135J3630
8138F517j3945l8057r021j3399Q294m552L4802M086k1912K7825K8794j3698j9132
8125b3398k6514l2R775j1832J6946J6512O199J9015K513k8029K0082j162M537
8112D612J410k2168j0016j3098L362L4384k8876n933L196j9713J4730K3095r88
8099a6003m089M74Q063J5596k1255K141Q230j5436J056k4067j2578Q469R377M0277
8085B55L1089J167j0401j3275l193k1916p696K1814L4245o553j176L2056L4059
$$ y = [-2104, -15464, -16926, 7032, -15127, -18411, -2614, 2309, 15070, 21624, 12623, -13568, -33036, -15136, 19349, 33097, 6682, 301, 9499, -7722, -30256, -57627, -35985, 18296, 11890, 31171, 43536, 48395, 45233, 17382, -2287, 11795, 1724, -10982, -7300, -2555, -2978, -7113, 6517, -7428, -45485, -54506, -67905, -59611, -64163, -29361, -25275, -47187, -19362, 9432, -4266, -23398, -49912, -49944, -40169, -52001, -35055, -18543, -12344, 6671, 9184, -18845, 1237, 75, 4612, 6022, -16146, -26162, -39260, -35898, -1514, -30390, -36323, -33127, -52840, -38110, -15015, -16003, -20092, -19618, -11555, 4041, -17214, -15073, -6843, -22279, -21223, -45290, -57868, -49399, -40022, 255, 31344, 32511, 22110, 8835, 5642, -16274, -23970, -2156, 32089, 25536, 24360, 56416, 90475]
8072I0475n513l800j5121M17j9725m0667m6536R261L2459p564l3299J2957j3623
8059d0279j9310N4189L3625J6548r590j4705m856o35o0291q369J1900Q197k2001
8046e5577K0366L4996q174O759j1777J594p444P505J5301L242J8766Q36j9782
8033F611j4623K286l5704L4042J4388M1674K4130K0103p8l9662k3993J2883L542
8020D5599o911J3791Q079r568K643M491k6338l4737q826j2837j0519L885k0682
8007e1930J4063j2187M541l234K6283o879r453L1815n203j6715l902J7449K0766
7994E414P44j3910o003k413l690J8955M4460O808l6296j9990p541J1534K0638
7981A8710J3228L6364j2248m9790k397p65J4058j7304k6594R013K6633n350l3182
$$ y = [90475, 84962, 81162, 66041, 66458, 46733, 6066, -40470, -31209, 1250, -6314, -39613, -26656, -40279, -59589, -5400, 28225, 44773, 35183, 20478, 15622, 14987, -45304, -53673, -41773, -33576, -55577, -35211, -215, -8389, -1630, -13407, -11813, -19257, -11752, 3549, 6791, 25557, 26393, 6611, -8012, -5726, -41430, -7388, 7000, 48674, 72804, 92907, 92829, 53167, 29174, 42057, 45599, 38688, 52479, 60558, 50990, 53633, 58124, 31786, -2951, -11777, -24614, -35133, -31248, -51930, -37867, -50054, -45513, -48747, -22464, -29343, -38796, -6981, -12184, -28899, -32801, -15352, 5414, 6158, -7752, -13755, -16168, -19858, -903, 43557, 50365, 14069, -5921, -13462, -1928, 18710, 31938, 68302, 56054, 6264, 3867, 3102, 17160, -144, -26738, -17725, 8908, 3558, -29624]
7968b9624K3972J1372j7866n156J9679J4959Q69k052J603p678Q778l9660k7230
7955d8034K4627J3211K863J0320P081j7396L539J1715l812K2221j4379O175J2349
7942C0480k855l1429j9166j1523L1467K8470k1534k8824k8210k765L5548J2064
7930h277Q702p924j4372l845j3952K5051J3669L1676P960r415J501j3902j46j460
7916A5266j4092J1129j1353m0908l1258L5027K3917K4804j6354j3663K0930m3966
7904d0521l6465K0555L2741J9756O237j0190q604k5404j1841K8321K7815J3131
7892A5531K168k9641j5865P203L9593q073P563J8495L3489J0852n7262l6172j896
7879a4015l614o249K7591k639l5970k7310k441K2928K2747n30J5024n529k8781
$$ y = [-29624, -5652, 5720, -12146, -17302, 2377, 17336, 18205, 16153, 17756, 10078, 18856, -20804, -48034, -23407, -10196, -7333, 2987, 10068, -7328, -3789, 7926, 4114, 26335, 11956, 18131, 30480, 27625, -3804, -22970, -34493, -3026, 25444, 3910, -24914, -53124, -55889, -20341, -8277, 425, -7499, -21871, -25716, -39668, -14617, -948, 30728, 38688, 29273, 30774, 16872, 16726, 15266, 1174, 12303, 950, -39958, -71216, -36189, -12272, 12532, -3822, -17485, 3445, -40521, -76986, -56431, -23690, -3934, 2303, -7887, -16491, -41895, -53736, -25415, 2400, 15531, 17699, -11942, -27807, -20604, 18989, 10916, 18479, 36974, 70463, 81315, 24053, -12119, -14015, -17629, -23878, 3713, 1074, -34896, -62206, -64647, -41719, -18972, -19502, -4478, -10007, -38788]
7866c8788l549L0033L3610K6015K4325j3401k1254K477j5039l4954J3135O9287
7854G1897L2167l2872l6112r590k1464j5405q783J4632j8219q103L288J402J2267
7841a4895J1475r97n215r74L1481K6884j4328Q691p832l1010j8162P108K0351
7828A2577L0902P541j769j686o351j6365n923Q417l3636j6800L5052k1351r11
7815a0303m073j8818K7270J1330k8253L4969K1495J05l1397j9655l1628M140L541
7802d1277P874P897k9750R565J6876J6366j40K6816J7852n302j3808j7760k4245
7789b9036M2928K0367k6272o4516k5588N12l105M6990K7620L525K0443J8272j2120
7776B0020k1868Q96j594j6701J576L1532J1396j3289j1709k5448j6064J8180L8283
$$ y = [-38788, -42337, -12304, 21306, 47321, 71646, 58245, 36991, 39468, 24429, -10525, 2610, 71897, 104064, 71192, 35080, 25490, 4026, -11379, -20162, -5530, -23749, -31852, -28564, -27162, -14895, -3420, -4417, -9632, -10606, 20875, 47759, 33431, 42122, 34290, 3280, -14882, -7774, 12577, 43479, 51020, 49251, 47565, 41214, 24849, 18926, 27343, -6293, -23093, 11959, -9392, -10303, -14376, -33194, -5924, 5406, -22847, 12122, 33617, 33722, 2325, -17330, -48958, -44818, -41277, -33403, -25506, -55256, -45691, -28815, -12449, -12589, 14227, 32079, 26777, 12969, -4791, -29036, 13892, 34259, 7987, -56529, -82117, -81605, -84710, -37720, -10100, -6575, 13868, 32140, 20020, -1848, -952, -2546, -19247, -17671, 13861, 25257, 11968, 259, -25189, -41253, -23073, 15210]
7763A5210K639n335l0864K2139K4920J5483o3526l0789K0241Q691L22L5691J6071
7750C0893o536l9196l5698Q912K5843J1423Q312K3655Q279R668k5869k2249q890
7737a1453L1911L7138r135j743J116l8043l1015k1216J3765P1857N310l5957k0324
7724g789r484K7293L6136l1759j5334j7790k1967k2466j725r667J6941m776Q753
7711e3634L5589L252k8723J2833J0786j2658K98J9274q527j3577K9324l90l563
7698i716J8456O560M4363j5566m4157k8576K7464P29Q158k0147k3543L2137K5956
7685B2118k7790J1926J1622p279j1905l2786p72q660L4725R393j4442l8602j499
7672e3951Q529L6274J1629j7154j3738n525L6306J5875j5704J4852j0757j0643
$$ y = [15210, 17849, 12514, -18350, 3789, 28709, 44192, -19334, -50123, -29882, -21191, -20869, 14822, 30893, 24357, -14839, -50537, -41625, -15782, -4359, 3953, 27608, 35887, 45555, 19686, -2563, -11453, 20458, 57596, 48461, 46718, 47834, 9791, -21224, -42440, -28675, 43182, 48492, 12535, -7789, -17273, 10020, 46156, 14397, -937, -18727, -40694, -63160, -64885, -74552, -57611, -62387, -53634, -18045, -14793, -43516, -30683, -19897, -32555, -32257, -12983, -21510, -35087, -5763, -6153, -9716, 8740, 15300, 59663, 44097, -60, -28636, -1172, -443, 7715, -12432, -35975, -3838, 22118, -5672, 6254, 17876, 10597, -1308, -34094, -34866, -43526, -8801, 592, -13850, -52452, -53951, -45422, -9148, 2481, -14673, -28411, -33936, 2370, 18245, 2541, 17393, 6636, -4007]
7660d007K6383l221M981j8151l2102P064L1998J0676l6679k337K1464J9515q413
7647A7171k0202j7288Q253L7287O004j5344j8487n840N702n601N203l776n554
7634a2472l0633j401L1686J1683K2506J4098O864J8507J2833J757k1445m8616
7622E367l7075J7952J6382P873r321l1228J2065L564J0768j8885j7392L3167J6629
7609I866j2550k2051k3360j3187N1834J351k3232l404O639K0569K825k5957m033
7596c4690K3956L1334Q795l3532m066J358P794K9058k1197p948L2006j5347j3972
7583C549L047j2431j8467j6618j0774j8583J1724K9959J8096J0715k4997k513
7571b7293P029K0821K5209l1764k4423J7621J9057p26n782N491l0554k377p460
$$ y = [-4007, 22376, 19155, 24136, 5985, -26117, -19053, 12945, 23621, -13058, -15395, 6069, 25584, 17171, -3031, -20319, -12066, 25221, 31225, 15881, -2606, -8446, -2744, -8345, -3142, -6918, -12472, -43105, -44506, -12820, -1137, 21369, 35467, 42331, 60838, 73671, 75428, 53983, 5367, -31708, -13756, 2626, 10499, 1178, -30050, -17985, -14421, -3653, -22538, -39930, -6763, 9866, -2684, -24735, -48095, -61282, -9448, -8097, -31329, -34733, -28094, -7525, -4700, -30657, -34690, -10734, 20600, 29395, -4137, -8203, -6845, 949, 30007, 8810, 862, 32868, 17521, 3549, 6596, -5835, -24302, -40920, -51694, -70277, -58553, -28594, -10498, 217, -24780, -27293, -20264, 557, 25766, -5998, -30421, -12800, 6257, 5531, -251, 5240, -25314, -27691, -35151]
7558c5151N809N630L2110j665j7145L298M612J9189Q738n183M931J3344r595O279
7544C5201M173N892j9072k9075N23J1569n611j0393J9480o929r030L467j6607
7531a6412k5691L1004L602L482l715O358o291o073O324o912N619J7972n362J3688
7517A7593M7092J1389j8328j9003q583l4791k6888K7612m907k5919j988j897J1380
7504b7238L8407K866k992L41j6002P334J4133o379k1003k0331m542L159L1993
7491b54M68l6839j7186P353Q447K128O627j9137N179K365N8441O5227J6900l9665
7477F0054n9852m4187J4688J4099j6724M183J4296J6121j8567L48k287K1502j4028
7464a0354J753k9492k1977K5286K6829R26k2691k5924n558M916K6416M9763j0316
$$ y = [-35151, -29342, -23712, 8398, 6733, -10412, -7114, -2502, 16687, 25425, 20242, 25173, 38517, 28922, 35201, 39374, 45266, 26194, -2881, -2358, 9211, 3600, -6793, 12687, 5758, -3272, 195, -16412, -42103, -11099, -7497, -4015, -7730, -1372, -7663, -13736, -7412, -14324, -8705, 9267, 3905, 17593, 64685, 76074, 57746, 38743, 30160, -4631, -31519, -3907, -8814, -34733, -36721, -38618, -27238, 11169, 14035, 11043, 11384, -4618, 2716, 16849, 10470, -10533, -30864, -35406, -32247, -254, 214, -36625, -53811, -46458, -38011, -35883, -29256, -48393, -43214, -40849, 17592, 82819, 99719, 60054, 202, -43985, -29297, -15198, -31922, -27739, -13443, 2678, -15889, -15541, -17828, 3674, -10354, -8601, -38093, -60070, -34784, -7955, -7029, -29720, -55644, -61202, -56286, -29870, 19893, 9577]
7451I577l5388L4130J7014J63J243L5176K1525l7588k4753k8056k149K0626o718
7438D802j1486m1541k3279R247L2858N0230r081l2119k3868L589m407l982j2767
7425f1804J1234K3686L5744K3345k8959l8088k867j119l0932J899l67j6449N1954
7412c2723L8785j7365j8669n065o661L9012K1396o970k1702K1649J7231n036r589
7399A4293J0358q942n3944k3009K714k603J8681L1294K8666k5183m1596j3444
7387f2715K1641J2824J2980j4762j2296p959n384J2225K9752p761l7548J2336
7375d6667n556n560J2391R493M170j2509m774Q785j1840o197J3258M2848K8230
7362B6072j122k1571j5374l1034K1062L0458m442K4371J8771j4575K416K656P21
$$ y = [9577, -25811, 8319, 25333, 25496, 26739, 61915, 83440, 45852, 21099, -6957, -9106, 11520, 4802, -6684, -48225, -71504, -62257, -29399, 20831, 11750, -20369, -44237, -40648, -45055, -49037, -61804, -50570, -26884, 8860, 32205, 3246, -34842, -37709, -38828, -69760, -67861, -68228, -84677, -32723, 6062, -11303, -29972, -35037, -41698, -2686, 18710, 11740, -9962, 11687, 28918, 23882, 14293, 24651, 15709, -38235, -61244, -58530, -61133, -42452, -11158, 17508, -7675, -49271, -62715, -41074, -28250, -15270, -30032, -42328, -50287, -55671, -43446, -13694, -21455, -59003, -46667, -52223, -57783, -45392, -35899, -31729, -44238, -49012, -40227, -52067, -58264, -45006, -2158, 26072, 24950, 3379, -11995, -43029, -21967, 8491, 4049, 28420, 47191, 32616, 35032, 37688, 38409]
7349C8409j2148j6862P001j9238J629M245L04J3917j2104j6334L967K9708N626
7336B8120j3037o1994k1212J589J7342J7798j6440l926K5907L9951J1002p347
7324A7753j6268J2158K9039k1375m5809P139K1425j4236j172K172j7220j6316
7312d2710J2927L4269k120K905j0716l3635r450J0397K1520J5538K620n125l968
7299g548Q255J4741J781K3602l1709n1195k3954L3725L3661o293n117m227P527
7286f751j0715J1754R873k709J7620J1930J2113l7951k5898k322J6146J2053K0891
7273B6034p057k0894j2131K829K1690M207j9702j3770j1405j2964K9044J5867
7261A748k8547j4j5252k3573K5437L5782k8989k8989N510L4253K4980j4137o509
$$ y = [38409, 26261, 9399, 16400, -2838, -1209, 3036, 3340, 17257, 5153, -11181, -7214, 22494, 28120, 15083, -46911, -68123, -66534, -49192, -31394, -47834, -51760, -25853, 14098, 25100, 17753, 1485, 13643, 42682, 21307, -24502, -17363, 4062, -10174, -11346, -9174, -26394, -42710, -29783, 4486, 2366, 5271, -5445, -39080, -48530, -38133, -16613, -1075, 1545, -3580, -7548, 707, 15448, 17229, 40831, 9122, -42073, -66027, -32302, 1359, -4934, -10051, -14278, -6751, -17466, -5712, 4161, 1452, 19072, 31002, 43115, 5164, -20734, -23056, -6910, 5143, 26034, 18977, -1917, -14048, -11219, 10471, 14678, -5024, -18794, -30199, -43163, -14119, 1748, -26799, -26813, -42065, -65638, -40201, -4419, -33408, -62397, -56887, -22634, 2346, -11791, -18300]
7248a8300n383l4342%J6017J7887j0427r403K1915K2804n830k0239j0004L005
7235c2300k6600j0318L5725O065j474J2589j2137k2583l9365J0366M2539J6237
7223b1256m455k4763r340q489J105K1320j9005n8364J5882R5892L4048R448l4853
7210b830m4306J6817J7651K8882j700J2706P757k6588l3912l4715L377K087J7605
7197c7169M426N697j0629J7861N929l888L3436K9432k1198l1785j7216k0005m758
7184d9867J8376M9412J3356K0823j9172l0084L356Q29p369q282J6554k3570l4937
7171e0575J3022M1783k9297k1803L561k1446J1158L5995J3957j6260k9885M114
7159d5676j0507N339P52K2723L9938Q517k07k7616k5491k4330J5720m78p086J9496
$$ y = [-18300, -23683, -58025, -58025, -42008, -24121, -34548, -43951, -22036, 768, -5062, -25301, -35305, -32300, -58900, -69218, -33493, -27428, -28902, -16313, -28450, -51033, -90398, -80032, -37493, -21256, -25711, -50474, -59814, -68303, -67198, -45878, -64883, -123247, -107365, -11473, 22575, 32023, -2830, -47136, -30319, -12668, 16214, 14514, 27220, 34977, 8389, -25523, -60238, -56861, -54774, -37169, -32743, -27046, -37675, -19814, -13885, -17773, 15663, 45095, 23897, -7888, -25104, -45109, -49867, -31491, 17921, 31277, 52100, 32928, 2844, 6200, 7029, -340, -8622, 7932, -15638, -50575, -37553, 4230, -25067, -46870, -43309, -64755, -53597, -17602, -3645, -19905, -49790, -45676, -56183, -50844, -50092, -27369, 12569, 21086, 20879, -6737, -32228, -56558, -40838, -41316, -48402, -28906]
7145b8906L73J2884j511j3119J8965J7923j6695l5527M0447k059J9425K1090o057
7132B7233O479n764p748L5996l114j6400k2298M727k2002k6243j9826Q554K9084
7119a1322N951j8538J0212K4533N888q749q521L714K0989J0734j5024k4477j1014
7106a5624J5980L1317k9779j7771Q089L855k6467J9434j923k1087J9514K1112
7094F650l628l019j6651K4354O132M204k0896j506q264P441J5835j800k8292K1722
7080B282M6097n328o394n357j3865o50k4421L3215K6624K4683m819o407P142j9372
7066E3430p715l5040j8965l395L300J5501J8527k9682k1983J2597R096J0963M3138
7053D9772l9345l4110N1005M760k7538l0561K3080J292m506J9577q352l1028l3753
$$ y = [-28906, -28533, -15649, -17160, -30279, -11314, 6609, -10086, -45613, -5166, -7225, 12200, 33290, 27233, 33712, 27948, 20200, 56196, 53082, 36682, 14384, 19111, -2891, -29134, -48960, -40406, -11322, -5371, -23909, -13697, 10836, 16724, 7975, -546, 3168, 24157, 34891, 19867, -4610, -15624, 356, 31673, 1894, -15877, -7788, -3933, -30400, -10966, -12889, -33976, -14462, 6650, 3022, 3, -16648, 7706, 13838, 18042, -2854, -4360, -12624, -5183, 10652, 8852, -19440, 2282, 48379, 43051, 36657, 31300, 17435, 16785, -7636, 25579, 52203, 76886, 72067, 65660, 72802, 53430, 45715, 10675, -8290, -11685, -8385, 7116, 25643, -4039, -26022, -13425, -4329, 6634, 49772, 10427, -23683, 27322, 32082, 4544, -26017, -2937, -1645, -6151, 13426, 5074, -25954, -59707]
7040e9707p784L9493K2608k337k6723j5280j0888m377L3194R131l6528j3637J8748
7027e4087j0908J2284J6587J6140K6202m528j5417J7708K2999k1218o421l3637
7015c4296n205J2486J9328j5107k8392j018K0346J4113j153O058n712K8424K6015
7002C5887k0783k7354j9313K5050K1448P555O9o499J279m247k1676L823l986J3518
6988D771L8642p624k3581k7583J4462k2669o1015j725L5255j4947j1030K6581
6976e0463j2697J4249J8384j7664r595J6221J4357L5367Q8j1626L6144O028m549
6963C4244m3144l8604J9440J6799n798o377r468N227m479N109L52k7154K0179
6950c3674O437j8929N002K9741L3698J9397L2935k54l8944j9733J944k44O629
$$ y = [-59707, -67491, -27998, -5390, -7727, -34450, -49730, -60618, -64995, -31801, -22670, -59198, -72835, -54087, -64995, -52711, -36124, -19984, 6218, 1690, -13727, 3981, 26980, 5762, -659, -34296, -39501, -27015, -7687, -22794, -51186, -52204, -31858, -17745, -18898, -12840, -18552, 9872, 35887, 15104, -12250, -31563, -6513, 14935, 22490, 22559, 16060, 17339, 13092, -8584, -4761, -8747, 4771, 43413, 35789, 12208, -15375, -913, -23582, -84597, -86322, -51067, -66014, -77044, -50463, -63160, -48911, -30527, -48191, -57786, -41565, -27208, 8159, 8247, -3379, 32765, 38793, 34244, -8900, -47504, -28064, -11265, -17063, -23440, -32908, -27681, -32160, -27051, -26699, -53853, -33674, -27237, -46166, -41164, -11423, 22275, 41672, 74607, 74353, 35409, 15676, 17620, 17376, 24005]
6937B4005j6739J7330J0677k3134m357j124l0075j3702j7444k3623J5803N6648
6925e735J1270o076p007R58r372p317L0353j290j5942J9229J255J9797K2750j176
6911E1697l1381Q810k1342R774N19Q298j3709k0376J4375K7962k6651m3525j0772
6898d6321L387R063J9015q965M995R100K821K020P754l073L2502j2111P985L7208
6884F5380J6684k0018m8365o793K8019K6566l0362N637K1715j9159k3544j3520
6872B240j0090J1989j6148J3487N73K4094K3697l8415k6024J9201P611l348k8986
6859b0119k8871n421K1868M0715j089j7835J2861J1392J1203r664k4661j8426
6847b8047Q330P698j2987J6162r388J667o796p422l954O204L9922k6312o903J7529
$$ y = [24005, 7266, 24596, 35273, 12139, 7782, 6658, -23417, -37119, -54563, -78186, -62383, -5735, 5535, -541, -7548, -6590, -15962, -23279, 7074, 5784, -10158, 9071, 10326, 30123, 52873, 51697, 20316, 29126, 7784, 17558, 18077, 26375, 12666, -7710, 6665, 34627, 7976, -35549, -46321, -42934, -33871, -14856, -23821, -18826, -9726, -6905, -4885, 2869, -204, 32298, 20187, 28172, 65380, 82064, 62046, 13681, 6888, 34907, 61473, 31111, 36748, 58463, 39304, 15760, 2240, -7850, 4139, -12009, 1478, 2051, 26145, 49842, 11427, -14597, 4604, 12215, 8867, -20119, -48990, -54411, -32543, 8172, 7083, -10752, 2109, 13501, 24704, 15040, -9621, -28047, -19717, -12019, -25006, -8844, -18232, -16565, -23361, -30783, -34737, -28533, 11389, -14923, -21826, -4297]
6833d297p364q078J2180L0017j7965j6479k3300R971L1204J4958k3993r754q735
6820b1635K114K4239l112m197k4017J7577K5570k1051m7818j2775K7532P089k026
6807c2510L0274j6325l4164L2641N4495j0540k0713n755M938k816l5997L687L1873
6794i12M1702l5082k8495O926l458N386J0146r17J0145P007J5006k568K4483j8542
6780C0827l5594R231j5178q161j2854j2232J4695J5275r462J6085J0167j688j8221
6767a7110J6369J3294r697k441q799J5244J1570o186J2574J2474l9201J4952M0444
6754E3487p17k91l8529j1983J6642l6100l1828p465j309j7505M774K8593J5969
6741b6262m4310q347J8177L1481N975J5637J0539o452J3235q693K5897j5157j6956
$$ y = [-4297, -11661, -19739, -7559, 22458, 4493, -11986, -35286, -25315, 5889, 20847, -3146, -12900, -21635, -19521, 4718, 1606, -2591, -26608, -9031, 16539, -4512, -52330, -65105, -37573, -30484, -32510, -2236, -18561, -52725, -20084, 34411, 23871, 3158, -2597, 2341, -475, -36472, -32785, -912, 40790, 5708, -22787, -15861, -19319, -13933, -3787, -4704, 5441, 12448, 27454, 24886, 49369, 30827, -4767, 4464, -10714, -18875, -31729, -43961, -29266, -13991, -23453, -7368, 2799, 1111, -17110, -741, 12553, 2856, 415, -8384, 6860, 18430, 12244, 24818, 37292, -1909, 13043, 53487, 52770, 52479, 13950, 1967, 18609, -17491, -49319, -56784, -58093, -75598, -70824, -42231, -26262, -70572, -78919, -60742, -29261, -23286, -7649, 2890, -3562, 9673, 980, 26877, 11720, -5236]
6728e236K0014j0306n583k3607k0805L439Q856O269K3813K0166J9746p171m8968
6715a9373j8416M008k7139q633k294J9320K5533k9768M2788M1183k5427l6057
$$ y = [-5236, 14778, 4472, -1111, -24718, -45523, -42084, -33228, -26959, -3146, 17020, 36766, 29595, -19373, -37789, -33781, -60920, -69553, -71847, -52527, -26994, -56762, -13974, 27209, 1782, -34275]
$$ [...]
##END NTUPLES=NMR SPECTRUM
##END=
