##TITLE=Analysis number 316130
Compound Code cc 41403
Book Reference 378/196
Project Code adrs
Chemist Name benw
##JCAMPDX= 6.0         $$ Bruker NMR JCAMP-DX V2.0
##DATA TYPE= NMR SPECTRUM
##DATA CLASS= NTUPLES
##ORIGIN= Bruker BioSpin GmbH
##OWNER= nmr
$$ XWIN-NMR		Version 3.5
$$ Tue Dec 20 08:04:31 2005 GMT Standard Time (UT+0h)  MAYBRIDGE\nmr@NMR_250MHZ
##.OBSERVE FREQUENCY= 250.131544655141
##.OBSERVE NUCLEUS= ^1H
##.ACQUISITION MODE= SIMULTANEOUS (DQD)
##.ACQUISITION SCHEME= undefined
##.AVERAGES= 16
##.DIGITISER RES= 18
##SPECTROMETER/DATA SYSTEM= dpx250
##.PULSE SEQUENCE= zg30
##.SOLVENT NAME= CDCl3
##.SHIFT REFERENCE= (INTERNAL, CDCl3, 0, 16.4499)
##AUDIT TRAIL= $$ (NUMBER, WHEN, WHO, WHERE, WHAT)
$$ ##TITLE= Audit trail, XWIN-NMR		Version 3.5
$$ ##JCAMPDX= 5.01
$$ ##ORIGIN= Bruker BioSpin GmbH
$$ ##OWNER= nmr
$$ C:\u/data/dgb/nmr/ADRS/14000/pdata/1/auditp.txt
$$ ##AUDIT TRAIL=  $$ (NUMBER, WHEN, WHO, WHERE, WHAT)
(   1,<2005-12-20 08:03:55.13 +000>,<MAYBRIDGE\nmr>,<NMR_250MHZ>,
      <created by zg, POWCHK disabled, PULCHK disabled
       configuration hash MD5:
       62 19 C7 07 E1 42 D1 B7 37 6C 3D D0 77 39 F9 E6
       data hash MD5: 64K
       FB 43 50 77 CF 5B B4 B9 B1 4F 18 5B 77 8B 0D 31>)
(   2,<2005-12-20 08:04:12.19 +000>,<MAYBRIDGE\nmr>,<NMR_250MHZ>,
      <Start of raw data processing
       ef LB = 0.3 FT_mod = 6 PKNL = 1 SI = 32K 
       data hash MD5: 32K
       E5 EA 94 64 45 E0 B6 7D CC B3 31 A1 F7 C0 F3 1A>)
(   3,<2005-12-20 08:04:16.24 +000>,<MAYBRIDGE\nmr>,<NMR_250MHZ>,
      <apk 
       data hash MD5: 32K
       B5 6B 66 12 B4 39 B8 CA 00 72 8B B2 61 4B 36 49>)
(   4,<2005-12-20 08:04:17.52 +000>,<MAYBRIDGE\nmr>,<NMR_250MHZ>,
      <abs ABSG = 5 
       data hash MD5: 32K
       EE CF 8B 5A B5 71 AA AA A4 1A 53 00 D2 31 DE 71>)
$$ ##END=
$$ 
$$ hash MD5
$$ EE 75 C7 C4 BB 65 52 F9 EB 2F 37 C0 C6 A5 BD FA
##$RELAX= 
##$RELAX= 
##$RELAX= 
##$RELAX= 
##$RELAX= 
##$RELAX= 
##$RELAX= 
$$ Bruker specific parameters
$$ --------------------------
##$DU= <C:\u>
##$EXPNO= 14000
##$NAME= <ADRS>
##$PROCNO= 1
##$TYPE= <nmr>
##$USER= <dgb>
##$AMP= (0..31)
100 100 100 100 100 100 100 100 100 100 100 100 100 100 100 100 100 100 
100 100 100 100 100 100 100 100 100 100 100 100 100 100 
##$AQSEQ= 0
##$AQ_mod= 3
##$AUNM= <au_zg>
##$AUTOPOS= <18 >
##$BF1= 250.13
##$BF2= 250.13
##$BF3= 250.13
##$BF4= 250.13
##$BF5= 500.13
##$BF6= 500.13
##$BF7= 500.13
##$BF8= 500.13
##$BYTORDA= 1
##$CFDGTYP= 0
##$CFRGTYP= 5
##$CHEMSTR= <none>
##$CNST= (0..31)
1 1 145 1 1 1 1 1 1 1 1 1 1 1 1 1 1 1 1 1 1 1 1 1 1 1 1 1 1 1 1 1 
##$CPDPRG= <>
##$CPDPRG1= <>
##$CPDPRG2= <>
##$CPDPRG3= <>
##$CPDPRG4= <mlev>
##$CPDPRG5= <mlev>
##$CPDPRG6= <mlev>
##$CPDPRG7= <mlev>
##$CPDPRG8= <mlev>
##$CPDPRGB= <>
##$CPDPRGT= <>
##$D= (0..31)
0 1 0 0 0 0 0 0 0 0.06 0 0 0 0 0 0 0.0002 0 0 0 0 0 0 0 0 0 0 0 0 0 0 
0 
##$DATE= 1135065833
##$DBL= (0..7)
120 120 120 120 120 120 120 120 
##$DBP= (0..7)
150 150 150 150 150 150 150 150 
##$DBP07= 0
##$DBPNAM0= <>
##$DBPNAM1= <>
$$ [...]
##$SUBNAM7= <"">
##$SUBNAM8= <"">
##$SUBNAM9= <"">
##$SW= 20.6930455092707
##$SWIBOX= (0..15)
0 0 3 0 0 0 0 0 0 0 0 0 0 0 0 0 
##$SW_h= 5175.983436853
##$TD= 65536
##$TD0= 1
##$TE= 294.16
##$TE2= 300
##$TE3= 300
##$TEG= 300
##$TL= (0..7)
0 120 120 120 120 120 120 120 
##$TP= (0..7)
150 150 150 150 150 150 150 150 
##$TP07= 0
##$TPNAME0= <>
##$TPNAME1= <>
##$TPNAME2= <>
##$TPNAME3= <>
##$TPNAME4= <>
##$TPNAME5= <>
##$TPNAME6= <>
##$TPNAME7= <>
##$TPOAL= (0..7)
0.5 0.5 0.5 0.5 0.5 0.5 0.5 0.5 
##$TPOFFS= (0..7)
0 0 0 0 0 0 0 0 
##$TUNHIN= 0
##$TUNHOUT= 0
##$TUNXOUT= 0
##$USERA1= <user>
##$USERA2= <user>
##$USERA3= <user>
##$USERA4= <user>
##$USERA5= <user>
##$V9= 5
##$VALIST= <valist>
##$VCLIST= <CCCCCCCCCCCCCCC>
##$VD= 0
##$VDLIST= <DDDDDDDDDDDDDDD>
##$VPLIST= <PPPPPPPPPPPPPPP>
##$VTLIST= <TTTTTTTTTTTTTTT>
##$WBST= 1024
##$WBSW= 4
##$XGAIN= (0..3)
0 0 0 0 
##$XL= 0
##$YL= 0
##$YMAX_a= 344839
##$YMIN_a= -271667
##$ZGOPTNS= <>
##$ZL1= 120
##$ZL2= 120
##$ZL3= 120
##$ZL4= 120
##$ABSF1= 16.44993
##$ABSF2= -4.243242
##$ABSG= 5
##$ABSL= 3
##$ALPHA= 0
##$AQORDER= 0
##$ASSFAC= 0
##$ASSFACI= 0
##$ASSFACX= 0
##$ASSWID= 0
##$AUNMP= <proc_1d>
##$AZFE= 0.1
##$AZFW= 0.1
##$BCFW= 0
##$BC_mod= 0
##$BYTORDP= 0
##$COROFFS= 0
##$CY= 12.5
##$DATMOD= 1
##$DC= 0
##$DFILT= <>
##$DTYPP= 0
##$F1P= 14.0000005364418
##$F2P= -0.99999901652339
##$FCOR= 0.5
##$FTSIZE= 32768
##$FT_mod= 6
##$GAMMA= 0
##$GB= 0
##$INTBC= 1
##$INTSCL= 1
##$ISEN= 128
##$LB= 0.3
##$LEV0= 0
##$LPBIN= 0
##$MAXI= 10000
##$MC2= 0
##$MEAN= 0
##$ME_mod= 0
##$MI= 0
##$NCOEF= 0
##$NC_proc= -3
##$NLEV= 6
##$NOISF1= 0
##$NOISF2= 0
##$NSP= 0
##$NTH_PI= 0
##$NZP= 0
##$OFFSET= 16.44993
##$PC= 1
##$PHC0= 89.44685
##$PHC1= 7.847566
##$PH_mod= 1
##$PKNL= yes
##$PPARMOD= 0
##$PSCAL= 4
##$PSIGN= 0
##$REVERSE= no
##$SF= 250.130018026127
##$SI= 32768
##$SIGF1= 0
##$SIGF2= 0
##$SINO= 400
##$SIOLD= 32768
##$SREGLST= <1H.CDCl3>
##$SSB= 0
##$STSI= 32768
##$STSR= 0
##$SW_p= 5175.98343685301
##$SYMM= 0
##$S_DEV= 0
##$TDeff= 65536
##$TDoff= 0
##$TI= <Analysis number 999999
Compound Code 99
Book Reference 9
Project Code 9>
##$TILT= no
##$TM1= 0
##$TM2= 0
##$TOPLEV= 0
##$USERP1= <user>
##$USERP2= <user>
##$USERP3= <user>
##$USERP4= <user>
##$USERP5= <user>
##$WDW= 1
##$XDIM= 32768
##$YMAX_p= 439059693
##$YMIN_p= -229884
$$ End of Bruker specific parameters
$$ ---------------------------------
##NTUPLES= NMR SPECTRUM
##VAR_NAME=  FREQUENCY,     SPECTRUM/REAL,   SPECTRUM/IMAG
##SYMBOL=    X,             R,               I
##VAR_TYPE=  INDEPENDENT,   DEPENDENT,       DEPENDENT
##VAR_FORM=  AFFN,          ASDF,            ASDF
##VAR_DIM=   32768,         32768,           32768
##UNITS=     HZ,            ARBITRARY UNITS, ARBITRARY UNITS
##FACTOR=    0.157963299565203, 1,           1
##FIRST=     4114.62133521338, 0,            0
##LAST=      -1061.36210163963, 0,           0
##MIN=       -1061.36210163963, -229884,     0
##MAX=       4114.62133521338, 439059693,    0
$$ Real data points
##PAGE= N=1
##DATA TABLE= (X++(R..R)), XYDATA
$$ [...]
18414B8043371L701126M630729L555746J211819j062152k304364k022783k471904
18406C3281588m561195n598765m964667m334039l645064k572732j644779j051174
18398D909173p27586n77949m44267l74353l41625k81970j17993j05056j03334
18389A835040j27996o8462L797N2150N1847q231J5958M3450J6966k0529k6364
18378A767626p1267j28958j32911j31555j81244j47733j06905o5786n2140l0835
18368G18292m9081n0916j00670l52O5129Q5178J1373K2168M1434O0469O8291n0266
18356H21049j61272r2693n8819n5438o2991n2423p1782j6519K7022P6670l657
18345C49147k3295l9883N166L9298J9218j2123K735m4417l6811p761O5226L6292
$$ plain form
18414 28043371 31744497 36375226 39930972 41142791 40080639 37776275 35753492 33281588
18406 33281588 28720393 23121628 18156961 13822922 10177858 7605126 5960347 4909173
18398 4909173 4181587 3603638 3159371 2785018 2443393 2161423 2043430 1938374 1835040
18389 1835040 1707044 1638582 1642379 1694529 1746376 1738145 1754103 1797553 1814519 1793990 1767626
18378 1767626 1696359 1567401 1434490 1302935 1121691 973958 867053 801267 749127 718292
18368 718292 669211 618295 517625 517273 582402 667580 678953 701121 742555 803024 871315 821049
18356 821049 659777 567084 508265 452827 389836 337413 265631 249112 276134 352804 349147
18345 349147 325852 285969 291135 330433 349651 337528 340263 295846 259035 251274 316500 352792
18333C52792P3764Q8494P0419J01114N7659N6238J12362O4914J1414j2807n4102
18322I22261J4476L8411m3431j19423j32713p9785n1314p8100p2533l9046J7577
18311C76380P5346K3378n0008l3835r0299O970O2675l0831O617q336q8638n5427
18299A93992K9719K7580k7400l4359K8878m436j8480K0247O1003J06263J53758
18288E36765R2071L0103M7448O4922L5990l3502n4899o4191M5169O677M9896K7674
18276G84123J43631J85315J79396J24112O6584J8107J35596J49396M6351r6701
18266A735910j75639k13852k70880k83191j46669o1505k2070M8191O3621J11518
18256G85434J16919L4290M698Q8240J10707p742k8867n5145j02511j06219q8349
$$ plain form
18333 352792 426556 515050 585469 686583 744242 800480 912842 977756 989170 976363 922261
18322 922261 936737 975148 931717 812294 679581 599796 548482 470382 397849 358803 376380
18311 376380 451726 475104 425096 391261 300962 307932 370607 339776 346393 338057 249419 193992
18299 193992 223711 251291 223891 189532 218410 213974 195494 215741 276744 383007 536765
18288 536765 628836 658939 706387 771309 807299 773797 718898 654707 699876 706553 756449 784123
18276 784123 927754 1113069 1292465 1416577 1483161 1501268 1636864 1786260 1832611 1735910
18266 1735910 1560271 1346419 1075539 792348 645679 584174 562104 610295 673916 785434
18256 785434 902353 936643 941341 1029581 1140288 1132546 1103679 1048534 946023 839804 751455
18245G51455j37782j68851r1476m995L1902L5770k7060l748M2759M8298R7681
18234E73953N4059N522R2549J00210m681k7606j8941l3937o0621l2129p9925r1704
18222D76749m6335m1506l7068j932Q04l3595p9327J0107j2230j6662k9161q2398
18210A07446j7095k045M3584J04133J3876J8507M3238J7692L5653P4038J19327
18199E58354R9731Q5669R0460P5236L6825l1037l0130p1302l5317N4010m2232
18188G90267j09028j00243o09n7744p5211J2430n8428m605j4185q233N9107O1750
18176D95268Q9745j9134p201N4704J9310N6322j9995j07921K0463O3461n526n2842
18164E86654k7092L8626K356J3571P541j2405Q0965K8035N188P0551J00949J25251
$$ plain form
18245 751455 613673 444822 353346 348351 380253 416023 388963 385215 427974 476272 573953
18234 573953 628012 633534 726083 826293 821612 794006 775065 741128 680507 648378 568453 476749
18222 476749 430414 388908 351840 349908 350712 317117 237790 247897 235667 219005 189844 107446
18210 107446 90351 88306 131890 236023 249899 268406 311644 329336 364989 439027 558354
18199 558354 658085 743754 834214 909450 946275 915238 885108 813806 778489 832499 790267
18188 790267 681239 580996 580387 522643 447432 459862 401434 396829 382644 374411 433518 495268
18176 495268 585013 565879 558678 613382 632692 689014 669019 561098 581561 645022 639496 586654
18164 586654 559562 598188 600544 614115 621656 609251 690216 718251 723439 793990 894939 1020190
18152A020190R8704J48260J19457N6231R9914M7407J35200J44072Q6741N3079
18142B009255N2573J07357J42494K03680K94400L82349M83181O24503P69503R83690
18132F052985J540776K383212L689179N757990Q345841J0348884J0510539Q244868
18124E6874274L627834j888936o199932q695441q992625p751669n890911l925512
18116A7157082k176081q81955J42868J100597K383935M172971P258252J2794418
18108D1952087K2871056L9406194M8850930J4393535j5899097j5247738k3394022
18101A12932945k9282607k3348459j6314269j1455046q146380n530567l684469
18094A5171148k657287j931989j426212j161619r19892o93683n88544n23516m06278
$$ plain form
18152 1020190 1118894 1267154 1386611 1442842 1542756 1590163 1725363 1869435 1956176 2009255
18142 2009255 2061828 2169185 2311679 2515359 2809759 3192108 3675289 4299792 5069295 6052985
18132 6052985 7593761 9976973 13666152 19424142 27769983 38118867 48629406 56874274
18124 56874274 60502108 58613172 52413240 43717799 34725174 26973505 21082594 17157082
18116 17157082 14981001 14099046 14241914 15342511 17726446 21899417 29157669 41952087
18108 41952087 64823143 104229337 153080267 167473802 151574705 136326967 112932945
18101 112932945 83650338 60301879 43987610 32532564 24386184 18855617 15171148
18094 15171148 12513861 10581872 9155660 7994041 7074149 6380466 5791922 5268406 4862128
18085D862128k88574l12995k43955k65112k44227j48102j09278j91589k54124
18076B804172k56071k80037k43984k22198j61169j09701r8854l1597j5810k7620
18066A357131m9527j03341j31203l7160p7899j05668j9577k7545j0071N845q8293
18055G12692l3688L4451n222p1525o0844l3362p608k4970M2467Q9818M5064p2077
18043F15196n5219j00330j16194m4959k9248L7202M6772j4379r9919O9459R3100
18032D01481j3511k1230N486P918o4933n6894k6664N3938Q7040O0804R7251J19384
18020F50070J59407K28928J94563J14845P7560k3021j35740j64910k29790k07367
18010F64545j77631r6734j4081P9148J7757l3163m959M256L6508l3460J10037
$$ plain form
18085 4862128 4573554 4260559 4016604 3751492 3507265 3359163 3249885 3058296 2804172
18076 2804172 2548101 2268064 2024080 1801882 1640713 1531012 1432158 1400561 1384751 1357131
18066 1357131 1307604 1204263 1073060 1035900 958001 852333 832756 805211 795140 800985 712692
18055 712692 679004 713455 708233 636708 575864 542502 534894 509924 552391 642209 687273 615196
18043 615196 559977 459647 343453 298494 269246 306448 353220 338841 238922 308381 401481
18032 401481 387970 366740 372226 380144 315211 258317 231653 285591 372631 433435 530686 650070
18020 650070 809477 1038405 1232968 1347813 1425373 1402352 1266612 1101702 871912 664545
18010 664545 486914 390180 376099 455247 473004 439841 434882 439138 475646 442186 552223
17999E52223K25660J58610R6811P1786l0988j13652r4025j21269j82032j63804
17989C99320q3632m3254k2800L2040L1617n4387r3643o0019J4203N5659K2627
17978A97731M2001N3393P3459L4098l7559l4644j3118j4905j2012K32j7544o6404
17966B04728k4928m6885l1091J5014p54J4815R3895L988k5283J9475L369L4962
17954B61305Q8969O5095J3038J0415M222l6128K8308L6115l5909l6793k8795o797
17942C63045m592l2552p6427l4383l3266l5747m8026m4616K4407M0443j1058r707
17930I7521j9060K9601R6900j5676j06087K3438P1679J08505R2283J00174J35773
17919F15051P2854J7541K875r9216k12313j92496o7986q8861q634J5278M7904
$$ plain form
17999 552223 777883 936493 1033304 1105090 1074102 960450 866425 745156 563124 399320
17989 399320 315688 272434 249634 281674 313291 258904 165261 105242 119445 175104 197731
17978 197731 239732 293125 366584 400682 363123 328479 315361 300456 288444 288676 271132 204728
17966 204728 179800 132915 101824 116838 116084 130899 224794 228782 203499 222974 226343 261305
17954 261305 350274 415369 428407 438822 443044 406916 435224 471339 435430 398637 369842 363045
17942 363045 358453 325901 249474 215091 181825 146078 98052 53436 77843 118286 107228 97521
17930 97521 78461 108062 204962 189286 83199 106637 178316 286821 379104 479278 615051
17919 615051 687905 705446 708321 609105 396792 204296 136310 47449 38815 54093 101997
17908A01997L7998K4063P2606L2078k3614N5728J50323J36269J41535J46930O7210
17897I43123K5633r4541j34412l461l367o936r0188n1859l0780n8690k2009L4327
17885E06840k2079j40629q1669o0981J2956k8491k4322m3785o6054J3456N1195
17874A16437k1031o6334O868L846J978o662K6459P675J2435J9191J8500p160n0771
17861F1431l3114m0354m1730j137K3541O5722M6630r39J5383j4184K1864J1095
17849A14208O910l6908m1980N749J3594k5305j1715J8577M6142r723M8632l7949
17837I0232l5465k3203k0529M1616J3945k4563R395j816Q364k8278K2673N5577
17825A07948J2349P923l0854n0837k5755L9257l5090m1214J0036r868K210k031
$$ plain form
17908 101997 139995 164058 236664 268742 245128 300856 451179 587448 728983 875913 943123
17897 943123 968756 874215 739803 736342 732975 726039 635851 583992 553212 494522 472513 506840
17885 506840 484761 344132 262463 201482 214438 185947 161625 117840 51786 65242 116437
17874 116437 95406 29072 35940 39786 41764 35102 61561 69236 81671 100862 119362 112202 61431
17861 61431 28317 -12037 -53767 -54904 -31363 34359 80989 80050 95433 81249 103113 114208
17849 114208 121118 84210 42230 47979 61573 36268 24553 43130 89272 79549 128181 90232
17837 90232 54767 31564 11035 52651 66596 42033 51428 49612 57976 29698 52371 107948
17825 107948 120297 128220 97366 46529 20774 60031 24941 -16273 -6237 -16105 -13895 -15926
17813a5926j4875M857M3551J3285j6012L5358L7268m2619m3355j6542l2963P9467
17801C1494L3963j7479k355L1380P2236O6182J3024k5242L0345J7056L9518r361
17789B80761o8630l2398q9750m9261J8950k329K1053l1488N991M8671L1584N3646
17777A86800M9662M6449M6527K4354M903j3202m6220p2616l5828o6543O661k9702
17765A01245k9017m9937k849j590k758J9629r591K8624M5219j8094n7121N9889
17753H3649N8043r128l6677L8598J03093R0508l688l6760m0718q2800n2816m9220
17741F2084q2563L1666M9674M5741M9790K9406L3740l1992L7072j2112L1131K1413
17729B65050k4215K357P641n0936N5952K4913k6943q1805q7411q2073J1104M150
$$ plain form
17813 -15926 -30801 -25944 17607 30892 14880 50238 87506 44887 1532 -15010 -47973 31494
17801 31494 65457 47978 45623 77003 149239 215421 228445 203203 233548 250604 290122 280761
17789 280761 212131 179733 89983 40722 59672 57343 78396 46908 52899 101570 133154 186800
17777 186800 236462 282911 329438 353792 358695 345493 299273 226657 190829 124286 130947 101245
17765 101245 72228 22291 19442 17852 15094 34723 25132 53756 98975 80881 23760 83649
17753 83649 141692 132564 95887 134485 237578 328086 324398 287638 246920 164120 111304 62084
17741 62084 -20479 11187 60861 106602 156392 185798 219538 187546 224618 212506 243637 265050
17729 265050 240835 243192 250833 199897 255849 280762 253819 172014 84603 2530 13634 17784
17717A7784Q972k1299K99J5716J9432N2236J8826l0393k9500l7875k3494L9233
17705B9937L6368m4562n301j1954L9003L3500j572K889j4752n3134r849k3758
17693b3185j1718J18763l5655m9832o196L7355j6286k996j3161m1010J14479M9805
17681A20363L3752j4342Q433n7308j3042L4260j4417l7028m0338J2373M6700j5824
17669F3582J9634P938L5284m901k0368N0634N382m6069K0684K3015k4084N870
17657A36601n9677J88N4248o3994r1871J3637J1056K4804m7092M77j2328K5425
17645h526L340J414L1008n4260k3631M3373M215j0244o801J0491M3529J4243J4263
17632F2414l1727L42L2206M6489m8551q5781p1875m7324P8608j1878J0059K4341
$$ plain form
17717 17784 26756 5457 5756 21472 40904 93140 111966 81573 52073 14198 -9296 29937
17705 29937 66305 21743 16442 4488 43491 76991 75419 78308 63556 10422 573 -23185
17693 -23185 -34903 83860 48205 -1627 -7823 29532 13246 10250 -2911 -43921 70558 120363
17681 120363 154115 139773 148206 90898 77856 112116 97699 60671 20333 32706 79406 63582
17669 63582 83216 91154 126438 121537 101169 151803 157185 111116 131800 154815 130731 136601
17657 136601 76924 77112 131360 67366 -24505 -10868 188 24992 -22100 -21623 -33951 -8526
17645 -8526 -5186 -3772 27236 -27024 -50655 -7282 -3067 -13311 -20112 -9621 33908 48151 62414
17632 62414 30687 31029 63235 109724 61173 -24608 -96483 -143807 -65199 -77077 -67018 -42677
17620d2677N24q535R1128k80l9597q129P0527n4203j5398k1026l9280N7187M7929
17607C8170K1742r364j4736N4622k5047k4609L0917m0875m9091M1938K5401J8592
17595F7660J770J0485r341l8592K1844M207P290j829m1992K0333P2437J6937l7396
17582I3813n467o2916m611N3919L2084q444O273j4555N3445q549m3629k1688J9413
17569H9088R7055j0343j03492n3395m1199j257r073J2147N7221k0201l9501M682
17557a8268M6164k0100J9558p3082m9804R203O4965K1787j802J9338J3060J8852
17545D9871O714n3744K1017Q627L4339O9577O6360Q6896K2671q833n3434o4806
17533A85255Q613j3812n3294m6474J5419M4631m2189k0624R8718N717l5712O7502
$$ plain form
17620 -42677 -42153 -50688 40440 40160 563 -7566 62961 8758 -6640 -27666 -66946 -9759 38170
17607 38170 59912 50548 35812 90434 65387 40778 71695 30820 -18271 23667 49068 67660
17595 67660 69430 79915 70574 31982 53826 58033 65323 63494 21502 41835 114272 131209 93813
17582 93813 88346 25430 20819 74738 106822 98378 104651 90096 143541 134992 91363 69675 89088
17569 89088 186143 175800 72308 18913 -22286 -23543 -32616 -20469 36752 16551 -22950 -18268
17557 -18268 27896 7796 27354 -45728 -95532 -86329 -21364 423 -1379 17959 31019 49871
17545 49871 56585 2841 23858 32485 66824 136401 202761 289657 312328 303495 250061 185255
17533 185255 193868 180056 126762 80288 95707 140338 98149 77525 176243 181960 146248 213750
17521B13750J00008N7024K8058j8426n1888K1294j8647J3693n2055j10582n3117
17510A29112K0029k7344o1596l0818J853m589j2363M5304k9508J0895L8624Q537
17498H8136n7764k5202o4614l3872J8583L9326Q593m6258l2241J962M2577L8297
17486b2477q2993n3057O1992M3838j8595p2118n3181J14099L8730k237o619o630
17474e9248j379j3089j8290L094P2521P2014n9086l702q800K6971K7544n2367
17462a3817m7983n3239o710L0817M1185j1638L3236K2086q1222j4475q381Q9424
17450b0717Q1975M5086L1304m3327p3108k1204L5913N9880J07340J50512J51343
17439E04997J36800k512j06563k15268j58256k0766k811l1792n1046n2914M9120
$$ plain form
17521 213750 313758 370782 398840 380414 328526 349820 331173 344866 292811 182229 129112
17510 129112 149141 121797 60201 29383 31236 26647 14284 59588 30080 40975 79599 88136
17498 88136 30372 5170 -59444 -93316 -74733 -35407 -26814 -73072 -105313 -103351 -60774 -22477
17486 -22477 -105470 -158527 -96535 -52697 -71292 -143410 -196591 -82492 -43762 -45999 -52618 -59248
17474 -59248 -60627 -73716 -92006 -88912 -16391 55623 -3463 -7165 -15965 11006 38550 -13817
17462 -13817 -61800 -115039 -121749 -90932 -49747 -61385 -28149 -6063 -87285 -101760 -110141 -20717
17450 -20717 61258 106344 137648 94321 21213 9 35922 95802 203142 353654 504997
17439 504997 641797 639285 532722 317454 159198 138432 135621 103829 52783 -131 48989
17428D8989M0157r7658k1314K1595M4704L9163n8083J1270L9448m2156M844l7127
17416f168n4652L3002R2355J1828K4916l573o330k9032m049k764r729j528j9301
17403B4975k7427M4548L6097p587l9083l1872P059l1773j5251n7943m619N1515
17391e1361P8937N7506k6676m9738j1320K2970J4370Q975m2802q6745J4759N9949
17379a1176p3043L4351L5345K2755M1481J5166N4818N920n6544J8836L442N0157
17367A41508J5936L4386J2483J0208j9730o1030j935K62o0093l0774o739M9692
17355H4174J08186j1383o2178o4958n3924J7393O7814M1341l4468J8839M5228
17344A56064l8570n2439j4488n8503r687M3597P4215l9683p1690n1261q67o942
$$ plain form
17428 48989 89146 -8512 -29826 -8231 36473 75636 17553 28823 68271 26115 30959 -6168
17416 -6168 -60820 -27818 64537 76365 101281 97708 91378 62346 58297 55533 45804 44276 24975
17403 24975 -2452 42096 78193 70606 31523 -349 6710 -25063 -40314 -98257 -102876 -51361
17391 -51361 27576 85082 58406 8668 -2652 20318 34688 43663 861 -85884 -71125 -11176
17379 -11176 -84219 -49868 -14523 8232 49713 64879 119697 125617 69073 87909 91351 141508
17367 141508 157444 191830 204313 214521 194791 133761 131826 132088 71995 41221 34482 84174
17355 84174 192360 180977 118799 53841 -83 17310 85124 126465 91997 110836 156064
17344 156064 117494 65055 50567 -7936 -17623 25974 100189 60506 -11184 -62445 -63312 -70254
17332g0254K3318Q9283O3576j6912l6882l7632K5334k4436L9827k4448l4335K7541
17320B3980L4943q951L1043J5105o2747O109P3605J2975l3402l5053j3252j4941
17308B9414J4290l3668M7097P7439M5457R860j4697j5224p218j4290K7320R494
17296A75274J0495m5539m4613m4308J0833J4272P6810n886J3379P320J6646N3296
17284B37979m8052o1214m853K7453n475L6966P8333m261K759k7939K0945N976
17272B58617O5718R8403k41L8468J161L5206M1959J12517J15615O4198M2089j0918
17260H62792Q2896J63943K17069J28472J1800J06221J52039K00332K12912J38330
17250B276806J88095K34947L00143N23998P44987R23896J388672K200662L513051
$$ plain form
17332 -70254 -46936 42347 105923 89011 52129 14497 39831 15395 55222 30774 -3561 23980
17320 23980 58923 49972 81015 96120 33373 39482 113087 126062 92660 57607 44355 29414
17308 29414 43704 10036 57133 134572 180029 189889 175192 159968 152750 138460 165780 175274
17296 175274 185769 140230 95617 51309 62142 76414 153224 147338 160717 168037 184683 237979
17284 237979 189927 128713 123860 151313 145838 182804 261137 256876 259635 231696 252641 258617
17272 258617 324335 422738 422497 460965 462126 497332 539291 651808 767423 831621 873710 862792
17260 862792 945688 1109631 1326700 1455172 1466972 1573193 1725232 1925564 2138476 2276806
17250 2276806 2464901 2699848 2999991 3523989 4268976 5192872 6581544 8782206 12295257
17241A2295257O064431R547694J0348386N057811n13470r01326J145561L268976
17233D6313320K038566l460826o820677o795982o845915o076722m159287k262285
17225A1930192r86167l0211Q95094K142459M198149P280089R842712P197829P29082
17216D3199228j646018o0945K007235K659905j356673o105777p015660o890999
17208B4790296o661901n158052l287072j985445j270286r46303p48481n99178
17200D133578m43136l33643k71296k77507k70882j93891j67704k58335j94159
17191A723025r5486m3889p1256j32346n2058o0372q6506n4180r3617j12846r2852
17180H27617n4143r7357j22909m7261j6910j4336P063k4673k2880J022l8413l9068
$$ plain form
17241 12295257 18359688 27907382 38255768 43313579 42800109 41898783 43044344 46313320
17233 46313320 48351886 44891060 38070383 31274401 24428486 18351764 14192477 11930192
17225 11930192 10944025 10913814 11808908 13951367 18149516 25429605 35272317 42470146 43199228
17216 43199228 41553210 41492265 43499500 46159405 44802732 38696955 31681295 24790296
17208 24790296 18128395 12970343 9683271 7697826 6427540 5481237 4732756 4133578
17200 4133578 3690442 3356799 3085503 2807996 2537114 2343223 2175519 1917184 1723025
17191 1723025 1627539 1583650 1512394 1380048 1327990 1267618 1181112 1126932 1033315 920469 827617
17180 827617 773474 676117 553208 505947 489037 474701 481764 457091 434211 435233 396820 357752
17168C57752J7661J0236k3469j6685j4522K9075j4546l9283q8197j5825L9939
17157B42136j3324k0646m820l4613P360n97m9270K2368M0073k5727j5313J6164
17145A63791m3980j0036o357J7843l0841M973m320q164J9689M7238L156j7361
17133A35631k249L9057K1740o9897k800K6830j3901K1963k0960m7692k9850L3372
17121I1244N6755P683j7562J4091L7504M2413K0074L0276J9162m3689J3920J5115
17109B86986r901M3771j8996J5704p1168R48P8776J23103J68401J44853J00174
17098H62651J0886m647R175M7195M4935l6506p1641j53976j29958L6866O5557
17087F80537J09362R911l4379j1271N7102J01268J69107J66788P731j14895q4783
$$ plain form
17168 357752 375413 385649 362180 345495 330973 360048 345502 306219 218022 202197 242136
17157 242136 228812 208166 203346 168733 176093 175496 126226 148594 188667 162940 147627 163791
17145 163791 119811 109775 103418 121261 90420 95393 91073 82909 102598 149836 152992 135631
17133 135631 133382 172439 194179 124282 121482 148312 134411 156374 135414 87722 57872 91244
17121 91244 147999 155682 138120 152211 189715 232128 252202 282478 301640 257951 271871 286986
17109 286986 277085 320856 301860 317564 246396 247344 326120 449223 617624 762477 862651
17098 862651 873537 868890 878065 925260 970195 933689 862048 708072 578114 614980 680537
17087 680537 789899 799810 765431 754160 811262 912530 1081637 1248425 1256156 1141261 1056478
17076A056478q9621l8974k9623p3277o0697o7174o9162p5796o7318N383N8604
17065E48823k8516J3734K3775k9634m531m5452q2558l9429m5743o9266j76757
17054F4446p7819j0381L6331K0265m7594n4509m353N7610Q0576M063j1618p9841
17042b2824o1424J2358m4917L92N4491l3624R546J8451l7780K0521N7515L9331
17030A2036K4040k9600k0021L6497K8587j7918Q538l7749p1128J7966J9647n3711
17018h2816N393j9961K1709J05556O9041n4555m550m885j7764P54k6104L8185
17006C0003k8019p2861j3453K1653n226L2461M1848r208K425L4009J5752k3451
16994B5933l8503l0759l18J6747N7594K5310o37j9203q452J4922j451k8444J8784
$$ plain form
17076 1056478 966857 927883 898260 824983 764286 697112 627950 552154 484836 490219 548823
17065 548823 520307 534041 557816 528182 523651 478199 395641 356212 310469 241203 64446
17054 64446 -13373 -23754 12577 32842 -14752 -69261 -73614 -16004 64572 68635 57017 -22824
17042 -22824 -84248 -71890 -116807 -116415 -61924 -95548 -86002 -67551 -105331 -84810 -27295 12036
17030 12036 36076 6476 -13545 22952 51539 33621 42159 4410 -66718 -48752 -29105 -82816
17018 -82816 -77423 -97384 -75675 29881 98922 44367 39817 34932 17168 17922 -8182 30003
17006 30003 1984 -70877 -84330 -62677 -67903 -35442 6406 -2802 -377 33632 49384 25933
16994 25933 -12570 -43329 -43647 -26900 30694 56004 55367 36164 27712 42634 41183 12739 31523
16981C1523j5074J1806j2216j2457q139k8398m6870J6022j0637k7893J5208L5050
16969e2075M3769N335n7080K7657N6568n8968p770k209j7433j2626l1500M2467
16957f3865O152m0019j988N2923J5512m646J5833j5623j6381K8789L61k8364m0562
16944i1878j3929L169K8303M4668l170O8946k7480l5817r0440L4790N3398K4683
16932d757K7767k8973n6740n7477n4748m7141J3544P3256Q9135n5716J6312M1197
16920d4341K4578N9195m1838p886N3178N3111K334m2945k9731j0451O747j7056
16908D895o236n5945J0898N4588j5728J9368M2278R830j06432l278N2783j1996
16896d975P835l7099l3981L1259j1381J4617L9347J8813l7315l7050R168M112
$$ plain form
16981 31523 16449 28255 16039 3582 -4557 -32955 -79825 -63803 -74440 -102333 -87125 -52075
16969 -52075 -8306 -2971 -60051 -32394 24174 -34794 -42564 -44773 -62206 -74832 -106332 -63865
16957 -63865 -57713 -97732 -99720 -46797 -31285 -35931 -20098 -35721 -52102 -23313 -22952 -51316 -91878
16944 -91878 -105807 -102638 -74335 -29667 -32837 36109 8629 -27188 -117628 -82838 -29440 -4757
16932 -4757 23010 -5963 -62703 -120180 -174928 -222069 -208525 -135269 -46134 -101850 -85538 -44341
16920 -44341 -19763 39432 -2406 -10292 42886 95997 98331 55386 25655 15204 21951 4895
16908 4895 -1341 -57286 -46388 8200 -7528 11840 54118 63948 -42484 -45762 7021 -4975
16896 -4975 2860 -34239 -68220 -36961 -48342 -33725 5622 24435 -12880 -49930 -40762 -36650
16884c6650J975m3759j7668K4458R9502P556J1923J343J2681K4679l0979k6278
16872B8783K1445M6651k6914j4817k9434l4719J9557k1392j5444J5667L0827L8337
16860E8547o805m1523O710N818K9324p1745m9808m6842k2778O260M8146j2091
16848i6787L4066K9303J6242L7904p500O331l4363n3549K2791J4076O208k1744
16836d7022o65N869L7336M6762j2546l5114n7297n201L7117L4030O6056p219O141
16823F8247k0763k9878O1585L2288j4264n0756q827P6813L7693p5901o0310J6833
16811C2760K5896k9943k590l2999M716N3701l5106R902k0143m4274l5206J7208
16799e6078N5318j3066o2775l2595O334K0765L7917L7768K9743Q846l0902r103
$$ plain form
16884 -36650 -34675 -78434 -96102 -71644 27858 35414 47337 48680 61361 86040 55061 28783
16872 28783 50228 96879 69965 55148 25714 -9005 10552 -10840 -26284 -10617 20210 58547
16860 58547 51742 10219 16929 22747 52071 -19674 -69482 -116324 -139102 -132842 -84696 -96787
16848 -96787 -62721 -33418 -17176 20728 13228 19559 -14804 -68353 -45562 -31486 -25278 -47022
16836 -47022 -47687 -41818 -4482 42280 29734 -5380 -62677 -67878 -30761 3269 69325 62106 68247
16823 68247 47484 17606 79191 111479 97215 46459 37632 114445 152138 76237 15927 32760
16811 32760 58656 28713 26123 -6876 -2160 51541 16435 26337 6194 -38080 -73286 -56078
16799 -56078 -760 -13826 -76601 -109196 -102862 -82097 -44180 -6412 23331 32177 1275 -7828
16787g828J5848q26M8173P032k9606o3851k5554K8505k0883O979Q8360L2026n9807
16774A8568p2389l7112M7723q191l1834p694K005K0252O6474J063k7888N2667
16762B3644L7838l202J21j7581K4107m1662r2483l866N1210j6565O709j3845O587
16749c8988k7199l5729J8773P4887K3250j1633l4700k1929n9320p207O5469J6322
16737c8004N1136j965m6511l4189K6358N7530k9776m0638l1463k6331l0589K4493
16725a19949M2930K8809O197m8056l8245m2121N1111O0225q239o929J5680j9296
16713g7883L4906M4753Q9807n3116j1229N7619K3939Q05J1225j1486o7571l4712
16701G057l0103m6310J7682J4653j6195J6689K8363m097J2355k63l9549K5762
$$ plain form
16787 -7828 8020 7194 55367 62399 32793 -31058 -56612 -28107 -48990 -42011 46349 78375 18568
16774 18568 -53821 -90933 -43210 -51401 -83235 -90929 -88924 -68672 -2198 -1135 -29023 23644
16762 23644 61482 58280 58401 40820 64927 23265 -69218 -73084 -21874 -38439 -31730 -45575 -38988
16749 -38988 -66187 -101916 -83143 -8256 14994 3361 -31339 -53268 -112588 -119795 -54326 -38004
16737 -38004 13132 11167 -35344 -69533 -43175 14355 -15421 -56059 -87522 -113853 -144442 -119949
16725 -119949 -77019 -48210 -42013 -90069 -128314 -170435 -119324 -59099 -67338 -74267 -58587 -77883
16713 -77883 -42977 1776 91583 38467 27238 84857 108796 109601 120826 109340 41769 7057
16701 7057 -23046 -69356 -51674 -37021 -53216 -36527 -8164 -12261 94 -169 -39718 -13956
16689a3956m134J9738j4005K720L8618k5978n753j4182P569k2763M1056M8477
16677E7407M3292N9493N9491K0247j5355r1289k2375J04512O0616m1634o4961
16666A69444q1964k2275k2146J6681M9857n1872m4757K5085J8910j3661M0411
16655H3713N1757J0523j4794j4668L4141M7520n904j8641o7783m3217o585O605
16643F2667n1049m0731J2262k6004J5881K4370m0645k7749m9446m135N5362Q201
16631f1016M0380L4977l3730J097K1565k9677l1032P6515p114n1516k3206N253
16619e7504K1419K6166n6034j2598k7034M96k8159O744O5447L9361j4696j0790
16607d7182k9337R3583K1018j3556n2143k6140Q957J6604N3206l5550o7562M1375
$$ plain form
16689 -13956 -18090 1648 -12357 -9637 28981 3003 -2750 -16932 -9363 -32126 8930 57407
16677 57407 100699 160192 219683 239930 224575 133286 110911 215423 276039 234405 169444
16666 169444 87480 65205 43059 59740 109597 57725 12968 38053 56963 43302 83713
16655 83713 135470 145993 131199 116531 150672 198192 192288 173647 105864 62647 56062 62667
16643 62667 11618 -29113 -16851 -42855 -26974 -2604 -43249 -70998 -120444 -124579 -69217 -61016
16631 -61016 -20636 14341 -19389 -18292 3273 -26404 -57436 19079 11965 -39551 -62757 -57504
16619 -57504 -36085 -9919 -65953 -78551 -105585 -105089 -133248 -126504 -61057 -21696 -36392 -47182
16607 -47182 -76519 17064 38082 24526 -27617 -53757 -44800 -28196 25010 -10540 -78102 -36727
16595c6727o243m0101j8041r409M3531Q262M6540l4792m4154n694M3263N852N3808
16582F095K2787O9962k7046j14461p5266k5651N432P6008J8354K4532L0939l4527
16570b2842l6917N7171k6465O791K2814M14n0711R26K8658m1924j8547L8636L4657
16557g339k5798j1344p2602K0604k1055M917L4868L0585J2511N14l5291J2360
16545e7070l589j4359N8745P3125j9832n4850k4097l4176o847q603j594R123N7901
16532b6123O4591q756k3239R559l5514j733P6590J0097J4113j7648l5890j2518
16520A3529M2964k5889j4511l6530k5608p80L8944P237J6349K1923L617m3185
16508a940J4325M7037l6436l3291l8530j1217M0748L1134J6011k8740m3738N1126
$$ plain form
16595 -36727 -42970 -83071 -101112 -110521 -66990 -58728 -12188 -46980 -91134 -96828 -53565 -47713 6095
16582 6095 28882 98844 71798 -42663 -117929 -143580 -138148 -62140 -43786 -19254 11685 -22842
16570 -22842 -59759 -2588 -29053 -22262 552 966 -49745 -48819 -20161 -62085 -80632 -41996 -7339
16557 -7339 -33137 -44481 -117083 -96479 -117534 -112617 -77749 -47164 -34653 -34139 -69430 -57070
16545 -57070 -60659 -75018 -16273 56852 37020 -17830 -41927 -76103 -82950 -91553 -93147 -84024 -26123
16532 -26123 38468 29712 6473 16032 -19482 -21215 55375 65472 79585 61937 26047 13529
16520 13529 56493 30604 16093 -20437 -46045 -46825 -7881 -644 15705 37628 41245 -1940
16508 -1940 12385 59422 22986 -10305 -48835 -60052 -19304 11830 27841 -899 -44637 6489
16496F489N947O23P00K0497K1954K0723n0811p4872q073N6576k7357j4863J1707
16483c0760P631l3047M588n489N664R484K1182k4049r271k5241K839M493J2797
16470e9179l2288m056k3433R408k301P6700K5359M720k9137m4693j3829M60m793
16457i7062L8963M0746L2960l0379R034J6766L8259j7418l3398k175L3055K4156
16445E3507j01245o8610L0721m687q306O0415J0930r411J6197L175K489M8755
16433C3930O307j6033j6466O567j1801M547m0659k3434K5235n6147k3874j6514
16421a28342M1898O5711L9631m8118j9876Q708J152k9412k2644M809q6951K3367
16409a50067M5301L4479Q0215N6184j3484m2769J991N151p8724m8803M3009K2721
$$ plain form
16496 6489 12436 13059 13759 34256 56210 76933 26122 -48750 -56823 -247 -27604 -42467 -30760
16483 -30760 -23129 -56176 -51588 -57077 -51413 -41929 -20747 -44796 -54067 -79308 -76469 -71976 -59179
16470 -59179 -91467 -95523 -118956 -109548 -111849 -35149 -9790 -5070 -34207 -78900 -92729 -92269 -97062
16457 -97062 -58099 -17353 15607 -14772 -5738 11028 49287 31869 -1529 -3704 29351 53507
16445 53507 -47738 -116348 -85627 -90314 -98620 -38205 -27275 -36686 -20489 -17314 -14825 33930
16433 33930 40237 24204 7738 14305 2504 7051 -33608 -57042 -31807 -87954 -111828 -128342
16421 -128342 -86444 -20733 18898 -29220 -49096 -40388 -39236 -68648 -91292 -86483 -173434 -150067
16409 -150067 -104766 -70287 9928 66112 52628 9859 11850 17001 -61723 -110526 -67517 -44796
16397d4796k7378J9614m7195K4138M942r895K4612K5706j3781j3526k90k2043
16385g9892L117L7396L27J9714J02470j16j8988n3531K0969M2499P275k1439m0630
16372A9171o0026m3992J6818r991n66O8652M8553j1031l7707N5977J0726l1823
16360B4761q0846J1978M0510M0228L9027J9561p9746k2157M6927Q4848m293p906
16348A12892p0690p377K7836m9734n4522l3015J1912J9483m8847M0122O3215k056
16336I219m0075N151k0404P4539k7718l0221M8149L9325o1469k7739o148L4245
16324c146L1502J1003m0782j34711k7046j2088K5031M0948O3734J1436K924K1894
16312i301l0487J7072n893q6347l1250L8185J7659K2089J6323R30J6154L6604
$$ plain form
16397 -44796 -72174 -52560 -99755 -75617 -70675 -80570 -55958 -30252 -44033 -57559 -57849 -79892
16385 -79892 -76775 -39379 -39052 -19338 83132 83016 64028 10497 31466 73965 81240 59801 19171
16372 19171 -40855 -84847 -68029 -78020 -78586 -9934 38619 27588 -10119 45858 56584 24761
16360 24761 -56085 -44107 -3597 36631 75658 95219 15473 -6684 40243 125091 120798 112892
16348 112892 42202 34825 62661 12927 -41595 -74610 -62698 -43215 -92062 -51940 11275 9219
16336 9219 -30856 -25705 -46109 28430 712 -29509 18640 57965 -3504 -31243 -37391 -3146
16324 -3146 28356 39359 -1423 -136134 -163180 -175268 -150237 -109289 -45555 -34119 -31195 -9301
16312 -9301 -39788 -22716 -28609 -114956 -146206 -108021 -90362 -68273 -51950 -51020 -34866 1738
16300A738K5932Q402N6555k2659k5934M850K0465R304N0497l5910l8349r4534
16288c9643Q69R530P612K0463O3597p026r3048n1567P672K1111j9426j7601N1419
16275d6038o405m8163k292q385J9701R9031L2532l4048m0225k5742L215j4481
16263g1300J1693M567l3779n673j3864O0851J6848K3742J1174P462p387J912j8512
16250a2266K3197l0786p888L681J0538M2420K438l660K2899K5090n0655m8306
16238b3298k6270K486k4552k1406P0796L4145L2417k2847j8990N0199r820l7949
16226D911J2679M1490K6679J5814l0665K1565k9383n0215j4707r251N210L1042
16214B5169J4194j3593r969l1249o6218L4267N2623K661l3703R757K4858l4295
$$ plain form
16300 1738 27670 36072 92627 69968 44034 48884 69349 78653 129150 93240 54891 -39643
16288 -39643 -38774 -29244 -21632 -1169 62428 55402 -37646 -89213 -81541 -60430 -79856 -97457 -46038
16275 -46038 -52443 -100606 -102898 -111283 -91582 7449 39981 5933 -34292 -60034 -56819 -71300
16263 -71300 -59607 -55040 -88819 -94492 -108356 -47505 -30657 -6915 4259 11721 4334 6246 -12266
16250 -12266 10931 -19855 -27743 -24062 -13524 28896 31334 27674 50573 75663 25008 -23298
16238 -23298 -49568 -47082 -71634 -93040 -22244 11901 44318 21471 2481 52680 42860 4911
16226 4911 17590 59080 85759 101573 70908 92473 63090 12875 -1832 -11083 -5873 25169
16214 25169 39363 25770 15801 -15448 -81666 -47399 5224 7885 -25818 -16061 8797 -25498
16202b5498j6770J8197K4386o003j2202l7586k4473M6552J6598K7559J3628n5493
16190c1105L6381J8799j7678l1313m8124j8284K270k5043j4556J6038K7818n152
16178h9949j2147K0733p542l5520K4591j1901N085J3961J8771L9957J7307m5868
16166f2522p837J563N5894K5766j2798k2195n1901j2936K2864L5918J5407J9896
16154G119n3715n1186N6534O0557N733p607M799m5909J5914K6286o3685p709L8636
16141a4233l1105l4681K2744K6269M9787m7478m7650l8087K8199P2302K1626K3087
16129C0780j9661l8044p4022m9612K0103L0827m451N018M7217M7469N572p6636
16117g5440k7202R031q0K9098J505J5639N1439j1678k2564o011j3362K3986O977
$$ plain form
16202 -25498 -42268 -24071 315 -5688 -17890 -55476 -79949 -33397 -16799 10760 24388 -31105
16190 -31105 5276 24075 6397 -24916 -73040 -91324 -89054 -114097 -128653 -112615 -84797 -89949
16178 -89949 -102096 -81363 -88905 -124425 -99834 -111735 -106650 -92689 -73918 -33961 -16654 -62522
16166 -62522 -70359 -68796 -12902 12864 66 -22129 -74030 -86966 -64102 -28184 -12777 7119
16154 7119 -46596 -97782 -41248 19309 25042 17435 22234 -23675 -7761 18525 -45160 -52869 -14233
16141 -14233 -45338 -80019 -57275 -31006 18781 -28697 -76347 -114434 -86235 -13933 7693 30780
16129 30780 11119 -26925 -100947 -150559 -130456 -99629 -104080 -99062 -51845 -4376 1196 -75440
16117 -75440 -102642 -93611 -93691 -64593 -63088 -47449 3990 -7688 -30252 -36263 -49625 -25639 -18662
16104a8662k6115l8828P711P279J0304k9042k7168K2098J5783R332Q658l552J0984
16091e1218K6856j4979K3951K9144L8272n0151p385L4790K3427L9759J1391k7249
16079G6608m1498J7551M713o3011k0526k3498j3150L8335O0832L5648n716q7134
16067b0846N3198O1699l0087m6652J0332k7187j5934l2722K9405M2738j8552n587
16055a95J4802m3898L9051K2317l3374r327n0216j7551R3893l1845n7080k0784
16043i4207K9919O2580N3267j5046m3498N6887j9994m8121m5270M9651P602l6051
16031d2281o6990l9441O385L612L1543O9227m2691m7705K9555L6345q773N761
16019f5453M09j8713l808n9191L5324N2198N1289L877j1760L580m7818o2060K3528
$$ plain form
16104 -18662 -44777 -83605 -75894 -68615 -58311 -87353 -114521 -92423 -76640 -67308 -58650 -62202 -51218
16091 -51218 -24362 -39341 -15390 13754 52026 1875 -5510 29280 52707 92466 103857 76608
16079 76608 35110 52661 57374 -5637 -26163 -49661 -62811 -24476 36356 72004 66288 -20846
16067 -20846 32352 94051 63964 17312 27644 457 -15477 -48199 -18794 23944 5392 -195
16055 -195 14607 -29291 9760 32077 -1297 -10624 -60840 -78391 15502 -16343 -73423 -94207
16043 -94207 -64288 -1708 51559 36513 -6985 49902 29908 -18213 -63483 -13832 -6230 -42281
16031 -42281 -109271 -148712 -142327 -138715 -107172 -37945 -80636 -128341 -98786 -62441 -71214 -65453
16019 -65453 -65044 -83757 -87565 -146756 -111432 -59234 -7945 -4068 -15828 -12248 -60066 -122126 -98598
16006i8598N2820K0670n8992L583Q825P693J5944K4349N2088o9277j9682J5054
15994d5523r3283P3381O3775k7290N1364Q9796j3631p1136K1898R179O218o666
15982E8082l7992n5928l2737j7630R424k1896Q232K812L8891L0166O710P454m9074
15969e3486K3222O3199L4055l3981J2318K2794n6871m3062J8109J2910k6550J1126
15957a6217L1524l2644J3057M837p599k6974N2725J4190M3238K2270m2122j2289
15945D3996n8357o7817l5857O3953Q206n7892L9401L7911K633l36K8228p125l1737
15932c4793j3205K3053Q7084M1558k8766p2332l5283J2423L7393l1088K7159L4319
15920D7522q3219o6404M3796L2423M4701P5772O5344l1703r6349L5549j9573K4180
$$ plain form
16006 -98598 -45778 -25108 -84100 -80517 -71692 -63999 -48055 -23706 28382 -40895 -60577 -45523
15994 -45523 -138806 -65425 -1650 -28940 22424 112220 98589 27453 49351 58530 64748 58082
15982 58082 20090 -35838 -68575 -86205 -76781 -98677 -90445 -87633 -48742 -18576 -11866 -4412 -53486
15969 -53486 -30264 32935 66990 33009 45327 68121 11250 -31812 -13703 -793 -27343 -16217
15957 -16217 15307 -17337 -4280 557 -7042 -34016 18709 32899 76137 98407 56285 43996
15945 43996 -14361 -82178 -118035 -54082 -45876 -103768 -64367 -26456 -23823 -24159 4069 -3056 -34793
15932 -34793 -47998 -24945 62139 103697 74931 2599 -32684 -20261 17132 -13956 13203 47522
15920 47522 -35697 -102101 -58305 -25882 18819 94591 159935 128232 31883 67432 47859 72039
15908G2039j5240o0937p03k1991o874L4524r630J8047M5005k0371n1101K848k399
15895a6783N6697m797k3247n7461P895O738p5428k8792K82P6856l1650J0392Q1478
15882B180o273k924L4127o144n4063j9612j8567K3700K4681j9015J3487J8965
15870i458r865K9410K0363m7402J4306O487O018j3063m7137l3850K5538P303j1113
15857f2463R703p66m3675l7064J1662L0986N0135n125n444p5103l9894O2296N4407
15844e0345M2565K2119J2857K1648M6439k6470o54k0889m6696l1143L0226l3965
15832c4308n8532L5386J2707J0919J0368k1723K44L3126k089l4640k3818K632
15820f9728K539K5916K7508J9892J2140l665l7698n706j0397N2290Q1857K8258
$$ plain form
15908 72039 56799 -4138 -4841 -26832 -33706 818 -8812 9235 54240 33869 -17232 -14384 -16783
15895 -16783 39914 35117 11870 -45591 -37696 -30958 -106386 -135178 -134896 -58040 -89690 -79298 2180
15882 2180 -4093 -7017 27110 20966 -33097 -52709 -71276 -47576 -22895 -41910 -28423 -9458
15870 -9458 -19323 10087 30450 -16952 -2646 3841 9859 -3204 -50341 -84191 -58653 -51350 -62463
15857 -62463 -52760 -53526 -97201 -134265 -122603 -91617 -41482 -46607 -52051 -127154 -167048 -104752 -50345
15844 -50345 -7780 14339 27196 48844 95283 68813 68159 47270 574 -30569 -343 -34308
15832 -34308 -92840 -57454 -44747 -33828 -23460 -45183 -44939 -11813 -13902 -48542 -72360 -69728
15820 -69728 -67189 -41273 -13765 6127 18267 14602 -23096 -28802 -39199 13091 94948 123206
15808A23206l8841p8171l2617K2888l8204N725K5922o3000n7719M204L7968J01932
15796A3293K9248k1785k4261j1462o091K6023j8666j1762o803j2011j1285N1301
15784d261M7435M2720j0898J5705j4180j106o9500k3742k8758m9370J4946M0290
15772d0719L6744M4109J6096m0469O233L617J9924k6872K3068k9l9014m5822k3073
15759f6207L8143o536j3769k1630K1190J3983L7328M0562o82J1198m860l158j2108
15746C3454l0611q1033m3962k3345O0451O7279Q262K9962m3434j3839n3341L935
15734h6222L9797K9148L0357P817m7987M566L0397k88O6797N9610m8510m9818
15722C5664k4152o5272j08542Q2942Q8596K2737O178L068m4501j8704k706L7398
$$ plain form
15808 123206 84365 6194 -26423 -3535 -41739 -36014 -10092 -73092 -130811 -126607 -88639 13293
15796 13293 42541 20756 -3505 -14967 -21058 4965 -13701 -25463 -32266 -44277 -55562 -4261
15784 -4261 43174 85894 74996 90701 76521 75415 5915 -17827 -46585 -95955 -81009 -40719
15772 -40719 -3975 40134 56230 15761 21994 25611 45535 18663 41731 41702 2688 -43134 -66207
15759 -66207 -28064 -34600 -48369 -69999 -48809 -34826 2502 43064 42382 53580 48720 45562 33454
15746 33454 2843 -78190 -122152 -145497 -85046 -17767 -9505 20457 -22977 -36816 -90157 -86222
15734 -86222 -46425 -17277 13080 20897 -27090 -22524 7873 7585 74382 133992 85482 35664
15722 35664 11512 -53760 -162302 -79360 9236 31973 38151 41219 -3282 -21986 -24692 12706
15710A2706l1072l4077K7768L4647R895k5938k1276J9005M641k2958l4732L6361
15698b5030K9429m5694l1501l4263K595L3710p67L9054K1444k8613m6611J0018
15686g6229Q7642k710o4632J6191J9837j4206l2194l8574k2251L1155J5197M7803
15674c2971j5142L2712N8875l7939n6970j2369P048J2060j1872j6291K6428O73
15662d5758N07j3195l8695M3391L2795l9673j2980J050q309M9800K4432j4460
15650b1095j4911k1510j8770p280O4091P0804j426m2500n4762r011k4463N169
15638g5664m181O7500J8865l1951l5360p67j6824l7486J6497P1533R7252l172
15626F6242n676M4407j3998J0799l63p0949m9374k95j7627P425Q533J2965l23
$$ plain form
15710 12706 -18366 -52443 -24675 9972 19867 -6071 -27347 -8342 -3701 -26659 -61391 -25030
15698 -25030 4399 -41295 -72796 -107059 -104464 -70754 -71521 -32467 -11023 -39636 -86247 -76229
15686 -76229 11413 8703 -55929 -39738 -19901 -34107 -66301 -104875 -127126 -95971 -80774 -32971
15674 -32971 -48113 -15401 43474 5535 -51435 -63804 -56756 -44696 -56568 -72859 -46431 -45758
15662 -45758 -45251 -58446 -97141 -53750 -20955 -60628 -73608 -72558 -80867 -31067 -6635 -21095
15650 -21095 -36006 -57516 -76286 -83566 -19475 51329 49903 7403 -47359 -56370 -80833 -75664
15638 -75664 -79845 -12345 6520 -25431 -60791 -61558 -78382 -115868 -99371 -27838 69414 66242
15626 66242 60566 104973 90975 101774 101411 30462 -18912 -19207 -36834 -29409 -20876 -7911 -8234
15613h234M058L0342K6346l9401k1669K4932l0115k3280j7970m1065M1970J0227
15601d3859L122j6534N0849N710k0215j1507J3942M6026J2433j3069L2994Q633
15589F8525k8308p962L0282k7813O37k6802o1808l0850j8870m288r622R170L1623
15576g6086m6923K673M4056M3889j4054N4981L1235M8143m4078m1542n0228j3366
15564f1300K5377N6323k8260p139m8336L0137k422r552J7222j3807l2862K099
15552g2520l0297L4936R628j6959K7824L0533k7288J4522j3779N63M8710j6672
15540a0799M579N5047P99o5992k8829j875J9534J1757J2613n5756O5763M1422
15528D8263n7348m5905j672J9672J6672P4743L0513n4718k3583k2785J2939M6784
$$ plain form
15613 -8234 -4176 26166 52512 13111 -8558 16374 -13741 -37021 -54991 -96056 -54086 -43859
15601 -43859 -40737 -57271 -6422 -712 -20927 -32434 -18492 27534 39967 26898 59892 68525
15589 68525 40217 32255 62537 34724 35361 8559 -53249 -84099 -102969 -107257 -116879 -107709 -76086
15576 -76086 -123009 -120336 -76280 -32391 -46445 8536 39771 87914 43836 2294 -47934 -61300
15564 -61300 -35923 20400 -7860 -14999 -63335 -33198 -35620 -45172 -27950 -41757 -74619 -72520
15552 -72520 -102817 -67881 -58253 -75212 -47388 -16855 -44143 -29621 -43400 -42837 5873 -10799
15540 -10799 -6220 48827 49626 -16366 -45195 -47070 -27536 -15779 -3166 -58922 6841 48263
15528 48263 -9085 -54990 -56662 -36990 -20318 54425 84938 30220 6637 -16148 -3209 43575
15516D3575L368M430j8422J730M036k5419J7208P984j9835m1024N270Q3741K381
15503F9023o6419o386J3637k6983k5553l5842Q710M224J0027j1383q306L2101
15491d3150k5466Q0162j2340l9411p873L2271K3280k1388j8098k6748o2698K5853
15479i5606L2357J5691Q204l4425M300O5426K9869j3011L3834m9746p8727k7193
15467a09027J2038O5387P5493k5347m721K5766k9694n2692j8647K6609O248M9381
15455B0794N0214L7843n8733o4581K3828L398o989m620n7503p842J5199j3178
15443f2170Q08L5755k7742K0525R93J0417J5960K9719k2494k0225k2668K7820
15431a3302P0467M2558n2216p7688L9429P3308j7259j4178R791l4910n2952J9613
$$ plain form
15516 43575 46943 51373 32951 34681 38717 13298 30506 38490 18655 -22369 -17099 66642 69023
15503 69023 2604 -3782 9855 -17128 -42681 -78523 -69813 -65589 -55562 -66945 -75251 -43150
15491 -43150 -68616 11546 -794 -40205 -48078 -15807 7473 -13915 -32013 -58761 -121459 -95606
15479 -95606 -63249 -47558 -39354 -73779 -69479 -4053 25816 12805 46639 -3107 -81834 -109027
15467 -109027 -96989 -31602 43891 18544 13823 39589 9895 -42797 -61444 -34835 -28587 20794
15455 20794 71008 108851 50118 -14463 9365 12763 5774 1154 -56349 -64191 -48992 -62170
15443 -62170 -61362 -25607 -53349 -32824 -31831 -21414 -5454 24265 1771 -18454 -41122 -13302
15431 -13302 57165 99723 47507 -30181 9248 82556 65297 51119 60910 26000 -26952 -7339
15419g339j2323n0115j1186j4128P5989Q3415k0077P681K9735O112l8149l1921
15407A7694j634k1346r504n8332r547J0729P4420J7719m6303k1600J3993L0842
15395b869l675l5941p769O3298M247m8068k5658N2663Q267P0636K6470r9393j2409
15382a0201K5964p887K8121N8686p7217r3222k6621N3977N4752k782k0326K5450
15370H694k6379m4268K4396K3118l2318j0937O6466j4999m1834m4873K3379l199
15358g2754p408L3619K9763m1555n4767J5860M6773K1453L4385L9472k288k9645
15346A2908r727M785J728k2706l1891l3902k5747J3915l744k073L175Q0344M02
15333a2533n0951q4888M1366L4070j8159K3697M7223l896M4544M6676q5090n6978
$$ plain form
15419 -7339 -19662 -69777 -80963 -95091 -19102 64313 44236 51917 81652 87764 49615 17694
15407 17694 16060 -5286 -14790 -73122 -82669 -71940 2480 20199 -26104 -47704 -33711 -2869
15395 -2869 -6544 -42485 -50254 13044 17291 -30777 -56435 -3772 4495 75131 101601 2208 -10201
15382 -10201 15763 7876 35997 94683 17466 -75756 -102377 -48400 6352 3570 -16756 8694
15370 8694 -17685 -61953 -37557 -14439 -46757 -57694 8772 -6227 -48061 -92934 -69555 -72754
15358 -72754 -80162 -46543 -16780 -58335 -113102 -97242 -50469 -29016 5369 44841 42553 12908
15346 12908 3181 7966 9694 -13012 -44903 -78805 -104552 -90637 -94381 -96454 -93279 -12935 -12533
15333 -12533 -63484 -148372 -107006 -72936 -91095 -67398 -20175 -24071 20473 67149 -17941 -74919
15321g4919J155j907P5319k890m2349j5852J7667M7323j3078j1914L429J6921
15309a095j9090L3515J06338N289r0560o6612J9792R2514k8108k6274K9172j6799
15297C8082n4318O700P492M795L9634L0197l1900N13k4924k8261J5729l2014q5241
15284a13516K5546R2160l885l6447L7666J6835n6268l0996M6237j2387N571K0115
15272i369L2805n344M2199R578r787k9715j14258l3961L6489P318J7700J7342
15260c9003J748K364K847k0235K1902Q9821O8338K4525q0445k2926N1512O993
15248A07441n3884j09724k5623L6259r036k0595L1726O4436l432j6890K7192k8807
15236i37l78p483k0144l5333m8927m6650O8749O9995n0834l8876P1879K1140l9314
$$ plain form
15321 -74919 -73764 -75671 -352 -3242 -45591 -61443 -43776 3547 -9531 -21445 -18016 -1095
15309 -1095 -20185 13330 119668 124957 34397 -32215 -12423 80091 51983 25709 54881 38082
15297 38082 -16236 -9536 -2044 2751 42385 72582 40682 41195 16271 -11990 3739 -28275 -113516
15284 -113516 -87970 4190 305 -36142 1524 18359 -37909 -68905 -22668 -35055 -29484 -9369
15272 -9369 23436 18092 60291 69869 60082 30367 -83891 -117852 -81363 -74045 -56345 -39003
15260 -39003 -37255 -34891 -32044 -52279 -30377 59444 127782 152307 71862 48936 100448 107441
15248 107441 53557 -56167 -81790 -45531 -54567 -75162 -43436 21000 17568 678 27870 -937
15236 -937 -1315 -8798 -28942 -64275 -113202 -159852 -91103 -21108 -71942 -110818 -38939 -17799 -57113
15223e7113m650M874l3703r907K4138N2827J6138m1454q226j082k464j0667O0305
15210a0984N2369l9811j6695K0008K1758m963j0892n386J220k407k2087M5386
15198B7516K6706o903n2675j5230J0900j6612M243q958N9977J0320l5183l7506
15186c3405o7889l718L1654P6090j8045L3139J4694J4376P522p723M1321N220
15174I3236k3274M5326j787m3157o9498r950l6715m2973N591N9728L8897O872
15162B2296k8344R348p834k7823m8508j0152N2140J781K950j7485J9105O9606
15150C7080J3208m595J5359k0693j2002n7035m9289j3629M4012N9970J02671j0584
15138A04473p5202n4831J4391L6626M3704K9816k9917k7415q1445n6144L215Q7652
$$ plain form
15223 -57113 -61763 -56889 -90592 -100499 -76361 -23534 -7396 -48850 -57076 -58158 -60622 -71289 -10984
15210 -10984 41385 1574 -15121 4887 26645 21682 10790 5404 6624 4217 -17870 27516
15198 27516 54222 47319 -5356 -20586 -9686 -26298 -22055 -31013 28964 39284 4101 -33405
15186 -33405 -101294 -105012 -73358 2732 -15313 17826 32520 46896 54418 46695 88016 93236
15174 93236 69962 115288 113501 70344 846 -9104 -45819 -88792 -83201 -23473 15424 22296
15162 22296 -6048 3300 -4534 -32357 -80865 -91017 -38877 -37096 -34146 -51631 -32526 37080
15150 37080 50288 45693 61052 40359 28357 -28678 -77967 -91596 -47584 12386 115057 104473
15138 104473 29271 -25560 -11169 25457 69161 98977 69060 41645 -39800 -95944 -92729 -5077
15126e077R755p8055p5226k636j5584O7264N0787J1515j156j2257J9431K1012
15114a0227n0864n6649M490p3231n439O8042L9325J480M081K3142m1447L4897
15102f2400N0484L0133J9957j2802n1199Q68r831l8956K4387K9317k8073o3257
15090a11372M1366N7932J0432K00J2906K7279N5363j9306q7207j00270o3708K0721
15078a55664K1107K4444J6581M2853J3915J3293J1694K7129k0288K176J6163K7335
15066D0738k9892L155M5898L5183j2267m0850m1428n2679l0186J0136M16l6227
15054a08003j5879j5744J0769P9284L4296l2966k4041k055M148L9400M2m9505
15042h0254K5287K7441k2754J1219K5966k372K7327J284P869r056o3031l4678
$$ plain form
15126 -5077 4678 -73377 -148603 -151239 -166823 -99559 -48772 -37257 -38413 -50670 -31239 -10227
15114 -10227 -61091 -117740 -113250 -186481 -191920 -123878 -84553 -83073 -78992 -55850 -97297 -62400
15102 -62400 -11916 18217 38174 25372 -25827 -24959 -34790 -73746 -49359 -20042 -48115 -111372
15090 -111372 -70006 -12074 -1642 -1442 11464 38743 94106 74800 -12407 -112677 -176385 -155664
15078 -155664 -134557 -110113 -93532 -50679 -36764 -23471 -11777 15352 -4936 -2760 13403 40738
15066 40738 10846 14001 59899 95082 82815 41965 537 -52142 -82328 -72192 -71776 -108003
15054 -108003 -123882 -139626 -128857 -49573 -15277 -48243 -72284 -74339 -70191 -30791 -30749 -80254
15042 -80254 -54967 -27526 -50280 -39061 -13095 -15467 11860 13144 21013 11957 -51074 -85752
15030h5752k6418K1577j329o789k0758l8387o3942R059M7813L2245R9195L3524
15018C8l8445r012K4930L2669R223J4108J7410j7661o7713o0665q692N4029O000
15005d3781m93j2075J0757m727m0318k0842m978L9515L6150L7427k9662r8637
14993a31664J4209O8899N7672P747o5251o1274K7855J1674m878Q977M6394p22
14981b0362m7644L8512L4521l051j7282m1328p2741K2489M7830o379n3964K462
14969a16937J4701J4475K5636L9592K8139N0974P6434O0478q1226j36464q2245
14958a06443l7731L1959K0791O9090l4269l3909Q5728K6608L0999o2196j7046
14947b6419n4425K9467Q4956j6028l2051j9508j7843j2812M8154R7632Q39n1901
$$ plain form
15030 -85752 -112170 -90593 -91922 -98711 -119469 -157856 -221798 -212739 -164926 -132681 -33486 38
15018 38 -38407 -47419 -22489 10180 19403 33511 50921 33260 -34453 -95118 -103810 -49781 -43781
15005 -43781 -44274 -56349 -45592 -50319 -90637 -111479 -116457 -76942 -40792 -3365 -33027 -131664
14993 -131664 -117455 -48556 9116 16863 -48388 -109662 -81807 -70133 -75011 -66034 -19640 -20362
14981 -20362 -68006 -29494 5027 1976 -15306 -56634 -129375 -106886 -59056 -65435 -119399 -116937
14969 -116937 -102236 -87761 -62125 -22533 5606 56580 133014 193492 112266 -24198 -106443
14958 -106443 -144174 -112215 -91424 -22334 -56603 -90512 -4784 21824 52823 -9373 -26419
14947 -26419 -80844 -51377 33579 17551 -14500 -34008 -51851 -64663 -16509 81123 81962 30061
14935C0061K9157j7937K149l1192k1510P2805l8118o6585j0388n579N9975P2705
14923G5543n5007k3814J2396N3471M9258l4566n1267n2120O2126L379l5680O1889
14911F5608P457j5360R708q7354j8928l26o9404k2562k612L3580L2534R088J8267
14898d0304J0972j5010J4490J839r743l1127L079M0021Q656r738L8566K9853k6205
14885A5349l1102K9214K4403l4849q4432l1407l8077M3711J08346r226n5993j6182
14873h0245J0909j1933n6954O093L0537L1367O4383K9427O44J9548p3389l9351
14861f8964K2811O0262K8335K8502K8383k2154j6949J7278L0909J371n3518j7648
14849C8618j1897P494j9140m6671m6312p224K2670M3748N2501k5352n1287m1053
$$ plain form
14935 30061 59218 41281 43430 12238 -9272 63533 25415 -41170 -51558 -57137 2838 75543
14923 75543 20536 -3278 9118 62589 111847 77281 26014 -26106 36020 39399 3719 65608
14911 65608 73065 57705 67413 -19941 -38869 -39195 -108599 -131161 -133773 -100193 -67659 -58571 -40304
14898 -40304 -29332 -44342 -29852 -28013 -37756 -68883 -65804 -25783 -17127 -26865 11701 41554 15349
14885 15349 -15753 13461 37864 3015 -81417 -112824 -150901 -107190 1156 -8070 -64063 -80245
14873 -80245 -69336 -81269 -138223 -132130 -101593 -70226 -5843 23584 24228 43776 -29613 -68964
14861 -68964 -46153 14109 42444 70946 99329 77175 60226 77504 108413 109784 56266 38618
14849 38618 26721 34215 15075 -31596 -77908 -85132 -62462 -18714 33787 8435 -42852 -83905
14837h3905K5186O3453M0032n9174l9069J8683o1111K0773M2004J576m9465j2846
14825i3863J5757M4211K7468P7578J2302K324k2962L4189n939K3124K402j9739
14813I6852P400n1316m5170m2328o2554N9405N8639k0071l3674l2927J29J1321
14801e4294q545L8510J31K6585M8416m3038q8176K2138K4926k3519m9483k8158
14789a34507M2903K7360m377Q999l871K0199L3060K296k1235m9510J2101K5905
14777d0677N2023L9438J4136K9715k7179k7773M391o790j1243n7881J7204Q675
14765e961m4316k6529L1654P7308r444R356K0545l1704p3931J5273Q448N3745
14753B4444j9134n3923n3715M0367K4103m1892j2415K1679J7080m4683L7701M9786
$$ plain form
14837 -83905 -58719 4734 44766 -14408 -53477 -34794 -95905 -75132 -33128 -31552 -81017 -93863
14825 -93863 -78106 -33895 -6427 71151 83453 85777 62815 97004 91065 114189 116591 96852
14813 96852 104252 52936 7766 -34562 -97116 -37711 20928 857 -32817 -65744 -65615 -54294
14801 -54294 -62839 -24329 -24198 2387 50803 7765 -80411 -58273 -33347 -56866 -106349 -134507
14789 -134507 -91604 -64244 -68621 -59622 -63493 -43294 -10234 -7938 -29173 -78683 -66582 -40677
14777 -40677 11346 50784 64920 94635 67456 39683 44074 37284 26041 -31840 -14636 -5961
14765 -5961 -50277 -76806 -45152 32156 22712 32068 52613 20909 -53022 -37749 -29301 24444
14753 24444 5310 -48613 -102328 -61961 -37858 -79750 -92165 -70486 -53406 -98089 -60388 -10602
14741a0602P387j9220j7166L2049n9288L1775J878K9406K7096k6841j9940j286
14729b4752l9525J6938L8560K2635r3749n1440K9087O6854M700J3213J7459M5288
14717D5268N5603l1596n7590n5156L7681k143l0975j333o758m401L49N6449k6311
14704b0913J1917m0526j5880n1985k081K291L7500P4478N828k3119l0907K1969
14692c1428J7499l7188K8780K9570j6599k3184K8395J2367K6466K0876p6360P502
14680a3304L4768M4787K0048n3827L982j0573k7972l6970L4505Lm8723l6135J0084
14667g9327k7123K528p759J8738J995j7239N37N8788M2685M4262M1060j6521k0687
14654D1937j179j8572L661j3422L5266m4618l0116K413o962n1738K6006N4192
$$ plain form
14741 -10602 -3215 -22435 -39601 -7552 -66840 -35065 -33187 -3781 23315 -3526 -23466 -24752
14729 -24752 -64277 -47339 -8779 13856 -79893 -131333 -102246 -35392 -30692 -17479 -20 45268
14717 45268 100871 69275 11685 -43471 -5790 -7933 -38908 -40241 -46999 -51400 -51051 5398 -20913
14704 -20913 -8996 -49522 -65402 -117387 -119468 -117177 -79677 -5199 629 -22490 -53397 -31428
14692 -31428 -13929 -51117 -22337 7233 -9366 -32550 -4155 8212 34678 55554 -20806 -13304
14680 -13304 21464 66251 86299 32472 36454 25881 -2091 -39061 -4556 -4553 -53276 -89411 -79327
14667 -79327 -106450 -103922 -111681 -92943 -90948 -108187 -107650 -48862 -6177 38085 79145 62624 41937
14654 41937 40758 22186 25847 12425 47691 3073 -27043 -24630 -31592 -83330 -57324 -3132
14642c132K7180o2528k3662J4140L0176K3053j0840m9246n944R627P4254k382
14630B0696j2121n8451k9948J5531L2242P2439m5498m7647j415N011M1359j5364
14618b3166l8641Q583M7686J5726k1978k2063j4654L336r320L9970Q037j4905
14606b1389j04412l7696Q5231R4303l3319k5286o919m1681M5936k0400o5541O3402
14594f7771N1314k0692J4820k2317n531k68M6654N7652j6703J2332k583M4110
14582I1017p93n0037j7851k4716m6056K2461J181k1823m6047N704P348N854L8654
14569c5104L1686K987o6974J840K7130M1297j7028M856M7637M8081l881r2108
14557i581l1345L3746k5380q788K3213O759M4795L7195J4303m07k138l0765l4154
$$ plain form
14642 -3132 24048 -38480 -62142 -48002 -17826 5227 -5613 -54859 -60803 -51176 23078 20696
14630 20696 8575 -49876 -79824 -64293 -32051 40388 -5110 -52757 -54172 -49161 -7802 -23166
14618 -23166 -61807 -53224 -5538 10188 -11790 -33853 -48507 -45171 -54491 -14521 -6484 -21389
14606 -21389 -125801 -163497 -78266 16037 -17282 -42568 -49487 -91168 -45232 -65632 -131173 -67771
14594 -67771 -16457 -37149 -22329 -44646 -50177 -50445 -3791 53861 37158 49490 46907 91017
14582 91017 90224 40187 22336 -2380 -48436 -25975 -24794 -46617 -92664 -86960 -79612 -73758 -35104
14569 -35104 -3418 -431 -67405 -65565 -38435 2862 -14166 -9310 38327 86408 82527 -9581
14557 -9581 -40926 -7180 -32560 -41348 -18135 -11376 33419 70614 84917 84510 82372 51607 17453
14544A7453N366o730L5254O5443J1133m2299n7593K3790J8812M7502J9397p2829
14532F4699K2718K1904J6515r85j5029N2398J2496K6719k1236r4678n3895l5035
14520c409N5541O8048p5959l504N9712k0144j2500K6601N0993l6824o6721o8154
14508b6320k4718K6744R3185M8872L584m2497k9502K2750n7183k8624o9476r4234
14496a77419N5042J09602J3394k5477J8520j3915P025j5509j6362M4041o56n1075
14484e2789J0335O0589N2980M9303o1416l4523l9955m4743L0466M1413p29N0270
14472F1201j4049J1851L7248l1362p2426n7868K6592P2962M8637N193n494J0996
14460I3481K7530k3362j8401N246n8772j6219N8569L7187J4229L3508n130o3408
$$ plain form
14544 17453 22819 16089 51343 116786 127919 85620 28027 51817 70629 118131 137528 64699
14532 64699 87417 109321 125836 124851 109822 162220 174716 201435 180199 85521 31626 -3409
14520 -3409 52132 120180 44221 40717 100429 80285 67785 94386 145379 108555 41834 -26320
14508 -26320 -51038 -24294 68891 117763 121347 78850 49348 72098 14915 -13709 -83185 -177419
14496 -177419 -122377 -12775 619 -24858 -6338 -20253 -13228 -28737 -45099 -1058 -1714 -52789
14484 -52789 -42454 18135 71115 120418 59002 24479 -15476 -60219 -29753 11660 10931 61201
14472 61201 47152 59003 96251 64889 -7537 -65405 -38813 34149 82786 87979 82485 93481
14460 93481 121011 97649 79248 84494 25722 9503 68072 105259 119488 152996 147866 84458
14448H4458p3488j1704k5182N0027l035P363P490n7440O3935R383N098m2725n0792
14435c6612K2907N2907M709k6490m0883J0271k5835n4552O5889M8718l9196N900
14423a2267K2039N7003N6339K9835j8125o4142J8283K5103K843q6779k7394o7748
14411f5010j6483P3603j2187l2008k4203q851L2637K1616n375o073j9740k1684
14399h3758o84P4352J4993n786Q016j172n0254r54L6884L5467L0139j176m3168
14386A2899P737J1344N6831k188r9241o6085l3912r0997K5537O9878O2680M905
14374d0612J655j7393j6150J8351P313L4753J4269J0037m0889l8170P796M6771
14362a2269K1408M6936l3178p3785k616Q3054J0515l2340l1240M0155L4287J2562
$$ plain form
14448 84458 10970 -734 -25916 24111 21076 28439 35929 -21511 42424 51807 56905 14180 -36612
14435 -36612 -13705 39202 43911 17421 -23462 -13191 -39026 -93578 -27689 21029 -18167 -12267
14423 -12267 9772 66775 123114 152949 134824 70682 88965 114068 116911 30132 2738 -65010
14411 -65010 -81493 -7890 -20077 -52085 -76288 -85139 -52502 -30886 -36261 -42334 -62074 -83758
14399 -83758 -84442 -10090 4903 -883 7133 5961 -44293 -45247 -8363 27104 57243 56067 12899
14386 12899 20636 31980 88811 86623 -12618 -78703 -112615 -203612 -178075 -108197 -45517 -40612
14374 -40612 -38957 -56350 -72500 -54149 -46836 -12083 2186 12223 -28666 -66836 -59040 -12269
14362 -12269 9139 56075 22897 -50888 -53504 29550 40065 7725 -23515 16640 50927 63489
14350F3489k6312J0l2388j0398n820J4747J1480n8911r510N034j2511K6571K7877
14337f642o805j4688l6041M0224J7491N3958L4271J1862P155m8121k9014O5O1947
14324H5662L8346k2902n9899k9057l3492k0860J1675K1178L5778j2638n4444J38
14312d0515j3437k6463N5867L4787k3814K9890j5411J2800J125m6019j8403O274
14300d3319O8072L7512K2190n2040n2531m1618J8828N1729J8236m8264j9545N0986
14288A0236K5399j6835j11087K2303N0311P0537o253j1157n121p4918p7837k0560
14276a44982N9922o221K5848M5301j1285L518j0343l2253L3561M6462N3315M2130
14264A04973l857k2285n3069m4539k1352M0294M9586k1373m4743n5851m7323l2668
$$ plain form
14350 63489 37177 37187 4799 -5599 -11419 3328 14808 -44103 -53613 -48579 -61090 -34519 -6642
14337 -6642 -13447 -28135 -64176 -23952 -6461 47497 81768 93630 100785 52664 23650 23715 85662
14324 85662 124008 101106 41207 12150 -21342 -42202 -30527 -9349 26429 13791 -40653 -40515
14312 -40515 -53952 -80415 -24548 10239 -13575 16315 904 13704 14829 -31190 -49593 -43319
14300 -43319 24753 62265 84455 32415 -20116 -61734 -42906 8823 27059 -21205 -40750 10236
14288 10236 35635 18800 -92287 -69984 -19673 50864 44611 33454 28333 -46585 -124422 -144982
14276 -144982 -85060 -91281 -65433 -20132 -31417 -27899 -38242 -70495 -36934 9528 62843 104973
14264 104973 101116 78831 25762 -18777 -40129 165 49751 28378 -16365 -72216 -119539 -152207
14252a52207O397L5653N7262p672m4161m609M2054M9624L6789l1032K5944L0827
14240D4869l3416p0339J042j1315k7920J7873O4549O3536K3156p323K6882k886
14228H8708j5680J5923J9245K726n6659r9299R283M904M1849O540J3106K1757
14216E2403n1286k0937l3669l1363j1351l624L9670J5271k0027L9515K0790n2063
14204e6671k0899j5631k4649K2129K9749M4943J0920m1246L303P9664l0124r32
14192E56k8966O098M17k3366j4363M9211O032J0457J5298m2669M5184M712o365
14179B2236L6138M0075j4837o288j3904p0283n4849j9909J827M0028j7551j2217
14167f9534L0258L8629J8125J3917N579L8091k1803k994m029K4374k7198m5442
$$ plain form
14252 -152207 -145810 -110157 -52895 -60567 -104728 -109337 -67283 -17659 19130 -11902 14042 44869
14240 44869 11453 -58886 -57844 -69159 -97079 -79206 -14657 48879 72035 64712 91594 88708
14228 88708 73028 88951 108196 110922 54263 -45036 -35753 -30849 11000 17540 30646 52403
14216 52403 1117 -19820 -53489 -84852 -96203 -99827 -60157 -44886 -64913 -25398 -4608 -56671
14204 -56671 -77570 -93201 -117850 -95721 -65972 -21029 -10109 -51355 -48052 31612 1488 556
14192 556 -28410 -22312 -21895 -45261 -59624 -10413 -4381 6076 21374 -21295 23889 28601 22236
14179 22236 58374 98449 83612 77324 63420 -6863 -61712 -81621 -79794 -39766 -57317 -69534
14167 -69534 -39276 -647 17478 31395 36974 75065 53262 50268 46239 70613 43415 -2027
14155b027p1146k4294M6221P040r021L113J1160K0645Q904N9000Q928n3824j6101
14142a1402M1616M702k4071m9863q093p069M2303j9190L7438K0606m3477n5593
14130g2093J1958N1391L0184j3103J3344k8757o3381j7109n101K4239K8066J2767
14118b7595J8004l6387L4375K6107p341l446K0178R83J3001L0406j1782K349K9507
14105H8359n7844K4065K5023o8707j6889K8904N6513k9667J233k6607j3431O196
14093A7148N9234K7349o1849l716k1706M5142L2854J3714j3103k125O3633l959
14081A52616j7322j0279k5436M530k9795J3562M256l8504k9197K9323Q721J0951
14069G3426O405k2706q0662K6110J1848K9430M6725J225L5936P1571M1224J1907
$$ plain form
14155 -2027 -73173 -97467 -51246 -44206 -53227 -50114 -38954 -18309 -9405 49595 58523 4699 -11402
14142 -11402 30214 34916 10845 -39018 -47111 -54180 -11877 -31067 6371 26977 -16500 -72093
14130 -72093 -60135 -8744 21440 8337 21681 -7076 -70457 -87566 -92667 -68428 -40362 -27595
14118 -27595 -9591 -45978 -11603 14504 7163 3717 23895 24878 37879 68285 56503 58852 88359
14105 88359 30515 54580 79603 10896 -5993 22911 79424 49757 50990 24383 10952 17148
14093 17148 76382 103731 41882 38166 16460 61602 94456 108170 95067 92942 156575 152616
14081 152616 135294 125015 99579 104109 74314 87876 92132 53628 24431 53754 62475 73426
14069 73426 79831 57125 -23537 2573 14421 43851 90576 91801 127737 199308 240532 252439
14057B52439j942j3989L5325L0474m8207k2384M2113M9605N2442J5994J172j8278
14045C74764J925K9j4945O0087j1682J8149k7894N3276O5199R045l7774L2879
14033E23058R685O1710N4137L2809K1636m0036K3675J2816J4106K9676j6052p2930
14021F54290n3260k4029m9830J1047j9687Q373j1983j23k2540K1014N5801l4925
14009E34148j10077r7432L9228K8532L391l4845K2632J8678k7226K5648J3144
13998D15821o3753n1104r5826r178M0501J2083J8239l0569j4391q965L5397J3168
13986B61423r3125k7280j7814L5716P1416J1233k8979j8852k6229l2889l0728
13975A03892k8569J2247J1183j1025J5057l9859q654l990k5326m992J0444n870
$$ plain form
14057 252439 250497 236508 271833 302307 254100 231716 273829 323434 375876 391870 393042 374764
14045 374764 376689 376718 361773 421860 410178 428327 400433 453709 518908 527953 490179 523058
14033 523058 532743 594453 648590 681399 703035 662999 686674 699490 713596 743272 727220 654290
14021 654290 601030 577001 527171 538218 518531 526904 514921 514798 492258 513272 569073 534148
14009 534148 424071 326639 365867 394399 397790 362945 385577 404255 377029 402677 415821
13998 415821 352068 300964 205138 195960 236461 248544 266783 236214 221823 212858 248255 261423
13986 261423 168298 141018 123204 158920 230336 241569 212590 193738 167509 134620 103892
13975 103892 75323 87570 98753 87728 102785 62926 54272 50282 24956 19964 30408 24538
13963B4538J5412p071n4985l7371J6020N5626J12561J0328m3857k5634n057j2164
13951D8346J8989J04280M849m1901q4268l6489M7721N6081n9596j0744k02O7853
13939A14919K3395m6231j2717n0334q4425J8809o944K4332L4039K5597l1377l3255
13927b4192j0910k3094M0560J5888M0915N0444n8757p9338M7814N5201m6043K4889
13915C3377p214L1503o6593o7541n050O69k5064L7073L8770l1142k0321R8057
13903A6524K7357k744K4291l6685r3240M1496L7912J6774N578p4073l2805J04668
13891C5053M2097J8026m279j9068k7579J1794j9024L2261j8308M267l1781n3278
13879b9819L0228l3657J0793j0182K89N0617K1303m381j0509j857K5813J1298
$$ plain form
13963 24538 39950 32879 -22106 -59477 -43457 12169 124730 135058 91201 65567 60510 48346
13951 48346 67335 171615 176464 134563 50295 13806 61527 117608 58012 47268 47066 114919
13939 114919 138314 92083 79366 29032 -55393 -36584 -43528 -19196 14843 40440 9063 -24192
13927 -24192 -35102 -58196 -17636 -1748 39167 89611 30854 -48484 -670 54531 8488 33377
13915 33377 26163 57666 -8927 -76468 -81518 -80849 -105913 -68840 -30070 -61212 -81533 16524
13903 16524 43881 41137 65428 28743 -64497 -23001 14911 31685 37263 -36810 -69615 35053
13891 35053 77150 95176 90897 71829 44250 56044 37020 69281 50973 55240 23459 -29819
13879 -29819 409 -33248 -22455 -32637 -32348 18269 39572 35191 24682 22825 48638 59936
13867E9936k4336m8714J8499m6550n7357L8130L6410K4507l3129J292o856K0064
13855a8104k37m2333P4592O1420Q020k0273m1630r995o06n1311n3166k4593O9793
13842d8423O5179j089j5053k9578J6357J4356K9513j1481l3664l7426J6978K9608
13830d723K2184O007l6854O084K8345k2276n6067K4376M3395N4368J6375M0985
13818A22199r4315n0939K945J1103L6230L0121m5581k759O244L9410J4736l9453
13806B9941k2168O353j2913l1970k2130o8262m0843J5880M3902N5807R1449J6971
13794F2017J815n4479J1738l6111j7854K3734k5705p3827J3667M1041O8272k621
13782A1687k9477l4082Q825K5261K4503j9403j3888L4324j2604K1001p616k9195
$$ plain form
13867 59936 35600 -13114 5385 -41165 -98522 -60392 -23982 525 -32604 -31312 -38168 -18104
13855 -18104 -18341 -60674 13918 75338 83358 63085 21455 11460 10854 -40457 -93623 -118216 -48423
13842 -48423 16756 15667 614 -28964 -12607 1749 31262 19781 -13883 -51309 -34331 -4723
13830 -4723 17461 23468 -13386 -7302 21043 -1233 -57300 -32924 10471 64839 81214 122199
13818 122199 27884 -23055 -20110 -9007 27223 57344 11763 9004 15248 54658 69394 29941
13806 29941 7773 14126 1213 -30757 -52887 -121149 -161992 -146112 -102210 -46403 45046 62017
13794 62017 63832 9353 21091 -15020 -32874 -9140 -34845 -108672 -95005 -53964 14308 11687
13782 11687 -17790 -51872 -43047 -17786 6717 -12686 -26574 7750 -4854 16147 8531 -20664
13770b0664l616J13480L5494J237l3109j8766m3333l5786M7160l2348o0012j2255
13758f2518P6798J5424q997J4318J8681m7186m6219M642K4533p4758k1842N5246
13746e1878N4384m07N824p764J9225J097l9771p5800p2314O2166Q7450K8964L5643
13733D6819j6605R398k8745l8099j5447O8697N6528l4739k9249j4251K399m973
13721A733O829J9872r445J419j7659K9360n8607k9163L0375N2303L2888m7856
13709A2049L3435j4637l3016n5138l3756n369K1472r461k5277k4099M2163j396
13697i3030k5238J1375Q4285O6267l8775k6359N4075L1240n0232j25230K0601
13686i1021O5795J2609l800J1970o0225L1147j4278J1534o5780L1982N3911j3069
$$ plain form
13770 -20664 -24280 89200 124694 125931 92822 74056 30723 -5063 42097 9749 -50263 -62518
13758 -62518 14280 29704 20707 35025 53706 6520 -39699 -35057 -10524 -85282 -107124 -51878
13746 -51878 2506 2099 7923 159 19384 20481 -19290 -95090 -167404 -105238 -17788 11176 46819
13733 46819 30214 39612 10867 -27232 -42679 26018 82546 47807 18558 4307 6706 1733
13721 1733 8562 28434 18989 20408 2749 32109 -26498 -55661 -25286 27017 59905 12049
13709 12049 45484 30847 -2169 -57307 -91063 -96432 -74960 -84421 -109698 -133797 -91634 -93030
13697 -93030 -118268 -106893 -22608 43659 4884 -21475 32600 63840 13608 -111622 -91021
13686 -91021 -25226 -12617 -16417 -4447 -64672 -33525 -47803 -36269 -102049 -70067 -16156 -29225
13674b9225J4665j1053k9653K6154L0825M511j0059l0501m0478K4026q493L281
13662e6000J863K1977K7032K3974K4926q855r867j6270Q803m3747o784k1863q8082
13649a42893j4611N0039Q0586N7691r992r64m8954K6765M2784n959O4712k5409
13637G3795p9600j2855k1698k1438o27K0422O4028l779L017L7077j0874l7653
13625I815M281L7194k1815o0289n175n966M7068J8132m2889m3620k4764l65J30
13612h8263M0161R0508k3542j9872n3314k2897L5665j5562L0938L7807N5810r113
13600E8326J4933r442J0732M3465J0254k9069l2750j2175L2627q362n8338l4909
13588a4708M1153M3287P06o3677n2553l343M2803J8941k335p7075p3639j2407
$$ plain form
13674 -29225 -14560 -25613 -55266 -29112 1713 6224 -3835 -34336 -74814 -50788 -59281 -56000
13662 -56000 -54137 -32160 -5128 18846 43772 34917 25050 8780 17583 -26164 -32948 -54811 -142893
13649 -142893 -157504 -107465 -26879 30812 20820 19856 -29098 -2333 40451 34492 99204 73795
13637 73795 -5805 -18660 -40358 -61796 -62423 -42001 22027 18248 21265 58342 47468 9815
13625 9815 14096 51290 29475 -30814 -35989 -41955 5113 23245 -19644 -63264 -88028 -88393 -88263
13612 -88263 -48102 42406 18864 -1008 -54322 -77219 -41554 -57116 -26178 11629 67439 58326
13600 58326 73259 63817 74549 118014 128268 99199 66449 54274 86901 78539 20201 -14708
13588 -14708 26445 69732 70438 6761 -45792 -49135 -6332 12609 10274 -66801 -140440 -152847
13576a52847M8018O2033J01840J9771n5607n0176l1404R781K8342o5028o5445
13565a50722Q0034R6568J2353k4674j2393j2945L232J6707O8562K5232n109r030
13553H7815k2684n658l1791n5644L7149j2673n9049M0730L097K4705K0419r857
13541A6559R724p4176q288M5956N6332m5097j0255n1751J2876J14678J5135l7385
13529D4308l9829k5308P1720q58l9621k8400m2630N7077p798k2924J292j1386
13517d4357K7544M7497L8496N1741k4605p2171k3918L6898K7852L4673m9314p2255
13505b1919k3212j1036L0227K4752o936M3080k6980q6455n4650Q430Q511M2437
13493g3751J7672r435L9751n7964k2093M7346J8193p472o5504k6699P678L546
$$ plain form
13576 -152847 -104829 -42796 59044 78815 23208 -26968 -58372 -48591 -20249 -85277 -150722
13565 -150722 -70688 25880 38233 13559 1166 -11779 -8547 8160 76722 101954 96845 87815
13553 87815 65131 59473 27682 -27962 9187 -3486 -62535 -21805 -18708 5997 26416 16559
13541 16559 26283 -47893 -56181 -10225 46107 1010 -9245 -60996 -48120 66558 81693 44308
13529 44308 4479 -20829 50891 50033 10412 -17988 -60618 -3541 -11339 -34263 -32971 -44357
13517 -44357 -16813 30684 69180 120921 96316 24145 227 37125 64977 99650 50336 -21919
13505 -21919 -45131 -56167 -25940 -1188 -8124 34956 7976 -78479 -133129 -124699 -116188 -73751
13493 -73751 -56079 -65514 -25763 -83727 -105820 -58474 -40281 -47753 -113257 -139956 -132278 -128732
13481a28732N2367Q3549K9383Q721P490J01002M4686l978k4798o3375N607q20
13469A11102j7856l7549m1906q5433m3149M4955O8257K6212n6943J8308P9882
13458F5880N236j4336k2798M662p9197k2854K6864n0740k6901Q1725M2990p2949
13446f2418k8195P1116k1847J0902K7265K8763j8211K4837N3725N046K85J0172
13434A01440j5587O3381J66766K73385J25518l5603m7041j00335j79534j05511
13424B46879j24434q2696M789M8259l6525l3248K7186k1785j4917N7643J1901
13413H3052j1453n8570n3167M404R712O7698J9768m3259n7004K9724p124k0413
13401c6632N0819J4215L4968l2891O248K2675N293j8961J663n8660M5604M7379
$$ plain form
13481 -128732 -76365 7184 36567 45288 52778 153780 198466 194488 169690 106315 111922 111102
13469 111102 93246 55697 13791 -71642 -114791 -69836 -1579 24633 -32310 -14002 65880
13458 65880 71116 56780 33982 38644 -40553 -63407 -36543 -87283 -114184 -32459 10531 -62418
13446 -62418 -90613 -19497 -41344 -30442 -3177 25586 7375 32212 85937 90983 91268 101440
13434 101440 85853 149234 316000 589385 714903 679300 632259 531924 352390 246879
13424 246879 122445 39749 44538 92797 56272 23024 50210 28425 13508 71151 83052
13413 83052 71599 13029 -40138 -35734 -26022 41676 61444 18185 -38819 -9095 -16219 -36632
13401 -36632 14187 28402 63370 30479 36727 59402 64695 45734 47397 -11263 34341 81720
13389H1720N2777J17353P0668J56526R7612k2124n6948j12635j52990r2779k6981
13378A12199L5256l6871r749o1167p9703l507K4149K8673L9263J7900k9556K0009
13366E6896l8383j376K0410l2453l8506l7964m3467M4375m9630J4880N0453M5814
13354h951M7325k0435k4168J0279O1985K5737k415J1560k525j261j0157m2731
13342D4243j5517N4989P6544J1040j3623k3041q9026p646k2601q0893n4355r749
13330a29635J06604P0352j7235n2880r97K9085P3398N7649j6015m1652m5860j6321
13318A6493J0131o106K9010K2910N5948j4839k1647j1059o0277O0879m5292q2429
13306d6278J2643L3365N0907J5001l1149n3196q665P435o485j5021l9074J9110
$$ plain form
13389 81720 134497 251850 322518 479044 576656 554532 497584 384949 231959 139180 112199
13378 112199 147455 110584 100835 39668 -40035 -43542 -19393 9280 48543 66443 36887 56896
13366 56896 18513 17137 37547 5094 -33412 -71376 -114843 -70468 -120098 -105218 -54765 -8951
13354 -8951 38374 17939 -6229 4050 66035 91772 89357 100917 98392 97131 86974 44243
13342 44243 28726 83715 160259 171299 157676 134635 45609 37963 15362 -65531 -119886 -129635
13330 -129635 -23031 47321 30086 -22794 -23791 5294 78692 136341 120326 78674 32814 16493
13318 16493 26624 20518 49528 72438 128386 113547 91900 80841 20564 81443 36151 -46278
13306 -46278 -33635 -270 50637 65638 34489 -18707 -27372 -19937 -26422 -41443 -80517 -61407
13294f1407K7015M735K660K7187K4579K8194m4185k6467j0061O3989m543R358
13282D1054L0003q563j8616K2858J2335o1772j9425J0753K5174J064L2344m2596
13270B4613n6453K5199o4701k4529L2179l4803j1234N7746J11824J5707q883k3687
13258D2978J6791J2339m9112M6395K6020m4146j5831O928J2842k0176n0554n755
13246b1281L6030J0200K3011K3741o8148J4507j1654o492l4409k0859k492j0857
13234f8703j7912j5605L0911J16136L5444N7097K5354k2358l7174p2531k1734
13223H925O2573R790p2363k6435O373K9493R010j0575K2021J2691Q2345M5093
13211A78941K5401k91L3160J26526J63165K37021L65918N43590M95696J69007
$$ plain form
13294 -61407 -34392 -29657 -26997 190 24769 52963 8778 -17689 -27750 36239 31696 41054
13282 41054 71057 62494 43878 66736 79071 17299 -2126 8627 33801 34865 67209 24613
13270 24613 -31840 -6641 -71342 -95871 -63692 -98495 -109729 -51983 59841 75548 66665 42978
13258 42978 59769 72108 22996 69391 95411 51265 35434 42362 55204 35028 -15526 -21281
13246 -21281 14749 24949 47960 71701 3553 18060 6406 -86 -34495 -55354 -57846 -68703
13234 -68703 -86615 -102220 -71309 44827 80271 137368 162722 140364 103190 30659 8925
13223 8925 71498 81288 8925 -17510 -11137 18356 27366 16791 38812 51503 133848 178941
13211 178941 204342 204051 237211 363737 526902 763923 1129841 1673431 2169127 2338134
13201B338134k09969l58084l11856l84785k89953j67803j43551j37797m5320k0171
13191B68845J8896p918n9112j0404j6211k509k9692N546j654l3778m2101m0179
13179D9729K2199K7935m2441N601K1045m3105k2421L592J6087j8018j1747o1438
13167e2982p059K8391M1015K5317J863K2802L5549n4246l3815m5597n3872q979
13155a01613N9484Q9065J9707o9915Q458L4602K6335k3605p109k717L0751K7587
13143I1030Q671k6381k9720J6907n6324k401M2024l4638K4290J4080J8923N7261
13131A23722K0602o916k048j9006l3341q4989k3691L5558K6641l1317l9116l217
13119c7118J9488K158M8349j2370m4130j0798j905j2324r489O2602O0815P9418
$$ plain form
13201 2338134 2128165 1770081 1458225 1073440 783487 615684 472133 334336 289016 268845
13191 268845 287741 279823 220711 210307 194096 191587 161895 167441 165787 132009 89908 49729
13179 49729 71928 99863 57422 63023 84068 40963 18542 22134 38221 20203 8456 -52982
13167 -52982 -60041 -31650 9365 34682 36545 59347 94896 40650 6835 -38762 -92634 -101613
13155 -101613 -42129 46936 66643 -3272 5186 39788 66123 42518 35409 32692 63443 91030
13143 91030 99701 73320 43600 60507 4183 1782 43806 9168 33458 47538 66461 123722
13131 123722 144324 137408 135360 116354 83013 -1976 -25667 9891 36532 5215 -33901 -37118
13119 -37118 -17630 -15472 32877 20507 -23623 -34421 -36326 -48650 -58139 4463 65278 144696
13107A44696O0207P6530N8708J66272J81373P8184o8514q7613r2128j46001r2682
13096B79032k8490J0420K1100L4227K2471O1863O8965O5906O6216L848j703Q6081
13084F89936J27100J26641J55189L23987O62491J162119J874486K036757J100373
13075H259079m02065j296675j435725j421456j171860p80552m79415l14301j70410
13066G86620j03215r2759p4248p4141j05422q756k8781K3969k9187k0643k1519
13055B51918k5326m3095m2083L1926P7746P323o7188k3974j3426N9116M1834R431
13043B64202M1188J4025j9320m8750p4781n4127m1973L9469Q833q2761J9324K6600
13031I1929k3013n5868l2516O9849Q4159N1448L1912M719K5601P437k5605J6657
$$ plain form
13107 144696 204903 281433 340141 506413 687786 765970 697456 609843 517715 371714 279032
13096 279032 250542 260962 282062 316289 338760 400623 469588 535494 601710 605558 603855 689936
13084 689936 817036 943677 1098866 1422853 2085344 3247463 5121949 7158706 8259079
13075 8259079 7857014 6560339 5124614 3703158 2531298 1750746 1271331 957030 786620
13066 786620 683405 590646 516398 442257 336835 328079 299298 323267 294080 273437 251918
13055 251918 226592 183497 141414 173340 251086 258409 191221 167247 153821 212937 254771 264202
13043 264202 305390 319415 300095 251345 176564 122437 80464 119933 128766 46005 65329 91929
13031 91929 68916 13048 -19468 50381 134540 185988 217900 222619 248220 255657 230052 246709
13019B46709Q0104K2551J2150l0557m3896n636O505p2195k8146O9806j0274l8459
13007B08662o7318j09216j8921k8073P717J0602l4195k303K6607N1770L6331L3843
12995A15506l0169k7617o6659O088O1063L0745K5208j7898n5459m6519l714K4826
12983A5401j4288M5551R880L982L7880J2114P4045O0872k6271k5698L1452k490
12971B22430K4220j9284j4200l242m967J581J0778j93j23008n031L4322p903J5731
12958A31234o0296p1955J7780r80m0437l4820m999N4578o058M2122N3628J4965
12946I4762m3383N0414K6125L1716K1554o51j034j3790M3130R6610J36121K25253
12934F66827L57649K40217Q5449j13728k01704k34122k34446j21450q0727n2712
$$ plain form
13019 246709 326813 349364 361514 330957 287061 281425 287930 215735 187589 257395 247121 208662
13007 208662 141344 32128 13207 -14866 -7149 3453 -30742 -33045 -6438 45332 81663 115506
12995 115506 85337 57720 -8939 -2851 58212 88957 114165 96267 40808 -5711 -9425 15401
12983 15401 1113 46664 56544 60526 98406 110520 184565 245437 219166 193468 224920 222430
12971 222430 246650 227366 213166 209924 204957 206538 217316 217123 94115 89084 123406 115503 131234
12958 131234 70938 -1017 16763 15783 -24654 -59474 -64473 -9895 -15953 26169 79797 94762
12946 94762 51379 101793 127918 159634 181188 180537 179503 165713 208843 305453 441574 666827
12934 666827 1024476 1264693 1350142 1236414 1034710 800588 566142 444692 363965 311253
12924C11253l5494q2574l4279N0972k9236m4453l4626M9247P3573k2952q9142
12913A12289n1785o084k9157J6535K3045j8784J3133J4792l4009O2822L3988k4367
12901A12418k9614n818j3668R540M9781N6514P7247J05118J05496J04408j2850
12890E58572j40949l8024j07649q6347o3840L877K365O2825M2528j8876L2665
12879B47147O0326M5493j2608q3812k2684K4550P6405L9648j3738n6583l7521
12868B66623L4933K6860Q778n7413o1262o8172l4954J09191P0011m5479J7054
12857B66170m1136l2133m0910O8705R0980J359q4074n8499m7627l7367j8868P2299
12845A38899M029K2460O4757L3640j0683J8779M1663O452p821L9960k8103j0758
$$ plain form
12924 311253 275759 193185 158906 209878 180642 136189 101563 150810 224383 201431 112289
12913 112289 60504 54420 25263 41798 64843 46059 59192 73984 39975 102797 136785 112418
12901 112418 82804 76986 63318 72858 122639 179153 256400 361518 467014 571422 558572
12890 558572 417623 379599 271950 185603 121763 125640 128005 190830 233358 214482 247147
12879 247147 307473 352966 340358 256546 233862 258412 334817 374465 360727 304144 266623
12868 266623 301556 328416 337194 279781 218519 150347 115393 224584 294595 249116 266170
12857 266170 225034 192901 151991 220696 311676 313035 228961 170462 122835 85468 66600 138899
12845 138899 142928 165388 230145 263785 253102 271881 313544 319996 312175 352135 324032 313274
12833C13274J1179K2138j4865n7392N257M4896J10950K3105l6201R200J6389J2195
12821D60125K7323K8194r273l9840k3391j7952J6905M2980P8370Q2488N5088J12101
12809H13118J11098O8133R1898P3568k9895n6365k2470K8853N9589J96178K36909
12798A570614J54093J08093J25728J31668Q1185J55298J88477J37217J57706K81431
12788C091510L03243K82907M03113M30215N43795O76219O62528Q70819J138769
12779H403118J448579J993638K677529L287720L703185M193640N098005P205463
12771C8010877J1313038J9108160L3746693O0630814R7948987J11459176O6841948
12764D39059693o653110o0425168p6337366p6643918o8358039m8552276k8955083
$$ plain form
12833 313274 324453 346591 331726 274334 279591 324487 435437 458542 422341 431541 447930 460125
12821 460125 487448 515642 506369 466529 443138 425186 442091 485071 563441 645929 701017 813118
12809 813118 924216 992349 1084247 1157815 1127920 1071555 1049085 1077938 1137527 1333705 1570614
12798 1570614 1724707 1832800 1958528 2090196 2171381 2326679 2515156 2652373 2810079 3091510
12788 3091510 3394753 3677660 4080773 4510988 5054783 5731002 6393530 7264349 8403118
12779 8403118 9851697 11845335 14522864 17810584 21513769 25707409 30805414 38010877
12771 38010877 49323915 68432075 102178768 162809582 260758569 372217745 439059693
12764 439059693 432406583 371981415 295644049 219000131 150642092 102089816 73134733
12757G3134733j6723789j0243987p066696n544413m700880m050967l438088k888107
12749A8477806k376665j919585j590803j289143j074829r31122p71791o91554
12741G832314n82161n93107n22981m28187m14414l94104l87606k55673k41890
12732D012191j76652o1197K4990P1293n5327r9857k17873k47412k53194k69017
12722B727945k37208j46853J2096K23324L51111N90426J119565J634604J661473
12713G936483P85151l16640j041670j217543j262780j128703p13495l80104k25780
12704B434919q7636o348N8174R7217r257k9590j19043j28620L8258R3217O3240
12693B404531K40199M24688Q04258R74317M85398j63719n81585p97130p67406
$$ plain form
12757 73134733 56410944 46166957 39100261 33555848 28854968 24804001 21365913 18477806
12749 18477806 16101141 14181556 12590753 11301610 10226781 9295659 8523868 7832314
12741 7832314 7250153 6657046 6134065 5705878 5291464 4897360 4509754 4254081 4012191
12732 4012191 3835539 3774342 3799332 3870625 3815298 3715441 3497568 3250156 2996962 2727945
12722 2727945 2490737 2343884 2355980 2579304 2930415 3520841 4640406 6275010 7936483
12713 7936483 8721634 8404994 7363324 6145781 4883001 3754298 3040803 2660699 2434919
12704 2434919 2347283 2340935 2399109 2496326 2487069 2457479 2338436 2209816 2248074 2341291 2404531
12693 2404531 2644730 3069418 3873676 4847993 5333391 5169672 4588087 3790957 3023551
12684C023551o61750n07921l90901k34714j04583q8262j41353r4722q4692j07969
12674F06684o0126l4141q6035J7273K3208N984J9513j5997j5784k2013j1118J7228
12662D44676k8158m9190m9397N3008p971N0697J10562Q3140J10861J66027K72259
12651A156514L70188L34932J36008j01995k08458l50143l08943k20907j69223
12642F37973p6006j1049l796m5428m9659n7895p5901L0774Q3769j5881n1399j96
12630C65306k685M4445P885J6368L690l2741o6713l0736J3645Q787j0392M0734
12618C57593L1569l2601J7334j4239n6516r8688o5512M8203L7541P0103J3152
12607C07939j8909M630o44m2378j2761m7954p338J3046J7302j5028n2850m473
$$ plain form
12684 3023551 2361801 1853880 1462979 1228265 1123682 1035420 894067 799345 714653 606684
12674 606684 546558 512417 426382 443655 466863 472847 492360 476363 460579 438566 427448 444676
12662 444676 416518 367328 317931 370939 362968 413665 524227 607367 718228 884255 1156514
12651 1156514 1526702 1861634 1997642 1895647 1687189 1337046 1028103 807196 637973
12642 637973 561967 550918 547122 501694 452035 394140 318239 349013 432782 416901 365502 365306
12630 365306 362621 407066 414951 431319 435009 402268 335555 304819 318464 327251 316859 357593
12618 357593 389162 356561 373895 359656 303140 204452 138940 187143 224684 294787 307939
12607 307939 289030 293660 293016 250638 237877 189923 182585 195631 212933 197905 145055 140582
12595A40582O1865N2650O821L6554j316p9484o8390p3642J1344L5246N5100Q5430
12583B62760R8698O3590J01360J90910Q6345l7483n2913m4629j08036n7440j04130
12572C99032q1782o6828l7726n0871o3941m4753o9884l0084m785L1054k55j6596
12560c7419p616q0348j1123J14686K3446l2915k0703J12785N7826k7361J8663
12549A09921P320k2611k207N2759L410J8854J133k7185k2320j940n5370k6989
12537C4775N2205O8993M6259l0124q5529J4287O2472K3678J6655J08876J01554
12526D14101J0420j3660o5256j20228n9071j879L5229j4280p8955l4906k4163
12515D7352J6233O4204L9937L2942m9642k1607l4039M467J2655L781l620J1788
$$ plain form
12595 140582 202447 255097 261918 298472 297156 217672 149282 75640 86984 122230 177330 262760
12583 262760 361458 425048 526408 717318 803663 766180 713267 668638 560602 503162 399032
12572 399032 317250 250422 212696 161825 97884 53131 -16753 -46837 -51622 -20568 -20823 -37419
12560 -37419 -45035 -125383 -136506 -21820 1626 -31289 -51992 60793 118619 91258 109921
12549 109921 117241 94630 92423 145182 148592 167446 168579 141394 119074 117134 61764 34775
12537 34775 86980 155973 202232 172108 86579 100866 163338 187016 203671 312547 414101
12526 414101 424521 410861 345605 225377 166306 164427 199656 185376 106421 71515 47352
12515 47352 63585 127789 167726 200668 151026 129419 95380 99847 112502 116283 112663 124451
12503A24451N4716m3525J7891j7665n9218Q006m9260l0841R74P557o007K0987
12491B8066n703K6786P2513K4617j3632n3535m2630m980q436r733j7829N7949
12479E3453O272l2844j90N4237R743J3351Q431k4893n98M4615K8396L109K1959
12466A85041m5942n1860j2005K6782K2451L1683j15382o2341K4168N4973K258
12455E9826j4825l7510o924Q420K7230J5251J3026L9329k8320j27394n254N708
12443e1437J3300K2210m4812J7544K8625j0518Q4989L158n5509m7280n96M4403
12431D077n305n1474n0042l988L591n4319l1301R9154P0522M6764O5j4683J7918
12418C0979M2716N420r45K040j888L0089l1067j326q007j5128M1823K2391M04
$$ plain form
12503 124451 179167 135642 153533 135868 76650 84656 35396 4555 5529 13086 7079 28066
12491 28066 22363 49149 121662 146279 132647 79112 36482 31502 23066 13333 -4496 53453
12479 53453 59725 26881 26691 80928 90671 104022 112453 87560 86962 131577 159973 163082 185041
12466 185041 139099 87239 75234 102016 124467 156150 40768 -21573 2595 57568 59826
12455 59826 45001 7491 567 8987 36217 51468 64494 103823 75503 -51891 -57145 -51437
12443 -51437 -38137 -15927 -60739 -43195 -14570 -25088 59901 63059 7550 -39730 -40326 4077
12431 4077 -1228 -52702 -102744 -106732 -103141 -157460 -188761 -89607 -19085 27679 27744 13061 30979
12418 30979 73695 79115 78170 80210 78322 108411 77344 76018 68011 52883 94706 117097 117501
12405A17501n4658k6626k2187L1893J1195r174L5603K5177K6914k3086j9047J9918
12393A13423J167o8899l3976K7411N8171K817q1808J9584K4722p1725L9402N2842
12381H3131m1604N9928L1053m7545m6666l4006K7491J66143J03081p1424l5936
12370A93646N6395M4118L9699o2795k6299o8112q1471j0849O0526k484l7012J094
12358A06456k8090j1977K6586J9507k3563n3005q5934m856O0682N479J03310o26
12346A13969q2797R179k0469l7061j5185L4047N7975P6618K1614m9580l7403J3065
12334H3972m8062O2051R8253m43o1529J0015M8476N8354J00190K04519K55706
12323H11502M49264N15880L40422J6448k02803l34220m26597m14445k63796r9303
$$ plain form
12405 117501 62843 36217 14030 45923 57118 47944 83547 108724 135638 112552 93505 113423
12393 113423 114590 45691 11715 39126 97297 100114 18306 37890 62612 -9113 30289 83131
12381 83131 41527 101455 132508 84963 38297 4291 31782 197925 301006 229582 193646
12370 193646 250041 294159 333858 271063 244764 176652 95181 84332 144858 142374 105362 106456
12358 106456 78366 66389 92975 112482 88919 35914 -50020 -54876 5806 11285 114595 113969
12346 113969 31172 40351 19882 -17179 -32364 1683 59658 136276 157890 108310 70907 83972
12334 83972 35910 97961 196214 195771 134242 144257 192733 251087 351277 555796 811502
12323 811502 1260766 1776646 2117068 2133516 1930713 1596493 1169896 755451 491655 392352
12313C92352p3514l6262n2093k3932k5867n7221m9448n3616k0720N0972J0963
12302F1614J4904M9995n1193p0179Q891J2226J8801L9162O583m2855j4603P30
12290C4076L17l1794o3452M3769N3890O58j4857j4730m3126m4191K6244J02487
12278D9291R882p555l3387N1103q681M873N8036k4743l8491n9739k2571L2606
12266A0624k510M9592M736L4809J7958l1364n4210k4587J2338J9090L0408M5390
12254A12274M7717j4680o2110L3389K5745k8405l4822L3752J24083J1474m4481
12243B03936q9589j24984N0518L3059J2791l5484M456J1812O839M3460J2320o1099
12231F8035k184J43213J72351J17598M0043m7286o8385j6474l9316K6026J42583
$$ plain form
12313 392352 318838 282576 230483 206551 180684 123463 74015 20399 -321 50651 61614
12302 61614 76518 126513 75320 5141 14032 26258 45059 84221 90804 47949 33346 34076
12290 34076 34393 2599 -60853 -17084 36806 37464 22607 7877 -35249 -79440 -53196 49291
12278 49291 59173 51618 18231 69334 60653 65526 123562 98819 60328 589 -21982 10624
12266 10624 8114 57706 62442 97251 115209 83845 29635 5048 17386 36476 66884 112274
12254 112274 159991 145311 83201 116590 142335 113930 79108 112860 236943 248417 203936
12243 203936 114347 -10637 39881 72940 85731 50247 54703 66515 73354 116814 129134 68035
12231 68035 65851 209064 381415 499013 539056 491770 423385 406911 367595 393621 536204
12220E36204J78780J56611J5783j06762r2952j07603q0930q3521q9564k3929m6869
12209B55248J4442J21588J02327O5137j8132o6763j8181o1383j62141q6103l886
12198A42153k6628m4578K2501l8220m5888N831j6296M1140R1104K3014j2694M6761
12186A88200O1463K2881k2407p7521J4440k7L3219K3575O1258Q175k0411l0651
12174B62194j7509j7670l6146o3407l9300l3684N698N0064q603m1338o3813J3953
12162A0439o30K81P8655J2024k9448k9059J1526k6315j062O8684J7991J6211m6067
12149H3230j7502N5854J6065k42N1159J13725J11977J09440k710k5627j33645
12138C61724j53534j13720L0060m621j1960j0419n3891N361L8017J6432Q388j8187
$$ plain form
12220 536204 714984 871595 887378 780616 687664 580061 499131 415610 326046 302117 255248
12209 255248 269690 391278 493605 558742 540610 473847 455666 394283 232142 146039 142153
12198 142153 115525 70947 93448 55228 9340 15171 -1125 40015 131119 154133 141439 188200
12186 188200 249663 272544 250137 172616 187056 187029 220248 243823 305081 313256 292845 262194
12174 262194 244685 227015 190869 127462 88162 54478 60176 110240 101637 60299 -3514 10439
12162 10439 9809 10090 88745 100769 71321 42262 53788 27473 26411 95095 113086 129297 83230
12149 83230 65728 121582 137647 137405 188564 302289 414266 523706 520996 495369 361724
12138 361724 208190 94470 124530 119909 107949 97530 43639 49000 87017 103449 111837 93650
12126I3650k1962m2432O6563j6513K0233l8219k5486Q710j3081J9482P4940k9822
12114I6063l8964k77q539o4838m7292J5197Q302p994j3119J2560Q3081M3916K281
12101H0377R8052R4103O1893J48991M8291o3043n6818j05195j08059n3184M3020
12090A88428j7284p0196o3198r5626p2871o614K4333K6504N0466R547J1540O4209
12078D9238j4634L1698l2854m41J314K4679j9756o4729k3350l086M5438K4600
12066A8117j3182k2765K2530K0003M1133j4493k5305J5909k8350K5892J5251M1664
12054I6404J14989Q327o7j1177P953n8060p4987k7899j5348j6477M0551J6344
12042H0553l4570m741k2901j0225l3643m4995K8075R3035j624Q993K8166o644
$$ plain form
12126 93650 71688 29256 95819 79306 99539 61320 35834 44544 31463 50945 125885 96063
12114 96063 57099 56822 48283 -16555 -63847 -48650 -40348 -48342 -61461 -48901 34180 78096 80377
12101 80377 178429 272532 334425 483416 531707 468664 411846 306651 198592 145408 188428
12090 188428 171144 100948 37750 -57876 -130747 -137361 -113028 -86524 -36058 -26511 -14971 49238
12078 49238 34604 66302 33448 33007 34321 59000 39244 -25485 -48835 -51921 -6483 18117
12066 18117 4935 -17830 4700 24703 65836 51343 26038 41947 13597 39489 54740 96404
12054 96404 211393 219720 219653 208476 216429 158369 83382 55483 40135 23658 64209 80553
12042 80553 45983 41242 18341 8116 -25527 -70522 -42447 50588 48964 57957 86123 79479
12030G9479M1182r269n3425L2522K9738l8602k4150j8028p79j1536n5962O954
12018b1876q2l6938k0507j1507N26N768j1285q91N2301K8003L4263K9424R429
12005E6628o238p087o1763n2479K3196K9426k2541k1759k5926L1003L4426m1223
11993f4337l1739m6072n211N7698j9029j3139k2090R462M4555R2634K4293l0119
11981c094k8789O5022l4329K1516l34k0268k526J69k9078k9733j1961l5773L0676
11968g8502L8519J6225J1928M2854M6294k7367j00123n2575J02306M7702J1897
11957E9158j589m1151k5361k3603K7081O1402L1454k4504m078j6082l7044j9896
11945a4213l7899o454R931N7826J5595n6456J599O4503N7631l116m953n2176m5877
$$ plain form
12030 79479 120661 111392 57967 90489 120227 81625 57475 39447 38668 27132 -28830 -21876
12018 -21876 -21958 -58896 -79403 -90910 -90384 -84616 -95901 -96792 -44491 -16488 17775 47199 56628
12005 56628 50390 43303 -18460 -70939 -47743 -18317 -40858 -62617 -88543 -57540 -23114 -64337
11993 -64337 -96076 -142148 -147359 -89661 -108690 -121829 -143919 -134457 -89902 2732 27025 -3094
11981 -3094 -31883 33139 -1190 20326 19992 -276 -2802 -2633 -31711 -61444 -73405 -109178 -78502
11968 -78502 -39983 -23758 -11830 31024 77318 49951 -50172 -102747 -441 47261 59158
11957 59158 57569 16418 -8943 -32546 -5465 55937 87391 62887 58809 42727 5683 -14213
11945 -14213 -52112 -58566 -48635 9191 24786 -31670 -30071 34432 92063 88947 83994 31818 -14059
11932a4059O7474M5836j8251p5212m4173K4740m0755o620r305N6109L63j8032
11920c1885M4212N1122p226J2398K9598R343k6589j02310p775L1584l5658J1576
11908b1610J4806M9816n0404p1550L399J4086p458j4869K8400l7867p629l478
11896a04358J1226L104p7155K2744N9621N2240K1098l4537l7174j1798K7760M0200
11884b7029N6003P7164l3515m0522q5213R183L8011R0792L6120m0631j3339l776
11872F3248k125n4377J598n4363j2610L9797P817M0750j778l3144K3374k9238
11860a1051J8686J0557k1330k9684k8228J2656j1812k64o213Q2794O4684j6193
11848F4602n7590k8801m863m3342j371J5692m998j4752K1729J5984K6015K8784
$$ plain form
11932 -14059 53415 99251 81000 5788 -38385 -13645 -54400 -61020 -70325 -14216 -13853 -31885
11920 -31885 12327 63449 56223 68621 98219 107562 80973 -21337 -29112 2472 -33186 -21610
11908 -21610 -6804 43012 -7392 -78942 -75543 -61457 -68915 -83784 -55384 -93251 -100880 -104358
11896 -104358 -93132 -90028 -167183 -144439 -84818 -32578 -11480 -46017 -83191 -94989 -67229 -27029
11884 -27029 28974 106138 72623 32101 -53112 -43929 -5918 84874 120994 80363 67024 63248
11872 63248 61123 6746 8344 -46019 -58629 -18832 -11015 29735 27957 -5187 18187 -11051
11860 -11051 7635 18192 -3138 -32822 -61050 -48394 -60206 -60470 -66683 16111 80795 64602
11848 64602 7012 -21789 -26652 -69994 -71365 -55673 -60671 -75423 -53694 -37710 -11695 17089
11836A7089k8894m9592p365r171K6349L36O2922K2403J4386m2893r0714n0642
11824a35786K4296L991K8521K0342K9491K7790k6558p272O7386K0271l7993l1286
11812a6807L3779M1988q0667J7294Q170L4681K0449m2085O122J1975K6065j4923
11800D6041p9288k4310K5444m2799j0589K6116m9355M1523J1097L7562O9340M307
11788E5089j3509L117L5988j0810k0079K162k9767k4163M814k0533r244n2007
11776g8942j9346O5603p185r291l4272j0614j5750K8206Q4248Q534r142j6754
11764a4705j2218Q07l2692j1211N367K4246r235q9845J2191J1022m9928k92J15729
11751e0764P5762j8470J1054j3952l4992k9349k5000R321r365M4674M1337l76
$$ plain form
11836 17089 -11805 -61397 -68762 -77933 -51584 -51248 11674 34077 48463 5570 -85144 -135786
11824 -135786 -111490 -107499 -78978 -58636 -29145 -1355 -27913 -35185 32201 52472 14479 -16807
11812 -16807 16972 58960 -21707 -4413 3757 38438 58887 16802 22924 34899 60964 46041
11800 46041 -33247 -57557 -32113 -74912 -85501 -59385 -108740 -67217 -56120 -18558 50782 55089
11788 55089 41580 44697 80685 69875 49796 51958 22191 -1972 2842 -17691 -26935 -78942
11776 -78942 -98288 -32685 -39870 -49161 -83433 -94047 -109797 -81591 2657 11191 2049 -14705
11764 -14705 -26923 -26116 -58808 -70019 -64652 -40406 -49641 -139486 -127295 -116273 -166201 -166493 -50764
11751 -50764 24998 6528 17582 3630 -31362 -60711 -85711 -76390 -85755 -41081 256 -120
11739a20q1699K7299L6949K7042L6058K3456l4820K9789J2904l4131k4657k0269
11727b199l2810M0188M1294p1246p2599j6646R3913O0274J4566P529k1421O133
11715D6976l7215q1825n326J9348Q0388L6784k9890j2049j0665L342m332j4036
11703h500L584J2704q817L7092R462o233m3838k2721j3985k1139j9807L5787k5640
11690g2051K0692k4681Q652M7468K7287Q488q242O688K2298l5783l0876m266M5397
11677A1071J5008n0553k0279Q1850Q6919n888j0446r2919l1021J1158j665N2063
11665D5298k04q6908r77P8753J2597j8924l8881l6931k6559K1486J606m0918L4473
11652e6089L9173j2420j7164L0571K6954J0673J2148o9106l047J5148K3970l8409
$$ plain form
11739 -120 -81819 -54520 -17571 9471 45529 68985 34165 63954 76858 42727 18070 -2199
11727 -2199 -35009 5179 46473 -24773 -97372 -114018 -20105 40169 54735 62264 40843 46976
11715 46976 9761 -72064 -77390 -58042 22346 59130 29240 17191 6526 9868 5536 -8500
11703 -8500 -4916 7788 -1029 36063 45525 39292 -4546 -27267 -41252 -62391 -82198 -46411 -72051
11690 -72051 -51359 -76040 -67388 -19920 7367 15855 7613 14301 36599 816 -30060 -34326 11071
11677 11071 26079 -24474 -44753 37097 124016 118128 107682 14763 -16258 -5100 -6765 45298
11665 45298 45094 -41814 -42791 35962 48559 29635 -9246 -46177 -72736 -51250 -49644 -90562 -56089
11652 -56089 -16916 -29336 -46500 -15929 11025 21698 33846 -35260 -38307 -23159 811 -37598
11640c7598j9500j577J9488l726M4311n666k2927j1456J1692L2213n4307p892
11628e6945J01290K4218k5726m6523p1639l6148J6352N7451K0720j3647J3473
11617a7124p2449m8526K2364P2877J7375Q5527J1321p1120o8964M8134j9117P589
11605c2113J7014k4693k3587k7389j1379L9847Q6470M9352J9930N081k3778q069
11593F6686n4386p2789J6741P7652N509M4105m6024k5921j1216r385M9329J9875
11581F0176L0418M3100J7827j8627r5076K4750l3794p3523M3001K3214J4903O30
11569C6999j1643l8753l5560j1280l675Q7044J2233K4214o8139j1876M3131L7051
11557E9746K7853J1243J0708N3068O6521M0225N064j5356j4752p5125n6079J0571
$$ plain form
11640 -37598 -57098 -58675 -39187 -42913 1398 -4268 -27195 -38651 -26959 5254 -49053 -56945
11628 -56945 44345 68563 42837 -3686 -75325 -111473 -95121 -37670 -16950 -30597 -17124
11617 -17124 -89573 -138099 -115735 -42858 -25483 60044 71365 245 -68719 -20585 -39702 -32113
11605 -32113 -15099 -39792 -63379 -90768 -102147 -62300 24170 73522 93452 98533 74755 66686
11593 66686 12300 -60489 -43748 33904 39413 83518 37494 11573 357 -9028 40301 60176
11581 60176 90594 133694 151521 132894 37818 62568 28774 -44749 -1748 21466 36369 36999
11569 36999 25356 -13397 -48957 -60237 -63912 23132 35365 59579 -8560 -20436 22695 59746
11557 59746 87599 98842 109550 162618 229139 269364 274428 259072 244320 169195 113116 123687
11545A23687j5274l1398K9828j6142o5582L7255j1679r5699L8169K5186M0786
11534E9137K5558n3493J5608L3087J8685j4641k3823j0079o8868j4028N8148k4913
11522C78M7299Q9214K1105k758k048K670L7767J7100n29m4506n718N318N093K0331
11508A90716L058L1396k3535J1541L7215M5461N1661J428j17238l2520l1238K1701
11496A89646O2949o1737o8647l3351j4852j3067L0431M2107j7007J979L9551j6645
11484A41357Q637O051k4127m8659J2834O101j8489o596k7503n344N2302j6036
11472H0528l67j9253k6308p4931k4041L8088J6515N0224K7484j5567M845n4534
11460B683k3298K5133k902M886K1124J16289J50567J05395P5882k1649K6994p27
$$ plain form
11545 123687 108413 77015 106843 90701 25119 62374 50695 -45004 -6835 18351 59137
11534 59137 84695 31202 46810 79897 98582 83941 60118 50039 -18829 -32857 25291 378
11522 378 47677 136891 157996 155238 153190 155860 193627 210727 210198 165692 159974 165292 170385 190716
11508 190716 193774 225170 201635 213176 250391 295852 347513 348941 231703 199183 167945 189646
11496 189646 252595 190858 122211 88860 74008 60941 91372 133479 116472 118451 158002 141357
11484 141357 149994 156045 131918 83259 96093 102194 83705 77109 49606 44262 96564 80528
11472 80528 80161 60908 34600 -40331 -64372 -26284 -9769 40455 67939 52372 57217 2683
11460 2683 -20615 4518 1616 6502 27626 143915 294482 399877 475759 454110 481104 480377
11448D80377j06128m4344L7079k5527q8273m5327j7111l7971r6410k3231L493
11437C6627N4337R4219l7102j5980j6360J7373o63k8098Q200k2053j1962N4076
11425A32614m2637J9944k2507M076K3601k5542m8666o2341M8687O6594n7926o1527
11413b5630j1301P875l2139R307L8621M899K6809m097j7559r598l2336M2172J7147
11400A4170o9479L3646J5572J4655k4571n3134J2508M1751J0734M425P140J2752
11388B0169K1665N8689p495J6282P021J6726l2768j3048M1892J02513L9567P2117
11376C43330N8963J05297O1476p0912j13672r0564j03564o9212k2531r789J3268
11365A02090m9877m1914j3514m627L3139O720O9243M981k2313l2649J8107J8636
$$ plain form
11448 480377 374249 329905 366984 341457 253184 207857 190746 152775 56365 33134 36627
11437 36627 90964 185183 148081 132101 115741 133114 132451 104353 112553 90500 78538 132614
11425 132614 89977 109921 87414 91490 115091 89549 40883 -21458 27229 93823 35897 -25630
11413 -25630 -36931 -29056 -61195 -51888 -13267 -8368 18441 14344 -3215 -12813 -45149 -2977 14170
11400 14170 -55309 -21663 -6091 8564 -16007 -69141 -56633 -14882 -4148 277 7417 20169
11388 20169 41834 100523 93028 109310 116331 133057 100289 87241 129133 231646 271213 343330
11376 343330 402293 507590 569066 498154 384482 293918 190354 121142 98611 88822 102090
11365 102090 52213 10299 -3215 -7842 25297 32017 101260 106241 83928 51279 69386 88022
11353H8022J04513M0446M7612l6084n9705o0539l0290O0962j1687j0508m5059
11342H7683K564k338l2023o0331J765o737M3322j9753j8553M1600O5485L2594
11330A35278k5123m8887m9571l697p254l0851k6851L0676j1973J860R963N69J1994
11317a3867l1034J3422M682O1086l3848K4884L8193k8951r4774j8099J0188K4691
11305d3427M2979M4945J8128K2891j104m4795l9749J9201l2877o6972o233j1673
11293i8686K4862L4150J9659l9099K9099M0608K2132P810k1713k4214l7941k7072
11281g0405k6899K5069J5979J7092J4928J2811k4623J2145o4411o2531N4703O3856
11269c2286K1254J4063K6343m1659M0678n4231l8067n3183O0136J2291p745L0860
$$ plain form
11353 88022 192535 232981 280593 244509 184804 124265 93975 154937 143250 132742 87683
11342 87683 90247 87909 55886 -4445 -2680 -9417 33905 14152 -4401 37199 102684 135278
11330 135278 110155 61268 11697 8000 746 -30105 -56956 -26280 -38253 -36393 -26430 -25861 -13867
11317 -13867 -44901 -31479 -26797 34289 441 25325 63518 34567 -60207 -78306 -68118 -43427
11305 -43427 -448 44497 62625 85516 84412 39617 -132 19069 -13808 -80780 -87013 -98686
11293 -98686 -73824 -39674 -20015 -59114 -30015 10593 32725 40535 18822 -5392 -43333 -70405
11281 -70405 -97304 -72235 -56256 -39164 -24236 -11425 -36048 -23903 -88314 -150845 -96142 -32286
11269 -32286 -11032 3031 29374 -12285 28393 -25838 -63905 -117088 -56952 -44661 -52406 -21546
11257b1546j2427J0506J9157O8935n2634J1553j016j2355j361m8983l536m786
11245d8493k2020o138J7844l7626L9947M5070K6509M1333K6165j7819j4233j5476
11233C5063j6134m3944M8021j8798o498N5699k9144n0301o7039M1647L5516m7725
11221f3637k2683Q066M6739N1963J7868m1692j428N665k5544k3124k662L8917
11209a1552M0439J6017j13769m0484J08766K6817l5071p1429J8454N6634J6496
11198A1318k1544K6587m6154n1231J740J02195p347l1082J0622p3941K8806O7725
11186A7694k0768n8618p1788K8479J9967Q542K9310k900J4521K6282J1143k7894
11174b6030m3831k6780m311N4925K6000j7764K1089M9281L4711k9837J0251o6388
$$ plain form
11257 -21546 -33973 -23467 -4310 64625 11991 23544 22528 10173 8812 -40171 -43707 -48493
11245 -48493 -70513 -76651 -58807 -96433 -56486 -11416 15093 56426 82591 64772 50539 35063
11233 35063 18929 -25015 23006 4208 -2290 53409 24265 -26036 -93075 -51428 -15912 -63637
11221 -63637 -86320 -78254 -31515 20448 38316 -3376 -4804 861 -24683 -47807 -50469 -11552
11209 -11552 28887 44904 -68865 -109349 -583 26234 -8837 -80266 -61812 -5178 11318
11198 11318 -10226 16361 -29793 -81024 -79284 22911 15564 -15518 -4896 -78837 -50031 17694
11186 17694 -3074 -61692 -133480 -105001 -85034 -76492 -47182 -50082 -35561 -9279 1864 -26030
11174 -26030 -69861 -96641 -100952 -46027 -20027 -37791 -16702 32579 67290 37453 47704 -18684
11162a8684p3893m982K5307j2642k5960L4562k2574j7637R8678O2449N7236n1236
11150E0624j16808K0877L0288j9370l0218l6474M3553N3237N2497L1491l1866
11139D7831m5531j6206k0116j0358j1373J0166J5135M2106j658j0603k3455m7569
11127g1631q403k0627k3874N5204K7751m8014J3486P6919J8763o0146q0758J4623
11115a06707K8455K6454j4828M4666Q1495M0129k3332j109L4504j07404q1641
11104g9318P3946K8988k8639J1388K9775n12j3145n4425k29l023M7R213M4071
11091A8137Q9434j7137N007R168m6145p1397R502K6305M7640N618k6473l5506
11079A4153J6551K6365l5344n8493K7089J3217m4152m907M6806N3798k5183l514
$$ plain form
11162 -18684 -92577 -97559 -72252 -84894 -110854 -76292 -98866 -116503 -17825 44624 101860 50624
11150 50624 -66184 -45307 -15019 -34389 -64607 -101081 -57528 -4291 48206 79697 47831
11139 47831 2300 -13906 -34022 -44380 -55753 -45587 -30452 11654 9996 -607 -24062 -71631
11127 -71631 -80034 -100661 -124535 -69331 -41580 -89594 -76108 811 19574 -40572 -121330 -106707
11115 -106707 -78252 -51798 -66626 -21960 59535 99664 76332 75223 109727 2323 -79318
11104 -79318 -5372 23616 -5023 6365 36140 35628 22483 -31942 -32171 -35194 -35147 -25934 18137
11091 18137 107571 90434 95441 104609 58464 -12933 -3431 22874 70514 76132 49659 14153
11079 14153 30704 57069 21725 -36768 -9679 3538 -40614 -45521 1285 55083 29900 26386
11067B6386j0449j4278K3741J4918M7724k2383o0096p938J0720k2353p375R684
11055a1699m0623K4674o128o7765k3332N7524P5286K1028j8561m5721j3734R631
11043c9420k1039j8553j3900O2683N9488K7257k4367K5179J1753K4213P820j8419
11031H2695l6903K5479Q708p5812n0763l821N7150M5755l409J1630M8314L1051
11019A40074J4354N4537j4795J5534Q9222R8435R1582K23028N79145R74807P03672
11008B969595l06710m54925l68579n32674n22763k70743j19915j14121j11229
10999A67936p7458N150l451K5599j9124l4926M3670q24J8443L8870k1607k2696
10987A19582l9514k6543k7518L3284Q894j3113J4375m9860Q587M2049P268R500
$$ plain form
11067 26386 15937 1659 25400 40318 88042 65659 5563 -2375 8345 -14008 -21383 -11699
11055 -11699 -52322 -27648 -33776 -101541 -124873 -67349 7937 28965 10404 -35317 -49051 -39420
11043 -39420 -60459 -79012 -92912 -30229 29259 56516 32149 57328 69081 93294 101114 82695
11031 82695 45792 71271 79979 4167 -46596 -50417 6733 52488 49079 60709 109023 140074
11019 140074 154428 208965 194170 209704 298926 397361 488943 711971 1291116 2265923 2969595
11008 2969595 2662885 2207960 1839381 1306707 783944 513201 393286 279165 167936
10999 167936 90478 95628 92177 117776 98652 63726 107396 106572 125015 163885 142278 119582
10987 119582 80068 53525 26007 59291 68185 55072 69447 19587 28174 70223 77491 86991
10975H6991P478m537n1829n8533k6808N492M5245r509m0489K8008l5209R8559
10963D4859P9799k4347r5786j9235M7094N7720N5830o1586n0636j3895K9686q526
10951D0977m8815M1574k4811o2968K8690L1145J7834L5519j067N5408R581o7515
10939E5552l8721O862L880p573n7466J9859L4710m7788L959J3351m6750M533J13402
10926E7810L1623J1817K96M8840Q70o4728o536N034l8781j3327L4986n1870m8157
10913c2123L0373O0357J6808n5698L4864O1834L0155l866P991j9680r5921j4043
10901B1051L0338K8339k9916L9849R003n5733k9479O7035M575m6244J4704L0446
10889H3968l0474l4767J6195M0580j9079m1895J6033P110j8189j9458L053r189
$$ plain form
10975 86991 94469 89932 38103 -20430 -47238 -41746 3499 -6010 -46499 -18491 -53700 44859
10963 44859 124658 100311 4525 -14710 32384 90104 145934 84348 33712 19817 49503 40977
10951 40977 -7838 33736 8925 -54043 -25353 5792 23626 59145 58078 113486 123067 55552
10939 55552 16831 23693 27573 20000 -37466 -17607 17103 -30685 -26726 -13375 -60125 -55592 57810
10926 57810 89433 101250 101546 150386 151256 86528 79992 85026 46245 32918 67904 16034 -32123
10913 -32123 -1750 58607 75415 19717 54581 116415 146570 142704 150695 131015 35094 21051
10901 21051 51389 79728 49812 89661 98664 42931 13452 80487 85062 38818 53522 83968
10889 83968 53494 18727 34922 75502 56423 14528 30561 37671 19482 24 3077 -6112
10877f112O5235L6474m6552r895J2237J1548P7536l5035o3738o237L7097k7169
10865D5389j8577l127L2185j0482N960K9623n4189p5095k9677N181M582N2591
10853a5636N4704M4431p337l2687r6114k1057M2439K1398O069K0937K5025K3371
10841F5543j0970n9435l8466J8752l2359k1987J1624M5690L5773L7811J6974n4983
10829A3967l6596J3666j1000j8188P573q115k9190J0722Q2233O2411q301n9631
10817A9551j1802m9500k1246O1814O4812k0954K0675m1481p4007q4664L4190N9230
10805d3382r498P646K2887O0826N9367l2620l0178k8207l6876n4335N5733P0325
10793D1688L1900J7234m446o8368l3555J8943N0025j8098N990K4586m2763p088
$$ plain form
10877 -6112 59123 95597 49045 39150 51387 62935 140471 105436 41698 35461 72558 45389
10865 45389 26812 23685 55870 45388 51348 80971 26782 -48313 -77990 -72809 -68227 -15636
10853 -15636 39068 83499 76162 43475 -52639 -73696 -31257 -9859 -3790 17147 42172 65543
10841 65543 54573 -4862 -43328 -24576 -56935 -78922 -67298 -21608 14165 51976 68950 13967
10829 13967 -22629 -8963 -19963 -38151 -30578 -38693 -67883 -57161 25072 87483 79182 19551
10817 19551 7749 -41751 -62997 -1183 63629 42675 63350 21869 -52138 -136802 -102612 -43382
10805 -43382 -52880 -45234 -22347 38479 97846 65226 35048 6841 -30035 -84370 -28637 41688
10793 41688 73588 90822 86376 18008 -15547 3396 53421 35323 41313 65899 23136 16048
10781A6048J88l6986j7716N5456K1601L1382M7462O5556m7784j9988p420J7309
10769A25108L4258k1144l9089j4628k5300L6603Q937o3074m5947l3396L7339O2197
10757F1864k1858m2064K4214M5472q0166o0211K2062M3061J04113l2961o7316
10746c790M6417K3121l6685p3386J2449K3676J6400j6259J9512M096k4988J4994
10734E557q453k1859N2036L8680m7989l8621n151m1950K2420K5737n933j3326
10722c8852l203N750J3236K7706K4441k6289p439l3064J68l8484k5335K8657M9119
10709b3589K347m4639L734N021Q552N5983K6014m032J1691j3495L8449K6107r3253
10696a110l2029j5426l3455L7543M2970J5628M5797K7383q9671j5120k589o204
$$ plain form
10781 16048 16236 -20750 -38466 16990 38591 69973 117435 182991 135207 115219 107799 125108
10769 125108 159366 138222 99133 84505 59205 95808 104745 41671 -4276 -37672 -333 61864
10757 61864 40006 -2058 22156 67628 -12538 -72749 -50687 -7626 96487 63526 -3790
10746 -3790 42627 65748 29063 -44323 -31874 -8198 8202 -8057 11455 15551 -9437 5557
10734 5557 -2896 -24755 27281 65961 17972 -20649 -25800 -67750 -45330 -19593 -25526 -38852
10722 -38852 -42055 -36305 -23069 4637 29078 2789 -4650 -37714 -37546 -76030 -101365 -72708 -23589
10709 -23589 -21242 -65881 -62147 -57126 -48574 7409 33423 29391 41082 27587 66036 92143 -1110
10696 -1110 -33139 -48565 -82020 -44477 -1507 14121 59918 87301 -2370 -17490 -20079 -26283
10684b6283n788K056O52m512j0012k9477n5361J5993M4366M2175J9545n643m247
10671a6536l0526L2602K580J7274P05M302P232n604j4420p4354k4076M7083J5634
10658c8104J1557l7085J6692P4807K2535j4407r328n4329j908L527n622M0982
10646I317M0610n46n3406j1205k2998j1464l4629J2352k6681N582K9337L1540
10634c2191k4753j2657j7082l7126M0526K8727M8983p502j2454J1920n141j109
10622a9859n178l3062o250M9246J3994J6957k5548p601N0165o290l4424J3273
10610E423N414k8989j8190L8484l1535M538N9762J4087p6251j8431L2167m6487
10598f0008q2648k9172N3505J03588N4385j2662k215l0010k7418n62K7014j381
$$ plain form
10684 -26283 -32071 -30015 -29363 -33875 -43887 -73364 -128725 -112732 -68366 -26191 -6646 -12289 -16536
10671 -16536 -47062 -14460 -11880 5394 6099 10401 17633 12029 -2391 -76745 -100821 -53738 -38104
10658 -38104 -26547 -63632 -46940 27867 50402 35995 26667 -27662 -29570 -26043 -31665 9317
10646 9317 49927 49381 -4025 -15230 -38228 -49692 -84321 -71969 -98650 -93068 -63731 -32191
10634 -32191 -56944 -69601 -86683 -123809 -83283 -54556 -5573 -13075 -25529 -13609 -18750 -19859
10622 -19859 -25037 -58099 -64349 -15103 -1109 15848 -9700 -17301 32864 26574 -7850 5423
10610 5423 10837 -18152 -36342 2142 -29393 -24855 34907 48994 -27257 -45688 -13521 -60008
10598 -60008 -142656 -171828 -118323 -14735 39650 26988 24773 -5237 -32655 -33217 -6203 -7584
10586g584o308k7909n6153j4523O2332N454j5717J0295l3565L5247K4841l0209
10574e3799k111L3785M2264k4299o4043L712J2481k803Q2488L3571m6911l721
10562A0614l6967l0799L4170R9324O680o5849k8777o040K1982K8048m3458l7419
10550d8491m32K5685K6087l490j3703L9815N5087m4494j5488L0190k923n0713
10538b870o7549K6298K3366k0484j2508P8795R7228J5070n5592n0305n9900j1982
10526d0433l1064k3659J6180n735j1546j5299k19K4115L7900r753J8148J9063
10514b2302k7815p2643l3534M5205L9526J7338M2848j9905l027M1053J5039Q287
10502C0070p5880l9412J898O4002P3520L2318M166p4073q7709n8888L1269P8414
$$ plain form
10586 -7584 -13892 -41801 -97954 -112477 -50145 -44691 -60408 -50113 -83678 -48431 -23590 -53799
10574 -53799 -55910 -22125 20139 -4160 -68203 -64491 -52010 -54813 27675 61246 14335 10614
10562 10614 -26353 -57152 -22982 76342 83022 17173 -11604 -17644 4338 32386 -11072 -48491
10550 -48491 -48923 -23238 2849 -641 -14344 25471 80558 36064 20576 50766 47843 -2870
10538 -2870 -70419 -44121 -20755 -41239 -53747 25048 122276 137346 81754 31449 -28451 -40433
10526 -40433 -71497 -95156 -78976 -84711 -96257 -111556 -111775 -87660 -49760 -59513 -41365 -22302
10514 -22302 -50117 -122760 -156294 -111089 -71563 -54225 -11377 -31282 -34309 6744 21783 30070
10502 30070 -45810 -85222 -83324 -19322 54198 86516 90682 16609 -71100 -129988 -98719 -20305
10490b0305k4688j1673M1372m2178m8899J880N9173n579k3837m6523J5218N1716
10478e4323m4561p166J0168L0213p365M2663k3492M4409o012n5223M7007M9961
10466B6279K0494m8197m8534m4816k8475J5836P8287O1371l0853l130M3882K666
10454D4810K964K7964m1857k0980N875M269j7636l1481k8606j2867k062K3112
10442d6495K4131M6343m4186l6809k465k7289q125j8571J5866J6672M4603O3969
10430B7644O7584N138k8073m5139j6549j8558P424j5252j2748M6477J4259j4332
10418A7875L1216r819j4088k5780m425l5838K6052J459m7422P910M9744L8336
10406C5220j4655k7795o3918l5829M9224l8477j987K1982J4151O0351k3477m0122
$$ plain form
10490 -20305 -44993 -56666 -15294 -57472 -106371 -104491 -45318 -50897 -74734 -121257 -106039 -54323
10478 -54323 -98884 -106050 -95882 -65669 -73034 -30371 -53863 -9454 -15466 -70689 -23682 26279
10466 26279 46773 -1424 -49958 -94774 -123249 -107413 -29126 32245 1392 -1738 42144 44810
10454 44810 47774 75738 33881 12901 18776 23045 5409 -26072 -54678 -67545 -69607 -46495
10442 -46495 -22364 23979 -20207 -57016 -59481 -86770 -94895 -113466 -97600 -80928 -36325 27644
10430 27644 95228 100366 72293 27154 10605 -7953 -529 -15781 -28529 17948 32207 17875
10418 17875 49091 39272 25184 -596 -5021 -40859 -14807 -13348 -60770 -52860 -3116 35220
10406 35220 20565 -7230 -71148 -106977 -57753 -96230 -98217 -76235 -62084 -1733 -25210 -65332
10394f5332l609K4449O5703m6354l8764k6762L3576j0366l6010K8136K4746M9534
10382a053N0643N043l8726m079K0473l5269m4614K5082P1366J9750m0630p0990
10370d3004K8852J2367P566J5736L4860j3860N5983P2025J6823N1955J13447K30590
10358E83340K26519Q6402o0313j24661k6245Q6673J30184J23399K2068p8964k05730
10347G62672j98318j20536j54020j01650q0038l3140j806m0881j8176n3564J9500
10336a9957Q429K3044j1780L3594N8118M670m4330m712M4780L0380k7476o6627
10324B8133q338L7194O0233J3220k0250P669m2005j4780j3372j0588j8228p573
10312A1315j2479m6099m0307J02000l8285O288k4296m92P2293K6997k2012q5658
$$ plain form
10394 -65332 -68941 -44492 21211 -25143 -63907 -90669 -57093 -67459 -103469 -75333 -50587 -1053
10382 -1053 49590 54633 15907 11828 32301 -2968 -47582 -22500 48866 68616 27986 -43004
10370 -43004 -14152 -1785 5781 21517 56377 42517 98500 170525 187348 239303 352750 583340
10358 583340 809859 896261 835948 711287 685042 771715 901899 1025298 1047366 968402 762672
10347 762672 564354 443818 289798 188148 108110 74970 73164 32283 14107 -39457 -19957
10336 -19957 -11528 11516 -264 33330 91448 96118 51788 47076 91856 122236 94760 28133
10324 28133 19795 56989 117222 130442 110192 117861 75856 61076 47704 37116 18888 11315
10312 11315 -1164 -47263 -87570 14430 -23855 -17567 -41863 -42355 29938 56935 34923 -50735
10300e0735q2753r371K5254O8843Q2000N586k5995l0503M2203m5936j7536K8632
10288a0311R6511L866o2632o9075k1452P0714M302J9855N8763k179p4184j20997
10276a06819L2648L9158J4467O5595J8229J5966r616j6857Q140j6724j7492r351
10264A7344m5640n1513L8242j2092M620P1169O2123m807j02183j8421J9241J4993
10252f924l533J5823N5490K6405J304o9469J031L9073M7726q709m0805l7490J3591
10239C3513l8764k9362m5291j7371R643k0428l6453j0253j8187M1319L8059K8072
10227f5503M3291M3251l6243m0949j4245K4911J7418m7928J6864J3842J0496L5360
10215E65n5117k1123R7660K411m5185q714K3024L2589j1111k1086l8038n2691
$$ plain form
10300 -50735 -133488 -142859 -117605 -48762 33238 38824 12829 -17674 24529 -21407 -38943 -10311
10288 -10311 86200 90066 27434 -41641 -63093 7621 11923 31778 90541 88362 14178 -106819
10276 -106819 -74171 -35013 -20546 45049 63278 79244 69628 52771 60911 44187 26695 17344
10264 17344 -28296 -79809 -41567 -53659 -49039 22130 84253 79446 -22737 -41158 -21917 -6924
10252 -6924 -10457 5366 60856 87261 88565 19096 20127 59200 106926 98217 57412 19922 33513
10239 33513 -5251 -34613 -79904 -97275 -87632 -108060 -144513 -154766 -172953 -131634 -93575 -65503
10227 -65503 -22212 21039 -15204 -56153 -70398 -45487 -28069 -75997 -59133 -45291 -34795 565
10215 565 -54552 -75675 21985 24396 -20789 -29503 -6479 26110 14999 -6087 -44125 -96816
10203i6816O36N4115M9764K1325k0473p1871J8788J4843Q421j5814L5880K0351
10191A9149j7926K835l5360N0336M715n1540j955N745N4385k791n3327l2270K0173
10178c7831P7224M0960l5953k0637k0795k9206K4014r589k8427n5347K7287L0980
10166c7320k3932l1090O9502L0541j3851j3770o6398l605K1105M0228L3438k9739
10154b4891k8557k7738K6570M9962p64q1262m1930N4279k111m416o255j708j1031
10141i9852l466M0103J7630L5232J2995j1999L1153k0579K6904m4678j7778J9806
10129a4529n4172j208M1620K4686N995K2035j6283k847J582j2438n181n3721k2387
10116h6848m073J7523P1830M1712l2758n9605J8400O620n0985k2272M0572k1666
$$ plain form
10203 -96816 -96180 -42065 7699 29024 8551 -63320 -44532 -29689 -21268 -37082 -1202 19149
10191 19149 1223 4058 -31302 19034 23749 -27791 -29746 -24001 30384 27593 -25734 -58004 -37831
10178 -37831 39393 80353 44400 23763 2968 -26238 -2224 -11813 -40240 -95587 -68300 -37320
10166 -37320 -61252 -92342 -22840 7701 -6150 -19920 -86318 -89923 -68818 -28590 4848 -24891
10154 -24891 -53448 -81186 -54616 -4654 -5418 -86680 -128610 -74331 -76442 -80858 -87113 -88821 -99852
10141 -99852 -103318 -63215 -45585 -10353 2642 -9357 21796 1217 28121 -16557 -34335 -14529
10129 -14529 -68701 -69909 -28289 -3603 2392 24427 8144 5297 6879 -5559 -10740 -64461 -86848
10116 -86848 -90921 -73398 -1568 40144 7386 -52219 -33819 -27199 -78184 -100456 -59884 -81550
10104h1550k923j9218m6344J2638j1328M3568P408q6j5346P142J9581M7449J08677
10091F9668K7210k7890J3983J4948m5091r2238m8057j946q336j8939O6338P1552
10079B1202M1892M840L6310q0505j9451K6702j7128m5699k8358J9457J9697M1410
10067B0369L0931m8764L2726q0055j2260L8320k9653K8118J3993N683j2399M3368
10055C0377N0392L2075J31131J56852P596k0798p6015j67268r9920q2710k5649
10044f3937M0676M2632J1735m5745L5206K0345p585p2197k4659k9138j7434L116
10032a06985N0752M1784n621p6326n6799N5495Q7451n9253k1967N7300j3526l378
10020e1073L6477j6781L9963N3043k2003l7092m0447M5960N6034l3121L2817m5423
$$ plain form
10104 -81550 -84473 -103691 -150035 -137397 -148725 -105157 -97749 -97835 -113181 -106039 -86458 -39009 69668
10091 69668 96878 68988 82971 97919 52828 -39410 -87467 -89413 -97749 -116688 -50350 21202
10079 21202 63094 67934 104244 23739 4288 30990 13862 -31837 -60195 -40738 -21041 20369
10067 20369 51300 2536 35262 -44793 -57053 -18733 -48386 -20268 -6275 -592 -12991 30377
10055 30377 80769 112844 243975 400827 408423 387625 311610 144342 44422 -38288 -63937
10044 -63937 -23261 19371 31106 -14639 20567 40912 33327 -38870 -63529 -92667 -110101 -106985
10032 -106985 -56233 -14449 -20070 -96396 -153195 -97700 -10249 -69502 -91469 -34169 -47695 -51073
10020 -51073 -14596 -31377 8586 61629 39626 2534 -37913 8047 64081 30960 63777 18354
10008A8354o0898n0768o2149k6026J6703r959L5861M6958K8555L924M129N2135
9996c181K5856p5315n4011J5114P466M671N36P2720M5693n4425j041P9087J0444
9983G3614j9511k8951j7962p1251l284l332P292L4416K5431J5858m2697M982K5107
9970b88k9809j8195n907N0754K7101k232N530K4061J753O264J5000j8870j9311
9957C5851Q6908k1400m4162m9562l8149k6773K5079K7390M0901L0446L9610R971
9945A16110J425m8624n6413j5084j1236M58K5119l036m2830M756L2275p2320k0571
9932h9971M242M1357M2027L9125Q2032J5543j4808o1507p4778N28L6577K8389
9920D8756p607J3148K6327l1211o2686l6327o518m239L6575j4781L9605L9473
$$ plain form
10008 18354 -42544 -93312 -155461 -181487 -164784 -174743 -138882 -91924 -63369 -59445 -55316 -3181
9996 -3181 22675 -52640 -106651 -91537 -84071 -79400 -78864 -6144 39549 -14876 -15917 63170 73614
9983 73614 54103 25152 7190 -64061 -67345 -70677 -63385 -28969 -3538 12320 -30377 -25395 -288
9970 -288 -30097 -48292 -54199 -3445 23656 21424 26954 51015 52768 59032 74032 55162 35851
9957 35851 122759 101359 57197 7635 -30514 -57287 -32208 -4818 36083 66529 106139 116110
9945 116110 117535 68911 12498 -2586 -13822 -13364 11755 8719 -34111 -29355 2920 -69400 -89971
9932 -89971 -85729 -44372 -2345 36780 118812 134355 119547 58040 -16738 -16210 20367 48756
9920 48756 41149 54297 80624 49413 -13273 -49600 -56118 -60357 -23782 -38563 1042 40515
9908D0515J3083o845m7195K4595q070j6217m1574j051j3011l4800l6292K8401
9896i8461K1240K6515M0168p152M057N9595q753p2639o7691m7712p167O5521J5141
9883g7338L111L6488K7174j3571Q951K8883l1385J0004o16o136r386j754n4806
9870h0381k4699M6592l2530N0421Q5302m045o871L3639J7758k1191l6019l0245
9858b269n3723l4157j8580N4778N4699l6032k1717o098j2247k2362N2143M0811
9846d754K3608k6132p786m1041O589K1882J2401O909P3022q7239J3595O9l1546
9833d0423K5613J5903j8753k9978M5222J2818J2184l679K7162j5600p973K6285
9821D8781J4240p030R109k7912k2226n029L788j2324o891k8487J1340r03l8149
$$ plain form
9908 40515 53598 46753 -442 24153 16083 -134 -41708 -42759 -55770 -90570 -126862 -98461
9896 -98461 -77221 -50706 -10538 -17690 -13633 45962 37209 -35430 -103121 -150833 -158000 -92479 -77338
9883 -77338 -74227 -37739 -10565 -24136 -15185 13698 -17687 -7683 -8299 -14435 -23821 -25575 -80381
9870 -80381 -105080 -58488 -91018 -40597 44705 40660 33789 67428 85186 63995 27976 -2269
9858 -2269 -55992 -90149 -108729 -53951 748 -35284 -57001 -63099 -75346 -97708 -45565 -4754
9846 -4754 18854 -7278 -15064 -56105 -49516 -27634 -15233 -8324 64698 -22541 -8946 -8877 -40423
9833 -40423 -14810 1093 -17660 -47638 -2416 10402 22586 18907 46069 30469 22496 48781
9821 48781 63021 55991 65100 37188 14962 9933 13721 1397 -5494 -33981 -22641 -23544 -61693
9808f1693q3137k2009J2031M2057j5983L3797J3016J0778M5644l7876Q038O1247
9796E910K2556j7427l4610m6918J3225M8081P995Q070L6993M4686m192r8885k5333
9783c9849M918J2520j3098m4669L7708l0708p6199q297N5458P9308O3712l1022
9771I782o4834m5802K1253K7807j0443j06788M3279O9234Q0185L5013L9802n1397
9759D7091m3366K5560M323k4225j4560L8670n0900J6762k9741p0709o752P279
9747a00568K3017J6859J2201K2595k430J2788m487K0014p0800j3099K3444L3057
9735b7409p6788m738M9864m751k5636k2838M2660J3312j9024K2768P1200j2907
9723E713n6433M7732M2731k112l4423q145m6428N1868Q6425n2366L5858J2777
$$ plain form
9808 -61693 -144830 -166839 -154808 -112751 -128734 -94937 -81921 -71143 -25499 -63375 -55337 5910
9796 5910 28466 11039 -23571 -70489 -57264 -9183 -1188 6882 43875 88561 84369 -14516 -39849
9783 -39849 -34931 -22411 -35509 -80178 -42470 -73178 -149377 -157674 -102216 -22908 40804 9782
9771 9782 -55052 -100854 -79601 -51794 -62237 -169025 -125746 -56512 23673 58686 98488 47091
9759 47091 3725 29285 33608 9383 -5177 33493 -17407 -645 -30386 -101095 -107847 -100568
9747 -100568 -77551 -60692 -48491 -25896 -28326 -15538 -20025 -11 -70811 -83910 -60466 -27409
9735 -27409 -104197 -108935 -59071 -63822 -89458 -112296 -69636 -56324 -75348 -52580 18620 5713
9723 5713 -50720 -2988 39743 37631 3208 -4937 -51365 503 86928 34562 70420 83197
9711H3197l8040p2478l2402m8528N236P4394P870m5897n898K6148n6729J6964
9699h6163O3889k06K0531L7619k6639o7201L006j232J645j4657j988M9403Q3388
9686F1395K3927m0455l072l4988m6321n284K900O0177Q2922L3788n7189l5389
9674D2411o9169J3204O074N1467n3256p4885m3794M3434l063P6615L1409p4978
9662e4531Q187Q0426K358j2842J1926k5569J2470p6039K7225L7950J5703Q931
9650C6195j3024n3593m700P7789m5143k9804j4737l7643j9632L9570M8713O6054
9638E0045p1351p5507L5407n6279N456L0747N1433N3223K7467k1051j7065Q384
9626B0909q646K0753O7472N174k2454k5536l5150J5895j1199k1525j2263J7557
$$ plain form
9711 83197 45157 -27321 -59723 -108251 -103015 -28621 -20751 -66648 -72546 -46398 -103127 -86163
9699 -86163 -22274 -22480 -1949 35670 9031 -58170 -55164 -56396 -54751 -69408 -71396 -21993 61395
9686 61395 85322 44867 41795 6807 -39514 -44798 -41898 18279 101201 134989 77800 42411
9674 42411 -26758 -13554 -7480 43987 -9269 -84154 -127948 -84514 -87577 -10962 20447 -54531
9662 -54531 -46344 34082 36440 23598 35524 9955 22425 -53614 -26389 11561 27264 36195
9650 36195 23171 -30422 -35122 42667 -2476 -32280 -47017 -84660 -104292 -64722 -16009 50045
9638 50045 -21306 -96813 -61406 -117685 -112229 -81482 -30049 23174 50641 29590 12525 20909
9626 20909 12263 33016 100488 105662 83208 57672 22522 38417 27218 5693 -6570 10987
9614A0987J4094m3973k0824N4445M4451K5285p3197k8783N168p9392N7904R3008
9602E9173L6874k0028l6592J1503K9603K8124L8104o735m6612l9724j1528J199
9590D3361L0893N295j6627J1262K8759j8892M7467L5571M0604O19l8131K4799
9578A94980R593l5518l8265n5017l7175R549J3272j5500K0330k4737M4525J128
9566H7165Q601j1316L5824K4915j2507o6211j0654J6257l5965R191J6602J384
9554F3286N563K1057l6746l9711P0084K0330j3123L1526j3087K080l4702K4371
9542A00928l1234m2130M248j2662Q795M5365M2822J9501M7583J10814K2288n2335
9530B63983L927p98l8940m2749K3018k5409n2414m554l0003n4533O813K9946j6792
$$ plain form
9614 10987 25081 -18892 -39716 14729 59180 84465 11268 -17515 -12347 -91739 -33835 59173
9602 59173 96047 76019 39427 50930 80533 108657 146761 140026 93414 53690 42162 43361
9590 43361 74254 79549 62922 74184 102943 84051 131518 167089 207693 208312 170181 194980
9578 194980 204573 169055 130790 75773 38598 48147 61419 45919 66249 41512 86037 87165
9566 87165 95766 84450 120274 145189 132682 66471 55817 72074 36109 45300 61902 63286
9554 63286 68849 89906 53160 13449 83533 103863 90740 122266 109179 111259 76557 100928
9542 100928 69694 27564 31812 19150 27945 73310 116132 135633 183216 294030 316318 263983
9530 263983 267910 267112 228172 185423 208441 183032 130618 126064 96061 41528 48341 78287 61495
9517F1495n7599K644j8412j5984N0951J212k1534L1384L196J2472k8585k2620
9505a380L3385L5345l7097n0882N1065J3964k0672M5507K0415k148l5005m709
9493D7788l7118n8448L2120M1535K7139N0185J352m4561P4232M9166N9279m4363
9481A98306j837j519m5744q0325k9658j4951m0399n7141k8792L3131K554J2006
9469e4369J08482P0381r219L323J8665l1972q2416m8493J4975N8211Q177O056
9457F1801L7679j4280M0679L5100l8008n7642o531n664p754q2994m2572l8562
9445a18748N9903J00271J4794r668K7527J7360l7786q8580O5284L3646O113M6930
9433A17046j5327n398k4989r0087j1384N9493N2678J5711n9249m1856L2075R8186
$$ plain form
9517 61495 3896 6540 -11872 -27856 23095 24307 2773 34157 37353 49825 21240 -1380
9505 -1380 32005 67350 30253 -20629 30436 44400 23728 69235 89650 87502 52497 47788
9493 47788 10670 -47778 -15658 25877 53016 103201 104553 59992 134224 183390 242669 198306
9481 198306 196469 194950 149206 68881 39223 24272 -16127 -73268 -102060 -68929 -66375 -54369
9469 -54369 54113 124494 115275 118598 137263 105291 22875 -25618 -10643 47568 55745 61801
9457 61801 99480 85200 125879 160979 122971 65329 58798 53134 45380 -37614 -80186 -118748
9445 -118748 -58845 41426 56220 46552 74079 91439 53653 -34927 30357 64003 70116 117046
9433 117046 101719 96321 71332 -18755 -30139 29354 82032 97743 38494 -3362 28713 126899
9421A26899M7050j5715k5683n2958m5913R115n986k2108k7027J3849J6715L2593
9409E0831M0768l2163l5364L0368K8287n4368Q338M2877M189m8495m362L9430
9397G0336j2495j143M0767M652n3886m5325L3189k9932j6007k2j4276L975L8332
9384A8165K1008j0988j4811L9219k6225n7466L625J2959p730O298K713m4040o7111
9371a24384L4253M7079N6323j9043r827j9447m4245k5961J3539M6085J4136m5981
9359g7473q605Q2367N916k4979m7270K2375K4353O0032K3665k0942k3144L6335
9347E2630J0464l594j5066m8136n340r53m6343m7190K8353k119n9343k9584J30409
9334c5812L8441M50Q433m5777m0910m85M1442j548l4284M913K4733M207l9322
$$ plain form
9421 126899 173949 158234 132551 79593 33680 42795 36809 14701 -12326 1523 18238 50831
9409 50831 91599 59436 24072 54440 82727 28359 36697 79574 83763 35268 30906 70336
9397 70336 57841 56698 97465 102117 48231 2906 36095 6163 -9844 -9866 -24142 -20167 18165
9384 18165 39173 28185 13374 52593 26368 -31098 -27473 -14514 -22244 -15946 -13233 -57273 -124384
9371 -124384 -90131 -43052 13271 -5772 -15599 -35046 -79291 -105252 -91713 -45628 -31492 -77473
9359 -77473 -86078 -3711 2205 -22774 -70044 -47669 -23316 36716 60381 39439 16295 52630
9347 52630 63094 59500 44434 -3702 -9042 -9995 -56338 -103528 -75175 -77294 -136637 -166221 -35812
9334 -35812 2629 3079 11512 -34265 -75175 -75660 -34218 -35766 -70050 -65137 -40404 -36197 -75519
9321g5519K8240L437L3163m9065m317P8490K9645K007R759l2790Q275K222J6347
9308D9894m8266k6959k5335J5626R7204r171m9939m856N6578K7642j5809j2713
9296E3896o203p598L1628m6737K0488L7088m6955l3406M8711L1420k7783o0423
9284e874k3684J0531J6570K4444J5519j3764K0213K7097p256j64M0235M7502l9778
9271A11591l1687P045K069k3599M643l3192j2796M7171Q032L1102l1081l1773
9259D7525L5259L3961k925j4034l4961k23M18n8277j3196O1541J34857K0252r7264
9246A12933K5838m1783j4294L9850q097k6803r302n5834j4355J15208M9072Q506
9234A80939j8202l2816j0274J2111J7217N383l5724L6218l4841p3387j6010K9167
$$ plain form
9321 -75519 -47279 -43842 -10679 -59744 -64061 14429 44074 46081 55840 23050 31325 33547 49894
9308 49894 1628 -25331 -50666 -35040 62164 52993 3054 -1802 54776 82418 66609 53896
9296 53896 47693 40095 71723 24986 45474 82562 35607 2201 50912 82332 54549 -5874
9284 -5874 -29558 -19027 -2457 21987 37506 23742 43955 71052 63796 63632 103867 151369 111591
9271 111591 79904 86949 89018 65419 70062 36870 24074 71245 79277 110379 79298 47525
9259 47525 82784 116745 113820 99786 64825 64602 65020 6743 -6453 55088 189945 210197 112933
9246 112933 138771 96988 82694 122544 114447 87644 78342 22508 8153 123361 172433 180939
9234 180939 162737 129921 119647 131758 148975 154358 118634 154852 120011 46624 30614 59781
9222E9781N7308K2592j5099j3706k5486M8916N6419j4713M2806j9238p5219R32
9210A25293K5633K1993j5470L8392l5033m1463P699j9164L5019Q0762J1820k1168
9198B14313j522m1558M8160m6774o234r917p379o561j5793j7002K7596L9071j9592
9185A56808j0623k8613m8908O3656L0715n0125K1109L0986L5830k0785q431K0329
9173A91948J1765n555l146m2490L672J4540K4858L4320l1796J860k8399p711M4392
9160B08258K9957l2445Qk850J7155J8336J8561j9608J8294j7549O4017J3150o780
9147C08504k4588m648R48L5913L2836N6463J4545L0949n9068l5633J3656L8967
9135D08844j975l6876M0725K1884m3136l7618Q3756L1117J6659K261J7724L1470
$$ plain form
9222 59781 117089 139681 124582 110876 85390 134306 190725 176012 218818 199580 124361 125293
9210 125293 150926 172919 157449 195841 160808 119345 127044 107880 142899 223661 235481 214313
9198 214313 212791 171233 219393 172619 166385 156468 149089 142528 126735 109733 137329 176400 156808
9185 156808 146185 117572 68664 132320 163035 112910 134019 165005 200835 180050 171619 191948
9173 191948 203713 198158 195012 152522 156194 170734 195592 229912 198116 199976 171577 163866 208258
9160 208258 238215 205770 205778 202928 220083 238419 256980 237372 255666 238117 302134 315284 308504
9147 308504 283916 279268 280216 316129 348965 405428 419973 450922 391854 356221 369877 408844
9135 408844 406869 369993 410718 432602 389466 351848 435604 466721 483380 485641 503365 534835
9123E34835J3893l763L8115J1645J5737j2238K5174K0472L2696O4229R3732K424
9111H36951K039j1497M0524M1284m627J1918K0451R9752Q1763j018M8455N1722
9099A217717J6687O8995L2790N997P8236M1402N2011M9435J7349O7333Q0290J2875
9087A741117J29457J31007N5263Q3687Q3256k2949J1736P3081J00062K6020j7534
9076B394203n5194N7481L974P535L9023M7338L9997O981l2325o4564J9329q265
9064B455513j4733p0379j01043j52919q2822k420m5206o0315k1901k8898j44871
9053A730006o1505o1887p5959m7525m554j28306l7592k2760n7518q0327p5517
9042A076556J5051m1147k5848n766q5110p5353p138l8249k9919L6298l8397m2531
$$ plain form
9123 534835 548728 544965 583080 594725 610462 598224 623398 643870 676566 740795 834527 836951
9111 836951 838990 827493 868017 909301 904674 916592 937043 1036795 1118558 1117540 1165995 1217717
9099 1217717 1234404 1303399 1336189 1342186 1420422 1461824 1513835 1563270 1580619 1647952 1728242 1741117
9087 1741117 1870574 2001581 2056844 2140531 2223787 2200838 2212574 2285655 2385717 2411737 2394203
9076 2394203 2339009 2396490 2400464 2407999 2447022 2494360 2534357 2541338 2509013 2444449 2463778 2455513
9064 2455513 2440780 2370401 2269358 2116439 2033617 2031197 1985991 1925676 1903775 1874877 1730006
9053 1730006 1668501 1606614 1530655 1483130 1478576 1350270 1312678 1289918 1232400 1152073 1076556
9042 1076556 1091607 1050460 1024612 1018846 933736 858383 851245 812996 783077 819375 780978 738447
9030G38447L258R426M0819O036k0727J8156J9435j0172l8902p4350j7076J6878
9018F91228P271r670n1842j4027n0094m4378o050j4944j02352l8459J6545J5474
9006C98702k61Q1258k1330q1813o251N1330Q629O1659j4342n3498j8659m9024
8994C56400j09986k3703M4205j5483p6060m7557N345k9403K0365P7985O4630J8238
8982B84976m4384l29J4389N4692J6193k235m527r55N8230J101J5237N6524K0355
8969D69267J2711l7463k3714l6607n6686p6390k8924k1724R610Q2495m266q5406
8957B02903r598m2592p910k3417K8594j033k5058j3693m654R251j5596q946r008
8944G9243j3935O8315J605l0242K5314K0670L0947L1160q49Q4256N3396m091o6270
$$ plain form
9030 738447 741705 751131 791950 797986 777259 795415 814850 804678 765776 691426 674350 691228
9018 691228 698499 688829 636987 622960 572866 528488 522438 507494 405142 366683 383228 398702
9006 398702 398441 479699 458369 376556 370305 421635 430264 491923 477581 424083 405424 356400
8994 356400 246414 222711 266916 251433 175373 127816 133161 103758 124123 202108 266738 284976
8982 284976 240592 240263 254652 309344 325537 323302 318775 317820 376050 377151 392388 448912 469267
8969 469267 481978 444515 420801 384194 327508 251118 222194 200470 210080 292575 288309 202903
8957 202903 193305 150713 142803 119386 147980 146947 121889 108196 103542 112793 97197 88251 79243
8944 79243 65308 133623 135228 104986 130300 150970 181917 213077 212228 296484 349880 345789 279519
8931B79519l1745m1595m5907L6264N4552L5953K2895K3364J5836M0860M7044j6216
8919D20824q2799l2237n4650n8831p594l3847n0985l9206p8790J2840K3226L307
8907B1258k0829J2546K0668M3094N0366j4623l8298P890J5663M9934l6023J7706
8895A29352r475J7603N4688L5774n375j7361R2418K39939K63785O0316j32104
8884G29560j23629j56508j09368k1931J0254k4437K0458M9394n9155N2121j4803
8873C51956r5914M1865j8815k5873m1218m8745k3916k4159j9779Q767j4057L3514
8861A23626Q7794k2793m4067l2326J7543K2868K7253N0743M8120m8645l3259k3851
8849A73006k9118J5132L7812J20262J26656K57270M15111L70314k7828k50102
$$ plain form
8931 279519 247774 206179 160272 196536 251088 287041 309936 333300 349136 389996 437040 420824
8919 420824 338025 305788 251138 192307 184713 150866 99881 60675 -18115 -5275 17951 21258
8907 21258 429 12975 33643 76737 127103 112480 74182 82072 97735 147669 111646 129352
8895 129352 119877 137480 192168 227942 222567 205206 297624 537563 801348 861664 729560
8884 729560 605931 449423 340055 318124 328378 303941 324399 373793 314638 366759 351956
8873 351956 256042 297907 279092 253219 212001 163256 139340 115181 95402 104169 90112 123626
8861 123626 211420 188627 144560 112234 129777 152645 179898 230641 278761 230116 196857 173006
8849 173006 143888 159020 196832 317094 443750 701020 1116131 1486445 1458617 1208515
8839A208515j87652k20176k53373k14422p2005m8144L7330r957j2806L5178K9871
8828B92359j3499l505n9394l2153l8229j3336n604J6482j5473r586m0871j7636
8816E9555L9380k2322K283j923P4573Q4139n2547n5841k1431k634K0286j9888
8804A03630K7638M6249M9762L571N9144J27380J12640K09353L3578j17846q2458
8793E72641o5619j04445r4401l6996m1032J6154O3136m975j03035l6649j8751
8782A46028j9531Q930l106m1897M2555M9363l3950k6906N289k3493K5525M9667
8770A78474j2758o6918l9229L2318l87m3410q1826O4422N0999k6928R340n430
8758E8667J4407k1503n3378J8531O4122J09054K5662l3964j5534M4717L129q295
$$ plain form
8839 1208515 1020863 800687 547314 332892 260887 212743 250073 240116 227310 262488 292359
8828 292359 278860 275355 215961 183808 145579 132243 126639 143121 127648 118062 77191 59555
8816 59555 98935 76613 78896 76973 151546 235685 183138 127297 105866 103232 123518 103630
8804 103630 131268 177517 227279 230850 289994 417374 530014 739367 772945 655099 572641
8793 572641 507022 402577 308176 271180 230148 246302 309438 304463 201428 164779 146028
8782 146028 126497 135427 132321 90424 132979 182342 148392 121486 126775 103282 128807 178474
8770 178474 165716 98798 59569 91887 91500 48090 -33736 30686 81685 54757 64097 58667
8758 58667 73074 51571 -1807 16724 80846 189900 215562 181598 166064 210781 213910 205615
8746B05615m0360l8876j1735k9630j6801r170M2646J5958m0741j503K7237l0326
8734G2314l4588M088K0849R569J4622l9447k6010K0106K5545j3694k2936K8809
8722E9227o9339l4823P417J05196N2792J4608J8295n412l5043k2330j3193L301
8710H0696M3205O6913o229n1015j0513k0888O648O5046M7643k1967o1128L090
8698A41501n1169k3583l9048M7897k4532k3054J6918J649N288M2912m064o2499
8686B8216L7944j2451k4708k7205J3075J7117R771K0372L093j06550j3593M8485
8674f434P138J7398J4850L2287J4491K778q9062j7973M2255O5966L1600k50j6223
8661I8821N3338R2238L0920J4781J4614p9561j7624j4273m5185m1027j4684M7489
$$ plain form
8746 205615 165255 126379 114644 85014 68213 59043 101689 117647 76906 75403 102640 72314
8734 72314 37726 41814 62663 72232 86854 47407 21397 41503 67048 53354 30418 59227
8722 59227 -10112 -44935 -37518 67678 120470 135078 153373 147961 112918 90588 77395 80696
8710 80696 123901 190814 184585 133570 123057 102169 108817 173863 221506 199539 138411 141501
8698 141501 90332 66749 27701 75598 51066 28012 44930 46579 51867 94779 90715 28216
8686 28216 66160 53709 29001 1796 14871 31988 41759 62131 65224 -41326 -54919 -6434
8674 -6434 704 18102 32952 65239 79730 82508 -6554 -24527 17728 83694 115294 115044 98821
8661 98821 152159 244397 275317 290098 304712 225151 207527 193254 148069 107042 92358 139847
8649A39847J0783k9482L2728K7905O29J747q774k6862J6931R804K8110O8053L5692
8636C07111k5334j8016k3616J188k4518j5344k8995k6847o314l5468N3366j6020
8624A41193m442m3700j6207J1933N4321L335l4164N5352J14781N0792O6645n2449
8612C47390p7951p8065k8097J2399Q92K6017l9348k2756j6746J4867k2793j774
8600A14035k3349p2908N1757P2257L0644L2353O446L6949M8350j01997k6093K9814
8588A98258M5212j2533q1371k722l3643k855M0964j8532m3159l09L5394j3243
8576A11461o486K0008K7845m3250R7810J98021J99275J24232n6874p4124j40423
8565D57495j10417r0080l3006r041k4143k8779J8154j140l5593m6417J4874m5055
$$ plain form
8649 139847 150630 121148 153876 181781 182410 184157 175383 148521 165452 175256 203366 271419 307111
8636 307111 281777 263761 240145 241333 216815 201471 172476 145629 139315 103847 157213 141193
8624 141193 136751 93051 76844 88777 143098 146433 112269 167621 282402 333194 399839 347390
8612 347390 269439 191374 163277 175676 176568 202585 163237 140481 123735 138602 115809 114035
8600 114035 90686 17778 69535 141792 172436 204789 211235 248184 296534 194537 168444 198258
8588 198258 243470 230937 149566 146844 113201 110346 151310 132778 89619 89310 124704 111461
8576 111461 104975 124983 152828 109578 207388 405409 604684 728916 672042 597918 457495
8565 457495 347078 256998 223992 214951 190808 162029 180183 179043 143450 97033 111907 66852
8553F6852j045O5191j3469n5815Q02J3104N0242L9035J6442o575k5304k7619m2161
8540G9680l3328k533j8521K4663P8937j4663M0324k7921l290J2636N6717O2505
8528B55206P3423R7399K41938K37551k8121p2178o1138j82703k10085j47984m4107
8517A59201m9706l7048j4975M1807K2219n6342q293R1017N2520n7055n8033l4521
8505E0791k4513J8190L0663j3191j7818l8263p2393m1135P2618L0582J35M5765
8493D1431l0505m085L07l2142n0500N5548j3474L642L3479O3690J22823J27983
8481C18197P4822L9578n3632o6076m8343p8978r1601o7863J0250M3862J3740K5727
8469A19683l894k9799k309k2427o299n003L9431P040K1951M113j4440o4544R9
$$ plain form
8553 66852 65807 130998 117529 61714 62516 75620 125862 164897 181339 174764 149460 121841 79680
8540 79680 46352 43819 25298 49961 128898 114235 154559 126638 123348 135984 192701 255206
8528 255206 328629 426028 667966 905517 877396 805218 744080 561377 351292 203308 159201
8517 159201 109495 72447 57472 99279 121498 65156 56863 147880 200400 143345 85312 50791
8505 50791 26278 44468 75131 61940 44122 5859 -66534 -107669 -35051 -4469 -4334 41431
8493 41431 10926 6841 7148 -24994 -75494 -19946 -33420 -29778 3701 67391 190214 318197
8481 318197 393019 432597 378965 312889 264546 185568 93967 26104 36354 80216 93956 119683
8469 119683 115789 85990 83681 61254 54955 49952 89383 96423 118374 122487 108047 43503 43602
8456D3602L4108k6300K2359n898j4818M8657l3835k4400L7108J1189j7111K2999
8444I7660k1387k5766K9037k0358J4722N578J3812j927l8498l9918J2298N5966
8432H1219J1704O7335J5227o9063n5197k2171k9974m3326M6776K8776J1313l3422
8420I197J2962M6819J8867o2366r2578L5448N9743N0406k0334j7886k4021J5178
8408C1435m5012l0442K2004n1121k4107p485L6064M9374J3052n5622Q31J2123
8396d8906N8429K7972k7906j7692K2160p319K1923P475k6185J0942m1404K340
8384a8171K6016p3781J3991J3039k6634j0731R1900J0947n1824n711J428M0285
8372A0754M0673m8075k7460M3812k733r152N6390L3502m4573l7965K0229M6076
$$ plain form
8456 43602 77710 51410 73769 67871 53053 101710 67875 43475 80583 91772 74661 97660
8444 97660 76273 50507 79544 59186 73908 79486 93298 91371 52873 12955 25253 81219
8432 81219 92923 160258 175485 106422 51225 29054 -920 -44246 2530 31306 42619 9197
8420 9197 22159 68978 87845 25479 -67099 -31651 28092 78498 58164 40278 16257 31435
8408 31435 -13577 -44019 -22015 -73136 -97243 -104728 -68664 -19290 -6238 -61860 -61029 -48906
8396 -48906 9523 37495 9589 -8103 14057 6738 28661 36136 9951 20893 -20511 -18171
8384 -18171 7845 -65936 -51945 -38906 -65540 -76271 15629 26576 -25248 -30959 -29531 10754
8372 10754 51427 3352 -24108 19704 16971 7819 64209 97711 53138 15173 35402 81478
8360H1478l3597k6289L5780M768L9087p616o4822n5451l7312l2123K6668J5262
8348e4167l5921l4703J3743P2434L731o6111j0225J26631N6507J0531m5644n98
8336C6208k1433M2361k8165n0905j2723k012p805P7129P5590K4309m7754J2734
8324I7534J7562j3982L000o2882p9475p5132l560K9334K0617P4984L0298n696
8312C2602l151R8572K5015k1138J5536p898n9266n4309l6725j6883k3949k3979
8300g5573K4745k3417Q013K8733K2487O3882o2538j0195J9855k7955n1219J9694
8288f3488K3917q77k0254n781l512o857M0078L0193k0068k6761L9167K8898k5615
8275a0960o5460n1219N1351M5914o7240K7929K2154L9372k776K087m4954o4608
$$ plain form
8360 81478 47881 21592 57372 62140 101227 93611 28789 -26662 -63974 -96097 -69429 -54167
8348 -54167 -90088 -124791 -111048 -38614 -34883 -100994 -111219 15412 71919 82450 36806 36208
8336 36208 14775 57136 28971 -21934 -34657 -36669 -44474 32655 108245 132554 84800 97534
8324 97534 115096 101114 104114 41232 -38243 -113375 -116935 -87601 -66984 8000 38298 32602
8312 32602 29451 128023 153038 131900 147436 139538 80272 25963 -10762 -27645 -51594 -75573
8300 -75573 -50828 -74245 -66232 -37499 -15012 48870 -13668 -23863 -4008 -31963 -83182 -63488
8288 -63488 -39571 -40448 -60702 -66483 -69995 -76852 -36774 -6581 -26649 -53410 -14243 14655 -10960
8275 -10960 -76420 -127639 -76288 -30374 -97614 -69685 -47531 -8159 -10935 -8848 -53802 -118410
8263a18410j9148J03360M9326J8793m5028n2436p2263N4890N8406M1713P321K6764
8251E3288M1677q463j0714n4912K1501k4564l7866J318L3083J5904M3188K9279
8239A02719K4183L4472o923r1313n7038J9053K5275l373m0572M8481L9133K253
8227I6350m5517r073M4575j2969m0036j0151K1859j7921j9915l5341k7954N399
8215e0694K6833Q5838M0714k4881r2603l5385N5682O5034K5813k6059o9040k6781
8203b5529M1431M7624O333N629J567o051r167j7161k4705o0113O7304R3358J6011
8190A36531o2982k4291j445M0290O2361o0307q563M7203Q0057N6878J33637J10262
8178E09631R0053O495j5855n9572n1692n5918p2425p1527n6001l5405q8260J163
$$ plain form
8263 -118410 -137558 -34198 15128 33921 -11107 -63543 -135806 -80916 -22510 19203 26524 53288
8251 53288 94965 86502 75788 20876 42377 17813 -20053 -18735 14348 30252 73440 102719
8239 102719 126902 161374 154451 63138 6100 25153 50428 47055 6483 54964 94097 96350
8227 96350 50833 41760 86335 73366 33330 23179 45038 27117 7202 -28139 -56093 -50694
8215 -50694 -23861 61977 102691 77810 -14793 -50178 5504 70538 96351 70292 1252 -25529
8203 -25529 15902 63526 69859 75488 77055 71004 61837 44676 19971 -40142 27162 120520 136531
8190 136531 73549 49258 47813 88103 150464 90157 81594 128797 208854 265732 399369 509631
8178 509631 599684 606179 590324 530752 479060 423142 350717 279190 223189 187784 99524 100687
8166A00687j3546j132q0362j8094m953J9800J6171L5112Q686N3029L0095l4780
8154A10713P15J9713P3806j778l630J3910N34k7182l8683J7459K1758M4307k5362
8141B06280k2383M6525Q4591l1412K736N6276K21633K90378J94928J65500M9696
8130A264748o9580j31620j84687j56080j02764j17933j27905j11197n1989l9454
8120A71539r46j9676o6758P566J3016K351L8566L7567K722M5898J0253j7372j8030
8107B06696j6068K818J6887k271M7708L3291M3900M8731O9930j2821l0774q3926
8095C24101q0359l5242l0140O6893L6886O0180P7702P1362P5009Q6027m3887j01822
8083E06710o9687J4276j9067n9992m8220q8234j00586l2071J3101K9452p0281
$$ plain form
8166 100687 87141 86009 5647 -12447 -17400 2400 18571 53683 62369 115398 145493 110713
8154 110713 111428 131141 204947 203169 199539 213449 213983 186801 148118 165577 187335 231642 206280
8141 206280 183897 230422 315013 283601 286337 342613 564246 854624 1049552 1215052 1264748
8130 1264748 1195168 1063548 878861 722781 620017 502084 374179 262982 210993 171539
8120 171539 170593 150917 84159 91725 104741 107092 145658 183225 185947 231845 242098 224726 206696
8107 206696 190628 193446 210333 208062 255770 289061 332961 381692 451622 438801 408027 324101
8095 324101 243742 208500 178360 245253 282139 342319 420021 491383 566392 652419 608532 506710
8083 506710 437023 451299 432232 372240 324020 235786 135200 103129 116230 145682 75401
8072G5401l562j9978K2329Q857j1805k191J8851q191m7542L1446P8727K2699N088
8059A70129K0457l834k6461j1598N7256o965j4941K954k9307R444N100n7710l8444
8046G6080j6110N5900O5561j5668k9840J1770o8430m7488J6510J3719P3427J7605
8034A53036o0374m1443p1338j6428k8376M5336P2392L3912j7773l2791J3166k630
8022D6689J540J1951L5375n556j324L0079L403j8300m3717J2278L0677J1176K7570
8009A41841m896o3020o267N445j7780j4630J1039J017k4499J9982j49K5808K0476
7996I4367m7388k4193L3820N3332J6546M8037K243p1280m1272l9324P267l6448
7984d293K291K6945N19j0344M9628k0824M254K6721M4851m2870n5001M3642M2406
$$ plain form
8072 75401 71839 51861 74190 83047 71242 69051 87902 79711 32169 63615 142342 165041 170129
8059 170129 190586 186752 160291 148693 205949 198984 184043 186997 157690 167134 172234 114524 76080
8046 76080 59970 115870 181431 165763 135923 147693 79263 31775 48285 62004 135431 153036
8034 153036 92662 51219 -20119 -36547 -64923 -19587 52805 86717 68944 36153 49319 46689
8022 46689 48229 60180 95555 89999 88675 118754 122157 103857 60140 72418 103095 114271 141841
8009 141841 136945 73925 67658 73103 55323 40693 51732 52749 28250 48232 48083 73891 94367
7996 94367 46979 22786 56606 109938 126484 174521 176764 105484 64212 24888 32155 -4293
7984 -4293 -2002 24943 25462 15118 64746 43922 48176 74897 119748 76878 21877 65519 107925
7971A07925Q891p4579l8514L1394J4199k8560l6540K2772P5210N9008n5799m3744
7959D1663k8917K4605M4225n1128k3628M0395M0077K549j8805l1966o4463k6224
7947e1617k0771q256L3022M6316N4153N0407r2807j0478Q541j8496N106K5145
7935B0265O0616J1994O31n6111k9122R794O470P3385O0738n5938k4152K2988k0817
7922H0741K6418M3407k1165m4272l4543M0161l474m1718m616k2813M4334K6464
7910H8924o3846m5546o555J5713N1798J9617o1924J9569k6095l334M4001K7885
7898F0207q121K4383R283L766k6316k1600L781k2839j4442L1040m592j2515P099
7885B9134m4773M0726M1733o0271P638L6867K0206k3363n6633o5787j2660N687
$$ plain form
7971 107925 116816 42237 3723 35117 49316 20756 -15784 6988 82198 141206 85407 41663
7959 41663 12746 37351 81576 30448 6820 47215 87292 89841 71036 39070 -25393 -51617
7947 -51617 -72388 -80644 -47622 -1306 52847 103254 10447 -31 8510 -9986 -4880 20265
7935 20265 80881 92875 93506 37395 8273 18067 24537 97922 158660 102722 78570 101558 80741
7922 80741 107159 150566 129401 85129 50586 90747 87273 45555 40939 18126 62460 88924
7910 88924 25078 -20468 -27023 -11310 40488 60105 -1819 17750 -8345 -11679 32322 60207
7898 60207 52086 76469 85752 89518 63202 41602 45383 22544 8102 39142 34550 22035 29134
7885 29134 -15639 25087 66820 6549 14187 51054 71260 47897 -8736 -74523 -87183 -81496
7873h1496N5231j6837j0131l6549k77M0446K9376K4832N2311k0898j8786J9567
7861C6789n5483k2156K4538K3212k3274K1707N9279K2048m5069p6439j3748l1255
7849g9851J1535O0519M588Q250J4974k8414L1345j1687j3641Q4714K0475j3142
7837H9665r3704l2869o385l5980j2175J1715L2120L8897L6356K3129k1709M214
7825C3274N8475p952k4321K4061m5504j5086M3977P194j7046k65m1644L6002N1539
7812A02704m5444n1750K9069j4137L295j6569l8758n071J4371L3116K5017l80
7800C5463j4563k3313k6046m2940Q668p908n0403j4046O9522R1563M0018M742
7788G0757l5157n2604J1485R11K0204M1098m7082m8499j8758K7963J4845o5007
$$ plain form
7873 -81496 -26265 -43102 -53233 -89782 -90059 -49613 -20237 4595 56906 36008 17222 36789
7861 36789 -18694 -40850 -16312 6900 -16374 5333 64612 86660 41591 -34848 -48596 -79851
7849 -79851 -68316 -7797 -3209 5041 20015 -8399 22946 11259 -2382 82332 102807 89665
7837 89665 -4039 -36908 -43293 -79273 -91448 -79733 -47613 -8716 27640 50769 29060 33274
7825 33274 91749 83797 59476 83537 38033 22947 66924 74118 57072 56807 15163 51165 102704
7812 102704 57260 5510 34579 20442 23737 7168 -31590 -36661 -22290 10826 35843 35463
7800 35463 20900 -2413 -28459 -71399 -62731 -70639 -121042 -135088 -65566 25997 66015 70757
7788 70757 35600 -17004 -5519 -4608 15596 56694 9612 -38887 -57645 -29682 -14837 -79844
7776g9844J7732M5673N338l808R3K5925m96M7190Q1244k4551q2510o2080J4395
7763a5699K6132k8335J8469j1711M906Q1038J8626l6658m740m366m1210p3173
7751f6721m7944N423K1529L3854M6736J0643k0464k9396K6165O3646O657j6499
7739C3629m2381l1651n363j3587k0807M4610O1365j2331J035J141l3660k9861
7727d7861j8075j2485L7298L8403R870O148N510n530M6852N6762K2280o3498n7435
7714A8239q8468J5164R6379O3856l7354l4075K0815K7967j6571m850k2484L194
7702D1812L9724q768n4297q125q434N9659L2688J1194j1784l4092J9690P3658
7690A52925N484n1196o2408o283N4013j07927k7044L2192r2525o0040O5309L5153
$$ plain form
7776 -79844 -62112 -16439 -11101 -14909 -14816 11109 10613 57803 139047 114496 31986 -30094 -15699
7763 -15699 10433 -17902 567 -11144 -6238 74800 93426 56768 52028 47662 6452 -66721
7751 -66721 -114665 -109242 -87713 -53859 -7123 3520 -16944 -46340 -20175 43471 50128 33629
7739 33629 -8752 -40403 -45766 -59353 -80160 -35550 25815 13484 14519 15660 -18000 -47861
7727 -47861 -65936 -78421 -41123 -2720 7150 13298 18808 13278 60130 116892 139172 75674 18239
7714 18239 -70229 -55065 41314 105170 67816 33741 54556 82523 65952 61102 38618 41812
7702 41812 81536 72768 18471 10346 1912 61571 94259 105453 93669 59577 79267 152925
7690 152925 158409 107213 44805 38522 92535 -15392 -42436 -10244 -102769 -162809 -97500 -62347
7678f2347l251O3626M9838J1859l5085j250j4873m5296K4411m525J5589K5441
7666B4137N8k4685r374k0654m8638K0248L0506K8310K215k9100m4760m1832j7639
7653a31208L0405P2212Q2470R083n5628R17L939n1518j03297q7259Q8421R1784
7641d9679J1400J4587M8150L3984m0601r7508m2498L0960L659O5512J5850l1859
7629c8043J5407o456p496j2427L2365p4811j4206R4847j1516l6723K6792N1853
7617A9586K265j0008k4470M761o638l650j7416M4093K0262j5068j3525n4859o7009
7604a21676k9356O4676R7792j3486L513k1299p2473P093M9051l5104k4438J0944
7592h4763O1417j4838k8761Q076Q048J7711L6088k7630j6622O837L0836k7897
$$ plain form
7678 -62347 -65598 -1972 47866 59725 24640 23390 8517 -36779 -12368 -16893 -1304 24137
7666 24137 24195 -490 -9864 -30518 -79156 -58908 -28402 -92 2123 -26977 -71737 -113569 -131208
7653 -131208 -100803 -28591 53879 62962 7334 8251 12190 -39328 -142625 -229884 -141463 -49679
7641 -49679 -38279 -23692 24458 58442 17841 -79667 -122165 -91205 -87546 -22034 -6184 -38043
7629 -38043 -22636 -29092 -36588 -49015 -16650 -91461 -105667 -10820 -22336 -59059 -32267 19586
7617 19586 21851 11843 -12627 -7866 -14504 -18154 -35570 8523 28785 13717 192 -54667 -121676
7604 -121676 -151032 -86356 11436 -2050 1463 -19836 -92309 -85216 -36165 -71269 -95707 -84763
7592 -84763 -23346 -38184 -66945 -58869 -50821 -33110 2978 -24652 -41274 -34437 -3601 -31498
7580c1498K200m2703m9982K7287L3813O0482O5538q6960m2919N0329K310o7518
7568g9621j8436Q59J5418N0518O3962m7793k3248K5859p827o718j9811k4738J2652
7555e8924n768Q988N0344L105j2068M3686j3265n3735m1385K0079M6528l8586
7543e1001l2885j4688N723O722J0017J2441j2792J172p352M5819K8304q292k0688
7530c7500J351k6509p5112q993L5269j4250O5364O9709O0032j8489J134n3431
7518a425m6798o4423K1569R0763L4129L5135k3072k533O11n5316L853O3774J3542
7505F9809k3802j7836O548N2640m5264o5024k5877j7377P5561M9976j5300n5094
7493a1040o4820J4944l6992L977P5705J7516K8512k270j2869K4803L6955R815
$$ plain form
7580 -31498 -29298 -72001 -121983 -94696 -60883 -401 65137 -21823 -64742 -14413 -12103 -79621
7568 -79621 -98057 -97198 -81780 -31262 32700 -15093 -38341 -12482 -20309 -27027 -46838 -71576 -58924
7555 -58924 -64692 -55704 -5360 -2255 -14323 29363 16098 -37637 -79022 -58943 -12415 -51001
7543 -51001 -83886 -98574 -92851 -86129 -76112 -63671 -76463 -75291 -82643 -36824 -8520 -16812 -37500
7530 -37500 -36149 -62658 -137770 -146763 -111494 -125744 -60380 9329 69361 50872 52006 -1425
7518 -1425 -48223 -112646 -91077 -314 33815 68950 45878 43345 43956 -11360 -7507 56267 69809
7505 69809 46007 28171 34719 87359 42095 -22929 -48806 -66183 9378 59354 44054 -11040
7493 -11040 -75860 -60916 -97908 -93931 -18226 -710 27802 25532 12663 37466 74421 84236
7481H4236L4359m2464l8530n8463n687K0624Q29n1067o9987O713O3291o264r4051
7468a56461K6888Q8075L7912L8446M9469Q4755j8713q3502r2547m1065J485K3519
7456d1739k0720L2083l5797l4113J5945P617L2358M767L9507j3110j3811M5108
7444A8095N3208J0822l9356m9024m7063K3994l222L2387M6706j2434M5602j4763
7432F4952q4196J3947K7016j8013k2863k3818O5105M7502M8146q0010j06646j8984
7420h7862M9239l764l2922P0126K3514l06m2579m3386L0477J8989J5298M377K0472
7407B1673M4819K5828q1957q658k9626j7056L7198j9512o5428K3021K9429J9751
7395b0518j8615P187J7617m021n143K7742N9015m1623q6000P753L3071K9421J257
$$ plain form
7481 84236 118595 76131 37601 -20862 -26549 -5925 -5096 -56163 -126150 -119437 -56146 -62410 -156461
7468 -156461 -129573 -41498 -3586 34860 84329 169084 150371 66869 -25678 -66743 -65258 -41739
7456 -41739 -62459 -30376 -66173 -100286 -84341 -76724 -44366 -39599 -92 -13202 -27013 18095
7444 18095 71303 82125 42769 -6255 -53318 -29324 -32546 -159 46547 34113 79715 64952
7432 64952 -19244 -5297 21719 3706 -19157 -42975 22130 69632 117778 37768 -68878 -87862
7420 -87862 -38623 -42387 -75309 -5183 18331 18025 -24554 -67940 -37463 -18474 -3176 1201 21673
7407 21673 66492 92320 10363 1705 -27921 -44977 -7779 -27291 -92719 -69698 -40269 -20518
7395 -20518 -39133 -31946 -14329 -18350 -23493 4249 63264 21641 -64359 -56606 -23535 5886 7143
7382G143J1162J429o0492l6935J7345j2677j1843O0052N7193k6022j5038K8544
7370A9861k2904k7448l0704k4596M0067J7867j0714j0266M5723k5812j4940L3247
7358a0619N7089j3067L4635K5148j6032l7478m7217k6193j9476L8196o7910Q030
7346g4894M8646n076K959m1672K586J3337J5406K0853o5784J728j3397J6210Q942
7333g0156L4354Q020o1029K537J0533n380K7625J8497Q992l3252n3343j6226l015
7320a31843O4775p505p3309r631O8858L6025J8375L5908K5183j12191q3145l6627
7308b05127P923Q7256P6768j1140K6713k7176p9708P176M918M0122l639n848Q826
7295g2936J0489j0156K7720K3375j4841O1860L7604J8645j5389q8035m0819L5292
$$ plain form
7382 7143 18305 19734 -40758 -77693 -60348 -73025 -84868 -24816 32377 6355 -8683 19861
7370 19861 -3043 -30491 -61195 -85791 -45724 -27857 -38571 -48837 -3114 -28926 -43866 -10619
7358 -10619 46470 33403 68038 93186 77154 39676 -7541 -33734 -53210 -15014 -82924 -74894
7346 -74894 -26248 -31324 -28365 -70037 -67451 -54114 -38708 -17855 -83639 -81911 -95308 -79098 -70156
7333 -70156 -35802 -27782 -88811 -86274 -75741 -81121 -53496 -34999 -26007 -59259 -112602 -128828 -131843
7320 -131843 -67068 -74573 -147882 -157513 -88655 -52630 -34255 1653 26836 -85355 -168500 -205127
7308 -205127 -197204 -109948 -33180 -44320 -17607 -44783 -124491 -117315 -112397 -72275 -75914 -81762 -72936
7295 -72936 -62447 -72603 -44883 -21508 -36349 25511 63115 81760 66371 -21664 -62483 -27191
7283b7191r284j4650m207k4593M4797P4302k3576q578K0876j1376n3697J855K8089
7270g233K029j5637k2103L8079L7029k180k9471k09P52j3473J0920L7182p366
7257B8319J0783L0796p609m0783j6876J041O7333P818n8331j6804n675j3358K7585
7244A4239N114o0510q48j2514j4641L1978j6191n9871L4920N8797M756l992o412
7231b5175M0983M466k0232K6850J6025J5099m129m2224m8175n052N8454j4255
7219B635L473N756J0103K4987J8775l1209N298l235J7838n856l2498j4359J8441
7206B0149K7073K759n9789k7754k0653j4143o50n3717k2420Q405L6933N2506j7762
7193f9063L2482K8911m8629O388M4014J4270q4657l0486P6107k4320q4022M155
$$ plain form
7283 -27191 -36475 -51125 -55332 -79925 -35128 39174 15598 7020 27896 16520 -37177 -35322 -7233
7270 -7233 -5204 -20841 -42944 -4865 32164 29984 513 304 1056 -12417 -1497 35685 28319
7257 28319 39102 69898 62289 21506 4630 5671 73004 80822 22491 5687 12 -13346 14239
7244 14239 19353 -41157 -42005 -54519 -69160 -37182 -53373 -113244 -78324 -19527 -14771 -18763 -25175
7231 -25175 15808 20274 42 26892 42917 58016 53887 11663 -36512 -41564 16890 2635
7219 2635 6108 11864 21967 46954 65729 34520 39818 36583 54421 48565 16067 1708 20149
7206 20149 47222 49981 -9808 -37562 -58215 -72358 -73008 -126725 -149145 -140740 -103807 -51301 -69063
7193 -69063 -36581 -7670 -56299 -49911 -5897 8373 -76284 -106770 -30663 -54983 -139005 -134850
7181a34850J08221O0642n8063o3343j3766J7665M2356n8759K1245M7171n446r93
7169c7920k1693l8509O3497K4707k5855m2640K1471L8036L062n087k280n0088
7157g3299R368L6431k0012l6496J2777L2381M257J933l6225N4211K3719l2346
7145b3301l5582Q5451p953j8705K3588j5148m8637o2900J6059l2586L7839O6795
7133a5080J9716J0904Q240q7700o0239k5654m860M5866M6377N2487N3462L2060
7121G5579l2535n630J4681j626l9826R41q083K1139K075N8678O3973l7118j03058
7108I190m1635p0898m452M107K2283J9107r337o5006l7261P180P6229r335N3550
7095d6278j9377m5162L3327N285j5448P4038M1309J2485l6321j6399M5123L1662
$$ plain form
7181 -134850 -26629 34013 -24050 -87393 -101159 -83494 -41138 -99897 -78652 -31481 -36927 -37920
7169 -37920 -59613 -98122 -34625 -9918 -35773 -78413 -56942 -18906 -15844 -20931 -23211 -73299
7157 -73299 -63931 -27500 -47512 -84008 -71231 -38850 -34593 -32660 -68885 -14674 9045 -23301
7145 -23301 -58883 26568 18615 -90 23498 8350 -40287 -103187 -87128 -119714 -81875 -15080
7133 -15080 4636 15540 23780 -63920 -124159 -149813 -154673 -108807 -62430 -9943 43519 75579
7121 75579 43044 37414 52095 50469 10643 11584 3501 24640 26715 85393 149366 112248 9190
7108 9190 -32445 -103343 -107795 -103688 -81405 -62298 -71635 -136641 -173902 -166722 -90493 -99828 -46278
7095 -46278 -65655 -110817 -77490 -72205 -87653 -13615 27694 40179 3858 -12541 32582 64244
7083F4244l749Q402L1140p973j0323j1139J9102l7275K3815k7334K5034J5390
7071H9334j8088l7917k6661J2694l8788m0794L8149O6799J1313p122l0223J439
7059B0135j065j6851L36q100k8647K1136L2295k9807P384J6519L4642j2027n0568
7046a4618J8331j1008L862O9979j2342k1599l0247o20Q937o3213M835N1378n7673
7033e3998p7811k2067J23954J494n2384l2395J0036j3956M5676R212m089k6459
7021i2787l1126k9714L1085M9636J0561K7728L0335l1359m719j2315P152l1843
7009g7366j4192J9717L9895O1196o865R997l426R488q6427k5404k0830l4869K4946
6996a04140R4980l7751o2877N6488J6787J6127Q983q4016K4320J8081n980k7243
$$ plain form
7083 64244 60495 68897 100037 92064 81741 70602 89704 52429 76244 48910 73944 89334
7071 89334 71246 33329 6668 19362 -19426 -60220 -22071 44728 56041 48919 18696 20135
7059 20135 19070 2219 2555 -5545 -34192 -13056 19239 -10568 -3184 13335 47977 35950 -14618
7046 -14618 3713 -7295 -3433 66546 54204 32605 2358 1738 10675 -52538 -47703 3675 -53998
7033 -53998 -131809 -153876 -29922 -28428 -80812 -113207 -103171 -117127 -71451 -62239 -66328 -92787
7021 -92787 -123913 -153627 -122542 -72906 -62345 -34617 -4282 -35641 -40360 -52675 -45523 -77366
7009 -77366 -91558 -71841 -31946 29250 22385 32382 28956 38444 -47983 -73387 -94217 -129086 -104140
6996 -104140 -9160 -46911 -109788 -53300 -36513 -20386 -11403 -95419 -71099 -53018 -58998 -86241
$$ [...]
##END NTUPLES=NMR SPECTRUM
##END=
