##TITLE=Analysis number 315822
Compound Code cc 41404
Book Reference 378/190/2
Project Code adrs
Chemist Name benw
##JCAMPDX= 6.0         $$ Bruker NMR JCAMP-DX V2.0
##DATA TYPE= NMR SPECTRUM
##DATA CLASS= NTUPLES
##ORIGIN= Bruker BioSpin GmbH
##OWNER= NMR
$$ XWIN-NMR		Version 3.5
$$ Mon Dec  5 08:52:26 2005 GMT Standard Time (UT+0h)  MAYBRIDGE\NMR@NMR_250MHZ
##.OBSERVE FREQUENCY= 250.131544655141
##.OBSERVE NUCLEUS= ^1H
##.ACQUISITION MODE= SIMULTANEOUS (DQD)
##.ACQUISITION SCHEME= undefined
##.AVERAGES= 16
##.DIGITISER RES= 18
##SPECTROMETER/DATA SYSTEM= dpx250
##.PULSE SEQUENCE= zg30
##.SOLVENT NAME= CDCl3
##.SHIFT REFERENCE= (INTERNAL, CDCl3, 0, 16.522)
##AUDIT TRAIL= $$ (NUMBER, WHEN, WHO, WHERE, WHAT)
$$ ##TITLE= Audit trail, XWIN-NMR		Version 3.5
$$ ##JCAMPDX= 5.01
$$ ##ORIGIN= Bruker BioSpin GmbH
$$ ##OWNER= NMR
$$ C:\u/data/dgb/nmr/ADRS/13390/pdata/1/auditp.txt
$$ ##AUDIT TRAIL=  $$ (NUMBER, WHEN, WHO, WHERE, WHAT)
(   1,<2005-12-05 08:51:56.32 +000>,<MAYBRIDGE\NMR>,<NMR_250MHZ>,
      <created by zg, POWCHK disabled, PULCHK disabled
       configuration hash MD5:
       62 19 C7 07 E1 42 D1 B7 37 6C 3D D0 77 39 F9 E6
       data hash MD5: 64K
       7A 3A 59 48 4A BA 8B 2D EF 55 CE 51 3D 27 6A 4A>)
(   2,<2005-12-05 08:52:13.81 +000>,<MAYBRIDGE\NMR>,<NMR_250MHZ>,
      <Start of raw data processing
       ef LB = 0.3 FT_mod = 6 PKNL = 1 SI = 32K 
       data hash MD5: 32K
       DD B4 F9 36 FD B7 7E 21 A6 DD C4 57 A8 E2 95 E6>)
(   3,<2005-12-05 08:52:15.62 +000>,<MAYBRIDGE\NMR>,<NMR_250MHZ>,
      <apk 
       data hash MD5: 32K
       6D 15 87 CF EE 4D 5B EE 02 3B D0 F7 49 2D 53 FC>)
(   4,<2005-12-05 08:52:16.35 +000>,<MAYBRIDGE\NMR>,<NMR_250MHZ>,
      <abs ABSG = 5 
       data hash MD5: 32K
       80 FC 30 A7 0A 66 8E 08 15 F7 27 A2 DF AB 91 1A>)
$$ ##END=
$$ 
$$ hash MD5
$$ 72 16 39 E0 A3 B0 79 44 EB 53 18 55 F1 67 62 4D
##$RELAX= 
##$RELAX= 
##$RELAX= 
##$RELAX= 
##$RELAX= 
##$RELAX= 
##$RELAX= 
$$ Bruker specific parameters
$$ --------------------------
##$DU= <C:\u>
##$EXPNO= 13390
##$NAME= <ADRS>
##$PROCNO= 1
##$TYPE= <nmr>
##$USER= <dgb>
##$AMP= (0..31)
100 100 100 100 100 100 100 100 100 100 100 100 100 100 100 100 100 100 
100 100 100 100 100 100 100 100 100 100 100 100 100 100 
##$AQSEQ= 0
##$AQ_mod= 3
##$AUNM= <au_zg>
##$AUTOPOS= <1 >
##$BF1= 250.13
##$BF2= 250.13
##$BF3= 250.13
##$BF4= 250.13
##$BF5= 500.13
##$BF6= 500.13
##$BF7= 500.13
##$BF8= 500.13
##$BYTORDA= 1
##$CFDGTYP= 0
##$CFRGTYP= 5
##$CHEMSTR= <none>
##$CNST= (0..31)
1 1 145 1 1 1 1 1 1 1 1 1 1 1 1 1 1 1 1 1 1 1 1 1 1 1 1 1 1 1 1 1 
##$CPDPRG= <>
##$CPDPRG1= <>
##$CPDPRG2= <>
##$CPDPRG3= <>
##$CPDPRG4= <mlev>
##$CPDPRG5= <mlev>
##$CPDPRG6= <mlev>
##$CPDPRG7= <mlev>
##$CPDPRG8= <mlev>
##$CPDPRGB= <>
##$CPDPRGT= <>
##$D= (0..31)
0 1 0 0 0 0 0 0 0 0.06 0 0 0 0 0 0 0.0002 0 0 0 0 0 0 0 0 0 0 0 0 0 0 
0 
##$DATE= 1133772714
##$DBL= (0..7)
120 120 120 120 120 120 120 120 
##$DBP= (0..7)
150 150 150 150 150 150 150 150 
##$DBP07= 0
##$DBPNAM0= <>
##$DBPNAM1= <>
$$ [...]
##$SUBNAM7= <"">
##$SUBNAM8= <"">
##$SUBNAM9= <"">
##$SW= 20.6930455092707
##$SWIBOX= (0..15)
0 0 3 0 0 0 0 0 0 0 0 0 0 0 0 0 
##$SW_h= 5175.983436853
##$TD= 65536
##$TD0= 1
##$TE= 294.16
##$TE2= 300
##$TE3= 300
##$TEG= 300
##$TL= (0..7)
0 120 120 120 120 120 120 120 
##$TP= (0..7)
150 150 150 150 150 150 150 150 
##$TP07= 0
##$TPNAME0= <>
##$TPNAME1= <>
##$TPNAME2= <>
##$TPNAME3= <>
##$TPNAME4= <>
##$TPNAME5= <>
##$TPNAME6= <>
##$TPNAME7= <>
##$TPOAL= (0..7)
0.5 0.5 0.5 0.5 0.5 0.5 0.5 0.5 
##$TPOFFS= (0..7)
0 0 0 0 0 0 0 0 
##$TUNHIN= 0
##$TUNHOUT= 0
##$TUNXOUT= 0
##$USERA1= <user>
##$USERA2= <user>
##$USERA3= <user>
##$USERA4= <user>
##$USERA5= <user>
##$V9= 5
##$VALIST= <valist>
##$VCLIST= <CCCCCCCCCCCCCCC>
##$VD= 0
##$VDLIST= <DDDDDDDDDDDDDDD>
##$VPLIST= <PPPPPPPPPPPPPPP>
##$VTLIST= <TTTTTTTTTTTTTTT>
##$WBST= 1024
##$WBSW= 4
##$XGAIN= (0..3)
0 0 0 0 
##$XL= 0
##$YL= 0
##$YMAX_a= 314068
##$YMIN_a= -234867
##$ZGOPTNS= <>
##$ZL1= 120
##$ZL2= 120
##$ZL3= 120
##$ZL4= 120
##$ABSF1= 16.522
##$ABSF2= -4.171173
##$ABSG= 5
##$ABSL= 3
##$ALPHA= 0
##$AQORDER= 0
##$ASSFAC= 0
##$ASSFACI= 0
##$ASSFACX= 0
##$ASSWID= 0
##$AUNMP= <proc_1d>
##$AZFE= 0.1
##$AZFW= 0.1
##$BCFW= 0
##$BC_mod= 0
##$BYTORDP= 0
##$COROFFS= 0
##$CY= 12.5
##$DATMOD= 1
##$DC= 0
##$DFILT= <>
##$DTYPP= 0
##$F1P= 14.0000005364418
##$F2P= -0.99999901652339
##$FCOR= 0.5
##$FTSIZE= 32768
##$FT_mod= 6
##$GAMMA= 0
##$GB= 0
##$INTBC= 1
##$INTSCL= 1
##$ISEN= 128
##$LB= 0.3
##$LEV0= 0
##$LPBIN= 0
##$MAXI= 10000
##$MC2= 0
##$MEAN= 0
##$ME_mod= 0
##$MI= 0
##$NCOEF= 0
##$NC_proc= -3
##$NLEV= 6
##$NOISF1= 0
##$NOISF2= 0
##$NSP= 0
##$NTH_PI= 0
##$NZP= 0
##$OFFSET= 16.522
##$PC= 1
##$PHC0= 88.72934
##$PHC1= 7.749497
##$PH_mod= 1
##$PKNL= yes
##$PPARMOD= 0
##$PSCAL= 4
##$PSIGN= 0
##$REVERSE= no
##$SF= 250.13
##$SI= 32768
##$SIGF1= 0
##$SIGF2= 0
##$SINO= 400
##$SIOLD= 32768
##$SREGLST= <1H.CDCl3>
##$SSB= 0
##$STSI= 32768
##$STSR= 0
##$SW_p= 5175.98343685301
##$SYMM= 0
##$S_DEV= 0
##$TDeff= 65536
##$TDoff= 0
##$TI= <Analysis number 999999
Compound Code 99
Book Reference 9
Project Code 9>
##$TILT= no
##$TM1= 0
##$TM2= 0
##$TOPLEV= 0
##$USERP1= <user>
##$USERP2= <user>
##$USERP3= <user>
##$USERP4= <user>
##$USERP5= <user>
##$WDW= 1
##$XDIM= 32768
##$YMAX_p= 405210092
##$YMIN_p= -370104
$$ End of Bruker specific parameters
$$ ---------------------------------
##NTUPLES= NMR SPECTRUM
##VAR_NAME=  FREQUENCY,     SPECTRUM/REAL,   SPECTRUM/IMAG
##SYMBOL=    X,             R,               I
##VAR_TYPE=  INDEPENDENT,   DEPENDENT,       DEPENDENT
##VAR_FORM=  AFFN,          ASDF,            ASDF
##VAR_DIM=   32768,         32768,           32768
##UNITS=     HZ,            ARBITRARY UNITS, ARBITRARY UNITS
##FACTOR=    0.157963299565203, 1,           1
##FIRST=     4132.6476996994, 0,             0
##LAST=      -1043.33573715361, 0,           0
##MIN=       -1043.33573715361, -370104,     0
##MAX=       4132.6476996994, 405210092,     0
$$ Real data points
##PAGE= N=1
##DATA TABLE= (X++(R..R)), XYDATA
$$ [...]
18490I9209R069K3470J7547j0430N000K3547j2077p890K2657M3169k1304j2392
18478A79575J0699M9251J6634l3188k5189l3565m4275k7469K3933N7085k8360
18467A45131o6819n806N048N4179j148J3212J0470m7390r754L0715j5868p14J4148
18454A25404k3036p327K9555J7572k580K292j2842r649M091J1813J5019Q248R214
18441A67774O83l2086J4616O7604k5210M606M2444O0673N7108M5749J7499J5345
18429D36805p1292j7197q593m4112N163O2596P7803N3692k6870l0067j352n2057
18417C84519n2002m1592m9845J2676K3638J7974K6128J7849j1961O000J3208K7629
18405C74221k887L9932O3368M9466Q41j824M7534N9547M5411M4540O712N1940
$$ y = [99209, 108278, 131748, 149295, 138865, 143865, 167412, 155335, 147445, 170102, 213271, 191967, 179575, 190274, 239525, 256159, 222971, 197782, 164217, 119942, 92473, 116406, 173491, 145131, 78312, 72506, 77554, 131733, 130585, 143797, 154267, 106877, 97123, 127838, 111970, 111256, 125404, 102368, 95041, 124596, 142168, 139588, 141880, 129038, 119389, 123480, 135293, 150312, 158560, 167774, 168457, 136371, 150987, 218591, 193381, 197987, 240431, 301104, 358212, 403961, 421460, 436805, 365513, 348316, 339723, 295611, 300774, 363370, 441173, 494865, 467995, 437928, 436576, 384519, 332517, 290925, 241080, 253756, 277394, 295368, 321496, 339345, 327384, 333384, 346592, 374221, 371334, 411266, 474634, 524100, 524941, 523117, 570651, 630198, 675609, 720149, 726861, 778801]
18393G78801M9154P0503J32007J43029J04193J02273J30904J07713J49444J82450
18383A950471J96275K29094K70055L18629M54492N20577P41396J156921J722542
18374G560452K663608L517505L512436L289400M321702N522012M882974K820864
18366C8090953J547478J663406J555846j22489k676350m087416l624224l359378
18358B8987826m257064m749076m091362l215934k597938k111706j552651j093576
18350E318519p76716n44207m11951k61101k35189k24493j58386j56721j39883
18341B409872j71692j06990p8763n8092q1419m3913J8872L9789M7628j5302R8791
18330B058781J09125Q3301J43831K10513K29900K99167L64779M66419P41987J181099
$$ y = [778801, 827955, 898458, 1030465, 1173494, 1277687, 1379960, 1510864, 1618577, 1768021, 1950471, 2146746, 2375840, 2645895, 2964524, 3419016, 3939593, 4680989, 5837910, 7560452, 10224060, 13741565, 17254001, 20543401, 24865103, 30387115, 35270089, 38090953, 39638431, 41301837, 42857683, 42735194, 40058844, 35971428, 32347204, 28987826, 24730762, 19981686, 15890324, 12674390, 10076452, 7964746, 6412095, 5318519, 4541803, 3997596, 3585645, 3324544, 3089355, 2864862, 2706476, 2549755, 2409872, 2238180, 2131190, 2052427, 1994335, 1912916, 1869003, 1887875, 1927664, 1975292, 1959990, 2058781, 2167906, 2251207, 2395038, 2605551, 2835451, 3134618, 3499397, 3965816, 4707803, 5888902]
18320E888902J825517K657802L109254K873379L088480M272596M629594L144718
18312C1490242J517851J176567J392159N71549j435325l276675l384758k810705
18304B5240905l215164m005602l779448k943791k307825j975291j525766j059958
18296D428060p26678n13572l90318k78296k07159k07730j80667j59414j65810
18287A598416j51826j04644j00109j24956j16300r4742p8482o2901o2390n3828
18277F48238l3860o0833k8563k3747k5910k0978n8786N131J390o9045q418L6017
18265C60636m653m2169k2626J5206l1209p8965o583R747l97r754o6054K892L5256
18252A61327j4034J1424L4771J8457k3145l8781k2678Q2446k9928q2763k3148
$$ y = [5888902, 7714419, 10372221, 13481475, 16354854, 19443334, 23715930, 28345524, 31490242, 33008093, 34184660, 35576819, 36148368, 34713043, 31436368, 28051610, 25240905, 22025741, 18020139, 14240691, 11296900, 8989075, 7013784, 5488018, 4428060, 3701382, 3187810, 2797492, 2519196, 2312037, 2104307, 1923640, 1764226, 1598416, 1446590, 1341946, 1241837, 1116881, 1000581, 905839, 827357, 764456, 702066, 648238, 614378, 553545, 524982, 501235, 475325, 454347, 395561, 400692, 402082, 333037, 324619, 360636, 355983, 313814, 291188, 306394, 275185, 196220, 189637, 199384, 198987, 189233, 123179, 126071, 161327, 147293, 158717, 193488, 211945, 188800, 150019, 127341, 209787, 179859, 97096, 73948]
18241G3948k760L4682L4458Q936l0503O36k5923K6634M1991L7925m198n8995j5046
18228A21785k9820m0241l720l259J4912p706j8996p387L8154L6603J8321J3035
18216A31681K0093m030m571P807J2194k662J8815J483q394q878J335k8157J7839
18203A54555L3094k1491m152O6713L2340l9095p1134J3550Q079j2453k418k3164
18191A34424j4356k0378j3715L1498L203l4364K1491M3518N932J5296l9878P9
18179A32750O9662L0019J604j4338L0207L6467j1920l1238k4871K3603j0331L650
18167B35264j9905l0733K7485k8105l7483m079K5611K1872O2659L629P367l365
18155B60217k5121l1217j8453l817m6237L5110K6353k646M080K3832n579j7027
$$ y = [73948, 71188, 105870, 140328, 149264, 118761, 119397, 93474, 120108, 162099, 200024, 195826, 136831, 121785, 91965, 51724, 48004, 44745, 59657, 51951, 32955, 25568, 63722, 100325, 118646, 131681, 151774, 147744, 143173, 150980, 163174, 160512, 179327, 180810, 172416, 163538, 164873, 136716, 154555, 187649, 166158, 162006, 228719, 261059, 221964, 150830, 164380, 172459, 160006, 157588, 134424, 120068, 99690, 85975, 117473, 120676, 86312, 107803, 151321, 157253, 172549, 132671, 132750, 202412, 232431, 234035, 219697, 249904, 286371, 274451, 243213, 218342, 241945, 231614, 235264, 215359, 184626, 212111, 184006, 146523, 142444, 168055, 189927, 252586, 256215, 263582, 260217, 235096, 203879, 185426, 181609, 135372, 170482, 196835, 194189, 198269, 222101, 216522, 199495]
18143A99495l28K9867L0839M5233K0752J6020L0403J7723L9710Q0011N5970L6062
18131F01757p629k3953P7304R8506Q7843J12313Q9701J03894J15358J46510J48881
18120A550485J78068K13304L21045M22333M53467M49118N95038Q15127J110748
18111F108733J607155K350167M010848P730987J5669708K5501303J1896396j3041861
18103F1833436j0897341o143398r970949j2175029p935922m387682k538632j634670
18095F149813j106781q15701o16981m67463l33681l09986k24526j80720k07086
18086A886888j96433j83976j98968j07031p2129j07007m5866o6519q100n3070
18076H47789r8980r1386j05107j3485k4928o9351p947l625j6073M644k7728k3257
$$ y = [199495, 199167, 229034, 259873, 305106, 325858, 341878, 372281, 390004, 429714, 509725, 565695, 601757, 594128, 570175, 647479, 745985, 833828, 946141, 1035842, 1139736, 1255094, 1401604, 1550485, 1728553, 1941857, 2262902, 2685235, 3138702, 3587820, 4182858, 4997985, 6108733, 7715888, 10066055, 14076903, 21807890, 37477598, 62978901, 74875297, 61833436, 50936095, 44792697, 34821748, 22646719, 14710797, 10323115, 7784483, 6149813, 5043032, 4227331, 3610350, 3142887, 2809206, 2499220, 2274694, 2093974, 1886888, 1690455, 1506479, 1307511, 1200480, 1128351, 1021344, 975478, 908959, 900859, 847789, 748809, 657423, 552316, 538831, 513903, 444552, 436605, 432980, 416907, 421551, 393823, 370566]
18064C70566l7805m2255J0612L561R462K856k6386k2545J380j1010q044m1054
18052B09338J7853N0940L4079m0382o7067q890K6132l694n703K804k8332L0828
18040B17906M4886K0879L9419j6012p5355p9887j3633P425l187k1087k1752J0915
18028A10517k9686l46J9315L769k2326K1567K3032Q585L6755l6953L4126K8267
18016A96622m6525O85P314M4089j0424k7159p952K753K4560K0093k3555k4094
18004A56407O073M0603J9629k2914J6401L8088K7959L6841L7328J4176m1069J6923
17992C46445M7203K4492k1242J0526K8919M8844M7038O7273N2675Q8761O4253
17981H05187P6152R3294R4758J15670R2142Q5693J09251J54734J31069J13821
$$ y = [370566, 332761, 290506, 301118, 304679, 314141, 316997, 290611, 268066, 269446, 258436, 250392, 209338, 227191, 278131, 312210, 271828, 204761, 195871, 222003, 218309, 212606, 215410, 187078, 217906, 262792, 283671, 323090, 307078, 231723, 151836, 138203, 145628, 142441, 121354, 99602, 110517, 80831, 80485, 99800, 103569, 81243, 102810, 125842, 134427, 171182, 134229, 168355, 196622, 150097, 150782, 158096, 202185, 191761, 164602, 156650, 159403, 183963, 204056, 180501, 156407, 162480, 203083, 222712, 199798, 216199, 254287, 282246, 319087, 356415, 370591, 329522, 346445, 393648, 418140, 396898, 407424, 436343, 485187, 532225, 599498, 652173, 740934, 805187, 881339, 974633, 1069391, 1185061, 1277203, 1362896, 1472147, 1626881, 1757950, 1871771]
17971A871771J04589R7180R5351R4349J19615J63533J60967K52549L41462M39787
17961C741153N80282P82785J010055J337777J903010K948192M548309O784504
17953B3636067Q931458R717802Q313339M611894o0504m195029o828891p791528
17945C6334608p459228o364879m933078l333236k036047j036171k96489L76525
17937A1252005J114743K248127L871296O143409Q562496R881994Q882494N501447
17929E7458011P79364l718013o931810q348630q271541p324274n965024m439830
17921A3238253l082116k083220j488224j016062p56915n63854m30559l75104k88635
17912C153564k10967j54746j70716j55858j01284j13402r0669j00679r5300j24475
$$ y = [1871771, 1976360, 2073540, 2168891, 2263240, 2382855, 2546388, 2707355, 2959904, 3301366, 3741153, 4321435, 5104220, 6114275, 7452052, 9355062, 12303254, 16851563, 23636067, 32567525, 42285327, 50598666, 55210560, 55150056, 50955027, 44126136, 36334608, 28875380, 22510501, 17577423, 14244187, 12208140, 11171969, 10875480, 11252005, 12366748, 14614875, 18486171, 24629580, 33192076, 43074070, 51956564, 57458011, 58237375, 54519362, 47587552, 39238922, 30967381, 23643107, 17678083, 13238253, 10156137, 8072917, 6584693, 5568631, 4811716, 4247862, 3817303, 3442199, 3153564, 2942597, 2787851, 2617135, 2461277, 2359993, 2246591, 2155922, 2055243, 1959943, 1835468]
17902A835468j66376j27098j98802j48475j16544j03574j07425p9738p9499p0387
17892F37550n2143l7322j0477l8125l1591l9154k2319l8406r110j9809l992k1589
17880C13513j9828j3961l8113r294j2064K7733P0534P246k2938j5922l5933n1360
17868A99613l4113J0938P963J584N715o239P162N144J400L3058M0808J7573R07
17855B91513j2814k3430L5725O1563Q529j1861l2786k1791q639O604o0410p7641
17843A54562j3341k4693l5059J4672N3918k9166p067j7215L1916L505j3480k7885
17831I0667l3690J7140L0198J1148N0152k1185l4887r702M138R743j3314R665
17819A10073p070Q460M290P803J527O747j8738n474l5261m6496J3554N6164J8888
$$ y = [1835468, 1669092, 1541994, 1343192, 1194717, 1078173, 974599, 867174, 787436, 707937, 637550, 585407, 548085, 537608, 499483, 467892, 428738, 406419, 368013, 358903, 339094, 335102, 313513, 293685, 279724, 241611, 232317, 220253, 247986, 318520, 325766, 302828, 286906, 250973, 199613, 165500, 176438, 184401, 185985, 191700, 185461, 192623, 197767, 199167, 232225, 273033, 290606, 291513, 278699, 255269, 290994, 352557, 361086, 349225, 316439, 294648, 286009, 292613, 232203, 154562, 141221, 116528, 81469, 96141, 150059, 120893, 113826, 96611, 128527, 132032, 118552, 90667, 56977, 74117, 104315, 115463, 165615, 144430, 109543, 99841, 103979, 113722, 100408, 110073, 103003, 111463, 115753, 123556, 125083, 131830, 113092, 107618, 72357, 25861, 39415, 95579, 114467]
17806A14467n14m0324J2075O4612O0457J6252K4196K636j7001j800J0944Q333
17794B54333q94j3166l8963m6104m8659j4141r403J4070m6130l065J3869m574
17782E7173l2587l688P0671J5967K6050J4953J574r727r2115m3575L1599M2895
17770G9190K9761J8117k1853n5591Q851K8251k6843q71K7338j8061k0999l2271
17758A5019K4163K5340j2174j6203K992J79J3465J2167l1530L8590O545n3601
17746B4952j217O634J5764L3228J8017k1911o871n1833L075k1798K0689J3575
17734C2304j2052j7853j3756j3980J9078j3804O1700O1819l2153k8925L950L3839
17722H0167j4551k9000j7299L1438K0996m518j8648m7528n30K6138O7407N1958
$$ y = [114467, 113953, 73629, 85704, 150316, 210773, 227025, 251221, 253857, 236856, 235056, 246000, 254333, 253439, 240273, 201310, 155206, 106547, 92406, 83003, 97073, 50943, 47878, 61747, 57173, 24586, 20898, 91569, 107536, 133586, 148539, 150113, 140386, 48271, 4696, 36295, 79190, 108951, 127068, 105215, 49624, 58475, 86726, 59883, 59012, 86350, 68289, 47290, 15019, 39182, 64522, 52348, 36145, 39137, 39316, 52781, 64948, 33418, 72008, 78553, 24952, 23735, 30369, 46133, 79361, 97378, 75467, 68596, 16763, 19838, -1960, 18729, 32304, 20252, 2399, -11357, -25337, -6259, -20063, 41637, 103456, 71303, 42378, 46328, 80167, 65616, 36616, 19317, 50755, 71751, 67233, 48585, 1057, 527, 26665, 94072, 146030]
17710A46030O0730J2128n3627K1338M9838R023O551p735k2144m8689n7105n272
17698A11066l1202n798K1192o953J4753m545q569J7389M4623J03894J7047j1013
17686B61884j6679j5957Q316l5629m0708j4790r771l4001o1177k0853J8748J3199
17674E2582j8860k0708M4866L0654P251n7780r227J6482j8004L4487J9753l1260
17662E0236j3076O458m3097n885k3219p617q018l1241J9716J12259J8397m2562
17650C2351m8675o170M726l392Q295r255l2125q879L0104O1370J0647o1153k7989
17637e0145q605L0639O623J778k4160M0906K8316M8660K6111k5233l5077J0105
17625D9918m451o0886l1931J0966J1088K9120k079L795K674l3197q157j6936J1978
$$ y = [146030, 206760, 218888, 165261, 186599, 236437, 245460, 252011, 244276, 222132, 173443, 116338, 111066, 79864, 74066, 95258, 88305, 103058, 98513, 89944, 107333, 151956, 255850, 272897, 261884, 245205, 229248, 237564, 201935, 161227, 146437, 136666, 102665, 41488, 20635, 39383, 52582, 33722, 13014, 57880, 88534, 95785, 38005, 28778, 45260, 27256, 61743, 81496, 50236, 37160, 43618, 521, -5364, -28583, -36200, -44218, -75459, -55743, 56516, 74913, 32351, -16324, -22494, -17768, -21160, -12865, -22120, -54245, -63124, -33020, 28350, 38997, -22156, -50145, -58750, -28111, -21488, -19710, -43870, -2964, 25352, 74012, 100123, 74890, 39813, 49918, 45467, -15419, -47350, -36384, -25296, 3824, 1745, 5540, 8214, -24983, -33140, -50076, -38098]
17612c8098M5631p596q713M1400j5017k1695m243o029j4686P748m195k52M1238
17599A5493M6711J0825k0401l3155l6323K1512n379l2703K7723O247l78J3750
17587A3922K1409K4674j245m6603J024N18k514J1539M259j6051l0262m140J4847
17574h623K1502j1786K616j1139l8675j7844K1140P076M3107M7758j8882l4659
17562A591M731K2188j8106j1893j6419j1418M9511J7386k2104K0289l7141m0374
17550d1759m779L5307O6651P106m3544k5203J8332j8291K778j7820J440L8036
17538A8254N1546k6498k9035q323L028J3838o45R460k3317k1555R64O026j5743
17525b2000Q849L1734N511j1824P319J197m149k2771m208J2465J5627K4898j2374
$$ y = [-38098, 7533, -63, -8776, 32624, 17607, -4088, -8331, -14360, -29046, -21298, -25493, -25745, 15493, 62204, 73029, 52628, 19473, -16850, 4662, -717, -33420, -5697, 550, 172, 13922, 35331, 60005, 58760, 12157, 13181, 13699, 11185, 22724, 26983, 10932, -19330, -23470, -8623, 12879, 1093, 3709, -7430, -46105, -63949, -42809, -35733, 7374, 55132, 36250, 1591, 6322, 28510, 10404, -1489, -17908, -29326, 20185, 37571, 15467, 35756, -1385, -41759, -46538, -11231, 55420, 62526, 18982, -6221, 12111, -6180, -3402, -21222, -19782, 18254, 69800, 43302, 14267, 5944, 8972, 22810, 22165, 31625, 8308, -13247, -12283, -6257, -22000, -13151, 18583, 24094, 12270, 19589, 20786, 16637, -6134, -10342, 2123, 17750, 42648, 30274]
17512C0274k3214m0225m1975k9884N8859L7059K6074k3199l7660o633J2951K7427
17500a0146K3261J8632j5488j4905k18L982q956J0520J2369N155j4525k7719M7011
17487B8973J376p446l6232O444K4863j1150m0408n877R787L087P976j4421j1628
17474d4656L7493L584M3785j6311j8907N059N6827m5017N865L5193k3793l9212
17462i0k7311K3929L7431O732k5339l0368m220J0336K6345J4421N1744n87n7265
17449B5758o680M6494J8510J8723k7069l1192L7261R772J06021J25294Q9152M797
17437D16841n3639l0096m9938j06693q7716o5408J3191L3462L5771P796k2175
17426I1396r425p212J5660J7341K020l0197k881r666j8079k2542K2353L9383j5315
$$ y = [30274, 7060, -33165, -75140, -105024, -46165, -9106, 16968, -6231, -43891, -50524, -37573, -10146, 13115, 31747, 16259, 1354, 1136, 5118, -3838, 6682, 19051, 24206, 9681, -18038, 28973, 30349, 22903, -13329, -6885, 17978, 6828, -33580, -39457, -29670, -26583, -18607, -33028, -44656, -7163, -3579, 40206, 23895, 4988, 10047, 66874, 21857, 27722, 62915, 39122, -90, -27401, -3472, 33959, 40691, 15352, -15016, -19236, -8900, 17445, 31866, 83610, 83023, 25758, 19078, 65572, 84082, 102805, 75736, 44544, 81805, 91577, 197598, 322892, 412044, 416841, 363202, 333106, 283168, 176475, 88759, 23351, 36542, 70004, 105775, 113571, 91396, 81971, 74759, 90419, 107760, 109780, 79583, 76702, 67036, 48957, 26415, 48768, 88151, 72836]
17413G2836n574l7824k6490J3238N5094J2385o4212k1597k2019j2223N8658J0770
17401C3042n3773j4719L4261j0028j0864Q155N0200L9595j160R708l9474m5537
17389e94K9450M3549j7491n6814J1338L7651L0565j5339j5862J2200j9968o4729
17377b6044l112J4711K9965K5339M6769k7146k0488R3853J09381M6549K2758k8216
17365B84319m7475l5571k4225M874m5881l346M366j8536l8851j4027l0505j0586
17353B4556N5554N2568j1354K13L6969O0447K3626K5062P54j4189p9831k8527
17341A45848O739j2995k8660o3351k4755K0687K5888N863l0235p881P050K3106
17329F7304J2198m862L132j9136q107j5263q536P393M638J4657L6225L6691k6246
$$ y = [72836, 67262, 29438, 2948, 16186, 71280, 83665, 19453, -2144, -24163, -36386, 22272, 33042, -20731, -35450, -1189, -11217, -22081, -13926, 36274, 75869, 74709, 84417, 44943, -594, 28856, 72405, 54914, -1900, 9438, 47089, 77654, 62315, 46453, 58653, 38685, -26044, -29156, -14445, 15520, 40859, 87628, 60482, 39994, 133847, 243228, 289777, 312535, 284319, 236844, 201273, 177048, 181922, 136041, 132695, 137061, 118525, 79674, 65647, 35142, 24556, 80110, 132678, 121324, 121537, 158506, 218953, 242579, 267641, 268395, 254206, 174375, 145848, 152587, 139592, 110932, 47581, 22826, 43513, 69401, 75264, 45029, 37148, 44198, 67304, 79502, 74640, 77772, 58636, 50529, 35266, 26730, 34123, 38761, 53418, 89643, 126334, 100088]
17316A00088j8153m553L6669L1442n1545k9737j4503l6995J5614j2024j7126N094
17304D271K039j5993K2852N2251m712M792K7658J4775m5481k938N2362m1508o1138
17291I230m7412j3457L121K8040M2145M6345r763j0265j4225J6901L7977J5918
17279A04555L7106q036n6589k4760K6023J1957m1028m506j9505J4737l6481m701
17267a228J5498p776J0798K9239O068n1002R956k090L015M8497J7366P642L357
17254H9340k8595m0630N1964J2447l4150k2315k568M3421M170q143k2109J7090
17242E9922J5390J9779L4097J1543k9840K6420m758m1908j7090n42L5947M5770
17230A54730j7657q508L1990L0421L1447J1211j0389p717j8881k1272J2849o3414
$$ y = [100088, 81935, 77382, 114051, 145493, 93948, 64211, 49708, 12713, 28327, 16303, -823, 4271, 6310, -9683, 13169, 65420, 60708, 65500, 93158, 107933, 62452, 59514, 111876, 70368, 9230, -38182, -51639, -48518, -20478, 21667, 68012, 58249, 47984, 33759, 50660, 88637, 104555, 141661, 133625, 77036, 52276, 78299, 90256, 49228, 44722, 25217, 39954, 3473, -1228, 14270, 6494, 17292, 46531, 52599, 1597, 11553, 9463, 12478, 60975, 78341, 85983, 89340, 60745, 20115, 72079, 84526, 50376, 28061, 25493, 68914, 73084, 64941, 42832, 59922, 75312, 95091, 129188, 140731, 110891, 137311, 132553, 90645, 73555, 73013, 108960, 154730, 137073, 128565, 160555, 190976, 222423, 233634, 223245, 215528, 196647, 175375, 188224, 124810]
17218A24810k703N4091O4088O6752P707j8914k1634k8071m3803R33o392K2649
17206B19513L0329j1136J1330p176J2880O1127Q465J1611J2023N83j7267K2913
17194C55195L6799O3670L6901O5305O8230r059J0719J2924K3662R5094P3730O1146
17182H94316Q1194J01983J24923J19827J64307J60105J00399J25041J65545K67580
17172B305220K23955J84589J98829K82186L50902L84475N31392P31051R39763
17163F132362J319058J870785K924112N121126Q341638R812262N288490m61455
17155D0348378n96702K125480L875058K081572l556277o608475n541024m948808
17147B7179202n391689m661359k949654j396973l29033O03828J757261L655618
$$ y = [124810, 122107, 176198, 240286, 307038, 314745, 295831, 274197, 246126, 202323, 203256, 196864, 219513, 249842, 238706, 250036, 242860, 255740, 316867, 325332, 336943, 348966, 349549, 332282, 355195, 391994, 455664, 492565, 557870, 626100, 617041, 627760, 640684, 664346, 759440, 833170, 894316, 975510, 1077493, 1202416, 1322243, 1486550, 1646655, 1747054, 1872095, 2037640, 2305220, 2529175, 2713764, 2912593, 3194779, 3545681, 3930156, 4461548, 5192599, 6132362, 7451420, 9322205, 12246317, 17367443, 25709081, 35521343, 40809833, 40348378, 39751676, 41877156, 45752214, 47833786, 44277509, 37669034, 32128010, 27179202, 21787513, 17126154, 14176500, 12779527, 12450494, 13054322, 14811583, 18467201]
17139A8467201O658988Q968735O087398O7797j444555J000537L118572K404164
17131D5328837k521049o487552n971207n091606n563941n265407l723014k353003
17123H352058j496886j035068q08718n69108m36163l73446l34406l00989k56230
17114B741044k21647j87905k14697k14098j25059j43635j48815j08031k8838o7274
17104A281045p9503p9764j05278r9922n6169o1703p6367o7430l9560l2682m6875
17093E35792o8540m7460m3421k5452j0230j6005j8817M021L214j5613k1244o364
17081B69881l4390O841k5037n684J8228k0881k0130l727k8411k4476j1837K6891
17069A47268m75m2669o014L9119j4876l1772J0236l1365k3255K9104N2507k0181
$$ y = [18467201, 25126189, 34094924, 40182322, 40250119, 38805564, 39806101, 42924673, 45328837, 42807788, 36320236, 30349029, 25257423, 19693482, 14428075, 10705061, 8352058, 6855172, 5820104, 5011386, 4442278, 4006115, 3632669, 3298263, 2997274, 2741044, 2519397, 2331492, 2116795, 1902697, 1777638, 1634003, 1485188, 1377157, 1348319, 1281045, 1201542, 1121778, 1016500, 916578, 860409, 798706, 722339, 654909, 615349, 582667, 535792, 467252, 419792, 376371, 350919, 340689, 324684, 305867, 309888, 313102, 297489, 276245, 269881, 235491, 242332, 217295, 211611, 229839, 208958, 188828, 185101, 156690, 132214, 120377, 147268, 146793, 104124, 98110, 137229, 122353, 90581, 100817, 69452, 46197, 75301, 127808, 107627]
17057A07627M710m515k2156k978J3762J1660j8350n2779k2763k7361p373M657
17045a5859K825k51j5368P249K2436J4146K9523N1877K9386O345J757m4994k7351
17032F1721r319k1166K1871L2238j5177J1788p655l0341L151o367k477K4250K349
17019F4866K0378L4839j0022m5980k196j7523k7922k6408N6110o81j0943L997
17007C8515k5033m0385L0088J4711k8219j5762J0063L518k2653p207J4602J3293
16995a4469j4728r078N588j8976J9899K3235j3279k2849L4570p299m0747N507
16983e2626N3118J7665R277N6575j0488j8919k5965k0670k4629J8312l1180j4066
16971d3596K0689O3680j4938k1174k6631k1682M278L4695L8473J8760R76J0217
$$ y = [107627, 112337, 107822, 85666, 82688, 96450, 108110, 89760, 36981, 14218, -13143, -20516, -15859, -13034, -13285, -28653, -21404, 1032, 15178, 44701, 96578, 125964, 132309, 134066, 89072, 61721, 52402, 31236, 53107, 85345, 70168, 81956, 74301, 43960, 47111, 40744, 38267, 62517, 64866, 85244, 120083, 110061, 64081, 61885, 44362, 16440, -9968, 46142, 45461, 34518, 38515, 13482, -26903, 3185, 17896, -10323, -26085, -16022, -12504, -35157, -42364, -27762, -14469, -29197, -38275, -32687, -51663, -31764, -8529, -21808, -44657, -10087, -17386, -58133, -52626, 492, 18157, 27434, 84009, 73521, 54602, 28637, 7967, -16662, 1650, -29530, -43596, -22907, 40773, 25835, 4661, -21970, -43652, -39374, -4679, 33794, 52554, 53530, 63747]
16959F3747j9209J6020m893L6525n080m3682j8539o250Q907k3050k6357M3874
16947B2013K7979K3967J1420n817k8366j0765n5721n395j4134n419K2208J0377
16935g653q801J8423N287M5658q154l349K3873l1735N199J2559l3108k8361j0945
16922b1107p181K2569K341q655J6102j5012J4201q758j4642j3023J9524K7447
16910A3806J9544L0928J1571k5846k0470n0805o070N867J621K9567J1502J607
16898B2822r098m807o532M2155N0799Q757n2626k8007N0853M3292l3990l8501
16886D5117P033j1827k4693l834J538O177k1884j2887l9928M382M3372K1897L4289
16873D8752r588k2646J0122r956J6015j1702j5079N485k0786J6357K7982k639
$$ y = [63747, 44538, 60558, 55665, 92190, 87110, 43428, 24889, 18639, 27546, 4496, -21861, 22013, 49992, 73959, 85379, 79562, 51196, 40431, -15290, -20685, -34819, -40238, -18030, -7653, -16454, 1969, 7256, 52914, 44760, 41411, 65284, 33549, 38748, 51307, 18199, -10162, -21107, -28288, -5719, -3378, -12033, 4069, -10943, 3258, -5500, -20142, -33165, -13641, 13806, 33350, 64278, 75849, 50003, 29533, -21272, -27342, -21475, -19854, 9713, 21215, 22822, 13724, 8917, 2385, 44540, 95339, 104096, 51470, 23463, 74316, 117608, 83618, 45117, 52150, 40323, 15630, 11796, 13334, 19511, -2373, -15260, -55188, -50806, -7434, 14463, 48752, 39164, 16518, 26640, 16684, 32699, 20997, 5918, 11403, -9383, 6974, 34956, 32317]
16861C2317l0048J5981P944J1819k2921m7252m5713j0513J3122J4185K7105O1896
16849B7922L6873K7093M672n2879l0710M2956p73l5070k2032P800K976j5792K956
16836d008l0977j6825l3034K74K17q203K697M5133K4966k854L1157j1375m3735
16823d6567l236l6986r4K8318k5853J6990P864M477J9789J9838o663J8119L7726
16810C3722m734P873L8672p462n9781m1415k8874j3480J7831M530L0448R423j10
16797a3357M5958l4857k6054k7048K72J3431j9584M979J8048q729k806M0896L8177
16784B9326l4248P532K2788l6468n8648R004N5108J0487j4218J7761J0962k1734
16772b348L4885p394m473p088N453K9165q462N376M484k574m5695P488J6548Q778
$$ y = [32317, 2269, 18250, 26194, 38013, 15092, -32160, -77873, -88386, -75264, -61079, -33974, 27922, 64795, 91888, 96560, 43681, 12971, 55927, 55154, 20084, -1948, 5852, 8828, -6964, -4008, -34985, -51810, -84844, -84570, -84353, -92556, -89859, -44726, -19760, -22614, 8543, -2832, -46567, -49803, -86789, -86883, -58565, -84418, -67428, -59564, -55087, -35298, -15460, -22123, -4004, 33722, 28988, 36861, 75533, 68071, 8290, -33125, -61999, -75479, -57648, -53118, -22670, -13247, -13357, 32601, -2256, -28310, -55358, -55086, -41655, -61239, -56260, -38212, -46941, -49747, -8851, 29326, -4922, 2610, 25398, -11070, -69718, -60714, -5606, 4881, -9337, 8424, 19386, -2348, 32537, 25143, 20670, 13582, 19035, 48200, 39738, 45114, 49598, 47024, 1329, 8817, 25365, 34143]
16758C4143k7305k9382p168L196j3115m872J9902l8454p586L0863J3793L1258
16746E273Q293k9544j2064j4465K733J8840R963j2985l0015K3115J0684J0534
16734i638j1556j4434o880j4616L1282K2807j7860k478j4928l4290O452K619l058
16721f6578K917L2994L611M103J8444M7195J044k4061m2663m008k1789k1076L6675
16708c3192J0663M5786j7368k3402k9606K2511j1103J9355K400j0608p997q799
16696d1360J4502L258K4925L1697k0554K0439m0660j1187o940j4636N5907j1990
16684C401n792L656K0045j952l4327J7163l638k8902M9176K4276J9264j552k8601
16671C2217j6569k4064k7660R54K6762J5186J1262l5135j3369k2981o743O0625
$$ y = [34143, 6838, -22544, -29712, -26516, -39631, -44503, -24601, -63055, -70641, -39778, -25985, 5273, 13566, -15978, -28042, -42507, -39774, -20934, -10971, -23956, -53971, -30856, -20172, -9638, -21194, -35628, -42508, -57124, -25842, -3035, -20895, -23373, -38301, -72591, -66139, -63520, -66578, -63661, -30667, -27056, -22953, -4509, 42686, 43730, 19669, -22994, -27002, -48791, -69867, -33192, -22529, 23257, 5889, -17513, -47119, -24608, -35711, -16356, -13956, -24564, -32561, -41360, -26858, -23600, 1325, 33022, 12468, 32907, -7753, -18940, -25880, -40516, 15391, 3401, -2391, 1265, 21310, 19358, -14969, 2194, -1444, -30346, 18830, 43106, 62370, 60818, 32217, 15648, -8416, -36076, -35122, -8360, 6826, 18088, -17047, -30416, -53397, -60140, 485]
16659D85L5993p198m3257k016P488j4280K6376M0730k1624j9003o181j125j8250
16646b1862l8098m56L1082Q133L4822O560j2731m993K7031J0538L682O206j7218
16633C2696q2203q2m295J6305K7907J97L0353J4843O737m931k791J5004K44o6618
16619a6634k0869K9302j454M460K758j9690l2689K6951L0146p876J0513K8337
16607C3255j3497m0841j4699M4118L7115J5626N3377R1286L7667k1473j9281J3683
16595B16336p188k2362k3754l2260Q955q563J1573m9312l3845R574k678K0178
16583H6654M792J7394k7991M8124J02126J323l8591j0325M2888N354j505k6606
16571B03637m6211m6457p8447m5972K3543J4009N276j1344J3465r782K223Q538
$$ y = [485, 36478, 29280, -13977, -15993, -8505, -22785, 3591, 44321, 22697, 3694, -2487, -3612, -21862, -59960, -60416, -29334, -21201, 13621, 20181, 7450, 2457, 29488, 40026, 43708, 49914, 32696, -49507, -49589, -53884, -37579, -9672, -9475, 20878, 35721, 42458, 37527, 34736, 49740, 49984, -16634, -37503, -8201, -9655, -5195, -2437, -22127, -54816, -27865, 2281, -5595, 4918, 33255, 19758, -21083, -35782, 8336, 45451, 61077, 114454, 205740, 243407, 221934, 202653, 216336, 209148, 186786, 163032, 130772, 139727, 131164, 142737, 93425, 59580, 69154, 66476, 86654, 91446, 108840, 80849, 128973, 231099, 232422, 193831, 183506, 226394, 231748, 230243, 203637, 157426, 110969, 32522, -13450, 10093, 24102, 29378, 18034, 31499, 21717, 23940, 32478]
16559C2478m1242N259K4785K394m2664L958O2983k7086m5742R522K2970l6671
16547b9056k2774M7963O0737p217m6106k8567J3706K8324j4886J290J4473M273
16535B2160K024j172o0920j7120k970K3455O5908l626m1419l1254k4692L2783
16523c6843K3055j9627k295o119J502k135J0082N3620k8832r269L0355L4012p638
16510C9868k1162n405k5848J5401L6848J3292o7590l1505J0017p026j8667K6354
16498c5423K8480k6605k963K3575j2938O800O529k9030K6234N080K3678K0558
16486C3975p032M397J3812j391l0134J4536K4318n4744p0969j1033p019J5207
16474g6077P667J8474o947j0351J2736N0430J2608o739o871l4315J2674K5819
$$ y = [32478, -8764, -3505, 21280, 23674, -18990, -15032, 47951, 20865, -24877, -15355, 7615, -29056, -51830, -3867, 56870, 49653, 3547, -25020, -11314, 17010, 2124, 3414, 17887, 22160, 24184, 23012, -37908, -55028, -57998, -34543, 31365, 27739, -13680, -44934, -69626, -36843, -13788, -33415, -35710, -41829, -40327, -42462, -32380, 21240, -7592, -16861, 13494, 47506, 39868, 18706, 13301, -12547, 2854, 39702, 52994, -14596, -46101, -36084, -43110, -61777, -35423, -6943, -33548, -36511, -12936, -25874, -19074, -12545, -41575, -15341, -10261, 13417, 33975, 26943, 31340, 45152, 43761, 13627, 28163, 52481, -2263, -73232, -84265, -91284, -76077, -68410, -49936, -56883, -67234, -54498, -4068, 8540, 1801, -5070, -39385, -26711, -892]
16462h92L5763l6870n5851K3241J8414j4074q203K182j7241l2476J6065r941O627
16449g3256j0561L5650N3484K7671k2362l6711j654j690m945q053J9212k7508
16437e0723k4965L1786J0361J3181J8540K6772L4363J5909l6182J002K4121j2870
16425E1295m6377l4972k5989k844M496J7018K2319j1737o830m0653n038K8661
16413e0651K4101O6014R611K4179J1676N516k0019l2591n2650n36n129N0938m391
16400B6068m409J048L683n0984r579L2661K5611q852J9063O67k1284n5262K0023
16387b1546M5910K351j9777k7131K8582j0985M0321J2029m1773k3281j794O99
16375a6395K357k9609o799M3320L1837j9223j9177k15M0663M3284j2400l1770
$$ y = [-892, 34871, -1999, -57850, -34609, -16195, -30269, -38472, -36290, -53531, -86007, -69942, -79883, -73256, -83817, -48167, 5317, 32988, 10626, -26085, -27739, -29429, -34374, -42427, -23215, -50723, -75688, -43902, -33541, -20360, -1820, 24952, 59315, 75224, 39042, 40044, 64165, 51295, 4918, -30054, -56043, -58887, -54391, -37373, -15054, -26791, -33621, -74274, -79312, -50651, -26550, 39464, 49075, 73254, 84930, 90446, 70427, 37836, -14814, -15350, -20479, 30459, 26068, 21659, 22707, 26390, -24594, -34173, -1512, 24099, 15247, 34310, 34977, 13693, -41569, -21546, 24364, 26715, 6938, -20193, 8389, -2596, 37725, 49754, 7981, -15300, -17094, -16395, -14038, -43647, -50446, -7126, 24711, 5488, -13689, -13904, 26759, 70043, 57643, 25873]
16363B5873n6683L712k95m4230J6030p421J2864K9933K4743p336n7200m8216K3981
16350h4245M0865K5888r909j462k3736J2048J6505r696n552k6748L816M5395J8691
16337A860m5974p893j3173K0407M3893L8105j4089l9222j827L9062R915l502K7743
16324E5305l7655j6179j1004k2588j9823j9415k3184K3408N3810J4822l1350K0998
16312a2855O112J90k321k318m0399J6144l522L330K9333k8541k1226N578K2476
16299b8019N5317j4530p928j1943l0651J03K8517O226k3383l3955M4264R834j9842
16286b5990j0034k6481Q12K3397M677m0279L0996J9243J5088L1848J6276l7138
16274B415m7331j3096K8470L9284J5631j9183m0763K5609J2523m0860L1043K4416
$$ y = [25873, -30810, -27098, -27393, -71623, -55593, -63014, -50150, -20217, 4526, -2810, -60010, -108226, -84245, -43380, -17492, -27401, -28863, -52599, -40551, -24046, -33742, -39294, -66042, -62226, -16831, 1860, -44114, -52007, -65180, -44773, -880, 37225, 23136, -16086, -17913, 21149, 31064, 27562, 55305, 17650, 1471, -9533, -32121, -51944, -71359, -94543, -71135, -17325, -2503, -33853, -12855, -6743, -6553, -8874, -11192, -51591, -35447, -38969, -35639, -6306, -34847, -56073, -50495, -28019, 27298, 12768, 4840, -7103, -37754, -37651, -9134, -2908, -26291, -60246, -15982, -6148, -25990, -36024, -62505, -61693, -38296, -33619, -73898, -42902, -23659, -8571, 23277, 39553, 2415, -44916, -58012, -29542, 9742, 25373, 6190, -34573, -8964, 3559, -37301, -6258, 18158]
16262A8158l3686k5644k0460R107L8914N697j6033M778k4993J3684O411k5731
16250d9798m352n090J0429K680K1046J7700j802l7936L479O239J750R96j833J6861
16236a9631o460J2888J166k1534j3292M1975L6985k8854l3771k4583J5856J0486
16224b8769Q586j2733L613l9218k2206N1382J1700k6559J8891k5603k6946J6429
16212g1433o10r728L6800L8665m986J5885j0126k6938Q955L1327k3183m3994k957
16199f2323K088K772j8689J1759J2662K8642L6685J1342j7662l277k344k40n43
16186H72O1q320q363Q750J3680R64j5451q12J694L7129L2414l484j3980J2488
16172E7642k6338n4148k3881N0455O779j2734j3861k8173K7970K8994K9946o1
$$ y = [18158, -15528, -41172, -61632, -52525, -13611, -7914, -23947, -19169, -44162, -30478, -24067, -49798, -54150, -59240, -48811, -46131, -25085, -7385, -9187, -47123, -43644, -37405, -35655, -34659, -36492, -19631, -26091, -13203, -12037, -33571, -46863, -4888, 32097, 3243, -30528, -55111, -39255, -28769, -20183, -32916, -29303, -68521, -90727, -39345, -27645, -54204, -35313, -60916, -87862, -71433, -72043, -81771, -44971, -6306, -11292, 4593, -5533, -32471, -23516, 7811, -15372, -59366, -62323, -60235, -57463, -76152, -64393, -51731, -23089, 13596, 24938, 7276, 3999, 1655, 1415, 872, 933, -7387, -15750, -7000, 6680, 7644, -7807, -8619, -6925, 30204, 62618, 59134, 45154, 57642, 31304, -22844, -46725, 3730, 10509, -2225, -16086, -44259, -16289, 12705, 42651, 42590]
16160D2590k3620k1175k6440j7526k3183j8841l0388K5017K0452j4522N152K7899
16148e4585l5866K8290N0540P623n6110k9141J7861L1744k0525J1389N968N006
16136c7806K2224M5921n90k4534k0350J5427j6771R957K6k0111J8068K4171o259
16123I373r981K9822L904m6185j365p992K5138j6445l1645K0659j5394Q220J9809
16110a2082J988R159J4686R253l4359m4653J5782R66J8207k007J0138M9228J8261
16097E4567k0934J454j6288j5328l1409j7707P876J1355L30r693J6178M567m3972
16084e9004j865j3214j925j7150K6698L8258J8287o2245l8865J7007K5999R173
16072e8846L0932K9022k0934r881N2727l817k8411N050q95j360K0580k1016L308
$$ y = [42590, 18970, -2205, -28645, -46171, -69354, -88195, -118583, -93566, -73114, -87636, -82484, -54585, -90451, -62161, -11621, -3998, -60108, -89249, -71388, -39644, -60169, -48780, -42812, -37806, -15582, 30339, 29749, 5215, -15135, 292, -16479, -6522, -6496, -26607, -8539, 15632, 9373, -608, 29214, 33118, -13067, -14432, -22424, 2714, -13731, -45376, -24717, -40111, -31891, -12082, -10094, -935, 13751, 23004, -11355, -56008, -40226, -39260, -21053, -23060, -12922, 36306, 54567, 33633, 35087, 18799, 3471, -27938, -45645, -37769, -26414, -26084, -35777, -19599, -15032, -59004, -60869, -74083, -76008, -93158, -66460, -28202, -9915, -72160, -111025, -94018, -68019, -58846, -27914, 1108, -19826, -29707, 23020, 19203, -9208, -4158, -5053, -6413, 14167, -6849, -3541]
16059c541N1454K1563m5217m2508L11Q956K6545N028L5736K2189j2488k3646J1228
16046E5610k676n769k715k5990o438n520k4407K4349J3583L858P468l090m2351
16033a4088j0337Q522K760R008L3414l0753o476j5982p947J9673L6923p817l9644
16020b2744l3509P242o930k6296J8850M1659q58o226N895k2538j5666J1162J5065
16007c4894k2879J4283r669L1J784k2341Q184O4531l763n7223j1182M1830N7373
15994B6065m826l9402k9115k2421n978J3178n562O118J9451K4891J6892L1590
15982C0881J7039o465l0112l3194l0896k7141R143J4648K6921N7566J1336o0305
15970b0579l9263O1406P0710p019J87K9686k6857m2327K920k3738l4198l5579
$$ y = [-3541, 47913, 69476, 24259, -18249, -17938, -8982, 17563, 22591, 58327, 80516, 68028, 44382, 55610, 52934, 47165, 44450, 18460, 12022, 6502, -17905, 6444, 20027, 23885, 31353, 28263, -14088, -24425, -15903, -13143, -4135, 29279, -1474, -7950, -23932, -31879, -12206, 24717, 16900, -22744, -56253, -49011, -55941, -82237, -63387, -21728, -22586, -28812, -22917, -45455, -61121, -49959, -34894, -57773, -43490, -53159, -53128, -51344, -73685, -65501, -970, -4733, -61956, -73138, -31308, 26065, 21239, -18163, -47278, -69699, -75677, -62499, -68061, -61943, -42492, -17601, -709, 30881, 47920, 41455, 11343, -21851, -52747, -79888, -70745, -56097, -29176, 28390, 39726, -20579, -59842, 1564, 72274, 65255, 65442, 95128, 68271, 25944, 28864, 5126, -29072, -64651]
15958f4651K1202L9298K8503k946n087J1240j8869o0359J2107L7840l4718M4186
15946G746M5771r786l799j0973l1991k2529K0050k6876L1325J4046k0034J0595
15934C545M4461J0369l0872j7625K8730l6497j6107K1775J3160r575q063M650
15922G951K9240j6371m2523L6874j904l1326m180R771J5287j1318j2753K8633
15910G381L739J5229n85m8408N713K4827J1376j9571j8779j4594J7248K7110J059
15897A1745k0568Q73K6547J4686o31O404j7830q437j3231J1276J12k0013N564
15884c503m7545m9916K9984J0293L076L9669j4679l355J0828j328Q592M0775k0175
15871B716L409q687k6229j5993J8478l023M4458M547j2811L1797l644m7792m1845
$$ y = [-64651, -43449, -4151, 24352, 21406, 16319, 27559, 8690, -51669, -39562, -1722, -36440, 7746, 53517, 43731, 39932, 28959, -3032, -25561, -5511, -32387, -1062, 12984, -7050, 3545, 48006, 58375, 27503, 9878, 38608, 2111, -13996, 7779, 20939, 11364, 3301, 7951, 37191, 20820, -21703, 15171, 13267, -18059, -22239, -12468, 2819, -8499, -21252, 7381, 11120, 26349, 25764, -22644, -16931, 7896, 19272, -299, -19078, -33672, -16424, 10686, 11745, -8823, -7950, 18597, 33283, 32652, 39056, 21226, 12789, -442, 10834, 10946, -9067, -3503, -51048, -100964, -70980, -60687, -57611, -17942, -32621, -35976, -25148, -26476, -17884, 22891, 2716, 6125, -2562, -28791, -44784, -26306, -29329, 15129, 19676, 6865, 38662, 35018, -12774, -54619]
15858e4619J586O026k815M94N925k5870j1617J5418k6363Q46k768M6086M7075
15845e96J3824j7419j7737J2402n6622N707J6821O42j535l175L001Q992J7822
15832a7873L736J7624M581k2607k0493p613M0470k633n487K1453j3997J2724q876
15819A009M231j8398j0668K4274k2488r042j8045k1768J7803p87j5858J8284L4126
15806a7327J7678j7750q492J1777l1450n2173P278N1389J0581K6402K9479k7255
15794A37j5449J104K932M0523J2346j7428N02K7170k6328M295O541J0874O513
15781E3732k0598M445m3966N099J8537L849k2019k7957J0824L6803O624m5627
15769b0254j1431j7428J5990k5000k4501J3741O169k647N5368N6306K818k8187
$$ y = [-54619, -53033, -47007, -49822, -49328, -43403, -69273, -80890, -65472, -91835, -90989, -93757, -47671, -596, 13228, -4191, -21928, -9526, -66148, -60441, -43620, -42978, -44513, -47688, -44687, -35695, -17873, -14137, 3487, 8068, -14539, -35032, -42645, -2175, -4808, -10295, 11158, -2839, 9885, 1009, 5240, -13158, -23826, 448, -22040, -31082, -49127, -70895, -53092, -53879, -69737, -51453, -17327, 351, -17399, -25891, -14114, -45564, -97737, -90459, -39070, -28489, -2087, 27392, 137, -15312, -14208, -11276, 29247, 41593, 24165, 24667, 51837, 25509, 29804, 36345, 47219, 53732, 33134, 37579, -6387, -1288, 17249, 21098, -921, -28878, -18054, 18749, 25373, -20254, -31685, -49113, -33123, -58123, -82624, -68883, -62714, -65361, -9993, 46313, 49131, 20944]
15757B0944l0742j9299R510J8875L0440K1614p2524J528K0023K6890j6475J106
15745A1890o451j951Q758j5764K3113K6638L2968J3071l0817m7979n7286k8988
15733g2798J6323M366k642O352K628J614M0824K0723O1868R321k1112J1455m4925
15720C3997m0218l1981n730k4398J9499L7127J4084L7162K7852J8503m1336l6812
15708G749J6297j3353J8761k1627j0015O808j0841l2149j7004k0008j2227L5415
15696e2194L8626J9711k5753j089l1771k9833L2502K6550J7941j1627j6152L8845
15684E756M0151j6304o3072l4286k6884J8904L0018j1715P136L8422M4670J5395
15672D8191n810j4306j8206l913l8936j2384L1113K4886o485k9231o283P279J6633
$$ y = [20944, -9798, -29097, -19587, -712, 29728, 51342, -21182, -19654, 369, 27259, 10784, 11890, 5439, 3488, 12246, -3518, 19595, 46233, 79201, 92272, 61455, 13476, -43810, -72798, -56475, -52109, -54751, -48399, -45771, -44157, -3333, 17390, 79258, 88579, 67467, 78922, 33997, -6221, -38202, -43932, -68330, -48831, -11704, 2380, 39542, 67394, 85897, 44561, 7749, 24046, 10693, 29454, 7827, -2188, 4620, -6221, -38370, -55374, -75382, -87609, -52194, -13568, 6143, -19610, -20699, -52470, -82303, -49801, -23251, -5310, -16937, -33089, 5756, 45907, 29603, -33469, -67755, -94639, -75735, -45717, -57432, -50296, -11874, 32796, 48191, 42381, 28075, 9869, 5956, -32980, -45364, -14251, 10635, 4150, -25081, -31364, -24085, -7452]
15659g452l5382m0768k8466M6583K9727O0630K9975P558l0691M188J118k3590
15647A3430m9095K3313L4630J5358j9109Q940M0169Q364k4337k2602k524m2075
15635a5538O963j2519j3134L7755Q317n7334j4048K3038J6841r700K615L966L400
15622a9378J658J729j5138j5386L2649M0554J3451K780L593o8267j9155L1447
15610i463J8069j9668L063j3138m989n328R725K8560k1261j3410n065L071O121
15597b3713O15m0108K9257K5143K421k0408n7584L7607J4485J715K7145K7656
15585B4231k146j0015l3216r463k6597K1982N2242L9903l0799m075j283j172j1723
15572G869j4312K2620k1253o517j8485K4504K1334l3259l4970K0036p253R951
$$ y = [-7452, -42834, -83602, -112068, -65485, -35758, 24872, 54847, 62405, 31714, 35902, 37020, 13430, -35665, -12352, 22278, 37636, 18527, 27467, 67636, 76000, 51663, 29061, 26537, -15538, -8575, -21094, -34228, 3527, 11844, -45490, -59538, -36500, -19659, -29359, -26744, -22778, -19378, -17720, -15991, -31129, -46515, -13866, 26688, 40139, 42919, 46512, -21755, -40910, -9463, 8606, -11062, -7999, -21137, -26126, -31454, -21729, 6831, -14430, -27840, -32905, -29834, -23713, -23098, -63206, -33949, -8806, -6385, -26793, -84377, -46770, -32285, -30570, -3425, 24231, 22085, 12070, -21146, -30609, -57206, -35224, 17018, 56921, 26122, 22047, 20764, 19592, 7869, -6443, 16177, -5076, -11593, -30078, -5574, 15760, -17499, -52469, -32433, -39686, -29735]
15560b9735j671k5295J8601J0459J4615j0599P875j5417Q459l239o408j5229k5073
15547g2657L5625N0099J0503l0885m1013R017M445j8314R057r985J723j7042k2746
15534i2173K4309L0210j806M4117p957m5497J531J679p282L0066J9903J271Q575
15521F946p764J3906L603j0176j6426r792k5796k7318K0525L0885M3448j6114
15509E927o0845k1104L8339K3811M897j3285j5711J6178k5227m2090r922L8984
15497f0048J4385J7920J8191J861k0580j6190J3856N346K9862M084L1650l5370
15485D967q5610m2208Q5076K1905J012k9095r749K9201l897j2308j6829k8992
15473h6527q60J6257O091K8228L1154J0020j2286k0143J6700J224L827M092J3622
$$ y = [-29735, -31406, -56701, -38100, -27641, -13026, -23625, -15750, -31167, -22708, -25947, -32355, -47584, -72657, -37032, 13067, 23570, -7315, -48328, -39311, -34866, -53180, -44123, -54108, -52385, -69427, -92173, -67864, -37654, -39460, 4657, -3300, -48797, -47266, -45587, -52869, -22803, -2900, -1629, 6946, -818, 13088, 16691, 6515, -9911, -19703, -45499, -72817, -52292, -21407, 22041, 5927, -54918, -76022, -37683, -13872, -8975, -22260, -37971, -21793, -47020, -89110, -99032, -60048, -45663, -27743, -9552, -7691, -28271, -44461, -30605, -25259, 4603, 8687, 40337, 4967, -80643, -122851, -37775, -15870, -14858, -43953, -53702, -24501, -28398, -40706, -57535, -86527, -87387, -71130, -65039, -36811, -5657, 4363, -7923, -28066, -11366, -10142, -6315, -2223, 11399]
15460A1399L7399o1610l6340K0676L8015M631k4592l3298j7073K2634P7831Q88
15448D0560p119R248k0795k4818O213J0156K5436k5715m196m935l9896j9105L4645
15435b0321j9167j9455K6416K1122k7761J6893K717j9060J7512m098J1676M9385
15423C5859R623m4417Q315q930J2724j662o7006o560K4912K0585p197J084L9368
15410A6698j900k1250K8975m0334n3828K2595o977o701m305J5254P7417M5695
15398G1339Q315j5367R89m2013r2497k8289L7829L702k9437J1479L8104j1103
15386d6949L1804K3526m2596J6424M8745j7848m4761j0321L1574M2262q54J0280
15374D1286o623K0436j2282j1202j4835k8076k4641K7217J8557Q241K856J0569
$$ y = [11399, 48798, -12812, -49152, -28476, 9539, 14170, -10422, -43720, -60793, -38159, 39672, 40560, 33441, 42689, 21894, -2924, 3289, 13445, 38881, 13166, 8970, 4035, -35861, -54966, -20321, -39488, -58943, -32527, -11405, -39166, -22273, -19556, -38616, -21104, -25202, -13526, 35859, 45482, 1065, 9380, 450, 13174, 11512, -55494, -62054, -37142, -16557, -23754, -22670, 16698, 14798, -6452, 22523, -17811, -71639, -49044, -56021, -62722, -67027, -51773, 25644, 71339, 79654, 64287, 65276, 23263, -69234, -97523, -59694, -55992, -85429, -73950, -35846, -46949, -15145, 8381, -34215, -17791, 30954, 13106, -31655, -41976, -10402, 31860, 31006, 41286, 34663, 55099, 42817, 31615, 16780, -11296, -35937, -8720, 9837, 18078, 20934, 31503]
15362C1503q92m1445M763j0589q961q450k5200K5694N5452M954m6144k8462J7997
15349b9780L7100K6584J7906J2637k3121n2125l5454j7836N3759M420J1868J4301
15337B0259j6337o3517k2429J2101J7476K381K790k2674k3312J2851L7200n58
15325d3769J6877k0155J1282P5882J1933j2007l0204Q167M7112l195j7193k5829
15313A8901j8099p067l2259J1508K801j307Q249M0726M2939m8851J356L6822l3662
15300B2057m8246L2832K7931k2268m0266L7197L4867M44Q109m1525m8100K6460
15288a0508M4418j1132J573k5094m4932L2018L1931M293k6905J3452r855J2997
15276A2256k9806q750L4903N2948j0412r65l4454k2458J913r730K696r491O515
$$ y = [31503, 30611, -10834, -6071, -16660, -25621, -34071, -59271, -33577, 21875, 26829, -19315, -47777, -29780, 7320, 33904, 51810, 64447, 41326, -10799, -46253, -64089, -10330, -5910, 5958, 20259, 3922, -59595, -82024, -69923, -52447, -50066, -47276, -69950, -93262, -80411, -43211, -43769, -26892, -47047, -35765, 40117, 52050, 40043, 9839, 18006, 65118, 61923, 44730, 18901, 802, -6265, -38524, -27016, -24215, -25522, -17273, 23453, 66392, 17541, 18897, 55719, 22057, -26189, 6643, 34574, 12306, -27960, 9237, 44104, 44548, 52657, 11132, -36968, -10508, 33910, 22778, 24351, -743, -45675, -13657, 18274, 22567, -4338, 9114, -741, 12256, -17550, -26300, 8603, 61551, 51139, 50174, 15720, -6738, -4825, -14555, -11859, -21350, -14835]
15263a4835K5980K2693J4352J3488m69l2747l2361l0930m027p346l8480Q810N3201
15250b2671L9501J4192J29j0544j62l1066m4374o569J9400j7820o007M89J9427
15237d6075K567p420R851k3571p530L1035J6003L73o267k4622l9021J4430M1604
15224c8643m860q05p127J0466R448P600K7437K2167j6121l6032p099N849K127
15211b5593l9670o204L0516J5566L8238r381j8877J7352j491k62N806o919k4201
15198b5120L68K4642k4547K6779o811K786O258j2286K0809K6069j1941N539k6591
15185E954l589K0305K6289m6913j1050M000m225J4038k0866k9398l4412N417M1114
15172c3336M6366k2252j8512K1358J7843M344N2370L2233j9288n3135k1810j4517
$$ y = [-14835, 11145, 33838, 48190, 61678, 61209, 28462, -3899, -34829, -38856, -46202, -84682, -75872, -22671, 16830, 31022, 31151, 20607, 20445, -10621, -54995, -61564, -42164, -59984, -65991, -65502, -46075, -43508, -50928, -41077, -64648, -72178, -41143, -25140, -24767, -31034, -55656, -94677, -80247, -38643, -43503, -44308, -51435, -40969, -31521, -23921, 3516, 25683, 9562, -26470, -33569, -27720, -25593, -65263, -71467, -40951, -25385, 12853, 3472, -15405, 1947, 456, 194, 6000, -919, -25120, -24752, -110, -24657, 2122, -4689, -1903, 4355, -7931, 12878, 38947, 27006, 32545, 5954, 2365, 22670, 48959, 2046, -9004, -5004, -9229, 4809, -16057, -45455, -79867, -74450, -33336, 13030, -9222, -27734, -6376, 11467, 15811, 68181, 100414, 81126, 27991, 6181, -8336]
15160h336O547j11j2402J0866M9210k3269j3595J7564p353j3791k317p516l356
15147g859J7374Q338j0051J5096j6912l5527L0436k6886k7686J4572j4535J2690
15135d0950n094J9858L7385J7065K7678j7279Q434K4188N965K195m7764k3554
15123H127K1390j2283L105n858o8747J1078O5909J6359j6654o247M908j5291k7611
15110b1815o670K1032P241J0354K374J4778k7622p3182j6967J9831N4378M8574
15098C2306k9110j8771K0059j2205p283p048J0650k1501J9947k4877K8670J4027
15086D864q852r319N508j9238L8533K4622l9168q261J8743n4659m273L9701l106
15073a4905k7696J3493Q5718O253k9297j0015k2399k492K0623m350l0034M4539
$$ y = [-8336, -1789, -1900, -14302, -3436, 45774, 22505, 8910, 26474, 19121, 5330, 3013, -4503, -7859, 9515, 17853, 7802, 22898, 5986, -29541, 895, -25991, -53677, -39105, -53640, -40950, -46044, -26186, 11199, 28264, 55942, 38663, 47097, 71285, 77250, 79445, 31681, 8127, 29517, 17234, 20339, 14481, -54266, -43188, 22721, 39080, 22426, 16179, 21087, 5796, -21815, -28485, -7453, -212, 10142, 12516, 27294, -328, -73510, -90477, -70646, -16268, 32306, 3196, -15575, 4484, -7721, -15004, -22052, -11402, -32903, -12956, -37833, -9163, 4864, -3988, -13307, -7799, -27037, 11496, 36118, -3050, -11311, 7432, -47227, -51500, -11799, -14905, -42601, -29108, 56610, 62863, 33566, 23551, 1152, -1340, 19283, 14933, -15101, 29438]
15061B9438J2128m8857j0814L2620m9952J8376K8432l6606K790L7124j543k8712
15049a5576L5053Q855l0019l6297K6150O8204L6372j0772m4952l166j4776j1715
15037G361j5103r391K2280n9m4566j99J5678N000l289q05o399j1658K0230J1643
15023i277L5958n0233k4125R517m619j002K212n437J3592Q415R63J2556r299l6696
15009e7475k9329M6142K6591M746J4193L2346N0156p146j1802k2982J5576o253
14997E4763l5601k3548M111j9555J6817j2730l2697R488K3172l676m119m5564
14985f9139J3291l198r7L0337L2419J2600J9165k6602l0950J2478L719J0126m171
14972b2O2665M827m2662k6318m0300k7303j5867R611j8167NM3414J8647p235K5892
$$ y = [29438, 41566, -7291, -18105, 14515, -35437, -17061, 11371, -25235, -22445, 14679, 13136, -15576, 19477, 28332, -1687, -37984, -11834, 56370, 92742, 81970, 37018, 33852, 19076, 7361, -7742, -17133, 5147, 5088, -39478, -39677, -23999, -18999, -22288, -23093, -29492, -41150, -20920, -9277, 26681, -23552, -47677, -38160, -42779, -43781, -41569, -47006, -33414, -24999, -24036, -11480, -20779, -57475, -86804, -40662, -14071, -9325, 4868, 37214, 87370, 80224, 68422, 45440, 61016, 54763, 19162, -4386, -275, -19830, -3013, -15743, -48440, -38952, -15780, -19456, -23575, -69139, -55848, -59046, -59143, -28806, 3613, 16213, 35378, 8776, -22174, -9696, -5977, 4149, -22, 62643, 67470, 24808, -1510, -41810, -69113, -84980, -75369, -93536, -93531, -50117, -31470, -38705, -12813]
14958a2813N132k2500K3968K0903l9819J5982L683J0139J8061J6744l4311r683
14946d514Q172K162l6124j1220K0026J7921K7801m3673K9995m72m3548l2843j7008
14933h3325K5753O1014L5038R464k9841k0648J5896Q745l226k7142l4422k2544
14921f5238M1554M5528K1296K6000k8634Q898l8811o670j8054N626m65p701j0190
14908b6861o4150j5924K8998K2751K6649J748q435R539M4468J622j7726k8027
14896b5348j4261K5450K7900P805k3786n1131j4746K6008O126K946J3844p754
14884b6947K9154o201k152N796r475J4634K2993L1324l3248p4086n6857J4593
14872i0472L7406j0836k7827K7751M2505k8708j6642r565K5089L8058O365j323
$$ y = [-12813, -7681, -30181, -6213, 14690, -25129, -9147, -5464, 4675, 22736, 39480, 5169, -4514, 3658, 5820, -30304, -41524, -21498, -3577, 24224, -19449, 10546, 10074, -33474, -66317, -83325, -57572, 3442, 38480, 47944, 18103, -2545, 13351, 22096, 18870, -8272, -42694, -65238, -23684, 21844, 43140, 69140, 40506, 49404, 10593, 3923, -14131, -8505, -8970, -16671, -26861, -91011, -106935, -77937, -55186, -28537, -26789, -35224, -25685, 18783, 20405, 2679, -25348, -39609, -14159, 13741, 21546, -2240, -53371, -68117, -42109, -35983, -33037, -19193, -26947, 2207, -3994, -6146, -350, -9825, 4809, 27802, 59126, 25878, -48208, -105065, -90472, -53066, -63902, -91729, -63978, -21473, -50181, -66823, -76388, -51299, -13241, -6876, -8199]
14860h199K531l3300J6058J8348N876o9119l7694O3343K0152J6524O378p509j4708
14847b1319J1754M7364J5217k6392j9972j7014N936P947j8248R214L0378n5854
14835c0989j1988k2194M004K3146l415p163K4802l7688j8524K8155M5696K1991
14823A5833p612j7099M343K929N390k8420j4804l2078p519M1206O1633L0061k7505
14810B6358k4854j7355P82m8441J3199N3677p366n632m77J857o338o573L3499
14797A2336L0829l1505l1673k9601K796J2092L8530N0471K1963k3063l2791k4203
14785c819J4709j2949j4981j2725K7590M179k6909N9405J275k669M307m3949j6609
14772b3145j2495n410K5829K0091q841k4886j611J9136L3336L5922J2923m7902
$$ y = [-8199, -5668, -38968, -22910, -4562, 1314, -67805, -105499, -42156, -22004, -5480, 898, -6611, -21319, -9565, 37799, 53016, 26624, 6652, -10362, -4426, 3521, -14727, -5513, 24865, -30989, -42977, -65171, -61167, -38021, -41436, -48599, -23797, -61485, -80009, -51854, -6158, 15833, 8221, -8878, -4535, -1606, 3784, -24636, -39440, -71518, -79037, -37831, 23802, 53863, 26358, 1504, -15851, -15069, -63510, -50311, 3366, -4000, -9632, -10109, -8252, -14590, -21163, 12336, 43165, 11660, -20013, -49614, -46818, -34726, 3804, 54275, 76238, 53175, 20384, -3819, 10890, -2059, -17040, -29765, -2175, 2004, -24905, 34500, 35775, 33106, 37413, -6536, -23145, -35640, -41050, -15221, 4870, -3971, -28857, -30468, -11332, 22004, 57926, 70849, 22947]
14760B2947l8259k1032k3587O360L4246J7338R128J6363q860k5694k8928l0123
14748g0101M2562M1408k3477J1063k9057l0483o083K9110j0888K8475j2374m1110
14736g0955K9003N679m7216J2320N4785L7113j3020p5672J4189N4220k3002J9590
14724b966L2971J9375J5354m2355j2569R93r679k6882O949j3486j5468k3324P970
14711f3117L2787P270j7757n580L5769K0672n450l7634K7007L8555o425n7536
14699c1439l6246K0580K3051k2176l2390o3676M8440N1842O134j1444q442j4267
14687g0033j1435N8812M2568K720J6907m0617k1955N917L4344j6283p8903p683
14675h5641L6829O7639j8401m8814m4070j7959K0200O2963O7436J8562l0986o8035
$$ y = [22947, -15312, -36344, -59931, -53571, -19325, -1987, 7141, 23504, 14644, -11050, -39978, -70101, -27539, 13869, -9608, 1455, -27602, -58085, -64168, -35058, -45946, -17471, -29845, -70955, -41952, -36273, -83489, -71169, -16384, 20729, 7709, -67963, -53774, 446, -22556, -2966, 30005, 49380, 64734, 22379, 9810, 10803, 1124, -25758, -18809, -32295, -47763, -71087, -63117, -30330, -23060, -40817, -46397, -10628, 10044, 4594, -33040, -6033, 32522, 26097, -31439, -67685, -47105, -24054, -46230, -78620, -142296, -93856, -42014, -35880, -47324, -55766, -70033, -81468, -22656, 19912, 22632, 39539, -1078, -23033, -17116, 17228, 945, -77958, -85641, -48812, 18827, 426, -48388, -92458, -110417, -90217, -27254, 40182, 58744, 27758, -40277]
14663d0277k5180L6820K3738J4389m899M3608m020p8814n3583j765M9519J1687
14651b8777J1758j3318m747L4856P239o0002J970L4335K0636j7889k3853l142
14639d0934J7087J2038K2451J0863j1948n1905K0798N0193j2188K4256R915O73
14627E1299k4897m1322m7622j7763K1182M2848j0006k3869N4640Q862m537o893
14615A922r893L0922J3163n4152J978L2754J4441K504J3157P359J4239j3588l4940
14602A9866L2883Q797J3091Q552k9441o7099j8554j0152J9884J2684k4133K8412
14590e210N3278l0548l0003k1802k8678J353J5573J4760N2145p714j4842j0158
14578a1846K3388N465j2416r354J574j3980K8621l298l4474J1415M6911n829j0824
$$ y = [-40277, -65457, -28637, -4899, 9490, 4591, 48199, 44179, -34635, -88218, -89983, -40464, -28777, -17019, -30337, -35084, -228, 7011, -52991, -51021, -16686, 3950, -13939, -37792, -40934, -23847, -11809, 10642, 21505, 9557, -42348, -21550, 28643, 16455, 40711, 50626, 51299, 26402, -14920, -62542, -80305, -59123, -16275, -26281, -50150, 4490, 13352, 8815, 1922, -7971, 22951, 36114, -18038, -16060, 16694, 31135, 33639, 46796, 54155, 68394, 54806, 19866, 52749, 61546, 74637, 83189, 53748, -13351, -31905, -42057, -22173, -9489, -33622, -5210, 48068, 17520, -12483, -34285, -62963, -61610, -46037, -31277, 20868, 13154, -1688, -11846, 11542, 17007, 4591, -4763, -3189, -17169, 11452, 8154, -26320, -14905, 32006, 26177, 15353]
14565A5353J3165J2633j7322J1880N4286k3422m4819J2786m5089j410L2898n17
14553B0422k2535K682J874K259k7185m2437K0720o891L0700K8224M0704j8856
14541B9681o3110r716J9311K076l768J9253R183M3031K1888l3433k1067J6986
14529C0315l414p391j3605L1116K9862J4139k3169m839J346J3513l4141r146k560
14516B2026k4466l9553k4443M209N1244L6178L4992R978m0760q121Q100r403j8078
14503A903l9314K9615L9020j3059o6725K4648q872J8769R779j9466K4685n464
14491d481J5406k6956r177o443J1874n018j1624j8191J9636l3886q448j863K4689
14478e4482k8605J3190K8130L0455m4413K7498L783J030K0697J3098O515n2479
$$ y = [15353, 28518, 41151, 23829, 35709, 89995, 66573, 21754, 34540, -10549, -11959, 20939, 20422, -2113, 569, 2443, 4702, -22483, -64920, -44200, -51091, -20391, 7833, 48537, 29681, -33429, -43145, -23834, -21758, -25526, -6273, 2910, 45941, 67829, 34396, 13329, 30315, 26901, 19510, 5905, 37021, 66883, 81022, 57853, 53014, 54360, 67873, 33732, 24586, 22026, -2440, -41993, -66436, -62227, -10983, 25195, 60187, 70165, 29405, 21284, 29384, 19981, 1903, -37411, -7796, 31224, 18165, -48560, -23912, -32784, -14015, -4236, -23702, 983, -4481, 10925, -16031, -25208, -31651, -19777, -24795, -36419, -54610, -34974, -68860, -77308, -79171, -54482, -83087, -69897, -41767, -11312, -55725, -28227, -24444, -23414, -2717, 10381, 16896, -35583]
14466c5583q431l174K7970J6675m5970l0583n64K1215K1716j14M437j5576K7524
14453b0458J097j0074Q105q996L6284K2060l1705N0875M3192n2632j4521j0578
14441A2649L138m5834l3546j7136L6072K2740l3502O728K2626o730J5541M7488
14429C0234l904J1405k2140P291j5619l82M4664K7091n9789k4987J381o157P439
14416c473M4664k9583k7866K6559r115Q458M5498r841k5104n750J0251l9185K885
14403a1602K4885n0566m379N2816N2329K3049l6474J084l4196j1406Q130M211
14391A7881M077m8979J3261J2335k2815k1007J521j1303K4854N3108O018l320
14379B5631L985k1415j6111Q851r322j7829l4971J3179K1548L9449j7430m1120
$$ y = [-35583, -44014, -47188, -19218, -2543, -48513, -79096, -79660, -58445, -36729, -36843, -32406, -47982, -20458, -19361, -29435, -21330, -30326, 5958, 28018, -3687, 47188, 90380, 37748, 23227, 12649, 15787, -30047, -63593, -80729, -44657, -21917, -55419, -48691, -26065, -32795, -17254, 30234, 26330, 37735, 15595, 22886, 7267, 6885, 51549, 78640, 18851, -6136, -4755, -10912, -3473, 41191, 11608, -16258, 10301, 1186, 9644, 55142, 45301, 20197, 14447, 24698, -14487, -11602, 13283, -37283, -41662, 11154, 63483, 86532, 50058, 51142, 16946, 5540, 13670, 17881, 21958, -27021, -13760, -1425, -24240, -45247, -43726, -55029, -30175, 22933, 28951, 25631, 29616, 8201, -7910, 941, -8381, -26210, -61181, -48002, -26454, 12995, -4435, -45555]
14367d5555m0133o854J0516J222L1918m16k9928K4850j303j2074M2580J6585l074
14354a1666M6099M3272m2363m3300l1882J6014K0366j2490k0258N7865O2461n772
14342G8346l2670o0786j2071k400J3724J622j5369p83J9834p795j5889P048N7415
14329C0226L1873m1541k1162J0980l565J6703J8630k1015J483J3603k5246l531
14317G438L0322K706M72k7209j8549p049o0611K3390M7290J6446l0459k9351j1827
14304e6991K2678P918P084n900N0055j6755p8623n588L6286J2077J0910l807K0987
14291C31m3344j79Q087O775L612L715R936l940Q569L446j0706j4635L2756K5447
14277B9870j8955l3502m1391l4632m5426M0987J4691N723P3695J6440m3342O041
$$ y = [-45555, -85688, -92542, -82026, -80804, -48886, -49302, -79230, -54380, -55683, -67757, -25177, -8592, -11666, 34433, 77705, 35342, -7958, -39840, -23826, -3460, -15950, -36208, 21657, 84118, 78346, 45676, -15110, -27181, -29581, -15857, -14235, -29604, -30387, -10553, -18348, -34237, -27189, 30226, 62099, 20558, -604, 10376, 6811, 23514, 42144, 21129, 22612, 36215, 10969, 7438, 37760, 40466, 40938, 13729, -4820, -11869, -72480, -49090, -1800, 14646, -15813, -45164, -56991, -34313, -26395, -19311, -25211, 24844, 8089, -70534, -76122, -39836, -27759, -16849, -20656, 331, -43013, -43192, -35105, -28330, -24718, -21003, -11067, -15007, -6438, -2992, -13698, -28333, 4423, 29870, 10915, -22587, -63978, -98610, -144036, -103049, -88358, -82635, -8940, 7500, -35842, -29801]
14265b9801J4791l097O987j6315M371Q552L2491n681n7083J8448J1400J3973j242
14252b206n0476n827L6570L6805k6381q471L8650M9020k5984k2007L1278J481
14240E2452k5361k555q167j1318j414j3077L6644L8966j1493l1157J151m32L1999
14227E6238J7684m3418m7547J2806q580j1975K5142k6633K493J4978L221j9240
14215b4831k1065J8517J2065p165J7740J7644k1096j1668l477P681P673j2918
14203b0900r796r380O567J0296M925k841K5480L8925L9538k5385k7849m1729j6297
14190b8446K0104M9499n26j5320j5151n973J2420j9202P49M632J6766M1961k5231
14177C6282j0624k0996l6345Q022Q4051j6360j0003J1833j0101j7693k0084K3637
$$ y = [-29801, -15010, -18107, -11120, -27435, -23064, -14512, 17979, 12298, -44785, -26337, -14937, -964, -2206, -52682, -58509, -21939, 14866, -11515, -19986, 18664, 67684, 41700, 19693, 50971, 52452, 27091, 24536, 16369, 5051, 3637, -9440, 27204, 66170, 54677, 23520, 24671, 24239, 56238, 73922, 30504, -17043, -4237, -12817, -24792, 350, -26283, -23790, -8812, -5591, -24831, -45896, -27379, -15314, -22479, -4739, 12905, -8191, -19859, -23336, -15655, -7982, -20900, -30696, -40076, -33509, -23213, -18288, -21129, 4351, 43276, 82814, 57429, 29580, -12149, -28446, -8342, 41157, 40631, 25311, 10160, 4187, 16607, -2595, -1846, 2786, 19552, 61513, 36282, 25658, 4662, -31683, -23661, 60390, 44030, 34027, 45860, 35759, 18066, -2018, 21619]
14165B1619K9375p286l2907J1127K2170K7803l6851j2249l812j2342k3721k4721
14153d1795Q317P102M8706J5610r891J5861r396j1510J3614O967J0381K3674l8826
14140C8814n9724j7445pJ0885M1581p980K072o310L3767o108L1823J5439k1514
14127E5293j5460L100j9064n2298j4651L6337M274o917o343K2944M787P512K3744
14114D3258k3629n20m6467j7988L3630j5139R858K842K9184K0065l1183l2006
14102b8095P369J1087M1375L6498j4421l5672l9673j2238L1741L464J0574j139
14090A0870K0989j8366m671j2082l4275M7517J8275M824j6116j9382L2969l685
14078B6867o7007k8188N8542L1125k1530K241L9602j2284n278j0488j6899j7863
$$ y = [21619, 50994, 43708, 10801, 21928, 44098, 71901, 35050, 22801, 18989, 6647, -17074, -41795, -33478, -26376, 22330, 37940, 28049, 43910, 34514, 23004, 36618, 43585, 53966, 77640, 38814, -20910, -38355, -38362, -27477, 14104, 6124, 8196, 1886, 35653, 29545, 61368, 76807, 55293, 39833, 42933, 23869, -28429, -43080, -6743, -2469, -9386, -15729, 7215, 12002, 19514, 43258, 19629, 19109, -27358, -45346, -11716, -26855, -16997, -14155, 15029, 35094, 3911, -28095, -20726, -9639, 31736, 68234, 53813, 18141, -21532, -33770, -2029, 1435, 12009, 10870, 31859, 13493, 8822, -3260, -37535, 9982, 28257, 33081, 16965, -2417, 30552, 26867, -40140, -68328, -9786, 21339, -191, 2050, 41652, 29368, 24090, 13602, -3297, -21160]
14066b1160k8636k4220J9116K1846L916o354q16K4654l0003J0316K3819K2606
14054A5084J756l631J4888L1182K346m4399o2088k3004J1804K2512K6168K870
14042d512L460J9533j4727L178M1579J8268m756k768j2798m1659q056K1416J8285
14029C6443l0964R910j0505l4960N498J2386L9244k6817r462L4711n338k8250
14017h104j1786M893Q68l2887K2864M9909l9472l1594K4310N4865O3462J2743
14005A10071n503n4485l5897j1441j6385L9543K8515n2952m3888n163k0313J0462
13993e7436L3144j881j8443j8990j2192R592K8438q110K6696J5325L3276K9343
13981E8762J8600o300k7920k0225k4712j2685P686j9856k410O860L0593j1350
$$ y = [-21160, -49796, -74016, -54900, -33054, -29138, -35492, -36308, -11654, -41657, -31341, -7522, 15084, 16840, 13209, 28097, 59279, 61625, 17226, -44862, -67866, -56062, -33550, -7382, -4512, -1052, 18481, 3754, 6932, 48511, 66779, 62023, 59255, 46457, 4798, -3258, 18158, 36443, 5479, 15389, 4884, -30076, -24578, -12192, 27052, 235, -9227, 25484, 20146, -8104, -19890, -14997, -14129, -47016, -24152, 25757, -13715, -45309, -20999, 33866, 97328, 110071, 104568, 50083, 14186, 2745, -13640, 25903, 54418, 1466, -42422, -47585, -67898, -57436, -24292, -26173, -44616, -63606, -75798, -66206, -37768, -45878, -19182, -3857, 29419, 58762, 77362, 71062, 43142, 22917, -1795, -14480, -6794, -26650, -29060, -22200, 8393, -2957]
13969b957M408K2959J6196M589K1083k387J6940n96j5111k7573k8406j7199r15
13956h969k5975l2987J7469R622N2473K9392l4897q356K0165j7786J7893j5157
13944B887j1252K7759L6233k2199K046l5942K1692J1739k0982K1171K1636j4637
13932D0151j7459k2732J2016l8146m9180J5332L3794M8133K8211l2608n8895k6365
13920f7748M2061L3974L7182j7288k9598j8676k0819j9560M1275J3406L8155j928
13908C0436r450l9564m5021K1026L1885J615M9275M598j9983P25J8994m6197J4414
13895A2753K6894k9164J891J6914J2634j3952l3008L134q136o509J3625j7340
13883b0264L8305J282m993k4623l8286J6699l075K7605K0643l91L2471L1835p90
$$ y = [-2957, 1451, 24410, 40606, 45195, 66278, 63891, 80831, 80235, 65124, 37551, 9145, -8054, -8969, -34944, -67931, -50462, -40840, 11633, 41025, 6128, -2228, 17937, 151, 18044, 2887, -8365, 19394, 55627, 33428, 35474, -468, 21224, 32963, 11981, 33152, 54788, 40151, 22692, -40, 11976, -26170, -75350, -60018, -26224, 21909, 50120, 17512, -41383, -67748, -25687, 8287, 45469, 28181, -1417, -20093, -40912, -60472, -19197, -5791, 32364, 30436, 20986, -18578, -63599, -42573, -10688, -9073, 40202, 44800, 24817, 25542, 44536, -1661, 12753, 39647, 10483, 12374, 29288, 41922, 27970, -5038, -1904, -10040, -16549, -2924, -20264, 18041, 19323, 14330, -10293, -48579, -31880, -34955, -7350, 13293, 12902, 45373, 77208, 76418]
13870G6418j3570k9149n4186J4333N1466r095l0476j5256Q57J1435L5066K220
13858D0063l7842j7325J0433j534L3979J6399J7437k6687n0416L1560L335j6020
13846C382L3035K2627J2249p0148j9533K537K1560R111n1120k5430L0742L8231
13834G243L1561J7537K8823p630q993K5722k298j9731l0596m380j4771j8843l0928
13821b7284L4362J6052k3109j1305l6339O972k46J1215q287J0380L4615j5290
13809h264n2686l0889N5696L0667P60n12J1303J4211l603k4620l1601N3199J2035
13796B5696p033K7261m309q848j5472p289M81J0890L6009k225l6304j4502p487
13783c132J572J3422J9246O719l018J1783K477J62l7054k5706l227j3880m3674
$$ y = [76418, 62848, 33699, -20487, -6154, 45312, 36217, 5741, -9515, -8658, 2777, 37843, 40063, 2221, -15104, -4671, -6205, 27774, 44173, 61610, 34923, -15493, 16067, 19402, 3382, 36417, 59044, 71293, 1145, -18388, -15851, 5709, 14820, -36300, -61730, -30988, 7243, 38804, 56341, 85164, 77534, 68541, 94263, 91965, 72234, 41638, 37258, 22487, 3644, -27284, 7078, 23130, 21, -11284, -47623, -40651, -40897, -29682, -37969, -27589, 7026, -8264, -60950, -91839, -36143, -5476, -4716, -5228, 6075, 20286, 16683, -7937, -39538, 13661, 25696, 18663, 45924, 41615, 32767, 17295, 10006, 10487, 21377, 57386, 55161, 18857, 4355, -3132, -1560, 11862, 31108, 37827, 34809, 46592, 49069, 49231, 12177, -13529, -16756, -30636, -74310]
13770g4310L9324J9004J3619L7583k6019l5693j0752l8934K3651K5467J8294r641
13758a8407O145L3032j9005N986l631k0410l335O6885J1234l1394l7353m9346
13746e9599L5096M6946J867l2126l1176l3821N801M0993k2766o363j7072K9942
13734d2278L8024M777J121J7614k1091j28K4285k346m661J088k7339K5633L8402
13721E3101J434j5227j3080j5795j1094j2462r731K4961K1661K2607J884l5085
13709A3174k3161L553k5311Q420k06Q688j7581j785N26M1043P203J8888p09p080
13695B5662k0412n4922K0703R768j1298J7019L1419k9845R907R506K342l4205
13683b4356k7186M609Q351J6665K3232J3221k966j8535M1770J3586j759j0838
$$ y = [-74310, -34986, -15982, -2363, 35220, 9201, -26492, -37244, -76178, -52527, -27060, -8766, -18407, -12262, 20770, 1765, 7751, 4120, -16290, -19625, 47260, 58494, 27100, -10253, -59599, -24503, 22443, 24310, -7816, -38992, -72813, -67012, -26019, -48785, -55148, -72220, -42278, -4254, 523, 1644, 19258, -1833, -1961, 22324, 19978, 15317, 16405, -10934, 14699, 53101, 54535, 39308, 26228, 10433, -661, -13123, -22854, 2107, 23768, 46375, 48259, 13174, -9987, -6434, -31745, -23325, -23531, -14843, -32424, -34209, -33683, 7360, 14563, 33451, 32742, 25662, 5250, -49672, -28969, -19201, -30499, -13480, 17939, -11906, -1999, 7507, 9849, -24356, -51542, -46933, -38582, -21917, 1315, 14536, 11570, -6965, 34805, 48391, 46632, 35794]
13671C5794L952n581L4888J3002j4715J2390j2585k3358p614m0492o3219l8745
13659a06283N203M1504O9467L4004k0849k8740n992j084R350N291K951J4329N978
13646B5129P57j0465m8862k2983N2602L77K4419m8885k8862R883L5486M2054L91
13633C1041j2465N037K6120p89J2760r481k1267n521j3757j4479J6345j2423K5318
13620B6439J4845j8845k2847K9648N0573q969l8381k7311L0277J1356j8172k2948
13608E665l0555J0510O4879j920k3856m3664l6151k06J5917k1383j63J688J8975
13595d0264n965P579m3540r091L2398M6614L9889N835J2404R064l241l3169j4740
13582C773J7500N1881K2257p1705m4387K5424L5055Q161l0440j3800j3819K9453
$$ y = [35794, 39746, 34165, 69053, 82055, 67340, 79730, 67145, 43787, 36173, -4319, -67538, -106283, -101080, -59576, 9891, 43895, 23046, -5694, -11686, -12770, -3420, 1871, 4822, 19151, 25129, 25886, 15421, -33441, -56424, -3822, -3445, 20974, -27911, -56773, -46890, -11404, 30650, 31041, 18576, 23613, 49733, 48944, 61704, 52223, 30956, 25435, 11678, -2801, 13544, 1121, 26439, 41284, 22439, -408, 29240, 79813, 70844, 32463, 5152, 35429, 46785, 28613, 5665, -24890, -14380, 50499, 48579, 24723, -18941, -55092, -55298, -39381, -60764, -60927, -59239, -40264, -46229, -38650, -82190, -91281, -58883, -12269, 27620, 33455, 45859, 54923, 51682, 18513, 3773, 21273, 73154, 95411, 23706, -20681, 4743, 39798, 47959, 17519, 3719, -10100, 19353]
13570A9353o189j0143k4775j9653J1544Q898j2035J2722K7356p597k5752j5528
13558d1799K6897q72l313J2267M1122j0636p1805k4598o628p372K1600L2288L2300
13545e49J5549M4238j0286m9721j183k8668N229K1961L4065q649R527P70m8299
13532a6016l3700J6011J6599J4166L2646j585m3778k8135k3444K4230M3120J9195
13520A9309n914j904K6159j2172p810j4079k1253K8401q902l9107J9999K7755
13508A0482m493J5075j63N534j8414J4843J9575J2963J563m4141M685L5733j3139
13495D0103l429j7252j0142j996j1834K8583J0413l5121K766K087j2096L055n338
13482a0201j1874K769j5602J7633N3507L1611l8887j8607K0801M299J3050J883
$$ y = [19353, 13164, 3021, -21754, -41407, -29863, -20965, -33000, -20278, 7078, -519, -26271, -41799, -14902, -15774, -19087, -6820, 34302, 23666, -48139, -72737, -79365, -86737, -65137, -32849, -549, 15000, 59238, 48952, -769, -1952, -30620, -25391, -3430, 30635, 21986, 31513, 32283, -16016, -49716, -33705, -17106, -2940, 29706, 28121, -15657, -43792, -67236, -43006, 114, 19309, 13395, 11491, 37650, 25478, 17668, 3589, -17664, 10737, 1835, -37272, -17273, 10482, 5989, 21064, 20901, 26435, 8021, 22864, 42439, 55402, 56965, 12824, 17509, 53242, 40103, 36674, 19422, 9280, 7284, -4550, 24033, 34446, -675, 2091, 4178, -7918, -4863, -10201, -22075, -19306, -34908, -17275, 36232, 67843, 28956, 10349, 31150, 35449, 48499, 50382]
13470E0382j4776n9885j4275J4758L778l47K8724J5687J3383M619K7501j2713
13458E6836m1243n4873k0128O822j030m449j0170n205M617M0151K2756m1165M716
13445d2365Q344J3361K2543L7051m6154l5889K6043j2736J4184K5162J0590j663
13433A8471l487M920k7276j0658l8508J5660K2785M175K696m413J8769k7339o433
13420c0638j6651L8720J8562l592j47m8290j7817J9038j805M631j7823j0681K0844
13407d5649L7680R190o905P552K9203k6151j0051R451j8160L1649p165j8813J5554
13394G385L398K2886K6312j2758m7335N936j6113l309l124O518l367m1768k362
13381e7701L3530N9450k4146K4221M6158O354j6411l8390k624L860J9611k5858
$$ y = [50382, 35606, -24279, -38554, -23796, -20018, -20365, 8359, 24046, 37429, 42048, 69549, 56836, 15593, -39280, -59408, -52586, -53616, -58065, -68235, -73440, -68823, -28672, -5916, -47081, -42365, -34021, -20660, 1883, 38934, -7220, -43109, -17066, -29802, -15618, 9544, 20134, 18471, 14984, 19904, -7372, -18030, -56538, -40878, -18093, -13918, -11222, -15635, 3134, -24205, -30638, -47289, -8569, 9993, 6401, 6254, -42036, -59853, -40815, -42620, -37989, -55812, -66493, -45649, -7969, 1221, -5684, 1868, 31071, 4920, -5131, 4320, -13840, 17809, 10644, -8169, 7385, 10783, 33669, 59981, 47223, -112, 5824, -10289, -13598, -16722, -10204, -13571, -55339, -57701, -24171, 35279, 11133, 35354, 81512, 87866, 71455, 33065, 30441, 34301, 53912, 28054]
13369B8054m8188J5669K7204P130J9035q586n1807j9564L5555J2135m983l6540
13357b4886k0343M0090M6889j6625k5613N750n6538k5288M7001M2299p563o660
13345a487K4722o2746q1078M2707P0342J182J8164N056M1J6058J709m5211l0410
13332d0951q083k0936L26K8163M8675k2200l0753K7711p016j7348k9405Q86M5061
13319b5870J2837J1709J4217L935j349m7002M932M6194K3295J3811l4655N116
13307B7170l306j5030j419J0907K7337p666l3700m8428J2367J1616r628k3682
13295e3462K5941k657q226J0320L6169J8061j1840j5973J8087M4386j1797k4534
13283B4475k2168K4669K3765j6267m7188k2571K5444M4166L0175k5745l1436j7352
$$ y = [28054, -20134, -4465, 22739, 29869, 48904, 40318, -11489, -31053, 4502, 16637, 11654, -24886, -45229, -5139, 41750, 25125, -488, 5262, -51276, -76564, -29563, 12736, 5173, -1487, 23235, -39511, -120589, -77882, -7540, -6358, 11806, 16862, 16903, 32961, 34670, -10541, -40951, -49034, -69970, -69644, -41481, 7194, -15006, -45759, -18048, -25064, -42412, -71817, -70931, -25870, -13033, -1324, 12893, 16828, 15479, -31523, -26591, 19603, 42898, 56709, 22054, 27170, 23864, 8834, 7415, 18322, 45659, 37993, 4293, -44135, -31768, -20152, -29780, -53462, -27521, -30178, -38404, -28084, 8085, 26146, 14306, -1667, 16420, 60806, 49009, 24475, 2307, 26976, 50741, 34474, -12714, -35285, -9841, 34325, 64500, 38755, 7319, -10033]
13271a0033L7337K9276k622J4964j9326J6794j267j6316K772l785O4454Q613o9865
13258E0996k3041j2976l2615O81L3779K0014k8267k6046J365K0222J8930J1347
13246C4389j0139J1400K5725l1568j3038j8207m236J4418M3937k3326j1394J9290
13234C7251m0600j2869K2054L9259m7472k0657K1868p682j8923k5501L0515K913
13222a9844N108L6483o439j7730J9536L7521J1433L1374n4030k0997L0744r465
13210D3694J0143L6263n17n357J9416l697k243j3941K3929L652k3661o98j4177
13197G2806o426j5891j1718j1525L5492Q946m4504l5353L1475K325j5992L2374
13185D2009j1743n6863L3450L2122J1515L5994j7017l1098j6839L0331J8806J9054
$$ y = [-10033, 27304, 56580, 53958, 68922, 49596, 66390, 65123, 48807, 51579, 47794, 112248, 120861, 50996, 27955, 14979, -17636, -16955, 16824, 36838, 8571, -17475, -16110, 4112, 23042, 34389, 24250, 35650, 61375, 29807, 16769, -1438, -5674, 8744, 52681, 29355, 17961, 37251, -3349, -16218, 5836, 45095, -2377, -23034, -1166, -8848, -27771, -53272, -22757, -19844, -14736, 21747, 15308, -2422, 17114, 54635, 66068, 97442, 43412, 22415, 53159, 43694, 53837, 90100, 89583, 84226, 103642, 99945, 97702, 83761, 107690, 111342, 87681, 86983, 72806, 66380, 50489, 38771, 27246, 62738, 71684, 27180, -8173, 23302, 25627, 9635, 42009, 30266, -26597, 6853, 38975, 50490, 86484, 69467, 38369, 21530, 51861, 70667, 89721]
13173H9721k4078l8503k4890L854K7500N085J3399L8111J9695L46o386L2782O9603
13160B06239R8348O2580P3355m189M429J7055J744n6597j01466q2409l5012J8232
13148B02309M1415L1360L8590L9637P3374J31696K66322M42290N07691L43496
13138B118180k4501k41640k85425l48020l18369k54220j76317q1173q0488m0228
13128B67799l1863l8421K2435p797p954n1219j9913p517J4868M0696j5896L9003
13116B04221N1832J6528N3797L7161O0004P8408j4197n7744q7739j40283n4279
13105A47709k3273j5630Q228m6851o8211J0562L1944K0082K2183j3139j059M7151
13093A19696j2171q624j3142J3416m1549l0167l8066j3930j7122J1994R650K6726
$$ y = [89721, 65643, 27140, 2250, 6104, 33604, 38689, 52088, 90199, 109894, 110240, 103854, 136636, 206239, 304587, 367167, 440522, 436333, 440762, 457817, 459561, 402964, 301498, 219089, 184077, 202309, 243724, 275084, 313674, 353311, 426685, 558381, 824703, 1266993, 1774684, 2118180, 2093679, 1852039, 1566614, 1218594, 900225, 646005, 469688, 388515, 308027, 267799, 235936, 197515, 219950, 212153, 204199, 152980, 133067, 125550, 140418, 181114, 165218, 204221, 256053, 272581, 326378, 363539, 423543, 501951, 487754, 430010, 342271, 201988, 147709, 124436, 108806, 117034, 70183, 1972, 12534, 44478, 64560, 86743, 73604, 72545, 119696, 107525, 98901, 85759, 99175, 57626, 27459, -10607, -24537, -41659, -29665, -20015, 6711]
13081F711K0729J1528J4515j2685o856L263q632L5951P3430R4431P2269n441k9405
13068B69808j286l02m4641n8104o041J1321K2210N317k3280k7508k3589m2265
13056H1640k7390k3015k8161j3512J8062k4972m660K3919J5157P938N1356L2675
13044A09037J2980j3758k4467n8046j0334J9862j4136j3702j3135M918J1070k2059
13032a1770L2687J5649k5327O057L4612N2453J7132m1728J9967m3016n2169l0478
13020b5931N8152O005o6417m4539O652K1517N1231L0502r859o562k547J1028J6132
13007D5364j3448J0798k7469l047R727P0012L5533J4524j8105j6612j9291l8203
12995D9783k9002L7292M6691l7977P328j0636k3315k3912L4610k1302R129r813
$$ y = [6711, 27440, 38968, 53483, 40798, 33942, 37205, 28573, 64524, 137954, 232385, 304654, 299213, 269808, 268522, 268220, 223579, 165475, 159434, 170755, 192965, 198282, 175002, 147494, 123905, 81640, 54250, 31235, 3074, -10438, 7624, -17348, -22008, 1911, 17068, 25006, 76362, 109037, 122017, 108259, 83792, 25746, 15412, 35274, 21138, 7436, -5699, -781, 10289, -11770, 20917, 36566, 11239, 17296, 51908, 104361, 121493, 79765, 99732, 56716, 4547, -25931, 32221, 38226, -28191, -72730, -66078, -44561, 6670, 37172, 27313, 20751, 18204, 29232, 45364, 31916, 42714, 15245, 12198, 21925, 91937, 127470, 141994, 123889, 107277, 87986, 49783, 20781, 58073, 104764, 66787, 74115, 63479, 40164, 16252, 50862, 29560, 38689, 28876]
12983B8876J8159L5474N0822M503P997j2783l902j4318q939l4500M716p056n3830
12970A5219j0573p961K365L7026O2245Q161p1628l6883J4071K2679L9398L6052
12958A10171N8169J5986J632q918J4671K8062k1664q4754K926K156J4952k1391
12946A11998k8593n8830R950M4440K7552Q834j9518m8762k2056k3015O15K9729
12934C2344r784J8204K2526R00n695m0585J757M1785O54q3760J9821L5286K6842
12921F0295l4572j416M7183K9019L20l6537O028l1962j8288j7317r476L3229k8414
12908a908m4131K4529Q772n3752j4807K0648J7960n2286o9653o928Q661K549j2811
12895a73157p4452q9611l2884K1551P1927Q5132Q1625O4374M8096N1742K5032
$$ y = [28876, 47035, 82509, 133331, 137834, 145831, 133048, 129146, 114828, 105889, 71389, 76105, 69049, 15219, 4646, -3315, -950, 36076, 98321, 106482, 34854, -2029, 12042, 34721, 74119, 110171, 168340, 184326, 185958, 177040, 191711, 219773, 198109, 113355, 116281, 118437, 133389, 111998, 83405, 24575, 34525, 78965, 106517, 115351, 95833, 47071, 25015, 2000, 2615, 32344, 22560, 40764, 63290, 64190, 58495, 17910, 19667, 61452, 62106, -21654, -1833, 33453, 60295, 25723, 24307, 71490, 100509, 100829, 64292, 70320, 38358, 20070, 2753, -6723, 26506, -1908, -46039, -21510, -12738, -66490, -81297, -60649, -42689, -94975, -164628, -171556, -162895, -160346, -173157, -247609, -337220, -370104, -348553, -276626, -191494, -109869, -45495, 2601, 54343, 79375]
12884G9375j0486K6401L048J9544m5884R589K8098K6821M3959p162j8447K3967
12872A78823L657P67Q541J60L817o164p420k3396J4285O9137M2956N1077j5710
12859C20530j23737j16666j02582l8839J9358P7172K5968K9309j1331k0097n290
12848E3795J1640j0317P782M1527K4518l0546l5216p633L0727N549M9525m6229
12836I5122k3436L2046K1083L765J0175P2029L8042M083L1229m495L831M833J7683
12823C05990k5759n9281j3232M782l6632l6249j4830L16J2045O4708M2191l8038
12811B06011m1503K1417r911M921k2512j5604L9532j0888j1448j1346j9353N4744
12799A84060M3294J6076J4956l6754P765K2755M9386M8772l607j4218n191N7065
$$ y = [79375, 68889, 95290, 98338, 117882, 71998, 81587, 109685, 136506, 180465, 173303, 154856, 178823, 182480, 183247, 191788, 191948, 195765, 189601, 182181, 158785, 173070, 242207, 285163, 336240, 320530, 196793, 80127, -22455, -61294, -41936, 35236, 61204, 90513, 79182, 59085, 53795, 65435, 55118, 62900, 104427, 128945, 98399, 63183, 55550, 86277, 91826, 141351, 95122, 71686, 103732, 124815, 128580, 138755, 210784, 248826, 252909, 284138, 279643, 283474, 288307, 305990, 280231, 220950, 207718, 212500, 175868, 139619, 124789, 125105, 137150, 201858, 244049, 206011, 164508, 185925, 176014, 180935, 158423, 142819, 182351, 171463, 160015, 148669, 129316, 184060, 227354, 243430, 258386, 221632, 229397, 252152, 301538, 350310, 346703, 332485, 327294, 384359]
12787C84359M9324K4673j3903Q099L15k2023J9232r750j9494N5917j2086K1748
12775D86411K5713K6114L5186Q095Q65K528O761J2671K7736q715n3435j0775P961
12762E67116L2528N1947p692j2981O4236O1551L3390O3209O9369L4879P6663j850
12750A032365o68L2752K9971P6828K5538Q0000J01870J23937J06054J17173J08351
12739A834171J59274J80951J26020J59437J31149J16571J41248J75749J78751
12730C203321K64261K91692L60699M18649M16891M96865N02090N44488O09671
12721G108627P71835R41637J249895J512365J890538K517012L157912L645555
12713B2795376M072080M568422N408723P102976J0395263J6387951K8267014N1901645
$$ y = [384359, 433683, 458356, 444453, 452552, 452867, 430844, 450076, 440326, 420832, 476749, 464663, 486411, 512124, 538238, 573424, 581519, 582384, 584912, 591673, 604344, 632080, 623365, 569930, 559155, 567116, 599644, 651591, 643899, 630918, 695154, 756705, 790095, 853304, 922673, 957552, 1034215, 1032365, 1031697, 1064449, 1094420, 1171248, 1196786, 1276786, 1378656, 1502593, 1608647, 1725820, 1834171, 1993445, 2174396, 2300416, 2459853, 2591002, 2707573, 2848821, 3024570, 3203321, 3467582, 3759274, 4119973, 4538622, 4955513, 5452378, 5954468, 6498956, 7108627, 7880462, 8822099, 10071994, 11584359, 13474897, 15991909, 19149821, 22795376, 26867456, 31435878, 36844601, 43947577, 54342840, 70730791, 98997805, 150899450]
12705A50899450Q7839386J03455474O3015782n589498n0343176n6247445n7390343
12698B35639630o0896779n3434985l6138243k1325564j2937843q739832o600685
12691C5565699n306930m252423l467892k819230k349344j913045j617388j440081
12683A2399366j300798j098691r91475q61916p54112o32993n36673m42268l95003
12674E385437l55716m36239l61417k88378l01307k57728k61233k03288j46189
12665B773942j24444j17308j59921j63891m6432r0162q5779j09122p2593j20203
12655A684087j62370j36573p1624q5152p4741p0829k4065J3996p5960o9811p5175
12644H51783k382N6477J0594l6469m8692m7813l0780n3753n9213j4922j5325J7687
$$ y = [150899450, 238738836, 342194310, 405210092, 399620594, 349277418, 293029973, 235639630, 174742851, 121307866, 85169623, 63844059, 50906216, 42166384, 35565699, 30258769, 26006346, 22538454, 19719224, 17369880, 15456835, 13839447, 12399366, 11098568, 9999877, 9008402, 8146486, 7392374, 6759381, 6222708, 5780440, 5385437, 5029721, 4593482, 4232065, 3943687, 3642380, 3384652, 3123419, 2920131, 2773942, 2649498, 2532190, 2372269, 2208378, 2161946, 2071784, 1986005, 1876883, 1804290, 1684087, 1521717, 1385144, 1313520, 1228368, 1153627, 1082798, 1058733, 1072729, 996769, 926958, 851783, 849401, 905878, 916472, 880003, 831311, 783498, 752718, 698965, 639752, 624830, 609505, 627192]
12632F27192N0253K6458n5504J9481M3918L4608J8078m5387m4046l4635q5876
12621E54540q9079o2401o7544m5686m000K5307j3556m1674J9362j3816k5627j5943
12609B19883K4491l2562j5460J550L3445J8248j7996k76L5434L5869K5108N271
12597C33005k7077J8981k2961J9333N6531j755M1384j791m500K2427k0058J0508
12585D24027k655j4819k8450m5978j2897N3232k529O417J540j6483M2444J9134
12573D22983L5382J954n5557j3837O788m9896p3781n997k1682m5645R175j2716
12561A97171k4781m7686j1618L1855L1660K8195J7701n5487J709O494K2002Q6909
12549B84124M3639m0747q0328p9588q6441n302o515k2529m9562m5200K9213J9385
$$ y = [627192, 677445, 703903, 648399, 667880, 711798, 746406, 764484, 719097, 675051, 640416, 554540, 465461, 403060, 335516, 289830, 285830, 311137, 297581, 255907, 275269, 261453, 235826, 219883, 244374, 211812, 196352, 197902, 231347, 249595, 231599, 231323, 266757, 302626, 327734, 333005, 305928, 324909, 301948, 321281, 377812, 376057, 417441, 415650, 411150, 433577, 413519, 424027, 421372, 406553, 378103, 332125, 319228, 372460, 369931, 376348, 377888, 361405, 403849, 422983, 458365, 460319, 404762, 390925, 397713, 347817, 274036, 268039, 246357, 200712, 209887, 197171, 172390, 124704, 113086, 144941, 176601, 204796, 222497, 167010, 168719, 175213, 197215, 284124, 327763, 287016, 206688, 127100, 40659, 35357, 28842, 6313, -43249, -88449, -59236, -39851]
12537c9851j576j5681J0382M4468L1446K380k9230o316O0919L8892l0984l2345
12525C2504j1012K1994M2143Q427M130o669o25j5848M6638Q0225N9195N4913Q5262
12512D01277Q539r2867o2531j2147J2582k3416k9144N732J1876L9965r822j4136
12500B35908m1129j5465m8074j8915O2797R979p7494j8307J8597J305N911j2788
12488A02325k2482L317l760j7213p115j9700J1578o106J6789J0895O91M852j2680
12475F1391o791L5550j315n3392q075J2833K1764L441K7902l2662k2688K2869
12463F0827L366M5346K2101K976k944k9992r062L167J3242j811L64Q062j7219
12450I8423j833J2064k0330m8707k1783K7512L5874L6041L9734j2418l0447j3934
$$ y = [-39851, -41427, -57108, -46726, -2258, 29188, 31568, 2338, -3978, 56941, 95833, 64849, 32504, 21492, 43486, 85629, 94056, 98186, 91517, 90892, 75044, 121682, 201907, 261102, 316015, 401277, 409816, 316949, 254418, 242271, 254853, 231437, 202293, 208025, 219901, 259866, 250044, 235908, 194779, 179314, 131240, 112325, 175122, 185101, 107607, 89300, 107897, 109202, 115113, 102325, 79843, 83160, 79400, 62187, 55072, 35372, 46950, 40844, 57633, 68528, 69219, 74071, 61391, 54600, 90150, 88835, 35443, 27368, 40201, 61965, 65406, 93308, 60646, 37958, 60827, 64193, 109539, 131640, 134616, 131672, 101680, 92618, 95785, 109027, 107216, 107580, 115642, 98423, 96590, 108654, 88324, 39617, 17834, 45346, 81220, 117261, 156995, 144577, 114130, 100196]
12438A00196j6823j393j4238j9781j7282j5593j1015l7413J3257L1752J7582K2277
12426E1526J6031j6981P456l2816J546J1079r361j6556Q568K2191m457J769K2152
12413F2147n2855k9184j7929n970j6887L5522M5218M1716j1714m2283J2826K2602
12401D3209R316j7012P950K7074R018k1753o3955R628N9133N1960M1100j068k6468
12388A28132J6761m031o6365j4454l3654m3731J7084N4106M1518m0508j590J1833
12376F5101l0136J770J4131O840J0710j3304j8430K5811j8787l524j9941k5260
12364e019L5463L8071K9288k6183l2319n0425j1423L1132J1116L783l3347o3719
12352g3582l7299M9393P3160R421o0156L709Q4874r929j0763j8651l8282N182
$$ y = [100196, 83373, 81980, 67742, 47961, 30679, 15086, 4071, -33342, -20085, 11667, 29249, 51526, 67557, 50576, 58032, 25216, 26762, 37841, 28480, 11924, 20492, 42683, 38226, 39995, 62147, 9292, -19892, -37821, -43791, -60678, -25156, 20062, 61778, 50064, 7781, 20607, 43209, 52525, 35513, 43463, 70537, 79555, 57802, -6153, 3475, 62608, 114568, 155668, 154600, 128132, 144893, 140862, 74497, 60043, 26389, -17342, -258, 53848, 95366, 54858, 53268, 65101, 34965, 36735, 50866, 57706, 68416, 55112, 36682, 62493, 43706, 40182, 20241, -5019, 30444, 68515, 97803, 71620, 39301, -11124, -22547, 8585, 19701, 23484, -9863, -73582, -110881, -61488, 11672, 21093, -39063, -35354, 49520, 39591, 28828, 10177, -28105, -22923]
12340b2923k4370K1041J3039R325J2460K3745k35l256R262j0545L5227j718q50
12327F0202K0607j3158p985M7555l2131j1289n500k7828k7776l509J3521k7708
12315a4999j2164j9532M8444O5751K1182N178L0663o7960m5564J2497Q079j1142
12303B0433Q206K0323M426k6602J9773K7496Q51k6823q063q075j1691J5782q666
12290B7370K018o544P565k5996Q573l6288m336P8967M5062l5835m2839q082J7196
12277B6831N1260P025k2611K2680K7128k3883J1351L9959N4772O6953N0772J656
12265C13893P9310K25315L51260M59763M33003K13938p7974k35676k78883l16508
12255A167441k80204k43941j35198j25647j02753k5005J0174j9397k4588l8857
$$ y = [-22923, -47293, -26252, -13213, -3888, 8572, 32317, 32082, 28826, 38088, 27543, 62770, 61052, 60202, 80809, 67651, 59666, 107221, 75090, 63801, 58301, 30473, 2697, -812, 12709, -14999, -27163, -46695, 1749, 67500, 88682, 93860, 124523, 56563, 10999, 23496, 31575, 20433, 28639, 48962, 53388, 26786, 46559, 74055, 74906, 48083, 40020, 31945, 20254, 36036, 27370, 29388, 22844, 30409, 4413, 12986, -23302, -27638, 51329, 96391, 60556, 17717, 9635, 26831, 78091, 85116, 62505, 85185, 112313, 88430, 99781, 139740, 194512, 261465, 312237, 313893, 393203, 618518, 969778, 1429541, 1862544, 2076482, 1998508, 1762832, 1483949, 1167441, 887237, 643296, 508098, 382451, 279698, 254693, 264867, 245470, 220882, 182025]
12245A82025l0093j6971m250k2438l8475o1277k0225L3631N6623R997l513k7021
12233E8013j3566m4508j9790P492J0047o570k269Q976M6512K0081M119j5673k8395
12220B4469L6339P639n208K6266J5139k8619R379l0029m2959k3018K2203p39L2302
12207D3164m203m1244l224M8624J9064k9787J7324q366k0633J2806j7443Q759
12195B4841L7892l669l4525k5590k7079J1931L2849L7202P154j7067k6021j3254
12183D664J2317K6580M0156j4403l8555j9196k9510J5480J4696l6074J9952Q219
12171D326J1979j4502k8617J4690k0160O94J0202J9067M5821l941p441j2740J4810
12158C4188P631j3440R47L304k7372J3215K0882m6367m835K845k8695k5974N9852
$$ y = [182025, 151932, 134961, 130711, 108273, 69798, 8521, -11704, 21927, 78550, 88547, 85034, 58013, 44447, -61, -19851, -12359, -2312, -8882, -11151, -2175, 44337, 64418, 68537, 52864, 24469, 60808, 68447, 63239, 89505, 104644, 76025, 85404, 55375, 12416, -10602, 11601, 10862, 43164, 38961, -2283, -5507, 43117, 62181, 32394, 49718, 41352, 20719, 33525, 16082, 24841, 62733, 59064, 24539, -1051, -28130, -16199, 16650, 53852, 61006, 43939, 17918, 4664, 16981, 43561, 83717, 69314, 30759, 11563, -17947, -2467, 12229, -23845, -3893, 4326, 16305, 1803, -26814, -12124, -32284, -31590, -21388, -2321, 43500, 39559, 32118, 19378, 34188, 41819, 28379, 29326, 32630, 5258, 18473, 39355, -7012, -11847, -9002, -37697, -63671, -3819]
12145c819J7630K4896k3471k538J2431K1043m0767m8502K8351J3218j1208O202
12133f534k8561J4870K5021Q2q911L0071L4474j3018l2814Q096k653k1453k9665
12120c0995K2909L1841J3034Q460k8352k2089o310K5909j7733j6912J2983j953
12108i208l0071k752K097J299L7592p619j5055J4324k9201N696N088M7338J1737
12095C1265l4874j0099J3212K1802k3014m5715K4898L3832k3248O931J3827l951
12083D866J862o344J7363M6911L1581o6492p6665l7433K9612J8903L3274K7245
12071B4683l5004J3562n24j543J4034j3332l332q685N802J2814L7492J6925j3170
12058D9722n0587l6690k5113L5306M4600n888k6006k0928k1645J0920J1304L3760
$$ y = [-3819, 13811, 38707, 15236, 12698, 25129, 46172, 5405, -43097, -14746, -1528, -12736, -6534, -35095, -20225, 4796, 4878, -4033, 26038, 60512, 47494, 14680, 22776, 20123, -1330, -30995, -8086, 23755, 36789, 45249, 16897, -5192, -11502, 14407, -3326, -20238, -7255, -9208, -39279, -42031, -39934, -38635, -1043, -8662, -23717, -9393, -38594, -32898, -27810, 19528, 31265, -3609, -13708, -496, 21306, -1708, -47423, -22525, 11307, -11941, -5010, 8817, 4866, 6728, 384, 17747, 64658, 96239, 29747, -46918, -84351, -54739, -35836, -2562, 24683, -10321, 3241, 2717, 1174, 15208, 1876, -1456, -10141, -4339, 8475, 45967, 62892, 49722, -865, -37555, -62668, -27362, 17238, 11350, -14656, -35584, -57229, -46309, -35005, -1245]
12046a245J5518M722q522Q046K7006L8209k1887j2425j1333m4059m2017j3454
12034f1441M2759J8937L9257J9147l8249j2821J6176K2156m9693p4408J1606K9280
12022c7294j4726J1246K983m2090p06N127K4182n233N8620O2968l0022k8470K616
12009I201K018r769R884k7502j119K9960M5048l3484m2994l3098K2064n46l777
11996c4114K1837L441R252j4905k8241o984L2865L5451J7817l1216K8334n375
11984B8162o6698n715J8823L8759K0161k0857l246J0224K3603k0936l4926M4073
11972C1427P857n2671r470N713J3341o119k6238k2886M593K0675k0667j4829K1664
11959d7610n129L2746P944K2289N861J9301K2967j3603n0432M828J7219K871j0553
$$ y = [-1245, 14273, 18995, 10473, 18519, 45525, 83734, 61847, 49422, 38089, -5970, -47987, -61441, -18682, 255, 39512, 58659, 20410, 7589, 23765, 45921, -3772, -78180, -66574, -37294, -52020, -40774, -37791, -79881, -80587, -75460, -51278, -56511, 2109, 65077, 35055, 6585, 9201, 11219, 1450, 11334, -16168, -17287, 12673, 57721, 24237, -18757, -51855, -29791, -30337, -34114, -12277, -8836, 416, -14489, -42730, -49714, -16849, 18602, 36419, 5203, 33537, 28162, -38536, -44251, -25428, 13331, 33492, 12635, 9389, 19613, 43216, 22280, -12646, 31427, 39284, -13387, -22857, -17144, -3803, -9922, -36160, -59046, -54453, -33778, -54445, -69274, -47610, -52739, -19993, -12049, 10240, 16101, 35402, 58369, 44766, -5666, -838, 16381, 19252, 8699]
11946H699k052k0006l8338N1929R4578L5230q93M1457K3867M3897L2500J9771
11934B90639j1546m3633j3934j7621p462n3356m2155k6063m3207K2K4985L3887
11922I0556m1458m6807o814J51j386M5766L1090m2060R685j5509p7755K0777O742
11909b7022k4809k7403k2624M4197N0325k1060r31L2277J1391k4607j8021J5914
11897a2373K9207j2766k727o529J6851j0322O238j0556j4082j0789q962j2540
11885d9350M1251K1232n000k3321l4081l1152J2287M516N6998K9631k556j7887
11873B568K3768J9756o1146K073J9091J5970m4764O559J4063J0920j4951j9952
11861b6045K8639J1165K0079K7791o5142l9609O522J7790K6972J3156m0130o262
$$ y = [8699, 6647, -13359, -51697, 232, 94810, 130040, 129147, 170604, 194471, 238368, 270868, 290639, 279093, 235460, 221526, 203905, 196443, 143087, 100932, 74869, 31662, 31684, 56669, 90556, 49098, 2291, -4523, -4372, -5758, 40008, 71098, 29038, 38723, 23214, -54541, -33764, -27022, -51831, -79234, -101858, -57661, -7336, -28396, -29327, 2950, 14341, -10266, -28287, -12373, 16834, 4068, 1341, -5188, 11663, 1341, 7579, -2977, -17059, -27848, -36810, -49350, -8099, 13133, 8133, -15188, -49269, -80421, -68134, -63618, -6620, 23011, 20455, 2568, 26336, 46092, -15054, -12981, 6110, 22080, -22684, -16125, -2062, 8858, -6093, -26045, 2594, 13759, 33838, 61629, -3513, -43122, -36600, -18810, 8162, 21318, -18812, -25074]
11849b5074m3942K1911m691k4445K3443J2048l317n070K0638L8935K9981l4123
11837F294n301N056k3944P299K6354l0532O911j3266l4345p870K759K6326M5694
11824A1435J5215l5693k0413P085m118Q814j2081j8714m5069R419K3660J8202
11812d2258L8322M4475k7102k219K1593k0169j7582k0661J588O740J1902J1381
11800F010Q315J0174j2480K57j7006Q276J0956j902l3974l9017n669J2966N772
11787d7322j0940O168j6541j1922L921L5553Q825l0763k1209j2878M3825O0920
11775G637k0648K5243l991K095J8352j8061j3490k4521r569L2591L0840r176r59
11762A6343l1606J5995L7590k110j4866J3611L5100j1559J6961j6628k1345O126
$$ y = [-25074, -69016, -47105, -51796, -76241, -52798, -40750, -44067, -49137, -28499, 10436, 40417, 6294, 993, 6049, -17895, -10596, 15758, -14774, -7863, -21129, -55474, -63344, -60585, -34259, 11435, 26650, -9043, -29456, -22371, -26489, -17675, -29756, -48470, -93539, -84120, -60460, -42258, -3936, 40539, 13437, 11218, 32811, 12642, -4940, -25601, -24013, -17273, -5371, 6010, 14325, 24499, 12019, 12276, -4730, 3546, 14502, 12600, -21374, -60391, -66060, -53094, -47322, -58262, -52094, -68635, -80557, -76636, -41083, -32258, -63021, -84230, -97108, -53283, 7637, -13011, 12232, 8241, 10336, 28688, 10627, -2863, -27384, -36953, -4362, 26478, 17302, 16343, -15263, 732, 38322, 36212, 21346, 34957, 70057, 58498, 75459, 58831, 37486, 43612]
11750D3612l7894k0077l0058j4888J4296J8826j8143M2556Q21m540K5235N2836
11738G2582j5606l5958j3232K8579K7759m1401l6171M687p309o611l1084j4677
11726f8442M9413K0410K1735L776k2486j5255L5125l822l0271l678J2165R120
11714G790L9968O0213L4694m4220q1322l1226j8659L1156J3290J7946J3010N294
11702D7934J442N049l5966l0395Q277K1535K3793p925k2447j0569j8823m4418
11690f2513N021J9033n2505L846L2872M3141N2828J5465J1956j2945l6655R949
11678B9493k108l4285m4673Q736K7519K7694j9869o0389k3138j5714j2696N9131
11666f0299L1601j9584K1559J6700j8632k554K2694k9114l1199j7260K2516k3818
$$ y = [43612, 5718, -14359, -44417, -59305, -45009, -26183, -44326, -1770, -949, -5489, 19746, 72582, 56976, 21018, 7786, 36365, 64124, 22723, -13448, -8761, -16070, -22681, -53765, -68442, -19029, 1381, 23116, 26892, 4406, -10849, 24276, 20454, -9817, -13495, -1330, 7790, 47758, 107971, 142665, 98445, 17123, -14103, -32762, -1606, 11684, 29630, 42640, 47934, 49376, 54425, 18459, -11936, -3659, 17876, 41669, 33744, 11297, 728, -18095, -62513, -57492, -38459, -90964, -87118, -54246, -11105, 41723, 57188, 69144, 56199, 19544, 29493, 27385, -6900, -51573, -42837, -15318, 12376, -7493, -67882, -91020, -106734, -119430, -60299, -28698, -48282, -26723, -10023, -28655, -31209, -8515, -37629, -68828, -86088, -63572, -87390]
11654h7390j652R875j5625J2630rP206M2102k5344J0925l8270m016J3357J1185
11641f5026J3984R681Q228j0011k186L6207K8419j0499J4386l153j7378l8290
11629c5638M106j1258L0587L5637L2668M5098j8887j6519M678o3691l0340R523
11617a4036O27J7788J0141L74p013j4603m6861j2108J1525N6667K0588j4693K7571
11604C5967l0746n2903K552M6339J3909R694l0787j773L739j801J8796j7735k2329
11591b7078R54j8407L0243K5457j894j9081J0511J8960p141k1817K0020J1802
11579B2529j8786r989k795l5288N770Q868j6904K2134P667O649L3015M1086j0932
11566E3024l7903J5747k1893l3989q06j0621J0830K5636K992n738n704p862r67
$$ y = [-87390, -89042, -79167, -94792, -82162, -82171, -74965, -32863, -58207, -47282, -85552, -89568, -76211, -65026, -51042, -41361, -33133, -43144, -45330, -9123, 19296, 8797, 23183, 20030, 2652, -35638, -31532, -42790, -12203, 23434, 56102, 101200, 82313, 65794, 70472, 6781, -23559, -14036, -13409, 4379, 14520, 14894, 7881, -6722, -53583, -65691, -54166, 2501, 23089, 8396, 35967, 5221, -47682, -45130, 1209, 15118, 24812, -5975, -7748, -4009, -5810, 12986, -4749, -27078, -26124, -44531, -14288, 11169, 9275, -9806, 705, 19665, 12524, -9293, 10727, 22529, 3743, -6246, -9041, -44329, -38559, -29691, -46595, -24461, -16794, -10145, 22870, 63956, 53024, 15121, 30868, 8975, -25014, -25820, -36441, -25611, 25, 3017, -2721, -8425, -16287, -17254]
11553a7254J8086O674M0181K351j3772j149l544n7703l0098O560P177j2495J0062
11540d4924l8206J8184J9719L4019L3631l484m7017l3901K3595L0166j3173n440
11528b6831K0062J0883M539k6612J7969K1643o307j2054p550J4146k067j1921
11516d100k900K2170J9965K067j5975p99J967n12j3566K0115l137j238q849j8666
11502c458o252l1710J8174j5760l7214K3610K3018J5494j2021L0387Q593p43N629
11489A7747k6622m2326j371J7934R483j0095l9255L696L3883J9614j8678l1468
11477f7458p621K5182J9509m789n015j1669Q599J2226L7860M399k3513j9292Q836
11464b2746m530K6472J8986j5343K4674J5835l2342m5916J9746m7985K807J9078
$$ y = [-17254, 832, 7506, 47687, 50038, 36266, 35117, 31573, -26130, -56228, -49668, -42491, -54986, -44924, -83130, -64946, -45227, -11208, 22423, 18939, -28078, -61979, -38384, -8218, -21391, -26831, -6769, 4114, 8653, -17959, 10, 21653, 15346, 3292, -4258, 9888, 7821, -4100, -7000, 15170, 35135, 37202, 21227, 20428, 22395, 21883, 8317, 28432, 25295, 24057, 15208, -3458, -9710, -41420, -23246, -39006, -76220, -52610, -29592, -14098, -26119, 4268, 12861, 12118, 17747, -8875, -51201, -52572, -34638, -25155, -35250, -74505, -70809, -36926, -17312, -35990, -67458, -75079, -49897, -30388, -35177, -40192, -51861, -43262, -31036, 6824, 11223, -12290, -31582, -22746, -27276, -804, 18182, 2839, 27513, 43348, 11006, -34910, -15164, -63149, -60342, -41264]
11452d1264K0465N859L7220j4118l3010J6424J8909K7173P931m3799L187O238
11440A1215Q172J2796j9720L763K2432j9624j3861j95J9146J3876n565k4214l3974
11427b5753k56P086r566j6743Q059L627L1677L4950Q715k1895j8243Q363J2325
11414B2346k7955n2115j2825M089J9561l3486Q93p234K9378O2479o763K238m20
11401A86j793L36k1694j5739J9147o276p082K43M107J4751M4589m991l5966o790
11387a6972L8073L9679J481l0885Q776J9169k2503k1912m5095L9469L4906k765
11375D1421r09k7285j7231k3596J6063L9987J919k1257j2708j9475j4827K6198
11363a1700k815K043j9059O838J1783L9264J2118K495M099k0237l3830k4227k957
$$ y = [-41264, -20799, -14940, 22280, 8162, -24848, -8424, 10485, 37658, 45589, 1790, 4977, 11215, 19387, 32183, 12463, 16226, 38658, 19034, 5173, 4978, 24124, 38000, 32435, 8221, -25753, -26009, -18923, -28489, -45232, -37173, -33546, -1869, 33081, 41796, 19901, 1658, 10021, 22346, -5609, -57724, -70549, -66460, -46899, -80385, -79492, -86726, -57348, 5131, -1632, 606, 186, -1607, -1271, -22965, -38704, -19557, -25833, -32915, -32672, -28565, -13814, 30775, 25784, -10182, -16972, 21101, 60780, 62261, 31376, 40152, 59321, 36818, 14906, -30189, 9280, 44186, 41421, 40512, 13227, -4004, -27600, -11537, 28450, 30369, 9112, -3596, -23071, -37898, -11700, -14515, -12472, -31531, -24693, -12910, 26354, 38472, 40967, 45066, 24829, -9001, -33228, -36185]
11350c6185K0486j097N802N5743K2620l6082q689K7532Q980k7816K150o002l617
11337B3825l1444N402K1444J0922M00k9582J086k2646J8568l538J5565J4296k6414
11324b116R362J8870m2151n0637K9496J3378l6802l004M8518K2053j7906O043
11312d896J3702o651L022K607j8871k6920L7522J1196l1502K2773O014J1733J4975
11299C4704K116l8327l4157j7295R290L1618N1069K6011j9737k4268N1j2983m550
11286C542o760M041L382L71P185q393p68j7234J5244k3145p380J1750J8587l039
11272b617k8978j6194l6376L9364N7757M6635J1269r885j2202P316K4844J4852
11260I5785k7273m0606j3582O784j9459k8432j9445K8463l8804l2642K3737J6611
$$ y = [-36185, -15699, -16796, -10994, 44749, 67369, 31287, 22598, 50130, 59110, 31294, 33444, 27442, 23825, -7619, -2217, 19227, 30149, 30549, 967, 2053, -20593, -2025, -5563, 10002, 24298, -2116, 7246, 26116, -16035, -66672, -37176, -23798, -60600, -63604, -15086, 6967, -10939, -4896, 8806, 2155, 5177, 7784, -11087, -38007, -485, 10711, -20791, 1982, 7996, 19729, 34704, 36820, -1507, -35664, -52959, -43669, -12051, 39018, 65029, 45292, 21024, 21075, 8092, 3542, -3218, 823, 4205, 4576, 11761, 3368, 2600, -14634, 610, -22535, -29915, -18165, 422, -2617, -31595, -47789, -84165, -44801, 12956, 59591, 70860, 60975, 48773, 56089, 80933, 95785, 68512, 27906, 14324, 21108, 1649, -26783, -46228, -17765, -56569, -89211, -65474, -48863]
11248d8863J6786O230L3569Q825m1105k9397M5834O1270O376m897N147j2288l0935
11235A6552m8454n350n260J5504r262P239M4859K7754l7661j7696J1654j2806
11223a2927K025K4518k8562k6802P649L439K1038K2502n8733M02J2241n3454k114
11210h8778N0155K2337j9634k6372l314j3240N95N1950j4477k0059O3662m641
11198a816l5833k5749R525K9623L2873k701k9623k6516k997M8604N5248j985m8578
11185G5k9977j3937J9427J2308J9230J4256L45j6782r097j187r010o1891j878
11172g8118J5943K6214L0346P26k2065j9170K251m0837j6060N0405M0439K1093
11160A1167j1029j9551j928o387k0119q674M7038K8182k574K3750k084q545j4206
$$ y = [-48863, -32077, -25847, 7722, 16547, -24558, -53955, -8121, 53149, 59525, 54628, 59775, 47487, 16552, -31902, -37252, -42512, -27008, -36270, -29031, 15828, 43582, 5921, -11775, -121, -12927, -10902, 13616, -14946, -41748, -34099, -30660, -9622, 12880, -45853, -45451, -33210, -86664, -88778, -38623, -16286, -35920, -62292, -65606, -78846, -78251, -26301, -40778, -60837, 2825, -1816, -37649, -63398, -53873, -24250, 8623, 5922, -23701, -50217, -53214, -4610, 50638, 48653, 75, -29902, -43839, -24412, -12104, 7126, 21382, 21727, 4945, -4152, -5339, -14349, -76240, -78118, -62175, -35961, -5615, -4889, -26954, -46124, -43873, -84710, -100770, -50365, -9926, 11167, 138, -19413, -21341, -27728, -47847, -56521, -9483, 18699, 16125, 39875, 37791, 29246, 15040]
11147A5040l7861N7011M2811l0955n6542n606J776L2162j7848m2864Q860N3031
11135A9015J1341k3449l735l141L2862N2137L381k3289l4097K1129K9211j0603
11123G0762k7265M917j3468q0092k3377j5791K8341J8393J9920N873r980L6685
11111A4918K3542m094R065j8137J6254R557k431n4173M973K1526L1474K0782j1469
11098F1787j8268k7285J8555N527J2717j4796P90k5684j1409k1639k3248M902
11086c8051K0553K089R718j1110K0719M4496K2382k6228l1218K9071L657K735
11074D8813k5540m7042J7898M3264j6851j2314j4805p620L4574j6701k6517l5322
11062e8163N919m3961L6352k280j6767j4039N7039J2278J6523J8779l8291J6535
$$ y = [15040, -22821, 34190, 77001, 46046, -10496, -16102, -14326, 17836, -12, -42876, -34016, 19015, 30356, 6907, 3172, 31, 32893, 85030, 88411, 65122, 31025, 52154, 81365, 70762, 43497, 48414, 34946, -45146, -68523, -84314, -55973, -37580, -17660, -11787, -21767, 14918, 38460, 34366, 43431, 25294, 41548, 51105, 48674, -5499, -526, 21000, 52474, 73256, 61787, 43519, 16234, 34789, 40316, 53033, 38237, 39027, 13343, 1934, -19705, -42953, -38051, -17498, -15409, -5691, -16801, 3918, 48414, 70796, 44568, 13350, 42421, 46078, 48813, 23273, -23769, -5871, 37393, 20542, 8228, -6577, -14197, 20377, 3676, -22841, -58163, -52244, -96205, -59853, -62133, -78900, -92939, -35900, -23622, -7099, 11680, -26611, -10076]
11050a0076O009J2150M2882J1231l935M5689K8671o6588m9110L9893K6360l4852
11038D8324k7459p321L770M3187l47P570l4390m3226K2901r168J5275j1505J9939
11025B7550j2570j3415j665p626l5905K3430o375p350M6057J0450k642J8948k3589
11012A5298j4512o0552p793K9455K0966L0043J9321Q020l040k099R357k2831k1437
10999A96o566r01M4655J405n1127k8721L866J1785J5385K2831K381j8446l3454
10986c6711r018J6367j6299O886J9695j599j7099l3396L7221M2405J3453k8317
10974f412j5180M8828N8587k4501j9364k874l3442l3919R598J7888P720K1781
10962B8710m7883n9987N2042P4324K8785j6322m2750q2936k7251M7083J0954L2844
$$ y = [-10076, -4067, 8083, 50965, 62196, 58261, 103950, 132621, 66033, 16923, 56816, 83176, 48324, 20865, 13544, 17314, 60501, 60154, 67724, 33334, -9892, 13009, 3841, 19116, 7611, 27550, 14980, 1565, -100, -7726, -43631, -20201, -26576, -33926, 12131, 22581, 19939, 38887, 15298, 786, -59766, -67559, -38104, -17138, 12905, 32226, 40246, 37206, 35107, 44464, 21633, 196, -6370, -7271, 37384, 38789, -12338, -41059, -37193, -25408, -10023, 12808, 15189, -3257, -36711, -45729, -29362, -45661, -38775, -19080, -20679, -37778, -71174, -33953, 8452, 21905, -6412, -21592, 27236, 85823, 61322, 41958, 39084, 5642, -28277, -18679, -791, 6929, 28710, -19173, -79160, -27118, 47206, 75991, 59669, 16919, -66017, -93268, -46185, -35231, -2387]
10950b387j7349N937m2428J5520Q742k9616J3611O0555j0118L9838K9572j6121
10938E5756m1219j992K4453J8016r759k1771J0413m425l487j7746r571m1968k3235
10925f6535q76J8245j1245r562Q961j8480j5244J6399L4882r992l502N8079J1546
10912A2676j2751K04k187J6828M41k1966J3331m4169m7623L2525M3107r225N006
10899a3803J1311L58J4733m737L756j4393K3324J2419l4025k6935L5420J9781
10887B7209K5283J4757p40K965j9849k7990J2930K414J1414k9853k2691j8371
10875b2522p142J4765N404M4007L050p757p366J6585m883o0529k1843L0690P8613
10862F1072J3111j8790q376J1391j6489k3733o4420k4287N4447J2323k4021j5542
$$ y = [-2387, -19736, -13799, -56227, -40707, -31965, -61581, -47970, 12585, 2467, 42305, 71877, 55756, 14537, 12545, 36998, 55014, 45255, 23484, 33897, 29472, 25985, 8239, -1332, -43300, -66535, -67411, -49166, -60411, -69973, -61012, -79492, -94736, -78337, -43455, -53447, -56949, 1130, 12676, -75, 129, -2058, 14770, 15211, -6755, 6576, -37593, -85216, -52691, -9584, -18809, -13803, -2492, -2134, 12599, 7862, 11618, -2775, 20549, 32968, -1057, -27992, 7428, 27209, 52492, 67249, 66509, 69474, 49625, 21635, 34565, 36979, 48393, 18540, -4151, -22522, -29664, -14899, -9495, 34512, 37562, 29805, 22439, 39024, 34141, -26388, -48231, -17541, 61072, 74183, 55393, 47017, 58408, 41919, 18186, -46234, -70521, -16074, -3751, -27772, -43314]
10850d3314L7814R359k3476K9356L847m5493L2391P1069j3138J3817k989k3490
10838D5753l2492l8008l8088k271r696L2847M6588k4102L833j5070J6445L5916
10826B1655k3909k0915J5736j6576k840l2538j7476L6703J8694j4166J2159L0287
10814F814N430n8063l007L5147M461j4230N04M234j2920R09K2359R475J4413l773
10800A1753r679R244j4533J6928j749k8136j3046j7852J695J8883O730K8279j559
10787F958k5764L7949N3598L041l230j0226j0871k5360j3713J2756k5647k2972
10775b3481k4837k5541r109K3220M4378J4268m8605j7773j8573L6100P3625L467
10763B7139J7600n573R54l4271k1197j1049k6323J2660L8828m778N07k4509j6183
$$ y = [-43314, -5500, 3859, -19617, 9739, 13586, -31907, 484, 71553, 58415, 72232, 69243, 45753, 13261, -24747, -62835, -65106, -74802, -41955, 4633, -19469, -15636, -30706, -14261, 21655, -2254, -23169, -7433, -24009, -26849, -59387, -76863, -40160, -21466, -35632, -23473, 6814, 12244, -45819, -48826, -13679, -9218, -23448, -22944, -18710, -31630, -30721, -8362, 1113, 15526, 11753, 2074, 11318, -3215, 13713, 11964, -16172, -29218, -47070, -45375, -26492, -19762, 8517, 6958, -18806, 19143, 72741, 75782, 72552, 62326, 51455, 26095, 12382, 25138, -509, -23481, -48318, -73859, -82968, -59748, -15370, -1102, -49707, -67480, -86053, -49953, 23672, 27139, 44739, 39166, 40120, 5849, -15348, -26397, -52720, -40060, -1232, -6010, -5503, -30012, -46195]
10750d6195K0415K6366l2501p997M0697L6255J7155r401j0j8949l647K2631j6666
10737B8153n8253J3261K8964j8950K7885q448j8604m0734k50R810r909J4447q555
10724d1183j8699M49K9793M9009l6579n6734k3758K2974P3025J1148j4150M763
10712E8k936J7367J5159l1843j2377l482M859j8923p568L8067L7135M4522j5837
10699F4201l3772k4736K8073K8209q535m3434j7510m4913j2332k927Q326L8497
10687b0853K8333j0735J8467K3985n1252m3651K5745K4773k680l5528J9617K3269
10675e10J0598O0250J1366J734k7057l5851n2843k2808L8801K6273j9898l3034
10663d2979k7805J724K738m618L6783M4458l5689o574j8537N2133P3964J7657
$$ y = [-46195, -25780, 586, -31915, -39912, 785, 37040, 54195, 44794, 44784, 25835, 22188, 44819, 28153, -30100, -16839, 12125, -6825, 21060, 12612, -5992, -46726, -46976, -37166, -47075, -32628, -41183, -59882, -59433, -29640, 19369, -17210, -73944, -97702, -74728, -1703, 9445, -4705, 58, -2878, 14489, 29648, -2195, -14572, -18054, -13195, -32118, -39686, -1619, 35516, 80038, 64201, 30429, 5693, 33766, 61975, 53440, 10006, -7504, -52417, -64749, -67676, -59350, -20853, 7480, -3255, 15212, 39197, -12055, -55706, -29961, -5188, -7868, -43396, -23779, -510, 10088, 70338, 81704, 83438, 56381, 20530, -32313, -55121, -16320, 9953, -9945, -42979, -70784, -69060, -66322, -70940, -34157, 10301, -25388, -31962, -50499, 1634, 75598, 93255]
10651I3255l0605j7665o051J3968j8928k6166k7295n9182l8465Q0774L1472L706
10639a182O723M3640m1636l1584n644N4326J1607J1668j0954O020j6449l1980
10627e445J8668J0628m3352p993n182K6382J827k4176P208n467j0795k1227J1152
10614d7772O2783M1740J9439o6587p194l159j7481O449O449P2210o823n6836j5687
10601a2469k3266k5483J45j18M8757L9815k5692m4111j1188j8382K5647k0033
10589f6378k2834k8705j3265L5409O0944p963j7434j438L7794K854K2408L1578
10577C2970l0152m7197L281J8418q578k130J4225k7022j8856L6371J1881j5252
10565c2041L4383Q057J6469j4995K420M2532n807l9862k5079k6052K2786k0294
$$ y = [93255, 62650, 44985, 38934, 52902, 33974, 7808, -19487, -78669, -117134, -36360, -4888, -1182, 5541, 49181, 7545, -24039, -29683, 24643, 36250, 47918, 36964, 42984, 26535, -5445, 13223, 23851, -19501, -27494, -32676, -6294, -4467, -28643, -21435, -26902, -37697, -58924, -47772, 15011, 56751, 76190, 9603, 2409, -750, -18231, -11782, -5333, 66877, 60054, 3218, -12469, -35735, -61218, -61073, -61191, -12434, 27381, 1689, -42422, -53610, -71992, -46345, -66378, -89212, -117917, -131182, -95773, -34829, -42792, -60226, -61664, -23870, -21016, 1392, 32970, 2818, -44379, -41098, -22680, -31258, -33388, -19163, -46185, -65041, -28670, -16789, -32041, 2342, 10399, 26868, 11873, 14293, 56825, 51018, 11156, -13923, -39975, -17189, -37483]
10553c7483J4981K6507J2211L5052j0216L619K0685j9030R556r75l1018J1594
10541C5483J9748m0365o1242K0506M2258J5006l3562K6925K7260k3834K5846j3144
10529D0885k2301k2099n723j0198J7232l341l1359J050L9284J0123N019j6698
10517A874N978O192m208J1487k4175K3823K1702N3p6152n0467M4189k092J8130
10504b3666J9471k1199J3334J7500l4571j667K3369m145m3764l563L4184p987
10492c2704K5904n0363M770P3288j1157k2243m549j0514j7275K3770J3311M1668
10480C3906N7518l2684l0559j4665k2425k4435O632O9150P336L1883M146l3419
10468E2384l0976k3492k0478m2278j360P616j9289p33J8065n896L970L9642K3402
$$ y = [-37483, -22502, 4005, 16216, 51268, 41052, 44671, 65356, 46326, 55882, 54907, 23889, 35483, 55231, 14866, -46376, -25870, 16388, 31394, -2168, 24757, 52017, 28183, 54029, 40885, 18584, -3515, -9238, -19436, -2204, -5545, -36904, -35854, 3430, 13553, 18572, 1874, 7852, 14044, 9836, 21323, -2852, 20971, 42673, 42726, -33426, -83893, -39704, -41796, -23666, -4195, -25394, -12060, 5440, -29131, -30798, -7429, -11574, -55338, -58901, -24717, -32704, -6800, -57163, -52393, 20895, 9738, -12505, -17054, -27568, -44843, -21073, -7762, 33906, 91424, 58740, 28181, 13516, -8909, -33344, -26712, 42438, 49774, 81657, 85803, 52384, 21408, -2084, -22562, -64840, -66200, -58584, -77873, -78606, -60541, -66437, -62467, -22825, 577]
10455E77K4370j5339k3627o3891j3888L9992L5048L5478j9018k0999K538N283
10443a3476J1884J1709o015l31l2364N140j327J3182K9941J5951l7587j4476p170
10430b4939O343k0293l8051L8696O0590q281m419m625J7239K149k4300r589m551
10417a4031M1100j365k2227m136k0458k1083o315K7966L1005k4397J2398K046
10405E03J3654J0478p781k3022j6442j2472R763L1969q979k7953J1053M155L0522
10392A5448J6685J0264L4690q659j1139l5600L082R202j1399l3400N957k6753
10380c1622o510M8275K7982K0695k7164m0229m7279k387J4689R450j6529k4467
10368g5096K2918P82l522M5901K3645M646K1578j8475j0274k6399m8812n692M1937
$$ y = [577, 24947, 9608, -14019, -77910, -91798, -51806, -16758, 18720, -298, -21297, -18759, -13476, -1592, 10117, 4102, 3771, -28593, -23453, -24780, -11598, 18343, 34294, -3293, -17769, -24939, -18596, -38889, -76940, -38244, 22346, 14065, 9646, 5021, 22260, 24409, 109, -9480, -14031, 27069, 25704, 3477, -659, -21117, -42200, -48515, -20549, 10456, -13941, -1543, 503, 14157, 24635, 16854, -6168, -22610, -35082, -25319, 6650, -2329, -30282, -19229, -15074, 15448, 32133, 42397, 77087, 68428, 57289, 21689, 24771, 33973, 22574, -10826, -4869, -31622, -38132, 10143, 38125, 58820, 31656, -8573, -55852, -58239, -43550, -34100, -50629, -75096, -52178, -51396, -54918, -9017, 14628, 19274, 40852, 22377, 12103, -14296, -63108, -68800, -26863]
10355b6863Q875J1598K4051j0032l4206J9093L4914p9202k8185N262M2109M4517
10343A1931l0585k5384p555OL5856L987m6382l318J0562L4397K1337k1316M875
10330a1589N820q750R843j1477l6638N62M7130N834j8775j028K786J5322j9282
10317b0242l3085p772N0630K0858m0972l880K5918K8429J3721J648k0414L086
10305A7925M364k7850L6661M66P15J1385n6347l170r497K6632K926L454j2483
10292d819J038J5239R817l572k2952J8221n109M841j328K4262j6907k0391K9659
10279B7999j3597o1727j5396N198L6234L1102j4763p659L662Q510l7886j4518
10267e2841L0768j4451k733L588O0094J7459Q651j4311j3452l1127j0908J3847
$$ y = [-26863, -17988, -6390, 17661, 7629, -26577, -7484, 27430, -51772, -79957, -74695, -32586, 11931, -18654, -44038, -51593, -51587, -15731, -11744, -58126, -61444, -50882, -16485, 4852, -16464, -11589, -5769, -14519, -4676, -16153, -52791, -52229, -5099, 735, -18040, -19068, -16282, -960, -20242, -53327, -61099, -10469, 10389, -30583, -34463, -8545, 19884, 33605, 35253, 14839, 17925, 22289, -5561, 31100, 31566, 32281, 43666, -12681, -15851, -25348, 1284, 4210, 7664, -4819, -3781, 11458, 21275, 17703, -5249, 12972, 7863, 12704, 11376, 35638, 18731, -1660, 27999, 14402, -47325, -62721, -57523, -21289, 9813, -4950, -12609, -8947, -437, -38323, -52841, -22073, -36524, -39257, -35669, 24425, 41884, 50535, 36224, 22772, -8355, -19263, -5416]
10255e416k7850l933j768L9499L9090P486k7522n6129J2814J9609J5305k6740
10243a5555j7412O5877M3093r896l5460m9214k3427L7771j3158R46m4533l0949
10231i1917N0517R991L3893P896J5325K223L6848N01o0847k3422j5320k2723L5387
10218b1648K6869j8404j4539M0563J1343M886K4878k7457j4509q175j5260j8126
10206b9579L1379N324Q938L3006J0522l3949o98k1632n4122p884J3809R993k5633
10193f0526L7173J1730L7928j1710k4516k3799M1319K2407j7070r518J6301k4267
10181d548k1254j1113l774L330P198J7851L6642k1559n0072n098n205K1914J2927
10168b2761J8371k0028p8383o748K5457J943N4208L9943k424k1298R856N1676
$$ y = [-5416, -33266, -37199, -38967, 532, 39622, 47108, 19586, -36543, -23729, -4120, 11185, -15555, -32967, 32910, 76003, 66107, 30647, -18567, -41994, -4223, -17381, -16435, -60968, -91917, -41400, -31409, 2484, 10380, 25705, 27928, 64776, 65277, 4430, -18992, -34312, -57035, -21648, 5221, -13183, -27722, 12841, 24184, 29070, 53948, 26491, 11982, 3807, -11453, -29579, 1800, 7124, 16062, 49068, 59590, 25641, 24943, 3311, -50811, -58695, -44886, -34893, -60526, -23353, -11623, 26305, 14595, -9921, -33720, 7599, 30006, 12936, 3418, 19719, -4548, -25802, -36915, -40689, -37359, -30161, -12310, 24332, 2773, -47299, -52397, -57602, -35688, -22761, -4390, -24418, -102801, -109549, -84092, -82149, -27941, 12002, 9578, -11720, -1864, 49812]
10156D9812J6085J0070m5311k8689l598J8620j0124j8819L548M40L0641L65q298
10143A4742m078k4538j6796j5287m991K9160K3682m355K0087L455M925o8245r816
10130e2055j5500L9779M7562R066l839j2057p5554l4256K2140L1642L838J7034
10118b2200K7926j2070j5730K3832K4448J191K2095o670q821Q958n81o3521q782
10105b9925L5218J5328n5157k6111m147K188J1572O1109K9816o2084m892R467
10093a7618K1317j9801l5520j4336J2262j7312L0765K5120Q3326J5473m0300p749
10081C5627l8981j279Q340k0811K462M706j1703j7720p946m4468k023K4173J6204
10068e3419k876K418J8042J8097P762J8813O884R949j0999o012O498M923l4911
$$ y = [49812, 65897, 75967, 30656, 1967, -1631, 16989, 6865, -11954, -8406, -7966, 22675, 23040, 14742, 10664, -13874, -30670, -45957, -50948, -21788, 1894, -2461, 17626, 21081, 26006, -42239, -52055, -67555, -27776, 19786, 28852, 25013, 12956, -62598, -96854, -74714, -43072, -39234, -22200, 5726, -6344, -22074, 1758, 26206, 27397, 49492, 42822, 34001, 42959, 42378, -21143, -29925, 5293, 20621, -34536, -60647, -64794, -62606, -51034, 10075, 39891, -22193, -27085, -17618, 3699, -16102, -51622, -65958, -53696, -71008, -40243, -15123, 68203, 83676, 43376, 35627, -3354, -4633, 3707, -17104, -14642, -9936, -21639, -39359, -47305, -91773, -93796, -69623, -53419, -56295, -53877, -35835, -17738, -9976, 8837, 15721, 25670, 14671, 8659, 15157, 20080, -14831]
10055a4831J6590L4512l5852K6035l3037q141J1861j1786l371J2697K0036j4862
10043a49J0594j4465k8462J416k631R539R86M6654m268n1969Q802N7415J6401
10030D9863j1637j4569j7415j8955l8240k7346j7129K078J1564J3606O9427L0740
10018C1987k1548r230m619j465k6571P809K3943m4757j2355o667K7097O9173J2099
10005D4896m5714o1597k7148k4182L3484K7599L2584P106k2368l8756L9914M0713
9993F531K496J9308K3936j8479l5634P807k3407k7431J0978J3053K5481k4855
9981b0216j853k2348k4937M3377M6648m42k1320J5537J6443k4486q305K1230j0134
9968I194l3425J921K1910K5261L625l1844m1891k3853K1411J8537L7704k4427
$$ y = [-14831, 1759, 36271, 419, 26454, -6583, -14724, -2863, -14649, -18020, -5323, 14713, -149, 10445, -4020, -32482, -31066, -33697, -24158, -23172, 23482, 19214, -32755, -23953, 33462, 49863, 38226, 23657, 6242, -12713, -50953, -78299, -95428, -93350, -81786, -68180, 1247, 31987, 10439, 1209, -3410, -4875, -31446, -23637, 306, -44451, -56806, -63473, -36376, 32797, 44896, -818, -62415, -89563, -113745, -80261, -52662, -20078, -12972, -35340, -74096, -34182, 6531, 9027, 28335, 52271, 33792, -1842, 5965, -17442, -44873, -33895, -20842, 4639, -20216, -22069, -44417, -69354, -25977, 20671, 20229, -1091, 14446, 30889, 6403, -1902, 19328, 9194, -24231, -22310, -400, 24861, 28486, -3358, -45249, -69102, -47691, -29154, 8550, -15877]
9956a5877k1949K872n609Q213N7580K9896m858L31P713k6525m8821j0538o867
9943c4439j3943o8392Q504O1344N422L0022M7342k546L3719M0907j2930N171m225
9930I5956m9372j0587J6865k2462l0208J5951K2294l6696k4956J5025L6446o6
9918B8190O835k4561q669N7981Q461k1794p44k786J5840l1483l3359J772R880
9905E563m6051M25J9990Q778M0488N580m5511l730j41P459L0436L3566M374K5771
9891H6997o6599k4600K0447j2709j1134R060k1884k1797J4313L4117K6795L2895
9879F5901O726j7437l4619l880n986j9482J3764P098Q129j9330j2308o305K568
9866a5161K2835l2024M0175M2213j3934J4750L6538J9311N4631N8463M9774P4400
$$ y = [-15877, -37826, -34954, -40563, -32350, 25230, 55126, 50268, 50599, 58312, 31787, -17034, -27572, -34439, -48382, -116774, -108270, -46926, -41504, -11482, 35860, 33314, 67033, 107940, 95010, 100181, 95956, 46584, 35997, 52862, 30400, 192, 16143, 38437, 1741, -23215, -8190, 28256, 28190, 35025, 10464, 1795, 59776, 68237, 46443, 45699, 42913, 58753, 27270, -6089, -4317, 5563, -40488, -40063, -20073, -11295, 29193, 34773, -10738, -14468, -14609, -7150, 23286, 56852, 61226, 86997, 20398, -4202, 16245, 3536, -7598, 1462, -20422, -42219, -27906, 6211, 33006, 65901, 72627, 55190, 20571, 16691, 10705, -8777, 4987, 12085, 20214, 884, -11424, -17729, -15161, 7674, -24350, 15825, 58038, 44104, 58854, 95392, 114703, 169334, 227797, 277571, 351971]
9854C51971P7387J98020L41214N38156L72951k3388k49800l03471k90199k66517
9844G46324k13648j95764j55171r2231j5627j7857m8635R016N0353K3918k596
9833H8082R979K8667m5373m0849K8748J9406k2356l8221n853P5188m2034m7598
9821G786K8988O783k34N178k1771L878j2136j6724n850K4822k3235k9434J6839
9808a5110L793K0350J0469j3615o872K881M6355j6205n854j9212n075K854J7282
9795B2041J4020N227O781j0303K7312l0387j7548K6540j0883k6353J7288K6008
9783D9743j5780l9998j3867l0353q049L6290M7914k2924r2344k8985N2574L1221
9771c4558L0166M986q159k9000J3L0496P820K8760N500k969R966m0879L0134K4350
$$ y = [351971, 429358, 627378, 968592, 1506748, 1879699, 1856311, 1606511, 1303040, 1012841, 746324, 532676, 336912, 181741, 89510, 73883, 56026, 7391, 16407, 66760, 90678, 88082, 98061, 126728, 81355, 40506, 69254, 88660, 66304, 28083, 22230, 97418, 55384, 7786, 36774, 43557, 43323, 48501, 26730, 30608, 18472, 1748, -4102, 20720, -2515, -31949, -15110, -11317, 9033, 19502, 5887, -985, 1896, 48251, 32046, 26192, 6980, 1905, 4759, 22041, 36061, 41288, 48069, 37766, 65078, 34691, 17143, 43683, 32800, 6447, 23735, 49743, 33963, -6035, -19902, -50255, -58304, -22014, 25900, 2976, -89368, -118353, -65779, -34558, -4392, 594, -7565, -36565, -36552, -6056, 1764, 30524, 36024, 33055, 43021, 2142, 32276, 56626]
9757E6626n7477k8396N2j5768N660l2679J4949L4907R23l1744M6342K0167j5193
9744a631m5850r300n191M385N844k6483l4676P6348N9173j1337l1966p545M1148
9731A2919p488l3035m594K747M7380l8050m6536k6637J2727j794K546l6036J40
9718a15711M2083L1766J0545k3746K4889O840M597J2470l0912J8707l0591r978
9706e9041K9157k3602j0573Q477O852K9462M813j8266N3309l0120l5723J8571
9694b6684K9450k0486O983P238o655n740J0316k2915k311M903N2955J528J2670
9681D1252l506k3333r555o188l4325n7922J753K8522L6654M2182j9049j7910M565
9668a6860l8195o975J0855K2526j3459K6238k2024k3317o185J7015L1835J1341
$$ y = [56626, -851, -29247, -29195, -44963, -39303, -71982, -57033, -22126, -21203, -52947, -6605, 13562, -1631, -47481, -56781, -61972, -57587, -51743, -78226, -112902, -36554, 22619, 11282, -20684, -28229, 12919, 5431, -27604, -32198, -29451, 17929, -20121, -66657, -93294, -80567, -82361, -79815, -115851, -115711, -73628, -41862, -31317, -55063, -30174, -23334, -18737, -6267, -37179, -18472, -49063, -59041, -29884, -53486, -64059, -55582, -48730, -19268, -14455, -32721, 20588, -9532, -45255, -26684, 2766, -17720, -10737, -3499, -10154, -15894, -5578, -28493, -30804, -25901, 27054, 28582, 41252, 37746, 14413, 4858, -1330, -35655, -93577, -91824, -63302, -26648, 15534, -3515, -21425, -16860, -55055, -62030, -51175, -28649, -42108, -15870, -37894, -61211, -67396, -50381, -18546, -7205]
9656g205j2287k0290J3195N3560J5277k454J1748j1801l9743k1000q249k3623
9644e2872J3385L5679K3956l4543J0328J6038Q021j4551l4186j5786L1094N0389
9632C6952k103m9175j3875K2424K0829J6286J2725k5293m1100J5065J3904k0363
9620a3724j2844k9579M659M7413M7018P599K115m8969j2411J2870L4392j9126
9608A9413l2459K5136K6597l9162M796M695q564N822k7366k4822n304K0740P325
9595b3153J425M4969K9594K7571r668k7515n862m4334o288M2971p871J4765R539
9582D6143j4936k302r966j1291M120k485j6952k988Q016j135R382J8555j6943
9569G218m0971k517M369J5569k1963J774P724J7105o868Q145K8930k49r713j9771
$$ y = [-7205, -19492, -39782, -26587, 26973, 42250, 39796, 51544, 39743, 0, -21000, -29249, -52872, -39487, -3808, 20148, -14395, -4067, 11971, 19992, 5441, -28745, -44531, -13437, 36952, 34849, -14326, -28201, -5777, 15052, 31338, 44063, 18770, -22330, -7265, 6639, -13724, -26568, -56147, -51488, -4075, 42943, 50542, 52657, 3688, -8723, 4147, 38539, 19413, -13046, 12090, 38687, -475, 4321, 9016, 452, 6274, -21092, -45914, -51218, -30478, -23153, -21728, 23241, 52835, 80406, 70738, 43223, 37361, -6973, -13261, 29710, 21839, 36604, 46143, 31207, 28905, 18939, 7648, 11768, 9283, -7669, -10657, -2641, -3776, 5606, 24161, 7218, -33753, -36270, -31901, -16332, -38295, -36521, -28797, -11692, -18560, -10415, 18515, 18266, 8553, -11218]
9555a1218j2670O979o42j7851K3819K5027n916O58N9993l447n2260k2506J9555
9542I521J0703j0610M286j9056L2212L8034J5050J2533q335k0398k7355l0445
9530F140J2471J1045k1845r175J9016r445L2235r062N558R410n8170l5471K3542
9517b3751q587o942R132J3560J4762J70r51J0972j0826J3223j8502K9058R900
9504C1218m2987k0283n868K6932J1881k650l3123L2720M5652J1026m7492l0464
9492b3438R937k4249K1276j1766n1582J4942M7010r798O289P429J1799K1225R823
9479B8897n495J1018J812J4677j5079l2607l3820L627J1209N8255P083J3296l8924
9466B3949k4547l4403j1040q653L6220K1524N0038R125j8528l2594l5814J5751
$$ y = [-11218, -23888, -16909, -17551, -35402, -11583, 13444, 7528, 8186, 68179, 64732, 12472, -10034, 9521, 20224, 9614, 13900, -5156, 27056, 65090, 80140, 92673, 84338, 63940, 36585, 6140, 18611, 29656, 7811, -1364, 17652, 8207, 40442, 31380, 36938, 46348, -11822, -47293, -23751, -32338, -39280, -30148, -16588, -1826, -1656, -2607, 8365, -2461, 10762, -7740, 21318, 31218, -11769, -32052, -37920, -10988, 893, -1757, -34880, -2160, 43492, 54518, 7026, -23438, -13501, -37750, -16474, -28240, -79822, -64880, -17870, -27668, -21379, -13950, -2151, 19074, 28897, 23402, 34420, 36232, 50909, 35830, 3223, -30597, -26970, -15761, 42494, 49577, 62873, 23949, -598, -35001, -46041, -54694, -18474, 3050, 53088, 62213, 43685, 11091, -24723, -8972]
9454h972J7749k0174l6300m503j0897j6126m921L6346K144J286K9257J3596K351
9441H36m1737P868O544M526n329K3807L5829O6327Q860k9044l2687n5242l4375
9428d3817j6599N0391J9675j1533k7406J8955R931m975r635N2851M8291j0165
9416G5964l5565l2170p769K832l286l653j5848J8366m178K6801j4076k0670j8625
9403c1877K7851l356l5003L2316K4187o5299j0557J2220j762J9221j5493n340
9391e2892K0380J5161k9232J3294l9844q200O0235N767m481J571N164j003q867
9378b2947J4306L4788k8555R875J9337m6216q513j906j6899Q63l80l0720n31M6308
9364c1190K1657j6062k588L040N114K5253K4723N948j6729L4375j0567K3916M000
$$ y = [-8972, 8777, -11397, -47697, -52200, -63097, -79223, -84144, -47798, -45654, -44368, -15111, -1515, 836, -40901, -33033, -26489, -21963, -27292, -3485, 32344, 98671, 107531, 78487, 45800, -9442, -43817, -60416, -10025, 9650, -1883, -29289, -10334, -403, -5378, -15013, 37838, 86129, 75964, 40399, 8229, 460, 3292, 6, -3647, -19495, -1129, -5307, 21494, 7418, -13252, -31877, -4026, -7382, -42385, -10069, 14118, -51181, -61738, -49518, -51280, -32059, -47552, -52892, -32512, -17351, -46583, -33289, -73133, -81333, -21098, -15331, -19812, -18241, -13077, -14080, -22947, -8641, 26147, -2408, 7467, 26804, -19412, -27925, -29831, -46730, -45867, -46247, -76967, -77498, -31190, -9533, -25595, -28183, -25143, -20029, 5224, 29947, 35895, 19166, 53541, 42974, 66890, 70890]
9351G0890J721k246m8352P545k8090j2159J2384l6380M985L8908M450o5430k9231
9338h1005R0359K9902l1471l571J1350J8287L9423j6328l2671j943J9581q243
9326C3670o599P791O5371L095n7950o2357J3958N277L2756l7602m936K0329L172
9313A5975L1787J9942k347K2229L2865n2405k1418K373K5523k4130k2011j7239
9301A1144j9554o975J2107M4668j5432j3491M429q683k547J6674J0356q003k4607
9288H6J0103K1026l0786o54O647J1578p854N384m029q425K3556l0367l8576Q305
9274c4006M0811L4769n001J9120r577k0445k437l9566M1636L9101j6521l4035
9262A3849j4337L500K5734J7168j1619r751J6749l88M866j0196k4856j291l857
$$ y = [70890, 72611, 70365, 22013, 29558, 1468, -10691, 1693, -34687, -29702, 9206, 13656, -51774, -81005, 9354, 39256, 7785, 4214, 15564, 33851, 73274, 56946, 24275, 22332, 41913, 33670, 27071, 34862, 100233, 103328, 45378, -16979, -3021, 2256, 35012, -2590, -7526, 12803, 15975, 47762, 67704, 65357, 87586, 120451, 68046, 46628, 49001, 74524, 50394, 28383, 11144, -8410, -15385, -3278, 41390, 25958, 12467, 16896, 8213, 5666, 22340, 32696, 24693, 86, 10189, 31215, 429, -225, 6422, 18000, 10146, 15530, 11501, 3076, 26632, -3735, -42311, -34006, 6805, 41574, 36573, 55693, 46116, 25671, 23234, -16332, 25304, 64405, 47884, 13849, -488, 3012, 28746, 45914, 34295, 24544, 41293, 40905, 45771, 35575, 10719, 9428, 5571]
9249E571J4072J495j7716j3418J3987M5897k265m7403q8458k2817K5164J5074
9237g0817K0639L4840N8876n7607k1791J4255K512K2889p554n511p307m7429J730
9224f2275l997K290M335M4305N3512N2504l0522m8317l0212Q440K5856j462l876
9211A0581q395j0474K8491K1371J7794j1589k0019k786p331k3362K1753L0368
9199D6402M2820O063k3084N137k4033J5410N1979n2157l3605j6111L992k2264
9187E49K643J9478o821K4961K421J1567o20l1346n5021k8508J7005J4454K6226
9174c012L3831J224J6027k0112l1311N4527J9344J9582m5543m5895J9401Q100
9162B6163K4296J0367K2326N4672O1673k4880p0482m2615L5130J5458l358J8556
$$ y = [5571, 19643, 21138, 3422, -9996, 3991, 49888, 47623, 220, -88238, -111055, -85891, -70817, -50178, -15338, 43538, -14069, -35860, -21605, -19093, 3796, -3758, -9269, -16576, -64005, -62275, -66272, -63982, -59647, -15342, 38170, 90674, 60152, 11835, -18377, -9937, 15919, 14457, 10581, 2186, -8288, 20203, 41574, 59368, 47779, 27760, 24974, 17643, -5719, 16034, 46402, 89222, 95285, 72201, 77338, 53305, 68715, 120694, 68537, 34932, 18821, 22813, 549, 3192, 22670, 15849, 40810, 43231, 54798, 54178, 22832, -32189, -60697, -43692, -29238, -3012, 30819, 32043, 48070, 27958, -3353, 51174, 70518, 90100, 44557, -1338, 18063, 26163, 50459, 60826, 83152, 137824, 199497, 174617, 104135, 61520, 96650, 112108, 108750, 127306]
9150A27306M0570L9990J4006j7667N023K7165J7742K7517J8168q005L0908N3160
9138C75883N9264J09731P8923J02284J39870K15335K53067L75819N86345J084221
9128C380742K030621L723607M275790J56098k425879j626655j337677k132108
9120F044539k046327j261345o95317m30093l30037j99443j59773j33339j12329
9111F76536p9734j220Q838n3558o6875n3466n8013l8807q2738m3661K296P0n2990
9098A56678m2495r748q725n0021l4889L6029R068J88J6723q333R215o675L3009
9085A00024L2703k7486j0487J5250K59l6897J7668K9081l4421j7603l4207j6698
9073A7186k1684j1415M806M407J0910P869K0170N6412j3726k0695K6249Q973k7610
$$ y = [127306, 167876, 207866, 221872, 204205, 209228, 236393, 254135, 281652, 299820, 291815, 322723, 375883, 435147, 544878, 623801, 726085, 865955, 1081290, 1334357, 1710176, 2296521, 3380742, 5411363, 9134970, 13410760, 13566858, 11140979, 9514324, 8176647, 6044539, 3998212, 2736867, 2041550, 1611457, 1281420, 1081977, 922204, 788865, 676536, 596802, 595582, 604420, 550862, 483987, 430521, 372508, 333701, 250963, 207302, 209598, 209668, 156678, 114183, 104435, 95710, 45689, 10800, 46829, 55897, 56085, 72808, 64475, 73690, 67015, 100024, 132727, 105241, 94754, 110004, 110263, 73366, 91034, 120115, 85694, 68091, 33884, 17186, -4498, -15913, -11107, -6700, 4210, 12079, 32249, 88661, 74935, 54240, 80489, 89462, 61852]
9060F1852k5624j3042J5375n865K4823k7423k1109J573K0534L3964j1344J0730
9048F4444M5869J4115m7068R083K5946j4235K263j4573l6475j9755j0543L0773
9036D9844K6409l4450l3377l2063n3462m8899L7700M4732K3810L3723K6830j7971
9024B2826j156O324L374J7523J1278J62q668j7261n33k0820J0752l7411l7552
9011e1162L5549O0429m843K3301r720l4550M674O544m7721k5710L4445J2474m2831
8998c9121L6063L7648m768K1370k3449l9162r13l4336K2226J2990l9930N576K4684
8985b1122K173K3169M3795J0201K0499k9565n1785k182r057l9994l570K0575K1677
8972a5186J4635K1469m709M566K394l1348n908K1421K5572J1728l8224j816K153
$$ y = [61852, 36228, 23186, 38561, 32696, 57519, 30096, 8987, 10560, 31094, 65058, 53714, 64444, 110313, 124428, 77360, 86443, 112389, 98154, 100417, 85844, 49369, 29614, 19071, 49844, 76253, 41803, 8426, -23637, -77099, -125998, -88298, -43566, -19756, 13967, 40797, 22826, 21670, 27994, 31368, 48891, 60169, 60331, 51663, 34402, 33869, 13049, 23801, -13610, -51162, -15613, 44816, 39973, 63274, 53554, 19004, 23678, 30222, -17499, -43209, -8764, 3710, -39121, -3058, 34590, 29822, 51192, 27743, -11419, -12332, -46668, -24442, -11452, -51382, -45806, -21122, -18949, 4220, 48015, 58216, 78715, 49150, -2635, -4817, -13874, -53868, -57438, -36863, -15186, -551, 20918, 16209, 20775, 23169, -8179, -14087, 7334, 32906, 44634, 6410, 4594, 6747]
8959F747n462m1762J9415K551k5768K0369L1886M806j4920l4942J5090N108J5276
8946a606K4199L8922o469Q432j1126k7735Q865L8491l564o163j9740j3336K8878
8933E8048K9090m73k1777l0657N939j2280n5715k3460N462J8644O4914J0219l685
8920D4269J4628l188l3225Q024j5991j2386m3041j471J5141k2846J8406m940L887
8907c2733Q384N0359O5682K4398J642j0682l188m6864m6910P336K3718J4815j9201
8894C6756j3891J5759L1468K3021j8510l3162M5835R657l9723j7414M9458m450
8882H4804r2738n1968K1830K9442L7959L6001l6023K157N286j5733K813J6907
8870D0737k3628K6448J0705J5196K0671P062L1466k4573j4677k2674k6465j7320
$$ y = [6747, 1285, -40477, -21062, -18511, -44279, -23910, 7976, 12782, -2138, -37080, -21990, -16882, -1606, 22593, 61515, 55046, 63478, 52352, 24617, 33482, 71973, 68409, 62246, 42506, 29170, 58048, 87138, 86665, 64888, 34231, 40170, 27890, -27825, -51285, -45823, -27179, 37735, 47954, 44269, 58897, 55709, 22484, 30508, 14517, 2131, -40910, -42381, -27240, -50086, -31680, -36620, -32733, -24349, 26010, 91692, 116090, 117732, 107050, 103862, 56998, 10088, 17424, 41142, 55957, 36756, 22865, 38624, 70092, 93113, 74603, 41441, 87276, 96933, 57210, 39796, 89254, 84804, -7934, -59902, -38072, -8630, 29329, 65330, 29307, 31464, 36750, 21017, 23830, 40737, 17109, 43557, 54262, 69458, 90129, 97191, 128657, 104084, 89407, 66733, 40268, 22948]
8858B2948n1559J8812L4270l3647K4956J7795O558J1722k812O282J2751k340O056
8845G1792k9117k216J4955L1100j2929r97n2439m7266K4985L7392j6893j877q791
8832G699p673N167j005p196L861J0724m0177j8195K1213j6753L9426K2189k8420
8819i140j7944J9026p046j4397m784K287L3752K9690J149N194l6291j4558R231
8806c831O4888L1755k0071l1973n0873l4323Q111k829J6736M6848K7961k7370
8794B5029j4679j6094N570j6451k3080j921l1126L9209K1979j7573k4038M6062
8782g113K7762M273K0842K4671l4201m9824k2667N7899M644o790j3526j6044L6533
8769B6459J2361J2581k3228j1584m0525K1107J3117J0188n537P627K0527o136
$$ y = [22948, -28611, -9799, 24471, -9176, 15780, 33575, 40133, 51855, 49043, 55325, 68076, 65736, 71792, 42675, 40459, 55414, 86514, 73585, 72588, 20149, -27117, -2132, 35260, 18367, 16490, 7699, 26, 5193, 4188, -3008, 853, 11577, -28600, -46795, -25582, -42335, -2909, 19280, -9140, -27084, -8058, -15104, -29501, -34285, -31998, 1754, 31444, 32593, 37787, 1496, -13062, -3831, 61057, 92812, 72741, 40768, -10105, -44428, -36317, -39146, -22410, 24438, 52399, 25029, 10350, -5744, -174, -16625, -39705, -41626, -72752, -33543, -11564, -29137, -53175, -7113, 20649, 24922, 45764, 70435, 36234, -13590, -36257, 21642, 26286, 19496, 5970, -10074, 26459, 38820, 51401, 28173, 16589, -23936, -2829, 10288, 20476, 14939, 22566, 43093, 36957]
8757C6957m4653l969J1573J6272K2173O181p97l2895j0409J5423m94q630Q593
8744A5325j1424o724j1917O586L2501K2389N008r930k9009N91R959K7688K996
8731E4039k3443j1675J0195K645l6665L915k2826K3209J4342o549M681q838l5171
8718c2141j9600L5991p88L7725J3442k6583k7983k8356K9051M8115M0202M258
8706G3333l6375j5211o800J5368K7967q107n7767m2782j3733j1751o384L0148
8694e2094L5488R398J3179l4441j0761L0690J6284J4815K2375j5820m3355Q222
8682f020R16N7473L4308J4569J2889j3654l5556O81O786K6271l2186l9113k868
8669B4496K491l3123j1614J8125K654J1366K4299L5877O2336j0101j2314j19J3555
$$ y = [36957, -7696, -11665, -92, 16180, 38353, 44534, 43737, 10842, 433, 15856, 15362, 6732, 15325, 3901, -2823, -14740, -8154, 24347, 46736, 51744, 41814, 12805, 13396, 23355, 51043, 54039, 30596, 18921, 29116, 31761, -4904, -989, -23815, -606, 13736, 7187, 11868, 3030, -32141, -51741, -15750, -16538, 21187, 34629, 8046, -19937, -48293, -19242, 28873, 69075, 73333, 36958, 21747, 14947, 30315, 58282, 50175, -7592, -50374, -64107, -75858, -82242, -52094, -16606, -7208, 5971, -28470, -39231, -8541, 7743, 22558, 44933, 29113, -14242, -6020, -5104, 52369, 86677, 101246, 114135, 100481, 64925, 65606, 72392, 98663, 66477, 27364, 24496, 26987, -6136, -17750, 375, 3029, 14395, 38694, 74571, 136907, 126806, 114492, 114373, 127928]
8656A27928p040l6252M0485L6015L3354Q8476J26397J57983p854r1864o4946n0599
8644C52083o4033q2135m0834O169j3619k9118k4374k473k5958j711M2089n625
8632A10461k8363k1960k3753j2451L1572M4514K0821P982j5598j9767J6995L7040
8620A47493J6850Q26M4016L8969K741k7913j9224J8977l941L657K691K3539L4172
8607B82853L6067J08277J95673L16214J92944j35544j37144p4713q1847j69008
8597E33772r2775j05542m5066k588m2197m2984j3706l8927m7795l5290j0788L2874
8585H8988J0765n99J9915Q129k4402k3795j2751j5008k3386J6561j816M951j8067
8572B9485M4052L8228K103m246k0559k2432j7899L0631p423k5934R145Q0328J32246
$$ y = [127928, 120888, 84636, 125121, 161136, 194490, 282966, 409363, 567346, 559492, 467628, 402682, 352083, 288050, 205915, 165081, 171250, 157631, 128513, 104139, 101666, 75708, 73997, 116086, 110461, 82098, 60138, 36385, 23934, 55506, 100020, 120841, 128823, 113225, 93458, 110453, 147493, 164343, 165169, 209185, 248154, 250895, 222982, 203758, 222735, 218794, 222451, 225142, 248681, 282853, 318920, 427197, 622870, 939084, 1132028, 996484, 859340, 784627, 702780, 533772, 440997, 335455, 290389, 287801, 245604, 202620, 188914, 149987, 102192, 66902, 56114, 88988, 99753, 99154, 119069, 127198, 102796, 79001, 66250, 51242, 27856, 44417, 42601, 47552, 29485, 73537, 111765, 113868, 109622, 89063, 66631, 48732, 79363, 71940, 46006, 55151, 135479, 267725]
8559B67725J40451J25960k7420q7159m1154n7080r1025j0856p4499o7895m0344
8548C6704r468L560L2660j2132n9123m004N3583J9846j5693j2299l4365j8946
8536a9677J0779O013M9089j9787k3720n753K5317n0148k6529N024K3926J4969
8524a0497m5845m950J2548J9583Q614j2967M777l534p389K4785K4645L9070k1318
8511B7522o0528k2038k1161K6292K7668J8764r59J3640L4296o741o186k497k7613
8498D59m5724j828L4141J5524j8754K8934N471n2793j1308J0927L1397J9258J0874
8485B6578J3707J0926j9732j6283K3933J4322N686p639l649l3244m1549P523K3426
8472D005j2129K703M2558K6650R191M82k9032n1776j8721J7124J8699J8619k8283
$$ y = [267725, 408176, 534136, 506716, 419557, 378403, 321323, 230298, 219442, 144943, 77048, 36704, 27236, 30796, 63456, 51324, -7799, -11803, 41780, 61626, 45933, 33634, -731, -19677, -8898, -2885, 46204, 26417, 2697, -3056, 22261, -27887, -54416, -49392, -25466, -10497, -56342, -61292, -48744, -29161, -20547, -33514, -28737, -32271, -39660, -14875, 9770, 48840, 27522, -33006, -55044, -76205, -49913, -22245, -3481, -4440, 9200, 43496, 36755, 30569, 28072, 459, -45265, -47093, -12952, 2572, -16182, 12752, 18223, -34570, -45878, -34951, -3554, 15704, 26578, 40285, 51211, 31479, 15196, 39129, 53451, 59137, 51498, 47849, 14605, -26944, -19421, 4005, -8124, -5421, 37137, 63787, 72978, 73460, 44428, -7348, -26069, -8945, 9754, 28373, 90]
8459I0L172K1841n6J5081K9677K8237o385r840m2938L402k7991k5779K8662Q190
8445B5363J2107j4493J3088P528L340j0298j5021J092J6193M002j3512k0481k5940
8432a7032k5117k181l986J9405J3978L5156K0737j3109j1924j4481J1214K5812
8420C8472j2710K0715j5339R929k9293l5962K6186L8871m4990P066n850j9300
8408b2205k5387J718K4200N9249J4766l154K7152k9003l5933n396R91q414k7228
8395b8644k0526K0208K4661O64j6273L4291o749P099j984k2422j9023p260M6056
8382A0098J512J8847l7158R609N2002l045l9791k2963k1578m0955K8639P5947
8370C1164O7051J2673k7164m5628o346l8532j5984j725J0286j059K1638J8419
$$ y = [90, 3262, 25103, 25047, 40128, 69805, 98042, 91657, 81817, 38879, 42281, 14290, -11489, 17173, 25363, 37470, 22977, 36065, 43593, 46933, 36635, 21614, 22706, 38899, 42901, 29389, 8908, -17032, -42149, -44330, -48316, -28911, -14933, 20223, 40960, 27851, 15927, 1446, 12660, 38472, 25762, 46477, 31138, 41067, 11774, -24188, 1998, 40869, -4121, 2945, -2905, -22205, -47592, -45874, -21674, 37575, 52341, 49187, 76339, 47336, 11403, 6007, 6998, -1416, -28644, -49170, -28962, -4301, -3637, -19910, 14381, 7632, 14731, 12747, -9675, -28698, -35958, 10098, 11610, 30457, -6701, 2908, 54910, 51865, 12074, -10889, -32467, -73422, -44783, 31164, 98215, 110888, 83724, 38096, 31750, -6782, -22766, -24491, -14205, -15264, 6374, 24793]
8358B4793L2707k437j6445k921M2114m1095o841K585o4111j5670K7672K1004N43
8345A898j9279k5699j0477L9727M0992M3887J8218l6567o2949L1882J1028o4810
8333c2149n7718J0431O1872l642o3570K7478L9249K8791R994j4773j1550k3409
8321b8996r214l8307r156N3986M8371o016k8456k3234o281k5583M2290M3210j1576
8308A038k0547N849L6321K7542n5182P400K1799k104J714l1320O470k8355k8844
8295e8219K3874N0703L3008K2960o391n1226m800P959K9314L4961o3989k6911
8283h757j5609j9679k1902K4644N6417k4474l0790L6114P6519K9091J1726j5610
8271I7690P963q644L645J8792l6167k2525j6712J5111L4270j7444l2951m2344
$$ y = [24793, 57500, 55063, 38618, 35697, 77811, 36716, 29875, 32460, -31651, -47321, -19649, 1355, 1898, -17381, -43080, -53557, -13830, 27162, 71049, 89267, 52700, -10249, 21633, 32661, -32149, -89867, -79436, -17564, -21206, -84776, -57298, -18049, 10742, 20736, 5963, -5587, -28996, -38210, -76517, -85673, -31687, 16684, 10668, -17788, -41022, -47303, -72886, -30596, 12614, 1038, -19509, -13660, 22661, 50203, -4979, 2421, 24220, 22116, 23830, -7490, -1020, -29375, -58219, -34345, 16358, 49366, 72326, 65935, 14709, 9909, 17868, 47182, 82143, 18154, -8757, -24366, -44045, -65947, -41303, 15114, -9360, -40150, -4036, 72483, 101574, 113300, 97690, 105653, 97009, 100654, 119446, 83279, 60754, 44042, 59153, 93423, 75979, 43028, 684]
8259F84o1178j1296N9403K7104p715L0866K0739M371l224o3497m7864q857J4616
8246d5848M6980K5841K3975l2035l3121J9518M231J1851k6822k7742K9742M4248
8234D0818K8054L323l9041k891K1244P372L994l4873J4008L5780L3454J1919j232
8221A21929J4979l422J3441l3331n4979k3718P938m378K1460k4259l0659n069
8209f8K5754j0368J344o734o627J543R007J1912P395q33k5238j5075l4515J9857
8195b2646P567J446K8086j4880M787m3281k2536K019M4030K7911K2128P995j877
8182D0749k7696J2499K0254J960k4479n314L4432L2419L23o173L588m6043l3328
8169C191K2236L4919r136k1119j3246J138j9259R404P926J7411j5918o417q6n5838
$$ y = [684, -60494, -71790, -12387, 14717, 7002, 37868, 58607, 62978, 59754, -3743, -51607, -60464, -45848, 1132, 26973, 50948, 18913, -14208, 5310, 9541, 21392, -5430, -33172, -3430, 40818, 68872, 72195, 33154, 30263, 51507, 58879, 62873, 28000, 42008, 77788, 111242, 123161, 121929, 136908, 133486, 146927, 113596, 58617, 34899, 42837, 38459, 59919, 35660, 5001, -68, 25686, 15318, 16662, 9928, 3301, 4844, 13851, 25763, 33158, 32325, 7087, -7988, -42503, -22646, -15079, -13633, 14453, -427, 4360, -38921, -61457, -59438, -15408, 12503, 34631, 42626, 40749, 13053, 25552, 45806, 47766, 23287, 17973, 52405, 84824, 85147, 78974, 82562, 36519, 3191, 25427, 60346, 51210, 30091, 16845, 17983, -1276, 8128, 16054, 33465, 17547, 11130, 11044, -44794]
8155d4794R882J3587O321M298J6493j0621l429k8325J4349N2329j4315k7771k8711
8142d0707J7368M969M81M2142j5268l7189K4596j042r585j5126L1589N1654k6511
8129B7371j081j10o5238O861M4375L018k4588k4966O819L1675M9341J4721j562
8116F6636k9909o442L7667q190n5058l5966L0366J3480J8349J9090j8019j7730
8104A4274j9700L5555L041l202j5783l7338K025L0578J0055K9006j9108k4267
8092E136o5511K6818L0704r561k531J407K8506O3535l992m5738n9660N047L9369
8079A3529L1273L45m732L4437N1785L1915r542k3376j8977n2502L7126L1382k8021
8066I4642l8506j464L4001J8944m0362k0577k8374l5659J4120J1860M0672p96
$$ y = [-44794, -34912, -21325, -15004, -10706, 5787, -4834, -8263, -36588, -22239, 30090, 15775, -11996, -40707, -23339, -18370, -17889, 24253, 8985, -28204, -3608, -4650, -14235, -29361, 2228, 53882, 27371, 26290, 26180, -39058, -32197, 12178, 15196, -9392, -34358, -27539, 4136, 53477, 68198, 66636, 36727, 30285, 67952, 59762, 4704, -31262, -896, 12584, 30933, 50023, 32004, 14274, -5426, 30129, 33170, 29968, 14185, -23153, -21128, 9450, 19505, 48511, 29403, 5136, -60375, -33557, -2853, -12414, -14945, -13538, 14968, 78503, 74511, 28773, -30887, -25840, 13529, 44802, 45147, 40415, 74852, 126637, 158552, 149010, 125634, 106657, 54155, 91281, 122663, 94642, 56136, 54672, 88673, 107617, 67255, 46678, 18304, -17355, -3235, 8625, 49297, 48501]
8054D8501l0375J9377J5671n020k4496n138J6903l61J954j3145M7105K9266J6612
8041A16854j844o238j6314j4949j1677O892q672J8459j2823k0507P465l309q013
8028D5324K0857K1006J7550J0804j0986m226k1761j4889K1065j7443j3485K457
8016E6273l7662j2801j0740L0879M3752M4844k838k2056N3525K5127k066K3911
8004A90148j2772j5525J2756l598m3295k2623J3582L7935K3215k5494j0580R265
7992A53014l0754l2968k2380j4587l4541R083L6830R40L86m1652k1336M0206o1
7979D2180l7505r773M8101L120k5492j382L060o206r469L9703L3604k4712M960
7966F0189K3896q756M089M4649m546q811o188q25J704j4101j6277j1453M2539
$$ y = [48501, 18126, 37503, 53174, 48154, 23658, 18520, 35423, 35062, 37016, 23871, 70976, 100242, 116854, 115010, 108772, 92458, 77509, 65832, 72724, 64052, 82511, 69688, 49181, 56646, 53337, 45324, 66181, 87187, 104737, 115541, 104555, 100329, 78568, 63679, 84744, 67301, 53816, 56273, 18611, 5810, -4930, 25949, 69701, 114545, 111707, 89651, 143176, 168303, 166237, 190148, 177376, 161851, 174607, 171009, 127714, 105091, 118673, 156608, 179823, 154329, 143749, 153014, 122260, 89292, 66912, 52325, 17784, 26867, 63697, 64637, 65023, 23371, 2035, 42241, 42180, 4675, -5098, 43003, 46123, 20631, 19249, 22309, 16103, 6634, 46337, 79941, 55229, 60189, 84085, 75329, 79418, 124067, 119521, 110710, 104522, 103697, 105401, 91300, 75023, 63570, 106109]
7953A06109L4215k6310Q819m88o3405k7645j122J1541K7474j1574L8436O2794
7941A58844k5738n6375o2587l4286M910J9212K4871K1370N1304M2733j7890k767
7929A23601j2976O417l3715j3098j2311j8358L206K2404J550j6395K9852j3444
7917F6733p3214m932Q024R288K4347k5987L592M2563M4451q5n2440q4526k4552
7904f6738J8605J4039K0502L4024q467k139l7009L9903m595k4808n89j3888N723
7891b5437j5005k3844K4955J3647L6126M8154m2915j1626K4381K9504r792m042
7879D4106o8869J1934N8257J8482k8795l7146J9641r02n846K1044J341n70K8493
7866F1170J758j5703J4790k0492J6546J8810Q397j1547n8926j9125K1393n532
$$ y = [106109, 140324, 114014, 122833, 122345, 58940, 31295, 30173, 41714, 69188, 57614, 96050, 158844, 133106, 76731, 14144, -20142, -15232, 3980, 28851, 50221, 101525, 144258, 126368, 123601, 110625, 117042, 83327, 70229, 57918, 39560, 42766, 65170, 66720, 50325, 80177, 66733, -6481, -11413, -3389, 5899, 30246, 4259, 7851, 50414, 94865, 94780, 42340, -42186, -66738, -48133, -34094, -13592, 20432, 11965, 9826, -27183, 12720, 8125, -16683, -17272, -31160, -25437, -40442, -64286, -39331, -25684, 10442, 58596, 15681, 4055, 28436, 57940, 48148, 44106, -24763, -12829, 45428, 63910, 35115, -2031, 17610, 16708, 10862, 31906, 33247, 32677, 61170, 62928, 47225, 62015, 41523, 58069, 76879, 85276, 73729, 14803, -4322, 17071, 11539]
7854A1539J9514n835N198O936k9644n0833K4800J9463l2373M15M9237K7644K3653
7841F9714j4531k5486k0160k3935Q682q616K430K3338j2222p82r282K3842j1309
7828A683j0283K6639M024m5975j3000K1519p807j7015L0100j7858q751r958L4627
7815a2055P297o2867k1810r194j1036N9577J8703K5604K6391q738m7228j0525
7803d5881L000k1020J8402K4609J5414L6093K2605l5478J3300J4389k9215j3096
7791C122m0390n296K6476j1404R275N484k2947M6323J8696m5128n6321n9673L0829
7778a00954Q3873L6383J6095l5294l2723L0722L0530J7036L9691q52j3413n6066
7766A5028L5265l203m4000O5120r60j0610l4859m5595j3349J4186J0767N603R737
$$ y = [11539, 31053, 25218, 30416, 37352, 7708, -43125, -18325, 1138, -31235, -30820, 18417, 46061, 69714, 55183, 29697, 9537, -14398, -5716, -14332, -11902, 11436, -786, -1568, -10850, 12992, 1683, -8600, 18039, 22063, -23912, -36912, -15393, -23200, -40215, -10115, -27973, -36724, -46682, -12055, -4758, -67625, -89435, -98629, -109665, -50088, -31385, -5781, 20610, 11872, -35356, -45881, -42881, -63901, -45499, -20890, -5476, 30617, 53222, 17744, 31044, 45433, 16218, 3122, -37268, -42564, -16088, -27492, -18217, -12733, -35680, 10643, 29339, -15789, -72110, -131783, -100954, -17081, 19302, 35397, 103, -32620, -1898, 28632, 45668, 85359, 84507, 71094, 15028, 50293, 47090, 3090, 68210, 67250, 56640, 21781, -23814, -37163, -22977, -12210, -6607, 3130]
7753C130l3825K3298J6255j9038l3347J1584K2542J9718J3139n853K5820K2850
7741F6273J174m5392n678q327L3573M0183q866q6645k1854j8517k5238L3744L6952
7728h618N315n0175K8342O3978k849k100L662o57l0474l814R291M958L300o398
7714A3761J3276L7770r918n0918l5600J3356K3609N59m954J5504o046J7771k5089
7701C081m0863j2436k1520K401N411L2391L0887P68m1579q11K1423M3235j1907
7688A0481k4550j1059K355L0161j106j5669K1608K8278j2267O585k5193o3012
7676e3388J2431j0775J0708K6015o081q8k2966j1320K9192P899K5332J35n1527
7663d4433m2491M6120O857J0649J0531j028M834K3070k9982j7504R511J1922J4497
$$ y = [3130, -30695, -7397, 8858, -10180, -43527, -31943, -9401, 10317, 23456, 17603, 43423, 66273, 67447, 22055, 16377, 8050, 41623, 81806, 72940, -13705, -35559, -54076, -79314, -45570, -8618, -3303, -53478, -25136, 38842, 35993, 33893, 37555, 36898, 6424, 2610, 11901, 16859, 20159, 13761, 27037, 64807, 54889, 3971, -31629, -18273, 5336, 5895, 941, 16445, 10399, 28170, 3081, -37782, -50218, -71738, -69337, -63926, -31535, -648, 120, -41459, -42270, -20847, 22388, 10481, -14069, -25128, -22773, 7388, 6282, -9387, 12221, 40499, 28232, 34817, 9624, -53388, -40957, -51732, -41024, -15009, -21090, -21178, -44144, -55464, -26272, -18373, 6959, 7094, -44433, -86924, -40804, -33947, -23298, -12767, -13795, -8961, 14109, -15873, -33377, -23866, -11944, 2553]
7650B553L7627r555n684k0757j9729R200j0385J2799j0870J158k6980k0633N7614
7637c642J5930k1085j6895K711k3839K5246J857p713N9706M4718p906k0809l0664
7624A7615Q39K4700o874N147l5793l8285J0316n043j370l011l1972K8537K8848
7611f346O07k2965J9618J9570J3848k9869m6826J2948K4651R484L14m5454j0922
7598f1342K9173K3086L4107m2247l3427j3730L7618M0077M958M080p509k6225
7586a1381j265M6538K0028k9209k5241m241L8867J1152L93j2802p557k717l0032
7573g467m7736k426Q210j9479M264L4338N0275L1483o0149k720P324P347l5764
7560c2500l0761n2516N5850M2991J0641M920L6597j5005l3977j1032m4113R516
$$ y = [2553, 40180, 30625, 24941, 4184, -15545, -6345, -16730, -3931, -14801, -13643, -40623, -61256, -3642, 12288, -8797, -25692, -22981, -46820, -21574, -19717, -27430, 32276, 76994, 69088, 48279, 17615, 18454, 43154, 36280, 41427, 5634, -32651, -22335, -27378, -28748, -31759, -63731, -35194, -6346, -5739, -28704, -9086, 10484, 24332, -5537, -52363, -39415, -14764, -5280, -4966, -50420, -61342, -32169, -9083, 25024, -17223, -50650, -64380, -26762, 13315, 18273, 22353, 14844, -11381, -12646, 33892, 53920, 24711, -530, -4771, 34096, 45248, 45641, 32839, 25282, 22565, -7467, -55203, -57629, -49419, -68898, -64634, -30296, 19979, 51462, -8687, -11407, -4083, 3264, -32500, -63261, -115777, -59927, -16936, -6295, -1375, 35222, 20217, -13760, -24792, -68905, -59389]
7548e9389J1354Q435J4165Q939r227k1728j688J5931M168L7458J837k9436k2617
7535d1798P350J8025j8065N9021M3558k6871k6804j221J307J6807O187p312k0031
7522A0153p200j45J257k136l1390k6438m279K7282J052M2024J9814O972k8580
7509H386k6627J0621J7440K9996k748O651P790n2408k6141J2243j8688j3157q372
7496e5014k2036k3923M3901M5974L2203J0332m619k9227L3864J5564o723p1171
7484c0875l958L9750K2118n904L4773l5647j9383L3371J8097N850M147J359k3122
7471D0576l2450k582K1124K6420j9315m6122k0806J2671K8395J5485K5928J1281
7459F0605K3529O351n7443l8360j0341K0941K173l753J4513J8209o6265m4781
$$ y = [-59389, -48035, -39600, -25435, -16496, -25723, -47451, -49139, -33208, -29040, 8418, 10255, -19181, -41798, -34448, -16423, -34488, 24533, 68091, 41220, 14416, 13195, 14502, 31309, 37496, 30184, 10153, 2953, 2808, 4065, 1929, -29461, -55899, -60178, -32896, -31844, 10180, 29994, 36966, 8386, -18241, -7620, 9820, 39816, 37068, 43719, 51509, -899, -27040, -14797, -33485, -46642, -55014, -77050, -100973, -57072, -11098, 21105, 31437, 26818, -2409, 31455, 47019, 40296, -30875, -34833, 4917, 27035, 21131, 55904, 20257, 874, 34245, 52342, 58192, 62339, 63698, 40576, 8126, 5544, 26668, 53088, 33773, -12349, -33155, -20484, 7911, 23396, 49324, 60605, 84134, 90485, 33042, -5318, -15659, 5282, 7455, 3702, 18215, 36424, -29841, -74622]
7447g4622j386j8762K8468N0692Q331l671j576l3804j9074J9291J1245K4768L0449
7434B0349q422J730J1916j2568M5R254l6743l8310K184L3343q528q112j7878Q542
7420d3198p938Q587L084k4358K742M8796K1711N840J3875J970k55j8238j4118
7407a500j6334l0633K3059L0080j4102J3340k9041k3220M9675M6347O860m1443
7395A3088p0522k2084N5118L3552K0209j1199m7519m385K5514J8710K0550k1137
7383I895j0379k6433l2o896J8209N5727J1557l1907k6771k7711P513Q237Q664
7370a0327J7204K8504N27l1010k5340k0092k5616R250p955m7110m2214N0056N6103
7357d8020N4791O806J0261J4315l3726j9403k7535k7099M163L2934L1469l401
$$ y = [-74622, -76008, -94770, -66302, -15610, -7279, -10950, -12526, -46330, -65404, -46113, -34868, -10100, 20349, 11927, 13657, 25573, 13005, 13050, 22304, -14439, -52749, -50565, -17222, -25750, -33862, -51740, -43198, -51136, -42549, -39465, -63823, -61081, -12285, 9426, 15266, 29141, 31111, 30856, 12618, -1500, -17834, -48467, -25408, 4672, -9430, 3910, -25131, -48351, 1324, 47671, 54531, 13088, -57434, -79518, -24400, 9152, 29361, 18162, -29357, -33742, -8228, 10482, 31032, 9895, -484, -26917, -26949, -33845, -15636, 40091, 51648, 19741, -7030, -34741, -27228, -18991, -10327, 6877, 35381, 35908, 4898, -20442, -40534, -66150, -56900, -64855, -111965, -154179, -104123, -48020, 6771, 13577, 23838, 38153, 4427, -14976, -42511, -69610, -65447, -32513, -1044, -4445]
7345d445O099q531J4932J5326l2117j2806k3439J8667l768n552M5413J4068l2149
7332h302L805L2884k641k4450K0145j2360r342j6202l2871P538L6890J5858m1529
7319c0577j2664K0006j1408L1471N2519j6427m7009J2867k0238k0905L6518K8638
7307B2791L647m4300m4989L3893K5312J0273r1j8414l8865J619M4046K9008k3268
7294F62N790J0998L5481k9038k4355k0371P716N0631l2940n3087L627M6678j5297
7281a3505l6793j5751K9487L4090K7423k042k7372l3597M5987J8200l7148m4706
7269e5727m21K2430R129n764m6403J3205M2607K5864n644J9992K1952j3612J6702
7256D4310k929K7637p501m3225j3926l4902m4784j163L0015M9956M8965J5389
$$ y = [-4445, 1654, -6877, 8055, 23381, -8736, -21542, -44981, -26314, -30082, -35634, 9779, 23847, -8302, -4497, 28387, 25746, 1296, 21441, 9081, -261, -16463, -49334, -41796, -4906, 10952, -30577, -43241, -23235, -34643, -3172, 49347, 32920, -14089, -1222, -21460, -42365, -5847, 22791, 26438, -17862, -62851, -28958, -3646, 6627, 6536, -11878, -50743, -49124, -5078, 23930, 662, 6452, 17450, 52931, 23893, -462, -20833, -13117, 37514, 4574, -48513, -44886, 1792, -13505, -50298, -66049, -36562, -2472, 24951, 22909, -4463, -38060, 7927, 26127, -11021, -55727, -56148, -33718, -24589, -30353, -76756, -63551, -20944, 4920, -724, 19268, 41220, 27608, 44310, 41381, 69018, 61517, 18292, 4366, -30536, -75320, -76483, -46468, 3488, 52453, 67842]
7244F7842o3356k9818J6389K4251L9226J7617q300J3034M243j1393l2302j7994
7232A9439m744k936P371k2432m5155K6937J7119Q953n91J0234J1734K1682l5649
7219A1962o1566j8702N572L1392P124J5849J8930J6906k4567p417m087l344L2918
7206B0970P007k9129o990j5057j9904j9356K5221J1480P098o366J481J7868O2711
7193E7034j6238m695l763j8199r95N3067j7552j9687j871j3222j9995o51l1699
7180c8466K3059J8120L489P651o268m0496j1454k0106J2051Q232R020M490J3690
7167a6988L9917j5304j1970j065K2171J215k6562R371J299k9884p17r603K5141
7154a2979J5631j074o702k1753j2015j3274L0732K3148k2282l3124R667K4187
$$ y = [67842, 4486, -25332, -8943, 15308, 54534, 72151, 63851, 76885, 81128, 69735, 37433, 19439, 14695, 11759, 19130, -3302, -48457, -21520, -4401, 4552, 3961, 14195, 25929, 47611, 11962, -49604, -68306, -62734, -31342, -24218, -8369, 10561, 27467, 2900, -4517, -8604, -11948, 20970, 27977, -1152, -8142, -23199, -43103, -62459, -37238, -25758, -18660, -25026, -23545, -5677, 57034, 40796, 36101, 32338, 14139, 13144, 66211, 48659, 28972, 27101, 13879, -6116, -6767, -38466, -15407, 2713, 6202, 13853, 7585, -32911, -44365, -64471, -52420, -44188, -35168, -30678, -16988, 22929, 7625, -4345, -5410, 16761, 17976, -8586, 785, 2084, -27800, -28517, -38120, -12979, 2652, 1578, -5124, -26877, -38892, -52166, -21434, 1714, -20568, -53692, -44025, -19838]
7142a9838L5928j1364m4100J5084J4275k1576K4821N1021n868l6869m152k1600
7130b4238n7386j7105q324k0266J3138K9979M4922K615J4679N0845m48m059l2891
7117h539j8152J285N77j3981l1998M1097L4876k2982M0280M81j4090r586l0836
7104c1568p366j7220K2139m3937j7064L8089L8335K3268K416m942J6664q379J536
7091A1971J6211J1505K0329q293l3329K6241M639q860J6216JN800l1042r350p52
7077B1287l9160j9337J2821J822j0851K8766M8260L949l588k6634q226m5085l4575
7064g0551J8815Q210J5714j3420J4233J6754K6487m5221p664M0286N467m1044
7052c1934j7480O7458K9567P207j5888l5911J2759K3227j0125k6314k705l3086
$$ y = [-19838, 16090, 4726, -39374, -24290, -10015, -31591, -6770, 44251, 38383, 1514, -2638, -24238, -81624, -98729, -107053, -127319, -114181, -84202, -39280, -36665, -21986, 28859, 28411, 24352, -8539, -26691, -25406, -24829, -38810, -70808, -29711, 5165, -17817, 22463, 22944, 8854, -732, -31568, -38934, -56154, -34015, -77952, -95016, -56927, -18592, 4676, 7092, 2150, 18814, 10435, 11971, 28182, 39687, 60016, 51723, 18394, 44635, 49274, 40414, 56630, 56631, 62431, 31389, 22039, 21287, -17873, -37210, -24389, -22567, -33418, -4652, 43608, 47557, 43969, 17335, 9109, -35976, -70551, -51736, -43526, -27812, -41232, -26999, -10245, 16242, -28979, -36643, 3643, 9110, -31934, -49414, 18044, 47611, 54818, 38930, 3019, 15778, 39005, 28880, 2566, -139, -33225]
7040c3225p603N748K6027J2132k0013k2034k0201P639k6454N2065j0809k8064
7028f4792K3908N1093K2394l6276k6583J7363K1514k0369k2245K46p339K6266
7016a4820l152L5553N382l1382K262K6498K6884q843o769m4878l0881o436J7538
7003c3044k2598p017K4603M0484J0554p147K1821l8265m5943k1577j7180K9831
6991f5478O2245J6717m6948m39l0265J9768K1821L3292J3434N731j724k1295k4327
6978a7468l6078k6529J8132J8612P6174O8433k5566q059n2342n7229k4514r08
6966f7342K7263j7325K5273O3654j4871j6121R823j7912k1405l6541j8818M956
6954g9366J5032L824M533P3805m174j3480Q600J4500J7214K0119P322j3433n664
$$ y = [-33225, -40828, -35080, -9053, 3079, -16934, -38968, -59169, -51530, -77984, -25919, -36728, -64792, -40884, 10209, 32603, -3673, -30256, -12893, 8621, -11748, -33993, -33747, -41086, -14820, -17972, 17581, 22963, -8419, -6157, 20341, 47225, 38382, 31613, -13265, -44146, -50582, -33044, -55642, -62659, -38056, 2428, 12982, 5835, 27656, -10609, -56552, -78129, -95309, -65478, -3233, 13484, -33464, -33903, -64168, -44400, -22579, 10713, 24147, 29878, 28154, 6859, -17468, -53546, -80075, -61943, -43331, 32843, 101276, 75710, 67651, 15309, -41920, -66434, -67342, -40079, -57404, -32131, 31523, 16652, 531, 10354, -7558, -28963, -65504, -84322, -79366, -64334, -60510, -55977, 17828, 13654, 174, 8774, 23274, 40488, 60607, 67929, 54496, 48832]
6941D8832o437j4498N173n426o917n0067j3818M4483K2720O093j8211K845J0294
6928B5066q197o1867k6335K9136P519L4211L410m1850j0576k566M6826L2023j5881
6915A0919M3708k4333n2384K1862K7705k7816j4252l1072M4197N7276j9772l9286
6903c248m3438m8928K4462k9108k2139J7271J870N8157J256K0933q529p792J6533
6890b2700M281o0436k8468K4123o992j2477N032O3091N6743J5290j7329m6716
6878b6558J679N7388j9119m949L9569J5739l8373k9219l3822K2922L7513j7324
6866E446K0074K2064l6819K9002J8027J0589k7286n8803Q533L7562o015m9946
6854b7572K5321K4823l3982j8132k6661m317K7912K899k8920L6461K6634r397
$$ y = [48832, 42395, 27897, 33070, 27644, 20727, -29340, -43158, 1325, 24045, 30138, 11927, 14772, 25066, 16869, -44998, -71333, -42197, -34678, -467, 2943, -38907, -49483, -52049, -5223, 26800, 10919, 54627, 30294, -22090, -228, 27477, -339, -14591, -45663, -1466, 55810, 36038, -3248, -46686, -95614, -71152, -100260, -122399, -105128, -103258, -45101, -43845, -22912, -31441, -39233, -22700, -18419, -78855, -107323, -83200, -90192, -102669, -97637, -34546, 22197, 37487, 20158, -26558, -24879, 32509, 13390, 8441, 48010, 63749, 25376, -3843, -37665, -14743, 22770, 5446, 25520, 47584, 10765, 39767, 57794, 68383, 41097, -17706, -9173, 28389, 22374, -27572, -2251, 22572, -11410, -29542, -56203, -60520, -32608, -29709, -58629, -22168, 4466, -4931]
6842d931k8443o37Q650M4343n615j6301L37l6971k410O698J3823j1441J3379M5071
6828B5552K9867M892Q122l2423k916n2693p052M2546K7172N920k2052k8553m0957
6815d2575j4145J8102j2536k875K5300K3947N449j0467K1618M6716k8179l491
6803B6864N562k6313K3879J3913k5962l8936K5731N3168l8294j5822K710J6801
6791B3301L0264m933k3262n1822J4018J6038R761P505k1480J0415j5299k7618
6779c3112O360L3239k8783K8187q428L101J1645L6625J1678m5445l4797J3574
6767f156J8789L7775N039l8885J3686m9456n7280J8713K7654j9372k1232j3666
6755h4391L0706o745r075K7292P612j2440J4290K2876R759j8395P646j4862n697
$$ y = [-4931, -33374, -34011, -25361, 18982, 13367, -2934, -2597, -39568, -41978, -35280, -21457, -32898, -19519, 25552, 55419, 60311, 68433, 36010, 33094, -19599, -26651, 15895, 43067, 48987, 26935, -1618, -42575, -56720, -38618, -51154, -54029, -28729, -4782, 667, -9800, 11818, 58534, 30355, 26864, 32426, 6113, 29992, 43905, 17943, -20993, 4738, 57906, 19612, 3790, 6500, 23301, 53565, 48632, 25370, -26452, -12434, 3604, 13365, 20870, -610, 9805, -5494, -33112, -26752, 6487, -22296, 5891, -2537, 564, 12209, 48834, 60512, 15067, -19730, -6156, 12633, 50408, 55447, 16562, 30248, -19208, -76488, -57775, -30121, -49493, -70725, -84391, -53685, -60430, -69505, -42213, -34601, -47041, -32751, -9875, -116, -18511, -10865, -25727, -31424]
6742c1424N2371K0278k864m7483l8411K106l8745j6502m384M5360R459J3620M3418
6729F799j182J7710P572l38M1996N573J4636J1251m3553j9764Q875M1659K5042
6716A16276n112m2547l5788j5602n6952l457J1090J7983j2432q408M7035k172
$$ y = [-31424, 20947, 41225, 38361, -9122, -47533, -45427, -84172, -100674, -105058, -59698, -50239, -36619, 6799, 5617, 23327, 30899, 30561, 72557, 78130, 92766, 104017, 60464, 40700, 49575, 91234, 116276, 111164, 68617, 32829, 17227, -39725, -43182, -32092, -14109, -26541, -34949, 12086, 9914]
$$ [...]
##END NTUPLES=NMR SPECTRUM
##END=
