##TITLE=Analysis number 315406
Compound Code cc 46602
Book Reference 441/181
Project Code ADRS
Chemist Name colinb
##JCAMPDX= 6.0         $$ Bruker NMR JCAMP-DX V2.0
##DATA TYPE= NMR SPECTRUM
##DATA CLASS= NTUPLES
##ORIGIN= Bruker BioSpin GmbH
##OWNER= NMR
$$ XWIN-NMR		Version 3.5
$$ Thu Nov 17 14:30:49 2005 GMT Standard Time (UT+0h)  MAYBRIDGE\NMR@NMR_250MHZ
##.OBSERVE FREQUENCY= 250.131544655141
##.OBSERVE NUCLEUS= ^1H
##.ACQUISITION MODE= SIMULTANEOUS (DQD)
##.ACQUISITION SCHEME= undefined
##.AVERAGES= 16
##.DIGITISER RES= 18
##SPECTROMETER/DATA SYSTEM= dpx250
##.PULSE SEQUENCE= zg30
##.SOLVENT NAME= CDCl3
##.SHIFT REFERENCE= (INTERNAL, CDCl3, 0, 16.4477)
##AUDIT TRAIL= $$ (NUMBER, WHEN, WHO, WHERE, WHAT)
$$ ##TITLE= Audit trail, XWIN-NMR		Version 3.5
$$ ##JCAMPDX= 5.01
$$ ##ORIGIN= Bruker BioSpin GmbH
$$ ##OWNER= NMR
$$ C:\u/data/dgb/nmr/ADRS/12620/pdata/1/auditp.txt
$$ ##AUDIT TRAIL=  $$ (NUMBER, WHEN, WHO, WHERE, WHAT)
(   1,<2005-11-17 14:30:27.00 +000>,<MAYBRIDGE\NMR>,<NMR_250MHZ>,
      <created by zg, POWCHK disabled, PULCHK disabled
       configuration hash MD5:
       62 19 C7 07 E1 42 D1 B7 37 6C 3D D0 77 39 F9 E6
       data hash MD5: 64K
       77 CC 3A 52 D5 B3 74 77 5F AE E0 D2 1C 2B 54 32>)
(   2,<2005-11-17 14:30:39.46 +000>,<MAYBRIDGE\NMR>,<NMR_250MHZ>,
      <Start of raw data processing
       ef LB = 0.3 FT_mod = 6 PKNL = 1 SI = 32K 
       data hash MD5: 32K
       B3 B2 A7 0A D1 48 76 E1 1A E2 1E 14 6E D8 0B C4>)
(   3,<2005-11-17 14:30:41.29 +000>,<MAYBRIDGE\NMR>,<NMR_250MHZ>,
      <apk 
       data hash MD5: 32K
       E1 68 6C 81 96 22 49 6E 35 62 0A AA A0 49 80 6E>)
(   4,<2005-11-17 14:30:42.04 +000>,<MAYBRIDGE\NMR>,<NMR_250MHZ>,
      <abs ABSG = 5 
       data hash MD5: 32K
       75 A8 82 27 98 65 F2 1B 57 86 34 93 75 7E 77 49>)
$$ ##END=
$$ 
$$ hash MD5
$$ 4E 98 DC A1 FB 30 7E FE 8A B8 31 94 D4 DA D9 E2
##$RELAX= 
##$RELAX= 
##$RELAX= 
##$RELAX= 
##$RELAX= 
##$RELAX= 
##$RELAX= 
$$ Bruker specific parameters
$$ --------------------------
##$DU= <C:\u>
##$EXPNO= 12620
##$NAME= <ADRS>
##$PROCNO= 1
##$TYPE= <nmr>
##$USER= <dgb>
##$AMP= (0..31)
100 100 100 100 100 100 100 100 100 100 100 100 100 100 100 100 100 100 
100 100 100 100 100 100 100 100 100 100 100 100 100 100 
##$AQSEQ= 0
##$AQ_mod= 3
##$AUNM= <au_zg>
##$AUTOPOS= <39 >
##$BF1= 250.13
##$BF2= 250.13
##$BF3= 250.13
##$BF4= 250.13
##$BF5= 500.13
##$BF6= 500.13
##$BF7= 500.13
##$BF8= 500.13
##$BYTORDA= 1
##$CFDGTYP= 0
##$CFRGTYP= 5
##$CHEMSTR= <none>
##$CNST= (0..31)
1 1 145 1 1 1 1 1 1 1 1 1 1 1 1 1 1 1 1 1 1 1 1 1 1 1 1 1 1 1 1 1 
##$CPDPRG= <>
##$CPDPRG1= <>
##$CPDPRG2= <>
##$CPDPRG3= <>
##$CPDPRG4= <mlev>
##$CPDPRG5= <mlev>
##$CPDPRG6= <mlev>
##$CPDPRG7= <mlev>
##$CPDPRG8= <mlev>
##$CPDPRGB= <>
##$CPDPRGT= <>
##$D= (0..31)
0 1 0 0 0 0 0 0 0 0.06 0 0 0 0 0 0 0.0002 0 0 0 0 0 0 0 0 0 0 0 0 0 0 
0 
##$DATE= 1132237826
##$DBL= (0..7)
120 120 120 120 120 120 120 120 
##$DBP= (0..7)
150 150 150 150 150 150 150 150 
##$DBP07= 0
##$DBPNAM0= <>
##$DBPNAM1= <>
$$ [...]
##$SUBNAM7= <"">
##$SUBNAM8= <"">
##$SUBNAM9= <"">
##$SW= 20.6930455092707
##$SWIBOX= (0..15)
0 0 3 0 0 0 0 0 0 0 0 0 0 0 0 0 
##$SW_h= 5175.983436853
##$TD= 65536
##$TD0= 1
##$TE= 294.16
##$TE2= 300
##$TE3= 300
##$TEG= 300
##$TL= (0..7)
0 120 120 120 120 120 120 120 
##$TP= (0..7)
150 150 150 150 150 150 150 150 
##$TP07= 0
##$TPNAME0= <>
##$TPNAME1= <>
##$TPNAME2= <>
##$TPNAME3= <>
##$TPNAME4= <>
##$TPNAME5= <>
##$TPNAME6= <>
##$TPNAME7= <>
##$TPOAL= (0..7)
0.5 0.5 0.5 0.5 0.5 0.5 0.5 0.5 
##$TPOFFS= (0..7)
0 0 0 0 0 0 0 0 
##$TUNHIN= 0
##$TUNHOUT= 0
##$TUNXOUT= 0
##$USERA1= <user>
##$USERA2= <user>
##$USERA3= <user>
##$USERA4= <user>
##$USERA5= <user>
##$V9= 5
##$VALIST= <valist>
##$VCLIST= <CCCCCCCCCCCCCCC>
##$VD= 0
##$VDLIST= <DDDDDDDDDDDDDDD>
##$VPLIST= <PPPPPPPPPPPPPPP>
##$VTLIST= <TTTTTTTTTTTTTTT>
##$WBST= 1024
##$WBSW= 4
##$XGAIN= (0..3)
0 0 0 0 
##$XL= 0
##$YL= 0
##$YMAX_a= 372508
##$YMIN_a= -393841
##$ZGOPTNS= <>
##$ZL1= 120
##$ZL2= 120
##$ZL3= 120
##$ZL4= 120
##$ABSF1= 16.44765
##$ABSF2= -4.245522
##$ABSG= 5
##$ABSL= 3
##$ALPHA= 0
##$AQORDER= 0
##$ASSFAC= 0
##$ASSFACI= 0
##$ASSFACX= 0
##$ASSWID= 0
##$AUNMP= <proc_1d>
##$AZFE= 0.1
##$AZFW= 0.1
##$BCFW= 0
##$BC_mod= 0
##$BYTORDP= 0
##$COROFFS= 0
##$CY= 12.5
##$DATMOD= 1
##$DC= 0
##$DFILT= <>
##$DTYPP= 0
##$F1P= 14.0000005364418
##$F2P= -0.99999901652339
##$FCOR= 0.5
##$FTSIZE= 32768
##$FT_mod= 6
##$GAMMA= 0
##$GB= 0
##$INTBC= 1
##$INTSCL= 1
##$ISEN= 128
##$LB= 0.3
##$LEV0= 0
##$LPBIN= 0
##$MAXI= 10000
##$MC2= 0
##$MEAN= 0
##$ME_mod= 0
##$MI= 0
##$NCOEF= 0
##$NC_proc= -3
##$NLEV= 6
##$NOISF1= 0
##$NOISF2= 0
##$NSP= 0
##$NTH_PI= 0
##$NZP= 0
##$OFFSET= 16.44765
##$PC= 1
##$PHC0= 86.70161
##$PHC1= 6.249839
##$PH_mod= 1
##$PKNL= yes
##$PPARMOD= 0
##$PSCAL= 4
##$PSIGN= 0
##$REVERSE= no
##$SF= 250.130018596258
##$SI= 32768
##$SIGF1= 0
##$SIGF2= 0
##$SINO= 400
##$SIOLD= 32768
##$SREGLST= <1H.CDCl3>
##$SSB= 0
##$STSI= 32768
##$STSR= 0
##$SW_p= 5175.98343685301
##$SYMM= 0
##$S_DEV= 0
##$TDeff= 65536
##$TDoff= 0
##$TI= <Analysis number 999999
Compound Code 99
Book Reference 9
Project Code 9>
##$TILT= no
##$TM1= 0
##$TM2= 0
##$TOPLEV= 0
##$USERP1= <user>
##$USERP2= <user>
##$USERP3= <user>
##$USERP4= <user>
##$USERP5= <user>
##$WDW= 1
##$XDIM= 32768
##$YMAX_p= 520700943
##$YMIN_p= -152796
$$ End of Bruker specific parameters
$$ ---------------------------------
##NTUPLES= NMR SPECTRUM
##VAR_NAME=  FREQUENCY,     SPECTRUM/REAL,   SPECTRUM/IMAG
##SYMBOL=    X,             R,               I
##VAR_TYPE=  INDEPENDENT,   DEPENDENT,       DEPENDENT
##VAR_FORM=  AFFN,          ASDF,            ASDF
##VAR_DIM=   32768,         32768,           32768
##UNITS=     HZ,            ARBITRARY UNITS, ARBITRARY UNITS
##FACTOR=    0.157963299565203, 1,           1
##FIRST=     4114.05122783894, 0,            0
##LAST=      -1061.93220901407, 0,           0
##MIN=       -1061.93220901407, -152796,     0
##MAX=       4114.05122783894, 520700943,    0
$$ Real data points
##PAGE= N=1
##DATA TABLE= (X++(R..R)), XYDATA
$$ [...]
$$ plain form
18971 23236665 19641203 17426918 16799178 17833243 19984559 21286344 20239053 17713877
18963 17713877 14957070 12510696 10615540 9331663 8537602 8071596 7929689 8064398 8430144
18954 8430144 9023699 9946431 11416348 13814748 18037284 24868205 31926359 34575976
18946 34575976 33161983 31400498 31267057 32975371 35214174 37273001 41402103 50577209
18938 50577209 63900183 72418998 70848504 64619581 57782306 51867450 48739091 49376678
18930 49376678 54709911 62726029 65340981 58181537 46680710 35837835 26727284 19908605
18922 19908605 15385407 12536304 10632093 9345801 8462568 7970599 7941186 8430766 9314340
18913 9314340 9819937 9216801 8022847 6813070 5623074 4614917 3946460 3451243 3092831
$$ packed form
18971B3236665l595462k214285o27740J034065K151316J301785j047291k525176
18963A7713877k756807k446374j895156j283877p94061m66006j41907J34709L65746
18954H430144N93555R22732J469917K398400M222536O830921P058154K649617
18946C4575976j413993j761485j33441J708314K238803K058827M129102R175106
18938E0577209J3322974Q518815j570494o228923o837275n914856l128359O37587
18930D9376678N333233Q016118K614952p159444j1500827j0842875r110551o818679
18922A9908605m523198k849103j904211j286292q83233m91969k9413M89580Q83574
18913I314340N05597o03136j193954j209777j189996j008157o68457m95217l58412
$$ plain form
18904 3092831 2815815 2551082 2338309 2123565 1938561 1790948 1680897 1595432 1494045 1396598
18894 1396598 1316824 1237025 1154899 1111855 1086681 1092524 1076249 1105355 1120421 1099450 1014179
18883 1014179 955260 878228 836196 826136 851105 959004 1120154 1295537 1491473 1585718
18873 1585718 1547359 1443390 1274809 1071060 860082 730960 624894 550727 544056 536269
18863 536269 454172 373822 382437 396817 414634 407766 408039 350632 333695 331023 330071 370251 353794
18850 353794 350102 388760 407521 451583 468249 428371 379986 308939 231800 186931 193222 236550
18838 236550 266900 288478 325839 321101 352236 400699 431979 440429 426876 425972 397209 363287
18826 363287 336996 316448 295834 275891 273668 240488 208506 200893 150561 92084 114869 184818
$$ packed form
18904C092831k77016k64733k12773k14744j85004j47613j10051q5465j01387r7447
18894A396598p9774p9799q2126m3044k5174N843j6275K9106J5066k0971q5271
18883A014179n8919p7032m2032j0060K4969J07899J61150J75383J95936R4245
18873A585718l8359j03969j68581k03749k10978j29122j06066p4167o671p787
18863E36269q2097q0350Q615J4380J7817o868K73n7407j6937k672r52M0180j6457
18850C53794l692L8658J8761M4062J6666l9878m8385p1047p7139m4869O291M3328
18838B36550L0350K1578L7361m738L1135M8463L1280Q450j3553r04k8763l3922
18826C63287k6291k0548k0614j9943k223l3180l1982p613n0332n8477K2785O9949
$$ plain form
18814 184818 237607 221643 174525 186815 211204 205510 184843 195947 201861 168370 154501 140925
18802 140925 142265 131097 99253 158531 201593 189452 175344 193649 252400 244611 233486 212513
18790 212513 185494 166832 146991 137737 163409 179441 189325 171846 179530 223471 283334 298970
18778 298970 278443 259632 240375 214314 199071 180791 170433 189563 203487 202118 230799 287685
18766 287685 303050 344372 471349 530016 488951 394483 342222 300769 251670 183041 149098
18755 149098 116973 108990 132374 147546 127913 114560 95921 63197 25783 12047 77721 112725
18743 112725 83840 103415 179462 196986 193639 193948 169195 183204 237250 241659 259648 258585
18731 258585 260450 260408 199032 127384 123772 127843 92922 88317 136934 162780 138077 100231 62778
$$ packed form
18814A84818N2789j5964m7118J2290K4389n694k0667J1104N914l3491j3869j3576
18802A40925J340j1168l1844N9278M3062j2141j4108J8305N8751p789j1125k0973
18790B12513k7019j8662j9841r254K5672J6032R884j7479P684M3941N9863J5636
18778B98970k0527j8811j9257k6061j5243j8280j0358J9130J3924j369K8681N6886
18766B87685J5365M1322J26977N8667m1065r4468n2261m1453m9099o8629l3943
18755A49098l2125p983K3384J5172j9633j3353j8639l2724l7414j3736O5674L5004
18743A12725k8885J9575P6047J7524l347L09k4753J4009N4046M409J7989j063
18731B58585J865m2o1376p1648l612M071l4921m605M8617K5846k4703l7846l7453
$$ plain form
18718 62778 57635 86998 76797 63195 51265 45579 81618 103754 105825 108933 81697 71085
18706 71085 55074 73978 12768 25856 57352 71809 63227 58212 98233 121381 128742 115143
18694 115143 80811 88997 36378 51378 64472 105563 147889 135772 117963 140412 90529 58842
18682 58842 51347 78378 90553 73309 31816 11358 34779 46625 65556 73326 51847 17978
18670 17978 15783 43533 24684 55837 84193 70552 92584 126592 118716 91688 113800 135841
18658 135841 124834 59407 14390 51027 75277 86690 60479 59695 8838 -21571 2953 33095
18646 33095 69977 118245 79851 64213 91760 120525 98275 90132 104011 94241 85837 115176
18634 115176 135392 146203 149333 138587 110985 95191 109861 95519 115102 143815 86069 102132
$$ packed form
18718F2778n143K9363j0201j3602j1930n686L6039K2136K071L108k7236j0612
18706G1085j6011J8904o1210J3088L1496J4457q582n015M0021K3148P361j3599
18694A15143l4332Q186n2619J5000J3094M1091M2326j2117j7809K2449m9883l1687
18682E8842p495K7031J2175j7244m1493k0458K3421J1846J8931P770k1479l3869
18670A7978k195K7750j8849L1153K8356j3641K2032L4008p876k7028K2112K2041
18658A35841j1007o5427m5017L6637K4250J1413k6211p84n0857l0409K4524L0142
18646C3095L6882M8268l8394j5638K7547K8765k2250q143J3879r770q404K9339
18634A15176K0216J0811L130j0746k7602j5794J4670j4342J9583K8713n7746J6063
$$ plain form
18622 102132 125745 132292 145406 134158 86659 76968 85905 87698 53280 29015 13900 27061
18610 27061 54236 37974 22862 42024 29141 59981 72358 56853 15491 27989 76665 102692
18598 102692 142659 141385 122348 136290 99063 38985 44382 79378 51892 44265 69073 75322
18586 75322 89038 114776 127664 100024 118208 93341 69560 104737 105227 58881 14974 30168
18574 30168 49477 41907 7181 16766 45033 34268 32839 53852 59341 56168 63767 127298 126934
18561 126934 104528 133248 164986 162357 100061 83482 147339 159430 132973 110021 78504 111556
18549 111556 124417 112313 108012 135015 111401 86172 115350 131684 148823 109008 60132 87331
18537 87331 43874 14833 43860 76942 87975 83761 90852 150866 185456 156312 134269 99760
$$ packed form
18622A02132K3613O547J3114j1248m7499r691Q937J793l4418k4265j5115J3161
18610B7061K7175j6262j5112J9162j2883L0840J2377j5505m1362J2498M8676K6027
18598A02692L9967j274j9037J3942l7227o0078N397L4996k7486p627K4808O249
18586G5322J3716K5738J2888k7640J8184k4867k3781L5177M90m6346m3907J5194
18574C0168J9309p570l4726R585K8267j0765j429K1013N489l173P599O3531l64
18561A26934k2406K8720L1738k629o2296j6579O3857J2091k6457k2952l1517L3052
18549A11556J2861j2104m301K7003k3614k5229K9178J6334J7139l9815m8876K7199
18537H7331m3457k9041K9027L3082J1033m214P091O0014L4590k9144k2043l4509
$$ plain form
18525 99760 108124 101313 114454 147427 164729 145830 158394 182752 221882 256203 259510 266292
18513 266292 260043 252706 224998 204798 210306 253161 322091 339393 342500 329125 316285 332482
18501 332482 361074 377048 363372 344748 358866 386545 406340 396592 356820 310769 281072 212858
18489 212858 169683 209873 257471 271386 255031 292453 287400 304439 339929 353848 381741 426961
18477 426961 415490 424822 438353 458752 460885 480524 498765 506595 519635 577939 620556 644538
18465 644538 695584 734388 795175 816122 773024 791486 833488 851883 922450 1065734 1174717
18454 1174717 1326472 1455003 1582599 1746430 1955192 2196953 2558535 3003147 3532643
18445 3532643 4372444 5729139 7956824 11273472 15328107 18634595 19228352 17307872
$$ packed form
18525I9760Q364o811J3141L2973J7302j8899J2564K4358L9130L4321L307O782
18513B66292o249p337k7708k0200N508M2855O8930J7302L107j3375j2840J6197
18501C32482K8592J5974j3676j8624J4118K7679J9795r748l9772m6051k9697o8214
18489B12858m3175M0190M7598J3915j6355L7422n053J7039L5490J3919K7893M5220
18477D26961j1471R332J3531K0399K133J9639J8241P830J3040N8304M2617K3982
18465F44538N1046L8804O0787K0947m3098J8462M2002J8395P0567J43284J08983
18454A174717J51755J28531J27596J63831K08762K41761L61582M44612N29496
18445C532643Q39801J356695K227685L316648M054635L306488N93757j920480
$$ plain form
18437 17307872 14693544 12429154 10873297 10304892 11021276 13294140 17203968 21183646
18429 21183646 23762196 25884816 27354054 25641371 21510681 17406230 13903311 11244394
18421 11244394 9682109 9123227 9440497 10744653 12556636 13293350 12289828 10596412
18413 10596412 8909946 7426257 6394172 5814118 5593298 5464001 5514473 5685376 5956074
18404 5956074 6520114 7526858 9294734 11525724 13142563 14021654 14842927 15488795 15743477
18395 15743477 16145510 17528823 20756818 26931474 36530879 46298247 51318059 52930490
18387 52930490 56735104 65960608 76744732 79439515 71396237 58892232 46979396 37343956
18379 37343956 31183052 28718893 29506359 31935049 32945378 31946964 31121052 31280662 30442351
$$ packed form
18437A7307872k614328k264390j555857n68405P16384K272864L909828L979678
18429B1183646K578550K122620J469238j712683m130690m104451l502919k658917
18421A1244394j562285n58882L17270J304156J811983P36714j003522j693416
18413A0596412j686466j483689j032085n80054k20820j29297N0472J70903K70698
18404E956074N64040J006744J767876K230990J616839Q79091Q21273O45868K54682
18395A5743477M02033J383313L227995O174656R599405R767368N019812J612431
18387E2930490L804614R225504J0784124K694783q043278j2504005j1912836r635440
18379C7343956o160904k464159P87466K428690J010329r98414q25912J59610q38311
$$ plain form
18370 30442351 27053444 22482089 18240270 14720404 11965169 10006616 8754159 7937118
18362 7937118 7349507 6946092 6720275 6631707 6661187 6751130 6960719 7335913 7931369 8755805
18352 8755805 10014363 11983811 15142625 20043384 25753684 29054147 28885046 27290808
18344 27290808 26019350 26305886 29514598 36777251 46842245 55451739 59569566 58590545
18336 58590545 55412854 53670342 51997384 46502780 38404356 30860899 24749076 20273861
18328 20273861 17530239 16106169 15488277 15515849 16426380 18053973 19563128 21069396 23940297
18319 23940297 28726972 33102979 34132173 32778108 31409213 31050779 32733500 37679604
18311 37679604 47255739 64876778 96616053 144313314 191107877 206376223 184124241
$$ packed form
18370C0442351l388907m571355m241819l519866k755235j958553j252457q17041
18362G937118n87611m03415k25817q8568K9480Q9943K09589L75194N95456Q24436
18352H755805J258558J969448L158814M900759N710300L300463j69101j594238
18344B7290808j271458K86536L208712P262653J0064994Q609494M117827r79021
18336E8590545l177691j742512j672958n494604q098424p543457o111823m475215
18328B0273861k743622j424070o17892K7572R10531J627593J509155J506268K870901
18319B3940297M786675M376007J029194j354065j368895l58434J682721M946104
18311C7679604R576135J7621039L1739275M7697261M6794563J5268346k2251982
$$ plain form
18304 184124241 146599713 110412561 80692631 60242286 49412611 45638427 43702397
18297 43702397 39268087 33169572 27496392 22644922 18819260 15963109 13840377 12258739
18289 12258739 11150253 10342120 9877705 9705476 9871181 10463606 11663182 13759673 15580907
18280 15580907 15466928 13812741 11863616 10073195 8674347 7839813 7499809 7499688 7794887
18271 7794887 8469262 9780638 12212809 16179570 20998309 25773694 30353626 34097472
18263 34097472 35814767 34108426 29514999 24481866 20455133 17122752 14074462 11363501
18255 11363501 9173202 7487151 6197739 5316503 4674590 4223552 3909282 3704903 3621812
18246 3621812 3620470 3865362 4396026 5288284 6288830 6623888 6092514 5228099 4357424 3575151
$$ packed form
18304A84124241l7524528l6187152k9719930k0450345j0829675l774184j936030
18297D3702397m434310o098515n673180m851470l825662k856151k122732j581638
18289A2258739j108486q08133m64415j72229J65705N92425J199576K096491J821234
18280A5580907j13979j654187j949125j790421j398848q34534l40004j21K95199
18271G794887O74375J311376K432171L966761M818739M775385M579932L743846
18263C4097472J717295j706341m593427n033133m026733l332381l048290k710961
18255A1363501k190299j686051j289412q81236o41913m51038l14270k04379q3091
18246C621812j342K44892N30664Q92258J000546L35058n31374q64415q70675p82273
$$ plain form
18236 3575151 2988150 2632854 2477429 2391897 2375040 2491516 2752618 3269007 4220408 5529937
18226 5529937 6367069 6192992 5533114 4911950 4412793 4322823 4852886 6275179 8407519
18217 8407519 9693039 9168643 7732017 6290268 5057449 4173445 3879604 4157198 4748392
18208 4748392 4951306 4496781 3718558 2963974 2319222 1794181 1470355 1298914 1168065
18199 1168065 1032233 943860 883238 812505 750741 693702 659289 612692 542448 478083 431795
18188 431795 409755 432201 469851 555608 540980 514622 443359 405792 385154 356833 337169
18177 337169 354129 319171 331452 364110 397475 379541 351150 355258 324357 283188 260205 300677
18165 300677 284632 288607 324156 322214 328245 324314 312525 283693 300515 338273 365741 393217
$$ packed form
18236C575151n87001l55296j55425q5532j6857J16476K61102N16389R51401J309529
18226E529937Q37132j74077o59878o21164m99157q9970N30063J422293K132340
18217H407519J285520n24396j436626j441749j232819q84004k93841K77594N91194
18208D748392K02914m54525p78223p54584o44752n25041l23826j71441j30849
18199A168065j35832q8373o0622p0733o1764n7039l4413m6597p0244o4365m6288
18188D31795k2040K2446L7650Q5757j4628k6358p1263l7567k0638k8321j9664
18177C37169J6960l4958J2281L2658L3365j7934k8391M108l0901m1169k2983M0472
18165C00677j6045L975L5549j942O031l931j1789k8832J6822L7758K7468K7476
$$ plain form
18153 393217 403869 357619 338304 317035 328679 292945 266002 248933 289089 341930 305734
18142 305734 354409 413836 401612 379130 404197 413400 466709 517654 542294 573356 616901 674576
18130 674576 756049 849156 913929 998454 1051597 1135702 1292241 1502172 1750582 2058935 2624604
18119 2624604 3594391 5006929 6225102 6521932 6395270 6434075 6726756 7447077 8848487
18110 8848487 11346008 15890107 24913676 43884305 72814067 86439017 75240309 57419272
18102 57419272 41865098 28134671 18522255 12890980 9631978 7630309 6273673 5305874
18094 5305874 4540635 3956292 3443347 3054896 2753110 2460670 2204355 2049724 1907653
18085 1907653 1722849 1540810 1409938 1249093 1151619 1104503 1051705 987261 933939 872601
$$ packed form
18153C93217J0652m6250j9315k1269J1644l5734k6943j7069M0156N2841l6196
18142C05734M8675N9427j2224k2482K5067R203N3309N0945K4640L1062M3545N7675
18130F74576Q1473R3107O4773Q4525N3143Q4105J56539K09931K48410L08353N65669
18119B624604R69787J412538J218173K96830j26662L8805K92681P20321J401410
18110H848487K497521M544099R023569J8970629K8929762J3624950j1198708j7821037
18102E7419272j5554174j3730427r612416n631275l259002k001669j356636r67799
18094E305874p65239n84343n12945l88451l01786k92440k56315j54631j42071
18085A907653j84804j82039j30872j60845r7474m7116n2798o4444n3322o1338
$$ plain form
18075 872601 758163 689521 650096 606093 581137 561666 558631 531114 490538 498896 550412 575000
18063 575000 577696 551218 521747 465920 442848 405470 381443 379214 355633 327990 312742 285186
18051 285186 268849 249839 257869 221479 212666 205109 202231 194375 172642 156674 134646 123149
18039 123149 123427 127198 141364 148644 156934 172446 202388 194957 186281 157183 136185 135478 126500
18026 126500 139182 172130 168121 143290 132909 141023 114682 92733 109340 117919 87473 104579
18014 104579 96916 104146 95179 80822 130022 186664 192687 238285 215227 196139 148869 134827
18002 134827 112453 168501 212652 235277 243010 247848 222397 184888 189365 197201 262690 264161
17990 264161 247775 210951 208628 213128 146824 115979 149786 172487 139989 77289 79405 123586
$$ packed form
18075H72601j14438o8642l9425m4003k4956j9471l035k7517m0576Q358N1516K4588
18063E75000K696k6478k9471n5827k3072l7378k4027k229k3581k7643j5248k7556
18051B85186j6337j9010Q030l6390q813p557k878p856k1733j5968k2028j1497
18039A23149K78L771J4166P280Q290J5512K9942p431q676k9098k0998p07q978
18026A26500J2682L2948m009k4831j0381Q114k6341k1949J6607Q579l0446J7106
18014A04579p663P230q967j4357M9200N6642O023M5598k3058j9088m7270j4042
18002A34827k2374N6048M4151K2625P733M838k5451l7509M477P836O5489J471
17990B64161j6386l6824k323M500o6304l0845L3807K2701l2498o2700K116M4181
$$ plain form
17978 123586 96706 69240 69661 66457 64567 94218 96194 85192 108632 143761 130839 140099 110184
17965 110184 114029 139758 139915 150458 173620 185851 159211 135181 132338 118801 112550 116670 95244
17952 95244 113373 120095 114538 93641 104085 112827 81237 103425 138037 162047 137065 68962
17940 68962 43813 59250 92021 110774 83882 33128 18119 42021 70918 88608 79654 49473
17928 49473 58810 64080 115569 152546 228895 280741 248375 210677 206569 193974 200917 201918 162438
17915 162438 142474 186663 243721 242717 206735 182554 213095 206849 206621 195320 188699 171208
17903 171208 172329 175585 149071 151368 162336 121631 99049 119652 112376 62282 53260 73315
17891 73315 83607 76487 107996 95694 81824 118240 127951 97699 61163 70885 82020 73680
$$ packed form
17978A23586k6880k7466M21l204j890K9651J976j1002K3440L5129j2922R260k9915
17965A10184L845K5729J57J0543K3162J2231k6640k4030k843j3537o251M120k1426
17952I5244J8129O722n557k0897J0444Q742l1590K2188L4612K4010k4982o8103
17940F8962k5149J5437L2771J8753k6892n0754j5009K3902K8897J7690q954l0181
17928D9473R337N270N1489L6977P6349N1846l2366l7698m108j2595O943J001l9480
17915A62438j9964M4189N7058j004l5982k4181L0541o246k28j1301o621j7491
17903A71208J121L256k6514K297J0968m0705k2582K0603p276n0094r022K0055
17891G3315J0292p120L1509j2302j3870L6416R711l0252l6536R722J1135q340
$$ plain form
17879 73680 123870 208107 238382 240712 224314 227079 229215 207361 268968 334286 342899 318741
17867 318741 277394 262250 215003 144024 108560 150271 190353 247011 253890 288995 322209 253839
17855 253839 214132 152427 144029 175404 140981 87771 49048 88617 88643 54424 48476 39197 22469
17842 22469 65102 56499 52809 39904 15922 10106 29533 42712 53921 110534 131016 107547
17830 107547 80548 129606 141286 169031 182832 184693 196722 222236 185201 156967 124656 112629
17818 112629 121362 201298 242861 309037 313618 276991 290582 254018 178874 153517 199647 210572
17806 210572 182681 174657 174949 136897 137104 113723 114838 130959 156051 149708 103601 56664 -5587
17793 -5587 28634 22404 3657 -23814 14304 101124 153612 114561 68412 84004 96748 81457
$$ packed form
17879G3680N0190Q4237L0275K330j6398K765K136k1854O1607O5318Q613k4158
17867C18741m1347j5144m7247p0979l5464M1711M0082N6658O879L5105L3214o8370
17855B53839l9707o1705q398L1375l4423n3210l8723L9569K6l4219n948r279j6728
17842B2469M2633q603l690j2905k3982n816J9427J3179J1209N6613K0482k3469
17830A07547k6999M9058J1680K7745J3801J861J2029K5514l7035k8234l2311j2027
17818A12629Q733P9936M1563O6176M581l6627J3591l6564p5144k5357M6130J0925
17806B10572k7891q024K92l8052K07k3381J115J6121K5092o343m6107m6937o2251
17793e587L4221o230j8747k7471L8118Q6820N2488l9051m6149J5592J2744j5291
$$ plain form
17781 81457 28507 9812 37974 72657 32191 -26471 -47522 -24929 -1647 63810 100009 124026
17769 124026 127567 103074 98941 85802 87451 127218 165440 207112 211661 215982 165419 118085
17757 118085 110932 104108 163649 198476 177701 151487 108543 136801 176314 136085 106789 86133
17745 86133 87160 109928 142062 150577 110932 74144 100549 114602 157363 228472 348984 531535
17733 531535 738588 821239 817425 677931 492005 332033 258104 248624 236125 195956 184387
17722 184387 177372 148101 111234 90107 108124 145963 177554 147712 172676 178281 151539 122019
17710 122019 97008 95818 73023 28537 -26222 15385 57065 20133 3624 64189 42247 52585
17698 52585 28823 35585 34469 100470 127444 96761 95046 79614 67599 83196 82132 19784
$$ packed form
17781H1457n2950j8695K8162L4683m0466n8662k1051K2593K3282O5457L6199K4017
17769A24026L541k4493m133j3139J649L9767L8222M1672M549M321n0563m7334
17757A18085p153o824N9541L4827k0775k6214m2944K8258L9513m0229k9296k0656
17745H6133J027K2768L2134Q515l9645l6788K6405J4053M2761P1109J20512J82551
17733E31535K07053Q2651l814j39494j85926j59972p3929r480j2499m0169j1569
17722A84387p015k9271l6867k1127J8017L7839L1591k9842K4964N605k6742k9520
17710A22019k5011j190k2795m4486n4759M1607M1680l6932j6509O0565k1942J0338
17698E2585k3762O762j116O6001K6974l0683j715j5432j2015J5597j064o2348
$$ plain form
17686 19784 10145 35183 28660 -22725 -18971 -13394 -21049 -53898 -49214 -23852 10323 50228 41218
17673 41218 42919 46836 4966 -24381 -16922 -45240 -58757 -36592 -33942 -39537 -14214 -8285 2418
17660 2418 -14829 13560 -8371 -11648 -1444 2680 -52278 -75471 -43766 -23511 -45112 -36852
17648 -36852 -30876 -14529 6811 8603 8293 34692 -17181 -40047 12878 48896 47668 20225 3083
17635 3083 -57706 -113763 -86295 -111818 -74013 -44504 -38083 -1904 -11819 -42208 -24156 27945
17623 27945 21758 31604 41762 34000 60226 72301 90449 41558 18221 40963 53565 17033
17611 17033 3075 23796 18797 -37946 -39842 -28197 81 39098 9571 -13463 -49628 -19442
17599 -19442 2011 10467 -17887 35826 26421 -3093 -8422 31360 -8791 -7996 -27824 -50941 -7092
$$ packed form
17686A9784r639K5038o523n1385L754N577p655l2849M684K5362L4175L9905r010
17673D1218J701L917m1870k9347P459k8318j3517K2165K650n595K5323N929J0703
17660B418j7247K8389k1931l277J0204M124n4958k3193L1705K0255k1601Q260
17648c6852N976J6347K1340J792l10K6399n1873k2866N2925L6018j228k7443j7142
17635C083o0789n6057K7468k5523L7805K9509O421L6179r915l0389J8052N2101
17623B7945o187R846J0158p762K6226J2075J8148m8891k3337K2742J2602l6532
17611A7033j3958K0721m999n6743j896J1645K8278L9017k9527k3034l6165L0186
17599a9442K1453Q456k8354N3713r405k9514n329L9782m0151P95j9828k3117M3849
$$ plain form
17586 -7092 57041 59433 64935 54116 78578 99170 62512 52955 36060 -14177 -24298 -38470
17574 -38470 -40605 -59628 -99584 -93510 -56683 -52605 -48965 -56297 -22728 17016 30482 10172 -23702
17561 -23702 -18485 -26983 -7401 10484 28928 -8823 -32963 -34786 20456 -33976 -33834 95 17557
17548 17557 20096 21284 50305 44956 -11750 6156 27026 12648 20113 55592 70469 91945
17536 91945 71097 68154 117931 108738 37586 -9968 -22520 -16103 -10090 -29164 -41685 -22610
17524 -22610 3004 -14484 -4258 -7721 -14518 -3876 -11454 -23133 -10846 5168 -10684 -4156
17512 -4156 24882 32452 81694 62226 20313 14166 33391 26272 18746 11742 23963 -9725 -38193
17499 -38193 -51848 -54193 -22340 -26662 -21648 3971 41950 63565 64235 43066 34286 48279 48649
$$ packed form
17586g092O4133K392N502j0819K4462K0592l6658r557j6895n0237j0121j4172
17574c8470k135j9023l9956O074L6827M078L640p332L3569L9744J3466k0310l3874
17561b3702N217q498J9582J7885J8444l7751k4140j823N5242n4432J42L3929J7462
17548A7557K539J188K9021n349n6706J7906K0870j4378P465L5479J4877K1476
17536I1945k0848k943M9777r193p1152m7554j2552O417O013j9074j2521J9075
17524b2610K5614j7488J0226l463o797J0642p578j1679J2287J6014j5852O528
17512d156K9038P570M9242j9468m1913o147J9225p119p526p004J2221l3688k8468
17499c8193j3655k345L1853m322N014K5619L7979K1615O70k1169q780J3993L70
$$ plain form
17486 48649 25100 13637 -8700 21247 52127 56781 40357 75130 71119 81529 43710 -12162
17474 -12162 -30899 -49543 -31601 -37032 -73228 -10240 11687 5229 9646 29841 44204 14371
17462 14371 -14615 -2300 10962 6254 -22111 -34040 -28153 -39400 -8902 22729 18130 -2163
17450 -2163 1345 22866 69892 85046 93314 96453 105244 131019 149789 209120 341266 454896
17438 454896 480628 380813 294598 230179 172061 99305 95682 62051 44679 26118 11529 20419
17426 20419 23541 32242 -12029 -50341 -23384 11719 3129 -51835 -71233 -23406 -12433 -2896
17414 -2896 12560 2192 3998 30646 20703 14704 -17662 -9447 1437 -1777 -3969 -1842 -41534
17401 -41534 7800 26003 34072 38019 13876 -5480 652 43061 22643 -6393 1515 5737 3210
$$ packed form
17486D8649k3549j1463k2337K9947L0880M654j6424L4773m011J0410l7819n5872
17474a2162j8737j8644J7942n431l6196O2988K1927o458M417K0195J4363k9833
17462A4371k8986J2315J3262m708k8365j1929N887j1247L0498L1631m599k0293
17450b163L508K1521M7026J5154Q268L139Q791K5775J8770N9331J32146J13630
17438D54896K5732r9815q6215o4419n8118p2756l623l3631j7372j8561j4589Q890
17426B0419L122Q701m4271l8312K6957L5103q590n4964j9398M7827J0973R537
17414b896J5456j0368J806K6648r943n999l2366Q215J0884l214k192K127l9692
17401d1534M9334J8203Q069L947k4143j9356O132M2409k0418k9036P908M222k527
$$ plain form
17388 3210 7396 1464 -3581 7165 13207 16707 11380 -19876 -9463 -7300 -14484 5482 19802
17375 19802 57690 87263 52553 34383 17642 -31582 -53556 -86402 -107809 -67139 -33533 -26587
17363 -26587 -34407 -39579 -22447 -30563 -42454 -52238 -56529 -44644 2860 68406 107622 69289 18427
17350 18427 -9193 -48574 -57566 -80611 -84399 -78595 -78999 -82010 -73696 -41019 -3719 2403 20479
17337 20479 30796 29778 43121 20705 -39246 -47450 -27952 -32030 -5923 19538 -17238 -47338
17325 -47338 -36985 1846 -13874 -23240 -11409 -11198 18250 18258 26502 18247 -25534 -66335 -14477
17312 -14477 14988 43813 -8303 8369 -36349 -52289 -23624 -8414 -2262 10862 16493 6874
17300 6874 18018 -1816 32715 34078 20179 21165 2903 -3293 17144 62163 73600 67079 62192
$$ packed form
17388C210M186n932n045J0746O042L500n327l1256J0413K163p184J9966J4320
17375A9802L7888K9573l4710j8170j6741m9224k1974l2846k1407M0670L3606O946
17363b6587p820n172J7132q116j1891r784m291J1885M7504O5546L9216l8333n0862
17350A8427k7620l9381q992k3045l788N804m04l011Q314L2677L7300O122J8076
17337B0479J0317j018J3343k2416n9951q204J9498m078K6107K5461l6776l0100
17325d7338J0353L8831j5720r366J1831K11K9448QQ244q255m3781m0801N1858
17312a4477K9465K8825n2116J6672m4718j5940K8665J5210O152J3124N631r619
17300F874J1144j9834L4531J363j3899R86j8262o196K0437M5019J1437o521m887
$$ plain form
17287 62192 57060 49491 911 6055 38733 40131 29778 46496 9116 32641 41766 21387 -8902
17274 -8902 -11314 -6788 17714 9983 12776 12362 3656 5950 14580 -22295 -40039 -2189 -6343 -12872
17260 -12872 -15619 -31156 -17712 -41686 -43609 -1339 13130 -6810 2271 4820 -3621 6594 16871
17247 16871 19060 5550 48703 53188 52274 53442 83223 18560 -32536 -36643 -27892 -4350 36389
17234 36389 39257 54631 65344 64054 24884 9854 34185 63251 16445 -31922 -21704 15369
17222 15369 59793 21585 -10726 19886 -61356 -81291 -39256 -33660 -50639 -59102 -39274 -21885
17210 -21885 -19601 -14264 23780 51025 7392 -15028 4779 -5752 -10234 8723 22386 19912
17198 19912 38248 17519 -15966 -28493 -35533 -20129 43138 36433 24416 49488 84664 63070
$$ packed form
17287F2192n132p569m8580N144L2678J398j0353J6718l7380K3525R125k0379l0289
17274h902k412M526K4502p731K793m14q706K294Q630l6875j7744L7850m154o529
17260a2872k747j5537J3444k3974j923M2270J4469j9940R081K549q441J0215J0277
17247A6871K189j3510M3153M485r14J168K9781o4663n1096m107Q751K3542M0739
17234C6389K868J5374J0713j290l9170j5030K4331K9066m6806m8367J0218L7073
17222A5369M4424l8208l2311L0612q1242j9935M2035N596j6979q463J9828J7389
17210b1885K284N337L8044K7245m3633k2420J9807j0531m482J8957J3663k474
17198A9912J8336k0729l3485j2527p040J5404O3267o705j2017K5072L5176k1594
$$ plain form
17186 63070 31339 -5861 -30071 -11357 8718 -21112 -68306 -62569 -81984 -117439 -87331 -14391
17174 -14391 17868 18386 17455 36565 23683 22554 30624 12249 -30371 -56432 -43746 -16082 -33262
17161 -33262 -27588 -39892 -39739 -31722 -13871 -14391 -22899 -60731 -82029 -72177 -63264 -27880 -27810 -74343
17147 -74343 -57468 -30740 -887 8707 -12203 -35038 -34234 -22061 11308 -7580 -601 24119
17135 24119 69541 48790 -1416 15857 15701 13589 29954 24132 17144 50741 46331 51510 15861
17122 15861 -36041 -10916 2738 -14036 -21142 -3771 25982 64974 103959 98614 87684 47651
17110 47651 42900 49068 37270 26318 45233 51662 25322 18874 27748 83076 67759 20833 22379
17097 22379 -3673 -31103 -55241 -82234 -53671 -26189 -16751 -15611 -29094 -20902 -20169 20852 47617
$$ packed form
17186F3070l1731l7200k4210J8714K0075k9830m7194N737j9415l5455L0108P2940
17174a4391L2259N18r31J9110j2882j129Q070j8375m2620k6061J2686K7664j7180
17161c3262N674j2304J53Q017J7851n20q508l7832k1298R852Q913L5384P0m6533
17147g4343J6875K6728K9853R594k0910k2835Q04J2173L3369j8888O979K4720
17135B4119M5422k0751n0206J7273j56k112J6365n822o988L3597m410N179l5649
17122A5861n1902K5125J3654j6774p106J7371K9753L8992L8985n345j0930m0033
17110D7651m751O168j1798j0952J8915O429k6340o448Q874N5328j5317m6926J546
17097B2379k6052k7430k4138k6993K8563K7482R438J140j3483Q192P33M1021K6765
$$ plain form
17084 47617 10894 -30004 -45582 -22414 4167 -28257 -52260 -93634 -99458 -7028 38186 42820
17072 42820 37867 40936 5875 -7944 -17750 8803 19064 -2089 -25690 -58499 -50910 -32464
17060 -32464 -18746 -31921 -42635 -31056 -7921 -31812 -13611 1329 8496 13553 19218 28499
17048 28499 33092 1888 -40490 -23660 21336 26662 35507 2451 -1596 -25790 -76153 -68057 -57361
17035 -57361 -68472 -65206 -40200 -20495 1901 -5241 -55689 -31122 -15698 -33489 21727 53211
17023 53211 84459 55416 48425 12581 -32350 -50028 -44404 -61590 -65639 -81571 -88299 -104824
17011 -104824 -92055 -61623 -15889 6487 -2901 28676 56477 52420 -10326 -16377 -9524 -24632
16999 -24632 1654 22182 5845 -26451 -63524 -61268 -28825 5718 -13873 -12171 -3051 23144
$$ packed form
17084D7617l6723m0898j5578K3168K6581l2424k4003m1374n824R2430M5214M634
17072D2820m953L069l5061j3819r806K6553J0261k1153k3601l2809P589J8446
17060c2464J3718j3175j0714J1579K3135k3891J8201J4940P167N057N665R281
17048B8499M593l1204m2378J6830M4996N326Q845l3056m047k4194n0363Q096J0696
17035e7361j1111L266K5006J9705K2396p142n0448K4567J5424j7791N5216L1484
17023E3211L1248k9043o991l5844m4931j7678N624j7186m049j5932o728j6525
17011a04824J2769L0432M5734K2376r388L1577K7801m057o2746o051O853j5108
16999b4632K6286K0528j6337l2296l7073K256L2443L4543j9591J702R120K6195
$$ plain form
16987 23144 26087 -1122 -9830 17791 40715 74558 47399 52178 64062 83501 47471 29927
16975 29927 475 -69688 -78390 -84052 -71758 -37175 -10483 3825 35652 23378 -23089 -40795
16963 -40795 -8499 2446 -58033 -90688 -48892 7512 22612 10973 15145 19618 18747 23654 -12826
16950 -12826 -12228 -69103 -97989 -107512 -91742 -24529 13355 -501 -40072 -26195 -72659 -80159
16938 -80159 -15177 19240 9239 -1628 3051 27218 -12897 -5518 -8263 -25776 -16714 2956
16926 2956 27373 38192 8999 27658 24919 -38605 -34819 -37312 -39261 -6511 -33280 -71919 -104491
16913 -104491 -123345 -99740 -70526 -28523 -31533 -30838 -18659 -56941 -68326 -49204 -29856 18544
16901 18544 32043 29114 57599 39080 24275 -31798 -30934 18125 25757 -14814 -28031 -38556
$$ packed form
16987B3144K943k7209q708K7621K2924L3843k7159M779J1884J9439l6030j7544
16975B9927k9452p0163q702n662J2294L4583K6692J4308L1827j2274m6467j7706
16963d0795L2296J0945o0479l2655M1796N6404J5100j1639M172M473q71M907l6480
16950a2826N98n6875k8886r523J5770O7213L7884j3856l9571J3877m6464p500
16938h0159O4982L4417j0001j0867M679K4167m0115P379k745j7513R062J9670
16926B956K4417J0819k9193J8659k739o3524L786k493j949L2750k6769l8639l2572
16913a04491j8854K3605K9214M2003l010O95J2179l8282j1385J9122J9348M8400
16901A8544J3499k929K8485j8519j4805n6073Q64M9059P632m0571j3217j0525
$$ plain form
16889 -38556 -58115 -30645 -553 22219 14904 -38385 -29865 6910 62509 38928 -4011 265
16877 265 -20241 -33657 -27520 500 -5946 -11471 4967 51521 19092 -46789 -59869 -26873 -31286
16864 -31286 -24859 -13151 1551 507 7098 22570 -16416 -32149 -2609 12075 10385 -32938
16852 -32938 -39509 -37268 -23172 -42414 -35018 -38473 -64543 -44812 -7996 33072 36943 53228 71786
16839 71786 74803 47289 23654 31094 10007 16972 34198 37897 11825 -3211 -4202 -15660 -11339
16826 -11339 -36168 -33168 -60033 -107270 -116895 -31570 12336 6948 24314 36580 36050 37437 30590
16813 30590 3008 -27982 -29703 4840 6821 28501 12393 -1544 -26151 -43257 -11794 2151
16801 2151 11243 22624 36704 28640 -7589 4022 40775 61297 33637 -21833 -70551 -92227
$$ packed form
16889c8556j9559K7470L0092K2772p315n3289Q520L6775N5599k3581m2939M276
16877B65k0506j3416O137K8020o446n525J6438M6554l2429o5881j3080L2996m413
16864c1286O427J1708J4702j044O591J5472l8986j5733K9540J4684j690m3323
16852c2938o571K241J4096j9242P396l455k6070J9731L6816M1068L871J6285J8558
16839G1786L017k7514k3635P440k1087O965J7226L699k6072j5036r91j1458M321
16826a1339k4829L000k6865m7237r625Q5325M3906n388J7366J2266n30J387o847
16813C0590k7582l0990j721L4543J981K1680j6108j3937k4607j7106L1463J3945
16801B151R092J1381J4080q064l6229J1611L6753K0522k7660n5470m8718k1676
$$ plain form
16789 -92227 -73707 -44508 -38563 -27562 -33239 -75798 -85223 -60333 -20033 -8428 -284 28764
16777 28764 6301 59446 116518 22054 -85886 -93682 -68578 -64718 -24228 -23590 -25091 -25828 5058
16764 5058 4943 -40880 4976 79035 95931 52902 30602 47275 45509 18959 -27442 -39409
16752 -39409 -41710 -28127 -50544 -40640 -44731 -37031 -34386 -24212 -45288 -70175 -58318 -26011 25804
16739 25804 58439 63316 80067 95028 60505 31941 -10689 -20890 -21290 4794 6081 -1471 440
16726 440 12627 31519 28520 11625 26397 73068 54741 76323 85227 57957 24148 48619
16714 48619 51602 8776 -21456 -3284 -7548 8186 22960 -6339 7583 13587 -41268 -86650
16702 -86650 -107105 -67045 -18103 -38273 -60044 -57491 -23441 -53774 -61797 -47264 -41545 -45163
$$ packed form
16789i2227J8520K9199N945J1001n677m2559r425K4890M0300J1605Q144K9048
16777B8764k2463N3145N7072r4464j07940p796K5104L860M0490O38j501p37L0886
16764E058j15m5823M5856P4059J6896m3029k2300J6673j766k6550m6401j1967
16752c9409k301J3583k2417R904m091P700K645J0174k1076k4887J1857L2307N1815
16739B5804L2635M877J6751J4961l4523k8564m2630j0201m00K6084J287p552J911
16726D40J2187J8892k999j6895J4772M6671j8327K1582Q904k7270l3809K4471
16714D8619K983m2826l0232J8172m264J5734J4774k9299J3922O004n4855m5382
16702h6650k0455M0060M8942k0170k1771K553L4050l0333q023J4533N719l618
$$ plain form
16690 -45163 -63170 -81087 -89665 -86674 -66993 -25256 -28457 -83319 -87124 -28118 7141 -813 12022
16677 12022 28367 4687 -30542 -40265 -17770 -15598 -7035 -4838 54420 59054 34946 -16771 -55605
16664 -55605 -41101 -969 11272 -16191 -10922 10500 8096 4531 21112 18794 32585 59053
16652 59053 35633 39682 22016 4724 1834 25816 19301 9733 20029 -35873 -106652 -106367 -40306
16639 -40306 -20934 -49420 -63667 -84177 -77975 -73495 -37562 -30131 -10339 -7082 -13582 -21401 -31423
16626 -31423 -40399 -3401 18116 -13872 -40714 -50285 -58768 6314 54389 89172 103087 90356
16614 90356 17772 -20428 -13410 -26235 -54864 -73829 -67632 -59295 -45690 11932 6097 13304 21086
16601 21086 6868 13779 29411 7603 31717 58923 36898 7877 -6093 -17419 -43831 -36475
$$ packed form
16690d5163j8007j7917q578K991J9681M1737l201n4862l805N9006L5259p954J2835
16677A2022J6345k3680l5229r723K2495K172Q563K197N9258M634k4108n1717l8834
16664e5605J4504M0132J2241k7463N269K1422k404l565J6581k318J3791K6468
16652E9053k3420M049j7666j7292k890K3982o515r568J0296n5902p0779K85O6061
16639d0306J9372k8486j4247k0510O202M480L5933P431J9792L257o500p819j0022
16626c1423q976L6998K1517l1988k6842r571q483O5082M8075L4783J3915j2731
16614I0356p2584l8200P018j2825k8629j8965O197Q337J3605N7622n835P207P782
16601B1086j4218O911J5632k1808K4114K7206k2025k9021j3970j1326k6412P356
$$ plain form
16589 -36475 17176 34274 -35664 -108024 -113028 -114625 -111180 -67109 -9201 34268 29216 -8402
16577 -8402 -3000 -2407 -15989 -27317 -18919 -47402 -51334 -51508 -78845 -67321 -2279 62760 72479
16564 72479 24044 -1432 -31595 -89793 -65509 -49479 -11431 875 -11365 -28031 -37570 -48387
16552 -48387 -81941 -98667 -26446 34691 60622 79317 24052 -42822 -59143 -60886 -67506 -71255
16540 -71255 -60600 -17043 -12400 -18514 -23975 -8985 -50313 -100528 -69739 -13289 46711 56631
16528 56631 3445 -22700 -41432 -62425 -44943 -43422 -20833 -48124 -77994 -68991 -75175 -74332 -40414
16515 -40414 -110 6128 13023 7231 -3529 -31578 -24748 -4077 11603 31594 9557 14555 42731
16502 42731 48360 5732 -45144 -66693 -3434 27310 -611 -54454 -45728 -68264 -79065 -73309
$$ packed form
16589c6475N3651J7098o9938p2360n004j597L445M4071N7908M3469n052l7618
16577h402N402N93j3582j1328Q398k8483l932j74k7337J1524O5042O5039R719
16564G2479m8435k5476l0163n8198K4284J6030L8048J2306j2240j6666r539j0817
16552d8387l3554j6726P2221O1137K5931J8695n5265o6874j6321j743o620l749
16540g1255J0655M3557M643o114n461J4990m1328n0215L0789N6450O0000R920
16528E6631n3186k6145j8732k0993J7482J521K2589k7291k9870R003o184Q43L3918
16515d0414M0304O238O895n792j0760k8049O830K0671J5680J9991k2037M998K8176
16502D2731N629m2628n0876k1549O3259L0744k7921n3843Q726k2536j0801N756
$$ plain form
16490 -73309 -46101 -50441 -71897 -53082 -72340 -55198 -6364 18263 23552 -19613 3014 11123
16478 11123 -5746 -7617 -9037 -5898 -24332 -9521 19126 2114 4914 31536 16685 -4003
16466 -4003 -17947 -13370 11581 24013 -5474 -656 -13678 -19647 -39379 -81305 -79614 -64609 -27865
16453 -27865 -5981 17310 50401 60926 74472 90380 57466 12079 26862 26016 25054 35991
16441 35991 30725 7959 6831 -45654 -32345 -53426 -70210 -52216 23803 -11215 -37675 -12402
16429 -12402 698 4465 -6502 16047 66646 63108 18823 18031 30836 26013 58819 51165 4239
16416 4239 -18788 -105183 -106406 -86492 -91437 -32623 -27050 -50479 -5663 13854 45774 85346
16404 85346 48082 -8649 -16127 -37086 -31484 -24854 17444 6227 -10669 1914 5715 10589 47590
$$ packed form
16490g3309K7208m340k1456J8815j9258J7142M8834K4627N289m3165K2627Q109
16478A1123j6869j871j420L139j8434J4811K8647j7012K800K6622j4851k0688
16466d003j3944M577K4951J2432k9487M818j3022n969j9732m1926J691J5005L6744
16453b7865K1884K3291L3091J0525J3546J5908l2914m5387J4783q46r62J0937
16441C5991n266k2766j128n2485J3309k1081j6784J7994P6019l5018k6460K5273
16429a2402J3100L767j0967K2549N0599l538m4285p92J2805m823L2806p654m6926
16416D239k3027q6395j223J9914m945N8814N573k3429M4816J9517L1920L9572
16404H5346l7264n6731p478k0959N602O630M2298j1217j6896J2583L801M874L7001
$$ plain form
16391 47590 32872 -6849 -8218 26438 12272 26929 15343 -20614 -15305 11726 36812 87967
16379 87967 120302 105486 55319 17553 19812 15483 46127 22761 28308 29000 46896 56884 23871
16366 23871 -23786 -79447 -71680 22873 60021 3162 -35439 -41081 -17247 -3870 49011 80284
16354 80284 87744 56062 29385 19921 28559 36511 30854 32260 37471 54730 48298 25558 -12575
16341 -12575 -18606 34513 14488 -29898 -35095 -23697 -23733 1939 12409 -29422 -58426 -15273 -9279
16328 -9279 -9493 -21900 -9352 -20730 -13414 -22915 -27415 -37577 27982 18679 -51690 -95908 -108978
16315 -108978 -74076 -34204 9395 28458 -55 -20490 -37563 -22011 7480 -7868 -11046 -689
16303 -689 -17571 -52174 -70349 -22283 -25316 -44349 -11202 3272 -25264 7045 24148 22594
$$ packed form
16391D7590j4718l9721j369L4656j4166J4657j1586l5957N309K7031K5086N1155
16379H7967L2335j4816n0167l7766K259m329L0644k3366N547O92J7896R988l3013
16366B3871m7657n5661P767R4553L7148n6859l8601n642K3834J3377N2881L1273
16354H0284P460l1682k6677r464Q638P952n657J406N211J7259o432k2740l8133
16341a2575o031N3119k0025m4386n197J1398l6K5672J0470m1831k9004M3153N994
16328i279k14j2407J2548j1378P316r501m500j0162O5559r303p0369m4218j3070
16315a08978L4902L9872M3599J9063k8513k0435j7073J5552K9491j5348l178J0357
16303f89j6882l4603j8175M8066l033j9033L3147J4474k8536L2309J7103j554
$$ plain form
16291 22594 20229 13358 39876 40179 -13881 -30300 20997 41936 3947 43009 49825 54513 22091
16278 22091 -11813 -16174 -38447 -23531 4645 -17323 -6300 14683 11265 15159 20975 25398 -53829
16265 -53829 -50201 -24921 -66701 -97647 -84939 -47205 -12264 6566 28038 21408 15975 44865
16253 44865 8311 -45141 -56461 -88687 -83885 -80725 -38738 -21174 -17589 -3716 -4390 2485 16043
16240 16043 51067 111544 99157 95105 67643 7301 -12155 51597 99424 40313 23431 14083
16228 14083 20070 -4793 34720 28271 -5833 -9779 22406 34592 48386 21104 1432 -7492
16216 -7492 -11722 -32774 -8035 -6856 -10619 -36161 -40765 -11951 -3879 -8000 -17944 -46041 -30726
16203 -30726 11920 64225 56515 -7200 -25182 7289 9269 9823 -1390 -20940 -4095 -41093
$$ packed form
16291B2594k365o871K6518L03n4060j6419N1297K0939l7989L9062O816M688l2422
16278B2091l3904m361k2273J4916K8176k1968J1023K0983l418L894N816M423p9227
16265e3829L628K5280m1780l0946J2708L7734L4941J8830K1472o630n433K8890
16253D4865l6554n3452j1320l2226M802L160M1987J7564L585J3873o74O875J3558
16240A6043L5024O0477j2387m052k7462o0342j9456O3752M7827n9111j6882r348
16228A4083N987k4863L9513o449l4104l946L2185J2186J3794k7282j9672q924
16216g492m230k1052K4739J179l763k5542m604K8814Q072m121r944k8097J5315
16203c0726M2646N2305p710o3715j7982L2471J980N54j1213j9550J6845l6998
$$ plain form
16191 -41093 -70760 -69059 -70156 -37633 -57943 -68875 -68711 -56764 -45304 -76517 -77649 -49293 -4078
16178 -4078 5501 -20261 -37145 -36166 -5020 -13711 -23034 -47804 -50880 -8784 -38030 -21810 -26732
16165 -26732 -28458 11575 11513 22991 18688 23358 30733 28728 -5587 -12297 40786 40955 32110 9093
16151 9093 -11955 -7559 22001 20094 13227 24139 15155 8814 -11311 9332 11949 -14046 833
16138 833 28724 40509 14201 -19302 -31156 -23220 -45506 -22578 11659 38831 78875 68032
16126 68032 58179 26718 44237 56326 56898 28516 8657 28189 19337 4056 27555 -11498
16114 -11498 -37421 -1531 39290 63659 70244 16995 -15875 9032 29375 15845 8883 21582
16102 21582 68010 67813 36293 -28694 -76 61737 91517 66995 88213 130355 89737 61293
$$ packed form
16191d1093k9667J701j097L2523k0310j0932J64J1947J1460l1213j132K8356M5215
16178d078R579k5762j6884R79L1146q691r323k4770l076M2096k9246J6220m922
16165b6732j726M0033o2J1478m303M670P375k005l4315o710N3083J69q845k3017
16151I093k1048M396K9560j907o867J0912q984o341k0125K0643K617k5995J4879
16138H33K7891J1785k6308l3503j1854P936k2286K2928L4237K7172M0044j0843
16126F8032r853l1461J7519J2089N72k8382j9859J9532q852j5281K3499l9053
16114a1498k5923L5890M0821K4369O585n3249l2870K4907K0343j3530o962J2699
16102B1582M6428j97l1520o4987K8618O1813K9780k4522K1218M2142m0618k8444
$$ plain form
16090 61293 47988 2920 -17074 -54159 -47000 -33982 -27964 -27589 -50661 -30001 -7740 44070
16078 44070 41569 -8478 -10427 13995 44419 45744 48232 21539 -6399 -36171 -15836 37613
16066 37613 22805 -36149 -19165 21701 31755 37645 25547 44741 68960 37697 28794 1452
16054 1452 24078 55748 69136 -20603 -58136 -36441 -43071 -41753 -31171 -31354 25129 27293 12807
16041 12807 40715 18037 -1931 12790 612 40659 31387 13670 18735 29785 7592 33401
16029 33401 47417 4189 -26103 37926 11227 -67872 -75042 -37453 -4366 -1962 -15055 -36512
16017 -36512 -33779 -18714 -49118 -39020 -31565 28543 22120 45011 32318 39116 36407 50608 54569
16004 54569 -19661 489 21348 18044 -35048 -86471 -89151 -49102 -20894 -2582 -11252 -30747
$$ packed form
16090F1293j3305m5068j9994l7085P159J3018O018L75k3072K0660K2261N1810
16078D4070k501n0047j949K4422L0424J325K488k6693k7938k9772K0335N3449
16066C7613j4808n8954J6984M0866J0054N890j2098J9194K4219l1263q903k7342
16054A452K2626L1670J3388q9739l7533K1695o630J318J0582j83N6483K164j4486
16041A2807K7908k2678j9968J4721j2178M0047r272j7717N065J1050k2193K5809
16029C3401J4016m3228l0292O4029k6699p9099p170L7589L3087K404j3093k1457
16017c6512K733J5065l0404J0098P455O0108o423K2891j2693O798k709J4201L961
16004E4569p4230K0150K0859l304n3092n1423k680M0049K8208J8312q670j9495
$$ plain form
15992 -30747 -12362 -2837 -12612 -900 33188 -27211 -58046 -27164 1276 -4426 15259 15753 36021
15979 36021 7001 -42077 -23627 23203 -18302 -24020 2587 -15652 -26110 -10454 -4897 -5398
15967 -5398 9555 47192 63515 26503 -32246 -50614 -20048 -35300 -21393 20396 62134 64842
15955 64842 53903 37207 18240 26245 11002 13306 -25642 -60915 -13407 9715 24879 29289
15943 29289 6908 -14306 -12779 1922 64482 70377 41376 4090 18638 24847 -44134 -56059
15931 -56059 -83579 -68678 -40039 14465 72042 60071 17118 -12908 -51713 -70079 -33276 -9589
15919 -9589 -5222 15534 -13770 -31304 -50060 -12550 45031 36835 26263 34308 -11459 -32152
15907 -32152 -58850 -55325 -16194 25896 80921 94784 93074 55004 59183 53326 5439 -17961
$$ packed form
15992c0747J8385R525r775J1712L4088o0399l0835L0882K8440n702J9685M94K0268
15979C6021k9020m9078J8450M6830m1505n718K6607j8239j0458J5656N557n01
15967e398J4953L7637J6323l7012n8749j8368L0566j5252J3907M1789M1738K708
15955F4842j0939j6696j8967Q005j5243K304l8948l5273M7508K3122J5164M410
15943B9289k2381k1214J527J4701O2560N895k9001l7286J4548O209o8981j1925
15931e6059k7520J4901K8639N4504N7577j1971m2953l0026l8805j8366L6803K3687
15919i589M367K0756k9304j7534j8756L7510N7581q196j0572Q045m5767k0693
15907c2152k6698L525L9131M2090N5025J3863j710l8070M179n857m7887k3400
$$ plain form
15895 -17961 -13742 -40597 -17352 -11169 2077 -22239 -48281 -45183 -25254 -28423 -33565 -38158 -50301
15882 -50301 -41423 -21470 -26855 -63207 -60355 -35270 -40823 -17340 24341 4465 3903 -3023 -17392
15869 -17392 9257 11090 -12416 9030 -6361 9886 24710 2320 19620 43492 53510 36641
15857 36641 37921 83763 108175 119071 110770 112252 48489 49569 64186 58236 51202 63192 62083
15844 62083 23224 -13525 5218 31592 37768 43505 32024 27799 57187 51733 15682 -21052
15832 -21052 -51355 -12651 -8513 24119 12615 8259 28770 17351 -21862 -2335 44736 37791
15820 37791 -13448 -52339 -19102 38184 102344 94378 70269 49929 -26477 -48009 -32706 -44729
15808 -44729 -48016 -19758 4037 -25874 -10790 -27171 -72253 -57062 -11761 11809 15937 -13823
$$ packed form
15895a7961M219k6855K3245O183J3246k4316k6042L098J9929l169n142m593j2143
15882e0301Q878J9953n385l6352K852K5085n553K3483M1681j9876n62o926j4369
15869a7392K6649J833k3506K1446j5391J6247J4824k2390J7300K3872J0018j6869
15857C6641J280M5842K4412J0896q301J482o3763J080J4617n950p034J1990j109
15844F2083l8859l6749J8743K6374O176N737j1481m225K9388n454l6051l6734
15832b1052l0303L8704M138L2632j1504m356K0511j1419l9213J9527M7071o945
15820C7791n1239l8891L3237N7286O4160p966k4109k0340p6406k1532J5303j2023
15808d4729l287K8258K3795k9911J5084j6381m5082J5191M5301K3570M128k9760
$$ plain form
15796 -13823 -26742 -15460 -51132 -81506 -76345 -42288 -8857 -69277 -113355 -92973 -55232 -29999
15784 -29999 -19016 -29751 226 42208 -268 428 4569 -11390 -30720 -18693 16510 12844
15772 12844 -1448 6958 2014 -33419 -16362 14642 21033 -9699 -8055 33531 46684 26724
15760 26724 -12016 -45750 -36344 -574 21673 27757 18510 -17942 16527 36466 12643 1908
15748 1908 10072 35338 13762 -8207 -38214 -38167 -37200 14278 40713 31972 6860 -6352 -13147
15735 -13147 5603 59791 60524 59409 35063 468 885 1174 -5784 -28397 -51009 -27989 -21331
15722 -21331 16203 20111 17285 7162 -2064 -19619 -52560 -70576 -60697 -22347 -59594 -86087
15710 -86087 -76045 -33855 -25431 -26104 -12162 4676 -9565 4960 18257 6037 6980 12306 36054
$$ packed form
15796a3823j2919J1282l5672l0374N161L4057L3431o0420m4078K0382L7741K5233
15784b9999J0983j0735K9977M1982m2476O96M141j5959j9330J2027L5203l666
15772A2844j4292Q406m944l5433J7057L1004O391l0732J644M1586J3153j9960
15760B6724l8740l3734R406L5770K2247O084r247l6452L4469J9939k3823j0735
15748A908Q164K5266k1576k1969l0007M7R67N1478K6435q741k5112j3212o795
15735a3147J8750N4188P33j115k4346l4595M17K89o958k2613k2612K3020O658
15722b1331L7534L908k826j0123r226j7555l2941j8016R879L8350l7247k6493
15710h6087J0042M2190Q424o73J3942J6838j4241J4525J3297j2220R43N326K3748
$$ plain form
15697 36054 22673 16040 65936 77029 69326 60510 26895 -45942 -50347 -14971 -20511 -39179 -54532
15684 -54532 -59008 -68949 -43302 -21793 6482 24961 -8896 -39267 -107840 -135693 -73575 -26841
15672 -26841 -1567 -1136 -15692 -18809 -11315 15779 25404 27099 23479 23264 6298 -33955 -27627 -14101
15658 -14101 -59901 -85351 -9990 -24017 -26787 -1122 49367 39645 7248 55 -2980 22204
15646 22204 18136 34883 22250 -1692 10714 318 -3519 27286 84785 46568 36559 14773
15634 14773 -13445 -14429 6308 14210 426 18907 43155 61908 48006 12041 16248 3083
15622 3083 -3374 -5759 21696 17599 15074 7967 -27555 8058 -14441 -44868 -9541 32133 13464
15609 13464 16307 16049 23933 29088 35474 28062 888 -35053 -1333 -132 -32985 -32009 -53146 -64120
$$ packed form
15697C6054j3381o633M9896J1093p703q816l3615p2837m405L5376n540j8668j5353
15684e4532m476r941K5647K1509K8275J8479l3857l0371o8573k7853O2118M6734
15672b6841K5274M31j4556l117P494K7094R625J695l620k15j6966m0253O328J3526
15658a4101m5800k5450P5361j4027k770K5665N0489r722l2397p193l035K5184
15646B2204m068J6747j2633k3942J2406j0396l837L0805N7499l8217j0009k1786
15634A4773k8218r84K0737P902j3784J8481K4248J8753j3902l5965M207j3165
15622C083o457k385K7455m097k525p107l5522L5613k2499l0427L5327M1674j8669
15609A3464K843k58P884N155O386p412k7174l5941L3720J201l2853R76k1137j0974
$$ plain form
15595 -64120 -34428 -594 -28611 -110 47183 76599 100876 69857 29265 -8877 -2027 -15171
15583 -15171 -19229 13095 49313 21851 32757 73958 79781 66511 58497 42623 -817 -14670
15571 -14670 -41563 -14285 -21775 -35437 -5478 20283 -28617 -34778 6515 12593 892 -4919
15559 -4919 -30400 -34468 -3988 21940 12409 19349 35918 36314 35575 5520 -17559 -82237 -72794
15546 -72794 -44536 -17376 18935 16886 -2640 -18090 -36875 -95549 -78599 -30176 25479 70169
15534 70169 61329 -9837 -59874 -31525 -19285 -3181 3045 5246 -14463 -63447 -28058 -50613
15522 -50613 -82278 -68101 -16219 -6742 2927 4371 36555 7923 -12188 -20341 -17313 -8086 24315
15509 24315 18652 31262 37345 10707 15409 -34337 -65830 -13104 55089 23089 12399 19027
$$ packed form
15595f4120K9692L3834k8017K8501M7293K9416K4277l1019m0592l8142O850j3144
15583a5171m058L2324L6218k7462J0906M1201N823j3270q014j5874m3440j3853
15571a4670k6893K7278p490j3662K9959K5761m8900o161M1293O078j1701n811
15559d919k5481m068L0480K5928r531O940J6569L96p39l0055k3079o4678R443
15546g2794K8258K7160L6311k049j9526j5450j8785n8674J6950M8423N5655M4690
15534G0169q840p1166n0037K8349J2240J6104O226K201j9709m8984L5389k2555
15522e0613l1665J4177N1882R477R669J444L2184k8632k0111q153L028R227L2401
15509B4315n663J2610O083k6638M702m9746l1493N2726O8193l2000j0690O628
$$ plain form
15497 19027 9814 11035 21581 -57446 -88153 -71924 -13507 30076 6027 -15481 -28440 -18650
15485 -18650 -64140 -50940 -29763 -17865 46138 63645 58508 49338 37667 13771 11358 14772
15473 14772 21225 48536 26963 23078 39576 3518 -7514 -4615 -19586 -25204 30426 25957 -14932
15460 -14932 -30622 -45656 -41893 -4335 -50714 -76561 -62420 -21243 22314 57257 41882 33649
15448 33649 7481 9571 49335 38913 53253 62092 81806 73610 -17001 -108151 -56683 -7281
15436 -7281 9857 -6065 -29530 -35712 -45990 -32406 -35177 -413 36166 36824 56280 40971 30970
15423 30970 3069 -19151 30628 38051 25818 28948 36856 40761 23570 1904 -9890 -39102
15411 -39102 -7827 -9421 -40410 -35766 -51712 -32561 -33183 -63735 -87365 -54363 -26823 -42576
$$ packed form
15497A9027r213J221J0546p9027l0707J6229N8417M3583k4049k1508j2959R790
15485a8650m5490J3200K1177J1898O4003J7507n137r170j1671k3896k413L414
15473A4772O453K7311k1573l885J6498l6058j1032K899j4971n618N5630m469m0889
15460a4932j5690j5034L763L7558m6379k5847J4141M1177M3557L4943j5375q233
15448C3649k6168K090L9764j0422J4340Q839J9714q196r0611r1150N1468M9402
15436g281J7138j5922k3465o182j0278J3584k771L4764L6579O58J9456j5309j0001
15423C0970k7901k2220M9779P423j2233L130P908L905j7191k1666j1794k9212
15411c9102L1275j594l0989M644j5946J9151o22l0552k3630L3002K7540j5753
$$ plain form
15399 -42576 -47842 -50024 -53340 -20482 30614 54186 2383 27358 33164 32546 63191 102328 115076
15386 115076 103904 69312 34599 33566 47313 19473 -7980 -337 64856 85465 63185 30186
15374 30186 -6503 -33427 -31903 -55682 -20903 -6446 -3030 -1743 27699 22595 25129 13504 -49309
15361 -49309 -35965 -28521 -27296 352 -48528 -25865 8565 -17360 904 3046 -40242 -42380
15349 -42380 -13269 32666 16737 -38250 -53770 -18368 660 -4825 -4442 20375 -10461 -25877
15337 -25877 -33288 -29965 -27401 13854 47922 78083 118473 70577 31624 33502 20083 3246
15325 3246 -33255 -47191 -65168 -28634 -7894 -4986 -10265 -13121 -5845 15313 24589 79700 67305
15312 67305 34133 57863 61129 51965 33637 -29462 -34077 4761 40193 35179 -19895 -50736
$$ packed form
15399d2576n266k182l316L2858N1096K3572n1803K4975N806o18L0645L9137J2748
15386A15076j1172l4592l4713j033J3747k7840k7453P643O5193K0609k2280l2999
15374C0186l6689k6924J524k3779L4779J4457L416J287K9442n104K534j1625o2813
15361d9309J3344P444J225K7648m8880K2663L4430k5925J8264K142m3288k138
15349d2380K9111M5935j5929n4987j5520L5402J9028n485L83K4817l0836j5416
15337b5877p411L323K564M1255L4068L0161M0390m7896l8953J878j3419j6837
15325C246l6501j3936j7977L6534K0740K908n279k856P276K1158R276N5111j2395
15312F7305l3172K3730L266r164j8328o3099m615L8838L5432n014n5074l0841
$$ plain form
15300 -50736 -17182 4692 27827 -8386 -31143 -31020 -15395 -18683 -16871 -8088 24295 17667 33718
15287 33718 24123 5746 -15189 -58638 -47076 -1674 11667 -6139 2820 -5605 -28330 -32084
15275 -32084 -37547 -22608 -27738 -34751 -54791 -20741 -1495 -32452 -74808 -61149 -2689 13935
15263 13935 3846 -16308 -11303 -19368 -24564 13356 26284 29794 48933 30338 -4195 2786 20162
15250 20162 6170 -2202 10299 -19480 -61919 -103320 -87842 -66909 -45580 -59969 -88556 -48885
15238 -48885 -61004 -52322 -19158 -42896 -42820 -42882 -37548 7615 34362 29913 41623 59365 84290
15225 84290 56758 35415 64920 67000 32159 -2080 -29209 -31666 -5814 -21942 -21759 -39038
15213 -39038 -62582 -91330 -110905 -46989 16587 7920 -21764 -4998 -33319 -58609 -49474 -8051
$$ packed form
15300e0736L3554K1874K3135l6213k2757J23J5625l288J812Q783L2383o628J6051
15287C3718r595j8377k0935m3449J1562M5402J3341j7806Q959q425k2725l754
15275c2084n463J4939n130p013k0040L4050J9246l0957m2356J3659N8460J6624
15263A3935j0089k0154N005q065n196L7920J2928L510J9139j8595l4533O981J7376
15250B0162j3992q372J2501k9779m2439m1401J5478K0933K1329j4389k8587L9671
15238d8885j2119Q682L3164k3738P6o2N334M5163K6747m449J1710J7742K4925
15225H4290k7532k1343K9505K080l4841l4239k7129k457K5852j6128J83j7279
15213c9038k3544k8748j9575O3916O3576q667k9684J6766k8321k5290R135M1423
$$ plain form
15201 -8051 -2380 -8794 11707 -28962 -66906 -70092 -60942 -65401 -52386 -22577 -42534 -71000 -58474
15188 -58474 6414 39262 43452 62895 49503 20594 -7396 12170 -1851 -17488 2770 23319
15176 23319 5687 -33226 -22505 17538 16483 7922 9757 51 21104 32757 6371 -21499
15164 -21499 -64603 -57004 -39088 -8951 -28404 -23663 12128 10415 8634 7933 -7956 -29114 -20460
15151 -20460 4705 -14397 -25440 -2996 5451 33606 32929 40058 50505 75277 61518 20260
15139 20260 -5164 -48887 -54980 -28812 -5624 -22770 -13422 33377 77890 104246 95725 63778
15127 63778 21916 -18637 -25976 -9868 -1952 -52370 -38186 -21349 -31672 -18581 -5304 31422
15115 31422 56467 51572 57396 25598 -23579 -14375 24569 28223 11767 42089 50298 40329 59922
$$ packed form
15201h051N671o414K0501m0669l7944l186R150m459J3015K9809j9957k8466J2526
15188e8474O4888L2848M190J9443j3392k8909k7990J9566j4021j5637K0258K0549
15176B3319j7632l8913J0721M0043j055q561J835r706K1053J1653k6386k7870
15164b1499m3104P599J7916L0137j9453M741L5791j713j781p01j5889k1158Q654
15151b0460K5165j9102j1043K2444Q447K8155o77P129J0447K4772j3759m1258
15139B0260k5424m3723o093K6168K3188j7146R348M6799M4513K6356q521l1947
15127F3778m1862m0553p339J6108P916n0418J4184J6837j0323J3091J3277L6726
15115C1422K5045m895N824l1798m9177R204L8944L654j6456L0322Q209r969J9593
$$ plain form
15102 59922 40801 -9802 -39077 -50183 -25863 -10266 20798 9920 -17820 -8563 -9562 -6484
15090 -6484 -19019 -35328 -48346 -25753 11479 68777 67689 32619 -2110 -7313 8588 6277
15078 6277 -13102 -34624 -8750 6821 -13700 -27226 -16998 -11358 6915 1191 -18606 32423
15066 32423 72739 5398 -41975 -28436 -11576 -15817 -35712 -45667 -7869 -27636 -39905 -30051
15054 -30051 -22739 -9641 -10869 -13898 2486 36729 28783 -8753 -11112 1157 11665 7056 81383
15041 81383 105424 68114 14133 12909 -1555 -2854 40461 95424 83798 63676 44864 868
15029 868 15720 51288 15885 4341 22243 13968 20771 36753 48042 32256 401 2485 -16170
15016 -16170 -28782 -22195 23981 59785 68053 57372 71269 73317 69825 61347 16458 8446 41311
$$ packed form
15102E9922j9121n0603k9275j1106K4320J5597L1064j0878k7740R257r99L078
15090f484j2535j6309j3018K2593L7232N7298j088l5070l4729n203J5901k311
15078F277j9379k1522K5874J5571k0521j3526J0228N640J8273n724j9797N1029
15066C2423M0316o7341m7373J3539J6860m241j9895r955L7798j9767j2269R854
15054c0051P312J3098j228l029J6384L4243p946l7536k359J2269J0508m609P4327
15041H1383K4041l7310n3981j224j4464j299M3315N4963j1626k0122j8812m3996
15029H68J4852L5568l5403j1544J7902q275O803J5982J1289j5786l1855K084j8655
15016a6170j2612O587M6176L5804Q268j0681J3897K048l492q478m4889q012L2865
$$ plain form
15003 41311 20114 34442 42679 -7730 -34298 -53842 -79488 -98391 -62787 -36585 -60408 -79278
14991 -79278 -58358 -31495 -27718 21460 38791 38477 11466 -9889 -24809 -32631 -86 27720
14979 27720 58702 116352 112166 74743 55056 38174 13996 3222 -46496 -58803 -47382 -33120
14967 -33120 -13558 -34704 -40260 -9804 14279 28958 2468 -23275 -4614 6894 1671 -17062
14955 -17062 -17919 -16032 -29085 -38424 -8622 -7573 -22383 36925 42605 37518 68558 45764 -9802
14942 -9802 -35897 24179 114484 129375 86519 7330 23389 57854 37586 -704 -17743 -12321
14930 -12321 23257 21646 18345 20064 -18482 -23132 8515 19300 4056 14 31944 91081 81295
14917 81295 88119 62306 63054 34660 28842 24453 38262 42489 53159 42359 40066 49139 44921
$$ packed form
15003D1311k1197J4328Q237n0409k6568j9544k5646j8903L5604K6202k3823j8870
14991g9278K0920K6863L777M9178J7331l14k7011k1355j4920p822L2545K7806
14979B7720L0982N7650m186l7423j9687j6882k4178j0774m9718j2307J1421J4262
14967c3120J9562k1146n556L0456K4083J4679k6490k5743J8661J1508n223j8733
14955a7062q57J887j3053r339K9802J049j4810N9308N680n087L1040k2794n5566
14942i802k6095O0076R0305J4891m2856p9189J6059L4465k0268l8290j7039N422
14930a2321L5578j611l301J719l8546m650L1647J0785j5244m042L1930N9137r786
14917H1295O824k5813P48k8394n818m389J3809M227J0670j0800k293R073m218
$$ plain form
14904 44921 30289 -27480 -64513 -45015 57623 64040 89627 105032 57916 -4652 -19287 994
14892 994 6660 29194 60387 40240 16971 -3613 -62606 -68395 -40693 -36758 2411 -9402 -15024
14879 -15024 -43373 -30308 -45669 -84492 -94318 -81209 -65889 -30567 -22511 -14741 -1750 -38482
14867 -38482 -60582 -16829 1071 235 -19402 -40139 -77305 -106632 -105970 -67800 -44487 -13674
14855 -13674 12386 3085 3267 -3743 23334 23782 32468 18312 38594 56991 82581 91828 68494
14842 68494 11454 -40101 -56946 1619 3740 487 11914 25223 30272 19464 -20651 -39869
14830 -39869 -4876 5384 -23606 -20772 1318 -6333 4673 7434 30393 26942 31207 10541 -7342
14817 -7342 -7242 4273 55036 43275 -12589 -40629 -10262 19958 31802 57234 88547 91262
$$ packed form
14904D4921j4632n7769l7033J9498J02638O417K5587J5405m7116o2568j4635K0281
14892I94N666K2534L1193k0147k3269k0584n8993n789K7702L935L9169j1813n622
14879a5024k8349J3065j5361l8823r826J3109J5320L5322Q056P770J2991l6732
14867c8482k2100M3753J7900q36j9637k0737l7166k9327O62L8170K3313L0813
14855a3674K6060r301J82p010K7077M48Q686j4156K0282J8397K5590R247k3334
14842F8494n7040n1555j6845N8565K121l253J1427J3309N049j0808m0115j9218
14830c9869L4993J0260k8990K834K2090p651J1006K761K2959l451M265k0666j7883
14817g342J00J1515N0763j1761n5864k8040L0367L0220J1844K5432L1313K715
$$ plain form
14805 91262 57897 27134 17093 6104 -22938 -27548 -19285 13556 33949 35673 136 -13441
14793 -13441 18650 15026 17655 59454 103114 66093 17125 13840 56032 103088 75029 22498
14781 22498 -36733 -81752 -83676 -30134 -9660 -2598 -15576 -18478 -19147 14834 -13876 -40560 -48975
14768 -48975 -58852 -37077 2154 29285 14283 29845 18193 13526 -26714 -61901 -86880 -76006
14756 -76006 -52533 -32384 69 6557 26821 -5261 -880 25245 65403 68527 56266 25453
14744 25453 25519 36933 49035 65777 58566 61213 37701 31384 12396 12284 15090 25917 21545 27302
14730 27302 76647 98518 24086 15022 20114 11041 5526 -18039 -24033 -15381 -3720 1385 -4484
14717 -4484 -9972 -5849 44072 22491 35277 72471 93687 54154 28691 17111 16949 -145 2422
$$ packed form
14805I1262l3365l0763j0041j0989k9042m610Q263L2841K0393J724l5537j3577
14793a3441L2091l624K629M1799M3660l7021m8968l285M2192M7056k8059n2531
14781B2498n9231m5019j924N3542K0474P062j2978k902o69L3981k8710k6684q415
14768d8975r877K1775L9231K7131j5002J5562j1652m667m0240l5187k4979J0874
14756g6006K3473K0149L2453O488K0264l2082M381K6125M0158L124j2261l0813
14744B5453O6J1414J2102J6742p211K647k3512o317j8988j12K806J0827m372N757
14730B7302M9345K1871p4432r064N092r073n515k3565n994Q652J1661N105n869
14717d484n488M123M9921k1581J2786L7194K1216l9533k5463j1580j62j7094K567
$$ plain form
14704 2422 -8695 -41151 -19447 37324 40493 28578 9624 -2556 -60963 -78973 -53930 -33663
14692 -33663 19367 68714 21045 11865 -15089 23797 69157 77927 64776 51107 26263 -25580
14680 -25580 -14528 54586 88920 87684 97827 71124 74816 77102 54391 38632 -25299 -17090
14668 -17090 25648 66344 48088 30808 23496 29924 76676 96576 103456 128951 137547 101321
14656 101321 83369 52693 11272 -18841 -2988 13716 14824 83599 99736 64879 41582 5528
14644 5528 -30193 -23211 -31764 -37847 -27440 -10603 30256 39478 60378 64669 11084 -41266 -17676
14631 -17676 -5017 -22170 -5914 27637 50197 64551 33394 62033 8643 -7863 19942 17303
14619 17303 -6792 -6313 1598 21680 43928 51073 23145 10335 25879 53157 112237 113563 72460
$$ packed form
14704B422j1117l2456K1704N6771L169j1915j8954j2180n8407j8010K5043K0267
14692c3663N3030M9347m7669r180k6954L8886M5360Q770j3151j3669k4844n1843
14680b5580J1052O9114L4334j236J0143k6703L692K286k2711j5759o3931Q209
14668a7090M2738M0696j8256j7280p312O428M6752J9900O880K5495Q596l6226
14656A01321j7952l0676m1421l0113J5853J6704J108O8775J6137l4857k3297l6054
14644E528l5721O982q553o083J0407J6837M0859R222K0900M291n3585n2350K3590
14631a7676J2659j7153J6256L3551K2560J4354l1157K8639n3390j6506K7805k639
14619A7303k4095M79P911K0082K2248P145k7928j2810J5544K7278N9080J326m1103
$$ plain form
14606 72460 56949 20231 -5396 -12739 10180 3441 7123 39251 60629 15657 -26642 -21744
14594 -21744 -38146 -19150 -13740 -22134 -28332 -32157 -11449 -35986 -47414 -25499 -11868 -39468
14582 -39468 -55889 -14687 -38519 -67498 -36004 -18158 -9732 -20252 -30235 -42560 -40203 -15784
14570 -15784 19369 20150 2729 10906 253 -14013 -18076 -12173 -5982 -3079 -14347 -47363 -54965
14557 -54965 -62881 -47842 -16020 9562 26905 26815 68179 38385 4681 12343 9929 -6480 -47122
14544 -47122 -35585 21406 42761 66173 101527 103745 75667 42799 30526 41091 35311 59097
14532 59097 39813 -7314 3195 37385 53844 43590 47969 63494 50090 51719 62027 16122
14520 16122 28697 9367 -18175 -9606 -11178 -14142 15882 12646 -20598 -20311 1024 18125 -30541
$$ packed form
14606G2460j5511l6718k5627p343K2919o739L682L2128K1378m4972m2299M898
14594b1744j6402J8996N410q394o198l825K0708k4537j1428K1915J3631k7600
14582c9468j6421M1202k3832k8979L1494J7846Q426j0520r983j2325K357K4419
14570a5784L5153P81j7421Q177j0653j4266m063N903O191K903j1268l3016p602
14557e4965p916J5039L1822K5582J7343r0M1364k9794l3704P662k414j6409m0642
14544d7122J1537N6991K1355K3412L5354K218k8078l2868j2273J0565n780K3786
14532E9097j9284m7127J0509L4190J6459j0254M379J5525j3404J629J0308m5905
14520A6122J2575j9330k7542Q569j572k964L0024l236l3244K87K1335J7101m8666
$$ plain form
14507 -30541 -47437 -30548 33707 64312 62879 93653 71545 57091 25757 2721 17921 14540
14495 14540 15569 -15701 -12023 475 14121 24545 11809 -45601 -27045 4962 13826 23466
14483 23466 -17899 -4625 23881 -30123 -41622 -13691 -42470 -37982 -308 7233 24077 28407
14471 28407 36185 51188 66402 49555 45980 55314 18291 11821 -7338 -14256 3539 -1716 -66
14458 -66 10492 61379 68018 40790 40071 42765 78044 109805 76834 72833 95212 107702 82178
14445 82178 107643 89652 39268 32088 69133 73605 91630 78014 103315 119458 66007 76216
14433 76216 83565 30740 54939 52298 26335 45151 51962 34000 -1746 -27898 -68842 -74378
14421 -74378 -66255 -56835 -52428 -28126 -20620 -10245 -25308 -14230 50033 72795 68398 86435 25128
$$ packed form
14507c0541j6896J6889O4255L0605j433L0774k2108j4454l1334k3036J5200l381
14495A4540J029l1270L678J2498J3646J0424j2736n7410J8556L2007Q864R640
14483B3466m1365J3274K8506n4004j1499K7931k8779M488L7674P541J6844M330
14471B8407P778J5003J5214j6847l575R334l7023o470j9159o918J7795n255J650
14458f6J0558N0887O639k7228p19K694L5279L1761l2971m001K2379J2490k5524
14445H2178K5465j7991n0384p180L7045M472J8025j3616K5301J6143n3451J0209
14433G6216P349n2825K4199k641k5963J8816O811j7962l5746k6152m0944n536
14421g4378Q123R420M407K4302P506J0375j5063J1078O4263K2762m397J8037o1307
$$ plain form
14408 25128 27719 55863 56764 45511 15935 -16606 4943 -2524 -9307 -873 -6569 40374 58441
14395 58441 46481 -303 -43190 -35702 -23707 -25625 -40771 7848 18640 45990 34582 41073
14383 41073 39159 -5772 -39859 -6746 29303 24863 9690 6496 12301 4924 -19622 -11733 -11035
14370 -11035 4146 19251 36816 5034 -33397 -40124 -32449 -15729 49049 84457 40577 12801
14358 12801 10156 18104 467 -16716 11956 26822 25513 33548 11227 3188 -1764 -388 -9922
14345 -9922 -48310 -45116 3647 31090 -21796 -50287 -54509 -55397 -60347 -56076 -31911 -9182 17024
14332 17024 32732 751 3887 -51176 -34845 -64234 -91482 -67517 -31463 8385 14144 -260
14320 -260 1206 14743 12847 13993 30547 -35285 -72430 -50993 -46997 -40906 -74265 -25977 17748
$$ packed form
14408B5128K591K8144R01j1253k9576l2541K1549p467o783Q434n696M6943J8067
14395E8441j1960m6784m2887P488J1995j918j5146M8619J0792K7350j1408O491
14383D1073j914m4931l4087L3113L6049m440j5173l194N805p377k4546P889O98
14370a1035J5181J5105J7565l1782l8431o727P675J6720O4778L5408m3880k7776
14358A2801k645P948j7637j7183K8672J4866j309Q035k2321q039m952J376r534
14345i922l8388L194M8763K7443n2886k8491m222q88m950M271K4165K2729K6206
14332A7024J5708l1981L136n5063J6331k9389k7248K3965L6054L9848N759j4404
14320b60J466J3537j896J146J6554o5832l7145K1437L996O091l3359M8288M3725
$$ plain form
14307 17748 -7948 -22501 6715 25452 -27443 -37474 -9778 -41742 -77876 -89138 -44685 3059
14295 3059 27490 70508 67404 41791 21758 -10729 -12661 -25808 13328 39178 11266 -5857
14283 -5857 3887 6738 -20066 -27913 5665 22721 -19756 -35172 -46936 -67084 -46429 7875
14271 7875 13776 18699 24638 -15423 -50013 -12469 18230 75241 102381 53397 27093 31873 60135
14258 60135 87066 99093 113777 117233 91865 92791 42501 40012 55478 23123 23964 33604 47750
14245 47750 54605 34076 27028 11097 15217 58026 37963 14682 29988 25405 20530 13487 -47060
14232 -47060 -55750 -24693 -31203 -45674 -47457 -36094 -16006 -9476 1819 14 -8060 -10767 -20410
14219 -20410 10375 9334 -3920 1801 57393 44970 -17647 -44899 -33604 -12960 5100 -27243
$$ packed form
14307A7748k5696j4553K9216J8737n2895j0031K7696l1964l6134j1262M4453M7744
14295C059K4431M3018l104k5613k0033l2487j932j3147L9136K5850k7912j7123
14283e857R744K851k6804p847L3578J7056m2477j5416j1764k0148K0655N4304
14271G875N901M923N939m0061l4590L7544L0699N7011K7140m8984k6304M780K8262
14258F0135K6931J2027J4684L456k5368R26n0290k489J5466l2355Q41R640J4146
14245D7750O855k0529p048j5931M120M2809k0063k3281J5306m583m875p043o0547
14232d7060q690L1057o510j4471j783J1363K0088O530J1295j805q074k707r643
14219b0410L0785j041j3254N721N5592j2423o2617k7252J1295K0644J8060l2343
$$ plain form
14207 -27243 -27746 -42612 -33990 -3591 25085 73415 55242 66007 65922 34053 -15814 -16972 10110
14194 10110 17247 31738 27241 18667 -21684 -38347 -22333 15013 43249 65426 15433 -21976
14182 -21976 -27165 -20816 -19153 -4245 -347 18458 45403 59048 43223 63321 81985 38984
14170 38984 14964 -11748 -10174 -2917 2222 10875 20682 5374 -3316 56946 82403 30292 29163
14157 29163 -35745 -12553 20960 48275 35358 79949 81881 40001 -10454 -2166 24458 21758
14145 21758 13320 30937 30563 38765 51163 55845 31334 1545 -2153 2296 2963 -39358 -29343
14132 -29343 -29194 -6579 11674 -26174 -44585 -12616 -3299 -25353 5335 4072 -363 7268 39877
14119 39877 52619 41706 62775 57456 69256 54338 15940 59096 100164 58851 53795 59440
$$ packed form
14207b7243n03j4866Q622L0399K8676M8330j8173J0765q5l1869m9867j158K7082
14194A0110P137J4491m497q574m0351j6663J6014L7346K8236K2177m9993l7409
14182b1976n189O349J663J4908L898J8805K6945J3645j5825K0098J8664m3001
14170C8984k4020k6712J574P257N139Q653R807j5308q690O0262K5457n2111j129
14157B9163o4908K3192L3513K7315j2917M4591J932m1880n0455Q288K6624k700
14145B1758q438J7617l74Q202J2398M682k4511k9789l698M449O67m2321J0015
14132b9343J49K2615J8253l7848j8411L1969R317k2054L0688j263m435P631L2609
14119C9877J2742j0913K1069n319J1800j4918l8398M3156M1068m1313n056N645
$$ plain form
14107 59440 57456 61684 57826 52023 27311 -4942 8164 -7604 4871 -5146 -26877 10876
14095 10876 38519 32184 16128 -4911 -16481 21436 62413 54439 42387 56523 -5542 -15864
14083 -15864 11396 23463 17250 21900 50911 56902 68111 48365 -2782 -22598 -4343 59014
14071 59014 82234 17993 28612 29892 -114 -36768 -1393 -30867 -15061 3537 18955 -3114
14059 -3114 -35918 -78975 -54977 8629 81576 91905 71892 82399 75997 51681 32121 17201
14047 17201 -33630 -65150 -24832 1936 -4138 -46119 -92937 -43717 4106 -22723 -33112 -65405
14035 -65405 -51708 -52155 -15013 53574 64224 30636 -3465 11804 31891 42297 17750 15772
14023 15772 15437 2046 -4877 40881 41316 -14010 6486 30609 27848 -8747 -34832 -12852 -21270
$$ packed form
14107E9440j984M228l858n803k4712l2253J3106j5768J2475j0017k1731L7753
14095A0876K7643o335j6056k1039j1570L7917M0977p974j2052J4136o2065j0322
14083a5864K7260J2067o213M650K9011N991J1209j9746n1147j9816J8255O3357
14071E9014K3220o4241J0619J280l0006l6654L5375k9474J5806J8598J5418k2069
14059c114l2804m3057K3998O3606P2947J0329k0013J0507o402k4316j9560j4920
14047A7201n0831l1520M0318K6768o074m1981m6818M9220M7823k6829j0389l2293
14035f5405J3697m47L7142O8587J0650l3588l4101J5269K0087J0406k4547j978
14023A5772l35j3391o923M5758M35n5326K0496K4123k761l6595k6085K1980q418
$$ plain form
14010 -21270 17041 50533 59542 72073 -3952 -47562 -28165 6975 6616 -123 526 21373 3057
13997 3057 -35677 -54660 -49826 -54575 -49129 -17568 3554 8638 -29578 -67981 -58936 -16754 -17926
13984 -17926 6147 16069 26487 22041 7022 14797 42946 33178 -2020 -7893 18800 19995 31617
13971 31617 34098 10206 -1249 -9137 -25679 -7255 -49966 -100219 -73278 -53388 -41053 -22151
13959 -22151 -2433 18352 -6260 -27577 -13210 14639 53803 49505 57328 33775 -13402 -38153
13947 -38153 -7044 -7970 -31012 -3749 30921 39511 54799 77856 80762 69383 43310 47065 48941
13934 48941 13240 -5162 -2795 27553 25609 -13290 -27793 -43186 -26418 -32523 -26176 6684
13922 6684 -9954 24233 5195 39297 30335 463 9098 -8273 -8000 16683 27621 15665 -28275
$$ packed form
14010b1270L8311L3492R009J2531p6025m3610J9397L5140l59o739O49K0847j8316
13997C057l8734j8983M834m749N446L1561K1122N084l8216l8403R045M2182j172
13984a7926K4073R922J0418m446j5019P775K8149r768l5198n873K6693J195J1622
13971C1617K481k3892j1455p888j6542J8424m2711n0253K6941J9890J2335J8902
13959b2151J9718K0785k4612k1317J4367K7849L9164m298P823k3553m7177k4751
13947c8153L1109r26k3042K7263L4670Q590J5288K3057K906j1379k6073L755J876
13934D8941l5701j8402K367L0348j944l8899j4503j5393J6768o105O347L2860
13922F684j6638L4187j9038L4102q962k9872Q635j7371K73K4683J0938j1956m3940
$$ plain form
13909 -28275 10805 70314 60028 -9361 -16765 -4952 3910 -15058 -4563 -12101 -46982 -57194
13897 -57194 -25949 -46521 -77861 -50105 -9022 22263 38258 20088 30558 11279 3779 18810
13885 18810 17258 3717 -8177 -12972 -24579 -80429 -79078 -50022 -24055 -17341 29200 26247 54681
13872 54681 79163 43787 12019 -21190 -31635 -12523 67449 95299 82081 56882 13763 26995
13860 26995 57678 28677 42428 52666 58906 10137 -7684 3507 -2994 -26913 -12152 -14053
13848 -14053 20455 -7226 -48936 -42369 -25073 -19356 -22655 -53020 -45756 -40655 -20969 -33267 -34599
13835 -34599 15732 57924 40038 -14098 -29463 19537 25398 -7562 -104992 -87571 -43354 -64186
13823 -64186 -69941 -79470 -57319 -33592 -11466 21337 -17635 -44703 -54370 -21977 -34692 -16761
$$ packed form
13909b8275L9080N9509j0286o9389p404J1813Q862j8968J0495p538l4881j0212
13897e7194L1245k0572l1340K7756M1083L1285J5995j8170J0470j9279p500J5031
13885A8810j552j3541j1894m795j1607n5850J351K9056K5967O714M6541k953K8434
13872E4681K4482l5376l1768l3209j0445J9112P9972K7850j3218k5199m3119J3232
13860B6995L0683k9001J3751J0238O240m8769j7821J1191o501k3919J4761j901
13848a4053L4508k7681m1710O567J7296N717l299l0365P264N101J9686j2298j332
13835c4599N0331M2192j7886n4136j5365M9000N861l2960r7430J7421M4217k0832
13823f4186n755r529K2151K3727K2126L2803l8972k7068r667L2393j2715J7931
$$ plain form
13811 -16761 3566 14075 39761 67156 65030 25034 -12714 -37402 6994 8730 -865 39433
13799 39433 20640 8265 17473 852 -24020 -5221 14640 -14280 -56317 -56096 -24240 -38373
13787 -38373 -36523 -12148 6479 49226 49181 66516 20295 -9534 -20666 -25464 -14895 -13176 -26257
13774 -26257 5075 35916 46504 83699 88198 48397 25444 66693 59697 27792 51593 61388
13762 61388 104483 93740 80294 92358 125130 144280 115470 112257 98156 101261 67632 36360
13750 36360 23487 71247 113069 102563 67972 39188 27663 31953 38749 -10 9250 10801
13738 10801 -39504 -6187 -12714 10866 24172 40372 22208 24607 37192 1688 -15202 -13645
13726 -13645 -35692 -48496 -28777 -32221 -21053 -3290 -4224 16306 49543 49879 49442 15971 20346
$$ packed form
13811a6761K0327J0509K5686K7395k126l9996l7748k4688M4396J736r595M0298
13799C9433j8793j2375R208j6621k4872J8799J9861k8920m2037K21L1856j4133
13787c8373J850K4375J8627M2747m5J7335m6221k9829j1132m798J0569J719j3081
13774b6257L1332L0841J0588L7195M499l9801k2953M1249o996l1905K3801R795
13762F1388M3095j0743j3446J2064L2772J9150k8810l213j4101L105l3629l1272
13750C6360j2873M7760M1822j0506l4591k8784j1525M290O796l8759R260J551
13738A0801n0305L3317o527K3580J3306J6200j8164K399J2585l5504j6890J557
13726a3645k2047j2804J9719l444J1168J7763r34K0530L3237L36m37l3471M375
$$ plain form
13713 20346 70329 26050 -23753 12596 24476 43248 54799 24758 29850 33688 34970 54484
13701 54484 60607 37487 -520 -16515 -7574 13612 -1688 14966 57529 95811 132655 124647
13689 124647 110779 74301 134560 216261 284033 377110 505335 691507 1021449 1617500 2348800
13678 2348800 2699333 2451010 1940198 1426156 963434 649046 428064 327149 248378 188102
13668 188102 181228 191017 188018 193015 201549 168847 148722 133384 156263 165073 151744 151235 115107
13655 115107 80724 80255 98237 116186 71179 55305 75732 93216 93936 121146 97351 58475
13643 58475 40632 29300 34975 24543 39316 53028 68411 58424 39410 9723 22697 30782
13631 30782 -11628 -15889 10829 17210 -7910 -14905 11403 48186 55942 28626 20402 19533 22341
$$ packed form
13713B0346M9983m4279m9803L6349J1880J8772J1551l0041N092L838J282J9514
13701E4484O123k3120l8007j5995Q941K1186j5300J6654M2563L8282L6844q008
13689A24647j3868l6478O0259Q1701O7772R3077J28225J86172L29942N96051P31300
13678B348800L50533k48323n10812n14042m62722l14388k20982j00915p8771o0276
13668A88102o874R789k999M997Q534l2702k0125j5338K2879Q810j3329n09l6128
13655A15107l4383m69J7982J7949m5007j5874K0427J7484P20K7210k3795l8876
13643E8475j7843j1332N675j0432J4773J3712J5383r987j9014k9687J2974Q085
13631C0782m2410m261K6718O381k5120o995K6308L6783P756k7316q224q69K808
$$ plain form
13618 22341 -1160 -4737 30934 72358 100956 99636 62962 48827 36852 19257 56037 84813
13606 84813 93496 125189 143467 114466 65220 72678 35504 17332 6668 -13570 -21825 -17139
13594 -17139 -45132 -57489 -14954 5943 30585 70355 55203 23827 13916 44482 45025 46619
13582 46619 41674 27496 4923 6518 25080 16905 33861 16905 53727 78548 57411 49024
13570 49024 76699 84961 63600 85157 87212 76003 53459 3398 5862 73417 129592 67661
13558 67661 44116 59060 79690 98799 128956 140395 96546 108137 91381 84517 115304 115175
13546 115175 126788 175898 270407 244030 169153 105546 22973 -48793 -86018 -72875 -56714
13535 -56714 -75715 -108809 -87753 -76937 -75487 -37503 -14342 -11108 1605 5535 12212 29380
$$ packed form
13618B2341k3501l577L5671M1424K8598j320l6674j4135j1975j7595L6780K8776
13606H4813Q683L1693J8278k9001m9246P458l7174j8172j0664k0238q255M686
13594a7139k7993j2357M2535K0897K4642L9770j5152l1376r911L0566N43J594
13582D6619m945j4178k2573J595J8562q175J6956j6956L6822K4821k1137q387
13570D9024K7675Q262k1361K1557K055j1209k2544n0061K464O7555N6175o1931
13558F7661k3545J4944K0630J9109L0157J1439m3849J1591j6756o864L0787j29
13546A15175J1613M9110R4509k6377p4877o3607q2573p1766l7225J3143J6161
13535e6714j9001l3094K1056J0816J450L7984K3161L234J2713L930O677J7168
$$ plain form
13523 29380 28247 28575 29199 -16911 -52441 -60647 -48964 -12896 -2372 -7382 34035 30164 34643
13510 34643 36460 41926 26322 -12191 -28199 2433 4535 -18634 -16428 10234 16165 3903 4687
13497 4687 39093 73968 74929 90435 64962 67519 92969 139893 176321 188506 189258 174379 180832
13484 180832 198605 241438 246922 194469 184058 159411 122013 93828 80700 80179 111821 131622
13472 131622 126600 111155 127888 160154 195985 205121 163729 170837 136675 117381 171772 245943
13460 245943 271454 338844 329914 307163 329313 358713 377186 422288 451699 488107 566208 698170
13448 698170 913995 1105128 1340307 1677119 2121424 2856122 4172142 6454499 9437981
13439 9437981 11307273 10752717 8842912 6812692 4979399 3560786 2617219 1970488 1515783
$$ packed form
13523B9380j133L28O24m6110l5530q206J1683L6068J0524n010M1417l871M479
13510C4643J817N466j5604l8513j6008L0632K102k3169K206K6662N931j2262P84
13497D687L4406L4875R61J5506k5473K557K5450M6924L6428J2185P52j4879O453
13484A80832J7773M2833N484n2453j0411k4647l7398k8185j3128n21L1642J9801
13472A31622n022j5445J6733L2266L5831R136m1392P108l4162j9294N4391P4171
13460B45943K5511O7390q930k2751K2150K9400J8473M5102K9411L6408P8101J31962
13448F98170K15825J91133K35179L36812M44305P34698J316020K282357K983482
13439I437981J869292n54556j909805k030220j833293j418613r43567o46731m54705
$$ plain form
13430 1515783 1217815 1020371 873904 781211 737738 694100 660926 672487 696283 709397 695218
13419 695218 624858 520187 429730 372184 312322 253227 231157 205139 153555 118983 69318
13408 69318 69986 24135 700 19493 75654 101208 116912 136461 127570 130612 119375 155904
13396 155904 175031 164147 136072 141683 199180 205750 207321 261329 243374 75961 25676 52327
13384 52327 40271 38443 50376 44229 31555 19636 41970 78511 39361 48369 99419 124764
13372 124764 110760 93389 74704 61497 15481 18073 64525 107472 169134 222812 254173 331816
13360 331816 388603 381892 358150 379435 471401 446507 373997 296924 200276 133260 158595 234692
13348 234692 315111 306564 244983 206137 199045 155181 146391 159548 161616 109638 73129 63490
$$ packed form
13430A515783k97968j97444j46467r2693m3473m3638l3174J1561K3796J3114j4179
13419F95218p0360j04671r0457n7546n9862n9095k2070k6018n1584l4572m9665
13408F9318O68m5851k3435J8793N6161K5554J5704J9549q891L042j1237L6529
13396A55904J9127j0884k8075N611N7497O570J571N4008j7955j67413n0285K6651
13384E2327j2056j828J1933o147j2674j1919K2334L6541l9150R008N1050K5345
13372A24764j4004j7371j8685j3207m6016K592M6452M2947O1662N3678L1361P7643
13360C31816N6787o711k3742K1285R1966k4894p2510p7073r6648o7016K5335P6097
13348B34692Q0419q547o1581l8846p092m3864q790J3157K068n1978l6509r639
$$ plain form
13336 63490 65916 101953 135548 152040 185160 210120 255176 248424 230804 191541 178002 174403
13324 174403 161796 156999 152669 165595 235217 256161 239802 223806 201723 211869 198504 229233
13312 229233 226771 246741 293946 320515 311681 312840 358167 380145 410411 432523 434354 430462
13300 430462 478053 466468 446503 436474 502923 522748 528780 534361 505721 510112 546869 558306
13288 558306 554822 588004 623091 608124 618285 651350 675114 694175 724945 729412 723859 721281
13276 721281 746612 798241 835057 854311 906054 1008007 1138727 1234040 1364667 1508211 1571716
13265 1571716 1637815 1715108 1759433 1884441 2155588 2415857 2605472 2776880 3054561 3380591
13255 3380591 3745190 4141940 4599518 5088315 5527989 6108840 6893428 7775086 8861785
$$ packed form
13336F3490K426L6037L3595J6492L3120K4960M5056o752j7620l9263j3539l599
13324A74403j2607m797m330J2926O9622K0944j6359j5996k2083J0146j3365L0729
13312B29233k462J9970M7205K6569q834J159M5327K1978L0266K2112J831l892
13300D30462M7591j1585j9965j0029O6449J9825O032N581k8640M391L6757J1437
13288E58306l484L3182L5087j4967J0161L3065K3764J9061L0770M467n553k578
13276G21281K5331N1629L6816J9254N1743J01953J30720R5313J30627J43544O3505
13265A571716O6099P7293M4325J25008K71147K60269J89615J71408K77681L26030
13255C380591L64599L96750M57578M88797M39674N80851P84588Q81658J086699
$$ plain form
13246 8861785 10279980 12086209 14348518 17143477 20652450 25273146 31350157 39214350
13238 39214350 49617417 64007440 85406148 121643268 190260493 314570875 463985508
13231 463985508 520700943 459099048 359594536 265888240 185304159 127659641 91813277
13224 91813277 69657315 54942113 44591158 37134966 31589401 27240971 23788921 21067434
13216 21067434 18848579 16913534 15216012 13766541 12333587 11052420 10032650 9131225
13208 9131225 8344869 7703836 7073089 6551717 6125834 5725869 5348686 4999139 4693068
13199 4693068 4366205 4021026 3708379 3471864 3208303 3028582 2896699 2796990 2685190 2552694
13189 2552694 2398475 2279083 2130377 2001972 1892426 1802110 1756326 1672188 1545777 1471082
$$ packed form
13246H861785J418195J806229K262309K794959L508973M620696O077011P864193
13238C9214350J0403067J4390023K1398708L6237120O8617225J24310382J49414633
13231D63985508N6715435o1601895r9504512r3706296q0584081n7644518l5846364
13224I1813277k2155962j4715202j0350955p456192n545565m348430l452050k721487
13216B1067434k218855j935045j697522j449471j432954j281167j019770r01425
13208I131225p86356o41033o30747n21372m25883l99965l77183l49547l06071
13199D693068l26863l45179l12647k36515k63561j79721j31883r9709j11800j32496
13189B552694j54219j19392j48706j28405j09546r0316m5784q4138j26411p4695
$$ plain form
13179 1471082 1410508 1347354 1274030 1198478 1124052 1053447 998235 943361 908881 897385 898873
13168 898873 866842 801185 749966 699796 617461 560551 515066 490831 508479 530751 493856
13157 493856 467464 450809 473736 507986 499416 478957 464019 447411 473706 503877 503492 464651
13145 464651 421137 451678 430336 411951 398165 338044 349984 412236 436404 460439 430867
13134 430867 384033 378964 343195 319209 359423 359972 353498 414168 439714 417664 362782 370447
13122 370447 360333 332342 286267 258950 233832 221167 238010 198791 189310 184162 199632 232859
13110 232859 282378 311226 207669 133109 102992 122769 115531 114608 156422 158242 117294 92271
13098 92271 125225 170197 221573 245420 214333 227787 237090 214300 187300 238956 279286 281366
$$ packed form
13179A471082o0574o3154p3324p5552p4426p0605n5212n4874l4480j1496J488
13168H98873l2031o5657n1219n0170q2335n6910m5485k4235J7648K2272l6895
13157D93856k6392j6655K2927L4250q570k0459j4938j6608K6295L0171l85l8841
13145D64651m3514L0541k1342j8385j3786o0121J1940O2252K4168K4035k9572
13134D30867m6834n069l5769k3986M0214N49o474O0670K5546k2050n4882P665
13122C70447j0114k7991m6075k7317k5118j2665J6843l9219r481n148J5470L3227
13110B32859M9519K8848j03557p4560l0117J9777p238r23M1814J820m0948k5023
13098I2271L2954M4972N1376K3847l1087J3454R303k2790k7000N1656M0330K080
$$ plain form
13086 281366 264513 258611 209180 172464 201863 255186 267686 257485 271040 211548 130000 83691
13074 83691 62775 9808 -26252 -5119 -30043 -23747 -20116 -39335 6295 50868 106067 130784
13062 130784 62838 80401 142397 140447 133246 142813 207636 215170 166117 131452 120455 106877
13050 106877 73363 47750 43870 10730 -35296 15289 16224 -40717 -77938 -110284 -122102 -74363
13038 -74363 -34850 -14197 -1475 48292 104246 127100 141091 153374 172034 185083 205689 211483
13026 211483 201137 170901 149710 140292 125790 93833 73612 81301 86052 107698 96902 61515
13014 61515 -5492 22151 40012 39006 69792 79663 96522 70823 74283 64544 48432 36087
13002 36087 56373 69827 61108 89716 93790 42773 38266 22407 34933 15596 43705 88401
$$ packed form
13086B81366j6853n902m9431l6716K9399N3323J2500j0201J3555n9492q1548m6309
13074H3691k0916n2967l6060K1133k4924O296L631j9219M5630M4573N5199K4717
13062A30784o7946J7563O1996j950p201R567O4823P534m9053l4665j0997j3578
13050A06877l3514k5613l880l3140m6026N0585R35n6941l7221l2346j1818M7739
13038g4363L9513K0653J2722M9767N5954K2854J3991J2283J8660J3049K0606N794
13026B11483j0346l0236k1191r418j4502l1957k0221P689M751K1646j0796l5387
13014F1515o7007K7643J7861j006L0786R871J6859k5699L460r739j6112j2345
13002C6087K0286J3454q719K8608M074n1017m507j5859J2526j9337K8109M4696
$$ plain form
12990 88401 103076 125004 180706 166449 194672 188428 194036 187207 131746 104814 126764 163407
12978 163407 164845 114839 26668 -12626 -9531 5213 22608 51191 67973 57708 64166 59984
12966 59984 56146 69682 76789 86769 92090 112289 109378 133430 151429 114758 65344 13028 -16863
12953 -16863 34594 49962 41578 45094 64007 102715 76618 52821 43350 18615 26099 36904
12941 36904 59396 49857 41570 51836 43609 82447 97091 139623 130396 150692 191887 211998
12929 211998 210111 177982 160539 159464 159701 154775 200602 128262 -12025 -91300 -149242 -146251
12917 -146251 -128646 -99164 -84729 -97449 -57000 -45040 -57338 -59439 -39437 -48451 -48393 -6465
12905 -6465 21280 18697 -42864 -29294 26483 69364 70186 36164 26233 59601 36566 -658 -42181
$$ packed form
12990H8401J4675K1928N5702j4257K8223o244N608o829n5461k6932K1950L6643
12978A63407J438n0006q8171l9294L095J4744J7395K8583J6782j0265O458m182
12966E9984l838J3536P107R980N321K0199k911K4052J7999l6671m9414n2316k9891
12953a6863N1457J5368q384L516J8913L8708k6097k3797r471k4735P484J0805
12941C6904K2492r539q287J0266q227L8838J4644M2532r227K0296M1195K0111
12929B11998j887l2129j7443j075K37m926M5827p2340j40287p9275n7942K991
12917a46251J7605K9482J4435j2720M0449J1960j2298k101K0002r014N8M1928
12905f465K7745k583o1561J3570N5777M2881Q22l4022r931L3368k3035l7224m1523
$$ plain form
12892 -42181 1824 -17168 13901 34748 18481 -4282 22457 30846 37821 43914 -4701 26396
12880 26396 7156 -44615 -39832 -13487 -10595 1023 19628 42431 54920 68952 39201 31581
12868 31581 -9959 20563 -29057 -52616 -27406 -24657 -28188 -20027 -9459 -28047 -42073 10191
12856 10191 36703 16436 15545 29499 21967 10643 5489 32502 38909 17325 34356 18567 21720
12843 21720 58895 93589 115038 66311 37991 44252 56695 6788 1626 -1140 -17300 -21920
12831 -21920 16910 -13925 -15530 2860 37668 78790 73002 84120 91244 52771 61807 84249
12819 84249 101541 105090 118640 87653 82428 57581 19228 14129 62189 76837 72920 36697
12807 36697 -13930 -58345 -50032 -35766 -28136 -21867 -10349 -8677 -55903 -55339 -14426 21400 -3910
$$ packed form
12892d2181M4005j8992L1069K0847j6267k2763K6739Q389O975O093m8615L1097
12880B6396j9240n1771M783K6345K892J1618J8605K2803J2489J4032k9751p620
12868C1581m1540L0522m9620k3559K5210K749l531Q161J0568j8588j4026N2264
12856A0191K6512k0267q91J3954p532j1324n154K7013O407k1584J7031j5789L153
12843B1720L7175L4694K1449m8727k8320O261J2443m9907n162k766j6160m620
12831b1920L8830l0835j605J8390L4808M1122n788J1118P124l8473R036K2442
12819H4249J7292L549J3550l0987n225k4847l8353n099M8060J4648l917l6223
12807C6697n0627m4415Q313J4266P630O269J1518J672m7226N64M0913L5826k5310
$$ plain form
12794 -3910 -71029 -40442 9346 57234 64169 57804 79518 109945 146041 179894 249924 366658
12782 366658 505673 698961 1028309 1694015 2404020 2679278 2335613 1847899 1392440 972788
12772 972788 678435 488102 372323 299865 226659 191202 186329 128729 121420 119078 87301
12761 87301 112396 142134 125598 78552 53840 36480 48778 95241 119934 138386 127274 97058
12749 97058 75908 50057 46358 25961 43037 60376 60321 54819 46998 46435 27170 45191 47572
12736 47572 20873 23504 10251 9830 23914 22466 5014 -21125 -15314 14583 31206 37104 33105
12723 33105 64230 73271 48820 19458 29516 42992 -11004 -11304 -14389 40472 30919 -13933 -8528
12710 -8528 587 -22342 -21529 13786 21357 4122 9694 9392 -20304 -30840 -45111 -35271 8304
$$ packed form
12794c910o7119L0587M9788M7888O935o365K1714L0427L6096L3853P0030J16734
12782C66658J39015J93288L29348O65706P10005K75258l43665m87714m55459m19652
12772I72788k94353j90333j15779p2458p3206l5457m873n7600p309k342l1777
12761H7301K5095K9738j6536m7046k4712j7360J2298M6463K4693J8452j1112l0216
12749I7058k1150k5851l699k0397J7076J7339n5n502p821n63j9265J8021K381
12736D7572k6699K631j3253m21J4084j448j7452k6139N811K9897J6623N898l999
12723C3105L1125R041k4451k9362J0058J3476n3996l00l085N4861r553m4852N405
12710h528R115k2929Q13L5315P571j7235N572l02k9696j0536j4271R840M3575
$$ plain form
12697 8304 46394 105613 83664 83495 66220 39981 18767 10485 27187 -25602 -38882 -49557
12685 -49557 -32735 28351 14758 -10039 -4091 29577 42655 -8707 5716 223 -13273 -22376
12673 -22376 1394 31779 43672 66718 22072 -3122 12060 29617 57022 75939 110583 142797
12661 142797 79329 9231 5975 19756 9570 5460 -8325 -541 5100 43405 88941 70216
12649 70216 28310 2692 4309 -17974 -36268 -12193 18196 -9965 -47076 -13851 35128 39318
12637 39318 36148 52132 37766 67016 58788 25650 2571 -15480 -15388 3492 39768 65640 73819
12624 73819 60129 72740 87797 74445 14201 31749 62828 31835 10586 27923 -9235 1245
12612 1245 24086 1587 -1340 454 -9227 -32522 -33896 -39885 -3251 7884 21875 16064 31696
$$ packed form
12697H304L8090N9219k1949j69j7275k6239k1214q282J6702n2789j3280j0675
12685d9557J6822O1086j3593k4797N948L3668J3078n1362J4423n493j3496r103
12673b2376K3770L0385J1893K3046m4646k5194J5182J7557K7405J8917L4644L2214
12661A42797o3468p0098l256J3781j0186m110j3785P784N641L8305M5536j8725
12649G0216m1906k5618J617k2283j8294K4075L0389k8161l7111L3225M8979M190
12637C9318l170J5984j4366K9250q228l3138k3079j8051R2J8880L6276K5872Q179
12624G3819j3690J2611J5057j3352o0244J7548L1079l0993k1249J7337l7158J0480
12612A245K2841k2499k927J794r681k3295j374n989L6634J1135J3991n811J5632
$$ plain form
12599 31696 2878 -31303 1493 -7531 -55900 -44733 -37654 -45565 -40805 -32181 -32046 -31394 -8193
12586 -8193 -4939 -28321 -34367 -19556 -6183 -11348 22734 34811 50959 38798 31664 13311 -23842
12573 -23842 -36094 -24580 34630 72185 52371 -10171 -63319 -68538 -33713 -31006 -41326 -31758
12561 -31758 -3746 -20909 -16204 5463 10903 -57457 -30711 19573 -21765 -36564 -21642 -9891
12549 -9891 39884 41157 9577 805 4405 19795 50693 91108 90046 78735 37122 22854 34908
12536 34908 31816 55428 53558 18985 -17458 -12017 14268 17526 41122 18918 -20185 7288
12524 7288 49857 32356 22002 -11851 26124 43548 41689 16746 161 -50628 -45561 -10707
12512 -10707 9122 24075 18710 -30379 -41549 -53265 -18314 -16125 29019 42934 33041 38003
$$ packed form
12599C1696k8818l4181L2796r024m8369J1167P079p911M760Q624J35O52K3201
12586h193L254k3382o046J4811J3373n165L4082J2077J6148j2161p134j8353l7153
12573b3842j2252J1514N9210L7555j9814o2542n3148n219L4825K707j0320R568
12561c1758K8012j7163M705K1667N440o8360K6746N0284m1338j4799J4922J1751
12549i891M9775J273l1580q772L600J5390L0898M0415j062j1311m1613j4268J2054
12536C4908l092K3612j870l4573l6443N441K6285L258K3596k2204l9103K7473
12524G288M2569j7501j0354l3853L7975J7424j859k4943j6585n0789N067L4854
12512a0707J9829J4953n365m9089j1170j1716L4951K189M5144J3915r893M962
$$ plain form
12500 38003 27392 59154 76580 69527 39105 24868 9016 -27400 -38990 -44373 -23193 19129
12488 19129 39793 48115 44959 65115 75149 28281 -7683 -287 13750 6143 -3258 7669 -9857
12475 -9857 -20668 -22395 -12965 -15870 -19364 2516 -4768 1029 -639 2356 -3658 -24537 -23431 -40977
12461 -40977 -21040 12021 55047 69044 32659 2341 11613 33204 10229 -3261 -15071 -38120
12449 -38120 -30910 -39609 -797 8552 3013 -43977 -44487 -37648 -47880 -49966 -19799 -6544 19190
12436 19190 3210 -5790 -16418 -10324 -6494 4438 52998 32991 4460 8631 61096 55263 -3107
12423 -3107 -35350 -39148 34391 51038 39343 25317 2114 -22290 -16407 -6834 -16825 -9198 -4568
12410 -4568 28319 52511 49896 37148 9167 -24498 -716 15399 -920 55594 80564 56816
$$ packed form
12500C8003j0611L1762J7426p053l0422j4237j5852l6416j1590n383K1180M2322
12488A9129K0664Q322l156K0156J0034m6868l5964P396J4037p607r401J0927j7526
12475i857j0811j727R430k905l494K1880p284N797j668K995o014k0879J106j7546
12461d0977J9937L3061M3026J3997l6385l0318R272K1591k2975j3490j1810k3049
12449c8120P210q699L8812R349n539m6990n10O839j0232k086L0167J3255K5734
12436A9190j5980r000j0628O094L830J0932M8560k0007k8531M171N2465n833n8370
12423c107l2243l798P3539J6647j1695j4026k3203k4404N883R573r991P627M630
12410d568L2887K4192k615j2748k7981l3665K3782J6115j6319N6514K4970k3748
$$ plain form
12398 56816 75607 69456 48753 29186 42205 25510 9605 -21109 6318 14813 33902 34625
12386 34625 38847 64390 34594 29253 3596 -10746 1521 21085 -39321 -59940 -28694 -37467
12374 -37467 -54269 -54573 -20855 -14606 -25118 -31540 -13997 6507 8071 22600 76259 50571 21661
12361 21661 37139 58683 47868 36021 8186 -43039 -47612 -10459 -27715 -540 20272 29202
12349 29202 -5365 -13342 2480 11395 -12826 -51700 -50842 -42409 -28180 -34147 -24172 -10574 -3297
12336 -3297 20679 27328 25312 21514 45407 52327 29332 66506 91126 57640 5780 38199 5311
12323 5311 -1236 -14750 5230 22011 24004 16118 24622 18646 34565 34352 7388 -24280 -28834
12310 -28834 11915 2450 6179 -16457 -12816 -26063 -15141 -39568 2499 26764 38781 43628
$$ packed form
12398E6816J8791o151k0703j9567J3019j6695j5905l0714K7427Q495J9089P23
12386C4625M222K5543k9796n341k5657j4342J2267J9564o0406k0619L1246q773
12374c7467j6802l04L3718O249j0512o422J7543K0504J564J4529N3659k5688k8910
12361B1661J5478K1544j0815j1847k7835n1225m573L7153j7256K7175K0812Q930
12349B9202l4567p977J5822Q915k4221l8874Q58Q433J4229n967R975J3598P277
12336c297K3976O649k016l798K3893O920k2995L7174K4620l3486n1860L2419l2888
12323E311o547j3514J9980J6781J993p886Q504n976J5919k13k6964l1668m554
12310b8834M0749r465L729k2636L641j3247J0922k4427M2067K4265J2017M847
$$ plain form
12298 43628 15372 35638 23744 7439 36359 44530 14125 -16906 -17919 -27083 -14673 8070
12286 8070 38248 94068 81190 62754 34411 -6188 12053 37051 22104 899 -803 28509
12274 28509 25393 9692 -39831 -5306 14317 61409 88511 90052 77363 36658 45705 37463
12262 37463 23615 38312 -17137 -51336 -53899 -24197 -1639 -39384 -38991 -38843 -20465 1888 -35863
12249 -35863 -37367 -30809 -6472 -1021 16351 15517 27616 33987 26018 -2156 -49322 8735 43995
12236 43995 14572 -11793 -24857 -8619 -6300 -27557 -41401 -35838 -6930 -41314 -23423 10409
12224 10409 -10892 -49697 -70998 -72318 -51050 -17462 -13887 8747 -761 -4882 56505 70280
12212 70280 45449 37460 56418 26194 -10584 -54513 -55218 -39929 -26649 6697 -9061 -35720
$$ packed form
12298D3628k8256K0266j1894j6305K8920Q171l0405l1031j013r164J2410K2743
12286H070L0178N5820j2878j8436k8343m0599J8241K4998j4947k1205j702K9312
12274B8509l116j5701m9523L4525J9623M7092K7102J541j2689m0705R047q242
12262C7463j3848J4697n5449l4199k563K9702K2558l7745L93J48J8378K2353l7751
12249c5863j504O558K4337N451J7372q34J2099O371p969k8174m7166N8057L5260
12236D3995k9423k6365j3064J6238K319k1257j3844N563K8908l4384J7891L3832
12224A0409k1301l8805k1301j320K1268L3588L575K2634r508m121O1387J3775
12212G0280k4831p989J8958l0224l6778m3929p05J5289J3280L3346j5758k6659
$$ plain form
12200 -35720 -34016 -58373 -57563 3523 4279 -9311 7973 21329 28431 -11771 -14292 13048 14757
12187 14757 21147 -2916 3384 12641 16780 50498 60938 59648 -1122 -17183 16473 39983 41842
12174 41842 29542 24618 27903 52184 51365 38460 1246 934 41367 39326 8743 3778 6120
12161 6120 22427 48422 8239 -13090 8754 -46329 -34516 -27085 -18958 -31152 -39979 -26672
12149 -26672 -12367 19412 -25719 -49401 -35605 -22588 -14995 -11008 -35789 -71317 -65672 -64743 -9091
12136 -9091 12979 -7630 -14787 18046 23309 -5603 -33730 -1773 16108 -18610 -57312 -25011
12124 -25011 -11917 -4475 -18823 -6720 -29187 -26205 -16876 -30406 -42548 -34338 -39697 -13009 -15565
12111 -15565 -37684 -41975 -35675 -24874 27957 -8464 -38581 -17128 -14833 -17996 15358 43614
$$ packed form
12200c5720J704k4357Q10O1086P56j3590J7284J3356P102m0202k521K7340J709
12187A4757O390k4063O300R257M139L3718J0440j290o0770j6061L3656K3510J859
12174D1842j2300m924L285K4281q19j2905l7214l12M0433k041l0583m965K342
12161F120J6307K5995m0183k1329K1844n5083J1813P431Q127j2194q827J3307
12149b6672J4305L1779m5131k3682J3796J3017P593L987k4781l5528N645R29N5652
12136i091K2070k0609p157L2833N263k8912k8127L1957J7881l4718l8702L2301
12124b5011J3094P442j4348J2103k2467K982R329j3530j2142Q210n359K6688k556
12111a5565k2119m291O300J0801N2831l6421l0117K1453K295l163L3354K8256
$$ plain form
12099 43614 17086 14948 2515 -47037 -38389 2038 13382 2471 -3312 -1437 -32930 -24520 14175
12086 14175 32846 36056 -8722 -31241 -1261 4625 648 10544 -4508 1771 -14806 -58204 -46002
12073 -46002 -43817 -19820 25273 9138 11318 -22111 -43496 -41801 -32535 -6983 373 25485 -8356
12060 -8356 2133 4513 13147 31615 -11019 -24680 -45864 -56892 -58595 -48453 -77367 -57963
12048 -57963 -67314 -71192 -9845 3258 -26487 -25376 -14111 -10898 2975 -15117 -32951 -37913 -15937
12035 -15937 -5188 30474 58091 60851 38470 14234 -2575 5907 23129 38603 17014 8312
12023 8312 3969 5451 8906 1150 -15463 -45968 -25356 33746 56379 31461 -11376 3092 12185
12010 12185 21720 20755 8557 1359 86 28773 17201 32273 25278 -17972 -21287 18520 12121
$$ packed form
12099D3614k6528k138j2433m9552Q648M0427J1344j0911n783J875l1493Q410L8695
12086A4175J8671L210m4778k2519K9980N886l977R896j5052O279j6577m3398J2202
12073d6002K185K3997M5093j6135K180l3429k1385J695R266K5552P356K5112l3841
12060h356J0489K380Q634J8468m2634j3661k1184j1028j703J0142k8914J9404
12048e7963r351l878O1347J3103k9745J111J1265L213J3873j8092j7834m962K1976
12035a5937J0749L5662K7617K760k2381k4236j6809Q482J7222J5474k1589q702
12023H312m343J482L455p756j6613l0505K0612N9102K2633k4918m2837J4468R093
12010A2185R535r65j2198p198j273K8687j1572J5072o995m3250l315L9807o399
$$ plain form
11997 12121 9240 16586 60927 58509 74383 72189 -4475 3716 -23210 -30015 631 -13922 26378
11984 26378 43795 11266 -18452 -6210 4228 17537 25263 32179 24628 5067 39734 43791
11972 43791 32880 47905 37166 10503 -28336 -64292 -47185 18885 40196 9908 -80198 -84634
11960 -84634 1254 29519 21409 3389 -1995 7637 51345 83494 79707 52960 39975 12446
11948 12446 -35750 -33629 -18415 25063 15822 -16880 -53908 -31998 -24104 -36149 -29523 -12592
11936 -12592 -36480 -35422 -29896 -43589 -53914 -46102 -22486 41428 86145 34220 -2671 -9284
11924 -9284 -2918 756 -5683 23285 69382 55282 39519 12298 -5628 9 52372 60565 52145
11911 52145 87176 48450 7298 12383 -11507 2334 50950 63998 47294 41104 35499 50711
$$ packed form
11997A2121k881P346M4341k418J5874k194p6664Q191k6926o805L0646j4553M0300
11984B6378J7417l2529k9718J2242J0438J3309P726O916p551j9561L4667M057
11972D3791j0911J5025j0739k6663l8839l5956J7107O6070K1311l0288r0106m436
11960h4634Q5888K8265q110j8020n384R632M3708L2149l787k6747j2985k7529
11948A2446m8196K121J5214M3478r241l2702l7028K1910P894j2045O626J6931
11936a2592k3888J058N526j3693j0325P812K3616O3914M4717n1925l6891o613
11924i284O366L674o439K8968M6097j4100j5763k7221j7926N637N2363Q193q420
11911E2145L5031l8726m1152N085k3890J3841M8616J3048j6704o190n605J5212
$$ plain form
11899 50711 82475 12307 -39155 -26966 -22969 -51269 -8475 60800 20101 30256 43838 14318
11887 14318 -615 20549 57228 25528 9729 13303 -39254 -55798 -15008 16779 41246 55530
11875 55530 37431 28541 25962 27726 25500 9689 21749 21279 -8795 870 55110 50368 5629
11862 5629 -7207 -27593 -55991 -59688 -760 24046 28594 18925 -14589 -20207 50169 48352 13067
11849 13067 16921 21407 11689 27708 58405 36414 -5482 -25491 -24445 -8092 -16152 632 -29993
11836 -29993 -58144 -62375 -70381 -56164 -16094 -17119 405 607 12761 55428 39059 22885 -18076
11823 -18076 -35614 -59595 -35012 9305 6250 20614 -25145 -42970 -30173 -49824 -74702 -85251
11811 -85251 -88998 -61676 -54640 -42732 -28731 -21208 -60985 -87308 -45436 3472 -8011 -16661
$$ packed form
11899E0711L1764p0168n1462J2189L997k8300M2794O9275m0699J0155J3582k9520
11887A4318j4933K1164L6679l1700j5799L574n2557j6544M0790L1787K4467J4284
11875E5530j8099q890k579J764k226j5811J2060m70l0074R665N4240m742m4739
11862E629j2836k0386k8398l697N8928K4806M548r669l3514n618P0376j817l5285
11849A3067L854M486r718J6019L0697k1991m1896k0009J046J6353q060J6784l0625
11836b9993k8151m231q006J4217M0070j025J7524K02J2154M2667j6369j6174m0961
11823a8076j7538k3981K4583M4317l055J4364m5759j7825J2797j9651k4878j0549
11811h5251l747K7322P036J1908J4001P523l9777k6323M1872M8908j1483q650
$$ plain form
11799 -16661 18464 36520 28483 9598 48625 47974 16111 20654 8166 -6263 -23668 -14309 11003
11786 11003 -26971 -69255 -75603 -4751 28804 14872 35962 49712 58906 51016 2627 1120
11774 1120 18862 -3284 25264 11656 4168 1754 -32090 -54543 -38810 -2488 -8159 -38839
11762 -38839 -31092 8238 63701 28036 9366 41908 48981 13224 -3969 -14693 -2630 30473
11750 30473 -12088 -36179 -496 14131 -57994 -80567 -79311 -64616 -34572 7005 27507 46549
11738 46549 68404 86375 63989 37069 -10662 -32450 -63345 -71341 -31105 2641 -21039 -20059
11726 -20059 1633 18451 33656 8577 -35659 -48604 -35539 -16991 -44182 -48527 -31544 -69787
11714 -69787 -52573 -10150 51697 56546 35584 33841 17046 -13093 -33462 -34646 -49222 -61247
$$ packed form
11799a6661L5125J8056q037j8885L9027o51l1863M543j2488j4429j7405R359K5312
11786A1003l7974m2284o348P0852L3555j3932K1090J3750R194p890m8389j507
11774A120J7742k2146K8548j3608p488k414l3844k2453J5733L6322n671l0680
11762c8839P747L9330N5463l5665j8670L2542P073l5757j7193j0724J2063L3103
11750C0473m2561k4091L5683J4627p2125k2573J256J4695L0044M1577K0502J9042
11738D6549K1855J7971k2386k6920m7731k1788l0895p996M0236L3746k3680R80
11726b0059K1692J6818J5205k5079m4236j2945J3065J8548k7191m345J6983l8243
11714f9787J7214M2423O1847M849k0962j743j6795l0139k0369j184j4576j2025
$$ plain form
11702 -61247 -70641 -76366 -65465 -22115 4994 -650 -10145 -10739 -14102 -21803 -55425 6048 3832
11689 3832 -19526 -14901 16787 13751 27383 7765 -7484 -5886 5886 18685 11267 -3413 5881
11676 5881 -28318 -33501 -54002 -68678 -61731 -91308 -97997 -79026 -43477 -22028 25301 100661
11664 100661 83663 41472 52201 45439 31893 13063 2903 -24538 -24274 6508 32986 38426
11652 38426 44819 19793 44195 13126 -13805 -6334 -30504 -42538 -13865 -4058 19202 46917
11640 46917 5587 -30814 -34043 -28101 -40569 -15750 -4276 -33339 -13727 11694 -13133 -10195
11628 -10195 -13596 -30989 -35083 -41487 -31033 12713 -30043 -54375 -24527 -15460 -23446 -33721 -11103
11615 -11103 -27516 -9417 17002 25413 49190 50484 12730 8308 -17792 -23850 16504 21460 3882
$$ packed form
11702f1247r394n725J0901M3350K7109n644r495n94l363p701l3622O1473k216
11689C832k3358M625L1688l036J3632j9618j5249J598J1772J2799p418j4680R294
11676E881l4199n183k0501j4676O947k9577o689J8971L5549K1449M7329P5360
11664A00661j6998m2191J0729o762j3546j8830j0160k7441K64L0782K6478N440
11652C8426O393k5026K4402l1069k6931P471k4170j2034K8673R807K3260K7715
11640D6917m1330l6401l229N942j2468K4819J1474k9063J9612K5421k4827K938
11628a0195l401j7393m094o404J0454M3746m2756k4332K9848R067p986j0275K2618
11615a1103j6413J8099K6419Q411K3777J294l7754m422k6100o058M0354M956j7578
$$ plain form
11602 3882 24610 -22998 -31742 -14301 -10682 -20616 8856 1651 8141 33562 49857 58391 19506
11589 19506 -7299 -24035 -54916 -51049 -23884 -7299 -7934 17693 7980 19808 39572 1067
11577 1067 -8684 -25496 -4716 18965 62204 99250 131154 115187 64530 42117 48947 40925
11565 40925 20989 36491 -6076 -30174 5634 8525 11684 -5897 -31515 -76139 -58041 -495
11553 -495 20468 14439 -7062 39534 56613 62133 56295 32451 6059 -13854 -31627 -19986 -45488
11540 -45488 -49435 -31642 -30023 -15450 -12690 -12547 -7522 10252 24100 22825 13282 15448 -10502
11527 -10502 3986 6972 -17131 -35344 -25676 -9593 -16272 -10024 -8667 -21614 -31923 28091 26728
11514 26728 1604 -4509 -27465 -21817 -9798 -6147 -17454 -928 15460 7721 27593 48676
$$ packed form
11602C882K0728m7608q744J7441L619r934K9472p205O490K5421J6295Q534l8885
11589A9506k6805j6736l0881L867K7165J6585o35K5627r713J1828J9764l8505
11577A067r751j6812K0780K3681M3239L7046L1904j5967n0657k2413O830q022
11565D0925j9936J5502m2567k4098L5808K891L159j7581k5618m4624J8098N7546
11553d95K0963o029k1501M6596J7079N520n838k3844k6392j9913j7773J1641k5502
11540d5488l947J7793J619J4573K760J43N025J7774J3848j275r543K166k5950
11527a0502J4488K986k4103j8213R668J6083o679O248J357j2947j0309O0014j363
11514B6728k5124o113k2956N648J2019L651j1307J6526J6388p739J9872K1083
$$ plain form
11502 48676 62509 86688 91164 62510 24000 37485 11249 2785 -44407 -99401 -93143 -37552
11490 -37552 -48653 -42405 -1380 -42756 -112123 -95426 -34373 -25487 -278 26570 40027 74199
11478 74199 70274 26801 -6485 -20801 1191 34717 8035 6343 35029 40049 8322 -10640
11466 -10640 5131 7577 8726 7672 18142 -1070 -26174 8158 18818 20376 11001 5139 -23670
11453 -23670 2551 -18649 -28788 -32683 -26637 -31787 -48457 -38950 -42098 -61506 -57106 -63949 -33209
11440 -33209 22499 55856 46080 33040 15413 31769 37586 11904 -6126 33135 103942 90672
11428 90672 81488 44397 -17178 -49532 -44478 59 13908 -19570 -24166 -34058 -29463 -48944 -56769
11415 -56769 -31043 -2192 -2036 -17436 1274 28316 29509 -4283 -21226 -80352 -65546 -26544
$$ packed form
11502D8676J3833K4179M476k8654l8510J3485k6236q464m7192n4994O258N5591
11490c7552j1101O248M1025m1376o9367J6697O1053Q886K5209K6848J3457L4172
11478G4199l925m3473l3286j4316K1992L3526k6682j692K8686N020l1727j8962
11466a0640J5771K446J149j054J0470j9212k5104L4332J0660J558r375n862k8809
11453b3670K6221k1200j0139l895O046n150j6670R507l148j9408M400o843L0740
11440c3209N5708L3357r776j3040j7627J6356N817k5682j8030L9261P0807j3270
11428I0672r184l7091o1575l2354N054M4537J3849l3478m596r892M595j9481p825
11415e6769K5726K8851J56j5400J8710K7042J193l3792j6943n9126J4806L9002
$$ plain form
11403 -26544 -34453 -6629 18502 44413 48054 25309 -16668 15905 60162 63192 47559 -1837
11391 -1837 8246 32192 23495 12035 -39081 -16254 41667 -13261 -26480 -27893 -9674 -22339
11379 -22339 -1591 -18660 -25394 -18782 291 8810 57671 86462 71508 44761 22576 17149
11367 17149 -7072 28203 75455 59759 10086 10976 23535 42605 8844 -2562 -1330 840
11355 840 -14440 -18186 27171 12630 -26206 -11377 15524 39602 -3842 -29500 39464 77454
11343 77454 68983 56312 4475 -29092 -28391 -25129 -20977 -3893 -21671 -27295 -14026 16589 48662
11330 48662 7330 7746 -15595 -61602 -62278 -31044 -13834 14363 5401 2305 7091 6356 15879 23722
11316 23722 6447 -7339 39063 7587 -9677 -53916 -94783 -86863 -51984 -26756 -20785 -41020
$$ packed form
11403b6544p909K7824K5131K5911L641k2745m1977L2573M4257L030j5633m9396
11391a837J0083K3946q697j1460n1116K2827N7921n4928j3219j413J8219j2665
11379b2339K0748j7069o734O612J9073Q519M8861K8791j4954k6747k2185n427
11367A7149k4221L5275M7252j5696m9673Q90J2559J9070l3761j1406J232K170
11355H40j5280l746M5357j4541l8836J4829K6901K4078m3444k5658O8964L7990
11343G7454q471j2671n1837l3567P01L262M152J7084j7778n624J3269L0615L2073
11330D8662m1332M16k3341m6007o76L1234J7210K8197q962l096M786p35R523P843
11316B3722j7275j3786M6402l1476j7264m4239m0867P920L4879K5228N971k0235
$$ plain form
11304 -41020 -51544 -21086 -14429 -39550 -47188 -58114 -56375 -88865 -55284 -1847 10447 25894
11292 25894 29351 13291 -3708 -16090 -17094 -13047 -15104 9948 5695 -8142 -46387 -55547 -58482
11279 -58482 -51133 -69424 -51210 -2354 18104 -36606 -62949 -28704 -14849 20450 55564 30101
11267 30101 1788 23100 -8393 -81377 -44392 9265 17235 5313 3020 -7352 -47355 -92929
11255 -92929 -104239 -86865 -70789 -27401 -25845 -31350 -6563 -17538 -41729 -47949 -23247 15551
11243 15551 44863 75525 68964 46007 57651 23490 -12117 -13253 6610 -9456 -38308 -37358
11231 -37358 -19605 6728 43741 52266 22274 21392 -9647 -10366 4520 25908 2389 -8548 -16736
11218 -16736 -42124 -7363 -10025 -28276 -27338 -1874 12313 3546 -5620 -12663 780 -25022 -23835
$$ packed form
11304d1020j0524L0458O657k5121p638j0926J739l2490L3581N3437J2294J5447
11292B5894L457j6060j6999j2382j004M047k057K5052m253j3837l8245r160k935
11279e8482P349j8291J8214M8856K0458n4710k6343L4245J3855L5299L5114k5463
11267C0101k8313K1312l1493p2984L6985N3657P970j1922k293j0372m0003m5574
11255i2929j1310J7374J6076M3388J556n505K4787j0975k4191o220K4702L8798
11243A5551K9312L0662o561k2957J1644l4161l5607j136J9863j6066k8852R50
11231c7358J7753K6333L7013Q525k9992q82l1039p19J4886K1388k3519j0937q188
11218a6736k5388L4761k662j8251R38K5464J4187q767r166p043J3443k5802J187
$$ plain form
11205 -23835 20813 30372 19983 11270 -24392 16447 54971 53329 46454 53587 32941 14904 66884
11192 66884 83078 38396 540 -24181 -23695 9020 23032 34449 23691 16198 41522 37745
11180 37745 9871 37457 21717 7356 28587 16521 44067 32170 -6791 9297 29332 33822
11168 33822 -10203 -56947 -22402 5394 -1695 -48787 -58947 -32126 932 30135 -5570 22743
11156 22743 36546 5958 -7344 -20803 -43497 -47439 -55920 -18874 -8958 -31959 22446 18931
11144 18931 22608 45775 28658 9287 -5739 13281 -9909 -31022 -92199 -85055 -26708 4813
11132 4813 13483 15629 8115 -27455 -34639 8042 26917 19309 4812 -10937 27797 17846 16517
11119 16517 33744 59307 58931 22193 7443 -32169 -59809 -31177 3258 2394 -53100 -49905 -18420
$$ packed form
11205b3835M4648R559j0389q713l5662M0839L8524j642o875P133k0646j8037N1980
11192F6884J6194m4682l7856k4721M86L2715J4012J1417j0758p493K5324l777
11180C7745k7874K7586j5740j4361K1231j2066K7546j1897l8961J6088K0035M490
11168C3822m4025m6744L4545K7796p089m7092j0160K6821L3058K9203l5705K8313
11156B2743J3803l0588j3302j3459k2694l942q481L7046R916k3001N4405l515
11144A8931L677K3167j7117j9371j5026J9020k3190k1113o1177P144N8347L1521
11132D813Q670K146p514l5570p184M2681J8875p608j4497j5749L8734r951j329
11119A6517J7227K5563l76l6738j4750l9612k7640K8632L4435q64n5494L195L1485
$$ plain form
11106 -18420 33033 12 -57545 -79092 -29332 34396 50077 15188 -33728 -21445 22091 64459
11094 64459 57451 37886 49612 13811 -26050 12206 51938 20371 -5417 -3085 19560 16058
11082 16058 -37169 -57955 -26149 -26205 -20010 -17989 -47997 -75918 -97158 -66408 -3543 2999 9253
11069 9253 14804 45261 13112 -14852 -27835 -32940 -29665 -25719 -7608 42169 25275 4817 20545
11056 20545 36855 48487 5384 -5803 13577 27987 31038 38091 45676 59434 64369 26231
11044 26231 13279 -13105 -13570 6501 -15799 -17380 -44861 -46363 -14432 -22431 -27543 -32863 -64460
11031 -64460 -64172 -45547 -2345 20085 -18546 -80432 -73506 -41029 -57285 -34997 17797 39461
11019 39461 33935 49702 16936 -3231 2962 21546 23676 34942 11905 -40374 -25709 -39832
$$ packed form
11106a8420N1453l3021n7557k1547M9760O3728J5681l4889m8916J2283M3536M2368
11094F4459p008j9565J1726l5801l9861L8256L9732l1567k5788K332K2645l502
11082A6058n3227k0786L1806n6O195K021l0008k7921k1240L0750O2865O542O254
11069I253N551L0457l2149k7964j2983n105L275L946J8111M9777j6894k0458J5728
11056B0545J6310J1632m3103j1187J9380J4410L051P053P585J3758M935l8138
11044B6231j2952k6384m65K0071k2300j581k7481j502L1931p999n112n320l1597
11031f4460K88J8625M3202K2430l8631o1886O926L2477j6256K2288N2794K1664
11019C9461n526J5767l2766k0167O193J8584K130J1266k3037n2279J4665j4123
$$ plain form
11007 -39832 -81689 -85359 -86258 -67422 -59117 -67773 -62023 -51356 -21406 -17211 -49216 -29389 -5872
10994 -5872 -2691 -14180 -18856 28065 17403 -17043 -2868 8099 14273 -10020 -34773 1076
10982 1076 -6361 -31679 -25655 -27883 -26744 -10937 10464 40961 -12057 -22067 -8531 40735 58770
10969 58770 54212 -28534 -85688 -90130 -69310 -40550 -42390 -44064 -41921 -38077 -47417 -32907 -8294
10956 -8294 -9320 -20325 6591 16372 -10770 4506 34831 -6494 -26292 -41100 -47580 -11091
10944 -11091 -3983 -15607 -351 17441 2212 -15449 -190 11427 -9588 -47265 -38482 -48585
10932 -48585 -82003 -49069 -1539 12841 -8652 -16389 8939 29625 28806 -6227 -23189 25350
10920 25350 38337 52878 23764 21392 53772 71789 71612 30958 26569 47023 53802 52660 85032
$$ packed form
11007c9832m1857l670q99J8836Q305q656N750J0667K9950M195l2005J9827K3517
10994e872L181j1489m676M6921j0662l4446J4175J0967O174k4293k4753L5849
10982A076p437k5318O024k228J139J5807K1401L0497n3018j0010J3536M9266J8035
10969E8770m558q2746n7154m442K0820K8760j840j674K143L844r340J4510K4613
10956h294j026j1005K6916R781k7142J5276L0325m1325j9798j4808o480L6489
10944a1091P108j1624J5256J7792j5229j7661J5259J1617k1015l7677Q783j0103
10932d8585l3418L2934M7530J4380k1493p737K5328K0686q19l5033j6962M8539
10920B5350J2987J4541k9114k372L2380J8017j77m0654m389K0454O779j142L2372
$$ plain form
10907 85032 90222 45101 27197 11429 -39520 -33584 21907 50847 62857 89112 99877 102159
10895 102159 55400 27596 11963 8267 22709 11499 -2803 25213 14350 21196 39342 6846
10883 6846 -12182 27422 62429 64056 3311 93 -838 -69741 -91860 -60493 -21768 -7327 -30897
10870 -30897 -28373 -33511 -18958 -2312 27802 14462 -40638 -43202 -41518 13555 -5980 -45511
10858 -45511 -33460 -17637 -10107 -22220 -34715 -28452 -9721 3676 37425 31129 23167 23201 27216
10845 27216 -11233 -890 -962 -22202 -21154 24227 11531 11042 -18455 -43212 -8433 -13290 2835
10832 2835 44771 50457 43336 15762 39864 47385 43336 44153 9839 -47057 -24823 -11012 13382
10819 13382 55731 46632 2137 18231 -2585 22979 45502 32158 33651 32495 28011 -8088
$$ packed form
10907H5032N190m5121j7904j5768n0949N936N5491K8940J2010K6255J0765K282
10895A02159m6759k7804j5633l696J4442j1210j4302K8016j0863O846J8146l2496
10883F846j9028L9604L5007J627o0745l218r31o8903k2119L1367L8725J4441k3570
10870c0897K524n138J4553J6646L0114j3340n5100k564J684N5073j9535l9531
10858d5511J2051J5823P530j2113j2495O263J8731J3397L3749o296p962L4M015
10845B7216l8449J0343p2k1240J048M5381j2696m89k9497k4757L4779m857J6125
10832B835M1936N686p121k7574K4102P521m049Q17l4314n6896K2234J3811K4394
10819A3382M2349r099m4495J6094k0816K5564K2523j3344J493j156m484l6099
$$ plain form
10807 -8088 -30299 -31108 11784 33423 21597 2734 2015 -26087 -4308 -27062 -48934 -75553 -30309
10794 -30309 709 13602 35971 51071 12384 -6998 -9497 8980 -25842 -33575 -38649 -74174
10782 -74174 -46756 -70917 -67956 -1331 17755 20852 -11875 -44386 -32937 -5288 1331 29157
10770 29157 69398 90387 105039 63899 16293 -19569 -14507 -15306 18632 8917 -11353 -27879
10758 -27879 -48958 -48934 -68436 -46417 -1787 -32069 -42895 1215 3331 -31772 -61199 -83271
10746 -83271 -91096 -62038 -8162 -6751 31371 57785 66043 96429 62537 5911 -27041 -9150
10734 -9150 10862 15923 26059 24995 2609 18604 -9267 -5421 20696 29953 23704 12331 21219
10721 21219 2769 4400 13673 -10088 -18545 -33233 -46040 -7898 -25802 9416 68885 61645
$$ packed form
10807h088k2211q09M2892K1639j1826j8863p19k8102K1779k2754k1872k6619M5244
10794c0309L1018J2893K2369J5100l8687j9382k499J8477l4822p733n074l5525
10782g4174K7418k4161K961O6625J9086L097l2727l2511J1449K7649O619K7826
10770B9157M0241K0989J4652m1140m7606l5862N062p99L3938r715k0270j6526
10758b7879k1079K4j9502K2019M4630l0282j0826M4110K116l5103k9427k2072
10746h3271p825K9058N3876J411L8122K6414Q258L0386l3892n6626l2952J7891
10734i150K0012N061J0136j064k2386J5995k7871L846K6117R257o249j1373Q888
10721B1219j8450J631R273k3761q457j4688j2807L8142j7904L5218N9469p240
$$ plain form
10709 61645 76131 62125 -5425 -88129 -81828 -36563 -40675 -11025 12576 8190 -20956 -24134
10697 -24134 -4664 6127 -50008 -58028 -24879 -25736 -5607 -50608 -80279 -41908 -6904 -1044
10685 -1044 24717 33276 9053 -25369 -38901 -35266 -19089 22853 67868 33553 24399 -6739
10673 -6739 -36818 -21863 -33664 -39210 -55642 -41266 18969 50370 46228 22613 20572 -2710
10661 -2710 -20931 8991 8897 9445 -15324 -65595 -46435 8389 -10420 -12352 6387 14519 2509
10648 2509 -7019 -19386 -4340 23757 37920 38041 64941 67465 81072 101676 82187 57528 44232
10635 44232 37178 43996 35522 29876 7605 30685 39595 45351 18738 -20110 -60607 -25190 4622
10622 4622 25753 14044 -35030 -54787 -59890 -33818 628 10535 -10198 -13674 -22226 -46000 -47732
$$ packed form
10709F1645J4486j4006o7550q2704O301M5265m112K9650K3601m386k9146l178
10697b4134J9470J0791n6135q020L3149q57K0129m5001k9671L8371L5004N860
10685a044K5761Q559k4223l4422j3532L635J6177M1942M5015l4315r154l1138
10673f739l0079J4955j1801n546j6432J4376O0235L1401m142k3615k041k3282
10661b710j8221K9922r4N48k4769n0271J9160N4824j8809j932J8739Q132j2010
10648B509r528j2367J5046K8097J4163J21K6900K524J3607K0604j9489k4659j3296
10635D4232p054O818q474n646k2271K3080Q910N756k6613l8848m0497L5417K9812
10622D622K1131j1709m9074j9757n103K6072L4446R907k0733l476q552k3774j732
$$ plain form
10609 -47732 -4715 -8236 -10939 -8583 22352 69312 62239 37720 34370 8294 -25413 -25640 -26599
10596 -26599 10003 40607 -183 -20349 -28955 -23103 -3155 12294 -3075 17635 53615 64872
10584 64872 61792 31252 -33464 -75333 -14973 7487 18675 13619 55042 45641 6021 -24032
10572 -24032 -1388 -24228 -54071 -51447 7059 -11852 -56612 -67887 -48994 -31865 -2313 843
10560 843 18218 12667 5815 15523 1231 28471 79010 54354 20014 -18210 -39720 -17794 769
10547 769 29781 23722 61445 70637 33387 -801 16399 10471 14868 42728 87466 64846 57877
10534 57877 46951 60712 92261 66196 31563 -9589 -19381 16832 21139 -432 -36896 -29903
10522 -29903 -8127 -16143 21455 40576 83308 121214 100568 64008 55417 61796 54410 18649
$$ packed form
10609d7732M3017l521k703K356L0935M6960p073k4519l350k6076l3707k27r59
10596b6599L6602L0604m0790k0166q606N852J9948J5449j5369K0710L5980J1257
10584F4872l080l0540o4716m1869O0360K2460J1188n056M1423r401l9620l0053
10572b4032K2644k2840k9843K624N8506j8911m4760j1275J8893J7129K9552L156
10560H43J7375n551o852R708j4292K7240N0539k4656l4340l8224k1510K1926J8563
10547G69K9012o059L7723R192l7250l4188J7200n928M397K7860M4738k2620o969
10534E7877j0926J3761L1549k6065l4633m1152r792L6213M307k1571l6464O993
10522b9903K1776q016L7598J9121M2732L7906k0646l6560q591O379p386l5761
$$ plain form
10510 18649 55285 85187 54160 10659 -20013 -38524 -53996 -25330 46745 67252 24040 30359
10498 30359 48260 27059 22985 37109 49874 44910 55706 43077 29038 11185 20966 -13138
10486 -13138 -24311 -42750 -65106 -75775 -71655 -77226 -84980 -66562 -48727 -37298 9421 6777
10474 6777 12511 20832 33084 15341 -21840 -35743 -31377 -36392 -35702 -26011 -51306 -37136 -34338
10461 -34338 -15282 -17581 -9028 -8526 -12602 17405 23195 29095 5585 8769 -5592 41723 30827
10448 30827 2605 2635 -6370 -15294 17852 30770 16642 38 20149 31726 37263 18687 -4052
10435 -4052 -200 -55861 -71638 -57671 -61449 -31093 3189 -34224 3289 36098 26723 27332 8759
10422 8759 -7768 -8687 -30538 -6354 -7550 -27139 -54828 -52174 -34842 5845 19852 -14853 -49148
$$ packed form
10510A8649L6636K9902l1027m3501l0672j8511j5472K8666P2075K0507m3212O319
10498C0359J7901k1201m074J4124J2765m964J0796j2629j4039j7853R781l4104
10486a3138j1173j8439k2356j0669M120n571p754J8418J7835J1429M6719k644
10474F777N734Q321J2252j7743l7181j3903M366n015O90R691k5295J4170K798
10461c4338J9056k299Q553N02m076L0007N790N900k3510L184j4361M7315j0896
10448C0827k8222L0r005q924L3146J2918j4128j6604K0111J1577N537j8576k2739
10435d052L852n5661j5777J3967l778L0356L4282l7413L7513L2809r375O09j8573
10422H759j6527r19k1851K4184j196j9589k7689K654J7332M0687J4007l4705l4295
$$ plain form
10409 -49148 -28364 -27455 -33256 -4084 11431 -16682 -61419 -60390 -32203 -23728 -60011 -75608 -44994
10396 -44994 -32912 -51570 -28904 -5832 7913 31323 57565 52677 62754 110008 120996 82592
10384 82592 56971 36125 5503 38007 47352 24265 6417 -7110 652 -6876 7469 33166
10372 33166 24768 -13234 3319 -29250 -14296 17064 11378 29874 19216 27105 42016 15358
10360 15358 29321 -1088 -52738 -57525 -19368 27868 53023 45450 26254 54433 75199 145830
10348 145830 202151 295289 336573 387954 449728 482737 520711 587616 598174 532510 465459
10337 465459 386111 356066 300296 234676 189793 159357 94469 69827 119242 121520 98774 68325
10325 68325 31985 65870 119915 112848 71228 8878 -58450 -62555 -13557 4850 13231 6247
$$ packed form
10409d9148K0784R09n801K9172J5515k8113m4737J029K8187Q475l6283j5597L0614
10396d4994J2082j8658K2666K3072J3745K3410K6242m888J0077M7254J0988l8404
10384H2592k5621k0846l0622L2504R345k3087j7848j3527P762p528J4345K5697
10372C3166q398l8002J6553l2569J4954L1360n686J8496j0658P889J4911k6658
10360A5358J3963l0409n1650m787L8157M7236K5155p573j9196K8179K0766P0631
10348A45830N6321R3138M1284N1381O1774L3009L7974O6905J0558o5664o7051
10337D65459p9348l0045n5770o5620m4883l0436o4888k4642M9415K278k2746l0449
10325F8325l6340L3885N4045p067m1620o2350o7328m105M8998J8407Q381o984
$$ plain form
10313 6247 -21939 -16772 22876 5772 28207 58927 41195 38941 37647 46538 47205 30209 41474
10300 41474 9709 13824 15541 38226 42096 18314 34032 35594 25851 21185 25061 5713 -11357
10287 -11357 -50467 -12196 6365 1815 -32003 -39823 -38748 -46108 -47693 -15113 -30078 -3241 -7437
10274 -7437 -30532 -12397 13976 17420 31214 -5579 -28009 -35672 8603 -8065 -8159 -18314 -22010
10261 -22010 -4751 3398 -31813 -71944 -62796 -40675 -19594 -18619 -12307 -1386 -6749 -19256 8834
10248 8834 32950 33501 32483 8527 -14706 -44565 -36396 -2799 -10135 -44483 -29106 -3811 -11190
10235 -11190 -39047 -47484 -52624 -49377 -29744 40967 66864 40199 14554 9695 7279 -45345 -78424
10222 -78424 -52324 -55695 -73078 -12956 -1276 37241 51334 -4166 -27977 -8270 26030 39449
$$ packed form
10313F247k8186N167L9648j7104K2435L0720j7732k254j294Q891O67j6996J1265
10300D1474l1765M115J717K2685L870k3782J5718J562r743m666L876j9348j7070
10287a1357l9110L8271J8561m550l3818p820J075p360j585L2580j4965K6837m196
10274g437k3095J8135K6373L444J3794l6793k2430p663M4275j6668r4j0155l696
10261b2010J7259Q149l5211m0131R148K2121K1081R75O312J0921n363j2507K8090
10248H834K4116N51j018k3956k3233k9859Q169L3597p336l4348J5377K5295p379
10235a1190k7857q437n140L247J9633P0711K5897k6665k5645m859k416n2624l3079
10222g8424K6100l371j7383O0122J1680L8517J4093n5500k3811J9707L4300J3419
$$ plain form
10210 39449 10608 2628 11790 -573 -32030 3103 209 -11846 18112 24727 -13338 -68766
10198 -68766 -75661 -59422 -22266 15155 1663 -8603 -1425 -43999 -76103 -46010 -3828 37150
10186 37150 79995 64696 48328 39741 1435 -53871 -42950 6334 22043 -10266 -22408 -7315
10174 -7315 -14188 -49540 -14616 21963 20494 -14756 -17021 1212 -3693 5515 -13645 -39269 -30001
10161 -30001 -26017 -28781 -20965 22614 -17513 -38021 -37381 -20976 3206 27490 34147 27423 29935
10148 29935 15233 -18606 -49455 -71048 -99412 -103047 -62832 -28517 19572 48369 61260 77193
10136 77193 68974 -2929 -29928 -33540 -36373 -22784 -23407 -12184 -8693 -26405 -64837 -34075 -5120
10123 -5120 21017 41964 56887 20785 10533 -7638 -1946 -31514 -36935 -46301 -52361 -52676 -40237
$$ packed form
10210C9449k8841p980R162j2363l1457L5133k894j2055K9958O615l8065n5428
10198f8766o895J6239L7156L7421j3492j0266P178m2574l2104L0093M2182M0978
10186C7150M2845j5299j6368q587l8306n5306J0921M9284J5709l2309j2142J5093
10174g315o873l5352L4924L6579j469l5250k265J8233m905R208j9160k5624R268
10161c0001L984k764P816M3579m0127k0508O40J6405K4182K4284O657o724K512
10148B9935j4702l3839l0849k1593k8364l635M0215L4315M8089K8797J2891J5933
10136G7193q219p1903k6999l612k833J3589o23J1223L491j7712l8432L0762K8955
10123e120K6137K0947J4923l6102j0252j8171N692k9568n421r366o060l15J2439
$$ plain form
10110 -40237 -22194 -26879 -16467 -59676 -86718 -68750 8209 71046 48269 28129 22901 44770
10098 44770 36143 25171 37686 31925 42630 38092 -11396 -38209 -70534 -56437 -52242 -39513
10086 -39513 -18485 -3715 -4105 10176 30029 62580 46473 27617 23704 24822 -463 9476 35910
10073 35910 35987 -1008 -18700 19910 29289 45236 23228 -1679 -54895 -72145 -49983 2371
10061 2371 39990 81804 19157 -13254 -11632 9142 17060 28592 105406 257979 273247 227234
10049 227234 158878 88685 39849 -4455 8182 -8274 -30109 11910 35074 18598 -2321
10038 -2321 30562 49357 56995 39959 38323 22343 11845 2049 -13154 741 -7590 -13658 22236
10025 22236 28363 9524 543 -24108 -31928 -49551 -25176 -3741 13378 23546 7027 -25912
$$ packed form
10110d0237J8043m685J0412m3209k7042J7968P6959O2837k2777k0140n228K1869
10098D4770q627j0972J2515n761J0705m538m9488k6813l2325J4097M195J2729
10086c9513K1028J4770l90J4281J9853L2551j6107j8856l913J118k5285R939K6434
10073C5910P7l6995j7692L8610R379J5947k2008k4907n3216j7250K2162N2354
10061B371L7619M1814o2647l2411J622K0774P918J1532P6814J52573J5268m6013
10049B27234o8356p0193m8836m4304J2637j6456k1835M2019K3164j6476k0919
10038b321L2883J8795P638j7036j636j5980j0498r796j5203J3895q331o068L5894
10025B2236O127j8839q981k4651p820j7623K4375K1435J7119J0168j6519l2939
$$ plain form
10013 -25912 -39180 -69589 -52875 -24955 -16489 -47081 -11577 -33371 -17364 7010 -13494 -41929
10001 -41929 -44836 -27541 9482 31326 -4776 -20976 -9314 -13273 -31916 -62995 -90555 -63797
9989 -63797 -38370 -26980 -25484 -11182 -46287 -90292 -103796 -76577 -67773 -41977 -10498 -12088
9977 -12088 -33507 -50501 -11732 45965 38005 13205 -12781 -52092 -58560 -83888 -69276 -40466
9965 -40466 -46988 -95012 -65580 -7214 46516 36876 -32832 -52563 -44426 -71081 -49648 7163
9953 7163 40769 55289 27307 -4858 -39722 -22301 -7577 3117 -18376 -10396 9240 42437
9941 42437 67611 93380 69079 32780 18599 28007 -10345 -35789 -34571 11694 13753 -5728
9929 -5728 -15948 -38626 -25847 -46324 -60973 -61889 -54500 -38449 -14803 -6899 39515 40179 61665
$$ packed form
10013b5912j3268l0409J6714K7920Q466l0592L5504k1794J6007K4374k0504k8435
10001d1929k907J7295L7023K1844l6102j6200J1662l959j8643l1079k7560K6758
9989f3797K5427J1390J496J4302l5105m4005j3504K7219Q804K5796L1479j590
9977a2088k1419j6994L8769N7697p960k4800k5986l9311o468k5328J4612K8810
9965d0466o522m8024K9432N8366N3730r640o9708j9731Q137k6655K1433N6811
9953G163L3606J4520k7982l2165l4864J7421J4724J0694k1493P980J9636L3197
9941D2437K5174K5769k4301l6299j4181R408l8352k5444J218M6265K059j9481
9929e728j0220k2678J2779k0477j4649r16P389J6051K3646P904M6414O64K1486
$$ plain form
9916 61665 58465 43475 40944 66248 51439 -12939 -90429 -62456 -53888 -44434 -26424 -29980 -15607
9903 -15607 9522 17062 634 7458 1384 -13600 4424 57082 42727 11831 2175 30417 27704
9890 27704 49531 17467 -13999 -5164 4330 19001 40127 31698 -14928 -11056 28256 38994 7801
9877 7801 -4267 23073 27439 18471 -28860 -71851 -23247 -38608 -62320 -73955 -115583 -78072
9865 -78072 -72134 -87025 -99751 -41967 -6954 -17274 23925 62375 78427 25673 10149 19687
9853 19687 -60279 -83889 -37685 -21394 -12987 -9063 1872 23735 8979 -1184 -8862 -30392
9841 -30392 -48284 -24808 -1782 10303 -10503 3682 -173 -47403 -41751 -28252 292 3485
9829 3485 12106 35333 8708 23604 39032 58508 52082 30527 14541 10929 -29586 -65015 -53263
$$ packed form
9916F1665l200j4990k531K5304j4809o4378p7490K7973Q568R454J8010l556J4373
9903a5607K5129P540j6428O824o074j4984J8024N2658j4355l0896r656K8242k713
9890B7704K1827l2064l1466Q835R494J4671K1126q429m6626L872L9312J0738l1193
9877G801j2068K7340M366q968m7331m2991M8604j5361k3712j1635m1628L7511
9865g8072N938j4891j2726N7784L5013j0320M1199L8450J6052n2754j5524R538
9853A9687p9966k3610M6204J6291Q407L924J0935K1863j4756j0163p678k1530
9841c0392j7892K3476K3026J2085k0806J4185l855m7230N652J3499K8544L193
9829C485Q621K3227k6625J4896J5428J9476o426k1555j5986l612m0515l5429J1752
$$ plain form
9816 -53263 -16681 13111 62542 79408 48236 20837 -20632 -62881 -79361 -48453 11611 31223
9804 31223 23384 962 40565 55629 33543 29430 12414 -222 4909 -13706 -29318 -23581 -28419
9791 -28419 -36973 -81204 -45371 -26429 -42104 -31080 9132 76723 108869 81807 43891 1790
9779 1790 -13748 16914 21780 16003 -30466 -42511 8740 38434 -20374 -26599 4767 10563 -22099
9766 -22099 -55547 -26767 8405 12049 19594 5193 -17703 6877 15735 -11832 -14280 -13796 23305
9753 23305 19182 13504 15327 38956 68995 25417 16425 15161 10646 -13509 -42363 -2713 19715
9740 19715 -11000 -43166 -87437 -70686 -35088 -59872 -73560 -22247 24940 22485 37447 34950
9728 34950 36046 15740 -33554 -48429 -39437 4259 -5344 -26114 -21789 10587 57015 46693 15755
$$ packed form
9816e3263L6582K9792M9431J6866l1172k7399m1469m2249j6480L0908O0064J9612
9804C1223p839k2422L9603J5064k2086m113j7016j2636N131j8615j5612N737m838
9791b8419q554m4231L5833J8942j5675J1024M0212O7591L2146k7062l7916m2101
9779A790j5538L0662M866n777m6469j2045N1251K9694n8808o225L1366N796l2662
9766b2099l3448K8780L5172L644P545j4401k2896K4580Q858k7567k448M84L7101
9753B3305m123n678J823K3629L0039m3578q992j264m515k4155k8854L9650K2428
9740A9715l0715l2166m4271J6751L5598k4784j3688N1313M7187k455J4962k497
9728C4950J096k0306m9294j4875Q992M3696r603k0770M325L2376M6428j0322l0938
$$ plain form
9715 15755 6707 14724 21634 21342 13344 -7943 9397 9594 58460 52747 48256 55437 68507 39278
9701 39278 9670 -27357 -72213 -43595 -36931 -34242 -45123 -17871 7192 5145 11124 46126 63381
9688 63381 42462 592 -14556 -26132 26699 49944 28100 44813 50454 65745 50830 39084
9676 39084 31928 -16780 -68333 -34868 -21386 -26395 -22443 5125 -4193 -45801 -40066 -38745 -33679
9663 -33679 -30586 -45193 10495 -3536 -13506 16273 -843 -63284 -65539 -43091 -15269 -25436
9651 -25436 -72772 -61931 -11764 -11857 4140 -29248 -10629 1484 -24489 -6657 985 -45704 -67886
9638 -67886 -44154 -41243 -22596 42843 67429 33965 18165 -1074 28002 38869 -19315 -33126
9626 -33126 -29962 -23953 -37681 2565 31359 33280 64681 31992 26058 29158 31800 41826 34931
$$ packed form
9715A5755r048Q017O910k92p998k1287J7340J97M8866n713m491P181J3070k9229
9701C9278k9608l7027m4856K8618O664K689j0881K7252K5063k047N979L5002J7255
9688F3381k0919m1870j5148j1576N2831K3245k1844J6713N641J5291j4915j1746
9676C9084p156m8708n1553L3465J3482n009L952K7568r318m1608N735J321N066
9663c3679L093j4607N5688j4031r970K9779j7116o2441k255K2448K7822j0167
9651b5436m7336J0841N0167r3J5997l3388J8619J2113k5973J7832P642m6689k2182
9638f7886K3732K911J8647O5439K4586l3464j5800j9239K9076J0867n8184j3811
9626c3126L164O009j3728M0246K8794J921L1401l2689n934L100K642J0026o895
$$ plain form
9613 34931 27488 24440 22431 -7518 -49289 -31260 29025 27035 20482 47097 39389 59013 56646
9600 56646 75192 47345 5119 -14444 -33324 -44099 -27945 -38706 -64551 -74661 -57614 -63358
9588 -63358 -62142 -54639 -67700 -78449 -60073 -10682 -2761 -24367 -15038 35764 58801 29909 3480
9575 3480 -6490 4299 11355 -33469 -49005 -2520 -6311 -17620 10594 28223 6482 -22554 -40905
9562 -40905 -46571 -14048 -41453 -61175 -25955 14884 51374 33241 27504 44764 35841 17874
9550 17874 49257 47192 68413 73627 65956 18497 -4841 -20948 -51123 -39131 -16713 -3861
9538 -3861 -12432 -12635 -29255 -22241 27075 -12281 -33158 6909 34316 35245 42530 37930 44599 22783
9524 22783 -16460 -9822 46544 47726 16384 6000 7033 24540 16566 -6807 -6182 12231 21865
$$ packed form
9613C4931p443l048k009k9949m1771J8029O0285j990o553K6615p708J9624k367
9600E6646J8546k7847m2226j9563j8880j0775J6154j0761k5845j0110J7047n744
9588f3358J216P503j3061j0749J8376M9391P921k1606R329N0802K3037k8892k6429
9575C480r970J0789P056m4824j5536M6485l791j1309K8214J7629k1741k9036j8351
9562d0905n666L2523k7405j9722L5220M0839L6490j8133n737J7260q923j7967
9550A7874L1383k065K1221N214p671m7459k3338j6107l0175J1992K2418J2852
9538c861q571k03j6620P014M9316l9356k0877M0067K7407R29P285m600O669k1816
9524B2783l9243O638N6366J182l1342j0384J033J7507p974k3373O25J8413R634
$$ plain form
9511 21865 12311 5700 28464 31621 5674 -15861 25464 42311 40353 34422 20237 8042 8211
9498 8211 -8343 -46631 -19857 13218 -10476 -27841 -9445 -8188 6040 1995 -39626 -34101 -29129
9485 -29129 -51247 -62886 -64164 -33059 -37203 -12373 -23497 -45385 -47576 -28653 -28080 -4669 -1567
9472 -1567 -40780 -31660 -20632 -25413 -12841 -4455 -7450 27281 35967 42795 22904 -9426 -28823
9459 -28823 -27787 -17957 40872 22957 -48938 -42103 -57779 -55995 -29967 16093 28547 46008 78554
9446 78554 64112 2080 -18474 1103 -19082 8423 43711 47147 19457 43036 77535 73308
9434 73308 64280 59019 18333 11124 19243 1863 -14872 -29090 14681 27951 52108 64538 41920
9421 41920 -5498 -45214 -64994 -62784 -23294 -4619 17860 717 -20109 8500 12272 -6290
$$ packed form
9511B1865r554o611K2764L157k5947k1535M1325J6847j958n931j4185j2195J69
9498H211j6554l8288K6774L3075k3694j7365J8396J257J4228m045m1621N525M972
9485b9129k2118j1639j278L1105m144K4830j1124k1888k191J8923N73K3411L102
9472a567l9213R120J1028m781J2572Q386k995L4731Q686O828j9891l2330j9397
9459b8823J036R830N8829j7915p1895O835j5676J784K6028M6060J2454J7461L2546
9446G8554j4442o2032k0554J9577k0185K7505L5288L436k7690K3579L4499m227
9434G3308r028n261m0686p209Q119j7380j6735j4218M3771J3270K4157J2430k2618
9421D1920m7418l9716j9780K210L9490J8675K2479j7143k0826K8609L772j8562
$$ plain form
9409 -6290 -36345 -33897 7989 -6910 -52984 -77017 -41969 -7934 6010 5411 -28941 -43632 -25693
9396 -25693 -15312 -41720 -66895 -82932 -57644 -4693 -35044 -27800 -41328 -41482 -18420 15907
9384 15907 17757 9819 -49430 -98172 -50541 5234 -1609 -15937 -304 36070 35056 -673 -51020
9371 -51020 -93711 -88499 -76532 -39618 27689 92552 150475 79976 -14925 -18072 -35506 -27419
9359 -27419 -35708 -27368 11308 21867 12756 25149 -13900 -25859 -29888 -35284 -35922 -25832 -24719
9346 -24719 -55506 -31770 -44719 -88728 -50567 -22603 15190 28235 37061 62999 4061 -16805
9334 -16805 24617 37424 36809 45386 10831 -32093 7663 -19019 -44081 -39108 -13268 -23194 -50261
9321 -50261 -41285 -13823 -11128 -11287 -5489 2675 5868 -14818 -85412 -119858 -73091 -36639 -4646
$$ packed form
9409f290l0055K448M1886j4899m6074k4033L5048L4035J3944n99l4352j4691J7939
9396b5693J0381k6408k5175j6037K5288N2951l0351P244j3528j54K3062L4327
9384A5907J850p938n9249m8742M7631N5775o843j4328J5633L6374j014l5729n0347
9371e1020m2691N212J1967L6914O7307O4863N7923p0499r4901l147j7434Q087
9359b7419q289Q340L8676J0559r111J2393l9049j1959m029n396o38J0090J113
9346b4719l0787K3736j2949m4009L8161K7964L7793J3045Q826K5938n8938k0866
9334a6805M1422J2807o15Q577l4555m2924L9756k6682k5062M973K5840r926k7067
9321e0261Q976K7462K695j59N798Q164L193k0686p0594l4446M6767L6452L1993
$$ plain form
9308 -4646 8696 26630 45204 18437 -23777 -16660 -46891 -78183 -63290 -55334 -17067 17343
9296 17343 22934 -49996 -72733 -75065 -91936 -102712 -86421 -61000 -18438 -13085 -25284 -44048
9284 -44048 -50939 -58402 -45088 -24337 -23296 -38947 -15210 3815 27811 18716 -1556 -17738 -21647
9271 -21647 -45801 -28850 -10992 5013 11825 13300 -2096 -12025 -25845 -54091 -13490 -51154
9259 -51154 -83490 -68650 -31634 2154 -9423 34113 77646 95453 96689 16006 -28085 -58026
9247 -58026 -35112 588 62389 51319 47205 83574 91916 54760 7063 -38099 -51601 -12150
9235 -12150 -21654 -16391 -42144 -58344 -47680 -40359 -34417 -5448 24171 12098 -8724 -11859 -3893
9222 -3893 1433 16130 -17981 -71269 -69827 -36522 -33835 -51483 -30394 12948 -4233 -11015 -1785
$$ packed form
9308d646J3342J7934J8574k6767m2214P117l0231l1292J4893P956L8267L4410
9296A7343N591p2930k2737k332j6871j0776J6291K5421M2562N353j2199j8764
9284d4048o891p463J3314K0751J041j5651K3737J9025K3996r095k0272j6182l909
9271b1647k4154J6951J7858J6005O812J475j5396r929j3820k8246M0601l7664
9259e1154l2336J4840L7016L3788j1577M3536M3533J7807J236q0683m4091k9941
9247e8026K2914L5700O1801j1070m114L6369Q342l7156m7697m5162j3502L9451
9235a2150r504N263k5753j6200J0664P321N942K8969K9619j2073k0822l135P966
9222c893N326J4697l4111n3288J442L3305K687j7648K1089M3342j7181o782R230
$$ plain form
9209 -1785 6063 18591 33270 -17892 -70037 -58721 -1958 36814 -2945 -79447 -95381 -75077
9197 -75077 -67813 -36940 -9381 14458 8774 -16112 -2756 -239 -19410 -42255 -25293 -13536
9185 -13536 31555 2461 -24078 -20015 -15743 19226 40624 12903 -4907 2718 -21587 -36015
9173 -36015 -13233 -32139 -19820 11824 41040 58799 94924 55233 15127 11037 -19159 965
9161 965 18228 59612 78811 102189 65367 42839 -18350 -78108 -42145 -16861 -12098 18958
9149 18958 46832 44646 49586 65976 30814 57863 61120 74043 76391 26986 34086 38191 20469
9136 20469 20811 45015 48249 61667 66126 99157 123155 124376 89696 61193 35149 44407 85387
9123 85387 107592 123396 69788 53714 65499 36422 23273 84622 101007 102097 148479 165550
$$ packed form
9209a785P848J2528J4679n1162n2145J1316N6763L8772l9759p6502j5934K0304
9197g5077P264L0873K7559K3839n684k4886J3356K517j9171k2845J6962J1757
9185a3536M5091k9094k6539M063M272L4969K1398k7721j7810P625k4305j4428
9173c6015K2782j8906J2319L1644K9216J7759L6125l9691m0106m090l0196K0124
9161I65J7263M1384J9199K3378l6822k2528o1189n9758L5963K5284M763L1056
9149A8958K7874k186M940J6390l5162K7049L257J2923K348m9405P100M105j7722
9136B0469L42K4204L234J3418M459L3031K3998J221l4680k8503k6044R258M0980
9123H5387K2205J5804n3608j6074J1785k9077j3149O1349J6385J090M6382J7071
$$ plain form
9111 165550 154550 178254 198332 195966 196495 193373 253923 287975 319671 380096 425925 493867
9099 493867 577270 717911 834416 925721 1119069 1340560 1569331 1910743 2453816 3337880
9089 3337880 4748774 7238301 11741898 17970262 21371260 19531776 15526725 11597997
9081 11597997 8147352 5602374 4024307 3061874 2401764 1953580 1656733 1431473 1243689
9072 1243689 1080626 979353 831319 695426 598767 552349 563490 476436 362627 370839 382134
9061 382134 383382 359920 299432 253321 238614 238377 208894 182243 149669 164023 171505 146113
9049 146113 145086 121533 88190 75944 84320 68827 77484 125332 96647 57334 25208 -12059
9037 -12059 20325 35440 35858 -5378 13519 35684 70225 115661 150338 155607 123987 51779
$$ packed form
9111A65550j1000K3704K0078k366N29l122O0550L4052L1696O0425M5829O7942
9099D93867Q3403J40641J16505R1305J93348K21491K28771L41412N43073Q84064
9089C337880J410894K489527M503597O228364L400998j839484m005051l928728
9081A1597997l450645k544978j578067r62433o60110m48184k96847k25260j87784
9072A243689j63063j01273j48034j35893r6659m6418J1141q7054j13809Q212J1295
9061C82134J248k3462o0488m6111j4707k37k9483k6651l2574J4354P482k5392
9049A46113j027k3553l3343j2246Q376j5493Q657M7848k8685l9313l2126l7267
9037a2059L2384J5115M18m1236J8897K2165L4541M5436L4677N269l1620p2208
$$ plain form
9025 51779 55305 51215 61146 39755 31788 3541 26169 79046 89311 74598 69006 11729 -38328
9012 -38328 -23878 4328 11744 49083 86532 44165 -16816 -27215 -30596 -51483 -31960 -32769 10623
8999 10623 9770 -1905 12929 47038 67511 40651 16159 752 -11153 48217 32604 46267
8987 46267 50104 4475 7185 -11872 4838 16311 -8578 -15328 -20453 5902 20485 77575 93383
8974 93383 52559 10387 -45382 -45618 -13686 42655 73224 49513 41730 25219 8132 -16753
8962 -16753 -50834 -16625 -9984 878 3053 -37357 -39249 -9220 33815 51532 18322 -9484
8950 -9484 -144 23192 54116 66555 66835 66619 38863 22699 37095 46098 43650 32892 5706
8937 5706 -22418 -13059 5409 -1843 -8474 1791 -9504 -1813 19991 14136 -16995 -30555 -10960
$$ packed form
9025E1779L526m090R931k1391p967k8247K2628N2877J0265j4713n592n7277n0057
9012c8328J4450K8206P416L7339L7449m2367o0981j0399l381k0887J9523q09M3392
8999A0623q53j1675J4834L4109K0473k6860k4492j5407j1905N9370j5613J3663
8987D6267L837m5629K710j9057J6710J1473k4889o750n125K6355J4583N7090J5808
8974I3383m0824m2172n5769k36L1932N6341L0569k3711p783j6511j7087k4885
8962a6753l4081L4209O641J0862K175m0410j892L0029M3035J7717l3210k7806
8950i484R340K3336L0924J2439K80k16k7756j6164J4396R003k448j0758k7186
8937E706k8124R359J8468p252o631J0265j1295P691K1804n855l1131j3560J9595
$$ plain form
8924 -10960 26534 62319 40193 26659 61826 36020 11412 -20733 -65132 -73833 -118384 -93313
8912 -93313 -66285 -32822 -50813 -15645 -7063 -33629 -60347 -91671 -71789 -44006 -45501 -42043
8900 -42043 -14698 -7377 -4205 7493 -41462 -82916 -85794 -54273 -33930 -2045 13818 23126 8639
8887 8639 16981 11745 4022 27566 38405 -2493 -34502 16893 24052 -13210 -12073 -18870 -59350
8874 -59350 -77194 -15801 -6742 -12024 -865 49735 28607 49607 21053 13015 23578 17322 18937
8861 18937 28511 38325 9011 -13109 -31556 -63069 -87958 -46053 -35035 -33430 3721 -3772 -44036
8848 -44036 -51198 -83133 -103710 -91280 -90526 -85997 -53122 -2847 6818 20950 15316 27465 15553
8835 15553 41533 102383 60163 17003 2077 -12730 -20201 -71498 -49518 -32337 -26288 -31576
$$ packed form
8924a0960L7494L5785k2126j3534L5167k5806k4608l2145m4399q701m4551K5071
8912i3313K7028L3463j7991L5168Q582k6566k6718l1324J9882K7783j495L458
8900d2043K7345P321L172J1698m8955m1454k878L1521K0343L1885J5863R308j4487
8887H639Q342n236p723K3544J0839m0898l2009N1395P159l7262J137o797m0480
8874e9350j7844O1393R059n282J1159N0600k1128K1000k8554q038J0563o256J615
8861A8937R574R814k9314k2120j8447l1513k4889M1905J1018J605L7151p493m0264
8848d4036p162l1935k0577J2430P54M529L2875N0275R665J4132n634J2149j1912
8835A5553K5980O0850m2220m3160j4926j4807p471n1297K1980J7181O049n288
$$ plain form
8823 -31576 -46608 -11446 -13464 -29888 -27378 5279 23094 7735 23902 52098 56010 40132
8811 40132 24181 30706 32750 36231 2869 -31500 -61139 -35081 -23824 -45399 -20957 -8290
8799 -8290 -24469 -8721 -2881 -25502 -28991 -5372 -16405 -1991 40421 25236 33576 10722 -28403
8786 -28403 -63329 -68621 -32512 7771 31793 28883 8614 11147 -1073 -25085 9339 53595
8774 53595 27027 23548 18034 2171 19747 9180 -11911 -18131 -12996 16484 -22399 -65224 -57188
8761 -57188 -70361 -66251 -48326 -32951 -36491 -60015 -59951 -45651 -54331 -47575 -43681 -29381 -29484 -26234
8747 -26234 -22335 -4420 35886 44297 23756 16346 -9974 -32051 -57931 -11949 -5864 -37553 -34608
8734 -34608 -17812 -27064 -12074 12095 49351 35677 33988 20024 10275 3175 8732 -1667 -11549
$$ packed form
8823c1576j5032L5162k018j6424K510L2657J7815j5359J6167K8196L912j5878
8811D0132j5951O525K044L481l3362l4369k9639K6058J1257k1575K4442J2667
8799h290j6179J5748N840k2621l489K3619j1033J4414M2412j5185Q340k2854l9125
8786b8403l4926n292L6109M0283K4022k910k0269K533j2220k4012L4424M4256
8774E3595k6568l479n514j5863J7576j0567k1091o220N135K9480l8883m2825Q036
8761e7188j3173M110J7925J5375l540k3524O4J4300q680O756L894J4300j03L250
8747b6234L899J7915M0306Q411k0541p410k6320k2077k5880M5982O085l1689K945
8734c4608J6796r252J4990K4169L7256j3674j689j3964r749p100N557j0399r882
$$ plain form
8721 -11549 -58734 -78926 -93204 -77478 -44488 -24493 -18673 -9886 4651 24609 16595 31393
8709 31393 -5000 -14357 -5945 -16769 -31536 7359 29616 -17513 -44061 -23635 35342 112184
8697 112184 110051 62117 62106 63389 657 -13600 13525 43743 53419 33557 11460 14310 -12677
8684 -12677 4597 27713 29519 22600 38625 57285 124229 113171 74685 86001 58591 45628
8672 45628 37317 17425 15248 23250 15720 41853 35071 26605 -1034 2292 22923 98075 115179
8659 115179 87742 75430 68554 49080 51284 68803 117631 131349 112524 111445 61831 -12279
8647 -12279 -7926 -3579 -1792 27293 75048 70019 55230 67522 112704 95030 78920 66717 81215
8634 81215 73637 71147 114393 128693 90711 94751 129096 108136 66755 54519 31708 48630
$$ packed form
8721a1549m7185k0192j4278J5726L2990J9995N820Q787J4537J9958q014J4798
8709C1393l6393r357Q412j0824j4767L8895K2257m7129k6548K0426N8977P6842
8697A12184k133m7934j1J283o2732j4257K7125L0218R676j9862k2097K850k6987
8684a2677J7274K3116J806o919J6025J8660O6944j1058l8486J1316k7410j2963
8672D5628q311j9892k177Q002p530K6133o782q466k7639L326K0631P5152J7104
8659A15179k7437j2312o876j9474K204J7519M8828J3718j8825j079m9614p4110
8647a2279M353M347J787K9085M7755n029j4789J2292M5182j7674j6110j2203J4498
8634H1215p578k490M3246J4300l7982M040L4345k0960m1381j2236k2811J6922
$$ plain form
8622 48630 90905 130234 134382 128749 126773 137665 126944 121679 149932 126013 146662 206012 229833
8609 229833 164319 140211 156861 176206 176251 173472 179872 152371 150081 161680 149001 128217 91278
8596 91278 93462 126407 116502 75530 91335 84580 56584 36205 55054 71776 62740 29568 5080
8583 5080 8186 35652 68663 82466 45781 30927 3059 -29213 -9492 6271 -22355 4760
8571 4760 49675 91393 78195 52141 23282 15549 13151 -17480 1087 15140 9316 12604 10238
8558 10238 -31402 -45836 -1981 5349 28759 -5516 -9339 15785 -18687 -39671 -13124 -18996
8546 -18996 -31517 32612 14289 -28884 -20802 -18767 -7984 -20783 -58285 -92392 -55085 7394
8534 7394 9497 7080 49167 69430 37816 10002 -3830 -61055 -111764 -74367 -26022 -4554
$$ packed form
8622D8630M2275L9329M148n633j976J0892j0721n265K8253k3919K0649N9350K3821
8609B29833o5514k4108J6650J9345M5k779O400k7501k290J1599j2679k0784l6939
8596I1278K184L2945r905m0972J5805o755k7996k0379J8849J6722r036l3172k4488
8583E080L106K7466L3011J3803l6685j4854k7868l2272J9721J5763k8626K7115
8571D760M4915M1718j3198k6054k8859p733k398l0631J8567J4053n824L288k366
8558A0238m1640j4434M3855P330K3410l4275l823K5124l4472k0984K6547n872
8546a8996j2521O4129j8323m3173Q082K035J0783j2799l7502l4107L7307O2479
8534G394K103k417M2087K0263l1614k7814j3832n7225n0709L7397M8345K1468
$$ plain form
8522 -4554 -43593 -6256 26181 -8024 -19793 -3676 29574 36766 -6209 -12242 622 22250
8510 22250 42355 32388 32428 73212 107118 52826 16347 -10448 -36647 -28102 14753 42298 31064
8497 31064 -2192 -4721 -18378 -32460 14718 62437 71653 35442 22982 31368 57647 71781
8485 71781 97362 62682 24990 54551 14198 -10977 12904 31242 8668 10497 30424 -5122
8473 -5122 -1534 -4082 -8551 -33162 -57612 -30678 7383 5314 2099 7907 41529 53578 67959
8460 67959 49754 27131 2868 -7580 17500 25733 25328 -11423 -50284 -47804 -44374 -31166 -6149
8447 -6149 11571 26249 10313 15108 11482 14035 33093 52848 24797 -5310 -64773 -84318 -52845
8434 -52845 -53892 -40034 -4695 -12004 -23335 -3054 -25041 18666 76242 76370 52840 -3940 -61367
$$ packed form
8522d554l9039L7337L2437l4205j1769J6117L3250P192m2975o033J2864K1628
8510B2250K0105r967M0M0784L3906n4292l6479k6795k6199Q545M2855K7545j1234
8497C1064l3256k529j3657j4082M7178M7719R216l6211j2460Q386K6279J4134
8485G1781K5581l4680l7692K9561m0353k5175K3881J8338k2574J829J9927l5546
8473e122L588k548m469k4611k4450K6934L8061k069l215N808L3622J2049J4381
8460F7959j8205k2623k4263j0448K5080Q233m05l6751l8861K480L430J3208K5017
8447f149J7720J4678j5936M795l626K553J9058J9755k8051l0107n9463j9545L1473
8434e2845j047J3858L5339p309j1331K0281k1987M3707N7576J28k3530n6780n7427
$$ plain form
8421 -61367 -35534 -39030 -7148 38451 47882 18445 -16819 -57431 -67164 -56416 -34919 -8556
8409 -8556 35277 33922 34256 6189 -42078 -55366 -20631 -30037 -86470 -93543 -32992 16966 56291
8396 56291 23951 6625 -5373 -1232 13214 -25539 -32272 3192 43783 67721 91673 89024
8384 89024 31363 21009 23182 -5663 2935 -36588 11550 95404 122969 119676 71450 31950
8372 31950 34895 34798 37786 10325 -49070 -41421 -956 38371 53480 53676 75354 71475 82901 84740
8358 84740 73460 67152 60743 51303 55491 7233 -11585 -31175 -9608 -9085 -6480 -11534 -65945
8345 -65945 -53181 -54757 -32043 -16877 20846 30895 42115 12813 -7123 -22372 -40139 -15355
8333 -15355 -10484 -6553 -15327 7138 42005 57352 51177 78631 94111 92671 29657 -27139 3188
$$ packed form
8421f1367K5833l496L1882M5599R431k9437l5264m0612r733J0748K1497K6363
8409h556M3833j355L34k8067m8267j3288L4735r406n6433p073O0551M9958L9325
8396E6291l2340j7326j1998M141J4446l8753o733L5464M0591K3938K3952k649
8384H9024n7661j0354K173k8845Q598l9523M8138Q3854K7565l293m8226l9500
8372C1950K945r7K988k7461n9395P649M0465L9327J5109J96K1678l879J1426J839
8358H4740j1280o308o409r440M188m8258j8818j9590K1567N23K605n054n4411
8345f5945J2764j576K2714J5166L7723J0049J1220k9302j9936j5249j7767K4784
8333a5355M871L931q774K2465L4867J5347o175K7454J5480j440o3014n6796L0327
$$ plain form
8320 3188 28493 8823 1583 -35851 -103560 -75765 -21704 -14533 -17941 7076 -6823 -77075 -52073
8307 -52073 -36736 -66619 -64150 -37363 -34795 -32861 -68853 -82443 -96697 -101835 -72341 -76072 -36920
8294 -36920 27738 40756 46409 86698 52461 24158 21522 -3666 -26359 -46687 -40348 -22424
8282 -22424 -15180 -21176 22652 46816 39860 44134 19638 -26418 4853 -11350 -39467 -17667 -14936
8269 -14936 5276 2772 -696 -15433 13715 12752 5316 9614 21193 -5401 -60369 -40985 -7984
8256 -7984 -12341 -34948 12293 31029 9806 12143 12421 25361 6706 -10437 16910 -320 -47524
8243 -47524 -68452 -32310 23298 62432 45512 18962 -20370 925 -20938 -27537 -30485 -48969
8231 -48969 -62245 -14538 17221 4110 -7133 28422 31309 6942 -1101 5168 -1323 31880 43648
$$ packed form
8320C188K5305j9670p240l7434o7709K7795N4061P171l408K5017j3899p0252K5002
8307e2073J5337k9883K469K6787K568J934l5992j3590j4254n138K9494l731L9152
8294c6920O4658J3018N653M0289l4237k8303k636k5188k2693k0328O339J7924
8282b2424P244n996M3828K4164o956M274k4496m6056L1271j6203k8117K1800K731
8269a4936K0212k504l468j4737K9148r63p436M298J1579k6594n4968J9384L3001
8256g984m357k2607M7241J8736k1223K337K78J2940j8655j7143K7347j7230m7204
8243d7524k0928L6142N5608L9134j6920k6550l9332K1295k1863o599k948j8484
8231d8969j3276M7707L1759j3111j1243L5555K887k4367q043O269o491L3203J1768
$$ plain form
8218 43648 28300 76884 67899 50238 44134 4694 19732 38447 51276 11869 4347 27173
8206 27173 19618 -4401 -41186 -59180 -57710 -44908 -50520 -18297 41139 29888 26491 23454 9839
8193 9839 16531 -5493 -15186 28371 27079 878 -22355 -68814 -103481 -101536 -74099 -52316 -58219
8180 -58219 -54917 -55725 -60799 -34193 -41356 -2129 34587 44111 4130 -37859 -24834 -6185 15161
8167 15161 43532 37729 23511 -6456 -6711 -16759 -31196 -15575 -7401 24571 95700 118842 145408
8154 145408 95954 52768 24997 -60334 -74241 -38419 1226 13065 -27453 -51020 -43314 -12188
8142 -12188 22838 -25351 -50699 -62554 -19142 7941 -1680 14507 27572 -6286 -68792 -74164
8130 -74164 -25029 1004 22083 21262 12752 57671 70832 60000 42735 51437 49324 53196 7707
$$ packed form
8218D3648j5348M8584q985j7661o104l9440J5038J8715J2829l9407p522K2826
8206B7173p555k4019l6785j7994J470J2802n612L2223N9436j1251l397l037j3615
8193I839O692k2024r693M3557j292k6201k3233m6459l4667J945K7437K1783n903
8180e8219L302q08n074K6606p163L9227L6716R524l9981m1989J3025J8649K1346
8167A5161K8371n803j4218k9967k55j0048j4437J5621Q174L1972P1129K3142K6566
8154A45408m9454m3186k7771q5331j3907L5822L9645J1839m0518k3567P706L1126
8142a2188L5026m8189k5348j1855M3412K7083r621J6187J3065l3858o2506n372
8130g4164M9135K6033K1079q21q510M4919J3161j0832j7265Q702k113L872m5489
$$ plain form
8117 7707 45856 78442 43638 -42450 -30915 15577 12271 -38600 -47440 -37574 1602 71537 79104
8104 79104 95370 58808 27285 -8603 -44690 -81780 -65780 -52386 -45347 -8523 14173 42814
8092 42814 59775 19929 1691 -4615 22875 4715 -29159 -65637 -14659 23359 12358 -83
8080 -83 -25600 -33794 -55787 -99130 -63592 -19784 9399 -17122 1809 21199 51104 43996 66804
8067 66804 83075 108391 86743 78454 39405 22444 47004 48486 56960 53783 79981 74381 55809
8054 55809 59164 44002 29494 10881 24886 36533 40620 98512 85569 38926 52156 66420
8042 66420 51731 53632 75638 96413 79903 97693 78659 104068 136861 104121 96968 103081
8030 103081 80272 41028 28158 18873 34616 52630 115116 105018 57970 85654 127350 142407
$$ packed form
8117G707L8149L2586l4804q6088J1535M6492l306n0871q840R866L9176O9935P567
8104G9104J6266l6562l1523l5888l6087l7090J6000J3394P039L6824K2696K8641
8092D2814J6961l9846j8238o306K7490j8160l3874l6478N0978L8018j1001j2441
8080h3k5517q194k1993m3343L5538M3808K9183k6521J8931J9390K9905p108K2808
8067F6804J6271K5316k1648q289l9049j6961K4560J482Q474l177K6198n600j8572
8054E5809L355j5162j4508j8613J4005J1647M087N7892j2943m6643J3230J4264
8042F6420j4689J901K2006K0775j6510J7790j9034K5409L2793l2740p153O113
8030A03081k2809l9244j2870r285J5743J8014O2486j0098m7048K7684M1696J5057
$$ plain form
8018 142407 150557 160315 153140 166308 225450 222650 188661 200008 234909 259848 305981 305431 278865
8005 278865 207875 171692 127828 76422 47008 70570 97208 100811 136425 128146 71509 13892
7993 13892 20213 25962 5491 76397 75410 11577 -5416 17931 4531 -16504 6131 23931 52058
7980 52058 85120 114857 72121 76189 102585 81141 46870 4332 16688 70931 83575 74233
7968 74233 28061 -5281 -1989 14921 62096 127074 112970 92813 95577 106972 131194 117778
7956 117778 124536 114878 111913 68269 18963 6030 -44639 -16286 43043 55075 53748 16964
7944 16964 10430 8081 -14851 -13206 -14876 -32305 18999 14394 14151 -13012 -46208 -26505 2128
7931 2128 31994 20854 71329 94348 69584 64787 75427 64769 35131 -5871 7300 14603
$$ packed form
8018A42407Q150R758p175J3168N9142k800l3989J1347L4901K4939M6133n50k6566
8005B78865p0990l6183m3864n1406k9414K3562K6638L603L5614q279n6637n7617
7993A3892O321N749k0471P0906r87o3833j6993K3347j3400k1035K2635J7800K8127
7980E2058L3062K9737m2736M068K6396k1444l4271m2538J2356N4243J2644r342
7968G4233m6172l3342L292J6910M7175O4978j4104k0157K764J1395K4222j3416
7956A17778O758r658k965m3644m9306j2933n0669K8353N9329J2032j327l6784
7944A6964o534k349k2932J645j670j7429N1304m605k43k7163l3196J9703K8633
7931B128K9866j1140N0475K3019k4764m797J0640j0658k9638m1002J3171P303
$$ plain form
7919 14603 -6911 8308 3498 25917 34975 -24495 -47454 391 12320 19958 42549 -9585
7907 -9585 -48537 -45238 -30017 2943 42196 38206 -467 -25804 -46634 7693 56169 48322 -32953
7894 -32953 -51604 -19673 -28677 -24480 -5124 -9282 -10396 -4452 -7105 20844 32276 17842 6227
7881 6227 42917 101978 97178 71385 5541 -15698 11166 -11368 -13061 14805 14411 -11324 11065
7868 11065 35185 18900 10965 40587 69556 45924 -15999 -9436 444 -23328 -8985 -23092
7856 -23092 -39682 -56363 -38973 -45956 -38704 -44290 -53576 -49330 -17815 12132 -15207 -17182 -23064
7843 -23064 -14516 -23657 -29074 -33922 -48976 -65856 -33342 -8772 -30486 -26163 -19956 4263 16486
7830 16486 3362 9239 27919 39676 47816 16050 6613 -22673 -40309 -44069 -7549 -25422 -23571
$$ packed form
7919A4603k1514J5219m810K2419R058n9470k2959M7845J1929P638K2591n2134
7907i585l8952L299J5221L2960L9253l990l8673k5337k0830N4327M8476p847q1275
7894c2953j8651L1931r004M197J9356m158j114N944k653K7949J1432j4434j1615
7881F227L6690N9061m800k5793o5844k1239K6864k2534j693K7866l94k5735K2389
7868A1065K4120j6285p935K9622K8969k3632o1923O563R880k3772J4343j4107
7856b3092j6590j6681J7390o983P252n586r286M246L1515K9947k7339j975n882
7843b3064Q548r141n417m848j5054j6880L2514K4570k1714M323O207K4219J2223
7830A6486j3124N877J8680J1757Q140l1766r437k9286j7636l760L6520j7873J851
$$ plain form
7817 -23571 2202 -4418 -36090 -65589 -76748 -62296 -28643 -15779 -14598 8563 36642 33342
7805 33342 -8739 -42249 -26297 15285 32896 47690 19269 24754 21933 -44721 -40274 -9911
7793 -9911 8066 -1509 -42686 -50841 -35093 2261 -24722 -24979 2704 20031 -28466 -75236 -99800
7780 -99800 -56513 -1440 8200 -35277 -37693 -43193 -26636 -16136 46425 61752 40646 54336
7768 54336 80265 61735 -4965 -21188 -14483 -24547 -32910 -28548 -37876 -11821 -15978 -11914 -493
7755 -493 -26121 -26869 18825 19603 -7234 -23259 -9787 25873 41925 47986 62297 104343 130308
7742 130308 91579 76532 69510 54255 48534 18911 -29908 -41037 -28240 2475 -7086 -14436
7730 -14436 -10283 17472 29573 -4758 -27523 10785 44472 -16480 -17916 13015 54384 18707
$$ packed form
7817b3571K5773o620l1672k9499j1159J4452L3653J2864J181K3161K8079l300
7805C3342m2081l3510J5952M1582J7611J4794k8421N485k821o6654M447L0363
7793i911J7977r575m1177q155J5748L7354k6983k57K7683J7327m8497m6770k4564
7780i9800M3287N5073R640m3477k416n500J6557J0500O2561J5327k1106J3690
7768E4336K5929j8530o6700j6223O705j0064q363M362r328K6055m157M064J1421
7755d93k5628p48M5694P78k6837j6025J3472L5660J6052O061J4311M2046K5965
7742A30308l8729j5047p022j5255n721k9623m8819j1129J2797L0715r561p350
7730a4436M153K7755J2101l4331k2765L8308L3687o0952j436L0931M1369l5677
$$ plain form
7718 18707 -13540 10212 5932 33742 36674 13560 -4361 -28180 -38519 -50067 -67615 -45245
7706 -45245 -25344 -44311 -57462 -45681 -48307 -74076 -36765 24893 11217 3168 -8094 -11470
7694 -11470 -18436 -27979 -11473 -11406 -1211 24250 30767 31960 41237 26172 32724 -1269 -35917 -50344
7680 -50344 -50574 -17378 -29800 -61645 -62543 -17889 -26499 5468 23972 49504 48490 -12893 -31656
7667 -31656 -13434 3943 22542 23091 1443 -6734 -6295 24621 27203 -12294 -22171 -13083 -3766 -21883
7653 -21883 -9174 -3427 -11123 18829 30853 -6987 -17829 -24411 -4381 -720 -1695 17177 95653
7640 95653 77896 79408 74250 -3089 -16465 583 6576 -2391 -22381 -15711 10105 25029 12575
7627 12575 22928 33622 20949 -880 -45214 -70640 -88272 -90591 -74209 -63942 -61704 -61031 -44980
$$ packed form
7718A8707l2247K3752m280K7810K932k3114j7921k3819j0339j1548j7548K2370
7706d5245J9901j8967j3151J1781k626k5769L7311O1658j3676q049j1262l376
7694a1470o966r543J6506O7J0195K5461O517J193R277j5065O552l3993l4648j4427
7680e0344k30L3196j2422l1845q98M4654q610L1967J8504K5532j014o1383j8763
7667c1656J8222J7377J8599N49k1648q177M39L0916K582l9497r877R088R317j8117
7653b1883J2709N747p696K9952J2024l7840j0842o582K0030L661r75J8872P8476
7640I5653j7757J512n158p7339j3376J7048N993q967j9990O670K5816J4924j2454
7627A2575J0353J0694j2673k1829m4334k5426j7632k319J6382J0267K238O73J6051
$$ plain form
7614 -44980 -9665 -42715 -52623 -27526 -19156 -10065 -6666 -47107 -4549 14441 15691 18955 6638
7601 6638 -13207 -30655 1892 20963 32200 42860 32157 55260 29585 -25896 -68081 -54977
7589 -54977 6212 -6478 -13772 -12518 10020 31458 36884 11151 33329 7291 -26354 -15873
7577 -15873 -36040 -22369 18821 17851 -15353 -29671 -74509 -97831 -63944 -23668 -5820 -20064
7565 -20064 -347 -24376 -39348 -57906 -28550 -25849 -1926 -7874 -43847 -76527 -76542 -53570 397
7552 397 12921 -20167 -37012 -289 45920 33590 6445 -28475 -101768 -106355 -50747 -18795
7540 -18795 1349 -6955 13727 5800 -14130 -19130 6908 23955 -15901 -19593 43922 24895 20329
7527 20329 -4245 109 26602 26423 18255 29627 37193 17402 -22574 -19324 -3926 -986 25481
$$ packed form
7614d4980L5315l3050r908K5097Q370R091L399m0441M2558J8990J250L264j2317
7601F638j9845j7448L2547J9071J1237J0660j0703K3103k5675n5481m2185J3104
7589e4977O1189j2690p294J254K2538K1438N426k5733K2178k6038l3645J0481
7577a5873k0167J3671M1190r70l3204j4318m4838k3322L3887M0276J7848j4244
7565b0064J9717k4029j4972j8558K9356K701K3923n948l5973l2680j5K2972N3967
7552C97J2524l3088j6845L6723M6209j2330k7145l4920p3293m587N5608L1952
7540a8795K0144q304K0682p927j9930n000K6038J7047l9856l692O3515j9027m566
7527B0329k4574M354K6493j79q168J1372P566j9791l9976L250J5398K940K6467
$$ plain form
7514 25481 65292 -4244 -27596 -47989 -51897 -16632 10782 8195 -32115 4320 45984 54923
7502 54923 23854 23986 17716 18439 17403 30032 42880 32917 20794 21486 57455 70119 40853 9879
7488 9879 -39361 -45334 -1148 9458 -34574 -58518 -16373 32009 67960 58486 29297 24516 11064
7475 11064 2461 35354 57735 -5469 -28020 12215 -30320 -77974 -78152 -74892 -36682 14341 26031
7462 26031 9475 -36091 6179 -1161 -11806 -22860 -59090 -73844 -55710 15737 31881 36574
7450 36574 13567 -5469 -6465 6933 7868 599 19169 44836 47063 28277 -36562 -63116 -23079
7437 -23079 32650 49831 43887 19880 -8141 -860 14314 45731 68072 86590 65706 46028
7425 46028 33624 17423 29391 14326 -18645 -27040 -34550 -10825 10777 -9563 -38748 -26314
$$ packed form
7514B5481L9811o9536k3352k0393l908L5265K7414k587m0310L6435M1664Q939
7502E4923l1069J32o270P23j036J2629J2848r963j2123O92L5969J2664k9266l0974
7488I879m9240n973M4186J0606m4032k3944M2145M8382L5951r474k9189m781j3452
7475A1064q603L2893K2381o3204k2551M0235m2535m7654j78L260L8210N1023J1690
7462B6031j6556m5566M2270p340j0645j1054l6230j4754J8134P1447J6144M693
7450C6574k3007j9036r96J3398R35p269J8570K5667K227j8786o4839k6554M0037
7437b3079N5729J7181n944k4007k8021P281J5174L1417K2341J8518k0884j9678
7425D6028j2404j6201J1968j5065l2971q395p510K3725K1602k0340k9185J2434
$$ plain form
7413 -26314 -34902 -13174 14575 49226 69834 100853 99802 25033 -16897 -44005 -28514 -38163
7401 -38163 -36497 -39775 -9428 3793 -21844 -49120 -75098 -104325 -121438 -73455 -45976 -55038
7389 -55038 -44945 -61515 -55187 -56738 -60635 -50684 -27158 23362 13446 -46900 -37748 31524 36190
7376 36190 8343 -22078 12768 -55703 -61164 4066 13028 -35786 -80621 -79152 -30067 -35813 -30855
7363 -30855 -16973 -37137 -57751 -72946 -61044 -18648 -6447 9716 27562 34668 20055 5048
7351 5048 -8166 16344 49592 9028 -5022 -10886 -12047 36085 42118 809 -55292 -107042 -127533
7338 -127533 -51726 -3215 20307 12664 5114 -18980 -53952 -58439 -74626 -74124 -84857 -104770 -65173
7325 -65173 -29067 -42709 -11071 -26544 -50150 -9773 -2667 -52403 -56237 -38953 10016 34387
$$ packed form
7413b6314q588K1728K7749L4651K0608L1019j051p4769m1930k7108J5491r649
7401c8163J666l278L0347J3221k5637k7276k5978k9227j7113M7983K7479r062
7389e5038J0093j6570O328j551l897R951K3526N0520r916o0346R152O9272M666
7376C6190k7847l0421L4846o8471n461O5230Q962m8814m4835J469M9085n746M958
7363c0855J3882k0164k0614j5195J1902M2396J2201J6163J7846P106j4613j5007
7351E048j3214K4510L3248m0564j4050n864j161M8132O033m1309n6101n1750k0491
7338a27533P5807M8511K3522p643p550k4094l4972m487j6187N02j0733j9913L9597
7325f5173L6106j3642L1638j5473k3606M0377P106m9736l834J7284M8969K4371
$$ plain form
7313 34387 -14079 4128 -692 -13873 -42762 -73410 -53235 -24214 15742 1502 -51119 -63872
7301 -63872 -49130 -28961 -14079 34075 32695 13613 26983 45907 49521 81218 84110 38935
7289 38935 613 -3864 14595 29409 21030 -9601 -54976 -77506 -34123 -5933 15234 1729
7277 1729 305 24933 77990 74844 38047 22703 4059 -6847 12828 36880 43001 -8243 -57924
7264 -57924 -49050 9516 -15000 -30664 -38042 -41126 -33089 11880 -14512 -56360 -49433 -19998 -67075
7251 -67075 -62458 -61728 -38191 -32832 -31811 5086 -12748 -53502 -28904 7465 21371 26155 44300
$$ packed form
7313C4387m8466J8207m820j3181k8889l0648K0175K9021L9956j4240n2621j2753
7301f3872J4742K0169J4882M8154j380j9082J3370J8924L614L1697K892m5175
7289C8935l8322m477J8459J4814q379l0631m5375k2530M3383K8190K1167j3505
7277A729j424K4628N3057l146l6797j5344j8644j0906J9675K4052O121n1244m9681
7264e7924Q874N8566k4516j5664p378l084Q037M4969k6392m1848O927K9435m7077
7251f7075M617P30K3537N359J021L6897j7834m0754K4598L6369J3906M784J8145
$$ [...]
##END NTUPLES=NMR SPECTRUM
##END=
