##TITLE=Analysis number 316112
Compound Code cc 46609
Book Reference 441/185
Project Code adrs
Chemist Name colinb
##JCAMPDX= 6.0         $$ Bruker NMR JCAMP-DX V2.0
##DATA TYPE= NMR SPECTRUM
##DATA CLASS= NTUPLES
##ORIGIN= Bruker BioSpin GmbH
##OWNER= nmr
$$ XWIN-NMR		Version 3.5
$$ Fri Dec 16 11:57:33 2005 GMT Standard Time (UT+0h)  MAYBRIDGE\nmr@NMR_250MHZ
##.OBSERVE FREQUENCY= 250.131544655141
##.OBSERVE NUCLEUS= ^1H
##.ACQUISITION MODE= SIMULTANEOUS (DQD)
##.ACQUISITION SCHEME= undefined
##.AVERAGES= 16
##.DIGITISER RES= 18
##SPECTROMETER/DATA SYSTEM= dpx250
##.PULSE SEQUENCE= zg30
##.SOLVENT NAME= CDCl3
##.SHIFT REFERENCE= (INTERNAL, CDCl3, 0, 16.522)
##AUDIT TRAIL= $$ (NUMBER, WHEN, WHO, WHERE, WHAT)
$$ ##TITLE= Audit trail, XWIN-NMR		Version 3.5
$$ ##JCAMPDX= 5.01
$$ ##ORIGIN= Bruker BioSpin GmbH
$$ ##OWNER= nmr
$$ C:\u/data/dgb/nmr/ADRS/13940/pdata/1/auditp.txt
$$ ##AUDIT TRAIL=  $$ (NUMBER, WHEN, WHO, WHERE, WHAT)
(   1,<2005-12-16 11:56:55.30 +000>,<MAYBRIDGE\nmr>,<NMR_250MHZ>,
      <created by zg, POWCHK disabled, PULCHK disabled
       configuration hash MD5:
       62 19 C7 07 E1 42 D1 B7 37 6C 3D D0 77 39 F9 E6
       data hash MD5: 64K
       80 B0 0A B8 05 8D 60 97 4E EC BE B9 A1 79 F1 05>)
(   2,<2005-12-16 11:57:14.17 +000>,<MAYBRIDGE\nmr>,<NMR_250MHZ>,
      <Start of raw data processing
       ef LB = 0.3 FT_mod = 6 PKNL = 1 SI = 32K 
       data hash MD5: 32K
       D4 FE 6B 2F 7B 15 FA EB 39 DD B2 0E 22 83 47 E8>)
(   3,<2005-12-16 11:57:19.81 +000>,<MAYBRIDGE\nmr>,<NMR_250MHZ>,
      <apk 
       data hash MD5: 32K
       AE 9B D1 FB 9D 75 84 8D A1 AB 17 A7 05 8D FC 29>)
(   4,<2005-12-16 11:57:21.41 +000>,<MAYBRIDGE\nmr>,<NMR_250MHZ>,
      <abs ABSG = 5 
       data hash MD5: 32K
       83 52 5F 79 A7 15 23 D4 CB 71 BE 24 9A 34 F7 7B>)
$$ ##END=
$$ 
$$ hash MD5
$$ 25 01 00 F0 E7 B4 3B 75 96 DD 41 23 4B 77 0C 16
##$RELAX= 
##$RELAX= 
##$RELAX= 
##$RELAX= 
##$RELAX= 
##$RELAX= 
##$RELAX= 
$$ Bruker specific parameters
$$ --------------------------
##$DU= <C:\u>
##$EXPNO= 13940
##$NAME= <ADRS>
##$PROCNO= 1
##$TYPE= <nmr>
##$USER= <dgb>
##$AMP= (0..31)
100 100 100 100 100 100 100 100 100 100 100 100 100 100 100 100 100 100 
100 100 100 100 100 100 100 100 100 100 100 100 100 100 
##$AQSEQ= 0
##$AQ_mod= 3
##$AUNM= <au_zg>
##$AUTOPOS= <52 >
##$BF1= 250.13
##$BF2= 250.13
##$BF3= 250.13
##$BF4= 250.13
##$BF5= 500.13
##$BF6= 500.13
##$BF7= 500.13
##$BF8= 500.13
##$BYTORDA= 1
##$CFDGTYP= 0
##$CFRGTYP= 5
##$CHEMSTR= <none>
##$CNST= (0..31)
1 1 145 1 1 1 1 1 1 1 1 1 1 1 1 1 1 1 1 1 1 1 1 1 1 1 1 1 1 1 1 1 
##$CPDPRG= <>
##$CPDPRG1= <>
##$CPDPRG2= <>
##$CPDPRG3= <>
##$CPDPRG4= <mlev>
##$CPDPRG5= <mlev>
##$CPDPRG6= <mlev>
##$CPDPRG7= <mlev>
##$CPDPRG8= <mlev>
##$CPDPRGB= <>
##$CPDPRGT= <>
##$D= (0..31)
0 1 0 0 0 0 0 0 0 0.06 0 0 0 0 0 0 0.0002 0 0 0 0 0 0 0 0 0 0 0 0 0 0 
0 
##$DATE= 1134734210
##$DBL= (0..7)
120 120 120 120 120 120 120 120 
##$DBP= (0..7)
150 150 150 150 150 150 150 150 
##$DBP07= 0
##$DBPNAM0= <>
##$DBPNAM1= <>
$$ [...]
##$SUBNAM7= <"">
##$SUBNAM8= <"">
##$SUBNAM9= <"">
##$SW= 20.6930455092707
##$SWIBOX= (0..15)
0 0 3 0 0 0 0 0 0 0 0 0 0 0 0 0 
##$SW_h= 5175.983436853
##$TD= 65536
##$TD0= 1
##$TE= 294.16
##$TE2= 300
##$TE3= 300
##$TEG= 300
##$TL= (0..7)
0 120 120 120 120 120 120 120 
##$TP= (0..7)
150 150 150 150 150 150 150 150 
##$TP07= 0
##$TPNAME0= <>
##$TPNAME1= <>
##$TPNAME2= <>
##$TPNAME3= <>
##$TPNAME4= <>
##$TPNAME5= <>
##$TPNAME6= <>
##$TPNAME7= <>
##$TPOAL= (0..7)
0.5 0.5 0.5 0.5 0.5 0.5 0.5 0.5 
##$TPOFFS= (0..7)
0 0 0 0 0 0 0 0 
##$TUNHIN= 0
##$TUNHOUT= 0
##$TUNXOUT= 0
##$USERA1= <user>
##$USERA2= <user>
##$USERA3= <user>
##$USERA4= <user>
##$USERA5= <user>
##$V9= 5
##$VALIST= <valist>
##$VCLIST= <CCCCCCCCCCCCCCC>
##$VD= 0
##$VDLIST= <DDDDDDDDDDDDDDD>
##$VPLIST= <PPPPPPPPPPPPPPP>
##$VTLIST= <TTTTTTTTTTTTTTT>
##$WBST= 1024
##$WBSW= 4
##$XGAIN= (0..3)
0 0 0 0 
##$XL= 0
##$YL= 0
##$YMAX_a= 478674
##$YMIN_a= -304525
##$ZGOPTNS= <>
##$ZL1= 120
##$ZL2= 120
##$ZL3= 120
##$ZL4= 120
##$ABSF1= 16.522
##$ABSF2= -4.171173
##$ABSG= 5
##$ABSL= 3
##$ALPHA= 0
##$AQORDER= 0
##$ASSFAC= 0
##$ASSFACI= 0
##$ASSFACX= 0
##$ASSWID= 0
##$AUNMP= <proc_1d>
##$AZFE= 0.1
##$AZFW= 0.1
##$BCFW= 0
##$BC_mod= 0
##$BYTORDP= 0
##$COROFFS= 0
##$CY= 12.5
##$DATMOD= 1
##$DC= 0
##$DFILT= <>
##$DTYPP= 0
##$F1P= 14.0000005364418
##$F2P= -0.99999901652339
##$FCOR= 0.5
##$FTSIZE= 32768
##$FT_mod= 6
##$GAMMA= 0
##$GB= 0
##$INTBC= 1
##$INTSCL= 1
##$ISEN= 128
##$LB= 0.3
##$LEV0= 0
##$LPBIN= 0
##$MAXI= 10000
##$MC2= 0
##$MEAN= 0
##$ME_mod= 0
##$MI= 0
##$NCOEF= 0
##$NC_proc= -3
##$NLEV= 6
##$NOISF1= 0
##$NOISF2= 0
##$NSP= 0
##$NTH_PI= 0
##$NZP= 0
##$OFFSET= 16.522
##$PC= 1
##$PHC0= 80.6096
##$PHC1= 13.21556
##$PH_mod= 1
##$PKNL= yes
##$PPARMOD= 0
##$PSCAL= 4
##$PSIGN= 0
##$REVERSE= no
##$SF= 250.13
##$SI= 32768
##$SIGF1= 0
##$SIGF2= 0
##$SINO= 400
##$SIOLD= 32768
##$SREGLST= <1H.CDCl3>
##$SSB= 0
##$STSI= 32768
##$STSR= 0
##$SW_p= 5175.98343685301
##$SYMM= 0
##$S_DEV= 0
##$TDeff= 65536
##$TDoff= 0
##$TI= <Analysis number 999999
Compound Code 99
Book Reference 9
Project Code 9>
##$TILT= no
##$TM1= 0
##$TM2= 0
##$TOPLEV= 0
##$USERP1= <user>
##$USERP2= <user>
##$USERP3= <user>
##$USERP4= <user>
##$USERP5= <user>
##$WDW= 1
##$XDIM= 32768
##$YMAX_p= 379456469
##$YMIN_p= -482986
$$ End of Bruker specific parameters
$$ ---------------------------------
##NTUPLES= NMR SPECTRUM
##VAR_NAME=  FREQUENCY,     SPECTRUM/REAL,   SPECTRUM/IMAG
##SYMBOL=    X,             R,               I
##VAR_TYPE=  INDEPENDENT,   DEPENDENT,       DEPENDENT
##VAR_FORM=  AFFN,          ASDF,            ASDF
##VAR_DIM=   32768,         32768,           32768
##UNITS=     HZ,            ARBITRARY UNITS, ARBITRARY UNITS
##FACTOR=    0.157963299565203, 1,           1
##FIRST=     4132.6476996994, 0,             0
##LAST=      -1043.33573715361, 0,           0
##MIN=       -1043.33573715361, -482986,     0
##MAX=       4132.6476996994, 379456469,     0
$$ Real data points
##PAGE= N=1
##DATA TABLE= (X++(R..R)), XYDATA
$$ [...]
23015 32620 34348 24659 18466 7507 -39145 -49896 -31034 -15949 -12249 -2723 5267 14149 -5785
23002 -5785 -15655 -14323 -570 -37087 -41084 -28518 -7045 1535 -5374 -6728 5773 -3522 -14013
22989 -14013 -29023 -2369 -4646 -19624 8125 13892 23060 42177 36638 28433 23001 25414 13598
22976 13598 -31917 -43475 -45495 -26315 382 15192 -19618 -46804 -61175 -44628 -11048 11766
22964 11766 35282 35704 36603 53723 79593 78731 79461 38571 26587 20361 -6906 -1197 108 -2276
22950 -2276 -9011 -20045 -11947 42232 53410 2543 -15186 23193 41997 40741 18570 -6869
22938 -6869 -15207 10474 6979 10568 23366 19711 19796 -2518 -14062 9291 3241 7558 2405 -21539
22924 -21539 -30385 -632 1589 -22571 -24932 18227 42073 34422 59917 55288 30668 7390 16105
22911 16105 24724 21623 24893 21208 38027 32085 3750 5307 8970 5339 -30407 -16489 8346
22898 8346 12588 2332 -18283 -2944 30721 49261 37939 10697 -1582 7323 -6409 -3133
22886 -3133 -18451 -41048 -41634 -29532 20900 61867 42192 36174 50399 43744 16784 -12775 -28270
22873 -28270 -25062 -18708 1921 -26765 -27169 -9389 15514 43796 30755 -29293 -47635 -20077
22861 -20077 -8300 -18452 -52985 -43005 1299 51286 49633 53213 72087 38210 -4449 -12921
22849 -12921 12444 3239 12255 20462 22672 21829 3176 -29347 -25740 -7759 15124 40407 49426
22836 49426 14534 -11223 7236 3689 -10452 -613 20941 -3577 8912 27159 33207 35580
22824 35580 13730 -39152 -61012 -60421 -42009 -38233 -38616 -51044 -45311 -36872 -28193 8977 31929
22811 31929 24211 -7555 7680 -7435 -19365 7318 24461 21432 -827 25019 42726 47747
22799 47747 12156 5926 -5648 15395 23626 -10493 -15279 -30659 -40806 -15777 -20910 -21543 -19454
22786 -19454 3311 4434 -11729 -5217 -14513 -26931 -9858 6038 -7025 5405 26816 9088
22774 9088 -25158 -26470 -29193 -7855 -16691 -13945 -8419 8739 26416 29873 5465 -4145 -13415
22761 -13415 -1820 8174 -3233 -17545 3630 -11773 -21850 -8278 18949 9183 21791 -13852
22749 -13852 -22843 -1838 20178 33550 33875 19185 37614 49051 35780 18271 11944 -8582
22737 -8582 -2691 14589 26014 13875 -3790 -519 997 10351 18097 3743 -17183 1609 -19599
22724 -19599 -24688 -50324 -57342 -61194 -29095 -25344 -16093 -10802 -28718 -40835 -35223 -44612 -43579
22711 -43579 -41583 -29800 -8134 -9114 -22135 -4833 -5195 -7685 -3632 17453 15204 7688 5255 3108
22697 3108 8064 20507 8804 13861 53174 38139 1694 -8409 -7935 -14139 -31411 -4888 27853
22684 27853 31798 18131 -20250 -46210 -12498 -9267 -9306 2168 3140 -14071 -17529 6893 20341
22671 20341 -2869 -21689 -2924 -12822 -22680 -5071 36097 43961 15394 -5455 -17981 -63775
22659 -63775 -62612 -38511 -54802 -49112 -59025 -35343 -34996 -18061 -7427 33874 48853 22617 23271
22646 23271 -33977 -45116 -35220 -6830 -57 -346 40065 39854 31787 12767 15147 6382 6298 14411
22632 14411 8007 -10479 4240 29953 22569 13885 -11597 -7567 -412 20588 21789 14185 33382
22619 33382 6773 -26464 -35999 -17691 31103 32641 2612 -22737 -20601 -24552 -26981 -11133 2673
22606 2673 9587 -11057 -5443 23634 44679 13246 -22194 -29034 -31574 -21392 -24798 -32702 386
22593 386 30207 29203 33821 22482 19975 19263 32294 31501 19566 13947 28196 26433 25362 -623
22579 -623 -9059 13549 16381 32299 39029 9246 13239 40801 22591 21261 26060 -3362 -30745
22566 -30745 -29342 -24760 17501 56272 24910 -14216 -18379 -15894 6912 -5002 -54113 -44203 -32100
22553 -32100 -13994 -20631 -18021 8154 -5189 38653 46446 16156 4816 8771 -8122 10304
22541 10304 25459 17726 9231 7090 33777 29770 -15884 -18955 8370 19288 13823 4211 -5756
22528 -5756 -7781 -6548 -10688 -10597 4669 32528 25664 -26256 -23824 -3846 11622 9242 -3224 -26605
22514 -26605 -37054 -24854 -10029 -19736 -25838 -26309 -43423 -30691 4245 19731 7829 -3038
22502 -3038 -6623 -36154 -1879 8661 26401 50977 42536 26966 32551 11539 -9242 -4949 -17315
22489 -17315 -20713 -23270 -4254 8368 15202 -14634 -11508 -2083 -15604 5231 -12535 -40127 -41124
22476 -41124 -30560 -12307 12729 23854 -7275 -13842 -33019 -11642 17440 22692 -6910 5153
22464 5153 22666 27665 31211 12948 -12754 -422 -9026 -38186 -53532 -33461 6033 43300
22452 43300 36138 4722 19544 7600 5356 -2900 -24753 -30751 -4226 15595 -12416 -3225 1779
22439 1779 1625 6344 12067 -1265 -2967 14195 16684 -22549 -35229 -49384 -48964 -10749 13630
22426 13630 16307 -4504 -13434 17435 24567 -1341 -50054 -56117 -73074 -57348 -23394 -9131
22414 -9131 -6834 -22968 -19562 -6951 9229 40941 50474 26701 17233 12474 26789 36516 33395
22401 33395 -1125 -33920 -39133 -40511 -22585 23375 16104 96 3696 35713 58107 27284
22389 27284 -7208 -48316 -47692 -32434 -22862 -2958 -9276 -20876 -30281 -43311 -50392 -67278 -23579
22376 -23579 34730 44877 11943 -13041 -9207 2004 -3833 -4822 -6938 -36814 -42348 -43378 -33240
22363 -33240 -28906 -34337 -10864 -17401 7398 41343 64267 84585 57428 51082 10617 -3619
22351 -3619 16212 9214 8840 1628 -8135 -15617 -42727 -46924 -27967 -61779 -69140 -38263 -34742 -35952
22337 -35952 -26188 -28870 -14548 -7498 -36800 -41759 -1636 -10030 -46586 -44588 -31111 -26445 -31265
22324 -31265 -16613 -10679 -6549 -18668 -16877 -31330 -31451 -19471 -7987 -3715 -8275 -12185 -20371
22311 -20371 -20734 -12266 -7664 -9137 -45478 -39897 -54828 -61936 -25304 2746 11437 15547 25490 20371
22297 20371 -6705 -31986 -57826 -34325 -12210 -2209 -6986 -12141 -22719 2625 -8651 -22546
22285 -22546 -19224 -48432 -55740 -27145 -6148 266 16867 31605 5599 -17689 -22310 -11685
22273 -11685 -6437 -448 23933 16191 -13471 -18271 5262 44024 19315 -14893 -22708 -47447 -43388
22260 -43388 -28170 -6501 5462 13059 13677 -8200 -23300 -11674 -9404 2782 -15485 -20093 -24655
22247 -24655 -25614 -10276 -15389 -32724 -30344 -1646 7076 -100 -5287 -8423 -10726 -12817 11223 21255
22233 21255 -1254 837 13009 13691 -5977 -38156 -12230 -3447 -18804 -21627 4544 4791 -29125
22220 -29125 -46629 -17796 2511 8617 -6031 -30345 -28795 -25550 -28855 -20037 22367 37478 19721
22207 19721 19471 7651 2221 -4619 -11942 -8387 -5179 28896 26767 38478 28091 -16359 -31368
22194 -31368 -47436 -26545 -1129 12979 25773 -7401 -14721 -2425 -2223 4452 -19247 -21221 -32674
22181 -32674 -25836 -15220 -25546 -27795 -31992 14487 40937 13530 -4545 15620 33675 17712
22169 17712 21782 -19299 -53748 -60041 -37374 -41489 -23378 -37046 -49885 -64550 -60622 -41077
22157 -41077 -25377 -4244 -8243 -10742 2711 -23802 -35845 -55038 -69250 -35807 -6666 30599
22145 30599 17871 6052 -9036 -14958 -26031 -15996 -14667 -14682 9631 -6982 -39307 -45394 -47117
22132 -47117 -27631 -8989 -15796 -4587 -20594 -21845 11483 23310 10796 11531 15900 22004 -7257
22119 -7257 -15343 -51293 -56638 -53579 -18129 -12706 -16996 -7533 -691 22137 21143 505 -8297 -520
22105 -520 -27486 -33351 -9195 24649 45906 52289 30776 20843 9585 -13103 -11543 2667 17522
22092 17522 25002 25526 38137 61383 39436 -1100 -29045 -32767 -20167 -19969 -34753 -12562 15591
22079 15591 -1166 -1541 9731 15756 8813 15253 11538 6746 12943 11618 24422 28025 17076 -12168
22065 -12168 -34716 -7860 13482 11336 26183 21818 15321 19418 -3992 -35669 -45753 -51911 -15915
22052 -15915 -12766 -29982 -18600 -5919 -8627 -20144 -29398 -25840 -17818 -3400 97 23358 -2186
22039 -2186 2939 24484 -8929 13332 34730 33796 16475 -21593 -29136 -13373 -33739 -43650 -46473
22026 -46473 -38151 -16282 -24121 -10306 23628 18744 1184 -9426 -10116 -28571 -47932 -32553 -30874
22013 -30874 -53671 -66446 -56715 -30385 -1226 -6844 -19808 -7014 -2538 -9161 -42819 -31336
22001 -31336 -15480 8037 21585 4863 16411 20310 23626 31111 18866 38481 10467 -21630
21989 -21630 -30822 4173 13384 -8804 -3227 4624 11018 8439 -8068 1476 8841 -11403 -47333
21976 -47333 -22227 20014 14877 14471 414 -50777 -78006 -83501 -74572 -46833 -24370 545 10207
21963 10207 14180 -17612 -15446 -17301 -17847 -15543 -32243 -18320 -25680 -21466 -14324 -12428 -12607 -10734
21949 -10734 -32930 -58857 -40938 -27200 -36800 1472 -10811 -27661 -36880 -39676 -43604 -39885 -38165
21936 -38165 -47004 -28130 -3687 473 -4193 -12521 -26285 -20012 8557 14115 19635 2470 -32419
21923 -32419 -35278 -24697 -28949 -15141 -16249 -21087 -46702 -35139 -32256 -45756 -74155 -52664 -37032
21910 -37032 -24166 1568 -11942 -47561 -23421 3880 20212 14360 -10347 6357 12416 -21035
21898 -21035 -22705 -3544 -2213 10056 6654 -4603 -24837 -15625 -24254 -8808 8101 18186 37317
21885 37317 33676 23365 -2418 -7284 2343 -10028 -21196 4658 39242 57691 30438 -41
21873 -41 -15459 9924 11058 34696 -11663 -13085 3343 1110 -17298 -6036 21602 1603 -400
21860 -400 -12916 -19836 -17695 -22567 -34622 -60262 -50283 -38520 -13355 8906 7161 4708 -6464
21847 -6464 -8643 2137 24292 31787 4753 -8747 -1610 -8723 -9489 14659 13242 -10934 -19833
21834 -19833 12737 1506 -35418 -40687 -19018 -7372 -10566 -18501 -39371 -14541 5413 7195
21822 7195 -19658 -38383 -34282 -20128 -11511 -20318 -4969 -12208 -27134 -27861 -39422 -47350 -43693
21809 -43693 -35822 -18620 -16033 6302 43938 39289 13654 -6322 -14320 -40297 -30536 2707 5337
21796 5337 374 23350 20557 3837 16107 19238 38228 39795 -1826 -6198 11334 -247 -31562
21783 -31562 -20984 -37693 -52398 -31864 -30828 -28039 -28024 -2923 -8843 -15720 -20034 -21859 -49723
21770 -49723 -26004 2352 14818 27514 27894 33729 6424 -12325 7231 18462 -19553 -42102
21758 -42102 -31186 -32643 -31414 -22155 -10434 -17842 4130 4014 -11275 -1689 17815 19839 23496
21745 23496 42961 27118 5535 25461 -3509 -31554 6038 25085 25246 38671 19619 15442
21733 15442 13104 23212 17881 7227 15997 -6884 -15297 -13172 -5983 5621 16651 -3712 -376
21720 -376 -8308 -10650 -772 -2792 2778 -16232 -24557 -4205 14498 23410 2781 -20205 -19125 12020
21706 12020 14836 -15251 -19991 -40911 -44917 -41493 -36252 -39349 -14555 -16541 -40872 -40773 -55359 -37620
21692 -37620 -31014 -39805 -46092 -31554 3821 15033 -21799 -48581 -62159 -17802 -5741 -2713
21680 -2713 12514 6944 6544 -5501 -11838 -6108 27790 29269 22518 22262 41419 37184 41660 57360
21666 57360 42678 27403 17958 -15729 -51839 -35955 4725 13360 1057 36096 22298 -16712
21654 -16712 -36985 -41187 -26968 -17424 27926 33779 21660 5973 5895 -11507 -44885 -40578 -23198
21641 -23198 -33156 -46752 -84376 -68848 -21972 21566 48589 12060 13616 34493 24625 10970
21629 10970 8823 -23369 -30745 -19722 -26582 -22992 -28593 -62339 -87321 -81698 -25907 -19559 -2435
21616 -2435 -7370 3490 12378 -19574 -31674 -33054 -35393 -15156 22864 36931 28941 24626 14922
21603 14922 -8272 -22152 -31873 -32074 -28770 -22832 -36885 -35689 -10530 -6856 -10117 -13837 -19689 -34323
21589 -34323 -52356 -52781 -28677 -5560 -7171 -24585 -1250 -16904 -24204 -11106 -23961 -42584
21577 -42584 -65478 -72566 -59030 -52297 -31241 14520 30734 9487 -48669 -52468 -35381 -49707
21565 -49707 -51429 -32652 -36451 -2804 3017 7455 25820 14334 -30499 -29929 -14357 12574 15600
21552 15600 7562 11919 17781 19183 -1555 29472 16635 9752 5007 -15164 -2281 8580 -9375
21539 -9375 -38063 -19998 -10477 -3726 -14551 4865 10615 32869 12807 18387 -6246 -1157 -14731
21526 -14731 -8037 28811 59254 80507 79345 27204 -1038 -12798 -1456 3331 41223 78792
21514 78792 73721 20824 -11975 -31062 -32590 -36528 -28014 -13501 4281 25888 19921 1134 -3984
21501 -3984 4803 4203 15695 36510 35463 16931 -3560 -70870 -67420 -32567 -28727 -30876 -18449
21488 -18449 -46690 -61875 -51113 -71508 -43582 -3021 11684 -17114 -9610 36059 41782 31872
21476 31872 -19438 -39080 -17813 -442 10622 -5296 6210 12397 11052 1061 -2030 2780 -21182
21463 -21182 -15066 -24230 -47132 -22674 12413 13395 32279 17082 -15592 -29920 -31814 -19828 -20150
21450 -20150 -56735 -41792 -29604 -27944 -29857 -25842 -32111 -20790 7270 -11775 -42540 -47910 -60930
21437 -60930 -51798 -24813 -6141 -40431 -39416 -12544 3216 17036 -3889 -11560 -13611 -12400 -26567
21424 -26567 -47661 -51957 -26900 -3644 16812 55522 41100 31197 31476 -3026 -33486 -9100
21412 -9100 43435 91625 53559 -1263 -29640 -18889 -13564 -8812 4070 9410 24859 47781
21400 47781 40620 35255 33015 27309 13420 26719 22846 18466 13238 -139 163 9672 10220 4096
21386 4096 -9365 -9278 -17079 -26121 -11277 -2764 -25955 -36169 -55263 -57575 -43654 -31411 -20443
21373 -20443 -19747 10241 -3535 -47044 -54451 -20629 -67 15655 14934 16514 -6538 -9666 -26445
21360 -26445 -19308 28344 35252 25365 35750 47035 32720 19336 34617 37670 33626 11747 431
21347 431 -11795 -40127 -23300 -9636 -15229 -10239 10681 21661 2894 -16753 -41508 -44519 -17257
21334 -17257 -32192 -55050 -72192 -72622 -58843 -15790 31103 40547 43409 25563 1556 -20775
21322 -20775 -23276 -9801 -10699 6516 7441 -10029 -16461 -7047 -4967 -15662 -8231 -26828 -23785 -6523
21308 -6523 -25121 -26965 -14840 -15804 -37591 -22514 -338 7319 7484 25983 24755 17665 1203
21295 1203 -27149 -15666 -11038 25120 37665 26624 7712 5343 14589 -15385 -28481 -30709 -5162
21282 -5162 24953 -6437 -35301 -39810 -28673 -50782 -60852 -63384 -39082 -21789 -32833 -24976
21270 -24976 -18433 -12160 -673 6015 -14005 -7344 26926 32348 13473 -12892 -29651 -5757 2584
21257 2584 5139 14560 -295 166 5446 36053 8680 -15930 -16115 14219 40617 35802 7640
21244 7640 6888 1303 11661 -1248 -11133 -31289 -22024 19874 17833 30663 70391 74538 52767
21231 52767 55650 29408 6645 1024 12624 26010 20969 13415 30147 25961 31016 18963 -20703
21218 -20703 -22958 3464 4876 14605 -10107 -23649 -21116 -50376 -49402 -31313 -29233 -23867 -2975
21205 -2975 16071 23210 11542 3440 -1678 -6007 -16606 -13903 -20442 -20521 -39406 -27255 -18456 -10114
21191 -10114 566 18645 22597 10137 -17696 -25677 -9765 15148 9846 12885 12270 25853 44992
21178 44992 41502 36121 24701 15995 24476 28219 13122 -33346 -45632 -46458 -35163 -60191 -33659
21165 -33659 -24825 -34128 -9081 6686 21824 40871 18439 28253 39339 27128 10631 26060
21153 26060 -5966 -32995 -43389 -35714 -42925 -52266 -33711 -55002 -74235 -69324 -45183 -51261 -67523
21140 -67523 -83342 -66748 -37619 -7604 -10068 -5897 11776 -25755 -27598 -7466 5484 17750
21128 17750 20852 51969 47084 14901 2767 -3065 137 11409 5404 -23139 -24198 -17079 -1270
21115 -1270 3851 -12424 -23197 -31238 -6598 -2070 -7505 7697 18082 9785 1701 26693 42039
21102 42039 26419 9463 -6002 -36449 -51813 -53726 -62955 -65778 -44693 -55167 -28910 -25576
21090 -25576 -18416 -46500 -45702 -11380 9252 30369 12575 10622 -20488 -69047 -85802 -57249
21078 -57249 -33361 -34396 -46277 -66256 -43603 11508 36879 12601 -6041 -20217 -26191 -21030
21066 -21030 20919 47396 59307 65901 65192 59427 19216 -64 30967 29878 -1197 -7205 -17861
21053 -17861 -29846 -17437 2212 5169 -4300 -18204 -13394 -40440 -61521 -18592 -2584 -18604
21041 -18604 10955 -146 10717 8586 -13288 -5083 -1076 -7122 -23838 -31526 -17384 37161 44657
21028 44657 1777 22469 21056 -9924 -2309 -8101 -13008 -28826 -23656 -12473 22348 19660 -4957
21015 -4957 -33298 -59455 -66912 -58205 -41658 -30661 -30047 -25626 -10755 -7325 -4166 27366 32556
21002 32556 3810 -1562 3205 2889 -295 -53990 -48486 -65989 -96320 -58007 -14559 -7695 -3801
20989 -3801 -25956 -22175 -24771 -43525 -40401 -28726 -27295 -28531 -9574 -16619 -36050 -39943 -32707
20976 -32707 -22576 -40306 -35185 -4994 -19240 -50812 -35275 -2609 -17898 -45282 -40123 5296
20964 5296 30468 49148 36288 23233 -20911 -52777 -35838 5972 -12921 -21854 -24195 -17917
20952 -17917 -27966 -36827 -47635 -36864 -63165 -63075 -44097 -20703 -17140 -37720 -26132 -17128 -24866
20939 -24866 -56070 -22414 -8942 4774 1386 -8151 15074 7181 -4506 22627 57198 50709
20927 50709 26165 -2385 -24979 -27786 -15873 9590 3500 -16830 5880 38508 44471 28194
20915 28194 15285 22030 9726 -25676 -29555 -35123 -34083 4599 18791 10643 -8075 -45093 -71614
20902 -71614 -31130 940 4541 25673 26546 20621 15146 -7785 -14487 19173 41256 66408 82200
20889 82200 69684 72609 75848 56243 22647 26829 44252 30219 35901 35358 17889 3704 -11801
20876 -11801 2581 26108 44826 54399 65190 17120 -29169 -24724 -11776 -20075 -26906 856
20864 856 16712 19727 26508 31027 -4837 3992 -5880 -11780 -26318 -16659 9771 3278 -1910 -26432
20850 -26432 -24705 4198 24251 4047 -767 -16821 -44336 -46490 -39072 -7921 10802 4149 -342
20837 -342 12565 15971 -726 -1749 12249 13835 2062 214 -22967 -859 21228 4628 -17291
20824 -17291 -23162 -10595 4981 1956 -35660 -42781 -18510 17123 43785 8650 -1358 -6613
20812 -6613 -17018 -6844 -1767 -15527 -19670 2569 -14053 -58581 -57703 -12274 13673 19933 18669
20799 18669 19259 36843 42025 53696 41687 31086 44193 28759 11228 34974 29994 -2653
20787 -2653 337 15076 11257 8710 -12052 -30091 -41422 -37667 -20853 -11895 -1497 4108 9674
20774 9674 -10379 -2250 4358 -23712 -53285 -50896 -22697 -2897 15595 17317 7385 -21826 -12731
20761 -12731 -12811 -40379 -42061 -4987 -16895 -31487 -2449 29819 26260 3989 -1030 -3750 -9231
20748 -9231 -17276 3326 10732 -14330 -14856 -19417 -31154 -23632 3676 656 -40147 -33585 -21533
20735 -21533 -28300 -22049 -9872 37291 63824 24339 1383 28609 14283 26957 20559 11051
20723 11051 -6501 -14535 -9385 35881 35081 19515 12720 6460 -2784 -1641 22866 7174 -4845
20710 -4845 14248 25557 19332 -11131 -30806 -47166 -43170 -25945 9875 30537 30277 36307 27391
20697 27391 -5257 17577 26738 12757 5027 -292 -35733 -30416 -43583 -57847 -52112 -53858 -42811
20684 -42811 -39970 -41002 -47610 -37892 -27079 -19375 -35399 -30478 -27360 -20574 -20991 -13859 -10010 -1762
20670 -1762 6490 16358 14342 15051 25364 20304 3498 -18602 -44654 -35865 -29769 -36125 -25473 -24338
20656 -24338 -3094 -2212 12754 -10311 -12475 -13739 -8407 -10302 -18176 -26288 -59044 -21105 28855
20643 28855 40729 35973 15849 14615 11596 9463 -4647 -15192 -35522 -14587 2356 23852
20631 23852 27346 25917 25615 10801 4114 -4793 -15172 -18747 -3336 2447 -7349 1288 -13882 -17630
20617 -17630 18643 33806 18654 -21072 -72044 -72832 -60722 -40033 -49664 -39661 -7623 -6578
20605 -6578 -16153 -14537 2765 25979 41439 33551 -14727 -28010 727 109 -2666 -13581 -26158
20592 -26158 -35725 -31578 -13153 -22876 -16273 138 9811 28967 22725 -3369 -2363 184 -20453
20579 -20453 -52487 -46558 -8503 14838 43950 42128 22726 28615 18082 -11787 -11232 -6295 -10389
20566 -10389 -1117 8910 -3211 -33382 -37086 -26038 12955 3357 -20932 -20421 -32008 -36496 -27595
20553 -27595 18811 20533 -1466 -26040 -21454 -54966 -66253 -40532 -16922 2865 -1262 -29356
20541 -29356 -40464 -27367 -47182 -31786 -7553 29196 23901 18065 6623 -5188 -2492 -7167
20529 -7167 -24523 -20356 6268 14390 -16463 -28525 -6945 39199 55948 34042 -15443 -42084
20517 -42084 -40908 -25127 -38123 -65248 -51056 -24628 -28003 -54057 -51257 -18162 11031 -3126
20505 -3126 -1244 51617 57595 16757 6071 20425 39836 68040 58056 24971 21024 11147 1688
20492 1688 18282 5658 16416 21868 40248 36156 -16975 -24732 -17354 -3768 -15800 -2876 28008
20479 28008 70561 71222 16395 -39014 -30676 7557 4708 -13434 -16705 7276 13269 -11516 -15569
20466 -15569 -29735 -27903 -13720 24505 28618 -14350 -35597 -6792 -6324 -22636 -49690 -42983 -33650
20453 -33650 -34091 -20077 -12301 8686 3565 -14237 -4432 -20416 -39481 -7412 5222 31483 24914
20440 24914 -3840 5852 10817 5106 9531 29989 37370 47599 50081 42595 5015 -19937 -24397
20427 -24397 -40019 -70543 -58479 -41782 -20813 -25382 -14579 6664 32962 39794 -4338 -8009
20415 -8009 36873 18789 24182 16836 -19288 -27095 -12666 -43580 -66375 -67781 -58877 -73717 -55626
20402 -55626 -54296 -38637 -8908 -35853 -31579 -47485 -27253 18760 -197 -48570 -51626 -31536
20390 -31536 -42506 -34474 -4871 -17975 -45547 -53799 -43559 -59645 -61642 -53226 -43936 -36833 -40633
20377 -40633 -22948 -20154 -34025 -23754 -47029 -67811 -65577 -29471 3310 13292 -5215 -5855 -12015
20364 -12015 -30000 5642 19018 -734 -16072 -15407 3921 4884 10102 3885 287 -20456 -9415
20351 -9415 -2575 16128 -12412 -6276 13921 8432 -29863 -14077 -5733 -13859 -13361 -35643 -28351
20338 -28351 8204 34696 50628 30545 46510 7226 -11775 -20541 -29404 -34436 -39342 -61424
20326 -61424 -60962 -32882 -23281 -37022 -52742 -48345 -33381 -27118 -15367 753 16781 -10759 -11028
20313 -11028 -14591 -25532 -24332 -40025 -9017 24204 3407 -15380 -27539 -25713 -34193 -49282
20301 -49282 -25129 1931 -21373 -15923 11289 12089 11819 -11015 -5348 14962 22635 38126 37007
20288 37007 28628 15169 1525 -26758 -53547 -38867 -36512 -1278 26508 11953 -21415 -31948
20276 -31948 -23184 -21729 -30923 -12540 -20276 -33184 -27637 -5158 -7198 -23955 -39762 -12573 18976
20263 18976 11161 4719 6003 -6705 -7713 -9561 12078 45060 18095 -3877 26379 26881 -9731
20250 -9731 -35579 -34245 -36656 -19073 -20597 -13816 -52047 -61462 -34479 -36491 -24807 -40420 -37200
20237 -37200 -14582 16698 7019 5861 -5270 -22382 -23485 -20673 -23374 5490 11805 -39667 -30718
20224 -30718 -10517 301 29386 20208 2581 -5182 -20401 -26520 -20285 1849 31627 29144 29952
20211 29952 17538 -13386 -19747 -36626 -59342 -61143 -41471 -16326 2199 25262 33698 17240
20199 17240 -7300 -30522 -47376 -36855 -15506 -24311 -28055 20867 39429 13119 -6490 16814
20187 16814 15029 -18372 -46067 -34706 -17821 -19616 -19593 8321 5265 -32877 -47340 -40666 -35852
20174 -35852 -39498 -6789 144 1866 24306 33991 51636 55459 27666 -6168 -43311 -40417 -5062
20161 -5062 -7078 -10747 -20407 -805 19780 20310 52506 62532 32231 8938 20086 6416 -13742
20148 -13742 15 -25930 -48278 -62100 -87480 -79644 -69991 -67788 -67844 -58319 -50046 -49977 -48554 -20188
20134 -20188 -15104 -30491 -34088 -28673 -23275 -11375 -27439 9936 32433 15902 11090 18390 8190
20121 8190 -3219 5080 -6132 -60626 -68816 -70705 -39232 -31324 -37254 -17688 -10106 -13314 -974
20108 -974 4576 27148 35194 16752 31595 51155 41498 23471 -6907 -43773 -30939 -30755 -44945
20095 -44945 -40803 -34596 -27207 -6238 -7965 -26831 -35095 -10700 19820 10748 -12503 -39103 -13683
20082 -13683 21354 39950 19428 57 -18369 -26983 -17470 583 22441 7983 -13119 -16412
20070 -16412 -37291 -57084 -29112 15671 -3312 4778 41422 59570 50343 21079 27894 23629
20058 23629 26405 47681 27539 -101 -5173 -18562 -30935 -22922 -7607 14467 4473 0 -6685
20045 -6685 -201 -898 -17303 -3222 -21781 -16239 -1508 -14864 -5055 -22100 -19707 -16079 -11860
20032 -11860 -30613 -29555 -16147 -10901 10283 37011 40408 7714 3968 -3688 -4412 11471 42530
20019 42530 38929 12598 29412 8403 -30365 -36283 -46421 -18908 -21601 -1078 698 -26021
20007 -26021 -37101 -33811 10041 40352 33917 38877 62666 62803 35730 29243 25306 21716 7183
19994 7183 18001 32957 21231 -6876 -16188 -7974 -10489 13602 34901 24723 -7943 -40256
19982 -40256 -49066 -46424 -17373 5160 8575 4927 8432 28229 26436 17818 -5368 -10597 -3160
19969 -3160 -9795 -2480 6767 17655 -9460 -12176 14283 -226 1001 3940 13082 14846 -4578
19956 -4578 -5411 17990 13361 -15440 -35666 -38861 -27356 -13327 -3638 13357 39267 59284 76905
19943 76905 55478 45265 33145 17912 18122 4628 26366 9338 -17422 -31899 -28124 -9879
19931 -9879 -1648 2615 -16699 -21342 11258 24058 -780 -25056 -22774 4539 -9109 -18068 -28409
19918 -28409 -38350 -55881 -43313 -26760 -15897 -18224 -19957 -1172 20350 47493 60579 21374
19906 21374 -19666 -29988 4307 7595 13788 7207 -1182 -30825 -26615 -14526 -16538 -25642 -5861
19893 -5861 33736 25388 13054 13239 -2643 -11213 -16713 -27300 -58839 -58349 -32936 -41285 -56216
19880 -56216 -53147 -17889 -28848 -22607 -4890 -6056 -26411 -49533 -48296 -56273 -65244 -37622 -25929
19867 -25929 -37433 855 20379 29515 -9146 -47408 -45939 -65602 -78229 -90149 -59475 -40679
19855 -40679 -53635 -55655 -45485 -44720 -50380 -47684 -32484 -3642 8348 -4348 10460 15901 35550
19842 35550 10554 11964 -9063 -27798 -29658 -32636 -1684 21170 -1974 16269 33014 24570
19830 24570 20580 -4859 -869 -2753 -7121 -37838 -31601 -603 3395 -2691 -16930 -37132 -10717
19817 -10717 -16138 -21949 -12929 -4936 13371 12107 8472 -18752 -28238 -43649 -28296 8324 8711
19804 8711 28071 21221 12797 7660 -11465 -14009 -34721 -63837 -59262 -43373 -31679 -55272 -48115
19791 -48115 -817 6350 126 -3063 -17267 -20733 -8582 4783 -20008 -6318 10688 27245
19779 27245 36980 17228 -21109 -62019 -41430 -10697 -8003 2738 -16455 13557 29495 12093
19767 12093 11028 22291 63740 60319 31339 13788 48708 64495 71130 61366 43500 40873 41162
19754 41162 47631 47620 49870 30594 6129 -4685 6468 -4119 -11733 -1419 14593 11808 -3460
19741 -3460 -4217 -1862 -19926 -38244 -20333 -1815 4298 3804 -5513 -13203 12390 22583 16904 -18266
19727 -18266 -23577 -35623 -27911 -8562 1449 6891 6042 -11450 -19964 -13746 8247 5411 10475
19714 10475 7353 -16511 -4012 9242 30123 46758 73618 76357 42481 31563 14673 16390
19702 16390 33774 6238 -32085 -22522 -26937 -24325 -1882 -1921 19619 27097 10705 -16839 -19770
19689 -19770 -48599 -58713 -29973 -9751 -23384 -1371 10335 38903 41188 9662 -7866 -312
19677 -312 3764 19706 47017 46147 25734 -146 3165 27516 37979 31746 24131 22213 24414 46351
19663 46351 40104 51570 53781 33557 10172 9143 -12329 -19226 11507 40190 24071 1535
19651 1535 -34537 -47066 -26686 -20074 -4999 6574 -20149 -51129 -49963 -20781 -15549 -865
19639 -865 -2346 -2829 8503 5553 3215 31564 -1758 -32255 -18811 -8595 18087 -17528 -34196
19626 -34196 -33352 -31715 -8531 13163 20253 32159 44227 42910 11801 2585 2931 30722 36226
19613 36226 57126 53168 4620 -68 22251 28958 29235 24388 11390 -412 -10956 -13544 -28787
19600 -28787 2351 65109 62765 24382 -3897 -5709 -12431 26554 63314 41033 31023 12258
19588 12258 11217 9959 13573 20462 -107 -26333 -8271 11742 57689 59877 34756 11473 -3025
19575 -3025 -4010 5009 26504 54606 42630 25811 17963 -3053 -4535 27884 12099 -3826 8029
19562 8029 19195 20520 -14008 -11923 -3723 26315 44748 31294 13537 16741 30862 29303 29773
19549 29773 20382 41655 25889 -10670 -10679 -3513 -3431 -17032 -14364 -11512 8495 -9788 -18555 4267
19535 4267 15918 20329 10895 -20359 -27495 -18534 -29370 -38129 -23103 -17679 -15996 23466 38478
19522 38478 10487 -5595 -10233 -1327 26434 28415 30069 48760 47668 36436 8199 -116 27555
19509 27555 29085 -9169 -18524 1250 9370 -19611 -13174 -3709 -6174 -2182 8340 40699 37525
19496 37525 36325 41454 32890 672 714 28345 23741 20819 19599 20995 9364 4370 9850 22599
19482 22599 2329 4206 11118 -1939 -3937 56 -17297 -49148 -75599 -71572 -25986 -2392 12404
19469 12404 -2512 -1752 26858 43501 28494 -8472 -10790 19029 31381 33013 14087 18092 20346
19456 20346 39874 32359 13032 5174 23989 20080 -3860 -38232 -36843 -16496 -22587 -28192 -43806
19443 -43806 -48218 -57119 -66443 -29563 -16028 -30729 -43538 -24483 4101 -747 9129 -8173 -2731
19430 -2731 21056 32263 -6257 -35180 -15172 -5980 -18053 4017 34169 43960 16709 2960
19418 2960 1962 36618 56032 46109 34445 16351 36698 74766 62750 65475 99915 114392 120479
19405 120479 141481 133830 172772 212344 235294 208574 173745 196716 222274 229330 197129 153108
19393 153108 161448 188716 203917 189555 177845 167143 198050 214391 198007 161165 117429 116855
19381 116855 101538 105911 127325 119927 123633 115519 86144 49552 36079 41511 43996 28227 38301
19368 38301 41113 45779 51712 48051 60898 63479 58716 73236 123846 149006 145291 166747 172557
19355 172557 143923 119845 106893 135226 184055 188993 191004 226284 252053 285375 319741 349585
19343 349585 345404 330516 315430 262999 210457 177614 159771 155458 154944 152104 116720 114936 114699
19330 114699 70960 48656 24452 17242 14645 -24360 -35426 -43498 -14403 38304 52784 59136
19318 59136 34238 15044 54968 57622 38621 17252 5853 5228 22042 10585 9503 45839
19306 45839 53479 46883 32890 22805 29096 7707 14988 19064 24950 27709 11104 28458 55511
19293 55511 50312 42642 40220 17515 -3186 -18688 -46418 -20738 6253 22534 26185 37012
19281 37012 42320 1588 -32 27680 17841 19036 22220 35405 37056 35673 69362 57089 32484
19268 32484 46056 27942 6240 -29768 -21958 -13019 -948 12191 8573 259 17440 46544
19256 46544 53351 9985 -22966 -35870 -12398 -4753 32703 35490 36209 28737 39141 -11108 -45223
19243 -45223 -48759 -36904 -20354 -4703 7656 -33409 -25336 7707 35441 43307 57281 43196
19231 43196 49661 20909 3618 -6842 -13592 -466 6666 7954 2366 9017 16812 1979 -37
19218 -37 10454 21504 -11830 -36576 -28376 -45127 -36511 -14206 6995 -10162 9804 29366 30287
19205 30287 6026 -28857 -54534 -39193 -18156 -9286 -1195 -8591 -6020 3519 40344 38740 13215
19192 13215 8575 28317 13267 6944 4708 106 -10459 15693 10109 8354 39502 47536 59785
19179 59785 46794 29305 22821 31303 17503 9624 19059 15108 55889 76587 51091 36749 23508
19166 23508 3151 4582 11927 -2268 5287 58336 72604 62562 48698 23947 1555 4779
19154 4779 1184 -1507 -163 11123 21978 21817 59801 84243 45696 42359 34319 54750 39420
19141 39420 25422 37408 40864 39472 29699 5581 -9835 -26285 2204 -999 -8830 9302 32846
19128 32846 8048 5910 27714 36602 17234 35039 36270 39243 23345 12305 24663 24703 19681
19115 19681 49163 64006 71324 77505 91295 104036 63237 87750 93416 81589 61001 41733
19103 41733 49324 68764 63528 65050 67233 85706 106802 98584 44168 2955 12039 10391 11229
19090 11229 15362 21015 21974 28515 41118 35096 33537 22524 17528 21467 761 -21699 -30448 -9607
19076 -9607 -5494 -7444 21466 36289 20576 17145 -11626 3090 13534 20891 6069 20104 6558
19063 6558 -3675 30006 44126 47252 66098 48634 23002 35835 55137 68908 89584 70845
19051 70845 59846 64338 40563 34829 63274 61973 63119 79598 104624 104631 78428 67589 36741
19038 36741 20333 2773 10260 27699 11138 -24967 -18677 -593 -8055 -26667 -63146 -32917
19026 -32917 14841 47917 25316 15636 45426 78055 83745 81738 77949 72549 35785 34854 28821
19013 28821 11868 43666 74099 57474 51603 40843 77578 68518 56809 64443 77887 97486
19001 97486 86316 59449 68100 63753 66541 74877 73314 72775 89945 112958 95058 105920 124807
18988 124807 118386 104090 90923 90473 90296 91499 94073 113191 127334 111912 109788 121716 135425
18975 135425 143150 169634 169827 149888 168839 186752 190520 170523 147257 118689 139042 139134 145475
18962 145475 147976 166544 171280 182026 177765 200167 218643 223111 221258 233192 231709 211886 197719
18949 197719 214758 259006 328391 358140 344770 334962 368198 409511 439312 434739 462229 496786
18937 496786 521985 565040 600833 663406 700803 755657 822475 875524 947155 1059740 1187754
18926 1187754 1309935 1453990 1626340 1822316 1996665 2224724 2465800 2685859 2894367
18917 2894367 3090109 3314869 3580243 3975314 4506938 5257427 6255097 7529193 9278257
18908 9278257 11840491 15419363 19760052 24506351 30022502 36329478 40921362 40387034
18900 40387034 36890655 32576593 28596753 26881489 28534033 34179196 44045021 54379093
18892 54379093 58647595 56217704 49987026 42410418 35360728 29251027 24320686 20476279
18884 20476279 17540689 15785442 15325885 16012720 17327790 17945142 17130713 15493464 13439564
18875 13439564 11410142 9864858 8824787 8133944 7676693 7481769 7518165 7757196 8090520
18866 8090520 8508239 9136771 10061652 11460436 13767311 17489890 22489009 27102278 29631977
18857 29631977 30314016 30506650 30886077 31344585 31986674 34122609 39364246 48533956 57113216
18848 57113216 60494987 61233909 58415397 52741330 48683946 47565586 49321176 52774950
18840 52774950 52308421 46598356 38996290 30688460 23334633 18110634 14646057 12279246
18832 12279246 10623465 9500053 8912203 8749207 9000665 9327589 9098344 8325414 7302182
18823 7302182 6163777 5161626 4433783 3889424 3488786 3150272 2869248 2653258 2457666
18814 2457666 2256899 2067506 1900714 1714710 1557404 1476299 1430900 1371678 1343995 1301805
18804 1301805 1261838 1186305 1100167 1017545 959861 930773 933174 920982 891699 851449 811060
18793 811060 787002 759520 723371 706140 678545 630704 615262 586659 541109 483844 439650
18782 439650 414939 400578 360352 333368 331619 349558 317825 314319 323700 322580 317318 319229 313719
18769 313719 316900 294668 317599 361760 427842 489107 467410 403700 340116 297881 303440 257907
18757 257907 235827 231686 248325 271728 300538 277039 267070 298827 295597 281082 279346 277809
18745 277809 283888 278938 254498 230379 193529 207406 229687 233383 199646 190986 193734 160926
18733 160926 134706 109698 109810 125164 166214 175800 167715 162634 186315 215826 226709 231545 234927
18720 234927 218056 204013 178882 168036 180634 170025 178149 189281 195997 207689 197288 201856
18708 201856 201235 184390 185289 221763 230059 233082 210373 180320 147186 117739 114761 139438 141217
18695 141217 139849 123419 95917 93556 91813 87690 103375 101642 93083 73481 66395 67642 84024
18682 84024 78043 96771 101687 111578 131344 157259 144033 125718 119354 114416 122491 124248 134359
18669 134359 121937 153039 190095 242641 256131 224468 225851 247591 243375 240277 217143 169275
18657 169275 149226 143635 142317 131908 149133 149406 136280 127391 122604 76805 50669 43723 14528
18644 14528 8754 39173 48405 17268 11034 5230 18591 16292 11068 37997 73653 71250 64668
18631 64668 84655 77836 77885 68146 51891 54196 39126 11720 43589 73996 77885 126467 139427
18618 139427 158003 175969 150587 149889 167093 176797 149827 131231 127879 121059 89149 70236
18606 70236 70155 59622 55336 61228 68329 87664 111536 124686 113710 118106 122745 85875 63210
18593 63210 54705 70042 103308 104751 102732 104648 64765 52945 65780 61035 60183 54694 82890
18580 82890 93121 102048 84595 61220 47661 21465 10305 8228 32772 29644 53514 57402
18568 57402 17773 21461 42250 58846 69290 52603 47816 66521 46679 21748 70792 95216
18556 95216 100074 92509 74160 68296 63131 38160 27225 24321 -3884 -28097 -3560 41371 64663
18543 64663 74806 50107 57136 46906 40646 35317 2559 -9300 56456 49195 31197 24372 27850
18530 27850 37950 52730 41667 15870 -9663 -3239 9445 9673 45323 96511 111565 77123
18518 77123 70786 63524 47289 35436 38187 61392 41091 22139 16048 21096 50314 80017 72373
18505 72373 60626 59646 57503 53670 51571 81566 108357 91713 43664 10420 -42117 -40898 -46038
18492 -46038 -56420 -47537 -47300 -15937 15660 25211 15542 32961 59841 68259 95284 79960 57331
18479 57331 47378 24412 5952 12349 23852 34363 58533 36475 -24159 -17804 19960 42417
18467 42417 42209 52919 44180 45494 29374 37700 84775 84636 73602 53289 46624 68375 90109
18454 90109 101198 49088 21163 35947 21562 2365 10604 61777 63815 14447 12529 34738
18442 34738 22280 22229 45598 58235 64621 79919 111661 125911 90592 82029 92818 121115 175685
18429 175685 183337 148911 141787 145977 140233 149948 175103 158951 134815 109170 85731 63757
18417 63757 67661 98731 128995 128148 110994 148206 193145 170937 146637 149812 172104 177067 191711
18404 191711 210405 227383 257837 273995 280888 298642 327343 364187 401147 406256 400588 405213
18392 405213 406658 421518 446473 476852 507445 540385 584812 615498 651799 663891 683528 687912
18380 687912 714932 774051 853694 963564 1073964 1180033 1246876 1309606 1376856 1478217 1638919
18369 1638919 1868467 2219337 2688301 3374844 4430318 6036347 8015204 9920358 12003546
18360 12003546 14695255 16454266 16110995 15194247 14423244 13867229 14116257 16122196 20291380
18351 20291380 25064946 27467405 26456845 23913417 20790643 17104866 13601369 11108745
18343 11108745 9790880 9442002 9980755 11118021 11746713 11245918 10365102 9378921 8179162
18334 8179162 6923630 5966701 5377420 5020269 4830600 4745006 4727996 4778707 4886663 5115760
18324 5115760 5561762 6347547 7572941 9264460 10986510 12221393 13458390 14828130
18316 14828130 15744291 16520928 18100211 21088601 26147392 33084990 39309844 44807441
18308 44807441 51274820 58951988 65853216 66857372 61618643 54298299 46624642 38863830
18300 38863830 32574314 29315469 29170508 31089097 33004705 33414403 31680334 28452787
18292 28452787 24322867 20066503 16225968 13188252 10965616 9378593 8243144 7451855
18284 7451855 6848831 6397959 6039871 5742792 5518628 5333287 5218181 5220979 5364790 5578635
18274 5578635 5934855 6466467 7306369 8632066 10785451 13976991 17642617 19898895 20320337
18265 20320337 20295734 20405139 21088394 23488165 28674084 35269903 40204222 43077690 43344221
18256 43344221 42464275 41769501 39787865 34777048 29242055 24449053 19921676 15792038
18248 15792038 12752198 10945737 10093245 9927956 9764745 9039578 8099305 7202267 6270027
18239 6270027 5349795 4614114 4111090 3772486 3484530 3240160 3003133 2817436 2671921
18230 2671921 2548408 2414162 2283467 2178510 2091487 2033031 2003051 2060108 2107301 2181845
18220 2181845 2220253 2267655 2320422 2403424 2576865 2826228 3183977 3658509 4349299 5359173
18210 5359173 6865285 9208279 12460104 15035651 15545430 15222091 14879578 14513401 14346242
18201 14346242 15338064 18357860 23647321 28675227 29396099 27403896 25010377 22080427
18193 22080427 18631629 16082064 15411538 16578462 18086875 17657191 15960504 14146230
18185 14146230 12090700 9755708 7649039 6165240 5230431 4610683 4199056 3929149 3775102
18176 3775102 3693435 3728252 3842740 4080631 4488110 5145630 6234066 7881590 9468292
18167 9468292 9813538 9352481 8794768 8145868 7371649 6824034 6729234 7106160 7992587 9551860
18157 9551860 12210783 16062125 20412668 24473424 28752066 32344273 32281905 29659813
18149 29659813 26650765 22995988 18622413 14618847 11586449 9319394 7648769 6494036
18141 6494036 5730376 5249136 5022384 5047040 5361969 6072049 6967651 7240829 6792753 6197273
18131 6197273 5546482 4777722 4005378 3473617 3125307 2902766 2719780 2642209 2684209 2756626
18121 2756626 2919588 3170747 3505430 4029954 4825663 6070137 7516760 8361366 8812887
18112 8812887 9495907 10558386 12274462 15531688 21943858 34034809 50664567 55241139
18104 55241139 49151510 43929418 38282260 29413634 20692532 15457493 12787210 10947559
18096 10947559 9317129 8018342 6902756 5788758 4768841 3974798 3369716 2938588
18088 2938588 2620547 2409133 2192665 1998458 1831717 1684516 1507738 1352595 1218087
18079 1218087 1115494 1070791 1028023 967771 901105 836969 794800 734419 710245 675410 650670
18068 650670 613480 577234 558300 544132 504112 435778 406102 423044 386500 375476 354999
18057 354999 349384 317843 292880 283603 261438 230707 213415 223430 228038 225933 233513 230166 240036
18044 240036 245588 248769 246303 241648 236202 230606 224615 189769 178974 160701 134884 126780 119498
18031 119498 167281 214075 233402 189402 178381 200399 184869 176015 157253 123025 111174 117633
18019 117633 142453 189114 190011 203323 181935 161905 175374 173264 169211 159306 125699 131537 135807
18006 135807 134244 141646 144750 150008 137893 131218 133619 113968 67723 63854 65678 45161 47029
17993 47029 75546 82067 76313 67255 84911 99513 121501 116455 100022 98412 86813 89137 90851
17980 90851 101341 131494 158116 149322 112252 97366 111515 108490 117384 107331 79776 66149
17968 66149 90822 93172 89832 87477 105670 107778 87426 96802 112672 115345 96493 110152 108839
17955 108839 80472 62275 4823 -10204 -15049 -4150 -4850 34547 40600 4290 1845 28599
17943 28599 44352 51022 63582 93683 81723 54380 33416 14456 20691 75833 75937 42327
17931 42327 18162 5256 34902 83761 86798 95088 85039 78164 81121 73175 82786 107615 117281
17918 117281 93931 59818 56490 42580 45863 31618 27288 30842 28609 33524 36496 4753 -1113
17905 -1113 22486 31665 34695 17107 -4573 5075 28579 61700 73909 60506 67239 64709 24468
17892 24468 9315 -23304 -33941 -31108 -28979 -35204 -20093 445 16040 42899 40592 38153 40445
17879 40445 30712 26873 28694 23591 43444 46537 46616 30481 6778 4850 -8707 -11768 22135 23344
17865 23344 1682 9674 -3449 -10373 -15735 -36435 -43839 -25455 -15099 -23489 -12454 14533 -9663
17852 -9663 -10021 14779 51920 67390 99506 137400 163331 134255 94495 72818 60469 109183
17840 109183 156753 162654 208155 239572 166047 129948 149405 106236 85601 89852 87885 76283
17828 76283 71704 89902 80674 51756 20260 18943 48761 75525 76207 79237 96886 68879 22907
17815 22907 22853 10723 -11382 -24936 -19072 23566 27152 40021 17869 33737 66384 112574 169113
17802 169113 209208 236298 215999 210188 230179 243892 254351 265256 243115 245191 285817 299378
17790 299378 283232 230236 198718 213738 224286 198818 205674 215622 185546 150815 121189 122851
17778 122851 106750 106242 95322 74224 65296 53509 47204 52147 81237 80737 71232 60788 70002
17765 70002 48893 55855 49508 19058 9451 6727 28302 70415 54300 76571 138688 130483 111129
17752 111129 106253 99672 77712 94560 106760 93233 69056 76450 94581 101601 105930 116011
17740 116011 118095 140364 162446 126391 111977 106843 87814 78911 48836 34751 45613 43019
17728 43019 10474 11309 6401 -5140 -14491 -27499 -28869 -19907 -20363 -20352 21081 40143 31771 13384
17714 13384 9461 31010 8127 2344 -10703 -2080 -4833 3413 -9694 7418 18280 26356 14366
17701 14366 14086 27142 45880 78687 97152 98736 96360 82078 89911 87601 60536 33212 26823
17688 26823 30998 62680 53883 22774 -8135 -16570 7891 21237 -10667 -4179 -7112 8165 2935
17675 2935 15661 53485 30350 41803 42850 -2660 -14198 30739 38270 36554 43985 68181 76273
17662 76273 51082 46428 52548 57504 69255 92925 127582 147513 123976 55396 36874 61452
17650 61452 85852 120375 135234 140551 132114 127473 102952 97018 66815 50716 84526 122682
17638 122682 117951 121968 139635 99571 87625 70676 49033 36203 15472 22054 47956 56549
17626 56549 58183 30432 25576 21525 -1061 1813 -21336 -15439 -20760 -35738 -30875 -12400 20575
17613 20575 36103 47059 53073 91388 90128 77457 69898 41653 71233 65541 93558 116750
17601 116750 86913 63630 61772 51181 20731 30324 56349 37464 29934 25867 14546 -5873
17589 -5873 1025 35970 4146 291 -18588 -23035 -23104 -29638 -17228 641 8441 -5212 -22782
17576 -22782 -17889 5630 16083 13385 39 -3194 -3089 -7306 -8350 -33175 -29390 -33858 -7876
17563 -7876 6768 2684 4717 -16117 21958 37499 7762 -9267 -8667 -22387 -17269 -21000 -29486
17550 -29486 -31195 -25796 -2204 -3096 -10542 -14820 -4832 10355 -14771 -26348 -23096 -38019 -45260
17537 -45260 -18770 -18065 -14734 1188 -6059 -26627 -55438 -15443 11257 24911 10961 -25406
17525 -25406 -43781 -20347 5787 2529 -26828 -33955 -27284 -46713 -64185 -81529 -32271 -4405
17513 -4405 -20332 -13236 16192 17064 16508 22802 28685 22769 15827 -19959 -15415 8008 38396 22195
17499 22195 13215 -821 11146 7886 6631 4845 -809 3114 4450 -25385 -28318 -21696 14624
17486 14624 20349 -9394 -35967 -38088 -22546 -17002 -39978 -64567 -37894 -15766 -17213 7220
17474 7220 -14748 -18334 -5173 -2292 -1404 17001 23148 40302 36096 15446 18073 7655 -1006
17461 -1006 -4570 -2610 -28931 -39248 -719 13795 11545 33763 55857 40428 1447 -403 -1697
17448 -1697 -15802 -19689 -12382 -10310 -2116 11905 37862 84196 164287 223245 222711 191151 177926
17435 177926 176469 114134 59375 30767 23936 24393 64886 74791 36569 11010 -7167 -9336 15155
17422 15155 28615 42219 35764 7951 -7432 -12185 15518 -8435 -28478 -30316 -26291 -11439
17410 -11439 -40603 -37689 -29817 -15989 -39387 -60321 -66987 -57040 -33250 -57670 -26601 12625
17398 12625 6853 -2413 10029 10570 9961 4441 -9070 -24683 -25141 -19863 -7858 -2461 3334 10954
17384 10954 14815 30188 73209 105195 83960 67940 103564 130761 119632 143993 199355 266099
17372 266099 357504 428663 474076 492763 458861 394174 308287 235225 197556 148315 108762
17361 108762 131698 87721 42207 68279 78069 70739 58218 43560 37683 937 -29626 -14317
17349 -14317 1222 6659 1949 43 604 -6357 -34376 -19881 -10427 -4056 10001 -6579 -16321
17336 -16321 -27088 -20280 4889 30499 34395 64371 59318 12356 -14828 -5810 -13536 -20655 -16576
17323 -16576 910 9227 -4333 -13094 -12103 -24444 -18300 -23267 -2059 -3149 21110 7170 344
17310 344 -1804 -530 -1952 -1146 4650 -2677 -22489 -18218 -12000 -32176 -38654 -55854 -16364 -5566
17296 -5566 -15733 -1845 5367 -4740 -23301 -1431 -4122 15265 12452 8297 14405 11351 11881
17283 11881 -4750 -4750 -13799 -31812 -46252 -27734 -36300 -23766 -9820 -17993 -16313 26261 39324
17270 39324 3197 -20628 -36073 -55801 -60723 -59237 -31951 -40551 -45531 -45630 -47364 -27451 -26559 -3501
17256 -3501 31088 17737 -8259 -8181 -30003 -39472 -56621 -44855 -22069 -11855 -23074 -29072 -15279
17243 -15279 -20832 -33836 -34725 -50379 -84354 -110136 -101804 -76922 -35957 -19318 -1138 -23300
17231 -23300 -28777 -32261 -16657 4950 33822 16981 14235 -21147 -7906 17508 13845 5659 -5244
17218 -5244 -3092 5427 -10892 -23161 -7244 37973 36222 38028 66824 45681 20814 -15916 -33766
17205 -33766 12454 32244 43695 31247 4647 -7313 -10945 -2836 16260 15780 -11137 -34901
17193 -34901 -45018 -32332 -55586 -70332 -48127 -21167 -22282 -30216 -20341 -7373 26742 11565
17181 11565 -3065 -35748 -24268 19492 29639 20672 483 -23314 -23666 7092 21675 -7165
17169 -7165 -3574 -30541 -24221 -43751 -40330 -24237 -27037 -32395 -33922 5021 34499 28678 4526
17156 4526 -470 5448 -9763 -14238 18631 26266 34 -31770 -28099 -26228 -26256 -41678 -42909 -44032
17142 -44032 -54073 -35371 -36549 -32973 -50689 -72873 -83437 -59699 -15860 -10099 -5909 5466
17130 5466 8950 -9750 -632 4845 10082 -7972 -29511 -6358 382 -23967 -62213 -109334 -72299
17117 -72299 -62791 -51250 -30914 -27537 -8952 -5995 12424 17543 -11816 -21670 -3096 17452 20333
17104 20333 7566 16228 30787 60391 66889 48125 24173 19579 20349 8212 15448 363 -25634
17091 -25634 -17927 1591 -15865 -45982 -27561 -12893 -5463 2140 9565 39337 61297 47571
17079 47571 15812 14621 36771 47996 65083 92532 80486 83099 74332 85590 117306 133734
17067 133734 151528 172361 170712 159929 158008 175686 219189 304144 440870 668529 898737
17056 898737 1149573 1433558 1634565 1637288 1552882 1405248 1148066 836158 610202 435648
17046 435648 320468 239933 202352 175116 136181 122234 124522 127815 110392 94176 74063 63265
17034 63265 46522 44392 56871 45491 16137 23702 39315 52331 42216 44602 55183 58462
17022 58462 35608 30007 26252 7682 -32654 -38238 -51634 -25751 -30237 -52224 -68952 -84420
17010 -84420 -82505 -88661 -94403 -107686 -100329 -62475 -64436 -72170 -35480 -33108 -39086 -31331 -2284
16997 -2284 34964 -13300 -53653 -20998 -9528 -23619 -28377 -11559 -28412 -22627 989 6726
16985 6726 23726 -592 -21842 -42955 -6042 7650 6097 5524 14770 14968 -29349 -29449 -18993
16972 -18993 -18134 2469 21470 35676 43615 28558 -10194 -45851 -27541 516 22904 44162
16960 44162 50026 27084 43263 65058 91631 103656 99177 111827 131946 138193 83791 56228
16948 56228 79629 81830 81489 61673 43768 3593 -5041 -5355 44782 47030 26514 11109 1968
16935 1968 16436 15279 5885 -4337 -15048 -28717 -56836 -57490 -38691 -33428 -17906 2591 18415
16922 18415 2639 -21378 -5924 5184 -17774 3388 27026 40901 51229 62416 67416 73507
16910 73507 55181 41729 66211 88265 78617 59237 71806 75995 64635 17953 38140 93251
16898 93251 81917 42591 71216 82597 82762 75390 44805 59940 107571 165902 155395 155897 160334
16885 160334 145625 128508 120590 107323 100926 87986 122056 128798 144662 174455 194418 196036
16873 196036 189699 188354 200465 193995 186187 185828 221253 265474 283585 296463 319699 348847 399654
16860 399654 412940 441142 476973 520759 530985 550088 625000 702275 806599 928752 1069072
16849 1069072 1219295 1413751 1601659 1756861 1909517 2015796 2171078 2375005 2586221
16840 2586221 2850850 3165452 3537747 4021170 4624971 5327412 6152874 7234100 8659369
16831 8659369 10545296 13177225 17050990 23008917 32076124 44376914 58430779 73009783
16823 73009783 86588077 95243869 95921251 88589678 77106873 64192660 50764972 39046584
16815 39046584 30344866 24137959 19651235 16352470 13891464 12000565 10485498 9277191
16807 9277191 8287930 7449353 6707354 6073944 5510671 4990367 4518904 4148547 3826705
16798 3826705 3552542 3341235 3155248 2917045 2677422 2470631 2303706 2115089 1933352
16789 1933352 1751370 1597841 1480557 1366255 1274072 1174046 1104231 1050580 999800 949025
16779 949025 915718 877988 791354 717896 658167 633782 616136 612101 588577 545979 504599 478135
16767 478135 447949 414547 416954 429293 417039 414762 377088 338948 325355 308310 281535 252538
16755 252538 253322 259288 266286 262821 271916 294037 265777 241138 226322 226383 189647 169761 170404 168082
16741 168082 163477 159783 133464 125766 104422 118703 124687 113094 126855 133415 152715 164094
16729 164094 159614 154144 136686 133940 118306 113810 105601 113066 120957 112403 117389 103842 95740
16716 95740 104147 105587 120549 101440 100255 118940 105980 115566 114932 116548 118687 125150 105422
16703 105422 93596 70256 77731 99976 103063 110455 109429 93595 105924 79258 87127 78397 71950
16690 71950 73299 56273 40954 46792 28333 38097 34746 31796 32795 73487 72859 52124 30784
16677 30784 38110 49996 48007 29310 40382 7003 -1285 31976 35685 26554 48393 51792 78010
16664 78010 97698 79743 71935 55526 57557 51286 48711 44798 53416 46365 57730 68507 72904
16651 72904 77425 63093 64495 60989 57287 88912 99267 55351 45928 47952 54035 62406 101223
16638 101223 106472 104247 94292 72458 95274 102416 118556 143429 133733 96240 64478 56511 42077
16625 42077 57358 40070 43585 46086 15002 -1405 -6815 -13637 -37625 -38750 -23655 -28764 -15772
16612 -15772 18348 48984 40051 39898 47299 48942 68296 50739 22726 11013 5054 -7493 -9367
16599 -9367 3216 20146 21564 24079 4993 -8034 -2044 9447 -1255 -17622 -17224 -26733 -11759
16586 -11759 16516 17757 4363 -4481 -20216 -17547 -14555 1294 14389 37911 18949 -16107
16574 -16107 -2600 26721 38521 12302 4949 9592 -3259 -13762 12711 31161 33537 55887
16562 55887 58941 65141 5504 -14740 10206 31302 29131 -11449 -26052 -3313 18532 45040
16550 45040 68499 64531 68005 44543 57934 40383 50511 51416 30934 17785 12498 -511 2748
16537 2748 -1355 11260 10632 -25546 -41897 -27962 -7225 16887 31908 45589 29854 20072 30925
16524 30925 33579 25689 11272 -12719 3833 21773 10404 -12252 -13315 -5889 -32996 -50803
16512 -50803 -24658 -24406 -21848 -6904 -1026 226 13644 -9069 -23332 -14057 6524 -2291 -14328
16499 -14328 35011 39053 18827 34603 21306 -3040 1279 -54 44483 95518 85108 53481
16487 53481 45142 13092 -1029 10847 19184 32041 27145 -8271 -4864 25336 24260 -6005 -22953
16474 -22953 -44146 -28453 -50684 -68449 -51694 -41451 -32473 -24433 6711 32391 10673 -925
16462 -925 6982 17655 28370 11967 803 -842 4345 -26191 -28128 -2506 21129 29565 -13429
16449 -13429 -22274 3158 10199 10414 -13302 -24614 -5373 -11835 -37479 -33905 -41003 -47883 -51784
16436 -51784 -49663 -35026 -23194 12585 24907 11389 4291 11297 36433 21057 2794 -12704
16424 -12704 -16380 -22097 -20119 -5233 -27670 -17553 -9556 3582 -32920 -48629 -31434 -15742
16412 -15742 -32884 -34627 -35 25651 13624 8421 24518 46558 54465 40264 16873 -12606
16400 -12606 7390 22614 13154 20298 14166 -16110 -8379 1466 22568 10802 1075 -10430 -15604
16387 -15604 9169 4116 -31518 -28219 -23741 -41606 -38196 -30233 -20883 9932 15265 8659 -940
16374 -940 -5358 -23669 1628 919 19299 5791 -13105 -5887 -18296 -32577 -17945 -19885 -16048
16361 -16048 -61164 -52749 -21443 -2298 9698 1741 -38517 -32716 18527 36600 11402 -2384
16349 -2384 10599 24005 17067 2456 -13842 -2938 -9001 -2609 20399 21624 13754 6849 -10213
16336 -10213 2383 -23240 -46594 -10856 -6148 -34199 -42080 -22537 -25594 -12454 -19578 -31642
16324 -31642 -16733 20023 22898 9935 6598 44906 75823 77717 51541 6811 8006 1407 -3291
16311 -3291 -3025 18650 -39 -4646 156 8198 -5416 -13712 -4661 -5763 -30793 -31117 -16734 39141
16297 39141 35467 24134 31834 20892 5644 4978 10781 22561 -5061 -26588 -26469 -23377 3603
16284 3603 12014 4489 19688 30532 18216 20954 59558 61703 67490 88458 136919 181989 236048
16271 236048 281891 365568 433317 482640 487515 469181 402018 347084 280252 195189 135231 111996
16259 111996 114933 115314 103939 55089 34538 22031 27997 21497 24474 -1317 -22848 -4719 23439
16246 23439 10797 -588 -32645 -38869 -22644 -3342 9020 24236 -15215 -39524 249 5497
16234 5497 -4516 2191 -3483 -22381 -9370 -6119 -23970 -12700 15394 -2152 -20977 -18110 -25554
16221 -25554 -40084 -48904 -46466 -48898 -46505 -41137 -50090 -32715 -37799 -17685 1311 -7122 -25778
16208 -25778 -29014 -47110 -51586 -33844 18605 54358 57021 75094 60041 44101 5461 -15717
16196 -15717 -55062 -61192 -29675 -10430 -21815 -9992 13406 15934 6423 358 20925 8257
16184 8257 -20482 -29617 -32500 -6028 -2231 -18210 -23013 -44177 -34417 -25519 -16577 4959 13731
16171 13731 17511 27424 21459 13909 9709 5358 -171 -13919 6067 -11344 9891 23895 17587
16158 17587 20138 -313 5423 -28542 -19592 -28893 -33175 -39005 -41139 -46026 -28022 8218 -9990
16145 -9990 -15209 12011 39580 29492 -5602 -11897 -17233 -10683 -13817 -35869 -29963 -29116 -45870
16132 -45870 -42970 -52111 -27236 -12119 -24106 -35273 -31061 -18607 1358 -24122 -24758 -15058 -32310
16119 -32310 -17091 2144 14 -3105 15064 -3363 731 -7560 12280 27206 32744 21932 -26312
16106 -26312 -23511 -9583 10786 30024 21765 -15959 -27251 -20022 -52853 -25901 6640 16983
16094 16983 10279 20326 38453 24414 9124 8095 1756 19250 8746 -24 16211 23742 18335
16081 18335 13841 23758 -7336 -15029 -8641 -7129 947 9496 36387 32389 2557 -54931 -84385
16068 -84385 -52292 -54454 -69985 -53606 -32089 -10005 2653 1439 -15783 -42429 -9811 8891
16056 8891 -6239 -16404 12570 11314 -9954 -18101 -9749 -32367 -71976 -60049 -25795 -9733
16044 -9733 3936 28474 36571 14296 -3553 -3682 -13674 -24893 -19649 -23187 -26965 -41904 -24153
16031 -24153 -8283 -19563 -16692 -1883 -32431 -36001 -20429 -18942 -30398 -39540 -40226 -25675 -45213
16018 -45213 -13946 -2516 -30696 -4987 -44647 -64627 -29638 -43702 -38830 -38240 -26907 -22364
16006 -22364 5858 1533 -20438 -35596 -10961 4429 5358 16110 19708 10368 33833 51748 32637
15993 32637 2949 -29211 -20880 -26133 -76370 -40387 -1668 -13238 -10178 -9754 -22556 -17814 -6765
15980 -6765 14712 10288 31419 32945 26655 5017 -1292 29528 23795 27786 -1972 -27411 -47611
15967 -47611 -54000 -47170 -38765 -3254 -209 -21413 -11718 910 -39083 -51554 -57068 -62998 -43227
15954 -43227 -12870 -10662 166 857 -21840 -34031 -16158 -35980 -40228 -22740 -9293 -10020 -24832
15941 -24832 -19060 -16792 13324 -1969 -16219 -18281 -42643 -79772 -82905 -76026 -81856 -51029 -26530
15928 -26530 -29173 -28821 -21462 -25993 -35852 -3807 30085 36817 45306 44766 41446 348 -30160 -170
15914 -170 16330 5046 -22523 -33745 -57715 -42938 -44453 -55545 -63743 -72603 -37193 -29043 -43786
15901 -43786 -46352 -62708 -68814 -64059 -54398 -23920 -6937 -10724 -6088 29771 45476 37263 41504
15888 41504 23258 7580 -11661 -38251 -40005 -41312 -48755 -57852 -32765 22685 18572 -7960 -13477
15875 -13477 -14266 -4193 -1139 17953 16366 -12890 18326 37525 33029 1268 10245 4787 -12597
15862 -12597 -43642 -43664 -47185 -62838 -17425 32890 25383 4039 25575 23863 -268 -25646 -23574
15849 -23574 -20204 739 7629 9007 7951 15530 9224 -1626 -20949 -20957 -847 -2253 -4167 4152
15835 4152 -21577 -20279 -5986 -41981 -46697 -36118 -32594 -27946 -36109 -41231 -12032 -9126 -5888
15822 -5888 8882 26447 47173 41186 20397 -4689 -22509 -20763 -33472 -21859 -6251 -36816
15810 -36816 -55152 -33637 958 -13021 -4426 -8456 -29351 -21366 -18375 18272 25347 3586 1202
15797 1202 28499 41351 30034 21152 -2889 -37006 -40974 -14299 -18420 -40889 -18954 -256
15785 -256 -6512 -1908 2605 -19970 -44906 -34359 -21226 -30122 -19727 -51504 -66502 -80318 -71760
15772 -71760 -44524 -25318 -19935 -21780 14069 28033 9854 6146 29125 40910 14201 -8335
15760 -8335 -14090 -36979 -28612 -31394 -13447 -2407 -756 13452 33645 3220 -26401 -37547 -35633
15747 -35633 -25161 -30654 -26370 6 19616 13645 -5145 17896 44922 33899 10222 5934
15735 5934 26941 30362 42321 42576 36782 35907 16802 -16846 -23713 29 15783 10259 9160 28818
15721 28818 53628 46661 -9891 -28412 -47845 -38205 -49812 -51364 -60056 -60856 -45499 -19947 -9777
15708 -9777 -48466 -70597 -24874 1524 -10369 -21453 -4722 23435 21895 9164 8185 -9995
15696 -9995 -26480 -70818 -98961 -89037 -65267 -67440 -79907 -51299 -33430 -10685 -11971 -24958
15684 -24958 -13935 15123 2875 26659 31138 10831 -1249 10227 -18643 -37833 -24619 -23980
15672 -23980 -10475 23442 -1536 -37606 -31763 -46467 -46726 -17858 3010 -14182 -44536 -42380
15660 -42380 -42959 -37329 -18391 -1434 12822 13178 16611 16359 4275 -11810 -12751 -47280 -51113 -47547
15646 -47547 -32711 -36312 -28681 -4914 1256 -12183 -5207 -3146 8803 19144 23450 39983 26600
15633 26600 214 -25028 -32365 -24947 -22655 -19041 -28660 -46365 -45493 -35209 -38054 -46963 -31179
15620 -31179 -32706 -4405 37021 37009 10721 -4637 -24789 -43322 -65227 -63222 -62356 -47488 -24945
15607 -24945 -18970 -42546 -27254 21709 3471 -4797 -20870 -11034 -3877 15073 17593 14801 -1406
15594 -1406 -7433 -22685 -23153 -5039 -11822 -23291 -14638 -19974 7072 25955 -19838 -25759 11841
15581 11841 21964 30191 20152 30224 41126 34340 11990 -530 18885 43826 39779 14912
15569 14912 17589 24967 14916 31839 32335 3640 -8129 -3628 15839 30026 41601 18872 -38221
15556 -38221 -37331 -27493 -15640 11279 14117 -7688 -6379 -31361 -56035 -55989 -55500 -54937 -28615 -14541
15542 -14541 -11115 -14873 -28615 -53114 -81303 -68878 -40498 -24924 -33056 -82381 -84081 -63666
15530 -63666 -60544 -78172 -81408 -24529 -2757 -15953 -46294 -68648 -61555 -29324 -12488 1341
15518 1341 -2134 -14342 4840 26684 6423 -4194 2566 -26497 -40509 -8021 -4037 -15149
15506 -15149 -42231 -18827 7667 -17050 -12139 5512 10146 28306 28174 7618 -7812 -35595
15494 -35595 -25157 -17352 -34327 -60490 -44307 -28053 -12554 3960 13340 -11516 -15015 2255
15482 2255 -13975 -7686 10905 -7171 -54531 -48767 -41647 -21205 -35750 -47822 -25488 -20339 -29459
15469 -29459 -22729 -12423 -21220 -7764 -4626 -45680 -42634 -49395 -54749 -45159 -33155 -16433 14656
15456 14656 -11563 -37309 -28714 -12033 -5970 -19957 -13815 -24483 -36737 -11450 10932 3281
15444 3281 -25457 -15488 -2802 -28768 -35792 -14438 -34136 -35928 -14790 -12805 4930 1061 -10389
15431 -10389 -7865 16114 6732 -32658 -41777 -32823 -57252 -37473 -26673 -64266 -80079 -72692 -87667
15418 -87667 -63525 -45960 -19556 -7811 -10747 -52766 -59932 -29336 -8683 -9355 -23116 -39658
15406 -39658 -59598 -65881 -59975 -54416 -56617 -30691 -28575 -46973 -48362 -31014 -31313 -42094 -29447
15393 -29447 -24143 -45265 -26788 -19224 -26542 -32477 -21164 -26917 -32377 -27236 -25377 -28671 -40312
15380 -40312 -29373 -43149 -41616 -27932 -1183 8684 -2701 -22579 -221 22760 30689 1158
15368 1158 -17052 4967 -16279 -6730 -7106 -26616 -38847 -19414 -20870 -27513 -38086 -28390 -5409
15355 -5409 5142 16558 22 -25549 -45877 -41484 -45869 -60903 -55241 -58950 -63065 -76685 -45022
15342 -45022 -35929 -13608 -19485 -26788 -5758 3237 -9354 6213 -12522 -53974 -45578 -65379 -79554
15329 -79554 -54572 -15614 -32519 -18569 -22000 -1546 29470 33428 15549 8042 -8654 -1194
15317 -1194 -5154 -18135 4848 40730 41884 27598 11815 17415 26504 36098 19960 -8460 13945
15304 13945 24020 21202 9528 12077 13713 -10659 -24742 -36077 -38894 -26676 -32318 -41783 -37278
15291 -37278 -30618 -38679 -46465 -50084 -32064 -28517 -16956 -438 -2740 -21376 -19128 -4501 820
15278 820 25976 47644 13968 -7923 -35063 -15862 -16248 7240 1871 -5863 -17908 -24770 -5451
15265 -5451 -6164 -18831 -9774 -5880 -35249 -22220 -10704 -23381 -38737 -29342 -13753 -39983 -26857
15252 -26857 6529 8791 -594 27143 34081 15281 13264 15999 31639 17257 -4984 3111 10614
15239 10614 18282 -8036 -13771 -36738 -40599 -44839 -46907 -29533 -22211 -17059 4620 -9693 -15931
15226 -15931 -10170 -25222 1414 30950 29298 46323 44260 33746 17408 12519 7119 14485 11654
15213 11654 32219 29011 17215 8209 -7443 -33800 -35203 3257 661 4350 -23866 -68772 -41564
15200 -41564 -12108 -12229 2527 25435 35779 65661 74809 15881 -7692 -12067 -7851 -9063 -5970
15187 -5970 -2465 4083 -13118 -29599 -34704 -34092 -41834 -34408 -23210 -54773 -72885 -66772 -56369
15174 -56369 -48477 -12273 4917 -14222 -17830 -707 -4429 -15031 -20053 -45934 -49176 -25356 -26776
15161 -26776 -13242 -1179 11286 -4263 11732 -6039 -41199 -29010 -4383 24988 -11539 -22240
15149 -22240 -24340 -42298 -38903 -35231 1113 33793 40266 13065 -22655 -52147 -51183 -34615 -13861
15136 -13861 -13579 -215 -5056 -14986 -37578 -19474 -8178 -44252 -50886 -75885 -48257 2932 15099
15123 15099 7887 -17593 -14375 -5541 -15627 -17130 -11158 -11884 -19104 -40347 1691 20035 -3049
15110 -3049 -27213 -36989 -21214 -5815 10571 17370 -1448 -268 -5895 -24612 -38227 -33780 -15120
15097 -15120 12174 26788 22338 -18024 -5919 46566 42801 22950 15068 2355 12504 23835
15085 23835 3741 14553 28065 33294 40185 4251 -2152 -11 24726 35725 55456 25708
15073 25708 -20386 -20216 32336 48875 14705 -5848 -15968 -16035 -33803 -75670 -51860 -16358 -421
15060 -421 10197 22416 19053 12468 21269 2674 -13710 -28284 -17547 -7803 7948 29846 12947
15047 12947 29771 18816 10212 18256 13840 14985 -1795 11091 27665 23398 14144 12907 12966 1258
15033 1258 -23011 15578 22489 1004 -25809 -20507 -5786 22947 30318 28073 30313 27539 20294
15020 20294 22654 31266 47370 61556 32659 -34298 -76641 -60249 -33740 -19159 -20822 -30303
15008 -30303 -32711 -17406 4882 1200 11644 -3301 -14302 -6016 131 55 23683 43784 66280
14995 66280 31806 12541 7687 5609 44965 60531 71565 56211 28121 8925 4507 2706
14983 2706 21128 13412 15452 41805 56087 55890 64862 58416 42512 38927 29117 11110 5585 -3003
14969 -3003 -7817 -16451 -37166 -28459 12992 24817 25748 16268 20071 13784 -14068 -12619 28498 49286
14955 49286 39813 20317 24803 22552 29223 14369 25572 24600 40189 23515 31291 25535 470
14942 470 6252 13276 29907 27858 1542 -4002 1088 17652 43942 59886 12013 -2458 -1536
14929 -1536 -11706 3826 56869 64683 21574 6644 9603 34376 25513 7653 -2652 -2769 20706
14916 20706 2154 -8832 17327 14973 -4731 -2840 47469 57691 55544 40057 20729 2707
14904 2707 10214 27243 21038 27861 42203 37294 41632 8316 13105 25153 -6827 1476 -922
14891 -922 -641 -5449 -1982 25597 29749 24726 59713 53691 30989 36024 10926 33204 61181 41371
14877 41371 55728 53101 47408 37398 24759 28421 24937 -8240 -46585 -37322 -43661 -17709 6267
14864 6267 19816 10962 26963 29758 33894 37722 40127 12826 12253 38988 38035 45712 50733 31109
14850 31109 38822 45961 32525 21214 28981 16214 2322 -5522 -16835 -27332 -34828 -45319 -30480
14837 -30480 -25485 -8325 24338 18820 11459 -26186 -48897 -50031 -25455 -32074 -37917 -24540 -25781
14824 -25781 -29563 -13812 10527 28370 9319 6193 22779 36323 37079 49797 51935 53288 41113
14811 41113 20987 40606 62786 34368 -20183 -17340 -18408 -28860 -21198 -19516 -26973 -35952 -47891
14798 -47891 -15229 514 -12610 15785 34235 31241 28234 28231 34986 27514 15410 40201 66509
14785 66509 72250 52642 56184 45030 24058 33140 46748 62730 37211 25753 48928 56532
14773 56532 34753 11351 5432 22007 17929 21825 19743 14872 24031 5552 -1575 6462 9503
14760 9503 12578 22701 26178 42731 47924 64903 72567 60912 31076 30488 19085 53095 54469
14747 54469 36130 23188 45732 79681 113752 140415 146616 173023 208436 231636 289643 371108
14735 371108 425430 483342 580990 695067 891171 1236441 1742481 2299346 2782643 3132126
14725 3132126 3293355 3161584 2768879 2305734 1830860 1376074 1040858 805543 650787
14716 650787 554822 479369 413309 361903 342278 340034 312252 248169 197612 163815 131584 130172
14704 130172 110877 114642 127563 144481 121106 79875 67922 77416 79457 54703 44796 45192 55379
14691 55379 76963 81645 72920 51542 21286 35216 17624 28674 33952 66625 84676 78575
14679 78575 61874 28922 -22853 -48052 -17962 716 37448 34544 31047 11081 18193 33442
14667 33442 23810 13883 -835 13711 17650 31046 -6663 2017 -5259 -20799 2330 32731 42286
14654 42286 40716 21226 24484 51873 9046 -8165 -27123 -14817 -4256 -10317 -24954 -23453
14642 -23453 3829 -7242 15053 40892 33328 24132 13555 7499 -14466 -40217 -21345 11965
14630 11965 25966 19218 5291 1983 -30188 -22701 -11499 5172 4091 2451 9603 20917 29679
14617 29679 32922 36365 63189 47536 20464 38059 53153 39130 2776 -37335 -34459 -21207
14605 -21207 -13330 -23036 -7843 25014 30424 8746 16460 17118 5282 17032 12844 -4680 15514
14592 15514 -5438 -14841 14127 10228 -7061 -36158 -32252 -8535 17093 23476 -22115 -19326 -8565
14579 -8565 -9111 -900 -9229 251 -1582 -15476 -24980 -18656 3663 7765 -2162 11726 9365 20784
14565 20784 26451 13051 10937 16823 -21360 -38831 -39862 -50643 -55083 -32895 10044 -20244 -44633
14552 -44633 -41174 -23070 -8599 -10997 -10286 -10951 -10610 -16715 -16420 -17386 -17702 2901 10621 -2957 -26595
14537 -26595 -24746 -8395 -16124 -24611 -31102 -20132 2480 -22930 -30680 -25493 -26091 -19497 -18619 2707
14523 2707 19114 24359 26969 3333 -12701 -32439 -15813 14067 8248 20018 -5472 774 -4939
14510 -4939 -792 48827 46477 34294 17965 7200 -3195 -17203 -9018 -755 15179 -1066 -30470
14497 -30470 -48390 -35147 -24220 -15197 -17832 -26385 -41488 -55610 -1859 13087 7937 -14052
14485 -14052 -9783 -15126 -2950 -19933 -36406 -36671 -3999 13039 17008 21625 49508 35823 23569
14472 23569 27617 33418 30289 35547 38215 27039 25858 41273 65620 96285 135451 147590 155565
14459 155565 175003 146439 130741 134350 167043 199961 193561 211383 235645 241228 248165 247905 245850
14446 245850 237467 250152 268764 266576 257061 268117 298040 308089 302051 308447 352793 340892
14434 340892 311206 320878 314884 268058 256913 262341 227465 193429 193615 193467 189979 202707 152918
14421 152918 117843 130885 156656 139971 124796 112463 105600 106290 97286 78984 44843 60303
14409 60303 63582 58264 58239 35555 -169 -29707 -23731 13272 53256 32553 24201 11790 -9552
14396 -9552 -9700 2369 1236 -15626 -6959 21638 34423 63657 83636 51435 -3408 -18106 -16717
14383 -16717 -34913 -28630 -12766 8962 31425 31243 25370 12996 -8944 -19076 -24945 -16436 -2641
14370 -2641 18577 -15616 -23688 -13035 -3835 16764 25063 13000 -1968 -6166 20692 18830 -3662
14357 -3662 -20807 -21273 -4209 -238 48096 51385 20428 53857 57555 32608 35439 49164 49885
14344 49885 42843 50024 -10763 -21419 -8483 2192 13983 12014 7043 19158 -4008 -31754
14332 -31754 -25401 -12276 -25407 -35903 -18519 -20874 -41650 -60347 -72623 -84194 -80873 -45815
14320 -45815 -19090 -4639 9170 -7907 -46210 -56279 -66239 -71874 -77115 -67363 -33393 -47835
14308 -47835 -26493 -28683 -20356 -15785 -29380 -34332 -52554 -58500 -54103 -35420 -56572 -83821 -64190
14295 -64190 -58737 -68256 -59376 -55234 -47609 -58031 -48975 -35428 -38473 -31487 -10030 33641 21948
14282 21948 -4249 -20970 -24617 -36547 -13629 23107 21695 -609 -21902 17652 18699 -3877
14270 -3877 -15628 -16344 -10545 -10510 -18375 -25482 -14265 -41341 -78142 -56132 -34550 -40383 -23548 -25582
14256 -25582 -42607 -51993 -27516 -2724 -12984 -13597 -1857 16797 18214 30187 29601 3294 -12777
14243 -12777 -16787 -4233 -16120 17108 44587 73761 88116 43714 18145 -20349 1170 -7983
14231 -7983 -30987 -14224 5659 23661 12443 -8330 -2898 9435 -3132 -32164 -64981 -64906 -39341
14218 -39341 -35918 -38976 -23249 -26777 -29832 -23506 -19843 -11028 20880 27810 16764 -24811 -33445
14205 -33445 -46466 -19968 -15730 -15313 -24122 -9984 -41018 -57039 -50773 -41630 -41434 -58095 -59648
14192 -59648 -38717 -32962 -6708 -40947 -57523 -72535 -46179 -50457 -68446 -82710 -97430 -116521
14180 -116521 -149784 -133759 -134904 -121251 -121549 -121536 -94832 -132331 -155683 -144946 -100752 -71903 -66834
14167 -66834 -93867 -116011 -120787 -102064 -59886 -62535 -99269 -129568 -136809 -110019 -97727 -78179
14155 -78179 -72015 -90362 -93615 -72059 -70716 -89617 -72032 -66553 -59495 -59520 -73867 -68081 -50185
14142 -50185 -48620 -35890 -15144 -20372 -33479 -29970 -20252 -16623 -34954 -33239 -11474 15848 33233
14129 33233 48202 48820 36978 22895 -2266 -25816 5524 13854 -8765 -17448 6552 13962 19140
14116 19140 6200 -16090 4986 31115 45307 53556 44211 4527 -5271 -11639 25875 45880
14104 45880 32204 35708 22865 25258 7895 8750 23318 30352 26060 24319 38019 42597 61281
14091 61281 96575 86798 50337 47753 80062 88534 72887 52793 48237 32573 62442 87354
14079 87354 77554 69464 77411 120537 138806 143168 156174 145021 129312 181783 219663 227500 221548
14066 221548 214862 251141 279838 284918 329772 340608 346223 360842 335455 346784 383386 405435
14054 405435 451519 484294 518722 596501 664955 700653 731826 785674 834157 862579 907010
14043 907010 982666 1077678 1168294 1262015 1352540 1462310 1597005 1732615 1879991 2018279
14033 2018279 2186123 2398022 2587570 2790542 3011065 3271613 3546145 3850833 4206170
14024 4206170 4583490 5042950 5537246 6077279 6637229 7287929 7990956 8796472 9701673
14015 9701673 10707836 11802769 12978255 14319043 15791809 17398496 19092583 20903887
14007 20903887 22784056 24761650 26843464 28999258 31183866 33407917 35592049 37693282
13999 37693282 39703538 41602461 43386866 45070323 46590054 47950180 49172294 50221848
13991 50221848 51137151 51923834 52575580 53088288 53457636 53700388 53845894 53834484 53654317
13982 53654317 53338676 52856826 52156286 51236207 50120244 48838403 47365034 45657913 43819513
13973 43819513 41863567 39801089 37646442 35414235 33187093 30991220 28849958 26802253
13965 26802253 24831723 22964166 21205030 19568711 18065630 16639550 15345546 14142454
13957 14142454 13011580 11990296 11073975 10248636 9481004 8777468 8141011 7547423 7024842
13948 7024842 6564163 6113151 5712641 5330446 4984884 4688410 4386192 4121074 3851709
13939 3851709 3586734 3361944 3181782 3020669 2871066 2701148 2549454 2417171 2249671
13930 2249671 2105915 2027811 1956053 1875495 1798811 1713515 1612036 1529301 1445050 1407085 1381568
13919 1381568 1314095 1251174 1180834 1136816 1140377 1089221 1041327 982569 944411 900003 859380
13908 859380 841110 837035 806048 773430 731336 693107 669406 682870 645709 616024 605490 581658
13896 581658 582543 575118 568928 554130 558643 547170 516136 525258 513535 491972 474317 478900 465809
13883 465809 450652 459842 454561 425553 407727 394411 371838 367509 390709 411981 411786 422684
13871 422684 418471 417572 399815 361864 350380 305365 310210 326502 327595 324263 317438 303150 313442
13858 313442 326462 311197 294676 289911 286192 277854 262003 248119 269185 270084 231738 222849 206475
13845 206475 216484 215795 197235 211411 240564 256337 249755 211354 170800 174096 193807 180748
13833 180748 165620 146006 129339 152456 164426 182385 204577 205447 195614 154159 131494 142821
13821 142821 159268 193948 182578 169717 171897 150880 168979 189882 201795 223818 236418 214308
13809 214308 204264 210127 219824 210634 214240 213495 218626 185147 153668 179103 190331 203569 203751
13796 203751 208732 188482 199943 212746 212543 215359 196595 194365 164132 177716 188631 182301 145344
13783 145344 139495 143325 142414 135041 100263 90803 89424 97497 106597 127773 121731 119970 108736 114792
13769 114792 141815 123535 94817 94318 131080 144883 125638 92965 75314 62748 67344 75223
13757 75223 70052 86096 70640 60479 24108 18605 26211 35390 32179 50500 58217 52877 86939
13744 86939 82371 78270 96313 104714 122829 97731 76214 66698 38520 44083 77637 74802 44458
13731 44458 42810 72021 113245 110283 43244 22795 17571 -141 994 -5524 -3963 18419 7024
13718 7024 -6293 -11624 1027 35445 39692 30464 70144 98114 72321 28638 50886 81433
13706 81433 98089 82395 46769 49228 66497 100334 84678 48719 36598 31694 59906 72300
13694 72300 77853 61757 75039 58925 33989 25847 19109 45949 36055 16374 -10073 15166
13682 15166 61774 67455 62005 36203 36207 74662 103373 81568 47200 -1765 -9307 6874 39509
13669 39509 44441 55791 47049 7480 258 19124 10164 2556 -519 9547 19751 20253 32807
13656 32807 20298 39735 49647 78028 42666 24333 32731 24970 1889 -12462 -4404 -13978 -5533
13643 -5533 37991 52794 50552 47193 25987 46711 67437 67939 60010 56863 60744 55477 66708
13630 66708 58804 31278 26369 6894 -5903 -8959 26898 55739 38345 29790 26387 14246 8156
13617 8156 20761 20239 44110 53003 48064 17077 -9629 -11219 -937 -11050 8486 16632 33582
13604 33582 32020 39 -26527 15604 27123 -2558 1058 9786 37170 42551 35059 62010 56178
13591 56178 47021 33361 20486 25745 24595 18547 19378 15400 9048 5418 27772 39954 36579 38177
13577 38177 29957 46162 44697 10140 -18065 -6612 4675 -889 24593 36544 15862 9088
13565 9088 24395 46211 23587 32701 52015 50796 45617 55590 60876 74812 91521 75683 83768
13552 83768 62356 58173 64435 85501 100323 131143 146515 148975 157978 194072 179897 183952 212440
13539 212440 229460 244024 229089 224842 267951 282555 285759 291859 302624 313970 342088 344118
13527 344118 318757 297121 297262 310709 291489 280031 282121 253100 251298 264172 257485 280677
13515 280677 262620 227218 182108 138175 108984 107602 112517 112628 106844 118829 130503 115303
13503 115303 85872 70259 89874 89768 68678 34497 19992 28102 81026 93946 89822 86565
13491 86565 97769 99896 75096 64158 45371 46336 51012 34801 36265 59482 98906 65971 38788
13478 38788 33909 28981 12919 24898 42894 51606 42837 32245 13246 19055 12056 -273 21053
13465 21053 16398 -18508 -48573 -51103 -46758 -41675 -45274 -10423 42214 41516 17264 17821 -5278
13452 -5278 -43932 -49434 -18620 -4427 -13434 -32575 -22691 8460 -11363 -35922 -50036 -18063
13440 -18063 -3040 5606 7324 -21733 -14157 -7005 -24348 -33367 -16013 -8780 -46483 -48395 -36944
13427 -36944 7033 10195 2846 -23272 -23224 -22682 -38615 -43763 -60587 -38636 -5802 -32635 -16791
13414 -16791 28630 29757 23279 -3286 -23427 -26449 -45595 -58519 -24258 -30533 -33580 14 10131
13401 10131 11823 4218 18256 7229 12322 17650 9905 7873 -15110 -33478 -27974 -8751 -6032
13388 -6032 -25774 -20113 -271 -28456 -31859 -16357 -22705 -30692 -13566 -14754 -1295 -9306 -12720
13375 -12720 -3931 20747 47283 47367 -1345 -5128 10169 51214 50780 33018 28408 7330 -26534
13362 -26534 -37678 -5616 290 -31540 -22146 11941 23426 11550 -3151 16269 21891 -6777
13350 -6777 -15604 -394 -19586 -4682 23817 21580 -2014 -19563 -15599 -13005 -13738 -26151 -30584
13337 -30584 -30590 3780 21023 514 -3614 -5160 -44686 -45304 -29617 -28905 -51110 -48304 -22451 -44362
13323 -44362 -45157 -9223 1765 -12705 -18307 159 -29194 -45569 -52361 -34813 -19993 -39470
13311 -39470 -40531 -45133 -29242 -25295 -11997 8156 5639 13690 11721 714 25668 50777 43420
13298 43420 15967 37325 22619 3615 -14940 -9279 23177 18627 -638 27567 34474 31223
13286 31223 20531 39610 46656 37609 -110 1396 8274 9940 -14067 -43146 -27717 -4963 -22354
13273 -22354 -33562 -22405 -38214 -9125 -30710 -66025 -67532 -95572 -101228 -69612 -39621 -11935
13261 -11935 17221 17189 51753 63843 64666 85623 61555 40795 33961 -1476 -14256 -845 32584
13248 32584 72290 112326 138787 172254 222016 278406 364257 460545 627329 900813 1289515
13237 1289515 1714795 1914164 1786131 1400011 1033141 740096 549693 437987 371097 299533
13227 299533 242563 210216 175907 158452 116434 94376 115887 103694 112866 96146 72757 64842
13215 64842 64975 36384 34684 33209 14291 8928 -876 19381 30059 1638 5027 14070 1326
13202 1326 8525 42651 31895 6324 15201 9641 19437 47865 55925 20884 8261 11349 11043
13189 11043 -17259 -8250 -19393 -23512 -20967 -16385 -23931 -7343 18253 100 -26469 -19217 -13132
13176 -13132 -21991 -14315 4669 8165 16956 40613 18628 -4964 -26678 -54279 -33264 -35342 -62849
13163 -62849 -89091 -72186 -47513 -30997 1365 -9329 -24228 -41320 -47213 -27239 -14259 -22531
13151 -22531 11466 49269 85220 82914 81608 81183 37949 47160 42153 32860 -4125 -23433 -46895
13138 -46895 -45282 -42132 -44514 -56382 -56235 -51459 -34190 -2768 -14718 -14025 -19457 -6199 13060
13125 13060 3407 -25340 -31940 -9914 -8123 -58024 -78137 -79469 -81362 -97858 -115223 -104304 -78462
13112 -78462 -54261 -34728 -28992 -34721 -38022 -9138 34053 35402 26335 17969 -9499 -26852 10186
13099 10186 7145 -6146 -12675 -41630 -67533 -30665 -30464 -29534 -35430 -28380 -54373 -41148 -22834
13086 -22834 -15393 -38739 -30914 -4456 -3937 -13509 -39741 -42403 -28856 -14077 -30769 -52106 -73645
13073 -73645 -43605 -43805 -51022 -17003 -7985 435 -21132 -37131 -46996 -31600 -16836 -25141 -15353
13060 -15353 22202 27328 46460 60296 81734 83981 68123 96909 86829 62517 78854 106265
13048 106265 101177 139771 177389 193051 179757 139097 103293 64956 36501 36951 18340 1133
13036 1133 -4837 4326 -15730 -15917 -26203 -52666 -60166 -72007 -57531 -55680 -54372 -56861 -39911
13023 -39911 -8440 -31510 -57430 -59710 -53206 -111691 -121856 -91024 -53759 -48333 -54844 -60385 -65713
13010 -65713 -85918 -46060 -13238 9322 17489 -6788 -11633 463 -398 -1309 -1158 -15715 -113
12997 -113 -16584 -36357 -63261 -108809 -102565 -65479 -36617 -49974 -84563 -153954 -280449 -425957
12985 -425957 -482986 -449402 -407667 -365719 -335274 -284803 -238695 -247559 -246389 -259671 -263209 -206994
12973 -206994 -154576 -147324 -126640 -139459 -146821 -157085 -151136 -183380 -179276 -145752 -146631 -164190 -172277
12960 -172277 -127507 -84870 -93762 -85525 -80916 -80439 -88610 -110925 -102285 -72474 -43409 -66128 -68028
12947 -68028 -83528 -93175 -87263 -96419 -101075 -94525 -127599 -114566 -106424 -103198 -92971 -62085 -57265
12934 -57265 -17533 20811 51181 64846 76144 125298 179382 253346 313924 279298 223513 97804
12922 97804 -48614 -76871 -95358 -121695 -130617 -128126 -130255 -138163 -144544 -124789 -123761 -129016 -124941
12909 -124941 -124598 -181018 -200157 -171322 -149487 -181830 -174857 -159337 -156840 -136345 -85179 -59213
12897 -59213 -67735 -65168 -88479 -109873 -97672 -93311 -117994 -93622 -75356 -71471 -48175 -34379
12885 -34379 -15756 -4387 -325 24528 26693 4108 10981 21163 -7730 -37138 -51291 -59589
12873 -59589 -36343 -41605 -3787 37111 56542 77861 74293 89046 101184 89800 71269 49764
12861 49764 -4546 -10478 -16249 2729 25375 29740 60395 126335 169237 180586 238735 275454
12849 275454 321812 344977 340861 343725 350752 342198 339049 380516 439820 496894 520397 562098
12837 562098 636714 705966 761095 833334 903685 1011572 1123964 1242986 1373522 1539682
12827 1539682 1722574 1900997 2095731 2356044 2640244 2900671 3153510 3424022 3753495
12818 3753495 4123221 4569891 5197772 6001555 7004505 8166802 9484806 11010851 12919294
12809 12919294 15397373 18685501 23059671 28856354 36668492 47042680 59891902 76095274
12801 76095274 100471902 142017749 212318659 305494781 374943694 379456469 318855122
12794 318855122 238655479 176246657 132729981 103749993 84609529 71006352 59994142
12787 59994142 50672605 43095762 37064547 32229703 28222038 24889894 22137783 19892233
12779 19892233 18022623 16385445 14900641 13572466 12433916 11405148 10451215 9579317
12771 9579317 8817732 8137816 7551267 7032850 6585122 6167467 5771748 5440920 5146729
12762 5146729 4865344 4550944 4266214 4052291 3833162 3599849 3393704 3211692 3086236
12753 3086236 2961573 2819871 2711309 2592714 2480707 2362737 2258006 2147558 2060684 1989958
12743 1989958 1926372 1831924 1750570 1728301 1699541 1645562 1587829 1573103 1527591 1456171 1372878
12732 1372878 1284040 1235531 1161989 1130536 1106595 1086371 1067563 1073926 1072235 1045087 970886 948344
12720 948344 914339 918359 939054 927907 905098 846806 804376 781300 751333 754174 764328 756854
12708 756854 765300 732297 725428 710789 675361 670777 668935 628683 593704 588881 609667 630838
12696 630838 626812 618699 593147 578606 579004 583392 589834 596411 593413 596591 581875 540878 516838
12683 516838 511227 494503 502860 498585 500642 546522 547682 501394 496150 527027 541469 526508 541715
12670 541715 567572 548525 491153 422717 349251 309583 322058 356968 408402 435836 410668
12659 410668 407193 401807 395104 365760 357121 388333 430127 413074 368351 323947 338945 354650
12647 354650 373696 386980 374961 335086 288832 291013 340685 361029 372438 342764 316802 319120
12635 319120 346852 343034 333479 289059 285477 313840 336765 332794 327865 310005 311005 297703 313530
12622 313530 326724 312187 324137 351514 380225 410849 417329 417796 450371 493756 518819 556248
12610 556248 576944 632693 667356 595013 495469 380735 319746 267687 276266 279354 280490 255222
12598 255222 228522 217434 182741 145253 130751 136649 136434 161739 186654 207735 197539 201825
12586 201825 216798 221617 199235 185526 165341 183065 193054 202752 169503 191124 182074 211893
12574 211893 206656 160165 164948 142375 145994 145205 161909 180843 175765 177726 215385 215495 199542
12561 199542 192365 192495 183478 180042 204230 205271 220874 239006 237279 256832 256383 276196 257341
12548 257341 213738 215415 228870 232625 224437 206731 210564 198423 195572 190737 185808 157843 132778
12535 132778 132745 143479 111751 89202 102200 149091 181479 181309 167675 182936 204416 227443
12523 227443 218490 191474 192391 197516 220427 231881 220662 225225 265800 264227 274554 288134 319977
12510 319977 327446 392374 479538 535926 534549 535774 552171 536686 468947 413185 365071 340885
12498 340885 354156 332975 294600 267058 282184 280731 307478 307606 279229 283535 255690 216658
12486 216658 199335 195113 194160 237714 243651 223602 182914 168930 185818 166958 167293 193010 224121
12473 224121 246131 271213 293269 288089 289949 274107 321345 382921 424612 491218 503782 538633
12461 538633 538707 522376 498768 438247 412238 405920 384208 373486 299734 275525 286387 296475
12449 296475 260787 230666 217375 210091 195940 182758 197812 205865 202376 179545 148345 138852
12437 138852 139533 125838 80673 97422 132012 155333 167796 139372 160871 173036 176862 167396
12425 167396 173700 179146 194859 218771 232744 231826 218184 239778 234588 227666 248074 227873 213988
12412 213988 216582 166946 147185 122022 109631 144747 147536 149756 119731 93007 79265 75827
12400 75827 81469 83683 96562 124991 112658 85608 109815 97583 88505 96887 133322 113586
12388 113586 107633 109865 77495 70295 115392 132953 137320 134678 132884 108626 89703 76292 84392
12375 84392 98270 93290 96574 94010 69502 74842 83116 118348 135210 128659 163497 175010 188511
12362 188511 185237 198933 251364 274325 298561 337856 410022 543466 747998 1070325 1527326
12351 1527326 1917565 2045210 1831536 1443992 1112941 856764 672982 567570 473354 413803
12341 413803 359710 299476 245957 204586 149449 134223 146024 163642 136376 105336 107738 163588
12329 163588 191444 174885 144361 163675 155413 119940 110672 118656 92254 70583 69408 74645
12317 74645 64764 73939 91834 99053 73499 86505 72644 46996 87553 112356 71972 70942
12305 70942 95411 93672 121679 119987 82502 65261 57957 51460 38364 41051 35046 28407 37595
12292 37595 61022 56334 70942 83565 49879 54924 72439 86873 74983 76949 90896 89684
12280 89684 78376 58066 47528 24951 15253 23322 45112 69567 70629 93896 77103 65230
12268 65230 42310 23187 11499 1645 37428 43308 32251 42224 58967 53541 69641 62585 56784
12255 56784 38700 50837 55109 47461 50769 74785 99756 67799 50080 55688 82588 106907
12243 106907 93590 69404 65105 12055 11384 36587 15242 33796 68749 88153 129023 114124
12231 114124 68861 55812 41340 39956 27308 38494 40899 53645 58172 70133 59844 42897
12219 42897 66008 70793 47027 48146 37774 47998 44561 34564 19744 33163 39083 38476 44506
12206 44506 47542 44563 56105 39089 40969 60638 64654 58028 64022 84827 86586 99313 69906
12193 69906 53135 32884 37126 30100 32749 38856 53872 88666 83130 75291 61638 67473 58992
12180 58992 41145 64048 64664 52971 26436 25568 38175 68628 51186 8960 -4777 -14413 11677
12167 11677 5612 15246 24601 12399 8342 36163 42236 52671 56718 79968 71235 52400 67122
12154 67122 84403 43135 19516 36689 37114 4656 29830 37130 51467 28590 35498 50921
12142 50921 32702 42024 49401 63328 56175 74414 61242 45238 60348 58885 24567 133
12130 133 8715 26933 13419 8476 38785 56867 37626 29260 52726 39667 21284 28716 12117
12117 12117 32065 13766 -12681 4973 -895 26894 60797 65116 36223 59717 60669 38090
12105 38090 26041 25949 7158 16676 36243 11126 37872 20393 3478 19721 21477 34516 20041
12092 20041 13239 9135 48293 62804 51168 40197 44051 78338 50886 22000 25396 26029 36969
12079 36969 57878 50307 37674 23177 35735 30196 35623 61283 46628 58922 65573 36117
12067 36117 13678 28183 32760 28844 36778 43052 36776 44984 36949 28173 38311 42463 46109 34847
12053 34847 39335 37549 73810 75181 49322 60466 113277 103674 94565 66175 40410 27057 33742
12040 33742 27944 2960 -26954 565 37382 55009 41204 26664 39440 23521 -7067 -29807
12028 -29807 -31194 -22288 -29569 -11238 25653 56621 54146 38082 22276 18181 47534 56344 72418
12015 72418 87666 70639 45593 52615 66843 65708 21555 4360 12532 15777 21022 43190 64428
12002 64428 48160 1170 -53381 -58727 -33206 -77 376 -8738 3805 13805 2393 -19644
11990 -19644 -59284 -47308 8420 26792 41628 50227 24610 19070 36321 59797 58261 37051
11978 37051 23145 -1066 -47 31035 26028 24986 66396 102957 91332 79821 39050 33169
11966 33169 23796 55574 53476 40924 25557 37964 18368 7238 13420 19180 19978 15918 7394
11953 7394 -15926 3291 4533 21205 43472 76628 71697 54533 36001 39214 39919 73700 92972
11940 92972 81752 60246 71312 58708 68194 49699 26334 16564 2714 8458 39181 27870
11928 27870 -11462 -3705 -19350 -45550 -25405 21917 25548 14340 6663 -4327 12844 28533
11916 28533 30823 26625 25794 -4805 18411 33740 -2934 1046 877 17636 11139 21624 28884
11903 28884 30023 52913 55564 18993 16261 -2560 -14450 21338 61190 85418 78217 61711
11891 61711 67743 65971 61489 73167 62948 17886 23699 47628 53213 15764 -36832 -40546 -17542
11878 -17542 -14216 -565 11834 2992 -7147 1804 9864 28735 70021 55836 30188 19625
11866 19625 23048 17662 3141 5222 18801 32338 32336 -5314 -19972 -14079 12441 17069 4789
11853 4789 4918 11203 34215 41750 7047 -25861 -32341 -12921 -5187 22829 34104 7342 -2786
11840 -2786 22990 20966 -6222 4453 6823 -15205 -20839 -28668 -18065 26619 42711 49329 14314
11827 14314 3839 -18504 -30796 -38162 -9395 15891 30321 34521 28816 8578 -7594 -1342
11815 -1342 26655 20711 25333 36362 12812 -15276 17108 4705 -2409 19525 13223 15770 -4248
11802 -4248 -13377 -5170 14629 22759 25421 48496 35403 4484 -30000 -36229 -47954 -28447 -27574
11789 -27574 -23141 -6330 -4491 12012 47925 49906 51810 47366 33745 46536 63530 47982 49295
11776 49295 37670 41222 49878 55118 50494 24841 11709 2341 -7145 1906 6488 7832 4383 -9079
11762 -9079 -6138 -15123 -10462 29792 16969 -21336 -23420 -1660 -14499 -26158 -16087 16115 28887
11749 28887 15520 12327 -9130 -23645 12664 25065 6174 -15216 -3808 6372 38095 53666
11737 53666 35397 -127 -13380 -14641 -9895 3731 24169 53616 56849 36921 31585 21278
11725 21278 7270 2389 9666 24372 35340 73944 76695 50079 33735 25976 -166 6796 -15631
11712 -15631 -15867 4024 33988 16165 2858 197 3750 14563 1818 -11067 -2193 -1978 -19610
11699 -19610 -21310 -3689 8735 -953 -18033 -17582 -2627 -5493 4014 48254 37283 33989 6316
11686 6316 -15421 7544 33967 33588 19450 31215 24528 27493 32431 28871 46962 45478 53316
11673 53316 35132 38936 32558 8201 -29043 -13888 23656 22309 -624 22295 45487 4549
11661 4549 -9101 14732 16996 25727 10133 14177 42265 54422 23108 -13242 -11970 581 -10144
11648 -10144 21202 50322 50072 15108 -21373 -38998 -20680 24733 35818 47423 20873 8399
11636 8399 40929 58974 29906 -9466 -17123 12952 42229 41310 56698 41161 16087 11435 21542
11623 21542 18257 29776 10229 8833 4299 9658 6569 -3281 -24560 -46914 -21276 11354 36620
11610 36620 3300 -15069 548 14076 5281 10486 20985 18155 7296 14943 43740 70568
11598 70568 52204 29322 22349 11355 34301 45059 38299 23902 30631 14912 20049 46703
11586 46703 27812 22546 34522 26246 -2462 -6951 -18360 -38548 -17805 -6831 -3199 -6923 -30456
11573 -30456 -18445 -39625 -18146 4367 7792 25154 29130 18313 7608 6052 29429 43772
11561 43772 50290 42385 40384 67050 54079 38796 36456 30596 11876 21916 22842 21436 21507 30826
11547 30826 8572 31450 58387 6804 -29290 -18562 -824 -4288 -9904 -2070 -1623 -15946 -9568
11534 -9568 26598 34749 3524 8401 17383 47896 69170 41034 44446 30010 -25915 -30042 -6895
11521 -6895 6846 15524 22069 -2833 -16232 -4959 13370 20316 -4524 5796 18496 8418
11509 8418 20285 28621 28338 31739 18825 32208 56949 38972 10600 22129 959 -6796 -12869
11496 -12869 -18391 -2069 -21986 -8604 -2574 -816 -14364 -13126 -1259 10707 20342 25099 22471
11483 22471 16744 13777 -4589 10384 21507 47731 35281 34125 13795 3177 8946 -9710
11471 -9710 -34603 -39788 -35112 -25869 15641 25825 10805 -23770 -41062 -42015 -19616 6653 -6578
11458 -6578 -15884 15276 22011 15652 -8778 -30757 -14151 -39274 -45384 -21887 7962 28423 38617
11445 38617 29489 8929 -20504 -41268 -26086 -4956 23298 28494 2907 31245 25761 13199
11433 13199 12536 20609 36580 30381 6810 14830 37905 19371 1263 21503 8957 -17364 -21175
11420 -21175 -16356 -3165 6847 4731 -7354 -9514 -6546 -22397 -25638 -2640 -26120 -28903 -9930
11407 -9930 -14215 -40636 -44472 -41965 -47130 -40145 -12806 36754 30884 14438 -11272 -24819 -2500
11394 -2500 1945 9548 12687 -2015 -7330 -10113 -7356 -21131 -3639 22684 26332 21655 5349
11381 5349 -1611 -3307 -3229 41493 68498 64716 67063 40166 11659 -2476 31764 50277 45148
11368 45148 52284 62370 61211 36901 42704 29147 -524 -14978 11715 16974 12913 -3487 -2694
11355 -2694 17925 40750 32549 16737 3212 1662 -922 1161 15389 21637 -3343 -37206 -60570
11342 -60570 -57131 -47690 -38128 -44977 -48351 -43431 -30917 -28070 -34264 -18641 1200 20715 -1109
11329 -1109 -35952 -40707 -45430 -51483 -56511 -46427 -35526 -55715 -63143 -49921 -17044 9080 -17558
11316 -17558 -29954 -31769 -8566 -11582 -37908 -40859 -36834 -45474 -20393 -22892 -8109 -12526 -29907
11303 -29907 -28047 -24584 -65859 -54918 -29919 -36812 -46933 -45929 -25253 -299 -447 10530 31670
11290 31670 -19516 -47135 -50091 -54429 -41161 -25421 -18644 -1448 -8100 -13275 -20077 163 -1308
11277 -1308 -12641 10946 14150 31424 20287 2950 -14742 -27721 -55349 -33254 17603 36904
11265 36904 45611 51563 49411 44898 27369 12143 1977 24932 33884 -18194 -10094 24149 -1395
11252 -1395 -10446 21074 32506 -3425 -10688 15718 8445 -2318 -2948 -15892 -39083 -39070 -24663
11239 -24663 -24389 -30024 -45423 -36776 -49449 -44256 -63715 -79440 -52118 -31321 -15366 -31767 -29327
11226 -29327 -9407 -16461 -9763 17033 16999 16140 32772 54353 36784 13970 19722 -7377 -20979
11213 -20979 -42458 -53827 -44017 -6702 -12652 -22102 -7132 -11686 -21511 -53470 -25849 13439 -8951
11200 -8951 -49724 -35895 -6273 -19506 5240 5025 -20295 -52489 -52344 -33200 -54706 -65054 -25604
11187 -25604 -12031 -36997 -52561 -36701 -45730 -35027 -31457 -26068 -8517 3479 -14454 -21021
11175 -21021 -39715 -42304 -26524 -14932 -58038 -57489 -23911 -6773 -6922 -3832 -1520 19681 -2357
11162 -2357 -29263 -16801 -27751 -29851 112 16087 57876 28534 9401 -5579 -9754 -6164
11150 -6164 -25983 -30785 -34458 -22282 -5653 -13587 13159 17244 30838 56148 16000 1822 15133
11137 15133 26693 17717 11138 -12518 -48652 -28091 -20785 -15993 -8547 -11839 5541 -3683 -21030
11124 -21030 -772 14038 -21394 -43932 -20334 5217 42089 44101 47012 54980 58647 55172 25041
11111 25041 2646 8684 6327 12414 -9413 -40705 -62943 -27881 -18457 -31612 -54907 -25714
11099 -25714 3747 -4400 -37498 -46824 -58724 -8374 13642 21473 52128 24291 -3813 -17541
11087 -17541 -6741 -41514 -79523 -46821 4973 23395 4145 11652 -14826 -27358 -29406 -27384
11075 -27384 12333 11267 -4725 -44789 -27281 -31662 -35126 -42639 5644 15362 6941 -6454 -35636
11062 -35636 -22274 -8114 35116 51447 23322 -7506 -44444 -44871 -36963 -19954 -21297 -14701 -14582
11049 -14582 -18106 -31010 -12637 15340 18513 28388 26093 16311 13617 17640 38223 14031 793
11036 793 -1208 -6217 -1458 -12631 -9246 -17191 3145 26741 11177 7510 -23933 -42237 -38098
11023 -38098 -18023 10926 32312 16043 -18813 -49318 -42614 -36390 -43022 -41763 -24397 -8468
11011 -8468 -22491 -14279 15797 -3473 -30794 -31305 -18900 -9776 -4904 -14332 -17282 -10384 25096
10998 25096 49115 15252 -16431 -84408 -94602 -72960 -36108 7194 -1589 -14373 14683 29205
10986 29205 35422 15307 39618 51620 58918 56996 36190 31695 27579 12698 12217 9562 -44921
10973 -44921 -78473 -70515 -28270 13598 11976 8686 -13919 -13161 -23512 -46698 -49392 -52768 -24793
10960 -24793 -19573 -61830 -32033 11491 31580 33947 8183 -15546 -18867 -34516 -71960 -63266
10948 -63266 -10929 -20708 -39515 -42330 -31731 -18405 -13096 -13831 -6643 -20374 -24062 -24018 -18550 -1937
10934 -1937 25505 2296 -13108 -4487 177 3637 -14323 -47812 -52326 -50221 -34151 -26552 -14228
10921 -14228 -4872 -11724 -14425 -1594 -9235 -14820 -11038 -12120 -29504 -27885 -28681 -33288 77 16980
10907 16980 5312 -3728 -25093 -45831 -41785 -30833 -27400 4850 14819 -7357 -23578 -42938
10895 -42938 -39123 -14358 -7902 -553 -11802 12633 6823 27778 27280 19925 -20223 -10155 -24086
10882 -24086 -35839 -52521 -40787 -27167 -25855 14873 18963 -5860 -34702 -13089 -1470 -21287
10870 -21287 -47194 -29195 4505 17473 -13514 -21217 -12057 -10165 -43059 -33389 -55130 -51870 -40600
10857 -40600 -18764 -7335 -7867 -2638 836 -12924 -1391 -20136 -38862 -19809 20303 34229
10845 34229 257 -18057 -16014 -20299 14110 29488 1307 -1033 12713 2214 -22179 -57477
10833 -57477 -29107 2619 8687 13467 33962 13407 4506 4389 943 -2570 -7371 -24108 -53675
10820 -53675 -58102 -37871 -49811 -61684 -19684 7158 -13785 -32719 -11072 -1 13447 6266
10808 6266 -10433 -20147 -11748 -36606 -41791 -33919 -23926 21028 18491 -21060 -28216 -11109 -25683
10795 -25683 -6145 -10480 -15130 -9407 6451 8029 10918 11359 22397 36650 28026 -18816 -19826
10782 -19826 -23748 -20720 8121 13207 13727 20273 17692 -4014 -45426 -30442 9808 19956 5700
10769 5700 -9720 -5179 18174 24893 20843 26097 15704 17737 12948 2879 2691 3453 13787 35142
10755 35142 24979 -8062 -38560 -58567 -32986 -10096 -15338 -40044 -43186 -15393 -14093 -21162
10743 -21162 2860 30080 9636 -417 9180 -7187 -2039 -366 10619 -10618 4062 384
10731 384 -31592 -40497 -34945 -23494 -24599 -24788 -18613 -1975 6090 8856 1876 46 -15180 -17835
10717 -17835 -4091 -4352 -5916 -6725 1240 1512 -16436 -26043 -50097 -24274 17261 32430 42195 26598
10703 26598 2324 4381 32349 -4503 -19208 -38922 -32665 -36369 -388 26868 33106 9027
10691 9027 -196 14619 29451 10191 -23680 -18606 -21653 -34611 -38510 -58907 -61439 -44407 -15647
10678 -15647 4532 -32894 -13884 -8254 -5902 10293 19490 9934 14819 -1312 11878 -7510 -14706
10665 -14706 -9012 -22857 -16639 2379 -908 5372 3039 -239 -2799 -12440 -25973 -40476 -60219
10652 -60219 -30596 -30387 -27398 -25120 -18118 -4973 25868 38752 16148 9619 25222 35413 46472
10639 46472 40222 26604 -22710 -57251 -36481 -42001 -32638 -25165 -16360 -21281 -12831 -12634 -41368
10626 -41368 -43666 -49891 -45788 -55965 -40107 -29636 -33532 -29626 -73058 -70339 -68796 -51343 -43509
10613 -43509 -13272 18835 11696 -12583 -34878 -34700 -18374 -4483 21924 -6152 -7096 15853 5078
10600 5078 -15658 -20882 7891 15421 6986 -17839 -36285 -11585 19581 24551 -9945 -58675 -46859
10587 -46859 -32631 -10094 -25362 -16228 1717 -15034 -11324 -1920 -8071 -16446 2377 -3743 -17407
10574 -17407 -38037 -45836 -44029 -24754 -14464 5940 7780 -3745 -17842 -28727 -39066 -23390
10562 -23390 -40182 -47429 -31067 -1596 31460 50729 56899 39464 -584 -7752 1339 21442
10550 21442 19602 16825 21101 10929 -4351 18 24769 12495 1735 12565 34788 28741 36004
10537 36004 23175 35967 55746 49821 34851 17972 41451 14411 -27044 3826 10494 12816
10525 12816 37921 51386 33085 9532 7114 -16411 -33741 -9296 16450 -5849 -25570 -17814
10513 -17814 -9064 -354 -21841 -56047 -68385 -38064 -9919 -3705 1137 3392 -4193 -1188 15629
10500 15629 24176 69228 41629 13887 9594 -4161 318 27079 45007 53995 36294 3431
10488 3431 19274 39539 35528 33560 35739 13985 -10577 1685 25901 12305 -18860 -17256 -12517
10475 -12517 5744 27227 16934 -6604 -8698 15314 42085 34749 4691 -16033 7054 8802
10463 8802 36004 25159 19707 2846 16837 53570 68262 51265 54615 71249 71279 42037 63669
10450 63669 97588 66962 52389 75826 91577 85439 64069 41232 21473 30924 32495 31969 20842
10437 20842 41875 76486 95341 70392 72739 67358 64004 47741 37499 22616 45117 81453
10425 81453 100343 70226 33875 19634 17419 36231 77184 93436 70259 48018 46603 6416
10413 6416 17428 13089 14458 -5212 -3611 12951 -11855 -13083 -19384 -12851 -25343 -10624 25423
10400 25423 53476 71572 72681 53518 69356 82886 56064 79707 121685 119108 73358 55851
10388 55851 58186 64031 79130 115829 116171 120437 99094 87901 80619 72880 71398 56038 32602
10375 32602 53210 74077 59752 53928 99102 127869 104510 90640 93035 78193 87279 81411
10363 81411 61342 81278 125532 162152 169115 160330 147955 153690 184028 207154 171247 106502
10351 106502 86423 110557 137193 181267 190635 196957 209403 198306 204557 214647 205884 206301 220337
10338 220337 201768 181759 167333 172337 152099 153804 182560 173926 186656 220620 233811 208891
10326 208891 202352 208171 218850 225732 239519 224337 232482 239937 269814 252770 239579 238343 226120
10313 226120 232179 239253 246935 247816 285502 309336 319054 340634 322231 304547 335699 337264 316161
10300 316161 318398 324822 376768 403660 426718 437898 450216 451040 457510 468652 502714 509290 517075
10287 517075 537751 533247 546117 583380 611242 604732 619332 655620 672223 688591 714807 755544
10275 755544 790876 829108 835587 837531 867021 907737 923012 966718 1020202 1073197 1115370 1144108
10263 1144108 1180999 1225205 1254921 1306168 1374988 1422315 1472058 1541637 1601921 1665179 1749784
10252 1749784 1786110 1850697 1891094 1990747 2076727 2137047 2204658 2275882 2401614 2490173 2588923
10241 2588923 2706346 2777956 2836878 2919042 3059885 3170635 3266219 3391419 3498630 3636521
10231 3636521 3769856 3850706 3933156 4053756 4164200 4256231 4364526 4476916 4607809 4758703
10221 4758703 4885941 5026925 5161407 5260575 5372172 5530546 5657181 5791885 5918611 6046302
10211 6046302 6170373 6344774 6532251 6662640 6776288 6925241 7080234 7217265 7343749
10202 7343749 7458169 7567310 7708036 7849136 8007717 8144506 8231177 8351835 8462145 8542677
10192 8542677 8631463 8713693 8785266 8862176 8979096 9053931 9096760 9120147 9164979 9194230 9207583
10181 9207583 9215104 9222586 9239266 9256598 9286834 9268294 9261840 9247106 9244688 9274241 9306849 9288793
10169 9288793 9268753 9236958 9216562 9232213 9235018 9240972 9281505 9257583 9216795 9209305 9182799 9157448
10157 9157448 9154749 9107892 9050617 9040433 8989216 8930439 8880328 8850302 8822717 8743818 8638039
10146 8638039 8522378 8391639 8267668 8147303 7995293 7857895 7740064 7608173 7463561
10137 7463561 7324895 7179397 7006064 6876849 6718174 6519867 6340592 6214827 6093009
10128 6093009 5966852 5829019 5728308 5612276 5471150 5361495 5241482 5113217 5007735
10119 5007735 4895881 4776762 4693278 4602386 4504306 4381816 4299928 4248957 4162877 4066713 3963106
10108 3963106 3846630 3754469 3661633 3533907 3467855 3391998 3267810 3172972 3068774 2976033
10098 2976033 2882624 2802269 2721248 2649230 2552907 2481370 2425154 2325187 2200228 2123048 2059789
10087 2059789 2013768 1951106 1908609 1844785 1784400 1722940 1699258 1682443 1659282 1607438 1571523
10076 1571523 1531662 1481502 1422578 1398679 1355795 1341962 1328747 1272887 1230105 1208598 1170415
10065 1170415 1158603 1134772 1117128 1092805 1079322 1032459 1001872 985602 941051 935493 926170 912813
10053 912813 882804 895220 904290 911392 884080 848481 854251 844889 806476 810446 794799 759789
10041 759789 737365 728229 738216 741462 753659 747501 718180 691287 691085 656956 602591 596530 604424
10028 604424 594158 586736 585928 576000 581286 611528 605843 612468 574444 541376 530169 540819 540940
10015 540940 531867 512102 492366 478398 462742 489662 506313 504978 477267 491409 496916 486402
10003 486402 462218 457654 454204 433371 430948 411652 404806 439641 433230 434362 437426 433148 428450
9990 428450 404333 385972 402496 415737 420075 397353 379470 342166 332618 370853 385515 392565
9978 392565 376612 374880 365051 377685 358801 343884 329188 327247 337081 337315 359921 362635 335618
9965 335618 325089 352643 366436 358338 345118 354686 361966 395299 424911 449253 454499 450555 447763
9952 447763 445452 457082 494294 520383 573491 647887 745851 877257 1068109 1374733 1906651
9941 1906651 2760499 4122153 5641691 6329286 6052913 5369494 4419623 3336224 2428739
9932 2428739 1818104 1442578 1189198 1020321 882856 767107 710651 656954 594426 562835
9922 562835 550439 525117 500529 477678 436474 425273 429739 438467 422156 388545 372642 329027
9910 329027 328853 338159 313608 312230 281089 252596 242601 241282 253763 288755 262355 240998 250719
9897 250719 257258 299938 324684 333427 394139 453595 575641 723313 785829 760312 686397 595638
9885 595638 493777 420466 363109 331130 340823 311777 297474 295660 297890 266798 264968 240832
9873 240832 241543 236660 233338 220203 190882 195653 210656 217812 224707 256330 275963 250476 227213
9860 227213 210227 227393 254714 260445 243986 233245 212008 207746 226408 244644 258602 238937
9848 238937 236548 270003 336298 461073 613694 797784 887460 855476 766471 666677 565950
9837 565950 442181 390469 349228 324599 306320 287768 261481 243936 241261 239187 233724 234790
9825 234790 249827 235328 214287 224150 220615 191133 203410 207615 208679 227799 217192 196560
9813 196560 176995 160102 185339 220869 219383 196197 184394 191628 228100 238435 239772 203150
9801 203150 143109 133697 136730 171776 174393 153231 129184 162186 180294 167588 161169 128197
9789 128197 137496 161735 168087 122098 102870 125225 145049 134234 124080 175570 210588 187115
9777 187115 174332 189802 193119 169139 157053 161396 174292 178896 199219 204463 179550 154776
9765 154776 144347 145808 132113 149128 167239 153015 158800 160566 166317 164701 127133 142977 163582
9752 163582 160732 155663 145907 161794 196357 203930 197683 194542 175980 160707 128350 109529 102812
9739 102812 125866 136541 123818 139188 138735 121115 112810 134073 135759 139332 163505 135077 121017
9726 121017 164720 188381 157943 135871 145613 168118 184257 185984 182995 169100 162444 186583
9714 186583 196500 161509 154293 175984 169107 129593 132062 105315 96636 103798 103889 121524 140239
9701 140239 118859 114123 158040 190015 199075 200634 193540 162537 126702 124533 142026 147852 129805
9688 129805 119626 130980 158800 175964 168560 159801 152196 168369 135210 155558 176569 192334
9676 192334 190370 158914 150436 156692 143216 129703 144163 186588 229137 212658 176376 148977
9664 148977 122309 154309 154801 136866 144773 134064 139392 102182 132315 184219 196596 197588 190908
9651 190908 162738 138906 154988 168861 163749 168865 183010 182791 183156 170293 164925 137522 91742
9638 91742 100029 126842 138488 159405 200414 194268 170427 171888 153923 149173 161519 170608 156291
9625 156291 143265 147275 146511 160013 161806 146246 142654 144778 160249 163095 172877 204302 199935
9612 199935 177222 190498 201502 189681 204170 191029 194418 192067 192628 200612 223251 224094 212138
9599 212138 212996 212339 191917 187455 172017 141194 151856 152202 171382 172905 189306 213169 224807
9586 224807 207251 214881 220874 220304 230307 215560 228080 221987 192351 179425 203274 184155 171571
9573 171571 165500 141950 144741 144268 134737 141334 133041 178018 214920 209765 183652 213292 202964
9560 202964 190220 207301 214294 211178 224778 227242 236542 221154 203535 184602 190555 189412 194821
9547 194821 228471 228049 224954 244024 244716 232366 254248 257671 253223 214551 218725 208884 211448 242055
9533 242055 260052 266655 247232 225881 227864 222240 253723 265814 292604 288421 244576 244871 246167
9520 246167 270983 310406 317358 309763 279535 261286 252217 279542 301262 288093 292759 330111
9508 330111 310616 290673 296655 275489 257519 246247 264866 279959 314155 326839 327699 316201
9496 316201 333907 332939 348776 352242 350848 371908 353749 362777 381729 366815 341452 323532 342801
9483 342801 351153 368945 366976 355034 370921 392616 402567 404907 420352 425006 424846 442441 438699
9470 438699 422660 430165 407858 379641 382043 381139 406102 457288 462826 475326 493846 511123 530622
9457 530622 507117 481750 497358 509537 498459 485577 476715 477970 495826 535688 546359 545432
9445 545432 553798 565183 551877 562097 587746 617654 626182 628198 599050 611046 632545 664851
9433 664851 699654 716219 719119 729019 718068 750271 758728 757339 791953 819039 832869 856988
9421 856988 861250 862297 886084 893767 907138 937169 1022080 1049948 1056769 1027203 1034889 1042293 1107835
9408 1107835 1161542 1214239 1228693 1268541 1293948 1309971 1341642 1377039 1431002 1457791 1503521
9397 1503521 1563532 1609306 1632038 1660665 1715141 1786857 1882516 1925343 1964771 1999430 2059008
9386 2059008 2126712 2186388 2253700 2383094 2478458 2584140 2698567 2811897 2912415 3036023
9376 3036023 3151520 3281632 3411434 3538226 3688399 3866199 4065301 4263917 4436982 4639889
9366 4639889 4870214 5116672 5389184 5657207 5925084 6211903 6531480 6876438 7250072 7641292
9356 7641292 8052605 8466849 8925735 9403192 9920194 10416028 10936950 11496521 12027223 12580558
9346 12580558 13136762 13702627 14275039 14805470 15304297 15784922 16209946 16639579 17033758
9337 17033758 17347442 17593856 17785883 17954971 18093553 18181921 18184555 18112961 17994676 17852404
9327 17852404 17605404 17281574 16945994 16546915 16085736 15618355 15110453 14563349 14013793
9318 14013793 13444409 12819592 12236177 11657539 11081132 10521224 9993547 9494238 9016267
9309 9016267 8552158 8098516 7692875 7333236 6928954 6572655 6270329 5968640 5685050 5425244
9299 5425244 5170176 4950487 4758795 4559295 4352706 4167932 4006125 3847330 3686152 3516304
9289 3516304 3353460 3214213 3103376 3002521 2914217 2789780 2681495 2590452 2520007 2459786
9279 2459786 2402938 2334243 2248711 2157221 2119325 2050198 1996503 1916298 1841960 1804457 1735606
9268 1735606 1662525 1641739 1633058 1581354 1521864 1476825 1461715 1429158 1375339 1368842 1330371 1289232
9256 1289232 1244335 1207697 1179271 1175807 1146221 1100992 1083289 1081029 1050574 993609 988179 975215
9244 975215 922196 890351 895350 911887 916496 891314 850804 851786 850237 841052 817453 799491 803616
9231 803616 784910 743089 711860 724757 718369 682781 669627 658306 661751 657595 666090 668374 633908
9218 633908 596037 572059 579540 572730 578540 569020 562326 556390 541906 542899 554138 554060 539769 531910
9204 531910 535613 498609 474299 470745 447399 428214 437862 441130 455884 453350 451814 437074 402228
9191 402228 390184 364927 380859 414704 384880 354903 371112 433126 443302 392797 366351 342933
9179 342933 329607 326003 367961 391015 381619 366505 348456 359646 339480 313589 320228 303220
9167 303220 294214 292787 319188 332342 338836 334353 319723 328576 311695 291693 304044 323341 317765
9154 317765 302716 292677 291168 301556 315414 292626 260368 237162 242904 254707 271982 237167
9142 237167 218621 202149 200598 196779 190211 204779 196956 191012 217929 211933 209475 234877 223197
9129 223197 185771 190535 261113 277285 272246 256786 244474 228067 215549 208113 229898 229583 225420
9116 225420 232610 262785 279619 271211 276247 256169 243271 260416 227210 194459 184446 194354
9104 194354 223518 190862 174334 146373 139693 151723 153578 148958 152207 168695 176727 167661 182329
9091 182329 212665 205841 194867 190530 164413 127975 154727 142465 111550 168764 210256 187733
9079 187733 204677 229010 212837 172355 170822 173024 199219 215076 201496 185505 199372 190769
9067 190769 193091 197574 180210 151405 143480 163328 129360 127959 151052 153398 159182 147479 148687
9054 148687 156464 137833 159439 158735 145464 129125 129735 143514 141443 123218 138152 133652 135306
9041 135306 143950 171196 146777 117831 101606 110407 141257 154088 142024 105615 73933 97185
9029 97185 128945 131379 142100 173489 155202 135698 126152 113806 124366 118527 125496 137809 126274
9016 126274 116066 124319 129820 111951 99241 83518 116262 150825 161044 188375 191386 163906
9004 163906 184499 228084 285470 320581 329383 317856 280561 232729 190716 155575 116224 134266
8992 134266 136484 170543 176104 179417 165058 163863 173907 184314 179254 169121 168657 151415 163024
8979 163024 141527 153403 151846 118667 114246 108475 103829 114178 105244 85532 85726 86100 83420 84917
8965 84917 96011 122539 145397 195402 245555 268390 287107 247654 208995 180729 161395 126389
8953 126389 121183 115685 115855 113724 104228 71037 71039 90047 84079 65744 80620 119029 126601 139539
8939 139539 138960 143924 126439 129958 137532 146074 150089 157488 139175 115823 128076 122657 105234
8926 105234 93924 103488 100365 95505 103769 73179 73956 91824 129034 160782 129949 114843 125845
8913 125845 75631 49099 40252 57215 75393 87629 86938 113225 105307 99675 94769 88455 90322
8900 90322 87012 84110 96366 110061 105798 104983 120140 145029 167106 162479 132081 99973 83267
8887 83267 112465 136492 139424 132487 118369 99596 67130 34432 33003 38152 50368 61418 23442
8874 23442 31838 74055 75907 72490 84217 81566 75502 74264 96965 114751 105896 130946 136335
8861 136335 128695 147790 168536 167365 157701 163592 156717 163690 148784 131573 100694 98138 94572
8848 94572 87645 56907 35838 12747 46214 69472 71363 89038 97987 98876 75928 54217 78632
8835 78632 94550 84730 96686 110112 139185 128918 78586 42735 62597 85306 80521 63297
8823 63297 65271 84867 89484 98513 99560 85756 98079 67953 103938 124050 126328 132662 124370
8810 124370 117456 116765 100946 80167 45568 52903 49830 43127 62885 74974 93510 99397 94969
8797 94969 94526 110649 100823 96616 78316 58478 56600 59483 62019 68859 59114 58507 84268 103313
8783 103313 73113 67212 72049 84006 116576 141700 120600 102641 110473 154761 182138 197903
8771 197903 161480 114488 86101 66469 82099 94159 95567 75062 79628 123989 116024 130911
8759 130911 143688 78223 56391 69424 64355 51130 40900 72433 72697 59977 57551 56648 73032
8746 73032 57827 26262 28044 31826 46551 53832 50778 50541 34366 16894 21986 15358 -9385
8733 -9385 19817 59389 72845 52226 56563 41123 33720 50565 43137 39776 50415 34983 38376
8720 38376 59400 59132 58880 33756 5586 14058 33489 57144 50398 22905 34026 29333 26721
8707 26721 25046 11610 19757 52347 54223 54199 30878 432 -1620 6933 17339 14834 32482 25986
8693 25986 23223 14899 -2219 36020 33985 46206 50723 73158 52121 23826 10986 3627 7711
8680 7711 32353 48910 81499 96797 110893 104168 86179 69428 50096 61236 105109 117789
8668 117789 92276 74427 70413 41460 55685 39406 39205 62270 84992 66337 68459 62465 46191
8655 46191 91368 88843 44973 62060 89689 85675 84989 89337 92364 99835 113320 137447 163439
8642 163439 221713 269436 273309 244942 193478 147704 120371 129653 144938 131800 106364 80263
8630 80263 43745 50848 59188 70403 111080 99131 89125 70072 52555 69366 94525 117388
8618 117388 113735 109504 127115 132579 164232 200226 213672 221279 256180 344233 422248 643591
8606 643591 917916 1008342 950918 848665 723744 589698 523525 514355 572530 669458 665482
8595 665482 658113 640370 606167 539359 532877 550239 551545 528137 490833 423088 368339 359858
8583 359858 377329 328429 270766 251093 225668 225051 197992 173747 171769 182840 179298 179267 188332
8570 188332 193046 221453 250983 304780 375061 462975 624916 954634 1481514 1804007 1720059
8559 1720059 1553712 1333085 1016199 719350 571110 494091 459662 430698 415362 390202
8549 390202 356533 310814 258820 220589 197546 184095 185143 189230 184422 148827 83634 87234
8537 87234 98715 92471 97150 118103 91365 97049 132025 153496 141951 106503 119076 150280
8525 150280 158219 155463 146434 172071 235879 293697 371807 587225 819503 861385 819999 731769
8513 731769 591963 421422 309242 224045 186833 162225 150849 155716 129360 115263 120172
8502 120172 131878 108267 96163 82000 90864 88356 92435 92244 102238 113807 87623 71510 57596
8489 57596 43835 32685 30712 24464 33161 40081 34404 16324 3800 4318 6212 24845 42497
8476 42497 13279 -15597 8896 25642 28047 34950 48719 37688 42411 58482 80976 82792 82642
8463 82642 67996 67009 81468 72215 70261 67250 30984 60257 70124 46774 13686 8066 12449
8450 12449 21912 31166 31711 19288 39160 55927 29727 -3992 -13018 17720 22126 23067 37639
8437 37639 48305 31808 11745 -5998 -6595 32332 40491 17048 33489 51591 30973 20936
8425 20936 7814 70 -12085 -1256 -2717 -14170 9545 17043 43391 75971 74114 65331 40768
8412 40768 28101 29841 52063 34775 8002 25688 28140 8579 -4624 1142 28344 57214
8400 57214 50816 32943 46019 48417 61383 28209 -7358 -752 23093 12705 -14077 13387
8388 13387 7271 9919 7723 -16961 16768 17992 -6762 -12595 -16307 -5301 -5675 14164 16274 6480
8374 6480 42694 38684 11523 12139 28375 -11767 -29097 -12523 -2558 3552 11414 35986 37822
8361 37822 935 -3627 4036 -33325 3934 19535 23533 28143 15742 7081 -4311 10851 20938
8348 20938 18876 17169 14801 857 14725 58441 49768 31739 27248 -16039 -33888 -19042 -18624
8335 -18624 -15917 16274 12039 3618 -9010 -8814 15348 36208 24217 -21188 -8169 4094 10354
8322 10354 26734 44360 53094 53112 50989 54500 57421 58293 41457 35956 53881 67798 67076 39426
8308 39426 20461 -2509 5789 8127 6234 14115 2636 19207 35051 26335 26279 48946 53886 47705
8294 47705 49433 33643 13110 7923 5085 16727 30084 36299 34907 41601 48980 57073 53137 73791
8280 73791 64827 30597 13630 9107 -9667 -15125 -2801 47757 46232 12259 9706 49601 26632
8267 26632 -6369 1530 -6809 4003 2589 -10117 -7648 11001 -399 -30885 -14761 28553 25846
8254 25846 33462 42369 46761 48757 51892 37994 21871 11980 -582 -10905 -21511 -6150 -3848
8241 -3848 21122 6331 -9754 221 22191 48119 46607 32586 71700 78908 56626 19682 -15079
8228 -15079 1846 30969 22244 7054 -7114 -22455 3717 12594 982 11350 2665 21282
8216 21282 34664 46109 44620 28139 23673 1203 -18106 -28383 -30027 -5668 11485 5152 43024
8203 43024 63735 49928 38494 20754 34260 43575 11243 -5320 -11051 16974 28836 -10634
8191 -10634 -4180 31651 54200 65531 27838 7156 18823 21039 1831 15510 12144 11523 6312
8178 6312 7326 5986 51613 76676 65405 58787 25570 -1881 8984 26419 13366 -18537 -9530
8165 -9530 6408 18345 32644 34980 27672 -4186 -9609 -1218 30416 63773 65959 58526 29520
8152 29520 40476 55246 11382 30010 58652 82795 107190 97458 81438 61759 76263 71384
8140 71384 47403 34662 42000 39770 33555 38552 36531 21067 20607 16585 21275 40600 51787 48049
8126 48049 53922 66424 49800 52700 71696 41558 41439 64574 75016 63281 37601 69300 96350
8113 96350 54336 12424 8443 18669 39852 13068 43456 45287 58987 56634 40278 45639 51831
8100 51831 52714 55594 38229 -754 -34262 -4616 5709 -20904 -26215 -27777 -6030 10663 -9711
8087 -9711 -30852 -42144 -20438 -21250 -30258 -21427 -29285 -13861 -4742 -12587 -32006 -16685 -11486 2288
8073 2288 4350 22929 25110 41708 32162 18375 16878 16693 27598 32411 40047 16118 773 23182
8059 23182 48131 19361 10755 -1434 1480 18374 39295 41477 24571 -731 890 9159 5118
8046 5118 -5743 16161 34390 24130 10022 -25576 -22078 23985 -5757 -41590 -43161 -41449 -24621
8033 -24621 -22442 -25140 10847 14084 25430 23571 44316 38255 23217 27004 54579 46595 33860
8020 33860 17932 -3978 23352 47608 60559 42331 45595 59427 22869 16958 27690 38822
8008 38822 55707 80149 75949 48764 50143 20697 1512 5031 19994 32255 -1469 -11987
7996 -11987 10821 39088 51884 61779 77359 92782 70460 47797 35201 16350 9238 -5038
7984 -5038 2651 21822 15300 6537 43824 30605 22972 53598 54121 24270 2234 4936 15049
7971 15049 19332 22735 23426 32697 31158 10987 21799 37646 49628 70766 80154 89711 79833 44188
7957 44188 32480 28372 20548 22317 30907 42794 42994 46771 56941 44289 31664 32930 43827
7944 43827 39687 45192 26178 18608 11699 25368 14938 16172 74367 93095 44280 35645 66266
7931 66266 96584 71147 42741 40156 19639 32696 57273 78019 60813 23797 6846 39751
7919 39751 28637 7024 -5928 3510 -4304 -9116 12946 30255 70027 68865 52474 65955 55658
7906 55658 51478 30194 27939 33054 38434 26677 30286 23546 12120 15204 17966 42714 26071
7893 26071 29921 41611 28643 3078 -3250 15799 48519 31568 -3661 -12249 1618 7173 37348
7880 37348 61555 64337 55843 40919 61748 74592 26666 -8922 33597 29118 37250 53186 41881
7867 41881 6968 -15277 -49345 -74044 -49590 -22191 13182 21633 44539 29166 27117 52803
7855 52803 30674 26620 21057 25114 31276 9689 14550 22762 4572 3306 2037 -10701 -22035
7842 -22035 -33554 13553 13627 -15524 -15300 -10234 -41236 -53700 -34318 19101 6973 -1610 -30381
7829 -30381 -53222 -24241 -5273 2059 -2351 -40019 -40483 -3645 20160 36826 16586 3637 -13834
7816 -13834 15572 10444 -6045 16144 14049 8700 40265 49211 45904 68165 62211 44094 30284
7803 30284 1179 9879 68579 61774 51355 18001 -14143 -28306 -39043 -46250 -69400 -60896 -47839
7790 -47839 -53549 -33592 5726 29637 24036 25314 14326 -4794 1503 -21272 -5437 32533 49077
7777 49077 58924 47979 29090 38525 33278 42000 21356 11206 5866 -2806 -8695 20772 17766
7764 17766 6671 23144 35454 34553 36587 16578 -35131 -8505 10259 33584 43364 23659 -22170
7751 -22170 -31299 -17193 14132 8193 -7221 -1652 58985 70118 99617 63256 45752 7171
7739 7171 -16789 -32118 -34787 -7203 -2062 -27067 -21653 30804 10078 -9104 6662 -19594 -52517
7726 -52517 -59191 -65626 -63911 -36750 -3586 14822 -26136 -33650 4887 1862 -8310 2944 -11809
7713 -11809 -10376 -29220 -22309 2665 16362 29139 26336 2123 -13051 -21500 -17409 -14035 2403
7700 2403 25013 37394 50895 26192 -220 -10331 -22046 -41728 -25474 -13341 -14789 -16029
7688 -16029 -14633 3215 3461 -5718 -29849 -46184 -49183 -50292 -34313 -13425 6693 19689 13081
7675 13081 -16562 -56204 -76338 -68528 -67942 -63476 -34963 -38820 -42603 -22426 -29636 -10668 6025
7662 6025 12757 13691 17523 34221 41513 24463 -14512 -20900 -8312 14441 4320 23969 14668
7649 14668 96 -14535 22741 58513 39058 38491 47746 27653 23178 41250 14460 -19228 18136
7636 18136 32377 13339 -8083 -2284 13611 9070 23757 11181 -11991 178 -3457 -674 -1898
7623 -1898 -28722 -24405 3414 2996 3029 10585 17727 13045 -21780 -25160 11457 23854 21911 3451
7609 3451 -1352 9409 23546 15867 11002 22127 5319 602 11279 7247 34559 32507 10308
7596 10308 18309 13130 26927 -17858 -38832 -41327 -24330 -41538 -34119 -17905 -24395 -14851 -15290
7583 -15290 5187 -10016 -12899 -30492 -4565 17548 -12533 -49119 -32574 -23662 -37659 -30031
7571 -30031 -32217 -29114 -30826 -23380 -2061 -3994 -11292 -9109 -7769 -2545 20090 46527 42820 36717
7557 36717 5514 -10054 -48686 -29833 -20356 -5800 23047 17685 32615 16512 -7205 -15335
7545 -15335 -45036 -27278 10321 22220 5434 6635 5991 6337 10136 50503 80976 82156 40662
7532 40662 29695 32946 25724 11613 900 2474 1509 -6250 14591 6535 6869 39078 44154 22185
7518 22185 7082 7360 21513 32298 28943 13976 486 -22553 -23509 -21901 10203 29518 44344
7505 44344 46948 34260 11227 15470 -17808 -14376 8996 -28619 -52877 -43222 -9250 10696 35293
7492 35293 53240 87551 92046 75373 86244 58347 26423 26147 -574 -25286 -24513 -38220 -34195
7479 -34195 1475 3386 -16693 -25518 -23426 -22555 -22581 -25981 -17233 12188 15199 35264 33754 11909
7465 11909 24444 21844 19076 21269 19823 9728 -3789 -20501 -24268 -45284 -10648 20159 -9717
7452 -9717 -17823 6875 43012 19325 -26604 -60681 -49935 -48242 -65757 -63797 -54262 -35422 -22887
7439 -22887 -15768 20725 -1975 -28853 -42053 -44859 -4039 4791 18789 37197 35555 23563 12808
7426 12808 23430 58786 54336 55901 32666 25873 44254 39015 12971 -29853 -57478 -28069 -3005
7413 -3005 -17048 -14440 -20773 7364 32246 19631 14016 31521 35013 18324 -7746 -25154 -28199
7400 -28199 -43371 -31280 -32837 -15457 -3993 -8995 -28942 -1341 7139 12045 223 -7109 4278
7387 4278 -9347 -35721 -5140 57342 57574 9303 -36894 -30903 -6015 18533 -8231 7674 15607
7374 15607 -20396 -42368 -31238 -12314 -33538 -44770 -49206 -53701 -17565 -7362 -28694 -33216
7362 -33216 -20403 7734 -3541 -3313 28263 45399 21366 -5343 -11215 -7387 -25428 -10729 -8333
7349 -8333 -37384 -44530 -35970 -57010 -31459 2314 27943 31052 32936 21376 11923 11377 16556 30338
7335 30338 42496 27706 19541 10921 13582 -8438 -9883 21509 54303 37632 28421 14546 -22017
7322 -22017 -11291 17956 16768 -20503 -23215 -5995 -23138 -31474 -12635 4045 1633 -758 -21425
7309 -21425 -21165 -20165 -29788 -10011 36944 36219 19069 237 10247 7469 -2814 14879 -8145
7296 -8145 4331 -6158 -5371 -29711 -14682 -4491 -10054 -10231 -3342 -18887 -29791 -7047 35133
7283 35133 10445 -13396 -17205 -31827 -39127 -18482 -29247 -12615 -6747 -17161 -20846 -4025 -8730
7270 -8730 -2294 10132 30691 51704 75092 74770 70973 42307 28272 356 -5615 -6382 -9118 -20905
7256 -20905 -15184 21249 49520 38309 6061 24226 29324 5433 17940 18310 23331 33786 31819
7243 31819 2247 11313 29254 15858 7409 -11155 -10979 2337 13946 33934 16781 4283 15437
7230 15437 56300 54252 24783 22795 15241 31644 31695 30429 -3218 -24615 -44436 -41221 -40776 -2749
7216 -2749 698 -28936 -40378 -47842 -46639 -50748 -51754 -62746 -59226 -68827 -54568 -52952 -52558 -41426
7202 -41426 -52752 -78890 -81458 -90261 -74437 -33854 -2785 -16466 -26671 -35203 -40262 -10448 3121
7189 3121 -14784 -17710 9834 -2158 -44748 -58552 -20801 3675 -29916 -28475 -37301 -24353 17989
7176 17989 18239 5761 1379 20418 15426 6265 -1844 -24134 -25388 -17580 -16335 -17284 -14744 8442
7162 8442 33382 37243 22525 -4797 3542 -41886 -60258 -49533 -40014 -21733 -22242 -38962 -21974
7149 -21974 -3900 -3319 -22839 -15503 -2491 15793 40251 23905 21913 25857 52132 59034 37052
7136 37052 22624 16419 710 16382 49466 38928 -23508 -22732 23571 15946 -16102 -26021 -32060
7123 -32060 -41950 -45060 -32738 -14094 29738 17671 -7989 14452 8068 -10478 20044 17153 10907
7110 10907 7177 34790 32834 33559 29622 28235 25202 11727 14451 13448 -4861 6980 -11567 -17476
7096 -17476 -43407 -47207 -67577 -72776 -37513 -21400 442 30523 21288 -11287 -17458 6189 -3039
7083 -3039 -1592 -7205 -19290 -5033 -11524 -12236 25372 28107 34465 34030 21771 29649 5189 -6782
7069 -6782 -22337 -30280 -16347 -36645 -12365 8324 5721 -19491 -41249 -68643 -77702 -58043 -5897
7056 -5897 1072 21524 12668 -2082 -15451 -8060 677 24315 8299 -2476 -45652 -56383 -41145
7043 -41145 -21785 23026 63704 62261 39636 27100 5979 -9553 -16628 -6095 -7007 11820 12144
7030 12144 -9518 -27228 -16760 4675 48259 65888 75001 58599 21723 -1303 -40748 -44908
7018 -44908 -46217 -43062 -42263 -35509 -20673 -11376 19695 47664 60587 48998 39367 49844 53486
7005 53486 29293 -11620 -12755 -33801 -39389 -45012 -41940 -43847 -54852 -49572 -47283 -54971 -52824 -52321
6991 -52321 -55833 -24577 -13243 -25241 -23606 -30636 -17634 -2324 1632 9242 16973 40327 38383
6978 38383 33770 4779 -9114 -32261 -53516 -33850 -20565 1943 -21269 -13568 -13797 1105 23983
6965 23983 15119 -5659 -14746 -13231 -12483 17300 23840 6226 9247 9527 -4498 481 12377 12206
6951 12206 37290 58465 46955 6855 13364 -15226 -25116 -16913 9311 1954 1789 16987 12771
6938 12771 16351 -5809 -12417 23197 58750 18876 4427 -26206 2427 12165 -18171 -16487 16463
6925 16463 31280 36684 23147 31985 21101 -4110 -8964 10701 43580 22163 7973 4345 -1675
6912 -1675 -21520 -29743 -41605 -33285 -9140 -13714 -22950 -47966 -61507 -31388 -16707 -16450 -11499
6899 -11499 -15340 -14562 3242 997 1840 15453 29168 40646 61483 61072 61352 79022 68598 42549
6885 42549 47384 52194 31947 12196 -3742 12695 25454 10127 13827 28165 21865 1343 -31762
6872 -31762 -44755 -70156 -24869 11543 25145 18337 -2087 13384 15639 5579 -3415 -9131 -35327
6859 -35327 -27333 -18001 -27249 -15841 -13831 4223 21409 39087 -16481 -20640 36293 32928 -8254
6846 -8254 -16894 -3222 15480 -3781 -20282 -35891 -36536 -9794 4523 -22147 -1638 -31998 -68423
6833 -68423 -28716 -45249 -38664 -13555 -97 -23669 -11985 -4878 -3953 -22024 -32489 -20258 -12870
6820 -12870 -5513 28740 35412 5601 -19944 -1260 23677 -15156 -19510 -25062 7491 6469 -16939
6807 -16939 1362 17117 -5378 2152 50746 89072 49453 -2212 839 14832 22717 46740
6795 46740 38835 -8706 -26683 1353 37219 40911 22975 -16835 -24766 11781 26952 22449 17744
6782 17744 17745 26318 18770 60355 47884 31106 19369 3507 -7799 6291 43337 31904 -1019
6769 -1019 -1735 603 -415 -5420 -14154 -8085 -1160 8680 -4499 -12267 4885 26253 41642 50896
6755 50896 40667 46111 39346 44710 32039 6545 17843 49775 52390 43507 51991 50115 38933
6742 38933 -7729 7565 11608 12995 12644 -23910 1176 31232 -20119 -33035 -21391 -16278 -11291
6729 -11291 3138 12933 26407 19776 15442 17624 35796 52926 58160 52915 51844 12985 -26255
6716 -26255 10380 33569 53172 71757 52715 42268 25159 16724 24024 17855 -7760 -9806 -15598
6703 -15598 -32664 -18540 -25185 -42509 -26851 312 -28364 -26079 24356 44393 43938 23083 39732
6690 39732 56567 60097 63118 63297 71040 62742 48812 20711 -18823 -35158 -41401 -21843 8015
6677 8015 22228 20339 11822 3469 8339 16335 40621 50140 20524 31264 40237 23838 17060 -6654
6663 -6654 2620 12347 5860 1148 2412 -8061 -30358 -50088 -58049 -54827 -38608 4116 11574 -25303
6649 -25303 -17056 -18996 -54518 -60024 -53345 -31487 2221 13726 2020 -23537 -23602 -9381 18344
6636 18344 22162 -5021 -8058 13639 8272 -818 -21935 1469 -672 13391 -1897 -12923 -39489
6623 -39489 -3217 33521 11037 10197 34279 24327 -8940 -16839 7713 24213 5273 -42065 -29750
6610 -29750 -22085 -22312 -40490 -42377 -30616 -18643 7579 56100 48166 23801 -419 -36647 -39732
6597 -39732 -24686 -10679 -8602 -3083 -6476 -19336 15430 37103 34230 26332 53328 63591 64251
6584 64251 26836 1892 19571 35503 14879 -49855 -61200 -41976 -33993 -9217 -3489 -15928
6572 -15928 -21676 -4212 16079 34112 48869 60538 57165 29380 20551 49949 49555 -8807 -26487
6559 -26487 16863 17118 -11153 -38444 -37364 -41036 -21805 -10639 -37108 -46933 -33953 -52015 -51179
6546 -51179 -16948 19131 -14813 -53395 -57248 -8188 13469 7121 13464 38595 39359 36224 4956
6533 4956 -10698 -1434 -6891 3587 -12162 -14148 5548 -9942 10224 23559 38905 47690 32499
6520 32499 4414 14557 3589 -20749 -47221 -68902 -61351 -47519 -55751 -18695 -2598 -1484
6508 -1484 -8681 -10824 -6989 -8379 -3519 2912 470 -14964 -18991 2403 38642 31391 6797 13269
6494 13269 3360 -6631 -13250 -17040 -9627 -2410 7074 -4632 -5777 21939 5479 7036 35179 46727
6480 46727 55968 39987 888 -19571 -8990 8790 3732 -5384 -2863 -9441 14705 6438 -2740
6467 -2740 7187 -43366 -57307 -57128 -46967 -42731 -37318 -27090 -9928 5883 7576 9612 15263 71
6453 71 -35154 -22211 -37757 -48838 -60776 -64115 -52305 -46669 -43390 -25873 -15814 -34452 -30777
6440 -30777 -8074 624 -6354 -12875 -11068 2449 -5317 -20665 -7950 27628 36268 38211 25720
6427 25720 12887 9524 31698 27862 -9567 -29037 -27960 -18550 975 23940 22930 -3230 -7562
6414 -7562 -9016 -13619 -28858 -27359 -7218 -23283 -24586 -30629 -26512 -13090 -12992 4760 22854 11600
6400 11600 18097 3182 4830 -1805 26848 44364 20778 -8643 -33408 -57333 -70168 -38051
6388 -38051 -17807 -20309 10684 14307 21213 31959 21409 34038 64938 56957 32632 -4218 12866
6375 12866 6969 -27768 -58901 -63184 -58535 -16978 -11080 1789 6430 33900 14587 -18796 -31009
6362 -31009 -42423 -51601 -40339 -46566 -36516 -27474 -29490 -19879 -6120 -9314 11509 16769 5815
6349 5815 19888 37523 17810 24806 60376 59672 23123 -752 -11972 -23102 -36480 -46700 -31177
6336 -31177 -24850 -20272 -11162 -17664 -30476 -4521 17211 14185 -22013 -85134 -92941 -70335 -44419
6323 -44419 -45831 -22568 8757 -13018 -44500 -31825 4709 15392 28987 11364 -2673 521
6311 521 4482 -6049 -16298 -35326 -37207 -35049 9660 9891 13664 -4502 -44066 -25804 -19439 128
6297 128 5346 14171 10840 -11259 -6739 5924 -15291 -2423 -2423 8456 -3924 3567 17659 15283
6283 15283 4872 3328 2339 343 -10556 10323 5226 -11565 -9516 -17540 -7218 20982 48328
6270 48328 28561 27759 27843 37325 34130 29168 21354 25090 19598 15598 52079 61204 59364 66205 86196
6255 86196 74761 30213 26872 30563 9412 23730 32272 10932 -21137 -12883 -5145 -13552 -7566
6242 -7566 -1532 20517 29648 22992 34421 54347 41399 23973 -36123 -59304 -54214 7092 38789
6229 38789 25176 28474 -13386 -1220 29604 23616 -11580 -18334 -27514 -9632 23656 31465 29888
6216 29888 35117 -17492 -48653 -40650 -21167 -29799 -7195 8648 -15981 -28184 -18687 3092 5486
6203 5486 -18784 -48676 -34865 -21415 -38027 -33476 -29881 -38756 -20313 -11365 -8137 -26906 -43614
6190 -43614 -75091 -54241 -42094 -42929 -40567 -62919 -77541 -37138 -14487 -18227 -32711 -25330 -20616
6177 -20616 1722 25008 -7787 -19602 -8515 17305 37187 -4549 -12516 -5980 -5722 -24969 -47207
6164 -47207 -50680 -22109 -36226 -61464 -68091 -68632 -43727 -31550 -25555 -9804 -26941 -50327 -52352
6151 -52352 -50774 -35320 -13297 -23919 -35247 -3367 10171 4133 -10343 -18078 4529 13567 -4910
6138 -4910 -2576 23041 35714 33416 -180 -33376 -32098 -8515 33190 26880 -15858 -4900 -8862
6125 -8862 9464 27023 28131 24615 15729 28237 28675 9988 -34542 -42980 -15422 -2679 -15654
6112 -15654 -21970 123 8846 57637 59328 38843 6683 -1528 6099 -4050 -14493 -15687 -16712
6099 -16712 -28776 -31333 -13953 6909 -35 -9464 -33025 -25311 -37025 -66952 -61804 -16718 8156
6086 8156 12148 14359 18603 28176 11882 17254 3855 -14138 -48687 -46256 -32584 -18425 -31707
6073 -31707 -27000 4745 8679 20385 6117 -5328 2856 -3847 9456 46741 53151 20795 11042
6060 11042 13520 4675 19347 14489 2708 -18622 -42596 -54466 -52096 -31233 -12617 -4064 12910
6047 12910 25786 21631 -7048 -29050 -27500 -7574 12836 18973 9584 17428 19628 30974 25706
6034 25706 8277 19187 15663 -18247 4848 -10814 6553 60000 58694 22310 -1801 -1979 25921
6021 25921 22992 9648 15202 27774 29907 27668 925 16908 45928 31548 1895 13461 35580
6008 35580 32028 12222 27112 61552 33262 -4407 -9070 12865 4660 -12729 -20756 -11953 -30459
5995 -30459 -26946 -5457 9833 13125 20590 2539 -7414 3468 14275 10526 -12824 -38895 -46654
5982 -46654 -36955 -23062 -49564 -59858 -14374 4432 14211 32240 33627 46276 35909 11921
5970 11921 12240 44268 34704 6449 9286 -24909 -54672 -34491 -13224 24584 23035 15035 14544
5957 14544 -36262 -30133 -6126 1937 20634 9566 -15459 -25435 -13495 5473 20393 -13194
5945 -13194 -9880 27140 22527 32483 45868 22500 11093 -17991 -33066 -24633 -7191 -27880 -32269
5932 -32269 -28250 -20819 -23642 7287 38253 40006 5353 -5014 4451 40848 37471 42951 42188 32948
5918 32948 43064 42188 23921 21362 49691 35999 21811 2433 23532 7943 -14214 -27255
5906 -27255 -38111 -27277 -24519 5580 14881 -15555 -15783 11482 14449 41220 59031 16481 7711
5893 7711 17346 11765 16732 46421 39340 36172 23238 12056 14764 42227 15484 8123 10590 -11175
5879 -11175 -20120 -35053 -6186 37600 34074 29804 34349 26636 24039 22048 29180 16486 -7196
5866 -7196 -973 11505 8168 -4813 -16847 -16997 -20421 -1324 11368 15726 17975 29731 41615
5853 41615 35477 10736 -24079 -35125 -17446 -14857 -11427 16454 -9827 -18987 -16023 -15583 23605
5840 23605 29391 26186 35123 13671 -5298 -33963 -25290 -9693 20166 22389 24213 7308 -17786
5827 -17786 -1040 22088 6494 -15022 -17536 -7692 4246 16896 21793 -1849 -43631 -39062 -6601
5814 -6601 8488 12351 26294 18253 -51 -9322 -23441 -51664 -59243 -47608 -24835 -18745 -22909
5801 -22909 871 22012 5822 -2752 -10124 -28806 -53008 -29741 1358 21310 31952 -10679
5789 -10679 -44479 -24889 -12695 -4417 -14759 -20599 -29229 -31915 -22748 -36936 -51035 -55951 -68794
5776 -68794 -71972 -52057 -36324 -28560 -15461 -17694 -4939 -2772 -10697 -17397 3489 -17404 -20739
5763 -20739 2226 3491 -22901 -33843 -33436 -15950 -11407 -23318 -20701 2534 9804 -14337 -7353
5750 -7353 -15919 3037 27384 -5346 -34065 -17645 -17697 -10768 4867 -8604 -12961 -20591 -30173 -37401
5736 -37401 -36008 -15544 12031 37779 28167 1304 20006 15496 13304 17561 27458 -202 -35930
5723 -35930 -39106 -23192 -25220 -23432 -17902 -17944 -19608 -29555 -57647 -73121 -40166 5820 23386 -13376
5709 -13376 -2591 22773 17081 9026 40478 20755 10001 19161 30672 47048 15671 -13248
5697 -13248 -27972 -15337 -19066 -21689 24469 33752 30839 -370 -28621 -26512 -11188 4058 23795
5684 23795 1871 4257 18558 6096 1098 -22422 -31370 -43482 -28250 -5220 26785 36592 31434
5671 31434 12951 20872 41232 16518 31351 19009 22857 26822 36946 31925 45749 52727 37615
5658 37615 6383 3452 1678 -2923 439 2817 5508 26001 38986 37868 26746 -6050 -24742
5645 -24742 -37372 -40079 -26782 -11989 -14943 -7121 4430 5091 6968 16579 -16471 -26365 -5589
5632 -5589 -10374 -36713 -31304 -2319 6525 9767 -1785 9741 10575 19941 17524 13643 -1068 -29354
5618 -29354 -35382 -5765 3844 -19638 -23298 -10923 15345 -10699 -3151 10044 -356 -12446 7699
5605 7699 31082 24561 16102 -20746 -9555 11703 11206 2509 -9643 4050 8140 13152 8900 5311
5591 5311 1352 8157 24637 20984 -17784 -35662 -24876 -15947 -5439 -5258 -18618 -35715 -16065
5578 -16065 3491 -6541 -4145 -35039 -23030 -2894 -3178 11005 7279 -25858 -39054 -46013 -26387
5565 -26387 2168 -13009 -20462 12344 37675 38244 22031 -364 -23847 -3489 28934 38957
5553 38957 -1913 -14758 -18448 -8353 -1456 -23718 -24033 -11888 10502 18556 36758 32961 29886
5540 29886 32051 30273 32787 29151 -9845 -49798 -61024 -54819 -67677 -40533 -36043 -34403 -14802
5527 -14802 -28015 -21286 6089 10148 30082 22612 32020 18482 -462 -7118 -6199 4952 7258
5514 7258 3550 16843 25776 5094 -9855 -38644 -40006 -35608 -35405 -40437 -54534 -51169 -17908 -15608
5500 -15608 -34377 -44075 -40221 1484 27787 -261 -24501 -32011 -39340 -21345 -10587 3692 -15812
5487 -15812 -10620 -20375 -31892 -38930 -10113 29520 44152 31640 15295 -1825 -43739 -63560
5475 -63560 -40499 -6886 28969 47631 38742 34262 12697 7271 6781 30133 60559 32097 -8592
5462 -8592 -12547 -7624 9875 30324 40165 35615 47797 81207 73275 50810 28222 15270 39989
5449 39989 38212 19519 -2212 -9145 -10035 1873 32836 57035 53823 58847 45116 20839 16979
5436 16979 31368 45504 30094 779 7175 -4776 -28020 -16575 -26224 -44806 -37972 3295
5424 3295 5363 29043 55223 25858 -4071 13443 4534 -37525 -34865 -19306 9792 20608 38271
5411 38271 36463 2876 -19645 16446 18297 -3348 -333 7430 -2920 4652 23691 22680 -1510
5398 -1510 -37208 -80004 -59559 -37693 -35991 -28917 -7496 -13983 -57145 -67401 -71088 -58641 -49150
5385 -49150 -43398 -15623 4829 8653 13674 -7245 5499 33410 40931 10967 -35271 -54628 -13204
5372 -13204 -19078 -23573 -15133 -46601 -58049 -28681 -18919 -27158 -15019 -41367 -59169 -24584 11960
5359 11960 -3183 -23117 -39755 -40594 -17594 -9644 -15173 -27888 -38789 -18319 -23428 -13982 -17594
5346 -17594 -12874 -11124 -1806 32341 59602 51934 16355 -15118 -5454 15463 26948 4335 -14911
5333 -14911 -19689 -28199 -20254 -15471 -23801 -28990 -42250 -37554 -30157 -39072 -68334 -62034 -14417 -14916
5319 -14916 -30557 -40668 -64995 -58540 -27958 -43819 -43125 -31149 -45494 -29595 793 18841
5307 18841 3634 -10272 -28300 -36979 -9642 31822 38270 48796 25311 22799 16198 14624 25016
5294 25016 9458 -22305 -17971 -26696 -38078 -13066 -1582 -19288 -3180 33904 54027 72113
5282 72113 61808 52212 23929 5635 6756 -3514 -20255 -41057 -53451 -47003 -26743 -31373 -2606
5269 -2606 -6444 -26431 -27146 -12637 -27813 -17193 -10327 -11955 -25490 -39535 -38313 -22231 -37291
5256 -37291 -10966 6200 -3553 -8903 8876 1821 -15095 -32920 -36520 -18903 -3219 -11541 -28613
5243 -28613 -26888 -41166 -59621 -72435 -57770 -30587 1071 2263 -13233 -21601 8191 12932 5072
5230 5072 -14858 -39102 -29383 -17664 -35782 -65126 -56810 -35992 -33937 -1054 7893 -22424 -23132
5217 -23132 -22450 -28289 -7821 -7132 -32875 -36364 -23597 19966 25608 -3290 -18696 -45237 -33211
5204 -33211 -43780 -51121 -37474 -40089 -58690 -54863 -25352 -27129 -37664 -12739 -14038 -9813 15559
5191 15559 15622 16497 9180 19498 48288 37499 65149 60595 28486 33926 35508 18291 -1431 -13937
5177 -13937 -32208 -50037 -45379 -58000 -29578 14371 6430 -2444 18550 23143 7207 16006 46936
5164 46936 40242 34373 12997 7731 24422 33446 27479 20370 33372 19338 1354 -6688 -11713
5151 -11713 -19313 -27750 -30513 -27548 -363 15180 -9229 3940 -7978 -36053 -56229 -57189 -26916
5138 -26916 -1067 22744 39601 10579 -7293 -15784 13232 30066 41899 21929 196 -1724
5126 -1724 3810 779 -6490 -16048 -18203 -8727 11149 8864 23213 13774 7508 -11778 12382 36057
5112 36057 38341 34898 43388 58441 63747 49393 27330 8636 -18692 -33231 -50311 -73946 -43343
5099 -43343 -13757 -33179 -15935 31253 45325 15481 24380 16746 3222 -28341 -22886 -19502 -33534
5086 -33534 -23345 -37103 -33818 -21398 -37076 -26303 -29208 -45655 -53743 -31313 -38457 -54704 -21120
5073 -21120 -14708 -21661 -59605 -46571 -14045 -32545 -27003 -36182 -38419 -15393 -9718 -14873 -21794
5060 -21794 -17807 -20628 -40005 -40401 -59910 -54156 -51002 -34265 -21968 -29705 -38973 -43727 -45241 -7123
5046 -7123 27123 -1173 -8573 8127 1946 9078 -3618 -8289 -10799 -13629 -10622 -6407 -10362 -36640
5032 -36640 -56682 -72685 -53061 -26358 12756 -20731 -23426 -15645 12911 7640 16100 6660 493
5019 493 -31676 -51661 -55810 -26879 -9356 -22369 -44341 -51114 -55701 -54046 -48074 -65380 -45151
5006 -45151 -38713 -25655 -10678 -16090 -1353 11340 -3536 -45275 -25116 9865 -2624 -26032
4994 -26032 -11928 -25870 -18347 -7773 -19186 -44361 -45970 -30455 -30515 -8029 -6072 -11487 -26339
4981 -26339 -14492 -42272 -58137 -34557 -9049 26082 65215 55043 14896 -4045 1930 -27758
4969 -27758 -32509 -32565 -43705 -6111 10451 3497 9936 -3502 -4069 16444 -13591 -57331 -60086 -25464
4955 -25464 -31888 -47419 -39389 -53523 -56323 -40352 -51426 -58307 -41679 -12677 -13972 -38193 -66662
4942 -66662 -33484 -11334 2575 3038 -20159 -24660 -48612 -68894 -33970 -14275 -5465 -7377 -16292
4929 -16292 -35246 -10722 -7237 -6134 10603 19086 22834 23085 13511 -36612 -36265 -4903 -13775 -6536
4915 -6536 -7455 -27103 -33342 -28328 -19025 -7889 6000 24914 10053 5475 -14226 -28800 -13697
4902 -13697 -53714 -60068 -60994 -42246 -26627 -23398 -26246 -5035 9852 3509 6446 12159 -11074
4889 -11074 -3914 2893 18711 51948 83776 88606 68315 29761 38082 26585 19554 27840 24332
4876 24332 24159 38427 29353 -12123 -7996 -27817 -37462 -28821 -30429 -41780 -32767 -13709 3480
4863 3480 14227 -5569 9191 24892 1240 1997 1179 16136 14643 5011 -4375 -4697 -17536 -13284
4849 -13284 12050 5630 11950 4751 -15185 -48442 -60146 -72650 -54046 2102 19276 4623
4837 4623 -456 2383 -6141 -6929 -49875 -54350 -38437 -38451 -32753 -25997 -23971 12638 15696 37 4980
4822 4980 25784 16107 -16010 -9457 -2396 -8745 -18156 -30410 -20560 -46205 -12250 14618 13715 -8561
4808 -8561 -24536 -32487 -43198 -44497 -35952 -50331 -61588 -75953 -92896 -68063 -25115 1079 -1207
4795 -1207 1993 5387 26961 28232 21058 -5295 -30108 -31956 -22298 -25173 -35757 -55612 -37006
4782 -37006 -18495 4089 4931 17990 -4316 -15204 -30934 -41942 -28230 -14450 -5966 -8494 -1983
4769 -1983 -728 33881 39076 -6609 -26881 -22811 -11506 13223 24034 45136 57071 32991 7511
4756 7511 -15604 -46516 -30553 -988 9405 14096 -8233 -42774 -60733 -7204 15817 -8621
4744 -8621 -11576 6407 33367 37648 37440 48683 57645 38611 12946 -26767 -39639 -16131 27716
4731 27716 43429 20929 12783 5060 12456 10832 -28897 -45800 -43965 -10221 8685 19647 4033
4718 4033 -18083 -17168 -29252 -26190 -2512 -8491 43 -17068 -17989 -12015 -16372 -5517 -1359 -19808
4704 -19808 -19613 -8096 27515 26089 27367 76782 89308 29700 26447 21701 14238 -1779 -32433
4691 -32433 -36214 -21469 7931 18868 2869 -3704 -33839 -36309 -43103 -19082 -24675 -49601 -41868
4678 -41868 -28284 -2980 -21405 -20989 -30639 -25214 -33938 -40803 -64587 -44242 -10640 9106 19477
4665 19477 -7137 2761 5262 -6652 -7218 -17847 -21654 -9596 10857 27194 10168 25133 41021
4652 41021 34657 4202 -15846 -14368 -2701 -707 -8292 9382 20061 31779 18207 16382 -30003
4639 -30003 -66084 -54244 -37494 -30601 -15589 -34551 -21838 -9124 -9246 -20180 5305 20004
4627 20004 27630 23422 9829 -15027 16065 41836 39880 6458 21373 34154 7801 -3856
4615 -3856 -2258 -17470 -15695 -11655 -37110 -39271 -38958 -23284 -43928 -38524 -19836 -20755 -25303 1613
4601 1613 -14638 -41621 -24960 -54817 -42493 -37660 -19267 -15000 -13377 -4299 8851 16996 12164
4588 12164 -26767 -68133 -54480 -18920 -21974 -5505 -16332 -27250 -9435 -15120 -34165 -51523
4576 -51523 -36200 -33932 -36637 -19021 -8942 8892 43380 -1090 -32670 -42359 -23609 -14568 -32003
4563 -32003 -15491 -15826 -21827 -27846 -26054 -52061 -49993 -50086 -50612 -33997 -55282 -52965 -38842 -6445
4549 -6445 -21603 11495 -40025 -40973 -27248 -21946 -46065 -56119 -31389 -28446 4427 28942 16247
4536 16247 21978 42005 48701 59199 50236 42507 49334 45250 38992 29293 40130 28102 15346
4523 15346 -7001 16878 2121 -12319 -10105 6413 26173 38506 36657 33601 28229 -5113 -19876
4510 -19876 -17268 -15833 -12194 -37273 -37039 -18278 -27661 -18710 -19210 -7729 -6616 -12479 -1967 3229
4496 3229 11852 16664 -7474 -14504 -15744 -14361 -8550 12828 34344 7951 -14178 -24641 -68057
4483 -68057 -57547 -39204 -31086 -1890 39292 35427 21369 12863 13134 -1703 -39939 -61733 -40332
4470 -40332 -36025 -15250 -17360 -27606 -21087 -16426 -9412 -27786 -15354 -20657 -28411 -13452 -39582
4457 -39582 -56401 -41718 -15826 6070 23162 28267 15987 -89 -7652 -570 15382 25964
4445 25964 15945 4703 28536 63773 46905 73590 78459 55879 25487 28254 38852 29290
4433 29290 28645 21019 -10059 -35399 -8652 -547 -10126 17840 13368 6781 10104 12991 9005 25726
4419 25726 26931 18030 5722 13016 -9821 -11136 11374 -11324 -17824 -10046 -3046 -3120 12179 27265
4405 27265 28137 -17681 709 10139 -7467 2217 18373 13055 19254 10702 6206 3957 16309 32948
4391 32948 19868 -16369 -21458 -17923 -3551 -32537 -24692 -13573 -13883 -16800 -19921 -4467 1434
4378 1434 -26554 -46543 -39108 -26503 -19503 -19264 -11929 15012 7273 13220 20918 37039 40362 23070
4364 23070 8146 -572 135 -9632 -562 9161 -6135 -20175 -24767 -40770 -35425 -30599 -9422 -10976
4350 -10976 6941 9885 2393 -2481 1714 31482 32376 -4902 -31146 -3470 16871 30283 24925
4337 24925 19326 27277 6225 -4407 22255 3135 4061 14254 -7717 -46931 -57975 -27465 -7428
4324 -7428 4803 -12862 -46611 -48926 -17672 -2326 4784 2688 14378 23399 17537 12406 -2693
4311 -2693 -53102 -72912 -61381 -43851 -50928 -57720 -12024 13501 -1212 -12271 -3706 -15968 -20457
4298 -20457 -7272 1786 306 -7160 -22919 -15068 -13644 11718 13449 8790 -5721 6382 8056
4285 8056 8574 17853 2332 12937 22326 -8305 -11718 -28541 -64277 -73450 -70340 -59391 -38339
4272 -38339 -12660 -38212 -30725 -22135 -24460 -23913 -17842 -21033 -9800 -3136 -8417 2582 -19376 -57307
4258 -57307 -48565 -48484 -36124 -14238 -17860 -32864 -18182 4199 2536 -7414 8207 20940 12466
4245 12466 3220 2524 13533 -8130 -34657 -69867 -68505 -51215 -40517 -27908 -23367 -957 4824
4232 4824 -16230 -38731 -40609 -63790 -71410 -53390 -28433 3723 18278 49 -16445 -25638 -24187
4219 -24187 -13982 -26489 -35121 -10071 17339 45900 64816 12539 -9179 11204 26917 34946
4207 34946 10680 -6092 12318 22672 -9099 -37199 -29577 -46448 -34441 -7776 -39298 -55840
4195 -55840 -38093 -19246 -12941 -34168 -28774 -19768 -66365 -55619 -31051 6540 22578 -30890
4183 -30890 -36615 -7852 9499 6068 21307 -8639 -21418 -48911 -39246 -42782 -43450 -28256 -485
4170 -485 -12050 -27673 -67845 -50168 -25746 -37585 -35244 -13333 -14040 4209 11927 649 -16313
4157 -16313 -16122 -25446 -18426 5217 23027 44813 52728 26042 -30142 -56923 -47692 -12087 4236
4144 4236 11548 24697 30326 35384 48722 51603 49004 41961 32789 39387 29616 11782 -218 -17239
4130 -17239 -21862 -37221 -8992 1304 17661 17922 19068 19746 13261 -9112 7634 55147 37473
4117 37473 1614 16261 35910 16786 -20358 -12808 2537 19988 39221 17589 -12066 -18674
4105 -18674 -20780 -27505 -26591 483 -10022 -22914 -35869 -35461 -23331 -26238 -6391 11545 -3676
4092 -3676 -393 9830 11595 -9772 -23110 -35702 -42541 -47120 -51811 -52863 -33411 -3504 -2273
4079 -2273 19568 26505 42932 45605 19364 -14808 -30029 -51446 -41237 -13961 -11417 12934 43869
4066 43869 31475 2691 -11841 -23546 -24634 -12226 7455 -3117 -31955 -50085 -27710 1166
4054 1166 -21737 -28692 -26231 -40866 -42939 -40979 -43516 -27801 -34244 -37006 9477 29130 5840
4041 5840 -18091 -18372 -20395 -14083 -24156 -18721 -19780 -31032 -25396 -4290 -6429 -5502 3599 12018
4027 12018 13008 19368 -2944 -15970 -16277 -32104 -35690 -17290 16007 53710 52301 39789 18805
4014 18805 -17979 -19886 -13532 -26235 11464 31292 27970 -1634 -1675 25462 14848 14595 180
4001 180 -14243 -8092 -935 10101 19269 -5224 -16974 -1665 19295 -10538 2296 5761 -1859
3988 -1859 -11801 -20565 -17110 -14117 -12901 17968 30712 -10325 -14152 -17638 -1372 16838 11508 4511
3974 4511 -7668 -17246 -12875 -20245 -14424 3951 287 1183 8993 29025 27316 12314 9945 -3084
3960 -3084 20027 10118 -25620 -32370 -8218 3121 19277 4045 14879 14971 -10219 -7541 19048
3947 19048 24778 -585 -33221 -27570 -34187 -14047 19736 33415 -2231 -1889 19882 -22887 -53843
3934 -53843 -15876 -4430 -10863 -11501 -13062 -5192 25564 49899 31721 -20115 -55890 -37723 -7109
3921 -7109 9864 35336 33320 20897 19240 7167 3281 17359 957 -6240 6683 -8080 -29120
3908 -29120 6096 2591 -19823 -34484 -36878 -29468 -41516 -37183 -34741 -2214 -9158 -12428 1761
3895 1761 -7136 -23060 -32703 -15722 -8552 -16005 -10919 -7290 -14920 -26276 -45847 -42306 -39794 -50966
3881 -50966 -42544 -29140 -27679 -38266 -28880 -17347 -19379 -4922 -18604 -19747 6623 2809 8652
3868 8652 23574 -9701 -8879 -1742 -16275 -8183 464 -943 -16607 -31195 -24128 -15396 1963 6882
3854 6882 -16392 7373 37383 23624 -18231 -41105 -18089 -838 -20309 -26061 -32802 -33761 -20258
3841 -20258 -12016 -8559 -17254 -9201 10585 20711 27552 -1661 -36783 -48021 -12755 9982 -16766
3828 -16766 -36419 -30544 -42715 -4849 13889 -4605 9963 22977 41427 34482 16109 4903
3816 4903 -11055 -7223 284 -6122 -20214 12950 22563 -21667 -58249 -55900 -35497 -11999 14024
3803 14024 47041 24664 -3894 12541 70950 78281 40637 2944 -14019 -10378 -9542 7306 9351
3790 9351 17539 28130 32251 25664 2033 -7162 5861 -3966 -20543 -24260 -41463 -58981 -34596
3777 -34596 -30079 -40856 -50394 -11686 -606 -7750 10335 24693 43131 14471 -18252 -35299
3765 -35299 11340 32547 33647 19686 30494 42532 6229 -13593 10484 13638 -31251 -26143
3753 -26143 -19555 -7275 -34153 -39102 -17030 12852 24910 43293 24679 27598 29918 44632 46815
3740 46815 58565 77481 44170 7238 -13562 -48449 -59534 -31889 -20321 26047 22697 -5197
3728 -5197 6592 9210 -11215 -53482 -40602 -17531 -6195 21196 22989 22586 8086 3198 1897
3715 1897 -24486 -53271 -66739 -36971 5729 48348 49892 25504 -5579 -26310 -7940 -5857
3703 -5857 -9866 -20710 -43448 -42028 -41892 -33944 4228 -13124 -43502 -33913 -33868 -37791 -35761 -21082
3689 -21082 17601 10202 -19844 33366 43815 3850 -2267 10366 45222 47654 45804 49612 40041
3676 40041 6610 -5049 1729 42829 41262 7472 -3911 -15288 -15297 -16446 -2512 -14207 -35380
3663 -35380 -36380 -52689 -51903 -46037 -13463 -12046 -6072 1661 9100 21792 -18745 -52665 -69814
3650 -69814 -47767 -38987 -55278 -52623 -46448 -49029 -31428 -42200 -23832 -1520 -10826 -49421 -50657
3637 -50657 -10553 15648 18556 11350 10812 8435 7968 -22762 -37509 -35120 -23408 10801 4662 10674
3623 10674 36507 37295 22710 24721 24771 28000 12627 -14264 -1259 15530 7503 -2542 -11663 -26866
3609 -26866 -4384 5501 15674 29265 8037 2412 9629 17795 17390 5333 -20368 -13454 -13471 -18955
3595 -18955 11631 -16282 -44901 -22029 3671 -8837 1781 23816 31953 32939 25925 19381 -22289
3582 -22289 -22357 -27420 -7716 13047 12663 -4795 476 5232 9910 2202 -6457 -32750 -54317 -46479
3568 -46479 -23761 -6386 3708 10410 4049 26310 20129 -14812 -41039 -31834 -4348 27167 30839
3555 30839 6192 -3371 -20120 -38160 -7168 10320 -5873 9411 25433 13900 -8869 -31146
3543 -31146 -17151 5139 -17459 -51635 -32126 -11460 -11677 -9239 -11604 2982 35205 25102 13664
3530 13664 -4533 -2851 -7626 5887 -22745 -21555 10167 17864 -5602 -13337 -3487 -3738 -9558 -11594
3516 -11594 2225 -12353 -22016 -36730 -49815 -36078 -20193 -29684 -36880 -31945 -37780 -34821 -21051
3503 -21051 -19767 -15897 17090 -5065 -14980 6713 26502 26169 26619 -1559 -32586 -16851 -9609
3490 -9609 -6980 -15508 -8664 2659 12698 33530 37936 46364 40197 36326 26767 44526 45025 54875
3476 54875 42661 5437 -8504 -17715 -7550 -6768 -28497 -11163 33796 -7276 -33495 -42985 -45190
3463 -45190 -16253 1128 -13400 -17335 -9154 -3734 28109 39570 46346 43564 36330 15691 28304
3450 28304 29004 8657 -13837 -30768 -36251 -45940 -25876 -1071 14924 42167 80416 48387 17066
3437 17066 38292 14466 6849 -13376 -23422 -9866 -7939 40600 27137 16048 14221 11018 2927
3424 2927 20421 31195 11598 -11107 -24349 -25612 -22392 -31696 -43986 -40909 -5171 -42553 -62394
3411 -62394 -49423 -34766 11396 -21009 -21857 -4562 32890 33204 17139 11551 12100 -8084 -16936
3398 -16936 2788 38291 40263 21997 6970 -442 -14212 -8325 7668 17408 37340 9213 -12959
3385 -12959 -42770 -28793 -30008 -15825 -13628 -35873 -47827 -62701 -74509 -64866 -15369 30756
3373 30756 26296 -16184 -35871 -43868 -43211 -29631 -17005 -10702 -11178 -30867 -50542 -56964 -24512
3360 -24512 -39609 -54791 -1125 16532 20688 -9394 -51914 -80941 -45945 -371 2877 -7881
3348 -7881 -230 -11921 9116 9567 -11159 -34260 -39814 -29388 -19229 -18724 7794 34977 41856
3335 41856 20100 -2983 -6618 -31990 -40381 -37142 -6658 -7851 23390 39750 29282 1757 7162
3322 7162 33212 43316 59782 47239 37062 31765 56473 58411 15290 -13679 -33829 -15130
3310 -15130 29443 11659 -23170 -22275 3881 -1432 -40735 -57144 -47382 -18970 -2798 -17271 -13357
3297 -13357 -28575 -18672 -13542 -35340 -18506 1927 -7338 3164 18786 38652 71862 73719 56398
3284 56398 14510 -12439 -9773 15051 27154 25425 14493 5963 19167 42128 38874 42526 40835
3271 40835 48845 43065 24918 -4723 -33246 -13566 5561 -44616 -70383 -73904 -57376 -48184 -31633
3258 -31633 -20456 -12386 -13873 -6596 559 -6807 -16929 -8439 14973 18533 -8050 -17286 -15225 -4527
3244 -4527 12109 37224 37013 55403 32656 12634 479 7397 -1805 -8889 -26033 4824 27041
3231 27041 26684 42106 27178 11166 -24159 -27851 -20395 -4842 -10106 -15122 -16922 -34993 -29676
3218 -29676 -15572 -13123 25310 21616 -4884 -38306 -58423 -60552 -59276 -76170 -67425 -51155 -11373
3205 -11373 33479 23917 17977 -14441 13042 20859 28378 38233 2684 -10774 3126 -16252 -31113
3192 -31113 -35093 -34950 -31106 -4590 12530 19446 -190 -4642 9955 5741 18937 13969 7181 -1478
3178 -1478 -9222 -30871 13404 45872 40012 14285 6914 19120 34553 38012 27728 33316 28242
3165 28242 6968 -3 -12294 -12625 -7808 -6601 -12757 -19997 -29147 -32892 -8924 -17184 -18373 -8768
3151 -8768 -4225 -34880 -36403 -31399 -702 10132 14989 15379 -27007 -15142 -2391 -26474 -17276
3138 -17276 -8290 -10661 4855 20326 32520 12688 36894 27472 10242 8855 18402 43211 37300
3125 37300 25177 1915 -43150 -79028 -55133 -27202 -21005 -16250 -21550 -15202 13361 23606 21003
3112 21003 23685 11435 -17815 -40060 -42734 -29451 -37911 -33018 -16228 10950 11485 30787 46560
3099 46560 18454 -584 4543 445 -10012 -19234 6883 -294 -27316 -17092 747 9474 -1140
3086 -1140 -2312 21419 32858 6272 6099 33204 14944 -17239 565 -1225 -13522 -10505 23225
3073 23225 24074 -5939 -18793 -9981 -9061 12473 16495 -20295 -31640 -28509 -27578 -25921 9717 -8020
3059 -8020 -7859 13161 6204 17047 30862 -17534 -27767 -39194 -11025 44593 38252 -7271 -24959
3046 -24959 -25527 -19243 9758 21022 29063 11331 11643 -18407 -20242 -38548 -64565 -40324 -11096
3033 -11096 4348 -23367 -43144 -17872 -1823 3366 49 459 -8347 9283 -2633 -11773 -17316
3020 -17316 -4296 17737 8801 4821 5957 -11731 -29383 -35641 -13758 -4234 -2269 -570 5838
3007 5838 -2711 -11637 14656 25014 12391 -27420 -56542 -36933 -2785 27848 48898 64211
2995 64211 72771 53182 27088 30238 793 -4602 -6306 -38323 -60338 -39184 -13052 -8778 -3862
2982 -3862 6722 2356 9769 -29847 -19510 13803 21958 -10734 -16966 -2358 -2807 20744 56777
2969 56777 60062 50349 14950 16835 35658 14415 -30558 -36391 5798 47635 18618 -8715 -27344
2956 -27344 -53549 -55574 -7022 12889 6465 -871 -2416 -16262 -8780 11499 -20128 -35144 -7095
2943 -7095 6528 -6294 15647 35130 27368 8797 -8155 -21024 -4161 25249 29932 45034
2931 45034 28594 43566 52859 12420 -4395 -11090 -43803 -28581 -14081 -21252 -28140 10668 -18496
2918 -18496 -40330 -34955 -34216 -42907 -60688 -67159 -23021 -26899 -41345 -31083 4938 -4254 -26564
2905 -26564 -46039 -34665 -7784 -4168 25015 6698 -2930 -15407 21967 43743 18543 2228
2893 2228 -20331 -14355 1870 17777 11151 41980 50946 59383 35598 30544 44891 25901 42928
2880 42928 48494 29612 4839 -13279 17094 22027 -8010 -2639 3714 426 -8630 13467 14485
2867 14485 -6225 -6457 -7745 -5076 31627 31395 31538 39563 46177 33169 43426 59672 51441 42744
2853 42744 34560 3926 -8990 -7095 -2137 21688 37757 46475 7467 -16243 -41397 -72498 -66299
2840 -66299 -29607 -33259 -45514 -31784 -26462 -17998 24972 50600 38617 51321 56801 35527 606
2827 606 -36537 -39553 -12819 19966 23703 -12472 -48597 -14253 5947 6726 21036 21835 -240
2814 -240 -23748 -13096 -1190 -5298 623 20719 3488 -11617 -11654 5082 40609 29968 -12940
2801 -12940 -10241 -11211 -32912 -36767 14676 8496 -534 -2808 -33993 -56010 -43215 -48013 -49183 -24530
2787 -24530 -32027 -54261 -66423 -33392 1211 -2798 -24913 12411 59824 80917 39247 51174
2775 51174 63135 57869 46417 29395 42856 27367 15108 4433 -23324 -37776 -46713 135
2763 135 27768 -2730 11017 22250 -3614 7042 51459 48923 43884 24217 13877 11484 -38778
2750 -38778 -26430 -14467 1771 14737 1783 -35498 -27008 -2157 5004 -9746 -19010 -7451
2738 -7451 13097 11312 -4864 -5368 -16874 -20444 -22217 721 -3250 18348 40131 51570 72768
2725 72768 51690 28824 9403 -15517 -33987 -26245 -39266 -50174 -49080 -28729 -17578 -15082
2713 -15082 9032 7652 8654 20430 2157 20303 30140 31538 28604 480 -23564 -29050 -13326
2700 -13326 -3089 -20056 2738 40881 37773 13868 -12222 -46077 -21843 -13296 -30347 -14862
2688 -14862 -31266 -27768 -47701 -17180 -12209 -25009 -16319 -11652 -31049 -13731 14441 2053 15264
2675 15264 11323 -10739 -16755 -21628 -25840 -23013 -9635 16073 2286 5444 -7314 -27932 -32412
2662 -32412 -40366 -29482 -35690 -56624 -43387 -17595 8555 5171 6434 -6579 -25386 -24374 5263
2649 5263 33454 24074 23084 20255 41417 64938 19785 -45990 -49156 -12645 14430 25687 5797
2636 5797 15346 18417 20263 15505 -337 -30384 -27476 -31380 -7716 26849 8397 -16864 -16293 -21786
2622 -21786 -26731 -16943 -42959 -29149 -8205 439 9407 -12528 -25604 -26697 -4560 9947 23380
2609 23380 48785 32370 -10548 -14570 -24789 -39335 -34103 4034 13468 7967 -6348 -27317 -8505
2596 -8505 22361 43614 18725 3812 -18311 -15860 -7231 21593 14759 15360 8809 7305 -6750
2583 -6750 -16963 -11114 9774 5741 21427 9800 9419 21687 53235 55738 22433 -1770 -3703
2570 -3703 21779 38388 52594 41610 13312 23040 31172 46404 10204 -17019 -15506 21596 40044
2557 40044 52433 47595 53404 37275 9347 -34044 -23040 -15432 -9684 5853 22004 22574 9903
2544 9903 -21243 -6221 4436 -15159 -19117 11881 -3173 -26961 -21233 -4209 -13686 6899 22826
2531 22826 -19828 -42358 -36931 -23719 -14390 -20445 -20408 1247 20360 20057 26568 29911 19643 2809
2517 2809 6902 4360 9489 3934 -14947 -50608 11060 24841 -2498 20145 24561 33641 19786
2504 19786 46314 36349 27563 29987 17578 -9003 -33670 -33980 -21176 7077 41905 47599 7490
2491 7490 11985 33017 27783 20968 58237 30511 -6890 -9341 2240 13212 10320 17692 -14867
2478 -14867 -20086 167 -1341 -1489 11712 6969 2457 -9832 -19856 -39851 -42176 -25364 16157
2465 16157 21939 19385 2950 -38322 -57117 -42461 -12720 44826 62613 45962 8828 -34402
2453 -34402 -55354 -31962 4106 16871 38984 56396 33776 12285 24807 13486 -13971 -24376
2441 -24376 -45550 -41948 -46882 -49392 -28624 -7064 -14050 -44219 -30678 18150 5414 68 2179
2428 2179 -21622 -34144 -65423 -45607 -1956 -20865 -34105 -37339 -19530 -7365 4580 14819
2416 14819 37578 31021 16791 11297 -12264 -5827 25011 20242 -15464 -4697 -9376 10489 14753
2403 14753 8563 -14276 -34455 -63329 -45470 -33582 -26474 -15871 -1602 -29931 -54885 -46538
2391 -46538 -70696 -71318 -38632 -8727 14322 15379 21308 37793 35394 29217 -3538 -32648 -3291
2378 -3291 12278 -4307 5997 9916 3176 -15071 -36142 -5576 16037 18438 29547 -14499 -10165
2365 -10165 -19115 -5569 2206 7298 5900 624 -1871 12384 -3396 -19040 -28048 9928 3971
2352 3971 -20519 -31528 -14516 7342 -6229 -15877 -18036 -25448 -8219 28539 61074 51384 31224
2339 31224 41941 37513 36057 12273 -17103 -35761 -46579 -49368 -27619 -28800 -56038 -19593 6326
2326 6326 -13105 -36093 -29829 -49691 -38390 -23732 -23161 93 26244 20770 -17958 -2144 47162
2313 47162 62540 36296 5808 7117 -6345 -9455 -13953 -16470 -12550 -27325 -39121 -46685 -22554
2300 -22554 -13129 -958 2668 -2502 26890 39256 35329 18484 10808 2651 -2544 33342 34283 16215
2286 16215 10826 9161 -12610 -53246 -27109 4656 -16290 -68805 -48862 -30572 -42570 -12146
2274 -12146 -9215 -19318 -24115 -27079 1870 -11397 -4542 3296 9420 8991 32554 51075 31475
$$ [...]
##END NTUPLES=NMR SPECTRUM
##END=
