##TITLE=Analysis number 314298
Compound Code cc 46623
Book Reference 441/161
Project Code qc-cat
Chemist Name colinb
##JCAMPDX= 6.0         $$ Bruker NMR JCAMP-DX V2.0
##DATA TYPE= NMR SPECTRUM
##DATA CLASS= NTUPLES
##ORIGIN= Bruker BioSpin GmbH
##OWNER= NMR
$$ XWIN-NMR		Version 3.5
$$ Wed Oct 12 16:43:14 2005 GMT Daylight Time (UT+1h)  MAYBRIDGE\NMR@NMR_250MHZ
##.OBSERVE FREQUENCY= 250.131544655141
##.OBSERVE NUCLEUS= ^1H
##.ACQUISITION MODE= SIMULTANEOUS (DQD)
##.ACQUISITION SCHEME= undefined
##.AVERAGES= 16
##.DIGITISER RES= 18
##SPECTROMETER/DATA SYSTEM= dpx250
##.PULSE SEQUENCE= zg30
##.SOLVENT NAME= CDCl3
##.SHIFT REFERENCE= (INTERNAL, CDCl3, 0, 16.4343)
##AUDIT TRAIL= $$ (NUMBER, WHEN, WHO, WHERE, WHAT)
$$ ##TITLE= Audit trail, XWIN-NMR		Version 3.5
$$ ##JCAMPDX= 5.01
$$ ##ORIGIN= Bruker BioSpin GmbH
$$ ##OWNER= NMR
$$ C:\u/data/dgb/nmr/ADRS/10770/pdata/1/auditp.txt
$$ ##AUDIT TRAIL=  $$ (NUMBER, WHEN, WHO, WHERE, WHAT)
(   1,<2005-10-12 16:42:36.66 +100>,<MAYBRIDGE\NMR>,<NMR_250MHZ>,
      <created by zg, POWCHK disabled, PULCHK disabled
       configuration hash MD5:
       62 19 C7 07 E1 42 D1 B7 37 6C 3D D0 77 39 F9 E6
       data hash MD5: 64K
       09 CC 85 E5 24 38 26 31 C7 AC 6F 62 18 63 A9 31>)
(   2,<2005-10-12 16:42:54.71 +100>,<MAYBRIDGE\NMR>,<NMR_250MHZ>,
      <Start of raw data processing
       ef LB = 0.3 FT_mod = 6 PKNL = 1 SI = 32K 
       data hash MD5: 32K
       8B E6 61 AB D0 01 D2 13 D6 AF FA 57 B2 FA FE FB>)
(   3,<2005-10-12 16:42:57.32 +100>,<MAYBRIDGE\NMR>,<NMR_250MHZ>,
      <apk 
       data hash MD5: 32K
       43 D1 C2 74 F7 D1 36 AD 51 CC 74 85 88 94 3E 5F>)
(   4,<2005-10-12 16:42:58.78 +100>,<MAYBRIDGE\NMR>,<NMR_250MHZ>,
      <abs ABSG = 5 
       data hash MD5: 32K
       7D 25 77 12 4F 70 3D 9D 07 2E 2C 1B 69 00 78 94>)
$$ ##END=
$$ 
$$ hash MD5
$$ 9E 1A 91 0C B9 D7 90 E5 47 EF 47 89 E3 80 CB 83
##$RELAX= 
##$RELAX= 
##$RELAX= 
##$RELAX= 
##$RELAX= 
##$RELAX= 
##$RELAX= 
$$ Bruker specific parameters
$$ --------------------------
##$DU= <C:\u>
##$EXPNO= 10770
##$NAME= <ADRS>
##$PROCNO= 1
##$TYPE= <nmr>
##$USER= <dgb>
##$AMP= (0..31)
100 100 100 100 100 100 100 100 100 100 100 100 100 100 100 100 100 100 
100 100 100 100 100 100 100 100 100 100 100 100 100 100 
##$AQSEQ= 0
##$AQ_mod= 3
##$AUNM= <au_zg>
##$AUTOPOS= <44 >
##$BF1= 250.13
##$BF2= 250.13
##$BF3= 250.13
##$BF4= 250.13
##$BF5= 500.13
##$BF6= 500.13
##$BF7= 500.13
##$BF8= 500.13
##$BYTORDA= 1
##$CFDGTYP= 0
##$CFRGTYP= 5
##$CHEMSTR= <none>
##$CNST= (0..31)
1 1 145 1 1 1 1 1 1 1 1 1 1 1 1 1 1 1 1 1 1 1 1 1 1 1 1 1 1 1 1 1 
##$CPDPRG= <>
##$CPDPRG1= <>
##$CPDPRG2= <>
##$CPDPRG3= <>
##$CPDPRG4= <mlev>
##$CPDPRG5= <mlev>
##$CPDPRG6= <mlev>
##$CPDPRG7= <mlev>
##$CPDPRG8= <mlev>
##$CPDPRGB= <>
##$CPDPRGT= <>
##$D= (0..31)
0 1 0 0 0 0 0 0 0 0.06 0 0 0 0 0 0 0.0002 0 0 0 0 0 0 0 0 0 0 0 0 0 0 
0 
##$DATE= 1129131755
##$DBL= (0..7)
120 120 120 120 120 120 120 120 
##$DBP= (0..7)
150 150 150 150 150 150 150 150 
##$DBP07= 0
##$DBPNAM0= <>
##$DBPNAM1= <>
$$ [...]
##$SUBNAM7= <"">
##$SUBNAM8= <"">
##$SUBNAM9= <"">
##$SW= 20.6930455092707
##$SWIBOX= (0..15)
0 0 3 0 0 0 0 0 0 0 0 0 0 0 0 0 
##$SW_h= 5175.983436853
##$TD= 65536
##$TD0= 1
##$TE= 294.16
##$TE2= 300
##$TE3= 300
##$TEG= 300
##$TL= (0..7)
0 120 120 120 120 120 120 120 
##$TP= (0..7)
150 150 150 150 150 150 150 150 
##$TP07= 0
##$TPNAME0= <>
##$TPNAME1= <>
##$TPNAME2= <>
##$TPNAME3= <>
##$TPNAME4= <>
##$TPNAME5= <>
##$TPNAME6= <>
##$TPNAME7= <>
##$TPOAL= (0..7)
0.5 0.5 0.5 0.5 0.5 0.5 0.5 0.5 
##$TPOFFS= (0..7)
0 0 0 0 0 0 0 0 
##$TUNHIN= 0
##$TUNHOUT= 0
##$TUNXOUT= 0
##$USERA1= <user>
##$USERA2= <user>
##$USERA3= <user>
##$USERA4= <user>
##$USERA5= <user>
##$V9= 5
##$VALIST= <valist>
##$VCLIST= <CCCCCCCCCCCCCCC>
##$VD= 0
##$VDLIST= <DDDDDDDDDDDDDDD>
##$VPLIST= <PPPPPPPPPPPPPPP>
##$VTLIST= <TTTTTTTTTTTTTTT>
##$WBST= 1024
##$WBSW= 4
##$XGAIN= (0..3)
0 0 0 0 
##$XL= 0
##$YL= 0
##$YMAX_a= 776198
##$YMIN_a= -643040
##$ZGOPTNS= <>
##$ZL1= 120
##$ZL2= 120
##$ZL3= 120
##$ZL4= 120
##$ABSF1= 16.43428
##$ABSF2= -4.25889
##$ABSG= 5
##$ABSL= 3
##$ALPHA= 0
##$AQORDER= 0
##$ASSFAC= 0
##$ASSFACI= 0
##$ASSFACX= 0
##$ASSWID= 0
##$AUNMP= <proc_1d>
##$AZFE= 0.1
##$AZFW= 0.1
##$BCFW= 0
##$BC_mod= 0
##$BYTORDP= 0
##$COROFFS= 0
##$CY= 12.5
##$DATMOD= 1
##$DC= 0
##$DFILT= <>
##$DTYPP= 0
##$F1P= 14.0000005364418
##$F2P= -0.99999901652339
##$FCOR= 0.5
##$FTSIZE= 32768
##$FT_mod= 6
##$GAMMA= 0
##$GB= 0
##$INTBC= 1
##$INTSCL= 1
##$ISEN= 128
##$LB= 0.3
##$LEV0= 0
##$LPBIN= 0
##$MAXI= 10000
##$MC2= 0
##$MEAN= 0
##$ME_mod= 0
##$MI= 0
##$NCOEF= 0
##$NC_proc= -2
##$NLEV= 6
##$NOISF1= 0
##$NOISF2= 0
##$NSP= 0
##$NTH_PI= 0
##$NZP= 0
##$OFFSET= 16.43428
##$PC= 1
##$PHC0= -69.88772
##$PHC1= 7.680778
##$PH_mod= 1
##$PKNL= yes
##$PPARMOD= 0
##$PSCAL= 4
##$PSIGN= 0
##$REVERSE= no
##$SF= 250.130021938684
##$SI= 32768
##$SIGF1= 0
##$SIGF2= 0
##$SINO= 400
##$SIOLD= 32768
##$SREGLST= <1H.CDCl3>
##$SSB= 0
##$STSI= 32768
##$STSR= 0
##$SW_p= 5175.98343685301
##$SYMM= 0
##$S_DEV= 0
##$TDeff= 65536
##$TDoff= 0
##$TI= <Analysis number 999999
Compound Code 99
Book Reference 9
Project Code 9>
##$TILT= no
##$TM1= 0
##$TM2= 0
##$TOPLEV= 0
##$USERP1= <user>
##$USERP2= <user>
##$USERP3= <user>
##$USERP4= <user>
##$USERP5= <user>
##$WDW= 1
##$XDIM= 32768
##$YMAX_p= 335057224
##$YMIN_p= -154066
$$ End of Bruker specific parameters
$$ ---------------------------------
##NTUPLES= NMR SPECTRUM
##VAR_NAME=  FREQUENCY,     SPECTRUM/REAL,   SPECTRUM/IMAG
##SYMBOL=    X,             R,               I
##VAR_TYPE=  INDEPENDENT,   DEPENDENT,       DEPENDENT
##VAR_FORM=  AFFN,          ASDF,            ASDF
##VAR_DIM=   32768,         32768,           32768
##UNITS=     HZ,            ARBITRARY UNITS, ARBITRARY UNITS
##FACTOR=    0.157963299565203, 1,           1
##FIRST=     4110.70691587485, 0,            0
##LAST=      -1065.27652097816, 0,           0
##MIN=       -1065.27652097816, -154066,     0
##MAX=       4110.70691587485, 335057224,    0
$$ Real data points
##PAGE= N=1
##DATA TABLE= (X++(R..R)), XYDATA
$$ [...]
##PAGE= N=2
##DATA TABLE= (X++(I..I)), XYDATA
18491E356227L8813M5880N3544N3194M5901M2020L7898L2991M4836N0997M4370
18480E846671L5102L1665M5029N7129O4312N7048M7108L3536L0721L9194P0067
18469F357582Q0036M8676R090P768M4139P8107J13747J09920M5904p8672j65059
18458F651238j07570n607N8869Q9291J01001J07371J04044R7063R0352Q9518Q7814
18447G363384Q0719Q3659R0604R9387R7460Q9570Q5905R0576Q8039R6873J14157
18436H380333J26218J16416J07713J18704J12227J04883Q6506P0259P9021J24835
18426I427115J54411J68916J78326J69158J38474J15115R1637R7427J24241J53252
18416A0818072J43739J17784J62351K23744K46445K29295K35828K67043K86906
$$ y = [5356227, 5395040, 5440920, 5494464, 5547658, 5593559, 5635579, 5673477, 5706468, 5751304, 5802301, 5846671, 5881773, 5913438, 5958467, 6015596, 6079908, 6136956, 6184064, 6217600, 6248321, 6287515, 6357582, 6437618, 6486294, 6495384, 6503152, 6547291, 6625398, 6739145, 6849065, 6894969, 6816297, 6651238, 6543668, 6538061, 6596930, 6686221, 6787222, 6894593, 6998637, 7095700, 7186052, 7275570, 7363384, 7444103, 7527762, 7618366, 7717753, 7815213, 7904783, 7990688, 8081264, 8169303, 8266176, 8380333, 8506551, 8622967, 8730680, 8849384, 8961611, 9066494, 9153000, 9223259, 9302280, 9427115, 9581526, 9750442, 9928768, 10097926, 10236400, 10351515, 10443152, 10540579, 10664820, 10818072, 10961811, 11079595, 11241946, 11465690, 11712135, 11941430, 12177258, 12444301, 12731207]
18407A2731207L11794L68197M17452M59739N39478O35228P26304Q26956R32566
18398A7948921J010109Q92594L41724k64997n37892j591689k714205j602872J55368
18389A3637061J050396J527763J790996J574047J24676k874125n254337n282237
18381F294240k925246m63090N97818J001486J181187J250557J184643Q75070N6614
18372I053279j164571j462434n27449K32081N33677O53674P56990Q60568Q83252
18363I819067Q57080Q64141R04182R73773J080639J196415J290402J335480J217914
18354A9539093P03567Q0148K51689P09323O74444R66404J927315K768939L112225
18345C0733147K323272m55858l410025l301273j880601k817061q296602j2984146
$$ y = [12731207, 13043001, 13411198, 13828650, 14288389, 14827867, 15463095, 16189399, 17016355, 17948921, 18959030, 19851624, 20193348, 19928351, 19390459, 17798770, 15084565, 13481693, 13637061, 14687457, 16215220, 18006216, 19580263, 19704939, 16830814, 11576477, 6294240, 3368994, 2905904, 3503722, 4505208, 5686395, 6936952, 8121595, 8996665, 9053279, 7888708, 6426274, 5898825, 6130906, 6664583, 7318257, 8075247, 8935815, 9819067, 10676147, 11540288, 12444470, 13418243, 14498882, 15695297, 16985699, 18321179, 19539093, 20242660, 20322808, 20574497, 21283820, 21958264, 22924668, 24851983, 27620922, 30733147, 33056419, 32600561, 29190536, 25889263, 24008662, 21191601, 12894999, -89147]
18337h9147r871895l118908P92995K241395K722474K631388J719887k93384k273803
18328e538998l297560l934131k736498n45074O38630R90487J125818J209327J259511
18319a0828488J262272J214348J131640J060607R86270R53558R69642R89304J012674
18310a248173J077951J172529J267174J362423J491687J663642J798392J636961
18302A0222586O93137j302514k639245j389778O65323J969492K699741K686645
18294A3605387Q10760l449929o541560o472615m483295j902090k288948m767497
18286a5489787m379638j208422P18098J349661J532009J522583J423193J179216
18278a3353087O24011j91404m58246P7946N38408O90185O92334O43863N99679
$$ y = [-89147, -9961042, -13079950, -12286955, -10045560, -7323086, -4691698, -2971811, -3265195, -5538998, -8836558, -12770689, -15507187, -16052261, -15413631, -14423144, -13297326, -12087999, -10828488, -9566216, -8351868, -7220228, -6159621, -5173351, -4219793, -3250151, -2260847, -1248173, -170222, 1002307, 2269481, 3631904, 5123591, 6787233, 8585625, 10222586, 10915723, 9613209, 6973964, 5584186, 6249509, 8219001, 10918742, 13605387, 14416147, 10966218, 4424658, -2047957, -6531252, -8433342, -10722290, -15489787, -19869425, -21077847, -20359749, -19010088, -17478079, -15955496, -14532303, -13353087, -12729076, -12920480, -13378726, -13300780, -12762372, -12072187, -11379853, -10735990, -10136311]
18269a0136311O05299O44628O69124O64113O57318O51946O59242O55786O30387
18260d298468O12406O46613P10978P88598Q47019R01756R83775J103978J238750
18251C535405J342992J251465M61219j489673k983602j863837R744J047390J637176
18242B948279K000510K009781J007958k375230o951793o914759k824446j11110
18234a1210810J017841J492517J606321J202055l78692k886211l374237j349211
18226a3880427J51582O86888Q15672P90016P81710P90349P93976P77716P56894
18217g535624P45025P44867P39825P55979Q13861R03151Q71299L35624r30346
18208b556339j744713r22517J64815O66575R11160J070767J183318J302032J441802
$$ y = [-10136311, -9531012, -8886384, -8217260, -7553147, -6895829, -6243883, -5584641, -4928855, -4298468, -3686062, -3039449, -2328471, -1539873, -692854, 208902, 1192677, 2296655, 3535405, 4878397, 6129862, 6591081, 5101408, 2117806, 253969, 263713, 1311103, 2948279, 4948789, 6958570, 7966528, 5591298, -1360495, -8275254, -11099700, -11210810, -10192969, -8700452, -7094131, -5892076, -6270768, -9156979, -12531216, -13880427, -13728845, -13041957, -12226285, -11436269, -10654559, -9864210, -9070234, -8292518, -7535624, -6790599, -6045732, -5305907, -4549928, -3736067, -2832916, -1961617, -1625993, -2556339, -4301052, -5223569, -5058754, -4392179, -3481019, -2410252, -1226934, 75098, 1516900]
18199A516900J621305J710350J280179j9863j386772k513418m691321o580066
18191i062706m922399j984522q76032m79320J93185P10986R11469R24911Q73220
18182a3711208Q11061P46010O94805O60719O25991N69738L60476k33916r70535
18173a0446859r11167k13467K29060L83596M28129M39438M43190M50975M51187
18164h745918M57605M39222M26829M47727M87949N23579N53083M25548j07999
18155e092375q22633p49169q3631L28082N37471O72748O69719K48123r52302k039714
18145g283681j459695l39830J86480M01587M90868M38004J14538m92575p59316
18136h703620l18003R2228K43659K86111K61409K44884K49146K49424K48338K46415
$$ y = [1516900, 3138205, 4848555, 6128734, 6108871, 4722099, 2208681, -2482640, -9062706, -13985105, -15969627, -16845659, -17324979, -17131794, -16420808, -15509339, -14584428, -13711208, -12900147, -12154137, -11459332, -10798613, -10172622, -9602884, -9242408, -9476324, -10446859, -11358026, -11571493, -11342433, -10958837, -10530708, -10091270, -9648080, -9197105, -8745918, -8288313, -7849091, -7422262, -6974535, -6486586, -5963007, -5409924, -4984376, -5092375, -5915008, -6664177, -6747808, -6419726, -5882255, -5209507, -4539788, -4291665, -5243967, -7283681, -8743376, -9083206, -8896726, -8495139, -8004271, -7566267, -7451729, -7944304, -8703620, -9021623, -8929395, -8685736, -8399625, -8138216, -7893332, -7644186, -7394762, -7146424, -6900009]
18126f900009K33347K23969K09815J91283J80917J99813K21195K37593K52727
18117d949350K62374K88522L03211L26315L74617M27815N02538O28239Q22986
18108a012733J056040J191458L24286l160802n808718k735314j95995L26338M72072
18099i543368M71740M42752M01001L46521L04218K59024K24284J92791J68897
18090f732140J16415O9065O5973J01669J14838J05517J12091J04531R7633J02328
18080e742080J11586J08190J04374J08498R7935Q6846Q2605Q2093Q3271P3960
18070d802722P7672P3707O4209O6970O4092N8338P2537P4480P7682P1892N6723
18059d044420M4211M8353N3526M5470L3142L9118R3023J14206Q5052P0141P0085
$$ y = [-6900009, -6666662, -6442693, -6232878, -6041595, -5860678, -5660865, -5439670, -5202077, -4949350, -4686976, -4398454, -4095243, -3768928, -3394311, -2966496, -2463958, -1835719, -1012733, 43307, 1234765, 1559051, -1601751, -7410469, -10145783, -10341778, -10015440, -9543368, -9071628, -8628876, -8227875, -7881354, -7577136, -7318112, -7093828, -6901037, -6732140, -6615725, -6546660, -6480687, -6379018, -6264180, -6158663, -6046572, -5942041, -5844408, -5742080, -5630494, -5522304, -5417930, -5309432, -5211497, -5124651, -5042046, -4959953, -4876682, -4802722, -4725050, -4651343, -4587134, -4520164, -4456072, -4397734, -4325197, -4250717, -4173035, -4101143, -4044420, -4000209, -3951856, -3898330, -3852860, -3819718, -3780600, -3687577, -3573371, -3488319, -3418178, -3348093]
18048c348093O1776N5690N2771N4656M5235M2049M2317M8080M7503M6407L4390
18037b817219L1345M4259M6305M8795N9118N6145N2585N2681M7194M0615L5897
18026b302280L1167K8518L1193L0355K2707J8752J8375M5408N2665M8903N1042
18015a923195N4924N2519M3332L8512M6997N6377N3125M7276L9193M1016M6594
18004a403330N2711N5346N1521M8586N2810M5902L9522M5585N1150N9993N8459
17993h41745N5589M9091M8186M6776N3682N5947N7325O1891N9809N6162M7037
17982b50250M1896N1001O0570N0143M7621N9473O0617O3134N4531O3756O8768
17971C71260P2021P2370P5781P8426P9154P6507Q6653R6424Q6291Q2648Q7245
$$ y = [-3348093, -3286317, -3230627, -3177856, -3123200, -3077965, -3035916, -2993599, -2945519, -2898016, -2851609, -2817219, -2785874, -2741615, -2695310, -2646515, -2587397, -2531252, -2478667, -2425986, -2378792, -2338177, -2302280, -2271113, -2242595, -2211402, -2181047, -2158340, -2139588, -2121213, -2075805, -2023140, -1974237, -1923195, -1868271, -1815752, -1772420, -1733908, -1686911, -1630534, -1577409, -1530133, -1490940, -1449924, -1403330, -1350619, -1295273, -1243752, -1195166, -1142356, -1096454, -1056932, -1011347, -960197, -900204, -841745, -786156, -737065, -688879, -642103, -588421, -532474, -475149, -413258, -353449, -297287, -250250, -208354, -157353, -96783, -46640, 981, 60454, 121071, 184205, 238736, 302492, 371260, 443281, 515651, 591432, 669858, 749012, 825519, 912172, 1008596, 1094887, 1177535, 1264780]
17960A264780Q5603R1728J03183J00200J01141J04641J01099J09533J18908J30626
17950B311442J34504J23965J25564J43094J40188J21419J35280J45080J55752
17941C536288J69742J64195J60507J76341J95757K18805K30968K41333K53666
17932E347602K66264K81805K96775L08882L41939L73881L94799M18799M73662
17923H504408N16541N38312N63254N47921M52185M31497O25748P59252P98847
17914A3737965Q59122J030120J196524J256672J292340J562559J996186K395003
17906B5326491K862297L446004M189124N353252O942636Q429291P830557k628605
17898F1751047l0795395m7782015k5930913n393810R02506L097908L607803L502051
$$ y = [1264780, 1350383, 1442111, 1545294, 1645494, 1746635, 1851276, 1952375, 2061908, 2180816, 2311442, 2445946, 2569911, 2695475, 2838569, 2978757, 3100176, 3235456, 3380536, 3536288, 3706030, 3870225, 4030732, 4207073, 4402830, 4621635, 4852603, 5093936, 5347602, 5613866, 5895671, 6192446, 6501328, 6843267, 7217148, 7611947, 8030746, 8504408, 9020949, 9559261, 10122515, 10670436, 11122621, 11554118, 12179866, 12939118, 13737965, 14597087, 15627207, 16823731, 18080403, 19372743, 20935302, 22931488, 25326491, 28188788, 31634792, 35823916, 41177168, 48119804, 56549095, 64379652, 61751047, 30955652, -16826363, -42757276, -48151086, -47248580, -44150672, -40542869, -37040818]
17890c7040818L161430K742247K344729J950842J664693J428166J077741M67697
17882b2203273n807J02972M12562O31424P21160P50230O90294N30245L82964M29216
17872a7558013N07063N06286M84676M35147M00769L98551M05299L85015L67853
17863a3667354L53617L18278K93505K85233K65597K54718K63552K54466K39171
17854a1139217K16595K05464K02705K15306K08034J85828J65775J67067J65092
17845i407351J50185J43289J40191J40523J36939J31661J36592J33635J39427
17836h154909J31428J25011J08712P9272P1875P8343P6161Q4963P9555O3608M9657
17825g206324N1976N5641N9287O7554Q0410Q2464P6792P0245N1578L7729L5085
$$ y = [-37040818, -33879388, -31137141, -28792412, -26841570, -25176877, -23748711, -22670970, -22203273, -22209080, -22106108, -21693546, -21062122, -20340962, -19590732, -18900438, -18370193, -17987229, -17558013, -17050950, -16544664, -16059988, -15624841, -15224072, -14825521, -14420222, -14035207, -13667354, -13313737, -12995459, -12701954, -12416721, -12151124, -11896406, -11632854, -11378388, -11139217, -10922622, -10717158, -10514453, -10299147, -10091113, -9905285, -9739510, -9572443, -9407351, -9257166, -9113877, -8973686, -8833163, -8696224, -8564563, -8427971, -8294336, -8154909, -8023481, -7898470, -7789758, -7710486, -7638611, -7560268, -7484107, -7399144, -7319589, -7255981, -7206324, -7154348, -7098707, -7039420, -6971866, -6891456, -6808992, -6732200, -6661955, -6610377, -6572648, -6537563]
17814f537563M2010N8939O5863O7165N2770M6499N1729O3772N5529N5959N5700
17803e921628N5470N0326M5902L5931L9315M3892M5795M3516M3920M8694M0057
17792e428810L9777M9966M5938L8055K8654K2203K6067K3584K9096L7445L4190
17781e053835J7530J2599K8938L4558M1405K9647K1122J4282Q560R540n72r864
17769d846090Q957N1933N4815L8347L4290L1256K8091K0696L0316L2858L2368
17758d482163L3365K9029K8585K7482K0378K4641L4130L9379L7718K7103K8801
17747d151552K9347K8168J5527r54k7725n6256j9549L2866K9248J9822J4692P528
17735d078838R704J5969J5946L4668K2948J0947Q579M832Q568J7029J5055K0045
$$ y = [-6537563, -6495553, -6436614, -6370751, -6303586, -6250816, -6204317, -6152588, -6088816, -6033287, -5977328, -5921628, -5866158, -5815832, -5769930, -5733999, -5694684, -5650792, -5604997, -5561481, -5517561, -5468867, -5428810, -5389033, -5339067, -5293129, -5255074, -5226420, -5204217, -5178150, -5154566, -5125470, -5088025, -5053835, -5036305, -5023706, -4994768, -4960210, -4918805, -4889158, -4868036, -4853754, -4845194, -4835654, -4836226, -4846090, -4837133, -4785200, -4730385, -4692038, -4657748, -4626492, -4598401, -4577705, -4547389, -4514531, -4482163, -4448798, -4419769, -4391184, -4363702, -4343324, -4318683, -4284553, -4245174, -4207456, -4180353, -4151552, -4122205, -4094037, -4078510, -4079464, -4107189, -4163445, -4182994, -4150128, -4120880, -4101058, -4086366, -4078838, -4069134, -4053165, -4037219, -4002551, -3979603, -3968656, -3960077, -3955245, -3946677, -3929648, -3914593, -3894548]
17723c894548K1118K0991J3145J7058J7701J0900Q891N539J0566J5378J7664J8447
17711c717150J9763K8393K8862L1872K2795J6563K5521L5438K1299J6872J5063
17700c454709J1176O667J3227J6894J3162P979J3785J3303J4126P422r196j2578
17688c358742j0686j454J2032J1291R137K797K958J2765J5799J5172o40K804Q924
17675c277843O597J4191J8671J7128J3849J9154J7599Q557J0920J8277J4241J2510
17663c106149P766Q022J2439Q708P317N733K507J5192J8363J9964Q932N600P096
17650b978510r84K414L286J4051J4623J2608J0327K358m03J229P82Q560P213P398
17636b895048M168J1007J0910P671O886O005R892Q913P205J0160Q047J1405P716
$$ y = [-3894548, -3873430, -3852439, -3839294, -3822236, -3804535, -3793635, -3784744, -3779205, -3768639, -3753261, -3735597, -3717150, -3697387, -3668994, -3640132, -3608260, -3585465, -3568902, -3543381, -3507943, -3486644, -3469772, -3454709, -3443533, -3436866, -3423639, -3406745, -3393583, -3385604, -3371819, -3358516, -3344390, -3336968, -3346164, -3358742, -3369428, -3370882, -3358850, -3347559, -3338422, -3335625, -3332667, -3319902, -3304103, -3288931, -3289571, -3286767, -3277843, -3271246, -3257055, -3238384, -3221256, -3207407, -3188253, -3170654, -3162097, -3151177, -3132900, -3118659, -3106149, -3098383, -3090361, -3077922, -3069214, -3061897, -3056164, -3053657, -3038465, -3020102, -3000138, -2991206, -2985606, -2978510, -2979494, -2977080, -2973794, -2959743, -2945120, -2932512, -2922185, -2919827, -2920230, -2919001, -2918219, -2909659, -2902446, -2895048, -2890880, -2879873, -2868963, -2861292, -2854406, -2848401, -2838509, -2829596, -2822391, -2812231, -2804184, -2792779, -2785063]
17623b785063J970P166Q709N778J2179J2515O810P923N678N318N038O065J2693
17610b687221r51L895J0435J7499Q919J2151J6564R093l602J749L680P009K17
17597b600563O041P599J0005Q211J146K006N789J6818J5497R602R5Q313J4538
17584b494903L322M716P720L125K065R302O320L391p773m753N230J6592J1091
17571b434555J2487O663M923M966M527R22J2586R948N484O908M802K9M518J0575
17557b345217N068J861R430J1736J1008M633k873L620j026O018O949M376J0142
17544b274275J0938K247P348O234L710O516N266J892P434J1095K450J11J0590
17531b198444Q033M299R260J731N349N873j32N114K807O284R836J1682O960O015
$$ y = [-2785063, -2783093, -2775927, -2767218, -2761440, -2749261, -2736746, -2729936, -2722013, -2716335, -2711017, -2705979, -2699914, -2687221, -2688172, -2684277, -2673842, -2656343, -2647424, -2635273, -2618709, -2609616, -2613218, -2611469, -2607789, -2600780, -2600563, -2594522, -2586923, -2576918, -2568707, -2567561, -2565555, -2559766, -2542948, -2527451, -2517849, -2517754, -2509441, -2494903, -2491581, -2486865, -2479145, -2476020, -2473955, -2464653, -2458333, -2454942, -2462715, -2467468, -2462238, -2445646, -2434555, -2422068, -2415405, -2410482, -2405516, -2400989, -2400067, -2387481, -2377533, -2372049, -2365141, -2360339, -2360310, -2355792, -2345217, -2340149, -2338288, -2328858, -2317122, -2306114, -2301481, -2304354, -2300734, -2301760, -2295742, -2288793, -2284417, -2274275, -2263337, -2261090, -2253742, -2247508, -2243798, -2237282, -2232016, -2230124, -2222690, -2211595, -2209145, -2209034, -2198444, -2190411, -2186112, -2176852, -2175121, -2169772, -2163899, -2164031, -2158917, -2156110, -2149826, -2139990, -2128308, -2121348, -2115333]
17517b115333R881K208J716J025O206L190R641Q722L843M745J3535M158K068Q178
17503b036217J0683K396k916J1332J2505J90J0121K6418J3090Q016O273J1235
17491a926874P361O599J4092J8604J4800K1860K4314L8722M6699N0332K7554k8015
17479a683952j36173j95478j33973m7360M298J2943J9341J9624K3616J8103J8343
17468b080668J7941J5962O009R495O589j015P071L014O539Q689O292J2202P400
17455a974480P564N777J64K868O872J0189J1522J6438K964O850J6846J4640J1841
17442a859945J958Q447R251n36k4998k9994o986L899J881R696J0200N179M510
17429a867438J4986O946J5107R310K269J064l542O29J2266J1067N188N8O603O799
$$ y = [-2115333, -2105452, -2103244, -2101528, -2100503, -2094297, -2091107, -2081466, -2072744, -2068901, -2064156, -2050621, -2046463, -2044395, -2036217, -2025534, -2023138, -2026054, -2014722, -2002217, -2002027, -1991906, -1965488, -1952398, -1944382, -1938109, -1926874, -1919513, -1912914, -1898822, -1880218, -1865418, -1843558, -1819244, -1780522, -1733823, -1683491, -1655937, -1683952, -1820125, -2015603, -2149576, -2196936, -2192638, -2179695, -2160354, -2140730, -2117114, -2099011, -2080668, -2062727, -2046765, -2040756, -2031261, -2024672, -2025687, -2018616, -2015602, -2009063, -2000374, -1994082, -1981880, -1974480, -1966916, -1961139, -1960975, -1958107, -1951235, -1941046, -1929524, -1913086, -1910122, -1903272, -1886426, -1871786, -1859945, -1857987, -1849540, -1840289, -1840825, -1865823, -1895817, -1902803, -1898904, -1897023, -1887327, -1877127, -1871948, -1867438, -1852452, -1845506, -1830399, -1821089, -1818820, -1817756, -1821298, -1820669, -1808403, -1797336, -1792148, -1792090, -1785487, -1778688]
17415a778688q20J932L507q54J643K330J1287M997J2047k207N17k208K617J3263
17401a730637J0481P422m55j479J121O322M992M927j414m52M516J0331M27J430
17387a682468R861M666L5L696K955P7K529L175M849L867O229L918K638K486R699
17372a621788L684M651M169R875L574O90K024L669L419P104Q662N325j26j855
17358a566923K683R432N912Q241J1564Q742J855o680N858N568Q028L388P210J7558
17344a477564J4536J2844Q975P837Q578J4536K0198J9666K0956K3498L2835L1459
17332a261646L8537j176r7791j87941j52923o3413j9062J381K0708J8694J3366
17321a691266K2119K2198J0490O216J0201R595R365Q672K382j0837L046J3939
$$ y = [-1778688, -1779508, -1777576, -1774069, -1774923, -1773280, -1770950, -1759663, -1754666, -1742619, -1744826, -1744309, -1746517, -1743900, -1730637, -1720156, -1712734, -1713189, -1714668, -1713547, -1707225, -1702233, -1697306, -1698720, -1699172, -1694656, -1684325, -1683898, -1682468, -1672607, -1667941, -1667906, -1664210, -1661255, -1661178, -1658649, -1655474, -1650625, -1646758, -1640529, -1636611, -1633973, -1631487, -1621788, -1618104, -1613453, -1609284, -1599409, -1595835, -1595145, -1593121, -1589452, -1586033, -1578929, -1570267, -1564942, -1565068, -1566923, -1564240, -1554808, -1548896, -1540655, -1529091, -1520349, -1518494, -1525174, -1519316, -1513748, -1505720, -1502332, -1495122, -1477564, -1463028, -1450184, -1441209, -1433372, -1424794, -1410258, -1390060, -1370394, -1349438, -1325940, -1293105, -1261646, -1223109, -1224285, -1322076, -1510017, -1662940, -1726353, -1745415, -1744034, -1723326, -1704632, -1691266, -1669147, -1646949, -1636459, -1630243, -1620042, -1610447, -1601082, -1592410, -1590028, -1600865, -1597819, -1583880]
17309a583880M289Q599R826N702Q382N277N747M082K033j546O491r91M652O927
17295a514410M463O757J0636O403L328q55L590L952P587K251k903j277P304P563
17281a455611M892L958L407M365P396j077j285M699J6414M710J28R601j579p175
17267a407157p959M394L471K442P207N77j924K711N723J339J673K871M354J0845
17253a369433o68K116M690O43K002L027P626K161R24m734J35J0776L104m01J412
17238a336620m16O48M615L424M547N526L181J310K499p26k727L311Q589J794n13
17223a301558j200N820M789j01p61R837J595o87J96M100P505J746j074P106k904
17208a265591j743j749K30N80k051P17O610O513j619m912O512O643m117M979J0654
$$ y = [-1583880, -1579591, -1570992, -1561166, -1555464, -1547082, -1541805, -1536058, -1531976, -1529943, -1531489, -1524998, -1525989, -1521337, -1514410, -1509947, -1503190, -1492554, -1486151, -1482823, -1483678, -1480088, -1476136, -1468549, -1466298, -1469201, -1470478, -1463174, -1455611, -1450719, -1446761, -1443354, -1438989, -1431593, -1432670, -1433955, -1429256, -1412842, -1408132, -1408004, -1398403, -1399982, -1407157, -1415116, -1410722, -1407251, -1404809, -1397602, -1397025, -1398949, -1396238, -1390515, -1389176, -1387503, -1384632, -1380278, -1369433, -1370101, -1367985, -1363295, -1362652, -1360650, -1357623, -1349997, -1347836, -1346912, -1351646, -1351511, -1340735, -1337631, -1338032, -1336620, -1337036, -1336388, -1331773, -1328349, -1323802, -1318276, -1315095, -1313785, -1311286, -1312012, -1314739, -1311428, -1302839, -1301045, -1301558, -1302758, -1296938, -1292149, -1292250, -1293011, -1283174, -1281579, -1282266, -1282070, -1277970, -1270465, -1268719, -1269793, -1262687, -1265591, -1267334, -1269083, -1268853, -1268273, -1270324, -1269607, -1262997, -1256484, -1258103, -1263015, -1256503, -1249860, -1253977, -1248998, -1238344]
17193a238344J874l544K391P530N505N88k472K655L360p817L344L214N331M723
17179a211662L377M644J087l73Q94L761Q882O214Q32L9J563R349J014o73l121
17164a174173j430m161L389j859k231K535R155N014N942n001r376O574J3854J993
17150a149775K555K054P01K731R120J778m729p117K481R505P351k306K673N006
17136a117972m642j240n282j34L164K785J165J3532R623l877o882K428M448K399
17122a100485L508k192J375M474L944K209k347J430J627k824l553m120N780M709
17108a086465J0882Q760k836m283j086L614P713m05j495J944K92K445J963l90
17094a059347n45L17J047J928J508N389N357k691K287J041N986L210K977k596
$$ y = [-1238344, -1236470, -1240014, -1237623, -1230093, -1224588, -1224000, -1226472, -1223817, -1220457, -1228274, -1224930, -1221716, -1216385, -1211662, -1208285, -1203641, -1202554, -1202927, -1202033, -1198272, -1189390, -1183176, -1182344, -1182305, -1180742, -1171393, -1170379, -1171052, -1174173, -1175603, -1179764, -1176375, -1178234, -1180465, -1177930, -1168775, -1163761, -1157819, -1162820, -1172196, -1165622, -1151768, -1149775, -1147220, -1145166, -1144465, -1141734, -1132614, -1130836, -1135565, -1142682, -1140201, -1130696, -1123345, -1125651, -1122978, -1117972, -1122614, -1123854, -1129136, -1129270, -1126106, -1123321, -1122156, -1108624, -1099001, -1102878, -1109760, -1107332, -1102884, -1100485, -1096977, -1099169, -1097794, -1093320, -1089376, -1087167, -1089514, -1088084, -1086457, -1089281, -1092834, -1096954, -1091174, -1086465, -1075583, -1066823, -1069659, -1073942, -1075028, -1071414, -1063701, -1064106, -1065601, -1063657, -1063365, -1060920, -1058957, -1059347, -1059892, -1059575, -1058528, -1056600, -1055092, -1049703, -1044346, -1047037, -1044750, -1043709, -1037723, -1034513, -1031536, -1034132]
17080a034132k557L100N388N784O188r93M390m866M100N928q64m548m027L939
17066a013170N790J895K62L130N112N92J547L561k046p740L365M302M749P820
17052i80831n97n537J819K843N155L124Q25J372J619k855j592N266k908Q7R363
17037i62847k289l186r30K448P345m179O452P774K963J559o849k690M854P878
17023i41697J401j844k435M992j844j47n72L252O590J011O474N188m790K21N451
17008i18749K642k892j2204n246J8073J0048P045p8l43m644j830j238K511O156
16994i00749k804K672O313l17K500L585j151r230n038L473M608O81R47M118J1362
16979h79030R70k063P997k759n710l445J279K473L20R8M035K651J795N656J590
$$ y = [-1034132, -1036689, -1033589, -1028201, -1022417, -1016229, -1017222, -1012832, -1017698, -1013598, -1007670, -1008534, -1013082, -1017109, -1013170, -1007380, -1005485, -1005223, -1002093, -996981, -996389, -994842, -991281, -993327, -1001067, -997702, -993400, -988651, -980831, -981428, -986965, -985146, -982303, -977148, -974024, -973199, -971827, -970208, -973063, -974655, -969389, -972297, -972210, -962847, -965136, -968322, -969252, -966804, -959459, -963638, -957186, -949412, -946449, -944890, -951739, -954429, -949575, -941697, -940296, -942140, -944575, -939583, -941427, -941574, -942146, -938894, -932304, -931293, -924819, -919631, -924421, -924200, -918749, -916107, -918999, -931203, -936449, -918376, -908328, -901283, -901361, -901704, -906348, -908178, -909416, -906905, -900749, -903553, -900881, -894568, -894885, -892385, -888800, -889951, -899181, -904219, -900746, -896138, -895457, -894510, -890392, -879030, -878060, -880123, -872126, -874885, -880595, -884040, -882761, -880288, -879968, -879870, -875835, -873184, -871389, -865733, -864143]
16964h64143o114L992M448P988Q029m999n7M919n648n35o87K348M76n973q61P478
16948h49339l29j671R88K920m19N455P688l624l924J645M679K469K682o9M131
16933h26718k09l486n407J378O694O740q50l170m36k296L464P536l52O471N293
16918h05348p03p845K679N059O004L515l829P56K309M041J469Q240K592K646M556
16903g73859l260j313k969K287M581R13J657j122n40M163J711O131p971k692N87
16888g71696L775M884k083k262P75K029O750J4o898Q29N715O219m654r94p78Q216
16872g50159K869k920J682P141m135m881J797Q853K752L067J701O07o66n309N487
16857g32114J93r937M383P324K567N236O098L75m840K72N347j867L875M64j752
$$ y = [-864143, -870257, -866265, -861817, -853829, -845800, -850799, -850856, -845937, -851585, -852120, -852807, -850459, -849983, -855956, -856817, -849339, -849668, -851339, -850351, -847431, -847850, -842395, -834707, -838331, -842255, -840610, -835931, -833462, -830780, -830849, -826718, -826927, -830413, -835820, -834442, -827748, -821008, -821858, -825028, -825464, -827760, -824296, -816760, -817112, -810641, -805348, -806051, -813896, -811217, -806158, -800154, -796639, -800468, -799712, -797403, -793362, -791893, -783653, -781061, -778415, -773859, -777119, -778432, -781401, -779114, -774533, -773620, -771963, -773085, -773625, -769462, -767751, -761620, -769591, -772283, -771696, -767921, -763037, -765120, -767382, -766607, -764578, -757828, -757814, -764712, -763883, -758168, -751949, -756603, -757597, -758375, -750159, -747290, -750210, -748528, -741387, -745522, -750403, -748606, -739753, -737001, -733934, -732233, -731626, -732292, -737601, -732114, -731921, -741858, -737475, -730151, -727584, -722348, -716250, -715875, -720715, -720443, -715096, -716963, -713088, -712624, -714376]
16842g14376K502L470L059k222P25l266J923M342k096J250P399L603J049q20p587
16827g01045L031O34j373L289l770K875K567o2K759L963N624q48L140l308k754
16812f85278J671M396K44J656N672L200p138l261M034M121m922o002R026N324
16798f67257L61l453j371J84J542M852O218k09L905K097J624L947O859M746o721
16783f42676K177l534l961k677K952l505n027P741P619J0593m658l607j979n216
16769f45758O49L790l878J090r54j653O866k160L414L556L304K145k334J987N336
16754f24600j514k451k499M952K67M37J0236O691m67L824P29J489m41j507o782
16739f11636j525K934j107J423N359R45J573J454n680N833M214o699L362J0605
$$ y = [-714376, -711874, -708404, -705345, -707567, -706842, -710108, -708185, -703843, -705939, -704689, -697290, -693687, -692638, -693458, -701045, -698014, -697380, -698753, -695464, -699234, -696359, -693792, -693854, -691095, -687132, -681508, -682356, -679216, -682524, -685278, -683607, -679211, -678967, -677311, -671639, -668439, -675577, -678838, -674804, -670683, -675605, -681607, -672581, -667257, -666896, -670349, -671720, -671536, -669994, -665142, -658924, -659133, -655228, -653131, -651507, -647560, -640701, -635955, -642676, -640499, -644033, -647994, -650671, -647719, -651224, -656251, -648510, -640891, -630298, -634956, -638563, -640542, -645758, -645109, -641319, -645197, -644107, -645061, -646714, -639848, -642008, -638594, -635038, -631734, -629589, -631923, -629936, -624600, -626114, -628565, -631064, -626112, -625845, -625408, -615172, -608481, -608948, -605124, -604395, -602906, -603347, -604854, -611636, -613161, -610227, -611334, -609911, -604552, -603607, -602034, -600580, -606260, -600427, -596213, -602912, -599550, -588945]
16725e88945n12p683j386J112k933J5L833J969l13K518J091j193N003N85n187
16710e92026J614L232M933L483L87k837l76j247k081O483O196PO93R504j956j790
16694e65781K661o230l682L467J0467J0557J008j0026k955q87K10o1L973k118
16680e59397k74J578n78R696R532n038p160j739L318Q119K193q75j906K74m3L734
16664e38566J977Q37N632K088k927r72L373P935j409m11o85J787NL175O761k165
16648e13565j0493l263Q519m835L568k6K666M863q73k299K674M416R889N74o89
16633d98874j460q7L566J949m567l906O242L301k929M654M253l175r32J864k11
16618d90312M482o497p143n85N635Q603j275j0268K226R737L933L381J676P506
$$ y = [-588945, -589457, -597140, -598526, -597414, -600347, -600332, -596499, -594530, -594843, -592325, -591234, -592427, -587424, -586839, -592026, -590412, -587180, -582247, -578764, -578377, -581214, -581590, -582837, -584918, -578435, -572239, -572232, -571539, -562035, -563991, -565781, -563120, -569350, -573032, -569565, -559098, -548541, -547533, -557559, -560514, -561401, -561191, -561252, -557279, -559397, -559671, -558093, -558671, -548975, -539443, -544481, -551641, -553380, -550062, -541943, -539750, -540625, -542531, -542257, -542300, -538566, -536589, -535752, -530120, -528032, -530959, -531931, -528558, -520623, -522032, -522443, -523128, -521341, -521336, -518161, -511400, -513565, -524058, -527321, -518802, -523637, -520069, -520095, -517429, -512566, -513439, -515738, -513064, -508648, -498759, -498185, -498874, -500334, -500421, -496855, -494906, -499473, -503379, -497137, -493836, -496765, -492111, -487858, -491033, -491965, -490101, -490312, -485830, -492327, -499470, -500055, -494420, -485817, -487092, -497360, -495134, -485397, -481464, -478083, -476407, -468901]
16604d68901p848o128M508M790o264J701j282k667q56l209j82M484J394N717J432
16589d73311J527P874k572n995M464J997O546P88M071N603k649j049L327L460
16575d45919k635m833l598M027K706N092N499n025l482M31r47m128l8J0506M777
16560d37567M334O734J627r900r610k41k412l802N099j256P36P148M809K184O808
16545d25309Q339n92l428L965K388k670K564q58k937o827m577K574L524K279K128
16530d19437K875K637M591o062k074k11l258M386O561J461N252R416j548n476
16516d00887q23J862L501L101p753q17M786N821N560m490o139n801N563M381P66
16501c91369m080j207Q98k176J147L535J642L181M406r56O663k872l819Q95Q36
$$ y = [-468901, -476749, -482877, -478369, -473579, -479843, -478142, -479424, -482091, -482947, -486156, -486338, -481854, -480460, -474743, -473311, -471784, -463910, -466482, -472477, -468013, -466016, -459470, -458682, -454611, -449008, -451657, -452706, -449379, -445919, -448554, -453387, -456985, -452958, -450252, -445160, -439661, -444686, -448168, -447737, -448684, -452812, -452850, -442344, -437567, -433233, -426499, -424872, -434772, -444382, -444623, -447035, -450837, -445738, -446994, -446258, -439110, -434301, -432117, -425309, -416970, -417562, -420990, -417025, -414637, -417307, -414743, -415601, -418538, -425365, -429942, -427368, -423844, -421565, -419437, -416562, -413925, -409334, -415396, -417470, -417681, -420939, -416553, -409992, -408531, -403279, -393863, -395411, -400887, -401710, -399848, -396347, -393246, -400999, -401816, -397030, -391209, -385649, -390139, -396278, -402079, -396516, -392135, -391369, -395449, -396656, -395758, -397934, -396787, -393252, -391610, -388429, -384023, -384979, -378316, -381188, -385007, -384112, -383276]
16486c83276N104K955o698L97l524k297O624K623m39K541N258K948K407K456N767
16471c57154o733j489n42k540l55N422K117o20N326j878j474m764O15L258K986
16456c57825L496l782o803n196N398O247l702P109L564K737p42K961K501M044
16442c39993K112M989o604o979j541k71O190P525M03O531j77N37R63J882L718
16427c20715k778L649K246l329l025j0722k949J265N267K968R76l58l010o934
16413c37449M656L495j914L635J0803L618K940M807k831r59M801L679K622j714
16399b99811o470m827o744O654Q811K739l36K46n021l857m483N860P085L166k528
16384b99516k623K053M630J202l774k687L633l632O98O782N513o68l140L549j670
$$ y = [-383276, -378172, -375217, -381915, -381518, -385042, -387339, -380715, -378092, -378531, -375990, -370732, -367784, -365377, -362921, -357154, -363887, -365376, -365918, -368458, -368813, -363391, -361274, -361894, -356568, -358446, -359920, -364684, -364069, -360811, -357825, -354329, -358111, -364914, -370110, -364712, -358465, -362167, -355058, -351494, -348757, -349499, -346538, -344037, -339993, -337881, -332892, -339496, -346475, -348016, -348287, -342097, -334572, -334169, -327638, -327815, -327278, -326315, -324433, -320715, -323493, -319844, -317598, -320927, -323952, -334674, -337623, -336358, -331091, -328123, -327147, -327505, -330515, -337449, -332793, -329298, -331212, -327577, -316774, -313156, -310216, -305409, -308240, -309199, -304398, -300719, -298097, -299811, -306281, -311108, -317852, -311198, -302387, -299648, -299984, -299738, -304759, -308616, -313099, -307239, -300154, -296988, -299516, -302139, -300086, -295456, -294254, -298028, -300715, -297082, -300714, -300016, -293234, -287721, -288389, -291529, -287980, -289650]
16369b89650m041K313m56k966Q019L82l775J55m456L17M405K645k40N430N190
16354b76728l866j969J509K840K127K837Q812M922k295K610j859n960K356M633
16340b60031N31l009N96J227k490J506K685k466K747M002j80p35n443K196J745
16325b57119m00J947j714o239L382J068j483k415k46O309n89j151M226L410j589
16310b52603Q01Q993J232k324K507J008J997L524m071l661O469N125j736l060
16296b35799J740K736l471n031J812M211P7K360L213r66l132L581L854Q14K882
16281b21119O216O21K41P270K268o689j598O578j162q752P744P753n125n557j059
16266b12370n577l529L035L621O904R03K184l53k383K568m828n712o266K994M507
$$ y = [-289650, -293691, -291378, -291834, -294800, -286781, -286399, -290174, -290019, -294475, -294158, -289753, -287108, -287348, -281918, -276728, -280594, -282563, -281054, -278214, -276087, -273250, -264438, -259516, -261811, -259201, -261060, -267020, -264664, -260031, -259500, -262509, -261913, -260686, -263176, -261670, -258985, -261451, -258704, -254702, -254882, -255617, -261060, -258864, -257119, -257519, -255572, -257286, -263525, -260143, -259075, -260558, -262973, -263219, -256910, -257499, -258650, -254424, -251014, -252603, -251802, -242809, -241577, -243901, -241394, -240386, -238389, -234865, -238936, -242597, -236128, -231003, -232739, -235799, -234059, -231323, -234794, -239825, -238013, -233802, -233725, -231365, -228152, -229118, -232250, -228669, -224815, -224001, -221119, -214903, -214282, -214041, -206771, -204503, -211192, -212790, -206212, -207374, -216126, -208382, -200629, -205754, -211311, -212370, -217947, -221476, -218441, -214820, -207916, -207013, -204829, -205182, -207565, -204997, -209825, -215537, -221803, -218809, -214302]
16251b14302Q112Q176j102n16J695L597L500l32q43L414m258l161j418n398K363
16236b00473K677O292L33O01R51k385N279j598j55K747l503l023L243r81j524
16221a91519J045M691m06r060K27P019K074L52O216r64n397L106K730j216J592
16206a79510k659P922J725l604R998J2643K656K588p499o40j200N3o27m22n497
16191a64073M15K754l49j577N28K874j945k50r86k68M038j577J71j96k279L124
16175a59596O729K198J196L664M902j139N268r41n527k662k313o150k003J000
16161a55374O721P52k517J077O834J0893P163n394j1428j43o79O020M925J721
16147a29429k104l302M30n21J459R525M778J09o556n612N58O239R374j050j1099
$$ y = [-214302, -206190, -198014, -199116, -199632, -197937, -194340, -190840, -191172, -192015, -188601, -192859, -196020, -197438, -202836, -200473, -197796, -191504, -191171, -190570, -189619, -192004, -186725, -188323, -188478, -185731, -189234, -192257, -189014, -189995, -191519, -190474, -185783, -186189, -195249, -195022, -188003, -185929, -185577, -179361, -180325, -185722, -182616, -179886, -181102, -179510, -182169, -174247, -172522, -176126, -166128, -153485, -150829, -148241, -155740, -156380, -157580, -157527, -158154, -158576, -164073, -163658, -160904, -161253, -162830, -162302, -159428, -161373, -161623, -162609, -162877, -158839, -160416, -160245, -160441, -162720, -159596, -152867, -150669, -149473, -145809, -140907, -142046, -136778, -137719, -143246, -145908, -148221, -154371, -156374, -155374, -148653, -147901, -150418, -149341, -142507, -131614, -124451, -129845, -141273, -141416, -142095, -136075, -131150, -129429, -131533, -134835, -134405, -134926, -133467, -123942, -119164, -119055, -125611, -131223, -130665, -124426, -115052, -116102, -127201]
16132a27201l835j802M008Q710j883n449L4l721L145P970M304j844j780Q35P013
16117a11496N729o099j79O896r081L098N115N668m54r94J864K775k423j221j057
16102a01859J424N174K118J612k829m934J911O751N274l399n715r90J793j352
16088i5021n779p228k611J0883R419K326J351l55J560l528q151K250J720p13P064
16073h6813M61l659j46k980k745M297J0465j749m518N198m58k207q37M681M219
16058g6791L441k14J944K887L983J811j302m379N480k103l48M664o86l536r69
16043f6118M674P34K574O989J134L65n520l690J849L419M277m12l613j334R7M256
16027e0319R504P624J582r772m737o458m12L921l310P19l189Q55Q928N84N800
$$ y = [-127201, -131036, -132838, -128830, -120120, -122003, -127452, -127418, -131139, -127994, -120024, -115720, -117564, -119344, -118509, -111496, -105767, -111866, -112045, -105149, -114230, -111132, -106017, -100349, -100803, -101797, -99933, -97158, -99581, -100802, -101859, -100435, -95261, -93143, -91531, -94360, -99294, -97383, -90632, -85358, -88757, -94472, -95462, -93669, -95021, -100800, -108028, -110639, -99756, -90337, -88011, -86660, -87015, -85455, -88983, -97134, -94884, -93164, -93877, -86813, -86352, -90011, -90157, -93137, -95882, -91585, -81120, -82869, -87387, -82189, -82647, -84854, -85691, -81010, -76791, -73350, -73564, -71620, -68733, -64750, -62939, -64241, -68620, -63140, -65243, -65591, -60927, -61613, -65149, -66118, -61444, -60710, -58136, -51147, -50013, -49648, -55168, -58858, -57009, -53590, -49313, -49725, -53338, -54672, -54575, -50319, -40815, -33191, -31609, -41381, -46118, -52576, -52988, -49067, -52377, -51658, -54847, -53992, -45064, -44480, -38680]
16012c8680R09k224K337o487k680M149L591k103k590N697J999M821K283l029L75
15997c1632Q76n801o45O075N267R29N03K482l12J663j642K268N19L757J08J454
15981a4131Q199n501j0554q248L795Q483l62J109n872K927k822o010L34j243j547
15966c1443P973K967j133j572M878L423N841k203n076j563L283K657M214n06J833
15951f427O87J964l403K701R058O081J290j132J129K02l845q06j355m396O59N578
15935G985N335j036k190Q37J076N017j354p826P036J905j497p129K864O516p760
15920I779P789Q460J156j2l843l202K907P737j563j383j067J784l52j214m385
15905B2591j338L250P260N413K783o208o660J972M71L248m547k660J434K136K296
$$ y = [-38680, -37771, -39995, -37658, -44145, -46825, -42676, -39085, -41188, -43778, -38081, -36082, -31261, -28978, -32007, -31632, -30756, -36557, -37202, -31127, -25860, -24931, -24428, -21946, -22258, -20595, -22237, -19969, -19450, -15693, -15585, -14131, -5932, -11433, -21987, -30235, -26440, -17957, -18319, -17210, -23082, -20155, -22977, -28987, -28653, -29896, -31443, -23470, -20503, -21636, -23208, -18330, -14907, -9066, -11269, -16345, -17908, -14625, -11968, -7754, -8260, -6427, -5740, -3776, -7179, -4478, 4580, 10661, 11951, 10819, 11948, 12150, 8305, 7499, 6144, 1748, 2407, 7985, 13320, 12284, 10094, 10931, 12007, 17024, 15670, 7844, 14880, 16785, 15288, 8159, 11023, 17539, 9779, 17568, 26028, 27184, 27172, 23329, 20127, 23034, 30771, 29208, 27825, 26758, 28542, 28190, 26976, 22591, 21253, 24503, 31763, 37176, 39959, 33751, 27091, 29063, 29534, 32782, 28235, 25575, 27009, 29145, 31441]
15890C1441L582J865o795O50R970O637l622J896j987L708L593o18m716j152Q169
15875E2621L142p118m773J963m252l909m22J374P046P511j707o179K387M110n603
15860D6191K188N141M506O077l484l592q87m137M965O284K287n087R608M512m990
15845F9582n373p376L886K201q55n27L91P654j870n575K139K228K416J069O583
15830G6573O579l753o031M03k427K178L966o27R37J389Q86l31r88K675R74M105
15814H6508m71K640k880N15K436j575j082M369L559P227K662L15J957r939j1636
15799H4605Q257J1076K506P822l065j1308N722O131r562k892L809k122K985J169
15785A05133l743j292O669Q77j556L713j25K154K257K337m33M009q21l875k356
$$ y = [31441, 35023, 36888, 30093, 30743, 40713, 47350, 43728, 45624, 43637, 47345, 50938, 50320, 45604, 44452, 52621, 55763, 48645, 43872, 45835, 41583, 37674, 37252, 38626, 45672, 53183, 51476, 45297, 47684, 51794, 46191, 48379, 53520, 58026, 64103, 60619, 57027, 56140, 52003, 56968, 63252, 65539, 60452, 70060, 74572, 69582, 64209, 56833, 60719, 62920, 62065, 61538, 61929, 69583, 67713, 62138, 64277, 66505, 68921, 69990, 76573, 83152, 79399, 73368, 73771, 71344, 73522, 77488, 76861, 77798, 79187, 80073, 79742, 78754, 81429, 82403, 86508, 86037, 88677, 85797, 86312, 88748, 87173, 86091, 90460, 94019, 101246, 103908, 104223, 106180, 96241, 84605, 92862, 103938, 106444, 114266, 111201, 99893, 105615, 111746, 102184, 99292, 103101, 100979, 103964, 105133, 101390, 100098, 106767, 107644, 106088, 109801, 109676, 111830, 114087, 116424, 115991, 120000, 119179, 115304, 112948]
15770A12948O544P188J047r76k037l745n804R14L058Q042M411m230o332K77m393
15755A16912k09M152L183l398m679m481J322J1294l584m617j155k225k892M356
15741A13979J2145O103K032M581N733K984k075n406j459N616J755l72l457n397
15727A36762L382L46J764N781M975M324l175o709m359p134k18O418M886L004M180
15712A54227L78r84o772k436K055K573J779O226M572k189l408R475R14l7l158
15697A63215j623n602P25K548j324P404Q773J413K870Q87n560j228n384p85P115
15682A73444O5o135k471L464M38R213o85l371r30j404O356J20l680j075R00n302
15666A68947J135M902J427K473J548K722L804j136M481J780p310J434N599J926
$$ y = [112948, 119492, 126680, 127727, 126751, 124714, 120969, 115165, 116079, 119137, 127179, 131590, 127360, 121028, 121305, 116912, 116703, 120855, 124038, 120640, 115961, 111480, 112802, 124096, 120512, 115895, 114740, 112515, 109623, 113979, 126124, 132227, 134259, 138840, 144573, 147557, 145482, 140076, 138617, 144233, 145988, 145616, 142159, 136762, 140144, 140490, 142254, 148035, 153010, 157334, 154159, 147450, 143091, 135957, 135739, 142157, 147043, 150047, 154227, 154605, 153621, 146849, 144413, 146468, 149041, 150820, 157046, 161618, 159429, 156021, 165496, 166410, 166373, 163215, 161592, 155990, 156715, 159263, 157939, 165343, 174116, 175529, 178399, 179286, 173726, 172498, 167114, 166329, 173444, 173509, 167374, 164903, 168367, 168805, 178018, 177333, 173962, 173032, 171628, 177984, 178104, 174424, 173349, 174249, 168947, 170082, 174984, 176411, 178884, 180432, 183154, 186958, 185822, 190303, 192083, 184773, 186207, 191806, 193732]
15652A93732N465j8p456q968O278M542R77k59J990n15J070P736O034j0286r078
15637A91244R02M140J0412J5630N807j2730n590j066j802O309j075l534K55J588
15623B10490n456J596K055n96l920o199M417R048k30l593L218K357L024K927q16
15608B18322o33K274N86l136j627J748J450J0081N74L417K588J80m174j0773N311
15593B26188O06m229P084N390m810o557O355R161R355M944p817j637l162R857
15579B50728M497j059m403O94n847m927l341J595j257Q251J442n489R660K947
15565B53491r43J294P13m650O795O631k698k703K919J0384K497n468k317M939
15551B70884K170L537n396j253L443L256N607M329k311L049Q034N366O671L238
$$ y = [193732, 199197, 199179, 191723, 182755, 189033, 193575, 194552, 194293, 196283, 195768, 196838, 204574, 210608, 200322, 191244, 192146, 196286, 206698, 222328, 228135, 215405, 209815, 208749, 206947, 213256, 212181, 208647, 208902, 210490, 205034, 206630, 208685, 208089, 204169, 197970, 202387, 211435, 211205, 207612, 210830, 213187, 216211, 219138, 218322, 217689, 219963, 220549, 217413, 215786, 217534, 218984, 229065, 229639, 233056, 235644, 235824, 231650, 220877, 226188, 226794, 222565, 229649, 235039, 230229, 223672, 230027, 239188, 248543, 253487, 245670, 244033, 240871, 250728, 255225, 254166, 249763, 250457, 244610, 239683, 236342, 237937, 236680, 244931, 246373, 240884, 250544, 253491, 252548, 253842, 254555, 249905, 256700, 263331, 260633, 257930, 260849, 271233, 273730, 268262, 265945, 270884, 273054, 276591, 271195, 269942, 273385, 276641, 282248, 286577, 284266, 287315, 295349, 300715, 307386, 310624]
15537C10624o287j9039j3511k077j831j332n447r91R114L746K283K259k632K877
15523B77756K266K79o52K354j885j339Q322M015R02k636K298k608J241N365K784
15508B98462k363K329j623o397j664o55K184j373N578K808j430K901R111N632
15494C13500k411m669j0643Q66k452J77m3n633K953R330J704K84L52l4P049R071
15478C19401M66n299Q046r64q638J666n87N846K926m538N174K146k704n035j041
15463C16865P221M238m320K34j949j5N31L108k22k106L157Q002n848l199o44m903
15447C20150o73K073O430M228J218P83n738Q975J436m147M962K793k667n255n058
15432C29510J069o34K283N887k692M058J5394Q215n22L054J640n921q394Q29J983
$$ y = [310624, 304337, 285298, 271787, 269710, 267879, 266547, 261100, 260109, 269223, 272969, 275252, 277511, 274879, 277756, 280022, 280301, 279649, 282003, 280118, 278779, 287101, 291116, 292018, 289382, 291680, 289072, 290313, 295678, 298462, 296099, 298428, 296805, 290408, 288744, 288089, 290273, 288900, 294478, 297286, 295856, 298757, 307868, 313500, 311089, 306420, 295777, 296643, 294191, 294368, 294325, 288692, 291645, 300975, 302679, 302963, 303315, 303281, 310330, 319401, 319867, 314568, 322614, 321650, 313012, 314678, 314091, 319937, 322863, 318325, 323499, 325645, 322941, 317906, 316865, 324086, 328324, 324004, 324238, 322289, 322274, 322805, 325913, 325691, 323585, 326742, 334744, 328896, 325697, 325053, 320150, 319477, 321550, 327980, 332208, 333426, 334209, 328471, 337446, 338882, 334735, 339697, 342490, 339823, 334568, 329510, 330579, 329945, 332228, 338115, 335423, 339481, 354875, 363090, 362568, 365622, 367262, 361341, 352947, 353776, 355759]
15417C55759J00J806O532P068o7k173o49K388k500J057L88j16j505J121L059K301
15401C74569m747J969O591o60l951K503M256K246l2j585m900j826O45j574L167
15386C76671O352L318K439k520J501k038k693O178M3J638l839n302N336M831j464
15371C90451J259O148N711K317m39M448o311o917K996O129N178L690l730p44p933
15356D02253J816K720k87K130o354j054j577M927k442j416k835k698L125Q601
15342D06909M011N44J849K454p07O38P735L266J108j782M553J864J880k496P75
15327D32601j692k876J868M337N401M82J137j707M193j509j615J363K738L167
15313D47888N7k618r204l955K121Q581L558k329j321K040q24j909q13R481J801
$$ y = [355759, 355859, 357665, 364197, 371265, 371198, 369025, 368376, 370764, 368264, 369321, 369709, 369593, 368088, 369209, 372268, 374569, 369822, 371791, 378382, 377722, 373771, 376274, 380530, 382776, 382744, 381159, 376259, 374433, 375078, 373504, 376671, 383023, 386341, 388780, 386260, 387761, 385723, 383030, 389208, 389251, 390889, 387050, 381748, 387084, 391915, 390451, 391710, 397858, 403569, 405886, 405447, 409895, 403584, 396667, 399663, 405792, 410970, 414660, 410930, 410186, 402253, 404069, 406789, 406502, 408632, 402278, 401224, 399647, 404574, 402132, 400716, 397881, 395183, 398308, 406909, 410920, 411464, 413313, 415767, 415060, 415698, 423433, 426699, 427807, 426025, 430578, 432442, 434322, 431826, 432601, 430909, 428033, 429901, 434238, 439639, 440121, 441258, 439551, 443744, 442235, 440620, 441983, 444721, 447888, 447945, 445327, 436123, 432168, 434289, 442870, 446428, 444099, 442778, 444818, 443994, 442085, 441272, 450753, 452554]
15298D52554j622j352J308m268O60Q646K371K747J467l103j903l291o868P138
15284D54484J1720Q30k727J536l187M214P920K839K515j721j811R09j180K172
15270D78513K245r83n882k485L707M013K544o15J915K321N671J212n976N218O36
15255D92054k537m78L279J899K099O692K209k58O397k64o686J319q3k60k853O43
15239E03172J629O936O945l845p769K574N176N244k475p403k326l96N379K837
15225E15678K268N133K024m819k599M308K855J0051M700K7k273K58O435J651P27
15210E46424Q08j667m331j269K062J379J287J01k626j93O339O781P573K048l154
15195E61562j954l466J85J624j133L812O054m899k345L861P61N833l8k537J85
$$ y = [452554, 450932, 449580, 450888, 446620, 447280, 455926, 458297, 461044, 462511, 459408, 457505, 454214, 447346, 454484, 466204, 467034, 464307, 465843, 462656, 466870, 474790, 477629, 480144, 478423, 476612, 477521, 476341, 478513, 480758, 479775, 473893, 471408, 475115, 479128, 481672, 481057, 482972, 485293, 490964, 492176, 486200, 491418, 492054, 489517, 489039, 492318, 494217, 496316, 503008, 505217, 504959, 511356, 511092, 504406, 505725, 505642, 505382, 502529, 503172, 504801, 511737, 518682, 514837, 507068, 509642, 514818, 520062, 517587, 510184, 507858, 507462, 512841, 515678, 517946, 523079, 525103, 520284, 517685, 521993, 524848, 534899, 539599, 539626, 537353, 537611, 544046, 545697, 546424, 547232, 545565, 541234, 539965, 542027, 543406, 544693, 544794, 542168, 541975, 548314, 555095, 562668, 564716, 561562, 559608, 556142, 556327, 557951, 556818, 560630, 566684, 561785, 559440, 563301, 564062, 569895, 569857, 567320, 567505]
15180E67505k979o288Q754L711J178K776M599K622O30M802J655r406N930O583
15166E92072k324L883N302K773J339L343q491n280k503L580J212o37O427J453
15152F02149k779P41M374N787O954M637k24j0248K9M488M227J479l536k104K039
15137F18013N801o39k713o561M993P840N079N85K640J210P387P672o44n430J143
15122F46376J297j805K354N792O882R11J267j800L996r43Q57M686M635o364J475
15107F69616K719J79L364N652P47o839m31P211J224k825n661K199J1958R472P875
15092G06460k871K887J1473P893R99o384K375L465J21Q524L739n68K414Q26M899
15077G46252j575K039K842Q544L674k98Q86K363l380Q896N634K460N949M583K900
$$ y = [567505, 564526, 558238, 566992, 570703, 571881, 574657, 579256, 581878, 582508, 587310, 588965, 579559, 585489, 592072, 589748, 593631, 598933, 601706, 603045, 606388, 597897, 592617, 590114, 593694, 594906, 594269, 600696, 602149, 599370, 600111, 604485, 610272, 617226, 621863, 621639, 611391, 611420, 615908, 620135, 621614, 618078, 615974, 618013, 623814, 623175, 620462, 613901, 618894, 626734, 631813, 632398, 635038, 636248, 643635, 651307, 650663, 645233, 646376, 647673, 645868, 648222, 654014, 660896, 661807, 663074, 661274, 665270, 664327, 665184, 669870, 674505, 668141, 669616, 672335, 672514, 675878, 681530, 682277, 675438, 675007, 682218, 683442, 680617, 674956, 677155, 689113, 698585, 706460, 703589, 706476, 717949, 725842, 726841, 720457, 722832, 726297, 726418, 734942, 738681, 738113, 740527, 741353, 746252, 744677, 746716, 749558, 758102, 761776, 761478, 762364, 764727, 761347, 770243, 775877, 778337, 784286, 788869, 791769]
15062G91769j94m135J118J324n755J490L573J5431Q857N742L477N593K961k966
15048H28285o435m113J1121J2499O933K449R203J3592M731j1691L605J4397J0702
15035H95278K469J121M759P871J5054P221Q505O216O315O995O400J9559J0423
15022I98186j097L874R949J3315O034P031O442J2130J1339J4426K3448J7739J5784
15009A138600J9737K0190K9562K0328J9713L1677K3127K2433L3192L7616M4153
14998A440328L7546M4785M5024N0189O0076O2425O7251Q2031R7054J17580J30387
14987B234676J55597J87553K30771K92745M02203N36173O55522L55744j388368
14978C662616l437271k121695l13057J21042K25394K39203K22592K01267J66988
$$ y = [791769, 791575, 787440, 788558, 789882, 784127, 785617, 789190, 804621, 813478, 819220, 822697, 828290, 831251, 828285, 821850, 817737, 828858, 841357, 848290, 850739, 859942, 873534, 878265, 866574, 870179, 884576, 895278, 897747, 898868, 903627, 911498, 926552, 933773, 942278, 948494, 954809, 961804, 968204, 987763, 998186, 997089, 1000963, 1010912, 1024227, 1030261, 1037292, 1043734, 1055864, 1067203, 1081629, 1105077, 1122816, 1138600, 1158337, 1178527, 1208089, 1228417, 1248130, 1279807, 1302934, 1325367, 1358559, 1396175, 1440328, 1477874, 1522659, 1567683, 1617872, 1677948, 1740373, 1807624, 1889655, 1986709, 2104289, 2234676, 2390273, 2577826, 2808597, 3101342, 3503545, 4039718, 4695240, 5050984, 3662616, 225345, -1896350, -2209407, -2088365, -1862971, -1623768, -1401176, -1199909, -1032921]
14969a032921J37362J16999J00489Q5958P1226M9217J7941Q440K1969M0018M0415
14958c42887L7900L4349K9679M2654M2564L8448K9554K6581K8691J8533J5424
14947A490K4734K2358J6116K1119K3715J9514J5000R635J4849J1725K0273J5927
14935B16455J0251J0253R401J3389J6651J1284M103Q158R831P297P852P799R219
14922C41943M575J2961J0701K603K923L047J1573R049K010J0998R649O582N894
14909D34508M909L096J1255Q458N354p644k943R900L712Q987O547O17L114Q132
14895D98002L204M22J716M912P045P373O512j543k740n15J797N601J0428N218
14881E47432M411Q048k954J608q79Q26M552Q429j137J58k145M839J978L301P462
$$ y = [-1032921, -895559, -778560, -678071, -592113, -520887, -471670, -453729, -445289, -423320, -383302, -342887, -304987, -270638, -240959, -198305, -155741, -117293, -87739, -61158, -32467, -13934, 1490, 26224, 48582, 64698, 85817, 109532, 129046, 144046, 153681, 168530, 180255, 200528, 216455, 226706, 236959, 246360, 259749, 276400, 287684, 291787, 299945, 309776, 317073, 324925, 332724, 341943, 346518, 359479, 370180, 372783, 375706, 378753, 390326, 399375, 401385, 412383, 422032, 428614, 434508, 439417, 442513, 453768, 462226, 467580, 459936, 456993, 466893, 470605, 479592, 486139, 486756, 489870, 498002, 501206, 501628, 503344, 508256, 515301, 522674, 529186, 527643, 524903, 524388, 526185, 531786, 542214, 547432, 551843, 559891, 556937, 558545, 557666, 558492, 563044, 571473, 570336, 570494, 568349, 573188, 575166, 578467, 585929]
14866E85929K302K095R282k477q5J11J196J935M704Q889L942m32j692q81J34k469
14850F12483M837M496M421N285N796M157K164l487J00M828N279p1J50J35j0458
14835F40115J216J0118P437J3159R104j1293p578P895Q007L559N961l474j0400
14822F73826p36O101j14J381P957L550K315Q6k681j471J573P60O151k646N049
14807G01101N263J410N03m688K589K260j081n16M471N303P807k18K848N684K740
14792G35476n799M441Q274n515J563K908J521K849L071l569k34Q11M043P792J247
14777G58879k449k9J000m546j063M163J18L736O234J0918l563k125j650n95P196
14762G76224P120N207j699J557j176K304k373m638M975J073L987J469n454J674
$$ y = [585929, 588231, 590326, 599608, 597131, 597046, 597157, 598353, 600288, 604992, 613881, 617823, 617391, 615699, 614818, 614952, 612483, 617320, 621816, 626237, 631522, 637318, 641475, 643639, 640152, 640252, 645080, 650359, 650288, 650438, 650573, 640115, 641331, 651449, 658886, 672045, 681149, 669856, 662278, 670173, 678180, 681739, 687700, 684226, 673826, 673090, 679191, 679077, 680458, 688415, 691965, 694280, 694366, 691685, 690214, 691787, 692547, 698698, 696052, 701101, 706364, 707774, 708277, 703589, 706178, 708438, 707357, 706841, 711312, 716615, 724422, 724204, 727052, 732736, 735476, 729677, 734118, 742392, 736877, 738440, 741348, 742869, 745718, 748789, 745220, 744986, 745797, 749840, 757632, 758879, 756430, 756401, 757401, 752855, 751792, 755955, 756073, 759809, 766043, 776961, 773398, 771273, 769623, 769028, 776224, 783344, 788551, 786852, 788409, 787233, 789537, 787164, 782526, 787501, 788574, 792561, 794030, 788576, 790250]
14748G90250J735K149j366N048P142J655k584p21K756J354r00L275P249N193l045
14733H19190o381q22M20J268J0623O000n864j637K099M320O153j21m113j94j498
14718H29443M30M937M561j213M521P065J799K559k391k475M119r35p718M23N271
14703H50396r0j625Q366J393J544Q876L745J739N55k699m09J32M848J310k926
14688H75155L083M633J687L447l210M429P4L162L934o930P90L610K684M325L123
14673I03996J860j566K083K695N059M478O061J732L52k17n049n374m87l213p19
14658I11691K783L330J143J396M415j369J574J910L60K959Q38J225Q15M195J929
14643I39194j465k583l615K340J0054L048M843Q012M147p81K271j658l538K040
$$ y = [790250, 791985, 794134, 792768, 797816, 804958, 806613, 804029, 803308, 806064, 807418, 806518, 809793, 817042, 822235, 819190, 812809, 811987, 812407, 813675, 824298, 830298, 824434, 822797, 824896, 829216, 835369, 835248, 831135, 830941, 829443, 829873, 834810, 839371, 838158, 842679, 849744, 851543, 854102, 851711, 849236, 853355, 852420, 844702, 845125, 850396, 850306, 848681, 857047, 858440, 859984, 868860, 872605, 874344, 874899, 872200, 871791, 871923, 876771, 878081, 875155, 878238, 882871, 884558, 888005, 884795, 889224, 889298, 892460, 896394, 889464, 890254, 893864, 896548, 900873, 903996, 905856, 904290, 906373, 909068, 914127, 918605, 924666, 926398, 926750, 926533, 921484, 916110, 915623, 912410, 911691, 914474, 917804, 918947, 920343, 924758, 923389, 924963, 926873, 927233, 930192, 931030, 932255, 933070, 937265, 939194, 937729, 935146, 931531, 933871, 943925, 946973, 951816, 959828, 963975, 963194, 965465, 963807, 960269, 962309]
14629I62309L443o68l193n34J085K964J464O422P268L153L423l420R105M595l415
14614I94001n820k083M131q07J200K945O304P262p04J7k33j592N770P116J828
14599A019335q41J227n60L432n458l980Q579Q202N372j868l892m700M37J521M205
14584A031011m469j720j809j177L951L794m728O239Q599R925P175L516K353J032
14570A063692O702Q28r83N543k81p594n617L103N189M719L666o286Q68K20n09
14555A073260Q080N378j506r76l679l577L983R116Q752M138p827q728l431L049
14541A086032M261K916K952Q510L866k480l58k189P644J0163k392k075L112M203
14527A124165k260K409k455j279O451K497K194J823J421R283J0680k000o703n038
$$ y = [962309, 965752, 965084, 961891, 961357, 962442, 965406, 966870, 973292, 980560, 983713, 987136, 983716, 992821, 997416, 994001, 988181, 986098, 990229, 989422, 990622, 993567, 999871, 1007133, 1006429, 1006446, 1006213, 1004621, 1010391, 1017507, 1019335, 1018494, 1019721, 1019161, 1022593, 1017135, 1013155, 1021734, 1029936, 1035308, 1033440, 1029548, 1024848, 1025285, 1026806, 1031011, 1026542, 1024822, 1023013, 1021836, 1025787, 1029581, 1024853, 1031092, 1039691, 1049616, 1056791, 1060307, 1062660, 1063692, 1070394, 1071222, 1070239, 1075782, 1075501, 1067907, 1062290, 1065393, 1070582, 1075301, 1078967, 1072681, 1073549, 1073769, 1073260, 1081340, 1086718, 1085212, 1084236, 1080557, 1076980, 1080963, 1090079, 1098831, 1102969, 1095142, 1086414, 1082983, 1086032, 1090293, 1093209, 1096161, 1104671, 1108537, 1106057, 1105699, 1103510, 1111154, 1121317, 1118925, 1116850, 1119962, 1124165, 1121905, 1124314, 1121859, 1120580, 1127031, 1129528, 1131722, 1133545, 1134966, 1144249, 1154929, 1152929, 1146226, 1141188]
14513A141188M677M265j655o994j880J316L336R478O920j003L223J932q85k455
14499A161463k575N685q992L299P707J191N355J006k156J0570M199L631P641l1
14485A197993k11L031L776J691k573L579K724K921n608J291j525k422l333Q652
14471A209986P500K862j398L368K983K308j88p519J785J0204P635P778n140k777
14457A239387O56J778M972q21Q799O023p19Q36K826j301q648l387K61P730N819
14442A264211K081P642M417k721k50n665o99L727j106K429N855P579l619J0504
14428A294385K210o646L450R171N886N406J411m043N100O297N976J3385N253P04
14414A347945K13o853j5071r790o051l110R414L95K81P510M321n565r619K497
$$ y = [1141188, 1145865, 1150130, 1148475, 1141481, 1139601, 1140917, 1144253, 1153731, 1160651, 1159648, 1162871, 1164803, 1163918, 1161463, 1158888, 1164573, 1155581, 1158880, 1166587, 1167778, 1173133, 1174139, 1171983, 1182553, 1186752, 1190383, 1198024, 1197993, 1197782, 1200813, 1204589, 1206280, 1203707, 1207286, 1210010, 1212931, 1207323, 1208614, 1207089, 1204667, 1201334, 1209986, 1217486, 1220348, 1218950, 1222318, 1225301, 1227609, 1227421, 1219902, 1221687, 1231891, 1239526, 1247304, 1242164, 1239387, 1240043, 1241821, 1246793, 1245972, 1254771, 1260794, 1260075, 1260911, 1263737, 1262436, 1253788, 1250401, 1250662, 1258392, 1264211, 1266292, 1273934, 1278351, 1275630, 1275380, 1269715, 1269016, 1272743, 1271637, 1274066, 1279921, 1287500, 1283881, 1294385, 1296595, 1289949, 1293399, 1302570, 1308456, 1313862, 1315273, 1311230, 1316330, 1322627, 1328603, 1341988, 1347241, 1347945, 1348158, 1341305, 1326234, 1316444, 1310393, 1307283, 1316697, 1317092, 1317373, 1324883, 1329204, 1323639, 1314020, 1316517]
14400A316517N210O638J0793R953k864j418K609O543O465L40l784L421L506O435
14386A370364O841k301m384p591M403N767p22N07L096P208Q558J499n09k087M023
14371A394672J200K58P290Q933R87j663m912J45K917L538j083K603O46Q521J674
14356A425726M375O130k105N284O445L733Q71k911k390K562O616j893R51L446
14342A456840n763p3P929R325L670o92K212n54K509K709r23P06j264k947j241
14327A472443Q297N449J829J74N997J3943M270J915k165j461k876O910P218k027
14313A519916j869j544J1118O720m246k428L212K355L840Q302M457l166q08L313
14299A549172o53M971P348K637K476L379O167k988N581j029j967Q60p52j415Q937
$$ y = [1316517, 1321727, 1328365, 1339158, 1349111, 1346247, 1344829, 1347438, 1353981, 1360446, 1360786, 1357002, 1360423, 1363929, 1370364, 1377205, 1374904, 1370520, 1362929, 1367332, 1373099, 1372377, 1372884, 1375980, 1383188, 1391746, 1393245, 1392736, 1390649, 1394672, 1395872, 1396130, 1403420, 1412353, 1413340, 1411677, 1406765, 1406910, 1409827, 1413365, 1412282, 1414885, 1415531, 1424052, 1425726, 1430101, 1436231, 1434126, 1439410, 1445855, 1449588, 1450459, 1447548, 1445158, 1447720, 1454336, 1452443, 1453394, 1456840, 1451077, 1451004, 1458933, 1468258, 1471928, 1471236, 1473448, 1472894, 1475403, 1478112, 1477189, 1477895, 1476631, 1473684, 1472443, 1480740, 1486189, 1488018, 1488192, 1494189, 1508132, 1512402, 1514317, 1512152, 1510691, 1507815, 1514725, 1521943, 1519916, 1518047, 1516503, 1527621, 1534341, 1530095, 1527667, 1530879, 1533234, 1537074, 1545376, 1549833, 1546667, 1545859, 1549172, 1548519, 1553490, 1560838, 1563475, 1565951, 1569330, 1575497, 1572509, 1578090, 1577061, 1575094, 1575954, 1575202, 1573787, 1582724]
14284A582724P509N748L205o05J281J420L895N7m026L63P523K478K271Q016Q443
14269A630302J825k376P676O493r28j260K522l899K105M708L293O886N964O801
14255A670112l03O303N047j196m478N994J912L198L519m143M084M340L339R131
14241A706859M28o558j453K472J1182R673L927j535N557K676J635K996L651k277
14227A739233K627K964K460Q224M953j003k949k33M728L526m406J332n56L316
14213A764216M948J2403Q182q71J267M377J247l93N645M422K546k113K840K532
14199A811248N083J3314P753J648j308m059j93Q549P779P990Q568K688l872k485
14185A862703M331K526J392O309M10k005m17O642J928M305O510J786j896L214
$$ y = [1582724, 1590233, 1595981, 1599186, 1598581, 1599862, 1601282, 1605177, 1605234, 1601208, 1601571, 1609094, 1611572, 1613843, 1621859, 1630302, 1632127, 1629751, 1637427, 1643920, 1642992, 1641732, 1644254, 1640355, 1642460, 1647168, 1650461, 1657347, 1663311, 1670112, 1669809, 1676112, 1681159, 1679963, 1675485, 1681479, 1683391, 1686589, 1690108, 1685965, 1690049, 1694389, 1697728, 1706859, 1707287, 1700729, 1699276, 1701748, 1712930, 1722603, 1726530, 1724995, 1730552, 1733228, 1734863, 1737859, 1741510, 1739233, 1741860, 1744824, 1747284, 1755508, 1760461, 1759458, 1756509, 1756276, 1761004, 1764530, 1760124, 1761456, 1760900, 1764216, 1769164, 1781567, 1789749, 1788878, 1790145, 1794522, 1795769, 1795376, 1801021, 1805443, 1807989, 1805876, 1808716, 1811248, 1816331, 1829645, 1837398, 1839046, 1837738, 1833679, 1833486, 1842035, 1849814, 1857804, 1866372, 1869060, 1865188, 1862703, 1867034, 1869560, 1870952, 1877261, 1877671, 1875666, 1875249, 1881891, 1883819, 1888124, 1894634, 1896420, 1894524, 1897738]
14171A897738M763J12O606M052l058Q77Q350J2919P739j61j837K674K695L629
14157A947098Q182L721k993J88K468J588M423J3303P538J181j22K137L912O802
14143A999426r9Q168J4075M931n762M941R806l331M468M292M425j211N185L672
14129B052986P575L715n589j451M094K379k80Q501N235O110J1945k31L839R73
14115B099801L28M626L395J0659R692P025N102k685L598K438J716O900N692M081
14101B162368K336q576K094O594O964J750O263O539N256K580M229Q923J0393L736
14087B221449k78Q833J1096P574J967L180K502K333M489P208N551N623M419M057
14073B290003K117K427n79J1208J0719J3422J6176J1066M386R973J0066J2790
$$ y = [1897738, 1902501, 1902613, 1909219, 1913271, 1910213, 1911090, 1919440, 1932359, 1940098, 1939937, 1938100, 1940774, 1943469, 1947098, 1955280, 1959001, 1956008, 1956196, 1958664, 1960252, 1964675, 1977978, 1985516, 1986697, 1986575, 1988712, 1992624, 1999426, 1999327, 2007495, 2021570, 2026501, 2020739, 2025680, 2035486, 2032155, 2036623, 2040915, 2045340, 2044129, 2049314, 2052986, 2060561, 2064276, 2058687, 2057236, 2061330, 2063709, 2063429, 2071930, 2077165, 2083275, 2095220, 2094989, 2098828, 2099801, 2100129, 2104755, 2108150, 2118809, 2128501, 2135526, 2140628, 2137943, 2141541, 2143979, 2145695, 2152595, 2158287, 2162368, 2164704, 2156128, 2158222, 2164816, 2171780, 2173530, 2179793, 2186332, 2191588, 2194168, 2198397, 2207320, 2217713, 2221449, 2221171, 2230004, 2241100, 2248674, 2250641, 2253821, 2256323, 2258656, 2263145, 2270353, 2275904, 2281527, 2285946, 2290003, 2292120, 2294547, 2293968, 2305176, 2315895, 2329317, 2345493, 2356559, 2360945, 2370918, 2380984, 2393774]
14061B393774N253o338k5157l1077j8444m187R343M953Q931O721K745M728N425
14048B356670P512N167L686J0597N252R924J1487l574M644J4650J0795Q467P156
14035B452433L204M016J3202J7372L882M214J1109J6646J2827J3753J2409R161
14023B574228J5005J4585J9530K3896K6034K5995K2025l22l8459r5081j13191
14012B474245o4264k0926O13J0518J6970J9251J8712J7263R373Q780J1246J3339
14000B515120J0674O892K622J1575R175O548O813O463J4878K3964J0557L712N246
13987B634239J1673J6620Q917Q866J1953J9066J3901J2993J8490J8891J4576J6572
13975B806757J8054K3871J7590J9935J3578k3511p9558j15962p5492j7697J1530
$$ y = [2393774, 2399027, 2392689, 2367532, 2336455, 2318011, 2313824, 2323167, 2328120, 2337051, 2343772, 2346517, 2351245, 2356670, 2364182, 2369349, 2373035, 2383632, 2388884, 2398808, 2410295, 2406721, 2411365, 2426015, 2436810, 2445277, 2452433, 2455637, 2459653, 2472855, 2490227, 2494109, 2498323, 2509432, 2526078, 2538905, 2552658, 2565067, 2574228, 2589233, 2603818, 2623348, 2647244, 2673278, 2699273, 2721298, 2720976, 2682517, 2587436, 2474245, 2409981, 2389055, 2389668, 2400186, 2417156, 2436407, 2455119, 2472382, 2481755, 2490535, 2501781, 2515120, 2525794, 2532686, 2535308, 2546883, 2556058, 2562606, 2569419, 2575882, 2590760, 2614724, 2625281, 2628993, 2634239, 2645912, 2662532, 2671449, 2680315, 2692268, 2711334, 2725235, 2738228, 2756718, 2775609, 2790185, 2806757, 2824811, 2848682, 2866272, 2886207, 2899785, 2876274, 2796716, 2680754, 2605262, 2587565, 2599095]
13964B599095J3733J5378J8230K2124P561J4280J2849M797M730R155J3203J0560
13952B745695J1641J4335J1808O323O233J4998J1682P565N071O790Q708J3572
13940B864421J6097J1419P782J1711J6754J2161j185P434J8982J7378J3839J3732
13928C010525J0454P615O566K011k2048l1575j8692L040J3855P712N828O662J7487
13915C019440J3867L516M136O525O757J3054N601R966R493J5742J5664P670N863
13902C137294L251Q254P323Q721O298J0932J7505J2934J1236J1816R013P797O521
13889C258895J5440J4181M509O283Q289J3132J6966Q493j932L430O990Q413K501
13876C365590R170J7548J5691Q145J1543J6428J0706M002P169P041J1544K0651
$$ y = [2599095, 2612828, 2628206, 2646436, 2668560, 2676121, 2690401, 2703250, 2708047, 2712777, 2721932, 2735135, 2745695, 2757336, 2771671, 2783479, 2789802, 2796035, 2811033, 2822715, 2830280, 2835351, 2842141, 2850849, 2864421, 2880518, 2891937, 2899719, 2911430, 2928184, 2940345, 2939160, 2946594, 2965576, 2982954, 2996793, 3010525, 3020979, 3028594, 3035160, 3037171, 3015123, 2983548, 2964856, 2967896, 2981751, 2989463, 2995291, 3001953, 3019440, 3033307, 3036823, 3040959, 3047484, 3054241, 3067295, 3072896, 3082862, 3092355, 3108097, 3123761, 3131431, 3137294, 3140545, 3148799, 3156122, 3164843, 3171141, 3182073, 3199578, 3212512, 3223748, 3235564, 3244577, 3252374, 3258895, 3274335, 3288516, 3293025, 3299308, 3307597, 3320729, 3337695, 3346188, 3344256, 3347686, 3354676, 3363089, 3365590, 3374760, 3392308, 3407999, 3416144, 3427687, 3444115, 3454821, 3458823, 3465992, 3473033, 3484577, 3505228]
13864C505228J3750J4583J4163J1287Q487N041Q787O873K445q86L996J5286J6537
13851C625577R511P211J5017Q680J1840J5239J3039O891Q287M458J2035J3753
13839C751538J7206J5488O118R805J1006P925J4209J8892R818Q988J7716J4633
13827C903342J1709J3115J1094J7261J2264O488R769K2955J9804J7561J6433J7562
13815D079357P913J0535J1281Q708R360J2951J5049O381Q277J6258J3438Q450
13803D207958Q984J0970J9136K7372J6389J0924J2998Q171N098K1695K2004J7364
13791D389063J4150K1823K2156J8129K0541J1782J3839J5706J9071J7221K1307
13780D584788J7729K5529K8658K1458J3938K0511K7026K7857K5272J9530K0352
$$ y = [3505228, 3518978, 3533561, 3547724, 3559011, 3567498, 3572539, 3581326, 3588199, 3590644, 3589758, 3593754, 3609040, 3625577, 3635088, 3642299, 3657316, 3665996, 3677836, 3693075, 3706114, 3713005, 3721292, 3725750, 3737785, 3751538, 3768744, 3784232, 3790350, 3800155, 3811161, 3819086, 3833295, 3852187, 3862005, 3870993, 3888709, 3903342, 3915051, 3928166, 3939260, 3956521, 3968785, 3975273, 3985042, 4007997, 4027801, 4045362, 4061795, 4079357, 4087270, 4097805, 4109086, 4117794, 4127154, 4140105, 4155154, 4161535, 4169812, 4186070, 4199508, 4207958, 4216942, 4227912, 4247048, 4274420, 4290809, 4301733, 4314731, 4322902, 4328000, 4349695, 4371699, 4389063, 4403213, 4425036, 4447192, 4465321, 4485862, 4497644, 4511483, 4527189, 4546260, 4563481, 4584788, 4602517, 4628046, 4656704, 4678162, 4692100, 4712611, 4739637, 4767494, 4792766, 4812296, 4832648]
13769D832648J9656K7459L0743K6870L3747L2462K8302L0581M0681M3576N3084
13758E199809N0041N1334O4225P1166P3217R2944J21458J46403J05878j09237
13748E867238n05254o16218k86378m5992K8287O3329P2512N9902N4640N2794M9533
13737D794393N0559M7260M3177L2832K7428J7006K5413M3704L6778L6594M5273
13726E200417L9639K5671L3424L1994L2974L0997K7881L7425L2853L0356K7814
13715E551445K8723L1440L7841L6775L1887K7090K4316K3679L2716M1715N8565
13704E926192P4741P2153N2543J9540l231q64J6074J8774K1894L7432L2876L5552
13692F303676L6642M2035N0331M2446K0811K0954L7369M5198M2501N1961M8151
$$ y = [4832648, 4852304, 4879763, 4910506, 4937376, 4971123, 5003585, 5031887, 5062468, 5103149, 5146725, 5199809, 5249850, 5301184, 5365409, 5436575, 5509792, 5602736, 5724194, 5870597, 5976475, 5867238, 5361984, 4745766, 4459388, 4413396, 4441683, 4505012, 4577524, 4637426, 4692066, 4744860, 4794393, 4844952, 4892212, 4935389, 4968221, 4995649, 5012655, 5038068, 5081772, 5118550, 5155144, 5200417, 5240056, 5265727, 5299151, 5331145, 5364119, 5395116, 5422997, 5460422, 5493275, 5523631, 5551445, 5580168, 5611608, 5649449, 5686224, 5718111, 5745201, 5769517, 5793196, 5825912, 5867627, 5926192, 6000933, 6073086, 6125629, 6145169, 6141938, 6141074, 6157148, 6175922, 6197816, 6235248, 6268124, 6303676, 6340318, 6382353, 6432684, 6475130, 6495941, 6516895, 6554264, 6599462, 6641963, 6693924, 6742075]
13681F742075M8443L4135L5922L0700K7788L9389M7571M4750L9959M2458M9627
13670G182817N1261N1256N3911O0382N4995N8113N7431N6135O4515P1542J06139
13659G868497J26499J00998P1530P921n8980m9314J1814N1498O6931O8976P8590
13648H344960R0755R1048R2307Q6752Q8996P4133P4984P9276R4959J06499R6572
13637I321241R2826R5332R0963R5410R4069J02499J11336J05998J16821J23247
13627A0349742J28567J40233J52099J66719J78058J87069J96924K05402K11363
13618A1916176K29917K43363K56131K71051K94267L19986L23109K68068K17702
13609A4339770K60788L75520M73468N39653N86568O54593P57113Q97774J073861
$$ y = [6742075, 6790518, 6824653, 6860575, 6891275, 6919063, 6958452, 7006023, 7050773, 7090732, 7133190, 7182817, 7234078, 7285334, 7339245, 7399627, 7454622, 7512735, 7570166, 7626301, 7690816, 7762358, 7868497, 7994996, 8095994, 8167524, 8175445, 8116465, 8067151, 8078965, 8130463, 8197394, 8266370, 8344960, 8435715, 8526763, 8619070, 8705822, 8794818, 8868951, 8943935, 9023211, 9118170, 9224669, 9321241, 9414067, 9509399, 9600362, 9695772, 9789841, 9892340, 10003676, 10109674, 10226495, 10349742, 10478309, 10618542, 10770641, 10937360, 11115418, 11302487, 11499411, 11704813, 11916176, 12146093, 12389456, 12645587, 12916638, 13210905, 13530891, 13854000, 14122068, 14339770, 14600558, 14976078, 15449546, 15989199, 16575767, 17230360, 17987473, 18885247, 19959108]
13600A9959108J296461J497484J427276M11546k473081o354997p186926m185278
13592D391593j367839l3899N18897P28632P92526P71209P12788O34080N62027
13583G710014N36667N18222M76472M27691M19272M44152M91510N33956N68684
13574A2126640N89864O08839O46369O86808P20358P49043P80744Q06196Q52904
13565A8567765R30216J030448J167095J304947J453746J596736J733812K000211
13557B9784976K378544K905242L603008M354105M599228K739613m719522j8681352
13549B6963842k6020953j6322010n099429l06191J524276K161208K281599K143731
13541a2673927J863271J560559J310672J203552J122508R57140P25875N80610
$$ y = [19959108, 21255569, 22753053, 24180329, 24591875, 22118794, 15763797, 8576871, 4391593, 3023754, 2989855, 3508752, 4237384, 5029910, 5801119, 6513907, 7147987, 7710014, 8246681, 8764903, 9241375, 9669066, 10088338, 10532490, 11024000, 11557956, 12126640, 12716504, 13325343, 13971712, 14658520, 15378878, 16127921, 16908665, 17714861, 18567765, 19497981, 20528429, 21695524, 23000471, 24454217, 26050953, 27784765, 29784976, 32163520, 35068762, 38671770, 43025875, 47625103, 50364716, 45645194, 26963842, 942889, -15379121, -20478550, -20784741, -19260465, -17099257, -14817658, -12673927, -10810656, -9250097, -7939425, -6735873, -5613365, -4656225, -3930350, -3349740]
13533c349740O17917P37711Q30548Q73435Q95835R03892R26336R52812R74374
13524D363120R82534R98283J029425J067023J130183J229944J340314J468876
13516A3609702J600499J709766J831809K065858K440340K930802L583604M333789
13508C4106169M743342L459746k766912j6319181k6703073j9208507o601025p47781
13500c0037222J420300K175443K331649K208332J906760J571413J288474J141221
13492a5993630J070517R06247O81966M90091M72494N69229O55876P10492P30819
13483i705899P40917P32760P19209O92970O86105O61112O57486O54110O46221
13474c515009O69088P13685P48149P64224P75508P98928Q67253R69462J115674
$$ y = [-3349740, -2731823, -1994112, -1163564, -290129, 605706, 1509598, 2435934, 3388746, 4363120, 5345654, 6343937, 7373362, 8440385, 9570568, 10800512, 12140826, 13609702, 15210201, 16919967, 18751776, 20817634, 23257974, 26188776, 29772380, 34106169, 38849511, 42309257, 39542345, 23223164, -3479909, -22688416, -29289441, -30037222, -28616922, -26441479, -24109830, -21901498, -19994738, -18423325, -17134851, -15993630, -14923113, -14016866, -13334900, -12844809, -12372315, -11803086, -11147210, -10436718, -9705899, -8964982, -8232222, -7513013, -6820043, -6133938, -5472826, -4815340, -4161230, -3515009, -2845921, -2132236, -1384087, -619863, 155645, 954573, 1821826, 2791288, 3906962]
13465C906962J306053J529207J633929J218807o35351m566646p787984o251441
13457i646464k600376m48254M45123P69966Q56530Q34286P56881O42112N46527
13448g843669M97770M69209M19195L49884K81291K70047K88969L04839L17386
13439d645079L18338L09701L10966L17054L02346K57324K19738J93422J93475
13430b222715J97653J85477J87961J82075J51211J82696K10355K11539K08001
13421e05747K14577K32273K24630K02019K00811J94745J85887J77878J70084J78510
13411A475667J83987J86833J69218J57266J52956J63418J63091J61566J67695
13402B981697J81260J85141J82571J79410J77321J71579J55545J30193J21154
$$ y = [3906962, 5213015, 6742222, 8376151, 9594958, 8959607, 4392961, -3395023, -9646464, -12246840, -12695094, -12249971, -11480005, -10623475, -9789189, -9032308, -8390196, -7843669, -7345899, -6876690, -6457495, -6107611, -5826320, -5556273, -5267304, -4962465, -4645079, -4326741, -4017040, -3706074, -3389020, -3086674, -2829350, -2609612, -2416190, -2222715, -2025062, -1839585, -1651624, -1469549, -1318338, -1135642, -925287, -713748, -505747, -291170, -58897, 165733, 367752, 568563, 763308, 949195, 1127073, 1297157, 1475667, 1659654, 1846487, 2015705, 2172971, 2325927, 2489345, 2652436, 2814002, 2981697, 3162957, 3348098, 3530669, 3710079, 3887400, 4058979, 4214524, 4344717, 4465871]
13393D465871J45499J75676J85030J82922J65244J52921J57192J74650J75790
13384E980795J73873J76815J89648J90486J60123J62986J74638J89580K07860
13375G606804K36933K42376K31235K36066K46626K49349K51964K52039K56731
13366I810123K76542K77944K76857K76842K97480L21747L00817L10986L42979
13357A2492317L82240M05147M01630L84983L95800M16413L92320L60331L54246
13348A5985427M08200M72838M86017M88073N00397N41236O12864O68154O95234
13339B0858440P29264P66498P99217Q44419Q88521R47346J031508J111849J180385
13330B9157447J284425J392657J437653J503661J620104J791541J958885K145783
$$ y = [4465871, 4611370, 4787046, 4972076, 5154998, 5320242, 5473163, 5630355, 5805005, 5980795, 6154668, 6331483, 6521131, 6711617, 6871740, 7034726, 7209364, 7398944, 7606804, 7843737, 8086113, 8317348, 8553414, 8800040, 9049389, 9301353, 9553392, 9810123, 10086665, 10364609, 10641466, 10918308, 11215788, 11537535, 11838352, 12149338, 12492317, 12874557, 13279704, 13681334, 14066317, 14462117, 14878530, 15270850, 15631181, 15985427, 16393627, 16866465, 17352482, 17840555, 18340952, 18882188, 19495052, 20163206, 20858440, 21587704, 22354202, 23153419, 23997838, 24886359, 25833705, 26865213, 27977062, 29157447, 30441872, 31834529, 33272182, 34775843, 36395947, 38187488, 40146373, 42292156]
13322D2292156K304229K422865K653866L031748L441068L897713M464121N177545
13314F9685311O007654O977409Q150794R499523J1008042J3320393J7297275K2109015
13306A64055416K2686973K295298o3703509j29083464r5904749k9472920k382768
13299a31509723O397846Q827229Q760244Q192288P398810O744872N936484N098286
13291g4153664M321503L463127K216716R97486P94923J339606J793716J967285
13283e7259302J990249J954191J896531J855639J777538J647127J528095J472184
13275d3137748J378632J246669J177174J178076J136472J058606R98823R31808
13267c4031488Q73149Q22387P80347P48973P55646P45447P24531O67477N97402
$$ y = [42292156, 44596385, 47019250, 49673116, 52704864, 56145932, 60043645, 64507766, 69685311, 75692965, 82670374, 90821168, 100320691, 111328733, 124649126, 141946401, 164055416, 186742389, 189037687, 125334178, -3749286, -99654035, -129126955, -131509723, -125111877, -116284648, -107524404, -99332116, -91933306, -85188434, -79251950, -74153664, -69832161, -66369034, -64152318, -63154832, -62359909, -61020303, -59226587, -57259302, -55269053, -53314862, -51418331, -49562692, -47785154, -46138027, -44609932, -43137748, -41759116, -40512447, -39335273, -38157197, -37020725, -35962119, -34963296, -34031488, -33158339, -32335952, -31555605, -30806632, -30050986, -29305539, -28581008, -27913531, -27316129]
13258b7316129N70330N91625O08950N56710M85237M73913M65673M35699M05642
13249b2722350L89818L97217L99990L91195L56619L49028L58071L51316L36054
13240a9393042L14820K93417K83906K74094K56795K47115K45425K35698K19980
13231a7021792J98847J97019K10421K12765K23118K13561K01594J93901K00511
13222a5170055J77504J60449J69987J79413J82222J74634J62648J47032J36985
13213a3679181J38930J33403J37323J40724J34227J30340J20000J00802Q8754
13204a2554678J05117J13320J13477J11214J16487J05215J00122J01222J00988
13195a1587516R8490Q9442R2823Q7188Q6108Q8185R7188J01689R1211P8846P9805
$$ y = [-27316129, -26745799, -26154174, -25545224, -24988514, -24503277, -24029364, -23563691, -23127992, -22722350, -22332532, -21935315, -21535325, -21144130, -20787511, -20438483, -20080412, -19729096, -19393042, -19078222, -18784805, -18500899, -18226805, -17970010, -17722895, -17477470, -17241772, -17021792, -16822945, -16625926, -16415505, -16202740, -15979622, -15766061, -15564467, -15370566, -15170055, -14992551, -14832102, -14662115, -14482702, -14300480, -14125846, -13963198, -13816166, -13679181, -13540251, -13406848, -13269525, -13128801, -12994574, -12864234, -12744234, -12643432, -12554678, -12449561, -12336241, -12222764, -12111550, -11995063, -11889848, -11789726, -11688504, -11587516, -11489026, -11399584, -11306761, -11219573, -11133465, -11045280, -10948092, -10846403, -10755192, -10676346, -10596541]
13184a0596541O9303M8710N1077Q8165Q2226M0234P208J5055K5595O4634J48240
13173i956094J58417J16771R5712P9827O6927N2596N7462O8415Q0957P5630O9507
13162i033873P3555P3576O8610O5926P3140Q3488O2650M8317N5117O9941O5818
13151h293735N1080K9213m0621j53782r3303M5789P9090Q1293P4160N9831N1808
13140h109177M8937M5695N3866N3563M7416L9376K9958K8330M1823M9530L9745
13129g630938L1956L7650O1265N3930K3334k240j3588j1003J1296L0373L2245
13118g375720M2056M6915N6874O6131O6730N8827M5974M0857N2698N3104N7047
13107f788507M6919K8102K9201L8627L4224K8313L1407M2438L8881L6785L2376
$$ y = [-10596541, -10527238, -10478528, -10427451, -10339286, -10257060, -10216826, -10209618, -10194563, -10168968, -10104334, -9956094, -9797677, -9680906, -9585194, -9505367, -9438440, -9385844, -9328382, -9259967, -9179010, -9103380, -9033873, -8960318, -8886742, -8818132, -8752206, -8679066, -8595578, -8532928, -8484611, -8429494, -8359553, -8293735, -8242655, -8213442, -8254063, -8407845, -8501148, -8455359, -8376269, -8294976, -8220816, -8160985, -8109177, -8060240, -8014545, -7960679, -7907116, -7859700, -7820324, -7790366, -7762036, -7720213, -7670683, -7630938, -7598982, -7561332, -7500067, -7446137, -7422803, -7425043, -7438631, -7449634, -7438338, -7407965, -7375720, -7333664, -7286749, -7229875, -7163744, -7097014, -7038187, -6992213, -6951356, -6898658, -6845554, -6788507, -6741588, -6713486, -6684285, -6645658, -6611434, -6583121, -6551714, -6509276, -6470395, -6433610, -6401234]
13096f401234K3795K8843L0871M1390K9634K8006K9949L5931L3811L3581L8478
13085f046945M2998M3269M2950M9295M3963M6131K9453j4059o7090p5250l8378
13074e943663O663L4854M4114N0999L7504K1524l331l7905j3542J4737J7890K0137
13062e750019K6416K5938K1973L2730K8507J5136J2409K4590K2794L1437L1993
13051e476096K4946K9926K6294J8205K2691L0110L1584L2006K6192K1472L3209
13040e179461L3391L7137M0300M1392L3095K7748K4364p224o9311j00124o4223
13029e182916j3811J2746J6660J6909K2619K7872J9063K4140K4732J0469K1355
13018e000162K4755J5907J3605J1644J8547K1313K1063K4920L4718L6668K5259
$$ y = [-6401234, -6377439, -6348596, -6317725, -6276335, -6246701, -6218695, -6188746, -6152815, -6119004, -6085423, -6046945, -6003947, -5960678, -5917728, -5868433, -5824470, -5778339, -5748886, -5762945, -5830035, -5905285, -5943663, -5937000, -5902146, -5858032, -5807033, -5769529, -5748005, -5751336, -5789241, -5802783, -5788046, -5770156, -5750019, -5723603, -5697665, -5675692, -5642962, -5614455, -5599319, -5586910, -5562320, -5539526, -5508089, -5476096, -5451150, -5421224, -5394930, -5376725, -5354034, -5323924, -5292340, -5260334, -5234142, -5212670, -5179461, -5146070, -5108933, -5068633, -5027241, -4994146, -4966398, -4942034, -4949258, -5018569, -5118693, -5182916, -5196727, -5183981, -5167321, -5150412, -5127793, -5099921, -5080858, -5056718, -5031986, -5021517, -5000162, -4975407, -4959500, -4945895, -4934251, -4915704, -4894391, -4873328, -4848408, -4813690, -4777022, -4751763]
13007d751763J7291J0706K641R144Q346R538R817J6644J8688K5256J5153K8997
12995d579542M1270L0373J6470J4953K3142K1956R699P86j0839k3075j3819l400
12983d472026R06O494O940J1828K8912K5488J9979K0672J7263J5330J4992L910
12971d299312J7620J6240J2300J1725J0720K0877J6202J2803J2822R548J2512
12960d145943J2433J3966J4191R657P363J6274K1359J0449o001J0611P692Q501
12948d019448J6199J7014J3450K0152J9393J2103J2015R625N761J0046P142J7128
12936c859420J9619J0750J0021L236R668R821J4784P555R889J1114J8200J6448
12924c718315L350L124J0326J8800J4842K0102J9666R125P493R574J3010M963
$$ y = [-4751763, -4734472, -4723766, -4721125, -4711981, -4703635, -4694097, -4684280, -4667636, -4648948, -4623692, -4608539, -4579542, -4538272, -4507899, -4491429, -4476476, -4453334, -4431378, -4421679, -4420893, -4431732, -4454807, -4468626, -4472026, -4471120, -4464626, -4457686, -4445858, -4416946, -4391458, -4371479, -4350807, -4333544, -4318214, -4303222, -4299312, -4281692, -4265452, -4253152, -4241427, -4230707, -4209830, -4193628, -4180825, -4168003, -4158455, -4145943, -4133510, -4119544, -4105353, -4095696, -4088333, -4072059, -4050700, -4040251, -4046252, -4035641, -4027949, -4019448, -4003249, -3986235, -3972785, -3952633, -3933240, -3921137, -3909122, -3899497, -3893736, -3883690, -3876548, -3859420, -3839801, -3829051, -3819030, -3815794, -3806126, -3796305, -3781521, -3773966, -3764077, -3752963, -3734763, -3718315, -3714965, -3711841, -3701515, -3682715, -3667873, -3647771, -3628105, -3618980, -3611487, -3601913, -3588903, -3583940]
12912c583940M849J128J6070K0560J7616J4647J2878K2251J2691M465J3110J4028
12900c429647J1079J4519J9539K1427J3843J1440J7088K1828K0975J9627J9602
12889c238680J9191J8164J5675J8466J9262J3913K5149K9193K0124K9640L6921
12878b992982L1194L7898M7472N1487N2476N8262O9646P7030R0752J11462J43840
12867b221463J45375L4779k92736o17460m88106j52742J8506R0428J16709J19807
12857c246903J22331J41350J59761J32234o5052m75979o35651l31744p3724K1403
12847d251974N3266O3080O4934O0473N5956M3026L7938L4977K2038L0147K9852
12836c756287K7484L4742L1299K7587K2446K2002K2278K2580K1182J9307J4248
$$ y = [-3583940, -3579091, -3577963, -3561893, -3541333, -3523717, -3509070, -3496192, -3473941, -3461250, -3456785, -3443675, -3429647, -3418568, -3404049, -3384510, -3363083, -3349240, -3337800, -3320712, -3298884, -3277909, -3258282, -3238680, -3219489, -3201325, -3185650, -3167184, -3147922, -3134009, -3108860, -3079667, -3059543, -3029903, -2992982, -2961788, -2923890, -2876418, -2824931, -2772455, -2714193, -2644547, -2567517, -2476765, -2365303, -2221463, -2076088, -2041309, -2334045, -2951505, -3439611, -3592353, -3573847, -3483419, -3366710, -3246903, -3124572, -2983222, -2823461, -2691227, -2756279, -3232258, -3867909, -4199653, -4273377, -4251974, -4198708, -4135628, -4070694, -4010221, -3954265, -3911239, -3873301, -3838324, -3816286, -3786139, -3756287, -3728803, -3694061, -3662762, -3635175, -3612729, -3590727, -3568449, -3545869, -3524687, -3505380, -3491132]
12825c491132K1653K0665J8025J9722J9760J7689J2550J8004J5632J0625R359
12814c307448K2845K0437J2137R009J1242L564J1467J9171K1603K6139J6065J0094
12802c123675Q858K1488K0377K3056K6423L1426M3459M2407L4686N414r6998j76150
12790c139229j07964k0093N405J9712K7120J3311J4864J9784J4551J7328K0031
12779c115180J7429J0680j535k593L433R239J1689J7180R111J0019N779Q658J2689
12766c003402J2605Q457L754J4244J3046M650M927O682J901J3319K260N024Q345
12753b904188L187P307P268R303O689J3497R556P94P391K622m918n18J7026J3141
12739b811843R002K855L212Q611M974N431K707J303O303N077J1335M384L050J1575
$$ y = [-3491132, -3469479, -3448814, -3430789, -3411067, -3391307, -3373618, -3361068, -3343064, -3327432, -3316807, -3307448, -3284603, -3264166, -3252029, -3243020, -3231778, -3228214, -3216747, -3197576, -3175973, -3149834, -3133769, -3123675, -3114817, -3093329, -3072952, -3049896, -3023473, -2992047, -2948588, -2906181, -2871495, -2866081, -2963079, -3139229, -3247193, -3267286, -3261881, -3242169, -3215049, -3201738, -3186874, -3167090, -3152539, -3135211, -3115180, -3097751, -3087071, -3088606, -3091199, -3087766, -3078527, -3066838, -3049658, -3040547, -3030528, -3024749, -3016091, -3003402, -2990797, -2982340, -2978586, -2964342, -2951296, -2946646, -2941719, -2935037, -2933136, -2919817, -2917557, -2912533, -2904188, -2901001, -2893694, -2886426, -2877123, -2870434, -2856937, -2847381, -2846587, -2839196, -2836574, -2841492, -2842010, -2824984, -2811843, -2802841, -2799986, -2796774, -2788163, -2783189, -2777758, -2775051, -2773748, -2767445, -2762368, -2751033, -2746649, -2743599, -2732024]
12725b732024K016J775k71J0300N232N069Q312P311K509O064M492l13J558j06
12711b678076K041O703M884Q966J2589K304N866L967M541R914M938l339L269Q849
12697b602584K090l102j686l721K460J0278K186L238J0521J2681J2445N831N479
12684b543884k001m683L118Q042J710Q741J2591J2469O969m576j770Q01m96N127
12670b497842R755J1595N279o170L069R55R415L359J0672J3799O410n808r786
12657b445298M497N251m15K059O701P617J1441J2899n455j631j430Q643K027K838
12643b390256m778N484M260q64m266Q74P769Q275P057J95k615J337Q625O138J815
12628b350950K158R121J1769Q364J274l389O87M342J110O657M036O99J017J508
$$ y = [-2732024, -2730008, -2728233, -2728504, -2718204, -2712972, -2707903, -2699591, -2692280, -2689771, -2683707, -2679215, -2679528, -2677970, -2678076, -2676035, -2669332, -2664448, -2655482, -2642893, -2640589, -2634723, -2630756, -2626215, -2616301, -2611363, -2614702, -2611433, -2602584, -2600494, -2603596, -2605282, -2609003, -2606543, -2596265, -2594079, -2590841, -2580320, -2567639, -2555194, -2549363, -2543884, -2545885, -2550568, -2547450, -2539408, -2537698, -2528957, -2516366, -2503897, -2496928, -2501504, -2503274, -2502473, -2502969, -2497842, -2488087, -2476492, -2471213, -2477383, -2474314, -2473359, -2463944, -2460585, -2449913, -2436114, -2429704, -2435512, -2445298, -2440801, -2435550, -2435965, -2433906, -2427205, -2419588, -2408147, -2395248, -2400703, -2402334, -2403764, -2395121, -2393094, -2390256, -2395034, -2389550, -2385290, -2386154, -2390420, -2389546, -2381777, -2373502, -2366445, -2366250, -2368865, -2367528, -2358903, -2352765, -2350950, -2348792, -2339671, -2327902, -2319538, -2318264, -2321653, -2320966, -2316624, -2315514, -2308857, -2304821, -2304122, -2303105, -2301597]
12614b301597L351J1472p19J477Q535P403J0235M995l68m540j326k236P674L113
12600b252531n371M174K615l318N808J0766O469L421K676R70O490J3188p32j075
12586b206450N414N719K819j987M98R841M556K159O403J0580J0819R007Q288N069
12572b127265j580o41R75q530j4937j0218J858L196M87O508L870J880K225J550
12558b140622K194K717Q292O46k950M960Q275J326P075Q489J38K965K049p893
12544b102339N814O178J933Q048K932J306Q80j329O225j115M667P621M419L674
12530b051086k829P313Q480K253m145M064l940Q937P142L318J899k091n301J862
12516b024124M345Q662M452M358L080J272j418K554O694M410l909O644J1579J1811
$$ y = [-2301597, -2298246, -2286774, -2287493, -2286016, -2277481, -2270078, -2259843, -2254848, -2255216, -2259756, -2261082, -2263318, -2255644, -2252531, -2257902, -2253728, -2251113, -2254431, -2248623, -2237857, -2231388, -2227967, -2225291, -2224321, -2217831, -2204643, -2205375, -2206450, -2201036, -2195317, -2192498, -2194485, -2193987, -2184146, -2179590, -2177431, -2171028, -2160448, -2149629, -2140622, -2132334, -2127265, -2128845, -2129486, -2128511, -2137041, -2151978, -2162196, -2160338, -2157142, -2156655, -2150147, -2146277, -2144397, -2142172, -2140622, -2138428, -2135711, -2127419, -2126773, -2129723, -2124763, -2116488, -2115162, -2108087, -2099598, -2099460, -2096495, -2094446, -2102339, -2096525, -2090347, -2088414, -2080366, -2077434, -2076128, -2075248, -2076577, -2070352, -2071467, -2066800, -2059179, -2054760, -2051086, -2053915, -2046602, -2038122, -2035869, -2040014, -2035950, -2039890, -2030953, -2023811, -2020493, -2018594, -2020685, -2025986, -2024124, -2019779, -2011117, -2006665, -2002307, -1999227, -1997955, -1999373, -1996819, -1990125, -1985715, -1989624, -1982980, -1971401, -1959590]
12502a959590q54j3007M280N223k297J737Q974L326j16N368k231k020K497l464
12488a952174M171J767M271M662L645O619M481m98j6J075M902M576K952M510L128
12473a901929N637K598n058N006K174r858l684K272K944J134L495N010M145J392
12459a884722M154O442N495L430Q79P573K932K57l425O08L942J940r37kL011K70
12443a848153P377L723j06M613N1o286J308L876Q212M280j008M079J772K243J172
12428a812847L732L266l567o58R118L338P388J380L11P81Q35K052k254J196r35
12413a786864m014Q91R031O141J231J000M201J057n701L410P928L750P627l598
12399a753910r70M315k476k01J5O05N040M115M884J0522j621P33M506j383N890
$$ y = [-1959590, -1960444, -1973451, -1969171, -1963948, -1966245, -1964508, -1955534, -1952208, -1952324, -1946956, -1949187, -1951207, -1948710, -1952174, -1948003, -1946236, -1941965, -1937303, -1933658, -1927039, -1922558, -1923056, -1923072, -1921997, -1917095, -1912519, -1909567, -1905057, -1901929, -1896292, -1893694, -1898752, -1893746, -1891572, -1901430, -1905114, -1902842, -1899898, -1898764, -1895269, -1890259, -1886114, -1884722, -1880568, -1874126, -1868631, -1865201, -1864322, -1856749, -1853817, -1853560, -1856985, -1856377, -1852435, -1850495, -1851432, -1851434, -1848423, -1848153, -1840776, -1837053, -1837159, -1832546, -1832495, -1838781, -1837473, -1833597, -1825385, -1821105, -1822113, -1818034, -1816262, -1814019, -1812847, -1809115, -1805849, -1809416, -1810074, -1800956, -1797618, -1790230, -1788850, -1788539, -1787758, -1786923, -1784871, -1787125, -1785929, -1786864, -1790878, -1789987, -1780956, -1774815, -1773584, -1772584, -1768383, -1767326, -1773027, -1769617, -1761689, -1757939, -1750312, -1753910, -1754880, -1750565, -1753041, -1753242, -1753227, -1752622, -1747582, -1743467, -1738583, -1728061, -1729682, -1728949, -1724443, -1725826, -1719936]
12384a719936j468J696O189K251K368m571j636M207l070M961N753O136K133K573
12370a692414K972k29m300M055P850M779n670q543q19L207Q535Q979k700m48j12
12355a674858l724O778R180M693l295J805R299N50l296L130O794l91J186M047
12341a638102k442K742K949n055n283M237K201j246N690O198Q555K747p127k235
12327a626171P749R124j80l246m766M547o73r69L830K122k767P36K741J78k14
12312a607959J464M098M751K871N832L612l154N284N310o620j465L540J717L189
12298a577530J1260K16o504k884m46J0652P145M637M539k583j189J533M604J978
12284a544572L58M9k179k538N067O498L466J912L618K748j420m470K089K724L509
$$ y = [-1719936, -1721404, -1719708, -1713519, -1711268, -1708900, -1713471, -1715107, -1710900, -1713970, -1709009, -1703256, -1697120, -1694987, -1692414, -1689442, -1689671, -1693971, -1689916, -1682066, -1677287, -1682957, -1691500, -1692319, -1689112, -1680577, -1671598, -1674298, -1674746, -1674858, -1678582, -1671804, -1662624, -1657931, -1661226, -1659421, -1650122, -1649572, -1652868, -1649738, -1642944, -1643335, -1642149, -1638102, -1640544, -1637802, -1634853, -1639908, -1645191, -1640954, -1638753, -1639999, -1634309, -1628111, -1619556, -1616809, -1623936, -1626171, -1618422, -1609298, -1609478, -1612724, -1617490, -1612943, -1613616, -1614585, -1610755, -1608633, -1611400, -1610664, -1607923, -1607745, -1607959, -1606495, -1602397, -1597646, -1594775, -1588943, -1585331, -1588485, -1583201, -1577891, -1584511, -1585976, -1582436, -1580719, -1577530, -1566270, -1566054, -1572558, -1575442, -1575888, -1565236, -1558091, -1553454, -1548915, -1551498, -1552687, -1551154, -1546550, -1544572, -1544214, -1544165, -1546344, -1548882, -1543815, -1537317, -1533851, -1531939, -1528321, -1525573, -1526993, -1531463, -1529374, -1526650, -1523141]
12269a523141P94k291n038L234L706L926k140L070M748j65K902j907J652l402
12255a514052J739R575L891k17R778k009l986k404M924K433R252k77k362l060
12241a486775J485L415K430P165M71m479M42L124m286K04O362M673j795O448J530
12226a459586j679J0710Q163K316m419j522O184l705n603L863k650l866P01l918
12212a455011N063J0535O020J788N331l649n676l990L00Q414J2162M350R10k534
12198a415987o500k139l45m258K911P960R14L721P849J111L515J581m34j833n106
12183a407040l31R386M57Q12M382Q709m287k699L188J1615J186n867q467J178
12169a387778K458p12J6O966J663l869k565l611J030O204j072L096M470P828R877
$$ y = [-1523141, -1522347, -1524638, -1529676, -1526442, -1522736, -1518810, -1520950, -1517880, -1513132, -1513297, -1510395, -1512302, -1510650, -1514052, -1512313, -1502738, -1498847, -1499064, -1489286, -1491295, -1495281, -1497685, -1492761, -1490328, -1481076, -1481353, -1483715, -1486775, -1485290, -1481875, -1479445, -1472280, -1471809, -1476288, -1475846, -1472722, -1477008, -1476804, -1470442, -1465769, -1467564, -1461116, -1459586, -1461265, -1450555, -1442392, -1440076, -1444495, -1446017, -1439833, -1443538, -1449141, -1445278, -1447928, -1451794, -1451093, -1455011, -1449948, -1439413, -1433393, -1431605, -1426274, -1429923, -1435599, -1439589, -1439289, -1430875, -1418713, -1414363, -1413453, -1415987, -1422487, -1424626, -1424971, -1429229, -1426318, -1418358, -1417444, -1413723, -1405874, -1404763, -1401248, -1399667, -1400101, -1401934, -1407040, -1407371, -1397985, -1397528, -1396716, -1392334, -1383625, -1387912, -1390611, -1387423, -1375808, -1374622, -1380489, -1388956, -1387778, -1385320, -1386032, -1386016, -1379050, -1377387, -1381256, -1383821, -1387432, -1386402, -1380198, -1381270, -1378174, -1373704, -1365876, -1355999]
12154a355999n080r325m860j743P604Q023K304O572P151J288P69m547l429k418
12140a353690r34J0281P827N39J04J072L999K351l782n864k083m520P639Q489
12126a328572p7p45J623K017L371l103n065K505P650K133m21r0J424P322K772
12111a307256K746N268Q010J624P83l496q689p922L789O061k63K193j633O702
12097a292083j551j503L557P66M28O351N139M668J525L728m151k39J775l197p333
12082a282120j414Q109j941Q05L896M171n389l074k70M323L979K051L221J149
12068a262504o59J449R47N885M364m794n834j864Q552N054k451O086K40J459M448
12053a239622L058R4O183N206l463N46J998K797l416m23O743K457k417j820M241
$$ y = [-1355999, -1361079, -1370404, -1375264, -1377007, -1369403, -1361380, -1359076, -1352504, -1345353, -1344065, -1343296, -1347843, -1351272, -1353690, -1354624, -1344343, -1336516, -1335977, -1335873, -1334801, -1330802, -1328451, -1332233, -1338097, -1340180, -1344700, -1337061, -1328572, -1328649, -1329394, -1327771, -1325754, -1322383, -1325486, -1330551, -1328046, -1320396, -1318263, -1318684, -1318774, -1317350, -1310028, -1307256, -1304510, -1299242, -1291232, -1289608, -1288825, -1292321, -1301010, -1308932, -1305143, -1299082, -1299345, -1297152, -1298785, -1292083, -1293634, -1295137, -1291580, -1290814, -1290386, -1284035, -1278896, -1274228, -1272703, -1268975, -1273126, -1273365, -1271590, -1274787, -1282120, -1283534, -1275425, -1277366, -1276561, -1272665, -1268494, -1273883, -1276957, -1277227, -1272904, -1268925, -1266874, -1263653, -1262504, -1263163, -1261714, -1260767, -1254882, -1250518, -1255312, -1261146, -1263010, -1254458, -1249404, -1251855, -1245769, -1245529, -1244070, -1239622, -1236564, -1236470, -1230287, -1225081, -1228544, -1227998, -1226000, -1223203, -1226619, -1227042, -1220299, -1217842, -1220259, -1222079, -1217838]
12038a217838l581k081L723J353p149L722N399l893l413k878k710K57L711M366
12024a221012P014P305N804K444j595L543J530j831L05l05l729P94N229N227p89
12009a190066q15J103J264J184P271N879n987j458m708l543L98P382j538j261
11995a184895M165J0295K724m77m428o636j604j321K611N749l235j237M63o542
11981a184368N887J0892J1885J521l115j363N727K833l702k179M215K723p380
11968a156424k987K056l86K255K360N026Q227J452o41q62l55R03K646k805k342
11953a141877K166R128Q863j405m158N802m460k289L28O15l130L13R35k40k080
11938a131489L097P994j767K536Q52n70L358r02j532J0232K612k056M721j122
$$ y = [-1217838, -1221419, -1223500, -1219777, -1218424, -1225573, -1221851, -1216452, -1220345, -1223758, -1226636, -1229346, -1229089, -1225378, -1221012, -1213998, -1206693, -1200889, -1198445, -1200040, -1196497, -1194967, -1196798, -1196493, -1196798, -1200527, -1199733, -1194504, -1189277, -1190066, -1190881, -1189778, -1188514, -1187330, -1180059, -1174180, -1180167, -1181625, -1186333, -1189876, -1189478, -1182096, -1183634, -1184895, -1180730, -1170435, -1167711, -1168188, -1172616, -1179252, -1180856, -1182177, -1179566, -1173817, -1177052, -1178289, -1177826, -1184368, -1178481, -1167589, -1155704, -1154183, -1157298, -1158661, -1152934, -1150101, -1153803, -1155982, -1151767, -1149044, -1156424, -1159411, -1157355, -1157741, -1155486, -1153126, -1148100, -1139873, -1138421, -1139062, -1139924, -1140279, -1139376, -1136730, -1139535, -1141877, -1139711, -1130583, -1121720, -1123125, -1127283, -1121481, -1125941, -1128230, -1127902, -1127287, -1130417, -1130104, -1129169, -1129409, -1131489, -1128392, -1120398, -1122165, -1119629, -1118777, -1119347, -1115989, -1116891, -1118423, -1108191, -1105579, -1107635, -1102914, -1104036]
11924a104036k055J695M780k88N49K985K6q88K276k719j801O3n33j939l488N28
11908a104845J0593N487j147o915r24N731L794L758M88J302J673k760J369K728
11894a079668m26K677K537P056l297n063K768N999M279l475l622M48M210L215
11880a062362M653K95j777K275K341K961M116j672o311l483k243k025Q767Q015
11866a046450l108m924j705l401K503K015j984J801L053o055k621q588M081O430
11852a058953m961K447N112P611J895m28k173J703N363P753L841M089L534M412
11838a018755L661L378m31k945o479j165r9J707n65n381J780J799L710L226J236
11823a015323L4L252M41k563o789J714J073N217Q091P216j28n113k591O917k112
$$ y = [-1104036, -1106091, -1104396, -1099616, -1099904, -1099355, -1096370, -1096344, -1097232, -1094956, -1097675, -1099476, -1099413, -1099946, -1101885, -1105373, -1104845, -1094252, -1088765, -1089912, -1096827, -1097751, -1092020, -1088226, -1084468, -1083980, -1082678, -1081005, -1083765, -1082396, -1079668, -1080094, -1077417, -1074880, -1067824, -1071121, -1076184, -1073416, -1067417, -1063138, -1066613, -1070235, -1069787, -1065577, -1062362, -1057709, -1057414, -1059191, -1056916, -1054575, -1051614, -1047498, -1049170, -1055481, -1058964, -1061207, -1063232, -1054465, -1046450, -1049558, -1054482, -1056187, -1059588, -1057085, -1055070, -1057054, -1055253, -1052200, -1058255, -1060876, -1069464, -1065383, -1058953, -1063914, -1061467, -1056355, -1048744, -1046849, -1047277, -1049450, -1047747, -1042384, -1034631, -1030790, -1026701, -1023167, -1018755, -1015094, -1011716, -1012147, -1015092, -1021571, -1022736, -1022835, -1021128, -1021693, -1027074, -1025294, -1023495, -1019785, -1016559, -1015323, -1015289, -1012037, -1011596, -1014159, -1020948, -1019234, -1018161, -1012944, -1004853, -997637, -997765, -1002878, -1005469, -998552, -1000664]
11808a000664k09K019K085q69J259L677K844j513k342J0264K506m147L95m729
11794i89424k94j013O78l753j747L197P788k294m052k506j682L483R597K577N856
11779i73589O563J125p221l153K165M562J465J729m853m847l6O44l93j724P228
11764i70335K586J391J254M481K764Q46K175j977O148n539L927k790O11O479l419
11749i51398o334p69L988P904L372J193q91q619N792P449m255K109o777m639K736
11734i49139N200K914m6J107m321J1242M241N92k57j807k877l87L248J523O294
11719i22473P497N385j367M352l248o557l90P20N849K71K402L069p4n621l504
11704i13689p042M798K624k097K458l684m667j302M817L971p969N896Q446r72
$$ y = [-1000664, -1000873, -998854, -996769, -997638, -996379, -992702, -989858, -991371, -993713, -983449, -980943, -985090, -984695, -989424, -989718, -990731, -990053, -993806, -995553, -992356, -984568, -986862, -990914, -993420, -995102, -991619, -982022, -979445, -973589, -967026, -965901, -973122, -976275, -974110, -969548, -968083, -966354, -971207, -976054, -976090, -975446, -975839, -977563, -970335, -967749, -966358, -965104, -960623, -957859, -957013, -954838, -956815, -950667, -956206, -952279, -955069, -954458, -947979, -951398, -957732, -958501, -954513, -946609, -943237, -942044, -942935, -951554, -945762, -938313, -942568, -940459, -947236, -951875, -949139, -943939, -941025, -941071, -939964, -944285, -933043, -928802, -928210, -928467, -930274, -933151, -933538, -930290, -928767, -922473, -914976, -909591, -910958, -906606, -909854, -916411, -916801, -916081, -910232, -909961, -907559, -904490, -904564, -910185, -913689, -920731, -915933, -913309, -915406, -912948, -916632, -921299, -922601, -917784, -913813, -921782, -915886, -907440, -908412]
11690i08412l112m31r56k020L904L111L542n917j638R09M207j940M579O564J860
11675h95750l74L533p55j723m503J726L531q48K108O602M671N8l362l74Q33p28
11659h85355l882l109k436K829Q091L447k726M005P507M768m09J021L302n187
11645h68134l93m66N30k788J174n666m270K346m345l901K011j005L766L75K462
11630h78304O494k856m507L587k582m106O964O047K433N482O927L791J320O659
11616h42651k114n811J329N962R811L584o146n510p36k529j43p105o010l1Q506
11601h49594k96j049k368k266j892M751K332K874L758J158m897O388Q749K513
11587h29839n170n944n817M03N472o586r82P297K779J81N599M841M358L912L36
$$ y = [-908412, -911524, -911955, -912911, -914931, -911027, -907916, -904374, -910291, -911929, -911020, -906813, -908753, -904174, -897610, -895750, -896124, -892591, -893346, -895069, -899572, -897846, -894315, -895163, -893055, -886453, -881782, -881724, -885086, -885460, -884627, -885355, -889237, -892346, -894782, -891953, -883862, -880415, -883141, -879136, -871629, -866861, -867270, -866249, -862947, -868134, -868527, -868993, -868463, -871251, -870077, -875743, -880013, -877667, -882012, -885913, -883902, -884907, -881141, -880766, -878304, -871810, -874666, -879173, -875586, -878168, -882274, -875310, -869263, -866830, -861348, -854421, -850630, -849310, -842651, -844765, -850576, -849247, -843285, -833474, -829890, -836036, -841546, -842282, -844811, -844954, -852059, -858069, -858100, -849594, -849890, -850939, -853307, -855573, -857465, -852714, -850382, -847508, -843750, -842592, -847489, -841101, -832352, -829839, -835009, -840953, -846770, -846367, -840895, -847481, -848463, -841166, -838387, -838206, -832607, -827766, -823408, -819496, -819160]
11572h19160m71K507l223K167K744J710K734k931N34m336j833m379K59J841J31
11557h21706N574j190M93k376J9o23k734K666O403J0653m600j0034j54P476J0237
11542g99896K994j869J46p841k188p64O712J222m611j571K509L309K095K741J3948
11527g83064L774R97m313n479j127m057m78J2850O033J766j1688j089Q373M304
11513g73198K322l954o742o62L370o162J068k267R66N157L93m23J570J614o727
11498g83675L045P182N735pn191k711l108P181O40J047M498K268p40m75p341R21
11482g70731R360L911J708o744J082P019M638m40n29N286J166k539J17k506l212
11467g52414J236K987N364J031N084j41k680n606o723n562Q473P884M511k349
$$ y = [-819160, -819631, -817124, -820347, -818180, -815436, -813726, -810992, -813923, -813389, -817725, -819558, -823937, -823678, -821837, -821706, -816132, -817322, -816829, -819205, -819186, -819809, -822543, -819877, -813474, -802821, -807421, -817455, -817609, -810133, -799896, -796902, -798771, -798625, -806466, -808654, -809418, -802706, -801484, -806095, -807666, -805157, -801848, -799753, -797012, -783064, -779290, -778293, -782606, -788085, -789212, -793269, -793747, -780897, -774864, -773098, -784786, -785875, -777502, -773198, -770876, -774830, -781572, -782234, -778864, -785026, -783958, -786225, -785259, -780102, -779709, -780132, -778562, -776948, -783675, -780630, -773448, -767713, -767720, -772911, -775622, -778730, -771549, -770909, -769862, -765364, -763096, -763836, -764311, -771652, -770731, -761371, -757460, -755752, -762496, -761414, -754395, -749757, -750197, -750726, -745440, -744274, -746813, -746696, -749202, -752414, -751178, -748191, -742827, -741796, -736712, -736853, -739533, -745139, -751862, -757424, -748951, -741067, -736556, -738905]
11453g38905r720O471J071j78p79L812K866k466J1959K804R44m095l201J225p112
11438g35304k435L450J1003J1354K267K061l044r17o827J717K615n123k418j594
11424g23195o51l175K825L461j389m372l202j432N123O837o9R421J363P66K532
11409g05157q003o91K091M337Q83o51r72K662K772p194J008M208o007l765L715
11394g10764j9K271Q66K375N833J014l064j879O594K244o34L110m113O525K956
11379f86685R16R562L756m918n249k411L069J720l578l115K619J67m328j119J009
11364f88585k4J467N964j616l337K200N151l069p76j68L01K379k430K054n72Q771
11348f72290k518l396m195N713O611J138J976k027k545k65j388l324j027N432
$$ y = [-738905, -748625, -742154, -741083, -741261, -742040, -738228, -735362, -737828, -725869, -723065, -722121, -726216, -729417, -728192, -735304, -737739, -734289, -723286, -711932, -709665, -707604, -710648, -711565, -718392, -716675, -714060, -719183, -721601, -723195, -723846, -727021, -724196, -720735, -722124, -726496, -729698, -731130, -726007, -719170, -719239, -709818, -708455, -707689, -705157, -713160, -713851, -711760, -707423, -706540, -707191, -708163, -705501, -702729, -709923, -708915, -704707, -710714, -714479, -710764, -710783, -708512, -707646, -705271, -699438, -698424, -701488, -703367, -696773, -694529, -695163, -692053, -696166, -689641, -686685, -685769, -676207, -672451, -677369, -682618, -685029, -681960, -680240, -683818, -686933, -684314, -684147, -688475, -689594, -688585, -688609, -687142, -681178, -682794, -686131, -683931, -678780, -681849, -682625, -682793, -682492, -680113, -682543, -680489, -681061, -672290, -674808, -678204, -682399, -676686, -670075, -668937, -666961, -668988, -671533, -671798, -673186, -676510, -677537, -672105]
11334f72105O168j041L066M719k797m871L7N306J04R178k654n435j208J121L511
11319f56901k527K78K652K999K197M89O5J031J627O632Q125M501l055n715l680
11304f41282K801K647k808m828L50L458K76o330n71J1638K324J539k400j98l824
11289f37208l265O536N822k3r476l650q93Q00N258P418O485R775k067k099j273
11274f17860p81j129N710N376l19M055M033n877N897J0049j21j767L697O802P820
11259e74415J5457p843l7123l3032j6318n671K509L31M677P780K200O054M940
11246f30454L337k728P875J481n128p101R28O53O04K258O648N094N960k569n724
11231f18866J975O93O598N366p690j772R984O835k08q529J309L696P57O201R68
$$ y = [-672105, -665937, -666978, -663912, -659193, -661990, -666861, -666824, -661518, -661414, -652236, -654890, -660325, -661533, -660412, -656901, -659428, -659150, -656498, -653499, -651302, -650813, -650748, -649717, -648090, -641458, -633333, -628832, -631887, -637602, -641282, -638481, -635834, -638642, -643470, -643120, -639662, -639386, -645716, -646287, -634649, -632325, -630786, -633186, -633384, -637208, -640473, -633937, -628115, -628138, -637614, -641264, -642157, -641357, -636099, -628681, -622196, -612421, -614488, -616587, -617860, -618641, -619770, -614060, -608684, -609003, -604948, -600915, -606792, -600895, -590846, -590967, -592734, -589037, -582235, -574415, -558958, -566801, -603924, -636956, -653274, -658945, -656436, -656105, -651428, -643648, -641448, -635394, -630454, -627117, -629845, -621970, -620489, -625617, -632718, -631790, -631137, -630533, -628275, -621627, -616533, -610573, -613142, -618866, -616891, -616198, -609600, -604234, -611924, -613696, -603712, -596877, -597085, -605614, -604305, -600609, -599852, -593651, -592683]
11216e92683O184J660n793J710r714O72J4918M473j054J751K844R92k967m617
11202e81624K832L206J216M051R892k855n135n078J117M064O51K1M761P855J139
11187e53887J321l748j5587q217m948l281O45K85m3N527k254n58m814p709L992
11172e93276P255N224M453m85L146O71K872N401M30K66L982N748o393n526K189
11157e64043K353J853O081m27o488K99k570n122K511R191P990k30j074r0M862
11142e44904N857j354l593K751P055k104j1365n081R70K546L928N77K018p14K500
11127e40913j715n269M163O779p31m942m328R17K333L522j070J415K128m755J577
11112e40889J0329M833K113l159l76N512K308q737O168L315n779k071P911J402
$$ y = [-592683, -586499, -584839, -590632, -588922, -598636, -597964, -583046, -578573, -579627, -577876, -575032, -574040, -577007, -581624, -578792, -575586, -574370, -570319, -560427, -563282, -568417, -573495, -572378, -568314, -567663, -567642, -562881, -555026, -553887, -552566, -556314, -571901, -580118, -585066, -588347, -587702, -587417, -587460, -581933, -584187, -584745, -589559, -597268, -593276, -586021, -580797, -576344, -576829, -573683, -573012, -570140, -564739, -564309, -564043, -560061, -554313, -560706, -566232, -564043, -561690, -559837, -553756, -554183, -560671, -560372, -562942, -568064, -565553, -556362, -548372, -548602, -549676, -549766, -544904, -539047, -540401, -543994, -541243, -534188, -536292, -547657, -552738, -551768, -549222, -545294, -544717, -542699, -543413, -540913, -542628, -547897, -543734, -536955, -537686, -542628, -546956, -546039, -543706, -540184, -541254, -539839, -537711, -542466, -540889, -530560, -525727, -523614, -526773, -527149, -521637, -519329, -528066, -521898, -518583, -524362, -526433, -518522, -517120]
11098e17120j5145q15N130K718L742K805P560j553j301p466p816L189N442L268
11084e17362L572n34L997P380j175M91K477r27l004j0464K73Q332j497p244L629
11069e12056M913j371j101m52j817L147P420K418l937m62m42M205k530l89Q62
11054e01592k502p20k98Q79M713L437L330j362j098L124M140j53k485J102L307
11039d86178N165K723k619n511m837M84J0589L239j758j496J304Q43j274m332
11025d83658J805R100K131l612k623m492k04M351M250J1583J0195L995N57p024
11011d53646j411m748K019k014n358J31P277k315K193L284r7m176K070l370n405
10996d65566L414K628l352l247K816O108K668k758m74q78L573R052L352o080l203
$$ y = [-517120, -532265, -533080, -527950, -525232, -521490, -518685, -511125, -512678, -513979, -521445, -529261, -526072, -520630, -517362, -513790, -514324, -510327, -502947, -504122, -503631, -501154, -502081, -505085, -515549, -515276, -506944, -508441, -515685, -512056, -507143, -508514, -509615, -510067, -511884, -508737, -501317, -498899, -502836, -503298, -503740, -499535, -502065, -502454, -501592, -504094, -504814, -505112, -504233, -499520, -496083, -492753, -494115, -495213, -492089, -487949, -488102, -490587, -489485, -486178, -481013, -478290, -480909, -486420, -491257, -490773, -480184, -476945, -478703, -480199, -478895, -478052, -479326, -483658, -481853, -472753, -470622, -474234, -476857, -481349, -481553, -477202, -472952, -461369, -451174, -447179, -446622, -453646, -455057, -459805, -457786, -459800, -465158, -465027, -457750, -460065, -457872, -454588, -454685, -458861, -456791, -460161, -465566, -462152, -459524, -462876, -466123, -463307, -457199, -454531, -457289, -457763, -458641, -455068, -446016, -442664, -448744, -451947]
10981d51947M255Q136O715J390p554j014n384n014O235J750l362K349q609k195
10967d54249J897M494M257l95N700O351R32l870k873M455j421k974K562P050j581
10952d29665o602L79J37j126N766J1780J963k520M916J0j981k506k938M920M937
10937d12530L746J253k643L56K621K871k463J688No99J876m734J266R048K128
10922c96211L791n640k363o83M754o977O88K358l564N647O022r50m966J764K317
10907c94013K895q84k284O76J621j945r439m390P510J0080K310n940K746J383
10893c89674k308l428M431L116P511M239N67l477L824Q170m799k576K155L185
10879c69064O160j132K410K910j637q194r753P852O699K230J057P97K700J7k595
$$ y = [-451947, -447692, -439556, -432841, -431451, -439005, -440019, -445403, -450417, -444182, -442432, -445794, -443445, -452054, -454249, -452352, -447858, -443601, -443996, -438296, -431945, -431013, -434883, -437756, -433301, -434722, -437696, -435134, -428084, -429665, -436267, -435888, -435751, -436877, -431111, -419331, -417368, -419888, -414972, -414962, -416943, -419449, -422387, -417467, -412530, -408784, -407531, -410174, -409818, -407197, -404326, -406789, -405101, -405096, -405795, -403919, -408653, -407387, -398339, -396211, -392420, -398060, -400423, -401106, -396352, -403329, -402641, -400283, -403847, -398200, -392178, -393128, -398094, -396330, -394013, -391118, -392002, -394286, -393610, -391989, -393934, -403373, -407763, -400253, -390173, -387863, -393803, -391057, -389674, -391982, -395410, -390979, -387863, -380352, -376113, -375546, -379023, -375199, -367029, -371828, -374404, -372249, -369064, -362904, -364036, -361626, -358716, -360353, -368547, -378300, -370448, -363749, -361519, -360462, -359665, -356965, -356948, -359543]
10864c59543N283L183K468L294L035r388N047M751N612j391O28K498m610p49j277
10849c41159o119J443J2179K529k654K434j905O47L991l469J297J184L28J954
10835c27320Q679q809k625O337N180L876m27p55K310M873K634N133k454k465N753
10820c00080K400K926L556O96K021p920j61K128k353j85j33O710J0860o49j288
10805b81472N073J1247K477q921r0L825J447M330N131J121l06k004L274M941p73
10790b50700N610J1075P336J157R464K393n137m903N643M945R066O023M66o254
10776b03816N067R141J2687M963K219J0629N948l128L081Q771N626Q550J1492
10763a18770J1030J1614J2869Q410O457J1284J2429J6411J9695J6049J2255J2526
$$ y = [-359543, -354260, -351077, -348609, -345315, -342280, -351668, -346621, -341870, -336258, -337649, -337021, -334523, -339133, -339882, -341159, -347278, -345835, -333656, -331127, -333781, -331347, -333252, -332605, -328614, -332083, -330786, -329602, -329274, -327320, -318641, -327450, -330075, -323738, -318558, -314682, -315109, -315864, -313554, -308681, -306047, -300914, -303368, -305833, -300080, -297680, -294754, -291198, -290502, -288481, -296401, -296562, -294434, -296787, -296972, -297105, -290395, -279535, -280184, -281472, -276399, -265152, -262675, -271596, -271686, -267861, -266414, -262084, -256953, -255832, -256138, -258142, -254868, -249927, -250700, -245090, -234015, -226679, -225522, -216058, -213665, -218802, -223705, -218062, -213117, -204051, -198028, -197562, -203816, -198749, -189608, -176921, -171958, -169739, -159110, -153162, -156290, -153209, -144438, -138812, -130262, -118770, -107740, -96126, -83257, -74847, -68390, -57106, -44677, -28266, -8571, 7478, 19733, 32259]
10751C2259K9644L0097K4274L1962M0469N2629N1892N3489P9072Q9848J11089
10740F26724J55758J97132K16185M8061o23345j190781o49679j20306O977N5794
10730a277480Q5254P9496P4602O0558M9581M2648M0186M2044L0816J2569l232
10719g62958P057J6158J8226N507R497J1445J4975J1593J7123J1458J2990J3741
10707f13188R229J2003N946K086J8955J2842O356R887R883j59P856N502L100N697
10693e04005L436K696O534P649J4656J1393K603m976m10n076K781J2608J5116
10680d34995M828K336n211n756K484J1270q84J674L800O349J573K4M528q13k533
10665d11326N386J114m606K756P907M523O643K508Q22J0470J1629N71L17j846
$$ y = [32259, 61903, 92000, 116274, 148236, 188705, 241334, 293226, 346715, 425787, 515635, 626724, 782482, 979614, 1195799, 1243860, 620515, -570266, -1219945, -1340251, -1333274, -1277480, -1192226, -1112730, -1038128, -977570, -927989, -885341, -845155, -803111, -772295, -759726, -762958, -755901, -739743, -721517, -716010, -706513, -695068, -680093, -668500, -651377, -639919, -626929, -613188, -603959, -591956, -586010, -583924, -564969, -552127, -545771, -535884, -526001, -526160, -518304, -512802, -509702, -504005, -500569, -497873, -491339, -483690, -469034, -457641, -455038, -460014, -460424, -465500, -462719, -450111, -434995, -430167, -427831, -433042, -438798, -436314, -425044, -425928, -424254, -420454, -414105, -412532, -412508, -407980, -408793, -411326, -405940, -404826, -409432, -406676, -398769, -394246, -387603, -385095, -384273, -373803, -362174, -361603, -361286, -363132]
10651c63132o520l5J0355p643j3671L428N726K861N317O435M047r61J350O992
10637c45451j769o322N059R237R18M03j489J471J848l26K09R074L651j902m219
10622c29608j826J6J646o892J895K247L620o19P799L658O23O7j898k69j200J686
10606c19055J344M056M037l986N049L954l509j936L384O04K664M926M43K837M122
10591b91066l68n388K281K368O94l381j874l020P4N205N632J211J421m646M587
10576b86270N040L878m648n518j2Q941M255K414O173p538j3018Q02J0686J093
10562b73722J1673l90p600m63M27M545Q488Q94J923K753j573P41N340o6O103Q212
10546b32715n254q339O324K683l249O80P380J0406L127n938n265n298j561m266
$$ y = [-363132, -369652, -369687, -359332, -366975, -380646, -377218, -371492, -368631, -363314, -356879, -352832, -353793, -352443, -345451, -347220, -353542, -348483, -339246, -338328, -337925, -339414, -337943, -336095, -336421, -336212, -327138, -323487, -325389, -329608, -331434, -331418, -329772, -336664, -334769, -332522, -328902, -329521, -321722, -318064, -317441, -317374, -319272, -319541, -320741, -319055, -317711, -313655, -309618, -313604, -308555, -304601, -308110, -310046, -306662, -306058, -303394, -298468, -298025, -295188, -291066, -291434, -296822, -294541, -292173, -291479, -294860, -296734, -299754, -299680, -294475, -288843, -287632, -286211, -290857, -286270, -281230, -277352, -282000, -287518, -287530, -278589, -274334, -271920, -265747, -273285, -286303, -285501, -274815, -273722, -262049, -262439, -270039, -270502, -270075, -265530, -257042, -256148, -254225, -251472, -253045, -252304, -246964, -247030, -240927, -232715, -237969, -246308, -239984, -237301, -240550, -239870, -232490, -222084, -218957, -224895, -230160, -235458, -237019, -241285]
10532b41285q102k012j85m520l946j708R703J2512n35j6165k047P099P778M314
10518b39099k241n115k787Q28M141O990L670J226K189L537j395m587n256J706
10504b36193L031N68N775p371o58O093R374O14k64J343L963n204j044o01l2R17
10488b19689N358O21j870M420J361k746l21M507P072N686R71K680L278k861p861
10473a99394M554J080J949Q124J388M24m899m794o526k250K274M279J0941O239
10459a76611o150l045L445k152o518m927N9R828N547J404m660N655K318N300L847
10444a66660J688O03M65L479L530m524o847J089R482P281n857j747Q53q83O089
10429a51959M205J290j21m770k171O828L305J0741n00j155J519n709L153J081
$$ y = [-241285, -249387, -251399, -251584, -256104, -260050, -261758, -252055, -239543, -240078, -256243, -258290, -251191, -243413, -239099, -241340, -246455, -249242, -248414, -244273, -237283, -233613, -232387, -230198, -226661, -228056, -232643, -237899, -236193, -233162, -232594, -226819, -234190, -234848, -228755, -219381, -218767, -219031, -217688, -213725, -218929, -219973, -220574, -220606, -219689, -214331, -213710, -215580, -211160, -209799, -212545, -212866, -208359, -201287, -195601, -194630, -191950, -188672, -191533, -199394, -194840, -193760, -191811, -183687, -182299, -181875, -186774, -191568, -198094, -200344, -198070, -193791, -182850, -176611, -182761, -185806, -182361, -184513, -191031, -195958, -195899, -186071, -180524, -179120, -183780, -178125, -175807, -170507, -166660, -164972, -164369, -163904, -160425, -156895, -161419, -168266, -167177, -157695, -150414, -156271, -158018, -157165, -158048, -151959, -147754, -146464, -146585, -151355, -153526, -146698, -143393, -132652, -133152, -134307, -132788, -138497, -135344, -134263]
10415a34263n476k595n961N750L463L724J053Q4k602J600N223O178M630j1847
10401a31039k462Q267O702L734j427j0231p857j0316n185J729M861j321n47N144
10387a39948P088J924J859K185l565M689O916Q4L256J254P977N688k602m566L746
10372a04015N191K038m672l842o555J0640J0648k764Q54k92k313O67j915r94j958
10357i9282m336m209l740M430Q507L721O038N320J436O978O907L0k905K966K526
10342f5613k808K015j219p16P406N830O837J0304J0136q094j3805r960k589r8
10328f2374K841j594m158j548N321R791N019J979K01Q747Q334Q967L217M677Q469
10313b111Q080N312R250O505K269L692N812O918L475j06L477J5649K1560K0767
$$ y = [-134263, -139739, -142334, -148295, -142545, -139082, -135358, -134305, -134221, -136823, -135223, -130000, -123822, -119192, -131039, -133501, -125234, -118532, -114798, -116225, -126456, -134313, -144629, -149814, -148085, -143224, -144545, -145092, -139948, -132860, -130936, -129077, -126892, -130457, -125768, -118852, -118768, -115512, -114258, -106281, -100593, -103195, -107761, -104015, -98824, -96786, -101458, -105300, -111855, -101215, -90567, -93331, -92477, -92769, -95082, -94415, -96330, -97324, -99282, -103618, -107827, -111567, -107137, -98630, -94909, -88871, -83551, -82115, -75137, -68230, -68200, -71105, -68139, -65613, -68421, -66406, -67625, -68341, -60935, -55105, -48268, -37964, -27828, -35922, -49727, -59687, -62276, -62374, -59533, -61127, -65285, -66833, -61512, -51721, -46702, -44723, -44522, -35775, -27441, -18474, -15257, -10580, -2111, 5969, 11281, 20531, 27036, 29305, 32997, 38809, 45727, 49202, 49096, 52573, 68222, 89782, 110549]
10299A10549J9592K4559L3698L2718M7106N7074P1280O5133j884k15756l81574
10288a37505k25374n8778L651K6968K6022K7847J4979J5584J7652J9361J4251
10277b55342J3676Q321O701M625J039Q372P185M757Q303Q333M187M367J7021P803
10263a50652K43l397j987N100N665N823K550P711O564O323N896o07L817K120L704
10248a01127j956K748Q409j378L844P571K679j381l351n727m645J31p570l697
10234a05450l1J907L24R862O752J210M82l915l554J646k360L777L690j92j391
10219h7243l646L645N105J596O190J0589J486O26l707l341N421J465J198N209
10205e5407M827j214K991J668j591l65L32J094L504j44k213R90J088Q98R670L713
$$ y = [110549, 130141, 154700, 188398, 221116, 268222, 325296, 396576, 461709, 459825, 244069, -137505, -362879, -421657, -418006, -391038, -365016, -337169, -322190, -306606, -288954, -269593, -255342, -241666, -233345, -226644, -222019, -220980, -212608, -205423, -200666, -192363, -184030, -179843, -175476, -158455, -150652, -150409, -153806, -155793, -150693, -145028, -139205, -136655, -128944, -122380, -116057, -110161, -110768, -106951, -104831, -101127, -103083, -100335, -91926, -93304, -89460, -81889, -79210, -80591, -83942, -89669, -94314, -94183, -101753, -105450, -105481, -103574, -103250, -93388, -86636, -85426, -84944, -88859, -92413, -90767, -93127, -89350, -85660, -85852, -87243, -90889, -87244, -82139, -80543, -74353, -63764, -62278, -61652, -65359, -68700, -63279, -61814, -60616, -55407, -50580, -51794, -48803, -47135, -48726, -49091, -48759, -47665, -44161, -44305, -46518, -45528, -44440, -43542, -33872, -30159]
10189c0159N205N911K561L661o832j4548m746P656N264N861L441L44m568l072
10175b4021N438N128Q560J252p89n801m07j204j236j456N266p36N654o15J796
10160c171R614N580L912J138j21J264M311J164j167k401Q027N077m820j777o498
10145B0132j5331k420n496n479K3L482Q043r31P0M805n304k50O877K813n72L652
10129A4114l943K714P029J179j884p514k655l222O374L571K955k48J900J0141
10115C0511Q481K277jj410l789o865K265L652L33P121K65j586P837l229o312O889
10099D6439L611N861J257k4q134k332O21M547J2999N546r071m589o076l83l395
10084D6877K141M789Q135j303O00R015l73n45j646K449p52J437j181K151K817
$$ y = [-30159, -24954, -19043, -16482, -12821, -19653, -34201, -38947, -31291, -26027, -20166, -16725, -16381, -20949, -24021, -18583, -13455, -4895, -3643, -4432, -10233, -10640, -11844, -13080, -14536, -9270, -10006, -4352, -4967, -3171, 6443, 12023, 15935, 17073, 16952, 18216, 22527, 23691, 22524, 20123, 28150, 33227, 28407, 26630, 20132, 4801, 2381, -3115, -8594, -8571, -5089, 2954, 2023, 2093, 6898, 1594, 1344, 8221, 11034, 10462, 14114, 10171, 12885, 19914, 21093, 19209, 11695, 9040, 5818, 12192, 15763, 18718, 18470, 20370, 30511, 38992, 41269, 41268, 39858, 36069, 29204, 31469, 35121, 35454, 42575, 42840, 41254, 49091, 45862, 39550, 46439, 50050, 55911, 57168, 57144, 49010, 46678, 47299, 51846, 64845, 70391, 61320, 56731, 50655, 50272, 46877, 49018, 53807, 61942, 60639, 61239, 70254, 69881, 69336, 67690, 70139, 69387, 70824, 69643, 71794, 74611]
10069G4611L767J651j510j612M325L855l69j836o73L982k532N793M559O33j833
10054I2811P54M045N13J521J476M179P03j559m595R048k976o77P099J993k876
10039A11459L651j252j592J531O975q22p371J824O138M545p300Q1L009j069l417
10024A16390N829J906L038M650l020J592P646K773k866M1P385j670o413k426m199
10009A30656j016M565L483K851N920o811l661K931K761K751L784m118j112K501
9995A45485r20J065J941M114l859L765K461L883O476J560J145l450m147J848K161
9980A63528K931J680M405J447P713O177o800q721l037J265P627M098J221k062
9966A81472L015l43j741O494Q849N395K445k710l29k845L893Q021K032n942K55
$$ y = [74611, 78378, 80029, 78519, 76907, 81232, 85087, 84718, 82882, 82209, 86191, 83659, 89452, 94011, 94644, 92811, 93565, 97610, 98123, 99644, 101120, 105299, 106002, 104443, 99848, 108896, 105920, 105243, 112342, 114335, 111459, 115110, 113858, 112266, 113797, 120772, 119950, 112579, 114403, 120541, 125086, 117786, 117867, 120876, 119807, 116390, 122219, 124125, 127163, 131813, 128793, 130385, 138031, 140804, 137938, 137979, 145364, 143694, 137281, 134855, 130656, 129640, 134205, 137688, 140539, 146459, 139648, 135987, 138918, 141679, 144430, 148214, 144096, 142984, 145485, 144565, 145630, 147571, 151685, 147826, 151591, 154052, 157935, 164411, 165971, 167116, 163666, 159519, 161367, 163528, 166459, 168139, 172544, 173991, 181704, 187881, 181081, 172360, 169323, 170588, 178215, 182313, 183534, 181472, 184487, 184144, 182403, 188897, 197746, 203141, 205586, 202876, 202547, 199702, 203595, 211616, 213648, 207706, 207961]
9951B07961K595p730l107O14j340J056p693J768O330J1004N905K45k744n446k412
9936B07006K053K913P041O35j046K924j859k407J183P865K588O02n183k015R892
9921B32192J0189n089l491J0605J874m358L256O082M868j574j3171M732M391n888
9907B44618jL848N457N657m083M517k892l943O798Q855O340O609N167p305n787
9892B73855m202o42l523l10K717J146K561j087J1302K076o186n291N478J3261
9878B91155j552l477J639L047L946J929J023K286K946L841r743q18N3M429O498
9863C07202O240R48k145L754L666o407m468M550k785M913P532N644N716k31M286
9848C38415L582j347j2018j7261m803L639K301j325l687K854O100O534L970M846
$$ y = [207961, 210556, 202826, 199719, 200333, 198993, 200049, 192356, 194124, 200454, 211458, 217363, 217608, 214864, 209418, 207006, 209059, 211972, 219013, 219648, 218602, 221526, 219667, 217260, 218443, 226308, 228896, 229498, 224315, 222300, 232192, 242381, 237292, 233801, 244406, 246280, 241922, 245178, 251260, 256128, 254554, 241383, 246115, 250506, 244618, 244617, 248465, 253922, 259579, 255496, 260013, 257121, 253178, 259976, 268831, 275171, 281780, 286947, 279642, 273855, 269653, 269011, 265488, 265178, 267895, 269041, 271602, 270515, 281817, 283893, 277707, 272416, 277894, 291155, 289603, 286126, 287765, 290812, 294758, 296687, 297710, 299996, 302942, 306783, 297040, 296222, 296275, 300704, 307202, 313442, 314390, 312245, 315999, 319665, 313258, 308790, 313340, 310555, 315468, 323000, 328644, 334360, 334129, 338415, 341997, 340650, 328632, 311371, 306568, 310207, 312508, 311183, 307496, 310350, 316450, 322984, 326954, 331800]
9834C31800n263j02M898L917m259R34j505M292Q242M6P536p64N098K129l56k501
9818C54142N416m930L71N880J544j527K241K484m591O232M289P1N770R947j669
9803C85670k872N869K130j122l174M630L381n90l555P556j85l391J750O044j856
9788D00285l487M342P867n670N220N547j955J298M021N008L415q079O429M6K78
9773D24565j462M96P057O92L011K760K521J406l201j204m905o878Q130L975K643
9758D39606N487J1373R915L161j115r164m444J14J499Q23l004m18K332L306l616
9743D55855k079M564L523l800J514M342K46L025M121L318K088m079l608k38J185
9728D69977M508Q96J045M745L900R700J702k384j935R635O862K427n976J232K940
$$ y = [331800, 326537, 326435, 331333, 335250, 330991, 331925, 330420, 334712, 342954, 343000, 350536, 349772, 354870, 356999, 356643, 354142, 359558, 354628, 354999, 360879, 362423, 360896, 363137, 365621, 361030, 367262, 371551, 371622, 377392, 387339, 385670, 382798, 388667, 390797, 389675, 386501, 391131, 394512, 393922, 390367, 397923, 397738, 394347, 396097, 402141, 400285, 396798, 401140, 409007, 403337, 408557, 414104, 412149, 413447, 417468, 422476, 425891, 417812, 424241, 424287, 424565, 423103, 423599, 430656, 431348, 434359, 437119, 439640, 441046, 437845, 436641, 431736, 424858, 432988, 436963, 439606, 445093, 456466, 466381, 469542, 468427, 459263, 454819, 454933, 456432, 457255, 454251, 453833, 456165, 459471, 455855, 453776, 458340, 461863, 458063, 459577, 463919, 464165, 467190, 471311, 474629, 476717, 472638, 469030, 468792, 469977, 474485, 475381, 476426, 481171, 485071, 494771, 496473, 494089, 492154, 501789, 508651, 511078, 505102, 506334, 509274]
9713E09274j117P71o574L142O946p05M795L832p997j863O160Q610Q50P51O539
9698E33414N309L178j678K578K143Q60k159M12N21J0309P884O09k15L205M50l081
9682E63739l293P332M017P483N417K91k641L631q95n493N060L773N639P229M361
9667F05650m161n628k928R966R630p65n774O927Q350k809k019J883N186O6N472
9652F29046Q001L344M382n026q888k90j294L447M995Q82O600M299L898K219l063
9637F52552L660O029J845m37m009L241k927K83M854M376J626K529j062K027q31
9622F73756o40N397P940O206K676l145J146J924k8o06K382L539R95N093k497L728
9606G07866L457l959n63L10Q181O410k01n248P565P509R089n3n117k26L993N533
$$ y = [509274, 508157, 508928, 502354, 505496, 512442, 511737, 516532, 520364, 512367, 510504, 516664, 525274, 526124, 526875, 533414, 538723, 541901, 540223, 542801, 544944, 545804, 543645, 544057, 544578, 554887, 562771, 563380, 563165, 566370, 566820, 563739, 560446, 567778, 571795, 579278, 584695, 584986, 582345, 585976, 585081, 579588, 584648, 588421, 594060, 601289, 605650, 601489, 595861, 592933, 602899, 612529, 611764, 605990, 612917, 621267, 618458, 616439, 618322, 623508, 623574, 629046, 637047, 640391, 644773, 639747, 630859, 630569, 629275, 632722, 637717, 638599, 645199, 649498, 653396, 655615, 652552, 656212, 662241, 664086, 663649, 659640, 662881, 659954, 660237, 665091, 669467, 671093, 673622, 672560, 674587, 673756, 673116, 678513, 686453, 692659, 695335, 692190, 693336, 695260, 695232, 694626, 697008, 700547, 701542, 706635, 704138, 707866, 711323, 707364, 706801, 707111, 715292, 721702, 721501, 716253, 723818, 731327, 740416, 740363, 735246, 735020, 739013, 744546]
9590G44546M820m341L449J0178J1155J0156K074j0352o101L692J437J070O947
9577G78730K150M400M538N204K739o58L10L741K213J4108N635J0726L869o482
9563H31223L37J856N57N972N840L323q85L447P289j040m039n559L807J0796J858
9548H64782J05J1014O622j697j919J583L306p30k684O569M199M515K530k496O666
9533I02365J1025N907M963O51j516L698L284J218K341K921J33M876P646O976L391
9518I59879o738M061P711L580J324l313L678R269N713M296N421P774J3017R421
9504A025093N179m509l586L33k692K205O946J5140P040O28M740N504K434O013
9490A070468R295R489R727K810l383N345J357P850M116j178J9N204N523Q636j706
$$ y = [744546, 749366, 745025, 748474, 758652, 769807, 779963, 782037, 771685, 765584, 769276, 770713, 771783, 778730, 780880, 785280, 789818, 795022, 797761, 797103, 797413, 801154, 803367, 817475, 823110, 833836, 837705, 831223, 831560, 833416, 833973, 839945, 845785, 849108, 848223, 851670, 858959, 857919, 853880, 848321, 852128, 862924, 864782, 864887, 875901, 882523, 880826, 878907, 880490, 883796, 883066, 880382, 886951, 891150, 895665, 898195, 895699, 902365, 913390, 919297, 924260, 924911, 923395, 927093, 930377, 931595, 933936, 936857, 936990, 941866, 949512, 956488, 959879, 953141, 957202, 964913, 968493, 969817, 966504, 970182, 979451, 985164, 989460, 994881, 1002655, 1015672, 1025093, 1030272, 1025763, 1022177, 1022510, 1019818, 1022023, 1028969, 1044109, 1051149, 1051777, 1056517, 1062021, 1064455, 1070468, 1079763, 1089252, 1098979, 1101789, 1098406, 1103751, 1105108, 1112958, 1117074, 1115896, 1115915, 1121119, 1126642, 1135278, 1133572]
9475A133572O012J0077J1508M987P007J1180Q982L187L061M978K166Q8L463K201
9461A212469L096J0915J0300J7346P815O531P112J0978J1977R617N874k050N968
9448A317948Q290J1715O091P967Q878J1422J0004J0761J7752J7761J2988Q516
9436A450093L920J6141J5101J6358O557R169J7625J9809J0846K1859K2116J8349
9424A627943J4667K4860K2306K3068L1195L2831L2125L2504K9492K3369L3591
9413A927951M2202M4321N3418M6156N3297O0667O6666P4048Q8318R1463J11889
9402B660396J24929J45665J59944J89510K24326K53272K60157J91620j26251q23220
9392C260348j507810j451491q21618l21283n4637N8696J07180J22413J19917J07841
$$ y = [1133572, 1139584, 1149661, 1161169, 1166156, 1173163, 1184343, 1193325, 1196512, 1199573, 1204551, 1206717, 1206805, 1210268, 1212469, 1215565, 1226480, 1236780, 1254126, 1261941, 1268472, 1275584, 1286562, 1298539, 1308156, 1314030, 1311980, 1317948, 1326238, 1337953, 1344044, 1352011, 1360889, 1372311, 1382315, 1393076, 1410828, 1428589, 1441577, 1450093, 1454013, 1470154, 1485255, 1501613, 1508170, 1517339, 1534964, 1554773, 1565619, 1587478, 1609594, 1627943, 1642610, 1667470, 1689776, 1712844, 1744039, 1776870, 1808995, 1841499, 1870991, 1894360, 1927951, 1970153, 2014474, 2067892, 2114048, 2167345, 2228012, 2294678, 2368726, 2457044, 2548507, 2660396, 2785325, 2930990, 3090934, 3280444, 3504770, 3758042, 4018199, 4209819, 4083568, 3260348, 1752538, 301047, -520571, -841854, -896491, -837795, -730615, -608202, -488285, -380444]
9382c80444J05346R2174P4420N9757N1027L2628L1023L2201L2519L2922L3415
9371A96988L7545M9390M1780L8948L3263L5450L0493L2113K6076K4711K8527K7165
9359F02449K4692K1156K4129J9326K5602K1698J7695K1879J2483R614J9081K9747
9347H49551J8834J1357J5439J3654J5645J1420O441P704J5979J4908J7667J1823
9335A010422J0635J1080P477P070O597J9976J5467J1541J0998R705J3055J3405
9323A147428M551Q528J4818J0960Q334P093R157J5448Q417J2039Q058O151O158
9310A267140K01P225J5804J4375J3711Q764J3550J7555M625O284Q560J724O415
9297A385933J4932M469L744J4647J7543J7681J6245J4914R005Q732J8027K8925
$$ y = [-380444, -275098, -182924, -108504, -48747, 2280, 34908, 65931, 98132, 130651, 163573, 196988, 234533, 283923, 325703, 364651, 397914, 433364, 463857, 495970, 522046, 546757, 575284, 602449, 627141, 648297, 672426, 691752, 717354, 739052, 756747, 778626, 791109, 800723, 819804, 849551, 868385, 879742, 895181, 908835, 924480, 935900, 942341, 950045, 966024, 980932, 998599, 1010422, 1021057, 1032137, 1039614, 1046684, 1053281, 1073257, 1088724, 1100265, 1111263, 1120968, 1134023, 1147428, 1151979, 1160507, 1175325, 1186285, 1194619, 1201712, 1210869, 1226317, 1234734, 1246773, 1254831, 1260982, 1267140, 1267341, 1274566, 1290370, 1304745, 1318456, 1327220, 1340770, 1358325, 1362950, 1369234, 1377794, 1379518, 1385933, 1400865, 1405334, 1409078, 1423725, 1441268, 1458949, 1475194, 1490108, 1499113, 1507845, 1525872, 1554797]
9285A554797K3352J9735K5405J6916K5737L0597J4746m5588j05445j06925n5993
9274A397334j9595O9J6518K1458J0900J1730J6484K1806J8167J9189J7726J5770
9262A547556J5140Q075J0583O252J0202J8622J4417J1385O296J0077J2160J5064
9250A685829K2429J9697J0361K2946L0436J7444J6454J8574K3814L0303L0377
9239A928664L5285L7382M4442N1713N4337L6245o4468k27175k64958j46372l7321
9228A447774Q851K4616K4942K8354L0936K9520K4406K7145J9745J5325J9484Q687
9216A709785Q814J3455J0500J5048J6570J2291R084J1542J9530J5019J2165J8221
9204A872024J5541J6321J4498J2967J5163J7780K7989K2269J7946K1568K2755
$$ y = [1554797, 1578149, 1597884, 1623289, 1640205, 1665942, 1696539, 1711285, 1665697, 1560252, 1453327, 1397334, 1377739, 1377808, 1394326, 1415784, 1426684, 1438414, 1454898, 1476704, 1494871, 1514060, 1531786, 1547556, 1562696, 1570771, 1581354, 1587606, 1597808, 1616430, 1630847, 1642232, 1648528, 1658605, 1670765, 1685829, 1708258, 1727955, 1738316, 1761262, 1791698, 1809142, 1825596, 1844170, 1867984, 1898287, 1928664, 1963949, 2001331, 2045773, 2097486, 2151823, 2188068, 2123600, 1896425, 1631467, 1485095, 1447774, 1456625, 1481241, 1506183, 1534537, 1565473, 1594993, 1619399, 1646544, 1666289, 1681614, 1701098, 1709785, 1718599, 1732054, 1742554, 1757602, 1774172, 1786463, 1795547, 1807089, 1826619, 1841638, 1853803, 1872024, 1887565, 1903886, 1918384, 1931351, 1946514, 1964294, 1992283, 2014552, 2032498, 2054066, 2076821]
9193B076821K2416K6235L6607L1861K4661j0675p4447j21914p9432k1087j042
9182A910004J1080J0146J1149K0718K7528K1963K1197J7044J4762J8021J2859
9171B096471J5731J3377J7891O078M575L619J7566J1638J9071K7109K0882R150
9159B263158R011R488P384L954J8006J3393J6077J3377J1102Q285J7155J6614
9147B407004J9036J6857J6454J2216J9491K0807R203L548M92N616J0929N85P742
9134B549980Q614P193J0690J4018J4494R515J5377J4410J1422J7236M859K408
9122B680216P825J7104J6618J1943J1205K3616K7516K9110J0626N252R156J6326
9110B866513J2839J9705J9802J9623J3016J4650J9790J9730J6754J8838J8588
$$ y = [2076821, 2099237, 2125472, 2162079, 2193940, 2218601, 2207926, 2133479, 2011565, 1932133, 1911046, 1910004, 1921084, 1931230, 1942379, 1963097, 1990625, 2012588, 2033785, 2050829, 2065591, 2083612, 2096471, 2112202, 2125579, 2143470, 2149548, 2154123, 2157742, 2175308, 2186946, 2206017, 2233126, 2254008, 2263158, 2272169, 2281657, 2289041, 2292995, 2311001, 2324394, 2340471, 2353848, 2364950, 2373235, 2390390, 2407004, 2426040, 2442897, 2459351, 2471567, 2491058, 2511865, 2521068, 2524616, 2525108, 2530724, 2541653, 2542238, 2549980, 2558594, 2565787, 2576477, 2590495, 2604989, 2614504, 2629881, 2644291, 2655713, 2672949, 2677808, 2680216, 2688041, 2705145, 2721763, 2733706, 2744911, 2768527, 2796043, 2825153, 2835779, 2841031, 2850187, 2866513, 2879352, 2899057, 2918859, 2938482, 2951498, 2966148, 2985938, 3005668, 3022422, 3041260, 3059848]
9099C059848K0576J9918J2905Q535Q896N853J7978J9423J2570J1573P512Q106
9087C213693P704R152R237R793J6440J5895J4835J3381J2805P388Q197J6131K4001
9074C378652K5271K6547K6344L0551K6343J2742J0749J6364K0319R723J6233J7259
9062C617097J2600K0240J7761J5050J8031J8689J7284L1192L4240L1530K6058
9051C859772K0111J5298J3410J8163K7973J6824K2533K3856K1136K5629J9119
9040D083824J8563K6274J9289J7435J7383J6942J8050L3251N1592N7148N3547
9029D413298M3149M0509K8564K6137J7153J6349K0150J6263J9703J3642K1848
9018D676765K9260L1236K2208K2992L4767L7528M1691N0990N0484M4203L0219
$$ y = [3059848, 3080424, 3100342, 3113247, 3121782, 3130678, 3136531, 3154509, 3173932, 3186502, 3198075, 3205587, 3213693, 3221397, 3230549, 3239786, 3249579, 3266019, 3281914, 3296749, 3310130, 3322935, 3330323, 3338520, 3354651, 3378652, 3403923, 3430470, 3456814, 3487365, 3513708, 3526450, 3537199, 3553563, 3573882, 3583605, 3599838, 3617097, 3629697, 3649937, 3667698, 3682748, 3700779, 3719468, 3736752, 3767944, 3802184, 3833714, 3859772, 3879883, 3895181, 3908591, 3926754, 3954727, 3971551, 3994084, 4017940, 4039076, 4064705, 4083824, 4102387, 4128661, 4147950, 4165385, 4182768, 4199710, 4217760, 4251011, 4302603, 4359751, 4413298, 4456447, 4496956, 4525520, 4551657, 4568810, 4585159, 4605309, 4621572, 4641275, 4654917, 4676765, 4706025, 4737261, 4759469, 4782461, 4817228, 4854756, 4896447, 4947437, 4997921, 5042124, 5072343]
9007E072343K1363K3605K3476K0107J7112K5897L5570L3667L4021L8140M0951
8996E386252M4089M1799M2760L5320K2115J9378L3606K9791N4448J08340J11413
8985E929311R1465Q0787O6963N7646L6809M3994M3739N1874L7426L2055N1089
8974F523158N7014N8466O3568O0309N6141N4520O4031P3093Q1549Q5038P5670
8963G252557N7590M6242L6017L4872M1900N2044N4808N6612M9170O4266Q0514
8952G826592Q4240R0065R7191R3355R3548R0556Q7612R4379R9628J10480J35606
8941H903252J35844J28808J25074J25407J13674J14036J26867J31660J28725J25363
8931A0158710J46147J51461J48860J56936J61783J66408J60606J54485J73053
$$ y = [5072343, 5093706, 5117311, 5140787, 5160894, 5178006, 5203903, 5239473, 5273140, 5307161, 5345301, 5386252, 5430341, 5472140, 5514900, 5550220, 5572335, 5591713, 5625319, 5655110, 5709558, 5817898, 5929311, 6020776, 6101563, 6168526, 6226172, 6262981, 6306975, 6350714, 6402588, 6440014, 6472069, 6523158, 6580172, 6638638, 6702206, 6762515, 6818656, 6873176, 6937207, 7010300, 7091849, 7176887, 7252557, 7310147, 7356389, 7392406, 7427278, 7469178, 7521222, 7576030, 7632642, 7681812, 7746078, 7826592, 7910832, 8000897, 8098088, 8191443, 8284991, 8375547, 8463159, 8557538, 8657166, 8767646, 8903252, 9039096, 9167904, 9292978, 9418385, 9532059, 9646095, 9772962, 9904622, 10033347, 10158710, 10304857, 10456318, 10605178, 10762114, 10923897, 11090305, 11250911, 11405396, 11578449]
8922A1578449J84708J92229K05321J97567J92229J94081K08665K31048K42020
8913A3426317K53152K66768K82669L02936L06868L32298L67555L94557M28103
8904A6361223M55630M46299M00566L63643M21027N29458O16792O68806P05543
8895B0968987P47605Q19525R13643R92779J049876J114225J258725J519981J800354
8886C1185700K104942K471666K907734L498154M293988N043911M864100R69514
8878E7339709j0750948k5035917k4252528j1462769k907634N46842J894527K334671
8870a2294047K404348K276118K093502J888886J705552J542772J361810J084031
8862B062972Q04619P44499R07313J095376J183419J086418R47125J060027J281612
$$ y = [11578449, 11763157, 11955386, 12160707, 12358274, 12550503, 12744584, 12953249, 13184297, 13426317, 13679469, 13946237, 14228906, 14531842, 14838710, 15171008, 15538563, 15933120, 16361223, 16816853, 17263152, 17663718, 18027361, 18448388, 18977846, 19594638, 20263444, 20968987, 21716592, 22536117, 23449760, 24442539, 25492415, 26606640, 27865365, 29385346, 31185700, 33290642, 35762308, 38670042, 42168196, 46462184, 51506095, 56370195, 57339709, 46588761, 21552844, -2699684, -14162453, -17070087, -16523245, -14628718, -12294047, -9889699, -7613581, -5520079, -3631193, -1925641, -382869, 978941, 2062972, 2867591, 3612090, 4519403, 5614779, 6798198, 7884616, 8831741, 9891768, 11173380]
8853A1173380J427471J511219J588061J639909J704636J841101K006146K111549
8845B5003472K182675K416939K890280L418821L972025M656399N481851O603946
8837E6626408Q240293J0143282J1037193N970006j6417344n1365258n4373233
8830c0138653k5666098o563853Q28222L673178M491991M539940M213685L791734
8822d0829854L357924K939164K560954K164454J583601Q35755N00404P71752J121932
8813b4993914J307100J327528J275048J269856J351366J403928J414113J396831
8805a4248144J385037J380186J388350J414433J463987J516102J596997J752695
8797b350357J964586K198961K481937K832870L303420L971537M743758N061708
$$ y = [11173380, 12600851, 14112070, 15700131, 17340040, 19044676, 20885777, 22891923, 25003472, 27186147, 29603086, 32493366, 35912187, 39884212, 44540611, 50022462, 56626408, 64866701, 75009983, 86047176, 92017182, 75599838, 24234580, -30138653, -55804751, -62368604, -61540382, -57867204, -53375213, -48835273, -44621588, -40829854, -37471930, -34532766, -31971812, -29807358, -28223757, -27388002, -26887598, -26115846, -24993914, -23686814, -22359286, -21084238, -19814382, -18463016, -17059088, -15644975, -14248144, -12863107, -11482921, -10094571, -8680138, -7216151, -5700049, -4103052, -2350357, -385771, 1813190, 4295127, 7127997, 10431417, 14402954, 19146712, 24208420]
8789B4208420L115261n094451j9784417k5981148j5619033m858618j81605J622661
8781d2572930K218704K302621K171930J966412J748197J541938J354422J140821
8773b8127885Q76048N38310L10663L58089N22114O12395O38933O34066O11379
8764b3025888O10964N91179N62101N26801M94747M68697M35226M10976M00097
8755a8525100M02639L89889L64078L38042L09401K90209K86474K99493L02684
8746a5542191K96243K82436K68185K41487K20218K26057K26311K19202K02552
8737a3359500J93795J87443J82334J64430J57171J61143J71829J77914J56906
8728a1806535J44192J44266J50688J39582J29370J14259R0317Q6308J04768J14597
$$ y = [24208420, 27323681, 22229230, 2444813, -23536335, -39155368, -44013986, -44195591, -42572930, -40354226, -38051605, -35879675, -33913263, -32165066, -30623128, -29268706, -28127885, -27251837, -26713527, -26402864, -26044775, -25522661, -24910266, -24271333, -23637267, -23025888, -22414924, -21823745, -21261644, -20734843, -20240096, -19771399, -19336173, -18925197, -18525100, -18122461, -17732572, -17368494, -17030452, -16721051, -16430842, -16144368, -15844875, -15542191, -15245948, -14963512, -14695327, -14453840, -14233622, -14007565, -13781254, -13562052, -13359500, -13165705, -12978262, -12795928, -12631498, -12474327, -12313184, -12141355, -11963441, -11806535, -11662343, -11518077, -11367389, -11227807, -11098437, -10984178, -10893861, -10807553, -10702785, -10588188]
8718a0588188J20392J14976J07821J06118J09520J06218R2517R3677P7190P4093
8708i585666O1512O3174O6344N6560P5403J10712J23037J16550J00119P9244P0825
8697h662186N9385O1892P5729P8670P3463O8217N9258O6433P2148O6951P2450
8686g907590Q4416P2320O8626P0771P4136P2080N3872M5280J7809l4184m4643
8675g427107J8314N5717O4399N9568O2547N8580N4447M6704M4590L5321L6794
8664f890126M1726M0440K7081K7274L0882L6459M5754N2713M9924M6917M8299
8653f442657K6444J3664J4672L5527M9747N1195L7124L9400M5921M1876M2951
8642f044136N3501N2399M2769M7656L9840M4642M2481L1443K4308K1304J749k1863
$$ y = [-10588188, -10467796, -10352820, -10244999, -10138881, -10029361, -9923143, -9830626, -9736949, -9659759, -9585666, -9524154, -9460980, -9394636, -9338076, -9262673, -9151961, -9028924, -8912374, -8812255, -8733011, -8662186, -8602801, -8540909, -8465180, -8386510, -8313047, -8244830, -8185572, -8119139, -8046991, -7980040, -7907590, -7823174, -7750854, -7682228, -7611457, -7537321, -7465241, -7411369, -7366089, -7348280, -7382464, -7427107, -7408793, -7353076, -7288677, -7229109, -7166562, -7107982, -7053535, -7006831, -6962241, -6926920, -6890126, -6848400, -6807960, -6780879, -6753605, -6722723, -6686264, -6640510, -6587797, -6537873, -6490956, -6442657, -6416213, -6402549, -6387877, -6352350, -6302603, -6251408, -6214284, -6174884, -6128963, -6087087, -6044136, -5990635, -5938236, -5895467, -5847811, -5807971, -5763329, -5720848, -5689405, -5665097, -5643793, -5642044, -5663907]
8630e663907O340K8276L3967L9938M0752K8951L9235L0128L3754L1638K4191K8055
8618e298682K4147K9915K4125K7282K4102J7640J8701P348O146N750n49m749m928
8605e123752J690N859Q184J1910N105j13R609K0524J7672J9991K5651J9281K0211
8592d958178K8460K2830K1773J5952J9255J2705O940J3011K7267K6325K1370J9763
8580d722527J6499J8568K3670K1293K2916K6593J6840J4694J8365J9332J8413
8569d505344K0336J7056J8650J7566J4800K5829J8388J3925Q941J0394J5733K2188
8557d301538J7296J6324J4127P570L658j233J1045J5892K0466J7263J4440J6124
8545d148566J8230J3295J1184J1431J6903J3363J8590K2618J7101P562M452P623
$$ y = [-5663907, -5657567, -5629291, -5595324, -5555386, -5514634, -5485683, -5446448, -5416320, -5382566, -5350928, -5326737, -5298682, -5274535, -5244620, -5220495, -5193213, -5169111, -5151471, -5132770, -5125422, -5119276, -5113526, -5114075, -5118824, -5123752, -5122062, -5116203, -5108019, -5096109, -5091004, -5091117, -5081508, -5060984, -5043312, -5023321, -4997670, -4978389, -4958178, -4929718, -4906888, -4885115, -4869163, -4849908, -4837203, -4830263, -4817252, -4789985, -4763660, -4742290, -4722527, -4706028, -4687460, -4663790, -4642497, -4619581, -4592988, -4576148, -4561454, -4543089, -4523757, -4505344, -4485008, -4467952, -4449302, -4431736, -4416936, -4391107, -4372719, -4358794, -4349853, -4339459, -4323726, -4301538, -4284242, -4267918, -4253791, -4246221, -4242563, -4243796, -4232751, -4216859, -4196393, -4179130, -4164690, -4148566, -4130336, -4117041, -4105857, -4094426, -4077523, -4064160, -4045570, -4022952, -4005851, -3998289, -3993837, -3986214]
8533c986214J1837J0716J2636J4039R206J3527J3931J1736K3455J9923J5851J8387
8521c810970J4509J6798R932J7104J2429k070k624J1128J2336J3653J4510Q948
8509c684317R203N158O510J1328J4111K0462J6814J3060P409J2048O711N225J0085
8496c546193Q692K3239K1180J5471J7087J1469J1229K1916J4647J0120N205R548
8484c376390J2826J7189J8986K0474K3524K6763K7304K1506L4385L8846J7588
8473c116999p622p8328j25931r1886k7866K771J0825J5903J2146K3287K1949J4790
8461c346961R653J1297J4625J9212R897Q813J8019J8748J9830K5386J5824J1652
8449c164005J4789J2000J2349J3190J1292K1227J8973J4932K0422J4532J6621
$$ y = [-3986214, -3974377, -3963661, -3951025, -3936986, -3927780, -3914253, -3900322, -3888586, -3865131, -3845208, -3829357, -3810970, -3796461, -3779663, -3769731, -3752627, -3740198, -3742268, -3744892, -3733764, -3721428, -3707775, -3693265, -3684317, -3675114, -3669956, -3663446, -3652118, -3638007, -3617545, -3600731, -3587671, -3580262, -3568214, -3561503, -3556278, -3546193, -3537501, -3514262, -3493082, -3477611, -3460524, -3449055, -3437826, -3415910, -3401263, -3391143, -3385938, -3376390, -3363564, -3346375, -3327389, -3306915, -3283391, -3256628, -3229324, -3207818, -3173433, -3134587, -3116999, -3124621, -3202949, -3328880, -3420766, -3448632, -3445861, -3435036, -3419133, -3406987, -3383700, -3361751, -3346961, -3337308, -3326011, -3311386, -3292174, -3282277, -3273464, -3255445, -3236697, -3216867, -3191481, -3175657, -3164005, -3149216, -3137216, -3124867, -3111677, -3100385, -3079158, -3060185, -3045253, -3024831, -3010299, -2993678]
8438b993678J7756K7746L0421L0597K8199L4867M2297N0379O1717N1027q334j54113
8426b781119k89039k13435q2198j4931J8129L1602L8914K1894J9690K1323K9307
8415c199863K3878J6748J5731Q373J0277J1951J2634J9423J1269M858J1469J8851
8403c034401J9022J5669J0299J2742R486L851P780J4384R518J2970K0164K0688
8391b877828J4059K5247J8155J4984K1171K4060K6631K9984J4166n6406j18361
8380b864138j03462m2342j1202L751J0427J8049J6524J0358R356J9400J7413J0078
8368b905788J631M117Q024J2755Q753J4418J1090J3187M915J1806J0679O495J270
8355b796648Q877R848J2582Q884k99J489J2931M627L582Q380K353O798O562N599
$$ y = [-2993678, -2975922, -2948176, -2917755, -2887158, -2858959, -2824092, -2781795, -2731416, -2669699, -2618672, -2627006, -2781119, -3070158, -3283593, -3365791, -3380722, -3362593, -3330991, -3292077, -3270183, -3250493, -3229170, -3199863, -3175985, -3159237, -3143506, -3135133, -3124856, -3112905, -3100271, -3080848, -3069579, -3064721, -3053252, -3034401, -3015379, -2999710, -2989411, -2976669, -2967183, -2963332, -2955552, -2941168, -2931650, -2918680, -2898516, -2877828, -2863769, -2838522, -2820367, -2805383, -2784212, -2760152, -2733521, -2703537, -2689371, -2745777, -2864138, -2967600, -3009942, -3021144, -3017393, -3006966, -2988917, -2972393, -2962035, -2952679, -2933279, -2915866, -2905788, -2904157, -2900040, -2892016, -2879261, -2870508, -2856090, -2845000, -2831813, -2826898, -2815092, -2804413, -2797918, -2796648, -2787771, -2777923, -2765341, -2756457, -2756756, -2755267, -2742336, -2737709, -2734127, -2725747, -2723394, -2716596, -2710034, -2704435]
8341b704435O944N680M889O286P369R381P167O60K584P870J009L845J1144P174
8327b622433K354M662Q16L649J0589Q548K997O289O505M187O191K832M05m737
8313b567146O438P212O264O717N849M227O378J026L26J0636J1968R301M583J361
8299b484860M682j988l080K278J4120K018m315P548J3521Q226n292j581k964K735
8285b448952O167N904J3888O071N560R958Q72J282M48R80K087L55P536N105Q86
8270b381853Q658O382J960J903K057j067K451P293m83J191J0576N030o99L296
8256b333305j319K270L693L674N741L355j900N168L399O303J1310N281j1590p021
8242b304941Q398P381O579Q007L009N316R163M555J240N960P557K322L326k49
$$ y = [-2704435, -2697491, -2691811, -2686922, -2680636, -2673267, -2663886, -2656719, -2656059, -2653475, -2645605, -2644596, -2640751, -2629607, -2622433, -2620079, -2615417, -2614601, -2610952, -2600363, -2591815, -2588818, -2582529, -2576024, -2571837, -2565646, -2562814, -2562409, -2567146, -2560708, -2553496, -2547232, -2540515, -2534666, -2530439, -2524061, -2523035, -2522709, -2512073, -2500105, -2490804, -2486221, -2484860, -2480178, -2482166, -2485246, -2482968, -2468848, -2466830, -2471145, -2463597, -2450076, -2441850, -2447142, -2448723, -2451687, -2448952, -2442785, -2436881, -2422993, -2416922, -2411362, -2401404, -2400532, -2399250, -2398802, -2397822, -2395735, -2395380, -2387844, -2382739, -2381853, -2373195, -2366813, -2364853, -2362950, -2360893, -2361960, -2359509, -2352216, -2352699, -2351508, -2340932, -2335902, -2336601, -2333305, -2334624, -2332354, -2328661, -2324987, -2319246, -2315891, -2317791, -2312623, -2309224, -2302921, -2291611, -2286330, -2297920, -2304941, -2296543, -2289162, -2282583, -2274576, -2271567, -2266251, -2257088, -2252533, -2251293, -2245333, -2237776, -2235454, -2232128, -2232377]
8228b232377k343R940M466Q63k253j103l175k425J3293K2156Q079p79J782o136
8214b190012k286O842L801J0873N041m644o789j1589k705N729Q956J4537N365
8201b156881k513m525j865j081N520P933O614M124M423O906L582P967N345M263
8187b110188l447n250L465o59L5M979J655L410P131R462J2064N80K95j46L108
8172b073506K948k825M668P691J683m29j071k512m737L007Q450J1275K764j149
8158b043743J890K266O91L333Q00Q367L176l688L160L624L096L684P377R90J35
8143b004842M489k70O739l153J564N86Q346K379P399M699j937R725Q733o053n975
8128a967571k423M280L831L502L192K436L665O944N967m64m353k6n92M716N890
$$ y = [-2232377, -2234720, -2224780, -2220314, -2219451, -2221704, -2222807, -2225982, -2228407, -2215114, -2192958, -2184879, -2185658, -2183876, -2190012, -2192298, -2185456, -2181655, -2170782, -2165741, -2170385, -2177174, -2188763, -2191468, -2185739, -2176783, -2162246, -2156881, -2159394, -2163919, -2165784, -2166865, -2161345, -2153412, -2146798, -2142674, -2138251, -2131345, -2127763, -2119796, -2114451, -2110188, -2113635, -2118885, -2115420, -2116079, -2116044, -2111065, -2109410, -2106000, -2098869, -2089407, -2077343, -2076763, -2076468, -2076614, -2073506, -2070558, -2073383, -2068715, -2061024, -2059341, -2059770, -2060841, -2063353, -2068090, -2065083, -2056633, -2045358, -2042594, -2043743, -2041853, -2039587, -2038896, -2035563, -2034763, -2026396, -2023220, -2026908, -2023748, -2020124, -2017028, -2013344, -2005967, -2004977, -2004842, -2000353, -2000623, -1993884, -1997037, -1995473, -1994887, -1986541, -1984162, -1976763, -1972064, -1974001, -1964276, -1955543, -1961596, -1967571, -1969994, -1965714, -1961883, -1958381, -1955189, -1952753, -1949088, -1942144, -1936177, -1936641, -1940994, -1941020, -1941612, -1936896, -1931006]
8113a931006R220K941l105L973l738l659K437O500P766M416K271N716K378K879
8099a891011M087k027K314Q129j561m842M823m259K567L137Q265L036q661J943
8085a874060M383M195q2M088N360P169J5654O460j690r95k828J226j141M27j920
8070a833754J542R398R528O753J1j4128j1380L297R149m75N679L683J480O299
8056a802918R219L688k34M444M189j76p133n647K473p056L732j319k841M81J1781
8041a787317R399R4L055K525k932L658K155l595J162P033M075M144m094K527J104
8026a757007l14J887J0910R716L03Q36p512l56L822N612P18J360J0876N308m551
8011a718392r400j7750r493j449j717k434n968j945N034K895Q91j2719n424N489
$$ y = [-1931006, -1921786, -1918845, -1921950, -1917977, -1921715, -1925374, -1922937, -1916437, -1908671, -1904255, -1901984, -1896268, -1893890, -1891011, -1886924, -1888951, -1886637, -1878508, -1880069, -1884911, -1880088, -1884347, -1881780, -1878643, -1870378, -1867342, -1876003, -1874060, -1869677, -1865482, -1865564, -1861476, -1856116, -1848947, -1833293, -1826833, -1828523, -1829518, -1832346, -1831120, -1832261, -1831834, -1833754, -1832212, -1822814, -1813286, -1806533, -1806522, -1820650, -1832030, -1828733, -1819584, -1820059, -1814380, -1810697, -1809217, -1802918, -1793699, -1790011, -1790245, -1785801, -1781612, -1781788, -1788921, -1794568, -1792095, -1799151, -1795419, -1796738, -1799579, -1799098, -1787317, -1777918, -1777824, -1774769, -1772244, -1775176, -1771518, -1769363, -1772958, -1771796, -1764763, -1760688, -1756544, -1760638, -1758111, -1757007, -1757321, -1755434, -1744524, -1734808, -1734505, -1733669, -1741181, -1741537, -1737715, -1732103, -1731385, -1730025, -1719149, -1713841, -1718392, -1727792, -1745542, -1755035, -1756484, -1758201, -1760635, -1766603, -1768548, -1763514, -1760619, -1759728, -1772447, -1777871, -1772382]
7997a772382J0692K763j715L466R20q12K682O628K267P106J986L216J485P405
7983a724293J1256n55l205J546l407j673N972N221l561L476r18n183k434R79j891
7968a718670K123J666j594m333m894o726j110j115J734q21n703j175Q459L406
7954a728753R20L060M980J982q213K640k11L779P20J400R87N232Q990O405j358
7939a697440j852k211K739J910Q496M076o440l528m500P864R733J083k558K874
$$ y = [-1772382, -1761690, -1758927, -1760642, -1757176, -1756256, -1757068, -1754386, -1747758, -1745491, -1738385, -1736399, -1733183, -1731698, -1724293, -1713037, -1713592, -1716797, -1715251, -1718658, -1720331, -1714359, -1709138, -1712699, -1709223, -1710141, -1715324, -1717758, -1716779, -1718670, -1716547, -1714881, -1716475, -1720808, -1725702, -1732428, -1733538, -1734653, -1732919, -1733740, -1739443, -1740618, -1732159, -1728753, -1727833, -1724773, -1719793, -1717811, -1726024, -1723384, -1723595, -1719816, -1719096, -1717696, -1716709, -1711477, -1702487, -1696082, -1697440, -1699292, -1701503, -1698764, -1696854, -1688358, -1684282, -1690722, -1694250, -1698750, -1690886, -1681153, -1680070, -1682628, -1679754]
$$ [...]
##END NTUPLES=NMR SPECTRUM
##END=
