##TITLE=Analysis number 316917
Compound Code cc 46624
Book Reference 468/19/2
Project Code adrs
Chemist Name colinb
##JCAMPDX= 6.0         $$ Bruker NMR JCAMP-DX V2.0
##DATA TYPE= NMR SPECTRUM
##DATA CLASS= NTUPLES
##ORIGIN= Bruker BioSpin GmbH
##OWNER= nmr
$$ XWIN-NMR		Version 3.5
$$ Wed Feb  1 12:08:16 2006 GMT Standard Time (UT+0h)  MAYBRIDGE\nmr@NMR_250MHZ
##.OBSERVE FREQUENCY= 250.131544655141
##.OBSERVE NUCLEUS= ^1H
##.ACQUISITION MODE= SIMULTANEOUS (DQD)
##.ACQUISITION SCHEME= undefined
##.AVERAGES= 16
##.DIGITISER RES= 18
##SPECTROMETER/DATA SYSTEM= dpx250
##.PULSE SEQUENCE= zg30
##.SOLVENT NAME= CDCl3
##.SHIFT REFERENCE= (INTERNAL, CDCl3, 0, 16.4421)
##AUDIT TRAIL= $$ (NUMBER, WHEN, WHO, WHERE, WHAT)
$$ ##TITLE= Audit trail, XWIN-NMR		Version 3.5
$$ ##JCAMPDX= 5.01
$$ ##ORIGIN= Bruker BioSpin GmbH
$$ ##OWNER= nmr
$$ C:\u/data/dgb/nmr/ADRS/15460/pdata/1/auditp.txt
$$ ##AUDIT TRAIL=  $$ (NUMBER, WHEN, WHO, WHERE, WHAT)
(   1,<2006-02-01 12:07:55.48 +000>,<MAYBRIDGE\nmr>,<NMR_250MHZ>,
      <created by zg, POWCHK disabled, PULCHK disabled
       configuration hash MD5:
       84 BC 41 DB A1 6E 1D 46 DA 25 12 A5 C1 ED C5 3A
       data hash MD5: 64K
       29 BE E4 A5 44 56 A4 87 12 63 AD 7B 55 93 82 BA>)
(   2,<2006-02-01 12:08:07.46 +000>,<MAYBRIDGE\nmr>,<NMR_250MHZ>,
      <Start of raw data processing
       ef LB = 0.3 FT_mod = 6 PKNL = 1 SI = 32K 
       data hash MD5: 32K
       BA 8C B8 E7 AF BB DD 4D 2C D8 50 AD 5D E9 0A A6>)
(   3,<2006-02-01 12:08:09.35 +000>,<MAYBRIDGE\nmr>,<NMR_250MHZ>,
      <apk 
       data hash MD5: 32K
       18 DD F5 CA AA 5D C9 5D 1B AF 97 6C 52 B8 E4 4B>)
(   4,<2006-02-01 12:08:10.09 +000>,<MAYBRIDGE\nmr>,<NMR_250MHZ>,
      <abs ABSG = 5 
       data hash MD5: 32K
       DE E1 99 A1 37 BD E3 AE 5F 15 A0 E6 4F 27 7D 4C>)
$$ ##END=
$$ 
$$ hash MD5
$$ 12 B5 D1 C7 2A D0 B3 B6 00 E2 5A 91 E5 D9 D4 24
##$RELAX= 
##$RELAX= 
##$RELAX= 
##$RELAX= 
##$RELAX= 
##$RELAX= 
##$RELAX= 
$$ Bruker specific parameters
$$ --------------------------
##$DU= <C:\u>
##$EXPNO= 15460
##$NAME= <ADRS>
##$PROCNO= 1
##$TYPE= <nmr>
##$USER= <dgb>
##$AMP= (0..31)
100 100 100 100 100 100 100 100 100 100 100 100 100 100 100 100 100 100 
100 100 100 100 100 100 100 100 100 100 100 100 100 100 
##$AQSEQ= 0
##$AQ_mod= 3
##$AUNM= <au_zg>
##$AUTOPOS= <8 >
##$BF1= 250.13
##$BF2= 250.13
##$BF3= 250.13
##$BF4= 250.13
##$BF5= 500.13
##$BF6= 500.13
##$BF7= 500.13
##$BF8= 500.13
##$BYTORDA= 1
##$CFDGTYP= 0
##$CFRGTYP= 5
##$CHEMSTR= <none>
##$CNST= (0..31)
1 1 145 1 1 1 1 1 1 1 1 1 1 1 1 1 1 1 1 1 1 1 1 1 1 1 1 1 1 1 1 1 
##$CPDPRG= <>
##$CPDPRG1= <>
##$CPDPRG2= <>
##$CPDPRG3= <>
##$CPDPRG4= <mlev>
##$CPDPRG5= <mlev>
##$CPDPRG6= <mlev>
##$CPDPRG7= <mlev>
##$CPDPRG8= <mlev>
##$CPDPRGB= <>
##$CPDPRGT= <>
##$D= (0..31)
0 1 0 0 0 0 0 0 0 0.06 0 0 0 0 0 0 0.0002 0 0 0 0 0 0 0 0 0 0 0 0 0 0 
0 
##$DATE= 1138795674
##$DBL= (0..7)
120 120 120 120 120 120 120 120 
##$DBP= (0..7)
150 150 150 150 150 150 150 150 
##$DBP07= 0
##$DBPNAM0= <>
##$DBPNAM1= <>
$$ [...]
##$SUBNAM7= <"">
##$SUBNAM8= <"">
##$SUBNAM9= <"">
##$SW= 20.6930455092707
##$SWIBOX= (0..15)
0 0 3 0 0 0 0 0 0 0 0 0 0 0 0 0 
##$SW_h= 5175.983436853
##$TD= 65536
##$TD0= 1
##$TE= 293.16
##$TE2= 300
##$TE3= 300
##$TEG= 300
##$TL= (0..7)
0 120 120 120 120 120 120 120 
##$TP= (0..7)
150 150 150 150 150 150 150 150 
##$TP07= 0
##$TPNAME0= <>
##$TPNAME1= <>
##$TPNAME2= <>
##$TPNAME3= <>
##$TPNAME4= <>
##$TPNAME5= <>
##$TPNAME6= <>
##$TPNAME7= <>
##$TPOAL= (0..7)
0.5 0.5 0.5 0.5 0.5 0.5 0.5 0.5 
##$TPOFFS= (0..7)
0 0 0 0 0 0 0 0 
##$TUNHIN= 0
##$TUNHOUT= 0
##$TUNXOUT= 0
##$USERA1= <user>
##$USERA2= <user>
##$USERA3= <user>
##$USERA4= <user>
##$USERA5= <user>
##$V9= 5
##$VALIST= <valist>
##$VCLIST= <CCCCCCCCCCCCCCC>
##$VD= 0
##$VDLIST= <DDDDDDDDDDDDDDD>
##$VPLIST= <PPPPPPPPPPPPPPP>
##$VTLIST= <TTTTTTTTTTTTTTT>
##$WBST= 1024
##$WBSW= 4
##$XGAIN= (0..3)
0 0 0 0 
##$XL= 0
##$YL= 0
##$YMAX_a= 423472
##$YMIN_a= -414801
##$ZGOPTNS= <>
##$ZL1= 120
##$ZL2= 120
##$ZL3= 120
##$ZL4= 120
##$ABSF1= 16.44209
##$ABSF2= -4.251083
##$ABSG= 5
##$ABSL= 3
##$ALPHA= 0
##$AQORDER= 0
##$ASSFAC= 0
##$ASSFACI= 0
##$ASSFACX= 0
##$ASSWID= 0
##$AUNMP= <proc_1d>
##$AZFE= 0.1
##$AZFW= 0.1
##$BCFW= 0
##$BC_mod= 0
##$BYTORDP= 0
##$COROFFS= 0
##$CY= 12.5
##$DATMOD= 1
##$DC= 0
##$DFILT= <>
##$DTYPP= 0
##$F1P= 14.0000005364418
##$F2P= -0.99999901652339
##$FCOR= 0.5
##$FTSIZE= 32768
##$FT_mod= 6
##$GAMMA= 0
##$GB= 0
##$INTBC= 1
##$INTSCL= 1
##$ISEN= 128
##$LB= 0.3
##$LEV0= 0
##$LPBIN= 0
##$MAXI= 10000
##$MC2= 0
##$MEAN= 0
##$ME_mod= 0
##$MI= 0
##$NCOEF= 0
##$NC_proc= -2
##$NLEV= 6
##$NOISF1= 0
##$NOISF2= 0
##$NSP= 0
##$NTH_PI= 0
##$NZP= 0
##$OFFSET= 16.44209
##$PC= 1
##$PHC0= 99.62219
##$PHC1= 8.267589
##$PH_mod= 1
##$PKNL= yes
##$PPARMOD= 0
##$PSCAL= 4
##$PSIGN= 0
##$REVERSE= no
##$SF= 250.130019986107
##$SI= 32768
##$SIGF1= 0
##$SIGF2= 0
##$SINO= 400
##$SIOLD= 32768
##$SREGLST= <1H.CDCl3>
##$SSB= 0
##$STSI= 32768
##$STSR= 0
##$SW_p= 5175.98343685301
##$SYMM= 0
##$S_DEV= 0
##$TDeff= 65536
##$TDoff= 0
##$TI= <Analysis number 999999
Compound Code 99
Book Reference 9
Project Code 9>
##$TILT= no
##$TM1= 0
##$TM2= 0
##$TOPLEV= 0
##$USERP1= <user>
##$USERP2= <user>
##$USERP3= <user>
##$USERP4= <user>
##$USERP5= <user>
##$WDW= 1
##$XDIM= 32768
##$YMAX_p= 271894526
##$YMIN_p= -54856
$$ End of Bruker specific parameters
$$ ---------------------------------
##NTUPLES= NMR SPECTRUM
##VAR_NAME=  FREQUENCY,     SPECTRUM/REAL,   SPECTRUM/IMAG
##SYMBOL=    X,             R,               I
##VAR_TYPE=  INDEPENDENT,   DEPENDENT,       DEPENDENT
##VAR_FORM=  AFFN,          ASDF,            ASDF
##VAR_DIM=   32768,         32768,           32768
##UNITS=     HZ,            ARBITRARY UNITS, ARBITRARY UNITS
##FACTOR=    0.157963299565203, 1,           1
##FIRST=     4112.66007039649, 0,            0
##LAST=      -1063.32336645652, 0,           0
##MIN=       -1063.32336645652, -54856,      0
##MAX=       4112.66007039649, 271894526,    0
$$ Real data points
##PAGE= N=1
##DATA TABLE= (X++(R..R)), XYDATA
$$ [...]
23656 -17692 -12204 -7865 -17663 -7775 -1583 5846 -1503 1690 6145 -6678 -521 4720 1226 2080
23642 2080 -203 -14934 -15158 -16540 14087 23907 32148 30619 26466 19653 -4352 -20011 -39015 -45080
23628 -45080 -34378 -12747 -391 -5326 -20406 -25629 -14025 5474 25846 22847 18373 4657
23616 4657 4109 3673 -5031 -9754 2845 -2522 -9186 1246 7214 -705 7908 2011 -21710 -25221
23602 -25221 -18728 -23440 -13373 -14805 -9774 90 4734 -10851 -6809 -11238 -20376 -19442 -9739 6371
23588 6371 1248 -10411 -15548 -15019 -8426 -16738 -15916 -6436 -35532 -41867 -16888 -11044 -2639 3475
23574 3475 6246 7735 6197 25497 21000 21129 23488 18653 3335 -15976 -17659 -18793 -15022 -920
23560 -920 5991 987 -11530 -15501 -19742 -13095 -4861 -10189 -14589 -10818 -10780 -10206 -8474 -4215 9452
23545 9452 21605 22734 7737 2720 8440 11271 25553 29755 30850 26959 14625 14822 12380 5829
23531 5829 1105 -5097 -1678 -9035 -9604 -29227 -34979 -29578 -21879 -14353 14222 16018 1469 -155
23517 -155 3521 9876 8572 -1027 5101 18295 13441 2667 -2008 -2424 8927 863 -14529 -5687
23503 -5687 -10822 -22930 -31930 -30490 -21636 -5157 -6276 -6456 -27239 -29094 -17428 -23648 -9119 -417
23489 -417 16769 7767 -12252 -2505 13158 -352 -679 17797 36275 27938 8709 -6952 -13598
23476 -13598 -1280 15661 4582 3068 8540 4269 -4226 -1499 -7863 -20447 -17539 -12739 -17602
23463 -17602 -13935 -3753 -8165 888 4276 -9239 -797 19562 15377 10222 8152 6273 1106 -4967
23449 -4967 -320 1544 2493 14697 13580 7999 -7903 -4019 10446 2453 -2671 3470 -6209 -1812
23435 -1812 13079 16009 -2210 -10701 -12460 -19226 -14707 1481 19510 23382 27247 15836 8663
23422 8663 9969 5162 -3114 -16927 -16627 -11691 5433 -219 -12972 -8649 2082 26413 35588 37816
23408 37816 32341 26242 16856 22948 28186 20567 18042 12522 1150 -2202 2549 18621 10043 -10568
23394 -10568 -13765 -10273 -4047 -2130 -3725 -17971 -14384 -6704 -2578 3946 2171 -4965 -20503 -43359
23380 -43359 -33461 -19861 -9197 7213 2563 -23718 -23515 -26736 -19749 -17502 -13509 1006 19764
23367 19764 38169 18890 -6606 -19588 -17911 -16343 -25683 -25010 -22918 -20700 -1343 1735 913 -1091
23353 -1091 3918 2469 -5368 -12264 -21295 -20915 -18794 -14555 -7794 -8424 -1608 -7832 -1945 5219 -2573
23338 -2573 5487 3091 -15326 -1048 -4788 -7967 11283 23636 29849 24081 18986 8818 7317
23325 7317 6198 -4392 -1154 -2512 -1022 7331 4756 -7620 -12442 -17831 -13027 -17638 -18903 793
23311 793 9538 -3712 -27663 -36838 -28352 -3496 9795 7191 12056 19638 759 -3897 1936 -6593
23297 -6593 -17426 -15656 -8219 16066 25466 15591 11633 1883 -14816 -22388 -24253 -23509 -15506 -2356
23283 -2356 5742 -980 3195 11232 -2557 -7193 -11524 -23620 -3791 14347 17072 16804 8131 420
23269 420 9326 13968 18992 31628 41516 31702 24700 21162 13501 -4417 -6440 -3412 -4329 -6418 -11078
23254 -11078 -1484 -5767 -9947 -6149 18053 31295 22561 28183 21157 -898 3473 16235 26578
23241 26578 21182 1848 -4509 -4665 -3825 19945 26862 24276 16535 10780 15981 18229 19869 4303
23227 4303 3884 2546 6632 5240 1715 3523 5087 1112 3831 6480 5192 7650 5833 -438 -10739
23212 -10739 -21069 -21028 -17565 -6794 -11943 -23950 -27863 -21185 -8320 5944 11515 -13772 -25431
23199 -25431 3839 768 4448 2982 -8647 -9365 -5502 -1271 14672 16295 13298 26161 13984
23186 13984 2496 561 -667 3300 -15118 -13874 -5854 1369 -458 -3111 1446 1768 152 -3949
23172 -3949 -322 4056 8598 5378 6875 951 -3644 -10921 0 9880 10837 4050 -5658 -1809 16243
23157 16243 24207 22714 9407 12693 10910 1586 -3927 3418 21184 26734 18412 1435 -6747 -1743
23143 -1743 -1935 -8562 860 14411 -95 -1867 5096 16738 18979 28136 31003 33746 33346 17031
23129 17031 8540 16106 13573 4358 -2351 -100 14014 6836 1182 8432 17149 13100 3400 9515
23115 9515 8972 67 -2642 -3746 -17976 -21324 -14600 -14804 -68 5332 10308 9966 387 -4823 -14631
23100 -14631 -35319 -36182 -23052 -13989 -5128 -10966 -8360 -9879 3604 -3844 -410 -484 9950 13977
23086 13977 18523 -3414 -8068 -5082 -629 -9318 -2267 7961 22258 11721 -1465 4429 17977
23073 17977 13163 15442 15121 18819 23285 1467 -23110 -15495 906 6145 16286 13731 11851 17753
23059 17753 18167 10657 20249 31802 26765 10895 5409 -337 -20858 -19441 1856 6178 -6951
23046 -6951 -568 136 -558 3296 -3758 2357 23254 32457 20055 6640 -10125 -22614 -16168 -12158
23032 -12158 -18662 -13514 183 -2188 -2106 -8644 -13396 -6163 -3141 -5676 -7583 4317 375 3181
23018 3181 5543 7408 2089 6480 -5023 -16242 -9192 -560 -890 -299 1196 -6052 -9004 -5750 -3698
23003 -3698 2669 -7151 -8167 -198 -1542 -681 4231 6651 3362 -5857 2932 11417 -3716 7286
22989 7286 11134 1250 -1211 9238 2765 -21246 -16491 -17994 -9012 12902 38739 16003 5430
22976 5430 -10000 -7296 -1995 -13969 -5815 1028 -12520 -9864 1089 11389 3738 -5778 -21102
22963 -21102 -13592 -925 -3868 -2689 -5431 -10119 -1723 8140 27027 33741 18552 6214 7071 -1101
22949 -1101 -8942 -19569 -9789 2515 4147 -4043 -22238 -22304 -12053 -17419 -6357 -10627 -9359 -11960
22935 -11960 -8400 -1226 -5230 -5101 6732 20821 26885 33567 32760 19962 7847 20561 17565 10065
22921 10065 -4393 -13475 -21612 -9106 -1935 -6151 16911 25120 10306 8423 13061 18135 13406
22908 13406 8971 19842 16681 13918 21599 19497 15703 15016 12017 6045 5549 -191 2610 12286 17073
22893 17073 17265 15761 1003 -16178 -894 15520 21040 18417 -3658 -9838 4743 -15229 -12394
22880 -12394 -3543 -12798 -14297 -192 -637 -1900 -3740 -2593 -4233 696 8199 14363 32427 27409
22866 27409 5670 -3419 -1316 15580 23905 18765 4776 -6554 -6560 -6806 -14005 -16836 -8441 1821
22852 1821 5011 -593 -12691 -14343 3153 10150 -4040 -13846 -17603 -7078 -9700 -7368 -311 20386
22838 20386 13353 -6371 -7946 -6133 -15244 -1723 608 -4797 5032 -7356 -33825 -14391 12600
22825 12600 22882 21817 26039 28711 10656 1519 -8874 -15247 -9214 -990 9656 17881 11443
22812 11443 -5077 -21966 -23327 -18382 -22509 -14825 5088 9512 17438 23330 18206 -12597 -17329
22799 -17329 -13382 -11033 -15293 -14854 -28001 -22387 -10461 -9751 7386 15476 7924 -13171 -3337 -2560
22785 -2560 -7150 6375 7810 -4709 -6628 -16521 -22796 -19259 -6488 -220 9117 8309 1199 -6325
22771 -6325 9025 3434 601 -4224 2681 -108 -8598 3421 18550 241 -3886 -6300 -8953 -12676
22757 -12676 -10512 -12409 -10397 -16695 -17903 -15128 -5903 6570 11842 -7904 -16465 -13525 -10409 2913
22743 2913 9144 4603 9879 -3127 -6802 -15704 -17555 -8212 -4229 -4477 -11425 -13252 -23575 -31602
22729 -31602 -32865 -22493 -1900 3892 5982 3544 -15871 -8654 3567 13267 14819 10094 1082
22716 1082 -793 15932 7650 -14721 -22347 -16557 -10205 -20443 -26326 -20297 -12325 1650 2977 10219
22702 10219 12769 3237 -12034 -9792 11624 -2220 -13607 -603 8482 -6201 -13152 -14497 -24744
22689 -24744 -24042 -9811 2105 4130 8119 -4717 -11902 -3080 -2904 -7506 10572 21250 11659 6008
22675 6008 -6769 -9197 -5921 -4013 -6180 -4657 16694 33183 13294 6587 23422 22172 16866
22662 16866 19175 27305 19305 13871 17218 18455 10573 9120 11693 6187 1213 -8221 -3941 -22042
22648 -22042 -27703 -22092 -23226 -11290 2980 -4714 -23843 -22510 -3520 -5431 -16967 -17113 -25476
22635 -25476 -19113 -7778 -9704 5476 9331 -660 -14828 -8381 -7990 -19541 -11247 4514 582
22622 582 -19687 -18128 -8520 13279 15250 13978 -657 -4953 1911 5014 4226 -2929 -6858 -5431
22608 -5431 5086 1216 1734 6956 -6947 -14090 -9812 -295 14166 15436 12572 5095 11959 8143
22594 8143 -9643 -13354 3376 16748 5075 12219 10004 2252 3743 -8354 -11757 -15170 -5761
22581 -5761 -3555 -11559 -1918 -5319 -8408 -1780 -1531 -3054 5514 -2973 -24130 -31826 -11966 1238
22567 1238 14508 14737 15616 14431 17752 22005 19868 9444 664 3071 9192 19878 29876 25689
22553 25689 16192 11926 6803 -300 11157 10252 19397 29384 22966 15473 17374 17078 1369 -2624
22539 -2624 -22061 -22381 -11075 4838 3904 -2707 -26057 -27075 -17550 -6410 655 10909 -2106
22526 -2106 9673 10492 16763 21011 21358 35194 21122 7992 3011 -9313 4546 10971 -960
22513 -960 4118 7540 22708 18054 11469 8438 -2186 4306 15715 27745 9188 4421 -5767
22500 -5767 -4208 6273 11448 8529 10014 11751 20953 20096 6207 596 -12470 -7102 -14599 -28931
22486 -28931 -22944 -13516 923 9051 10180 11579 5394 9716 25656 24831 14245 10023 14249 13394
22472 13394 -9155 -13474 -13913 -17795 -10256 -4216 -4473 -11314 -11903 -11942 -9808 -15841 -13015 -5036 -4666 -5290
22456 -5290 848 10109 4964 -6468 -6792 -10435 -71 11481 21760 12393 1236 2390 2243 -4736
22442 -4736 -7829 -15446 -4158 -221 4207 5417 10235 3774 10260 10041 16028 1411 -9465 -5860
22428 -5860 -6938 -10278 -6329 6053 17954 12002 3600 4751 2782 7964 22434 21323 9985 6247
22414 6247 5961 7943 8870 11923 17783 2076 -9926 -9457 -615 -2590 -14948 -18954 -8392 5772
22400 5772 67 -18799 -24731 -19823 -11026 -4821 -8647 -10825 -173 2040 -2040 7165 11801 -5381
22386 -5381 -11214 -9028 -13047 -11622 -6577 -832 6357 -1446 -742 -9410 -19686 -19428 -26236 -27658 -19185
22371 -19185 -10981 -8787 -4161 8269 15044 24912 21722 4828 629 -4302 -11520 -11213 -8167 -10612
22357 -10612 -7576 -20765 -38610 -34493 -10308 -3854 -9607 -22872 -22954 -1705 13715 12580 2435
22344 2435 1793 1119 3308 -4934 -6427 -1913 -4293 1442 12291 15977 9157 -4572 -20594 -22292
22330 -22292 -12501 7336 15975 7947 -2882 -12076 -25082 -27616 -18105 -7494 2667 9020 12745
22317 12745 -10429 -13319 -4758 7647 16676 2085 10923 11074 18436 24326 12521 22502 39960
22304 39960 28504 8756 7408 18288 24615 13742 9943 11099 6426 -7696 -14515 -763 2738
22291 2738 -3858 -9934 5482 12053 16973 16159 9103 2467 2891 -3762 -28637 -12568 -3456 -4882
22277 -4882 3511 9507 7852 -4073 -6048 -18113 -31002 -8870 12952 11615 30191 31454 17175
22264 17175 5173 3683 7092 -10402 2671 23199 25640 12576 2090 -3394 -24589 -20663 -15063
22251 -15063 -24099 -24773 -13495 -9445 -4162 1752 -8695 -5061 722 5625 6456 8778 4761 18544
22237 18544 20389 1199 -5966 -2785 459 -11373 -13347 -6298 -305 6414 5173 -5420 -7270 -11771
22223 -11771 -13221 -5070 -5508 12265 5694 -7277 -8157 -7181 -6025 7638 5578 5025 -6681 -3895
22209 -3895 -2920 426 7319 772 -15437 -6685 3166 14612 10747 -13830 -25429 -14888 -13429 -3491
22195 -3491 -4694 756 10054 13534 -12543 -39213 -49462 -48998 -39653 -32332 -41104 -27259 -9733 2636
22181 2636 -1606 709 -6226 -14323 -13506 -15270 -11822 -6295 12508 3960 -15276 -13859 -2237 -6347
22167 -6347 -6272 -1472 5794 4160 -22229 -34216 -11777 -12255 -16288 -8427 -7426 -8764 -16860 -10276 -25381
22152 -25381 -22938 -13934 -7346 -9407 7390 4983 -12788 -15467 -4264 -2089 1876 -5465 -2779 -8510
22138 -8510 4355 11022 7502 12221 -3608 -5778 -7826 -8542 -14056 -12785 -4836 6165 -2462 -15262
22124 -15262 -19170 -18424 -14625 201 2828 2939 186 909 11138 6120 -2551 692 -5183 2822 -3419
22109 -3419 -17627 -16256 -9319 2979 1295 10985 13027 8264 8970 6586 -4050 -88 -617 -11191
22095 -11191 -25052 -27545 -42365 -41985 -54192 -46267 -30732 -15729 1210 19669 10194 2429 4565
22082 4565 -3630 -2197 -5455 -840 -1648 -14232 -25252 -9931 5449 5840 8550 19172 24365 6821
22068 6821 -4844 -18159 -11294 -11639 -9697 -5024 -829 8984 -4854 -21936 -32508 -21881 -13468
22055 -13468 -2850 -2238 3014 -1981 -30811 -36549 -26451 -22458 -19643 -16054 -5712 10111 26701
22042 26701 16267 1641 445 -5916 -14325 -19974 -14853 -13807 -18858 -14525 -13771 -840 10351 17028
22028 17028 13985 12915 3029 539 -4192 -2734 -7795 -10037 -2009 9031 16483 3823 -12861 -8804
22014 -8804 -11834 -6324 -910 13866 19734 9305 3538 4794 -3865 -3185 -6694 -9409 -8827 -8932 1245
21999 1245 5886 8149 4170 8179 3194 3629 5591 10576 -6180 -8102 713 -8769 -6613 -19089
21985 -19089 -13608 -10272 -7633 -6889 -9521 -21801 -17978 -12269 -15385 -1976 8711 5881 -6861 -16499
21971 -16499 -13733 -11594 -2208 2331 17190 8908 2676 5845 18911 15439 2040 -1634 -1552 -435
21957 -435 -3109 -4162 5369 5694 6086 16610 13725 16790 9246 -11660 -26373 -1620 11289 11846
21943 11846 16575 2461 -11780 -12337 -25268 -32779 -31598 -18364 -15654 -20862 -12433 -9970 -11968 -14097
21929 -14097 -12299 -15412 -20447 -26807 -20523 -8651 -2196 4606 3382 -6711 -23578 -36323 -31932
21916 -31932 -34879 -26626 -25312 -23483 -17676 -5409 13050 31825 20406 -11295 -10255 3871 -336
21903 -336 -130 -2616 5243 12447 10386 24412 22326 3525 -3607 -430 -5071 -19360 -5430 5454
21889 5454 11680 6261 -13023 -16476 -12426 -15469 -6455 -13414 -12272 -11578 -10145 -3571 3705 9913 -2535
21874 -2535 -14315 -17145 -10560 -3383 -15945 -16901 4721 4878 21296 31319 29590 22579 7096 -3519
21860 -3519 -4878 11088 19680 19019 9474 -4002 -11545 -10229 -3488 -4125 -6435 -2732 698 -9291 -8368
21845 -8368 6285 16579 17795 5064 -18814 -21946 -9689 -2041 -11979 -7868 -5892 -277 -2054
21832 -2054 -1777 16793 28420 13744 16841 25170 28912 25181 11696 13637 -6228 -664 17140
21819 17140 20269 14777 13210 9638 -5416 -3927 1946 6843 8139 9973 22517 18023 6625 -4299
21805 -4299 -16075 -12680 -7063 -11504 -17783 -5811 577 -2078 -6352 -10852 -3443 -2494 247 -13218
21791 -13218 -23558 -19744 -19120 -18629 -3486 -3038 -11268 -14745 -17261 -22248 -23607 -25995 -26647 -25499 -20103
21776 -20103 -17046 -3628 -24147 -23503 -2495 7947 -6765 -20212 -23046 -13694 -4098 14392 10186
21763 10186 -12088 2926 10106 9293 -2397 -3347 -1522 -5991 -5174 -9470 984 4385 6081 12503
21749 12503 2418 -1958 -7687 -15583 -10095 -22684 -15399 3776 2807 -3998 4695 18536 6464
21736 6464 -1400 12239 23603 28432 22587 9882 6502 -6053 -449 12648 25940 28826 24134
21723 24134 18936 19930 13466 4314 -2660 -2497 3119 5426 20554 15315 2057 -12296 -21092 -24742
21709 -24742 -18756 -21635 -27136 -22709 -5232 -8827 -19168 -11202 8888 4914 9235 6799 -8166
21696 -8166 -760 15673 12316 3024 -2329 1109 4458 5286 -10374 -9114 -3353 12293 21489 5173
21682 5173 -3743 -12474 -5306 -3238 9564 19244 15897 818 -9344 -20592 -14689 -8469 5630
21669 5630 14001 12554 5013 -14952 -6735 2948 -5348 -14635 -10177 3929 12231 12637 4953 -887
21655 -887 -21616 -22702 -3133 -975 -20519 -25279 -28344 -29684 -15003 -18670 4986 14911 18673 10369
21641 10369 -4342 -1774 7345 22053 21005 11076 2183 -5298 -15279 -24844 -38856 -37801 -30831 -31979
21627 -31979 -36034 -18073 -11663 -10599 -3436 -3469 -12263 2575 21000 8731 -9739 -14395 -14537 -27543
21613 -27543 -28296 -7600 -14489 -15305 325 5745 -2489 -10565 -11072 -17850 -15118 -7707 -4963 -2294 -12096
21598 -12096 -11015 11398 10449 3821 6358 16724 29357 22860 19341 19729 5517 -4274 11366 14551
21584 14551 14981 17830 3280 -4044 2080 3009 8041 15766 6623 -2723 302 189 3954 832 9989
21569 9989 6211 -903 -12936 -11483 -16069 -15370 -16946 -20593 -17912 -20422 -29651 -14790 -10001 -29855
21555 -29855 -29913 -27244 -31037 -15381 -3180 -4814 8772 4093 -1433 -4887 -16559 -8041 -20092 -22665
21541 -22665 -30734 -23788 -9853 -12277 8613 9665 5038 -2967 10837 9349 2841 4577 3630 13494
21527 13494 15880 17111 3216 6619 -11771 -22660 -25527 -36088 -22346 3102 -1833 -17781 -27855
21514 -27855 -18483 -13369 -9500 -6878 -10600 -7320 -13337 -10183 7082 23598 26846 27532 21355 1829
21500 1829 -9560 -4953 -743 -3291 -15504 -19087 -21480 -32192 -14928 -2364 -11311 -19157 -15274
21487 -15274 -15830 -8820 -11920 -34048 -29783 -10861 -668 -452 6123 15963 7910 8332 4572 -2032
21473 -2032 -14196 -12194 -8941 4668 9246 11772 5191 3180 16854 18055 14957 28957 22863 5323
21459 5323 -7700 -12278 -9610 8969 14119 13317 3839 6639 6714 -10451 -15019 -16727 -17653 -13060 -5850
21444 -5850 234 2210 16850 23780 23167 14370 10538 10192 30821 34061 9262 -1436 11045 7833
21430 7833 1486 -1896 -594 -6923 4362 1984 -3394 -1315 -825 -368 -4863 -24466 -25917 -26769 -41199
21415 -41199 -43387 -16607 616 -2761 -4864 11272 9865 1276 -415 -2294 -6113 -6140 -6420 -5345
21401 -5345 9983 4039 6756 8520 1412 5971 14540 18981 -5605 -26397 -29478 -22276 -33575 -22178
21387 -22178 -28812 -29754 -21666 -7492 -11247 -10266 -9642 1690 -7001 -10472 -5496 -6256 -12170 -2887 2886
21372 2886 -766 -8418 -8695 4810 11086 570 -705 7305 10416 -7558 -4200 7737 17303 4553
21358 4553 973 -12922 -14047 3955 6931 -2235 -1309 9766 4860 -627 -5194 -12277 -21668 -17085
21344 -17085 -8280 8039 7512 -3361 -4327 -19057 -34538 -30948 -7068 -2528 -16148 -15386 -11666 -8863
21330 -8863 -571 10480 27116 16005 1866 2202 5537 19182 30975 33943 28016 12321 822
21317 822 -4818 9677 17776 -1694 -17016 -11317 -13593 -16584 -22059 -8740 -84 -8830 -24652 -17756
21303 -17756 -20469 -1128 10075 20103 17924 5880 10814 9401 -15955 -8081 -3665 -19204 -32967
21290 -32967 -28581 -9237 -8486 -7145 6389 25556 33181 22784 21953 29032 36902 42342 37257 26681
21276 26681 28550 11155 1846 13682 15566 3194 -10919 -12388 6932 19724 32623 27011 22849
21263 22849 11946 12302 11757 7783 -5922 -16816 -15547 3613 3742 -1634 -10274 -20147 -14241 -10853
21249 -10853 -12153 -4737 5930 22743 18179 5941 2854 -10671 -13557 -18459 -13148 1843 15395
21236 15395 27598 28311 33587 35807 32768 9227 -15621 -16895 -1441 4937 5372 7908 -2618 -5265
21222 -5265 -20609 -13998 -4428 -2146 -5840 -3949 -2625 4002 5261 -1874 -8284 1242 3405 -128
21208 -128 -10624 -8291 -6693 -2207 -6437 -7216 3369 -5479 -18326 -20917 -14657 -830 2725 14401
21194 14401 29612 27634 6582 -6065 -1896 3595 4206 17263 9479 -16336 -23873 -23704 -30854 -22317
21180 -22317 -12179 -9544 -4047 -6400 7872 9423 -6109 -12356 13562 30535 36983 33387 16125
21167 16125 9953 -1802 -3376 -7076 -12832 -5600 -19497 -28035 -20402 -24753 -12991 1708 -14596
21154 -14596 -20148 759 10774 5348 -3269 -10086 -14523 -8643 1394 -2682 8347 3554 -19949
21141 -19949 -32440 -27154 -18636 -22225 -16281 -15853 -15932 -4526 1839 -13353 -22806 -9249 -14658 -10549
21127 -10549 -17582 -8324 3803 12090 19362 15710 11543 4547 2855 11159 8503 -4188 -4226 -2615
21113 -2615 -3695 9825 17346 11615 13271 8717 5207 6659 -7997 -10027 -2165 1633 14470 15588
21099 15588 8412 2138 1417 6140 13119 2445 -6772 -4520 -8325 -17806 -11187 0 -8398 -19344
21085 -19344 -9168 -4338 -9287 -2334 -4793 -2594 -631 9434 -226 -1753 13373 9311 -14656
21072 -14656 -18111 -4630 6175 8884 6319 -728 891 1170 -140 -11528 -18127 -4472 -2012 -2801
21058 -2801 -5565 -14984 -12278 -5823 -16665 -14044 -9936 5191 4903 -7581 -10586 -8525 5795 16980
21044 16980 500 -5780 -10191 -2281 6352 4394 6866 10959 6138 -12783 -37190 -32806 -19681
21031 -19681 -10126 -541 -1373 9400 13066 13120 1461 -5052 -11031 -8940 -3676 -5625 -2982 4633 -8223
21016 -8223 -2533 9836 4775 10249 23896 18593 10468 14649 10469 7296 -4281 -10454 -22659 -18952
21002 -18952 -5962 9358 15777 11281 2688 -7200 -5631 1057 -7793 -16193 -3090 9715 3952
20989 3952 -1001 -4964 -16172 -21915 -29879 -34973 -26947 -12340 -11523 -19447 -17984 -22011 -15867 -25293
20975 -25293 -31133 -15423 4222 16139 10416 16439 22027 14190 4072 524 -5097 5983 1135
20962 1135 5229 6883 -5431 -2542 3640 2320 -9522 -9720 -783 -1709 -2923 -700 -3362 -15534
20948 -15534 -24463 -10713 6626 9112 4992 -178 -1862 -219 5805 6754 4732 -4942 -1606 -7431
20934 -7431 -15644 -3012 18793 18897 13607 7365 6704 4622 6300 -3198 3137 5368 3864 177 5417
20919 5417 22770 26804 19072 8120 -4009 7961 7313 687 -1916 -4865 -16594 -9441 1369
20906 1369 14992 25280 19942 11724 2800 -8558 -7486 9262 26358 30530 16866 8176 3098
20893 3098 -11542 3339 1603 12925 20298 8334 -3078 -3454 -10838 -5396 185 13674 20016
20880 20016 8681 -2091 -7158 1083 -1643 2717 11156 -6512 -17755 -1487 -1465 -10641 -13935 801
20866 801 22042 27462 15591 11031 17477 12993 12263 19452 16291 17931 22274 23546 22674 24746 9924
20851 9924 2097 10578 17409 11639 7697 2486 -886 -4113 2441 12863 13488 2540 4716 -8587
20837 -8587 -2250 -4582 -24057 -15335 -7943 -8530 2911 6360 18347 18777 6142 9464 19112 11822
20823 11822 6617 12181 195 -9937 -4345 15808 21077 12642 2926 7896 -3 -10314 -17944
20810 -17944 -24265 -14743 -5206 -10361 -9417 -8788 -15710 -12361 -18013 -21190 -26313 -29372 -28303 -36487 -32077
20795 -32077 -35108 -24371 -14156 -11178 -4067 -11403 676 4341 -2020 4105 12210 10917 7481 4411
20781 4411 -5034 7843 16329 13243 21268 33533 20382 1648 -12775 -138 13187 13225 10618
20768 10618 9891 5554 -3628 -11310 -11742 2468 -671 -8669 -6348 -3438 7509 12588 -5501 -5759
20754 -5759 -2215 3069 -27 -6882 -4008 11416 17521 16563 13865 15522 10594 728 -8135 3229
20740 3229 -3059 -3860 8068 10585 4109 5496 -14028 -19976 -22836 -25892 -23201 -8877 -6240 -14916
20726 -14916 -16360 -9366 -9325 3903 10868 3223 -18072 -17037 -18659 -23653 -22833 -24638 -18011 -11118 -9235
20711 -9235 -17489 -24929 -18161 -3565 13614 20365 8163 7544 14690 -2174 -15750 -275 3487
20698 3487 3138 10177 17188 16815 15353 14749 6964 13174 9171 -860 5966 4035 -8508 -8889 -13749
20683 -13749 -4771 -5013 -6506 14281 33098 37493 25856 8578 -5241 -9478 -3571 3050 -15786
20670 -15786 -13351 -2476 12502 22456 25590 21499 12258 -6539 -18871 -7749 4949 9788 4332
20657 4332 9650 7859 -6763 -4304 -8387 4309 10053 3956 -11572 -14815 -12681 -18047 -20696 -15151
20643 -15151 -4859 -2420 2045 531 11752 5858 3641 7674 5204 -6079 -18742 -13461 -4005
20630 -4005 12210 11148 -4182 -12578 -9820 6526 5637 301 -3752 1477 7818 4586 -6677 -7215
20616 -7215 -1257 -24137 -27673 -18646 -23977 -17092 -13130 -19531 -21904 -23653 -23561 -22099 -27982 -30647 -40423
20601 -40423 -41371 -21592 -7647 -7163 -693 3679 5517 8262 12462 12244 12184 9985 -6364 1065 9140
20586 9140 6541 -12804 -14059 -5367 -9612 -27398 -17020 -5695 -15759 -25730 -40383 -27619 -3695
20573 -3695 -2374 -4599 3577 -592 -12187 -22129 -28326 -27990 -27013 -24513 -15686 -21274 -24467 -18825 -15756
20558 -15756 -10364 -11649 -14681 -6344 256 -222 4875 30289 38548 31107 5783 -1526 2971 -8949
20544 -8949 3295 -4847 -19777 -29898 -34735 -23857 -14057 -3292 -17872 -19149 -2774 6369 -3725
20531 -3725 781 13502 28708 31828 11183 8982 10390 331 977 5489 -16 8460 -7744 -5900
20517 -5900 2644 -1222 -1411 -4298 -5046 8899 4492 -8837 -5880 -5636 5625 9345 16029 21686 10371
20502 10371 495 -1590 1752 6644 5101 -1678 8835 16050 19726 4167 -9333 -18262 -3416
20489 -3416 4493 -3591 4844 17504 1569 -9819 -14452 -5142 -2770 -2208 3663 -3306 -2400 3267
20475 3267 11285 29378 25839 13493 3712 -4707 -8108 -939 -4076 -13957 -14807 -5980 -10549 -1409
20461 -1409 11676 12189 -3281 -11370 -10627 2973 15756 7122 -10460 -16792 -13350 -11008 -1507 -1780
20447 -1780 3710 -6033 -15959 -39284 -41843 -24427 -27094 -17811 -11471 -13146 5046 10321 9539 5034
20433 5034 11407 21757 30252 33477 29681 18036 -12375 -17095 -5127 -6834 -8085 -5401 -1869 -10713
20419 -10713 -19735 -24459 -19721 -11503 3960 12095 4688 6862 15197 18206 21721 13525 16073 10162
20405 10162 -10048 4733 17005 12999 9194 9980 8464 24800 19671 25775 35471 30576 10630
20392 10630 10488 13285 14411 -1006 -12205 -10664 -900 -5460 7201 7191 5341 3048 -6246 12988
20378 12988 20954 16665 5093 12625 20190 2193 -13514 -10198 8529 12866 6644 5014 6544
20365 6544 9703 -719 -4732 -1082 -5073 -1926 5156 14326 15303 -3719 -11252 -15650 -17731 -6172
20351 -6172 10374 8256 -7725 -15832 -8225 6305 -2571 -20192 -14144 6823 13197 5586 3918
20338 3918 23116 16305 5794 -11488 -12592 -8949 -757 -6191 -30520 -25947 4151 2598 4559
20325 4559 1350 -13666 -12937 -1335 -7657 -17174 -10250 -239 2132 502 -23056 -30560 -31192 -34654
20311 -34654 -29542 -21262 -22503 -16993 -4584 11204 27624 23299 18406 9369 14938 16024 2425
20298 2425 15990 29940 40978 35351 25449 11827 9749 4834 6693 5638 17823 16662 10197
20285 10197 11488 725 -18933 -10213 -8850 -11764 -22112 -18106 -4155 3566 -10849 -2588 8079
20272 8079 3041 2750 7283 13404 11847 4219 -253 7471 13409 21001 3564 12957 18171 14705 4747
20257 4747 -1391 -5723 -8401 -13061 -7778 1703 -1108 4403 3100 8518 9634 9647 3565 3409 -1485
20242 -1485 -4997 -1669 4708 8542 5218 3 15960 36090 20464 16967 9056 14463 21949 29682
20228 29682 36070 30538 27209 21892 11578 16051 6948 9878 -5739 -14805 4463 6147 19498
20215 19498 29069 17949 21620 844 3409 607 7712 15238 18671 23547 25079 14929 11562 20093
20201 20093 24070 4651 -9296 -10260 -403 1951 -2689 -5186 -10441 -5852 -9484 -15714 -15299 -10500
20187 -10500 -5923 -13677 -2621 -2640 -1169 8985 14350 -7351 -16752 -7646 6738 17943 17602 15879
20173 15879 22423 20184 34664 36847 28248 28917 21548 11294 13247 8183 1022 -4454 -14074 -11305
20159 -11305 -15695 -2832 9479 3440 -4891 -2536 -6961 -11295 -10378 -12583 -7533 -1484 1077 -1645
20145 -1645 931 5964 12055 488 -1005 -3288 12412 8635 -915 -11020 -23365 -21642 -14194 -12830
20131 -12830 -17123 -14249 -2313 15897 12260 5139 569 10112 18333 -853 -4784 -826 16850
20118 16850 10793 10696 10432 1806 -1182 -9013 -23929 -11731 -12066 -2330 1403 -4326 -4432 -3468 11163
20103 11163 4272 -2967 6976 8335 3528 -6680 -8327 -3619 1966 16543 17155 12782 8047 10417
20089 10417 3711 5623 -2730 622 3709 -3539 5511 -2076 -20528 -19620 -8512 -4690 -5978 -9149
20075 -9149 -11131 -19610 -17445 -2216 -2443 -2103 -7048 -18112 -11378 -13618 -17831 -8970 3223 8375
20061 8375 33504 32547 11526 2621 12012 18801 18342 19067 22484 26557 14199 9902 10591 9517 7482
20046 7482 7516 4539 10717 15663 17000 18608 8697 9079 4681 -538 -7871 -3569 4144 6020 -2828
20031 -2828 -11914 -23487 -32916 -29696 -39559 -20799 -5607 6539 11746 -961 -4618 474 6349
20018 6349 11613 12868 26955 26142 8458 6181 16752 2521 -16881 -14796 -15881 -21902 -11928 -7271
20004 -7271 -6564 5652 -3560 -2451 -12167 -22251 2993 11964 -899 -9463 -11921 -3048 -304 3703
19990 3703 -5538 -11478 -2471 5947 18088 3744 -20186 -20063 -18763 -19328 -12040 3585 2726 9561
19976 9561 -296 -10198 -10034 -2102 3896 1111 3172 -11287 -17692 9016 33086 29847 25487 22776
19962 22776 5804 -9396 -9771 -7333 -8665 -9973 -4705 16579 25581 1297 -6771 -8693 -9082 -1548
19948 -1548 -4167 -346 14106 35392 38289 33297 23450 15175 17686 14504 119 4592 21452 12819
19934 12819 3006 3099 -5257 -14778 -5900 -526 -3418 -7463 116 2275 10866 10616 -9412 -14478 -8672
19919 -8672 -3345 -10904 -7236 -9530 -14670 -4337 6289 6145 2954 -1100 -49 15646 5178 -8625
19905 -8625 -3673 -14474 -10161 -7656 -24640 -29232 -24344 -25995 -26180 -15790 -14601 -3311 -2778 11987
19891 11987 18586 30172 14595 10686 7922 4382 -8212 -3241 5806 9291 -4710 -3941 7203
19878 7203 530 -3253 456 8010 5818 2469 6707 -100 -12871 -5250 16430 15487 7874 8990
19864 8990 13527 12304 1344 -7833 -9843 -8848 -1396 -8221 5140 11839 11408 -5990 -11476 13866
19850 13866 24831 15526 5869 -2119 8602 13684 -404 -3264 -12937 -15322 -2674 -8575 -13493
19837 -13493 -6637 -13548 -5565 10169 12914 16284 15981 5957 -11284 -9088 -7096 -3978 -2344 -248
19823 -248 776 6563 3168 3585 7641 7705 1482 -6345 -1634 -7166 -18301 -14232 -12570 -12710 297
19808 297 -202 1253 16492 11057 14036 24468 33629 45141 42134 34199 19089 1828 -6266 -3368
19794 -3368 -7249 -9729 -4819 8529 29405 16884 -661 3178 10428 27873 29720 20699 8877
19781 8877 13889 22013 11709 -8540 -15614 -8847 3745 10324 12617 11499 11951 19999 21299 16148
19767 16148 16348 18804 10957 -10895 -17551 257 -5303 -5353 5109 12871 12063 18965 29409 31566
19753 31566 22258 18125 3589 9702 6518 11166 10261 6495 6914 7454 11283 16513 25649 21059 16031
19738 16031 13246 16839 28380 32791 18790 10025 -4377 -14318 -12086 -9852 -1048 3051 13040 11128
19724 11128 14596 32021 26808 20125 26402 47689 46136 19980 11651 -1060 -2302 1746 17943
19711 17943 21267 26408 33329 29267 19898 25168 30789 25504 23555 23712 23420 33500 35637 26665 19590
19696 19590 9240 10585 14095 17045 -627 -7241 -2797 -5575 -357 9507 22987 21298 7531
19683 7531 -4278 11859 17544 10168 9930 28975 26190 15757 10246 14038 17637 8490 443 -11282
19669 -11282 -15569 487 1221 -6691 -3700 -3160 -8937 -15220 -9415 -6012 -5143 971 11708 8485 5739
19654 5739 -8314 -28548 -26038 -22351 -21730 -28043 -12036 7422 12961 4433 -4379 -4669 -8721 -10431
19640 -10431 -9130 -5805 3188 10843 13064 26586 33206 22947 8521 5476 24191 16344 -5653
19627 -5653 -10811 -8879 3543 3766 -3081 7819 1839 -11118 -11132 -4762 -2376 10992 30109 32925
19613 32925 27998 18557 220 -13241 -11700 -6795 8736 22902 27740 22941 13122 13674 10783 10591
19599 10591 9206 13911 7373 -5748 -6586 -1219 -12891 -6609 10451 11295 -728 -17603 -28539
19586 -28539 -21651 -15784 -2554 -1570 -3303 4625 22655 34810 38616 34476 26940 17202 15477 13256
19572 13256 -501 -1831 16003 14496 10814 12828 11226 3838 7091 17425 37469 41708 26696
19559 26696 10100 889 300 15918 16540 17907 16903 19051 9094 3070 -4018 68 -5465 -366
19545 -366 -5775 -6748 -9454 -9351 -9795 -17604 -7447 16996 26691 26448 22989 7744 17616 7369 -11460
19530 -11460 -11541 5534 5152 9084 18154 15106 22361 21345 17620 11322 3920 4940 7723 7133 23344
19515 23344 22549 24569 23795 6912 8469 13071 10925 21394 30236 27699 18321 291 -17047 -12875
19501 -12875 5329 3512 12242 34829 28793 10802 17011 21626 33120 34975 14453 -2159 5051
19488 5051 17281 15014 19325 19244 7511 8524 7533 14707 26389 20986 10271 7383 19737 34723
19474 34723 33737 15352 -1433 -7663 18179 21289 16355 -764 11740 25028 32789 13194 -1473
19461 -1473 -12332 -16673 -9688 18551 30294 13766 10223 3501 10933 26841 37002 28497 27950
19448 27950 37713 39541 44092 37109 19032 20058 32310 43767 53127 78366 94136 85311 67048
19435 67048 92758 102172 120353 127572 123488 122480 123117 126465 146506 157154 155636 142452 134057
19422 134057 112902 106742 113903 120727 112938 102639 113934 122039 106576 89433 82341 80253 74142
19409 74142 75771 79523 96295 88778 64853 40426 44107 50328 57299 67871 66221 47820 24816
19396 24816 38761 55956 56385 73130 86348 100615 124801 134846 129460 125127 117220 121237 121817
19383 121817 113469 116157 121562 129532 134817 147591 159608 172479 181326 203016 222645 203572 171240
19370 171240 148241 137520 115459 103079 102008 105013 110302 111394 99782 88944 76145 69872
19358 69872 57857 46948 55634 64786 49699 39159 43739 44202 28618 3155 3674 26170 31129
19345 31129 23947 15869 6665 5653 9472 16144 23328 13211 6025 14947 5632 10056 4537 6432
19331 6432 18752 26976 19694 30904 34089 37691 39952 36739 44013 36403 28260 32938 47485 58346
19317 58346 45346 26121 35492 24339 13747 11327 9183 41832 45072 45780 60864 60186 42390
19304 42390 26247 29332 32019 33810 29562 40620 37893 36818 32818 17604 12723 18536 14726 15833
19290 15833 21681 22170 15240 20519 32627 41459 39961 37845 40696 26613 8282 14565 19172 7286
19276 7286 2464 3459 11356 13830 29661 32905 23175 27807 27691 17638 20817 22231 19865 24122 33063
19261 33063 33384 29770 32064 45286 55933 46672 29401 27169 34655 24530 25089 19972 19902 18864
19247 18864 14020 25155 27275 33486 38263 40081 34455 29109 37994 31166 34610 54044 48055 54367
19233 54367 50976 37153 33652 29160 35303 36387 38585 51508 68524 62727 54464 49787 54770 44999
19219 44999 38560 46760 42862 34704 40343 45935 29346 29643 46052 53038 42825 21192 16683 32005
19205 32005 41244 45825 47338 37297 36555 30160 25868 30927 35451 38733 37133 51160 62921 71564
19191 71564 61948 62223 60075 55797 65440 66610 68961 74833 80922 88362 89927 88128 74528 76626
19177 76626 79762 80584 70454 64459 60189 66062 62513 62681 56907 73255 88068 83875 76807 85105
19163 85105 91058 80405 80454 83323 96741 86913 67926 67363 62509 67898 67340 53158 43031 22618
19149 22618 17141 15446 24643 35162 41944 42809 51176 50093 60015 82443 88814 91563 92257 89456
19135 89456 87644 76190 68499 47164 49191 61244 75034 104554 103418 86125 87805 79009 76506
19122 76506 76743 71514 83945 75383 70502 63685 69836 82630 76803 70595 72695 71283 65460 60648
19108 60648 80968 92326 81658 70952 75728 84283 72156 64049 59177 46359 41498 35261 55298
19095 55298 69020 66424 58804 55589 48959 49771 55998 53321 52265 42675 44107 54599 60622 66610
19081 66610 77709 85296 73358 70427 61218 83593 100557 105461 114860 116837 116991 118957 121437 113313
19067 113313 102947 91054 76962 85692 91698 79947 78785 71384 74767 65647 64417 69887 70175
19054 70175 67844 64494 70897 68270 65255 80110 94196 97793 102935 97239 98570 108893 107509 110892
19040 110892 125440 115448 119733 119540 113241 120359 122065 127269 123296 126344 113047 113866 122810 130526
19026 130526 149263 147464 137351 136644 135397 125600 131648 133539 144419 140041 128626 125452 118070
19013 118070 117747 120644 124100 111721 103537 113278 106830 110617 122291 133068 135218 131435 123447 128928
18999 128928 134316 149171 168521 170225 174520 180579 180400 177425 170946 187162 186923 184016 190489 191139
18985 191139 180596 183427 188775 196297 206932 227174 241850 247276 250605 257289 258876 256231 259755
18972 259755 257118 276250 299875 327761 331812 341573 369281 386627 402738 424112 460315 514261
18960 514261 573010 630390 691012 756800 784379 822345 870749 898124 940430 1007305 1111380
18949 1111380 1240549 1389429 1556777 1716804 1864599 2044774 2257929 2548887 2966121
18940 2966121 3636569 4679494 6384153 8893923 12022911 15554023 19458847 24136694
18932 24136694 27445951 26608893 23958207 20461970 16799048 15122437 16124079 20213888
18924 20213888 27629115 35629115 39356583 38090460 33652732 27728024 22265673 17875696
18916 17875696 14649648 12207006 10162449 8920866 8662165 9348823 10628529 11360417
18908 11360417 10962350 9902213 8333845 6696407 5526296 4796785 4356734 4091520 3944093
18899 3944093 3877666 3904010 4073100 4352812 4739601 5336096 6287022 7889958 10574146
18890 10574146 14302032 17519190 18867119 18972634 18815064 18842945 19042604 19392257 20806722
18881 20806722 24465648 31310035 37427525 39527130 40144816 37575037 32608846 29627054
18873 29627054 29010093 30728953 34177752 34366407 30601761 25506321 19178449 13677073
18865 13677073 10215838 8146810 6818797 5888518 5270377 4940556 4937871 5304027 5764232
18856 5764232 5791815 5391711 4749770 3921419 3191027 2698844 2371818 2136408 1958563 1804153
18846 1804153 1669407 1547234 1429715 1326765 1225247 1126546 1022190 965725 923552 882223
18836 882223 846083 815929 791817 752861 716357 694538 677944 642621 607941 579113 552807
18825 552807 531850 524476 527707 554244 570441 549491 505829 469418 417315 370064 353656 370436
18813 370436 405830 430283 427875 399432 366548 344511 343395 328242 324442 320630 301029 276792
18801 276792 267853 246696 225891 215441 222167 215933 201947 200424 201774 175671 152161 149589 151438
18788 151438 152740 161138 177152 177652 169723 151709 153166 149924 141288 139394 145629 125592 120064 121360
18774 121360 124324 138744 161390 181184 204474 260807 313357 321926 309506 275988 239075 219118
18762 219118 194923 173563 162161 165798 170612 157079 136527 124141 123535 134060 128075 110356
18750 110356 109547 109670 97410 99830 119650 131961 130800 122217 124016 128970 130990 127358 110525 102251
18736 102251 119664 127970 105824 93739 124640 130467 117856 118683 129534 113782 97755 83925
18724 83925 78043 86038 98013 103453 102884 90243 80030 71035 51502 52660 44521 57659 81062
18711 81062 83270 93467 91257 76664 70800 72852 70979 70633 77728 53800 45532 62955 76562
18698 76562 75323 89296 98493 83691 75363 98391 103103 89313 98066 106099 103837 104134 118749
18685 118749 153614 183425 191544 166120 143050 142836 127077 116345 113849 122290 123327 117424 110273
18672 110273 76642 68864 71280 64110 51482 56188 61076 52271 46706 60475 66806 56885 40118
18659 40118 50977 64812 50588 34800 31670 41560 51922 57194 64183 66988 75121 77159 63582
18646 63582 82781 84511 77664 74553 55428 49807 56946 70817 84100 94295 97787 94102 81987
18633 81987 73865 79232 81636 82002 79730 60630 64231 56524 52110 42171 38596 46873 41375 44401
18619 44401 60794 60735 73347 78156 65518 74723 89242 86863 75397 62459 62088 63272 54429 51992
18605 51992 49296 43569 47341 48738 48692 36884 26722 32256 46094 58698 80583 80967 75690 69160
18591 69160 67506 61778 51212 58403 62186 46813 30876 33052 41084 54751 51696 56780 61724
18578 61724 61416 57969 64781 71009 78142 78165 75263 71602 63833 43121 52002 59402 69877 84001
18564 84001 76720 67728 55492 45387 42870 46618 37164 39768 35300 44583 45463 51876 56505 50721
18550 50721 52616 49272 47883 59888 52185 55392 50281 40004 53839 70342 69421 67567 47029
18537 47029 44558 58122 67560 58248 55420 50340 41939 61390 70508 74157 73221 58298 62540 61038
18523 61038 50832 50262 72063 79543 72851 84608 84529 83540 92050 94781 103546 92138 82852 75793
18509 75793 71748 70500 67202 75638 72921 63713 70986 81641 80600 96861 89684 83995 88877 82948
18495 82948 74706 71988 84519 92097 101724 90479 87821 108774 122661 122872 113628 98783 97836 104614
18481 104614 99881 105579 106260 116555 140345 135100 134088 138873 153556 161540 153046 153980 159755 159550
18467 159550 146859 142290 149709 162983 159502 147915 136921 131429 145016 159593 157965 135625
18455 135625 115965 110011 121806 143966 153474 146352 151502 165599 165717 169998 179854 194156 210967
18442 210967 218602 215565 214138 235434 269286 298986 319744 317914 300570 289336 287058 287253 289734
18429 289734 319284 363167 385998 387678 396971 397504 378442 362639 340721 316149 315605 322497 320394
18416 320394 316903 317830 312978 298683 288682 304538 309527 293796 291488 287906 297595 323929 333834
18403 333834 348622 377799 413479 446078 482363 523505 554529 575596 607057 631717 687358
18392 687358 756432 823140 898509 960796 1012298 1058495 1100848 1167966 1282234 1453718 1705436
18381 1705436 2089493 2734709 3739990 5126799 6546341 8078446 10024258 11088255
18373 11088255 10635758 9734392 8506105 7428120 7382147 8690772 11639049 15467861 18217091
18364 18217091 18587899 16680463 13631870 10307399 7662596 6092043 5333365 5186771
18356 5186771 5633433 6637795 7563578 7580614 7010855 6064372 4857139 3919671 3349126
18347 3349126 3022245 2836746 2756839 2731626 2751981 2778733 2824656 2952550 3219013 3681081
18337 3681081 4484569 5709792 6952539 7756254 8530672 9203670 9417427 9656823 10363698
18328 10363698 11936756 15233693 20370456 25274485 29193379 33028031 37491886 42749725
18320 42749725 44836509 41934171 36355112 29139695 22180556 17811624 16144629 16657046
18312 16657046 18639693 20649094 21929235 21507219 19081086 15811984 12453583 9617555
18304 9617555 7585480 6262089 5370170 4742812 4288183 3979605 3776776 3598000 3440643
18295 3440643 3292448 3186414 3120616 3099142 3146413 3273777 3490963 3819565 4339598 5190260
18285 5190260 6604790 8891649 11750275 13599441 13865812 13388429 12488327 12145507 13569483
18276 13569483 17481188 22914331 27232674 29816025 29690281 28014350 26973978 25655983
18268 25655983 22683523 19211167 15494681 11588413 8728829 7064236 6167235 5813439
18260 5813439 5916007 6129988 5898235 5330439 4597329 3757833 3107866 2721963 2494905
18251 2494905 2336842 2217397 2102424 1982737 1881479 1773220 1658124 1576369 1523435 1498030
18241 1498030 1515150 1551109 1578456 1602726 1616188 1655998 1746031 1882252 2105919 2384078 2819055
18230 2819055 3522067 4711463 6720921 9279654 10818700 10857973 10222693 9009125 7964524
18221 7964524 7937533 9194171 12131348 16848866 20703637 20927260 19116200 15937728 12093565
18212 12093565 9480488 8458534 8878956 10561392 12226446 12122007 10894284 9019812
18204 9019812 6722367 4930225 3818112 3141239 2729083 2472557 2294258 2184630 2128935
18195 2128935 2118517 2163119 2276574 2467280 2788791 3375329 4443543 5878002 6732280
18186 6732280 6618088 6057237 5107957 4153737 3626029 3454446 3550805 3904192 4570203 5772961
18176 5772961 7844010 10803306 13979960 17266093 20667721 22295004 21055121 18795172
18168 18795172 15818122 12299846 9464455 7385992 5743429 4539643 3745315 3233072
18160 3233072 2897639 2685692 2572064 2589865 2834861 3375640 4133092 4524722 4329664 3861103
18150 3861103 3154044 2444203 1978453 1702384 1523880 1402606 1321655 1258739 1234785 1238621
18140 1238621 1273555 1352643 1489788 1762399 2273764 3065625 3756519 3894570 3733288 3374847
18130 3374847 2973550 2876806 3240733 4178146 5568106 6408351 6274880 5729416 4799364
18121 4799364 3863090 3388031 3409704 3880239 4569785 5013466 5331110 5863969 7009471
18112 7009471 9951675 16631246 25703291 27515542 24736100 20814958 13877701 8448537
18104 8448537 5640096 4153205 3264027 2666993 2235324 1916413 1664566 1457878 1312377
18095 1312377 1192009 1076782 980593 895223 812784 725579 662014 623652 584162 545436 511888
18084 511888 480203 447725 415492 398830 378103 362831 346140 326965 315312 303310 283894
18073 283894 265111 239379 227858 230500 226059 218770 198469 171480 169825 175433 176490 165522 152140
18060 152140 146857 131684 113275 122884 111297 86957 83988 90801 89634 108068 119169 116175 104498
18047 104498 81983 65399 66117 67626 76230 81224 89346 90228 88633 82843 70848 61539 62473 60654
18033 60654 47698 56251 69172 69742 55713 41450 37513 54814 58595 42238 47809 42840 34921
18020 34921 31375 28686 28038 14626 16694 23186 28009 34420 48246 39713 27371 33569 37145 28246
18006 28246 33118 32489 27018 25126 28425 31148 44554 46003 30336 13517 14909 2397 -10264
17993 -10264 -6298 -7648 -11341 -10091 -25677 -25494 -19260 -18468 -8103 9645 25985 31141 27644 28555
17979 28555 23083 22513 22980 8273 14269 12739 21774 19976 26947 19784 19633 12386 10129 13639 30482
17964 30482 34954 25316 15801 10270 -552 -4530 -6093 -6407 -15593 -27578 -9789 -3170 -3843 -5633
17950 -5633 -10864 -2673 16205 25155 27014 7193 -3698 986 4738 -3535 -9761 -5964 -3315 -790
17936 -790 258 -15615 -22341 -26302 -13077 -522 5349 16 -3749 1597 3856 -13024 -19362 -10107
17922 -10107 5938 7323 4629 11849 13284 12181 -2255 -5365 576 7302 -10481 -22587 -21871 -8381
17908 -8381 5494 23769 13906 6066 -886 -10119 -8012 -11678 -5205 -863 2367 15830 29437 22405
17894 22405 17907 20770 19253 17467 13081 6535 11147 -86 1005 12203 18196 14731 12137 17388
17880 17388 19012 9302 2383 4502 11670 7801 -6261 -12514 323 -599 6663 23129 20730 19030
17866 19030 24331 35345 37763 51720 60216 58980 48925 49068 68235 93497 97557 117179 123271
17853 123271 127996 134578 135025 122246 104846 75408 42698 30737 28812 35827 28533 34769 22413
17840 22413 13663 22320 39040 40224 32754 18858 19197 34866 29140 14738 5881 -640 2178 11788
17826 11788 16928 19550 24688 22463 29531 25299 16073 22264 40105 69212 89199 94763 102785 110242
17812 110242 117745 123237 137388 152143 169088 171781 169111 144444 122399 101329 78860 67833
17800 67833 74489 103122 125382 114434 91356 65820 46671 29829 33610 31686 21134 14239
17788 14239 14656 4902 5436 -464 -12366 7179 10356 11118 5933 8572 15546 16214 17625 23430 29910
17773 29910 47454 37815 35758 62402 88548 99457 101917 86258 75767 71360 72716 82169 67380
17760 67380 35769 17880 26877 33365 32400 23046 35213 60121 73727 63371 54766 33639 19233
17747 19233 17992 16459 16453 3419 1539 -10354 -8895 3632 12785 15782 346 -12427 -12152 1500
17733 1500 -4078 -11274 -4295 -11841 -20304 -20362 -6442 807 7893 19730 44531 36993 29277 29647 14817
17718 14817 10781 36089 58770 65691 52483 38238 40674 36158 25001 25050 41997 46225 26197
17705 26197 20198 13282 3558 5389 7690 1027 -7390 -9254 -12629 -2614 10603 8719 15697 12067
17691 12067 4961 3587 -5098 1087 16539 13283 -10532 -2376 10291 7766 21279 30999 31053 28808
17677 28808 39002 43006 57476 58284 47389 35693 38174 72410 103229 102604 83357 75935 67740
17664 67740 50724 35066 36734 41494 45955 44267 33672 31790 40012 18908 17976 19650 7787
17651 7787 4013 4950 17594 11703 5046 -4510 -6076 340 1653 -1927 -14959 -15172 -12885 -11772 -913
17636 -913 25337 29446 11925 15671 15376 19713 30419 39413 46193 25108 25260 20417 24505 36247
17622 36247 43575 62983 68734 46882 26527 12242 10741 25305 38935 20098 4983 -1840
17610 -1840 -18190 -23248 -13059 421 -1098 -11254 -6220 9894 23820 18290 15469 -6659 -6890
17597 -6890 330 -10335 -16860 -13938 5590 10652 727 -22285 -30199 -24911 -9374 7238 20880
17584 20880 15023 -788 3109 15436 37833 55116 65172 95422 129209 170737 229413 306283
17572 306283 335499 329812 310165 249985 187725 135792 91489 65357 54786 40366 23680 3195
17560 3195 3886 8411 10927 10616 2453 -2801 -7976 -18071 -27371 -16595 -6942 340 -4792 -4434 -11423
17545 -11423 -19176 -5663 -18821 -5719 -1580 -10261 -9435 -553 4389 12715 16727 14685 22543 9022
17531 9022 -6015 -2586 -1554 -1116 -968 -13082 -5476 8794 8533 11272 14570 4768 543 -11150
17517 -11150 -26953 -9817 -8667 -10705 -9411 -5635 -8726 -13411 -28289 -19231 -4572 2059 470
17504 470 -9034 -14424 -7357 -3051 -13248 -24077 -13443 -5056 -1186 8686 -10827 -8089 -303 -12452
17490 -12452 -11005 -873 14240 17573 13915 20548 20654 3107 -20825 -24424 -12960 -3503 -18233
17477 -18233 -28269 -15893 -22722 -34888 -22531 -8573 -1459 -18928 -36052 -41958 -42780 -37319 -36536
17464 -36536 -20372 -15078 -43099 -41467 -33003 -16693 -21847 -16908 -15395 -27314 -35622 -25318 -5476
17451 -5476 15197 20578 11939 13719 20000 17587 46114 102898 124352 116962 99074 70539 42146
17438 42146 22549 18539 7293 -12402 -4830 4092 22798 12322 -1617 85 13141 11002 -374
17425 -374 -2925 -4823 -13943 -11040 -3036 -6651 -6432 -2191 -10466 -15651 -15153 -24560 -27335 -22604 -25184
17410 -25184 -20651 -6304 -8342 -14003 -23783 -3237 19932 22415 28471 26052 27167 31417 19224
17397 19224 21895 18302 18441 27669 25763 29348 26937 24254 10873 3175 -3984 -5025 14559 21913
17383 21913 10070 12656 21118 15987 5900 -4824 -15768 -14672 -12165 -19759 -21123 -21292 -28649 -32241
17369 -32241 -27754 -20450 -12549 -431 -6291 -6704 -7910 10978 13000 -651 -5331 -7204 -9958 -14253
17355 -14253 -14336 -13058 -9497 -13748 -1364 -5304 -3843 12942 3665 -9584 -8530 -16218 -25274 -18496
17341 -18496 -13646 -8129 -7046 -18120 -14698 -1723 -2809 -10248 -16172 -12213 -7175 -4997 858 4160
17327 4160 22024 13470 7587 12837 4294 7092 12047 13149 10636 17166 17529 10197 -3264 -1835
17313 -1835 -3828 7898 -6539 -7638 3242 -3310 12822 28511 17142 2957 6601 991 -14886
17300 -14886 -21055 -11175 90 1477 -2743 -4893 -18981 -28605 -13980 11572 7885 -7699 -23590
17287 -23590 -28340 -15950 1309 1094 -7671 -6207 5361 16254 12062 28326 55689 55889 34148
17274 34148 23803 35005 29427 26416 26651 32941 35911 29247 23277 21065 15097 -6431 -833 10834
17260 10834 1781 11804 21750 4365 4651 13230 4444 5530 -12052 -22038 -18633 -18583 -5928 -7058
17246 -7058 -8908 -3221 1405 -7193 -758 11034 8329 731 11782 14344 13296 -182 -434 -7294
17232 -7294 1242 18341 15205 9026 18960 11831 11193 6211 -18316 -19812 -6350 1942 1872 10344 26460
17217 26460 23048 7316 2895 -4866 -15323 -16828 -3989 9326 -2233 -24655 -31876 2009 -1075
17204 -1075 -13820 -14242 -12026 -26034 -20414 -4366 -2018 -5125 16319 28111 19298 9428 7568 12042
17190 12042 18116 4846 -11094 -6919 -5355 -20680 -32078 -25851 -17654 -13467 -26794 -16265 -12914
17177 -12914 -2812 7419 11265 21796 22406 22464 9813 19613 14745 3382 11344 20209 33234 18234
17163 18234 15948 20884 18747 18665 11219 7514 3470 -4058 3818 8396 -3159 -6045 2665 -5069 -7255
17148 -7255 19245 37687 42771 49877 54846 59663 61899 39675 19897 32079 36258 55704 57499
17135 57499 41218 47574 44094 33348 45295 57381 48489 30348 26167 50445 70385 64597 53589
17122 53589 60138 54230 46998 46981 55835 59365 51831 51662 48336 52070 59191 26913 11027 17323 39915
17107 39915 64629 68985 60260 60279 51606 44146 45508 64974 86932 103238 101347 101977 115822 99486
17093 99486 94478 100137 105421 107680 105240 121409 120077 118269 116310 114544 124731 129312 149686 164991
17079 164991 202102 259378 326209 386479 458644 513747 514799 466292 409133 346080 298668 262740
17067 262740 250607 238213 223794 223252 241235 245112 231564 235007 253131 273627 296925 319052
17055 319052 348130 367031 383249 412649 449694 500737 571044 670711 779444 919976 1044723
17044 1044723 1143870 1226102 1290032 1362506 1458553 1578174 1718222 1901128 2125034 2429076
17034 2429076 2788035 3202031 3762917 4505867 5558080 7177896 9757907 14061658 21259841
17025 21259841 31545071 42765727 55240572 66855881 69716413 67345010 61038353
17018 61038353 48956358 37090414 27305238 19357398 13960124 10594893 8434096 6970363
17010 6970363 5950443 5200512 4626538 4172087 3775803 3409588 3068235 2751260 2463911
17001 2463911 2225572 2047704 1920461 1835863 1776934 1726909 1642102 1549252 1440950 1308157
16991 1308157 1183843 1063003 943559 857020 804458 765138 725089 664828 637361 617836 593741
16980 593741 568288 524791 499396 476921 439594 436914 457712 462817 470423 474674 473034 442494
16968 442494 403761 362758 318635 293959 290033 275439 258466 257869 249127 229752 220167 218447 204569
16955 204569 183432 169081 164612 142031 126350 130817 119649 124152 121624 105516 111409 110062 122579
16942 122579 114040 107379 104586 94232 107856 119720 117610 89976 67778 69360 69179 70436 64871
16929 64871 48795 33180 29649 21393 -531 -789 18726 38356 36470 21185 10969 -1531 -2621
16916 -2621 19899 30161 14077 4974 -6655 -1267 62 7154 5641 3203 5690 18225 18430 -4333
16902 -4333 -9737 -14408 -8196 2898 5136 14254 22195 29160 20730 28957 37291 38271 50910 56299
16888 56299 52415 37155 38358 21852 14821 7560 6305 19442 27140 15202 -10916 -16404 -1068
16875 -1068 14527 24444 29949 9104 169 11036 22106 19787 15844 10127 30259 39072 23318
16862 23318 12137 2956 -3024 11944 29755 27832 12088 -10704 -1687 21825 30245 15053 3643
16849 3643 5347 1895 -2370 -2372 13401 20394 27480 21409 16245 28922 37559 26022 19747 -741
16835 -741 -4523 9230 13962 12902 17649 12782 6563 15954 19676 4347 -3135 17959 20359 11775
16821 11775 2837 -11601 -20401 -7111 -7033 -2825 -12754 -16867 2572 27241 30521 16049 -2130
16808 -2130 4136 -60 -1907 -4665 -16674 -5203 -7384 -17524 -30352 -25210 -5048 5735 -2086
16795 -2086 2912 2375 -7569 -11757 -10043 -15099 -25818 -35047 -36862 -16767 -13732 -19645 -16564 -1774
16781 -1774 845 247 -185 3060 7659 8393 3320 15842 7592 7800 -4445 -33222 -33955 -13540 -13620
16766 -13620 -23892 -16747 -4413 1364 -1550 -13533 -13245 4901 -1605 -1939 -19130 -40644 -29265
16753 -29265 -17020 -25071 -28796 -18350 -8079 -4981 -2458 -8228 -18319 -19513 -27744 -25640 -31279
16740 -31279 -48917 -40264 -28330 -17106 4622 13850 21936 -3385 -10066 791 -1894 5789 -6860
16727 -6860 -16636 -16086 -15886 -19769 -16598 -8277 -17501 -18561 -30454 -24775 -25574 -23965 -23935 -20255 -14703 -8776
16711 -8776 -1790 -7698 -26546 -43075 -52353 -39318 -24532 -35554 -40510 -24170 -20271 -19556 -10891
16698 -10891 -3143 -10098 -7909 -15437 -13198 2037 -8390 -25090 -26731 -20605 -25073 -32509 -34627 -23499
16684 -23499 -10678 -13647 -23616 -25183 -10157 -17880 -27529 -28363 -15489 -76 -6267 -5621 -2236 -6306
16670 -6306 -3688 6438 2439 -5697 -10102 -16937 -26313 -24146 -15194 -20157 -30300 -25335 -29576 -33984
16656 -33984 -31868 -36232 -43952 -32365 -24735 -6025 -4732 -15078 -31434 -38229 -26036 -10048 644
16643 644 -682 12861 12053 6376 8266 -7438 -16958 -17739 -10528 -10660 -15230 -11054 -7740 -2014 5183
16628 5183 4340 4516 4651 6630 -897 -12085 -14191 -12056 -7826 1740 4400 5813 897 1699 6997
16613 6997 12671 14093 5766 -4215 -317 8840 3312 -16817 -2734 -9462 -18968 -1664 4684 3877
16599 3877 7714 24325 20097 4395 7459 1487 -6547 2061 12289 858 -18290 -25724 -15321
16586 -15321 -12268 -6491 -7214 -11644 -10784 -9093 -11567 -8043 17722 18548 1646 16065 26498 28587
16572 28587 6527 378 -7386 -15133 -14165 -31545 -31710 -27197 -23458 -37693 -26993 -18890 -22113 -3690
16558 -3690 -15190 -35275 -28945 -11838 -3838 1608 -5734 -17814 -32452 -32499 -30539 -34964 -17640 -12086
16544 -12086 -20392 -17077 -8715 -18278 -27756 -12327 -1787 -2704 4813 -1439 3217 -7821 -2514 7964
16530 7964 11396 -1925 -13459 -7738 -43 -13368 -30202 -29890 -28962 -31495 -27109 -24571 -26987 -28391
16516 -28391 -27706 -42132 -41978 -33994 -39371 -30915 -33923 -13823 -14039 -23700 -36538 -33247 -12124 -5059
16502 -5059 -4578 -15833 -19855 -19379 -11421 280 -8987 -20537 -35570 -36287 -25708 -21220 -10309 -11804
16488 -11804 -6942 -14544 -17526 2567 20316 20508 12230 1008 -1451 3384 7123 8561 2556 18174
16474 18174 28123 30604 46668 57631 72913 115185 173906 233055 296015 340452 347017 345358
16462 345358 318033 263279 194942 138499 108958 87919 61245 41657 38985 46949 61714 70972
16450 70972 76535 99576 102397 116418 135603 135645 145511 148885 139156 121722 94244 74625 54011
16437 54011 46720 35344 29550 7136 -10853 -10781 7078 20393 12155 5613 846 -383 2130 9676
16423 9676 24728 22369 9652 9800 7662 -4794 -3631 264 -2171 -11069 -8750 -2630 -1250 -7350
16409 -7350 -13390 -16633 -9801 5241 10704 11168 5357 -10489 -20315 -21979 -20409 -8062 -1959 -25887
16395 -25887 -37711 -36968 -28770 -17457 -15926 -21858 -19986 -21264 -27312 -21327 -12855 -14109 -6494 -3827
16381 -3827 -23319 -38872 -30476 -20521 -11958 -24253 -28776 -13286 -7516 -19900 -12875 4553 9781
16368 9781 22440 15694 8059 17320 18547 7449 3722 8077 1750 -1804 -1753 -5532 -959 -8847 -19116
16353 -19116 -26472 -29187 -18533 -11738 -7457 -5234 -10286 -13204 -12490 -7031 -4007 -4519 -9118 -12726 -5856
16338 -5856 -14802 -20202 -23214 -14822 -4241 1735 5894 2108 -20852 -30218 -30011 -28213 -23995 -28379
16324 -28379 -22284 -10279 -10493 -10397 -16190 -16748 -12348 -8068 -9813 -7668 -4934 3301 -2770 3487 5790
16309 5790 8429 4229 -5590 -13257 -19789 -2293 13462 6896 -8948 -7362 -18199 -29619 -36367
16296 -36367 -39337 -38180 -22803 -10631 -23813 -26655 -18899 -1078 -370 -1251 -826 -6214 -21514 -15650
16282 -15650 -13859 -7559 -2492 -6660 -19171 -14505 -3502 6512 5315 10151 4227 -11221 -8871
16269 -8871 -4270 -7221 -2235 961 -12116 -15828 -10577 -6809 -4728 -4116 -5281 -5651 1901 8340 12410
16254 12410 4793 7909 6466 1241 -15578 -24664 -29447 -37263 -23913 -22709 -24765 -19976 -5823 -1645
16240 -1645 -16155 -14990 -14325 539 5204 6664 6058 6100 -6806 -12906 -6669 1528 -6058 -12495 -2816
16225 -2816 -9980 -14650 -13488 -6298 -7208 -3475 11100 3295 -2993 -12385 -28762 -28870 -20651 1805
16211 1805 2218 -3653 -11148 -20519 -14735 -8022 4130 10689 7155 -1764 -9016 -15076 -15903 -27694 -33156
16196 -33156 -35621 -41522 -51225 -43333 -33833 -29854 -34217 -28609 -12781 -14321 -1921 6838 3907 2404
16182 2404 -16448 -20368 -20172 -26980 -27537 -28214 -9076 -5469 -16713 -28578 -10676 -6713 -25490 -34900
16168 -34900 -36344 -15655 -1050 -4006 -8796 -19783 -23416 -26854 -32694 -22072 -3894 2061 -886
16155 -886 -278 -17462 -18392 -13074 -15140 -25240 -19167 -13490 -8001 -7425 -13810 -23892 -39497 -34883 -27117
16140 -27117 -27235 -29835 -20932 -9496 204 -3977 -4109 -971 -8076 -4419 6573 14950 7358 11121
16126 11121 13261 1091 -3272 -9509 -548 -367 -17766 -19726 -19871 -20849 -30312 -17860 -10200 -14548
16112 -14548 -20113 -24557 -24199 -27994 -33896 -18495 -14349 -2897 6901 -1412 -12966 -26114 -14622
16099 -14622 -15195 -28397 -33205 -19894 -4141 -12688 -16201 -11836 -12179 -13653 -19240 -15502 -14444 -20486
16085 -20486 -17720 -25014 -20595 -21889 -19567 -14427 4488 19579 25254 7264 -6235 -4123 7730
16072 7730 5993 -5139 -15115 -6810 4381 -7207 -4650 3739 8943 8548 945 10560 14684 -2288
16058 -2288 -6079 3045 5425 1582 -13205 -14387 -17515 -14450 -7027 9330 -2023 -661 14348 16324
16044 16324 14750 4341 3287 -5215 -8994 -18284 -19504 -26489 -25451 -15199 -20766 -22698 -34752 -34989
16030 -34989 -15566 -19307 -28878 -35046 -31645 -29126 -24901 -14150 -11330 -21074 -30513 -25320 -37467 -40499
16016 -40499 -12933 -6797 -14687 -21744 -13827 13658 18341 9619 6166 -5428 -10257 4674 10045
16003 10045 8357 608 -3979 -17195 -19661 -6983 3204 -1813 12594 10758 7825 -2963 -11074
15990 -11074 -12963 -10654 -5961 -6867 3310 19726 16362 -2475 -14765 -13964 -9336 -12030 -26124 -26852
15976 -26852 -14243 -22843 -19238 -4868 -620 -12319 -14449 -14919 -8719 -21645 -22753 -10511 -10825 -10466
15962 -10466 -21768 -18914 -11499 -13395 3608 3734 -11844 -4434 10483 10134 2192 -1776 -16125 -34857
15948 -34857 -33685 -35111 -23540 -1826 7993 -10398 -31375 -24853 -19963 -14138 63 -479 -15635
15935 -15635 -16922 -12165 -13011 -24645 -17072 -6662 -604 -2413 -1029 -5321 -5568 -8982 -4141 9847
15921 9847 10548 -11286 -18900 -10006 1729 5904 -4403 4372 7874 6176 10162 2729 -3569 -3590 -14753
15906 -14753 -22955 -23611 -38070 -54518 -35310 -7020 21393 27951 17739 10076 8415 -8011 -15061
15893 -15061 -12755 -11762 -2783 -2510 -4945 -5238 -17795 -18136 -17474 -10460 9356 3030 -22008 -22500 -8248
15878 -8248 2577 1068 -988 -13348 -29403 -33471 -22149 -25318 -21406 -18785 694 -665 -11687
15865 -11687 -19383 -27806 -20126 -5030 -9991 -7198 -10875 -3807 5759 5861 7579 -945 2647 1875 -7822
15850 -7822 -10598 5235 3442 11620 20078 -3548 -9891 -10708 -22316 -35451 -33644 -24316 -24679 -19531
15836 -19531 -12549 -8269 455 -9039 -8654 -22188 -30670 -14855 -6494 -7541 -2961 -7844 -6139 -14463
15822 -14463 -28312 -22702 -20542 -19132 -19797 -9567 -3720 1792 1241 -15875 -2177 8269 5287 -11413
15808 -11413 -5179 -2340 -5454 -7503 -18736 -30616 -22982 -15414 -13371 -8555 -14459 -23448 -17130 -21838
15794 -21838 -30709 -33051 -33655 -32939 -34399 -39409 -33965 -18511 -13647 -14922 -21125 -18393 -22485 -27058 -32362
15779 -32362 -31259 -19122 -11782 -20385 -24466 -21444 -8571 -15611 -21575 -8514 9474 6467 -5527
15766 -5527 -10798 -7232 2364 10036 5476 -1676 -4687 9661 12439 -969 -16014 -9568 1324 5732
15752 5732 -1745 -15147 -13484 -5302 -6057 -15046 -24526 -19984 -25710 -25622 -28362 -32488 -19453 -19408 -13485
15737 -13485 -21812 -27784 -22170 -20961 -30069 -13273 -4763 -12786 -25031 -27915 -28525 -20039 -9825 -3196
15723 -3196 6009 8919 9334 10266 -2059 -13756 -1360 2351 9143 14019 -1899 -3420 -3687 -4697
15709 -4697 -9464 4492 1595 -20949 -35196 -32862 -25451 -33597 -32511 -14538 -10729 2259 9016
15696 9016 4500 -1065 -6290 -7619 7756 3309 -14752 -36343 -34209 -27935 -20594 -25693 -17035 -14157
15682 -14157 -24216 -20442 -1786 -9806 -15049 -11835 -13556 -14755 -22476 -21861 -28503 -25931 -22885 -19256
15668 -19256 -24717 -19243 -34049 -22572 -18312 -21820 -2634 9528 4463 -5335 -18840 -24679 -20126
15655 -20126 -7280 13087 23853 26367 12804 -3747 377 3899 -1221 -7691 2184 -419 -3743
15642 -3743 -12489 -2539 -575 -5153 -8679 -8999 -7529 4280 -3755 -7813 -13901 -19421 -4049 -10699
15628 -10699 -14317 -22213 -10282 -12863 -9297 -5897 -519 5675 -17668 -28922 -23307 -9521 -9270 -12696
15614 -12696 -7681 -4946 138 4254 -5866 -7811 -7196 -16526 -4672 -10272 -20867 -23449 -23256 -3563
15600 -3563 -6213 -1849 6704 2084 124 -12648 -22270 -33262 -54856 -38108 -9275 -1730 -15859
15587 -15859 -25911 -22587 -25791 -15034 -5686 -11993 -16722 -1445 3701 1421 -5769 10785 19162
15574 19162 21180 17467 4232 -10358 -11993 -11455 -14040 -17320 -20834 -15440 -12221 -15567 -25337 -25863
15560 -25863 -8803 -24849 -24131 -16626 -15277 -2527 10963 9799 8996 891 -12298 -40095 -33266
15547 -33266 -25751 -15476 -8421 1674 13698 10018 -1890 -18160 -22903 -27134 -23751 -8590 -23826
15534 -23826 -26802 -22643 -17459 -2679 -3283 -9943 -9297 2755 7076 -6430 -6511 -9947 -19123 -19490 -14441
15519 -14441 -2816 -10557 -10786 -12329 5233 6607 -12660 -17084 -13297 -25009 -38513 -37907 -39205 -27962
15505 -27962 -18144 -11406 -7217 -27321 -23779 -16675 425 12655 1536 -6286 -3539 -7321 10296
15492 10296 8017 4522 -5852 3098 9566 5399 -1122 -3764 8124 5831 2352 -18 -8005 -10608
15478 -10608 -7308 -11439 -6520 37 -348 -11947 -13945 -6281 2018 -20957 -26053 -26889 -6957 3323
15464 3323 2844 -9892 -4941 6053 4707 -8239 -21280 -10438 3206 15606 28120 12741 -16877
15451 -16877 -18457 -15347 -5098 -3790 5389 15035 7395 11176 31277 25575 4495 -4126 -7134 -4685
15437 -4685 6778 2812 1076 -4582 -24822 -28775 -17675 -27544 -15184 -1728 -4515 -10773 -20988
15424 -20988 -17963 -11692 -2825 -5056 -10009 5840 4615 7024 7934 2949 -4344 -5080 2663 10377 2622
15409 2622 -15669 -10530 7132 3141 -3733 11774 16076 20327 21587 11672 14337 16718 7968 -4005
15395 -4005 -8535 1212 -1108 -11779 -6401 -2049 -6266 -13937 -12314 -17972 -13655 -21098 -29175 -24354
15381 -24354 -11281 -14211 -15091 -3220 -9735 12031 13666 -5131 -12433 -19567 -13995 -16133 -12379 -5246
15367 -5246 -9297 -12277 -16091 -5235 1550 2439 -4486 -22860 -10623 -1192 9900 10909 9521 758
15353 758 -9182 -18290 1604 18958 20607 13829 -3380 -12989 -16007 -2036 5547 955 -5462 -7871
15339 -7871 8736 15506 19127 10241 12703 4354 -3658 -3018 -16120 -25902 -23897 -19759 -5892 14614
15325 14614 12759 11575 13701 5557 2552 11044 9485 -10437 -24453 -27276 -28094 -10793 660 2883
15311 2883 -4249 -10638 4205 21896 21950 9025 -4178 -7831 1829 16563 12811 -11031 -33433
15298 -33433 -20644 -19385 -12029 -1155 -35 558 -13917 -15188 -13904 -10678 -20611 -25751 -19663 -18118
15284 -18118 -11430 -351 -6798 -14023 -15811 -8138 -269 -6101 -5851 -17199 -29485 -20738 2115 -7385
15270 -7385 -20173 -16312 -10137 -765 189 12646 12077 -7816 -24011 -27734 -7424 13317 9873 9742
15256 9742 2641 -2565 -8787 8503 9438 2157 110 -5044 -7861 -4034 -2252 -8311 -5844 5538
15242 5538 18754 4516 -8991 -15651 -16426 -16212 -9843 -3325 -5580 -2315 3182 766 -18613 -19291
15228 -19291 -17839 -25920 -35978 -30953 -10942 -5366 -6097 -2019 -8358 -20679 -10926 -17967 -23334 -23408
15214 -23408 -8618 -6823 -20218 -20079 -10585 -15163 -13011 3746 9478 -1811 -777 -4173 -13082 -3508
15200 -3508 1097 5555 9864 -7290 -7439 -7666 -10910 -8833 7562 11252 7133 14955 11427 1160
15186 1160 2037 9959 16930 13897 1434 -1406 -18513 -21888 -12845 -820 19462 16247 1475 -1148
15172 -1148 7962 18397 18258 28615 25781 23272 27828 4255 -20813 -24904 -14974 -7390 4607 16284
15158 16284 6253 306 5642 13737 15385 2922 -14074 -19297 -26346 -30118 -16126 -12802 5093
15145 5093 1254 -17037 -35659 -43514 -35843 -32040 -30656 -23719 -6330 -17119 -22950 -17125 -8674 -9360
15131 -9360 -5472 -9081 -20936 -34734 -16090 -10476 -3821 789 196 -1424 -5874 -10173 -3623 -4078
15117 -4078 -7398 -11000 -297 -8820 -15828 -18688 -4563 8161 11430 -1284 -14975 -14322 -23401 -33099
15103 -33099 -26511 -30082 -13007 -9432 -7928 -14812 -13601 -12963 -15261 -24486 -20588 -23010 -19590 -24729
15089 -24729 -38455 -32323 -26752 -27593 -11728 791 -405 -3769 -3125 -3680 5550 -4199 77 1626
15075 1626 -5524 -9510 -11075 -17251 -15613 -25772 -33117 -36822 -29547 -8363 1382 9934 2866 -12514
15061 -12514 -7978 3260 10444 14644 14329 1985 -13098 -15351 -2180 14802 15859 20479 7031
15048 7031 13600 11488 14178 11142 11322 -3725 -11061 -11541 -2187 12327 24620 19714 1682 10342
15034 10342 18988 32927 31372 13964 5030 1163 -2511 -6212 5536 -1644 -10565 -3659 14918
15021 14918 9860 -3194 -9921 1293 889 -9319 -13487 -1769 10332 16331 17004 -2391 -8936
15008 -8936 -11598 -15621 -9949 1646 5205 1725 11282 38790 37026 25184 19487 13482 5797 8016
14994 8016 -4689 -14101 -25501 -31478 -32024 -22967 2816 5497 -2993 -4898 524 -5344 -3124 -3347
14980 -3347 -14565 -6251 317 9211 18644 13199 11552 1707 -10874 -25971 -14302 -13080 -16678 -22226
14966 -22226 -43041 -41834 -23512 -14263 -5959 -10446 -8028 -14474 -26894 -27454 -34606 -21630 -28822 -37159
14952 -37159 -38458 -27690 5356 30878 32127 25353 5254 6242 8705 14593 9954 -2705 -10776
14939 -10776 -17194 -21573 -15356 -26652 -45377 -42232 -22943 -8392 -11303 10215 9515 17487 25594
14926 25594 12300 7478 1836 4778 20001 25581 21054 19294 15957 18088 15263 233 -3240 4666
14912 4666 -3146 595 9501 8745 11480 9870 10270 8061 10995 -663 -9382 -15325 -10591 -7331 -3995
14897 -3995 -2114 -3610 6295 6428 -5142 -18054 -7875 3445 -227 6764 10033 -6346 -11599 -1735
14883 -1735 -4236 -9303 -10321 -12724 -369 -2883 -19079 -29542 1585 10542 18127 3188 7653
14870 7653 5452 -9777 -21357 -23054 -22449 -18411 -12090 -1780 -1551 -17990 -22660 -15412 3075 8556
14856 8556 -8095 -16112 -16071 -844 -3016 916 4661 -14338 -21769 -17721 3236 22939 20071 8476
14842 8476 10765 17447 29515 25561 8059 -16320 -17285 1449 7615 -8573 -38512 -25740 -9372
14829 -9372 -87 -13338 -19664 -10539 2777 -2991 -17150 -11308 3425 12030 8588 -6363 -13210
14816 -13210 -18231 -11140 15049 10863 22880 22114 -3412 -27044 -29999 -16992 -3943 458 7491
14803 7491 1018 -17870 -8984 2131 -6370 -4845 -2660 4949 19902 18518 4978 -2993 -676 -5468
14789 -5468 -6892 -9268 -11652 -27087 -31771 -6223 7513 7601 9472 -9344 -13134 -13670 -18187 -39928
14775 -39928 -35417 -3029 7854 12454 22317 33844 42582 46924 50776 62017 72300 83866 107785
14762 107785 161957 241936 360089 488019 609740 697216 748091 706657 596482 475536
14752 475536 366542 260931 179215 141274 108664 85676 87225 78522 80683 68431 52501 42680
14740 42680 32070 33452 36172 29225 42773 38055 31713 40802 21923 9108 22491 25389 19368
14727 19368 8234 -3109 -7980 -17995 -15110 3034 25601 25178 -2590 -2123 13324 5158 -1074
14714 -1074 1272 240 -1753 12620 11671 14066 19178 23486 14550 24624 28061 25122 26055 15036
14700 15036 -281 -774 -7179 -21100 -26894 -23091 -8282 -12099 -15122 -10534 -18203 -13780 3152 -2032
14686 -2032 -2867 -408 9335 13582 7327 6438 557 4175 2956 -10636 -15954 -2439 -3403 15346 24012
14671 24012 4514 -19165 -49440 -42192 -26903 -13051 -11080 -16594 -15491 -16294 -14401 54 -8183
14658 -8183 -13243 -4996 10118 -6507 -7244 -3673 2765 4467 7950 9370 8405 -13912 -11204 6709
14644 6709 9310 20801 9673 -5192 -7548 -4518 13885 17414 10905 14396 21175 4367 1025
14631 1025 2955 9439 6745 -1266 -12 4300 6549 7160 -9679 -14772 -15732 -7279 3510 21573
14617 21573 29233 23773 4704 6703 -6678 -18092 -9457 7198 2188 3892 6407 5206 2467
14604 2467 -11326 -7848 2408 -13715 -17362 -13413 -8064 -6404 -4118 -2367 -7629 -23626 -37229
14591 -37229 -36196 -26392 -17369 -20735 -28281 -18821 -20405 -22249 -10839 7604 13247 -378 -7861 -1206
14577 -1206 3529 -237 4113 3402 7197 19260 29174 14932 -5555 -20095 -12489 -2861 -14427 -16443
14563 -16443 -14296 -1065 5106 -6295 -16687 -21094 -24812 -24277 -15965 7112 21460 18285 32399
14550 32399 27737 21623 13882 6165 2292 2684 346 871 7401 11656 20094 23302 3790 -1418 -6026
14535 -6026 -8366 -14426 -13897 -20272 -26458 -24760 -20591 1350 9182 17705 6290 -8032 -586 6752
14521 6752 -4744 -5659 11422 15049 12464 20951 13753 13483 8423 22918 33175 18922 1653 -19279
14507 -19279 -28018 -22935 -18198 -14993 -17935 1895 2313 11736 -1990 -20862 -25589 -18384 -15992 -5425
14493 -5425 -1814 -621 -7283 -4502 874 -7133 -12772 -4476 14085 35689 46120 54079 92835 99834
14479 99834 113261 124799 122658 122244 103447 54712 40761 45328 33465 21873 11548 32324
14467 32324 40336 22297 23676 25239 19830 -2073 -14471 4582 20491 24198 21325 6667 4261
14454 4261 3598 16759 22207 18053 13155 6908 11677 12107 13058 20831 20633 19663 27633 35426 43102 45088
14438 45088 55350 69896 76065 83819 100574 123719 157085 224721 331180 482452 633488
14427 633488 750466 832584 810290 696889 556232 419381 306842 237209 194268 151067
14417 151067 121059 93003 77225 76352 76930 72832 57433 54499 58319 58161 54672 37972 24867
14404 24867 20299 3761 4239 16449 23238 19376 30284 30246 17706 6237 8014 17649 32375 36840
14390 36840 13564 10791 17532 8503 7870 6615 -6109 -25390 -32614 -8691 14071 7168 25
14377 25 1274 11701 26882 28231 22423 26004 20493 10633 19268 13397 -8391 -16996 -13284 -8045
14363 -8045 -428 -551 5550 4527 -5377 -5499 624 5848 1637 10386 18286 22515 19306 14160 4424
14348 4424 -20219 -19773 -2000 1297 8574 11894 6155 3560 -5196 -5152 -4176 -10319 -9304 -4454 -10617
14333 -10617 -9629 -127 5256 3551 26246 29681 19955 5117 23289 25451 19032 5917 -2500 -5819
14319 -5819 -6025 -15622 -14969 -8998 -2714 4710 -2472 5578 3269 -11201 -9238 3405 15644 20484
14305 20484 13109 4041 -7503 -6478 3711 11174 28655 113 -6249 10872 23762 16849 10562
14292 10562 19920 19912 29091 23550 13135 15732 24126 20048 34944 22681 11927 16910 17525 6884
14278 6884 -1786 5201 8043 -7277 12322 16717 13817 15792 19560 10322 -474 823 13444 21877
14264 21877 28798 34472 24989 23615 21655 22852 33181 31222 19495 5493 8336 13275 10465 9986
14250 9986 4688 -6069 -9412 5291 9524 15003 22542 26835 20352 15225 30751 51513 31579
14237 31579 21738 38317 45062 40168 29880 25662 29446 28645 27268 29280 17769 12183 24949 35590
14223 35590 26107 23599 11801 14310 17885 17286 18468 26211 32205 23014 21387 11974 6632 17505
14209 17505 21420 21245 44324 63844 73575 87464 107219 107951 118780 123535 110361 85269 76553
14196 76553 88064 84932 76835 46638 28785 39803 40193 40000 38098 23989 29924 25610 29667 40437
14182 40437 50775 59357 55545 50711 40113 26327 4973 -3804 13019 27400 37413 40709 42159
14169 42159 35506 19800 21328 28777 37483 17180 14594 18647 10828 12122 21701 21718 27462 55524
14155 55524 51576 48237 45977 51179 34561 40990 36003 51972 49765 45928 35782 33212 43194 33465
14141 33465 24083 17907 15728 25414 33713 30467 21611 10974 7638 6562 19690 24944 15496 17504
14127 17504 15858 5834 191 10952 8027 4041 5805 -1058 -4968 318 -622 13876 20930 11717
14113 11717 -6800 -3848 4242 9302 12967 15057 13945 8170 1618 -8793 -6065 5920 5954 6915
14099 6915 36220 45349 43073 47454 50549 48775 32776 28396 36502 36556 28127 33622 30651 34808 36374
14084 36374 21823 33270 44419 21876 7491 -3499 -10968 8196 24046 40284 60651 76453
14072 76453 102660 120730 137362 131677 119817 118659 122761 114293 110519 107666 106997 108926 99816 109188
14058 109188 107240 99954 94747 94044 104147 100437 98960 99107 102491 113042 116155 102323 100430 105045
14044 105045 117029 130294 116995 123438 127047 112400 115627 125678 109936 94181 92308 101739
14032 101739 121001 121436 119419 119907 132236 137627 126147 117585 111055 116291 123833 143947 157396
14019 157396 160617 157546 153926 161131 164586 175007 176950 195177 201758 199108 189980 194667 206470
14006 206470 216156 243354 251734 260562 269889 285925 298685 303101 304765 302691 321161 356178 392112
13993 392112 416046 472123 520585 538550 534974 530150 507457 494853 497541 522253 554318 589922
13981 589922 628918 674845 728071 782215 806932 842079 900290 987445 1093422 1216113 1338865
13970 1338865 1477326 1638867 1832914 2048527 2281955 2574658 2937837 3401624 4027465
13961 4027465 4756158 5591248 6535845 7562733 8783758 10295266 12334403 15394980 20129576
13952 20129576 27917904 41564099 65319954 98032699 124710235 143532811 155083617
13945 155083617 142453861 117033285 91179113 64575614 44220443 31843052 24483552
13938 24483552 19841842 16653091 14369948 12706168 11290483 10019268 8917316 7868483
13930 7868483 6886604 6053631 5340249 4772369 4325869 3949378 3634151 3363688 3131042
13921 3131042 2904218 2716624 2554444 2385340 2227280 2089726 1951899 1810203 1703617
13912 1703617 1615687 1550991 1482055 1415740 1360718 1288361 1218582 1139439 1071188 1029590 973674
13901 973674 933202 900614 873230 836565 798353 750677 714544 689574 667469 637601 605248
13890 605248 588024 565587 538478 509926 491917 464636 445417 441743 422734 414015 410746 390168
13878 390168 360730 359280 341819 310649 308940 301705 300027 297768 289341 279153 269898 265132 249854
13865 249854 233041 228498 242303 241367 227273 217169 211077 209859 200219 178343 165971 155637 135380
13852 135380 114621 104256 103540 97076 102834 120974 139931 136933 139318 149300 159617 183016 211922
13839 211922 263556 302070 330524 328434 312001 284790 250449 224579 200705 168267 148356 128728
13827 128728 107507 102226 95016 79723 81549 78312 74220 100342 128378 146347 152104 156680 146814
13814 146814 153301 147058 132566 113935 102121 101638 94635 95495 104097 101638 87152 80231 80760 82284
13800 82284 80783 69269 50366 51717 53667 77128 89057 98837 115413 146234 188897 222694
13788 222694 262089 308908 366623 400872 379883 332382 291679 248716 198123 164127 154218 150084
13776 150084 130908 113892 94407 76724 71900 70627 65382 67642 88979 91075 78732 68733 57980
13763 57980 49206 52940 45592 28949 32007 28929 17175 23990 23784 31632 26267 23930 23110 31536
13749 31536 36329 44498 33607 22532 34506 28169 26474 18868 12133 11360 4693 16583 23188 34212
13735 34212 57907 60977 51965 43853 37294 46397 48768 44541 39602 32797 8969 -9852 3805
13722 3805 29547 28062 26557 24278 18281 4322 903 7335 -5112 -13138 -7851 -5338 -11480 -20574
13708 -20574 -20777 -17568 -15294 -5682 -1937 2457 3855 1210 17171 34883 31436 12463 8071 10632
13694 10632 10562 14112 19168 20205 22686 32078 51620 69205 72160 76127 76177 72780 45240 17879
13680 17879 7141 13229 24132 38806 32677 11245 11264 20084 26294 21079 36846 33897 8509
13667 8509 9230 12070 12225 6448 11497 13516 7397 5262 12801 20458 1975 1636 10746 9673 1529
13652 1529 13828 20940 9609 13305 23721 29197 22065 15568 16777 23156 20863 19920 12579 2828
13638 2828 -1586 -1473 -7165 -13314 -24287 -12986 -11665 -7812 -5101 9942 15028 15098 24315 21486 10447
13623 10447 27947 23009 11305 15332 15959 8718 10290 9380 12582 36778 40124 30205 22309 2031
13609 2031 -6617 8026 9274 4888 18667 11751 8106 14342 14207 31498 34228 28398 32575 23327
13595 23327 13034 9032 5279 7737 21527 22336 25990 28573 23476 17687 13835 19001 37472 26807
13581 26807 27823 39353 30974 35988 42993 35405 29234 10369 13554 16895 18083 12221 1130 -5302
13567 -5302 -312 9355 4826 38 11998 23365 20851 22761 22159 28153 26573 9501 -2194 -4402
13553 -4402 11191 5996 1653 10148 17669 6895 3112 18488 17858 972 -6444 4445 19682
13540 19682 24641 25919 15981 16546 13001 14262 13811 14342 15096 7934 9173 24530 19158 -9076 -15945
13525 -15945 2952 34512 46746 38947 39342 41376 19097 309 -259 886 -14290 -22537 -7254
13512 -7254 21997 9376 -5577 4761 8014 -1035 -14682 -19892 -10141 3777 22042 26028 36111
13499 36111 37987 32492 17817 17624 18300 24040 31645 33381 16274 11300 -3486 -3067 17013 11400
13485 11400 10856 17080 13625 20875 11990 1311 7034 15647 21529 26181 31763 42060 45969 41761
13471 41761 43689 43170 56330 70914 82930 102660 151779 227255 360802 532824 671725 764772
13459 764772 832682 785303 670107 518488 375512 278636 224709 172204 145693 122682 100842
13448 100842 74742 51077 45993 40798 37738 41530 45364 44951 44006 36885 26916 16204 27528 41549
13434 41549 59494 61541 28848 15898 22048 26595 21447 26548 32080 18594 18650 9196 6993 -9105
13420 -9105 -15831 -10102 -7018 -351 4653 16548 13219 6241 13331 18180 17520 14696 -24 -6985
13406 -6985 7085 19039 11165 -1603 41 25447 37790 44323 36647 22332 28229 25286 30515
13393 30515 27617 13274 11930 16164 28955 23972 28916 45771 43891 40232 42715 29686 3985
13380 3985 -5754 4235 -5402 -15905 -8675 -486 6096 11691 9402 -8619 -23294 -19471 -8823 -16497
13366 -16497 -9749 -1993 -805 11194 5279 -1941 19762 25973 22510 21306 12992 13832 20170 5947
13352 5947 -6070 -1024 7602 26623 33030 28586 27360 48869 75440 73905 60166 53143 65343
13339 65343 89799 126140 169083 243805 369556 604614 986584 1378002 1457332 1329740 1094292
13328 1094292 765379 501264 359448 281761 245032 215166 178012 138357 98355 76694 56267
13317 56267 32855 35086 53153 57338 50198 48151 29972 27349 32842 30130 28002 36238 19590
13304 19590 6834 14926 22593 18530 24513 23558 20326 -2609 -6281 3916 9740 18573 25330 16974
13290 16974 13223 15677 19298 7814 2107 12668 29086 28540 16987 24201 7643 -8580 -6379
13277 -6379 4899 5187 4219 13710 22878 52839 56418 55942 35156 29320 41341 51376 66730 76988
13263 76988 55325 28701 20040 25387 35431 29360 490 -7831 -162 6033 3194 5339 12246
13250 12246 32463 51918 46494 50329 53530 56602 57391 42086 45115 46182 48723 52213 40970 34576
13236 34576 35934 21636 10597 26398 22849 27955 30725 35720 51338 49825 38080 43822 55930
13223 55930 67947 82113 86919 86016 69902 58064 52449 48224 35752 26203 21036 20586 23176 17064
13209 17064 18983 23777 28723 31385 35569 37913 30137 11441 12412 10166 8329 1260 4503 11243
13195 11243 4307 13882 29078 32485 20721 11027 19542 36286 24593 21558 22824 33310 33690
13182 33690 27117 25395 23255 10629 5023 9899 12173 15346 23917 37169 38517 45375 30352 12622
13168 12622 11776 20870 7945 1707 3623 2188 10701 4584 3748 21981 39691 27347 27981 49939
13154 49939 62995 65660 68409 74323 90514 124316 182106 205440 190586 138862 128960 139287
13142 139287 146429 130162 104786 85116 72977 64765 63066 48093 52683 47667 51566 64456 64740
13129 64740 70243 73335 61445 51600 61707 79028 75211 54411 45399 52244 54316 49958 57918
13116 57918 60061 46351 60268 66601 56421 54883 53121 47812 30837 16491 1214 -5311 8422
13103 8422 20901 32380 36067 33181 34607 42031 58273 63826 43817 44033 59910 46401 50468
13090 50468 54075 59033 50390 38128 32132 20005 18363 19966 25957 21744 31343 46519 27687
13077 27687 24235 32912 36697 11870 -9316 -11413 -4290 -1786 1663 24825 24167 11248 522
13064 522 11476 17437 25435 28516 18283 8555 16159 20909 32915 32546 11394 -10369 -22966 -33599
13050 -33599 -49987 -36208 -20357 -22109 -8124 25243 69193 69444 73474 87864 76252 51381
13038 51381 45684 45536 37555 36831 44769 53990 49283 57636 47235 44532 32370 21151 15597 5656
13024 5656 -14409 -27031 -15172 2388 23748 60149 118121 158705 178197 206849 238087 260447
13012 260447 284276 281143 276981 257228 221220 181515 171280 161159 169075 175257 179376 183837 173589
12999 173589 179185 190628 201521 196514 188017 179055 183818 184015 186899 189020 202464 214800 209251
12986 209251 220975 229145 246100 275552 297159 324919 378987 476295 629345 729105 732318 697059
12974 697059 607992 511593 442030 397065 353338 322407 301355 301538 293663 284999 269282 269380 281314
12961 281314 280548 291311 289889 274104 287116 296833 296088 312102 320364 323017 320516 310027 296378
12948 296378 325094 367047 389882 397703 409379 419044 408478 396729 408397 442582 469262 494151
12936 494151 536173 578796 583449 562887 553082 565768 617805 661594 705372 763511 824537 890832
12924 890832 961784 1030103 1079199 1127689 1173481 1246280 1368955 1526276 1715237 1891412 2067094
12913 2067094 2283991 2539950 2861366 3233674 3636346 4106584 4653005 5269958 5986049
12904 5986049 6901099 8102516 9717575 11946015 15096553 19439934 25090560 33048849
12896 33048849 45662706 67781930 109980865 184185542 259895160 271894526 247482158
12889 247482158 204341933 139938918 89874854 61972313 46494077 36655551 29771334
12882 29771334 24639743 20571546 17472196 15120812 13251067 11702104 10362652 9215960
12874 9215960 8261499 7460628 6799155 6244204 5768799 5327436 4911365 4551035 4243483
12865 4243483 3996870 3785099 3569015 3370458 3158513 2947060 2769630 2614250 2477057
12856 2477057 2375150 2299811 2233623 2157923 2090030 2033982 1979786 1972237 2066119 2320131 2662653
12845 2662653 2770680 2647771 2399782 2035882 1701983 1471157 1333259 1253029 1179699 1114072
12835 1114072 1066565 1005312 958917 916394 878606 814971 768454 728286 718002 711760 679557
12824 679557 653686 624128 597145 569350 547887 533942 525986 525463 528224 528712 534034 541770 562269
12811 562269 611257 707479 843529 1001395 1066212 1047080 970501 849062 734732 656824 607602
12800 607602 583199 546538 498031 449920 404266 347735 309590 292941 255620 232915 224509 209074
12788 209074 190963 183473 182052 168397 157212 155618 149825 145183 137967 131953 129152 130942 136727
12775 136727 108571 92290 90131 89743 87107 85804 80838 83511 106232 150549 182551 194433 226548
12762 226548 255030 260536 270130 286014 267275 243053 226322 207513 178162 152324 127606 106285
12750 106285 107085 122215 126700 109138 96636 92059 91655 105530 109621 95415 109647 131842 155954
12737 155954 165238 179380 191412 212569 219679 219045 206742 190770 174569 153703 147958 149687 145512
12724 145512 138503 137179 134429 123874 130032 161152 160796 163160 188164 205225 214010 200803 182327
12711 182327 165748 147705 141305 136897 137388 124255 115698 109043 94748 80906 94461 115798 131849
12698 131849 122534 103271 79424 83828 82857 71380 70599 67607 58771 58105 61859 77798 100853 137469
12684 137469 162847 195813 206402 210268 199441 168341 141142 122759 108741 95296 82202 84723
12672 84723 86013 94092 104566 108566 105104 128759 162945 195684 252272 343056 438128 517169
12660 517169 537963 506859 456264 401288 339691 288275 251137 245199 252773 232321 192261 169706
12648 169706 151045 126968 120482 116889 100687 89032 81656 79468 63705 54461 53156 46941 52089
12635 52089 52797 34227 38916 39781 22087 19042 20877 28854 40873 46357 34834 48562 61146
12622 61146 82101 83603 102691 104218 91973 86149 96558 102126 99684 92984 88594 95305 92262
12609 92262 68716 36751 22467 33080 29807 18715 3432 18656 8046 4427 21666 20719
12597 20719 3769 5853 12080 11293 5770 7188 7115 9285 27052 43031 45603 37829 39093 42181
12583 42181 45712 30326 17915 19493 25508 15345 12176 8334 6514 -5282 -10691 -8965 2328
12570 2328 22626 16818 -1281 760 1505 2122 -6652 6282 -391 -13729 -12786 -11477 -7950 1202
12556 1202 17817 8534 6074 7504 7607 19018 20933 11606 -3797 -5326 561 12365 6779 13754
12542 13754 31686 27505 22370 29897 19492 5123 14976 21131 26596 23499 33177 28730 37727 34254
12528 34254 21957 16947 30016 32682 25087 27641 22409 13029 3556 4490 6493 18800 27790 18697
12514 18697 10462 16161 12667 10680 7365 16182 21245 22835 6656 9146 28828 48399 40685 36966
12500 36966 36188 25200 22086 29841 47259 47544 39883 35183 35891 23345 1933 3900 9474 12439
12486 12439 6450 548 -2690 11292 36502 42411 31987 13385 10522 19281 16708 20383 12244
12473 12244 13650 13127 6202 25311 42022 34352 43127 39698 31795 29755 19635 17522 30125 36409
12459 36409 38534 35401 35459 51955 56858 61059 85824 133589 168550 195516 267216 400063 642703
12446 642703 1042398 1399982 1438439 1295366 1050289 731052 494131 344227 256515 211553
12436 211553 194930 161472 126400 98616 80382 75649 82693 74934 63084 55512 42407 22779
12424 22779 18650 14693 10440 957 -1468 -1666 -14438 -17561 -22564 -31330 -2454 10275 6922 4453
12410 4453 7117 5699 4878 20372 10482 3013 3549 756 9372 8297 10102 21978 30283 23088 3444
12395 3444 1599 11030 11276 -553 6665 12581 16884 13078 2840 11758 10623 2592 4586 -4792
12381 -4792 -3119 7243 122 273 6938 7366 6778 1182 7360 16550 5556 -7714 -9515 -9198 -5977
12366 -5977 -12227 -2329 14717 12583 22295 44153 42538 39007 30284 10279 8697 5672 -6043 832
12352 832 6674 16152 17453 11697 10179 15748 15079 15626 23936 18713 14069 860 1888 2049 -4123
12337 -4123 -10804 9723 6157 -659 -4392 -4460 15527 28292 21816 23232 24056 -83 -3496 -7321
12323 -7321 7037 5637 -3150 -2987 -956 -2258 11792 16419 8972 -3713 -9685 -19634 -26006 -14918
12309 -14918 -10106 -6324 -952 8539 37186 43953 57450 48106 22896 17765 9151 -6878 -1673
12296 -1673 5196 10151 22253 26883 20822 21038 14326 -2785 -4888 -645 8770 19396 4860 11127
12282 11127 13586 12930 17215 12657 9312 2535 1290 12610 3808 4139 5254 4804 13308 13116 4764
12267 4764 -7890 -23155 -15744 995 8283 1279 -6787 -10051 -1299 2161 427 -4177 -15233 -9859
12253 -9859 -15054 -24508 -30736 -7171 926 -5253 -698 -12832 -26341 -35184 -32450 -20206 -13332 -11795
12239 -11795 -13402 -15109 -5405 8388 11121 3675 -9471 -14694 -9115 -10543 -13159 -24883 -35244
12226 -35244 -37848 -25155 -9302 265 2777 -49 -11538 -18129 -17249 -12891 -11689 -6319 -11175 -11319
12212 -11319 -5468 7452 21811 27769 29901 24101 17561 16580 7541 2604 5227 10241 -61 3434
12198 3434 16156 12198 4840 5200 -3162 -16359 -21178 -12520 -6641 1587 1157 3424 11531 4526 5852
12183 5852 2028 5864 17293 29228 37104 20149 -18132 -14656 -10221 -16178 -17453 3713 7393
12170 7393 5520 7929 -9430 -14002 -20491 -30997 -24288 -32330 -28936 -39150 -29977 -21093 -26415 -28084
12156 -28084 -26713 -7147 2582 -8906 -10460 -10825 -12733 -10087 2222 10519 2191 -3177 -6561 -9980
12142 -9980 11699 27983 23239 23487 26262 30696 21569 -544 -12607 -3571 -14479 -20889 -3960
12129 -3960 -2382 -13479 -19372 -31942 -39775 -35612 -21630 -12535 -23061 -22135 -34947 -22480 -11109
12116 -11109 -9376 -15919 -15560 -11729 -6959 -16398 -9556 -13333 -29717 -34633 -25353 -5227 -4400 -12538
12102 -12538 -17121 -29718 -38415 -27414 -2331 -1545 -6006 -7756 -11997 -17351 -10478 -8842 -5632 -13507
12088 -13507 -20222 -15910 -22461 -20089 -26213 -34121 -19825 -1710 4061 -7233 -16867 -962 1664
12075 1664 -4463 -20599 -19386 -17050 -9337 -6957 -10887 -4420 -712 20975 23917 16693 8410 948
12061 948 4752 -10765 -13398 -17345 -22217 -9943 -1213 10011 8899 12660 -3273 -9555 -22428 -21567
12047 -21567 -16219 -5713 -10489 -6145 -8486 -4458 -2378 11878 12072 16819 10938 1909 10477 6742
12033 6742 5215 -10180 -9607 -6375 -3251 -5836 -15466 -14206 -3614 3592 -7935 -24315 -9440 5984
12019 5984 -2968 6257 13531 -6307 -14467 -20549 -21143 -16685 -15087 6080 23993 16816 3421 970
12005 970 16113 33193 42278 37312 30141 26072 19250 6351 12274 4450 -4614 -4875 -5311 -9032 10799
11990 10799 14830 5204 -2898 -10341 -15355 -26126 -27483 -9447 -13158 -28707 -25860 -3432 -14493
11977 -14493 -16627 -19811 -23382 -31404 -24477 -5384 2833 1578 -5942 -12913 -10266 988 9215 21790
11963 21790 44473 42067 14794 16543 18900 5996 1458 9425 -4 -7313 -7206 -14412 781 17772
11949 17772 10348 9313 2629 -5079 -12116 -16728 -16931 -7355 -5111 2366 -2840 -1412 -5093 -4346 7057
11934 7057 274 -205 6771 18464 5655 -9437 -3969 9255 -1731 -15203 -6998 4466 5985
11921 5985 -3905 -8715 -8384 -2327 -13749 -20122 -11404 1208 8756 4960 -2024 -398 -1619 10393
11907 10393 5376 -2679 -12498 -16460 -17757 -2229 -2629 -10386 -8521 -6925 -5720 -5565 -6523 -7097 3235
11892 3235 4820 3200 920 -17637 -15415 -13315 1535 4146 9604 6716 -386 -13797 -11278 -11193
11878 -11193 -4975 -6071 -5347 693 -25594 -30321 -8211 448 2689 -1411 5319 9070 6535 3636
11864 3636 14464 5837 -2232 -17568 -8520 -24472 -45863 -25416 -14492 -33403 -36418 -19185 -17306
11851 -17306 -15560 -19894 -11049 3035 -6855 4230 -5356 -12870 -412 10694 8149 12089 30432
11838 30432 22693 22861 37175 45573 11411 -12546 -22074 -6407 4032 11116 9838 -9083 -16951
11825 -16951 -7224 -5282 3581 8036 14303 13522 -1388 -1291 9995 1258 838 792 -2100 5226 7724
11810 7724 5572 7872 1541 -7615 -15041 -24661 -17051 -12917 5312 -6169 -16368 -10606 390 24292
11796 24292 12897 10760 11553 -7741 -7028 -5014 -6846 1570 -1078 -8125 -6319 -11250 -9904 -1999
11782 -1999 -1881 -4252 -17393 -10890 10022 12066 -5766 -15512 -2476 1629 438 -1159 2379 4154
11768 4154 3831 -5221 -628 14231 17970 12078 1206 -6765 -13893 -17613 -23556 -20198 -18896 -18431 -20877
11753 -20877 -6701 3228 -847 7866 2489 7335 31714 42269 35401 32273 26274 12245 25202
11740 25202 30822 31908 32153 22316 12964 15686 14716 -4500 -19035 -18446 -4257 4327 -6326 -14863
11726 -14863 -11688 -18265 -18269 -9803 -4277 -4182 602 6013 -4 -6079 1750 19536 16694 -5425 -6461
11711 -6461 2022 2846 1093 3084 9311 12703 3244 4718 8460 -4576 -13000 -9765 -8660 -349 13809
11696 13809 19056 6313 9006 3900 -4289 9004 10100 8346 -8262 -14581 -25113 -24904 -34114 -29830
11682 -29830 -11758 -6804 -780 -12822 -8644 -1486 -10724 -11522 -7827 541 -1948 820 -2222 -11451
11668 -11451 -8166 -7063 -12477 -13387 -8424 2893 532 -4794 -17128 -19348 -20497 -29359 -27203 -21056
11654 -21056 -8445 -2890 -7539 -9332 -7076 -11753 -12996 -23458 -18589 -5168 -9430 -20408 -24333
11641 -24333 -19873 -2017 18370 18830 8303 -2962 -6031 -14700 -20649 -21776 -23472 -18064 -13694 -3158
11627 -3158 6354 11505 2035 1468 13599 15213 8300 9518 19612 2154 -15957 -10374 -8642 -14518
11613 -14518 -12338 -1497 12539 22527 24421 13671 7976 -403 -8084 -2342 3886 3862 -6909 -17023
11599 -17023 -16530 -20696 -14494 -18599 -30016 -26680 -29267 -31672 -28383 -17232 -12632 -13601 -14060 -4233 -14549
11584 -14549 -9175 -7066 -6482 -4863 -18439 -16122 -23531 -20874 -21296 -11983 232 8520 9189 14126 13031
11569 13031 20617 31999 34111 23810 4940 -8603 -5680 -3033 5410 -15756 -30660 -28341 -24230
11556 -24230 -17616 -7578 -6001 4889 7655 9228 6830 -7961 -8606 -11418 -15892 -16553 -8129 -3115
11542 -3115 -23527 -14332 -5828 -10667 -11439 -3266 -2121 -4034 -4380 -23785 -25930 -15850 -15154 -22074 -23705
11527 -23705 -16689 -17837 -15394 -12566 1432 19779 22961 23442 12473 -6549 -8304 -10593 -1572 -3944
11513 -3944 -14686 -14004 -16267 -14905 -11041 -19283 -9261 -17416 -19473 1944 12606 12234 5389 503
11499 503 6311 -3811 -6318 -11568 -2410 1229 -6351 -4688 -16119 -1977 369 -5564 5490 14626
11485 14626 9482 -7029 3233 11599 -491 -7749 -3209 4750 6558 -4042 -13789 -16496 -10346
11472 -10346 -11381 -18868 -729 14265 7298 -4327 -24589 -10974 2855 13185 4328 -1647 -4917
11459 -4917 -14961 -2235 5964 6891 -3518 -9272 -5796 -2809 -12022 -282 -2958 -9812 -1994 10611
11445 10611 28090 29386 17990 5862 -3630 -18169 -28676 -22995 -22966 -4320 -13246 -26931 -11842
11432 -11842 5623 -6060 -2225 -1978 -14607 -15240 -13978 -13874 -7810 -21384 -18746 -16920 -18690 -23160
11418 -23160 -27648 -18985 -4501 -13054 -15502 -18963 -17929 -12285 -1665 17574 17871 3956 -4367 1243
11404 1243 7220 7224 -697 -5578 -1792 -2147 5338 28361 28722 21705 8760 9386 4540 8382 15818 8563
11388 8563 -6599 -9941 9487 9690 -6544 -32455 -28021 -15439 -8496 -4009 -3372 -1665 -10306 -6314
11374 -6314 3722 8896 171 -4478 -4896 -9784 -16141 -10392 -8659 -16124 -12107 -19099 -14957 -7605 -333
11359 -333 5265 5484 -484 -1082 780 1199 -978 1873 -5704 -5704 -7402 -4333 -6424 -14638 -8177 -10152
11343 -10152 -13566 -11168 9316 11715 15156 18291 8648 13849 8689 -427 -9011 -9957 -11277 -11745 -5372
11328 -5372 686 23737 15031 1134 -17302 -28068 -26004 -11047 -5173 -3505 -17410 -27721 -28295
11315 -28295 -7964 -646 -2990 -1256 11276 9630 19653 20459 19092 19988 17228 -5038 1323 -1086
11301 -1086 -13182 -5703 1785 3482 -4199 1067 5361 7396 -896 3491 14458 11734 -10298 -28036
11287 -28036 -37077 -26125 -3588 -388 5344 9843 -10742 -25218 -35910 -33551 -24124 -12885 -6542
11274 -6542 -4484 -4946 3238 -2607 -12551 -2559 -6860 -3320 -5356 17159 19118 5084 4629 10990 6705
11259 6705 1213 -1551 -3806 -6066 -11079 -4938 -13002 -23538 -23621 -18037 -5080 6631 11360 4840
11245 4840 -2064 -8370 3506 -1272 -9707 -7849 -8527 2740 3477 -13465 -10332 -5571 1624 19592
11231 19592 25215 16928 18880 11906 3600 -9284 -8947 7720 3462 9033 -8152 -23903 -18913 5268
11217 5268 17169 16873 -111 1037 -3131 891 -6992 -21356 -8830 -3545 -257 1552 4525 5460
11203 5460 16294 30282 26720 10304 -12069 -6196 3230 -15966 -32780 -25664 -19080 -9754 -26312
11190 -26312 -25797 -6134 8549 4871 -2580 -1479 8357 6274 -6397 3017 9310 2898 2402 -3675
11176 -3675 -15598 -11207 1990 -3136 4290 279 -5519 -6455 4983 12648 10113 3776 15554 28408
11162 28408 22684 10918 838 -9652 -19659 -13292 -1365 169 -4828 -14889 -34565 -23449
11150 -23449 -24452 -15661 -11323 -21710 -31649 -41120 -34433 -39573 -42170 -32644 -23247 -13510 -14774 -12619
11136 -12619 -19312 -27884 -20484 -10425 -23728 -27743 -13330 -366 -6055 -18890 -17809 258 -4542
11123 -4542 -19258 -10460 -7312 -25688 -26546 -18661 -16082 -12074 -12875 -19679 -14367 -17244 -8419 -11945 -26291
11108 -26291 -34733 -21318 -13805 -21434 -17250 -14353 -309 14101 21520 18679 3685 4421 -597 645
11094 645 7826 2592 -10686 -2691 -1602 3806 -6841 -9238 3064 151 6325 10224 3239 -959
11080 -959 -2818 1332 5667 4157 875 -20387 -30970 -27648 -21409 -3696 -4848 -8664 -17396 -1022
11066 -1022 -1757 -13484 -27529 -38575 -24447 -23860 -12367 1470 1388 -10342 -16863 -18761 -12492 -5709
11052 -5709 9007 9192 10701 12797 -1334 9698 -486 -7368 771 4706 5833 22462 19421 17260
11038 17260 8640 -5908 -11266 1015 -10143 -12214 -18100 -31254 -21738 -18679 -26388 -21028 -17788
11025 -17788 -13023 -21985 -14855 -17587 -5148 8633 21021 9504 6964 10779 969 -9698 -4159
11012 -4159 8529 -8201 -2466 4331 5189 4342 -6738 -21903 -29603 -25599 -17531 -256 27596 44067
10998 44067 37183 26663 30049 27827 13647 16868 20308 11600 11700 1007 -1255 7424 859 3853
10984 3853 -5489 -15658 -21942 -24352 -17995 -5194 -8876 -13079 -16804 -16886 -22417 -19893 -21545 -25237 -31625
10969 -31625 -40603 -34330 -12530 -8188 -6727 -105 -2960 -6976 -5594 -2575 2295 -3224 -12037 -16120
10955 -16120 -5314 -1140 -4993 -7940 -11146 -8132 -3407 -4271 -8233 -13503 -17064 -11158 -8730 -3297
10941 -3297 -4027 -30905 -42552 -29462 -14494 -843 -5260 -5179 937 11750 5966 -156 11573 18270
10927 18270 25708 15913 5065 -7926 -2113 4849 4273 -11034 -11548 -12392 -17379 -16236 -13067 9915
10913 9915 18037 -3965 -7933 -14324 -9053 -1104 2136 2466 -9953 -15067 -8948 -6797 187 -4594
10899 -4594 -18440 -11172 -1406 -4402 -17791 -17780 -8702 -12857 -7803 -1151 8487 7441 3716 1751 -13181
10884 -13181 -30873 -24492 -21224 -25000 -29667 -31919 -30737 -38668 -25205 -1911 -514 -7822 -2666 5770
10870 5770 -17670 -33625 -22713 -3552 -503 7065 13498 -5801 -16928 -30354 -28715 -27531 -6891
10857 -6891 -7101 -15967 -11555 32366 47812 29566 28761 26323 15288 3024 -15948 -15266 -1882 3248
10843 3248 5964 13386 2824 -8074 -22642 -31347 -18508 -6275 3048 5215 -1931 4007 698
10830 698 -15054 -12658 6774 14479 12829 1472 17574 28024 9292 3466 -7250 -3832 8367
10817 8367 11032 4831 3364 9704 4793 -3192 1031 2808 -12093 -10255 7142 5520 11685 15713
10803 15713 10470 -7732 -17229 -20333 -8446 170 6434 -15959 -17554 8458 2848 -8841 -1938
10790 -1938 -4883 -10974 -23787 -24789 -16176 -4799 8734 14275 11634 -3714 -14193 5298 4882
10777 4882 -12338 -9513 -2998 -2178 -6688 -4686 -3778 -10849 -12087 -13401 -20466 -29651 -19507 -19716 -27363
10762 -27363 -17139 -9178 -618 -5662 -14475 -16490 -779 -7731 -7290 -10251 -18296 -11513 -11104 -14295
10748 -14295 -9565 1003 -6129 -14787 -13830 -5008 11670 12739 17300 5396 -717 15364 -2068
10735 -2068 -23416 -27017 -17542 -721 -2723 7920 27535 13951 11347 2762 -8271 -6044 -3249
10722 -3249 -7055 6330 13041 11754 11330 5311 5839 3480 -999 -10635 -12276 7325 -158 -17008
10708 -17008 -22597 -17724 -12040 -5804 -17643 -20195 -11427 -1153 4951 238 -9963 -22077 -21723 -14736
10694 -14736 -1722 -4436 50 3286 -13087 -21681 -21972 -15048 -2264 -4230 -8194 -10025 -10317 -13192
10680 -13192 -12762 -9709 1305 -5866 -15513 -3022 3583 2718 -4927 -5710 -11415 -7613 4666 11959
10666 11959 320 -11249 -6784 9194 2169 -17094 -11875 -2334 3167 7546 13367 10674 3572
10653 3572 -1888 -2955 -16228 -41905 -37538 -23900 -28274 -35680 -23228 -10695 -10148 -17721 -17361 -13979
10639 -13979 -3081 -6368 -1021 11425 14532 11152 52 -8640 3915 12111 6353 2386 7382
10626 7382 19274 18815 13251 8348 801 10461 15445 5843 8110 12616 2642 5433 2829 -7965
10612 -7965 -11470 -6233 14463 26624 24436 26766 36926 39046 32855 34225 34278 34810 32644 29450 24162
10597 24162 15588 6158 5600 14094 15602 17184 14633 17371 34973 22881 8164 14254 5001 -3742
10583 -3742 4731 -375 2723 5015 -1650 11559 26941 29147 33095 28120 12780 -2804 -1849 23561
10569 23561 26081 17706 230 -3543 6407 20774 15527 812 -8228 -4581 -13086 989 -1473
10556 -1473 -2465 3322 -1671 -4544 -5902 -3270 8276 11045 -667 -5794 5919 13041 15425 81
10542 81 -2764 1390 794 -6746 -2379 4772 25628 40940 24382 9168 -457 1658 6478 6679 7227
10527 7227 12419 816 -11316 -13425 -14351 -16093 -32918 -20952 18860 27394 6243 -18342 -26175
10514 -26175 -17341 3676 22966 19927 19185 22584 25392 11533 5577 13654 19886 17159 23235 28722
10500 28722 15264 3440 16 15347 19238 6321 -3654 6817 19870 18219 11254 7846 18781
10487 18781 14555 947 -4651 -992 3188 4885 -2752 2904 11377 28514 35649 27817 26961 27207
10473 27207 14993 5688 2290 2023 -2828 -7599 -3859 10269 4908 3745 -6115 6781 2931 -3918
10459 -3918 -1999 -8869 -26182 -36145 -26375 -16172 4308 2378 -7067 -6140 862 -2721 -6219 6166
10445 6166 18484 30421 22667 18490 24028 30891 30151 25560 10362 19646 26771 22111 12984 14842
10431 14842 15588 6569 300 16618 22300 14373 10837 21594 28722 34051 49617 42997 37982 29397
10417 29397 32863 29276 26169 15753 -5096 -1774 -555 -4441 -1509 3105 5586 13344 17308 3515
10403 3515 -4003 -2661 1208 388 12179 15731 15462 16647 13880 -1913 -5174 -5728 -14974 -5352 -4496
10388 -4496 -10806 11173 23627 22261 23685 18692 12817 -1058 -3517 4708 22479 12683 14714 25012
10374 25012 29882 24580 17484 -290 -4040 -16020 -20225 -3545 24601 29864 21900 13067 17231
10361 17231 39068 46045 37380 25465 10777 10961 27066 40513 48908 44537 39708 47616 47967 54884
10347 54884 45327 48625 34127 25497 27007 20007 14583 3841 856 -112 -3777 328 11024 20793
10333 20793 38101 42936 38338 37403 38289 32762 31689 37338 60905 56137 53077 57798 63950 64495 63934
10318 63934 52800 50666 51403 52453 51298 44789 28815 25962 21458 15694 24474 10995 16635 29521
10304 29521 24873 14798 16111 32427 47898 42365 20543 -2703 -354 5551 14388 21263 10799
10291 10799 13757 20189 30014 31177 30303 37473 36208 44451 50170 67674 71679 64770 47035 32405
10277 32405 24955 19627 12378 10442 7878 -5643 -3187 20942 27546 22965 19509 14992 14459 3601
10263 3601 -6710 -17042 -15021 4073 23969 36880 39854 37392 39670 45788 60167 69000 84080
10250 84080 113589 148155 149972 124888 100665 78982 63782 63061 64534 63997 58256 43969 54485
10237 54485 50819 31049 29106 41481 43527 39837 43456 49347 50833 43197 28612 24610 30650 30897
10223 30897 19103 31659 41710 46158 24764 -2488 1872 12893 20356 33183 38336 26884
10211 26884 18723 677 -2941 -11484 -1288 3328 -2265 -8536 -19252 -16955 -4851 9061 25838
10198 25838 35018 24342 25479 36664 27359 27952 33170 25848 10852 17340 29451 30371 34095 29707
10184 29707 34654 25080 23753 28946 24147 25824 22897 31159 17680 6868 11894 11433 10886 18307
10170 18307 25331 25491 12930 16386 18051 19296 28087 19176 10882 11904 8878 12678 6110 2806
10156 2806 2226 9894 1943 11374 13625 27101 33049 33751 35955 45462 36630 37918 29028 12325 22191
10141 22191 37759 50334 39178 21088 26462 40749 48912 55822 57693 55168 46595 37708 36313
10128 36313 41796 35753 25974 18266 25828 34689 31903 18678 11256 16382 15902 11309 2805 -15206
10114 -15206 -5038 6088 1637 1637 12656 10615 5069 15571 29952 36331 19092 -1491 -9320
10101 -9320 3077 6136 16744 16888 39818 45248 21364 14148 15855 7575 12760 4784 3679 11983
10087 11983 21035 33395 37333 31720 47797 46229 19363 7498 19226 28032 31312 35849 25356
10074 25356 18364 24671 31126 20029 31505 22616 3184 12520 15313 26035 42425 40000 26457
10061 26457 25314 26524 10397 13044 32943 45440 28637 10044 1451 -1991 12618 38552 56234
10048 56234 61997 56323 36793 40117 26465 31889 35478 20767 27859 50066 51292 40764 37092
10035 37092 24535 22205 21520 31886 21100 15045 23927 26449 18208 13317 8874 8047 17245 24144
10021 24144 13317 21539 22754 21257 15755 30438 34221 33652 36000 28623 20434 19844 14350 15003 5917
10006 5917 -404 11831 25444 36838 33628 29604 29202 38065 31250 20391 14185 -7160 3281
9993 3281 21402 41889 44367 27624 10844 -3365 -9565 42 18955 38846 59042 44905 43653
9980 43653 56440 47843 41058 49050 39238 34397 37702 54186 75911 71913 74978 73767 75874 78967
9966 78967 100251 127723 154661 235784 364522 576180 916563 1254477 1384862 1298350 1072101
9955 1072101 790191 535391 357474 257874 207394 173140 149979 132229 120596 119151 108324
9944 108324 86764 60462 56924 79410 76514 57790 57850 51603 57739 54315 55155 47187 45668 49297
9930 49297 34463 34352 36182 48800 81530 95250 106890 96177 72683 52974 37445 23420
9918 23420 11331 21578 30361 13269 1084 10935 10313 11266 2994 -2535 7006 8852 15974 27340
9904 27340 34616 35785 26534 20514 17076 24700 39380 19120 20390 30380 28088 18749 25295 36208
9890 36208 43057 53451 59557 53867 38320 29062 34211 43854 33478 19847 17516 19361 22704 14226
9876 14226 8415 21130 17264 39839 39198 46797 44728 47521 46454 45866 43500 39606 39405 38434 43593
9861 43593 60971 62581 60417 56780 48370 40328 41045 34606 34639 23041 22179 31246 41513 50479 52054
9846 52054 44681 33503 31274 24018 24678 14126 14839 15052 17915 34484 49449 55224 56549 41531
9832 41531 36033 39784 26122 11775 6754 19991 30862 36924 49354 57959 63481 63607 69143 66875
9818 66875 58996 54572 56035 56065 64063 54092 38039 27649 16156 26794 48091 40432 43395 46845
9804 46845 48336 38294 40513 888 -1857 12133 4356 761 16291 28583 31742 28706 17148
9791 17148 13314 16142 37207 40547 32242 21908 20613 19973 16322 17902 10110 8239 31863 31244
9777 31244 18535 19527 7019 6725 6191 116 -13944 -12969 3260 13033 15856 14959 9479 9711 21899
9762 21899 28988 26673 23966 33758 36764 37731 47701 55294 49542 56019 35557 19042 12520 24751
9748 24751 37879 52863 27828 -2439 1499 12193 14832 18893 20962 35921 35055 31859 35553
9735 35553 27046 22127 15528 19177 39511 61067 70412 65801 66207 79684 100371 108685 96634 67828
9721 67828 52117 50423 55243 49841 41962 34713 25251 21174 38677 41779 34662 29589 40286 54015
9707 54015 47147 28480 23360 17306 7437 10151 26247 18608 2451 3724 13310 12326 12498 -2506
9693 -2506 10843 29199 42807 43266 31043 16369 -589 17910 30039 37158 49023 44839 24860
9680 24860 17732 21511 16287 17258 32099 30561 16301 14136 23446 22816 26501 33728 24435 13962
9666 13962 9596 -4945 -3219 14431 32973 37479 29151 31191 26524 25093 32033 41062 39733 44278
9652 44278 44127 44693 42948 50761 47570 44886 43688 39308 34496 46367 53221 48757 29456 21069 16590
9637 16590 15217 21531 24976 16811 19378 15761 12948 24534 14044 3147 2458 16389 17837 3013
9623 3013 18597 33578 31425 10131 2312 2003 -10919 -146 18657 24472 21183 24406 19036 22938
9609 22938 20381 24761 36586 34192 32958 33332 26426 28146 33402 27438 18019 17784 33439 31076 25598
9594 25598 23348 35692 36654 9964 7092 27232 30300 26927 27374 32634 37864 37047 44758 55162
9580 55162 48984 51524 63985 62527 53864 50002 32724 26945 26268 3617 -2937 15995 28787 29136
9566 29136 29155 20498 11513 23374 28745 17209 14522 11794 13255 8740 25232 20918 17281 19919
9552 19919 11365 7945 10655 11387 25557 34864 36106 14913 -4437 731 -1944 -5247 -9510 -9522 -8633
9537 -8633 15536 6819 9576 7624 11763 10269 21211 30359 38517 37714 32401 25333 16828 14789 11164
9522 11164 23425 19521 23556 30626 16079 24096 23506 22998 16871 11053 -3062 -3652 9885 21269
9508 21269 44334 43028 25990 33287 39610 34361 28258 27224 14143 12708 15536 2270 2571 -1577
9494 -1577 -6993 -4630 -9223 -1469 -1716 -11714 -12800 -6029 -5670 -6889 534 -1721 1839 14384 11992
9479 11992 13471 2704 -5394 -3247 -8608 -21123 -7873 17903 21000 16820 56 -2679 8437
9466 8437 22843 14783 12828 22336 11851 5827 5165 10105 26544 16956 14533 4648 3596 15566
9452 15566 21201 12043 -5468 1419 9306 10991 29904 40106 23685 -8573 -3101 -2133 3501 9952
9438 9952 4214 -5194 -1266 13444 20422 19245 33537 20449 -4508 2760 9475 3920 -5974 -1304
9424 -1304 6159 21234 28157 19001 778 -6772 -15090 -8972 -1068 15749 19013 24031 14662 14454
9410 14454 21255 16542 11153 3464 2302 8900 18268 24017 25103 12509 3686 3377 -1812 26 -97
9395 -97 16787 25804 21970 20244 11200 15510 14422 21688 23072 19676 -140 -7112 2098 5364 28088
9380 28088 30739 26765 26339 11995 2598 1934 10638 4194 9648 12466 11409 5430 1179 -7055 2487
9365 2487 -877 14414 8986 18114 30254 16013 15123 -1097 -7108 -3186 397 -4661 -18939 -18652
9351 -18652 -8734 13340 23668 38253 31307 16298 23259 23992 11633 -3377 -5236 -4212 -2474
9338 -2474 -44 -3613 -2526 10396 25196 22384 15588 14022 17166 9603 4124 1412 -10512 -5545
9324 -5545 -7459 -1777 5071 11915 19857 19455 22008 27433 34656 44258 40974 29686 15278 784
9310 784 16170 17830 3664 4485 -7307 -7439 191 -3372 6259 33590 27924 5093 5845 1755 -7173
9295 -7173 -6870 792 12260 9579 10610 8132 14269 11817 14733 15330 4559 3061 -1026 3963 -4087
9280 -4087 1948 12487 15239 10483 7031 5940 -3829 -11631 4941 30502 35726 21286 25531 16611
9266 16611 5609 -2760 -2201 -2004 -3902 -17177 -17372 718 151 -4677 -376 -16144 -9909 -4944 -6278
9251 -6278 2113 12947 14395 14762 5174 5051 2856 9033 16759 19413 22766 20032 22788 19585 18539
9236 18539 16815 10350 5042 -10278 -11186 -10498 -23053 -18571 -5229 -8560 1446 15224 11755 18660
9222 18660 24671 16061 14037 23377 15793 11686 6914 13099 29300 19819 12126 11630 -9366 -10329 -3476
9207 -3476 -2801 3289 11931 11402 14796 519 -6363 -17761 -6718 3981 -500 -3309 -4439 -9689
9193 -9689 5298 5830 -545 9096 -1286 -9618 4669 12577 9076 15891 9821 2529 6648 10873
9179 10873 8776 19594 27898 14726 10190 4075 -7098 -9075 -6005 -1385 -11934 1043 23823
9166 23823 31012 27886 14131 -7972 -13964 -959 -14475 -25589 -21326 -25986 -2998 11393 8410
9153 8410 1947 -4664 5364 16715 19545 11368 4763 1884 -2916 7 3691 470 18829 27405
9139 27405 16271 -7952 -13647 -10299 -12324 -10901 -451 3318 16064 17328 14828 22782 21892 22456
9125 22456 27926 12781 -3577 -15333 -16600 -6379 -4882 -6175 -7752 -2073 -4796 -16292 -4721
9112 -4721 -790 5577 15677 15544 10937 8770 25531 36774 18986 18172 29356 24512 8212 2709
9098 2709 6975 9790 18996 17179 178 6537 19478 14008 -944 5521 17820 19611 15798 4713
9084 4713 2617 12333 -9171 -21659 -20530 -3371 4830 9630 17462 20548 16988 18891 34794 31552
9070 31552 17395 5479 -560 4158 9461 274 1067 6387 9287 9300 8383 15555 31725 33962 40740
9055 40740 32215 21169 11598 12938 32 -10107 -7081 17713 33163 37094 33878 21144 10728
9042 10728 -3415 2722 17 7644 11732 2329 -4458 -7715 21758 20915 18806 19491 31849 40509
9028 40509 28859 12928 5492 -7525 -8635 -10302 9116 23568 22731 18964 9829 -5413 -16258
9015 -16258 -23662 -20893 -10043 -19251 -26651 -17621 -4789 -8027 -22290 -12396 8168 8762 6794 2275
9001 2275 -8025 -4386 -2375 8758 23350 38054 31932 10846 1984 10664 13048 15245 1308
8988 1308 -10688 -2721 -961 13254 11771 17306 13858 -7217 -2042 11934 -1956 -15366 -7848
8975 -7848 945 5470 10954 9849 13892 7291 5422 13215 22166 6767 3905 -2812 -18575 -21781
8961 -21781 -18046 -3941 1773 2251 3264 -6613 -5829 -9494 571 4780 4391 -221 7090 18594 19931
8946 19931 24686 16562 7451 -6578 -25240 -28956 -15486 -25563 -22511 -4911 8223 11624 17216
8933 17216 4607 6505 16168 16899 6601 -8946 -7854 -2462 -12366 -16253 -2507 12695 13363 13608
8919 13608 18244 11445 -4221 -18590 -16721 -2596 -15212 -24907 -18338 -14927 -3451 308 10154
8906 10154 18847 10177 8163 10360 8136 11367 17126 10265 1453 11095 11544 4722 1969 981 7174
8891 7174 16971 16138 15327 18209 13022 16819 14113 17687 6 -28 8663 32285 50801 61464 99461
8876 99461 132505 151097 149907 128595 103962 80775 51127 39982 41864 41953 42626 36657 42389 29317
8862 29317 21567 24602 27274 21594 25476 27006 21166 33181 22697 16152 13553 4129 11515 6348
8848 6348 -1161 1114 3529 -3670 -12758 -11324 -8585 3911 -1421 -10845 -7746 -26857 -21959 -2442
8834 -2442 -2169 2854 -48 4276 -16402 -21921 -14908 -6983 -949 968 -1912 240 -7020 4312 -2644
8819 -2644 -811 4300 10513 5082 -1331 -3199 6598 11656 7405 7085 5299 -1788 2518 11170 9870
8804 9870 18125 6853 -20915 -11318 13205 14444 20209 9478 10988 10341 8205 4758 11047 12511
8790 12511 7069 2798 8324 6921 15495 26166 37644 17788 5890 9610 15228 18541 15777 9928
8776 9928 13128 15484 6944 392 -529 -5286 -4736 6907 2009 11749 10239 10828 14434 -431 -4058
8761 -4058 8942 15656 22531 19971 8939 1054 8665 13956 20901 28180 21471 7369 10973 13008
8747 13008 17363 9414 8864 33194 36168 22137 16650 25858 30245 38413 26517 27551 22514 22100
8733 22100 22349 14881 25552 29136 14904 15088 32419 40209 33849 17333 8356 6939 22254 37765
8719 37765 24313 14697 15320 22986 21417 5426 5000 26158 35747 30027 21586 19490 12189 12690 20345
8704 20345 33378 30309 28930 32482 26304 43862 55935 57356 54824 63251 75286 77538 76621 68890
8690 68890 61727 41135 41171 48866 62377 69807 63117 67529 70990 57896 67221 60845 44266 40079
8676 40079 51564 53953 43522 53826 62412 61984 61432 66947 82891 91394 87972 89317 86479 96158
8662 96158 106793 99007 87108 92422 97130 88913 83293 85166 93014 113911 133432 122856 109647
8649 109647 102291 88032 90211 84453 79329 75002 101614 118726 125902 125218 145354 160877 180088
8636 180088 202967 224338 230619 242027 249607 264435 271817 288183 292090 307714 324601 320871 304518
8623 304518 311041 318369 306169 290417 283495 269398 280412 285084 257489 232745 228141 224208 220393
8610 220393 212162 214939 216854 221398 219019 216561 207224 194783 181574 165921 161155 149821 136496
8597 136496 121127 102512 92722 80141 61983 59802 58700 62356 68388 71099 60863 55667 42962
8584 42962 41172 48520 50277 54470 56705 56058 58253 63349 75209 73751 66522 54515 65516 64876
8570 64876 46532 45073 67034 68261 53416 37960 31755 35132 15588 8684 6612 14299 20343
8557 20343 11210 5670 -2862 -663 -842 3187 8661 6802 12771 13005 16017 27501 33843 31781 43086
8542 43086 58831 48220 43249 47717 35654 31414 9054 -6125 -14303 -19451 -30559 -26193 3663
8529 3663 4587 362 -14375 -25463 -28268 -12404 -13678 -19128 -6677 4366 26261 27599 13110
8516 13110 12780 -180 182 -2012 -8880 -9842 -4026 -16060 -20309 -12835 -2402 2450 2119 -7122 -12034
8501 -12034 -10037 -5363 13072 12279 14791 23908 34387 28088 10588 11731 18056 11160 409 10021
8487 10021 16263 20485 27699 28425 25247 12832 -11440 -5214 742 12458 17026 15952 -3455 -13515
8473 -13515 -3091 5148 5355 19080 32260 30796 31924 28846 21534 18560 36170 35893 40273 34383
8459 34383 33281 33808 18338 10077 8995 5869 5516 10139 28928 36316 53749 46025 41358 41059 27694
8444 27694 22797 29171 40096 28140 21806 26490 27419 30605 17574 161 8497 11050 11750 18517
8430 18517 27491 21024 13912 9167 9598 7550 2453 -6595 -1090 2932 5421 -2713 -10954 -10514 -15188
8415 -15188 -6384 15619 23962 23639 2581 -9644 -5610 -10839 -57 8698 16297 21931 28911 29249
8401 29249 25445 18729 17437 23277 26049 16594 23786 27408 22017 28933 29494 30747 25894 20580 27635
8386 27635 28468 21410 19926 26014 25158 10507 1660 -678 1275 16310 19001 14634 15921 18221 17401
8371 17401 13222 1311 -1130 -4728 2752 -1234 -9174 7663 12108 4394 1596 24244 43248 44298
8357 44298 42254 40882 41377 24624 2631 1107 8338 17493 3952 6681 12448 11272 30789 26900
8343 26900 28225 29758 22616 23137 22112 37212 37136 21282 19788 12986 6912 998 -1367 -10012 -3089
8328 -3089 -2764 -15850 -10419 -14441 -16202 -9887 1644 7394 1952 -782 9753 16126 14420 -12239
8314 -12239 -6611 -9451 -11137 -1477 6917 -6291 -12122 -14852 -20745 -7857 -9748 -8941 -20698 -14671
8300 -14671 -3215 6047 1441 -3738 9127 18676 20225 23080 24951 16785 11193 7821 16674 13283
8286 13283 -67 -15785 -20372 -16388 -8038 -11082 -18088 -2744 9056 13463 14782 5383 8978 16914
8272 16914 20108 23677 19325 19565 36444 41408 42362 15447 8254 2018 1372 14996 1291 5504
8258 5504 13120 8030 13346 -542 -4025 11123 15064 14832 9621 20450 23997 15262 14214 14082 8995
8243 8995 -7454 4247 2514 16441 12749 6126 2685 4112 7012 -11711 -7614 8966 16228 19856
8229 19856 25409 17157 16829 15727 7388 14185 19198 9344 8540 2229 1054 -3461 -20265 -5441 1345
8214 1345 -1558 -194 8491 10928 11463 11457 16723 2478 1531 -1603 -2046 -7537 -5066 -14501 -17569 -17545 -18169
8197 -18169 -11764 -10727 -22194 -24684 1314 14815 25007 30582 26891 20269 21298 10000 16308
8184 16308 23688 18922 18458 14433 21181 26685 29810 24769 13072 7295 -892 1179 -2790 16227
8170 16227 42041 69699 77379 71266 56195 28319 9307 -5663 6787 17829 11222 9071 20826
8157 20826 31978 33720 16744 29920 44045 33791 29640 24352 -534 -288 18333 22007 6182
8144 6182 -9352 -1129 19339 21758 19855 12514 8458 18340 32416 40247 29591 8196 -7369
8131 -7369 8631 24863 52200 64869 63292 61962 64102 59817 43159 22907 9791 17476 6472
8118 6472 634 -1300 -4291 1994 7318 -5596 3538 18905 23739 -3961 -5186 7383 7506 -5018
8104 -5018 -18584 -12932 -4023 9802 14315 21767 19217 12590 17738 12119 -2102 208 -5775 -4926
8090 -4926 -8752 -2892 6648 5022 7815 8289 14729 20996 19099 18091 21953 16744 21920 33008 37322
8075 37322 46437 55936 50245 36313 31015 20651 13823 9407 18458 40213 51344 52521 64966
8062 64966 78668 85095 100154 112579 126699 144115 138522 112905 98838 107170 116100 122495 149408
8049 149408 157134 149404 143548 139815 138121 133328 132980 107159 80298 65049 56297 50969 53403 73295
8035 73295 85853 89764 82705 80926 74136 90444 105513 98443 89963 104405 105567 92724 108839
8022 108839 150514 173166 216669 293943 378155 450607 462510 449852 404156 341760 305352 281469
8010 281469 244234 220142 220601 237224 275123 336042 361121 354115 319202 270659 210027 174679
7998 174679 140734 102385 98098 91238 76930 82499 84433 68705 57868 63096 65141 65282 91865
7985 91865 92902 101014 112784 116274 134520 138927 128478 133104 162448 211198 242034 266896 299538
7972 299538 328606 342852 328453 294553 271739 255227 230869 235159 264390 290783 307882 309184
7960 309184 274859 242918 203132 168446 152327 144590 127350 105796 87797 65849 58633 58127
7948 58127 48955 31929 36452 37202 52103 60173 47011 22642 37977 69026 66183 58680 46301
7935 46301 55718 65659 74286 87236 109450 121481 137429 134241 109453 84500 70679 69264 64897
7922 64897 70613 82021 93992 73834 62345 51879 48909 42334 32328 31308 38910 33956 33508
7909 33508 11649 -14375 -8663 3704 -4047 -7882 -4120 2499 9144 14080 13817 10557 5281 9120
7895 9120 -9113 -9997 -5279 -18652 -13934 -9569 -12306 -438 6718 18889 19892 7784 -9116 -11176
7881 -11176 -13811 -25969 -27695 -32471 -24755 -22637 -31484 -14289 -16849 -25319 -25029 -17498 -28680 -46106
7867 -46106 -33663 -20163 -5579 -15910 -34552 -16769 7873 -3422 -417 962 -9838 -26728
7855 -26728 -40962 -30484 -26974 -22352 -19317 5738 879 -7476 -15692 -12241 -14476 -8335 -11804 -2746
7841 -2746 3538 -15016 -24794 -22128 -6455 6345 18267 14903 -3352 -6885 -14868 -14179 -9381 -5032
7827 -5032 -8627 -11226 -9031 3949 6417 -274 -3975 12295 -8050 -11317 -8932 -803 491 602
7813 602 2464 6459 -3307 -1601 7166 -6586 -2322 12223 10204 -16866 -19560 -749 -1612 -7374
7799 -7374 2767 -11787 -21751 -14300 6060 5829 -13460 -19245 -11464 -7640 -1704 3362 18522 1889
7785 1889 -8743 -9873 -6011 -13001 -3520 3465 1609 -3531 -15785 -19469 -14917 -8505 -6850 15389
7771 15389 21697 11676 -7717 -9611 5651 23211 875 -18514 -10767 3980 8422 14946 5018
7758 5018 -8464 -6749 3976 11105 19241 36113 30172 7586 3874 6283 -10582 -12507 -2557 14319
7744 14319 3274 -5385 2866 -1003 -14443 -13052 -16547 -24228 -11857 -1060 273 12172 -2098
7731 -2098 4190 -11637 -17409 -8804 1418 2910 -5514 -5208 2709 -9506 -2527 3214 4735 7932
7717 7932 10493 -751 -14158 -23045 -10718 -6878 -25869 -33447 -31196 -22428 -20142 -24355 -19912 -15298
7703 -15298 -5322 914 1989 -7529 1128 4238 14274 24451 28483 26198 8300 -17482 -31143
7690 -31143 -19595 7770 -2761 -3670 -7400 -12313 -6903 -12721 -5147 -11051 -20661 -13190 -11695 -18504
7676 -18504 -20747 -6403 -6857 -24873 -40687 -41461 -24105 -13777 -16233 -10206 -8730 -12156 -13245 -380
7662 -380 -132 -19015 -25061 -11552 -5454 5907 -11280 -20234 -11719 -7882 -11735 -2782 -9708 -33492
7648 -33492 -35301 -29248 -29947 -31590 -34347 -40255 -28241 -26281 -22396 -25049 -14768 409 -1898 -3560
7634 -3560 -8812 4533 -824 -11023 -23065 -21964 -19716 -30001 -32799 -29846 -25307 -24225 -24143 -19313
7620 -19313 -11671 -3920 -6305 -17094 -9047 3999 9308 10453 8880 5355 7345 -858 4754 5695
7606 5695 -6288 -11858 -9293 -7562 -8688 -9755 -10145 -10853 -7800 -6213 -5775 -7725 -12467 -3420 -3315 -5352
7590 -5352 -123 10729 5787 11028 17175 27430 21660 13012 705 -620 4480 -9933 -14148 -6193
7576 -6193 -1254 -9765 -615 -1658 1807 5519 -4174 -12325 -141 -2632 -2682 -14157 -11928 109 -8900
7561 -8900 -20926 -13790 -11697 -10786 -12957 -19386 -39266 -52514 -43839 -33772 -28600 -10606 -5502 -698
7547 -698 -1504 6693 1956 -1542 -6984 -22912 -27311 -14586 -11970 -291 8676 9268 9036 -2482 -1456
7532 -1456 -2559 -6645 -9938 -19532 -18687 -4938 -8244 -12026 -17597 -17797 -8762 2184 6255 19196 26178
7517 26178 15924 5274 -2113 -7787 -5075 -19545 -13790 -12615 -14771 -12031 16086 33363 20587
7504 20587 -4107 -13020 -7682 14288 12917 1691 -7409 -9588 -1756 8951 12716 25209 22643
7491 22643 20880 12071 7117 2253 -6718 -4134 18831 26347 21876 7943 2611 4918 5992 5981 4528
7476 4528 -10503 -15169 -10389 -10094 -13959 -16166 -20765 -10899 -2369 3281 3760 9332 5195 -1898 5989
7461 5989 12280 11780 7620 3478 2007 17607 6784 -782 570 -15368 -20107 -20082 -19053 -19797 -23517
7446 -23517 -21632 -22284 -13541 -9431 -10608 -11710 -11171 -14171 -5630 -9165 -15804 -10749 -2205 4894 -3777
7431 -3777 -7275 -2193 -9232 -7682 -13605 -23151 -12724 160 5050 -5025 -4950 -5199 2597 6685 -2384
7416 -2384 -5940 -8112 -12261 -17646 -13101 2827 9527 7279 716 6806 -3053 -18144 -18398 -5526
7402 -5526 4344 -2011 -10401 -16427 -25287 -30131 -28977 -38614 -34739 -24849 -26836 -26955 -24039 -21083 -18284
7387 -18284 -16993 -19148 -22866 -9071 -6280 13174 17239 12561 305 -9841 -11173 -20488 -25897 -28382
7373 -28382 -44991 -52712 -33471 -10137 -9890 12729 18464 13417 9470 20179 7408 8754 21867
7360 21867 30592 27200 22785 12125 4579 4768 6367 4083 11271 -2154 -8320 -20167 -30472 -18611
7346 -18611 -4900 -1700 -10138 -3688 -6888 -23349 -35996 -20961 -12937 -8539 842 -5293 -17491
7333 -17491 -20794 -26779 -17049 -1154 -4828 624 7996 4432 -3628 -18860 -25655 -13029 -2915 -5076
7319 -5076 -21386 -11862 -4165 -872 -4045 -6175 -781 4749 -5311 -20169 -27645 -38293 -27228 -16005
7305 -16005 -6911 -2152 -11281 -26683 -15944 -5989 4933 306 -13552 -19735 1602 13753 16648
7292 16648 12916 16802 9958 7312 6977 -1552 -6630 -122 2665 6585 15751 14169 21938 33459 12710
7277 12710 -9507 -9230 -5505 -12503 -13269 -12626 -3629 -18065 -26163 -33922 -34995 -29025 -22281 -15272 -21454
7262 -21454 -36319 -39463 -34443 -16489 1143 -6546 -22691 -24091 -15631 -7598 6847 11420 9524
7249 9524 18155 7884 2789 -597 -9205 -24358 -32559 -16358 -1067 -4197 -2609 1921 -3326 1068
7235 1068 8677 -200 -18391 -2146 7984 3902 -412 -13056 -14099 -19523 -14260 -21511 -27139 -28293
7221 -28293 -14726 3202 -513 -4812 -17799 -23161 -23684 -17468 -6522 1805 -13535 -22550 -14430 7198
7207 7198 -3430 -1870 -13375 -24830 -16871 -2730 416 2951 2987 -6260 -15896 -8191 4891 -11
7193 -11 -52 942 4489 9205 819 -4824 6432 24311 26081 27637 20844 6975 5841 -12575 -17660
7178 -17660 -13765 -5372 -1231 -9952 -9890 -15159 -23965 -10097 -3623 6803 593 -11207 -23639 -15115
7164 -15115 -13822 -14299 -10806 -12204 -11791 -4401 -596 7781 9848 36437 39014 31487 19361 7425
7150 7425 13652 12828 591 580 9160 3236 -5447 717 1824 -3801 -6129 -558 6118 9007 811
7135 811 1851 715 -19738 -16493 -8687 -6039 -6572 -6558 -864 -3654 -5684 1785 14776 16080 12006
7120 12006 23860 24708 3904 -16834 -13342 4536 7055 -8772 -11414 -6322 11988 18056 6753
7107 6753 2158 8315 10055 11807 -5544 -10426 -1505 2447 17042 15382 370 -7128 -4757 -5533
7093 -5533 -5070 -8063 -4690 -16504 -7644 1676 9353 7378 1961 -26296 -35646 -33120 -10194 -1211
7079 -1211 -14293 -33754 -34320 -26621 -30657 -35179 -25091 -14976 300 11281 3258 -6807 -6261 -3047
7065 -3047 7314 8659 7583 -7092 -16564 -19319 -17394 -15668 -8242 -11715 -22874 -13441 -6142 2356
7051 2356 513 -8001 -6283 -6960 -5252 -14189 -23257 -19617 -25026 -24664 -13786 -10419 -7623 -5311 -2100
7036 -2100 -7018 -3703 5757 8530 -11015 -29109 -38905 -32896 -21397 -6277 1132 1236 1984 -7219
7022 -7219 -6678 -6500 -12562 -22549 -24141 -29779 -29185 -24440 -33812 -24012 -18213 -25141 -31695 -17759 -7957
7007 -7957 -7467 -8801 -9471 6233 383 -979 -8500 -5641 -12493 -8113 -2722 4402 -7839 -27672 -38486
6992 -38486 -22028 10203 7450 -2417 -7311 -13748 -7150 -3640 -12470 -7494 7328 3737 -5818 -1285
6978 -1285 4076 -2516 1742 9379 13540 9705 -254 -19827 -26895 -31453 -20464 -5841 -13599 -21318
6964 -21318 -9782 -8278 -22756 -20710 -11033 -11481 -14359 -11945 -12864 -11143 -17951 -12789 4921 9719
6950 9719 7190 17813 15285 8285 -7440 277 6581 -2691 -3569 5996 3539 898 -21295 -27969
6936 -27969 -13143 11642 15445 959 -1328 -8928 3852 7346 15307 6577 -2507 -13651 -2416
6923 -2416 -4068 -8548 -19311 -32833 -13144 -2828 -3833 -15313 -29042 -26139 -22285 -12788 -3798
6910 -3798 -21733 -38392 -30158 -17051 -10169 -9854 -2481 12037 19621 -21 -9020 1015 -323 -12026
6896 -12026 -10903 -7810 -5964 248 9500 -4656 -14360 -9917 -9440 -9139 -8651 -16004 -14770 -14610 -25804
6881 -25804 -23555 -6093 7963 7494 -3570 -1853 7028 4687 -9526 3358 11524 3333 -9612
6868 -9612 -14340 -9604 -7481 -17055 -9298 2916 8327 4034 -13946 -16667 2100 -2121 -19146 -32161
6854 -32161 -33378 -20690 -15998 -19370 -7023 2472 -6855 205 -5341 -19731 -27207 -15195 -18241 -18606
6840 -18606 -7175 10843 12300 20887 7387 -1552 -10581 -5875 6492 8848 -6317 -14417 -3416
6827 -3416 -968 -4005 -2010 -11527 -17694 -24187 -13628 7467 19301 11474 10612 8722 -472 -19173
6813 -19173 -25521 1404 10407 -7651 -35179 -39071 -10279 14415 20149 21374 22495 22062 17355 -3397
6799 -3397 -5561 -6 1671 372 -9444 -18412 -9637 -799 -8534 -21505 -26590 -27404 -17122 -14691 -22125
6784 -22125 -17640 -14611 -309 2600 3068 4888 10561 8816 4426 11658 21389 25403 25135 26252 34047
6769 34047 46235 33079 37507 30150 32940 29688 17637 19521 34081 42732 43965 33721 44018
6756 44018 63792 61782 68106 69327 64685 49179 51098 45243 28971 32811 48765 59326 57259
6743 57259 67649 93288 121563 115835 140223 185713 250846 337198 487039 714833 1007372
6732 1007372 1181161 1148211 1015977 805990 558480 392113 287963 220898 166068 134414
6722 134414 108196 88296 85690 93629 93629 83143 58161 35361 26200 22096 28253 47274 49899 39038
6708 39038 40039 40615 48643 49046 39186 23806 16557 11815 17677 -2796 -13967 5104 16402 19628
6694 19628 21944 11493 -6574 -14372 4695 27305 21541 1567 10197 13588 16086 20561 17071
6681 17071 6167 -1116 5609 10261 6712 -4276 6820 14977 21385 16822 9263 11427 3756 10186
6667 10186 2428 -8143 -20544 -22827 -18246 -17090 -3173 -2922 12546 6097 3288 -11528 -23971
6654 -23971 -14829 -2721 10366 32122 46488 32449 22870 3803 -16806 -10430 -4513 -12180 -4510
6641 -4510 -14740 -11619 6804 15233 14240 11230 3188 8034 17211 32195 37008 16228 964 7036
6627 7036 2711 -503 -17597 -17073 -17510 -2982 11702 18784 5544 -3224 19270 16774 4027 -12965
6613 -12965 -9234 -8007 -1538 -12965 -18718 -16164 -5433 -4040 -1274 -5699 -9186 5174 14961 8077
6599 8077 -9434 -3890 4570 6941 10904 2322 -2582 7963 16298 7810 -8357 -15391 -10405 -6192
6585 -6192 -20797 -31773 -27094 -24652 -16693 -11176 -19434 -24191 -27700 -28558 -17745 -6046 2988 6958
6571 6958 11858 -5601 -7935 13910 15722 10693 9962 -3828 -21885 -40589 -47886 -36858 -25777
6558 -25777 -11503 -14931 -1651 6994 7215 3477 -13355 -14289 -15654 -8174 8855 -416 -2589 -2730
6544 -2730 5501 19785 8301 4969 8807 11613 3847 -11369 -6877 3544 11742 563 -12405
6531 -12405 -21602 -7810 -9245 -8204 -69 2731 -1060 -1054 2839 -5205 -17710 -10633 -16540 -15049 -13225
6516 -13225 -16346 -15641 -6742 -1492 6743 14978 12178 7996 11080 5684 1501 -1586 8468 7557 16229
6501 16229 31183 32564 28520 8091 1108 -6151 3949 14583 24849 21486 19226 10133 -3600
6488 -3600 -16327 -8658 8833 7618 1648 -19583 -28978 -10596 -962 4875 16597 15969 17330 1981
6474 1981 2295 6496 3383 10629 10250 7851 10470 2617 -2776 -8932 7761 8873 11296 18418 7763
6459 7763 9565 3114 -11187 -9082 -4367 -11204 -12239 -15649 -15750 -16113 -20657 -27678 -34598 -32208 -12017
6444 -12017 1444 1565 4334 11680 11143 1436 2429 -6754 -12909 -13451 -15875 -16672 -8791 912 55 5711
6428 5711 -7218 -8917 10118 14901 20022 23012 10627 -2200 -1656 -5780 -16719 -17168 -15016 -3184
6414 -3184 8005 3389 6646 -3312 -21813 -8939 -4398 -13736 -14316 -10753 -5301 1573 1614 9930 10325
6399 10325 -6104 1640 3649 -18293 -21088 -24148 -29678 -11638 1070 -2967 -1488 -4071 -10682 -22499
6385 -22499 -21580 -32552 -26880 -21781 -17588 -17897 -16585 -19162 -31852 -18225 -9886 -2123 12103 19912
6371 19912 10164 12086 -3599 -5404 -10825 -24956 -15444 -4117 -11406 -8952 -4663 -11987 -788 455
6357 455 -4370 -9393 -3443 3251 -1478 -4050 -4615 -2286 1739 1479 8425 6835 11944 28264 26517
6342 26517 11363 8127 5565 596 -6478 13791 17202 11188 3540 13332 23065 1568 -13960 -12721
6328 -12721 -10458 -5836 -9668 -4406 5064 14594 21039 33415 32805 4295 -9292 -1831 -1038 1191
6314 1191 -5830 -1139 -10970 -1825 6153 -557 7952 21536 14147 12742 403 -2953 -4453 -15577
6300 -15577 -19131 -17202 -18230 -16287 -11802 -17224 -26099 -28630 -35894 -38326 -27626 -7575 5249 372
6286 372 6935 -2695 -18145 -7463 -15792 -23933 -37351 -37099 -20563 -20819 -24950 -22992 -12948 -9407
6272 -9407 -22641 -14103 -13548 -13934 -22099 -14306 -1664 8283 13314 12558 4835 -4407 191 -4177 3816
6257 3816 17000 8417 -2167 4690 15948 15165 15136 2504 -9430 -16918 -27896 -29800 -25397 -37015
6243 -37015 -33142 -12130 13400 19012 12311 -8011 -16350 -2685 11542 16596 14402 16310 13057
6230 13057 7297 1961 5343 1933 -8740 -11946 -17493 2886 11766 -5382 -9025 -4446 -5750 -18817
6216 -18817 -13092 -4464 -5317 -18483 -25256 -7426 12413 10237 2662 4383 -1449 -1230 -11031 -12621
6202 -12621 -16446 -10313 2284 8437 636 -9076 -1878 18705 10234 -767 -10223 -5823 -1529 5000
6188 5000 15785 24225 19280 26094 20261 32178 38439 29309 26320 18182 13959 18866 10948 -1225
6174 -1225 7177 12679 357 -20772 -24595 -33531 -35082 -18572 -8164 -3652 -20556 -5423 10877
6161 10877 -1773 -25397 -24977 34 10413 -6376 -11044 -8792 -944 -102 4425 6297 6592 -9981
6147 -9981 -9415 -11639 -3126 -6848 -14180 -17124 -22466 -23390 -29997 -18545 -2521 7090 -4764 -32432
6133 -32432 -32189 -19038 -20616 -36881 -27877 3809 13944 25801 18656 8563 -16514 -15856 -3388
6120 -3388 -18505 -32412 -27150 -21041 -28692 -12138 4485 10477 19848 14152 18100 10920 6055 13064
6106 13064 14262 8361 -7141 -12844 -4338 1636 -2042 2983 7911 18492 19235 12076 -1921 -5902
6092 -5902 -6121 11450 731 3904 4136 -8295 -8590 1194 21505 16474 5464 -3944 -2286 866
6078 866 -5523 2143 8575 3711 -6192 5968 11429 -294 -16869 -34367 -21293 5787 22014
6065 22014 9810 634 6409 9287 1535 -2131 -8840 -24785 -31772 -14788 -4238 -16918 -24138
6052 -24138 -24297 -32519 -38544 -29002 -6189 9125 14466 19812 33414 28511 19085 22894 21424 20243
6038 20243 21665 18318 14617 10762 5046 15140 20736 4537 6370 3170 -5052 7673 5145 -7457
6024 -7457 -735 8745 16573 -6840 -15469 7948 2606 -3695 -509 16184 10527 -19630 -16988 -14329
6010 -14329 -10343 -3650 -1014 1344 3166 1902 9529 -394 -13247 -7856 3373 9748 3345 -12196
5996 -12196 -11304 -4890 -6895 -14001 -648 -1990 -2649 -5164 -14796 -23338 -20928 -14056 -2024 419 -3815
5981 -3815 -12213 -2688 2759 -183 -9169 -4585 5920 14123 12934 18049 31909 15624 -11300 -13560
5967 -13560 -18305 -24975 -35382 -29224 -17663 -4311 -9823 -27158 -31841 -19041 -8204 9751 1761
5954 1761 -18030 -27117 -23332 -22570 -46074 -46957 -30494 -20574 -23275 -15720 -8611 -14401 -13947 6638 13450
5939 13450 -24 -13607 -20425 -3672 -4608 -13252 -15484 -17426 -19007 -870 -5486 -10578 -11879 -13371
5925 -13371 -15846 -8275 -10023 -11967 -15757 -30894 -32202 -25292 -22750 -16052 -9760 -20365 -31548 -21544
5911 -21544 -18525 -13775 -17698 -16903 3457 4762 -5854 205 4722 3 -4411 8436 3981 -11919
5897 -11919 502 6464 -128 -10181 -4141 -1943 6668 18341 24437 16586 2817 -14702 -13269
5884 -13269 -4899 2908 7040 7733 2826 7412 6828 13325 18846 10560 -7559 -24681 -33099 -8520
5870 -8520 2034 3358 7234 8637 6473 9950 12482 -4519 -19158 -11082 -7011 -3378 6459 -5955
5856 -5955 -13834 -14910 -1569 3427 6464 10614 8074 1638 -2373 5048 27449 28997 11947 -2006
5842 -2006 -6792 1710 184 -9354 -20861 -16785 -16544 -19425 -25577 -33357 -35798 -33288 -20708 -8229
5828 -8229 -12245 -4816 1670 3821 -4011 -6772 2001 8505 -1298 -12687 -16905 -19697 -21056 -19134 -17702
5813 -17702 -22909 -29150 -24077 -16163 -22721 -26176 -23621 -15961 -5865 -12655 -14827 -9742 -7793 -6447
5799 -6447 -4173 -11961 -10253 -9807 -10314 -3163 11728 6805 4656 -4837 -3800 -13612 -23335 -25900 -25283
5784 -25283 -13424 -2537 5084 8335 -3094 4089 10909 318 -10559 1106 -2003 153 -825
5771 -825 -15686 -25015 -27830 -33094 -27391 -27529 -39298 -41754 -39341 -28691 -8829 -9408 -4054 -6182 -9025
5756 -9025 -759 6045 -2675 -1639 -7288 -15359 -7217 -5262 -6173 3674 5730 -3693 12429 34630 35092
5741 35092 29276 20713 943 -10555 -6932 8602 6985 10874 11577 6619 1531 -1406 -1776 -1171 -133
5726 -133 8127 5769 -2648 -6156 1797 3572 9113 6148 10773 22281 27407 36335 48272 44021 28970
5711 28970 14082 -3936 -22570 -17144 -6901 -3065 5129 -2640 11445 14231 11186 545 6448
5698 6448 10957 4660 -11000 -2044 17912 24710 11696 26500 27174 9795 3704 1681 -4645 -3282
5684 -3282 19849 29636 6829 -14222 -17973 -14101 -20140 -22945 -1082 4113 1143 7615 12736 12427
5670 12427 8193 -2442 -5227 -7313 -3977 -10290 -28358 -37275 -33354 -32586 -34106 -23038 -19469 -10151
5656 -10151 -3908 -7582 -6207 -9884 105 10703 4912 -13643 -28043 -21070 -14676 -10779 -497 -6166
5642 -6166 -13158 -9774 -8131 -16887 -17833 -7847 800 2575 12298 3861 5746 6983 2329 10318 -1625
5627 -1625 -3635 582 8577 -4937 -17146 -23916 1099 -6440 -14984 -3147 -532 6295 5665 -13457
5613 -13457 -17331 -16205 -22408 -29314 -30179 -14135 -1194 13108 20076 17650 8428 -8250 -17063 -22891
5599 -22891 -23261 -16578 -34427 -35779 -34718 -25412 -9593 653 6964 6584 6393 -5577 -27633 -29921
5585 -29921 -18390 -10898 -1986 -2769 1392 -4631 -9721 -10077 -8458 -25821 -34732 -19396 -5638 -7894
5571 -7894 -12476 -17203 -14635 -3489 -13749 -9914 -13151 -10397 15619 17244 7663 1449 9412 -9398
5557 -9398 -18392 5223 15788 -111 -20093 -14548 9466 22082 18284 25683 14373 7284 7016
5544 7016 24380 28603 22716 18670 27801 39210 38363 29637 10755 5254 5883 1453 -753 -12052
5530 -12052 -10815 -2575 3560 7993 3423 23451 38522 34471 22858 20852 2230 -15353 -27938
5517 -27938 -34944 -30020 -27135 -19674 -7510 -2181 -9558 -26767 -48281 -32266 -26032 -24549 -19645 -11976
5503 -11976 -16416 -29287 -25457 -23502 -28933 -23516 -9557 2506 1151 -5409 -4731 -11506 -7956 -8837
5489 -8837 -3431 11819 17547 13247 964 -13014 -6365 -3480 -12079 -25487 -19962 -2682 10261
5476 10261 9850 -4343 -13785 -9381 -5569 -12175 -11878 -22008 -19393 -25866 -14862 -17477 -19342 -10917
5462 -10917 -10749 -8089 11867 21746 15650 9857 7786 4539 9081 18732 8753 3527 7238 13837 -4715
5447 -4715 -2123 1730 -9816 -28210 -23216 -13152 -14426 -15697 -10740 -18138 -24862 -23510 -21288 -16029
5433 -16029 -23126 -21917 -8633 3748 6756 5040 1630 18870 21819 20984 19088 8638 -1020 415
5419 415 11624 15107 11988 4463 -7513 -14036 -21298 -27579 -28364 -1272 24421 17060 817 9717
5405 9717 6442 -16020 -26039 -24537 -15918 -17316 -13906 -16371 -18159 -13876 -3746 3839 1674 -12554
5391 -12554 -5697 3371 9015 12788 20577 7848 -716 -4319 54 12000 14849 27629 16785 10678
5377 10678 -8358 -9956 -8632 -2655 -11290 -10830 -17084 -27137 -26944 -28121 -25820 -16480 -14117 -14415 -10375
5362 -10375 -8166 6964 13710 8825 11364 9481 9957 -7309 -20616 -13025 -9741 -18356 -15680 -15725 -19662
5347 -19662 -16349 -19994 -2817 -2323 -3318 -1435 -5613 -2743 -24240 -24553 -2346 3588 1283 5860 -2108
5332 -2108 -18486 -19099 1693 -4066 -8464 -17472 -18550 -3711 -6532 -4740 670 7143 25214 28937
5318 28937 6722 -7350 -9223 -9993 -7258 -9649 -24290 -40065 -17937 9889 15537 2356 -6717
5305 -6717 908 777 -3483 -7144 15401 23590 9232 -11333 -20483 -10891 -716 -10548 -9924 -14612
5291 -14612 -15517 -18896 -17508 -20781 -19345 -14273 4076 4622 1081 -7735 -13218 -19792 -16687 -1636 -2053
5276 -2053 -6235 1591 -20075 -31463 -21572 -15550 -11676 -6936 -6203 -14607 -8015 -11816 -27504 -23937
5262 -23937 -10762 -9783 -8337 -8038 -8673 -13678 -2636 14192 13321 -576 -4762 -1406 -1859 -6603 -15566
5247 -15566 -724 -882 -6065 -12113 -7723 -5613 -12927 -5865 -4813 -12329 -10851 8654 23168 20576
5233 20576 18600 5401 13803 11845 4695 -6850 -14146 -18985 -10024 -8263 2410 -2511 2259 11627
5219 11627 16090 9200 7482 11336 11636 5424 -2117 -8155 2162 -3066 -17854 -20985 -23717 -14013
5205 -14013 -11469 -1266 10247 14734 29215 29941 27575 32193 11399 -12463 -19050 -3750 -3582 -11398
5191 -11398 -14371 -16427 -14585 -27371 -36784 -27253 -8819 11178 13423 -3712 -9861 -3448 4482 4906
5177 4906 5898 10367 7052 6388 18433 10038 14650 20490 16174 -1168 -16855 -14508 -5091 -6366 -3951
5162 -3951 25434 30901 13846 7896 3146 -8252 -16988 857 13501 2611 -26480 -34739 -28627
5149 -28627 -24631 -26389 -14852 -8161 -14957 906 11316 -11587 -17868 -15057 -16144 -6778 5399
5136 5399 12920 16976 5071 -9062 -20836 -11071 18246 19077 9601 13339 12596 12429 16399 33154
5122 33154 20211 4563 14471 9683 4977 295 13265 18370 14052 -5357 -5414 -8852 -20548 -28550
5108 -28550 -26227 -7705 -16442 -8799 3205 -3816 -9158 6581 10872 15978 28176 27602 20196 8666
5094 8666 10065 14356 9259 17361 11161 113 -7690 -7168 -17004 -27671 -20082 -11539 -1060 8932
5080 8932 10444 5523 12654 2031 -8002 -18953 -32363 -17442 -10090 -12775 -9483 -22558 -39644
5067 -39644 -33557 -18927 4067 10827 1985 -795 6336 14351 22632 15530 16274 422 5477 14410
5053 14410 8354 9433 15033 13262 1179 -2849 -12396 -15717 -13219 -8990 2602 3000 8352 6314
5039 6314 -17879 -22013 -7975 -3955 7015 10099 -1611 -8355 -1558 -11056 -39154 -20039 -2987
5026 -2987 -11692 -18108 -36328 -26728 -18720 -15664 -14629 -14464 -7915 -22339 -32588 -33565 -12942 4979
5012 4979 14270 14294 6692 2152 -5025 -3836 5126 22351 22010 12744 22137 12396 7084 -5095 -3486
4997 -3486 477 6848 16604 3673 -11177 -1970 -6275 -16719 -24042 -32313 -35171 -11632 659 -16415
4983 -16415 -27933 -27785 -17797 -11554 -11911 -4970 -11181 -15319 -7539 -12938 -18220 -14151 -8131 -27788 -27055
4968 -27055 -26896 -28622 -25701 -16640 -16382 -12182 -3197 14184 15946 11904 2073 -6194 -8012 -1482 -2794
4953 -2794 -17340 -29810 -22843 -22908 -17723 -29648 -29321 -18519 -12194 -13171 -10350 -10031 -6428 -8908 -2654
4938 -2654 7100 10193 18537 16972 10930 7839 -11692 -18193 -19491 -14805 -14684 -8455 -11443 -15431 -12904
4923 -12904 -11354 -4933 22036 5633 -4394 5050 -10170 -11470 7302 16548 21884 23315 1705
4910 1705 -12151 -16798 -13401 -1087 -11625 -11633 -10120 -9920 7924 25509 24158 10925 18586 11581
4896 11581 3013 20905 26572 27503 12062 -1556 3673 6858 3683 1297 -6394 -8828 -17773 -18668
4882 -18668 -8333 -7516 -24655 -21921 -2136 15688 13695 5439 -3453 -10270 -2078 1127 -17320 -27683
4868 -27683 -20621 -16569 3122 9515 1318 -4710 -4546 7651 12041 13314 -12205 -18399 -24065 -33660
4854 -33660 -24732 -8841 -13413 -18155 -32716 -45124 -42326 -23444 -9432 6596 18635 22247 82
4841 82 -943 -453 -6063 -3768 3440 -5730 4 -7183 -22578 -18313 -18646 -22439 -3586 1188 -712
4826 -712 -7197 -5121 6786 14467 31216 15379 2502 7305 13353 8106 1496 -8503 2293 -10890
4812 -10890 -29139 -26759 -15480 -2272 -7761 -10764 -4334 -12106 -6020 -12969 -11681 -16458 -18231 1176
4798 1176 -6909 -10718 -11003 -1336 -2362 -6849 -18001 -14762 -3304 -233 2087 8182 12564 5554 3030
4783 3030 6550 15400 9669 19853 25374 12292 8685 10237 922 -15237 -24608 -35058 -27661 -3453
4769 -3453 907 -1283 -673 643 -1019 67 15442 -2 -3177 -828 -9064 -14377 -13746 -5749 -1000
4754 -1000 -11974 -17081 -12794 486 8539 7491 1624 -1230 -6570 3661 8073 10971 9781 -891
4740 -891 -13945 -4870 2114 -15120 -5995 -1984 -4877 -18847 -24141 -19449 -12325 -4154 -5007 -6472 -6629
4725 -6629 -3731 -625 8410 -3293 -14800 -18064 -8306 -672 1734 -555 -3150 -438 -4187 5211
4711 5211 12033 7401 15444 24941 30490 33511 30033 7930 -1001 643 4185 14461 27243 27456
4697 27456 14763 4102 10340 16467 8432 4864 10051 12393 22027 18342 12592 20763 30802 16759
4683 16759 8838 13002 -544 -10232 -34967 -38964 -17243 -1082 8884 15762 24590 20814 10456
4670 10456 -3630 -9638 -18089 -12617 -14676 -18688 -33146 -49377 -38309 -23692 -2835 -7420 -13724
4657 -13724 -682 -5192 -3018 -2289 -23611 -32884 -24915 -12470 -8875 2474 8613 5181 5619 -3122
4643 -3122 -1257 3223 7665 -10615 -28093 -11159 -12314 -9749 -18827 -15590 -8845 -721 3263 -2661
4629 -2661 9250 10849 6098 6825 4180 13426 29745 30700 3987 -7597 -7176 -60 -16325 -8045
4615 -8045 3210 6394 6587 19326 22598 4170 -13591 -2770 -15098 -22670 -20883 -14704 -18350 -35817
4601 -35817 -35119 -25988 -8855 1151 -19755 -21585 -16588 -21353 -10813 -12492 -21769 -27831 -28382 -7829
4587 -7829 10806 10528 3474 13087 5680 22683 15330 4214 5448 14285 11178 12582 13423 7132 -10376
4572 -10376 -11048 -16543 -20674 -4978 950 -3963 -13726 -6463 -3026 419 -8557 -14881 -4070 -5446
4558 -5446 3671 3918 -9739 -7470 -21231 -19092 -11849 -5630 -8676 -9130 -6724 142 1828 -1544 -10714
4543 -10714 -15150 -2087 18537 14520 -9218 -20692 -14768 -13741 -24800 -10848 1831 2991 -7953
4530 -7953 -4012 1030 -722 210 -15297 -30712 -31503 -29167 -22101 -7512 -14296 -17915 -13648 -22193 -15807
4515 -15807 -5754 3160 -1427 -11251 -22092 -22892 -14473 -2215 -10608 -19137 -18098 -17850 -7966 12640
4501 12640 10833 8689 20820 23231 13463 18328 15901 -6741 -24181 -19608 -6246 1519 -216 7160
4487 7160 4781 -8240 -10193 -4910 6505 3179 -6744 -12984 399 4253 -13413 -13421 -6564 -11827 -22018
4472 -22018 -15319 3690 22711 20550 -2471 -16498 -20538 -30714 -38371 -40816 -29462 -20406 -11450
4459 -11450 -6891 -17923 -27253 -28353 -16494 -7429 -13584 -17160 -22374 -29231 -31764 -34089 -28470 -25032
4445 -25032 -14690 -21002 -24556 -32966 -24757 -16347 -7373 -293 3951 2563 -1651 -6311 -18874 -12025
4431 -12025 -344 12663 12016 132 9651 26626 16991 21173 18241 14275 10693 4537 1645 -388
4417 -388 4379 304 -6569 -2672 -6152 -5485 -7646 -10503 -5240 -10076 -4523 -5632 1510 2916 12842
4402 12842 18854 17926 23506 20001 14114 -7159 -13394 -4988 -11049 -21423 -18160 -15779 -13021 -2191
4388 -2191 441 11463 6665 -9374 -10282 -10414 5171 12792 9234 -6195 -9291 -23674 -22045 4324
4374 4324 2760 -18486 -4716 4794 4382 -3085 -2351 -7494 -4760 3972 11789 13602 3126 -7083
4360 -7083 -2285 9594 11280 6223 11139 21409 24886 20500 2363 -512 10151 -538 -261 11338
4346 11338 16843 21224 7909 -3919 -3024 -23005 -20666 2947 -3122 -1381 -1442 -8557 -3145 -13712
4332 -13712 -13269 -7186 -7924 -7984 -11496 -12990 -9522 -9484 -1115 -546 -12299 -13317 -17883 -21244 -7015 -33
4316 -33 -4044 -14510 -16883 -12866 9968 9744 1590 -4148 1374 4915 -4465 -26913 -26779 -13459 -10171
4301 -10171 -19452 -15206 -7909 -10117 423 17319 17845 13338 834 -3020 -6091 -13860 -3142 2957
4287 2957 3628 -4304 -7135 -139 -14355 -38332 -32538 -17229 -13368 -12917 -16468 -25886 -23219 -9506
4273 -9506 -9771 3935 10207 1050 -9623 -12729 -12992 -29060 -26444 628 4135 -8042 -3705 -13307
4259 -13307 -6979 8441 10561 7344 13273 7346 2511 3397 -8703 -8371 7 3638 18896 27648
4245 27648 31393 22823 5235 -2188 -1313 4949 7623 -893 -4249 -3956 7907 27442 31125 27114
4231 27114 25503 19178 16392 7476 -13114 -8800 -15700 -15147 -21681 -17316 -14686 -2344 2805 -11014
4217 -11014 -14841 -9315 -1506 -7474 -10826 -15609 -3750 6476 9358 6314 2361 1080 -7735 -9712
4203 -9712 -4453 2676 1158 -2594 -20825 -35538 -22886 -6521 -23722 -17168 1778 17123 11275
4190 11275 2550 9772 13471 4735 7109 6591 8493 2950 -1024 -3207 -11180 -12865 -15266 -4632 3802
4175 3802 2594 3764 -9509 -25878 -19887 -21104 -17219 -14664 -20324 -11521 -4885 -6763 -21902 -21474
4161 -21474 -4506 -2921 -11056 -12025 -15545 -13924 -1088 13924 16790 10314 -4630 -9834 -5141 -16598
4147 -16598 -21366 -30599 -27628 -20573 -22633 -26637 -19319 -6223 3926 1966 -5420 -10796 -10306 -5916
4133 -5916 -7418 -22013 -26960 2890 21706 31892 16630 -2219 -5395 3332 12917 12101 12084 9000
4119 9000 4060 7978 20715 23937 15890 11948 17433 28067 14398 -8535 -7340 -11823 -6740 47
4105 47 2330 -5284 -3384 -828 -2240 -8984 -4669 -4489 -1304 -6261 -10139 -7066 -11043 -13554 -4086 -15606
4089 -15606 -8140 -3692 -1067 10635 31895 40604 27702 7538 -170 -1270 -4210 5284 972 6138
4075 6138 14561 13719 12301 -1153 -3029 -6663 -12203 -8571 -17863 -20737 -9719 7562 11784 14075
4061 14075 14518 12714 15454 18182 10449 -7655 -16227 -16684 -12108 10269 12877 4170 3082 2511 9613
4046 9613 5384 3402 6199 -9773 -13137 4060 19177 16313 10960 5358 2935 3306 7784 11236
4032 11236 13931 6457 -12361 -17777 -23442 -15606 -5903 -14770 -26351 -21474 -30624 -34029 -25708 -17557
4018 -17557 -3790 5365 8335 169 267 6457 -3248 -15485 -13225 -6788 -8408 -242 -2108 -4035 49
4003 49 -5512 -14362 -6664 -3135 -15455 -11641 -11762 -21908 -19632 -8121 -11256 -22119 -18884 -9075 -14986
3988 -14986 -8027 -938 -10377 -19316 -21259 -9442 -2226 -24338 -23386 1088 7862 8382 -1665 -4957
3974 -4957 -5090 -12159 -30417 -34258 -14576 -995 9482 8584 -451 -9502 -31006 -33591 -2935 5804
3960 5804 1646 -8905 -15092 -2159 4621 -13939 -23756 -23637 -8832 474 3732 10985 7487 -2335
3946 -2335 2785 -141 -4655 -159 -6924 -4184 2122 7681 12229 25061 21923 6226 -17518 -11523
3932 -11523 -13514 -6319 10784 9125 8846 10244 16753 24163 32056 17841 16071 17912 1136 -8068
3918 -8068 -14614 -9375 -11108 -9816 -10135 5449 2303 -6947 -8876 -11243 -604 5026 15295 6470
3904 6470 14203 15061 6605 1504 9343 8863 16359 30273 38067 23280 7490 11 -3706 -16405
3890 -16405 -13450 -11307 -7564 389 -2033 3916 15862 22653 25375 16350 -4644 -9358 3294 14343
3876 14343 13819 8755 11339 1027 -6990 -10437 -11723 -3460 16159 38933 39459 28658 -2812 -15292
3862 -15292 154 5367 1662 -6115 -2734 -6544 -8384 -3309 1439 -5304 -10359 -11564 -18526 -19030 -6312
3847 -6312 1519 8764 5384 -18499 -27459 -26199 -24023 -28723 -35278 -37755 -27556 -12598 1873 2813
3833 2813 -14549 -13720 -13016 36 2721 11712 10727 284 2916 1059 -3886 3817 -3508 -26637 -32419
3818 -32419 -43731 -41746 -21401 -7212 9457 14346 19242 12565 -8950 -6703 -3254 -9151 -13678
3805 -13678 10805 22741 16100 12117 1163 -7543 -1644 -2762 1854 2987 2536 7563 2310 -4111
3791 -4111 -7907 -6053 -14759 -21064 -35518 -39902 -34900 -32078 -16120 -13407 -11771 -8255 -2671 4164
3777 4164 -126 -15338 -13374 -27438 -44301 -26005 -5602 10029 6202 6923 13893 19535 19177 26156
3763 26156 16934 14044 15907 -10841 -23300 -12124 -1943 11120 -5139 -10930 -5630 7331 9132
3750 9132 16160 15111 10187 2407 4104 -2276 -4063 174 -6182 4529 29901 24421 13893 11696
3736 11696 6278 -20613 -16215 -1994 -85 2037 11207 12472 13068 11986 3985 -5350 -249 1568
3722 1568 3223 -1051 2498 13045 -7048 -21802 -5180 3275 -7955 -6297 4080 5580 -4679
3709 -4679 -519 7921 4043 2139 -1649 -20760 -25588 -23181 -13008 -537 11064 15960 9349 10337
3695 10337 8148 19686 15430 30257 34113 33697 23830 3555 5280 11213 22280 27983 23168 18472
3681 18472 8519 1320 20997 15309 -10342 -11763 -9543 -1649 5407 8016 3912 4388 1761 -4932
3667 -4932 -15880 -16745 -3087 7954 -733 -9629 -7729 11243 27360 26571 6055 -6649 5101
3654 5101 -710 -243 -52 4967 13587 10740 3188 327 187 -7 -4261 2873 -1473 -6650 -14276 -18088
3638 -18088 -17966 -19615 -16808 -14113 -4542 -12618 -3557 13582 14353 9734 10784 3699 9244 6815 -909
3623 -909 -16657 -15777 -17688 -16066 2055 6037 3243 3649 -2798 2003 7603 2708 -4289 -7057 492
3608 492 -14778 -17967 -16785 -12851 -17262 -15819 -5295 5095 23485 19861 23132 16665 1018 -16519
3594 -16519 -7301 -7442 -5565 -17320 -18702 -19428 -10301 8363 12444 8517 21253 8473 -1392 -3888
3580 -3888 -810 -5692 -9305 515 -6782 -5862 17413 40810 31708 39303 45159 43366 32463 17835
3566 17835 9876 -2923 -3085 -2755 -1839 4784 -9972 -7064 1805 -4412 -6271 -5843 -6291 -9337 -21235
3551 -21235 -31300 -26537 -8424 -10395 -31960 -36555 -34496 -36501 -32931 -18926 7467 16101 17923
3538 17923 22551 20738 -3265 -16933 -19602 -15207 -4322 -8864 -9260 11116 15039 22735 17976 188
3524 188 -2158 6203 8675 477 -6535 -11906 -15042 -14395 -2038 10514 8400 10731 7905 14409 23690
3509 23690 21551 13282 268 -7332 -13666 -21885 -13197 -7683 1339 2607 1593 -11020 -7485 2022
3495 2022 21915 26450 16244 5543 7074 -5487 -18130 -7942 -14538 -10482 14496 19853 19566
3482 19566 19245 9680 7396 -17940 -1608 17662 18173 5118 16096 26315 26248 32736 24935 6792
3468 6792 -10825 2367 11398 1915 -7186 -6025 2402 11053 17199 28743 17237 14267 8970 4669
3454 4669 7897 4805 2476 -6710 -10132 -2085 6691 14964 8557 3482 12056 10858 23368 21198 12287
3439 12287 9819 1808 -2638 8395 15723 2742 5050 21817 35891 13865 15511 13227 8172
3426 8172 5875 -6638 -17266 -14893 -15679 -17718 -10590 -339 5212 -10723 -10424 16473 14819 17527
3412 17527 -267 -2850 32 -8994 1884 2862 1508 18192 10202 5517 146 -10561 -5982 -4074
3398 -4074 -9067 -18945 -20622 -18816 -26097 -25913 -20302 -12938 -17331 -9410 -245 -560 4977 21528 12941
3383 12941 542 -10146 -12588 -12140 -7101 4051 -6698 -23150 -7510 -2486 -9484 -7982 -900
3370 -900 9410 15824 7176 -7568 -20482 -11299 10498 8309 -6680 -19555 -26370 -9928 5358
3357 5358 13850 5353 4670 -655 -11588 -6250 -8383 1680 3016 -400 -9051 -4222 3457 4775 -3278
3342 -3278 14120 13880 3016 24327 30004 5704 -15276 -24041 -15030 -14196 -14276 -13167 -7568 -1636 6369
3327 6369 14747 14812 -3301 -2861 -3257 61 5792 25772 29056 5136 1840 -3358 9609 21758 14599
3312 14599 7168 4907 4805 -8385 -23372 -16248 -3936 2153 -1795 1476 -2186 644 13276 7898
3298 7898 4998 -3750 5893 24143 22779 26891 20494 19198 11280 -15448 -24093 -22997 -5723 5088
3284 5088 6477 8023 3418 -6309 6247 12355 7930 -12966 -19649 -11663 7576 10334 2845 4915
3270 4915 11352 16005 16519 14529 19473 9805 -8372 -9122 3668 -376 -1309 -10928 -17482 -12261 -11587
3255 -11587 -6892 -4747 892 8817 14184 -2811 -17365 -9546 7103 3227 -9867 -5286 2351 11970
3241 11970 11830 28813 20720 10250 11779 5780 -6511 7241 -2974 -17494 -13791 676 1601
3228 1601 2062 7411 13940 4650 -6401 -9287 -3355 -617 -11915 -11723 -5578 9683 7655 18041
3214 18041 34492 38427 24655 3751 13138 16369 11353 1632 5381 10134 20981 9636 -3698
3201 -3698 -7373 -7766 246 10375 12691 2355 12979 25531 18084 8968 9231 10632 3697 -4892
3187 -4892 -12544 -15206 -12223 -8228 -5409 -4174 4690 -2642 -15694 -10425 4348 14538 2318 -4479
3173 -4479 -11880 -8718 -8351 -8263 -13004 -7928 -29076 -27353 -13114 3404 1666 1071 8585 8963 923
3158 923 -14353 -37907 -33623 -2895 18330 -3567 -8693 -3418 11449 7593 13828 17603 11969 5673
3144 5673 -10980 -5887 -8220 -21632 -22485 -16291 -20121 -8484 5761 -6955 -22263 -27483 -18891 757
3130 757 7354 355 -3771 -18787 -17948 -9305 -11634 -14673 -2034 -10692 -16178 -7595 2082 -10546 14049
3115 14049 23884 18783 4382 2177 -12587 -13934 -5390 8844 10504 -7489 -19801 -18015 -6466
3102 -6466 24419 31158 22857 10103 2620 2933 17055 20819 31921 26508 7649 -1157 -346 -10776
3088 -10776 -257 12522 11677 12156 18290 10795 -7005 -15385 -14307 -10602 2772 18931 19015 1931
3074 1931 -21681 -18550 942 -803 -11651 -13902 -573 -6269 -12603 -9056 -1179 -4092 -3525 -6509
3060 -6509 -13214 -12153 -6306 -4670 -5708 -3988 4678 4068 7526 13526 15451 8754 39 9499 10129
3045 10129 -5946 -21421 -16466 -20339 -13413 17575 16393 20499 31910 22806 83 -11955 -23478
3032 -23478 -18908 -13142 -17321 -3563 2239 -1143 -8353 -4271 2737 5153 -15444 -21869 22 19155
3018 19155 1263 -7669 2001 14717 19995 13191 10711 4515 8241 4207 11687 20552 12323 -1289
3004 -1289 -12241 -9902 -7304 12032 21141 10842 2947 788 -8160 622 11461 17704 17062 12133
2990 12133 -839 -10719 -19462 2667 -4906 -18760 -31015 -43304 -27205 -10017 -13852 -37336 -36736
2977 -36736 -15063 -11923 -6893 8164 8355 9916 17947 12697 4900 -1314 -56 2333 -3487 -13474
2963 -13474 -5210 6748 3844 -3630 1379 16578 21050 -840 -5925 -4836 -4034 8164 14394 13405
2949 13405 -6982 -11593 4618 15104 7869 -1288 -13143 -12862 -9976 -7392 2159 1538 -10311 8010
2935 8010 15442 6514 1819 6731 13544 13052 3327 -964 4224 6519 2229 -5873 8636 16661 1531
2920 1531 -10513 -8097 8930 13129 -2872 -6980 4941 1865 -2739 -5936 -3805 -8643 -8914 -2660
2906 -2660 -19000 -16534 -15148 -14269 -8767 227 12615 20373 35528 40708 31822 36302 24909 22526
2892 22526 34533 20479 16635 31016 36114 37673 39374 32086 6813 -7721 -866 10290 22267
2879 22267 11335 5248 11307 6902 -9457 3642 1776 -16642 -12392 9992 5541 13679 8360
2866 8360 2096 4307 6203 4359 -2435 -18432 -30915 -15476 -14743 -15165 -6206 -3200 3920 7148 5153
2851 5153 72 -2453 -154 -10954 -2463 5095 -14242 -8611 -5545 -4076 -2507 -5178 -3720 2999
2837 2999 21542 18130 12286 7323 -12627 -33675 -26554 -18414 -15344 -6845 -18412 -8250 -4433 -7409
2823 -7409 -4806 -5478 -1857 -9947 -24737 -22344 -26157 -21600 -15796 -343 2027 -8999 -10681 1481
2809 1481 11561 -2761 -11566 -5369 -897 -49 4024 -2935 -19429 -18016 -19089 -13453 -16289 -21881
2795 -21881 -1066 -526 -1190 6085 -5696 -2780 -5297 -11994 -13761 -3499 4672 8326 15961 20264
2781 20264 17547 10695 24329 28374 21276 8812 1961 -4950 -5306 -8401 -2617 1356 -2525 -3036 -9610
2766 -9610 -3992 -390 -7753 -161 10549 15976 4185 2769 7316 -1107 -4054 -6065 -21193 -9889
2752 -9889 1820 7783 5388 2132 5124 9913 -7920 -6175 13005 1430 -17110 -6534 -5703 -10599
2738 -10599 -12991 -15360 -18866 -33273 -13866 -4064 1631 -795 -7440 -5194 7155 23144 18316 -1132
2724 -1132 6082 -386 -7523 -4686 -1484 345 -12876 -11947 -4523 9199 397 2508 447 -4894 -4219
2709 -4219 -1356 -7191 -8785 -14519 -16576 770 17488 848 -6550 2144 11769 2010 -7032 -18052
2695 -18052 -22315 -10105 -2568 3744 5305 -162 5247 14972 12503 5307 661 7900 4928 -14754
2681 -14754 -21553 -19007 -37342 -41279 -16280 -5145 -20391 -11938 -7088 -7015 -10766 -24361 -19495 -12854
2667 -12854 -17854 -13161 -17353 -24548 -26050 -22248 -5970 3485 13734 17816 14736 9992 -7234 -1548
2653 -1548 5160 19581 9134 282 1835 1500 8617 7210 -7219 -15910 3302 -1330 -15094 -8513
2639 -8513 -9439 -14362 -3432 2390 -3971 -3759 -6693 -3248 21416 36759 25554 17054 19802 23096
2625 23096 17747 12653 14943 28562 31845 35892 28622 3726 -13060 -11115 -4577 -3086 -2766 12278
2611 12278 25603 23315 28373 27478 11147 3627 1055 -10249 -3666 5983 6704 31 -12581 -4146
2597 -4146 -114 -2048 -769 -537 -14923 -20244 -10985 -15751 -19512 -11608 1152 3301 -9987 2660
2583 2660 10810 -15848 -15192 -995 6129 -2346 -16877 -5054 3522 6623 -3583 -3511 1845 5596
2569 5596 -1385 -11427 -15936 -11835 -13342 -2378 -2734 -2133 1075 9024 10737 13980 9892 2943 -2850
2554 -2850 -30478 -39664 -31706 -14391 690 5760 4906 1183 -4582 -18164 -16979 -9327 3419 12505
2540 12505 7211 -11906 -5394 7531 14015 15486 14449 1812 -5044 -21319 -22369 -1816 -4223
2527 -4223 -7753 14158 16481 9579 9774 7271 8642 11829 -2356 -5857 -11200 -7609 10054 19008
2513 19008 22248 21283 11461 -1238 -10698 -17800 8712 19192 17989 -14085 -29417 -24632 -6449
2500 -6449 -646 -7340 -3597 -4822 -9736 -8788 -3923 -1369 1879 11886 15421 19849 18585 13115 4110
2485 4110 2743 342 -9689 -6989 -2983 -9800 -13876 -15418 -6993 -586 -3659 8930 102 -15900
2471 -15900 -29280 -25127 -2731 -10442 -31477 -34985 -41351 -32961 -13691 9174 16130 7168 4200
2458 4200 8213 6388 -427 -739 2545 10735 13293 -1010 -8030 -5748 -2448 265 2299 2658 -5738
2443 -5738 -2386 6690 -2285 -24602 -18488 -9691 -6360 -5545 403 -5894 -14359 -12674 4831 20457
2429 20457 24672 26656 30193 28603 31732 28211 13417 6756 13251 15304 25280 23369 24145 26162 3402
2414 3402 -9217 -9139 -11226 909 3999 794 5203 12492 36429 45454 40445 32967 32323 45517 35099
2399 35099 14420 -9072 -26603 -21834 -11058 -618 14048 24154 12702 -3164 -11352 -15743
2387 -15743 -15738 -10527 -11451 -18303 -13884 -5516 11118 31597 19112 -3110 -492 -5900 5115 21990
2373 21990 16331 21994 8337 -2754 -6874 -1086 154 178 -3039 -8793 -11918 -3417 8061 4225
2359 4225 -5514 -2738 -3121 10097 8461 -6511 -8926 797 -4270 -5566 -592 4884 14001 -8455
2345 -8455 -18190 -22232 -13641 -990 14827 9135 -2033 13030 21012 24591 25607 21096 19616 -4642
2331 -4642 -30208 -40993 -21598 -19196 -12506 849 4967 -6879 -17757 -14710 -6427 -548 9784
2318 9784 23651 18271 18289 25664 20363 5439 632 3594 -7715 -15513 -227 9760 19502 11302
2304 11302 4938 7388 8149 -2360 -7353 -14010 -15306 -11533 -7293 -14363 1525 17102 15925 4604
2290 4604 545 -5103 -13068 -19527 -15096 -16173 -18610 -12877 -11357 -20084 -6862 -4715 -11839 -10693 3453
2275 3453 11802 12021 981 1297 10447 9753 8058 6686 2688 10189 8125 10169 20776 14421 7855
2260 7855 5434 -17177 -32241 -24959 -10638 -2191 -8178 -16292 -3410 -3298 -4669 -19756 -13599 -15003
2246 -15003 -17263 -1702 -461 -10448 -11473 -7486 -6581 7860 9037 7185 16493 14964 4625 16197
2232 16197 22461 20111 15092 8333 12257 3999 -13739 2163 17355 16735 7503 2218 -10785 -16567
2218 -16567 12680 20602 8389 10427 13922 6312 -5935 -13523 -5322 23 7239 4075 3778 1634
2204 1634 4682 6486 -5100 -21261 -21323 -10871 5657 22180 15706 21725 17642 19290 10251 14200
2190 14200 18172 10080 10107 25340 40626 46362 24534 10648 873 -1393 3241 13767 -5441 -19865
2176 -19865 -14403 -8940 -3332 4636 11612 18367 30521 29296 12020 -7526 -7264 4678 8926 5040
2162 5040 13399 23830 3918 19144 31361 36196 40473 51825 38423 30010 32061 17402 4131
2149 4131 952 3195 -2890 -4042 -4269 1644 -5943 -10687 -4579 4212 19345 37355 37991 18874 -415
2134 -415 4398 2224 12413 14740 1246 306 -1930 10718 2624 -4964 -2789 5931 -4153 -5560
2120 -5560 7346 28524 24228 24317 29884 26307 11828 1985 15456 17144 10993 9762 18232 17231
2106 17231 3360 -1460 -13411 -14621 -7662 2534 13200 21384 20858 15674 184 -15217 -10203
2093 -10203 -18370 -24644 -37141 -41845 -36286 -20299 -12628 -2858 9514 7256 -5010 -10155 -11729 -10998
2079 -10998 -17491 -13552 -18027 -16293 3609 13120 20387 28506 21695 4112 -6495 -6501 -13904 -14836 7007
2064 7007 23388 19742 -1958 -10768 -17684 -19523 -18112 -6930 -5826 -4111 -630 7567 5852 11501
2050 11501 16652 15692 26207 31209 21491 4761 2389 -4958 9805 12812 -2745 -7887 -4907 -10299
2036 -10299 -8817 -6170 313 -3218 -13428 -12408 -5912 6540 19719 8830 2651 2436 2096 -14114
2022 -14114 -17338 -17679 -4892 -17123 -12131 4134 -15416 -26590 -27416 -15064 -11418 -9267 -1997 9216
2008 9216 15254 7199 5690 9104 10657 -554 -13552 -10732 -7668 -2313 8648 9652 9555 -713
1994 -713 14 6763 9157 -4748 -3599 7964 2390 -12628 -20952 -30980 -26559 -18272 -5983 8669
1980 8669 11680 603 -3964 981 -13387 -14258 -16071 -11967 -13306 -11926 -14738 -12680 269 -18942
1966 -18942 -30705 -1575 16000 4042 -17044 -22908 -27433 -22997 -22172 -23853 -9398 -11969 -5877
1953 -5877 -5221 -10297 -22271 -20398 -13589 1745 9546 20086 22578 9310 -3169 -14105 -19150 -24173
1939 -24173 -6340 9918 12327 7832 8575 5535 1852 -4011 4557 6596 -2990 -7245 -7123 3698
1925 3698 4088 9866 23900 8736 7226 -2446 -7479 -14084 -6792 5707 10068 5418 1500 1841 20845
1910 20845 34940 29035 19989 15950 24244 24406 17051 17942 30700 27546 23336 15286 103 -13222
1896 -13222 -7400 -210 4468 8243 8693 -958 -13531 -18492 -28573 -19482 -19643 -22296 -23874 -23925 -21156
1881 -21156 -3555 12420 26779 28059 24071 -2340 -6937 1525 -15619 -10503 235 -3397 1914
1868 1914 518 -5609 -13934 -11148 -10371 6896 14178 9358 -2943 5670 9438 16694 19960 8815
1854 8815 -6960 -8483 -798 -7639 -14696 -2501 3164 17020 13130 10658 19769 15061 7016 6783
1840 6783 -9567 -3561 10479 10113 -4366 4792 21228 21910 4109 -24195 -28520 -19975 -9162 -5320
1826 -5320 693 3002 1057 -8831 -19740 -13209 6340 13160 19978 18240 6739 14422 12341 11396
1812 11396 8917 13420 15531 12572 4811 495 -2486 -8165 -10680 -3109 -739 -3440 -8958 -11883 -8790
1797 -8790 -3131 5712 700 6278 17276 23439 25825 22994 -2895 -15668 2997 -5528 1640 4303
1783 4303 -4820 -8951 -19242 -7707 4514 6383 9609 -2823 213 20297 38194 48253 50346
1770 50346 38655 17304 11393 25461 32471 15588 13759 18924 25803 26273 19896 8171 -12887
1757 -12887 -1278 16360 20584 20858 21202 23030 26040 17220 8664 6517 1294 -5486 2308 11523 3222
1742 3222 -7532 3025 4353 8235 7339 14578 5518 14978 8043 -725 -1086 8912 4435 4099 -7962
1727 -7962 -9120 -5598 -9871 13153 19003 23141 20714 16190 17811 10251 2177 -8510 -7386 -9261
1713 -9261 -15128 -2263 -1093 1180 2772 -7560 -976 -4375 2468 -2958 -10680 -11209 14450 22078
1699 22078 19605 19670 12257 14224 15337 16162 19515 12126 -6320 -14123 -4634 2432 9554 9298 14620
1684 14620 12584 3785 1483 6449 16882 13863 4394 -4221 -2712 -8570 4800 17377 25730 27844
1670 27844 33739 32478 33225 27492 24121 26956 26743 13462 12112 7601 7376 14917 25468 21517 10824
1655 10824 -7989 -3657 6361 24153 21576 16774 80 481 -5602 3202 16445 24994 20583 6647
1641 6647 14586 18425 1080 -5668 934 409 2014 -5477 -6204 -227 838 -11851 -14619 -16292 -18286
1626 -18286 -28049 -18239 -17656 -2072 4122 -1372 -14664 -17745 -2624 4818 -3972 -25104 -28963 -14959
1612 -14959 -3033 1179 4162 13550 10829 13862 13706 8973 8853 4166 4818 1541 5440 24258 30351
1597 30351 32524 19295 -4787 -1026 23073 12193 -1919 3380 14918 16346 8325 -10669 -18670
$$ [...]
##END NTUPLES=NMR SPECTRUM
##END=
