##TITLE=Analysis number 316300
Compound Code cc 46646
Book Reference 468/13
Project Code adrs
Chemist Name colinb
##JCAMPDX= 6.0         $$ Bruker NMR JCAMP-DX V2.0
##DATA TYPE= NMR SPECTRUM
##DATA CLASS= NTUPLES
##ORIGIN= Bruker BioSpin GmbH
##OWNER= nmr
$$ XWIN-NMR		Version 3.5
$$ Tue Jan 10 10:45:12 2006 GMT Standard Time (UT+0h)  MAYBRIDGE\nmr@NMR_250MHZ
##.OBSERVE FREQUENCY= 250.131544655141
##.OBSERVE NUCLEUS= ^1H
##.ACQUISITION MODE= SIMULTANEOUS (DQD)
##.ACQUISITION SCHEME= undefined
##.AVERAGES= 16
##.DIGITISER RES= 18
##SPECTROMETER/DATA SYSTEM= dpx250
##.PULSE SEQUENCE= zg30
##.SOLVENT NAME= CDCl3
##.SHIFT REFERENCE= (INTERNAL, CDCl3, 0, 16.522)
##AUDIT TRAIL= $$ (NUMBER, WHEN, WHO, WHERE, WHAT)
$$ ##TITLE= Audit trail, XWIN-NMR		Version 3.5
$$ ##JCAMPDX= 5.01
$$ ##ORIGIN= Bruker BioSpin GmbH
$$ ##OWNER= nmr
$$ C:\u/data/dgb/nmr/ADRS/14420/pdata/1/auditp.txt
$$ ##AUDIT TRAIL=  $$ (NUMBER, WHEN, WHO, WHERE, WHAT)
(   1,<2006-01-10 10:44:18.32 +000>,<MAYBRIDGE\nmr>,<NMR_250MHZ>,
      <created by zg, POWCHK disabled, PULCHK disabled
       configuration hash MD5:
       62 19 C7 07 E1 42 D1 B7 37 6C 3D D0 77 39 F9 E6
       data hash MD5: 64K
       2C 1E 3E 8B 03 36 A2 A2 CA 1C C1 48 9C AB 99 8C>)
(   2,<2006-01-10 10:44:41.82 +000>,<MAYBRIDGE\nmr>,<NMR_250MHZ>,
      <Start of raw data processing
       ef LB = 0.3 FT_mod = 6 PKNL = 1 SI = 32K 
       data hash MD5: 32K
       FE F2 2C 07 74 D5 6F 0D 10 8B 56 7A 2F D2 1E C4>)
(   3,<2006-01-10 10:44:46.07 +000>,<MAYBRIDGE\nmr>,<NMR_250MHZ>,
      <apk 
       data hash MD5: 32K
       37 29 4C E1 AD D3 7F 29 16 11 35 D7 A7 C1 63 2C>)
(   4,<2006-01-10 10:44:47.01 +000>,<MAYBRIDGE\nmr>,<NMR_250MHZ>,
      <abs ABSG = 5 
       data hash MD5: 32K
       64 A5 B6 01 C2 27 8B 89 9E DB B9 31 41 77 99 0A>)
$$ ##END=
$$ 
$$ hash MD5
$$ 39 F4 D4 7B 40 DF 64 E3 96 B4 18 38 FB A6 B6 E8
##$RELAX= 
##$RELAX= 
##$RELAX= 
##$RELAX= 
##$RELAX= 
##$RELAX= 
##$RELAX= 
$$ Bruker specific parameters
$$ --------------------------
##$DU= <C:\u>
##$EXPNO= 14420
##$NAME= <ADRS>
##$PROCNO= 1
##$TYPE= <nmr>
##$USER= <dgb>
##$AMP= (0..31)
100 100 100 100 100 100 100 100 100 100 100 100 100 100 100 100 100 100 
100 100 100 100 100 100 100 100 100 100 100 100 100 100 
##$AQSEQ= 0
##$AQ_mod= 3
##$AUNM= <au_zg>
##$AUTOPOS= <12 >
##$BF1= 250.13
##$BF2= 250.13
##$BF3= 250.13
##$BF4= 250.13
##$BF5= 500.13
##$BF6= 500.13
##$BF7= 500.13
##$BF8= 500.13
##$BYTORDA= 1
##$CFDGTYP= 0
##$CFRGTYP= 5
##$CHEMSTR= <none>
##$CNST= (0..31)
1 1 145 1 1 1 1 1 1 1 1 1 1 1 1 1 1 1 1 1 1 1 1 1 1 1 1 1 1 1 1 1 
##$CPDPRG= <>
##$CPDPRG1= <>
##$CPDPRG2= <>
##$CPDPRG3= <>
##$CPDPRG4= <mlev>
##$CPDPRG5= <mlev>
##$CPDPRG6= <mlev>
##$CPDPRG7= <mlev>
##$CPDPRG8= <mlev>
##$CPDPRGB= <>
##$CPDPRGT= <>
##$D= (0..31)
0 1 0 0 0 0 0 0 0 0.06 0 0 0 0 0 0 0.0002 0 0 0 0 0 0 0 0 0 0 0 0 0 0 
0 
##$DATE= 1136889855
##$DBL= (0..7)
120 120 120 120 120 120 120 120 
##$DBP= (0..7)
150 150 150 150 150 150 150 150 
##$DBP07= 0
##$DBPNAM0= <>
##$DBPNAM1= <>
$$ [...]
##$SUBNAM7= <"">
##$SUBNAM8= <"">
##$SUBNAM9= <"">
##$SW= 20.6930455092707
##$SWIBOX= (0..15)
0 0 3 0 0 0 0 0 0 0 0 0 0 0 0 0 
##$SW_h= 5175.983436853
##$TD= 65536
##$TD0= 1
##$TE= 294.16
##$TE2= 300
##$TE3= 300
##$TEG= 300
##$TL= (0..7)
0 120 120 120 120 120 120 120 
##$TP= (0..7)
150 150 150 150 150 150 150 150 
##$TP07= 0
##$TPNAME0= <>
##$TPNAME1= <>
##$TPNAME2= <>
##$TPNAME3= <>
##$TPNAME4= <>
##$TPNAME5= <>
##$TPNAME6= <>
##$TPNAME7= <>
##$TPOAL= (0..7)
0.5 0.5 0.5 0.5 0.5 0.5 0.5 0.5 
##$TPOFFS= (0..7)
0 0 0 0 0 0 0 0 
##$TUNHIN= 0
##$TUNHOUT= 0
##$TUNXOUT= 0
##$USERA1= <user>
##$USERA2= <user>
##$USERA3= <user>
##$USERA4= <user>
##$USERA5= <user>
##$V9= 5
##$VALIST= <valist>
##$VCLIST= <CCCCCCCCCCCCCCC>
##$VD= 0
##$VDLIST= <DDDDDDDDDDDDDDD>
##$VPLIST= <PPPPPPPPPPPPPPP>
##$VTLIST= <TTTTTTTTTTTTTTT>
##$WBST= 1024
##$WBSW= 4
##$XGAIN= (0..3)
0 0 0 0 
##$XL= 0
##$YL= 0
##$YMAX_a= 533845
##$YMIN_a= -404001
##$ZGOPTNS= <>
##$ZL1= 120
##$ZL2= 120
##$ZL3= 120
##$ZL4= 120
##$ABSF1= 16.522
##$ABSF2= -4.171173
##$ABSG= 5
##$ABSL= 3
##$ALPHA= 0
##$AQORDER= 0
##$ASSFAC= 0
##$ASSFACI= 0
##$ASSFACX= 0
##$ASSWID= 0
##$AUNMP= <proc_1d>
##$AZFE= 0.1
##$AZFW= 0.1
##$BCFW= 0
##$BC_mod= 0
##$BYTORDP= 0
##$COROFFS= 0
##$CY= 12.5
##$DATMOD= 1
##$DC= 0
##$DFILT= <>
##$DTYPP= 0
##$F1P= 14.0000005364418
##$F2P= -0.99999901652339
##$FCOR= 0.5
##$FTSIZE= 32768
##$FT_mod= 6
##$GAMMA= 0
##$GB= 0
##$INTBC= 1
##$INTSCL= 1
##$ISEN= 128
##$LB= 0.3
##$LEV0= 0
##$LPBIN= 0
##$MAXI= 10000
##$MC2= 0
##$MEAN= 0
##$ME_mod= 0
##$MI= 0
##$NCOEF= 0
##$NC_proc= -3
##$NLEV= 6
##$NOISF1= 0
##$NOISF2= 0
##$NSP= 0
##$NTH_PI= 0
##$NZP= 0
##$OFFSET= 16.522
##$PC= 1
##$PHC0= 83.67516
##$PHC1= 4.116411
##$PH_mod= 1
##$PKNL= yes
##$PPARMOD= 0
##$PSCAL= 4
##$PSIGN= 0
##$REVERSE= no
##$SF= 250.13
##$SI= 32768
##$SIGF1= 0
##$SIGF2= 0
##$SINO= 400
##$SIOLD= 32768
##$SREGLST= <1H.CDCl3>
##$SSB= 0
##$STSI= 32768
##$STSR= 0
##$SW_p= 5175.98343685301
##$SYMM= 0
##$S_DEV= 0
##$TDeff= 65536
##$TDoff= 0
##$TI= <Analysis number 999999
Compound Code 99
Book Reference 9
Project Code 9>
##$TILT= no
##$TM1= 0
##$TM2= 0
##$TOPLEV= 0
##$USERP1= <user>
##$USERP2= <user>
##$USERP3= <user>
##$USERP4= <user>
##$USERP5= <user>
##$WDW= 1
##$XDIM= 32768
##$YMAX_p= 485129623
##$YMIN_p= -69087
$$ End of Bruker specific parameters
$$ ---------------------------------
##NTUPLES= NMR SPECTRUM
##VAR_NAME=  FREQUENCY,     SPECTRUM/REAL,   SPECTRUM/IMAG
##SYMBOL=    X,             R,               I
##VAR_TYPE=  INDEPENDENT,   DEPENDENT,       DEPENDENT
##VAR_FORM=  AFFN,          ASDF,            ASDF
##VAR_DIM=   32768,         32768,           32768
##UNITS=     HZ,            ARBITRARY UNITS, ARBITRARY UNITS
##FACTOR=    0.157963299565203, 1,           1
##FIRST=     4132.6476996994, 0,             0
##LAST=      -1043.33573715361, 0,           0
##MIN=       -1043.33573715361, -69087,      0
##MAX=       4132.6476996994, 485129623,     0
$$ Real data points
##PAGE= N=1
##DATA TABLE= (X++(R..R)), XYDATA
$$ [...]
16776B98208k7305l8308j3229L704q027j5765j0256k337k845O762n756j5128n943
16763A63775K785k656m809o678j069K744R051n558J843j078r419L755j6925k4822
16749A10939j969J6652R832K4789J8300K7181M1603M5154M4715L2899K5940k1283
16737C74752l1923m3077o0473n1007k9085k9634j6539q606l576j1260j5538o192
16725F7842j031L706J533q995n163o048j7019j1320k99k753J4642N36l928J161
16711C2864k786k192J9535J4446j529j3647k499j2005N5N17O999q234m479r92
16697B6053j882m78m332J2083j327q6p845k017K285r43L570l132M578O984J5354
16682D8865J9469J6380J2305L673j9511j3808k3566k1188p223n039R906L001p62
$$ plain form
16776 298208 270903 232595 219366 223070 215043 199278 189022 186685 183840 190602 184846 169718 163775
16763 163775 166560 163904 159095 152417 151348 154092 163143 157585 159428 158350 148931 152686 135761 110939
16749 110939 108970 125622 135454 160243 178543 205724 247327 292481 337196 370095 396035 374752
16737 374752 342829 299752 239279 188272 159187 129553 113014 104408 100832 89572 74034 67842
16725 67842 66811 70517 72050 63055 57892 51844 34825 23505 23206 20453 35095 35631 31703 32864
16711 32864 30078 27886 47421 61867 60338 46691 44192 32187 32242 32759 39758 31524 27045 26053
16697 26053 24171 23693 19361 31444 30117 30031 22186 20169 22454 21511 25081 21949 26527 33511 48865
16682 48865 68334 84714 97019 100692 81181 67373 43807 22619 15396 10357 20263 23264 22502
16669B2502J4177R113p257l584k535J0027j921j3024J1374L136O903p535J446
16656D2822j1115j1917r382o346r598J120J4014J5247N744j0704K608M748j7011
16643A0230K476J503J0583R52j3077j7557k829J892K724N539m955o504J7381K319
16629A0677j855m937o765k745K204l334n908O536o563j794K276n05n869o222j683
16614b6487l384J784M891j779J2180M570k539L952n601o22L566p85o106j9087
16600c5447K434J4978J1713Q722J4140J748j818k572P490P123n949R203j3742
16587A8023j1351k803k211K431q949K898J1946L417j7005j9069K34Q158N001P394
16573a886m194N489K689L79N866l013p138m136J3514Q603n772N528N114j1625
$$ plain form
16669 22502 36679 45792 38535 34951 32416 42443 40522 27498 38872 42008 48911 41376 42822
16656 42822 31707 19790 10408 4062 -5536 -4416 9598 24845 30589 19885 22493 27241 10230
16643 10230 12706 14209 24792 25744 12667 -4890 -7719 -5827 -3103 2436 -2519 -9023 8358 10677
16629 10677 8822 3885 -2880 -5625 -3421 -6755 -12663 -6127 -12690 -14484 -12208 -12713 -18582 -24804 -26487
16614 -26487 -29871 -28087 -23196 -24975 -12795 -8225 -10764 -6812 -12413 -13035 -9469 -10254 -16360 -35447
16600 -35447 -33013 -18035 -6322 2400 16540 18288 16470 13898 21388 28511 22562 31765 18023
16587 18023 6672 3869 1658 4089 -4860 -1962 9984 13401 -3604 -22673 -22439 -14281 -9280 -1886
16573 -1886 -6080 -591 2098 2477 8343 5330 -1808 -5944 7570 16173 10401 15929 21043 9418
16559I418j4566o347M816K205p602J500O355K331K332L060q128o037Q670K0569
16545A8576O098j5741R044m797l195K113k743L771j109p797j3398R877L333J6251
16531B0283K789J0840n4j2843j4232J0696J995p860j7226j4363l710O747q4q554
16517b5576q750n521M067J4488O793r466K946O597r25n820k605k593N016J3085
16503h264l561j2529m843M908o422M906N349J237n0O024j043m086r272J933N609
16488b0104J5489J1315J1846j0804j3109n331K5J2853M712K989q491p486r01P046
16474D9L554J1756k920o895m656q49j5396L135P503n813J0095m460m006J165Q89
16459f849N359o658m291J0533l720k906N50J215q940J4575J485j8928r786R042
$$ plain form
16559 9418 -5148 -11495 -6679 -4474 -12076 -10576 -4221 -1890 442 3502 -4626 -10663 -1993 18576
16545 18576 24674 8933 17977 13180 9985 12098 9355 13126 12017 4220 -9178 699 4032 20283
16531 20283 23072 33912 33858 21015 6783 17479 19474 11614 -5612 -19975 -23685 -16938 -17022 -25576
16517 -25576 -34326 -39847 -35780 -21292 -14499 -23965 -21019 -14422 -15347 -21167 -23772 -26365 -21349 -8264
16503 -8264 -11825 -24354 -29197 -24289 -30711 -25805 -20456 -19219 -19269 -13245 -14288 -18374 -27646 -25713 -20104
16488 -20104 -4615 6700 18546 7742 -5367 -10698 -10673 2180 6892 9881 1390 -6096 -6997 49
16474 49 3603 15359 12439 5544 888 39 -15357 -12222 -4719 -10532 -437 -4897 -8903 -7738 -6849
16459 -6849 -1490 -8148 -12439 -1906 -5626 -8532 -7982 -6767 -15707 -1132 353 -18575 -28361 -19319
16445a9319J7879Q269n633r395q874k763o15O23m149L605m281m038L1884J4606
16431A7799k6376n447j5569l886J1040L097R088n93n284q154K931Q433k38n930
16417a9089N860o394J880P960R37K144m135M545n583r966N107M483J1996N059
16403D804j6318p488j197l528o568P176j084J7011N797k0493k353K0652J235j443
16389c797j6369r848R704j4000l610P575J8908J867l946O281J207q988l029j4449
16375c2494O966j354J849J9335j6987q338o013P283K615L612J2450o723n05K5421
16361G117O062j6821j0993o177j5161K883M013J0098n770N500P355m644n236m052
16347b5826L675k337k505l41J0899J0646l720n250J3014J1009J7905j2554j0863
$$ plain form
16445 -19319 -1440 6829 1196 -8199 -17073 -19836 -20451 -19828 -23977 -20372 -24653 -28691 3193 17799
16431 17799 -8577 -14024 -29593 -33479 -22439 -19342 -10254 -10847 -16131 -24285 -21354 -12921 -13159 -19089
16417 -19089 -13229 -19623 -17743 -9783 -8846 -6702 -10837 -6292 -11875 -21841 -16734 -12251 -255 4804
16403 4804 -11514 -19002 -20199 -23727 -30295 -23119 -24203 -7192 -1395 -21888 -24241 -3589 -2354 -3797
16389 -3797 -20166 -30014 -20310 -34310 -37920 -30345 -11437 -9570 -13516 -7235 -6028 -15016 -18045 -32494
16375 -32494 -25528 -26882 -25033 -5698 -22685 -31023 -37036 -29753 -27138 -23526 -11076 -17799 -18304 7117
16361 7117 13179 -3642 -14635 -20812 -35973 -33090 -29077 -18979 -24749 -19249 -11894 -16538 -21774 -25826
16347 -25826 -22151 -24488 -26993 -27334 -16435 -5789 -9509 -14759 -1745 9264 27169 14615 3752
16334C752q487o965O450j43j192n47l205m845L168N347K342l07O71R397l473q074
16318f111L762R241O447r088m370l247Q223j7624j5405J6032Q688P518j2745r611
16304a8290k189J1682J0485N336q410r554O496L161R86L895N111J428J2154J5414
16290C7705J5909K4690J1964K9160N9074Q0477Q0640N3157N6203O6784K1712m7010
16278D90465o4184n9293o3798o9407p5450m6696l4620j8323j8356r055p013K139
16266B6409Q091j5736p3j2345j1260m064P503R287j5880o635p08K817R018p95
16252d371m19J450J2594l852j1719m566J565r05j974O885o193o046O96J6114K057
16237A316r539j1954k56M438J0416l49q771r469P707M522M414J927k277J273j0148
$$ plain form
16334 3752 -4735 -11700 -5250 -5393 -6585 -7132 -10337 -15182 -12014 -6667 -4325 -4632 -3961 5436 1963 -6111
16318 -6111 -2349 6892 13339 4251 -119 -3366 4857 -12767 -28172 -12140 -3452 4066 -8679 -18290
16304 -18290 -20479 -8797 1688 7024 -1386 -10940 -4444 -1283 -297 3598 8709 10137 22291 37705
16290 37705 53614 78304 90268 119428 178502 258979 339619 392776 448979 515763 537475 490465
16278 490465 426281 366988 303190 233783 158333 111637 77017 58694 40338 31283 24270 26409
16266 26409 34500 18764 18691 6346 -4914 -8978 -1475 7812 -8068 -14703 -15411 -12594 -3576 -4371
16252 -4371 -4790 -3340 9254 5402 -6317 -10883 -9318 -10223 -12197 -5312 -11505 -17551 -16855 -741 1316
16237 1316 -8223 -20177 -20433 -15995 -5579 -5928 -14699 -24168 -16461 -11939 -7525 -5598 -7875 -6602 -16750
16222a6750J986K264J83l108J053J7132J1534j5846J647r409P06J033J0561Q294
16208A1280j7301k088K976o513L158n627j403l0P193K1523N265m608k024n686
16194F115J0468n727j2728o077q985j770J1189J0546o629N794L568l584j989n570
16180e379m221j4109l66K710j6787L001M985R874M305j2016R846J2826Q137m35
16166B371q899r814j1765r606J1314R204N687Q703P472J3911K080n923P64j0150
16152E349k1943n665J726j465J5983J2777o539n6K706j1960o341P214L263j1976
16138a6927j0222o02j048O229o749K18j653R118j228j2206J1469K048n178p566
16124c4297Q3n72J2915J1720p445l733R871J0755K942j0359j3684j7858l040M583
$$ plain form
16222 -16750 -14764 -12500 -12317 -15425 -14372 2760 14294 -1552 95 -9314 -8608 -7575 2986 11280
16208 11280 -6021 -8109 -5133 -11646 -8488 -14115 -15518 -15548 -8355 13168 18433 13825 11801 6115
16194 6115 16583 10856 -1872 -7949 -16934 -18704 -7515 3031 -3598 2196 5764 2180 191 -5379
16180 -5379 -9600 -23709 -24075 -21365 -38152 -35151 -30166 -20292 -15987 -28003 -18157 -5331 2806 2371
16166 2371 -6528 -16342 -28107 -37713 -26399 -17195 -11508 -2805 4667 18578 20658 14735 15499 5349
16152 5349 -16594 -22259 -20533 -21998 -6015 6762 223 167 2873 -9087 -15428 -8214 -4951 -16927
16138 -16927 -27149 -27751 -28799 -22570 -29319 -29101 -30754 -21636 -22864 -35070 -23601 -21553 -26731 -34297
16124 -34297 -34214 -34786 -21871 -10151 -17596 -21329 -11458 -703 2239 -8120 -21804 -39662 -42702 -38119
16110c8119J7785N174n029J344J8057j600R02M746J879o358l666J8628J38j3111
16096G70j2278L239L273N312O065j2257j0897P234R061j4259K647k441O04N523
16082h404l061j4357p186Q254J873J396j853M529K2002J696N595m387m564p444
16068e911N172k798L031K181o774l663j2411K658k302L105l235L825m840j0628
16054c2590P446J8082L623j94N383j1768O144J5536j4887J115J3013r727k2541
16041b1365j2227l189K545J462J7772J8691L564J450j3197n610J1337L597J784
16028F614j7936q613m08r638k052J986J0516l676L221j0094j290J1187O173R163
16014d847N403j6787o974j1492q033J0120J9719O020J0181J2840l113p208n263
$$ plain form
16110 -38119 -20334 -15160 -20189 -18845 -788 -2388 -1486 3260 5139 -1219 -4885 13743 13881 770
16096 770 -11508 -8269 -4996 316 6381 -5876 -16773 -9539 -478 -14737 -12090 -14531 -13927 -8404
16082 -8404 -11465 -25822 -33008 -24754 -22881 -21485 -23338 -18809 3193 4889 10484 6097 1533 -5911
16068 -5911 -739 -3537 -506 1675 -5099 -8762 -21173 -18515 -20817 -17712 -20947 -17122 -21962 -32590
16054 -32590 -25144 -7062 -3439 -3633 1750 -10018 -3874 11662 -3225 -2110 10903 1176 -21365
16041 -21365 -33592 -36781 -34236 -32774 -15002 3689 7253 8703 -4494 -10104 1233 4830 6614
16028 6614 -11322 -19935 -20343 -29981 -32033 -30047 -19531 -23207 -19986 -30080 -31370 -20183 -14010 -4847
16014 -4847 556 -16231 -23205 -34697 -42730 -32610 -12891 -6871 3310 16150 13037 5829 566
16001E66K599J800m237j4466N417J3579l205j4314j1686q075J0449J8151J5742
15988A2320m975r155l001n210K711K955R647M794p836j006j2439o377M869J0293
15974b410k711k0533R837N250j1431K687Q448J496M683j075k623l129N26J1988
15960A003R740R342l606j0977j1218j303m219n023j655J081l45n291j827q515
15946c2813n526P475J5697K1314q715j0600L280P001p971j3360R504P704p793
15933a4803l89k688P006J1049O75o393j8006n354K636J1866J3458j555q065j6384
15919b6947N670O811J274J0199j451j2338j2712L535M418Q476O499M081J232K649
15905A396j4226l115L097j154J0950l007Q736J2677K466l818j2616l188l37j1875
$$ plain form
16001 566 3165 4965 728 -13738 -8321 5258 2053 -12261 -23947 -32022 -21573 -3422 12320
15988 12320 7345 -1810 -4811 -10021 -7310 -4355 5292 10086 2250 1244 -11195 -17572 -12703 -2410
15974 -2410 -5121 -25654 -15817 -10567 -21998 -19311 -10863 -9367 -4684 -5759 -8382 -11511 -10985 1003
15960 1003 10743 20085 16479 5502 -5716 -7019 -11238 -16261 -17916 -16835 -17180 -22471 -24298 -32813
15946 -32813 -38339 -30864 -15167 6147 -2568 -13168 -9888 -2887 -10858 -24218 -14714 -7010 -14803
15933 -14803 -15192 -17880 -10874 175 850 -5543 -23549 -28903 -26267 -14401 -943 -2498 -10563 -26947
15919 -26947 -21277 -14466 -13192 -2993 -4444 -16782 -29494 -25959 -21541 -13065 -6566 -2485 -1253 1396
15905 1396 -12830 -15945 -12848 -14002 -3052 -6059 2677 15354 17820 14002 1386 -1802 -2139 -14014
15891a4014J0256O17Q411J0207j1977N558J9124R9n246j2326j6114j79l387j9972
15877b8943K3Q235J0138k48O070Q28r89L310J883j0871J601K772J3207p117r215
15862i316O168r550M729J0572n319j930K775k509K377n883j196q254l606O46q3
15847b0379L443M261m113n403l642J1223J0078N263j030k191M003k561o025o564
15833a3637L740Q654Q22m363N62L740k763m559p048j3282O778R446o564O457O182
15818e835N638j276M137r694o213L631R577o306l46P832N33j6941j0766l479J1547
15803a7961J2358J904N549m984r313j1447Q160L048O062r951k641j701L386P641
15789i890p149j780Q469L945j160R026R91j15N653q770j6494q456Q121R905P074
$$ plain form
15891 -14014 -3758 -3141 5270 15477 3500 9058 28182 28281 23035 10709 -5405 -5584 -8971 -28943
15877 -28943 -28920 -20685 -10547 -10795 -4725 -3897 -4886 -1576 307 -10564 -8963 -6191 7016 -101 -9316
15862 -9316 -3148 -12698 -7969 2603 -2716 -4646 -1871 -4380 -2003 -7886 -9082 -17336 -20942 -20296 -20379
15847 -20379 -16936 -12675 -16788 -22191 -25833 -14610 -4532 731 -299 -2490 1513 -1048 -7073 -13637
15833 -13637 -9897 -1243 -421 -4784 -4222 -482 -3245 -7804 -14852 -28134 -21356 -11910 -18474 -12017 -5835
15818 -5835 -197 -1473 2664 -7030 -13243 -9612 -35 -6341 -6687 1145 1678 -15263 -26029 -29508 -17961
15803 -17961 -5603 -3699 1850 -3134 -12447 -23894 -15734 -12686 -6624 -16575 -19216 -20917 -17531 -9890
15789 -9890 -17039 -18819 -10350 -6405 -7565 1461 2452 2337 7990 -780 -17274 -25730 -17609 -7704 -630
15774f30j1448j056J2627O780M923j6613M846q79j7663m502L795J5687M126j0916
15760a0923M612Q286M542j8651P548M211L408j132j335O298m49r387M296Q976
15746A0300J077n089L008m845R86Q347J2616l433p244j5483j6196o417K774O488
15732a3111J357j0220N824R529m661L994J6350k51j1759p65m537k513m275m402
15718a9440l096K08m040J2139L199n229r666k806P06L524Q021J6345K1639q27
15704B0677j7847j7137k2603J82K4433K1697j2138q833j7073k260l621l895J1361
15691b7057K4561L023N622N430m963L558J1844o318l506l050q165r44p378j1449
15677a8792L04J1394K478K686L73j839J333L579l225J638M625R473l304j3562
$$ plain form
15774 -630 -12078 -13134 -507 6273 11196 -5417 -571 -1450 -19113 -23615 -19820 -4133 -7 -10923
15760 -10923 -6311 1975 6517 -12134 -4586 -375 3033 1901 566 6864 6415 -2972 1324 10300
15746 10300 11377 6288 9296 4451 5437 13784 26400 22967 15723 240 -15956 -22373 -19599 -13111
15732 -13111 -11754 -21974 -16150 -6621 -11282 -7288 9062 8811 -2948 -3713 -8250 -10763 -15038 -19440
15718 -19440 -22536 -22328 -26368 -14229 -11030 -16259 -25925 -28731 -28025 -24501 -16480 -135 21504 20677
15704 20677 2830 -14307 -36910 -36728 -12295 9402 -2736 -11569 -28642 -30902 -34523 -38418 -27057
15691 -27057 -2496 527 6149 11579 6616 10174 22018 15700 12194 9144 979 35 -7343 -18792
15677 -18792 -18488 -7094 -4616 -1930 -1557 -3396 -2063 1516 -1709 -71 4554 14027 10723 -2839
15663b839O288J1762p214Q592M919j0691j1629M064J0328q542r867Q119J3289
15650A6579j863j6217j9598l183M923j1942K990P657k198M579J4141L098j0592
15637a1626L11R116L650J953m681j962M132j0396k605m629J8581n296m156j5019
15623b2627J674j2216j271J6175O696J1859k985J842m297m567J0347K672q39j381
15609A082n302R78n207q137l901J1487M882l627j777L619o834p193J4432J9094
15595A3596P156k3223j8854J4114Q580j0434k496k087m590m520J1348O924j0115
15582a4601j3546J0519J1016L534o032r30O7O690o702n955J2764j5600q668O696
15568b0748N104N227k093N552j4588M804R776P135o560P384J8182q937k2916r99
$$ plain form
15663 -2839 3449 15211 7997 16589 21508 10817 -812 3252 13580 5038 -4829 3290 16579
15650 16579 14716 -1501 -21099 -24282 -19359 -31301 -28311 -20654 -22852 -18273 -4132 -1034 -11626
15637 -11626 -11315 -2199 1451 3404 -1277 -3239 893 -9503 -12108 -16737 1844 -3452 -7608 -22627
15623 -22627 -20953 -33169 -34440 -18265 -11569 290 -2695 -853 -5150 -9717 630 3302 2463 1082
15609 1082 -4220 -3242 -8449 -16586 -20487 -9000 -4118 -7745 -9522 -5903 -12737 -19930 -5498 13596
15595 13596 20752 -2471 -21325 -7211 1369 -9065 -11561 -13648 -18238 -22758 -11410 -4486 -14601
15582 -14601 -28147 -17628 -6612 -3078 -9110 -10040 -9973 -3283 -9985 -15940 -3176 -18776 -27444 -20748
15568 -20748 -15644 -10417 -12510 -6958 -21546 -16742 -6966 169 -6391 993 19175 10238 -12678 -13677
15554a3677K904k742P299J5654j083j8238j2367k07Q682J2815N771j679R150P140
15540A9422L483p024j0890p492j2003L054J3421J7626J1144j641j0287j0757k882
15527E174q015m49J0729Q084P250R339m629k3926j0047P349l929j7847p343J7244
15513a1016L809N459N009n680K89q568k198J0656P643K944j3191l731k2447p036
15499c8058J819J0287J7997l490j5552M260k558k998J0841J290q50J9847J489
15486D324q592m703O203k77P082N357o910p169M214J083j3114J2789O192o039
15472D40M392j0353j8782j424J2202K945K803L87p945O834N501m312M337L688
15458G13o631j109J1894J138q116j0465j1717j750O584J639k844J67J5309M569
$$ plain form
15554 -13677 -10773 -13515 -6216 9438 8355 -9883 -22250 -22457 -13775 -960 4811 3132 12282 19422
15540 19422 22905 15881 4991 -2501 -14504 -11450 1971 19597 30741 29100 18813 8056 5174
15527 5174 -2841 -3290 7439 15523 22773 32112 27483 3557 -6490 859 -3070 -20917 -28260 -11016
15513 -11016 -7207 -1748 3261 -2419 -2130 -10698 -12896 -2240 5403 8347 -4844 -8575 -31022 -38058
15499 -38058 -36239 -25952 -7955 -11445 -26997 -22737 -25295 -28293 -17452 -16162 -17012 2835 4324
15486 4324 -4268 -8971 -2768 -3045 4037 9394 2484 -4685 -471 612 -12502 287 6479 440
15472 440 4832 -5521 -24303 -25727 -13525 -10580 -7777 -7390 -15335 -8501 -3000 -7312 -2975 713
15458 713 -5918 -7027 4867 6005 -2111 -12576 -24293 -26043 -19459 -17820 -20664 -20497 -5188 -619
15444f19O369m616j422l578J493o754J224m268N810j644L46L275j0127k484J1003
15429e992j394j0679k642J5501M834M526j2362J678M492o078p452K237n468J4129
15415d670N194j1056q837M711j2386J0078N009j264j0818J1683J571m135R813
15402e107J667N293N219J106n95l961j0999K458L273r053j4919n541J1713J936
15388a7510P591M278r727j4939j1120J5184P496j512N626M113l625L058P646J6328
15374A2887j831n056j7972o362o013P834K2221O987j2828n938N082N556N922p859
15360B630n937p831K201m743J3150O578j4563n137J033R163L930M921k704K284
15346D975q405M54K788n208o033n23j1078j630N751P933J4574K556q735j6286
$$ plain form
15444 -619 5750 1134 -288 -3866 -2373 -9127 -7903 -12171 -6361 -8005 -7659 -4384 -14511 -16995 -5992
15429 -5992 -7386 -18065 -20707 -5206 -372 4154 -8208 -6530 -2038 -8116 -15568 -13331 -18799 -4670
15415 -4670 524 -10532 -19369 -14658 -27044 -16966 -11957 -13221 -24039 -12356 -10785 -14920 -5107
15402 -5107 -3440 1853 7072 8178 7583 3622 -7377 -4919 -1646 -10699 -25618 -31159 -19446 -17510
15388 -17510 -9919 -5641 -15368 -30307 -41427 -26243 -18747 -20259 -14633 -10520 -14145 -11087 -3441 12887
15374 12887 11056 6000 -11972 -18334 -24347 -16513 5708 12695 -133 -6071 -989 4567 10489 2630
15360 2630 -3307 -11138 -8937 -13680 -530 6048 -8515 -13652 -12619 -3456 474 5395 2691 4975
15346 4975 -3430 -2976 -188 -5396 -11429 -11952 -23030 -24660 -18909 -10976 3598 6154 -2581 -18867
15332a8867r045J1438J9820o12n88n155q079j782q678o079j622K884q061j314
15318c5740J1879J3186K469J61q426j0898R453J6287k895m588K897k707q425n807
15304b3154m91O587M24J1377Q078R425K525m785r771p405j474M096j7617l49Q32
15289b1702L694L59P693J510J485j7260m664J5844J211r346R046O58m158P443
15275h187M472m513k273k251l163R84O290J714M88n865p767l425P320Q784k2761
15260c0153l787L886K2011O049r452j3670J0605J6273m553m662j085m324m724
15247a7586n952M6J5010P590n761p133J5649M795o458n2j409j2769k474J1324
15233e180j802m91P535k001m825P327m773j1248L091n386n616j1771k885P322
$$ plain form
15332 -18867 -27912 -16474 3346 2734 2146 -3009 -11088 -12870 -21548 -27627 -29249 -26365 -34426 -35740
15318 -35740 -23861 -10675 -8206 -8045 -16471 -27369 -17916 -1629 -4524 -9112 -6215 -8922 -17347 -23154
15304 -23154 -23645 -17058 -16634 -5257 2821 12246 14771 9986 215 -7190 -8664 -4568 -22185 -22534 -21702
15289 -21702 -18008 -17649 -9956 -8446 -6961 -24221 -28885 -13041 -11830 -21176 -12130 -11472 -15630 -8187
15275 -8187 -3715 -8228 -10501 -12752 -15915 -14931 -8641 -6927 -6439 -12304 -20071 -23496 -16176 -7392 -30153
15260 -30153 -33940 -30054 -8043 -1994 -11446 -25116 -14511 1762 -2791 -7453 -8538 -12862 -17586
15247 -17586 -23538 -23492 -8482 -892 -6653 -13786 1863 6658 200 148 -1261 -14030 -16504 -5180
15233 -5180 -6982 -7473 62 -1939 -6764 563 -4210 -15458 -12367 -17753 -23369 -35140 -38025 -30703
15219c0703Q456L598k567l27R904J6399L498q085o850N402o456k094M716l175
15205h284N453J0742M300J0p361Q14J037k84r65q375m710N314R875m514J1685
15190A4737O95j3238q78R79l115m468j4804m559j505m016k19M317J4325L818o559
15175a4490n796K6708J5434j1308j8822M949J1341N61P801O84j3950j2858q415
15162a8161N43M771J0756l885l138r533m434M592J2012R133k928N310m394k263
15148a619j9312j710M162K229k583j3052J1426J9730Q028n121j3220m335L389
15135a1988j1458p820J954N348n162Q306m839m224L47L238J0465J3294m342j5753
15121b2634R72J6744N273N485J552p720m145k676o14k962k784L681j3290k248
$$ plain form
15219 -30703 -22247 -18649 -21216 -21543 -11639 4760 8258 173 -6677 -1275 -7731 -9825 -5109 -8284
15205 -8284 -2831 7911 12211 12221 4860 5674 6711 6427 5462 -2913 -7623 -2309 7566 3052 14737
15190 14737 15432 2194 1316 2295 -820 -5288 -20092 -24651 -26156 -30172 -30391 -26074 -11749 -7931 -14490
15175 -14490 -20286 6422 21856 10548 -8274 -3325 8016 8577 16378 17062 3112 -9746 -18161
15162 -18161 -17618 -12847 -2091 -5976 -9114 -18647 -23081 -18489 -6477 2656 -272 5038 644 -1619
15148 -1619 -20931 -22641 -18479 -16250 -18833 -31885 -20459 -729 7299 2178 -11042 -15377 -11988
15135 -11988 -23446 -31266 -29312 -23964 -29126 -20820 -25659 -29883 -29536 -26298 -15833 -2539 -6881 -22634
15121 -22634 -21662 -4918 355 5840 7392 -328 -4473 -7149 -7763 -10725 -13509 -9828 -23118 -25366
15107b5366N752m240J183k535P336M508l617J465J3702j2121q637q268J663L259
15093b5916j0845J3422O552m35L238o488J7092J3552r547q258n260n686j1280
15080b9859L525Q841O741j3808J2067J1151P741j567K220m736J1000N181j6562
15067A935r299L948j7539M043J2714m095k4232Q260P097k22J0142R267n679L888
15053B28J914M149K66N070L529n899j4116k611J786J182m25J173P014p190J0147
15038F217n244J2034L4418M2254J2323j7326o6396n4912M968J5946P815M260k759
15025f402K006l706j563L011J0239j269Q06l958m28M60p450n816J254J2557J5192
15010A4933P71N555J6805Q145r103p085j3857J3622J2803O586O598N787K328M471
$$ plain form
15107 -25366 -19614 -23854 -22671 -25206 -17870 -13362 -16979 -15514 -1812 -13933 -22570 -30838 -29175 -25916
15093 -25916 -36761 -23339 -16787 -17222 -13984 -20472 -3380 10172 625 -7633 -12893 -18579 -29859
15080 -29859 -26334 -17493 -10752 -24560 -12493 -1342 6399 4832 7052 2316 13316 18497 1935
15067 1935 -7364 -3416 -20955 -16912 -4198 -8293 -32525 -24265 -17168 -17390 -7248 2019 -3660 228
15053 228 2142 6291 6557 11627 15156 9257 -4859 -7470 -5684 -4502 -4927 -3754 3260 -3930 6217
15038 6217 973 13007 47425 89679 102002 84676 18280 -36632 -31664 -15718 -7903 -3643 -6402
15025 -6402 -4396 -8102 -9665 -6654 3585 2316 3122 -836 -1264 -804 -8254 -14070 -12816 -259 14933
15010 14933 15704 21259 38064 46209 37106 30021 16164 29786 42589 49175 55773 61560 63888 68359
14996F8359J9202J5490J5031J7522K5714K3239L9414N7739R0724J21726J98150
14985F92310L92961P66680J289843Q27873o91648j010234q29579n54464l12432
14976E71310j91250j17109p4614n0795k3281r834j0854k1705j4102j7244m202
14965C6320K257k129L745o992l158n934n742j0836j2984m908K659n784M110l803
14951a3179L044N508j446NO229n559J184J0628q102Q543R438p531N630j43k667
14936A1582J783m756p359N89q48k562l618J3058K0015j312j9313P513Q092K011
14922B4875j219k595j061k729j5943j0314M308Q944j227k80k889l170O511j3J341
14907D539q824o1n014J566k472J1370o677m467j577N225Q867j576p183k114k277
$$ plain form
14996 68359 87561 103051 118082 135604 161318 184557 223971 281710 372434 494160 692310
14985 692310 1085271 1851951 3141794 3969667 3278019 2267785 1438206 883742 571310
14976 571310 380060 262951 188337 137542 114261 104427 93573 71868 57766 40522 36320
14965 36320 38577 36448 40193 33201 30043 24109 18367 7531 -5453 -10361 -7702 -13486 -9376 -13179
14951 -13179 -10135 -4627 -6073 -6068 161 -5398 -4214 6414 -1688 6855 16293 8762 14392 14249 11582
14936 11582 13365 8609 1250 1839 991 -1571 -5189 7869 27884 26572 7259 14772 22864 24875
14922 24875 23656 21061 20000 17271 1328 -8986 -4678 4266 3039 2759 -130 -3300 3211 3198 4539
14907 4539 -4285 -4346 -9360 -7794 -10266 1104 -5573 -10040 -11617 -6392 2475 899 -6284 -8398 -10675
14892a0675J0144n778R30J012P880m19R0l982l92K595j238r872j2144O011l423
14877a9261o27m210j09p922l348o777M713R977J1100o847M565p174O871N103M401
14862i545J3284m72R27r738J51P801O399M008L627o911m023k188L134j6452j057
14847a1055Q20o533N918Q701k108M877L766j0462k984R168K383j436N533O921
14833A3509j5331j2410L799n113J266J5339J8797p364P542L107q652m502m550
14820E437j1833m660n650m107L259J1032n98p722l708P018O099j005N320m991
14806f109L683l481M524k098N83l0J322J7851k743q549J0197P629p194k0526q894
14791a3835O62J0792j4418l944J7121J2538m758J772p778k142p626N340O7o918
$$ plain form
14892 -10675 -531 -6309 -5379 -4367 3513 3094 3184 -798 -1190 1405 167 -9705 -21849 -15838 -19261
14877 -19261 -19888 -24098 -24207 -32129 -35477 -42254 -37541 -27564 -16464 -23311 -18746 -25920 -19049 -13946 -9545
14862 -9545 3739 3267 4194 -5544 -5393 2408 8807 12815 16442 9531 5508 3320 6454 -9998 -11055
14847 -11055 -10235 -16768 -10850 -2149 -4257 620 4386 -6076 -9060 108 2491 1055 6588 13509
14833 13509 -1822 -14232 -10433 -15546 -14280 1059 19856 12492 20034 23141 14489 9987 5437
14820 5437 -6396 -11056 -16706 -20813 -17554 -6522 -7120 -14842 -18550 -11532 -5433 -6438 -1118 -6109
14806 -6109 -2426 -5907 -1383 -3481 -2898 -2928 -1606 16245 13502 4953 15150 22779 15585 -4941 -13835
14791 -13835 -13173 -2381 -16799 -20743 -3622 8916 4158 5930 -1848 -3990 -11616 -6276 -6209 -13127
14777a3127k702L570N697l712j766K522K764l330q218J357k99j168r152k915O236
14762b4243L730p966J556n124K206J9712N21K479m979L636K18r14J1800j2952
14748a0320m884J7409J676M3j464j4725J0571J3694m457j4669J321N285n805j0316
14734a6641R566K98q0R344Q600j0004o582j186j378k901M029L685p614o343Q746
14719h461O419j3119k867K519J7451q282J303r348P960J2999N161P432J1738J258
14705C2163o730j6013k0136Q445K985p234R2J355J349P440m915L4R589L785M063
14690A6272j0628k0925j2149P418J7599k467m11j4766o162J0295J0408K2446N469
14677B2399K411O714k5287p686q329Q173L456p379L139l916J3740N248o224o286
$$ plain form
14777 -13127 -15829 -12259 -6562 -10274 -12040 -9518 -6754 -10084 -18302 -16945 -17244 -18412 -27564 -30479 -24243
14762 -24243 -20513 -28479 -26923 -32047 -29841 -10129 -9608 -7129 -12108 -8472 -8254 -9168 2632 -10320
14748 -10320 -15204 2205 3881 3924 2460 -12265 -1694 12000 7543 -7126 -5805 -520 -6325 -16641
14734 -16641 -7075 -6777 -6857 2487 11087 1083 -5499 -6685 -8063 -10964 -6935 -3250 -10864 -17207 -8461
14719 -8461 -2042 -15161 -18028 -15509 1942 -6340 -5037 -14385 -6425 6574 11735 19167 30905 32163
14705 32163 25433 9420 -10716 -2271 714 -6520 -6428 -5073 -3724 3716 -1199 -1165 8424 12209 16272
14690 16272 5644 -15281 -27430 -20012 -2413 -4880 -5291 -20057 -26219 -15924 -5516 16930 22399
14677 22399 24810 31524 6237 -1449 -9778 -1605 1851 -5528 -2389 -6305 7435 12683 6459 173
14663A73q509j899N470m858r58M56j351J825n868l019O205N262J415O532m913
14648d037o483N181Q617o746M98J2727L320p118j3322m200N439J263k174j648
14634h683J4142P065j6608p885N379J4774J1054p37j425j5044j431J5762J272
14621A7635j517R25l415k953l030n97Q907J657j7977l973N967J310Q84Q52N951
14606A0626K550N365p019j627k795j5461q843n810J124N034L578K5463k324j889
14592G972O329N588k713r571m535j023p694k565j1118k085N233R432K353j1174
14578a5571m864K049J1884J0590r676l506N011L488R03M570m916N646L466j659
14564G415J2967p784k0857Q98m891L037J468J5773J0593k738P588j362j400L197
$$ plain form
14663 173 -8336 -10235 -4765 -9623 -10581 -10125 -11476 -9651 -15519 -18538 -12333 -7071 -5656 876 -4037
14648 -4037 -10520 -5339 3278 -3468 -2970 9757 13077 5959 -7363 -11563 -6124 -4861 -7035 -8683
14634 -8683 5459 12524 -4084 -11969 -6590 8184 19238 18501 17076 2032 601 16363 17635
14621 17635 16118 17043 13628 10675 7645 7048 15955 17612 -365 -4338 1629 2939 3823 4675 10626
14606 10626 13176 18541 11522 9895 7100 -8361 -17204 -23014 -21890 -16856 -13278 12185 9861 7972
14592 7972 14301 19889 17176 7605 3070 2047 -5647 -8212 -19330 -21415 -16182 -6750 -4397 -15571
14578 -15571 -20435 -18386 -6502 4088 -5588 -9094 -4083 -595 308 4878 -38 5608 9074 7415
14564 7415 20382 12598 -8259 -7361 -12252 -9215 -7747 8026 18619 15881 23469 22107 20707 23904
14550B3904o93q110j4538j2455J0063l539O121Q653K2p384l995L202k575l410
14536d734L644M930K26j1103P142P938m15R008J3288m403l414K860L091m490k832
14521B0736L866l311pj385j1512j1352K888J3329M385n97L630K82j3647j2952
14507e647n008K748Q462K633l27k067M123m099L155J3270j0527p576O466M331
14493I937L066o856K352n779O47O73Q491L284q558j6816J3865P979J2858L590
14479B8733j682M147l209l254q243j5836j8833j2071O138N345O279l585q363o333
14465c0767J6794J2617J25j97m068l183J1746j756r174L111m353J0732R946n717
14451E856j4502n420M743R120R638m539j1705l435J4933O839l482J118m234r982
$$ plain form
14550 23904 23211 15101 563 -11892 -1829 -5368 753 9406 9428 2044 -1951 1251 -1324 -4734
14536 -4734 -1090 3840 4066 -7037 105 8043 7628 16636 29924 25521 22107 24967 28058 23568 20736
14521 20736 24602 21291 21284 19899 8387 -2965 -77 13252 17637 17040 20670 20952 7305 -5647
14507 -5647 -10655 -7907 555 3188 2861 794 4917 818 3973 17243 6716 -860 5606 9937
14493 9937 13003 6147 8499 2720 3367 4040 12531 15815 7257 -9559 4306 12285 25143 28733
14479 28733 27051 31198 27989 24735 16492 656 -18177 -30248 -24110 -18765 -12486 -16071 -24434 -30767
14465 -30767 -13973 -1356 -1231 -1428 -5496 -8679 3067 1311 -7863 -4752 -9105 1627 11573 5856
14451 5856 -8646 -14066 -9323 -203 9435 4896 -6809 -10244 4689 11528 8046 9164 4930 -5052
14437e052L812J1029n96J0637P738L219J900r366r967q93m839n914r79m839k393
14422f503p727J5542J8858N270o044p554j769Q512M843o435k111N94J4017o113
14408B3380l609l068k2788j6074J3165J1723K68p520P52m620q328k96J1187J8947
14394A3119L800J5863j2507j5962Q010Q598n498r746k0575j7403R937J1471J2224
14381A331N23m835k084m209j078L181J5372Q843p30k016j594J593j340o314P01
14366G344J1003O966j6881j2243N768n770j42j1688m109J2905M013j27p072P061
14352b972J674n644l13Q882P227Q980n566j2127m954o045m745N851N613R976q387
14337b550J390k74k865J4853R787K69M953j0695r032o970M325M843Q798o853o471
$$ plain form
14437 -5052 -1240 9789 9193 19830 27568 30787 32687 23321 13354 12461 7622 1708 729 -4110 -6503
14422 -6503 -14230 1312 20170 25440 19396 11842 10073 18585 23428 16993 14882 15476 29493 23380
14408 23380 19771 16703 -6085 -22159 -8994 2729 2997 -4523 -3771 -8391 -16719 -17015 -5828 13119
14394 13119 16919 32782 20275 4313 12323 20921 15423 5677 -14898 -32301 -22364 -10893 1331
14381 1331 1854 -2981 -5065 -9274 -10352 -7171 8201 17044 16314 14298 12704 14297 12957 6643 7344
14366 7344 18347 25313 8432 -3811 1957 -3813 -3955 -15643 -19752 -6847 -2834 -2961 -10033 -2972
14352 -2972 -1298 -6942 -7255 1627 8854 17834 12268 141 -4813 -10858 -15603 -9752 -4139 5837 -2550
14337 -2550 -1160 -1434 -4299 10554 20341 20610 25563 14868 5836 -1134 3191 8034 16832 9979 3508
14322C508Q79l693J43J1120m783k949J895P410p592q817k388j2086O45M530P120
14307e058K551l354j3512J0801J129J6067O443j1570m321l05q52M894k4O375m657
14292D607j7580J484J2362J875L890J3256j364Q87p403m109P37J9155L767m433
14278B7131O421M216j8158N658j5902j5636P599O418J000j743J453j202j159o003
14264I3K39Q157q102j0193K326N436k470R93P142J636o758q18r9P082N222j916
14248G970L68j4886L608O733K891n314q301j629J7813J0856p507p098j2039J1802
14234E267m714k7148m324J5380J5057P410K182q306m869M480k416N840J5681p977
14220A1543j920K534K815P896o586q158j2558j0050J572J4072J2785k35o368o238
$$ plain form
14322 3508 4387 694 837 11957 7174 4225 6120 13530 5938 -2879 -5267 -17353 -16708 -12178 -5058
14307 -5058 -2507 -5861 -19373 -8572 -7443 8624 15067 3497 -824 -1129 -1981 2913 2889 9264 4607
14292 4607 -12973 -11489 873 2748 6638 19894 18530 19417 12014 7905 8642 27797 31564 27131
14278 27131 33552 37768 19610 25268 9366 -6270 1329 7747 8747 7004 8457 7255 6096 93
14264 93 332 8489 387 -9806 -7480 -2044 -4514 -3521 3621 5257 -1501 -2319 -2418 4664 9886 7970
14248 7970 8338 -6548 -2940 3793 6684 1370 -6931 -8560 9253 20109 12602 5504 -6535 5267
14234 5267 553 -26595 -30919 -15539 -482 6928 9110 804 -4065 415 -2001 3839 19520 11543
14220 11543 9623 12157 14972 22868 16282 8124 -4434 -14484 -12912 1160 13945 13710 7342 1104
14206A104J2244o745L667j7824o819P731J4986O479j423J392o806j0181J0365
14193H170j995j493r001J2081k140j4392J3454J5640K227M361Q2m98p097q337
14179A1062J1822j1757j7687j560o122K050Q640k38j6100P559K547r59P117O077
14165B451m891O348P154K927J209k390r652o017m407mK3695J5482o58k4544q34
14150E869O583l877j2030N921J2539p063j2983j0034J9690N697j5239m206M688
14137d445K64k117j0756N436M254J9657o69r278r241p019J909j335m025k768k85
14122b0418K0110L515j1469J1611J8276j0728j0304p964l706Q902J5177j3100
14110i8m529N948q254l453P394Q550l13m623j4066j2534J5663Q460N348P65n937
$$ plain form
14206 1104 13348 6603 10270 -7554 -14373 -6642 8344 14823 13400 14792 7986 -2195 8170
14193 8170 6175 4682 -4319 7762 5622 -8770 4684 20324 22551 26912 26994 26496 19399 11062
14179 11062 22884 11127 -6560 -8120 -14242 -12192 -3552 -3790 -19890 -12331 -9784 -10743 -3626 2451
14165 2451 -2440 3908 11062 13989 15198 12808 3156 -2861 -7268 -7272 16423 31905 31247 6703 5869
14150 5869 12452 8575 -3455 2466 15005 7942 -5041 -15075 4615 10312 -4927 -9133 -4445
14137 -4445 -4181 -6298 -17054 -11618 -7364 12293 11624 2346 -6895 -13914 -12005 -13340 -17365 -20133 -20418
14122 -20418 -308 3207 -8262 3349 21625 10897 593 -7371 -11077 -2175 13002 -98
14110 -98 -4627 1321 -6933 -10386 -2992 5558 5245 622 -13444 -25978 -10315 -1855 3493 4258 -1679
14095a679J893L384K087Q87q685o047p81P19j732q822j794M403r834j212m262
14080c1475p490J4312m71J2124K0622N353L512q922j789J0571R983K563o46j8622
14066I625k1193P598J5434N26L922j642O248j1960j4456R434j3258j8327Q287
14053a9762K1123J6579N223R094p835r342J12l87K532P833p381p302K2074J952
14039C4513q230K107m051j4294n601j3185n24J1452J1932j066n542n813j433l770
14025c505j3200R742N144j0404r325k529J0626O684R725p919q904p198J034N07
14011a9522l46L563L717L344N166q1J4768K815p358k364M644L817J721N22k1126
13996f720m785O571J2560J0715j0176j0627j011J2943J1490j298K034Q539oN44
$$ plain form
14095 -1679 214 3598 5685 6572 -2113 -8160 -8941 -8222 -9954 -18776 -20570 -16167 -26001 -27213 -31475
14080 -31475 -38965 -24653 -25124 -13000 7622 12975 16487 7565 5776 16347 26330 28893 28247 9625
14066 9625 -11568 -3970 11464 11990 15912 14270 20518 8558 -5898 3536 -9722 -28049 -19762
14053 -19762 1361 17940 23163 32257 24422 15080 15192 14805 17337 25170 17789 10487 32561 34513
14039 34513 26283 28390 24339 10045 4444 -8741 -9265 2187 14119 13053 7511 1698 265 -3505
14025 -3505 -16705 -6963 -1819 -12223 -21548 -24077 -13451 -6767 2958 -4961 -13865 -21063 -20029 -19522
14011 -19522 -19868 -16305 -12588 -9244 -4078 -4159 10609 13424 6066 3702 8346 12163 13884 14406 -6720
13996 -6720 -11505 -4934 7626 18341 8165 -2462 -3473 9470 20960 19662 21696 30235 30229 30773
13982C0773J816M514L674N301n580k1366R13j190L660P914l898o972N05o880r109
13967D075l932o307q304O27J2288k336j68J8618Q319P436J8229q221j6194q100
13953A6030J0500K3501K0243R728N488N645m411k34k617J7184M0532M6390P0573
13940B58552J07830J11603P2022K0901k403p1500j11516j16811q3278m1492l3686
13929A10222k0209j0655j0814j8624l359r199j3000O496P248P203j437j0570k092
13916C1210O073o887p043o497k0167j0230N567J1922J1843M210o351m328k0921
13903a1599p70K373j832r17K519J5520P971m823n391k544P424M820J659p706R370
13888A6074K512k294J2120m463j9616l388Q710M255K909p377j6559K949J0444
$$ plain form
13982 30773 32589 37103 40777 46078 40498 19132 20045 18855 22515 30429 26531 19559 20064 13184 4075
13967 4075 143 -6164 -14468 -13841 -1553 -3889 -4057 14561 22880 30316 48545 40324 24130 16030
13953 16030 26530 50031 70274 80002 85490 91135 86724 86490 83873 101057 141589 187979 258552
13940 258552 366382 477985 550007 570908 568505 497005 385489 268678 185400 143908 110222
13929 110222 90013 79358 68544 49920 46561 37362 24362 30858 38106 45309 43872 33302 31210
13916 31210 37283 30396 23353 16856 -3311 -13541 -7974 3948 15791 20001 13650 9322 -11599
13903 -11599 -12369 -9996 -11828 -12745 -10226 5294 13265 8442 3051 507 7931 12751 14410 6704 16074
13888 16074 18586 16292 28412 23949 4333 945 9655 13910 16819 9442 -7117 -4168 6276
13875F276l950n744j543k65L470N032M550N166j0515k071N053j016R30J1532J1070
13860B7975O498M470L279j4074j0769n941j702O588k056J043k155M850J405J2707
13846C2118M071J0634j333r132o583k1582k3165J894Q226N592L652J727m117o436
13832d434K724J2227L731n562m76J335j926J1544o54j810R475L314q264j0144
13818A1080j0405j1347L76R438M706j3669n896p191j1746j315P309K6099J4078
13805A1517N174l197j2177r340r160J4912J766l469J4987J6965m912o306J233
13792A7993p568j6151j580o74M254J2876K134M367J4617M843j0147P17n402R773
13778C0052P09l418J0109q25r050k520R462j720r873j3014m244n10j921L580P772
$$ plain form
13875 6276 2326 -3418 -4961 -5226 -1756 3276 7826 12992 2477 406 5459 4443 5373 16905 27975
13860 27975 34473 38943 42222 28148 17379 11438 9736 16324 14268 15311 13156 18006 19411 32118
13846 32118 36189 46823 45490 36358 29775 8193 -14972 -13078 -4852 740 4392 6119 2002 -4434
13832 -4434 -1710 10517 14248 8686 8210 9545 7619 19163 18509 16699 26174 29488 21224 11080
13818 11080 675 -10672 -10296 -858 3848 -9821 -15717 -22908 -34654 -35969 -28660 -2561 11517
13805 11517 16691 13494 1317 -8023 -17183 -2271 -505 -3974 11013 27978 23066 16760 17993
13792 17993 10425 -5726 -7306 -7980 -3726 9150 11284 15651 30268 35111 24964 25681 20279 30052
13778 30052 30761 27343 37452 36627 27577 25057 34519 32799 22926 9912 5668 5158 3237 6817 14589
13763A4589K200n407n722J046q342R812M012r599Q065J0859m191n665m770p012
13749a25N972K451j5327O695L2043L3q538M207Q913L33j1882K094J627l618l112
13734B1766J3042p095j0323m422Q471J4795O665m511L165j5556r729P090l208
13721B0150o02j3041L387Q86l513q237q769O530k131k189K637J692L174P7K981
13706C032l41q11m015J924L575o669r573L540N869N471q466P463J4223l871J007
13691A2358o250k340p868j7738r372O224K0943K747J833o082L397L469R948L942
13677A5211Q862m609K0367P836j5263P09n133n56J533r672J289l079K382R016
13663B8893k450l927p674n590p100K541M548j785K266N685R22r107m462n975P097
$$ plain form
13763 14589 16789 11382 5660 6706 -1636 8176 12188 2589 10654 21513 17322 11657 6887 -125
13749 -125 5847 8298 -7029 -334 31709 31742 23204 27411 36324 36657 24775 26869 28496 24878 21766
13734 21766 34808 27713 17390 12968 21439 36234 42899 38388 41553 25997 16268 23358 20150
13721 20150 19548 6507 9894 10780 7267 -970 -9739 -3209 -5340 -7529 -4892 -3200 -26 51 3032
13706 3032 2691 1880 -2135 -211 3364 -3305 -12878 -9338 -3469 2002 -6464 999 15222 11351 12358
13691 12358 6108 3768 -4100 -21838 -31210 -24986 -4043 -1296 537 -5545 -2148 1321 11269 15211
13677 15211 24073 19464 39831 47667 32404 33113 27980 27424 28957 19285 20574 17495 19877 28893
13663 28893 26443 22516 14842 9252 2152 4693 9241 7456 9722 15407 16329 7222 2760 -3215 3882
13648C882K571m543O396r43m118L400M800q92N419L440j144p582r770k906K674
13633F84R013P255j130n035K67P477N34j6750Q951J4717j2214o409O711j515p092
13618E464K403Q831Q221j1145k457k397j0972J3040O036l995q909J1453J2562
13605B8135n995J887J723k35J1340L420R306n386p470r754J59j119l801L887P560
13590C3657m152n00k355j2173j5155m944L875J6234O576k782K735j631Q949j503
13576B6831j9292p096J2R280J266j0414J4748L514m775j2156o070M482Q084J4639
13562B3053P123n50q523j5998L477J3625N56m101Q179K4528J6124j3562j5933
13549C7998o578J501p223o207J866P855k944l151J6134O522r038K703p097k243
$$ plain form
13648 3882 6453 1910 8306 7363 3245 6645 11445 10553 15972 19412 18268 10686 916 -1990 684
13633 684 9697 16952 15822 10787 11054 18531 19065 2315 11266 25983 13769 7360 14071 12556 5464
13618 5464 7867 16698 24919 13774 11317 8920 -2052 10988 17024 13029 4120 15573 28135
13605 28135 22140 24027 25750 25515 36855 40275 49581 44195 36725 26971 27130 26011 22210 26097 33657
13590 33657 29505 29005 26650 14477 -678 -5622 -1747 14487 21063 18281 21016 19385 28334 26831
13576 26831 7539 443 455 9735 11001 587 15335 18849 14074 1918 -4152 330 8414 23053
13562 23053 30176 29626 21103 5105 8582 22207 22763 18662 26841 51369 67493 53931 37998
13549 37998 31420 32921 25698 19491 21357 29212 26268 23117 39251 45773 36735 39438 32341 30098
13535C0098J96N270O037m025m692j335N227k626n361j4941n075L827R061K170
13521B3831N103l105j0875K358Q964N612j037O062o101m218q285r56p497R800
13507A9656O208Q95p446K817P846n181Jj141P248k68k009l143k41J655J384j0485
13491A7796l889J2714K499J785K285o85K480j0604N509L120m935M04n840J330
13477B3969n027q281O881J1119J3923K477q784o684r205L370O26r261K958q283
13463I798n320R05L058J1784O257o296j2655j7973J934L021l077J2907K7072P921
13449C9336k3580r081j4079j3041K647P475J4031J0868J786n059P693q868m551
13436E577k022l876o337K5017J6811n373l065j174l679l223L882L442j2596O896
$$ plain form
13535 30098 30294 35564 41601 37576 32884 31549 36776 34150 28789 13848 8773 12600 21661 23831
13521 23831 28934 25829 14954 17312 26276 31888 30851 36913 30812 26594 18309 17353 9856 19656
13507 19656 25864 26759 19313 22130 29976 24795 24796 23655 30903 30635 28626 25483 25242 26897 28281 17796
13491 17796 13907 26621 29120 30905 33190 32505 34985 24381 29890 33010 28075 28479 22639 23969
13477 23969 18942 10661 17542 28661 42584 45061 36277 29593 20388 23758 24384 15123 18081 9798
13463 9798 4478 5383 8441 20225 26482 20186 7531 -10442 -8508 -5487 -8564 4343 31415 39336
13449 39336 15756 6675 -7404 -20445 -17798 -10323 3708 14576 16362 11303 18996 10128 5577
13436 5577 3555 -321 -6658 18359 35170 29797 26732 25558 21879 18656 22538 25980 13384 20280
13422B0280O880j594k436k47L8j285O358Q614m601j3547q987l762j4141O83Q874
13407A127J1809J3572l305K252M36o710j2536M035J3356j6363k170J7866J0384
13394C3753k874j982J169Q173M097j763m546J622m740j1988m430N416K517K787
13380B7211j606L753J165K998j6516j1020M849l877o128J6454M611l683L083K093
13366B3387J0349N835R962l06j5294n617n794K636O265l430L042O195l535K52
13352C3947J037Q560P833o2K482m921j6285N134P818K979j447R06q99j4352j0811
13337B1919n467j90N697p339R89J7938j1791j5634k959J5495J3388O052p688k102
13323B8308j302q772j8427K038l357O884M078N726O597M905Q597L719o778l609
$$ plain form
13422 20280 27160 25566 23130 22883 22921 21636 27994 36608 32007 18460 9473 5711 -8430 -7747 1127
13407 1127 12936 26508 23203 25455 25891 19181 6645 10680 24036 7673 5503 23369 33753
13394 33753 30879 28897 30066 38239 42336 40573 36027 37649 32909 20921 16491 21907 24424 27211
13380 27211 25605 29358 30523 33521 17005 5985 10834 6957 829 17283 21894 18211 21294 23387
13366 23387 33736 39571 49533 49227 33933 28316 22522 25158 31423 27993 31035 37230 33695 33947
13352 33947 34984 43544 51377 51315 53797 48876 32591 37725 45543 48522 47075 47981 47082 32730 21919
13337 21919 16452 16262 21959 14620 15609 33547 21756 6122 3163 18658 32046 38098 30410 28308
13323 28308 27006 18234 -193 1845 -1512 5372 9450 15176 21773 26678 35275 38994 32216 28607
13309B8607k452L572j1218k865Q01O004l19N765O899k45L287l049k594J394j1328
13294B2259j2874l45O111J0208P416N795K545m691j4102j431J2616Q69m651j014
13280B8711l255P76M436n65R982R808K3793L073j6462r582j08j1291r517J3679
13266D3478J270J0487J0254o240O869J3310M802r391Q512K7244J5229J714P478
13253A35016J514j0466k419k891N444L379p949r767k898J400K863J0644J9406
13240A43276J5734K9374M3918N4143O1622P5881J23885K12876L44087N64333O60604
13229B329733J46850m37434n49913m70468l33237k04252j24207q3688n9233l3294
13219A80857m2203j8234q879j2419o857M31j7134j9492N74J3544O962Q089k801
$$ plain form
13309 28607 26155 29727 18509 15644 16445 22449 22130 27895 34794 34549 37836 34787 32193 33587 22259
13294 22259 9385 9040 15151 25359 32775 38570 41115 36424 22322 20891 33507 34376 29725 28711
13280 28711 25456 26232 30668 30103 40085 49893 73686 76759 60297 50715 50607 39316 29799 43478
13266 43478 44748 55235 65489 59249 66118 79428 84230 74839 83351 110595 125824 127538 135016
13253 135016 136530 126064 123645 120754 126198 129577 121628 111861 108963 110363 113226 123870 143276
13240 143276 159010 188384 232302 286445 348067 423948 547833 760709 1104796 1669129 2329733
13229 2329733 2476583 2039149 1489236 1018768 685531 481279 357072 273384 214151 180857
13219 180857 138654 120420 111541 99122 92265 92696 75562 56070 56644 70188 77150 85239 82438
13206H2438q019L235J1382l463j6559m081K699Q363l419J294J7560J9277p186
13193A03521o741o961p482j4274l472P359j567j760K805l846k197N137J1133q798
13179G2857j3320r311p532q081j6623O273J0393L522P049R770J4211J15m44J0313
13165G9192J1408j1475p029k0221j687K708L748L493J477J3412K851l133K701
13152G7445j451L077M178P561L588m356l404m536q301j272P372K460p846o952
13138F7563k399K942J0316P085n698J172J1913l258k958n70o232j005j236J4902
13124I2537j8579J652N512J5946J4416m75q708P022J781k467j2211L365J5338
13111A15129J6508Q434J0618J7631L099j3294j0120j5654k0519k0302j4053J829
$$ plain form
13206 82438 74419 77654 89036 85573 69014 64933 67632 75995 72576 73870 91430 110707 103521
13193 103521 96780 89819 82337 68063 64591 71950 70383 68623 71428 67582 65385 70522 81655 72857
13179 72857 59537 50226 42694 34613 17990 24263 34656 38178 45227 54997 69208 69323 68879 79192
13165 79192 90600 79125 72096 51875 50188 52896 56644 60137 61614 75026 77877 74744 77445
13152 77445 75994 79071 83249 90810 94398 90042 86638 82102 73801 72529 79901 82361 74515 67563
13138 67563 65164 68106 78422 85507 79809 80981 92894 89636 86678 86108 79876 78871 77635 92537
13124 92537 73958 75610 81122 97068 111484 111009 102301 109323 111104 108637 96426 99791 115129
13111 115129 131637 140071 150689 168320 171419 158125 148005 132351 111832 91530 77477 79306
13099G9306J4710J6250n109j4426l2736m3541k1170J7989L4580Q918J6661O580
13087G8012O881K0108j699m563Q999J541n62k427p89j4359n669j985N081P950
13073I6519L965J5294K474j0120O68j200N401O481j3676k638M091J1319P996o57
13059A25917L753l029j3525r071K0410J4454K7885K4689J7985J2323J7200O0061
13047B99052P5285N0158j0769k0553J579k4107q9075r2747n7869m8889k4257O788
13035F4596O313J6191J5826k74o132O173J9666K1277K1036K3565L597j1681L332
13022A83485q163J770J6341n54K2044K6809J6375J5218J6793L1464K3524M9013
13010C94119Q2012J19925J62001J83506J66625R9582M0824o585o5350j46888j95190
$$ plain form
13099 79306 94016 110266 105157 90731 57995 14454 -6716 11273 45853 54771 71432 78012
13087 78012 84893 105001 103302 98739 107738 109279 108717 106290 105501 91142 85473 83488 88569 96519
13073 96519 100484 115778 118252 108132 108800 107600 113001 119482 105806 103168 107259 118578 126574 125917
13059 125917 129670 126641 113116 104045 124455 138909 166794 191483 209468 221791 238991 299052
13047 299052 374337 424495 413726 393173 394752 370645 281570 188823 130954 82065 57808 64596
13035 64596 70909 87100 102926 102652 96520 102693 122359 143636 164672 188237 191834 180153 183485
13022 183485 175322 177092 193433 192879 214923 241732 258107 273325 290118 321582 345106 394119
13010 394119 476131 596056 758057 941563 1108188 1207770 1248594 1242009 1176659 1029771 834581
12999H34581j85080j41524j02276o6969l6591j2808k403j4127j8203j4979j5346
12988B24275j5588j2114j9693m784J1832M701q93n492R1n539j0871R65J5141N268
12974A87299j0526p961o355P552k570L676l041j277j2668j2669L211J168N35K336
12960A48710L420R757k296p043l09K4073K0468R493J1381P739j1798p950k5440
12947A80205n0907m3952n4338n0252J3056O5012P6879M9269J2896K3848K9990
12936B51706K1075L619n802m748k069l051o471J6534P797P277m304j0390J0073
12923B81246M1657O6689J06722J09824N273j42576j96542j25110q0180l971J38969
12912B02001J45875O7432J0678n047j6733j6035k3717k4586k4242j9848N55J8917
$$ plain form
12999 834581 649501 507977 405701 338732 302141 289333 286930 272803 254600 239621 224275
12988 224275 208687 196573 176880 172096 183928 188629 187736 182244 182335 176796 165925 166890 182031 187299
12974 187299 176773 168812 162457 170009 167439 171115 168074 166797 154129 141460 144671 145839 146374 148710
12960 148710 152130 161887 159591 152548 152239 176312 196780 206273 217654 225393 213595 205645 180205
12947 180205 129298 85346 31008 -19244 -6188 58824 135703 184972 197868 221716 251706
12936 251706 272781 276400 270598 265850 263781 260730 254259 270793 278590 285867 281563 271173 281246
12923 281246 322903 389592 496314 606138 611411 468835 272293 147183 67003 63032 202001
12912 202001 347876 415308 425986 420939 404206 388171 364454 339868 315626 295778 296333 315250
12900C15250K9339J8042K601j5969k6714j4965O888J5743O130Q887O985k2330
12888C29887m1704j934N37J569o544k7712p574q16J0192K5338M3743L5269J8283
12875C78534K353J7113J5954J6298M43j5756k7341m35L2320M7402L8382K5653
12863E30920K5011K7901K0924M783J5572K6611L3298M635o835J0122L0636N7552
12851G81130P9826P2525M2656J1196J0418J0599K570q91M938L8187O5926P7448
12839A196528O1846Q2965R7513J01194Q7414P7492N4533M2396P0740J10230R6929
12828B079780R0009Q9522R2079J33166J80988J74352J89950K48014K96007L07144
12818C881011L33607M04763M97910N67932N16874M70071N33002O49157P14604
$$ plain form
12900 315250 344589 362631 365232 349263 322549 307584 314472 330215 336345 345232 352217 329887
12888 329887 288183 286249 286786 288355 281811 254099 246525 245709 255901 281239 324982 360251 378534
12875 378534 380887 398000 413954 430252 430695 414939 387598 387163 419483 466885 505267 530920
12863 530920 555931 583832 604756 609539 625111 651722 685020 689655 682820 692942 723578 781130
12851 781130 860956 933481 976137 987333 997751 1008350 1010920 1010029 1014967 1053154 1119080 1196528
12839 1196528 1258374 1341339 1438852 1540046 1627460 1704952 1759485 1801881 1872621 1982851 2079780
12828 2079780 2169789 2259311 2351390 2484556 2665544 2839896 3029846 3277860 3573867 3881011
12818 3881011 4214618 4619381 5117291 5685223 6202097 6672168 7205170 7854327 8568931
12809H568931Q10317R93408J230635J473035J850255K358538L105601L994324
12801B4385044M813222O079323Q241337J1048267J4405423K0592745L3189643
12794A22755004N8365290J01676584J35049792O7282953o3610870j09707442r8825316
12787B12985995p1800017m5575488k7593428j7524927j2058943q487380o127763
12780B3818049m399503l214526k505166k034435j665277j368484j107376q87733
12772F635549p52518o26665n43946n33913m58339l18001j88558r8581j02490j61034
12762B851504j85753j60515j29621j46223j47310j01824j06939j16263r2193o5581
12752A599282p3517p1221p7806j04598o8242k2615k1262j4638j9546l7419m2833
$$ plain form
12809 8568931 9379248 10372656 11603291 13076326 14926581 17285119 20390720 24385044
12801 24385044 29198266 35277589 43518926 54567193 68972616 89565361 122755004
12794 122755004 181120294 282796878 417846670 485129623 421518753 311811311 212985995
12787 212985995 141185978 95610490 68017062 50492135 38433192 29945812 23818049
12780 23818049 19418546 16204020 13698854 11664419 9999142 8630658 7523282 6635549
12772 6635549 5883031 5256366 4712420 4178507 3720168 3402167 3213609 3115028 3012538 2851504
12762 2851504 2665751 2505236 2375615 2229392 2082082 1980258 1873319 1757056 1664863 1599282
12752 1599282 1525765 1454544 1376738 1272140 1203898 1181283 1160021 1145383 1125837 1088418 1045585
12741A045585j6119j8145n5319q1230q3306o9132o8519o3569l3048k996K9928
12730E84130L6116L6592K3681J99r168l7023l3857k037L343j4460k0372L112n77
12717E69679R177L5657M4348L5270J6161k0091n3641n3044m4786l1874m6187k1892
12705D38777O632K7427M1592L8633L4296q178j9422k0865l2324r765j9187l8700
12693D38916l2809j9898o003l044M753J078l655o531n310k0610m473l14J4007
12680C56107J3006K280j5990l0659m1525k1902l1405k4341O3J6426L5064N6663
12668C13787O4927O8498N0170j9232n7458p7251o3856j6229J7360M1893J6910
12657C39519O913J8320J9579J6439L8318J8453K127J1476R952K876p267J5691
$$ plain form
12741 1045585 1029466 1011321 956002 874772 791466 722334 653815 590246 557198 554202 584130
12730 584130 620246 656838 680519 680718 671550 634527 600670 598633 601976 587516 567144 570256 569679
12717 569679 578856 614513 658861 694131 710292 690201 636560 583516 538730 506856 460669 438777
12705 438777 445409 472836 514428 553061 587357 579179 559757 538892 506568 496803 477616 438916
12693 438916 406107 386209 380206 377162 381915 382993 379338 372807 367497 346887 342414 342100 356107
12680 356107 369113 371393 355403 324744 283219 261317 229912 205571 205634 222060 257124 313787
12668 313787 378714 447212 497382 478150 420692 343441 279585 263356 280716 322609 339519
12657 339519 346432 364752 384331 400770 439088 457541 459668 471144 481096 483972 476705 492396
12645D92396L7403M8392M9069L6595N2427R3540Q8225K1885k9865m6737j6786
12634H26544r575j3509O75K6992L6212M8966P9976O5847O4708O4713O2014N5621
12622A309184M6146L9373M8536P2966J02883J07627J01132J12394J22299J43201
12612B205741J54772J89205K38446K45735K78127L26495L43807M02365M62521
12603D847214N31198O40496P80282R42518J093804J226521J372959J539830J749819
12594A4724641K019781K423992L081009M112620N653261Q043862J1950550J8316307
12586G0326023K7430509L5893338L5028545K1870389Q702864K305792p480861
12579A94076599k3902499l4976687l4847095k8223034k0259783j3637427r007167
$$ plain form
12645 492396 529799 578191 627260 663855 716282 809822 898047 919932 890067 843330 826544
12634 826544 816969 803460 804135 831127 867339 916305 996281 1062128 1126836 1191549 1253563 1309184
12622 1309184 1355330 1394703 1443239 1516205 1619088 1726715 1827847 1940241 2062540 2205741
12612 2205741 2360513 2549718 2788164 3033899 3312026 3638521 3982328 4384693 4847214
12603 4847214 5378412 6018908 6799190 7741708 8835512 10062033 11434992 12974822 14724641
12594 14724641 16744422 19168414 22249423 26362043 32015304 40059166 52009716 70326023
12586 70326023 97756532 133649870 168678415 190548804 199251668 201557460 194076599
12579 194076599 170174100 135197413 100350318 72127284 51867501 38230074 29222907
12572B9222907o014249m079215k880818k187645j722229j397072j218355j136401
12564H586923j027634r19385q66157p96746o82636n38579m36697l44713k64483
12555B709893k06401j57744j39661j27313j25531j23884r2714q9176j04271r0095
12545A453103o8441q0515p5835p0230n2329n8101o2854l2235l3027k8748k1702
12534H69086l801n082r719j5232l0403m5777o6216n1467k8556m0676m3495l3303
12522D95359j8157j5213q238K341N796p824k3515l9587j3592J0053L427j3999
12510C76851o825N748K015l230j5994n261j9629q333j3288r170l355N732P886
12497C13147K088J355J3550K1096l96J9843M6476O2550P3624P1949N4747p2955
$$ plain form
12572 29222907 23208658 19129443 16248625 14060980 12338751 10941679 9723324 8586923
12564 8586923 7559289 6639904 5773747 4977001 4294365 3755786 3319089 2974376 2709893
12555 2709893 2503492 2345748 2206087 2078774 1953243 1829359 1736645 1647469 1543198 1453103
12545 1453103 1384662 1304147 1228312 1158082 1105753 1047652 984798 952563 919536 890788 869086
12534 869086 865285 860203 850484 835252 804849 759072 692856 641389 612833 572157 528662 495359
12522 495359 477202 461989 453751 456092 461888 454064 430549 390962 377370 387423 390850 376851
12510 376851 370026 375774 377789 374559 358565 353304 333675 325342 312054 302884 299529 305261 313147
12497 313147 315235 316590 330140 351236 350840 370683 417159 479709 553333 625282 680029 607074
12485F07074j33781j11335n8310l1852k2131k6533l5018k9317k8352k0455m538
12474A05452O787Q302k942m84O545n535l766n959j6912k3840j6532j284J3240
12461F3072Q289L583J4543K5448P095r902k296k0087o850j864j5428q309Q774
12448F6068K1532M5854M9400M8332Q4313R1269L6712p9192j09886q3589m4454
12437A26359k2436j1702N836N367J0697J5691Q455n057o846l26m752j2624r293
12424I9369K618Nj5105j6864J5510p376o106L459j936p445l677j3325m060j784
12410D3283O696N203N026J1852q13q569p597L90M983J4165J6329L4006L9968o100
12396A58822m0468k4605k7362j3120p686j879L622j2017K273j049j3558J92O202
$$ plain form
12485 607074 473293 361958 303648 271796 249665 223132 188114 158797 130445 109990 105452
12474 105452 112239 120541 117599 117115 123660 118125 114359 108400 91488 67648 51116 49832 63072
12461 63072 71361 74944 89487 114935 122030 112128 109832 89745 82895 81031 65603 57294 66068
12448 66068 87600 133454 182854 231186 315499 406768 443480 364288 254402 170813 126359
12437 126359 103923 92221 98057 103424 114121 129812 138267 133210 126364 126038 121286 108662 99369
12424 99369 101987 101992 86887 70023 85533 78157 72051 75510 73574 66129 62452 49127 45067 43283
12410 43283 49979 55182 60208 72060 71247 62678 55081 55471 60454 74619 90948 124954 164922 158822
12396 158822 118354 93749 66387 53267 45581 43702 47324 35307 37580 36531 22973 23165 29367
12383B9367j2256j0539p000J196K2063J4347M414J892P381j290r924L12J523o530
12369C4956l687J240J5281J4710q981q090N714k910Q371J1766J7581K0742L4485
12356A41178J7050L0194L4834M7784O1814J06393J61876K65306M72190O69165
12346B007784M27891k31111n32847n18207l81761k32916j35351r0354o1699m7676
12336B03753n3070m2754l0594k3432k6490q084j7440r042r962j8427j1901J1487
12324c5956K0430J3171P780j301n47p197P142J5164j971P235P987J1215r8j9438
12310B3616M28J550K174M896l417J7052J4641N038J2857J041J9442L0024P178
12297A36520q446o064j5949k4402M50J7202n239k6153o670q053j1670r990M217
$$ plain form
12383 29367 17111 6572 -428 768 22831 37178 41592 43484 50865 49575 39651 39963 41486 34956
12369 34956 31269 32509 47790 62500 53519 45429 51143 48233 56604 68370 85951 106693 141178
12356 141178 158228 188422 223256 271040 332854 439247 601123 866429 1338619 2007784
12346 2007784 2435675 2204564 1671717 1153510 771749 538833 403482 313128 251429 203753
12336 203753 150683 107929 77335 53903 27413 19329 1889 -7153 -17115 -35542 -47443 -35956
12324 -35956 -15526 -2355 5425 4124 3577 -3620 3522 18686 16715 23950 31937 43152 43054 23616
12310 23616 24044 25594 27768 32664 29247 46299 60940 65978 78835 79876 99318 129342 136520
12297 136520 128074 122010 106061 81659 82109 99311 94072 67919 61249 53196 41526 31536 35753
12284C5753K334J8101O983j5320r786m892O77q587J0957k322m676k1582j0787
12271c147l1657m664J3710N943L001j1791L862J0510P832n422m070J3292j089
12258c690j109k228o199K142R124j113k509J0916P949P77l797q058k052o061N833
12243g5N541j0418j117K340N427J954j2475K966R243k792J189P635n029j454J0913
12228A3848n816j2983j453j2540N493L856J411J652q254q316P451J4152O092L138
12214G731M377O377k446k466N369r209m468j625l670k744q131L295J5227o643
12200I74K800M542K2597L435k826k814j4783r228j3282k686J90J185K283N336
12186b277O655r892j25R142J1839Q768O311j8489j2839P746N071J1289J5353J3473
$$ plain form
12284 35753 38087 56188 63171 47851 38065 33173 33850 25263 36220 33898 29222 7640 -3147
12271 -3147 -34804 -39468 -25758 -19815 -16814 -28605 -24743 -14233 -6401 -11823 -15893 -2601 -3690
12258 -3690 -4799 -7027 -13226 -11084 -1960 -3073 -5582 5334 13283 14060 10263 2205 153 -5908 -75
12243 -75 5466 -4952 -6069 -3729 1698 3652 -8823 -5857 3386 594 1783 9418 4389 2935 13848
12228 13848 8032 -4951 -6404 -18944 -13451 -9595 -8184 -6532 -14786 -23102 -15651 -1499 4593 7731
12214 7731 12108 18485 16039 13573 18942 9733 5265 3640 -30 -2774 -10905 -7610 7617 974
12200 974 3774 8316 30913 34348 31522 28708 13925 4697 -8585 -11271 -11081 -9896 -7613 -2277
12186 -2277 4378 -5514 -5639 3503 15342 24110 30421 11932 -907 6839 11910 23199 38552 52025
12172E2025J0455Q891k222j037j211J498N425K2859K7654N383L547M0117N9096
12159B32480R4009J11034J39510J80953J73841J05836K5683j6589n5056j18931
12149H72770j81884j71821j29618j01579p8601o3980m3528j1290Q115j4041j5401
12138F9142k587M002k1004l3172k0978K377J1844J327l760l591J786l690j3201
12125a1505L310J4157J6080n907k2221k0083N858k610P722K298p045J4431R870
12112D355j064K957R92q614j705o239j767p114P590K11P33l3K495K731P367K301
12096E196r915o71M586K878o439j0840m945M871L632n168m874J2676N901K413
12082f99L61J791m556n474o18J133J0401k339n955J69J542l138P25r842K024J4143
$$ plain form
12172 52025 62480 71371 69149 68112 66901 68399 73824 96683 124337 129720 133267 173384 232480
12159 232480 326489 437523 577033 757986 931827 1037663 1063346 1046757 991701 872770
12149 872770 690886 519065 389447 287868 209267 145287 101759 90469 98584 84543 69142
12138 69142 66555 70557 49553 16381 -4597 -2220 9624 10951 7191 3600 5386 1696 -11505
12125 -11505 -8195 5962 22042 16135 -6086 -26169 -20311 -22921 -15199 -12901 -19946 -5515 4355
12112 4355 3291 6248 7240 -1374 -3079 -9318 -11085 -18199 -10609 -10398 -9665 -9698 -7203 -4472 2895 5196
12096 5196 -4719 -5390 -804 2074 -4365 -15205 -20150 -15279 -11647 -16815 -21689 -9013 -3112 -699
12082 -699 -338 1453 -3103 -8577 -9195 -8062 2339 0 -5955 -5786 -4244 -7382 -6657 -16499 -14475 -332
12066c32N931q142j449M669K454l291P648K649o036O232J089q343m21j172l040
12051a554R149n782N917Q468m992j3536n715p38R020O942R669J888K362K839j5884
12036H053l200j0878r692L497N766j2601o478M049M467j2661m01P769K58L167
12022a8885J5619J4705r09J2293j49j2555L312J236j804K145J231j6106m244j46
12008d257p024k280l8r869j3927r350q212k784J9291K7007J0511P730J940j0195
11994a457j698J1098j811j3901J1074k709p181M186r91j2012J146j0530k44l240
11980b8270J139N830j715j07j803l584L323Q034J0323J1706n111q499P382K1257
11966A9905K039p083j9145O041O307q821j785j0333L985Q497n109n958O008N209
$$ plain form
12066 -332 5599 -2543 -3992 677 3131 -160 7488 10137 4101 10333 11422 3079 2658 1486 -1554
12051 -1554 7595 1813 7730 16198 11206 -2330 -8045 -8783 237 7179 16848 18736 21098 23937 8053
12036 8053 4853 -6025 -15717 -12220 -6454 -19055 -25533 -21484 -17017 -29678 -30079 -22310 -22052 -18885
12022 -18885 -3266 11439 10530 22823 22674 10119 13431 14667 12863 15008 16239 133 -4111 -4257
12008 -4257 -11281 -13561 -13599 -23468 -37395 -46745 -54957 -57741 -38450 -11443 -932 6798 8738 -1457
11994 -1457 -3155 7943 6132 -7769 3305 596 -6585 -2399 -3390 -15402 -14256 -24786 -25030 -28270
11980 -28270 -27131 -21301 -23016 -23123 -24926 -28510 -25187 -17153 -6830 4876 -235 -8734 -1352 19905
11966 19905 21944 14861 -4284 1757 8064 -757 -2542 -12875 -8890 -393 -5502 -11460 -5452 -243
11952b43K052J956j2672j5359l950P369J7119N387K599m908j2901j2174p708J7280
11938a6153J7853k894L014Q271j5543k0662K864R358J60P93J3444J0702r237L988
11924E958l99k70m614j983m342j9493j2250O286J3905J0584n765j1850J858M205
11910a8170N027P97J398N086M481r377q24J8702N821k482k918j7574q611k790
11896b1434L494J776K4142J902j1577j8948J709m261K86N415J169j186k680J250
11882a8943j1223k072K248J2259Q27K230N905J3715N218m972O655J245q579q713
11868d200n539o556p15K884J941J552J0299O131k747j40j51j3468q728k30o458
11853b6125j1783M128Q438j657J1510L385j3645J0024l327L79J776n238M656J4739
$$ plain form
11952 -243 1809 3765 -8907 -24266 -28216 -20847 -3728 1659 4258 -650 -13551 -25725 -33433 -16153
11938 -16153 1700 -1194 1820 10091 -5452 -26114 -23250 -13892 -13732 -12939 505 11207 1970 5958
11924 5958 5559 5289 675 -1308 -5650 -25143 -37393 -31107 -17202 -6618 -12383 -24233 -22375 -18170
11910 -18170 -13143 -12346 -10948 -5862 -1381 -10758 -11582 7120 12941 10459 7541 -10033 -18644 -21434
11896 -21434 -17940 -16164 7978 9880 -1697 -20645 -18936 -23197 -22911 -17496 -16327 -17513 -20193 -18943
11882 -18943 -30166 -32238 -29990 -17731 -16904 -14674 -8769 4946 10164 5192 11847 13092 4513 -4200
11868 -4200 -9739 -16295 -17010 -14126 -12185 -10633 -334 5797 3050 2910 2759 -10709 -19437 -19667 -26125
11853 -26125 -37908 -33780 -25342 -26999 -15489 -12104 -25749 -15725 -19052 -18673 -16897 -22135 -17479 -2740
11839b740m574J183L063p62j0138N149L063N362j9165n856L449k613O732J526
11825a6321r520k159N959R60O309J4116J9742J971R536m577j0284j6843l849J149
11811c811J615r476k607j1130N757R692n405M6l670J228j461J5700J134j2253
11797a4641N069j801l755l611p061O843O205Q531J899m035n249O009k888l653
11783a2138K073o670j0375j8219K749k367J0893R863M061o963Q022J0427O473
11770b171j885K338n281j8406k564M053R302M009j0859P451N459q196J5075J2374
11756A0699M731p954m300j2182k968k580M66j766P403J1783L01j3462k086j528
11742a3443j1276k11J709K222M016Q323M588J1062Q272m988j5491j1946L858J3175
$$ plain form
11839 -2740 -7314 -6131 -3068 -3830 -13968 -8819 -5756 -394 -19559 -25415 -21966 -24579 -17847 -16321
11825 -16321 -25841 -28000 -22041 -21081 -14772 -656 19086 21057 30593 26016 15732 -1111 -4960 -3811
11811 -3811 -2196 -11672 -14279 -25409 -19652 -9960 -15365 -15319 -18989 -17761 -19222 -3522 -2388 -14641
11797 -14641 -9572 -11373 -15128 -18739 -25800 -18957 -12752 -4221 -2322 -6357 -11606 -5597 -8485 -12138
11783 -12138 -10065 -16735 -27110 -45329 -42580 -44947 -34054 -24191 -20130 -27093 -19071 -8644 -2171
11770 -2171 -4056 -1718 -6999 -25405 -27969 -23916 -14614 -10605 -21464 -14013 -8554 -16750 -1675 10699
11756 10699 15430 7476 3176 -9006 -11974 -14554 -14088 -15854 -8451 3332 3633 -9829 -11915 -13443
11742 -13443 -24719 -24930 -23221 -20999 -16983 -8660 -4072 6990 15262 10274 -5217 -17163 -13305 -130
11728a30J824K038J641n142p383M70q81J0496J0682n057N188p560N023m925n331
11713I53r61K540j7652Q193o288j5881n027J7209J5753L795k633p439K639k039
11699f838J0284M665r760j4796Q151j906n464o783o701k888o894m237k901K0164
11685b5904P531q898j18J4037R049j2509j0964J5916M967J0764j207N353O896
11672A4913n968r338n223q600J883L26P971J899n482q953k401j8055L794J5565
11658a7669Q249j505L630o334K845J1191j2356p445Q557NJ219J25J478J040J1411
11643D441j512K853Q85j4148J362P147q726j2369N273m666J4071O867j5269k384
11629a6175J8995N490j3287j7516J9120J3703L342o217j8130K633N022Q063j1631
$$ plain form
11728 -130 1694 3732 5373 231 -7152 -6682 -7563 2933 13615 8558 13746 6186 11209 6284 953
11713 953 -8 2532 -15120 -6927 -13215 -29096 -34123 -16914 -1161 2634 1 -7438 -4799 -6838
11699 -6838 3446 8111 -1649 -16445 -8294 -10200 -15664 -22447 -29148 -32036 -38930 -43167 -46068 -25904
11685 -25904 -18373 -27271 -27389 -13352 -4303 -16812 -27776 -11860 -6893 3871 2664 8017 14913
11672 14913 8945 -393 -5616 -14216 -12333 -12007 -4036 -2137 -7619 -16572 -18973 -37028 -33234 -17669
11658 -17669 -9420 -10925 -7295 -13629 -10784 407 -11949 -19394 -10837 -10832 -9613 -9488 -8010 -6970 4441
11643 4441 2929 5782 6667 -7481 -6119 1028 -7698 -20067 -14794 -19460 -5389 1478 -13791 -16175
11629 -16175 2820 8310 -4977 -22493 -3373 10330 13672 7455 -10675 -8042 -3020 5043 -6588
11616f588M739j4360p246Q168J4579j1206m897Q366J897o936J010Q685P71L748
11602G30J274j1601N082J316Q095o247m161O399j138m161O581J6796n051r682
11588D232p175N348n880l263J1479L132m494M238m565j891J0917P471j2856j964
11574D729m392r611m359J267k669J1761J8566O111o132k0942o08K590p825n925
11560a7439K181j799M621J9601O099j491m698N482L786q207o922k608l8k319M933
11545A182M346N500K414j1490k432q987L292J0885j016j4226p428J0436L466M072
11531A4n98l928M370K238K951o403l325j553m67M854R900r157m804N704l211J0366
11515F951P153k324N466N74j8498L406O216l647o197l077j6627k040J1376j4693
$$ plain form
11616 -6588 -1849 -16209 -23455 -15287 -708 -11914 -16811 -8445 -6548 -13484 -12474 -3789 -3018 730
11602 730 2004 -9597 -4515 -3199 4896 -1351 -5512 887 -251 -4412 2169 18965 13914 4232
11588 4232 -2943 2405 -3475 -6738 4741 7873 3379 7617 3052 1161 12078 19549 6693 4729
11574 4729 337 -9274 -13633 -12366 -15035 -3274 15292 21403 15271 -5671 -6279 -3689 -11514 -17439
11560 -17439 -15258 -17057 -12436 7165 13264 11773 7075 12557 16343 8136 1214 -1394 -1432 -3751 1182
11545 1182 5528 11028 13442 1952 -480 -9467 -6175 4710 3694 -10532 -17960 -7524 -4058 14
11531 14 -584 -4512 -142 2096 5047 -1356 -4681 -6234 -6701 -1847 8053 -1104 -5908 -204 -3415 6951
11515 6951 14104 11780 17246 17820 -678 2728 8944 5297 -900 -3977 -20604 -22644 -11268 -25961
11501b5961J3381J7645m042r296j659J15M048L742n692n032k961qJ3621J0567
11487H468J0399q268l081J163r062J704p609L602m699o916p474l667Q576M621
11473a2243r759p925R836P283j3137J1315K7317q03r880j156J864q236j3226N426
11459a3324K127L457p162o368p899R542R523J5438M26j3155l732K626R447J5057
11445A6003n468r692P234L45L800o304j0927J0183n546k80Q413P498n635o770
11431B854p278n00M309N062O661J0390K0465L930P614n078j0800n113N493m304
11417C3705r180j9923j0938J0192J5980j284o726o686j0596R931J5134K023j0290
11404A1342M773p585j9631P491J0744k197K379J684r36M200j7098r627k2Q103
$$ plain form
11501 -25961 -12580 5065 1023 -8273 -9932 -9817 -5769 -2027 -7719 -12751 -15712 -15720 -2099 8468
11487 8468 18867 10599 7518 8681 -381 1323 -6286 -2684 -7383 -14299 -21773 -25440 -16864 -12243
11473 -12243 -22002 -29927 -20091 -12808 -25945 -14630 12687 11884 2004 848 2712 -5524 -18750 -13324
11459 -13324 -11197 -7740 -14902 -21270 -29169 -19627 -10104 5334 5760 -7395 -11127 -8501 946 16003
11445 16003 10535 843 8077 8422 12222 5918 -5009 5174 -372 -652 7761 15259 9624 2854
11431 2854 -4424 -4924 -615 4447 11108 21498 41963 45893 53507 48429 37629 32516 38009 33705
11417 33705 24525 4602 -6336 3856 19836 18552 11826 5140 -5456 4475 19609 21632 11342
11404 11342 16115 8530 -11101 -3610 7134 4937 7316 9000 8064 12264 -4834 -14461 -14483 -6380
11390f380p428L577O404P694L31o359m858m32n687K114J2404n22N867k58l061
11375C406J1909J776j950j0891K796K748k976L804l874j2071N182n235K63J7623
11361A2510L239j3012j3868q699P779l433J2873J7461K1792j1944j8375j5104
11349h781q868M220J0647m679k543J4443n655n262r709P586R396j446o388N682
11335a357l372M729o442n617k632J7677J7118J453N450o142q037J62J07k234J726
11320A2589J896p335K715R783Q652k379n690p540J032q707L353o297j3832l867
11306a5627R099J0696O351j3111n685n132K027P169J8242R106m971j5575Q18k440
11292I67J1173O333k468j2075J6834J1254n035J0004j3497k4447l574P413j209
$$ plain form
11390 -6380 -13808 -10231 -3827 3867 4198 -2161 -7019 -7451 -13138 -11024 1380 858 6725 6467 3406
11375 3406 15315 17091 15141 4250 7046 9794 6818 10622 6748 -5323 -141 -5376 -5113 12510
11361 12510 15749 2737 -11131 -19830 -12051 -15484 -2611 14850 36642 24698 6323 -8781
11349 -8781 -17649 -13429 -2782 -7461 -10004 4439 -1216 -6478 -16187 -8601 795 -651 -7039 -1357
11335 -1357 -4729 0 -6442 -12059 -14691 2986 20104 21557 27007 20865 12828 12990 13097 10863 12589
11320 12589 14485 7150 9865 19648 28300 25921 20231 12691 13723 5016 8369 2072 -11760 -15627
11306 -15627 -6528 4168 10519 -2592 -8277 -13409 -11382 -4213 14029 23135 18164 2589 3407 967
11292 967 12140 18473 16005 3930 20764 32018 26983 36987 23490 -957 -4531 2882 1673
11279A673j27M933K898Q684K868L648j12o221N309j3690k087n044k734j0324J4538
11264D212K925P811K020M000r84K575o134j7898J1917Q395r255J1109K535j3552
11250I676p178P432K0763J3376o241j7384m584l298K767j2306N026K630O830k410
11236A5099j4412J870N666j258P464P046J5579P227j539q373l817o155o618N94
11222A8373o169q538L399J878N062K123n499Q666j303j4736k196k392p403J6079
11208G344Q138o306m906K2621J1576M506j1736q472p802o782k339n475J843J0109
11194A2319o887P281P756L989n011j0509L719K728n077p040n103M837M746J4550
11180B2298R438p265l263j149p471m824j311j296J954M122L073Q994o96K110p024
$$ plain form
11279 1673 1546 6479 9377 18061 20929 24577 24465 18244 23553 9863 7776 2732 -2 -10326 4212
11264 4212 7137 14948 16968 20968 19984 22559 16425 -1473 10444 18839 9584 20693 23228 9676
11250 9676 2498 9930 30693 44069 37828 20444 15860 12562 15329 3023 8049 10679 17509 15099
11236 15099 687 2557 8223 6965 14429 21475 37054 44281 42742 34369 30552 24397 17779 18373
11222 18373 12204 3666 7065 8943 14005 16128 10629 19295 17992 3256 1060 -1332 -8735 7344
11208 7344 15482 9176 4270 26891 38467 42973 31237 22765 14963 8181 5842 367 2210 12319
11194 12319 5432 12713 20469 24458 19447 8938 12657 15385 10308 3268 -1835 3002 7748 22298
11180 22298 31736 24471 21208 20059 12588 7764 6453 5157 7111 11233 14306 23300 22604 24714 17690
11165A7690j0456p337J6183N18N77m621L940J5645O824j7009p008J3051K128q527
11151B1598q733J13O705J924N737k473R389o900k2303Q433J2941K391o146j638
11137B1038P31K555J533j526l83m514n45k006j6894o768Q435k076L32L797N412
11122I121N424n493j2053k255P149O239k165j6327L264J2087M927O826j0383n819
11108E42J092Q418J0703R742J892j6339j2428O267K136j4150J301J6027J3143
11095B8346k638J3574n610p176j228p634j2363l44K604j003j903O261L142J095
11081A5123N979j671j5494k557J0371M818n275L23J1520Q004n634J3227m403j0455
11067B3876p467R27O822M239l765j461p221q8L370o20R326o196J3109O460M198
$$ plain form
11165 17690 7234 -103 16080 16598 17175 12554 16494 32139 38963 21954 14946 27997 30125 21598
11151 21598 12865 12978 19683 21607 27344 24871 34260 27360 5057 13490 26431 28822 22676 21038
11137 21038 21769 24324 25857 24331 23948 19434 18889 16883 -11 -6779 1656 -420 -88 3709 9121
11122 9121 14545 9052 -3001 -5256 1893 8132 5967 -10360 -7096 4991 9918 16744 6361 542
11108 542 1634 10052 20755 30497 32389 16050 3622 9889 12025 -2125 -824 15203 28346
11095 28346 25708 39282 33672 26496 25268 17634 5271 4927 7531 6528 4625 10886 14028 15123
11081 15123 21102 19431 3937 1380 11751 16569 11294 11617 23137 31141 25507 38734 34331 23876
11067 23876 16409 17336 24158 28397 24632 23171 15950 15862 19232 18612 27938 21742 34851 41311 45509
11052D5509K828q156j7194j4969j6533J825J8668N126l512k28P952J3832M751
11039C9899j0523Q744j033j1639K994m013l98o82n979m043J5973K2585Q925J283
11025F2093P900J4937j8083k1301j5462l274m581J8529O349L49K0603J1210j4257
11012F5012N75O529m157j239q185j4347J146r765j0941M842n72L436q2O668K5200
10997F4120R969j1058r564J2892J1383J3556L173l165O201m800L532J4613O857
10984A17709Q784K651K0098L588J9114j08J1525L9696N9882N2614P4618J04680
10972E14851J72411K71454M10090M85119L38763p4177l68116m34558l58362k77960
10962F79515j90759j25053p6440l0739k7056m4916m0425k3270m650m500j6487
$$ plain form
11052 45509 48337 40181 22987 8018 -8515 -6690 11978 17104 13592 13364 21316 35148 39899
11039 39899 29376 38120 37087 25448 28442 24429 24031 23349 17370 13327 29300 51885 60810 62093
11025 62093 69993 84930 66847 45546 30084 26810 22229 40758 47107 47456 68059 79269 65012
11012 65012 65587 72116 67959 66720 58535 44188 45334 35569 24628 29470 28898 32334 32252 38920 64120
10997 64120 74089 63031 53467 66359 77742 91298 94471 91306 97507 92707 96239 110852 117709
10984 117709 126493 129144 149242 152830 171944 171836 183361 223057 282939 335553 410171 514851
10972 514851 687262 958716 1368806 1853925 2192688 2118511 1750395 1315837 957475 679515
10962 679515 488756 363703 287263 256524 229468 184552 144127 120857 116207 111707 95220
10951I5220k46j3196j5569n758K083N586q866j0860O794L390m850L734L229J09
10937F0800k0348q699R343O106J1191j8389j9158L910O223J8072J5812L898j644
10924F7117p839k0240Q103K2898O538J0369R87O108o966j0772n70N891r729j6565
10910E5330K982O980M962N974N603j8248q472n11j1865r543Q884N651q674N398
10896D4451J2123M949J143m041M186L201O471q853K0239j963k086l639p245q827
10882F0109o361J677O192R023J167o741J2756K1092O234N896k775J064J331J1890
10868A22554J3764N157J0139P926M725o609k3178k0973k1200j9823q698Q375J6972
10855H9131O034l110k8149n4455m8127o834J8544J8637K6674K0762J1744J1158
$$ plain form
10951 95220 94974 81778 66209 60451 62534 68120 59254 48394 55188 58578 53728 57462 60691 60800
10937 60800 40452 31753 41096 47202 58393 40004 20846 24756 30979 49051 64863 68761 67117
10924 67117 59278 39038 47141 70039 76577 86946 87933 94041 87075 76303 75733 81624 71895 55330
10910 55330 58312 65292 70254 76228 81831 63583 55111 54600 42735 33192 42076 47727 39053 44451
10896 44451 56574 61523 62666 58625 62811 66012 72483 63630 83869 81906 79820 76181 68936 60109
10882 60109 53748 55425 61617 70640 71807 65066 77822 98914 105148 111044 108269 109333 110664 122554
10868 122554 136318 141475 151614 159540 164265 157656 134478 113505 92305 72482 63784 72159 89131
10855 89131 95165 92055 63906 9451 -38676 -45510 -26966 -8329 18345 39107 50851 62009
10843F2009j60R596K677p156P974J6600J1045j3073j6397r670q361O533M871J05
10829F6593J1837n583Q181L291J2665k905L41p649J953L400m900j1871N901l775
10815G7479P436J6613M818j115J2609L1880J2480n139R100K6584O1006P1658J5489
10802C40898j891j0137k9285l5009p4810n7952m5002m5245M357J1302N518R804
10790G2548O813Q06M895O19m88N663P222J50O822N309o616j799J3689N339K613
10775A23585O571J5519R434k761k0646j4320L624n616l3123J47P875P948J7325
10762A15562J5165M3394L5229L242j0950n405j6004l0784j4925n452L378m436
10750A28014j6451j0917l471M23O634J5468J0153l324N744J0369J3212L632N500
$$ plain form
10843 62009 61849 71445 74122 66966 74940 91540 102585 89512 73115 63445 55084 61617 66488 66593
10829 66593 78430 72847 81028 84319 96984 94079 94420 86771 88724 92124 87224 75353 81254 77479
10815 77479 84915 101528 106346 105231 117840 149720 162200 157061 166161 192745 253751 325409 340898
10802 340898 339007 328870 299585 264576 189766 131814 86812 41567 45924 57226 62744 72548
10790 72548 79361 80167 85062 85681 85193 90856 98078 98228 105050 110359 103743 101944 115633 120972 123585
10775 123585 130156 145675 155109 152348 131702 117382 121006 115390 82267 82414 90289 98237 115562
10762 115562 130727 174121 209350 212592 201642 196237 180233 149449 134524 129072 132450 128014
10750 128014 111563 100646 97175 97598 104232 119700 129853 126529 132273 142642 155854 159486 164986
10737A64986o907j3628j0210Q235q287l475Q033l572M411R728k938n395L925N094
10723A50000k446L073n612o733k1197q261m549J0835K621R857k013J1720K4491
10710A61786J944j929j4515p05j1556k5277m5752m8523m4393j8303L0447O5035
10698D8259L3363L4933K1562K5420K5683K2901J6478j0180n509q9p817J0748K2140
10685B37892J0213J1833P718J3393K5535L9579O6445P3767L7187l8364j11964
10674C73234j37386j05802o2892M0650J12600R8343M4599J2566J4749N713l8186
10663C58188k8500l3031k3229n375J0133J9307R208j0250r473J743j1600j1040
10651B66081O612J5740J0054P649Q049L61j6375K207Q583N940p628k0197K026
$$ plain form
10737 164986 158079 144451 134241 142476 134189 130714 138747 135175 139586 149314 146376 140981 144906 150000
10723 150000 147554 150627 145015 138282 117085 108824 104275 115110 117731 127588 125575 137295 161786
10710 161786 163730 161801 147286 146581 135025 109748 63996 15473 -28920 -47223 -16776 48259
10698 48259 81622 116555 138117 163537 189220 212121 228599 218419 212910 212821 205004 215752 237892
10685 237892 248105 259938 267656 281049 306584 346163 412608 486375 523562 485198 373234
10674 373234 235848 130046 67154 107804 220404 318747 363346 375912 390661 396374 358188
10663 358188 329688 296657 273428 268053 278186 297493 306701 296451 286978 288721 277121 266081
10651 266081 272693 288433 298487 306136 314185 314546 298171 300378 308961 314901 307273 287076 289102
10638B89102J4908j000J3209J3831L0950L6372J9291K0249J2497n271l325r23
10626D39890K852L3409M2272L2226K0359K7061J8588K5490J6552J1118K3013J7711
10614G10541J0952J8745J9572K5805M4235N4093N9593O2339K5339K2580J8749
10603A072543J7855Q027l870J9211M8550N7064O3162P2801P1101Q6736R5679Q6851
10591A695710P2532O7975Q4510J17547J21028J32990J36846J35736J48202J60380
10581B873456J95788J95521K14661K86917K93400L36136M34346N31566N91275
10572E953066O55089P11458Q08244J023599J228091J177164Q95080P92085R51513
10563A4195389J282750J744397K329178L094057M061229N269225O835841R085728
$$ plain form
10638 289102 304010 303010 316219 330050 361000 397372 416663 436912 449409 444138 440813 439890
10626 439890 442742 476151 518423 550649 571008 598069 616657 642147 658699 669817 692830 710541
10614 710541 721493 740238 759810 785615 829850 883943 943536 1005875 1031214 1053794 1072543
10603 1072543 1090398 1098425 1094555 1113766 1162316 1219380 1282542 1355343 1426444 1513180 1608859 1695710
10591 1695710 1768242 1836217 1920727 2038274 2159302 2292292 2429138 2564874 2713076 2873456
10581 2873456 3069244 3264765 3479426 3766343 4059743 4395879 4830225 5361791 5953066
10572 5953066 6608155 7319613 8127857 9151456 10379547 11556711 12451791 13243876 14195389
10563 14195389 15478139 17222536 19551714 22645771 26707000 31976225 38812066 47897794
10555D7897794J2461480J7827732K6816779M2430838O7768677R5672703R0243205
10548D01119208K0256308n8620243q7564287q0424792o0563333m1100977k6765763
10541F6336121j7326142j1381512p773860n530277m034830l029612k389724j882680
10533A2987484j462723j032959o33156m85656o86806r68997j065884r81452p96613
10524D873238n75277l86496k47497k10891k30655k30243k06464j75494j61477
10515B448744j44619j39418j37381j26640r8369q9081o4006p2916p7264q5809
10505A413241p5940o5548l9903l8749m4227n0219l3371j952k2426n5046p8932
10494I06928o9746n3888n0730m1216l6480k9074R200N345l272r897j8416k6833
$$ plain form
10555 47897794 60359274 78187006 105003785 147434623 215203300 310876003 401119208
10548 401119208 421375516 362755273 275190986 194766194 134202861 93101884 66336121
10541 66336121 49009979 37628467 29854607 24324330 20289500 17259888 14870164 12987484
10533 12987484 11524761 10491802 9858646 9372990 8686184 7717187 6651303 5669851 4873238
10524 4873238 4297961 3911465 3663968 3453077 3222422 2992179 2785715 2610221 2448744
10515 2448744 2304125 2164707 2027326 1900686 1802317 1713236 1649230 1576314 1499050 1413241
10505 1413241 1337301 1271753 1231850 1193101 1148874 1098655 1065284 1063332 1040906 985860 906928
10494 906928 837182 783294 732564 691348 654868 625794 634994 640339 637067 627170 608754 581921
10482E81921k6416j6455M456J565j4637l2860j2403O830K267L789q810j722q330
10469D79195l2159m0656k5112j2146o842l28p306k079P352P946J0371Q798j6113
10456C70921k2561k9295j7382j8239m330k7564l7845q084M036J4908J0188O01
10444B35354j9247j0764J628l814j6333P144J2552m058j0917k1113l2883k3440
10432A14109k8956k5390j3415L516K2200K1953K7864M9985M2627K397k6456o5478
10420A24956o3366m0643k2719J4892K3880Q280l040o300J5350J2108P466j290
10408F9574q349j6064K544O187J048k13j4268J7680K9604M5354N7738N5532J5300
10395B61667j6315m1556l8425k8000k6704j9170k8862k9639j968n78K1334J7828
$$ plain form
10482 581921 555505 539050 543506 545071 530434 497574 485171 492001 494268 498057 489247 487525 479195
10469 479195 447036 406380 381268 369122 362280 361952 354646 352567 359919 367865 378236 387034 370921
10456 370921 348360 319065 301683 283444 279114 251550 213705 205621 209657 224565 234753 235354
10444 235354 216107 205343 206971 203157 186824 193968 206520 202462 191545 170432 137549 114109
10432 114109 85153 59763 46348 49864 72064 94017 121881 171866 214493 216890 190434 124956
10420 124956 61590 20947 -1772 13120 37000 45280 42240 35940 51290 63398 70864 69574
10408 69574 61225 45161 47705 53892 54940 54727 40459 58139 87743 133097 190835 246367 261667
10395 261667 245352 203796 165371 137371 110667 91497 62635 32996 31028 30450 51784 69612
10383F9612P136J2303q871j1217r468q715j0222j6450K280K239l442M191J3032
10370D2408L284r737o759j0618j2242J067Q537J1917R843j3835k0158o155o911
10357i359J451J1832J2234J0982m97j2024k297q07k619L876j744N365L016j497
10343A7912K9463J4445J1244j0187k3115j3041l995k0571j4059Q430J9208J5543
10331C1277P75K064L313j1089l1436j4675M381q152o689N603J8837K8213L355
10318B5777n895J010K443p270l842k514O694J1859J2737J0163j0124j3596j42
10305B7300R406N650m585j1541m968P04r415m402p110j6424p788l973m451O826
10291b4771J865P336O326p956n212J4156N219K603J6109P071p062r073Q292M858
$$ plain form
10383 69612 76748 89051 80180 68963 59495 50780 40558 24108 26388 28627 25185 29376 42408
10370 42408 45692 35955 29196 18578 6336 7403 15940 27857 37700 23865 3707 -2448 -9359
10357 -9359 -7908 3924 16158 27140 26643 14619 12322 11515 8896 12772 11028 16393 19409 17912
10343 17912 47375 61820 73064 62877 39762 26721 22726 2155 -11904 -3474 15734 31277
10331 31277 32052 34116 37429 26340 -5096 -19771 -15390 -23542 -30231 -24628 -5791 22422 25777
10318 25777 19882 20892 23335 16065 12223 9709 16403 28262 40999 51162 41038 27442 27300
10305 27300 36706 42356 37771 26230 21262 21966 12551 8149 1039 -15385 -23173 -27146 -31597 -24771
10291 -24771 -22906 -15570 -9244 -17200 -22412 -8256 -3037 -434 15675 22746 15684 6611 14903 19761
10277A9761r028O977M244o553J539p666j0174j362K0196J1061J6216k136r268
10264C3807J8264K1039J0019K8079J6103j2166l7544k5600j9196j929R465j4795
10252B5546n372K495Q845J0851L3482K3596k758k3023k0620k2992j6889j7444
10240d283j5485P525R453j0688k1008k1875j2726R109j096J357L757J6699J0647
10227b8614P888J2962r136o052n790O641r380k999R341l182O760P557O930M28
10213f646R915M316M72n803J829k616O59M976J7910J2034J3959P330n741J1856
10199F4450J3223J3665J4195K0893J5605K88N289O94l2645k5332j2025j0090j4439
10186E3771j9442j2645j7787l407J8643K0032J1734J9758J2985J2322l158k2980
$$ plain form
10277 19761 10733 17710 21954 15401 16940 9274 -900 -2262 17934 28995 45211 43075 33807
10264 33807 52071 73110 83129 111208 127311 115145 77601 52001 32805 30876 40341 25546
10252 25546 20174 22669 31514 42365 75847 99443 96685 73662 53042 30050 13161 -4283
10240 -4283 -19768 -12243 -2790 -13478 -34486 -56361 -69087 -59978 -61074 -59717 -55960 -39261 -28614
10227 -28614 -20726 -7764 -16900 -22952 -28742 -22101 -31481 -34480 -25139 -28321 -21561 -14004 -7074 -6646
10213 -6646 3269 7585 8057 2254 4083 1467 2126 7102 25012 37046 51005 58335 52594 64450
10199 64450 77673 91338 105533 126426 142031 142319 147608 148302 115657 90325 78300 68210 53771
10186 53771 34329 21684 3897 490 19133 39165 50899 70657 83642 95964 92806 69826
10174F9826k0658j7584j4993o708M502M977L66Q545P713L045m027n087j4316j1990
10160C611P45P989j472j4089k959J6701Q423p116K070K258J940K577N79J4753
10146C6010P651q767R615N241J91L975k227J890J5503k80l499J866J4015L8279
10132A19463M9798M2251O1976P8163R9770J54629K35084L68261M88132M16210
10122B113737K0953l38198m44832l91542k95632k06898j61487r5091n4350l0858
10112A15802n613j8921j7117j4646j8127p569J090R461m38l775r240j565j130
10099B8212j6581o059M054j686K874Mj3162m644J882j2680L105j2032l914j2562
10085d3189J094r12J845J3896Q321K3605Q556o782l157M429J156K53L372J0653
$$ plain form
10174 69826 49168 31584 16591 9883 14385 19362 19728 28273 35986 39031 35004 29917 15601 3611
10160 3611 4356 12345 10873 -3216 -6175 10526 18949 11833 13903 16161 18101 20678 21257 36010
10146 36010 43661 34894 44509 49750 49941 53916 51689 53579 69082 68802 65303 67169 81184 119463
10132 119463 169261 211512 273488 351651 451421 606050 841134 1209395 1697527 2113737
10122 2113737 2134690 1796492 1351660 960118 664486 457588 296101 201010 146660 115802
10112 115802 110189 91268 74151 59505 41378 33809 34899 44360 43922 40147 30907 29342 28212
10099 28212 11631 5572 9626 7940 10814 10818 -2344 -6988 -5106 -17786 -14681 -26713 -30627 -43189
10085 -43189 -42095 -43007 -41162 -27266 -18945 4660 13216 6434 3277 7706 8862 9115 12487 23140
10071B3140J1442R366j2823k4711j4595n470Q511M296j5799K946j1584l826R834
10058a9273J251J97R514N890l152Q355O741l282N543O164O534o836o146q424l981
10043i05N249L399j764q877P049R589l127J1864J8661L025p804j863k643k3763
10029H090j2891J1247j13j3405l478j0421m421J1020l91L701J0241j421L255n284
10015d271n585p652J3124J941j501m678N037J0498r631L080K609J912Q776j6061
10001b402j6009m526J0502J5467l176j8383o013J1426k811k869J464l316P790
9988a2856n40j869Q141J965M785R268r883j0545j4511M61O404l313N953P311k644
9973a1873J1459j2014k1057N266J3277P288r860K846Q842J81o612p423J2464L045
$$ plain form
10071 23140 34582 43948 31125 6414 -8181 -13651 -5140 -844 -16643 -13697 -25281 -29107 -19273
10058 -19273 -18022 -17825 -8311 -2421 -5573 2782 9523 6241 11784 17948 24482 17646 11500 3076 -905
10043 -905 4344 7743 5979 -2898 4151 13740 10613 22477 41138 44163 36359 34496 31853 8090
10029 8090 -4801 6446 6333 -7072 -10550 -20971 -25392 -14372 -14763 -11062 -821 -2242 1013 -4271
10015 -4271 -9856 -17508 -4384 -2443 -3944 -8622 -3585 6913 -2718 362 2971 4883 13659 -2402
10001 -2402 -18411 -22937 -12435 3032 -144 -18527 -24540 -13114 -15925 -18794 -17330 -20646 -12856
9988 -12856 -13396 -15265 -7124 -5159 -374 8894 -989 -11534 -26045 -25584 -19180 -22493 -16540 -9229 -11873
9973 -11873 -414 -12428 -33485 -28219 -14942 -7654 -17514 -14668 -5826 -5645 -12257 -19680 -7216 -4171
9959d171j5986M123K540J1250R077N890Q060L111q669j0704o819j3820o305o827
9945b9250N626J5804R915n823J2365K208j7626j0845O885R006m372m304P172J0919
9931G680J4185M142j1598m990j069p609R682k621n269j2099K378k625L420l25
9917f718q732j171k106l692Q718l643L040j93N336J492j1339j2302J4288J468
9903a5554n944P657J0222J9740K986n214j0137p422L417J683j0332l662J0580
9890a980J9838N049k706p791j5436J3687J329k496L393M313j0588j1192n237K100
9876g717J1898j3848p799J5632K777L668m146J626J0415k321j6919J259Q40q79
9862e514J0338j2145j8140M244P874P436j041Q514p186L264J5132M569q731o863
$$ plain form
9959 -4171 -20157 -16034 -13494 -2244 6833 12723 20783 23894 15225 4521 -2298 -16118 -22423 -29250
9945 -29250 -23624 -7820 2095 -3728 8637 10845 -6781 -17626 -10741 -1735 -6107 -10411 -3239 7680
9931 7680 21865 26007 14409 9419 8350 741 10423 7802 2533 -9566 -7188 -9813 -6393 -6718
9917 -6718 -15450 -16621 -18727 -22419 -13701 -17344 -14304 -14497 -9161 -7669 -19008 -31310 -17022 -15554
9903 -15554 -21498 -13841 -3619 16121 19107 13893 3756 -3666 -249 1434 -8898 -12560 -1980
9890 -1980 17858 22907 20201 12410 -3026 10661 11990 9494 12887 17200 6612 -4580 -9817 -7717
9876 -7717 4181 -9667 -17466 -1834 943 4611 465 2091 12506 10185 -6734 -5475 -4635 -5514
9862 -5514 4824 -7321 -25461 -21217 -13343 -5907 -6948 1566 -5620 -2356 12776 17345 8614 1751
9848A751j1314J348P73J8062l049n491L755M567j8992j5567r826P627Q457K647
9834a5252k106K54J6191J5486K29q810o620j0072Q627q15J551K184j373o084O085
9819e25K361q606r604o114Q117R145j036J66M303J0030j5066r23K1084J1016j742
9804B2606j3896j0291N274j921j1449m435O430o29P91J1663R447o807p957o553
9790g727j7023m247K843K132O295q458r659M491J4724R715O544M878n87O845m515
9775F251j5530M186j601J234q188n288N383J0262n539O77K29M660J2014J583O46
9760A0979n561j0132m937j0651j4974k281J4216J5485Q156J431o795m58J869K98
9746c355J792k073j5685L193L076O517L148j357L467j0819o199K820o95L216l264
$$ plain form
9848 1751 -9563 -8215 -7442 10620 7571 2080 5835 10402 -8590 -24157 -33983 -26356 -17899 -15252
9834 -15252 -17358 -17104 -913 14573 14802 5992 -628 -10700 -2073 -2888 -1337 847 -526 -6610 -525
9819 -525 1836 -6770 -16374 -22488 -14371 -5226 -6262 -6096 -1793 8237 -6829 -7752 13332 24348 22606
9804 22606 8710 -1581 3693 1772 -9677 -14112 -7682 -8311 -7520 4143 13590 6783 -1174 -7727
9790 -7727 -24750 -28997 -26154 -24022 -17727 -26185 -35844 -31353 -16629 -6914 -370 4508 3921 10766 6251
9775 6251 -9279 -5093 -6694 -5460 -13648 -18936 -13553 -3291 -8830 -8153 -7924 -3264 8750 10333 10979
9760 10979 5418 -4714 -9651 -20302 -35276 -37557 -23341 -7856 300 1731 -5064 -5522 -3653 -3355
9746 -3355 -1563 -3636 -19321 -16128 -13052 -6535 -3387 -4744 -1277 -12096 -18295 -15475 -16170 -12954 -16218
9731a6218K471k571p601L123N542J459L201k555L634M36l643n670O766L956k886
9716a0556L934p614o270N965j705M991P862R295j1394k449O574N113K781O200
9702A2727l080j171J2308K144j9421j2867k152l689j2347J0515l089N679r643
9689b4086q69K0658J052k655L4L627M108J4657j812P944q569l993J673j5507j2722
9674a6460J6684J5613L056n923n158o719k5681P91Q799J2853m928j1561j0564
9661b9198J052M582J0242j1786J840J2987K682l12J1036k492j2644M875J6942
9648I806M541j3896k0481j759n759n72O923P882M614l894k216n925M152P992r224
9633a7816J4684m913n447J489J3424M448J3692K945j4533k0217o413j096K155
$$ plain form
9731 -16218 -13747 -16318 -23919 -20796 -15254 -13795 -10594 -13149 -9515 -9079 -12722 -18392 -11626 -7670 -10556
9716 -10556 -6622 -14236 -20506 -14541 -16246 -11255 -3393 5902 -5492 -7941 -1367 3746 6527 12727
9702 12727 9647 8476 20784 22928 3507 -9360 -11512 -15201 -27548 -17033 -20122 -14443 -24086
9689 -24086 -24955 -4297 -3245 -5900 -5866 -2239 1869 16526 14714 22658 14089 10096 11769 -3738 -16460
9674 -16460 224 15837 18893 12970 7812 1093 -24588 -23797 -14998 -2145 -7073 -18634 -29198
9661 -29198 -28146 -23564 -13322 -25108 -23268 -10281 -7599 -7911 3125 633 -12011 -7136 9806
9648 9806 14347 451 -20030 -21789 -27548 -28120 -21197 -13315 -8701 -12595 -14811 -20736 -16584 -8592 -17816
9633 -17816 -3132 -8045 -13492 -12003 1421 5869 19561 22506 7973 -12244 -18657 -19753 -17598
9620a7598O456J621k447K0183K890r987k293J0300p8k678L753q938J030m568k839
9605e193o907J7627J0487M803k257r34q407q289m69J2482L781J564L947q013k0652
9590f430n513l817L676M361J0489J7979J639Q83O592l186n353k0549j8510m595
9576b2334J3625p496M020O356N746j1215p801J1024N215q360N922J2593q60k2534
9562a6099p615Q423J4599J0673J066M482M787j4386p84Q542N948m759n332m887
9548D658j1138n363n792J2810N589n77L893M489O514j0692q500r620p679J3646
9534g762J1218M100k853p707k447k874k853N483J0083R893k903m800L593j856
9520H315o358j945j1924n47n523k311m097K843q468n513P694J8104J7623J169
$$ plain form
9620 -17598 -11142 -9521 -11968 8215 11105 1118 -1175 9125 9047 6369 10122 1184 2214 -2354 -5193
9605 -5193 -12100 5527 16014 20817 18560 17626 9219 930 461 12943 16724 18288 22235 14222 -6430
9590 -6430 -11943 -15760 -12084 -7723 2766 20745 22384 23267 29859 26673 21320 771 -17739 -22334
9576 -22334 -8709 -16205 -12185 -5829 -83 -11298 -19099 -8075 -2860 -11220 -5298 7295 6435 -16099
9562 -16099 -23714 -15291 -692 9981 11047 15529 20316 5930 5146 13688 19636 14877 9545 4658
9548 4658 -6480 -11843 -17635 -4825 764 187 4080 8569 15083 4391 -4109 -13729 -21408 -7762
9534 -7762 3456 7556 4703 -3004 -5451 -8325 -11178 -5695 4388 14281 11378 6578 10171 8315
9520 8315 1957 12 -11912 -12459 -17982 -20293 -24390 -21547 -30015 -35528 -27834 -9730 7893 9062
9506I062k965P032J561M760J886p516r744J401j682P143O833J968m753l099Q257
9491B0144L7k034n000O252R564n797o71j2997j5973l21R299K030N350j0801q005
9476h923j2233j8810J1343Q052p326m977O064J5500J3834J1367R376J398n085
9463A9580L404O138R013L243j3409l601q671j4342O050J342j0555k129J9161k473
9449A2751j4220j896j5211R14J486J2671L34l879k238J5278j099l341o621j331
9435f402J5952N46m72j538Q518p738k626l91p48j3040o19m197o310L094o37J684
9419a4924J1128J3494m493j2299Q830K0061K1533j6047j3900L990N1R26M268m224
9405A8394r227m949o759K6n468M219O946l023k957O938j7L839N630r421p310n989
$$ plain form
9506 9062 6097 13129 14690 19450 21336 13820 4076 5477 3795 10938 17771 19739 14986 11887 20144
9491 20144 20181 18147 13147 19399 28963 23166 22495 9498 -6475 -6796 2503 4533 9883 -918 -8923
9476 -8923 -21156 -39966 -28623 -20571 -27897 -32874 -26810 -11310 2524 13891 23267 24665 19580
9463 19580 22984 29122 38135 41378 27969 24368 15697 1355 7405 8747 -1808 -3937 15224 12751
9449 12751 -1469 -3365 -18576 -17662 -16176 -3505 -3171 -7050 -9288 5990 4891 1550 -5071 -6402
9435 -6402 9550 10096 9624 8086 16604 8866 6240 5849 5101 -7939 -8558 -12755 -19065 -15971 -16608 -14924
9419 -14924 -3796 9698 5205 -7094 1736 21797 43330 27283 13383 17373 17424 18350 22618 18394
9405 18394 9167 4218 -2541 -2515 -7983 -3764 3182 159 -2798 4140 4123 7962 13592 4171 -3139 -9128
9389i128k366K762J099O672K163O732J845n634L202K0798P769o291k763N101M830
9374C6791k321j2060j0935J1372P721J145m272k090j0345l638M660l562q681j5521
9360a1736j1051L573J2183J2201k236J0076J334j1938O427J3749J1221K594n623
9347C0774j2157j01P22J982n018K15q974n289O508J1470l73k553N764r638j2166
9332A166m592M549J5190l269J889J1699L278j571Q086o761o287r8q296R28j1029
9317D882j4608K751J4432J970J1289Q473p858j5040j4610J9122J7732q1K731k808
9303B8377o615j2596N531q408j2009J2884J2138p971J0106R72j2851P863k890
9290A4531o092N297L147J914L485p167M325O002j948j803o158j5556j7306J844
$$ plain form
9389 -9128 -11494 -8732 -7633 -961 1202 7934 9779 4145 7347 28145 35914 29623 26860 31961 36791
9374 36791 34470 22410 11475 22847 30568 31713 27441 25351 15006 11368 16028 12466 3785 -11736
9360 -11736 -22787 -19214 -7031 5170 2934 13010 14344 2406 8833 22582 33803 36397 30774
9347 30774 18617 18516 19238 21220 16202 16417 7443 2154 8662 20132 19759 17206 22970 13332 1166
9332 1166 -3426 1123 16313 13044 14933 26632 29910 28339 36425 29664 23377 23279 14983 15911 4882
9317 4882 -9726 -6975 7457 9427 20716 29189 21331 6291 -8319 10803 28535 28454 31185 28377
9303 28377 21762 9166 14697 6289 -5720 7164 19302 11331 21437 22409 9558 17421 14531
9290 14531 8439 13736 16883 18797 22282 15115 19440 25442 23494 21691 15533 -23 -17329 -15485
9276a5485k337M657J5494J8481l933k52P294J080r898q201L960J7290P353j0267
9262B5236j2472j9103k715P642P615l467l744l440j11N994l004N899J2298Q550
9248B5178q631r350j1440K886O130K2426M901L703p043k2115j0869J1855j058
9235F573M186K741k993P434M246o089K79Q003q149j2412L493Q821k697n750j1771
9220d085r448m457P884R772J2521M17Q147J485n941O046j1730m616N561k0208
9206h652R686J4253M925R702p663n712j138P021J0907r009J4293j120p013n274
9192B5206j1150j091R726N253N039p823l74n12r74Q230O246O25J3170n643j4872
9177C1056M608k76K210P790j4367j6655k345M637Q003j0446n252j689J0059R962
$$ plain form
9276 -15485 -17822 -13165 2329 20810 16877 16625 23919 24999 15101 6900 10860 28150 35503 25236
9262 25236 12764 -6339 -9054 -1412 6203 2736 -1008 -4448 -4559 1435 -1569 4330 16628 25178
9248 25178 16547 7197 -4243 -1357 4773 27199 32100 35803 28760 6645 -4224 7631 6573
9235 6573 10759 13500 10507 17941 22187 16098 16377 24380 16231 3819 7312 16133 13436 7686 -4085
9220 -4085 -13533 -17990 -10106 -334 12187 12604 20751 22236 16295 22341 10611 5995 11556 -8652
9206 -8652 1034 15287 20212 29914 22251 16539 15401 22422 33329 24320 38613 37493 30480 25206
9192 25206 14056 12965 22691 27944 32983 25160 24786 24274 23300 31530 37776 38401 51571 45928 31056
9177 31056 35664 35388 37598 45388 31021 14366 12021 16658 24661 14215 8963 7274 17333 27295
9163B7295O273m224N64O848L926Q889j5246l937Q076o200j7827J0768N953o815
9149B4343q545P625M692P018P426o389n627Q018n011K553j069O582j0303k1028
9135A0285l418P505R713Q182m013N29r80j6618o26o600Q551q62K229J080j819
9120A3138m688m362j184O102m199J28k693j2297Q292R628J0571J1607o12J4512
9106D3943j678r131M922M761K968n313m730L373Q856j0768j1783l527r417k795
9092I681M918K094J2209J2842M660J2671q311q061J664j678m289O608K5848J845
9078G2701j1154j430k436j5458O397K655p852j2399r884K159P755J58J0798K621
9064D4631j6716K372k628k383J42J3249J3904O589j4883m819J533l74N590m539
$$ plain form
9163 27295 33568 29344 29908 36756 40682 49571 34325 30388 38464 32264 14437 25205 31158 24343
9149 24343 15798 23423 28115 35133 42559 36170 30543 38561 33550 36103 35034 41616 31313 10285
9135 10285 6867 14372 24085 32267 28254 28783 27803 11185 10559 3959 12510 11648 13877 14957 13138
9120 13138 8450 4088 2904 9006 4807 4935 2242 -10055 -1763 7865 18436 30043 29431 43943
9106 43943 42265 33134 38056 42817 45785 40472 35742 39115 47971 37203 25420 21893 12476 9681
9092 9681 14599 16693 28902 41744 46404 59075 50764 42703 44367 42689 38400 45008 70856 72701
9078 72701 61547 60117 57681 42223 48620 51275 43423 31024 21140 23299 31054 31212 42010 44631
9064 44631 27915 30287 27659 25276 25418 38667 52571 59160 44277 39458 40991 40617 46207 41668
9050D1668P091J4778K1860o241k718k771p314K724q221o950K141o033r804J2639
9036E2849J7559q128j8967K157J9442J8318l432p056n641J1712O810j782j2329
9023G1512j2988J750r900M922l940J976J2259L773q092L566M52p247O135J667
9009F5845o22K707j1340m712R244P248L348J0441j0637j2933R034N691j917m583
8995F6814j6713q055K778J2289m013q002J3323O169j226P178J4571l653k441L725
8981H2744q001n268R44N628j0559k076N311j838K202l790k917J0336M283j5219
8967F1780r624J307L463L826l280N904K2368M409p979M454P340l920j3149m340
8953G2559L681N581j2074K353L106K231J659P36J135M725r776j4733O405K3038
$$ plain form
9050 41668 48759 63537 85397 79156 76438 73667 66353 69077 60856 53906 56047 50014 40210 52849
9036 52849 70408 62280 43313 45470 64912 83230 79798 72742 67101 78813 85623 83841 71512
9023 71512 58524 60274 50374 55296 51356 53332 65591 69364 61272 64838 65290 58043 64178 65845
9009 65845 65223 67930 56590 51878 61122 68370 71718 82159 71522 58589 67623 73314 71397 66814
8995 66814 50101 42046 44824 57113 53100 45098 58421 64590 63364 70542 85113 81460 79019 82744
8981 82744 74743 69475 70419 76047 65488 63412 68723 66885 69087 65297 62380 72716 76999 61780
8967 61780 52156 53463 56926 60752 57472 63376 85744 90153 82174 86628 93968 90048 76899 72559
8953 72559 76240 81821 69747 72100 75206 77437 79096 79832 80967 85692 75916 61183 67588 90626
8939I0626R215O74m884j0116k0265j36R03k338J3720R228K309J1102Q059k775
8925A05322k238q627k312j7089J698N370P782j694j306N162N189p880j1245J6002
8911I4134J9388j0133j9563M73Q857q86R472j028K022n224L472l797K892O970
8897A07049N445m413l297l619O708Q142M985J367j0522R261J7857O152l908n648
8883A35559r042q72K119o844p008j976N089J079j0558k86J5340L46J1937j514
8869A33369J093o57n359p390Q258Q479L519K644j5508M055L789n780L028m623
8855A28917r642j5109J680m402N226K2455J2766j9475j3054J5242K5508J6652
8843A66764r99o824m672K903j686j2042q821J3252J2904o755p295M50L943j2269
$$ plain form
8939 90626 99841 100515 95631 85515 65250 65114 66017 63679 77399 86627 88936 100038 108097 105322
8925 105322 103084 94457 92145 75056 76754 82124 89906 88212 86906 92068 97257 89377 78132 94134
8911 94134 113522 103389 83826 84299 93156 92270 101742 100714 102736 97512 100984 97187 100079 107049
8897 107049 112494 108081 104784 101165 107873 116015 121000 122367 111845 121106 138963 145115 141207 135559
8883 135559 126517 125645 127764 120920 113912 111936 117025 118104 107546 107260 122600 122946 134883 133369
8869 133369 134462 133805 128446 121056 129314 137793 141312 143956 128448 132503 136292 130512 133540 128917
8855 128917 119275 104166 105846 101444 106670 129125 141891 122416 109362 124604 150112 166764
8843 166764 165765 158941 154269 157172 155486 143444 134623 147875 160779 154024 146729 147179 151122 138853
8829A38853Q100J0248o506O84O233O315J2452Q32P423O678R755k565Q418Q965
8815B15885k213r610L643m489m868k0236o329K400K666M734j282K247J6277R800
8801B08625J962Q699m067j964O58L575Q916J0779L667R9J495J5399j052j0622
8787B46169k948r891m134j092j6056N115Q387J2126K1835L865O622J4295J2319
8774B96612o94j3689N57m95r862l469L186P221R128J798n345o044L124N165M421
8759B91614K1016Q937R821L396j920j8818j3334R725J9726J9986K9485P549k3596
8746C63587k713L118k0090o604J0408R683J2671Q862M494m422j0524J289q305
8733C61454L957l338K189J6577K0378J7394n580j139Q948j391J3172J7959K918
$$ plain form
8829 138853 146953 157201 150695 151379 157612 163927 176379 177211 184634 191312 201067 198502 206920 215885
8815 215885 213672 204062 207705 203216 198348 178112 171783 174183 176849 181583 180301 182548 198825 208625
8801 208625 210587 219286 215219 213255 213913 217488 226404 237183 240850 240949 242444 257843 256791 246169
8787 246169 243221 233330 229196 228104 212048 217163 225550 237676 259511 263376 269998 284293 296612
8774 296612 295918 282229 282786 282291 272429 268960 272146 279367 288495 290293 284948 278904 282028 287193 291614
8759 291614 312630 321567 331388 334784 332864 314046 300712 310437 330163 350149 379634 387183 363587
8746 363587 360874 363992 343902 337298 347706 357389 370060 378922 383416 378994 368470 369759 361454
8733 361454 365411 362073 364262 380839 401217 418611 413031 411892 420840 419449 432621 450580 453498
8720D53498o227k0281J0256J3737Q684N443M59J890r121q187K2954J9798P671
8707E00574K6526J6406j5651J973K0973J5110K4380J5472l183o15o94J3709J5127
8694F30107m674K031J3998J4355J8996J8063m39j704L151J4128Q845J0153J3184
8681G40194N869o04J5272L0202K6590K0186P791J0636J5280K4024K3157O513K2988
8668I48098N870R462J9751J0836R727K6951J8901K6287J2597J1641M470M9740
8656A154331M7021K8925J0599K7036L4436K8042J6514K7836L1126K9959N3408
8645A489233N2586M5830L0170L0728M3438L6706L5752M3184M2844M7081M9806
8634A947358M6865M8178N2252O3595O0934O2488N7132O0353O4305Q0232P9798
$$ plain form
8720 453498 447271 426990 437246 450983 459667 465110 465569 467459 458338 450151 473105 492903 500574
8707 500574 527100 543506 527855 529828 550801 565911 590291 605763 602580 601965 601271 614980 630107
8694 630107 625433 627464 641462 655817 674813 692876 692437 690733 693884 708012 716857 727010 740194
8681 740194 746063 745459 760731 790933 817523 837709 845500 856136 871416 895440 918597 925110 948098
8668 948098 953968 963430 983181 994017 1003744 1030695 1049596 1075883 1088480 1100121 1104591 1154331
8656 1154331 1201352 1230277 1240876 1267912 1302348 1330390 1346904 1374740 1405866 1435825 1489233
8645 1489233 1541819 1587649 1617819 1648547 1691985 1728691 1764443 1807627 1850471 1897552 1947358
8634 1947358 1994223 2042401 2094653 2158248 2219182 2281670 2338802 2399155 2463460 2543692 2623490
8623B623490P8735O3126Q6481J05346J09559R7192R7904J05126J13793J20337
8613C601089J25930J17396J22571J46040J61480J62615J55029J64358J74402K04522
8603E135432K04237K08325K25757K33608K63114K74663K85125L25713L61206M07620
8593G924800M14287L34333K79364K89532L11491L46851L95799M37129M49855M60258
8583A1643699M78676M97156N03477M96957N09409N16417N04463N12886M75882
8574A6139022M49252M26703L96279L61156L16790K69273J87372J11259O1502j2312
8564A8706296o9669j45311k15825k52905l21147l69048m11801m58932m75099m77255
8554A5509304m73198m91438m78976m48059l70122k77810l75762o09835o60781
$$ plain form
8623 2623490 2702225 2765351 2851832 2957178 3066737 3163929 3261833 3366959 3480752 3601089
8613 3601089 3727019 3844415 3966986 4113026 4274506 4437121 4592150 4756508 4930910 5135432
8603 5135432 5339669 5547994 5773751 6007359 6270473 6545136 6830261 7155974 7517180 7924800
8593 7924800 8339087 8673420 8952784 9242316 9553807 9900658 10296457 10733586 11183441 11643699
8583 11643699 12122375 12619531 13123008 13619965 14129374 14645791 15150254 15663140 16139022
8574 16139022 16588274 17014977 17411256 17772412 18089202 18358475 18545847 18657106 18718608 18706296
8564 18706296 18636627 18491316 18275491 18022586 17701439 17332391 16920590 16461658 15986559 15509304
8554 15509304 15036106 14544668 14065692 13617633 13247511 12969701 12593939 11984104 11323323
8545A1323323o17791n56227m84246m44444m24674l85890l60322l63019l17958
8536G368752l07032k87111k70910k61059k49967k56795k32672k17742j92202j80792
8526D912470j73157j61865j49007j55291j52449j50590j49622j40271j21920j12418
8516C445880j01852j13275j20295j04264o4797p0929q0936o7918p2428m4756k1465
8505B582965K1080K0851q0422j53759j47779j21861q8645p9762n7896m7233m6258
8494A801281m5840l9494n1645m3029l7907l9223l8872l3697l2654k7278k3730
8483A387912l4750l2908k4689k2271k3709k4321l8060k9070k2888k1711k8249
8472A085286l2974l1788j0882k8197j7567j1325k4607j2090k4204j4006n796j3435
$$ plain form
8545 11323323 10705532 10149305 9665059 9220615 8795941 8410051 8049729 7686710 7368752
8536 7368752 7061720 6774609 6503699 6242640 5992673 5735878 5503206 5285464 5093262 4912470
8526 4912470 4739313 4577448 4428441 4273150 4120701 3970111 3820489 3680218 3558298 3445880
8516 3445880 3344028 3230753 3110458 3006194 2941397 2870468 2789532 2721614 2649186 2604430 2582965
8505 2582965 2604045 2624896 2544474 2390715 2242936 2121075 2032430 1952668 1894772 1847539 1801281
8494 1801281 1755441 1715947 1664302 1621273 1583366 1544143 1505271 1471574 1438920 1411642 1387912
8483 1387912 1353162 1320254 1295565 1273294 1249585 1225264 1187204 1158134 1135246 1113535 1085286
8472 1085286 1052312 1020524 1009642 981445 963878 952553 927946 915856 891652 877646 871850 858415
8460H58415j7845k4681k6365j3932j0206j2647j5831j9437k87p187j9466p145
8448F83386p347q511j8165j6637j5869k0455j2573k656M046j1759o667n791j1000
8435E50002r530j291j4738M144l526k0398M298p056j0550l829o882j7747r806
8422D53091r122j3887o886j1575m345M992j3170r586j1021Q226J2031L725k0306
8409C82167j4368q433o614j3709j0073q27O041R523l509j3718O468m244l231j3504
8395C11969j1581j2261m611R129J0218J429m549k6906J073P154q389j4629j1990
8382B46056M889J4j0924j6287R897R865K163j749o266j2262j3805R481J1091l147
8368B29016Q275K561j6786j5492j8517j065P292n157M694J3560K296o410j9432
$$ plain form
8460 858415 840570 815889 789524 775592 765386 752739 736908 717471 717184 709997 690531 683386
8448 683386 676039 667528 649363 632726 616857 596402 583829 581173 585219 573460 566793 561002 550002
8435 550002 540472 539181 524443 528587 525061 504663 508961 501905 491355 487526 480644 462897 453091
8422 453091 443969 430082 423196 411621 407276 412268 399098 389512 378491 386717 398748 402473 382167
8409 382167 367799 359366 352752 339043 328970 328143 334184 343707 340198 326480 332948 328704 325473 311969
8395 311969 300388 288127 283516 292645 302863 304292 299743 272837 273910 281064 272675 258046 246056
8382 246056 250945 250959 240035 223748 233645 243510 245673 243924 237658 225396 211591 221072 232163 229016
8368 229016 237291 239852 223066 207574 189057 187992 195284 190127 194821 208381 210677 204267 184835
8355A84835j28P09p449L555o608n546O602k407j516Q881n369j179j302m883r902
8340A58293k046k139K125P365M199p567j1121J2521N110p721k773j0214r567L695
8326A40160J2457m769j9717k380J441r999p808l815Q78L565K0455M060l680p876
8312A22972k158N426m568N899L1937K1092K499j9803k3111j0761q031n639L846
8299A19600Q821k047q59n049l609j75J3100q851j6296J0859K078j8538o165J2674
8285A05543k5o933N62J594l877k413j790M467k338K900J0322q738p544L285j0865
8270H4150J637L503R82Q749j662q059J3245J353j5371J169l767K441r501r980
8256F8889K363o764L93l996Q541P263l840q912l442M069r12n604o116N388L258
$$ plain form
8355 184835 184707 185416 177967 181522 174914 169368 175970 173563 172047 180928 175559 174380 173078 168195 158293
8340 158293 156247 154108 156233 163598 167797 160230 149109 161630 166740 159019 156246 146032 136465 140160
8326 140160 152617 147848 128131 125751 127192 117193 109385 105570 106448 110013 130468 134528 130848 122972
8312 122972 120814 126240 121672 127571 159508 180600 183099 163296 140185 129424 121393 115754 119600
8299 119600 128421 126374 125515 120466 116857 116682 129782 120931 104635 115494 117572 99034 92869 105543
8285 105543 105518 98585 99147 100741 96864 94451 92661 97128 94790 97690 108012 99274 91730 95015 84150
8270 84150 85787 89290 90272 99021 97359 89300 102545 103898 88527 89696 85929 88370 78869 68889
8256 68889 71252 64488 64881 60885 69426 76689 72849 63937 60495 64564 63652 58048 51932 57320 60578
8241F0578k45j353L61J67n991L527j0516q879O466N334J0050J0659K844j2148
8227F0854j9121l475j2267J4495Q970r56J677J7418j1822l797M719q444r396K203
8213D1058o08j4225N315K3027J3111j717j9199j973J1925L884m075q082J1794
8200F0235J2048j3212k1197K015O38J5059p39J498L851n953j307K308K295o38
8186E6901n313J3944Q578q778n807o203q060j5975p524R253J7420J3762M035M49
8172F6682j0345m098n413K742J3559n525l495K0290N60j3993m353P195p760m916
8158E1130Q30J5352m738r638n506O292O155M578Q033j1842j7177p440j629k850
8144C1550p265o094J5447O713o099n161O348O571j2536j0428J4981L505n587K071
$$ plain form
8241 60578 60333 58980 59341 59508 53517 57044 46528 37649 44115 49449 59499 70158 73002 60854
8227 60854 41733 38258 25991 40486 49456 48500 50177 67595 55773 51976 56695 48251 38855 41058
8213 41058 40450 26225 31540 54567 67678 65961 46762 44789 56714 60598 56523 48441 60235
8200 60235 72283 59071 37874 39889 40527 55586 54847 56345 60196 54243 52936 55244 57539 56901
8186 56901 51588 65532 74110 65332 59525 53322 45262 29287 21763 31016 48436 62198 66233 66682
8172 66682 56337 52239 46826 49568 63127 57602 54107 74397 74957 60964 56611 63806 56046 51130
8158 51130 51960 67312 62574 52936 47430 53722 59877 64455 72488 60646 43469 36029 34400 31550
8144 31550 24285 18191 33638 40351 34252 29091 35439 42010 29474 19046 34027 37532 31945 34016
8130C4016K864K711P917K040j7625n179m62m848p130L680P733N791q622k1300
8116A586k065J2426j4221j762J530r049n386N452J3308J9175j064Q98O866P339
8102C5033J159q591m034M679q18j1990l93p49p197L82P680L427n463J893j56l1
8086A4831K751J1716J4325k347m108q145k505o872j634J3147N194r997P254J1387
8072D4997l334p794p245P416N954n496k6566J0008J3490J403J679O248M127q316
8058C6571j3283J316N134m278j945k772N338N782j1729K293J2308R611j1693q162
8044B4491o511l297J3324O242O44N99n532j5947l717n346O570K0137J1930l278
8030D0309j178n623J1527J3011Q607j0491j3456k894K908p758J230K561l479k374
$$ plain form
8130 34016 36880 39591 47508 49548 31923 26744 26282 21434 14304 17984 25717 31508 22886 1586
8116 1586 -479 11947 -2274 -4036 -2506 -11555 -16941 -11489 1819 20994 19930 20828 27694 35033
8102 35033 36192 27601 23567 28246 27428 15438 15045 14296 7099 7481 15161 18588 13125 15018 14862 14831
8086 14831 17582 29298 43623 41276 37168 29023 26518 19646 18012 31159 36353 26356 33610 44997
8072 44997 41663 33869 26624 34040 39994 34498 7932 17940 31430 32833 34512 40760 44887 36571
8058 36571 23288 24604 29738 25460 23515 20743 26081 31863 20134 22427 34735 44346 32653 24491
8044 24491 17980 14683 28007 34249 34893 35492 29960 14013 10296 4950 11520 31657 43587 40309
8030 40309 39131 33508 45035 58046 66653 56162 42706 39812 42720 34962 36192 38753 35274 32900
8016C2900Q60j2014j1231o347N520R215K181n944l824P164N749j2082p664K669
8002G152k375l307K895k60J5599L656K814o600j447Q566K996j0654m38n123l925
7987I549M775j247L626j0109n223P383L519j139J0710P453r34M445j0641J053
7973B3220J3277O71O985K506p31J240K678q052M988L539n390j2627k1482k93k046
7958H483j31J9692K237j4653J0897K751j1903M171m883l944N182J594M16p999
7944A1910k560m153l694L817N15J4471M58m207N791R039K093L84J4517k519j3828
7929C2034M096o714p065L700P702Q382m389R740j8305q46P803j1253k2745l480
7915a340J6212J7492q604j1917j5147o18R778M25O146J1619J410J1319o872j0144
$$ plain form
8016 32900 33760 21746 10515 4168 9688 18903 21084 15140 11316 18480 24229 12147 4483 7152
8002 7152 4777 1470 4365 4105 19704 23360 26174 19574 18127 26693 29689 19035 18597 13474 9549
7987 9549 14324 13077 16703 6594 1371 8754 12273 11134 21844 29297 28363 32808 22167 23220
7973 23220 36497 37168 44153 46659 45928 47168 49846 41794 46782 50321 44931 32304 10822 10529 8483
7958 8483 8352 28044 30281 15628 26525 29276 17373 21544 16661 12717 17899 19493 19909 11910
7944 11910 9350 5197 1503 5320 5835 20306 20764 16557 22348 31387 33480 33864 48381 45862 32034
7929 32034 36130 29416 22351 26051 33753 42135 37746 47486 29181 28335 36138 24885 2140 -1340
7915 -1340 14872 32364 23760 11843 -3304 -3922 5856 6281 12427 24046 25456 36775 29903 19759
7901A9759J469Q378J2807m366O864j8225k2726k0910j2623J5235O387l314J0148
7888a117P369R720J1593Q195j9648j7289k407l455q64R947N663M59J1821Q90N200
7873B6077l674j3937o236l814m984Q35N786J1800P947P85p097q684Q952J1274
7859B5030J4064L157n5j1133r686j1329K480L616j93l448m507N637N896r285j814
7844H430Q419N304p133k767r991k713j074j1371J0772j437K86L717k233L79O658
7829E246l494j0290L104J2148K373j4515k993J2360j391o833R564O138m656o990
7815b29K860J2001J568L099n698j1707j5688l954J582m95r961k177r66J2405Q198
7800i162J481J111q96k745N272J0329N960P604o599m860N004Q551p012m894O811
$$ plain form
7901 19759 21228 29606 42413 38047 44911 26686 3960 -16950 -29573 -14338 -7951 -11265 -1117
7888 -1117 6252 15972 27565 35760 16112 -1177 -3584 -7039 -7903 2044 7707 8166 19987 20877 26077
7873 26077 22403 8466 2230 -1584 -6568 -5733 53 11853 19800 20585 13488 4804 13756 25030
7859 25030 39094 42251 42196 31063 21377 10048 12528 16144 15951 12503 7996 13633 19529 10244 8430
7844 8430 16849 22153 15020 12253 2262 -451 -1525 -12896 -2124 -3561 -3275 442 -1791 -1412 5246
7829 5246 1752 -8538 -5434 6714 9087 -5428 -8421 3939 2548 -4285 5279 11417 6761 -229
7815 -229 2631 14632 16200 19299 13601 1894 -13794 -17748 -16166 -16661 -26622 -28799 -29765 -17360 -9162
7800 -9162 -7681 -6570 -7466 -10211 -4939 5390 11350 18954 12355 7495 12499 21050 14038 9144 15955
7785A5955j8735j7390J1580J5679m34m677j0283N791R714K265R858o624j2137
7772E62q167O059m773j0319l371J3432J1469o611j6096n88Q828J5113N753r488
7758A803Q761m797o953P482J546j0985L246r04P159k033m649K867Q715L262j3668
7743H52Q94K875L938n134q046m19J0077Q876O324k26k262o752j5811q014p102
7728a9930o098J6209J9551k127q33p752j1004p944K798k699J3604j3152q566j526
7714b9469J3508M679k0978l551n557j694M895J9857J9736j25l619l585q70R460
7700B687l379J372j688P735r891j5596J829J0407j571j1200k868J0616n936j1266
7686b8749J640J3355p155J290J7049m701r346P017n271r831K753J4463K403J286
$$ plain form
7785 15955 -2780 -20170 -8590 7089 6655 1978 -8305 -2514 7200 9465 19323 12699 562
7772 562 -7605 -1546 -6319 -16638 -20009 -6577 4892 -1719 -17815 -18403 -9575 5538 11291 1803
7758 1803 10564 5767 -1186 6296 7842 -3143 103 -801 6358 4325 -324 2543 11258 14520 852
7743 852 1746 4621 8559 3425 -4621 -5040 5037 13913 20237 20011 17749 10997 -4814 -12828 -19930
7728 -19930 -26028 -9819 9732 7605 6772 -980 -11984 -19928 -17130 -19829 -6225 -19377 -27943 -29469
7714 -29469 -15961 -11282 -32260 -35811 -41368 -43062 -38167 -18310 1426 1301 -2318 -5903 -6773 2687
7700 2687 -692 680 -1008 6727 -3164 -18760 -16931 -6524 -8095 -19295 -22163 -11547 -17483 -28749
7686 -28749 -27109 -13754 -20909 -19619 -2570 -7271 -16617 -9600 -14871 -24702 -21949 -7486 -5083 -3797
7672c797R723P043L881l147q089j1090o477K002l163K258k170n781J4992O160
7658B345o892l607j0990M264J2080K5569J0499k92j4281j6215q158j7563O438
7645a6803J3352J6797M564k2536q687J299R75K526P672o448R404r07l757q983
7631a1532l603N561l751j629L452J0958N432o079r619N050m550N506R26L969Q173
7616H264J91L32J446j9441l216K320J7904J311q709J499j885l8J3736p508K105
7601H311m517q873j939P201K390q102N614q553n51L094o114r644o442q583m83
7586c7191J2202O393r222l208J5480J5269K035k819j703M581j133R694O55n162
7572E871l826P386m41r116n335J784m280Q748P640L374o501j3554j0900N058J2550
$$ plain form
7672 -3797 5926 12969 16850 13703 5614 -5476 -11953 -9951 -13114 -10856 -13026 -18807 -3815 2345
7658 2345 -4547 -8154 -19144 -14880 -2800 22769 33268 32976 18695 2480 -5678 -23241 -16803
7645 -16803 -3451 13346 17910 -4626 -13313 -12014 -11039 -8513 -841 -7289 2115 1208 -2549 -11532
7631 -11532 -15135 -9574 -13325 -14954 -11502 -544 4888 -1191 -10810 -5760 -10310 -4804 -3878 91 8264
7616 8264 8455 8787 10233 -9208 -12424 -10104 7800 9111 402 1901 16 -22 13714 6206 8311
7601 8311 3794 -5079 -7018 183 2573 -5529 85 -8468 -9019 -5925 -12039 -21683 -28125 -36708 -37191
7586 -37191 -24989 -18596 -27818 -31026 -15546 -277 1758 -1061 -2764 1817 684 10378 11033 5871
7572 5871 2045 9431 8990 -126 -5461 -3677 -7957 791 8431 11805 5304 -8250 -19150 -14092 -1542
7557a542O692J5878O237k1597j1371J3997K2040j427j9761J520j405n547m507
7544g93n095n923M043M770J285J435N560o267l377K759r464n849J0065P176L746
7529D071J1023r538j2170J47M628J167n142J4080O822o73N892m731k6375m473
7515a5272J0858Q409J3900K818n045k793j973j1017j85j0838j3267O260K1360
7502C215N292j0901l161q767o643K315J1884J6971m749n244J994J809k79J3207
7488A6943l690m136j932n911j1261N530J2013L01P80j9808m01n076r542o217p891
7473d0298J0409J0736J1355k721j3154m937J4739J3961q248o950k523L468Q556
7460e607q360l943k013m901L548J0440J8288R625o473j615j4501M15k366o659
$$ plain form
7557 -1542 5150 21028 27265 5668 -5703 8294 30334 28907 9146 10666 9261 3714 -793
7544 -793 -5888 -11811 -7768 -2998 -1713 -278 5282 -985 -4362 -1603 -11067 -16916 -6851 325 4071
7529 4071 15094 5556 -6614 -6467 -1839 -672 -5814 8266 15088 14415 20307 15576 -10799 -15272
7515 -15272 -4414 3995 17895 20713 15668 12875 10902 -115 -300 -11138 -24405 -18145 3215
7502 3215 8507 -2394 -5555 -14322 -20965 -18650 -6766 10205 5456 212 2206 4015 3736 16943
7488 16943 13253 9117 7185 1274 -9987 -4457 7556 7857 8637 -11171 -11572 -16648 -26190 -32407 -40298
7473 -40298 -29889 -19153 -7798 -10519 -23673 -28610 -13871 90 -8158 -15108 -17631 -14163 -5607
7460 -5607 -13967 -17910 -19923 -24824 -21276 -10836 7452 17077 10604 8989 -5512 -5097 -7463 -14122
7446a4122Q61J6438o068j2692Q793Q567q138l043o49L331n459l079J1104J3218
7432I062M815j7682k093n603p821L859P68Q553o987L87r220r603m441J6434J7338
7417b234l05q119J0334k370j2706l448Q353k02O251J0155r63j4553N073K248j296
7402c782P92m883l548l811n213o641J585L175K0209J2134j7780o598k082J1983
7388d460o034j261N605J153R319N139l206R677P237N591p438m85m624q956o42
7373F615L918m614p535j652j1285P537o255l604J649M083N620P372j377k107k409
7358d044K745n362q619j470N084K34j565N187M697O753k143j0409n367q841n111
7343b8231j226O295L986L249o502j014j2012K4176K2388j4974j2453j200N229
$$ plain form
7446 -14122 -13261 3177 -2891 -15583 -6790 1777 -6361 -9404 -10053 -6722 -12181 -15260 -4156 9062
7432 9062 13877 -3805 -5898 -11501 -19322 -15463 -14695 -6142 -13129 -12742 -21962 -31565 -36006 -19572 -2234
7417 -2234 -2539 -10658 -324 -2694 -15400 -18848 -10495 -10697 -4446 5709 4746 -9807 -4734 -2486 -3782
7402 -3782 -2990 -7873 -11421 -15232 -20445 -27086 -25501 -22326 -2117 10017 -7763 -14361 -16443 -4460
7388 -4460 -10494 -11755 -6150 -4997 4322 9461 6255 15932 23169 28760 21322 20837 16213 7257 6615
7373 6615 10533 5919 -1616 -3268 -14553 -7016 -13271 -16875 -15226 -11143 -5523 1849 472 -1635 -4044
7358 -4044 -1299 -6661 -15280 -16750 -11666 -11432 -12997 -7810 -3113 3640 1497 -8912 -14279 -23120 -28231
7343 -28231 -29457 -23162 -19176 -15927 -22429 -23443 -35455 -11279 11109 -3865 -16318 -17518 -12289
7330a2289o921k715k275M744N886M41J715O264Q730m080O539p004l240j1343p458
7315b3006K400N53J8538J5620j857j2774n866J2298l269k705q376r299L583J4740
7301E80M222R217R077j373k2653r149k062j6284L039k906J6036J1954N240k833
7287B105N266m034j1304r227J1079O621k06j4827j952N626K0075J2408j1153q066
7273B411L382L530J463M467N289q21R050N783q836j6331L464M226p391j1701J5577
7258A3562j2916o188k252M025K667L903O080k845j892M723j3799j5030j053K675
7244a8340J968j573J4602q485o094k834P262J1574O11J110j907k705L240j1326
7230a2897j0070R266P47n578J661j422J713m348j2174P54J5938J5157P049j7744
$$ plain form
7330 -12289 -19210 -21925 -24200 -19456 -13570 -13129 -11414 -5150 3580 -500 6039 -965 -4205 -15548 -23006
7315 -23006 -20606 -20053 -1515 14105 12248 -526 -6392 5906 2637 -68 -8444 -17743 -14160 580
7301 580 4802 14019 23096 21723 -930 -10079 -12141 -28425 -25386 -28292 -12256 -302 4938 2105
7287 2105 7371 3337 -7967 -17194 -6115 506 300 -14527 -16479 -10853 9222 21630 10477 2411
7273 2411 5793 9323 10786 15253 20542 19721 28771 34554 25718 9387 12851 17077 9686 -2015 13562
7258 13562 646 -5542 -7794 -3769 -1102 2801 8881 6036 4144 8867 -4932 -19962 -21015 -18340
7244 -18340 -16372 -17945 -3343 -11828 -17922 -20756 -13494 -1920 -1309 -199 -2106 -4811 -1571 -12897
7230 -12897 -22967 -13701 -12954 -18532 -16871 -18293 -16580 -20928 -33102 -32348 -16410 -1253 5796 -11948
7216a1948m787R287M329o287J4694p203m970j514P331m319p062Q254o711k476
7202a3382M364R144p353j6074k3082l531O567Q559k14L616M621J0392L931m675
7188a7117j676J4185j0150j733M43k503n260L285j420Q52k367J862L99m68J267
7173b0401K2226K744L839m910j5473p177m84R277J2697k161O551L643J698N33
7159A2602k3567k477P557R47M993K108L13K474o383j4916l489K446J260j2518
7145b8650J5993K028O25p651J3210m883P756N543k010N25m426Q245O257j939j3756
7130c133k1477k937N271O446P506k939j079j1935J577n407k303n736j006J2834
7116b4318P641J0863j1555n663r825K794K44j557J68k871P502k851k165J7863
$$ plain form
7216 -11948 -16735 -7448 -3119 -9406 5288 -1915 -6885 -8399 -1068 -5387 -12449 -4195 -10906 -13382
7202 -13382 -9018 126 -7227 -23301 -46383 -49914 -43347 -34788 -35002 -31386 -26765 -16373 -12442 -17117
7188 -17117 -18793 -4608 -14758 -16491 -16048 -18551 -23811 -20526 -21946 -21094 -23461 -21599 -21200 -21668 -20401
7173 -20401 1825 4569 8408 3498 -11975 -19152 -19636 -10359 2338 177 6728 10371 12069 12602
7159 12602 -10965 -13442 -5885 -4938 55 2163 2476 4950 -1433 -16349 -19838 -17392 -16132 -28650
7145 -28650 -12657 -10629 -10004 -17655 -4445 -9328 -1572 3971 1961 2486 -1940 6305 12562 10623 -3133
7130 -3133 -24610 -27547 -22276 -15830 -8324 -11263 -12342 -24277 -22700 -28107 -30410 -36146 -37152 -24318
7116 -24318 -16677 -5814 -17369 -23032 -32857 -30063 -29819 -31376 -31208 -34079 -26577 -29428 -31593 -13730
7102a3730j897k65j1294J5l782J159q80l170p787J5911O157q640N461q510N901
7087b5351M000K463J0240J1510r18j3493p217J1920Q497P86r924n964L688J5239
7073E476P587k241k763j7577l54Q75N486j5381R23O915M939o874J1102J3869j2975
7058i93Q616l671j534j91k37M411l801J833P047r926k363n320j2398j0446K799
7043b6174K053K677k634N671J1378J403o538k756l301N908P860l192K817N668
7029H40k841J645k1409K757L879M216M754K923j2225M03N58M633J6821M832n195
7014F591o851o231n284j43M843J5892r623j5655Q268J333M820r646k417N590O326
6999b187M063j5928l931R259j834L560J3413j850m421j865j622r635n824L564
$$ plain form
7102 -13730 -15627 -15892 -27186 -27171 -30953 -29794 -30674 -33844 -41631 -25720 -19563 -28203 -22742 -31252 -25351
7087 -25351 -21351 -18888 -8648 2862 1944 -11549 -18766 -6846 1651 2437 -7487 -13451 -9763 5476
7073 5476 13063 10822 8059 -9518 -9872 -8997 -3511 -18892 -17969 -11054 -6115 -12989 -1887 11982 -993
7058 -993 7623 3952 2418 2227 1990 6401 2600 4433 11480 1554 -809 -6129 -18527 -28973 -26174
7043 -26174 -24121 -21444 -24078 -18407 -7029 -5626 -12164 -14920 -18221 -12313 -4453 -7645 -4828 840
7029 840 -2001 -356 -21765 -19008 -15129 -10913 -6159 -3236 -15461 -15058 -14500 -9867 6954 11786 6591
7014 6591 -260 -6491 -11775 -11918 -7075 8817 -806 -16461 -8193 -6860 -2040 -11686 -14103 -8513 -2187
6999 -2187 1876 -14052 -17983 -8724 -10558 -6998 6415 4565 144 -1721 -3343 -12978 -18802 -15238
6985a5238N911J2222M848R61r337O840q575j587l893j5066k483P659l364K109
6971a8993k435M537R184m416J499J2540K948j1217k79l10J609J2567J6959m641
6957A9552k9236m054M608R984K871j1790N930j444l050j24j1192l669J2575K2556
6943A3517j0352j490m051l153J0963l649L828J7416j802j4186R47L745Q22P146
6929A9701q043r654l949J846p071L395J993R93n050j669N413M076j608K587N66
6914C526o282p738M161P254k504o929L44k336J3496Q509M065m161j614j850O536
6899A4477J849k799o857K410p032L022m37j4695O860N258P548R84K398o115o003
6884H68N62P630m092q463j8700K678J1058Q607R408L318j0314L099Q43n926Q55
$$ plain form
6985 -15238 -9327 2895 7743 8704 -633 6207 -2368 -3955 -7848 -22914 -25397 -17738 -21102 -18993
6971 -18993 -21428 -16891 -7707 -12123 -10624 1916 4864 -6353 -6632 -6942 -5333 7234 24193 19552
6957 19552 -9684 -13738 -9130 854 3725 -8065 -2135 -3579 -6629 -6753 -17945 -21614 -9039 13517
6943 13517 3165 1675 -2376 -5529 5434 1785 5613 23029 21227 7041 7988 11733 12555 19701
6929 19701 11658 2004 -1945 -99 -7170 -3775 -1782 -789 -5839 -7508 -2095 1981 373 2960 3526
6914 3526 -2756 -10494 -6333 921 -1583 -8512 -8168 -10504 2992 11501 15566 11405 9791 7941 14477
6899 14477 16326 13527 6670 9080 2048 5070 4633 -10062 -3202 2056 9604 10588 12986 6871 868
6884 868 1430 9060 4968 -3495 -22195 -19517 -8459 148 9556 12874 2560 5659 6502 576 1431
6869A431J0059K273j4539j2800n166m826j9414R621J4306N727P874k126J1332
6856C752N457j0017p318J53q12q137l558Q387J932n695k742J3547R931o70k923
6841A287j7550j5726J053L596J1448k658j254q01M901K014j1786j0075O299J2218
6827a7034P036L547k045o365K794N462p658j0951j402M07N601N57K398J2630O429
6812A406j63j6319o13N556k511N539P966R332K120k4119j4867L149O658j1j245
6797a8122N867J0001Q200j6485j2914O848Q097l889p34n984J202J7429l489j3276
6783a7249N303L416m899n15P23M859J0399L871p742J648M146p622r006R064n843
6768i447k522J802k496j0667j677J0727J7981Q228n551l742k853r220K200Q254
$$ plain form
6869 1431 11490 13763 -776 -13576 -18742 -23568 -42982 -33361 -19055 -13328 -5454 -7580 3752
6856 3752 9209 -808 -8126 -7973 -8785 -16922 -20480 -12093 -10161 -15856 -18598 -5051 4880 4210 1287
6841 1287 -16263 -31989 -30936 -27340 -15892 -18550 -19804 -20605 -15704 -13690 -25476 -35551 -29252 -17034
6827 -17034 -9998 -6451 -8496 -14861 -12067 -6605 -14263 -25214 -26616 -26209 -20608 -20051 -17653 -5023 1406
6812 1406 1243 -15076 -15689 -10133 -12644 -7105 861 10193 12313 -11806 -26673 -23524 -16866 -16877 -18122
6797 -18122 -12255 -2254 5946 -10539 -23453 -16605 -8508 -12397 -13131 -19115 -17913 -484 -3973 -17249
6783 -17249 -11946 -8530 -13429 -13944 -13221 -8362 2037 5908 -1834 -186 3960 -3662 -12668 -3604 -9447
6768 -9447 -11969 -10167 -12663 -23330 -25007 -14280 3701 11929 6378 2636 -217 -9437 -7237 1017
6754A017P886k539l363j1519o743J0104M961n786q054o622J3983J7299p92k2252
6740a2420M077N563n255K563J5213M989m274k769k209k139j486p551j1340n441
6726b2479o751J3N696j0634j0751R946J1608N178J1043M86J158K47l567m949M443
6711i313J740j1434K669M527O523j0565j971J7114l928j3854M728J6996O246j0871
6697a393j2271J7298J5683j5370o799O409j324k042j2744Q977N81p320q997J1022
6683h290N044q26O797R228J1763L882o328k8103r701j1010J4009K6977J753j6421
6669a226k03M786p333L92L97K024J9626R381j0786k064j5703r471m599q444Q580
6654a4643J4777R740o83j5356j802Q999K051j0056r931r683J154J839n181J2771
$$ plain form
6754 1017 8903 6364 3001 -8518 -15261 -5157 -196 -5982 -14036 -20658 -6675 10624 9832 -12420
6740 -12420 -8343 -2780 -8035 -5472 9741 14730 10456 7687 5478 3339 1853 -5698 -17038 -22479
6726 -22479 -29230 -29217 -23521 -34155 -44906 -34960 -23352 -18174 -7131 -6645 -5487 -5240 -8807 -13756 -9313
6711 -9313 -7573 -19007 -16338 -11811 -5288 -15853 -17824 -710 -4638 -18492 -13764 3232 9478 -1393
6697 -1393 -13664 3634 19317 3947 -2852 3557 2233 191 -12553 -3576 -2995 -10315 -19312 -8290
6683 -8290 -3246 -4072 2725 11953 23716 27598 21270 -6833 -16534 -27544 -13535 13442 15195 -1226
6669 -1226 -1429 3357 -3976 -3584 -3187 -1163 18463 27844 17058 14994 -709 -10180 -14779 -23223 -14643
6654 -14643 134 9874 9191 -6165 -7967 1032 3083 -6973 -16904 -26587 -25433 -23594 -28775 -16004
6640a6004j291k959N795K002J2257j736q21P50P581O810J921j0726P00p221M9
6625b893K45N91j3269j2240j207J0665J2953J1955P742j469P619L510k057l509
6611A8636o203j4145m452m647m282P404M893Q612p098j4546m800q123k235J1603
6597a9383J2364J2793M592j6296p747j271N630k341p75L049k486n160m864L152
6583a8743j2188N15J7443J4015q378o76P57M655n475o76p284j8024K080J9652
6569a2327R089j6807p222R127J9382L759j900O344j208q184r728j7697R934J3565
6555c873M920p306J3354J447r386j1414j0125q751l886M349l412l509J8628J5845
6541c119N41n66J399R974j6728j2134J1319M998k827J5898J743k0604P462L110
$$ plain form
6640 -16004 -17295 -20254 -14459 -12457 -200 -1936 -2757 -2007 5574 12384 14305 3579 4279 -2942 -2893
6625 -2893 -2648 -2057 -15326 -27566 -28773 -18108 -5155 6800 14542 13073 20692 24202 22145 18636
6611 18636 12433 -1712 -6164 -10811 -15093 -7689 -2796 5816 -1282 -15828 -20628 -28751 -30986 -19383
6597 -19383 -7019 5774 10366 -5930 -13677 -14948 -9318 -11659 -12434 -9385 -11871 -17031 -21895 -18743
6583 -18743 -30931 -30416 -12973 1042 -7336 -8012 -7255 -2600 -8075 -8751 -16035 -34059 -31979 -12327
6569 -12327 -3238 -20045 -27267 -18140 1242 5001 3101 9445 8237 53 -9675 -27372 -17438 -3873
6555 -3873 1047 -6259 7095 8542 -844 -12258 -22383 -31134 -35020 -30671 -34083 -37592 -18964 -3119
6541 -3119 -2578 -3144 -1745 8229 -8499 -20633 -9314 -4316 -7143 8755 10498 -10106 -2644 466
6527D66j844j5526o926K1504K4239k263j7236j5080j1176j458J6386N191k476
6514f199J250j550Q116J564J2536K5427J9116j282k6022j3770j419l871o801j68
6500F927p196j6789n671R079L881k3004R851Q375o159N235J2430Q027l964K798
6486C820l184p865l249O251k271J0836K883j2162p647Q060p92r775J1470J3765
6472A0140j0053p322K127n682J0508Q504J281L261j4263k1644J1760J7185R19
6459F721n737q241j0752n319o628j230j956J2082P816Q99K7641J4552m757L456
6445B8547j7171l038J336n685J786L138l155JM699o217l278m339j5972N199N559
6430h590L44p853q884R438J3200N220o409j8390j0729J699R112j502M197O039
$$ plain form
6527 466 -1378 -16904 -23830 -2326 21913 19650 2414 -12666 -23842 -25300 -8914 -3723 -6199
6514 -6199 -4949 -6499 1617 3181 15717 41144 60260 58978 32956 19186 17767 13896 7095 6927
6500 6927 -269 -17058 -22729 -13650 -9769 -32773 -22922 -14547 -20706 -15471 -3041 4986 1022 3820
6486 3820 636 -7229 -10478 -4227 -6498 4338 7221 -4941 -12588 -4528 -5320 -15095 -3625 10140
6472 10140 87 -7235 -5108 -10790 -282 8222 9503 12764 -1499 -23143 -11383 5802 6721
6459 6721 984 -7257 -18009 -23328 -29956 -31186 -33142 -21060 -13244 -12345 15296 29848 25091 28547
6445 28547 11376 8338 9674 3989 5775 8913 5758 5759 10458 4241 963 -3376 -19348 -14149 -8590
6430 -8590 -8246 -16099 -24983 -15545 -2345 2875 -3534 -21924 -32653 -30954 -21842 -23344 -19147 -13108
6416a3108k610k356K793K2958K798Q18j0036j9407L972J1021J3025Q196q922m35
6402H707J1594o46q718K390j0315j6971P66k481o998M110J5680J8341p28j4059
6388F72j6736j8507N110J5544M230j1160K622J9851O9J209p042q681J213l709
6374a5315O335L893O738n381J4343J8149l093j7460m869k187j4271M561K046k767
6360i278J0945O529k78l026K176k729j3125j8930j697N981N533O018R319k693
6346e255J008L282k96K997R964Q51k657M251l734M96R6o188n029J249k613M668
6330C090J1099N666p069j4326j4255j20q86J0298K604L158J0092J718r311M582
6316F340Q206k73k173k30j1450K180o098J894n91L393N412l646l350q633j4931
$$ plain form
6416 -13108 -15718 -18074 -15281 7677 10475 11293 1257 -18150 -14178 -3157 9868 18064 9142 8707
6402 8707 20301 19655 10937 13327 3012 -13959 -13193 -15674 -22672 -18562 -2882 15459 14731 672
6388 672 -16064 -34571 -29461 -13917 -9687 -20847 -18225 1626 1695 2904 -4138 -12819 -11606 -15315
6374 -15315 -8980 -5087 1651 -3730 10613 28762 25669 8209 3340 1153 -13118 -8557 -6511 -9278
6360 -9278 1667 8196 7918 4892 7068 4339 -8786 -27716 -29413 -23432 -17899 -11881 -2562 -5255
6346 -5255 -4247 -965 -1261 1736 11700 12551 9894 14145 10411 10907 11003 4815 -214 1035 -1578 3090
6330 3090 14189 19855 12786 -1540 -15795 -15915 -16801 -6503 -3899 -741 9351 11069 1758 6340
6316 6340 14546 14273 12100 11870 420 2600 -3498 -1604 -2195 1198 6610 2964 -386 -9019 -23950
6301b3950Q230Q348q054L212J839M338o85p761K576l141m723K905M517Q126J329
6286b894l108R045O570j3700R670M464k022n901O018o672j1031J2006K187P06
6272E338l812o060L333k063k4217p019j371j688J1186P511J185M786P667R527
6258D303k880J925O365J800p208j0381K268j9061r577K2366R768Q078K005j0367
6244e96j4058K04R411R091m706k226k678m279j283R884J291P258n845n69k235
6229a336j0380m308Q357m762p752Q331j214p341k050n179l418M548M629M056Q333
6214i486J2529m93k647P869k022k565J736R874N479j1864l494L860j5649j0017
6200a6890k04J1446M675k663K269j9635q377K290J2395J1160J8372J4730r95j3465
$$ plain form
6301 -23950 -15720 -7372 -15426 -12214 -10375 -6037 -6722 -14483 -11907 -15048 -19771 -16866 -12349 -4223 -2894
6286 -2894 -6002 3043 9613 -4087 5583 10047 8025 2124 8142 1470 -9561 2445 4632 5338
6272 5338 1526 -4534 -1201 -3264 -27481 -34500 -35871 -37559 -26373 -18862 -17677 -12891 -5224 4303
6258 4303 1423 3348 9713 11513 4305 -6076 -3808 -22869 -32446 -10080 -312 7766 9771 -596
6244 -596 -14654 -14450 -5039 4052 -654 -2880 -5558 -9837 -11120 -1236 55 7313 1468 899 -1336
6229 -1336 -11716 -16024 -7667 -12429 -20181 -11850 -13064 -20405 -22455 -27634 -31052 -26504 -21875 -17819 -9486
6214 -9486 3043 2550 -97 7772 5750 3185 4921 14795 20274 8410 4916 8776 -6873 -16890
6200 -16890 -17094 -5648 -973 -3636 -1367 -21002 -29379 -27089 -14694 -3534 14838 29568 28573 15108
6186A5108j1442p862o851N391r44j628P479n173O348K562K424J4743K041j1577
6172A0619k3243L059N33j8120L38Q908P244J826J0156J898l826j0081o857M741
6158a2805j442M220R728J460j8224r200J3019R666k421m797p590j126p713R562
6144a7663j0137j1412j997J5343R704l84Q357l120N165M128r059n550P480j0206
6130a9351q492Q274J3384M867j9171o414J614L292K817J3398J5006o519j6568
6117a3863N799k42k97K310j2960K191J0904L136L100p312m565l28j578r09q301
6102b2915j2700K608P040R869Q478Q040q627j0822J2450p24P780J2604n161p454
6088D66r398K477r60k285K960J1041o796l669k972o386l395m147j0348l690J1332
$$ plain form
6186 15108 3666 -4196 -11047 -5656 -6600 -8228 -749 -5922 426 2988 5412 20155 22196 10619
6172 10619 -12624 -9565 -9032 -27152 -26814 -17906 -10662 -8836 1320 3218 -608 -10689 -17546 -12805
6158 -12805 -14247 -10027 -299 1161 -17063 -26263 -13244 -3578 -5999 -10796 -18386 -19512 -27225 -17663
6144 -17663 -27800 -39212 -41209 -25866 -16162 -16546 -8189 -11309 -6144 -2016 -11075 -16625 -9145 -19351
6130 -19351 -27843 -19569 -6185 -1318 -20489 -26903 -25289 -21997 -19180 -5782 9224 2705 -13863
6117 -13863 -8064 -8306 -8603 -6293 -19253 -17062 -6158 -3022 78 -7234 -11799 -12127 -13705 -14614 -22915
6102 -22915 -35615 -33007 -25967 -16098 -7620 420 -8207 -19029 -6579 -7303 477 13081 7920 466
6088 466 -8932 -6455 -7415 -9700 -6740 4301 -2495 -6164 -9136 -15522 -18917 -23064 -33412 -37102 -25770
6073b5770r142p732n219J8068J0592r42m485k154N275k706j756J6279j251j227
6059a2170J666n391r57j4922m247O144k891R214J640j038M902J1770K547j0560
6045a4293P729q38o282j974Q07P839Q265J08L357j0160q259N15M571l075j2977
6030b4667n34Q17L504L562Q926r820j3549J1929J9137O286Q536R72j3068M8K415
6015D494k039j0166j3435p999j238J2596K1739J021j0096R62m717l472j4585o322
6001c3257J4433J3583k572j35N510J2828J4279J4595j794j8551o684m944q773
5988a482K673M224K581J1801q49j5673n432M968O480j2659j5239l280J0046J3211
5974A370k210l855j2081M831J9946J4780M706n961n667p061r592j0559K906K897
$$ plain form
6073 -25770 -34912 -42644 -47863 -29795 -19203 -20145 -24630 -26784 -21509 -24215 -25971 -9692 -10943 -12170
6059 -12170 -10504 -15895 -16852 -31774 -36021 -29877 -32768 -23554 -21914 -22952 -18050 -6280 -3733 -14293
6045 -14293 -6564 -7402 -13684 -15658 -14851 -7012 1253 1361 4718 -5442 -13701 -13186 -8615 -11690 -24667
6030 -24667 -25201 -24384 -20880 -17318 -8392 -18212 -31761 -19832 -695 5591 14127 15099 2031 2079 4494
6015 4494 2455 -7711 -21146 -29145 -30383 -17787 3952 4973 -5123 -4161 -8878 -12350 -26935 -33257
6001 -33257 -18824 -5241 -7813 -7948 -2438 10390 24669 39264 37470 18919 12235 7291 -1482
5988 -1482 1191 5415 7996 19797 18948 3275 -2157 2811 9291 -3368 -18607 -21887 -11841 1370
5974 1370 -840 -4695 -16776 -11945 8001 22781 27487 21526 15859 8798 -794 -11353 -8447 -5550
5960e550P600r323L76j614n123L63k560K541K237p729K51Q526J5267P826P208
5945B0296J93j9188j0452J3457O555j0789p551j1729m445L961P471j575R815m296
5931h277j382J70O39M800J1187J474K252P449j0499j55n408m942p442j1371L645
5916a7860N221o644J0913o409O113o374m307l064l872n339l130Q628L544K261
5902b0319J0821m732j010l933L367J2487P27J533k580m371K545o199j321K689
5888a0296J2374O879M16p089n142L954K411N756L067m208j7548K062L430j7598
5874b1532L760J1456N72j965l113J3228k220r089m434r180R099K4193P206o961
5860A1020o802r330k770Q432N596Q682J074n841j0194j961m018N561Q18Q986L571
$$ plain form
5960 -5550 2050 -7273 -6897 -8511 -13634 -13271 -15831 -13290 -11053 -18782 -18531 -10005 5262 13088 20296
5945 20296 20489 1301 -9151 4306 10861 72 -7479 -19208 -23653 -19692 -12221 -13796 -3981 -8277
5931 -8277 -9659 -9489 -8850 -4050 7137 8611 10863 18312 7813 7658 2250 -2692 -10134 -21505 -17860
5916 -17860 -12639 -19283 -8370 -14779 -8666 -15040 -19347 -22411 -26283 -31622 -34752 -26124 -22580 -20319
5902 -20319 -9498 -14230 -15240 -19173 -15806 -3319 -2592 -1059 -3639 -8010 -5465 -11664 -12985 -10296
5888 -10296 2078 8957 9373 2284 -2858 1096 3507 9263 12330 8122 -9426 -7364 -3934 -21532
5874 -21532 -17772 -6316 -5744 -7709 -10822 2406 186 -8903 -13337 -22517 -13418 10775 17981 11020
5860 11020 4218 -5112 -7882 550 6146 14828 15902 10061 -133 -2094 -6112 -551 267 9253 12824
5845A2824r184k742k878j2910O520J9043O222o993L631o529K015j5598j5907J4659
5831g827J3524j0320j8393j0575J4462J1700k352r705o363J243J9389P553k077
5818B59q864J16J0605n805r931o490j027j266o519o275P683J4585P91r083K853
5803a8368J3180k724J96K555m246k834M886n119k304l866j3355R51J1563J8115
5789a370R553n316L609P60J292j299P058r675l647j8576J966P764j4938J999J5604
5774e216P260J3268k672R36M186q657m320j6414j090l845K251L146j49k288q355
5759b1959l928R837J3956K006J0606k003j0052L59n032K0032l186n008J4590J732
5745B1950j5692j1705k225m49l884j5635J580J3905J1905L567k695R912r434l400
$$ plain form
5845 12824 3640 898 -1980 -14890 -8370 10673 16895 9902 13533 7004 9019 -6579 -22486 -7827
5831 -7827 5697 -4623 -23016 -33591 -19129 -7429 -9781 -19486 -25849 -24606 -5217 2336 259
5818 259 -8605 -8489 2116 -3689 -13620 -20110 -21137 -22403 -28922 -35197 -27514 -12929 -12138 -21221 -18368
5803 -18368 -5188 -7912 -7716 -5161 -9407 -12241 -7355 -12474 -14778 -18644 -31999 -31048 -19485 -1370
5789 -1370 8183 2867 6476 7236 8528 7229 14287 4612 965 -17611 -15645 -7881 -22819 -20820 -5216
5774 -5216 2044 15312 12640 13576 17762 9105 4785 -11629 -12719 -16564 -14313 -11167 -11316 -13604 -21959
5759 -21959 -25887 -16050 -2094 -88 10518 8515 -1537 -1178 -6210 13822 10636 5628 20218 21950
5745 21950 6258 -5447 -7672 -8121 -12005 -27640 -26060 -12155 -250 3317 622 10534 1100 -2300
5731b300J2855k198l305R372p955r447j7845j1011L258M641O381o491Q226J7213
5717A394j856j0867k456n309K0517o88o619p450m102J2184N559R242j0914j3013
5703a4378j1071p897l027K450P427l74J3903J0626J347L878J2624P242j3653j9198
5689a0101j2937o898n044M489K2474Q081j7830kK213o523L299M958L008P134j7960
5674b1639j1568O041P065j979J721m215j4423Q739J3511J6072O070J5094k141
5661A8348j5155j6169k61r794K117k963k982J8438R616j479j5154q906R204K334
5647a2806N625p019N540J849J418J196R704p004r021L741P278O211L594M141n56
5632A3891j3585m982M158J358M19P02j647k520j530o568m468M766R159l266P720
$$ plain form
5731 -2300 10555 8357 5052 14424 6469 -2978 -20823 -31834 -28576 -23935 -17554 -24045 -15819 1394
5717 1394 -462 -11329 -13785 -19094 1423 735 -5884 -13334 -17436 -5252 307 9549 -1365 -14378
5703 -14378 -25449 -33346 -36373 -33923 -26496 -26870 -12967 -2341 -994 2884 15508 22750 9097 -10101
5689 -10101 -23038 -29936 -34980 -30491 -8017 64 -17766 -17768 -15555 -22078 -18779 -13821 -10813 -3679 -21639
5674 -21639 -33207 -27166 -20101 -22080 -20359 -24574 -38997 -30258 -16747 -675 5395 20489 18348
5661 18348 3193 -12976 -13237 -23031 -20914 -23877 -26859 -8421 1195 -284 -15438 -24344 -15140 -12806
5647 -12806 -7181 -14200 -8660 -6811 -5393 -4197 5507 -1497 -10518 -6777 501 6712 10306 14447 13891
5632 13891 306 -4676 -518 840 1259 1961 314 -2206 -3736 -10304 -14772 -10006 -847 -4113 3607
5617C607J8669m468q762N929N372L853k39P618j4908j5793j090P515R622P355
5603B4280L343p993j0823j1020P681l394n509J037k00M619L767M641j3475j1986
5589a5032p785L518j770M902J631P261N130K976M982j531P493n810J012J669m968
5574C678J673n004j2051n893O313K220r60Q553m846j3878J0173M055J6259Q282
5560A8574m906j5141J691N721k579o608K392R214j875J0465k99j5168j2231p837
5546a8587L261J5048Q420q358K25k1358j855J896Q366l526k817J0934K4817M099
5532B0565o298p411j1158j3482L636J3836m603L370R756j1456j3161J1285M516
5519f05J464O815o224k889k767R636l33l57J1028q222j8208M560n529J1583N228
$$ plain form
5617 3607 22276 17808 9046 14975 20347 24200 23961 31579 16671 878 -212 7303 16925 24280
5603 24280 27623 19630 8807 -2213 5468 2074 -3435 -2398 -2598 2021 5788 10429 -3046 -15032
5589 -15032 -22817 -19299 -21069 -16167 -14536 -7275 -2145 831 5813 4282 11775 5965 6977 8646 3678
5574 3678 5351 347 -11704 -17597 -11284 -9064 -10024 -1471 -6317 -20195 -10022 -5967 10292 18574
5560 18574 13668 -1473 218 5939 3360 -3248 -856 8358 6483 16948 16649 1481 -10750 -18587
5546 -18587 -15326 -278 8142 -216 9 -21349 -23204 -21308 -12942 -16468 -19285 -8351 16466 20565
5532 20565 14267 6856 -4302 -17784 -14148 -312 -4915 -1545 8211 -3245 -16406 -5121 -605
5519 -605 859 7674 1450 -1439 -4206 5430 5097 4740 15768 7546 -10662 -6102 -11631 -48 5180
5504E180O718l894r408M407M884P521j1853m926j2880m215J4412R41o950j645
5490a1708o321M481l207p234j118Q039N50P363R319l506p679p371o651J4225M200
5475f618L793J161j1635m66l235P473q087n275j185n19M757P223j988l544O334
5460a1811P085l574K343o216m629p361Q595K3218N250m309M643k996k138P32j3761
5445d929n639O704j066m559j718M85o60J361n986M840J2162m890m650m654j1680
5430b4879r808R878R823p57O942J3576J8578J7j4903p489j1256k054L565m145
5416a2912J246J2900j068r703N665J2036j860n879k726p149K31M066J4146J765
5402A0758J0322J3028j3804j4599o620M966l50K582r954m977N034j1913j412N562
$$ plain form
5504 5180 11898 8004 -1404 3003 7887 15408 3555 -1371 -14251 -18466 -4054 -3113 -10063 -11708
5490 -11708 -18029 -13548 -16755 -23989 -25107 -17068 -16518 -9155 164 -3342 -11021 -18392 -25043 -10818 -6618
5475 -6618 -2825 -1664 -13299 -13765 -17000 -9527 -17614 -22889 -24074 -24593 -19836 -12613 -14601 -18145 -11811
5460 -11811 -4726 -8300 -5957 -12173 -16802 -24163 -15568 7650 12900 8591 13234 10238 8100 8832 -4929
5445 -4929 -10568 -3864 -4930 -9489 -11207 -10722 -11382 -10021 -16007 -11167 995 -3895 -8545 -13199 -24879
5430 -24879 -34687 -24809 -14986 -15743 -8801 4775 23353 23370 8467 978 -10278 -12332 -8767 -12912
5416 -12912 -11666 1234 166 -9537 -3872 8164 6304 425 -2301 -9450 -9219 -5153 8993 10758
5402 10758 21080 34108 20304 5705 -915 4051 3701 6283 -3671 -8648 -3614 -15527 -16939 -11377
5388a1377p40l891n43n411J4038O142j2993L046J3848K766l035L703M591n452
5374D692o493m276l213K73m613M179R451p549j0094K612J1009L987J0575m74m393
5359E673j6195j312Q807j4951L551J5610J5841q299K14q49j7212O204P419o322
5345a821j0874J149J995K291l449L800r821N524J0307J001n772q165J4089J1281
5331A1535M346r812j5139K550O521p338j1419J124J8448N281j914j2185q475J3831
5317b646k75o69J1237K728j5356K32k067r488Q820K899J933N948N7j1636j257
5302i540P888L901l40k145K622o745J1711k571j5398l623J1831M289K981J465
5288F326r42k059m664j1049n383n614j7466J0922J6784m370M948J264K377o776
$$ plain form
5388 -11377 -12117 -16008 -16551 -21962 -7924 -1782 -14775 -11729 2119 4885 1850 5553 10144 4692
5374 4692 -1801 -6077 -9290 -9017 -13630 -9451 0 -7549 -17643 -15031 -4022 -35 10540 10066 5673
5359 5673 -10522 -11834 -3027 -17978 -14427 1183 17024 8725 8939 8090 -9122 -2918 4501 -1821
5345 -1821 -12695 -11546 -9551 -7260 -10709 -6909 -16730 -11206 -899 102 -5670 -13835 254 11535
5331 11535 15881 6069 -9070 -6520 1 -7337 -18756 -17632 816 6097 4183 -8002 -16477 -2646
5317 -2646 -2921 -3590 7647 10375 -4981 -4749 -6816 -16304 -7484 -4585 -2652 3296 3353 -8283 -9540
5302 -9540 -1652 2249 1909 -236 2386 -4359 7352 4781 -10617 -14240 -2409 1880 4861 6326
5288 6326 5384 3325 -1339 -12388 -17771 -23385 -40851 -29929 -13145 -17515 -12567 -11303 -8926 -15702
5274a5702l089q227l588J8895K522J205j474L170k134Q78Q503L793k430q440l530
5259i648l356K40O275j1685j1032J0537Q738m626O948K329K410n911o4P771n029
5244f103P613L481j91q752o317P049r84J1052j377P86k3304Q590J6188O779j8791
5229d281p802m095R594K287M771j2725o173K718J7454L59o088k602o955J3855
5215C17J3428M354j4496J400J3451k0222r754J1480J0946k224J3522j0628k0213
5202h639j0896M953Q239r750j313N779J3524N101q375k963j6504j0034K384O412
5188b2082O865J1434q287j4104j1307k914K4840Q253N759j597J125J2593J164
5175A1742N338P167j4413Q6M750M650j0151j646L627j2669j0092q958j010J1050
$$ plain form
5274 -15702 -18791 -27018 -30606 -11711 -9189 -7984 -9458 -6288 -8422 -7544 959 4752 2322 -6118 -9648
5259 -9648 -13004 -12764 -6489 -18174 -29206 -18669 -9931 -14557 -7609 -5280 -2870 -8781 -8845 -1074 -6103
5244 -6103 1510 4991 4800 -3952 -10269 -3220 -4204 6848 5471 6257 -17047 -8457 7731 14510 -4281
5229 -4281 -12083 -16178 -6584 -4297 474 -12251 -18424 -15706 1748 2107 -3981 -6583 -13538 317
5215 317 13745 18099 3603 5003 18454 -1768 -11522 -42 10904 8680 22202 11574 -8639
5202 -8639 -19535 -14582 -6343 -16093 -17406 -11627 1897 6998 -1377 -4340 -20844 -30878 -28494 -22082
5188 -22082 -15217 -3783 -12070 -26174 -37481 -40395 -15555 -7302 -1543 -3140 -2015 10578 11742
5175 11742 17080 24247 9834 9920 14670 19320 9169 7523 11150 -1519 -11611 -20569 -21579 -10529
5161a0529J3885K780J294m451q057J2664J180j929o983q445M940k83k429o238
5147a2601R48k567M756m539P740J3878r40l436Q303j0468l46O243M662m830p330
5132e27Q384m420o325j642M576l639j1699P883J3136J675m182j4582M410J0980
5118D028J6557J099j4229q876m385j7311J625K1249r86J807L171J5004P893r844
5104A6802n079k171J1407P477k1700l072J3978k241l794k910j4447o069p632m586
5090b4037m290J2878M208J015J1051k784j3782M94M799K133J7200P307M749k420
5076A8521q670j342j3397K351n505j1470j1285P276j705n308N705J6688r339j3312
5062c0792K815k940J1799M847k245L336J3583j553k32M811k271J0811m744k1302
$$ plain form
5161 -10529 3356 6136 7430 2979 -5078 7586 8766 6837 -146 -8591 -3651 -3934 -6363 -12601
5147 -12601 -11653 -14220 -9464 -14003 -6263 7615 6675 3239 11542 1074 728 6971 11633 6803 -527
5132 -527 7857 3437 -2888 -4530 46 -3593 -15292 -7409 5727 7402 3220 -11362 -6952 4028
5118 4028 20585 21684 7455 -1421 -5806 -23117 -21492 -243 -1229 578 3749 18753 26646 16802
5104 16802 11723 9552 20959 28436 6736 3664 17642 15401 11607 8697 -5750 -11819 -19451 -24037
5090 -24037 -28327 -15449 -11241 -10226 825 -1959 -15741 -15247 -10448 -8315 8885 16192 20941 18521
5076 18521 9851 8509 -4888 -2537 -8042 -19512 -30797 -23521 -25226 -30534 -24829 -8141 -17480 -30792
5062 -30792 -27977 -30917 -19118 -14271 -16516 -13180 403 -1150 -1382 3429 1158 11969 7225 -14077
5048a4077l240J6429J8099o762K72p454K233k782p176P88J132Q399p698j4658
5034a6495L526P144l532O103q335N9J8512j05o258l714J9639K264j7394K120O35
5019D169j1304l177J0273R735p344j6352r090j6k561M444r117L462J0156J246
5005a5476k785p095K019N731Q590J4451J2081r00j4505q858Q427j062l833L564
4991C49o249N266J0449O418l786q244p392o763P907Q013l325j2899o123m255R462
4976a1172K0534k458o772k771J215R63j1649m052J549J1428J305r595P254R28
4962c293k737n315P295J6422J0626l743q540Q657m508k049j418k541j9663k797
4948a3604L195p895n198q74O605R360J0749P883j6087q085N444R094M727l659
$$ plain form
5048 -14077 -17317 -888 17211 10449 10721 3267 5500 2718 -4458 -3670 -2538 5861 -1837 -16495
5034 -16495 -12969 -5825 -9357 -3254 -11589 -11530 6982 6877 619 -3095 16544 18808 1414 3534 4169
5019 4169 -7135 -10312 -39 9696 2352 -14000 -23090 -23106 -25667 -21223 -30340 -26878 -16722 -15476
5005 -15476 -18261 -25356 -23337 -17606 -9016 5435 17516 16616 2111 -6747 1680 618 -3215 349
4991 349 -5900 -634 9815 16233 12447 4203 -3189 -9952 -2045 5968 2643 -10256 -16379 -20634 -11172
4976 -11172 9362 6904 132 -2639 -1424 -461 -12110 -16162 -14613 -3185 -1880 -11475 -4221 -3293
4962 -3293 -6030 -11345 -4050 12372 22998 19255 10715 19372 14864 12815 11397 8856 -10807 -13604
4948 -13604 -10409 -18304 -23502 -24376 -17771 -8411 2338 10221 -5866 -13951 -8507 587 5314 1655
4934A655O16m966j762n332L182J493N222J553j903k523j862r672r155L519M063
4919a5872n970p375M738J6432P701n802J0563l230n525J514Q355m836p72l820
4905c899K725j398O233J165j1181r651L489P046J1587r447j1020J2541J1684j2133
4891b259n958m595J3536J7941N741j3650o986N990O239N627N373J3312k1262j8432
4877F17m084M143P405L620K83n297o55K422P47P510j590j3970r139k718J3809
4862C103l270P235n082J038n987j3384Q998Q301l668j1247K19Q823k016q122p299
4847b2358J0676J0380J0608j731q899K497l262o531n469J1953M459M483j5010
4834h204n754J133R22k868m91P785J6698J2661k0438j9491Q3N729J436r03N257
$$ plain form
4934 1655 2271 -2695 -4457 -9789 -6607 -5114 108 1661 -242 -2765 -4627 -14299 -23454 -19935 -15872
4919 -15872 -21842 -29217 -24479 -8047 -346 -6148 4415 1185 -4340 -2826 5529 693 -79 -3899
4905 -3899 -1174 -2572 3661 4826 -6355 -16006 -12517 -5471 6116 -3331 -14351 -1810 9874 -2259
4891 -2259 -8217 -12812 724 18665 24406 10756 3770 9760 15999 21626 26999 40311 19049 617
4877 617 -3467 676 8081 11701 11984 6687 6032 8454 9201 16711 15121 1151 -7988 -10706 3103
4862 3103 -167 7068 1986 3024 -2963 -16347 -7349 952 -2716 -13963 -13744 -4921 -6937 -15059 -22358
4847 -22358 -11682 -1302 9306 7575 -1324 1173 -2089 -8620 -14089 -2136 2323 6806 -8204
4834 -8204 -13958 -12825 -11903 -14771 -15262 -7477 9221 21882 1444 -18047 -17964 -12235 -10799 -11702 -6445
4819f445k710J0815J1616N890o37j4666r184o779J047R750m784L090Q98O889O587
4804A1377n115l666J0231m029P565J1869o931r665K14R77p028n236q558l843O129
4789e709K3579O498J457q077L685r139l303k478p36O595n427K377k100L525j359
4774I388Q188M105m052j622r756q283j897J0438N447N637o469m22J655K966j117
4759A4206q463r433r254o681j882J3900O988L260R426m648J79r09Q163M094j2215
4744F731p390j3758q428J3672R360m106j5115N942M605J1649O0M736n742o096
4730c880M37m103j4528R09k735P302O10J1162P736J409n296k492O260k721o703
4715f633j1711L81O806O923N162p1l206M403L512j1721L113R016J374n902n107
$$ plain form
4819 -6445 -9155 1660 13276 19166 18529 3863 -5321 -12100 -11053 -1303 -6087 -2997 -2099 4790 11377
4804 11377 6262 2596 12827 8798 16363 28232 21301 11636 11850 12827 5799 563 -7995 -11838 -5709
4789 -5709 17870 24368 25825 17748 21433 12294 8991 6513 5777 12372 6945 9322 7222 10747 9388
4774 9388 17576 21681 17629 16007 6251 -2032 -3929 6509 11956 17593 11124 10702 12357 15323 14206
4759 14206 5743 -3690 -12944 -19625 -21507 -7607 -619 2641 12067 7419 7598 6689 14852 18946 6731
4744 6731 -659 -14417 -22845 -9173 187 -3919 -19034 -13092 -8487 3162 3222 7958 2216 -3880
4730 -3880 -3443 -7546 -22074 -21165 -23900 -16598 -15988 -4826 2910 4319 -977 -3469 2791 70 -6633
4715 -6633 -18344 -17963 -11157 -4234 928 857 -2349 2054 5566 -6155 -3042 5974 7348 1446 -3661
4700c661o451k616J2161Q929r124j7104k018M810O826J1446R06j035J624N609
4686A0302N949J0518J945r428j0477n476m388J961l392O973J072n427j428n486
4672f782L438J7757N178p627r066k775l448j4461p717J0261J442P738q06n652
4658a2520j5836q387P619J6984R530p666q072p603j647J218J3026R230M724p578
4644f978J1026J0928q004J813j469l79M03J0684L837j3160j0529j6637r706m316
4630c2487J8797J6948j1131j3605J951N071j4461j785J0784J8274k334N184l049
4617a843j9452l230l074k635j905M445J8976O679p696j874P256N797j1388m400
4603a4344j3395n400J1299J2565q485P756K44O684j941J200J0057j093r654r403
$$ plain form
4700 -3661 -10112 -12728 -567 8362 -762 -17866 -19884 -15074 -8248 3198 4104 3069 4693 10302
4686 10302 16251 26769 28714 19286 8809 3333 -1055 906 -2486 4487 5559 132 -1296 -6782
4672 -6782 -3344 14413 19591 11964 2898 123 -3325 -17786 -25503 -15242 -13800 -6062 -6868 -12520
4658 -12520 -28356 -36743 -29124 -12140 -2610 -10276 -18348 -25951 -27598 -26380 -13354 -4124 600 -6978
4644 -6978 4048 14976 6972 8785 7316 6937 7340 18024 21861 8701 -1828 -18465 -28171 -32487
4630 -32487 -13690 3258 -7873 -21478 -19527 -14456 -28917 -30702 -19918 -1644 -3978 1206 -1843
4617 -1843 -21295 -24525 -27599 -30234 -32139 -27694 -8718 -2039 -9735 -11609 -4353 1444 -9944 -14344
4603 -14344 -27739 -33139 -21840 -9275 -17760 -10004 -9760 -3076 -5017 -3817 6240 5147 -4507 -13910
4589a3910q142L337N488K035K990J4825n580o395j388m700M36Q2m867m547j965
4574b2301L302J0711p798j2393J1105J7935J953q77M934j536L407L255Q322r254
4560A0765j5338j0608L160N174J0107J492j083N439J34k0107j5208Q02J192M479
4546a9600L527J3382J6795K131l079m38q149p710k513Q022K287N305o117q089
4532d246O095k103L397P133O501r676n815o018o411j1988J289K110J914J2778
4518e040J091L831K438q482j1015J924J2642n50l11J1499m55L238j0906j0624
4504a0720R989R628K296q883j0670Q214L929N008q71J44j581m549J528K730o976
4489g84P323j1382m667k288M277J0727k207l306o916j2175J2905Q682m137N65
$$ plain form
4589 -13910 -22052 -18715 -13227 -11192 -8202 6623 1043 -5352 -6740 -11440 -11004 -10922 -15789 -20336 -22301
4574 -22301 -18999 -8288 -16086 -28479 -17374 561 2514 1637 6571 5035 8442 11697 20019 10765
4560 10765 -4573 -15181 -12021 -6847 3260 4752 3669 9108 9242 -10865 -26073 -25271 -24079 -19600
4546 -19600 -16073 -2691 14104 16235 13156 12718 4569 -3141 -5654 2368 4655 9960 3843 -4246
4532 -4246 1849 -254 3143 10276 16777 7101 1286 -4732 -11143 -23131 -21842 -19732 -17818 -5040
4518 -5040 -3949 -118 2320 -6162 -17177 -15253 -2611 -3161 -3472 8027 7572 10810 -96 -10720
4504 -10720 -731 8897 11193 2310 -8360 -146 3783 8791 7920 8064 6483 1934 3462 6192 -784
4489 -784 6539 -4843 -9510 -11798 -7521 3206 999 -2307 -9223 -21398 -8493 189 -3948 -3383
4475c383j667k650j0703Q478J300N796j361O439n769j0822R977J267k856k766
4461h720l333k0437r324J7292J5648L060o053p286O077J5278P853P482J1210j0120
4447A8627k5278n231j2428m942P521K788J15K967J1073J7645J063O98J1196l116
4433B2698l054K151M691L123k892j7701o165Q469j017J649q126P503L783j4390
4419G22o930j313P366P922O939n980m992o188l230j5659N235J4054j1478o894
4405b0426R964P882J5127N489j6825j7853k0738k516J0560L0107P813j3355j4878
4392a9649Q253K1326P827N11l960k919j8605J888J643J0313N481Q8r53j0270p889
4377f915q048j4546J3218J3819p108O274J2736L287q634N846J1484j237k1017
$$ plain form
4475 -3383 -5050 -7700 -18403 -9925 -8625 -2829 -4190 2249 -3520 -14342 -4365 -3098 -5954 -8720
4461 -8720 -12053 -32490 -41814 -24522 -8874 -5814 -11867 -19153 -13076 2202 10055 17537 28747 18627
4447 18627 -6651 -11882 -24310 -29252 -21731 -18943 -18828 -15861 -4788 12857 13920 14618 25814 22698
4433 22698 19644 21795 26486 29609 26717 9016 2851 11320 10303 11952 3826 11329 15112 722
4419 722 -6208 -7521 -155 7767 14706 8726 3734 -2454 -5684 -21343 -16108 -2054 -13532 -20426
4405 -20426 -10462 -2580 12547 18036 1211 -16642 -37380 -39896 -29336 771 8584 -4771 -19649
4392 -19649 -11396 9930 17757 18268 14308 11389 -7216 -5328 -3685 6628 12109 12197 11244 974 -6915
4377 -6915 -14963 -29509 -16291 -2472 -9580 -3306 9430 12717 4083 9929 21413 20176 -841
4364h41j9619N358M21m100L351J9148p68n981j4187j255o012K778R064m893K898
4349a4638Q019M950m400R119K337j0096l488m84P285J3508L015k66M903j4458
4335E306j1890r288J547M314o919M75Q848P558R80m389j3728M921K372J0752O462
4320G321o563q538J107L279J4808j426k661o801l781j1311J7503O599l426r785
4306c675m351j4693j3820J2600J0894M443J3142J7698j499j4842k0800j0213m23
4293b5539J0535J1508J9181P664j755q934n406K112Q96j6732M388r721j1259J2776
4279a0286R084J0066k87o610j413J1693N059l520j47o286j794J0534O82q978J677
4264I474J2670J2401N664j5674j0781r166L517Q849R959J156l065J537j0345j1698
$$ plain form
4364 -841 -20460 -15102 -14681 -18781 -15430 3718 2950 -3031 -17218 -18473 -24485 -21707 -12643 -17536 -14638
4349 -14638 -6619 -1669 -6069 3050 5387 -4709 -8197 -8681 -1396 12112 15127 14861 19764 5306
4335 5306 -6584 -15872 -14325 -10011 -16930 -16455 -7607 -49 931 -3458 -17186 -12265 -9893 859 7321
4320 7321 758 -7780 -6673 -3394 11414 9988 7327 526 -3255 -14566 2937 9536 6110 -3675
4306 -3675 -8026 -22719 -36539 -23939 -13045 -8602 4540 22238 20739 5897 -14903 -25116 -25539
4293 -25539 -15004 -3496 15685 23349 21594 12660 7254 9366 10262 -6470 -2082 -11803 -23062 -10286
4279 -10286 -1202 8864 8577 1967 554 12247 17306 13786 13639 7353 5559 16093 16775 7797 9474
4264 9474 22144 34545 40209 24535 13754 4588 8105 16954 26913 28069 25004 26541 16196 4498
4250D498L037J0972k286l634J0533J766N269j3707j3917r558m334J07K403o213
4236a5064K39J939P504J412K826n347r15P021N943M612r94j0128j0529J3029L202
4221D750p54L61n271P084m934m126P34J46L121o10n227k11o210k744Q034N538
4205c19O32Q100N528R3o252j0953J9360J520j20J944k316q42m226m56j0138j0009
4189h454N804J3207l181q073k016Q330q07K091Q799k740M202j0057r310p89K198
4174g96j580M44k92J1216J8982n914j0678n716L68o787m648O230J5283k3352k4799
4159c2039n19p405J3983J1480j222K438m588O553L035M400K466J5487l340k598
4145H131n258j0378p5O279m188o680O69m240o155N200N513J2604l921p964Q414
$$ plain form
4250 4498 7535 18507 16221 12587 23120 24886 30155 16448 2531 -7027 -11361 -11254 -8851 -15064
4236 -15064 -14825 -12886 -5382 -3970 -1144 -6491 -7406 -385 5558 10170 9176 -952 -11481 1548 4750
4221 4750 3996 4357 -914 6170 1236 -2890 -2156 -2010 1111 501 -4726 -4937 -11147 -13891 -5857 -319
4205 -319 313 8413 13941 14034 7782 -3171 16189 17709 17589 19533 17217 16375 12149 11693 1555 -8454
4189 -8454 -2650 10557 7376 -697 -2713 5617 4810 6901 15700 12960 17162 7105 -2205 -2994 -796
4174 -796 -2376 -1932 -2224 8992 27974 22060 11382 5666 6034 -753 -5401 829 16112 -7240 -32039
4159 -32039 -32558 -39963 -25980 -14500 -15722 -13284 -17872 -11319 -8284 -3884 -1418 14069 10729 8131
4145 8131 2873 -7505 -7580 -1301 -5489 -12169 -11500 -15740 -21895 -16695 -11182 1422 -2499 -10463 -2049
4130b049O065j2816o964N780R514p765k31J0049n851l335J49J2562J199r943J210
4115b426l758J0509Q805L476K219L058j1631j3074J1486k600m280n4l617o41R90
4100a538j531j182M838R760N092p630j095M607p827q487O001n790n291l820Q28
4085a3065N162J088j0303O796Q652M73L498J327n517j579q612k416Q03O06J6632
$$ plain form
4130 -2049 4016 -8800 -15764 -9984 -470 -8235 -8466 1583 -4268 -7603 -7454 5108 6307 -3636 -2426
4115 -2426 -6184 4325 13130 16606 18825 21883 10252 -2822 8664 6064 1784 1730 -1887 -2528 -1538
4100 -1538 -3069 -4251 587 10347 15439 7809 6714 11321 3494 -4993 1008 -4782 -10073 -13893 -13065
4085 -13065 -7903 -6815 -17118 -10322 -1670 -1197 2301 3628 -1889 -3468 -12080 -14496 -13693 -13087 3545
$$ [...]
##END NTUPLES=NMR SPECTRUM
##END=
