##TITLE=Analysis number 316355
Compound Code cc 46803
Book Reference 447/128
Project Code adrs
Chemist Name bos
##JCAMPDX= 6.0         $$ Bruker NMR JCAMP-DX V2.0
##DATA TYPE= NMR SPECTRUM
##DATA CLASS= NTUPLES
##ORIGIN= Bruker BioSpin GmbH
##OWNER= nmr
$$ XWIN-NMR		Version 3.5
$$ Thu Jan 12 09:55:15 2006 GMT Standard Time (UT+0h)  MAYBRIDGE\nmr@NMR_250MHZ
##.OBSERVE FREQUENCY= 250.131544655141
##.OBSERVE NUCLEUS= ^1H
##.ACQUISITION MODE= SIMULTANEOUS (DQD)
##.ACQUISITION SCHEME= undefined
##.AVERAGES= 16
##.DIGITISER RES= 18
##SPECTROMETER/DATA SYSTEM= dpx250
##.PULSE SEQUENCE= zg30
##.SOLVENT NAME= Acetone
##.SHIFT REFERENCE= (INTERNAL, Acetone, 0, 16.522)
##AUDIT TRAIL= $$ (NUMBER, WHEN, WHO, WHERE, WHAT)
$$ ##TITLE= Audit trail, XWIN-NMR		Version 3.5
$$ ##JCAMPDX= 5.01
$$ ##ORIGIN= Bruker BioSpin GmbH
$$ ##OWNER= nmr
$$ C:\u/data/dgb/nmr/ADRS/14500/pdata/1/auditp.txt
$$ ##AUDIT TRAIL=  $$ (NUMBER, WHEN, WHO, WHERE, WHAT)
(   1,<2006-01-12 09:54:20.08 +000>,<MAYBRIDGE\nmr>,<NMR_250MHZ>,
      <created by zg, POWCHK disabled, PULCHK disabled
       configuration hash MD5:
       62 19 C7 07 E1 42 D1 B7 37 6C 3D D0 77 39 F9 E6
       data hash MD5: 64K
       F5 52 95 EC 7E F2 2D EC 54 9F A7 A5 C8 02 CA FA>)
(   2,<2006-01-12 09:54:45.29 +000>,<MAYBRIDGE\nmr>,<NMR_250MHZ>,
      <Start of raw data processing
       ef LB = 0.3 FT_mod = 6 PKNL = 1 SI = 32K 
       data hash MD5: 32K
       FB 5E 02 A4 FC F4 3A D9 0F F9 F6 DF F0 72 D7 B9>)
(   3,<2006-01-12 09:54:48.68 +000>,<MAYBRIDGE\nmr>,<NMR_250MHZ>,
      <apk 
       data hash MD5: 32K
       55 E2 75 A7 DA 23 30 40 24 CD 7F B8 C7 E8 A4 02>)
(   4,<2006-01-12 09:54:50.19 +000>,<MAYBRIDGE\nmr>,<NMR_250MHZ>,
      <abs ABSG = 5 
       data hash MD5: 32K
       C8 53 12 EC CA 92 D7 35 E0 1D 0C D2 C2 7A 34 CD>)
$$ ##END=
$$ 
$$ hash MD5
$$ 81 B9 28 2A 09 F0 B7 43 94 A2 2D EE FE 5E D7 AA
##$RELAX= 
##$RELAX= 
##$RELAX= 
##$RELAX= 
##$RELAX= 
##$RELAX= 
##$RELAX= 
$$ Bruker specific parameters
$$ --------------------------
##$DU= <C:\u>
##$EXPNO= 14500
##$NAME= <ADRS>
##$PROCNO= 1
##$TYPE= <nmr>
##$USER= <dgb>
##$AMP= (0..31)
100 100 100 100 100 100 100 100 100 100 100 100 100 100 100 100 100 100 
100 100 100 100 100 100 100 100 100 100 100 100 100 100 
##$AQSEQ= 0
##$AQ_mod= 3
##$AUNM= <au_zg>
##$AUTOPOS= <2 >
##$BF1= 250.13
##$BF2= 250.13
##$BF3= 250.13
##$BF4= 250.13
##$BF5= 500.13
##$BF6= 500.13
##$BF7= 500.13
##$BF8= 500.13
##$BYTORDA= 1
##$CFDGTYP= 0
##$CFRGTYP= 5
##$CHEMSTR= <none>
##$CNST= (0..31)
1 1 145 1 1 1 1 1 1 1 1 1 1 1 1 1 1 1 1 1 1 1 1 1 1 1 1 1 1 1 1 1 
##$CPDPRG= <>
##$CPDPRG1= <>
##$CPDPRG2= <>
##$CPDPRG3= <>
##$CPDPRG4= <mlev>
##$CPDPRG5= <mlev>
##$CPDPRG6= <mlev>
##$CPDPRG7= <mlev>
##$CPDPRG8= <mlev>
##$CPDPRGB= <>
##$CPDPRGT= <>
##$D= (0..31)
0 1 0 0 0 0 0 0 0 0.06 0 0 0 0 0 0 0.0002 0 0 0 0 0 0 0 0 0 0 0 0 0 0 
0 
##$DATE= 1137059658
##$DBL= (0..7)
120 120 120 120 120 120 120 120 
##$DBP= (0..7)
150 150 150 150 150 150 150 150 
##$DBP07= 0
##$DBPNAM0= <>
##$DBPNAM1= <>
$$ [...]
##$SUBNAM7= <"">
##$SUBNAM8= <"">
##$SUBNAM9= <"">
##$SW= 20.6930455092707
##$SWIBOX= (0..15)
0 0 3 0 0 0 0 0 0 0 0 0 0 0 0 0 
##$SW_h= 5175.983436853
##$TD= 65536
##$TD0= 1
##$TE= 294.16
##$TE2= 300
##$TE3= 300
##$TEG= 300
##$TL= (0..7)
0 120 120 120 120 120 120 120 
##$TP= (0..7)
150 150 150 150 150 150 150 150 
##$TP07= 0
##$TPNAME0= <>
##$TPNAME1= <>
##$TPNAME2= <>
##$TPNAME3= <>
##$TPNAME4= <>
##$TPNAME5= <>
##$TPNAME6= <>
##$TPNAME7= <>
##$TPOAL= (0..7)
0.5 0.5 0.5 0.5 0.5 0.5 0.5 0.5 
##$TPOFFS= (0..7)
0 0 0 0 0 0 0 0 
##$TUNHIN= 0
##$TUNHOUT= 0
##$TUNXOUT= 0
##$USERA1= <user>
##$USERA2= <user>
##$USERA3= <user>
##$USERA4= <user>
##$USERA5= <user>
##$V9= 5
##$VALIST= <valist>
##$VCLIST= <CCCCCCCCCCCCCCC>
##$VD= 0
##$VDLIST= <DDDDDDDDDDDDDDD>
##$VPLIST= <PPPPPPPPPPPPPPP>
##$VTLIST= <TTTTTTTTTTTTTTT>
##$WBST= 1024
##$WBSW= 4
##$XGAIN= (0..3)
0 0 0 0 
##$XL= 0
##$YL= 0
##$YMAX_a= 397719
##$YMIN_a= -331118
##$ZGOPTNS= <>
##$ZL1= 120
##$ZL2= 120
##$ZL3= 120
##$ZL4= 120
##$ABSF1= 16.522
##$ABSF2= -4.171173
##$ABSG= 5
##$ABSL= 3
##$ALPHA= 0
##$AQORDER= 0
##$ASSFAC= 0
##$ASSFACI= 0
##$ASSFACX= 0
##$ASSWID= 0
##$AUNMP= <proc_1d>
##$AZFE= 0.1
##$AZFW= 0.1
##$BCFW= 0
##$BC_mod= 0
##$BYTORDP= 0
##$COROFFS= 0
##$CY= 12.5
##$DATMOD= 1
##$DC= 0
##$DFILT= <>
##$DTYPP= 0
##$F1P= 14.0000005364418
##$F2P= -0.99999901652339
##$FCOR= 0.5
##$FTSIZE= 32768
##$FT_mod= 6
##$GAMMA= 0
##$GB= 0
##$INTBC= 1
##$INTSCL= 1
##$ISEN= 128
##$LB= 0.3
##$LEV0= 0
##$LPBIN= 0
##$MAXI= 10000
##$MC2= 0
##$MEAN= 0
##$ME_mod= 0
##$MI= 0
##$NCOEF= 0
##$NC_proc= -3
##$NLEV= 6
##$NOISF1= 0
##$NOISF2= 0
##$NSP= 0
##$NTH_PI= 0
##$NZP= 0
##$OFFSET= 16.522
##$PC= 1
##$PHC0= 79.41174
##$PHC1= 10.15827
##$PH_mod= 1
##$PKNL= yes
##$PPARMOD= 0
##$PSCAL= 4
##$PSIGN= 0
##$REVERSE= no
##$SF= 250.13
##$SI= 32768
##$SIGF1= 0
##$SIGF2= 0
##$SINO= 400
##$SIOLD= 32768
##$SREGLST= <1H.Acetone>
##$SSB= 0
##$STSI= 32768
##$STSR= 0
##$SW_p= 5175.98343685301
##$SYMM= 0
##$S_DEV= 0
##$TDeff= 65536
##$TDoff= 0
##$TI= <Analysis number 999999
Compound Code 99
Book Reference 9
Project Code 9>
##$TILT= no
##$TM1= 0
##$TM2= 0
##$TOPLEV= 0
##$USERP1= <user>
##$USERP2= <user>
##$USERP3= <user>
##$USERP4= <user>
##$USERP5= <user>
##$WDW= 1
##$XDIM= 32768
##$YMAX_p= 325205218
##$YMIN_p= -270766
$$ End of Bruker specific parameters
$$ ---------------------------------
##NTUPLES= NMR SPECTRUM
##VAR_NAME=  FREQUENCY,     SPECTRUM/REAL,   SPECTRUM/IMAG
##SYMBOL=    X,             R,               I
##VAR_TYPE=  INDEPENDENT,   DEPENDENT,       DEPENDENT
##VAR_FORM=  AFFN,          ASDF,            ASDF
##VAR_DIM=   32768,         32768,           32768
##UNITS=     HZ,            ARBITRARY UNITS, ARBITRARY UNITS
##FACTOR=    0.157963299565203, 1,           1
##FIRST=     4132.6476996994, 0,             0
##LAST=      -1043.33573715361, 0,           0
##MIN=       -1043.33573715361, -270766,     0
##MAX=       4132.6476996994, 325205218,     0
$$ Real data points
##PAGE= N=1
##DATA TABLE= (X++(R..R)), XYDATA
$$ [...]
##PAGE= N=2
##DATA TABLE= (X++(I..I)), XYDATA
19239C109300K3184l7528N94K7682K9855K2588j5658J6861M2307k5293K4500K5393
19227C243785l2546L504J4351N739k6622j4997J0390M9320L8242m0722m6944n2209
19215C151291P267J6564J18351L0776q967l6157q5806m4461K6544M1871M4348
19204C261621K5488L3753J9783l6724l5573k9674p940n6400l1963L1994L6364
19193C210729N1262Q2275K3405k6623Q4955J0574j1972L0402J3925n3590n629
19182C409713O460r354K3301Q025k6781Q5479O3458l4007M6222J5895o8152J8307
19170C538566N3002L7838k1317m5904j948K5305N3853L3161K1412J705Q015J0285
19158C713973j06614o7251J9267J14902Q1778Q419J6180n3056P993L521M5318
$$ plain form
19239 3109300 3132484 3094956 3095550 3123232 3153087 3175675 3160017 3176878 3219185 3193892 3218392 3243785
19227 3243785 3211239 3214743 3229094 3234833 3208211 3193214 3203604 3252924 3291166 3250444 3203500 3151291
19215 3151291 3158558 3175122 3293473 3324249 3315282 3279125 3193319 3148858 3175402 3217273 3261621
19204 3261621 3287109 3320862 3340645 3303921 3268348 3238674 3230734 3174334 3142371 3174365 3210729
19193 3210729 3261991 3344266 3367671 3341048 3426003 3436577 3424605 3455007 3468932 3415342 3409713
19182 3409713 3416173 3406819 3430120 3438145 3411364 3496843 3560301 3526294 3572516 3588411 3520259 3538566
19170 3538566 3591568 3629406 3608089 3562185 3560237 3585542 3639395 3672556 3693968 3695673 3703688 3713973
19158 3713973 3607359 3540108 3559375 3674277 3756055 3764474 3780654 3727598 3735591 3739112 3784430
19147C784430K2214p959M9926L2376n3735k8078n4476n2447M3354K2153K7321
19136C785079J4811J8613l0568k9453P1689m016L6174L4303M6496L4128p186J9665
19124C989735O0865L7858o4095l2892O353K466j5362m8318J112N2330P052L7324
19112D034428L157n0395K7282L4878J4281Q0736L0702J8453R439l2262j3485O1633
19100D218847K115k3979K5623M9066J9359R0911j353k8557J5906L3946j082l3855
19088D366947l0948m4719N8913N5974K5631L7537l6200p6807N3361P3469K2455
19077D505613q204k0678Q4248R8264O3723r786j5201m783l141m0622N222M8242
19065D702897l364j1272L5699n0683m4240O483J11331M7359j6213k6235N392J00999
$$ plain form
19147 3784430 3806644 3798685 3848611 3880987 3827252 3799174 3744698 3692251 3735605 3757758 3785079
19136 3785079 3799890 3818503 3787935 3758482 3830171 3826155 3862329 3896632 3943128 3977256 3970070 3989735
19124 3989735 4050600 4088458 4024363 3991471 3997824 4000290 3984928 3936610 3937722 3990052 3997104 4034428
19112 4034428 4037585 3987190 4014472 4049350 4063631 4144367 4175069 4193522 4202961 4170699 4157214 4218847
19100 4218847 4220962 4196983 4222606 4271672 4291031 4381942 4380589 4352032 4367938 4401884 4400802 4366947
19088 4366947 4335999 4291280 4350193 4406167 4431798 4469335 4433135 4356328 4409689 4483158 4505613
19077 4505613 4497409 4476731 4560979 4659243 4722966 4713180 4697979 4693196 4690055 4649433 4654655 4702897
19065 4702897 4699533 4688261 4723960 4673277 4629037 4635520 4746851 4794210 4777997 4751762 4757154 4858153
19053D858153L6849j266N6927j3841J2375j4172q692J3288O3438K2684L5839J6605
19041E078187l039K6270J2052j901R430O8042N8208J0135n6974l8253K3078L7499
19029E222734J13473K5490k9135L3028M8285K4524j6359M3239J5848P016L3048
19018E521191j8643L4204N4526M774L2722J6784J9322K8559K2672M6091O7988
19007E830190L532n7415P7249R6247M3548K3089M1796R4306P6958L1683N321j9212
18995F247292k537J625L9419o434j7298M9855R421O4021L4839M6102Q4725P0792
18983F621822N3800l1658J4396k871J1690k3145J2067j5506K3115O9657J2316
18972F745683K2218P4365K8962O7444J26615J14520L9057j3635K1381P5370O4501
$$ plain form
19053 4858153 4895002 4893736 4950663 4936822 4949197 4935025 4926333 4939621 5003059 5025743 5061582 5078187
19041 5078187 5075148 5101418 5113470 5111569 5120999 5189041 5247249 5257384 5200410 5162157 5185235 5222734
19029 5222734 5336207 5361697 5332562 5365590 5413875 5438399 5422040 5465279 5481127 5488143 5521191
19018 5521191 5502548 5536752 5591278 5596052 5628774 5645558 5664880 5693439 5716111 5762202 5830190
19007 5830190 5833722 5776307 5853556 5949803 5993351 6016440 6058236 6152542 6229500 6261183 6266504 6247292
18995 6247292 6244755 6246380 6285799 6279365 6262067 6311922 6321343 6385364 6420203 6466305 6551030 6621822
18983 6621822 6675622 6643964 6658360 6655489 6667179 6644034 6656101 6640595 6663710 6733367 6745683
18972 6745683 6767901 6842266 6871228 6938672 7065287 7179807 7218864 7205229 7226610 7301980 7366481
18961G366481J01854M0661M942K8755j002q162O4360M9906K5107O7538J20495
18950G860935M6359N5088P0223P0215N0198L2219N0506N7441J52063J23934O1574
18939H630755R48J8436P0477Q4442M6832K5171J26640R7508O1475R2816P4994
18928I330494M5454L3614k4289J10332J12158M8803Q0948J14638O7995O8636J26751
18917A0115534J83063J61908N8072L4963J12910J42044J03706R9291M8469J44221
18907A1204181J77899J81151J77556J82950J89054J81583K23474J94311J66974
18898A2879133J13909J61819J53365J56067K28637J91192K16891K94555L45538
18889A4741106L31379L28950L50096L10741L43753L10253L82065M31797M32694
$$ plain form
18961 7366481 7468335 7508996 7513938 7542693 7541691 7533529 7597889 7647795 7672902 7740440 7860935
18950 7860935 7907294 7962382 8032605 8102820 8153018 8185237 8235743 8293184 8445247 8569181 8630755
18939 8630755 8631703 8650139 8720616 8805058 8851890 8877061 9003701 9101209 9162684 9255500 9330494
18928 9330494 9375948 9409562 9385273 9495605 9607763 9656566 9737514 9852152 9920147 9988783 10115534
18917 10115534 10298597 10460505 10518577 10553540 10666450 10808494 10912200 11011491 11059960 11204181
18907 11204181 11382080 11563231 11740787 11923737 12112791 12294374 12517848 12712159 12879133
18898 12879133 12993042 13154861 13308226 13464293 13692930 13884122 14101013 14395568 14741106
18889 14741106 15072485 15401435 15751531 16062272 16406025 16716278 17098343 17530140 17962834
18880A7962834M74428O38889P56745P50358P62869Q28719J036791J221043J295700
18871B5728376J415088J521793J528904J267375l8284l245499p259345r521376
18863A1397032n280044M84274K289118K401158K264211K320130K309220K353790
18855B0538889K396131K358684J988734L90352l861319r893754j4276139j0429158
18847a0787580j270020K363111K538148K116579J881303J660192J468216J372312
18839A342261J232738J128756J056479R83465R06694R16899P74460P37579Q15599
18830I894930P51656P12402O71165P29654P56070Q77046R57724J094807J115447
18821A7560901J095401J262236J305888J489906J617556J669341J662810J163546
$$ plain form
18880 17962834 18437262 19076151 19832896 20583254 21346123 22174842 23211633 24432676 25728376
18871 25728376 27143464 28665257 30194161 31461536 31423252 28177753 20918408 11397032
18863 11397032 6116988 6601262 8890380 11291538 13555749 15875879 18185099 20538889
18855 20538889 22935020 25293704 27282438 27672790 23811471 13917717 -358422 -10787580
18847 -10787580 -12057600 -9694489 -7156341 -5039762 -3158459 -1498267 -30051 1342261
18839 1342261 2574999 3703755 4760234 5743699 6650393 7567292 8341752 9079331 9894930
18830 9894930 10646586 11358988 12030153 12759807 13515877 14392923 15350647 16445454 17560901
18821 17560901 18656302 19918538 21224426 22714332 24331888 26001229 27664039 28827585
18813B8827585k33780l023152n775981n839123j116897K204960K934555K904411
18805B0882578K938676L104512L233977L438615L640578L633852K759227n54177
18797D3077838p728279j5770146j8882512q400414K568259N443269N390361N084336
18789A0782712M885131M980170N223558N011146L891154N15725n486793j2601946
18781A7200857j6810979j5678863j5877354j1955877o40130N305219O012121N425128
18773b7019878M811166M541358M123376L146274R75288k952646p507435r879934
18765b9762431o917694m436054l337545J26029K600387K764264K286486J956500
18757c4720058J678545J486479J277811J301181J323655J182733J017093Q55341
$$ plain form
18813 28827585 28593805 25570653 19794672 13955549 12838652 15043612 17978167 20882578
18805 20882578 23821254 26925766 30159743 33598358 37238936 40872788 43632015 43077838
18797 43077838 35349559 19579413 696901 -7703513 -5135254 308015 5698376 10782712
18789 10782712 15667843 20648013 25871571 30882717 34773871 35289596 29802803 17200857
18781 17200857 389878 -15288985 -31166339 -43122216 -43762346 -38457127 -32445006 -27019878
18773 -27019878 -22208712 -17667354 -13543978 -10397704 -9422416 -12375062 -19882497 -29762431
18765 -29762431 -36680125 -41116179 -44453724 -44327695 -41727308 -38963044 -36676558 -34720058
18757 -34720058 -33041513 -31555034 -30277223 -28976042 -27652387 -26469654 -25452561 -24597220
18749b4597220P21161N68149M12998M46350M34473L85968L95240M36052M69170
18740b0327659M57557M29900L88154L71003L56793L82286K87209K38364K51614
18731a7164779K12720K44368K75126K22897K17660K86512L02257K43259K74813
18722a4885167K65251K70130J82416J71246K51098K41299K27308K30910K12951
18713a2832558K19714J72861J37725J24456J96397K58556K24864J59719J52932
18704a1185334J92788J91552J43390J12321J10540J52003J64909J43690J60073
18695i814068J25859J08064J27305J86874J33099J34833J14916J34666L2730P4957
18685h640765J48199J74280J44940J23518J15658N7546P4809N0612J28521J13451
$$ plain form
18749 -24597220 -23876059 -23307910 -22894912 -22448562 -22014089 -21628121 -21232881 -20796829 -20327659
18740 -20327659 -19870102 -19440202 -19052048 -18681045 -18324252 -17941966 -17654757 -17416393 -17164779
18731 -17164779 -16952059 -16707691 -16432565 -16209668 -15992008 -15705496 -15403239 -15159980 -14885167
18722 -14885167 -14619916 -14349786 -14167370 -13996124 -13745026 -13503727 -13276419 -13045509 -12832558
18713 -12832558 -12612844 -12439983 -12302258 -12177802 -11981405 -11722849 -11497985 -11338266 -11185334
18704 -11185334 -10992546 -10800994 -10657604 -10545283 -10434743 -10282740 -10117831 -9974141 -9814068
18695 -9814068 -9688209 -9580145 -9452840 -9265966 -9132867 -8998034 -8883118 -8748452 -8715722 -8640765
18685 -8640765 -8492566 -8318286 -8173346 -8049828 -7934170 -7876624 -7801815 -7751203 -7622682 -7509231
18675g509231P3482M7323R0888J14549J48449J02852N3948J8380M2535J63134
18665f653691J01032j4579j7311K5903L2615k7692r842K3527N3702L9711J04135
18654f342490J05277P0342L1559P1728P4187R4781N2073L7816O8988P1907N1227
18643e612605K8091J6358M8075L2266Q7510Q6685P0188L1385R0232M2975R8248
18632d980592M7374L2965J08290N7832L6717K9825K0652M7569O4748J8188M0280
18621d476152K2576j9632Q6991P8415L7434L2310Q5166K3714k6873O1255K9598
18610d065198N037L5252j6877p6768q4161K6420J7060Q7388O0695J2076J3690
18599c985386P1388M6448k3644K5648N7582P8180j4603J2357N5585P3578k0497
$$ plain form
18675 -7509231 -7435749 -7388426 -7297538 -7182989 -7034540 -6931688 -6877740 -6859360 -6816825 -6653691
18665 -6653691 -6552659 -6567238 -6584549 -6558646 -6526031 -6553723 -6563565 -6540038 -6486336 -6446625 -6342490
18654 -6342490 -6237213 -6166871 -6135312 -6063584 -5989397 -5894616 -5842543 -5804727 -5735739 -5663832 -5612605
18643 -5612605 -5584514 -5568156 -5520081 -5487815 -5400305 -5313620 -5243432 -5212047 -5121815 -5078840 -4980592
18632 -4980592 -4933218 -4900253 -4791963 -4734131 -4697414 -4667589 -4646937 -4599368 -4534620 -4516432 -4476152
18621 -4476152 -4453576 -4473208 -4386217 -4307802 -4270368 -4238058 -4152892 -4129178 -4156051 -4094796 -4065198
18610 -4065198 -4060161 -4024909 -4041786 -4118554 -4202715 -4176295 -4159235 -4071847 -4011152 -3999076 -3985386
18599 -3985386 -3913998 -3867550 -3891194 -3865546 -3807964 -3729784 -3744387 -3732030 -3676445 -3602867 -3623364
18588c623364j9914R5016P1200O7618R4341K4855R6545N2468K2314l9915m2252
18577c201088n6887k0461K9061Q0448N3576K4076j2360n9124p401P9158R3323
18566b997679P3960J8203L497O0066J93o761L1501O019Q7045M3657P146l540m557
18553b681250L8824O8440p047K1702N4011j1602l4106L993Q1414L4646j2825L1475
18541b412325J9997K5720o6210o8783P709k4506L2625K3344J5494J3691M6984
18530b386260P0863Q1617j1031J6356N0696n1865J0455N9382N4872O6966K9175
18519b008774k0922j774J297k5018m6459Q057L6598J10599R0540N1151n8449M5146
18507a818008L1125m0757J1931j8647M6075L9049l1381N5515J4702J8411L2674
$$ plain form
18588 -3623364 -3643278 -3548262 -3477062 -3409444 -3315103 -3290248 -3193703 -3141235 -3118921 -3158836 -3201088
18577 -3201088 -3257975 -3278436 -3249375 -3168927 -3115351 -3091275 -3103635 -3162759 -3170160 -3091002 -2997679
18566 -2997679 -2923719 -2905516 -2902019 -2841953 -2841760 -2848521 -2817020 -2811001 -2723956 -2680299 -2673153 -2676693 -2681250
18553 -2681250 -2642426 -2573986 -2581033 -2559331 -2505320 -2516922 -2551028 -2547035 -2465621 -2430975 -2443800 -2412325
18541 -2412325 -2392328 -2366608 -2432818 -2501601 -2493892 -2518398 -2485773 -2462429 -2446935 -2433244 -2386260
18530 -2386260 -2315397 -2233780 -2244811 -2228455 -2177759 -2229624 -2219169 -2159787 -2104915 -2037949 -2008774
18519 -2008774 -2029696 -2031470 -2030173 -2055191 -2101650 -2093593 -2056995 -1946396 -1855856 -1804705 -1863154 -1818008
18507 -1818008 -1786883 -1827640 -1815709 -1834356 -1788281 -1749232 -1780613 -1725098 -1710396 -1691985 -1659311
18496a659311J8063M688k0508L3732M3415P7663O2315o7382r8563m7896J00430
18485a553354J04438L2713Q578O581k591k1917Q08P9058L0789M7073Q600m1086
18473a300310j0350M9694M5162j1916k0466J4995k8602j1576K2426J9414M6020
18462a185509M8816P1922O2676m3020J2244Q0301J4602p1972l4927L3469N793
18451a005605k7507K4143P6401Q5420Nl2301l6741l6728Q197O3055J8853j4151
18439h76959m5262k658Q2641q4j00672l2134K0694M8915J47731M9175k3557q328
18427g40498K5265o961O5511P1946l0829J985o5341R769K4615l8562n092R3048
18415e95144J516p693M1098M2215M8402j4519N37J7000R845K0807O6384m8353
$$ plain form
18496 -1659311 -1641248 -1636560 -1657068 -1623336 -1579921 -1502258 -1439943 -1507325 -1605888 -1653784 -1553354
18485 -1553354 -1448916 -1416203 -1407625 -1401044 -1403635 -1425552 -1424744 -1345686 -1314897 -1267824 -1259224 -1300310
18473 -1300310 -1310660 -1260966 -1215804 -1227720 -1248186 -1233191 -1261793 -1273369 -1250943 -1231529 -1185509
18462 -1185509 -1136693 -1064771 -1002095 -1045115 -1032871 -952570 -937968 -1009940 -1044867 -1011398 -1005605
18451 -1005605 -1033112 -1008969 -932568 -847148 -847143 -879444 -916185 -952913 -944716 -881661 -862808 -876959
18439 -876959 -922221 -924879 -842238 -842322 -942994 -975128 -954434 -905519 -757788 -708613 -732170 -740498
18427 -740498 -715233 -722194 -656683 -584737 -615566 -613581 -678922 -669153 -644538 -683100 -688192 -595144
18415 -595144 -593628 -601321 -560223 -518008 -469606 -484125 -483588 -466588 -456743 -435936 -369552 -417905
18403d17905L9133K9358j5121o1812k606L346J9470M3188J1460L1386M6421J3546
18391b60136k253j1627k1888L9130j3226J9445m952J3784K3830k7938K164K7913
18379b15754Q0685O7552J3573Q1242N7732n53j5796l7928K2664M324o384O5081
18367A16438L2433l5318O495K6836m5557q273L3586m5556o1579O2024K2134J4634
18355A18297N5830O5806K0314m174o2770j4340M1373M4209j3977N8328M4404K7604
18343C80904K3852k7712m9277M4934Q6517l7968J2374L3512j901q266J8001L3570
18331E08540Q0962N813K5212M8430J6600j7243J7966k3897J6428k2357l4639K8031
18319F49846M8869N4699N6237M2532N604J2994J0974k8710m6062M1702L4103N9467
$$ plain form
18403 -417905 -378772 -349414 -364535 -426347 -428953 -425607 -406137 -362949 -351489 -320103 -273682 -260136
18391 -260136 -262389 -274016 -295904 -256774 -270000 -250555 -255507 -241723 -217893 -245831 -243667 -215754
18379 -215754 -135069 -67517 -53944 27298 85030 84477 68681 30753 53417 57741 51357 116438
18367 116438 148871 113553 120048 146884 101327 93054 126640 81084 19505 81529 103663 118297
18355 118297 174127 239933 260247 256073 193303 178963 220336 264545 250568 308896 353300 380904
18343 380904 404756 377044 327767 372701 459218 421250 433624 467136 465235 456969 474970 508540
18331 508540 589502 595315 620527 668957 685557 668314 686280 662383 678811 656454 621815 649846
18319 649846 698715 753414 809651 852183 857787 870781 881755 853045 806983 848685 882788 942255
18307I42255j1595K6166J04116N0949K6201l9255o08K5845j6517m9889P156K0496
18295A085320J15572O4302J0950p244o7734L4191K9785P3688N7024R009J3179
18284A418042O1703O8668N1586M6838L7796j407j0437P4L2709P4987Q4113O4036
18272A928708N2580p7808k2293j1501p1288j02175K8789R8520M1461k111J11613
18261A974495R9696R5176L6145k1440J4260M8135O3986P364o3622Q247M4978N1472
18249B358892l4514m2103m3354n8328M797Q5713M1830O7272J33634L4939K8277
18238B577055O3456J11474N1352P0159L4310n8318l6544M660K9871J8744N9010
18227B925229K4642L3217O0861J16595J00261R7450P6010m064M241M2952N2180
$$ plain form
18307 942255 930660 956826 1060942 1111891 1138092 1098837 1098229 1124074 1107557 1057668 1064824 1085320
18295 1085320 1200892 1265194 1276144 1268900 1201166 1235357 1265142 1338830 1395854 1404863 1418042
18284 1418042 1479745 1548413 1599999 1646837 1684633 1683226 1672789 1672863 1705572 1780559 1864672 1928708
18272 1928708 1981288 1903480 1881187 1869686 1798398 1696223 1725012 1823532 1864993 1862882 1974495
18261 1974495 2074191 2169367 2205512 2184072 2198332 2246467 2310453 2317817 2254195 2262442 2307420 2358892
18249 2358892 2324378 2282275 2238921 2180593 2185390 2271103 2312933 2380205 2513839 2548778 2577055
18238 2577055 2640511 2751985 2803337 2873496 2907806 2849488 2812944 2817604 2847475 2866219 2925229
18227 2925229 2949871 2983088 3043949 3160544 3260805 3358255 3434265 3430201 3434442 3477394 3529574
18216C529574P5538P9705L0774l7540M7641Q7631M5885J7441Q3596J17207J50552
18205D228004L1464N8733J05447J15135O7246J18457R0270M7613Q0049J25242
18195E067660R8686M4268J27095J55160O2624N1440K19947J47538P8203P1746
18185F124367J55006J69670J48670J36095J72383K05305J82253K39576L09828
18176G843153K47933K27498J77050K54430K65076K00252Q9873J08384M5410P6839
18166I535898O3927J82457L94259M18881N15090N55783N33976M98408N55754O63990
18156A3918423O85243P30220Q70888J014427J100941J196529J448830J600095
18148B2565596J704118J917444K156163K351312K513346K311663J328727r51725
$$ plain form
18216 3529574 3605112 3684817 3715591 3678051 3725692 3813323 3859208 3876649 3960245 4077452 4228004
18205 4228004 4259468 4318201 4423648 4538783 4606029 4724486 4814756 4862369 4942418 5067660
18195 5067660 5166346 5210614 5337709 5492869 5555493 5606933 5826880 5974418 6052621 6124367
18185 6124367 6279373 6449043 6597713 6733808 6906191 7111496 7293749 7533325 7843153
18176 7843153 8091086 8318584 8495634 8750064 9015140 9215392 9305265 9413649 9459059 9535898
18166 9535898 9599825 9782282 10176541 10595422 11110512 11666295 12200271 12698679 13254433 13918423
18156 13918423 14603666 15333886 16204774 17219201 18320142 19516671 20965501 22565596
18148 22565596 24269714 26187158 28343321 30694633 33207979 35519642 36848369 35896644
18140C5896644m486696q438537j1048346j1778706j1387960r116469n121334j664605
18132b7146009N82988J878331K325516K374430K033618J766564J646438J476896
18124a3061228J397177J239334J107272R51074P90000P95517P46963O37184N30397
18115d866310N52308N55554N90402N94399O43250N99524N83275N85296M81218
18106C18916M45093N03157N08978M77842N77295O68070Q57233R37920R33842J116712
18096G345058J302564J456908J605498J765949J972095K165237K279839J922287
18088B1815435O34365j757102m953832q077229r810868j0117150r481614o802123
18080b8550118l168599o02050J054801J844279K076651J932341J723877J517877
$$ plain form
18140 35896644 31409948 22971411 11923065 144359 -11243601 -20360070 -25481404 -27146009
18132 -27146009 -26563021 -24684690 -22359174 -19984744 -17951126 -16184562 -14538124 -13061228
18124 -13061228 -11664051 -10424717 -9317445 -8366371 -7576371 -6780854 -6033891 -5396707 -4866310
18115 -4866310 -4314002 -3758448 -3168046 -2573647 -1930397 -1330873 -747598 -162302 318916
18106 318916 764009 1267166 1776144 2253986 2831281 3499351 4356584 5294504 6228346 7345058
18096 7345058 8647622 10104530 11710028 13475977 15448072 17613309 19893148 21815435
18088 21815435 22449800 20692698 15738866 7661637 -2149231 -12266381 -21747995 -28550118
18080 -28550118 -31718717 -32320767 -31265966 -29421687 -27345036 -25412695 -23688818 -22170941
18072b2170941J341736J233299J031921Q82411Q54521P14787O12798O41690N96621
18063a4261157N23499M37641L77571L17824L65512L55707L29257K49812J29767
18054a1174567R5525N7778K157J6945L4208N4587R3685J25079O7234J19952Q3454
18043a0423963O6376J47180J38629J84442K15772J78752J77226P6520J74453J59890
18033h904723Q6064J27499J56666J10885R8032Q8206O8011O2999J43885J63457
18023g799019Q7644J38241J22824J43684J22688L2505K2532L0732L2709P5567
18013f989893J19718J28890K6672R2267N6511L1963J07632P3978K1074Q9434N6145
18002f185609R2039N9041Q3644P2082Q4412L1452L7325J0191O2015P5498N8582
$$ plain form
18072 -22170941 -20829205 -19595906 -18563985 -17681574 -16827053 -16112266 -15499468 -14857778 -14261157
18063 -14261157 -13737658 -13300017 -12922446 -12604622 -12239110 -11883403 -11554146 -11304334 -11174567
18054 -11174567 -11079042 -11021264 -11019107 -11002162 -10967954 -10913367 -10819682 -10694603 -10627369 -10507417 -10423963
18043 -10423963 -10357587 -10210407 -10071778 -9887336 -9671564 -9492812 -9315586 -9239066 -9064613 -8904723
18033 -8904723 -8818659 -8691160 -8534494 -8423609 -8325577 -8237371 -8169360 -8106361 -7962476 -7799019
18023 -7799019 -7711375 -7573134 -7450310 -7306626 -7183938 -7151433 -7128901 -7098169 -7065460 -6989893
18013 -6989893 -6870175 -6741285 -6714613 -6622346 -6565835 -6533872 -6426240 -6352262 -6331188 -6241754 -6185609
18002 -6185609 -6093570 -6034529 -5950885 -5878803 -5794391 -5762939 -5725614 -5715423 -5653408 -5577910 -5519328
17991e519328N5340Q3710M4539J9481M8686O4924K9399J0120J5389L9385K7190
17980e081165N9052P0338O1040N2846N2051M9713M9193P3788l899O942L5768K2378
17968d551955j0989r495m795J14741P1885M3679J2422j0603l6799P147P0753Q8294
17956d215715K9620j9025k9062J8845M23J1363L3824N6881m585M6114N5381M6904
17944c969032l858K4193O5738J3221l4141N6421M085p417N9413M5069M4510J0636
17932c691162L5576L2636j0126n761R657R023J6845N8360M9760j2505M4898K8979
17920c433820j1554Q0869N2199m9009l826m744J4915J8954O4414M3895M3945M425
17908c179337k1025L2645q323k5648L9761J7330Q111Q954k9620m928N8417l177
$$ plain form
17991 -5519328 -5463988 -5380278 -5335739 -5316258 -5267572 -5202648 -5173249 -5163129 -5147740 -5108355 -5081165
17980 -5081165 -5022113 -4951775 -4890735 -4837889 -4785838 -4736125 -4686932 -4613144 -4617043 -4610101 -4574333 -4551955
17968 -4551955 -4562944 -4572439 -4577234 -4462493 -4390608 -4346929 -4334507 -4345110 -4381909 -4374762 -4304009 -4215715
17956 -4215715 -4186095 -4205120 -4234182 -4215337 -4214914 -4203551 -4169727 -4112846 -4117431 -4071317 -4015936 -3969032
17944 -3969032 -3972890 -3948697 -3882959 -3869738 -3903879 -3847458 -3843373 -3850790 -3791377 -3746308 -3701798 -3691162
17932 -3691162 -3655586 -3622950 -3633076 -3638837 -3629180 -3620157 -3603312 -3544952 -3495192 -3507697 -3462799 -3433820
17920 -3433820 -3445374 -3364505 -3312306 -3361315 -3365141 -3369885 -3354970 -3336016 -3271602 -3227707 -3183762 -3179337
17908 -3179337 -3200362 -3167717 -3176040 -3201688 -3161927 -3144597 -3136486 -3127532 -3157152 -3162080 -3103663 -3106840
17896c106840k1246J326J076K7839M8166k903j2670k0188J8857K4580j2157J9774
17884c034386O073O7353K3577l5054m597K3889M0033K7706L0016O0904P609L4111
17872b752766M6432o6863l8309M771k4501k5673N7784M0576l3876J3715P5136
17861b703574K7086j9508K3865O8747l7365k0630L5887J03890J1400o8195n6171
17850b634568l4476j3437Q1057Q5193O7408P99m8616l6995J0734L3376k1916L6984
17838b474457q896k1553L2390J7942j3184N998Q796N238P6388P394l6365L8023
17826b362286m669j3179N0312K7009l9822n0405L2695R8087L200m5431l6147K0760
17814b319876j1762j0260L9005K8711q543m1159m5748J1724J6677L0372O4768
$$ plain form
17896 -3106840 -3128086 -3126760 -3125684 -3097845 -3049679 -3052582 -3065252 -3085440 -3066583 -3042003 -3054160 -3034386
17884 -3034386 -3028313 -2960960 -2937383 -2972437 -2977034 -2953145 -2913112 -2885406 -2855390 -2794486 -2786877 -2752766
17872 -2752766 -2706334 -2773197 -2811506 -2806735 -2831236 -2856909 -2799125 -2758549 -2792425 -2778710 -2703574
17861 -2703574 -2676488 -2695996 -2672131 -2603384 -2640749 -2661379 -2625492 -2521602 -2510202 -2578397 -2634568
17850 -2634568 -2669044 -2682481 -2601424 -2516231 -2448823 -2448024 -2496640 -2533635 -2522901 -2489525 -2511441 -2474457
17838 -2474457 -2483353 -2504906 -2472516 -2454574 -2467758 -2461760 -2452964 -2447726 -2371338 -2363944 -2400309 -2362286
17826 -2362286 -2366955 -2380134 -2329822 -2302813 -2342635 -2393040 -2360345 -2262258 -2259058 -2304489 -2340636 -2319876
17814 -2319876 -2331638 -2341898 -2302893 -2274182 -2282725 -2323884 -2369632 -2357908 -2341231 -2310859 -2246091
17803b246091K5593j9535j6605L1365p123M6138k5145l598M3720J212j8570M3327
17791b145312M0443J7455P276j2158j8109K1324l0281R205L3974r10M262K6355
17779b046476J5349l9660Q755Q8281m032n6875J2681N0537M2614M985l074j2220
17767a939135k3596o8592k2741K1727J4332k1743J0655m3372M2025N7677P3314
17756a899449J488o8265r927M9976Q637j1961L6242N0812o0807m1493N3478m105
17744a895374m6017q277k5022K0629M5886N0886N2296J168l244n8494l2331J4613
17732a883281p33l9384Q846N0191J5976n519j1251O5777P9229k313j755J9488
17720a704729k2130k2845k4983J4045M5412j4466k4509J2788q993K1470J2296
$$ plain form
17803 -2246091 -2220498 -2240033 -2256638 -2225273 -2232396 -2186258 -2211403 -2215001 -2171281 -2170069 -2188639 -2145312
17791 -2145312 -2104869 -2087414 -2080138 -2092296 -2110405 -2089081 -2119362 -2110157 -2076183 -2077093 -2072831 -2046476
17779 -2046476 -2031127 -2070787 -2062032 -1973751 -1977783 -2034658 -2021977 -1971440 -1928826 -1923841 -1926915 -1939135
17767 -1939135 -1962731 -2031323 -2054064 -2032337 -2018005 -2039748 -2029093 -2072465 -2030440 -1972763 -1899449
17756 -1899449 -1897961 -1966226 -1976153 -1926177 -1917540 -1929501 -1893259 -1842447 -1903254 -1944747 -1891269 -1895374
17744 -1895374 -1941391 -1949668 -1974690 -1954061 -1908175 -1857289 -1804993 -1803825 -1807069 -1865563 -1897894 -1883281
17732 -1883281 -1884014 -1923398 -1914552 -1864361 -1848385 -1853904 -1865155 -1799378 -1720149 -1722462 -1724217 -1704729
17720 -1704729 -1726859 -1749704 -1774687 -1760642 -1715230 -1729696 -1754205 -1741417 -1750410 -1728940 -1716644
17709a716644N4178N3581J8238R508m4521J852l9532j5441l8549k6623P1927P0097
17697a601929j1050p1220p5766L5939O6105j3548K7743M7964M0468k6270m4910
17686a626474K5211j4545j6750j5255n952K9880N6754k9093q233K9905K8007k9608
17674a576153Q246R799J6334k750q6379k1238M0126P3977O4524K6662p985J0280
17662a444557L5344M6131r706q6462l2919m173J5931Q7013R4082o983p659m2061
17650a356019j3937j8836J042J7487j8011l5895r119J2230k5819N964l6656K3141
17638a454428K5215O277m7110L1794N978K1912m017k3770P7043P3631m1247n0222
17626a378944r341J7915N3304M6826J8444m437r242m7639L8672N1048L975n1566
$$ plain form
17709 -1716644 -1662466 -1608885 -1590647 -1581139 -1625660 -1623808 -1663340 -1678781 -1717330 -1743953 -1672026 -1601929
17697 -1601929 -1612979 -1684199 -1759965 -1724026 -1657921 -1671469 -1643726 -1595762 -1555294 -1581564 -1626474
17686 -1626474 -1601263 -1615808 -1632558 -1647813 -1653765 -1623885 -1567131 -1596224 -1604457 -1574552 -1546545 -1576153
17674 -1576153 -1567907 -1558108 -1541774 -1544524 -1630903 -1652141 -1612015 -1538038 -1473514 -1446852 -1454837 -1444557
17662 -1444557 -1409213 -1363082 -1372788 -1459250 -1492169 -1496342 -1480411 -1393398 -1299316 -1306299 -1313958 -1356019
17650 -1356019 -1369956 -1388792 -1387750 -1370263 -1388274 -1424169 -1433288 -1421058 -1446877 -1440913 -1477569 -1454428
17638 -1454428 -1429213 -1422936 -1470046 -1438252 -1432274 -1410362 -1414379 -1438149 -1361106 -1287475 -1328722 -1378944
17626 -1378944 -1388285 -1370370 -1317066 -1270240 -1251796 -1256233 -1265475 -1313114 -1274442 -1223394 -1219419 -1270985
17614a270985M292L0507K0861L4854j5223k6092l034k6424n1695n183p8891j08389
17602a495402n7224N9816Q9630K431K3215L0760J9386M1989N9024o6323n3259
17591a345957n5830r788m0709M5973R0642J4155k9260j8387K2460K0374k671M4673
17579a264325J2475P2457l2835p2287O224N1980J9763r387k8384J9527K73O21
17567a223898J8603j6202k3302O0965O3301M0542k1076q846O6657R582o7229k4096
17555a124999R06J7708p530J2613p6184q6033o460J7494m9766l3520M766j3765
17543a344770Q9919k868q1929j5109K45k5570j2739M0925M7251M9614j0061n231
17531a270323M8169k9600j8661N0888M2966m270n7000M812L8338p020j630k1781
$$ plain form
17614 -1270985 -1266693 -1236186 -1215325 -1180471 -1195694 -1221786 -1224820 -1251244 -1302939 -1308122 -1387013 -1495402
17602 -1495402 -1552626 -1492810 -1403180 -1400749 -1377534 -1346774 -1327388 -1285399 -1226375 -1292698 -1345957
17591 -1345957 -1401787 -1411575 -1452284 -1406311 -1315669 -1301514 -1330774 -1349161 -1326701 -1306327 -1308998 -1264325
17579 -1264325 -1251850 -1179393 -1212228 -1284515 -1278291 -1226311 -1206548 -1215935 -1244319 -1224792 -1224519 -1223898
17567 -1223898 -1205295 -1221497 -1244799 -1183834 -1120533 -1079991 -1101067 -1109913 -1043256 -1033674 -1100903 -1124999
17555 -1124999 -1124093 -1106385 -1113915 -1101302 -1177486 -1263519 -1269979 -1252485 -1302251 -1335771 -1331005 -1344770
17543 -1344770 -1254851 -1257719 -1339648 -1354757 -1354512 -1380082 -1392821 -1351896 -1304645 -1255031 -1265092 -1270323
17531 -1270323 -1222154 -1251754 -1270415 -1219527 -1176561 -1180831 -1237831 -1233019 -1194681 -1201701 -1203331 -1225112
17519a225112m3691O3890K3811k9784J6471R993j3322n8352k963J0235K8510L0339
17507a189975N105m48Q496j4441M0662M1651j3097l5254n0193o3119M9437R1113
17495a130063M904q35j4429j6196m4102j0755J1175J9014K3434Q4492j1002m4862
17483a129225L4784K6794n6943r717J712K3690j0844K8544m7239o782m0399j7031
17471a202656J7598K6059J7561O8498M5981K294J3671l6796p675L866j922Q031
17459a045490J2567K1922o600k9720m256o2476K0257M018K152M4826L7848J9502
17447i85450j03093M2319o388n532L7397K8338K6283r284k3990K0059N3724K5632
17435h99985l699p800p6227l8997l603O1581K0744l5473l6856K944L8254k3272
$$ plain form
17519 -1225112 -1268803 -1204913 -1181102 -1210886 -1194415 -1184422 -1197744 -1256096 -1259059 -1248824 -1220314 -1189975
17507 -1189975 -1184870 -1185318 -1176822 -1191263 -1150601 -1108950 -1122047 -1157301 -1207494 -1270613 -1221176 -1130063
17495 -1130063 -1125159 -1125994 -1140423 -1156619 -1200721 -1211476 -1200301 -1181287 -1157853 -1073361 -1084363 -1129225
17483 -1129225 -1094441 -1067647 -1124590 -1134307 -1132595 -1108905 -1119749 -1091205 -1138444 -1145226 -1185625 -1202656
17471 -1202656 -1185058 -1158999 -1141438 -1072940 -1026959 -1024665 -1010994 -1047790 -1055465 -1051599 -1053521 -1045490
17459 -1045490 -1032923 -1011001 -1017601 -1047321 -1051577 -1114053 -1093796 -1089778 -1087626 -1042800 -1004952 -985450
17447 -985450 -1088543 -1046224 -1052612 -1058144 -1020747 -992409 -966126 -975410 -999400 -979341 -925617 -899985
17435 -899985 -903684 -911484 -987711 -1026708 -1030311 -968730 -947986 -983459 -1020315 -1017371 -979117 -1002389
17423a002389j7792j4703k6986P2761J7871m0837P397K8095J9702m0485N879L4540
17411i56947m441j3321k2463p24M0471o994k6022K7056K8505j857m9512l9242
17399a025491m391M2129M8994L0581Q358k3060j5246l4319M8591P6656K869m4418
17387h88747n2177k2281k3900M9275K2981N6867K3710m6846m4352J9882j2801
17376i18389l9594P5928J3282k6735K8113Q5381Q777k4459o6060k5063l5307Q097
17364i16029J4170j1280j4801P9327J1423M856J7770M1541j1657m7051k8547Q4652
17352g75626R152j7724l0038o7637P060P0215N6547m6532m5188o8385k8544R3442
17340h43258L2687Q262q890k9986k0764K207O682m0723r686N0289M8441k7797
$$ plain form
17423 -1002389 -1020181 -1034884 -1061870 -989109 -971238 -1012075 -1004678 -976583 -956881 -997366 -991487 -956947
17411 -956947 -961388 -974709 -997172 -997896 -957425 -964419 -990441 -963385 -934880 -936737 -986249 -1025491
17399 -1025491 -1029882 -987753 -938759 -908178 -899820 -922880 -938126 -972445 -923854 -847198 -844329 -888747
17387 -888747 -940924 -963205 -987105 -937830 -914849 -857982 -834272 -881118 -925470 -905588 -918389
17376 -918389 -957983 -882055 -868773 -895508 -867395 -782014 -773237 -797696 -863756 -888819 -924126 -916029
17364 -916029 -901859 -913139 -927940 -848613 -837190 -832334 -814564 -773023 -784680 -831731 -860278 -775626
17352 -775626 -766474 -784198 -814236 -881873 -874813 -804598 -748051 -794583 -839771 -908156 -936700 -843258
17340 -843258 -810571 -802309 -811199 -841185 -861949 -859742 -853060 -893783 -903469 -853180 -804739 -832536
17328h32536l4429O9518R683k1754N5211k2897K551j2847j9946l6533M0762j717
17316h04934j6642j0715j0752j0687K3603P9803l4640K8093J5176N630M6490m206
17304f93781k7172K7814o095j1813R838J8133M335j9327j7199J6900K9372L1441
17292f37554p6763p4254K559J2099M3746M5396P509k7895J9655K5929J5698o1697
17280g05572M1341K750m6037l6669n329j0652Q681k8071J9061M1147M1659L7050
17268f40641m0632q708q247l8232n8993J9390N5445j8291j1990j1837K4888N062
17256g32786l5469J8315j803J0813J7162L9678M231o3667j0328N9928K6147Q04
17244f66975k9073J7391L6854l982L4388j5649o1877j0170j1958N2221l5844j3624
$$ plain form
17328 -832536 -866965 -797447 -787764 -809518 -754307 -777204 -774653 -787500 -807446 -843979 -803217 -804934
17316 -804934 -821576 -832291 -843043 -853730 -830127 -750324 -784964 -756871 -741695 -736065 -689575 -693781
17304 -693781 -720953 -693139 -699234 -711047 -701209 -683076 -678741 -698068 -715267 -698367 -668995 -637554
17292 -637554 -714317 -788571 -786012 -773913 -730167 -684771 -677262 -705157 -685502 -659573 -643875 -705572
17280 -705572 -664231 -661481 -707518 -744187 -749516 -760168 -751487 -779558 -760497 -719350 -677691 -640641
17268 -640641 -681273 -689981 -698228 -736460 -795453 -776063 -720618 -738909 -750899 -762736 -737848 -732786
17256 -732786 -768255 -749940 -751743 -740930 -723768 -684090 -679859 -743526 -753854 -693926 -667779 -666975
17244 -666975 -696048 -678657 -641803 -645785 -611397 -627046 -688923 -699093 -711051 -658830 -694674 -708298
17232g08298m6121J0617L5550N0699M0366m7120j04961p834N85J2010N52K7142
17220g36813k1468M0860Q1326k273j1466N149M607L5531k1033O642K8378k8643
17208f19203l0935k365K2141o0175p99J0250L9101J7236J9777K7602k4755N309
17196e96816K3304J7522K0103r8592p9691L018M2140p363M573l380M6908J7411
17184f10863n048O4665M6920o1346n2865l9361K4572N5163m0143n1755L7514O3421
17172e69126r638n5380p859L5263J4467o952k5833J1905N4574o2325J219k7120
17160f46805J5795r246O9068K9641j2898o983j4024R351n7571K865P523m250l270
17147f20804M4166N7892p153m5074n7562L0074J8242L5693N0419p0184k7912N0422
$$ plain form
17232 -708298 -754419 -743802 -708252 -657553 -617187 -664307 -769268 -777102 -776517 -764507 -763955 -736813
17220 -736813 -758281 -717421 -636095 -638368 -649834 -644685 -640078 -604547 -625580 -618938 -590560 -619203
17208 -619203 -650138 -652503 -630362 -690537 -691336 -681086 -641985 -624749 -604972 -577370 -602125 -596816
17196 -596816 -573512 -555990 -535887 -634479 -714170 -711152 -669012 -676375 -671802 -675182 -628274 -610863
17184 -610863 -615911 -551246 -504326 -565672 -618537 -657898 -633326 -578163 -618306 -670061 -632547 -569126
17172 -569126 -578764 -634144 -642003 -606740 -592273 -599225 -625058 -613153 -558579 -620904 -619685 -646805
17160 -646805 -631010 -640256 -571188 -541547 -554445 -561428 -575452 -566101 -623672 -620807 -613284 -617534 -620804
17147 -620804 -576638 -518746 -525899 -570973 -628535 -598461 -580219 -544526 -494107 -564291 -592203 -541781
17135e41781r797l143J966p655N6538j3559m9199n9820r7279J5268R9145K8046
17123e81270M2204j69K620p3526k1113J4137K3001M6058j152j6841J3429J1220
17111e41402l2865k4292k5940m844M882O1464N4632O991M8007P992k5268L2770
17099d37873K567n1329j993N995l6641l5468j0682M753J4444J3593P032o463M0293
17086d91772K648P185k1338J2000L6318J6821M7697l5853j8251L1816m5848K060
17074d56517k4189k7879L278P1495l6784K8246P930n9840j1271J803J7951J0295
17062d75482L0202m6675k8163M261j872k2873k2057M580j4798o5731j592N3430
17050e86770N0412K1186j47l181J2100K2569L8207M2324m1372K2088j121k8291
$$ plain form
17135 -541781 -551578 -554721 -552755 -560410 -503872 -517431 -566630 -626450 -723729 -708461 -609316 -581270
17123 -581270 -539066 -539235 -536615 -610141 -631254 -617117 -594116 -548058 -549210 -566051 -552622 -541402
17111 -541402 -574267 -598559 -624499 -629343 -624461 -562997 -508365 -501374 -453367 -445375 -470643 -437873
17099 -437873 -435306 -486635 -488628 -482633 -519274 -554742 -565424 -560671 -546227 -532634 -525602 -532065 -491772
17086 -491772 -489124 -481939 -503277 -491277 -454959 -438138 -390441 -426294 -444545 -412729 -458577 -456517
17074 -456517 -480706 -508585 -505307 -433812 -470596 -442350 -434420 -494260 -505531 -503728 -485777 -475482
17062 -475482 -445280 -491955 -520118 -515857 -517729 -540602 -562659 -558079 -572877 -638608 -640200 -586770
17050 -586770 -536358 -515172 -515319 -518500 -506400 -483831 -445624 -403300 -444672 -422584 -423705 -451996
17038d51996m3419n5465O3900P8424K6398p931r001l5429N4947M3638o9334k4202
17026d29470K0791K9316n8867l8417n3166O6079L0793l5616k5359j6404l4164
17015e44484O081M9676O7246O0173l8158l0506P8500j146m8510L9031M6053K3526
17003b92518p9018k9923l1109L3055M4464N7478K6443n5761l9590j7335N526M1486
16991c36802M2242o6o6248K6028O7452j3957m9117o2952j9746k9565j1071R528
16979d44274q049K2425K6075k828J1036K4244K7675j7125K7610O301k7151k9532
16967c83593p9908L0774M7081k2395m1751L3892O3791J0154l9991J3224L6611
16956c32111M936o7602L0697P3826j0278n6358n6642J8704J0864J1834K0213J6983
$$ plain form
17038 -451996 -495415 -550880 -486980 -408556 -382158 -390089 -399090 -434519 -379572 -335934 -405268 -429470
17026 -429470 -408679 -379363 -438230 -476647 -529813 -463734 -432941 -468557 -493916 -510320 -544484
17015 -544484 -538403 -488727 -421481 -361308 -399466 -429972 -351472 -352618 -401128 -362097 -316044 -292518
17003 -292518 -371536 -401459 -432568 -399513 -355049 -297571 -271128 -326889 -366479 -383814 -378288 -336802
16991 -336802 -294560 -294626 -360874 -334846 -267394 -281351 -330468 -393420 -413166 -442731 -453802 -444274
16979 -444274 -452323 -429898 -403823 -406651 -395615 -371371 -343696 -360821 -333211 -326910 -354061 -383593
16967 -383593 -463501 -432727 -385646 -408041 -449792 -415900 -352109 -341955 -381946 -368722 -332111
16956 -332111 -327175 -394777 -364080 -290254 -300532 -356890 -413532 -394828 -383964 -372130 -351917 -334934
16944c34934K2511m7726j308M7791o7441q314J7233N6361K6326K72N166M1516
16932b42547l6466K1690M3801n265o4359j8352K4809K7905J5509l1505p9617k7230
16920c71627L0325K8868K8673J7529m5705j9612j9726l5532M528N7189M7602l6370
16908c13858K0844L0976l7106j7471K4115l7623k1098L5434k1904L3927k1877
16897c25641K6167K5202J7701j9151k1644l0062Q854L8239L2670k7456k4013k0034
16885c19168L7136R5769l1706n3739n032m0102j9982Q461J8007O5143K2341l6371
16873b59243k7063K6876n0235N0456J6886m7288n8348J1229N9843M86R293j6986
16861b84094J2388R2907K0312p3107m2159l4914j3021P8945N9365l255N05J8818
$$ plain form
16944 -334934 -312423 -360149 -361457 -313666 -381107 -389421 -372188 -315827 -289501 -289229 -284063 -242547
16932 -242547 -279013 -257323 -213522 -218787 -283146 -301498 -276689 -248784 -233275 -264780 -344397 -371627
16920 -371627 -341302 -312434 -283761 -266232 -311937 -331549 -351275 -386807 -382279 -325090 -277488 -313858
16908 -313858 -293014 -262038 -299144 -316615 -292500 -330123 -351221 -315787 -337691 -303764 -325641
16897 -325641 -299474 -274272 -256571 -275722 -297366 -327428 -318574 -280335 -247665 -275121 -299134 -319168
16885 -319168 -282032 -186263 -217969 -271708 -276740 -316842 -336824 -328363 -310356 -245213 -222872 -259243
16873 -259243 -286306 -259430 -309665 -259209 -242323 -289611 -347959 -336730 -276887 -276401 -267108 -284094
16861 -284094 -271706 -178799 -158487 -231594 -273753 -308667 -321688 -242743 -183378 -186633 -186128 -167310
16849a67310k9042p8644j7068K0122j1459M4176L2188j767o8809j8505M8682J9447
16837b27989j3215l0469k3546K1280m1135r4909k1512P7064Q5706J3220K344K7350
16825b25811M0136q804n5696l1835K1074q69N4558j0674n7715k7196j0876R514
16813c04194m9531P859N0069P7708N0451q8841n3003K9372O2530J8736k5524K4806
16801a99562r839M3958Q2926M979n5166n6898p5958L3369l94l8952J8247R3637
16789a59653N1053m3550m7086P7R0225j1582m9765m1787K3206j8111n8689K0029
16777b45633N1548K3649p7168L4277K8519K2378N764n4296n7779k3419M7544n903
16765b50519J48M29p944k423L793K1655L2586M7358R394j028l5521j5881K4713
$$ plain form
16849 -167310 -196352 -274996 -292064 -271942 -283401 -239225 -207037 -208804 -277613 -296118 -247436 -227989
16837 -227989 -241204 -271673 -295219 -273939 -315074 -409983 -431495 -354431 -268725 -255505 -253161 -225811
16825 -225811 -185675 -194479 -250175 -282010 -260936 -261805 -207247 -217921 -275636 -302832 -313708 -304194
16813 -304194 -353725 -345866 -295797 -218089 -167638 -256479 -309482 -280110 -217580 -198844 -224368 -199562
16801 -199562 -209401 -165443 -82517 -77538 -132704 -189602 -265560 -232191 -232585 -271537 -253290 -159653
16789 -159653 -108600 -152150 -199236 -199159 -108934 -120516 -170281 -212068 -188862 -206973 -265662 -245633
16777 -245633 -194085 -170436 -247604 -213327 -184808 -162430 -156666 -210962 -268741 -292160 -244616 -250519
16765 -250519 -250371 -249942 -257886 -260309 -256516 -234861 -202275 -154917 -145523 -146551 -182072 -197953 -173240
16752a73240p883O066J8915L2666l3466K401k8390n888L419L15Q329K6062p972
16739a58666l7914j9360j5721m8847p461k4761R329N0310n88R798k4179M963P1390
16726a91707N4722j1979o5929p8224n9441J1853J13587K8767l1200l7604N730
16715b61425J299J0403J7159L5758M2142K0013O1200j7753o5004r906J7532j783
16703a50365M7479j5780j5771P127O318k482l283l1001m621j088J0441n5985l9668
16690b48679M419j5323M2763M1539K3271N537K1816k938J0351O8743N1460n8238
16678e5279l5743J9168p1712m5150N3338J4549J5113J1117r1082k4041L8471M6240
16666a25011N4363q347m7122L0647K2246j9211p4316k8533L6375Q21n583j5099
$$ plain form
16752 -173240 -181123 -175057 -156142 -123476 -156942 -154541 -182931 -188819 -185400 -185085 -176756 -150694 -158666
16739 -158666 -196580 -215940 -231661 -280508 -287969 -312730 -303401 -253091 -253679 -243881 -268060 -263097 -191707
16726 -191707 -136985 -148964 -214893 -293117 -352558 -340705 -227118 -198351 -229551 -267155 -261425
16715 -261425 -260126 -249723 -232564 -196806 -154664 -134651 -73451 -91204 -156208 -166114 -148582 -150365
16703 -150365 -102886 -118666 -134437 -127310 -120992 -123474 -126757 -157758 -162379 -163467 -153026 -209011 -248679
16690 -248679 -244260 -259583 -216820 -175281 -152010 -146473 -124657 -127595 -117244 -48501 2959 -55279
16678 -55279 -91022 -71854 -143566 -188716 -135378 -120829 -105716 -94599 -185681 -209722 -171251 -125011
16666 -125011 -70648 -78995 -126117 -95470 -73224 -92435 -166751 -195284 -158909 -158088 -163671 -178770
16654a78770O1949M1363Q479j0765k9446J248Q166L5632m6931l807N593n7089
16642a64378k6139j8493K8360R7248j399m6279P79J1422N523R038j702n1104m4075
16629b01199K4121K0771l5224J1324k0696L0626l761J548K4239k351L1466M1949
16617g7187N138k4025n6941K0914j5050K1168M0893L3083R827l6580l8535j878
16605a19173L5139j3254j1755O8135M5900m8853j1658r8523m1273N1505L0430
16594a13380j0489l0853j5996J07300N3503p225m9478L0536k1584j0347l1508
16583i9521q830N5560K7190K2994l7298k2817O194K230L3237K7622K5924q973
16571B3512l0517r746L2938l4345o2642j3776J8879P157l0161K2227O4870K3784
$$ plain form
16654 -178770 -116821 -75458 -66979 -77744 -107190 -105942 -97776 -62144 -109075 -112882 -107289 -164378
16642 -164378 -190517 -209010 -180650 -83402 -84801 -131080 -130301 -118879 -113356 -104318 -106020 -157124 -201199
16629 -201199 -177078 -156307 -191531 -180207 -200903 -170277 -174038 -172490 -148251 -150602 -119136 -77187
16617 -77187 -72049 -96074 -153015 -132101 -147151 -125983 -85090 -52007 -42180 -78760 -117295 -119173
16605 -119173 -84034 -97288 -109043 -40908 4992 -43861 -55519 -154042 -195315 -143810 -113380
16594 -113380 -123869 -154722 -170718 -63418 -9915 -17140 -66618 -36082 -57666 -68013 -99521
16583 -99521 -108351 -52791 -25601 -2607 -39905 -62722 -56528 -54298 -21061 6561 32485 23512
16571 23512 -7005 -16751 16187 -18158 -80800 -94576 -75697 -68540 -98701 -76474 -11604 12180
16559A2180k4095q562L2083p1510l1715R119j930k0995K2051K8576m9793N0004
16547e4587J2645N9793K8480l0520k6063l4295o174Q684M514j7255j1713p5720
16535a42211K3521L1635j1810P3547J7026n0951J2059M334J8271M102m084m3336
16523f7897R309N0763K4377L8867K7834j9968j6330J7752k0679m040M6026k8558
16511E7456j1666m3685K6799J114p6059q290n7362M072n143M6823K0792l4248
16499g9397l442J6361P0824M3792K727k9359J1695P41j4429l1877o1407J0710
16487f3061N1355K9771j7928j0805J0703o3858L943K0758L2779L1226k752P4570
16475I6701K564l8643k2991n9610r642M3675l938k1488L741M9012l1724M2397
$$ plain form
16559 12180 -11915 -20477 11606 -59904 -91619 -82500 -84430 -105425 -83374 -54798 -104591 -54587
16547 -54587 -41942 17851 46331 15811 -10252 -44547 -50721 -42037 -37523 -54778 -66491 -142211
16535 -142211 -118690 -87055 -98865 -25318 -8292 -59243 -47184 -42850 -24579 -20477 -24561 -67897
16523 -67897 -58588 -7825 16552 55419 83253 63285 46955 64707 44028 39988 86014 57456
16511 57456 45790 2105 28904 30018 -46041 -54331 -111693 -107621 -112764 -65941 -45149 -79397
16499 -79397 -82839 -66478 4346 48138 50865 21506 33201 33942 19513 -12364 -73771 -63061
16487 -63061 -11706 18065 137 -10668 35 -63823 -59880 -39122 -6343 24883 22131 96701
16475 96701 99265 60622 37631 -21979 -31621 12054 8116 -13372 -9631 39381 7657 50054
16463E0054n8581l4417l3163M8501N0150J5748O2594m1363m5152n8760K1993P6485
16451E4089M4208j9791q5270k7971M3652J5601l9903l5547K4215P3179L635o863
16439D3234J281k9813L3395k3295o0243q2677K8319O6442J3907j081K1458K5247
16427C6174m2260M620j340p2632m3743L3909M0135L7372R789M388l702M0056l9785
16414B981J193Q5961k3863n1639M7728M7973k0276l2614P854j6342K2197q900
16402F2253n5676J5556O0918K7874M734l5783k7941l8607l5055m15L0131K3456
16390C1445K7208K9006J2307M744m948L9371O859M4386q882l8218q4621j2492
16378D6165K2676o172l1012M9823K6224J8750K8234l8918j16239j0668M6749L8214
$$ plain form
16463 50054 -8527 -42944 -76107 -27606 22544 38292 100886 59523 14371 -44389 -22396 54089
16451 54089 98297 78506 -6764 -34735 8917 24518 -15385 -50932 -26717 46462 50097 43234
16439 43234 44515 14702 48097 24802 -35441 -118118 -89799 -23357 -9450 -10531 10927 36174
16427 36174 -6086 -1466 -2806 -75438 -119181 -85272 -45137 -7765 2024 6412 2710 42766 2981
16414 2981 4174 90135 66272 14633 62361 110334 90058 57444 65298 48956 71153 62253
16402 62253 6577 22133 83051 110925 115659 79876 51935 13328 -21727 -22142 7989 31445
16390 31445 58653 87659 99966 104710 99762 139133 145992 190378 181496 143278 58657 46165
16378 46165 68841 62669 31657 81480 107704 126454 154688 115770 -469 -11137 35612 73826
16366G3826j588K4871m649j6400m1196j2517N6768L8501n0704J0918K5761l1206
16354G2385K6858K1521j678k5522l3162J3884K9801j7503O0189L6344j1008j11437
16342F0672p6816R9O1542N979K9216J3595q375m1686m7753m2271L4381K7534k0176
16329d059L6155n93o124N1121k671J7558L6666M374K2603j5807k5444K6455K7268
16316A67502l098o754k8871l2202n455L0205m1076j0846q87M4774J7616P4719
16304B05627J7535l4502m3755n2118l272k9875J7571m5322k1646P876L9901J5580
16292G3600M452K7748J2623J8807J159n1213L8523j3931J4686J4028j0389j1196
16280A18897L8277l5301j5746j698P773k3358R309L6572j1848j032K2369K1377
$$ plain form
16366 73826 72238 97109 92460 76060 34864 22347 79115 117616 66912 77830 103591 72385
16354 72385 99243 120764 119086 93564 60402 74286 104087 86584 146773 183117 172109 60672
16342 60672 -16144 -16045 45497 51476 80692 94287 85912 44226 -3527 -45798 -11417 16117 -4059
16329 -4059 32096 31503 25379 76500 73829 91387 128053 132427 155030 139223 113779 140234 167502
16316 167502 164404 157650 128779 96577 91122 121327 80251 69405 68518 113292 130908 205627
16304 205627 223162 188660 144905 92787 89515 59640 77211 31889 10243 18119 58020 73600
16292 73600 78052 105800 118423 137230 138389 87176 125699 111768 126454 140482 130093 118897
16280 118897 157174 121873 106127 104429 112202 88844 98153 134725 122877 121845 144214 165591
16268A65591m749M1691M2615k9924o529N420N3911J1277l9350k0722L1978j541
16256B49668j3889l6397J019n8600J0681P3515L1416J3416l6339K432m3273l4964
16244A58685R688k5901j8231L307j0476M541L3908K5694K4865m6360K9412L6491
16232B25623l8776j4813n9002k8095N3746J05137p342p4501l5363q971J3074M106
16220A34823j7770R088K5180N6483J8318L0600O4458l5964l990k6458j9510L3042
16208B68300k6067l5454m7831N6778M2546j832l3873J4798k1219J1918k2924j7979
16196A87161o4961o8886k9759j4902L4904M8985N3166l7169K7453K6350k3742
16185A38600J5873K9254J2302q169K0649J0378M9183p266k3303k3542j5420J2050
$$ plain form
16268 165591 160842 202533 245148 215224 208695 214115 268026 279303 239953 219231 251209 249668
16256 249668 235779 199382 200401 141801 152482 225997 257413 270829 234490 236922 193649 158685
16244 158685 168373 142472 124241 127548 117072 121613 155521 181215 206080 159720 189132 225623
16232 225623 186847 172034 113032 84937 138683 243820 236478 161977 126614 117643 130717 134823
16220 134823 117053 126141 151321 207804 226122 256722 321180 285216 281226 254768 235258 268300
16208 268300 242233 206779 158948 215726 258272 256440 222567 237365 216146 228064 205140 187161
16196 187161 122200 53314 23555 8653 43557 92542 145708 108539 135992 162342 138600
16185 138600 154473 183727 196029 187860 208509 218887 268070 260804 237501 213959 198539 210589
16173B10589k5811K2306J4237k6967n4368O4857N2354M72K6359J7738j7580M978
16161B89164l0386k0244k0636J6464r6833R932Q0334N3420o0790J123K1855m0711
16149B02692k8825j4287M6390J2137L1149J1115j9959J7560J5224j4870k1749
16138B36577L0505p267p289k0324N5784J7782n7485j3898k02K9621P8378k7667
16126C14515p2240m6328j3394M4525J1446m9222K8657j9013j9410K6907J8101
16115B24544l4303N7980R4109J3343k2337P1207m3407p2507l9523l5477K1512
16104B35141q482k9740N3575L2858n8167J183O8992J6320j7707l1678j3188k1123
16092B27984j980P6333m61J8204m1696q016N3869K8330l4110j3451p7863k4196
$$ plain form
16173 210589 184778 207084 221321 194354 139986 204843 257197 257669 284028 301766 284186 289164
16161 289164 258778 238534 217898 234362 137529 147461 227795 281215 220425 221548 243403 202692
16149 202692 173867 159580 205970 218107 249256 260371 240412 257972 273196 258326 236577
16138 236577 267082 259815 252526 232202 287986 305768 248283 234385 234183 263804 342182 314515
16126 314515 242275 195947 182553 227078 238524 189302 217959 198946 179536 206443 224544
16115 224544 190241 248221 342330 355673 333336 404543 361136 288629 249106 213629 235141
16104 235141 226659 196919 250494 283352 225185 226368 295360 311680 293973 262295 249107 227984
16092 227984 226004 302337 301876 320080 278384 270368 324237 352567 318457 305006 227143 202947
16080B02947N4218O2669P0139m1235p928M3358J4351j3223j9552Q956o3042p816
16068C03842k6336j2355L024M529O3302L8736m9392m0498o3826N1296J1153m9181
16056B34294m0465J6683L2836N2570j4944j9747m3561N6991N079J923J4030m5687
16044B50002O152J16312Q076j2155m4354p172K2896J6559m323j0772l7739J2893
16032C16375J0708R489r452J0881l975j7841M861o0142o518J0590K1306R0513
16020C76795N007k4887N017k8222l0550l0526j1793P295q368J6394K4685L7117
16008C37964K146l5897k8627j3482P4688L0262k4285p9665l1383K0531M4281M4632
15996C41165j7098K3540l380M7437J7406J7979l7985k767J4223K3819l4150l7183
$$ plain form
16080 202947 257165 319834 389973 348738 340810 384168 398519 385296 365744 374700 311658 303842
16068 303842 277506 265151 268175 272704 336006 374742 325350 284852 221026 272322 283475 234294
16056 234294 193829 210512 243348 295918 280974 261227 217666 274657 279736 281659 295689 250002
16044 250002 256154 372466 380542 368387 324033 316861 339757 356316 351993 341221 303482 316375
16032 316375 327083 336572 327120 338001 334026 316185 321046 260904 254386 264976 286282 376795
16020 376795 381802 356915 361932 333710 303160 272634 260841 268136 259768 276162 300847 337964
16008 337964 340110 304213 275586 262104 336792 367054 342769 263104 231721 252252 296533 341165
15996 341165 324067 347607 344227 391664 409070 427049 389064 386297 400520 424339 390189 353006
15984C53006M2804l93q657j2326m0437j0354J8889n3887N4318R7384j5364m0982
15972C84001q013L4373l528l7005j5612j5282J9107M392r542n284n1798N7873
15960C53682j072K438N1360M8376m5666J4233l7054n3930j2240K0891O9892l9680
15948C71230j3075q1005k4603j4346O4100J13967N6232r172m3282j3246k1599
15937C85201L9645k3839m3172j7155J6223j3630L9885J8948j8247q524j8508j7899
15925C38928M5153M9304M4754k3720n229j4967r340M1311m8857k6257J3204O4473
15913D68757J426o8765j9932P5825L3984J4754o1308m3873M3067O0358k4798l5697
15901D43798O748M1958j8822n3793k1661q4649M7696Q7795J9912k0597m3666N523
$$ plain form
15984 353006 395810 395417 386760 374434 333997 323643 342532 288645 342963 440347 424983 384001
15972 384001 375988 410361 406833 369828 354216 338934 358041 362433 352891 347607 295809 353682
15960 353682 352610 355048 406408 454784 409118 423351 386297 332367 320127 341018 410910 371230
15948 371230 358155 277150 252547 238201 302301 416268 472500 463328 420046 406800 385201
15937 385201 424846 401007 357835 340680 356903 343273 383158 402106 383859 375335 356827 338928
15925 338928 384081 433385 478139 454419 449190 434223 424883 466194 417337 391080 404284 468757
15913 468757 470183 401418 381486 457311 491295 506049 444741 400868 443935 504293 479495 443798
15901 443798 450546 492504 473682 419889 398228 313579 361275 449070 468982 448385 404719 410242
15889D10242K002J3183M1557J5906J4494K735k4124n388J7479N8596k9495n8588
15877D58599j756j6651K7074j4059J1799P4785r138n3785p710k3700p155l529
15865D34774m8675O8652J1170l0935K5072J6106M5043j2129m7179j8711L6538
15854D79726n265N4456M6166J3302k5609K8962K1073k3930j00509m4363M2185
15843D86194J9481K7729M68J5623k4666m9704k1986l4192n6469J4295L6823J3764
15831D27360L5292j7054K1349J6846m9448j8859M1784K7831K8222L1200L2662
15820E77185l5117J6231l9879j5469J4561J2320l4265j1634M4077L0156L7234
15809E95400L1564n4835p8715n331L4936Q604N2563M7791p0632k3647K8103K4116
$$ plain form
15889 410242 412244 425427 466984 482890 497384 500119 475995 470607 488086 546682 517187 458599
15877 458599 456843 440192 467266 453207 465006 539791 530653 476868 469158 445458 438303 434774
15865 434774 386099 454751 465921 434986 460058 476164 521207 509078 461899 443188 479726
15854 479726 474461 528917 575083 588385 562776 591738 612811 588881 488372 444009 486194
15843 486194 505675 533404 533872 549495 524829 475125 453139 418947 362478 376773 413596 427360
15831 427360 462652 445598 466947 483793 434345 415486 457270 485101 513323 544523 577185
15820 577185 542068 558299 518420 502951 517512 529832 495567 483933 528010 558166 595400
15809 595400 626964 572129 493414 488083 523019 531623 584186 631977 561345 537698 565801 589917
15797E89917p882k2762l8346j1079k9099o275K651M0127L7573m954L0626K4481
15785F04978R878O6015l1670o1668p6189l6043k1992N4552K7034k8392q0395L775
15773D29883N5847P6362O2404M3648J4470k1613r744n9297j9638R122m2332p293
15761E31819O1544j3214n3158K2867J5590m1055P0915k298M589M2294k7333n2778
15749E59782j8231j7742O7051M1648L710j5886N941m7091J5352K3596K0237l7647
15737F00720q6188J1881N0173K5021J8002j9981k0924J9789N7751O969O200k7017
15725F42396m0773j2229l7310k3965N7705M7244K2782M0418l3033k7788j9825
15714F15622L4613O3596k4585j9461L0461o020Q949J4921l4687M163p572K1921
$$ plain form
15797 589917 582035 559273 520927 509848 480749 474474 477125 517252 554825 549871 580497 604978
15785 604978 614856 680871 649201 587533 511344 475301 453309 507861 534895 506503 426108 429883
15773 429883 485730 562092 624496 668144 682614 661001 651257 591960 572322 581444 539112 531819
15761 531819 593363 580149 526991 549858 565448 524393 595308 593010 597599 639893 612560 559782
15749 559782 541551 523809 590860 632508 636218 620332 626273 579182 594534 618130 638367 600720
15737 600720 514532 526413 576586 601607 619609 599628 578704 598493 656244 663213 669413 642396
15725 642396 601623 589394 552084 528119 585824 633068 655850 696268 663235 635447 615622
15714 615622 650235 713831 689246 669785 700246 694226 703175 718096 683409 687572 680000 701921
15702G01921R4353n778l2583N547o92m9410l3716M2595o6061j1662N2138M9653
15690G46305Q000l8586L5240M0755l3185o0201O3127M3116K4932l3511m6495k031
15678G47466J6182L3703J3343K5441N939m9783n4708L8763N3904o8407m481J0647
15666G68009p3412K1045O7031K4979M212M795L3324j3972o1534o4736K6672K776
15654G39189l3748l7107j0841O0840L0647m977j0189N0214J0478P9992M700l6934
15642H42264Q2871J2779k5705O988M478J6396l87O748n0386k5757k2454j6013
15630H31822j6825m5701K0931L1537O2081L5786j8241j8095O4095K6894n40n2445
15618I21299q8001Q833q364k5047j8467Q024K7578N2042O4251L235L5259m1959
$$ plain form
15702 701921 796274 790496 757913 763460 762768 713358 679642 722237 656176 644514 696652 746305
15690 746305 754305 715719 750959 791714 758529 698328 761455 804571 829503 795992 749497 747466
15678 747466 763648 797351 810694 836135 842074 792291 737583 776346 830250 761843 757362 768009
15666 768009 694597 715642 782673 807652 811864 816659 849983 836011 774477 709741 736413 739189
15654 739189 705441 668334 657493 718333 748980 744003 733814 784028 794506 874498 879198 842264
15642 842264 925135 937914 912209 919197 923675 940071 939684 946432 896046 870289 847835 831822
15630 831822 814997 769296 790227 821764 883845 919631 901390 883295 947390 974284 973744 921299
15618 921299 833298 842131 833767 808720 790253 798277 825855 877897 942148 945383 980642 938683
15606I38683K8991J6655j6407m907M2291q112o7778Q281K1358K1838L8660L1386
15594A050939J2249R280L377J8052k3194L300l9716k27j2662O7341P0171M6591
15582A205501n5147p9052l406Q6500M7907l2427k6773j6095m1815L9770L2087
15571A157050N3432J23950n286P975J6092p738k8035K0818k1233j9331q076j0367
15559A279251j5919k6442J4688R2025P5453K3783J9809O6424M463L3457J8314
15548A585306K386j7755k0145P6680O6403L6430J2015L9079o647N2116Q9904Q2200
15536A997972J0057M6453P4026J7593q920J01645J39854Q9882O9648J50545J21901
15525B810656J97542J48557J97381K20773K76959J86496K53667K97189L65627
$$ plain form
15606 938683 967674 984329 967922 963015 1005306 997194 929416 937697 959055 980893 1019553 1050939
15594 1050939 1063188 1072468 1075845 1093897 1070703 1074003 1034287 1034060 1021398 1088739 1158910 1205501
15582 1205501 1150354 1071302 1067896 1154396 1202303 1169876 1143103 1127008 1085193 1124963 1157050
15571 1157050 1210482 1334432 1329146 1337121 1353213 1345475 1317440 1338258 1317025 1297694 1289618 1279251
15559 1279251 1263332 1236890 1251578 1343603 1419056 1442839 1462648 1529072 1533535 1566992 1585306
15548 1585306 1587692 1569937 1549792 1626472 1692875 1729305 1741320 1780399 1773752 1825868 1915772 1997972
15536 1997972 2008029 2054482 2128508 2146101 2137181 2238826 2378680 2468562 2538210 2688755 2810656
15525 2810656 3008198 3156755 3354136 3574909 3851868 4038364 4292031 4589220 4954847
15516D954847M37509N65036O64337O39650N32281j65240j813274m019959n477035
15507c681848k916444J62052Q54972Q16595O30905N12534L82349L14837K00468
15498b723580K19844K21280L00351K59930J72649J06435R6570R9295J27418J82089
15488i37719O8408O0061q785N2372O5209L2637K7486Q7908O2749K6585k9238J8840
15476d73487J1970M1314M6761p9638k2742K8172R12L2346J8536L9908K4734k1224
15464c52438L3412L0485O6498J0827k9252n881J7659P641r79J3230O2286q209
15452a54721j6147L325L7397n126J9119L891K8157l91K9274Q3984N5096n5495
15440B8363p965L6654J826m4953j8016K0721N4972N6638L9170K9374M3202L6578
$$ plain form
15516 4954847 5392356 5957392 6621729 7261379 7793660 7628420 5815146 1795187 -3681848
15507 -3681848 -6598292 -6436240 -5581268 -4764673 -4133768 -3621234 -3238885 -2924048 -2723580
15498 -2723580 -2503736 -2282456 -1982105 -1722175 -1549526 -1443091 -1346521 -1247226 -1119808 -937719
15488 -937719 -869311 -809250 -818035 -765663 -700454 -667817 -640331 -552423 -489674 -463089 -492327 -473487
15476 -473487 -461517 -420203 -373442 -453080 -475822 -447650 -446738 -414392 -395856 -355948 -331214 -352438
15464 -352438 -319026 -288541 -222043 -211216 -240468 -246349 -228690 -221049 -222028 -208798 -146512 -154721
15452 -154721 -170868 -167543 -130146 -135272 -116153 -112262 -84105 -84496 -55222 28762 83858 28363
15440 28363 20398 57052 58878 13925 -4091 16630 71602 128240 167410 196784 239986 276564
15428B76564j3981m3105k7183n9932l8275M2555L6976M8076N8476q490o0751k0313
15416A90617l2670M7322J2776j0514K5376k27L1426Q6839j4000j1065j5122o2943
15404B47815n1999N0688P8967M320j5188l9380M3468L3631O917q123l0987o695
15392C13434k3703m419N9405M8424N4411j8496m3632l4066L4573l683k3113K5656
15380C84791j2889K6310K9261j91J1970j3419L793K9101K782j0109o958k8276
15368D16166O398M5146j5940j4319j0849j9158M3038K1627o241J4561j1433n022
15356D63974J6332l9374n797L4090m321J1969L3170N867L5713j5106k0886L6375
15344E52006K4831M8986J421n3091j6076J323K0383O852k1091l5227l166K3941
$$ plain form
15428 276564 262583 219478 192295 132363 94088 136643 173619 221695 280171 271681 210930 190617
15416 190617 157947 205269 218045 207531 232907 232680 264106 350945 336945 325880 310758 247815
15404 247815 195816 246504 325471 329791 314603 275223 318691 352322 359239 351116 320129 313434
15392 313434 289731 285312 344717 393141 447552 429056 385424 351358 385931 382248 359135 384791
15380 384791 371902 398212 427473 427282 439252 425833 429626 458727 461509 451400 444442 416166
15368 416166 422564 467710 451770 437451 426602 407444 450482 472109 465868 480429 468996 463974
15356 463974 480306 440932 435135 469225 464904 476873 510043 515910 551623 536517 515631 552006
15344 552006 576837 625823 627244 574153 558077 559400 579783 586635 565544 530317 527151 551092
15332E51092K6267k153k6187R098j1956j8585l9749k9595J9508J2580M3102K1100
15320E54522L0826L0699Q990N6648j1585j4365M2789P62k9127n7351M0905q935
15308F44778m8356l2580O940O78k3390L357N4710J9091J7221P0827q763M775m282
15295G05006j1864J2635j8907m8413K595L9843r739K6497j9382n103J4896L4251
15283G22315k3214k7439J4680r643k5443l31N190J3744k1377k1321l3631O1607
15271F55137K5493p2179M7606L2135k3537q724j1670M0723J693l5405m4013J1428
15259F18687P5738J6291k6827L1193L9663l4332n7105K940O0857M1038k8565o94
15247G38884j8559K978l8059j2752L1856j3865J9613R6206J414o5334J1238j8679
$$ plain form
15332 551092 577359 575206 549019 558117 546161 527576 487827 458232 477740 490320 533422 554522
15320 554522 585348 616047 625037 681685 670100 655735 698524 699286 670159 612808 653713 644778
15308 644778 596422 563842 570782 571460 548070 551427 606137 625228 642449 713276 704513 709288 705006
15295 705006 693142 705777 686870 638457 641052 680895 671156 697653 678271 673168 688064 722315
15283 722315 699101 671662 686342 676699 651256 650925 656115 669859 648482 627161 593530 655137
15271 655137 680630 608451 656057 688192 664655 655931 644261 684984 686677 651272 607259 618687
15259 618687 694425 710716 683889 715082 754745 720413 663308 666248 727105 768143 739578 738884
15247 738884 720325 723303 685244 672492 704348 690483 710096 806302 807716 742382 753620 734941
15235G34941r756j6484k103N9727J8602R0427M4898l0681j8272j1435l8064l155
15223H18645l727l0356J2638O265j0918m3319j3076N7551n110J2588J3701l0765
15211G84117o4215J1295p60J38K9968J7316L2480Q97K8469O9527k5888n7569o724
15198H19051M2911L832p197K9587O484K242j2709l2484N067o5629l5802r563L090
15185G48880J8933K1017L4247N131m9690o9550K2668R6184M0649J5706k4012M0453
15173I00616l0074O994M8858K2991j4142Q855K1514l174r649k2867J837L0746
15161I62505n3884n520L9626N9651O757m8935m5834k5013N1842M9931m6166q8531
15149H56429q61O0461q651K8596K9378k7601k2041N711M130l6456K1375j9358
$$ plain form
15235 734941 725185 708701 706598 766325 784927 875354 920252 889571 871299 859864 821800 818645
15223 818645 814918 784562 797200 803465 792547 749228 736152 793703 788593 801181 814882 784117
15211 784117 719902 731197 730437 730575 760543 777859 810339 811236 839705 909232 883344 825775 819051
15198 819051 861962 865794 858597 888184 894668 896910 884201 851717 856784 791155 755353 745790 748880
15185 748880 767813 788830 823077 828208 778518 708968 731636 827820 868469 884175 860163 900616
15173 900616 870542 877536 926394 949385 935243 944098 965612 962438 952789 929922 931759 962505
15161 962505 908621 903101 942727 1002378 1009135 960200 914366 889353 941195 991126 944960 856429
15149 856429 855568 916029 907378 935974 965352 937751 915710 921421 925551 889095 910470 891112
15137H91112n2394N0766R7389K4458j5747l694R805k8962j3851P945O433K413
15125I75673j6402o982l1389J9053L2078J9500m1027m5946o56J7245L5692j689
15113I55150n179l796k7027k8027j5468J00460N0951J2781L3112r964l6614o158
15101A020221K3155j9662m8746M4151k6105m5327N0294j5545K4282K7593l162
15090A031149k7778J9061N1842L7618l7281k9437P471J1985n3403p6692K4029
15079I58564M0081r827J5218k0149M1105p255j6697K138l3091L1415O8671J6790
15067A086963k8640k0186L559K7303L9512R6657k6035o8052l4383o948p288j3429
15055A049033O613j43j0946J6827k1050K9186J16228K9747k4601q1836m9101J6290
$$ plain form
15137 891112 838718 889484 986873 1011331 995584 991890 1001695 972733 958882 966827 973260 975673
15125 975673 959271 952289 920900 939953 972031 991531 950504 904558 903902 921147 956839 955150
15113 955150 949971 946175 919148 891121 875653 976113 1027064 1039845 1072957 1062993 1026379 1020221
15101 1020221 1043376 1023714 974968 1019119 993014 947687 997981 982436 1006718 1034311 1031149
15090 1031149 1003371 1022432 1074274 1111892 1074611 1045174 1052645 1064630 1011227 934535 958564
15079 958564 998645 988818 1004036 983887 1024992 1017737 1001040 1003178 970087 1001502 1070173 1086963
15067 1086963 1058323 1038137 1041696 1068999 1108511 1205168 1179133 1111081 1076698 1069750 1062462 1049033
15055 1049033 1055646 1055503 1044557 1061384 1040334 1069520 1185748 1215495 1190894 1109058 1059957 1076247
15043A076247K3244j2348K9355K7949m5886K512J1329m0476k4933N3959M0671
15032A141623q077l2584k2207O266J449N9310K6753J3807k8882l5144J8588M2661
15020A183563L0190K5113J986p502O089J0438m1941Q406O7577j7794l7459l3033
15008A195633j5433P317l3250N49M8541J3618l5257l9798L9083L7904J3688O0677
14996A293272K7545r9758k4796K2888K1785M9633j2808j1803M8974J4467n533
14985A323866l7490l6904n992q593l4957j8752n4351n490j5842K6342P7023N0251
14973A259111m0880M7731M9106R87J5270N5257p324r1297n6422M3721Q2844m488
14961A353616k9941j9056l8530l5687k4942J4396Q0854K6075R45k0063J5948r200
$$ plain form
15043 1076247 1099491 1087143 1116498 1144447 1098561 1101073 1112402 1071926 1046993 1100952 1141623
15032 1141623 1133546 1100962 1078755 1085021 1086470 1145780 1172533 1186340 1157458 1122314 1140902 1183563
15020 1183563 1213753 1238866 1240852 1233350 1239439 1249877 1207936 1216342 1283919 1266125 1228666 1195633
15008 1195633 1180200 1187517 1154267 1154816 1203357 1216975 1181718 1141920 1181003 1218907 1232595 1293272
14996 1293272 1320817 1221059 1196263 1219151 1240936 1290569 1277761 1265958 1314932 1329399 1323866
14985 1323866 1286376 1249472 1243480 1234887 1199930 1181178 1126827 1121337 1105495 1131837 1208860 1259111
14973 1259111 1218231 1265962 1315068 1316055 1331325 1386582 1379258 1287961 1231539 1275260 1358104 1353616
14961 1353616 1323675 1304619 1266089 1230402 1205460 1219856 1300710 1326785 1327730 1307667 1323615 1314415
14949A314415j4254M5843J944o1161J6658P165J6649P913L9126J7033P0199R6306
14937A557836k4281l4574o3187o3854o3390k3743O5268Q421k2258m804K2847J1273
14925A365554L6748L8574l8912N230J9053j0792j9401k0765L7L5279O5682K0794
14913A497081l7050K8167M4168l0069l8196N4886L7560o0514q4055M0947L6619
14902A489544L1347R918k9604o124k0281K4101l242M3721J0052N514k6490m2073
14890A486383K2409N2712K4393j17005m0753L4624L0904k2791j1991N3930J6206
14879A529021J6252L9294M8225R54k7571J743n5204q070q301k8093N406R3508
14867A607164N2119M0742K2583q2074l9583J00949L1168n0603K3069K0081k5547
$$ plain form
14949 1314415 1300161 1346004 1347948 1286787 1303445 1310610 1327259 1335172 1374298 1391331 1461530 1557836
14937 1557836 1533555 1498981 1435794 1371940 1308550 1284807 1350075 1358496 1336238 1331434 1354281 1365554
14925 1365554 1402302 1440876 1401964 1407194 1426247 1415455 1396054 1375289 1375326 1410605 1476287 1497081
14913 1497081 1460031 1488198 1532366 1502297 1464101 1518987 1556547 1496033 1411978 1452925 1489544
14902 1489544 1520891 1530809 1501205 1495081 1474800 1498901 1495659 1539380 1549432 1554946 1528456 1486383
14890 1486383 1508792 1561504 1585897 1468892 1428139 1462763 1493667 1470876 1458885 1512815 1529021
14879 1529021 1545273 1584567 1632792 1633746 1606175 1607918 1552714 1544644 1536343 1508250 1513656 1607164
14867 1607164 1659283 1700025 1722608 1640534 1600951 1701900 1733068 1682465 1705534 1725615 1700068
14856A700068k0838j3363l4609K1008m855K5684K3905m8473r094K2308p66K7878
14844A688853J6930M0821l203n2361l1308n6857M1149O1777J3113m5919j7512
14833A655483L5450m6854k481L2810k0359J1289K7881J1678M6827K0581q259j5819
14821A748227j2747K864o24J3617J3379L3773J4833O1910J7022k6969k0695K288
14809A846878k6248J2978O427K1386L9463n3918J8110N727O555J5168q770l3654
14797A850102K8164L5176M2019p437l9793L7219o276m9323J8307J0691L4648k4965
14785A928532k0033o0767K675R1055N1866P191q0553q9894O7842R8292N5116M3534
14773B094856o453O3324K6300m8743o5312K3236N9615k0983Q498N619j6995M9580
$$ plain form
14856 1700068 1679230 1665867 1631258 1652266 1647411 1673095 1697000 1648527 1639433 1661741 1660975 1688853
14844 1688853 1705783 1746604 1743401 1691040 1659732 1602875 1644024 1705801 1718914 1672995 1655483
14833 1655483 1690933 1644079 1641598 1674408 1654049 1665338 1693219 1704897 1751724 1772305 1764046 1748227
14821 1748227 1735480 1738344 1737720 1751337 1764716 1798489 1813322 1875232 1892254 1865285 1844590 1846878
14809 1846878 1820630 1833608 1840035 1861421 1900884 1846966 1865076 1870803 1877358 1892526 1883756 1850102
14797 1850102 1878266 1913442 1955461 1948024 1908231 1945450 1939174 1889851 1908158 1918849 1953497 1928532
14785 1928532 1908499 1847732 1850407 1941462 1993328 2000519 1919966 1830072 1897914 1996206 2051322 2094856
14773 2094856 2088403 2151727 2178027 2129284 2063972 2087208 2146823 2125840 2134338 2139957 2122962 2172542
14761B172542N5826l7625n4082O249q041K7994J4085N8577L7293Q527L6983L2683
14749B351011P70Q1064Q0783N2997O1105O2481N1828k8756o8124k41941m25443
14738A977775m76947k99363m1857N4963Q9935J26824J61525N2849K7710k998M1826
14727A712242L8128O6136J4309Q1M5660J0806N3541J2153K8692o148m3483m6793
14715A885324O8478M3453O9221N1655l092l0964m1804J3153K9463m4992L12R2775
14703B132982K4033l1958j2327N2338Q5561j0198j19974l8839N5491L3731l2960
14692B137880J8877N2341N6466n3812j16259l9607O1130L1453M4584M4493P143
14681B244689m0223n4731o7357J6107J27312P5799K7242P116K0478M999o1740
$$ plain form
14761 2172542 2228368 2190743 2136661 2142910 2134869 2162863 2176948 2235525 2272818 2281345 2318328 2351011
14749 2351011 2351781 2432845 2513628 2566625 2627730 2690211 2742039 2713283 2645159 2403218 1977775
14738 1977775 1500828 1201465 1159608 1214571 1304506 1431330 1592855 1645704 1673414 1670416 1712242
14727 1712242 1750370 1816506 1830815 1830896 1876556 1887362 1940903 1953056 1981748 1975600 1932117 1885324
14715 1885324 1953802 1997255 2066476 2118131 2115039 2084075 2042271 2055424 2084887 2039895 2040207 2132982
14703 2132982 2157015 2125057 2112730 2165068 2250629 2240431 2120457 2081618 2137109 2170840 2137880
14692 2137880 2156757 2209098 2265564 2211752 2095493 2055886 2117016 2148469 2193053 2237546 2244689
14681 2244689 2204466 2149735 2082378 2098485 2225797 2301596 2328838 2335954 2356432 2361431 2299691
14670B299691l2478J883P7681N6480j8583m2634J9978K3381O2942j5804M209J2486
14658B449232L9153K1775o4118n6066P05K6432K8733J536j6513l2015J3343P280
14646B419477K1017O9545J16775k9809q3007r953j2593l323P0155K6816J956k834
14634B584222O410P133K5852N407M2242j3765M0344K9956k8127l276K5602j9945
14622B702055l8879o1158l108M1937Q449k3409L700K7603k6342M7448M9446N936
14610B733678j8990M1906J4682K4113O874j4151K6997n224j5212P7143N1730p1684
14598B851862k0302K1056K7029J9367Q7986M3338k7707N3608L9224K9475m4183
14587C080753M499K9548M4522K3584o681n3469M5338m4803n3944r047L3569K2507
$$ plain form
14670 2299691 2267213 2269096 2346777 2403257 2384674 2342040 2362018 2385399 2448341 2432537 2436746 2449232
14658 2449232 2488385 2510160 2446042 2389976 2390681 2417113 2445846 2447382 2430869 2398854 2412197 2419477
14646 2419477 2440494 2510039 2626814 2597005 2513998 2504045 2491452 2488129 2558284 2585100 2587056 2584222
14634 2584222 2590632 2597765 2623617 2629024 2671266 2657501 2697845 2727801 2699674 2696398 2722000 2702055
14622 2702055 2663176 2602018 2598910 2640847 2649296 2625887 2629587 2657190 2630848 2678296 2727742 2733678
14610 2733678 2714688 2756594 2771276 2795389 2802263 2788112 2815109 2809885 2794673 2871816 2923546 2851862
14598 2851862 2831560 2852616 2879645 2899012 2986998 3030336 3002629 3056237 3095461 3124936 3080753
14587 3080753 3085252 3114800 3159322 3182906 3176225 3122756 3168094 3123291 3069347 3060300 3093869 3116376
14575C116376J1660L6509N3459K0546j5048k13k6077P885M8352R4202M3746n7612
14563C333785n8931l4807O659M7147O041n9675M0368L7638O4629L372k6198m1046
14551C318982J1909L7190P9761n690n6538M8385Q2333O6037P6516j3998o1439
14540C583448K2344o8635M2879M7943j9615K3265N4300L4073J7358L1469j0760
14529C758069j577M9172J7735k8546J849K1077K356l694J5625J7208L0956K9657
14517C909887K7462n585p547n8099k7873K9906p701J0694N2577l6872o5436M3208
14505C864621N7409j2426k809O7999j698J1279N1370K2833K5370l548p6109N9822
14493D064113J2800r492O6936J2572M9980Q9195M5724Q0686M9458o6339k3723
$$ plain form
14575 3116376 3128036 3164545 3218004 3238550 3223502 3223289 3197212 3205097 3253449 3347651 3391397 3333785
14563 3333785 3274854 3240047 3246706 3293853 3299894 3240219 3280587 3318225 3382854 3386226 3360028 3318982
14551 3318982 3330891 3368081 3447842 3442152 3385614 3433999 3516332 3582369 3658885 3644887 3583448
14540 3583448 3605792 3537157 3580036 3627979 3608364 3631629 3685929 3720002 3737360 3768829 3758069
14529 3758069 3756492 3805664 3823399 3794853 3796702 3817779 3820135 3816441 3832066 3849274 3880230 3909887
14517 3909887 3937349 3931764 3924217 3866118 3838245 3868151 3860450 3871144 3923721 3886849 3821413 3864621
14505 3864621 3922030 3909604 3906795 3974794 3973096 3984375 4035745 4058578 4083948 4080400 4004291 4064113
14493 4064113 4076913 4067421 4134357 4146929 4196909 4286104 4331828 4412514 4461972 4395633 4371910
14482D371910Q4265N8591K0874L1608j2358N0257N1455m6849n2989K9531P0404
14471D656699L9211N1302L5485l80j5192j6943J7205P8059N5774p789M5519P3683
14459E012633M2967P364K1681M6916M2626M5670R26M854m5177n4724m374J31023
14447E252385M8971M5312Q9397K184l5518M3405N2235L7772o128j3122L4457L2761
14435E584111P8159O7693L1161N4815N0057K201L397K9269L966j9732Q8122P5628
14423F048847M5164M4332O3685O018O9721O3346m0759K7846R8316N9729J5140
14412F501385p255O39M7346L7746N6551J27830Q8023J2579J1433N0451M3777O6750
14400G037255K4750J08464J22384O3930J11452J08417N6220r723j2196l2104l6315
$$ plain form
14482 4371910 4456175 4514766 4535640 4567248 4554890 4605147 4656602 4609753 4556764 4586295 4656699
14471 4656699 4695910 4747212 4782697 4782317 4767125 4750182 4767387 4845446 4901220 4893431 4938950 5012633
14459 5012633 5055600 5062964 5084645 5131561 5174187 5219857 5220783 5225637 5180460 5125736 5121362 5252385
14447 5252385 5301356 5346668 5436065 5438249 5402731 5446136 5498371 5536143 5530015 5516893 5551350 5584111
14435 5584111 5662270 5729963 5761124 5815939 5865996 5868197 5871594 5900863 5904829 5885097 5973219 6048847
14423 6048847 6094011 6138343 6202028 6208046 6277767 6341113 6300354 6328200 6426516 6486245 6501385
14412 6501385 6494130 6494769 6542115 6579861 6636412 6764242 6852265 6864844 6876277 6926728 6970505 7037255
14400 7037255 7062005 7170469 7292853 7356783 7468235 7576652 7632872 7623149 7610953 7578849 7542534
14389G542534K597l9658q3362J0202J55838J34982Q4950K2874M6571R4789J09691
14378H082008P5377O3259J01530N8002K7505J06422J62383J11441J04030J36986
14368I028943K7447J26145J30347P8306K8493K4168P8070P5771R4774R3109J45888
14357I931461J07104J08260J68381J62786J23139O4556P2874R4188J35241J32709
14347A1100699Q2774M4171J38257J81437J79435J56987J41474J45090J93207J22025
14337A2485556J23095K13707J52335J44495J00532J66404J69528J97607J94695
14328A3947954J85120K22822J87235J98143J95564K28977K27024K37712L12197
14319A5942748K47059K00746K10094K37021K98708L11301L32802L79520L93360
$$ plain form
14389 7542534 7545131 7505473 7422111 7432313 7588151 7723133 7808083 7830957 7877528 7972317 8082008
14378 8082008 8157385 8220644 8322174 8380176 8407681 8514103 8676486 8787927 8891957 9028943
14368 9028943 9056390 9182535 9312882 9391188 9419681 9443849 9521919 9597690 9692464 9785573 9931461
14357 9931461 10038565 10146825 10315206 10477992 10601131 10665687 10738561 10832749 10967990 11100699
14347 11100699 11183473 11227644 11365901 11547338 11726773 11883760 12025234 12170324 12363531 12485556
14337 12485556 12608651 12822358 12974693 13119188 13219720 13386124 13555652 13753259 13947954
14328 13947954 14133074 14355896 14543131 14741274 14936838 15165815 15392839 15630551 15942748
14319 15942748 16189807 16390553 16600647 16837668 17136376 17447677 17780479 18159999 18553359
14310A8553359L86137L48375L66238M71071M83255M18940M63106M67416M31521
14301B2389418M02471M94905N68481O48967N93761O16859P22794Q35586Q82214
14292B8155456Q43293R12664R51044J075795J166173J149147J229298J383748
14284C6866618J419929J626300J877018K061425K180428K359159K642501K923366
14276E3956744L310462L580537L800111L985487M029741M476831N406927O755445
14268H9302285Q301088R756706J1185575J2712417J3949082J3390308N971755
14261A64569216j8506309o2278551j04983859j05643836l5234518R973767J7581052
14254a34523038J5680031J2943612J0475562Q651201P462680O407621N423979
$$ plain form
14310 18553359 18939496 19287871 19654109 20125180 20608435 21027375 21490481 21957897 22389418
14301 22389418 22791889 23286794 23855275 24504242 25098003 25714862 26437656 27273242 28155456
14292 28155456 28998749 29911413 30862457 31938252 33104425 34253572 35482870 36866618
14284 36866618 38286547 39912847 41789865 43851290 46031718 48390877 51033378 53956744
14276 53956744 57267206 60847743 64647854 68633341 72663082 77139913 82546840 89302285
14268 89302285 97603373 107360079 118545654 131258071 145207153 158597461 164569216
14261 164569216 146062907 83784356 -21199503 -126843339 -162077857 -152104090 -134523038
14254 -134523038 -118843007 -105899395 -95423833 -86772632 -79309952 -72902331 -67478352
14247f7478352M510498L648839L138491K723257K441340K501106K561224K330713
14239d3622884K029319J833507J705250J573565J388605J252259J168832J071838
14231c1599709R26520Q40290P81892O32560L99730M3082o4397R47J11999K57581
14221b7669505L43388M78940M22782M41062M36316M62270M84456M24494M63594
14212b3712203M58555L59296L46881L56512L14185L67288L18578L03935L24204
14203b0562769M30323M44769L79658L50327L35814K42544K18262K71545L18970
14194a7570557K31585K86423K87230K33854K48235K23999J57081J72413K11464
14185a5518273K53214K10795K11379K03370K78022K72956J88879K08302K05889
$$ plain form
14247 -67478352 -62967854 -59319015 -56180524 -53457267 -51015927 -48514821 -45953597 -43622884
14239 -43622884 -41593565 -39760058 -38054808 -36481243 -35092638 -33840379 -32671547 -31599709
14231 -31599709 -30673189 -29832899 -29051007 -28418447 -28018717 -27975635 -28040032 -28039085 -27927086 -27669505
14221 -27669505 -27326117 -26847177 -26424395 -25983333 -25547017 -25084747 -24600291 -24175797 -23712203
14212 -23712203 -23253648 -22894352 -22547471 -22190959 -21876774 -21509486 -21190908 -20886973 -20562769
14203 -20562769 -20132446 -19687677 -19308019 -18957692 -18621878 -18379334 -18161072 -17889527 -17570557
14194 -17570557 -17338972 -17052549 -16765319 -16531465 -16283230 -16059231 -15902150 -15729737 -15518273
14185 -15518273 -15265059 -15054264 -14842885 -14639515 -14361493 -14088537 -13899658 -13691356 -13485467
14176a3485467J62427J05546J17037J44421K52623K12987K06795J19709J17985
14167a2045937J28844J45458J83738Q9987N6970J53503J08375Q1803K10251J71324
14157a0715684R8280J45432J13668R1305J38227P1527J18762J11557O3358Q4101
14147i679467J12865J28012J38172J33827Q8418M1698L4226N1955Q8569L6041
14137h825684N5771O9886J9000L2770O2505R5902N7016K8161J03481L9665Q0016
14126h181511J65724M4802J3173L9726J00983J67756J24144P1005N8383N3827
14116g341988q434K119K1770O1457Q0175N5578K0120R1458R6922N8654N5723J6990
14104f789456J9408N6475Q8642P1448O6028O6061J00503K6809k1133L7671J17434
$$ plain form
14176 -13485467 -13323040 -13217494 -13100457 -12956036 -12703413 -12490426 -12283631 -12163922 -12045937
14167 -12045937 -11917093 -11771635 -11587897 -11497910 -11440940 -11287437 -11179062 -11097259 -10887008 -10715684
14157 -10715684 -10617404 -10471972 -10358304 -10266999 -10128772 -10057245 -9938483 -9826926 -9763568 -9679467
14147 -9679467 -9566602 -9438590 -9300418 -9166591 -9078173 -9036475 -9002249 -8950294 -8861725 -8825684
14137 -8825684 -8769913 -8700027 -8681027 -8648257 -8585752 -8489850 -8432834 -8404673 -8301192 -8261527 -8181511
14126 -8181511 -8015787 -7970985 -7957812 -7918086 -7817103 -7649347 -7525203 -7454198 -7395815 -7341988
14116 -7341988 -7350422 -7348303 -7326533 -7265076 -7184901 -7129323 -7109203 -7017745 -6920823 -6862169 -6806446 -6789456
14104 -6789456 -6770048 -6713573 -6624931 -6553483 -6487455 -6421394 -6320891 -6294082 -6315215 -6277544 -6160110
14093f160110N8842r706j124K6552M3060M7102l5127J3331p040M0380O2822J0457
14081e910561R0595O4058M3774k1437J4819j083k833J1494K7785N7061P676p6465
14069e695117m540R0369J15142Q6075J27414M4913p7197q9430J8688O7538N5516
14058e260629K5331M2561M1443k8651O7968P8755N2293K5858K6186J0624K4979
14047d893282O5631J25514p5384n3602L0991P0524Q0023N6173o996j744l6607
14036d638759j16563j03778j988K2234R9231M5923m98J8967K0870J13594P3658
14025d467109k5612l813O3819M4522m542n0487k6760j1150J9656M1694L1809L5218
14013d352755J06320K0859k3979K6447L2325l9475r546N646l528L2430O901J8533
$$ plain form
14093 -6160110 -6101268 -6110974 -6112098 -6085546 -6042486 -5995384 -6030511 -6017180 -6024220 -5983840 -5921018 -5910561
14081 -5910561 -5819966 -5755908 -5712134 -5733571 -5718752 -5719835 -5722668 -5711174 -5683389 -5626328 -5618652 -5695117
14069 -5695117 -5699657 -5609288 -5494146 -5408071 -5280657 -5235744 -5312941 -5402371 -5383683 -5316145 -5260629
14058 -5260629 -5235298 -5192737 -5151294 -5179945 -5111977 -5033222 -4980929 -4955071 -4928885 -4918261 -4893282
14047 -4893282 -4827651 -4702137 -4777521 -4831123 -4800132 -4729608 -4649585 -4593412 -4600408 -4602152 -4638759
14036 -4638759 -4755322 -4859100 -4861088 -4838854 -4739623 -4693700 -4694198 -4675231 -4654361 -4540767 -4467109
14025 -4467109 -4492721 -4496534 -4432715 -4388193 -4392735 -4443222 -4469982 -4481132 -4461476 -4419782 -4387973 -4352755
14013 -4352755 -4246435 -4225576 -4249555 -4223108 -4190783 -4230258 -4239804 -4234158 -4237686 -4205256 -4198355 -4179822
14001d179822M2239O2016J7758j0135N1907P7103k3877J4511Q2675J598q0476
13990c944503K0331k812k3647J091M5737M8062L452K0822M4178J2997J9438K6518
13978c728336N1335K4303K2973N4083O051j1030Q480M5396K9613l3759n093k3512
13966c559496M583l124M6543J0760L6515K6297k4883j5039M4712J8509m2530P4301
13954c382852Q8380R8708k5170k2582R1627O8667l5211k5870k8006k9879j4159
13943c216347k5981O6549J3160l222N2548J0381m4657l2627j2138L9680L1903
13932c120751q500M3285O8746L6808K0398j9380o0684K1999P1376l1996R903J8004
13920b950792J8110P137m4959J4160P16O450P106K8696J7618n9341l719L8332
$$ plain form
14001 -4179822 -4137583 -4075567 -4057809 -4067944 -4016037 -3938934 -3962811 -3948300 -3865625 -3864027 -3944503
13990 -3944503 -3924172 -3926984 -3950631 -3949540 -3903803 -3855741 -3852289 -3831467 -3787289 -3774292 -3754854 -3728336
13978 -3728336 -3677001 -3652698 -3629725 -3575642 -3569591 -3580621 -3572141 -3526745 -3497132 -3530891 -3535984 -3559496
13966 -3559496 -3554913 -3558037 -3511494 -3500734 -3464219 -3437922 -3462805 -3477844 -3433132 -3414623 -3457153 -3382852
13954 -3382852 -3294472 -3195764 -3220934 -3243516 -3151889 -3083222 -3118433 -3144303 -3172309 -3202188 -3216347
13943 -3216347 -3242328 -3175779 -3162619 -3165841 -3113293 -3102912 -3147569 -3180196 -3192334 -3152654 -3120751
13932 -3120751 -3129251 -3085966 -3017220 -2980412 -2960014 -2979394 -3040078 -3018079 -2946703 -2978699 -2968796 -2950792
13920 -2950792 -2932682 -2925545 -2970504 -2956344 -2955628 -2949178 -2942072 -2913376 -2895758 -2955099 -2958818 -2920486
13908b920486n455J4631K0569Q0184N755l5636m3068j7503N4248M9963J20M6994
13896b749684N1604O34j4538K4263K6727J7413j0527k8741Q0603O2297k1640K173
13884b559416L823m6857l280M3438L0039J1357N8764O63k6802k7558J5430M8651
13872b451748K943r4508l5019j5005j8147O6341M3173k3594k488K1771p835N3406
13860b460710J678m3659k8398J6579O6081N9461k8988P867k185k0216J2967l7618
13848b457141o8588L9728P482O9397L5654k5147l8600k6901J4301L9149N7426
13837b353240J8163k2810m2564J9060l953k3817N6643N9737O1525L3175k8411
13826b226492j9587L5352m5805n0723j0227P0411k7256j1688P791N765N5566Q58
$$ plain form
13908 -2920486 -2925941 -2911310 -2890741 -2810557 -2804802 -2840438 -2883506 -2901009 -2846761 -2796798 -2796678 -2749684
13896 -2749684 -2698080 -2697446 -2711984 -2687721 -2660994 -2643581 -2654108 -2682849 -2602246 -2539949 -2561589 -2559416
13884 -2559416 -2555593 -2602450 -2605730 -2562292 -2532253 -2520896 -2462132 -2461469 -2488271 -2515829 -2500399 -2451748
13872 -2451748 -2448805 -2543313 -2578332 -2593337 -2611484 -2545143 -2501970 -2525564 -2528052 -2506281 -2514116 -2460710
13860 -2460710 -2459032 -2502691 -2531089 -2514510 -2448429 -2388968 -2417956 -2410089 -2412274 -2432490 -2419523 -2457141
13848 -2457141 -2525729 -2486001 -2478519 -2409122 -2373468 -2398615 -2437215 -2464116 -2449815 -2410666 -2353240
13837 -2353240 -2335077 -2357887 -2400451 -2381391 -2385344 -2409161 -2352518 -2292781 -2231256 -2198081 -2226492
13826 -2226492 -2246079 -2210727 -2256532 -2307255 -2317482 -2247071 -2274327 -2286015 -2278224 -2272459 -2216893 -2216035
13814b216035J0543K7887L0082P1156Q528K0779k3412n668K0115l701j1590j1114
13802b082430J0225N7230M6104M4046j120l8885l0105m1673l2907L0604N0663
13791a988248K3612K0917O3720Q2823J6153n0109K2760M9886N3899j6088R419
13780a711256R8487P4996P9982P9826R2050L1105j80654l43073m40143m18780
13770b637460j08872q214M2838L6633Q0446J30062O7739m2738R929P5116O6203
13759b288318M2400k8592j2728J7091K8306n0970l4286L3885N5592q752K3260
13748b223112M7440O7783k3407n956P8788l0684K4997J4219L5675K6367O540K3164
13736a958186k7771o3315N21K7186P677M4186n659k3863K733K051M2701k2598
$$ plain form
13814 -2216035 -2205492 -2177605 -2147523 -2076367 -2067839 -2047060 -2070472 -2076140 -2056025 -2059726 -2071316 -2082430
13802 -2082430 -2072205 -2014975 -1968871 -1924825 -1925945 -1964830 -1994935 -2036608 -2069515 -2038911 -1988248
13791 -1988248 -1964636 -1943719 -1879999 -1797176 -1781023 -1831132 -1808372 -1758486 -1704587 -1720675 -1711256
13780 -1711256 -1612769 -1537773 -1457791 -1377965 -1285915 -1254810 -1435464 -1778537 -2218680 -2637460
13770 -2637460 -2746332 -2754546 -2711708 -2675075 -2594629 -2464567 -2396828 -2439566 -2429637 -2354521 -2288318
13759 -2288318 -2245918 -2274510 -2287238 -2270147 -2241841 -2292811 -2327097 -2293212 -2237620 -2246372 -2223112
13748 -2223112 -2175672 -2107889 -2131296 -2137252 -2058464 -2089148 -2064151 -2049932 -2014257 -1987890 -1981350 -1958186
13736 -1958186 -1985957 -2049272 -2048751 -2021565 -2013888 -1969702 -1975361 -1999224 -1996491 -1994440 -1951739 -1974337
13724a974337K3102L0611j2225m8423M8565o668j9586m681k558k1213L543J6198
13712a967672K6159M3329O3004L1124n9077q995k6763L3812O6232M3477L2321
13701a723049J3669J4157j6947k1753q1820p4029K6716M4298L0580k7884j1270
13690a827332O1469N5490K1914k3313n510N0474M7292q1928k2733J8196N113K6988
13678a673880m1641k8435L4233K1018J3212n542j6162O767k9785K086L5718j7430
13666a699841K258L4022J0196L2975L3960n2836L4293J754j8925J758n5099K0379
13654a655106Q2340J9454q301J9356O665n526m0396P939K8353J694j9216O499
13642a556245k9057J1573N7590m519k3668k9834k3422J3028o607L5714M3742n4880
$$ plain form
13724 -1974337 -1951235 -1920624 -1932849 -1981272 -1932707 -1939375 -1958961 -1963642 -1966200 -1987413 -1983870 -1967672
13712 -1967672 -1941513 -1898184 -1835180 -1804056 -1863133 -1872128 -1898891 -1865079 -1798847 -1755370 -1723049
13701 -1723049 -1709380 -1695223 -1712170 -1733923 -1815743 -1889772 -1863056 -1818758 -1788178 -1816062 -1827332
13690 -1827332 -1765863 -1710373 -1688459 -1711772 -1717282 -1666808 -1619516 -1701444 -1724177 -1705981 -1700868 -1673880
13678 -1673880 -1715521 -1743956 -1709723 -1688705 -1675493 -1681035 -1697197 -1690430 -1720215 -1718129 -1682411 -1699841
13666 -1699841 -1697583 -1663561 -1653365 -1620390 -1586430 -1639266 -1604973 -1603219 -1622144 -1620386 -1675485 -1655106
13654 -1655106 -1572766 -1553312 -1561613 -1542257 -1535592 -1541118 -1581514 -1573575 -1545222 -1543528 -1562744 -1556245
13642 -1556245 -1585302 -1573729 -1516139 -1520658 -1544326 -1574160 -1597582 -1584554 -1591161 -1555447 -1511705 -1566585
13630a566585m217m441L271J3928l2937j4239K5378l6362m46L9899K6077K86r96
13617a551384m8089l1452l201J1275j5250k369M9071N2162L1680J4973l2904o008
13605a531496l0858K5265M3606K6376l7384k8402K683l728M0295K904k5325j8597
13593a534661J8542K2475M6736K1518j6695L1473q835k1022N3596j2122j5955
13582a414950J5796M6266M01j8815k1069n0699l2638K5454O403K0248K1663m3170
13570a445110r35J8173J0034J2040m734n5896L681M8150J3770O1264O8065k8320
13558a299818p6417J1946M5008m5009k4984R609J2355p9967N209J5633l944n228
13546a435607M4183J1301k2362L4055j1558N6761K6404q3659q9235N8377P5399
$$ plain form
13630 -1566585 -1570802 -1575243 -1571972 -1558044 -1590981 -1605220 -1579842 -1616204 -1616650 -1576751 -1550674 -1550388 -1551384
13617 -1551384 -1599473 -1630925 -1634126 -1622851 -1638101 -1640470 -1591399 -1539237 -1507557 -1492584 -1525488 -1531496
13605 -1531496 -1562354 -1537089 -1493483 -1467107 -1504491 -1532893 -1530210 -1533938 -1493643 -1490739 -1516064 -1534661
13593 -1534661 -1516119 -1493644 -1446908 -1425390 -1442085 -1410612 -1419447 -1440469 -1386873 -1398995 -1414950
13582 -1414950 -1399154 -1352888 -1352487 -1371302 -1392371 -1443070 -1475708 -1450254 -1443851 -1423603 -1401940 -1445110
13570 -1445110 -1446045 -1427872 -1417838 -1405798 -1410532 -1466428 -1462747 -1414597 -1400827 -1339563 -1271498 -1299818
13558 -1299818 -1376235 -1364289 -1319281 -1364290 -1389274 -1379665 -1367310 -1447277 -1442068 -1426435 -1430379 -1435607
13546 -1435607 -1391424 -1380123 -1402485 -1368430 -1379988 -1323227 -1296823 -1380482 -1469717 -1411340 -1335941
13535a335941P4943l6067o6555M2529L6805k2792r300Q3160L5695m0938j8174
13524a256635k3567J3406m129k3175p6464N287K3007K9151M6311J2971R305k2680
13512a267212Q11r898m0108j0266J2385l0310O2034k779J5181L0632k9352m0414
13500a309296l7894J2873K8914N8711Q1757j0243J0050l3078k9451j8919j1136
13489a257712n648l975k09J0427L8833K3016m3358o391N2333N172n4734K6336
13477a215910M4419R164k6221J6605J3376k0651J1071K6933N5426N7063L586k5974
13465a051113m9888k2518n7032k0817N7375L3621L2188J9428j974l5261M9992
13454a045999j9870o0954M241j318J606K4887K2105l1090k6579J7457L0263N4322
$$ plain form
13535 -1335941 -1260998 -1297065 -1363620 -1321091 -1284286 -1307078 -1316378 -1233218 -1197523 -1238461 -1256635
13524 -1256635 -1280202 -1266796 -1270925 -1294100 -1370564 -1365277 -1342270 -1313119 -1266808 -1253837 -1244532 -1267212
13512 -1267212 -1266401 -1276299 -1316407 -1326673 -1314288 -1344598 -1282564 -1285343 -1270162 -1239530 -1268882 -1309296
13500 -1309296 -1347190 -1334317 -1305403 -1246692 -1164935 -1175178 -1165128 -1198206 -1227657 -1246576 -1257712
13489 -1257712 -1263360 -1267335 -1267544 -1257117 -1218284 -1195268 -1238626 -1245017 -1192684 -1187512 -1242246 -1215910
13477 -1215910 -1171491 -1162327 -1188548 -1171943 -1158567 -1179218 -1168147 -1141214 -1085788 -1028725 -1025139 -1051113
13465 -1051113 -1101001 -1123519 -1180551 -1201368 -1143993 -1110372 -1078184 -1058756 -1060730 -1095991 -1045999
13454 -1045999 -1065869 -1126823 -1122582 -1123900 -1122294 -1097407 -1075302 -1106392 -1132971 -1115514 -1085251 -1030929
13442a030929K8027j9774l7839j1232l0970M82l8421j9880L3094L2724O781j918
13430a089855P4826m6748O786k3713o9982m3703M7407O3729j1637q615k465L1972
13418a071998n8784m684l9296M7444P8467k317r554p018L9878J5386L0450Q921
13406i73105m2773J1354j6441J9000L794l3410n150l772q027j8359L2920N2247
13394i81722K0036K2572K7872l4709k6083m0243l8148O154Q29j2775Q51J965q799
13381a062200n0054J2954k1261L1953N5844R500j780L5845K4569Q963k0900p1400
13369a047967m9638M1366M3879P2027j9024m0331m6530L3989N0004L7368j5645
13358i40502o926j6716L6813k9478m745J4920k1273l236j6439k563K5792Q678
$$ plain form
13442 -1030929 -1002902 -1022676 -1060515 -1071747 -1102717 -1102235 -1140656 -1160536 -1127442 -1094718 -1087937 -1089855
13430 -1089855 -1015029 -1061777 -1054991 -1078704 -1148686 -1192389 -1144982 -1081253 -1092890 -1101505 -1103970 -1071998
13418 -1071998 -1130782 -1135466 -1174762 -1127318 -1048851 -1051168 -1060722 -1067740 -1027862 -1012476 -982026 -973105
13406 -973105 -1015878 -1004524 -1020965 -1001965 -998171 -1031581 -1036731 -1040503 -1048530 -1066889 -1033969 -981722
13394 -981722 -961686 -939114 -911242 -945951 -972034 -1012277 -1050425 -1044271 -1043442 -1056217 -1055366 -1053401 -1062200
13381 -1062200 -1112254 -1099300 -1120561 -1088608 -1032764 -1023264 -1025044 -989199 -964630 -955667 -976567 -1047967
13369 -1047967 -1097605 -1056239 -1012360 -940333 -959357 -999688 -1046218 -1012229 -962225 -924857 -940502
13358 -940502 -947428 -964144 -927331 -956809 -961554 -946634 -967907 -971143 -987582 -990145 -964353 -955675
13346i55675J5916j2456J032j0663L4903m8634J480K5653R99J6974l2172n160
13334i67803K597o862J6750L5933j7131k2372L0466J0244J0044K8968o711k8903
13322i14780o5004l3281N1060J4294L1221M3763J7722k0181J7285M329l1791J9372
13310h65991J4301k4468j8758k2611k8859j2276M0869P596M4459J3263j3672p649
13298h73796j2877L040j2313j2070J616k2065J1351M8283m5808l9222Q632L1561
13286i13668O8431j2652r3544m7461K3430L9448J2848M0779O290J9742Q5966n8792
13274h29183J8135M524L285J5487k1440l4529K6234k398R364k630m2535o483L1490
13261h30679j1197j8067K0291K6560p148o3669p650K0365q306L8887L3822j4963
$$ plain form
13346 -955675 -939759 -952215 -951183 -961846 -926943 -975577 -974097 -948444 -947445 -930471 -962643 -967803
13334 -967803 -965206 -972068 -955318 -919385 -936516 -958888 -928422 -918178 -908134 -879166 -885877 -914780
13322 -914780 -979784 -1013065 -962005 -947711 -916490 -872727 -855005 -875186 -857901 -853572 -885363 -865991
13310 -865991 -851690 -876158 -894916 -917527 -946386 -958662 -917793 -910197 -865738 -852475 -866147 -873796
13298 -873796 -886673 -883633 -895946 -908016 -906400 -928465 -917114 -868831 -914639 -953861 -945229 -913668
13286 -913668 -845237 -857889 -951433 -998894 -975464 -936016 -923168 -882389 -876099 -856357 -770391 -829183
13274 -829183 -811048 -806524 -803239 -787752 -809192 -843721 -817487 -819885 -810521 -813151 -855686 -862169 -830679
13261 -830679 -841876 -859943 -839652 -813092 -820240 -883909 -891559 -871194 -879500 -840613 -806791 -821754
13249h21754L248L7804m3502j1264K9249L800q035l9410P376j906j8075N6114
13237h06355J2698M1668M4354q059j6287L7374m0745k8729p9594J476M8881N4224
13225g39094j9369p6182N6324N6271j1863l4123Q7189l2679p2362k6516M5326
13214g67078J5957j1924j9396p700L6596K8583J2930J8285k9044l097o505o748
13202g39141j0625Q020P812M1762L1510p843j5993O6782k9616j5087J4068j1472
13190f59823l9083m0737Q841r045j9500J6676N0331j4778m4258o438r641j0553
13178g78008K5265L2780K1415N531m4033K5256J3118J6012N5164m0389m374J395
13166f70868r217K2599j8946k9016J7030p045Q7918P812p7946o4914m129R2001
$$ plain form
13249 -821754 -818506 -780702 -824204 -835468 -806219 -802419 -810454 -849864 -842488 -844394 -862469 -806355
13237 -806355 -793657 -751989 -707635 -715694 -731981 -694607 -735352 -764081 -843675 -842199 -793318 -739094
13225 -739094 -758463 -834645 -778321 -722050 -733913 -768036 -680847 -713526 -785888 -812404 -767078
13214 -767078 -751121 -763045 -782441 -790141 -753545 -724962 -712032 -693747 -722791 -725888 -732393 -739141
13202 -739141 -749766 -741746 -733934 -692172 -660662 -668505 -684498 -617716 -647332 -662419 -648351 -659823
13190 -659823 -698906 -739643 -730802 -739847 -759347 -742671 -692340 -707118 -751376 -757814 -767455 -778008
13178 -778008 -752743 -719963 -698548 -693017 -737050 -711794 -698676 -682664 -627500 -667889 -672263 -670868
13166 -670868 -680085 -657486 -676432 -705448 -688418 -695463 -607545 -599733 -677679 -742593 -746722 -654721
13154f54721N5504q305n3055k0063q0678o8966J3938N8091k142P980Q184R327
13142g34906O6689M6869J461M3002J0570j8743L5225k4648k5941J4526j7842J3231
13130e90507M5713l9540l062j5871L239r623j8680r08M2734Q5488J8499n5645
13118e38163r561L2554o4169l0897n028l0660j8104j388k5199p0661J4131P945
13106g39200J6475k7491l0916K9858M1471M4204M8228j4950N320L8527J0035L0269
13094e48170M9458l1666n9841L6075J7727j01158k6668Q6186K980n3251o7704
13083f96032M11L6482q897J7550M8641O4869l2960m9483N0662j2911l8139o4349
13071f84156M0503L297k7089k7543M7556N2313J7423j570R577K1619m508K9374
$$ plain form
13154 -654721 -599217 -607522 -660577 -680640 -761318 -830284 -816346 -758255 -760397 -752417 -744233 -734906
13142 -734906 -668217 -621348 -619887 -576885 -566315 -585058 -549833 -574481 -600422 -585896 -603738 -590507
13130 -590507 -544794 -584334 -587396 -603267 -600028 -609651 -628331 -629239 -586505 -501017 -482518 -538163
13118 -538163 -547724 -515170 -579339 -610236 -615264 -645924 -664028 -665416 -690615 -761276 -747145 -739200
13106 -739200 -722725 -750216 -781132 -751274 -709803 -665599 -617371 -632321 -627001 -588474 -578439 -548170
13094 -548170 -498712 -530378 -590219 -554144 -536417 -637575 -664243 -578057 -575077 -628328 -696032
13083 -696032 -695621 -659139 -668036 -650486 -601845 -536976 -569936 -619419 -568757 -581668 -619807 -684156
13071 -684156 -643653 -640356 -667445 -694988 -647432 -595119 -577696 -579266 -569689 -548070 -552578 -523204
13059e23204m7229J5575O1624l54j0768M329j9105j3709K3477J4598m2106m3616
13047e80488r304J9748j1505q406N6163K9748l9280l7182k1759o486j1607J7010
13035f03348n496J0102L3554j7683K4812J3528M38l291J557r936L481l3655p9265
13022f65202M2545Q0341N079p259K7591M2207l2736L5265L4431k5370l1034k028
13010d96170j0290L3195M4498k4336m2490r329m524L255l596l8526j9296n811
12998e73420J2259J8917J806K0780L0124J0471k3353L982K6892J3796j2273k6584
12986d96603k9752m2166R209O837M5523l990K8803l5601K2281L1795n6032o4205
12974e83901L1559L7630J6588r413m2806K4327L9211R8142l4041j18552q3645
$$ plain form
13059 -523204 -570433 -554858 -493234 -493588 -504356 -500027 -519132 -532841 -509364 -494766 -536872 -580488
13047 -580488 -589792 -570044 -581549 -589955 -533792 -504044 -543324 -580506 -602265 -608751 -620358 -603348
13035 -603348 -608844 -598742 -565188 -582871 -558059 -544531 -544093 -547384 -545827 -555763 -552282 -585937 -665202
13022 -665202 -622657 -542316 -537237 -544496 -516905 -474698 -507434 -472169 -437738 -463108 -494142 -496170
13010 -496170 -506460 -473265 -428767 -453103 -495593 -504922 -509446 -506191 -509787 -548313 -567609 -573420
12998 -573420 -561161 -542244 -540438 -519658 -489534 -479063 -502416 -498434 -471542 -457746 -470019 -496603
12986 -496603 -526355 -568521 -559312 -552475 -506952 -510942 -482139 -517740 -495459 -463664 -519696 -583901
12974 -583901 -552342 -514712 -498124 -507537 -550343 -526016 -486805 -388663 -422704 -541256 -624901
12963f24901L6497J04100Q5780k6549m5664l2277j7439k7023L6940l8015j6170
12952e64721J7152p9K5408K8200R904M8989K859r147K6305L2523j1853L8632n6720
12939d12548j06109m2292m98N5089K8750n7471O1090l5422l7227k0308P6806n9558
12927e49698l3803K0929M768l0984K805N3230K5660J394k0347j3792k7935l1084
12915e98857M0754M3614O8752R215j7170k213L4252K205o6766k0647k5556L1961
12903e00456L1390k4725p307J8596N7322J403L1681n75K841J8986l8392m0371
12891d49607L3322K7768j8195k8845o576Q111m582j2617K7992J1984K5801O8971
12879c16473J2719j6492p5253j7687M0195N3895K6627m9740j241p5815M676P545
$$ plain form
12963 -624901 -588404 -484304 -398524 -425073 -470737 -503014 -520453 -547476 -510536 -548551 -564721
12952 -564721 -547569 -547648 -522240 -494040 -484136 -435147 -432288 -441435 -415130 -382607 -394460 -355828 -412548
12939 -412548 -518657 -560949 -561447 -506358 -477608 -535079 -473989 -509411 -546638 -566946 -490140 -549698
12927 -549698 -583501 -562572 -557804 -588788 -585983 -532753 -507093 -505699 -526046 -539838 -567773 -598857
12915 -598857 -558103 -514489 -445737 -436522 -453692 -455905 -421653 -419448 -486214 -506861 -532417 -500456
12903 -500456 -469066 -493791 -501098 -482502 -425180 -423777 -392096 -392671 -389830 -370844 -409236 -449607
12891 -449607 -416285 -388517 -406712 -435557 -442133 -434022 -438604 -451221 -423229 -411245 -385444 -316473
12879 -316473 -303754 -320246 -395499 -413186 -372991 -319096 -292469 -342209 -343450 -419265 -414589 -407044
12867d07044m5843j9380N7428N4471n010m162K3993n3024j8531j2853l4409J6565
12855d47799L2940L0183j9436n0476M6928n612L1589Q082j8976K1363m11n368
12843c76993o372l472M0334j6895k3918M2503N7619o2444o3726N726L1073M7317
12831c29248K3139k127J1735n5156n5044L9147L6047l2697o419L4604K3390L587
12819c09042j2641n8544R316K3760M2923j3370k532O8726J1065r3137l1553j083
12807c66112j8875L3350J3716M3933P3936j225m9525k6140J8765l5645k4734J8696
12795c19860j4962l1000l0498K6950k4215M9327L4543m1186J8935O2386K8682
12784b40898m6591m0020n889N735Q8614J820j11660k4199L4971K8342k8376l2577
$$ plain form
12867 -407044 -452887 -472267 -414839 -360368 -365378 -369540 -345547 -398571 -417102 -429955 -464364 -447799
12855 -447799 -414859 -384676 -404112 -454588 -407660 -413272 -381683 -373601 -392577 -371214 -371625 -376993
12843 -376993 -383365 -386837 -346503 -363398 -387316 -344813 -287194 -349638 -413364 -407638 -376565 -329248
12831 -329248 -306109 -308236 -296501 -351657 -406701 -367554 -331507 -364204 -370623 -336019 -312629 -309042
12819 -309042 -321683 -380227 -370911 -347151 -304228 -317598 -320130 -251404 -240339 -333476 -365029 -366112
12807 -366112 -384987 -351637 -337921 -293988 -220052 -221277 -270802 -296942 -278177 -313822 -338556 -319860
12795 -319860 -334822 -365822 -396320 -369370 -393585 -344258 -309715 -350901 -331966 -269580 -240898
12784 -240898 -287489 -327509 -333398 -327663 -239049 -237229 -348889 -373088 -338117 -309775 -338151 -370728
12772c70728M2741K9272J2941M6629k0892j5235l032k4879k9204K6405K6141K0664
12760b59177j7410m7894J2292L9101K6549L5644o2193K05K6049Q2200Q2115l1727
12748a14246k5854K8105l0298n7240n0499j6069L5144N9433l1621o6812m0007
12737c09964N1051P6510r614k8550l6764L5662L6320r0867k8465O9783O7343L865
12725a63690o2428m4966M8122j4840k7584J1192J3443M530j5693j1030J4935K898
12713b45111m4466M955K5091k6324k140J5451M8808K5729J2345l9384J036l547
12701b27557j5819k5548j8844L8478N6702l14J7327m7190r878m016j5647J0426
12689b41880o464l692K6891l4196N7395O027J5295k4087k6390n750k4100j0535
$$ plain form
12772 -370728 -327987 -298715 -285774 -239145 -260037 -275272 -278304 -303183 -332387 -305982 -279841 -259177
12760 -259177 -276587 -324481 -312189 -273088 -246539 -210895 -273088 -272883 -246834 -164634 -82519 -114246
12748 -114246 -140100 -111995 -142293 -199533 -250032 -266101 -230957 -171524 -203145 -269957 -309964
12737 -309964 -258913 -182403 -192017 -220567 -257331 -221669 -185349 -276216 -304681 -234898 -167555 -163690
12725 -163690 -226118 -271084 -222962 -237802 -265386 -254194 -240751 -236221 -251914 -262944 -248009 -245111
12713 -245111 -289577 -284622 -259531 -285855 -287995 -272544 -223736 -198007 -185662 -225046 -224010 -227557
12701 -227557 -243376 -268924 -287768 -249290 -192588 -192902 -175575 -222765 -232643 -236659 -252306 -241880
12689 -241880 -248344 -252036 -225145 -259341 -201946 -195919 -180624 -204711 -231101 -236851 -260951 -271486
12677b71486L5489L0781k5725r586j4894j2404Q0935m901k9039P9296O3154k0199
12665i8579j7780j6021k9270m2364k1549p670o450L6013r47l1059L4118m0235
12653b41793p1896K4287L9099m582l6749j2087O8310K7937K3034M970P126j16
12641a72460q771K3686O6052l0043j12511o9647L2223L6985k1911L3266L9015
12630a84116K8363K5572l2083j8388J6537J4802j4865l0025p217j0799k6458L7156
12618b01521Q1240O972J0680Q638J2081j0028n025l2012p110j6768M654R409q698
12605a47488J8866j8820l3293l3726K4277k298K4314j2999J0226M7878K0111k3338
12593a26290M330l7800j3730N4962J0239J5286K7130k2644j6450K0300n3883j0323
$$ plain form
12677 -271486 -235997 -205216 -230941 -240527 -255421 -267825 -186890 -191791 -220830 -141534 -78380 -98579
12665 -98579 -116359 -132380 -161650 -204014 -225563 -233233 -239683 -203670 -204617 -235676 -201558 -241793
12653 -241793 -313689 -289402 -250303 -254885 -291634 -303721 -235411 -207474 -184440 -179470 -172344 -172460
12641 -172460 -181231 -157545 -91493 -121536 -234047 -303694 -271471 -234486 -256397 -223131 -184116
12630 -184116 -155753 -130181 -162264 -180652 -164115 -149313 -164178 -194203 -201420 -212219 -238677 -201521
12618 -201521 -120281 -113309 -102629 -93991 -81910 -91938 -96963 -128975 -136085 -152853 -148199 -138790 -147488
12605 -147488 -128622 -147442 -180735 -214461 -190184 -192482 -168168 -181167 -170941 -123063 -102952 -126290
12593 -126290 -121960 -159760 -173490 -118528 -108289 -93003 -65873 -88517 -104967 -84667 -138550 -148873
12581a48873j4198k4875P4768Q7520k790k2988l1533k5385j6706L8205m0287n6760
12569a83902k5378M8155L7601k2747l382N60K3348K8293J0720J2925n8212R706
12557a22313K4587l4295m518J3548M788m9651m061Q189O119L9359J9111L5462
12545f3675J3610K4423n5140k6362p087J5239J2048N4984J0354R610k3375m8913
12533h4284l2591r847n554j3716O816M1419K9551K0005L8090K2631k4681J2632
12521D71J1940j0670j5615M0k4375k425N5271l5858m3162K7794J6652p240O893
12508b0284K0974q431J5445n985K452l5831r5742l563J5065l0036o945L5177J910
12495a15794J9994P947j8108j8728j7088J9258P966K9862O867M4153K2212m3327
$$ plain form
12581 -148873 -163071 -187946 -113178 -25658 -28448 -51436 -82969 -108354 -125060 -86855 -127142 -183902
12569 -183902 -209280 -161125 -123524 -146271 -149653 -149093 -125745 -97452 -86732 -73807 -132019 -122313
12557 -122313 -97726 -132021 -136539 -122991 -118203 -167854 -171915 -163726 -157607 -118248 -99137 -63675
12545 -63675 -50065 -25642 -80782 -107144 -114231 -98992 -86944 -31960 -21606 -11996 -35371 -84284
12533 -84284 -116875 -126722 -132276 -145992 -139176 -97757 -68206 -48201 -10111 12520 -12161 471
12521 471 12411 1741 -13874 -13834 -38209 -40634 14637 -21221 -64383 -36589 -19937 -27177 -20284
12508 -20284 690 -7741 7704 1719 4171 -31660 -127402 -130965 -115900 -145936 -152881 -117704 -115794
12495 -115794 -95800 -87853 -105961 -124689 -141777 -122519 -114553 -84691 -77824 -33671 -11459 -54786
12483e4786K7286P0154k6305k5402l269j3769j4392m0810k9157l9399p1259Q841
12471b12267J00241K8329K7928O5055K2482J2749l6073k9446M7100O052K555k074
12459C2631L6761J3334k1987J999m7011r6696L0744O3682p177l314p3123m1069
12447a11226k474N759Q3137M0998L5560M1816j4856N9910L758n9338q08J556M189
12434H7981K0811j6834j8798J0616J4261m6218k0129r631l7883m1446O346M0912
12422a0012O1187O1299L0333l5296n7658N224L976j2297l702P746o431m601K2919
12409F2687L531R638Q309L8117j3086K380k3036n8505J822M6440k176m4351n5640
12396b3870O90M2392N9981j3043l7853l3877k001n876l2083k4142K8437K7752
$$ plain form
12483 -54786 -27500 42654 16349 -9053 -12322 -26091 -40483 -81293 -110450 -149849 -221108 -212267
12471 -212267 -112026 -83697 -55769 9286 31768 44517 8444 -21002 26098 32150 34705 32631
12459 32631 69392 82726 60739 62738 15727 -80969 -50225 13457 6280 2966 -70157 -111226
12447 -111226 -113700 -107941 -24804 16194 51754 93570 78714 138624 142382 83044 82236 83792 87981
12434 87981 108792 91958 73160 83776 98037 51819 31690 22059 -15824 -57270 -50924 -10012
12422 -10012 51175 112474 142807 107511 49853 55077 59053 46756 43054 50800 44369 39768 62687
12409 62687 66218 75856 84165 122282 109196 111576 88540 30035 31857 78297 76121 31770 -23870
12396 -23870 -23180 19212 79193 66150 28297 -5580 -7581 -13457 -45540 -69682 -41245 -13493
12384a3493L2623j5177K312j8013L8063M4266O4537k095l275m2735m5661m0624
12372G28j8206O4222j3576k465K045L962M273K3513J7696J1689q252m8658L8129
12359G5100K9632o451M3876J05J3166r726m3494K339P5268L3088j8525m3124n9630
12346I1624j8821j7231J7886m3703k6397N5569K4895j0704K7197P4901L1607n549
12334B01274r112j8996m6213J5246l1299N6062L7681m7932l4709n5187J9036O2591
12322A48442R863l0500K3816J0907j8910n7369j7050K5505M0649Q2606K1788o3038
12310A76709N199L9268k3407m0426k5478r743L4752m944r964k6322J2661k618
12298A25687j0518L573n1901J7784N6418r011L4642Q0878J693o9362n2224J1379
$$ plain form
12384 -13493 19130 3953 6265 -11748 26315 70581 135118 133023 129748 87013 41352 728
12372 728 -17478 46744 33168 30703 32748 36710 40983 64496 82192 93881 85629 36971 75100
12359 75100 104732 98281 142157 142262 155428 145702 102208 104547 179815 212903 194378 151254 91624
12346 91624 72803 55572 73458 29755 3358 58927 83822 73118 100315 175216 206823 201274
12334 201274 192162 173166 126953 142199 110900 166962 204643 156711 122002 66815 85851 148442
12322 148442 158305 127805 151621 162528 143618 86249 69199 94704 135353 217959 239747 176709
12310 176709 181908 221176 197769 157343 131865 122122 156874 151930 141966 115644 128305 125687
12298 125687 115169 118742 66841 84625 141043 132032 166674 247552 249245 179883 127659 139038
12286A39038k5176o7865R039N6523N0315j4902K3316P8078j7744p035J3596l3496
12274B03687n4872K3269R4898J3947n1485n7714q765L8875j7990q2923m4586Q1640
12262A37981N8985N5792M8590l990k4778m6786M1510J0872n0951p0042J9310K7134
12250B03627J7662O1301p849q767K3320J1197l6421k7840J4874m6942j726Q644
12238B11080n241L6575l631N1766k5804l0870J2542J7155j9428M2593N3573k1343
12226C18967p1065n8585J1831N8102J10521O0097m6831n8250l476K0117l0122
12215C11306l9181q9217l1404L8484N2426K1283L7049n0202n3574N176K3264R269
12203B34679q20p555k7834J0525M693j0874N4755K9972k1865n6046J12745L4608
$$ plain form
12286 139038 113862 45997 55036 111559 161874 146972 170288 248366 230622 223587 237183 203687
12274 203687 148815 172084 266982 280929 229444 171730 162965 201840 183850 100927 56341 137981
12262 137981 196966 252758 301348 297358 272580 225794 267304 278176 227225 157183 176493 203627
12250 203627 221289 282590 274741 265974 289294 300491 264070 236230 251104 204162 202436 211080
12238 211080 205839 242414 238783 290549 264745 233875 246417 263572 244144 286737 340310 318967
12226 318967 247902 189317 201148 259250 369771 429868 383037 324787 321311 341428 311306
12215 311306 272125 182908 151504 189988 242414 263697 300746 250544 196970 202146 225410 234679
12203 234679 233859 226304 198470 208995 213688 202814 257569 287541 265676 209630 322375 356983
12191C56983O586J3829m1877j0035M415p1645k6364J08824K8536l7200o4893J8546
12179B85705M0479J9463Q155O557k6210j5693l5090Q294M6942K0564J2318n3067
12167C18417o455j0962K4147Q916K6440l6087j0398M4534j8676R100j88K7751
12155C76539j0815l9663l888M9136k0133j3665k4620l8962M5850K715J1133j2206
12143C21421m4548j2248M7866J9914m2725J9209L0315K348K4817o827J4242m0094
12131C33690k6932l5770K5923K1772K2457J6172J9916j6536K2701N5338Q149r2087
12119C54793p4952l430O684j4326N3727J5278m5681j8620k5786O0649R684L3198
12107C51218K6033K4080J9435K9050m264J5686O613l2595n6037O749N1068O006
$$ plain form
12191 356983 363569 377398 335521 325486 329901 258256 231892 340716 369252 332052 267159 285705
12179 285705 326184 345647 353802 360359 334149 318456 283366 291660 338602 359166 371484 318417
12167 318417 311962 301000 325147 334063 360503 324416 314018 358552 339876 348976 348788 376539
12155 376539 365724 326061 322173 371309 351176 337511 312891 273929 319779 322494 333627 321421
12143 321421 276873 264625 312491 332405 289680 308889 339204 341552 366369 359542 373784 333690
12131 333690 306758 270988 296911 318683 341140 357312 377228 360692 383393 438731 446880 354793
12119 354793 279841 276411 283095 268769 322496 337774 292093 273473 247687 308336 318020 351218
12107 351218 377251 401331 420766 449816 445552 461238 467851 435256 379219 385968 437036 443042
12095D43042J7686m4373O89m2479j2764M3177o929k6827K0065K4152N7392K6074
12083D98905j2775n9609o1316j510M9237O1085J0206J4999L1883o1533p9922K9011
12071D18661J8469J294L5607j0452p1492J0871N1626K0906N0539k2147m7505Q675
12059D65052k723j1636K9640l2086N355p616k6404o515R354R577k4173L0264Q9217
12046E27306L6331O2181O492m5872m6329o1368k6611k1416K2654j6559M4870l59
12034D81320m3494M5509K6181N7309j1533j6082j8582j3291r396L5203J7473n3140
12022D97477N3062Q4362l0795k7691p139o22r13J4066K3567O343O189l1414j396
12009E85096n9130j2752N2739L0455J0614J4210m5815q2216j4794O3712M1324
$$ plain form
12095 443042 460728 416355 417044 374565 361801 404978 398049 371222 391287 415439 472831 498905
12083 498905 486130 426521 365205 363695 412932 474017 484223 499222 531105 469572 389650 418661
12071 418661 437130 438424 474031 463579 392087 402958 454584 475490 526029 503882 456377 465052
12059 465052 462329 450693 480333 448247 453602 445986 419582 413067 422421 431998 407825 438089 527306
12046 527306 563637 625818 632310 586438 540109 478741 452130 430714 453368 436809 481679 481320
12034 481320 437826 483335 509516 566825 555292 539210 520628 507337 497941 533144 550617 497477
12022 497477 550539 634901 604106 576415 569276 568654 567741 581807 605374 611717 617906 586492 585096
12009 585096 525966 513214 565953 596408 607022 621232 575417 493201 478407 542119 583443
11998E83443l4326l5727M1503K1348R744N0882j5636j8307K5448J6201K5706K9675
11986F99954l6097o7429j428L4885L5280l1317l4872Q112L2420L303r161J0745
11974F44395l6406m612L4028M072k2887k0417j666M8207r256m835l588j0690K2049
11961F38394K7862j2167N5592N1299o8439o3265m5917J3107p829Q1164J6031M1332
11949G27164Q760j3462q6655l3227K4447L9918J0361M5835r61k5736m9176j1239
11937F36029N906O255M7344M5895n4843J5353O0370j8579p049K8980K056P0427
11925H38144j3731j3973L961J1522J2964l7018k0728j5887o0514k2734L7235L3461
11913G52702m4889m6426L1931K1775N3452K5881M5540P0199L906k5017l4292J1006
$$ plain form
11998 583443 549117 513390 554893 576241 585985 636867 621231 602924 628372 644573 670279 699954
11986 699954 663857 596428 595000 629885 665165 633848 598976 607088 639508 642811 633650 644395
11974 644395 607989 603377 637405 641477 618590 598173 596507 644714 635458 630623 627035 616345 638394
11961 638394 666256 654089 709681 760980 692541 629276 583359 596466 588637 669801 685832 727164
11949 727164 735924 722462 635807 602580 627027 666945 677306 723141 722180 696444 647268 636029
11937 636029 641935 648190 695534 741429 686586 701939 762309 743730 736681 765661 767717 838144
11925 838144 824413 810440 814401 825923 838887 801869 781141 765254 704740 682006 719241 752702
11913 752702 707813 661387 693318 715093 768545 794426 839966 910165 914071 889054 854762 865768
11901H65768k4639p5155k5114m154k2495J6338J1472l9787K089j9911L2629Q382
11889G25423k055N8569N1981M7757K9972k0746J5622K3063l825K9045J288k7361
11877I28733l280L285o8206l7244l2145K6976M4767M8017k2514k4721L7491N4869
11865I56028l7645k5483Q7267Q9167J3098M131o9151p5801l059l8736m2003j091
11853H56722K9141k9478m4943M0996O3777P6796j8232m3683M1530N5792L0811
11842A059229m2153J9496N6474m886N1644k6508p931p6487p1675k1949m5616m167
11830H85471j5581L8946O976j8743l1953O2380L910O3224j2624m0415j3363O6920
11818I95148O836m5993M087K8689j7968n6033O5124L1484k8852M110J2376j534
$$ plain form
11901 865768 841129 765974 740860 736706 714211 730549 742021 702234 704323 684412 717041 725423
11889 725423 723368 781937 833918 881675 911647 890901 906523 929586 925761 954806 956094 928733
11877 928733 925453 928738 860532 823288 791143 818119 862886 910903 888389 863668 901159 956028
11865 956028 918383 892900 980167 1069334 1082432 1086563 1017412 941611 938552 899816 857813 856722
11853 856722 885863 856385 811442 852438 916215 993011 974779 931096 972626 1028418 1059229
11842 1059229 1017076 1036572 1093046 1088160 1139804 1113296 1105365 1028878 957203 935254 889638 885471
11830 885471 869890 908836 915812 897069 865116 927496 931406 994630 982006 941591 928228 995148
11818 995148 1001984 955991 960078 988767 970799 914766 979890 1011374 982522 986632 999008 997474
11806I97474O5115k982N6043l18n2224k7809O403j8765L9536m550N1505n205K5167
11793A129390J2192n94K4545P415j6145m2274K5703L0979J9079R7809p802q0789
11781A199508J2927K4894q1350o1193K158N585J721J1765R571m1292K923O4816
11769A152033M5307Q622L0940r250l2518K6743M6812j9698J5665j1801k8024j4725
11757A210106k6826K6493O130o1748J289M5922O6047L0516n8390J7198O0523R21
11745A318181q520o5691R056J7439L1953M1246L4873L8335l8289j19881m7975
11734A210727Q5235N1342K093K5875M8734m3703m1761J5638k2605P4383K0637
11723A426595K52k3683P951L3374M4108j1784m2958l282N656R499J1087q475o914
$$ plain form
11806 997474 1062589 1059607 1115650 1115332 1063108 1035299 1041702 1022937 1062473 1057923 1109428 1104223 1129390
11793 1129390 1141582 1140988 1165533 1172948 1156803 1114529 1140232 1171211 1190290 1288099 1280297 1199508
11781 1199508 1212435 1237329 1155979 1094786 1096944 1102529 1104250 1116015 1125586 1084294 1087217 1152033
11769 1152033 1197340 1205962 1236902 1227652 1195134 1221877 1268689 1248991 1264656 1252855 1224831 1210106
11757 1210106 1183280 1209773 1215903 1154155 1155444 1201366 1267413 1297929 1239539 1256737 1317260 1318181
11745 1318181 1309661 1243970 1253026 1270465 1302418 1343664 1378537 1416872 1378583 1258702 1210727
11734 1210727 1295962 1347304 1349397 1375272 1424006 1380303 1338542 1354180 1331575 1405958 1426595
11723 1426595 1426847 1403164 1411115 1444489 1488597 1476813 1433855 1430573 1436229 1445728 1456815 1448340 1441426
11710A441426q202J3934N5738L1447o035J1731k1697N2629J7893m6220o7726j0633
11698A464285j0149K8508j6842j9255N5628P6993N4712J516J4045j649M657J1250
11686A663699K196q200L350J7659M2800N5140N6414j6558r854l6071K2167J8985
11674A811727Q747j4491k9677r337N436K0507m4479k3884N2127L6723K8834k9356
11662A812877K1020K7924m8685m8091P1847O6830L4875L6660j6791l2848q6446
11651A839172j4792J3945L2742M8129J0790K6215M5628P5058j8207l1392l8826
11640A988462P837p736J4846m570j1131L7414o2J0846P6481L849l1966p3261j2020
11627A998989R7874M9919J02353M2179K9563n4930K4398J3374q1725N561n669
$$ plain form
11710 1441426 1433224 1447158 1502896 1534343 1528308 1540039 1518342 1570971 1588864 1542644 1474918 1464285
11698 1464285 1454136 1482644 1465802 1446547 1502175 1579168 1633880 1635396 1649441 1647792 1652449 1663699
11686 1663699 1665895 1657695 1661045 1678704 1721504 1776644 1833058 1816500 1806646 1770575 1792742 1811727
11674 1811727 1820474 1805983 1776306 1766969 1772405 1792912 1748433 1724549 1776676 1813399 1842233 1812877
11662 1812877 1833897 1861821 1813136 1765045 1836892 1903722 1938597 1975257 1958466 1925618 1839172
11651 1839172 1824380 1838325 1871067 1919196 1929986 1956201 2001829 2076887 2058680 2027288 1988462
11640 1988462 1996299 1988563 2003409 1998839 1987708 2025122 2025060 2035906 2112387 2116236 2084270 2011009 1998989
11627 1998989 2096863 2146782 2249135 2291314 2320877 2265947 2290345 2303719 2221994 2227555 2221886
11616B221886L5500L2184J2242N9718L5450j0124r71N4461K5493q648K5527N2371
11604B535089O727K8177L423l4827p870N734K5762L4978N0309O427Q280L8855
11592B701064m511k119K2610k180M6600L4541N5980R097L5730K0993n7543j4719
11580B845543J6201Q051K7010O662J724N8388K8607l4882M4472M5245J8924M2990
11568C108935M3912j1879K8311K6954k360m7156J3078P8898j0155O4512N5758
11557C348808L5364O1257L1528m3461J2943Q0710K7831O535R231K83J5669K3098
11545C609796N0943R5623M9937n3706m574K2199M5397P1709J9266R479K4272P5737
11533D016078k669O5007N3043L0699N8881K5927O9267N7757j0555k0860P078N3540
$$ plain form
11616 2221886 2257386 2289570 2301812 2361530 2396980 2386856 2385885 2440346 2465839 2457191 2482718 2535089
11604 2535089 2541816 2569993 2573416 2538589 2530719 2536453 2562215 2597193 2647502 2653929 2662209 2701064
11592 2701064 2696553 2694434 2717044 2714864 2761464 2796005 2851985 2861082 2896812 2917805 2860262 2845543
11580 2845543 2861744 2869795 2896805 2903467 2905191 2963579 2992186 2957304 3001776 3047021 3065945 3108935
11568 3108935 3152847 3140968 3169279 3196233 3193873 3146717 3159795 3238693 3228538 3293050 3348808
11557 3348808 3384172 3445429 3476957 3433496 3446439 3527149 3554980 3561515 3570746 3571029 3586698 3609796
11545 3609796 3660739 3756362 3806299 3752593 3748019 3770218 3815615 3887324 3906590 3916069 3940341 4016078
11533 4016078 4013409 4078416 4131459 4162158 4221039 4246966 4316233 4373990 4363435 4342575 4349653 4403193
11521D403193N9458M2367J4687R9700Q0763J9099k3774O8176P4865N3367M8639
11510D940540N2385M8587R3989L4601J7632O4215J04989P7904O7498R5779P1905
11499E670024J9251N6888J09404J17305O6667K4418J1512O9329O4947N8326J35628
11488F403699J46016Q5982r70O3296O3957J10646J15000P8627J25899N5241J16104
11477G363497J42807J30359M2890J28429J60630R7187R3517J18979J26523J08145
11467H512963Q5069J27535R7119R8213N0258O7689O7766J07525J25855Q8361J8696
11456I447049J9347L3425J6292M8187N1095k8128r6146p1176p5903j10302j09432
11445I124308r4386j76822j89438k24842k79333l03533k71841k83765l31911l69576
$$ plain form
11521 4403193 4462651 4505018 4519705 4619405 4700168 4719267 4695493 4763669 4838534 4891901 4940540
11510 4940540 4992925 5041512 5135501 5170102 5187734 5251949 5356938 5434842 5502340 5598119 5670024
11499 5670024 5689275 5746163 5855567 5972872 6039539 6063957 6075469 6144798 6209745 6268071 6403699
11488 6403699 6549715 6635697 6634727 6698023 6761980 6872626 6987626 7066253 7192152 7247393 7363497
11477 7363497 7506304 7636663 7679553 7807982 7968612 8065799 8159316 8278295 8404818 8512963
11467 8512963 8598032 8725567 8822686 8920899 8971157 9038846 9106612 9214137 9339992 9428353 9447049
11456 9447049 9466396 9499821 9516113 9564300 9615395 9587267 9491121 9419945 9344042 9233740 9124308
11445 9124308 9029922 8853100 8663662 8438820 8159487 7855954 7584113 7300348 6968437 6598861
11435F598861l51039m00245l82878l58358l95072m45872l96381m06671m48170
11426C014175m89426m42158m43252l85401m74365m47407m36563m69089m36595
11417a010081m03588m18427m07198k84094l70281l97980k95508k76373k42638
11408d106168k86389l34983l28568k69654k69813k06633j42458j36583j31838
11399f213087k38489k28849j49359j11179n6952r1297j33350j89573r2923m5742
11389g550800j20342p3165n1290J9779j2461j14147k3052j3997j8944L8149M9647
11378g870623j22j0854M7150o598L4968K9919L4183O3107Q4339M2924L1320M119
11366g516168N1433K8084O9885J39002R9733M8147O6856N5906M5614M9175P4049
$$ plain form
11435 6598861 6247822 5847577 5464699 5106341 4711269 4265397 3869016 3462345 3014175
11426 3014175 2524749 2082591 1639339 1253938 779573 332166 -104397 -573486 -1010081
11417 -1010081 -1413669 -1832096 -2239294 -2523388 -2893669 -3291649 -3587157 -3863530 -4106168
11408 -4106168 -4392557 -4727540 -5056108 -5325762 -5595575 -5802208 -5944666 -6081249 -6213087
11399 -6213087 -6451576 -6680425 -6829784 -6940963 -6997915 -7089212 -7222562 -7412135 -7505058 -7550800
11389 -7550800 -7671142 -7744307 -7795597 -7775818 -7788279 -7902426 -7925478 -7939475 -7958419 -7920270 -7870623
11378 -7870623 -7870745 -7881599 -7834449 -7841047 -7806079 -7776160 -7741977 -7678870 -7594531 -7551607 -7520287 -7516168
11366 -7516168 -7464735 -7436651 -7366766 -7227764 -7128031 -7079884 -7013028 -6957122 -6911508 -6862333 -6788284
11355f788284J06856R2926J01401R5354P5476J6750N5773K8783L0624R7902O1737
11344f024702N8099N7227O3041K9508j0651O6904R5583j822R7944Q5073J6705
11333e467091K7744R1786Q2132R3117P0589N1146P1211K5003L5451M0207j388
11322d880093l23O7467j6327J12954R4687J4881j0821L1599J06645J25907N9570
11311d293854K6497J8049m767k3235N9491P3681M7924p269L3010K2755N8636L3519
11299c955563j404K0811L6623M7821n330l3952M8097R9332Q4169n566J4807N5178
11287c594977M5016L6786L3695K0318K9993k3668J662P8800O1339P8295k2968
11276c255709J9971N2276n995K9718N175P1684j9664n331L8905M4954l4273k6008
$$ plain form
11355 -6788284 -6681428 -6588502 -6487101 -6391747 -6316271 -6299521 -6243748 -6214965 -6184341 -6086439 -6024702
11344 -6024702 -5966603 -5909376 -5846335 -5816827 -5827478 -5760574 -5664991 -5666813 -5568869 -5483796 -5467091
11333 -5467091 -5439347 -5347561 -5265429 -5172312 -5101723 -5050577 -4979366 -4954363 -4918912 -4878705 -4880093
11322 -4880093 -4880416 -4812949 -4829276 -4716322 -4621635 -4606754 -4617575 -4585976 -4479331 -4353424 -4293854
11311 -4293854 -4267357 -4249308 -4254075 -4277310 -4217819 -4144138 -4096214 -4103483 -4070473 -4047718 -3989082 -3955563
11299 -3955563 -3956967 -3936156 -3899533 -3851712 -3857042 -3890994 -3842897 -3743565 -3659396 -3664962 -3650155 -3594977
11287 -3594977 -3549961 -3513175 -3479480 -3459162 -3429169 -3452837 -3451175 -3372375 -3311036 -3232741 -3255709
11276 -3255709 -3235738 -3183462 -3189457 -3159739 -3154564 -3082880 -3102544 -3107875 -3068970 -3024016 -3058289 -3084297
11264c084297L0410N8889L0072M1456K1855n852l4648l313L2267M5570Q6126R7470
11252b683995O91o310K3795L3673K816p768l0043k8420k8974J5110J15110M8122
11240b546193N409M461K3980O7393j6932J7561O834j9295n79L5626O5398j465
11228b357802j5255k3015o3921J5124L4196P6107J251M3762M99m7192J6851L3161
11216b286234j0288R53N5533O3211r350n9712o5586K6311N8411M2511J1658j9614
11204b192196J4662J12041N6977N696M1529j4487k0556K2750j2944J2828k111
11193a975811o0667N2089k0396n29L0559L1802K2270l4816Q177l0169L5238O4018
11181a878235j2424J0403M8041K9683K4257L9381J2247P669j0735K092p0615j5336
$$ plain form
11264 -3084297 -3053887 -2994998 -2964926 -2923470 -2901615 -2907467 -2942115 -2945428 -2913161 -2867591 -2781465 -2683995
11252 -2683995 -2683304 -2689614 -2665819 -2632146 -2629330 -2637098 -2667141 -2695561 -2724535 -2709425 -2594315 -2546193
11240 -2546193 -2540784 -2536323 -2512343 -2444950 -2461882 -2444321 -2437487 -2456782 -2457361 -2421735 -2356337 -2357802
11228 -2357802 -2373057 -2396072 -2459993 -2444869 -2410673 -2334566 -2333315 -2289553 -2289054 -2336246 -2319395 -2286234
11216 -2286234 -2296522 -2295569 -2240036 -2176825 -2186175 -2245887 -2311473 -2285162 -2226751 -2184240 -2172582 -2192196
11204 -2192196 -2177534 -2065493 -2008516 -2002820 -1961291 -1975778 -1996334 -1973584 -1986528 -1973700 -1975811
11193 -1975811 -2036478 -1984389 -2004785 -2005314 -1974755 -1942953 -1920683 -1955499 -1947322 -1977491 -1942253 -1878235
11181 -1878235 -1890659 -1880256 -1832215 -1802532 -1778275 -1738894 -1726647 -1718978 -1729713 -1727621 -1798236 -1813572
11169a813572j1527M6311J6570L7244n49M7563j2609m7214m867J3773O8665L8644
11157a621568J2774K22l5703l8313L0374P204m80k8201k7750K4545L9511K1157
11145a616228J5393j4996K2279j1602m1570J9396J9588M1738L713O0958L9710
11134a461621l9779k6003J7735R160k001K4754K3318j5681k6916k3565p003j9745
11122a547347N5081j6538N270L2209Q3097j7322J0824l5741K5530L0465J1341
11111a363131j5579L661j2028L1472j8927K9369O2363j5785K8336m1300k9312
11100a340861j0991M3344O863M5380K6871m1076m453K4966j9309m1591l1118m332
11088a346307N0730L5965J670j0669J2674K1873M9184O4449l503J1907L2399L587
$$ plain form
11169 -1813572 -1825099 -1778788 -1762218 -1724974 -1725523 -1677960 -1690569 -1737783 -1742650 -1728877 -1660212 -1621568
11157 -1621568 -1608794 -1608572 -1644275 -1682588 -1652214 -1645010 -1645490 -1673691 -1701441 -1676896 -1637385 -1616228
11145 -1616228 -1600835 -1615831 -1593552 -1605154 -1646724 -1627328 -1607740 -1566002 -1562289 -1501331 -1461621
11134 -1461621 -1501400 -1527403 -1509668 -1500508 -1502509 -1477755 -1454437 -1470118 -1497034 -1520599 -1527602 -1547347
11122 -1547347 -1492266 -1508804 -1503534 -1471325 -1388228 -1405550 -1394726 -1430467 -1404937 -1374472 -1363131
11111 -1363131 -1378710 -1375049 -1387077 -1355605 -1374532 -1345163 -1282800 -1298585 -1270249 -1311549 -1340861
11100 -1340861 -1351852 -1308508 -1301645 -1256265 -1229394 -1270470 -1274923 -1249957 -1269266 -1310857 -1341975 -1346307
11088 -1346307 -1295577 -1259612 -1257942 -1268611 -1255937 -1234064 -1184880 -1120431 -1123934 -1112027 -1079628 -1076041
11076a076041q5278l1380J9391j999R542n126k0383L60K9967N1773j6949K2651
11064a103472M6670J1615j5123k7994l9926m3134L0752M2251m0703k4570N8570
11053a105064Q473M3031k8995L826R160l3396k6562M2985O0786N9258k2278j2234
11041a001010P1469Q5159o87N500j4917j4579p1010l9745L3329p175m793O6643
11029h91816O1350l3185k4355l6283j3072K2368l9493J8173K3940J6906M8174
11018h47293L0524M5810l8548n4969o6123k9186J7700P6942L1263m01l0883j9932
11006h85096Q173r516n0855K1479J5300k81J7179k8338K8933L4581J8242K9541
10994h00658n0688n1568K6973K5181K0291j1060l1605M6683M7998r350j1216K9246
$$ plain form
11076 -1076041 -1161319 -1192699 -1173308 -1175307 -1165765 -1170891 -1191274 -1190914 -1160947 -1109174 -1126123 -1103472
11064 -1103472 -1056802 -1045187 -1060310 -1088304 -1128230 -1171364 -1140612 -1098361 -1139064 -1163634 -1105064
11053 -1105064 -1096591 -1053560 -1082555 -1078729 -1069569 -1102965 -1129527 -1086542 -1025756 -966498 -988776 -1001010
11041 -1001010 -929541 -844382 -845069 -839569 -854486 -869065 -940075 -979820 -946491 -953666 -958459 -891816
11029 -891816 -830466 -863651 -888006 -924289 -937361 -914993 -954486 -936313 -912373 -895467 -847293
11018 -847293 -816769 -770959 -809507 -864476 -930599 -959785 -942085 -865143 -833880 -834281 -865164 -885096
11006 -885096 -876923 -886439 -937294 -915815 -900515 -900796 -883617 -911955 -883022 -848441 -830199 -800658
10994 -800658 -851346 -902914 -875941 -850760 -830469 -841529 -873134 -826451 -778453 -787803 -799019 -769773
10982g69773l7784l2453o35O9526J8086J4527m496l5146L8145M2084J8139l7063
10970g16843j5189l2065j1727M4348M8582N280J820M0726J1767r255m2911k7376
10958g02843K5658P4302O2642o0111m4299o2923k5342O4506N7474L7533k9874
10947f03277r761N0426N1684n2027l2026o4523p4674L3278M8684J7734k9831N7431
10935f06882J4300m1880j984k0504k5117L0125K6754N4673l045N123j5026o7511
10923f50974L9528M8383J8001K5459J761m280J3404L2890j7931M222j4441r667
10911e13645j8304j0115J2959j0332O4278O2956l3700l6139j7279k6636p719o274
10899e39950k384l1028K8534M3198L9647K8829n0410P645r617j5008p2731o3368
$$ plain form
10982 -769773 -807557 -840010 -840645 -771119 -753033 -738506 -743002 -778148 -740003 -697919 -679780 -716843
10970 -716843 -732032 -764097 -775824 -731476 -682894 -677614 -675794 -635068 -623301 -632556 -675467 -702843
10958 -702843 -677185 -602883 -540241 -600352 -644651 -707574 -732916 -668410 -610936 -573403 -603277
10947 -603277 -613038 -562612 -510928 -562955 -594981 -659504 -734178 -700900 -652216 -634482 -664313 -606882
10935 -606882 -592582 -634462 -636446 -656950 -682067 -651942 -625188 -570515 -573560 -568437 -583463 -650974
10923 -650974 -611446 -563063 -545062 -519603 -517842 -522122 -508718 -475828 -493759 -489537 -503978 -513645
10911 -513645 -531949 -542064 -529105 -539437 -475159 -412203 -445903 -482042 -499321 -525957 -533676 -539950
10899 -539950 -542334 -573362 -544828 -501630 -461983 -433154 -483564 -475919 -485536 -500544 -573275 -636643
10887f36643n1344N0972N5055M7289J9528l613l279J6169N3053j8017J4079Q4282
10875c72469R914n3392j6918k1726M315L7866K5216L8321m208j6598k2092L40
10863c91431J016j959M5625L857K3485N310j7845j6928L1706R57J7718l7392L050
10850c32831L84j6065m4059K9044j670j8872j9343J7030j2365j5932J4538K0957
10838c79184N561k0659L1864O4480K979J8711n7755k4205L8513j60o509j5780
10826c42144J6213L6455M5308L4957O2750M2013m3132q6094n3126j1984M1360
10815b57424O4011N4081k0506l2595n8150l4707n3736J9307n2700K7632P3608
10804b71179o582K493N5024j1185r385K6531o8888k2550k1790L798j1969k2814
$$ plain form
10887 -636643 -687987 -637015 -581960 -534671 -515143 -518756 -522035 -505866 -452813 -470830 -456751 -372469
10875 -372469 -362555 -415947 -432865 -454591 -450276 -412410 -387194 -348873 -353081 -369679 -391771 -391431
10863 -391431 -390415 -392374 -346749 -342892 -319407 -314097 -331942 -348870 -317164 -316207 -298489 -335881 -332831
10850 -332831 -332447 -348512 -392571 -363527 -365197 -384069 -403412 -386382 -398747 -414679 -400141 -379184
10838 -379184 -373623 -394282 -362418 -297938 -294959 -276248 -334003 -358208 -319695 -319855 -326364 -342144
10826 -342144 -325931 -289476 -244168 -209211 -146461 -104448 -147580 -233674 -286800 -298784 -257424
10815 -257424 -193413 -139332 -159838 -192433 -250583 -285290 -339026 -319719 -372419 -344787 -271179
10804 -271179 -277761 -275268 -220244 -231429 -240814 -214283 -283171 -305721 -327511 -323713 -335682 -358496
10792c58496M5431N9329m2555K9791N888o4393K2026K6281K2937R102J0205L1059
10780b03395j443O169O117l8136r926L1348M1262M9869l380p862m3533m6768k5541
10767b45219J7625N2396Q8001j9097j8149M0769N6670k9286n1122m4652j5529
10756a67593P9068L1446k1206j6006J6560l3206J9703O9625K336j6959J9326q6229
10744a03135k124L1150K4172k9332j8988L0056L9085L6250K0588m6554m365l5271
10732e8468j9744n5183l6428P5786L8494L7091L2258k2852p3491p1407L5496M9773
10720f8675M7557o8716l2525Q792K1137n6121J9127N7562K2327j337j1237L2260
10708b9849J7143J3226J4888k6979O853k3586m7374l5669m1279j361J0733M9092
$$ plain form
10792 -358496 -313065 -253736 -296291 -266500 -260612 -325005 -302979 -276698 -253761 -244659 -234454 -203395
10780 -203395 -204838 -198669 -192552 -230688 -240614 -209266 -168004 -118135 -121515 -129377 -172910 -219678 -245219
10767 -245219 -227594 -175198 -87197 -106294 -124443 -83674 -27004 -56290 -107412 -152064 -167593
10756 -167593 -88525 -57079 -78285 -94291 -77731 -110937 -91234 -21609 -19273 -36232 -16906 -103135
10744 -103135 -105259 -74109 -49937 -79269 -98257 -68201 -29116 7134 27722 -18832 -23197 -58468
10732 -58468 -78212 -133395 -169823 -94037 -55543 -18452 13806 -9046 -82537 -153944 -118448 -68675
10720 -68675 -21118 -89834 -122359 -113567 -92430 -148551 -129424 -71862 -49535 -50872 -62109 -29849
10708 -29849 -12706 520 15408 -11571 -4718 -28304 -75678 -111347 -152626 -153987 -143254 -94162
10696i4162M6643M5669j376P185M1193k8515L4725K3105k5920j6740o3004j2309
10684d3506j0358j1775P0215j5295P093O964O8684J3443o9129o0368L2509O3914
10672E2391K494k1788Q4644O0745J184p4920m338j8509o3377K913M3513k0745
10660D4207l45Q1889K741L77M4461l6030m3836K502M404K0397L1824j3446J2335
10647A51480J7467k627q51l4754j3088J6936J5721M4435O5957J8782o5173j10105
10635A04180k9032K0460Q175J9268L176K1013K7687r694M2939o064J1243n4886
10623A58465m2030K8970M4562p970m6955J8830K9284K2822m32N4771k8650k7154
10611B04513L0371L8279l666K2739j2009L1926K377P690m6091l0929j5934K1539
$$ plain form
10696 -94162 -47519 -1850 -3226 3959 45152 16637 51362 74467 48547 31807 -31197 -43506
10684 -43506 -53864 -65639 4576 -10719 -3626 3338 72022 85465 16336 -44032 -11523 52391
10672 52391 54885 33097 117741 178486 179670 104750 100412 81903 18526 21439 64952 44207
10660 44207 43862 125751 128492 128869 173330 137300 93464 95966 100370 120767 152591 139145 151480
10647 151480 168947 166320 165469 130715 117627 134563 150284 194719 260676 279458 214285 104180
10635 104180 75148 95608 103783 123051 126227 147240 174927 165233 208172 202108 213351 158465
10623 158465 116435 145405 189967 181997 135042 153872 183156 205978 205546 260317 231667 204513
10611 204513 234884 273163 269497 292236 280227 312153 314530 322220 276129 245200 229266 250805
10599B50805L9011l0066m3186J2554N0835N1977N2905J0110m148j5698n7094m2400
10587B75605j6609q263m3730O816L5705L7507k7275m1522M3761P5526L5198M8955
10575D21674K0529j9010n7547k4752M9875l8776j9654L2359L6186k9664r826M7964
10563D09358K4231l2450o0516j8448K8624J2787J3764j551k9069k2054q271L3484
10551C49889j5562M636j3447J3858L0627Q2954j1922k6883o0605j9010o478N897
10539C33954L8113j0011K3088n2795L1585K4964P063Q525j8162L9544N4065M295
10527D84228r6912l548K9877L7979n0863l4587O1380P6587o66m3102o4762M5413
10515D41024P9642N8111M965n8352l4005r444Q590l4489J8904L6149p384m2321
$$ plain form
10599 250805 289816 259750 216564 229118 279953 331930 384835 394945 390797 375099 318005 275605
10587 275605 258996 250733 207003 213819 249524 287031 259756 218234 261995 337521 372719 421674
10575 421674 442203 423193 365646 340894 390769 351993 332339 364698 400884 371220 361394 409358
10563 409358 433589 401139 340623 322175 350799 363586 377350 375799 346730 324676 316405 349889
10551 349889 334327 338963 325516 339374 370001 452955 441033 414150 353545 334535 328057 333954
10539 333954 372067 362056 385144 332349 363934 388898 395961 404486 386324 425868 479933 484228
10527 484228 387316 383768 413645 451624 400761 366174 427554 504141 503475 460373 395611 441024
10515 441024 520666 578777 583742 525390 491385 481941 490531 456042 474946 511095 503711 461390
10503D61390J0694P6357k5416k0567J7959J9719k6359O7580L2572k7830o2015
10492E24084P891P5450J153m2509K0245P3643L8380J2482L743m410l1931N598
10480F83819r589m0304l4768l764J1390o517j6544l6016K443J0427K0992K5378
10468F06947L7735l2760J1478J0593q203k9086K417J287j5068M1836L2885M0183
10456G00244q877k0278j7996o7841K9683O6321L7402P765O346L661r266k9803
10444F97361l5637L6830O929K3343J9165j5159l6806N1120M588j7866l7775l519
10432F92574L7352j2521k8209K320O3176M0714l4471K9127o348K1795N3782M0452
10420H99743k3611l3497k6346J2975O66j0271J7811k5462k4743m4681l3789N6592
$$ plain form
10503 461390 472084 548441 523025 502458 520417 540136 513777 581357 613929 586099 524084
10492 524084 531975 607425 608578 566069 586314 659957 698337 710819 714562 710152 678221 683819
10480 683819 674230 633926 599158 595394 606784 600267 583723 547707 550150 560577 581569 606947
10468 606947 644682 611922 623400 633993 625790 596704 599121 600408 585340 627176 660061 700244
10456 700244 691367 671089 653093 585252 614935 681256 718658 726423 732769 736430 727164 697361
10444 697361 661724 698554 705483 728826 747991 732832 696026 747146 751734 733868 696093 692574
10432 692574 729926 717405 689196 691516 754692 795406 760935 790062 783714 805509 859291 899743
10420 899743 876132 842635 816289 829264 829930 819659 837470 812008 787265 742584 708795 765387
10408G65387K0005M6778L5495M0945m341K5693k2650m1416J651M766J1672N9787
10396I43772M3886L1671N9215m5196n4030k608L4280l9141r875M4480K3969j9080
10384A011343n0616n0361O9112N6684k0560k6166r3531m3783M2310N7108N8068
10373A009608J4065p9558m2144J6797L5923L8412O424k8266K7825O406r107l8781
10361I57604l1466k0661O840J10576P9823L9079k7044j7611m2654j9313J1726
10350A046899M5830N335J8315K4654k920J4418O0121Q898j26653j0155M7160L4003
10338A165905L2878j9881q3236j7049L8918J0105R368q91r950l807O9757P9215
10326A271332r083k7130M8680k9695p557j5170K376L279M9442O5129J0941k5056
$$ plain form
10408 765387 785392 832170 867665 908610 904269 929962 907312 865896 867547 872313 883985 943772
10396 943772 987658 1019329 1078544 1033348 979318 976710 1010990 971849 961974 1006454 1030423 1011343
10384 1011343 960727 910366 979478 1036162 1015602 989436 895905 852122 894432 951540 1009608
10373 1009608 1023673 944115 901971 918768 954691 993103 999527 971261 999086 1005492 996385 957604
10361 957604 926138 905477 912317 1022893 1102716 1141795 1114751 1097140 1054486 1035173 1046899
10350 1046899 1092729 1098064 1116379 1141033 1138113 1152531 1212652 1221550 1094897 1084742 1131902 1165905
10338 1165905 1198783 1178902 1095666 1078617 1117535 1127640 1137008 1136117 1126167 1122360 1192117 1271332
10326 1271332 1262249 1235119 1283799 1254104 1246547 1231377 1233753 1237032 1286474 1351603 1362544 1337488
10314A337488M1227L5770R922M111j7647p112n5773J3998N2480P526m5779l6950
10302A339261Q387K7757K1891P2029q059J6383L0803o846R524o444K0973r759
10290A515900j6249r689j25k3065j5609O0038L1673j0352o98k501P0537J21319
10278A721179l9974p950J7930L9075O4871K3291l4023m0184r4606j37277n7498
10267A454834N4831M3153K6846Q3911R1957L8693p240J7967k2250m3595n0406
10256A688701n5701q1858l9601R017L2515P4034O1533J5992K9614O6212R6959
10245A897417L7619l8907r2193j72613j32189m3549l2747P8321L7223K1468J30299
10234A690149P0689l4262j0180j2887j3871n2732m4255o1052l0470L3036J2089
$$ plain form
10314 1337488 1378715 1414485 1424407 1428518 1410871 1403759 1347986 1361984 1414464 1421990 1376211 1339261
10302 1339261 1347648 1375405 1397296 1469325 1461266 1477649 1508452 1501606 1511130 1504686 1525659 1515900
10290 1515900 1499651 1489962 1489837 1466772 1451163 1511201 1542874 1532522 1531824 1529323 1599860 1721179
10278 1721179 1681205 1673255 1691185 1730260 1795131 1818422 1784399 1744215 1649609 1512332 1454834
10267 1454834 1509665 1552818 1579664 1663575 1755532 1794225 1786985 1804952 1782702 1739107 1688701
10256 1688701 1633000 1551142 1511541 1520558 1553073 1627107 1688640 1704632 1734246 1800458 1897417
10245 1897417 1935036 1896129 1803936 1631323 1499134 1455585 1422838 1501159 1538382 1559850 1690149
10234 1690149 1760838 1726576 1716396 1703509 1689638 1636906 1592651 1531599 1501129 1534165 1546254
10223A546254M2360q725k480K7571N6254O5138j3624l9905o6931p3334L6659J0963
10211A580200j150L0512M4389k4173L156J195K5555R0549P7383J6909L744K1211
10199A869480J111Q664L887o90Q9532J5058K406q753L640L350K1364K4064M4903
10186B078016K1469k4485l2680l2953O0365n6938q832P2361N8659K7P261J6120
10174B158390k3320M1980R854M2138l1183M01K8219n5419K66L6844r806m6204
10162B152160j3579R275M8315P2998O5522L4064j5197K7630J1066M0151J4789
10151B447194n7418k3506N7584O0714N4910L2494j0722r199L8047n284K927Q059
10139B595800j9466n7254J8805N6162k5519k9854M0599L9878J12799J2976n0860
$$ plain form
10223 1546254 1588614 1579889 1577409 1604980 1661234 1726372 1712748 1672843 1605912 1532578 1569237 1580200
10211 1580200 1579050 1609562 1653951 1629778 1632934 1634129 1659684 1750233 1827616 1844525 1848269 1869480
10199 1869480 1870591 1879255 1883142 1882452 1971984 1987042 1989448 1980695 1984335 1987685 2009049 2033113 2078016
10186 2078016 2099485 2075000 2042320 2009367 2069732 2012794 2003962 2076323 2134982 2135009 2142270 2158390
10174 2158390 2135070 2177050 2186904 2229042 2197859 2198260 2226479 2171060 2171326 2208170 2198364 2152160
10162 2152160 2138581 2147856 2196171 2269169 2334691 2368755 2353558 2381188 2392254 2432405 2447194
10151 2447194 2389776 2366270 2423854 2484568 2539478 2571972 2561250 2552051 2590098 2584814 2587741 2595800
10139 2595800 2576334 2519080 2537885 2594047 2568528 2538674 2579273 2619151 2731950 2744926 2694066
10128B694066K5358K738J3016k7921J5582K5240N1173N784k319N969J8775l8650
10116B788811L5862J9218n4725K3654N2031M2144M2667n251P37J7237L6598J5409
10104C014392p4328k8435L9394O7865K2526k4026J7583m255K1013N6298Q896k591
10092C114332K3029L4907j2453K6401J9039K5537m045K4939q255m5102K0009L7016
10080C255354P0828J12265n3428r343N6672J5168M5824J9455l3367L1084O388
10069C516900J9248L6303K1881L1728N9814N7424Q4309k9673M630M8933K7930
10058C879427j1113n2078J7944N2406j9862J2095M8760J17277N9902n4123k6611
10047D024024L8714N0551J0996k4836O3201Q2152L7936L3533j4588L8095Q5253
$$ plain form
10128 2694066 2719424 2722162 2735178 2707257 2722839 2748079 2799252 2805036 2802717 2808686 2827461 2788811
10116 2788811 2824673 2843891 2789166 2812820 2864851 2906995 2949662 2944411 2945148 2962385 2998983 3014392
10104 3014392 2940064 2911629 2951023 3018888 3041414 3017388 3034971 3030716 3051729 3108027 3116923 3114332
10092 3114332 3137361 3172268 3159815 3186216 3205255 3230792 3226747 3251686 3243431 3198329 3218338 3255354
10080 3255354 3326182 3438447 3385019 3375676 3432348 3447516 3493340 3512795 3479428 3510512 3516900
10069 3516900 3536148 3572451 3594332 3626060 3685874 3743298 3827607 3797934 3802564 3851497 3879427
10058 3879427 3868314 3816236 3834180 3886586 3866724 3878819 3927579 4044856 4104758 4050635 4024024
10047 4024024 4062738 4113289 4124285 4099449 4162650 4244802 4282738 4316271 4301683 4339778 4425031
10036D425031P5932J1819L2264r805n4060K7336J01895R0631J9413J8618j1716
10025D727358K7388L9523j3823R242O5676P4800O3204Q2665K7763m1759O6964
10014E129001Q8393j9243J3676N9771K7831N8226N4168K6988N2437L4831l642
10003E522437K5823M9154L4387O5869O0106J00984P6738J458M5513M3221K6248
9992F051938M1229L0531Q1467Q6693L773J9365O4197R3111K9683Q0993L7217M3666
9980F663863M1090M683P408J13694Q4214k5736l0689M2517J27673J42006O6738
9969G237461J27910L6373P6836J25878O7527J12488J09497R5779M7850l0879R5733
9958H102453J39258J11440Q8241O2468N7018J14295R0317R7929R6785Q2952O2943
$$ plain form
10036 4425031 4500963 4512782 4545046 4535241 4481181 4508517 4610412 4701043 4720456 4739074 4727358
10025 4727358 4754746 4794269 4780446 4789688 4855364 4930164 4993368 5076033 5103796 5062037 5129001
10014 5129001 5217394 5198151 5211827 5271598 5299429 5357655 5411823 5438811 5491248 5526079 5522437
10003 5522437 5548260 5597414 5631801 5697670 5757776 5858760 5935498 5936956 5982469 6025690 6051938
9992 6051938 6093167 6123698 6205165 6291858 6295631 6314996 6379193 6472304 6501987 6582980 6620197 6663863
9980 6663863 6704953 6709636 6717044 6830738 6914952 6889216 6858527 6901044 7028717 7170723 7237461
9969 7237461 7365371 7401744 7478580 7604458 7671985 7784473 7893970 7989749 8037599 8006720 8102453
9958 8102453 8241711 8353151 8441392 8503860 8560878 8675173 8765490 8863419 8960204 9043156 9106099
9947I106099P5792Q9603J20814J03425J07092J88193J97247J43807R8948J39052
9937A0370072J11620R1898R0870J25909J80555K01704J83971J60394Q5068J86155
9927A1788216J97787K14717K17582K62347J92899R2500K25641J49532J83898K68990
9917A3794109K55015K72830K45757K43009L32940L43741L62111L38562L14590
9908A6502664L04042L18676M03228M06654L35801K74439K86473L12311L42452
9899A9486740L06167L15159M66380O28625P03100P68041P90840O91202P54965
9890B4911219P96763P70021P61747P23861O66195Q81118J381855J818104K024870
9881C4735753K192904K326745K336600K052607R52144j729392n645201q468930
$$ plain form
9947 9106099 9181891 9271494 9392308 9495733 9602825 9791018 9988265 10132072 10231020 10370072
9937 10370072 10481692 10573590 10664460 10790369 10970924 11172628 11356599 11516993 11602061 11788216
9927 11788216 11986003 12200720 12418302 12680649 12873548 12966048 13191689 13341221 13525119 13794109
9917 13794109 14049124 14321954 14567711 14810720 15143660 15487401 15849512 16188074 16502664
9908 16502664 16806706 17125382 17528610 17935264 18271065 18545504 18831977 19144288 19486740
9899 19486740 19792907 20108066 20574446 21203071 21906171 22674212 23465052 24156254 24911219
9890 24911219 25707982 26478003 27239750 27963611 28629806 29510924 30892779 32710883 34735753
9881 34735753 36928657 39255402 41592002 43644609 44596753 42867361 37222160 28753230
9873B8753230p137323k132239J916125L672079M157100M262562M409829M566971
9865D2468334M432357L792872J185686m607529j2620576j8144556j4704807m197078
9857b395297L356135N901560O298505O266221O240552O334833O079105M780399
9849D2862013N94630q244748k0178662k7729396k1716742o345558L938636O640577
9841c0179250O590510O165590N976514N642908N226536M097160J033126n143199
9833e90105j3174858j8044232j3686813l301991L196852M685864M355427L912128
9825c2647728L623552L496475L193328K495883Q31063k356178o347916q635434
9817c6346955o273712j341494J675448K269507J973646J618902J396996J333087
$$ plain form
9873 28753230 21615907 19483668 21399793 25071872 29228972 33491534 37901363 42468334
9865 42468334 46900691 50693563 51879249 47271720 34651144 16506588 1801781 -2395297
9857 -2395297 960838 6862398 13160903 19427124 25667676 32002509 38081614 42862013
9849 42862013 43456643 35211895 15033233 -12696163 -34412905 -40758463 -36819827 -30179250
9841 -30179250 -23588740 -17423150 -11446636 -5803728 -577192 3519968 4553094 -590105
9833 -590105 -13764963 -31809195 -45496008 -48797999 -45601147 -40915283 -36559856 -32647728
9825 -32647728 -29024176 -25527701 -22334373 -19838490 -19007427 -21363605 -27711521 -36346955
9817 -36346955 -42620667 -43962161 -42286713 -40017206 -38043560 -36424658 -35027662 -33694575
9809c3694575J294543J213967J098910R79176Q46091Q07945P62089P72823O53667
9800b5265364N25521M35792L67717L38371L57707M36515L63751L03101M10625
9791b1726264M27468L99711M20627L17278L12599L33826K37253K53140L03569
9782a8720793K44650K09995K05648K72581L21441K97428J81426J77894K36213
9773a6573517K62795K14849J94039K41452K66053J83749K20755K19502J54304
9764a4616019R7208J85018J90256K17872J84270K24198K33905J31184J49438J44674
9754a2857996J49665J59296J31556J42900R3840J35118J79603J35340Q2546Q0192
9744a1567940J10167J68885J07237J13439J14438J54386J02400P5342L3597Q1033
$$ plain form
9809 -33694575 -32400032 -31186065 -30087155 -29107979 -28261888 -27453943 -26691854 -25919031 -25265364
9800 -25265364 -24739843 -24304051 -23936334 -23597963 -23240256 -22803741 -22439990 -22136889 -21726264
9791 -21726264 -21298796 -20899085 -20478458 -20161180 -19848581 -19514755 -19277502 -19024362 -18720793
9782 -18720793 -18476143 -18266148 -18060500 -17787919 -17466478 -17169050 -16987624 -16809730 -16573517
9773 -16573517 -16310722 -16095873 -15901834 -15660382 -15394329 -15210580 -14989825 -14770323 -14616019
9764 -14616019 -14518811 -14333793 -14143537 -13925665 -13741395 -13517197 -13283292 -13152108 -13002670 -12857996
9754 -12857996 -12708331 -12549035 -12417479 -12274579 -12180739 -12045621 -11866018 -11730678 -11648132 -11567940
9744 -11567940 -11457773 -11288888 -11181651 -11068212 -10953774 -10799388 -10696988 -10621646 -10588049 -10507016
9734a0507016J29086R8526J00330P2483J26367J53635R3187J00582J00668P3400
9724i458752R5070Q5525J2263L9752O6669Q9114O9152L295O9877J15286R4419
9713h718330Q7693J14011P9731M4445M4479P7756K4273K9271Q5924K4583l4437
9702h140601J8058J4794Q0657P2530M3956N2162J9771J4227M8454L9175K2898
9691g713919J77591J15655L5295J14229M0314J8238O2278m810M9332R1201P1907
9680f942689K7580M0191P2124J1514L1445m8660K1569M8599k3392M22O3621L3327
9668f664349L7969O8868J22096N3722j7626L347L4707P4151j8764o4187M6645
9657f323421M8869O4312M4735j0591K4631o413L0869R9961M535J1105Q028M5545
$$ plain form
9734 -10507016 -10377930 -10279404 -10179074 -10106591 -9980224 -9826589 -9733402 -9632820 -9532152 -9458752
9724 -9458752 -9363682 -9278157 -9265894 -9226142 -9159473 -9070359 -9001207 -8997912 -8928035 -8812749 -8718330
9713 -8718330 -8630637 -8516626 -8436895 -8392450 -8347971 -8270215 -8245942 -8216671 -8130747 -8106164 -8140601
9702 -8140601 -8122543 -8107749 -8027092 -7954562 -7910606 -7858444 -7838673 -7824446 -7775992 -7736817 -7713919
9691 -7713919 -7536328 -7420673 -7385378 -7271149 -7230835 -7212597 -7150319 -7155129 -7105797 -7014596 -6942689
9680 -6942689 -6915109 -6874918 -6802794 -6791280 -6759835 -6808495 -6786926 -6738327 -6761719 -6761297 -6697676 -6664349
9668 -6664349 -6626380 -6557512 -6435416 -6381694 -6399320 -6395973 -6361266 -6287115 -6305879 -6370066 -6323421
9657 -6323421 -6274552 -6210240 -6165505 -6176096 -6151465 -6157878 -6127009 -6027048 -6022513 -6011408 -6003380 -5957835
9645e957835M4610k1191L8864L5425M4459L6342N4474L3713N4168K0123J3502
9634e603346Q750r319J074Q0978N7846l8932J8797L1978l5066j2182L0983J23779
9622e344660Q0097J5869k9915p0623q255L6517M7080N1297K4996J11279M2411
9611e043907j01450J5850R5561l53n8977k8821N8926q805O412J05162O0963r8906
9599d998345J7369O7863K9028L6672r942L2102K7834O3357Q2064M1852m0382o3936
9587d714464j8177r746L6007J2216k3596k1873O1100N4111R496K1684k6694j8094
9575d638030K3534P9526O6556L3375N2123K8039N5481L5142J0107J6651k7194
9564d264690j1943J9795j0875J1702L8308L1784N5322m7974m5671N7471M184j7648
$$ plain form
9645 -5957835 -5913225 -5934416 -5895552 -5860127 -5815668 -5779326 -5724852 -5691139 -5636971 -5616848 -5603346
9634 -5603346 -5594596 -5603915 -5602841 -5521863 -5464017 -5502949 -5484152 -5452174 -5487240 -5499422 -5468439 -5344660
9622 -5344660 -5264563 -5248694 -5278609 -5349232 -5357487 -5320970 -5273890 -5222593 -5197597 -5086318 -5043907
9611 -5043907 -5145357 -5129507 -5033946 -5034299 -5093276 -5122097 -5063171 -5071976 -5065564 -4960402 -4899439 -4998345
9599 -4998345 -4980976 -4913113 -4884085 -4847413 -4857355 -4825253 -4797419 -4734062 -4651998 -4610146 -4650528 -4714464
9587 -4714464 -4732641 -4742387 -4706380 -4694164 -4717760 -4739633 -4678533 -4624422 -4614926 -4593242 -4619936 -4638030
9575 -4638030 -4614496 -4534970 -4468414 -4435039 -4382916 -4354877 -4299396 -4264254 -4254147 -4237496 -4264690
9564 -4264690 -4276633 -4256838 -4267713 -4256011 -4217703 -4185919 -4130597 -4178571 -4224242 -4166771 -4162587 -4180235
9552d180235J4704R05M2556J9885m5423L425k3064N4091M1795O478k794J9780
9540d047897M8308j4124L7850L7735k059M5665J5862N946J4813Q238j1367R808
9528c851222r962l8560k5460J0589K2723L9018j005J9464k95J8365M7612k3839
9516c792572j7545K6636J30896M5067k9454n6784k2173O1547L0004N3312Q762
9505c562304p3692k2685K4876J793L7810M2375J4773j3161n0528j7003P6396O4279
9493c477071m6077Q675m618j4689j2060N4956Q8630m0438j3771k0453N565L4689
9481c436662O2688O4820O9152P4426q729M022k8146l9692K387p3114m7199K7438
9469c328609K4580N3692J6665M6510K0469M4112L5388L6281l8600l8237o7678
$$ plain form
9552 -4180235 -4165531 -4164626 -4122070 -4102185 -4147608 -4144183 -4167247 -4113156 -4071361 -4064883 -4067677 -4047897
9540 -4047897 -3999589 -4013713 -3975863 -3938128 -3940187 -3894522 -3878660 -3872714 -3857901 -3849663 -3861030 -3851222
9528 -3851222 -3861184 -3899744 -3925204 -3914615 -3891892 -3852874 -3853879 -3834415 -3834710 -3816345 -3768733 -3792572
9516 -3792572 -3810117 -3783481 -3652585 -3607518 -3636972 -3693756 -3715929 -3654382 -3624378 -3571066 -3562304
9505 -3562304 -3635996 -3658681 -3633805 -3632012 -3594202 -3551827 -3537054 -3550215 -3600743 -3617746 -3541350 -3477071
9493 -3477071 -3523148 -3514473 -3519091 -3533780 -3545840 -3490884 -3402254 -3442692 -3456463 -3476916 -3471351 -3436662
9481 -3436662 -3373974 -3309154 -3240002 -3165576 -3174305 -3170283 -3198429 -3238121 -3235734 -3308848 -3356047 -3328609
9469 -3328609 -3304029 -3250337 -3233672 -3187162 -3166693 -3122581 -3087193 -3050912 -3089512 -3127749 -3195427
9458c195427q5245q4485l7212P3249P2510K7225M9965L2233L6138N8255M2515
9447c010279m6215o7295j43383j05341j19257m1058Q2500R4081Q5173N0357N1560
9436c169157O5459K8768R620n2233r851k2731q0351n7676q401J9010J4171K3630
9424c239742j8618M7496K9600o24M559M5602J792m7414l4211p8719m0116K2901
9412c307494j3554L8343L8630J3731N0584N4331P385K5164J203m904L3120k86
9400c063747j8996o8009j2882J720L8020M7207l6097l4580L2739L1766O324r163
9388c085698L0198N7865M9533j3736m0474J5677l6679R411K6940Q4615N2336m8037
9376b898049o8508m195K4433O9502j5646k6636j8101K3347J5715J1354L8155m6037
$$ plain form
9458 -3195427 -3280672 -3365157 -3402369 -3329120 -3256610 -3229385 -3179420 -3147187 -3111049 -3052794 -3010279
9447 -3010279 -3056494 -3123789 -3267172 -3372513 -3491770 -3532828 -3450328 -3356247 -3271074 -3220717 -3169157
9436 -3169157 -3103698 -3074930 -3065310 -3117543 -3127394 -3150125 -3230476 -3288152 -3296553 -3277543 -3263372 -3239742
9424 -3239742 -3258360 -3210864 -3181264 -3181888 -3177329 -3131727 -3129935 -3177349 -3211560 -3290279 -3330395 -3307494
9412 -3307494 -3321048 -3282705 -3244075 -3230344 -3179760 -3125429 -3118044 -3092880 -3091677 -3096581 -3063461 -3063747
9400 -3063747 -3082743 -3150752 -3163634 -3161914 -3123894 -3076687 -3112784 -3147364 -3114625 -3082859 -3076535 -3085698
9388 -3085698 -3055500 -2997635 -2948102 -2961838 -3002312 -2986635 -3023314 -3013903 -2986963 -2902348 -2850012 -2898049
9376 -2898049 -2966557 -2970752 -2946319 -2876817 -2892463 -2919099 -2937200 -2913853 -2898138 -2886784 -2848629 -2894666
9364b894666j7283N7619J213j4305N5375K6554J320n711M434L4936k9102q2426
9352b862042j7890M154Q646L1749K544J7307J8366P8741M0254m6084j1000k6636
9340b761891j8796K9955J6386m143l702l6527M7418P242n761K2067J5061J6917
9328b675774O7137m152m5960l705k8318J3638k3644p2541K6408K3141L8766L7664
9316b647340L1421k7895n6369m6004K1175L1051M2486o969j2220o226K1543k2883
9304b678230N163Q4058K9754n2471j3462O4320M8955m1509n8483K5456L1234j7245
9292b572460o0464J5102P7246k418k347L4653K0949o466k5975k848M5369K0830
9280b458829m602n1806l3385L8163L2118k6990K4137M6172N4023j0306l5601l4448
$$ plain form
9364 -2894666 -2911949 -2854330 -2853117 -2867422 -2812047 -2785493 -2784173 -2789884 -2785450 -2750514 -2779616 -2862042
9352 -2862042 -2879932 -2875778 -2867132 -2835383 -2832839 -2815532 -2797166 -2718425 -2678171 -2724255 -2735255 -2761891
9340 -2761891 -2780687 -2750732 -2734346 -2738489 -2742191 -2778718 -2731300 -2724058 -2729819 -2707752 -2692691 -2675774
9328 -2675774 -2608637 -2612789 -2658749 -2662454 -2690772 -2677134 -2700778 -2773319 -2746911 -2723770 -2685004 -2647340
9316 -2647340 -2615919 -2643814 -2700183 -2746187 -2725012 -2693961 -2651475 -2658444 -2670664 -2676890 -2655347 -2678230
9304 -2678230 -2673067 -2589009 -2559255 -2611726 -2625188 -2560868 -2511913 -2553422 -2611905 -2586449 -2555215 -2572460
9292 -2572460 -2632924 -2617822 -2540576 -2542994 -2545341 -2510688 -2489739 -2496205 -2522180 -2525028 -2479659 -2458829
9280 -2458829 -2463431 -2515237 -2548622 -2510459 -2478341 -2505331 -2481194 -2435022 -2380999 -2391305 -2426906 -2461354
9268b461354l5543K0426K7239L0535M420K132l1992k7332J6940M2708K5960J0191
9256b375670l3150K0141k9156j3556j8509J8450L0966N9119M9153M373j2911l818
9244b304568k4176p874k1172l5680L6164R197l8069r128J3897K8801J5821k6313
9232b363100O639l4641J3885O0502K2104J4801p836p604j6864L9689l2234j2246
9220b316905R806l415J5207p596L3020K3129j5293P8530O1479n2764o0656j9214
9208b254672L1830J4065k4962p248Q303q621J6999J1011j0811m6731k3408J6085
$$ plain form
9268 -2461354 -2496897 -2476471 -2449232 -2418697 -2414277 -2412145 -2444137 -2471469 -2454529 -2411821 -2385861 -2375670
9256 -2375670 -2408820 -2388679 -2417835 -2431391 -2449900 -2431450 -2400484 -2341365 -2292212 -2287839 -2300750 -2304568
9244 -2304568 -2328744 -2336618 -2357790 -2393470 -2357306 -2348109 -2386178 -2395306 -2381409 -2352608 -2336787 -2363100
9232 -2363100 -2356461 -2391102 -2377217 -2316715 -2294611 -2279810 -2287646 -2295250 -2312114 -2272425 -2304659 -2316905
9220 -2316905 -2307099 -2310514 -2295307 -2302903 -2269883 -2246754 -2262047 -2183517 -2122038 -2174802 -2235458 -2254672
9208 -2254672 -2222842 -2208777 -2233739 -2240987 -2232684 -2241305 -2224306 -2213295 -2224106 -2270837 -2294245 -2278160
$$ [...]
##END NTUPLES=NMR SPECTRUM
##END=
