##TITLE=Analysis number 314652
Compound Code cc 46901
Book Reference 422/117
Project Code adrs
Chemist Name robb
##JCAMPDX= 6.0         $$ Bruker NMR JCAMP-DX V2.0
##DATA TYPE= NMR SPECTRUM
##DATA CLASS= NTUPLES
##ORIGIN= Bruker BioSpin GmbH
##OWNER= NMR
$$ XWIN-NMR		Version 3.5
$$ Mon Oct 24 08:54:05 2005 GMT Daylight Time (UT+1h)  MAYBRIDGE\NMR@NMR_250MHZ
##.OBSERVE FREQUENCY= 250.131544655141
##.OBSERVE NUCLEUS= ^1H
##.ACQUISITION MODE= SIMULTANEOUS (DQD)
##.ACQUISITION SCHEME= undefined
##.AVERAGES= 16
##.DIGITISER RES= 18
##SPECTROMETER/DATA SYSTEM= dpx250
##.PULSE SEQUENCE= zg30
##.SOLVENT NAME= DMSO
##.SHIFT REFERENCE= (INTERNAL, DMSO, 0, 16.522)
##AUDIT TRAIL= $$ (NUMBER, WHEN, WHO, WHERE, WHAT)
$$ ##TITLE= Audit trail, XWIN-NMR		Version 3.5
$$ ##JCAMPDX= 5.01
$$ ##ORIGIN= Bruker BioSpin GmbH
$$ ##OWNER= NMR
$$ C:\u/data/dgb/nmr/ADRS/11250/pdata/1/auditp.txt
$$ ##AUDIT TRAIL=  $$ (NUMBER, WHEN, WHO, WHERE, WHAT)
(   1,<2005-10-24 08:53:28.44 +100>,<MAYBRIDGE\NMR>,<NMR_250MHZ>,
      <created by zg, POWCHK disabled, PULCHK disabled
       configuration hash MD5:
       62 19 C7 07 E1 42 D1 B7 37 6C 3D D0 77 39 F9 E6
       data hash MD5: 64K
       24 FA E6 AC AF 09 47 1F D8 E5 DE 54 87 DA 4A A4>)
(   2,<2005-10-24 08:53:46.22 +100>,<MAYBRIDGE\NMR>,<NMR_250MHZ>,
      <Start of raw data processing
       ef LB = 0.3 FT_mod = 6 PKNL = 1 SI = 32K 
       data hash MD5: 32K
       14 7B 89 89 3F 7B 96 5C CF 81 B7 41 ED F2 14 35>)
(   3,<2005-10-24 08:53:51.63 +100>,<MAYBRIDGE\NMR>,<NMR_250MHZ>,
      <apk 
       data hash MD5: 32K
       65 1D D5 61 C7 42 84 99 F1 58 23 33 F0 3D 4E 92>)
(   4,<2005-10-24 08:53:53.50 +100>,<MAYBRIDGE\NMR>,<NMR_250MHZ>,
      <abs ABSG = 5 
       data hash MD5: 32K
       80 72 3D A1 23 B9 0D 4D 1A 4D 57 E9 97 B0 30 3A>)
$$ ##END=
$$ 
$$ hash MD5
$$ 57 2C 33 D2 67 9E 7D 19 34 06 EC 46 F0 DA 55 28
##$RELAX= 
##$RELAX= 
##$RELAX= 
##$RELAX= 
##$RELAX= 
##$RELAX= 
##$RELAX= 
$$ Bruker specific parameters
$$ --------------------------
##$DU= <C:\u>
##$EXPNO= 11250
##$NAME= <ADRS>
##$PROCNO= 1
##$TYPE= <nmr>
##$USER= <dgb>
##$AMP= (0..31)
100 100 100 100 100 100 100 100 100 100 100 100 100 100 100 100 100 100 
100 100 100 100 100 100 100 100 100 100 100 100 100 100 
##$AQSEQ= 0
##$AQ_mod= 3
##$AUNM= <au_zg>
##$AUTOPOS= <4 >
##$BF1= 250.13
##$BF2= 250.13
##$BF3= 250.13
##$BF4= 250.13
##$BF5= 500.13
##$BF6= 500.13
##$BF7= 500.13
##$BF8= 500.13
##$BYTORDA= 1
##$CFDGTYP= 0
##$CFRGTYP= 5
##$CHEMSTR= <none>
##$CNST= (0..31)
1 1 145 1 1 1 1 1 1 1 1 1 1 1 1 1 1 1 1 1 1 1 1 1 1 1 1 1 1 1 1 1 
##$CPDPRG= <>
##$CPDPRG1= <>
##$CPDPRG2= <>
##$CPDPRG3= <>
##$CPDPRG4= <mlev>
##$CPDPRG5= <mlev>
##$CPDPRG6= <mlev>
##$CPDPRG7= <mlev>
##$CPDPRG8= <mlev>
##$CPDPRGB= <>
##$CPDPRGT= <>
##$D= (0..31)
0 1 0 0 0 0 0 0 0 0.06 0 0 0 0 0 0 0.0002 0 0 0 0 0 0 0 0 0 0 0 0 0 0 
0 
##$DATE= 1130140407
##$DBL= (0..7)
120 120 120 120 120 120 120 120 
##$DBP= (0..7)
150 150 150 150 150 150 150 150 
##$DBP07= 0
##$DBPNAM0= <>
##$DBPNAM1= <>
$$ [...]
##$SUBNAM7= <"">
##$SUBNAM8= <"">
##$SUBNAM9= <"">
##$SW= 20.6930455092707
##$SWIBOX= (0..15)
0 0 3 0 0 0 0 0 0 0 0 0 0 0 0 0 
##$SW_h= 5175.983436853
##$TD= 65536
##$TD0= 1
##$TE= 296.16
##$TE2= 300
##$TE3= 300
##$TEG= 300
##$TL= (0..7)
0 120 120 120 120 120 120 120 
##$TP= (0..7)
150 150 150 150 150 150 150 150 
##$TP07= 0
##$TPNAME0= <>
##$TPNAME1= <>
##$TPNAME2= <>
##$TPNAME3= <>
##$TPNAME4= <>
##$TPNAME5= <>
##$TPNAME6= <>
##$TPNAME7= <>
##$TPOAL= (0..7)
0.5 0.5 0.5 0.5 0.5 0.5 0.5 0.5 
##$TPOFFS= (0..7)
0 0 0 0 0 0 0 0 
##$TUNHIN= 0
##$TUNHOUT= 0
##$TUNXOUT= 0
##$USERA1= <user>
##$USERA2= <user>
##$USERA3= <user>
##$USERA4= <user>
##$USERA5= <user>
##$V9= 5
##$VALIST= <valist>
##$VCLIST= <CCCCCCCCCCCCCCC>
##$VD= 0
##$VDLIST= <DDDDDDDDDDDDDDD>
##$VPLIST= <PPPPPPPPPPPPPPP>
##$VTLIST= <TTTTTTTTTTTTTTT>
##$WBST= 1024
##$WBSW= 4
##$XGAIN= (0..3)
0 0 0 0 
##$XL= 0
##$YL= 0
##$YMAX_a= 284305
##$YMIN_a= -356506
##$ZGOPTNS= <>
##$ZL1= 120
##$ZL2= 120
##$ZL3= 120
##$ZL4= 120
##$ABSF1= 16.522
##$ABSF2= -4.171173
##$ABSG= 5
##$ABSL= 3
##$ALPHA= 0
##$AQORDER= 0
##$ASSFAC= 0
##$ASSFACI= 0
##$ASSFACX= 0
##$ASSWID= 0
##$AUNMP= <proc_1d>
##$AZFE= 0.1
##$AZFW= 0.1
##$BCFW= 0
##$BC_mod= 0
##$BYTORDP= 0
##$COROFFS= 0
##$CY= 12.5
##$DATMOD= 1
##$DC= 0
##$DFILT= <>
##$DTYPP= 0
##$F1P= 14.0000005364418
##$F2P= -0.99999901652339
##$FCOR= 0.5
##$FTSIZE= 32768
##$FT_mod= 6
##$GAMMA= 0
##$GB= 0
##$INTBC= 1
##$INTSCL= 1
##$ISEN= 128
##$LB= 0.3
##$LEV0= 0
##$LPBIN= 0
##$MAXI= 10000
##$MC2= 0
##$MEAN= 0
##$ME_mod= 0
##$MI= 0
##$NCOEF= 0
##$NC_proc= -3
##$NLEV= 6
##$NOISF1= 0
##$NOISF2= 0
##$NSP= 0
##$NTH_PI= 0
##$NZP= 0
##$OFFSET= 16.522
##$PC= 1
##$PHC0= -84.71465
##$PHC1= 6.999938
##$PH_mod= 1
##$PKNL= yes
##$PPARMOD= 0
##$PSCAL= 4
##$PSIGN= 0
##$REVERSE= no
##$SF= 250.13
##$SI= 32768
##$SIGF1= 0
##$SIGF2= 0
##$SINO= 400
##$SIOLD= 32768
##$SREGLST= <1H.DMSO>
##$SSB= 0
##$STSI= 32768
##$STSR= 0
##$SW_p= 5175.98343685301
##$SYMM= 0
##$S_DEV= 0
##$TDeff= 65536
##$TDoff= 0
##$TI= <Analysis number 999999
Compound Code 99
Book Reference 9
Project Code 9>
##$TILT= no
##$TM1= 0
##$TM2= 0
##$TOPLEV= 0
##$USERP1= <user>
##$USERP2= <user>
##$USERP3= <user>
##$USERP4= <user>
##$USERP5= <user>
##$WDW= 1
##$XDIM= 32768
##$YMAX_p= 437245972
##$YMIN_p= -117167
$$ End of Bruker specific parameters
$$ ---------------------------------
##NTUPLES= NMR SPECTRUM
##VAR_NAME=  FREQUENCY,     SPECTRUM/REAL,   SPECTRUM/IMAG
##SYMBOL=    X,             R,               I
##VAR_TYPE=  INDEPENDENT,   DEPENDENT,       DEPENDENT
##VAR_FORM=  AFFN,          ASDF,            ASDF
##VAR_DIM=   32768,         32768,           32768
##UNITS=     HZ,            ARBITRARY UNITS, ARBITRARY UNITS
##FACTOR=    0.157963299565203, 1,           1
##FIRST=     4132.6476996994, 0,             0
##LAST=      -1043.33573715361, 0,           0
##MIN=       -1043.33573715361, -117167,     0
##MAX=       4132.6476996994, 437245972,     0
$$ Real data points
##PAGE= N=1
##DATA TABLE= (X++(R..R)), XYDATA
$$ [...]
18881E3332j1379N885K0355J4108j8909l1851k4551M1510K8596k907L05L879J9527
18868I7900j8761j5570J73j4922l0047n055O515J1708K2990L953j9530r817J3874
18855D3411L2164J3295j3335n066K8413K9O729j1506m0398q792q535j3797L9305
18842F1917J6270n155P198J4552k878L510K671J8032M408J3560R250j4581K89
18829A29043r274k7805j7632K438l817J3625j0305j5734l2179j3472J1316r38
18817B5266Q60Q834J902J2247K5744o079k2446o223L3505Q863j3752j6367r465
18804D2889L1344J4245L576j825j7451n6943l5554K693j0158j5591R655K2018
18792a1102K2184J7765Q74k9177L1632L1279k851m199j8839j1966j5283Q436j8339
$$ plain form
18881 53332 41953 47838 68193 82301 63392 31541 6990 48500 77096 74189 74494 78373 97900
18868 97900 79139 63569 63742 48820 18773 13718 20233 31941 54931 58884 39354 29537 43411
18855 43411 75575 88870 75535 70469 98882 98911 105640 94134 53736 44944 36409 22612 61917
18842 61917 78187 73032 80230 94782 91904 95414 98085 116117 120525 134085 143335 128754 129043
18829 129043 119769 91964 74332 76770 72953 86578 76273 60539 28360 14888 26204 25266
18817 25266 26126 34960 36862 49109 74853 68774 46328 40105 73610 82473 68721 52354 42889
18804 42889 74233 88478 92054 90229 72778 15835 -19719 -17026 -27184 -42775 -33120 -11102
18792 -11102 11082 28847 29721 544 32176 63455 60604 56405 37566 25600 10317 18753 414
18779D14j1243J4061K3323l601j2807K6907j0394r673k4338j7401p793R784K0151
18766b610M5658L5845l1678l2725m974N205j0482k784J2258j6257j6980K1796
18754B272M5435L5265K4643j2829j304j2894K013O643j6694k9232L383p689j096
18741C7916l476J0069k9641j0155K8370K5269j3622n23j3501k3676k07n286K2937
18728B4474L1505k292j4350j9406p357J8908m68k8874N545K6080M357N434N407
18715D8963J3473K6382j6865j95R786j650k0901j9925j4414J0789N2532j0585
18703G7390n3721n925L5330K4121j2493q978P494l703k4273n953l7609L335K7151
18690B2166j203K2789p554k2054K8111J1138J1767l1475n0805J5371J3183n384
$$ plain form
18779 414 -10829 3232 26555 22954 10147 37054 26660 16987 -7351 -24752 -32545 -22761 -2610
18766 -2610 43048 78893 47215 14490 9516 14721 4239 1455 13713 -2544 -19524 2272
18754 2272 47707 82972 107615 94786 93482 80588 82601 89244 72550 43318 46701 39012 37916
18741 37916 34440 44509 14868 4713 33083 58352 44730 44207 30706 7030 6823 1537 24474
18728 24474 55979 53687 39337 19931 12574 31482 31014 2140 7685 33765 38122 43556 48963
18715 48963 62436 88818 71953 71758 81544 79894 58993 39068 24654 35443 87975 77390
18703 77390 23669 17744 53074 77195 64702 55724 63218 59515 35242 29289 -8320 -4985 22166
18690 22166 20963 43752 36198 14144 42255 53393 65160 33685 -17120 -1749 11434 6050
18678F050j1388J0817L594j4766L6622N780n984L773j2932J2574M491j7847k8199
18665g415j9045k7560R527L1467O772o603K4204J7686K795p700k2114j1874M1451
18652C1591M6111k4693j4240K0280j4830k5614j4118k5169j1948K202j345K2099
18640i674M7341r225k6153r007K3126Q306m1369n7295J1324L3411L90J4834r149
18627b3140p402K396K8917K1736L3120J5417k2487p487K8394j3415m1651O097
18615B0495Q455K4657p784l3352j2241J4833p277q242J167j0532j7256K9801Q4
18602B808j0641R057O52J6994R529K321j1464K6900K666m265K1036K0378o526
18589G9445k6875l4471Q904r752K1887J8338K5585n943j6480l4q340j867J3382
$$ plain form
18678 6050 -5338 5479 9073 -5693 30929 36709 30725 34498 21566 34140 38631 20784 -7415
18665 -7415 -26460 -54020 -44493 -13026 -6254 -12857 11347 29033 31828 24128 2014 -9860 31591
18652 31591 77702 53009 38769 59049 44219 18605 4487 -20682 -32630 -30428 -31773 -9674
18640 -9674 37667 28442 2289 -6718 16408 24714 -16655 -73950 -62626 -29215 -28825 -13991 -23140
18627 -23140 -30542 -28146 771 22507 55627 71044 48557 41070 69464 56049 14398 20495
18615 20495 28950 53607 45823 12471 230 15063 7786 -456 711 -9821 -27077 2724 2808
18602 2808 -7833 1224 1876 18870 28399 30720 19256 46156 48822 44557 65593 85971 79445
18589 79445 52570 18099 27003 17251 39138 57476 83061 77118 60638 60604 52264 50397 63779
18576F3779k872j4965q029j3348K6230L1916n113N071J6526r03j3589j5465l0602
18563C8636n552N878L465r943J7287J5150j2094j9748K1966O021J8252p704j1235
18550F0379j0084l3381j9060K0296R254R275m875M794K8296K0j5516j5809J5875
18537D9464K9332O335q099K4782J9250k0852j8341P076k1305j5220L0157K727
18525H5306j0430j4300J5664M8012n848r814j1676j7190L160J7971l8034P74J1770
18512G5365k5326K6286K6056k0475p866j3550M709j2064k3986R58K6473J2566
18500F9146m80k0977J3190K2461k6389k6329K1975K0921k9683k4512J3040O163
18488C8526p213J3351J4679K186J5268l973M320j050L283J4798l166l0237J0365
$$ plain form
18576 63779 60907 45942 37913 24565 50795 82711 77598 82669 99195 98292 84703 69238 38636
18563 38636 33084 38962 42427 32484 49771 64921 52827 33079 55045 61066 79318 71614 60379
18550 60379 50295 16914 -2146 18150 27404 36679 31804 36598 64894 64914 49398 33589 49464
18537 49464 78796 85131 77032 101814 121064 100212 81871 88947 67642 52422 82579 85306
18525 85306 74876 60576 76240 124252 118404 108590 96914 79724 82884 100855 62821 63595 75365
18512 75365 50039 76325 102381 81906 74040 60490 65199 53135 29149 30107 56580 69146
18500 69146 68666 47689 60879 83340 56951 30622 52597 73518 43835 19323 32363 38526
18488 38526 31313 44664 59343 61529 76797 72824 77144 76094 79377 94175 91009 60772 71137
18475G1137K8835j5176m6339k4445O745K0248l665j0971j0345M246K2306j7353
18463B5223o322J5022J6604R676O820J3650J7336n565k4422j463j58m156J4239
18450G6484q083k5632K1734N0260L3443M5018N4453N2401M1283r08l5781j4837
18438B89835K7959n7296j3855M342J3418P6165N3603J539j0288m224k2711l8704
18426C19783R166m519k5082l5703o5392n7056l4945J0413j9441M198J2667J3620
18414A27709J0485J1612j2552k540k0265l9638k0606j1603j4545J7790j8315J1233
18402C8765K4645K3419K2524j9504l9221j3837q0l501J3396J9283k0902j3582
18390C1405k0231J7130J3299J6173J3776L459l7796k2454J7465K5623j0639J4676
$$ plain form
18475 71137 99972 84796 38457 14012 20757 41005 37340 26369 16024 20270 42576 25223
18463 25223 18901 33923 50527 60203 67023 80673 98009 92444 68022 66559 66401 62245 76484
18450 76484 68401 42769 64503 114763 148206 193224 247677 300078 341361 340453 304672 289835
18438 289835 317794 260498 246643 250985 264403 340568 394171 395710 385422 381198 358487 319783
18426 319783 328949 324430 299348 263645 198253 141197 106252 116665 97224 101422 114089 127709
18414 127709 138194 149806 137254 134714 114449 74811 54205 42602 28057 45847 27532 38765
18402 38765 63410 86829 109353 89849 50628 36791 36711 33210 46606 65889 44987 31405
18390 31405 11174 28304 41603 57776 71552 75011 37215 14761 32226 57849 47210 61886
18378F1886o60J390L721m463l0190k2166M830k314J3254J9750j639j3883j0657
18365A8859k876O979j9888P940M1635J1169k5604j855k1127k0344J8045K4876
18353C7809K3687K5494m313J035o049j2757J140n814l4625j9114J7268K3241o793
18340D0209J6346j4161M457J5889J6033l4227j294Q967o578J5654K3862j7445
18328F7712k2585K1872J1382j0052k0268K663K0232j8382r899J2081O457O282
18316F7495j5591m680J5014j9533k2372L0047J1523K8855Q665l412j4838M260
18304H5433P180k4767l7501K982J607j0962J796O67L7846j4857q064Q049J931
18291E1340k6221K4989K4420k5557q868k6213l366L3766L3734l683J595m679K443
$$ plain form
18378 61886 61226 62616 66337 61874 31684 9518 14348 12034 25288 45038 43399 29516 18859
18365 18859 15983 22962 3074 11014 52649 63818 38214 36359 15232 -5112 12933 37809
18353 37809 61496 86990 82677 83712 77663 64906 66046 60232 25607 6493 23761 47002 40209
18340 40209 56555 42394 46851 62740 78773 44546 43252 52219 45641 61295 85157 67712
18328 67712 45127 66999 78381 68329 48061 50724 70956 52574 42675 54756 61213 67495
18316 67495 51904 47224 62238 42705 20333 50380 61903 90758 99423 96011 81173 85433
18304 85433 92613 67846 30345 33327 34934 23972 25768 26435 64281 49424 41360 49409 51340
18291 51340 25119 50108 74528 48971 40103 13890 10524 44290 78024 74341 75936 71257 73700
18278G3700M2428l2567l2878K953o220J7527j1228k5826m6238k6256K444N4068
18266A1907K3177J3631k498j5112J569K2636o127m7285K2614J4850K9781J4257
18254H3400k2916j4461m483r777J7825M6360L6861K9953M8735L4842M5498N9550
18242C51387j8504O981J1318j8135m2755m3123j7500m4059l1299o795Q28r269
18230A39075l0482K3141L7210K8217L7660M1032L8330P9091Q6930K5617M8561
18219E54382J6172M8997N6687N5326N8877M8964n498j13591j48290r5148o1437
18208D15441j7355l5031l3216l3188l5874j421k7585l8359l0904r881o740O735
18196A52622K975l2837j5960J128p062K162O490j1662K3208N276Q007k6906q358
$$ plain form
18278 73700 116128 83561 50683 53636 47416 64943 53715 27889 -18349 -44605 -42161 11907
18266 11907 35084 48715 46217 31105 32674 55310 49183 1898 24512 39362 69143 83400
18254 83400 60484 46023 41540 31763 49588 95948 132809 162762 211497 246339 291837 351387
18242 351387 332883 339864 351182 333047 290292 247169 229669 185610 154311 147516 148344 139075
18230 139075 108593 131734 168944 197161 234821 275853 314183 393274 480204 505821 554382
18219 554382 570554 619551 676238 731564 790441 839405 833907 720316 572026 476878 415441
18208 415441 398086 363055 329839 296651 260777 259356 231771 193412 162508 152627 145887 152622
18196 152622 155597 122760 106800 107928 100866 103028 109518 97856 121064 126340 134347 107441 99083
18183I9083R976Q632l29o605n095q979k1291m7607j4110N3488L4312J7502l5606
18170H3371q630K675o223k2904k7209J2090J1448j4909J5801K2857K894J7007
18158H8268J9514n140j7798q377J6665r167K127k003l321J3649m590Q702L483
18145A02012k6328n76R956j0332j5517M944R213p536J1738J5526J6750q256j6689
18132H4905K9331k547j4560J1631P166m639j6256k1213J3388m004l9177K7821
18120G1846P312p440J262J734M1071M420l4401p3J6680K40k4587O259Q001Q319
18106A00643k9848j9509l3654J3353l041J8636Q774K085J4049K200J1j2174n792
18093E5733O57J7963j4030L0518K3393R841P153N892l1466j1351p982j964r096
$$ plain form
18183 99083 109059 117691 117362 110757 105662 96683 75392 27785 13675 67163 101475 118977 83371
18170 83371 74741 77416 71193 48289 21080 33170 44618 29709 45510 68367 71261 88268
18158 88268 107782 102642 84844 76467 93132 83965 86092 84089 80768 94417 89827 98529 102012
18145 102012 75684 75108 85064 74732 59215 64159 73372 65836 77574 93100 109850 101594 84905
18132 84905 114236 111689 97129 108760 115926 111287 95031 73818 87206 83202 44025 71846
18120 71846 79158 71718 72980 74714 115785 120205 85804 85731 102411 102651 78064 84323 92324 100643
18106 100643 70795 51286 17632 30985 27944 46580 55354 57439 71488 73688 73699 61525 55733
18093 55733 56390 74353 60323 90841 114234 124075 131228 137120 105654 94303 86321 84357 75261
18080G5261n59K568K6201j1287j650L1109P099O358Q9K5926P930l7720j8421m4314
18066F8590N225k37j5640J7389L182J4127Q854p6L424j5502J097j0959J7703J8581
18052A15758j5245j0652P895o768J5075P452j7216k478p314j1903q82J3042o756
18039H0008p212J3929j5701q654q944r804K3446K1819N82l632L986J3418p377
18026I5864k0634K2353K997j2746k5J0132l943K2381j7098k6411K5409J1986J3154
18013A23419K4893k9652l7339R088J3060M745j6936k6836R97l289J001J5299R044
18000H7494K7190J6132p569J4886J3282k8790r254L031k1157n261o908k036m475
17987G6565j613J7168J1767M215R900l3521r295L6110J0420L94K3755J3398K2193
$$ plain form
18080 75261 74702 77270 103471 92184 90534 121643 128742 135100 135189 161115 169045 131325 112904 68590
18066 68590 73815 73578 57938 75327 78509 92636 101490 101414 104838 89336 90433 79474 97177 115758
18052 115758 100513 89861 97756 90988 106063 113515 96299 93821 86507 74604 73722 86764 80008
18039 80008 72796 86725 71024 62370 53426 43622 67068 88887 89469 85837 89823 103241 95864
18026 95864 75230 97583 100580 87834 87809 97941 93998 116379 99281 72870 98279 110265 123419
18013 123419 148312 118660 81321 90409 103469 108214 91278 64442 65439 62150 63151 78450 87494
18000 87494 114684 130816 123247 138133 151415 122625 113371 116402 95245 89984 83076 81040 76565
17987 76565 74952 92120 103887 108102 118002 84481 75186 111296 121716 122110 145865 159263 181456
17974A81456k6091k0708j4223Q805j2173k2123o120K2467J0589J0844K0690L1504
17962A84917K2449j367j7085J1556k5662j8183P04n977M780P663K1202k486k9506
17949A53005l1176j3158l2302K368N2325L5457K0045J2542K8477m9207n1882j1387
17937A15107J8574M37J6081M263o478j460M129M737K424K2351J5420L582J4692
17924B13859P89o4380j2051J2777J7251J685O885N427O316M6976K3166P53q098
17911B51355J3863j0009j6784R038P486K8502L8956L8288M3488K2042j7546k6144
17899C82535j6542n254m2211m3016m0828k9565K2843k02k9610L52L92j5056M507
17886A88345J6023K4j1224K6091Q319j112J4959J0423M367j3403l2748j0809K8645
$$ plain form
17974 181456 155365 134657 120434 129239 117066 94943 88823 111290 121879 132723 153413 184917
17962 184917 207366 205999 188914 200470 174808 156625 157329 151352 156132 163795 184997 182511 153005
17949 153005 121829 108671 76369 78737 131062 166519 186564 199106 227583 178376 126494 115107
17937 115107 133681 134118 150199 154462 147984 146524 150653 155390 157814 180165 195585 199167 213859
17924 213859 214648 150268 138217 150994 168245 169930 176815 182242 188558 235534 258700 259453 251355
17911 251355 265218 255209 238425 247463 254949 283451 322407 360695 404183 426225 408679 382535
17899 382535 365993 360739 318528 275512 234684 205119 227962 227760 198150 198502 198894 183838 188345
17886 188345 204368 204392 193168 219259 227578 226466 241425 251848 256215 242812 210064 199255 227900
17873B27900P03K4846j7431k4661M108p100K6475L9292R120J2523k1894j1996
17861B61885j692K498j2002k5081L556j4540k1851M419j2434K6545M2463j6802
17849B36964k712L4709P829j7071l549k5729P972N351J9567j7309K2632N275N616
17836B79545m0329l2387j0856j009N8547N2776J7180n426k0989n44r203l837o216
17823B77252P38n14n875p993K2777L9601J7823q847k5174j5468k3699k5r365L313
17809B64544J9052J262K9762m663l3508j098K1290J6322J4630K4077M9185M9794
17797D50649J0082J0250L5358K9574Q061K4711J946o814j7963l172J2627N734
17785E61043J7503j3725Q893J2132L9962J4058J1851J2752Q712K6387L1382M9640
$$ plain form
17873 227900 228603 253449 236018 211357 215465 208365 234840 274132 283252 295775 273881 261885
17861 261885 260193 262691 250689 225608 229164 214624 192773 197192 184758 211303 253766 236964
17849 236964 234252 268961 276790 259719 256170 230441 238413 243764 263331 246022 268654 273929 279545
17836 279545 239216 206829 195973 194964 253511 306287 323467 318041 297052 296508 287305 283468 277252
17823 277252 277990 277476 271601 263608 286385 325986 343809 334962 309788 294320 270621 270596 261231 264544
17809 264544 283596 284858 314620 309957 276449 275351 296641 312963 327593 351670 400855 450649
17797 450649 460731 470981 506339 535913 543974 568685 570631 563817 545854 542682 555309 561043
17785 561043 578546 564821 573714 585846 625808 639866 651717 664469 673181 699568 730950 780590
17773G80590L5543m7389o4341q1386m7260j9332M944K6867M3168J8204L5012M5674
17761G30294J9304O293K7946k4150k6362J8733M4235J8209m257o973N227j7801
17749G90698k9966n7321j0095N1007L0514L576k666K0812P58K28K5444J4352o970
17736H30371R809m434R456M0204N8899O913k9933Q709M599M0843K5086L0447M3430
17723A074399M5495M2099N0766Q1206J06783J04482Q9806O2618O3455M0691M5334
17712A807134Q1939Q5534O2365L8580O5809Q5680R4819J34900R6673J33869J27893
17701B815195J24056J91103K64963L55252M83329O07692P27465Q99339J233233
17692G701627J719373K456281L515661N106271P343676R456338R450539N553899
$$ plain form
17773 780590 816133 768744 704403 623017 575757 556425 561369 588236 631404 649608 684620 730294
17761 730294 749598 755891 783837 759687 733325 752058 796293 814502 810245 803272 808499 790698
17749 790698 760732 703411 693316 744323 774837 778413 775747 796559 797317 797545 822989 837341 830371
17736 830371 840180 835746 845202 885406 944305 951218 921285 929994 934593 975436 1000522 1030969 1074399
17723 1074399 1119894 1161993 1212759 1293965 1400748 1505230 1595036 1657654 1721109 1761800 1807134
17712 1807134 1889073 1974607 2036972 2075552 2141361 2227041 2321860 2456760 2553433 2687302 2815195
17701 2815195 2939251 3130354 3395317 3750569 4233898 4841590 5569055 6468394 7701627
17692 7701627 9421000 11877281 15392942 20499213 27842889 37299227 46749766 52303665
17684E2303665N53715j280925P43407J279569k896665q021900r799459p303069
17676B5578338m446195k554907j293976m70217J27876O39996J366306K347752
17668B1294973L581838N304801P677836R989885R929361N391217k55189k020005
17660F0894717M78089J224410l173828q354500r792693p000309l690811j047804
17652B9537271J349366L815431O573796J0193147J5847878K4371809L2833782
17645A24522480L2610557J4533026j5725941l5968087l5188476k3959300j4658199
17638D6166060r126607n920311m014213k856125j958507j248695q96323r71455
17630A9173824j411591j794892j830037j645819j398787j209131j051512q96492
$$ plain form
17684 52303665 52857380 51576455 52319862 53599431 50702766 42680866 32881407 25578338
17676 25578338 21132143 18577236 17283260 16813043 16940919 17580915 18947221 21294973
17668 21294973 24876811 30181612 37859448 47849333 57778694 63169911 62914722 60894717
17660 60894717 61372806 62597216 59423388 51068888 41276195 34275886 30585075 29537271
17652 29537271 30886637 34702068 41275864 51469011 67316889 91688698 124522480
17645 124522480 157133037 171666063 155940122 119972035 84783559 60824259 46166060
17638 46166060 37039453 31119142 27104929 24248804 22290297 21041602 20145279 19173824
17630 19173824 17762233 15967341 14137304 12491485 11092698 9883567 8832055 7935563
17622G935563q09424o25422m30939l53325l65096m96616n77166n21805m41434
17613C314336l54076k86297k53356k27570k13997k00066j60415j46695j46818
17604A325046j23144j00962r7174p0490n4714j01109p4948q4730o5788m7587m0569
17593D63831k8823l6288k2219k8006m0522n9226k315j1406j9818m3749p85L530
17581A74204j3351M865n914N095m08l4342k2661o853J1581P316j622L3889J8751
17568A70550j1761k4018j7454j0521q419M2687L9597N372Q866J7416j3423j1650
17556A87242k2672k4057O49l1777j7263j4659o415J2163l3614m001p092o178K4379
17543E6705L2936k3587k8214K2943J8104M3254r532J479J9241J0386q887k1359
$$ plain form
17622 7935563 7126139 6500717 6069778 5716453 5351357 4854741 4277575 3755770 3314336
17613 3314336 2960260 2673963 2420607 2193037 1979040 1778974 1618559 1471864 1325046
17604 1325046 1201902 1100940 1003766 933276 878562 777453 702505 617775 551987 504400 463831
17593 463831 435008 398720 376501 348495 307973 248747 246432 235026 215208 171459 170674 174204
17581 174204 160853 165718 159804 164899 164491 130149 107488 100635 112216 119532 117910 151799 170550
17568 170550 158789 134771 117317 106796 98377 141064 180661 186033 194899 212315 198892 187242
17556 187242 164570 140513 141162 109385 92122 77463 71048 83211 49597 45596 38504 32326 56705
17543 56705 89641 66054 37840 60783 78887 122141 112609 114088 133329 143715 134828 113469
17531A13469j2062k8019j756M186k5005k358L1612K7120R421J5584M2480N2811
17519B27483M9813L5968k2660o0740r4467o2657k5277J0326K8117j7775K772o434
17507F4469p534m359J4208o391j926M22j176p407K093k486m023J5791K7876k2696
17493F6861j4518Q811o342J3969K7589m6221J3768J5255N847l166k0876q377J7068
17480F9668K4231J6439L351k5571k7888l4373K54K3399K7529J5659N782K3218
17468A21698K2937J5144Q683K7423q804m602k9754M50J6851N756m901l501J2187
17455A79567J011n682J843k6849r74K1232J7674j316k9653J198j5810j048K467
17442A43660J2478L2639R835M868j9466J471j061m650j7240j8034J2078J4162
$$ plain form
17531 113469 101407 73388 71632 75818 50813 48455 80067 107187 116608 132192 174672 227483
17519 227483 277296 313264 290604 229864 135397 72740 47463 57789 85906 68131 70903 64469
17507 64469 56935 52576 66784 60393 58467 58889 57713 50306 52399 49913 45890 61681 89557 66861
17493 66861 52343 61154 54812 68781 96370 50149 63917 79172 85019 81853 60977 52600 69668
17480 69668 93899 110338 113689 88118 60230 25857 26111 49510 77039 92698 98480 121698
17468 121698 144635 159779 168462 195885 187081 182479 152725 153175 170026 175782 170881 167380 179567
17455 179567 180578 174896 176739 149890 148916 170148 187822 186506 156853 158051 142241 141193 143660
17442 143660 156138 188777 198612 203480 184014 185485 184424 179774 162534 144500 156578 170740
17430A70740m0217m4409O631M232k876o185J0080k2365m089R666J1295J5770l8955
17417F9318l6947N227M5763J2368p141P284j706p504l6614l7618j6530L896L7477
17404C7273K2513R366J4879Q511j5359j1155j4830k0564R193L958j599j2143j4248
17391A5795j447L7778L1064J806K378J2021r186J6322J157J0440J8953m298j7961
17378A14822K6834J7549k9134J996J1416J5723J585p628l6835j2200n922J3413
17366A11619M3040J5307j4998j8589L788n820j5045K6087K8199j4719j5518K8909
17354A72260K1603K5196J945l5833k0208q972J523L0650J3038k2832k0528K0068
17342A77910J2422l07m429k4017j5851J4493J5536n043j3472N686L5607J3806
$$ plain form
17430 170740 130523 86114 92745 96977 94101 87916 97996 75631 71542 81208 92503 108273 69318
17417 69318 32371 37598 83361 95729 88588 95872 94166 86662 50048 12430 -4100 -204 37273
17404 37273 59786 69152 84031 92542 77183 66028 51198 30634 39827 43785 42186 30043 15795
17391 15795 14348 52126 83190 84996 87374 99395 90209 106531 107688 118128 137081 132783 114822
17378 114822 141656 159205 130071 132067 143483 159206 160791 153163 116328 104128 98206 111619
17366 111619 154659 169966 154968 136379 140167 134347 119302 145389 173588 158869 143351 172260
17354 172260 193863 219059 221004 185171 164963 155991 157514 188164 201202 178370 157842 177910
17342 177910 190332 190025 185596 161579 145728 160221 175757 170714 157242 162928 198535 212341
17330B12341J0886l1302j4106p168J5125k1593j5530K2672O510j7782l5892L226
17318A27387J5285K1019L6006L2330j0447o841K1350p574n842J1850n57J53l286
17305B30833P859L3128K9357K554j090o174O2j6757p47L5722J8250K5622J8484
17292C77103j1307K6665L4420q698j1099K802N968k09J3203M2217L5375L3457
17280E39897L7159Q541J393j9087Q808M1690J3330L3956K5162J3719L5803N8749
17268G99120N7972O2243L7054j466k0600K5180O9904J10706J24427J32656J15776
17257A512972P4858O1714N5738N1544P8127J25585J51363K10643K81130L35111
17247B938785L52971L66560M59278O19055R27522J417621K060801K986365M414377
$$ plain form
17330 212341 223227 191925 177819 170651 185776 164183 148653 171325 177835 160053 124161 127387
17318 127387 142672 163691 199697 232027 221580 214739 236089 228515 222673 234523 233966 234119 230833
17305 230833 238692 271820 301177 303731 302641 296467 296529 279772 279025 314747 332997 358619 377103
17292 377103 365796 392461 426881 418183 407084 409886 415854 415645 428848 471065 506440 539897
17280 539897 577056 585597 586990 567903 576711 618401 631731 665687 690849 704568 740371 799120
17268 799120 857092 919335 956389 954923 934323 959503 1029407 1140113 1264540 1397196 1512972
17257 1512972 1587830 1649544 1705282 1756826 1834953 1960538 2111901 2322544 2603674 2938785
17247 2938785 3291756 3658316 4117594 4736649 5664171 7081792 9142593 12128958 16543335
17238A6543335O793660R914578J0837159O002666n251129j1551672q312583m350041
17230B0625973j659281L06690K073530M109192O956130R559476Q640858J781295
17222E2393863q421836j0277922o437716k976430m08882J872891M638479P634760
17214C8017207Q353004L969034n489884j0340192p665714m413802k077773k87860
17206B0064020J343319L307255O068598Q682201P743597P46680r623555j0923716
17198B7408399p246233m549419k962231j991962j403808j016961p20438m86386
17190G030961l35423l14706m02808n55767n87750n80525n08917m37602l37010
17181B970453k65840k26569j78106j52854j62117j93578j88425j90150j45704
$$ plain form
17238 16543335 23336995 33251573 44088732 50091398 44840269 33288597 24976014 20625973
17230 20625973 18966692 19273382 21346912 25456104 32412234 41971710 50612568 52393863
17222 52393863 43972027 33694105 27256389 24279959 23871077 25743968 30382447 38017207
17214 38017207 46370211 50339245 44849361 34509169 26843455 22429653 20351880 20064020
17206 20064020 21407339 24714594 30783192 39465393 47208990 47955670 38332115 27408399
17198 27408399 20162166 15612747 12650516 10658554 9254746 8237785 7517347 7030961
17190 7030961 6695538 6380832 5978024 5422257 4834507 4253982 3745065 3307463 2970453
17181 2970453 2704613 2478044 2299938 2147084 1984967 1791389 1602964 1412814 1267110
17172A267110j13463p7682r1327j07163q4807k5850k0518j8162n7233m9220p5970
17161E45715q4944q7092l5211k1432l9862m2303n481j451k4729m2481k9071k6083
17149A05575o416k2829j2569J2750L1721k8184l1328K5209J2350n582J5855j6914
17137G9638p794J9217j4177k9214j2371p689k494L1273K1529K0627J4101r818
17125A02828L286M790O066J2001K2352M6033N5408M4793n547j8843J6307K822
17113B92296n943j993j2320m2306m044J005m6420n4733j4189j4348k67M2877L3807
17100A73422L4394N3292M1360L4918j6426l5088l547l0899j94K8629K2205Q523
17088C10589j0915k2382n6773o1200q001K7219j697R643J9580K5132P7460P0853
$$ plain form
17172 1267110 1153647 1075965 984638 877475 792668 766818 746300 728138 670905 621685 545715
17161 545715 460771 373679 338468 317036 277174 234871 229390 227939 203210 160729 131658 105575
17149 105575 99159 76330 63761 76511 108232 80048 48720 73929 86279 80697 96552 79638
17137 79638 71844 91061 76884 47670 35299 27610 25116 56389 77918 98545 112646 102828
17125 102828 106114 110904 116970 128971 151323 197356 252764 297557 292010 273167 289474 292296
17113 292296 286353 284360 272040 229734 225690 226695 180275 125542 111353 97005 96738 139615 173422
17100 173422 207816 261108 302468 337386 320960 285872 282325 251426 251232 279861 302066 310589
17088 310589 299674 277292 220519 159319 151318 178537 176840 186483 206063 231195 308655 379508
17076C79508j744j577L2102L1283O3283O3859R9350N1760M125l8155p8178j05564
17064E00052j07662q0242m2704k9371k3906j0061k620K5284J7757k5358n075k3261
17052A92833m0569l2491m5215O761J1013j5028J063j8985l4807J253J1972J1496
17040D9296k1567j2197j149k1852l656j1274m011p69j6780J0682M939k679q108
17027c9125o656K1519Q752J021o595n178L6626R485l4626l2689P701L2269N154
17014b342M173L5598j6663j3397J207l5238j0591Q139J3483K483j65k71m2089
17001e5673m4342K932m133j4093N210K3371K8567K4104J9659k7592j4107J5596
16989d0501j3357j4248K1468L9224o773o769K22M3990J2500j2056l1910l9687
$$ plain form
17076 379508 377764 376187 408289 439572 502855 566714 666064 717824 721949 683794 605616 500052
17064 500052 392390 312148 269444 240073 216167 206106 203486 228770 246527 221169 216094 192833
17052 192833 152264 119773 74558 81319 92332 77304 78367 59382 24575 25828 37800 49296
17040 49296 27729 15532 14383 -7469 -11125 -22399 -26410 -27179 -43959 -33277 -28338 -31017 -39125
17027 -39125 -45781 -24262 -15510 -14489 -21084 -26262 10364 19849 -14777 -47466 -39765 -7496 -2342
17014 -2342 1831 37429 20766 7369 8576 -26662 -37253 -29114 -15631 -13148 -13313 -13584 -55673
17001 -55673 -100015 -97083 -101216 -115309 -110099 -86728 -58161 -34057 -14398 -41990 -56097 -40501
16989 -40501 -53858 -68106 -46638 -7414 -14187 -20956 -20734 23256 35756 23700 -8210 -47897
16977d7897j4580j1545O209j460j3986L8354P167n068j2730J3268L7577k3854
16965b8545k9139j2073J1330J2554l525P395K557o841p811j4871p596J4795K2240
16952c9530j0831J7516J1437K056r276J3269M058k7355o208N864K8551j3322j9981
16939d3752l053Q477l157k0942j437j7845O552J9770L651R886J8436j1048j1777
16926d6239J4513N621k920J587O42m3438k5812J8389k1759K1523J0137k0913r549
16913i8218K2056K5211o091j6392P859K8985l115j4544j6046L421m967P523J9558
16900d4760j3035J965P066J6192k6006k992J1582L013R093R118j4168K3642J2562
16887f728l1122k5297L415J527J7981j7817M560O987L131j0957j1571l319J8639
$$ plain form
16977 -47897 -62477 -74022 -67813 -69273 -83259 -44905 -37738 -42806 -55536 -42268 -4691 -28545
16965 -28545 -57684 -69757 -58427 -45873 -49398 -42003 -39446 -46287 -54098 -68969 -76565 -61770 -39530
16952 -39530 -50361 -32845 -21408 -19352 -28628 -15359 -11301 -38656 -44864 -39000 -10449 -23771 -43752
16939 -43752 -46805 -38328 -41485 -62427 -63864 -81709 -75157 -55387 -51736 -41850 -23414 -34462 -46239
16926 -46239 -31726 -26105 -29025 -27438 -26796 -70234 -96046 -77657 -99416 -77893 -67756 -88669 -98218
16913 -98218 -76162 -50951 -57042 -73434 -65575 -36590 -39705 -54249 -70295 -66874 -71841 -64318 -44760
16900 -44760 -57795 -55830 -48764 -32572 -58578 -61570 -49988 -46975 -37882 -28764 -42932 -19290 -6728
16887 -6728 -37850 -63147 -59732 -58205 -40224 -58041 -53481 -46494 -43363 -54320 -65891 -69210 -50571
16874e0571L9110n760j0434n608m311Q060j1534k8531n869N462J5372J4979q027
16861d7662k3244O380o155K532L5376L864l9416j0735l089j9797L7280L4211K8717
16848a738p542q283k0368j6617r771l010J0579J8334J0345k579o413o903R323
16835c4643J1102n178N88m519k0781k1090l710Q599K6294O663j1180j9090k2443
16822h9388J4078M7106L292j8002q807q902L307L825m892R16P990k4306j5845
16809h9628n073j1937K9595K3941Q359K1812M052q408q038j5651L342L2036o11
16796a6209j7923J1473j6803J3506J311l1238R538O533J6975L828j4400j7551
16784e0960q96J0053J6850L1484k614L0650P197j6086q573n851L702j0628k0274
$$ plain form
16874 -50571 -11461 -17221 -27655 -33263 -37574 -29514 -41048 -69579 -75448 -69986 -54614 -39635 -47662
16861 -47662 -70906 -64526 -70681 -68149 -32773 -28909 -68325 -79060 -82149 -101946 -64666 -30455 -1738
16848 -1738 -9280 -17563 -37931 -54548 -64319 -67329 -56750 -38416 -28071 -30650 -37063 -43966 -34643
16835 -34643 -23541 -28719 -28131 -32650 -53431 -74521 -78231 -69632 -43338 -36675 -47855 -66945 -89388
16822 -89388 -75310 -28204 -24912 -42914 -51721 -60623 -57316 -53491 -58383 -57467 -49477 -73783 -89628
16809 -89628 -94701 -106638 -77043 -53102 -44743 -22931 -18879 -27287 -35325 -50976 -47634 -15598 -16209
16796 -16209 -34132 -22659 -39462 -25956 -24645 -55883 -46345 -39812 -22837 -19009 -33409 -50960
16784 -50960 -51856 -41803 -24953 6531 3917 34567 41764 25678 17105 11254 14956 4328 -15946
16771a5946j2401q961o107K563n503Q092K8494J8899n532j0497l6936m227n444
16758e3506P823j3581P041J7013j1045J3930J24l2039j6982M420n404K529K6786
16745e2891J5493J4566R085J1217o096L181J057l318k7135j4614J0128r138k5676
16732g4141M988J0560K237Q482K8817J9069j9317l084j3502r388K7409N949m304
16719a6225j3436j5487N824k0045j613K7631N82j4149K4847J9546J940K3115m446
16706A8084l5759k9539Q16J5684K6012j7886j1132p533r155j8781j8912o905M785
16693i0221J0749J8032Q510M871K7588K2494P528K525n852l291p595J0664R179
16680A5181N360M998J3541L0459J7236R583q509J5323L0119K4607r392l9197j5199
$$ plain form
16771 -15946 -28347 -37308 -43415 -40852 -46355 -38263 -9769 9130 3598 -6899 -43835 -48062 -53506
16758 -53506 -45683 -59264 -52223 -35210 -46255 -32325 -32201 -64240 -81222 -76802 -82206 -79677 -52891
16745 -52891 -37398 -22832 -13747 -2530 -8626 -5445 -4388 -7706 -34841 -49455 -39327 -48465 -74141
16732 -74141 -69153 -58593 -56356 -47874 -19057 12 -19305 -22389 -35891 -45279 -17870 -11921 -16225
16719 -16225 -29661 -45148 -39324 -59369 -60982 -33351 -32769 -46918 -22071 -2525 -585 22530 18084
16706 18084 -17675 -47214 -46398 -30714 -4702 -22588 -33720 -41253 -50408 -69189 -88101 -95006 -90221
16693 -90221 -79472 -61440 -52930 -48059 -20471 2023 9551 12076 6224 2933 -4662 6002 15181
16680 15181 20541 25539 39080 69539 86775 96358 87849 103172 133291 157898 148506 109309 94110
16667I4110l3994j6418R585J9689J9070J362n454J6295N1214K181n6406j8845
16655H2389M236J9686n9K9732N375J4656J1083l5085n3254MK5773J415l765J4993
16641A17179J6413J5439k501l8679j3826P943m477m1129k6967j386j5625J9091
16629C1475j1396l2389K0936j1028K1367K8898L968j2948K3613R803l7238m1897
16617f836j8116o742j577j8550K5574K5667j360M525K966j9132j2880k737L4733
16604E535R416j7615p816J0959K4218J0509Q497j0732k7807j7076K1166J7522
16592B6776j275m908l1735k6979r811N095J5363K6061J5145k6243n762r221j2215
16579c9709o974Q074J086j4098Q160J6949l0428N825L5956M3239L505j2423k958
$$ plain form
16667 94110 60116 43698 53283 72972 92042 93404 87950 104245 155459 157640 101234 82389
16655 82389 86625 106311 106252 135984 141359 156015 167098 132013 78759 78763 104536 105951 102186 117179
16641 117179 133592 149031 146530 107851 94025 101968 97491 56362 29395 28009 12384 31475
16629 31475 20079 -12310 8626 -2402 18965 47863 51831 38883 62496 72299 35061 -6836
16617 -6836 -24952 -31694 -33271 -51821 -26247 -580 -1940 2585 5551 -13581 -26461 -29198 5535
16604 5535 14951 -2664 -10480 479 24697 35206 43703 32971 5164 -11912 9254 26776
16592 26776 25501 20593 -11142 -38121 -47932 -42837 -27474 -1413 13732 -12511 -18273 -27494 -39709
16579 -39709 -46683 -38609 -37523 -51621 -43461 -26512 -56940 -51115 -15159 28080 31585 19162 16204
16566A6204l9114o364K7608R51j0821l5678j1107J6021j8306j5367J5178O126
16554e4669j7307K7558J914K4162M1379l3527l5172k1770j2228M980o220K9134
16542e1766N0488j0719L009J5095k5725j0320k2375J0283M9425J0157r771k727
16530E054P153K10l5262m3597N264J8101L2031K7315j1267N136k0383l1631p378
16517d9254J511L4765J3279o402j1987M959k378k8530p742J989K4494K851r603
16504c2048P890P568J4526Q01j4383k621k6975o133o811K2007k2907K7673l504
16491c4917l176n176O222j7546o629L279N219j1639q607L0221L3224J9093k8064
16478a8496k8599J9027O285n479k2506q504K6014K6887J4952n313j2967k047j889
$$ plain form
16566 16204 -22910 -29274 -1666 -715 -11536 -47214 -58321 -42300 -60606 -75973 -60795 -54669
16554 -54669 -71976 -44418 -42504 -18342 23037 -10490 -45662 -67432 -79660 -74680 -80900 -51766
16542 -51766 -1278 -11997 -8988 6107 -19618 -29938 -52313 -42030 7395 17552 7781 5054
16530 5054 12207 12417 -22845 -66442 -61178 -43077 -11046 16269 5002 10138 -10245 -41876 -49254
16517 -49254 -47743 -12978 301 -6101 -18088 -13129 -15507 -44037 -51779 -49790 -25296 -22445 -32048
16504 -32048 -24158 -16590 -2064 -1263 -15646 -18267 -45242 -51375 -58186 -36179 -59086 -31413 -34917
16491 -34917 -38093 -43269 -37047 -54593 -61222 -57943 -52724 -64363 -72970 -42749 -9525 9568 -18496
16478 -18496 -47095 -28068 -21783 -27262 -49768 -58272 -32258 -5371 9581 4268 -8699 -10746 -12635
16465a2635j4381l4825j9820K7965L7116M4359J622l3245j0732L4039M707k1964
16453B206j7315k1807j0614m0422k1611J6714R149K3972n835R349J7694M251r684
16440d3953j6038J602J8427M7991l731l1541n331J4023j5983K401P968j4392j0762
16427d9319J0938J498M78r080j919n225N183J6808N286M90j0166j0466N496k414
16413d2412K8867L3802R244p07J418j2365j5004o156j2017j8069q738J4640N088
16400b2409J9345m5110l4989J3407o681L0712P276l2576j2304N804K1489l2436
16388h8472O9K4811l241J886K1449m681j2704o643K8204j2825m8283q872L8024
16375g1278O6390J918J2022k4412k4924j7703j1207N2728j6687k6541J4035Q316
$$ plain form
16465 -12635 -27016 -61841 -81661 -53696 -16580 27779 29401 -3844 -14576 19463 24170 2206
16453 2206 -15109 -36916 -47530 -87952 -109563 -92849 -83700 -59728 -65563 -56214 -38520 -34269 -43953
16440 -43953 -59991 -58389 -39962 8029 4298 -27243 -32574 -18551 -34534 -32133 -24165 -38557 -49319
16427 -49319 -38381 -36883 -36405 -45485 -47404 -52629 -47446 -30638 -25352 -24862 -35028 -45494 -39998 -42412
16413 -42412 -13545 20257 29501 28794 30212 17847 2843 -3313 -15330 -33399 -42137 -27497 -22409
16400 -22409 -3064 -48174 -83163 -69756 -76437 -45725 -38449 -71025 -83329 -77525 -56036 -88472
16388 -88472 -88403 -63592 -66833 -64947 -43498 -48179 -60883 -67526 -39322 -52147 -100430 -109302 -71278
16375 -71278 -4888 -2970 9052 -15360 -40284 -57987 -69194 -16466 -33153 -59694 -45659 -37343
16363c7343l707k9779M646J7932K4241J108k4327o534O67l2210j727K0061O603
16350f0369K8532L4286m9113l4915J3821L173j0514K6971K4140L8977l1628n5252
16338g1891j750K1334j0264K4378K8667l99K111j7375j2176p728n654j88Q545
16325d2390k0519J3966n709K7446o699j2513J2698J6381j4809Q890r556l9429
16313g2243j7646K669J8224J361K4280L1984J5855N819J172o711K685n1534J2087
16300c1998L9485j1447j6491l6212m086L1774K0559j5116j0725p975j0904k531
16288e5667j12k034M083j5952k4229j6017K3898J5773K4156J8527j2888L563J4338
16275b2561J0421P681j5119P951l390l4788J9743J1212m291k3843j5087p124J6368
$$ plain form
16363 -37343 -41050 -70829 -66183 -48251 -24010 -22902 -47229 -53763 -53096 -85306 -87033 -66972 -60369
16350 -60369 -31837 2449 -46664 -81579 -67758 -64585 -75099 -48128 -23988 14989 -16639 -71891
16338 -71891 -73641 -52307 -62571 -38193 -9526 -9925 -7814 -25189 -37365 -45093 -50747 -50935 -42390
16325 -42390 -62909 -48943 -54652 -27206 -33905 -46418 -33720 -17339 -32148 -23258 -32814 -72243
16313 -72243 -89889 -87220 -68996 -67635 -43355 -11371 4484 10303 11475 4764 7449 -44085 -31998
16300 -31998 7487 -3960 -20451 -56663 -60749 -28975 -8416 -23532 -34257 -42232 -53136 -55667
16288 -55667 -55779 -57813 -53730 -69682 -93911 -109928 -86030 -70257 -46101 -27574 -40462 -36899 -22561
16275 -22561 -12140 -4459 -19578 -11627 -15017 -49805 -30062 -18850 -23141 -46984 -62071 -69195 -52827
16262e2827j810J6899N413j0086j2666L6249L799m753l7528K112K1416j1228l9261
16249h4271K0985K4025M645J648j4270R352L1881J7305J7283l396l5212j9325
16237b9350m559j211j3212N076J2988j1096N904K4133N354j2296j7039p145n088
16224d7541j6785k0901O33J1870n521K2425K2092j3558k1409J0826P430K5847
16212b4592j1328n1145j0244J2349J7110N419q655R894N372q77j0935J3794R054
16199d4784r537o009K0963J3624j5029j296J6480k8744m620J8207L815J0883k3695
16186d9742j3499K2195Q956j6389P926M8481L062J629r045m212j5484j0747M753
16173b2116k0183o034j912J2062L585n349J8440j1733m071N164p63j0535m924
$$ plain form
16262 -52827 -54637 -37738 -32325 -42411 -55077 -18828 -15029 -19782 -57310 -55198 -33782 -45010 -84271
16249 -84271 -63286 -39261 -34616 -32968 -47238 -37886 -6005 11300 28583 25187 -10025 -29350
16237 -29350 -33909 -35120 -48332 -43256 -30268 -41364 -35460 -11327 -5973 -18269 -35308 -42453 -47541
16224 -47541 -64326 -85227 -84594 -72724 -78245 -55820 -33728 -47286 -68695 -57869 -50439 -24592
16212 -24592 -35920 -87065 -97309 -84960 -67850 -62431 -71086 -61192 -55820 -56697 -67632 -53838 -44784
16199 -44784 -54321 -60330 -39367 -25743 -40772 -42068 -25588 -54332 -58952 -40745 -36930 -26047 -49742
16186 -49742 -63241 -41046 -32090 -48479 -40553 7928 10990 12619 3574 -638 -16122 -26869 -22116
16173 -22116 -42299 -48333 -50245 -38183 -34598 -39947 -21507 -33240 -37311 -32147 -32910 -43445 -48369
16160d8369J1882O034j1652J7952q724J5508J2787J6870n890l5433k2646J2229
16148c9452J0131j8363k3046K3531Q261J0141n886p853J3813j8407N356P522M55
16135c3797O663Q398L208J672j2641L752Q432k486J7918O824l2770K723R958j7824
16121b9970j0702r07j0765K0408J2708q035J717p629j3732o426K3760j138J3294
16108a7417O979k1138r844R378k098J0093O296k093J0002J1017k5382j8774K4235
16095a8746l0725q223K3819r515j6565q644l953O072l54m70k0325M0674J4836
16082c2119J9866j581J753K22j1049N439k677j4551J9409j5279j4541j9688j9530
16069h4326K2929K1691p392j9065J6705L3189L5992j4428j2782P416P339K066
$$ plain form
16160 -48369 -36487 -30453 -42105 -24153 -32877 -17369 -4582 12288 6398 -29035 -51681 -39452
16148 -39452 -29321 -47684 -70730 -47199 -38938 -28797 -34683 -42536 -28723 -47130 -41774 -34252 -33797
16135 -33797 -27134 -18736 -15528 -13856 -26497 -22745 -14313 -16799 1119 7943 -24827 -22104 -12146 -29970
16121 -29970 -40672 -41579 -52344 -31936 -19228 -27263 -25546 -33175 -46907 -53333 -29573 -30711 -17417
16108 -17417 -10438 -31576 -41420 -32042 -34140 -24047 -17751 -19844 -9842 1175 -24207 -42981 -18746
16095 -18746 -49471 -57694 -33875 -43390 -59955 -68599 -72552 -66480 -66834 -67304 -87629 -46955 -32119
16082 -32119 -12253 -13834 -12081 -11859 -22908 -17469 -20146 -34697 -15288 -30567 -45108 -64796 -84326
16069 -84326 -61397 -39706 -47098 -66163 -49458 -16269 19723 5295 -7487 -71 7268 9334
16057I334j1948j4232r307m382j1322P70n081M546k5069j1925K5575M3963L171
16044e907P470l7726r404J8407k6530j4681J7975J5010j084p82P592J8318k0819
16031c2161k905k164m770l112O806n136n998K6764r761Q154N347K181k1801p306
16017d5862m1433k984P788J2607K4764j6716k0062p51K2872l484J948R065J4472
16004c7776J539k6061K615K8407J0107j9274J1729J8001j2972j1652m165n33J7278
15991b2757L856k515K4895j1268j8257M756m674j9220j7843J5838J2733Q301J2110
15978a4045J0385J2508k3895J6275L645j7648k1294M628K1924j5059r279L2924
15966A069L4920Q485j4565m8219l4686O831L4943J1539j9020n376J4527L609j5935
$$ plain form
16057 9334 -2614 -16846 -26153 -30535 -41857 -41087 -46168 -41622 -66691 -78616 -53041 -9078 -5907
16044 -5907 1563 -36163 -45567 -27160 -53690 -68371 -50396 -35386 -36470 -37252 -29660 -11342 -32161
16031 -32161 -35066 -37230 -42000 -45112 -38306 -43442 -49440 -22676 -32437 -24283 -18936 -16755 -38556 -45862
16017 -45862 -87295 -90279 -82491 -69884 -45120 -61836 -81898 -82649 -59777 -63261 -61313 -52248 -37776
16004 -37776 -36237 -62298 -59683 -31276 -21169 -40443 -28714 -10713 -23685 -35337 -39502 -40035 -22757
15991 -22757 -18901 -21416 3479 -7789 -26046 -21290 -25964 -45184 -63027 -47189 -34456 -26155 -14045
15978 -14045 -3660 8848 -15047 1228 4873 -12775 -34069 -29441 -7517 -22576 -31855 1069
15966 1069 35989 44474 29909 -18310 -52996 -46165 -11222 317 -18703 -24079 -9552 -5943 -21878
15953b1878M575K2912l297K587j8024k3831R107k506l105L9131J7774j7299Q337
15940A4483J1262j7246j0111n197J0840j0309k3660k9196P940K1006N177J7780
15928g231j928J0364K295j6439j7091j6737j6334P226K8758K6564P06m7802k0376
15915f8025J2731L6611o185j1611n273n703q266m355L678K0107J0125J36k2825
15902d8855j1629j9429k2033q462K1014L8404J985J7287K2786j2139k4526L1097
15890a4500J1053R175J0711L021k2692j5022q029O517J1394K8155j5227j6312
15878a1756l638n151l887K9r291R953j8496J732J756r735J0604R123l1890j1493
15864g2140O215J6213J4465K6600m057j5247j5898K359P143L4852J9764j3949
$$ plain form
15953 -21878 -17303 5609 2312 4899 -13125 -36956 -27849 -30355 -33460 5671 23445 6146 14483
15940 14483 25745 8499 -1612 -6809 4031 -6278 -29938 -59134 -51194 -30188 -25011 -7231
15928 -7231 -9159 1205 3500 -12939 -30030 -46767 -63101 -55875 -27117 -553 153 -47649 -68025
15915 -68025 -55294 -18683 -24868 -36479 -41752 -47455 -55721 -60076 -56398 -36291 -26166 -26030 -48855
15902 -48855 -60484 -79913 -101946 -110408 -89394 -50990 -49005 -31718 -8932 -21071 -45597 -14500
15890 -14500 -3447 5728 16439 19460 -3232 -18254 -26283 -19766 -8372 19783 4556 -11756
15878 -11756 -15394 -20545 -24432 -24403 -33694 -23741 -42237 -40505 -38749 -48484 -37880 -28757 -60647 -72140
15864 -72140 -65925 -49712 -35247 -8647 -12704 -27951 -43849 -41490 -34347 505 20269 6320
15852F320k5627k9765j683J3554L7298k963l6493k23J1143J2333j9655r669K3321
15839b2109K0181J5889k8848r969J327l210m453o603J1093K3429q704j4027Q860
15826a7144L699k881k4919l494j5048J4589j0681Q77o337K1838R425n317P198
15813b8195k4716L348q216j010K8073Q50q773J7577K3575K6253k5921k6805r581
15800c3541M022j615L89o981j3511J4111j608N379q121J4712K36j7026J4042L200
15786b6312R914p092p310K0084K7186K6046k5224o0796j4402J1070K1123j148
15774b6861K9843L3739q835o382k6465l36j5432R821r5L378J8576K7505J7197
15761E5653j1263j9456K0861J0891J3303J3637M4605N4352N1151Q1671J42684
$$ plain form
15852 6320 -19307 -49072 -50755 -37201 97 -2866 -39359 -39582 -28439 -16106 -35761 -45430 -22109
15839 -22109 -1928 13961 -14887 -24856 -23529 -26739 -31192 -37795 -26702 -3273 -11977 -26004 -17144
15826 -17144 -13445 -16326 -41245 -44739 -59787 -45198 -55879 -55002 -61339 -39501 -30076 -35393 -28195
15813 -28195 -52911 -49563 -57779 -58789 -30716 -29866 -38639 -21062 2513 28766 2845 -23960 -33541
15800 -33541 -29519 -31134 -30745 -37726 -51237 -37126 -38734 -33355 -41476 -26764 -26528 -43554 -29512 -26312
15786 -26312 -16398 -23490 -30800 -10716 16470 42516 17292 -43504 -57906 -46836 -25713 -26861
15774 -26861 2982 36721 27886 21504 -4961 -5297 -20729 -10908 -11003 -7625 10951 38456 55653
15761 55653 44390 24934 45795 56686 69989 83626 128231 182583 233734 315405 458089
15750D58089K08231L38849L22070P0998l59468m09763j96055q6058p4015p8685
15740A94193n7222l2744K4797j6674o065L065M911k235l6814j5515J0760j107
15728F9350j3024j5825P821l098m6271k8815P340K1414q307j4918J9081j2370
15716a7622k0651l6330K056J7641K2043L620n34j2771k9144M8668K3605L38k7109
15703b6190j251J3145L176r97L202p858L1794K6954r177j2571j8620l5460k9974
15690f3827Q278O267M332K5091R327J0725j574Q277N527q694o551p125l8603k5859
15676g4409K3372L7049M292j7016K715K1489j5115l3452l679J7322J4478k379
15664b5333j9564j3471n58M1190K0745k1355j1671P449k9573K630O289K1134J4847
$$ plain form
15750 458089 666320 1005169 1327239 1398237 1038769 629006 432951 346893 272878 194193
15740 194193 136971 104227 129024 112350 106285 109350 114261 112026 75212 59697 70457 69350
15728 69350 56326 40501 48322 45224 -1047 -29862 -22522 -1108 -9415 -24333 -5252 -17622
15716 -17622 -38273 -74603 -72547 -54906 -32863 -29243 -29777 -42548 -71692 -23024 581 919 -26190
15703 -26190 -27441 -14296 -11120 -12117 -8915 -16773 15021 41975 32798 20227 1607 -33853 -63827
15690 -63827 -55549 -49282 -44950 -19859 -10532 193 -1381 6896 12423 3729 -2822 -9947 -48550 -74409
15676 -74409 -51037 -13988 -9696 -26712 -23997 -2508 -17623 -51075 -54754 -37432 -22954 -25333
15664 -25333 -44897 -58368 -58926 -17736 3009 -18346 -30017 -22568 -52141 -49511 -43222 -22088 -7241
15651g241j1171m0060M169J0926J6112K2278J9621J4167k2466l9892l0223j744
15639f5524K9387P24l106M242J2612j2184m0247K51M7178J0904J533j3497J5198
15626a2529j746k1139L2885Q722Q138P21k3734r95k7602Q842M643K9656M2951
15613D8813o325l9799R183J0375j4437l5218j8350j9971M1788J7326K7721k380
15601A8726k6931j7132j0821j5689N067J1527J2016j0556j6452J346J2808K9716
15589f375j353n122j3321p424l705n699M688K725n149K5399L87j3021K0317K6584
15575A8931p028l225k1120k1283J6218K08M811K078l8519o071R137K8050K1430
15562C617n219J9833j7557N691Q884k6017j486R488k1718K4910j958o444l3584
$$ plain form
15651 -7241 -18412 -58472 -54303 -43377 -27265 -4987 14634 28801 6335 -33557 -63780 -65524
15639 -65524 -36137 -35413 -38519 -34277 -21665 -33849 -74096 -73845 -26667 -15763 -14230 -27727 -12529
15626 -12529 -14275 -35414 -2529 6193 14331 15052 -8682 -9677 -37279 -28437 -23794 5862 48813
15613 48813 42488 2689 11872 22247 7810 -27408 -45758 -65729 -23941 -6615 21106 18726
15601 18726 -8205 -25337 -36158 -51847 -46780 -35253 -23237 -33793 -50245 -48899 -36091 -6375
15589 -6375 -7728 -12850 -26171 -33595 -37300 -42999 -38311 -35586 -40735 -15336 -14949 -27970 -7653 18931
15575 18931 11903 8678 -12442 -33725 -17507 -17299 -12488 -10410 -48929 -55000 -45863 -17813 3617
15562 3617 -1602 18231 674 6365 15249 -10768 -12254 -2766 -24484 426 -1532 -7976 -41560
15549d1560k9737m063K6871K2338P898J5672J6367k1961j6038J5585k606j7144
15537b8378J0588L056k3871k6346Q782o313k0690r03J3728M1699j069k8082p578
15524f5377J0091K8962J9667j2586j7880P816m860o356O423j416k0123J3360R082
15511c3197m724J4355J715R836K8991p173k0886l7105J99J6635p627R124R604
15498b0253J3046j0909l821j2769k7407K6755j141r002J1769j9312O975J4170
15486c1899L98K1674K2258j5934j0226j3139k4091J6715K3903n202p081R681m22
15473a3365J3822L05K35L923l0840J5623P185k509j3961M156J0122P486p754N499
15459g3K6143j0019k6763j7477K439J5742R011k908k9477k3751K7201K226r654
$$ plain form
15549 -41560 -71297 -75360 -48489 -26151 -18253 -2581 13786 -8175 -24213 -8628 -11234 -28378
15537 -28378 -17790 -14734 -38605 -64951 -56169 -62482 -83172 -84075 -70347 -28648 -29717 -57799 -65377
15524 -65377 -55286 -26324 -6657 -19243 -37123 -29307 -34167 -40523 -34100 -35516 -55639 -42279 -33197
15511 -33197 -37921 -23566 -21851 -12015 16976 9803 -11083 -48188 -47989 -31354 -38981 -29857 -20253
15498 -20253 -7207 -18116 -21937 -34706 -62113 -35358 -36499 -45501 -33732 -53044 -46069 -31899
15486 -31899 -31501 -9827 12431 -3503 -13729 -26868 -50959 -34244 -10341 -15543 -22624 -12943 -13365
15473 -13365 457 762 997 4920 -25920 -10297 -3112 -5621 -19582 -15426 -5304 2182 -5572 -73
15459 -73 26070 16051 -10712 -28189 -25750 -10008 -997 -3905 -33382 -57133 -29932 -27706 -37360
15446c7360J622K2059K2579j5285k6751Q898J7413J8316j7169L199m145l1968
15434c8592l0759j964K2611j748r346J6767m971J760l0066L073K9601L1086K745
15421i803k6170j3357R96J6703J7093l693J2302r247k8579J5748M3875Q080j4910
15408I038j2365N313j018j3402J8354l2940l8398j8733K0886J3335K8415J5569
15396e946j5250l587K2471J1751p121J9549R614l5129m2101J170J6815J6895J2396
15383A527j8258N044R693M17q516K9292K4729j0457k2484j2373j1968J5468O197
15370H311j257j3515K513M6398q068m385m50j254j1911j7746Q435j3351M750M021
15356B491o408k4373J2683L5193Q129j9694j3877j4855J93k538j60n973m873n111
$$ plain form
15446 -37360 -35738 -13679 8900 -6385 -33136 -24238 -6825 11491 -5678 -2479 -6624 -38592
15434 -38592 -69351 -71315 -48704 -50452 -59798 -43031 -48002 -46242 -76308 -73235 -43634 -12548 -9803
15421 -9803 -35973 -49330 -48334 -31631 -14538 -18231 -5929 -15176 -43755 -28007 15868 23948 9038
15408 9038 -3327 1986 968 -12434 5920 -27020 -65418 -84151 -63265 -49930 -21515 -5946
15396 -5946 -21196 -24783 -2312 9439 2318 21867 31481 -3648 -45749 -44579 -27764 -10869 1527
15383 1527 -16731 -11687 -1994 -1577 -10093 19199 43928 33471 10987 -1386 -13354 2114 8311
15370 8311 7054 -6461 -3948 42450 34382 29997 29547 28293 16382 -1364 7071 -6280 -1530 2491
15356 2491 -3917 -28290 -15607 19586 27715 8021 -5856 -20711 -20518 -23056 -23216 -29189 -34062 -39173
15342c9173N550J2272j6267j0167J2015J7342J2543K4043L818n290l0521O263
15330g572K9308j200j2466O631L3433j6713j0910n478j0530k0912j7803Q073J142
15317b4997M0064M667p910k82J0952j0278k1268j1971K4007o496r704o814L006
15304a7024J2636Q65K5795j871k5654j7094P354J3471J0168r768j2834L653l085
15291a3388L118L109j7012Q347J8412N309j4768Q300q530j3185p611k9993J2592
15278d5300N604K441K9123J970o381n553m353k260J7783R764k1738j3966J8060
15265a4806K7971k9901N330J0466Q682j4061Q541N28L0446r511k4376K0242o659
15252A2892K064M781K0372j5920k427j7859m0397k083J4656J4819m395k4058m670
$$ plain form
15342 -39173 -33623 -21351 -37618 -47785 -35770 -18428 -5885 18158 21976 16686 -13835 -7572
15330 -7572 21736 20536 8070 14701 48134 31421 20511 15033 4503 -16409 -34212 -26139 -24997
15317 -24997 15067 19734 11824 11542 22494 12216 -9052 -21023 2984 -3512 -13216 -20030 -17024
15304 -17024 -4388 -3523 22272 20401 -5253 -22347 -14993 -1522 8646 -1122 -13956 -10303 -13388
15291 -13388 -10270 -7161 -24173 -15826 2586 7895 -6873 1427 -7103 -20288 -27899 -57892 -45300
15278 -45300 -39696 -37255 -8132 -6162 -12543 -18096 -22449 -24709 -6926 2838 -18900 -32866 -14806
15265 -14806 13165 -16736 -11406 -940 7742 -6319 2222 2750 33196 23685 -691 19551 12892
15252 12892 14956 19737 40109 24189 21762 3903 -36494 -38577 -23921 -9102 -13497 -37555 -42225
15239d2225J4782R720j3186J994M772K3150K3453k2257k992p970j00Q880j3543
15226a5522o599J4795K6961J8564J893j3896o508r027J3198J1331l9505p404J0798
15213i21J7439p172k4959k4365j1363M0251j523j1233j368J5293K2716J3109j4009
15200A1895k6344J3984K7966J72l7919l694L406j4281m673Q161L8045K2413K2321
15187F1452k220j3806k6539l2971l617K2703Q454k936k3461N275Q127j3693l1692
15174d4924n94L0055K4693K1136j2577k5616O63r583J2457p135R84k8978j7058
15161e6477p977J2444M4956J4760R421n409l6811j8731J9351K640j639R412J1636
15148b424j864l1519O738K6841N850j7833j2713K760j6758L163J7519m433j805
$$ plain form
15239 -42225 -27443 -17723 -30909 -28915 -24143 -993 22460 203 -2789 -10759 -10859 -1979 -15522
15226 -15522 -22121 -7326 19635 38199 40092 26196 19688 10661 23859 35190 -4315 -11719 -921
15213 -921 16518 9346 -15613 -39978 -51341 -11090 -12613 -23846 -25214 -9921 12795 25904 11895
15200 11895 -14449 -465 27501 27673 -10246 -13940 -10534 -24815 -29488 -21327 16718 39131 61452
15187 61452 59232 45426 18887 -14084 -17701 5002 13456 10520 -12941 -7666 461 -13232 -44924
15174 -44924 -45518 -15463 9230 30366 17789 -7827 -7164 -16747 -4290 -11425 -10441 -39419 -56477
15161 -56477 -64454 -52010 -7054 7706 17127 11718 -25093 -43824 -24473 -21833 -23472 -14060 -2424
15148 -2424 -4288 -35807 -29069 -2228 3622 -14211 -26924 -24164 -40922 -37759 -20240 -24673 -26478
15135b6478q237l7780N704L6448J5004J2175N105l45J0172j2295J5859P531k7579
15122d716l3607J2370Q129N005n597k4960j3375P361Q229q416J1301Q334o33m633
15108c5208P967Q439r513l993P046J9339L3508R126k220J114k4305o418j2565
15095g683K740R377J3267J2911J7729K0943q826k482q679q511j6917J0479r315
15082B5033k1477j3459J7039N087j4769p060J4368M2219o453k2369J0004l63m725
15069B3075j1245k1486L177O305k5914j2947j8747J1553L0565j8062L294J881
15057b8551J7545q311o513K2895J1322J5331R662l509L596o901K669l0987j4561
15044a6313K0319O591q509J8912j095l7361n035Q684l89j363J4214j2903p546
$$ plain form
15135 -26478 -34715 -72495 -66791 -30343 -15339 -3164 1941 1596 11768 -527 15332 22863 -4716
15122 -4716 -38323 -25953 -17824 -12819 -18416 -43376 -56751 -49390 -41161 -49577 -38276 -29942 -30575 -35208
15108 -35208 -27241 -18802 -28315 -32308 -25262 -5923 27585 36711 34491 35605 11300 4882 -7683
15095 -7683 -4943 4434 17701 30612 48341 69284 60458 57976 49297 40786 23869 34348 25033
15082 25033 3556 -9903 7136 12223 -2546 -9606 4762 46981 40528 18159 28163 27800 23075
15069 23075 11830 -9656 -6479 -174 -26088 -39035 -57782 -46229 -15664 -33726 -30432 -28551
15057 -28551 -11006 -19317 -25830 -2935 8387 23718 33380 29871 33467 26566 29235 -1752 -16313
15044 -16313 4006 10597 2088 21000 19905 -17456 -22491 -13807 -14196 -15559 -1345 -14248 -21794
15031b1794q71J4198J6876m37j0940j7879K6415J0718J5739j4212j2359J7224
15019B2678J2416r933L990j6709J975K0794k1834q324M3945n356k8900j8731j2584
15006a6573N40J7089K0491J4668j4872j2665j8003j5632q4N525L1832P294k3209
14993c599n1915m179K0625K4890J7839N188K0747L73j7593r99K1800J5628l2251
14980A6554m2566j471m484o01M8560J3990m869J217N256l0900j0704k0898K0779
14967a0137M0581k0286j282Q166j0473k4526K2496M6799J8464J005j0856k0946
14955C9005m5111j9754K4593j0004j0683M79J941o691K7846L6649l691k1452j9305
14942f178n514R496K3966R283k1167m703M0124J5947j2272j9660o581O219N341
$$ plain form
15031 -21794 -22665 -8467 8409 7972 -2968 -20847 5568 16286 32025 17813 5454 22678
15019 22678 35094 25161 29151 12442 14417 35211 13377 5053 48998 43642 14742 -3989 -16573
15006 -16573 -16033 1056 21547 36215 21343 8678 -9325 -24957 -25041 -19516 12316 19610 -3599
14993 -3599 -55514 -59693 -39068 -14178 3661 8849 29596 29969 12376 11377 33177 48805 16554
14980 16554 -26012 -27483 -31967 -32568 15992 29982 25113 26330 31586 686 -10018 -30916 -10137
14967 -10137 30444 10158 8876 17042 6569 -17957 4539 51338 69802 70807 59951 39005
14955 39005 -6106 -25860 -1267 -11271 -21954 -21475 -19534 -26225 1621 38270 34579 13127 -6178
14942 -6178 -11692 -2196 21770 31053 9886 5183 45307 61254 48982 29322 22741 28960 34301
14929C4301N285r232r370J8527l7159k0763j745J7027j0148p627j9378k6173K3594
14916d2861J8876l2215j819m020l147K1894L2749J8948j7519l070n549J740J2905
14903c088O818j1831m1985r897P767L512j1690N228M1539K1747l367n739j9936
14890b0922R075N723r337K2182J3404J649j6098r585L367j0092j6247J2930P894
14877f057k387j0758m704J2696K1299R242o618J1906J1631j1173L465O457l4571
14864D28m0058q922K2824J4938o77j2391Q480K0084o891l546j812l635k1078K7677
14850d579L7279L484j2118l1377j6391k2341J539K3692P69J283J1056K1798N640
14837A9734J708k0610j971N673r523o119L435j0960n782L0654K092k671l1307
$$ plain form
14929 34301 39586 30354 20984 39511 2352 -18411 -20156 -3129 -13277 -20904 -40282 -66455 -42861
14916 -42861 -23985 -56200 -58019 -62039 -65186 -43292 -10543 8405 -9114 -12184 -17733 -15993 -3088
14903 -3088 3730 -8101 -50086 -59983 -52216 -48704 -60394 -55166 -13627 8120 4753 -986 -20922
14890 -20922 -11847 -6124 -15461 6721 20125 21774 5676 -3909 -542 -10634 -26881 -13951 -6057
14877 -6057 -8444 -19202 -23906 -11210 10089 19331 12713 24619 36250 25077 28542 34999 428
14864 428 -39630 -48552 -25728 -10790 -11467 -23858 -15378 4706 -2185 -5731 -7543 -11178 -32256 -4579
14850 -4579 32700 36184 24066 -7311 -23702 -46043 -44504 -20812 -20043 -18760 -7704 14094 19734
14837 19734 21442 832 -1139 4534 -4989 -11108 -7673 -18633 -24415 6239 8331 5660 -25647
14824b5647p127J3495l508J3317J7043o625j4988j2658l3149j1830K1203Q664
14812d1810L0149J7135L481k677n355m428k029k3526K2525k6966j2651K495P548
14799c6109k557J432P378K8128K6627j4846m2947K3087R603k3831K1614K1162
14787A8741L9079M57j5299l0120n775L278P708j5614n700K504J8887l0229k3784
14774c5867J6451K9957k781J4717n233M401k3656j2415o721k6876J3333L4927
14762B37J6511O866k4884J9302J2543k7434JM135K1486p833k3123m5406n748J1472
14748d1875K02J6400J4128J1264J0413m2857k073J3609j0310k343Q442J5464J9916
14735A0380n752j8944l916j1649l146n221K3483L5554Q72l6721R158L2478J15
$$ plain form
14824 -25647 -32774 -19279 -22787 -9470 7573 948 -14040 -26698 -59847 -71677 -50474 -41810
14812 -41810 -11661 5474 8955 6278 923 -3505 -5534 -29060 -6535 -33501 -46152 -43657 -36109
14799 -36109 -38666 -37234 -29856 -1728 24899 10053 -32894 -9807 -204 -24035 -2421 18741
14787 18741 57820 58277 42978 12858 7083 10361 18069 2455 -3245 -741 18146 -12083 -35867
14774 -35867 -19416 10541 7760 22477 17244 21645 -2011 -14426 -21147 -48023 -34690 237
14762 237 16748 23614 -1270 18032 30575 3141 3142 7277 28763 20930 -2193 -47599 -53347 -41875
14748 -41875 -41673 -25273 -11145 119 10532 -32325 -34398 -20789 -31099 -33442 -25000 -9536 10380
14735 10380 4628 -14316 -18232 -29881 -33027 -38248 -14765 20789 21661 -15060 -5902 26576 26691
14722B6691j7448J3483L524l6300n774J8600j1988M95j1352j191K4091J2401K5778
14709D1010j3027k7601J0515n690J5851m035J4092m698j1940j7792N207M8910
14697E0802j8185j5887J5467l99k0578k534j3267o36Q992j1958j0353K2101j2886
14684i321J2882J4339k6431p994k3060P368N097J0275K6116J3146K1106m0785
14672B738j4136Q531j01J5593q193K5125O793j322m7753k2370K6311O883l660
14659e561R447j5269j2095k2396J1562L094j2937q809K8927J2906k4686r469K4402
14646b0884k48j2027J431o645K5331N265q790l7415N503K5712N0836J7230k5361
14633A9938m2346Q029O704J8830O656k4913K4860K1162o608o231o061k0858p846
$$ plain form
14722 26691 9243 22726 26250 -10050 -15824 2776 -9212 -8717 -20069 -21260 2831 15232 41010
14709 41010 27983 382 10897 5207 21058 17023 31115 26417 14477 -3315 1892 50802
14697 50802 32617 16730 32197 31798 11220 8686 -4581 -5217 3775 -8183 -18536 3565 -9321
14684 -9321 3561 17900 -8531 -16525 -39585 -32217 -27120 -16845 9271 22417 43523 2738
14672 2738 -11398 -2867 -2968 12625 4432 29557 36350 35028 -12725 -35095 -8784 -1901 -5561
14659 -5561 3886 -11383 -23478 -45874 -34312 -31218 -44155 -52964 -24037 -11131 -35817 -45286 -20884
14646 -20884 -21132 -33159 -31728 -38373 -13042 -7777 -16567 -53982 -48479 -22767 28069 45299 19938
14633 19938 -22408 -14379 -7675 11155 17811 -7102 17758 38920 32312 26081 20020 -838 -8684
14620h684l7339J5906K6955k3368k0617L2742K1283r400j4629K4582J5753j5526
14608G658o67l758J2231K3j5269l2401k2251K441p494J6983M515k506K1496R663
14594i336j0823j9554O616K7449N195j9659J627M435J2107N107R193k319q890
14581A148k0503N443J5490L934J6967j838J0973p084k6051j5760N038L2471l631
14568A6597j5458j7096M135J6544J1167K6002J0199M234j0673k1682k974K9466
14556E0461n003j8311j8833l9074l0256J7064Q847j0571p816K7843L1289J5399
14544B1039k3743J2162p089j1226K0046o67j5480P725O002j1830n19n405l0214
14531c9199j0405J5531L6360K5191J0657q698l8960J111j7151k4088l2372J5657
$$ plain form
14620 -8684 -46023 -30117 -3162 -26530 -47147 -14405 6878 -2522 -17151 7431 23184 7658
14608 7658 6991 3233 15464 15487 218 -32183 -54434 -51993 -59487 -42504 -37989 -40495 -18999 -9336
14594 -9336 -20159 -39713 -33097 -5648 -453 -20112 -18485 -14050 -1943 3164 12357 10038 1148
14581 1148 -19355 -13912 1578 5512 22479 20641 31614 24530 -1521 -17281 -12243 20228 16597
14568 16597 1139 -15957 -11822 4722 15889 41891 52090 56324 45651 23969 20995 50461
14556 50461 45458 27147 8314 -30760 -61016 -43952 -35105 -45676 -53492 -25649 5640 21039
14544 21039 -2704 9458 2369 -8857 11189 10522 -4958 2767 8769 -3061 -3580 -8985 -39199
14531 -39199 -49604 -34073 2287 27478 38135 29437 -9523 -8412 -25563 -49651 -82023 -66366
14519f6366K0277K0676k2108o756K8250K7488K5534j6002k9104n882r780J2098
14507b1675j0662m701K0808J2083J3109k2784j2454J9048q94k2669L989J4716
14495a2086k8134L4690J3208j1004K4329L9456r333j6205j81l002k2297j3339
14483c898j1635L937k012K113J5912j8171P710Q914K0079p87m1942k735k861o720
14469c2096N610n801J8482L6126J0326k9449j7774L0119J5347R171p172m8252
14457a5363j3022j7683m756J4715K3800M7503j0516k3101M153P652l294J9521
14445B9609J5937l8707k3553K3261j2341N485J5822M964N767K6649k916j7625
14433C2352j3716j6760O235k8914j269m435K4945j0502j0084P197J2040J4005
$$ plain form
14519 -66366 -46089 -25413 -47521 -54277 -26027 1461 26995 10993 -18111 -23993 -33773 -21675
14507 -21675 -32337 -37038 -16230 -4147 8962 -13822 -26276 -7228 -8122 -30791 -26802 -12086
14495 -12086 -40220 -5530 7678 -3326 21003 60459 51126 34921 34740 31738 9441 -3898
14483 -3898 -15533 -11596 -13608 -11495 4417 -13754 -6044 2870 22949 22162 -19780 -22515 -25376 -32096
14469 -32096 -26486 -32287 -13805 22321 32647 3198 -14576 15543 30890 40061 32889 -15363
14457 -15363 -28385 -46068 -50824 -36109 -12309 35194 24678 1577 5730 13382 10088 29609
14445 29609 45546 6839 -16714 6547 -5794 -309 15513 20477 26244 52893 49977 32352
14433 32352 18636 1876 8111 -20803 -22072 -26507 -1562 -12064 -22148 -14951 -2911 11094
14421A1094M116o836j8376Q201K655l5501J6988l367P872J2386P18J500j0331
14408h881o223L6897q05l261J0716m823m1816j1627J1019J8546L5080o118j8909
14395I795k2784j7611k0836R358J0257J2902L3253j1432j0256J8396J8857J107
14383C1006L581J5874l3783k5155J234o25J0686K3299J9744k2453j4742j5290
14371f624R125J7824K855j1110p759l218l40J7396O186n530L456k4038j3573M768
14357a0582K6201N386j211l980n346j3967J962J4954O969l3463k541K564j8222
14344c1276r693o232L3482O870K1474K3756R403l963m015k7058k1586l757k2789
14331c5384K039J6006K3067J3396M632n33l2154k4874o637J6957K2111J2507k7123
$$ plain form
14421 11094 15210 8374 -10002 -1801 854 -34647 -17659 -21026 -13154 -768 -50 1450 -8881
14408 -8881 -15104 21793 20988 17727 28443 23620 -18196 -29823 -18804 -258 34822 28704 9795
14395 9795 -12989 -30600 -51436 -42078 -31821 -18919 14334 2902 -7354 11042 29899 31006
14383 31006 34587 50461 16678 -8477 -7243 -7868 2818 26117 45861 23408 8666 -6624
14371 -6624 2501 20325 23180 12070 4311 1093 753 18149 24335 18805 22261 -1777 -15350 -10582
14357 -10582 15619 21005 19794 15814 10468 -3499 -1537 13417 20386 -13077 -15618 -13054 -31276
14344 -31276 -40969 -47201 -13719 -6849 14625 38381 47784 43821 39806 12748 -8838 -12595 -35384
14331 -35384 -33345 -17339 5728 19124 23756 23223 -8931 -33805 -40442 -23485 -1374 11133 -15990
14318a5990L463R141J644M36n233K427M974J8145J3899j4783k1395p79r399J0038
14304c412j2145j0348K762K8508L6672k733L904k1562l2329j0137J918L907J6094
14291A099L9489o373m1431r241K3964N525k0174j4838j3760L1268P115J8085L746
14278B4474k8872o864K6799j973k3519l2641p235K6449K7957K8152k809p362K2447
14265D5003R619j4393k979k8161j2789j6487Q421M6738P481k0757J922O335L9263
14252F9216K6314J5450l7880l5174j4674j4446r919N261P836K7565p019n0114
14240a7584l093K6254K8864m25Q59O476k1505k2271J0806Q334l3934l524K4406
14227C663J6050K3425N602K2835k0727j3459k1194J883q992j3190J69L4338J6969
$$ plain form
14318 -15990 -12527 -3386 -1742 -1306 -6539 -4112 862 19007 32906 18123 -3272 -4051 -13450 -3412
14304 -3412 -15557 -25905 -23143 5365 42037 39304 43208 21646 -10683 -20820 -18902 -14995 1099
14291 1099 40588 34215 -7216 -16457 7507 13032 -7142 -21980 -35740 -4472 2643 20728 24474
14278 24474 -4398 -11262 15537 13564 -9955 -42596 -49831 -23382 4575 32727 29918 22556 45003
14265 45003 54622 40229 37250 9089 -3700 -20187 -11766 34972 42453 21696 23618 29953 69216
14252 69216 95530 110980 73100 37926 23252 8806 -1113 4148 11984 39549 32530 -17584
14240 -17584 -20677 5577 34441 34016 34875 41351 19846 -2425 8381 16715 -17219 -20743 3663
14227 3663 19713 43138 48740 71575 50848 37389 16195 18078 9086 -4104 -3935 30403 47372
14214D7372J9429j080k5404j1776m507J2799k2002O769L2954J1352j8829J5898
14202F2975m733j1546p844j069r799k4146j5225J291j9511M650M6947j5009k5216
14189a8235Q506K4202N014j2529o031J3594J761j7642N341R732Q724j2492p229
14176B716K2044K0337p420m3706m6665K2200K5663K3573P245j2372M233J5346
14164C3194j3543N8j270j7917m401K0789J2563J2920m357j1880j7914k6880P662
14151a0976J7160K9638K6577J2001j3431j9233n388o937l1934j7037J8321K2390
14139B1151k7989j8184J6771J7358J4970Q497J8462r42K207j151J9472r087k4681
14126C6854J601j532r505Q814o166k7597K9466j0690m551L3500N421q138k3591
$$ plain form
14214 47372 66801 65721 40317 28541 24034 36833 14831 21600 54554 65906 47077 62975
14202 62975 58242 46696 38852 37783 27984 3838 -11387 -10096 -29607 -24957 21990 6981 -18235
14189 -18235 -9729 14473 19487 6958 927 14521 16282 -1360 3981 13713 22437 9945 2716
14176 2716 24760 45097 37677 -6029 -52694 -30494 -4831 18742 25987 13615 17848 33194
14164 33194 19651 19709 18439 522 -3879 16910 29473 42393 38036 26156 8242 -18638 -10976
14151 -10976 6184 35822 62399 74400 60969 41736 36348 29411 -2523 -19560 -1239 21151
14139 21151 -6838 -25022 -8251 9107 24077 32574 51036 50094 52301 51150 70622 61535 36854
14126 36854 38455 36923 27418 36232 30066 2469 31935 21245 16694 50194 55615 47477 23886
14113B3886Q324k882q220m0792k4840L9634J7765J5904K1073O839k1479l4298
14101I14m824J8113j43m843Q092ol855O943N865J3911p993j0265l2123p63J8112
14086G135J4618L896J6058L0724q501j3267j0932R728j4859l7931o088J4704J9047
14073B4332K7035K070j0657J7454p206j8457j7167J683J071J6867K6334N878j7817
14060E1420m307j2976J2940N414j4454Q111J9829r542l0205j9336k7372j2491
14048c2969L1812K9748n222J2847o871m6J6513L2993R873J0792l1952P89j973
14035F6334l672j8966l2850j1304Q269M1095K9013j2540k8206j6723k7177M621
14023b106J288J1154J5202O954N199M346K659l2717N664J797j808K6307P857j1920
$$ plain form
14113 23886 32210 29328 21108 -19684 -44524 -4890 12875 28779 49852 56691 35212 914
14101 914 -3910 14203 14060 9217 17309 17303 13448 20391 26256 40167 32174 21909 -10214 -10977 7135
14086 7135 21753 25649 41707 72431 63930 50663 39731 49459 34600 -3331 -9419 5285 24332
14073 24332 51367 53437 42780 60234 53028 34571 17404 19087 20158 37025 63359 69237 51420
14060 51420 47113 34137 47077 52491 38037 46148 65977 56435 26230 6894 -20478 -32969
14048 -32969 -1157 28591 23369 36216 29345 29299 45812 78805 88678 99470 67518 68307 66334
14035 66334 62662 43696 10846 -458 7811 48906 77919 65379 37173 20450 -6727 -2106
14023 -2106 -818 10336 25538 32492 37691 42037 44696 11979 17643 19440 17632 43939 51796 39876
14009C9876j738J6731p686K839j5694P612J324q111j270R16J9174k1712k3719
13996H542L6854P83Q789K1695N663j1493k8842j4327j4509j2464N619L5352O600
13983D8262j7852n199k2884K0868J7903J6461J9823J3159j4265l666P712j8723
13971F1599k1782k0695J0806n885p020m335J1159L984L659M326L3280j0652o954
13958E1490k0627l1182l3970M610K3597N005P619J4065J153j51K6837J2847q12
13945F0481j219K1337J4186R871k2546k9912k711K782j3182J7514J9662N086l3461
13932D7888j2748O664J9438J5228j4253k5922J7080k7885j0868N92K0358J5775
13920E1347O907Q711Q34j0204K2123Q507k7207k3392m204j2984k302L681L350
$$ plain form
14009 39876 38138 54869 47183 50022 34328 41940 43264 35153 33883 34799 53973 32261 8542
13996 8542 45396 46179 54968 76663 82326 70833 41991 27664 13155 691 6310 41662 48262
13983 48262 30410 25211 2327 23195 41098 57559 77382 90541 76276 72610 80322 61599
13971 61599 39817 19122 29928 24043 17023 12688 23847 27831 31490 35816 69096 58444 51490
13958 51490 30863 -319 -34289 -29679 -6082 -1077 6542 20607 21760 21609 48446 61293 60481
13945 60481 59262 80599 94785 104656 82110 52198 49487 52269 39087 56601 76263 81349 47888
13932 47888 35140 41804 61242 76470 62217 36295 53375 25490 14622 15214 35572 51347
13920 51347 58254 66965 67799 57595 79718 88225 61018 37626 33422 20438 18136 21817 25167
13907B5167P341J3759K3504r663K274k1948k5536k0697N155r230k5171L7345P705
13894A0005J4764r7K0732O419O43J0235J9352j3025J5960k263j1485K7735O440
13881A05415j9218k051j4312L896m496k6311M319R147l333q338P225J9526q764
13868F2705J5011j7680l1854L941p068J432J8682J4439J8409J0406j8175L26N466
13855G6040J086Q896J878n223k2561L49J054n268J3176o675J6669K1808j1901
13842H9328P558n778m807p790L2520P925J1512j6991q185n800L313j0331J5290
13829A07764O39p131j8766k1159j2303J2088P693J2631J1027J7051j2245l628
13817I3661j8050k3013J5179k185P865k1257j0435R909J796J9522j0577p777Q876
$$ plain form
13907 25167 32508 46267 69771 60108 62382 40434 14898 -5799 -644 -9874 -35045 2300 10005
13894 10005 24769 24672 45404 51823 52466 62701 82053 69028 84988 82725 71240 98975 105415
13881 105415 86197 84146 69834 73730 69234 42923 47242 56389 53056 44718 51943 71469 62705
13868 62705 77716 60036 28182 32123 25055 26487 45169 59608 78017 88423 70248 70574 76040
13855 76040 77126 86022 87900 82677 60116 60465 61519 56251 69427 62752 79421 101229 89328
13842 89328 96886 91108 86301 78511 111031 118956 130468 113477 105292 99492 102805 92474 107764
13829 107764 108403 101272 82506 61347 49044 61132 68825 81456 92483 109534 97289 93661
13817 93661 75611 52598 67777 65592 73457 52200 41765 51674 53470 72992 62415 54638 63514
13804F3514l326l3879j4344M753L8615K7637l162k3590k4435k299P854K8696J2174
13791G8208M18J5242m79k2547M479j1270j9304k4679P426M5358P875m0199j0175
13778C0353q573J2585J3231l9160M769J4888P84j3266P221K2260J4364p219k5170
13765B7067P635J5752J8775J6800J5252l375k4485j3439R257O195j2111l1997
13753C1326j9240J7743M9113K335k3646r603J0104o100J1659K699J0626L3795
13741A10811o008o322P467p208N239K3478l220k4631k3054l8319J1161J2447J3453
13728G5294K4504L10k2996k7585j2494Q473j0713j0084J2909J1201m808k5275
13716A8736q047K6781J6184q770J2926J5277m922l2707j4501K5115J0533o988
$$ plain form
13804 63514 60188 26309 11965 16718 55333 82970 79808 56218 31783 29484 37338 66034 78208
13791 78208 78626 93868 93389 70842 75321 64051 44747 20068 27494 72852 80727 40528 30353
13778 30353 21780 34365 47596 8436 13205 28093 28877 15611 22832 45092 59456 52237 27067
13765 27067 34702 50454 69229 86029 101281 97906 73421 59982 69239 75434 63323 31326
13753 31326 12086 29829 78942 81277 57631 48028 58132 52032 63691 66390 77016 110811
13741 110811 104803 98481 105948 98740 103979 127457 124237 99606 76552 38233 49394 61841 75294
13728 75294 99798 100108 77112 49527 37033 45506 34793 24709 37618 48819 44011 18736
13716 18736 10689 37470 53654 44884 57810 73087 68165 35458 20957 46072 56605 49617
13704D9617R105p99j7014J5890j0412k0279M1486J1670k973R172J2410J8811O748
13691A23432j5072k3614K2000l721k8737p579J6146M047Q043j5575j3862k9305
13679C6203j7974l137J5220K0239L6727L1415Q415j9753l2888o211K4198p924
13667H4530j0794j7946j0476K8835n236j1169j1154m834m657J7974J8890q970
13655F4993J2488K9794l201l220J8348K1753l969l4195l6598q035K179O42J6902
13642G7881J7948K7216O363m090K007m528q491j5887k85q568n351j5083o053k5215
13628C7864R211k791K3763J6838R861J3819j3370O017k2381k896M8709L907L0446
13615A58997m896j4097L6913J7873N442j9249J4343N45n752k4770q951j1293R342
$$ plain form
13704 49617 58722 57923 40909 56799 46387 26108 67594 79264 76291 85463 97873 116684 123432
13691 123432 108360 84746 106746 103025 74288 66709 82855 86902 94945 79370 65508 36203
13679 36203 18229 15092 30312 50551 87278 118693 127108 107355 74467 68256 92454 84530
13667 84530 73736 55790 45314 74149 68913 57744 46590 41756 37099 55073 73963 64993
13655 64993 77481 107275 104074 100854 119202 140955 136986 102791 66193 58158 60337 60979 77881
13642 77881 95829 123045 129408 125318 127325 122797 114306 98419 98134 89566 84215 69132 63079 37864
13628 37864 47075 44284 68047 84885 94746 108565 95195 101212 78831 75935 124644 128551 158997
13615 158997 154101 140004 176917 194790 200232 180983 195326 195871 190119 165349 156398 145105 154447
13602A54447L33k0668k4759l7810L965J6450J3480k4883k8877K7359L7154K8283
13590A44474J452k6426j4754K80p763O618J1379O849M315j4752K7568q892j1452
13577A18896Q498J6995m687j2824j3879j269K6552p187O161K3751j8439l1713
13565A10855J1902N658l943R326K6716k0776j7434r518M0p530k0243k766j80J2630
13551I4737L6871J3434j8446q889k338K1233J3269J220j3149j6745j5099N793
13539A11891j3998J0083K5135L4000J0457j994k133l3637p096j6435k0757k5851
13527F9665K4591K1257N805Q314j02L0972J5955M382J3711l9299j6200m482M825
13514A39394O320K9917l714k8686L177M477J7793P740M936j3449l735J0326K7229
$$ plain form
13602 154447 154780 134112 109353 71543 75508 91958 105438 80555 51678 79037 116191 144474
13590 144474 145926 119500 104746 105026 97263 103881 115260 122109 126424 111672 139240 130348 118896
13577 118896 127394 144389 139702 126878 112999 111730 138282 131095 137256 161007 142568 110855
13565 110855 122757 128415 124472 133798 160514 139738 122304 112786 112826 105296 85053 82287 82107 94737
13551 94737 131608 145042 126596 117707 115369 136602 149871 151091 137942 121197 106098 111891
13539 111891 97893 107976 133111 167111 177568 175574 173441 139804 132708 116273 95516 69665
13527 69665 94256 115513 121318 129632 129530 160502 176457 180839 194550 155251 139051 134569 139394
13514 139394 145714 175631 171917 143231 146408 150885 168678 176418 181354 167905 164170 174496 201725
13501B01725L4151j528K1279M0155O0697P3295R6195J18208K11123K39405L20302
13490A415007L85240L12528J31849j74095l94083l82735k34843j89291j36377
13481G33200q8627o3189o4468l8900j4967l8389m1143O181l0992l7174j4980j0817
13469B95735j9571K12j6902L487j0891k8929n119k0441O144J449j4065j0468J789
13456A82430Q80J2784o049k7237m81j0536j9816K91Q534l7805O011K7103K8547
13443A64656j4403j6010K2157K0504L02O972l0280k6293J2293J0744k219j8478
13431A29945J4479j1337M196R203J0354q05k594m576o981n097J7599J0071m933
13418A59524J5893J100m1937l0022J8595K3003K15P457j1065k713l621l685K791
$$ plain form
13501 201725 235876 234348 255627 295782 356479 429774 525969 644177 855300 1094705 1415007
13490 1415007 1800247 2112775 2244624 2070529 1676446 1293711 1058868 869577 733200
13481 733200 644573 581384 516916 478016 463049 424660 383517 389698 358706 321532 306552 295735
13469 295735 276164 276376 259474 262961 252070 223141 218022 197581 203725 205174 191109 180641 182430
13456 182430 183310 196094 190045 162808 162327 151791 131975 132266 140800 102995 109006 136109 164656
13443 164656 150253 134243 156400 176904 177206 184178 153898 127605 139898 150642 148423 129945
13431 129945 144424 133087 137283 146486 156840 156035 153441 148865 141884 136787 154386 164457 159524
13418 159524 175417 176517 134580 104558 123153 146156 146371 153828 142763 140050 136429 132744 135535
13405A35535L908R166Q671p322J1223J959J7812K787k6089k2261J3214J1287j5889
13392A44001K1553L0512q059k2188J3577J5873q433j9256K1667J9215k5253j6334
13380A66875M150l954o794o860R436P177J6664J6517o792p257J1012J9527m981
13367B14720q94j52j5591j6801J407Q41J9725l792j0901j6878p586R065o923o714
13353A59526Q817j2080j7059j056j077J9725q974O396J6101J4996O527J0521l8133
13340A64230L291K605J163J8559J8335L023P854J0750j9157j7694L673j9110l1065
13327A46457N900J7117K1583m854k458J1816O72l3167K2062O7501J4941j7317
13315B50253p220n153j5482k3218q887K8768K2534J5746r16j0662K0345J1392
$$ plain form
13405 135535 139443 148609 157280 149958 161181 163140 180952 183739 157650 135389 148603 159890 144001
13392 144001 165554 196066 188007 165819 179396 195269 186836 167580 189247 208462 183209 166875
13380 166875 171025 167071 160277 153417 162853 170030 186694 203211 196419 189162 200174 219701 214720
13367 214720 213826 213674 198083 181282 182689 183530 203255 199463 188562 171684 164098 173163 166240 159526
13353 159526 168343 156263 139204 138148 137071 156796 147822 154218 170319 185315 191842 202363 164230
13340 164230 167521 170126 171289 189848 208183 211206 219060 229810 210653 192959 196632 177522 146457
13327 146457 152357 169474 191057 186203 183745 195561 196233 163066 185128 252629 267570 250253
13315 250253 243033 237880 222398 199180 190293 219061 241595 257341 256425 245763 266108 277500
13303B77500P008K0277M1318K7586M034Q757J069l6007k2662N808n762p665k9587
13290B91674j6249k0470k1041k2496J3580K7360M947L2689L3184j0927K3239O437
13278C41927p017J2841n334n091j17k0597j4145l5572J666P110o826R002K3442
13265C01289N107m7368p911L4698P028r374J5355K1289k437K0674J7975J3887
13253C70212J7438k8850Q516r022O029L1126O92k402j7729k9614j3332J6633P965
13240C57662j3433k1715l4273l8275J311m684k8409L9109P3684N5169L8422Q321
13228D32889l4880m374m141j1424M251M2088j0332j0069M068J2923k0072l9106
13216C61821k6546J3591M2361K6174m10J8924N147m9009k5399J3591L841r796
$$ plain form
13303 277500 284508 304785 346103 373689 377723 386480 387549 351542 328880 334688 328926 321261 291674
13290 291674 275425 254955 233914 211418 224998 252358 257305 289994 323178 312251 335490 341927
13278 341927 334910 347751 342417 337326 337209 316612 302467 266895 268561 275671 268845 277847 301289
13265 301289 306396 259028 251117 285815 292843 283469 298824 320113 317676 338350 356325 370212
13253 370212 387650 358800 367316 358294 364323 395449 396141 393739 376010 346396 333064 349697 357662
13240 357662 344229 322514 288241 249966 251277 246593 218184 257293 330977 386146 424568 432889
13228 432889 398009 393635 389494 378070 382321 424409 414077 404008 408076 420999 400927 361821
13216 361821 335275 348866 391227 417401 416991 435915 441062 392053 366654 380245 384086 374290
13204C74290J2289K5155M3195M2276K2405L0679J0322K8192K489J3360M785N321
13192F14758q362l183N515J4512M470N076o51J8708M9497K3174n078K101L1176
13179G51713P9772R9256N2917P6570J11331J15197J32916R0851l1348j80367k52737
13168A046071j93090r4357K4330J8901l4032j2215l3538J1069J7299M2181M142
13157G96761n129K1675O6779K4347O660M2091j0244l1295m561J7457K9685L1929
13145I86155J4815P224k2m242n206J2391L0536K9961Q731M87O676K4005K3387
13132A134898L91J9539L8524N4095K7207O0581O1516Q6469J10279O9444j0193
13121A652750o9156j11690l4991m856p28k491j485J5092N1798M9872N4136O3671
$$ plain form
13204 374290 386579 411734 454929 497205 519610 550289 560611 588803 591292 604652 609437 614758
13192 614758 606396 603213 608728 623240 627710 632786 632135 650843 700340 723514 718436 720537 751713
13179 751713 831485 930741 983658 1060228 1171559 1286756 1419672 1510523 1479175 1298808 1046071
13168 1046071 852981 758624 782954 801855 767823 755608 722070 733139 750438 792619 796761
13157 796761 791632 813307 880086 904433 911093 953184 942940 911645 907084 924541 954226 986155
13145 986155 1000970 1008194 1008172 1003930 998724 1011115 1041651 1071612 1080343 1080830 1087506 1111511 1134898
13132 1134898 1135289 1154828 1193352 1247447 1274654 1335235 1396751 1483220 1593499 1662943 1652750
13121 1652750 1583594 1471904 1436913 1432057 1431329 1428838 1427353 1442445 1494243 1544115 1598251 1661922
13109A661922L6843O5632O0004N8975Q1696Q2482N2762K8165K7531J6382L5266
13098B207660M4448K6882M3036L7401M2458K2280O953M3347O2077P8260Q4737
13087B699539J22532J19690J02365J44510J72925J24430J25570J54799J52663
13078C919023J62318J87674K07402K44531K83403L19903L47781L68315M56304
13069F496654N07444N33536N78034O48477P59875Q58427R70871J206840J462105
13060A4022263J765059K112408K528241L207020M055407N237446O996075R466546
13052D9390465J2937028J7576766K3602625L1913958M4100323O1635722P9207105
13045C20363992P8097930L8784050l4201647q5807841q0731329n7317689l8076365
$$ plain form
13109 1661922 1698765 1764397 1824401 1883376 1965072 2047554 2100316 2128481 2156012 2172394 2207660
13098 2207660 2252108 2278990 2322026 2359427 2401885 2424165 2431118 2474465 2536542 2614802 2699539
13087 2699539 2822071 2941761 3044126 3188636 3361561 3485991 3611561 3766360 3919023
13078 3919023 4081341 4269015 4476417 4720948 5004351 5324254 5672035 6040350 6496654
13069 6496654 7004098 7537634 8115668 8764145 9524020 10382447 11353318 12560158 14022263
13060 14022263 15787322 17899730 20427971 23634991 27690398 32927844 39923919 49390465
13052 49390465 62327493 79904259 103506884 135420842 179521165 241156887 320363992
13045 320363992 398461922 437245972 403044325 317236484 236505155 179187466 141111101
13038A41111101k5378406j7640291j3081521j0042000p454720n357187m022804
13031E8134172l842214m458215m904527m793263m320383l797101l307215k979908
13023B5731346k678171k359179k027925j772833j561656j352950j230347j148268
13015A1600017j058213r40809q26780p20599o68650o14812n32591m54158m58345
13006E325060m23959l73113l24087l20523k74245k78834k52551k35677j93523
12997B648548j81568k01224k05577k08239j74811j26263r8854q6705p5611q3177
12987A206519p8769q6103l9885O289Q631M9410N3750K6358j6080l8456j23406
12976I68258j19569o2618l7710l3848j4972l2549k2784m5523k0371j5041l5712
$$ plain form
13038 141111101 115732695 98092404 85010883 74968883 67514163 62156976 58134172
13031 58134172 54291958 49833743 44929216 40135953 35815570 32018469 28711254 25731346
13023 25731346 23053175 20693996 18666071 16893238 15331582 13978632 12748285 11600017
13015 11600017 10541804 9600995 8774215 8053616 7384966 6770154 6237563 5783405 5325060
13006 5325060 4901101 4527988 4203901 3883378 3609133 3330299 3077748 2842071 2648548
12997 2648548 2466980 2265756 2060179 1851940 1677129 1550866 1452012 1365307 1289696 1206519
12987 1206519 1127750 1041647 1001762 1008051 1016682 1066092 1119842 1146200 1130120 1091664 968258
12976 968258 848689 786071 748361 714513 699541 666992 644208 598685 578314 563273 527561
12965E27561j9771j9781k8241j6469j0121M755Q60j6620l9292m1405R091J8721
12953C69288k0672k7593j4510l3144K24j2699j1996J6723M7105l819l0374j1504
12941B67029N037L1522q500K123K4858L2125K8692n827l6657m6934m5389L598
12929B51677K5155q682j9360J7906L2737J0343J8836L7975J47075J95232J52093
12918H60987N9726n9780j53886j96897j35506j13134o9230k9566m0421o564j370
12907A14359k628j7944o506K3647K3533K3579j1675p245j5612l3516j1325R719
12895H8386K4849r496k0480j2251K9946L7477K0732K3315O35J9528M1247l3900
12883B09988L272L719j2210j2212k3007k9729p602R337R969l3742l1831N151p430
$$ plain form
12965 527561 507790 488009 459768 443299 433178 437933 438793 422173 382881 341476 350567 369288
12953 369288 348616 321023 306513 273369 273593 260894 248898 265621 312726 308907 278533 267029
12941 267029 272066 303588 295088 297211 322069 354194 382886 377059 340402 293468 248079 251677
12929 251677 276832 268150 248790 266696 299433 309776 328612 366587 513662 708894 860987
12918 860987 920713 860933 707047 510150 374644 261510 192280 162714 122293 115729 114359
12907 114359 111731 93787 87281 110928 134461 158040 146365 139120 123508 89992 78667 88386
12895 88386 113235 103739 83259 71008 100954 138431 159163 182478 183113 202641 243888 209988
12883 209988 213260 216979 204769 192557 169550 139821 132219 141556 151525 117783 85952 91103 83673
12870H3673j7526j1423j6912j5273Q028k70j1439k2800j8615l6869M035K9354
12858b6037K9868J5195L5003N1836J4893j1338Q67J6627Q849l2042l9142k1119
12846D3460m458p14k1798o237N907R131l752j9074j0260L5761L0633m2k1109j1657
12832B5791j0119K805K2892K4747K8179J0785k781j3439j0493j9918q092J1547
12820F1904R188L758k1226k5506q739k34j9067l0175o799k2023K127J0612K1139
12807b5041j5523n676Q164N6315K8957k224p900M238k4424R298l98K5829K6395
12794G8010K3633k3609l105m962J0909J322l273M770J408j0722j0399j1225j3299
12781C9458K810K0984J0862K713l250j7545m060k1158J0007K1799j2601p385r493
$$ plain form
12870 83673 66147 54724 37812 22539 30567 30297 18858 -3942 -22557 -59426 -55391 -26037
12858 -26037 3831 19026 54029 105865 120758 109420 110287 126914 135763 103721 64579 43460
12846 43460 39002 38288 16490 10253 16160 25291 21539 2465 -7795 27966 58599 58557 37448 25791
12832 25791 15672 18477 41369 66116 94295 105080 102299 88860 78367 58449 50357 61904
12820 61904 71092 74850 53624 28118 19379 19145 78 -30097 -36896 -58919 -56792 -46180 -25041
12807 -25041 -40564 -46240 -38076 18239 47196 44972 37072 41310 16886 26184 25786 51615 78010
12794 78010 101643 78034 74929 69967 80876 82198 78925 83695 85103 74381 63982 52757 39458
12781 39458 42268 63252 74114 76827 73577 56032 51972 30814 40821 62620 50019 42634 33141
12768C3141J1944K5573m822m3693l2067O785J7797L8017K0404L1556r458j7692
12756G7485r314j2356J2966M347l2380j9133L5180K4221m958N853N052R625l720
12743I2868n084L170l180J9240o648k6594J3784J6442J6926N878j0876m1929k1337
12730E2660K6122K7884o400p932j5024m3713p742M920n896P327j4370M098J796
12717B3730Q661J8574L2533k9240q606j5340K3953n81k8867q325K6998J6628J8375
12704G8493k8899p402j2022L1084L25j0797j5638p145J9632j1325k6506K261J3211
12691B5272K7828N817Q986Q933k0205k871k572k5960P836J8512k8067m931O631
12678B5209K9984J1883L931K1180R388j3549j4846l0319j0284j7614J7229J7429
$$ plain form
12768 33141 45085 70658 65836 22143 -9924 -3139 14658 52675 73079 104635 95177 77485
12756 77485 68171 55815 68781 73128 40748 21615 56795 81016 76058 81911 86963 96588 92868
12743 92868 87784 90954 87774 107014 100366 73772 87556 103998 120924 126802 115926 73997 52660
12730 52660 78782 106666 100266 92334 77310 33597 25855 30775 24879 32206 17836 21934 23730
12717 23730 32391 50965 83498 54258 45652 30312 54265 53684 24817 16492 43490 60118 78493
12704 78493 49594 42192 30170 61254 61579 50782 35144 27999 47631 36306 9800 12061 25272
12691 25272 53100 58917 67903 76836 56631 53760 51188 25228 33064 51576 23509 18578 25209
12678 25209 55193 67076 71007 92187 101575 88026 73180 42861 32577 14963 32192 49621
12666D9621n5285J7008L9575j1574J3111L737J3403N970N830l614j5810j554K1455
12653H1873M136n23k1559P157N258L88j9890p519J574J7382m271k390J170O663
12639F9449M279j4081K423P038L9321j2319m0677j6053J3172L1444q790o224k5522
12626D3460J8720K1447o290J4362j5446j1204l4223J3082J4497K4862K4022L0824
12614A38113J4899r558m200J083o820K2034K297j6849r205J2835L9833N6471N8684
12601B99617J02082J07878J14293J11241J85481K86378L63986L58512J91578o0971
12591B060075l53633l61236k89819j93249j57071p9760n2607o6422m1076j8967
12581D46235k6283k5708l8672j3434j6928n8290m2325j9868k944l063j5207P073
$$ plain form
12666 49621 -5664 11344 50919 39345 52456 56193 69596 75566 81396 77782 61972 60418 81873
12653 81873 86009 85486 63927 71084 76342 76730 56840 49321 50895 68277 64006 61616 62786 69449
12639 69449 73728 59647 62070 69108 108429 96110 55433 39380 52552 83996 75206 68982 43460
12626 43460 62180 83627 77337 91699 76253 65049 30826 43908 58405 83267 107289 138113
12614 138113 153012 143454 139254 140337 133517 155551 157848 140999 131794 144629 184462 240933 299617
12601 299617 401699 509577 623870 735111 920592 1206970 1570956 1929468 2121046 2060075
12591 2060075 1706442 1345206 1055387 862138 705067 625307 572700 506278 465202 446235
12581 446235 419952 394244 355572 342138 325210 266920 224595 204727 201783 198720 183513 190586
12569A90586j307k5080j1444n4267k230P854j4556r195l529P072K524k1464m371
12556F0593J9094K3586J4611m231j3005k9630K342J2210K1659J0072m5458o5422
12544F421J2066K9169J3475J803k6366k354J2695M5227J2191n554O936J7463k6342
12531I6830k5109J2924j1968k3446J3888j2227k7355k0882K3617J1716J2612K1234
12519G1834J5133k5049j688J9091p127j2529j2493N93j6966J7890j912N395K1281
12506G3453o237j2796J840k636K3518Q804P125K4268K8452j4511q30n66k2878
12493A07006J657J5140p360r495k507J009l2260K3556Q371L55N643j1838r40O198
12479A04535l4607j6435P404L949Q633K2232N231P608L094J4321j8921k2683M567
$$ plain form
12569 190586 189279 164199 152755 98488 96258 104112 89556 80361 76832 83904 86428 64964 60593
12556 60593 79687 103273 117884 113653 100648 71018 73360 85570 107229 117301 71843 6421
12544 6421 18487 47656 61131 62934 36568 34214 46909 92136 104327 98773 105709 123172 96830
12531 96830 71721 84645 72677 49231 63119 50892 23537 2655 26272 37988 50600 71834
12519 71834 86967 61918 60230 79321 72194 59665 47172 47765 30799 48689 46777 52172 73453
12506 73453 67216 54420 56260 53624 77142 85946 93071 117339 145791 131280 130450 129884 107006
12493 107006 108663 123803 116443 106948 104441 105450 73190 96746 105117 105472 111115 99277 98337 104535
12479 104535 69928 53493 60897 64846 73479 95711 100942 108550 111644 125965 107044 84361 88928
12466H8928J0729p304k1635l0626J5279M7891K5084j4590k1647L383O997P837
12454A10326K2288M494j0248L9351K1244L2167L7971K5846J0704n6358l2825k2827
12442A82133j6730l4215j3009R965J4250R672j5810j2982J838O153j1770j0436
12430A09059j5396J4951R817L0514J9450j2884K650J5619j9153O871j7438j2210
12418A31850J1267l698l0474K288j7058q175Q372J7832j794o913n546k0690r614
12405F7647K845J7534L1196r32k445L2060P158l6049n864K74r779j8261n302J2839
12391I2921J3728J7820j4644o300l397l515K1501j8808O689P741j3895r587J141
12378I1395l513O148L4313Q835m614K4454m030k2192J9494j1693k1029j1354k470
$$ plain form
12466 88928 99657 92353 70718 40092 55371 103262 128346 113756 92109 95492 102489 110326
12454 110326 132614 137108 126860 166211 187455 219622 257593 283439 294143 237785 204960 182133
12442 182133 165403 131188 118179 128144 142394 152066 136256 123274 125112 131265 119495 109059
12430 109059 93663 108614 118431 148945 168395 155511 158161 173780 154627 161498 144060 131850
12418 131850 143117 139419 108945 111233 94175 86000 94372 112204 110410 103497 97951 77261 67647
12405 67647 70492 88026 119222 118290 115845 147905 155063 119014 113150 113424 103645 85384 80082 92921
12391 92921 106649 124469 109825 103525 100128 96613 118114 99306 105995 113736 99841 90254 91395
12378 91395 87882 94030 128343 137178 132564 157018 152988 130796 150290 138597 117568 106214 103744
12365A03744M1698L095Q368K451j7045l1359j8970n468O949J369m368L2550L2949
12352A55963J323Q979j4043m609K526j4464k948O600K9088P613P794m1253L286
12339A45855K3958j602j5979K087k2450m197J4706M983J0106K836j449q597K7106
12326A77363M035k2078k3342O96J2702K4382k2428J118K3418N580k0139p453N028
12313A58882K3002q058P720j9785l870K0440L4846j7155p459j1284j2359P494
12301A72414K8718J4930k0321J0777Q538l6286J553P813P487J2876J8281J0128
12289B36908J2863r946j7482k7532l2135K4058K7784l551J8649J8577J0518p750
12277B50961J4949R259M012l14j8706o320q130j9693K640n24P02N942n584J2189
$$ plain form
12365 103744 145442 148537 156905 159356 142311 110952 91982 86514 93463 94832 90464 123014 155963
12352 155963 157286 166265 152222 147613 150139 135675 132727 139327 168415 176028 183822 142569 145855
12339 145855 169813 168211 152232 154319 131869 127672 142378 147361 157467 160303 158854 150257 177363
12326 177363 181398 159320 135978 136674 149376 173758 151330 152448 175866 181446 161307 153854 158882
12313 158882 181884 173826 181546 161761 157891 178331 213177 196022 188563 177279 164920 172414
12301 172414 201132 216062 195741 206518 215056 178770 180323 188136 195623 208499 226780 236908
12289 236908 249771 239825 222343 194811 162676 186734 214518 210967 229616 248193 258711 250961
12277 250961 265910 275169 279181 278867 260161 253841 245711 226018 228658 228134 228836 234778 229194 241383
12263B41383K3786j8153k6699j105K4698R371k7812m812j1839J9202q009M95L2600
12250B53106J5824J0400l2297m141L3606K5907O064j2217l6856j1963K3193J3589
12238B84215J8551k6964o957J9113k4935m415N154J0309n390K980k0411M84L879
12225B55613J7324j0453J0591K4446k0691j1641L0721L0876J5091l054k7453j5083
12213B96287j6119K1943K7233L5158Q168l0415J890L093R452M799P309n1554k6758
12200B90486j0770L0310J6577O39L4700J0675p290k8942k346J1474n860K1201
12188C60854K5361j4340k1224j0594P732J5105N4689M552j2357j0093Q39L830
12176D04354K7495P990L218l46k976l8718k7662K5796m313q17K364J3199l229
$$ plain form
12263 241383 265169 247016 220317 219212 243910 253281 225469 220657 208818 228020 220011 220506 253106
12250 253106 268930 279330 247033 242892 276498 302405 308469 296252 259396 247433 270626 284215
12238 284215 302766 275802 268845 287958 263023 258608 263762 274071 268681 271661 251250 251734 255613
12225 255613 272937 262484 273075 297521 276830 265189 295910 326786 341877 338823 311370 296287
12213 296287 280168 302111 329344 364502 372670 342255 344145 347238 356690 361489 368798 317244 290486
12200 290486 279716 310026 326603 327242 361942 372617 365327 336385 334039 345513 339653 360854
12188 360854 386215 371875 350651 340057 347789 362894 417583 422135 409778 399685 400524 404354
12176 404354 431849 439839 443057 442711 439735 401017 373355 399151 394838 394021 396385 409584 406355
12163D06355Q940K107Q056J5971Q938K3547J1478o848K246J2636q518J95j6120
12150D68983m848j631J5416L8936L2283M404N29J9155j6174j0766K2245J5646
12138E84178R36R100j5204l6702L347J4243K1828J4375K8105N24R34K905k7544
12125F01025R345K3315K0120N074j1312K784j6732J2890J5001r31M550J4249K6662
12112G06040j0181O720P387J1343K8213Q029J2914J6113R054L687j5608O557M0873
12099H31141L5873L452J1580J806j5311J3755j8849j1140N854J1958L3836J2985
12087I16940L0254K3915n084j1942j2721r328n40K2953N1088m461R661k5990M764
12074I89509j8538r664J7297L1782M2397M272r234k648J6434J2828J3880Q77L3157
$$ plain form
12163 406355 415295 417402 425458 441429 450367 473914 485392 478544 480790 493426 484908 485103 468983
12150 468983 464135 462504 477920 516856 549139 553543 554072 573227 557053 546287 568532 584178
12138 584178 585114 594214 579010 542308 545655 559898 581726 596101 624206 624730 625664 628569 601025
12125 601025 610370 633685 653805 658879 647567 650351 633619 646509 661510 660579 665129 679378 706040
12112 706040 695859 702579 709966 721309 749522 757551 770465 786578 795632 799319 783711 790268 831141
12099 831141 867014 870466 882046 883852 868541 882296 863447 852307 858161 870119 903955 916940
12087 916940 947194 971109 966025 954083 941362 932034 931494 954447 1005535 1001074 1010735 984745 989509
12074 989509 970971 961307 978604 1010386 1052783 1057055 1047821 1045173 1061607 1074435 1088315 1089192 1122349
12061A122349M6571K4178N313P738J7339K9557J6199K6687j6827k480L6372j4619
12049A298377j153K3523j6647n257J4512L2566K8003K1485O565O202N7763M7932
12037A513871m031m1553k5683J1974L6648L2993R178R445K4905K7331K4681M145
12025A623904J3567J5033J7556K3907J9468L6303K6539K3244J1378K5708J8441
12014A855048K5698P2967K6558L612N5717K2486l0428j7534L3926L0354L2082
12003B110486M4698J8351l652L3437L9386K6137J605J3808M7910O4835K0416p997
11991B409420K5208K1828L3930J2401K547M2343J4022K264O1668L5742K2057M4743
11979B728173K3931P675L9333M8568O356J0192P8416J8486K2272M4723K1560K4186
$$ plain form
12061 1122349 1168920 1193098 1198411 1206149 1223488 1253045 1269244 1295931 1279104 1276624 1312996 1298377
12049 1298377 1297224 1320747 1304100 1298843 1313355 1345921 1373924 1395409 1401974 1408176 1465939 1513871
12037 1513871 1509840 1468287 1442604 1454578 1491226 1524219 1533397 1542842 1567747 1595078 1619759 1623904
12025 1623904 1637471 1652504 1670060 1693967 1713435 1749738 1776277 1799521 1810899 1836607 1855048
12014 1855048 1880746 1953713 1980271 1983883 2039600 2062086 2031658 2014124 2048050 2078404 2110486
12003 2110486 2155184 2173535 2169883 2203320 2242706 2268843 2270448 2284256 2332166 2397001 2417417 2409420
11991 2409420 2434628 2456456 2490386 2502787 2505334 2547677 2561699 2563963 2625631 2661373 2683430 2728173
11979 2728173 2752104 2759779 2799112 2847680 2854036 2864228 2942644 2961130 2983402 3028125 3049685 3073871
11967C073871L1546M218J5496M8247K249J0390K5120J0597R972K6672L6214M4629
11955C339221P455q232K6709J0624j887M917K9063L3963K7914K5281J1216J3624
11943C519868K5708O949j8736k753j9582P013l755J5614M404J2260P08j3958n223
11930C528517N423p124o547K8817q211N169q966n227j0399J6072R985l7153j2927
11917C497429j0170j8316k9165o473q956m0363l8372k2445J6433k4084k4432k0937
11905C270149n1790l6244l9342k9172j5064j4427J5157K2406m8550m2330j7393
11894C013400l6431j8559k5581o4336k5407k0192j6169k7407m6412k4169k2002
11883B686735k6144P497m8168n3690j4604k3633l6844n3422m1789j5464r090m2887
$$ plain form
11967 3073871 3105417 3109635 3125131 3173378 3175627 3186017 3211137 3221734 3231706 3258378 3294592 3339221
11955 3339221 3346676 3338444 3365153 3375777 3373890 3378807 3407870 3441833 3469747 3495028 3506244 3519868
11943 3519868 3545576 3552525 3533789 3531036 3511454 3518467 3514712 3530326 3534730 3546990 3547698 3533740 3528517
11930 3528517 3533940 3526816 3520269 3549086 3540875 3546044 3537078 3531851 3521452 3537524 3547509 3510356 3497429
11917 3497429 3487259 3468943 3439778 3433305 3424349 3383986 3345614 3323169 3339602 3315518 3291086 3270149
11905 3270149 3218359 3182115 3142773 3113601 3098537 3084110 3099267 3121673 3073123 3030793 3013400
11894 3013400 2976969 2958410 2932829 2868493 2843086 2822894 2806725 2779318 2732906 2708737 2686735
11883 2686735 2660591 2668088 2619920 2566230 2551626 2527993 2491149 2437727 2395938 2380474 2371384 2328497
11871B328497j4321J7630l6841j0156j5717m3162l2464o0590j5537k3902n995
11860B087442K519m7060l4193Q670j8720m1935q505k6373k9088m6181m4081j1256
11848A791239J9379j5996k1494n7240n3480k8905r609Q169J89j1184j5191j0347
11836A595530o054j6466l4094o5082l5320k0899j1845j7514n5055K957N863p616
11824A334405M983l1636r058q157k1003l3568k9986q47p791p089J1345j2481M318
11811A193435l693k7644l5700j6862j1846K6531j7363k0265j9075M209p899K614
11799A066442j8769k8095m083Q487m602k5737l0206j6553k2058k4899j4424j4968
11787H70535K031j721K3154j0004l9641k8895j7081k4998r372l4356J729N166
$$ plain form
11871 2328497 2314176 2331806 2294965 2284809 2269092 2225930 2193466 2132876 2117339 2093437 2087442
11860 2087442 2089961 2042901 2008708 2017378 1998658 1956723 1948218 1921845 1892757 1846576 1802495 1791239
11848 1791239 1810618 1794622 1773128 1715888 1662408 1633503 1623894 1632063 1632252 1621068 1605877 1595530
11836 1595530 1589476 1573010 1538916 1473834 1438514 1417615 1405770 1388256 1333201 1336158 1342021 1334405
11824 1334405 1339388 1307752 1298694 1290537 1269534 1235966 1205980 1205133 1197342 1190253 1201598 1189117 1193435
11811 1193435 1189742 1162098 1126398 1109536 1097690 1124221 1106858 1086593 1067518 1071727 1063828 1066442
11799 1066442 1047673 1019578 1015495 1023982 1019380 993643 963437 946884 924826 899927 885503 870535
11787 870535 872566 870845 893999 883995 844354 815459 798378 773380 764008 729652 731381 736547
11775G36547j2599P109K5584k194k4572j9674p788n530j6892k2506J7260J767
11763F76512k1146K379l4605j6096R338Q836P193j4708J6464K3067m0870j1351
11751F05013O191J5384L416l8291q451k6186m2545L0735L3829o413Q824r460l8238
11738E33808p133l467N256k3232n535M526j0113l1181j1218L270L634P429l88
11725D65656N68J5576j8593l5521k3766J5058J9866j152m576K6509j1386k5830
11713D22409j558J04j4938K4944J9705k9694l1040O50O89M075k242K4718K0797
11700D38619p539l5737r780J7969k1852k2290k900J2581k7535k0320k7457j9730
11688B74029K4507L802Q56j1794K7593J173j1448L5988L130l7543k304L6697J449
$$ plain form
11775 736547 723948 731057 756641 754447 729875 710201 702413 696883 679991 657485 674745 676512
11763 676512 655366 657745 623140 607044 616382 625218 632411 617703 634167 657234 616364 605013
11751 605013 611204 626588 630004 591713 583262 557076 514531 545266 579095 572682 581506 572046 533808
11738 533808 526675 523208 528464 505232 499697 504223 494110 462929 451711 454981 458615 466044 465656
11725 465656 466224 481800 463207 427686 403920 418978 438844 437692 433116 459625 448239 422409
11713 422409 420851 420955 406017 430961 450666 420972 389932 390582 391271 395346 393104 417822 438619
11700 438619 431080 395343 385563 403532 381680 359390 356490 369071 341536 321216 293759 274029
11688 274029 298536 302338 303194 291400 318993 320166 308718 344706 347836 310293 307989 344686 346135
11675C46135k424j1524l8553R072K3979R116N738k9518M437k9630k9691L1427
11663B88564K9329j8868r684l462q987n80K6524O334n361j3897O169j6580k4012
11650B55489J1924J63M800l106N806l9734j6291J7897N06J9026J7313j2758Q895
11637B69930k9031k4652k4543k4448P112M0244J9064k383N414n472r610j3353
11625B08272l616n120j8478k7407O615J4896K4552J2230M188o256j1925l363n77
11612A94011p704M667J6875J2642Q198J5554j0083j6825R817r186l3979q278K608
11599A78317J9629k917r074q505j0502j464n860K6811J8869j0225k0707P4Q243
11586A82689k3584k1827M578J2667n152R423l9502J5012K8571K4214j3620l8736
$$ plain form
11675 346135 343711 332187 293634 302706 326685 335801 341539 312021 316458 286828 257137 288564
11663 288564 317893 299025 289341 285879 276892 276312 302836 309170 303809 289912 296081 279501 255489
11650 255489 267413 267576 272376 269270 275076 235342 219051 236948 237454 256480 273793 261035 269930
11637 269930 240899 216247 191704 167256 174368 214612 233676 231293 236707 231235 221625 208272
11625 208272 204656 199536 181058 153651 160266 175162 199714 211944 216132 209876 197951 194588 194011
11612 194011 186307 190974 207849 220491 228689 244243 234160 217335 227152 217966 183987 175709 178317
11599 178317 197946 195029 185955 177450 166948 165484 159624 186435 205304 195079 174372 174446 182689
11586 182689 159105 137278 141856 154523 149371 158794 119292 134304 162875 187089 173469 134733
11574A34733K815O862P994K1025K3930m287r029j4127k466n006j6840k2335K878
11561A26147J734N103K8503L6728k1171j8685k6221J8754j0054m0052j1341J5099
11549A04544j6759K2102J2650k468j4069O960J1410J5742n376k941n441j250J5456
11536A40560p330j2594K3119Q18k2378j4284o160q992K0003K3436J5594k3190
11524A28602j2920j2185j6205K2692J1274P654L261q138J0744J5371M0408k353
11512A88205j7824k4560K527m047j0540k60l4221j1367P303M4496J6557j0755
11500A45514J6794j9470m1797k5274n363O829K6554K3201M235J5006J2250l27
11488A58152k5709l5134k1992J7410K1947J7728l4219l4029R657k9L8014K6782
$$ plain form
11574 134733 137548 144410 152404 173429 197359 193072 184043 169916 167450 162444 145604 123269 126147
11561 126147 127881 132984 161487 198215 177044 158359 132138 150892 140838 100786 89445 104544
11549 104544 87785 109887 122537 120069 106000 112960 124370 140112 134736 131795 126354 125104 140560
11536 140560 133230 120636 143755 144573 122195 107911 101751 92759 112762 136198 151792 128602
11524 128602 115682 103497 87292 109984 121258 128912 132173 124035 134779 150150 190558 188205
11512 188205 170381 145821 148348 144301 133761 133501 99280 87913 95216 139712 156269 145514
11500 145514 162308 142838 101041 75767 70404 77233 103787 126988 131223 146229 158479 158152
11488 158152 132443 97309 75317 92727 114674 132402 98183 64154 73811 73782 111796 138578
11476A38578j7376j9736j2862J1389o835l6317K1753L3454k0664K190M0818j8462
11464A15930n8781j4400M472J7027J0373j8502K6494J4104m972j5358q318Q756
11452G6825o26J1061Q869j3174M406K1683l7082J6988P291j0974L769q577J654
11439H2113j7410n115K2264K2129J3124j0291k1957K6124J3351J134J2590j6045
11427A22011k1100j2064l0368j2020J4095L2359K7511k05M043n791j8064j1972
11415H8435R262J5646k2925k3172k3539K515R406J8067P247M903N795O204j6656
11402H1188O667J1033q871k189j4052q26o381l1719P88J4325K0708r171l2302
11389B9198k5339k749J2050R324J6461J5555Q338J7389R63r150Q994j123J1669
$$ plain form
11476 138578 121202 101466 88604 99993 93158 56841 78594 112048 91384 93574 134392 115930
11464 115930 57149 42749 47221 64248 74621 56119 82613 96717 91745 76387 68069 76825
11452 76825 76199 87260 96129 82955 87361 109044 71962 88950 96241 85267 89036 80459 82113
11439 82113 64703 59588 81852 103981 117105 106814 84857 110981 124332 125466 138056 122011
11427 122011 100911 88847 58479 46459 60554 92913 120424 120219 124262 118471 100407 88435
11415 88435 97697 113343 90418 67246 43707 46222 55628 73695 80942 85845 91640 97844 81188
11402 81188 87855 98888 90017 87828 73776 72950 66569 34850 35638 49963 70671 61500 29198
11389 29198 3859 1110 13160 22484 38945 54500 62838 80227 81190 72040 81034 79911 91580
11376I1580j2889j9342R902j4269J034R018J024J392K5395K918k1079N221j7863
11363F2042m998P357R723K6418L8750k9272m2958K786q68q627m8138r733K2130
11350B4612K478m998o811J584J7149L2141j2377k7775m911J78O941O995Q191L6449
11336G9846J1122k6559l6174M844o130J2043K9616j0943k2559j296J8645J2311
11324F4766M881Q122M146o0141l1928l1320J1252N9242M0519J1875J4612J0189
11312A06215q22j5356R353j587l7828o633L7915n81k3595k6658K5408k059j6840
11299D6932P12m914j913R798J3540k932K02k258J1394J9379j4466p597K4574j0040
11285H2411j6196p230p872J337n434J0716K2169p808o161k855J9190l280k3056
$$ plain form
11376 91580 78691 59349 69251 54982 56016 65034 66058 67450 92845 95763 74684 79905 62042
11363 62042 57044 64401 74124 100542 139292 110020 67062 69848 68980 60353 12215 2482 24612
11350 24612 27090 22092 15281 16865 34014 66155 53778 26003 21092 21270 28211 35206 43397 79846
11336 79846 90968 64409 28235 33079 26949 38992 68608 57665 35106 33810 52455 64766
11324 64766 69647 77769 81915 21774 -10154 -41474 -30222 29020 69539 81414 96026 106215
11312 106215 105393 90037 99390 97803 59975 53342 91257 90676 67081 40423 65831 63772 46932
11299 46932 47644 42730 40817 50615 64155 61223 61425 59167 70561 89940 75474 67877 92451 82411
11285 82411 66215 58985 51113 52450 47016 57732 79901 72093 65932 63077 82267 78987 55931
11272E5931j9677J789M488j7640L697K3794J9699p293R083J8995l0820O990k016
11259F7020k419K687n900K209j9562j537k1642J0307K597Q154K3482k99j2025
11246E3072o906j2629L15N827N763k5865j0267P767M474J3145K0234k1081l3286
11233E63K834P584R936M230j475l200j5236J9139N765N664Q344Q753Q314N280
11219F6495J5403J6246N418P635r790j6190j2943k7615l98K169M562o18K3163
11206G3537j0364M1423K4971o446p414j9062K8494J9936k0579l2080l9104q391
11194D4921J0804J9758j1628J6110Q648j0691k4812p574P593J3325j4928L253
11182E4779M0422q027k9204k2541k623O815j2199J3672o496J7101P639k885p859
$$ plain form
11272 55931 36254 38043 42531 24891 28588 52382 72081 64788 73871 92866 62046 69036 67020
11259 67020 64601 67288 61388 63597 44035 42498 20856 31163 33760 41914 65396 65097 53072
11246 53072 46166 33537 33852 39679 45442 19577 9310 17077 21551 34696 54930 33849 563
11233 563 3397 10981 20917 25147 23672 20472 5236 24375 30140 35804 44148 52901 61215 66495
11219 66495 81898 98144 103562 111197 101407 85217 72274 44659 44261 46430 50992 50374 73537
11206 73537 63173 104596 129567 123121 115707 96645 125139 145075 124496 92416 53312 44921
11194 44921 55725 75483 63855 79965 88613 77922 53110 45536 53129 66454 51526 54779
11182 54779 95201 87174 57970 35429 32806 39621 27422 41094 34598 51699 59338 56453 48594
11169D8594M498L034r327j2305j2838j1240k2450R970K6351j093r467R638M722
11156B8087Q907K8807k5725R72J3918j1920j5188n161k5247J5292J6798K6560
11144E6100j630r746L1914j1666k4886J4728L194j214M134l356P558n446J038
11131F0722O199r11m8103j0508J1135J5600j2727J217j357K2684L729n339Q861
11118E1202r945R190J0216J4314O997K4271L317M494j1310n560j7709k3042J0587
11105F7022q732j3827J5570P314K269j3432k9941J8677L0566l6138k4319O641
11093B1670L1201r034J2447K1939P873j1662O481q970j9625J0288o890k1432M681
11080C8967J6497N583l3872J1110P231l77k7989J4717m546l9529P817O967l206
$$ plain form
11169 48594 53092 56126 46799 34494 21656 10416 -12034 -2064 24287 23194 13727 23365 28087
11156 28087 36994 65801 40076 41048 54966 43046 27858 22697 -2550 12742 29540 56100
11144 56100 54470 44724 76638 64972 40086 54814 58008 56794 60928 57572 65130 59684 60722
11131 60722 66921 66010 17907 7399 18534 34134 21407 22624 21267 43951 47680 42341 51202
11118 51202 41257 50447 60663 74977 81974 106245 109562 114056 102746 97186 79477 56435 67022
11105 67022 58290 44463 60033 67347 69616 56184 26243 44920 75486 39348 15029 21670
11093 21670 52871 43837 56284 78223 86096 74434 80915 71945 52320 62608 55718 34286 38967
11080 38967 55464 61047 27175 38285 45516 45139 17150 31867 27321 -12208 -4391 2576 -630
11067f30J7072J9110p022k1160j2325j9372P266M3853N43N90K4379J651N886J8670
11053G8511J0242Q590j2978P258K7207O221j3411N281O485J3143k806k4308j4872
11040I4563j4433J2977J3510K0262M2747J4223K3520J6907k3027l5613j8894m401
11028A42341l285j8761K2717L0895K1578J4943J0357Q043J0159j2943l0523l2316
11016A63205k3510o168K477L1955M6894j2574k089Q070p681j0187J2170k5388
11004A77174j9119J02l1241P541R97k0946R212n369k0360l0015l513Q324K7099
10991I9886K6167J5122k9608k7824L0312L23J540j4836L211K9644k693l8442j9082
10978G3720j6418j3189k0112J986n883K4438n935J3863k7055P208j0560o906R527
$$ plain form
11067 -630 16442 35552 28530 7370 -4955 -24327 -17061 26792 27335 27925 52304 53955 59841 78511
11053 78511 88753 97343 84365 91623 118830 125051 111640 116921 123406 136549 133743 109435 94563
11040 94563 80130 93107 106617 126879 169626 183849 207369 224276 201249 165636 146742 142341
11028 142341 139056 120295 143012 173907 195485 210428 220785 228828 238987 226044 195521 163205
11016 163205 139695 133527 136004 167959 214853 202279 200190 208260 200579 190392 202562 177174
11004 177174 158055 158157 126916 134457 135454 114508 123720 118351 97991 67976 64463 72787 99886
10991 99886 126053 141175 111567 83743 114055 114378 115918 101082 104293 133937 131244 92802 73720
10978 73720 57302 44113 24001 25987 20104 44542 38607 52470 25415 32623 22063 15157 24684
10965B4684K1819m178l8510j7275J3737K4217J8835k26O498j09R792K7497J0944
10952I7725N794r887l2220j8098k577P743k3185m492K510L199N59J2810J4861
10939E4742J1751j4088k3034k8346K5320K9889k185l8588J711q248J1314J6972
10927C7210J7833J6159R86j1056J1349m461j548k3345r277J8767p57l2203k5002
10914e345K945J5793O731k5810k3400J7250N238J200L7428j4300j0598K7520M7416
10901H2068J1144k8385j5777k3670r816l0279q414R697m696J9171J2046K6131
10889C9220j1269j2291m733L8805J1185k1909k4949l7395O704M1128m142m353
10877A6001K8170J8059K6641j5612n2292k0808j300K46j146l039J3401J4572M269
$$ plain form
10965 24684 46503 42325 3815 -13460 277 24494 43329 43103 49601 49492 59284 86781 97725
10952 97725 103519 93632 61412 43314 40737 48480 25295 20803 23313 26512 27071 39881 54742
10939 54742 66493 52405 29371 1025 26345 56234 54049 15461 17172 8924 20238 37210
10927 37210 55043 71202 72188 61132 72481 68020 66472 43127 33850 52617 51860 19657 -5345
10914 -5345 -2400 13393 20124 -5686 -29086 -11836 -6598 -5398 32030 17730 7132 34652 82068
10901 82068 93212 64827 49050 25380 15564 -14715 -23129 -13432 -18128 1043 13089 39220
10889 39220 27951 15660 10927 49732 60917 39008 14059 -23336 -16632 24496 20354 16001
10877 16001 44171 62230 88871 73259 20967 159 -1141 -895 -2041 -5080 8321 22893 27162
10864B7162M4316j5819l7686K7872K2601k3718j8989N888n52N202J0596J2796
10852E9669j5179m3871l952K2251L2592J3624o833k2621j7556K0553N762P42K7918
10839G3099j6401J0113k185k3679P554m431o316J3396Q474k8768j9029J5225L2483
10826E9535M932J3993p05j809j518P389j8965J6844J834k1522q247o292m818q869
10812C1782O616K0991j7024k5261j0462l74K53m307R68J6540K2926R402n446K4275
10798G0879k938k6012O718j2167J7008O861o186J4051L661k7903k7894o355J7845
10785B7568J8579J5108j1704K1798J1787P082K8387o968r569q954j2935o193K042
10772G6028P62q536Q630K9468K304p008J3962O366k5872j8917r096J4046L2556
$$ plain form
10864 27162 71478 55659 17973 45845 68446 44728 25739 31627 31075 36277 46873 59669
10852 59669 44490 619 -3333 18918 51510 65134 58301 35680 18124 38677 44439 45181 73099
10839 73099 56698 66811 64626 40947 48501 44070 37754 51150 59624 30856 11827 27052 59535
10826 59535 64467 78460 77755 75946 74428 81817 62852 79696 81530 60008 51761 45469 40651 31782
10812 31782 38398 59389 42365 17104 6642 6268 6521 2214 3182 19722 42648 52050 46604 70879
10798 70879 67941 41929 48647 36480 53488 60349 54163 68214 71875 43972 16078 9723 27568
10785 27568 46147 61255 49551 71349 83136 90218 118605 111637 102068 93114 80179 73986 76028
10772 76028 76790 68254 76884 106352 108656 101648 115610 121976 96104 77187 68091 82137 114693
10759A14693j2530k2680m753r618k3204M499K527K538O235P582R186j2591J2625
10746G4509M977j7899J3421R830r796M814J3801k4150m657k7922j2530M0646J8901
10733H3945J3900q859R91J0748q746k9966P723J1183n888K5956K2129K7484J3649
10720A64249O889r862K9419p512l8718L638J4689K6304J2470j3131J2709J9327
10708B20471k2522j1482j6114j1425J2182j024j4265j0683k54p537j6533K5406
10696A46220K0302k3365Q259L5147K1385l5603J7859l691j6626j150R679k2089
10684A56327j693L2255J9952q123J4339l851J530M465O943L752J4241o077j9065
10671B14995K251K0757J7380p478J5092K4804J3080R033K6117J4566k668j6216
$$ plain form
10759 114693 102163 79483 74730 65112 41908 46407 48934 51472 57707 65289 74475 61884 74509
10746 74509 79486 61587 75008 84838 75042 79856 93657 69507 64850 36928 24398 65044 83945
10733 83945 97845 88986 89977 100725 91979 62013 69736 80919 75031 100987 123116 150600 164249
10720 164249 171138 161276 190695 183183 144465 148103 162792 189096 201566 188435 201144 220471
10708 220471 197949 186467 170353 158928 171110 170086 155821 145138 144884 137347 120814 146220
10696 146220 166522 143157 151416 186563 207948 172345 190204 186513 169887 168737 178416 156327
10684 156327 154634 186889 206841 198718 213057 209206 210736 215201 222144 225896 240137 234060 214995
10671 214995 217246 238003 255383 247905 262997 287801 300881 309914 336031 350597 347929 331713
10659C31713l0070p460L2993K8080L4378K9405J3406j6747n260L295K1946P200
10647D42879K0154K3435L5501L1841K4960M326M8263M8572L2598N4985P8729O8265
10635I14508P8914O7197M3594L9777P6201J10656P3130R2684J44654K22143K94038
10624B157496L72573N03504O55031Q63880J068553J347631J615509J701247J432535
10615A1717959Q01465R5705l15477l27985L7597N49650J138625J804517K552727
10606A8054783L168243L313474K511782P84063j034319j926064j717353r13850
10598B2240759N3925J096589K154323L182702L969101L912359K448590k92333
10590C8766015k943659m015248l619334k589605j470024m00993N54178J437080
$$ plain form
10659 331713 301643 294183 327176 355256 389634 419039 432445 415698 410438 413733 435679 442879
10647 442879 463033 486468 521969 553810 578770 583096 631359 679931 712529 767514 846243 914508
10635 914508 993422 1060619 1104213 1143990 1220191 1330847 1403977 1496661 1641315 1863458 2157496
10624 2157496 2530069 3033573 3688604 4552484 5621037 6968668 8584177 10285424 11717959
10615 11717959 12519424 12615129 12299652 11971667 12009264 12558914 13697539 15502056 18054783
10606 18054783 21223026 24536500 27048282 27832345 26798026 24871962 23154609 22240759
10598 22240759 22294684 23391273 25545596 28728298 32697399 36609758 39058348 38766015
10590 38766015 35822356 31807108 28187774 25598169 24128145 23727152 24281330 25718410
10582B5718410J959836J809882O67916j200141k895452l445600l021354k236199
10574A7357298j470846q03206k59517J10832K73276J85009l12388j059166j688739
10565A2332553j806152j682222j450003j102412q72605o70883n36644m40160l52557
10556C418915l16491k82922k45855k12149k48067k46317j86126j84001j88621
10547A308366j20193j08141j13725q2668q3173p3147m5959m5554p3775n7666l1476
10536D72889o1022m2658j9745k3072k3068l3475k7774p147k8119l2024n099o992
10524A62694m3613j0901k7768k5626K0747J6548k2902L47J3057l5919j4547j0241
10512B1876J7474L0099q586k1390n940j6545j5512o961P212k64J7874L4244O41
$$ plain form
10582 25718410 27678246 29488128 30156044 28955903 26060451 22614851 19593497 17357298
10574 17357298 15886452 15083246 14823729 14934561 15207837 15392846 15080458 14021292 12332553
10565 12332553 10526401 8844179 7394176 6291764 5419159 4748276 4211632 3771472 3418915
10556 3418915 3102424 2819502 2573647 2361498 2113431 1867114 1680988 1496987 1308366
10547 1308366 1188173 1080032 966307 883639 800466 727319 681360 635806 562031 504365 472889
10536 472889 411867 369209 349464 326392 303324 269849 242075 234928 206809 174785 169686 162694
10524 162694 119081 108180 80412 54786 75533 92081 69179 69526 82583 46664 32117 21876
10512 21876 39350 69449 60863 39473 33533 16988 1476 -5485 1727 1463 19337 53581 54222
10499E4222l8490K1241L2386j943j3748j2895l6198o726q85K743j968o07m026
10486f894L480Q975j8290J2317J6629k010l746p227n872L252K004R062k242J4944
10472B4382j0073K245P395J3299L8207K6066k942l0887k6230l0621m282K5477
10460C2036M3591j0451j6775j6529K630K0278j474Q436M140j9294k2463l267p439
10447A3419j3418J5268J7424l2489R043J5983p365J7423K149k1843j9213M4109
10435D0490m202k4606l1291Q465p41j757j2821K7308J7198P643j3959J3397k8758
10422c634j8492l230o981j1254K9293K3426k0379N93J1309j7099j0221l35j2532
10409c9536j460N695K4814O320n102o103j4688k4113O200K6188j6067r128J2299
$$ plain form
10499 54222 15732 36973 69359 67416 53668 40773 4575 -2151 -3036 -293 -2261 -2868 -6894
10486 -6894 -3414 5561 -12729 -412 16217 14207 10461 3234 -2638 614 2618 11680 9438 24382
10472 24382 14309 16554 23949 37248 75455 101521 98579 67692 41462 10841 6559 32036
10460 32036 75627 65176 48401 31872 34502 54780 53306 61742 65882 46588 24125 20858 13419
10447 13419 1 15269 32693 204 9247 25230 17865 35288 37437 15594 -3619 40490
10435 40490 36288 11682 -19609 -11144 -11885 -13642 -26463 845 18043 25686 11727 25124 -3634
10422 -3634 -22126 -25356 -32337 -43591 -14298 9128 -11251 -10658 651 -16448 -26669 -27004 -39536
10409 -39536 -40996 -35301 -10487 -4167 -9269 -15372 -30060 -54173 -47973 -21785 -37852 -46980 -34681
10396c4681n015O873q309J0362J5396L2859K4665K232j9938l0400j8361k7271
10384e1588L80Q36m284K668K4647J5999k0337K0721j3656M577j0692J1912K0759
10371A942K830j0972k1672j3396m12j919Q282j7110j4024K1416K5097m18j2122
10358c2478J6345k742K1733L3816M185j9714L5695j0226j4246L0171J1499J6610
10346I0648j4025l4828O442J2760J3182r610p763j5228P70Q477R574k8418q818
10333B3163R538j5028l3317Q859N186k2315K6583J5868J6963L111l567k6062R492
10320A8474p051k293j6384l58k9299M705m935r317j2128J011L5202J5572l544
10307a0345j439k9640J6694J9818n247J3557L5750n707j8998j4047o8k252j6221
$$ plain form
10396 -34681 -39696 -32823 -41132 -30770 -15374 17485 42150 44382 24444 -5956 -24317 -51588
10384 -51588 -51208 -50372 -54656 -51988 -27341 -11342 -31679 -10958 -24614 -20037 -30729 -18817 1942
10371 1942 4772 -6200 -27872 -41268 -41680 -43599 -35317 -52427 -66451 -45035 -19938 -20356 -32478
10358 -32478 -16133 -18875 2858 36674 40859 21145 56840 46614 32368 62539 74038 90648
10346 90648 76623 41795 48237 60997 74179 64569 56806 41578 42348 50825 60399 31981 23163
10333 23163 32701 17673 -15644 -6785 -1599 -23914 2669 18537 35500 38611 35044 8982 18474
10320 18474 11423 9130 -7254 -7612 -36911 -32206 -37141 -46458 -58586 -57575 -22373 -6801 -10345
10307 -10345 -11784 -41424 -24730 -4912 -10159 3398 39148 33441 14443 396 328 -1924 -18145
10294a8145O10l48j814L40j0426J0452n788o352L106j2761O194P538J2735J0005
10280d654L714j1496K4415J4952p441l0167K4144K9189k6063m8686j0974o718
10268d9785J1016m888k3413j2095N469K0789K8231p933R590K658p876M237L1150
10255G150O620j4654j8738k370L0206j0807K875q577n028j6614J0140J6129J2802
10242I134j4147m4769q269j6918r286N899K0400P616P855k1859J869L0126J6628
10229a5721j7799q529J4147j4892j284J8821M745j4875k3943K8563K4546j189
10217g410R184k8114N292M7557q204J6007K0401j7172k6323l5014m997L6719Q9
10204H015q532J543J459O698l073l5575j6769J795K5215r747r967J3174J5302
$$ plain form
10294 -18145 -17535 -17883 -19697 -19357 -29783 -19331 -25119 -31471 -28365 -41126 -34932 -27394 -14659 -4654
10280 -4654 -940 -12436 11979 26931 19490 -10677 13467 42656 16593 -32093 -43067 -49785
10268 -49785 -38769 -43657 -67070 -79165 -73696 -52907 -24676 -32609 -23019 -20361 -28237 -24000 7150
10255 7150 13770 -884 -19622 -21992 8214 -2593 282 -8295 -13323 -29937 -19797 -3668 9134
10242 9134 -5013 -49782 -58051 -74969 -84255 -78356 -57956 -50340 -42485 -64344 -62475 -32349 -15721
10229 -15721 -33520 -42049 -27902 -42794 -44078 -25257 -20512 -35387 -59330 -30767 -6221 -7410
10217 -7410 1774 -26340 -21048 26509 18305 34312 54713 37541 11218 -23796 -28793 7926 8015
10204 8015 -517 1026 2485 9183 6110 -29465 -46234 -44439 -19224 -28971 -38938 -25764 -10462
10191a0462J3465J4163Q39J770K5907J5682k3333j3825R573R696K0839M1366J0420
10178A16100m0688l1265K263K8808M829m940K0210o992J7079J6371r081j38j369
10165A11187o80r72l764k7759J9058n766P4M9883O717J4320M6035J8189l5828
10152A90694m5048p5488l0401M0620J5521n883M0970J9411O556j5437j3363j8759
10140A09393l3852m8626j930j1855M295J5474l234l0447J5656L4776P176k6270
10128C0556l9156O990j9618m4013P571J8816K4222J0471q877l4826j3582K5058
10116c6388J5153j566N606J0978J6842r86j951j7113k8090l423O516J5502J2326
10103f594j470m144k0237L134J2153J1779K4532J0687k8433J428k1724k5446J3602
$$ plain form
10191 -10462 3003 17166 18005 19775 45682 61364 38031 24206 33779 43475 64314 105680 116100
10178 116100 75412 44147 46410 75218 80047 75107 95317 88325 105404 121775 112694 112556 111187
10165 111187 110507 109535 105771 78012 97070 91304 91378 141261 147978 162298 208333 226522 190694
10152 190694 145646 70158 39757 80377 95898 90015 130985 150396 156952 141515 128152 109393
10140 109393 75541 26915 24985 13130 17425 32899 29665 -782 14874 49650 56826 30556
10128 30556 -8600 -1610 -21228 -65241 -57670 -38854 -14632 -4161 -13038 -47864 -61446 -36388
10116 -36388 -21235 -22801 -17195 -6217 10625 9639 7688 -9425 -37515 -40938 -34422 -18920 -6594
10103 -6594 -8064 -12208 -32445 -29311 -17158 -5379 19153 29840 1407 2835 -18889 -44335 -30733
10090c0733M0445Q234K1168j2794k5547o22k3972k0177K838r30K5627R122j789
10077i130K6032l512j8733l44k083K3489K918r716k2706k8313j7815m268j045
10064f5226L6557K9010K4188P992j2982r51j7604L496O902K7551J7069l2880q061
10051A5061J0588K298L2260o158J803j5855j8356j3830o566j5137k100M374r883
10038b1501K8716O491l456J5547j5289l4075p700L6235j3137j775k2575k1575
10026e4094P481O226m268Q649J5281K5272K6080J2022j9744N968K188m8985j6454
10013c4378R672J2789L6677J0047k2702l0380l491j5006K564K0840J4955l8577
10001c6990j5704P950J8231L7901j0129p009J0253k549J6462J3840j0203J1633
$$ plain form
10090 -30733 9712 17946 39114 26320 773 151 -23821 -43998 -41160 -42090 -16463 -7341 -9130
10077 -9130 16902 13390 -5343 -5687 -7770 15719 18637 8921 -13785 -42098 -59913 -64181 -65226
10064 -65226 -28669 341 24529 32521 19539 18588 984 4480 11382 38933 56002 23122 15061
10051 15061 25649 27947 60207 54049 55852 39997 21641 7811 1245 -13892 -15992 -11618 -21501
10038 -21501 7215 13706 10250 25797 10508 -23567 -31267 4968 -8169 -9944 -32519 -54094
10026 -54094 -46613 -40387 -44655 -36006 -20725 4547 30627 42649 22905 28873 31061 -17924 -34378
10013 -34378 -24706 -11917 24760 34807 12105 -18275 -21766 -36772 -34208 -13368 1587 -36990
10001 -36990 -52694 -44744 -26513 11388 1259 -5750 4503 1954 18416 32256 22053 33686
9989C3686L2383J703j9396k1456l7105k289l172J1233J520L049K4685R765l5563
9976i57k3212j168P645K3196L7070K013m8624r9M578j5811R095K881R726J1064
9962A7397K121k372m8261l8734J2756J4047j3916K3251J8856K2234R705j203k2390
9949f509m470l974R635j6315Q317J7312j4888j1340k7335n216K8513N2180Q684
9936C4594j5566Q60j6155K430J3901M350O441M009q564k893Q368J1031M108J4367
9922F1281Q951J3388O963K653k996j8461n127j3630j0000m734j1554l3065k0578
9909b6909M880J9458N83J6883p563M52l1276M344K8090k1271J952k3344M58P442
9895b5821q666J690K0864L4965J2726j2742k8669k7361n547K1242n493J4834M895
$$ plain form
9989 33686 66069 67772 48376 26920 -10185 -12474 -15646 -4413 -2893 156 24841 34606 -957
9976 -957 -24169 -25337 -17692 5504 42574 44587 -4037 -4136 442 -15369 -6274 -3393 6333 17397
9962 17397 19518 17146 -31115 -69849 -57093 -43046 -56962 -33711 -14855 7379 17084 15881 -6509
9949 -6509 -10979 -14953 -5318 -21633 -13316 3996 -10892 -22232 -49567 -54783 -26270 25910 34594
9936 34594 19028 19888 3733 6163 20064 24414 30855 34864 26300 23407 31775 42806 46914 61281
9922 61281 70232 83620 90583 93236 90240 71779 66652 53022 43022 38288 26734 -6331 -26909
9909 -26909 -22029 -2571 -1988 14895 7332 7784 -23492 -19148 8942 -12329 -10377 -33721 -33263 -25821
9895 -25821 -34487 -32797 -11933 23032 35758 23016 -5653 -33014 -38561 -17319 -22812 -7978 -3083
9882c083R822r61P445N638j4842l8887J1708K5136O006m39q121l2505l0934j3370
9868g7387o619L9960J1697q295Q492N652k245o878N622R64q181j0624J0041K8600
9854i201R956p064l634j2686K0121R813j6616J1796N816j6619j4121M059k032
9841b0412q354j4030N471K0396K7834L0607J7246k6279l4702j2529k991j6073
9829c3816j7976J2939J8603K8581R512n849l914j4414J7299j1884P850J2467q184
9816A1214l1659p129J444P557j9220J3243J7891j8605j3497J0744J3770L0562
9804A6315L428M257k0872j7960L391j0005l07N342O36l717j727J4224N64m801
9790a1232k461J6215K6886L1273J7737n394j3032L3096N1780O5070J07899J26978
$$ plain form
9882 -3083 6739 5778 13223 18861 4019 -34868 -23160 1976 7982 7543 -578 -33083 -64017 -77387
9868 -77387 -84006 -44046 -32349 -40644 -32152 -26500 -28745 -35623 -30001 -29037 -37218 -47842 -37801 -9201
9854 -9201 755 -6309 -9943 -22629 -2508 7305 -9311 2485 8301 -8318 -22439 -18380 -20412
9841 -20412 -28766 -42796 -37325 -16929 10905 41512 58758 32479 -2223 -14752 -17743 -33816
9829 -33816 -51792 -38853 -20250 8331 17843 11994 8080 -6334 10965 -919 6931 19398 11214
9816 11214 -20445 -27574 -26130 -18573 -37793 -24550 -6659 -25264 -38761 -28017 -14247 16315
9804 16315 19743 24000 3128 -14832 -11441 -21446 -21753 -16411 -15775 -19492 -21219 -6995 -6431 -11232
9790 -11232 -13693 2522 29408 60681 78418 73024 59992 93088 144868 209938 317837 444815
9778D44815J60144K68461M29898M55721K44758j45524m21722m60577l34322j81506
9768D60146r5705o6308m4423l0298p123m846k0478j1228j5964k4456k9890k3504
9756H5923q509l2068k8394m795j0483l731n545j9352K2630K7492j0265k2116q102
9743a7315N614K1899L608m013j3588l6599J120j3312M579J6489J3332o460M471
9730b0175N154J652J1993K4004K197m382n553k0239j0688J5906j7783N028K0959
9717H073j3538J0463L738j598l4376L393m439r992j449J5387K0757Q7k0287k32
9703b4013R366N144j1491J2725R154k8649m0383L1808J7529L117j3621j0241O911
9690c2644M2483o52l2818N195M519q940Q548k7474P745J5981k777p704J6676P498
$$ plain form
9778 444815 604959 873420 1303318 1759039 2003797 1858273 1436551 975974 641652 460146
9768 460146 364441 298133 253710 223412 216289 211443 190965 179737 163773 139317 109427 85923
9756 85923 77414 45346 16952 12157 1674 -2057 -7602 -26954 -4324 23168 12903 -9213 -17315
9743 -17315 -11701 10198 13806 9793 -3795 -40394 -39274 -52586 -48007 -31518 -18186 -24646 -20175
9730 -20175 -15021 -13369 -1376 22628 24825 20443 14890 -5349 -16037 -131 -17914 -12886 8073
9717 8073 -5465 4998 8736 7138 -27238 -23845 -28284 -38276 -39725 -24338 -3581 -3494 -23781 -24013
9703 -24013 -14647 -9503 -20994 -8269 885 -27764 -68147 -36339 -18810 -15693 -29314 -39555 -32644
9690 -32644 9839 9187 -23631 -18436 -13917 -22857 -14309 -41783 -34038 -18057 -20834 -28538 -11862 -4364
9676d364J9058Q563o82K1581J90j6139k677K3503J7387Q236j8151k1188l2568
9663B749j5351K0321J4034L3064K1150N067J5391Q9526J38372K04395K30201J89588
9651I48507m5512k59487k07385j43828r2810m4189l1673l7294p654J8241k212
9640I4704j616k2505o287r736k9151o083k3368l1140Q006K6094J9213m093o226
9627G812M123k3335m682k4395J6670k971q781J3194L3387L968l8878l72J1816
9614a2444j4248L798J1530K3079j3859k6667q732K3043L262O582M757J9082j2710
9601F473q100k1989K232j8501l338O92j7268K3421j3539k7067r141K1644K2998
9588d1483N75J6963j1458K1959P96N156J6809J4246l1372j3085J3910J7550o657
$$ plain form
9676 -4364 14694 23257 22575 44156 44346 28207 25530 49033 66420 74656 56505 35317 2749
9663 2749 -12602 7719 21753 54817 75967 81034 96425 185951 324323 528718 758919 948507
9651 948507 902995 643508 436123 292295 199485 155296 123623 86329 78675 96916 94704
9640 94704 93088 70583 64296 54560 25409 19326 -4042 -35182 -27176 -1082 18131 14038 7812
9627 7812 11935 -11400 -16082 -40477 -23807 -26778 -35559 -22365 11022 14990 -23888 -24260 -12444
9614 -12444 -26692 -22894 -11364 11715 -2144 -28811 -37543 -14500 -11238 -4656 101 19183 6473
9601 6473 -1627 -23616 -21384 -39885 -43223 -42531 -59799 -36378 -49917 -76984 -86125 -64481 -41483
9588 -41483 -40908 -23945 -35403 -13444 -12648 -7492 9317 23563 -7809 -20894 -6984 10566 3909
9575C909L990O146j6092j0238j8914Q481m020o789m769L4633Q086J330j6783j8242
9561b9272L2223J2059j2869q367j0026M198R077p287o667k7858o493K543J7131
9548c1608L373M172M434N799K7052p793j5695M574p651j3115O701M604L3292m15
9534A7724m507o580j142n19k5982m2254n88K707L747q426K2626J9212P583l3233
9520d9632k9007J9299K2569O621k7978k1192m057k658K0965L0730o152K639k289
9507d0142J5584K0810K5725m91j1363k0326l751K2949q460n238J8492k8623j3647
9494b8481L140J5317j0135j2983j4654O633j3271j8947J6683J2298K2882O53k4315
9481d5180J7566j8635j4174Q15l519M1667J396r679N150J712k0916K396K5348
$$ plain form
9575 3909 7899 14045 -2047 -12285 -31199 -22718 -26738 -33527 -38296 -3663 4423 5753 -11030 -29272
9561 -29272 2951 15010 2141 -6226 -16252 -12054 -2977 -10264 -16931 -44789 -51282 -48739 -31608
9548 -31608 -28235 -24063 -19629 -13830 13222 5429 -10266 -5692 -13343 -26458 -19757 -15153 18139 17724
9534 17724 13217 6637 5495 4976 -21006 -63260 -63848 -61141 -57394 -65820 -43194 -23982 -16399 -49632
9520 -49632 -78639 -59340 -36771 -30150 -58128 -79320 -83377 -86035 -65070 -34340 -40492 -37853 -40142
9507 -40142 -24558 -3748 21977 21486 10123 -10203 -13954 8995 535 -4703 13789 -14834 -28481
9494 -28481 -25341 -10024 -20159 -33142 -47796 -41163 -54434 -73381 -56698 -44400 -21518 -20865 -45180
9481 -45180 -27614 -46249 -60423 -59608 -63127 -21460 -20064 -29743 -24593 -22881 -43797 -41401 -16053
9468a6053R41j3105N688N95j756L245l573J2083k0394j0578n606J4613J0173L264
9454b0463j3656j1022q655N8J9252j4974J9167K7177n550r705J7J0165Q552j1896
9440a1533j3012J8164J8688j1651O277j184J1744P021K685j8017j6589L596j2050
9427a5861l44k601p849R527N5J6100J8592k0712j0818J1465o463j7358n078n33
9413c1878K804J2040J0286M563m42l045K749K788k6942j3776L0886K1075R089
9400B0197l0825r283N540J5695p150l280N591j1714J0732M3159K2306j0861q361
9387D1746j5281k7837o244m547L000L7071K4565m1141m0265j489J5568M1613j8185
9374H574j5247q453q557J9581O019J1929j770l103K3705K1133j794j6194j8135
$$ plain form
9468 -16053 -15112 -28217 -22529 -21934 -23690 -20445 -24018 -11935 -32329 -42907 -48513 -33900 -23727 -20463
9454 -20463 -34119 -45141 -53796 -53738 -34486 -49460 -30293 -3116 -8666 -18371 -18354 -8189 363 -11533
9440 -11533 -24545 -6381 12307 656 6933 5749 17493 24514 27199 9182 -7407 -3811 -15861
9427 -15861 -16205 -18806 -26655 -17128 -17073 -973 17619 -3093 -13911 -2446 -8909 -26267 -31345 -31878
9413 -31878 -29074 -17034 -6748 -2185 -2627 -5672 -2923 -135 -27077 -40853 -9967 11108 20197
9400 20197 -10628 -19911 -14371 1324 -5826 -9106 -3515 -15229 -4497 38662 60968 50107 41746
9387 41746 26465 -1372 -7616 -12163 -9163 27908 52473 11332 -28933 -30422 -14854 26759 8574
9374 8574 -6673 -15126 -23683 -4102 1917 13846 12076 8973 32678 53811 52017 35823 17688
9361A7688j1594n153j0754j6254J1837J2259j5895M890j9568j3911Q956J6050
9349b1449K3386J8270L900M359K6641j9225k5734n574j9599j368K2798J4389k961
9336A7833k0530j557N471j0902Q920J8807j1001l0913J9607k185j2449m766J4987
9323h678J6145j8985j1697l128j9833J4131j0987k1208J5124K902R789K6126O640
9310c659J3468J608M968K9391k2524l1779n311j1490K5123J6991l7370j3102J834
9297c1852k4833J8716N822J8903q399J0714k5135l0129M015R687K156L7363L8263
9284B5291K5694j6815l8394j7824j901K6873j9076k3932J9458K8141P094k9963
9272a5354J7315j9300j5468j2398J2616K3563j512P620k2895j5568k3842J5425
$$ plain form
9361 17688 6094 941 -9813 -26067 -14230 -1971 -17866 -12976 -32544 -46455 -37499 -21449
9349 -21449 1937 20207 24107 28466 55107 35882 10148 4574 -15025 -16393 6405 20794 17833
9336 17833 -2697 -4254 1217 -9685 -765 18042 7041 -23872 -4265 -6450 -18899 -23665 -8678
9323 -8678 7467 -11518 -23215 -26343 -46176 -32045 -43032 -64240 -49116 -46214 -36425 -10299 -3659
9310 -3659 9809 11417 16385 45776 23252 -8527 -13838 -25328 -205 16786 -20584 -33686 -31852
9297 -31852 -56685 -37969 -32147 -13244 -21643 -10929 -36064 -66193 -62178 -52491 -50335 -12972 25291
9284 25291 50985 34170 -4224 -22048 -23949 2924 -16152 -40084 -20626 7515 14609 -15354
9272 -15354 1961 -17339 -32807 -45205 -32589 -9026 -10538 -2918 -25813 -41381 -65223 -49798
9260d9798M1186K9790J987K4552M962p01l1107o250J4790O896k7214m845M318
9247H566J0946j7130k1812m1343j089J9441K9556M774k4333J7941R457L458Q270
9234F702R688J1694P699K0354K7913n679m3960m3164n699L8567J5726k1558r295
9221H988l2165M006N6020N409j2539Q800j4590k5095K484j1353N291j0728k4230
9208c9702J8505J6690p130m228K6211J9288k2657n345J0318J7086K1878j0674
9196D0240k084m6664O199J3067K0373K4489m089j2077j3868J2726K7466J1132
9184G6910j9670l6925j8658L050P343l660q844J2795M795k5699m565j2078J7245
9171g961k1439k4350J6745K0560J9455J0504q382J0199j4674j6692r675r530k0089
$$ plain form
9260 -49798 -8612 21178 23165 47717 52679 51978 20871 14621 29411 36307 9093 4248 8566
9247 8566 19512 2382 -19430 -60773 -61862 -42421 -12865 -8091 -32424 -14483 -5026 -1568 6702
9234 6702 16390 28084 35783 56137 84050 78371 34411 -8753 -14452 24115 39841 18283 8988
9221 8988 -23177 -19171 36849 42258 29719 38519 23929 -1166 1318 -10035 -4744 -15472 -39702
9208 -39702 -21197 -4507 -11637 -15865 10346 29634 6977 1632 11950 29036 50914 40240
9196 40240 38156 -8508 -2309 10758 31131 55620 51531 39454 25586 38312 65778 76910
9184 76910 57240 20315 1657 4707 12050 8390 -454 12341 17136 -8563 -13128 -25206 -7961
9171 -7961 -29400 -53750 -37005 -16445 3010 13514 5132 15331 657 -16035 -25710 -35240 -55329
9158e5329l3702J2114J91J2289K2078K734J9634J2014R037j1052k0862P011l055
9145b6898o720R88J9709J6782Q011l2353k2759L0337J8179j524J2345k6698k0117
9132c0718J9231q901l3601R164P634M0141K5586m950p217J5059m284j0764l7295
9119b0915j49J5529j601l3506N561N3533J8490j6172l078j8805j2581M469j2907
9106b2132Q271J3017j3321j7046j3902K2689K2989K0136J6607j5915l5822m187
9094a8616j2892l825K4303J5616n36j874j2582l0400j5699J5356N689J0676K0091
9081d693O369P279J1867Q844J3302J7048l1315k0222K014N049R953j7577m254
9068C664l925J5355J336j4250J5533J65l1433P959K1303j7064l0270l601J5011
$$ plain form
9158 -55329 -89031 -76917 -76726 -64437 -42359 -39625 -19991 -7977 1060 -9992 -30854 -23843 -26898
9145 -26898 -33618 -32630 -12921 3861 11872 -20481 -43240 -12903 5276 3752 16097 -10601 -30718
9132 -30718 -11487 -20388 -53989 -44825 -37191 2950 28536 23586 16369 31428 27144 16380 -20915
9119 -20915 -21064 -5535 -7136 -40642 -35081 18452 36942 20770 17692 -1113 -13694 -9225 -22132
9106 -22132 -13861 -844 -14165 -31211 -45113 -22424 565 20701 37308 21393 -14429 -18616
9094 -18616 -31508 -35333 -11030 4586 4050 2176 -10406 -40806 -56505 -41149 -35460 -24784 -4693
9081 -4693 1676 8955 20822 29666 42968 60016 28701 8479 10493 15542 25495 7918 3664
9068 3664 -261 15094 16430 2180 17713 17878 -13555 -5596 15707 -1357 -31627 -35228 -20217
9055b0217k156R295O89l243J6396j77p379m47J5898K7717k345j2191l3107j4471
9041b5738j3625M019J104J600K0297j0677r438K1054J8395R171q834j6784k1750
9028c1206j7826K312J4365j4903K5905K9013J4108J9570j7892l8648N073R168
9016i61J3122p647J9937L2118K2020O088j7532k9432k0236p517O922j300K0589
9003C6171L913Q033j6849m1242k2975m391Q424J8682K321o367p339j2213J827
8990c2005J8998K4398k046O44K2743r470j7189j7750j3429l516K6733N230l4054
8977c0713j846k2573Q612L3317q991j9547J331M8394L005j9464j3020J796p239
8964b6938k0279k763o517L1972L4835j7391k4905j5722J6527M732q37m876J6598
$$ plain form
9055 -20217 -22373 -13078 -12389 -15632 764 587 -6792 -7239 8659 36376 34031 21840 -11267 -25738
9041 -25738 -39363 -35344 -34240 -32640 -12343 -23020 -32458 -11404 6991 16162 7328 -9456 -31206
9028 -31206 -49032 -46720 -32355 -47258 -21353 7660 21768 41338 23446 -15202 -10129 -961
9016 -961 12161 4514 24451 56569 78589 84677 67145 37713 17477 9960 16882 15582 36171
9003 36171 40084 48117 31268 -9974 -32949 -37340 -28916 -10234 -7913 -14280 -21619 -33832 -32005
8990 -32005 -13007 11391 9345 9989 32732 23262 6073 -11677 -25106 -28622 -1889 3341 -30713
8977 -30713 -32559 -55132 -46520 -13203 -22194 -41741 -40410 7984 10989 -8475 -21495 -19699 -26938
8964 -26938 -47217 -49980 -56497 -24525 10310 -7081 -31986 -47708 -31181 -26449 -27286 -32162 -15564
8951a5564L5274j1115j6004k3315J0094o78J5302K651J464j7277J049K770k98
8938a5647j8163P720K2126N091P322J5949o764M266j3438k11j2436j6925j0759
8925c1869J8272L4219j239j1722k9641k799J9441j4447k6267r117R880k5044R727
8912f0606K699K6261J2010k802q579l264j2801Q920L46j4105l2L9137L2654n29
8898A9309O396j3416n3327j1748L1621N89K2530L6792j2244k7606J3700K2726
8886C5322O728j9322k9325l3063q19K0095K0814K6539j2012r044K7813L2430j2025
8873E4131O477J8140k3338j9633l3906k8801J6312K5399J1683l141m6038m066
8861b6781L099j2426K1035j0487j3652K7585R606o526Q155j6587j6480k976r276
$$ plain form
8951 -15564 19710 8595 -7409 -30724 -20630 -21308 -6006 -3355 -1891 -19168 -18119 -15349 -15647
8938 -15647 -33810 -26090 -3964 1127 8449 24398 17634 21900 8462 8251 -4185 -21110 -31869
8925 -31869 -13597 20622 19383 7661 -21980 -24779 -5338 -19785 -46052 -55169 -45289 -70333 -60606
8912 -60606 -57907 -31646 -19636 -22438 -31017 -34281 -47082 -38162 -37816 -51921 -51953 -12816 19838 19309
8898 19309 25705 12289 -41038 -52786 -21165 -20576 1954 38746 26502 -1104 12596 35322
8886 35322 42050 22728 -6597 -39660 -40479 -20384 430 26969 14957 5913 33726 66156 54131
8873 54131 60608 78748 55410 35777 1871 -26930 -10618 14781 26464 23323 -22715 -26781
8861 -26781 -23682 -36108 -15073 -25560 -39212 -11627 -2021 -8547 -392 -16979 -33459 -36435 -45711
8848d5711O245L7198K6982K9243K545j2114l083j5683J094j1233j0315L716Q490
8835A7374p741r529J0831O219J4729J3247j3894k5797j7427k2265J1250L7395
8823A4392K2392j5699L600L360J4684L876j9081k4462k926r181J0478L0145k2194
8810I384p604J6402k252q989N790K7738J8097k0941k5854p63m902j9286P670O532
8796A022N321L8244j1529j2368J582k4744R117l7j5854j1246L0579J9985J1001
8783D1073q390J0054N986o735l292n023j77j2037m536K61J2826Q14j2663j8593
8769d32N041o33J6275j4899O289R667J8800m861o018l1665j8589J5258N193K3773
8755B3199r224k4134N579J9576K2118p446m653J6877j7709j4524Q824l1751K144
$$ plain form
8848 -45711 -39466 -2268 24714 53957 56502 44388 41305 25622 26716 15483 5168 8884 17374
8835 17374 9633 104 10935 17154 31883 45130 31236 5439 -11988 -34253 -23003 14392
8823 14392 36784 21085 24685 28045 42729 46605 27524 3062 136 -9045 1433 31578 9384
8810 9384 1780 18182 15930 6941 12731 40469 58566 37625 11771 11008 6106 -13180 -5510 1022
8796 1022 6343 44587 33058 20690 22272 -2472 6645 6608 -9246 -20492 10087 30072 41073
8783 41073 32683 42737 48723 41988 38696 33673 33496 21459 16923 17184 30010 30824 18161 -432
8769 -432 4609 3976 20251 5352 11641 21308 40108 35247 29229 -2436 -21025 -5767 -574 23199
8755 23199 13975 -10159 -4580 14996 37114 29668 25015 41892 24183 9659 18483 -13268 -11124
8742a1124J9556J2627J219l536K433j5562J0135L217K613k504j0458q565J9291
8729A9342k952O39l1752k098L1815K2418j5657P815J9842R200J5454J5390K3156
8716A12612r760l2709p064J1805k0057j8900o19R37j6254q876j1837J0909J4127
8703B4314J7576L13j2111o42o256Q110k1901j1442M552J0535K5760j4042j6148
8690H618M9360J1712q876O992p011J1095j5922J0520L3638k2388k9498R181P958
8677F5379j723j8749O954Q540l546j7700J4717k355j6008k908J589J5637L642
8664E3469N168K3998K0468j5730K7571L3806K7381K67j1348Q86J2374p78J0697
8651A88229j4377o098k7507j7106l086K9880J1898k2399q631N241k4432k7050
$$ plain form
8742 -11124 8432 21059 22278 18742 21175 5613 15748 18965 21578 19074 8616 51 19342
8729 19342 16390 17029 -14723 -16821 14994 37412 21755 29570 49412 58612 74066 89456 112612
8716 112612 102852 70143 63079 74884 54827 35927 35308 36245 19991 11115 -722 10187 24314
8703 24314 41890 42203 30092 29450 23194 31304 9403 -2039 2513 13048 38808 24766 8618
8690 8618 57978 69690 60814 67806 60795 71890 55968 66488 100126 77738 48240 57421 65379
8677 65379 63656 44907 51861 60401 56855 39155 53872 51517 35509 32601 34190 49827 53469
8664 53469 58637 82635 103103 87373 114944 148750 176131 176398 165050 165936 178310 177532 188229
8651 188229 173852 167754 140247 123141 120055 149935 161833 139434 130803 136044 111612 84562
8639H4562N959J2802R914K9807j0824j6625l4112q380J9846j7476R683O161O579
8626I7896P879j3619l0868K0631J8497k5278K6490M0592k5677k0131k4942k8021
8614D3449K2700L4164Q817R198k1315r345J6585j7519J2J1442j1866r37K411j8029
8600F9767j3687J398K5702K2355p995P216j406P112J6711J6424m348L191K7527
8587A69967l062N213N005J9371J9727q828J92J7718L2966J8034l65J4510M0789
8574C31237L0731j1282P160K6092J7404L5883m95J2957l7264k3267j5957m0819
8562C32380k1639k4271J3885j8621n6974l7343K35j2778k8847k7357o232J5006
8550A27444p920J8829J4735j3577q226J340p971N6j9604K1802J3880p714j3823
$$ plain form
8639 84562 90521 103323 113237 143044 132220 115595 81483 73103 92949 75473 85156 91317 97896
8626 97896 105775 92156 61288 81919 100416 75138 101628 142220 116543 96412 71470 43449
8614 43449 66149 100313 109130 118328 97013 87668 104253 86734 86746 98188 86322 85385 87796 69767
8600 69767 56080 57478 83180 105535 97540 104756 103350 110462 127173 143597 139249 142440 169967
8587 169967 166905 172118 177123 196494 216221 207393 207585 225303 258269 276303 275938 290448 331237
8574 331237 361968 350686 357846 383938 401342 437225 436730 449687 412423 389156 373199 332380
8562 332380 310741 286470 300355 281734 224760 187417 187652 174874 146027 118670 112438 127444
8550 127444 119524 138353 153088 139511 131285 132625 124654 124710 105106 126908 140788 133074 119251
8537A19251O990j5547k2320q267K0921L6133N0911N0085R9395J27359J26336j8044
8525E73203j09960j22911r7607n8597m3665n6624j0L4268K1265k503l2467j8063
8513H6329P170k7955O997M4843K6713j2431l7849P379K2984N254k5731Q718J527
8500A13948j8894j6678p122R917J4964J505j5145j6154M596K0323J051N4472N1692
8487A98475N4930R4108J18270J63907K27351J84260K48k40351k56941j85091j05437
8476B53729n4518j3879K305P674j3810k3598k0482J436L636l196m768P001J5740
8463A57270r126l0700p631j1833l7037r016k2552m43L5663J864P998K2010o544
8450H9923M628j5371K7110J1562K8255M5771R425k2404j4863r470L1462J19278
$$ plain form
8537 119251 126241 110694 88374 80107 101028 137161 188072 238157 337552 464911 591247 573203
8525 573203 463243 340332 242725 184128 140463 83839 83829 118097 139362 136859 104392 86329
8513 86329 93499 65544 72541 117384 144097 131666 93817 101196 124180 129434 103703 112421 113948
8500 113948 95054 78376 71254 81171 96135 97640 82495 66341 70937 91260 92311 146783 198475
8487 198475 253405 347513 465783 629690 857041 1041301 1041549 801198 544257 359166 253729
8476 253729 199211 185332 187637 195311 181501 157903 137421 138857 142493 139297 134529 141530 157270
8463 157270 148144 117444 109813 97980 60943 51927 29375 28932 64595 66459 74457 96467 89923
8450 89923 94551 79180 106290 117852 146107 191878 201303 178899 164036 154566 186028 305306
8438C05306J46274Q8001M0709q9664j54510q2469n5467l914n8604l1189K4581
8427A29054m900j7168j2694j9887J1743o909n564J5207J2757l378j6317n5690
8415B6254k5230k668R816p06Q07L7673L6939n953k7383q703J630j256J2152k1807
8401C1565j7813j071L033R045l5464j6358l347K1224k0133P77K7983L4765n869
8388B8337n882j0120J2271j259j7601P621Q043j4907O518o599J1042K4516m349
8375C7631j5323p279K7487K0248n483l2716k6869Q036n466R227j7902J2631J9551
8362B3773J3667J8809q631P686O748M393J8488q090O412j881n639n354J9651j8198
8348G1834j0295K8721L2009L0455M2759K5359L1471L7677n9680q5135l9401k9914
$$ plain form
8438 305306 451580 539581 580290 490626 336116 253647 198180 194266 135662 104473 129054
8427 129054 124154 106986 94292 74405 86148 79239 73675 88882 101639 98261 81944 26254
8415 26254 1024 -1644 8172 7466 8273 45946 82885 76932 49549 40846 42476 41220 53372 31565
8401 31565 13752 12681 15714 24759 -10705 -27063 -30410 -9186 -29319 -28542 -559 34206 28337
8388 28337 22455 12335 24606 23347 5746 13367 21410 6503 13021 6422 17464 41980 37631
8375 37631 22308 15029 42516 62764 57281 24565 -2304 5732 266 9493 -8409 4222 23773
8362 23773 37440 56249 47618 55304 62052 66445 84933 76843 83255 81374 75735 70381 90032 71834
8348 71834 61539 90260 122269 152724 195483 220842 252313 289990 230310 145175 105774 75860
8336G5860j319L086J6617j6832k2937k1008P818M2580j0052l3898k3789M000n403
8323A4723M417J7517J7610J972P928J2535J4831j5113l7176k42K9524r675P867
8310F6718Q497j5165j585J2379M531J3607L7531J6113j3125L2243N8230J24143
8298C44117J16612L5028p9009j24357q1721o2712l7462k2772j1308J140m599M26
8286G3383o799L424k0131k9185P170J3830K5269M741m224J2882k9096k0144n891
8273B5229j8479O240J2920O041M436q43r649L554j4289k1687K1779J6392L991
8260C5635j0215J1206L2144J8170K6371K8778L2386J3657j6856o3021k9872j3841
8248F4542M394J4162j3702k5301r524l458K7818J9320j3163k468k4462j2220K0415
$$ plain form
8336 75860 74541 77627 94244 77412 54475 33467 41285 83865 73813 39915 16126 20126 14723
8323 14723 19140 36657 54267 56239 64167 76702 91533 76420 39244 39002 68526 58851 66718
8310 66718 75215 60050 58465 70844 75375 88982 126513 142626 129501 161744 219974 344117
8298 344117 460729 495757 416748 292391 210670 147958 110496 87724 76416 77556 72957 73383
8286 73383 66584 70008 49877 20692 27862 41692 66961 71702 67478 80360 51264 31120 25229
8273 25229 6750 12990 25910 31951 36387 35544 25895 29449 15160 -6527 15252 31644 35635
8260 35635 25420 36626 68770 86940 113311 142089 174475 188132 171276 108255 78383 64542
8248 64542 68936 83098 69396 44095 34571 31113 58931 78251 65088 62620 38158 25938 46353
8235D6353J6264M31q562l6531j4560l725p677J8053K4660J1372j8528o210O350
8222B7690J590K802m881l8716k3147J5135J8478M4938K838J5459j1956k8454k3031
8209a255l0671K1184M0437L5868l7787j3782q993m199K729m822J4062L763k4135
8196g601j493j26P962J3688j1913j7421K8799J6317J898m978j2087j3763j4749
8183a5467L1347M6261r008k1133j2646L856K0764j1605j8678Q067O038j4249k566
8170A0981q04j85l183m541j4611n305k6707l313L4614L586J859l3251J4395K4074
8156b391Q125P058j2664L7650R150m2304m7069k935M157m237K0671J7720n5k6908
8142c4032j3863Q92K587q439L0986M4332M861n946J3410J1605O72q662k3072Q660
$$ plain form
8235 46353 62617 63048 54486 17955 3395 -330 -8007 10046 34706 46078 27550 21340 27690
8222 27690 29280 32082 27201 -11515 -34662 -19527 -1049 43889 46727 62186 50230 21776 -1255
8209 -1255 -31926 -10742 29695 65563 27776 13994 5001 802 3531 -1291 12771 16534 -7601
8196 -7601 -9094 -9220 -1258 12430 517 -16904 11895 28212 30110 25132 13045 -718 -15467
8183 -15467 15880 62141 53133 32000 19354 23210 43974 32369 13691 21758 27796 13547 10981
8170 10981 10177 9992 6809 2268 -12343 -17648 -44355 -47668 -13054 -9468 -7609 -40860 -26465 -2391
8156 -2391 5734 12792 128 37778 46928 4624 -42445 -45380 -41223 -45460 -24789 -7069 -7124 -34032
8142 -34032 -47895 -47003 -44416 -52855 -21869 22463 27324 21378 34788 46393 47065 38403 15331 23991
8128B3991k1002n560K3970J8475J3456l5141k3857j8348q638j5406L4891L0782
8116A7613J1577k8990P145J1096J7262M60j9744m1080J1192k0427j2089K0936
8104b5049J9291L9514o44j0478l5280O955m705j1219J1364K7280j825J3682j1348
8091A7538k3936j292O847l201J1573R798m628k7393M335J4420j4592j5575K4013
8078b093K6391j5652j3262j8345Q346J8773K817K2099j1884k9849j4065J9663
8066g061j3794L902N113J1483J8771K224J7327K8583K968R167J5427O568P27j5935
8052H5470m0324J5194J0299j0585n632l34L13k353j4044M4946M850k6351l4662
8039B6787n726j2967R037L3607K4529P690j8083j3287k409q389j581R586o041
$$ plain form
8128 23991 2989 -2571 21399 39874 53330 18189 -5668 -24016 -32654 -48060 -13169 17613
8116 17613 29190 200 7345 18441 35703 36163 16419 -24661 -13469 -33896 -45985 -25049
8104 -25049 -5758 33756 33112 22634 -12646 -5691 -10396 -21615 -10251 17029 15204 28886 17538
8091 17538 -6398 -7690 -843 -4044 7529 17327 12699 -14694 -10359 4061 -10531 -26106 -2093
8078 -2093 24298 8646 -4616 -22961 -14615 4158 6975 29074 17190 -12659 -26724 -7061
8066 -7061 -20855 -16953 -11840 -357 18414 20638 37965 66548 69516 78683 94110 100678 101405 85470
8052 85470 45146 60340 70639 60054 54422 54088 54401 52048 38004 82950 87800 61449 26787
8039 26787 21061 8094 17131 50738 75267 82957 64874 51587 49178 40789 39208 48794 42753
8026D2753q023R551K9180n588j2729j5335j5188n171K0567K5227O445J7589M559
8013I3837J3624J8934L206J2143K0035K8887p705l5010j1516J6249K9542J6832
8001A99058o860m8400l2711L947K2490q965o342R342J6722L267K40k4367j5600
7988A11821K5049K1530L5021J5740m9637N384o547k6164m0389j190j558K3339
7976A12399M2759P874l0711k4955k6446j123K2426k254j6231j1604J368K8293
7964A01795K2498K014L55o250j2791n409J0143Q925k7218k7401J635J0569j938
7951G6927P940j8606l3292J5980L3714K8724M365O570r550l4746l831L970l3976
7938D4189k1873J6897K2196L9366K2623l3411J678J8482j3125j6664l948O298
$$ plain form
8026 42753 34730 44281 73461 67873 55144 39809 24621 19450 40017 65244 71689 89278 93837
8013 93837 107461 126395 129601 141744 161779 190666 182961 147951 136435 152684 182226 199058
8001 199058 192198 143798 111087 115034 137524 128559 122217 131559 148281 151548 151788 127421 111821
7988 111821 136870 158400 193421 209161 159524 164908 158361 132197 91808 90618 89060 112399
7976 112399 155158 163032 132321 107366 80920 79797 102223 99969 83738 72134 73502 101795
7964 101795 124293 126307 126662 120412 107621 102212 112355 121280 94062 66661 68296 78865 76927
7951 76927 84867 66261 32969 48949 82663 111387 115752 122322 112772 78026 74195 78165 44189
7938 44189 22316 39213 61409 100775 123398 89987 91665 110147 97022 80358 76410 82708
7926H2708l0187j8762J2459K5817j615j2858n430J1796K3431j2201k0454l6832
7914A7872n804K0650M985M295k5226j0401j8622j8230M612L7807M8245r163j9317
7901C1703n041K852o859n2144q739O0029J8923k3351k370l0222P10L1642r664
7888G469q739Q789j874R479K491K6690K7389K3826J7732r381l8418k7797q355
7875B9301l287L2793m0545j2452m497j0111p454r119K666K8247L492j6730J8897
7862A1201L93P49j779J2091k6959l570J5888K4571K1008j5631l4571j2543O783
7849b369J5703Q287O126k3386m0710q317J3164K5262L9682m159k3759k512j2720
7836i708K905K7630J8279L519p468j0656q157k0633J8183k0786k6617j1141L2553
$$ plain form
7926 82708 52521 33759 46218 72035 70420 57562 52132 63928 87359 75158 54704 17872
7914 17872 12068 32718 37703 41998 16772 6371 -12251 -30481 -25869 11938 60183 51020 31703
7901 31703 26662 29514 22655 -29489 -38228 21801 40724 17373 15003 -15219 -14509 17133 7469
7888 7469 -1270 7519 5645 15124 17615 44305 71694 95520 113252 103871 65453 37656 29301
7875 29301 26014 58807 18262 5810 1313 -8798 -16252 -25371 -22705 5542 9034 -7696 11201
7862 11201 11594 12343 10564 22655 -4304 -7874 8014 32585 53593 37962 3391 -9152 -2369
7849 -2369 13334 21621 27747 4361 -36349 -44666 -31502 -6240 33442 29283 5524 3012 -9708
7836 -9708 -6803 20827 39106 42625 35157 24501 16344 -4289 13894 -6892 -33509 -44650 -12097
7823a2097K3679m31j7928M142K6005r401r590K4038k584J5615N634j0246j1366
7810B5470k673k2846j2634L764r07o319J4220K574j4461K5263q562M635j4109
7797f585o437k59K2125J1898J0925J9130J0286l4248l7628k0094J1908l378j1227
7784c3584L0172N32k2607l13o534j0836j3539J7560J5496M161j0860J3870J3887
7771b595l303o257K7947j5039l9314p166J5826L7623K3013j9230k5004n788j5489
7758c4776p991J9251j5399M494M5863K8597k4452m7878J3283J5468j1072j2062
7746b6674k4693J2237J2075J3164J971J3100j789Q801J469k1958L332R974m3248
7733d2239l5218M2652J9486L455p888O991j011j4335j3207J769k3607n621K1988
$$ plain form
7823 -12097 11582 11151 -6777 -2635 23370 13969 4379 28417 25833 41448 47082 36836 25470
7810 25470 22797 -49 -12683 -8919 -9826 -16145 -1925 649 -13812 11451 2889 7524 -6585
7797 -6585 -13022 -13281 8844 20742 31667 50797 61083 26835 -10793 -30887 -18979 -22357 -33584
7784 -33584 -3412 -2880 -25487 -25800 -32334 -43170 -56709 -39149 -23653 -19492 -30352 -16482 -2595
7771 -2595 -5898 -12155 15792 753 -38561 -45727 -29901 7722 30735 11505 -13499 -19287 -34776
7758 -34776 -42767 -23516 -38915 -34421 11442 40039 15587 -32291 -19008 -3540 -14612 -26674
7746 -26674 -51367 -39130 -27055 -13891 -11920 1180 -609 8192 9661 -12297 -8965 1009 -42239
7733 -42239 -77457 -34805 -15319 -11864 -19752 -12761 -13772 -28107 -41314 -39545 -63152 -68773 -46785
7720d6785Q69j9182j1290p008K8708J3059j0742J392O92n388K5649J8680J5945
7707D599O878r834N349j2593l206j6216l2950R165K1775j3664K310j3065j2556
7694f4008J5616P817j2042J0692R313j1403J1510L628j8815J227Q430J1719R638
7681a6678J2999k60l9620j5500R342K8163m475K810M1586J1999j1818R918j1933
7668A6533j5689j7834k599J787J5734L853J244k5377j5020K1873J2862Q590m002
7655A955j5480J0487J0342j5713k3806k486j7635L93R882J5289n024p287m348
7642d3431J0783M218J3655O596L0479j4106l4552J1756J5913k7803k4176k252
7630e2920K014J5575J5594K3234R335K7862j7294j1836J122K7971J0652l5673
$$ plain form
7720 -46785 -45916 -65098 -76388 -83396 -54688 -41629 -52371 -50979 -50287 -55675 -30026 -11346 4599
7707 4599 11477 1643 6992 -5601 -8807 -25023 -57973 -48808 -27033 -40697 -38387 -51452 -64008
7694 -64008 -48392 -40575 -52617 -41925 -32612 -44015 -32505 -28877 -47692 -46465 -38035 -26316 -16678
7681 -16678 -3679 -3939 -43559 -59059 -49717 -21554 -26029 -23219 18367 30366 18548 28466 16533
7668 16533 844 -16990 -19589 -17802 -2068 1785 3029 -22348 -37368 -15495 -2633 5957 1955
7655 1955 -13525 -3038 7304 -8409 -32215 -34701 -52336 -51943 -42061 -26772 -31796 -39083 -43431
7642 -43431 -32648 -28430 -14775 -8179 22300 8194 -26358 -14602 1311 -26492 -50668 -52920
7630 -52920 -50906 -35331 -19737 3497 12832 40694 23400 11564 12686 40657 51309 15636
7618A5636j8685j0789l0553O415n564L588J8935j042J5801M455J891k0929J5344
7605e497K9611o660n190j3341j6153J9271K7650o713j2534K2485J0607j6711m357
7592B2468k8015k0431j7696M020j871K569m87J6926J0918J2795K6122p512j3861
7579E945j3056j1218J0587K732o643J8776k5122r832J82O613j3027J2546p98L085
7565a9230J6397J3095q470Q416k134k5980o875J3378L2564k203k6084k1656N660
7552b3122J7811j3299N829j7930J6914J6983L570j5814J0803n592q91k6619J8942
7539a2415J1716j5709O88r359N154k2143j2653q835j2345J0591K1531J2959P389
7526b3431J120l089n481j5676K0726j4L213k258k0560r956K1879j050j711p044
$$ plain form
7618 15636 -3049 -13838 -44391 -37976 -43540 -39952 -21017 -22059 -6258 -1803 88 -20841 -5497
7605 -5497 24114 17454 12264 -1077 -17230 2041 29691 22978 10444 32929 43536 26825 22468
7592 22468 -5547 -25978 -43674 -39654 -41525 -38956 -39443 -22517 -11599 1196 27318 19806 5945
7579 5945 -7111 -18329 -7742 -5010 -11653 7123 -17999 -27831 -27649 -21036 -34063 -21517 -22315 -19230
7565 -19230 -2833 10262 1792 10208 8074 -17906 -24781 -11403 21161 18958 -7126 -28782 -23122
7552 -23122 -5311 -18610 -12781 -30711 -13797 3186 6756 -9058 1745 -3847 -4738 -31357 -12415
7539 -12415 -699 -16408 -15720 -25079 -19925 -42068 -54721 -63556 -75901 -65310 -43779 -30820 -23431
7526 -23431 -22311 -25400 -30881 -46557 -25831 -25845 -22632 -24890 -45450 -55406 -33527 -34577 -36288 -43332
7512d3332J8843l464k1810J6867K373m6K2171K7915m3772k2595j1918J1155J3159
7499c4454J669L2000K1801j7267l1233j5154J9688m741R456L01J946Q595k668
7486a0061K0342j3563m865p973q42j1435J5403J9759J997n732J467m481J0614
7473A0630m37m2469j9716M2628L6952j3077j8137M073j3899q136k821P879p125
7460b3655K2137L210n079L173j8205k4908Q07m656N816L7105P571N319q879M705
7446D461m412L704n871j2069l739k1956J1913J9537N28q450r746K0482J4614j0713
7432a717N497J0655j4968r62j0943q206O029J1766o744j5474k2843j3885K1465
7419d0330M459R443L617l789j1060K5489L3117o363j8068j4917k4606o204q716
$$ plain form
7512 -43332 -24489 -27953 -49763 -32896 -30523 -30569 -8398 19517 -24255 -46850 -58768 -47613 -34454
7499 -34454 -32785 -785 21016 3749 -27484 -42638 -22950 -27691 -18235 -17934 -15988 -7393 -10061
7486 -10061 10281 -3282 -8147 -16120 -16962 -28397 -12994 6765 8762 3030 4497 16 10630
7473 10630 10193 -32276 -51992 -9364 27588 14511 -3626 447 -13452 -21588 -24409 -16530 -23655
7460 -23655 -1518 1692 -3387 -214 -18419 -43327 -42520 -47176 -41360 -4255 3316 8635 -244 4461
7446 4461 49 3753 -2118 -14187 -17926 -39882 -27969 -8432 -7904 -16354 -26100 -5618 8996 -1717
7432 -1717 3780 14435 -533 -1495 -12438 -20644 -14615 -2849 -9593 -25067 -47910 -61795 -40330
7419 -40330 -35871 -26428 -22811 -26600 -37660 -12171 20946 14583 -3485 -18402 -43008 -49212 -57928
7406e7928J2488J9718M1896J4426n751m789j33j0643l683l792J061J7857J1207
7393C1934n610o925k6390j5719K3155L487k0516q243k9331N683K8163L5831P210
7380B2729R628k2008k8122M946J6459l4863j9353l5229p188K1405L526N660K349
7367f0061l64j648K1358L9992K0700j703j2072p686j2735n499R666j9118J2991
7354a6179K1140R808m895k0505j1996k2009J1993K2433j3712l712o757j6950k0019
7341g1360K651L4452n442j5513J0528M6462K7529l6844k2188P730M719p045k4814
7328d9135K9160L1740K9776O417J1542k5031m302j93L307r89l684j4916q744k9889
7314b4941m4j5696j7885l462N5801M447p917P694J88J5913P309J7813J8496M590
$$ plain form
7406 -57928 -45440 -25722 16174 30600 24849 20060 19927 9284 5601 1809 2870 20727 31934
7393 31934 26324 19399 -6991 -22710 445 3932 -16584 -24827 -54158 -48475 -20312 15519 22729
7380 22729 32357 10349 -17773 -12827 3632 -31231 -50584 -85813 -93001 -71596 -68070 -62410 -60061
7367 -60061 -60425 -62073 -40715 -723 19977 18274 6202 -1484 -14219 -19718 -10052 -29170 -16179
7354 -16179 4961 14769 9874 -10631 -22627 -44636 -32643 -10210 -23922 -27634 -34391 -51341 -71360
7341 -71360 -68709 -34257 -39699 -55212 -44684 1778 29307 -7537 -29725 -21995 -17276 -24321 -49135
7328 -49135 -19975 11765 41541 47958 59500 34469 30167 29974 33281 32292 28608 13692 4948 -24941
7314 -24941 -24985 -40681 -58566 -62028 -6227 -1780 -9697 -2003 -1815 14098 21407 39220 57716 62306
7300F2306j5532j4703j8771O452J4090j5404j6460r904J1630L5421o139l1772
7288A214j2338j360R887O327l630M316j3829K8153M588p155j6091l7691J4553
7275b3056j2021j9399P30K5883L606l653K0038J9838R528j7758K023q22l7714
7262c2777j378J8136o333J4888J1512J2946j8776k8198K5993L3630j5698l4306
7250b0361r11K2388L1594j3605k5259k4186L0984j2000J4281J1838j3717J7402
7238A8448P63j1627j1502k5440j0940M129J545j2234M156J7638j9831j2738o273
7225f3906J3495Q703l0192L249L2169K7610J954J007O314q511P721o76j1625R644
7211c044N656j5775O24l996o586k2288l7438L0237M6706J7294n72j3044k4083
$$ plain form
7300 62306 46774 32071 13300 19752 33842 18438 1978 -7926 3704 39125 32986 1214
7288 1214 -11124 -12484 -2597 3730 100 4416 -9413 18740 23328 16173 82 -37609 -23056
7275 -23056 -35077 -54476 -53746 -27863 -24257 -27910 -7872 11966 21494 3736 5759 4937 -32777
7262 -32777 -34155 -16019 -22352 -7464 4048 16994 -1782 -29980 -3987 29643 13945 -20361
7250 -20361 -21272 1116 32710 19105 -6154 -30340 644 -11356 2925 14763 1046 18448
7238 18448 19211 7584 -3918 -29358 -40298 -36169 -34624 -46858 -42702 -25064 -44895 -57633 -63906
7225 -63906 -50411 -41708 -71900 -68651 -36482 -8872 -6918 -5911 403 -8108 -387 -1063 -12688 -3044
7211 -3044 2612 -13163 -12539 -16535 -23121 -45409 -82847 -52610 -5904 11390 10818 -2226 -26309
7198b6309L251J4725K7278l3506P045K0759r998P916k6392K2448K8802j2753K2153
7185D5419j0291m4573k6349J7026K3550M7753J7174k7466k3552j5166O701m2456
7173c2230q479J7474J1182Q256j7392j7253N115J1822J5896J6460K7350M845j8527
7160B4519k7857l8730p065R443l41k1679N319J0102J3435P652P536m505j3278
7147c5449J6202J6834j0705R763j4006L432J7506q468n257N428l6811J1421m554
7134c4664j4776K0962M991J312k5274l297P076K4601j4345k5137R627p560P244
7121d9240J6789k619K3072J5131N51L4081J4731m139k8827K0314j0386k8970n949
7108e461k51r397j6648j0243j6019K6608l315k5415j8182K5094L3541R780k1578
$$ plain form
7198 -26309 -23058 -8333 18945 -14561 -7516 13243 3245 11161 -15231 7217 36019 23266 45419
7185 45419 35128 -9445 -35794 -18768 4782 52535 69709 42243 18691 3525 10226 -32230
7173 -32230 -40709 -23235 -12053 -3797 -21189 -38442 -33327 -21505 -5609 10851 38201 43046 24519
7160 24519 -3338 -42068 -49133 -39690 -40031 -61710 -56391 -46289 -32854 -25202 -17666 -22171 -35449
7147 -35449 -19247 -2413 -13118 -3355 -17361 -13929 3577 -4891 -10148 -4720 -41531 -30110 -34664
7134 -34664 -49440 -28478 -23487 -22175 -47449 -50746 -43670 -19069 -33414 -58551 -48924 -56484 -49240
7121 -49240 -32451 -35070 -11998 3133 3684 37765 52496 48357 19530 39844 29458 488 -5461
7108 -5461 -5712 -15109 -31757 -42000 -58019 -31411 -34726 -60141 -78323 -53229 -19688 -9908 -31486
$$ [...]
##END NTUPLES=NMR SPECTRUM
##END=
