##TITLE=Analysis number 316282
Compound Code cc 46902
Book Reference 422/139
Project Code adrs
Chemist Name robb
##JCAMPDX= 6.0         $$ Bruker NMR JCAMP-DX V2.0
##DATA TYPE= NMR SPECTRUM
##DATA CLASS= NTUPLES
##ORIGIN= Bruker BioSpin GmbH
##OWNER= nmr
$$ XWIN-NMR		Version 3.5
$$ Mon Jan  9 14:24:09 2006 GMT Standard Time (UT+0h)  MAYBRIDGE\nmr@NMR_250MHZ
##.OBSERVE FREQUENCY= 250.131544655141
##.OBSERVE NUCLEUS= ^1H
##.ACQUISITION MODE= SIMULTANEOUS (DQD)
##.ACQUISITION SCHEME= undefined
##.AVERAGES= 16
##.DIGITISER RES= 18
##SPECTROMETER/DATA SYSTEM= dpx250
##.PULSE SEQUENCE= zg30
##.SOLVENT NAME= CDCl3
##.SHIFT REFERENCE= (INTERNAL, CDCl3, 0, 16.522)
##AUDIT TRAIL= $$ (NUMBER, WHEN, WHO, WHERE, WHAT)
$$ ##TITLE= Audit trail, XWIN-NMR		Version 3.5
$$ ##JCAMPDX= 5.01
$$ ##ORIGIN= Bruker BioSpin GmbH
$$ ##OWNER= nmr
$$ C:\u/data/dgb/nmr/ADRS/14400/pdata/1/auditp.txt
$$ ##AUDIT TRAIL=  $$ (NUMBER, WHEN, WHO, WHERE, WHAT)
(   1,<2006-01-09 14:23:40.15 +000>,<MAYBRIDGE\nmr>,<NMR_250MHZ>,
      <created by zg, POWCHK disabled, PULCHK disabled
       configuration hash MD5:
       62 19 C7 07 E1 42 D1 B7 37 6C 3D D0 77 39 F9 E6
       data hash MD5: 64K
       8D 92 C8 F0 38 F2 1A 2E 7E BA E0 73 A5 9B 16 C9>)
(   2,<2006-01-09 14:23:55.35 +000>,<MAYBRIDGE\nmr>,<NMR_250MHZ>,
      <Start of raw data processing
       ef LB = 0.3 FT_mod = 6 PKNL = 1 SI = 32K 
       data hash MD5: 32K
       BB 51 DB 7C C6 A5 FA A7 0A 41 98 C6 84 02 25 3B>)
(   3,<2006-01-09 14:23:57.38 +000>,<MAYBRIDGE\nmr>,<NMR_250MHZ>,
      <apk 
       data hash MD5: 32K
       4D 38 26 DE 4E 65 53 70 02 86 E5 F0 A2 16 ED B5>)
(   4,<2006-01-09 14:23:58.13 +000>,<MAYBRIDGE\nmr>,<NMR_250MHZ>,
      <abs ABSG = 5 
       data hash MD5: 32K
       67 AA 00 DE 26 FD 6E 2F C1 2F D9 6C 98 8E 33 A5>)
$$ ##END=
$$ 
$$ hash MD5
$$ 93 AD DF 6F 0C AE B9 BF 8F D4 B2 D6 6B 47 0E A0
##$RELAX= 
##$RELAX= 
##$RELAX= 
##$RELAX= 
##$RELAX= 
##$RELAX= 
##$RELAX= 
$$ Bruker specific parameters
$$ --------------------------
##$DU= <C:\u>
##$EXPNO= 14400
##$NAME= <ADRS>
##$PROCNO= 1
##$TYPE= <nmr>
##$USER= <dgb>
##$AMP= (0..31)
100 100 100 100 100 100 100 100 100 100 100 100 100 100 100 100 100 100 
100 100 100 100 100 100 100 100 100 100 100 100 100 100 
##$AQSEQ= 0
##$AQ_mod= 3
##$AUNM= <au_zg>
##$AUTOPOS= <35 >
##$BF1= 250.13
##$BF2= 250.13
##$BF3= 250.13
##$BF4= 250.13
##$BF5= 500.13
##$BF6= 500.13
##$BF7= 500.13
##$BF8= 500.13
##$BYTORDA= 1
##$CFDGTYP= 0
##$CFRGTYP= 5
##$CHEMSTR= <none>
##$CNST= (0..31)
1 1 145 1 1 1 1 1 1 1 1 1 1 1 1 1 1 1 1 1 1 1 1 1 1 1 1 1 1 1 1 1 
##$CPDPRG= <>
##$CPDPRG1= <>
##$CPDPRG2= <>
##$CPDPRG3= <>
##$CPDPRG4= <mlev>
##$CPDPRG5= <mlev>
##$CPDPRG6= <mlev>
##$CPDPRG7= <mlev>
##$CPDPRG8= <mlev>
##$CPDPRGB= <>
##$CPDPRGT= <>
##$D= (0..31)
0 1 0 0 0 0 0 0 0 0.06 0 0 0 0 0 0 0.0002 0 0 0 0 0 0 0 0 0 0 0 0 0 0 
0 
##$DATE= 1136816618
##$DBL= (0..7)
120 120 120 120 120 120 120 120 
##$DBP= (0..7)
150 150 150 150 150 150 150 150 
##$DBP07= 0
##$DBPNAM0= <>
##$DBPNAM1= <>
$$ [...]
##$SUBNAM7= <"">
##$SUBNAM8= <"">
##$SUBNAM9= <"">
##$SW= 20.6930455092707
##$SWIBOX= (0..15)
0 0 3 0 0 0 0 0 0 0 0 0 0 0 0 0 
##$SW_h= 5175.983436853
##$TD= 65536
##$TD0= 1
##$TE= 294.16
##$TE2= 300
##$TE3= 300
##$TEG= 300
##$TL= (0..7)
0 120 120 120 120 120 120 120 
##$TP= (0..7)
150 150 150 150 150 150 150 150 
##$TP07= 0
##$TPNAME0= <>
##$TPNAME1= <>
##$TPNAME2= <>
##$TPNAME3= <>
##$TPNAME4= <>
##$TPNAME5= <>
##$TPNAME6= <>
##$TPNAME7= <>
##$TPOAL= (0..7)
0.5 0.5 0.5 0.5 0.5 0.5 0.5 0.5 
##$TPOFFS= (0..7)
0 0 0 0 0 0 0 0 
##$TUNHIN= 0
##$TUNHOUT= 0
##$TUNXOUT= 0
##$USERA1= <user>
##$USERA2= <user>
##$USERA3= <user>
##$USERA4= <user>
##$USERA5= <user>
##$V9= 5
##$VALIST= <valist>
##$VCLIST= <CCCCCCCCCCCCCCC>
##$VD= 0
##$VDLIST= <DDDDDDDDDDDDDDD>
##$VPLIST= <PPPPPPPPPPPPPPP>
##$VTLIST= <TTTTTTTTTTTTTTT>
##$WBST= 1024
##$WBSW= 4
##$XGAIN= (0..3)
0 0 0 0 
##$XL= 0
##$YL= 0
##$YMAX_a= 541259
##$YMIN_a= -384695
##$ZGOPTNS= <>
##$ZL1= 120
##$ZL2= 120
##$ZL3= 120
##$ZL4= 120
##$ABSF1= 16.522
##$ABSF2= -4.171173
##$ABSG= 5
##$ABSL= 3
##$ALPHA= 0
##$AQORDER= 0
##$ASSFAC= 0
##$ASSFACI= 0
##$ASSFACX= 0
##$ASSWID= 0
##$AUNMP= <proc_1d>
##$AZFE= 0.1
##$AZFW= 0.1
##$BCFW= 0
##$BC_mod= 0
##$BYTORDP= 0
##$COROFFS= 0
##$CY= 12.5
##$DATMOD= 1
##$DC= 0
##$DFILT= <>
##$DTYPP= 0
##$F1P= 14.0000005364418
##$F2P= -0.99999901652339
##$FCOR= 0.5
##$FTSIZE= 32768
##$FT_mod= 6
##$GAMMA= 0
##$GB= 0
##$INTBC= 1
##$INTSCL= 1
##$ISEN= 128
##$LB= 0.3
##$LEV0= 0
##$LPBIN= 0
##$MAXI= 10000
##$MC2= 0
##$MEAN= 0
##$ME_mod= 0
##$MI= 0
##$NCOEF= 0
##$NC_proc= -2
##$NLEV= 6
##$NOISF1= 0
##$NOISF2= 0
##$NSP= 0
##$NTH_PI= 0
##$NZP= 0
##$OFFSET= 16.522
##$PC= 1
##$PHC0= 84.49454
##$PHC1= 2.707683
##$PH_mod= 1
##$PKNL= yes
##$PPARMOD= 0
##$PSCAL= 4
##$PSIGN= 0
##$REVERSE= no
##$SF= 250.13
##$SI= 32768
##$SIGF1= 0
##$SIGF2= 0
##$SINO= 400
##$SIOLD= 32768
##$SREGLST= <1H.CDCl3>
##$SSB= 0
##$STSI= 32768
##$STSR= 0
##$SW_p= 5175.98343685301
##$SYMM= 0
##$S_DEV= 0
##$TDeff= 65536
##$TDoff= 0
##$TI= <Analysis number 999999
Compound Code 99
Book Reference 9
Project Code 9>
##$TILT= no
##$TM1= 0
##$TM2= 0
##$TOPLEV= 0
##$USERP1= <user>
##$USERP2= <user>
##$USERP3= <user>
##$USERP4= <user>
##$USERP5= <user>
##$WDW= 1
##$XDIM= 32768
##$YMAX_p= 491955122
##$YMIN_p= -234884
$$ End of Bruker specific parameters
$$ ---------------------------------
##NTUPLES= NMR SPECTRUM
##VAR_NAME=  FREQUENCY,     SPECTRUM/REAL,   SPECTRUM/IMAG
##SYMBOL=    X,             R,               I
##VAR_TYPE=  INDEPENDENT,   DEPENDENT,       DEPENDENT
##VAR_FORM=  AFFN,          ASDF,            ASDF
##VAR_DIM=   32768,         32768,           32768
##UNITS=     HZ,            ARBITRARY UNITS, ARBITRARY UNITS
##FACTOR=    0.157963299565203, 1,           1
##FIRST=     4132.6476996994, 0,             0
##LAST=      -1043.33573715361, 0,           0
##MIN=       -1043.33573715361, -234884,     0
##MAX=       4132.6476996994, 491955122,     0
$$ Real data points
##PAGE= N=1
##DATA TABLE= (X++(R..R)), XYDATA
$$ [...]
19221A91456q2387l5959j4122l971M381l012j4255m842J779p455p625j0047j478
19208A2463q194j7770r919J1785J8106o293l625K2113o76K0070J4275j498r344
19195D1493l774p708q579p942J750l218M563J0822M831j1399m189n294N066L736
19181B0158J2680N412m241k533l6J703o017j4230j0664N006k971j3213j227n925
19167a6098Q658J723j201J7458J5577j2492j877J5563N539k7372j157K1631J8777
19154D4729m994J24j118j1599r488j7400p364O36M277K0121J2071O723K59k348
19140C4629M650Q450K551l474Q188j2817q449j2533P71J0254J1270k316m979J797
19126C7992L371J391j1352q057K008m324j1539O740K0935O539l723K145J084n638
$$ plain form
19221 191456 109069 73110 58988 55017 59398 56386 42131 37289 39068 31613 23988 13941 12463
19208 12463 4269 -13501 -23420 -11635 6471 178 -3447 18666 17990 38060 52335 50837 41493
19195 41493 37719 30011 21432 13490 15240 12022 16585 27407 32238 20839 16650 11356 16422 20158
19181 20158 32838 38250 34009 31476 31440 33143 27126 12896 2232 7238 4267 -8946 -10173 -16098
19167 -16098 -7440 -5717 -6918 10540 26117 13625 11748 27311 32850 5478 4321 25952 44729
19154 44729 39735 39859 38741 27142 17654 254 -7110 -6474 -2197 17924 29995 36718 36977 34629
19140 34629 39279 47729 50280 46806 54994 42177 33728 21195 21966 32220 43490 41174 36195 37992
19126 37992 41363 42754 31402 23345 25353 21029 9490 16230 37165 43704 39981 42126 43210 37572
19112C7572m950KQ315k1120p773J7743J9263m196m697L657r61m315n293j621M876
19097C6502N719j5828m633J1290K034o324J351j1120J87M970p334K782n520p961
19083F115r423P107J0013P684O318n20m347j3149N716J1406n178j6817n800J2465
19069A1590J0224R108j853j408L406p459l105M040j076L852j4140O520j2422j0166
19055b889m466o497J0299m432J4426J6767Q150M014K194l732j3908r616R717J8747
19041C8774J2580O164N152Q944j562p121k23j3772j5407p651J1943O12J1678p409
19027D2702n155J3646j0625q986J802M636j262l582l007O407o82j6937J2533M451
19013C5941j3242p934R661k751j3729j1828J4374J7889k365j5332Q685K9458r307
$$ plain form
19112 37572 32622 32624 40939 19819 12046 29789 49052 44856 40159 43816 42855 38540 33247 31626 36502
19097 36502 42221 26393 21760 33050 35084 28760 30111 18991 19178 24148 16814 19596 14076 6115
19083 6115 -3308 3799 13812 21496 27814 27294 22947 9798 15514 26920 21742 4925 -875 11590
19069 11590 21814 30922 29069 27661 31067 23608 20503 24543 23467 27319 13179 19699 7277 -2889
19055 -2889 -7355 -13852 -3553 -7985 6441 23208 31358 35372 37566 33834 19926 10310 20027 38774
19041 38774 51354 57518 62670 71614 70052 62931 62708 48936 33529 25878 37821 38433 50111 42702
19027 42702 37547 51193 40568 31582 33384 38020 36758 33176 30169 36576 35894 18957 31490 35941
19013 35941 22699 14765 24426 21675 7946 -3882 10492 28381 26016 10684 19369 48827 39520
19000C9520j3484j1058O838J4165o94m443J159M86R954O032n680L484k292o051
18986C7936j725p106M139J0047J0062P272N886K754K91j2819J3233K840j4547
18973E8263j0085L498o380N291O835m604j0209q15o873p858m832O293O868N26
18959C5918M733N699n628m48k595j4626j6147j158J7885L415M415K1061J017p48
18945E2793j7472j047j2395j394M164J2164O181l423N893N066o996J7387J2337
18932G3258j2962l0637j7449R902R947n177r232m038J4467M291K962O278j3511
18919B8099j2720N687J4873j1493o878J6995q357J659l009j2126K295J1097L839
18906B9961o682M477J1978j8142m967J0055N148m785O743l843J1387r203n514
$$ plain form
19000 39520 26036 14978 21816 35981 35287 30844 32003 32489 42443 48475 42795 46279 43987 37936
18986 37936 36211 29105 33244 43291 53353 60625 66511 69265 69556 56737 69970 72810 58263
18973 58263 48178 51676 45296 50587 57422 52818 42609 41794 34921 27063 22231 28524 35392 35918
18959 35918 40651 46350 40722 40274 37679 23053 6906 5748 23633 27048 31463 52524 53541 52793
18945 52793 35321 34274 21879 20485 24649 36813 42994 39571 45464 50530 43534 60921 73258
18932 73258 60296 29659 12210 22112 32059 26882 17650 13612 28079 32370 35332 41610 28099
18919 28099 15379 21066 35939 24446 17568 34563 26206 27865 24856 12730 15025 26122 29961
18906 29961 23279 27756 39734 21592 16625 26680 31828 27043 33786 29943 41330 32127 26613
18893B6613J1405j817k273m378R610J6696m781o293J1180J9546J165r814j1194
18880E5665J529n39J142J798J698J605J5987M693r911o317j491J2401R261j4476
18866G3045j1882L281L532J0923K754j705k317q53J1666O648j2143j0902m507
18853F7540j925J6004J0342J8244P233j0440k768J5783l91o978L77r244k2812
18840H0965Q247J5923o16l875j4747R255J2065m598j2884n507q987J0031O861
18827I2133L512j2653o458K0214R109n925j75j2910j9743m975k03j695n024J0966
18813F6173R900J3377q066m145o160L44J398l617J2246K0083Q098j4022q545N018
18799I2082o58j172q253n094j1632j5891P972J7843J0148m474O662L0920J9701
$$ plain form
18893 26613 38018 36201 33928 29550 39160 55856 51075 44782 55962 75508 76673 66859 55665
18880 55665 57194 56655 57797 59595 61293 62898 78885 83578 73667 67350 65859 78260 87521 73045
18866 73045 61163 64444 67976 78899 81653 79948 77631 76778 88444 95092 82949 72047 67540
18853 67540 65615 81619 91961 110205 117438 106998 104230 120013 119622 112644 113021 103777 80965
18840 80965 89212 105135 104519 100644 85897 95152 107217 102619 89735 84228 75241 85272 92133
18827 92133 95645 82992 76534 96748 105857 99932 99757 86847 67104 62129 61926 60231 55207 66173
18813 66173 76073 89450 81384 77239 71079 71423 72821 69204 81450 101533 109631 95609 87064 92082
18799 92082 91424 90252 81999 76905 65273 49382 57354 75197 85345 80871 87533 118453 138154
18786A38154J3701N4098N5034m072n8234m6137k5575j9343r478N249J7675J5456
18774A36528K926p944q820j0671K7976L0066K1861M8306o134n4946l9179k7564
18762A12405j8440m567n85m493j1988j9616l5J5340p958k510J5308J6308p44k3504
18748F4921q415J3102P54J0140J6896P273j1878j5816R36K5206Q760q100K8175
18735A31954L3153J0946K366L449J085p23K847J3381J0390k5779k8666j9086k044
18722A33273j9063k4399j1907n143M131J0735M598N517j4924k5361m877K0194
18710G2774M519j2991j2020r551j4353j609K7757J5941J5949J9668Q313j35l594
18697A10668j8063Q395Q114j468P407J1918J6813M685N477O51M188J020N020n237
$$ plain form
18786 138154 151855 205953 260987 256915 198681 152544 126969 107626 98148 103397 121072 136528
18774 136528 139454 131510 122690 112019 139995 170061 191922 240228 234094 179148 139969 112405
18762 112405 93965 89398 88813 84320 72332 52716 52681 68021 60063 57553 72861 89169 88425 64921
18748 64921 56506 69608 70362 80502 97398 104671 92793 76977 77913 103119 111879 103779 131954
18735 131954 165107 176053 178419 181868 182953 182230 185077 198458 208848 183069 154403 135317 133273
18722 133273 114210 89811 77904 72761 76892 87627 92225 97742 82818 57457 52580 72774
18710 72774 77293 64302 52282 42731 28378 26769 54526 70467 86416 106084 114397 114262 110668
18697 110668 92605 101000 109114 107646 115053 126971 143784 148469 153946 154597 158785 159805 164825 159588
18683A59588O537l300m308O623J4881K4105J0351J4720J5885J5515J7221k228
18671B75590j427N197J4167j1095j4922p172Q257K3360J4595K5046J0073j778
18659C39891j047M644R441J7291j6290K25R929J4141j366N265R114o560R849K793
18645C97320K3336L9143Q011J6923M0314P2115P5244O4979L3561o248J3908O0860
18633H39466L6352Q462j3912J069M0755P6415J04213P3410L8963M0563Q5294J53029
18621A484079J50622N5627P610Q0794J78565K21770J61643R8432J20569K25461
18611B785172L01495L21677L72490M23504N03063O78050R44703J197046J434026
18602H961226J989507L157687N391615R317334J3604626J0627187j434285o051203
$$ plain form
18683 159588 166125 162825 158517 165140 180021 204126 214477 229197 245082 260597 277818 275590
18671 275590 274163 279360 293527 282432 267510 260338 268595 291955 306550 331596 341669 339891
18659 339891 338844 343488 352929 370220 353930 354155 364084 378225 376859 382124 391238 384678 394527 397320
18645 397320 420656 459799 467810 484733 525047 597162 672406 737385 770946 764698 778606 839466
18633 839466 875818 884280 870368 871437 912192 988607 1092820 1166230 1205193 1245756 1331050 1484079
18621 1484079 1634701 1690328 1697938 1778732 1957297 2179067 2340710 2439142 2559711 2785172
18611 2785172 3086667 3408344 3780834 4204338 4707401 5385451 6330154 7527200 8961226
18602 8961226 10950733 14108420 19500035 28817369 42421995 53049182 51614897 45563694
18594D5563694J04513P234929L167686q815156j1517415o220443P72307P711893
18586C8002008J1988701N596527n773132o203904J463475N901051k572944j3015131
18578C5386651j3079111q495606m665110k528820j414740q64068o30790n59492
18570C148914m46693k69499j45567j29098j99648k60052j86424n6383M7370L7325
18560A540245q4049j46164j24419l1686R63k9282p7453j36726j47376q8762l4144
18549F41147J5935l1999q2932o3328l4951q125K5082M3948l104k3785j7841K308
18537D62355n325m2387p7108o7547j5403k3829P120j270p835J581L9949M4913
18525C15214O277l8767k5596J5812M3882m018l6752n1231k7126J8728N7535L2723
$$ plain form
18594 45563694 45668207 52903136 56070822 47255666 35738251 29517808 30290115 38002008
18586 38002008 49990709 55587236 49814104 43610200 45073675 50974726 48401782 35386651
18578 35386651 22307540 13811934 9146824 6618004 5203264 4339196 3708406 3148914
18570 3148914 2702221 2432722 2287155 2158057 1958409 1698357 1511933 1455550 1502920 1540245
18560 1540245 1456196 1310032 1185613 1153927 1154890 1125608 1048155 911429 764053 675291 641147
18549 641147 657082 625083 542151 478823 443872 435747 460829 504777 501673 477888 460047 462355
18537 462355 457030 414643 337535 269988 254585 230756 237876 236606 228771 230352 270301 315214
18525 315214 321491 282724 257128 272940 316822 312804 276052 224821 197695 216423 273958 306681
18513C06681j7430l8137k2577o865J910k5840l7555l3394j9171j616q897j219
18501I5890j3035o439M583n291J1521R743R145o237j9679O406l406L217Q205O282
18487A00905m788r178r534j3347j5378O408K2647J8495J2902O446j7066o902K603
18474I4213p172J2759K4642P263L415J1480K09k7054j2650J0814J3320r791o910
18461A14538M84K607L074L016M03r155j0746j8983k9304j3965j4939j6368Q974
18448A9636o983j375l158P392O118K732K1434K9362n254q961P96Q351R93j0109
18434F0974n973r206j0056J5072J3343j905O174Q468l412J0741M585j2397r806
18421F6602K0269K828j0409j3556k117O815J4829o021R293J1497K0172K0928L133
$$ plain form
18513 306681 289251 251114 228537 221672 223582 197742 160187 126793 107622 106006 97109 95890
18501 95890 82855 76416 80999 75708 87229 96972 106117 99880 80201 86607 83201 86418 94623 100905
18487 100905 96117 86939 77405 64058 48680 55088 77735 96230 109132 115578 98512 91610 94213
18474 94213 87041 99800 124442 131705 135120 146600 146809 119755 107105 117919 131239 121448 114538
18461 114538 115022 117629 120703 123719 124122 114967 104221 85238 55934 41969 27030 10662 19636
18448 19636 12653 11278 8120 15512 21630 24362 45796 75158 69904 60943 61739 70090 71083 60974
18434 60974 55001 45795 35739 50811 64154 62249 68423 76891 73479 84220 88805 76408 66602
18421 66602 86871 89699 79290 65734 63617 70432 85261 79240 88533 100030 120202 141130 144263
18408A44263j2335J7787M8961O4239Q9259J41682J48296J12075J452r6943j52776
18397E05960j45238r0564o2227l0762k7408k7409j6144r445j316M410j544q113
18385I0200j6055k0687n203P930K0606L527j7715o388k647N383R195j2669j4295
18372D1182J4462J2641J4313R948n206j6309k3395p338N012P391P456Q100k58
18359F7999j1801q682k68j210j535k033p160j439o824p958k889M939R676M55k5161
18344F109p880L0131N594j145J7467K287o660k1421j2713R257j522P44N735r240
18330A6743P874L959J2356R516j5541J974J324M307J7908k272k2491p750M672
18317C2579m654l411O843J698L11m589J6797J4382j3252j0856k2192j1363j840
$$ plain form
18408 144263 131928 149715 198676 262915 352174 493856 642152 754227 755679 658736 505960
18397 505960 360722 270158 207931 177169 149761 122352 106208 96763 95447 99857 98313 90200
18385 90200 74145 53458 48255 56185 76791 80318 62603 56215 53568 58951 68146 55477 41182
18372 41182 55644 68285 82598 92546 87340 71031 47636 40298 45310 52701 60157 68257 67999
18359 67999 56198 47516 47248 46038 44503 42470 35310 33871 27047 19089 16200 21139 30815 31270 6109
18344 6109 -1771 28360 33954 32809 50276 52563 45903 24482 11769 21026 19504 20248 25983 16743
18330 16743 24617 28576 40932 50448 34907 36881 38205 42512 60420 58148 35657 27907 32579
18317 32579 27925 24514 31357 33055 33366 28777 45574 59956 46704 35848 13656 2293 453
18304D53J0148J2670P959r110J325J1924M257j0116j343j117p460J032J1902O359
18290C8883Q573l403L169J0232J786J2328O162m291M410m89r452J253J701q043
18276F2819L160J5718j892r335j3584k586k596P995R859J089j1190q929j746R869
18262E8651J055K332o88l705J386j028O248M766J5016J6143j7723j2740L669O973
18248H0355K0242K765n991n007K527O871r769J1054J0550n963j6504k5082j9866
18235D6182q284j5144j2915r742J6320K1939Q772J3768J803M457P451j1152j1950
18222E1505M809O2L154m692l234r57j3529J2064J4611p661K182J2575l836q101
18208E8952r607O982J8293n700n033L599j3227Q339L977J7519J2654j5786o622
$$ plain form
18304 453 10601 23271 31230 22120 23445 35369 39626 29510 28167 27050 19590 20622 32524 38883
18290 38883 47456 44053 47222 57454 59240 71568 77730 73439 77849 77360 67908 69161 70862 62819
18276 62819 65979 81697 79805 70470 56886 54300 51704 59699 69558 70647 59457 50528 48782 58651
18262 58651 59706 62038 61350 57645 59031 58003 64251 69017 84033 100176 82453 69713 73382 80355
18248 80355 100597 103362 97371 92364 94891 101762 91993 103047 113597 107634 91130 66048 46182
18235 46182 37898 22754 9839 97 16417 38356 47128 60896 62699 67156 74607 63455 51505
18222 51505 56314 56376 59530 54838 51604 50647 37118 49182 63793 56132 58314 70889 67053 58952
18208 58952 49345 56327 74620 68920 63887 67486 54259 62598 66575 84094 96748 80962 74340
18195G4340K085J313R039n596N214j332O239J496l894J1875J89M134K9756K0214
18181A55072J7071J1520j2067k3839j8395j6503l337j1310M803r291Q160k345
18169I9539l673J238O705N543m117Q697J417j2798J409J8507K3559L534k484q031
18155A39045q077p43L917J7323J1424P268P833J8905K1251J4804J1483j3316j0056
18142B21061l722P156J8842K0025J4272J2941R032J727K7144M2799L7305K3371
18130D31953J9439J6098N1098O1500O1766O1119R0747R0207J05018J25392J82981
18119A297318K40328K73271L29137M15257N52966P48764J133272J852486L434904
18110A0277703O740308J0777987O933842p262295j0901616p477381l781357j908036
$$ plain form
18195 74340 76425 77738 86777 81181 86395 85063 91302 92798 88904 100779 100968 105102 134858 155072
18181 155072 172143 183663 171596 147757 129362 112859 109522 98212 103015 93724 101884 99539
18169 99539 95866 97104 103809 109352 105235 113932 115349 102551 103960 122467 146026 149560 147076 139045
18155 139045 130968 130225 134142 151465 162889 170157 177990 196895 218146 232950 244433 231117 221061
18142 221061 217339 224495 243337 263362 277634 290575 299607 301334 328478 371277 408582 431953
18130 431953 451392 467490 518588 580088 641854 702973 793720 883927 988945 1114337 1297318
18119 1297318 1537646 1810917 2140054 2555311 3108277 3857041 4990313 6842799 10277703
18110 10277703 17018011 27795998 34729840 27467545 16565929 9088548 5307191 3399155
18102C399155j023818o10374m01731k49036j66879j33741j04695r6415p5754n9866
18092D76846m7021k3911K176o230l2457l1257j7895j101R518m858j2759L679j2591
18079C02139j4685q652j7734j6833r888k310j2521j3420k7550k9197n499j0352
18067A33498k1734p425O683P593J7797K0204j1339k4405M112J2342m776m98j2173
18054A19879O366P560k6781q802J5064J3702K2721M6650K1463J2760O843m215
18042B33210j4464j4300j2978j1453j9119j3102Q545J139j6301m392J075k5207
18030A12653k1282o811J1766K444j7727l757J991l527m268j11K4322K0253O964
18017A22910P414J4192j432j744n339J111J203l2835k2998p007J1799J7455J3163
$$ plain form
18102 3399155 2375337 1764963 1363232 1114196 947317 813576 708881 612466 536712 476846
18092 476846 429825 405914 408090 401860 369403 338146 320251 319150 328668 323810 311051 314730 302139
18079 302139 287454 278802 261068 244235 234347 232037 219516 206096 178546 149349 143850 133498
18067 133498 111764 104339 111022 118615 136412 156616 145277 120872 124984 137326 132550 132052 119879
18054 119879 126245 133805 107024 98222 113286 126988 149709 196359 217822 230582 237425 233210
18042 233210 218746 204446 191468 180015 160896 147794 156339 157478 141177 136785 137860 112653
18030 112653 91371 84560 96326 98770 81043 77286 79277 75750 71482 71371 95693 115946 122910
18017 122910 130324 144516 143084 141340 136001 137112 138315 105480 82482 75475 87274 104729 117892
18004A17892k683J0995P920L531j0976j854l346j640N004K470q815l821K5844
17991A40521L4448J1269m848K722l188r324K5477L2769R125k3038j7950l07Q850
17978B06526K8582L5186K9819J5431j974R271j5827k4453P222q817j5283j3446
17966B52237j8665J540o033q115J0446K3888K6187J6521k108J7604K3650J6875
17954C54027q622k4103o9803j03250q2051o908L4078Q5002J07162R2634L5026
17943D13192O8J4050L4549M0440j2287n0487m0155O120L4680O4487M6905K539
17931E54101m2592l3989l946J555l4089m1252o1388n1141k2216J671N145o268
17919B65591k1114k6552p662J163m704j6633j917M898J6127K0973J8554o41j7122
$$ plain form
18004 117892 115209 126204 134124 137655 126679 124825 121479 119839 124843 127313 118498 114677 140521
17991 140521 174969 186238 181390 184112 180924 171600 197077 229846 238971 215933 197983 197676 206526
17978 206526 235108 270294 300113 315544 313570 322841 307014 282561 289783 280966 265683 252237
17966 252237 233572 235112 229079 220964 231410 255298 281485 298006 295898 313502 337152 354027
17954 354027 345405 321302 251499 148249 66198 59290 93368 178370 285532 378166 413192
17943 413192 413260 427310 461859 502299 490012 439525 399370 405490 440170 504657 551562 554101
17931 554101 511509 477520 473574 475129 441040 399788 338400 287259 265043 266714 271859 265591
17919 265591 244477 217925 210263 211426 206722 190089 188172 193070 209197 230170 248724 248083 230961
17906B30961O252L0993J7523J0279M270O11Q453n37o277P761L832J7470J4316
17893C45907K126r945j7779L091J2158R727J0290J5228L0591J5495j0714R704
17881D15879K2130j1946j129K0835K1130J8185N68R792Q72Q456N0658N0307J1994
17868F17731P692J1069K4489L1466K9027M7875M6272L7905L6085M7434O8152O8331
17856A073528N6073P1794P9516O4761J03815J14569J62889K28341L03806L57951
17846B617043L34289K11000J45827J60114K15479K67415L59838M64274N95133
17837E370412P58696R52055J238133J441952J668503K012632K684926L843710
17829A9971019N766299R121826J5141949K4366306L2538725K8787454P724197
$$ plain form
17906 230961 237213 268206 285729 296008 300278 300889 309342 308805 302528 310289 314121 331591 345907
17893 345907 348033 338088 320309 323400 335558 345285 355575 370803 401394 416889 406175 415879
17881 415879 438009 426063 424934 445769 466899 485084 485652 495444 496316 504772 555430 605737 617731
17868 617731 625423 636492 660981 692447 721474 769349 815621 853526 889611 937045 1005197 1073528
17856 1073528 1129601 1201395 1280911 1345672 1449487 1564056 1726945 1955286 2259092 2617043
17846 2617043 2951332 3162332 3308159 3468273 3683752 3951167 4311005 4775279 5370412
17837 5370412 6129108 7081163 8319296 9761248 11429751 13442383 16127309 19971019
17829 19971019 25737318 34859144 50001093 74367399 106906124 135693578 143417775
17822A43417775j9198986l4111639l1972300k1919925j2966332p454359m395894
17815A1398340k680105j703359j104771p50687n88601n56347n81994n32101m01064
17806B499311k38438j80322j66310j53022j29516m6791M3799M0708m2339j72023
17796A455057k47900k53304j94171j18175r2913n8762m3875j5939n112k3037l1953
17785C69916k6309l3830r749j5228j1891Q123j08j8659k8670j8265P813J0422
17773B33565j2479j7537j4666j5101r328K755j7378j9949j5419k572j241J2476
17761A23126J974J3981K4223L458j2131j4284J2025j337j6580n660o935j988r403
17748A10469J8327K6482J3108L6645N1868P6891J07058J58952J97751J63994M4297
$$ plain form
17822 143417775 124218789 90107150 58134850 36214925 23248593 15794234 11398340
17815 11398340 8718235 7014876 5910105 5159418 4570817 4014470 3432476 2900375 2499311
17806 2499311 2260873 2080551 1914241 1761219 1631703 1584912 1628711 1669419 1627080 1455057
17796 1455057 1207157 953853 759682 641507 548594 489832 445957 430018 424906 401869 369916
17785 369916 343607 309777 300028 284800 272909 281032 280924 262265 233595 215330 223143 233565
17773 233565 221086 203549 188883 173782 164454 167209 149831 129882 114463 111891 110650 123126
17761 123126 125100 139081 163304 166762 154631 140347 152372 151035 134455 128795 121860 119872 110469
17748 110469 128796 155278 168386 205031 256899 333790 440848 599800 797551 961545 1005842
17737A005842q4389j45657j60937j30373o0770j5176j5284m7171p3725o1060l6517
17726A74783k1050L026j2097k0089L874J1079K2666K0622Q722J5846M4723N4257
17714C06362L9279J2279k5518K95J8602j6566l4642m8738o1974n0906j0019J3319
17702A41773J7655K9793L8387K8325R172l194k6492n2302q5050o7895k7601j1872
17690i301P630l930O494k528j478K144l548l347M543J694N894K204n489K4013
17676B4995n87p885R118o25j8749J321L2469N3266L4804K6168J1137j2705m1679
17663A11048k7006j4927j799q49p956k546j6300k273N699J3926r305O52J67j8152
17649C0379m619Q461N312m794J5403J7838n223n378r316O58J886n429j833j5738
$$ plain form
17737 1005842 921453 775796 614859 484486 423716 408540 393256 346085 272360 211300 174783
17726 174783 153733 156759 144662 124573 128447 139526 162192 182814 191536 207382 252105 306362
17714 306362 345641 357920 332402 332697 351299 334733 300091 251353 189379 138473 128454 141773
17702 141773 159428 189221 227608 255933 265105 261911 235419 183117 98067 30172 2571 -9301
17690 -9301 -1671 -5601 893 -1635 -3113 -969 -4517 -7864 -3321 -1627 4267 6471 982 24995
17676 24995 24408 16523 25641 25016 6267 7588 40057 93323 128127 154295 165432 152727 111048
17663 111048 84042 69115 67316 66467 58511 55965 39665 37392 43091 57017 47712 48364 48531 30379
17649 30379 25760 34221 39533 34739 50142 67980 62757 57379 48063 48721 50607 45178 43345 27607
17635B7607j9856j3068l315n959l387o919K235N545L1159L3996J1206M432J767
17622F5443j2406k702k873k5249q563K2289K86J5316j1398j5198q807o950k292
17609F896j2142J3907Q4K448J138l082O439J5798J6796m482O65L423Q385J294
17595E7567p473o137j1902k031J4060J723L518Q489J1014j9780j6813O951J8206
17582E7392p854Q3L441r405J0187J4074N174J014q038m246k304j7663p638M540
17568C8757O417K32K5430J8973K3387N4983O5412J5824l1007n8557l8382n837
17556A15632N631l319j8141m611K6981P2185M5377J626l7520n1319l7922r999
17544A04601k988O260K7857N8678O0024J9209n5609n8393k6005j8565l288K963
$$ plain form
17635 27607 7751 -5317 -8632 -14591 -17978 -24897 -22662 -17117 14042 48038 59244 63676 65443
17622 65443 53037 50335 47462 22213 13650 35939 36225 51541 40143 24945 16138 9188 6896
17609 6896 -5246 8661 8745 11193 12331 9249 15688 31486 48282 43800 44465 47888 56273 57567
17595 57567 50094 43957 32055 30024 44084 45807 49325 57814 68828 49048 32235 39186 57392
17582 57392 49538 49621 53062 43657 53844 67918 73092 74106 66068 61822 59518 41855 34217 38757
17568 38757 45174 45406 70836 89809 113196 168179 233591 249415 218408 159851 121469 115632
17556 115632 121263 117944 99803 95192 122173 194358 239735 241361 203841 152522 114600 104601
17544 104601 101613 107873 135730 194408 254432 273641 218032 159639 133634 115069 111781 114744
17532A14744o97J7492L9037M8179N1521N434n8922n7040k8948k9257k6968k546
17520G2029n977m502J0002j4887K399J8988J3652R532K0942M992k6218j4645Q15
17507H7122j5490p78J7493K137j2878N420M835N591q218j8682K0783J3948k916
17494I8367j5147j5920L382j3017r138k152J0440J2537L343R122J2550j9083k736
17481G2548j344o089P225M869L16Q853P017R802J497J043J7708M823l540r805
17467A14923k6578j3188N942K0007J6059R425m071K807K0223K4250O037N487L0963
17454B12286K5101K8892L7031K1551K5277o925q759q349j5967j6629k2486J6013
17442B87036O2272M346o0970o8830m1805k4527k3028q478k219j920j2930L904
$$ plain form
17532 114744 114047 131539 170576 218755 270276 275710 216788 159748 130800 101543 74575 72029
17520 72029 66052 61550 71552 56665 59064 78052 91704 101236 122178 127170 100952 86307 87122
17507 87122 71632 70854 88347 90484 77606 83026 87861 93452 85234 66552 87335 101283 98367
17494 98367 83220 67300 70682 57665 48527 46375 56815 69352 72695 81817 94367 75284 72548
17481 72548 71204 65115 72340 77209 77525 86378 93395 103197 104694 105737 123445 128268 124728 114923
17467 114923 88345 75157 81099 101106 117165 126590 122519 125326 145549 169799 175836 181323 212286
17454 212286 237387 266279 303310 324861 350138 343213 334454 326105 310138 293509 271023 287036
17442 287036 349308 353654 292684 223854 182049 157522 134494 126016 123797 121877 108947 112851
17430A12851L251L882j6366j7407l420M889N671J4941J3837P449j3822l046R463
17417A22173r099k628J6333J1744n452j2500j0999K031j127k458j3003l924N736
17404I6827L808p531m077J511j3755R580Q818J1132l323o713j1995K0885R741
17391A14908j020r910j1987n087P397l402m634P931k089j1305k766O088L903M715
17377I2742j028N990J8356Q979j8541k2981R684P704O60M936r469J0894O84j6404
17363I2206O480J7372j7297k4076q26J9077R62k826J778l761J4621J7078M627
17350A25415r329j5638M082L174m42n067l230j5057j4289N949J0252q802j8357
17337E8661P841R916J1093j99P156J6180M646n72O314L328l360M793J0774o480
$$ plain form
17430 112851 116102 119984 103618 86211 82791 87680 93351 108292 122129 129578 115756 112710 122173
17417 122173 113074 110446 126779 138523 133071 120571 109572 111603 110476 108018 95015 91091 96827
17404 96827 100635 93104 89027 90538 76783 86363 95181 106313 102990 96277 84282 105167 114908
17391 114908 113888 103978 91991 86904 94301 90899 86265 94196 92107 80802 78036 84124 88027 92742
17377 92742 91714 97704 116060 125039 106498 83517 93201 100905 101565 106501 97032 107926 108610 92206
17363 92206 98686 116058 98761 74685 73859 92936 93898 91072 92850 89089 103710 120788 125415
17350 125415 116086 100448 104530 107704 107262 102195 98965 83908 69619 75568 85820 77018 58661
17337 58661 66502 76418 87511 87312 94468 110648 115294 114722 121036 124364 121004 125797 136571 130091
17323A30091j3816j7463L896l348r865o435n105J0764J1277J0518J8340J0341
17311A39195p779k1086n132k484n650R470R92m480j2383o835J8612K3835p903
17298A18372J4381J7167J6166J6821J1293J8269M293j2514k0841j4358p43p320
17286A60986k0959k6826r597q645k5488j5814K3870L2992K9766Q237M035J8309
17274A70866m856K324M719K315J3206p90j383P62K6757J1657R020J0549J5908
17261B61054M345J6106K856o614R368J6645J7846J6652J9854J5899j4404q384
17249C51223J3897J6605J4717L0079M3635P8722J24333J58039J56410J13711j7775
17238A083596j27151j48913j34139q4012n2188k9424k0733k658j7891k088J8087
$$ plain form
17323 130091 116275 98812 102708 99360 89495 83060 77955 88719 99996 110514 128854 139195
17311 139195 131416 110330 105198 102714 97064 106534 107526 103046 90663 83828 102440 126275 118372
17298 118372 132753 149920 166086 182907 194200 212469 216762 204248 183407 169049 168306 160986
17286 160986 140027 113201 103604 94959 69471 53657 77527 110519 140285 148522 152557 170866
17274 170866 166010 168334 173053 175368 188574 187784 186401 187163 213920 225577 234597 245146 261054
17261 261054 265399 281505 284361 277747 287115 303760 321606 338258 358112 374011 359607 351223
17249 351223 365120 381725 396442 426521 470156 548878 673211 831250 987660 1101371 1083596
17238 1083596 956445 807532 673393 589381 537193 507769 487036 484378 466487 464399 482486
17227D82486J8652j677o26K5196J4555J3029K2713K7815L1108K4579L4885M9177
17215G41892Q8903P7312P1717O1093M3435L3398O4752Q5825P9185K8814K090J9957
17203A398373O8503J09781J28329J03401J18548J32457J99319K42173L14054M01472
17193C216410N09526O33255P00386Q07231R96494J425617K133971L375530N667715
17184A9466135R097948J0560076N634113j549312l789885Q18839L430533j397158
17176D2271289q536132j0700360p689836m241633k052840q73923j98783J77130
17168H154912N30590R78703J600068K553801M209090P307125J1753466J3094839
17160E0182594O147204k867748m880145J145604L658583k962411j1544525j3508135
$$ plain form
17227 482486 501138 499461 498835 524031 538586 551615 574328 602143 633251 657830 692715 741892
17215 741892 830795 908107 979824 1040917 1084352 1117750 1182502 1268327 1347512 1376326 1378416 1398373
17203 1398373 1466876 1576657 1704986 1808387 1926935 2059392 2258711 2500884 2814938 3216410
17193 3216410 3725936 4359191 5059577 5866808 6863302 8288919 10422890 13798420 19466135
17184 19466135 28564083 39124159 44758272 43208960 39419075 40237914 43668447 42271289
17176 42271289 33735157 23034797 15344961 11103328 9050488 8176565 7977782 8154912
17168 8154912 8685502 9664205 11264273 13818074 18027164 25334289 37087755 50182594
17160 50182594 56329798 53462050 48581905 49727509 53386092 50423681 38879156 25371021
17152B5371021r668342n567171l034714j732300j076227p69131n60839l60471
17144B601826k46931k38791k70138k50096j87736r6069j5761L8398R427m4251
17134A299878q5746n4037l9699q5928j33583j34559o9148j220Q502k5964j6546
17123F61950K4951M2089j7299r4709j26601p3781j2329L2782N8204M0236J2355
17112E47848j9977q495r712n2281q7660r4857o0751j8264j0191L291J9348l838
17100B04461j04q378j6019l3552j7632j7798j0605n564K6475K6520K2933k929
17088A67808j2411m858L722j48P714P63Q689Q964J6234J9057J4898J2543m417
17075B38558k5109J1113J2659K447J1012K3319J452J3234P695L0233K4813L0077
$$ plain form
17152 25371021 15702679 10135508 7100794 5368494 4292267 3523136 2962297 2601826
17144 2601826 2354895 2116104 1845966 1595870 1408134 1312065 1296304 1334702 1344129 1299878
17134 1299878 1214132 1160095 1120396 1034468 900885 766326 697178 695958 704460 678496 661950
17123 661950 686901 728990 711691 616982 490381 416600 404271 437053 495257 535493 547848
17112 547848 527871 519376 509664 457383 369723 274866 214115 195851 185660 188951 208299 204461
17100 204461 204357 195979 179960 146408 128776 110978 100373 94809 121284 147804 170737 167808
17088 167808 155397 150539 154261 154113 161827 162590 171279 180243 196477 215534 230432 242975 238558
17075 238558 213449 224562 237221 239668 250680 273999 275451 288685 296380 326613 351426 381503
17063C81503K3343L2837L1565o24O29L2338L3928K7633k958j3947k3732l8693
17051D83822j5090m004L582j0592j0174Q733J6379L7539O2169N7094O0255P4981
17039G64694K9442J6788M3793J08869J37392Q3406j9352n3354n4237l8765K0029
17028A038705Q7939J34436J21925L0767M1847J28258J42321O5583P0506J19341
17018A981628J85114K67338L75598L99114L76274L77749M88626O37720Q14877
17009E904038J138919J676733K650327M493050Q203697J3715587J4391211j137476
17001E1036086j3953647j2763225p320989l295729j022358N66311K248094M785298
16993B0279841R155572J4083966J0260886p147833j4494219j0993654n616573
$$ plain form
17063 381503 404846 437683 469248 468624 469253 501591 535519 563152 560194 546247 522515 483822
17051 483822 468732 464728 468310 457718 447544 456277 472656 510195 572364 629458 689713 764694
17039 764694 794136 810924 854717 963586 1100978 1184384 1165032 1111678 1057441 1018676 1038705
17028 1038705 1126644 1261080 1383005 1413772 1455619 1583877 1726198 1791781 1862287 1981628
17018 1981628 2166742 2434080 2809678 3208792 3585066 3962815 4451441 5089161 5904038
17009 5904038 7042957 8719690 11370017 15863067 24066764 37782351 52173562 51036086
17001 51036086 37082439 24319214 16998225 13702496 12680138 13246449 15494543 20279841
16993 20279841 29435413 43519379 53780265 46632432 32138213 21144559 15527986
16986A5527986k097960K09981K502531N952459J0483884J0389368k395148j1361029
16978B9212072r963157n763597k732934r60120K98831J658492L752820P455748
16970B2958155J1396359P369284p118015j2124079r170023n171689k766410j518956
16962C854626q97782n51754l30214j71452l1344J1987r8067k26658k84545k62678
16952A012119j89833j21433n8863j5371M0522J17421J58579M4401j48161j93892
16942F45489j45839r7838o1998j4815L9040O8412J1978k1193j2594n131o0965
16931C44546p7637k5616k1385j1997J9520L3937K1220k6620n9996n5828j5978
16920A24166m473j7049j2747J3680L7796M3335j1946l7101l3487k5293k1724j3127
$$ plain form
16986 15527986 13430026 13640007 16142538 22094997 32578881 42968249 40573101 29212072
16978 29212072 19248915 13485318 10752384 9792264 10091095 11749587 15502407 22958155
16970 22958155 34354514 41723798 34605783 22481704 13311681 8139992 5373582 3854626
16962 3854626 2956844 2405090 2074876 1903424 1872080 1884067 1786000 1559342 1274797 1012119
16952 1012119 822286 700853 641990 626619 667141 784562 943141 987542 839381 645489
16942 645489 499650 401812 339814 324999 364039 432451 444429 423236 410642 405511 344546
16931 344546 266909 241293 219908 207911 227431 261368 282588 255968 195972 140144 124166
16920 124166 119693 102644 89897 103577 141373 184708 172762 135661 102174 76881 55157 42030
16908D2030M283J0095K5773K0142K1528J5742k1837l7786k2660k0952j8743l3266
16896a5651P482N318q534L604j602K924Q399J6449Q876p842j0251R948j576j3275
16882D269R263q309R090L3222K1525j594j0120k0103k2775l6570q415J5861O807
16869g849J1006N986P568K4938L739J648M966r143l1583k2779L553K88Q238J0494
16855A1070k71M82K4800j5414m5902j0683J6197L2964M0850K4281J3064j6386
16843G5052k4735j1493J398k1715l6540q064k349J4804J1880k488M56M310N085
16830E601l402p627j3049M854K1101J4738n056p84p250p837j3529J368p942M480
16816a4334k682m385J817L447j5409O682L19j927l427J0252J792N770N75q78O111
$$ plain form
16908 42030 46313 56408 82181 102323 123851 139593 117756 79970 57310 36358 17615 -15651
16896 -15651 -8169 -2851 -11385 -7781 -9383 -6459 1940 18389 27265 19423 9172 19120 17544 4269
16882 4269 13532 5223 14313 47535 69060 67466 57346 37243 14468 -22102 -30517 -14656 -7849
16869 -7849 3157 9143 16711 41649 45388 47036 52002 42859 11276 -11503 -7950 -7662 576 11070
16855 11070 10799 11281 36081 20667 -25235 -35918 -19721 13243 54093 78374 91438 75052
16843 75052 50317 38824 40222 18507 -18033 -26097 -28446 -13642 -1762 -4250 -3794 516 5601
16830 5601 2199 -5428 -18477 -13623 7478 22216 17160 16376 9126 1289 -12240 -10872 -18814 -14334
16816 -14334 -17016 -21401 -19584 -16137 -31546 -24864 -24545 -26472 -29899 -19647 -17855 -12085 -11510 -12388 -6277
16801f277k1680j7874P971n009j1033k046O392J2517O250J6829K029k2885j4410
16788d9226Q961J2069J0880K894p172j6942o713l012l05k328j915O742Q237m086
16774d1916J035J5750L343l648J8107K465j7145j1354L697r86q068L457n961m97
16760d1721J1639o635P6r27Q985m970o544O65n492o25J731n80L060j0229J411
16745e0156L911J2062q5R449j523j4282J2189J1127j3155j5342o977N31r39l04
16731e3494J2078Q981k570J876m775n624K930o022J2315P402j9551j369P617l124
16717d3330K706M136O619r319j1867j3600L778j540M675L025l008O469J0643M786
16703c5827k852J7245j519q399p201M771l78M577r968j4779L271K6871Jo909o722
$$ plain form
16801 -6277 -27957 -45831 -37860 -42869 -53902 -55948 -49556 -37039 -30789 -13960 -11931 -34816 -49226
16788 -49226 -40265 -28196 -17316 -14422 -21594 -38536 -45249 -48261 -48566 -50894 -52809 -46067 -37830 -41916
16774 -41916 -40881 -25131 -21788 -25436 -7329 -4864 -22009 -33363 -29666 -30652 -38720 -35263 -41224 -41721
16760 -41721 -30082 -36717 -36641 -37568 -28583 -33553 -40097 -39432 -44924 -45549 -43818 -44398 -41338 -51567 -50156
16745 -50156 -46245 -34183 -34268 -24819 -26342 -40624 -28435 -17308 -30463 -45805 -52782 -52251 -53190 -53494
16731 -53494 -41416 -32435 -35005 -33129 -37904 -43528 -40598 -46620 -34305 -26903 -46454 -47823 -40206 -43330
16717 -43330 -40624 -36488 -29869 -39188 -51055 -64655 -60877 -62417 -57742 -54717 -57725 -51256 -40613 -35827
16703 -35827 -38679 -21434 -22953 -31352 -38553 -33782 -34160 -29583 -39551 -54330 -51059 -24188 -24187 -31096 -37818
16688c7818J4056P527P029k425o329P750N235o587J0883R994N661j0429o083j9970
16674b1506m387M486J0617M360N934j606R58L718J3501l009n348p092J0494M7425
16660E8545K7231j3666l3129j1376p903n52j8268j7478N351k762j3377K2863P701
16647C180K510p630J8323J7201l642j6135j0557J0617K9473J8343j5014k1488
16635B5181k4236r192J701R099J6060K540j3436r48m687J7792K5710L1143O8126
16622A44853O3782N8642K4709j8220j5535m346R635k9489o0358o6312k4795k5866
16610E6700j7858l750p750Q605J330K922R117K0089K6032L6449O1015L0014K596
16597B25511j1620q454k213J2195l1948n5670n9602m1276k0226j2048o216p708
$$ plain form
16688 -37818 -23762 -16235 -9206 -11631 -17960 -10210 -4975 -11562 -679 9315 14976 4547 -1536 -21506
16674 -21506 -25893 -21407 -10790 -6430 -496 -2102 -1144 2574 16075 13066 7718 626 11120 58545
16660 58545 85776 72110 38981 27605 19702 19150 882 -16596 -11245 -14007 -27384 -4521 3180
16647 3180 5690 -1940 16383 33584 29942 13807 3250 13867 43340 61683 46669 25181
16635 25181 945 -8247 -6546 2553 18613 21153 7717 6769 2082 19874 45584 76727 144853
16622 144853 208635 267277 291986 273766 258231 253885 263520 234031 173673 107361 82566 56700
16610 56700 38842 35092 27342 35947 37277 40199 49316 69405 95437 131886 192901 222915 225511
16597 225511 213891 205437 203224 215419 183471 127801 68199 26923 6697 -5351 -11567 -19275
16585a9275n480k938O213Q305p707j2902q601K984q267J9220J8368K503n019j1610
16571b4206k2425L142L749p237J3179J6030Q503r776j091J191p018j521R870k455
16557b0065l057K431j845L717j317o571m497J3683J2825o689n695n570p340k0315
16543e0305N071O702j5438N87j778K0431J4395L360j1244N521N836j323j1361
16530b9546j5748Q252R650p545M726Q534M689O357K9776Q930j3605j3080O309
16517G699M339j4423j9612k500K191R767r485q372J4319K51o844P285p998M42
16503b2941J0325O106n483r040o350j1773j5277K824J2242N735J0653P835r341
16490b4485j1496J638M521J4227J664M287N941j3415L31K4l637o057Q455M758
$$ plain form
16585 -19275 -24755 -27693 -21480 -13175 -20882 -33784 -42385 -39401 -47668 -28448 -10080 -7577 -12596 -24206
16571 -24206 -46631 -43489 -39740 -46977 -33798 -17768 -9265 -19041 -20132 -18941 -25959 -27480 -17610 -20065
16557 -20065 -23122 -20691 -22536 -18819 -20136 -26707 -31204 -17521 -4696 -11385 -17080 -22650 -29990 -50305
16543 -50305 -45234 -38532 -53970 -53383 -55161 -34730 -20335 -16975 -28219 -22698 -16862 -18185 -29546
16530 -29546 -45294 -37042 -27392 -34937 -30211 -21677 -16988 -10631 19145 28075 14470 1390 7699
16517 7699 12038 -2385 -21997 -24497 -22306 -12539 -22024 -30396 -16077 -15826 -22670 -15385 -23383 -22941
16503 -22941 -12616 -6510 -11993 -21033 -27383 -39156 -54433 -51609 -39367 -33632 -22979 -15144 -24485
16490 -24485 -35981 -34343 -29822 -15595 -13931 -9644 -3703 -17118 -16787 -16763 -20400 -26457 -18002 -13244
16476a3244j829Q135m312J451J2202j641r630r934j6031j0009J3028o30r729J262
16462d0911K1094J7096j7111j3295R984M868J8971O583j1112O606M962j1035N697
16449B397J1512M190j2018j0970J0923J3937L3697L2344L6771M3712M5618k2469
16437A89644o0837m8169k1716k0870K692r260k588K8777M3249O6016N1725k2128
16425A96535o1861m1986k2108j288J2504K8006K4766L0651L5173j1425n1822l9103
16413I8042k7430r478k2021r787K5136K5472M8248M3655K0147m0646n2484m7749
16401E1105m0959k692M733j6860m251J7780M472N350n028k4296r830l355M872
16388a8959K359J0415J206r137M711J0735n262l991n047o181n829j730O038J628
$$ plain form
16476 -13244 -15073 -6938 -11250 -9799 2403 762 -8868 -18802 -34833 -44842 -31814 -32444 -42173 -40911
16462 -40911 -19817 -2721 -19832 -33127 -23143 -18275 696 7279 -3833 2773 7735 -3300 2397
16449 2397 13909 18099 6081 -4889 6034 19971 53668 86012 122783 166495 212113 189644
16437 189644 128807 80638 58922 38052 40744 31484 28896 57673 100922 166938 218663 196535
16425 196535 134674 92688 70580 69292 81796 109802 134568 165219 200392 188967 137145 98042
16413 98042 70612 61134 39113 29326 54462 79934 128182 171837 191984 151338 98854 51105
16401 51105 10146 7454 12187 -4673 -8924 8856 13328 18678 13650 -10646 -20476 -23831 -18959
16388 -18959 -16600 -6185 -4979 -14116 -9405 1330 -3932 -7923 -12970 -19151 -24980 -26710 -20672 -19044
16374a9044r408L71J3843J2227j2238o547M594j8401j1875Q129J3223J1748r094
16361b2472N466O346p537j8995L95O100j912J851k539o091M20j4307k376J0706
16347d4945M192j2876J1905J6361L547O251L152l253J558o849J0530J481j0408
16334a9354n974J3546j421j3977p531Q797m445l711J2925j315P6L01J1339m032
16320a4776j4129j1682k100Q389K1611o480j5057K753J523r447n886M799K309
16307c8173N701Q607J2284m880q477j037k0849L538J2601O545Q564j317P086M15
16293i392K579j990M805M508J79j5846o200q821o852J3267n144j883L607O645
16279b0538J5197j632j224j3529J798n240j4388P013J1767J0125J0733j1638l722
$$ plain form
16374 -19044 -28452 -28081 -14238 -2011 -14249 -20796 -16202 -34603 -46478 -38349 -25126 -13378 -22472
16361 -22472 -17006 -10660 -18197 -37192 -36797 -30697 -32609 -30758 -33297 -39388 -38968 -53275 -55651 -44945
16347 -44945 -40753 -53629 -41724 -25363 -21816 -15565 -12413 -15666 -14108 -20957 -10427 -8946 -19354
16334 -19354 -25328 -11782 -13203 -27180 -34711 -25914 -30359 -34070 -21145 -22460 -22384 -22083 -10744 -14776
16320 -14776 -28905 -40587 -42687 -34298 -12687 -19167 -34224 -31471 -29948 -39395 -45281 -40482 -38173
16307 -38173 -32472 -23865 -11581 -16461 -24938 -25975 -46824 -43286 -30685 -24140 -15576 -16893 -9807 -9392
16293 -9392 -6813 -8803 -3998 510 689 -15157 -21357 -30178 -37030 -23763 -28907 -30790 -27183 -20538
16279 -20538 -5341 -6973 -8197 -21726 -19928 -25168 -39556 -32543 -20776 -10651 82 -11556 -15278
16266a5278J7866j7501m863L899M147M612l728r202P260j2268k914J989j414J5005
16252a2390q557k585J8923O698j0751O414K902P302Q228j4592j7854q049o627
16239c0938q764M055K134j79J5171j322j7361Q994L606N679J0755r354M61n722
16225b2785q357j820k948K972o72l508J1105m193o903j876J8557o506N594j3957
16211c5297j0724M677R210K1966J4401K964L065l299j6676j1759l964l746L430
16198b5752j3963r336K0682J5104O521p78j7871j1403K92L254j468J7842O379
16185a0497l967l016n076j194m866n809R133J2603n829j1898M70O51r502k79J8200
16170b0876J406k565J0607J926q114j980j329j783l931o68J7261O686j2853R390
$$ plain form
16266 -15278 2588 -14913 -19776 -15877 -11730 -7118 -10846 -20048 -12788 -25056 -27970 -25981 -27395 -12390
16252 -12390 -20947 -23532 -4609 2089 -8662 -2248 654 7956 16184 1592 -16262 -24311 -30938
16239 -30938 -39702 -35647 -33513 -33692 -18521 -19843 -37204 -28210 -24604 -18925 -8170 -17524 -17063 -22785
16225 -22785 -31142 -32962 -35910 -32938 -33610 -37118 -26013 -30206 -37109 -38985 -20428 -26934 -21340 -35297
16211 -35297 -46021 -41344 -32134 -10168 4233 7197 10262 6963 -9713 -21472 -25436 -29182 -25752
16198 -25752 -39715 -49051 -28369 -13265 -6744 -7522 -25393 -36796 -36504 -33250 -34718 -16876 -10497
16185 -10497 -14464 -17480 -22556 -23750 -28616 -34425 -25292 -12689 -18518 -30416 -29946 -29295 -38797 -39076 -20876
16170 -20876 -19470 -22035 -11428 -9502 -17616 -19596 -20925 -22708 -26639 -27307 -10046 -3360 -16213 -6823
16156f823j5542o497K932n084n840q603j200N846J5355J7374r342q013l027N107
16142b3357J1652Q633P250r557Q458J171q528q203j1102l377J2934J3493n007
16129e540j0091j295J453l762K873K206J0921k64j590M871M147j696o054j1417
16115a5238k0001M666P816R55j29Q447j082n911j5451N690J614q81Q405N819K481
16100a2800O231r35P27r697j5834J229J5571N652j728K101j0528j2494M560J3046
16086a4899J639K344L850q335N0J7892j689j0639j1269N104k924j5994J0614P151
16072a7105j5121J337J6888l249R79r73J0081J2888m967k4650j3352J6248m594
16059b5590K209J653O45J1398R646J321j3025o106Q315k515m323m448J0117j350
$$ plain form
16156 -6823 -22365 -28862 -25930 -31014 -36854 -45457 -46657 -40811 -25456 -8082 -17424 -25437 -28464 -23357
16142 -23357 -11705 -3072 4178 -5379 3079 4250 -4278 -12481 -23583 -26960 -14026 -533 -5540
16129 -5540 -15631 -16926 -15473 -19235 -16362 -14156 -3235 -3499 -5089 -218 3929 2233 -3821 -15238
16115 -15238 -35239 -30573 -22757 -21802 -21931 -13484 -14566 -20477 -35928 -30238 -28624 -29505 -21100 -15281 -12800
16100 -12800 -6569 -7504 -6777 -16474 -32308 -31079 -15508 -9856 -11584 -9483 -20011 -32505 -27945 -14899
16086 -14899 -13260 -10916 -7066 -15401 -15351 2541 852 -9787 -21056 -15952 -18876 -34870 -24256 -17105
16072 -17105 -32226 -30889 -14001 -17250 -16271 -17244 -7163 5725 758 -23892 -37244 -20996 -25590
16059 -25590 -23381 -21728 -21083 -9685 -39 1282 -11743 -17849 -9534 -12049 -16372 -20820 -10703 -12053
16045a2053J78j0314J058j0493n557Q447P328J792r86n428R488k575M009n812
16031b0918P890o884k74p411p308P383L645O725j206O366J8446P62L320n382j0845
16016e691j237l761n58k820J390L44J130M921p432K612L821K160L749j0846r614
16001b1832Q311k847O917K473n473m219p991J1436K0334N489K924L268p117k3228
15987a1555r127J4550q983j5724q840n390N567J8449J4710k351L608j5939J506
15974a9519p886J3045J265m002P4R78J5208Q722k931p953j3903j154m840L145
15960a9751o526P139R783J3530k338j1462L804O549j2514j4815J0549K913J8620
15947E481m209j6745J56J1987J2166j560p312m19j1787r367j0498J0844J0026
$$ plain form
16045 -12053 -11875 -22189 -21131 -31624 -37181 -28734 -21406 -19614 -20600 -26028 -16540 -19115 -15106 -20918
16031 -20918 -13028 -19912 -20186 -27597 -34905 -27522 -23877 -17152 -18358 -11992 6454 7216 10536 5154 -5691
16016 -5691 -6928 -10689 -11247 -14067 -12677 -12333 -11203 -6282 -13714 -11102 -7281 -5121 -1372 -12218 -21832
16001 -21832 -13521 -16368 -9451 -6978 -12451 -16670 -24661 -13225 7109 12598 15522 18790 11673 -11555
15987 -11555 -20682 -6132 -15115 -30839 -39679 -45069 -39502 -21053 -6343 -8694 -5086 -21025 -19519
15974 -19519 -27405 -14360 -13095 -17097 -17023 -16045 -837 7885 4954 -2999 -16902 -18056 -22896 -19751
15960 -19751 -26277 -19138 -9355 4175 1837 -9625 -5821 728 -11786 -26601 -16052 -13139 5481
15947 5481 1272 -15473 -15317 -3330 8836 7276 -36 -455 -12242 -21609 -32107 -21263 -11237
15934a1237L264j0908N344M557M039L483L392O706l854k815K649k700J8570j4651
15920E839j6118l269N944M566q608L03K398J1479O653k865p148k3175l560N337
15906b2224l298l603J1298P73j4186J5062L23j8065p746R092R430j3185N910m713
15892c5132L433Q447Q440J777N346l118QL297q591m871K659n747k0813L249J1749
15877b9867o63Q93J9208O201k707M377j2438J0246J2886j213K447j5790j1243
15864a7663j751N551J635p89J437L770J1598r678j0033j641o185J4402J4718L277
15850H648M732j2337m693J576r663M476R588j3447l726n828q010J1600P124r48
15836a0908K68j5206j8364M559O600N232K327l145O873J4973J777j104o53L824
$$ plain form
15934 -11237 -7973 -18881 -13537 -8980 -4941 -1458 1934 8640 4786 1971 4620 1920 20490 5839
15920 5839 -10279 -13548 -7604 -3038 -11646 -11343 -8945 2534 9187 6322 -826 -24001 -27561 -22224
15906 -22224 -25522 -29125 -17827 -17054 -31240 -16178 -15855 -33920 -41666 -32574 -23144 -36329 -30419 -35132
15892 -35132 -31699 -23252 -14812 -13035 -7689 -10807 -10799 -7502 -16093 -20964 -18305 -24052 -44865 -41616 -29867
15877 -29867 -30530 -29637 -10429 -4228 -6935 -2558 -14996 -4750 8136 6923 9370 -6420 -17663
15864 -17663 -19414 -13863 -12228 -13017 -11580 -7810 3788 -5890 -15923 -17564 -23749 -9347 5371 8648
15850 8648 13380 1043 -3650 -2074 -11737 -7261 2327 -11120 -14846 -20674 -28684 -17084 -9960 -10908
15836 -10908 -10640 -25846 -44210 -39651 -33051 -27819 -25492 -28637 -21764 -6791 -5014 -6118 -6771 -2947
15822b947M72J432q907J668M974j5995K848Q037r507l729j4910J781M677L14L268
15807b6524p278J6737P547j3855O614J3299j1057p952J1373P750k314L559j473
15794c574j0070J8304o78j316m07q709O063m225m937o571Q17m665Q770J1673j1309
15779a0834j573Q566m882j5028j3994N332J3676r77J0061P110j2996M561Q549
15766b429j3052k2054r752J5919J4219O007M768L489k811N776K514N738j5482
15753g150P442J2948m927p46K0183L123j3315j644l55l974K57r849k3805m68O247
15738a6033J6217K447j8306n147M010L294J8896L900n901j0726P336O361J4295
15725B0643K443j5660j8055k0973L65Q537L032P898J6410J179o099M620j1917
$$ plain form
15822 -2947 -2475 -1043 -9950 -8282 -3308 -19303 -16455 -8418 -17925 -21654 -36564 -34783 -30106 -29792 -26524
15807 -26524 -33802 -17065 -9518 -23373 -16759 -3460 -14517 -22469 -11096 -3346 -5660 -2101 -3574
15794 -3574 -13644 4660 3982 2666 2259 -6450 -387 -4612 -9549 -16120 -15303 -19968 -11198 475 -10834
15779 -10834 -12407 -3841 -8723 -23751 -37745 -32413 -18737 -19714 -9653 -2543 -15539 -10978 -2429
15766 -2429 -15481 -37535 -47287 -31368 -17149 -11142 -6374 -2885 -5696 80 2594 8332 -7150
15753 -7150 292 13240 8313 7567 27750 30873 17558 15914 15559 11585 11842 1993 -21812 -22280 -16033
15738 -16033 184 2631 -15675 -20822 -16812 -13518 5378 9278 3377 -7349 -13 6348 20643
15725 20643 23086 7426 -10629 -31602 -31237 -22700 -19668 -11770 4640 5819 -280 4340 -7577
15712g577L402n157j2766N173R104J611M472J3545k413m058j4608m377p416j4096
15698c5161M982M483M626P150N632J0441l274j1532N635L324J912k847j379j2527
15684a8535j1337O259o94j1638m68J2535R309N106J383l469M151M650O91J820
15670b37J847j3910J1572J2801K978j0017k848j719Q792n294j2135j9611j487
15657b9268J3736O061J2895J0211P414m301k3959j3446j1145M804K0386J8625
15645A2013j1856k6896N061J7233P789l145J185m913K358j2594l524K2623M967
15632A0301o030r696Q938n784j480L092J862k795O446k434r245J1881N025j50
15618I931M560q937M726L726j3318k367L894r741O686l898k246N771j0132N073
$$ plain form
15712 -7577 -4175 -9332 -22098 -16925 -7821 -6210 -1738 11807 9394 5336 -9272 -13649 -21065 -35161
15698 -35161 -30179 -25696 -21070 -13920 -8288 2153 -1121 -12653 -7018 -3694 -1782 -4629 -6008 -18535
15684 -18535 -29872 -23613 -24307 -35945 -36413 -23878 -14569 -9463 -8080 -11549 -7398 -2748 -2057 -237
15670 -237 1610 -12300 -728 12073 15051 5034 2186 467 9259 3965 -8170 -27781 -29268
15657 -29268 -15532 -9471 3424 13635 21049 16748 -7211 -20657 -31802 -26998 -6612 12013
15645 12013 157 -26739 -21678 -4445 3344 199 1384 -3529 -1171 -13765 -17289 5334 10301
15632 10301 4271 -5425 3513 -2271 -3751 -659 1203 -1592 4854 2420 -6825 5056 10081 9931
15618 9931 14491 5554 10280 14006 688 -1679 2215 -7526 -840 -4738 -6984 -1213 -11345 -6272
15604f272O618O247m478k4953K449O710J393J5750k954q297J270l329m990L074
15590a1762m393K401K247k727p20R383O027R991J7512K301J329j2147j2734n631
15576A077q920o787n94k243l734o793J3812p844j9604n041o001o508J0815J4727
15562c3638n61R958K10j7012J604K3815L026n095n687R672P996o219j2857j390
15548b6178J6728P485j267o02j96j1076J1468k482k2017K865J3336N876j0301
15535a6361O728R085m152J357J974M705k309m554J2984J6744k068j8998j7455
15522a2320o364J2141K904J317J4334j061j263J4335L641M339j5351j8851M282
15509B083L027j4244r739K963M43l534J0579L806l549j2039p008O372K753r45
$$ plain form
15604 -6272 346 6593 2115 -22838 -20389 -13679 -12286 3464 510 -7787 -6517 -9846 -14836 -11762
15590 -11762 -16155 -13754 -11507 -14234 -14954 -5571 456 10447 27959 30260 31589 19442 6708 1077
15576 1077 -7843 -14630 -15224 -17467 -21201 -27994 -14182 -22026 -41630 -46671 -52672 -59180 -48365 -33638
15562 -33638 -34199 -24241 -24031 -41043 -39439 -15624 -12598 -17693 -23380 -13708 -5712 -11931 -24788 -26178
15548 -26178 -9450 -1965 -3232 -3834 -4030 -15106 -3638 -6120 -28137 -25272 -11936 -6060 -16361
15535 -16361 -9633 -548 -4700 -3343 -1369 3336 1027 -3527 9457 26201 24133 5135 -12320
15522 -12320 -18684 -6543 -3639 -2322 12012 10951 9688 24023 27664 32003 16652 -2199 2083
15509 2083 5110 -9134 -18873 -15910 -15467 -19001 -8422 -4616 -8165 -20204 -27212 -20840 -18087 -19032
15495a9032k595k106L727J2155J4675M124j4L492q84k796k602m246J173J4415
15481A9486l43j1930j9439l554P192J1067O562J6854l792M796r589m063j5670
15468b423j7379K154l680l589k192J0524J9616M804J0096l178L591n617J824p132
15454G419r170L356J4463r079j6543j6984m635N67Q569J5981J6570j1749j8589
15441a9824J393J626J2190J0182k0582j5793r420J7227L469n66O731j078J2425
15428b020Q76k953n491K417q971j218J4198M478r935j699J3097L823l757n63q179
15413e897k87M238J309L796k261P915L447j0555o261p577Q575Q156o523j5660
15399a7585p881m584K026J0518L539J0115R049P100k664o734n041k389Q35n307
$$ plain form
15495 -19032 -21627 -23733 -20006 -7851 6824 10948 10934 14426 13542 10746 8144 3898 5071 19486
15481 19486 19143 7213 -12226 -15780 -8588 2479 9041 25895 22103 26899 17310 13247 -2423
15468 -2423 -19802 -17648 -21328 -24917 -27109 -16585 3031 7835 17931 14753 18344 12727 14551 7419
15454 7419 -1751 1605 16068 6989 -9554 -26538 -31173 -30606 -22037 -6056 10514 -1235 -19824
15441 -19824 -18431 -16805 -4615 5567 -15015 -30808 -40228 -23001 -19532 -20098 -13367 -14445 -2020
15428 -2020 -1144 -4097 -9588 -7171 -16142 -17360 -3162 1316 -8619 -10318 2779 6602 2845 2282 -5897
15413 -5897 -6184 -1946 -637 3159 898 8813 12260 1705 -4556 -12133 -3558 4598 -1925 -17585
15399 -17585 -25466 -30050 -28024 -17506 -13967 -3852 5197 12297 9633 2899 -2142 -4531 -3696 -9003
15385i003R729R713m343n541O108K78m923j7352j0092J910M268J1044O546K563
15371I05L133J0944J820o240j1561l610Q736J0881k642K644j6699j6869N092n500
15357a8966O014J3033m861j2741J2776J0967O163P626j5188j1472K781j1206j1442
15344b6516J1437K012j2042P159l04n947N465O227k090O871J4503N200N594R858
15330B7427o347j1323J189j441o830M793k321j1041p909m570m029N138J896l724
15316a9092L382J101n432m088R04N264J468J279O801k43P044N135L052n75J6113
15301B2113O256m990k305P662K0492j5550k7748j3810j1846p49O035J4171Q479
15288H210m322r187O620j0925r739K676J139m037K060J7552J9100J3087J747m739
$$ plain form
15385 -9003 726 10439 6096 555 6663 6941 2018 -15334 -25426 -23516 -19248 -8204 -1658 905
15371 905 4038 14982 16802 10562 -999 -4609 4127 15008 12366 15010 -1689 -18558 -13466 -18966
15357 -18966 -12952 81 -4780 -17521 -4745 6222 12385 20011 4823 -6649 -3868 -15074 -26516
15344 -26516 -15079 -13067 -25109 -17950 -18254 -24201 -18736 -12509 -14599 -7728 6775 11975 17569 27427
15330 27427 21080 9757 10946 9505 2675 7468 5147 -5894 -13803 -18373 -22402 -17264 -15368 -19092
15316 -19092 -15710 -14609 -20041 -24129 -23225 -17961 -16493 -15214 -8413 -8656 -1612 3523 6575 6000 22113
15301 22113 28369 23379 21074 28736 49228 33678 5930 -7880 -19726 -20475 -14440 -269 8210
15288 8210 3888 -5299 1321 -9604 -19343 -16667 -15528 -19565 -17505 47 19147 32234 33981 29242
15274B9242q912m857m606r431M195J983q504P704J4110P346P82l713k161p323
15260A5855j1873M45n106n485j5886o941K2887l082O44j1836k05M705J1141k18
15246d955j1672R361k373j2946J2618P159l88K791L672n912Q788N925j225j8553
15232g710n397J3350j8062j0382J3628L6324K0941j0674j6921J189r9j449K625
15219A7363R03Q20l83J0978Q419l120k193k2279n211L544n087Q242l074k697R949
15204A6174l343j463n156m982j3442j628j163m235N163j098o12j605K117O902
15190h371J1928o508o459m579Q937O139n084M166J330J1061l497j4563j330l231
15176a0061p206J6116j067m36j5154j092p703n35J2633J8778l176j8259N504J7999
$$ plain form
15274 29242 20330 15473 10867 1436 5631 7614 -890 6814 20924 28270 29052 25339 23178 15855
15260 15855 3982 4427 -679 -6164 -22050 -28991 -6104 -9186 -8542 -20378 -20583 -15878 -4737 -4955
15246 -4955 -16627 -7266 -9639 -22585 -9967 -2808 -3196 -405 3267 -2645 6143 12068 10843 -7710
15232 -7710 -13107 243 -17819 -28201 -14573 21751 42692 32018 15097 16286 16187 14738 17363
15219 17363 18266 19086 18703 29681 38100 34980 32787 10508 5297 8841 3754 11996 8922 6225 16174
15204 16174 12831 11368 6212 1230 -12212 -13840 -15003 -19238 -14075 -15173 -15785 -17390 -15273 -8371
15190 -8371 3557 -2951 -9410 -13989 -5052 1087 -3997 169 1499 12560 9063 -5500 -6830 -10061
15176 -10061 -17267 -1151 -2218 -2654 -17808 -18900 -26603 -27138 -14505 4273 1097 -17162 -11658 6341
15162F341J3841l354O354N898j1583k3564j4712j1053J5437J9861j0302j558k388
15149a0782j0060N679m838J2135J7340J0718k123k657N579j4814k196o448O895
15136D428J7138j7484j2650R387K800q073M720K2600K337j7248k0445P151p80
15123f119M223k465J1542P66j2729P49J1832O835j078r629j8834P50L895J2257
15109A995J1006K219q335m59j26L21J232j3279q270k825J0127L19j0030R917N094
15094a094r884j890J0624J1813J717P813K454l790j5863m219R110J800M291l460
15080I422o801P201R119n397j887r878j2526j4569Q112L415M21L708J6102q596
15066b154J4265K332j1085q778q01M132J6891l988k953J925N280J082m291m532
$$ plain form
15162 6341 20182 16828 23182 29080 17497 -6067 -20779 -31832 -16395 3466 -6836 -8394 -10782
15149 -10782 -20842 -15163 -20001 -7866 9474 20192 18069 15412 20991 6177 3981 -2467 4428
15136 4428 21566 4082 -8568 819 3619 -4454 266 22866 25203 7955 -12490 -5339 -6119
15123 -6119 -1896 -4361 7181 7947 -4782 -4033 7799 14634 13556 3927 -14907 -14157 -10262 1995
15109 1995 13001 15220 6885 6426 6300 6621 7853 -5426 -13696 -16521 -6394 -6075 -16105 -6188 -1094
15094 -1094 -10978 -12868 -2244 9569 11286 19099 21553 17763 1900 -2319 6791 8591 12882 9422
15080 9422 2621 9822 18941 13544 11657 1779 -10747 -25316 -17204 -13789 -13368 -9660 6442 -2154
15066 -2154 12111 14443 3358 -5420 -6221 -2089 14802 10814 7861 9786 15066 16148 11857 7325
15052G325p866N595R219r410r215K7J0063R73R62r871j0225o350L648J2070O909
15037C854N352R42r860Q854N625j0796q032K020P946n665l977j0801m143L722
15023a4959L462n392J2940j0929l889Q435J1699J4436q606p831q28j987k8L435
15009d2j5007j0274K1333l45j5359j779J9956P184M785L541j95j0877J3263J999
14995A8183l151q911l10j067R923r327r911j5066N73K555Q53J3711m335q659L
14980a4936J5830Q56J606n684R801K684P17j3509j4320J5582K454M02r30l189
14966b636k882j1099R808L455J4092m8M380l859Q36J4131m381m550L818M638N358
14951C1061M877j678K010j2642p303j432r41J1175L040j0413l263o909k0567q978
$$ plain form
15052 7325 -541 5054 14273 4863 -4352 -4325 5738 6711 7673 -2198 -12423 -18773 -15125 -3055 3854
15037 3854 9206 10148 288 9142 14767 3971 -4061 -2041 5905 240 -3737 -14538 -18681 -14959
15023 -14959 -11497 -16889 -3949 -14878 -18767 -10332 1367 15803 7197 -634 -1462 -3449 -3477 -42
15009 -42 -15049 -25323 -3990 -4335 -19694 -21473 -1517 5667 10452 13993 13798 2921 16184 18183
14995 18183 15032 6121 5811 4744 14667 5340 -4571 -19637 -19064 -16509 -15656 -1945 -6280 -14939 -14936
14980 -14936 894 1750 3356 -2328 7473 10157 10874 -2635 -16955 -1373 1081 1483 553 -2636
14966 -2636 -5518 -16617 -6809 -3354 10738 10690 15070 11211 12047 26178 21797 17247 21065 25703 31061
14951 31061 35938 34260 36270 23628 16325 14893 13952 25127 28167 17754 14491 7582 -12985 -21963
14937b1963r7q789L977K3557P557J662j385j0525q881m74L4158J3125m199J0216
14923C7939J82r540k105j0676k0663O425J0253K0020M732j7193j0375j2947K2613
14910A8665k336k3192l437O516M92L836l846M25j99M931n498j103K208r504J6191
14895D149Q637J4200K178j7900k8832l323M118K691R749J3652j142N401J2484
14882B6062n830j7573N305K1086m935j0070Q904O571m197N227q113O128K029j553
14868B9041j2362r216l047J6738J441J260L631o624j9793m698l029J1122j6404
14855a1940J134N560m423j5096l145M617l93J1518J9928K793n802j0575K992J5898
14841A3066J408R721K800J1359p858j4442r095N265j1032m744J63l305m322O047
$$ plain form
14937 -21963 -22060 -30849 -26872 -3315 4242 5904 4519 -6006 -14887 -15361 18797 31922 27723 37939
14923 37939 38121 28581 26476 15800 -4863 1562 11815 31835 36567 19374 8999 -3948 18665
14910 18665 16329 -6863 -10300 -3784 -3292 544 -3302 -2877 -3076 1855 -3643 -4746 -2538 -12042 4149
14895 4149 12786 26986 29164 11264 -17568 -20891 -16773 -14082 -4333 9319 8177 13578 26062
14882 26062 20232 2659 7964 29050 24115 14045 22949 29520 25323 30550 22437 28565 30594 29041
14868 29041 16679 7463 4416 21154 22595 23855 27486 20862 1069 -3629 -6658 4464 -11940
14855 -11940 -10806 -5246 -9669 -24765 -27910 -23293 -23686 -12168 7760 10553 4751 -5824 -2832 13066
14841 13066 14474 24195 26995 38354 30496 16054 6959 12224 1192 -3552 -3389 -6694 -11016 -4969
14827d969J5557M683m773J490J5753p681j1187q27K774J0745l58k681m72J523
14813A9577Q251L371m911k4877k6565J1887J4147j312N828J2838J0504j0047k0879
14800b188o332L632J1706M643r70O837J3000L672Q10r610j1884j2647o547M274
14786a604l228M172J2115J5000Q940j882j5176n778m304R550k828o912l439r60
14772C666K295j6004o066P96R616J1681k903j129M755P46o591P989J0528n691
14758A3688j2606J949P769p36j4133l603L085m947M405K135J974q528m499l581
14744a7628K1947J9751Q997j7835q749k777m660O310J2710j984J468J3787m389
14731B6948o366l380k576o94m598m22L617N252m399r531l617J9177q331l773J0010
$$ plain form
14827 -4969 10588 15271 10498 11988 27741 20060 8873 8046 10820 21565 21207 18526 18054 19577
14813 19577 27828 31199 26288 1411 -25154 -13267 880 -432 5396 18234 28738 18691 -2188
14800 -2188 -8520 -4888 6818 11461 10491 17328 30328 34000 34810 25200 13316 669 -5878 -1604
14786 -1604 -4832 -660 11455 26455 35395 33513 18337 12559 8255 17805 14977 8065 4626 3666
14772 3666 5961 -10043 -16109 -15313 -5697 5984 3081 1952 6707 7453 862 8851 19379 13688
14758 13688 1082 3031 10800 10064 -4069 -7672 -4587 -9534 -5129 -2994 -1020 -9548 -14047 -17628
14744 -17628 4319 24070 33067 15232 6483 3706 -954 5356 18066 16082 17550 31337 26948
14731 26948 20582 17202 14626 13932 9334 8912 12529 17781 13382 3851 234 19411 11080 7307 17317
14716A7317J8943l437r240N935N320n847n818p570n110K549j0768j5391J7580
14703D463Q887q502n875N481R918J2381n671j2202p143O832J6224J1806Q729n213
14689D0115r409j3937R80p35J1226j0114p086P633k0722r196J4610J4322J1090
14676B8777j632j2409p325m55K326n418j3367J104J868J5332K088K522N322j1948
14662F785j7935o200O408Q657J674j46l140M986P314N807N665j2894o126j4213
14648a3358L523Q505J6350q64j062J680j117N454K53j256M954o620m642J4659
14634B6459R962k3207p983j3368j952Q489J9769N05o095o923r34M081M730M33
14620A3966j4467j3560O359j3699M149K949J5323P059J3490k9O898j1272J454
$$ plain form
14716 17317 36260 32823 23583 29518 34838 28991 23173 15603 10493 13042 2274 -13117 4463
14703 4463 13350 4848 -1027 4454 14372 26753 21082 8880 1737 8569 24793 36599 45328 40115
14689 40115 30706 16769 17749 17014 28240 18126 11040 18673 -2049 -11245 3365 17687 28777
14676 28777 27145 14736 7411 6956 9282 3864 -9503 -8399 -6531 8801 10889 13411 18733 6785
14662 6785 -11150 -17350 -10942 -2285 -611 -757 -3897 1089 8403 14210 19875 6981 855 -13358
14648 -13358 -9835 -1330 15020 14156 13094 14774 13657 19111 19364 18108 23062 16442 11800 26459
14634 26459 36421 13214 5231 -8137 -10089 -1600 18169 18674 12579 5656 4722 8803 13533 13966
14620 13966 -501 -14061 -7702 -21401 -17252 -14303 1020 8079 21569 21540 28438 17166 18620
14607A8620m711j8139j9123Q168J4674R824N55L00J3886R760j749o909m224q78
14593B0054r25n80R55l912n476p706R715J643j2635L422O207j546N257m451m58
14578I564N15j63K915l888m10J6797J4470q979k856p968n825j0765P820N937j0012
14563G152P178P128J1310L737j3253j3838j0838J447K195l369q898m999P795Q253
14549A000m764M434l027l980J186Q010j2886p29N176O002M654P541Q680O524J2540
14534D0361N484p014q038j2341J0333P760j1943j3526j0853j487m629K304O941
14521C352J3299J2386j6655k0244N232L659j933n899o314o115O622K2644m148
14508E886r970l04J908j2154J1048M335K0020j241j5699l825n788J6073J9571
$$ plain form
14607 18620 13909 -4230 -23353 -15185 -511 9313 9868 10168 24054 33814 32065 25156 20932 20054
14593 20054 19129 18549 19504 15592 10116 2410 12125 13768 1133 4555 10762 9216 14473 10022 9564
14578 9564 10079 9916 12831 8943 8533 25330 39800 30821 27965 19997 14172 3407 11227 17164 7152
14563 7152 14330 21458 32768 36505 23252 9414 -1424 23 2218 -1151 -10049 -15048 -7253 1000
14549 1000 -3764 670 -2357 -6337 -5151 2859 -10027 -10756 -5580 422 5076 12617 21297 27821 40361
14534 40361 45845 38831 30793 18452 28785 36545 24602 11076 223 -1264 -5893 -3589 3352
14521 3352 16651 29037 12382 -7862 -2630 1029 -904 -6803 -13117 -19232 -12610 10034 5886
14508 5886 -4084 -4388 -2480 -14634 -3586 749 20769 19528 3829 4 -5784 10289 29860
14495B9860J578m418p712o472P035n514J452q523L364k685m368j7484q204R626
14481a2465K4616M270j2871j058J6182N254q575r942r667J2945P563J2118j1937
14468A6433r234M802M921n217n340K2467m820j5071n570M805J2036l484j2305
14455D423m453p186J077K0100P656J1470M050j1140n354J0926P337k673q596j806
14441B5831l617k312L212j1616k0505J804K592m378K073P486J71j739M633J2742
14427A6377m628j4994j1867L653K1251O649q564N603N667k776q810m864j973J2603
14413A3327K7195N202j3356k1416n426M109J7439Q908j5766j4488j227M584m832
14400D253p069J8943K1007k113l641m435L713M12K689J4284o90j8803j4402J0158
$$ plain form
14495 29860 31438 27020 19308 12836 19871 14357 15809 7286 10650 7965 3597 -13887 -22091 -12465
14481 -12465 12151 16421 3550 2492 18674 23928 15353 5411 -4256 8689 16252 28370 16433
14468 16433 7199 12001 16922 11705 6365 28832 24012 8941 3371 8176 20212 16728 4423
14455 4423 -30 -7216 -6139 13961 21617 33087 37137 25997 20643 31569 38906 36233 27637 25831
14441 25831 22214 19902 23114 11498 -9007 -7203 -4611 -8989 -6916 570 741 -998 3635 16377
14427 16377 11749 -3245 -15112 -11459 9792 16441 7877 13480 19147 16371 7561 2697 724 13327
14413 13327 40522 45724 32368 10952 5526 9635 27074 35982 20216 5728 4501 9085 4253
14400 4253 -2816 16127 37134 35021 31380 26945 30658 31070 33759 48043 47353 28550 14148 24306
14386B4306J3876P624k0438j0900o512R404k421N595J8073J3000k131m351j6976
14373B8149j1943K90r766J076N691L0065m73k3208M315P658j2265l570m733k838
14359H448j509M022J896j967J3113L184P789j0111l406R369N573j0692K88P942
14345C3939k158j7917n56J4055L034L061j4508K049Q066j599j6558j2107J749
14332E50R117J9060q12j5416J1263J6880n845j9138j1955J2817J3883j3336j9237
14319b169m879k27N737Q14J0155K3673k819l5809O800o721J0993R049m177N789
14305A6209q89Q624K670L879m861p20r215p179M4K366k020o040j0903r139P284
14290i890J5877J0508o67k683l946J708O185J0548P547j1177p22o221k66n707
$$ plain form
14386 24306 38182 45806 25368 14468 7956 17360 14939 20534 38607 51607 49476 45125 28149
14373 28149 16206 16496 6730 7806 13497 43562 43089 19881 24196 31854 19589 16019 11286 8448
14359 8448 6939 10961 12857 10890 24003 27187 34976 24865 21459 30828 36401 25709 25997 33939
14345 33939 31781 13864 13308 27363 30397 33458 18950 20999 29065 27466 10908 -1199 550
14332 550 9667 28727 27915 12499 23762 40642 34797 15659 3704 16521 30404 17068 -2169
14319 -2169 -7048 -7275 -1538 -724 9431 33104 30285 -5524 1276 -5445 5548 14597 10420 16209
14305 16209 15320 23944 26614 30493 25632 24912 15697 8518 8562 10928 8908 2868 -8035 -17174 -9890
14290 -9890 5987 16495 15828 13145 9199 10907 17092 27640 35187 24010 23288 17067 16801 11094
14276A1094R647j2482j0230K4252J471j7304q432L601l676P837k953l585N863
14263E103R677j720P429P322J549j688j0578J550n667n060M759J9703m951p332
14249B0096j1157L324q477K790N826o267Q692J106M281j0316Q028J7866l860j4516
14235A7416j912N610j644j8012j1724J7151J5883Q269Q690o969m452j7911N058
14222A5453J918J3368J4198N831J2033o034n947m08O153j1224k6112r171n77K04
14208I685k940J7267P141p096n987j581J2447P072M799j672q450o248p965j2672
14194C800M797J0345M244n755J168J2067k409j4565P794O927O220J968r165k1150
14180F286Q200J2462P520j4071j2356J0763L101J0956K539j407o143L470j090
$$ plain form
14276 11094 20741 8259 -1971 22281 23752 6448 -1984 1617 -2059 5778 2825 -760 5103
14263 5103 14780 13060 20489 27811 29360 27672 17094 18644 12977 7917 12676 32379 27428 20096
14249 20096 8939 12263 3786 6576 12402 6135 14827 15933 20214 9898 17926 35792 31932 17416
14235 17416 15504 21114 19470 1458 -10266 6885 22768 31037 39727 32758 28306 10395 15453
14222 15453 17371 30739 44937 50768 62801 56767 50820 50412 56565 45341 19229 10058 9481 9685
14208 9685 6745 24012 31153 24057 18070 16489 28936 36008 40807 39135 30685 24437 16472 3800
14194 3800 8597 18942 23186 17431 18599 30666 28257 13692 21486 28413 34633 36601 27436 6286
14180 6286 14486 26948 34468 20397 8041 18804 21905 32861 35400 33993 27850 31320 30230
14167C0230j2149m45o563L057k769m933M548J4946P147K002m984r481j483J3172
14153C2295p458q643J385j9366q499J0815J7996P708l322P818M153r57j4708n402
14139A3815p247o627Q895J2928M96n052J9559J4169L110N676j6528r263N625J7558
14125E7114r429j0825M562R305K252Q495Q688j5995k957R555j2753n336k835j27
14111C9714P163m925l854L938l916m983j0691j5732R701N518R520J2152j0852
14098C2753J325n271k121J363n911p855P149O926n359o979K153O703J1423j605
14084C4694L45O691o886k234J0476m14k0850P295J8402J3651m213j7060j9124
14071B0773M921K025J2J2946p966r003J026j33Q497R008O678Q76J279P486l340
$$ plain form
14167 30230 18081 17636 11073 14130 11361 6428 10976 25922 33069 35071 30087 20606 19123 32295
14153 32295 24837 16194 17579 -1787 -10286 529 18525 26233 22911 30729 34882 33925 19217 13815
14139 13815 6568 -59 8836 21764 22260 17208 36767 50936 54046 59722 43194 33931 39556 57114
14125 57114 47685 36860 41422 50727 52979 61474 70162 54167 51210 60765 48012 42676 39841 39714
14111 39714 46877 41952 38098 42036 38120 33137 22446 6714 16415 21933 31453 43605 32753
14098 32753 34078 28807 26686 28049 22138 14283 21432 28358 22999 16020 18173 24876 36299 34694
14084 34694 35039 41730 34844 32610 43086 42672 21822 29117 47519 61170 56957 39897 20773
14071 20773 25694 27719 27731 40677 32711 23708 24734 24601 33098 42106 48784 49660 50939 58425 55085
14056E5085k2973m773k67j0902k684M319q913J344J0317J0491l950O71J1856r806
14042B9815k2722q114K7070j619m065J1344R684P227m653R12P16j0672j1108r888
14028A3927k392R466l03r056J9154J7846N917q833n394j024k617N080J1359n408
14014D7722j3507n491k851r445P056J3646J505p655o832J3206K685m296J2984
14001D8727o240O637J0531K883o253J1Q065L468n924l659q563k798K86J691k618
13986D6244N825R356j0673j101p713J137J1110n418n155j4254P433K862O649o190
13972D0112K694J8485O803k0943r982J0292J1475j2993n04j1308j875O95J1221
13959D4172J5291m508q846J162K245n683o013K4752O366r866j631l88q889O2M55
$$ plain form
14056 55085 32112 27339 27072 16170 13486 17805 8892 10236 20553 31044 27094 27765 39621 29815
14042 29815 7093 -1021 26049 24430 20365 31709 41393 48620 43967 44879 45595 34923 23815 13927
14028 13927 11535 21001 20698 11642 30796 48642 54559 45726 40332 39308 36691 41771 53130 47722
14014 47722 34215 28724 25873 16428 23484 37130 38635 30980 24148 37354 40039 35743 48727
14001 48727 42487 49124 59655 62538 56285 56296 64361 67829 61905 58246 49683 46885 47171 48862 46244
13986 46244 52069 61425 50752 49651 41938 43075 54185 48767 43612 29358 36791 39653 46302 40112
13972 40112 42806 61291 68094 47151 37169 47461 58936 45943 45439 34131 32256 32951 44172
13959 44172 59463 54955 46109 47271 49516 43833 37820 62572 68938 59072 57441 57053 48164 48226 48681
13944D8681j5763p345L466o261N868J2243k158L07l243J399K4655P846j4502j8170
13930C7023N613R786m02O878K753M479k534j1341j5384m201M422K111q632J411
13916C1982j0163o80Q278J2907O78L439m561n031j791k235J5812q56p240P123
13902D7662k304m653k559j068L896j9234k1753J5684O113m550j282K9264J2118
13889E7334O294P352k702j2387P861N005j1194j5656L4J2340P019l22q078J1268
13875F4168j8374j878N909R149O916M39K53p183L111J960r518l291K788J0317
13861F4766O367r183o216k375m116J2647q930q110j0702K927j0731L587N329n896
13847B9364K484R373j1311m81J8176J2334p68L338J79m497J7534m260n572J1013
$$ plain form
13944 48681 32918 25573 29039 22778 28646 40889 38731 39038 35795 37194 61849 69695 55193 37023
13930 37023 42636 52422 52020 58898 61651 66130 63596 52255 36871 32670 37092 39203 30571 31982
13916 31982 21819 21139 29417 42324 43002 46441 41880 36849 35058 32823 48635 47779 40539 47662
13902 47662 45358 40705 38146 37078 40974 21740 -13 15671 21784 17234 15952 45216 57334
13889 57334 63628 70980 68278 55891 63752 68757 57563 41907 41941 54281 61300 60978 52900 64168
13875 64168 45794 43916 49825 58974 65890 66329 66582 59399 62510 64470 54952 51661 54449 64766
13861 64766 71133 61950 55734 53359 49243 61890 52960 44850 34148 37075 26344 29931 35260 29364
13847 29364 31848 41221 29910 29429 47605 59939 59171 62509 62688 58191 75725 71465 65893 76906
13833G6906K440n341k3362J2759m663k4985J403J8177j438J440R847O779j4182
13820E5780k0616J6081K0567P073j2554p583J4342j0674n846J1529K118q609r115
13807E2493m222K389M66M949Q525J0012M298L066J104j4164l242j593n370J1982
13793G0693k1549j7558J1526J1472k681k823K751M059o028o187J3487N906l065
13780F0003r159r455q181O549n374K781J0938K70M943K8552K6159j995k3804j6374
13766F5853k026J3960r678j8222J4361J3009N000j4646n731J5663j1703R66J2602
13753G9408K012l67j400l495q25L372P601j266k2355j4864K919R509L053N135
13739F8437Q243p76j8813j3635l537K564J8588J2207k364l90Q564L340R800N06
$$ plain form
13833 76906 79346 74005 50643 63402 58739 33754 35157 53334 51896 53336 63183 69962 55780
13820 55780 35164 51245 71812 78885 66331 58748 73090 62416 56570 68099 70217 61608 52493
13807 52493 48271 50660 51126 56075 64600 74612 78910 81976 83080 68916 65674 64081 58711 70693
13793 70693 49144 31586 43112 54584 51903 49080 51831 55890 49862 43675 57162 63068 60003
13780 60003 50844 41389 33208 39757 34383 37164 48102 48372 53315 81867 108026 106031 82227 65853
13766 65853 63827 77787 68109 49887 64248 77257 82257 67611 61880 77543 65840 66806 79408
13753 79408 81420 81053 79653 76158 75333 78705 86306 85040 62685 47821 50740 60249 63302 68437
13739 68437 76680 75904 57091 43456 39919 42483 61071 73278 70914 70524 79088 82428 92228 92734
13725I2734j697j5000k427J557J5040N284n553l598j1315n092J1969N423k113
13712H5212R443l16m341r507K93K0631K2093j4203q404n335m372j8326j5568o479
13698E0821j239Q811L520J0180K2602q13j766Q396NM370r687j108J2694J5915
13684A22701j8773k687J7147k3350j1667k843J0717Q977J370O405m640j1023K112
13671I4446N89K025L328l724J2017J4285P466Q711J0824K3142P903j22R248L0359
13657B20497L8662K9130M0754O6352Q3374J18187J91288L19425N42050P22671
13647B372390L77311l64085p21455o16559l61183j91938j09416o3647n3738m7326
13637B20354l3660j0480k1421k1324j581k0808K308J335R702j170p081Q16n549
$$ plain form
13725 92734 91037 76037 73610 75167 90207 95491 89938 86340 75025 69933 81902 87325 85212
13712 85212 94655 94339 89998 80491 80784 101415 123508 109305 100901 95566 91194 72868 57300 50821
13698 50821 49582 58393 61913 72093 94695 93882 92116 100512 100517 104887 95200 94092 106786 122701
13684 122701 103928 101241 118388 95038 83371 80528 91245 100222 101592 107997 103357 92334 94446
13671 94446 95035 97060 100388 96664 108681 122966 130432 139143 149967 173109 181012 180890 190138 220497
13657 220497 259159 288289 329043 395395 478769 596956 788244 1107669 1649719 2372390
13647 2372390 2749701 2385616 1664161 1047602 686419 494481 385065 321418 267680 220354
13637 220354 186694 176214 154793 133469 131888 111080 113388 114723 124425 123255 116174 116990 111441
13624A11441p500o052R469P286j2681j3532k076R846l534l116n38L3179K3602
13611A45794j6572m335M678o798l466q685l365K891r735p538J5225N736j2785
13598A01045r69K954J8293j4337j0995l239N996J1669Q0r797r12r39L439L519
13584A05807j816k332K4473O292o787m114l01m32k437K144O93m19p700j797j5052
13569I6222j007N33O522O583L59J2660K6725J2141j3110J697o4j5807K980j0103
13555A26331r05J673L269k355j8116r070J1819O859j2304O323J3579J3158j3246
13542A27015j6226m24L508m290n912j0278R93J3979J3417j04p193j6703p323J8188
13528A08647J5026L076j1275j5371R218J663j0520j025J171j7245q562j633j2548
$$ plain form
13624 111441 103941 97889 107358 114644 101963 88431 86355 96201 92667 89551 89013 122192 145794
13611 145794 129222 124887 129565 122767 119301 110616 107251 110142 100407 92869 108094 113830 101045
13598 101045 100076 103030 121323 106986 95991 92752 98748 110417 110497 100700 99788 98849 102288 105807
13584 105807 103991 101659 126132 132424 125637 121523 121222 120790 118353 120497 121190 120771 113071 111274 96222
13569 96222 95215 95748 102270 108853 109212 121872 148597 160738 147628 149325 149261 133454 136434 126331
13555 126331 125426 127099 130368 128013 109897 100827 112646 119505 107201 113524 127103 140261 127015
13542 127015 110789 110365 113873 109583 103671 93393 94386 108365 121782 121678 114485 97782 90459 108647
13528 108647 123673 126749 115474 100103 109321 110984 100464 99439 100610 83365 74803 73170 60622
13515F0622m8333l7483O091O4229Q3190M3800j6985k1599k715L3007M7456L0200
13503B41480k3689l5571p925J7622L5912K7590O703J0149J2422L111j0886p874
13491B69044P209L767r740p180P835L110j9450j9097j679m610J9210K1922n187
13478B65154k2236k2326o92k60P66k505q942j255P592r847n436J6466K3574J7662
13464B57715L4017L1649K1513K0748K241j2263o909R217K5617J7449Q765j769
13452D07990k6707o398o202k0811l1394j7006j7074j4746q423l628j5672j781
13440B38148j478j026p771n197J3493K0428O550q183r105q850l377j2353j5635
13427B05644O677K4693J2074K798J3653J4508R255L674M610R658P372P524r409
$$ plain form
13515 60622 12289 -25194 -19103 45126 128316 172116 155131 133532 130817 163824 211280 241480
13503 241480 217791 182220 174295 191917 227829 255419 262122 272271 284693 287804 276918 269044
13491 269044 276253 280020 270280 263100 270935 274045 254595 235498 233819 229209 248419 270341 265154
13478 265154 242918 220592 219900 219640 220406 217901 208959 207704 215296 205449 200013 216479 240053 257715
13464 257715 291732 323381 344894 365642 367883 355620 348711 357928 383545 400994 409759 407990
13452 407990 381283 374885 368683 347872 316478 299472 282398 267652 259229 255601 239929 238148
13440 238148 236670 235644 227873 222676 236169 256597 263147 254964 245859 237009 233632 221279 205644
13427 205644 212321 237014 249088 251886 265539 280047 289302 292976 297586 307244 314616 322140 312731
13414C12731j8031j2178R293P680J6953j18o477k0905l614P091r400m0582m5699
13401A96744k5780K998M3819P7476N6807L8345M0940M4169J4682k3260n1314m5446
13389C70180k9829l0463k7084M125J2560K9702L3660K2669O357j0383r689o613
13377C65192q103L215n152j3963Q568K9427N3960P5288J1244o0428p5855o1260
13365C22133k4858k7541k7983k8432m0326p3052p1480l7893P7856K09067K10889
13354D88380J02791J5788P90q628k2280J3805J5911J8948K3121N871n215j4132
13342F35150k2157j0505L492j57L6197M9591L0681M4985L8139K9230j5597j57842
13330F61207l09754k77087j82170j27080K6503J62762J52631R5091M3116M1170
$$ plain form
13414 312731 294700 282522 291815 299495 316448 316330 309853 288948 285334 292425 283025 242443 196744
13401 196744 170964 173962 217781 295257 352064 390409 431349 475518 490200 466940 415626 370180
13389 370180 340351 309888 282804 286929 299489 329191 362851 385520 391877 381494 371805 365192
13377 365192 357089 360304 355152 341189 349757 379184 433144 508432 519676 459248 383393 322133
13365 322133 297275 269734 241751 213319 172993 99941 28461 -9432 68424 277491 488380
13354 488380 591171 606959 607749 599121 576841 590646 606557 625505 648626 654497 649282 635150
13342 635150 612993 602488 605980 605823 642020 691611 722292 767277 805416 834646 819049 661207
13330 661207 351453 74366 -107804 -234884 -208381 -45619 107012 202103 245219 286389
13320B86389L3589K0035J2104J7972K8125J7357K0119K4644R909M976n137j552
13308D68530J160k019J0541J4802J1722K6169L6450J5762J6203K0008J3915l726
13296F29517j1702J1725J5337K203j735R441K6079K5514K1029K0079O302M334
13284G58123J8768L2482M5418O7059O2069K3598K2043J2722J0930K3767K6388
13273A103367j3302k2022j7282L083J6539M950J4233M2666O2909N0637M4267N2924
13261A342969M3844L6903L2023J4382O655K4859N0258O1283N8211N8345L9926
13250A769658M0284N5079O0353N7636M4560Q5421J07062J09804J07825J18698
13240B556380J16813J24500J64236J65813J91298K27782K46087K22106K01773
$$ plain form
13320 286389 319978 340013 352117 370089 398214 415571 435690 460334 470243 475219 470082 468530
13308 468530 469690 467671 478212 493014 504736 530905 567355 583117 599320 619328 633243 629517
13296 629517 617815 629540 644877 647080 645345 654786 680865 706379 727408 747487 753789 758123
13284 758123 776891 809373 854791 921850 983919 1007517 1029560 1042282 1053212 1076979 1103367
13273 1103367 1090065 1068043 1050761 1053844 1070383 1075333 1089566 1132232 1195141 1245778 1290045 1342969
13261 1342969 1386813 1423716 1455739 1470121 1476776 1501635 1551893 1613176 1671387 1729732 1769658
13250 1769658 1809942 1865021 1925374 1983010 2027570 2112991 2220053 2329857 2437682 2556380
13240 2556380 2673193 2797693 2961929 3127742 3319040 3546822 3792909 4015015 4216788
13231D216788K07384K26011K47162K95579M02189M92527N45653O17774P04714
13222G955781P86367R28905J111183J312128J523414J741308J992613K345286
13214A9696985K958065L753871M709158O122504Q084746J0435752J2970345J7172672
13206H5904098K6632564M6417133Q3404199J29521992J20075136m090686j24783153
13199C63081283j36291473r1430424m9973662k6549582j4880369r733644p547337
13192B6674792n844186m281257l139578k350586j871968j501767j146522q25927
13184E713001n63326m13478l51230l71192l92537l72299l15485k53250k01120
13175B479084j82530j86337j54749o5440o3391j68953k29993j81807j19162p3290
$$ plain form
13231 4216788 4424172 4650183 4897345 5192924 5595113 6087640 6633293 7251067 7955781
13222 7955781 8742148 9671053 10782236 12094364 13617778 15359086 17351699 19696985
13214 19696985 22655050 26408921 31118079 37240583 45325329 55761081 68731426 85904098
13206 85904098 112536662 158953795 242357994 371879986 491955122 487864436 363081283
13199 363081283 226789810 135359386 85385724 58836142 43955773 34222129 26674792
13192 26674792 20830606 16549349 13409771 11059185 9187217 7685450 6538928 5713001
13184 5713001 5149675 4736197 4384967 4013775 3621238 3248939 2933454 2680204 2479084
13175 2479084 2296554 2110217 1955468 1890028 1826637 1657684 1427691 1245884 1126722 1053432
13165A053432n4339m9981n0902m0515m3234l7766j9102j9385m1010n5903m8761
13154E92534l451J2264K914p794N455L8559P2401Q5902J05738J46879K42985M77604
13142A771990O67387L99280k85788o85560n85872l76716k21091j21305j01267
13133D61058q7005p3146o1882p4871o3205r469j5421q985n294l137J6376J9189
13121I4208K1548L4603J9991J6234n210j1484N507l149o2J3079r14k1347l9500
13108A23504j2664Q800r050n055J4889m073j3833k396Q674K4804K9712J42r525
13095A53929l5715l5983p964Q308J1178N550L759J8395n507m318P301K0394K5168
13082A64495L8786N2323N4086R3356J48484J40732N3588o3696j10787j68199k17392
$$ plain form
13165 1053432 999093 949112 898210 857695 814461 776695 757593 738208 697198 641295 592534
13154 592534 589083 601347 604261 596467 601922 640481 712882 798784 904522 1051401 1294386 1771990
13142 1771990 2439377 2838657 2552869 1867309 1281437 904721 683630 562325 461058
13133 461058 374053 300907 239025 164154 100949 91480 76059 67074 61780 58643 75019 94208
13121 94208 115756 150359 170350 186584 181374 169890 175397 172248 172186 185265 184351 163004 123504
13108 123504 110840 119640 110590 105535 120424 116351 102518 100122 108796 133600 163312 163454 153929
13095 153929 118214 82231 74267 82575 93753 99303 103062 121457 115950 111632 118933 139327 164495
13082 164495 203281 255604 309690 403046 551530 692262 745850 682154 571367 403168 185776
13071A85776j75296r9290l9647J0939P682L2445K9335J4756L096j256R949Q688
13059a2823O540m301j3779O755K8751K3479K5098L0740L3751M8666Q4679J84922
13047D42478L62946M90738M55775K78874j27584m76455m44859l09409j86418r1980
13037C94106m8901n3431o3530o0128k2656k0234q391j8182j5455l5479l2354q195
13025G170q864R226K5193L4787J1937r081l0059J651j0391j7163j7845k8716l7362
13012f9517m6192m9788k7661j0837L0489O2203O8696N7408O0124M3757r384l0161
13000G9137o0572j7626j0455n0l690j2834M9J0736J0653k358l026j2j1740j7709
12986c9497j8105j9789k525O213M445J9520O913j0069J2747K0954K1332P630j0927
$$ plain form
13071 185776 10480 -88810 -128457 -117518 -109836 -77391 -48056 -33300 -30204 -31460 -21511 -12823
13059 -12823 -6283 -10584 -24363 -17608 11143 34622 59720 90460 124211 172877 257556 442478
13047 442478 805424 1296162 1751937 2030811 1903227 1426772 981913 672504 486086 394106
13037 394106 345205 291774 228244 168116 145460 125226 116835 98653 83198 47719 15365 7170
13025 7170 -1694 7532 32725 67512 79449 70368 40309 41960 31569 14406 -3439 -32155 -69517
13012 -69517 -115709 -165497 -193158 -203995 -173506 -111303 -42607 14801 74925 118682 109298 79137
13000 79137 18565 939 -9516 -9566 -13256 -26090 -26041 -15305 -4652 -7010 -10036 -10048 -21788 -39497
12986 -39497 -57602 -77391 -79916 -73703 -69258 -49738 -42825 -52894 -40147 -19193 2139 9769 -1158
12973a158n746J7549J505j0240l899j358j1238k1343R7Q680J156r42Q145j3960
12959c2752j3988P713K212J0899K1895l702q365R911N044k604l582q414n289l88
12945b1410j5935j3531k79j858k057J389J643M275j5081r369K201P523j6740R847
12931f9382J4553R725n726j1836j769N772K702K922j4528j6096r528J7342J384
12918g4465j2641j9622K838J0765J4923O610n278j7468q878M854j318m667J2265
12905i2082K0144K8409K2347J3016p160k6856k0466K2310N2475K5841j116j4739
12893B2123j2005K6186P9770P8067J0242m6008o3945k7094K786j5935K649m521
12881E2315j6718j9950o791N842n410j1197L009q90m852K489M333J8142o722j6521
$$ plain form
12973 -1158 -6904 10645 12150 1910 -1989 -3347 -14585 -35928 -35831 -27151 -25995 -26937 -18792 -32752
12959 -32752 -46740 -39027 -36815 -25916 -4021 -7723 -16088 -6177 -1133 -3737 -7319 -15733 -21022 -21410
12945 -21410 -37345 -50876 -51155 -53013 -55070 -53681 -52038 -47763 -62844 -72213 -70012 -62489 -79229 -69382
12931 -69382 -54829 -45104 -50830 -62666 -64435 -58663 -55961 -53039 -67567 -83663 -93191 -75849 -74465
12918 -74465 -87106 -106728 -103890 -93125 -78202 -71592 -76870 -94338 -103216 -98362 -99680 -104347 -92082
12905 -92082 -71938 -43529 -21182 -8166 -15326 -42182 -62648 -40338 12137 37978 36862 22123
12893 22123 10118 36304 116074 194141 204383 158375 94430 67336 70122 54187 56836 52315
12881 52315 35597 15647 8856 14698 9288 -1909 1100 210 -4642 -2153 2180 20322 13600 -2921
12867b921j1036L016L181P518J1032l607j4311n129J3128p882j9885q176O920
12854b8152O439o321P727k376j1283m984P421Q691j5259J7991J4521N433p723
12841g875r612L481J0742J1049q603p461j7563J0193Q62P190J4690k747p319k0393
12827b3366j5431m09M475N958k190J2087R491j502J012L268q528K8N302J0007
12813B02R743l855l367r020j0985n305K988j0768m470N076r428N042n41m873m217
12798d3778J0210O083m454m785m096K2271J84n967N235m907j880j1181K378J1324
12784b3363O671J3922q153j2201Q996k900l823P804P121n41p843o844J1908J3091
12770C845J4726N4J2920N26O912K0618K1505M862J3268P860P076K2278L7909N8014
$$ plain form
12867 -2921 -13957 -10941 -7760 -242 10790 7183 -7128 -12257 871 -7011 -26896 -35072 -28152
12854 -28152 -21713 -28034 -20307 -22683 -33966 -38950 -31529 -22838 -38097 -20106 -5585 -152 -7875
12841 -7875 -17487 -14006 -3264 7785 -818 -8279 -25842 -15649 -14787 -7597 7093 4346 -2973 -23366
12827 -23366 -38797 -39206 -34731 -28773 -30963 -18876 -9385 -10887 -9875 -6607 -15135 -15107 -9805 202
12813 202 9945 6090 2723 -6297 -17282 -22587 -19599 -30367 -34837 -29761 -39189 -34147 -34688 -39561 -43778
12798 -43778 -33568 -27485 -31939 -36724 -40820 -18549 -18365 -24332 -19097 -24004 -25884 -37065 -34687 -23363
12784 -23363 -16692 -2770 -10923 -23124 -14128 -17028 -20851 -13047 -5926 -6467 -14310 -21154 -9246 3845
12770 3845 18571 18625 31545 32071 38983 59601 81106 85968 99236 107096 114172 136450 174359 232373
12756B32373O3686Q4967J04085J77471L16580N64466P18851L60067l90459p35622
12746A496465n86113l47882k04457j14028n5876m7885l6743k5958j7126q237M217
12735E6377m635l866J0714j4108k6421j0153J907k4460o005J2723J113o457M283
12722h988l452o441K04l383j1379m691M108J5304Q657p853M465M801L640j0947
12708a5955K80q707k199j0884p921q917L641N934J0771P074p791r16J6916P561
12694a1113j0213n408N322J921J877n473m188l859J3121K301J984P312j1876j3600
12680c1892k319N355L793M758J026J2716l63j0140j7892k606J0000r973j3758
12667e1295q134n392K1515R547K803L240k927n420n235k111O823P058p603j4898
$$ plain form
12756 232373 296059 381026 485111 662582 979162 1543628 2262479 2622546 2232087 1496465
12746 1496465 910352 562470 358013 243985 188109 140224 103481 77523 60397 52160 56377
12735 56377 51742 47876 58590 44482 18061 7908 9815 -14645 -20650 -7927 -6814 -13271 -8988
12722 -8988 -12440 -18881 -18677 -22060 -33439 -38130 -34022 -18718 -10061 -17914 -13449 -8648 -5008 -15955
12708 -15955 -15675 -24382 -26581 -37465 -45386 -54303 -50662 -44728 -33957 -26883 -34674 -35590 -18674 -11113
12694 -11113 -21326 -26734 -21412 -19491 -17614 -23087 -27275 -31134 -18013 -15712 -13728 -6416 -18292 -31892
12680 -31892 -34211 -28856 -25063 -20305 -19279 -6563 -6926 -17066 -34958 -37564 -27564 -37537 -51295
12667 -51295 -59429 -64821 -43306 -33759 -30956 -27716 -30643 -36063 -41298 -43409 -36586 -29528 -37131 -52029
12653e2029M998J4504P941M882j1159q727Q636Q077q158q159N82J0844J0852o936
12639b3852Q303J2886k714j4194k8121r745J1837j778J186k472j4199L621J0946
12626d8296P374q738l126J5936Q623j749L3o015j274J0662r322p688L915O331
12612c3334K64o671J0298J294j543m544P231n669o5q460j014k421k743N048J6562
12597b5767M206J8690M8j5984n994k99L014J605j3125j2769L67P878k15M065N853
12582b8427p449l843q03J6859K361L627K935m198P614p360o976r102q70J2201
12568b3431M539Q349L452O391R703p535j7336j4281q885O973L833L807L137R959
12554a1325o24j2179L20M766n762n543l210q607O473P181j1096K862L079j760
$$ plain form
12653 -52029 -47031 -32527 -24586 -19704 -30863 -39590 -30954 -22877 -31035 -39194 -38612 -27768 -16916 -23852
12639 -23852 -15549 -2663 -5377 -19571 -47692 -57437 -45600 -47378 -46192 -48664 -62863 -59242 -48296
12626 -48296 -40922 -49660 -52786 -36850 -28227 -29976 -29943 -35958 -37232 -26570 -35892 -43580 -39665 -33334
12612 -33334 -33070 -39741 -29443 -28149 -29692 -34236 -27005 -32674 -32739 -41199 -42213 -44634 -47377 -42329 -25767
12597 -25767 -21561 -2871 -2823 -18807 -24801 -25100 -22086 -20481 -33606 -46375 -46008 -38130 -38345 -34280 -28427
12582 -28427 -35876 -39719 -40522 -23663 -21302 -17675 -14740 -18938 -11324 -18684 -25660 -34762 -35632 -23431
12568 -23431 -18892 -10543 -7091 -700 9003 1468 -15868 -30149 -39034 -32061 -28228 -24421 -21284 -11325
12554 -11325 -11949 -24128 -23808 -19042 -24804 -30347 -33557 -42164 -35691 -28510 -39606 -36744 -33665 -35425
12540c5425m797J1328J6440n696k433L481L791p764j2642q672N206J2188r800
12527c4795m091n937j1947J238J8404P260q028R563J5502J289p108j6408Q794
12514b6264J3634L659r517j2753L619O948m974J2448O465k431j2069q473P199
12501b2509J8221J1156j9304j6410J0595l08k958L480j0899j3174M316R008J1120
12488a7666P237M837k391k340m361k756j9953R821L81J5040J4841k1830k968M338
12474a7770j497q94j0072k412k12J8020N64k6782p935L889Q074P336q417j1371
12460d9479L991k474R409R153k563K351J153J3274l414j0388r776L511R932j601
12446b6921m490k527P771J075n380K1433L071j1326L072N274P379K25J479N371
$$ plain form
12540 -35425 -40222 -28894 -12454 -18150 -20583 -17102 -13311 -21075 -33717 -42389 -37183 -24995 -34795
12527 -34795 -38886 -44823 -56770 -55532 -37128 -29868 -37896 -28333 -12831 -11542 -18650 -35058 -26264
12514 -26264 -12630 -8971 -18488 -31241 -27622 -20674 -25648 -13200 -6735 -9166 -21235 -29708 -22509
12501 -22509 -4288 6868 -12436 -28846 -18251 -18559 -21517 -18037 -28936 -42110 -37794 -28786 -17666
12488 -17666 -10429 -5592 -7983 -10323 -14684 -17440 -37393 -27572 -27191 -12151 2690 -19140 -22108 -17770
12474 -17770 -19267 -20161 -30233 -32645 -32857 -14837 -14273 -41055 -48990 -45101 -37027 -29691 -38108 -49479
12460 -49479 -45488 -47962 -38553 -29400 -31963 -29612 -28459 -15185 -18599 -28987 -38763 -35252 -25320 -26921
12446 -26921 -31411 -33938 -26167 -25092 -30472 -9039 -5968 -17294 -14222 -8948 -1569 -1344 135 5506
12432E506l314n35k525k0037q123l477Q125j349j643o369O278R007o883n20j1960
12417c7819l731r09L384j2317J308Q678K299J1764O530j3602j578J0554K192p926
12403c1173j0300p196J5855Q240Q345P893n159j781J0196O31P534J472L657O223
12389A4437k1407r737j5268j4942P6J3923K0305n600k0187R906Q223J2595N777
12376a899j708j0490l3476p72J0214J4177K0958j0236k3105q091j858K027P252
12363c7007o701M675p673P440K6672R200j5529j8690j4739m767Q073K1076P096
12350b0874N108o176N769N03j9377j3161j2182O923J837K512J5043O877l582n006
12336c5786l241J4575p225n211p074J973J4341r844q009L605Q115L433P574J4612
$$ plain form
12432 5506 2192 1657 -868 -20905 -29028 -32505 -24380 -25729 -27372 -33741 -27463 -18456 -25339 -25859 -37819
12417 -37819 -41550 -42459 -39075 -51392 -50084 -41406 -39107 -27343 -20813 -34415 -35993 -25439 -23247 -31173
12403 -31173 -41473 -48669 -32814 -24574 -16229 -8336 -13495 -15276 -5080 -4449 3085 4557 8214 14437
12389 14437 -6970 -16707 -31975 -46917 -46841 -32918 -12613 -18213 -38400 -28494 -20271 -7676 -1899
12376 -1899 -3607 -14097 -47573 -48345 -38131 -23954 -2996 -13232 -36337 -44428 -46286 -44259 -37007
12363 -37007 -43708 -39033 -46706 -39266 -12594 -3394 -18923 -37613 -52352 -57119 -49046 -27970 -20874
12350 -20874 -15766 -21942 -16173 -15670 -35047 -48208 -60390 -53467 -51630 -49118 -34075 -27198 -30780 -35786
12336 -35786 -39027 -24452 -31677 -36888 -43962 -41989 -27648 -37492 -45501 -41896 -33781 -30348 -22774 -8162
12322h162q758M842Q136j6151j4328O358M839L337q57L892J950j2803j6770l87
12308d4862j3084R324Q723J7845J9639J3406M646j0805j5048J43q356l716K642
12295a9503l913j626Q040l810j360n554o925J1151K4366Q428n861k551j58j0849
12281a0125J345R540J388q8n615n096r457o854R238K643p084k879j0261j359J3482
12266b1182J5310j1614j3946K97J0025J5901p012k0996K392R566m627J0485Q376
12253g025p466J1029J5196k753p853n19l787l337m022q564J7J5249j6519j9958
12239d0312K358J0898P448O512j217o236l594l80K507n165O688j0249j5350J5588
12225c0504J6199m517j4817q519q349P340J1825L202P331j2653K855J0847n187
$$ plain form
12322 -8162 -16920 -12078 -3942 -20093 -34421 -28063 -23224 -19887 -20744 -16852 -14902 -27705 -44475 -44862
12308 -44862 -57946 -48622 -39899 -22054 -2415 10991 15637 4832 -10216 -10073 -18429 -22145 -19503
12295 -19503 -23416 -25042 -17002 -20812 -22172 -27726 -34651 -23500 866 9294 3433 882 724 -10125
12281 -10125 -8780 760 2148 2060 -3555 -8651 -18108 -24962 -15724 -13081 -20165 -23044 -33305 -34664 -21182
12266 -21182 -5872 -17486 -31432 -31135 -21110 -5209 -12221 -33217 -30825 -21259 -25886 -15401 -7025
12253 -7025 -14491 -3462 11734 8981 1128 609 -3178 -6515 -10537 -19101 -19084 -3835 -20354 -40312
12239 -40312 -37954 -27056 -19608 -13096 -14313 -20549 -24143 -24523 -22016 -27181 -20493 -30742 -46092 -30504
12225 -30504 -14305 -18822 -33639 -42158 -50507 -43167 -31342 -28140 -20809 -33462 -30607 -19760 -24947
12212b4947m568k856P433k118j5654Q614j266Q712J9849J0038r114j0524J569
12199a4832r379M311N717J2458J191k822J1594P133Q139q687j0283n908j7264
12186a8632m932J2261l652j4838L715J4995J1565k227O868N689J845J608k484
12173A1781M237r57Q10J4006J3509p58J4263J7371K2557k441k3861k4983l136
12160D2398j5443j8198j2034n397n928l35J4456N629k082n591r229k791P627R09
12146f009K6818J3893r64J511j4613j3448R18K1183J3165J7221P537j4318O83
12133E3577o122J613K2201j479k919K688r505r294K292N310j1706O513J1056r70
12119F3255p622J302J4538L5034L2444K1226O291k3109l5623j0336q535k3561
$$ plain form
12212 -24947 -29515 -32371 -24938 -27056 -42710 -34096 -35362 -26650 -6801 3237 -5877 -16401 -14832
12199 -14832 -24211 -19900 -14183 -1725 -534 -3356 8238 15371 23510 14823 4540 -1368 -18632
12186 -18632 -23564 -11303 -14955 -29793 -26078 -11083 482 -1745 5123 10812 12657 14265 11781
12173 11781 16018 15061 15871 29877 43386 42628 56891 74262 96819 94378 70517 45534 42398
12160 42398 26955 8757 -3277 -8674 -14602 -14937 -481 5148 3066 -2525 -11754 -14545 -6918 -6009
12146 -6009 20809 34702 33738 35249 20636 7188 8106 29289 42454 59675 67212 52894 53577
12133 53577 47455 49068 71269 69790 66871 69559 60054 50760 53052 58362 46656 53169 64225 63255
12119 63255 55633 56935 71473 106507 138951 160177 166468 143359 107736 97400 88865 65304
12107F5304j7262m695K55j86j2208p503j939K284J0334P172k364Q740m483l993
12093C9456J2834Q314k493j3650l762J112J951n581j0251J11j6380o547j3916
12080h802j4419O032J2859J3114O54k3570R85J2938l989l362K2816J1055m927
12067B1384r333q079L830J2665Q504J675m050P311j966j4591j0583q661j600K805
12053f89K565q56r739k132J0817O963N887m153j7235M420J6031O873J469r400
12039A0821l080o966j44J2585O111L140j2971o143J8594j0363q548p27m166j3635
12025a5492K526Q474J746Q767J5163Q161Q648L185j4138j5985j1549J1370l698
12012G178o495J8717J0570O371r344q205j3851p400o533J763J9647J1420O396
$$ plain form
12107 65304 48042 43347 43602 43416 31208 23705 21766 24050 34384 41556 39192 47932 43449 39456
12093 39456 52290 60604 58111 44461 40699 41811 43762 38181 27930 28041 11661 5114 -8802
12080 -8802 -23221 -17189 -4330 8784 9438 -14132 -13147 -209 -4198 -7560 15256 26311 21384
12067 21384 12051 3972 7802 20467 28971 30646 26596 33907 31941 17350 6767 -1894 -3494 -689
12053 -689 1876 1020 -8719 -10851 -34 6929 12816 8663 -8572 -4152 11879 18752 20221 10821
12039 10821 7741 775 631 13216 19327 22467 9496 3353 21947 11584 3036 2309 -1857 -15492
12025 -15492 -12966 -4492 -2746 6021 21184 29345 37993 41178 27040 11055 -494 10876 7178
12012 7178 683 19400 29970 36341 26997 18792 4941 -2459 -8992 -7229 12418 23838 30234
11999C0234j3819R38J089L420r519j649J2430J053k993J2347k144j620k707L310
11985C0370J4351r363j6204j5882k500M021J0621j1025o892J0229J5431K2466
11973D5623P64L536K215j3902k1669n785J5523J0415j3241J9921M960j046k413
11960D4901P189K870J6932J4440q119j0346r262r862L198N370J0624R297O848
11947H4080q104m864O761L825o956L237J5334J4418m179M345O738p225j8966P879
11933I6323L615l684J452r777k546O931L73k182J5916j9837j9111J04l329L231
11919F7479Q724M633k3356J0275O066K529k096o760j107R439L13j9472q408n12
11905D7747l792L834J9819M598K045N009o469k3545j1340O934O489j0400k280
$$ plain form
11999 30234 16415 17353 18442 21862 12343 10694 23124 24177 21184 33531 31387 29767 27060 30370
11985 30370 44721 35358 19154 3272 772 4793 15414 4389 -2503 7726 23157 45623
11973 45623 46387 49923 52138 38236 16567 10782 26305 36720 23479 43400 48360 47314 44901
11960 44901 52090 54960 71892 86332 78213 67867 58605 48743 51941 57311 67935 77232 84080
11947 84080 75976 71112 77873 81698 74742 77979 93313 107731 103552 107897 114635 107410 88444 96323
11933 96323 99938 96254 97706 87929 85383 92314 92687 90505 106421 86584 67473 67577 64248 67479
11919 67479 76203 80836 57480 67755 73821 76350 74254 67494 66387 75826 76139 56667 48259 47747
11905 47747 43955 47789 67608 72206 74251 79260 72791 49246 37906 44840 51329 40929 38649
11892C8649l783l117j6894r503O882J6896l667j005Q832L922J9106q147m999q416
11878C4756P035J7335r692L689N694m727n147J6245O46j3712l194K612k009p83
11864D8748J719M555j0326m514j412n113K0230J2161O28j1171K922k640k855l586
11850D9346j0083N905J4265K868K043O095J2178j2840r680k1235Q889J4118J3401
11837G5270L65j3091j8435n64J0596R450N220p407O740L730r9j8407j2760m285
11823C6323j851p550J1610J7596j0066j555r213P916L302J663L1334M43l598r315
11809F7039j797Q240J0036r346o423Q324j1065r144q591k375j68J3767P475O396
11795G2368o980j8731j004J1618j85R27K957J2124p911j206K4529K310k1572j1194
$$ plain form
11892 38649 34866 31749 14855 5352 12234 29130 25463 24458 33290 37212 56318 48171 43172 34756
11878 34756 41791 59126 49434 53123 58817 54090 48943 65188 65834 52122 48928 51540 49531 48748
11864 48748 50467 55022 44696 40182 38770 33657 53887 66048 66676 55505 58427 55787 52932 49346
11850 49346 39263 45168 59433 62301 64344 70439 82617 69777 60097 38862 47751 61869 75270
11837 75270 75635 62544 44109 43545 54141 63591 68811 61404 68144 71874 71775 53368 40608 36323
11823 36323 34472 26922 38532 56128 46062 44507 35294 43210 46512 48175 79509 79952 76354 67039
11809 67039 65242 73482 83518 74172 67749 76073 65008 55864 47273 44898 44730 58497 65972 72368
11795 72368 65388 46657 45653 57271 57086 58013 60970 73094 65183 63977 88506 90816 69244 58050
11781E8050J5830N617n5O767p526j2314k5059k9393O211K5856m03j7173P72R449
11767C6629Q305J2298k59N508p307k198j648N235P882L273q787r782N323J2942
11753F7414j183r729Q645Q407m159j4412R127J5232M522L907j7380J991j5282
11740E7100l602N946P99N235J0529Q424j061n357l450r866j3726k221N252K0121
11726G4123N826r665L503M130j9264J748J1853R688k953r504n373k319R487j341
11712F9939m347p18J349N194K303m527O196r714k60J406j618j317j900J7213J33
11697G9332p806k569l341n027M160r444j658M482R067k079M284P791m401j2194
11683F0597M469p582r622J2749J9880j1957j3130Q973K3155K3165L5098J6930
$$ plain form
11781 58050 73880 79497 79442 86209 78683 66369 41310 11917 18128 43984 43581 26408 27180 36629
11767 36629 44934 57232 56973 62481 55174 52976 51328 56563 64445 67718 58931 49149 54472 67414
11753 67414 66231 56502 65147 73554 69395 54983 64110 79342 83864 87771 70391 72382 57100
11740 57100 53498 59444 60243 65478 76007 84431 83370 78013 74563 64697 50971 48750 54002 74123
11726 74123 79949 70284 73787 77917 58653 60401 72254 81942 78989 69485 64112 61793 71280 69939
11712 69939 65592 64874 66223 71417 73720 69193 75389 65675 65415 66821 65203 63886 61986 79199 79332
11697 79332 71526 68957 65616 60589 64749 55305 53647 58129 67196 65117 69401 77192 72791 60597
11683 60597 65066 57484 47862 60611 80491 68534 55404 64377 87532 110697 145795 162725
11671A62725k362n054j9958j7747j1559o238P963j8940j8831k2772j4099K0017
11659E3145L789K261m586L635j765l495N526P753m547l954Q083L411k185k544
11645F4527J0259J2565j363j4307Q634p388n717j5086J2404J0312L40j0668o603
11632E7909j618R817k873j6771J091J8787M529l146m399l164M108J0892J8504
11619I3666M855o006o620p739O858p35L121L857l890q584J1385Q831M023L692
11605A06714j4841n456o536J567L792K468J0659k774j3473O7l728q4o73R593J3789
11590A01084J7070K0244J678l40N776j1607k3927k3434j6381j0265Q889q270K377
11577F2894j3174J0170J3994m27q021j3023K2959J1684q296j3378K488O196j4180
$$ plain form
11671 162725 160363 155309 135351 117604 106045 99807 107770 88830 69999 47227 33128 53145
11659 53145 56934 59195 54609 58244 56479 52984 58510 66263 61716 57762 65845 69256 67071 64527
11645 64527 74786 87351 85988 71681 80315 72927 67210 52124 64528 74840 75180 64512 57909
11632 57909 56291 66108 63235 46464 47555 66342 70871 67725 63326 60162 64270 75162 93666
11619 93666 98521 92515 85895 78156 85014 84279 87400 91257 87367 78783 90168 98999 103022 106714
11605 106714 91873 86417 79881 81448 85240 87708 98367 95593 82120 82187 78459 78375 77702 87295 101084
11590 101084 118154 138398 140076 139736 145512 133905 109978 86544 70163 59898 68787 60517 62894
11577 62894 49720 59890 73884 73457 65436 52413 75372 87056 78760 65382 67870 74066 59886
11564E9886J214M726m339p715K793j569J7663P505r060J054m62Q41k122K178N024
11549G7617j4180q346j832J615j2591l137J6823Q397J5735k02J925R308m066j3528
11535G3538n19j3032n594j046J873J3925J525j1386N919n011j6021K931m57j0222
11521C6423O568J2130J0969j2113l811j2139q401p07j2047P222J7842L949q788
11508C7097J1169J1939k565J204L270L239K519j5529n030J2513Q230q231j0753
11495D9072j5426k623k381J2322R889r432r03J269L548j0015j3436M53M493J3819
11481D0649K156n95J097M393l336N291r536m484K2304J0753r359n949o541l932
11467D2911k670l033p420m273j02Q535J383o505j813j5774J937R934R724J5575
$$ plain form
11564 59886 61100 65826 61487 53772 56565 54996 72659 80164 71104 72158 71696 72537 70415 72593 77617
11549 77617 63437 55091 53259 54874 42283 39146 55969 64366 80101 79899 81824 91132 87066 73538
11535 73538 73019 59987 54393 53347 55220 69145 70670 59284 65203 60192 44171 47102 46645 36423
11521 36423 42991 55121 66090 53977 50166 38027 29626 28919 16872 24094 41936 45885 37097
11508 37097 48266 60205 57640 58844 62114 65353 67872 52343 47313 59826 68056 59825 49072
11495 49072 33646 31023 28642 40964 50853 41421 40518 41787 45335 35320 21884 22337 26830 40649
11481 40649 42805 42210 43307 47700 44364 49655 40119 35635 57939 68692 59333 53384 46843 42911
11467 42911 40241 37208 29788 25515 25413 33948 35331 28826 27013 11239 13176 23110 32834 48409
11453D8409M345q284r356j7212K482J3798j2825k1815j9930M595O219J2737L793
11440F956J3819J182J144J234j849o290k173O714o231j041R938O240l686O012
11426C1969o86l15k109k236M46k134n468K160J730k295r188Q49J1991J07r701
11411A5120j702L802P021n247l953M389P501Q989k851o773L88J0456l398J565
11397C5307M837J597j3966j4334J075M626j3545q33R11J6790m940K40K508m956
11383A5317K626R70o303l259P972M343q626J038p87R1j4165k746O60J3843P618
11368A8592j1782n857M852J6425J476n231Q394j445J3637J3072J0305R163j93
11355G1408k2425p431M436O283j1793o168O508m264j2610j689l500J440J7097
$$ plain form
11453 48409 52754 44470 35114 17902 20384 34182 21357 -458 -20388 -15793 -9574 3163 6956
11440 6956 20775 21957 23101 24335 22486 16196 14023 20737 14506 13465 23403 29643 25957 31969
11426 31969 31283 30968 28859 26623 27069 24935 19467 21627 23357 21062 11874 12723 24714 24821 15120
11411 15120 13418 17220 24241 18994 15041 19430 26931 35920 33069 26296 26684 37140 33742 35307
11397 35307 40144 41741 27775 13441 14516 19142 5597 4764 5675 22465 17525 17765 20273 15317
11383 15317 17943 18913 12610 9351 17323 21666 13040 14078 13291 13382 -783 -3529 -2869 10974 18592
11368 18592 6810 953 5805 22230 23706 18475 26869 25424 39061 52133 62438 71601 71408
11355 71408 48983 41552 45988 52271 40478 34310 40818 36554 23944 22255 18755 20195 37292
11342C7292J1210l694k282j1425o909o093j910q934J9370m320p59K273j3344r03
11328I572o528o607J750P66J3477N35J4994J0293j951r070k382j4693o92N713
11314A5177J469K767J765J4995J3270R004m396p066q067m542j6697K005J5603
11301C5287J3911m924K026P603K3671M3988K8484J1824Q372j5564k3426m7937
11289H3315m1044j8597r293p894P770l602j4382o59N048R107j86j531j6123L38
11275g733J9859K6946l856P852L145j1287j8754n848j6242J226J3787R214L116
11262B1425J0324n893q879k0329M682K605m053l493j067K4326j72l368r720k3463
11248a7075O699K4753m204Q432J682j7075j7012j0682J2927J9457J2769K395M88
$$ plain form
11342 37292 48502 44808 42526 31101 24192 18099 16189 7255 26625 22305 21546 23819 10475 9572
11328 9572 3044 -3563 -1813 -1047 12430 12965 27959 38252 36301 27231 24849 10156 9464 15177
11314 15177 16646 19413 21178 36173 49443 58447 54051 46985 38918 34376 17679 19684 35287
11301 35287 49198 44274 46300 53903 77574 121562 150046 161870 170242 154678 131252 83315
11289 83315 42271 23674 14381 6487 14257 10655 -3727 -4386 662 9769 9583 8052 -8071 -7733
11275 -7733 12126 39072 35216 43068 46213 34926 16172 10324 -5918 -4692 9095 18309 21425
11262 21425 31749 25856 16977 -3352 1330 3935 -118 -3611 -4678 19648 19476 16108 6388 -17075
11248 -17075 -10376 14377 10173 18605 20287 3212 -13800 -24482 -11555 7902 20671 23066 23554
11235B3554j525R235K0314n879j2837o406k599N912j1962o717k52N820j65p269
11221I224K136r716N791K173M762j275p746j273r428N141K0629J7310k102j4395
11207B1231o748P316k340o557j712Q176L22j711N346q71J1092Q09l343r466o449
11192A5095O641Q928o814J4598J3386j206j0397j4833q016M263K65Q27J1951Q343
11178D3031J8028K4222L1584J5653r884j2201J5755J0464j8814k4848j9853k5213
11166D7924j9732n85L585q830j8924J943J1469j963Q487j0163j0209n022p686
11153i706N023J6689r064N889J8083o806j5764r473Q326Q929N67m316l577P620
11139A2420M432n022P520m480r220o250L33J0272N093j879M89r094j5265l784
$$ plain form
11235 23554 22029 31264 51578 45699 32862 26456 23857 29769 17807 11090 10838 16658 16493 9224
11221 9224 11360 1644 7435 9608 14370 13095 5349 4076 -5352 -211 20418 37728 35626 21231
11207 21231 14483 21799 19459 12902 11190 19366 19688 17977 23323 22452 33544 34353 31010 21544 15095
11192 15095 21736 30664 23850 38448 51834 50628 40231 25398 17382 21645 21910 22737 34688 43031
11178 43031 61059 85281 116865 132518 122634 110433 126188 136652 117838 92990 73137 47924
11166 47924 28192 27607 31192 22362 3438 5381 16850 14887 23374 13211 3002 -2020 -9706
11153 -9706 -4683 12006 2942 8831 26914 20108 4344 -5129 3197 12126 12693 8377 4800 12420
11139 12420 16852 11830 19350 14870 5650 -600 -267 10005 15098 13219 13708 4614 -10651 -14435
11125a4435M057O919N46o908r933K428Q783K732K1Q195Q17K837j328j0369j5787
11110b1425N428m65K801J982o458K556L658k381P655M345r704N089J4365P672
11096A5118J101L621J4592L7q571k0362M595L1M333J0425J958k724o073M063K209
11081B4353p474k3442j269j357J53K573Q810J8842o430n228n270k843J2365j357
11067A2426K5r179O838K870r511J3675N708L451r090k398K343q48j5041k1599
11053b0330p321L685R552J6328l222J440R095j2226j2583q765K231j763J1617
11040a2262Q970J361j1368q085k996J2099m1M245R1J2365Q706N891m079m380j0658
11025a41j0599R7o288M448K976N428M934l666M590m914J2559P189r389q377J2798
$$ plain form
11125 -14435 -10378 -3459 -2913 -9821 -19754 -17326 -8543 -5811 -5790 2405 3222 6059 4731 -5638 -21425
11110 -21425 -15997 -16462 -13661 -11679 -18137 -15581 -11923 -14304 -6649 -2304 -12008 -6919 7446 15118
11096 15118 16219 19840 34432 34469 25898 5536 10131 10162 14495 24920 26878 24154 18081 22144 24353
11081 24353 16879 -6563 -7832 -9189 -9036 -6463 2347 21189 14759 9531 4261 1418 13783 12426
11067 12426 12451 3272 10110 12980 3469 17144 22852 26303 17213 14815 17158 16310 1269 -20330
11053 -20330 -27651 -23966 -14414 1914 -1308 132 9227 -2999 -15582 -24347 -22116 -23879 -12262
11040 -12262 -3292 -1931 -13299 -21384 -24380 -12281 -12322 -8077 -7986 4379 13085 18976 14897 10517 -141
11025 -141 -10740 -10643 -16931 -12483 -9507 -4079 855 -2811 1779 -3135 9424 16613 7224 -1153 11645
11010A1645J619k312J294O460J582q815q515k2599N98M427O916K044K169O871
10996C384M950k204j817R036J592N880j411k1166J3588K5526j0678r016j470j1743
10982D451j5992K593J2779j5023j0719Q073K2858J2381M372p905j9327p552O166
10969b845M474M949j6128j3214J6806J0374R485M220n349j0621j962p67j193P480
10955E709P011p539j9891L554K291j0376k757J752J271Q670j360l125J0925R985
10941F120j619o044L035p029o485J0657M088J295j0736M930q196M256J6220p451
10927C041j1148q015M156M716M231N498m307M161Q44o491K941N965Q170K107l922
10912A1947m381L13j815k692L003P844j29r000J727j284K072p160K714K4215P595
$$ plain form
11010 11645 13264 10952 12246 18706 20288 11473 2958 -19641 -19043 -14616 -7700 -5656 -3487 3384
10996 3384 8334 6130 4313 13349 14941 20821 19410 -1756 11832 37358 26680 17664 16194 4451
10982 4451 -11541 -8948 3831 -11192 -21911 -13838 9020 21401 25773 17868 -1459 -9011 -2845
10969 -2845 1629 6578 -9550 -22764 -5958 4416 13901 18121 12772 2151 189 -578 -1771 5709
10955 5709 12720 5181 -14710 -11156 -8865 -19241 -21998 -20246 -18975 -10305 -11665 -14790 -3865 6120
10941 6120 4501 -1543 1492 -5537 -12022 -1365 2723 4018 -6718 -1788 -9984 -5728 10492 3041
10927 3041 -8107 -16122 -11966 -7250 -3019 2479 -1828 2333 3177 -3314 -373 5592 13762 15869 11947
10912 11947 7566 7879 6064 3372 6375 14219 14090 5090 6817 5533 7605 445 3159 27374 34969
10897C4969L969r136n704j3265k2457j0029J2607O120P580j0621j3628Q807l331
10884a4119k291R421N189o616N038P914J5023q350j7027n481r369N489Q113L845
10870c221K25r203n640J2657O850N28m101o253Q609J8272p403p421j0427J2430
10856E902K577q333j4705L179J0453q312n512J1837j0191K0695M642j6817j1403
10843a5988K436K28K657o189N183J0321P223l638L122K2983J3652j3557j1960
10830A6473j4216J677R251O782r820P25k472M582o485K770j5202q267J194O143
10816f865N998l211P451J1522J1830j2477k758j5980r769N263k510M860o463L434
10802i675J3583J3798J202P607o745m51k122j3408m347J4653n63j1562m487L598
$$ plain form
10897 34969 38938 29802 24098 10833 -11624 -21653 -9046 -2926 4654 -5967 -19595 -10788 -14119
10884 -14119 -16410 -6989 -1800 -8416 -3378 4536 19559 11209 -5818 -11299 -20668 -15179 -7066 -3221
10870 -3221 -2996 -12199 -17839 -5182 1668 2196 -1905 -8158 451 18723 11320 3899 -6528 5902
10856 5902 8479 146 -14559 -11380 -927 -9239 -14751 -2914 -13105 7590 12232 -4585 -15988
10843 -15988 -13552 -13324 -10667 -16856 -11673 -1352 5871 2233 5355 28338 41990 28433 16473
10830 16473 2257 3934 13185 19967 10147 10872 8400 12982 6497 9267 -5935 -14202 -13008 -6865
10816 -6865 -867 -4078 3373 14895 26725 14248 11490 -4490 -14259 -8996 -11506 -6646 -13109 -9675
10802 -9675 3908 17706 18908 26515 19770 19319 17197 3789 -558 14095 13532 1970 -2517 1081
10788A081M541P617K204j4386k6233r834J2564J4058o999J6276J4429J3816L164
10775C2298k778L577j7477j6950q809j038Q139P212L75N744J3848J505L387k7735
10761A298O33R702L350m948J6432J557j3861P45Q250L88J2151J298j0933q448
10747A7614q145m548L305j9692P677N014j3222l897J7581l490J0475Q152M888
10734B1712Q301j271j3250o612K764k106O744r723n222Q091j1896o37J4571J9076
10720C0542K057N389r116p961o922o740K257L578j3359k7785K639J1618J7453
10707C650R124j202K79p829o421m59J2224J3442M649n728j1152N984J1264m247
10693B3578m005j4347p055J1881R300M105l966N375J1916j7044j3613J0525R488
$$ plain form
10788 1081 5622 13239 15443 1057 -25176 -35010 -22446 -8388 -15387 889 15318 29134 32298
10775 32298 29520 33097 15620 -1330 -10139 -11177 -3038 4174 4549 10293 24141 25646 29033 1298
10761 1298 1931 11633 14983 10035 26467 28024 14163 14908 23158 23546 35697 36995 26062 17614
10747 17614 9469 4921 8226 -11466 -3789 1225 -11997 -15894 1687 -1803 8672 16824 21712
10734 21712 30013 28742 15492 8880 11644 9538 16282 6559 1337 9428 -2468 -3105 11466 30542
10720 30542 32599 37988 28872 20911 13989 7249 9506 13084 -275 -28060 -25421 -13803 3650
10707 3650 12774 11572 11851 4022 -2399 -2858 9366 22808 27457 21729 10577 16561 27825 23578
10693 23578 19573 5226 -1829 10052 19352 23457 19491 24866 36782 19738 6125 16650 26138
10680B6138N614k550J1403O641q217j7556k0088k976l053j898K832l16J121L307
10666D02n741L202J4338m290j2964l964K292M484N793J4893M199K298N679p033
10652B3588j7583j4197P091J0378J0455J672J872p546m528r755J420J0381J0952
10639B4200K678j0771J256m444N932j1043l82Q578j235K353r82m60K010p459j3007
10624b776J2070L5005Q169p233k2297k522R268J9466j3230j1559P270j1743j3372
10611F516M673L179M324N409q629j4303n137Q237L923m839q29j0028Q501P807
10597H804Q126n595j7379o242N2K1081J1187q158q246P867J2187L333o338j7008
10583C671j6803P832m544J11J6083J0262J2266J0495j0534j6433m011r016q366
$$ plain form
10680 26138 31752 29202 40605 47246 39029 21473 1385 -1591 -4644 -6542 -3710 -4026 -2905 402
10666 402 -5339 -2137 12201 7911 -5053 -9017 -6725 -2241 3552 18445 22644 24942 30621 23588
10652 23588 6005 -8192 -1101 9277 19732 21404 23276 15730 11202 1447 2867 13248 24200
10639 24200 26878 16107 17363 12919 18851 7808 7426 16004 14769 17122 16140 15680 17690 10231 -2776
10624 -2776 9294 44299 52468 45235 22938 20416 29684 49150 35920 24361 31631 19888 6516
10611 6516 11189 14368 18692 24101 15472 1169 -3968 4269 8192 3353 2524 -7504 997 8804
10597 8804 16930 11335 -6044 -12286 -12234 8847 20034 11876 3630 11497 23684 27017 20679 3671
10583 3671 -13132 -5300 -9844 -9733 6350 16612 28878 39373 28839 12406 8395 -621 -8987
10570h987j059J1807J4513p752q625j7221J819J4769N782N071P849p876n267J0995
10556A5818l920n627o453j7547O940L141J5225K1809p72L144j2939j8570q340
10543h091J3453K529r808r095j637J5459j6860O957N738q951L454K2122Q616k6290
10529b404j5848k236J7781O008J7482J307j718n030j0775l245J9600L583r4l784
10515B0627k72j1006j5920k71j7440K608N187Q442N726J3724K953M086j7105q234
10501f895K840m031o57o948q133K1848J9723J419o848K989J0541L82K003J4824
10487D3057m973p342k121p563j115K2952j8506j5260K83L199K966P960J2233P220
10473D2990p397j7241r726k638m225j706J8102J5545j6203j4213L260J883j683
$$ plain form
10570 -8987 -10046 1761 16274 8522 -103 -17324 -15505 -736 5046 10117 17966 10090 4823 15818
10556 15818 11898 6271 -182 -17729 -10789 -7648 7577 29386 28614 31758 18819 249 -8091
10543 -8091 5362 7891 -1917 -11012 -12649 2810 -14050 -7093 -1355 -10306 -6852 15270 23886 -2404
10529 -2404 -18252 -20488 -2707 3301 20783 22090 20372 15342 4567 1322 20922 24505 24411 20627
10515 20627 20355 9349 -6571 -6842 -24282 -21674 -16487 -8045 -2319 11405 14358 18444 1339 -6895
10501 -6895 -4055 -8086 -8743 -15691 -23824 -1976 17747 19166 12318 15307 25848 26230 28233 43057
10487 43057 38084 30742 28621 21058 19943 42895 24389 9129 9412 12611 15577 23537 35770 42990
10473 42990 35593 18352 8626 5988 1763 57 18159 33704 17501 3288 6548 8431 6748
10460F748J8080J858n03J1557n357j0799k580m585o390q447m086M438Q464Q580
10446A6978j2146n263N418J1214J8140j4017j6496r176R206J5409J051j2071j0408
10433b161R38n377p929L624K6806J9124j2404j4691j924J0796J4301K636r57q06
10419C1976j0445j3701r492L711L143j1712P534j1418K594J5580r154j43J6568
10406A5041l304L828N923J887n53q614j2916k319P062o249P056M678Q312L150
10392B2982p118n071R139q178j3962j206J2301K1102P132M807j168p436J0778
10379D4102L647M660M863o743k2748k3533j4169l429J3441P403M121Q739N545
10366B5899O526J2901N032j0084k1366n828N399P551m310j8708k068K1568L544
$$ plain form
10460 6748 24828 26686 26183 37740 32383 21584 19004 14419 8029 -418 -4504 -66 8398 16978
10446 16978 4832 -431 4987 16201 34341 20324 3828 -5348 3858 19267 20318 8247 -2161
10433 -2161 -1223 -6600 -14529 -10905 15901 35025 22621 7930 6006 16802 31103 33739 32782 31976
10419 31976 21531 7830 -1662 2049 5192 -6520 1014 -10404 -7810 7770 -1384 -1527 15041
10406 15041 11737 15565 21488 23375 22822 14208 1292 -1027 6035 -214 6842 11520 19832 22982
10392 22982 15864 10793 19932 11754 -2208 -3414 8887 29989 37121 41928 40760 33324 44102
10379 44102 47749 52409 57272 50529 27781 4248 -9921 -13350 91 7494 11615 20354 25899
10366 25899 32425 45326 50358 40274 18908 13080 18479 26030 21720 3012 944 22512 26056
10353B6056j7837l732j356K3123Q667p900n767J4025J7669K078P47j4815K653
10340D3611R052J3992J6170J1896m908P047J7202L9132M5285N3027N5648N9573
10328C66727M9512N4079J5870j4434j2650j6721n2054n5293p0222n2154n4521
10317A58139n1376k8211k0032j475m120j0075r329j5041q695J0148P846j2302
10305A5477k99L010o771r21j272J4267J2576n693k309j8442p007J0963J2221M289
10291C0089m298l951j5350j2963K102M078o765j4844O657J8648J2322j1331q607
10278d213R058N344O088j0067L863L173k120m076o570j587j314J1374l639l918
10264A396l890J3782K4725L188m216j2100M040M243p884j5563o203q413r466p30
$$ plain form
10353 26056 8219 4487 3131 26254 34921 27021 21254 35279 52948 55026 55773 40958 43611
10340 43611 52663 66655 82825 94721 89813 96860 114062 153194 198479 251506 307154 366727
10328 366727 416239 470318 486188 471754 459104 442383 390329 335036 264814 212660 158139
10317 158139 106763 78552 58520 57045 52925 42850 33521 18480 9785 19933 27779 15477
10305 15477 15178 18188 11417 10496 9224 23491 36067 30374 28065 9623 2616 13579 25800 30089
10291 30089 25791 21840 6490 -6473 -4371 -293 -7058 -21902 -15245 3403 15725 4394 -4213
10278 -4213 4845 10189 16277 6210 10073 13246 11126 7050 480 -1107 -2421 8953 5314 1396
10264 1396 -2494 11288 36013 39201 34985 22885 26925 31168 23284 7721 1518 -6895 -16361 -17091
10250a7091L300M179Q676m900P951n452L596r157j1568J993J7780J3484J777j2688
10236A880Q973Q059O069J1172j3365j9788l432R077J267j501J0153n116J1773
10223B5221J3745r802j4256O70m383M790M292O34J779j3229j5980m592k089O849
10209f351J2934N758N056j096K590j3842k3347j563L152J4817L523K3352k035
10196B2948o240j6833j1940O415L350l315O779K724l795R509N702l631o518N427
10182A0582m582L504M497K805L069j1589k585O241M538o916l462j192L335r101
10168h56j2884O12P798J1961M241M421m426L817o881j2490j8562J4552P62M490
10154c445J6494P780L8j8367k3L210N265r37K377K024L961J358j2624R485j3489
$$ plain form
10250 -17091 -13791 -9612 -936 -5836 2115 -3337 259 -8898 -20466 -18473 -693 12791 14568 1880
10236 1880 10853 18912 24981 36153 22788 3000 -432 8645 9912 8411 18564 13448 25221
10223 25221 38966 29164 14908 15578 11195 15985 20277 20911 22690 9461 -6519 -11111 -13200 -6351
10209 -6351 6583 12341 17397 16301 18891 5049 -18298 -19861 -16709 -1892 1631 24983 22948
10196 22948 16708 -125 -12065 -5650 -2300 -5615 1164 3888 93 9602 15304 11673 5155 10582
10182 10582 6000 9504 14001 16806 19875 8286 5701 11942 16480 9564 6102 4910 8245 -856
10168 -856 -13740 -13128 -5330 6631 10872 15293 10867 14684 7803 -4687 -23249 -8697 -7935 -3445
10154 -3445 13049 20829 20867 2500 2477 5687 10952 10015 12392 14416 18377 19735 7111 16596 3107
10139C107N269J0060N455K309Q09l271J5844p505r002K265Q612j1300k0526L697
10125E823N021l096Q976O412n869K719K4j414j619j1346j684k982j0307l324N043
10110g623J200n474k490m801j341P194M740m336m273R099K3498l806O064j029
10096A6622l4093j2473J3330J4088J1125Q336R387l108q360j6473n388N399O973
10083E365j405p264j0692L190J8748R973m546M532J1615l240J139j1104p223q914
10069A74k036n54q934l639Q646J8994l04M676n478l309p413q917q325J2043j154
10054e530p50Q567Q204n652n342l649J0494K509l631o797N248j176Q69n94p461
10039d691j1196J8502J4390j59o173j0027l224J3262L927m332m692n679J6427
$$ plain form
10139 3107 8376 18436 23891 26200 27009 23738 39582 32077 23075 25340 33952 22652 2126 5823
10125 5823 10844 7748 16724 23136 17267 19986 20010 18596 16977 5631 3947 965 -9342 -12666 -7623
10110 -7623 -6423 -11897 -14387 -19188 -20529 -13335 -8595 -12931 -17204 -8105 15393 11587 17651 16622
10096 16622 -17471 -29944 -16614 -2526 8599 16935 26322 23214 14854 -1619 -7007 -1608 5365
10083 5365 3960 -3304 -13996 -10806 7942 17915 13369 17901 29516 26276 27415 16311 9088 174
10069 174 -1862 -2416 -11350 -14989 -6343 12651 12347 17023 11545 8236 823 -8094 -16419 -4376 -5530
10054 -5530 -6280 2287 10491 4839 -503 -4152 6342 8851 5220 -1577 3671 2495 3364 2770 -4691
10039 -4691 -15887 2615 17005 16846 10673 646 -2578 10684 14611 10279 5587 -92 16335
10026A6335N388l671j1549r377M86r574J2758L411j3326o897k082J0440J407k866
10012i117p8O462J743J5350m619J1892r388r473P728j2161k053k680j5922L456
9998a8860P213M70J2814m0p547m631q467j4373K2416K31j261O512N650J8995m617
9983A4505j3108o568k26j6144P676J2990J3217M685n124l183j79J2840l104j4349
9969C928M731K305J530p606n461o95p158P11l621l718J0089L742j5609R767J5551
9954H486R378Q55N903m651J685q243L579J3389N538N580q389q81p081l727j4048
9939G373j513k841R26k152m669M378L439N381N325o722j7375M774L820N040m590
9924E94l885J0058P908p072q520m977Q81L426J9120j0358p095j0347m757j681
$$ plain form
10026 16335 21723 18052 6503 -2874 -2388 -11962 796 4207 -9119 -16016 -18098 -7658 -6251 -9117
10012 -9117 -9195 -2733 -990 14360 9741 21633 12245 2772 10500 -1661 -3714 -6394 -22316 -18860
9998 -18860 -11647 -11177 1637 1597 -5950 -10581 -19048 -33421 -11005 -10774 -12035 -5523 127 19122 14505
9983 14505 1397 -5171 -5397 -21541 -13865 -875 12342 17027 11903 8720 8541 21381 18277 3928
9969 3928 8659 10964 12494 4888 -573 -1268 -8426 -7715 -11336 -15054 -4965 -1223 -16832 -7065 8486
9954 8486 17864 18719 24622 19971 21656 13413 16992 30381 35919 41499 33110 32229 25148 21421 7373
9939 7373 5860 3019 3945 1793 -2876 1502 4941 10322 15647 8925 -8450 -3676 144 5184 594
9924 594 -3291 6767 14675 7603 -917 -5894 -5013 -1587 17533 7175 80 -10267 -15024 -16705
9910a6705K0519J174R58m894n767Q148J625m379Q608l916k1414M221n45R250J8799
9895A5682l306j9998n515l173K3120J0843m065r283r082k176J239O09K278n287
9881h114j0487O582L890Q429P89K897o18j075p605J2540N720R507J868J733r038
9866A7018j3750Q021L579k3446J0726J1179J5244j4846r683O860Q221R819M626
9853C3568j2574j3438Q683J0628J1662Q827R66n112K427n607j1744q981n256l865
9839A0184j3200n866o907n463L994J5637jO794Q437N976j0041j4018J2189N237
9825A2952N510K942R86N885j0288j8201N160L859O967P947o096j1605n415K425
9811C028j464l867P839r433j5446l864O051J2024Q80J9481n230J4382L313k2367
$$ plain form
9910 -16705 3814 4988 5946 1052 -4715 3433 5058 679 9287 5371 -16043 -11822 -12367 -3117 15682
9895 15682 12376 -7622 -13137 -16310 6810 17653 13588 4305 -4777 -6953 -5714 -5105 -2827 -8114
9881 -8114 -18601 -12019 -8129 300 1089 3986 3368 2293 -5312 7228 12948 22455 24323 26056 17018
9866 17018 3268 11289 14868 -8578 2148 13327 28571 13725 4042 10902 19123 28942 33568
9853 33568 20994 7556 16239 26867 38529 47356 48322 43210 45637 40030 28286 19305 14049 10184
9839 10184 -3016 -8882 -15789 -21252 -17258 -1621 -1622 5172 13609 19585 9544 -4474 7715 12952
9825 12952 18462 21404 22390 28275 17987 -214 4946 8805 15772 23719 17623 6018 603 3028
9811 3028 1564 -2303 5536 -3897 -19343 -23207 -17156 -5132 -4252 15229 9999 24381 27694 5327
9797E327q268q421l584o30N569J1944l811l703k536N85P875J470O58O378k788
9782F065j1817J783n077J810O625J816j2557K829K1501M939p197J13O371m312
9768A2892n39L810K942k256j5504j3161P586Q007N936J2175L645j1597p640L874
9754A0170n687n544m810n045K318J4877K669r582p876n979M954l317q354J09J5713
9739e384J1218J2545M804L014k0730j349j4446N079O885N290p200r462j3365o333
9725b9434N249P270J7706L610j29m936N655P442M15o362Q721N283p090j3320o054
9710e974J5021q66J613M897j6230j916j040M735J816j388J126J0479M148j2275
9696D146q672p000n037J4746l996N106n458N070O617J953J751Q56P890n550j0799
$$ plain form
9797 5327 -2941 -11362 -14946 -15576 -10007 1937 -1874 -5577 -8113 -7528 347 1817 2475 8853 6065
9782 6065 -5752 -3969 -9046 -7236 -611 1205 -11352 -8523 12978 17917 10720 10833 17204 12892
9768 12892 12353 16163 19105 16849 1345 -11816 -4230 3777 9713 21888 25533 13936 6296 10170
9754 10170 4483 -1061 -5871 -10916 -8598 6279 8948 -634 -8510 -14489 -9535 -12852 -21206 -21097 -5384
9739 -5384 5834 18379 23183 26197 5467 4118 -10328 -5249 1636 6926 -274 -9736 -23101 -29434
9725 -29434 -24185 -16915 791 4401 4272 -664 4991 12433 12848 6486 15207 20490 13400 80 -5974
9710 -5974 9047 8181 9794 14691 -1539 -3455 -4495 240 2056 668 1794 12273 16421 4146
9696 4146 -4526 -11526 -16563 -1817 -5813 -707 -6165 -1095 5522 7475 9226 10082 17972 12422 1623
9681A623N957O00j2726q762K512j0705r48K116J8657J0564J547j1636J416L391
9667C606j2996k859M08N605j1155o132L475j34M016J5747K18P599M645j4548J33
9652b372j7873p169J470J3717K9803j6641j2072J9540L859k144k364n506L436
9639E684J047J4794j6n56l815j6094K411P282o1q156Q167J864J3892r157k0150
9624b864k0672J79K8182Q51j1410M25K640M450j0966J0617j842l441j1292P467
9610g676K0854K1091m714j6471L557n614N59n446p316j0778k1593n432K7634J8292
9596F947o381J133j2189J3110N335j1502k1509N101P063K877P001N314l684Q829
9582G445k480j4065k944R737O038Q817O174j3646j0398R59K43L408K833L704m450
$$ plain form
9681 1623 7580 8180 -4546 -13308 -10796 -21501 -22449 -20333 -1676 8888 10435 -1201 215 3606
9667 3606 -9390 -12249 -11841 -6236 -17391 -23523 -20048 -20182 -16166 -419 -201 7398 12043 -2505 -2372
9652 -2372 -20245 -27414 -25944 -12227 17576 935 -11137 8403 12262 10118 7754 2248 5684
9639 5684 6731 21525 21509 20953 17138 1044 3455 10737 10676 2520 10687 12551 26443 17286 -2864
9624 -2864 -23536 -23357 4825 5676 -5734 -5309 -2669 1781 -9185 1432 -410 -3851 -15143 -7676
9610 -7676 13178 34269 29555 13084 16641 11027 11586 6140 -1176 -11954 -33547 -38979 -11345 6947
9596 6947 566 1699 -10490 2620 7955 -3547 -25056 -19955 -12892 -10015 -3014 2300 -1384 7445
9582 7445 4965 -9100 -12044 -2307 3731 12548 18722 5076 -5322 -4363 -4120 -712 2121 5825 1375
9567A375o0q409j0155O175L579M799O17J407j0591P343J2167m328J691O593P893
9552B0096Q685j065j0794J0039Q189l556j2464j7029m008J1846L284M879o482
9539A1620l751O192l665k445r45J0890m924k283o609k0467k899K5291L675q030
9525A650K2637n631p800l421j2387p280J6638J4503J2018P713j3439j7236j0483
9512b518p935k977J132J3500L512l582M293O325L240j1776j3738n866J3238L819
9498F67J0156J3096j271M451M544n852k1600j609P809j784m662j917r091M163
9484b900P599m818K209K821N225o325j8184J888j1694N180J1956K325m016J4283
9470E549k803R409p624K564N920L904j7535j0842l362j8284J1966K4267l271j1707
$$ plain form
9567 1375 1315 -7094 -17249 -11074 -7495 -2696 -2079 -672 -11263 -3920 8247 3919 5610 12203 20096
9552 20096 28781 27716 16922 26961 35150 31594 19130 2101 -1907 9939 13223 18102 11620
9539 11620 7869 14061 10396 7951 7006 17896 12972 10689 4080 -16387 -19286 6005 9680 1650
9525 1650 24287 18656 10856 7435 -4952 -12232 4406 18909 30927 38640 25201 7965 -2518
9512 -2518 -10453 -13430 -12298 1202 4714 1132 5425 11750 14990 3214 -10524 -16390 -3152 667
9498 667 10823 23919 22648 27099 31643 25791 4191 2582 10391 8607 3945 2028 -7063 -2900
9484 -2900 4699 -119 2090 4911 10136 3811 -14373 -12485 -24179 -18999 -7043 -4718 -8734 5549
9470 5549 2746 12155 4531 7095 13015 16919 -616 -11458 -14820 -33104 -21138 3129 -142 -11849
9456a1849o44P097m108n974N329J5609M020q470L72j0263R678M278j6029Q426
9442b528K38m974K220J014M457K348L532Q205J552j640o755o184p458j0885J2026
9427d832p1P699k060j6430J4748M321j7886j613J3592J1683j0911j9129J3283
9414g606Q731R59J53k188N53Q097J3787J237j2203l276J2331O201j1411j5696
9400c31O41j1092l735J7154K581K244r727k471O615M042j7635K840P688N376l778
9385D12j7731j611m624J57J1186k05l93N442o708L881O467R296N431p57J800j0038
9369B005J811r761K203P858q089r078P180J2612r632P285Q978j045K706m440q98
9354I695J7614M503k642r869m102j4615j4458n482q216M595P705J8428J4074J1739
$$ plain form
9456 -11849 -12493 -5396 -9504 -15478 -10149 5460 9480 1010 1382 -8881 797 5075 -10954 -2528
9442 -2528 -2290 -7264 -5044 -4030 427 2775 6307 14512 16064 14424 7669 1485 -5973 -16858 -4832
9427 -4832 -4903 2796 736 -15694 -946 3375 -14511 -16124 -2532 9151 -1760 -20889 -7606
9414 -7606 1125 2084 2237 49 602 8699 22486 23723 11520 8244 20575 26776 15365 -331
9400 -331 310 -10782 -14517 2637 5218 7462 -2265 -4736 1879 5921 -11714 -8874 -1186 4190 412
9385 412 -17319 -18930 -23554 -23397 -12211 -12416 -12809 -7367 -14075 -10194 -3727 5569 11000 10243 12043 2005
9369 2005 3816 -5945 -3742 4116 -3973 -13051 -5871 6741 -2891 4394 13372 12327 15033 10593 9695
9354 9695 27309 31812 29170 19301 15199 584 -13874 -19356 -27572 -22977 -15272 3156 17230 28969
9340B8969k252r909m010o332n586j277l469j9814L091J9626O513o088J006K3607
9326B4075Q413j0611j3301l552r055P482m864K203K7465J0841j9134l3729o164
9313a9931J0484P387m661J4047P797m332N116r6j9758r515m960J9140M906O14
9299F238j0021P993J7170j0603o284k745P325Q905j5313j8640J5455O608r605
9286c517j410O959o458J853J5471J4589j9633j0485R394O059j7128o347j1043
9273b1696q56M726P374L712L215J2661M416l419R08M652n085p407J315J886K458
9258H860L628K26k359J3087m419r363j6327m307l67k586J1455J9404O058j8799
9244D191J2352j663q608m006j4228N421J8626q84J446P058J443K188j3939J1157
$$ plain form
9340 28969 26717 16808 12798 6466 880 -397 -3866 -23680 -20589 -963 5550 -538 468 24075
9326 24075 32488 21877 8576 5024 -4031 3451 -1413 790 28255 39096 19962 -13767 -19931
9313 -19931 -9447 -2060 -6721 7326 15123 10791 15907 15811 -3947 -13462 -18422 718 5624 6238
9299 6238 -3783 4210 21380 10777 4493 1748 9073 17978 2665 -15975 -520 6088 -3517
9286 -3517 -4927 2032 -4426 -2573 12898 27487 7854 -2631 6763 12822 -4306 -10653 -21696
9273 -21696 -22552 -17826 -10452 -6740 -3525 9136 13552 10133 11041 15693 10608 3201 4516 6402 8860
9258 8860 12488 12714 10355 23442 19023 9660 -6667 -10974 -11341 -13927 -2472 16932 22990 4191
9244 4191 16543 14880 6272 2266 -11962 -6541 12085 11201 12647 19705 21148 23336 9397 20554
9230B0554R243l641j4061j1792P239o212J0542M161k536n218O993J9172j3900
9217B0544j765K980k0063j2798k054J4190J2250P002k961n488J4082j0658k3329
9204h068O488K0320n5j5838n797o204J0458N570J691M256M055r123O66O774j809
9189A3384o569n149j604L115j536l808r07n066J2725m570j6047r279P748K603
9175a4960R430N852l460K687R385j2977N50l36O147J945J0977o082j785Q593n501
9160A0465j3142j3723K585R258k742K4027J6813p334m188j1806M250R900j2386
9147A1977o362M17J696n166o44o54L57o094J0493L969n042J0400O506p26p140
9132A3987k0072n496J8721J4160j0288l600O163J3739o96j1770j1151l930Q62
$$ plain form
9230 20554 29797 26156 12095 303 7542 1330 11872 16033 13497 8279 15272 34444 20544
9217 20544 18779 21759 1696 -11102 -13156 1034 13284 20286 17325 11837 25919 15261 -8068
9204 -8068 -1580 18740 18685 2847 -2950 -9154 1304 6874 8565 12821 16876 7753 8419 15193 13384
9189 13384 6815 1666 62 3177 1641 -2167 -3074 -8140 4585 15 -16032 -25311 -17563 -14960
9175 -14960 -5530 322 -3138 -451 8934 -4043 -3493 -3829 2318 4263 15240 9158 7373 15966 10465
9160 10465 -2677 -16400 -13815 -4557 -7299 16728 33541 26207 22019 10213 14463 24363 11977
9147 11977 5615 6032 7728 2562 1918 1264 1621 -4473 6020 9989 4947 15347 21853 21127 13987
9132 13987 -6085 -11581 7140 21300 11012 7412 13575 27314 26618 14848 3697 -233 629
9119F29R840N706J983N896l166r146m341m136j5609j805l390k683l525K1444J8078
9104A5775J2095j2691k3598l213o567J1889J5415m289q883m47k282J2274r013
9091c535n471l895J1113P373k510O211P997j1575k065Q710q042k6629J071J6679
9077d568k119q557r566P684P590M672q29K87j892J3398Q967j2311p338J6364N941
9062A7723j4292q934M964l530K909J3626M228K053N141K322l676k403p747l520
9048H864J062M747m036r844l815O01J097J4819J3536J483j2544K15J701L5j0205
9033G716n505p53l217M420J2875Q697j1709k176o853K651N782J2070M497o922
9019B1573k0294j8778R844J7598j603p624O930m453n727o074N860K498N799j7082
$$ plain form
9119 629 10469 16175 18158 24054 20888 11742 7401 3265 -12344 -14149 -17539 -20222 -23747 -2303 15775
9104 15775 27870 15179 -8419 -11632 -18199 -6310 9105 4816 -4067 -4514 -6796 5478 -3535
9091 -3535 -9006 -12901 -1788 5585 3075 9286 17283 5708 3643 12353 4311 -22318 -21247 -4568
9077 -4568 -6687 -15244 -24810 -17126 -9536 -4864 -5693 -5406 -7298 6100 15067 2756 -4582 11782 17723
9062 17723 3431 -5503 -539 -4069 -1160 12466 16694 18747 23888 26210 22534 20131 12384 8864
9048 8864 9926 14673 10637 793 -3022 -2421 -1324 13495 27031 28514 15970 16185 17886 17921 7716
9033 7716 2211 1458 -1759 2661 15536 24233 12524 10348 3495 6146 11928 23998 28495 21573
9019 21573 1279 -17499 -7655 9943 8340 716 7646 3193 -2534 -8608 -2748 -250 5549 -11533
9005a1533o551R87J3140k192K277O689O050M648K056p083q215J196j368L815j407
8990B509l949N833K0962R538j101R58J8118n835j088j3515j0955n211q061R277
8976A7480O528q277j8357o620K944J5428n015j6050R507J5353J433P193j01k2203
8962g57m555R110J5246m951m234Q277O834P85j2844M856K0345J629n841k424r001
8947B2475p785p219m580k384j3308J1485J0930j378M335J0963j0211j3323J459
8934A459J4969j2672p416k693m215J237J7367J8141Q42l609l909k597N328m980
8920A7252n681P009m302L577q440j0248k523q052R569p581j939J053P37n9J0677
8905A049j635j8565n470l899J4285K6085j3212o674O275J8327L739M285K392j4154
$$ plain form
9005 -11533 -18084 -17097 -3957 -6149 -3872 2817 8867 13515 15571 8488 273 1469 101 3916 2509
8990 2509 -1440 4393 25355 34893 33792 34750 52868 47033 45945 32430 21475 16264 8203 17480
8976 17480 24008 15731 -2626 -9246 -6302 9126 4111 -11939 -2432 12921 14354 21547 21446 -757
8962 -757 -5312 3798 19044 14093 9859 18136 24970 25755 12911 17767 38112 39741 33900 31476 22475
8947 22475 14690 7471 2891 507 -12801 -1316 9614 8236 12571 23534 13323 0 1459
8934 1459 16428 3756 -3660 -6353 -10568 -9331 8036 26177 27019 23410 19501 16904 22232 17252
8920 17252 11571 18580 14278 17855 9415 -833 -3356 -11408 -1839 -9420 -11359 -10306 -9569 -9628 1049
8905 1049 -586 -19151 -24621 -28520 -14235 11850 -1362 -8036 -1761 16566 20305 24590 26982 12828
8891A2828j8256N92J598mJ9710M033j4291j2116P785R527o614K852m292j470m080
8876b198J180R197M517J728P690M704J0675K153k559j4775j33Q400m782J204Q694
8861C5695m24l526R03L656N85J1682L0826L8712N9705L3128j7481m7008m5295
8848A01158l3520l3435r423o141r249P33J1120n573j2728J0324q034j6547j2583
8835b3898K766N348m082J4474J1501j0323j5554K882P971k670Q302K912j1J1368
8821A0986P572j4884j9196q976J7095M023L130q328k479J4236R672p129j7726
8808a2004q104m468n800K0856P862k27l996O435M982N861o4j1501q24P33m936
8793e195L79Q120K864J467j048j2290j192J0101j5665l215j1874m136m934O490
$$ plain form
8891 12828 -5428 -4836 -3238 -3242 16468 20501 6210 -5906 1879 11406 4792 7644 3352 1882 -2198
8876 -2198 -1018 8179 12696 14424 22114 26818 37493 39646 37087 22312 22179 30579 25797 27001 35695
8861 35695 35271 31745 32648 36304 36889 48571 79397 118109 177814 210942 193461 146453 101158
8848 101158 67638 34203 24780 18639 9390 10123 21243 15670 2942 13266 5232 -11315 -23898
8835 -23898 -21132 -15784 -19866 -5392 6109 -4214 -19768 -16886 -8915 -11585 -3283 -371 -382 10986
8821 10986 18558 3674 -15522 -24498 -7403 -3380 -250 -8578 -11057 3179 12851 5722 -12004
8808 -12004 -20108 -24576 -30376 -9520 -1658 -1885 -5881 554 5536 11397 11333 -168 -992 -259 -5195
8793 -5195 -4816 3304 6168 7635 6587 -5703 -6895 3206 -12459 -15674 -27548 -31684 -36618 -30128
8779c0128O807L2323L1867J3881j7500j5934q961j3754j5222q640N236N868Q276
8766e881J0155L732p139q698J4173J7075J044j6160P428J1834n1K721q183l403
8752A8647m729n327m518p674M14p02O561M621k343Q722L287l579J909j475j1450
8737B364J1068n57l681l178j1195J571R205P499M931o729m313J0084J1220J616
8723B9905J0858N999j0065k0061N373J6849L357j0024j5989J896J7516J2601K789
8710E1004J4987n003K337j8415j8726K383K628J979q83M831k994j0687R964j341
8696C2064q94j417j0656J691P65R432l574o298O738M310n490l604J5710J7968
8682E6745K081o727P001M022j8342J0873J9180j4526p803j0374P273J7377j106
$$ plain form
8779 -30128 -23321 9002 40869 54750 37250 21316 12355 -1399 -16621 -25261 -20025 -14157 -5881
8766 -5881 4274 8006 867 -7831 6342 23417 24461 8301 15729 27563 27512 30233 22050 18647
8752 18647 13918 8591 4073 -3601 -3187 -3889 2672 7293 4950 13672 16959 13380 15289 13814 2364
8737 2364 13432 12875 9194 6016 -5179 -3608 5597 13096 18027 11298 6985 17069 28289 29905
8723 29905 40763 46762 36697 16636 22009 38858 42215 32191 16202 18098 35614 48215 51004
8710 51004 65991 60988 63325 44910 26184 28567 31195 33174 32291 37122 34128 23441 33405 32064
8696 32064 31170 29753 19097 20788 21553 30985 27411 21113 27851 32161 26671 23067 38777 56745
8682 56745 58826 52099 59100 63122 44780 55653 74833 60307 52504 42130 49403 66780 65674
8669F5674q765K934J3547k806j805n300o66j96N829M743n991m627N907K793j2018
8654E9253m712J9225R708j3713J032j602j800M131j1J619M269J9604M717j2592
8640H9128k765J1701J4387Q676J2678j226p935j0424j3444K085J1027P302n799
8627A15391L419Q649m264k185l025J1519P844N15O143J3420M136R424J8070K3494
8613B12550L4367K5404P522J5681J6349j5660K589K0977L956K1243K791l617j6376
8600C27776j2010r95r145k1093j1442r876l334j921p000p138n811j4756k945P81
8586B21091k091J4326o74o867o514j7836m672j6266j6659j2035j9202k2910k8323
8573H1368p288J094j397l2m619q017j042J428L300k261j4604J1904K288l511K445
$$ plain form
8669 65674 56909 59843 73390 70584 68779 63479 62813 62617 68446 73189 67198 62571 68478 71271 59253
8654 59253 54541 73766 83474 69761 70793 69191 67391 71522 71511 73130 77399 97003 101720 89128
8640 89128 86363 98064 112451 121127 133805 132579 124644 114220 100776 102861 113888 121190 115391
8627 115391 118810 127459 123195 121010 117985 129504 137348 137863 144006 157426 161562 170986 189056 212550
8613 212550 246917 272321 279843 295524 311873 296213 298802 319779 323735 344978 347769 344152 327776
8600 327776 315766 314771 305626 284533 273091 263215 259881 257960 250960 243822 238011 223255 220310 221091
8586 221091 219000 233326 232652 225785 219271 201435 196763 180497 163838 151803 132601 109691 81368
8573 81368 74080 75174 73777 73745 69126 61109 60067 61495 64795 62534 47930 59834 62122 58611 61056
8558F1056R721j1747q635m246J5J296q799J0446J3581k6717j4697q78k247N455
8544B3604l387j4915l468K5206o651j0206J405k032j0696N263N387J4077M590
8531B8177L739j1955j2548j082N409k629M55R028O82k3176L314J3240R935O23
8517B3212j3073j0162J435k0081j0217L499L326M403R699J2549J0959R535q007
8504A7077k1771q868k762n58r679J806K4938Q804M485J3167m912j3534O5J5074
8490B3332j997n492O231M412q630N053Q497n551n553R198j4435k5864j5284J1075
8476a5008J9067K000l710K390J8766K3475p692k0330o807j5881j3441K5504Q537
8463A6870J868J633o572J0029J9342K291k2225r317J0054q3L195j2215k054m841
$$ plain form
8558 61056 70777 59030 50395 46149 46164 47460 38661 49107 62688 35971 21274 20396 18149 23604
8544 23604 20217 5302 1834 27040 20389 10183 11588 9556 -1140 4123 9510 23587 28177
8531 28177 31916 19961 7413 6331 11740 9111 9566 18594 19276 -3900 -586 12654 22589 23212
8517 23212 10139 -23 1412 -18669 -28886 -25387 -22061 -17658 -7959 4590 15549 25084 17077
8504 17077 -4694 -13562 -16324 -16882 -26561 -24755 183 8987 13472 26639 21727 8193 8258 23332
8490 23332 21335 15843 22074 26486 17856 22909 31406 25855 20302 29500 15065 -10799 -26083 -15008
8476 -15008 4059 6059 2349 4739 23505 46980 39288 18958 12151 -3730 -17171 8333 16870
8463 16870 18738 20371 13799 23828 43170 45461 23236 13919 23973 23890 27085 14870 12816 7975
8449G975Q633P164m389o256l808J1501R799q375m49N060p363K369L937M48J0035
8434C6281j0559l652q056M402j4455l130P092P991l986O311Q043O968R763J4755
8420E7768o393j3668j5371N25P07k0487n585J1350J0376m686j2967N363P655j483
8406A3104k044m69m27J2796N199j2652k745J2512L415O78J472L135k8857q009
8392b892K485q917K772N442l05J680O189R711m30j0554l321o91J2668K6057J7941
8377E7835j0653k6879j4128N264n028O311M27J0803L525Q343p065j1894j0527
8364F334N258o414m781N761r923M447k03P54O334M998Q453k0592j93R543p734
8349B042j6242L951J2001N427q501j5770p150J6342q79N296J5682N69M752j0803
$$ plain form
8449 7975 16608 23772 19383 13127 9319 20820 30619 22244 21795 26855 19492 21861 25798 26246 36281
8434 36281 25722 22070 14014 18416 3961 831 7923 15914 11928 18239 26282 33250 43013 57768
8420 57768 51375 37707 22336 22861 23568 3081 -2504 8846 19222 14536 1569 6932 14587 13104
8406 13104 11060 10591 10164 22960 28159 15507 12762 25274 28689 29367 30839 33974 5117 -2892
8392 -2892 -407 -9324 -6552 -1110 -1415 265 6454 16165 15735 5181 1860 1169 13837 39894 57835
8377 57835 47182 20303 6175 11439 6411 12722 13149 23952 27477 35820 28755 16861 6334
8364 6334 11592 5178 397 6158 -3765 682 479 1233 7567 12565 21018 426 233 9776 2042
8349 2042 -14200 -10249 1752 7179 -1322 -17092 -24242 -7900 -8779 -3483 12199 12768 17520 6717
8335F717J6947J3254K818J5287j0733j5983M192j506O30M298J370j8448j9899
8322a056n383o124R307O990P266L709m17k942o994q749O948J2684j169K283O726
8307B3079L477j0529q447p925j626j0640Q599Q476J189O425J240L491J0006l810
8293B3005j9847K025J4326J220J677Q512m822j3010O730R189J2473m252j3030
8280B4196l084l507q388k009n161Q146J024j7932k02j2796l802J2766J5259m821
8266c11r15O712p091Q86L68j121j3126o721k161K227L74K885k38K3109j376k841
8250F60P66m341K0107J4319q445K845m838j0821J719K5727j596m803j3798j4948
8236B553o252p461R837M010M918J002R415O947K388j0329O183Q290j7865j6230
$$ plain form
8335 6717 23664 36918 39736 55023 44290 28307 32499 30993 31623 35921 37291 18843 -1056
8322 -1056 -6439 -12563 -3256 3734 11000 14709 14292 11350 4356 -4393 2555 15239 14070 16353 23079
8307 23079 26556 16027 7580 -345 -1971 -12611 -4012 4464 5653 12078 13318 16809 26815 23005
8293 23005 3158 5183 19509 20729 22406 30918 26096 13086 19816 29005 41478 37226 24196
8280 24196 21112 17605 9217 7208 2047 10193 11217 -6715 -6917 -19713 -23515 -10749 4510 -311
8266 -311 -1226 5486 -1605 -719 -351 -1472 -14598 -21319 -23480 -21253 -20879 -17994 -18232 4877 3501 660
8250 660 1426 -2915 17192 31511 23066 25911 21073 10252 11971 37698 36102 31299 17501 2553
8236 2553 -3699 -11160 -1323 2687 7605 8607 18022 24969 27357 17028 23211 31501 13636 -2594
8222b594p293l470o076J886M052O531Q109j4327J313J7628n885m143R854m634
8208I51K312j117L70J1348R432j2118o779j4476q813J102k313N029O038o094J3369
8193a759J0893R067J0675M343j6229M409p176j6170j6114J3560P949j0038j6750
8180b3340j6055K3380K5340m421J172m377m142J1637j564m77J454k21k188j9063
8166a2865M361J4162n109k913P847Q79P539K087m605n862Q281j4487j5522L5034
8152A8827K0488m47O737K468J3121J0332K6028K6687R413l1707l9802l9923k6801
8139d579J080j0031J6042m96J3870k456j6888P702q070l436l899M438l223j0161
8125b0107R930n87J1190J6038R090q264o899J0633p702k480K497J3524p476o987
$$ plain form
8222 -2594 -9887 -13357 -19433 -17547 -13495 -6964 1145 -13182 -11869 5759 -126 -4269 5585 951
8208 951 3263 2146 2516 13864 23296 11178 4399 -10077 -18890 -17788 -20101 -15072 -9034 -15128 -1759
8193 -1759 9134 18201 28876 33219 16990 21399 14223 -1947 -18061 -4501 3448 -6590 -23340
8180 -23340 -39395 -16015 9325 4904 6076 1699 -2443 9194 7630 7153 8607 8386 6198 -12865
8166 -12865 -8504 5658 549 -2364 5483 6362 13901 15988 11383 5521 13802 -685 -16207 18827
8152 18827 39315 38868 45605 48073 61194 71526 97554 124241 133654 101947 62145 22222 -4579
8139 -4579 -3499 -13530 2512 2016 15886 13430 -3458 4244 -3826 -7262 -11161 -6723 -9946 -20107
8125 -20107 -10177 -10764 426 16464 25554 17290 10391 21024 13322 10842 13339 26863 19387 12400
8111A2400N413N596n214J9434K2547P835J0231J6467L412j8923m0573k6364K376
8098A4637n214l624m973J1784Q280J961J5055q118n825j3807p869l086m224J752
8084c271k979k641p200Q539J1176l551o616n575k046L265m286j1539J3808J9576
8070F660J054k343p67J3940P524J3445M586m232j0448m797M108j5892m34O414
8056A8818j4885j5365Q698Q990J3716J6583r881k411J9953K352j7012j8256N060
8043A6360K8778J2336Q433J9401L004K275J8454K5799J425L164Q193m573o28o886
8029A35535n82j596J574L744J3801n416j6338L211q409j6719k695j217j0543N296
8015I9646K642J0368l66K35M340J19J5764O269K990n698p262J3681J3362P841
$$ plain form
8111 12400 17813 23409 18195 37629 60176 68011 78242 94709 98121 79198 38625 12261 14637
8098 14637 9423 5799 826 12610 20890 22851 37906 29788 23963 10156 2287 -799 -5023 -3271
8084 -3271 -6250 -8891 -16091 -7552 3624 73 -6543 -12118 -14164 -10899 -15185 -26724 -12916 6660
8070 6660 7714 5371 4604 18544 26068 39513 44099 39867 29419 24622 28730 12838 12404 18818
8056 18818 3933 -11432 -2734 6256 19972 36555 26674 24263 44216 46568 29556 11300 16360
8043 16360 45138 57474 65907 85308 88312 90587 109041 134840 136265 139429 147622 143049 142421 135535
8029 135535 134953 133357 134931 138675 152476 147060 130722 133933 125524 108805 106110 104893 94350 99646
8015 99646 102288 112656 112290 112525 116865 116984 132748 139017 142007 136309 129047 142728 156090 163931
8001A63931J5672J9498K1196K2492L6922O2064R2831J05832O0836l9826q9193
7990D72255j02054q1367n0029r621K317J3790J9919N4625O3731M4108q004p8208
7978C41462q9756o6194l3532l1809k2595j9379j3205K089Q973N33k0715o003J6450
7965F6319J5968Q842J8094J0664r491j5442N642K0825J4126K7196J1457K1780
7953A95980M1131M4087M9302L7285J9788j6927l4170l4298k5331j7775j4425j2714
7941B31933L8103O8587L4521k3491o7997o1575m4420l9248k9215j6832n606j7757
7929F7003l4064o393K3261p262l651j3043m661J4664R135J714l744Q493O10m29
7915E1633Q278L076J838J6713R7J0502K9184K6293j033j6014j4846n233j2851
$$ plain form
8001 163931 179603 199101 220297 242789 279711 341775 434606 540438 601274 561448 472255
7990 472255 370201 288834 238805 229184 231501 245291 265210 319835 383566 427674 419670 341462
7978 341462 251706 185512 151980 120171 97576 78197 64992 67081 76054 76587 55872 49869 66319
7965 66319 82287 91129 109223 119887 110396 94954 100596 121421 135547 162743 174200 195980
7953 195980 237111 281198 330500 367785 387573 370646 336476 302178 276847 259072 244647 231933
7941 231933 270036 338623 373144 349653 281656 220081 175661 136413 107198 90366 84760 67003
7929 67003 32939 26546 49807 42545 38894 25851 21190 35854 44989 46703 42959 51452 52062 51633
7915 51633 59911 62987 64825 81538 81635 92137 121321 147614 146581 130567 115721 110488 97637
7902I7637j3512j4432j3225L214K824o568l919k1017j6543P660J4317L301j5988
7889B3749j459j0403j7282j7019R524O358j027j318L37j667J1918J0973n330q186
7875h32k877k419N53J5076K0668J299k4656j5046K887J3679n95m606r064M146
7861a787J3360n824n224m903m513j1016l126P157P706j1709J253j472j1445M987
7847b6556R470j5127j0547J672J4383J0160n187j607O430M241J0313p054j5242
7834b4651p658j870J4575Q448J0300J3788m676k7010r111Q945J2206m804J0937
7821e81N751J06m096P583N396q77o404k541j920j8153R735j1022J0175M759J390
7806f99k319M849N183k538o426j1766p996n291l687K669m444p623o760Q330J4808
$$ plain form
7902 97637 84125 69693 56468 59682 62506 55938 52019 31002 14459 22119 36436 39737 23749
7889 23749 22290 11887 -5395 -22414 -12890 -6532 -7559 -8877 -8540 -10207 1711 12684 7354 -832
7875 -832 -3709 -6128 -5575 9501 30169 31468 6812 -8234 -5347 8332 7737 3131 -5933 -1787
7861 -1787 11573 5749 525 -4378 -8891 -19907 -23033 -15876 -8170 -19879 -18626 -20098 -31543 -26556
7847 -26556 -17086 -32213 -42760 -41088 -26705 -16545 -21732 -23339 -16909 -12668 -2355 -9409 -24651
7834 -24651 -32309 -34179 -19604 -11156 -856 12932 8256 -18754 -27865 -18920 -6714 -11518 -581
7821 -581 5170 5276 1180 8763 14159 13282 6878 4337 2417 -15736 -6001 -17023 -6848 -2089 -699
7806 -699 -3018 1831 7014 4476 -1950 -13716 -21712 -27003 -30690 -28021 -32465 -40088 -46848 -38518 -23710
7791b3710K5411M149j2630k140k487l85J2433j934j6652j7310K20J3237K818L2
7777a8948J0619J4069M442j148k872k442K4993J7562j3015j6927p667m781j350
7764B535l449p866O028N87J6508J048j7159j1459p787J2584K0383P352j6176j760
7750A369M181j7000K520J5949l097l761k37K378j8223l843O907K922j647m993
7736a6575M80J662J8588J0380Q767l419k0898k8997m724J2950J2781m932j4259
7723b8196j0894P580J5549R096o591o982O927J4600K1577j0972j0451k434n653
7710f844J5519J7973N555j3455k7715j0118R832K244J2012N172j7098j3307P806
7697a2424J3036J4125j1934j2592o881J4218j560j4032R249L257O187j4498j4824
$$ plain form
7791 -23710 1701 5850 -6780 -8920 -11407 -11792 641 -1293 -17945 -35255 -35035 -21798 -18980 -18948
7777 -18948 -8329 5740 10182 9034 6162 3720 28713 46275 33260 16333 8666 3885 2535
7764 2535 -914 -8780 -2752 -2165 14343 15391 -1768 -13227 -21014 -8430 11953 19305 3129 1369
7750 1369 5550 -11450 -8930 7019 3922 161 -76 2302 -15921 -19764 -12857 -9935 -11582 -16575
7736 -16575 -16095 -14433 4155 14535 23302 19883 -1015 -30012 -34736 -21786 -9005 -13937 -28196
7723 -28196 -39090 -31510 -15961 -6865 -13456 -20438 -13511 1089 22666 11694 1243 -1191 -6844
7710 -6844 8675 26648 32203 18748 -8967 -19085 -9253 -7009 5003 10175 -6923 -20230 -12424
7697 -12424 612 14737 2803 -9789 -16670 -2452 -4012 -18044 -8795 -5538 649 -13849 -28673
7684b8673P09J7596J1826J025q436m087P083q1J215L315P95m366p704j00J1017
7669A134J5537K119N136o858o903j2577r230J2468M332j7018q419J2540J0928
7656C189O046m103l574j517K215r74p214j4776N656K921j192R059l544J22n402
7641a3088j1665L879J88o167k049J943J4401J1223J1047r585j1061P64n846m251
7627b0267O182K416n286L083k772k604K169l785J8749J6643O634n252m73pj0506
7612D924j663m298O523q622j3200J2285O787p049j9003j1937j2086J0547N566
7599c1226J4n895o628N426N906J3665N519j2178j6551n185Q273J6408l059o879
7585c2390K80K0612r298q183o81N520J3513Q090P744P514m041q693R45j518L107
$$ plain form
7684 -28673 -27964 -10368 1458 2483 -5953 -10040 -2957 -3038 -1823 1492 2287 -2079 -9783 -9883 1134
7669 1134 16671 18790 23926 17068 10165 -2412 -11642 826 5158 -11860 -20279 -7739 3189
7656 3189 9235 5132 1558 41 2256 1282 -5932 -20708 -15052 -12131 -13323 -4264 -7808 -7686 -13088
7641 -13088 -24753 -20874 -20686 -26853 -28902 -26959 -12558 -1335 9712 127 -10934 -10170 -16016 -20267
7627 -20267 -14085 -11669 -16955 -13872 -16644 -19248 -17079 -20864 -2115 14528 21162 15910 15437 15430 4924
7612 4924 3261 -1037 5486 -3136 -16336 -4051 2736 -4313 -23316 -35253 -47339 -36792 -31226
7599 -31226 -31212 -37107 -43735 -38309 -32403 -18738 -13219 -25397 -41948 -47133 -38860 -22452 -25511 -32390
7585 -32390 -32110 -11498 -20796 -28979 -29660 -24140 -10627 -2537 5207 12721 8680 -13 932 -586 2521
7570B521o904l034J1299K21J0504j7348j0306M9M916P496j85o326j3741O79O155
7555a4004r971M069L280J1648J7810n537k954p496k5098j3842J94Q078P695P318
7541a8810j1669j0856J1871K4841j418m545o297Q4l63N498Q353j3268o952O751
7527a6780m507Q627J6113l311j1371j127J4953Q391K303r058q797p560n922K0738
7513B692J3665l618j5706j8517K012O822P917L652J186J1684l234q0j2403p46
7499d674q302M887J5960q934j2024r129j2506m645J5220N594j2816l417K146q43
7485c3483K350J1982N16J1568j349j1491J1390J7210J3919J179r57j4536j8241
7472i943j2672L482L157n430J1398P768j0782j0749m564J0325n228M101j840n122
$$ plain form
7570 2521 -4383 -7417 3882 4103 14607 -2741 -13047 -12998 -8082 -586 -771 -7097 -20838 -20159 -14004
7555 -14004 -23975 -19906 -16626 -4978 12832 7295 4341 -3155 -28253 -42095 -41901 -33823 -26128 -18810
7541 -18810 -30479 -41335 -29464 -4623 -6041 -10586 -16883 -16799 -17162 -11664 -3311 -16579 -23531 -16780
7527 -16780 -21287 -12660 3453 142 -11229 -12356 2597 10988 13291 4233 -4564 -12124 -18046 2692
7513 2692 16357 12739 -2967 -21484 -19472 -12650 -4733 -1081 105 11789 8555 8475 -3928 -4674
7499 -4674 -12976 -8089 7871 -1063 -13087 -22216 -34722 -39367 -24147 -18553 -31369 -34786 -32640 -33483
7485 -33483 -31133 -19151 -18635 -7067 -8416 -19907 -8517 8693 22612 23791 22834 8298 -9943
7472 -9943 -22615 -19133 -15976 -21406 -10008 -2240 -13022 -23771 -28335 -18010 -23238 -19137 -20977 -26099
7458b6099O831J4081K005J528r110j6461o183R872M281m572n313l668O283J2452
7444a4073J928j23o11O7o258m652k081N049J1950n778J895R38j711j0079j373
7429b4912Q774m120M072J1020J0204L052j1280M020j2252K50J4956m17n093M948
7415C222O037k385N747j690q075j2124r591M549Q939J6839n438j1497n087m253
7401a4807R114N769j2851L372J247q575p047k411J4600K541N849N152p405k233
7387g685j4111j2193J1944K5504R796j5393K101o242k565o312P055l561O360M604
7373f98k833j8788L358J6178J1393k788j7097j684p51o029k366K743Q965P18q234
7358a7913m916o862j1541M528N096P505p230N600J270r29K0969J4175K283n752
$$ plain form
7458 -26099 -19268 -5187 -3182 -1654 -10764 -27225 -33408 -23536 -19255 -23827 -29140 -32808 -26525 -14073
7444 -14073 -12145 -12268 -12879 -12812 -19070 -23722 -25803 -20754 -8804 -14582 -12687 -11749 -13460 -23539 -24912
7429 -24912 -16138 -20258 -16186 -5166 5038 8090 -3190 830 -11422 -11172 3784 3367 -1726 3222
7415 3222 9259 6874 12621 10931 2856 -9268 -18859 -14310 -5371 11468 6030 -5467 -10554 -14807
7401 -14807 -5693 76 -12775 -9403 -8156 -16731 -23778 -26189 -11589 -9048 -3199 1953 -5452 -7685
7387 -7685 -21796 -33989 -22045 3459 13255 -2138 -37 -6279 -8844 -15156 -8101 -11662 -5302 -698
7373 -698 -3531 -22319 -18961 -2783 8610 5822 -11275 -12959 -13710 -19739 -22105 -19362 -10397 -9679 -17913
7358 -17913 -22829 -29691 -41232 -36704 -31608 -24103 -31333 -25733 -24463 -25392 -4423 9752 12035 6283
7344F283L771J2371o86m520j5543j4570j0323N515J0561l980J0714O258L486j0264
7330i27N539j677p531m058K607o598K525o496M378n837j6361J250L997J4696k36
7315a4729j731J195O868J260r83P039P349l691r911j1258L888J2182R752o282
7301I48j2799k2053J508J9835R642j3784M118J4817N580L843l344j4949l192P745
7287b085k83N62o683m236p58n180m256J2424J99Q937N094P53j4701j1304k924
7272b4441J6418Q333P782Q074m377j3853P912R354P126O58j6985q197q22l467
7258f485o89P039j2282l112L131j0511r212K266j549k545N373j340l355J939Q570
7243b2762O805j314j2931K1351J5535N365K435n095k965N77J905j4200k2176m970
$$ plain form
7344 6283 10054 22425 21739 17219 1676 -12894 -23217 -17702 -7141 -11121 -407 5851 9337 -927
7330 -927 4612 2935 -4596 -8654 -6047 -12645 -10120 -16616 -12238 -18075 -34436 -33186 -29189 -14493 -14729
7315 -14729 -16460 -15265 -8397 -7137 -8120 -1081 6268 2577 -7334 -18592 -14704 -2522 7230 948
7301 948 -11851 -33904 -32396 -12561 -2919 -16703 -12585 2232 7812 11655 8311 -6638 -9830 -2085
7287 -2085 -2368 -1806 -8489 -12725 -13483 -18663 -22919 -10495 -10296 -1359 3735 4488 -10213 -21517 -24441
7272 -24441 -8023 310 8092 16166 11789 -2064 5848 15202 22328 22986 6001 -2196 -3018 -6485
7258 -6485 -7174 -135 -12417 -15529 -12398 -22909 -32121 -29855 -31404 -33949 -28576 -29916 -33271 -31332 -22762
7243 -22762 -15957 -17271 -30202 -8851 6684 12049 14484 9389 6424 7001 8906 -5294 -27470 -32440
7229c2440J7623J60O892L449k146O133l462j1586R28O45J1345J2044l086r576
7215c077l579k0658M596J8012o494N889N082l996m316m955k004j3193k717J1990
7201a9420K3148K7328Q039j1941m637r939p129j8515n849J3456m628r897j4474
7188c4458k0338l353R087K4872P698Q431R802J071J0910n242j5163m031O907P686
7174C879J2519j3525p315O119J5370L2144J875j7160j5998m358M530P170M740
7161B9990j772k492n970r025n83J7077l009k272r918q835O962M75j2931L524K764
7146C985L157n308M834j2737q630K043J452M873o903j5464M234J4341Q191L219
7132A287R406j1766n058Q892o629l072J6490K230O952r024n823P076j1807j2516
$$ plain form
7229 -32440 -14817 -14657 -7765 -4316 -6462 -329 -3791 -15377 -14449 -13804 -2459 9585 6499 -3077
7215 -3077 -6656 -27314 -22718 -4706 -11200 -5311 -229 -4225 -8541 -13496 -15500 -28693 -31410 -19420
7201 -19420 3728 31056 39095 27154 22517 12578 5449 -13066 -18915 -5459 -10087 -19984 -34458
7188 -34458 -54796 -58149 -49062 -24190 -16492 -8061 1741 2812 13722 8480 -6683 -10714 -3807 3879
7174 3879 16398 2873 -4442 1677 17047 49191 51066 33906 17908 13550 18080 25250 29990
7161 29990 28218 25726 19756 10731 10148 27225 24216 21944 12026 3191 10153 10628 -2303 1221 3985
7146 3985 7142 1834 6668 -6069 -14699 -12656 -11204 -6331 -13234 -28698 -24464 -10123 -1932 1287
7132 1287 10693 -1073 -6131 2761 -3868 -6940 9550 11780 18732 9708 3885 10961 -846 -13362
7118a3362M281K320m301p318Q718N787n39P925J901N814Q349N781m155j8645l260
7103g04J2455q463j3848j1377L869J2604k531j2691j0144K212N434J1276n265
7090a7173r194K799P626k475m204l738J930l373K0968R870N35k453K262j153L87
7075B614k799R245O031n554j3069p738O984R059l07L250L130j9129j3240o290
7061b7813j2506K425R30J2768J7755Q088n704n052K667P227P734o080L535K967
7047H941J209N40j738L293m320k1392j1435J1390J5796j4697j2754L615K150P913
7033a1489P217j807O565m175M130M563j3439l153J3770K0804j6393j1163m52P242
7019B220p680R58R110O347n842m178j1030J08O248n183o266p143j4131l193J4639
$$ plain form
7118 -13362 -9081 -6761 -11062 -18380 -9662 -3875 -4414 3511 5412 11226 19575 25356 21201 2556 -704
7103 -704 11751 3288 -10560 -21937 -18068 -5464 -7995 -20686 -30830 -28618 -23184 -11908 -17173
7090 -17173 -26367 -23568 -15942 -18417 -22621 -26359 -24429 -27802 -6834 3036 3571 1118 3380 2227 2614
7075 2614 -185 9060 15091 9537 -3532 -11270 -4286 4773 4466 7716 10846 -8283 -21523 -27813
7061 -27813 -40319 -37894 -36964 -24196 -6441 1647 -4057 -9109 -6442 785 8519 2439 5974 8941
7047 8941 10150 10690 8952 12245 7925 -13467 -24902 -13512 2284 -12413 -25167 -21552 -19402 -11489
7033 -11489 -4272 -6079 486 -3689 441 5004 -8435 -11588 2182 22986 6593 -4570 -5022 2220
7019 2220 -5460 -4502 4608 10955 5113 935 -10095 -9987 -3739 -8922 -15188 -22331 -36462 -39655 -25016
7004b5016J1782J601m303j6578k451J1408P582K7826k830j5950l71L69M456P496
6990E021j7798j1782Q657K511J4615J0776Q197o127k655P45j983o675j794N670
6976G378l233J335q702j8713J0498O481L580m237l116j1821k59k450q918j0814
6962d2991q329J3704J2756J3410L881L16m15R811P223r688j219p731o348o669
6948b2289k378P248J87J3034M741n855O257l21j6629j0818J2437J3980L563l217
6934f0j9881j953K0744o735n33l978K541M991J1025J689j8904k995J2279L910
6920B140j1214n237K0236R500j0087q981L524p919L857O914N442m148j1577n198
6906a2748N287N443k004j1650R71K199p310m786J0319J7155j342j8512o42J2509
$$ plain form
7004 -25016 -13234 -11633 -15936 -32514 -34965 -23557 -15975 11851 9021 -6929 -7300 -6931 -2475 5021
6990 5021 -12777 -24559 -15902 -13391 1224 12000 20197 14070 11415 12160 10177 3502 1708 7378
6976 7378 4145 5480 -3222 -21935 -11437 -4956 -1376 -5613 -8729 -20550 -20809 -23259 -32177 -42991
6962 -42991 -51320 -37616 -24860 -11450 -7569 -7253 -7668 2143 9366 -322 -1541 -9272 -15620 -22289
6948 -22289 -24667 -17419 -17232 -4198 543 -5312 945 624 -16005 -26823 -14386 -406 3157 -60
6934 -60 -19941 -21894 -1150 -7885 -8418 -12396 -9855 -4864 6161 7850 -11054 -14049 -1770 2140
6920 2140 -9074 -14311 5925 15425 5338 -3643 -119 -8038 -4181 2733 8175 4027 -7550 -12748
6906 -12748 -7461 -2018 -4022 -15672 -14701 -12502 -19812 -24598 -14279 2876 1534 -16978 -17620 -5111
6892e111J847m206M361K207j1063n040J1465O016j3466P316J096l109o75J4020
6878E658j1170q432l633L373J0484l34l753L567R301P71o665N911q69R960J507
6863A5676p856j0799o552j0632J9040J5885n814j1796O745L008l456j574O035
6850G910q318j1715O862R996J3309K344j6073j9241%J0049K1287N120k129o600
6836A2801r813n935K495N120n320j517J0N392K983n140J943Q551j0875j5012j9238
6821c3555O071R810J6643J4360N384l830k8376k053N701J2263j208j1608r847
6808b0245P27J004n858p603J4843M551P645Q386n680N310J0680M14j033K09m595
6793H755k0633K781R241j1902p227J5764J460j7849r516j549J421J707J5511J4273
$$ plain form
6892 -5111 -3264 -7470 -3109 -902 -11965 -17005 -5540 476 -12990 -5674 -4578 -7687 -8362 5658
6878 5658 -5512 -13944 -17577 -14204 -3720 -4054 -7807 -4240 5061 5832 -833 5078 4209 14169 15676
6863 15676 7820 -2979 -9531 -20163 -1123 14762 8948 -2848 3897 6905 3449 1875 7910
6850 7910 -408 -12123 -5261 4735 18044 20388 4315 -14926 -14926 -4877 16410 21530 19401 12801
6836 12801 2988 -2947 -452 4668 -652 -2169 -2159 3233 6216 1076 3019 11570 695 -14317 -33555
6821 -33555 -27484 -17674 -1031 13329 18713 14883 -13493 -15546 -9845 2418 1210 -10398 -20245
6808 -20245 -19518 -18514 -24372 -31975 -17132 -12581 -4936 3450 -2230 3080 13760 14174 13141 13350 8755
6793 8755 -11878 -9097 144 -11758 -18985 -3221 -1761 -19610 -29126 -30675 -29254 -27547 -12036 2237
6779B237j3882j0098J1519o497J3802J330l787k321j1974l4R892M521M664O553
6765E925J7141p617j0828q258o252P672j3280j0194J658Q347N846m27m512p91
$$ plain form
6779 2237 -11645 -21743 -10224 -16721 -2919 -1589 -5376 -7697 -19671 -19705 -9813 -5292 -628 5925
6765 5925 23066 15449 4621 -3637 -9889 -2217 -15497 -25691 -24033 -15686 -9840 -10267 -14779 -15570
$$ [...]
##END NTUPLES=NMR SPECTRUM
##END=
