##TITLE=Analysis number 317249
Compound Code cc 46904
Book Reference 422/149
Project Code adrs
Chemist Name robb
##JCAMPDX= 6.0         $$ Bruker NMR JCAMP-DX V2.0
##DATA TYPE= NMR SPECTRUM
##DATA CLASS= NTUPLES
##ORIGIN= Bruker BioSpin GmbH
##OWNER= nmr
$$ XWIN-NMR		Version 3.5
$$ Tue Feb 14 08:38:38 2006 GMT Standard Time (UT+0h)  MAYBRIDGE\nmr@NMR_250MHZ
##.OBSERVE FREQUENCY= 250.131544655141
##.OBSERVE NUCLEUS= ^1H
##.ACQUISITION MODE= SIMULTANEOUS (DQD)
##.ACQUISITION SCHEME= undefined
##.AVERAGES= 16
##.DIGITISER RES= 18
##SPECTROMETER/DATA SYSTEM= dpx250
##.PULSE SEQUENCE= zg30
##.SOLVENT NAME= CDCl3
##.SHIFT REFERENCE= (INTERNAL, CDCl3, 0, 16.4617)
##AUDIT TRAIL= $$ (NUMBER, WHEN, WHO, WHERE, WHAT)
$$ ##TITLE= Audit trail, XWIN-NMR		Version 3.5
$$ ##JCAMPDX= 5.01
$$ ##ORIGIN= Bruker BioSpin GmbH
$$ ##OWNER= nmr
$$ C:\u/data/dgb/nmr/ADRS/15960/pdata/1/auditp.txt
$$ ##AUDIT TRAIL=  $$ (NUMBER, WHEN, WHO, WHERE, WHAT)
(   1,<2006-02-14 08:38:15.19 +000>,<MAYBRIDGE\nmr>,<NMR_250MHZ>,
      <created by zg, POWCHK disabled, PULCHK disabled
       configuration hash MD5:
       84 BC 41 DB A1 6E 1D 46 DA 25 12 A5 C1 ED C5 3A
       data hash MD5: 64K
       47 99 E0 58 7E BE 67 6F A2 B9 51 C9 AA 19 88 EC>)
(   2,<2006-02-14 08:38:27.54 +000>,<MAYBRIDGE\nmr>,<NMR_250MHZ>,
      <Start of raw data processing
       ef LB = 0.3 FT_mod = 6 PKNL = 1 SI = 32K 
       data hash MD5: 32K
       74 30 E3 62 B6 DE DD 9B 76 39 6A EC 6E 12 04 5D>)
(   3,<2006-02-14 08:38:29.47 +000>,<MAYBRIDGE\nmr>,<NMR_250MHZ>,
      <apk 
       data hash MD5: 32K
       4D 94 38 9D A2 79 0E 62 F3 4A 8E B0 A4 90 34 55>)
(   4,<2006-02-14 08:38:30.18 +000>,<MAYBRIDGE\nmr>,<NMR_250MHZ>,
      <abs ABSG = 5 
       data hash MD5: 32K
       1C BA EA 78 64 90 C9 6A 53 DA 79 8A 86 DF C4 37>)
$$ ##END=
$$ 
$$ hash MD5
$$ 43 D1 33 37 7D C7 33 99 F8 14 4C 49 D0 CD CF 3E
##$RELAX= 
##$RELAX= 
##$RELAX= 
##$RELAX= 
##$RELAX= 
##$RELAX= 
##$RELAX= 
$$ Bruker specific parameters
$$ --------------------------
##$DU= <C:\u>
##$EXPNO= 15960
##$NAME= <ADRS>
##$PROCNO= 1
##$TYPE= <nmr>
##$USER= <dgb>
##$AMP= (0..31)
100 100 100 100 100 100 100 100 100 100 100 100 100 100 100 100 100 100 
100 100 100 100 100 100 100 100 100 100 100 100 100 100 
##$AQSEQ= 0
##$AQ_mod= 3
##$AUNM= <au_zg>
##$AUTOPOS= <4 >
##$BF1= 250.13
##$BF2= 250.13
##$BF3= 250.13
##$BF4= 250.13
##$BF5= 500.13
##$BF6= 500.13
##$BF7= 500.13
##$BF8= 500.13
##$BYTORDA= 1
##$CFDGTYP= 0
##$CFRGTYP= 5
##$CHEMSTR= <none>
##$CNST= (0..31)
1 1 145 1 1 1 1 1 1 1 1 1 1 1 1 1 1 1 1 1 1 1 1 1 1 1 1 1 1 1 1 1 
##$CPDPRG= <>
##$CPDPRG1= <>
##$CPDPRG2= <>
##$CPDPRG3= <>
##$CPDPRG4= <mlev>
##$CPDPRG5= <mlev>
##$CPDPRG6= <mlev>
##$CPDPRG7= <mlev>
##$CPDPRG8= <mlev>
##$CPDPRGB= <>
##$CPDPRGT= <>
##$D= (0..31)
0 1 0 0 0 0 0 0 0 0.06 0 0 0 0 0 0 0.0002 0 0 0 0 0 0 0 0 0 0 0 0 0 0 
0 
##$DATE= 1139906294
##$DBL= (0..7)
120 120 120 120 120 120 120 120 
##$DBP= (0..7)
150 150 150 150 150 150 150 150 
##$DBP07= 0
##$DBPNAM0= <>
##$DBPNAM1= <>
$$ [...]
##$SUBNAM7= <"">
##$SUBNAM8= <"">
##$SUBNAM9= <"">
##$SW= 20.6930455092707
##$SWIBOX= (0..15)
0 0 3 0 0 0 0 0 0 0 0 0 0 0 0 0 
##$SW_h= 5175.983436853
##$TD= 65536
##$TD0= 1
##$TE= 294.16
##$TE2= 300
##$TE3= 300
##$TEG= 300
##$TL= (0..7)
0 120 120 120 120 120 120 120 
##$TP= (0..7)
150 150 150 150 150 150 150 150 
##$TP07= 0
##$TPNAME0= <>
##$TPNAME1= <>
##$TPNAME2= <>
##$TPNAME3= <>
##$TPNAME4= <>
##$TPNAME5= <>
##$TPNAME6= <>
##$TPNAME7= <>
##$TPOAL= (0..7)
0.5 0.5 0.5 0.5 0.5 0.5 0.5 0.5 
##$TPOFFS= (0..7)
0 0 0 0 0 0 0 0 
##$TUNHIN= 0
##$TUNHOUT= 0
##$TUNXOUT= 0
##$USERA1= <user>
##$USERA2= <user>
##$USERA3= <user>
##$USERA4= <user>
##$USERA5= <user>
##$V9= 5
##$VALIST= <valist>
##$VCLIST= <CCCCCCCCCCCCCCC>
##$VD= 0
##$VDLIST= <DDDDDDDDDDDDDDD>
##$VPLIST= <PPPPPPPPPPPPPPP>
##$VTLIST= <TTTTTTTTTTTTTTT>
##$WBST= 1024
##$WBSW= 4
##$XGAIN= (0..3)
0 0 0 0 
##$XL= 0
##$YL= 0
##$YMAX_a= 374393
##$YMIN_a= -345626
##$ZGOPTNS= <>
##$ZL1= 120
##$ZL2= 120
##$ZL3= 120
##$ZL4= 120
##$ABSF1= 16.4617
##$ABSF2= -4.231472
##$ABSG= 5
##$ABSL= 3
##$ALPHA= 0
##$AQORDER= 0
##$ASSFAC= 0
##$ASSFACI= 0
##$ASSFACX= 0
##$ASSWID= 0
##$AUNMP= <proc_1d>
##$AZFE= 0.1
##$AZFW= 0.1
##$BCFW= 0
##$BC_mod= 0
##$BYTORDP= 0
##$COROFFS= 0
##$CY= 12.5
##$DATMOD= 1
##$DC= 0
##$DFILT= <>
##$DTYPP= 0
##$F1P= 14.0000005364418
##$F2P= -0.99999901652339
##$FCOR= 0.5
##$FTSIZE= 32768
##$FT_mod= 6
##$GAMMA= 0
##$GB= 0
##$INTBC= 1
##$INTSCL= 1
##$ISEN= 128
##$LB= 0.3
##$LEV0= 0
##$LPBIN= 0
##$MAXI= 10000
##$MC2= 0
##$MEAN= 0
##$ME_mod= 0
##$MI= 0
##$NCOEF= 0
##$NC_proc= -2
##$NLEV= 6
##$NOISF1= 0
##$NOISF2= 0
##$NSP= 0
##$NTH_PI= 0
##$NZP= 0
##$OFFSET= 16.4617
##$PC= 1
##$PHC0= 96.29184
##$PHC1= 5.735277
##$PH_mod= 1
##$PKNL= yes
##$PPARMOD= 0
##$PSCAL= 4
##$PSIGN= 0
##$REVERSE= no
##$SF= 250.130015081373
##$SI= 32768
##$SIGF1= 0
##$SIGF2= 0
##$SINO= 400
##$SIOLD= 32768
##$SREGLST= <1H.CDCl3>
##$SSB= 0
##$STSI= 32768
##$STSR= 0
##$SW_p= 5175.98343685301
##$SYMM= 0
##$S_DEV= 0
##$TDeff= 65536
##$TDoff= 0
##$TI= <Analysis number 999999
Compound Code 99
Book Reference 9
Project Code 9>
##$TILT= no
##$TM1= 0
##$TM2= 0
##$TOPLEV= 0
##$USERP1= <user>
##$USERP2= <user>
##$USERP3= <user>
##$USERP4= <user>
##$USERP5= <user>
##$WDW= 1
##$XDIM= 32768
##$YMAX_p= 358332744
##$YMIN_p= -36932
$$ End of Bruker specific parameters
$$ ---------------------------------
##NTUPLES= NMR SPECTRUM
##VAR_NAME=  FREQUENCY,     SPECTRUM/REAL,   SPECTRUM/IMAG
##SYMBOL=    X,             R,               I
##VAR_TYPE=  INDEPENDENT,   DEPENDENT,       DEPENDENT
##VAR_FORM=  AFFN,          ASDF,            ASDF
##VAR_DIM=   32768,         32768,           32768
##UNITS=     HZ,            ARBITRARY UNITS, ARBITRARY UNITS
##FACTOR=    0.157963299565203, 1,           1
##FIRST=     4117.56537918545, 0,            0
##LAST=      -1058.41805766756, 0,           0
##MIN=       -1058.41805766756, -36932,      0
##MAX=       4117.56537918545, 358332744,    0
$$ Real data points
##PAGE= N=1
##DATA TABLE= (X++(R..R)), XYDATA
$$ [...]
19727e250L869j413P28p79L696m389M40Q788k111n427k106l80O8j494o036o546
19711a8342q58L597M479m867J662p72j869K503l790j979L133J493M708K820O405
19696a677K460m854j978m731J874j542L981O966m140n296j1001K140K044j310
19682a7064j637r38O815L41K702O889K921k508M318m037n099o516M078j165M745
19667f155J0406K364k519n080J62m643k05l132m097j535r90L123J278J1558O229
19652F764k290l430k671R47N050L249O07l366o654j171N088O754m32n901k279
19637B65n394k466K04M728M942o719K491O665J90l519j0199m313n333j1Q41M059
19621a3569N540L438M165p49n964k983N560L718J301n055j206Q868o788m580O665
$$ plain form
19727 -5250 -1381 -2794 -2066 -2845 851 -3538 -3098 5690 3579 -1848 -3954 -4334 -4266 -5760 -11796 -18342
19711 -18342 -19200 -15603 -11124 -15991 -14329 -15101 -16970 -14467 -18257 -20236 -17103 -15610 -10902 -8082 -1677
19696 -1677 783 -4071 -6049 -10780 -8906 -10448 -6467 499 -3641 -8937 -19938 -17798 -15754 -17064
19682 -17064 -18701 -19639 -12824 -12483 -9781 -2892 29 -2479 1839 -2198 -7297 -13813 -9735 -10900 -6155
19667 -6155 4251 6615 4096 -984 -822 -5465 -5670 -8802 -12899 -14434 -15424 -12301 -11023 535 6764
19652 6764 4474 1044 -1627 -680 4370 7619 8226 4860 -1794 -2965 2123 8877 8445 2544 265
19637 265 -5129 -7595 -7391 -2663 2279 -4440 -1949 4716 4906 1387 -8812 -13125 -18458 -18469 -17628 -13569
19621 -13569 -8029 -4591 -426 -1175 -7139 -10122 -4562 -844 457 -4598 -5804 3064 -3724 -8304 -1639
19606a639o93m307O473J080o836l148L45l347m097P65O626L553n841k799J387
19591a2478K752k03K793J807K397m393L759J085J808m140R52l852l118K661k362
19576a0532J093l182m215K528M777m063j089P891J885j850n744j339L285l079
19562a3634m202J315Q492J0381N704l216k759m67J416N032n770o098n176K232
19548f750M911N9n33R28L487n825q54L495l670J664L953m373L834L732m547p317
19532g806m679J952J703M567J596J980m448n483k150K914P409M688L396k520l265
19517a46M467m002K055L301q193n885m216O16L34J422l09Q189J1756j148L36l772
19501D805q715p349L669J860M219K630L800l06J356m145o407J010J671j747Q648
$$ plain form
19606 -1639 -2332 -6639 -166 914 -5922 -9070 -8725 -12072 -16169 -15404 -8778 -5225 -11066 -13865 -12478
19591 -12478 -9726 -9929 -7136 -5329 -2932 -7325 -3566 -2481 -673 -4813 -3861 -7713 -10831 -8170 -10532
19576 -10532 -9439 -12621 -16836 -14308 -9531 -13594 -14683 -6792 -4907 -6757 -12501 -13840 -10555 -13634
19562 -13634 -17836 -16521 -8029 2352 8056 4840 2081 1614 3030 8062 2292 -3806 -8982 -6750
19548 -6750 -1839 -1780 -2313 -1385 2102 -3723 -4577 -1082 -4752 -3088 865 -3508 326 4058 -489 -7806
19532 -7806 -12485 -10533 -8830 -4263 -2667 -687 -5135 -10618 -12768 -9854 -2445 2243 5639 3119 -146
19517 -146 4321 319 2374 5675 -2518 -8403 -12619 -12003 -11669 -10247 -10556 -2367 9389 8241 8577 4805
19501 4805 -3910 -11259 -7590 -5730 -1511 1119 4919 4613 5969 1824 -4583 -3573 -1902 -3649 4999
19486D999j35p4p046l469l532r9K999L723J718l005m429Q860K134l873q05L24
19470a710j369j804M040J318k46J728q39l576K272n59K39m697j210l5k395m361
19454a3204M221K021J360n712J581J5193K192r38k509l32j37r64l74n77k756M014
19438C079N965m491p095p20O75K657o500k080L096K164L561j480k941J728K635
19423B53p151p313L37R291J20k102J264M000J965J134J511j974K026m552o527
19408g718J08q37P278N944K330m628k232K722L012N133l511m196J140r57m974
19393a386J62N54O041j462m100l344J6L139p80r907m658N690M179L777L529K023
19377C473m883k345p30k065k103P926Q51o845q532l394J032L644J530J641j447
$$ plain form
19486 4999 4864 4790 -2256 -5725 -9257 -9356 -6357 -2634 -916 -3921 -8350 510 2644 -1229 -2034 -1710
19470 -1710 -3079 -4883 -843 475 229 1957 1118 -2458 -186 -745 -506 -5203 -6413 -6448 -8843 -13204
19454 -13204 -8983 -6962 -5602 -11314 -9733 5460 7652 6714 4205 3873 3736 2772 2398 1821 -935 3079
19438 3079 9044 4553 -2542 -3262 -2587 70 -6430 -8510 -5414 -3250 311 -1169 -4110 -2382 253
19423 253 -6898 -14211 -13874 -4583 -4463 -6565 -5301 -1301 664 1798 3309 1335 3361 -1191 -7718
19408 -7718 -7610 -8447 -1169 4775 7105 2477 245 2967 5979 11112 7601 3405 4545 3588 -1386
19393 -1386 -1224 -670 5371 3909 -191 -3535 -3519 -380 -1160 -11067 -15725 -10035 -5856 -2079 1450 3473
19377 3473 -1410 -3755 -4485 -6550 -8653 -727 124 -6721 -15253 -18647 -17615 -13971 -12441 -10800 -12247
19362a2247m340RQ473L066N02J954j675n295N210R385m87l989j207L750J996j100
19346D005N212M047N019k642o664p674k693K534r716p906K991K522L79L119J631
19331e836j956p62P73q376p800R440N281O442l363m51O717L076M052L054l227
19316G064r511k552m360J655O473r436n02O965Q854K982n966n832l72j118L621
19301b035K139k621j493L939K213k651n339N6J545M967k429O030J949K907l061
19286F116l354j112m535L083L093r38k886K657M550p299p349L954j791J413M977
19271E79j01m345k971M208O520M103j66K379q544q330k266j263p9k069m635L819
19255a3161j401J592J1049N262n379m131o207q252K959M657O431L326k307K376
$$ plain form
19362 -12247 -16587 -16578 -8105 -5039 -4537 -2583 -4258 -9553 -4343 5042 4555 566 -641 3109 5105 4005
19346 4005 9217 13264 18283 15641 8977 1303 -1390 1144 -8572 -16478 -13487 -10965 -10586 -7467 -5836
19331 -5836 -7792 -8554 -7781 -16157 -23957 -14517 -9236 -2794 -6157 -6608 109 3185 7237 10291 7064
19316 7064 -2447 -4999 -9359 -7704 -1231 -10667 -11169 -4204 4650 7632 1666 -4166 -4538 -5656 -2035
19301 -2035 104 -2517 -4010 -71 2142 -509 -5848 -5792 -4247 720 -1709 4321 6270 9177 6116
19286 6116 2762 1650 -2885 198 3291 2353 -533 2124 6674 -625 -7974 -4020 -5811 -4398 579
19271 579 478 -3867 -6838 -2630 3890 7993 7827 10206 1662 -6668 -8934 -10197 -10276 -12345 -16980 -13161
19255 -13161 -14562 -12970 -1921 3341 -2038 -6169 -12376 -20628 -17669 -13012 -6581 -3255 -5562 -3186
19241c186j561m8L172P72O175Q038k633r127j1055J245O657Q33j955K004J814
19226A145K009k279m646k157j334L811N390P773k267m717j713Q113N232k458n584
19211F318J276K537k160o392J384Q830J6865P637R670K0822M2907N3450L2662
19198A95806J196n174J6868K4470m450l1997k8280k0516K909L6604L4487K359
19186B24282j0567m174N741O012k6092m1137l9002k6775k2894j2410j2873j4082
19174B6029j4939n630J059O739Q86q143M699L045P782j315K392k78n222J130L616
19159B1850m759k870l249L783L697m378J386N836J261m461p17Q64m456m238k110
19144G439N658p368o180N419J099j921m749n856k592L441O552K247o817O165L198
$$ plain form
19241 -3186 -4747 -4795 -1623 -851 5324 13362 10729 1602 -9453 -8208 -1551 -718 -2673 -669 1145
19226 1145 3154 875 -3771 -5928 -7262 -3451 1939 9712 7445 2728 1015 9128 14360 11902 6318
19211 6318 7594 10131 7971 1579 2963 11793 28658 36295 45965 66787 109694 163144 195806
19198 195806 197002 191828 208696 233166 228716 196719 168439 147923 150832 187436 221923 224282
19186 224282 213715 209541 215282 221294 195202 154065 115063 88288 65394 52984 40111 26029
19174 26029 11090 5460 6519 13258 14144 6001 10700 13745 21527 20212 22604 22326 17104 18234 21850
19159 21850 17091 14221 10972 14755 18452 14074 15460 21296 22557 18096 17379 18243 13787 9549 7439
19144 7439 13097 5729 -451 4968 6067 4146 -603 -6459 -9051 -5610 942 3189 -3628 2537 5735
19129E735q304K938O934M265L312n640q71L946k640Q335J152o113n543L279O476
19114A7261m249K588j041j934k083j0389l141O584L245j874o89J893K788q941
19100A8j130J757L084r4r10k748J914K744k577m421n43L524O964K619n976k053
19084B172L013k848n358K596q31p637o534J021n729M362N377L8O744p86O81O042
19068B323m766j306L374k798o128m13P233n47n7O177R003l675m453o62n594O41
19052a648P90N746J258k523P203L287p765q12N2j099O532l58q456j372K601N075
19036H511M358N651n312j76p227p521j393k989N049R695O804k091o217l680p420
19021c958j599l227j04j944J206O290k764j755O966j424m423j056K751M840l40
$$ plain form
19129 5735 -2569 369 7303 11568 14880 9240 8369 12315 9675 18010 19162 13049 7506 10785 17261
19114 17261 13012 15600 14559 12625 10542 153 -2988 3596 6841 4967 4278 6171 8959 18
19100 18 -1112 645 3729 3635 2725 -23 1891 4635 2058 -2363 -2906 618 7582 10201 4225 2172
19084 2172 5185 2337 -3021 -425 -1256 -8893 -15427 -14406 -20135 -15773 -10396 -10358 -3614 -4400 -3719 2323
19068 2323 -2443 -3749 -375 -3173 -9301 -9714 -2481 -3028 -3085 3092 12095 8420 3967 3305 -2289 -1648
19052 -1648 -858 4888 6146 3623 10826 14113 6348 5536 5588 4489 11021 10663 2207 835 3436 8511
19036 8511 12869 18520 13208 13032 5805 -1716 -3109 -6098 -1049 8646 15450 13359 7142 3462 -3958
19021 -3958 -5557 -8784 -8888 -10832 -9626 -3336 -6100 -7855 -889 -2313 -6736 -7792 -5041 -201 -541
19006e41p863J383k774m614L01l563j30J419R199J804m276J808M117L657m64q646
18990i183P336M11m211O09L373p441K434O494p821l357M291R427M151J400l658
18975D255m69k79j610M2M259k490J217m46j0621k10L097O260M789j849L68J340
18959G653o59J356l44j429J091K383q248j1020qL44k974N877M599M61j827K377
18943c68Q358P840m124J7M972l10M53m937k344K112k655K989l015J429k38k069
18927H110n048j524P53O636Q285J357p312q352R3m4j462M714K32k364K874m66
18911F482o560N28O095p087J152J622o097Q38j965R3M460K451J5137q80j1553
18896D716n078K247P645N169j194M592m548n492O97p52r08o35k968j496j967l2
$$ plain form
19006 -541 -8404 -7021 -9795 -14409 -14108 -17671 -17801 -16382 -7183 -5379 -9655 -7847 -3730 -73 -537 -9183
18990 -9183 -1847 -1436 -5647 -5038 -1665 -9106 -6672 -178 -7999 -11356 -7065 2362 6513 7913 4255
18975 4255 3786 3507 1897 1939 6198 3708 4925 4479 -6142 -6352 -3255 3005 7794 5945 6313 7653
18959 7653 6994 8350 8006 6577 7668 10051 1803 -9217 -9225 -8881 -11855 -5978 -1379 -918 -2745 -368
18943 -368 7990 15830 11706 11723 16695 16385 16838 11901 9557 11669 9014 12003 8988 10417 10179 8110
18927 8110 3062 1538 2291 8927 17212 18569 11257 2905 2998 2954 1492 6206 6438 4074 6948 6482
18911 6482 -78 450 6545 -542 610 2232 -3865 -3027 -4992 -4899 -439 2012 17149 16269 4716
18896 4716 -362 1885 9530 14699 13505 18097 13549 8057 8754 8002 7094 6459 3491 1995 28 -4
18880dr46Q391J0237q9n334M408N952m640j1488J994P574K318J857O338n22q780
18864A7266N53J920K942p74j922L409p9n372l659j485k05k989o375j231j707K161
18848B453P143j043m087m355Q963l455o319L268n860L226K429k682j387J949J799
18833B042L981J737M578j92r558k457J719O270l530l706J782L168M313J1910J5321
18818C7378J5524J0567N964M447j32o896r767q167j561n449n79j384q92m835q846
18803B5372m41K376k29M420M438m214J634l38O88M263j945m408m100k605q581
18788A6330m420n60R80O152L513K638k180n832K385L07l472J108K426M422J96
18773B3993q592m431Q575Q170k527L570L635P813J3852L1818J5383j4168j4002
$$ plain form
18880 -4 -950 7441 17678 17589 12255 16663 22615 17975 6487 8481 16055 18373 20230 26568 26046 17266
18864 17266 17819 19739 22681 21907 19985 23394 23315 17943 14284 12799 12594 9605 3230 1999 292 2453
18848 2453 9596 8553 4466 111 9074 5619 -700 2568 -3292 -66 2363 -319 -1706 243 2042
18833 2042 6023 7760 12338 12146 2588 131 1850 8120 4590 884 2666 5834 10147 22057 37378
18818 37378 52902 63469 69433 73880 73748 66852 57085 48918 47357 41908 41329 39945 39053 34218 25372
18803 25372 24931 27307 27078 31498 35936 31722 33356 33018 33706 37969 36024 31616 27516 24911 16330
18788 16330 11910 11350 12330 18482 21995 24633 22453 16621 19006 19313 15841 16949 19375 23797 23993
18773 23993 15401 10970 19545 27715 25188 28758 32393 40206 54058 85876 101259 87091 73089
18760G3089j4882j2904j1134n457o588l952J846k351L877L640J136r95j4397q351
18746B577j0332J741L088M527l73n37P2K247J310k413j0324j330O182L677k133
18731b021J920m02M457O843j288r518K86k044K160M455Q69M4K298l3R33m546l705
18714G08j150l300l705M73M499J687N39o987j184N66O006M602m62l923m907M006
18698b532L997J542k90L966K275M005Q42j215P193p247r84Q259Q18O615J139o514
18682B1869q112L063J2410M656j6666j6290J0620J9838J8362R686J009j3975P83
18669D7253M728R530l691k0455r20J1002j505K828N68J086J770m119m643j374
18655D2058m991j800N707L101o635j3607N411R748K352m152m848p5M976L859M162
$$ plain form
18760 73089 58207 45303 34169 28712 22124 18172 20018 17667 21544 25184 26320 25325 10928 2577
18746 2577 -7755 -6014 -2926 1601 1228 691 763 3010 4320 1907 -8417 -9747 -3565 112 -2021
18731 -2021 -101 -503 3954 10797 9509 -9 277 -1767 393 4848 5717 5761 8059 8026 8959 4413 708
18714 708 -442 -3742 -7447 -6974 -2475 -788 -249 -7236 -8420 -7854 -1848 2754 2292 -1631 -6538 -2532
18698 -2532 1465 3007 2717 6683 8958 12963 13805 12590 19783 12536 11552 19811 20629 27244 28383 21869
18682 21869 13757 16820 29230 33886 17220 930 11550 31388 49750 59436 60445 46470 47253
18669 47253 51981 61511 57820 37365 36445 47447 45942 48770 49338 50424 52194 48075 43432 42058
18655 42058 37067 35267 40974 44075 37440 23833 29244 38992 41344 37192 32344 32269 37245 41104 45266
18640D5266l217M67P238n460K063r7K258M609l883l865M427J339L985N078N88
18625F0796j296L539N024m48k186O489k199n844N828Q559L086k744n13Q58M561
18610H3510K581k359K49P961K953O928J365Q852J3227K0839K7001M3021N5014
18597B71142K9943M909R723J6734J9916k560j8088j5667n522K3495N0600N3370
18585D37995K6049J3904K8904P4300Q4363N5387J1266J0026O2583R4773O6159
18574I65709J9916K2630N8854R4572J18223J40859J63545J93669K86183M28438
18564B492598N78637P37186J074524J781995L197127N921676R722423R226561
18556C4732727J977077j293627L38212L623519K884170l599931n768175n254554
$$ plain form
18640 45266 42049 42516 49754 44294 46357 46260 48518 53127 49244 45379 49806 51145 55130 60208 60796
18625 60796 59500 63039 68063 67615 65429 71918 69719 63875 69703 78262 81348 78604 78091 78949 83510
18610 83510 86091 83732 83981 91942 94895 101823 103188 112040 125267 146106 173107 216128 271142
18597 271142 301085 305994 315717 332451 352367 349807 331719 316052 310530 334025 384625 437995
18585 437995 464044 477948 506852 581152 665515 720902 732168 742194 804777 899550 965709
18574 965709 985625 1008255 1067109 1161681 1279904 1420763 1584308 1777977 2064160 2492598
18564 2492598 3071235 3808421 4882945 6664940 9862067 15783743 25506166 34732727
18556 34732727 36709804 35416177 35754389 39377908 42262078 38662147 32893972 27639418
18548B7639418k823275K657909P815000N520788j141022k023154L83811L194905
18540D1224380k76867o263494p486610p671349o280424l923450k248811j362378
18532E710997r33662o91054n22199l86031k96257k43149k18453k09882j76883
18523B033427j36492p4215q1620j29257j25995r7931o7924o2694n7693n5230p5835
18512A068541q4374o6997l8843k3255m3577o8061o0751m6040j7092l365M646j8039
18500F02793k6776k6794j1056j2530l8999n5263m9043m0363k9898k5100k4747
18489B62224j6651o455j0039j5409j9642r737l532n944m660K718k667k955j0403
18476A56848p691j853j0705o764m263n093l799k827m937j581P463M668M385J683
$$ plain form
18548 27639418 24816143 27474052 35289052 40809840 39668818 37645664 38029475 41224380
18540 41224380 40947513 34684019 27197409 19526060 13245636 9322186 7073375 5710997
18532 5710997 4777335 4086281 3564082 3178051 2881794 2638645 2420192 2210310 2033427
18523 2033427 1896935 1822720 1741100 1611843 1485848 1387917 1319993 1257299 1199606 1144376 1068541
18512 1068541 984167 917170 878327 855072 811495 743434 682683 636643 619551 616186 620832 602793
18500 602793 576017 549223 538167 525637 486638 431375 382332 341969 312071 286971 262224
18489 262224 245573 239118 229079 213670 194028 184291 180759 174815 170155 172873 170206 167251 156848
18476 156848 149157 147304 136599 129835 125572 120479 116680 113853 108916 107335 114798 119466 123851 125534
18462A25534p596k269m46r901j094j323j3146l459j556P284N108p574m823J067
18448H5806K527O981l035q743n489j591j714m349j0723j303l945j306K754o268
18434D9602n843Q234J8378j531j5529q968L266J5761P754k405l98p014M229K0146
18420H5682K5923K643q778o839R982J8425q27j3746k792k557p451j05m770o455
18406H8335K995L377K380M8m929k781p591l315m375q394j0675j1435p64L209R572
18391E5657k616M076L065m482l660m474j765M258M033p448M017N629m859p707
18377D3724o358oj360R08m297n113P024Q562R950K506k385k252K18l830j0446
18362C6845K306J0187K175l70P735J0287M130L78q913m94N382L708l670p466N134
$$ plain form
18462 125534 117938 115669 115223 105322 104228 102905 89759 86300 84744 92028 97136 89562 84739 85806
18448 85806 88333 95314 92279 83536 78047 76456 74742 70393 59670 58367 54422 53116 55870 49602
18434 49602 43759 51993 70371 68840 53311 44343 47609 63370 71124 68719 68321 61307 65536 85682
18420 85682 111605 114248 105470 98631 108613 127038 126211 112465 109673 107116 99665 99560 94790 88335
18406 88335 91330 94707 97087 97135 92206 89425 81834 78519 74144 65750 55075 43640 42876 46085 55657
18391 55657 53041 57117 60182 55700 52040 47566 45801 50059 54092 46644 50661 56290 51431 43724
18377 43724 37366 37360 36000 36908 32611 27498 34522 43084 53034 55540 53155 50903 51121 47291 36845
18362 36845 39151 49338 51513 51143 58878 69165 73295 73673 64760 64266 69648 73356 69686 62220 67354
18347F7354R598J931j0186l233n184m972j561J984o71l305j932q710n287j294
18333C4532l417n553L24O17l827J516N082N200K130k861P34M081Q12o659o180
18318B6531j233l798l496O479pO072M096j052K040Q77p600j618K564O667k263
18303C4259M674Q974J0942J1867K590l804q272j4577j4860j196j663n099k031
18290B1804j506k589L936K399o0P225Q956k051j0909k395m489n513m456j373m273
18275D706N456R501J6747Q857l74l651j2743r929j34L506j315p62K674j27P934
18260C0346J768m517m276p173K472j57L741K654j399p171q374n507l689M065N249
18245H032R351R607M496k45m38l804n743R29l387M810O894O329L026O213J237
$$ plain form
18347 67354 76952 78883 68697 65464 60280 55308 53747 55731 55060 51755 49823 41113 35826 34532
18333 34532 31115 25562 25886 26503 22676 24192 29274 34474 36604 33743 34477 38558 39370 32711 26531
18318 26531 25298 21500 18004 24483 24476 30548 34644 33592 35632 36509 28909 27291 29855 36522 34259
18303 34259 38933 47907 58849 70716 73306 69502 61230 46653 31793 30597 28934 23835 21804
18290 21804 20298 17709 21645 24044 23984 31209 40165 38114 27205 24810 20321 14808 10352 8979 4706
18275 4706 10162 19663 36410 45267 44893 41242 28499 18570 18436 21942 20627 19865 22539 22412 30346
18260 30346 32114 27597 23321 16148 18620 18463 22204 24858 23459 16288 7914 2407 -1282 2783 8032
18245 8032 17383 26990 31486 31241 30803 26999 21256 22185 18798 23608 30502 36831 39857 46070 47307
18230D7307j3637J653l905P79J056l940m478P257o62K980P223L897N690M001N307
18215F0528p923j3847o186j736o184M73K122j528N54N988m545j865N240P555M665
18200D3311Q849J4804J2489J0523J2739Q98o026m134R912J9764L8467O6367R5213
18187C23176J07443Q5467L2423k8703p6444r7182q6583p0029n1363l2742j6377
18176H9086j0984q881p475r158r062p595l247P317m321r876p520J1198L170m480
18162B8172n610L88N26j520n159N219M275J124M532j524p882M806J399m671K655
18147B6730K225l891L65Q157M324R17J946M084K029l723K78p84N37r26l514O056
18131D4810M684K443J0220J3973L418J675N364K943J0414J3937J4663J3613J6867
$$ plain form
18230 47307 33670 35323 31418 32197 33253 29313 24835 32092 31430 34410 41633 45530 51220 55221 60528
18215 60528 52605 38758 32572 30836 24652 25125 27247 25719 26273 32261 27716 25851 31091 38646 43311
18200 43311 52160 66964 79453 89976 102715 103613 97587 93453 103365 123129 161596 227963 323176
18187 323176 430619 516086 548509 519806 443362 346180 259597 189568 138205 105463 89086
18176 89086 78102 69221 61746 52588 43526 35931 32684 40001 35680 25804 18284 29482 32652 28172
18162 28172 22562 22950 23476 21956 16797 22016 26291 27415 31947 30423 22541 27347 28746 24075 26730
18147 26730 28955 25064 25429 33586 37910 38827 40773 44857 46886 43163 43441 42657 43194 42268 38754 44810
18131 44810 49494 51937 62157 76130 79548 81223 86587 89530 99944 113881 128544 142157 159024
18118A59024L6450L8124M2403N3262O7086J02806J36374K01910L10626M96817
18108A644882Q91025J769043L567695N126391J453310k430946k719364l176761
18100F125275k428271j348701p09763m01891k57652j79248j21760j02831p5993
18091D99165n3045m8022m0528l0672k6741l6079l3592k5733k8184j6809j5580
18080A44180n478k254p799p925k964Q53j0492j5744o288K870J174p615p051j1818
18066F3649k675K877m172l407L14k264l264n172l669p810n020o210L3o10K152
18051B4752L569p838p7j047k670L137Q09P36J498K235L856P739n218j0070q862
18036A2549k364j586L119J1662J730l209k314j910L254K320o589q510J793J144
$$ plain form
18118 159024 195474 233598 276001 329263 396349 499155 635529 837439 1148065 1644882
18108 1644882 2535907 4304950 7872645 12999036 14452346 12021400 9302036 6125275
18100 6125275 3697004 2348303 1638540 1236649 978997 799749 677989 575158 499165
18091 499165 446120 398098 357570 326898 300157 264078 230486 204753 176569 159760 144180
18080 144180 138702 136448 128649 120724 117760 118613 108121 92377 86089 88959 90133 82518 75467 63649
18066 63649 60974 63851 59679 56272 56586 54322 51058 45886 42217 34407 29387 23177 23210 22600 24752
18051 24752 28321 20483 20406 19359 16689 19826 20635 21371 22869 25104 28960 36699 31481 21411 12549
18036 12549 10185 8599 11718 23380 25110 21901 19587 17677 20931 23251 16662 8152 9945 11089
18022A1089J141j254J597J751N709Q651M194j0936o872O860M537k838L913k129
18008B5413r63m447o846O912k880m178O297N109O38k631k385k349N931M882K983
17993C1486m011J926r764o272j365k67N782M950m228l105j0312j442N623O577
17979A5578J2682n243k738k058K822o49K433N972J462n442J136P385m520m832
17965B3988k540k879k005m320n687k627j94J2167J1898K09o154N82P616M215N465
17950C9734j282q97j580j758K779j011r911k583L194P20L35l252m294N2L186l565
17934A9867j931P045M479P70k43J120k291j387k943O37n43J420K584K332K206
17919C3122k89m952K309l096L588L867K584L456J875J1690J7628K2837L1320N2785
$$ plain form
18022 11089 12230 10976 12573 14324 20033 28684 32878 21942 15070 21930 26467 23629 27542 25413
18008 25413 24450 20003 13157 20069 17189 13011 19308 24417 25055 22424 20039 17690 23621 28503 31486
17993 31486 27475 29401 19637 13365 12000 11733 17515 22465 18237 15132 4820 3378 9001 15578
17979 15578 28260 23017 20279 18221 21043 20394 22827 28799 30261 24819 25955 33340 28820 23988
17965 23988 21448 18569 16564 12244 6557 3930 3736 15903 27801 28010 21856 22438 30054 34269 39734
17950 39734 38452 37555 35975 34217 36996 35985 26074 23491 26685 27405 27740 24488 20194 20246 23432 19867
17934 19867 17936 24981 29460 30230 29987 31107 28816 27429 24486 25123 24580 26000 28584 30916 33122
17919 33122 32833 27881 30190 27094 30682 34549 37133 40589 42464 54154 71782 94619 125939 178724
17905A78724L4610k032k885J7677J8148m607k8508l1849j9579J1455K9230L3533
17893B33917Q811j6640K418J5448Q676k6717l8013l8704m2495l0897j8715j4948
17881D2141j785N737m445j491K386o250q641n276R67Q083R996P933P889Q841J29
17866F6214p401p332q242m23m014m266j063L316p132j1277p06l622P104J567q00
17851B1923N807L445r540j0908M021P916N72q564n876N4L972O214k674j0007L621
17836I976J0068j998J313N521l152j060l706J409K602J439o101p649k855L426
17822I233N586Q205m23j1248j477N513N863q720n440K677l356M44q25l120J623
17807D535J0625J223j0741m984J628k754l746L046M856O625N907M915l092r859
$$ plain form
17905 178724 213334 211302 208417 226094 244242 239635 211127 179278 159699 171154 200384 233917
17893 233917 242728 226088 228506 243954 252630 225913 187900 149196 106701 75804 57089 42141
17881 42141 40356 46093 41648 40157 42543 36293 27652 22376 23343 31426 41422 49355 57244 66085 66214
17866 66214 58813 51481 43239 42816 38802 34536 33473 36789 29657 18380 17674 14052 21156 22723 21923
17851 21923 27730 31175 21635 10727 14748 22664 23236 14672 8796 8850 12822 19036 16362 6355 9976
17836 9976 20044 18046 19359 24880 21728 20668 16962 18371 20973 22412 16311 8662 5807 9233
17822 9233 14819 23024 22601 11353 9876 15389 21252 12532 7092 9769 6413 6857 6032 2912 4535
17807 4535 15160 16383 5642 658 2286 -468 -4214 -1168 3688 10313 16220 21135 18043 8184
17793H184m467l214K693J717q02P207J5306K5924K6890L0460J2378j0284k3113
17780H8879k1336k4873k0043j2879p155M214R724N541R09r065l745R090M385J52
17766B3798L685J056o885m21l899m248m259K547J562l021k852k207k686K751P881
17751A2802K813L412M996N656K827J0690J4043O580q503j2976r248m573N19O809
17737C5847J2027J4617M980Q428N97m130n856l498k185N442K644j4055k831J766
17723E3793m478m588n532k758K551O709j011o321l48J207N789k321n844J661M812
17708D3321K917k269K921J860o509k378J3168o86O42k451K764K336L43r2Q984
17693F4871L760J05j478P906N364M862P114M246O945Q194O389J3068L1306L5981
$$ plain form
17793 8184 3717 503 3196 4913 4111 11318 26624 52548 79438 109898 122276 111992 88879
17780 88879 67543 42670 22627 9748 2593 6807 16531 22072 22981 13916 10171 19261 23646 23798
17766 23798 27483 28539 21654 21233 17334 13086 8827 11374 12936 9915 7063 4856 2170 4921 12802
17751 12802 15615 19027 24023 29679 32506 43196 57239 63819 55316 42340 33092 28519 29038 35847
17737 35847 47874 62491 67471 75899 76496 72366 66510 63012 60827 66269 68913 54858 52027 53793
17723 53793 49315 44727 39195 36437 38988 45697 44686 38365 38017 39224 45013 42692 36848 38509 43321
17708 43321 46238 43969 46890 48750 42241 39863 53031 52345 52987 50536 53300 55636 55979 55887 64871
17693 64871 68631 68736 67258 75164 80528 85390 92504 96750 103695 111889 118278 131346 162652 198633
17679A98633M0260L5335N142P581J2240K609k0103l5658m0373l1310j7456p006
17667A49894k074j426N234K580J2053K7436K3746K5352K7218M7984M8442K6321
17655C92760P968O195K1561J6161K468n219k641n862o047P972K2591L1191O3719
17642E52817R1878J36078J60221J67915J37023R3983N7043M2782M9661P7175J21544
17631A688120J78455K62278L45375M16736M74253N57660P15224J009277J497379
17622G144757K295491L677906O143215J0368784J5984799K0013072J8995557J2057052
17614I6680633J049448j0027704j7105596j8394599j5645256j1455043p477204
17607A7624679m623323k896081j908969j303906r14273o61000n06809m19913l88788
$$ plain form
17679 198633 238893 274228 279370 286951 299191 301800 281697 246039 205666 174356 156900 149894
17667 149894 147820 146394 151628 154208 166261 193697 217443 242795 270013 317997 366439 392760
17655 392760 400728 406923 428484 444645 447113 441894 439253 433391 427344 435316 457907 489098 552817
17642 552817 644695 780773 940994 1108909 1245932 1339915 1396958 1439740 1489401 1566576 1688120
17631 1688120 1866575 2128853 2474228 2890964 3365217 3922877 4638101 5647378 7144757
17622 7144757 9440248 13118154 19261369 29630153 45614952 65628024 84623581 96680633
17614 96680633 97730081 87702377 70596781 52202182 36556926 25101883 17624679
17607 17624679 13001356 10105275 8196306 6892400 5978127 5317127 4810318 4390405 4001617
17598D001617l86439l76925l52290k99806k42873j71147j04737n6984l6221o7026
17588A907169j11166j47154j71106j64346j49398j23032r5884p3234n2674m2504
17578G76671m8064m5649m6013m9147l8771l8586l3934k6030k7272l0800k6511
17567C65894k5528k1894k2267j7013j3741q789j7203j3501j6905j859j2760j4760
17555A79674k569p211k350k562n9J329l053j0885j2401j4618p366N85K679J312
17541A22505K187K280N303O23k029r398j2059n02L387n07k393M595r134l941K882
17526A03799N30n33J814M129K699P611J2265K5828M3085N0912J9523j6176l0883
17513B24603l3088k5186j6375p161n79L23J2654L1764L0076k214k0255k5709l2830
$$ plain form
17598 4001617 3615178 3238253 2885963 2586157 2343284 2172137 2067400 2010416 1974195 1907169
17588 1907169 1796003 1648849 1477743 1313397 1163999 1040967 945083 871849 819175 776671
17578 776671 728607 682958 636945 587798 549027 510441 476507 450477 423205 392405 365894
17567 365894 340366 318472 296205 279192 265451 256662 239459 225958 209053 207194 194434 179674
17555 179674 177105 169894 167544 164982 164923 166252 163199 152314 139913 125295 117929 118514 121193 122505
17541 122505 124692 126972 132275 132898 130869 121471 109412 108910 112297 111790 109397 113992 104858 100917 103799
17526 103799 104329 103796 105610 109739 112438 120049 132314 158142 201227 252139 271662 255486 224603
17513 224603 191515 166329 149954 142793 142214 142537 155191 186955 217031 214817 194562 168853 136023
17500A36023k1810j1216k447J6805M2136M5596J0965k0257j4175j7339j0776q305
17488A45200q603j024L92J6983M6160M8099n826k6895k9243k9113k9872j9980
17476A06278j2859j0097k669j427K686J642k217l912q834j3267o335K777n692
17463D6074p897M31M155P723K372R947J185m730n545P692j271j434O540j218n909
17448E8115J76N08k836j263k911J568N324J4413J1967K0875K0141m652j0661j3986
17434I6778j9511j2874q011l777L571O012N534J370J803q20l938r235q695n00
17420D7707p384j0345k90j057n670l025j111O185n246p509l289L425N032L999
17406B1422O16J533o533J255L152J859o09j881K66n76M889K177k195l025o381
$$ plain form
17500 136023 114213 102997 100550 117355 159491 205087 216052 195795 181620 164281 153505 145200
17488 145200 136597 135573 135965 152948 199108 247207 241381 214486 185243 156130 126258 106278
17476 106278 93419 83322 80653 79226 81912 83554 81337 77425 68591 55324 48989 51766 46074
17463 46074 38177 38608 42763 50486 52858 62805 63990 59260 53715 61407 60136 58702 65242 64024 58115
17448 58115 58291 58799 55963 54700 51789 53357 58681 73094 85061 105936 126077 121425 110764 96778
17434 96778 77267 64393 56382 52605 56176 62188 67722 69092 70895 70075 66137 56902 48207 47707
17420 47707 40323 29978 29688 28631 22961 19936 18825 25010 19764 12255 8966 12391 17423 21422
17406 21422 22038 23571 17038 18293 21445 23304 22695 20814 21080 20504 25393 27570 25375 22350 15969
17391A5969R26K733L886k296J536K268J910j355N356n52J649J092O65L327j231
17376C5883P944O336j885q769l104K993n696k219L204K710r00l258R633O757N718
17361E5347J481q247M75k035J363K583N88L496O02P03m244l216q062n367m818
17346C0649J692N323J727J796l0L001L333j883p585m515k184o2M113J981M004
17331D1360R007J924o383l812j672N35l804m177M879n24m140j734O146k30q938
17316B8437j1950m59N466K364j0640r95N632R79L838R609m57q802l081M033L792
17301B7766m905j208j01n655K484n78n124m147r60O79L18R92k973R66M601N867
17285A8022J438k320l177J921m76O436R347N078j057p279m361n6O542m383j1488
$$ plain form
17391 15969 16895 19628 23514 21218 22754 25022 26932 25577 30933 30381 32030 33122 33787 37114 35883
17376 35883 43827 50163 48278 39509 36405 39398 33702 31483 34687 37397 36497 33239 42872 49629 55347
17361 55347 56828 48581 49056 47021 48384 50967 51555 55051 55653 56356 52112 48896 40834 35467 30649
17346 30649 32341 37664 39391 41187 41157 44158 47491 45608 38023 33508 31324 31262 35375 37356 41360
17331 41360 50367 52291 45908 42096 40424 40959 37155 32978 37857 37333 33193 31459 37605 37375 28437
17316 28437 16487 16028 21494 23858 13218 12223 17855 18834 22672 32281 31824 23022 19941 23974 27766
17301 27766 22861 21653 21552 15897 18381 17803 12679 8532 7572 8251 8569 9561 6588 7554 12155 18022
17285 18022 19460 17140 13963 15884 15408 21844 31191 36269 35212 27933 23572 23516 30058 25675 14187
17270A4187k817K077M954O146J889j545j621M49L534q223r232N907N760J469m085
17255A8849J2318R395N641o013o810o055P505K627o997q265l267P241N973O304
17241C8446L663r21n29J448j956j328O980L583k109K106J0166j2141p254J349
17227D1503R104n029l521J684Q373K3416J5542L24l018M337J4215J1125n563o454
17213A06038n725j1997j1044j0016l840k571jN202J928l479k017J4011K2620R684
17199A08793K832M27l133m912Q00J8Q13J13n094o51l887l172k737n999l293O136
17183H7054j346n506p71M532Q558q16l722N438K578L130J153p365O27N915k315
17168I7144K279J1059J0757P458P000L719R158J2576K2029K4858L7499N9380N3330
$$ plain form
17270 14187 11370 13447 18401 24547 26436 24891 23270 23719 27253 19030 9798 15705 21465 22934 18849
17255 18849 31167 40562 46203 40190 33380 27325 34830 37457 30460 22195 18928 26169 32142 38446
17241 38446 42109 41188 40659 42107 40151 38823 45803 49386 47277 49383 59549 47408 40154 41503
17227 41503 50607 45578 42057 43741 52114 75530 91072 91396 88378 92715 106930 118055 112492 106038
17213 106038 100313 88316 77272 67256 63416 60845 60844 66046 67974 64495 62478 76489 99109 108793
17199 108793 111625 112052 108919 104007 104807 104825 105638 105751 100657 100006 96119 92947 90210 84211 80918 87054
17183 87054 85708 80202 79431 83963 92521 91705 87983 93421 95999 99129 100282 92917 93544 99459 97144
17168 97144 99423 110482 121239 128697 135697 139416 148574 161150 183179 208037 245536 304916 358246
17155C58246K0194J6338K3870N1765N2192M2422Q713j2807j6984J5436K7418J6641
17143F03444J4985J8303L2315O1767R8319J30789J83253K74216L28595L71793
17133B117779M57264O30431R75461J584786K732474M898042P559671P133717L445556
17124C1535181k61186j38615J910795J142072k042467n563670o352041n750661
17116A4479408m280888k503525j290481o03005j84159J41252N25548J083337K001502
17107I368989L731233O876446J0010902Q286904L200203r38786Q2205K323895
17099D2941991N11253l749095p671723q186238p258178n257324l163528j840582
17091F326576j151387p92727n80967m40290l54449l07884k93380k71761k17654
$$ plain form
17155 358246 378440 394778 418648 470413 522605 565027 573740 560933 543949 559385 586803 603444
17143 603444 618429 636732 669047 730814 829133 959922 1143175 1417391 1745986 2117779
17133 2117779 2575043 3205474 4180935 5765721 8498195 13396237 20955908 28089625 31535181
17124 31535181 31273995 31135380 33046175 34188247 32145780 26582110 20230069 14479408
17116 14479408 10198520 7694995 6404514 5801509 5617350 5758602 6284150 7367487 9368989
17107 9368989 13100222 19976668 29987570 38274474 41474677 40535891 40618096 42941991
17099 42941991 43453244 39704149 32032426 23846188 16588010 11330686 8167158 6326576
17091 6326576 5175189 4382462 3801495 3361205 3006756 2698872 2405492 2133731 1916077
17082A916077j66746j04032q1397q7511r7125p0858n6191o0946p4571r2453o1826
17071I62421j3348j9429l7772m5256k2085j3253l5153n6506q4972o9439m7951
17060E17257m4972k7722j9569k3937k2125j3802j9023k1456k3738k8328q124n713
17048B58748N149O822M130M981J5315K9312N1110P6699J03231R4259N4331k555
17036G01532n6292q5503r0749q4205o7321m2267k9659k4764k0471r722q922j0784
17024A70873j353j539M316j05q349J65J3616Q391l348j3185r446r782m599L87
17010A46042J037N14o340j035j256L357j50l834P699J9828J5157m01n749J0093
16996A84962J5309J2503J5204K2063L6016N7060O2996J0564j3210k6866k3945
$$ plain form
17082 1916077 1749331 1645299 1563902 1476391 1379266 1308408 1252217 1191271 1116700 1024247 962421
17071 962421 949073 929644 891872 846616 824531 811278 776125 719619 634647 565208 517257
17060 517257 472285 444563 424994 401057 378932 365130 346107 324651 300913 272585 264461 258748
17048 258748 263897 270719 274849 279830 295145 324457 375567 452266 555497 649756 704087 701532
17036 701532 645240 559737 468988 384783 317462 275195 245536 220772 200301 190579 181657 170873
17024 170873 169520 167981 172297 172192 163843 164008 177624 186015 182667 169482 160036 150254 145655 146042
17010 146042 147079 147593 141253 140218 138962 142319 142169 138335 146034 165862 181019 180618 174869 184962
16996 184962 200271 212774 227978 250041 286057 343117 406113 416677 403467 376601 352656
16985C52656P102M2179P5396P7928L9023M1850N8290M1442j0882m757J8405O7105
16973H05737J34985J91579J99075J86368J80680K08909K54884M02731O09857R59500
16963D134305J610014K960946N704455J0264063J1546718J192597n573765o789959
16955B5049374p399509n125011k486811o16491R39422K977069O365485J0790448
16947C0493976Q536298k586751o166751p246655o741603l936704j299308J035900
16939A2088402L991845P888417P563082j106780m836164n712625n737183l750664
16931A0388330j794672m47807P64465K497397N486518Q835221N160183l374818
16923B7514817n200477o236234n520870l465886j954839j136121p00682m55161
$$ plain form
16985 352656 359758 401937 477333 555261 594284 636134 694424 735866 724984 720227 738632 805737
16973 805737 940722 1132301 1331376 1517744 1698424 1907333 2162217 2564948 3174805 4134305
16963 4134305 5744319 8705265 14409720 24673783 36220501 37413098 31839333 25049374
16955 25049374 17649865 12524854 10038043 9421552 10360974 13338043 19703528 30493976
16947 30493976 39030274 36443523 30276772 23030117 16288514 12351810 11052502 12088402
16939 12088402 16080247 23968664 31531746 30424966 25588802 19876177 14138994 10388330
16931 10388330 8593658 8145851 8910316 11407713 16894231 25729452 30889635 27514817
16923 27514817 22314340 16078106 10557236 7091350 5136511 4000390 3299708 2844547
16915B844547k96466j85822j39686j21586j57072k06097k08943j87514j51266
16906A190095j12123o9133l3284Q073L7846j0915p0158r4756r6319q5083o4699
16895E99544l9661l2312k4562j7461J0256K5385m822l2694l4391m3714m3629p631
16883C54308K6571L9471J2356l5636m7155m5135m3884k4293j4872o952q121m351
16871B02307q72q558m917n803j91O061N287m410q185q972q153q701q962j2083
16857A33848P47P71N399J7950J3608l825j5242j9805j3203Q53O957k022O69L201
16843A29906P26j7533j8667n828J739p289k37m886O113J4372J0595p38J330j3726
16829I5877j4547m33n949L1J1098O478Q189J2087j714j3510j1827j0950o88K854
$$ plain form
16915 2844547 2548081 2362259 2222573 2100987 1943915 1737818 1528875 1341361 1190095
16906 1190095 1077972 1008839 975555 983628 1021474 1010559 940401 845645 749326 664243 599544
16895 599544 559883 527571 503009 485548 495804 521189 516367 483673 449282 405568 361939 354308
16883 354308 380879 420350 432706 397070 349915 304780 260896 236603 221731 214779 206658 202307
16871 202307 201435 192877 187960 182157 181966 188027 193314 188904 180719 171747 163594 154893 145931 133848
16857 133848 134595 135366 140765 158715 172323 168498 153256 133451 120248 121101 128058 126036 126705 129906
16843 129906 130632 113099 94432 88604 90343 83054 82817 77931 84044 98416 109011 108273 109603 95877
16829 95877 81330 80897 74948 74979 86077 92555 100744 112831 111117 97607 85780 74830 74142 76996
16815G6996J0943J4514J0763J2159j5880k0652n987k053L246j334n892p461L015
16802G2377J5291J8207K2270L51p403j2697p239j2748m047j0258p041J424J547
16789G0034o544K603N423P088J0676l289q634p226O91K041M104P1K556N232Q62
16774H5688O506m669n308k846j62K355j2137o388n17r236M227L108N545n582l659
16759E6925N45l611K32L605q045n254l674K194J723N80m18k646m233K226m39m670
16743C5040R1P994K479r081p171j660M644M511K874k796o983p272k728M753k218
16728B2477L300n88k707r42k535l770j855k487J1796J0944L88m026j601J523n921
16713B3996P87J39J143O493j157k604N98M259j683R27r18M718q341L778J676r825
$$ plain form
16815 76996 87939 102453 113216 125375 109495 88843 82856 80803 84049 82715 76823 69362 72377
16802 72377 87668 105875 128145 128496 121093 108396 101157 88409 84362 74104 67063 68487 70034
16789 70034 63490 66093 71516 78604 89280 85991 77357 70131 70822 72863 76967 77038 79594 84826 85688
16774 85688 92194 87525 82217 79371 79209 81564 69427 63039 62522 53286 57513 60621 66166 60584 56925
16759 56925 57470 53859 54091 57696 49651 44397 40723 42917 44640 45220 44802 42156 37923 40149 39710 35040
16743 35040 35131 43125 45604 36523 29352 27692 32336 36847 39721 36925 29942 22670 19942 24695 22477
16728 22477 25777 25189 22482 21540 19005 15235 13380 10893 22689 33633 34021 29995 28394 29917 23996
16713 23996 24783 24922 26065 32558 31401 28797 29395 33654 31971 32898 31980 36698 28357 32135 33811 23986
16697B3986m461K899j691L49r30m931J587R351L945N685M881m969o341l435n554
16682B0371N167M198n62l593o917q542K58K435K486M901N242P7m555j210J291
16667B1047O447r59l752k598o364k976L580L018j038J0075Q217N683m464O41k778
16652C3779q0m046p761J72K312L226m131j0040n309j824K989J2348j15L502j425
16637B3597k31O197P98j494L713p569j2743m154Q617M193k666l297m58k619J896
16622A3780q26l009o90j347k779j668n651j219K452N973M346O802L860j262m58
16607A8304l223m542K495N521K970l082K333L269n099r340m675J541K192k383
16593F281K348J720j784O150Q41j299L619m824n600l456J603O701k823m419m309
$$ plain form
16697 23986 19525 22424 20733 21082 20152 15221 16808 26159 30104 35789 40670 35701 29360 25925 20371
16682 20371 25538 29736 29174 25581 18664 10122 10380 12815 15301 20202 25444 25521 20966 19756 21047
16667 21047 27494 26535 22783 20185 13821 10845 14425 17443 16405 26480 34697 40380 35916 36557 33779
16652 33779 33699 29653 21892 22064 24376 27602 23471 13431 8122 6298 9287 21635 21520 25022 23597
16637 23597 23366 29563 30361 28867 32580 25011 12268 8114 16731 20924 18258 14961 14503 11884 13780
16622 13780 12954 9945 9255 7908 5129 3461 -2190 -3409 -957 5016 9362 16164 20024 18762 18304
16607 18304 15081 10539 13034 18555 21525 18443 20776 24045 18946 9606 4931 6472 8664 6281
16593 6281 8629 10349 8565 14715 15556 14257 17876 13052 7452 3996 5599 12300 9477 5058 749
16578G49N568N036N133n52j481K231j550P68M738J7528K4595K8224M4840M5780
16564A81607K0601N672l211R230J726p254k7364l8051l4818l0610j3380j471r042
16551E3635j286N612L90r62N351J5297L6001L6568L3692K0935m64m212N885N42
16537B06984k1204l5831l0588k8326k1089j2989j3302j0256k912p953j008n38
16525B0988Q50j847n99J391K604L954j870P41K55l333n143m056M839n716o499
16510F559L33L618M765J498K38o325o241J284L452K298J366k325N128q51J872
16495A6669N090n400N252N213K492m219p855n893j296J592Q923K841m433K71l083
16480A6164K268K151p839J167k841n602l497o261l236J0053R370N120n002j399
$$ plain form
16578 749 6317 11353 16486 15934 14453 16684 15134 15902 20640 38168 62763 90987 135827 181607
16564 181607 202208 207880 204669 213899 215625 208371 181007 142956 108138 77528 64148 62677 53635
16551 53635 52349 57961 58351 57389 62740 78037 114038 150606 184298 205233 204769 200557 206442 206984
16537 206984 185780 149949 119361 91035 69946 56957 43655 33399 30487 22534 21526 20988
16525 20988 21838 19991 19392 20783 23387 27341 25471 26212 26467 23134 17991 13935 18774 13058 6559
16510 6559 6892 10510 15275 16773 17011 10686 4445 5729 9181 11479 12845 10520 15648 14797 16669
16495 16669 21759 16359 21611 26824 29316 25097 17242 11349 10053 11645 20568 23409 18976 19247 16164
16480 16164 18432 20583 12744 13911 11070 5468 1971 -4290 -7526 2527 11897 17017 12015 10616
16466A0616k715J581O63k935J89k412l061L715M017O767O682n902n208p098M478
16451I377m680m335Q530k924r356k500P65Q481m980K61r65k985R663M518m795
16436D075K172M514K174k529j95p444l054L332l99r038j374O567P635r33m233
16421A270M924J1416J803n955J769l44m011m020N296J738p350l973O114N806J120
16406A5603k685Q381J0111o547q70J1384J0182K0583K5472L5249M2359P884j5820
16393A61286k5079l4222k8262j8555n737M774J5776L2472M6501M0044j0439l0106
16381A48453l1306l1637j9684o467R335K7534M0955L6837N488k8541l9911k9112
16369H1944j1522o692m172R265K1312L2596L5695J5287j6872l0237l0633k6652
$$ plain form
16466 10616 7901 9482 10145 7210 7399 4987 1926 5641 9658 16425 23107 17205 11997 4899 9377
16451 9377 4697 362 8892 5968 -3388 -5888 -5123 3358 -1622 -1361 -2326 -5311 4352 8870 4075
16436 4075 6247 10761 12935 10406 10211 2767 -287 3045 2646 -6392 -7766 -1199 6436 5503 1270
16421 1270 6194 17610 19413 13458 15227 14883 10872 6852 12148 13886 6536 2563 8677 14483 15603
16406 15603 12918 21299 31410 24863 23993 35377 45559 66142 91614 126863 169222 177106 161286
16393 161286 136207 101985 73723 55168 49431 54205 69981 102453 148954 188998 178559 148453
16381 148453 117147 85510 65826 59359 68694 96228 137183 174020 179508 150967 111056 81944
16369 81944 70422 63730 59558 68823 90135 122731 158426 173713 156841 126604 95971 69319
16357F9319j9213k1857r399l197O0R93L353M065n749k397k663J724N241p414m279
16342H587j270K514R916M26p722l860J192j298k80k916k63O297P52p558n689L55
16326h17M876M137j300l178K191k923m879l969L058N173j391n724l815J454J420
16311e687P496L132r234l977J023k888J631L315K688L477j766N88N399N148k890
16296G455l555J982k7L640K29n551j032L314M98L133N459K341l522q969k257l239
16280a01O96L411M800k411m430j800O90k36n05J401N005O246L019j749j909J544
16264A3671J981P06j0706O037L935k615m54m146l303k751L105l952KQ29J035n173
16248a799l373J66L137l792o93O04J583M715L305M747L072l14p785q691L962l3
$$ plain form
16357 69319 50106 28249 18850 15653 15713 16706 20059 24124 18375 15978 13315 15039 20280 12866 8587
16342 8587 7317 9831 19747 20173 12451 8591 9783 8485 8205 5289 5026 11323 12075 4517 -1172 -817
16326 -817 4059 8196 6896 3718 5909 2986 -1893 -5862 -2804 2369 978 -4746 -8561 -7107 -5687
16311 -5687 1809 4941 -4293 -8270 -7247 -10135 -8504 -5189 -2501 976 -790 -202 5197 10345 7455
16296 7455 3900 5882 5855 9495 9724 4173 3141 6455 6953 10086 15545 17886 14364 5395 3138 -101
16280 -101 595 4006 8806 6395 1965 165 855 619 114 1515 6520 12766 15785 14036 12127 13671
16264 13671 15652 16358 5652 11689 15624 13009 12555 8409 5106 2355 5460 1508 1510 2339 3374 -1799
16248 -1799 -5172 -5006 -1869 -5661 -6354 -5750 -4167 548 3853 8600 11672 11358 3573 -5118 -1156 -1189
16232a189K524o488o441P749J470o20R59k321J597J1442Q231n00n685k18K307
16217A2817l979k894m777o946n687m574K979Q327O909Q86l81K026L928n211p486
16202d063q26J225O534Q08m396p41l267j371k061r08P13m042K868M989J370L244
16186G6K698n29p06j0283R74P736J171p73J396o015j0052M134M809L627Q577l513
16170C327m645j238j235L509J701m236M482L964j175j629J664j064P32Q06P89
16155E752m155J541k752J115p63P57K0l573kR57q604O785M363n481o224J730n2
16138h586Q30K462J225k709k212k205l225r47K956N684P295J905J648K732l235
16123C618k322j527K235m577o408j436K458O924N265K960L876l006R266L086m807
$$ plain form
16232 -1189 1335 -5153 -11594 -3845 -2375 -2995 -2036 -4357 -2760 8682 16913 16413 10728 10510 12817
16217 12817 8838 5944 1167 -5779 -11466 -16040 -13061 -4734 2175 3061 2680 4706 8634 3423 -4063
16202 -4063 -4889 -3664 2870 3678 -718 -1459 -4726 -6097 -8158 -9066 -8353 -12395 -9527 -4538 -3168 76
16186 76 2774 2245 1539 -8744 -7770 -34 1137 364 1760 -4255 -14307 -10173 -5364 -1737 6840 3327
16170 3327 -1318 -2556 -3791 -282 1419 -2817 1665 5629 4454 2825 4489 3425 4157 4963 5752
16155 5752 1597 3138 386 1501 738 1495 1515 -2058 -2060 -1103 -9707 -2922 1441 -4040 -10264 -8534 -8586
16138 -8586 -7756 -5294 -4069 -6778 -8990 -11195 -14420 -15367 -12411 -6727 568 2473 4121 6853 3618
16123 3618 1296 -231 2004 -2573 -8981 -10417 -7959 -1035 4230 7190 11066 8060 17326 20412 15605
16108A5605m680J838M28k668p288o024k020L060p44M175k057q084n013K814N594
16093e064K903j847j514K935O454P272k229k209N280o797l218L590j108p017o253
16078h822M790M564l408q450k237J0462M613L945M357K22n956l634j376j192r84
16063c106j181O89J28R456J288l195m2n697l320L827M817q853n593M347M385M398
16047B348p23K225M465P20p529k897N424l026j563o484k47J457L02O25R388J1572
16031A6057K848n105o899j297j090L591M093j471J179M96P10l054p48m057k861
16016B392j867K548K74J448J141L588j173q013L917O325m606J363M059j221o63
16001I512m942j1J841K394K448m955o4n241l19M453K048n245j493j993k307N855
$$ plain form
16108 15605 10925 12763 13191 10523 3235 -2789 -4809 -1749 -2493 1682 -375 -8459 -13472 -10658 -5064
16093 -5064 -2161 -4008 -5522 -2587 3867 11139 8910 6701 11981 5184 1966 5556 4448 -2569 -8822
16078 -8822 -4032 532 -2876 -11326 -13563 -3101 1512 5457 9814 10036 4080 446 -930 -2122 -3106
16063 -3106 -4287 -3598 -3470 5986 7274 4079 4037 -1660 -4980 -1153 3664 -5189 -10782 -6435 -2050 2348
16047 2348 1625 3850 8315 9035 1506 -1391 4033 1007 -556 -7040 -7287 -5830 -5528 -4903 4485 16057
16031 16057 18905 13800 6901 5604 4514 8105 12198 10727 11906 12402 13112 10058 9310 5253 2392
16016 2392 525 3073 3347 4795 5936 9524 8351 338 4255 10580 5974 7337 11396 10175 9512
16001 9512 4570 4559 6400 8794 11242 6287 6223 982 663 5116 7164 1919 426 -1567 -3874 1981
15985A981j03k193j071R015k490m284k103m972n256J633r38l626J285P80Q998
15970c344L669o485R06P479m07n022j318N285N30k759m94N77m238k277K779J793
15954c326l921N938J882k05O512M553O60o26M451m611q769l734r86M258j584J230
15938A722j636k220k393l954M92N699J1257j09r269j715k427J146K288L161p507
15923e465n059N271J1040K596l769q01l645k686K659Q22j879o727J324K014M392
15908H7O363L725m154q168p90K135k943j294J458J466O3O325K219L403j311P008
15892A5592L356N727N80l309k041o158n484q221r593K232M874J924q645o253N930
15877i489O306O270R10p841m053k431R348L022l409R743J112m928O62q345o874
$$ plain form
15985 1981 1878 -315 -1386 7629 5139 855 -1248 -6220 -11476 -9843 -10781 -14407 -13122 -12342 -3344
15970 -3344 325 -6160 -5254 2225 1818 -3204 -4522 763 1293 -1466 -1960 -1383 -5621 -7898 -5119 -3326
15954 -3326 -7247 -1309 573 368 6880 11433 12093 11467 15918 11307 2538 -1196 -2182 2076 492 1722
15938 1722 86 -2134 -4527 -8481 -7989 -2290 8967 8858 -411 -2126 -4553 -3407 -1119 2042 -5465
15923 -5465 -10524 -5253 5787 8383 4614 3813 168 -2518 141 963 -916 -7643 -6319 -4305 87
15908 87 6450 10175 6021 -2147 -2937 -802 -3745 -5039 -3581 -2115 -2052 4273 6492 9895 8584 15592
15892 15592 18948 24675 25255 21946 19905 13747 8263 42 -9551 -7319 -2445 -521 -9166 -15419 -9489
15877 -9489 -3183 3087 3997 -3844 -7897 -10328 -980 2042 -1367 8376 9488 4560 5222 -3123 -9997
15862i997J229K927J619L210J956L473j038O39m893m805M602P753m073q72j111
15847F19L463M792p315q768J199P501M70m387Q525L386o873l712o02M14L067P870
15831I649K470l981l050m005L938Q930L729o799j0768r490r30Q212K373J60m252
15816c814K743M383o116m924j130j15L763J923M842L893M80k751m050r2K135k205
15800a035j484M271l556l218M38Q82m92m736M766K499j88j394K344J1735L533
15785A4365j080J755l075j4856o368j046j150M270J191P36Q677J691n809k538
15771c237j215l774O54L500K275J108N35l662J900j329k650K3M064M062N092p78
15755F568o57r758J808l65J120M012M054L87J455r01r616K813J303L337m176j0472
$$ plain form
15862 -9997 -8768 -5841 -4222 -1012 944 4417 3379 4018 -875 -5680 -1078 6675 2602 1730 619
15847 619 4082 8874 1559 -7209 -6010 1491 1961 -2426 6099 9485 2612 -1100 -1702 -1288 1779 9649
15831 9649 12119 8138 5088 1083 5021 13951 17680 10881 113 -9377 -10307 -2095 278 438 -3814
15816 -3814 -1071 3312 -2804 -7728 -8858 -8973 -5210 -3287 1555 5448 5928 3177 -873 -965 1170 -1035
15800 -1035 -2519 1752 -1804 -5022 -4584 -3702 -4194 -8930 -4164 -1665 -1853 -3247 -903 10832 14365
15785 14365 13285 15040 11965 -2891 -9259 -10305 -11455 -7185 -5994 -5258 3419 5110 -699 -3237
15771 -3237 -4452 -8226 -7572 -4072 -1797 -689 -154 -3816 -1916 -3245 -5895 -5872 -1808 2254 7346 6568
15755 6568 5911 -3847 -2039 -2404 -1284 2728 6782 7169 8624 7723 -1893 920 2223 5560 1384 -9088
15739i088p363J676L313N62l603N928O977N4j31j026o286l784J286J2938L148
15724D601j200N97m898j441l325l075p31j225J797r14N554M469L554N591j747
15709G607j164n530L151J491j902k451J49k640m26M14R07k990L15L362k275o08
15693b590l888k254L32L176M169N881J862n540m739j878k00J417K769m656j170
15678g309j914J877Q73j127M239K469q893L974K634n545j839R465m823k546L056
15663e409O174k07m469O30o108k047J575Q948K620l870j370n863P33N856N209
15648B402j068j939J764l659k830N47j728j098j22l105L332J764M692M347l326
15633b7q289m689j395O432K051R925R299l297l625p369j1628M032J5742O614q243
$$ plain form
15739 -9088 -16451 -14775 -11462 -10900 -14503 -8575 -1598 -1544 -1675 -2701 -8987 -12771 -11485 1453 4601
15724 4601 3401 3998 -900 -2341 -5666 -8741 -9472 -10697 -8900 -9814 -4260 209 3763 9354 7607
15709 7607 6443 913 4064 5555 3653 1202 1351 -1289 -1715 -1301 -394 -3384 -3069 293 -1982 -2590
15693 -2590 -6478 -8732 -8400 -5224 -1055 4826 6688 1148 -3591 -5469 -5669 -4252 -1483 -6139 -7309
15678 -7309 -9223 -7346 -6473 -7600 -3361 -892 -9785 -5811 -3177 -8722 -10561 -1096 -5919 -8465 -5409
15663 -5409 765 558 -3911 -3281 -9389 -11436 -9861 -913 1707 -2163 -3533 -9396 -8663 -2807 2402
15648 2402 1334 -605 1159 -2500 -5330 -4783 -6511 -7609 -7731 -10836 -7504 -5740 -1048 3299 -27
15633 -27 -8316 -13005 -14400 -7968 -5917 4008 13307 10010 6385 -984 -12612 -8580 7162 13776 5533
15618E533q009j386k252K745P241l536K57K40o800m126K277k089n479Q74K976
15603a1534N126M459M235L881K512k599o427p574q70K270k129j808K667l6n19
15588h346L21J0883J3818p927n921K984K098K444p001p702J823J882P11P02l798
15573c029K534o87m986j420L594j952k327N091M328M406m27j183L475J43m889
15558B671m017j018q76j855O537O620l622K075l764K008l938O044J0350p79r080
15543G356l287l489l807N032N038k126m861j150M3j998O447K429n98q628k380
15528e979n83K391J145K169j025r41K747L844j010K108n780p19O011K591j90l055
15512C724l394N001K21Kp210M47k617M552j350o350m106O90N88r89K388J0874
$$ plain form
15618 5533 -2476 -3862 -6114 -3369 3872 336 593 833 -5967 -10093 -7816 -9905 -15384 -14510 -11534
15603 -11534 -6408 -1949 2286 6167 8679 6080 -347 -7921 -8791 -6521 -8650 -10458 -7791 -7827 -8346
15588 -8346 -8025 2858 16676 8749 2828 5812 7910 10354 3353 -4349 -2526 -644 67 769 -3029
15573 -3029 -495 -1182 -6168 -7588 -3994 -5946 -8273 -3182 1146 5552 5125 3942 7417 7560 2671
15558 2671 -1346 -2364 -3240 -5095 1442 8062 4440 6515 2751 4759 821 6865 17215 16436 7356
15543 7356 4069 580 -3227 1805 6843 4717 -144 -1294 -1251 -3249 3198 5627 5029 -3599 -5979
15528 -5979 -6562 -4171 -3026 -857 -1882 -2823 -76 3768 2758 4866 -914 -1633 4378 6969 6779 3724
15512 3724 330 5331 5552 5554 -1656 -1209 -3826 726 -624 -6974 -11080 -10390 -9802 -10791 -8403 2471
15496B471J980n978N636K394k243j455j05n633l617L897p14J181j696m060k53
15481h195O426J007l337r30K464L411M674r450m228L829K893l78n776m718k423
15466a4731R41Q460P076m409q834p863O158O043l679M478K964j641q15j922M829
15451b945O085O80K970L454o313o984J222L577n163k071J985l263j25O166n298
15436f023K394P505l136l414l947k674L206L767J092j478j57j341N131j472m3
15421e90O155l23o47l400K091J020q14j090o68N6o07n864o78O694J616p659l57
15404e065k685K460m75k262j120L578q60n515J368L730K096O1J927k81L004o4
15388a03l472l933q79l148l816O444K765K216k463M18O659Q59L859O70p003p340
$$ plain form
15496 2471 4451 -1527 4109 6503 4260 2805 2700 -2933 -6550 -2653 -3367 -2186 -3882 -7942 -8195
15481 -8195 -1769 -762 -4099 -5029 -2565 846 5520 -3930 -8158 -4329 -1436 -1814 -7590 -12308 -14731
15466 -14731 -13790 -5330 1746 -2663 -11497 -19360 -13202 -7159 -10838 -6360 -3396 -5037 -5852 -7774 -2945
15451 -2945 3140 3820 6790 10244 3931 -3053 -1831 1746 -3417 -5488 -3503 -6766 -6891 -725 -6023
15436 -6023 -3629 3876 740 -2674 -6621 -9295 -6089 -2322 -1230 -2708 -2865 -4206 925 -547 -590
15421 -590 5565 5242 4595 1195 3286 4306 3492 2402 1734 1790 1183 -4681 -5359 1335 2951 -4708 -5065
15404 -5065 -7750 -5290 -5765 -8027 -9147 -5569 -6429 -11944 -10576 -6846 -4750 -4689 -2762 -3043 -39 -103
15388 -103 -3575 -7508 -8387 -11535 -15351 -8907 -6142 -3926 -6389 -5971 688 1547 5406 6076 -927 -8267
15372h267k449J348N66O00j485l022N283O471L316r08J714k725n101K670K531
15357E42J496l297o043J44n235j191J951k536N046M121J614j527J209M104k82
15342A16L965l946J40o017j0003J4730K971o48N294j965k875J813j57K962N633
15327A2013J780m707j781o472j875o50Q567N05p588j995K003n850N00n166n42
15312a1258k181n778M012R956J586M818M756j0248j132N163m762j940l770Q836
15298a942J1150r150q635N831R339j265r589O711L471m621n914n91L850o39J543
15283d51L173K343R09J148m288k217q33o520j971M688J34p797Q683O595j508P155
15267I243J993K540j155n299p008m042j704M744J938P103K137o426k404j305K297
$$ plain form
15372 -8267 -10716 -9368 -8802 -8202 -9687 -12709 -7426 -955 2361 1453 3167 442 -4659 -1989 542
15357 542 2038 -1259 -7302 -7158 -12393 -13584 -11633 -14169 -9123 -5002 -3388 -4915 -3706 398 116
15342 116 4081 135 275 -5742 -15745 -1015 1956 1308 6602 4637 1762 3575 3418 6380 12013
15327 12013 13793 9086 7305 833 -1042 -1692 6875 7380 -208 -2203 -200 -6050 -5550 -10716 -11258
15312 -11258 -13439 -19217 -15205 -5249 -3663 1155 5911 -4337 -5469 -306 -5068 -7008 -10778 -1942
15298 -1942 9208 58 -8577 -2746 6593 5328 -4261 2450 5921 1300 -4614 -5205 -1355 -1994 -451
15283 -451 2722 5065 5974 7122 2834 617 -216 -6736 -8707 -4019 -3885 -11682 -2999 3596 2088 9243
15267 9243 11236 13776 12621 7322 314 -3728 -5432 -688 1250 8353 10490 4064 1660 355 2652
15252B652P58l162k76M103j025m236j798k025K93N32K556J78L593L542k538l645
15236d98n63J131L78O80n98N63q45m353K043m130n652M728L747Q13P478O101p50
15219A0273p057K336k952l041K81Q99M943r54J007l753L424Q18p491j158k038
15204d463K649N695J425O283q56M670n805n209L084K156o856k263o220Q19j918
15189f809m579o98M31M321k01j668O130P52j939J220m650M056L427J091L207J099
15173E190l033l72k081o055J788J3039L212n447o083k320K339K253K509L259m834
15158C364m45L572J98m772k665j093Q611r99m452o343m174l33j308J828M29J3258
15142D676J2592q420j658L844l607l372K044l900p091l715L354j113Q48N321K884
$$ plain form
15252 2652 3410 248 -28 4075 3050 -1186 -2984 -5009 -4716 -4184 -1628 -1450 2143 5685 3147 -498
15236 -498 -1061 70 448 1128 530 1093 248 -4105 -2062 -6192 -11844 -7116 -3369 -2556 4922 11023 10273
15219 10273 3216 5552 2600 -441 -160 739 5682 4728 5735 1982 5406 6224 -1267 -2425 -4463
15204 -4463 -1814 3881 5306 11589 10733 15403 9598 4389 7473 9629 2773 510 -5710 -4891 -6809
15189 -6809 -11388 -12086 -11655 -7334 -7535 -9203 -3073 -2321 -4260 -3040 -7690 -3634 -207 884 4091 5190
15173 5190 2157 1785 -296 -6351 -4563 8476 11688 6241 158 -2162 177 2430 4939 8198 3364
15158 3364 2919 6491 6689 1917 -748 -1841 6770 5771 1319 -5024 -9198 -9531 -10839 -9011 -8582 4676
15142 4676 17268 8848 7190 11034 7427 4055 6099 2199 -4892 -8607 -5253 -6366 -5518 -197 2687
15127B687n194m044k982o21k64j489J2843J0569l501m174l776p39K866n4L253
15112E380P985J401q038k310n071L131l178n303k031P102L330K782M945J253M173
15097A5551N132P737J2592J1635N597l216q484j1027j2476n218o259l306o765
15084A493N36q98j2631k816O288J329R414N144p35o538K858j386K506m916k622
15069b974o009J865O195k3K565J377j621j955l55j521p11k03r88N055k029N192
15053C860K975n245p133m747M349J0241N268K287Q84m829j4254q562K874L639
15039h393j154k872P084P712J634o986p771J80L608J0092Q579O910J0032P301
15025C5956J4542O113R579O966m923m362j244r854q157r168k101o51j0465j918
$$ plain form
15127 2687 -2507 -6551 -9533 -10154 -10418 -11907 936 11505 8004 3830 54 -685 2181 2127 5380
15112 5380 13365 14766 6728 4418 -653 2478 -700 -6003 -8034 -932 2398 5180 10125 11378 15551
15097 15551 20683 28420 41012 52647 58244 55028 46544 35517 23041 17823 11564 8258 1493
15084 1493 2029 1131 -11500 -14316 -8028 -6699 2715 7859 7124 586 3444 2058 4564 -352 -2974
15069 -2974 -8983 -7118 -923 -946 1619 2996 1375 -580 -935 -2456 -3167 -3370 -4358 697 -1332 3860
15053 3860 6835 1590 -5543 -10290 -5941 4300 9568 11855 12739 7910 -6344 -14906 -12032 -8393
15039 -8393 -9547 -12419 -5335 2377 4011 -2975 -10746 -10566 -6958 3134 11713 18623 28655 35956
15025 35956 50498 56611 66190 73156 68233 63871 62627 52773 44616 35448 33347 32696 22231 20313
15011B0313J076P16L522k004o259n857p363n471N042k082J724N359P81k573n251
14996A673p080k238N064P188K663R89K128K986J055K512P18O755J3681J3188K0316
14981G1598L7200N9411J21425K50531L64589R7743j72107j89947k21651j70462
14971B48330r2582n1316k5403j1964j2533j4833p335p538J052K028q150n161J384
14958A5979k159q635n588r45k503J747j873J094J767R585O084m221r834o91j927
14943b120l80K737l04O198n24p813m708j075K175n982J04Q583J0874J531o455
14928B841k236m497j709m327l755k914P180P533J550J334p6L342L302q208n452
14913f092M909n329k041O967R307q995m818K569R154P966k75n104l405L998K968
$$ plain form
15011 20313 21389 22105 25627 23623 17364 11507 4144 -1327 3715 1633 3357 8716 9497 6924 1673
14996 1673 -5407 -7645 -2581 4607 7270 8259 10387 13373 14428 16940 17658 24413 38094 51282 71598
14981 71598 108798 168209 289634 540165 904754 1002497 830390 640443 418792 248330
14971 248330 155748 104432 79029 67065 54532 39699 32364 24826 25878 27906 19756 14595 15979
14958 15979 13820 5185 -403 -1348 -3851 -2104 -3977 -2883 -1116 8469 14553 10332 498 -193 -2120
14943 -2120 -2500 237 -67 6131 5607 -2206 -6914 -7989 -5814 -11796 -11692 -3109 7765 9296 2841
14928 2841 605 -3892 -5601 -9928 -13683 -16597 -9417 -1884 -334 1000 924 4266 7568 -640 -6092
14913 -6092 -1183 -6512 -8553 -1586 7721 -1274 -6092 -3523 5631 13597 13322 8218 4813 8811 11779
14898A1779j631l085n383q74K982J89L305k524L663k329n727K046L119L178R69
14883I677j505j013l453R69P90m490o025p7M652K280n19K108n609k360l599L918
14867d256L175J320l984K504m49k060K227j67l1P522P75J985P65o458r338j824
14851h294L509L377k439K830m383r956J0676P825o613r9L737l720k010P079k716
14836a197j378l096K189j689l931k102K521P56k838Q945P980m02q495l651Q527
14821B139l912n310O421L590q464M644j150q6N734O155j546j1900N010l826q110
14806a0611O317J422l332k593O836J097N863m385r585N074O027R330K309n533
14792H236l29l613o154p291J655q54M371M687k718k564P46q51j309k955O29L882
$$ plain form
14898 11779 10148 7063 1680 806 3788 3977 7282 4758 8421 6092 365 2411 5530 8708 9677
14883 9677 8172 7159 3706 4675 5465 975 -5050 -5127 -475 1805 1286 3394 -2215 -4575 -8174 -4256
14867 -4256 -1081 239 -3745 -1241 -1690 -3750 -1523 -1690 -1721 5801 6576 8561 9326 2868 -6470 -8294
14851 -8294 -4785 -1408 -3847 -1017 -5400 -15356 -4680 3145 -3468 -3567 170 -3550 -5560 1519 -1197
14836 -1197 -2575 -5671 -3482 -5171 -9102 -11204 -8683 -7927 -10765 -1820 6160 5758 -2737 -6388 2139
14821 2139 -1773 -7083 -662 2928 -5536 -892 -2042 -2128 3606 9761 8215 -3685 1325 -2501 -10611
14806 -10611 -4294 -2872 -6204 -8797 -1961 -864 4999 614 -8971 -3897 2130 11460 13769 8236
14792 8236 7907 4294 -1860 -9151 -7496 -8350 -3979 708 -2010 -4574 -3828 -4679 -5988 -8943 -8314 -4432
14776d432M63m821l666Q92K144P495N28j048K721N095l648j945K848P034O8p949
14760A779n129k8j610j697J224M038L597m145q392q38L812M911k200M062J006
14745C90K632m36j711K180M56q531O772L616k130l796L12K0L039Q049N566j152
14729A5276j575j803o734l727m768l19N779K94j693N635k307j811k516m805J458
14714c616J594m023N836K489Q75P142M532l945n357L058p531j0687k530K904K714
14699f545J603O202k732m661K545p8N35n846o001m963N387O041K408P43N266K250
14683B154J938n283o673j43m729N72M096R149p69m242L378k995r978r34m58L761
14667a1156K28k542K128l898N2L810M55j643Q770L585l564P236Q751l518j1327
$$ plain form
14776 -4432 -3969 -8790 -12456 -11564 -9420 -1925 -1397 -2445 276 5371 1723 -222 2626 9660 9728 1779
14760 1779 -3350 -3378 -4988 -6685 -5461 -1423 2174 -1971 -10363 -11201 -7389 -2478 -4678 -616 390
14745 390 3022 2586 875 3055 3511 -5020 1752 5368 3238 -558 -246 -226 2813 10862 16428 15276
14729 15276 13701 11898 5164 1437 -3331 -3650 2129 2423 730 6365 4058 2247 -269 -5074 -3616
14714 -3616 -2022 -6045 -209 2280 3155 10297 14829 10884 5527 8585 1054 -9633 -12163 -9259 -6545
14699 -6545 -4942 1260 -1472 -6133 -3588 -3666 -3131 -8977 -14978 -19941 -14554 -8513 -6105 -5362 -96 2154
14683 2154 4092 -1191 -7864 -8007 -12736 -12164 -8068 1081 312 -3930 -552 -3547 -13525 -14459 -14917 -11156
14667 -11156 -10928 -13470 -11342 -15240 -15188 -11378 -10923 -12566 -3796 -211 -3775 3461 12212 8694 -2633
14652b633p317j405P083R913M765l50L084l868p477j1350K127M098M796L028o558
14637b064L250M365q839k205L129k178n128K484n79Q017n645o235j908j793K796
14622a2533R028L172k459J330K001j201k357M826J641j1639J24K631J0378J173
14608F115p59J446k380J805l412n610j880j199O860k506K439n83l582l362M315
14593b293K738O6m140n999J247P722J303k506L662L118o190l068J4K937Q636K48
14577G495o601l120j249K464l270o32O374J247m326l595m82n084K934O899Q342
14562G396m80l845J881n677k863J305j408M036L366l091J254L572O242k299l298
14547F091o325L737P972n156k540k729m537j508o040p42J110q007p310j171Q094
$$ plain form
14652 -2633 -9950 -11355 -4272 5641 10406 10056 13140 9272 1795 -9555 -7428 -3330 1466 4494 -2064
14637 -2064 1186 5551 -3288 -5493 -2364 -4542 -9670 -7186 -7765 252 -5393 -11628 -13536 -15329 -12533
14622 -12533 -3505 -333 -2792 -1462 539 -662 -3019 1807 3448 -8191 -8067 -5436 4942 6115
14608 6115 5356 6802 4422 6227 2815 -2795 -4675 -5874 986 -1520 919 336 -3246 -6608 -2293
14593 -2293 445 511 -3629 -9628 -8381 -659 644 -1862 1800 4918 -1272 -4340 -4326 -1389 7247 7495
14577 7495 894 -2226 -3475 -1011 -4281 -4913 1461 2708 -1618 -5213 -5695 -10779 -7845 -946 7396
14562 7396 6916 3071 4952 -725 -3588 -2283 -3691 345 3711 620 1874 5446 11688 9389 6091
14547 6091 -234 3503 11475 6319 3779 1050 -3487 -4995 -11035 -11777 -10667 -18674 -25984 -27155 -19061
14532a9061O604M355L91J739n182J031j232N8N155J910M12n362o24K298J901j546
14516g153J078P095k225m465L317J770l859O274j758n209o34n589k14Q444O35
14501b493N62J12j089K843m523L589l531l143k737K885n034o752J135k713L748
14486a7141J047J0238j924k222R41k971k635J694J883K653o95O326M939M334R65
14471G432n324n053J538O99l456l788p060K162K751L954K239p878L043O143O339
14456C741N14o705O95K004n27J756O967l403R88O69N73K149m932R42J98k846o864
14439d081j047L986K358j427N85J045l661l797m656J15L843l021n442L793R974
14424a433P78m329O583P74M92m962j251m26j212n69n493p583l481J3317J0302
$$ plain form
14532 -19061 -12457 -8102 -7711 -5972 -11154 -10123 -11355 -11297 -6142 -4232 -3820 -9182 -9806 -7508 -5607 -7153
14516 -7153 -6075 1020 -1205 -5670 -2353 -583 -4442 1832 74 -5135 -5769 -11358 -11572 -3128 -2493
14501 -2493 -1931 -1819 -2908 -65 -4588 -999 -4530 -7673 -10410 -7525 -12559 -19311 -18176 -20889 -17141
14486 -17141 -16094 -5856 -7780 -10002 -9061 -12032 -14667 -12973 -11090 -8437 -9132 -2806 2133 6467 7432
14471 7432 2108 -2945 -1407 -708 -4164 -7952 -15012 -12850 -10099 -6145 -3906 -11784 -8741 -2598 3741
14456 3741 4255 -2450 -1755 249 -278 1478 8445 5042 6030 6699 7272 9421 4489 5431 5629 2783 -4081
14439 -4081 -5128 -1142 1216 -211 374 1419 -2242 -6039 -10695 -10580 -6737 -9758 -15200 -11407 -1433
14424 -1433 -655 -4984 1599 2373 2865 -2097 -3348 -3774 -4986 -5555 -11048 -18631 -22112 -8795 1507
14409A507J274j428M7N611l031j321N90m999j83n6n773K857M236j990p900M702
14393e857P522M502J230R95k510K322m91o488k878J688j605o35l809j07P998L238
14377E115L207m592K957j927m303j1470n408N629L302L24L560L234P365O14r19
14362F688j301K488j493j245n086J460R855r096q086L18n94m27J195M86j435j293
14346g566M808j305p421M70N37j098K443k15K767M293N163K472L812K071j1128
14331A03n626l466J668K391N76j127K442J138K772M09j986K668l268q43L406J289
14315B546j86r85n96J705j318J432N30J003L00m090O174k918n283j252K221q21
14299a538k885K137N422J665l125m219J983J0999j608m043r768l503l97N861j757
$$ plain form
14409 1507 2781 1353 1400 7011 3980 2659 3249 -1750 -1933 -1989 -7762 -4905 -669 -2659 -10559 -5857
14393 -5857 1665 6167 7397 8392 5882 8204 7713 1225 -1653 35 -1570 -2205 -6014 -6121 1877 5115
14377 5115 8322 3730 6687 4760 457 -11013 -16421 -10792 -7490 -7166 -3606 -372 6993 7607 6688
14362 6688 5387 7875 6382 5137 51 1511 11366 2270 -5816 -5498 -6092 -6519 -5324 -4838 -6273 -7566
14346 -7566 -2758 -4063 -11484 -11014 -10477 -11575 -9132 -9347 -6580 -2287 2876 5348 9160 11231 103
14331 103 -5523 -8989 -7321 -4930 -4354 -5481 -3039 -1901 871 1280 -706 1962 -1306 -2149 1257 2546
14315 2546 2360 1375 779 2484 1166 2598 3128 4131 4431 341 6515 3597 -1686 -2938 -717 -1538
14299 -1538 -4423 -2286 3136 4801 1676 -2543 -560 10439 8831 4788 -4980 -8483 -8880 -3019 -4776
14284d776n522l05k041R32O889m820m211N866N260N884o01k675l36J824j754m680
14268e066j176l785M319O378J596n5k71m022K65k085k476N64j048Q955L311J247
14252F651l454m777k097K401j630l519j867J296L999j889j93j718J422j844p73
14237g992N805J03J072r60K336K134L806n021n180j988J526M44M961R00Q8J781
14221C815p435o364j363J294o024l967L091K534J829R029J1279O104M526l688
14207A4660r04n713q586q033L169J731n997N940J224J963J73l962n746M924l863
14192i020j451J203K729M301l090R777L228k698q244o102J271l82o296L780k606
14177a3600k543P118n339M691J864N335k584j840K062K684j104Q16L773p03Q16
$$ plain form
14284 -4776 -10298 -10603 -12644 -11712 -4823 -9643 -13854 -7988 -2728 3156 2555 -120 -456 1368 -386 -5066
14268 -5066 -6242 -10027 -5708 670 2266 2211 1940 -2082 -1817 -3902 -6378 -5814 -6862 2093 5404 6651
14252 6651 3197 -1580 -3677 -1276 -2906 -6425 -8292 -6996 -2997 -4886 -5079 -6797 -5375 -7219 -7992
14237 -7992 -2187 -2084 -1012 -1972 364 2498 6304 1283 -3897 -5885 -4359 -3915 1046 1946 2034 3815
14221 3815 -3620 -9984 -11347 -10053 -16077 -20044 -16953 -14419 -12590 -3561 7718 13822 18348 14660
14207 14660 13756 8043 -543 -8576 -5407 -3676 -9673 -3733 -2509 -546 -373 -4335 -10081 -5157 -9020
14192 -9020 -10471 -9268 -6539 -2238 -5328 4449 7677 4979 -3265 -9367 -8096 -8478 -14774 -10994 -13600
14177 -13600 -16143 -9025 -14364 -9673 -7809 -2474 -5058 -6898 -4836 -2152 -3256 -2440 1333 630 1446
14162A446N735m750j4329k812J275J0448l987n525M322M212K392k487k025p50
14148f835k78L476j524M970P279j014n913m184O715N530k56k167p544p456k582
14133a1783q3o63O874K624J698k385k723k403J3646j45n759K622l739r30L115
14118c4l365K937J3420M90n679n082J073M300p120m955J595r45n521K249J288
14103e349j080j529K152J355K971L632o551J227j635O483N443Q543o102q768l41
14088D51j279l868L11M294J288l85l346j74n594q574J267P219J682j945j109Q22
14072h940P599K229K538k564j177M291L552k34m146l751r24l514n941J317j347
14057a1012m289k660k337L155j339q46M166M287L525P080L119n581R98L503l182
$$ plain form
14162 1446 7181 2431 -11898 -14710 -13435 -2987 -6974 -12499 -8177 -3965 -1573 -4060 -6085 -6835
14148 -6835 -7113 -3637 -5161 -191 7088 6074 161 -4023 2692 8222 7966 5799 -1745 -9201 -11783
14133 -11783 -11866 -12529 -5655 -3031 -1333 -3718 -6441 -8844 4802 4657 -1102 1520 -2219 -3149 -34
14118 -34 -3399 -462 12958 13448 7769 2687 3760 8060 940 -4015 -2420 -3365 -8886 -6637 -5349
14103 -5349 -6429 -7958 -5806 -4451 -1480 2152 -4399 -3172 -4807 1676 7119 15662 9560 792 451
14088 451 -828 -4696 -4385 -91 1197 812 -2534 -2708 -8302 -16876 -15609 -8390 -6708 -8653 -9762 -8940
14072 -8940 -1341 888 3426 862 -315 3976 7528 7294 3148 -603 -1527 -5041 -10982 -9665 -11012
14057 -11012 -15301 -17961 -20298 -17143 -18482 -19328 -15162 -10875 -7350 -270 2849 -2732 -1734 1769 -1413
14042a413r07o419l604j156L37m29N647Q851K950p761J875n14k935M291Q458k421
14026D850j0240j518M241O846M531M079R05m991o029l352N23k308J97j839j678
14011e783O54M773j578J73n582j678J0282M2P63Q70j243k368L123k131J674J588
13995C579J722n706l491M952l99n70L054l166k102N02l992j080P254O619l133
13980D043j392L763L817j365k149r206N50j367j541J566n945J787K049K21R212
13965D043J070n275K0O373J910q021k42M952J8j509k386R34j686n758l045j234
13949i836l19J74k997k730O97K416j994K169J0966M430K467j525M671L309J927
13934A3825l831l605M524r51j850p1j593j152n691q014j087Q294l884p2j891n12
$$ plain form
14042 -1413 -2320 -8739 -12343 -13499 -13162 -13591 -7944 907 3857 -3904 -2029 -2543 -5478 -1187 7271 4850
14026 4850 -5390 -6908 -2667 4179 8710 12789 13694 8703 2674 -678 -155 -2463 -2266 -4105 -5783
14011 -5783 -5129 -356 -1934 -1761 -7343 -9021 1261 1303 2066 2936 1693 -675 2448 317 1991 3579
13995 3579 5301 -405 -3896 1056 657 87 3141 -25 -2127 -1625 -5617 -6697 557 7176 4043
13980 4043 2651 6414 10231 8866 6717 -2489 -1939 -3306 -4847 -3281 -9226 -7439 -5390 -5169 4043
13965 4043 5113 -162 -142 6231 8141 120 -122 4830 4848 3339 953 1887 201 -5557 -8602 -9836
13949 -9836 -10155 -9981 -12978 -15708 -15011 -12595 -14589 -12420 -1454 2976 5443 3918 8589 11898 13825
13934 13825 9994 6389 10913 9962 8112 8041 6448 5296 -395 -8409 -9496 -1202 -5086 -5158 -7049 -7561
13918g561J07r76M39M584j248m263m180l633L781J36N404M98L008M315K685j489
13902A607K771k85N16o36m549k460k227k284n57M98N549K202n80N324L67j836
13886C420P012O908m407o704M880M255j760j1550l550j785j102L20P212m970n989
13871g810l352M416L4J692lJ580N437P004K50o046j466K473k466L727j938l241
13855B91k302o881j261K51O706O349j479p41J520K54j078m824o163N300K824j826
13839c060l588m255J168K782J200j434J1463J147j911L04k40M224n930r308o213
13824a3651K543J3294P816J339m23j569r416l435M6P711Q439q11k739N65L919
13809A3628r88m152M264P743o151p538M262K8q536o980J677N47L101l621K875
$$ plain form
13918 -7561 -7454 -8430 -7991 -3407 -4655 -8918 -13098 -16731 -12950 -12814 -7410 -6912 -3904 411 3096 1607
13902 1607 4378 4093 4609 3973 -576 -3036 -5263 -7547 -8104 -7606 -2057 145 -435 4889 5256 3420
13886 3420 10432 17340 12933 6229 11109 15364 13604 2054 -1496 -3281 -4383 -4063 3149 -1821 -7810
13871 -7810 -11162 -6746 -6712 -5020 -5023 -3443 1994 8998 9248 3202 1736 4209 1743 5470 3532 291
13855 291 -2011 -8892 -10153 -9902 -3196 3153 1674 933 2453 2707 1629 -3195 -9358 -4058 -1234 -3060
13839 -3060 -6648 -10903 -9735 -6953 -5753 -7187 4276 5423 3512 3816 3576 7800 1870 -7438 -13651
13824 -13651 -11108 2186 10002 11341 10918 9349 -67 -3502 -3456 4255 12694 11883 9144 9709 13628
13809 13628 12640 8488 12752 20495 14344 6806 11068 11096 2560 -4420 -2743 -2196 905 -2716 159
13794A59n409n512N345M597l465m275P557L598r133r330L470J2057L874J823P097
13779A2453J150n685K455k93o355J340j440j676L363J703j875p496o480l222N657
13764f401M461K1o157K962j39n155o635K827P048J0798J693n746k633J190k548
13749d414n293K709M849J0065O071n781k074k908M100J547r232n589R22J547K956
13734e25Q038M682m524l347K125K37k363o398k031N801j238O408R9J58J486M453
13718A3061o828o478K490q48m62J590K585M59o808m855L603L762J346n121m888
13703g392J171J631M904l870k983J416K443r77M981J477L08L022N144L879m937
13688A0217p24l525R13m937K3J595J06k154K914N329l300k883J3K358m979m866
$$ plain form
13794 159 -5250 -10762 -5417 -820 -4285 -8560 -1003 2595 -6538 -15868 -12398 -341 3533 5356 12453
13779 12453 13603 7918 10373 10080 3725 5065 3625 1949 5312 7015 5140 -2356 -8836 -12058 -6401
13764 -6401 -1940 -1919 -8076 -5114 -5253 -10408 -17043 -14216 -7168 3630 5323 -423 -3056 -1866 -4414
13749 -4414 -9707 -6998 -2149 7916 13987 8206 6132 3224 7324 8871 -361 -5950 -5028 -3481 -525
13734 -525 7513 12195 7671 4324 6449 6686 4323 -2075 -4106 1695 457 6865 6964 7122 8608 13061
13718 13061 6233 -245 2245 1397 935 2525 5110 5569 -1239 -6094 -2491 1271 2617 -2504 -7392
13703 -7392 -6221 -4590 314 -3556 -6539 -5123 -2680 -3657 1324 2801 3109 6131 11275 15154 10217
13688 10217 9493 5968 6881 1944 1967 3562 3668 1514 4428 9757 6457 3574 3587 5945 966 -3900
13672c900J350k536j41O301J687j275L778k099K993O068m344m117J957L026Q207
13657A6955R232N708L63o642p768k835j143l223M027L69r436K533J3377O300o529
13642B1288n932L358J620l034m781j083n265l742M573L296J225K628j301N196
13628A8046Q85m913l873M335P089M365J2900m171j8183k1603j3411n895K36K005
13614b2188L976Q618R875k869O458M116j04Q157J0655J4319J5026K8070L0082
13601A14191M7316O9507J03725J77533L30621N30145N05535O5218k81737l86451
13591A275603l97498l13588j87925r7102o0626m2369m0601k5238j5865j7210j4150
13580F3431m086o356l806l435m550o508p95N021M534n411o234m478n809j43M468
$$ plain form
13672 -3900 -2550 -5086 -5227 1074 2761 1486 5264 3165 6158 12226 7882 3765 5722 8748 16955
13657 16955 26187 31895 32258 25616 17848 15013 13870 10647 14674 15043 5607 8140 21517 27817 21288
13642 21288 15356 18714 20334 17300 12519 11436 6171 2429 7002 10298 11523 14151 12850 18046
13628 18046 18931 14018 10145 14480 21569 25934 38834 34663 16480 -5123 -18534 -24429 -24193 -22188
13614 -22188 -18212 -9594 281 -2588 3870 7986 7882 16039 26694 41013 56039 84109 114191
13601 114191 161507 231014 334739 512272 842893 1373038 1878573 1943791 1662054 1275603
13591 1275603 878105 564517 376592 279490 218864 176495 135894 110656 94791 77581 63431
13580 63431 59345 52989 49183 45748 41198 34690 33895 38916 43450 38039 31805 27327 21518 21375 25843
13565B5843m259q62m475n299j563J539P858L940l277l143K068Q151L291M881K558
13550C7251j1256p528N594J685j799m729r13J832k019O683K804L15J416M680M265
13535C8281k390j519R358R284j462m898m014n439L462q36L45k428k399l358k821
13520B9166Q22j393j748J826K355m870K585r817j788l663L14N068m531R429k88
13505B3467O22k283k670O348L662m637j709p3m643k261M261K354L278J821o719
13490B0818k150q70l533P06j906n038m171j945N378J0244R154M323m245k310p482
13475A6973k835k797K616P342J789q446m846Q581P046J625n55N634J5212N242
13461E2581p329n427p767k327m326m506O98N239m744l290n684k327M373K872m95
$$ plain form
13565 25843 21584 20722 16247 10948 9385 10924 18782 22722 19445 16302 18370 26521 29812 34693 37251
13550 37251 25995 18467 24061 25746 23947 19218 18305 20137 18118 24801 27605 27920 29336 34016 38281
13535 38281 35891 34372 43730 53014 51552 46654 42640 37201 40663 39827 40172 37744 35345 31987 29166
13520 29166 29988 28595 26847 28673 31028 26158 28743 18926 17138 13475 13789 18857 14326 23755 23467
13505 23467 24089 21806 19136 25484 29146 24509 22800 22727 18084 15823 20084 22438 25716 27537 20818
13490 20818 18668 17798 14265 14971 13065 8027 3856 1911 7289 17533 26687 31010 26765 24455 16973
13475 16973 14138 11341 13957 21299 23088 14642 9796 18377 25423 27048 26493 32127 47339 52581
13461 52581 45252 39825 32058 29731 25405 20899 21597 26836 22092 18802 13118 10791 15164 18036 17541
13446A7541Q496R180n610m188N87P643N573N060J0782L7161O1038L5962j4260
13433A74965k9663k6830j2790j1976N981K6620L3860L861k1408k5443k3320j5895
13421G7962j4387M314J751m864o09n229l948k729p75J650k072L391Q392J2294
13407G5141K5404N4113N5998J6927o051l2730k6916k0852k6400k7193j4088j0532
13395F2821p239j0908n529J514Q049M112m23Q167J8j261j0720p736o876m296K125
13380C1818Q070M35m68j648j382N644l033j678j159k947k303l383l976l430N217
13365B5777M600r80J083O421J0535M643l584Q914J8590J5280k06l832j5284k1399
13351E0558k1286j1471m277o455j3764j2221O356J8339J6440j104k3995k1098
$$ plain form
13446 17541 26037 35217 29607 25419 26006 33649 39222 44282 55064 92225 153263 189225 174965
13433 174965 145302 118472 105682 93706 99687 126307 160167 164028 142620 117177 93857 77962
13421 77962 63575 67889 69640 64776 64167 58938 54990 52261 51486 53136 51064 54455 62847 75141
13407 75141 100545 154658 210656 227583 221532 188802 161886 141034 114634 87441 73353 62821
13395 62821 55582 44674 39145 40659 48708 52820 52397 60564 60582 59321 48601 40865 33989 29693 31818
13380 31818 39888 40323 39855 38207 36825 42469 39436 37758 36599 33652 31349 27966 23990 20560 25777
13365 25777 30377 29397 30480 36901 47436 52079 48495 57409 75999 91279 91073 87241 71957 50558
13351 50558 29272 17801 13524 7069 -6695 -18916 -12560 5779 22219 21115 -2880 -23978
13339b3978j1648j306N069J1508J0388O669J6878J3765N38m475p399j8250j6866
13326a9107N098R256J799m762L395M41n056m412M664O279Q78J898J1759R664L440
13311B5234O251J1809K2448L5165N3499O6205K4408k2564k9358l2655k6994k4852
13299A08596k8567k4734q351m634Q27M710J1724J5712O328M38n128l231j173l680
13285F8837n964J5411M1512M8419M7964L9710K5166j4880j43862j18362L5098
13274C9049N1513O7408O3067K1015k643k576P81j948j3912j3526j3970q269q701
13261A77288j0868n325m661r293q402r36R994J6302J5108P225R573R645Q753L4683
13247B49086P6714J29857R8166k9185o4138o9312q3594n9548l1498r521J196K370
$$ plain form
13339 -23978 -35626 -36932 -31863 -20355 -9967 -3298 13580 27345 27883 23408 16009 -2241 -19107
13326 -19107 -14009 -4753 -2954 -7716 -4321 -3880 -8936 -13348 -8684 -2405 -1527 371 12130 21794 25234
13311 25234 31485 43294 65742 100907 154406 220611 245019 222455 193097 160442 133448 108596
13299 108596 80029 55295 46944 42310 43137 47847 59571 75283 81611 82049 76921 73690 72517 68837
13285 68837 62873 78284 119796 168215 216179 255889 281055 266175 122313 3951 39049
13274 39049 90562 157970 221037 242052 239409 236833 237614 235666 221754 208228 194258 185989 177288
13261 177288 166420 161095 156434 147141 138739 137803 147797 164099 179207 186432 196005 205650 214403 249086
13247 249086 325800 455657 553823 524638 460500 391188 307594 248046 216548 207027 208223 210593
13235B10593l192r106q138K896m76n881L006N450N357N003M122K904J1950L1816
13221B56304K3136J2782l926j7781l2692j5337M068J3587J5867J4015J1814J3100
13209B94937Q122J2910J6329J3902P131L769L230K999L556j986M462J4539J8065
13196D01965K7120K6647J4739L8114M3449M1398K5668P884K274L9417R6713J16015
13184H81403R8978R5430Q6069O7835O1166Q8033J12067J31249J58940J96049J90847
13173B168066K22400K46194K52807K97393L71770M09920M98842O74523Q96033
13164F037948J140934J413802J803046K392796L249458M632935O434948Q451083
13156C5556950J1961769J9619636L5505252O5411908J01492479Q6531673K253077
$$ plain form
13235 210593 207401 198295 190157 193053 192577 186696 189702 195152 200509 205512 209634 212538 224488 256304
13221 256304 279440 292222 288296 270515 237823 222486 226554 240141 256008 270023 281837 294937
13209 294937 303059 315969 332298 346200 353331 357100 360330 363329 366885 364899 369361 383900 401965
13196 401965 429085 455732 470471 508585 552034 593432 619100 626984 629258 668675 765388 881403
13184 881403 980381 1075811 1161880 1229715 1290881 1378914 1490981 1622230 1781170 1977219 2168066
13173 2168066 2390466 2636660 2889467 3186860 3558630 3968550 4467392 5141915 6037948
13164 6037948 7178882 8592684 10395730 12788526 16037984 20670919 27105867 35556950
13156 35556950 47518719 67138355 102643607 168055515 269547994 356079667 358332744
13149C58332744n3491886p0059652p3861546n5782848l3006642j8636192j1762932
13142D1731046q228692o110714m750739l671943k768935k063551j648113j391790
13134A1096569j220290j051986q75797p47129o48783n47248m79706m15487l54224
13125D755919l24202k98286k57174k31413k38704k35785k10625j67995j45732
13116B646003j17342q5250r0493j23165j31091j40146j52571j36137j17252j02567
13106A449989q6174q4810p3033n2289n1245p1515p7591o4533m4760l5620k3302
13095G85117j5533o437j0297q70p864l4932m1069l8061k3265j8981k2792k4647
13083E40369l3408m6262k5959k199J9759L3377J5076L41j9164k6070k4056k4169
$$ plain form
13149 358332744 304840858 234781206 160919660 105136812 72130170 53493978 41731046
13142 41731046 33502354 27391640 22640901 18968958 16200023 14136472 12488359 11096569
13134 11096569 9876279 8824293 7948496 7201367 6552584 6005336 5525630 5110143 4755919
13125 4755919 4431717 4133431 3876257 3644844 3406140 3170355 2959730 2791735 2646003
13116 2646003 2528661 2443411 2352918 2229753 2098662 1958516 1805945 1669808 1552556 1449989
13106 1449989 1363815 1279005 1205972 1153683 1102438 1030923 953332 888799 844039 808419 785117
13095 785117 769584 763147 752850 751980 744116 709184 668115 630054 606789 587808 565016 540369
13083 540369 506961 460699 434740 432541 452300 485677 500753 501094 481930 455860 431804 407635
13071D07635k4859r117j0735j6203j9661j2567o63K159m747r669j1620k128l23
13058B87502l320p276l778n998n200q447j3589r255n344r769m964R128L918m946
13044B18662j3354j7496k73n640j6755j6668j4828k2147j9537j3653p020n579
13032F5712l441k248K101J7452M7738J08523J51497N7093n9148q8380p9853m0743
13020A76303Q191K6632J4430J8989L389j8818p942j825q067k454r633m970q218
13007A86007m074L379P425p477j8210j6710j0451o178M186R850k634Q245L4291
12994A87649J9482o832q784p104N061J2908N842j3420j5492J153m233o599J095
12981A70726p98r408n989M550L896m970l155j157k129p406j6816p654J7Q998K5999
$$ plain form
13071 407635 382776 373659 362924 346721 327060 314493 313830 315989 311242 301573 289953 287825 287502
13058 287502 284182 276906 273128 267130 261930 253483 239894 230639 225295 215526 210562 219690 223608 218662
13044 218662 205308 187812 187539 181899 165144 148476 133648 111501 91964 78311 71291 65712
13032 65712 62271 60023 62124 79576 127314 235837 387334 444427 385279 296899 217046 176303
13020 176303 184494 211126 225556 244545 247934 229116 221174 219349 211282 208828 199195 194225 186007
13007 186007 181933 185312 192737 185260 167050 150340 139889 133711 137897 147747 145113 153358 187649
12994 187649 207131 200299 191515 184411 189472 202380 208222 194802 179310 180463 176230 169631 170726
12981 170726 169928 160520 154531 159081 162977 158007 154852 153695 151566 144160 127344 119690 119707 128705 154704
12966A54704J7502K2279M6220M8208J2781k8433m3454m3336l8352q934R044k626
12954A45603q652o818m226N391m65j5878k5109k2225j7382m644P761L704Q417
12941F5477J513O105P545J0658K946Q73J847k33O11p90k563n403k042j4206j1795
12926F0543k020K983m073J06p120L227J1854KO47j0091j3370k175k202M359K965
12911D5635m275Q006N260J2738Q553j0708m071m595L838J2709K0583R587L30j266
12897A02324N376j081j1730r203q179k570j087l061j5078j1181m004J510Q633
12884E0669L452P932K816l416k802Q85K145L370Q116Q043J1739J4817O710k076
12870A12400j1973j1132p419j5000o423P324l507k600l865m950M190l383j0276
$$ plain form
12966 154704 172206 194485 240705 288913 301694 273261 229807 186471 148119 139185 148229 145603
12954 145603 136951 130133 125907 131298 130833 114955 89846 67621 50239 45595 53356 57060 65477
12941 65477 66990 73095 80640 91298 94244 95117 96964 96731 97342 96552 93989 88586 86544 72338 60543
12926 60543 58523 61506 57433 57539 50419 53646 65500 65502 66149 56058 42688 40513 38311 42670 45635
12911 45635 41360 49366 54626 67364 75917 65209 61138 56543 60381 73090 93673 103260 103590 102324
12897 102324 107700 106619 94889 85686 77507 74937 73850 70789 55711 44530 40526 42036 50669
12884 50669 54121 62053 64869 61453 58651 59536 61681 65051 73167 81210 92949 107766 114476 112400
12870 112400 100427 89295 81876 66876 60453 67777 64270 61670 57805 52855 57045 53662 43386
12857D3386m708N695J2686J1030K146N223J1421L149j3608j2843j1342k024k809
12844D7402r384j2917n197k550j3043j188J8726J0968j832j289M748R305l270
12831D0479q346J308O568Q098Q527j674N587J810J353J2417K6806M4915O3391
12818B11239N1345K5203j750m4899n4875m2462l6001k7682j6688p535k233n339
12806D8323r594l929P349J0241N205R287J0026M375j664n882j1845n771o084j515
12792D8522O05j0490j0580M04L479m949k550k797p028j112N602N393J831N40m470
12777B2400p430M054R161L060L703J944o646o516j280J378O768o313q651L463
12763A9095p08M116K112N426M180P807l335j412N077n185l863J526j271q161R27
$$ plain form
12857 43386 38678 44373 57059 68089 70235 75458 86879 90028 76420 63577 52235 50211 47402
12844 47402 38018 25101 19904 17354 4311 3123 21849 32817 30985 29696 34444 43749 40479
12831 40479 32133 33441 40009 48107 56634 54960 60547 62357 63710 76127 102933 147848 211239
12818 211239 262584 287787 286037 241138 186263 143801 107800 80118 63430 55895 53662 48323
12806 48323 38729 34800 42149 52390 57595 66882 76908 81283 79619 73737 61892 56121 50037 48522
12792 48522 49127 38637 28057 28461 31940 26991 24441 21644 14616 13504 19106 24499 26330 26870 22400
12777 22400 14970 19024 28185 31245 34948 36892 30246 23730 22450 23828 30596 24283 15632 19095
12763 19095 18387 22503 24615 30041 34221 42028 38693 37281 42358 37173 33310 34836 33565 25404 26331
12748B6331M64o473o13m530j047P37o302L66L944M793Q750m332p455o0M673j163
12732A8083L369N605N154L540J364J481O551O389J433N683K792m773l170l638
12718D9863o033Q020Q723J025l092K223N339J6509J5194J2432K2925M3193M8323
12705B24644N9998J14015K01723L83819N64466M29796m5506l15530l98311l84985
12695H34129k72815j57509q8237n6162m0732k8123k1725r324r220m548k632N288
12683A48390j2119k6034j8252j0557j6827j0329m33m120k250n024l507K382O818
12670D8138J5594R372M960n128j2598j2809n502l852n18n939J009J885r537j375
12656B3700L178p123J62K645n425r997N245M928Q25j0604J714l397p426P878J0245
$$ plain form
12748 26331 26795 20322 19709 15179 14132 14869 8567 8933 12877 17670 26420 22088 14633 14573 19246 18083
12732 18083 21452 27057 32211 35751 37115 38596 45147 51536 52969 58652 61444 56671 53501 49863
12718 49863 43830 51850 60573 61598 58506 60729 66068 82577 97771 110203 133128 176321 224644
12705 224644 284642 398657 600380 984199 1548665 1978461 1932955 1617425 1219114 834129
12695 834129 561314 403805 315568 259406 218674 190551 168826 159502 150282 145734 143102 148390
12683 148390 136271 110237 91985 81428 64601 54272 53839 49719 47469 42445 38938 41320 48138
12670 48138 63732 73104 78064 72936 60338 47529 42027 38175 37657 31718 32727 34612 25075 23700
12656 23700 26878 19755 19917 22562 17137 7140 12385 17313 18138 7534 9248 5851 -1575 6303 16548
12641A6548O330L813N0l807k680j0605K527R835J632n608k67J074J474J729K953
12626B4998q399q737J776M601L394P61K905J277n042j236N707M436L487m610M43
12611B5761L626J0720O019O706J2784k488j709l121r458r518n474p176l378j46
12597B3148m724j059l445m709j190P727R085j247l663r86j726k018j0434r467
12583d708J0031K373n14L400R032p35k547j350r09L640p93k115p093K347J714
12568A1773k435J57o305l202J11l144R11L821J28p24k181K430L278P381Q17j798
12552A1018o923m164k563O458Q902L016M24j521J511J46n083J658J749N39K924
12537A8091O167j2362n372k239k049l050P428M979n159p111O344M606r92N388
$$ plain form
12641 16548 22878 26691 26741 22934 20254 9649 12176 22011 23643 18035 17768 18842 20316 22045 24998
12626 24998 16599 7862 9638 14239 17633 18394 21299 22576 17534 16298 22005 26441 29928 25318 25761
12611 25761 29387 40107 46126 52832 65616 63128 61419 58298 48840 39322 33848 26672 23294 23148
12597 23148 18424 17365 13920 9211 8021 15748 24833 23586 19923 18937 17211 15193 4759 -4708
12583 -4708 5323 7696 7182 10582 19614 18879 16332 14982 14073 17713 16920 14805 7712 10059 11773
12568 11773 9338 9495 3190 -12 99 -3045 -2134 1687 1815 1091 -1090 1340 4618 11999 12816 11018
12552 11018 4095 -69 -2632 3826 12728 15744 16168 14647 16158 16304 11221 12879 14628 15167 18091
12537 18091 24258 11896 6524 4285 2236 -814 6614 11593 6434 -677 5667 10273 9281 14669
12523A4669n474J06O978J08j459J185L317l08l55j723q109n905o12J593L964J42
12507H117j077Q266k987Q49j097j300j157J596M398j98m142k118K673l465K197
12492A0555j927J097m187m891K897j496P226M248J136l229k03k377j302J932O19
12477A0098j539l088J933J055k993l608j169k87m776P00M127n83k778j395P769
12462C466M531l926l466M51J396J436j305K54J1198R748o130j0357m18Q146J3497
12447B8521J2897J6109M1515Q3086J05167J2759n2618n3431o3104m6536k5890
12436E8475p520j769m450r983j2557o855O67m05j890K447J436n816L133J560l837
12421A2636q355m125L419M464k183j925L437P969j854n909j234J231Q732k216
$$ plain form
12523 14669 9195 9301 16279 16387 14928 16113 19430 19122 18767 17044 8935 3030 2418 4011 7975 8117
12507 8117 7040 15306 12319 13168 12071 10771 9614 11210 15608 15410 11268 9150 11823 8358 10555
12492 10555 8628 9725 5538 647 3544 2048 9274 13522 14658 11429 11226 8849 7547 9479 10098
12477 10098 8559 5471 7404 8459 5466 1858 689 402 -4374 -3674 453 -130 -2908 -4303 3466
12462 3466 7997 4071 605 1056 2452 3888 2583 2837 14035 23783 17653 7296 6878 15024 28521
12447 28521 41418 57527 99042 182128 287295 300054 247436 194005 130901 84365 58475
12436 58475 50955 49186 44736 34753 22196 15341 16008 15603 13713 16160 17596 11780 14913 16473 12636
12421 12636 4281 156 3575 8039 5856 3931 7368 15337 13483 7574 6340 7571 16303 14087
12407A4087j957m567l238j043j335n85L642p669n402Q724R525m9j0720m949L286
12392b250L889M085j732q008m187j782N22J3330R012L468J53p122l758L556R583
12377A8759O198K954k523l772p89q271K606P71M49K596k342l640n274J914Q025
12362A7661K702k912l943q240n565M354L546J886N356J673m056k560j14j55J73
12347I806j417J183L75L134O258L323R96l435j391N423j092r98o153r883l22m063
12331A744J623L198j537j066j535j720P204M26m466K720j690p401J940J633J285
12316B358Q42N877N866j536P5l376p00k651k955K00L125k829o724N597Q614N694
12300A7477q32m688M563j933M82j481q992R2J567k199k10j357K416J975J211j906
$$ plain form
12407 14087 12130 7563 4325 3282 1947 1362 5004 -2665 -8067 657 10182 10133 -587 -5536 -2250
12392 -2250 1639 5724 3992 -4016 -8203 -9985 -9463 3867 12879 16347 16500 9378 5620 9176 18759
12377 18759 24957 27911 25388 21616 20827 12556 15162 15933 16382 18978 16636 12996 7722 9636 17661
12362 17661 20363 17451 13508 5268 -297 4057 7603 9489 14845 16518 12462 9902 9788 9633 9806
12347 9806 8389 9572 9947 13081 19339 22662 23658 20223 18832 24255 23163 22165 16012 6129 5807 1744
12331 1744 3367 6565 5028 3962 2427 707 7911 8337 3871 6591 4901 -2500 -560 1073 2358
12316 2358 3200 9077 14943 13407 13482 10106 9406 6755 3800 4000 7125 4296 -2428 3169 11783 17477
12300 17477 16645 11957 16520 14587 15069 13588 4596 4688 6255 4056 3846 2489 4905 6880 8091 6185
12284F185J028j388J685J313K180N124j572l778n333l997K754K71M30p39n760
12269a597O966N529l663m167m386k255J699j528J479l63m88N83J686J190L960
12254D645L502k058j972O473L101M958N103Q803Q67j875p83J770k277K263J1578
12239D4098Q067k538n407k214j0260l987N43J353o880q14J984p51m547M64K364
12224B1475J090K645n126J043O361M819J226J738k090k852N748O402N071N894
12210E3444J423P566M457J319M016j011l522n131n841j1198k217Q9L494l002q720
12195C5166l807o026k249P245m498m714K363K515O438j635k197K02q370k182M010
12180B2261P170J1417J2057j087m230kK8n721R37O09j1516o878k443j80p668j032
$$ plain form
12284 6185 7213 5825 7510 8823 11003 16127 14555 10777 5444 1447 4201 4472 4902 4163 -1597
12269 -1597 5369 10898 7235 3068 -1318 -3573 -1874 -3402 -1923 -2286 -2774 -2191 -505 685 4645
12254 4645 8147 6089 4117 10590 13691 18649 23752 32555 33422 31547 30764 32534 30257 32520 44098
12239 44098 52165 49627 44220 42006 31746 27759 28302 29655 22775 21961 23945 23194 18647 19111 21475
12224 21475 22565 25210 20084 21127 27488 32307 33533 35271 33181 30329 36077 42479 47550 53444
12210 53444 54867 62433 66890 68209 72225 71214 67692 62561 56720 45522 43305 43394 46888 43886 35166
12195 35166 31359 25333 23084 30329 25831 21117 23480 25995 32433 30798 28601 28803 20433 18251 22261
12180 22261 29431 40848 52905 51818 47588 47586 47614 41893 42830 43439 31923 25045 22602 22422 14754 13722
12164A3722J6225M803q576m442o044r775m286n567M325O590j285j834j0209k641
12150h994J5601M733l015k438K994N761L485R86p949m031M320L685o865P56K451
12135A1480L941m85j175k324j889n399j054M617P638N522P01o395m545n3l200
12120G380k292j610J473N181k342J681l146q736j489J278J927L955O33k490J811
12105C214k078J871n327l106m167P080O508k298O46r4L963J372l345j728J702
12090D213J514p031n00M174M90J333k541L83p34n073J348O236M556M300p890n045
12074b67N240O069p11l484J256R9J825O957l751j383o00l803M153p97k943l445
12058D415k362K357K494j586n391k42q1N881Q907J561o511l97J72j68o94o9r44
$$ plain form
12164 13722 29947 34750 26174 21732 15688 5913 1627 -3940 385 6975 5690 3856 -6353 -8994
12150 -8994 6607 11340 8325 5887 8881 14642 18127 19113 11164 7133 11453 15138 8273 9029 11480
12135 11480 15421 14936 13761 11437 9548 4149 3095 7712 15350 20872 21573 15178 10633 10580 7380
12120 7380 5088 3478 4951 10132 7790 9471 6325 -2411 -3900 -2622 -695 3260 3893 1403 3214
12105 3214 1136 3007 -2320 -5426 -9593 -2513 3995 1697 2343 2249 6212 7584 4239 2511 4213
12090 4213 5727 -1304 -1804 2370 2860 4193 1652 2035 1301 -3772 -2424 3812 8368 12668 4778 -267
12074 -267 4973 11042 10331 6847 8103 8202 10027 16984 13233 11850 11250 7447 11600 10803 7860 4415
12058 4415 2053 4410 6904 5318 -73 -315 -396 5485 14392 15953 9442 9045 9217 9049 8355 8286 7342
12041G342k374k324n352L423j949q26O032n148k517P293l796L958l722k214k810
12026d984L524L768J959l075L837R289m090l969p62L257j244J460p23K184M91
12011A0922m811p491M059N866K776k170k511n522Q92O644Q208O460l190n800k861
11996A1471J610K349k693l844l03k992k332l692l868J623j262O876J0374n013
11982H304q286l185k597l646L279K734n25l342l606l035K810K400p6L712N328
11967B69J979q72J444k773J426J144J433j8k601J614l218L9l679p47O843L903
11951F186o11k754O550n00p741p896M371O865m675P39J674m397j888M404L362
11936C689K897m24K829m466k43J947j453K680j155k562j627o544K382L28R556
$$ plain form
12041 7342 4968 2644 -2708 715 -1234 -2060 3972 -1176 -3693 3600 -196 3762 40 -2174 -4984
12026 -4984 -1460 2308 4267 1192 5029 14318 10228 6259 5497 8754 7510 8970 8247 10431 10922
12011 10922 6111 -1380 2679 8545 11321 9151 6640 1118 2010 8654 16862 23322 20132 14332 11471
11996 11471 13081 15430 12737 8893 8590 5598 3266 -426 -4294 -2671 -3933 2943 13317 8304
11982 8304 18 -3167 -5764 -9410 -6131 -3397 -3922 -7264 -10870 -13905 -11095 -8695 -8771 -5059 269
11967 269 2248 1376 2820 47 1473 2617 4050 4032 1431 3045 -173 -134 -3813 -4560 2283 6186
11951 6186 5575 2821 9371 8871 1130 -6766 -2395 4470 -205 534 2208 -2189 -4077 327 3689
11936 3689 6586 6162 8991 4525 4282 6229 4776 7456 6301 3739 2112 -4432 -2050 -1722 7834
11921G834J0384l394q658l654m093l110j007m246M987K575p857j0385J3799J5474
11907H649P382N764k679J972j2862q885m7j65k915K258K677o48L340n65k750J951
11891B477N99L826n245l572j830k742j527n96L283N34l685M074O949Q81J648K627
11875G701L744k51n822j620n308M75j899m722L216k89k101j088p69k550J308J1359
11859A384O976J764O094K6l655l256l100n136q874n004M737Q285N920j14N391
11844A1438M2N03n526k243n54j976j205k114K165N121m448n113K963N688l276
11829A465q651P0M656J119L360J0423R41m269k170o190n768l290k581M045N478
11814a362Q938l917q820N354K310L80K408K835M893M68p05n452O19J433k025P667
$$ plain form
11921 7834 18218 14824 6166 2512 -1581 -4691 -5698 -9944 -4957 -2382 -10239 -20624 -6825 8649
11907 8649 16031 21795 19116 21088 8226 -659 -706 -871 -3786 -1528 1149 501 3841 3276 526 2477
11891 2477 3076 6902 1657 -1915 -3745 -6487 -8014 -8610 -5327 -4793 -8478 -4404 2545 3426 5074 7701
11875 7701 11445 11194 5372 3752 -1556 -1081 -2980 -7702 -4486 -4775 -6876 -7964 -8733 -11283 -9975 1384
11859 1384 8360 10124 16218 16244 12589 9333 6233 1097 -7777 -12781 -8044 241 6161 6047 11438
11844 11438 11480 11983 6457 4214 3660 1684 479 -1635 530 5651 1203 -3910 -947 4741 1465
11829 1465 -7186 -7116 -2460 -1341 2019 12442 13383 9114 6944 754 -5014 -8304 -10885 -6840 -1362
11814 -1362 7576 3659 -5161 193 2503 2883 5291 8126 13019 13487 12782 7330 7949 9382 7357 15024
11798A5024N191o955M461J23J229L83O5p661n633m096o731K971K119p50M611M563
11782H914L703K840q50k316o957p178j94N88N040k73N975J722r260j825j201M663
11766C391j204k07J377k136o973K490P891O272Q17l647R6q164l922L018K184P176
11750H459O914o768p900R36M44l45j192J298L873m526k359P124l211o814o094
11735a0161n041M020J1584Q135j342J23l821l018n117K982M179O578O440o602
11721H939n926r62l744m224L294J2014l844J344m707m56J89j565k727j068K053
11706a390N959k02r079p932j179n129R352P195k66m208j489Q34M20l287O772o062
11690i691l531J07k845K053N754Q911R268j295m768l896o675M045L999j665k534
$$ plain form
11798 15024 20215 13260 17721 17844 19073 19456 19521 11860 6227 2131 -4600 -1629 490 -260 4351 8914
11782 8914 12617 15457 14607 12291 5334 -1844 -2038 -1450 3590 3317 9292 11014 1754 -71 -1272 3391
11766 3391 2187 1980 3357 1221 -5752 -3262 4629 10901 11718 8071 8167 3 -3919 -901 1283 8459
11750 8459 15373 8605 705 1641 2085 1740 548 1846 5719 1193 -1166 5958 2747 -4067 -10161
11735 -10161 -15202 -11182 402 8537 7195 7318 3497 479 -4638 -1656 2523 9101 15541 8939
11721 8939 3013 2051 -1693 -5917 -2623 9391 5547 6891 2184 1728 1917 352 -2375 -3443 -1390
11706 -1390 4569 4367 -4712 -12644 -13823 -18952 -9600 -2405 -2671 -6879 -8368 -7534 -7114 -10401 -3629 -9691
11690 -9691 -13222 -13115 -15960 -13907 -8153 758 10026 8731 3963 67 -6608 -2563 1436 -229 -2763
11675b763L308J835l278m347k14J021p26k286n000j150k815K685P664N093K498
11660A525Q74J989K311j183m259o94O791j990j0149k287K07M791J3526J916j4048
11645f80o203L098j303K301J72k697l174K462Q065L617Q9L318m298j119j711q95
11629A042J1Q552L420o180o672J079J463r41P39L891k831J608J0558M082n58J279
11613B0542m46j816l641J197M098K815k733j3554j577J73P22K006P11P00m968
11598D229j709O622K721j562q316r369K100P268L687J798q51l339k210k147J257
11583A79L769J759p202l154L860j788M553K353m169o055k779r45J312P267M448
11568C408J392l849n12L165N63n098Q06l795K537J826N0O838N959K724m349o501
$$ plain form
11675 -2763 545 2380 -898 -5245 -5459 -4438 -5164 -7450 -12450 -13600 -16415 -13730 -6066 -973 1525
11660 1525 2399 4388 6699 5516 1257 563 7354 5364 -4785 -7072 -6865 -2074 11452 13368 -680
11645 -680 -6883 -3785 -5088 -2787 -2615 -5312 -8486 -6024 2041 5658 5747 9065 4767 3648 1937 1042
11629 1042 1053 9605 13025 6845 173 1252 2715 1774 2513 6404 3573 5181 15739 19821 19263 20542
11613 20542 20096 18280 14639 15836 19934 22749 20016 6462 4885 5058 5780 7786 8497 9197 4229
11598 4229 2520 9142 11863 10301 1985 -7384 -5284 1984 5671 7469 6618 3279 1069 -1078 179
11583 179 3948 5707 -1495 -4649 -789 -2577 1976 4329 160 -5895 -8674 -9619 -8307 -1040 3408
11568 3408 4800 951 439 3604 4167 -931 -125 -3920 -1383 443 493 7331 13290 16014 11665 5164
11552E164q72l879M04L652j358m602j601N69l537p574l94J3399R099n990o249
11537c769O77N658N081k998n199L806Q109j066o811l149K909j0973q211L466L491
11522h979N776M868k358n856q48Q185K514L9M82P38o658j909J11O339L783p722
11506a495j0469Q68P939k100K84n806k468J396Q341L415K230J0936k708j2860
11492b497l672n97k751R475M659J806K381l40K69L88m315m817j689k89O840K271
11476G122m478Q284j020m091j0084k881L271K820L156J59j449K325l768q556J699
11461g491k964N814J0603rm249n053j278j94N252K024p934k005k211L63Q475J840
11445I83J690n900l179L601O377L305O764K791J154l043n725o200n147l735K389
$$ plain form
11552 5164 4292 413 817 4469 3111 -1491 -3092 -2523 -6060 -13634 -14028 -629 8470 2480 -3769
11537 -3769 -3092 2566 7647 4649 -550 3256 11365 10299 3488 339 3248 -7725 -15936 -12470 -8979
11522 -8979 -3203 1665 -693 -6549 -7397 788 3302 3341 3823 4561 -2097 -4006 -3895 2444 6227 -1495
11506 -1495 -11964 -11096 -3157 -5257 -4973 -10779 -13247 -11851 -3510 -95 2135 13071 10363 -2497
11492 -2497 -6169 -6766 -9517 -42 4617 6423 8804 8464 8733 9121 4806 -11 -1700 -1989 4851 7122
11476 7122 2644 10928 9908 5817 -4267 -7148 -3877 -1057 2099 2258 809 3134 -634 -9190 -7491
11461 -7491 -10455 -4641 5962 5953 1704 -3349 -4627 -4821 431 2455 -5479 -7484 -9695 -9332 -857 983
11445 983 2673 -3227 -6406 -2805 3572 6877 13641 16432 17586 14543 8818 2618 -2529 -6264 -3875
11430c875J842N841o86p711j325M066Q49p465m346L396J1449k971o274r89M051
11415d148K598l990L982O650k457K47j994j49L997R93O698j729p734K809N673
11400A1446l062m271r034m65p82m56M733m13m168l826L10l44L460O508R648n101
11384D183o488P4j530J648j129J407J818o901l031O776O123N810L938m124k322
11369F252K28L785k38n808m617J271p362j456N835N481j837n299m431k278N092
11354e382J042p182K275k444P84j475O89N271n32p34R88K016k816j38J014n743
11338a2367n49J588m75j221P02M463J0886K700m397M05p39J63l190K533M902j771
11322C633M845K239K284P365J353n637M225K887k399l016n035q764k044R260M05
$$ plain form
11430 -3875 -2033 3808 3122 -4589 -5914 -1848 -999 -8464 -12810 -9414 2035 -936 -7210 -8199 -4148
11415 -4148 -1550 -5540 -1558 5092 2635 2882 888 739 4736 5729 12427 10698 2964 5773 11446
11400 11446 8384 4113 -4921 -5386 -6168 -6624 -1891 -2304 -6472 -10298 -9988 -10332 -6872 -364 9284 4183
11384 4183 -2305 -2231 -3761 -2113 -3242 -1835 -17 -6918 -9949 -3173 2950 8760 12698 8574 6252
11369 6252 6480 10265 10027 4219 -398 873 -6489 -7945 -2110 3371 1534 -3765 -8196 -10474 -5382
11354 -5382 -4340 -11522 -9247 -11691 -10907 -12382 -11693 -6422 -6954 -7688 -6700 -4684 -7500 -7638 -6624 -12367
11338 -12367 -12916 -11328 -11803 -13024 -12322 -7859 3027 5727 1330 1735 996 1159 -2031 502 5404 3633
11322 3633 8478 10717 13001 20366 21719 16082 20307 23194 20795 17779 12744 3980 1936 11196 11601
11307A1601p930K214L799k119l53q863q447M454M901N233M64L475O001J828j0881
11292E377l057M380N736l881n753m513q85J880K177R38J282j436n188p324J667
11277h600N276R034p095n847N94M648J698L230J282N964R837Q888N907N988J3809
11262E4613O811j3854q534p751o690j7021j0310q822L897M319l33K016P847o99
11248E489l655j72M387k638o027k757Q744N183K958p78L2K294o03q003K875O00
11232G929n248K402k788m405L657m827l129N83M568n694P46k310N821l816n474
11217a1985P55J186K878K757J954n775l741l066N084P076K012o870j1846J306
11203a8275Q175M366M292o02p356p457M376O3p371K402N23Q446K560n619j240
$$ plain form
11307 11601 3671 5885 9684 7565 7212 -1651 -10098 -5644 -743 4490 4954 8429 14430 16258 5377
11292 5377 2320 6700 12436 8555 2802 -1711 -2596 -716 1461 2399 3681 2245 -2943 -10267 -8600
11277 -8600 -3324 5710 -1385 -7232 -6638 -1990 -292 2938 4220 10184 20021 28909 34816 40804 54613
11262 54613 61424 47570 39036 31285 24595 7574 -2736 -11558 -7661 -3342 -3675 -1659 6188 5489
11248 5489 1834 1662 6049 3411 -2616 -5373 3371 8554 11512 10734 10766 13060 12457 4454 7329 7929
11232 7929 2681 5083 2295 -2110 1547 -3280 -6409 -5826 -1258 -6952 -6206 -8516 -2695 -6511 -11985
11217 -11985 -11230 -10044 -7166 -4409 -2455 -8230 -11971 -15037 -9953 -2877 -865 -7735 -19581 -18275
11203 -18275 -10100 -5734 -1442 -2044 -9400 -16857 -12481 -12418 -19789 -17387 -16864 -8418 -5858 -11477 -12717
11188a2717O318j047l619J313O567j287j748O328K082M385o090o432r0j580J0652
11173C035L289K452L557M057L465m113j0251n841K238N110k357l023m55k30M0
11158I73K691m875j019O300K88m836j756N315J682L270J6164K0691J1049Q53k247
11143E4543K95l876q775o462r649j2652j2620m572O478M794o74k257L278L864
11129A1715M177j178q070m758L206J944Q6Q41j833K071n47l0N11j431k440LK759
11112G026j820l847N188L268m373l706o91J147K660n486n015L391J650%k620n266
11096h494l149j39Q278M908N273l720j0612M567L883M830k586l91J674J956o752
11081d74l596J0093K779l957m409o903j915m779P329Q819n470N45Q210J729J0263
$$ plain form
11188 -12717 -6399 -7446 -11065 -9752 -3185 -4472 -6220 108 2190 6575 485 -5947 -6037 -7617 3035
11173 3035 6324 8776 12333 16390 19855 15742 5491 -350 1888 6998 4641 1618 1163 933 973
11158 973 3664 -1211 -2230 4070 4358 -478 -2234 3081 4763 8033 24197 44888 55937 56790 54543
11143 54543 54838 50962 42187 35725 26076 13424 804 -3768 2710 7504 6830 4573 7851 11715
11129 11715 15892 14714 6644 1886 5092 7036 7122 7963 6130 8201 7654 7624 8135 6704 4264 4267 7026
11112 7026 5206 1359 6547 9815 5442 1736 1045 2192 4852 -634 -5649 -2258 -608 -608 -3228 -8494
11096 -8494 -11643 -11782 -3504 1404 6677 2957 -7655 -3088 795 5625 3039 2648 4322 6278 -474
11081 -474 -4070 6023 8802 4845 436 -6467 -8382 -13161 -5832 2987 -2483 -1938 6272 8001 18264
11066A8264j306r271p86J240m934m342o184P43P904M910O656M270r941q115p388
11051h280j1563o02J3167M306k87j253L973p031m787K007J026j74M040k022o13
11036h093L473P47P93K357q946r417o7L259J1451P17l738q72J184J550K350L613
11020C61P740P161k386r530l581m251j369L704K09j255k885k786n690J85L633
11005a0740J402J854j2O858O020L523J383K288l522o159o037J251L724k604m49
10990a220J805k990L874K668l52K590Q561n413j1078J128K017k086j93k74L94
10975e69k193j793P073K574o195k720Q339L840M472L341o357j0835L387j154M21
10960A631j946k41M727L221m734m373J251K115M121q76m660o115n214r04M754
$$ plain form
11066 18264 16958 7687 6901 8141 3207 -1135 -7319 -6576 1328 6238 12894 17164 7223 -892 -8280
11051 -8280 -19843 -20445 -7278 -2972 -3259 -4512 -539 -7570 -12357 -10350 -9324 -9498 -5458 -7480 -8093
11036 -8093 -4620 -3873 -3080 -723 -9669 -19086 -19153 -15894 -4443 -3726 -7464 -8336 -7152 -5602 -3252 361
11020 361 8101 15262 12876 3346 -235 -4486 -5855 -2151 -1942 -3197 -6082 -8868 -14558 -14373 -10740
11005 -10740 -9338 -7484 -7496 -638 5382 8905 10288 12576 9054 2895 -3142 -1891 1833 -771 -1220
10990 -1220 585 -2405 1469 4137 3785 6375 14936 9523 -1555 -427 1590 -496 -689 -963 -569
10975 -569 -2762 -4555 2518 5092 -1103 -3823 4516 8356 12828 16169 9812 -1023 2364 1210 1631
10960 1631 -315 -556 4171 7392 2658 -1715 -464 1651 5772 4896 236 -5879 -11093 -11997 -7243
10945g243P701R341K831o849m635p66m354p603l479N855l350O312K841K16l6Q77
10929b341L834N59j360L052J243o147k814N272N828l096M232o80J063n05r18K028
10913I250k816J351j88l552N68K833L047j2457q298N716L489n496j1797j587N096
10898a4841J781J599O541O879N594L018n911o441K604N617P621R96l08m514r045
10883A190n605J267K598N64K433O211k456o987j316l359j438Q27J368n520R10
10868i313N857O24L821j342j45p72L777K753l370n702m399J374N579j887n588
10853h733K414J0907m982j275J432k04K681L71k470J987n121m654M804M108J009
10838B274p734M853M751j927p704n072N265J0729K819l129q274m034L232Q105
$$ plain form
10945 -7243 458 9799 12630 5781 1146 380 -3974 -11577 -15056 -9201 -12551 -6239 -3398 -3182 -3218 -2341
10929 -2341 1493 2052 692 3744 4987 -1160 -3974 1298 7126 4030 8262 7582 8645 8140 7222 9250
10913 9250 6434 7785 7597 4045 4613 7446 10493 -1964 -10262 -4546 -1057 -6553 -18350 -19937 -14841
10898 -14841 -13060 -11461 -4920 1959 7553 10571 4660 -1781 823 6440 14061 15057 14749 10235 1190
10883 1190 -4415 -3148 -550 14 2447 8658 6202 -785 -2101 -5460 -6898 -6071 -4703 -10223 -9313
10868 -9313 -3456 -2832 989 -353 -498 -1270 2507 5260 1890 -3812 -8211 -6837 -1258 -3145 -8733
10853 -8733 -6319 4588 -394 -1669 -237 -441 2240 2611 141 2128 -2993 -7647 -2843 1265 2274
10838 2274 -5460 -607 4144 2217 -5487 -10559 -5294 5435 8254 5125 -3149 -7183 -3951 4154
10824D154J360n674P36J846j726k75k815q652M319O874p89o494M435L416Q181
10809H896K445K152k84j149j610k049K193l159M122L565j963j479O14J859j2845
10794A308j0344N547j272m41K844M047L600n112j0936j174L993R765J441o409
10780c143l875J438J0191P869o60l453k86n205n236l564l587J91J012J0215l373
10765a466m761r70M129l496m286R092m31o26J503L731L271o126k134o513K633
10750f450N441l374l455L69l419L574L138P76M887M941m024J6Q912K688j774r400
10734B846l347k502Q245M989q457l200R19P322K542k61J534K930K837p70m392
10719A1235o560n46m185P75m494j51j385M660J1406K443q094l661k118L824L675
$$ plain form
10824 4154 5514 -160 576 2422 696 421 -2394 -11046 -6727 147 -642 -7136 -2701 715 8896
10809 8896 11341 13493 13209 12060 10450 8401 10594 7435 11557 15122 13159 11680 12294 14153 1308
10794 1308 -9036 -3489 -4761 -5202 -2358 1689 5289 177 -10759 -11933 -7940 1825 3266 -3143
10780 -3143 -7018 -5580 4611 12480 11820 8367 8081 2876 -2360 -5924 -9511 -9320 -8308 1907 -1466
10765 -1466 -6227 -7197 -3068 -6564 -10850 -1758 -2189 -2815 -1312 2419 5690 -436 -2570 -9083 -6450
10750 -6450 -1009 -4383 -7838 -7469 -10888 -7314 -4176 -3400 1487 6428 2404 2420 11332 14020 12246 2846
10734 2846 -501 -3003 5242 10231 1774 -1426 -507 6815 9357 9096 10630 13560 16397 15627 11235
10719 11235 4675 4129 -56 719 -3775 -3926 -5311 -651 10755 13198 5104 1443 -675 3149 6824
10704F824l3n710n036k90P48N798O271l21o033k227m904n23P136l850k809p3N018
10687a4l618r282J440J1900k741l63K989K78k00P2j954j1645l68M677L240o90
10671f279k896J103O490N620J555k753l232J659N640K17j0090p360O158R233M931
10656I996Q744M246m090n10j569k233k390l516l884o818o200j001J701L243J105
10641c176P51K242k144l258M332J0452J3036O297P39R924L7547N4236O3502K672
10627A97152l9976m0721l7718k4944k2454q475q117o584l890R53L148n145J683
10614D912O222J138k501J73l719l432m109P417J809o250l139L14O574r71l387
10599A051k636r69p104j328k143J677P662N279o228J829j040K663n878k108N621
$$ plain form
10704 6824 6791 1081 -3955 -4245 -3497 2301 8572 8251 2218 -9 -4913 -5436 1700 -2150 -4959 -5032 -14
10687 -14 -3632 -12914 -11474 426 -2315 -2678 311 589 389 461 -1493 -13138 -13506 -8829 -5589 -6279
10671 -6279 -9175 -8072 -1582 4038 5593 2840 -392 1267 6907 7124 -2966 -10326 -4168 5065 9996
10656 9996 18740 22986 18896 18386 16817 14584 12194 8678 4794 -2024 -8224 -9225 -7524 -4281 -3176
10641 -3176 -2425 -183 -2327 -5585 -1253 9199 22235 28532 29271 39195 76742 130978 194480 197152
10627 197152 157176 116455 78737 53793 31339 22864 14747 8163 4273 5226 8374 3229 4912
10614 4912 11134 12272 9771 9944 6225 2793 -1316 6101 7910 1660 -1479 -1165 5409 4438 1051
10599 1051 -1585 -2554 -9658 -10986 -13129 -11452 -3790 1489 -4739 -2910 -3950 -1287 -7165 -9273 -3652
10584c652M718o01l741q360L86J976P40J286R331J0705j080m087N71o069p260
10569e137o84j408j634R19Q007P365K726m575j487k860N864m965m384j936L373
10554h16j832M941K022j1274k997m745K740P033P1m955O612j756k793J582L709
10539b458K711j34J011L282K294k477J382R86k362k333K088k176l35K88l529p186
10523h948j84J62L535K290J160J163Q592P638J0407K4850L5147O824j6797j5425
10509F0414j6102j3845j2121o710L710q242r990l528K076P33N7R18R67M369K580
10494E286p882K746j181j0890J522N306K885J866L708m213m698j009K729P111
10480C286k070J047N959P493p148j022l939o161m82P311j885k730K592k377l567
$$ plain form
10584 -3652 1066 465 -3276 -11636 -11250 -9274 -8534 -7248 2083 12788 11708 7621 8192 2123 -5137
10569 -5137 -5821 -7229 -8863 -7944 63 7428 10154 5579 4092 1232 7096 2131 -2253 -4189 -816
10554 -816 -2648 2293 4315 -6959 -9956 -14701 -11961 -4928 -4857 -9812 -3200 -4956 -7749 -6167 -2458
10539 -2458 253 119 1130 4412 6706 4229 5611 6597 4235 1902 3990 1814 1479 1767 -1762 -8948
10523 -8948 -9132 -8970 -5435 -3145 -1985 -822 7770 15408 25815 50665 85812 92636 75839 60414
10509 60414 44312 30467 18346 11636 15346 7104 -2886 -6414 -4338 -3605 -3548 -2630 -1663 2706 5286
10494 5286 -2596 150 -1031 -11921 -10399 -5093 -2208 -342 3366 -847 -5545 -6554 -3825 3286
10480 3286 1216 2263 8222 15715 8567 7545 3606 -2555 -3037 4274 2389 -341 2251 -126 -3693
10465c693R861l803p803q83M201n153N534j289l219J510O026M324J547l697r01
10450B562J0550l094j1962l480R69L661j461m86J438K35m046k046J515l886K153
10435g378j592L065o128j21p68M758J390J093O262k72m551O53M707L571m965j553
10419a829J002M592L934k31p075j880l258K390l022o615N006Q168P301n98m088
10404C797J735j875k511J819L727k965K421n381o095L41N861n294o22J0010n50
10389D418r955k441M390L092J984k085n295K748J730r66J59o505J566N889K774
10374A503m181k868J215N40K78l70k236k022n049N923O52J856M024N728N97J749
10358G339P176N631J3947J0669L44P113M015p162m064K944J98m754q28l772p859
$$ plain form
10465 -3693 6168 2365 -5438 -6321 -2120 -7273 -1739 -3028 -6247 -4737 1289 5613 7160 3463 2562
10450 2562 13112 10018 -1944 -5424 -4455 -794 -2255 -2741 -1303 -1068 -5114 -7160 -5645 -9531 -7378
10435 -7378 -8970 -5905 -12033 -12154 -12922 -8164 -6774 -5681 581 309 -4242 -3589 1118 4689 -276 -1829
10419 -1829 -827 3765 7699 7468 393 -1487 -4745 -2355 -5377 -11992 -6986 1182 8483 7885 3797
10404 3797 5532 3657 1146 2965 6692 3727 6148 767 -5328 -4987 874 -4420 -5042 4968 4418
10389 4418 -5537 -7978 -3588 -496 1488 -597 -5892 -3144 -1414 -2380 -2221 -8726 -7160 -1271 1503
10374 1503 -2678 -5546 -4331 -3791 -3513 -3883 -6119 -8141 -13190 -7267 -6615 -4759 -735 4993 5590 7339
10358 7339 14515 20146 34093 44762 45106 52219 56234 49072 45008 47952 48150 43396 42568 38796 30937
10343C0937r307r450j841k361k184o883n390L132L204m93j0344O454L036M383
10329B893j665m37j551J063N065J426j026M925J167q658J568L698k062j70k236
10314D000K103n154o572O427L066j908j281p87l620M580K559N202J360K285o990
10299E270j882O570l737O25Q425J2879l654r629k869N47J134m673n350N33l564
10284F25J909M263p880o112K845J896j041K571J806o747j925m07N814n36j066
10269c985J171O440M044k077m723K140M349M428n79j611J801l312o028o719k384
10254g045N003k653L939K390K801j618j695J603L195n650l257p7N16J446J284
10239A82J81k060k639k626M069J41k137r10L215o419m368L483L305O245L567p49
$$ plain form
10343 30937 21630 12180 10339 7978 5794 -1089 -6479 -3347 -143 -636 -10980 -4526 -1490 2893
10329 2893 1228 791 -760 303 5368 6794 5768 10693 11860 3202 4770 8468 6406 6236 4000
10314 4000 6103 949 -5623 804 3870 1962 681 -106 -3726 854 3413 8615 9975 12260 5270
10299 5270 3388 9958 6221 6846 15271 28150 24496 14867 11998 12545 13679 9006 3656 4189 625
10284 625 2534 6797 -1083 -7195 -4350 -2454 -3495 -924 882 -5865 -7790 -8197 -2383 -2919 -3985
10269 -3985 -2814 3626 7670 5593 870 3010 7359 11787 11208 9597 11398 8086 2058 -4661 -7045
10254 -7045 -2042 -4695 -756 1634 4435 2817 1122 2725 5920 270 -2987 -3064 -2548 -1102 182
10239 182 363 -1697 -4336 -6962 -2893 -2752 -4889 -5799 -2584 -9003 -13371 -9888 -6583 -338 3229 2480
10223B480K35L138j43K05k226k003K547j718M618N48k105M586N738P106O773M304
10207C4083N377k55o574m462n377o92k313k305q353K54l886m088L265j2065K152
10192e239O646L726O129P88j565l319k766R59k162l876p290m196O965R176J0630
10177A4606k688k928j494N913r1J362J308M208L615q192o748L508q90L42L82p404
10161D809l337J04m655m950M302j352k349M663L746k351l00L13L609J507J0518
10146A4277l754j1240o325J879Q314M336p308p287N829p27j399P95k873M80M993
10131a0k99M894o047k610M746J440l166l541N64M707K487l1o819l449K565l90
10115d959L74K626M655p96j1378n069N562M538P985L185L110M717k407m872o405
$$ plain form
10223 2480 2715 5853 5710 5915 3689 1686 4233 2515 7133 7681 5576 10162 15900 23006 29779 34083
10207 34083 39460 39205 32631 28169 22792 22100 19787 17482 9129 9383 5497 1409 4674 -7391 -5239
10192 -5239 1407 5133 11262 12050 10485 7166 4400 5359 3197 -679 -7969 -12165 -5200 3976 14606
10177 14606 11918 8990 7496 13409 13318 14680 15988 20196 23811 15619 8871 12379 11489 11831 12213 4809
10161 4809 1472 1576 -3079 -8029 -3727 -5079 -7428 -2765 981 -1370 -1670 -1357 2252 3759 14277
10146 14277 10523 -717 -7042 -5163 3151 7487 179 -7108 -1279 -2006 -3405 -2610 -5483 -5003 -10
10131 -10 -309 4585 -1462 -4072 674 2114 -1052 -4593 -4029 678 3165 3134 -3685 -7134 -4569 -4959
10115 -4959 -4585 -1959 2696 1900 -9478 -14547 -8985 -4447 3538 6723 9833 14550 12143 7271 866
10100H66j699M904k118r802j0657K603P853J2719O766l270l829j336l956j420
10086b376K727N677K902Q19r011K691K305n213L240j190O65O472r56r81k766k029
10070B976K729J82k668o338n574N801Q9j745O470K08P38j312Q84N497N110K722
10054A5769m481q287j428L622l394L433n821n174J957L315P230K329O961p968
10040H063l401M162L708j065m858j356n206j847m334O012o418R185O205J380j069
10025I161m926P42n767n216l69J315j85l599O630k377j644K059J09K824P01J232
10009F90N24k082l722k165K476M921M218j022K471o38m826n892M573J2284N235
9994A7045l870n301j2806q049O091J0175K227K918O73m64m93q910m151M943K233
$$ plain form
10100 866 -833 4071 1953 -7849 -18506 -15903 -8050 4669 11435 8165 4336 3000 -956 -2376
10086 -2376 351 6028 8930 9749 738 3429 5734 521 3761 2571 3236 9708 8752 7771 5005 2976
10070 2976 5705 5887 3219 -3119 -8693 -2892 -2803 -4548 1922 2130 2868 1556 2440 7937 13047 15769
10054 15769 11288 3001 1573 5195 1801 5234 -587 -5761 -3804 -489 6741 9070 16031 8063
10040 8063 4662 8824 12532 11467 6609 5253 47 -1800 -6134 -122 -6540 2645 8850 10230 9161
10025 9161 4235 4977 -790 -6006 -6375 -5060 -5245 -8844 -2214 -4591 -6235 -4176 -4067 -1243 -542 690
10009 690 1214 -868 -4590 -6755 -4279 642 4860 3838 6309 5671 845 -5047 -474 11810 17045
9994 17045 13175 7874 -4932 -12981 -6890 3285 5512 8430 9103 8639 8146 -764 -4915 28 2261
9979B261L52K511n224M12Q16o92p001L428J0173O475J995O19J987m263q339k306
9963C204K974J783m358K379m433k691k328r80N483M381L139K582K514k466N961
9948A7144n485j1233j216l905N750k60J790N315p67p078n464M522L824k196P90
9933A531J745l187k679N56N037P8j424j346K208K206K732q160p629M195J385j1675
9917a4427m138N476J0091J0581J585m625K806J10l412j517L607M554o58J48L738
9902A3919k014m435n367J232J485N706m714p590j93n276r39N426N722R52q31k610
9886D73k066o393K042K277k72j018l677L676n394m06k268R248M004p959q688L278
9870a3143L014R861K760l327J682N34K192n176J588Q573L51j361o529K44r102
$$ plain form
9979 2261 2613 5124 -100 312 1128 436 -6565 -3137 7036 13511 15506 16125 18112 13849 5510 3204
9963 3204 6178 7961 3603 5982 1549 -1142 -3470 -4450 1033 5414 8553 11135 13649 11183 17144
9948 17144 11659 426 -790 -4695 1055 795 2585 7900 7133 55 -5409 -887 2937 741 1531
9933 1531 3276 89 -2590 -2034 3003 3081 1657 311 2519 4725 7457 -703 -8332 -4137 -2752 -14427
9917 -14427 -18565 -13089 -2998 7583 9168 4543 7349 7459 4047 2530 6137 10691 10033 10181 13919
9902 13919 11905 7470 2103 3335 4820 10526 5812 -1778 -1971 -7247 -8186 -2760 2962 3914 3083 473
9886 473 -1593 -7986 -5944 -3667 -3939 -4957 -8634 -4958 -10352 -10758 -13026 -3778 226 -7733 -16421 -13143
9870 -13143 -10129 -268 2492 -835 847 1381 3573 -1603 -15 8558 8909 7548 1019 1263 -7839
9855g839j533K894N697O262l411l64o667q524N184R394l50p419N40L281K858n505
9839e502o01K741Q673l296K24P74L088N446k092l550l406N973N61p520L264L897
9823H674O460l042m555m489Q73P90j403J967p732o768p01M238J1645k908m402
9808a353N65M516J505L061J448r423k395J2230J978l871j712k904p75M994P15
9793H579m976p167J792n189L44J2133L793l345q040j971m081n77l465N26M902
9778f742k71O196M124l977L553j715j929K5k437l731m695m885O005M593m078O672
9762c292J1007j653k357K237j566J1o395k038M25k610K705k046k635K687L770
9747a750M207k910k935L441K649k780j726m9J341L818k796J765j266k53k527n569
$$ plain form
9855 -7839 -9372 -6478 -781 5481 2070 1706 -4961 -13485 -8301 1093 743 -6676 -6136 -2855 3 -5502
9839 -5502 -6103 -3362 5311 2015 2239 3013 6101 11547 9455 5905 2499 8472 9033 1513 4777 8674
9823 8674 15134 12092 7537 3048 3921 4711 3308 5275 -2457 -9225 -9926 -5688 5957 3049 -1353
9808 -1353 -788 3728 5233 8294 9742 319 -2076 10154 12132 8261 6549 3645 2870 7864 8579
9793 8579 3603 -3564 -1772 -6961 -6617 5516 9309 5964 -2076 -4047 -8128 -8705 -12170 -11644 -6742
9778 -6742 -7013 -817 3307 -670 2883 1168 -761 -736 -3173 -6904 -11599 -16484 -10479 -5886 -9964 -3292
9762 -3292 7715 6062 3705 5942 4376 4387 -2008 -4046 -3621 -6231 -3526 -5572 -8207 -5520 -1750
9747 -1750 2457 -453 -3388 53 2702 -78 -1804 -1853 -512 3306 510 2275 1009 756 -1771 -7340
9731g340l123M62k567N353O293K152o058M40L561L243k895l434P849K403p567
9716a228n610K9P352m172k442Q995J224M031o74M46K267k260R55J039k413p329
9700B10j0399K83P226K241p090L665n07l511K292N734N885p588o707r34O982M455
9684B237J492j626P60l757k43N360j753K606M460l775n469l538m880j297O701
9669b722M764j293K651L228m86m259n6M66n038K626j621n019J751N234K627K083
9653D936o79M24m678K421Q275l180q81J451o18K181m881n042m70J552N29k863
9637a523J0706j026j551n197K091Q80j335o619n565l46N78N220j060L043R170
9622G466k465r965m11P35R34K798O392J582j809N08J238m243J974K543j733m089
$$ plain form
9731 -7340 -10463 -10001 -12568 -7215 -922 1230 -4828 -4388 -827 2416 -479 -3913 3936 6339 -1228
9716 -1228 -6838 -6809 543 -3629 -6071 2924 4148 8179 7505 7951 10218 7958 8913 9952 7539 210
9700 210 -10189 -9906 -2680 -439 -7529 -3864 -4371 -7882 -5590 144 6029 -1559 -8266 -9200 -2218 2237
9684 2237 3729 2103 2863 -894 -1137 4223 2470 5076 9536 5761 292 -3246 -8126 -9423 -2722
9669 -2722 2042 749 3400 6628 6142 1883 1827 2293 -2745 -119 -1740 -6759 -5008 226 2853 4936
9653 4936 4257 4681 3 2424 10699 7519 6638 8089 7471 9652 4771 -271 -741 811 1340 -1523
9637 -1523 9183 8157 6606 1409 3500 4380 3045 -3574 -9139 -9485 -8907 -3687 -4747 -1704 7466
9622 7466 5001 -4964 -5375 -4640 -3706 -908 5484 7066 5257 5765 7003 2760 4734 7277 5544 1455
9606A455l108L700K586k438L05L587M969j548k264m339k549J185o550k14o92P29
9590e186M329j447L68J508O74L638O242K829J427j1082k550L2L109n24r861o442
9574a2936L973J724J618L767N968j58m523N523L612n584k194l064l090p46o806
9559a2916K344Q175J028k254K00M808j455m633l982L030K702k946j740k337j362
9544a1338M761O733l973K244M377J245o149q369K176O527O223J425p079m64M767
9529C106l23L664K406j088m274o600N632L187j147l637k07N904K072R52m0L411
9513A3018q04k724k343r124K25P740M244r005m974m637k211N927O264M274m9n870
9497d9q172P28m66M894m819o52Q387l970L129N623M355l834n437R55M409M005
$$ plain form
9606 1455 -1653 2047 4633 2195 2500 6087 11056 9508 7244 2905 356 1541 -5009 -5223 -5915 -5186
9590 -5186 -857 -2304 -1936 -428 246 3884 10126 12955 14382 3300 750 782 3891 3367 -6494 -12936
9574 -12936 -8963 -7239 -5621 -1854 4114 3956 -567 4956 8568 2984 790 -2274 -5364 -6110 -12916
9559 -12916 -10572 -2397 -1369 -3623 -3423 1385 -70 -4703 -8685 -5655 -2953 -5899 -7639 -9976 -11338
9544 -11338 -6577 156 -3817 -1573 2804 4049 -2100 -10469 -8293 -1766 4457 5882 -1197 -1661 3106
9529 3106 2783 6447 8853 7765 3491 -3109 2523 5710 4563 926 719 6623 8695 9647 9607 13018
9513 13018 12214 9490 7147 -1977 -1752 5988 10232 1227 -3747 -8384 -10595 -4668 1596 5870 5821 -49
9497 -49 -8221 -7493 -7959 -3065 -7884 -8536 -149 -4119 -990 4633 8988 5154 -283 672 5081 9086
9481I086l480p218O103j348n152N7j303j714K483K143k008j76L193L138L878j08
9465G574l268J62O096J526J072m709J937j317j55M663L819l463k069N69k098K287
9449A2626j608l469j178R608L053J3796L7l145P018r90j158l473J0080Q736Q43
9434E0776l271p53K287M04J1533J2583P475K224Q491J1193R014J9182L2691L5668
9420A99497M1390N2461P0665J00210J27862J89095K98133M53202O66221Q38472
9410C037208O60559R3849l91874o28475o79891n69922m05624k67527j85918j30013
9400E32372r1642p0487n5554m4352l2684k0366k0613k0924k1360j5086q948j2938
9388A17418j7234j4455P92k911p442l841o132l552m965o563k77K59K689K06j421
$$ plain form
9481 9086 5606 -1612 4491 3143 -2009 -1952 -3255 -4969 -2486 -343 -2351 -2527 666 3804 7682 7574
9465 7574 4306 4468 10564 12090 13162 8453 10390 9073 8918 13581 17400 13937 11868 12437 10339 12626
9449 12626 11018 7549 6371 15979 19032 32828 32865 29720 36738 35748 34590 31117 41197 49933 50776
9434 50776 47505 46752 49039 49443 60976 73559 81034 83258 91749 102942 111956 131138 163829 199497
9420 199497 240887 293348 364013 464223 592085 781180 1079313 1532515 2198736 3037208
9410 3037208 3697767 3791616 3399742 2771267 2091376 1521454 1115830 848303 662385 532372
9400 532372 440730 370243 314689 270337 237653 217287 196674 175750 154390 139304 130356 117418
9388 117418 100184 85729 86521 83610 76168 72327 66195 62643 57678 51115 50838 51097 53786 53992 52571
9373E2571n249l259m051j256Q99m986K149l341K214k95o481o896J82k794o784
9358A2623l056Q3N653J767j513m134m686M80Q44p079l224J835O118L11P854N282
9342A9158n273p20j78n645m374N983n92M543l402r05M966N067o672m644o180n913
9326d781L485K457O813P056N444p418j346O03K369l69o308l679n621k687o78L701
9310i59O443m158k5M749K381M310m311m394P48Q660J3339j156j1660o813r28K084
9294H310K572P4m837N063K011n143j617N082n4J65m720p063m777L168P35m210
9278e241Q1J0803O878R64L869j0123j822M563Q402L897m395j972k239K45J023
9263A4933k7P54o051k325Q797Q701k451k339l647M456n170o353q231J22M696N10
$$ plain form
9373 52571 47322 44063 40012 38756 39655 34669 36818 33477 35691 35396 28915 22019 22201 19407 12623
9358 12623 9567 9650 15303 17070 15557 11423 6737 7217 8061 982 -2242 -407 5711 6022 13876 19158
9342 19158 13885 13165 12987 7342 2968 8951 8359 12902 9500 8595 13561 18628 11956 7312 1132 -4781
9326 -4781 -1296 1161 7974 15030 20474 13056 11710 12313 14682 14313 8005 4326 -1295 -3982 -4660 -959
9310 -959 5484 1326 1301 6050 8431 12741 8430 4036 4784 13444 26783 25627 13967 7154 6226 8310
9294 8310 10882 10956 6119 11182 13193 8050 6433 11515 11461 11626 6906 -157 -4934 -1766 -1031 -5241
9278 -5241 -5160 5643 12521 13485 17354 7231 5409 9972 18374 22271 17876 15904 13665 13910 14933
9263 14933 14906 15660 9609 7284 16081 24782 22331 19992 16345 20801 15631 9278 1047 1169 5865 6375
9247F375N038J207j028L211l296k115R82p733m68L129J35k14l490k561l281n855
9231i964N20k013O257J0737P036j588k039n749o795J284L5P95j680k201K354p994
9215a1005L010k27k714m89O416K520m16K499L218n534k789R606P323P441J906
9200B0765R62Q341l64j9625j2930l434N36l096m212N535J6500P321j494n702j821
9185G282J017k946K880J5074R369o419o219j319J472N282J336l390o426J892p429
9170A1456q748L251K02J228n22p606j0138L000J673n179L819O18L674K916Q43
9155D87L313k032J039M486j989l708j728n522O647P909M993j790k210j785J23
9140H233o24J805K366O488J154j739l943n253l720p10j594j627J149K548L473
$$ plain form
9247 6375 11413 12620 11592 14803 11507 9392 10374 2641 2173 5302 5437 5223 1733 -828 -4109 -9964
9231 -9964 -9444 -11457 -5200 5537 12573 10985 8946 3197 -3598 -2314 -2279 -1484 -3164 -5365 -3011 -11005
9215 -11005 -7995 -8222 -10936 -11425 -5009 -2489 -2905 -406 2812 -2722 -5511 4095 11418 18859 20765
9200 20765 21727 30068 29704 10079 -2851 -6285 -5749 -8845 -13057 -7522 8978 16299 14805 9103 7282
9185 7282 8299 5353 8233 23307 32676 26257 20038 18719 20191 25473 26809 23419 16993 18885 11456
9170 11456 2708 5959 6161 7389 6867 -739 -10877 -7877 -6204 -11383 -7564 -6946 -3272 -356 487
9155 487 3800 1768 2807 7293 5304 1596 -132 -5654 993 8902 13895 12105 9895 8110 8233
9140 8233 7609 9414 11780 18268 19422 17683 13740 8487 4767 4057 2463 836 1985 4533 8006
9125H006O137n931k962k902k838J64o191k461P713P831L576Q954k470q566M65
9110H525j380M881J172J99k814J966K764n485r827R866O988j209k057q99L732
9095A6422o435l399k672K732J500j443p89r32k05J164R85n728l349N960R064l22
9079A2553q697k12J2j296o290J21P004L486Q407J96J848J22m060J696p03k661
9063A1526J438K06l321n608O648m747o753M655M309N658k873l390K717M189k454
9048A2200M24m640q22L713m583O88j88N40N112j929k154m336P96J971J349K916
9032A1057k466m579M47j533J907l667k985J3418J0008r77K142K508N177o01m087
9017B5769k900n489j155n271n717O83J730O763K287R62J944K169j763p015K09
$$ plain form
9125 8006 14143 8212 5250 2348 -490 -326 -6517 -8978 -1265 6566 10142 19096 16626 8060 8525
9110 8525 7145 12026 13198 13397 10583 12549 15313 9828 1 9867 16855 15646 13589 12690 16422
9095 16422 9987 6588 3916 6648 8148 6705 5916 4984 4779 5943 6928 1200 -2149 3811 12875 12553
9079 12553 3856 3644 3656 2360 -3930 -3809 3195 6681 15088 15284 17132 17254 13194 14890 14187 11526
9063 11526 12964 13170 9849 4241 10889 6142 -611 4044 8353 14011 11138 7748 10465 14654 12200
9048 12200 12624 7984 7162 10875 6292 6980 6792 7332 12444 10515 8361 4025 4821 6792 8141 11057
9032 11057 8591 4012 4459 2926 4833 1166 -1819 11599 21607 20630 22772 25280 30457 29856 25769
9017 25769 22869 17380 16225 10954 5237 5920 7650 14413 16700 17662 19606 21775 20012 12997 13206
9002A3206l652l617k12o35n937k864J0396N452j696L659L137N787O583o115j1638
8987A1854j681m061q803K123M265N63j685K587J3354k839q47m697m569L795O144
8972A5503J54p32N65P065K196r153j0878n87k943J749K510N551N301m435o637
8957E229L4l550l164k179Q131j448l507L228J1436o93n207J335P44J16K071r33
8941A1643l800k531P034N041k104J960K945j52L97O005J6717Q158O536K555Q26
8926F1230N757J7341J8683K6291N0125Q5637J25456J14094J6874n7234r3225j00304
8914B70725q3321n2191l2920k3320j4241k297l177L63q632l778p889k192k50R14
8900C7794m360l669k721k062j084q996j0594R263J590l089M078M67j2100o59Q036
$$ plain form
9002 13206 9554 5937 5725 5090 -847 -3711 6685 12137 10441 14100 17237 23024 29607 23492 11854
8987 11854 10173 6112 -2691 -568 3697 4260 2575 5162 18516 15677 14830 10133 5564 9359 15503
8972 15503 15657 14925 15490 22555 24751 15598 4720 4133 1190 2939 5449 11000 16301 11866 5229
8957 5229 5263 1713 -1451 -3630 4501 3053 -454 2774 14210 13517 8310 9645 10389 10505 12576 11643
8941 11643 7843 5312 12346 17387 15283 17243 20188 20036 20433 26438 43155 51313 57849 60404 61230
8926 61230 66987 84328 103011 129302 179427 265064 390520 504614 521488 464254 371029 270725
8914 270725 187404 135213 102293 78973 64732 62435 59258 59621 50989 47211 39322 37130 36880 37794
8900 37794 33434 29765 27044 24982 23898 14902 4308 13571 15161 12072 16150 16617 4517 3858 11894
8885A1894M294J423P281L018o004m405K910j686K89L000J396l450K442K760o68
8870B4494m171j990m294J375L865N703K706j492o603J371K565J549j228N543k252
8855B7141o674k815n89J818l332k98P742L125N929l055K702k115k111M04L236
8840C1108k457K7M012q289J967M268O17o659q272R989M924n22k312l524k317J116
8824B3676L344M263M119J249J365j5754k490M370M726J506k324K049P053m26j521
8809C5205P73O49N971K121o823m80Q37K02m143m93J342O090Q854J630L957N525
8793F1217l972m097j521J488K612J652o39j254J640o91o019k143J342l128m735
8778D1752N952l16n770J474P769J643O513Q986m311l47L133K288P190Q874J36
$$ plain form
8885 11894 16188 17611 24892 27910 21906 17501 20411 18725 19014 22014 23410 19960 22402 25162 24494
8870 24494 20323 18333 14039 15414 19279 24982 27688 26196 19593 20964 23529 25078 23850 29393 27141
8855 27141 20467 17652 17063 18881 15549 15251 22993 26118 32047 28992 31694 29579 27468 27872 31108
8840 31108 28651 28678 32690 24401 26368 30636 31253 24594 16322 26311 31235 30713 28401 24877 22560 23676
8824 23676 27020 31283 35402 36651 38016 22262 19772 24142 28868 30374 28050 30099 37152 36726 35205
8809 35205 35978 36627 42598 44719 37896 37416 38253 38455 34312 33819 35161 41251 50105 51735 55692 61217
8793 61217 57245 53148 51627 53115 55727 57379 56740 55486 57126 56435 50416 48273 49615 46487 41752
8778 41752 47704 47388 41618 43092 50861 52504 59017 68003 63692 63345 66478 68766 75956 84830 84966
8763H4966j748N381J0704N652M185M17r744p177j513q714o663l779n220l567J0557
8748G3737L256j335N729J1013R585J0933o057j2585j5895j1628J071Q80j91m47
8734F8066n380j2226J923J0034n12J897K425k247O718O614L351J4161P544L078
8720A05446J411N054j040j2078o398r031q835k470L608J770o020q879n537j400
8706E5601K381O422k185l476l351J088O465l01J80N148N591K586o617l403L346
8691F9475o905p536M832L597Q737L170j03j883J174L29J176k627k280N759j787
8676G5128R67L370M128K260K980j711m701k079J0J224k171j346o404M710O173
8661H2538N699O499N105l413p086P15K493K797K117J676N254J1294J717k879N453
$$ plain form
8763 84966 83218 88599 99303 104955 109140 109557 99813 92636 91123 82409 75746 71967 66747 63180 73737
8748 73737 76993 75658 81387 92400 101985 112918 106861 94276 78381 66753 67824 68704 68513 68066
8734 68066 62686 50460 52383 62417 61905 63802 66227 63980 70698 77312 80663 94824 102368 105446
8720 105446 106857 111911 110871 98793 92395 83364 74529 72059 75667 77437 71417 62538 57001 55601
8706 55601 57982 64404 62219 58743 55392 56480 62945 62644 62824 67972 73563 76149 69532 66129 69475
8691 69475 62570 55034 59866 63463 72200 75370 75267 73384 74558 74887 76063 73436 71156 76915 75128
8676 75128 76095 79465 83593 85853 88833 87122 82421 80342 80352 81576 79405 78059 71655 76365 82538
8661 82538 88237 94736 99841 96428 89342 90057 92550 95347 97464 99140 104394 115688 117405 114526 119979
8646A19979K542Q414O256j306o9M524M028N271N500L311Q273N993O433J182M5
8631A80376K847l321k327P31J3417J2894O36O68J1237J4273P824O681Q816J1965
8617B66717P574R206Q118k480M914J3892K7756M7360Q7967J54062K55030K74631
8605A154747J01717j11974j92770k23829j98958j26006o9151m0851l0758k4978
8595B37189j7258j1471l522l123p385j2878p971J923J620m803j0088k683O11M804
8581A64965L629N775L451O911M310M387J1043J3056O804J0303M866J8891K7780
8568B86171K3518K7301K9004K4219J7472O700q805k6414m1334m1292k7655l2628
8556B36257l0981j1427j3425j8840o242k807l788o164r103o592r968l728j67J826
$$ plain form
8646 119979 122521 130935 137191 135885 135816 140340 144368 149639 155139 158450 166723 172716 179149 180331 180376
8631 180376 183223 179902 177575 178306 191723 204617 205253 205921 217158 231431 239255 245936 254752 266717
8617 266717 274291 283497 291615 289135 294049 307941 335697 383057 471024 625086 880116 1154747
8605 1154747 1256464 1144490 951720 727891 528933 402927 333776 292925 262167 237189
8595 237189 219931 208460 204938 201815 194430 181552 173581 175504 177124 172321 162233 159550 160161 164965
8581 164965 168594 174369 177820 184731 189041 193428 204471 217527 224331 234634 239500 258391 286171
8568 286171 309689 336990 365994 390213 407685 414385 405580 379166 337832 296540 268885 236257
8556 236257 205276 193849 180424 161584 155342 152535 148747 142583 133480 126888 116920 113192 113025 114851
8542A14851m581r325j1254q757p005K103k708p753k357k032r014n856K4k328O236
8527E0244M358l272k746K247L332l615m415k075R943P800k28o971q01N455l448
8512E5808l450l689M678J4364J7967J2176m574r701j5166j1586j1036l677n141
8499C6973p39M39M12o69K355k66r287l787r89N049j1232n010J429O016Q148l536
8483B5306l78J0214O717o670O27R897p167r703p327O18r68J327J014M020p021
8468B0506l246O654k450l175K315L682K907l207K340M392J044l344l826l616J425
8453B2401j680l109K630M832M001K877J225k991p11l916o110K390K749l01L75
8438B4662n334l054J506J473M200R58J410l361J876m459R23N367J672j931J490
$$ plain form
8542 114851 110270 100945 89691 80934 73929 76032 73324 65571 63214 61182 52168 46312 46336 44008 50244
8527 50244 54602 51330 48584 50831 54163 50548 46133 44058 54001 61801 61573 54602 53801 59256 55808
8512 55808 52358 48669 53347 67711 85678 97854 93280 83579 68413 56827 45791 42114 36973
8499 36973 36234 36673 37085 36416 38771 38505 29218 25431 24442 29491 18259 13249 14678 20694 28842 25306
8483 25306 24928 35142 41859 35189 35816 45713 38546 28843 21516 22134 21166 22493 23507 27527 20506
8468 20506 17260 23914 21464 18289 20604 24286 27193 23986 26326 30718 31762 28418 24592 20976 22401
8453 22401 20721 17612 20242 25074 29075 31952 33177 30186 29475 25559 19449 21839 24588 24287 24662
8438 24662 19328 16274 17780 19253 23453 24411 25821 22460 24336 19877 20800 26167 27839 25908 27398
8423B7398K9m730n215j539k470J850l102J848L834L729Q341o73o443p75n29r222
8407A2331o998J849M366m33k020O620L190n416l306R900O199k588o156q349J211
8392A0400O69k997O982J484J487p705l403O714j10j004n69J742Q193K47q428k759
8376A0943L407M588m321J196o267k158M316j71L726K39M405O11l229O23K108j057
8360A8959j186j986j639L647n90l926O491j18n0r40M728p565k636n269j626L92
8344F686J552j429O08P72k877r540K823M825O178L091l192l003M585J1543m790
8329A7832k826l402J28j324n080l688n286j949L223J3585J682l200o747j322L816
8314E442J900O529J520P818L658L93K82k106m882j2362o349K979q88Q38K8k69
$$ plain form
8423 27398 27427 22697 17482 15943 13473 15323 12221 14069 17903 21632 29973 29300 22857 22082 21553 12331
8407 12331 5333 7182 11548 11115 9095 15715 18905 13489 10183 20083 26282 23694 17538 9189 10400
8392 10400 11069 8072 15054 16538 18025 10320 6917 13631 13521 12517 11948 13690 21883 22130 13702 10943
8376 10943 14350 18938 14617 15813 9546 7388 11704 11533 15259 15498 19903 20514 17285 17908 20016 18959
8360 18959 17773 15787 14148 17795 17205 13279 19770 19652 19602 18662 23390 15825 13189 7920 6294 6686
8344 6686 8238 6809 7417 8189 5312 -4228 -1405 3420 9598 12689 9497 6494 11079 22622 17832
8329 17832 15006 11604 11732 10408 5328 1640 -3646 -5595 -2372 11213 12895 9695 2948 1626 5442
8314 5442 7342 13871 15391 23209 26867 27260 27542 25436 20554 8192 1843 4822 3934 4772 4800 4531
8298D531J549O026K194n388l176J93j923L289r06J646J991j325J30R56L822M779
8282A8388m555K589k702j159j028O720l79r517o796j767R187j671l774l45K077
8267E268P50o03J576O020o3o509M49M036Q73q677j2O22j549r88N026l003L075
8250F291P548l139l237n2K684l403r64L404M053N198m104k284L6o495o148Q950
8234H338R120M623L348M9o206j1569q96R692L355o498k65J423M700J482m98l44
8218A9854m400k451l703n117N73K084j892N658k220N540K576L527K354j514j700
8203A9169P166n915q56l874m62R646l613r475l588P46j50L90K961j487J056k465
8187I249j899J472L096O599m539j2933K385N824R145Q780l737q118k676P902L092
$$ plain form
8298 4531 6080 12106 14300 8912 5736 5929 4006 7295 6389 8035 10026 8701 8831 9787 13609 18388
8282 18388 13833 16422 13720 12561 11533 18253 17874 8357 1561 -206 8981 7310 3536 3191 5268
8267 5268 6018 5415 6991 13011 12948 6439 6888 10924 11797 3120 3108 3730 2181 1193 6219 3216 6291
8250 6291 13839 10700 7463 7411 10095 6692 5728 9132 13185 18383 14279 11995 12031 5536 -612 8338
8234 8338 17458 22081 25429 25478 19272 7703 6807 16499 19854 13356 13091 14514 19214 20696 20198 19854
8218 19854 15454 13003 9300 4183 4756 6840 4948 10606 8386 13926 16502 20029 22383 20869 19169
8203 19169 26335 20420 19564 15690 15228 24874 21261 11786 8198 8944 8794 9184 12145 10658 11714 9249
8187 9249 7350 8822 11918 18517 13978 1045 3430 9254 18399 27179 23442 15324 12648 20550 23642
8172B3642L35k504j2109J337M924L326Q91K062O230R123j127n229K817P188o048
8157C4858p326l131k953n859J633N946k948j136j275o764M665Q090L652j912o813
8142A8727r018N400R745M421p43o780N091l036n748m044O07R694K632O43k472
8127B5119O88M070P592L758P914J5584K5570M4677M9699K6430m330k5004l7509
8114A44258k4908k5808k5824j3633r850n671L43j515l498m52J121p34l729m990
8100B5110l145N098q47k630L271M059j232m057k546j388K997N25J594Q8K827K436
8084C2160m274n980q097J612L213M835N764l230k499K059p18k170K93L098n405
8069B0661K063R400Q674L700l917K744n228l362J56N971K41l39J372k38K90j554
$$ plain form
8172 23642 23977 21473 9364 10701 15625 18951 19842 21904 28134 37257 36130 30901 33718 40906 34858
8157 34858 27532 24401 21448 15589 17222 23168 20220 19084 17809 11045 15710 23800 27452 25540 18727
8142 18727 9709 15109 24854 29275 28532 21752 26843 23807 18059 14015 14622 24316 26948 27591 25119
8127 25119 25807 29877 37469 41227 49141 64725 90295 134972 184671 211101 206771 181767 144258
8114 144258 119350 93542 67718 54085 44235 38564 38907 37392 33894 33442 34563 33829 30100 25110
8100 25110 21965 27063 26216 23586 26857 30916 29684 25627 23081 21693 24690 25215 26809 26897 29724 32160
8084 32160 27886 21906 13809 15421 18634 23469 29233 26003 23504 25563 24845 22675 22968 26066 20661
8069 20661 22724 32124 40798 44498 40581 43325 38097 34735 34891 40862 41103 40764 42136 41898 42188 40634
8053D0634J108Q245P126J1057J1973J4026R546J6787J7055O956O481l304n366
8040A42324n006p544j319p550j4679m947j105j0924j1240k453M193r24j508O57
8026G7975r137m253R862O263J839n044k529L385N038K731l233j541K613j873J866
8011H3962Q256Q851L657l093Q151L498O248Q861K8440L8793L6056M0178K7329
7998B99187l848k1868l6996k9966k2170k4692j8957j6772p675p614r055n741j670
7985I2163k026K718l599L237m97o731n095l934j77R61K790L624R86J1056R947
7970A05423O557O096N99l485j4734o135k929k142k062K289J0969N586l061j324
7956A01647R802L719p00k806p605k233j753p01K67o183r251o632n450o512j1075
$$ plain form
8053 40634 41742 49987 57113 68170 80143 94169 103715 120502 137557 144513 150994 147690 142324
8040 142324 137318 129774 128455 120905 106226 101279 100174 89250 78010 75557 79750 78826 77318 77975
8026 77975 68838 64585 74447 80710 82549 77505 74976 78361 83399 86130 82897 81356 83969 82096 83962
8011 83962 92218 101069 104726 101633 109784 113282 119530 128391 156831 195624 231680 271858 299187
7998 299187 295339 273471 236475 206509 184339 159647 140690 123918 116243 108629 99574 93833 92163
7985 92163 90137 92855 89256 92493 91996 85265 80170 76236 76059 77020 79810 83434 84420 95476 105423
7970 105423 111980 118076 118675 115190 100456 94321 91392 89250 87188 89477 100446 106032 102971 101647
7956 101647 111449 115168 114468 111662 104057 101824 100071 99370 99637 93454 84203 77571 72121 65609 54534
7941E4534k115l230P54J717p05k990m084M418M163J326M507l336J150J298m790
7926E2617O752K103o131q236N684n38l120o979J369k327p214K680j570l039L226
7911C5277L793K384O045q394q111P26o4n049p746L006K698M635O03K723K621m220
7895C0927J424k549p84J349n375q918j647j254O062K150K703j491Q79k466l090
7880A7920q0O073J998J265j0057q600k495J199R506o867k990L089j910K182N966
7865A6199l279J286j866k170j74l727K360K596N752L69j403J255j538o76k445
7850A2539J093O972m87o267k623M132K333k2J436l176r322j943L567L265K004
7835A3501j868M364M249n633r127M704M411j552j275l710N091M651J338m636m305
$$ plain form
7941 54534 52419 49189 49943 51660 50955 47965 43881 48299 52462 53788 58295 54959 56109 57407 52617
7926 52617 59369 61472 55341 47105 52789 52251 49131 42152 43521 41194 33980 36660 35090 32051 35277
7911 35277 39070 41454 47499 39105 30994 31720 31656 26607 18861 21867 24565 29200 29803 32526 35147 30927
7895 30927 32351 29802 29018 30367 24992 16074 14427 13173 19235 21385 24088 22597 23476 21010 17920
7880 17920 17840 23913 25911 27176 17119 8519 6024 7223 16729 9862 6872 9961 8051 10233 16199
7865 16199 12920 14206 12340 10170 9996 6269 8629 11225 16977 17346 15943 17198 15660 14984 12539
7850 12539 13632 20604 20117 13850 11227 15359 17692 17670 19106 15930 6608 4665 8232 11497 13501
7835 13501 11633 15997 20246 14613 5486 10190 14601 13049 11774 8064 13155 17806 19144 14508 10203
7820A0203n527j55M606R172k396r923k421J576O901n472m079O84j177K42K100
7805D334k687o244J762P84Q746K188Q12p397o84k356q071L077j573m179M829Q33
7789e826R33J392P904j249K466p598m5K541J699K715M898L764j036j014q934M018
7773F628P327k036k735O091j2004k672J291L098l94R17q42N455L449n792m840
7758B941LK979N987p814l582k963l749N778N308j03q733L70J0592P118l26q95
7742A2911r15o40k638j002k267O55l844m468k061K796l207o391K58J517P602L283
7726A589N89j024m912o174L444L886L195M293q40k061p413J562l95j798k115l087
7710a1261j86k692r57P392Q572J643K656k978L983L398l546k937n050J647j639
$$ plain form
7820 10203 4676 4521 9127 18299 15903 5980 3559 5135 12036 6564 2485 3169 1992 2234 4334
7805 4334 1647 -4597 -2835 -2051 6695 8883 9695 2298 1614 -742 -8813 -5736 -7309 -11488 -6659 -5826
7789 -5826 -4893 -3501 4403 3154 5620 -1978 -2023 518 2217 4932 9830 13594 12558 11544 2610 6628
7773 6628 13955 11919 9184 15275 3271 599 1890 4988 4594 5511 4669 10124 13573 7781 2941
7758 2941 2944 5923 11910 4096 514 -2449 -6198 -420 4888 4785 -3948 -3578 7014 14132 13806 12911
7742 12911 11996 11356 8718 7716 5449 6104 2260 -2208 -4269 -1473 -4680 -11071 -10813 -9296 -1694 1589
7726 1589 2178 1154 -3758 -9932 -6488 -2602 593 4886 4046 1985 -5428 -3866 -4261 -6059 -8174 -11261
7710 -11261 -11447 -14139 -15096 -7704 868 2511 5167 2189 6172 9570 6024 3087 -1963 -316 -1955
7695a955n887l616K501j630r99J506N194L521N60l287l778r07L805m417j565l134
7679a4088j502N375M875l59p469P05Q487k355n193M949P481K350l108k074m332
7664f258j040o53N38l740Q02J747J641K66J648K629N16K777l82j464L677N017
7648G721n299q835l758K593L182L339k33P21M209M117j631J690j607l615j030
7633A564J669k042k974j290J420M96j833j521Q56M082j121J967R15o625M549M754
7617D866K370j930r361m055M575j888M767l623k031Q277L993K404k984p557M177
7602B000M821j744q608j582P174m77q433p400J0524Q712j80l326K59m661j631
7587d552N041R0L305m16l890M647J298J404O32j053p180q35L455K2l274J500K671
$$ plain form
7695 -1955 -7842 -11458 -8957 -10587 -11586 -10080 -4886 -1365 -805 -4092 -7870 -8777 -4972 -9389 -10954 -14088
7679 -14088 -15590 -10215 -5340 -5699 -13168 -12463 -3976 -6331 -11524 -6575 906 3256 148 -1926 -6258
7664 -6258 -7298 -7951 -7413 -11153 -10351 -8604 -6963 -6697 -5049 -2420 -1904 873 491 -973 2704 7721
7648 7721 2422 -6413 -10171 -7578 -4396 -1057 -1290 -569 3640 7757 6126 7816 6209 2594 1564
7633 1564 3233 1191 -1783 -3073 -1653 -1157 -2990 -4511 -3655 427 -694 1273 2188 -4437 112 4866
7617 4866 7236 5306 -4055 -8110 -3535 -5423 -656 -4279 -6310 1967 5960 8364 5380 -2177 2000
7602 2000 6821 5077 -3531 -5113 2061 1584 -6849 -14249 -3725 4987 4807 1481 1740 -2921 -4552
7587 -4552 489 579 3884 3468 -422 4225 5523 6927 7559 6506 -674 -1509 1946 1968 -1306 194 2865
7570B865n434k955k600M610N163Q52k46j621k541L302K711L33j251j856J955l672
7554c85K1K41m833o44K025k904q031R63Q923K156l177j986K121k716l276J474
7538a0028M049R703N708p361j402K612k844j892O384R856Q47K30J102j240p743
7523G981q985p778l339O924J782l188j128J536j695j317Q6N86J743J674J819O217
7507B918r39n852k682j471K33J703r6o45K01L253K52k514o455K154Q11K609P54
7490e766P62j70L35m837N04L401J79l571k160M04N325Q021k67J178r457k518K521
7473f116R68P43M617R38k058l076j374m21M024K512l623r329R4J2836M1n572M067
7456g29Q678J064o287j1522J770P198L504q50o745K499K136O657O01m250p780
$$ plain form
7570 2865 -2569 -5524 -8124 -3514 1649 2501 2255 634 -1907 1395 4106 4439 3188 1332 3287 -385
7554 -385 -364 -123 -4956 -5600 -3575 -6479 -14510 -13547 -4624 -2468 -5645 -7631 -5510 -8226 -11502 -10028
7538 -10028 -5979 3724 9432 2071 669 3281 437 -1455 4929 14785 15632 15862 16964 15724 7981
7523 7981 -1004 -8782 -12121 -5197 -3415 -6603 -7731 -6195 -7890 -9207 -9121 -8535 -6792 -5118 -3299 2918
7507 2918 1979 -3873 -6555 -8026 -7793 -6090 -6186 -6831 -6630 -3377 -3125 -5639 -12094 -9940 -9129 -6520 -5766
7490 -5766 -5004 -5174 -4839 -9676 -9172 -5771 -5592 -9163 -11323 -10919 -5594 2427 2160 3338 -6119 -8637 -6116
7473 -6116 -5148 -4405 212 1150 -908 -3984 -5358 -5779 -1755 757 -2866 -12195 -12101 735 776 -4796 -729
7456 -729 7949 9013 2726 -8796 -7026 172 3676 2826 -3919 -1420 716 7373 7974 3724 -4056
7441d056j1397M508m060l280O096Q167j747L58J31J089R34K375k395k401L092
7426b586K239Q240P89l283K586K488M460M941l298o691r941o970N81O487L415
7411C457K387j618j167J535j620l967q65L40M674Q05m447M527m631P7P131r17
7395E701r819q105J877K56K49J550Q347k168M980J1438L432N004n462J193m177
7380A4296j1557j792j103N094K888j0872p592o55P399J893K324R31k934M2P970
7365F332m384L769N144P21Q16J343j0445L136M417l179l54K466k284q323n130
7350e955O829L15K131M007J228J154l158q961n456Q4L285L253O04k307r21M291
7334D23K268k683L85L135N461K251m443K556o007p415O74m699O199J625j410L93
$$ plain form
7441 -4056 -15453 -10945 -15005 -18285 -12189 -4022 -5769 -5411 -5280 -4191 -3257 -882 -3277 -5678 -2586
7426 -2586 -347 7893 8682 5399 7985 10473 14933 19874 16576 9885 -56 -7026 -6445 42 3457
7411 3457 5844 4226 3059 4594 2974 -993 -1858 -1518 3156 3961 -486 4041 -590 -513 6618 5701
7395 5701 -4118 -12223 -10346 -10090 -9841 -8291 56 -2112 2868 14306 17738 22742 17280 18473 14296
7380 14296 2739 947 -156 4938 7826 -3046 -10638 -11293 -3894 -2001 323 1254 -1680 -1638 6332
7365 6332 1948 5717 10861 11582 12398 13741 3296 6432 10849 7670 7316 9782 7498 -825 -5955
7350 -5955 874 1189 3320 7327 8555 9709 6551 -2410 -7866 -7782 -4497 -1244 -640 -2947 -3868 423
7334 423 2691 8 393 3528 8989 11240 6797 9353 3346 -4069 -3395 -8094 -1895 -270 -1680 -1287
7318a287j295j966m460K27M354k296o23j986l306N362O106p351J748K673k048
7303f148o497K580O690K071J043J545N606o528q028q68l980p28O055L838m52J107
7287b694M631N941K587M963j919n225J252K883l754m946o078m399P099q02q93
7272a354m201L172Q63M173l565k305K083M77R41j368q02n723M191Q552l207l015
7256a088L191qm151K054o63j394k693m785N35k93L26j67n165r2j73J2741J651
7239a74l802l67L175J857M137m010k903j076n82k471m470J1L55L131M591L655
7223A057K948m238r015j729O353Q896k376o958l02j449M98q11J0083L598p490
7208i35q690k495K427M068J281l419K877Q721q68q640k78j381N750k706Q18M73
$$ plain form
7318 -1287 -2582 -4548 -9008 -8781 -4427 -6723 -7346 -9332 -12638 -7276 -1170 -8521 -6773 -4100 -6148
7303 -6148 -12645 -10065 -3375 -1304 -261 1284 6890 362 -7666 -8534 -12514 -13242 -7187 -3349 -3801 -2694
7287 -2694 1937 7878 10465 15428 13509 8284 9536 12419 8665 3719 -2359 -6758 341 -461 -1354
7272 -1354 -5555 -2383 -1520 2653 -912 -3217 -1134 -657 284 -1084 -1886 -7609 -3418 5134 1927 -1088
7256 -1088 2103 2095 -2056 -2 -665 -2059 -4752 -9537 -9002 -9295 -8969 -9136 -14301 -14393 -14566 -1825 -174
7239 -174 -3976 -4343 -1168 689 4826 816 -2087 -3163 -3745 -6216 -10686 -10675 -10320 -7189 -2598 1057
7223 1057 4005 -233 -9248 -10977 -4624 4272 1896 -5062 -5364 -6813 -6315 -7126 2957 6555 -935
7208 -935 -9625 -12120 -9693 -5625 -4344 -7763 -4886 3835 2967 -5673 -5951 -7332 -1582 -4288 -3470 -2997
7192b997m330l939l48P50K668J499R285M517l181j1502k069M614K629p27J923
7177a208k595l433K942k183n30M740J918J501m795K18M546Q62m828k664Q0j247
7161f676J79M767O311j699R22O361K67m50m020j408K700J40o086n410p903Q98
7145a1107N573L09R17k071O53M641m46l461P063N814m945l348O585m734o896L347
7129b106n43n10k56N025o8l526O436R12n495o498l536r87J623P665l71L767k03
7112A329J936n028M093K225k174N38N167o590j905L404R25n160q38K788L147r31
7096B926O315L4k235m176j485M579l371K573j122k161k942m371N02m85J863j734
7080e290m626j680J2827R537j771j355k460n904R57J0136j279L0j803p084j600
$$ plain form
7192 -2997 -7327 -11266 -11614 -10864 -8196 -6697 2588 7105 3924 -7578 -9647 -5033 -2404 -3131 -1208
7177 -1208 -3803 -7236 -4294 -6477 -7007 -2267 -349 1152 -3643 -3425 1121 1983 -2845 -5509 -5429 -6676
7161 -6676 -6497 -1730 4581 2882 3804 10165 10432 9982 5962 4554 7254 7394 1308 -4102 -12005 -11107
7145 -11107 -5534 -5225 -4308 -6379 -5726 -1085 -1531 -4992 2071 7885 2940 -408 6177 1443 -5453 -2106
7129 -2106 -2649 -3159 -3415 1610 1542 -1984 4452 5364 -131 -6629 -10165 -11152 -9529 -1864 -2235 1532 1329
7112 1329 3265 -1763 2330 4555 2381 2919 8086 1496 -409 2995 3920 -1240 -2078 710 3857 2926
7096 2926 9241 9275 7040 2864 1379 5958 2587 5160 4038 1877 -1065 -5436 -4934 -5419 -3556 -5290
7080 -5290 -9916 -11596 1231 10768 8997 7642 5182 -722 235 10371 9092 9122 7319 235 -1365
7065a365L635O661P61q147o057m660j439K292k239J871K411M207J075O05J92l797
7049c994K442L784L278k959k592p359K030L047M996j258K105k973l774l101R39
7034e389k76m23M265j246j396n498K30K141j1630l43R569L299O970K410j454l514
7018b285j10P727m89J374k270k234J953K753j461m856r76K287M418M987L126m239
7002I705L336m062p22k311o957J079K250j930l334L91M572q702k945P261L720
6987A351j825j40m947m52L508J0592K266M982k066p490j3510m636l365K447R84
6972a2301l811N025J0039M758m61M221k336o39J028J36k139m456K887J933k428
6957A456J22l861k848J335N60l237j329K494M611K01o28J68l317K068J955K881
$$ plain form
7065 -1365 2270 8931 9692 1545 -4512 -9172 -10611 -8319 -10558 -8687 -6276 -2069 -994 -389 -197 -3994
7049 -3994 -1552 2232 5510 2551 -41 -7400 -5370 -2323 2673 1415 3520 547 -3227 -6328 -5389
7034 -5389 -5665 -6088 -1823 -3069 -4465 -9963 -9733 -7592 -19222 -19565 -9996 -6697 273 2683 1229 -2285
7018 -2285 -2395 5332 4843 6217 3947 1713 3666 6419 4958 102 -874 1413 5831 10818 13944 9705
7002 9705 13041 8979 8257 5946 -1011 68 2318 388 -2946 -2555 2017 -6685 -9630 -2369 1351
6987 1351 -474 -614 -5561 -6013 -2505 8087 10353 15335 13269 5779 -7731 -12367 -15732 -13285 -12301
6972 -12301 -16112 -11087 -1048 3710 3249 7470 5134 4495 5523 5659 3520 -936 1951 3884 1456
6957 1456 1578 -2283 -5131 -3796 -3236 -6473 -7802 -5308 -697 -496 -1124 -956 -4273 -2205 -250 2631
6941B631N48n851K6K11n07o519R99R833j732l150M561o89k013o0P436J719m08
6924G035o452k456n054k547j887Q540K79k575M669L564m164n24N1j468o334j461
6908a0784J451K313J560M977N30k703l607P662J659K091o785k400J463Q92R287
6893G606L308n461l536L14j142k677q154j265K534L973o936j422Q373O73j642
6878e454N040K293k605j634K421K273L055k448p679J483P76l299p43L788r91P29
6862b995K723K913Q84j774j828K641j420m798L78N64m262l671J429M369J932K864
6846e1M431L081K49p85Q8j874l754p069j596J199K186K961M242M406l18M234n940
6829E690o144K577J541K490k475m386K307k713k283P411R38k305l325L404L842
$$ plain form
6941 2631 3179 -2672 -2646 -2435 -2942 -9461 -8462 1371 -361 -3511 1050 361 -1652 -1712 5724 7443 7035
6924 7035 583 -1873 -6927 -9474 -11361 -2821 -2542 -5117 -448 3116 -1048 -1572 -1521 -2989 -9323 -10784
6908 -10784 -9333 -7020 -5460 -483 47 -2656 -6263 1399 3058 5149 -1636 -4036 -2573 -1681 7606
6893 7606 10914 5453 1917 2231 1089 -1588 -9742 -11007 -8473 -4500 -11436 -12858 -4485 -3812 -5454
6878 -5454 -414 1879 -726 -2360 61 2334 5389 2941 -4738 -3255 -2479 -5778 -6521 -2733 -3724 -2995
6862 -2995 -272 2641 3525 1751 -77 2564 1144 -3654 -3276 -2712 -6974 -10645 -9216 -4847 -2915 -51
6846 -51 4380 7461 7710 6925 7013 5139 1385 -5684 -7280 -6081 -3895 -934 3308 7714 7396 11630 5690
6829 5690 -454 2123 3664 6154 3679 -707 1600 -1113 -3396 4015 4953 2648 -677 2727 6569
6814F569k490k732l713l056P88LN110O447L062k348m805L885K237l297q680o053
6798i073R417L886J243M033k671n450l765j236l304P950M960p2K097j622l146
6783C247m259k956m494K570J656J387j672K587K724m439o31M11k863P621P739
6768H628M17k00J528j297j004l438O07n180n734L265r39n092k063M418q20QL727
6751c169R481p031o306M115R604M726j240l871K145L08N943M541l960j852J848
6736A5282j728M846Q915N210J953m556q83L233J6614J8588K3213K5807L1864O422
6722A54780q323j7316k4764k0218l650M174L235o61P114J8729J6573K0436M0444
6709A90553M9114O1210R8903J60960K66397M04955O37912Q87589P00661q6013
$$ plain form
6814 6569 4079 1347 -2366 -5422 -4634 -4631 479 6926 9988 7640 2835 6720 8957 5660 -3020 -9073
6798 -9073 344 4230 5473 9506 6835 1385 -2380 -3616 -6920 1030 5990 5918 8015 6393 3247
6783 3247 -1012 -3968 -8462 -5892 -4236 -2849 -4521 -1934 790 -3649 -4280 -3869 -6732 889 8628
6768 8628 9045 8845 10373 9076 8072 4634 5241 61 -5673 -2408 -3347 -8439 -10502 -6084 -6904 -6896 -3169
6751 -3169 6312 -719 -7025 -2910 6694 11420 10180 6309 8454 8762 14705 19246 15286 13434 15282
6736 15282 13554 18400 27315 32525 34478 29922 29039 32272 48886 67474 90687 116494 148358 154780
6722 154780 146457 129141 104377 84159 80509 84683 87918 87257 94371 113100 129673 150109 190553
6709 190553 239667 300877 399780 560740 827137 1232092 1870004 2757593 3458254 3372241
6699C372241n52539o88080o68373m82522k96042j82081j23433p7473n9578l8135
6689B03985j9378k3990j6705j7123j5719p227j304o657j818R130J7862J2902K506
6676A36464j1960k3693k5965j4798r837q376l026K596L55O80n695M7o083j626
6662B9083L954p75K913l527q919O4o660j28k772j041k287R16O417R20o304m732
6646G122m500l224K652j852J790k518l5N024L0R4M978M425K094k142o547k866
6630D525O85k908K676M443J093j83m834R69k772r8M673m406r334j928N28M50M730
6613a691M90J375N045J695l005r467l498M136l05k245J512P047n950o628j013
6598a2502J977q99K085L764R84n531K519M9k115k25L497k542n06M572L608M652
$$ plain form
6699 3372241 2819702 2131622 1463249 980727 684685 502604 379171 301698 242120 203985
6689 203985 184607 160617 143912 126789 111070 103843 102539 95882 94064 103194 121056 133958 136464
6676 136464 124504 100811 74846 60048 50211 41835 38809 41405 41760 42440 36745 36792 30709 29083
6662 29083 33037 32262 35175 31648 22729 22793 16133 16005 13233 12192 9905 10821 17238 18158 11854 7122
6646 7122 2622 -602 2050 198 1988 -530 -565 4459 4489 4583 9561 13986 16080 13938 7391 4525
6630 4525 5210 2302 4978 9421 10514 10331 5497 6466 3694 3596 8269 3863 -5471 -7399 -6871 -6421 -1691
6613 -1691 -1201 174 5219 6914 3909 -5558 -9056 -4920 -5225 -7470 -5958 1089 -4861 -11489 -12502
6598 -12502 -10525 -11424 -9339 -5575 -4591 -10122 -7603 -7554 -9669 -9894 -6397 -8939 -9445 -4873 -1265 3387
6582C387N054r620q704O069P955K784P25J682j5726O281J0802L894j0398o53j919
6567A613J078J005l967K066L462M19q248m256J585l642O40M530O167J178j0305
6552f675m16Q237O493l052k379o183l177J261j136m786N584L515k288m24p843
6537a3269j912N485Q466m2j828J72n202n370j063J742m331o13N505j908k821L752
6521a3237n017j2944P558J1332P933L453M795M566n173m779K394J249j2339n921
6507a6130O253O377j032Q7J254k282q47J514o38K101J731L527N11l381l59N160
6491C846o136m691k353O548Q310j358k225N97j648m667m714k052L382L23K577
6476d261N859j353j2730j877L565P135N180J432K123M210p452l572q63n459J868
$$ plain form
6582 3387 8441 -1179 -9883 -3814 4141 6925 7650 9332 -6394 -113 10689 14583 4185 3532 1613
6567 1613 2691 3696 -271 1795 5257 5676 -2572 -6828 -5243 -8885 -8245 -3715 2452 3630 -6675
6552 -6675 -7091 1146 7639 4587 2208 -3975 -7152 -5891 -7027 -11813 -6229 -2714 -5002 -5426 -13269
6537 -13269 -15181 -9696 -1230 -1272 -3100 -2928 -8130 -13500 -14563 -12821 -17152 -17765 -12260 -14168 -16989 -13237
6521 -13237 -18254 -31198 -23640 -12308 -4375 -922 3873 8439 3266 -1513 881 2130 -10209 -16130
6507 -16130 -9877 -3500 -4532 -4445 -3191 -5473 -6320 -4806 -5444 -3343 -1612 1915 2426 -955 -1314 3846
6491 3846 -2290 -6981 -9334 -2786 5524 4166 1941 2538 890 -3777 -8491 -10543 -7161 -6838 -4261
6476 -4261 1598 245 -12485 -14362 -10797 -3662 1518 2950 5073 9283 1831 -1741 -2604 -8063 -6195
6461f195L096p325N81m523K774P431O556j172J069M867J258L07r380j443j541
6446c640q205q125k459M678K278Q656K676l088L631l179q98O216j635q05l606
6431g505J351L73k462K176P173K714n864J92l159o47N520m400j338L519M297m47
6415A493j602M444k312l664K2m446l588J408k344Q222O613M862n395n974l989
6400f250Q16k728j83L440k184o21j44q450K465J2203M709j968L795j762j37r678
6384f677j1598J712P364O149K611L072j815o293n584K824O555L642K065J899J510
6369G436m292M491R47J724q94K017n024p927P134o73k674k932R07L885J984k328
6353C781n353k499k125P831J350l091j382L450j991k242P06q82J197J186k574
$$ plain form
6461 -6195 -3099 -10424 -9843 -14366 -11592 -4161 2395 1223 2292 7159 8417 8724 -656 -2099 -3640
6446 -3640 -11845 -19970 -22429 -17751 -15473 -6817 -4141 -7229 -3598 -6777 -7675 -1459 -3094 -3899 -7505
6431 -7505 -6154 -5781 -8243 -6067 1106 3820 -2044 -1852 -5011 -5658 -138 -4538 -5876 -2357 1940 1493
6415 1493 -109 4335 2023 -1641 -1619 -6065 -9653 -8245 -10589 -2367 4246 9108 3713 -2261 -6250
6400 -6250 -5434 -8162 -8345 -4905 -7089 -7710 -7854 -16304 -13839 -1636 3073 1105 4900 3138 3001 -6677
6384 -6677 -18275 -16563 -9199 -3050 -439 2633 818 -5475 -11059 -8235 -1680 1962 4027 5926 7436
6369 7436 3144 7635 8582 10306 9412 11429 6405 -1522 5612 4939 2265 -667 240 4125 6109 3781
6353 3781 -1572 -4071 -6196 1635 2985 -106 -1488 1962 -29 -2271 -1565 -2447 -1250 -64 -2638
6338b638k897L736M009j005P90n928P646k861j771M708M653k512L810N818j945
6323A3613l281m715p591m38J60j447j085J713j43Q51l77K29K87L129O93j86P69
6306B181o562k512l24P770l222j359p48J009J791L23l945q947O126K375j835q21
6290h700K614J274K335J33l90J460k845L451P004j497p736Q8q89n238j629L971
6274f594Q929J243m653m593j326O221Q26K706j358P46j912O21M251m106l759K79
6258b479K31J55o515J49K023L758k169m908J609M916P410P114n231q852n277k369
6242a0435N829J359m547J675L489o011n505K456j566j900M353M713O939l43j95
6227C11j534J70q50R85j732L792J296l291k810k483j096K579L74J593l664p614
$$ plain form
6338 -2638 -5535 -1799 2210 1205 1995 -3933 3713 852 -919 3789 8442 5930 9740 15558 13613
6323 13613 10332 5617 -1974 -2412 -2252 -3699 -4784 -3071 -3214 -2363 -2740 -2511 -2224 905 1598 1412 2181
6306 2181 -4381 -6893 -7217 553 -2669 -4028 -4776 -3767 -1976 -1653 -5598 -14545 -8419 -6044 -7879 -8700
6290 -8700 -6086 -4812 -2477 -2344 -2734 -1274 -4119 -668 6336 4839 -2897 -2809 -3698 -8936 -10565 -6594
6274 -6594 2335 3578 -1075 -5668 -6994 -773 53 2759 1401 2147 235 856 5107 1001 -2758 -2479
6258 -2479 -2248 -2093 -8608 -8459 -6436 -2678 -4847 -9755 -8146 -3230 4180 11294 6063 -2789 -8066 -10435
6242 -10435 -4606 -3247 -7794 -6119 -2630 -8641 -14146 -11690 -13256 -15156 -10803 -6090 849 506 311
6227 311 -1223 -1053 -1903 -918 -2650 1142 2438 -853 -3663 -6146 -7242 -4663 -4289 -2696 -6360 -13974
6211a3974L315N951L840J758m82n233q783N094O87R84L898L125J2090n24q174
6196C572n997J563J010J54j3080m493J2403N577o927J486J403n61l813l75L421
$$ plain form
6211 -13974 -10659 -4708 -868 890 408 -4825 -13608 -8514 -7827 -6843 -2945 180 12270 11746 3572
6196 3572 -2425 -862 148 302 -12778 -17271 -4868 709 -6218 -4732 -3329 -3890 -7703 -8078 -4657
$$ [...]
##END NTUPLES=NMR SPECTRUM
##END=
