##TITLE=Analysis number 317171
Compound Code cc 46909
Book Reference 422/141
Project Code adrs
Chemist Name robb
##JCAMPDX= 6.0         $$ Bruker NMR JCAMP-DX V2.0
##DATA TYPE= NMR SPECTRUM
##DATA CLASS= NTUPLES
##ORIGIN= Bruker BioSpin GmbH
##OWNER= nmr
$$ XWIN-NMR		Version 3.5
$$ Thu Feb  9 20:31:06 2006 GMT Standard Time (UT+0h)  MAYBRIDGE\nmr@NMR_250MHZ
##.OBSERVE FREQUENCY= 250.131544655141
##.OBSERVE NUCLEUS= ^1H
##.ACQUISITION MODE= SIMULTANEOUS (DQD)
##.ACQUISITION SCHEME= undefined
##.AVERAGES= 16
##.DIGITISER RES= 18
##SPECTROMETER/DATA SYSTEM= dpx250
##.PULSE SEQUENCE= zg30
##.SOLVENT NAME= CDCl3
##.SHIFT REFERENCE= (INTERNAL, CDCl3, 0, 16.522)
##AUDIT TRAIL= $$ (NUMBER, WHEN, WHO, WHERE, WHAT)
$$ ##TITLE= Audit trail, XWIN-NMR		Version 3.5
$$ ##JCAMPDX= 5.01
$$ ##ORIGIN= Bruker BioSpin GmbH
$$ ##OWNER= nmr
$$ C:\u/data/dgb/nmr/ADRS/15790/pdata/1/auditp.txt
$$ ##AUDIT TRAIL=  $$ (NUMBER, WHEN, WHO, WHERE, WHAT)
(   1,<2006-02-09 20:30:42.53 +000>,<MAYBRIDGE\nmr>,<NMR_250MHZ>,
      <created by zg, POWCHK disabled, PULCHK disabled
       configuration hash MD5:
       84 BC 41 DB A1 6E 1D 46 DA 25 12 A5 C1 ED C5 3A
       data hash MD5: 64K
       5A EB 7E 43 42 EA A4 1E 7E CB F7 AF 69 39 EC B0>)
(   2,<2006-02-09 20:30:57.35 +000>,<MAYBRIDGE\nmr>,<NMR_250MHZ>,
      <Start of raw data processing
       ef LB = 0.3 FT_mod = 6 PKNL = 1 SI = 32K 
       data hash MD5: 32K
       C1 4E AE 51 D9 A0 ED 9E 44 D1 A0 18 35 04 0E 21>)
(   3,<2006-02-09 20:30:59.22 +000>,<MAYBRIDGE\nmr>,<NMR_250MHZ>,
      <apk 
       data hash MD5: 32K
       78 87 A3 96 44 83 9E 24 F0 98 E3 A4 26 23 84 04>)
(   4,<2006-02-09 20:30:59.99 +000>,<MAYBRIDGE\nmr>,<NMR_250MHZ>,
      <abs ABSG = 5 
       data hash MD5: 32K
       4B A5 49 F8 DF 86 F3 C8 9E 3F F5 89 15 A8 07 A9>)
$$ ##END=
$$ 
$$ hash MD5
$$ D6 31 8A F1 DC 06 D8 34 1A 0D 5E 5F E1 16 96 CA
##$RELAX= 
##$RELAX= 
##$RELAX= 
##$RELAX= 
##$RELAX= 
##$RELAX= 
##$RELAX= 
$$ Bruker specific parameters
$$ --------------------------
##$DU= <C:\u>
##$EXPNO= 15790
##$NAME= <ADRS>
##$PROCNO= 1
##$TYPE= <nmr>
##$USER= <dgb>
##$AMP= (0..31)
100 100 100 100 100 100 100 100 100 100 100 100 100 100 100 100 100 100 
100 100 100 100 100 100 100 100 100 100 100 100 100 100 
##$AQSEQ= 0
##$AQ_mod= 3
##$AUNM= <au_zg>
##$AUTOPOS= <23 >
##$BF1= 250.13
##$BF2= 250.13
##$BF3= 250.13
##$BF4= 250.13
##$BF5= 500.13
##$BF6= 500.13
##$BF7= 500.13
##$BF8= 500.13
##$BYTORDA= 1
##$CFDGTYP= 0
##$CFRGTYP= 5
##$CHEMSTR= <none>
##$CNST= (0..31)
1 1 145 1 1 1 1 1 1 1 1 1 1 1 1 1 1 1 1 1 1 1 1 1 1 1 1 1 1 1 1 1 
##$CPDPRG= <>
##$CPDPRG1= <>
##$CPDPRG2= <>
##$CPDPRG3= <>
##$CPDPRG4= <mlev>
##$CPDPRG5= <mlev>
##$CPDPRG6= <mlev>
##$CPDPRG7= <mlev>
##$CPDPRG8= <mlev>
##$CPDPRGB= <>
##$CPDPRGT= <>
##$D= (0..31)
0 1 0 0 0 0 0 0 0 0.06 0 0 0 0 0 0 0.0002 0 0 0 0 0 0 0 0 0 0 0 0 0 0 
0 
##$DATE= 1139517041
##$DBL= (0..7)
120 120 120 120 120 120 120 120 
##$DBP= (0..7)
150 150 150 150 150 150 150 150 
##$DBP07= 0
##$DBPNAM0= <>
##$DBPNAM1= <>
$$ [...]
##$SUBNAM7= <"">
##$SUBNAM8= <"">
##$SUBNAM9= <"">
##$SW= 20.6930455092707
##$SWIBOX= (0..15)
0 0 3 0 0 0 0 0 0 0 0 0 0 0 0 0 
##$SW_h= 5175.983436853
##$TD= 65536
##$TD0= 1
##$TE= 294.16
##$TE2= 300
##$TE3= 300
##$TEG= 300
##$TL= (0..7)
0 120 120 120 120 120 120 120 
##$TP= (0..7)
150 150 150 150 150 150 150 150 
##$TP07= 0
##$TPNAME0= <>
##$TPNAME1= <>
##$TPNAME2= <>
##$TPNAME3= <>
##$TPNAME4= <>
##$TPNAME5= <>
##$TPNAME6= <>
##$TPNAME7= <>
##$TPOAL= (0..7)
0.5 0.5 0.5 0.5 0.5 0.5 0.5 0.5 
##$TPOFFS= (0..7)
0 0 0 0 0 0 0 0 
##$TUNHIN= 0
##$TUNHOUT= 0
##$TUNXOUT= 0
##$USERA1= <user>
##$USERA2= <user>
##$USERA3= <user>
##$USERA4= <user>
##$USERA5= <user>
##$V9= 5
##$VALIST= <valist>
##$VCLIST= <CCCCCCCCCCCCCCC>
##$VD= 0
##$VDLIST= <DDDDDDDDDDDDDDD>
##$VPLIST= <PPPPPPPPPPPPPPP>
##$VTLIST= <TTTTTTTTTTTTTTT>
##$WBST= 1024
##$WBSW= 4
##$XGAIN= (0..3)
0 0 0 0 
##$XL= 0
##$YL= 0
##$YMAX_a= 643160
##$YMIN_a= -500846
##$ZGOPTNS= <>
##$ZL1= 120
##$ZL2= 120
##$ZL3= 120
##$ZL4= 120
##$ABSF1= 16.522
##$ABSF2= -4.171173
##$ABSG= 5
##$ABSL= 3
##$ALPHA= 0
##$AQORDER= 0
##$ASSFAC= 0
##$ASSFACI= 0
##$ASSFACX= 0
##$ASSWID= 0
##$AUNMP= <proc_1d>
##$AZFE= 0.1
##$AZFW= 0.1
##$BCFW= 0
##$BC_mod= 0
##$BYTORDP= 0
##$COROFFS= 0
##$CY= 12.5
##$DATMOD= 1
##$DC= 0
##$DFILT= <>
##$DTYPP= 0
##$F1P= 14.0000005364418
##$F2P= -0.99999901652339
##$FCOR= 0.5
##$FTSIZE= 32768
##$FT_mod= 6
##$GAMMA= 0
##$GB= 0
##$INTBC= 1
##$INTSCL= 1
##$ISEN= 128
##$LB= 0.3
##$LEV0= 0
##$LPBIN= 0
##$MAXI= 10000
##$MC2= 0
##$MEAN= 0
##$ME_mod= 0
##$MI= 0
##$NCOEF= 0
##$NC_proc= -2
##$NLEV= 6
##$NOISF1= 0
##$NOISF2= 0
##$NSP= 0
##$NTH_PI= 0
##$NZP= 0
##$OFFSET= 16.522
##$PC= 1
##$PHC0= 99.48711
##$PHC1= 2.075334
##$PH_mod= 1
##$PKNL= yes
##$PPARMOD= 0
##$PSCAL= 4
##$PSIGN= 0
##$REVERSE= no
##$SF= 250.13
##$SI= 32768
##$SIGF1= 0
##$SIGF2= 0
##$SINO= 400
##$SIOLD= 32768
##$SREGLST= <1H.CDCl3>
##$SSB= 0
##$STSI= 32768
##$STSR= 0
##$SW_p= 5175.98343685301
##$SYMM= 0
##$S_DEV= 0
##$TDeff= 65536
##$TDoff= 0
##$TI= <Analysis number 999999
Compound Code 99
Book Reference 9
Project Code 9>
##$TILT= no
##$TM1= 0
##$TM2= 0
##$TOPLEV= 0
##$USERP1= <user>
##$USERP2= <user>
##$USERP3= <user>
##$USERP4= <user>
##$USERP5= <user>
##$WDW= 1
##$XDIM= 32768
##$YMAX_p= 363873942
##$YMIN_p= -51459
$$ End of Bruker specific parameters
$$ ---------------------------------
##NTUPLES= NMR SPECTRUM
##VAR_NAME=  FREQUENCY,     SPECTRUM/REAL,   SPECTRUM/IMAG
##SYMBOL=    X,             R,               I
##VAR_TYPE=  INDEPENDENT,   DEPENDENT,       DEPENDENT
##VAR_FORM=  AFFN,          ASDF,            ASDF
##VAR_DIM=   32768,         32768,           32768
##UNITS=     HZ,            ARBITRARY UNITS, ARBITRARY UNITS
##FACTOR=    0.157963299565203, 1,           1
##FIRST=     4132.6476996994, 0,             0
##LAST=      -1043.33573715361, 0,           0
##MIN=       -1043.33573715361, -51459,      0
##MAX=       4132.6476996994, 363873942,     0
$$ Real data points
##PAGE= N=1
##DATA TABLE= (X++(R..R)), XYDATA
$$ [...]
19145I301P522j756m099m636j073J856J336P35r70n478j688m03Q8l39J516p77
19129A135j81L205Q368P899l617o049l810L52M318k588p590K535P727l804J531
19114I431M220J307k08l326n24m738N992M592J800J0618Q657J0417O328K5182
19100G9748M5535N1081L8303N529j1810M46J6343K2937o855k9404l3056n995K2663
19087A95465L4805J6652p647j4146L449J8970k865l1147m1187m6685l5547j8390
19075G1727j4361n353m620p143q544r853m470n74K03q104Q25J42P24K267K831
19060A5697M369p38O440p042j0916j951r83P873J961L926j232q37K304M030O075
19045B8976Q33o190r489M278L60m334m61Q94o85P80K293J557l184J709o39m55
$$ plain form
19145 9301 16823 15067 10968 6332 5259 7115 8451 9186 8216 2738 1050 647 735 396 1912 1135
19129 1135 954 4159 12527 20426 16809 10760 6950 7302 11620 9032 1442 3977 11704 7900 9431
19114 9431 13651 14958 14750 11424 10900 6162 12154 16746 18546 29164 37821 48238 54566 79748
19100 79748 125283 176364 214667 220196 208386 208832 225175 248112 241257 211853 178797 172802 195465
19087 195465 230270 246922 239275 225129 228578 247548 244683 213536 172349 125664 90117 71727
19075 71727 57366 52013 47393 40250 31706 21853 17383 16809 17012 8908 9733 9875 10599 12866 15697
19060 15697 20066 19328 25768 18726 7810 5859 4876 12749 14710 18636 17404 16567 18871 22901 28976
19045 28976 29809 23619 14130 18408 18768 14434 13973 14867 14182 14962 17255 18812 15628 17337 16698 16243
19029A6243j274j6896m453Q632O973J335J587l133p497M95N553L084j016m357
19015E276k522n360O685J427J98M244j92M3o808j525M55K109J704O609j882J230
18999A1691l527j367J501J828l693N049M622l407l049k132k879L701K155M336
18985A4829k963q550O352j115l896L610L918M853j890j200m276o52l76j565L56
18970G435j278r93P801J3351O355p476o434k911l63p513m172K048M601O164N859
18955B2474j11m333o06q251N320J42j395K972L900k621l048j018r709n122P40
18940f66K190N377m850k044P461P951K943k467J491N927n620m106o272q28L408
18925I895J543J021o156o721m845O209R302L229k10n150l453o283M201m796l140
$$ plain form
19029 16243 14969 -1927 -6380 2252 9225 10560 12147 9014 1517 2012 7565 10649 9633 5276
19015 5276 2754 -2606 4079 5506 5704 9948 9756 9799 2991 1466 1921 4030 5734 12343 10461 11691
18999 11691 8164 6797 8298 10126 6433 11482 16104 12697 9648 7516 4637 8338 10493 14829
18985 14829 11866 3316 9668 8553 4657 8267 12185 17038 15148 13948 9672 9020 8644 7079 7435
18970 7435 6157 5164 12965 26316 32671 25195 18761 15850 15487 7974 3802 5850 10451 16615 22474
18955 22474 22363 18030 17424 9173 14493 14635 13240 16212 20112 17491 14443 13425 3716 -1406 -666
18940 -666 1524 6901 2051 7 7468 15419 18362 15895 17386 23313 17693 13587 7315 6487 9895
18925 9895 11438 12459 6303 -418 -5263 946 10248 13477 13267 8117 4664 -1619 2582 -2214 -5354
18910e354Q96J18q44M283L460L248L248M127k889P27J156J215J622Q31m824q288
18894B732P180O31k79L707j401p553J595k645M195M882N132q771j115k854J724
18879G160L503k012o6k759J939N255J207J542O39J878m789r473L573k074k116
18864C407P798N601K401k337k887K187J691j782l876j979n325J291P779k886Q475
18849A9558j040n700l218k091K295K763J1612P122P89n95j029J732K392m550K840
18834C2880J103k736J476l876K254n590r064O53j410j491n028L677R307K532m373
18819B0314J30P21M3q222L903M377q669k154J2976O990K203Qn287q776l537k585
18803A2435r24K287Q88P760L433K01n797n52K19o81k898o4m771j383L087Q170
$$ plain form
18910 -5354 -4458 -4340 -5184 -901 2559 5807 9055 13182 10293 11020 12176 13391 15013 15844 11020 2732
18894 2732 9912 10543 10264 13971 12570 5017 6612 3967 8162 13044 18176 9405 8290 5436 7160
18879 7160 10663 8651 8585 5826 7765 13020 14227 15769 16408 18286 13497 4024 7597 5523 3407
18864 3407 11205 16806 19207 16870 13983 16170 17861 16079 12203 10224 4899 6190 13969 11083 19558
18849 19558 18518 12818 9600 7509 9804 12567 24179 31301 32090 31495 30466 32198 34590 30040 32880
18834 32880 33983 31247 32723 28847 31101 25511 16447 17100 15690 14199 9171 12848 22155 24687 20314
18819 20314 20444 21165 21208 12986 16889 21266 12597 10443 23419 30409 32612 32620 27333 18557 15020 12435
18803 12435 11511 13798 14686 22446 25879 26080 20283 19731 19950 19269 16371 16307 11536 10153 13240 21410
18787B1410L320k247k472O775L571n005o989q74L871L731K745n943K553K921N603
18772C2970j6j0765k178M396O886J0180L167J3139K0626J4906K51j0166k3937
18759E9459j4037l378o792k282p402p178p521m570R660o26q06O577O440n48k254
18744B4742N292J258k480k444k496l702m518N07K694L178O317m01o733L072M637
18729B8923m432k868J439N664N103q77j2277l783K466N422O740L657L146L713
18715D2036O030R976R479J0891L678l447o795o362j418m254k648l55n769K1N026
18700E6089P82L251K839K44L589m14l911k034k385n914l695q956q595q99N440
18685C5431K064K000K947n92n686k552O3J810Q00r25M167l54M145j955q013o414
$$ plain form
18787 21410 24730 22483 20011 26786 30357 25352 18363 17489 21360 25091 27836 21893 24446 27367 32970
18772 32970 32954 22189 20011 24407 31293 41473 44640 57779 78405 93311 93562 83396 59459
18759 59459 45422 42044 35252 32970 25568 18390 10869 6299 15959 15333 14527 21104 27544 26996 24742
18744 24742 30034 31292 28812 26368 23872 20170 15652 16159 18853 22031 28348 27947 21214 24286 28923
18729 28923 24491 21623 23062 28726 33829 32952 20675 16892 19358 24780 31520 35177 38323 42036
18715 42036 48066 58042 67521 78412 82090 78643 71848 65486 64068 59814 57166 56811 51042 51063 56089
18700 56089 56871 60122 62961 63205 66794 66380 62469 60435 58050 52136 48441 39485 30890 29991 35431
18685 35431 37495 39495 42442 41850 36164 33612 33675 35485 36285 35360 39527 39173 43318 41363 33350 26936
18669B6936J774J761j476p31M797Q646N73K593o96l497P62N740k149L868q522
18654D0379q456k934J031Q182O903j945o109p07l883J114P072j590j387o92o456
18639C0522M973L846n211o586j092L391K162L522M737R299O138m423k520l289
18625D5469K233O80r4l919n641J1284J5941K630l16M085n449k953O89n961p195
18610E1483K94L73M714n877j553l075N272N058j013L615m874K166N236j687r364
18595E0768n013l301K357M662j460q129m793L321O79Q330Q079Q197J378m532Q681
18580F9224O099l791L88l349n738M50J4871P649k793O67r754L413J0798N84L876
18565I2594m995J542K051k365J215j218l62j647l644L30k785K957N208L402O701
$$ plain form
18669 26936 28710 30471 28995 28264 33061 41707 42280 44873 44177 40680 41442 47182 45033 48901 40379
18654 40379 31923 28989 30020 38202 45105 43160 37051 36344 32461 33575 40647 39057 37670 36978 30522
18639 30522 35495 39341 34130 27544 26452 29843 32005 35527 40264 49563 55701 51278 48758 45469
18625 45469 47702 48382 48288 44369 38728 50012 65953 68583 68267 72352 66903 63950 64639 58678 51483
18610 51483 51777 52150 56864 50987 49434 46359 51631 56689 55676 59291 54417 56583 61819 60132 50768
18595 50768 45755 42454 44811 49473 48013 39884 35091 38412 39091 47421 55500 63697 65075 60543 69224
18580 69224 75323 71532 71920 68571 62833 63283 78154 85803 83010 83677 73923 77336 88134 88718 92594
18565 92594 87599 89141 91192 88827 90042 88824 88462 86815 83171 83501 80716 83673 88881 92283 98984
18550I8984R868j715n549n632l547O171P137J989L124L640M504l88l194n421p329
18535A02642K220L171L497J550j016J648K337M966P371J0081J978j589m814M773
18521A38815J1817J751K119K298P952J4837L880K461l248o226L417J2217Q216
18508B00306K170M536M414J7477J6265J6077J6654L1875N0266M7424L7521K1946
18496D66931P357J0108K6642K1281L786j1477o170J9618L8699O2090M7381K8516
18484G14762L6177O8153Q8513R3545P5629M1609L8299Q1097J11311J05203Q0451
18473A534749Q2498J16782J51014J88282K23090K61372L26678M34689O13272Q38924
18463D771350J136388J678235K764427M899603Q424735J0330624N919032M13640
$$ plain form
18550 98984 108852 107137 101588 95956 92409 98580 105717 107706 110830 114470 118974 118586 115392 109971 102642
18535 102642 104862 108033 111530 113080 112064 113712 116049 121015 128386 138467 140445 138856 134042 138815
18521 138815 150632 152383 154502 156800 164752 179589 183469 185930 182682 176456 179873 192090 200306
18508 200306 202476 207012 211426 228903 245168 261245 277899 309774 360040 407464 444985 466931
18496 466931 474288 484396 511038 532319 536105 524628 518458 538076 576775 638865 686246 714762
18484 714762 750939 819092 907605 1001150 1076779 1118388 1156687 1237784 1349095 1454298 1534749
18473 1534749 1617247 1734029 1885043 2073325 2296415 2557787 2884465 3319154 3932426 4771350
18463 4771350 5907738 7585973 10350400 15250003 23674738 34005362 39924394 40338034
18455D0338034j937026O95241M819719K050702l228088o274307n188788K71790
18447C1547277O095831O364926J200902k535352k560601J735134K738956k395270
18439D2191803p069181r361349p860708n006019l024472j939984j370742j041604
18431E517744p90115n67255m05320l17759k87812k82398k44455j82638j06664
18422B333328r8967j49174j70189j38930q7391p1380q4248p0456p4083o9820o3981
18411A254709o1839m6915m6769n8456o8407o6952m3567j342K8695K2884Q821p209
18399I13653N5J526k5783m9786n3937n4824l9474l5623k5782k3555j9531j6727
18387E70212k4155k7318j2716j3729j9930k2616k5378m1774l5847l5009l3981
$$ plain form
18455 40338034 38401008 39096249 43915968 45966670 42738582 36464275 31275487 31547277
18447 31547277 37643108 44008034 45208936 42673584 40112983 41848117 44587073 42191803
18439 42191803 35122622 25761273 17900565 12894546 9870074 7930090 6559348 5517744
18431 5517744 4727629 4160374 3755054 3437295 3149483 2867085 2622630 2439992 2333328
18422 2333328 2234361 2085187 1914998 1776068 1688677 1617297 1533049 1462593 1388510 1318690 1254709
18411 1254709 1192870 1145955 1099186 1040730 972323 905371 861804 860462 889157 912041 920862 913653
18399 913653 913708 915234 889451 839665 785728 730904 691430 655807 630025 606470 586939 570212
18387 570212 546057 518739 506023 492294 472364 449748 424370 382596 346749 311740 277759
18376B77759j9455j5031k0714k8710k2862j6655n229j0156j5788l877K031N13
18364A21826L830n543q328n669j460L719K827j432o616K07k53K128L51l084k255
18349A00248o001j7747j2888N193N710L240n282p404k697m86O868L182L999N757
18335H1692N674M013L721N166J0325R209n335L03M833L147j231R61K085k331J78
18320A22410P722J0431J1942P643M249O187L597m539j3022k073N455l060n881
18307A51061j1217j3015M92J4470N438p628p868j5374k656M708n608j6203j9346
18294G7254j0243j550l200r475j86j155m981k926P47P79K03J792l414L64l68Q82
18278D4523J076l683j832Q82J0513n848j0681n392N937O243l48K296J3603L174
$$ plain form
18376 277759 258304 243273 222559 193849 170987 154332 149103 138947 123159 119282 121313 121826
18364 121826 125656 120113 111785 106116 104656 108375 111202 109770 103154 103361 103108 105236 105587 102503 100248
18349 100248 94247 76500 63612 68805 74515 77755 72473 65069 62372 61886 68754 71936 75935 81692
18335 81692 87366 91379 95100 100266 110591 119800 114465 114768 119601 122748 121517 122478 124563 122232 122410
18320 122410 130132 140563 152505 160148 164397 170584 174181 169642 156620 154547 160002 156942 151061
18307 151061 139844 126829 127321 141791 147229 139601 131733 116359 113703 118411 112803 96600 77254
18294 77254 67011 65461 62261 52786 52600 51445 46464 43538 44285 45064 45267 47059 43645 44009 43641 44523
18278 44523 45599 41916 40084 40966 51479 45631 34950 29558 35495 41738 41390 43686 57289 60463
18264F0463j0285k912M909o711o456R57j366r272J91L670r21J283N375k69K449
18249D1105J041k339K482J427k715j616k775o312K595Q66L079j861m094J190J498
18234C3571P066Q637N372P949M028q918n153n549k31N153K120J458N739O647m42
18219F7447n627k87O21q427k212l648K873M526N883N692j885N899J7159J4019
18205A02033Q94j2835j2082n724K189Q060o485j3469q556k70R127P012M355K088
18191G6337r063p041P874R861p297Q389J1015J193k50p672m317M475o69J951Q777
18176I3563P901O695M414M629p377r611j1877j5588q641k108o678Q97o762m803
18162D4654N034j422m122O758Q978Q67N293J612k008L074k104m328j42K77m167
$$ plain form
18264 60463 50178 47266 52175 45464 39008 39965 38599 29327 29518 33188 32267 33550 38925 38656 41105
18249 41105 42146 39807 42289 43716 41001 39385 36610 30298 32893 33759 36838 34977 30883 32073 33571
18234 33571 40637 49274 54646 62595 66623 57705 52552 47003 46772 51925 54045 55503 61242 67889 67447
18219 67447 61820 61533 62154 53727 51515 47867 50740 55266 61149 66841 64956 70855 88014 102033
18205 102033 102927 90092 78010 72286 74475 82535 76050 62581 54025 53755 62882 69894 74249 76337
18191 76337 67274 60233 68107 77968 70671 79060 90075 91268 91018 83346 79029 83504 82835 84786 93563
18176 93563 101464 108159 112573 117202 109825 100214 88337 72749 64108 62000 55322 56219 49457 44654
18162 44654 49688 48266 44144 50902 59880 60747 66040 67652 65644 68718 66614 62286 62144 62421 58254
18147E8254l779k394M003M13m172n285L622O383M893P098J0018J3233J2099J5801
18133A20187N329K69K203M900q751q960P26P570J0259K175M911J8436K0929K3695
18119B03878K1371L0020L7249N0277O4485P0641R7901J42246J91689K79887M44941
18108A634585P68829J478450K927981M071900J627546j129777k903416l108369
18100E367729j942954j062712o24656m10997k82062k01171j41760j14403q8048
18091D98966o8082n0799l7536m0809l1265k2576k0501k0364k1130j8244j3802
18080A53858p669q494j303p995J910O179n738j6701j8946j1631o754l603k995
18067G0118j719N51Q66n282n884r304L075M300k022j404p852p762n838Q31J403
$$ plain form
18147 58254 54475 52081 56084 56497 52325 47040 50662 57045 61938 69036 79054 92287 104386 120187
18133 120187 125516 125785 127988 132888 124137 115177 115903 123473 133732 135907 140818 159254 180183 203878
18119 203878 225249 255269 292518 342795 407280 477921 575822 718068 909757 1189644 1634585
18108 1634585 2403414 3881864 6809845 10881745 12509291 11379514 8476098 5367729
18100 5367729 3424775 2362063 1737407 1326410 1044348 843177 701417 587014 498966
18091 498966 430884 380085 342549 301740 270475 247899 227398 207034 185904 167660 153858
18080 153858 146189 137695 136392 128397 130307 136486 130748 114047 95101 83470 76716 73113 70118
18067 70118 68399 68950 69816 64534 58650 49346 52421 56721 54699 53295 45443 37681 31843 32674 34077
18052C4077l140J318J539K84k514J393m248K771K709m738m043m495l014M159N145
18037B7203n852l066N181N926n46j0903l460K457J766l725m686n551L102K771
18023A0617K755J830l623j1926m435P598Q156j17K517J23K83J54Q66K382L228
18008B0408O53N405m908p670J461J212m918k76m93L207l516k889K796P21m604
17993F589j395L519R330k450K608j810P58M533p707j0274j329o5n596M5O0P78
17977b406l281j597k956R415O861m193k749N998K628j870r691N941O366L320j621
17962A0165R84l542k855L24j140k862k767L257K332q90J643J413k446Q38o908
17947b454K866j983k922L893P568j190j1047L937J904K024J233L62k160P24L072
$$ plain form
18052 34077 30937 32255 33794 34078 31564 32957 28709 31480 34189 29451 25408 20913 17899 22058 27203
18037 27203 21351 18285 23466 29392 28846 17943 14483 16940 18706 14981 10295 4744 7846 10617
18023 10617 13372 15202 11579 -347 -4782 2816 10972 10855 13372 13495 13778 13932 14798 17180 20408
18008 20408 21061 26466 21558 13888 15349 16561 11643 11367 10874 14081 10565 7676 10472 11193 6589
17993 6589 5194 8713 18043 15593 18201 16391 17149 21682 13975 3701 2372 2307 -3289 -3244 -3184 -2406
17977 -2406 -5687 -7284 -10240 -825 6036 1843 -906 5092 7720 5850 -3841 2100 8466 11786 10165
17962 10165 11149 7607 4752 5076 3936 1074 -1693 1564 3896 3006 4649 6062 3616 4454 -2454
17947 -2454 412 -1571 -4493 -600 6968 5778 -5269 -1332 572 2596 3829 4191 2031 2755 5827
17932E827j871k079l05j242P76l96o69L002J880L357K315l393J5L418m909k742
17916B984N424O59o606o717k20j036P840N316K110K11m543m579j777J895k37P903
17900H627Q570k226L413p123j887N230l446m56l237P66M153J027O32L394l416
17885A4021k691K179m879M215R511O609M95M51n917p412J020N739j663k186O595
17870B6087L231j453l441n317L970k21K540J030L382N239J334m001o934l108J0046
17855C2384j146o645r152j706K741o280K395O954Q970l860l598O549L53o413J155
17840B2701k916J486N906l709p707p182j290Q252O205n29R620Q638j472k458K598
17825C8143m129j71l387o507m46l606r8J311j070K515K935P582R205J6238K4406
$$ plain form
17932 5827 3956 1877 1572 330 1106 710 41 3043 4923 8280 10595 7202 7217 10635 5726 2984
17916 2984 8408 9067 2461 -4256 -4476 -5512 2328 7644 9754 9965 5422 843 -934 961 724 8627
17900 8627 17197 14971 18384 11261 9374 14604 11158 10702 7465 8231 12384 13411 14043 17437 14021
17885 14021 11330 13509 8630 12845 22356 28965 29460 29911 23994 16582 17602 23341 21678 19492 26087
17870 26087 29318 27865 24424 19107 23077 22856 25396 26426 29808 35047 36381 32380 25446 22338 32384
17855 32384 31238 24593 15441 13735 16476 10196 12591 19545 28515 24655 21057 27606 27959 21546 22701
17840 22701 19785 21271 27177 23468 15761 8579 7289 15541 21746 21217 30837 39475 38003 35545 38143
17825 38143 34014 33843 30456 23949 23503 19897 19799 21110 20040 22555 25490 33072 42277 58515 82921
17810H2921L7660M8718L8980J5222j650Q551J7942J8529k426l5842l5228j1434
17798A81943J9727L6128K0297n330r904R857J3025o250l6233m4905m3470l1637
17786A03248k3650k3846j0765o061j224J716P977N70o474p339n387k987J74m339
17772B1613p004Q515Qr598l965N081P799P535L932O2q384j0425n222l408J06J82
17756F827Q907K266n352j938K758J999L234J2704N20m776p818o753o181L656k083
17741G970M869j07n67K550Q895j219q718j1272j266R006K635K374k419j516k710
17726H505N38K688J289K778K573l989p89K625m152k975P081L978L867l958k538
17711A7521j626K765K115L291l534m556n155L47R426M480n848m070N135L963m044
$$ plain form
17810 82921 120581 169299 208279 223501 221851 230402 248344 266873 264447 228605 193377 181943
17798 181943 201670 237798 258095 252765 242861 252718 265743 259493 223260 178355 134885 103248
17786 103248 79598 55752 44987 38926 37702 39418 47395 47965 41491 34152 28765 25778 25952 21613
17772 21613 14609 23124 23132 13534 9569 14650 22449 29984 33916 33978 25594 15169 9947 6539 6645 6827
17756 6827 15734 18000 12648 10710 13468 15467 18701 31405 31925 27149 19331 12578 6397 10053 7970
17741 7970 12839 12732 12165 14715 23610 22391 13673 2401 1135 10141 12776 15150 12731 11215 8505
17726 8505 9043 11731 13020 15798 18371 14382 13593 16218 12066 9091 16172 20150 24017 20059 17521
17711 17521 15895 18660 20775 24066 20532 15976 10821 11168 20594 25074 19226 15156 20291 24254 20210
17696B0210r53K675p252n67N31p88j296K464M98R53M866K910m326k122k636p505
17680G662K526P82N383L815r19k615j642J641k000o695m054K552N128N459P172
17665B4195K366M974N04p643j161j247j952O354K026L078oj129O432R103l120
17650D2774l102n832O259J2602J5378M255J8532K4743K4564K7314J7850K598m072
17637A83863m950l79p121k1914k2576j4127j5988k2238j7970p100l278q393K130
17624C9959N210o473q569p120k263L230J197O619L557o697q301j935o59l961j03
17609A3691n162N2m793O92Q763J361m649k054K05N543O821M964l305j135O954
17594B7948M341k45n983m645j730l225M319j148Q88K976L323J64m920n575O180
$$ plain form
17696 20210 19257 21932 14680 14113 14644 13856 12560 15024 15522 16475 21341 24251 19925 17803 15167 7662
17680 7662 10188 10970 16353 20168 19249 16634 14992 16633 14633 7938 3884 6436 11564 17023 24195
17665 24195 26561 31535 32039 24396 23235 21988 20036 26390 28416 31494 31488 30359 36791 45894 42774
17650 42774 39672 33840 40099 52701 68079 72334 90866 115609 140173 167487 185337 187935 183863
17637 183863 178913 178534 171413 149499 126923 112796 96808 74570 56600 49500 46222 37829 39959
17624 39959 45169 38696 30127 23007 20744 23974 25171 31790 35347 28650 20349 18414 17755 13794 13691
17609 13691 8529 8581 3788 4480 13243 14604 9955 7901 8106 13649 20470 25434 22129 20994 27948
17594 27948 32289 32044 26061 21416 19686 16461 20780 19632 20520 23496 26819 26983 22063 16488 22668
17579B2668K411M167l90o891j603M062Q899p90r600j014l019p01p75j354N279
17564B1349j87l24L375m149p064L830K953n201J330L710O90k671j86K575J032
17549B1062M023k054N374q944j054j076m048Q470J255n668o076q71k22O149P088
17534B3408K232J469K567n31J002m034k293J620N35K805m687j32R461N825M665
17519D3912R96o372k536k021j1259J809L317K706J966l666j521M37P183M819k27
17504C9543o027m7J654M871N845J2651R896N21K0677L4205M4425M1323K0105Q339
17490B37981R22R314P700j4427l9948m8701l2904k0950p850n982m570m774l680
17477G2131j692O388K0694L0246L8562M0825K3708J1341R056Q364L486q108k2716
$$ plain form
17579 22668 25079 29246 28856 21965 20362 24424 33323 32533 22933 21919 18900 18199 17424 16070 21349
17564 21349 21162 20838 24213 20064 13000 16830 19783 14582 15912 19622 20312 17641 17455 20030 21062
17549 21062 25085 23031 28405 19461 18407 17331 13283 21753 23008 17340 11264 10393 10171 16320 23408
17534 23408 25640 27109 29676 29145 30147 26113 23820 25440 25975 28780 24093 23961 33422 39247 43912
17519 43912 44908 38536 36000 33979 22720 24529 27846 30552 32518 28852 27331 27768 34951 39770 39543
17504 39543 33516 33469 35123 39994 45839 58490 68386 68907 89584 123789 168214 209537 229642 237981
17490 237981 238903 248217 255917 241490 201542 152841 119937 98987 91137 85155 80585 75811 72131
17477 72131 70439 76827 97521 127767 166329 207154 230862 242203 251259 259623 263109 255001 232285
17464B32285m1736m4148l1845j9938j8489j2340j0589J216L902P51m190K636m44
17451E7071l967n651r73m668J633R372J900k820K936M850J2567J6956K6531L0857
17437A46594K8044K9233K7022N002j7597k4617l1896k6712j2626j0061q929J0915
17425A14372K1143M0427K9482O649j1348j6389k9143k7758j3435L165K7030L9001
17413A83196M0371J8750j7717l5163l4684k7617k1507r523n81J6453L0032M4175
17401A86185L7583j56k8371l9462k7904k5286j6601q912J485l693m722M202K264
17388G6612j1982n353L209J845Q504N899K357l24J60M546N957J7080J9323J6044
17374A43877L3529N5879P3198Q9347R1565O3214J5076l4988o0000q2526q5936
$$ plain form
17464 232285 190549 146401 114556 94618 76129 63789 53200 54416 58318 59069 54879 57515 57071
17451 57071 53104 47453 46480 41812 43445 52817 54717 51897 54833 59683 72250 89206 115737 146594
17437 146594 174638 203871 230893 235895 218298 193681 161785 135073 122447 112386 103457 114372
17425 114372 135515 175942 205424 212073 200725 184336 155193 127435 114000 117165 144195 183196
17413 183196 223567 242317 224600 189437 154753 127136 105629 96106 95525 111978 142010 186185
17401 186185 223768 223612 195241 155779 127875 102589 85988 77076 78561 74868 70146 74348 76612
17388 76612 64630 59277 62486 64331 72835 78734 81091 80767 80927 85473 91430 108510 127833 143877
17374 143877 177406 233285 306483 395830 487395 550609 565685 530697 470697 388171 302235
17363C02235o9794m8477l9289k8101k1749j6313r037j0418m967J027l122M780
17351E6775R823Q74p261j0570L403P50J381J102n252k106k418N96K518Q681K021
17336F0317l567j493j0663o010M166M118L555K650L45k063p149m279j359M144
17322D2712P242j71R69o957m495J879J424L68m78M524O859L141j012j006k030
17307E2969R08m889m670k720m035N699N56n76K824L354k195p593k810O974R971
17292E3767L88l344k15O371o67n72l180k996j655m515O19P142L407j677o135R52
17276D7690L688j904k22j251j511j989m738j601K22K67Q14Q31P645R69n31k900
17260D5479o341K403K514l747J1767N198K600K777l718L513K528o298j346o076
$$ plain form
17363 302235 232441 183964 144675 116574 94825 78512 69475 59057 54090 55117 51995 56775
17351 56775 66598 67472 60211 49641 53044 53794 55175 56277 51025 48919 46501 47097 49615 58296 60317
17336 60317 56750 55257 44594 38584 42750 46868 50423 53073 53418 51355 44206 39927 38568 42712
17322 42712 49954 49783 50752 43795 39300 41179 42603 42971 42493 47017 53876 57017 56005 54999 52969
17307 52969 53877 48988 44318 41598 37563 43262 43818 43242 46066 49420 47225 39632 36822 43796 53767
17292 53767 54155 50811 50596 56967 56300 55728 52548 49552 47897 43382 44001 51143 54550 52873 46738 47690
17276 47690 51378 49474 49252 48001 46490 44501 39763 38162 38384 38651 39465 40296 47941 48910 48379 45479
17260 45479 39138 41541 44055 40308 52075 57273 59873 62650 58932 62445 64973 58675 57329 51253
17246E1253m368J3715K091q731l028k076J207j914J898P093M304J324J286M063
17232F8117k512l525j271m501M816K158K460n826J740P954l169n275j258M931
17218F4839J825o20K34R462N757l891K720k487q25J208r615n442L956j496j326
17203F4299M970P524j534m500j314L947J2661K713N628P979M679n402q900r223
17189H3527p8J668J21L616M028l670n110k048N023K993n555k044Q37P040P340
17174I7688Q823M282P49M326m34l943j5055p764N291Q94O700o62K013j224n611
17159I6073l459N17J165n710n050P61P402N071N8o76m736n64P044J784l472j334
17143I4874q957k613O042L422K236J332J792k280M059J0268R587L800J719M648
$$ plain form
17246 51253 46885 60600 62691 53960 50932 48856 50063 48149 50047 57140 61444 62768 64054 68117
17232 68117 65605 62080 60809 56308 61124 63282 65742 59916 61656 69610 66441 61166 59908 64839
17218 64839 66664 66044 66278 75740 81497 77606 80326 77839 77014 78222 68607 63165 67121 65625 64299
17203 64299 69269 76793 75259 70759 69445 73392 86053 88766 94394 102373 107052 101650 92750 83527
17189 83527 83449 85117 85238 88854 92882 89212 84102 82054 87077 90070 84515 82471 83308 90348 97688
17174 97688 106511 110793 111542 115868 115434 111491 96436 88672 93963 94857 101557 100895 102908 101684 96073
17159 96073 92614 93131 94296 88586 83536 84297 91699 96770 96828 96152 91416 90852 97896 99680 96208 94874
17143 94874 85917 83304 89346 92768 95004 96336 98128 95848 99907 110175 119762 123562 125281 129929
17129A29929l740q850k150K562l962l815Q785P705J904N9L318o92o135j204m144
17114A19570p815M116J057P453Q700n531p484J323L495R208l620j746J197j264
17100A28659Q797K534m564J008L554j161n401k90n378K631L781M456l602n648
17086A29376J194j0270j209N829J1224P402K207l584L217K031o845L805N753J2240
17072A62370R615J3106K1972J8266J4324J4212J5145j369r024j4507j8796j7012
17060B08302k0019p499j455J604J957K048m585Q52k688o471L004K3583K1941Q819
17046B29393O220l852J324R445L616j639p858p732O73l139q988K008K971p442
17032B15000j0759n730N073r69N351R087R831J3661J0656J627k650M028M617N564
$$ plain form
17129 129929 126189 117339 115189 117751 113789 109974 118759 126464 128368 128427 131745 131053 124918 123714 119570
17114 119570 111755 115871 116928 124381 133081 127550 120066 121389 124884 134092 130472 128726 129923 128659
17100 128659 137456 139990 135426 136434 139988 138827 133426 133136 127758 130389 134170 138626 135024 129376
17086 129376 130570 120300 119091 124920 136144 143546 145753 142169 145386 147417 140572 144377 150130 162370
17072 162370 171985 185091 207063 225329 239653 253865 269010 267641 258617 244110 225314 208302
17060 208302 188283 180784 179329 180933 182890 184938 180353 181205 178517 172046 175050 198633 220574 229393
17046 229393 235613 231761 233085 242530 246146 244507 236649 228917 229590 226451 217463 219471 222442 215000
17032 215000 204241 198511 203584 202615 207966 217053 226884 240545 251201 252828 250178 254206 258823 264387
17018B64387L317J0920J0356R550K577j8356k1616j2757j1682l337N60o299J4762
17005B42382J8317O801J332J0923J9065J6693M735M734K186O240J3855L3002J5512
16992C95777l954j6611j4788k623l645r904p289K048J4985J4344J7687J0207P872
16979D04106J0396J6029J8071K7595M3650N3458O0842N7264M0884K6521K6259
16968G85075M6141M9787K8809R882M014J0003L6389M2495M5813M8771N1152O8055
16956A226386J09541J55034K03157K68556L46893L96392M44097N53290P96697
16947D500043J226817K000429L400134N440532O240135M143167P23883q99621
16939B6775519K90883J987484Q05069k643448n221380n652244m242453k491519
$$ plain form
17018 264387 267704 278624 288980 298530 301107 282751 261135 248378 236696 233359 233919 227620 242382
17005 242382 260699 267500 268832 279755 298820 315513 320248 324982 327168 333408 347263 380265 395777
16992 395777 391823 375212 360424 357801 354156 344252 336963 339011 353996 368340 386027 396234 404106
16979 404106 414502 430531 448602 476197 519847 573305 634147 691411 732295 758816 785075
16968 785075 831216 881003 909812 919694 923708 933711 970100 1012595 1058408 1107179 1158331 1226386
16956 1226386 1335927 1490961 1694118 1962674 2309567 2705959 3150056 3703346 4500043
16947 4500043 5726860 7727289 11127423 16567955 22808090 26951257 27675140 26775519
16939 26775519 27066402 29053886 29858955 27215507 21994127 16341883 12099430 9607911
16931I607911j307791n74116p4781L47106Q11191J455338K562876M558976Q041766
16922B5428476J1735182J0907432N023833r81205k114283J175005K626300j443479
16914E2357261p477411j0653523j0021255p019919m305250k674262j799549j297797
16906G108295r65380p23838n26672l93314k72752k19628k12154j66201j00579
16897C527777n2319p9899q8555m9174N1589J31320J42399J68851J98710K40688
16887D191387K80377L59690N57126Q73943J361366K165168L691299O713971J1673747
16878C1868074J2930035L842225m653579j0090402r689630n829535k750269o86182
16870A4940737J154113L649231P793566J2163718Q267374j349349p917072j0653000
$$ plain form
16931 9607911 8300120 7726004 7651223 7998329 8809520 10264858 12827734 17386710 25428476
16922 25428476 37163658 48071090 53094923 52113718 49999435 51174440 53800740 52357261
16914 52357261 44879850 34226327 24205072 17185153 12879903 10205641 8406092 7108295
16906 7108295 6142915 5419077 4892405 4499091 4226339 4006711 3794557 3628356 3527777
16897 3527777 3475458 3395559 3307004 3257830 3309419 3440739 3583138 3751989 3950699 4191387
16887 4191387 4471764 4831454 5388580 6262523 7623889 9789057 13480356 20194327 31868074
16878 31868074 44798109 48640334 43986755 33896353 24206723 18377188 15626919 14940737
16870 14940737 16094850 19744081 27537647 39701365 47968739 46619390 38702318 28049318
16862B8049318p863092m237415j689775M37375L007630N872653M571128m73734
16854B7674088m038251n800120m444752k476045j099373q7328R94438K684680
16846A3407337N410407O818816K391937k380898n534039n734311l748653k153528
16838H477068j260714p84561n49589m04713k80381j78456j17027o3091k1961M1611
16828D858186J51403K69995L60428M33415N40572P54984J109243J637927K447559
16819A2563712L828655O209547R847979J3748031J6380303J7269437J4271451
16812I4119115O456130k996121j0814463j5593999j6445315j4448070j1206618
16805B9070659p782561n139401l442713k388432j699881j220662q92915o61487
$$ plain form
16862 28049318 20186226 15948811 14259036 14696411 17704041 23576694 28147822 27674088
16854 27674088 23635837 17835717 13390965 10914920 9815547 9728219 10722657 13407337
16846 13407337 18817744 25636560 28028497 25647599 20113560 14379249 10630596 8477068
16838 8477068 7216354 6431793 5882204 5477491 5197110 5018654 4901627 4838536 4816575 4858186
16828 4858186 5009589 5279584 5640012 6073427 6613999 7368983 8478226 10116153 12563712
16819 12563712 16392367 22601914 32449893 46197924 62578227 79847664 94119115
16812 94119115 100575245 97579124 86764661 71170662 54725347 40277277 29070659
16805 29070659 21288098 16148697 12705984 10317552 8617671 7397009 6504094 5842607
16797E842607n13382m39078m14198m06353l80449l44756k81175k22901j58614
16788B681701j03092q4792j15137j57467j84458j91983j78546j58333j26797j10357
16778A270739q3130o5700n3950m9733n0046m2389l1702l0469l3751k7876k8490
16767G73503l4565l1278l1175l7440m9138n2141m0123k7533j6579q396l306j2741
16755D29088k6427k7513k6705j7195j4265k952J7268J2251q085k0604j0214k352
16743C02295j0345q387r685P1J0094J6845J2318N711j2155k4963l6283l4162k6351
16730A85003k2482j7993m253P12r766k184J978j4006j3083j3836j4358j1124j767
16717F2841R873N409r38l851p227n854J478l47p804j360N980K42j838P955J0445
$$ plain form
16797 5842607 5329225 4890147 4475949 4069596 3689147 3344391 3063216 2840315 2681701
16788 2681701 2578609 2493817 2378680 2221213 2036755 1844772 1666226 1507893 1381096 1270739
16778 1270739 1187609 1121909 1067959 1018226 968180 925791 894089 863620 829869 801993 773503
16767 773503 738938 707660 676485 639045 589907 537766 497643 470110 453531 445135 441829 429088
16755 429088 402661 375148 348443 331248 316983 314031 331299 343550 335465 314861 304647 302295
16743 302295 291950 283563 273878 273949 284043 300888 313206 318917 306762 281799 245516 211354 185003
16730 185003 162521 144528 140275 140987 131221 129037 131015 117009 103926 90090 75732 64608 62841
16717 62841 72714 78123 77185 73334 66107 60253 61731 61384 53580 52220 58200 58442 56604 64559 75004
16702G5004j028k764k1o204m575J602Q480J6041J0269R390J1956K1986J0589J241
16688A51966k584M19K288r31m432j3425j9178j8009k0779j5119j7999m884o083
16675C1250j072N129Q123R669n869k455p23p954o068j348K784Q240k368m288N398
16660C8448L703N80k234o726j5129j4660o189n428o505J351Q821J329n894k515
16646a1048k182N597l16n834m844j893K607o106Q87J0424j993r813L082P685M818
16631h929Q220J108J800K258m704l891K07N978R000K094N051O611k154j0194k137
16616A0318l562r29j190o015j2390J888J733Q812N799M981J101K235j769Q85K982
16601A4879n583L26K983L47J540K227k350q233n002j420L656M159L93k538M217
$$ plain form
16702 75004 73976 71212 71191 64987 60412 62014 70494 86535 96804 106194 118150 140136 150725 151966
16688 151966 149382 149801 152089 151158 146726 133301 114123 96114 75335 60216 42217 37333 31250
16675 31250 30178 35307 43430 53099 47230 44775 44052 36098 30030 28682 31466 39706 37338 33050 38448
16660 38448 42151 42731 40497 33771 18642 3982 -2207 -7635 -14140 -12789 -3968 -2639 -8533 -11048
16646 -11048 -13230 -7633 -7949 -13783 -18627 -20520 -17913 -24019 -23132 -12708 -14701 -24514 -21432 -13747 -8929
16631 -8929 -709 399 2199 4457 -247 -4138 -3931 2047 11047 13141 18192 24803 22649 12455 10318
16616 10318 6756 5827 4637 -1378 -13768 -11880 -10147 -1335 4464 9445 10546 12781 11012 11897 14879
16601 14879 9296 9622 12605 12952 14492 16719 14369 6136 1134 -286 3370 7529 7922 5384 9601
16586I601R933R545Q185L711j4013q170j742R15k035m205O886r98p112L424n380
16571H545K556O322j934M456O900R351o046j725J287K453k463n766l607M043Q699
16556C3071Q650J579k369J807l896o295j0191j494j556M267M729P124l919j2077
16542A9430n651k295q00j029O714P364j238n946J777J226J818K252l532m721l341
16527A2028n92L171O260Q088P11o535j0330m202K056k039L727M132j488N127L192
16512B3306K040j023r221m026M050P48o535m121n207n232n879M700j802j805O594
16497c413N106m236n601l039k518j316N729O651j41K80O488M980j163m123L466
16482G150J4101j223r262K248l839j0833M324o365P17J731L128k247j337J189
$$ plain form
16586 9601 19534 29079 37264 40975 26962 18792 17050 17965 15930 11725 18611 17613 10501 13925 8545
16571 8545 11101 17423 15489 19945 26845 36196 30150 28425 29712 32165 29702 23936 20329 24372 33071
16556 33071 41721 43300 40931 42738 38842 32547 22356 20862 19306 23573 28302 35426 31507 19430
16542 19430 13779 11484 10684 9655 16369 23733 22495 16549 18326 19552 21370 23622 20090 15369 12028
16527 12028 11436 14607 20867 28955 29666 23131 12801 8599 10655 8616 12343 16475 14987 20114 23306
16512 23306 25346 24323 15102 11076 15126 15874 9339 5218 11 -5221 -11100 -6400 -8202 -10007 -3413
16497 -3413 1693 -2543 -8144 -11183 -13701 -15017 -9288 -2637 -2778 -2498 3990 8970 7807 3684 7150
16482 7150 21251 20028 10766 13014 9175 -1658 2666 -3699 -2982 -1251 1877 -370 -1707 -518
16468e18l900m472O479R239p159L201O756j157o381k243l492J318N94j547p2K088
16452a266j829K93L846M506K929N052R07o61p261j679Q262N347p052j950r769
16437c25O674l107p159p171K688J766k191k524N219N475L935J931n06k774K333
16422D264O290L588j0253k929K197O169j917m441p623M468K15o182J052O057L864
16407D819m075q03o831o150J493O784L374J942J639k046J60O299R15j0551N752
16392B721N042j954L007j837J999R128J9262K5503K9883L5336M3790K8372J6750
16379B17002P160j753m420l55k1679m0730m2306l1102k3100j8616p927O78k30
16366C2622N699M11M572K3427M1008M9221M1416J6721p744o417J2690K440j5613
$$ plain form
16468 -518 -4418 -8890 -2411 6828 -331 2870 9626 8469 2088 -155 -3647 -2329 -1735 -3282 -3354 -1266
16452 -1266 -3095 -2802 1044 5550 8479 13531 14438 13777 6516 4837 13099 18446 11394 9444 -325
16437 -325 6349 3242 -3917 -11088 -8400 -6634 -8825 -11349 -6130 -655 3280 5211 4705 1931 4264
16422 4264 10554 14142 3889 960 3157 9326 7409 2968 -4655 -187 28 -6154 -5102 955 4819
16407 4819 744 -59 -6890 -13040 -11547 -4763 -1389 553 2192 146 306 6605 7520 -3031 2721
16392 2721 7763 5809 8816 6979 8978 18106 37368 62871 92754 128090 171880 200252 217002
16379 217002 224162 222409 217989 217634 195955 155225 112919 81817 58717 40101 32174 32852 32622
16366 32622 38321 38732 43304 66731 107739 156960 198376 215097 207353 200936 213626 216066 200453
16353B00453l8609l9857k8841k7008j8122p174j1414q893m981l563o071k0n790
16340A10p172J198J659N235l909j958P182J886m594N125M137l149j330J084P143
16325A2647R730N879K03J0366K7711L1106M3550L6777j002k7027l2845k7564j7388
16312G2143j4433M512J2753K2541L9575M7151K3935r837l3694l7737k5948j3942
16300H7019O437J6128L2185L3164J1922j3407k9594l8138l0540j5939q10j977
16288E6450N631K2619L8448M0977O541q876k7988m1678k6641j8869j8450r57r97
16275B6210j256N76p787k861l300l103k154J2064K090J257k64O161O935p451j117
16260B6000N350Q434J0440J6312K4384L4464N3817P8740Q3513P9719N3619K3840
$$ plain form
16353 200453 161844 121987 93146 66138 48016 40842 29428 20535 15554 11991 5920 5900 110
16340 110 -7062 -5864 -4205 1030 -2879 -4837 2345 4231 -363 4762 8899 5750 4420 5504 12647
16325 12647 22377 28256 28459 38825 66536 97642 141192 177969 176967 149940 117095 89531 72143
16312 72143 57710 62222 74975 97516 137091 184242 208177 198340 164646 126909 100961 87019
16300 87019 93456 109584 141769 174933 186855 173448 143854 105716 75176 59237 58427 56450
16288 56450 62081 84700 123148 164125 170666 161790 133802 92124 65483 46614 28164 27207 26210
16275 26210 24954 25530 17743 14882 11582 8479 6325 18389 20479 21736 21472 27633 34568 27117 26000
16260 26000 31350 39784 50224 66536 90920 125384 179201 257941 341454 421173 474792 498632
16248D98632j9861o1322p4169p5621o8756n6239l8927k7280k4664j5012j522k271
16236C2988n273k405o427j920M828n206q381k137j654k404m222j56M67L363K57
16221A718l900o854k343M746k422n25q09M049N35J081N213N831m126l738n98l229
16205e371q74r31L348L040k041n199j209J168J100n865J951R541J765P778j996
16190F205m578m997M084l601l841k061J817O548l144K149J69l089n960J550m111
16175a2860J089J319n588m664M688R68L454N119l759k67K107J44l580K114L29
16160i387l044K878j280n621J620Q74J622L750o806J284n689K142P04N252l945
16145a5646j106j015l457L597P646N482n348m516j611q41J158M138O838K6l268
$$ plain form
16248 498632 478771 417449 343280 267659 198903 142664 103737 76457 51793 36781 35259 32988
16236 32988 27715 25310 18883 16963 21791 16585 8204 6067 4413 2009 -2213 -2369 -1902 1461 1718
16221 1718 -2182 -9036 -11379 -6633 -9055 -9580 -10389 -6340 -5805 -4724 489 6320 2194 -1544 -2142 -5371
16205 -5371 -6245 -7176 -3828 -788 -2829 -8028 -9237 -8069 -6969 -12834 -10883 -1342 423 8201 6205
16190 6205 1627 -3370 714 -2887 -6728 -8789 -6972 -424 -3568 -1419 -1250 -4339 -10299 -8749 -12860
16175 -12860 -11771 -10452 -16040 -20704 -16016 -15048 -11594 -6475 -10234 -10501 -8394 -8250 -11830 -9716 -9387
16160 -9387 -12431 -9553 -10833 -16454 -14834 -13960 -12338 -8588 -15394 -14110 -19799 -17657 -16953 -11701 -15646
16145 -15646 -16752 -17767 -21224 -17627 -9981 -4499 -9847 -14363 -15974 -16815 -15657 -11519 -4681 -4655 -7923
16130g923l136k870N110k877O06P553o06m961l986k376L80J690r11n479j958P416
16114a4328n127j510O258J611l534M520N992n649m595O177K051L762m665p430
16100a6467r052K244j455j040K262J0233O506n438j709J996Q53k741K160K705
16086h943M371j1964M433l113K225J981J092Q422L114l763n384L017m831j252
16072a0595k901m496N108r70m624K515K702l008k885P948K664l285L072Q741n050
16057e064o186L148L868L037M151k789r805o831l680l887m291L12N251k828K075
16042b3519J290J715J007N645P9n348k772J495M672K758P47n105m717P552R66
16027a3535o851j0827Q083L573K641j583K77M782K079k887k519K044o425m687
$$ plain form
16130 -7923 -11059 -13929 -8819 -11696 -11090 -3537 -4143 -9104 -13090 -15466 -15086 -13396 -14307 -19786 -21744 -14328
16114 -14328 -19455 -20965 -14707 -13096 -16630 -12110 -6118 -11767 -16362 -10185 -8134 -4372 -9037 -16467
16100 -16467 -25519 -23275 -24730 -25770 -23508 -13275 -6769 -12207 -13916 -11920 -11067 -13808 -11648 -8943
16086 -8943 -4572 -16536 -12103 -15216 -12991 -11010 -9918 -1496 1618 -2145 -7529 -4512 -9343 -10595
16072 -10595 -13496 -17992 -12884 -13854 -18478 -15963 -13261 -16269 -19154 -11206 -8542 -11827 -8755 -14 -5064
16057 -5064 -11250 -8102 -4234 -1197 2954 165 -9640 -16471 -20151 -24038 -28329 -28017 -22766 -25594 -23519
16042 -23519 -22229 -20514 -19507 -13862 -13783 -19131 -21903 -20408 -15736 -12978 -12231 -17336 -22053 -14501 -13535
16027 -13535 -20386 -31213 -23130 -19557 -16916 -18499 -18222 -13440 -11361 -14248 -16767 -14723 -21148 -25835
16013b5835q271N035J0543k803o557L044J141J500m260l417M512P207R232N114
15999c815K858q88q422J038K309p434R62M267j979l675J0045M069o479l223q397
15984a8764j481P033M023O101k765n944m341j994m697M17M042M292J429l085L441
15969a2293J510l047p163m610J3063R377N08P85l74K610o310n458L009l163k074
15954a3630j430J432K728k52r13k940m006M824j95k558K312P785L81k523n358
15939a4343j816K222k925J543L90L997M432L957j832m01J001m537j1934j577N275
15924a6548M068J563k199n90R040o647q80R06K37k69k89M044j897M117K035L195
15908a14o046r056k018N056l198j788M627L189l911q280J71K376O033Q481L300
$$ plain form
16013 -25835 -34106 -29071 -18528 -21331 -27888 -24844 -23703 -22203 -26463 -29880 -25368 -18161 -8929 -3815
15999 -3815 -957 -1845 -10267 -9229 -6920 -14354 -13392 -9125 -11104 -14779 -4734 -665 -7144 -10367 -18764
15984 -18764 -20245 -13212 -9189 -3088 -5853 -11797 -16138 -18132 -22829 -22412 -18370 -14078 -12649 -15734 -12293
15969 -12293 -10783 -13830 -20993 -25603 -12540 -3163 -2655 -1870 -2244 366 -5944 -11402 -8393 -11556 -13630
15954 -13630 -15060 -13628 -10900 -11152 -12065 -15005 -19011 -14187 -14382 -16940 -14628 -6843 -6462 -8985 -14343
15939 -14343 -16159 -13937 -16862 -15319 -14929 -10932 -6500 -2543 -4375 -4776 -3775 -8312 -20246 -21823 -16548
15924 -16548 -12480 -10917 -13116 -13706 -4666 -11313 -12193 -11287 -11050 -11319 -11608 -7564 -9461 -5344 -3309 -114
15908 -114 -6160 -15216 -17234 -12178 -15376 -17164 -12537 -9348 -13259 -21539 -21368 -18992 -12959 -4478 -1178
15893a178j0157j1438l025P157M804k247j759k78K809q73m599J1497K016j967
15879i238m222j663K555J398k971n19L895J177J385K391M328l104j085k258N740
15864b191Q07j942J849J298l456n468n344M111J2835J101o883o272n799o98L170
15849a2882L894J166j14j16n557J597M311k262j390p873l576J980N990o197N555
15834a5474N141k936J311M394O17n020m374r02O667P046m698J047N910N881L910
15819H520q361k019K730M99m636L445o222m223k288J588K037l5R74J920o499J635
15803a0935M503N708J965q06Q271k673j3684m064k306L25L952L360K401l586k801
15788a0370l320M550L003j309l853N894K737m281j521J413k301k355K773K989
$$ plain form
15893 -1178 -11335 -22773 -25798 -18641 -13837 -16084 -17843 -18121 -15312 -16185 -20784 -9287 -7271 -9238
15879 -9238 -13460 -15123 -12568 -11170 -14141 -14660 -10765 -9588 -8203 -5812 -1484 -4588 -5673 -7931 -2191
15864 -2191 -1384 -3326 -1477 -179 -3635 -9103 -14447 -10336 2499 3600 -3283 -9555 -15354 -16052 -12882
15849 -12882 -8988 -7822 -7936 -8052 -13609 -12012 -7701 -9963 -11353 -19226 -22802 -20822 -14832 -21029 -15474
15834 -15474 -10333 -13269 -11958 -7564 -6947 -11967 -16341 -17243 -10576 -3530 -8228 -7181 -1271 4610 8520
15819 8520 159 -1860 870 1369 -3267 178 -6044 -10267 -12555 -10967 -8930 -8965 -7991 -6071 -12570 -10935
15803 -10935 -6432 -724 1241 435 8706 6033 -7651 -11715 -14021 -13696 -9744 -6384 -3983 -7569 -10370
15788 -10370 -13690 -9140 -6137 -7446 -11299 -5405 -2668 -6949 -8470 -7057 -9358 -11713 -8940 -5951
15774e951o25j1353Q119Q799m500n901l93p11j930j927l090M027k848k549K522
15759a8311L549P751J810l488n406m121l88k271j709j175R029J2079K565k074
15745b160O73m997p156k309L059m43K883M561L573j967n581j696k492j769j968
15730a7789o74K244Q123P261J903k563o959L825l72m123n403J759j947q7J919
15715a2883L176L380J840m437o208m51N361N518J667j359l819j1358k026M956
15701a6643M940P47M179q28P82L821k21p616j266P431l089l121M245Q964o61l082
15685a418m209l499J424j695K090N124k94M99o237n005L949J351N417j722j381
15670e606p47M360O271L161l531k059J171k639k688k405m377Q50p92k934m721
$$ plain form
15774 -5951 -6576 -17929 -9810 -1011 -5511 -11412 -11805 -12516 -14446 -16373 -19463 -15436 -18284 -20833 -18311
15759 -18311 -14762 -7011 -5201 -8689 -14095 -18216 -18604 -20875 -22584 -23759 -14730 -2651 -86 -2160
15745 -2160 -1487 -6484 -13640 -15949 -12890 -13333 -10450 -5889 -2316 -4283 -9864 -11560 -14052 -15821 -17789
15730 -17789 -18463 -16219 -8096 -835 1068 -1495 -8454 -4629 -5001 -9124 -14527 -12768 -14715 -14802 -12883
15715 -12883 -9707 -6327 -4487 -8924 -15132 -15583 -10222 -4704 -3037 -4396 -8215 -19573 -21599 -16643
15701 -16643 -11703 -10956 -6777 -7605 -6823 -3002 -3223 -10839 -12105 -4674 -7763 -10884 -6639 2325 1664 -1418
15685 -1418 -5627 -9126 -7702 -9397 -7307 -2183 -2477 -1978 -8215 -13220 -9271 -7920 -2503 -4225 -5606
15670 -5606 -6353 -1993 4278 7439 3908 1849 3020 381 -2307 -4712 -9089 -8239 -9031 -11965 -16686
15655a6686l87k219p279R719N402R50N549k938J682Q318L105n06P24M155p326
15640B263l974L745k485j222o057j152N35k614J122n654m665l65Q496N893O05
15625e529m923l100J0013M476q055l424j318M802N005l925J842L284n76p173q61
15610i462P966l528r341r42L585O359K931j509K07p378o350K645K416j866N52
15595a3715N476N14R41J68j743l89J991j095n76m643M230m096M35R964N369l053
15579b22n142m212n08L749O65m603m856k919K170M563J0161L007L692p48N695
15564A0492k017o290k627k529l497L557J034K004l894j590j775l214K228K439
15550e679K448k463J392K292J71p284J249m422J880k470l403j817l034L819K978
$$ plain form
15655 -16686 -17073 -19292 -26571 -16852 -11450 -10500 -4951 -7889 -6207 2111 5216 4710 5434 9589 2263
15640 2263 -1711 2034 -451 -1673 -7730 -8882 -8347 -10961 -9839 -15493 -20158 -20523 -12027 -6134 -5529
15625 -5529 -10452 -13552 -3539 937 -7118 -10542 -11860 -7058 -2053 -5978 -4136 -852 -1428 -8601 -9462
15610 -9462 -1496 -5024 -14365 -15307 -11722 -5363 -2432 -3941 -3734 -11112 -17462 -14817 -12401 -14267 -13715
15595 -13715 -8239 -7725 -6784 -6616 -8359 -8748 -6757 -7852 -8428 -13071 -8841 -12937 -12502 -2538 2831 -222
15579 -222 -5364 -9576 -10084 -6335 -5670 -10273 -15129 -18048 -15878 -11315 -1154 1853 5545 4797 10492
15564 10492 8475 2185 -442 -2971 -6468 -2911 -1877 127 -3767 -5357 -7132 -10346 -8118 -5679
15550 -5679 -3231 -5694 -4302 -2010 -1839 -9123 -7874 -12296 -10416 -12886 -16289 -18106 -21140 -17321 -14343
15535a4343M116N966j581m280L411K71J866J202l770K882K441p339J49p44O033
15520c720M288j230K221k567N86o46r17n003m229j255O765l023n418j559N574
15505a0133M332q20r793M750K828j44M52N750l468n097P388P239k108j1308m59
15490a0591J528M701L568m267o082k560L626j603Q37j580q610k191N375J4359
15476c490n232J327R9M042J422J423l480j896O169J113m445L321L311N379l27
15461H736n583n798n29O997R37k71n904m112M94K645k856L941o277k622Q625j245
15445b822n336J535O659K41J554o980o759L399N037j645r078k176J0534O552m878
15430d163L508Q504q64l498l819K626J194M750n520Q7M06m572q4K290o678k156
$$ plain form
15535 -14343 -10227 -4261 -5842 -10122 -6711 -6440 -4574 -3372 -7142 -4260 -1819 -9158 -9009 -9753 -3720
15520 -3720 568 -662 1559 -1008 -422 -1068 -1985 -6988 -11217 -12472 -5707 -8730 -14148 -15707 -10133
15505 -10133 -5801 -6621 -16414 -11664 -8836 -8980 -8528 -2778 -6246 -11343 -3955 3284 1176 -10132 -10591
15490 -10591 -9063 -4362 -794 -5061 -11143 -13703 -10077 -11680 -10843 -12423 -21033 -23224 -17849 -3490
15476 -3490 -8722 -7395 -7296 -3254 -1832 -409 -3889 -5785 384 1497 -2948 373 3684 9063 8736
15461 8736 3153 -2645 -3174 3823 4760 4489 -1415 -5527 -5033 -2388 -5244 -1303 -7580 -10202 -1577 -2822
15445 -2822 -8158 -6623 36 277 1831 -5149 -11908 -8509 -3472 -5117 -14195 -16371 -5837 715 -4163
15430 -4163 -655 7849 6985 3487 -332 2294 3488 8238 2718 2805 3211 -1361 -1445 845 -5833 -7989
15414g989j811p40J760k103n843L213M587N023o301q863Q647L598l950J782M791
15399d199k404r569K109Q02k028Ok212J719p04P262m536L252L841N056n311n841
15383a2757m017j846M836Q279l32q361m703O510M328O7J183O332O87J45J317m512
15367b844q834J21p19l305K231J1468K842k088p083L54Q752P028l968o282m768
15352g095J335n08k835N385o097j074J808O13O312J340l740k290M714k825L257
15337a700L724J644j981N605k788m804L8p215l458j898N561J099P02O926J741
15322C196K441K241n225J55K095j983K856R9J935L738K93p056l734J568m8J586
15306D157K3j075l087P917J410j24q732j0218j987Q055q72l663L68k994J1018
$$ plain form
15414 -7989 -9800 -10540 -8780 -10883 -16726 -13513 -8926 -3903 -10204 -19067 -10420 -6822 -10772 -8990 -4199
15399 -4199 -6603 -16172 -14063 -13261 -15289 -15283 -17495 -15776 -16480 -9218 -13754 -10502 -6661 -1605 -6916 -12757
15383 -12757 -16774 -18620 -13784 -5505 -5837 -14198 -18901 -12391 -8063 -7996 -6813 -481 206 351 1668 -2844
15367 -2844 -11678 -11557 -12276 -15581 -13350 -1882 960 -1128 -8211 -7857 895 7923 3955 -2327 -7095
15352 -7095 -5760 -6268 -9103 -3718 -9815 -10889 -9081 -8468 -2156 -816 -4556 -6846 -2132 -4957 -1700
15337 -1700 2024 3668 1687 7292 4504 -300 -262 -7477 -10935 -12833 -7272 -6173 -5471 1455 3196
15322 3196 5637 7878 2653 2808 4903 2920 5776 5875 7810 11548 11841 4785 1051 2619 2571 4157
15306 4157 4180 3105 18 7935 9345 9221 489 -9729 -11716 -3661 -4533 -8196 -7828 -10822 196
15291A96M154j073M79o60L721q632n195M702K535O066p64o368O344L514l5j668
15275G316l965p584m726L861L102M301R4m396j01M298N44K399j483J667m103j756
15259e32N284L910n653j013L369N752k284Q88O83j457J609p505n096O840O66n196
15243B65L821o992p409j727p63P898P790n097k046K978K148N00m606o39N453K999
15227D573J1j908o20O20M301J729p972J320l212n166r63k29M185L022L84O653
15211F728j831n957o11P752N186l976L14L413n453Q76Q323P982J785l191o057
15196A5283j905O09l562l883P201N31r78J583k464r480p575L096M304K42k034
15181I68J25j27m091l069N186N366P64M89P011K360j071m253p883j0190k754K389
$$ plain form
15291 196 4350 3277 3756 3096 6817 -1815 -7010 -2308 227 6293 5529 -839 5505 9019 8984 7316
15275 7316 3351 -4233 -8959 -5098 -1996 2305 2399 -1997 -2098 2200 2744 5143 3660 5327 1224 -532
15259 -532 4752 8662 3009 1996 5365 11117 8833 9721 10404 8947 10556 3051 -2045 4795 5461 265
15243 265 4086 -2906 -10315 -12042 -12805 -4907 2883 -2214 -4260 -1282 866 1366 -3240 -3879 1574 4573
15227 4573 4584 2676 2056 2676 6977 8706 734 2054 -1158 -6324 -7287 -7516 -3331 -309 75 6728
15211 6728 4897 -1060 -1671 6081 11267 7291 7605 11018 5565 6441 14764 22746 24531 21340 15283
15196 15283 13378 13987 10425 6542 13743 14274 13296 14879 12415 2935 -4640 -1544 2760 3002 968
15181 968 1093 966 -3125 -6194 -1008 4358 5122 5611 12622 14982 13911 9658 1775 -8415 -11169 -8780
15165h780J417L591P517O635K950o076M800m320q901k775N891K526n009N107L822
15150H395K316K601n751K742N73o89q491l47j596M522L322M693j601n665n481
15135d57j705j001N102J3837N992k915q534k33q419q734p010Q81M505L510L017
15120b164n895k600M69L935o8R007L079j18K394K374m235p324j439k339O238M988
15104F302M777P388p051n753n254Q179K094j269M799n775K885O057M093k458j90
15089A8824N30n095p334M076O292m156l800n359k360k833Q378K146k934J700k488
15074E587j531M068K079l946o020k706j650R847J1403k219k465K608l307n345
15060F403J175L678m469k341j275O129m258k887L287J0573J1876P477o221q234
$$ plain form
15165 -8780 -7363 -3772 3745 10380 13330 7254 12054 7734 -1167 -3942 1949 4475 -534 4573 8395
15150 8395 10711 13312 7561 10303 10876 10187 1696 1349 -247 4275 7597 12290 10689 5024 -457
15135 -457 -2162 -3163 1939 15776 21768 18853 10319 10086 1667 -7067 -14077 -13196 -8691 -5181 -2164
15120 -2164 -8059 -10659 -10190 -6255 -6323 2684 5763 5645 8039 10413 6178 -1146 -2585 -4924 1314 6302
15104 6302 11079 18467 11416 5663 409 8588 10682 9413 14212 8437 11322 17379 21472 19014 18824
15089 18824 19354 14259 6925 11001 17293 13137 9337 3978 1618 -1215 7163 9309 6375 8075 5587
15074 5587 4056 8124 10203 6257 237 -2469 -4119 5728 17131 14912 12447 15055 11748 6403
15060 6403 7578 11256 6787 4446 3171 9300 5042 2155 5442 16015 27891 35368 29147 20913
15046B0913j525o130j0830n216K169N557N581J888L504m585l558O07j169L396
15032A0602K668M731L756K300J787k605k630L372n73m531o174J547n202j0733
15018a685J636J263k839N673K637j575k60l774j217P573O575K443m943n91p60
15003A0156K878J640m43n315r71J76J263k188q018J619M594L165l746M787P51
14988A0348J273o723l181L292K603O084J3p61k759m07J1150M119m423M212N718
14973C0558J7527R694K2632N1539R5134P1836J117n8573q7414o0981l4912q060
14961E0097n775n678l846q309l079n949q090m58K701N245n384M959P349J357l209
14946B1931o441k333j614N34j984l613l584M383O341l487k436k113K637o566K169
$$ plain form
15046 20913 19388 13258 2428 -2788 -619 4938 10519 12407 15911 11326 7768 8375 7206 10602
15032 10602 13270 18001 21757 24057 25844 23239 20609 23981 23408 18877 12703 14250 9048 -1685
15018 -1685 -49 1214 -1625 4048 6685 5110 4850 1076 -141 7432 14007 16450 11507 10916 10156
15003 10156 13034 14674 14231 8916 7945 8121 9384 7196 -822 797 5391 8556 4810 9597 10348
14988 10348 11621 4898 1717 5009 7612 13696 13709 12948 10189 9782 20932 25051 20628 24840 30558
14973 30558 48085 57779 80411 131950 227084 298920 300037 241464 154050 93069 58157 50097
14961 50097 44322 38644 34798 26489 23410 17461 9371 8913 11614 16859 11475 16434 23783 25140 21931
14946 21931 15490 13157 11543 12077 10093 6480 2896 7279 13620 10133 7697 5584 8221 1655 3824
14931C824j669l721l49R83R260K150j167j042P837j250l183j005L448k543J457
14916A3030m118M47m267m480N446M67N56J053J715M760l536J99k819J857J859
14901A2169m801J315k07m52k1k206l375K510o03j456J353L991p703l739L903J601
14885B279L612Q077L415j283k260k145L316N008M94P93L647o775o372o065M359
14870A0100J361j841j273j178K766J042k545l24m537Q10N045k7Q071Q15o211m614
14854G460P913O769o608o502L458J771l165L52M159k86N437n74k477J126k563
14839A6270J225O111P94o769K425J029J911Q98j828L616L399j444k565l574J587
14824B3085l633n118J283J342J687j243l014N842J662j965K065J886L738M206
$$ plain form
14931 3824 2155 -1566 -1915 -932 8328 10478 9311 8269 16106 14856 11673 10668 14116 11573 13030
14916 13030 8912 9359 5092 612 6058 6525 7081 8134 9849 14609 11073 11272 8453 10310 12169
14901 12169 7368 8683 8476 8024 8003 5797 2422 4932 4329 2873 4226 8217 514 -3225 678 2279
14885 2279 5891 13968 17383 16100 13840 11695 15011 20019 20513 21306 24953 18178 11806 5741 10100
14870 10100 11461 9620 8347 7169 9935 10977 8432 8108 3571 4381 9426 9399 17470 18285 12074 7460
14854 7460 15373 22142 15534 9032 12490 14261 11096 11448 15607 15321 20758 20184 17707 18833 16270
14839 16270 17495 23606 24400 17631 20056 21085 22996 23894 22066 25682 29081 27637 25072 21498 23085
14824 23085 19452 14334 15617 16959 18646 17403 14389 20231 21893 19928 21993 23879 27617 31823
14810C1823N414K669n263m785k837o92m982R39m749o722k233Q744J561L107j903
14795B0091L299Q188K46k872j620j275m623j843O32K290j98k522j638N188r57
14780B2386k646n973J473L357o226q043j343R761M651R255p82k125R35o66l552
14765B0462n949r855L544Q913L22J389k428M131k117n551j113N648M560J065k131
14750B0890L299K991R28j481n023M91L337M044l186m511j24k505K4R205j473j0380
14734A6526K082m71R61L733m11l795P11K028n74P613k70q218j519m770k430P511
14718A8707N586J699O64O155o234q060l017m029j025L691O988L252o991l421q412
14703E553N987N933l43N702J023l074o32J0455j088m998j866M477M535n874l377
$$ plain form
14810 31823 37237 39906 34643 29858 27021 26329 21347 22286 17537 10815 8582 17326 18887 21994 20091
14795 20091 23390 31578 31824 28952 27332 26057 21434 19591 20223 22513 22315 19793 18155 23343 22386
14780 22386 19740 13767 15240 18597 12371 4328 2985 12746 17397 26652 25870 23745 24680 24014 20462
14765 20462 14513 4658 8202 17115 17437 18826 16398 20529 18412 12861 11748 17396 21956 23021 20890
14750 20890 24189 27180 28108 26627 21604 22095 25432 29476 26290 21779 21655 19150 19174 28379 26906 16526
14734 16526 18608 18137 19098 22831 22420 18625 19336 21364 20790 28403 28133 19915 18396 13626 11196 18707
14718 18707 24293 25992 26656 32811 26577 18517 15500 11471 10446 14137 21125 24377 17386 13965 5553
14703 5553 11540 17473 17130 22832 23855 20781 20149 30604 29516 24518 22652 27129 31664 25790 22413
14688B2413K717K132l473J742N242M786k543k324M152K130K286j370K784n742
14674C4932m452j144m039Q04J640L546M153q17N944j079m5m597p014m834M340
14659B7338J0243j894n557J23j2894j0032Q164P890N6k639K373k729L214Q638
14645C2294l402J997O85l43J30O314j849n309j015M951M78q56N644l138q798o388
14629B1395j276k217R995K662l887k326O323J317j0490m825l414K014L302L130
14615B1703K805K442m492p012p23M07P429O302J830O073j091r98J12J170j947
14600C4010m565p973k37J871l835l267J1507N416N91L992N327l549j987j881j494
14585C3926R4m788J65L15J275M540J101m753L399N078n41L656Q578k750L540O161
$$ plain form
14688 22413 25130 27262 23789 25531 30773 35559 33016 30692 34844 36974 39260 37890 40674 34932
14674 34932 30480 29336 25297 26101 27741 31287 35440 34623 40567 39488 39443 34846 27832 22998 27338
14659 27338 37581 35687 30130 30253 17359 7327 15491 23381 23437 20798 23171 20442 23656 32294
14645 32294 28892 30889 31574 31231 31361 37675 35826 30517 29502 34453 34931 34075 39719 36581 27783 21395
14629 21395 20119 17902 27897 30559 26672 24346 30669 31986 21496 16671 13257 15271 18573 21703
14615 21703 24508 26950 22458 15446 14723 15130 22559 28861 30691 36764 35673 34675 34787 35957 34010
14600 34010 29445 21472 21235 23106 19271 16004 27511 32927 33518 37510 42837 39288 37301 35420 33926
14585 33926 34020 29232 29397 29712 30987 35527 36628 31875 35274 40352 39811 43467 52045 49295 52835 58996
14569E8996Q240Q969R810J9503K1783J4005J1636P483j0904j8695k2393j8274
14557I0159q805m357o821j1471q108L706L909J42L766O066n402m365J375J178
14543F0972m287J345K644N798m153n361k115m810p309j007N301M757k764q772
14529D0239M178M792p389n374j387N7O080L355p23L017R54M904k458k468J581
14514D9358q387m193N279l549l127P023N500L804j476k938m947j142J009j218
14500D0996r63j43L871K401O112J723o214k133k533n091m4m293j654Q396N492
14485D5923m909K788J505k075M432Q29l947O632q33m056J350m94K805N607N50
14470E6107M013O13m922l466j25L231p369r50N705J368O035r420Q03P445O253
$$ plain form
14569 58996 67236 76205 86015 105518 127301 141306 152942 160425 149521 130826 108433 90159
14557 90159 81354 76997 70176 58705 50597 54303 58212 58354 62120 68186 62784 58419 59794 60972
14543 60972 56685 58030 60674 66472 62319 56958 54843 50033 42724 41717 47018 51775 49011 40239
14529 40239 44417 49209 41820 36446 35059 35116 41196 44551 43828 46845 47799 52703 50245 47777 49358
14514 49358 40971 36778 42057 38508 35381 42404 47904 51708 50232 47294 42347 41205 42214 40996
14500 40996 40033 39890 43761 46162 52274 53997 47783 45650 43117 38026 37982 33689 32035 40431 45923
14485 45923 41014 43802 45307 43232 47664 48493 44546 51178 50345 46289 47639 47145 49950 55557 56107
14470 56107 60120 60733 55811 52345 52220 55451 48082 47132 52837 54205 60240 50820 51623 59068 65321
14455F5321O350L328K941q442k27M296l645j80K967N375m710K280P149O745R672
14440I9220R025M831J652o55j623k495K891K508M987L227N890J1694J4744J4641
14426A70537K831Q667P007J0629K5399K1217J0523J3597K6673K8812J5574K7882
14414C69348K5068K4739K6871J6286J0574J1351J846J173q59n172k825p685j8819
14401D51896j2860q20k065O973K5833K9790M2719N3836P3962P6326P5721P3980
14389H95291O0164J9859j8630n8571q4301r4283q9722q3880o7676n5530m4612
14378C78109l7396k4124k3699k1966j7804j6407j0050q696q787p807l758K36J864
14365A99715M870J962k332K690P846J4194J3629K0702K3286J1673Q325l84p233
$$ plain form
14455 65321 71671 74999 77940 69498 69271 73567 69922 69742 72709 78084 73374 75654 82803 89548 99220
14440 99220 108245 113076 114728 114073 112450 109955 112846 115354 120341 123568 129458 141152 155896 170537
14426 170537 173368 182035 189042 199671 225070 246287 256810 270407 297080 325892 341466 369348
14414 369348 394416 419155 446026 462312 472886 484237 486083 487256 486397 481225 478400 470715 451896
14401 451896 439036 438216 436151 443124 468957 498747 541466 595302 669264 745590 821311 895291
14389 895291 955455 975314 956684 898113 813812 719529 629807 545927 478251 422721 378109
14378 378109 340713 316589 292890 270924 253120 236713 226663 217967 209180 201373 197615 197851 199715
14365 199715 204585 206547 204215 206905 214751 228945 242574 263276 286562 298235 306560 306176 298943
14352B98943l462n003j9387j5671j5198j2027j4344j1600j0750o967p219j0575
14340A66740j5271j1740k02K717j646k616o85k663k397j858P060M31j4208o976
14326A16686p747O71L494l511m91j224n870l44j275j182l333M307l114p9k32p89
14310I5967K233k266k475k783n145l597P03N676J0075k115p76k815o958J482K221
14295H9427q571j199l2m09K5k301O075N78j1000L228J1447O281k674K41j182p392
14279H2542j2313K827J718k201O37K356L742M74M444Q168O146k77o083k838j855
14264H7487l37m278L118J15j734l546o80J20j158J998M064q08K099J144J1596
14249I9200r07J910P305J468j1791m286R102O265j498q407j550m190K823N791
$$ plain form
14352 298943 295481 290478 271091 255420 240222 228195 213851 202251 191501 184534 177315 166740
14340 166740 151469 139729 139527 142244 140598 137982 137297 134634 132237 130379 137439 137870 123662 116686
14326 116686 108939 109610 113104 109593 109102 107878 102008 101664 100389 99207 95874 100181 97067 96988 96756 95967
14310 95967 98200 95934 93459 90676 85531 81934 82637 88313 98388 96273 95497 92682 85724 87206 89427
14295 89427 80856 79657 79625 79216 79241 76940 83015 83593 72593 75821 87268 93549 90875 91116 89934 82542
14279 82542 70229 73056 74774 72573 73210 75566 79308 79782 84226 92394 98540 98263 92180 89342 87487
14264 87487 87150 82872 85990 86105 84371 80825 80145 80265 79107 81105 85169 84361 86460 87604 99200
14249 99200 98293 100203 107508 108976 97185 92899 102001 108266 106768 98361 96811 92621 95444 101235
14235A01235M955N283m704l056J654j28M338N969Q335P991q34N16R262P747K93
14220A48856J966J562j312j050P12L116P164M841l29k621l882L071j217l870m385
14205A52622j1122N40N52K249k45l202J914J845m67l720n306o280O712N029r34
14190A40187o284k226L615J027q672o044l885L065R111N04M321J963p255l370
14176A26057L298Q898O56m78J105J684L447k661L129r85j048j273K226k863j860
14161A39332L370m047k251J071J665j016N05O144M425P76j521m314J325j072K485
14146A46877M979O925O378K393p349l447N232O038J244M580j557N088p05n626
14132A71050L339O84N741O987J599L742j599J0201p01k755O948L85L866L364O90
$$ plain form
14235 101235 106190 111473 106769 103713 105367 105239 109577 115546 123881 131872 131038 131554 140816 148563 148856
14220 148856 150822 152384 151072 150022 150734 153850 161014 165855 165526 162905 159023 162094 160877 157007 152622
14205 152622 141500 142040 142592 144841 144596 141394 143308 145153 144686 140966 135660 129380 136092 141121 140187
14190 140187 133903 131677 135292 136319 127647 121603 117718 120783 129894 130398 134719 136682 129427 126057
14176 126057 129355 138253 138909 138431 139536 141220 144667 142006 145135 144150 143102 141829 144055 141192 139332
14161 139332 142702 138655 136404 137475 139140 138124 138629 144773 149198 149974 148453 144139 145464 144392 146877
14146 146877 151856 158781 165159 167552 160203 156756 161988 168026 169270 173850 172293 177381 176676 171050
14132 171050 174389 175073 180814 187801 189400 193142 191543 201744 201043 198288 205236 205621 209487 212851 213541
14117B13541j227l853K63M639K464K221M067L385N059M665N891J2688J0067J0876
14103B74746J9646K2592J8845J1560J6314O184k275l545m7l126k03l819p44N29
14089C56657K273N646R544J1466J4606J2038N023J4698J2511j55K609K245p090
14076D42071o136k732k421k058m169m97J828J668m815j305k739M860Q6K940o58
14061D25923K864N834N405J0840P243Q934N297M849Q807O902J5028J5366J7037
14048E40329N585Q374J4071J6319O712J3519K4894K2890J6305J7364J4128J8323
14036G18813J2212J7158K5084K4460K6101K6536J8859K0869K9318K5416L1329
14025I76155L5463L8780M0411M3291M2209M5002N2197M9687N2713O0044O2150
$$ plain form
14117 213541 212314 208461 208724 213363 215827 218048 222115 225500 230559 235224 241115 253803 263870 274746
14103 274746 294392 316984 335829 347389 363703 369887 367612 364067 364020 360894 360691 356872 356128 356657
14089 356657 358930 364576 374120 385586 400192 412230 417253 431951 444462 444307 446916 449161 442071
14076 442071 435935 433203 430782 428724 424555 424058 425886 427554 422739 421434 418695 423555 423641 426581 425923
14061 425923 428787 434621 440026 450866 458109 467043 472340 477189 485996 492898 507926 523292 540329
14048 540329 545914 554288 568359 584678 591390 604909 629803 652693 668998 686362 700490 718813
14036 718813 731025 748183 773267 797727 823828 850364 869223 890092 919410 944826 976155
14025 976155 1011618 1050398 1090809 1134100 1176309 1221311 1273508 1323195 1375908 1435952 1498102
14014A498102O4428P5365Q0553Q3886Q9184Q9327J05138J14864J16573J25131
14004B442551J36333J37438J58845J78565J90179J97411K11411K41169K61291
13995D155193K83976L02140L40640L71627M02050M41020M80274N32844N79879
13986G889643O45865P14537P86010Q69098R61973J054705J185603J322423J463748
13977A6893605J626445J817809K023730K248672K490837K754573L034457L318561
13969C6208689L606588L876499M098089M240690M267147M131149L820150L299636
13961F7548637K576303J672033O43078m22385j443761k351881l092597l627201
13953F1502226l960499m116482m119489l996584l797156l558476l292590l026922
$$ plain form
14014 1498102 1562530 1637895 1718448 1802334 1891518 1980845 2085983 2200847 2317420 2442551
14004 2442551 2578884 2716322 2875167 3053732 3243911 3441322 3652733 3893902 4155193
13995 4155193 4439169 4741309 5081949 5453576 5855626 6296646 6776920 7309764 7889643
13986 7889643 8535508 9250045 10036055 10905153 11867126 12921831 14107434 15429857 16893605
13977 16893605 18520050 20337859 22361589 24610261 27101098 29855671 32890128 36208689
13969 36208689 39815277 43691776 47789865 52030555 56297702 60428851 64249001 67548637
13961 67548637 70124940 71796973 72440051 72017666 70573905 68222024 65129427 61502226
13953 61502226 57541727 53425245 49305756 45309172 41512016 37953540 34660950 31634028
13945C1634028k758997k509640k273917k059039j862678j676854j517980j379435
13937A5595488j242899j131091j022003r29951q43479p58459o89226o34705n74935
13928G768740n21192m75526m38632m13048l77719l37687l15402k94751k67603
13919D327180k52230k34738k21284k08264j87457j68871j63184j60591j50967
13910B579594j37321j28077j19313j09607r9422r4413r7336r8242q5359p8650
13900A531854p3360p3051p0640o5025n4748n3902m9124m9202n0979m6468m3049
13889I02306m8148l7754k3772l7391l8592l0608l4460k4751k2537k9853l1588
13878E42852k2665k1527k4574j9911k3653k7486j7347q410j2942r165j0922j2553
$$ plain form
13945 31634028 28875031 26365391 24091474 22032435 20169757 18492903 16974923 15595488
13937 15595488 14352589 13221498 12199495 11269544 10426065 9667606 8978380 8343675 7768740
13928 7768740 7247548 6772022 6333390 5920342 5542623 5204936 4889534 4594783 4327180
13919 4327180 4074950 3840212 3618928 3410664 3223207 3054336 2891152 2730561 2579594
13910 2579594 2442273 2314196 2194883 2085276 1985854 1891441 1794105 1695863 1610504 1531854
13900 1531854 1458494 1385443 1314803 1249778 1195030 1141128 1092004 1042802 991823 945355 902306
13889 902306 854158 816404 792632 755241 716649 686041 651581 626830 604293 574440 542852
13878 542852 520187 498660 474086 454175 430522 403036 385689 377279 364337 355172 344250 331697
13866C31697r142j4912j6448j7748j1291n932j2429j2053j2116j0752j620K418
13854B09672N73o375n410n254p480r019m805o494k720k88m225r304N9J067j2859
13839A37138n288P093M630L545m075j246j691j191j24j0973n013L348m14j303
13825A24436P937o741r370q442j0605j101M042K729m291j253j109m963p987k748
13811H0534M33p60o628q232k97J983m812o299m15l563p456k112K159k649n077
13796C6809n239l006q378m505J02L589M051L59l381q117l738K548l945l130K713
13781F732N399N778m657j769n465O310P613l731m577n539O19N862M544j004m233
13766A1882m91k277R33l250r101Q83M172K327j370J0812N281q887q221j985J955
$$ plain form
13866 331697 322555 307643 291195 273447 262156 256224 243795 231742 219626 208874 207254 209672
13854 209672 210245 203870 198460 193206 185726 176707 171902 165408 162688 162400 158175 148871 148930 149997 137138
13839 137138 131850 138943 143573 147118 143043 141797 140106 138915 138791 127818 122805 126153 125739 124436
13825 124436 132373 125632 116262 107820 97215 96114 100156 102885 98594 97341 96232 91269 83282 80534
13811 80534 80967 80207 73579 65347 65050 67033 62221 55922 55507 51944 44488 42376 44535 41886 36809
13796 36809 31570 28564 20186 15681 15783 19372 23423 23782 20401 12284 8546 11094 7149 4019 6732
13781 6732 12131 17909 13252 11483 6018 12328 19941 16210 11633 6094 6713 12575 17119 16115 11882
13766 11882 11391 9114 10047 6797 -2304 -1421 2751 5078 3708 14520 19801 10914 2693 708 2663
13751B663K847j822l445Q36J165m037m790P182L418K13m001o021O910j624J299
13736G93J0642L767o400r736J358J543l16M82J90k148K164R70k662R5L19J348
13720B409n336n706k916q70J759N70K156N167m59m75J744K365L167j82o173M221
13704A441O953M261l445j2837l668M084P418R63k989j91K691l100l405k385R727
13689E518R616r73l821r029n06O218j268M220r46k202l633n19J742O749J304j481
13673A0989j090m049j06l638l987O862N097J531Q868K157n426K105j727p751O2
13658I897M011m836m856k162k196K323l955M684L135K015j441k280k054J282K99
13643C866J267J081P162J894J992k304P60Q26l630L719k085P621N054q775r74
$$ plain form
13751 2663 5510 3688 243 1079 2244 -1793 -6583 599 4017 4230 229 -5792 1118 -506 793
13736 793 11435 15202 8802 -934 424 1967 1651 2133 2323 175 2339 3309 647 742 1061 2409
13720 2409 -2927 -8633 -11549 -12419 -10660 -10090 -7934 -2767 -3226 -3701 -1957 408 3575 3393 -2780 1441
13704 1441 8394 12655 9210 -3627 -7295 -3211 4207 5170 2181 1990 4681 1581 -1824 -4209 5518
13689 5518 15134 14161 10340 1311 805 7023 5755 9975 9029 6827 3194 2675 4417 11166 12470 10989
13673 10989 9899 5850 5744 2106 -1881 4981 10078 11609 20477 22634 17208 19313 17586 9835 9897
13658 9897 13908 9072 4216 2054 -142 2181 -1774 2910 6045 8060 6619 4339 2285 3567 3866
13643 3866 5133 6214 13376 15270 17262 14958 15718 16544 12914 16633 14548 22169 27223 18448 17474
13628A7474P06N92k205l117L951N46l408r571p68M154M23O65P475N480k397K637
13612B2637J015k459L089l728Q18K307p537J453Q26q111l308M42p60K604K626
13597A1914N99N093J395r19j260l749k574K949K425M394k250K429R35m620m010
13582A2751j011M23k92L099j522p932n936J051M908N052N481J280j981m751k062
13567H558n372Q757M564M152L104P071k535o880O99K258M041K31L115L091L084
13552C7938j655m505K241L754l062P44K218q609k501L716M452J169j855M266J260
13537C9571J549L969R19L402m75j185R942M436P688K280J0111K218O281P463L756
13522A01925N272J0395J4985J1728J1782J3526J7501K2414J4395J5027K6450K1165
$$ plain form
13628 17474 18180 18772 16567 13450 17401 17947 14539 4968 4200 8354 8777 9442 16917 22397 20000 22637
13612 22637 23652 21193 24282 20554 21372 23679 16142 17595 18421 10310 7002 7444 6684 9288 11914
13597 11914 12513 17606 19001 18082 16822 13073 10499 13448 15873 20267 18017 20446 21381 16761 12751
13582 12751 11740 12163 11871 14970 13448 5516 -420 631 5539 10591 16072 17352 15371 10620 8558
13567 8558 3186 11943 16507 20659 23763 30834 28299 21419 22118 24376 28417 28648 31763 34854 37938
13552 37938 36283 31778 34019 37773 34711 35455 37673 29064 26563 30279 34731 35900 34045 38311 39571
13537 39571 41120 45089 46008 49410 48935 47750 57692 62128 69816 72096 82207 84425 90706 98169 101925
13522 101925 107197 117592 132577 144305 156087 169613 187114 209528 223923 238950 265400 286565
13510B86565K3624K0736K2877J8922K1607Q369p03M558J3903q848j5974j2978
13498C82658j1294j3898l1098k9550k3784j9438j7046j5086j1083j8123k0345
13487A71913j4552j2537r856j5350p117J134k582j3208p203j280m156q966n371
13474G0869k577r862J562N689p314p75R24L762J821q525j0408j349M60r682M006
13459C8601O514O007j1375j0101N974P041o25L94J730N619m791J336k517j945
13445D1862J180J202m150L34m049l801N967K399l939k145O232R214K829k762n752
13430D4621l019l060l615N481r44K676N64j0034M267o030r61O890L066j985m52
13415C7465P452j593J590J0328j456L47N357j06k716k403j1273o285N509K844
$$ plain form
13510 286565 310189 330925 353802 372724 394331 402700 401997 406555 420458 411610 395636 382658
13498 382658 371364 357466 326368 296818 273034 253596 236550 221464 210381 192258 171913
13487 171913 157361 144824 134968 119618 112501 113635 111053 97845 90642 89362 85206 76240 70869
13474 70869 68292 58430 59992 65681 58367 57592 58516 62278 64099 55574 45166 43817 44277 34595 38601
13459 38601 45115 51122 39747 29646 35620 42661 42036 42430 44160 49779 44988 46324 43807 41862
13445 41862 43042 44244 40094 40428 36379 32578 38545 40944 37005 34860 41092 50306 53135 50373 44621
13430 44621 41602 38542 34927 40408 39464 42140 42704 32670 36937 30907 29946 36836 39902 37917 37465
13415 37465 44917 43324 44914 55242 53786 54133 59490 59384 56668 54265 42992 36707 42216 45060
13401D5060J052o169n154j272O350L684m33L991M103k393m872P910N377j775k298
13386E3161j547p93k77l85P94o61k72m224P96m36L730O110N138O363m232o721
13370E6544J849M398j199k123O042M466K086N439n81q457k943J347k733R788K004
13355G5927l528m881p452m526J361L013M870M210m74Q353J1423J2118J3597J8893
13341A32904K6251L5220M2373O0023Q0918J33284K27130L59762M65544L79109
13331A942518P6473k37126m06313l96177k86710j74777j14770p3235n0561m9562
13321B29760l1455j9662k3809j3146j1712o023j1920q098m933k532j321j290O760
13308A00619o52j807p526m837j867m794n452n573q772L813P662p339J657M273
$$ plain form
13401 45060 46112 39943 34789 33517 39867 43551 43118 47109 51212 48819 43947 51857 57234 55459 53161
13386 53161 51614 50821 50544 50159 50953 50292 50020 45796 46592 46156 49886 55996 61134 67497 63265 56544
13370 56544 58393 62791 61592 59469 65511 69977 72063 77502 76921 68464 65521 66868 64135 73923 75927
13355 75927 72399 67518 60066 55540 56901 59914 64784 68994 68520 76873 88296 100414 114011 132904
13341 132904 159155 194375 236748 296771 377689 510973 738103 1097865 1563409 1942518
13331 1942518 2018991 1781865 1375552 979375 692665 517888 403118 329883 279322 229760
13321 229760 198305 178643 154834 141688 129976 123953 112033 103935 99002 96470 95149 93859 100619
13308 100619 99967 98160 90634 85797 83930 79136 73684 68111 59339 63152 70814 63475 65132 69405
13294F9405K305K637K342L936o502k390l8K51O2j162j136J1679J2643m471m782
13279H4779j252K834N830k680P168K324N567N970N227J400o49m114K204j698j4239
13264I8671q194j0277l422j332M249K279j884O865N898q760o820J874J884J941
13250H2972n436J119K079n03p027J090R976P420q272o552r12J429K025O404N862
13235I1674l005m913l384P96N363P027J780L325K980k111l458p222j0443k451
13221G5958k994n381K691J331N753N100L246L788M012l748L044l715Q819Q190
13207A06094m245j108P89k143q6j33J6806P547P570J2583K685j2508j1762n368
13193A16721m554l870J72l759l806J159J247n074l437K445R418M311p096J260
$$ plain form
13294 69405 71710 74347 76689 80625 74123 71733 71695 71946 72008 70846 69710 81389 94032 89561 84779
13279 84779 83527 86361 92191 89511 96679 99003 104570 110540 115767 117167 116518 112404 114608 112910 98671
13264 98671 90477 80200 76778 75446 79695 81974 80090 86955 92853 84093 77273 79147 81031 82972
13250 82972 77536 78655 80734 80231 73204 74294 84270 91690 83418 76866 75954 77383 79408 85812 91674
13235 91674 88669 83756 80372 81168 86531 93558 95338 98663 101643 99532 96074 88852 78409 75958
13221 75958 72964 67583 70274 71605 77358 82458 85704 89492 93504 89756 92800 89085 97904 106094
13207 106094 101849 100741 101530 99387 99301 99168 115974 123521 131091 143674 146359 133851 122089 116721
13193 116721 112167 108297 108469 104710 100904 102063 103310 98236 94799 97244 106662 110973 103877 105137
13179A05137J007m47k243l384L072p238l572P380N021m92k717Q102J5555N863
13165A31044R47n219J147J255l943j1906L026J2436O464L511P685J1290J2568
13152A70305Q677P116P449J7758K6543M1441N0088M1629J7302j0435l6169l9590
13140C02114l4699k7481k7260m173m045J355p619n720M031k036l391n558k066
13127A83452p579n017L910J010j0197p089n392N460L95P1K808N960O186K040q5
13112A75933K186O134J568L525m45q84j315j7n347m292p030p657M646J0696J0801
13097A88502M582J594P084p03r382n169n779j974j2866p659j1284o863P19N558
13083A46360J1184J3980K2504J9662J0156l875p453q918n998o3O002Q304J5962
$$ plain form
13179 105137 106144 105697 103454 100070 103142 95904 92332 99712 104733 104241 101524 109626 125181 131044
13165 131044 131991 126772 127919 129174 125231 113325 116351 128787 135251 138762 146447 157737 170305
13152 170305 178982 186098 193547 211305 237848 279289 329377 371006 388308 377873 341704 302114
13140 302114 267415 239934 212674 208501 204456 205811 198192 192472 196503 194467 191076 185518 183452
13127 183452 175873 170856 174766 175776 165579 158490 153098 158558 158953 159024 161832 167792 173978 176018 175933
13112 175933 178119 184253 185821 189346 188901 188017 186702 186685 181338 177046 170016 162359 167005 177701 188502
13097 188502 193084 194678 201762 201059 191677 186508 180729 178755 165889 158230 146946 140083 140802 146360
13083 146360 157544 171524 194028 213690 223846 219971 212518 203600 197602 197539 203541 211845 227807
13070B27807J3624L631l926k293L092J0072J7482k395o987o28p99m677m674j975
13056B47354Q626J1278Q359J0525K2733J6783P933O124j1334l1815l8047k9970
13044B28549j9836j3002N68J0217P130J0200K082Q86L450j0249l368M14J704N869
13030B24614P011N000J266l181l167K353k598j4577q473K1423O2498J16221Q3276
13017D91666J8082k8843m8695l1386j5631o047j3619m450N855M032J729J0372
13005C83065J6696R085Q735R061L182N09m745k666j684P427K06k882L471L798
12991D33258J4139J6027J1931N885M606J2236P115L365L257L506r096k675J2029
12978E15583J5594K0330K3895M941n673j4114k600J2728J8586J5675J5960J3313
$$ plain form
13070 227807 241431 245062 241136 238843 241935 252007 269489 267094 260107 259479 258680 254003 249329 247354
13056 247354 255980 267258 275617 286142 308875 325658 333591 339715 328381 296566 258519 228549
13044 228549 208713 195711 196279 206496 213626 223826 225908 226794 230244 219995 216627 217041 218745 224614
13030 224614 231625 236625 237891 234710 231543 233896 231298 216721 208248 229671 292169 408390 491666
13017 491666 509748 480905 432210 400824 385193 379146 365527 361077 366932 370964 372693 383065
13005 383065 399761 408846 417581 426642 429824 430333 425588 422922 421238 428665 428871 425989 429460 433258
12991 433258 447397 463424 475355 481240 485846 498082 505197 508562 511819 515325 506229 503554 515583
12978 515583 531177 551507 575402 580343 574670 560556 557956 570684 589270 604945 620905 634218
12966F34218P148J2931J6715J3401K519p320q769R58O306K5474M4194L4685K5455
12953H07915J5258Q135P031J2743J1398J2149J7477L2904M6064L5079L5481M0025
12941A081659L8420K1913L403L31J4496L6809M1719K8663J8772L0777N3935Q2084
12929A452981J12304J23585J12081J03317J09909J15630J15212J26610J59700
12920B531329J90847K32241K73775K71941K63035K72739L25811L76561M11995
12911E150274M59041N40649O78773Q49780J018689J180529J396713J696936K098677
12902A5070061K662258L440743M602035O289818Q540064J1647447J6967717K7140474
12894I6360617M5959705P2899261Q8011829N9846951P95579n0754135p6717102
$$ plain form
12966 634218 641366 654297 671012 684413 686932 679612 670843 671801 678107 703581 747775 782460 807915
12953 807915 823173 831308 838339 851082 862480 874629 892106 925010 971074 1006153 1041634 1081659
12941 1081659 1120079 1141992 1145395 1145726 1160222 1197031 1238750 1267413 1286185 1316962 1370897 1452981
12929 1452981 1565285 1688870 1800951 1904268 2014177 2129807 2245019 2371629 2531329
12920 2531329 2722176 2954417 3228192 3500133 3763168 4035907 4361718 4738279 5150274
12911 5150274 5609315 6149964 6828737 7678517 8697206 9877735 11274448 12971384 15070061
12902 15070061 17732319 21173062 25775097 32064915 40604979 52252426 69220143 96360617
12894 96360617 142320322 215219583 303231412 363078363 363873942 313119807 236402705
12887B36402705p0704470m9448706l1054418j9959373j3891946j0292939p828606
12880C3222247n942253m508564l472880k730540k146100j716828j390741j131121
12872A0183220r58729q70684p91389o84884n89533n12454m63543m13008l55194
12863D543802k90460k43715k24866k22911k19673k11031j98429j78877j34867
12854B618973r7616q8148q5768q6593j07421j26920j24871j09383j02319q7237
12844A602697q7167r2888r1886r4633q7186o9036n5688m1813l7642l5344m8596
12833H60818n2809m5921l9694m7360m6159m1371j7853O618N107J696r581k5266
12821E48225m8427o4264n9784m4649k5398j5745p099J177j1216j6746j1766q932
$$ plain form
12887 236402705 165698235 116249529 85195111 65235738 51343792 41050853 33222247
12880 33222247 27279994 22771430 19298550 16568010 14421910 12705082 11314341 10183220
12872 10183220 9224491 8353807 7562418 6877534 6288001 5775547 5312004 4898996 4543802
12863 4543802 4253342 4009627 3784761 3561850 3342177 3131146 2932717 2753840 2618973
12854 2618973 2521357 2433209 2347441 2260848 2153427 2026507 1901636 1792253 1689934 1602697
12844 1602697 1515530 1422642 1330756 1236123 1148937 1079901 1024213 982400 944758 909414 860818
12833 860818 808009 762088 722394 675034 628875 587504 569651 576269 581376 583072 573491 548225
12821 548225 499798 435534 375750 331101 305703 289958 282859 284036 272820 256074 244308 235376
12809B35376n855j3401j6326L783J7016J7303O995j1393k9795l1891m4543k7678
12797I9591j1950o03O820J0914nN875J313N147K9045K8561L8889O9900J13043
12784C96540J28564O8650j7616q1278r4835p0723o3840o0017n0323l1500k9083
12773I4539j1748J947M597N437L163j1467j8757k5472M061M8189P6686N9478K051
12760B32704l3544l5831k7598k0136o527k732l751l392k200l470L698O264l94
12747A03091r026j6811j274m215L220N103R771R673N042k897j1983l4863l4296
12734B0535l7719k9604m671Q965N720J2554J1887M030o444M574M250l039o158
12721a5120n854k083l239j503L147J725m153K269O642N26Q188K968l775J436M567
$$ plain form
12809 235376 229521 216120 199794 203577 220593 237896 244891 233498 203703 171812 127269 99591
12797 99591 87641 87038 93858 104772 104767 110642 111955 117102 146147 174708 213597 283497 396540
12784 396540 525104 593754 576138 494860 400025 329302 265462 205445 155122 123622 94539
12773 94539 82791 84738 89335 94772 97935 86468 67711 42239 46300 94489 171175 230653 232704
12760 232704 199160 163329 135731 115595 109068 106336 102585 99193 96993 93523 97221 103485 103091
12747 103091 94065 77254 75980 71765 74985 80088 89859 99532 104574 101677 89694 54831 20535
12734 20535 -17184 -46788 -51459 -42494 -36774 -24220 -12333 -8303 -14747 -10173 -5923 -8962 -15120
12721 -15120 -20974 -23057 -26296 -27799 -24652 -22927 -27080 -24811 -18169 -17643 -9455 -6487 -10262 -8826 -4259
12706d259O62m617j0401j4464K2J7046K3626K3371R772j508o136m512j066j232
12692B6304N70q309j4528j4015q770l860K091M016N093K934k298M600P561n227
12678c838q692q199O473O950m750L15M843P66p921p842j831N044J118j424N149
12663a3839K156N366N657m450Q93N19R21p596j0405J70l445m197N049p104j0040
12648d0345k276L976J427J3411J0166P435P526P241J528l273p170p208m449n04
12634a2515O430J536K041Q785k184l340O36n084r325l571L143O886Q142m03P724
12619H901L193P740O23o930N505M365O720R948J8831K0165L892p363j9648j2609
12605D3333o599n121o700j4510j043O552l756k519j149N967J0846O4K76O204o367
$$ plain form
12706 -4259 -3597 -8214 -18615 -33079 -33057 -16011 7615 30986 40758 39250 33114 28602 27536 26304
12692 26304 26874 18565 4037 -9978 -18748 -22608 -20517 -16501 -11408 -8474 -10772 -6172 1389 -3838
12678 -3838 -12530 -20729 -14256 -7306 -12056 -11741 -6898 -6132 -14053 -21895 -23726 -18682 -17564 -18988 -13839
12663 -13839 -11683 -6317 -660 -5110 -4217 -3698 -2777 -10373 -20778 -20608 -24053 -28250 -23201 -30305 -40345
12648 -40345 -42621 -38645 -37218 -23807 -13641 -6206 1320 8561 10089 6816 -354 -7562 -12011 -12515
12634 -12515 -6085 -4549 -2508 6277 4093 753 1389 -3695 -13020 -16591 -13448 -6562 1580 1177 8901
12619 8901 12094 19834 20457 13527 19032 23397 30117 40065 58896 79061 82953 75590 55942 43333
12605 43333 36734 31613 24913 10403 9360 15912 12156 9637 8488 14455 25301 25365 25641 31845 25478
12590B5478r566m379r201q532j0703j1662k854n530M479Q145J3909J5985k806
12577B763o229j0414l176K197R629R953N678M512l303L287R300m202q304J074
12563A2765J308L089P026J157m276j251p302j0204n586n414k536M584J2018O905
12549A2283R18k374j343k611N7p20k603P34P029Q38p019k863M817N86N746P475
12533B0950P296J0629N589l752p374n316p37L137n669m917K682l392j8617j0505
12519i996J679N455j596n847j970k32j510n333n689q219K119M540L078M292J934
12504a7295O25k974j471J790J369R265J0646l638N766p41k127j348J532P047j049
12489G397P583J797M31l479j984j343k126J0069Q409n699o570l365k307p544J195
$$ plain form
12590 25478 15912 11533 2332 -6200 -16903 -28565 -31419 -36949 -32470 -24325 -10416 5569 2763
12577 2763 -3466 -13880 -17056 -14859 -5230 4723 10401 14913 11610 14897 24197 19995 11691 12765
12563 12765 14073 17162 24188 25345 21069 19818 12516 2312 -3274 -8688 -11224 -6640 5378 12283
12549 12283 13201 10827 9484 6873 6930 6210 3607 4341 11370 12208 5189 2326 7143 7729 13475 20950
12533 20950 28246 38875 44464 40712 33338 28022 27285 30422 24753 19836 22518 19126 509 -9996
12519 -9996 -8317 -2862 -4458 -10305 -12275 -12507 -14017 -19350 -25039 -33258 -31139 -26599 -23521 -19229 -17295
12504 -17295 -16670 -19644 -21115 -19325 -17956 -8691 1955 -1683 4083 3342 1215 -133 1399 8446 7397
12489 7397 14980 16777 17208 13729 11745 10402 8276 18345 26754 21055 14485 11120 8813 1269 2464
12474B464M072k24p720Q099J0862P095K352O810N526l478l828J42M26K174M168
12459C8940Q870J7213J0041R850J2693J5104K4373K2587L3748M5708N6959J03069
12447C99155J72104K87028M22358M60797K55022q2984l41007m20730l41839k35121
12437E74783j35068r0085p1409m7491l1895k9580k8361j6109j5679j8289j1715
12426G9102j7051j0750n949m811k469O32n012j481q057o089n636L85l87J934Q26
12411A5187O020l35l561k792o025L476N557K94n751K920O545n024k77l146m19
12396A2669J416J407k384k540k472Q625M29l269j022K509J436L592j456L184M183
12381B6307M378J868j937n600q109L415N684o354l675p932Q857L479n74j07K482
$$ plain form
12474 2464 6536 6312 -1408 6691 17553 24648 27000 33810 39336 35858 32030 32172 32598 34772 38940
12459 38940 47810 65023 75064 84914 97607 112711 137084 159671 193419 239127 296086 399155
12447 399155 571259 858287 1280645 1741442 1996464 1913480 1572473 1151743 809904 574783
12437 574783 439715 349630 278221 230730 198835 169255 140894 124785 109106 90817 79102
12426 79102 62051 51301 45352 40541 38072 38704 33692 32211 24154 18065 12429 12814 12427 14361 15187
12411 15187 21207 20872 17311 14519 8494 11970 17527 17821 12070 14990 21535 16511 16234 13088 12669
12396 12669 14085 15492 13108 10568 8096 16721 17150 13881 12859 15368 16804 20396 18940 22124 26307
12381 26307 30685 32553 30616 25016 16907 20322 26006 19652 15977 8045 16902 20381 19807 19700 22182
12366B2182m132l845J733P649O226J0914K063m645p199j1451O26r03N632N491
12352C0341L24j147j942J354L268p138n495K950J767P01L397l675P1l773M402
12337B5405J495m883N454N498l124k243n179K095M385M574R4J605j1894q262N771
12322B0791O384l168L478p971j080M659O095M015j394j544l072L669k511N670
12308C4021J55P37j948o98P83N174O573P139o810n390K744k807n923R86J414l077
12292C3073J139L532r8M139n132j200M185M803L862j013K82O07j084m309k483
12277D0303m947P999j218m971o581q7R971j939K431L303Q49K860q99o472M309
12262D4911K367L804r554m220L633P611K998O381K687j2552o537r93q42Q74J709
$$ plain form
12366 22182 18050 14205 15938 23587 29813 40727 42790 38145 30946 19495 20121 19218 24850 30341
12352 30341 30665 29518 27576 28930 32198 25060 19565 22515 24282 24983 28380 24705 24776 21003 25405
12337 25405 26900 22017 27471 32969 29845 27602 22423 24518 28903 33477 33571 35176 23282 15020 20791
12322 20791 27175 24007 27485 19514 18434 23093 29188 33203 31809 30265 27193 30862 28351 34021
12308 34021 34176 34913 32965 32267 33050 38224 44797 51936 45126 39736 42480 39673 33750 34736 36150 33073
12292 33073 34212 37744 37646 41785 36653 35453 39638 44441 48303 47290 47572 48179 47095 42786 40303
12277 40303 35356 43355 42137 37166 30585 30498 40469 38530 40961 44264 45113 47973 47074 40602 44911
12262 44911 47278 51082 41528 37308 40941 48552 51550 57931 60618 48066 41529 40536 39694 40568 42277
12247D2277J114M697p977n917L565N865K144J0908j398o120O022N425l671k747
12233E4187l617R68q446j439J6960L190j968P31k545O684Q780O810r40M70P972
12218H7797J740O026M582L020m862M790L482j722K40K57J0131O353o59n49j655
12203A18971Q520O765o91K658l680p402l218N147o873L86O410N559P570J477K227
12188A43826M885K377o651n777m072n22L451M635M188k198K243l783M968N210
12174A52780O388L626j335l529j2183k184K738m501j2298J443K341M43p37o36
12160A32356p170k048n465O121j145p058K80K20L659R04J071j660j321O028R020
12145A33792k685m063R966m349n309k754K980J0001k794J862P15j646m633O964
$$ plain form
12247 42277 43391 48088 40111 34194 37759 43624 45768 56676 55278 49158 55180 60605 56934 54187
12233 54187 50570 51538 43092 41653 58613 61803 59835 60566 58021 64705 73485 80295 79355 79825 87797
12218 87797 89537 95563 100145 103165 98303 103093 106575 104853 105093 105350 115481 121834 121175 120626 118971
12203 118971 127491 134256 133565 136223 132543 125141 121923 127070 120197 120583 126993 132552 140122 141599 143826
12188 143826 148711 151088 144437 138660 134588 134066 137517 142152 146340 144142 146385 142602 147570 152780
12174 152780 159168 162794 161459 157930 145747 143563 146301 141800 129502 130945 133286 133729 132992 132356
12160 132356 125186 123138 117673 123794 122649 115591 115871 116091 119750 120654 121725 120065 118744 124772 133792
12145 133792 131107 127044 137010 132661 127352 124598 127578 137579 134785 136647 137362 135716 131083 138047
12131A38047M213n998o447P16L67O966L370j228L317Q788K595o401j235J793j913
12116A46950K330O957M66j158Q432k782n163P84J462L163l489m798J797J1685
12102A66636M00m395L563N426l527l079Q249Q386k398k84J5419Q983n762n300
12088A92317M675M795K288L401n6l255J445K18N526N382N372L970l574p039M444
12073B19909Q46N790P170M279L461j523O128N721P006K808K031J626N679O132
12059B77063N781Q707K594k481p44N149J541r0J2066O608K321r36N77P271O619
12044C32046P949L874R433J0410J767L862O401J0695n69n495L738J6997O797k072
12030D05833N985O302N989J1910P110O394J704N190M306J3253J3879J4199O407
$$ plain form
12131 138047 142260 136262 129815 130531 130898 137864 141234 140006 143323 152111 154706 148305 147070 148863 146950
12116 146950 149280 156237 156703 155545 163977 161195 156032 156816 158278 161441 157952 153154 154951 166636
12102 166636 167036 162641 166204 171630 168103 165024 173273 181659 179261 178977 194396 203379 197617 192317
12088 192317 196992 201787 204075 207476 207420 204165 205610 205828 211354 216736 222108 226078 222504 215465 219909
12073 219909 220755 226545 233715 237994 241455 239932 246060 251781 258787 261595 263626 265252 270931 277063
12059 277063 282844 291551 294145 291664 290920 296069 297610 297520 309586 316194 318515 317579 318156 325427 332046
12044 332046 339995 343869 353302 363712 365479 369341 375742 386437 385868 380373 384111 401108 407905 405833
12030 405833 411818 418120 424109 436019 443129 449523 451227 456417 460723 473976 487855 502054 508461
12017E08461Q485J0919K877J2251J965N735J1216J2344J3358R385J1731J5270
12005F23997J6283J6158J7874J4249Q882J3615J8198Q114J6359J6774J8223K0796
11993H09522J9437J9126J8847J9016J7557K0685J4337K2266K4193K2600L0704
11982A038290L2300L6921L4824K1260K5655L0327L0681K5834L5619L7445L7072
11971A386228M2349M9368N5473M8388M3837M6219M6335M8839M7937N2702N1626
11960A919301O7787P0453N8208O5307P6874P1723P6536Q4152R1047Q4696Q6485
11949B752569R8501R4149J05902J09344J11572J20192J19178J28923J30371J29228
11939C899929J37691J45741J51025J67457J66287J68894J72143J74610J79119
$$ plain form
12017 508461 516946 527865 530742 542993 544958 550693 561909 574253 587611 596996 608727 623997
12005 623997 640280 656438 674312 688561 697443 711058 729256 737370 753729 770503 788726 809522
11993 809522 828959 848085 866932 885948 903505 924190 938527 960793 984986 1007586 1038290
11982 1038290 1070590 1107511 1142335 1163595 1189250 1219577 1250258 1276092 1311711 1349156 1386228
11971 1386228 1428577 1477945 1533418 1581806 1625643 1671862 1718197 1767036 1814973 1867675 1919301
11960 1919301 1987088 2057541 2115749 2181056 2257930 2329653 2406189 2490341 2581388 2666084 2752569
11949 2752569 2851070 2945219 3051121 3160465 3272037 3392229 3511407 3640330 3770701 3899929
11939 3899929 4037620 4183361 4334386 4501843 4668130 4837024 5009167 5183777 5362896
11930E362896J95114K02772K09417K04677K07365K19613K20317K25915K36965
11921G285051K43388K50555K44754K44896K50052K55448K63255K53256K46497
11912I537152K41915K54893K55650K41854K38810K29830K09834K06946K12915
11903A1629799J95742J66261J47872J39024J15839R1465P2116N3297K4411L309
11893A2639135j6018m1538o1946q3624j11979j35357j44341j61446j91632j93365
11883A1497889k12226k15999k24917k37604k45383k50741k54612k49164k50094
11874I357149k47845k48008k50751k49899k39868k39970k28924k26432k26447
11865G199005k30701k24371k05972k04007k01806j94917j86878j78978j76891
$$ plain form
11930 5362896 5558010 5760782 5970199 6174876 6382241 6601854 6822171 7048086 7285051
11921 7285051 7528439 7778994 8023748 8268644 8518696 8774144 9037399 9290655 9537152
11912 9537152 9779067 10033960 10289610 10531464 10770274 11000104 11209938 11416884 11629799
11903 11629799 11825541 11991802 12139674 12278698 12394537 12486002 12558118 12611415 12635826 12639135
11893 12639135 12623117 12581579 12519633 12436009 12324030 12188673 12044332 11882886 11691254 11497889
11883 11497889 11285663 11069664 10844747 10607143 10361760 10111019 9856407 9607243 9357149
11874 9357149 9109304 8861296 8610545 8360646 8120778 7880808 7651884 7425452 7199005
11865 7199005 6968304 6743933 6537961 6333954 6132148 5937231 5750353 5571375 5394484
11856E394484j66682j71218j68718j53917j49183j43058j39273j42649j35754
11847D024032j35785j31464j29131j17877j12294j05507j04694j04005j01234
11838B982041r7365r0474q9118q9929q8951r2642q4539o7647o8664p2497o7112
11827B073103o2157o2175o1025o6721n8048n8512n2280n6094m4461l9552m2484
11816A469594m1837m4992m4601l3558m0440m9300l2706l1689l2688k5430k7319
11805A065034k0761k4663l1436l8132k6490k4282k3531j9882k0695k3090k4004
11794G88068k8736k2298j5916j3745j6214j9347j8498j8733j1273j6629k1743
11783E84936j5661r754j0141j2084r020j7565j1192l339o704j1346o265j3192
$$ plain form
11856 5394484 5227802 5056584 4887866 4733949 4584766 4441708 4302435 4159786 4024032
11847 4024032 3888247 3756783 3627652 3509775 3397481 3291974 3187280 3083275 2982041
11838 2982041 2884676 2794202 2705084 2615155 2526204 2433562 2349023 2281376 2212712 2140215 2073103
11827 2073103 2010946 1948771 1887746 1821025 1762977 1704465 1652185 1596091 1551630 1512078 1469594
11816 1469594 1427757 1382765 1338164 1304606 1264166 1214866 1182160 1150471 1117783 1092353 1065034
11805 1065034 1044273 1019610 988174 950042 923552 899270 875739 855857 835162 812072 788068
11794 788068 759332 737034 721118 707373 691159 671812 653314 634581 623308 606679 584936
11783 584936 569275 559521 549380 537296 528276 510711 499519 496180 489476 478130 471865 458673
11771D58673j1794j1193j4751j4512q890j4367o260K422l031r915j2074j3140
11759C41168l007m578j3809n614p40o893l477k251q024q125m667k079p158p118
11745B63628L07l856m476o560p856k513l381p745m852M559o83m714j461m919J31
11730B15609k479j4584q453m304O357l434j1163o683J109k485M993k750n939k899
11716A62895l933o59l065q838m410l627m034L785j618l352J150n595j494J852
11702A29057k127j860k101O8m904l259k899k910R05m93n842o49j654M36J912j208
11686A02472j537r34o24o174p410l62P093N363l667j1670m893k548J804J0795
11672H7708j395j2325o306n39O089J949k192k53J280K360l511J835l08j1172l989
$$ plain form
11771 458673 446879 435686 420935 406423 397533 383166 376906 379328 376297 366382 354308 341168
11759 341168 338161 333583 319774 314160 313420 306527 303050 300799 292775 284650 279983 277904 270746 263628
11745 263628 263935 260079 255603 249043 241187 238674 235293 227548 222696 227255 226572 221858 220397 215478 215609
11730 215609 213130 198546 190093 185789 192146 188712 177549 170866 171975 169490 174483 171733 165794 162895
11716 162895 158962 158303 155238 146400 141990 138363 134329 138114 136496 133144 134294 128699 127205 129057
11702 129057 126930 125070 122969 123037 118133 114874 111975 109065 109970 109477 103635 102986 101332 101768 103680 102472
11686 102472 100935 100001 99377 93203 85793 85431 92524 97887 94220 82550 77657 75109 76913 87708
11672 87708 86313 73988 67682 67143 73232 75181 72989 72736 74016 76376 72865 74700 74392 63220 59231
11657E9231l848o161n888R999J2239K771K306l806j822Q47N30J126n472j0338
11643E1714n699K581j747l833K528M428L785L770N34k053r99k040L417M752o803
11628E4335k669k337l476j0743o788o014K151P36J18J409Q45l52j20K777J847
11613C1719m841M007M487k418n277M077P08n690L355j365k323P837L264k959l972
11598C0609p404k500K852J639O359K571M24j500L52p475J428J0156P53p333j910
11583B9021L836J522k903N637l40K81J0215J084o624l650n017k874L5o237n953
11568A8033j891l507L328N424J55K855l064k143K358Q289J988K804l74m604o689
11553B2962L746N236K374p173K260K128m156j3661q800L887L566K919K745K030
$$ plain form
11657 59231 55383 49222 43334 53333 65572 68343 70649 66843 65021 65868 66398 67524 62052 51714
11643 51714 46015 48596 46849 43016 45544 49972 53757 57527 58061 56008 55009 52969 56386 61138 54335
11628 54335 51666 49329 45853 35110 28322 22308 24459 25195 25313 26722 27567 27215 27095 29872 31719
11613 31719 26878 30885 35372 32954 27677 31754 32462 26772 30127 28762 26439 34276 37540 34581 30609
11598 30609 23205 20705 23557 25196 31555 34126 34550 33050 33402 25927 27355 37511 38264 30931 29021
11583 29021 32857 34379 31476 37113 36773 37054 47269 48353 41729 38079 33062 30188 30223 23986 18033
11568 18033 16142 12635 15963 21387 21542 24397 21333 19190 21548 29837 31825 34629 34255 29651 22962
11553 22962 26708 31944 34318 27145 29405 31533 27377 13716 4916 8803 12369 15288 18033 20063
11539B0063L5o16j201j784o627o012M433N247R16m13M519K286L647O374N444p038
11523B9273l772O322L322k602k988J2576n390m923N518O964q302m633K265q18
11509C2812k742q521o688l258J184N972L749q21k98L311k128k621L554K441p34
11494B5212n58M081M61r906J85m506r095K817N083m780n280j257Q770Q170k465
11479A6932n601j944n350q157O4N280Q358q29K871k721l45K61N52M130l799l08
11463I394Q608K988j645l359j805o329N083M956M583O725n668r492J814L82n819
11448A0416k03J101K246J821o067j185J610J788p334K900P179L295o523k717J478
11433I805R160Q476O085l985o525j501l106P49Q08M422r578p853K937L449L879
$$ plain form
11539 20063 20098 19482 18281 16497 9870 3858 8291 13538 14454 14041 18560 20846 24493 30867 36311 29273
11523 29273 25501 31823 35145 32543 29555 42131 36741 31818 37336 44300 35998 31365 33630 32812
11509 32812 30070 21549 14861 11603 12787 18759 22508 21687 21389 24700 22572 19951 23505 25946 25212
11494 25212 24654 28735 29196 19290 19475 14969 5874 8691 13774 8994 3714 2457 11227 19397 16932
11479 16932 11331 9387 4037 -4120 -4056 1224 9582 8753 11624 8903 8558 8819 9371 13501 9702 9394
11463 9394 18002 20990 19345 15986 14181 7852 12935 17891 22474 29199 23531 14039 15853 16235 10416
11448 10416 10213 11314 13560 15381 9314 8129 9739 11527 4193 7093 14272 17567 11044 8327 9805
11433 9805 18965 27441 33526 29541 23016 21515 18409 19158 19966 24388 14810 6957 9894 13343 17222
11418A7222m732M309R544N115j006n924p056k868J367K376K590j029k968j523
11404A5417m749R06o43L146L108K05j527L744m416r937m596o622J557M167L267
11389C027M79K671j110r82q341l618Q111k399J61Q67m841j296l096p48M469N529
11373a117P178N505l28k71m999L016N299k060m48R620o886j2257K054L280j284
11358F302L804k741K569P121n437K063j962n766n294Q102J1688k447r844j59O527
11343A4526R536R350J1875j291j1382l048n914j37q65q185m508q377l781J863
11329c38K757L411J764M978J517o018j100M446K303N86k422L407j788O794l200
11314A7097n287j963n619J454k76j370N919J1441k706m651p366m268O396K352
$$ plain form
11418 17222 12490 16799 26343 31458 30452 24528 17472 14604 15971 18347 20937 19908 16940 15417
11404 15417 10668 11574 10931 14077 17185 17390 15863 19607 15191 5254 658 -5964 -4407 -240 3027
11389 3027 3506 6177 5067 4085 -4256 -7874 237 -2162 -2001 -1134 -5975 -7271 -10367 -11115 -6646 -1117
11373 -1117 6061 11566 11238 10967 5968 8984 14283 12223 11775 21395 14509 2252 4306 7586 6302
11358 6302 10106 7365 9934 17055 11618 13681 11719 5953 659 8761 20449 18002 8158 7999 14526
11343 14526 24062 33412 45287 43996 32614 29566 23652 23515 22650 14465 9957 1580 -2201 -338
11329 -338 2419 5830 7594 12572 14089 8071 6971 11417 13720 14306 11884 15291 13503 20297 17097
11314 17097 11810 9847 4228 5682 5406 4036 9955 21396 18690 14039 6673 2405 8801 11153
11300A1153k058J677K743N088k047L947j684l604J330K999N847n044r365j117
11286I865N84N241N854k295q896n7O248L088N37J825L765R029O769L570J989l622
11270D3494K469N809N114j0820l197n510r500l692R33k118N686m529l452J258
11256B1945j842R92M152J0948J21r557r715n94O495L87o45p467k277m4l097n1
11240I751L585K957n268m437M799k037l551J264j483O747K370l08k173k272j64
11225I780m210K702k881o357m71N063J180K089k560q156K419M812O57N366J9663
11210B9096J9879K3375L2168K0815j506k1725k9544k0285j4526j3688m792J785
11198B1052M596o015p017L743O884k180p852p939N44P04j376N953N163n33R82
$$ plain form
11300 11153 9095 10772 13515 18603 16556 20503 18819 15215 16545 19544 25391 20347 10982 9865
11286 9865 10449 15690 21544 19249 10353 10296 16544 19632 20169 21994 25759 34788 41557 45127 47116 43494
11270 43494 45963 51772 56886 46066 42869 37359 27859 24167 25100 22982 28668 24139 20687 21945
11256 21945 20103 21095 25247 36195 36316 26759 17044 16450 22945 23332 22687 15220 12943 12899 9802 9751
11240 9751 13336 16293 11025 6588 11387 9350 5799 7063 5580 12327 14697 14389 12216 9944 9780
11225 9780 5570 8272 5391 -966 -1437 3626 4806 6895 4335 -3821 -1402 3410 4067 9433 29096
11210 29096 48975 72350 104518 125333 123827 102102 72558 52273 37747 24059 19267 21052
11198 21052 25648 19633 12616 16359 23243 21063 13211 5272 5816 6520 5144 11097 16260 15727 16709
11183A6709n475r657n976M519K673k869P562J498j571L744n643m514Q711L798
11169A3509K789l540K119m85l906J519o866k363J707K070L28j228k769k432M588
11154E040L234k05N43n947j741N036L143j893l636n146K39R398R487q01m540J2946
11138B5157J2122P533J8950L852j1644o184j4167j6223p785k757J509J049q087
11125C325n300K533J141j958M328l848l99q67L208M432J579r32k086J485o108
11110E33r460l252J573O216K317J130q624R5N481k281k483j297L793k00m322K276
11094h505P087M282k053k613o134n666O650L443o418L194k600k70L573N95j27
11079e562j399l157p060L794J0294K384m648j1776l072Q161j33M624J993K90R33
$$ plain form
11183 16709 11234 1577 -4399 120 2793 -76 7486 8984 7413 11157 5514 1000 9711 13509
11169 13509 16298 12758 14877 14392 10486 12005 5139 2776 4483 6553 6881 5653 2884 452 5040
11154 5040 8274 8069 8612 2665 924 5960 9103 7210 3574 -1572 -1333 8065 17552 16751 12211 25157
11138 25157 37279 44812 63762 67614 55970 49786 35619 19396 11611 8854 10363 11412 3325
11125 3325 -1975 558 1699 -259 4069 221 -178 -1045 2163 6595 8174 7242 5156 6641 533
11110 533 -8927 -12179 -10606 -4390 -2073 -943 -9567 -9472 -3991 -6272 -8755 -10052 -6259 -6459 -10781 -8505
11094 -8505 -1418 2864 811 -1802 -7936 -13602 -6952 -3509 -9927 -6733 -9333 -9603 -6030 -5435 -5562
11079 -5562 -6961 -10118 -17178 -13384 -3090 -706 -5354 -17130 -20202 -12041 -12174 -7550 -5557 -5267 -4334
11064d334J150j542m138J52L883m67o910O029M548J306j0903m774N794N525K195
11049b486J0050L709q51r798m646o784j682J0764L009l557J254K655l416L728
11035A949l911l670N99m017l74l083K750J458J286l224j322O61J1517K710l863
11020e34J394L295N828m460n528k072o62O226l94p579l893M725N902P97K983J645
11004G673L38m983j0015k679%q87K997L355J730K224n341M96m881o768K952L01
10988a3488L62K312n720j831O352j333O346N083q36k710r383l014J11J79J400
10973a6170L642N346K389L083m469K732n53q252n28K953L918l661k282J092m160
10958a4920j044n304M53L7J711m1N823P565k554o643m361M41J0084M335p212j433
$$ plain form
11064 -4334 -3184 -4726 -8864 -8712 -4829 -5296 -12206 -6177 -1629 -323 -11226 -16000 -10206 -4681 -2486
11049 -2486 7564 11273 10422 624 -4022 -10806 -12488 -1724 1285 -2272 -1018 1637 -1779 1949
11035 1949 -1962 -5632 -5033 -9050 -9424 -12507 -9757 -8299 -7013 -10237 -11559 -10898 619 3329 -534
11020 -534 860 4155 9983 5523 -5 -2077 -2739 3487 3093 -4486 -8379 -3654 2248 3045 6028 7673
11004 7673 8011 3028 -6987 -9666 -9666 -10553 -7556 -4201 -2471 -247 -5588 -5092 -9973 -16741 -13789 -13488
10988 -13488 -13126 -10814 -16534 -18365 -12013 -13346 -7000 -1917 -2753 -5463 -14846 -17860 -17749 -17570 -16170
10973 -16170 -12528 -7182 -4793 -1710 -6179 -3447 -4000 -12252 -12780 -9827 -5909 -9570 -11852 -10760 -14920
10958 -14920 -15964 -21268 -20815 -20778 -19067 -19108 -13285 -5720 -8274 -14917 -19278 -18837 -8753 -4418 -11630 -13063
10942a3063n17L553l351q28N411M142j66O85j658j0826k099K63K859J28N481N061
10926d925O430k46j0078l557M462J027M121k944o962m586M401Q972L829R52L960
10911D856n792r399K635O948j490m794J819J781q869o609O881L495o046J75Q461
10896e948k638m087p7M161O84P405J411m406k455J206J047J1O38P041L398K2l930
10879C483j1360k782k211J1921Q969J414m490o312o306k773J858j6L723k820j030
10864h732P005K863L615Q270K75m742q699J815L585j928j979Q240j069J121m936
10849D704L844j973P11J615m467P61qn252m04o3l512k686O443L129m479m057n67
10832f261p77k440M765K922r74K082M454n063o22P247L49p326k210j635N188J707
$$ plain form
10942 -13063 -13580 -10027 -13378 -14206 -8795 -4653 -4819 -4134 -5792 -16618 -18717 -18454 -15595 -15467 -9986 -4925
10926 -4925 1505 1259 -8819 -12376 -7914 -6887 -2766 -5710 -12672 -17258 -12857 -3885 -56 896 4856
10911 4856 -936 -10335 -7700 -752 -2242 -7036 -5217 -3436 -12305 -18914 -12033 -8538 -14584 -14409 -5948
10896 -5948 -8586 -12673 -12750 -8589 -7905 -500 911 -3495 -5950 -4744 -3697 -3686 -3048 3993 7391 7413 3483
10879 3483 -7877 -10659 -12870 -949 8020 9434 4944 -1368 -7674 -10447 -8589 -8605 -4882 -7702 -8732
10864 -8732 -1727 1136 4751 13021 13296 8554 -145 1670 5255 3327 1348 9588 8519 9640 4704
10849 4704 8548 6575 7286 8901 4434 5195 5187 -65 -469 -532 -4044 -6730 -287 2842 -1637 -5694 -6261
10832 -6261 -7038 -9478 -4713 -1791 -2765 -683 3771 -1292 -1914 5333 5682 -1644 -3854 -5489 -301 1406
10816A406j583O245j150k139o204n557p3L907J891K815K475l714K871M930n690
10801D30q71J780o264m141j658M535J1159P422N289o159q531N40o48p725q106
10786a2948n091Q394R442L549P47L730R14m808m208k304o72n65J673l037J798
10771c386K17K062M776J856o926l544j457J090l87N996j817J553k439j079J863
10756a622O483r968o485k057M217M403J738n410K28j57m189J562K572K853l761
10741i593q08K511k934m69m87n30P853J318O775M084l671j614L064o652l957O137
10725A027K775p49L61N797k588q069j306P714N647m497q05K116L004K95R41J284
10709A2947K61J001J476l678r889n531N018P682K493k474m164J99l596l347O738
$$ plain form
10816 1406 -177 6068 4918 2779 -3425 -8982 -9055 -5148 -3257 -442 2033 -1681 1190 6120 430
10801 430 -441 1339 -4925 -9066 -10724 -6189 4970 12392 17681 11522 2991 3531 2883 -4842 -12948
10786 -12948 -18039 -9645 -203 3346 4093 7823 8737 3929 -279 -2583 -3255 -3820 -2147 -5184 -3386
10771 -3386 -3169 -1107 3669 5525 -1401 -4945 -6402 -5312 -5699 297 -1520 33 -2406 -3485 -1622
10756 -1622 4861 -5107 -11592 -13649 -9432 -5029 -3291 -8701 -8473 -8630 -12819 -11257 -8685 -5832 -9593
10741 -9593 -10401 -7890 -10824 -11293 -11780 -12310 -4457 -3139 3636 7720 4049 2435 5499 -1153 -5110 1027
10725 1027 3802 3053 3414 9211 6623 -1446 -2752 4962 10609 6112 5307 7423 10427 10722 11663 12947
10709 12947 13208 14209 15685 12007 2118 -3413 1605 9287 11780 9306 5142 5341 1745 -1602 5136
10694E136k429N365L075J793m889r97L491k133n849L93O595P262n117j1644m031
10679c979N085N936J758J565K405n00o134j296J202M00m96n61j0850p506m89n47
10663a4007P771J1041L620r31R575o647r586r590p01P11j385K800K749N026k296
10648a850o500J205L920J936m447K857P121J685m339j487K401Q71J90K887q310
10633a860m998j825L465j174j642j818L756k029P215M157n099j088N21m56k266
10618e141M23k603j4n293K628P427Q571k231l922J708N797n047Jj0058l88l169
10602a1311L70Q616L84m24N803n464j1299j60M090P786p23n067N60J377m182l949
10586a3593N381Q267M819n077k999l6o318M317L310j096l606M359q4r41l199o72
$$ plain form
10694 5136 2707 8072 11147 12940 8051 7054 10545 8412 2563 2956 9551 16813 11696 52 -3979
10679 -3979 1106 7042 8800 10365 12770 12270 6136 4840 6042 6442 5946 5385 -5465 -12971 -13460 -14007
10663 -14007 -6236 4805 8425 7494 17069 10422 836 -8754 -9455 -8744 -10129 -7329 -4580 446 -1850
10648 -1850 -8350 -7145 -3225 -1289 -5736 -2879 4242 5927 1588 101 2502 3373 3563 6450 -1860
10633 -1860 -6858 -8683 -5218 -6392 -8034 -9852 -6096 -8125 -910 3247 -1852 -2940 -2419 -2875 -5141
10618 -5141 -4718 -7321 -7335 -12628 -10000 -2573 5998 3767 -155 1553 7350 2303 2304 -7754 -8142 -11311
10602 -11311 -10941 -2325 -1941 -2365 3438 -2026 -13325 -13485 -9395 -1609 -2332 -7399 -6839 -5462 -9644 -13593
10586 -13593 -8212 55 4874 -203 -3202 -3238 -9556 -5239 -1929 -3025 -6631 -2272 -2356 -3297 -6496 -7168
10570g168J167M378N823k939k470L399J982J340L25M520L415o90p874j346P13
10555D575m779M605m255m06J158l541l962K057n21o53J070k716j037r18k367J01
10539a1589J0928P477o687r709M633L130P82K975L066m12L514R717P348K665o789
10524B1049p68k979o855k648j377Q865M781n822r143m714P481Q85Q263P737J256
10509B6011K445P08r268j2178J049L672Q207l321k333j698o646l223N38K811R66
10494G740J124N624L265m253j971O200O304m897m935m103j118P429Q757k9M270
10479B9407n775m932k922O00j643k246o1l441o01L070L537M50N919J819k650r362
10463A1169q136K732L67N063J614p901K81M923M793j279J472K381J132l730m810
$$ plain form
10570 -7168 -6001 -1623 4200 1261 -1209 2190 4172 5512 5837 10357 13772 13082 5208 3862 4575
10555 4575 -204 4401 146 -260 898 -2643 -6605 -4548 -5069 -5722 -4652 -7368 -8405 -9323 -11690 -11589
10539 -11589 -661 6816 129 -9580 -4947 -1817 -1035 1940 5006 4594 8108 17825 25173 27838 21049
10524 21049 20281 17302 10447 7799 6422 15287 20068 14246 5103 389 7870 8755 17018 24755 26011
10509 26011 28456 29164 19896 7718 8767 12439 20646 17325 14992 13294 6648 3425 3963 6774 7740
10494 7740 8864 14488 17753 13500 11529 17729 24033 19136 14201 10098 8980 16409 25166 25137 29407
10479 29407 23632 18700 15778 16378 14735 12489 12428 8987 8386 11456 14993 15443 21362 23181 20531 11169
10463 11169 3033 5765 6132 11195 12809 4908 5189 10112 14905 13626 15098 17479 18611 14881 10071
10448A0071N476L42L058l76j690O921J938q126k653J285P295l585r477l327l029
10433D123K458M176j084N27K153K046R55n048q110O499Q990K035L55j506k652
10418A5917j424J354j108O228k324n002o865l761K518j66M484m38o590k439J779
10403B163L368m132m312L780O657m39l277p228K811K431J842k438K695N555L086
10388A2562l975j810J58l033m227o56k67L095l664R43O813K767j117m511K963
10373F041K67L419J298M242n313M150J986N294l16m695J770R673l628o248m65
10358A7475N175K696k060m692J479J462J298q71m711J314L06J154j693m973j861
10343A1498K51L621J334m101l814M230J118J538j500L08M177Q85R6L69j396L731
$$ plain form
10448 10071 15547 15889 18947 18571 16881 23802 25740 17614 14961 16246 23541 19956 10479 7152 4123
10433 4123 6581 10757 9673 10200 12353 14399 15354 10306 2196 8695 17685 19720 20075 18569 15917
10418 15917 14493 15847 14739 20967 18643 13641 6776 3015 5533 5367 9851 9413 2823 384 2163
10403 2163 5531 1399 -2913 867 7524 7085 3808 -3420 -609 1822 3664 1226 3921 9476 12562
10388 12562 8587 6777 6935 3902 -325 -981 -1248 1847 -1817 -874 5939 8706 7589 3078 6041
10373 6041 6308 9727 11025 15267 9954 14104 16090 21384 21068 16373 18143 27816 24188 17940 17475
10358 17475 22650 25346 23286 18594 20073 21535 22833 21962 17251 18565 18871 20025 18332 13359 11498
10343 11498 11749 15370 16704 12603 8789 13019 14137 15675 14175 14483 18660 19545 19641 20010 18614 22345
10327B2345L522j21K173m331j707J006r44K976Q404r279l946Q489O035R330N130
10312D9082J211L161K704L570j249k551K763L934K211l881m228r373p56j667m251
10297D0680J976n502m180L043K981k989m743o69M762N075m041L44L687l301M458
10282D1581M140N53k749k18M957l423n057j794M34K711N501N847R457j775j401
10267E8764K912K609J678l700q110j3366m970M917P559R18l153K566O708M598
10253E9930n016p163n152O925J725o87k296J250J401M697P629l244j446J0460
10239F9013L598l479m464r596j58J1318P103j093l544j7N402j35k542J841k962
10224G0285k476K809p82j19k966L8j106m68l147N352O228N307m331J734M384Q268
$$ plain form
10327 22345 25867 25746 27919 23588 21881 22887 21943 24919 33323 24044 20098 28587 34622 43952 49082
10312 49082 50293 53454 56158 59728 58479 55928 58691 62625 64836 60955 56727 47354 46598 44931 40680
10297 40680 42656 37154 32974 36017 38998 36009 31266 30597 35359 40434 36393 36737 40424 37123 41581
10282 41581 45721 46274 43525 43307 48264 44841 39784 37990 38424 41135 46636 52483 61940 60165 58764
10267 58764 61676 64285 65963 62263 54153 40787 35817 40734 48293 49211 46058 48624 55332 59930
10253 59930 54914 47751 42599 49524 51249 50562 48266 49516 50917 55614 63243 59999 58553 69013
10239 69013 72611 69132 64668 55072 54914 66232 73335 72242 68698 68681 74083 73948 71406 73247 70285
10224 70285 67809 70618 69836 69717 66751 66789 65683 65215 62068 67420 73648 78955 74624 76358 80742 89010
10208H9010Q307L730q348o945N536j038L460N020J7222R44l539P926O636L705
10194A31626J275M486j296O458J7037J5972K5527L5641L8702L1875L0866L5101
10182C73270L2263K465k9604k7335j3434k1851l1004l0077l1430k4048j7080r175
10170A72960n431m334K742K276L847L308K733o16N161j019k741R21J293m092j883
10155A75125J466m320j711J44L69j181l488J838N042P840Q421J30M56q585o123
10140A75423K980K466J973J069P360J6247K518N25k51J305K149L550K781R75O877
10125B27947O974K323l102l282M091n389l459O511p419K005O742k711m574m66
10111B26191L455j908m374Q97J794M82L944M515o160n80O238J223k083j0742r953
$$ plain form
10208 89010 97317 101047 92699 85754 91290 90252 93712 98732 115954 116898 113359 121285 127921 131626
10194 131626 132901 137387 136091 142549 159586 175558 201085 236726 275428 307303 338169 373270
10182 373270 405533 407998 378394 351059 337625 315774 284770 254693 223263 199215 182135 172960
10170 172960 167529 163195 165937 168213 172060 175368 178101 177485 182646 181627 178886 179807 181100 177008 175125
10155 175125 176591 172271 170560 170704 171073 169892 166404 168242 173284 181124 189545 189675 190131 181546 175423
10140 175423 178403 180869 182842 183911 191271 207518 210036 210561 210310 211615 213764 217314 220095 221070 227947
10125 227947 234921 237244 234142 230860 234951 229562 226103 232614 225195 227200 233942 231231 226657 226191
10111 226191 229646 227738 223364 224261 226055 226537 230481 234996 228836 228256 234494 235717 233634 222892 212939
10096B12939O712Q196k607p12j229j3676n84Q18R56j207m138j677Q41M294n38
10081B08388K906j027n360p320j0648Q12P22k898O21k376m333n754J222M205L316
10066A82476M003N476l598j394J0960O102M518O891m040j1341j0107j2132j0954
10053A66860n401j4013r695l602m490N103P802k969m697n970J705m432m569Q4
10039A21716n909q82K877l755J420n30j958l637k657p651q985L303P939L522l098
10024A01715n922k362n892q372L283P433L44j614J1235J1485k529o732j6298j0293
10010G5481J775R542K20j1998r116m96j334n665j52K806j194k478K093k092o18
9995E6774M39K08J555P68J806r64o858M475j138J251k566m211p752o540L581M483
$$ plain form
10096 212939 219651 227847 225240 224528 223299 209623 209039 209857 210813 209606 205468 203791 204632 208926 208388
10081 208388 211294 210267 204907 197587 186939 187751 188473 185575 186196 183820 179487 173733 174955 179160 182476
10066 182476 186479 191955 188357 186963 197923 204025 208543 215434 211394 200053 189946 177814 166860
10053 166860 161459 147446 137751 134149 129659 134762 142564 139595 134898 128928 130633 126201 121632 121716
10039 121716 115807 114925 117802 114047 115467 114937 112979 109342 106685 99034 90049 93352 101291 104813 101715
10024 101715 95793 93431 87539 79167 82450 89883 90227 88613 99848 111333 108804 102072 85774 75481
10010 75481 77256 86798 87018 75020 65904 65408 64074 58409 58257 61063 59869 57391 59484 57392 56774
9995 56774 57213 57421 58976 59744 61550 60586 53728 58203 57065 58316 55750 51539 43787 37247 40828 45311
9979D5311m659k087L292k504L470J93o655j606O640L695m042q065L915R233L023
9964D9154q342n662j209M157J574R212M8K150m836q855n082o362n971K614J775
9949B4365l708l102r14K482M499j059L898J171p549L50J649n274l783l089K140
9934A2076O894O938k125k961l360j0672j152Q546k904L61j455M332k339n056m238
9919B885n74P226N260p35m262J637k36k11Q492K018J311L147J998j1771n498m47
9903A0240O7jo224O321N06O927R010k084j165J59K27n424m350p700n227k864l042
9886d624P008Q169L189K547J54k293j112o066l633k936L326m22k543Q82N969L624
9870A1239L819M644J990p51m717l007k857M625R184O018o93k586j703J208o215
$$ plain form
9979 45311 40652 38565 41857 39353 42823 43016 36361 34755 41395 45090 41048 32983 36898 46131 49154
9964 49154 40812 35150 33941 38098 39672 48884 48932 51082 46246 37391 32309 25947 19976 22590 24365
9949 24365 20657 17555 16641 19123 23622 22563 26461 27632 20083 20433 22082 16808 13025 9936 12076
9934 12076 18970 25908 23783 20822 17462 6790 5638 14184 11280 11641 10186 14518 12179 7123 2885
9919 2885 2311 9537 14797 14062 9800 11437 11201 10990 19482 21500 22811 25958 27956 16185 10687 10240
9903 10240 10307 10306 4082 10403 10909 17836 26846 24762 23597 23756 23983 18559 14209 6509 1282 -1582 -4624
9886 -4624 2384 10553 13742 16289 16443 14150 13038 6972 3339 403 3729 3307 764 1646 7615 11239
9870 11239 15058 19702 21692 20941 16224 13217 10360 14985 24169 30187 29494 26908 25205 26413 20198
9855B0198o953J216M067m54n767k57j136K38P861k185p651n759o789j403P817
9840C043n669k907M909J754j425K789J2836M644J192k817n990q086K62p00k67
9825C568N273K003J083N731P062p30p996p038R50o278K899K027k582L831j352
9810H451p15R009n643J133j0857n502N544K159J044j472O06P49L658L08n67L420
9794A1325k022k1k885l203q25j345j893l430K49M952Q06o188r89L112N769j488
9778A924k391O183K346J276r986j628M071o097J876O567l04K030n62l958l103
9763a756k405O835Q36L386j0686j814L690M338j925j766k638N439M345p831r263
9748a1215k79J1135N196l630K822R37M237O551K328o99o000p750l221j360l222
$$ plain form
9855 20198 13245 14461 18528 18074 12307 12050 10914 11152 19013 16828 9177 3418 -3371 -4774 3043
9840 3043 -2626 -5533 -624 1130 -295 2494 15330 19974 21166 18349 12359 4273 4535 3835 3568
9825 3568 8841 10844 11927 17658 24720 23990 15994 8956 9906 3628 6527 8554 5972 9803 8451
9810 8451 7736 16745 11102 12235 1378 -4124 1420 3579 4623 3151 3757 4506 8164 8472 7905 11325
9794 11325 9303 9282 6397 3194 2369 1024 -869 -4299 -4050 902 1708 -4480 -5469 -2357 3412 1924
9778 1924 -467 5716 8062 9338 -648 -2276 1795 -4302 -2426 4141 3837 5867 5305 1347 -1756
9763 -1756 -4161 2674 3510 6896 -3790 -5604 -1914 2424 499 -1267 -3905 1534 5879 -1952 -11215
9748 -11215 -11494 -359 4837 1207 4029 4966 9203 15754 18082 17383 11383 3633 412 -948 -4170
9733d170m116o693K981Q917L334K182r440n740M978r79n294L950R763L850n992
9718b469p425m097j253J839N019P440O70l928j226n190m018Q183M172l247K222
9703c308k32m954P673j869k587k464L048O943l347m79j197K833P160J545j86K666
9687A1245o948p021k359Q102L292j763J789n983K203J118l062p734J966P095K534
9672D474o741K648K091k268Q975R859n336j0096M040J730j945p101R28O153J533
9657H944n296k453M785l674l688j571m111j823p87Q291R187j16o984M153j75j2080
9641g398K425Q495J018j046l15k555l913l831O516q94m91N099J32q60n985m138
9625g741R049N85k475m20L887l502n027k06k481K888P022m157l064J233N414P726
$$ plain form
9733 -4170 -8286 -14979 -11998 -3081 253 2435 -7005 -12745 -7767 -8746 -14040 -10090 -327 3523 -2469
9718 -2469 -9894 -13991 -15244 -13405 -8386 -946 -276 -4204 -5430 -10620 -14638 -6455 -2283 -5530 -3308
9703 -3308 -3540 -8494 -821 -2690 -5277 -7741 -4693 2250 -1097 -1576 -2773 60 7220 8765 8579 11245
9687 11245 4297 -2724 -5083 3019 6311 4548 6337 354 2557 3675 613 -7121 -5155 1940 4474
9672 4474 -2267 381 2472 204 9179 19038 13702 3606 7646 9376 7431 330 1258 7411 8944
9657 8944 3648 1195 5980 2306 -1382 -2953 -7064 -8887 -9674 -1383 7804 7688 704 4857 4682 -7398
9641 -7398 -4973 3522 4540 3494 3179 624 -3289 -7120 -604 -1498 -1989 3110 3242 2382 -3603 -7741
9625 -7741 1308 1893 -582 -1002 2885 -617 -5644 -5850 -8331 -5443 1579 -2578 -5642 -4409 1005 8731
9609H731j512J482j360p681n638n69L841n319J018K931k887J141Q09N259N197
9594E443J53o690l240J120j380k087m167L564K467j146M14J991j054L805L203
9579B396l825k524k569j792k209P85p762L91N961P358K011M90j185m906n541j726
9563a4647K49Q341J784l72Q48k471M20N22j876k669J4K546L228k576l190N972
9547c877N037n85J087K054J173o981J786K636Q655K479K381k469o052l233o20
9532C471o44K484K11M6m663K925L658m080n456L22k76j43n97p338j137J452O350
9515c415P352K32J427k834o276L28Q259Q085R615K180q241n983J039o25n650J483
9499F976L287l255n139M125L300n702o547n552K143J055r04l622K083R231j027
$$ plain form
9609 8731 7219 8701 7341 -340 -5978 -6547 -2706 -8025 -7007 -4076 -6963 -5822 -5013 246 5443
9594 5443 5596 -1094 -4334 -3214 -4594 -6681 -10848 -7284 -4817 -5963 -5549 -3558 -4612 -807 2396
9579 2396 -1429 -3953 -6522 -8314 -10523 -9738 -17500 -17109 -11148 -3790 -1779 -1289 -2474 -7380 -12921 -14647
9563 -14647 -14398 -6057 -4273 -4645 -3797 -6268 -5848 -5326 -7202 -9871 -9857 -7311 -4083 -6659 -9849 -3877
9547 -3877 1160 575 1662 3716 4889 -2092 -306 2330 10985 13464 15845 13376 7324 4091 3471
9532 3471 2827 5311 5522 5568 905 3830 7488 3408 -2048 -1726 -2002 -2145 -2742 -10080 -11217 -9765 -3415
9515 -3415 3937 4169 5596 2762 -3514 -3186 5073 13158 22773 24953 16712 10729 11768 11143 5493 6976
9499 6976 10263 7008 1869 5994 9294 3592 -2955 -8507 -6364 -5309 -6213 -9835 -7752 1479 452
9484D52j74K061K847N9K113L525l174l522l001l414J66J2932J2163J483n378q727
9468A0411l208m588p012o80k350K431K390J111O947P1j0855M245N154o11r12J7
9452B561o24K148l348O44K125n75J984m548J93K153m538J750L770J068R00j66
9436E497L573j577m819M489q232n424Q77M440o089o17J1070L244n177n02j80m907
9420d334o704N435N025J835M316k243m489l169J689k34k87j539K573QN06Q265
9404F653M284m264n861k755N878J808l860j158P66l510r36L448k395n453j553
9389h908K585k163p337Q7N287Q989j53K103q30p83N127L098n022M82K436j146
9373C852K583N065O47k524m430j0159N988M052l924j58j620o043K310N30m010
$$ plain form
9484 452 278 2339 5186 5245 7358 10883 7709 4187 1186 -2228 -2062 10870 23033 24516 19138 10411
9468 10411 7203 2615 -4397 -5077 -7427 -4996 -2606 -1495 5452 5523 -5332 -1087 4067 3456 2544 2561
9452 2561 1937 4085 737 1381 3506 2931 4915 367 560 2713 -1825 -75 3695 4763 5663 5497
9436 5497 9070 7493 2674 7163 -1069 -6493 -5616 -1176 -7265 -7882 3188 6432 1255 753 573 -4334
9420 -4334 -11038 -5603 -578 1257 5573 3330 -1159 -4328 -2639 -2873 -3160 -4699 -2126 -2118 -1612 6653
9404 6653 10937 6673 812 -1943 3935 5743 1883 725 1491 -2019 -2955 493 -1902 -7355 -8908
9389 -8908 -6323 -8486 -15823 -15736 -10449 -1460 -1613 490 -340 -1123 4004 7102 2080 2562 4998 3852
9373 3852 6435 11500 12147 9623 5193 -4966 1022 5074 1150 992 -628 -6671 -4361 -3831 -7841
9358g841j104L887J352j198M898j066J3r7L584o501J167P616m917r105o536n138
9342b0986N325R681M23K324Q603J835j0242l728Q30N560N069k609m309j097J297
9327b024O972j248J770J291l571m497K72L905m950k366R53j264K875p55J110J528
9311Ap13k377O246m197l071j330m006L373o76N78j550n663o29L170k904r218k742
9294b5708l35R302Q733L197J020L356l677l632J176p79k750O448K060o378k402
9279a0369L405K541k043J793R667k204p07j581K811m80n809p962m757K429M210
9264i056K788N530N565q32j024o537m237J381N01Q84n67J861o26R86J473l525
9248e435Q063M358o113n900P564K5K130K153N528r13l15l795K03K335l039J193
$$ plain form
9358 -7841 -8945 -5058 -3706 -4904 -6 -1072 -1059 -1156 2428 -4073 -2906 4710 -207 -9312 -15848 -20986
9342 -20986 -15661 -5980 -5557 -3233 5370 7205 -3037 -6765 -5935 -375 4694 2085 -2224 -3321 -2024
9327 -2024 4948 3700 5470 6761 3190 -1307 -1035 2870 -2080 -4446 -3493 -4757 -1882 -2637 -1527 1
9311 1 -712 -3089 3157 -1040 -4111 -5441 -9447 -6074 -6750 -6172 -7722 -13385 -14014 -10844 -13748 -22966 -25708
9294 -25708 -26043 -16741 -8008 -4811 -3791 -435 -4112 -7744 -6568 -7347 -10097 -3649 -1589 -7967 -10369
9279 -10369 -6964 -4423 -6466 -4673 4994 2790 2083 502 3313 2833 -2976 -10938 -15695 -13266 -9056
9264 -9056 -6268 -738 4827 3995 2971 -3566 -7803 -6422 -5921 -5037 -5604 -3743 -4369 -3383 -1910 -5435
9248 -5435 2628 6986 873 -5027 2537 2562 4692 6845 12373 11460 11145 7350 7553 9888 6849 8042
9232H042l48k965L390n119q366M550J1170m152n472j772k925l261p13K002n375
9217a1314L619N456K176r48K193j703l227j131j853J583j261P208O86l90m668
9202c574j496J493k95k160k229p34M761K211Q648k75o006n308n318M513P242N31
9186B004j0k908J085O459l499O872K417m132m998p176j1713K605M033K380n864
9171a2445m355j439Q545J1702j163N44O516J142j757L314m009l989N364l200l130
9156A640M999O006Q662q056p85O327m343j862o232o594J263K688k414m869P507
9141C937N018p967n993J560K684K422k183J934j02j703O89k197q431K184M258
9126c890j014L96J2955P448N827j073j1354p223j72K732J173Q9M92n690m324o113
$$ plain form
9232 8042 7694 4729 8119 3000 -5366 -816 10354 6202 730 -1042 -3967 -7228 -7941 -5939 -11314
9217 -11314 -7695 -2239 -63 -1011 1182 -521 -3748 -4879 -6732 -5149 -6410 798 1484 1094 -3574
9202 -3574 -5070 -3577 -3872 -6032 -8261 -8995 -4234 -2023 6625 6350 344 -4964 -10282 -5769 1473 2004
9186 2004 1994 -914 171 6630 3131 10003 12420 8288 3290 -3886 -15599 -12994 -8961 -6581 -12445
9171 -12445 -16800 -18239 -9694 2008 845 1389 7905 9047 7290 10604 6595 2606 7970 4770 1640
9156 1640 6639 12645 21307 13251 12466 18793 14450 12588 6356 -238 1025 3713 1299 -3570 3937
9141 3937 8955 988 -5005 -3445 -761 1661 -522 1412 1310 -393 296 -1901 -10332 -8148 -3890
9126 -3890 -4904 -4508 8447 15895 21722 20649 9295 2072 1900 4632 5805 5894 6386 696 -3628 -9741
9110i741J130p11Q126k632m822M53J3994M931n571k391J624J220m438L928O30
9095E730k162k002r63K047n312o11m912P323R841j881n145K097r9k870J920m403
9079a402l269K463M876l175r13M956L220K156o658j33M268O430m021K47J627j333
9063I339k708K632L781j520L699K298m167n602K239P903p49k620j151M428L933
9048B1735N104j828J1189J1727M532j347r061j2722r961m116K275l93P67l654
9034A4247Q23r29p040m637m63J33K996l779L101j436N764n219m464M180K856Q5
9018F218L978k141n013O095M627r2o651j855l145k549M346M292J1364J2116J7115
9003D8705J5347n20j0240q176r193q640p092l139l195n717J153O423j040o566
$$ plain form
9110 -9741 -8611 -9322 -1196 -3828 -8650 -8197 5797 10728 5157 2766 4390 5610 1172 5100 5730
9095 5730 3568 1566 603 2650 -2662 -3273 -8185 -862 8979 7098 1953 4050 3951 1081 3001 -1402
9079 -1402 -4671 -2208 2668 -507 -1420 3536 6756 8912 2254 2121 6389 12819 8798 9045 10672 9339
9063 9339 6631 9263 13044 11524 15223 17521 13354 7752 9991 17894 17145 14525 13374 17802 21735
9048 21735 26839 25011 36200 47927 52459 51112 42051 29329 19368 15252 17527 17134 17901 14247
9034 14247 15070 14141 7101 2464 2001 2134 5130 1351 4452 3016 8780 3561 -903 3277 6133 6218
9018 6218 10196 8055 3042 9137 13764 13672 7021 5166 2021 -528 3818 8110 19474 31590 48705
9003 48705 64052 63532 53292 45116 35923 27283 20191 17052 13857 8140 9293 15716 14676 8110
8989H110m083k842j059L949l847O170j576n948k262K24M569J13J626m28R84l009
8973F91J857K2309J1227K911l231o653p665j3238p048k55q905L019R051j167p140
8958d237K536k418o207J20J852m191Q113Q87o185J803O832k279J044M647M132
8943F449J0076r96k177M190m075O171O41r124q605n448K366j4N10k271O356N462
8927I511m21M303R398p680j0920j140L641K262J254J836P592K441m043o742l912
8912G380m291L836k246n121k323N072R283M982J120n894l347L786J57m286Q87
8897H995k52k127k095J415k358L869Q116L498j755k49k23O50O456M836N322M897
8881C8995k648l906j146J651l68k896j674L218L452R690J0144L508n273Q95J1442
$$ plain form
8989 8110 4027 1185 126 4075 228 6398 4822 -1126 -3388 -3164 1405 1518 3144 2716 3700 691
8973 691 2548 24857 36084 38995 35764 29111 21446 8208 1160 905 -8000 -4981 4070 2903 -4237
8958 -4237 -1701 -4119 -10326 -10206 -8354 -12545 -4432 -3545 -9730 -7927 -1095 -3374 -2330 2317 6449
8943 6449 16525 15529 13352 17542 13467 19638 20279 11155 2550 -2898 -532 -546 -36 -2307 4049 9511
8927 9511 9090 13393 22791 15111 4191 3051 6692 8954 10208 12044 19636 22077 18034 11292 7380
8912 7380 3089 6925 4679 -442 -2765 2307 11590 16572 17692 11798 8451 12237 12394 8108 8995
8897 8995 8743 6616 4521 5936 3578 7447 15563 19061 17306 17057 16834 17484 23940 28776 34098 38995
8881 38995 36347 32441 31295 32946 32578 29682 28008 31226 34678 44368 54512 58020 52747 53642 65084
8866F5084J5636J3504O373J0169K7324K7493J8088J1910K0059K8956M1590O1624
8854C47810J06002J59697K46690M12873N87961N32367J34936k66336n07385n03328
8844A251287l64499k38647j61170j03267o6108m8025l3733l1303j8458j2450j7382
8833A56245k0012o608k885j2194k1692j2669p379J874m844m957o287N47k726m79
8819E5934P60p223o432j710r55O041K659r97J293K586Q48M099k582l736J166M930
8803E6681P34l703n450k784l273k805m434J555J243o319K899L372k905k644L505
8788C5672J2838N102j259J580k95m321J93m613k257N679K563j00l113q002q044
8773C1623J081Q089M416j97m123j894M693M435M69J581j071K710N550N659J441
$$ plain form
8866 65084 80720 94224 100597 110766 138090 165583 183671 195581 215640 244596 286186 347810
8854 347810 453812 613509 860199 1273072 1861033 2393400 2528336 2262000 1754615 1251287
8844 1251287 886788 648141 486971 383704 317596 269571 235838 204535 186077 173627 156245
8833 156245 136233 129625 126740 114546 92854 80185 72806 74680 69836 64879 58592 59139 56413 55934
8819 55934 56694 49471 43039 41329 40374 46415 49074 48077 49370 51956 52804 56903 54321 50585 51751 56681
8803 56681 57415 53712 48262 45478 42205 39400 34966 36521 37764 31445 34344 37716 34811 32167 35672
8788 35672 48510 53612 52353 53933 53638 49317 49510 44897 42640 48319 50882 50782 47669 39667 31623
8773 31623 32704 40793 45209 45012 40889 38995 43688 48123 48592 50173 49102 51812 57362 63021 64462
8758F4462k278p05j1585l9k437L961Q089p26j2514q636Q91L283L917J899M828
8743E2410R246N466P212R824k34n650j575l009k530p685j2296n37l148o539j64
8728D0791M294P16J40L141L516m120P224M130j49J732N298L005j690Q4Q41k009
8712F6944K021o167J761P132M185R949J4589O279J060j765o540m583j583r769
8698H3513n21q141m407m194m13m701j206M498m186J350J55r073o247o1J493j277
8682D6582K813r21j0260J30O530J0409N109M112N794J255N473M257N732K318L127
8667I2460n140K577l914k813L68M04J360K030k68L820Q07p6l035M1L871J019m42
8650I3069n337K353j604J548J3102J4188O593M8M92J2953N590P668k677M600Q326
$$ plain form
8758 64462 62184 61479 49894 49855 47418 51379 59468 58742 46228 37592 38483 41766 45683 47582 52410
8743 52410 61656 67122 74334 84158 83924 78274 76699 73690 71160 63475 51179 50642 47494 40955 40791
8728 40791 45085 45801 45941 49082 52598 48478 55702 59832 59683 61415 66713 69718 68028 68112 68953 66944
8712 66944 68965 62798 64559 71691 75876 85825 100414 106693 107753 105988 99448 94865 93282 83513
8698 83513 82992 74851 70444 66250 65837 61136 59930 64428 60242 61592 61747 52674 46427 46366 47859 46582
8682 46582 49395 48474 38214 38344 44874 55283 60392 64504 70298 71553 77026 81283 87015 89333 92460
8667 92460 87320 89897 85983 83170 83538 83942 85302 87332 87064 90884 91691 91615 88580 88621 92492 93511 93069
8650 93069 87732 90085 88481 90029 103131 117319 123912 123960 124452 137405 142995 150663 147986 152586 160912
8635A60912j511J632N154M160P696J5399Q278L542P777M04O808Q040O107j059
8621B33339N74N970M821Q408R507M026R68N8J002P25l453j964k987p546j2921
8606B40527j0292j6100m756l768n579k101k849m712r066r964k048M693Q957M633
8592A87575J325M284K645j317K079M210M428N673K551Q596L743L769L699N692
8578B38952J2462J6089J5052N128J3438K0220J8113J9631J9854Q021q620j6517
8566C61823k3027k6619l1852l1607l2624k7391j9252j5868j5003j1581j2207n436
8554A09356l891q013q918l792K785r090j3063n306n991N475J752l626l380J067
8540E5365m063p643j87L489l869K975O082Mo335n958P00o99j0678p015j608L034
$$ plain form
8635 160912 159401 161033 166187 170347 178043 193442 201720 205262 213039 213443 220251 228291 234398 233339
8621 233339 233913 239883 244704 253112 262619 266645 267613 267671 268673 269398 265945 263981 260994 253448 240527
8606 240527 230235 214135 209379 205611 200032 197931 195082 190370 181304 171340 169292 173985 182942 187575
8592 187575 188900 193184 195829 194512 196591 200801 205229 210902 213453 222049 225792 229561 233260 238952
8578 238952 251414 267503 282555 287683 301121 321341 339454 359085 378939 386960 378340 361823
8566 361823 338796 312177 280325 248718 216094 188703 169451 153583 138580 126999 114792 109356
8554 109356 105465 97452 88534 84742 87527 78437 65374 60068 54077 59552 61304 57678 54298 55365
8540 55365 51302 43659 43472 46961 43092 46067 52149 52153 45818 39860 40560 39861 29183 22168 20560 23594
8524B3594K804O71Q079l245n792n137o75l65j821N095J487M662J540K08k114j965
8508B7026N466n56q085L279J935l336n389n713P017M504L446O702l737p241p804
8493A7514J308L597N885n773m466K163o48m527l384K184j706m54O390J946j803
8478A8226l291L103l474N207O51l35L769m981o411J33L353O608L22K024j0704
8463A4200r544j943R61M778M683K80L120K875l878l522j485o898k135P235M450
8448A3177Q025k035n826k536M50o663M070L65O024N895L541l64n903m281p022
8433F917p302p9p93M074k78R405N528l463m287l135K099p05J661l131m198l699
8417a386m097M263P297M409M88P47l442l078k81M994J367M970k578p617O69J050
$$ plain form
8524 23594 26398 27069 35148 31903 26111 20974 20299 19934 18113 23208 24695 29357 30897 31105 28991 27026
8508 27026 32492 31936 23851 27130 29065 25729 20340 14627 21644 26148 29594 36296 32559 25318 17514
8493 17514 18822 22419 28304 22531 18065 20228 19580 15053 11669 13853 12147 11693 18083 20029 18226
8478 18226 14935 18038 14564 19771 20422 20087 23856 18875 12464 12597 15950 22558 22880 24904 14200
8463 14200 4656 2713 3674 8452 13135 13415 16535 19410 15532 12010 10525 3627 1492 8727 13177
8448 13177 21202 19167 13341 10805 11255 4592 8662 9027 15051 20946 24487 24123 18220 13939 6917
8433 6917 -385 -464 -1257 2817 2539 11944 17472 14009 9722 6587 8686 7981 9642 6511 2313 -1386
8417 -1386 -5483 -1220 6077 10486 10974 11721 8279 5201 4920 9914 11281 16251 13673 6056 6725 7775
8401G775J303m4Q955Q100j714q873m675Q7j257J704L073o73k493k169l996p352
8385b249k744n78K372p46L091L231k310k05l571L60K207j359k085k583R317J3248
8369A5396n64m665O042j662n118p335l118J259L78M153O770M71K97k075p565M639
8353G303L428l800j944N597m110m279J100J723j904J091n259j010J671j257k781
8338d431l914J103N422J068l889P40P419n410J662m699O39L539K233p8j372O592
8322F624O610l178j456l387k656j091N36K452K503R836M075m586k840o065p683
8307c06L91k947K85K830M722N91l754n679K576Q168P623n658m915m806k043n506
8291h428j05K670j562K39k148K954L057K249j002K561K578K574q701j291K565
$$ plain form
8401 7775 9078 9034 17989 26089 24375 15502 10827 10914 9657 11361 14434 13761 11268 9099 5103 -2249
8385 -2249 -4993 -5571 -3199 -3945 -854 2377 67 -138 -3709 -3349 -1142 -2501 -4586 -7169 2148 15396
8369 15396 14832 10167 16209 14547 9429 2094 -1024 235 613 4766 11536 12007 12304 10229 2664 7303
8353 7303 10731 6931 4987 10584 6474 2195 3295 5018 3114 4205 -1054 -2064 -393 -1650 -4431
8338 -4431 -8345 -7242 -1820 -752 -4641 -3901 3518 -1892 -230 -4929 -4290 -751 1482 1404 32 6624
8322 6624 13234 10056 8600 5213 2557 1466 2002 4454 6957 16793 20868 16282 13442 7377 -306
8307 -306 85 -2862 -2577 253 4975 5566 1812 -3867 -1291 6877 14500 8842 3927 -879 -2922 -8428
8291 -8428 -8533 -5863 -7425 -7186 -9334 -6380 -3323 -1074 -2076 485 3063 5637 -3064 -4355 -1790
8276a790o21q61L278k620L798L078N675K38K400m819p173O106J454K298K851o664
8260F628m775l935M942n056o511k533J260L534L374Q458P099J194o843o063j96
8245E77L275L002l268m39N821L821q221j050J2571j901k628O40J85L291m927n162
8229E587l082J709L786p275k725q93J982L058j936k707j494J396J57j958j22J653
8213b864k350k083K046R379l048j027k31p587l215J0169M654J871p64K017l856
8198C111j168M575k411M429K687K550j747k076q994o88M389j3L554J058l123P717
8182A3850J803q793o658L882p24K815l922l56O269l010j893J468N156k223Q603
8167A6267L02j454p67M93k752O588k73m005l040k362M692R299J393N424L84n246
$$ plain form
8276 -1790 -2411 -3272 6 -2614 1184 4262 9937 10175 12575 7756 583 6689 8143 10441 13292 6628
8260 6628 1853 -2082 2860 -2196 -8707 -11240 -9980 -6446 -3072 5386 12485 13679 6836 773 577
8245 577 3852 6854 3586 3147 8968 12789 4568 3518 16089 14188 11560 12200 12385 15676 10749 5587
8229 5587 2505 4214 8000 725 -2000 -2893 -911 2147 211 -2496 -3990 -2594 -2437 -4395 -4517 -2864
8213 -2864 -5214 -7297 -5251 4128 1080 53 -178 -7765 -10980 -811 3843 5714 4950 6967 3111
8198 3111 1943 6518 4107 8536 11223 13773 12026 9950 956 268 4657 4644 8198 9256 6133 13850
8182 13850 15653 6860 202 4084 3360 6175 2253 1897 8166 5156 3263 4731 9887 7664 16267
8167 16267 16569 15115 14348 14841 12089 18677 18404 14399 11359 8997 13689 22988 24381 29805 30189 24943
8151B4943l755q438q54Q161J054n296k604j615j886N0J401N253j373n800M050
8136A3291Q689j218J522k599j7J571l418l916J142N259J763J82J383P596m18P867
8120C8679J0076J8429L0653L1970L1189J8298K74k6770l1166k6866k3948j2196
8108E8622o96p530j319K294o437m070L957o132o298R35l652l721K149M208o012
8093B6298m628L19O802J774k066l242l937N494Q191m860o623L220J350r201m639
8078A4252Q577O485k506N208j043j584l74r105m510Q69J592p000j935L184J608
8063A3718k899k047J0516Q058L813J343n023l488P710N458J426j810k006K357
8049C7126N942O988J176k182J0487P795O334J3925J4681J6568J3347J6871J5095
$$ plain form
8151 24943 21188 12750 11896 20057 21111 15815 13211 11596 9710 9760 11161 16414 15041 9241 13291
8136 13291 21980 20762 22284 19685 19668 21239 17821 13905 15047 20306 22069 22251 23634 31230 30812 38679
8120 38679 48755 67184 97837 129807 160996 179294 179568 152798 121632 94766 70818 58622
8108 58622 57926 50396 49077 51371 44934 40864 44821 38689 32391 33326 29674 25953 28102 32310 26298
8093 26298 21670 21989 28791 30565 28499 25257 21320 26814 35005 30145 23522 26742 28092 18891 14252
8078 14252 22829 29314 26808 32016 30973 29389 29015 19910 15400 16269 17861 10861 8926 12110 13718
8063 13718 10819 8772 19288 27346 31159 32502 27479 23991 31701 37159 38585 36775 34769 37126
8049 37126 43068 50056 51232 49050 59537 67332 73666 87591 102272 118840 132187 149058 164153
8036A64153J1036j049o964m730n732j597j404p439j4422j1655j306m169o772m754
8022A03196J767n754k184l664R5p135n354M167J1234N219J676j317k215q68K286
8007A01149j584n539M623P536N174P829J8209K3236K7848K5650K6354J7687N843
7994B64015o898L056J9772J9897N768k1987l4765l6721l5310j8434j0105r747
7982A38541r349m042j485O948m944L33M417O954l724o574k463p347j2917o295
7968I8053K357k696j0486J18N006L804k32O19j1876K409l552M990O369R411N578
7953A09872P877k608K668J930l397n105J158O245L423j0722r029r650p391l679
7939H1592q197j0284m186m343L493K855k631K503o849q535j989m447J602n764
$$ plain form
8036 164153 175189 174140 167176 162446 156714 155117 153713 146274 131852 120197 118891 114722 107950 103196
8022 103196 104963 99209 97025 93361 93456 86321 80967 85134 96368 101587 103263 101946 99731 98863 101149
8007 101149 99565 94026 98649 106185 111359 119188 137397 160633 188481 214131 240485 258172 264015
7994 264015 257117 260173 279945 299842 305610 283623 248858 212137 176827 158393 148288 138541
7982 138541 129192 125150 123665 130613 125669 126002 130419 137373 133649 127075 124612 117265 104348 98053
7968 98053 100410 97714 87228 87346 92352 96156 95924 96543 84667 87076 83524 88514 94883 104294 109872
7953 109872 117749 115141 117809 119739 116342 111237 112395 118640 122063 111341 102312 92662 85271 81592
7939 81592 73395 63111 58925 54582 58075 60930 58299 60802 53953 45418 43429 38982 40584 34820
7925C4820J437L002J118p081o681M969l533k369J788K204K873j422l611R30L453
7910C1897p946k994n342o639l833J469n97N890M427M609k24rj901n007J25k70
7894A3655j046m618l256q321j05p68L845J2001L661Q19k720l327l034K85m477
7879B594m119j059L368Q715N669j5k930j307j511L45l390o548k082j767K742K970
7863A675N499k990J234j551m877n088L083Q465J50l810m273k810k076M704N434
7848B769P22l19n617p920M858R539K08k785L394p434l114k619K998o085j72N375
7832f202L756n30j890J763Q99P226l82j1304l270P946Q8m450K593J1129L836L029
7816A4237l296j0755q834k370M433K59n154P340m79N70J154k739j016m711k515
$$ plain form
7925 34820 36257 39259 40377 33296 26615 31584 28051 25682 27470 29674 32547 31125 27514 28444 31897
7910 31897 23951 20957 15615 8976 5143 6612 6015 11905 16332 20941 20717 20708 18807 13800 13925 13655
7894 13655 12609 7991 4735 -3586 -3691 -4459 -614 11387 15048 15867 13147 9820 6786 7071 2594
7879 2594 -1525 -2584 784 9499 15168 15153 12223 10916 9405 9750 6360 -188 -2270 -4037 -1295 1675
7863 1675 7174 4184 5418 3867 -1010 -6098 -3015 5450 5600 1790 -2483 -5293 -7369 -2665 2769
7848 2769 3491 3172 -2445 -10365 -5507 4032 4240 1455 4849 -2585 -5699 -8318 -5320 -11405 -11577 -6202
7832 -6202 -2446 -2976 -4866 -3103 -2204 5022 4640 -6664 -9934 -1988 -1900 -6350 -3757 7372 11208 14237
7816 14237 10941 186 -8648 -11018 -6585 -6326 -11480 -4140 -4619 -4049 -2895 -5634 -6650 -11361 -13876
7801a3876j427l698O270k741k809L38K680P764J656n099k370K684J782K945j131
7786g032j793j896k643q68M455J563J139k616K726P033m009l968J712L348K726
7771a23l442K604k7j574m217L856L580j128M45M115j363o127l082L20k668n303
7755a4134K395J0376k59J983p47j147l244K240J18L42O052l965l221k813o841
7740a2865L872K581n179o635n049j482N284O154M894R46J313m307K202p539p27
7725a6537J0565N422j881l148m389n584M986K310l828J618m887m383m450L693
7711b0493J033P32L208k442O016k46J251K175j992l011N285J325L64K190k726
7696g331j768k743J198O09k830O839M641j478r749m919K056Q300M313o48N903
$$ plain form
7801 -13876 -15303 -19001 -12731 -15472 -18281 -17943 -15263 -7499 -5843 -10942 -13312 -10628 -8846 -5901 -7032
7786 -7032 -8825 -10721 -13364 -14232 -9777 -8214 -7075 -9691 -6965 68 -3941 -7909 -6197 -2849 -123
7771 -123 -3565 -961 -988 -2562 -6779 -2923 657 -471 -26 4089 2726 -3401 -6483 -6163 -8831 -14134
7755 -14134 -11739 -1363 -1622 361 -386 -1533 -4777 -2537 -2419 -2077 3975 10 -3211 -6024 -12865
7740 -12865 -8993 -6412 -11591 -18226 -23275 -24757 -19473 -13319 -8425 -7479 -6166 -10473 -8271 -15810 -16537
7725 -16537 -5972 -550 -2431 -5579 -9968 -15552 -10566 -8256 -12084 -10466 -15353 -19736 -24186 -20493
7711 -20493 -19460 -18728 -15520 -17962 -11946 -12192 -10941 -8766 -10758 -13769 -8484 -7159 -6795 -4605 -7331
7696 -7331 -9099 -11842 -10644 -10035 -12865 -6026 -1385 -2863 -12612 -17531 -15475 -7175 -2862 -3510 2393
7681B393o834o353m838M438N401R01l374l555r220M035O292k601J379M952M25
7666f559P82l421K04K081o68M911K061k937j423j494n595P72Q11L182J46j914
7650i061M215k611k753l577Q89L915m362K573L467K089M486K326m02q6k840p70
7634b502L296l370J98K450m147n070n675J292J054j556L623J123k546L764m818
7619a2884K220m005l374j813J255J1213P319j107n976o25K030M914L64j50k195
7604b814p91l827n084L950J125k362j649o134K237J842Q436R399m895K446M15
7589B294m594o402j179O02l869J566L657M896o48K024J040p02M122p043M277m402
7573d361n949l059L348k50j71j717k526K126Q906M75m067q354J554J779L895J027
$$ plain form
7681 2393 -4441 -10794 -15632 -11194 -5793 -4892 -8266 -11821 -21041 -17006 -10714 -13315 -11936 -6984 -6559
7666 -6559 -5777 -9198 -8994 -6913 -7581 -2670 -609 -3546 -4969 -6463 -12058 -11286 -10475 -7293 -7147 -9061
7650 -9061 -4846 -7457 -10210 -13787 -12898 -8983 -13345 -10772 -7305 -5216 -730 1596 1194 1108 -1732 -2502
7634 -2502 794 -2576 -2378 72 -4075 -9145 -14820 -13528 -12474 -14030 -10407 -9284 -11830 -8066 -12884
7619 -12884 -10664 -14669 -18043 -19856 -18601 -7388 -69 -1176 -7152 -7777 -5747 -833 -469 -619 -2814
7604 -2814 -3605 -7432 -12516 -8566 -7441 -9803 -11452 -17586 -15349 -13507 -5071 4328 -567 1879 2294
7589 2294 -2300 -8702 -9881 -9279 -13148 -11582 -7925 -3029 -3677 -1653 -613 -1315 2807 -4236 41 -4361
7573 -4361 -10310 -13369 -10021 -10271 -10442 -12159 -14685 -12559 -3653 -3178 -7245 -15599 -14045 -12266 -8371 -7344
7557g344j0639r931K946P311L187L134K412r55k525j068l313R07J503R226M834
7542c15j02j215l481P8l530K719j559k224j766L020M932j802N496M826l193p458
7526e574j784J0149R08k371q056k593k687M651l227k617L531K630l172n13J114
7511i611L569L391K852k473l472n56L925O052J904n487k510l522l766l014J1507
7496a211k843m412J566Q32k700p87M128O124J807m74l294l437q03q123j471J1619
7480c479O72N86j186j936o768k420R239O16L955L125j804q18l608l214p681o056
7464b0777N55M665k27O402L961J931m560j128l552K777M341r22O85L694M034j086
7448G93j1490m650L284k876P267j185m255R11k79N279R43n367J163j527L076J566
$$ plain form
7557 -7344 -17983 -27914 -24968 -17657 -14470 -11336 -8924 -9879 -12404 -13472 -16785 -15878 -14375 -5149 -315
7542 -315 -417 -1632 -5113 -5035 -8565 -5846 -7405 -9629 -11395 -8375 -3443 -5245 251 5077 1884 -5574
7526 -5574 -7358 2791 3699 1328 -6728 -9321 -12008 -7357 -10584 -13201 -9670 -7040 -10212 -10725 -9611
7511 -9611 -6042 -2651 201 -2272 -5744 -6300 -2375 3677 5581 94 -2416 -5938 -9704 -12718 -1211
7496 -1211 -4054 -8466 -6900 -6068 -8768 -9555 -5427 697 2504 2030 -1264 -4701 -5504 -13627 -15098 -3479
7480 -3479 -2807 -2221 -3407 -5343 -12111 -14531 -5292 -4676 -721 2404 600 -218 -3826 -7040 -14721 -20777
7464 -20777 -20222 -15557 -15784 -9382 -5421 -3490 -8050 -9178 -12730 -9953 -5612 -6534 -5849 -2155 1879 793
7448 793 -10697 -15347 -12063 -14939 -7672 -8857 -13112 -12201 -12480 -7201 -6258 -11625 -10462 -11989 -8913 -7347
7432g347q422r96R62N588L844J825N794k58K182l960J208Q446K042k450m551Q77
7416D784j858j0360P50L277l228n385k729m705O425K478Q01L590N544K249o461
7401d828k238N907k912n444J381K155l135L117l34K036n88L550l595k61O088M315
7385E214j0622j0833l444k971l142P15O881K430L787O120m237J102l55l119N16
7370a1958M091N218l860l813n43J0429Q24l3J452k737r259l297O322p28k305N320
7354d877O851K005O45l957m621n826N89k876l169n97J736P371J0438p536r714
7339a3538k832M778R800L955K371p489j1902J11M936L23l995o076L499K33l66
7324a6192R168M312m826k988n328k418q5R621L362o127m826l797l565k481L030
$$ plain form
7432 -7347 -15769 -16765 -15803 -10215 -6371 -4546 1248 990 3172 -788 420 8866 10908 8458 3907 4784
7416 4784 2926 -7434 -6684 -3407 -6635 -12020 -14749 -19454 -13029 -10551 -9750 -6160 -616 1633 -4828
7401 -4828 -7066 -1159 -4071 -9515 -8134 -5979 -9114 -5997 -6331 -4295 -4883 -1333 -4928 -5189 899 5214
7385 5214 -5408 -16241 -19685 -22656 -25798 -25083 -18202 -15772 -11985 -5865 -10102 -9000 -9355 -12474 -11958
7370 -11958 -7867 -2649 -6509 -10322 -10865 -436 388 355 1807 -930 -10189 -13486 -7164 -7892 -10197 -4877
7354 -4877 1974 3979 4624 667 -3954 -9780 -9191 -12067 -15236 -15833 -14097 -6726 3712 -3824 -13538
7339 -13538 -16370 -11592 -1792 2163 4534 -2955 -14857 -14746 -9810 -9487 -13482 -19558 -16059 -15826 -16192
7324 -16192 -7024 -2712 -7538 -10526 -15854 -18272 -18357 -8736 -5374 -11501 -16327 -20124 -23689 -26170 -23140
7309b3140P443L404j982n834m24J832L03Q9M828M328L764J995J635k508n361o787
7293a6415j558q20L381R81k33j337M131M783J911M773m183r096k301J693P708
7278f582J89o328m227J0588l53J660J518K734j828l450j160p106m934K901R966
7263f412K486L143k595n819j115J502n102j347K232K494L413L079j465J594L709
7248b03n77m168k866L355k839k692l376K286J0176J609K752K363p9q91j1381n414
7232a1945L68L799L678m665l153m02K348m762m262J31K895M372P203l256k351
7217a0002L537Q57J301J34k525J85L233L433K240l648j094j8o441O51L134N06
7201d517o479j948N511J559J114J572k82k874k327P97J040m60l323K354O826M222
$$ plain form
7309 -23140 -15697 -12293 -14275 -20109 -20533 -18701 -18398 -18309 -13481 -9153 -5389 -3394 -1759 -4267 -9628 -16415
7293 -16415 -17973 -18793 -15412 -14431 -14664 -16001 -11870 -7087 -5176 -403 -4586 -13682 -15983 -14290 -6582
7278 -6582 -6393 -12721 -16948 -6360 -6713 -5053 -3535 -801 -2629 -6079 -7239 -14345 -19279 -16378 -6412
7263 -6412 -3926 -783 -3378 -9197 -10312 -8810 -13912 -15259 -13027 -10533 -7120 -4041 -5506 -3912 -203
7248 -203 -780 -4948 -7814 -4459 -7298 -9990 -13366 -11080 -904 705 3457 5820 5741 4850 -6531 -11945
7232 -11945 -11577 -7778 -4100 -8765 -11918 -12320 -9972 -14734 -18996 -18865 -15970 -11598 -4395 -7651 -10002
7217 -10002 -6465 -5608 -4307 -4173 -6698 -6513 -3280 153 2393 -1255 -2349 -2367 -8808 -8157 -5023 -4517
7201 -4517 -10996 -12944 -7433 -5874 -4760 -3188 -3470 -6344 -8671 -7874 -6834 -7294 -10617 -8263 -1437 2785
7185B785k22j099j2143k894k416J620L596N880m568p581p116P009R553l941n247
7170a6784M713N551O346r19K4L995K084j596L133M308m871n258K71p43k939J039
7154a646M497k517j40P116n140j472n742J71M157K223r734n2P241L380l787l471
7138d916k56l372l009J07o415P614N606k221J854J160L774j778M63k1K082J796
7122B468K685K91k828j564J897p134m062l682P60K226M523q410q943M374K900
7107a4499J650k906p83N837Q475K878K033m976p470l4M038O133o705o096n138
7092a7563n079J1641P439M68N03m871p783j428Q357J589k92j635O92O322j056
7077b696l059M58J0o611J153M260Q00r973q436J407J1725O911O132L977n99j2498
$$ plain form
7185 2785 2563 1464 -10679 -13573 -15989 -14369 -10773 -4893 -9461 -17042 -24158 -17149 -7596 -11537 -16784
7170 -16784 -12071 -6520 -174 -1093 -1069 2926 5010 3414 6547 10855 5984 726 997 254 -2685 -1646
7154 -1646 2851 334 194 7310 2170 698 -5044 -4873 -716 1507 -8227 -8279 -1038 2342 -1445 -4916
7138 -4916 -5172 -8544 -11553 -11446 -17861 -10247 -4641 -6862 -5008 -3848 -74 -1852 -1389 -1410 672 2468
7122 2468 5153 5444 2616 1052 2949 -4185 -8247 -11929 -11169 -8943 -4420 -12830 -21773 -17399 -14499
7107 -14499 -12849 -15755 -16538 -10701 -2226 652 2685 -2291 -9761 -9795 -5757 376 -6329 -12425 -17563
7092 -17563 -22642 -11001 -3562 -3094 -2591 -7462 -15245 -16673 -8316 -6727 -7019 -8654 -7962 -1640 -2696
7077 -2696 -5755 -5297 -5287 -11898 -10745 -6485 -5685 -15658 -24094 -22687 -10962 -4051 2081 6058 5459 -7039
7061g039n034L600J859j148L602L347J514N175j37m445l996J012M818l368k788
7046c028p171J22O61k628n81L731nO25K007r89j364o92J333l891J29P242O57j150
7028d992l572j083L653M949L268j832o654k974k476N74l838N839Q997J407p411
7013f145j2294j892R143J928M287P6p986J629L215n51o328L861K601l383m918
6998a6757L816P369J072o181L670q18J356R737M746k781r381l529N742o260L91
6983g808Q021k236o085j140M406l093K148k789j961k394O475M104K679p169P93
6968f049L211K565O35k983m383k105l781J83k68N67m15k650j48Q111J872n80l809
6951a0027Q23K795L124k147o09p30j077o670j538O232J65R451M140o341r450n08
$$ plain form
7061 -7039 -12073 -8473 -6614 -7762 -4160 -813 701 5876 5739 1294 -2702 -1690 3128 -240 -3028
7046 -3028 -10199 -10077 -9416 -12044 -12625 -8894 -8899 -8274 -6267 -7256 -8620 -9312 -7979 -11870 -11741 -4499 -3842 -4992
7028 -4992 -8564 -9647 -5994 -1045 2223 391 -6263 -9237 -11713 -11139 -14977 -9138 -141 1266 -6145
7013 -6145 -18439 -20331 -11188 -9260 -4973 -4897 -12883 -11254 -8039 -8590 -14918 -11057 -8456 -11839 -16757
6998 -16757 -12941 -5572 -4500 -10681 -7011 -7829 -6473 3264 8010 5229 -4152 -7681 -1939 -8199 -7808
6983 -7808 213 -2023 -8108 -9248 -4842 -7935 -5787 -8576 -10537 -12931 -6456 -2352 327 -6842 -6049
6968 -6049 -2838 -273 362 -2621 -7004 -9109 -12890 -12707 -12975 -12408 -12823 -15473 -15621 -7510 -5638 -6218 -10027
6951 -10027 -9204 -6409 -3285 -5432 -6041 -6771 -7848 -14518 -16056 -9824 -9659 -208 3932 -2409 -11859 -12367
6935a2367L496J892J500L210q166p472n369m143M584N252O499J126p989J767O001
6920a0179k908n82M490N839k208l77L756p25L742L240j417j251L384o74K90n856
6904a436o21j868m30j060K622P77K168M645P00m565L983R63l449j3257k597L01
6888a3124j172n148q411L446K810P846J226o558l261l23O699O764j287l710K514
6873a1689R760M923k994k05J178M58j111l502K50J94j209l573n348J0r708p624
6857c0190L469M014J268M529O151l705k220k60j806J2346N446k338l118m632L935
6842g111j119l968o968M886L612j305k679J063O78J60M671N97P48J675J680J828
6826a552j798k908J545j459k032N096K173l129n776j211N283O153j922n001j287
$$ plain form
6935 -12367 -8871 -6979 -5479 -2269 -10435 -17907 -23276 -27419 -22835 -17583 -11084 -9958 -17947 -16180 -10179
6920 -10179 -13087 -13669 -9179 -3340 -5548 -5925 -2169 -2894 848 4088 2671 1420 4804 4130 4420 -1436
6904 -1436 -2057 -3925 -4355 -5415 -2793 -2016 152 4797 5497 932 4915 5878 2429 -10828 -13425 -13124
6888 -13124 -14296 -19444 -27855 -24409 -21599 -13753 -12527 -19085 -22346 -22669 -15970 -9206 -10493 -14203 -11689
6873 -11689 -1929 2994 0 -205 973 1431 320 -3182 -2932 -2738 -3947 -7520 -12868 -12858 -22566 -30190
6857 -30190 -26721 -22707 -21439 -16910 -10759 -14464 -16684 -16944 -18750 -6404 -958 -3296 -6414 -11046 -7111
6842 -7111 -8230 -12198 -19166 -14280 -10668 -11973 -14652 -13589 -12911 -12751 -8080 -7483 -6735 -5060 -3380 -1552
6826 -1552 -3350 -6258 -4713 -6172 -8204 -3108 -935 -4064 -9840 -11051 -5768 385 -1537 -6538 -7825
6811g825J518k087Q17J423l539J637K683q73m444P057K338k01K697J829J804o811
6795a977p824Q59K567m825J862j150N22N2J163k93K028J497L976J928O336K458
6779I179m447m865m178l212m034K139J429J4N61n75q722j161K365j216j810l40
6763a8873L967N035M010l89J701j934k684l385P857r835j197K352K681L672M48
6748f574K072K079L209k638K64J645k919k698l525l134P035M935Q18k758m9O049
6732C811L562o408J82Q63J0854O324p311r837K579K779L810n153m437J31k593
6717h44k526j110L278p804n26N804K351r46P98M72O892O649L009p186p587k251
6701a527K135K570j227J189J187l99j479p669m979N815L837k58j263J940k520
$$ plain form
6811 -7825 -6307 -8394 -7577 -6154 -9693 -8056 -5373 -6246 -10690 -3633 -1295 -1496 1201 3030 4834 -1977
6795 -1977 -9801 -8942 -6375 -11200 -9338 -10488 -9966 -9914 -8751 -9044 -7016 -5519 -1543 385 6721 9179
6779 9179 4732 -133 -4311 -7523 -11557 -9418 -7989 -7975 -7414 -7989 -16711 -17872 -15507 -16723 -18533 -18873
6763 -18873 -14906 -9871 -5861 -6250 -4549 -6483 -9167 -12552 -4695 -14530 -15727 -13375 -10694 -7022 -6574
6748 -6574 -4502 -2423 786 -1852 -1588 57 -2862 -5560 -9085 -12219 -5184 -249 569 -2189 -2238 3811
6732 3811 7373 965 1147 2010 12864 19188 11877 2040 4619 7398 11208 6055 1618 1749 -844
6717 -844 -3370 -4480 -1202 -9006 -9532 -3728 -1377 -2323 -1525 -1053 5839 12488 15497 8311 724 -1527
6701 -1527 608 3178 1951 3140 4327 3928 2449 -5220 -10199 -4384 -547 -805 -2068 -128 -2648
6686b648N371O292p639p118l419k09J752n397p93M853J903L99J583j113n55P173
6670D35k935q04l998j241N312N103k412l227K892n02j270J60p034m474j55L003
6654a1147J306j968N811L69j867M481N342L33j919p91j260L952M040l749l9r57
6638A937j2224m452J530n298J17J372M972Q554J866k00o339r933l077Q514K314
6623a0347M225P863K581q383l69Q943k377q381p537m580m623L890n47j093R80
6608a9755Q903L533J029Q833k450k176l557n47o093K596R987K941k103l975k977
6593e811M964M466q891j0085L05P325Q189j973q264j177m237N450M326L895j447
6578b965l594j185j634l983k501l83J946J067K601R53J570O02L267l542j013j554
$$ plain form
6686 -2648 2723 9015 1376 -5742 -9161 -9370 -7618 -13015 -13808 -8955 -7052 -6653 -5070 -6183 -6738 435
6670 435 -2500 -3304 -7302 -8543 -3231 1872 -540 -3767 -875 -1377 -2647 -2487 -9521 -13995 -14150 -11147
6654 -11147 -9841 -11809 -5998 -5629 -7496 -3015 2327 2660 741 -50 -1310 2642 6682 2933 2894 1937
6638 1937 -10287 -14739 -13209 -18507 -18390 -17018 -12046 -3492 -1626 -1826 -8165 -18098 -21175 -12661 -10347
6623 -10347 -6122 1741 4322 -4061 -4430 4513 2136 -6245 -13782 -18362 -22985 -19095 -19642 -20735 -19755
6608 -19755 -10852 -7319 -6290 2543 93 -2083 -5640 -6187 -12280 -9684 303 3244 1141 -2834 -5811
6593 -5811 -847 3619 -5272 -15357 -15052 -7727 462 -1511 -9775 -10952 -15189 -9739 -5413 -1518 -2965
6578 -2965 -6559 -7744 -9378 -13361 -15862 -16245 -14299 -13232 -10631 -9678 -8108 -7506 -4239 -7781 -8794 -10348
6562a0348K412Q145L186K253K059o267r339m724K996L577j620N090n822n479K396
6547a1485q236N12L359J0514Q050o98p201q34K829Q03m065p035k122P637M370
6532c602J23R6l341l020l169k732L110M503Q1M791J005O648m932m977O661N178
6516F423K652l54q995m880J920m056J331M257o040j326k243R18k342m41J49K366
6500a0661k275O99O488J0169j387J592m481l153J909P7J49n339m34N786k872j904
6484e637k15k117m049L03k025L982N297R74P004K252J905j519p730j074O243j711
6468A883n519L382Q14o633J784l763J106L13N48j174J48P176L346p493o885M345
6452f622J080j599J271m464P39j230n444q58L403P593J501o308K889R37j298k985
$$ plain form
6562 -10348 -7936 209 3395 5648 7707 1440 -7899 -12623 -9627 -6050 -7670 -2580 -8402 -13881 -11485
6547 -11485 -19721 -19209 -15850 -5336 2714 2016 -5185 -6019 -3190 -2387 -6452 -13487 -15609 -7972 -3602
6532 -3602 -3479 -3383 -6724 -9744 -12913 -15645 -12535 -8032 -7951 -3160 -2155 4493 -439 -5416 1245 6423
6516 6423 9075 8721 -274 -5154 -3234 -7290 -5959 -1702 -7742 -9068 -11311 -10393 -12735 -13176 -13027 -10661
6500 -10661 -12936 -12237 -5749 4420 3033 4625 144 -3009 -1100 -1023 -874 -6213 -6647 -861 -3733 -5637
6484 -5637 -5852 -7969 -12018 -11715 -13740 -9758 -4461 -3487 3517 5769 7674 6155 -1575 -2649 3594 1883
6468 1883 -3636 -254 560 -6073 -4289 -8052 -6946 -6633 -6085 -7259 -7111 65 3411 -4082 -10967 -6622
6452 -6622 -5542 -7141 -5870 -10334 -9595 -10825 -16269 -17127 -13724 -6131 -4630 -10938 -8049 -7112 -8410 -11395
6436a1395J612R18j514R608K863M421l40m879o332j654L840j475k890m069K121
6421i165R394N921l602m195j603L79J140m0k919n773j787P663L161j0460J28M741
6405g017k168K08Q063J769m985J227N20q254O31M923n965j786l382K994Q762j184
6389e644m187R43O491L03O513l258k207j763K127p387n562K893p02J725M731k43
6373e227k020J258R805q12p429n84J1302K893j0477m365k28J870M639l355l654
6358f384l895k9m133N984L936R91J0457k839j500m857m167l05J789O565j394o539
6342f320N28l52J640R579L355r94j933n134m239M957L383m043o635p8J351M047
6326h88N52p42J828M0l065l608J171j793k492j48m554J311P900K479j336L207
$$ plain form
6436 -11395 -9783 -8865 -10379 -771 2092 6513 6173 1294 -5038 -6692 -2852 -4327 -7217 -11286 -9165
6421 -9165 229 6150 2548 -1647 -3250 -2871 -1731 -1771 -4690 -10463 -12250 -4587 -1426 -11886 -11758 -7017
6405 -7017 -9185 -8977 -914 855 -4130 -2903 -2383 -10637 -10006 -5083 -11048 -12834 -16216 -13222 -4460 -5644
6389 -5644 -9831 -8888 -2397 -2094 4419 1161 -1046 -2809 -682 -8069 -13631 -10738 -11440 -9715 -4984 -5227
6373 -5227 -7247 -5989 3816 3004 -4425 -5009 6293 9186 -1291 -5656 -5884 -4014 625 -2730 -6384
6358 -6384 -10279 -10308 -14441 -8457 -4521 -3530 6927 4088 2588 -2269 -6436 -6741 -4952 1613 219 -6320
6342 -6320 -5792 -6144 -4504 5075 8430 7436 5503 369 -3870 1087 4470 427 -6208 -6286 -4935 -888
6326 -888 -336 -1078 750 790 -2275 -5883 -4712 -6505 -8997 -9145 -13699 -12388 -4488 -2009 -3345 -138
6310a38l467l068j120k299l781n34N722R78M316l979o774l434J698L952M680L672
6294c576J427p022L36L12j306p460j451k534J898N291q47M07N727O946m566k895
6278i313J429q72L294l54L36J933M46K100j729j651n631n262m150k610M107o42
6262a8569m99j913R10L066J0741k414m646K550k151n94K549M794J2717k31n375
6247I35m472j503o662K058Q093M204k277k614r651R28K197J123J660j551k332
6232i864j000J999J838J402o147Q9L762M802n051K906K234P621L492l294K39r75
6216D053l864j31l162l662n719K846k508K08L371J10N911m607k161l58L66L102
6200f205M86m64o488k330K564J0426j43k840K051J131K881L36n225j441N104M336
$$ plain form
6310 -138 -3605 -6673 -7793 -10092 -13873 -14407 -8685 -7707 -3391 -7370 -14144 -17578 -15880 -11928 -7248 -3576
6294 -3576 -2149 -9171 -8835 -8523 -9829 -17289 -18740 -21274 -19376 -14085 -14932 -14525 -8798 -1852 -6418 -9313
6278 -9313 -7884 -8756 -5462 -5816 -5480 -3547 -3101 -1001 -2730 -4381 -10012 -15274 -19424 -22034 -17927 -18569
6262 -18569 -19068 -20981 -20071 -17005 -6264 -8678 -13324 -10774 -12925 -13519 -10970 -6176 6541 6310 935
6247 935 -3537 -5040 -11702 -9644 -1551 2653 376 -2238 -11889 -10961 -8764 -7641 -5981 -7532 -9864
6232 -9864 -10864 -8865 -7027 -5625 -11772 -11683 -7921 -3119 -8170 -5264 -3030 4591 8083 4789 5028 4053
6216 4053 189 58 -3104 -6766 -12485 -9639 -12147 -11939 -8568 -8458 -2547 -7154 -9315 -9673 -9307 -6205
6200 -6205 -5719 -6183 -12671 -15001 -12437 -2011 -2154 -4994 -2943 -1812 1069 1405 -3820 -5261 -157 4179
6184D179q83m890k482q81j675q218l82m050N743K679M330k394P244J124M62l766
$$ plain form
6184 4179 3296 -1594 -4076 -4957 -6632 -14850 -15232 -19282 -13539 -10860 -6530 -8924 -1680 -556 -94 -3860
$$ [...]
##END NTUPLES=NMR SPECTRUM
##END=
